##TITLE=Analysis number 310767
Compound Code cc 23601
Book Reference 399/179
Project Code adrs
Chemist Name evam
##JCAMPDX= 6.0         $$ Bruker NMR JCAMP-DX V2.0
##DATA TYPE= NMR SPECTRUM
##DATA CLASS= NTUPLES
##ORIGIN= Bruker BioSpin GmbH
##OWNER= NMR
$$ XWIN-NMR		Version 3.5
$$ Thu Jun 23 12:35:09 2005 GMT Daylight Time (UT+1h)  MAYBRIDGE\NMR@NMR_250MHZ
##.OBSERVE FREQUENCY= 250.131544655141
##.OBSERVE NUCLEUS= ^1H
##.ACQUISITION MODE= SIMULTANEOUS (DQD)
##.ACQUISITION SCHEME= undefined
##.AVERAGES= 16
##.DIGITISER RES= 18
##SPECTROMETER/DATA SYSTEM= dpx250
##.PULSE SEQUENCE= zg30
##.SOLVENT NAME= DMSO
##.SHIFT REFERENCE= (INTERNAL, DMSO, 0, 16.522)
##AUDIT TRAIL= $$ (NUMBER, WHEN, WHO, WHERE, WHAT)
$$ ##TITLE= Audit trail, XWIN-NMR		Version 3.5
$$ ##JCAMPDX= 5.01
$$ ##ORIGIN= Bruker BioSpin GmbH
$$ ##OWNER= NMR
$$ C:\u/data/dgb/nmr/ADRS/4660/pdata/1/auditp.txt
$$ ##AUDIT TRAIL=  $$ (NUMBER, WHEN, WHO, WHERE, WHAT)
(   1,<2005-06-23 12:34:47.64 +100>,<MAYBRIDGE\NMR>,<NMR_250MHZ>,
      <created by zg, POWCHK disabled, PULCHK disabled
       configuration hash MD5:
       62 19 C7 07 E1 42 D1 B7 37 6C 3D D0 77 39 F9 E6
       data hash MD5: 64K
       EF B4 B2 EB 10 6F 0F B6 85 74 B2 2F 8D 19 66 C6>)
(   2,<2005-06-23 12:35:00.27 +100>,<MAYBRIDGE\NMR>,<NMR_250MHZ>,
      <Start of raw data processing
       ef LB = 0.3 FT_mod = 6 PKNL = 1 SI = 32K 
       data hash MD5: 32K
       C3 A2 86 AE E3 6E FE 54 54 1B B5 48 15 F4 A3 5D>)
(   3,<2005-06-23 12:35:02.19 +100>,<MAYBRIDGE\NMR>,<NMR_250MHZ>,
      <apk 
       data hash MD5: 32K
       FE 5D C2 74 C8 90 9E 60 DA 11 1F EC 87 89 C9 5A>)
(   4,<2005-06-23 12:35:02.93 +100>,<MAYBRIDGE\NMR>,<NMR_250MHZ>,
      <abs ABSG = 5 
       data hash MD5: 32K
       3A CC 33 AB 09 57 21 09 89 C8 60 0A EE 13 57 F7>)
$$ ##END=
$$ 
$$ hash MD5
$$ 89 78 00 CB AA 15 C4 01 3F 3F 5C 13 A6 59 FE 9E
##$RELAX= 
##$RELAX= 
##$RELAX= 
##$RELAX= 
##$RELAX= 
##$RELAX= 
##$RELAX= 
$$ Bruker specific parameters
$$ --------------------------
##$DU= <C:\u>
##$EXPNO= 4660
##$NAME= <ADRS>
##$PROCNO= 1
##$TYPE= <nmr>
##$USER= <dgb>
##$AMP= (0..31)
100 100 100 100 100 100 100 100 100 100 100 100 100 100 100 100 100 100 
100 100 100 100 100 100 100 100 100 100 100 100 100 100 
##$AQSEQ= 0
##$AQ_mod= 3
##$AUNM= <au_zg>
##$AUTOPOS= <12 >
##$BF1= 250.13
##$BF2= 250.13
##$BF3= 250.13
##$BF4= 250.13
##$BF5= 500.13
##$BF6= 500.13
##$BF7= 500.13
##$BF8= 500.13
##$BYTORDA= 1
##$CFDGTYP= 0
##$CFRGTYP= 5
##$CHEMSTR= <none>
##$CNST= (0..31)
1 1 145 1 1 1 1 1 1 1 1 1 1 1 1 1 1 1 1 1 1 1 1 1 1 1 1 1 1 1 1 1 
##$CPDPRG= <>
##$CPDPRG1= <>
##$CPDPRG2= <>
##$CPDPRG3= <>
##$CPDPRG4= <mlev>
##$CPDPRG5= <mlev>
##$CPDPRG6= <mlev>
##$CPDPRG7= <mlev>
##$CPDPRG8= <mlev>
##$CPDPRGB= <>
##$CPDPRGT= <>
##$D= (0..31)
0 1 0 0 0 0 0 0 0 0.06 0 0 0 0 0 0 0.0002 0 0 0 0 0 0 0 0 0 0 0 0 0 0 
0 
##$DATE= 1119526486
##$DBL= (0..7)
120 120 120 120 120 120 120 120 
##$DBP= (0..7)
150 150 150 150 150 150 150 150 
##$DBP07= 0
##$DBPNAM0= <>
##$DBPNAM1= <>
$$ [...]
##$SUBNAM7= <"">
##$SUBNAM8= <"">
##$SUBNAM9= <"">
##$SW= 20.6930455092707
##$SWIBOX= (0..15)
0 0 3 0 0 0 0 0 0 0 0 0 0 0 0 0 
##$SW_h= 5175.983436853
##$TD= 65536
##$TD0= 1
##$TE= 295.16
##$TE2= 300
##$TE3= 300
##$TEG= 300
##$TL= (0..7)
0 120 120 120 120 120 120 120 
##$TP= (0..7)
150 150 150 150 150 150 150 150 
##$TP07= 0
##$TPNAME0= <>
##$TPNAME1= <>
##$TPNAME2= <>
##$TPNAME3= <>
##$TPNAME4= <>
##$TPNAME5= <>
##$TPNAME6= <>
##$TPNAME7= <>
##$TPOAL= (0..7)
0.5 0.5 0.5 0.5 0.5 0.5 0.5 0.5 
##$TPOFFS= (0..7)
0 0 0 0 0 0 0 0 
##$TUNHIN= 0
##$TUNHOUT= 0
##$TUNXOUT= 0
##$USERA1= <user>
##$USERA2= <user>
##$USERA3= <user>
##$USERA4= <user>
##$USERA5= <user>
##$V9= 5
##$VALIST= <valist>
##$VCLIST= <CCCCCCCCCCCCCCC>
##$VD= 0
##$VDLIST= <DDDDDDDDDDDDDDD>
##$VPLIST= <PPPPPPPPPPPPPPP>
##$VTLIST= <TTTTTTTTTTTTTTT>
##$WBST= 1024
##$WBSW= 4
##$XGAIN= (0..3)
0 0 0 0 
##$XL= 0
##$YL= 0
##$YMAX_a= 290887
##$YMIN_a= -340889
##$ZGOPTNS= <>
##$ZL1= 120
##$ZL2= 120
##$ZL3= 120
##$ZL4= 120
##$ABSF1= 16.522
##$ABSF2= -4.171173
##$ABSG= 5
##$ABSL= 3
##$ALPHA= 0
##$AQORDER= 0
##$ASSFAC= 0
##$ASSFACI= 0
##$ASSFACX= 0
##$ASSWID= 0
##$AUNMP= <proc_1d>
##$AZFE= 0.1
##$AZFW= 0.1
##$BCFW= 0
##$BC_mod= 0
##$BYTORDP= 0
##$COROFFS= 0
##$CY= 12.5
##$DATMOD= 1
##$DC= 0
##$DFILT= <>
##$DTYPP= 0
##$F1P= 14.0000005364418
##$F2P= -0.99999901652339
##$FCOR= 0.5
##$FTSIZE= 32768
##$FT_mod= 6
##$GAMMA= 0
##$GB= 0
##$INTBC= 1
##$INTSCL= 1
##$ISEN= 128
##$LB= 0.3
##$LEV0= 0
##$LPBIN= 0
##$MAXI= 10000
##$MC2= 0
##$MEAN= 0
##$ME_mod= 0
##$MI= 0
##$NCOEF= 0
##$NC_proc= -4
##$NLEV= 6
##$NOISF1= 0
##$NOISF2= 0
##$NSP= 0
##$NTH_PI= 0
##$NZP= 0
##$OFFSET= 16.522
##$PC= 1
##$PHC0= -88.59899
##$PHC1= 12.51794
##$PH_mod= 1
##$PKNL= yes
##$PPARMOD= 0
##$PSCAL= 4
##$PSIGN= 0
##$REVERSE= no
##$SF= 250.13
##$SI= 32768
##$SIGF1= 0
##$SIGF2= 0
##$SINO= 400
##$SIOLD= 32768
##$SREGLST= <1H.DMSO>
##$SSB= 0
##$STSI= 32768
##$STSR= 0
##$SW_p= 5175.98343685301
##$SYMM= 0
##$S_DEV= 0
##$TDeff= 65536
##$TDoff= 0
##$TI= <Analysis number 999999
Compound Code 99
Book Reference 9
Project Code 9>
##$TILT= no
##$TM1= 0
##$TM2= 0
##$TOPLEV= 0
##$USERP1= <user>
##$USERP2= <user>
##$USERP3= <user>
##$USERP4= <user>
##$USERP5= <user>
##$WDW= 1
##$XDIM= 32768
##$YMAX_p= 480297607
##$YMIN_p= -302255
$$ End of Bruker specific parameters
$$ ---------------------------------
##NTUPLES= NMR SPECTRUM
##VAR_NAME=  FREQUENCY,     SPECTRUM/REAL,   SPECTRUM/IMAG
##SYMBOL=    X,             R,               I
##VAR_TYPE=  INDEPENDENT,   DEPENDENT,       DEPENDENT
##VAR_FORM=  AFFN,          ASDF,            ASDF
##VAR_DIM=   32768,         32768,           32768
##UNITS=     HZ,            ARBITRARY UNITS, ARBITRARY UNITS
##FACTOR=    0.157963299565203, 1,           1
##FIRST=     4132.6476996994, 0,             0
##LAST=      -1043.33573715361, 0,           0
##MIN=       -1043.33573715361, -302255,     0
##MAX=       4132.6476996994, 480297607,     0
$$ Real data points
##PAGE= N=1
##DATA TABLE= (X++(R..R)), XYDATA
$$ [...]
22330 45357 33446 62672 -37965 -89768 -53683 -100721 -113929 -33979 -17519 -35407 -29758 -120871
22318 -120871 -179338 -183205 -146157 -178294 -180380 -12546 89039 44672 12324 16498 29867 32608
22306 32608 -55973 -87835 -62167 -72957 -83537 -70921 32346 -14359 -991 35690 78918
22295 78918 88086 49230 -19110 -24121 -54449 -101781 -111769 -98903 -93786 -52953 23935 145484
22283 145484 102043 -1525 -8895 -34667 -43838 -36640 62302 84710 89684 65568 53256 -22279
22271 -22279 -86620 -108303 -37182 -4789 -7612 -56018 -100629 -178170 -215747 -132337 -63724 -38389
22259 -38389 -58372 -853 57106 15414 -32722 -54629 -24701 51357 70969 54442 -6476 -34516
22247 -34516 -43601 -17510 -40257 -42960 -55650 -46115 -6034 48405 -54783 -95702 -88697 16529
22235 16529 2036 -9783 10899 31173 35149 -37522 -71611 -15608 -10145 81152 116625 73815
22223 73815 -172 -131672 -138083 -90000 -40898 -98584 -129606 -76287 -77206 -36862 20418 15732
22211 15732 -37891 -118342 -97488 -35155 21756 26029 -51736 -126633 -137876 -108930 -90857 -67775
22199 -67775 -28213 -35562 -49694 -34882 -72380 -207426 -248893 -182416 -136363 -128624 -113442 -115770
22187 -115770 -112744 -144903 -136259 -146379 -169846 -46076 -48539 -66817 -57300 -34757 35150 -43935
22175 -43935 283 4395 28563 -14195 35447 169106 174698 73637 4901 -51416 -136488 -115494
22163 -115494 -28872 -48710 -22534 -75097 -95677 -32640 30854 80594 39561 -87885 -58091
22152 -58091 -18428 -55590 -129026 -68309 -100960 -108573 -72693 -1800 24775 -18356 -45249 -73258
22140 -73258 2907 56007 66787 122064 69237 -179 -127426 -196375 -196826 -147869 -95415 -50761
22128 -50761 -87985 -91030 -44556 -39457 -30119 -76721 -66910 -18111 -29693 -41122 -75720 -51702
22116 -51702 -21372 -128004 -102664 -40838 -81587 -73103 -145062 -125265 -76507 31674 59544
22105 59544 51716 80106 76907 59842 132314 147741 41507 -3642 -5193 -9445 16213 -13278
22093 -13278 -125746 -137671 -82097 -68184 -46852 6284 23708 45875 4955 39371 98447
22082 98447 57149 -38080 -85391 -102974 -115781 -132172 -84027 -121713 -122978 -165497 -159087 -117961
22070 -117961 -114631 -54290 56116 105591 135441 92476 20634 -21620 -69330 -20901 2255
22059 2255 39667 62860 38932 -49499 -22205 -28026 -103667 -190328 -148251 -94553 -47512 -9483
22047 -9483 -44470 -55658 -88473 -89745 -93374 -77390 -22738 55468 61528 51025 8084 34327
22035 34327 45997 44414 80145 62945 35527 -1941 17159 36795 -2457 -53987 -54483 -93582
22023 -93582 -85791 -23301 63563 59991 34280 26469 57744 25980 12137 42868 1314 -47880
22011 -47880 -119581 -97859 -25461 -2230 -33582 -12314 -26794 -101916 -145610 -74644 -10467 9958
21999 9958 -35522 -72192 -74013 -107102 -66620 -18040 -48101 -103969 -127009 -73885 -95484 -149541
21987 -149541 -152391 -191011 -166935 -214270 -207077 -111016 -123320 -126785 -68426 -56710 -77882 -178987
21975 -178987 -176112 -191277 -193338 -162362 -162981 -122263 -82501 -72493 -118859 -75126 42175 53744
21963 53744 -18501 -98431 -122772 -131900 -94194 -60444 -34107 -272 79200 108260 16875 -78730
21951 -78730 -113287 -74738 -76457 -188776 -116530 -152928 -133448 -80081 -17580 -4673 55746 76227
21939 76227 -262 -53395 -86381 -26971 23631 5983 13165 8272 -71950 -57736 -10012 703
21927 703 -60109 -157061 -154305 -122453 -100979 -33654 -53957 -81093 -116346 -75776 -29727 -65998
21915 -65998 -94004 -40350 -6645 13345 -8710 -2288 29218 36019 17960 -13436 -4899 -45304
21903 -45304 -77769 -63707 -69707 -58197 12376 -9897 -123912 -71173 4431 -45852 -64921 -51999
21891 -51999 2603 39390 5803 -80378 -94052 -116500 -72044 -75091 -145499 -98253 -113424 -102269
21879 -102269 -107851 -51823 3744 68990 124946 117599 89333 67407 -45402 -168910 -199035
21868 -199035 -139795 -36347 40156 -20611 -14073 21297 2433 -38911 -108502 -81717 -77568 -84067
21856 -84067 -81185 -82333 -5444 9240 5676 -28824 57432 -50626 -51362 -29307 44168 21303
21844 21303 35239 28146 24111 2792 -17498 -20752 -30344 -28040 -26544 -72683 6276 50314 -2640
21831 -2640 -60776 -76410 -22 20047 -37821 -73543 -68527 -60631 -13622 -43217 -105722 -71907
21819 -71907 -47614 -104445 -47354 10093 8337 49268 25011 -25154 -65930 -22225 27772 22320
21807 22320 -44713 -52942 -13704 -59189 20372 70946 82300 2500 -21584 32956 -66195 -219825
21795 -219825 -237289 -191870 -97478 -43480 -27052 -102011 -131878 -54438 -19647 10398 19029 45335
21783 45335 8728 -21454 68406 138481 109954 74795 7542 -92382 -138807 -69880 -111429 -156341
21771 -156341 -109127 4754 17587 -17422 -9890 2763 -7659 -49264 -23331 -36428 -59909
21760 -59909 -68506 -84205 -147570 -216742 -245683 -172374 -122215 -117225 -89186 -120009 -232771 -234407
21748 -234407 -81584 -10839 19089 36929 29396 27499 -2371 10743 -62666 -118773 -85846 22242
21736 22242 23914 -78200 -112202 -1278 72503 -21295 -77922 -68418 -38676 340 -110135
21725 -110135 -138356 -171994 -202445 -176701 -222813 -206744 -175696 -148737 -184847 -120840 -82486
21714 -82486 -74659 -49463 -1498 -45410 -93422 -94543 -109757 -107625 -98042 -24075 48488 81505
21702 81505 22059 -42958 -92527 -87660 -29312 -64512 -53282 -51921 -69618 -36795 -114177 -154861
21690 -154861 -169621 -171930 -142312 -80439 -61468 -110794 -205162 -260262 -224392 -108163 -25899
21679 -25899 19130 -5965 -53171 -68745 -45207 -5151 19017 14850 -29534 -48664 -20601 81470
21667 81470 25859 18825 -15202 -31121 -35763 -74194 -127721 -54322 -50801 -127944 -227806 -127222
21655 -127222 -47082 -83989 -91587 -103307 -184941 -231534 -185375 -181183 -127072 -9843 9231 -21292
21643 -21292 25663 45743 27440 -20184 -19135 -4643 -66938 -15031 39511 74777 102884 77678
21631 77678 37268 80919 41665 4071 -15970 -29190 -42080 6656 56581 61297 -19188 -24020
21619 -24020 -59819 -94758 -72948 -125052 -114627 -86564 1449 -11569 -89413 -155669 -168237 -110887
21607 -110887 -107615 -110823 -41960 -10230 17908 36579 12647 1534 -6393 46488 36910 22075
21595 22075 40004 56576 40429 41742 124437 151465 93412 58936 17955 -34625 -78578 -44843
21583 -44843 -24363 -34119 -41405 -92712 -142320 -105370 -31876 -46511 -90583 -66769 -14965 2344
21571 2344 42567 124896 108464 46290 -10454 11550 -18492 -10741 20022 -11332 -142593 -125470
21559 -125470 -38533 -26753 -135665 -122120 -101724 -109445 -149482 -104595 -33488 -28697 -75603 -32675
21547 -32675 18839 1718 -69952 -145597 -115612 -162696 -169808 -160580 -153103 -149329 -56310 -81250
21535 -81250 -64419 -8961 59625 16023 13991 37979 -51959 -128421 -111729 -19235 -79574 -82261
21523 -82261 -133252 -110122 -117991 -123148 -133481 -116884 -92177 -121875 -197765 -232523 -137165 -10254
21511 -10254 35920 -5940 -10655 -74683 -112269 -105594 -215775 -147376 -88888 -30386 24355 -44693
21499 -44693 -72298 -39153 -27751 -68835 -130553 -77925 -52269 -27988 -48453 -43841 -19911 -57805
21487 -57805 -68196 -32552 -68407 -9686 -4717 -43334 -86981 -77528 -71736 -99090 -56635 -32288
21475 -32288 -82761 -38285 -22039 -68876 -122480 -38219 13041 48775 127000 131008 37563 -41331
21463 -41331 -29972 81903 138330 73536 24138 -40518 -56001 -36113 2708 -63597 -94674
21452 -94674 -120814 -161318 -157655 -144088 -122943 -130244 -133108 -131514 -152060 -161582 -194468 -159477 -77218
21439 -77218 -20320 10177 -62063 -93680 -141919 -153313 -52707 -37543 -104312 -37773 8313
21428 8313 19068 109608 106453 80242 71613 96211 66255 -40639 -79971 -94256 -101125 -59827
21416 -59827 54167 23912 4357 -59607 -91450 -129779 -89741 -68601 -86915 -130669 -109547
21405 -109547 12877 14437 16253 59918 93911 43313 40684 4782 -67876 816 510 -6387
21393 -6387 -68221 -126162 -87772 -34430 -14738 16061 21136 -5648 -28314 -7184 -24974 -64279
21381 -64279 49098 10710 -45051 -86813 -53957 -62724 -48095 -96929 -36892 -26661 14819 -22879
21369 -22879 -34671 7788 -1984 -22090 -19800 -2833 -87539 -151045 -148078 -128802 -124261 -63134
21357 -63134 -8454 -16977 32623 48263 40347 -1185 -98417 -145991 -146124 -207452 -226752 -218302 -154095
21344 -154095 -122056 -126375 -127604 4825 44010 9526 17227 -89762 -93132 -47251 24931 29495
21332 29495 2032 -87099 -97988 -40508 -21202 18964 19295 -48195 -33366 -112778 -155113 -174188
21320 -174188 -131831 -58139 -53610 -38234 -14108 -60976 -20076 41441 69934 69647 46956 67167
21308 67167 69405 77575 10009 -51342 -93693 -138038 -132795 -63428 -73074 -26467 16943 24076 19450
21295 19450 -19850 87873 92129 106223 119291 131120 185931 179195 119385 97719 83485 71231
21283 71231 28584 965 46580 70145 32142 -39960 -94769 -127570 7305 131625 110497
21272 110497 49504 90220 87674 42637 -10966 -26292 5499 -49758 -63741 -29520 133216
21261 133216 213110 138739 -3632 -83113 -124971 -87257 -4368 -16712 -55373 -93794 -33304
21250 -33304 -30478 -110779 -191158 -166379 -125404 -65931 -12668 29498 12656 -29649 -60940 -38343
21238 -38343 -51897 -91464 -109668 -71686 -69568 -30992 -11984 38409 63001 32161 43495 103767
21226 103767 80559 86385 116105 82059 93517 138610 99207 35798 -1901 -41738 9268 -5372
21214 -5372 1974 10436 -8814 -24346 -80929 -137138 -110646 -72857 -33731 52806 33981 -2583
21202 -2583 -37181 -59270 -43898 2613 6192 50637 -3025 -33682 -57515 -25442 -6239 -24575
21190 -24575 -55415 -36165 -58128 -149141 -105828 -105677 -92995 -37198 17180 37451 -9394 24516
21178 24516 24110 -84456 -134347 -80516 -84981 -115710 -168909 -200531 -125956 -74494 20886 28128
21166 28128 42552 70486 87071 46692 -4771 -36092 -72192 -119263 -99944 -147156 -161404 -150445
21154 -150445 -108206 -102444 -109350 -51354 24898 14526 17828 67439 -13641 -152993 -157535 -143067
21142 -143067 -153200 -66094 -52198 -45273 -25064 -20835 1511 23397 100362 70825 9186 66957
21130 66957 62872 32571 30518 23300 -1627 64556 -1879 -118853 -41888 -9460 36132 -12056
21118 -12056 -65911 -96831 -107428 -153792 -129240 -83630 -107931 -125753 10975 26511 9501
21107 9501 28929 53280 33901 -50974 -15466 -50573 -43781 -57029 -35959 45141 101072 58424
21095 58424 8717 87018 109938 -54773 -120316 -128496 -80922 -123127 -134994 -159162 -157988 -141166
21083 -141166 -111294 -156013 -106303 -40276 18798 66301 87174 109352 109204 57255 -8434 -54550
21071 -54550 -96855 -42143 18574 5630 -51713 -54388 -89956 -121469 -125027 -95491 -185708 -185994
21059 -185994 -92457 17543 56804 -4027 -72048 -75281 -109274 -70216 -50875 -48746 -9876 -15474
21047 -15474 -22284 -75511 -62919 -39368 40243 126119 89466 103160 61453 7891 -57259 -107929
21035 -107929 -101937 -97471 -100592 -23482 110086 72637 89931 161141 103904 -11142 -112607
21024 -112607 -93775 -53208 -60515 -87171 -61836 -13655 40294 109458 87320 61959 13984 -15226
21012 -15226 -28826 52151 91826 48537 37295 61636 30488 19889 -40211 -50297 12534 -448
21000 -448 -54586 -154841 -133155 -88865 -112553 -74633 -89424 -47811 -56014 -65456 -29617 -133520
20988 -133520 -103895 -36225 -21315 -11642 -74735 -61471 -31278 -108532 -110681 -115386 -172812 -107027
20976 -107027 24729 79151 51995 -56335 -33864 6893 -24203 -71669 24892 57521 81562
20965 81562 16838 1625 70926 28903 87106 61048 -26533 -36384 -37769 -106286 -72194 -50295
20953 -50295 -3217 2415 -15398 -24761 -108095 -69117 39961 36406 35698 7627 23147 -37664
20941 -37664 -50164 28818 64818 91645 -23238 -38179 -13131 41874 69576 70898 80732 37616
20929 37616 -60994 -13969 9042 57424 57375 29691 13197 -15214 -102584 -155382 -135503 -105834
20917 -105834 -72528 -62948 -44401 -94289 -123334 -149634 -115134 -61071 -40161 10922 85663 -13618
20905 -13618 -139403 -43274 -1781 -63960 -97665 -74955 -4397 31040 60855 126843 192916
20894 192916 139206 124398 78380 -49786 -72138 7105 -6913 -6802 -30919 27729 69309 44966
20882 44966 30098 102834 151176 102899 85234 43849 75572 28032 13429 -15807 6340 11741
20870 11741 -97438 -69650 -81877 -140266 -141956 -98875 -154154 -168120 -81862 -35452 -65331 -56350
20858 -56350 -1618 -33637 -117536 -104353 -32258 -45844 -3669 -46397 -139289 -196099 -210251 -134420
20846 -134420 -80303 -10206 -59126 -85274 -84524 -90129 -62363 -83661 -95214 -102211 -106848 -129777
20834 -129777 -128169 -73586 -74134 -127978 -133314 -80083 -95100 -148554 -149442 -84876 -48048 21206 36573
20821 36573 73406 71960 27444 -13701 12863 15946 7933 44542 16816 5571 4130 76534
20809 76534 68347 58840 -934 45820 73394 81542 64403 73686 13966 -104253 -172800 -86608
20797 -86608 16276 4139 -82183 -66940 -38269 28239 73634 112271 83732 -9658 -47423
20786 -47423 -37249 -109163 -139593 -108638 -105071 -51317 58536 103065 76954 11078 -574 34898
20774 34898 23601 20640 50263 -3375 -83559 -46407 9681 129534 190173 166589 46854
20763 46854 5719 -53220 -168004 -142247 -12817 -15258 -121271 -114787 -88176 -126656 -103019
20752 -103019 -14737 -89302 -119043 -108489 -109454 -157799 -103743 -165802 -256711 -171788 -92467 -70771
20740 -70771 -139433 -127984 -57556 30160 47484 23103 21885 -2586 4466 4340 -22074 -32084
20728 -32084 -25907 -132160 -109843 -80319 -80666 -42898 -22159 4298 71099 18540 -91722 -86300
20716 -86300 -17950 48792 43082 -67602 -101857 -17501 39435 42977 -8701 -71332 -77127 -66876
20704 -66876 -36495 -7150 32130 70640 29209 -34720 -48816 30152 118753 128468 132445 111545
20692 111545 72901 93972 122336 84455 6698 -56608 -28521 -17980 24582 11310 -53922
20681 -53922 -142971 -191985 -173578 -54572 28811 -6864 -66332 -119676 -106514 -129112 -205117
20670 -205117 -235676 -122014 -63497 -10403 11725 -90374 -79191 6306 62732 81351 62217
20659 62217 31912 37607 -48537 -110834 -121189 -88876 -7505 17172 -30976 -44875 -28121 -57576
20647 -57576 31477 206551 225756 207767 166286 166381 161663 129281 68583 -5056 -31377 31639
20635 31639 149399 186379 143505 90883 -2119 -45102 -20431 70185 133563 177775 197917
20624 197917 138712 68489 89034 42842 -9685 -45124 -16292 -18228 29162 70400 -15431 -29543
20612 -29543 -14453 28432 120280 98948 61431 18019 -85316 -104880 -77911 -65235 -7567
20601 -7567 36060 17737 38546 -26051 -58138 -100121 -124545 -72355 24141 56322 65450 90916
20589 90916 71889 74326 43499 1168 -22333 -2714 27464 16800 -7654 11166 83205 3137
20577 3137 11018 70635 64123 151908 152703 78235 10556 -10381 34441 14653 -19434 -39088 -57585
20564 -57585 882 72633 85912 42683 -30561 -66595 -65367 -79449 -9698 34868 66254 48164
20552 48164 50850 82877 132027 115893 89583 -9134 67090 67000 24452 -10743 -9530 12492 19072
20539 19072 125466 177368 45904 -23216 -24922 -84000 -73826 -57170 -23945 40219 12159
20528 12159 -18133 18750 -21028 -29529 -31623 -46830 -111667 -128784 -83683 -30006 -51754 -27240
20516 -27240 39798 -50269 -6671 -15496 1248 85764 67827 101730 74689 -7288 29447 62176
20504 62176 22127 19502 -27672 -49071 27253 97088 42886 -47025 -47917 -70093 -93051 -87345
20492 -87345 -60677 -48709 -48584 -50582 19576 4023 -16256 -20380 -16613 63737 142633 136750 120448
20479 120448 82404 40703 42915 52410 -5634 -39515 -22273 11567 39645 -8977 -140295 -138127
20467 -138127 -117329 -112209 -100189 -100721 -71341 -66251 -45051 -66780 -107804 -129879 -118674 -61241
20455 -61241 -29535 24608 -11826 -77378 -49569 50503 89229 98619 121292 47377 -118638
20444 -118638 -141072 -35595 -47240 -64016 -15199 -17708 -69074 -60346 -83985 -92527 -38549 -27670
20432 -27670 29357 33178 21486 7071 -43377 -64916 -94425 -36993 6927 37903 62910 102662
20420 102662 51216 -40746 -120626 -108143 -131137 -73240 -6012 58785 21127 56326 76997
20409 76997 99055 28772 -17470 -36903 -51161 -90179 -157450 -133218 -143849 -146014 -132621 -82569
20397 -82569 -28637 -1648 16903 31387 -64036 -121695 -93683 -57668 -103279 -66910 -82179 -134150
20385 -134150 -91626 -40015 -93646 -67752 -21227 -81427 -90090 -74696 29158 73585 15329
20374 15329 -49366 -86264 -71055 -7658 -6300 -35604 -52433 -25225 24453 15722 6123 -22607
20362 -22607 -70816 -12646 -2185 -15881 -14648 30896 56203 89245 133592 110450 109556 1334
20350 1334 -28423 -191 -9748 -52332 -32862 7298 -15984 6602 -4831 -72581 -86767 -124631
20338 -124631 -125621 -111302 -106188 -46829 1931 6743 -42726 -153407 -137510 -96283 5632 45477
20326 45477 -15129 -67778 -13552 18663 38441 67578 132945 86486 27910 -39210 -88076 -96545
20314 -96545 -114377 -155034 -120821 -49616 -143934 -183430 -159403 -120129 -105402 -79204 -44047 -20371
20302 -20371 -86607 -164032 -199328 -231840 -178571 -155140 -245165 -196105 -100508 -69292 16286 66238
20290 66238 62400 37316 -4100 -58227 -83601 23878 28432 -21912 23893 46669 -13456 -39397
20278 -39397 -81978 -81847 -59540 -58696 -19870 -9566 1994 28255 54265 77709 81458 71809 52063
20265 52063 25082 71979 101791 129886 138420 117789 128175 175273 95620 28720 13095 58598
20253 58598 66086 38423 56390 73358 49883 73985 -26949 -75064 -32817 -93994 -48924 -2987
20241 -2987 -60976 -149216 -139886 -65294 -168450 -185032 -72852 -25557 20819 6985 27578 54546
20229 54546 65141 6171 -35306 18713 5589 -94550 -254835 -210785 -96990 -25277 -40353
20218 -40353 -101677 -185921 -179071 -95527 -4255 -78550 -102670 -135974 -153557 -145560 -155934 -168275
20206 -168275 -106429 -78946 -73539 -58797 -24872 -59258 -81088 -51232 -53920 -26080 1507 -47296
20194 -47296 -87467 -58726 -21243 -36484 -93707 -83669 -128200 -141260 -125258 -92992 -113753 -42253
20182 -42253 -32679 16595 -13075 -34240 -38257 20831 74576 79666 -11924 -45676 -90544 -37153
20170 -37153 67932 24827 13948 54022 21654 8315 54660 51392 -459 -23087 -55095 -141518
20158 -141518 -191046 -121436 -68499 -129034 -160672 -75241 25122 110020 108924 111577 113745 94069
20146 94069 89199 61605 45686 26250 -969 16270 19662 -60244 -110900 -171004 -167791 -96966
20134 -96966 -71164 -16986 -9983 -8275 -40967 -45295 33021 -2292 -65366 -36020 -32304 -16921
20122 -16921 -21860 -52756 -73079 -62771 -43075 -28765 42146 57245 50442 43756 98286 113596
20110 113596 155184 173265 144526 135591 -2962 -10483 -57209 -25441 48452 -41696 -28823 -27838
20098 -27838 14928 3829 -7580 -31487 -145657 -168727 -231062 -195175 -69845 -41040 -34070
20087 -34070 2497 6339 59853 79202 0 40709 85023 46159 -40967 -49377 -24764 -4006
20075 -4006 -30414 -19595 -84975 -64702 -53925 -83796 -117375 -135671 -135466 -82368 -103043 -118740
20063 -118740 -86030 -60958 63921 96151 91465 99682 31861 27165 17928 50605 95878 29096
20051 29096 -73952 -148584 -91054 24467 29142 71130 100105 80349 74559 45976 -1177 -45221
20039 -45221 -71948 -93686 -1220 52492 56394 47636 -63152 -110209 -111495 -96244 -51804 -4182
20027 -4182 -26395 -77217 -90511 -67584 -94150 -79488 35253 97994 30139 -7544 20476 97888
20015 97888 122769 88333 36207 55415 7888 -45482 -41438 13435 -4701 -10106 -73738 -148189
20003 -148189 -90451 47410 32645 -24068 -55950 -38615 -41670 25075 53568 44219 50368 65908
19991 65908 36246 -8104 -30545 -86321 -66069 -38640 -52333 -19080 73299 51698 29089 10324
19979 10324 57517 77323 39658 75405 86034 88258 62267 -30634 -87754 -85997 -160594 -65074
19967 -65074 37903 70270 11193 -62731 -61171 17904 64554 57908 64500 109282 116612 61407
19955 61407 9325 30669 100381 46524 -4759 -58408 -93167 -29482 -18239 -25777 74879 153199
19943 153199 149747 167807 209990 133390 54047 78062 116271 128552 120829 10254 28756 41304
19931 41304 -34881 -98711 -89287 -127046 -134614 -38260 35620 72133 117797 75676 31045 63931
19919 63931 -61685 -124910 -59497 -54607 -97269 -100187 -19862 30881 23863 54027 5892 -1033
19907 -1033 3037 144938 128084 50926 2133 -47379 -18153 19047 5026 -83820 -150552 -153452
19895 -153452 -42228 80510 95672 96462 28168 16250 95237 172979 114039 104981 45227 -978
19883 -978 22538 -7745 -26447 138728 157973 95029 35623 -47565 -124323 -171306 -135183 -49950
19871 -49950 -52422 -8410 68226 72229 85541 84883 61450 14558 -7147 -89121 -131573 -96255
19859 -96255 13874 -8053 -45316 19944 48611 17895 31266 11082 -40706 -39430 -3426 -1388
19847 -1388 -28855 -60762 -46072 -12060 52437 55516 2269 3844 32096 54047 49981 39151
19835 39151 17107 -23876 2632 12112 -22311 41223 11708 33522 14158 41701 21382 2353
19823 2353 903 4025 -40092 -21534 -68929 -82982 -53712 75725 54781 33452 17645 -717
19811 -717 77367 78387 35535 120134 139147 126152 152325 201513 149951 41748 85842 72527
19799 72527 -22667 -42276 -74585 -79203 -32598 -9341 39410 51547 78307 439 -67413 13391
19787 13391 91060 80399 92564 90934 128486 158068 101488 -2590 -128973 -186823 -119611
19776 -119611 -23091 -29277 10641 48357 119984 167245 170993 119996 77460 -996 24168 -3017
19764 -3017 10507 78622 29816 -1858 43216 60394 110141 138486 79607 81064 129268 110715
19752 110715 106512 156502 160890 159233 203170 213571 150745 110453 145332 105757 32050 74060
19740 74060 159752 102319 108771 94516 91761 87537 193317 290933 325637 315541 424517 560345
19728 560345 623661 646556 606561 459462 496072 548740 561265 569139 502283 436699 415770
19717 415770 480217 499914 385969 343403 318276 263397 288171 211884 163944 178457 167476
19706 167476 184704 221143 235164 235218 153531 89550 100769 44368 103314 125047 166553 223023
19694 223023 211664 163793 144856 96179 113775 98060 81342 92539 126968 122110 163327 162668
19682 162668 68932 7970 2488 51471 53710 38747 34107 45286 43375 57629 70273 74018
19670 74018 -10793 -49716 54425 93996 88315 144091 167454 129280 148964 171809 152350 117467
19658 117467 95244 46105 36380 -30851 -21529 -758 37093 65648 71880 156017 70036 -10286
19646 -10286 8492 39804 95152 73363 99783 184569 133837 191104 145713 107490 64258 38119
19634 38119 3277 37283 172780 183462 175434 171822 84178 26388 48601 51435 19038 38162
19622 38162 12548 -12769 -52832 -57192 -10176 59633 53154 -4117 -21087 23954 67183 93985
19610 93985 107906 70335 16161 4827 97605 97047 131306 126655 20467 -5782 3965 351
19598 351 79581 37377 21535 -10648 63185 -1613 13341 -1049 61607 50208 49756 134374
19586 134374 134456 114277 100603 49846 -29178 -50600 -36657 13483 87430 199295 168197 112779
19574 112779 108167 91134 70517 57403 55472 -64936 -85411 -28928 -70016 -95715 -108151 -79623
19562 -79623 -73834 -15935 -16568 30498 36023 -11545 -105563 -173533 -90733 1231 -22588 -10733
19550 -10733 -5789 11145 24736 77742 142294 148764 167376 113704 106494 2204 -5268 19584
19538 19584 104973 163365 127771 102946 82763 -5823 23281 82401 81483 -22348 4796 77888
19526 77888 168793 144325 82877 148019 192936 81807 91454 108244 107306 106674 83522 70318
19514 70318 98688 78625 10979 -20235 39303 121011 185646 109241 86026 131372 125165 129293
19502 129293 45592 -8558 19499 3097 1012 87828 25975 -24109 23481 66018 208080
19491 208080 270808 231142 129822 116238 120279 142427 212942 244874 292202 370469 312922
19480 312922 234640 167709 82725 152958 169976 171153 231941 186432 211453 212000 92558 14180
19468 14180 4240 -19764 18980 64432 147480 239865 311149 235546 171053 141629 67344 98584
19456 98584 94577 105693 176190 159394 154820 295764 350067 344733 276088 264391 345886 338422
19444 338422 233848 196685 164002 140942 118850 140663 110708 99145 144737 174021 130656
19433 130656 72826 103625 90894 31849 15882 59796 129989 111792 163039 178386 146493
19422 146493 219880 185037 145041 220884 224722 154556 164190 134368 105169 133454 108056 114799
19410 114799 165330 172683 149819 155809 138923 128369 183688 185217 207198 164854 104202 157513
19398 157513 143536 194345 230677 202618 99972 70619 35423 -93739 -45119 35808 2342
19387 2342 -42710 -49392 -24225 68855 100902 64155 117116 172682 171163 131681 75120 102207
19375 102207 123477 161725 152097 111366 140998 205396 173266 127170 201778 189364 31817
19364 31817 -12523 23418 44011 126444 231657 302138 287366 202055 190558 136342 117857
19353 117857 101631 92971 104226 109154 18982 4949 76941 118158 148521 133867 172484 251213
19341 251213 159424 136981 161625 127490 93934 121757 216369 238055 136032 159006 244994
19330 244994 279840 361901 400650 350164 407143 410834 393237 374278 364744 407895 427311 417721
19318 417721 413458 392883 339352 294934 241922 196703 180977 147356 66004 140001 149909 166632
19306 166632 201259 153782 191797 240596 206218 178954 168457 162783 144448 157703 158167 120718
19294 120718 44488 20811 65254 70334 152803 137782 98624 83160 148733 160240 212109 272562
19282 272562 277011 205378 155902 163559 218001 391393 390924 310865 311004 357936 290869 243550
19270 243550 247925 249213 248029 210381 236410 302534 290651 296709 242667 287559 285213 343766
19258 343766 410670 369455 341628 315531 315680 362123 348827 311215 342513 345887 350712 383281
19246 383281 281429 264124 290410 293067 262505 244046 252017 183346 198787 210797 232749 211505
19234 211505 245340 384940 519944 592754 602883 524039 506364 516985 527409 546346 518880
19223 518880 535400 562621 510429 471139 472731 513916 486211 531535 573731 609527 678502 787646
19211 787646 861863 907913 959216 944932 912540 912008 938224 978929 963556 961230 890802 770399
19199 770399 725364 737311 702040 758173 786739 710365 670316 731213 718459 645138 649176 598055
19187 598055 606562 616239 661284 701849 699345 715106 703901 707318 678359 633799 583349 620094
19175 620094 656368 670640 636155 633756 706470 727002 780638 754329 733010 900318 1030083
19164 1030083 1061199 1057969 1110484 1229888 1266480 1232161 1207125 1217731 1251334 1272219 1335159
19153 1335159 1432156 1499870 1548675 1597067 1639846 1772498 1853272 1855694 2008950 2226762 2343037
19142 2343037 2419693 2467669 2480924 2416536 2327980 2218435 2009585 1935308 1959094 1940740 1947036
19131 1947036 1846518 1814772 1920561 1894942 1868807 1915857 1898596 1894857 1847959 1785034 1867427
19120 1867427 2020792 2003156 1938152 1860515 1887758 1983537 2059782 2161295 2260642 2373539 2445663
19109 2445663 2523156 2538548 2603998 2711444 2834183 2982272 3063635 3226946 3410579 3555682
19099 3555682 3686311 3823825 3959867 4118818 4298043 4434994 4546561 4747725 5009357
19090 5009357 5251703 5672503 6151789 6699372 7489159 8489255 9598493 10878942 12561549
19081 12561549 14650846 17507761 21203781 25734378 31327633 38069351 45937004 54669922
19073 54669922 63852444 72971168 81232451 88240629 94378296 99797274 103552822 105396015
19065 105396015 105841162 104705913 101575419 97121815 91987167 85522620 77910626 70000829
19057 70000829 62586231 56023228 50317265 45435754 41407566 38077612 35384155 33201386
19049 33201386 31298571 29746121 28486849 27398559 26451792 25533422 24786124 24202246 23656346
19040 23656346 23307369 23050706 22773690 22491300 22139350 21822050 21498467 21165543 20747038
19031 20747038 20282191 19825080 19227475 18465429 17698896 16946478 16176109 15356589 14578671
19022 14578671 13834013 13039642 12288940 11606575 10910076 10282751 9674428 9164807 8729233
19013 8729233 8256786 7854187 7460667 7041711 6635443 6279745 5983495 5661708 5383639
19004 5383639 5128778 4853996 4592151 4355517 4177255 4049594 3939374 3756307 3542804
18995 3542804 3394580 3226699 3010570 2813582 2707452 2605528 2463672 2254700 2112049
18986 2112049 1994364 1900090 1849218 1788480 1662911 1555205 1470100 1310364 1312140 1340421 1266916
18975 1266916 1138426 1152935 1133122 1060135 1061392 1055727 1030733 1002672 962032 863876 774804
18964 774804 746257 749154 636267 576935 606838 625811 634341 585003 508191 529565 503221 496224
18952 496224 527778 509704 439896 470895 511971 552576 629260 613821 506617 517516 544615
18941 544615 598833 665654 632366 636433 645461 613832 614090 548952 365867 281961 323509 331611
18929 331611 347470 347668 326485 330706 348495 351341 297844 273091 310339 320963 386100 382661
18917 382661 353989 321830 239523 229308 248323 351823 373919 338782 319102 303608 373978
18906 373978 394151 452457 519867 487819 463661 395154 451458 579571 579298 519880 537770 589463
18894 589463 667781 686571 648582 555478 482027 484752 590028 668890 601717 571367 615574
18883 615574 708595 726328 660801 592384 502621 555399 652305 630842 530200 458464 482592
18872 482592 538806 557177 631474 683380 674967 650543 668042 709234 683734 759496 748052 727060
18860 727060 687177 646143 660058 646447 709894 709984 680176 605117 588056 559910 541876 559847
18848 559847 590765 578769 577126 540623 585181 601366 650900 705835 648590 661071 748656 776580
18836 776580 760419 769967 888023 932656 1018709 1099712 1115953 1070259 1000716 940605 887602
18825 887602 844018 874866 920122 850653 865968 772852 695324 704958 666400 640321 643188 634908
18813 634908 637167 577584 568482 568643 560787 595439 575261 551392 515436 430853 377509 337130
18801 337130 381741 366902 391393 393509 420291 431283 409718 348823 383009 391374 360005 367898
18789 367898 383258 381404 342332 313600 347282 339917 202677 180672 231199 264636 220444 220996
18777 220996 267442 279820 299180 296338 314695 314929 373919 445574 419289 411868 429279 366037
18765 366037 313985 368444 425009 301068 205827 225885 269412 204534 201159 227675 231693 255008
18753 255008 334924 329796 226307 279766 284157 342733 398319 401826 407192 369195 407234 397503
18741 397503 321952 300300 381105 483989 475009 444447 388449 453449 478310 483449 504811 440273
18729 440273 339406 241203 270114 337048 363366 444024 432361 424779 454863 433423 365821
18718 365821 346855 334406 363261 393209 395527 359206 333129 392617 461761 536903 627500 648688
18706 648688 615446 583798 571528 622895 574671 528030 499531 521950 558111 650325 710862
18695 710862 746366 806631 795896 894137 921248 953369 1055668 1035071 975875 926777 916617
18684 916617 916013 1011026 1083469 1095037 1057949 1098435 1038317 935109 958817 1111102 1112962 1133305
18672 1133305 1130187 1092380 1087309 1160988 1220326 1289437 1290470 1323575 1390207 1452552 1481652 1532835
18660 1532835 1597409 1636662 1754677 1837532 1977747 2134544 2260778 2293219 2318325 2395310
18650 2395310 2502273 2566624 2710435 2906492 3012188 3024028 3025287 2996638 3014257 3140621
18640 3140621 3235922 3317851 3437152 3401139 3373360 3514920 3697325 3831773 3978075 4083188
18630 4083188 4274904 4508464 4851801 5259062 5790047 6356189 7020245 7976455 9165606
18621 9165606 10747571 12718384 15176187 18338682 22524374 28256014 36153980 46702589
18613 46702589 60420425 77081996 94692921 109004091 114535553 110849627 105549237
18606 105549237 104733595 109231842 116404319 121292928 117729983 104310111 87460375 73190268
18598 73190268 62427433 54488993 48537516 43865517 40034993 36869270 34208226 32020250
18590 32020250 30186056 28730657 27522722 26383750 25419292 24581710 23861201 23273706 22802041
18581 22802041 22441573 22192510 22092341 22076507 22075778 21976130 21760927 21497649 21200032 20943788
18571 20943788 20522757 20107487 19566227 18908438 18260554 17518285 16599020 15804064 15022083
18562 15022083 14104390 13126218 12359225 11655745 11013392 10500358 10036050 9506257 8972118
18553 8972118 8370173 7888729 7410738 6921961 6518913 6115765 5786629 5550539 5312289
18544 5312289 4971491 4737824 4502628 4310884 4128033 3959837 3822920 3578681 3364886
18535 3364886 3197627 3082096 2891534 2765437 2653889 2473518 2384834 2283667 2208606 2080264
18525 2080264 1977429 1911984 1805662 1677269 1554509 1474992 1467507 1399859 1332778 1332476 1342552
18514 1342552 1193012 1031108 962793 949467 921687 880086 821004 741036 684438 721929 806985
18503 806985 747206 635218 621495 566449 537254 590875 568407 494334 384639 313157 327990
18492 327990 350895 430883 488252 473012 497593 596644 649719 611851 604341 643437 563076 456008
18480 456008 330361 318978 481205 641834 670210 613943 496671 422815 408010 336650 274960
18469 274960 307144 381578 332017 300722 351062 319984 220621 225246 278865 238928 196382 137157
18457 137157 126811 234691 294903 282975 294309 294721 358415 403851 381432 409776 445935 391045
18445 391045 408574 440062 412461 339556 313371 390447 455272 507369 532673 489205 413189
18434 413189 452553 465123 439800 441582 442436 462809 424348 395554 412432 488343 513604 457292
18422 457292 545975 562241 560699 553727 525002 511315 476873 517070 555054 564271 561537 622765
18410 622765 700978 717948 730016 769676 660231 638012 738061 671249 690863 807989 794443
18399 794443 757126 745162 700487 659082 633658 619969 521355 526486 581776 637070 698590 578691
18387 578691 542663 499759 402783 367707 322412 333644 372242 396496 395555 380886 384712 288561
18375 288561 216044 260222 347441 264423 257763 287417 316956 281320 206582 273528 308845 334705
18363 334705 298322 259854 272918 240266 217628 281316 296393 325690 369364 331582 341580 303137
18351 303137 161093 115048 154572 236677 154048 64741 -30963 -46375 22049 61827 48855
18340 48855 12364 67394 53200 25804 19330 -4004 -46916 2246 -3795 14950 51147 49540
18328 49540 48372 21496 64751 53511 100789 60494 67713 56081 75651 50087 20996 -9442
18316 -9442 -20556 29742 82642 160330 138690 105735 108053 117192 35051 35176 27792 -59903 -65376
18303 -65376 -235 25383 46901 17774 -42731 -62768 -118438 -97996 -88185 -51650 -31000 25399
18291 25399 3542 -60928 -154053 -102821 24050 53497 -14499 -37194 -2933 -1683 83098 163602
18279 163602 154359 94926 32441 4516 -77752 -40678 2944 27300 59486 82155 90213 118475
18267 118475 150829 114136 50914 79463 10151 -117929 -60919 78603 96610 65925 15818
18256 15818 -7248 55610 72037 95889 54249 57515 61794 1238 18721 80723 65998 72191
18244 72191 13356 -21097 -36000 -26908 7551 45656 30874 -50630 -74854 -12776 -9718 21873
18232 21873 -68093 -137386 -107736 -26255 48962 59169 79090 34589 27371 88383 50368 12202
18220 12202 -9977 22554 63124 14437 -28055 -11785 51511 7319 -62765 -23349 106812
18209 106812 105504 31388 28032 73238 72551 58422 28049 58433 16609 -24130 -15284 -32336
18197 -32336 -49694 -19379 -2897 23387 -1129 -52697 -55907 -48571 -42097 -147178 -97715 -37823
18185 -37823 -69957 -5686 45921 140155 150618 55736 85665 56924 -53507 17407 92989
18174 92989 57954 37808 60215 38362 -33853 -39507 29472 27150 -21288 -12460 17247 45065
18162 45065 117400 81969 -617 -45474 -21768 67297 53057 46479 26264 -107626 -106512 -26288
18150 -26288 45748 101021 118176 75295 33741 34800 60186 18035 1275 23706 -26682 -27687
18138 -27687 -25147 -20231 -48586 -12097 -93932 -53289 70536 127964 36788 -38238 -36291 -64887
18126 -64887 -107943 -98505 -64294 -18984 -27384 -90454 13317 -16492 -68952 -98272 -41423 -23515
18114 -23515 -8346 38202 21651 60879 10053 1081 24284 -18394 -76940 -92481 -110758 -65101
18102 -65101 -30917 -67893 -79920 6219 20727 72207 141106 96212 37692 43031 85447 28213
18090 28213 -28873 -137504 -118934 -46579 -40150 -29119 76179 62576 34029 41180 42163 63835
18078 63835 11387 -52461 15158 62412 53516 31049 44147 53507 99406 102284 66531 39041
18066 39041 59425 23087 -11550 -6203 -43391 11668 22730 -7612 -17643 -66618 -121684 -149336
18054 -149336 -40059 43223 79576 42450 83836 41380 -97641 -176907 -130807 -85915 -44991
18043 -44991 29896 -130 -29906 40469 48681 41730 75776 118671 56296 4156 48601 57707
18031 57707 14043 21677 19047 80524 116496 69538 36885 45050 85780 89363 32891 -15427
18019 -15427 -29121 -33539 7353 13985 16069 19315 13847 88126 168752 121663 160237 120332 88797
18006 88797 160698 266046 327528 500058 648662 651390 599406 574033 609982 559063 515255
17995 515255 448308 450081 494567 462443 442612 385550 356792 304164 281313 265478 248837 216584
17983 216584 265653 252308 205808 271494 355642 401950 446711 513402 473217 420414 469821
17972 469821 470881 482936 526384 648502 755162 806890 752904 738620 783595 886323 979741
17961 979741 991208 924038 869660 822486 721936 642050 640904 635787 653138 659793 573100 443129
17949 443129 397154 429789 426140 393447 330475 230443 176228 129709 41973 57444 83110
17938 83110 32119 159885 242406 204183 147429 188515 174628 207571 134855 106156 101828 77356
17926 77356 17233 49165 121380 193321 261040 295763 281895 238383 249057 243147 237415 163173
17914 163173 120416 85244 -44097 -62260 -128305 -39648 99188 89545 59807 77516 87333
17903 87333 39060 19753 31272 17528 14772 50883 75775 76666 117355 148065 208492 176034
17891 176034 111861 98776 119259 24782 -89960 -90909 -37980 -72895 -196675 -167899 -11059
17880 -11059 4622 67046 59125 -53230 -59700 -47495 -91029 -8395 47528 -14824 -12335 -35829
17868 -35829 -51219 -101330 -203102 -233182 -202903 -134210 -65852 -98706 -175650 -215946 -147455
17857 -147455 -92077 -117707 -70406 -56648 -78382 -124787 -121299 -47605 -53329 -81834 -75458 -42829
17845 -42829 32786 85840 116846 50689 42962 52472 -28474 -147190 -84796 -20489 10307 59689
17833 59689 67800 102021 96911 1230 -66439 -81964 -77042 -35112 3017 -9403 -17129 -37279
17821 -37279 -65938 -25060 -14792 9030 29229 -61444 -55445 -280 13815 49382 108322 114610
17809 114610 62879 138893 166372 74217 -45889 -31829 41870 35291 33972 -25560 701 8941
17797 8941 -83207 -111121 -70014 35961 68347 9421 -37515 -38247 -37650 -38153 -12335 -77579 -122649
17784 -122649 -102626 -114943 -126464 -134241 -86361 -144243 -88695 -17510 -22913 -47097 -6931 -47744
17772 -47744 19093 43445 33941 11645 -84267 -100792 -90553 -87455 -110291 -80150 -175381 -79060
17760 -79060 -26480 -34583 -14335 -1944 -11228 -1913 10219 -9395 -15679 -59857 -114627 -87504
17748 -87504 -68800 -90999 -94918 -85713 -82279 -59770 -15729 -52445 -168980 -127906 -120374 -103006
17736 -103006 -88302 -39627 -32045 21065 84261 47910 -19 -3450 2154 6083 -25801 -23701
17724 -23701 7263 17675 -37188 -63324 -57190 -20545 -4786 19869 6732 -18389 -1235 42135
17712 42135 81777 107593 20031 38740 -11541 -86575 -96481 -121384 -138356 -67433 26071 46663
17700 46663 25050 27129 -21829 -106169 -167664 -156035 -107720 40 67249 104261 83689 30226
17688 30226 40449 71019 29667 32093 157555 111054 51058 -19959 -59975 -40932 -50417 -59318
17676 -59318 -32777 30003 -1019 -29919 -98996 -123249 -120908 -100115 -51834 -69190 -60760 -7807
17664 -7807 71577 3693 72619 197473 160005 50459 8420 7033 28673 -2606 -42840 -13748
17652 -13748 -3908 56813 161467 212028 194621 151395 204985 199430 188200 170548 288810 379418
17640 379418 459540 550624 578170 637131 668778 728073 806089 761452 699081 703590 743087 677481
17628 677481 584693 530292 510323 504004 543023 500563 440343 387631 359794 370756 291673 251583
17616 251583 250342 257938 291181 271711 199869 172290 162549 120685 163906 211729 221743 148112
17604 148112 198808 205446 168557 194527 211106 249497 218002 220659 153519 59764 77223 106076
17592 106076 96928 124541 116436 119145 116353 68357 61066 87234 88352 94989 68115 89795 64478
17579 64478 72969 11021 -73274 13413 10460 24981 78746 52579 82610 36694 10493 71952
17567 71952 99155 85834 36488 47976 57768 51462 -35005 -157970 -200971 -187984 -144366 -120559
17555 -120559 -21400 -67180 -118344 -54650 -48902 -27238 -40838 -63594 -62316 -59481 -49612 9299
17543 9299 35341 2007 -62818 -115661 -106764 -150422 -149646 -96227 -41092 -54364 -86567 -50019
17531 -50019 -94506 -21159 8509 69 63906 67710 -29396 -106082 -96665 -2389 -34536 -114702
17519 -114702 -75434 39006 70146 123232 40414 -32657 -43650 -32659 -26813 11246 -5459
17508 -5459 -63939 -123522 -105982 -86123 -81587 -47238 18614 24321 -17227 -39695 -38441 -97991
17496 -97991 -58214 -96937 -142637 -108386 -77963 -103550 -102168 -42855 -42941 -34474 -106289 -154115 -131301
17483 -131301 -114806 -33810 -26675 12275 35838 -5643 -31601 -4713 -15199 -28308 -25620 -31967
17471 -31967 -84158 -995 67526 100383 80524 94118 134213 107641 50022 57849 82506 37458
17459 37458 -9185 12843 13523 33376 82465 83668 67495 -32117 -79398 -18043 47436 59752
17447 59752 29262 -8198 -55386 -145988 -73045 -5163 13109 33201 35703 49279 582 31152
17435 31152 63582 124068 64492 35089 6432 -27978 6927 -103864 -124069 -71773 -64493 -91471
17423 -91471 -25529 57144 2663 -94284 -120522 -41605 -79934 -177772 -188717 -125726 -248355
17412 -248355 -302255 -205369 -110181 -138782 -140829 -105467 -62704 -120008 -147476 -113098 -76951 49915
17400 49915 48986 -52125 -39645 58477 65786 96823 100850 44088 51716 66536 30930 5746
17388 5746 54945 21807 52456 46922 31332 80193 62748 11515 8804 -13812 -99192 -140765
17376 -140765 -112560 -114002 -96979 -104647 -29777 76784 58301 -31589 -49357 -41795 -44680 -81141
17364 -81141 -118473 -105018 -91349 -93105 -94616 -67586 -83075 -121330 -13619 11724 6337 -719
17352 -719 107545 163439 123697 92050 124980 108683 99042 82400 64635 131454 75920 76962
17340 76962 -880 -57909 -35839 31296 41848 -43170 -59555 75032 172640 158110 89466
17329 89466 -5262 -35282 37407 57366 76865 70741 83284 69285 -1830 3959 -5074 -63897
17317 -63897 -141844 -78117 109333 142982 6272 -16978 -9174 -70366 -84036 -2773 -14307
17306 -14307 -64574 -75709 -58853 -70749 -53864 -21596 -67852 -100712 -178538 -175942 -156130 -113740
17294 -113740 -78376 -97542 -94434 -87048 -17971 50360 62914 4184 -26417 -15969 -43972 -43710
17282 -43710 -15421 -18973 -56919 -62094 -112319 -85379 -25222 -21789 21944 9247 -13807 -47653
17270 -47653 -37623 -39034 -40651 43189 31885 21105 -3406 69412 95434 17091 -21653 -94175
17258 -94175 -179384 -119103 -75108 -104652 -182706 -154522 -140103 -126539 -58566 -75389 -61253 -90244
17246 -90244 -63480 19276 31694 37889 13220 -53162 -83553 -151431 -150623 -86711 -80347 -83971 -81780
17233 -81780 -36171 -14513 -14079 -16553 -2527 10902 19074 90283 142949 152633 102684 61553 -10103
17220 -10103 -15414 -46504 -85975 -70121 -8613 -43024 -63213 892 61586 7631 -11627 -33502
17208 -33502 -71046 -133001 -72542 -80572 -127985 -220810 -190378 -106541 -57446 -47224 73553 152447
17196 152447 105981 30778 -70179 -55372 22226 -15385 -38815 -22223 45164 32942 38814
17185 38814 6591 -48749 10636 32358 -7736 -125186 -103022 21715 11874 -17112 -29598
17174 -29598 -88963 -134746 -136455 -37241 33174 22394 -21649 -25503 20203 -74946 -72436 -17424
17162 -17424 6203 -19113 -43211 32351 50472 99811 98357 107510 120998 129103 75470 83615
17150 83615 117163 53611 47021 7493 -126041 -194640 -207060 -134264 -138255 -77696 -53412 -38790
17138 -38790 -10935 26848 4164 -45144 21601 70426 86759 38241 -10147 -56279 -28958 5211
17126 5211 22022 11568 -2780 16560 81554 105470 88163 54386 -6979 -94581 -186196 -195495
17114 -195495 -140703 -62048 30608 99975 98910 58046 -16659 -38601 -21895 -42111 -75856 -96222
17102 -96222 -118417 -134063 -133346 -97442 -31905 -43447 -53376 -35588 37066 106255 83738 46862
17090 46862 -3138 -62791 -57809 -45698 62548 110197 92709 58845 8112 -58727 -42359 -18387
17078 -18387 -41165 -86856 -101622 -112617 -137224 -61905 72137 55210 14282 39580 79021
17067 79021 7435 -77365 -12544 62059 44450 69241 3853 -84567 -86650 -75208 -51865 -19626
17055 -19626 -6043 51819 35895 15196 -45181 -19197 25543 24723 40992 105020 71460 67180
17043 67180 -13241 -4310 25712 16147 15786 -7088 16505 -50418 -143978 -122702 -72980 -86374
17031 -86374 -66380 -97662 -135721 -74078 -50187 -23231 -58370 -95724 -91337 -91351 -64554 -57638 -30881
17018 -30881 -41636 -94920 -39295 40612 13030 27639 75597 93397 112784 90559 123749 104716
17006 104716 85151 71222 86758 29639 -53313 -110013 -68709 -20493 -100334 -90072 -56956
16995 -56956 -102176 -160403 -81843 54581 20658 -76545 -94203 -157519 -126396 -100386 -116322
16984 -116322 -125516 -38547 20897 -4879 -13733 -68075 -127586 -85506 -9889 -949 -15994 -74002
16972 -74002 -132141 -132328 -86812 -7717 113250 161438 66201 -6550 26394 -15794 -98474 -146085
16960 -146085 -134744 -108938 -148304 -157339 -54342 28308 5552 43750 58379 37314 28614 -480
16948 -480 -35209 -97826 -164843 -169573 -200613 -164671 -106335 -59652 -30396 -62268 -37232 -6006
16936 -6006 -24963 -54908 -31692 -41582 -57885 -43214 -147708 -224442 -145038 -63782 -70159 -18057
16924 -18057 -56495 -66765 -17628 2004 -77238 -81584 -79888 -9347 -50239 -67836 -34705 -21944
16912 -21944 17284 -34921 -91437 -123914 -97281 -93760 -114728 -117125 -171897 -97928 -40767 6777
16900 6777 -22983 -60576 -60822 -35395 -18808 48424 -65762 -75042 32794 -22190 -60015 918
16888 918 83491 87447 36434 68943 67646 30327 -11638 -11172 47116 92778 41840 -59679 -54169
16875 -54169 -19957 20969 70157 7 -44087 -58508 -55950 114 -5180 -5322 -64208 -78337
16863 -78337 -114731 -94002 -36725 730 -70097 -115064 -144852 -120724 -165706 -178196 -84794 -19426
16851 -19426 -52476 -40726 18345 10531 -3141 3228 -30629 -18439 11301 -66874 -110144 -134662
16839 -134662 -131593 -149832 -108877 -69176 -42516 38671 -1486 17821 148858 117553 37390
16828 37390 101127 118923 23661 -81824 -102304 -100685 -123468 -83906 -92426 -58908 -86776 -95514
16816 -95514 -31116 -13564 -58590 -14559 98507 113168 58659 -1904 21787 -27019 -34155 8891
16804 8891 37593 -30864 -42520 18660 95582 78195 -49524 -103649 -117291 -98029 -82364 -87610
16792 -87610 -79856 -100997 -117659 -129826 -156667 -114984 -111183 -24514 5141 -6004 30900 69505
16780 69505 71128 42899 -25715 -48453 -95522 -140558 -180831 -138067 -112120 -139082 -158220 -159505
16768 -159505 -133198 -87345 -40872 -114613 -126922 -41239 34360 97057 96351 60171 -31143 -58185
16756 -58185 -83579 -106627 -73270 -26765 -28188 -50523 -56609 -65892 -80012 -102445 -7798 61676
16744 61676 95338 37409 -73851 -4637 26491 12269 30760 657 12496 -9745 -32038
16733 -32038 9861 198 -53089 -67984 -13814 50172 73989 58129 -4486 -34805 -23547 -9696
16721 -9696 -71365 -168911 -133309 -65977 -14601 -5577 29320 26688 -39203 -16030 -38072 -7534
16709 -7534 15893 32592 31185 19911 -33012 -93260 -109064 -80203 -20642 17328 62236 27620
16697 27620 -37654 -16844 -56869 -120334 -151783 -96575 -43755 -64329 -112569 -91027 -34988 -15651
16685 -15651 -3486 -55228 -124979 -69452 493 8779 5277 4592 20183 -4156 31908 35017 -22110
16672 -22110 -143811 -171496 -174503 -143562 -102662 -63543 -74434 -52754 -12049 26126 -1953 -17208
16660 -17208 -58344 -46255 -94509 -111638 -132428 -81532 -57345 -54156 -6280 42066 -15687 -157123
16648 -157123 -204475 -146813 -36104 -53710 -45848 -98468 -143199 -167323 -177647 -197447 -104586
16637 -104586 -64926 -9194 -78276 -113163 -41221 56380 94898 -32195 -125211 -147190 -127083
16626 -127083 -121492 -130306 -131863 -101232 -115034 -159247 -170523 -165433 -141250 -95235 -144464 -134021
16614 -134021 -127664 -72675 -45604 -94683 -74498 -97811 -89236 -126169 -166583 -186828 -93306 12234
16602 12234 51898 50042 -53754 -94683 -86639 -80664 -76802 -40449 -89644 -113485 -87570 -61948
16590 -61948 -14249 -8769 -36622 -45938 -10389 -3515 -5883 73691 48626 -3066 22016 42992
16578 42992 -5754 -56786 -43638 -37479 -69246 -56670 -10261 12329 12288 74489 59507 -5268
16566 -5268 -59789 -3036 10008 -15870 -44127 -24701 -9153 55231 52441 8850 51156 21347
16554 21347 -68379 -88086 -65739 -6972 -40644 -106460 -161860 -100727 -42786 -82023 -89548 -46286
16542 -46286 -68968 -43379 -105474 -69364 -57840 -135904 -192893 -117173 -22719 -83124 -143559 -92337
16530 -92337 -101846 -48015 34268 81322 42380 52917 2210 -19034 -15761 -45945 -45047 83429
16518 83429 166126 174233 104258 5219 -58839 -79352 -103701 -47524 -68216 -55707 -73587 -80015
16506 -80015 -124358 -106416 -25309 -15871 86702 106323 -2500 -101902 -101281 -114960 -109178 -88624
16494 -88624 -23211 -7307 -21607 -18301 -55235 -107183 -84412 -41518 -16560 15519 -31522 -102674
16482 -102674 -61210 -18164 -779 10170 11429 -53048 8499 80602 56710 43885 55988 18524
16470 18524 -12351 -76999 -59346 -36797 -56615 -39184 11992 -54369 -61932 -29441 -19834 -23024
16458 -23024 35270 33068 55936 91730 -3487 -78967 -79032 -58857 -81488 -107657 -126922 -121701 -83473
16445 -83473 8905 7650 -43593 -90036 -79863 6529 57414 -34041 -58555 -17619 -35270 -25978
16433 -25978 -38496 24831 128420 136043 87984 9099 29102 17231 -15469 -22725 -22675 -6629
16421 -6629 55078 94125 -4373 -16630 7103 -97059 -151196 -13114 83864 118717 108400
16410 108400 61174 -892 -14097 -11931 20996 9840 -36036 59855 72667 -13419 -74715 -79761
16398 -79761 -90726 -115578 -76036 -96755 -86858 -53886 -59928 -32295 -9069 -54063 4738 -35398
16386 -35398 -81187 -38515 69760 110614 84991 96036 62512 61465 56073 53065 73447 31293
16374 31293 -57499 -82743 -85889 -94115 -108152 -92819 -47237 -12883 -3754 31056 70512 148259
16362 148259 98336 58266 20902 -43191 -78059 -67046 -48291 -3460 14449 24752 -9637
16351 -9637 -122081 -65642 7965 33276 56607 40542 -16389 -28902 -40084 -83656 -75457 -45004
16339 -45004 3785 63839 4156 -31606 -52597 -102979 -43694 -40769 -2910 -157 -38848 -95702
16327 -95702 -133596 -166374 -141500 -113967 -121683 -212065 -228544 -157787 -162676 -154616 -78540 -49794
16315 -49794 25675 4872 -92082 -113016 31071 61337 36493 11895 -84888 -114369 -88058
16304 -88058 -44138 9061 -46278 -69871 -59871 -9323 -71094 -157297 -169577 -163885 -91609 -34272
16292 -34272 11534 -12240 -63274 -15556 86608 33086 9862 23578 -22880 31363 17336
16281 17336 -26646 -19800 -43339 -75821 -72674 -50126 -35749 6977 27938 -70847 -103431 -103939
16269 -103939 -100236 -181848 -222264 -155775 -96026 -107033 -130014 -97612 -62912 -27927 -39248 -18290
16257 -18290 17774 -24884 19537 81565 82149 15510 15813 -79994 -121954 -169750 -179548 -91489 44681
16244 44681 3205 -43460 37008 99682 39874 -35426 -46720 -61989 -104340 -53723 -30088 -61322
16232 -61322 -112594 -116961 -82135 -109047 -187275 -140276 -37422 30839 -45935 -62723 7862 117297
16220 117297 95376 75764 11623 -79591 -76615 -11423 -7272 -1450 49164 33490 3925 88745
16208 88745 110520 59399 46350 8616 -6184 -29202 50298 60724 5010 -21940 -9225 -43011
16196 -43011 -47514 29751 61107 24412 15525 150592 100432 29768 34470 53493 -5957 2339
16184 2339 4155 90731 139829 132864 115893 80535 50867 81826 98178 68964 99097 89861
16172 89861 73525 6561 35379 68355 52034 -1287 -15116 -63615 -60408 -10004 9469 -1410
16160 -1410 26258 43788 64712 44122 -28422 -54185 -53350 -125099 -155961 -194743 -180311 -110609
16148 -110609 -113587 -9201 -12116 -50085 17863 42282 -21526 -115477 -121713 -81631 -75480 25484
16136 25484 104809 45562 -627 -59675 -35854 -7155 8826 -11877 -10722 24771 -20753 -128098
16124 -128098 -127971 -132896 -162949 -52420 -36083 -43003 -87470 -33420 95133 127905 47314 -10106
16112 -10106 -1898 -48423 -38102 7552 43472 24153 8939 13824 69091 122682 28709 -30902
16100 -30902 -117313 -103640 -37129 -9069 59388 140203 73165 3634 -19347 84847 173852
16089 173852 57301 -1489 -46164 -58525 31559 15451 -96876 -103409 -153655 -171582 -174791
16078 -174791 -164237 -71688 -33143 -1167 45535 72850 88508 96903 127162 112246 75849 28913
16066 28913 16244 47084 128517 84846 25872 37738 85918 18879 15045 79956 60839 25900
16054 25900 -48336 -37417 -7026 -24229 -57635 -75241 -79788 -41858 17163 42841 21671 49658
16042 49658 39482 -22802 21214 -935 -27026 -28998 -9654 -27968 -58986 14082 86892 108009
16030 108009 124514 116933 -39491 -73712 -16236 3177 11385 -7188 -74064 -82709 -36295 5301
16018 5301 18319 -13788 -8226 31600 -55512 -136026 -69298 3319 -18665 -61716 -87882 -68467
16006 -68467 -15137 -41817 -87426 -87127 -92791 -86614 -130390 -99285 -28223 -64364 -127199 -86417
15994 -86417 -58145 21417 68932 81349 127655 102866 49484 -8822 -79861 -100390 -18632 135777
15982 135777 145015 126011 108057 93083 47519 -21480 62232 70212 32550 100861 129286 138640
15970 138640 95738 -7252 -22898 3399 -23594 -61980 -150689 -168031 -160878 -118705 -81080
15959 -81080 -72242 -74535 -115887 -140631 -118587 -66319 -69688 -131498 -224683 -189362 -62300 14231
15947 14231 17577 3104 -86625 -32866 -882 -492 -3406 -42047 -10213 34571 72132 16603
15935 16603 -51904 -70530 -46820 -19546 -15754 -42650 -80979 -134419 -153687 -179906 -123870 -60077
15923 -60077 -61699 -53098 -107063 -210692 -139049 -18481 33508 3445 -30892 -124418 -139841 -103681
15911 -103681 -77242 -50397 -57541 -90850 -141367 -33051 46395 -9929 -46225 -32300 11042
15900 11042 -39627 -24211 783 63390 73652 21217 -44384 -124244 -110257 20328 -1923
15889 -1923 -87530 -71880 -2250 77473 115189 180730 216183 89058 52611 83800 93565 56335
15877 56335 3677 -97022 -114230 -25063 -43658 -71523 -40243 22343 32899 7222 -24092
15866 -24092 -51306 -66332 -91491 -90266 -6836 24700 15852 22501 25048 -55659 -50315 -104412 -176917
15853 -176917 -166927 -83930 -52283 -114050 -76237 -87070 -95001 -72425 -106478 -100537 -59064 -32681
15841 -32681 -68168 -83789 -18044 26266 -56789 -65185 -48885 -45562 -50947 -65858 -47506 70902
15829 70902 58861 -17606 -33250 7364 17420 -75773 -104889 -41210 -88117 -151587 -167865 -95454
15817 -95454 54558 31078 -42665 -66170 -85459 -67889 -13861 -33830 -64532 -2448 21099
15806 21099 -13614 -125504 -144560 -38024 -22093 857 42983 8679 -51566 -88969 -32755
15795 -32755 -12198 50529 24594 -32990 -22840 4079 -220 16087 26965 42049 22876 29330
15783 29330 68143 18325 47408 49044 48837 72347 49484 11895 -6969 -54001 -64660 -4711
15771 -4711 -91026 -119171 -174846 -118812 -127808 -100598 23456 23752 -81207 -128474 -66997 -101171
15759 -101171 -106153 -94767 -17540 -31321 -20044 -41724 -14878 9542 -45292 -149204 -194630
15748 -194630 -81908 15539 -48524 -68644 -44095 -27223 -35387 -14213 11345 38750 -69270
15737 -69270 -181525 -219657 -125509 12582 -18287 -99235 -156420 -127146 -32286 294 -41128
15726 -41128 -25000 11792 -34917 -33000 6796 67184 -21813 -59635 -31960 -9436 -36617 -66105
15714 -66105 -91922 -61388 19993 22589 -36852 -80514 -84866 -104463 -46368 78184 19473 -43306
15702 -43306 30071 42462 -5529 -851 62 16705 8520 -1641 23061 -36450 -6358 82765
15690 82765 -8346 -45039 76196 110602 92840 169564 175552 75008 61028 102677 145220
15679 145220 95815 11115 -19997 -46577 -103180 -82424 -97515 -140092 -180749 -171518 -133521 -114505
15667 -114505 -45968 -4025 25398 51311 27414 -19086 -52640 14639 8002 10432 -16725 33353
15655 33353 81436 20328 -52007 -23805 6837 -24017 -92471 -44683 -29491 36466 102357 90307
15643 90307 -46432 -16167 87145 117415 -16895 -71017 -52702 -23226 11289 -31373 -82399
15632 -82399 -113629 -69822 -34627 48688 43700 2885 -9649 -39634 -95649 -150963 -97886 9105
15620 9105 41344 -2088 -69028 -11315 100055 68020 7810 20540 944 23762 -61351 -59905
15608 -59905 -6881 -8266 33827 68534 104959 103529 36397 -3549 8087 51023 60639 57768
15596 57768 16898 9331 28085 93070 21064 -2239 36013 64224 -57204 -153956 -165183 -136004
15584 -136004 -55864 -76603 -128120 -177771 -161810 -100012 -80693 -40065 -49585 -57821 -57369 -37522
15572 -37522 -25115 27584 59523 53036 1341 15695 -14565 -20076 -9809 34239 25453 -41056
15560 -41056 -39862 -39461 73837 96616 45033 -46322 -66566 -18044 -40112 -60709 -12719 -3366
15548 -3366 -39767 -15642 49844 70116 73261 33474 -19099 -43197 38313 48337 -34067 -2002
15536 -2002 11152 31581 123351 60763 -17929 -26254 -6648 34662 46505 -34105 -65683 2271
15524 2271 -36327 -48480 -23113 37377 71312 109322 107929 133816 37068 -32006 -92843 808
15512 808 -49801 -131554 -51169 -13345 36668 36258 48129 4335 13610 -21495 -75575 -97516 -105782
15499 -105782 -106735 -81300 -46306 46463 31084 -3650 6545 40148 10195 40656 112999 104692
15487 104692 -9937 -17426 69885 -46272 -202819 -150574 -98933 -77846 -49949 -1333 750
15476 750 -20320 -83987 -79388 -65861 25367 43644 -24264 -83294 -37234 -4181 -44391 -73768
15464 -73768 -58086 -61681 -117063 -139745 -157013 -75833 62814 137603 117717 -14497 -127902
15453 -127902 -115398 -59199 43774 71029 -17711 -77640 16639 -18759 -74602 -107720 -94396
15442 -94396 -105418 -109932 -82418 -29854 28877 5608 -44344 -54831 4313 9653 -16243 -38451
15430 -38451 -8314 -66549 -83394 -40851 -8585 26097 8362 -13177 -14376 2257 -7628 -116865
15418 -116865 -149541 -146453 -158135 -186565 -127498 -35895 -39779 -42547 6224 -26754 6896 69934
15406 69934 62258 94358 120439 102766 132715 164586 165823 149614 158057 118754 112188 100867
15394 100867 91977 45180 5474 13710 -13419 -45227 -30816 -84838 -51705 -27485 3986 3831
15382 3831 -4650 -58001 -73958 -51783 -88031 -80357 -20679 -21010 -23364 -15629 -27749 -17378 -82335
15369 -82335 -132980 -91935 -46424 -14528 37116 70973 10245 45357 114384 128813 104266 17658
15357 17658 17657 6649 -28730 -50120 -83058 -57472 -44202 -79701 -43962 -72302 -39107 -64392
15345 -64392 -25033 -15610 -80972 -177804 -138809 -67738 -114993 -62877 -38455 -59917 -1655 20019
15333 20019 -23578 -49176 -62019 -42042 -82512 -82247 -6872 -64889 -38401 26163 3566 -37270
15321 -37270 -58833 -8618 -31708 -13773 -51625 -40046 -8794 50354 37174 -43104 -60772 -1626
15309 -1626 78362 74262 49945 121622 64527 -3314 -10582 74289 127810 53407 -40492 48451
15297 48451 17525 -35268 33779 162214 177599 118251 84741 70061 44352 20961 -22384
15286 -22384 -74824 28744 76211 10416 -90564 -127263 -101811 -99630 -43836 21466 57693
15275 57693 34160 58832 89304 104201 55593 -8741 30187 98802 28141 -12830 -78798 -87538
15263 -87538 -10136 48931 89316 57763 -10338 -80797 47650 134626 70199 18570 40236
15252 40236 74704 109920 96326 81694 97382 4223 -25825 41949 87829 74822 30518 15629
15240 15629 -70608 -89612 -27950 -29576 -5299 41951 63093 38612 18460 20192 47094 24214
15228 24214 3061 -34242 -103500 -40207 13611 -38025 -61435 -38455 19474 16415 -14957 -31656
15216 -31656 41519 40112 41093 159984 145044 97710 60583 67470 88442 63184 22446 8004
15204 8004 31085 14626 49781 93857 66146 88508 93157 -21834 -131566 -83428 -35534 879
15192 879 27793 7334 -67185 -107370 -31169 24996 27019 6966 75938 100091 171347 171696 101327
15179 101327 20894 -28290 -10840 62907 63555 -10525 -24816 -5079 -50293 -81166 -65906 -70646
15167 -70646 -54181 -9978 66033 58092 19553 33368 70568 -21216 -70033 4481 58395 37527
15155 37527 -20923 -71866 -151241 -125124 -47310 60659 137370 25041 17947 27026 12513 23727
15143 23727 -31822 -58247 -15877 11210 19983 47526 46269 17494 -32329 -12469 99017 125114
15131 125114 121007 86820 74345 64990 24937 30241 33335 4743 13658 -46516 -94870 -87427 -57844
15118 -57844 -6450 -22761 -25843 21648 5318 -73930 -30578 45178 76320 61098 52497 -37223
15106 -37223 -33516 32532 42917 128684 82630 46489 -13163 34417 63857 -21056 18156 39894
15094 39894 44440 74904 88533 67021 99097 139004 131326 84173 62024 7814 -16155 -18082
15082 -18082 -40553 -78352 -6194 -7522 -7732 10312 26046 -6318 20633 78674 21432 -14148
15070 -14148 29677 26946 66974 61343 55745 42303 65911 82848 31615 32028 83390 117667 153204
15057 153204 153660 88969 53807 5229 10755 23001 -126246 -139493 -111273 -55571 -14163 30675
15045 30675 8382 -25186 7443 223 2537 -3449 -44743 -30687 -38258 -55128 -37610 3918
15033 3918 5802 7308 18224 35327 108421 111123 124281 224874 212653 158931 131214 111260
15021 111260 46838 -19983 4924 -18350 -25783 8128 11364 -44656 -66248 -43185 7003 -27155
15009 -27155 -14885 12320 969 -29966 -71513 -122425 -121977 -53009 31988 96960 38789 63581
14997 63581 68161 80638 124119 183239 215651 112133 80492 146505 199788 176218 128894 143388
14985 143388 189730 112092 61637 59938 25401 6568 -10342 -48164 -102225 -140185 -102319 -3859
14973 -3859 35797 -26052 -18099 21129 57756 56235 94639 150870 152149 137839 105918 62385
14961 62385 63509 11546 2195 31947 -226 -9963 16479 24360 61005 19319 -9780 6351
14949 6351 71773 98175 98348 14645 22182 16609 -68386 -100168 -103657 -39501 -66974 -105329 -111536
14936 -111536 -6571 36805 1781 -52050 -59729 -78967 -89148 -88510 -56540 -40399 20720 78463
14924 78463 101570 118707 115340 50920 37168 22974 19545 14312 52257 23354 59119 34760
14912 34760 18807 -21370 -48363 -20938 -45570 -76681 -82714 -141702 -119420 -46146 34382 36534
14900 36534 -16698 -68564 -9995 33245 10559 -3172 14185 26088 9659 -35634 -49679 3823
14888 3823 9181 21024 -23852 -38194 -48098 -15396 -21978 -96977 -82808 -106839 -75235 -21961
14876 -21961 -3332 3517 7098 74839 97208 36671 10598 60305 9898 62856 145388 96719
14864 96719 68933 16296 -6828 33482 70194 86718 -1501 -46383 -78990 -111319 -85318 -94408
14852 -94408 -133610 -139471 -158446 -134511 -41332 67122 136931 140025 106396 89887 51102 38703
14840 38703 -89517 -103955 -91493 -32453 120072 89761 12515 -21976 47682 41557 -110927
14829 -110927 -67749 6449 -21977 18662 37513 -13156 -54985 -70104 -16885 66821 64084 12289
14817 12289 -18592 -9281 34719 32302 128028 71502 -9230 -50178 -53476 -14815 67118 145985
14805 145985 167785 188813 126921 70231 68675 -1358 -63127 -84488 -52226 -9181 -55856 -131665
14793 -131665 -117173 -147159 -79993 -42804 11727 34452 -20319 -60206 -103119 -129154 -113399
14782 -113399 10114 55575 -89210 -136247 -174649 -160358 -113724 -18734 11405 10915 506
14771 506 -39966 3031 50157 7802 -95538 -115697 -97293 -43497 -16319 19004 59102 39873
14759 39873 -3265 13301 48021 35109 1453 -23513 -54654 -82565 -78832 -39990 -31653 -36628
14747 -36628 -3728 9616 -30099 -36811 3361 12898 34212 84582 47958 -35937 -63203 -106763
14735 -106763 -97267 -93369 -37288 -2818 11366 62536 67697 54293 -91767 -100134 46157 137599
14723 137599 61416 58009 174128 213700 216916 152494 90525 65277 4015 -58908 -71146 10673
14711 10673 60681 -24748 -41838 2512 6156 43515 21264 31722 113772 98566 2942 -45822
14699 -45822 -43655 -14349 -44217 -29672 20349 41166 17228 4958 87823 78353 -6428 91945
14687 91945 113818 90751 114489 67798 7990 -36354 -73776 -72499 -99175 -127858 -101171 -73476
14675 -73476 -127325 -125432 33114 62855 25447 46790 63923 82714 51965 43736 25068 53760
14663 53760 56471 61050 89511 122437 24803 -35689 -116126 -143198 -56697 -6520 -19259 -33387
14651 -33387 -19573 23315 -26633 31802 65674 96089 136409 110910 96215 142932 126201 126696
14639 126696 113067 69818 -48586 -72194 -84285 -85129 -59523 -87315 -66514 -63576 -63322 -59382
14627 -59382 -74036 -9314 21060 -32401 -124460 -89323 102769 93787 25752 14398 4143 40946
14615 40946 90614 158231 121932 48177 -57278 -19902 59708 45928 -39764 21346 -2347
14604 -2347 -33838 -37311 -23118 -31221 -88648 -104544 -27118 22872 -33639 -54585 -40445 -95099
14592 -95099 -33046 5736 47285 -7822 -34275 17998 63379 65599 -14109 -90539 -73474 -138033
14580 -138033 -86146 23502 -8167 -64583 -10335 19644 42997 40938 50776 30210 -45780 -6184
14568 -6184 -29447 -26237 38821 82770 132278 118664 158406 142217 136703 103136 58977 -1322
14556 -1322 -62850 -59642 -9845 81413 123863 80501 51693 -16912 -17079 -3669 -58602 -3762
14544 -3762 88359 97957 20692 29830 -81447 -87407 -39305 23481 42029 17147 14638 22841 54782
14531 54782 44779 52948 28932 20122 -29154 50146 75181 10307 -17208 -55632 -47762 -5621
14519 -5621 24481 13168 81124 113401 63959 42124 6811 13718 12528 -10379 541 -16771
14507 -16771 -62550 -54725 -21381 39344 131681 120467 26198 -21134 6577 8712 -42030 -81410
14495 -81410 -28973 10479 31233 11410 18538 23444 6578 30966 1650 -8034 10597 42623
14483 42623 5672 -52736 -61042 -35778 5917 -34529 -96509 -55790 28700 43603 -23817 -175615
14471 -175615 -221987 -173877 -56862 -61908 -63299 52223 102322 53369 -64770 -74280 -98639
14460 -98639 -55366 -18391 -39680 -25236 39642 99170 38667 48708 126166 72101 -498 -51114
14448 -51114 -49390 12229 14578 31525 -29650 -90126 -61979 -45167 -97641 -22037 64620 34042
14436 34042 41889 34536 74029 76410 62558 58107 61888 51587 -24175 -88928 -102624 -766
14424 -766 66243 21048 6553 -4746 -108480 -136206 -68503 -54270 -46136 -18635 2382 56685
14412 56685 101983 98572 40407 40724 98556 99823 95478 198622 109635 63783 10787 40273
14400 40273 24865 28423 64232 -9109 -11699 62479 9486 -37459 -92939 -33239 12866 7255
14388 7255 29434 -3911 3437 -15152 -62795 3248 4078 36353 60236 -45111 -44049 -34048
14376 -34048 -57732 32501 149775 195244 228276 154623 125385 84759 94822 51275 58173 54666
14364 54666 63642 22825 -25316 5436 153991 90346 -36493 -39206 50265 70784 98629 74527
14352 74527 89810 29302 -28248 -66311 -15133 11565 -12505 -9549 -32590 -9208 14568 -65417
14340 -65417 -7092 -3844 -50493 -74575 -43065 -63881 -28149 37237 21827 52233 -6097 -81768
14328 -81768 -58141 -15129 -10793 -5440 -20934 -50363 -110324 -128463 -11809 19245 16436 92812
14316 92812 152180 123865 108832 185824 250604 245934 89072 -16385 30053 74725 148597
14305 148597 66905 40696 115375 152693 81423 -24110 -3669 38907 72612 17124 -5010
14294 -5010 639 -47769 -112990 -79132 -111219 -141645 -122612 -87989 -53070 -78090 -52680 -22325
14282 -22325 -40116 -113790 -62782 -20757 75275 151665 159605 138330 6592 -16515 11127 107516
14270 107516 154128 204463 177431 122582 75474 37300 -25217 -20883 -13363 -13728 -36147 -51711
14258 -51711 66732 109284 -736 22102 26685 -59773 -140569 -125243 -199256 -178100 -94355
14247 -94355 -26100 36189 103710 127643 64770 -59481 4480 142097 121569 83739 61618
14236 61618 70691 28848 -29484 -28069 -90550 -139899 -85871 -43618 -25460 2018 54855 72201
14224 72201 17735 -54845 17307 89511 138378 151971 153005 99761 92044 147580 120185 -10195
14212 -10195 -77499 -69438 -20476 46340 25957 -59867 -55669 -63485 -36040 -61961 -81284 -76527
14200 -76527 -22255 53391 49176 24118 113597 163122 68303 -51328 -64387 -24956 -31680 -43810
14188 -43810 -44667 -17264 34914 85863 -18597 -133896 -27541 44519 78842 47819 -12756
14177 -12756 -26338 -59557 -74390 9190 73329 80808 98442 92553 35605 -9344 -2483 48182
14165 48182 17397 30814 121769 85526 79490 89909 116924 177323 95776 121208 110892 59228
14153 59228 16667 -7352 76824 79328 45680 87526 -17158 -30935 -12999 -18926 5123 73850
14141 73850 85753 19630 -25046 184 77832 139328 112692 133699 114641 74468 16491 -28260
14129 -28260 -55391 25359 39276 100850 102544 89027 58716 43002 60350 41633 62536 64210
14117 64210 60617 123361 73610 10197 -12265 -90129 -39909 34527 154594 64274 19305 83742
14105 83742 120608 81441 58212 35712 -9220 -3356 32541 -6281 -79928 -85268 -42111 -25634
14093 -25634 -20466 28843 -16941 13909 60062 11231 -4263 12888 -52524 -2204 11572 44377
14081 44377 -66970 -69250 -42876 -47003 47141 72857 68456 59118 66245 79784 176760 164390
14069 164390 107193 101857 131864 169760 103291 70931 1244 -93132 -21794 30206 6302 3122
14057 3122 32112 181007 162055 40374 61175 69735 -4203 -1515 3714 76557 39725 66228
14045 66228 58219 -67858 -84023 -57519 -11647 14324 19004 40017 176930 200568 152598 145676
14033 145676 18990 -7438 6985 32426 37485 69911 75664 74099 91558 59832 14766 64217
14021 64217 49569 108046 148718 124704 99819 44744 -1117 21807 24897 73938 127280 76427
14009 76427 21105 41835 -1617 -121624 -171915 -15657 85853 46064 8441 45237 4351
13998 4351 -37226 35661 98154 119367 102024 31575 -2453 73147 112642 20454 -4413 42927
13986 42927 -2537 -93259 -40510 -43024 -30387 -40215 -27426 7214 -35923 -81260 -49427 23960
13974 23960 36949 61276 56102 165614 131777 144917 191909 211779 110419 37537 -8349
13963 -8349 -31834 -40501 -24141 62428 125616 16858 -16029 13506 55459 47689 60650 27999
13951 27999 -16022 -76176 -76145 -55245 -53503 88667 174811 88340 1018 58244 5151 11446
13939 11446 117503 54815 2413 47159 181496 152737 128274 154531 169290 150303 197132
13928 197132 215535 174157 133486 109913 99814 41338 -7000 -61114 -49036 -5503 12871
13917 12871 -11477 14984 -19007 -28315 59609 82433 109653 29453 30357 51799 64320 17587
13905 17587 9377 57858 70762 62965 90347 80551 79271 160194 179561 153570 81628 34663
13893 34663 12625 55496 41056 73074 52029 53316 36407 101733 186381 213821 160527 208652
13881 208652 208069 149548 110966 45698 12091 43251 101076 212440 228247 232263 188612 84582
13869 84582 51640 -19067 -81890 -13763 79580 92939 125168 29584 26355 42243 23679 55103
13857 55103 120125 173923 82496 29136 -3857 13026 36381 57312 16400 70326 143719 116859
13845 116859 87910 61806 21757 27578 91297 140239 169967 70816 -13473 25611 67399 103288
13833 103288 64583 92716 113008 113931 79112 25617 65325 127500 134451 72378 78449 27709
13821 27709 -78708 -167909 -121112 22308 129924 151832 143951 121922 98926 52669 48285
13810 48285 38082 62596 98581 107236 100587 156382 172701 128952 138964 75833 16613 42061
13798 42061 59188 -35991 26658 183377 284831 206560 105715 82235 108878 93746 138490
13787 138490 157053 150219 94610 79362 1838 -60276 -3425 72384 124983 157177 151540 113612
13775 113612 11437 -33857 -1617 30405 61802 136054 152046 101606 53933 136639 113126
13764 113126 59289 -29002 -102038 -19480 8553 12181 18593 12833 37584 81172 63437 144913
13752 144913 153290 58606 12614 1075 52223 69201 28502 37454 143467 134546 45642 90920
13740 90920 116420 83984 45924 88 31498 90811 101012 82115 70293 126072 120985 102045
13728 102045 98222 150565 76992 29948 36826 85140 107615 113568 163480 114534 72333 50544
13716 50544 44945 -21422 -82020 1528 116196 81538 109456 52445 33398 24081 24588 49410
13704 49410 75058 23720 -9685 86211 108535 142716 77413 30754 83591 142444 171674 161782
13692 161782 135866 156754 198190 163702 99114 29487 69009 66853 99910 141393 119650 69871
13680 69871 76837 46226 44237 61130 77811 34594 77555 80497 72770 -1200 25343 62067
13668 62067 89661 112461 149820 111423 59550 45965 27729 38966 100578 99569 25713 74507
13656 74507 172597 182996 143627 184774 295142 336160 318741 224652 105088 88231 141046
13645 141046 120776 115376 193312 217996 217149 237764 242209 182704 97174 88947 52428 86114
13633 86114 72101 123265 202025 225181 226236 118833 52437 73859 90829 82557 446 -15821
13621 -15821 25340 44027 -30787 -52970 1710 62563 134607 128215 75028 61046 42248 75313
13609 75313 85138 152260 234481 205723 143394 140670 59094 73162 120511 152768 95837 100351
13597 100351 37955 10115 27908 -80334 -46860 89291 98710 106034 128625 191310 187489 163857
13585 163857 216483 229409 207753 199638 141823 45337 6441 19190 26772 53315 128688 90570
13573 90570 155656 179612 145516 108251 91683 71160 78468 100159 202262 245156 199807 133747
13561 133747 111759 84125 54152 112873 212812 197231 176222 178470 164096 110098 76018 82941
13549 82941 129702 141278 51075 33045 47820 168246 187035 164092 171260 150265 166969 169282
13537 169282 93794 47502 3995 50477 105726 153990 112178 68750 50302 103808 172688
13526 172688 139342 125146 166056 230191 171096 137890 92271 62354 89119 103978 127291
13515 127291 209343 221916 226115 182921 102372 10994 56277 88377 117845 116767 109595 115054
13503 115054 179248 151124 205321 287925 374053 325681 238090 183690 165106 175824 209541
13492 209541 234981 231172 246645 281325 253084 215862 227889 280401 283918 277208 194520 74931
13480 74931 19700 78622 165131 207484 215632 178448 130099 149824 183115 156488 119810 164793
13468 164793 177157 155186 164895 211856 184276 154394 144326 72107 78028 124651 92005 123594
13456 123594 209069 251947 203312 189487 137842 105102 119816 120892 155480 131466 98300 147332
13444 147332 128534 157195 189711 101135 125035 221456 239239 199370 239854 275172 363283
13433 363283 355627 253608 204291 240008 251321 248962 267210 246059 213815 210619 188637 185320
13421 185320 208297 180719 93904 90676 119460 127038 124696 112082 69892 87128 135183 175669
13409 175669 180052 193795 196421 178484 217386 250010 237340 156818 83759 9523 -7969 -63533
13397 -63533 -52782 55185 120924 75419 42224 34491 72889 214943 329178 296881 248113
13386 248113 225890 243847 171148 128918 115299 125348 136882 134904 62337 133513 171623 197901
13374 197901 202004 140518 127197 175119 177030 215456 229423 233174 117743 105936 154868 114992
13362 114992 94479 132325 26413 49688 155679 264919 366917 372913 242687 175035 126495
13351 126495 116919 142144 161701 126879 157409 250282 297283 238856 126339 160343 183386
13340 183386 188690 188846 122118 111417 206421 214964 253575 295157 230373 133020 132172 114734 157072
13327 157072 217304 290862 305033 273624 273483 362419 284206 178169 151557 153108 202865 288529
13315 288529 361273 304333 265510 242192 221394 137526 181488 275088 279025 201002 178935 253578
13303 253578 237807 148006 190920 180631 164076 153922 119913 58432 113891 147896 160865
13292 160865 167440 136656 101618 87152 136819 180337 198790 187559 150916 177399 239064 242447
13280 242447 216224 241339 252981 149722 145150 172393 135775 192202 255091 304939 270309
13269 270309 215323 220508 230138 178196 211134 193614 205371 166339 161780 187848 269816 300684
13257 300684 359117 296268 242890 246404 260099 254667 192957 222179 267330 233951 232214 191892
13245 191892 177182 173550 199298 247482 326569 357759 329326 260385 243583 220052 247159 221229
13233 221229 164567 195062 186196 171527 154857 158993 186303 177003 151700 177024 153260 134040
13221 134040 149151 171998 299676 331052 268946 204103 242141 275278 287554 291224 256115
13210 256115 247637 200980 181144 153899 157628 149403 161025 146785 185882 209466 185913 243782
13198 243782 225801 210946 245135 234222 211031 258861 317559 239912 216798 190568 226579
13187 226579 279055 239446 275070 323121 355362 395055 434033 393465 360505 337563 309759
13176 309759 191630 233466 269582 235798 208623 257498 240882 153399 163335 150653 220405
13165 220405 236624 255471 249640 202313 209305 286326 342249 305430 221987 365010 443580 402898
13153 402898 240946 180190 288239 291716 278513 303315 292764 303497 325089 292750 346650
13142 346650 343148 307366 239183 151956 86431 127104 196704 291675 375340 416698 446494 441962
13130 441962 436503 453438 513966 472869 530190 531141 514912 559670 713136 875865 1062979
13119 1062979 1227024 1414874 1680024 1992238 2263274 2536288 2691117 2720207 2730844 2507325
13109 2507325 2207520 1952894 1679128 1404254 1250429 1108168 1052835 963212 967585 954516
13099 954516 932875 830638 709926 732200 815529 859098 832325 859612 812994 735523 675722
13088 675722 636485 652718 750940 735901 729859 719800 727856 723989 700420 635795 618303 702875
13076 702875 734399 722503 704585 637672 650698 698363 676956 624389 624492 550636 531368 462489
13064 462489 376213 423169 447081 483536 447427 420720 457793 575990 602097 635340 657646
13053 657646 615220 564103 591779 547716 530733 502987 429523 482105 497776 528234 535613 454827
13041 454827 490119 539482 627461 548702 442799 432173 466020 402265 419650 431563 472783
13030 472783 439301 415084 412238 420465 481740 464816 398969 385417 474940 467982 417601 412352
13018 412352 448709 466205 503475 452331 376447 415299 475891 458619 457432 415191 400760 455062
13006 455062 406947 378001 379312 461812 486653 445995 381138 362184 417406 394674 438009 461267
12994 461267 410576 465984 518247 517509 519947 495030 471809 477614 486261 439307 419701 388380
12982 388380 348480 393856 429607 421401 435575 431839 417925 372664 281741 279267 212557 205596
12970 205596 250217 267033 235121 244495 337869 379695 378081 388287 437412 543741 495916 455528
12958 455528 505540 456340 382170 353056 381144 401625 379983 426769 436131 407857 365215 393269
12946 393269 483035 490746 559161 599512 610003 597310 532389 540049 610713 592645 500459 531433
12934 531433 594248 605381 697665 831140 957506 1013847 1108339 1242409 1310764 1329495 1387387
12923 1387387 1422504 1376395 1281738 1267898 1208187 1045514 1019853 1039418 997338 824823 741876
12912 741876 749975 738079 690547 719081 709777 680357 628430 611401 617647 706326 663672 605081
12900 605081 519608 384286 415821 448147 435052 384793 385991 464430 496464 514437 497748
12889 497748 486076 513604 465944 474420 415549 394675 383565 334815 338343 400831 459814 505368
12877 505368 536232 573727 574673 506221 525446 565751 561557 584842 642558 644625 636930 615701
12865 615701 575097 579576 557393 511340 477460 485471 460840 426219 534513 550464 497173 484029
12853 484029 488020 542610 508289 544432 553616 560477 522705 490628 572917 554619 476386 441431
12841 441431 403585 456515 470495 431419 433029 490134 429507 421800 457742 377584 386539 437528
12829 437528 462196 491275 500255 431596 398739 383684 395449 358745 316758 317573 320797 389435
12817 389435 390287 404366 484130 505006 518528 546220 575517 620581 669143 700024 708932 745715
12805 745715 816585 873982 893292 967457 1030497 1112524 1122986 1043166 1001629 1005025 935100 910298
12793 910298 893824 820212 752189 758818 698831 684527 792133 877495 945396 1069704 1128778
12782 1128778 1210903 1250780 1189899 1126529 1102944 1106488 1161956 1186200 1214412 1282421 1303893
12771 1303893 1272502 1209790 1209457 1276026 1358617 1442977 1461664 1578638 1671475 1792271 1852543
12760 1852543 1919086 2019877 2013753 2023925 2055347 2050627 2100868 2175706 2247247 2285705 2328113
12749 2328113 2458659 2565872 2662791 2720007 2762994 2788785 2805683 2849112 2925118 2956675 3114193
12738 3114193 3267777 3390637 3468277 3601925 3746481 3773404 3811511 3853646 3984592 3977105
12728 3977105 3899951 3861666 3789163 3783096 3784436 3777617 3821240 3869164 3973772 3975716 3986092 4054096
12716 4054096 4074390 4074534 4097262 4109036 4186602 4300412 4337368 4449692 4621678 4806095 4996430
12705 4996430 5133047 5278918 5415665 5595452 5796725 6037961 6299477 6589134 6895786
12696 6895786 7265757 7730649 8251125 8908310 9593172 10451535 11412891 12483340 13686469
12687 13686469 15111608 16890971 18966515 21534746 24815312 28791863 33762953 40056037
12679 40056037 48258350 59212048 73820891 93552282 120280218 156674840 205798843
12672 205798843 268941529 342018370 413870240 463782516 480297607 477790115 461678276
12665 461678276 417688334 351873994 290229496 243621062 209708558 184602459 165335280
12658 165335280 149750808 137001693 126480084 117695742 110089488 103518799 97838204
12651 97838204 92811656 88514086 84866436 81679439 78896208 76519732 74422173 72620136
12643 72620136 71165425 69957674 69006860 68568640 68482677 68529247 68689736 68843056 68709646
12634 68709646 68111889 67067705 65305299 63044392 60408312 57427514 54385293 51408391
12626 51408391 48584870 45889878 43348815 40900724 38657769 36536718 34560671 32725658
12618 32725658 31014533 29404678 27829829 26342580 24994132 23701848 22465785 21379459
12610 21379459 20382806 19365233 18420734 17551079 16780310 15955692 15174482 14501217 13934503
12601 13934503 13374125 12806860 12186390 11692547 11134964 10596516 10076275 9679724 9237446
12592 9237446 8852799 8490972 8125696 7792955 7472548 7251762 6971723 6672836 6405288
12583 6405288 6227096 6071847 5790762 5501361 5329916 5176240 4946888 4779782 4603271
12574 4603271 4491100 4334838 4126369 4012187 3814542 3722731 3693945 3686813 3606509 3445102
12564 3445102 3235488 2993934 2878433 2885571 2844818 2750553 2700948 2726468 2647347 2634615 2634211
12553 2634211 2612950 2676264 2701555 2778231 2820352 2867089 2911225 3065456 3254514 3409230 3480261
12542 3480261 3528363 3421481 3345442 3116663 2876940 2673739 2494591 2390825 2362707 2328612
12532 2328612 2283064 2228446 2186769 2146458 2080517 2019320 1908641 1866728 1833902 1866984 1867302
12521 1867302 1768865 1754792 1790942 1906731 1937934 1956240 1960287 2050455 2030376 2111874 2289010
12510 2289010 2303878 2321615 2287747 2356652 2457566 2550351 2612961 2625189 2653652 2716772 2794278
12499 2794278 2863443 2848347 2798387 2800198 2779021 2683117 2631310 2676227 2676969 2627380 2705601 2815472
12487 2815472 2812333 2829364 2895685 2950389 2931287 2903021 2883303 2892203 2924513 2884186 2867349 2861285
12475 2861285 2695985 2592262 2572255 2579502 2560342 2590853 2587964 2477290 2457972 2492482 2372716
12464 2372716 2322539 2260315 2270007 2289319 2291675 2408340 2528281 2560540 2509987 2526182 2519364
12453 2519364 2444588 2397962 2367109 2348193 2355332 2312744 2215378 2240933 2304104 2276220 2250729
12442 2250729 2267968 2357058 2449250 2474164 2482928 2611478 2791793 2931952 3192148 3493294
12432 3493294 4009524 4685207 5495939 6144092 6563420 6666377 6413334 5893368 5243180
12423 5243180 4674326 4290171 3931053 3598656 3415662 3288459 3180909 3055060 2958670 2906162
12413 2906162 2829795 2759810 2697020 2702054 2703701 2691309 2631732 2566828 2495150 2383449 2329376
12402 2329376 2291087 2286211 2311669 2311259 2259922 2198041 2136417 2125602 2050661 2033322 2107634 2187851
12390 2187851 2170881 2082276 2017724 1944916 1979012 1963109 1973421 1985242 1854526 1823684 1791459
12379 1791459 1730406 1762904 1784990 1766627 1770253 1766804 1795920 1818765 1827441 1805183 1841206 1835468
12367 1835468 1808961 1828925 1844252 1790013 1851425 1840798 1883367 1930842 1873008 1842688 1842822 1803352
12355 1803352 1775898 1819424 1867709 1830238 1795350 1812261 1794780 1767867 1860101 1865457 1835075
12344 1835075 1898175 1938179 1959741 1948329 1879766 1888490 1966066 1943295 1896500 1862605 1824886
12333 1824886 1859181 1840090 1866250 1872351 1953894 1992594 1937000 1922108 1949970 1980901 1889498
12322 1889498 1764051 1776681 1818384 1816301 1803223 1781885 1785720 1807889 1857612 1873868 1927426
12311 1927426 1953152 1916064 1879442 1844435 1898643 1889474 1840840 1834932 1839456 1847012 1842199 1817642
12299 1817642 1770256 1898944 1960115 1936987 1949162 1904990 1866868 1927190 1933904 1928761 1891497
12288 1891497 1803932 1835181 1895415 1834404 1716745 1708230 1741270 1802235 1815039 1763750 1715827
12277 1715827 1699159 1673698 1659931 1745537 1813730 1832296 1914509 1929731 1873038 1867722 1856569
12266 1856569 1818229 1825537 1889357 1876798 1788536 1853860 1928050 1854124 1836107 1898594 1868808
12255 1868808 1872346 1901610 1981025 1986640 1950460 1892396 1880770 1887050 1940511 1924754 1902305 1901007
12243 1901007 1977825 2067979 2055711 1974344 1964970 1993450 2006331 1965080 2044243 2041534 1956623 1996410
12231 1996410 2064965 2127657 2224508 2259963 2241844 2309704 2513083 2694590 2877478 2962335 3192365
12220 3192365 3544723 3974609 4303542 4521796 4627674 4592619 4480350 4347765 4066729 3767432
12210 3767432 3503566 3358148 3151478 3000827 3013485 3042554 2891359 2774706 2752327 2698654
12200 2698654 2758316 2730843 2626995 2641027 2687508 2667264 2711369 2685218 2620585 2626104 2657621
12189 2657621 2715878 2746224 2714451 2649832 2592968 2587953 2675130 2767437 2784724 2714029 2649849
12178 2649849 2630366 2649830 2578407 2559071 2549844 2569738 2545740 2493778 2499121 2475021 2466977 2384831
12166 2384831 2368694 2414690 2487265 2509855 2476470 2491449 2528836 2526404 2514488 2469724 2444999
12155 2444999 2516889 2586445 2611656 2590054 2481611 2375769 2405642 2499383 2538627 2578609 2622472
12144 2622472 2648290 2586779 2600977 2524028 2475274 2409245 2420303 2410819 2402891 2374526 2401001 2460583
12132 2460583 2450201 2379758 2388814 2552635 2529833 2525347 2534442 2513365 2587613 2673924 2656200 2621555
12120 2621555 2647677 2657757 2649202 2616238 2665758 2745058 2735991 2595139 2588951 2644378 2670671 2733854
12108 2733854 2758012 2676515 2653531 2731098 2829855 2823512 2733299 2720761 2790150 2796239 2870802 2776005
12096 2776005 2683588 2633675 2628898 2718941 2759286 2748198 2774825 2841381 2867360 2818694 2831792
12085 2831792 2760143 2761774 2786740 2815176 2821623 2809462 2822863 2831220 2811632 2852245 2935262 3012071
12073 3012071 2998372 3041717 3064769 3016176 3048505 3047132 3010376 2928820 2879892 2923599 2960237
12062 2960237 3026578 3013537 2951761 2970056 3038518 3046284 3094170 3115019 3174843 3204247 3139126
12051 3139126 3099630 3033785 3035421 3050753 3056403 3123801 3093903 3064439 3057824 3021292 3106359 3206748
12039 3206748 3193506 3218723 3194962 3140040 3083137 3036234 2985502 2985983 2991356 3069359 3058980 3042129
12027 3042129 3083481 3042888 2984042 3001015 2951916 2997683 3017466 3005874 3001046 2993154 3006352 3049618
12015 3049618 3196322 3205299 3184236 3198814 3186550 3167874 3123378 3138536 3183648 3183319 3144538 3146873
12003 3146873 3072304 3049416 3103553 3185679 3171135 3143940 3122275 3161929 3188123 3233314 3233867 3176982
11991 3176982 3222787 3158431 3125848 3156993 3157096 3165363 3152667 3127081 3153583 3237936 3315940 3391995
11979 3391995 3365846 3257768 3225913 3267476 3316713 3305585 3204720 3158494 3186659 3292811 3331094
11968 3331094 3277968 3267885 3300631 3345124 3377591 3365510 3322722 3325516 3371528 3372993 3329814 3303070
11956 3303070 3301336 3256732 3207909 3165247 3211789 3268206 3344307 3355130 3357417 3376691 3315141 3321676
11944 3321676 3330630 3277985 3222860 3211031 3278807 3299511 3333986 3365850 3233333 3227474 3322568
11933 3322568 3403370 3341720 3278305 3333408 3365033 3289027 3277288 3384051 3379391 3255041 3206002
11922 3206002 3205645 3219500 3272759 3283503 3306231 3246767 3175701 3210965 3239550 3194361 3194566 3265761
11910 3265761 3299636 3315942 3279915 3258551 3236041 3226734 3212145 3209893 3219336 3239321 3210005 3325241
11898 3325241 3373792 3419281 3362071 3364393 3314262 3303166 3340596 3354069 3271760 3254422 3284113
11887 3284113 3301578 3344310 3378139 3356302 3315212 3392104 3374448 3275389 3278337 3261265 3136928
11876 3136928 3170835 3259018 3247686 3200219 3118559 3146550 3158829 3156286 3158189 3079152 3104395 3187192
11864 3187192 3261081 3210208 3123389 3080953 3055989 3065955 3062841 3086529 3166282 3109884 3035254 3073564
11852 3073564 3050363 3044167 3071273 3099505 3086456 3016953 2999432 2980290 2975544 3040338 3103322 3074065
11840 3074065 3041669 3003135 2893486 2946092 3003067 3043794 3023538 3055167 3060288 3007313 2980072
11829 2980072 3046084 3073422 3012090 3109527 3047353 2956326 2923262 2976046 2998481 3031029 3078990
11818 3078990 3063215 3008159 2969669 2953303 2910401 2796928 2809983 2904101 2846997 2791636 2794528
11807 2794528 2827228 2863134 2837569 2837347 2823891 2821147 2846839 2850002 2897990 2894757 2926388 2917298
11795 2917298 2912339 2916315 2888667 2812876 2746636 2724044 2745082 2735086 2705383 2757553 2746168 2724084
11783 2724084 2721977 2685526 2704576 2813217 2849837 2742638 2755877 2793929 2767251 2645301 2634015
11772 2634015 2693246 2644555 2594554 2638266 2581513 2469343 2515744 2652753 2660786 2634520 2610466
11761 2610466 2668195 2676805 2625538 2664222 2652209 2602024 2653129 2643851 2674849 2689955 2680830 2708522
11749 2708522 2593690 2509042 2474203 2498117 2488208 2486355 2420846 2421471 2492089 2535550 2532053 2457019
11737 2457019 2409801 2397095 2408753 2527889 2495856 2442435 2375932 2366922 2411872 2472747 2456514
11726 2456514 2432618 2462270 2445822 2425305 2398125 2314343 2245582 2144475 2162733 2255063 2353699
11715 2353699 2364278 2362111 2385428 2413404 2467252 2423860 2352734 2306735 2306849 2303745 2286254 2215203
11703 2215203 2155187 2162029 2171786 2085811 2084469 2148646 2150409 2144218 2108493 2122241 2113617 2112093 2095410
11690 2095410 2199158 2173278 2130711 2172851 2204791 2152796 2120687 2115174 2094819 2071815 2064277
11679 2064277 2050336 2095675 2048218 1971704 1988363 2119215 2143831 2215355 2269486 2190232 2108310
11668 2108310 2054003 2074350 2138536 2085239 2093708 2099244 2083418 2045641 1977419 1946224 1977257 1931262
11656 1931262 1880267 1871132 1878807 1893504 1909027 1858472 1843740 1863254 1831323 1793455 1816054 1849821
11644 1849821 1879214 1854715 1851252 1898205 1873453 1851042 1775981 1779061 1819241 1863535 1869836 1814172
11632 1814172 1795543 1833725 1817068 1774372 1789576 1831293 1846455 1788390 1778593 1800980 1747545
11621 1747545 1752428 1738968 1791550 1863235 1923718 1872955 1886103 1896163 1798377 1784242 1685991
11610 1685991 1690066 1714861 1710591 1743832 1760485 1686280 1595970 1611584 1667818 1587706 1622608 1694203
11598 1694203 1691345 1703898 1779643 1783898 1736677 1669258 1688657 1743203 1695330 1679576 1729488 1728485
11586 1728485 1652654 1590200 1591920 1685882 1720441 1663896 1552168 1541401 1567139 1580396 1553501
11575 1553501 1538660 1596993 1584294 1550175 1523982 1566346 1534717 1519488 1498607 1463483 1488428
11564 1488428 1534162 1558254 1492791 1433233 1444612 1470486 1440277 1383532 1497530 1610199 1619842
11553 1619842 1577343 1528321 1484626 1457634 1503719 1440185 1424913 1417262 1319618 1295567 1305873
11542 1305873 1349225 1366618 1376706 1383228 1370749 1333220 1376561 1438905 1479723 1510456 1479011
11531 1479011 1384037 1292303 1244308 1260311 1312365 1369906 1403133 1413645 1423547 1384563 1291878
11520 1291878 1302029 1326205 1354185 1307628 1306968 1352454 1363822 1240283 1226649 1252740 1318877
11509 1318877 1327593 1313150 1261443 1216170 1202973 1318804 1329000 1246078 1263766 1277741 1264354
11498 1264354 1319516 1411163 1326021 1224371 1193987 1161206 1175435 1212194 1199063 1163761 1184139
11487 1184139 1139121 1145935 1108590 1103477 1153871 1132480 1150304 1149280 1173543 1199129 1187963 1205519
11475 1205519 1176660 1106092 1114811 1170821 1182143 1133677 1135634 1205890 1267317 1235410 1241594 1195275
11463 1195275 1164889 1161890 1125106 1103342 1072961 1063969 994504 961046 1053278 1030304 985034 1059047
11451 1059047 1049500 1055442 1033910 1019892 1069947 1157659 1140366 1133764 1132306 1032130 1001874 1010507
11439 1010507 1114377 1148307 1134187 1140809 1133265 1138689 1170921 1145753 1137995 1161655 1085139 1070981
11427 1070981 1024443 979709 1026966 1038886 1041313 1023297 978702 950719 956133 1014533 1008067 911884
11415 911884 849712 821092 860046 945011 947378 938173 973736 967730 904187 869460 921209 1005085
11403 1005085 1014593 1011243 1000845 904640 910868 936489 906345 815051 822131 898430 911111 967346
11391 967346 884133 856600 868972 890097 893472 886900 912031 1027033 1039708 958111 903024 826996
11379 826996 822541 946586 941410 901943 917784 877304 893386 903721 927647 956668 916160 924302
11367 924302 890101 807759 785797 761076 788843 814296 833469 863806 807203 862104 892318
11356 892318 866320 816616 806255 928259 962667 949693 891374 837868 791563 754787 803714
11345 803714 847594 898046 889477 876294 788397 836408 879405 891416 822201 769569 715653 755397
11333 755397 776266 820665 775276 784939 864068 866397 756440 731714 629926 627392 726722 754343
11321 754343 758461 740888 689720 735427 674936 680782 772630 735640 734359 749361 718897 738610
11309 738610 820217 893873 905129 848797 836191 843152 792237 727180 702284 766293 766628 793303
11297 793303 747232 741365 771209 714039 714921 687201 677874 717152 716402 722621 806213 752910 684942
11284 684942 594030 502690 534186 646760 731116 690386 624540 744000 742822 764107 685936
11273 685936 640730 645181 668546 677161 592710 600189 654575 678333 669453 679389 554362 518204
11261 518204 605308 644994 627547 625164 627956 625005 625624 541807 537673 588047 602241 585263 571558
11248 571558 626801 626719 573706 596373 553786 532003 520046 478394 540911 532539 535001 565412
11236 565412 541598 522866 525960 537515 506527 528038 489417 516226 677973 740121 627194
11225 627194 550740 508221 401960 352812 406097 529121 596489 618363 709584 698965 617011
11214 617011 545036 524887 478772 399051 439627 522693 548013 486054 476228 484557 492627 495135
11202 495135 501658 507403 515383 468044 527936 570388 592045 566002 614204 569310 572435 619248
11190 619248 570559 550783 556179 510668 433489 398860 398324 387721 368203 505576 535715 476331
11178 476331 475818 482044 483114 476767 487161 473326 500929 506406 373845 400646 422597 424816 447507
11165 447507 544976 468886 366958 463037 507964 474157 433805 477033 486116 415681 458827
11154 458827 429316 454283 513784 531037 555753 566778 503086 405139 436700 503485 473169
11143 473169 449508 449562 441719 436211 478559 470278 442135 398584 435103 482414 439239 417008 393239
11130 393239 350426 311193 346783 427421 379411 336025 352753 317754 313124 402618 507823
11119 507823 565089 535223 428248 399468 423067 417804 433555 448743 464435 448966 400764
11108 400764 468307 503360 449368 459277 442366 408911 404310 384547 439731 438825 423982 364097
11096 364097 365483 378364 354827 292495 279384 369353 389249 336554 318029 262855 296715 287218
11084 287218 250895 219341 301796 383766 447073 470165 478841 436614 401004 374286 351415 350440
11072 350440 377421 372438 437602 533566 472954 309189 329418 363229 313593 282801 357252
11061 357252 349170 411304 444523 505806 447347 404906 399566 419415 465158 436748 420805 386341
11049 386341 224483 247821 353377 420470 500000 458600 412129 479386 592144 572482 551543
11038 551543 605401 604780 640093 673269 660549 690651 664918 536247 494098 566916 615369 597290
11026 597290 644681 674632 759733 831111 799446 792279 764110 741886 724761 708696 748693 761038
11014 761038 725406 684898 676619 696628 671698 708426 735141 721779 724728 699560 619816 591850
11002 591850 663809 688207 719581 807501 721578 630609 598779 571416 606623 537398 561626
10991 561626 633806 630372 629065 517157 459804 448214 446337 403509 351478 359400 437415 528066
10979 528066 544885 452454 399793 412506 413177 451512 436288 399190 348957 266766 201350 279232
10967 279232 353442 342799 359760 366967 436239 368348 374708 428744 461166 477855 510258 494114
10955 494114 493120 464646 389591 359264 399265 432519 429205 442239 437561 329486 347414 370968
10943 370968 330324 255389 263877 312744 268554 250041 350266 337048 273164 268396 323862 384926
10931 384926 410523 356099 291016 242131 226572 285910 298138 286078 276555 306161 295948 272970
10919 272970 310136 316935 287606 298348 291540 289390 253112 124360 152083 219260 213004 194095
10907 194095 187349 246758 180992 240807 301106 311833 275261 218581 190207 103778 102578 162492
10895 162492 253206 283047 233378 230431 254401 236431 183735 175032 114724 191336 281776 240031
10883 240031 205316 83149 94023 250608 326134 299644 340781 347212 282898 226141 255100
10872 255100 320759 322570 346318 330613 290433 319692 356615 367283 348606 352864 410185 423182
10860 423182 412193 374134 392863 375464 382007 412574 382162 367009 383073 379749 353072 341318
10848 341318 446265 521366 530905 530355 548264 564187 515533 411468 344647 314166 345057 363443
10836 363443 372733 342636 327450 321292 349957 354579 342639 320237 273756 285434 287567 216363
10824 216363 166234 220252 265991 276846 261422 308645 332154 341028 253789 202470 232961 334379
10812 334379 376115 347011 250391 178107 166145 152669 210586 274923 327963 365627 403142
10801 403142 411675 354975 402733 396717 409594 384555 336182 297407 311501 281021 342189 328209
10789 328209 289208 201408 173291 257273 318248 321297 174885 146871 148843 209819 243933 226333
10777 226333 204007 172570 269169 238595 182240 243450 205774 172066 193582 171664 99155
10766 99155 122739 191264 271815 319939 322238 321268 275305 200340 131876 130019 65863 37227
10754 37227 104364 143571 32431 -33776 50774 76814 143525 225964 226654 186760 146972 168299
10742 168299 155696 203674 273036 315829 295019 225744 228189 319701 431869 400852 362326
10731 362326 395392 341267 318357 294914 339802 324603 296388 243076 261075 372417 394401
10720 394401 241918 170320 170375 242136 307658 332259 294910 237722 225619 276123 287926 225238
10708 225238 275102 260516 206515 202159 205734 306832 408552 392314 346585 345497 381596 373234
10696 373234 366356 351280 333643 334082 309018 329953 428538 491402 536166 525941 463275 477376
10684 477376 450367 446768 568667 623420 608679 593694 512490 505280 626207 726877 703738
10673 703738 657505 665370 599779 658739 745342 784436 775861 816909 839499 864928 834629 843349
10661 843349 874119 884582 913723 956302 967846 999263 1064500 1100319 1154662 1219709 1121777
10650 1121777 1114153 1140688 1116422 1134497 1154007 1152145 1233465 1243560 1276734 1262544 1377359
10639 1377359 1427113 1439413 1559304 1709331 1790500 1937071 2060176 2231022 2392056 2550818
10629 2550818 2756216 3094203 3522102 3978156 4528247 5327955 6297487 7586943 9306897
10620 9306897 11496074 14131421 17144225 20470848 23687631 26132727 27508321 27981907
10612 27981907 28136049 28573525 29762187 31997393 35381833 39987479 45780202 52173465
10604 52173465 57910360 61639515 62442127 60930222 58746251 57278510 57287166 59070849 62746600
10595 62746600 68269473 75274584 82625974 88656895 91273097 89403405 84231945 78333479
10587 78333479 73321388 69914059 68453056 68891960 70862550 73755731 76893831 78904039
10579 78904039 78482669 75120559 69847927 64390369 59845027 56483797 54314690 53193566
10571 53193566 52781747 52815955 52795270 52335043 50815180 48120596 44757520 41320867 38133908
10562 38133908 35466635 33395163 31677822 30160630 28872105 27753068 26732813 25673400
10554 25673400 24677024 23703529 22677493 21832413 20997168 20194171 19541394 18952581 18293938
10545 18293938 17673990 17086054 16401918 15728904 15032849 14335945 13715250 13103883 12568866
10536 12568866 12046270 11493180 11043762 10633482 10166914 9686851 9214256 8725512 8291551
10527 8291551 7905906 7561188 7263224 6981838 6673246 6326846 5883740 5557685 5272348
10518 5272348 5072139 4879834 4647229 4413267 4217414 4051951 3948805 3725775 3500719
10509 3500719 3341347 3168322 3097335 2947782 2877953 2706592 2485000 2346831 2284397 2197672
10499 2197672 2069850 2085470 2103611 2001547 1896235 1814330 1727011 1646090 1677315 1666985 1647448
10488 1647448 1591701 1454761 1339026 1292040 1260030 1209078 1122813 1132910 1213139 1227772 1235096
10477 1235096 1262215 1283528 1225036 1135043 1069276 1102347 1109520 1103973 1078972 1028189 1015704 1014477
10465 1014477 953170 956925 871720 797205 804573 816257 919075 997863 1007506 978050 923650 950566
10453 950566 988739 1095819 1078575 1125056 1291228 1548060 1778133 2113264 2584745 3183154
10443 3183154 3698318 3839301 3487442 2931911 2407010 2063806 1874697 1826882 1777825 1640178
10433 1640178 1513240 1458368 1379755 1317470 1305051 1296938 1271379 1281372 1382007 1341411 1212318
10422 1212318 1177347 1210437 1251171 1281712 1250892 1322604 1342527 1307990 1301384 1288787 1267391
10411 1267391 1315089 1304112 1245328 1166076 1143682 1121853 1063524 1159862 1172507 1149457 1052811
10400 1052811 1035883 1121340 1044256 1011209 1003905 952557 887182 1036733 1050159 1042466 1122708
10389 1122708 1159905 1095128 1054563 1009163 940644 959806 1009017 989797 1032172 925939 815456
10378 815456 779279 762645 813869 825582 750664 724644 749020 779546 677337 630462 681759
10367 681759 735837 619386 613352 706319 794467 769189 664887 591192 625729 658029 690046
10356 690046 748341 720728 612951 526039 496716 546960 595214 616424 638971 590275 539246
10345 539246 489084 502387 615594 640365 575994 608544 529533 505627 559405 592755 544427
10334 544427 491515 519391 466926 507971 592631 666662 668026 640712 706728 803724 873674 938193
10322 938193 1055014 1253306 1513272 1718145 1760865 1676620 1531089 1323248 1122578 949371
10312 949371 895575 902277 849482 921207 983223 1099476 1183968 1289083 1443946 1539893 1409099
10301 1409099 1281384 1088981 917024 897491 813872 757635 859379 855656 873652 906914 798096
10290 798096 710779 707769 766439 787225 679259 563998 405596 439414 398091 374576 373870
10279 373870 387137 365691 430495 450112 496382 487187 497191 612678 586019 545832 551586 591552
10267 591552 685133 776877 806588 648039 595239 585103 547752 601349 602583 637060 649287
10256 649287 576180 502471 536639 567155 567695 576825 517939 433700 508930 502049 488982 461477
10244 461477 416879 354268 309259 342042 354950 359028 296274 298269 298479 302919 332162 420827
10232 420827 412083 319360 272430 327801 377144 339507 319181 332196 249742 242231 251949 222603
10220 222603 240879 258804 218944 141965 196347 264561 384419 413437 392846 428252 397714
10209 397714 411861 433012 413230 385342 413114 371109 264400 161290 155765 209083 243688
10198 243688 280253 284245 304715 334729 249004 210989 250113 293454 322441 282289 248431 255576
10186 255576 302937 300652 304074 318581 391390 434582 454775 536120 483726 374442 367070 407831
10174 407831 481574 500872 531381 567476 488998 518505 577026 585998 556558 542197 469977 401508
10162 401508 449319 527798 582073 557469 622131 634161 676059 701564 694868 674706 692378 642222
10150 642222 619016 471609 474493 551162 560984 667432 798280 816023 790381 715346 758442
10139 758442 749832 658423 664038 722939 725699 687107 683972 672018 720833 732205 635600 533564
10127 533564 524990 503797 441146 446911 477781 431785 415480 336367 369276 389060 345302 365039
10115 365039 388510 390844 351634 291690 237397 201554 245010 245474 262118 284904 296909 290161
10103 290161 288861 235965 276000 315611 340294 384411 392469 392317 323195 233533 146304 87365
10091 87365 155334 235753 338873 372260 375410 350560 313506 297495 278745 290320 216752 217666
10079 217666 239791 311419 395602 414933 429669 406988 328734 264050 299808 249867 269061
10068 269061 268234 200463 244456 311354 299284 305519 313602 296982 328158 391257 460354 422670
10056 422670 323963 268472 257591 205130 123031 95241 114499 167006 232545 265142 231549
10045 231549 268436 192961 113286 128058 74049 120800 187844 207556 233860 281915 342610
10034 342610 334720 383873 355500 270653 283267 286657 233383 189330 174195 153913 222567 224828
10022 224828 172859 115367 168066 161267 225434 186865 192124 264165 231310 151520 181440 256786
10010 256786 303225 270211 244196 253438 268430 314980 281571 245977 245585 261289 215547 209419
9998 209419 200156 241794 232743 225019 208805 194668 237087 220338 206711 223592 307220 306690 310942
9985 310942 217710 228551 266493 229252 185859 235698 237103 273315 333296 311384 281136 280942
9973 280942 261203 161064 54639 136357 228878 233226 227946 183327 140956 39625 39363 62218
9961 62218 107882 62626 165563 193236 137076 212003 259171 323769 315970 182165 182004 222438
9949 222438 188381 164362 145820 183168 201385 216718 280478 274155 257536 254440 286519 240020
9937 240020 221348 294495 383272 503432 732270 1098440 1401734 1776647 1849674 1538039
9927 1538039 1088814 796659 632109 597676 504749 375363 362409 421406 358524 264590 302265
9916 302265 265638 266337 293539 357961 393698 368753 403143 505574 513622 453961 443594 412057
9904 412057 455277 461317 339175 317393 399314 411620 336474 286855 243784 178491 200481 207087
9892 207087 238299 288525 277438 285098 273747 287699 271166 257090 212933 205219 255811 221735
9880 221735 127845 146151 224398 288814 273202 243959 164840 203073 134064 160398 255521 260091
9868 260091 266813 315939 264013 186010 61372 74134 148553 197301 227170 188117 125381 174799
9856 174799 295640 340484 306301 212121 159721 131899 111841 115625 68627 31586 77703 111971
9844 111971 159584 157278 101982 80062 75426 -10018 8179 85146 107003 211212 310095 264209
9832 264209 180173 94627 83996 107785 187382 273452 225611 204611 233770 189648 166559 153823
9820 153823 160362 117782 129913 99599 55887 64240 128106 120688 79989 90876 87583 25982
9808 25982 46072 72651 71450 80565 44413 63454 40589 37628 40625 45857 78641 128440 102205
9795 102205 120023 143104 179565 188969 278024 301789 245323 226111 225411 299264 287769 230355
9783 230355 211366 156828 162018 163737 133272 132919 112403 30714 53362 130996 132687 193954 171814
9770 171814 151385 145332 181449 159904 138135 182348 130857 49696 39903 57475 100007 171047
9758 171047 103791 -64 -10416 80372 60643 16199 23937 130057 171913 147275 182507
9747 182507 130199 109961 169250 195449 272830 307325 312480 234111 147715 140096 210229 209499
9735 209499 144576 152457 146239 111680 167122 178798 138666 186766 205523 181914 216535 266927
9723 266927 300447 335856 289872 121339 42089 117577 190525 218910 141602 113099 139638
9712 139638 163551 197022 226188 243033 240086 190811 214615 260215 180771 165819 254837 233907
9700 233907 317262 347677 281962 221580 192056 185763 216777 198816 253606 296527 223684 269570
9688 269570 252292 195432 218714 264286 254840 222545 218591 293669 326803 318548 281164 253093
9676 253093 233758 289306 307576 374672 400396 330210 354146 473706 514053 487710 511350
9665 511350 584157 677933 742853 879861 1114294 1444653 1914409 2401223 3153383 4311877
9655 4311877 5904827 7996154 10776827 13692535 15517312 14649977 11745959 9023202
9647 9023202 7148488 5971576 5242634 4669909 4138063 3612116 3234612 2976775 2718428
9638 2718428 2546907 2454681 2404325 2272085 2181156 2074239 2058584 2027864 1954603 1837505 1715953
9627 1715953 1693481 1670426 1638556 1646565 1676689 1709225 1669318 1669673 1708469 1709576 1740951 1721179
9615 1721179 1681768 1608245 1542718 1450601 1352318 1223287 1181134 1051380 934653 976350 1046866
9604 1046866 963664 934405 960152 968360 870255 730414 567139 529447 519688 550755 567329
9593 567329 569797 563168 586151 499631 476034 423537 382830 373102 377232 359590 331000 273418
9581 273418 240199 224548 215508 216516 232786 225448 205669 192357 169707 231282 271308 261866
9569 261866 288836 291964 271036 210963 132773 169904 228232 208841 122256 168980 208681 205235
9557 205235 201718 229182 233995 230662 225996 251131 256378 306541 301532 243416 191761 139239 158699
9544 158699 157746 135676 168348 190704 142870 56104 62712 38327 24946 57301 69355 75796
9532 75796 54777 82383 62548 1153 69703 84372 92023 134249 117021 115381 91984 121584
9520 121584 132897 147782 204592 128019 45752 58094 131733 170549 135907 98796 113923 100254
9508 100254 129697 226063 204747 189608 143539 93699 69084 78692 47082 -26041 -82046 6950
9496 6950 114792 109912 72503 108285 134180 13775 -32195 -106123 -154204 -161980 -73694 -34249
9484 -34249 -24063 105825 149979 100317 123187 140905 120856 172076 140186 143427 198989 254367
9472 254367 180618 130889 187684 123090 68925 83273 139609 195097 241723 216106 295698 208305
9460 208305 168681 147727 57824 67173 147088 79406 4188 6332 14200 10626 80696 102655
9448 102655 75836 54511 111420 66774 56196 21942 31057 -4847 -28805 46301 183112 204944
9436 204944 183770 149172 17892 54990 48822 36156 34955 22645 34788 96286 110179 40888
9424 40888 14193 134944 182408 152606 162200 102673 87993 84813 133095 99639 97113 77823
9412 77823 8504 7912 -5224 904 14177 80420 28136 5834 37489 30592 79113 43161 12671
9399 12671 61037 102209 4343 -11895 -32026 -16410 3817 54101 44506 -7216 21345 46000
9387 46000 -11512 -17929 -43490 -55689 365 28724 23877 -8938 988 64171 75319 -25514
9375 -25514 -80769 -92347 -112618 -106383 -24426 18983 37642 52460 63179 151818 112533 73529
9363 73529 49903 62583 -26036 47562 130770 94271 19100 30852 116085 73021 95198 72217
9351 72217 119852 201710 212887 133160 111054 46390 46612 52123 -21626 -35013 84987 86257
9339 86257 57564 54213 29856 61893 -20689 -23616 11237 23852 5321 -29913 1493 -2272
9327 -2272 -46215 -17399 17549 46101 59407 84278 136036 187848 264085 210106 163271 199208
9315 199208 218963 183947 170007 142682 110764 97676 178442 207396 159292 139410 179526 219433
9303 219433 165425 120740 84866 186852 167171 137842 115190 79970 22087 38267 84932
9292 84932 183875 196762 192936 159644 160388 93472 96704 70476 90216 138620 111035 129932 148989
9279 148989 117377 53686 84199 166904 157196 81101 37940 68574 13957 -11626 42703 85235
9267 85235 108145 109234 79573 40323 77083 118899 116261 68130 50400 41759 52528 130251
9255 130251 171802 160645 104996 81721 132882 153548 155725 71465 -13990 -44890 14974 122071
9243 122071 122458 107543 177246 196777 159373 140394 125055 186027 136022 63692 43166 44399
9231 44399 47210 26414 51986 30297 1099 10648 21316 30947 82782 20108 -27802 32417
9219 32417 66877 81153 146663 153507 138745 47027 -6171 15578 7100 52913 -6926 100241
9207 100241 116344 171123 182366 142883 73317 68629 159252 204144 182458 98857 105522 97239
9195 97239 58396 49685 9945 3077 71159 108711 121609 -26647 47851 56682 80236 111978
9183 111978 126019 36417 36006 26194 -31173 7395 63343 133643 124559 52836 54390 81681 69914
9170 69914 104124 61596 51281 149146 184614 175855 113515 41110 94621 156979 113558 83115
9158 83115 4980 -11294 23812 126090 143771 160404 185713 174403 194352 139303 128746 120897
9146 120897 89811 6107 22380 87717 55928 45129 4809 11235 44483 87017 33466 45456
9134 45456 75320 135073 156102 77681 -28123 22375 66020 84953 83692 31674 5099 31781
9122 31781 61634 120122 139538 101613 111167 142091 39528 -4497 -46549 -9851 7579 -91845
9110 -91845 -96638 -50229 -33252 -100128 -99322 -135463 -122611 -10033 110385 92239 61845 95644
9098 95644 38476 -28922 -93462 -64302 12611 72371 60998 -5558 22397 68097 62778 30191
9086 30191 31888 70183 -9357 -37468 -36372 -26850 -15954 -60368 -30010 -21328 -7506 -29194 -87474
9073 -87474 -73156 -25421 -20161 3946 90805 91096 51259 28607 -14264 1965 41544 140539
9061 140539 236541 260065 137561 103799 117569 104923 75586 133659 122034 -5481 -21278
9050 -21278 -37207 -82191 -109569 -66113 -47136 -72683 -32079 -16202 -49440 -65843 51801 123469
9038 123469 133290 155440 75622 66583 125814 116047 1164 -31502 56952 83916 113190 112555
9026 112555 97369 143460 170077 163851 172835 167140 59033 18962 41984 11328 -2434 45516
9014 45516 63673 101428 171277 185974 132564 4595 -37514 10472 15070 -25496 -1305 -83123
9002 -83123 -129515 -92974 -39410 -28990 -84568 -85812 -15216 42495 -31227 -77232 -87048 -43005
8990 -43005 31813 17167 52956 34487 -46974 -180047 -105416 23995 34628 65411 55578 2582
8978 2582 -18474 25790 -16795 -119217 -134904 -74834 -19644 -65606 -60688 -76092 -81388 12964
8966 12964 42205 87310 116314 142953 130005 91545 152929 135253 60493 18757 6374 -138813
8954 -138813 -212269 -137706 5670 37415 26781 18223 13026 12414 5041 78322 51321 18248
8942 18248 11843 -15739 -49890 -57846 -7340 32025 -19550 -32839 18021 -9091 -8836 82846 139766
8929 139766 164409 194231 187653 169540 150242 106011 74226 15987 65252 85072 -58088 -126585
8917 -126585 -114936 -96088 -50118 -5305 -25329 9450 58371 71325 61402 -4267 3025 6942
8905 6942 -60855 -40578 17000 97180 85996 -18171 -38805 -23704 -60304 -80760 -116721 -106518
8893 -106518 -91184 -231625 -180380 -107382 -832 -19275 -39658 4257 -19913 -46999 -73627
8882 -73627 -109407 -50485 677 -44053 -38033 55911 55912 -6501 -48603 -58943 -66423 -37110 -13022
8869 -13022 81853 52850 6936 -57253 -30851 36712 78746 202229 254738 232034 168459 154359
8857 154359 168957 82075 -5840 -25764 -40849 -43650 -19913 76937 130622 44823 -24145 36119
8845 36119 22673 377 -59017 -77143 -68950 -140699 -161138 12697 81126 51820 13773 -7316
8833 -7316 8425 37448 68122 42698 38870 71473 80084 71374 94008 81971 29070 25932 -5741
8820 -5741 -6790 -69806 -79990 -81756 -153983 -70277 -10030 -44111 -58721 -49639 -1255 39440 -13085
8807 -13085 6391 12929 38389 46512 16640 35390 -57476 -78378 53943 86139 -4486 -27902
8795 -27902 84210 119840 75609 71968 111743 159143 183048 138099 148664 88102 83837 72389
8783 72389 29266 4045 91829 116862 115840 97333 66994 -75300 -130752 -57369 40979 103987
8771 103987 72158 -6163 32370 169764 236818 126692 65680 24815 25315 84141 114812 133668
8759 133668 140691 31778 -51815 -652 3753 39971 58066 128086 130254 58945 25115 18107
8747 18107 36132 38992 11661 -43673 -5120 34176 135391 146844 123931 39293 -382 -56477
8735 -56477 -81552 -89115 -115082 -79637 20006 47360 26274 96866 124589 116067 83059 176053
8723 176053 208683 244343 134389 -32730 -97665 -3217 39076 64170 101757 94859 18514
8712 18514 -3856 -47193 -94150 -16004 62837 -6379 73113 106391 121322 64183 70601 144977
8700 144977 265472 258768 154271 43685 36449 118911 124045 89098 85659 160668 224789 235861
8688 235861 227472 205843 152455 104100 183826 153207 112345 112428 136101 142153 169045 122909 86318
8675 86318 119580 52911 -10935 -70613 -99549 -13016 23627 69662 87844 103284 51475 118857
8663 118857 115263 -40204 -19102 105694 123328 98983 112472 83483 98513 129924 93301
8652 93301 54813 38592 36798 4232 29889 -1364 -45377 -37776 22933 54562 77879 67723
8640 67723 136041 79916 54307 44920 12094 36983 85782 31344 -30607 3161 48956 117909
8628 117909 114808 131076 128200 76921 1105 29149 6537 -15336 -9749 44151 13499 -23548
8616 -23548 -21256 24583 50438 16197 -17233 -50683 -30257 18759 59772 137021 138086 134832
8604 134832 157389 192487 165794 134758 22622 -30938 51989 121181 74009 107060 46332
8593 46332 41285 70201 18669 -42856 -14651 41530 45962 49266 92351 218764 211588 131538
8581 131538 149710 187498 263119 237050 87504 -1360 -64761 -74063 9723 36971 27110 69574
8569 69574 18546 -46831 -58355 -1535 -29655 -49999 40554 46699 87036 33366 -61722 21986
8557 21986 85144 100654 84876 40233 5042 33103 125953 138916 27747 41538 51855 89637
8545 89637 91348 189684 159736 60767 26219 54967 66553 51259 32182 10143 5273 91037
8533 91037 122741 149560 101850 50636 22119 12242 -58 38787 14904 -3906 6701 11123
8521 11123 32438 63202 38190 -16017 -12497 37691 56977 101824 133919 125111 85297 61001
8509 61001 121840 152227 146049 89426 32624 74129 62332 28818 34284 92695 77982 39962
8497 39962 18096 14164 6201 46680 111199 167667 152471 -18680 -71012 17078 -17283 -29978
8485 -29978 -36400 19831 -17562 -22776 -64784 -85400 -4414 53989 69183 125958 62614 -46752
8473 -46752 -63322 10296 53293 -11943 32984 67120 160886 103622 46992 -7092 -72548 -145712
8461 -145712 -55558 -88720 -152507 -125699 -39952 -43425 -3356 42667 77771 14362 -29654 -15258
8449 -15258 -97134 -153706 -110716 -33325 -956 2642 -42671 -34254 -39094 2372 51929 39870
8437 39870 77429 180314 243273 166779 98503 42168 -5303 -44265 64774 33788 -18848
8426 -18848 21813 96381 57818 -14329 -81862 -99356 -6599 48187 399 -63571 -73041 -19431
8414 -19431 149381 140054 87779 -1138 13945 4895 -23706 -42327 -62634 -10581 59660 56856
8402 56856 72160 87683 38159 89783 77552 -13981 -31883 -2842 31090 45432 -22697 10400
8390 10400 90484 62234 60238 22064 -17432 -80463 5028 139140 145641 146639 73455 46305
8378 46305 75143 49572 1447 -12299 84146 99526 51382 72132 96344 80702 136377 173847
8366 173847 146822 112224 86771 92005 90572 24717 -26666 80384 169258 110270 65495 40805
8354 40805 -35865 -97095 -64897 -47755 54392 40165 101391 137438 76433 92948 100183 39811
8342 39811 22126 13513 -35571 -65286 41787 144838 137399 96657 69449 63730 76327 45281
8330 45281 67546 72984 22177 -25941 -87475 -11796 75121 127624 148278 61111 -51987 -79052
8318 -79052 -17278 -28229 399 -2441 -76044 -65478 -123840 -138748 -135617 -99117 -63646 -40679
8306 -40679 -32869 -29692 -17558 -53991 11558 34505 108765 101095 70752 57590 16585 25073 35791
8293 35791 66654 -49385 -125514 -45738 -13944 21263 85113 124927 114402 79109 111878 -2241
8281 -2241 -14721 80353 106485 84726 97794 106155 59302 116457 220665 189028 157670 209656
8269 209656 118273 5494 35536 79299 62791 71342 107683 52848 -42693 -76281 -119837 -179195
8257 -179195 -185723 -139875 -71424 -22029 -43309 -28409 -61096 -87936 -129906 -92281 -28784 10362
8245 10362 -68651 -132843 -198687 -182099 -88050 -127042 -81089 -39631 -92860 -96801 -35038 -16323
8233 -16323 -6671 22351 -44308 -28944 1084 47166 91627 96017 56421 58628 112542 116662 106170
8220 106170 96162 42753 -8395 -81654 -75077 -15305 6423 -16157 54966 -3879 -19338 25104
8208 25104 -1988 70237 88188 26950 -33939 -97580 -104566 -65838 -63601 25098 114835 83966
8196 83966 22150 -46823 -80921 -15932 34067 30493 -11707 -16797 -34254 -97863 -54745 46975
8184 46975 95183 89397 65458 70474 77132 96051 112439 66829 73833 129883 178305 129623 147831
8171 147831 149323 36313 -11775 -1511 4391 -469 -46286 -118819 -57785 -49603 -104087 -80836
8159 -80836 -36483 -56490 -90060 -50777 -1652 41701 35195 104568 62550 28849 -8313 27864
8147 27864 38278 -13517 -59179 271 76503 80002 48334 681 -38753 9190 -29728 -53889
8135 -53889 12501 88015 156572 94258 53916 -2107 -52859 -40936 -63860 -39291 4538 58538
8123 58538 -66881 -112382 -122612 -75748 -139566 -124205 -98483 -52659 -83989 -72229 -108300 -137333
8111 -137333 -117136 -66949 100591 162925 89398 -4319 -14321 98739 217959 115999 63962
8100 63962 34474 26811 13969 -8071 -56680 -21403 50923 42479 -15043 27270 44140 121404
8088 121404 93601 74178 -5934 -29138 -7411 -81416 -75857 -68579 48832 67559 58567 5210
8076 5210 -30983 -47228 -57846 -65347 -79956 -99967 -41891 -35142 -38479 38116 71397 25513 29392
8063 29392 60364 64698 61789 9273 -6743 -3769 85355 53403 17671 -11598 -29694 7845
8051 7845 5586 -12382 -38824 1524 -3606 35707 70836 54478 13862 67230 46786 -30759
8039 -30759 -73221 -69796 -36834 -14118 29966 36819 -8839 -12798 -3626 -40874 -32684 -6324 -34010
8026 -34010 -87633 -133417 -92404 -104963 -123548 -113101 -10070 -27946 31647 11981 72556 91129
8014 91129 83718 96030 101288 70653 93973 123578 177095 86979 -35694 -52892 -75474 -67080
8002 -67080 -59100 -105937 -50434 -23581 13394 11399 -32898 -47152 -54397 -58352 -107762 -100407 -32416
7989 -32416 42855 49449 -18955 -7110 -23784 -10846 -32040 9792 119825 96734 27506 65642
7977 65642 81865 140901 170912 40140 -7712 -28350 -8511 12165 -31815 -10742 8042 29289
7965 29289 -4409 -63476 -24240 -18171 -38974 23710 19992 36217 47745 12446 -41893 -17498
7953 -17498 -82085 -34031 34051 53089 -2640 -459 2108 -4853 -23830 -60371 -14533 -67839
7941 -67839 -37702 25234 4032 25784 10796 -43967 -14961 22463 77884 108165 132252 79069
7929 79069 41549 -8791 20621 -12568 -97432 -205460 -245821 -142461 -78626 -8662 44381
7918 44381 82241 111308 63952 21256 17749 8220 -15836 -58783 -35871 -49460 -42183 -58606
7906 -58606 -43227 -109408 -94561 -71035 15457 -6124 28353 86559 38912 -9060 -8176 45884
7894 45884 -9080 -61084 -130396 -184591 -180537 -121314 -68079 -28467 -52850 -81364 -15811 -20164
7882 -20164 -48552 -109007 -135532 -63685 -48391 -67789 -134484 -98414 -39972 7416 23588 7740
7870 7740 24129 30508 30854 50970 110262 181681 138448 89338 104190 29832 -64909 -39090 -3249
7857 -3249 -19973 -14684 -6205 -73998 20344 12552 -5061 12124 -2412 3505 -4898 -54725 -44004
7844 -44004 -65284 -29945 70287 -10116 -19087 -7532 -4505 -3592 -6807 58971 22295 40708 14943
7831 14943 -10070 31590 66526 -470 -48096 -1086 -8 56779 44724 35218 22718 101377
7819 101377 110077 25890 40798 26093 7402 59514 76187 17681 26964 143674 95447 6582
7807 6582 -24150 -83547 -155066 -204651 -105728 -67627 -31146 -2803 45227 55615 47650 70809
7795 70809 145041 144749 125924 99854 114649 96062 64977 133217 102989 8690 48386 28548
7783 28548 -46137 -59070 -31490 -36860 -123341 -189117 -110767 -69512 12152 88976 133215 49173
7771 49173 55578 55818 24697 -20307 -39575 41133 112846 133862 100955 60965 22795 -26251
7759 -26251 -7364 15467 49645 23392 37858 9440 -5342 57193 149166 138455 93470 129242
7747 129242 168812 143455 62716 -26420 -111550 -14502 85439 29037 5229 -9125 1817 -54015
7735 -54015 -87955 -22739 21603 33789 62625 -25406 -43489 -124891 -140400 -120676 -80769 -28589
7723 -28589 18899 9468 -10280 -45146 -72457 -47080 -8117 69091 88679 95141 50405 37397
7711 37397 37053 -4579 27968 27370 -29627 -68577 -20496 -8087 7084 55038 12069 -1522 1782
7698 1782 -89140 -153138 -135700 -54719 -82175 -88839 -44264 -31203 -56542 -33474 -75432 -56014
7686 -56014 -45927 -24464 28364 16297 -34879 -27403 -55506 -80977 -102118 -57513 -63007 -85569
7674 -85569 -137458 -141649 -81261 -54785 -23685 -103181 -184669 -174071 -80247 19465 -42691 -79611
7662 -79611 -7567 -38725 -53945 -93660 -28052 10790 -2538 -30096 -17050 2074 -49053 -167465
7650 -167465 -117029 -39741 -27686 -47268 -126982 -150238 -130988 -35626 6160 39961 110159 93081
7638 93081 42655 -413 4538 -54469 -128753 -100856 -15453 33049 50558 3711 -80331 -70198
7626 -70198 -47365 -72732 -187059 -197662 -141972 -66860 -4303 -64142 -89021 -22992 51673 -34221
7614 -34221 -81421 -87343 -2027 53926 90349 136654 115013 -9040 -40288 -98734 -168953 -158687
7602 -158687 -113879 -75873 -3681 86003 164674 111690 95157 41272 31474 26239 -71360 -71284 -122483
7589 -122483 -115180 -93263 -62493 -93628 -118621 -175359 -161173 -174686 -188948 -170480 -134796 -62580
7577 -62580 -47987 -64650 -83064 -104968 -141884 -89382 -28373 -40874 -34381 38199 103083 14741
7565 14741 -46057 -34287 -52888 -12439 -17803 -67845 -96939 -104229 -92252 -16949 -36150 -21072
7553 -21072 -67557 -89035 -130539 -135056 -171848 -186048 -206267 -137161 15782 13052 17771 2904
7541 2904 -54516 -97595 -45123 -6094 -28766 -133067 -197604 -169771 -86001 -90713 -109985 -124015
7529 -124015 -65139 -20364 -28557 -20701 9407 -25318 -50889 -23068 50067 18900 58266 84259
7517 84259 103841 133243 105518 17933 -32361 -40569 7330 1624 -24123 -13049 -9771 -20172
7505 -20172 -45004 -108052 -201144 -178913 -86661 -30419 -41838 -86704 -116130 -121836 -101511 -97254
7493 -97254 -174404 -120029 -21571 34594 -6328 -64347 -57354 58825 95311 45234 32427 31577
7481 31577 -1159 30353 36121 75994 60663 80056 53430 29942 -17660 -51750 33514 79207
7469 79207 37747 50737 46883 80459 63277 -71251 -29054 -26590 -46382 -24324 -41539 -67570
7457 -67570 -87689 -46189 31783 11799 78401 37160 -28448 -39808 -46855 42786 10641 -5115
7445 -5115 -125773 -149889 -89749 -20269 -19272 4511 -39344 -35997 -37263 -43767 -113159 -112852 -85114
7432 -85114 -108576 -188242 -173914 -79055 -5764 -17867 -7389 -113924 -121976 -65797 -19943 49513
7420 49513 87944 92744 90618 45096 15135 5834 -7300 12373 94720 113125 125218 90341
7408 90341 26057 30813 -19636 -31279 -18044 32491 49370 57646 33009 29025 45717 35297
7396 35297 105394 -42433 -110655 -53904 1239 66569 111882 -9447 -53693 -83166 -86196 -61665
7384 -61665 -55871 1618 46235 -20124 -116918 -136430 -32216 14175 -108131 -84113 -58251 -31034
7372 -31034 41796 98926 106905 100914 111577 68953 24108 55441 33580 -29597 -59423 2975
7360 2975 1430 -47626 -95672 -37404 -10842 -72539 -63349 -19972 40328 99680 92664 37244 17539
7347 17539 19622 -42935 -47121 -27789 -18738 17695 31231 113798 45245 21089 24819 -14744 -112694
7334 -112694 -157228 -168065 -169171 -201942 -166673 -156234 -192112 -152715 -130111 -49746 31630 88895
7322 88895 12032 -98442 -115617 -98979 -6406 -3280 -11971 -98866 -111920 -36933 7037 22004
7310 22004 -39556 -24172 -5047 50839 -33470 -40397 -81399 -45926 15049 18483 -45983 -106795
7298 -106795 -123253 -29700 -106968 -126256 -5892 7147 103995 139797 75585 6548 -81010
7287 -81010 -95518 -9524 112169 110674 73006 -253 13310 -49477 -92754 -54138 28797 -16326
7275 -16326 -54247 -9823 -37855 -37728 -13403 -3863 5181 45259 5830 3952 58912 45638 -12273
7262 -12273 -36857 -46416 -54952 14427 28370 17946 -113373 -152147 -116988 -78499 7404 -23786
7250 -23786 -68362 -60636 -123727 -135986 -61952 -24635 38500 -18275 -91575 -79519 6421 79077
7238 79077 59026 110342 82346 57705 -32376 -106447 -127721 -122340 -156515 -74293 -84708 -132959
7226 -132959 -141601 -122116 -105904 -123090 -87077 -90852 -125559 -170308 -187124 -178366 -109937 -26590
7214 -26590 36893 -30046 -85727 -117384 -92867 47817 32420 16971 57601 18064 -48553 -48351
7202 -48351 -16600 -64505 -161501 -140207 -24761 67635 147095 179065 159344 57808 49114 110492
7190 110492 91368 30839 58787 55950 81445 -6822 -35702 15870 40773 58259 49027 32765
7178 32765 64466 48743 -35399 -53836 -2534 47418 81042 72703 9071 -39740 14975 8277
7166 8277 -8457 -26239 -71936 -9043 15579 -25838 12385 972 1247 -36665 -76156 -92633
7154 -92633 -54156 -44805 -44470 -60278 -13887 -45557 -11321 56529 75728 96733 95925 92314 97594
7141 97594 113413 76450 18188 5971 372 -27311 -26348 11770 14347 -19611 -18613 -112616 -106648
7128 -106648 -31837 -55545 -15972 -13686 54078 -17633 -84166 -70572 38992 81737 22135 -37485
7116 -37485 -10395 14425 -18564 -63991 -112035 -66731 45517 30303 24639 29837 23251 -12537
7104 -12537 7709 8234 -13070 11256 53602 -24714 -118713 -151118 -130971 -80048 -26983 -17050
7092 -17050 -37032 -43104 -55270 45135 74292 827 -41719 -43804 -38790 18392 45290 50619
7080 50619 707 -18577 31609 -6020 -8613 -50796 -107551 -102284 -39303 -42284 -47529 -654 -882
7067 -882 -11147 -50816 -21128 -103795 -105300 -74160 -86427 -125883 -112408 -88931 -120900 -172751
7055 -172751 -212769 -189203 -95125 -88587 -73249 -54240 -18237 -90663 -121907 -81480 -57718 -63559
7043 -63559 -34276 22141 -4588 -39375 -24785 -2921 72341 80329 75932 -48715 -7747 -37215
7031 -37215 -60931 -87108 -141587 -94443 -100861 -93390 -137938 -103262 -16091 29050 -649 -19450
7019 -19450 -28787 -95882 -123861 -63824 67327 160338 88953 22775 -64977 -80687 -33173 41031
7007 41031 12657 -6287 -16626 -75012 -35490 -43279 -11072 27168 3552 4385 12228 19755 33771
6994 33771 26959 69065 92276 111197 36388 -40718 -40585 3951 42220 -52816 -136496 -138305 -171467
6981 -171467 -150300 -62597 -27749 -21133 -18817 -17885 28664 48812 64610 50552 17919 -65961
6969 -65961 -67611 -129318 -101144 -17302 -19146 -68573 -132180 -160078 -96078 -40455 -114877 -163215
6957 -163215 -55547 -55506 -24531 -25023 -23432 -17644 65105 11067 -33374 -23192 23681 31298 32166
6944 32166 71815 74377 34911 -31040 19094 17225 46894 2347 26545 27899 -16877 -109960
6932 -109960 -65093 -130127 -178032 -124692 -77406 -54881 -7867 83016 53988 -16133 -15155 -39228
6920 -39228 -71786 -26277 -18151 10875 91677 100937 73774 96801 21592 -130181 -138322 -65376
6908 -65376 -27804 9908 42869 2633 19882 47681 66746 55006 13136 -42093 1734 -34030
6896 -34030 -68508 -38271 -26703 -70888 -107749 -65777 -49086 -17924 49062 35885 77140 25386
6884 25386 -25475 -89556 -100085 -15982 -21879 -87293 -50237 13981 52272 64884 89901 136725
6872 136725 95539 39417 -363 -79707 -136837 -144625 -161807 -94196 -88681 -98930 -29449 -2353
6860 -2353 107563 81515 25814 5652 -8033 -36023 847 -27807 8696 79084 88176 -1915
6848 -1915 -59767 -59165 -108253 -136716 -172914 -188522 -118344 -85630 -86748 -40559 -67804 -45785 79841
6835 79841 115918 85859 31837 43210 -5976 44023 30415 43792 -11525 -48112 -42877 -46297
6823 -46297 -12811 -41616 -27627 52309 74868 50318 49232 8347 67147 -2076 -46989 -120317
6811 -120317 -96986 -24746 -30028 -75865 2244 39941 75152 39728 -16944 -7966 -44062 464
6799 464 34025 7467 -3196 -118 -30056 -39266 -22881 7843 8031 -70677 -127422 -133653 -46840
6786 -46840 41970 34030 -5096 21858 9006 -2699 -5041 -61945 -96990 -15478 25542 -20801
6774 -20801 942 -112322 -112583 -73975 -1453 13177 -51532 -79640 -72677 -54263 -89415 -113359
6762 -113359 -111427 -108844 -87555 55562 697 -66208 -102787 -83810 -62755 -58568 -87508 -64144
6750 -64144 -36472 -29159 -54471 -19233 33416 84341 51620 36572 18997 12900 -83775 -140367
6738 -140367 -78032 -42788 19595 27410 14749 -23841 -24461 -24992 -30021 50180 82269 15690 -56234
6725 -56234 -54285 -53298 -69793 -80991 -72770 -70259 -70982 -30344 66694 87323 113590 144779 143383
6712 143383 115421 74028 15617 -1692 -33983 -17682 -58622 -76686 19714 45316 53366 -5063
6700 -5063 -85549 -84096 -27864 55029 107027 120142 111275 12046 -110592 -111725 -103628 -139702 -189292
6687 -189292 -171008 -116880 -41353 -91324 -95159 -69721 -48033 35118 39599 1767 -47679 -21981
6675 -21981 -54581 -118981 -85716 -19091 18003 358 9369 47633 18483 -20884 -32559 -1658
6663 -1658 37959 56780 825 -83332 -166192 -156354 -59058 -17961 -37464 -63896 -186983 -129741
6651 -129741 8928 57898 23144 -88087 -152678 -111177 -78033 41256 124852 113062 8792
6640 8792 -6915 28775 35400 36980 18863 13739 -29463 39208 84019 97927 55484 -40134 -111877
6627 -111877 -92819 7239 15744 -51366 -39798 -78832 -160169 -106217 -47362 -6147 2476 -11748
6615 -11748 -49092 -87458 -90552 -93936 -87847 -114188 -61121 -16971 -20147 11879 -17074 -32380 -87228
6602 -87228 -171955 -205858 -194208 -136723 -116689 -85545 -55752 -74863 -77901 -117759 -169752 -177840
6590 -177840 -247589 -217566 -30729 -48503 -145665 -139665 -66284 -44801 -10586 1091 -29045 -26514
6578 -26514 -25654 2161 -81512 -92517 34468 737 -78865 -106280 -89101 -79965 -96568 -105549
6566 -105549 -124624 -157642 -141571 -65682 2819 58764 35525 46340 95317 146410 125652 66992
6554 66992 -7305 41286 120421 153540 73809 -8503 -68504 -105032 -61584 -31731 10918 28880
6542 28880 24755 -14889 -4316 -16316 -110405 -147255 -180319 -205984 -266321 -123837 -32426 -37965
6530 -37965 -34281 -24932 20466 -106605 -165602 -15470 74623 28489 -39472 -63466 -117306 -85525
6518 -85525 -39395 74335 64250 6623 -13772 -15562 -41774 -123551 -119574 3291 6229 -88091
6506 -88091 -92294 15797 45532 20973 31142 14516 10926 6171 -25197 38232 63856 -3025
6494 -3025 -35404 13912 19874 -58855 -69971 -72467 -104873 -93789 -114365 -69065 36124 95429
6482 95429 114639 92584 120034 112105 30356 26278 11888 23345 57190 104125 78658 55252
6470 55252 -45392 -33571 -44639 -88007 -40787 -13332 -8309 5821 -69099 -92204 -95052 -104955
6458 -104955 -7142 53397 109948 83921 36892 11852 15656 -43785 -31451 -23765 -55202 -8806
6446 -8806 77527 63083 85539 132219 182357 81992 31786 80323 79416 79315 76022 56320 71259
6433 71259 91398 162979 82327 76548 73974 57500 64000 78594 -6502 -68878 -138301 -104723
6421 -104723 4921 72928 -9149 -487 65797 11357 16928 78301 -35120 -153050 -156614 -126881
6409 -126881 -49274 -11751 29117 -20841 -21036 -34892 -27761 32006 12450 18869 65203 42583
6397 42583 95115 73394 23245 -27283 9254 -60261 -49463 -19976 -49081 -108110 -119909 -100846
6385 -100846 -38215 -46264 -22502 -53802 -30489 27230 49594 -486 -19216 -70726 -132682 -7711
6373 -7711 31764 -14359 -7336 6904 -1014 -17936 31238 34662 3623 -73546 -87343 -57231 -80199
6360 -80199 -138607 -106597 -52621 -29261 -75662 -98400 -48623 8273 -33398 -61864 -13197 32913
6348 32913 108360 143775 142757 102157 -10444 -24938 29389 39808 -2258 61292 88342 110487
6336 110487 105547 -7418 -109040 -160325 -172683 -139540 -64340 -71608 -119738 -155547 -144115 -76005
6324 -76005 -22598 31200 30433 -20041 -44336 -47819 -14606 -3999 -2996 -26707 -65168 -80512 -133068
6311 -133068 -180901 -160346 -91130 -27301 63284 32353 -42401 -119639 -94851 -115829 -37216 62915
6299 62915 111590 117685 35843 -44719 -7004 7209 63578 16276 -11613 33973 20823 -44844
6287 -44844 -124635 -181252 -53229 1142 -10753 41141 99668 129073 160757 161042 120465 76043
6275 76043 123474 61401 40986 52890 58655 30650 -7597 49262 18644 8521 -34831 -26667
6263 -26667 -40648 -40134 -23695 -16972 -4783 -62227 -142166 -133201 -85574 30729 24204 58384 96029
6250 96029 64575 5391 -109835 -73960 -85328 -85324 -124410 -125667 -108277 -120105 -77294 -52708 -38181
6237 -38181 -23013 -19503 -42658 -17856 -19888 -28211 -8821 18552 -34285 -103201 -114083 -104731 -65021
6224 -65021 -22612 50396 145401 159882 171971 161638 85683 31571 -21764 -133193 -99197 -24802
6212 -24802 -9251 28246 -55508 -69899 -40105 40234 82744 76758 13987 -1580 -49218 897
6200 897 44307 54551 71085 -45001 -71359 -27120 83817 80745 16084 -33311 -23362 -43625
6188 -43625 -58861 -1207 32959 27398 -6577 -33475 -68347 30414 140168 237992 124522 58913
6176 58913 34611 7817 12468 -7362 6686 45799 163707 163933 153506 75892 53055 5088
6164 5088 -37897 -100203 -38917 24198 -30699 -61152 19378 112193 131353 120096 78315 88822
6152 88822 108589 100058 93970 -212 -129173 -137628 -104102 -84915 -52431 -9332 40659 45848
6140 45848 -56592 -110383 -65492 -65207 -49179 17535 125517 117203 45765 59955 76417 -5509
6128 -5509 -76537 -184013 -163843 -162919 -142686 -48937 -14348 34794 3128 -19978 14154 -15716
6116 -15716 -1939 37629 17913 57211 46914 31448 -9889 -31344 -68263 -74049 -47832 -81311
6104 -81311 -77002 -9040 67213 100932 72606 104734 129255 127923 164339 196156 182008 59042
6092 59042 -68951 -27220 -17623 -63818 -70318 -66684 -44751 -65387 -37779 -41287 22558 41908
6080 41908 -2231 -11863 42450 32203 1308 -42074 -82645 -33274 63572 86605 98326 34055
6068 34055 15889 13400 85206 115925 42049 61030 119660 66765 -97842 -94154 -30266 -39325
6056 -39325 13698 28239 31535 -36079 -51083 10621 17335 -70581 -93235 -82824 -134192 -145546
6044 -145546 -84208 -25461 -4845 63879 62923 13929 -2135 -45956 -22206 2962 21297 -6213
6032 -6213 -106585 -223545 -143620 -27497 37099 30821 27481 56592 -28109 -54339 -50317 -114049
6020 -114049 -105720 -96546 -29422 50449 -8568 -17061 -56196 -21261 -94848 -165746 -182032 -189809
6008 -189809 -147330 -60884 19843 7976 -5541 -4741 15864 6543 -46658 -93541 12207 111923
5996 111923 74984 90928 119491 123035 11210 -162099 -153048 -130090 -85660 -38849 24221 -50481
5984 -50481 -134267 -151903 -136704 -129361 -166859 -108099 545 -3534 37103 43579 85008 90534
5972 90534 -5918 -21910 -26745 -135039 -121406 3369 -27433 -76408 -18447 29263 110158 94888
5960 94888 54501 28799 19515 -17629 -52019 -118756 -102127 -61408 -63767 -63974 -91454 -178673 -154739
5947 -154739 -163025 -133590 -142465 -146845 -125173 -28731 5915 -112063 -185885 -93815 -25838 -74635
5935 -74635 -81328 -40015 -19175 -17917 -26507 -1086 -67068 -180220 -199294 -109563 -80449 -74648
5923 -74648 -64061 -49007 -26323 -32989 -41848 -57201 -118251 -165255 -104060 -48160 -97194 -164853
5911 -164853 -188647 -80176 -34777 -99082 -41571 31745 -36022 -61837 -85991 -107157 -44477
5900 -44477 -83421 -152923 -125740 -1981 3544 -57948 -38376 -23622 -23102 3458 25624 -17282
5888 -17282 -110902 -183556 -140091 -60942 12994 20480 -43597 56806 129499 44209 18381 -52746
5876 -52746 -126435 -118218 -87472 -101093 -128768 -17863 54702 -7230 -46871 -56166 -53762 -69409
5864 -69409 -115045 -123965 -27505 -49661 -170199 -80605 19978 48358 58865 85256 123644 77761
5852 77761 -62376 -163304 -155929 -91920 -38164 -64956 -114225 -86911 -40290 -22633 -48154 -34711
5840 -34711 87197 78762 -46307 -112958 -18677 29362 37912 -43486 -50879 -96647 -190692 -132964
5828 -132964 -18133 23224 86020 95820 106858 83462 84788 31254 20872 -59969 -19740 -34765
5816 -34765 -76983 -43094 -53134 -37637 -2400 24057 -44969 -66650 -6354 41882 38215 -23370
5804 -23370 -50157 -48489 -20499 -10629 -2017 -16421 -65899 -67514 49956 -15625 -31918 -66944
5792 -66944 -33453 -46012 -78707 -108225 -75129 -88534 -49799 51006 -8636 -35021 -28320 2607
5780 2607 -29795 -39847 -49984 43927 100833 91045 75196 112847 23897 -35249 -69543 -110586
5768 -110586 -108224 -4867 1765 -75325 -61225 -40292 -10668 41178 50535 23155 6905 23726
5756 23726 13998 -7758 -15204 -27249 -80100 -28497 33243 15625 -88900 -108807 -75100 -72370
5744 -72370 -87295 -126543 -133176 -121794 -73951 -16978 -57165 -60394 -49656 -70954 -65942 6542
5732 6542 50828 -31249 -64678 -36965 -795 -56425 -27082 71400 34076 56880 98275 87666
5720 87666 103970 84608 54358 33418 -30698 -75007 -42532 20730 13348 -33403 -110241 -129172
5708 -129172 -82671 -52743 -14136 -68423 -38639 2173 -28896 -17216 -67560 -64517 -100767 -142774
5696 -142774 -86600 -65245 3276 18128 -27159 -60107 -13839 3704 90941 67447 67852 44490
5684 44490 71545 60668 9544 14811 -4919 -51277 -115253 -197044 -166729 -132163 -77131 -43002
5672 -43002 -10869 28050 22093 16664 -34448 30300 36879 -36802 -18601 50642 24759 -46639
5660 -46639 -80284 -76816 -23697 -43179 -54210 -59543 -60412 -78591 -27936 -12371 -43314 -86005 -98214
5647 -98214 -53167 -40921 13088 106573 93281 95449 80139 61355 67779 73028 18906 -52133
5635 -52133 -20112 -5297 -23151 -26772 -99240 -139122 -185229 -182931 -127052 -83821 -16713 131358
5623 131358 109528 -42210 -86556 -68032 -43841 -30880 1984 38162 42376 78806 109699 128600
5611 128600 105180 31365 51092 19757 -33071 -50056 -79750 -111696 -29694 -20833 -102098 -79427
5599 -79427 -89672 -57597 -8502 1767 -55551 -40566 -58651 -48129 -18756 18192 -50693 -102263
5587 -102263 -150786 -46433 -22274 -34709 -11599 4175 -247 14099 16514 -19039 -58174 -28600
5575 -28600 -37075 -108360 -155894 -159397 -121323 -67570 -119162 -137499 -112120 -123620 -80160 -35986
5563 -35986 -59294 -70942 -16458 -116597 -165736 -224761 -200917 -190729 -69888 -72374 -134895 -134196
5551 -134196 -146555 -114233 -77934 -42858 -38959 1776 -43922 -40561 14809 41807 -3734 -5716
5539 -5716 46289 52900 2882 -11741 -92405 -95296 -75099 -78545 -84948 -176309 -159004 -66973 106581
5526 106581 77881 43636 52642 -20686 -63051 -60958 18742 -6816 8142 14293 -17019 -30381
5514 -30381 46694 13845 38191 41583 -23386 -12215 7336 9514 -17179 -122168 -132818 -101263
5502 -101263 -49256 -21186 -75433 1382 48345 -6201 -46306 -74283 -177041 -140846 -119060
5491 -119060 -60036 -48126 15090 33274 53175 55722 25101 2352 -91255 -111081 -125445 -49287
5479 -49287 13882 -35796 -88614 -120957 -74995 -16321 3430 15670 31348 39797 24593 84876
5467 84876 74440 -32533 -77505 -8164 -3747 -105182 -171518 -132733 -46897 -97198 -141852 -42229
5455 -42229 -5760 -23730 -52358 -92902 -119083 -84108 -31319 -32520 -64356 -58248 -6402 -61411
5443 -61411 -64716 -42755 -1564 37046 66722 -10636 -13484 -22068 -46015 -50978 -124994 -146012 -157172
5430 -157172 -130604 37481 89640 15570 -32511 -26070 -20430 31833 25128 40282 76 -44842
5418 -44842 24104 61631 22511 -22943 -71764 -97621 -31994 112829 47513 -72987 -47392
5407 -47392 -75690 -53396 28499 88965 110808 170447 110763 83995 89835 3279 -118064 -155104
5395 -155104 -138311 -87147 -98380 -99281 -123617 -85549 -52513 -80947 -106346 -127306 -151385 -112820
5383 -112820 -78494 -38570 -35819 -25587 2082 24575 -23436 -34648 -44658 -91933 -91898 -38010
5371 -38010 -8067 25946 100756 131716 48242 39595 24884 6375 -24887 -13220 -84761 -98351
5359 -98351 -58974 -43456 -20437 -43611 -73774 -147329 -142403 -121054 -63778 -12591 -114371 -258500
5347 -258500 -293668 -139456 -44512 -41487 -65786 -76775 -142514 -107854 -31125 67244 47681 31830
5335 31830 76263 82355 -57452 -37477 122914 129169 66383 5897 -3355 43560 32821 95684
5323 95684 156543 133849 30264 -62306 -99125 -105038 -114334 -92806 -106613 -158751 -146026 -69443
5311 -69443 -66083 -87950 -75658 -109499 -144898 -118683 -98495 -66456 -25105 50238 48206 24406
5299 24406 -57325 -69691 -18431 -10304 30422 -16630 -12225 27372 28661 113571 156534 78488
5287 78488 28570 49936 54252 58468 70070 20047 41468 49142 -24428 -171051 -187107 -125278
5275 -125278 -89892 -45328 50521 19968 -88792 -63958 23297 97268 62040 42748 16054
5264 16054 -19668 -2427 -30071 15696 96391 130218 76502 5900 77494 78856 13893 -33960
5252 -33960 19744 28432 1070 39118 11219 59100 121306 86205 37165 1041 62639 48510
5240 48510 76449 10527 8471 82722 85332 -17479 -29612 -21183 -23472 -81339 -108146 -149373
5228 -149373 -187086 -128307 -33586 54397 97137 115030 110150 43251 -39446 -8503 38087 77752
5216 77752 66962 17592 54994 29240 72053 73059 52768 23587 83738 129145 32170 3667
5204 3667 -81086 -144411 -40511 8261 -21876 -77183 -48570 -49955 -37548 13599 -48128 -62916
5192 -62916 -25474 66239 162281 90097 18877 65891 91996 59381 -47226 -59359 -22008 -14102
5180 -14102 -16781 60538 95028 4499 -76339 -63487 -59295 -21145 -44263 -14079 97017 75183
5168 75183 48036 1834 21150 30725 -37366 -39565 -12071 32261 113680 176397 143838 48065
5156 48065 -22480 -31216 48312 44646 3108 -56962 -16814 59896 79232 109174 85586 96376
5144 96376 7559 -14502 -27999 -76335 -120316 -102460 -99472 -80645 5548 -21807 -78112 -25932
5132 -25932 -32075 -122470 -98433 -82657 -80442 -53866 -94058 -83944 -79370 -67873 -116490 -101554
5120 -101554 -18173 24017 21487 -34807 -19337 -72765 -48949 38283 40699 20905 -65159 -86367
5108 -86367 -85073 -78902 -58060 -18960 17434 -47817 -124707 -86774 -73681 -48638 -35508 49227
5096 49227 35833 -9056 19326 -34938 -40059 -44252 -13470 7460 7468 32689 -2358 -88747 -125507
5083 -125507 -89575 -5519 -33877 -106871 -170992 -196420 -188361 -86254 -61992 -39542 -44482 -38665
5071 -38665 13897 -35729 -147866 -205885 -172018 -114024 -106007 -159493 -149843 -173719 -179628 -220229
5059 -220229 -242385 -206542 -179465 -158527 -167790 -67345 -44118 -51168 -49198 -77266 -28163 34396
5047 34396 50794 87021 -35324 -152851 -137571 -115004 -143306 -118165 -114012 -123120 -48734 70978
5035 70978 62368 -14855 -18760 -67454 -184363 -193833 -160199 -147955 -128548 -195337 -135992 -71619
5023 -71619 -48797 -68707 -93250 -139587 -78491 4228 -10574 -97346 -78852 -64627 -57420 28004
5011 28004 101068 71178 83854 54631 41356 41335 67758 74355 126019 184454 66770 -18936
4999 -18936 -52362 -4289 38382 2144 -61645 -81928 -101422 -59980 -84740 -72039 -33198 4214
4987 4214 -14485 -48934 -68287 -134087 -163821 -83506 -66980 -143100 -186599 -105340 -71802 15477
4975 15477 36910 55351 42874 -2571 17354 -28849 -99653 -119704 -100403 -17292 60958 -24149
4963 -24149 -50829 175 55488 24858 24031 51730 95757 64253 71246 22452 6168 57808
4951 57808 97464 92438 77663 101610 29117 29640 45473 29960 -8230 -80896 -70427 -13681
4939 -13681 -53333 -69190 -35891 -40395 -189096 -216307 -130145 -77021 -22951 21762 -4968 -58625
4927 -58625 -65812 -36086 42641 41905 -56774 -69472 -23576 -13425 -11173 53170 59558 24809 20613
4914 20613 -52692 -24867 -46895 -79374 -126841 -208068 -152174 -56798 -35331 24953 48739 89121
4902 89121 72565 -12305 -67767 -51043 37736 -10399 -86092 -79352 -95675 -71146 -4749 -78618
4890 -78618 -134883 -178133 -208696 -118263 -17702 -48555 -114030 -97287 -67580 -28118 -9079 46185
4878 46185 43145 32692 112798 74901 7520 -8454 -119360 -153491 -118032 3686 6134 -12721
4866 -12721 19997 123325 113713 59751 26358 11157 -61022 -107892 -46646 -38192 -26235 -38902
4854 -38902 10389 48289 -47148 -155856 -189351 -116121 -35396 -37848 -9747 -28175 -58760 -126455
4842 -126455 -139823 -122075 -97057 2778 -13406 -87410 -92517 -69387 -44621 -46257 -25953 -66621
4830 -66621 -49895 -40943 51048 25835 -65685 -59493 -50506 -85131 -86879 -81862 -28858 2687 -7201
4817 -7201 -729 -27857 9270 105207 87518 -8744 -59184 8431 -77684 -140752 -118275 -136740
4805 -136740 -66932 76202 74810 65370 28919 97661 63686 12625 12083 53131 72764 68421
4793 68421 70930 -21878 -86170 -17641 -4295 114495 135282 79491 34989 17643 -61387 -55081
4781 -55081 42212 97676 122304 64833 -47321 -85845 -99498 -66978 -46010 -50161 -55907 3790
4769 3790 -9053 -73117 -96051 -85850 -60639 -33816 -35891 -60227 -64777 -78139 -108625 -76790
4757 -76790 -110108 -5236 94443 79721 43873 -43759 -30700 17600 15113 -60600 -92212 -97495
4745 -97495 47331 74225 11862 -34488 -34857 -19100 45128 95606 108255 100186 83115 -1737
4733 -1737 75736 138521 139500 68562 -7538 10324 14447 68926 34808 4320 8033 -24640 -30105
4720 -30105 -14355 17835 120579 101468 53615 -8770 -38032 -1706 31871 1521 -45443 -30814
4708 -30814 -18270 -18349 -32311 -55987 -95992 -81350 -86046 -137760 -40877 61503 79195 61578
4696 61578 122575 106782 82755 80846 6917 -62349 8084 78102 58905 -11153 -107730 -148494
4684 -148494 -61933 -46650 -24627 5152 38570 79917 58169 129513 170738 73213 54271 59296
4672 59296 5305 -4984 -57349 -93299 -99870 -103189 -118211 -124962 -171678 -171364 -136175 -187676 -197875
4659 -197875 -137470 -147516 -110710 -88694 -128514 -110505 -10785 -14021 -142164 -125001 -17546
4648 -17546 -36496 -61658 -70804 -19101 -35750 -46979 -30719 -22286 -8793 -26458 37341 50228
4636 50228 12363 -459 -3201 22456 58518 27520 36701 17852 -1688 58730 79148 42519
4624 42519 55085 -31098 -14297 6296 -131834 -106245 -72327 -59078 8416 -26331 -112650 -90460
4612 -90460 -7722 68652 75708 48454 -7385 -79134 -29170 38964 63296 95856 43868 15598
4600 15598 -4186 35257 -10096 -84772 -83456 -36039 12207 -28800 -100028 -142631 -132159 -163405
4588 -163405 -194132 -146367 -64138 -97530 -80584 -129351 -121089 -68658 -37252 -92817 -98830 -56321
4576 -56321 29793 81750 132105 151782 71838 -32435 -125707 -131097 -90620 -57217 -136582 -108225
4564 -108225 -86058 -95085 -66778 -35590 -20052 88046 87391 47725 17990 -61536 -133989 -98091
4552 -98091 -57360 -34605 8491 103224 109875 34112 -26970 -15322 20405 78499 4628 -47031
4540 -47031 -57920 -15371 -44177 -27118 39286 59589 84419 120526 84836 47393 9560 -70381
4528 -70381 -160489 -150689 -75690 18421 -8241 -39716 -29039 25533 12457 -59709 -136359 -142636
4516 -142636 -94776 -77187 -66348 -30704 -84476 -151099 -158127 -179455 -173862 -72609 21012 64172
4504 64172 41793 52869 105365 65713 16757 54384 40881 -113848 -158662 -142019 -116894 -71329
4492 -71329 -66651 -42217 -106171 -104356 -91681 -97232 -57981 -79669 -50346 -24937 -61987 -6556
4480 -6556 36415 27674 -10727 -41304 -39512 -29176 56410 146396 98593 72354 62975 124743 81708
4467 81708 53176 33753 981 94732 124749 136219 61956 852 -49359 -9970 -20774 -49786
4455 -49786 30090 76829 74470 20337 18014 62834 -26344 -23663 45944 8272 -11745 -18238 9532
4442 9532 9598 -5513 -6757 1621 50365 47730 7552 -71464 -20583 63103 -46362 -117315 -116447
4429 -116447 -16828 22946 -36288 -111629 -146900 -218251 -187175 -133863 -90577 -38217 -4508 59793
4417 59793 81487 22297 -7613 68586 122060 114596 140865 153720 82311 -12790 -49806 -22543
4405 -22543 20683 -36768 -65589 -35637 27831 17277 -11609 -41009 -77235 -35559 20906 57937
4393 57937 93768 -6597 -56208 -41761 -34061 -16828 35194 66288 54030 -25925 -13580 80329
4381 80329 6725 -115378 -119370 -109560 -107330 9119 -58732 -77274 33319 95545 59088 138088
4369 138088 130174 44507 58429 67825 65799 40087 3798 -20881 -29250 -46664 -19012 -69763
4357 -69763 -164215 -156866 -182917 -140546 -75813 -74858 -69706 -8302 -3343 3418 -57281 -111499 -125233
4344 -125233 -61509 -67668 -114787 -115377 -19278 34325 46024 4232 -2697 -55474 -92491 -92077 -98752
4331 -98752 -121509 -99094 -111499 13703 147254 102764 52100 18915 17693 -18357 -82232 -100989
4319 -100989 -44065 -7727 13906 2740 -49926 -92948 -106844 -123277 -104865 -105798 -120999 -147692
4307 -147692 -165644 -103409 -74048 -52068 -66907 -62550 -69714 -90730 -82701 33349 10472 5380
4295 5380 10528 -59088 -150171 -169802 -151882 -164586 -181551 -136033 -77333 -78132 -11120 33285 66586
4282 66586 116946 107432 -43239 -52312 -78984 -76770 -45356 -13919 -76573 -97058 -50334 -4344
4270 -4344 -24649 -25604 25694 32420 -5243 -51081 -90858 -105828 -64072 2307 -23135 -16548 -18858
4257 -18858 -71669 -21599 -2819 -26324 -41158 -81060 -65865 11705 13996 -24584 -45265 -66270
4245 -66270 -43487 -35673 -80833 -72245 -92867 -98229 -88371 -125347 -135534 -132305 -109732 -109649 -79555
4232 -79555 -90932 -103928 -133560 -179963 -157855 -51662 -19670 -58347 -72821 -42613 -36161 -54129
4220 -54129 -87813 -8365 42597 14108 -42466 -7525 41184 -31908 -114963 -19300 63571 2952
4208 2952 18536 7067 25412 51194 29121 83891 19388 -109165 -46999 -13471 -35773 -69784
4196 -69784 -66238 25790 50927 15438 -5233 -74708 -41549 -71267 -71853 -57481 -71716 -65780 -88895
4183 -88895 -69003 -40039 -35025 18961 45649 11972 7497 -34322 -76194 -68886 -56827 -34588
4171 -34588 -61478 -62487 -12855 -17923 -108092 -177028 -143634 -48169 53393 2156 -34482 19390
4159 19390 35447 -62203 -89530 -72770 -107208 -125839 -105876 -112640 -22141 -26389 -2877 -86305
4147 -86305 -105626 -66237 -64323 -27382 -62534 -7429 11091 16968 -13061 -14611 31158 31555 -6432
4134 -6432 -61755 -15460 9693 21842 59281 53383 -14738 -13721 -15810 -53007 36885 101476 106250
4121 106250 60126 13346 21918 57758 54363 -4489 -27537 -93064 -46543 37759 19296 5337
4109 5337 -51931 -148823 -146160 -53632 -7660 -20629 -40187 -39059 16171 26429 -10666 -33161
4097 -33161 -6616 76999 87678 -4480 -52446 -30829 46113 74596 75285 26332 29882 42421
4085 42421 25843 43148 -15480 -110156 -150322 -111427 -71307 -86784 -88886 -39561 -25114 -41760
4073 -41760 24868 -17339 -93596 -81503 -15564 38000 -39015 -105031 -40379 -106935 -167003 -142444
4061 -142444 -78315 -64907 -5420 -14611 -41323 4583 25774 9568 -48843 -79107 -12892 3486
4049 3486 63413 99669 110184 48498 6810 -11239 32406 48933 -5707 -69709 -135975 -174870
4037 -174870 -149567 -77179 -12646 -22169 -77566 -53565 -11960 -24253 35727 -3539 -93530 -109585
4025 -109585 -69452 -71030 -94119 -42604 35137 89616 56935 -32004 -56336 -132247 -109871 -53356
4013 -53356 -33703 -15312 13803 -3925 -1813 17354 2038 -33783 -18589 49408 28053 30465
4001 30465 82628 31880 -10212 24684 18680 15717 -66651 -59509 -18139 -26612 -43196 -39100 19012
3988 19012 93982 99184 88186 -4811 -36939 27391 27720 25868 5924 -1736 -18497 -72767 -86867
3975 -86867 -31741 -16833 49042 55811 29636 68209 77165 45794 -23887 -93062 -51707 -35268
3963 -35268 -65594 -59501 -21504 68457 55789 20637 -23695 45966 48719 -27419 -119533 -52486
3951 -52486 6118 48909 94700 119867 39465 -51861 -77337 -26922 1896 -7115 12186 -44254
3939 -44254 -39334 19560 36615 62026 128205 143022 171691 142492 125564 107146 20276 -9605
3927 -9605 -18243 7654 30528 -32351 -25295 47341 44237 57421 67352 106924 148179 134107 86548
3914 86548 -3890 -2284 -25859 -63614 22177 37349 -16364 -101529 -13066 6808 -39677 -54127
3902 -54127 -43742 -58590 -12844 16434 -18536 -37910 -35822 -36255 8176 24780 -7045 22451
3890 22451 42560 -20655 -24733 -53186 43107 106821 136592 91654 105120 130115 70525 16125
3878 16125 -69354 -97391 -72008 -40585 -54851 -95989 -196011 -105791 -11293 35716 21423 5461
3866 5461 10841 73565 106179 131556 142328 96284 67853 158862 146170 133199 113605 124757
3854 124757 115332 10775 -12198 -4241 22630 21182 18944 -46592 -93896 -99358 3016 65912
3842 65912 108607 21648 25625 -9688 -70558 -35059 -33684 -13538 361 -95448 -148121 -136370
3830 -136370 -100550 -56982 -47996 -23455 -60661 -141868 -185785 -180055 -123397 -113634 -22429 63872
3818 63872 93526 22079 -26794 -17017 -66091 -5518 44068 5988 -1572 -55675 -65857 -44597
3806 -44597 -68398 -129348 -41695 -41204 -73731 -43466 -27402 4120 -4982 44590 112331 54078
3794 54078 -29688 -101282 -44707 22385 38584 105134 172462 173300 116746 32748 11700 -17403
3782 -17403 64258 21637 -12156 43778 67058 43302 20220 -53341 -137345 -142704 -66414 39477
3770 39477 76213 86221 93817 57906 96660 41702 -2050 -9625 -42587 -49076 -71889 -11082
3758 -11082 855 -51456 -84799 -29103 -25177 -40112 -47915 -70505 -31112 -18098 38337 39548
3746 39548 -12844 13812 59862 114269 49902 -14237 -16380 -78762 -146330 -180418 -171867 -107825
3734 -107825 -57154 -27556 -1963 38103 37992 61419 48467 57204 -2177 -12197 -3828 -91207
3722 -91207 -64058 -15204 -43099 -36135 -34919 -51632 -36174 -51244 -96784 -128476 -104574 -73280
3710 -73280 26159 92100 105421 139310 137454 117082 107005 67731 26793 5627 -24192 -32759
3698 -32759 -96477 -76391 -79311 -139325 -135846 -139957 -152522 -88553 -54951 -48875 -21076 -43976 -53420
3685 -53420 -79767 -141705 -74728 -50505 -80817 -70031 43338 148538 190678 155336 80895
3674 80895 4170 -75426 -101102 -256 75747 45698 50571 44647 96409 142956 62613 60985
3662 60985 39644 -43 -59695 -80299 -59737 -29541 -72082 -69681 -70743 -23830 -17798 -16429 -63605
3649 -63605 -118048 -123248 -33949 -33457 28335 -39096 -119940 -141217 -173831 -185820 -99291 -58702
3637 -58702 -50825 -43959 -24785 -28593 23205 68801 70186 39621 14267 -4273 -63938 -34870 -60828
3624 -60828 -39447 -56779 -43774 1474 -9291 -65107 -66993 13814 40660 29122 25552 -51481
3612 -51481 -100137 -97663 -86130 -54487 -33837 16875 3101 5469 62842 37324 52042 70747
3600 70747 52280 -17948 -49453 -19506 20517 24301 36792 16086 8063 55336 130329 116922
3588 116922 60273 6439 38684 30510 74424 30965 -8695 10587 -48237 -72260 -31948 -1014
3576 -1014 -29798 -82036 -38158 18519 -2465 -6711 1940 110173 107768 105548 122121 147217 173807
3563 173807 120601 73825 74792 128033 71907 6712 -46708 -6296 15167 -43893 -133690 -146337
3551 -146337 -142430 -42534 -28305 -50209 3099 50231 31177 -31740 56516 154069 127047 105584
3539 105584 79269 17441 53710 88245 17680 22873 -2251 12153 14422 113086 101796 27577
3527 27577 76986 152038 92420 52130 -11775 -9624 31457 21980 -34514 -20361 -10759 44490
3515 44490 97931 99560 54954 106672 141745 98812 24568 -25637 24444 12925 -37391 -22364
3503 -22364 23779 70731 105773 96592 72582 76421 74853 95292 138618 118064 103573 146485
3491 146485 122145 107931 59763 2909 -55952 -37403 -63186 -67856 -62927 -115626 -85741 41148
3479 41148 108476 44702 53787 31363 -29355 -104636 -74180 -28107 58802 59965 129760 148816
3467 148816 41698 -80727 -136484 -153527 -68763 -55190 -11002 -32045 -16644 -83032 -62754
3456 -62754 -59080 -84290 -97120 4274 31771 -10850 -120472 -138195 -97910 -136338 -71126 -21619
3444 -21619 -35088 -16569 25217 68282 122400 125574 86015 24707 31733 8902 37337 33912
3432 33912 17760 -863 -42692 -52501 -4261 68953 74216 51990 125928 133026 115731 96805
3420 96805 112712 96061 139101 126669 81899 72253 50980 979 2361 58733 133841 151992
3408 151992 168546 104104 7614 25882 27247 -58976 -68931 -4997 -48947 -66237 -59389 -93501
3396 -93501 -145629 -112339 -21176 -15873 3511 17417 17530 28145 27499 56422 122035 74517 19244
3383 19244 -16437 -19282 -13788 66448 97667 72531 67282 24670 -18210 -91592 -74420 -74164 -89135
3370 -89135 -142282 -91849 -47093 -49475 -73008 -61736 -66318 -85338 -142069 -52080 14008 -20324
3358 -20324 -13387 -42816 -38820 -42257 -40561 -37361 -38527 29711 -17585 -70693 -29604 13573 56874
3345 56874 63283 78763 9433 -38945 18830 79689 93055 166238 201969 108104 -3031 -94254
3333 -94254 -151438 -134121 -85162 -23991 83062 61482 19744 745 20008 98467 102843 48767
3321 48767 -29351 12568 95049 125980 142402 140824 112273 93768 95012 117356 123732 58282
3309 58282 -10764 -14431 -79759 -90102 -98528 -22609 786 -64161 -26990 -6553 -31260 11462
3297 11462 -26847 -23969 35878 49356 67625 90580 78571 82156 -2879 -100001 -77289 -72219
3285 -72219 -50102 12808 28681 70034 66192 34609 39413 -62942 -138579 -152723 -206679 -138150
3273 -138150 -78215 -44951 -89791 -90050 -37314 -8415 -31640 24919 33119 7676 -34853 -111277
3261 -111277 -37410 -7940 -70165 -7875 -19690 -116922 -155384 -104185 -119226 -123355 -78477 2622
3249 2622 14660 7702 -21062 -23788 -11315 -52609 -66606 53556 195403 135336 123872 114812
3237 114812 74440 10372 -32980 10930 -37282 -49700 -916 62208 -15618 -81535 -91416 -89033
3225 -89033 -96640 -44654 -14206 27306 9113 -67702 55796 97951 17307 15943 68145 69149
3213 69149 71262 51036 -46882 20884 100594 96960 126186 122386 39234 4745 13259 -40950 -94065
3200 -94065 -18363 31907 16819 6275 46835 58224 -54738 -130396 -67400 5732 -9217 -92695
3188 -92695 -49801 -28982 825 -46530 -59260 -65518 6396 3949 -22623 -65669 -98713 -46581
3176 -46581 34553 23941 78146 72104 68633 88816 44852 -20862 -42865 -13210 7209 141584
3164 141584 177808 44489 -25317 4205 54414 -18130 -91934 -153311 -140419 -66331 -42938
3153 -42938 35724 52190 13093 -40680 -90791 -118206 -157364 -198850 -166440 -160510 -52826 29817
3141 29817 81444 87382 54009 -11443 -60371 -30702 -14500 40747 26876 10058 -251 -22251
3129 -22251 -40351 25132 -35423 10518 9950 -18134 1973 -16292 -17500 -47134 17788 24453 90440
3116 90440 73284 40867 -3624 73054 123034 171421 197257 88749 105174 184258 142675 108207
3104 108207 90041 43932 43722 39401 24887 -22472 8171 -58221 -17079 -57031 -18653 74628
3092 74628 108086 127321 95150 34068 -46745 -34778 -24081 14990 43329 44209 67373 69220
3080 69220 60854 38697 31849 47122 68989 67134 -26116 32967 67919 88994 78256 91607
3068 91607 143974 200621 220016 212255 210860 200833 186858 129414 85487 95662 126129 53871
3056 53871 46126 47635 -26067 -93397 -89303 -89296 -96543 -19608 41944 2395 36845 21291 -72421
3043 -72421 -99739 -56170 -32669 -55605 4644 -19224 -41104 -18003 17030 -8747 -1258 -18769
3031 -18769 -141070 -141159 -54922 -5319 3380 29883 7123 -92394 -59768 -14429 -84223 -94985
3019 -94985 -117718 -121217 -90475 -114786 -133405 -77684 -112598 -62702 -55541 -96112 27903 52619
3007 52619 -42352 -88577 -49237 32526 38248 14007 30155 16201 8397 -2518 -60710 -68930
2995 -68930 -39285 -72851 -51649 14547 43762 10512 -30118 -103467 -75672 -156019 -143182 -81018
2983 -81018 -74572 -137532 -83943 -2459 -29385 -23921 4914 -50399 -25915 -7253 56846 55006
2971 55006 -19121 4683 41801 75579 -40781 -75377 -67995 -85227 2307 66110 59877 -16702
2959 -16702 20471 34667 38252 60771 13385 -3408 -2856 -19009 -79784 -105655 -66109 -104503
2947 -104503 -170854 -100112 -28416 -10583 -101935 -145457 -88594 -17834 -10265 -18911 -14982 1240
2935 1240 5545 2863 48428 90149 58576 -37701 -127412 -165516 -118819 -85475 -65978 -43897
2923 -43897 -30991 9988 7774 -33924 -82668 -54696 23445 65070 -343 -16686 -1089 -95578
2911 -95578 -105813 -11710 19564 5905 -54197 -1102 58 -51137 -47046 -79384 -76513 -86793
$$ [...]
##END NTUPLES=NMR SPECTRUM
##END=
