##TITLE=Analysis number 307928
Compound Code cc 23604
Book Reference 399/153
Project Code adrs
Chemist Name evam
##JCAMPDX= 6.0         $$ Bruker NMR JCAMP-DX V2.0
##DATA TYPE= NMR SPECTRUM
##DATA CLASS= NTUPLES
##ORIGIN= Bruker BioSpin GmbH
##OWNER= NMR
$$ XWIN-NMR		Version 3.5
$$ Tue May 17 12:45:02 2005 GMT Daylight Time (UT+1h)  MAYBRIDGE\NMR@NMR_250MHZ
##.OBSERVE FREQUENCY= 250.131544655141
##.OBSERVE NUCLEUS= ^1H
##.ACQUISITION MODE= SIMULTANEOUS (DQD)
##.ACQUISITION SCHEME= undefined
##.AVERAGES= 16
##.DIGITISER RES= 18
##SPECTROMETER/DATA SYSTEM= dpx250
##.PULSE SEQUENCE= zg30
##.SOLVENT NAME= CDCl3
##.SHIFT REFERENCE= (INTERNAL, CDCl3, 0, 16.522)
##AUDIT TRAIL= $$ (NUMBER, WHEN, WHO, WHERE, WHAT)
$$ ##TITLE= Audit trail, XWIN-NMR		Version 3.5
$$ ##JCAMPDX= 5.01
$$ ##ORIGIN= Bruker BioSpin GmbH
$$ ##OWNER= NMR
$$ C:\u/data/dgb/nmr/ADRS/3050/pdata/1/auditp.txt
$$ ##AUDIT TRAIL=  $$ (NUMBER, WHEN, WHO, WHERE, WHAT)
(   1,<2005-05-17 12:44:39.18 +100>,<MAYBRIDGE\NMR>,<NMR_250MHZ>,
      <created by zg, POWCHK disabled, PULCHK disabled
       configuration hash MD5:
       62 19 C7 07 E1 42 D1 B7 37 6C 3D D0 77 39 F9 E6
       data hash MD5: 64K
       43 5A EE 23 4A B5 7A 83 DF 36 15 D6 9A 7A AF 1C>)
(   2,<2005-05-17 12:44:52.51 +100>,<MAYBRIDGE\NMR>,<NMR_250MHZ>,
      <Start of raw data processing
       ef LB = 0.3 FT_mod = 6 PKNL = 1 SI = 32K 
       data hash MD5: 32K
       1B 42 5C 06 E0 A4 D3 5F 02 BA EB C5 E9 0D 8F 7D>)
(   3,<2005-05-17 12:44:54.20 +100>,<MAYBRIDGE\NMR>,<NMR_250MHZ>,
      <apk 
       data hash MD5: 32K
       AB 1D 98 72 17 0C 38 6E EE 50 86 A8 FB 69 F6 0B>)
(   4,<2005-05-17 12:44:55.02 +100>,<MAYBRIDGE\NMR>,<NMR_250MHZ>,
      <abs ABSG = 5 
       data hash MD5: 32K
       87 3C D7 22 4A B1 02 EC 3E 2F 3E 88 1E A1 AE F4>)
$$ ##END=
$$ 
$$ hash MD5
$$ AE F2 EC EF B4 63 95 F1 4B 4A F8 BC 97 08 D0 4B
##$RELAX= 
##$RELAX= 
##$RELAX= 
##$RELAX= 
##$RELAX= 
##$RELAX= 
##$RELAX= 
$$ Bruker specific parameters
$$ --------------------------
##$DU= <C:\u>
##$EXPNO= 3050
##$NAME= <ADRS>
##$PROCNO= 1
##$TYPE= <nmr>
##$USER= <dgb>
##$AMP= (0..31)
100 100 100 100 100 100 100 100 100 100 100 100 100 100 100 100 100 100 
100 100 100 100 100 100 100 100 100 100 100 100 100 100 
##$AQSEQ= 0
##$AQ_mod= 3
##$AUNM= <au_zg>
##$AUTOPOS= <32 >
##$BF1= 250.13
##$BF2= 250.13
##$BF3= 250.13
##$BF4= 250.13
##$BF5= 500.13
##$BF6= 500.13
##$BF7= 500.13
##$BF8= 500.13
##$BYTORDA= 1
##$CFDGTYP= 0
##$CFRGTYP= 5
##$CHEMSTR= <none>
##$CNST= (0..31)
1 1 145 1 1 1 1 1 1 1 1 1 1 1 1 1 1 1 1 1 1 1 1 1 1 1 1 1 1 1 1 1 
##$CPDPRG= <>
##$CPDPRG1= <>
##$CPDPRG2= <>
##$CPDPRG3= <>
##$CPDPRG4= <mlev>
##$CPDPRG5= <mlev>
##$CPDPRG6= <mlev>
##$CPDPRG7= <mlev>
##$CPDPRG8= <mlev>
##$CPDPRGB= <>
##$CPDPRGT= <>
##$D= (0..31)
0 1 0 0 0 0 0 0 0 0.06 0 0 0 0 0 0 0.0002 0 0 0 0 0 0 0 0 0 0 0 0 0 0 
0 
##$DATE= 1116330278
##$DBL= (0..7)
120 120 120 120 120 120 120 120 
##$DBP= (0..7)
150 150 150 150 150 150 150 150 
##$DBP07= 0
##$DBPNAM0= <>
##$DBPNAM1= <>
$$ [...]
##$SUBNAM7= <"">
##$SUBNAM8= <"">
##$SUBNAM9= <"">
##$SW= 20.6930455092707
##$SWIBOX= (0..15)
0 0 3 0 0 0 0 0 0 0 0 0 0 0 0 0 
##$SW_h= 5175.983436853
##$TD= 65536
##$TD0= 1
##$TE= 296.16
##$TE2= 300
##$TE3= 300
##$TEG= 300
##$TL= (0..7)
0 120 120 120 120 120 120 120 
##$TP= (0..7)
150 150 150 150 150 150 150 150 
##$TP07= 0
##$TPNAME0= <>
##$TPNAME1= <>
##$TPNAME2= <>
##$TPNAME3= <>
##$TPNAME4= <>
##$TPNAME5= <>
##$TPNAME6= <>
##$TPNAME7= <>
##$TPOAL= (0..7)
0.5 0.5 0.5 0.5 0.5 0.5 0.5 0.5 
##$TPOFFS= (0..7)
0 0 0 0 0 0 0 0 
##$TUNHIN= 0
##$TUNHOUT= 0
##$TUNXOUT= 0
##$USERA1= <user>
##$USERA2= <user>
##$USERA3= <user>
##$USERA4= <user>
##$USERA5= <user>
##$V9= 5
##$VALIST= <valist>
##$VCLIST= <CCCCCCCCCCCCCCC>
##$VD= 0
##$VDLIST= <DDDDDDDDDDDDDDD>
##$VPLIST= <PPPPPPPPPPPPPPP>
##$VTLIST= <TTTTTTTTTTTTTTT>
##$WBST= 1024
##$WBSW= 4
##$XGAIN= (0..3)
0 0 0 0 
##$XL= 0
##$YL= 0
##$YMAX_a= 379817
##$YMIN_a= -423540
##$ZGOPTNS= <>
##$ZL1= 120
##$ZL2= 120
##$ZL3= 120
##$ZL4= 120
##$ABSF1= 16.522
##$ABSF2= -4.171173
##$ABSG= 5
##$ABSL= 3
##$ALPHA= 0
##$AQORDER= 0
##$ASSFAC= 0
##$ASSFACI= 0
##$ASSFACX= 0
##$ASSWID= 0
##$AUNMP= <proc_1d>
##$AZFE= 0.1
##$AZFW= 0.1
##$BCFW= 0
##$BC_mod= 0
##$BYTORDP= 0
##$COROFFS= 0
##$CY= 12.5
##$DATMOD= 1
##$DC= 0
##$DFILT= <>
##$DTYPP= 0
##$F1P= 14.0000005364418
##$F2P= -0.99999901652339
##$FCOR= 0.5
##$FTSIZE= 32768
##$FT_mod= 6
##$GAMMA= 0
##$GB= 0
##$INTBC= 1
##$INTSCL= 1
##$ISEN= 128
##$LB= 0.3
##$LEV0= 0
##$LPBIN= 0
##$MAXI= 10000
##$MC2= 0
##$MEAN= 0
##$ME_mod= 0
##$MI= 0
##$NCOEF= 0
##$NC_proc= -2
##$NLEV= 6
##$NOISF1= 0
##$NOISF2= 0
##$NSP= 0
##$NTH_PI= 0
##$NZP= 0
##$OFFSET= 16.522
##$PC= 1
##$PHC0= -72.01511
##$PHC1= 4.97755
##$PH_mod= 1
##$PKNL= yes
##$PPARMOD= 0
##$PSCAL= 4
##$PSIGN= 0
##$REVERSE= no
##$SF= 250.13
##$SI= 32768
##$SIGF1= 0
##$SIGF2= 0
##$SINO= 400
##$SIOLD= 32768
##$SREGLST= <1H.CDCl3>
##$SSB= 0
##$STSI= 32768
##$STSR= 0
##$SW_p= 5175.98343685301
##$SYMM= 0
##$S_DEV= 0
##$TDeff= 65536
##$TDoff= 0
##$TI= <Analysis number 999999
Compound Code 99
Book Reference 9
Project Code 9>
##$TILT= no
##$TM1= 0
##$TM2= 0
##$TOPLEV= 0
##$USERP1= <user>
##$USERP2= <user>
##$USERP3= <user>
##$USERP4= <user>
##$USERP5= <user>
##$WDW= 1
##$XDIM= 32768
##$YMAX_p= 319768738
##$YMIN_p= -60742
$$ End of Bruker specific parameters
$$ ---------------------------------
##NTUPLES= NMR SPECTRUM
##VAR_NAME=  FREQUENCY,     SPECTRUM/REAL,   SPECTRUM/IMAG
##SYMBOL=    X,             R,               I
##VAR_TYPE=  INDEPENDENT,   DEPENDENT,       DEPENDENT
##VAR_FORM=  AFFN,          ASDF,            ASDF
##VAR_DIM=   32768,         32768,           32768
##UNITS=     HZ,            ARBITRARY UNITS, ARBITRARY UNITS
##FACTOR=    0.157963299565203, 1,           1
##FIRST=     4132.6476996994, 0,             0
##LAST=      -1043.33573715361, 0,           0
##MIN=       -1043.33573715361, -60742,      0
##MAX=       4132.6476996994, 319768738,     0
$$ Real data points
##PAGE= N=1
##DATA TABLE= (X++(R..R)), XYDATA
$$ [...]
23768 -8838 -1683 2736 -9951 -16286 -10699 -7842 995 9054 2293 944 -5244 -10794 -14519 -10115
23754 -10115 -15710 -17872 -17999 -31000 -34903 -29585 -36742 -22678 -6967 -435 -2669 -2970 10967 15280
23740 15280 13364 4966 4208 11903 593 -6360 -138 5144 3286 15515 18079 19404 -4994 -8879
23726 -8879 -20239 -12321 -11402 -6450 -4833 -10818 -14213 -5799 -6960 -15702 -11295 -12381 -24119 -35012
23712 -35012 -23282 -9288 -10066 4395 7 -18845 -20576 -9693 -3597 -1637 -10922 -5953 -6949 -9925
23698 -9925 -21137 -24594 -20111 -23746 -18075 -3257 9723 -5344 -5576 -2151 -1908 -10567 -12137 6453
23684 6453 18382 20719 27385 22791 -2707 -6241 -3556 -9004 -17507 -21315 -25195 -18720 -5155 -3141
23670 -3141 -555 9809 8473 4410 -5756 5966 2709 -5012 -4776 94 -4169 3978 7312 6784
23656 6784 3563 -2140 -1970 2239 2367 -6410 -19823 -12801 -17131 -12959 -1175 -15361 -26150 -32686
23642 -32686 -27315 -23324 -19497 -31122 -27567 -17786 -13505 -14978 -7862 -2691 -8537 -4330 -18200 -24612
23628 -24612 -18095 -16227 -22826 -17670 -5987 12061 16590 12505 2778 -6682 -29016 -24874 -7571
23615 -7571 2267 -11567 -27182 -18610 -18507 -9806 4683 15224 12376 17063 12160 7104 -2583 -5260
23601 -5260 -11202 -11857 -4534 7029 7393 9895 10918 9826 5008 1646 -600 -3527 -3296 5385 6186
23586 6186 5943 5905 10445 20934 21509 29068 28741 24032 10520 -2687 -3524 3307 6481 2892 -4489
23571 -4489 -9310 -4895 1623 9081 8641 6184 1534 3204 3075 1541 5509 2027 4510 2328 5133
23556 5133 -3032 11196 29920 24803 27560 26704 16891 -1452 -2776 4331 7549 1400 -9673 -15197
23542 -15197 -16931 -18456 -16322 -8747 -14621 -21831 -32961 -21341 -2146 10977 21438 25247 23489
23529 23489 14122 3579 -1889 -9521 -18987 -15610 3863 7872 8374 -6208 -9351 -3821 1850 13432
23515 13432 12265 14142 -1216 -16101 -24794 -24192 -11599 3358 9385 -596 -10263 4179 5574
23502 5574 -4873 -20154 -6050 -63 884 9994 1973 -12277 -13461 -5542 -12640 2588 8381 -1486
23488 -1486 -6136 -15291 -22614 -18025 -13914 -7245 -7633 -4947 -1661 3152 17595 21015 29685 45531
23474 45531 40044 32916 27567 16278 5897 8609 11636 9326 -1648 -13098 5396 20455 19429
23461 19429 1793 -11604 -609 12042 13723 11224 11392 -8759 -25416 -28304 -31141 -32959 -17805
23448 -17805 -12824 -7183 -13220 -14174 -8587 9177 15033 -614 -11591 -1699 5122 -2023 -11470 4375
23434 4375 13882 1822 -10430 -13901 -14323 -15133 -13194 -7280 -6226 -7970 1284 -4078 -5062 9154 12298
23419 12298 2388 -11678 464 2827 3643 -2584 5015 11182 14216 4582 -1680 4732 2302 -5370
23405 -5370 -7237 2688 11754 5347 7963 5764 -1216 -13683 -16811 -23206 -23993 -16684 1952 -6528
23391 -6528 -9738 538 7562 -222 -3936 194 -2777 -20642 -4641 -5760 -9570 -8633 -4206 -12984
23377 -12984 2810 12091 9330 -1019 -12901 -8583 -6920 -1601 9007 14221 14316 5860 -7998 -6079
23363 -6079 12894 21665 23039 16362 5930 -7574 -9578 6069 36856 29331 11051 15789 12868
23350 12868 4358 5264 -5811 -4454 -2402 -4273 -14967 -23508 -25967 -18654 -15927 -4060 -14220 -12537
23336 -12537 -5397 5207 6442 438 -11822 -20956 -11837 4819 2409 9728 8535 11226 8165 3993
23322 3993 -19387 -23444 -20041 -22103 -10732 3757 6004 -3486 -12655 -11940 4415 8322 3687 3594
23308 3594 181 -5093 10359 15145 8664 -7051 -11587 -8303 3501 5861 2036 6998 7955 -9882
23294 -9882 -22987 -16930 -16265 -7999 -4565 8075 21935 26419 22613 9213 -7922 -2661 10382
23281 10382 7963 -3926 -6951 -15153 -9379 -15165 -17281 -19393 -13733 -13780 835 952 -5003 11623
23267 11623 20605 6987 -4247 7242 15119 2636 2808 -1793 -15510 -20139 -14663 -9881 1941
23254 1941 12353 7283 5563 28391 27126 15172 9438 6013 -8251 -2967 -2754 1894 8133 590
23240 590 -8192 -5566 -6269 -13759 -13521 -1823 4674 18150 13589 14832 2418 -6446 -13752 -7844 -1343
23225 -1343 744 -357 -2895 -10218 -7997 -9855 -7406 -2713 -1300 -10121 -2623 -7335 -24564 -22565
23211 -22565 -24996 -24958 -14654 -11593 -14765 -12653 -12360 -10118 -10431 -2377 9134 7195 -10690 -4598 -10342
23196 -10342 -11327 -10917 -4999 1705 -1362 5534 9160 18553 7558 17046 20424 -2918 -13632 -7578
23182 -7578 10451 1566 -2147 808 -5676 -4391 -3624 -8257 3058 -4449 -9439 4371 11877 5385
23168 5385 -6522 -5474 -5777 -2612 2694 6770 336 -2815 -2627 -7275 -5563 -5806 -18102 -23745 -20425
23153 -20425 -19150 -10191 -15394 -13728 -16235 -17767 -8285 -8906 -25282 -31827 -21713 -12200 -10098 -14323
23139 -14323 -17227 -13053 -2123 4208 -1415 -10894 -8124 -11273 -9556 -6404 2307 14714 18837 9315
23125 9315 3880 -804 1662 9311 10539 -2044 -9705 -7829 -575 7907 9888 10616 -245 -11644
23111 -11644 -25196 -36654 -34677 -13475 -1421 -8496 6564 14627 11673 -10070 -21731 -23372 -10545
23098 -10545 -10743 -26001 -12434 -6687 -9802 2485 14511 16895 18966 7050 -2662 992 14126
23085 14126 8236 6769 3683 -6755 -15157 -20519 -18295 -23060 -14592 -6565 -12005 -6708 7379 5682
23071 5682 -18034 -32769 -19702 -11592 -11877 -29007 -44748 -34938 -26133 -8585 9958 18110 1304
23058 1304 -4567 -9749 -17082 -8751 -4908 -6589 -11480 -29531 -34181 -18169 -10196 -7195 -15840 -9860
23044 -9860 -8882 142 2628 17575 24376 17401 11080 720 -2857 -5655 -15093 -23944 -19495 -7362
23030 -7362 6566 18264 14410 21490 18321 12552 725 -806 2704 5033 -7416 -12767 5212
23017 5212 13638 21032 30096 20336 12220 66 4234 -4369 -5546 13975 15722 17605 22065 23804
23003 23804 10423 -2432 -2344 804 -312 5908 10987 7547 1874 -20928 -25851 -7283 -5410 -3609
22989 -3609 -2759 -19588 -35595 -34969 -21983 -19613 -16577 -7097 -2571 3164 4534 11506 20545 5042
22975 5042 -4631 -13593 -20781 -4472 -6087 -3818 -3422 2457 2409 -18844 -27699 -15136 3253 11976
22961 11976 -1826 -10369 -7879 -1373 -2731 -7619 -7319 -5775 -540 6925 5776 3253 -3472 1584
22947 1584 -12522 -1538 9340 13104 -1048 -19504 -10625 -5552 -6237 -6600 -1478 8278 8552 14400
22933 14400 2565 520 9894 14240 11310 -1372 -11322 -8148 -6643 -6869 -7681 -7039 -414 -791 -9568
22918 -9568 -14762 -11338 -2395 1522 10907 8763 2779 -412 -12724 -19702 -7609 -12445 990 -2299
22904 -2299 -13543 -1099 117 2524 11298 15483 10954 15780 20852 27339 16810 6001 -825 5449
22890 5449 -419 -5378 -10558 652 19166 14719 4708 -4625 -1686 8135 -1134 -6657 -11505 -18854
22876 -18854 -9763 2771 7526 813 8411 -7890 -13024 2302 -480 7464 3565 -9869 -3
22863 -3 9033 944 9107 26973 17749 -917 -3545 -1531 -4543 -1137 3686 5875 -10230 -22777
22849 -22777 -17661 -20664 -14872 -17887 -5780 13665 22869 19351 5314 378 -2886 -8953 -19394
22836 -19394 -10850 2482 17175 -10745 -16566 -12828 -15396 -12278 -10358 -12040 -31040 -23365 -587
22823 -587 773 -2400 4799 2429 -599 4962 -904 -9440 -8185 -4848 -13462 -19004 -23288 -28388 -22458
22808 -22458 -10303 -13719 -734 2646 12980 15685 19872 13423 4911 -9376 -14998 2453 7127
22795 7127 5965 7454 2194 -5327 -11799 -16146 -8511 4008 4064 2919 10517 -392 -22705 -19260
22781 -19260 -17209 -13746 -10664 -11364 5081 5322 5960 11025 6233 442 2065 6202 -101 -22150 -26765
22766 -26765 -40441 -32515 -33689 -36565 -32265 -24044 -21245 -21975 -11944 6295 16198 7917 -16466 -27294
22752 -27294 -31869 -22251 -14234 -17310 -11952 -9347 -17229 -17912 2432 7346 954 1195 6121 17077
22738 17077 -5218 -24138 -15508 -10601 -2592 4944 1453 8614 14691 18874 -1101 -12466 -8514
22725 -8514 -13168 -11109 2671 11607 9086 16799 12856 -1062 -9339 -4698 -13144 -10318 2444 6561
22711 6561 -347 -10461 -13175 -24712 -23353 -12857 -5254 -6056 5392 -276 3265 -3195 -5318 10993
22697 10993 16851 9466 8973 -1689 -1972 -1639 -6257 -14276 -22202 -25795 -11744 -1041 -6269 -2676
22683 -2676 10038 6100 868 7269 20349 39823 23326 1429 6081 10633 4133 -16018 -14673
22670 -14673 -10251 1680 10387 -766 -3286 -2611 -11742 -17298 -8778 -914 6049 7615 -1042 6388
22656 6388 17442 17804 6821 2120 3844 134 -147 -17346 -15319 -6404 15311 10537 15924 9811
22642 9811 5627 24008 30992 23615 9952 16791 24085 26966 16497 22813 47395 83881 121714
22629 121714 169206 224729 286360 337177 374352 385530 405734 422948 423663 409199 375812 308366
22617 308366 246091 197181 149435 111884 85952 75165 63627 49720 34761 21437 8981
22606 8981 631 6639 15723 12922 8102 6934 4169 -10447 -22659 -4181 14496 387 -18497
22593 -18497 -10911 -12004 -5949 -12693 -32952 -35374 -18371 -7431 -8928 -1780 12267 15680 11915
22580 11915 1377 -1700 -5058 -9589 -2679 15136 25142 21722 11262 -2688 -12507 -12703 -20025
22567 -20025 -25843 -20575 -13442 -27288 -38814 -36594 -31839 -22048 -15720 -2629 10134 32621 40087
22554 40087 30391 13576 10194 5747 3884 9732 -7147 -13978 -10145 -9766 -12499 -2619 -11611 -10699
22540 -10699 -3758 -5325 -12803 -8955 -7934 924 -4408 -12218 -22139 -26735 -22382 -12042 -13934 -14254
22526 -14254 -10302 -21237 -32727 -20805 -6606 4108 9005 8899 -2263 -15704 -21643 -26022 -2904
22513 -2904 3033 -4156 -1053 12880 21774 13422 -10384 -20319 -13128 -19362 -24099 -14095 -13481 -19356
22499 -19356 -13889 -3607 -15338 -17494 -15147 2890 19847 15894 3334 3665 6966 -1637 -17036
22486 -17036 -3312 1838 -8162 -21316 -29956 -5757 21918 4410 -11229 -12507 -8602 3527
22474 3527 18768 20780 19609 15419 13849 21444 24893 26729 25084 25814 32350 21367 11248 6030
22460 6030 3808 -2280 -4182 -7829 -3301 1250 -2407 840 -8194 -10209 -18915 -17836 -70 13128
22446 13128 -1123 -20315 -29322 -16467 -13858 -7661 -6434 -13939 -2938 1755 988 -5430 -6497 -754
22432 -754 1676 -5843 -18083 -16491 -14532 -26682 -38423 -23045 -7860 -5339 -8639 -20598 -30879
22419 -30879 -51470 -51666 -45390 -35913 -31210 -7498 5103 587 313 -2739 3956 5860 13117 15695
22405 15695 6330 17042 38313 38500 34619 39896 32696 19165 9149 -7615 -12088 -9610 -6867
22392 -6867 -19436 -19639 -14349 -16192 -18331 -14792 -13410 -6463 1045 21836 24921 19775 13236 7660
22378 7660 -107 2831 1025 5403 404 3204 -2831 -9601 -3947 -12560 -11805 -19417 -23106 -10397 7586
22363 7586 17994 18536 17189 23140 27612 18365 9820 5198 11998 15376 16013 9015 8747 19014 17151
22348 17151 17599 12731 7141 6800 2351 -718 -2748 -13969 -18292 -4739 1643 9630 5063 265
22334 265 -5802 -12738 -11194 -5766 -4221 -252 1772 16601 24116 12668 16681 30618 40152 42131
22320 42131 29656 29491 20495 3771 -7283 -8434 -2378 12516 11970 8984 5257 15171 11856 5254
22306 5254 9926 14952 16647 17259 16455 24717 22756 35140 34415 14487 9644 16131 12786 4036 2407
22291 2407 3881 6360 8991 12270 10046 7723 15168 15239 2730 -9967 -11926 -15893 -14649 -6580 -15514
22276 -15514 -9821 -10941 -14582 -10188 -2258 -15201 -16701 -8973 -8705 -12477 -7873 7730 11774 -8326
22262 -8326 -22586 -22091 -24933 -23966 -25824 -16822 -15588 -8083 -3380 7525 38220 41998 24365 17809
22248 17809 20751 30246 23955 22558 29675 28130 25560 29858 22407 23514 24408 19585 14559 14672 9138
22233 9138 11636 14665 28721 25904 18530 22572 20492 10698 11419 15495 28611 36724 47504 53312
22219 53312 58521 52394 40736 43334 43526 29474 30672 28985 10231 15480 23534 36826 45024 52830
22205 52830 40182 25678 13912 13060 18865 13154 23840 38894 46121 37938 49849 77593 95038
22192 95038 107500 122042 121480 109046 98237 96975 100322 96346 96292 99920 88163 75496 79942 74112
22178 74112 62739 78335 96463 89100 80188 89146 112788 132029 144914 162663 210334 264277
22166 264277 327553 378306 419761 447732 468247 487660 490580 466613 438117 369381 298908 235713
22154 235713 191874 165072 148321 135695 114531 104489 105958 95521 108433 121165 120389 124096
22142 124096 131947 138591 132529 135421 133838 139419 147037 151201 147933 146779 150122 149597 155715 149614
22128 149614 160617 164287 174133 188562 198963 191082 190179 177656 175865 199822 211483 209454 221827
22115 221827 232579 239458 252522 278577 280647 300531 326079 351234 348280 352117 364538 395617
22103 395617 428394 461620 481036 506354 555144 580282 602966 645093 692605 736020 783991
22092 783991 844050 915996 998197 1097797 1208585 1311148 1442289 1605183 1794317 2028968
22082 2028968 2330316 2706009 3177378 3747081 4479119 5435578 6746135 8606504 11314674
22073 11314674 15302405 21281895 29954784 41366171 53832120 64046229 69806165 71921651
22065 71921651 73022768 74893378 76732976 75680692 69720359 59774045 48504969 38137246
22057 38137246 29628980 23026821 18018506 14233387 11367331 9232082 7625347 6358229
22049 6358229 5363834 4561527 3930789 3415815 2985833 2640942 2348550 2110908 1896484
22040 1896484 1702492 1537775 1406205 1291111 1196451 1111917 1044735 977696 912731 854099
22030 854099 780456 740821 701543 650265 595779 557840 544969 533240 504256 469183 447839
22019 447839 439710 441625 436689 419517 405421 382707 357875 364526 371156 378351 361566 324360 310774
22006 310774 316584 296264 291289 289132 269454 268637 273050 253234 218659 199401 184757 176262 170059
21993 170059 165354 163114 156759 164152 165858 176267 180064 187533 188054 186080 171272 172029 174892 181921
21979 181921 190827 192005 199322 195076 206556 224879 270315 328955 407511 467636 490574 515513
21967 515513 520711 515481 532151 540800 523217 487385 431098 363286 298746 250632 222140 196333
21955 196333 180330 159125 144145 133829 122873 129721 121638 106016 92280 85603 88349 84011
21943 84011 85245 74588 58090 60200 55182 60223 56255 52000 52752 55105 60861 73993 62073 66659
21929 66659 72076 83191 77978 64923 53481 53365 55355 52718 36246 36552 45797 47582 35575 47489
21915 47489 45676 36491 39912 36137 34298 32138 27275 38594 35010 30788 35828 27758 40051 49800
21901 49800 46118 44359 33594 27398 34235 26878 28994 26716 15658 22352 23511 19467 3590 -1451
21887 -1451 24021 40616 42392 36357 18227 19390 37750 37996 36280 44053 59368 60307 59186 46625
21873 46625 39783 48770 50162 45367 33321 43051 52836 53812 45108 31911 11657 21255 35737 36332
21859 36332 48115 49428 47115 46879 36745 35809 28636 26999 24194 28632 29282 29453 22140 23186 18726
21844 18726 16834 12387 13840 16046 24541 29509 40878 36824 24787 27215 22423 20923 27693 32737
21830 32737 35868 36766 39620 27067 9032 17040 29665 30164 28884 36964 28569 36260 40732 36344
21816 36344 35158 36872 17196 -353 6925 13770 27477 23877 31191 22172 4240 -2823 -10332
21803 -10332 -5916 -7274 -11991 -17121 -7412 -8786 3452 9183 1480 -2747 8817 17295 19028 19381
21789 19381 10076 3164 10777 21493 17692 9512 3459 -1452 10931 11984 20447 20576 8790 4347
21775 4347 7573 -4319 -4243 7725 6705 -702 -4816 -7866 6926 7938 4965 1578 7952 6594
21761 6594 -2566 -3290 -11079 -14010 -19789 -13145 -5221 -7632 1839 10440 22966 32021 29707 9638
21747 9638 -968 -13823 -16589 -17838 -17109 6892 16173 11121 3911 2434 -3352 -3010 -9196 -6728
21733 -6728 841 11740 -828 11830 20540 8101 -6598 -11117 -12029 -9934 8514 6401 -2184
21720 -2184 4519 -4611 -7265 -2415 8294 8854 -2616 1444 13170 13032 20604 35011 32537 28995
21706 28995 34056 33033 32773 27588 26304 31123 25606 18999 11184 13603 1890 9408 20525 21245
21692 21245 4047 6430 15973 11268 4324 22398 28420 30956 23452 9775 13730 13370 16116 18773
21678 18773 19823 15518 19380 18665 3123 9777 10455 14010 11010 4817 6974 1470 -12381 -7109
21664 -7109 -5199 3019 -514 -1048 5249 6564 18499 18654 10021 9771 15983 16149 4334 -6472 121
21649 121 6811 7243 6009 12773 3524 -711 6273 16147 855 -18079 -22806 -18039 690 14564
21635 14564 10612 11858 21977 27972 30382 26982 12678 -9901 -7971 2903 -2213 -1171 10820
21622 10820 3450 -4101 2888 2473 -4299 -4640 -17089 -21475 -12019 -3592 -527 -12110 1934 2062
21608 2062 3078 134 2476 9118 2715 -12986 -10350 1023 5048 8298 4008 -1831 -495 5916
21594 5916 10138 16748 15750 8241 15891 21692 15676 2968 -347 12183 17880 29586 19098 12098
21580 12098 15749 13514 30499 42601 45141 31975 8677 -1225 3836 13163 25057 21946 16945
21567 16945 20326 25092 10062 -5905 -6934 -167 1685 -8585 -19230 -25736 -22440 -3422 -6236
21554 -6236 -6828 -12703 -26400 -22972 -17491 -27123 -31480 -25777 -14971 -6331 2753 -8032 -9788 -5051
21540 -5051 4610 13362 19142 13273 -5683 -15218 -8219 -9756 -4645 -9709 -17648 -10881 1664 12177
21526 12177 20753 18868 15218 9436 12967 10974 15672 11525 4375 -544 2054 7692 12158 22817
21512 22817 19712 20506 26413 33366 40519 60305 85724 118485 162663 207814 265915 338226 401645
21499 401645 410421 405218 403202 404397 408783 394812 355928 304808 257707 212656 156384 120385
21487 120385 93185 84668 57680 36318 42689 44502 30811 21131 19926 26587 21031 25415 23107
21474 23107 7304 7318 13542 -345 -5079 13072 17014 16272 19167 7949 6806 6432 5691 5014 7379
21459 7379 5459 -5135 -4701 -196 -10089 -10847 -6863 1357 4128 21712 25046 18903 6657 8991
21445 8991 11684 8874 11885 15647 16997 6440 -2037 4543 12826 22112 13685 1468 -18030 -16647
21431 -16647 1059 6784 -2829 3971 -7205 -10897 -14652 -4485 -8208 -6176 10205 4301 1396
21418 1396 -4927 -8811 -11278 -14980 -19070 -16084 -5056 -14841 -22955 -18751 -8650 14811 7732 -13264
21404 -13264 -22417 -8540 5867 2143 -5518 -13517 -20852 -10818 -565 3955 3086 19167 25307
21391 25307 15369 10833 13914 21108 17708 21501 14669 12858 5932 8117 11915 3499 -15309 -7074
21377 -7074 10568 21970 27056 19449 10609 11161 8812 3255 -9162 -5239 -1613 -8838 -16202 -26828
21363 -26828 -25795 -21169 -20723 -12593 -870 10322 10420 4147 -6291 -9672 -8339 -18414 -18068 -19594
21349 -19594 -11902 1091 15859 9087 -590 -8940 -23334 -14342 3722 18453 20471 2144 -18981
21336 -18981 -8155 -7980 -6921 -4914 -8380 -25050 -24023 -6555 1147 7281 10069 -4957 -12870 -8202
21322 -8202 1159 -9037 -20787 -29114 -34304 -15603 -10447 -6361 -3922 7186 9493 -824 -7777
21309 -7777 3771 23348 26994 20246 40 -4002 -775 -8451 -26282 -24770 -22578 -40536 -29798
21296 -29798 -9360 -9865 -21938 -21470 -32471 -8254 -1291 -3059 7573 4992 7395 5283 -14065
21283 -14065 -26792 -9685 6236 9706 11051 13417 6862 -3887 4845 16986 22701 13864 7867
21270 7867 15580 9397 9059 9153 14199 7296 -2675 7933 5639 -5359 -7 -3985 -5766 -16382 -18479
21255 -18479 -8066 16368 14104 13177 29118 28044 22617 8759 546 -7373 -11264 -5354 6933
21242 6933 3908 8536 8413 -5978 -9351 -11613 -19549 -23269 -11839 1411 -3749 -6861 4810 19883
21228 19883 20430 -1463 -10481 -6500 -12781 -13074 194 10684 9469 7826 6101 4403 5980 9619
21214 9619 12658 15143 9951 10631 9077 13740 18788 20845 18225 16042 13730 22589 17664 2400 2380
21199 2380 6396 8264 15122 20580 19535 19809 1318 -5275 -38 5178 3375 1433 4861 -2948 -17275
21184 -17275 -20126 -17257 -10764 9294 4314 5188 196 -2540 -4856 -5888 -12320 -18745 2063 11754
21170 11754 8591 941 4955 10378 19734 18119 -7028 -21665 -31727 -33848 -17142 7141 4649
21157 4649 10820 5762 8505 13023 11614 4262 -1117 -7211 -3705 2048 2666 -4737 -13755 -9971 2695
21142 2695 15048 -1589 -20486 -21865 -14150 -8454 -5489 2203 12908 15921 24205 7893 -3974
21129 -3974 -15343 -22416 -21984 -28772 -23103 -17698 -24089 -21976 -6479 -4695 -4165 -7082 -9418 3022
21115 3022 13554 12002 8006 1648 -14685 -19554 -9502 -3684 -17514 -22856 -27883 -30321 -33640 -34854
21101 -34854 -32318 -17231 -5068 -24346 -19870 -8518 837 9959 -970 -18272 -20613 -15193 -21451
21088 -21451 -28301 -32692 -19249 -6674 -4415 -7354 -3272 -8899 -9332 -7066 -19885 -22759 -10329 -16557
21074 -16557 -18440 -24400 -23842 -24041 -13669 2395 -5083 -2638 7146 7903 1784 -11125 -23243 -16327
21060 -16327 -4129 -11691 -21225 -29303 -28762 -28985 -23356 -13644 2015 3570 5844 9030 5985 -3451
21046 -3451 5049 8695 1220 -5649 -6301 -7004 -8549 -3693 -2582 15081 16895 -3102 -82 -6220 -20978
21031 -20978 -27684 -19416 -17434 -16431 6130 21264 11008 423 -14009 -11543 -10231 -10715 -1587
21018 -1587 -3148 -13643 -15273 -18110 -18611 -12419 -11892 -12043 -14592 -27351 -25283 -9221 -23150 -21907
21004 -21907 9440 7413 771 4030 15605 22421 19047 19763 3289 1137 -13629 -23442 -25484 -24583
20990 -24583 -11815 -11332 -16299 -15805 -327 -8416 -3908 11368 12662 30735 24523 7339 991 813
20976 813 1808 7965 -10360 -10641 -5500 3719 10810 13610 19060 11644 3890 -920 2399 18045 25568
20961 25568 27516 27730 8309 9358 17984 -5512 -12342 241 12629 -3498 -7168 6452 6711
20948 6711 4016 17623 17668 12281 -7354 -19364 -14910 -18236 -2561 -8264 -9615 -10059 -11371 -10811 -7185
20933 -7185 -860 -9782 -18790 -25194 -23159 -8492 13846 20720 14612 16152 11341 9942 6372 6194
20919 6194 -4693 8924 12029 -1417 -13872 -11428 -6501 -5426 1263 -2076 3049 16677 18917
20906 18917 -1878 -12845 -11250 169 -992 8560 3909 427 -3043 -12135 -10133 -3108 -1618 -55
20892 -55 4835 2374 8681 -2876 -8225 -2323 4855 8491 -2934 -1647 7170 9738 -8337 -12764
20878 -12764 -9168 -6988 -13871 -23911 -21512 -2028 -2565 -2939 1994 11069 9601 4198 10416 6282
20864 6282 -7108 -4319 2234 6942 20162 17830 19039 22300 23761 12568 15719 18639 2604 -17468
20850 -17468 -25316 -6060 3035 -597 -9767 -4301 3429 -2165 861 -5019 -6106 -6086 9911 11711
20836 11711 3807 -4342 -18149 -16835 -3968 15288 31539 33973 21393 8686 2714 -1988 -5902
20823 -5902 3582 15172 17245 17987 19872 12331 7304 6420 1816 -6551 -2912 6563 10989 9761 1214
20808 1214 -12771 -20502 -20710 -26997 -3847 -4287 -1265 4115 8474 13386 11678 7593 1217 15072
20794 15072 18757 14932 23218 23311 31691 19156 5817 1541 421 -1993 -3607 -10171 -6270 8674
20780 8674 2530 -1766 -9284 -9059 -8812 -3785 2401 8910 10633 10930 -2392 -1845 -4636 -8116 -9517
20765 -9517 -7493 -7542 -3453 -15852 -18179 -10843 -15089 -19061 -14431 -8184 5555 -3748 -15096 -9264
20751 -9264 -11359 -18980 -18441 -17258 -24110 -12496 2187 -1096 -7125 3938 -563 13018 24324 18693
20737 18693 17264 14070 3250 -18196 -15136 -11434 -16869 -20394 -13552 -7967 -3322 3873 6543 3707
20723 3707 4342 -8641 -13241 -8797 -9732 1030 -750 -3123 2422 -5309 -19812 -38535 -21159 4240
20709 4240 4796 6628 9644 12440 8241 3256 -2051 25248 26216 9948 -2091 -3769 -3603 -13602 -37160
20694 -37160 -39236 -33857 -31324 -38430 -26050 -5468 7404 2930 -3169 1137 -483 -5213 -8125 -3052
20680 -3052 4455 6317 -3629 -5967 4000 7156 8067 4908 17356 9394 -7869 -13791 -12202 -26824
20666 -26824 -28942 -19673 -8860 -1864 -1555 -23494 -24872 -17521 -15283 -14027 -12099 -17605 -21497 -16489
20652 -16489 -3109 7604 8253 -4879 -23220 -39406 -20571 -17039 -16404 -25295 -14867 -18476 -21616
20639 -21616 -30259 -24976 -11467 -7427 -3110 -16773 -10537 -3554 1589 15598 10898 -9019 -13239
20626 -13239 -22390 -13470 -12345 -16435 -18170 -18638 -21703 -24060 -4310 6212 -6939 -8991 -12121 -13732
20612 -13732 -7189 1 -16740 -27613 -26252 -13198 -446 4100 -2359 -3793 -698 8486 8215 12578
20598 12578 8166 10758 11720 440 6102 6030 -6717 -17031 -24220 -13728 -7715 -7824 -3210 -6004
20584 -6004 -1897 -3715 -6109 -8439 -2222 -426 -7896 -16217 -11575 -22995 -29141 -25098 -15057 -3498
20570 -3498 12397 8979 9836 11379 8386 -2748 5714 12569 15527 10012 -6753 -4073 -10483 -20242
20556 -20242 -17004 2446 6344 8118 9863 -54 4819 -1330 -12106 -21538 -21346 -2759 109 -1645
20542 -1645 -15516 -29155 -17893 4385 15164 5565 9599 -1082 -3214 -8225 -25570 -35332 -16049
20529 -16049 -2601 -8391 -6006 -1174 -8972 -21835 -20111 -18623 -12351 11013 9539 477 -5260 -5829
20515 -5829 2210 -5244 -18766 -22076 -25996 -21832 -6000 -6446 -8966 -3319 -2658 -10918 -17831 -36045
20501 -36045 -42039 -23611 -10051 -3912 2234 5523 1820 -4300 -5910 -21149 -24615 -19127 -18611 -27032
20487 -27032 -23674 -14393 -2969 1118 -397 6774 2897 -6772 -5334 1730 171 -1282 -3522 -2459
20473 -2459 -11268 -17894 5035 24079 27751 6809 -4055 -3675 4147 10461 12684 10868 5412 -5787
20459 -5787 -17818 -16797 -10302 -17976 -28658 -41266 -29683 -20244 -16104 -26264 -25627 -18438 -6002
20446 -6002 -4889 -4783 9867 19254 9667 561 -1139 -6279 2178 -2150 -3083 -10448 -4860 -8695 -16382
20431 -16382 -14813 -4100 -6919 -3877 4752 6010 9897 7543 5292 -2543 -11657 -14643 -14700 -17943 -8309
20416 -8309 -5871 -2092 -7130 -11355 -28848 -22832 11457 23949 20639 5050 -3896 4659 7385 5536
20402 5536 4669 3060 -2743 2026 -155 -2997 -11320 -18246 -26425 -41872 -47407 -38030 -33062 -15647
20388 -15647 819 -9502 -20394 -28876 -26460 -15421 -13960 -10724 596 3762 -7222 -22751 -17079
20375 -17079 1305 8954 13803 15621 4473 6 566 5462 2781 -18341 -35345 -37751 -24311
20362 -24311 -12929 -13568 -22388 -13117 -11427 -11164 -23584 -26550 -8788 1412 1288 3273 9166 5166
20348 5166 351 -9771 6518 12580 2404 151 2789 -193 2569 2094 5710 -250 -8412 -6279
20334 -6279 -3557 5629 8715 4708 -8527 -13970 1876 7729 -7920 -15228 -9749 -4315 -1184 1819
20320 1819 8383 11680 22275 20121 224 -11153 -15294 -13766 -10265 -5912 -1332 5881 2364 -3752
20306 -3752 -1398 -3209 3093 5240 -5358 -3960 -15096 -23114 -24088 331 12283 -142 -10811
20293 -10811 -1688 997 -2051 3818 -9538 2716 13980 9138 -1868 -8234 -21819 -10760 -6167
20280 -6167 -19996 -2805 9084 8006 8345 22305 19983 -8498 -12706 -10914 -9032 -3021 -524 -8690
20266 -8690 66 8055 14469 6093 -5075 -8144 -13313 -9592 -5817 -5175 6159 5854 193 -7376 -11816
20251 -11816 -11200 -17496 -14093 -4665 -12354 -15986 -8619 -4920 -4663 11274 16127 4628 -3937 -8896
20237 -8896 -10624 -11888 -20120 -5993 6968 20909 11659 -2836 -19615 -12952 6882 -4702 -8015
20224 -8015 -3443 -1588 -6870 916 -91 7267 6668 -8620 -10550 -11051 -10066 -15748 -10686 -6472 -4336
20209 -4336 1613 -9786 -10842 -13590 -22561 -21274 -3055 295 8519 5693 2730 7314 -4287 -3968
20195 -3968 2323 -12074 -26244 -16014 -18156 -16252 -6871 1809 15472 2676 -23278 -29255 -26552
20182 -26552 -27429 -33094 -17944 -6982 -6153 -3376 -11156 -10669 -3092 11244 13919 12390 13940 -1858
20168 -1858 -8008 12492 9356 -590 5652 2922 -505 -17729 -26044 -4587 -963 -15526 -13306 -3274
20154 -3274 -8468 -17831 -6991 -5823 -11234 -11434 -14603 -21014 -19602 -10747 218 1454 6647 13397
20140 13397 16753 5072 -5405 875 6411 1951 6255 4473 -4964 325 -214 -18157 -22948 -12494
20126 -12494 -722 3060 10265 5171 9446 25 -12548 -16929 -19642 -7150 10244 18026 12754
20113 12754 7117 -1670 153 4960 -2390 8326 7802 2379 19232 14083 4020 -9536 -20457
20100 -20457 -16139 -8443 2677 14881 5615 -1702 -255 3800 -9145 -3506 -4886 6766 8125
20087 8125 398 -13915 -21467 -7061 4240 8497 -3828 2545 1884 -8449 2230 4189 -2592
20074 -2592 -9855 -13489 -9167 3412 14354 12651 570 -1978 -3566 356 -5235 -8174 -6115 127
20060 127 -1409 -7460 -6860 -6265 5891 20482 21373 21543 2940 -9722 -13629 -22725 -31049 -38021 -24779
20045 -24779 -13585 -19563 -6019 -3275 1225 9130 8214 -3869 -3972 -2234 7597 14187 10618 -274
20031 -274 -6889 -604 -4824 -4498 -10420 -19457 -18072 -14854 -18856 -22040 -36000 -29406 -6864 -2410 -7611
20016 -7611 -14112 -24344 -36517 -32641 -15960 -14166 -14474 -9958 8326 5268 8937 132 -6971 -2892
20002 -2892 6748 4261 7576 -5934 -25502 -33112 -20903 -25368 -11425 -1430 -1747 -8064 -15473 -14123
19988 -14123 -15699 -4842 -1670 2501 4317 -12538 -30543 -32824 -23154 -8884 3389 5033 3203
19975 3203 -2709 -2491 -2276 11394 18832 12213 1528 -4650 -10926 -25883 -20588 -16792 -17899 -19050
19961 -19050 -13071 -6760 806 9440 14329 7127 18893 30704 36279 12083 8876 10482 10607 15805
19947 15805 14488 10640 2704 -17224 -18762 -11139 1424 7623 1025 3814 5434 2000 -3510 -4085
19933 -4085 -5012 -1132 -5046 -5241 -6406 -15162 -12196 -3320 -7683 -3487 -1852 -20365 -9060 -2411 4111
19918 4111 10833 11596 7020 4291 6605 13414 5233 -10311 -8567 -4486 -7198 -808 4973 -3570 -10213
19903 -10213 -1882 6891 15026 17429 22519 7559 -3275 -6007 -9322 -9395 -8463 -51 5770 8585 -1713
19888 -1713 -10720 -6482 4456 9246 83 -6893 -5146 -1811 6894 5672 -8548 -34395 -24363 -11932
19874 -11932 -697 -941 -9251 -4068 2284 1498 -10660 -12268 -9172 -18879 -16151 -13289 -19247 -15344
19860 -15344 -14654 -10603 5739 6087 1330 8033 -2569 -10783 -24717 -32706 -28672 -23608 -22823 -12324
19846 -12324 -4909 -6792 -29903 -25102 -19704 -15228 -17407 -16149 -19235 -20963 -15278 -10284 -19678 -18287
19832 -18287 3769 -699 -9879 -16741 -16954 -26696 -30470 -38187 -29601 -20871 -10528 -13503 -28184 -45597
19818 -45597 -40424 -19520 47 -6564 -863 2663 8478 4207 1641 5993 -7051 -20599 -16267
19805 -16267 -443 10636 13794 5769 4722 -10417 -13652 -6098 2327 4567 -3946 -5392 16942
19792 16942 15159 12991 18717 1978 -16492 -24813 -29480 -30995 -23931 -21647 -31892 -23942 -19543 -9564
19778 -9564 4937 10838 10759 8215 3614 9828 11358 3095 20196 15810 -4701 -4789 -14325 -25061 -18166
19763 -18166 -7302 -2073 -7313 -7189 -6130 -10285 -15057 -12033 -12825 -8024 -1844 -1089 -1964 -7372 -13456
19748 -13456 -10655 11911 23946 14794 -7155 -17017 -29456 -23378 -10517 -6488 -738 -6204 -15184
19735 -15184 -8627 14933 12389 -16 -4515 5591 21541 24165 9651 4230 -1867 1480 874
19722 874 7106 4801 -5235 -10888 -5669 5052 2075 -7221 -2390 3699 -2852 -5411 7032 -3718
19708 -3718 -2091 -2503 -17142 -20626 -2294 2143 -3466 381 -9028 -17166 -16275 -11412 -9343 1195
19694 1195 3787 1011 3786 -2346 -2004 14492 11313 -6457 -21397 -14394 -8429 -5513 -406 -2555
19680 -2555 5790 19590 13793 1855 -13546 -520 9942 22188 21904 7624 -4245 2718 16848
19667 16848 10407 4745 -5234 1528 -10368 -10133 -9509 -12288 -9998 -5622 -8719 -8640 -17462 -2849 4448
19652 4448 18729 25572 23751 12127 -1595 -11086 -15186 -18284 -7424 -2790 -1941 1877 9016 4771
19638 4771 8412 17217 7681 10496 -13622 1528 19036 1498 -4638 8509 13689 12457 10918
19625 10918 7450 9700 17024 12397 3135 19863 31646 26355 14002 14608 2000 -1018 -4096 -12310
19611 -12310 478 -484 -1971 -2559 5591 17327 22430 27642 40975 35015 33515 36169 17717 -9255
19597 -9255 -8285 13395 28593 22604 19120 14868 15546 20318 15341 11011 1492 -5978 2406 875 -7074
19582 -7074 -4398 14906 4658 -16108 -5560 3523 -10381 -8668 3490 21303 22035 11627 15928
19569 15928 15480 17303 29312 28231 15672 2482 11674 21732 22778 23185 12527 -13357 -22126
19556 -22126 -13800 -10226 2229 16473 15423 6422 -603 -4670 -4155 -9982 496 14909 29777
19543 29777 29449 15505 1833 14869 10965 968 -9611 8524 16809 14988 26628 32872 47462
19530 47462 61918 75305 96394 111386 122778 150528 176935 213261 260043 297570 312460 314978
19518 314978 311969 309115 306992 288390 256092 230894 207278 165045 127953 110798 100828 97329
19506 97329 83624 81276 74539 74843 58843 45550 50808 37822 23776 29988 37697 34104 27323
19493 27323 31238 16961 -8217 -13071 -7989 3265 8261 19425 23745 17553 14973 16693 5725
19480 5725 -4788 -9986 -12852 -7212 -7117 -4381 -7140 -10837 -2960 -1117 8108 19864 28100 36148 25588
19465 25588 8004 -2351 -4309 -5419 -13834 -16404 -17589 -16268 3448 12276 12991 15672 20925 13056
19451 13056 6404 582 -16322 -9082 9125 21698 20412 16315 11869 -2649 -4551 -3690 -705 -3131
19437 -3131 -2778 4339 12855 11783 13419 13189 12095 252 -13436 -10342 7422 16958 3391 -474
19423 -474 3792 -4343 -1569 -7654 -4150 1527 12425 -3718 -12459 -6441 -4636 -16201 -10236 3110
19409 3110 408 4946 18038 4267 6412 15471 5347 -2889 10732 10930 -477 -8593 -6791 6969
19395 6969 1926 4938 17675 34363 19860 3962 10471 18473 20017 13584 4832 12399 8903 6078
19381 6078 14433 26958 26485 22636 7050 6854 11174 28206 20060 17705 14611 24738 10977 -2093
19367 -2093 -7396 -2666 -2235 -14960 -17429 -10077 5355 7201 10532 11734 16294 10078 7452 13693
19353 13693 11110 8374 20061 36147 26174 18284 19309 14337 26053 20538 16043 4972 4484 10998
19339 10998 10500 21351 27021 31604 21067 18514 14583 17199 32881 32620 32418 36701 15467 204
19325 204 30846 62032 62057 46382 48978 65294 86265 83678 78742 95418 115370 130396 157087
19312 157087 161352 178825 200521 215627 208551 205559 214031 212397 222474 227108 210064 210090 187026
19299 187026 171238 176560 161980 156376 142116 118135 97733 88639 86092 87411 76705 73940 68732
19286 68732 50347 42443 44412 44588 22048 2663 11727 7727 10278 15416 12054 -3997 -11546 -85
19272 -85 17147 27724 36873 30377 29717 26589 22254 15500 18704 24359 26659 20587 9965 -2244
19258 -2244 16410 16077 10282 21060 29860 39313 44852 30281 28885 23784 18678 26402 24869 22030
19244 22030 18760 17283 24051 25319 10676 13974 10686 7031 20244 22570 14642 15092 18413 25635
19230 25635 17100 12619 5781 17696 22443 22365 19618 29109 27013 17490 18662 10384 12849 19567 37633
19215 37633 30491 31608 35136 23663 21895 21091 11603 19634 9576 18052 26490 25393 27222 33802
19201 33802 46224 29326 19293 31247 59357 67354 67837 59820 45625 45175 47945 41225 33965
19188 33965 27626 31298 48468 50697 48628 41611 41752 47028 46694 42766 28133 25103 34815 36847
19174 36847 36201 25817 26516 30161 41387 42474 33825 24754 28182 35244 43975 38187 28103 31081
19160 31081 37873 40670 55608 52075 55318 60965 64635 66670 54732 28175 12067 20220 25672
19147 25672 25030 23390 32479 32553 15748 14355 376 916 12511 25062 18621 5652 -2367 16283
19133 16283 28013 20718 16143 31139 33057 25960 34731 43540 35435 38123 37400 29480 30898 33391
19119 33391 43897 47060 33553 22889 18716 26667 13987 5990 11492 27716 38837 46871 49787
19106 49787 55342 41487 32421 21670 20038 31284 29265 22006 31270 38649 45591 46077 42599 39991
19092 39991 44209 59116 69182 71754 60497 58589 68901 85874 90873 93873 74629 55750 62685
19079 62685 59398 61370 50933 47037 54216 54742 58330 49216 50758 63008 76428 89984 95650 98315
19065 98315 98978 115872 114464 101638 93601 92756 88044 83896 97761 94822 92007 95151 110401 109813
19051 109813 131058 148868 162430 160956 157240 158759 164612 162532 149176 150046 155928 157485 160878
19038 160878 149527 145543 149512 160048 154535 153517 147829 143350 137891 131137 128371 132025 135246 149901
19024 149901 139177 134644 145942 154904 154322 144898 154787 159828 164404 169164 173660 181602 195955 194286
19010 194286 175237 182573 181913 200405 211136 217202 228694 223623 225907 230217 225889 230350 243309
18997 243309 257272 276039 288471 296772 299480 323094 337994 353851 360759 369265 384154 400854
18985 400854 424914 430589 440208 434789 446956 486994 512761 530125 555610 594405 646929 703197
18973 703197 759423 817579 893296 959367 1014927 1074345 1133157 1190601 1230483 1262850 1303200
18962 1303200 1351512 1404738 1449379 1480753 1515386 1558309 1606034 1672919 1732900 1796736 1853470
18951 1853470 1910687 1981327 2076401 2169988 2291120 2442695 2594439 2776362 2982278 3235989
18941 3235989 3537433 3891774 4303583 4787305 5381459 6103058 6956133 8018146 9354321
18932 9354321 11039101 13164116 15846396 19248587 23542216 28789709 34907495 41441917
18924 41441917 47622520 52676878 56241226 58444714 59580268 59607954 58172927 54976361
18916 54976361 50185851 44412421 38374869 32635705 27549321 23205402 19581069 16579593
18908 16579593 14099252 12071271 10408112 9038849 7921942 7002734 6237234 5573997
18900 5573997 5015346 4533893 4131303 3795590 3504916 3241540 3014927 2825755 2670051
18891 2670051 2530631 2419025 2326069 2241102 2173641 2133758 2081228 2016277 1950377 1879280 1808336
18880 1808336 1725225 1655946 1598276 1552366 1501822 1468194 1426606 1357998 1294885 1252597 1223328
18869 1223328 1167991 1102624 1022036 946366 894649 837519 790807 749480 712672 682536 653915
18858 653915 623690 584478 556013 542385 511039 484478 468076 454328 431900 412575 403736 383692
18846 383692 379471 383590 381958 371054 377427 375152 371728 368217 361894 356705 359380 361058 368811 365901
18832 365901 359505 352761 347929 345558 335772 322535 317061 311827 320661 312207 306256 294305 296839 299154
18818 299154 306506 302520 296210 288491 276176 255327 256365 254085 250188 243597 240387 247978 254607 246479
18804 246479 226976 236049 237110 235613 249106 251474 252110 239492 233504 235278 232645 228476 240645
18791 240645 256998 264886 256370 251850 260785 268334 271384 266582 273897 279537 281837 279457 285161 303678
18777 303678 303064 293200 288465 281632 285274 277351 280857 295962 324636 366312 405789 436890 428595
18764 428595 396120 359276 319802 294832 275646 254395 263483 268075 269679 270951 264604 253918
18752 253918 259650 266908 265061 285668 304007 307142 303704 304066 302526 316472 329819 331249 336836
18739 336836 347662 349154 357469 367728 382209 386739 397479 417702 426843 442543 447357 462188
18727 462188 486010 495720 506883 516798 527133 533092 531477 548300 565069 587460 612671 634268
18715 634268 647640 651154 671922 688236 711634 750532 769229 800715 838635 868941 894314 937652
18703 937652 994781 1049841 1106104 1163583 1236148 1292103 1368931 1425518 1498623 1595734 1701484
18692 1701484 1810728 1907322 2000837 2123366 2240721 2381030 2527891 2678612 2845088 3033551
18682 3033551 3239363 3460624 3716642 4011418 4333833 4697717 5125890 5624213 6219611
18673 6219611 6914238 7732457 8692202 9840199 11182280 12710468 14465758 16436214 18625801
18664 18625801 21029604 23583948 26205166 28852110 31470925 33943877 36174307 38099223
18656 38099223 39627027 40689033 41246877 41296712 40817682 39836032 38407267 36581793 34435718
18647 34435718 32071612 29569241 27011956 24468880 22001182 19682139 17538125 15565150
18639 15565150 13793375 12228554 10858199 9672645 8659357 7786785 7030244 6361343
18631 6361343 5780984 5296474 4869461 4486136 4146396 3858676 3597924 3362795 3164041
18622 3164041 2975089 2807069 2647137 2489201 2337628 2230885 2119383 2012636 1901383
18613 1901383 1801203 1698179 1600207 1503644 1416659 1356792 1295128 1229073 1179542 1131986 1087823
18602 1087823 1055608 1002618 952318 900736 879782 851234 807731 778483 752504 716524 684435
18591 684435 663971 650946 625230 605889 583134 561169 555105 536495 503402 482981 472531 473518
18579 473518 469292 465764 467274 442957 413065 408306 404433 390788 374643 381489 376924 378773 372349
18566 372349 368525 381613 378111 382605 372458 356820 353286 363510 366367 334477 328599 315338 311594
18553 311594 317720 320130 334690 327878 320586 304029 293284 276475 268087 258339 266483 267173 265924
18540 265924 266501 269950 275142 281104 282540 298166 310938 298113 290781 303064 305995 324789 342991
18527 342991 339243 326140 314513 307634 292016 287446 284754 271878 247679 226663 203333 185418
18515 185418 181304 191115 190506 182076 171744 164230 163168 160345 161772 144371 126110 126029 146489 149761
18501 149761 143139 131414 127641 132195 139433 132175 125913 121020 116870 112548 103528 105645 116196 116884
18487 116884 108618 114524 123633 95405 83369 96476 96956 97906 97790 83026 81734 96244 102364 89486
18473 89486 91814 92216 95103 118521 119303 109299 100183 95922 86248 101337 111943 113668 99418 106283
18459 106283 113461 113185 106359 107634 106809 109211 102961 97523 79717 83173 80437 69987 53122 50153
18445 50153 59430 76074 71518 74828 79913 90842 85241 88134 97612 92729 83376 89188 91029 86038
18431 86038 88508 86185 93140 90422 99746 95827 89145 87306 82341 76545 72390 83258 87098 95111
18417 95111 99166 111438 125743 121742 113801 105434 103213 96189 85232 98124 116069 115673 120065
18404 120065 122076 116631 116886 126414 126944 120307 119833 105987 110977 113890 108628 104459 106443 94475
18390 94475 79121 75159 73191 71936 65154 80697 92983 94228 99559 87082 76767 75271 83277
18377 83277 79437 65061 62503 53728 50215 51117 45503 34171 31091 45722 50330 39328 46227 54011
18363 54011 85244 85879 70954 63838 54122 30918 41329 62328 53904 50759 54356 46653 49045
18350 49045 62205 48989 52174 46231 44040 46965 49256 45771 52133 43373 46717 52962 47873 36355
18336 36355 42085 57758 72052 79439 69983 63145 71184 74221 68963 70687 90269 92250 95623 117718
18322 117718 147543 164996 193317 234724 262750 291413 312243 335373 336141 346712 347001 340532
18310 340532 320918 283278 254728 224649 204981 193742 168216 138621 121054 108691 93842
18299 93842 77161 68996 78394 79205 74041 85187 82174 61409 54786 54535 49721 57253 84074 72644
18285 72644 58777 72331 73281 73100 59937 57778 54820 40221 23934 28551 39895 45716 49568
18272 49568 48100 44864 36117 40428 46612 42908 36617 45876 57135 58677 67489 62100 51082 53981
18258 53981 55095 49838 56983 47628 34669 32222 18130 14669 32190 39235 33490 17957 22034
18245 22034 25829 24649 19652 21000 27997 30433 26411 20215 18628 6492 7581 15110 21899 38638
18231 38638 35174 27882 24558 27362 20623 16733 19187 27548 19759 24956 36044 27656 22417 32381
18217 32381 38290 43087 31386 25933 22603 19425 16474 20444 20927 18132 25124 22211 19758 16508
18203 16508 15261 18018 12428 2016 4979 7746 2979 9153 24294 31835 26852 12280 20150 26064
18189 26064 32773 40157 47063 40156 45984 44696 39360 26199 27154 45501 50734 49657 48066 52040
18175 52040 52924 39744 31454 40711 50825 39965 34638 37560 37905 31329 29361 45658 41384 40360
18161 40360 54740 53819 59244 69316 64251 53711 51861 64387 73330 78155 75272 64681 75106
18148 75106 78031 65067 66456 69408 71849 70785 79663 83782 93921 105406 107709 119888 132713
18135 132713 142395 148434 164030 157703 144561 160543 193976 213326 226017 261191 288283 306057
18123 306057 335667 382225 433845 514126 613081 742177 902463 1139966 1488921 2022866
18113 2022866 2839897 4189872 6558304 10931524 18640962 27419189 29284638 24641978
18105 24641978 18626790 13414880 9631824 7114510 5309157 3955239 2986064 2305575
18097 2305575 1826409 1463264 1196550 1014449 858287 742092 655554 570784 482434 422137
18087 422137 376086 343727 321928 306893 274707 254282 236928 210133 187203 180752 176601 175769
18075 175769 159473 148517 137403 140182 139448 128208 120108 102568 100542 85881 95287 84780 85434
18062 85434 86438 80665 68996 50885 63961 90001 90710 90715 78558 83914 74755 67384 69006 58047
18048 58047 50830 44410 46770 37992 38320 34534 38771 49441 54637 54442 59644 58233 61172 44754
18034 44754 37559 40770 43351 44465 42376 49011 63236 62628 65795 69096 63153 70665 64993 65215 59849
18019 59849 57644 64470 57231 56104 59307 59532 65566 86013 84732 71845 64515 83146 108753 114859
18005 114859 102477 112611 131180 134889 143330 167056 187744 204873 216540 214006 216801 221413
17993 221413 229973 235438 244175 231159 204857 182932 174632 175186 174242 160523 141507 123425 104384
17980 104384 92742 96450 91870 84048 74018 60389 64007 63126 65234 74939 73019 74372 52718
17967 52718 50561 38262 27272 24615 15878 5035 24290 33779 48006 62598 67406 47916 21949
17954 21949 22421 21111 21599 21395 15189 16958 13092 26617 38519 33707 41613 45165 29290 23577
17940 23577 36018 46142 38459 18084 5389 12948 19863 30265 29423 32061 31454 30882 27213 32529
17926 32529 36433 27601 19381 18815 11989 13191 14807 10870 6987 8199 12108 14689 27474 44239
17912 44239 54476 44120 22266 21740 22809 24834 24511 17916 14127 8479 4596 16265 27085 13703
17898 13703 5227 -5061 -12502 6848 28595 5560 -869 6941 16451 21108 27900 25496 34435
17885 34435 29098 11286 3837 -482 -5229 6288 21958 21074 14045 16052 11325 15903 6214 11520
17871 11520 24767 11863 543 13551 16301 9392 -10054 -18728 -10775 3163 11423 23231 25444
17858 25444 30193 22638 4065 13993 18752 21787 22655 30879 30854 22338 8717 276 10979 13516
17844 13516 9249 5633 8997 18595 34487 35961 25989 22555 24492 19385 19027 25375 22355 20097
17830 20097 28896 31019 24537 27935 14562 7778 7763 356 -1685 4582 14268 18959 9608 7124 5458
17815 5458 3759 -5405 11606 1674 -2525 10934 16459 29423 29283 15425 1840 -7505 -6789 -5586
17801 -5586 5407 13580 3510 -10784 -2277 15893 29039 19924 11802 3825 2377 7874 10235
17788 10235 13753 15654 34846 22414 27283 48090 50004 42924 41172 43107 57013 69455 78828
17775 78828 76778 65902 87780 112021 106419 68180 60739 64773 78299 79620 69752 66550 52898
17762 52898 45665 40074 38222 34251 35522 39371 11567 -8655 -11043 3525 21938 32002 28642
17749 28642 25831 19643 26564 30588 25323 27325 33431 44911 40276 30047 25337 21813 19130 28871
17735 28871 21236 24126 15829 12340 16773 18214 8304 2662 488 5618 -1890 -7315 -3984 -4038 1806
17720 1806 12128 14904 14847 9188 -2140 -12317 -8895 2623 6987 2608 5055 8205 4168 3875
17706 3875 16547 16051 2090 -507 -2979 1121 -5540 4234 12395 8056 16879 12750 12464 4220 10108
17691 10108 18783 12843 -1906 -16521 -19431 -6144 2148 1347 -13419 -18497 -10228 -9238 -1897 -4177
17677 -4177 -11338 -10577 8595 21531 11974 15685 15006 -4387 -10195 -8036 -14529 -5866 -3344 -1241
17663 -1241 -11810 -3818 1967 201 -11308 -5271 2466 -930 -1882 8077 26600 27754 8252 672
17649 672 2784 -101 -11421 3327 4660 8008 10956 6672 -6919 -15107 -7134 6599 1144 329
17635 329 -6701 3933 -2736 -10611 14851 13137 9145 14165 9254 9811 -203 -3059 4202 8162
17621 8162 6433 17880 14560 14174 11593 1190 2140 7148 -6192 -3853 -733 -3161 -2645 -5853 9043
17606 9043 25936 26551 12204 -8007 -15032 -3647 -7754 -16075 -16438 -3637 168 -13669 -23725
17593 -23725 -23398 -16258 -19484 -20502 -13485 1658 -9011 -21292 -22443 -10084 2489 -6479 13521
17580 13521 40304 27379 17905 21540 27274 26927 16062 6271 -8998 1368 5544 4957 4101 17448
17566 17448 21243 14993 14667 28120 29583 29658 21090 9215 462 -2577 515 -3053 -13395 1209
17552 1209 2579 -909 2243 -407 -8195 -16157 -8741 -10516 -14121 682 9599 788 -3294 -3610 8331
17537 8331 16454 7900 -5540 -16997 -18912 -20192 -12944 2708 14187 10926 12879 16882 24632 10092
17523 10092 14422 18977 13880 9777 6331 27961 42202 40272 32048 30536 43349 53636 58282
17510 58282 61672 56645 54050 47068 47096 50456 53146 62072 68620 71033 61876 57289 52938 57684 53359
17495 53359 40745 38673 50443 45785 42929 45311 32449 32853 33397 27701 8575 7528 19564 19759
17481 19759 20302 15720 13685 3068 8940 22541 26839 16972 1058 1188 -4222 -13196 5488 26898
17467 26898 32239 21891 9376 12637 875 -8895 -12040 12264 27664 18425 18954 20774 15190
17454 15190 23317 14157 2465 -6971 -5013 -17684 -14006 3779 8226 8373 25614 62492 105307
17441 105307 135876 137514 108232 78163 53608 44974 37155 19299 13448 20399 24681 18981 14141
17428 14141 8870 11477 12798 28273 27106 13795 -594 -7852 -24016 -28356 -20801 -11228 -23743
17415 -23743 -35465 -31384 -14462 3134 -709 -10087 -5880 -4659 -4618 -5200 -12900 -14157 -14742 -6584 -17528
17400 -17528 -17893 -5769 -5753 -9319 -10017 -2895 90 -26604 -24484 -22870 -46872 -60742 -33468 -6755
17386 -6755 -8448 -5698 -23808 -13829 -5829 -17681 -14278 -1935 -7649 -3277 -4476 -11782 2631 10928
17372 10928 1390 2940 -9474 -29868 -37485 -44337 -41499 -21487 -6783 -14297 -11222 4237 13456
17359 13456 18892 11028 8543 11159 15050 23036 1423 -13055 -26299 -18088 -9512 -10002 -1534 -3532
17345 -3532 -3274 -14023 -19482 -18854 -28 3749 2384 7515 26111 22673 7121 -8005 -2308 -2206
17331 -2206 -2143 -1275 12412 13139 20817 19808 15598 12051 6924 18101 7870 -513 -14313 -3194
17317 -3194 -4593 -25382 -14720 -755 4890 2776 9633 18546 33861 37335 32984 21735 14645
17304 14645 -2859 -9608 3185 8050 575 -10185 -16218 -6815 2251 -12237 -20934 -23444 -19371
17291 -19371 -16469 -4516 -52 3066 16617 22252 9068 -12127 3241 16211 3047 -4704 2267
17278 2267 2900 2660 -4707 -7392 -9416 -3367 -9206 -16545 -26 8571 2458 2862 -2553 -9238 -10449
17263 -10449 2653 5975 -5872 -2373 -825 -5503 -5380 534 -2081 8890 11732 17284 8935 -7139
17249 -7139 -13902 -19418 -13182 2454 4219 -6851 -9226 -9218 -7899 -10562 -11999 -24396 -13509 -24835
17235 -24835 -13826 -17825 -19729 -5777 7985 10817 15601 10600 -1423 1041 5908 7380 6663 -9097
17221 -9097 -15690 -2656 -926 -10043 -6173 -7082 -12592 -15161 -14450 -7238 -20937 -13764 -14409 -18881 -19137
17206 -19137 -9283 12106 7626 -5026 -8774 -13149 -3401 -3813 -18559 -20194 -23876 -18527 -12635 -6228
17192 -6228 9101 5171 -9067 -25140 -36824 -31275 -25059 -15647 -19304 -18906 -23334 -31199 -28830 -32895
17178 -32895 -39558 -27284 -10192 3990 -5778 -11658 -4398 -5618 -3538 -15663 -19107 -20780 -4736
17165 -4736 -4824 -2299 -10480 -27101 -24248 -1118 12459 11178 11269 -2734 -9576 -21749 -35754 -38867
17151 -38867 -8051 8130 -1338 101 4767 -1200 -10100 -8571 4234 9457 4221 12513 5725 -7237
17137 -7237 -16080 -13889 -2774 6410 -182 -6603 -6709 -6140 4993 13156 10612 -3748 872 672 -4075
17122 -4075 -3950 -10426 -16793 -24197 -22000 -13427 -11603 -6250 9587 21447 18935 5257 -11369 -11427
17108 -11427 -6090 -2251 1058 2287 4273 -11139 -27912 -34907 -26336 -11210 4284 12763 22014
17095 22014 8477 1821 -1451 -347 906 2578 963 12660 28968 36769 25978 -953 -11336
17082 -11336 -1668 -2946 -5316 -6743 -6837 2982 7102 -85 -4931 5405 10245 -3327 -1491 -1872 -15824
17067 -15824 6296 25096 26438 12817 3718 7977 17122 593 -12770 -8596 -13525 -20373 -14779
17054 -14779 -9463 5660 788 36 -1027 -6757 3345 -9212 -21212 -24860 -31156 -29515 -36069 -19539
17040 -19539 -18215 -23213 -20313 -7416 -2457 -4790 -1302 2980 16416 3967 13694 19515 3337
17027 3337 -22510 -12599 11256 24620 14504 -5654 -7276 -15311 -12894 -8423 992 6635 6686 -2757
17013 -2757 -5945 -21718 -24339 -5613 6154 10631 10376 1070 -24710 -38373 -42732 -36918 -17837
17000 -17837 -25850 -33163 -32256 -13943 7696 17674 8832 9721 7584 10583 5200 5081 4495 6091 -5059
16985 -5059 -7982 -12115 -16615 -11869 3217 15936 8061 14635 5609 -1403 -3997 -8231 -6179 -16064
16971 -16064 -28694 -20388 -22069 -27144 -32482 -27637 -18076 -15337 -15599 -16275 -3771 504 -10298 -25040
16957 -25040 -18001 -31595 -27659 2899 8781 388 -634 -10685 -9525 -12767 -11980 -4492 -12682 -8642
16943 -8642 -21168 -20820 -10101 4149 13741 29261 24682 1744 -6987 -646 -5953 -13998 -13476 -6658
16929 -6658 -14255 -7227 -7586 -19900 -4652 10688 24072 13048 2848 -5737 -2583 5706 14196
16916 14196 13830 4033 -9654 -14956 -21700 -22099 -6686 -15536 -6672 -5755 -3344 -754 7499 5428 3547
16901 3547 14743 7598 -14741 -23506 -24132 -27214 -30280 -20315 -6067 3925 -4257 -4947 702 9717
16887 9717 3961 7342 -4759 -13521 -3938 8202 -12952 -35518 -25666 -20348 -32409 -27520 -20939
16874 -20939 -9817 -7652 -2805 -7799 -2055 -5435 10901 6613 -4520 -5251 -12699 -5408 -1766 4954
16860 4954 -4427 -14340 -20974 -15551 -21202 -11205 -10373 -472 7713 7442 -1939 -13782 -13455 -11847 -20048
16845 -20048 -23537 -21774 -23702 -24270 -22985 -15082 -20408 -31245 -29596 -5387 11483 9756 -5515 -6551
16831 -6551 4079 1882 13975 9235 -1767 -811 -2504 3970 2102 7195 6428 10456 14660 10756
16817 10756 7546 19698 29775 29260 17482 12930 342 -16146 -20963 -8083 -10526 -24315 -22571
16804 -22571 -8393 1535 1567 -10971 -15985 -11480 8410 5012 -8836 -11092 -15631 1363 4363 -27428
16790 -27428 -27132 -772 -1449 -15008 -17614 -25562 -34414 -19415 -1467 -2794 -13875 -21071 -19621 -15298
16776 -15298 -13426 -12145 6514 10888 6630 -3421 8821 6588 11919 21732 34199 33305 35147 22413
16762 22413 4917 -14631 -26882 -16734 -15956 -13298 -18197 -24517 -19278 -16522 -23266 -18693 -10304 8082
16748 8082 927 -12735 -26777 -30797 -21445 -13644 -12424 -11527 -13605 -4789 -4944 14385 15441 15107 14670
16733 14670 18179 13837 7878 14855 14349 -2416 1911 15602 17158 3280 -7967 -8894 -7715 -7603
16719 -7603 1210 1154 -6235 -6152 11504 29178 15305 -8027 -25371 -28428 -14931 -5827 -562 7449
16705 7449 15695 3876 -18758 -23251 -34048 -41055 -36577 -32742 -10554 1981 7487 2969 -11546
16692 -11546 -17911 -21447 -25155 -17906 -20281 -22165 -10297 -2913 -1325 12730 22055 23477 10522 1795
16678 1795 -13621 -11632 -19069 -33754 -23570 -4118 -2119 -5467 -15437 -10932 -20462 -22007 -20502 -13694
16664 -13694 -2923 12440 16473 2995 -7849 -2948 1037 5258 18413 29722 17861 -8672
16652 -8672 -29944 -36490 -22410 -18673 -20588 -25115 -32067 -43073 -31257 -5228 15981 20986 4190
16639 4190 -4983 -20536 -19336 549 12014 7226 916 9294 13236 17017 1342 -14287 5452
16626 5452 16470 10359 10901 10891 14836 14245 -2464 -6496 -5556 -3868 -1753 -3050 1151 -5067 -6682
16611 -6682 8645 8726 11460 11427 14629 2965 -11524 -12675 -10042 -11739 1265 358 -20302 -22666 -29515
16596 -29515 -34666 -20530 -23865 -32128 -44880 -44223 -34803 -23725 -24041 -31421 -20183 -17417 -20005 -37102
16582 -37102 -39498 -37895 -25352 -6925 -1705 7014 3830 -7126 -17601 -6847 -7960 -12478 -24706
16569 -24706 -33272 -28826 -17868 -8816 1329 3873 9407 5504 -807 -3042 6984 8810 6341 17452
16555 17452 5620 -13915 -12389 -9954 -16710 -6167 -4462 -17447 -12839 -7995 -4102 7044 1734
16542 1734 7520 13689 13867 15432 -443 3090 -339 1953 2216 -7318 -2970 657 -9294 -358 4492
16527 4492 5719 2780 -3707 -6446 -6216 -17056 -26517 -10935 -14452 -14836 13877 12862 -13474 -18728
16513 -18728 -5973 -7249 -14413 -16830 -22343 -10760 -16553 -21414 -11274 -4379 -12866 -22038 -13626 -10217
16499 -10217 -4527 -9396 -3931 240 1958 15 -9707 -31884 -37418 -33356 -30104 -44185 -35001 -13645
16485 -13645 5697 8526 15245 17393 8979 6350 8272 15088 17030 18751 19158 14473 5138 1093
16471 1093 -4571 11986 25494 14984 4948 4654 3098 -2237 6495 -287 -14064 -20175 -16006 -18203
16457 -18203 -26466 -24706 -2841 8575 -72 -27688 -36499 -26057 -24788 -26290 -24746 -29349 -27308
16444 -27308 -35521 -51498 -52323 -41382 -37229 -33641 -33757 -24815 -17551 -13771 -14803 -12258 -4993 -415
16430 -415 -7456 -30849 -34509 -34635 -29495 -13437 -3827 7233 7050 -4296 -11399 -21293 -14001 -10380
16416 -10380 -12307 -17644 -19153 -9428 2454 -6315 -13422 -10740 -7037 -6686 -22733 -27846 -31185 -27994
16402 -27994 -7354 -2213 -6394 -5034 -5595 -12415 -20558 -24030 -16466 -11532 -22941 -16270 4942 5246
16388 5246 -4927 137 2462 -10285 -24326 -29131 -38344 -28729 -7479 -1859 388 1022 336 14
16374 14 416 2772 -2451 -10728 -17919 -18674 -23825 -12178 8323 15319 466 -22946 -39999 -26425
16360 -26425 -16903 -25361 -31964 -23582 -13440 5562 7433 3789 2876 -7383 -13340 -1777 16679
16347 16679 10093 8189 7633 7143 4088 -7307 -6573 -13215 -18834 -17188 -10697 -2844 7628 5047 1061
16332 1061 514 -3940 14635 14598 -1054 -9047 -3170 -5958 -13456 -8603 -1580 -2368 -5101 -16942 -21709
16317 -21709 -6021 8454 4431 761 4636 73 -11214 -13210 -4683 -3169 -15065 -17312 -23736
16304 -23736 -15197 -975 -3486 -13916 -15048 -9323 -4581 -6073 -15442 332 13886 -1175 -4505
16291 -4505 -18237 -25663 -19824 -20020 -17397 -30594 -32450 -21135 -14802 -8948 -163 -6365 -5757 6422
16277 6422 15006 14643 16419 13554 10412 1415 5445 -10431 -16038 -19225 -25596 -16462 -8605 6615
16263 6615 4399 -15969 -17949 -12843 -3287 -8254 -21027 -17366 -13894 -22145 -30065 -32303 -21206 -22820
16249 -22820 -18735 -17881 -6743 5456 10235 -1173 -10003 -9199 -11562 -3568 4037 2401 -4317 -6704
16235 -6704 12983 12920 13908 9974 11261 3580 -2041 -9039 -1151 12985 7589 -789 -7884 -16015 -21386
16220 -21386 -11341 -3584 4975 3963 -4301 -435 -4920 -602 -5211 -5681 5326 4334 -2414 -18330
16206 -18330 -26571 -13088 -7676 -8262 -7224 -11193 -19445 -22997 -29527 -20871 -14931 -5753 -637 -6505
16192 -6505 -23104 -30670 -25237 -15626 -14898 -9357 -14348 -11962 -9118 -3511 14610 20784 18118 20355
16178 20355 2174 -16385 -13923 -7976 -16738 -2760 9558 -204 -10425 -14376 1596 490 -8485
16165 -8485 -21748 -26692 -24424 -9193 3052 388 -3669 -4675 -11212 461 -10198 -22832 -11138
16152 -11138 9874 6956 2983 2194 10358 12235 4211 -2632 -2378 -6738 8871 13044 22509 22457 1966
16137 1966 1391 7299 -5519 -6019 -4880 -13850 -18884 -17183 -16064 -2737 -7262 2593 422 -13186
16123 -13186 -6500 -3644 -14428 -6537 892 1016 1819 -9660 -1865 -5223 -1706 -6939 -9639 -787
16109 -787 15972 11364 -12997 -25367 -24212 -11045 -4385 271 2234 2196 -12542 -15035 -13993 -14984
16095 -14984 -20577 -8885 -7501 5851 1417 -793 -3360 3940 4934 3626 10269 -15978 -25442 -12405
16081 -12405 2746 5691 4950 15786 16233 10752 -6183 -11617 -16130 -11502 -8636 -2873 -5967 -3327
16067 -3327 7212 -790 -1242 -544 -9970 -11709 -24209 -23257 -7305 -12992 -9587 -13142 -14295 -6293 -9238
16052 -9238 -17901 -13180 -13649 -18001 -18956 -30695 -30577 -9374 9132 10325 10150 22651 21379 5350
16038 5350 -13949 -18474 -17481 -18304 -5259 -410 9713 4533 -4007 -4192 -5204 -5177 -9763 -11896 -6388
16023 -6388 -7395 -11520 -16078 -8509 13469 18207 14965 4798 -5359 -12182 -17834 -5558 4954
16010 4954 9542 9328 -7439 -6000 -2904 -1853 -2349 -22595 -34463 -36358 -34695 -25589 -20087 -8126
15996 -8126 4347 -2618 -1953 3862 2406 -14756 -37052 -34903 -24096 -23208 -27674 -27913 -17376 -12023
15982 -12023 -8978 -11808 -9307 -5330 -11574 -4945 -10603 -3215 976 5059 -4956 -6111 -4262 3226
15968 3226 10996 5530 15741 29213 27769 13930 -4111 -1489 1635 -14411 -21631 -5971 -1659
15955 -1659 1666 1241 -5396 -6181 -13342 -5060 3041 7870 6239 1854 -669 -1006 -1939 12973 31341
15940 31341 26314 5076 -15564 -12654 3707 11885 16846 4779 255 700 -6161 -24491 -25834
15927 -25834 -13616 -8198 -12570 -17534 -27422 -25250 -11763 -7229 4622 19130 11769 -7424 -8627
15914 -8627 -2026 -8363 -18431 -13744 -18403 -22177 -13422 -10290 8088 15345 7494 1451 -6914 169
15900 169 659 6048 11061 -19384 -37827 -28482 -12342 -26343 -32259 -17325 -9858 -5016 9059 5803
15886 5803 -5065 -8036 -8139 -4674 -4908 2757 -2820 -5563 -23976 -22676 -6168 -1799 -5315 -9009
15872 -9009 137 661 1744 -3640 4183 15669 13102 4291 3477 2620 -6909 -9727 -289 -1171 10943
15857 10943 10179 -6214 3284 1556 -1375 -6458 -9235 -5888 -2630 -4238 -13900 -6935 -3501 -812
15843 -812 2271 -17281 -34051 -21217 -5371 -14223 -16947 -11219 -5063 -3281 3744 -646 -20653 -6253
15829 -6253 -9323 -8661 -2430 -1323 4921 2945 -360 5797 2819 -5096 7411 -791 -9780 -555 10946
15814 10946 9499 3731 -2660 113 4219 4369 5610 -6497 -9904 -4712 -16581 -16417 -1033 2670
15800 2670 2368 -251 2297 3014 2010 -15721 -22153 -31763 -19929 -8638 -174 5561 -1356 8093
15786 8093 5797 9577 -3604 -10356 -25012 -19535 1847 14947 9164 -3831 12611 15012 -214
15773 -214 -4067 -9340 -17482 -27898 -24637 -2502 -12362 -15129 -14271 -17459 -12380 -5989 -16316 -33856
15759 -33856 -34384 -14468 1345 2590 -1863 -11118 -10286 -7699 7889 13397 15924 16951 14179 14815
15745 14815 9745 2205 898 -14260 -28534 -19046 -9696 -22147 -23761 -11032 -10616 -22199 -32723
15732 -32723 -25525 -15496 -3494 4841 -3076 -18644 -24337 -2473 -4632 -8172 -8606 -2000 -5352 -9199
15718 -9199 1597 12840 3788 -5471 1039 2909 3088 -4611 -16086 -21846 -21710 -18527 -25501 -17069
15704 -17069 -18490 -15739 -22350 -22892 -12296 -6879 -5905 -11762 -1589 6255 1405 14736 29871 34384
15690 34384 36538 28347 16643 13243 3334 1656 9206 7574 -3310 -3749 4731 -2756 9137 10321
15676 10321 7483 -6749 -8320 4196 10405 9615 21571 13918 -1525 -10779 -9466 3456 11437
15663 11437 7436 -3595 -9057 -6313 -5307 -16534 -31502 -29659 -15276 -8149 -6344 -525 -14559
15650 -14559 -30094 -26552 -4662 17047 6998 3194 -3538 -9036 -16535 -11188 -12998 -2681 -718
15637 -718 13387 26368 20143 9643 -7258 -7660 -9932 -12850 -5664 5595 14264 8106 10720 16695
15623 16695 8028 9580 13553 15215 25795 15805 4630 1400 4272 -3377 -12408 -5796 12244 23394
15609 23394 17772 2513 2222 -1055 -13506 -16346 -24540 -35714 -25415 -22304 -17072 -2255 -2728 -2377
15595 -2377 -9632 -11934 -7134 -1048 -7364 -11046 -6580 -11038 -6771 6747 10519 12093 13537 16743
15581 16743 20702 25786 8344 -5574 4064 6374 -4538 -8587 -18422 -3987 8085 10632 13237
15568 13237 8334 -6956 -18833 -19179 -12806 -5718 -1489 -16569 -30144 -20870 -5820 -4049 3181
15555 3181 14177 2672 5034 4667 -5128 -4722 165 -611 8237 15125 -4349 4823 15138 13190
15541 13190 8924 11488 5084 -9557 -16940 -8846 -7243 -6334 -2859 -16649 -29373 -29057 -16414 -16081
15527 -16081 -20953 -12453 -9364 -5415 -12862 -15695 -24337 -32285 -35241 -33894 -23187 -15721 -7725 -12786
15513 -12786 -12651 -8904 -1492 8155 14210 7310 2557 6562 13423 14175 27075 25156 1327 -2908
15499 -2908 14300 8396 2185 2902 5632 11915 13129 10530 22295 11494 -15716 -13933 56 11526
15485 11526 8831 4209 -21010 -13392 -7716 -3701 1301 -2505 -16942 -22432 -30065 -16480 -6624 -13648
15471 -13648 -12181 -7847 -9596 -20340 -17062 -6829 -5602 -14071 -26094 -26299 -23459 -13814 3363 10984
15457 10984 10975 7636 1894 6140 355 9140 11335 6549 6088 -2847 -6252 -12780 -12261 -4197 -2076 9822
15441 9822 3457 -9095 -18256 -18524 7392 22501 16243 10261 341 -21179 -26533 -22986 -27206 -27906
15427 -27906 -16261 -13444 489 6120 -922 -16593 -24993 -22169 -15835 -11192 -11601 -20676 -22668 -20084
15413 -20084 -4128 14688 6042 -987 3784 -437 8766 -5106 -18372 -18418 -21054 -12395 -5295 -10631
15399 -10631 -24124 -20244 -4294 -162 -5344 -17520 -23480 -15456 -4491 -11448 -4805 -9982 -9831 2514
15385 2514 7797 2304 6684 -7085 -16458 -11170 -5296 -2781 616 6695 14038 14070 -732 -8600 -2792
15370 -2792 -2662 7812 9914 -3283 -1038 -1122 4679 1466 -19924 -15722 -12540 -5000 -7860 -5669 -7931
15355 -7931 -21945 -16496 -17535 -22845 -20295 -8184 -4838 -10623 -6921 -5909 -9525 -7793 -1162 -10392
15341 -10392 -9072 -14042 -16310 -4519 -12873 -27831 -27588 -11564 -11801 -1454 21987 20532 9501
15328 9501 6516 5105 -7907 -9700 -8883 -15483 -20714 -20362 -8265 3165 2628 -7594 -6573 -9050
15314 -9050 -14084 -8578 -18965 -14798 -21926 -5179 4661 -3007 -4523 -9573 -13269 -16116 -973 -1177
15300 -1177 13238 18344 17862 11760 -2498 -3308 6482 11290 -5234 -14480 -16132 -9369 -10926 -14370
15286 -14370 -15420 -29174 -29116 -19604 -5851 -6029 -767 -8206 -14080 -10623 -15488 -13789 -9044 2037
15272 2037 8027 6328 -3860 -8999 -7319 449 -8968 -8658 -8481 -2603 6430 8106 -20 -8214 -11066
15257 -11066 -20448 -27925 -23510 -22008 -1486 17357 9655 12750 25099 20982 13591 7886 15356 13238
15243 13238 4128 -7145 -15000 -95 14182 8032 -2635 -2746 -5968 11194 6039 -3215 275
15230 275 16091 9531 -5608 733 9078 10657 3840 -5787 -8688 1920 -5959 -13967 4824 24481
15216 24481 30981 7085 -5136 -9339 -8335 -10685 -8109 -8612 99 9931 4043 4101 -5092 -432 -5332
15201 -5332 -3735 -6038 -7908 -1276 -3042 -4171 -5907 -2250 1160 -1985 -5636 -10721 -14079 -6802 314
15186 314 -8532 -7554 256 -6316 -11225 -9096 -16445 -21313 -11367 15093 17850 7073 -2091 354 878
15171 878 -1200 -1739 1457 -16405 -28551 -31007 -27936 -20320 533 10322 3098 3300 10383 16975 18016
15156 18016 2518 -12057 -16498 -22366 -22566 -33204 -32894 -17052 -16747 -18433 -11314 -4598 -2856 -636
15142 -636 4989 1134 -7452 -4558 825 4666 -10605 -12325 -7241 -19312 -24042 -20800 -23666 -25131
15128 -25131 -27835 -21072 -10452 -4264 -4519 -4103 -11236 -4800 -4916 537 3659 19162 30257 21086
15114 21086 9328 -14696 -24227 -28753 -6410 6575 -5754 -10193 -8724 -7310 -15513 -25223 -11819
15101 -11819 577 -14419 -4548 -9128 -16963 -19037 -4068 325 4578 7278 9639 12345 -4894
15088 -4894 -13974 -17304 -8993 -18949 -22175 -9573 469 3080 2388 3449 -962 -6061 -7401 -27796
15074 -27796 -21768 -9296 194 -4024 -12516 -20261 -24842 -6648 520 3387 4428 -1626 -5271 -1951
15060 -1951 -9599 -13443 -14003 -5420 5108 17112 18776 29563 30133 21505 10247 -9980 -6501 5631
15046 5631 12061 -7520 -10372 4158 3918 -1741 4838 -494 -760 -7124 -4670 -13558 -15065 -13053 -13430
15031 -13430 -29394 -29352 -22577 -16708 7799 13808 11729 3311 -8664 -5479 9711 7434 743 -5137
15017 -5137 -5015 6583 2012 -8769 -8833 -9074 -18400 -17977 -15959 11489 18307 -11317 -9065 671 2220
15002 2220 -489 -13871 -23781 -30850 -15730 -1624 3107 14594 5595 -5203 977 3512 1960
14989 1960 2 1963 -4062 -4484 2422 12839 25665 45250 41627 28791 35093 41757 25626 23661
14975 23661 19042 6890 14869 6938 -11902 -2427 6024 -2203 -11422 -5428 -559 -11415 -3733 5619
14961 5619 25153 55076 68088 85853 90009 81491 65892 43737 35575 29380 17274 5280 13136
14948 13136 7565 -5854 -11035 -4637 -3967 -5162 -7952 -5944 11157 4209 6027 15299 2193 -8600
14934 -8600 -7362 -4274 -10896 -10248 -21200 -6761 -306 -8580 -22646 -6989 5893 -5572 2156
14921 2156 -1224 -9128 -8712 -14014 12722 16685 10878 7996 9784 3877 15 -2658 -5661 -11919 -6109
14906 -6109 -12935 -11014 -5525 -9470 -14559 -241 -7793 -9033 -9844 -9282 -6595 -11547 -22481 -17721 -16688
14891 -16688 -12015 -7343 -6578 -13493 -9354 -14735 -26360 -18184 -12411 -10667 -11470 -12064 -3997 -1315 -6869
14876 -6869 -17640 -12838 1641 4832 585 7096 499 -2285 2994 13670 7650 -7807 -17160 -22344
14862 -22344 -19466 -20095 -22908 -37192 -44580 -31158 -20440 -12618 -14328 -19859 -29539 -30958 -23698 -16411
14848 -16411 -7369 -3542 -2987 -7683 -5147 -114 -8086 -7229 -2662 7448 9177 10702 -2379 -10828
14834 -10828 -22235 -7229 2931 11508 7684 8296 5171 -729 -8393 -5592 -8090 -13379 -8504 7188
14820 7188 16290 6857 -9066 -14328 -10031 -20548 -15988 -687 4006 -3030 -4796 -11542 -12141 -5007
14806 -5007 -2305 -3230 -8749 -2028 2021 13920 11973 13268 10782 -3799 -10795 -4660 -5194 -6263 -6736
14791 -6736 645 3487 -5819 -4189 -2567 -1112 -1865 213 2454 -2965 -14590 -12526 -7980 -9422 -18472
14776 -18472 -28208 -23932 -27713 -20942 -9647 -8966 -8325 -9 1374 1739 2988 4583 1160 -4063 -6030
14761 -6030 4909 -3372 -6503 3082 3382 356 -6365 -1240 -3327 -15560 -13869 5111 3757 4680
14747 4680 8992 -9994 -6541 -8988 -20334 -10172 -749 6236 -783 -12965 -14781 -19594 -27753 -34734
14733 -34734 -38028 -30100 -8254 -15541 -12628 -2200 9690 9770 -4970 -12705 78 7613 -4151
14720 -4151 -11579 -13765 -21622 -19726 -10823 -11634 -19888 -21440 -17883 -16892 -13331 -13728 -1130 5772 -4580
14705 -4580 -13299 706 5111 13784 6521 -4863 -1610 7019 -4977 -14410 -12621 -878 -612 -5079
14691 -5079 -10887 -7450 2959 3071 14903 19110 31598 19818 7337 2540 -2216 -14372 3636
14678 3636 2487 4713 2216 -18204 -24072 -6734 6528 10292 8419 -2420 -944 6123 7281 2109
14664 2109 7181 -3618 -6990 4566 -3980 -12897 -16438 -15514 -9900 -708 -8427 -8549 6811 7445 5804
14649 5804 -2454 -3782 -607 -1825 -8994 -13853 -10654 5079 -5088 -2241 -1686 14320 14284 -10317
14635 -10317 -21950 -21345 -18971 -13684 8672 13114 865 5850 2003 1050 6561 4522 -8627 -15826
14621 -15826 -12071 -13857 -7713 -7882 -9176 -11861 -2594 -9530 -4082 10814 -1385 -14691 -10003 -4230
14607 -4230 -5645 6935 17220 14588 -1710 -13874 -16596 -19644 -2752 11741 17920 9292 -4924
14594 -4924 7227 11542 12263 2029 6079 16024 36202 25860 19156 29767 28143 20211 8987
14581 8987 6522 6565 5882 16732 8218 10154 10344 388 -18854 -30576 -18681 -26690 -14520 3993
14567 3993 17925 16998 -557 -3107 18647 20481 11585 6393 3931 -1635 3227 -488 -6063 -7894
14553 -7894 -957 9284 18302 10314 -1879 -4457 -4149 -14047 -1209 11295 17291 15338 16672 -4950
14539 -4950 -1533 5778 14122 15418 1574 -8629 -1152 3960 -6382 -9285 4916 23559 15377
14526 15377 -6793 2101 10908 11346 8259 3230 -3224 -21083 -35960 -20243 -12336 -9184 -13168 -21656
14512 -21656 -28040 -35717 -21091 -22559 -28907 -16682 -4906 -17320 -31925 -22294 -14810 -22785 -25053
14499 -25053 -19059 -4103 20095 11022 -8058 -13965 -16417 -19788 -14329 -7739 -8067 -6758 -10760 -22623
14485 -22623 -27694 -20469 -16742 -13279 -9310 1104 -2055 10827 18186 11396 -10566 -16523 -21758 -5741
14471 -5741 -2460 -2207 533 -3104 -14320 -18534 -18377 -16828 -21349 -23524 -17689 -27063 -28900 -16454 -9816
14456 -9816 3674 6515 -3714 -6189 -21671 -34683 -29687 -1106 -7893 -12710 -5445 -14687 -18835
14443 -18835 -8484 -8555 -22336 -18376 -4056 5101 -11773 -21020 -23166 -28038 -13316 -14493 -11454 -2253
14429 -2253 8546 -9425 -21559 -15696 8794 22929 8533 3372 14150 3864 -5629 8077
14417 8077 4602 -8885 -20667 -23120 6788 14799 5455 -6394 -10678 -12078 -25893 -24236 -12147
14404 -12147 -2383 1228 5210 -4774 -8285 -12781 -7650 -4803 7742 7538 11726 7967 -721 -7944
14390 -7944 -15910 -8469 1269 1834 1705 -2261 2005 -5054 -3721 680 2943 -8102 -8699 3647 11917
14375 11917 10344 14379 32247 27285 12132 5936 5454 15097 14245 25220 18729 10712 11116 19605
14361 19605 24814 16014 14835 3105 11262 15072 7882 10752 21038 28329 25928 24179 13395 -5007
14347 -5007 -11815 -11136 -12683 7628 10195 -3597 -9772 -13898 -21861 -21015 -5491 -10212 4499 5182
14333 5182 -7386 -11842 -9177 -12166 -11260 -12396 -11083 -15124 -28838 -23493 -3788 -10574 -5065 -7019
14319 -7019 -4618 -7291 3105 -2358 -7695 -4658 1242 15209 6403 -4344 -4908 -2767 -2394 -2102 -7370
14304 -7370 -8874 -11001 -9732 -6377 -6830 -18268 -30861 -35453 -33399 -20226 -19047 -9694 5211 19751
14290 19751 28236 14407 10755 2830 5619 8841 14293 13315 6950 3183 -1544 -9693 -2627 8258
14276 8258 40 9015 13037 3506 -3484 -1665 14669 11750 -7091 -33652 -30710 -31774 -24164 -19107
14262 -19107 -23670 -12636 -4725 1415 -1469 -72 6523 22200 26902 18090 26098 19085 -56 -2523
14248 -2523 127 9554 5428 1168 13457 15135 15112 9767 3554 -8 -12832 -14464 11574 3886
14234 3886 -3519 -8851 723 -1699 -8370 -6379 -6174 857 -1371 -1637 -3646 -4270 -13099 -16431 -4567
14219 -4567 15399 22082 7916 10720 20373 14566 19812 12551 7645 7699 6759 -3483 -9380 -2059 3469
14204 3469 -6637 -15202 -2704 5088 508 -5151 -22263 -16662 3399 7207 5091 5677 3207 15459
14190 15459 4997 -18817 -23143 -10987 646 477 4032 6609 -177 -6466 -8210 -14150 -17866 -7026
14176 -7026 2278 -4746 -20031 -24235 -9065 6364 -1539 -6441 -6954 -300 11595 13168 8598 -4079
14162 -4079 -14070 -6020 1689 -530 -8473 -8384 1249 4008 11663 3671 105 3875 16361 9411 5192
14147 5192 12515 8603 -1597 -14744 -20307 -37215 -29156 -22659 -17219 -6372 -8433 -18213 -14640 -14260
14133 -14260 -31745 -31623 -18246 -12744 -8770 -12240 1657 11563 4440 2383 -8063 -15222 -12804 -16736
14119 -16736 -30701 -24553 -12779 -5145 8922 29444 27858 18991 15467 11371 2632 6177 13740
14106 13740 14606 2257 -7802 -8797 -9172 -2333 -3994 -2629 8065 8149 1188 4333 8536 12805 11404
14091 11404 -9257 -32398 -38656 -23079 -6774 675 6631 334 20273 31551 25456 23085 21018
14078 21018 34113 32784 7912 4864 11710 5941 -4974 -9414 6005 4422 -10192 -18602 -17889
14065 -17889 -20144 -12201 496 -6474 4610 23272 16509 799 -6811 -18193 -24895 -30711 -3003
14052 -3003 15588 13616 10396 13653 1990 -5004 -951 -6164 -11771 -14399 -21099 -11036 1044 5250
14038 5250 3989 3955 980 -3198 -21195 -37876 -38101 -23611 -13067 -10311 -8509 12834 16165 7698
14024 7698 838 1708 -12634 -7331 -7228 -5659 -11144 -16509 -16152 1384 11042 13250 8062 5195 -848
14009 -848 -2528 6433 2852 -13825 -17775 6810 15056 7692 3203 7012 24386 17670 9937 11409
13995 11409 15421 4011 259 8941 20509 15593 3990 10484 -5839 -12264 -6551 -6871 -19868
13982 -19868 -6227 -3654 -5179 -991 12722 15745 14314 10485 3915 -15359 -16268 -11078 6473 -4445
13968 -4445 -15021 -32624 -35199 -34334 -29394 -23020 -2643 7713 15663 21121 21592 6443 -1343 -11957
13954 -11957 -13366 2862 17464 23236 18067 20930 18831 15212 27260 28911 28502 12606 12072 17097
13940 17097 5702 11284 9756 5990 4913 -4866 2922 9831 15121 5264 -345 -195 6172 14444
13926 14444 12513 22397 28727 5634 -6817 -4572 -7451 -11749 -8047 -12431 -3241 -2790 5897 13498
13912 13498 11286 11300 -1314 2212 320 -2725 -9812 -22682 -20616 5359 16274 15506 7803 14499
13898 14499 -1719 -7915 10988 22889 739 -2989 5412 6137 8735 7196 -2083 2861 28512
13885 28512 16273 12878 6441 6131 3052 7027 9574 19206 23202 13051 12612 15321 17119 10816
13871 10816 2278 -15833 -21489 -17778 -12925 -10569 -3329 1991 2876 -6207 -8414 8856 1777 -10403
13857 -10403 -16768 -13553 6789 13270 13504 13384 4954 3618 4357 5962 6354 4214 14450 11168 9430
13842 9430 18054 29308 18930 7646 -750 -8060 4768 3324 -2525 3738 2047 13107 15832
13829 15832 13377 -3685 -8352 1170 1677 -3850 -3385 3859 631 -13392 -28323 -23479 -23342 -18133
13815 -18133 -11565 -7779 -310 -1216 -4249 2304 695 49 1602 -6428 -9825 -4002 -10997 -3201 -3664
13800 -3664 -10064 -4031 5912 11655 5098 -3984 -6126 -10718 -18937 -28533 -21989 -24537 -10217 -16166
13786 -16166 -6111 3004 5370 5767 -5675 -20074 -16831 3712 14732 34942 36465 8921 -1198
13773 -1198 5982 -7697 -24835 -23010 -7420 -4569 7959 4232 -7072 -13320 -4127 -490 175 -17192
13759 -17192 -21415 -10239 6117 11310 1010 -5674 -18088 -28948 -9210 9509 17019 30925
13747 30925 15817 4309 15564 16582 6833 1593 -2755 316 14935 22244 1069 -5585 14094
13734 14094 16044 6211 25046 16725 13290 13477 10653 3154 -1783 -12037 -20271 -20905 -32101 -36212
13720 -36212 -32577 -2131 8755 3103 15030 19895 13728 5055 12577 9057 -7532 -17023 -12932
13707 -12932 -17107 -13841 -17221 -10351 3902 5309 4814 7099 12666 11654 23108 16254 19034 9170
13693 9170 3691 -1735 -7996 -9908 -2824 13914 21690 29783 18102 11362 12987 15856 11710 -2953
13679 -2953 241 13398 6328 -5138 -8168 -4621 -7662 -17189 -13086 746 2983 5266 961 3945
13665 3945 13446 25096 23342 13032 6563 5315 15022 12966 10019 10735 8898 12829 15782 14600
13651 14600 366 -17859 -24910 -13831 1383 1311 -14337 -9336 7318 4041 -7175 -2943 -541
13638 -541 -4141 -10999 -26066 -18318 -5275 -5745 -2196 2937 -8487 -9080 -16497 -15722 -5063 -2759 -22148
13623 -22148 -27199 -18285 -11443 -11824 -14570 -12078 -13817 -21034 -22907 -16540 -15644 -23802 -22668 -19224 -19784
13608 -19784 -10637 512 12876 8467 -65 589 -7402 4002 -900 -7246 -13582 -27066 -24339 389
13594 389 13234 17542 18707 16411 11493 9910 18943 25605 16531 1360 -4501 -5529 -1639 2987
13580 2987 702 17575 35524 36688 15384 8107 11157 4212 -309 4533 2300 -15408 -36514
13567 -36514 -37509 -24631 -14268 -20247 -23201 -9812 13284 29651 10199 11130 11494 3607 -14 7767
13553 7767 16609 22189 13529 8331 11287 6198 7533 1992 4803 15214 18455 10407 -2378 -973
13539 -973 -7112 -2515 -609 -6884 -8636 -641 8756 11027 10620 21354 16345 5902 -540 -2476 12593
13524 12593 18335 19216 6232 -283 1725 14120 22989 24736 12648 -4520 -236 -1163 8295 22266
13510 22266 28381 29754 10709 -11809 -11190 -10752 -20398 -21185 -11622 -4897 -9140 1662 21825 26123
13496 26123 12291 3047 -2607 -11954 -18584 -5745 6245 10433 -3192 1554 3842 -6541 -802
13483 -802 10921 29217 49417 55211 52497 62140 60093 51270 36315 36737 32624 19372 -2613 6903
13469 6903 20092 14901 1159 -10147 -11538 -4351 15094 19704 9342 -3032 12439 9747 -13713
13456 -13713 -13716 -13081 -2688 -769 11053 13389 18866 26521 20477 3612 4236 5188 10056 13709 27364
13441 27364 16363 -515 1222 7682 9360 12627 23278 21879 16745 6961 17460 11812 16333
13428 16333 13572 17542 4613 3642 9700 17888 20242 -5727 -17616 -17156 -4841 -2816 -1002 15364
13414 15364 11538 14005 -1519 9462 19083 16076 16466 11841 12887 2103 -3005 9605 16979 6637
13400 6637 722 26114 37317 15193 15514 32976 37625 48791 39447 14332 20481 22752 10631
13387 10631 -12696 -18296 -12676 -4864 6696 3747 8949 17299 27504 38227 25208 28658 31714
13374 31714 25763 31814 43318 41398 23476 32456 22182 22956 22173 24671 37523 25359 19951 21069
13360 21069 5490 4008 -3318 -6657 -467 -3389 7289 22961 20407 21911 36507 31237 23518
13347 23518 30800 33434 22381 20803 21386 28248 40752 48154 34174 21476 17203 5461 3020
13334 3020 -1706 6440 5038 9201 10281 11272 14137 16186 21655 29838 5480 -6427 5612 23764
13320 23764 24011 15491 3293 -1912 1391 3310 946 7146 11893 20360 22067 33910 43568 54268
13306 54268 66583 74091 78666 88740 92789 95431 108393 119464 145050 177723 214963 290358
13294 290358 403536 585690 846184 1143375 1415860 1603662 1688565 1641950 1481669 1233585
13284 1233585 972345 740836 557063 434129 344917 272014 212379 187784 177137 140829
13274 140829 110687 95884 89832 78783 72774 60594 54118 47767 42853 49737 51416 42516 40463
13261 40463 26514 32183 19456 18357 23661 28720 16022 26615 33886 18906 12402 -6361 -14262
13248 -14262 -14710 -5096 -8773 -2019 8178 5492 2854 273 8690 24606 25570 11584 -1223 -2943
13234 -2943 -2532 -8065 26509 37326 21257 14698 10434 295 -366 -5729 9013 4384 358 12594
13220 12594 14454 7697 -114 -2447 -6176 -10461 -18834 -26004 -25688 -17388 -8438 -10096 -19411 -35091
13206 -35091 -33309 -25806 -27881 -26799 -19639 -21472 -11980 7222 11646 15088 8614 5584 4598 4115 -1108
13191 -1108 -992 -2406 -6346 -13018 -12128 -18341 -9519 -7872 7870 38566 67038 95216 94057 94484
13177 94484 91440 76198 63305 42427 45170 49124 48237 51028 52413 50341 46914 53724 43295 45912
13163 45912 35620 43531 46396 39941 39586 52426 40753 27088 35956 34990 26730 31445 32382 28868
13149 28868 32664 24325 18198 24226 40666 55684 42984 31016 36829 44271 52263 37000 30408
13136 30408 33577 31697 37118 46881 43742 24797 20876 16777 3263 -201 1478 8990 7792 24759
13122 24759 35305 40726 57818 66936 66855 60728 53006 58773 63839 60202 75255 78550 70922 82741
13108 82741 87262 83688 84672 108082 112185 121962 126459 124156 122881 121710 131249 120392 113606 106581
13094 106581 88978 84994 77088 88130 94216 70159 62244 72275 77311 74970 67859 60691 53799
13081 53799 55855 58730 57290 66215 59796 56984 62208 62644 63183 59943 51949 48503 34983 45275
13067 45275 41645 23196 26561 37762 26783 28363 44719 33143 26741 21966 24469 29921 30233
13054 30233 14716 5064 9675 9907 11395 14226 30615 48432 61150 66277 63122 60570 36265
13041 36265 18394 12783 4595 -16157 -25930 -27139 -18514 -13495 -2348 8667 26799 47747 57150
13028 57150 75313 93433 102450 111706 115681 98161 104835 116051 131063 146852 150053 153983 158041
13015 158041 146353 138475 126392 125920 121016 119755 104365 82902 90532 106940 114134 119260 118367
13002 118367 113441 100689 80724 93087 90552 92325 92157 92658 97590 92409 96100 111014 114938 109990
12988 109990 115685 116544 124036 133850 150742 151963 152135 150519 147607 141923 144468 143294 152366 170514
12974 170514 181119 220026 265926 296075 321615 344927 379792 390541 388023 386017 379303 337629
12962 337629 294363 257303 216281 188594 172651 177140 196932 200829 202477 218736 223606 200734
12950 200734 200358 191103 190962 199089 199420 185072 187226 188462 186173 170039 157176 156430 158673 159776
12936 159776 169503 183392 189393 197018 209128 226032 224026 213526 229662 242348 232833 241150 254055
12923 254055 254117 280836 324795 353609 375913 393445 409066 425077 455057 478109 477432 465686
12911 465686 477155 477947 483761 485467 490115 487488 493975 515783 521110 530474 553976 560350 586353
12898 586353 603518 617076 643649 671870 705326 743043 790965 829995 866850 893458 917649
12887 917649 958975 1026341 1098971 1161153 1214804 1266294 1319728 1377578 1445100 1517601 1606063
12876 1606063 1699479 1800516 1903857 2033566 2190647 2354054 2512119 2669495 2854724 3058317
12866 3058317 3301815 3585871 3935352 4371981 4896563 5538788 6322737 7293156 8496615
12857 8496615 9977454 11712762 13761597 16319920 19661905 24245621 30798658 40485785
12849 40485785 55257883 78398233 114451450 165995983 225487119 275944887 307546667
12842 307546667 319768738 308729196 273168414 223990763 174934854 133547614 101684764
12835 101684764 78029887 60458477 47406580 37796568 30722643 25425929 21352979
12828 21352979 18115252 15427727 13175069 11312992 9789324 8549228 7533113 6718462
12820 6718462 6053715 5469813 4945060 4488287 4120569 3829256 3578539 3349738 3150107
12811 3150107 2966835 2765230 2567661 2392872 2244503 2090914 1945380 1843537 1753711 1678532
12801 1678532 1618518 1553535 1483255 1419886 1370241 1313039 1248791 1224525 1198599 1216932 1265023
12790 1265023 1338089 1466142 1576353 1660172 1696427 1657295 1549387 1414903 1287059 1178913
12780 1178913 1079498 1001145 929605 860517 791225 730262 664311 611787 575400 531200 486947
12769 486947 466664 448994 441850 443291 450063 464897 471511 471940 476206 476430 483916 475284 448850 458397
12755 458397 454716 435630 421948 425938 415744 396518 384558 380772 376212 378997 386270 367519 352519
12742 352519 336485 325133 320520 308870 313344 311710 305386 290142 271041 255299 245561 241594 234365
12729 234365 234876 255749 276434 278891 284929 274544 250495 222426 178351 130530 98329 86842
12717 86842 84705 69021 80639 99632 119494 124477 129604 137962 167573 178654 180155 179462 175702
12704 175702 171595 166769 160268 152141 140197 135503 134970 132912 144243 141575 144522 153051 157699 156854
12690 156854 153551 146798 138560 115684 102091 101203 95763 83154 69519 52721 56492 63293 86646
12677 86646 108821 120297 122390 131992 127122 94914 63629 64528 64793 50239 36526 32689 28554
12664 28554 20837 23741 35255 28442 22895 20190 26662 39770 60174 86730 116069 115429 106564
12651 106564 126532 158260 173050 179521 178865 169644 151908 119305 114497 116576 123781 126695 120682
12638 120682 129025 117217 104291 109904 104568 102260 105277 99714 97706 96086 94006 87583 78473 73118
12624 73118 77532 74965 45497 34963 36702 53798 70243 80570 80277 88164 105468 87187 79201
12611 79201 78656 72974 65302 56971 64168 75941 89171 102823 116499 125634 113583 109339 105162
12598 105162 106026 96337 77040 68166 62410 55698 46517 46017 50594 50173 52195 60989 69418 65523 63179
12583 63179 67160 72099 68850 68925 66652 74250 84590 82519 78145 63590 53658 49630 57714 45009
12569 45009 34261 20168 -3029 -10548 -2504 17726 28017 25373 31094 41310 36076 26082 26578
12556 26578 34699 44697 54036 62473 63430 62708 42001 30923 20573 21392 33327 40150 39043 32052
12542 32052 32869 33210 31894 42984 34893 24071 28894 28351 28696 27652 23229 13231 15982 37898 54437
12527 54437 72674 96670 98518 103820 106697 112221 96417 72574 70562 48446 26481 18403 31591
12514 31591 35724 16420 11240 10282 10143 6822 -2457 -18226 -24099 -1343 24273 54480 61785 62284
12500 62284 69024 74953 84987 103659 122922 130717 140070 140009 130830 117889 110677 100597 77025
12487 77025 77178 84599 86857 94455 123620 145715 167684 177728 192617 207226 220277 228608 232570
12474 232570 225262 224619 218807 202998 189065 189918 198826 209471 241132 273773 298400 307789 297544
12461 297544 281130 275780 287084 316029 346886 394481 452597 530369 633568 750801 830504
12450 830504 858338 832682 763956 673815 597735 552333 523851 518996 526550 524330 521572 519904
12438 519904 505374 456336 394419 352465 321448 290197 276756 255192 223164 228697 241465 229371
12426 229371 220954 211845 204387 196485 181826 184101 184380 189689 184148 169785 163882 152353 142166
12413 142166 149356 144299 143032 148545 138589 154620 184832 199941 226957 239304 267771 283142
12401 283142 270405 252873 246796 256632 307911 388427 492055 671850 925984 1214204 1474193
12390 1474193 1639055 1697237 1622866 1448258 1191043 945252 738003 590410 473188 378850
12380 378850 302643 240751 201508 175921 142495 126367 108058 98498 103035 106259 97977 96143
12368 96143 93306 85243 76051 73561 71148 66714 72542 62861 52796 37441 36032 35931 47624 52656
12354 52656 60296 55283 47547 43296 48473 55162 48978 40310 37566 28479 26034 25652 37062 52009
12340 52009 41648 35445 27488 47543 36622 11845 24457 35264 31450 28495 22065 29093 25912
12327 25912 24417 29384 17161 15729 17730 24635 16133 4082 11050 4335 -5413 -13458 -14975 -237
12313 -237 -408 11385 27297 9702 2701 3767 11057 16696 39485 47802 44464 35508 31311 34228
12299 34228 29905 19792 12186 14410 19667 19783 23443 20738 8810 2247 3745 12555 14085 11463
12285 11463 8016 4360 12923 30126 25326 13761 -2730 7062 17894 12963 -2217 -10046 -3818
12272 -3818 10119 15207 15961 15945 -2374 -8315 -6059 2096 4488 8948 -1171 2339 8728 5479 7540
12257 7540 2263 -592 -5654 3364 10443 739 -11417 -11803 -1796 -2807 9903 14085 12566 12527 15365
12242 15365 7806 2103 -6845 -6684 -3488 553 1847 -7811 6608 20397 21882 21422 4386 -6033
12228 -6033 -10167 -7041 25073 25754 17933 1181 -14684 -12053 1781 8163 19668 27711 18414 10862
12214 10862 3674 22120 28843 23268 20449 25639 43353 36011 20812 16536 40173 40814 26894
12201 26894 12120 869 -3336 8396 -1305 -2300 2975 12279 2866 -1132 1431 4468 2632 14890
12187 14890 31390 30662 33890 22829 24361 25026 21714 43740 38297 17068 6214 -1518 1561 6717
12173 6717 16240 14537 9153 -4921 -20641 -11743 9215 9261 10814 10353 -2290 -9387 -13781 -16699
12159 -16699 -11515 -10207 -4801 -8753 501 3092 565 2537 14423 15676 14429 -1388 2064 258
12145 258 -3113 9911 22069 25449 20360 10000 4971 9482 -1367 10447 17448 14295 5762 -9121
12131 -9121 -1981 10963 17264 11890 15441 18060 27656 29195 30203 35524 41532 43695 44238 39144 36701
12116 36701 26546 22666 16884 2191 -1234 -13756 -11606 -12984 -20394 -5135 484 7152 6761 -6011
12102 -6011 557 13273 10177 8025 27922 33137 18356 3357 9566 10141 -4192 -8179 -6551 12426
12088 12426 18675 19673 22850 19014 10341 -1179 7482 -12058 -20569 -18675 -17470 -14373 -31956 -26714
12074 -26714 -19089 -17573 -5567 9148 7089 -450 -11022 -13690 -15459 -14233 -5444 -4686 3433 16148
12060 16148 12484 -4321 -22270 -17143 -21713 -15420 -3473 -1327 13750 39758 34810 19526 13613
12047 13613 5425 5670 13689 17825 4166 -13652 -12858 -25414 -21917 7772 21150 29913 51196
12034 51196 47019 27289 22711 19820 18139 32309 39332 21594 17076 15626 19903 30245 15008
12021 15008 -460 -5582 -2047 5719 22553 20192 17887 3363 -2362 -4686 -7046 -912 1367 9360
12007 9360 5547 -1272 1257 -7358 1571 14322 6426 1676 9891 5182 3298 -1048 -8777 -5000
11993 -5000 7960 23895 37420 27634 22764 32066 32531 15925 -8179 6366 21320 24934 16090
11980 16090 2212 418 -5047 -3934 3330 18845 14416 6292 18560 28439 21831 18201 28064 21915
11966 21915 2858 -10968 -5925 -7502 -14611 -16638 -7319 -2527 -3856 -4302 5505 4062 -10440 -18221
11952 -18221 -8120 13036 21016 14689 8123 -1815 -2362 5376 18869 10548 2619 -5658 -7407 -1146
11938 -1146 1713 -6123 -12010 -13117 -17839 -8914 3613 3987 3486 8210 2882 5173 -3500 -14732 -3942
11923 -3942 7352 14595 16601 11445 4597 2149 987 12236 22267 11361 -5406 -10092 -1050
11910 -1050 -9612 -13364 -19667 -23315 -15437 5344 17525 15097 1970 -1529 1199 3168 8146 8173
11896 8173 506 2886 12993 14027 6534 2071 164 -2371 -10896 -950 5830 3625 5480 4146
11882 4146 -12099 -22610 -7850 -2455 -11354 -22717 -30497 -29182 -6045 -3763 -10148 -10516 -13949 -16583
11868 -16583 -24129 -36249 -33483 -19907 -5184 -14087 -25933 -31011 -25079 -17900 -11098 -15087 -14082
11855 -14082 -6115 8529 22697 28263 25066 25187 11224 5346 20711 33347 21516 16325 21190
11842 21190 16751 7439 5951 -8836 -16227 -15740 -20181 -14907 -17120 -15988 -11903 -10697 -12360 -27394
11828 -27394 -29101 -25549 -18637 -14620 -20530 -15466 -7486 689 -4399 14460 18037 5269 6875 10588
11814 10588 9815 5371 2564 7068 16999 13389 14120 14578 9205 10 -8395 -4915 -1605 659 -3707
11799 -3707 7930 2219 -5264 -5148 3586 5456 11501 7892 2717 5378 74 -7969 -13472 -11004 1550
11784 1550 21987 18873 27217 31240 28355 29614 31388 17828 20256 22907 11594 5877 5129 4283
11770 4283 20354 9034 -1926 -12496 -6808 695 9893 14124 3657 -3449 1713 1864 11371 7600
11756 7600 1625 4848 8081 1802 -12027 -6685 -4000 -12088 -11187 -11540 -21026 -28787 -23315 -3044 -5165
11741 -5165 -44 -10926 -13785 -6049 -13327 -15711 -9972 -22164 -19887 -19735 -20289 5869 21008 13490
11727 13490 9456 -676 -2088 6035 -6364 -21526 -8700 -4268 -15225 -16565 -16107 -12497 -13785
11714 -13785 -2683 8131 8303 5160 -3114 -6385 -5293 -13259 -13685 -7268 -3681 3456 2072 10349
11700 10349 6289 4000 -3799 -8327 -5577 -7281 -15905 -13251 -16353 -14896 -11062 -7133 -5696 -2192
11686 -2192 4051 8445 11305 1776 -8294 -4774 -3552 -4459 -6566 -5850 -4437 -2207 -2196 -15575 -22330
11671 -22330 -19265 -14127 -1547 12753 13332 -1408 -15534 -16145 -13491 -4983 -5429 438 16950 30843
11657 30843 19561 2759 1638 7670 9084 20075 17172 4672 -13426 -13611 -8029 -5681 -12292
11644 -12292 -3806 10293 23985 20087 1554 -6517 -13110 -5744 6548 19682 28405 13370 -455
11631 -455 -504 3381 5568 22834 33563 42492 41732 41494 73172 108318 118148 119017 94237 71960 47702
11616 47702 26701 22426 25735 18992 16193 11080 -6192 -9040 -8087 -20133 -28234 -19781 136 10220
11602 10220 16213 13067 -3795 -15174 -16070 -16463 -16723 -14623 -14146 4135 16449 20600 12564 12576 364
11587 364 -1697 -9397 -15010 -23278 -28221 -15131 7269 15741 26363 29802 28088 36429 30142 10385
11573 10385 -7666 -10991 -13774 -6557 2651 12669 7818 8295 17648 10684 2338 7799 27075 31050
11559 31050 20498 2442 2394 -1109 1188 5754 15172 17757 8060 4329 -11313 -25607 -16332 -6791
11545 -6791 -12411 -17732 -10905 -9295 -10220 3923 25700 31978 45271 36848 21724 19756 4781 -3733
11531 -3733 977 7558 7315 5659 1133 6984 10927 11030 16960 7200 -4080 -10064 -10143 -4387 13913
11516 13913 26671 32149 36785 22534 16988 26128 36605 35339 17474 11551 -2413 -12447 -18737
11503 -18737 -14086 -7305 -8076 2405 1756 -4165 -13033 -11237 1496 -496 -3972 -9297 -7571 3654
11489 3654 6055 13769 -5275 -7544 6952 17278 24503 18032 13743 8899 12872 11894 18169 23377
11475 23377 13938 4156 3549 -5101 -6001 -3839 3467 955 25258 21639 837 1453 -12140 -3299
11461 -3299 13729 6132 2734 10729 11529 10220 6038 6820 4094 -11646 -19329 -8669 676 -11752
11447 -11752 -13581 146 11621 9951 10881 10689 12751 14620 11795 17157 21150 22896 24639 14721
11433 14721 17473 22833 11871 16033 12287 10002 9084 -7073 -12420 441 1680 -5213 -12879 -3599
11419 -3599 7604 9772 9105 9415 17034 33501 27802 21339 18289 24384 12720 -236 -6307 -7932
11405 -7932 -6410 378 13921 18980 13042 10830 8788 23497 25996 22035 33680 16696 -7499
11392 -7499 -24217 -25858 -23876 -22690 -13162 -16202 -11457 -6914 -6815 1598 6460 11650 19212 9593 -7954
11377 -7954 -14725 -257 1795 18610 17407 17081 16456 17980 21334 29432 38563 27151 -1956 -3552
11363 -3552 10591 29787 26998 16180 9765 7701 7383 4206 -1949 151 3561 7287 -6643 -23284
11349 -23284 -12889 -4936 -12341 -24053 -18437 -13550 -16435 -15881 -12898 87 -8776 -19195 -9504 3910
11335 3910 12929 7396 2078 -3162 -12124 -13783 -10347 -934 -9454 -14321 -8827 6115 18737 20867
11321 20867 7566 -6452 -10432 -4724 3410 7086 22706 11628 73 864 5967 13609 18917
11308 18917 8852 -7353 -18927 -17382 -22824 -13841 -2338 2053 -10640 -12427 -5874 -7064 -15086
11295 -15086 4744 6502 -3557 1635 8651 5839 -3488 -9212 -15304 -13422 -10749 3017 10750 15201
11281 15201 11333 11284 20608 34010 42472 57368 42534 18744 2450 -13902 -10175 -17884 -20675
11268 -20675 -5727 9975 18653 18537 7005 -4979 6179 11225 8533 5754 1640 8906 1911
11255 1911 5282 25841 26174 1929 -9730 -10849 1819 11817 7084 5190 10145 -1380 -4671 4656
11241 4656 5074 2074 -6162 -7384 -2840 -3556 5060 8515 6728 9159 15494 23140 19091 9286 9668
11226 9668 17529 17687 25829 39899 50386 65429 83867 88779 93808 83955 68730 44249 23689
11213 23689 22068 9944 539 5024 8530 5633 -10049 -6155 9891 1145 8019 41357 48089
11200 48089 29007 6577 4676 12068 17130 15064 16469 2335 -8963 -11752 -3433 15048 39043
11187 39043 72763 90897 74206 68809 55372 44032 32817 23664 19625 16200 9872 -728 9834
11174 9834 15539 13685 6485 -1565 4548 -3617 -8174 720 15003 17050 20180 3870 -6055 2386
11160 2386 10590 14573 14735 14016 16041 9682 16974 7693 3487 -1543 10953 16029 17590 9920 -300
11145 -300 -9370 -9890 1037 1860 2261 7173 4838 20705 15363 7797 9639 11472 9406 14230 27565
11130 27565 40636 36071 36628 46490 45276 44388 28972 29444 31554 8922 5960 10458 21709 20421
11116 20421 10033 272 -1804 5270 2654 -5798 -7091 8217 23027 13963 6668 4355 6463 10954
11102 10954 14371 28467 34211 14545 26304 46821 50338 52298 59793 63234 50043 40212 22299
11089 22299 8141 13759 28291 28527 14679 4649 -18057 -14996 326 7870 13775 11740 4016
11076 4016 11385 14296 22106 24910 24879 24313 10516 -6213 188 -2891 -3768 7542 8809 -2655 -14421
11061 -14421 -19057 8131 23074 22512 22449 21848 10117 3575 2505 534 3673 14307 11095 17039
11047 17039 21474 11991 1815 -611 -7733 -4258 -428 10625 7327 -1554 6108 16345 14375 471
11033 471 -4915 17496 22313 18990 20867 23083 24572 24315 4842 -1434 -6113 1788 9096 845 1325
11018 1325 1863 -8777 5947 17513 19262 14688 22092 13715 12469 6337 -3102 -8209 -4207 4395
11004 4395 10791 26903 33374 19665 13724 5087 12958 13477 7061 -4706 -7108 7916 13330 692
10990 692 -5553 3003 10646 17498 20044 20780 16741 -2326 1729 13466 25923 34099 20227 15863
10976 15863 15007 3900 10059 7490 -6811 5216 13689 16829 24091 17995 17101 10270 4616 -5011
10962 -5011 -16729 -21775 -18998 -3950 -13702 -16231 -14374 -6328 -12038 -17884 -15381 -3797 679 8441
10948 8441 17070 6096 10885 7306 11028 16425 29552 31574 29683 7023 -7256 -174 5127 -2018
10934 -2018 -3884 -9111 -4765 389 13094 20746 15188 18178 27730 34152 26182 29978 19874 -1298
10920 -1298 17853 25948 25193 17473 14902 -4832 -9398 -363 -9137 -16425 -15120 -7552 4896 16021
10906 16021 9965 -4607 2527 5710 -1382 -5051 2694 4401 11379 9825 -213 -11979 -14410 -13073
10892 -13073 -9545 -7168 -11655 -20081 -32449 -28801 -9602 -2495 -17487 -29486 -11411 7018 8298
10879 8298 -3833 -8156 -6897 -1916 13362 20977 22555 17313 22422 9904 8484 11984 -6336 508
10865 508 13611 16485 7173 -9597 -5241 801 5565 6606 13511 25729 36974 39126 27836 8140
10851 8140 -23 10796 11455 10046 18264 15922 13590 5410 7423 3713 -5262 4515 2094 1128 -14797
10836 -14797 -17750 -16905 1421 16394 11077 6623 2607 9027 -1206 2164 10825 6467 14351 21609
10822 21609 634 9459 -864 -16591 -3186 21975 18417 -801 -8174 -18414 -13417 -1114
10810 -1114 23478 22752 12800 3803 6660 11436 9839 5212 13796 5368 11839 19733 7334 3440
10796 3440 17001 23563 10515 7262 11706 -1025 1445 -4747 3692 16293 12044 1210 -2637
10783 -2637 8293 12061 9672 8409 -1949 827 -7065 -18276 -5400 9124 11704 14169 20255
10770 20255 6903 -1233 -3810 -1144 2476 5213 -676 -10406 -13309 -25768 -26512 -15456 -4604 13495
10756 13495 15216 16018 19006 11703 4559 6150 4468 615 -2876 974 6319 -20 -19646 -23166
10742 -23166 -576 -3894 3374 13030 4062 10213 12372 -3070 -2417 7433 15963 6324 -12042 -22072
10728 -22072 -9682 -4955 -1168 -455 -9476 -3910 -6980 -13557 -4099 218 -7461 -14148 -17071 -13308
10714 -13308 -7231 -7431 2471 2804 3567 586 -7056 -5719 -10954 -9968 5640 5549 12848 18941 20722 14717
10698 14717 9618 -6793 -5409 5705 28520 20801 14157 7302 5711 12168 7844 -5560 -10313
10685 -10313 -20492 -12658 126 -8348 6499 16735 406 -23056 -16122 -2920 4443 23905
10673 23905 22206 19827 25513 13005 10561 20561 9039 8597 -7640 -13827 9773 17821 15610
10660 15610 8943 9171 9373 5010 -12235 -28775 -16475 -7133 -8371 -3690 8357 10956 9162 9430
10646 9430 1561 1815 -2287 -11433 -6268 -5319 5431 -3951 -8527 -20966 -27345 -6393 17303 8071
10632 8071 8456 19631 35443 22606 1779 2824 5651 8713 22244 31848 49387 61834 68372
10619 68372 87546 75758 67842 49027 36125 39678 31696 24992 24683 22907 24708 13998 12997
10606 12997 12199 6836 15947 16863 27211 23952 25403 25453 18565 22393 38420 51826 43093 42225 38437
10591 38437 21164 10004 11672 12402 11601 18192 23800 25427 25026 13592 18587 33716 49200 38754
10577 38754 11622 11156 22358 22070 17598 20549 8249 -3732 -7706 -11736 -5596 -5224 3538 15031
10563 15031 7790 3307 16449 17449 13197 2146 -9267 -12110 -14458 -17758 -15070 -5208 5636
10550 5636 15515 11207 18158 27171 35089 48033 48286 31588 17775 18630 27483 16688 10955 5906
10536 5906 5254 15481 18005 13609 15700 15537 21907 22011 23364 23733 5170 8612 15725 21675 33115
10521 33115 33536 26906 24594 17681 20050 23498 34710 38438 36175 35769 41801 56121 65396 76907
10507 76907 115669 175039 266509 419931 670838 951905 1043256 909550 696377 517652
10497 517652 386153 295848 229739 166702 125232 89841 74220 68171 56969 55071 49907 48192
10485 48192 44242 37646 21841 20554 27424 26250 19328 14371 14501 19191 34456 28558 19917 29507
10471 29507 19494 9128 14501 12317 6646 8912 16824 14220 2533 -6275 -12315 3942 11859
10458 11859 14814 22875 22835 21153 25038 25651 13111 22210 35788 35319 16876 342 -8640 -10336
10444 -10336 -10073 8578 17979 14892 18828 26896 24244 13912 10488 9186 13990 23199 22331 21225
10430 21225 17391 21004 19138 31799 43855 32122 21339 25270 33953 31354 21649 22127 30836 18932
10416 18932 4155 15779 18702 25688 24928 11216 7718 10717 4719 -8882 -5401 8373 22105
10403 22105 26820 21228 17053 6693 5299 -1370 2558 1483 -1048 2324 5183 6077 -1790 4419
10389 4419 16637 20414 19384 6195 -9256 -13454 -5500 -2473 -4967 8283 17687 22617 21123 6810
10375 6810 17870 30973 19358 12814 8103 -929 -3902 7970 -900 -13922 -15671 -5535 -9466
10362 -9466 -7035 1848 5598 7997 4150 7541 4572 -2004 -15651 -11935 -9804 -5798 -9467 -19395
10348 -19395 -12041 -1859 -955 8356 16156 8680 8541 8767 18728 14840 5899 5179 5467 8585 20726
10333 20726 18889 7164 3978 4523 6853 12807 -7884 -14626 -10795 2740 9860 901 -7309 -5034
10319 -5034 -1876 -13846 -8600 -1696 3109 -3993 -8586 -4908 -12396 -15114 -19984 -4574 3912 23025
10305 23025 23136 17237 11892 7383 2807 12888 10720 14025 5364 4694 -3356 1702 8456 19260
10291 19260 23535 19724 13337 14908 15969 22308 24851 21622 17015 31954 29785 19731 444 -7238
10277 -7238 -13671 -1212 9972 9113 7417 11783 17436 7671 14919 23956 18318 13743 12262 19479
10263 19479 22901 15716 13889 6473 2031 1191 14167 12042 10191 8085 6191 489 -554 10497
10249 10497 20525 28419 34531 25859 44242 26826 16216 6183 10102 18768 14435 13815 28829
10236 28829 24625 17378 18307 26330 31881 21762 14065 21087 17575 18020 20955 27882 26554 26981 32885
10221 32885 43585 43797 46549 56092 41339 32727 24757 22999 21057 22976 34555 28180 23842 18052
10207 18052 29756 29809 31572 22166 10561 10798 20108 11459 12799 31918 26682 23318 15425 12611
10193 12611 18894 23255 19005 20132 14713 9533 9547 11493 24721 19915 19226 32713 34554 29987 38024
10178 38024 32584 32452 26764 24800 32946 46307 63077 64603 54132 41065 51442 30612 18589
10165 18589 26396 22108 15578 6543 21442 38021 26412 19067 27155 23886 29049 26953 26173 20119
10151 20119 27454 23557 26683 24444 17919 22693 34928 43306 40302 29782 23386 17604 30721 35222
10137 35222 38684 42426 32140 23902 16061 8372 3908 -11074 -19538 -242 20121 32820 22598
10124 22598 25839 22047 22284 19499 21161 34422 24191 15002 15396 24011 32508 27518 37265 42771
10110 42771 51930 36275 22430 2007 3141 7862 17991 23282 34079 44250 56187 54891 40418
10097 40418 35859 38383 26870 25688 32419 33822 32275 24349 23099 16922 23162 34439 31637 17842
10083 17842 16494 35634 39737 22998 10356 16487 26596 28501 21211 7663 14898 34002 31543
10070 31543 30081 26968 24339 46277 38816 19147 17213 17279 14837 25970 46864 50109 61240 53242
10056 53242 42972 41992 37937 20516 11888 10649 14640 25910 31860 36705 37649 30912 34151 56560
10042 56560 64988 62704 59793 56711 50158 63350 75852 84626 85035 93673 99778 112465 143805 180298
10028 180298 252405 366708 582402 974886 1578862 1984411 1827728 1429336 1055846 765440
10018 765440 569015 430930 327486 256408 205598 171400 140353 127935 97229 88075 80278
10007 80278 62095 64160 58540 53109 59515 74401 78881 67533 44829 37250 29567 27158 29621
9994 29621 31233 25539 16624 18813 33423 37755 28758 30626 34391 37209 47223 47468 57057 51111
9980 51111 52087 53488 48024 54610 49393 45200 45350 59472 61859 59018 54789 62593 61097 64685 60671
9965 60671 40978 38940 44476 51843 42678 35954 45143 44026 39624 49053 69460 72554 66886 55659
9951 55659 54921 62590 66152 48696 30460 44893 52050 46665 64109 63458 44865 54392 56484 60992
9937 60992 76194 79255 61394 48724 64145 64593 71186 69337 66729 75770 82009 83888 83154 73797
9923 73797 68537 73802 79190 83998 81198 68907 62775 49705 40814 39621 36486 29366 29866 36386
9909 36386 45774 61282 65587 65711 65837 51187 47974 46426 56909 55438 52328 51265 45993 48374
9895 48374 57799 62066 58105 52785 47836 55638 60846 69435 67859 77401 83130 75391 76998 83744 84178
9880 84178 84045 101257 112019 110223 85596 92962 101297 131735 182170 218441 228491 219833 210151
9867 210151 184224 167471 148385 120175 111042 116116 110863 107656 105338 93544 102970 107312 95783
9854 95783 95285 94251 101139 98561 91860 89890 101959 107814 108396 93990 92660 95586 91222 100035 102505
9839 102505 80753 83605 90784 83885 77911 85447 105618 123612 136701 139660 130457 122334 129261
9826 129261 124509 124037 117785 111129 112068 114983 121043 129045 130717 147080 156737 151864 143508 151086 139521
9811 139521 138926 132563 132053 144781 147745 137964 149754 158427 156788 154559 151315 136844 123288 120707
9797 120707 118670 141677 154044 151930 144117 137585 137180 131657 136560 160024 178909 190017 206098
9784 206098 212795 196007 181271 179462 178850 178180 189150 190227 175789 167535 158877 159069 166320 172927
9770 172927 175079 176555 174085 170871 175859 172219 164729 177857 176774 184847 187453 179056 164924 165661
9756 165661 177772 187234 190137 191108 186264 194420 204163 196907 202346 210439 197097 202211 222474 233746
9742 233746 248396 250975 246729 237200 239125 241373 248002 249726 258355 260064 257044 257837 253512 240259
9728 240259 255191 252672 245194 251680 263438 273879 289714 290454 272952 268054 275703 289039 310055
9715 310055 314370 302386 285123 290933 279344 288232 312089 309364 304308 294454 298795 306336 312906
9702 312906 301860 298504 317171 332794 348412 355946 348845 349118 354439 352351 360510 379609 379594 373907
9688 373907 373101 378541 374924 383252 406844 416454 406562 398713 427114 432709 428279 432475 432216 441034
9674 441034 445325 451924 448457 433928 434430 434369 444933 454418 453485 451940 454706 461262 465598 468392 470141
9659 470141 482527 492529 492254 490978 487064 487024 495721 484608 487437 494545 507597 517705 514580 503902
9645 503902 500002 509144 512621 530632 538364 526154 520307 518869 525063 517626 506901 513824 524651
9632 524651 537792 540313 537386 527736 524325 540381 542827 546538 558418 554764 551264 546507 542535 533914
9618 533914 523204 519723 515410 519838 522607 517432 518760 513936 519284 518650 512274 505737 508754 505081
9604 505081 488035 486762 489443 470526 465346 471165 474164 465672 456812 461619 458085 458774 450516 433816
9590 433816 415109 415183 423675 436001 426585 414586 409053 411885 408293 406067 397613 398566 393418 383804
9576 383804 354336 352700 354117 372907 382597 373306 380316 371266 361109 363254 363038 357386 344698 323607
9562 323607 310624 318558 325413 327917 343489 346201 350014 341311 324887 318833 316134 297623 290640
9549 290640 306936 308222 312090 305014 306131 302287 303874 299491 312389 308594 294599 275438 273746
9536 273746 275323 270881 257852 250244 247769 255450 260605 249955 248492 254323 240664 227824 233448
9523 233448 243285 242894 240851 233761 227481 226558 232907 225559 224569 215496 214286 222215 225423 220045 216227
9508 216227 207504 207906 207936 199968 180798 168131 175200 192070 202355 195341 187970 183462 180839 196718
9494 196718 199858 205487 202075 201385 186747 182116 178020 168866 183201 177765 170579 161232 159826 160803
9480 160803 165292 167856 171181 161748 159836 167083 167735 150966 136060 140868 147997 145478 125916 123087
9466 123087 122934 114615 107126 114887 128532 132181 123440 134753 139292 129349 132127 114112 102929 96509
9452 96509 105577 124429 124520 117277 121593 128679 128285 114780 118497 122288 111392 96768 87713 100110
9438 100110 104399 112228 127132 126299 124404 102569 86181 82402 82129 79404 93980 87191 66419 63296
9424 63296 65835 73336 84750 71240 63168 72877 70554 64133 53805 43752 28182 35702 50764
9411 50764 72836 72888 74054 86388 71610 60523 51808 43682 47536 53632 61950 67788 61720 52015
9397 52015 48292 68305 67992 62682 65079 75975 92370 88000 74972 59871 54079 53616 54326 59380
9383 59380 65063 58847 59732 56074 44799 40824 58142 57024 68627 61480 40473 33125 39835 59628
9369 59628 69069 67675 76533 77020 76931 73986 71095 72253 69058 64261 63171 68288 61262 60338 54823 55152
9353 55152 59028 57934 55461 58267 69331 78732 86873 89110 76894 57268 60845 57753 70238 93177
9339 93177 92085 78580 63573 59058 49377 54125 61792 60916 68136 61600 53075 56762 61220 76510
9325 76510 76224 68668 71388 75855 87169 92516 101682 99518 91733 104250 107211 106347 103189 120059
9311 120059 129391 134715 159781 178702 199992 211923 198151 186297 184363 170814 159958 153735
9299 153735 144437 126725 104064 96008 97501 116736 134011 167805 194986 210109 208664 200000 187666
9286 187666 174142 175918 176789 172107 173193 174419 158500 159461 166691 175030 176008 191801 231415 277027
9272 277027 330136 385759 436764 469216 462499 411681 363038 319756 266025 221177 194783 194286
9260 194286 187679 171818 161366 160305 176956 178629 178284 191696 190789 191305 197128 193645 196359 194077
9246 194077 175332 143944 121992 99828 97847 91007 88990 108502 112451 114256 136812 161753 180461
9233 180461 187805 196188 192927 188039 164911 127098 100423 89041 86730 76550 72325 48703 41203
9220 41203 30440 31754 32728 29241 30654 24784 25517 41108 49836 51006 41515 39540 48450 40945 45479
9205 45479 42977 35287 37148 54771 72238 69259 65488 69685 77644 69530 71267 79582 65689 53368
9191 53368 43670 32122 39138 44238 36573 28591 7926 16843 14231 14197 20342 32226 45884 40983
9177 40983 35757 31925 22711 21846 23396 24151 22924 19483 28703 36466 34009 25379 28142 34468 24723
9162 24723 20541 37124 49005 66513 75092 79659 76280 65265 68454 61239 43759 39993 39998 33929
9148 33929 23970 36936 50427 46541 30571 38103 34973 18162 16435 7014 7345 15231 24092 25363
9134 25363 28856 39396 33490 42658 36311 32169 24756 19846 16831 14722 10238 -8533 228 13893
9120 13893 31533 35601 39253 34033 37791 36360 25437 21361 15402 19423 16182 -3976 -20956 -16688
9106 -16688 906 110 17567 23748 18915 28804 39294 43764 40206 25859 14737 25497 33728
9093 33728 28773 24789 15257 18837 21437 31265 30694 18205 6866 7310 16020 12761 10107 22855
9079 22855 18736 14644 18184 24824 21106 18915 17356 26168 44825 54345 44025 27562 16382 12731
9065 12731 1180 -5792 -7870 -15024 -12517 -18630 -19881 -16677 -12764 -13695 -1841 11389 -7603 -18024
9051 -18024 -8033 -7925 11964 20078 114 -833 -3735 -18622 -17864 3769 21918 18891 18825 25881 19492
9036 19492 9124 10516 7048 2336 12444 7674 17735 30980 27674 30115 23453 23040 16206 10589
9022 10589 21488 32317 34483 31526 35975 42034 34057 30547 15818 -5873 -15810 -11465 -1256
9009 -1256 1670 22018 27777 24676 14417 5582 -5238 -12689 -5858 -4540 -14 2130 277 318 -3830
8994 -3830 608 3383 10273 13286 6483 2681 -7381 -12335 -1534 -2556 2147 3104 5333 10502 8503
8979 8503 433 2760 -289 3417 4532 14298 14878 3516 1284 -2950 3770 -1484 -6521 -385 5347
8964 5347 -2918 2554 12558 9084 11977 20444 28641 23916 21841 24365 25629 25903 34311 34963 39229
8949 39229 32525 14157 12138 16005 17974 5905 -2659 -16271 -3036 10127 4748 2484 2413 2654
8935 2654 2294 10588 20835 24516 13623 8551 4121 6040 11136 26735 33548 39253 40916 42907
8921 42907 47496 49483 44500 25482 22263 22465 33687 36442 40939 38653 44154 44986 44717 46894 49170
8906 49170 30908 8787 -9127 -20613 -1690 18093 33150 43717 47562 54720 61075 58027 54663
8893 54663 52801 35023 26477 19045 31578 42821 36735 24229 20408 21556 25329 27663 15462
8880 15462 11998 34466 44771 42315 58147 70577 86509 92521 99630 107527 110475 112680 108052
8867 108052 102695 100942 95564 84370 67190 41987 37527 45441 66303 70599 62349 50545 31316
8854 31316 21202 6072 -3391 6754 20020 28901 31257 24613 16675 4294 16246 24680 14029
8841 14029 6928 16916 19514 20990 19823 30119 27788 31411 29275 16554 9614 4357 11460 16215
8827 16215 12212 6351 372 16406 31735 37955 26299 16189 13648 -1182 10081 15577 7017
8814 7017 -9794 -8003 -1844 14652 14874 15899 -2659 -6376 4600 13761 6236 -7602 -11234 -14756
8800 -14756 -14859 -6480 7653 20643 11265 18916 12192 1552 -8055 -13812 -4523 10665 13847 15097
8786 15097 8272 -82 -1259 8774 11249 5195 13075 12470 3146 11842 24889 14327 87 -53
8772 -53 17268 24499 22763 16700 12935 15765 14990 16414 18631 28601 32645 31857 45346 32201 21346
8757 21346 19917 17675 4568 -8231 -16939 -16926 -20205 -23809 -19623 -3063 6256 4635 7011 12320
8743 12320 23013 30687 28142 21081 21787 19823 23679 30842 44456 33284 3402 4282 7017 8087
8729 8087 18294 44933 32282 11072 11352 23442 26680 10452 5995 22856 15316 21737 28951
8716 28951 36049 25179 32336 35468 30957 20960 14103 10035 7990 8626 11088 15420 9307 3871 8524
8701 8524 3776 2854 -1101 4208 18361 23068 15400 8393 4850 17561 36086 24282 20210 23587
8687 23587 13498 5855 5341 1994 9778 22904 11086 -807 -4832 -15260 -18557 -528 2797
8674 2797 571 -5590 -13091 -13477 2515 113 1879 3636 8500 6323 4978 16080 16244 17373 12913
8659 12913 6358 -5359 -909 12341 11352 23081 31946 31164 31633 24945 25640 22153 16004 16586 21443
8644 21443 22193 18053 15928 17360 10468 8458 -6119 -7060 -5581 1919 14352 2974 2597 20801
8630 20801 30631 31849 34880 14495 8740 11211 8924 2608 11177 16662 24682 29412 29630 26213 26023
8615 26023 27841 28226 28496 27576 26464 34599 41659 30133 16748 12632 14272 22845 21729 27762 39051
8600 39051 44853 42508 37608 37308 45568 55558 60494 73478 77987 79494 74828 73415 72656 70141 64174
8585 64174 68696 63053 43675 40853 41924 42094 37148 28906 18607 16379 24001 25361 27628 42090
8571 42090 56633 54328 32275 15698 9502 22190 37324 43170 45853 39665 40396 39222 36425 41618
8557 41618 36253 40327 51439 44550 43370 37046 32533 36909 47229 48730 53384 52820 43179 40807
8543 40807 48547 52259 46271 29934 32235 34709 30386 29983 23189 21321 19533 18348 29229 44667
8529 44667 22202 6969 2866 -4233 -15632 -15039 -8049 -711 -12997 -24219 -12261 8343 19194
8516 19194 14361 16765 18019 14530 22689 30316 33178 33297 29401 35709 29476 32381 26878 20920 12736
8501 12736 3750 212 -2857 5369 23521 26695 21757 13385 -397 13303 20868 18632 14984 5617
8487 5617 -109 13868 12153 3755 -4116 693 2530 96 -7550 -6025 -9386 2467 2946 24296
8473 24296 43140 35583 29153 42201 34973 26501 16763 26795 29589 7220 -11301 -12593 -6883
8460 -6883 -2515 -825 2839 10950 5424 -2066 624 -7627 -21571 -22403 -25992 -24291 -15872 -850 9609
8445 9609 2367 -18231 -7972 11771 3429 3048 4523 1039 -1360 693 6541 8194 634 2324
8431 2324 6561 -327 -14116 -20827 -9633 -3070 4343 6862 17316 27201 32775 44934 34280 6836
8417 6836 4642 8 -2596 -7148 -3247 -667 662 11260 31315 24832 11157 15618 10866 -4760
8403 -4760 -11009 -920 -7289 732 -696 -1179 -930 4207 765 12460 13985 5522 -10056 -24528
8389 -24528 -29248 -27472 -10971 -10947 -2302 7833 13461 -1910 4308 9280 12049 9117 22387 16089
8375 16089 18014 20805 14332 5586 487 -1242 -18265 -23858 -16726 -5174 -8838 -14816 3687 13490
8361 13490 30265 39497 35852 25645 10990 23327 18323 2193 358 88 -2757 8516 5848
8348 5848 9255 5660 -15443 -4181 9060 16501 19519 23369 23274 21023 9324 -6931 -9274 -22160
8334 -22160 -12569 -6172 -5400 -7699 -11821 -24025 -32463 -28794 -20847 -11988 -10892 2893 3967 6159
8320 6159 9617 1088 13407 8785 -7872 -7539 -1752 8943 -5805 -18900 -11590 -1760 14211 11129
8306 11129 -4230 306 -3055 -7796 -13026 -13618 1545 6720 14951 4249 12604 4273 -7502 -6288
8292 -6288 -5920 -15283 -23187 -8070 5904 4447 505 -4175 -3912 -6616 -3907 18232 20124 14580 14862
8277 14862 12372 3946 4519 11199 12550 -4791 -16044 3070 17098 7565 4962 10230 11042 -4998
8263 -4998 4700 9959 10405 5001 726 -4492 17621 34036 24163 4374 -2702 -3772 5054 16042
8249 16042 6431 3475 6795 1134 -7275 -12551 -11022 -1337 5388 5139 -15522 -15499 -4133 4112 6211
8234 6211 4432 5327 5749 -8202 1274 21151 32735 27850 6613 -2781 -5967 -16916 -19266 -27319
8220 -27319 -30755 -32661 -20472 -9500 -1671 3738 -3067 1576 3066 -8662 -16911 -6621 1891 4608
8206 4608 9303 27687 33073 13458 -7356 -11509 -14337 1664 1266 1171 -13017 -10894 -6827 -2377
8192 -2377 -3227 350 12988 12130 6530 -5801 -9664 -10861 -10518 -11553 -16965 -11462 -10509 -10612 -12538 -13107
8176 -13107 -14469 -14119 -18236 -1084 -542 -18331 -19921 -1389 -17944 -20676 -11538 6840 11468 -3926
8162 -3926 -6727 1672 -7864 -23831 -19354 -22815 -13294 2235 3065 5411 7129 16232 10883 10009 16618
8147 16618 6625 -5913 -12983 -13110 -6573 -2475 -11697 -8566 -6414 -4477 4938 9703 984 -15430
8133 -15430 -14548 -21200 -17580 -24029 -24459 -27733 -25567 -6978 3315 1557 -1009 -4829 -5285 7633 21763
8118 21763 22274 3165 -373 -610 -15621 -31327 -27824 -7422 13425 22310 13911 18891 39534 41073
8104 41073 26394 15166 11216 20098 11935 637 -3721 -426 3834 9313 5662 12342 791 -8499
8090 -8499 -4403 -3958 -5394 7841 4690 2755 14543 23506 11337 -1878 3676 12974 9682 16386
8076 16386 17014 -3930 -5100 4819 9745 10060 10233 7713 3380 1474 7549 3107 -806 -3714 9985
8061 9985 22916 23771 8968 -3647 -3945 -2812 -8365 -11905 1222 17062 30863 26718 20916 16598
8047 16598 15684 24914 26314 15823 11748 22831 31226 19884 15106 26245 26883 33512 40791 37347
8033 37347 37012 40470 31190 12450 3889 -51 226 10958 16059 23117 11880 8722 18080 8043
8019 8043 9757 15549 14077 9766 6019 18460 17264 5976 2823 20122 19313 10463 9534 11617 -3931
8004 -3931 12496 36782 42211 42259 32400 28056 30613 38772 40600 36990 37252 28867 16022 2577 8209
7989 8209 10402 13669 16165 11769 10160 27343 27241 18184 28766 33306 35845 50313 63143 48344
7975 48344 29712 19146 20354 20379 14503 21048 24700 19827 19066 11375 22913 34455 33164 16981
7961 16981 9227 6724 -6426 177 11057 20658 23847 1022 -2574 17358 37222 36255 29069 23826
7947 23826 4202 8215 9116 14200 20777 35128 20113 3938 -2424 9060 28424 35890 33320
7934 33320 38823 33719 22891 26862 40905 34702 47822 47446 46184 50046 53645 59173 56491 54405
7920 54405 41047 29906 28145 32411 32578 38487 53676 45922 17689 -2503 2320 23488 29046
7907 29046 26978 18870 8346 3152 5368 10119 6447 362 3386 3111 10120 -950 -6259 2413
7893 2413 4318 -10495 -5622 5012 12675 30146 30354 27459 28193 15293 2663 -7173 -9582 816
7879 816 11633 20021 12863 16602 12205 18279 11806 8135 13770 8132 6177 22324 26923 10082
7865 10082 418 6786 3468 -5984 -9752 -6509 -4060 848 13398 8417 15565 18842 33194 29579
7851 29579 20296 26365 28064 18460 5362 -767 5681 3531 5992 15044 27486 25421 -1859 -21327
7837 -21327 -36301 -29571 -12424 -10014 -13364 -3589 4753 -3048 3280 16295 22510 5642 -17666
7824 -17666 -21087 -14291 -8471 2780 -2489 -7620 2414 7397 -3362 -26150 -40246 -36025 -29595
7811 -29595 -24925 -21495 -16592 -29032 -17882 1678 5017 -2054 -8103 -13852 -5092 3727 -472 -4596
7797 -4596 4452 -4988 -3497 -2932 -4183 -9079 -10905 4197 7264 -6177 -13525 -12664 -6563 442 -4635
7782 -4635 -11843 -20527 -23021 -30763 -30413 -20602 -13878 -10680 -12911 -7897 -1157 4882 16195 13990 4867
7767 4867 -5030 -8531 3459 8456 3639 7372 15372 7518 -7766 -4546 -6990 -19573 -8880 -6839
7753 -6839 -10362 -5157 -8626 -3129 -8644 -12474 8281 15543 17832 21104 7733 -16257 -18561 -11519
7739 -11519 -20123 -10727 -1918 2159 7149 3171 2236 -4313 -6988 -5783 -9207 -1938 5994 15766 3461
7724 3461 -6929 -18105 -26970 -22545 -14872 -11801 -11545 -2079 -2015 -4482 -11637 -25826 -22398 -13585 3354
7709 3354 18305 14504 10362 10652 13109 20947 23695 17262 17509 11019 16430 23387 28794 18747 14156
7694 14156 10310 4919 1568 17799 29019 22160 7378 -2516 2216 3674 -414 -1956 -11879 7874
7680 7874 8411 6468 -4143 -25382 -26772 -21289 -15127 -11785 -14347 -5357 8441 8778 2766 -5786 -7821
7665 -7821 -14366 -15143 -19443 -20216 -17778 -7216 158 1924 3455 -5953 -7127 -15072 -8132 -5230 -3100
7650 -3100 12685 6796 4756 10341 -3239 -9954 -10556 -306 8703 1542 915 5210 14457 26011
7636 26011 10472 -9956 -12059 -4692 -8596 -6739 -6233 -4619 -4134 -6092 10557 14499 29202 34433
7622 34433 17259 -4425 8290 -10580 -20793 -23318 -17928 1026 7859 -1171 -15350 -8204 -1029
7609 -1029 5106 8777 17076 31173 31343 21103 23408 15165 3902 584 -11179 -20798 -17689 194
7595 194 10384 15038 3250 -3789 -13866 -15480 -8134 -13871 -12235 -17002 -19219 -22936 -23411 -11686
7581 -11686 4081 1088 8534 11272 3166 -2112 3214 673 9038 19039 28526 23680 22034 -2594
7567 -2594 -12236 -848 -7995 -22957 -13497 5961 7696 13875 20122 19981 6346 -3963 -13956 -13725
7553 -13725 -13654 -8594 -484 4498 -13604 -11624 -9008 -15713 -11935 -15457 -17000 -6115 6068 5675 7578
7538 7578 12995 -2750 -4532 -5770 -21479 -37135 -21055 -1421 11505 19120 17268 10576 4564
7525 4564 8989 10283 5936 9698 9270 17039 4667 -3890 -1565 -11398 -1992 -3652 -8081 -10761 -11100
7510 -11100 2541 8991 7965 5673 5643 4445 5749 -2484 -11497 -11787 3602 2530 8204 6219 3192
7495 3192 2371 -567 -9266 -5508 -4207 -10660 -8523 -6834 -10757 -10252 -18971 -7303 7535 5415 -3942
7480 -3942 -8987 -6812 -1309 -10424 -1077 13064 5945 -17501 -11047 -14225 -8157 -2590 5784 10097
7466 10097 6521 4211 11456 26068 10187 -8140 -3908 -13488 -19841 -33204 -45293 -41576 -29194
7453 -29194 -9749 4441 7791 15501 8873 -1106 -11505 -18308 -21244 -35156 -29624 -22159 -16727 -3891
7439 -3891 10303 8495 -2311 966 13105 18555 9909 9304 9078 13920 23719 25565 19746 16466 5550
7424 5550 -1857 -3886 -1359 -13687 -7717 -1120 3332 5052 15146 12674 16917 9127 11225 -14650
7410 -14650 -29903 -32686 -24143 -28037 -31856 -19603 -5692 -7545 -16425 -27579 -26318 -22037 -15942 3037
7396 3037 10221 -1476 -26526 -36718 -34990 -18664 -18136 -15679 -9771 -13945 -10504 -2784 -361 888
7382 888 18834 8634 -8625 -2712 4328 12168 12573 16044 12027 7616 -5613 -11341 -37845 -47430
7368 -47430 -43277 -37117 -31927 -13850 -3139 -16051 -8445 5794 1485 -6378 -59 8184 24047
7355 24047 15915 17953 18686 9600 -5699 -12451 -2750 3595 11813 6690 -3828 -13100 -24872 -33799
7341 -33799 -20043 -11012 -5508 -144 -3707 -3305 4629 -336 4029 -7700 -11560 -17024 -7664 12091
7327 12091 9739 3111 3273 17069 14098 4737 -12562 -12902 -18240 -31258 -28059 -15123 -15455 -17449
7313 -17449 -13727 -17316 -19011 -9145 -8770 -16733 -13501 1913 428 -8720 -5281 -15972 -16723 -24531 -18427
7298 -18427 -15008 173 4685 1299 -640 740 -17585 -24463 -18153 -21754 -17469 -13160 -8230 -16815
7284 -16815 -22010 -8357 3503 24239 32306 11413 7997 3138 -12460 -33528 -45599 -34390 -13410
7271 -13410 -1044 -5522 -19276 -19738 -8355 -5712 -19077 -12870 -8457 -4861 -13595 -20141 -8479 5153
7257 5153 4877 7116 461 -9285 -12846 -20429 -18307 -9007 -14082 -12753 -6033 1982 -10223 -1236 5632
7242 5632 18317 16363 -6004 -13352 -4816 -13316 -18500 -5200 -6120 -20421 154 1546 -6973 -17460
7228 -17460 -22843 -17442 -11280 -3023 -18950 -26279 -12161 -6915 -17798 -15381 -12795 -4767 -7260 -2152
7214 -2152 7348 7574 4714 88 970 7114 22325 29750 18906 12063 1481 -987 589 -5915 -10217
7199 -10217 -24401 -29878 -27459 -18008 -29612 -30715 -16147 -20490 -29542 -20068 -4123 11064 16318
7186 16318 23142 20159 22230 13777 -3133 -11620 -20101 -19150 -15447 -14931 -15158 -6025 -3798 -8367 -15564
7171 -15564 -10214 -8499 -11382 -3795 -1364 -3704 -5626 -5482 -8219 -14640 -21951 -22040 -36570 -35869 -45879
7156 -45879 -44130 -25102 -16620 -18174 -3441 -5553 75 4626 10528 -327 -7524 5391 6799 12455
7142 12455 15460 -2492 -12179 -4954 -1121 427 -6177 -8170 -13205 -19259 -20892 -26048 -19963 -15993
7128 -15993 -4396 7441 2077 -585 4876 3378 -7110 -18408 -24067 -20068 -3127 -13957 -25930
7115 -25930 -26477 -16558 -16077 -12914 -5819 -7169 -16582 -8680 -9350 -7087 -8824 -8178 -7673 -19750 -15057 -3857
7099 -3857 -12628 -18835 -27867 -14026 -13813 -33939 -57335 -50549 -32764 -11608 -10543 -20082 -14195 -15567
7085 -15567 -24815 -21046 -15166 7013 8708 3742 8634 7169 2096 -1959 -724 14446 13259 14486
7071 14486 20840 15477 10763 17186 7965 702 -11362 4475 13016 14086 6877 -3357 -3938 -7178
7057 -7178 -7216 3524 13140 16700 14258 -2464 -15401 -6581 1575 -9501 -2079 -9458 -1589 9068
7043 9068 -199 3189 11688 21110 17118 9582 2844 -8242 -8802 -6261 -9504 -9495 -5835 3033 337 -5455
7027 -5455 -13645 -15261 -9152 -12000 -15345 -13418 -17893 -21035 -2074 21715 23962 26974 35649 21532
7013 21532 13832 22351 14774 8109 16542 11997 6180 6734 2020 -8519 -22382 -45241 -46503 -25929
6999 -25929 -17823 -17659 -21518 -26703 -38800 -37230 -31294 -19349 -9253 -7066 -1379 -5839 -2627 -22393
6985 -22393 -21859 -18367 -25473 -30657 -27517 -20874 -22888 -18567 -17157 -1132 9776 8793 -2112 1
6971 1 6220 706 -21077 -31093 -31926 -28992 -44522 -38842 -29246 -30946 -27129 -31900 -32480 -14016 -17796
6956 -17796 -15210 -13993 -16219 -8114 -8113 -21069 -29879 -14891 -7983 -9921 -3407 -9080 -12541 -9578 -2393
6941 -2393 -240 2192 9263 14421 11216 6760 5239 -11400 5002 9895 172 2783 -4888 -19413
6927 -19413 -39183 -39180 -28895 -18978 -13104 -9653 651 5929 2903 -3934 521 1599 -8624 -29015
6913 -29015 -13397 -13631 -24603 -28365 -31374 -18059 -12998 -4703 6798 -2717 7197 17691 6798
6900 6798 4991 4103 -6807 4614 6310 7032 9631 11050 -2374 -5236 -2673 4711 5958 -299 -1945
6885 -1945 -430 -2357 -2754 -7864 -13686 -15651 -8038 -23166 -17405 -2612 7999 3787 13202 20954
6871 20954 20434 14527 1541 -1185 12522 22383 17922 25 -8984 -18989 -29057 -31386 -40895 -41320
6857 -41320 -29147 -20796 -17436 -20298 -10038 -12638 -16947 -18654 -10313 -9115 -15996 -24403 -22763 -13133
6843 -13133 -17931 -15685 -8975 -2763 100 5930 21545 23845 13011 19551 7933 -10874 -7603 3472
6829 3472 10866 2738 -15006 -25206 -12765 -3176 -825 -8074 -10303 -3324 6087 15117 4769 2442
6815 2442 -14022 -10949 -21441 -7160 9369 1243 -3237 452 110 -3141 2797 1926 12553 15527
6801 15527 23989 13727 12233 2761 -12673 -10766 -9046 -8488 1569 4072 31 -5826 -7983 4593
6787 4593 12804 14048 3762 -7832 -2436 -9268 -30609 -29064 -20108 -4557 -1835 -452 10 -13276
6773 -13276 -13217 -13906 -27229 -29984 -9011 -144 11338 6468 12702 3311 1813 2800 9040 4489 -16407
6758 -16407 -18730 -8981 6073 18143 5968 2258 13786 13860 -9684 -40684 -43658 -38851 -26825
6745 -26825 -23056 -19259 -16885 -25925 -34334 -25566 -11346 731 13252 8291 13795 14430 1989 -11706
6731 -11706 -15964 -24503 -39241 -36076 -39082 -24999 -143 8816 2669 -9868 -7392 4790 -9173
6718 -9173 -18726 -21237 -22884 -13291 -6048 -2401 4522 2225 13437 11601 18349 11746 1222 -1102
6704 -1102 -3807 -8 4253 5370 5472 6664 1542 -12184 -174 10985 3266 -3655 -9674 -2356
6690 -2356 -5223 -4394 13070 12650 18274 19938 15269 7767 -4548 3743 7933 6613 2361 5663 18649
6675 18649 17917 11171 -2396 -11874 -9762 4892 17015 16748 11892 17041 33832 27467 23838 15322
6661 15322 -2378 -22186 -26628 -24333 -15960 -10314 -11721 -8189 -7585 15703 21772 4623 9311 13182
6647 13182 9604 21388 30571 28226 11900 -2967 -20505 -20887 -11008 -20459 -29236 -27962 -30773 -26907
6633 -26907 -24604 -22347 -28214 -25779 -19192 -17048 -36497 -39749 -28436 -11253 7703 20657 21214 16294
6619 16294 11966 5120 6344 4754 1594 -1871 7714 6916 -933 6654 11304 -8010 -5476 9800
6605 9800 10049 6764 1766 -2183 4461 6516 23952 32844 13438 2933 7191 6857 1486 -16056
6591 -16056 -27112 -23541 -10399 -2489 -6688 -13658 -14069 -21142 -19328 -15894 -12861 -8057 -4867 -6289
6577 -6289 -7133 -21253 -12226 12720 26831 19178 7108 -4474 -12333 -6000 8516 6457 9019 19430
6563 19430 25951 18207 10358 -1728 -2014 -5162 -17714 -20689 -15696 -6682 -3924 -15255 -16862 -15235
6549 -15235 -16342 -12350 -4898 -4353 -7087 -13146 -13746 -5028 -7898 -16745 -20876 -12177 -5519 11683 15524
6534 15524 15729 1673 -13095 -13001 -19217 -21561 -12485 -22586 -25683 -43710 -33360 -16382 -3111 -9116
6520 -9116 -9372 -6111 -3200 910 13966 4522 2554 -1551 -6915 -7955 1552 1689 -1833 -2074 -14013
6505 -14013 -1741 5566 -7348 -15316 -16254 -29218 -41357 -48002 -42546 -24694 -14597 -7817 -10961
6492 -10961 -11270 -16267 -14058 -11138 -9263 -16480 -23590 -12426 3608 13652 16481 18877 22719 30923
6478 30923 31658 32982 18094 9733 -10745 -15970 3112 -2458 -16681 -9576 -7825 -17384 -7472 -12432
6464 -12432 -15367 -9635 -22679 -10219 -14266 -11864 -14960 -20101 -12452 -24823 -27242 -16287 -10280 -14557
6450 -14557 -25595 -19771 -16308 -15087 -9011 -8807 -10494 -22601 -29009 -26113 -15882 -6801 -15729 -16040
6436 -16040 -16412 -28540 -14911 -10813 -12500 -33036 -35761 -24171 -20870 -21312 -7837 -3283 -2143 -2426
6422 -2426 -11128 2742 -7560 -13223 -16568 -16950 -18977 -13328 -11662 -10686 -6004 -2890 9431 16857 11079
6407 11079 16038 14217 -7282 -18897 -9666 20311 24666 9821 557 -14591 -28485 -27091 -15788
6394 -15788 -3365 3809 9849 17687 18747 8165 -10404 -18748 -28599 -41682 -30980 -23020 -17052
6381 -17052 -17126 -21818 -11166 -5182 -3080 9313 17670 14154 10861 8769 -6730 -6137 -8864 4449
6367 4449 341 -24479 -33905 -15855 6643 8969 -5253 -8390 -5223 384 -7687 -19161 -18756 -1565
6353 -1565 -9800 -23476 -29553 -20601 -21330 -12931 -9559 -6316 -10693 -11993 -5591 1854 14999 17526 4053
6338 4053 -6463 -4680 -5917 -9841 -6941 -9471 -22092 -22144 6865 20513 5589 -10608 408 9726
6324 9726 10238 1074 -10684 -13547 -7360 -9461 -9647 -19035 -16215 -22638 -22637 -22806 -17393 -10633 -15299 -14171
6308 -14171 -8321 -15118 -15016 -12137 -2354 2727 -10936 -24479 -31435 -25789 -17326 -19051 -18957 -14266 -6222
6293 -6222 -6529 -10657 -657 -7733 -22199 -20217 -20917 -17537 -13027 -21885 -16148 -20392 -6730 -1449 -9669
6278 -9669 -16720 -27985 -16941 -17232 -18803 -16734 -6588 -14827 -30931 -38927 -37739 -2687 14044 20480
6264 20480 5500 -12880 -25403 -22481 -22412 -22095 -18479 -25272 -22663 -6391 -1536 2653 -2906 10115
6250 10115 11348 13468 19321 953 224 -5747 -12886 -829 -1306 -11107 -28305 -39332 -33531 -21147
6236 -21147 -13992 -13305 -3404 -11194 -13712 -19765 -24343 -19198 -29405 -28639 -24624 -16074 -11589 -6186 -10625
6221 -10625 -17988 -4621 2096 -3755 -14380 -3147 -4827 -18672 -25420 -18862 -9360 -11600 -13815 -3038
6207 -3038 8056 19438 7442 5014 -2489 1881 907 -2944 -11035 -10348 425 -1978 9016 -4919
6193 -4919 -5887 -9835 -29260 -38722 -37163 -25297 -14031 -26109 -28339 -16938 -19879 -22471 -11897 1632
6179 1632 -2071 -11527 -13290 -10261 -3491 7751 19159 16399 17105 31550 31934 25945 26439 25139 21279
6164 21279 17131 11862 10504 11406 -9554 -23883 -35274 -21976 -5586 -8875 -1169 -4884 224 9468
6150 9468 1708 -3621 -5904 -20130 -20431 -22328 -11559 -1356 -7818 -9129 -17122 -21242 -24202 -23962 -35358
6135 -35358 -15436 -5757 -5582 -7937 -316 6829 9634 12774 8300 4502 11533 7160 4066 10994 13594
6120 13594 1791 -2941 -12384 -18085 -22385 -23765 -24144 -16531 -7275 -9743 -32909 -28257 -9389 -13056
6106 -13056 -18020 -7565 -5989 -15861 -8889 9232 4016 -6703 -12761 -1227 9377 427 -6157
6093 -6157 1492 12245 -757 -21483 -26599 -23993 -17661 -13858 -13126 -14040 -13019 -23944 -20110 -20822 -17407
6078 -17407 -16935 -18089 -23265 -18515 -7457 -14774 -26031 -25216 -10056 11107 14856 2068 -1979 3061
6064 3061 6202 11471 4225 -13814 -12008 -6226 2316 5730 4883 7205 10700 12214 3208 -2563 -3713
6049 -3713 -7726 -9608 4597 9543 7796 11898 8755 -5402 8128 23219 14859 8024 -3440 -16421
6035 -16421 -21240 -8842 -9515 -6016 -3192 1980 5039 8743 6618 4993 5395 5667 -8997 -4992 1197
6020 1197 18324 17592 -2478 -6747 7 10098 7936 7472 9690 22658 39424 21902 -1861 -8315
6006 -8315 -15331 -18945 -21250 -8152 6797 8119 15164 18537 15470 4728 -9949 -13215 1472 18474
5992 18474 20075 6197 4659 -3377 -7907 -5028 -15130 -23210 -18052 -2601 18223 5370 6176 -154
5978 -154 5810 6035 5944 17511 16229 4893 -16001 -19873 -348 9238 7227 -1957 -18904 -17842 -6356
5963 -6356 -490 -6902 -13146 -1130 3776 1014 -15757 -25622 -23622 -7299 5655 2360 -3732 1518
5949 1518 17351 10349 3889 2620 5020 -7406 -14408 -11306 2079 12392 21099 14341 1146 1698
5935 1698 -2102 -2213 -5788 -8349 -24619 -45029 -30262 -5613 10152 13062 452 -31381 -29461
5922 -29461 -17821 -11765 -5773 -3522 -18439 -21555 -17834 -10611 -9207 -3260 -8157 -5216 6249 13713
5908 13713 29 -9355 -7196 -3717 10488 9265 3216 -2421 -14405 -27432 -22240 -19342 -12481 -24427
5894 -24427 -19240 -8563 -10165 -15565 -12939 7340 11579 12445 -1891 -4349 -1968 5162 11995 20912
5880 20912 23163 22777 13583 9084 652 1177 -5802 -19155 -16929 -32615 -28713 -24804 -26675 -29000 -22245
5865 -22245 -20534 1581 9830 -5290 -8549 -2889 -472 124 6137 -86 -554 -1094 13095 18228 14001
5850 14001 4185 -2775 25269 31488 33679 13857 9419 -4214 -11618 -6136 3085 13956 -8337
5837 -8337 -7146 857 -6101 -4323 10746 7206 -1589 -11435 -3834 3192 -10358 -18926 -14062 -16514
5823 -16514 -19948 -1574 12508 11408 -9537 -14285 -14270 -23405 -16993 -7119 -2252 -13973 -14592 -9615
5809 -9615 -13603 -8672 5536 17023 30288 20660 8703 3772 -143 2513 1048 6527 7416 -6037
5795 -6037 -11114 -18550 -7824 -13119 -16603 -25070 -27134 -21531 -18748 -16910 -1620 9073 5419 1248
5781 1248 4863 114 -40 -7034 -17784 -15418 -2846 9112 -433 -4030 11096 9264 7043 -1900
5767 -1900 -5532 -2533 -6216 5262 21995 10102 -6866 -19202 -26574 -20136 -21036 -20660 -18717 -18609
5753 -18609 -19850 -31086 -28687 -29102 -15077 -8917 3252 2193 -2929 -997 -9998 -5354 -10375 -7401
5739 -7401 -9361 -15481 -11855 1123 8872 2588 11900 21097 15478 2543 -10344 -10181 -10551 -11041 -8011
5724 -8011 -5900 -8840 -13874 -10824 4645 16898 18736 2522 -12569 -13075 -22837 -22886 -11594 2271
5710 2271 7903 -1138 -6333 -2228 -9259 -5453 -9180 -18924 -23033 -15847 -27815 -23077 -15827 -22910 -24588
5695 -24588 -26802 -2555 4111 6400 9118 4330 3133 -7703 -11913 -16578 -26575 -11260 -7044 -21850
5681 -21850 -26971 -11073 -25254 -23948 -6367 19101 15792 3808 -2459 4985 -2959 -17942 -15012
5668 -15012 -3279 -9985 -7314 -14796 -3317 5954 -1285 -4042 -14054 -12081 -9025 -14120 -5867 1312
5654 1312 1404 -6389 -18025 -23505 -10636 -14643 -9544 -12591 990 1880 -8410 -23547 -8942 -11994
5640 -11994 -13392 7938 3384 -5325 -7702 -15549 -11910 -14941 -9575 -12551 -13779 -22194 8834 14342
5626 14342 932 3452 6289 10373 8086 1639 17841 12356 353 -4631 -17378 -31207 -19425
5613 -19425 -1774 8148 1039 -5072 -2232 -6113 -15004 -23298 -22152 1845 17362 13895 -7563 -24664
5599 -24664 -13417 -5249 -10474 -17966 -21151 -13380 -11016 -24077 -13018 -12268 -7690 -3926 -4592 7087
5585 7087 21534 16460 9047 393 -6349 -14192 -13166 -318 2003 -4384 -16185 -21332 -17195 -16816
5571 -16816 -3823 -2858 63 9053 25258 20576 2136 -6118 -6796 3828 10673 2832 -3093 -8376
5557 -8376 -12914 -22893 -8762 10764 18539 31700 10007 -10005 -10445 -2446 -21373 -31154 -24148 -20350
5543 -20350 -29542 -16025 -10690 -8516 -1336 4366 11003 -2617 -17725 -28190 -24914 -17541 -8453 314
5529 314 8847 57 -12677 -16442 -21642 -16139 -6336 7926 12830 15069 14049 323 1530 6286
5515 6286 1898 7126 777 -12652 -6094 12210 21973 15746 15373 4504 -3075 -186 5169 8974
5501 8974 -11099 -12079 -1201 -5053 -7274 -6723 9215 14584 12757 16572 -892 -21031 -16747 -15864
5487 -15864 -14135 -2161 551 -8129 -20630 -7103 11021 15633 -2843 -17569 -11135 -7810 -8033
5474 -8033 -8184 -11013 -27019 -14174 -13817 -18857 -22928 -29307 -28035 -33363 -24203 -18338 -17082 -9414 -1207
5459 -1207 1194 -3868 -3599 2837 10332 16931 22885 -913 -17646 -11248 7580 18642 8431 -6744
5445 -6744 850 1470 -205 4600 9908 -1152 -11404 -8703 -11534 -6304 6185 -628 13850 31866
5431 31866 16784 17348 8313 -14416 -5095 5495 10598 10394 3031 2268 7203 6357 6022 3848 9573
5416 9573 8020 2968 -9071 -13227 -14810 -11807 -14190 -22159 -17476 5776 14229 10416 -389 -10783
5402 -10783 -8151 -14522 -19052 -17238 -7989 7650 -3288 -15462 -12116 -10581 -8027 -8771 -8236 4417
5388 4417 -10205 -5936 8798 16788 22309 18593 8711 19695 27282 27310 20107 16769 13838 -3105
5374 -3105 -14208 -24907 -11461 -9188 -14653 -7798 -18323 -16361 1259 5177 9508 23684 18880
5361 18880 2148 -9503 -13457 -13977 -19266 -10299 -9826 -9945 -19482 -14709 -16073 -21449 -28109 -16966 -16267
5346 -16267 -14677 -1854 11857 19631 20503 -1142 -410 249 -10662 -25952 -19907 -3545 -7643 -2551
5332 -2551 -11305 -2231 4088 7029 8252 16098 3799 -3678 -35 969 2119 7260 -3545 -8884
5318 -8884 -11894 -5143 -11766 -228 6379 10115 12300 16979 11396 7848 -2456 -25707 -49849 -46310
5304 -46310 -39028 -21528 -10187 -14136 -15288 -9416 -11443 4272 11352 4076 2729 2071 -817 -6844
5290 -6844 -9443 -15709 -9085 3432 -6573 -14583 -9860 -12435 -8706 -69 -1738 9456 -8753 -26236
5276 -26236 -23352 -18265 -10663 -13286 -31274 -23882 -3126 -3950 8125 20694 17437 16475 163 -10381
5262 -10381 -16825 -21029 -7240 12830 9757 528 -13820 -22670 -43370 -34599 -10838 -2160 -10859
5249 -10859 -11751 -15027 -28510 -30410 -33717 -28428 -24840 -11567 -3652 -6710 -8878 1570 2483 12955
5235 12955 16163 14070 8758 -11850 -32735 -30404 -17363 -8064 4345 -2186 10738 17982 -786
5222 -786 -6505 -3415 6914 16992 105 -4417 -4949 -145 3020 6550 2086 -2703 3521 -96 -4594
5207 -4594 -10044 -17612 6195 -7694 -16340 -7535 -474 12213 14653 -766 -6316 -643 -8909 1292
5193 1292 14355 9028 13938 19113 9722 12106 8342 2977 973 -1854 12973 15122 5209 3807
5179 3807 -2023 -13779 -11323 -11655 -10903 -9237 -19905 -19730 2764 -3791 -12086 -3131 10220 -1968
5165 -1968 -16091 -14875 6053 2728 -1606 -1366 -11979 -11748 2111 9711 8938 8622 675 2165 5673
5150 5673 -9471 -13745 -7889 -2520 16961 22053 14995 3010 -85 6660 13549 11053 -5662 -8220
5136 -8220 -5048 -15758 -992 7204 -587 -3824 -4788 -1783 2930 -4203 2865 53 -6702 4659
5122 4659 13802 491 -3371 -7021 -8461 -4394 -8148 -9248 -4835 3078 22422 6497 -28218 -12771
5108 -12771 -9894 -23549 -18184 -8849 2335 -4083 -22931 -19273 -18590 -12110 -20595 -24098 -14823 -1734
5094 -1734 -13644 -13084 -10482 -20956 -21973 -15313 1183 12369 9648 -8052 -9720 1148 -6181 -16912
5080 -16912 -11012 -10450 -12431 -8812 -8919 -4894 4710 5629 4780 5512 7370 13799 3434 -1635 -9192 13417
5064 13417 23490 15509 19498 19960 1731 -2988 -1337 -5883 -19754 -20538 -20469 -16683 -13146 -25029 -28755
5049 -28755 -9791 2074 8487 -1123 -11276 -6871 10093 -6274 -15074 -10458 4640 6560 3422
5036 3422 4172 15243 9230 -7537 -15974 -21218 -15631 -10272 -1735 -5908 -8345 -4175 -7767 -15404 -7221
5021 -7221 -6865 5891 5221 6391 12405 11386 -8768 -8023 5277 15097 14974 1432 -6325 -12621 -28707
5006 -28707 -21567 -6723 -225 -882 1037 971 6127 371 -12201 -14822 -6838 -13110 -11341 -11660 -2096
4991 -2096 -20680 -15880 -961 -688 -5898 -6512 -3986 -7570 -6803 4694 9548 6566 14532 11765 10907
4976 10907 13678 36756 34801 16066 1480 -8824 -2231 -1226 -8724 -6418 1194 10223 9708 12481
4962 12481 3485 10935 14346 -2377 -1871 7756 -3601 -7739 2057 19467 16981 84 -8020 -9378
4948 -9378 -12730 -24952 -31184 -20866 -22051 -11162 -4469 1193 4425 8953 13915 8250 8891 12870
4934 12870 21217 6114 -299 -8168 -7545 -1883 146 2306 -3623 -13891 -22519 -17995 -1089 10250
4920 10250 -3703 -13164 -7123 1770 -2417 93 -2112 -427 714 250 6204 6865 -10953 -7301 13871
4905 13871 16117 12287 3697 -5896 -303 5698 5276 6832 -610 -16506 -5248 -567 -7727 -658
4891 -658 -7172 1345 -1330 -10081 -12142 -7411 -12258 -16699 -13225 -6271 -23 14481 29106 27209 26671
4876 26671 29499 15984 24449 29724 22644 20360 7646 14061 20733 18012 7418 5047 -2365 -8708
4862 -8708 -3409 -8991 -1167 -11980 -17721 -33224 -30427 -16753 -15408 -3820 11965 935 -1555
4849 -1555 2589 -2555 14283 17684 17997 25808 24699 23105 11666 -969 -4525 -8201 -17149 -24006
4835 -24006 -26562 -30572 -18332 -21771 -31538 -23520 -7876 2815 898 8831 19668 13392 -1470
4822 -1470 -2992 -4943 1712 -3690 -11346 -8025 -2944 -2909 -9203 -10171 6257 14048 18731 34292 28428
4807 28428 25164 25019 12180 7228 9438 -6830 -23345 -5581 18804 20332 6253 -15059 -31113
4794 -31113 -29068 -15542 -16355 -7417 -683 4798 267 -5349 -3143 -6348 -6840 5760 7996 5734 5859
4779 5859 4115 10563 9024 -510 11302 8924 9433 9526 -990 -6151 -6868 -4212 12475 30290 23680
4764 23680 15007 21693 30340 30258 11793 7528 19595 27185 23325 16759 81 -7652 -25382 -33582
4750 -33582 -21322 -8657 -8018 -3761 -4605 183 8786 3556 1004 4467 -1643 8307 12147 8616 664
4735 664 -5783 -20319 -9957 -4309 -9462 1530 5331 -10837 -21236 -13194 -6133 -12405 -19798 -20231
4721 -20231 -27175 -30021 -16932 -5131 1331 -12977 -16920 -17620 -18596 -14815 -13690 -10767 638 -3700
4707 -3700 -4285 -3604 -8968 -15027 -27203 -34265 -33636 -21822 1593 30586 52241 43854 31930 26101
4693 26101 12694 -510 -8389 -7502 -6081 62 14056 15535 3848 -1721 7402 14691 10975 7202
4679 7202 7620 -2148 -14988 -6279 6481 14104 12111 7622 -9880 -16253 -12446 2471 15194 10830
4665 10830 27290 27184 23727 8500 2238 4355 4724 10471 2999 -8544 -9267 -3250 630 -7996 -4117
4650 -4117 6817 6210 1733 17091 11035 2874 14219 17862 8041 -7344 -5597 2297 -2091 -3460
4636 -3460 -6358 -5314 684 -2056 -14841 -15198 -16064 -8385 -10775 -7248 9099 25494 11102 -1080
4622 -1080 -14841 -17510 -11347 6631 8040 -13577 -24907 -14385 -8947 79 9381 16501 5135
4609 5135 -22342 -33052 -35658 -22171 -26006 -23780 -6075 -9941 -10236 -20714 -37891 -40499 -31436 -32673
4595 -32673 -35408 -38172 -18570 799 -1209 3327 2030 12543 9213 -3100 -11249 -27803 -27770 -16834
4581 -16834 -20498 -20097 -27393 -16529 -7528 -857 128 2082 -6453 -16325 -19744 3761 14775 7231
4567 7231 1990 5599 3936 451 13295 14266 -4011 -19661 -4620 3227 -9290 -11764 -14465 -6184
4553 -6184 12234 19980 10745 8432 -8217 3065 27644 32172 24768 3589 -10159 -6623 -5874 -4814
4539 -4814 209 5459 10454 7438 -4618 -19320 -23416 -14172 -5889 -10991 -13582 -19480 -26942 -33016
4525 -33016 -31673 -24043 -19265 -17451 -6433 34 5874 10627 7585 6105 723 -2305 3265 1342
4511 1342 5571 5314 202 8677 7078 -14808 -22965 -17362 -22578 -24170 -17367 -16370 -15644 -20314 -10369
4496 -10369 810 -10978 8024 7422 5846 6349 7676 -2649 -16047 -14946 -5061 -9958 -6189 -424
4482 -424 -5992 -3751 -15835 -10221 1143 -2426 2500 3812 -4359 2989 -13932 -35043 -25586 -20059
4468 -20059 -3163 6399 -2310 -7357 -5556 1467 3137 -3924 9604 15276 15952 20411 22665 7132
4454 7132 -4302 -10012 -18768 -17932 -10769 -10267 -14260 -11371 -5786 -3613 -13117 -18118 -12983 -12041 -12542 4384
4438 4384 -958 7022 10117 7913 1608 -7835 -9860 -7504 6929 7081 -4316 -12115 -2770 139 -9150
4423 -9150 -18928 -27736 -14565 -3634 7492 11322 3749 4762 -467 870 -6934 -11917 -8565 -2025
4409 -2025 2326 10228 2980 2939 -15993 -8378 -1363 -5020 -14424 -2926 13553 14513 -130 -11184
4395 -11184 -28458 -24532 -20918 -19114 -3934 12597 15895 12966 -10386 -10497 6888 12384 17387 11831
4381 11831 14761 26905 21344 16666 18005 23310 18959 6571 -5660 -5692 1679 1346 -4153 -8688 10195
4366 10195 23359 19255 9190 627 -3494 7358 15346 8198 -2628 -783 5541 -14997 -25126
4353 -25126 -22833 -27254 -27662 -28783 -14742 -7420 -5465 -4215 -4037 -11129 -9420 2312 -2600 -5120 -5967
4338 -5967 -21502 -21809 -11337 -3567 5423 9353 -7346 -2206 14634 27375 27166 12885 7530 4909
4324 4909 3403 4349 13422 3640 -13628 -11952 -6150 -24046 -32539 -29360 -20248 -13943 -16276 -12653 3198
4309 3198 4917 -9260 -11226 -12739 -4433 9586 5429 -5354 -6541 -10408 1053 8159 -12612 -24306
4295 -24306 -26948 -25057 -21194 -22689 -18668 -20465 -13037 5336 7771 6823 -3565 -13924 7611 12782
4281 12782 -11682 -15465 -14709 -11877 -8500 -2304 1223 2058 3089 -2043 -10375 -11524 7257 11707 21564
4266 21564 25866 19309 29273 11800 -37 -4438 -14187 -12550 170 20823 19500 1471 14160
4253 14160 13085 12579 6225 329 4719 5824 2973 -5306 -17567 -22521 -16121 -14333 -15814 -5484
4239 -5484 -11248 -13419 -15545 -21154 -9250 -14158 -18918 -11514 4037 1942 6904 14056 12711 7251
4225 7251 5896 17135 6246 -10311 -17148 -15428 -4461 7375 17185 19283 14922 19332 21860 14942
4211 14942 -97 -586 -1877 2238 -6563 -10573 -16603 -14273 7643 12956 3881 -17782 -16736 -14347
4197 -14347 -11510 -11803 -15220 -7313 17433 22147 17343 16382 12768 -2755 -13269 -28446 -21581 1942
4183 1942 -914 -10215 1383 9788 18764 4078 -2376 2811 5039 -8442 -5943 7654 -5672 -4944
4169 -4944 -12820 -6554 -4184 -6210 5996 -19778 -24694 -15795 -7763 12609 12499 1801 -1062 -15798
4155 -15798 -12316 2581 5340 -3295 -2987 -6799 1074 4524 3804 2638 1638 6186 11277 3434 -13327
4140 -13327 -9463 -10194 -19510 -17148 -18641 -32037 -21629 1529 1650 -14063 -19039 -4057 -4706 -22161
4126 -22161 -21987 -19594 -24949 -28052 -29712 -15358 10990 11677 10272 1289 9964 14789 17752 10415 -1017
4111 -1017 9538 24728 33341 32324 23191 15596 11643 15938 16299 717 -6109 -2726 -4253 3048
4097 3048 4623 -1791 11737 16597 11090 -629 -11801 -29120 -24661 -23122 -20737 -4753 8707
4084 8707 -1648 3349 3553 -4599 -1947 -6525 -19585 -31440 -30761 -18349 -7450 12224 7404 5953
4070 5953 7566 -4629 -19931 -18578 -29632 -19051 -8034 -15398 -24960 -19948 -23281 -23085 -12547 -7888
4056 -7888 -5936 -1064 5338 1379 -18197 -17039 -7817 -4827 -12299 -9107 -2595 -13931 -12241 -16075
4042 -16075 1687 607 -5001 -9168 1454 8364 -860 617 2958 -9585 -19507 2522 15863
4029 15863 5162 -9274 -10646 -23912 -21830 -3996 9636 4827 3621 7871 5540 3147 3790 7807
4015 7807 -11480 -8565 7265 13231 16341 14235 11716 -1692 2327 6907 6350 10329 9244 12898
4001 12898 17062 17905 13015 13422 17905 27007 11511 -1935 -5919 7922 15733 3143 -15351 -22356
3987 -22356 -24445 -19355 -1779 -1271 -9192 -13832 -17443 -18290 -15592 -10273 2422 10069 16887 14890 8454
3972 8454 -6876 -3454 578 -6000 -9555 -18388 -33589 -26410 -15397 -10698 -12516 -3201 12969 23031
3958 23031 27464 20797 12495 19834 15491 5650 620 -699 -532 1384 4660 273 -5858 -1294 19350
3943 19350 18902 4604 13312 13271 -2729 -3906 515 12360 5029 -267 6656 9323 -12985 -17714
3929 -17714 -6277 816 -996 -6386 6106 8810 9990 18207 17163 16269 23266 19402 7761 6701
3915 6701 -8432 -27975 -12191 -6916 -6675 5780 6484 -1928 -15910 -15633 -16620 -25675 -20875 -7801
3901 -7801 -4881 2144 -4158 4746 -19163 -19915 -30552 -19120 -10607 -8879 -245 -1027 -9936 -7572 13845
3886 13845 15592 9450 1322 3090 4505 7526 -15 3309 11316 21207 23943 16772 10323 14014 11577
3871 11577 -8262 -6382 10751 10480 5493 2194 -6810 -14184 -14212 -2397 4851 9214 19654 26083
3857 26083 29305 25100 21980 19797 18156 2736 6646 -6815 -25226 -23270 -16188 -13876 -4884 -3158
3843 -3158 9341 16565 13914 -4079 -17914 -30971 -12099 -4735 -17049 -17628 -11577 -16493 -6359
3830 -6359 -2486 -8712 -4562 -3172 -6763 -9299 -6645 -11189 -20803 -14604 -12708 -7200 -4547 -5575 -10513
3815 -10513 -24277 -18891 -15553 -2345 -11466 -29545 -39213 -36387 -25475 -12453 -6986 -8530 -11305
3802 -11305 -9388 -2098 3275 3508 5012 193 6572 1021 -13391 -19628 -25148 -25683 -17100 -14236 -9783
3787 -9783 -9742 -17903 -17827 -3669 -21083 -35313 -28400 -18489 -9613 -3163 -4278 -6800 -3366 -16711 6126
3772 6126 18423 891 -21631 -19371 -662 3447 12670 29342 22293 -3307 -2576 8030 14221
3759 14221 22717 12132 4160 9141 4006 -273 -10747 -5110 3353 -4983 -2411 11502 1760 -558
3745 -558 11389 19516 18199 11391 12724 15958 11439 3426 -4337 -6067 -14355 -22219 -7172 11225
3731 11225 -1276 -11072 -21973 -27654 -25512 -20923 -10126 2069 -2246 -1571 -13801 -21571 -18279 -20984
3717 -20984 -16399 -10272 -14030 -4796 -8916 -12263 986 13696 15684 3989 -337 11418 17687 14830
3703 14830 12510 16674 21234 8258 -11545 -18523 -18918 -14704 -4853 -5233 -4665 -956 6979 5657 -1698
3688 -1698 -15412 -10871 82 3668 -13857 -20116 -26840 -21880 -3583 2258 981 -4939 -17012 -19467
3674 -19467 -4662 57 8525 5345 -11595 -5403 -4080 -20237 -26488 -20029 8857 10911 8683 9030
3660 9030 18223 21627 12183 -8072 -19993 -23500 -26058 -31290 -22244 -20212 -36184 -31681 -14759 -10164
3646 -10164 -21722 -9087 9149 21992 20435 27452 17050 9306 6366 1712 -6107 7656 7422
3633 7422 12494 25233 19449 12521 1209 -4142 9314 21548 30803 25644 15108 17523 2913
3620 2913 -4664 4752 10494 12130 1852 474 -861 6788 8696 4705 -8712 -16988 -11079 -9399
3606 -9399 2 -2522 -10276 -3472 9221 16087 19684 19668 853 -29495 -35986 -27376 -13934 -8749
3592 -8749 -2748 1779 10920 14658 4630 -2276 -13732 -14193 -9344 -12197 -9677 -6153 -8354 -9954 -15853
3577 -15853 -7785 -7147 -8714 334 2243 7264 3499 -10808 -19080 -5221 -2262 -260 3238 4670
3563 4670 13849 13998 14785 473 -9092 -8094 -3674 -10548 -28143 -18930 -11559 -24352 -28533 -6288 11727
3548 11727 6600 26631 20345 9805 14585 19901 7694 -220 347 13624 436 -12116 -9785
3535 -9785 -2835 4998 5934 -14639 -26295 -27658 -25872 -18578 -623 5477 7665 955 -12108 -18726
3521 -18726 -17512 -15159 -9903 -22647 -13851 -4765 7970 21102 32333 23888 -284 -12028 -14369
3508 -14369 -14811 -25985 -27779 -13397 -2189 -5267 -17808 -945 4598 1028 -1855 -1623 -12854 -14120
3494 -14120 -11337 -15079 -21816 -19590 -21030 -27663 -31465 -10177 5115 12207 11113 10265 -733 -8326
3480 -8326 -16038 -9061 -2219 1215 -4871 -2268 -1367 10454 13058 5614 11988 13108 12799 794 -23189
3465 -23189 -28277 -30778 -23685 -12083 -11572 -13958 -17213 -15801 -3865 927 2742 -8685 -13155 -9145
3451 -9145 -3319 -6460 -11581 -9256 9155 12018 9696 1560 -5619 -7352 5590 14956 5974 -2116
3437 -2116 -13404 -13918 -11335 -1029 6723 7411 396 1109 -1183 -1109 -2787 -4096 -11319 -14311 -4751 98
3421 98 12352 22212 3478 -12610 -18263 -16038 -10444 -4588 1738 6208 5231 3308 794 -13879 -21644
3406 -21644 -23081 -15366 -12456 -5752 3346 -15342 -16046 -11388 -5934 4899 1918 -5735 -6859 -1349
3392 -1349 -3445 -6247 4000 17149 9831 -1462 17737 22599 11449 15887 11075 -9407 -1148
3379 -1148 6457 18751 30479 34195 4174 -19198 -29516 -23522 -13584 -3933 2909 -5713 520 2589
3365 2589 3260 113 -4184 -8164 -2325 -10359 -12013 4533 4085 9552 2276 -2358 2952 9789 2935
3350 2935 -18078 -17674 1167 -453 -6148 -2448 184 4785 11940 3226 2599 8126 6219 2646 16083
3335 16083 22226 783 5540 11920 16633 18253 6455 -10808 -9926 3835 -5392 -13125 -22486 -17959
3321 -17959 -20828 -24630 -14050 -11901 -1439 -2561 -3173 7864 3458 4015 9568 9033 10002 6177 4086
3306 4086 9926 13178 16916 -2110 -7440 -1908 7689 11744 -3815 -18219 -10626 -15422 -26430 -17495
3292 -17495 -14055 -9732 2144 15941 7400 1289 -1139 4588 9704 6666 -823 3253 -2668 -16299
3278 -16299 -5148 5351 1660 10887 5521 -4419 -7369 -5065 -2771 -11490 -13342 945 10969 2921
3264 2921 6199 -5929 -17105 -10326 4378 -4898 -25409 -19230 -4589 -13814 -15279 -22846 -21769 -14746
3250 -14746 -3145 3888 2550 10799 16053 11425 1560 13094 34458 37074 21743 26346 21376 12334
3236 12334 -3010 5179 689 19947 18839 5781 2185 -7562 -8038 -6704 -2236 -13299 -19474 -11777
3222 -11777 -6000 8562 13670 22850 33349 17642 13337 13745 1740 13583 11426 3462 -1805 -1233
3208 -1233 5525 6848 4616 2076 -4654 -14959 -16433 -1843 8603 -77 -1757 9603 7475 12563
3194 12563 9726 7961 14237 3208 -13391 -2448 9750 6572 10552 2564 7759 6331 7997 12529
3180 12529 26022 20142 5692 19886 34195 12261 -959 -14370 -13678 -7873 3947 15420 1955
3167 1955 -14224 -18432 948 22874 31662 22979 19129 9302 2532 -1267 381 4763 -4216 13459
3153 13459 26277 22859 -3775 -11360 -9002 -5755 -1209 8212 4579 6062 5947 4341 6258 3479
3139 3479 5963 3467 -8166 -13551 -10499 -6960 12567 28642 10276 -4100 15031 16951 4525
3126 4525 -3483 6587 -3398 -9052 -9587 -6150 11523 11806 -2226 2475 19842 22914 13247 2092
3112 2092 -10011 -12289 720 3541 -6272 2251 15587 23412 9058 -828 4609 14752 12211 -3947
3098 -3947 -1703 -13484 -6244 9862 8584 3641 18100 19097 4758 12252 11316 -2307 3010 6837
3084 6837 -10888 -22374 -19378 -16179 3911 2326 -2770 -17115 -24220 -16928 1759 6067 1455 1017
3070 1017 1835 -12219 -20339 2012 13484 11219 9301 9944 14546 9063 2725 13089 13315 -7085
3056 -7085 -12665 -11589 -7306 -11168 -11831 -17946 9692 32931 25031 16218 17014 8425 2083 -2993 6415
3041 6415 2839 -1721 13127 11135 4205 -7302 -12312 -4710 -831 5736 -2889 -6731 -5257 -10183
3027 -10183 -3657 -4656 4018 -1311 -2346 2005 4032 -1826 18742 24923 13328 7294 13349 10022
3013 10022 7053 -2913 -16246 698 15069 18182 27671 37980 29263 18352 10324 2945 6746
3000 6746 23888 31357 30865 28023 12693 15085 16823 7481 9915 10822 5252 14985 16844 11269 15597
2985 15597 20956 10425 1812 -9838 -12021 -18866 -8722 -8681 -8646 -790 -12485 -10205 316 2476
2971 2476 7914 15670 9253 2139 3913 7356 18629 17392 7406 -6504 -4398 -5237 -9038 -20171
2957 -20171 -23827 -24914 -31609 -17731 -4400 -3219 -1548 -10795 -5380 -12499 -9974 -2955 4346 8482
2943 8482 -6689 -13047 -16092 -11816 -4558 -3360 -14499 -12972 -10729 -26091 -23987 -8242 3317 -14
2929 -14 -12094 -10127 4973 4464 -8575 -5098 -4830 -11980 -8354 1742 10762 1660 -4575 684 3904
2914 3904 2221 13632 15434 15086 7260 145 3299 8893 -7666 -14474 1198 9780 9695 4389 11380
2899 11380 1782 -20792 -12881 -3508 15466 18703 13676 9964 3176 9341 14816 21350 12969 10074
2885 10074 5362 8640 6287 4826 16540 18205 5336 -3007 -592 1396 4136 -7401 -16465 2167
2871 2167 -14681 -24981 -26835 -26650 -26093 -21113 -7230 -5584 -4578 13164 9476 16065 7294 -1870
2857 -1870 2476 292 -2914 -18541 -18045 -3599 9113 5799 -4474 1721 5123 12368 17599 20897
2843 20897 24126 16872 22488 14696 9845 12118 8455 4370 4539 11016 18198 19098 8655 2395 9757
2828 9757 4924 -6959 -6522 -920 2118 -6370 -17838 -17793 -17490 -13226 -3067 3418 2195 -1207 693
2813 693 6435 20085 27915 23031 18740 9797 3586 -7009 -1609 -12375 -14929 3345 6440 -8254
2799 -8254 -3700 -2078 3750 9487 18134 13983 4872 -7465 1153 6742 9309 6278 9875 2166 420
2784 420 5702 12159 26554 22111 10684 -5409 -13768 -13041 -17993 -2165 12931 24269 14959 13780
2770 13780 1416 -1613 2601 -10358 -27323 -21818 3131 430 -1999 -3611 3926 4731 -799 -6489
2756 -6489 -9836 -6763 -3159 -9027 -13860 -18632 -9290 5169 9455 14040 8113 4960 658 -17521
2742 -17521 -28777 -21313 2841 14328 11709 6548 -3742 -3656 -901 -14478 -12589 -7697 3290 4863
2728 4863 19756 16244 15669 12468 10123 13591 11119 -2390 12365 7740 -4464 2438 3387 11116
2714 11116 20069 24770 13820 -9624 -24910 -6184 -743 5296 15471 6843 5756 9287 6489
2701 6489 4654 -1418 -5772 -344 7293 13970 -4340 -545 -4182 -8443 -2746 4931 556 -4702 2099
2686 2099 17832 13670 2776 8694 4403 5696 6796 225 4292 -8745 -7986 -1201 2585 -3487
2672 -3487 -10713 -5759 3331 -4066 5438 25092 22560 18849 16314 20918 14613 -4243 5647 23111
2658 23111 14680 9635 18428 23058 22221 29181 25019 20588 14151 8589 1089 -799 2203 -9752 1046
2643 1046 8594 6486 12474 4443 4836 2596 -10976 -22099 -15399 -7706 -8247 -4344 4909 6804 -9784
2628 -9784 -19285 -9546 -7112 -265 2356 -10999 -19761 -16883 -4895 3860 568 903 -8803 -24723
2614 -24723 -7303 3991 4856 1806 1846 1733 10108 14689 1092 12951 30982 19745 15906 17252
2600 17252 -7304 -10977 -5381 18665 26188 26400 16512 8368 12763 13063 10783 -471 -7918 -5260
2586 -5260 14468 22556 17694 21660 14341 7803 4073 24534 5780 2984 5910 13124 16447 10326
2572 10326 18781 12297 -13095 -23991 -17075 -6231 7372 22969 31884 20540 11304 10331 9383 9610
2558 9610 7931 24642 26837 7117 4819 -2436 -2663 -6551 -12552 -8777 -7042 -2266 -6962 -8684 -8550
2543 -8550 6278 21170 18827 17940 18069 15413 17567 5177 801 142 -11187 -1164 10826 13416
2529 13416 -4316 474 12154 19344 26497 21856 26942 14893 -2926 -7014 -15044 -30250 -13319
2516 -13319 11122 7796 -7483 -12802 -14563 -3988 -3940 5179 -3238 -2036 -2598 -410 -2964 -10259 -5230
2501 -5230 3007 16470 7506 13261 4049 -9319 -11958 -7536 -808 -14167 -18602 -15714 -5916 -5557
2487 -5557 2009 18228 6374 -96 7689 15375 13169 -2115 -22415 -17053 -4385 -724 -7229 -12438
2473 -12438 -20260 -11660 -1308 -4280 -6451 -15372 -6079 9527 18505 14755 21357 32485 36032 31479
2459 31479 15411 -2030 10396 14368 9050 12399 3292 1942 14321 23844 21725 8427 -2266
2446 -2266 3475 -7356 -17412 -14776 1348 10227 8360 7692 4728 -165 604 3776 10249 9320 9545
2431 9545 4297 -4703 -14248 -9808 -4796 -13587 -5085 475 2221 -407 -9947 -10545 -21754 -32627 -23477
2416 -23477 -5711 -5568 932 3841 6997 4694 -1990 -382 7211 6472 10340 9319 15136 27933 28751
2401 28751 16691 10263 16192 -2703 -5340 -13834 -26874 -13031 -5739 429 -4252 7408 14881
2388 14881 10429 19180 12776 -5044 -9341 4846 14457 19751 36029 39475 20348 -788 -5363
2375 -5363 -18498 -6211 11115 4009 11112 9571 -7392 -14707 -10068 -10111 -4164 -564 -737 -8921 -4287
2360 -4287 1400 4562 12865 12311 10632 4672 -3024 4513 3427 6726 7712 -91 -5666 -9133 -10992
2345 -10992 -17452 -18602 -11989 3297 7846 16149 23026 16086 18555 23720 21583 5471 7315 13943
2331 13943 21078 24699 12111 4568 3838 6166 -11411 -17519 -1564 -1981 10360 27809 10204 12198
2317 12198 10639 11700 9918 23044 37194 32559 31174 28300 20662 8679 8770 8605 -4135 -10180
2303 -10180 -15396 -20620 -20618 -15362 -13633 -13858 -17645 -11950 -5282 -13277 -5292 -8634 1336 -3748 1017 18196
2287 18196 11849 -9981 -23260 -33216 -38067 -26027 -22243 -11950 -2386 708 2085 1577 10003 16533
2273 16533 7213 8937 18946 14724 10613 15110 5530 10130 18563 17159 26630 22271 25426 21899
2259 21899 13855 6382 5440 12407 13514 972 1872 13878 8057 5241 -3595 -8837 3452 8613
2245 8613 13579 20182 15125 10565 5303 9126 5946 14055 15012 11463 5305 -3752 -8879 -8818 -14777 -10890
2229 -10890 723 11504 16430 5497 5768 1488 8488 10869 3925 -8308 1357 -1483 2171 2906
2215 2906 -3884 14673 23059 27888 26487 28805 16307 19383 23527 25120 19944 5755 -9332 9196
2201 9196 23789 26961 10238 10642 16572 18771 27322 28207 17470 14143 10087 -1842 8028 7347 2658
2186 2658 8372 19279 17780 15490 18373 -3810 -24994 -22977 -7913 -8529 -16338 -17537 -14467 -985
2172 -985 -3039 1578 6827 9028 3762 -1813 -537 -8475 11344 22092 22439 22442 14612 17230 13036 13451
2156 13451 7432 7583 2627 1439 -2855 -5935 -18229 -12003 -2128 -2292 2579 7131 5395 -1582 6900
2141 6900 9711 2136 -9546 -9486 -8700 -18486 -26212 -33591 -25377 -12375 -7662 -27412 -17111 -248
2127 -248 8858 3867 6501 8770 -5693 -16487 -32815 -36615 -33706 -33682 -27437 -18698 -9831 3408 -4961
2112 -4961 -12892 618 2221 -4888 -1910 4990 3788 6147 -4924 -13291 -14682 -6276 113 10731
2098 10731 18235 8634 -2624 -3298 -2278 -3480 -13378 -10350 1182 5336 2699 12221 12731 1247
2084 1247 2159 13227 19385 1710 -1106 -3332 2262 -1136 -12536 -5461 -7635 -15247 -4753 -13467
2070 -13467 -5847 2404 4568 5101 -1409 -14417 -12800 -6998 -13490 -16402 -424 4885 2955 8175
2056 8175 -446 1623 628 -11836 -6323 -5976 1241 1914 10624 13375 13151 728 -3739 -1920 674
2041 674 13231 18276 13302 23053 15326 12078 2069 4127 1523 11170 27724 18943 -148 -8008
2027 -8008 -18465 -19762 -6294 5851 15381 12337 20865 25055 16114 2201 -12406 -15028 -13267 -11132
2013 -11132 -1398 10222 15585 20311 19001 4816 -3299 -15876 -5362 15116 17743 418 -14772
2000 -14772 -15375 -20075 -8615 9751 8545 -949 -6600 -11848 -12563 -9842 7815 16268 14609 13191
1986 13191 318 -4864 3242 1762 -3140 2068 6213 3696 7160 -996 -9267 -9136 5746 4669
1972 4669 -1226 -2307 -15750 -28622 -23710 -18343 -2462 5590 1504 -7743 -6549 -4468 -4471 2645 9017
1957 9017 624 -2523 21061 38123 14764 -1326 -8288 -16159 -4084 7636 14620 5359 11700
1944 11700 20994 18381 1572 -10026 -4649 7556 -11199 -18715 -4190 -5800 -2652 19859 9074
1931 9074 4513 6100 -15094 -18479 42 17840 21155 19907 19574 19251 21638 13245 -11060 -22065
1917 -22065 -22773 -5056 -1310 -4098 13374 8521 8352 15562 18748 25072 25987 3837 6301 22127
1903 22127 21373 22583 12923 8004 3164 1659 -5128 -8094 -145 7141 10074 12242 2982 -4259 -3985
1888 -3985 -4428 -3980 2538 5195 -2367 -6843 -99 -1461 9452 -732 -6288 -10284 -3814 1009 2477
1873 2477 -1622 7086 11050 -744 -4937 -4900 -5306 -946 10332 8976 216 2547 5137 8188 704
1858 704 -3917 114 20880 21746 9945 3471 106 -5484 -1115 1871 -1810 1376 5053 3351 3159
1843 3159 1230 -1234 -6184 3281 9980 13622 25153 15119 8398 -1278 -3829 10214 15633 8947
1829 8947 6663 4846 5205 14300 701 4243 14167 17621 7238 -4496 5422 4281 2047 2601 -10503
1814 -10503 -9504 -7140 -4914 3956 -349 2624 4273 -7711 -21135 -19547 -10982 900 1987 6692
1800 6692 16003 -38 -9235 6676 27193 29084 5964 -1586 6626 1176 584 -2381 4541 1083
1786 1083 2199 22252 7365 -7966 3055 5188 -10198 -2107 16293 16177 6067 -7881 -4402
1773 -4402 10641 25217 11643 -10185 -22855 -13929 -3032 8954 19880 15180 18279 14245 10494
1760 10494 17192 17399 16473 15477 6581 -5471 -8585 -4471 9451 16955 10288 22041 21771 9382 -1864
1745 -1864 -12136 -6543 2023 4830 11083 25814 26438 16698 11653 11138 9388 12996 8391 5550 20702
1730 20702 42026 33559 12827 -2435 -19842 -17515 -4736 -14305 -25560 -27595 -28342 -11258 -3739
1717 -3739 -8213 -12788 -9834 -819 -3267 2488 -4939 -3483 9587 29153 19720 9933 13244 16530
1703 16530 14816 8941 16147 12495 17741 26396 14835 2682 -7998 -4952 8490 13733 -1216
1690 -1216 -1530 7732 9034 16627 22851 17609 5393 3058 -2706 -3950 7733 18002 16433 18959
1676 18959 9990 9169 2769 1987 3729 -11079 -12523 -10861 -6015 685 785 1571 -2609 7676 19893
1661 19893 10574 -9024 -13649 -30912 -33658 -22516 -8853 -2800 -5502 -10642 -1483 2601 -8174
1648 -8174 -5164 -10984 -2751 -1583 -2760 3062 1750 27 11940 10941 12763 7020 -3986 -15237
1634 -15237 -24644 -24692 -15862 -19024 -29993 -33882 -20085 -3945 -9134 3365 7046 -5102 -11921 -14026
1620 -14026 -16362 -4141 -5401 9654 9315 10467 2142 12984 20939 29642 28445 16006 4987 8328
1606 8328 14505 11659 23776 25609 19619 16618 24407 21223 16744 27499 28172 8606 9406 27906
1592 27906 19876 436 -13109 -3928 -44 -2923 -11434 -16635 -15429 -2702 -22360 -40099 -26947
1579 -26947 -23273 -21233 -4321 8324 24035 37265 29248 21512 148 -2969 -19599 -16298 -12881
1566 -12881 -16433 -7883 -10806 -3708 7914 22492 15486 -3282 -9881 -5721 -12751 376 2448 4739
$$ [...]
##END NTUPLES=NMR SPECTRUM
##END=
