##TITLE=Analysis number 325636
Compound Code rjf 01106
Book Reference 176673
Project Code adrs fraglib
Chemist Name jom
##JCAMPDX= 6.0         $$ Bruker NMR JCAMP-DX V2.0
##DATA TYPE= NMR SPECTRUM
##DATA CLASS= NTUPLES
##ORIGIN= Bruker BioSpin GmbH
##OWNER= nmr
$$ XWIN-NMR		Version 3.5
$$ Fri Jan  5 14:00:18 2007 GMT Standard Time (UT+0h)  MAYBRIDGE\nmr@NMR_250MHZ
##.OBSERVE FREQUENCY= 250.131544655141
##.OBSERVE NUCLEUS= ^1H
##.ACQUISITION MODE= SIMULTANEOUS (DQD)
##.ACQUISITION SCHEME= undefined
##.AVERAGES= 16
##.DIGITISER RES= 18
##SPECTROMETER/DATA SYSTEM= dpx250
##.PULSE SEQUENCE= zg30
##.SOLVENT NAME= DMSO
##.SHIFT REFERENCE= (INTERNAL, DMSO, 0, 16.522)
##AUDIT TRAIL= $$ (NUMBER, WHEN, WHO, WHERE, WHAT)
$$ ##TITLE= Audit trail, XWIN-NMR		Version 3.5
$$ ##JCAMPDX= 5.01
$$ ##ORIGIN= Bruker BioSpin GmbH
$$ ##OWNER= nmr
$$ C:\u/data/dgb/nmr/ADRS/520/pdata/1/auditp.txt
$$ ##AUDIT TRAIL=  $$ (NUMBER, WHEN, WHO, WHERE, WHAT)
(   1,<2007-01-05 13:59:56.93 +000>,<MAYBRIDGE\nmr>,<NMR_250MHZ>,
      <created by zg, POWCHK disabled, PULCHK disabled
       configuration hash MD5:
       49 4B E0 1D 92 C2 6B 37 9F E6 65 BC 52 41 86 1D
       data hash MD5: 64K
       92 9C 07 D1 C5 4C CC 50 59 2F C1 8C 09 E5 8D 53>)
(   2,<2007-01-05 14:00:09.41 +000>,<MAYBRIDGE\nmr>,<NMR_250MHZ>,
      <Start of raw data processing
       ef LB = 0.3 FT_mod = 6 PKNL = 1 SI = 32K 
       data hash MD5: 32K
       87 AA 13 B8 68 F8 12 2F FB FC 5F 19 9C EE 8E 66>)
(   3,<2007-01-05 14:00:11.07 +000>,<MAYBRIDGE\nmr>,<NMR_250MHZ>,
      <apk 
       data hash MD5: 32K
       DF CC 66 2B E6 64 07 07 98 F4 6F 78 00 5E 13 A9>)
(   4,<2007-01-05 14:00:11.82 +000>,<MAYBRIDGE\nmr>,<NMR_250MHZ>,
      <abs ABSG = 5 
       data hash MD5: 32K
       9F 9C B1 84 CD 51 49 E4 A3 09 1B 54 4F 85 6E 2A>)
$$ ##END=
$$ 
$$ hash MD5
$$ 75 5E 18 4F 69 7B 51 6D DC 3B 2D E2 B8 33 A5 97
##$RELAX= 
##$RELAX= 
##$RELAX= 
##$RELAX= 
##$RELAX= 
##$RELAX= 
##$RELAX= 
$$ Bruker specific parameters
$$ --------------------------
##$DU= <C:\u>
##$EXPNO= 520
##$NAME= <ADRS>
##$PROCNO= 1
##$TYPE= <nmr>
##$USER= <dgb>
##$AMP= (0..31)
100 100 100 100 100 100 100 100 100 100 100 100 100 100 100 100 100 100 
100 100 100 100 100 100 100 100 100 100 100 100 100 100 
##$AQSEQ= 0
##$AQ_mod= 3
##$AUNM= <au_zg>
##$AUTOPOS= <52 >
##$BF1= 250.13
##$BF2= 250.13
##$BF3= 250.13
##$BF4= 250.13
##$BF5= 500.13
##$BF6= 500.13
##$BF7= 500.13
##$BF8= 500.13
##$BYTORDA= 1
##$CFDGTYP= 0
##$CFRGTYP= 5
##$CHEMSTR= <none>
##$CNST= (0..31)
1 1 145 1 1 1 1 1 1 1 1 1 1 1 1 1 1 1 1 1 1 1 1 1 1 1 1 1 1 1 1 1 
##$CPDPRG= <>
##$CPDPRG1= <>
##$CPDPRG2= <>
##$CPDPRG3= <>
##$CPDPRG4= <mlev>
##$CPDPRG5= <mlev>
##$CPDPRG6= <mlev>
##$CPDPRG7= <mlev>
##$CPDPRG8= <mlev>
##$CPDPRGB= <>
##$CPDPRGT= <>
##$D= (0..31)
0 1 0 0 0 0 0 0 0 0.06 0 0 0 0 0 0 0.0002 0 0 0 0 0 0 0 0 0 0 0 0 0 0 
0 
##$DATE= 1168005595
##$DBL= (0..7)
120 120 120 120 120 120 120 120 
##$DBP= (0..7)
150 150 150 150 150 150 150 150 
##$DBP07= 0
##$DBPNAM0= <>
##$DBPNAM1= <>
$$ [...]
##$SUBNAM7= <"">
##$SUBNAM8= <"">
##$SUBNAM9= <"">
##$SW= 20.6930455092707
##$SWIBOX= (0..15)
0 0 3 0 0 0 0 0 0 0 0 0 0 0 0 0 
##$SW_h= 5175.983436853
##$TD= 65536
##$TD0= 1
##$TE= 294.16
##$TE2= 300
##$TE3= 300
##$TEG= 300
##$TL= (0..7)
0 120 120 120 120 120 120 120 
##$TP= (0..7)
150 150 150 150 150 150 150 150 
##$TP07= 0
##$TPNAME0= <>
##$TPNAME1= <>
##$TPNAME2= <>
##$TPNAME3= <>
##$TPNAME4= <>
##$TPNAME5= <>
##$TPNAME6= <>
##$TPNAME7= <>
##$TPOAL= (0..7)
0.5 0.5 0.5 0.5 0.5 0.5 0.5 0.5 
##$TPOFFS= (0..7)
0 0 0 0 0 0 0 0 
##$TUNHIN= 0
##$TUNHOUT= 0
##$TUNXOUT= 0
##$USERA1= <user>
##$USERA2= <user>
##$USERA3= <user>
##$USERA4= <user>
##$USERA5= <user>
##$V9= 5
##$VALIST= <valist>
##$VCLIST= <CCCCCCCCCCCCCCC>
##$VD= 0
##$VDLIST= <DDDDDDDDDDDDDDD>
##$VPLIST= <PPPPPPPPPPPPPPP>
##$VTLIST= <TTTTTTTTTTTTTTT>
##$WBST= 1024
##$WBSW= 4
##$XGAIN= (0..3)
0 0 0 0 
##$XL= 0
##$YL= 0
##$YMAX_a= 223410
##$YMIN_a= -349502
##$ZGOPTNS= <>
##$ZL1= 120
##$ZL2= 120
##$ZL3= 120
##$ZL4= 120
##$ABSF1= 16.522
##$ABSF2= -4.171173
##$ABSG= 5
##$ABSL= 3
##$ALPHA= 0
##$AQORDER= 0
##$ASSFAC= 0
##$ASSFACI= 0
##$ASSFACX= 0
##$ASSWID= 0
##$AUNMP= <proc_1d>
##$AZFE= 0.1
##$AZFW= 0.1
##$BCFW= 0
##$BC_mod= 0
##$BYTORDP= 0
##$COROFFS= 0
##$CY= 12.5
##$DATMOD= 1
##$DC= 0
##$DFILT= <>
##$DTYPP= 0
##$F1P= 14.0000005364418
##$F2P= -0.99999901652339
##$FCOR= 0.5
##$FTSIZE= 32768
##$FT_mod= 6
##$GAMMA= 0
##$GB= 0
##$INTBC= 1
##$INTSCL= 1
##$ISEN= 128
##$LB= 0.3
##$LEV0= 0
##$LPBIN= 0
##$MAXI= 10000
##$MC2= 0
##$MEAN= 0
##$ME_mod= 0
##$MI= 0
##$NCOEF= 0
##$NC_proc= -3
##$NLEV= 6
##$NOISF1= 0
##$NOISF2= 0
##$NSP= 0
##$NTH_PI= 0
##$NZP= 0
##$OFFSET= 16.522
##$PC= 1
##$PHC0= 212.3804
##$PHC1= 7.797256
##$PH_mod= 1
##$PKNL= yes
##$PPARMOD= 0
##$PSCAL= 4
##$PSIGN= 0
##$REVERSE= no
##$SF= 250.13
##$SI= 32768
##$SIGF1= 0
##$SIGF2= 0
##$SINO= 400
##$SIOLD= 32768
##$SREGLST= <1H.DMSO>
##$SSB= 0
##$STSI= 32768
##$STSR= 0
##$SW_p= 5175.98343685301
##$SYMM= 0
##$S_DEV= 0
##$TDeff= 65536
##$TDoff= 0
##$TI= <Analysis number 999999
Compound Code 99
Book Reference 9
Project Code 9>
##$TILT= no
##$TM1= 0
##$TM2= 0
##$TOPLEV= 0
##$USERP1= <user>
##$USERP2= <user>
##$USERP3= <user>
##$USERP4= <user>
##$USERP5= <user>
##$WDW= 1
##$XDIM= 32768
##$YMAX_p= 359180114
##$YMIN_p= -109863
$$ End of Bruker specific parameters
$$ ---------------------------------
##NTUPLES= NMR SPECTRUM
##VAR_NAME=  FREQUENCY,     SPECTRUM/REAL,   SPECTRUM/IMAG
##SYMBOL=    X,             R,               I
##VAR_TYPE=  INDEPENDENT,   DEPENDENT,       DEPENDENT
##VAR_FORM=  AFFN,          ASDF,            ASDF
##VAR_DIM=   32768,         32768,           32768
##UNITS=     HZ,            ARBITRARY UNITS, ARBITRARY UNITS
##FACTOR=    0.157963299565203, 1,           1
##FIRST=     4132.6476996994, 0,             0
##LAST=      -1043.33573715361, 0,           0
##MIN=       -1043.33573715361, -109863,     0
##MAX=       4132.6476996994, 359180114,     0
$$ Real data points
##PAGE= N=1
##DATA TABLE= (X++(R..R)), XYDATA
$$ [...]
$$ plain form
17730 61990 57652 34181 37582 60864 89082 96663 93848 86879 105643 120631 104718 81327 67533
17717 67533 63396 67223 75249 79558 90257 100465 108506 82945 58448 93119 164995 215386 235223
17704 235223 251522 266433 261378 265296 253326 211699 177682 170209 145852 114548 88157 53677
17692 53677 59865 54971 70225 87347 87447 64262 55599 39702 30342 18497 40861 54903 59284
17679 59284 58483 78323 47747 25007 15176 8124 26776 45375 55342 37338 46890 36624 40592
17666 40592 62223 75384 63019 73540 93050 115623 111396 110468 99596 72725 56905 64087
17654 64087 56785 55619 63645 85110 102704 96116 102122 102501 120906 120014 124774 132641 128753 143725
17640 143725 158876 181806 195411 164895 130113 148198 161120 156573 170351 183436 203789 206394
$$ packed form
17730F1990m338k3471L401K3282K8218P581k815o969J8764J4988j5913k3391j3794
17717F7533m137L827Q026M309J0699J0208Q041k5561k4497L4671P1876N0391J9837
17704B35223J6299J4911n055L918j1970m1627l4017p473k4357l1304k6391l4480
17692E3677O188m894J5254J7122J00k3185q663j5897r360j1845K2364J4042M381
17679E9284q01J9840l0576k2740r831p052J8652J8599R967j8004R552j0266L968
17666D0592K1631J3161j2365J0521J9510K2573m227r28j0872k6871j5820P182
17654F4087p302j166Q026K1465J7594o588O006L79J8405q92M760P867l888J4972
17640A43725J5151K2930J3605l0516l4782J8085J2922m547J3778J3085K0353K605
$$ plain form
17628 206394 179275 165707 156213 128992 136260 140003 115074 86062 90454 119618 125264 116751 112050
17615 112050 128156 144872 137576 135909 124779 130017 111766 113467 98961 83452 84372 90295 85349
17602 85349 73262 72030 79882 72879 42778 22954 46369 74786 66019 69675 75975 63936 53151
17589 53151 66073 50752 43030 40781 20177 1594 17913 6070 -19893 -34598 -26506 -30809
17577 -30809 -376 6915 56457 81293 55127 13894 4318 -15809 11579 49722 62389 55584
17565 55584 57575 44031 40472 47956 44897 41397 38693 29148 9813 9142 16293 17699 24485 5375
17551 5375 -2206 16050 25318 45544 13161 4795 12021 23598 21849 1062 4589 13192 29327
17538 29327 26150 42800 43895 49370 19363 28674 26926 20168 9810 11905 30771 52729 62766
$$ packed form
17628B06394k7119j3568r494k7221P268L743k4929k9012M392K9164N646q513m701
17615A12050J6106J6716p296j667j1130N238j8251J701j4506j5509R20N923m946
17602H5349j2087j232P852p003l0101j9824K3415K8417q767L656O300j2039j0785
17589E3151J2922j5321p722k249k0604j8583J6319j1843k5963j4705Q092m303
17577c0809L0433P291M9542K4836k6166m1233r576k0127K7388L8143J2667o805
17565E5584J991j3544l559P484l059l500k704r545j9335o71P151J406O786j9110
17551E375p581J8256R268K0226l2383q366P226J1577j749k0787L527Q603J6135
17538B9327l177J6650J095N475l0007R311j748o758j0358K095J8866K1958J0037
$$ plain form
17525 62766 74860 100017 115587 143759 137672 120725 92475 72642 102199 101429 82369 65995
17513 65995 69040 91599 103161 116699 145382 168354 155461 135411 105255 97340 91997 92389 118417
17500 118417 117160 102171 79216 91244 88593 103594 92490 93241 89855 65363 39215 47418 53921
17487 53921 63612 75982 62535 78961 79623 53859 31856 57566 59401 52600 36134 58388 73070
17474 73070 88035 94193 84919 66572 53528 70523 100300 130934 130332 136244 124678 128374 117375
17461 117375 99552 113031 123480 117160 106770 128697 137641 124551 152793 132182 104449 105478
17449 105478 131836 127789 102919 97891 118150 90659 95214 86513 61656 64030 50328 45646 35892
17436 35892 28429 39994 25503 18356 25060 64269 72308 62571 67102 64700 45942 38879 45876
$$ packed form
17525F2766J2094K5157J5570K8172o087j6947k8250j9833K9557p70j9060j6374
17513F5995L045K2559J1562J3538K8683K2972j2893k0050l0156p915n343L92K6028
17500A18417j257j4989k2955J2028k651J5001j1104P51l386k4492k6148Q203O503
17487E3921R691J2370j3447J6426O62k5764k2003K5710J835o801j6466K2254J4682
17474G3070J4965O158r274j8347j3044J6995K9777L0634o02N912j1566L696j0999
17461A17375j7823J3479J0449o320j0390K1927Q944j3090K8242k0611k7733J029
17449A05478K6358m047k4870n028K0259k7491M555q701k4857K374j3702m682r754
17436C5892p463J1565j4491p147O704L9209Q039r737M531k402j8758p063O997
$$ plain form
17423 45876 46858 49231 37223 15284 18160 28734 5674 14516 13833 17737 31123 37981 30731 45637
17409 45637 57025 46682 33752 21778 25928 39993 73407 70193 60227 61638 73662 81073 53218
17396 53218 31325 59124 86533 63130 75541 65956 31244 33038 49012 52670 44764 45345 35367
17383 35367 20608 19718 34449 36663 37722 57235 24883 -17375 -2886 31787 37309 31209 29357
17370 29357 40192 46287 27363 10000 21177 12578 23258 37614 41264 41355 47174 46124 64670
17357 64670 70264 67389 57938 53722 34065 -492 -9298 -3141 4309 17960 17784 23859 35692 60069
17343 60069 71918 49287 39288 32987 41913 71397 86929 81150 66741 57676 29705 45414 60067
17330 60067 25383 21155 15731 19581 19437 13070 6435 7550 33523 30813 37782 79066 90401 80928
$$ packed form
17423D5876R82K373j2008k1939K876J0574k3060Q842o83L904J3386O858p250J4906
17409D5637J1388j0343j2930j1974M150J4065L3414l214r966J411J2024P411k7855
17396E3218k1893K7799K7409k3403J2411r585l4712J794J5974L658p906N81r978
17383C5367j4759q90J4731K214J059J9513l2352m2258J4489L4673N522o100j852
17370B9357J0835O095j8924j7363J1177q599J0680J4356L650R1N819j050J8546
17357F4670N594k875r451m216j9657l4557q806O157P450J3651j76O075J1833K4377
17343F0069J1849k2631r999o301Q926K9484J5532n779j4409r065k7971J5709J4653
17330F0067l4684m228n424L850j44o367o635J115K5973k710O969M1284J1335r473
$$ plain form
17316 80928 84625 73446 88237 93106 119164 169959 186723 205269 211802 240418 248488 220576
17304 220576 189867 181122 173727 176052 179607 186033 224325 256815 309312 345671 330111 327996 296009
17291 296009 229695 207900 189229 177474 170878 155350 126664 111588 99849 84273 70474 94575
17279 94575 73786 72156 93766 96473 76042 66564 81958 75470 101960 106272 94200 78863 66744
17266 66744 25864 48601 90834 97381 101212 87848 76203 100858 148522 169102 167551 152880
17254 152880 157615 151812 114458 105178 126317 122286 107593 103417 120037 145438 167082 179479
17242 179479 201358 218010 231394 217404 190420 173478 159559 145309 119734 89484 77168
17231 77168 41157 54034 81110 100599 102210 111309 97052 75879 74566 81725 86647 88689 76023
$$ packed form
17316H0928L697j1179J4791M869K6058N0795J6764J8546O533K8616Q070k7912
17304B20576l0709q745p395K325L555O426L8292L2490N2497L6359j5560k115l1987
17291B96009o6314k1795j8671j1755o596j5528k8686j5076j1739j5576j3799K4101
17279I4575k0789j630K1610K707k0431r478J5394o488K6490M312j2072j5337j2119
17266F6744m0880K2737M2233O547L831j3364j1645K4655M7664K0580j551j4671
17254A52880M735n803l7354r280K1139m031j4693m176J6620K5401K1644J2397
17242A79479K1879J6652J3384j3990k6984j6942j3919j4250k5575l0250j2316
17231G7168l6011J2877K7076J9489J611R099j4257k1173j313P159M922K042j2666
$$ plain form
17218 76023 77751 87735 80923 83982 98172 102631 104823 103000 90331 86217 86851 75409 49457 58667
17204 58667 61817 63205 52543 36329 43070 49578 46044 34776 29326 26698 12768 -5137 -9129
17191 -9129 4011 27479 44271 12232 21912 39687 52249 63950 72496 74973 86846 71440
17179 71440 79065 76507 85196 98174 98226 92900 68414 69578 82187 103560 123259 136614 126942
17166 126942 121187 121816 141176 150044 182309 204405 193329 169598 161690 135475 109391 105919 90840
17153 90840 94723 124564 137694 161106 156562 177182 199482 210014 202056 191730 198590 209205
17141 209205 209973 202068 185454 184249 202468 215433 230749 263883 270879 254420 202386 170894
17129 170894 152093 134682 118285 113505 123785 117265 115682 100606 105488 114275 134058 146777
$$ packed form
17218G6023J728R984o812L059J4190M459K192j823j2669m114O34j1442k5952R210
17204E8667L150J388j0662j6214O741O508l534j1268n450k628j3930j7905l992
17191i129J3140K3468J6792l2039R680J7775J2562J1701Q546K477J1873j5406
17179G1440P625k558Q689J2978N2n326k4486J164J2609K1373J9699J3355r672
17166A26942n755O29J9360Q868L2265K2096j1076k3731p908k6215k6084l472j5079
17153I0840L883K9841J3130K3412m544K0620K2300J0532p958j0326O860J0615
17141B09205P68p905j6614j205J8219J2965J5316L3134O996j6459n2034l1492
17129A70894j8801j7411j6397m780J0280o520j583j5076M882Q787J9783J2719
$$ plain form
17117 146777 153259 123375 76584 89034 132463 88527 81694 63650 75235 90369 101626 154714
17105 154714 184280 185694 190537 188519 199800 197301 195469 184602 180584 212825 201694 194917 184061
17092 184061 181511 200267 227509 249533 240232 243468 254874 270130 256709 271962 307361 313049
17080 313049 328488 330782 331208 324377 304239 283561 254185 224179 221636 248955 257975 262523 240172
17067 240172 270389 257924 230568 229673 242577 248976 253526 264748 282804 300761 306262 306351 315552
17054 315552 342679 351905 354991 352893 344982 386687 404120 439385 463218 520620 588057 653095
17042 653095 713209 729043 735077 768160 800519 836729 905614 964424 1058375 1154040 1233602 1362166
17030 1362166 1491656 1665838 1859390 2096962 2368506 2729668 3233160 3915523 4897959
$$ packed form
17117A46777O482k9884m6791J2450M3429m3936o833j8044J1585J5134J1257N3088
17105A54714K9566J414M843k018J1281k499j832j0867m018L2241j1131o777j0856
17092A84061k550J8756K7242K2024r301L236J1406J5256j3421J5253L5399N688
17080C13049J5439K294M26o831k0138k0678k9376l0006k543K7319R020M548k2351
17067B40172L0217j2465k7356q95J2904O399M550J1222J8056J7957N501Q9R201
17054C15552K7127R226L086k098p911M1705J7433L5265K3833N7402O7437O5038
17042F53095O0114J5834O034L3083L2359L6210O8885N8810R3951R5665P9562J28564
17030A362166J29490J74182J93552K37572K71544L61162N03492O82363R82436
$$ plain form
17021 4897959 6307095 8369255 11341738 15446459 20313911 24312296 24991809 21963604
17013 21963604 17604478 13947940 11524092 10142785 9558902 9685987 10576568 12401146
17005 12401146 15348707 19530098 24380658 27885202 27555426 23374831 17981623 13455634
16997 13455634 10224963 7991374 6402995 5259698 4422009 3814832 3366258 3058561 2821029
16988 2821029 2630723 2465365 2320855 2166232 2037506 1933256 1882040 1845524 1850829 1867981
16978 1867981 1878241 1957135 2061853 2195465 2307501 2432774 2579037 2812034 3142577 3588086
16968 3588086 4259049 5211811 6580500 8569151 11440816 15288856 19583923 22640400
16960 22640400 22418127 19192956 15251798 12136011 10140687 9035165 8678975 8987984
$$ packed form
17021D897959J409136K062160K972483M104721M867452L998385O79513l028205
17013B1963604m359126l656538k423848j381307n83883J27085Q90581J824578
17005A2401146K947561M181391M850560L504544l29776m180595n393208m525989
16997A3455634l230671k233589j588379j143297q37689o07177m48574l07697k37532
16988B821029j90306j65358j44510j54623j28726j04250n1216l6516N305J7152
16978A867981J0260P8894J04718J33612J12036J25273J46263K32997L30543M45509
16968C588086O70963R52762J368689J988651K871665L848040M295067L056477
16960B2640400k22273l225171l941158l115787j995324j105522l56190L09009
$$ plain form
16952 8987984 10027901 11981838 15074339 19357511 24111597 27082606 25832064 21043158
16944 21043158 15685361 11518069 8600093 6599668 5230427 4243683 3514292 2990286
16936 2990286 2616625 2339541 2091867 1846645 1662884 1547448 1435311 1307658 1198179
16927 1198179 1061577 975989 902510 820345 804164 803541 799586 780802 759192 709784 607192
16916 607192 566736 524247 473902 433218 409831 380451 370122 389574 397200 396729 377149 384772
16904 384772 390959 390008 381412 372840 377066 392718 361963 322126 308638 300161 298664 305935 313984
16891 313984 312504 297489 292705 272256 251897 250438 235324 248092 237446 234040 260826 280076
16879 280076 282119 264461 276809 283812 282569 241725 221543 260642 287446 280551 248438 229489
$$ packed form
16952H987984J039917J953937L092501M283172M754086K971009j250542m788906
16944B1043158n357797m167292k917976k000425j369241r86744p29391n24006
16936B990286l73661k77084k47674k45222j83761j15436j12137j27653j09479
16927A198179j36602q5588p3479q2165j6181o23l955j8784k1610m9408j02592
16916F07192m0456m2489n0345m0684k3387k9380j0329J9452P626m71j9580P623
16904C84772O187r51q596q572M226J5652l0755l9837j3488q477j497P271Q049
16891C13984j480j5015m784k0449k0359j459j5114J2768j0646l406K6786J9250
16879B80076K043j7658J2348P003j243m0844k0182L9099K6804o895l2113j8949
$$ plain form
16867 229489 206056 238510 232506 240797 257164 278747 291190 302209 287243 280648 293968 287787
16855 287787 296238 308179 286248 297090 335588 352996 354891 348669 362992 401688 422667 426704
16843 426704 422030 402015 405438 459653 497770 521312 538728 527529 563280 580202 605215 629816
16831 629816 675284 734401 779098 828629 879571 926885 997620 1106643 1224152 1368407 1510729
16820 1510729 1668281 1821176 2026337 2288097 2602109 2912690 3256331 3627535 4072856
16811 4072856 4680090 5504704 6690346 8444959 11031332 14935364 20822700 29440230
16803 29440230 40815412 52323744 58546424 55559413 45223428 34018383 25919314
16796 25919314 21005379 18437083 17560831 18164139 20457608 24868872 31912752 41176449
$$ packed form
16867B29489k3433L2454o004Q291J6367K1583J2443J1019j4966o595J3320o181
16855B87787Q451J1941k1931J0842L8498J7408J895o222J4323L8696K0979M037
16843D26704m674k0015L423N4215L8117K3542J7416j1199L5751J6922K5013K4601
16831F29816M5468N9117M4697M9531N0942M7314P0735J09023J17509J44255J42322
16820A510729J57552J52895K05161K61760L14012L10581L43641L71204M45321
16811D072856O07234Q24614J185642J754613K586373L904032N887336Q617530
16803B9440230J1375182J1508332O222680k987011j0335985j1205045q099069
16796B5919314m913935k568296q76252O03308K293469M411264P043880R263697
$$ plain form
16788 41176449 49320123 51109926 45070828 34714446 24900243 17837751 13186231 10110893
16780 10110893 8022760 6501782 5381845 4560336 4000851 3635566 3385498 3119463 2850980
16771 2850980 2596672 2288441 1993536 1794305 1628694 1476856 1349056 1225528 1121777
16762 1121777 1046296 985204 899231 826951 796960 754307 698264 669534 631810 616173 614765
16751 614765 594225 559492 530399 503722 457963 443430 442765 451154 432229 419392 401689 386515
16739 386515 363559 346983 339310 330765 340382 353677 366018 388052 371201 374926 396914 388439
16727 388439 380564 413502 418603 385995 359080 307048 291067 314342 320250 314427 322405 288172
16715 288172 243360 230519 274269 287668 265158 267239 263793 262430 251426 229902 208095 225244
$$ packed form
16788D1176449Q143674J789803o039098j0356382r814203p062492m651520l075338
16780A0110893k088133j520978j119937q21509n59485l65285k50068k66035k68483
16771B850980k54308l08231k94905j99231j65611j51838j27800j23528j03751
16762A121777p5481o1092q5973p2280k9991m2653n6043k8730l7724j5637j408
16751F14765k0540l4733k9093k6677m5759j4533o65Q389j8925j2837j7703j5174
16739C86515k2956j6576p673q545R617J3295J2341K2034j6851L725K1988q475
16727C88439p875L2938N101l2608k6915n2032j5981K3275N908n823P978l4233
16715B88172m4812j2841M3750J3399k2510K081l446j363j1004k1524k1807J7149
$$ plain form
16703 225244 211033 177434 174979 206466 221940 253513 254665 201032 194593 189266 182148 182897 177123
16690 177123 184321 171827 170098 190659 186956 184703 178128 199604 192594 181476 184748 227194 247830
16677 247830 264951 279870 291445 279300 268653 271960 260064 245950 226158 218368 214034 214472
16665 214472 261840 285975 316408 299944 260921 260197 251363 258835 290376 328903 394919 449984
16653 449984 498135 515604 482916 478695 469255 460561 482826 489290 495804 496686 467350 419872 412042
16640 412042 408444 438379 444520 448076 449789 433792 435567 434416 437162 430963 390005 359682 377598
16627 377598 400676 383664 367026 372708 388070 377728 342961 304552 290256 281766 254095 231789
16615 231789 216656 190836 191508 203649 194600 196754 192853 169691 195824 201869 194848 197789 225456
$$ packed form
16703B25244j4211l3599k455L1487J5474L1573J152n3633o439n327p118P49n774
16690A77123P198j2494j729K0561l703k253o575K1476p010j1118L272M2446K0636
16677B47830J7121J4919J1575j2145j0647L307j1896j4114j9792p790m334M38
16665B14472M7368K4135L0433j6464l9023p24q834P472L1541L8527O6016N5065
16653D49984M8151J7469l2688m221r440q694K2265O464O514Q82k9336m7478p830
16640D12042l598K9935O141L556J713j5997J775j151K746o199m0958l0323J7916
16627C77598K3078j7012j6638N682J5362j0342l4767l8409j4296q490k7671k2306
16615B31789j5133k5820O72J2141r049K154l901k3162K6133O045p021K941K7667
$$ plain form
16602 225456 222677 196856 206082 225709 201809 168752 148896 155336 168277 192584 191250 198349
16590 198349 214041 215834 220531 191449 172027 186006 213264 207764 189597 179362 200401 230627
16578 230627 239700 245622 244261 260823 239777 233339 228675 220096 220291 223867 222844 230422 234417 223174
16564 223174 201067 189278 220932 241476 231302 238521 231034 236176 221140 229613 244126 233657
16552 233657 227225 234087 220189 214052 242752 251289 266291 258104 253607 259776 266404 267716 275133
16539 275133 326931 331935 305882 312478 315560 296836 312759 366948 386823 412418 415595 437104
16527 437104 454279 441459 444706 458781 445728 434768 421458 433809 444176 467164 472033 470773
16515 470773 487654 497452 495936 478800 465799 470001 495475 514546 536233 571213 558337 569279
$$ packed form
16602B25456k779k5821R226J9627k3900l3057j9856O440J2941K4307j334P099
16590A98349J5692J793M697k9082j9422J3979K7258n500j8167j0235K1039L0226
16578B30627R073N922j361J6562k1046o438m664q579J95L576j023P578L995j1243
16564B23174k2107j1789L1654K0544j0174P219p487N142j5036Q473J4513j0469
16552B33657o432O862j3898o137K8700Q537J5002q187m497O169O628J312P417
16539B75133N1798N004k6053O596L082j8724J5923N4189J9875K5595L177K1509
16527D37104J7175j2820L247J4075j3053j0960j3310J2351J0367K2988M869j260
16515D70773J6881R798j516j7136j3001M202K5474J9071K1687L4980j2876J0942
$$ plain form
16503 569279 587553 547169 525589 528330 535432 528640 514572 506072 516222 511906 547996 576534
16491 576534 585643 573518 563465 568613 582427 566646 568185 567276 553379 561041 582304 576795 568572
16478 568572 580728 583074 586728 606023 633219 630872 640007 653388 659840 650299 673071 694534 689030
16465 689030 731945 756618 775222 803401 836869 852622 862770 862925 869364 895006 921522 932725
16453 932725 946061 978005 1007072 1041904 1096100 1134804 1141236 1187047 1221432 1251665 1290637 1312376
16441 1312376 1341839 1383320 1447109 1525395 1574688 1610591 1673595 1718389 1750865 1756927 1779612
16430 1779612 1786537 1844083 1910477 1972429 2027504 2077507 2148961 2220985 2304591 2377831 2449981
16419 2449981 2549949 2627078 2754516 2859522 2970576 3090191 3240641 3379525 3544219 3717353
$$ packed form
16503E69279J8274m0384k1580K741P102o792j4068q500J0150m316L6090K8538
16491E76534R109j2125j0053N148J3814j5781J539r09j3897P662K1263n509q223
16478E68572J2156K346L654J9295K7196k347R135J3381O452r541K2772K1463n504
16465F89030M2915K4673J8604K8179L3468J5753J0148J55O439K5642K6516J1203
16453I32725J3336L1944K9067L4832N4196L8704O432M5811L4385L0233L8972K1739
16441A312376K9463M1481O3789P8286M9293L5903O3004M4794L2476O062K2685
16430A779612O925N7546O6394O1952N5075N0003P1454P2024Q3606P3240P2150
16419B449981R9968P7129J27438J05006J11054J19615J50450J38884J64694J73134
$$ plain form
16409 3717353 3901635 4112094 4343282 4566336 4790989 5019125 5279443 5540764 5857482
16400 5857482 6236233 6646260 7075033 7539414 8027289 8564188 9148880 9783923 10507567
16391 10507567 11292829 12167168 13130990 14171291 15334688 16566067 17968626 19562166
16383 19562166 21340536 23305856 25485268 27894882 30505921 33338471 36407619 39642089
16375 39642089 42965097 46264357 49350758 52085489 54211554 55573414 56132002 55792114
16367 55792114 54574726 52574816 50021591 47081789 43896325 40662300 37485240 34471710
16359 34471710 31664770 29065017 26724788 24600143 22685183 20999987 19481167 18084636
16351 18084636 16794271 15628342 14579490 13603916 12665148 11793366 11002570 10283901 9608155
$$ packed form
16409C717353J84282K10459K31188K23054K24653K28136K60318K61321L16718
16400E857482L78751M10027M28773M64381M87875N36899N84692O35043P23644
16391A0507567P85262Q74339R63822J040301J163397J231379J402559J593540
16383A9562166J778370J965320K179412K409614K611039K832550L069148L234470
16375C9642089L323008L299260L086401K734731K126065J361860N58588l39888
16367E5792114j217388j999910k553225k939802l185464l234025l177060l013530
16359C4471710k806940k599753k340229k124645j914960j685196j518820j396531
16351A8084636j290365j165929j048852r75574r38768q71782p90796p18669o75746
$$ plain form
16342 9608155 8995621 8446411 7940074 7449469 6985957 6600094 6229445 5872767 5572618
16333 5572618 5306820 5070831 4840898 4615969 4392484 4167132 3971037 3787072 3604630
16324 3604630 3482669 3350795 3197015 3085781 2990483 2906432 2776872 2673123 2598981 2545474
16314 2545474 2489709 2416761 2314848 2237803 2149211 2101766 2044335 1996346 1959459 1901516 1821444
16303 1821444 1748958 1716646 1716958 1670729 1629848 1603981 1586895 1552990 1529656 1491517 1498888 1538948
16291 1538948 1524128 1478583 1459841 1406627 1342177 1291965 1249126 1217288 1217663 1201698 1196275 1184410
16279 1184410 1175414 1151791 1161476 1132259 1091064 1056944 1029378 1000990 977167 933652 905324 876569
16267 876569 851385 839160 830049 834628 783563 748729 743005 753085 756385 744723 722144 714560
$$ packed form
16342I608155o12534n49210n06337m90605m63512l85863l70649l56678l00149
16333E572618k65798k35989k29933k24929k23485k25352j96095j83965j82442
16324C604630j21961j31874j53780j11234r5298q4051j29560j03749p4142n3507
16314B545474n5765p2948j01913p7045q8592m7445n7431m7989l6887n7943q0072
16303A821444p2486l2312L12m6229m0881k5867j7086l3905k3334l8139P371M0060
16291A538948j4820m5545j8742n3214o4450n0212m2839l1838L75j5965n423j1865
16279A184410q996k3623R685k9217m1195l4120k7566k8388k3823m3515k8328k8755
16267H76569k5184j2225r111M579n1065l4834n724J0080L300j1662k2579p584
$$ plain form
16255 714560 713797 683710 682972 703993 693993 690261 681830 694015 701476 705620 680837 669610 677047
16242 677047 673170 668980 675668 671587 673586 670542 694865 699397 697303 712630 737903 777548 794663
16229 794663 813390 842662 858254 853012 853209 827494 755799 679327 641016 610752 598294 564538
16217 564538 545792 543413 511239 477691 456012 419692 379325 382887 399941 401125 401561 372020
16205 372020 365198 401510 407743 402869 393942 393749 387366 401821 417143 416612 413100 434604 440653 432190
16191 432190 403824 416714 427902 462762 490707 476356 457419 427776 429296 449432 460513 458000
16179 458000 466673 472512 470464 503683 523455 514131 463902 451498 429541 400065 382508 387557
16167 387557 386958 380742 375964 365383 359853 382436 415684 404590 415550 408900 409765 413710 415312
$$ packed form
16255G14560p63l0087p38K1021j0000l732q431J2185P461M144k4783j1227P437
16242F77047l877m190O688m081J999l044K4323M532k094J5327K5273L9645J7115
16229G94663J8727K9272J5592n242J97k5715p1695p6472l8311l0264j2458l3756
16217E64538j8746k379l2174l3548k1679l6320m0367L562J7054J184M36k9541
16205C72020o822L6312O233m874q927j93o383J4455J5322n31l512K1504O049q463
16191D32190k8366J2890J1188L4860K7945j4351j8937k9643J520K0136J1081k513
16179D58000Q673N839k048L3219J9772r324n0229j2404k1957k9476j7557N049
16167C87557n99o216m778j0581n530K2583L3248j1094J0960o650Q65L945J602
$$ plain form
16154 415312 396725 399578 389428 414474 462547 456834 436662 423339 433656 478236 486417 477438
16142 477438 476903 522982 524843 538059 579824 598287 585564 595832 605454 655436 717030 740671
16130 740671 753976 757182 770773 835588 940293 1043836 1128101 1208047 1268472 1349818 1474880
16119 1474880 1642898 1844720 2049755 2259416 2459286 2654250 2915344 3267041 3746559
16110 3746559 4393803 5304038 6527256 8224031 10646909 14051938 18494417 23448381
16102 23448381 27606927 29804480 30057262 29931864 31272695 35340357 42650200 52043887
16094 52043887 59385770 59785935 52907867 43367338 35949728 32019288 30828842 30988570
16086 30988570 30800699 28730992 24515073 19408166 14866816 11457162 9057488 7389382
$$ packed form
16154D15312j8587K853j0150K5046M8073n713k0172j3323J0317M4580Q181q979
16142D77438n35M6079J861J3216M1765J8463j2723J0268R622M9982O1594K3641
16130G40671J3305L206J3591O4815J04705J03543Q4265P9946O0425Q1346J25062
16119A474880J68018K01822K05035K09661J99870J94964K61094L51697M79518
16110C746559O47244R10235J223218J696775K422878L405029M442479M953964
16102B3448381M158546K197553K52782j25398J340831M067662P309843R393687
16094E2043887P341883M00165o878068r540529p417610l930440j190446J59728
16086C0988570j87871k069707m215919n106907m541350l409654k399674j668106
$$ plain form
16078 7389382 6161184 5225009 4478160 3900071 3461665 3171252 2963656 2772203 2580392
16069 2580392 2337081 2072281 1871508 1687530 1552923 1451855 1337655 1242018 1150812 1087190
16059 1087190 1010672 940015 886993 838741 796232 739752 684398 655668 653059 633748 610652
16048 610652 564500 527525 513172 502749 487304 490670 501860 514169 465357 464976 494260 491526
16036 491526 464528 458994 453781 474966 477910 448784 399317 379010 374163 349138 333295 322330
16024 322330 317219 313483 273029 246569 256561 263952 245839 255850 289476 295690 281919 243584
16012 243584 215336 211634 199662 204658 218044 211374 201154 206857 199090 205438 207505 200069 183056
15999 183056 179903 179034 180407 194289 183274 162346 187059 171357 155135 173419 186241 169096
$$ packed form
16078G389382j228198r36175p46849n78089m38406k90413k07596j91453j91811
16069B580392k43311k64800k00773j83978j34607j01068j14200r5637r1206o3622
16059A087190p6518p0657n3022m8252m2509n6480n5354k8730k609j9311k3096
16048F10652m6152l6975j4353j0423j5445L366J1190J2309m8812l81K9284k734
16036D91526k6998n534n213K1185K944k9126m9467k0307m847k5025j5843j0965
16024C22330n111l736m0454k6460R992P391j8113J0011L3626O214j3771l8335
16012B43584k8248l702j1972M996J3386o670j0220N703p767O348K067p436j7013
15999A83056l153q69J373J3882j1015k0928K4713j5702j6222J8284J2822j7145
$$ plain form
15987 169096 148736 124685 115743 115307 140919 150069 150947 153879 182388 180670 191439 221717 233138
15974 233138 243901 234998 224963 245594 253917 226206 211130 204403 182274 153848 167583 190748
15962 190748 220037 221457 191833 159501 147038 119147 122347 152703 152480 161105 166275 164429 162856
15949 162856 129182 131945 154732 141143 114194 101213 99191 75055 75867 106722 127412 113250
15937 113250 135467 114115 101170 96053 85867 104576 115739 112533 80719 63488 92043 132743
15925 132743 119531 109840 105989 107887 128530 131688 112273 99893 85260 63535 18456 8326
15913 8326 35694 50545 50010 62244 75899 79636 74807 68816 99230 89624 80847 73854 56900
15900 56900 40121 37848 74488 75099 62623 87082 98624 73312 67158 51865 51325 43066 7265
$$ packed form
15987A69096k0360k4051q942m36K5612R150Q78K932K8509j718J0769L0278J1421
15974B33138J0763q903j0035K0631Q323k7711j5076o727k2129k8426J3735K3165
15962A90748K9289J420k9624l2332j2463k7891L200L0356k23Q625N170j846j573
15949A62856l3674K763K2787j3589k6949j2981k022k4136Q12L0855K0690j4162
15937A13250K2217k1352j2945n117j0186J8709J1163l206l1814j7231K8555M0700
15925A32743j3212r691l851J898K0643L158j9415j2380j4633k1725m5079j0130
15913H326K7368J4851n35J2234J3655L737m829n991L0414r606q777o993j6954
15900E6900j6779k273L6640O11j2476K4459J1542k5312o154j5293n40q259l5801
$$ plain form
15887 7265 36708 66313 61326 68509 63764 51466 60182 63540 52612 56904 60291 60246 53150 69457
15873 69457 63614 56080 74996 86183 81443 101115 101409 101181 83892 46053 32248 17340 34839
15860 34839 33290 12109 -11107 686 15902 23391 22709 23068 14378 38202 66641 59605 85297
15847 85297 89453 53522 42978 46583 40202 43520 56139 66380 65535 78941 88107 52401 36425
15834 36425 53297 33584 38887 47624 42500 17456 19767 -2490 8897 33968 35968 66378 76483
15821 76483 83947 58112 38284 22835 9795 -15378 -14273 8474 33521 19339 7077 7466
15809 7466 -3770 4124 27421 6307 -19335 -2186 36027 38826 20751 7818 -15514 -34156
15797 -34156 -32335 -39397 -24985 -43512 -28169 -11436 -14682 16118 32174 24652 37666 79338
$$ packed form
15887G265K9443K9605m987P183m745j2298Q716L358j0928M292L387m5p096J6307
15873F9457n843p534J8916J1187m740J9672K94k28j7289l7839j3805j4908J7499
15860C4839j549k1181k3216J1793J5216P489o82L59q690K3824K8439p036K5692
15847H5297M156l5931j0544L605o381L318J2619J0241q45J3406R166l5706j5976
15834C6425J6872j9713N303Q737n124k5044K311k2257J1387K5071K000L0410J0105
15821G6483P464k5835j9828j5449j3040k5173J105K2747K5047j4182j2262L89
15809G466j1236P894K3297k1114k5642J7149L8213K799j8075j2933k3332j8642
15797c4156J821p062J4412j8527J5343J6733l246L0800J6056p522J3014M1672
$$ plain form
15785 79338 75519 92008 72092 64938 71098 71507 24359 4572 14333 28848 26571 25174 19661
15772 19661 21442 27637 22243 24591 15002 2627 11477 10663 234 -25127 -45849 -22340 3519
15759 3519 21392 15762 -13216 8659 2653 -13373 -6747 22490 41080 40027 36560 32515 36829
15746 36829 47781 54992 82355 89356 59136 55606 62500 42662 30149 25396 14178 5150 21791
15733 21791 31825 42734 78126 76206 40679 49763 39776 17820 23044 2780 -14942 -7566 4544
15720 4544 29082 30702 29752 20625 18750 36476 17301 -15985 -16799 -1603 23390 59317 80941
15707 80941 65783 37020 29262 29211 46052 41405 23052 21106 43236 25096 19803 23125 43203
15694 43203 42543 30891 -6855 -9997 -5088 17025 27195 19726 27116 -182 -1922 1192 16567
$$ packed form
15785G9338l819J6489j9916p154O160M09m7148j9787R761J4515k277j397n513
15772A9661J781O195n394K348r589j2375Q850q14j0429k5361k0722K3509K5859
15759C519J7873n630k8978K1875o006j6026O626K9237J8590j053l467m045M314
15746C6829J0952P211K7363P001l0220l530O894j9838j2513m753j1218r028J6641
15733B1791J0034J0909L5392j920l5527R084r987k1956N224k0264j7722P376J2110
15720D544K4538J620r50r127j875J7726j9175l3286q14J5196K4993L5927K1624
15707H0941j5158k8763p758n1J6841m647j8353j946K2130j8140n293L322K0078
15694D3203o60j1652l7746l142M909K2113J0170p469P390k7298j740L114J5375
$$ plain form
15681 16567 32136 40489 31343 27541 29893 16185 12265 -18906 -25463 -5935 20741 17414 9791
15668 9791 12427 -4227 -16875 24609 56547 51076 23640 43977 47269 48652 37417 39692 24618
15655 24618 13554 13706 10249 -233 -8403 10128 11684 -20092 -30356 -37015 -36065 -37805 -10328
15642 -10328 9562 41356 43286 18780 17073 24768 59985 89601 76780 37109 16097 27365
15630 27365 11882 20152 11602 -2246 -18060 -15344 -315 14979 39524 38483 13602 10921 21611
15617 21611 47997 24117 -2715 -4027 -5015 8935 4176 4707 -7680 -17633 -5282 16625 36581
15604 36581 27398 34082 15350 -25120 -24997 5501 34628 32202 14645 22981 19777 8350 25632
15591 25632 14335 2912 1276 -18019 1669 15822 16861 -1927 -14286 4846 30276 35909
$$ packed form
15681A6567J5569Q353r146l802K352j3708l920l1171o557J9528K6676l327p623
15668I791K636j6654j2648M1484L1938n471k7436K0337L292J383j1235K275j5074
15655B4618j1064J52l457j0482q170J8531J556l1776j0264o659R50j740K7477
15642a0328J9890L1794J930k4506j707P695L5217K9616j2821l9671k1012J1268
15630B7365j5483Q270q550j3848j5814K716J5029J5294K4545j041k4881k681J0690
15617B1611K6386k3880k6832j312r88J3950m759N31j2387r953J2351K1907J9956
15604C6581r183O684j8732m0470J23L0498K9127k426j7557Q336l204j1427J7282
15591B5632j1297j1423j636j9295J9688J4153J039j8788j2359J9132K5430N633
$$ plain form
15579 35909 12205 14754 23531 36262 30435 20304 8373 12771 12099 -8409 -27245 -10035 5605
15566 5605 14127 30069 31102 15090 32181 62663 77784 104477 104829 103206 96133 112752 147101
15553 147101 183988 170027 157460 175021 179631 194859 185040 177049 166080 136673 120559 123367
15541 123367 127151 143125 139712 115052 98817 85028 74592 40462 14092 921 24319 41489
15529 41489 18658 -8527 -17514 -31730 -41814 -7594 -10001 2367 -4706 -25522 -31510 -9270
15517 -9270 -6601 -11893 -6991 -24525 -25705 -4151 5482 -14663 572 -12752 -26402 -15558 8968
15504 8968 8160 9937 21228 39279 22276 -3552 -19272 -25318 -822 15372 20161 15315 6306
15491 6306 7435 23385 11427 -26101 -45454 -41419 -50559 -34887 -11534 -13128 -380 4657 -19313
$$ packed form
15579C5909k3704K549Q777J2731n827j0131j1931M398o72k0508j8836J7210J5640
15566E605Q522J5942J033j6012J7091L0482J5121K6693L52j623p073J6619L4349
15553A47101L6887j3961j2567J7561M610J5228r819p991j0969k9407j6114K808
15541A23367L784J5974l413k4660j6235j3789j0436l4130k6370j3171K3398J7170
15529D1489k2831k7185q987j4216j0084L4220k407J2368p073k0816n988K2240
15517i270K669n292M902j7534j180K1554R633k0145J5235j3324j3650J0844K4526
15504H968q08J777J1291J8051j7003k5828j5720o046K4496J6194M789m846r009
15491F306J129J5950j1958l7528j9353M035r140J5672K3353j594J2748N037k3970
$$ plain form
15478 -19313 -13810 -39018 -45793 -20694 -15685 -21357 -6171 11001 2414 -8188 -7098 -5234 -10590
15465 -10590 -22702 -36110 -37022 -14806 -21659 -27891 -12430 -9880 -18854 -3516 -12009 11980 18969
15452 18969 3817 -11155 -10942 -36797 -69168 -65594 -50196 -52726 -40659 -52755 -53803 -39346 -46545
15439 -46545 -65766 -47889 -35450 -22579 7715 430 -45914 -28333 -16422 -17468 -30826 -23667
15427 -23667 -38355 -41850 -38325 -25668 -10444 -21254 -13980 4924 -14665 -14597 -12503 -4203 6353
15414 6353 -17414 -19743 -13497 -9384 -5548 3038 10006 2882 -5447 8281 -12454 -35985 -46492
15401 -46492 -58811 -52972 -42308 -49138 -60993 -82795 -52081 -17774 14020 27385 -2682 -5195
15389 -5195 6481 2464 25340 37544 44217 28321 12357 16302 34197 37445 23649 1612 -17342
$$ packed form
15478a9313N503k5208o775K5099N009n672J5186J7172q587j0602J090J864n356
15465a0590j2112j3408r12K2216o853o232J5461K550q974J5338q493K3989O989
15452A8969j5152j4972K13k5855l2371L574J5398k530J2067j2096j048J4457p199
15439d6545j9221J7877J2439J2871L0294p285m6344J7581J1911j046j3358P159
15427b3667j4688l495L525J2657J5224j0810P274J8904j9589O8K094Q300J0556
15414F353k3767k329O246M113L836Q586O968p124q329J3728k0735k3531j0507
15401d6492j2319N839J0664o830j1855k1802L0714L4307L1794J3365l0067k513
15389e195J1676m017K2876J2204O673j5896j5964L945J7895L248j3796k2037j8954
$$ plain form
15376 -17342 -32884 -5272 23025 40775 59883 28011 -17290 -43647 -42107 -9965 5218 260
15364 260 -398 34418 20698 -4575 12832 27210 24263 -3959 -19377 -27017 -31246 -36044 -34947
15351 -34947 -19172 775 -8577 -23043 -38681 -61262 -73263 -67749 -68865 -53405 -51843 -27868
15339 -27868 1091 -3825 -31019 -65592 -61556 -34884 -31165 -4748 10269 12960 -27885 -38413
15327 -38413 -9210 -179 35429 24858 16113 35690 20553 25779 30468 21484 10803 -17034 -31604
15314 -31604 -27378 -11412 -8296 -29953 -61958 -84495 -58382 -39182 -42681 -57725 -38312 2396
15302 2396 -12211 -2579 5799 5779 -12615 -20578 -12667 -2890 -3088 -16257 -25772 -20436 -38484 -41976
15288 -41976 -37860 -34447 -25422 -26484 -40757 -40205 -50618 -51966 -54662 -53463 -41549 -16867 11703
$$ packed form
15376a7342j5542K7612K8297J7750J9108l1872m5301k6357J540L2142J5183m958
15364B60o58L4816j3720k5273J7407J4378k947k8222j5418p640m229m798J097
15351c4947J5775J9947r352j4466j5638k2581j2001N514j116J5460J562K3975
15339b7868K8959m916k7194l4573M036K6672L719K6417J5017K691m0845j0528
15327c8413K9203R031L5608j0571q745J9577j5137N226M689q984j0681k7837j4570
15314c1604M226J5966L116k1657l2005k2537K6113J9200l499j5044J9413M0708
15302B396j4607R632Q378k0j8394p963P911R777j98j3169r515N336j8048l492
15288d1976M116L413R025j062j4273N52j0413j348k696J199J1914K4682K8570
$$ plain form
15275 11703 40063 22729 11128 25143 16647 -6042 -25021 -19198 -17778 -9490 3914 13322 2150
15262 2150 -2868 3879 24016 38603 45432 26964 -10560 -37537 -53783 -44251 -33473 -24985 -41989
15249 -41989 -45844 -58154 -30771 -18218 -49944 -67850 -66317 -38417 -27864 -37544 -25889 -30600
15237 -30600 -35002 -10791 -14954 -1854 -913 6780 11848 4149 -32270 -41829 -32271 -18516 -28017 -38238
15223 -38238 -38874 -44946 -45787 -28533 -24697 -16107 14061 7809 7776 32996 6389 -38014 -70554 -51665
15209 -51665 -37822 -39314 -55899 -36237 -3757 -5238 -6548 -1066 16159 35586 8119 -13240
15197 -13240 13027 -1907 -13707 -6101 14880 16650 19925 22983 2818 14557 14768 11694 8279
15184 8279 1394 -37620 -39634 -34793 -37601 -18998 -23123 -34187 -15648 16762 14841 25559 11296
$$ packed form
15275A1703K8360j7334j1601J4015q496k2689j8979N823J420Q288J3404R408j1172
15262B150n018O747K0137J4587O829j8468l7524k6977j6246R532J0778Q488j7004
15249d1989l855j2310K7383J2553l1726j7906J533K7900J0553r680J1655m711
15237c0600m402K4211m163J3100R41P693N068p699l6419r559R558J3755r501j0221
15223c8238o36o072q41J7254L836Q590L0168o252l3K5220k6607m4403l2540J8889
15209e1665J3843j492j6585J9662L2480j481j310N482J7225J9427k7467k1359
15197a3240K6267j4934j1800P606K0981J770L275L058k0165J1739K11l074l415
15184H279o885l9014k014M841k808J8603m125j1064J8539L2410j921J0718j4263
$$ plain form
15171 11296 -4253 -23513 -1538 11916 -410 -6301 -16243 -36744 -15291 1522 -8976 -6323
15159 -6323 -9069 -31301 -48334 -38478 -32090 -55455 -43440 -53747 -55800 -24293 -6440 -19848 -19989
15146 -19989 -8481 -12383 -35503 -47046 -31125 -26038 -45518 -47595 -29649 -7304 -35525 -37393
15134 -37393 -34542 -32861 -22675 -9870 -7771 -43066 -70529 -61283 -37948 -12264 -2299 11310 8169
15121 8169 -21262 -28407 -16042 -11051 11762 15283 -13491 -24217 -28356 -34630 -28388 3043 18897
15108 18897 6214 8204 5065 -39065 -39342 -5872 14156 10151 20621 23989 -6744 -30836 -71051
15095 -71051 -75965 -47250 -30675 -13252 10803 -16976 -25270 -21459 -12887 -6578 -15483 -49051 -50881
15082 -50881 -44280 -52205 -52554 -67037 -95877 -107536 -93243 -70520 -49587 -60176 -54866 -59192 -45057
$$ packed form
15171A1296j5549j9260K1975J3454j2326n891r942k0501K1453J6813j0498K653
15159f323k746k2232j7033R856O388k3365J2015j0307k053L1507J7853j3408j41
15146a9989J1508l902k3120j1543J5921N087j9480k077J7946K2345k8221j868
15134c7393K851J681J0186J2805K099l5295k7463R246K3335K5684R965J3609l141
15121H169k9431p145J2365M991K2813L521k8774j0726m139o274O242L1431J5854
15108A8897j2683J990l139m4130k77L3470K0028m005J0470L368l0733k4092m0215
15095g1051m914K8715J6575J7423K4055k7779q294L811Q572O309q905l3568j830
15082e0881O601p925l49j4483k8840j1659J4293K2723K0933j0589N310m326J4135
$$ plain form
15069 -45057 -29329 -10772 -12615 -27124 -36649 -43612 -47980 -38628 -28428 -13595 -13495 -50749 -41474
15056 -41474 -11324 3384 -15191 -38718 -52445 -44730 -45532 -43402 -31089 -11059 7569 24452
15044 24452 21430 30354 7631 -12685 -19784 -33078 -37254 -25008 -19540 -13445 2867 10119 -6655
15031 -6655 -17495 -10704 -10456 -13526 -9876 -16535 1106 -8249 -9476 -12041 20326 14296 10721 11647
15017 11647 12387 6427 9527 6621 -11160 11564 2570 -22644 -1219 33831 62310 37606 -10563
15004 -10563 -20792 6856 30621 44211 32925 5383 -29672 -24108 8319 6983 -16311 -26416
14992 -26416 -42045 -22741 23325 29951 49088 35330 33084 23391 21184 21387 19382 16830 -4009
14979 -4009 -21297 -35941 -40513 -49251 -30121 -2708 14007 -7795 -6819 6969 -8693 -7276 2801
$$ packed form
15069d5057J5728J8557j843j4509r525o963m368R352J0200J4833J00l7254R275
15056d1474L0150J4708j8575k3527j3727P715q02K130J2313K0030J8628J6883
15044B4452l022Q924k2723k0316p099j3294m176J2246N468O095J6312P252j6774
15031f655j0840O791K48l070L650o659J7641r355j227k565L2367o030l575R26
15017A1647P40n960L100k906j7781K2724q994k5214K1425L5050K8479k4704m8169
15004a0563j0229K7648K3765J3590j1286k7542l5055N564L2427j336k3294j0105
14992b6416j5629J9304M6066O626J9137j3758k246r693k207K03k005k552k0839
14979d009j7288j4644m572q738J9130K7413J6715k1802R76J3788j5662J417J0077
$$ plain form
14966 2801 -4967 -23573 -19381 12285 9389 5595 -2283 -20999 -15840 -6215 3649 17132 36697
14953 36697 40626 27756 34282 47361 44306 24228 24897 58930 50778 46845 71490 82438 64953
14940 64953 34352 15343 16143 23084 24641 -13315 -14824 -11199 -23470 17252 8622 1394 17698
14927 17698 29054 33994 28698 15962 389 13388 10719 11350 15873 18741 7730 -14154 -7394
14914 -7394 4554 11168 -6860 -13812 -11614 -26961 -38516 -43869 -31675 -33489 -31215 -5109 -24
14901 -24 3053 -4544 -1091 360 -8149 -18956 -26086 -14040 6527 -813 -18692 -19325 -26061 -27017 -19053
14886 -19053 15140 34361 29494 17175 -27128 -31793 11887 30998 18848 -4027 -485 -13485
14874 -13485 -24643 -24109 -28227 -7881 -22292 -1019 33785 17747 29077 47287 31716 9849
$$ packed form
14966B801p768j8606M192L1666k896l794p878j8716N159R625R864J3483J9565
14953C6697L929j2870O526J3079l055k0078O69L4033q152l933K4645J0948j7485
14940F4953l0601j9009Q00O941J557l7956j509L625j2271M0722q630p228J6304
14927A7698J1356M940n296j2736j5573J2999k669O31M523K868j1011k1884O760
14914g394J1948O614j8028o952K198j5347j1555n353J2194j814K274K6106N085
14901b4L077p597L453J451q509j0807p130J2046K0567p340j7879o33o736r56P964
14886a9053L4193J9221m867j2319m4303m665M3680J9111j2150k2875L542j3000
14874a3485j1158N34m118K0346j4411K1273L4804j6038J1330J8210j5571k1867
$$ plain form
14862 9849 -31049 -31033 -61400 -75836 -66374 -68970 -56221 -31424 -10715 -8990 247 -23915 -31773
14849 -31773 -37879 -50155 -84467 -63544 -26681 -9746 -4268 3072 -5611 -36964 -59923 -46189
14837 -46189 -15580 5880 -939 -5056 2251 28011 14829 -4155 6896 16204 9711 8584 -3650
14824 -3650 -4274 -23314 -32095 -36768 -48313 -37021 -38147 -53428 -49462 -32195 -17162 -15231 -6784
14811 -6784 -4245 -6392 -15503 -28612 -10120 -3974 -42450 -36207 -19749 3288 -1886 -6188 -13150
14798 -13150 -34677 -31371 -27055 -5715 -8049 -25216 -34795 -24174 -11832 28422 37589 10184 1269
14785 1269 10704 38609 41399 52895 37587 25600 21744 20483 3174 5661 9142 -5533 -20348
14772 -20348 -20273 -34195 -17626 21938 53124 19590 552 -4769 10002 -17538 -21784 -38061 -60878
$$ packed form
14862I849m0898J6l0367j4436R462k596J2749K4797K0709J725R237k4162p858
14849c1773o106j2276l4312K0923L6863J6935N478P340q683l1353k2959J3734
14837d6189L0609K1460o819m117P307K5760j3182j8984J1051R308o493j127j2234
14824c650o24j9040q781m673j1545J1292j126j5281L966J7267J5033J931Q447
14811f784K539k147r111j3109J8492O146l8476O243J6458K3037n174m302o962
14798a3150k1527L306M316K1340k334j7167r579J0621J2342M0254R167k7405q915
14785A269R435K7905K790J1496j5308j1987l856j261j7309K487L481j4675j4815
14772b0348P5j3922J6569L9564L1186l3534j9038n321J4771k7540m246j6277k2817
$$ plain form
14759 -60878 -65408 -22970 1687 -9916 -18813 -6409 2168 -5103 -9828 -7975 -4569 -20770 -43008
14746 -43008 -42409 -52659 -53662 -47775 -32576 -25944 -5199 10301 16629 14276 -6657 -20026 -51989
14733 -51989 -34952 2318 2861 -3017 -16656 7823 -1803 -17322 -40382 -42492 -35875 -56968 -62857
14720 -62857 -59306 -53797 -32118 -13455 -1094 -23998 -26935 -7571 27904 22518 2884 -8098
14708 -8098 -9890 -21828 -11310 -2886 -5386 -22344 -40635 -50006 -37113 -31321 -15978 -21419 -32733
14695 -32733 -21639 -35054 -33648 -45917 -52048 -40230 -17644 -535 -1287 10630 5190 -15287 -37272
14682 -37272 -39784 -22127 -19323 -8721 9000 968 -11267 -14803 -39988 -49429 -57501 -45408 -18032
14669 -18032 -15860 -32505 -44629 -55549 -47557 -49271 -24683 -7164 11569 -5284 12094 12372 31591
$$ packed form
14759f0878m530M2438K4657j1603q897J2404Q577p271m725J853L406j6201k2238
14746d3008N99j0250j003N887J5199O632K0745J5500O328k353k0933j3369l1963
14733e1989J7037L7270N43n878j3639K4479r626j5519k3060k110O617k1093n889
14720f2857L551N509K1679J8663J2361k2904k937J9364L5475n386j9634j0982
14708h098j792j1938J0518Q424k500j6958j8291r371J2893N792J5343n441j1314
14695c2733J1094j3415J406j2269o131J1818K2586J7109p52J1917n440k0477k1985
14682c7272k512J7657K804J0602J7721q032j2235l536k5185r441q072J2093K7376
14669a8032K172j6645j2124j0920P992j714K4588J7519J8733j6853J7378K78J9219
$$ plain form
14656 31591 29677 1032 -13153 -21405 -14642 -22876 -48546 -54936 -64591 -36764 -46868 -58444 -69433
14643 -69433 -70252 -56573 -41072 -21719 -10482 -8190 -24168 -29225 -33989 -28750 -3969 -5387 -18264
14630 -18264 -31768 -32154 -39926 -31640 -3050 -12409 -21682 1017 -1276 -13609 -2985 20998 34264
14617 34264 29364 11381 -5171 -10814 -31864 -69727 -54801 -37960 -19454 13269 12958 21895 30976
14604 30976 36828 8377 -5413 -21039 -31508 -23674 -38584 -15197 -6508 -12911 -23927 -2811
14592 -2811 -20225 -20669 -30738 -34928 -39741 -32752 -10335 -20864 -25593 -38279 -42652 -40552 -46366 -32549
14578 -32549 -30862 -42035 -61653 -41367 -21593 -17845 -11688 5919 25735 -1381 -21206 -28247
14566 -28247 -43099 -43578 -32342 -9572 -1852 -7015 -16997 -16470 -26044 -19190 -28064 -38461 -51610 -32193
$$ packed form
14656C1591j914k8645j4185q252O763q234k5670o390r655K7827j0104j1576j0989
14643f9433q19J3679J5501J9353J1237K292j5978n057m764N239K4781j418j2877
14630a8264j3504l86p772Q286K8590r359r273K2699k293j2333J0624K3983J3266
14617C4264m900j7983j6552n643k1050l7863J4926J6841J8506L2723l11Q937R081
14604C0976N852k8451j3790j5626j0469P834j4910K3387Q689o403j1016K1116
14592b811j7414m44j0069m190m813O989K2417j0529m729j2686m373K100n814J3817
14578c2549J687j1173j9618K0286J9774L748O157J7607J9816k7116j9825p041
14566b8247j4852m79J1236K2770P720n163r982N27r574O854q874j0397j3149J9417
$$ plain form
14552 -32193 -18269 -10524 6638 15773 7864 -17157 -35009 -48371 -39223 -21556 -34344 -21174
14540 -21174 -13426 2137 -25469 -77112 -70195 -22024 5838 23728 18428 23774 16493 12991 -1424
14527 -1424 31051 32488 15669 13204 5394 168 11016 -1663 -29757 -26690 -13982 -5088 -23155
14514 -23155 -32969 -37451 -31159 -17321 -18859 1548 12092 4036 15920 35426 20641 20512 27543
14501 27543 22720 42676 29430 20750 5118 -7067 12923 17328 21220 16600 51949 62182 55352
14488 55352 57533 64030 55921 63908 75693 81458 75412 84848 53878 24218 28365 32399 72125
14475 72125 88860 57989 31447 50517 73713 68926 62302 64880 56645 39942 28407 4811
14463 4811 -3311 15231 36342 38676 36444 9918 -242 3518 23843 36474 38350 31781 21059
$$ packed form
14552c2193J3924P745J7162R135p909k5021j7852j3362R148J7667j2788J3170
14540b1174P748J5563k7606n1643O917M8171K7862J7890n300N346p281l502j4415
14527a424L2475J437j6819k465p810n226J0848j2679k8094L067J2708Q894j8067
14514b3155r814m482O292J3838j538K0407J0544q056J1884J9506j4785j29P031
14501B7543m823J9956j3246q680j5632j2185J9990M405L892m620L5349J0233o830
14488E5352K181O497q109P987J1785N765o046R436l0970k9660M147M034L9726
14475G2125J6735l0871k6542J9070K3196m787o624K578q235j6703j1535k3596
14463D811q122J8542K1111K334k232k6526j0160L760K0325J2631J876o569j0722
$$ plain form
14450 21059 8000 -2350 14325 22758 37980 31608 2769 -22105 -49092 -41285 -37786 -28342 -18386
14437 -18386 -5349 -17707 22234 58697 46480 20992 16008 29897 36488 45995 24599 9084
14425 9084 16701 22449 25678 19303 16109 13669 13197 19594 27545 28762 35578 44002 30574 12477
14411 12477 19217 53664 49930 31400 32433 66686 66410 56801 67248 67439 59627 52798 56860 72941
14397 72941 53644 15081 2507 -12329 -789 3500 -9660 -17195 -17245 44300 37608 -11258 -22270
14384 -22270 -294 5281 15200 10671 -8968 -28689 -36693 -10760 14274 14192 19331 22900 23815 13259
14370 13259 8661 6222 25351 38903 41858 45930 56102 36744 18564 17880 20823 16544 6841
14357 6841 18340 14594 31295 75620 107092 85250 29644 -3455 15268 5599 -11923 9935
$$ packed form
14450B1059j3059j0350J6675Q433J5222o372k8839k4874k6987P807L499R444R956
14437a8386J3037j2358L9941L6463j2217k5488m984J3889O591R507k1396j5515
14425I084P617N748L229o375l194k440m72O397P951J217O816Q424j3428j8097
14411A2477O740L4447l734j8530J033L4253k76r609J0447J91p812o829M062J6081
14397G2941j9297l8563j2574j4836J1540M289j3160p535n0O1545o692m8866j1012
14384b2270K1976N575R919m529j9639j9721q004K5933K5034q2N139L569R15j0556
14370A3259m598k439J9129J3552K955M072J0172j9358j8180o84K943m279r703
14357F841J1499l746J6701M4325L1472k1842n5606l3099J8723r669j7522K1858
$$ plain form
14345 9935 26160 42044 65923 58941 24450 29854 33882 44411 25629 35097 39868 44664 30894
14332 30894 27518 27422 31571 35307 46063 37329 52926 90155 106951 111231 84570 75789 103537
14319 103537 120881 137288 178196 231022 271529 315914 362819 405239 450099 456956 437203 398922
14307 398922 405339 426865 431032 460409 468929 437001 418052 377269 310629 270512 261638 271330
14295 271330 228360 196584 194682 204088 214917 231006 217145 207426 190393 175402 147444 155377
14283 155377 151400 141626 161488 197122 220538 227295 216485 210833 171582 163180 192775 233139
14271 233139 225149 207720 183838 184064 156679 126774 136198 129055 117080 109654 109558 99520 91143
14258 91143 102905 82956 85076 56446 16649 9990 30065 60411 74347 61358 38325 52514
$$ packed form
14345I935J6225J5884K3879o982l4491N404M028J0529j8782R468M771M796j3770
14332C0894l376r6M149L736J0756q734J5597L7229J6796M280k6661q781K7748
14319A03537J7344J6407M0908N2826M0507M4385M6905M2420M4860O857j9753l8281
14307C98922O417K1526M167K9377Q520l1928j8949m0783o6640m0117q874R692
14295B71330m2970l1776j902R406J0829J6089j3861r719j7033j4991k7958P933
14283A55377l977r774J9862L5634K3416O757j0810n652l9251q402K9595M0364
14271B33139p990j7429k3882K26k7385k9905R424p143j1975p426r6j0038q377
14258I1143J1762j9949K120k8630l9797o659K0075L0346J3936j2989k3033J4189
$$ plain form
14246 52514 44398 47941 45208 42681 61110 62932 51964 52462 53497 53726 29693 10838 6641 24881
14232 24881 11443 12879 22593 37368 38921 43050 43544 48068 45214 41103 46100 33619 22999 28920
14218 28920 11509 13641 27624 16341 -25850 -42942 -29113 1304 7367 312 -28231 -52756
14206 -52756 -53010 -37282 -30497 8788 48675 75596 64359 23476 18905 17371 18631 17739 33329
14193 33329 38227 27678 12513 33922 62838 68401 75788 93616 75794 66435 73903 58903 57197
14180 57197 76309 111350 138382 132556 103526 103274 91620 87279 100654 96668 93638 126304 152631
14167 152631 152199 117206 103440 84071 69533 52008 38288 33681 46339 36066 4722 369
14155 369 8014 -10311 99 33027 58792 49301 27804 19575 30666 31646 19955 13854 31123
$$ packed form
14246E2514q116L543k733k527J8429J822j0968M98J035K29k4033j8855m197J8240
14232B4881j3438J436R714J4775J553M129M94M524k854m111M997j2481j0620N921
14218B8920j7411K132J3983j1283m2191j7092J3829L0417O063p055k8543k4525
14206e2756k54J5728O785L9285L9887K6921j1237m0883m571j534J260q92J5590
14193C3329M898j0549j5165K1409K8916N563P387J7828j7822r359P468j5000j706
14180E7197J9112L5041K7032n826k9030k52j1654m341J3375l986l030L2666K6327
14167A52631m32l4993j3766j9369j4538j7525j3720m607J2658j0273l1344m353
14155C69P645j8325J0410L2928K5765r491k1497q229J1091R80j1691o101J7269
$$ plain form
14142 31123 45725 57956 50564 51311 56549 30932 32698 29778 54309 67831 60300 66051 68425
14129 68425 51543 43392 50676 23444 9568 24319 26025 19531 35812 41830 43221 69829 97753
14116 97753 108108 109949 92546 77273 58889 82424 94074 93765 112824 133031 131649 126855 124761
14103 124761 102249 107929 111360 99171 70508 74944 69335 80410 83233 67273 47233 36101
14091 36101 39973 43801 39451 46732 35941 24433 31355 35293 26185 34719 43470 39381 30284 50079
14077 50079 63915 41972 35242 47989 80410 90700 87770 73095 79999 90837 78168 97592
14065 97592 120456 110020 71311 71869 79630 111552 115797 102843 103788 108467 100721 87656 74505
14052 74505 49418 44549 70015 89379 93013 78876 73467 91995 88386 56553 65163 82664 94393
$$ packed form
14142C1123J4602J2231p392P47N238k5617J766k920K4531J3522p531N751K374
14129F8425j6882q151P284k7232j3876J4751J706o494J6281O018J391K6608K7924
14116I7753J0355J841j7403j5273j8384K3535J1650l09J9059K0207j382m794k094
14103A24761k2512N680L431j2189k8663M436n609J1075K823j5960k0040j1132
14091C6101L872L828m350P281j0791j1508O922L938r108Q534Q751m089r097J9795
14077E0079J3836k1943o730J2747L2421J0290k930j4675O904J0838j2669J9424
14065I7592K2864j0436l8709N58P761L1922M245j2954R45M679p746j3065j3151
14052G4505k5087m869K5466J9364L634j4137n409J8528l609l1833Q610J7501J1729
$$ plain form
14039 94393 106795 101333 72914 83960 121601 134260 98333 106950 125652 126591 106551 146507
14027 146507 163621 171837 152264 167625 159478 142042 139273 161137 158263 136770 143572 152838 159307
14014 159307 186980 176333 145986 132353 138691 176638 202710 208613 193352 194885 200060 184592
14002 184592 190593 202421 227994 237193 241027 229468 243175 265913 284101 320996 334247 334018
13990 334018 329453 341405 316849 322932 313657 306058 312642 311969 264457 246729 269434 291119 293896
13977 293896 311868 334515 336368 326011 299642 271355 230639 243510 258710 269695 259818 254798
13965 254798 241716 234950 254933 284160 284273 310772 309456 289867 295929 332550 362863 381705
13953 381705 388712 396286 392294 433672 463549 482428 508223 552950 604877 624023 622884 611850
$$ packed form
14039I4393J2402n462k8419J1046L7641J2659l5927Q617J8702R39k0040L9956
14027A46507J7114Q216j9573J5361q147j7436k769K1864k874k1493O802R266O469
14014A59307K7673j0647l0347j3633O338L7947K6072N903j5261J533N175j5468
14002A84592O001J1828K5573R199L834j1559J3707K2738J8188L6895J3251k29
13990C34018m565J1952k4556O083r275p599O584o73m7512j7728K2705K1685K777
13977B93896J7972K2647J853j0357k6369k8287m0716J2871J5200J0985r877n020
13965B54798j3082o766J9983K9227J13K6499j316j9589O062L6621L0313J8842
13953C81705P007P574l992M1378K9877J8879K5795M4727N1927J9146j139j1034
$$ plain form
13941 611850 593688 604079 570479 569201 570346 543335 527113 541571 542606 545102 562681 541070
13929 541070 522358 542348 578484 573620 570159 575989 598872 641913 684376 699125 730926 759556
13917 759556 790579 820778 846382 889856 907329 945166 982889 1011517 1055523 1094650 1142830
13906 1142830 1195021 1283494 1401769 1481588 1582611 1671301 1764778 1890229 1982917 2048211 2153119
13895 2153119 2263953 2418318 2600136 2742283 2877713 2998584 3116456 3252230 3414163
13886 3414163 3606778 3835920 4126778 4440748 4776452 5184411 5676230 6275457 6998630
13877 6998630 7869961 8892023 10021867 11331504 12851399 14722007 17197151 20521199
13869 20521199 25066300 31212702 39523283 50551798 64365415 79312516 91511178
$$ packed form
13941F11850j8162J0391l3600j278J145k7011j6222J4458J035K496J7579k1611
13929E41070j8712J9990L6136m864l461N830K2883M3041M2463J4749L1801K8630
13917G59556L1023L0199K5604M3474J7473L7837L7723K8628M4006L9127M8180
13906A142830N2191Q8473J18275P9819J01023Q8690R3477J25451R2688O5294J04908
13895B153119J10834J54365J81818J42147J35430J20871J17872J35774J61933
13886C414163J92615K29142K90858L13970L35704M07959M91819N99227P23173
13877F998630Q71331J022062J129844J309637J519895J870608K475144L324048
13869B0521199M545101O146402Q310581J1028515J3813617J4947101J2198662
$$ plain form
13862 91511178 96239026 92596670 84962561 78874887 77497115 81327654 88626687 95183658
13854 95183658 95598507 87329791 73296448 58553712 46201821 36773888 29742267 24461951
13846 24461951 20439799 17347180 14939244 13057036 11585254 10397885 9328526 8318769
13838 8318769 7392259 6595817 5923980 5333352 4819736 4415425 4037437 3753775 3508742
13829 3508742 3281735 3060193 2874787 2696627 2540376 2403569 2262806 2146700 2018196
13820 2018196 1875631 1794591 1735407 1655111 1573514 1497094 1432830 1408012 1366769 1291539 1225658
13809 1225658 1180605 1142577 1126070 1076087 1027179 1001428 952715 905496 873145 862720 845320
13798 845320 818784 795752 794404 775822 739210 709727 686740 662566 660865 664262 634894 610922
$$ packed form
13862I1511178M727848l642356p634109o087674j377772L830539P299033O556971
13854I5183658M14849q268716j4033343j4742736j2351891r427933p031621n280316
13846B4461951m022152l092619k407936j882208j471782j187369j069359j009757
13838H318769r26510p96442o71837n90628n13616m04311l77988k83662k45033
13829C508742k27007k21542j85406j78160j56251j36807j40763j16106j28504
13820B018196j42565q1040n9184q0296q1597p6420o4264k4818m1243p5230o5881
13809A225658m5053l8028j6507m9983m8908k5751m8713m7219l2351j0425j7400
13798H45320k6536k3032j348j8582l6612k9483k2987k4174j701L397k9368k3972
$$ plain form
13786 610922 621810 614762 595127 590405 591038 608932 613584 609752 630093 626834 592222 567084 554523
13773 554523 544972 522994 504829 504719 487552 462552 426467 405235 388486 380690 388117 382883 367498
13760 367498 388678 385859 398558 372462 327053 323681 323855 321728 315588 310907 298672 279083 282579
13747 282579 281803 276842 290344 316753 324303 334411 343288 362451 380466 358642 329741 323222 298557
13734 298557 282296 287825 291902 326284 333094 323470 300692 239820 205876 208590 231046 218057
13722 218057 206139 211185 192478 183800 180383 168308 164293 172086 181710 180456 165977 145632 154641
13709 154641 176241 187954 181504 178118 172302 127435 137218 121968 95598 79596 106533 124450
13697 124450 120950 94447 103827 125886 134665 120837 133071 147266 127748 104212 108629 115975
$$ packed form
13786F10922J0888p048j9635m722O33J7894M652l832K0341l259l4612k5138j2561
13773E54523r551k1978j8165j10j7167k5000l6085k1232j6749p796P427n234j5385
13760C67498K1180k819J2699k6096m5409l372J74k127o140m681j2235j9589L496
13747B82579p76m961J3502K6409P550J0108Q877J9163J8015k1824k8901o519k4665
13734B98557j6261N529M077L4382O810r624k2778o0872l3944K714K2456j2989
13722B18057j1918N046j8707q678l417j2075m015P793R624j254j4479k0345R009
13709A54641K1600J1713o450l386n816m4867R783j5250k6370j6002K6937J7917
13697A24450l500k6503R380K2059Q779j3828J2234J4195j9518k3536M417P346
$$ plain form
13685 115975 125629 119680 111303 131878 141926 148624 143734 133204 125853 132899 141010 127675 107570
13672 107570 108944 127855 110264 122066 106766 91666 91190 104686 66102 34646 66782 69511
13660 69511 56245 42985 68191 51816 15719 22874 42017 45015 59378 72112 58512 59313
13648 59313 57047 62768 60758 63454 77704 66678 63323 76106 89481 88144 98749 101691 102586
13635 102586 114027 97651 85443 69017 62089 70934 54800 48695 50597 42734 51571 79494 99876
13622 99876 89497 97190 122697 118845 108302 104525 85731 64955 68332 79689 59325 56297 47139
13609 47139 42067 55830 46440 23675 30945 34017 50032 54210 33196 44033 70118 82274 72180
13596 72180 79508 69468 47537 82666 109550 65423 49755 40642 38855 23988 11448 15868
$$ packed form
13685A15975R654n949q377K0575J0048O698m890j0530p351P046Q111j3335k0105
13672A07570J374J8911j7591J1802j5300j5100m76J3496l8584l1456L2136K729
13660F9511j3266j3260K5206j6375l6097P155J9143K998J4363J2734j3600Q01
13648E9313k266N721k010K696J4250j1026l355J2783J3375j337J0605K942Q95
13635A02586J1441j6376j2208j6426o928Q845j6134o105J902p863Q837K7923K0382
13622I9876j0379P693K5507l852j0543l777j8794k0776L377J1357k0364l028r158
13609D7139n072J3763r390k2765P270L072J6015M178k1014J0837K6085J2156j0094
13596G2180P328j0040k1931L5129K6884m4127j5668r113j787j4867j2540M420
$$ plain form
13584 15868 44503 64712 75769 69736 95343 125228 163967 229012 321852 460143 564271
13573 564271 574550 461896 334609 242046 194562 150396 111554 114875 94654 62657 67102
13562 67102 86576 92836 95976 82226 84183 101409 131571 131817 101939 101191 105903 122311 154471
13549 154471 178693 201021 225227 286955 386147 551568 801689 1051220 1127293 942574 651564
13538 651564 417960 290132 233942 191188 177935 162412 143104 152325 135551 132219 122143
13527 122143 112796 120079 137733 133670 117172 109154 114335 111834 94716 94112 131934 123116 137945
13514 137945 183342 238760 306419 441001 603076 652887 557622 427235 298842 206008 152178
13503 152178 131775 130715 76130 67823 80459 83421 73897 83746 98993 59281 30934 39178 49649
$$ packed form
13584A5868K8635K0209J1057o033K5607K9885L8739O5045R2840J38291J04128
13573E64271J0279j12654j27287r2563m7484m4166l8842L321k0221l1997M445
13562F7102J9474O260L140j3750J957J7226L0162K46k9878p48M712J6408L2160
13549A54471K4222K2328K4206O1728R9192J65421K50121K49531P6073j84719k91010
13538F51564k33604j27828n6190m2754j3253j5523j9308R221j6774l332j0076
13527A22143r347P283J7654m063j6498q018N181k501j7118o04L7822q818J4829
13514A37945M5397N5418O7659J34582J62075M9811r5265j30387j28393r2834n3830
13503A52178k0403j060n4585q307J2636K962r524R849J5247l9712k8347Q244J0471
$$ plain form
13490 49649 16489 14186 31800 63280 80427 93339 94655 69430 59665 43803 12497 14463
13478 14463 12129 26787 24001 21711 26405 45311 71974 80802 71241 69227 97256 109047 90928
13465 90928 85166 95044 98879 93826 89332 129117 125916 120560 129949 123550 126361 95477 117757 142809
13451 142809 148150 112320 83414 102096 122182 117094 121236 171676 188109 207117 216610 241874
13439 241874 248934 249478 249871 237908 199486 179049 176083 176250 143296 112932 105905 125340 127911
13426 127911 103831 85148 62694 89378 92545 91631 80689 80657 86440 108555 119155 127453 131343
13413 131343 165136 190127 244940 305712 354689 404150 478552 496698 489914 499222 481340 459660
13401 459660 460559 467674 472561 467535 457921 436017 388012 322254 286003 259617 199744 172153 149690
$$ packed form
13490D9649l3160k303J7614L1480J7147J2912J316k5225r765j5862l1306J966
13478A4463k334J4658k786k290M694J8906K6663Q828r561k014K8029J1791j8119
13465I0928n762R878L835n053m494L9785l201n356R389o399K811l0884K2280K5052
13451A42809N341l5830k8906J8682K0086n088M142N0440J6433J9008R493K5264
13439B41874P060N44L93j1963l8422k0437k966J67l2954l0364p027J9435K571
13426A27911k4080j8683k2454K6684L167r14j0942l2N783K2115J0600Q298L890
13413A31343L3793K4991N4813O0772M8977M9461P4402J8146o784R308j7882k1680
13401D59660Q99P115M887n026r614k1904m8005o5758l6251k6386n9873k7591k2463
$$ plain form
13388 149690 122042 101450 100103 87390 83001 68797 61602 44315 32182 28840 38636 54219
13376 54219 60578 50877 42641 37941 40788 48843 54959 24952 33387 67237 67639 82308 57988 22950
13362 22950 10620 39194 46416 46815 33720 6659 15033 30808 13765 12583 -17273 -33610 -25269
13349 -25269 -5237 -1056 -5043 4757 23042 33346 23906 32183 54574 59789 17387 -6909 22016
13336 22016 29241 23512 -2114 8747 7693 -15144 -22402 -26379 -10116 -82 20312 27658 16697
13323 16697 32057 35352 22173 -12022 -39045 -38950 -22826 16771 40717 65136 46890 42732 33991
13310 33991 39926 44500 9114 -16044 3106 17616 -10573 -22429 -13462 -5021 -235 -3168 -2555
13297 -2555 12059 17930 12468 -19730 -37695 -17747 12793 22927 35861 35348 26716 23223 25105
$$ packed form
13388A49690k7648k0592j347j2713m389j4204p195j7287j2133l342R796J5583
13376E4219O359r701q236m700K847Q055O116l0007Q435L3850M02J4669k4320l5038
13362B2950j2330K8574P222L99j3095k7061Q374J5775j7043j182k9856j6337Q341
13349b5269K0032M181l987R800J8285J0304r440Q277K2391N215m2402k4296K8925
13336B2016P225n729k5626J0861j054k2837p258l977J6263J0034K0394P346j0961
13323A6697J5360L295j3179l4195k7023R5J6124L9597K3946K4419j8246m158q741
13310C3991N935M574l5386k5158J9150J4510k8189j1856Q967Q441M786k933O13
13297b555J4614N871n462l2198j7965J9948L0540J0134J2934n13q632l493J882
$$ plain form
13284 25105 28127 23074 16207 19973 17315 9449 6008 18356 30135 9769 1418 -4871 10231
13271 10231 13596 -11197 1539 9399 21250 35148 49889 57628 55199 49875 28182 17568 24586
13258 24586 38112 49594 33496 9847 -3159 -31641 -37066 -37695 -15239 -22004 -20321 -7337 -3266
13245 -3266 -10213 -22241 -18224 -19718 -19317 -26923 -4189 34262 51329 37905 28735 24960 9482
13232 9482 16907 28381 9031 1069 22137 10639 6296 12499 17813 -5800 11004 43461 58842
13219 58842 41993 13875 13584 33463 1659 -4393 15710 16160 -3219 -16375 -9503 11850 7659
13206 7659 2390 -15402 -16920 -943 10468 28120 30441 21088 20744 -3825 -889 31427 41359
13193 41359 57638 68522 79703 92979 72480 51025 61548 54090 40978 42162 49126 16477
$$ packed form
13284B5105L022n053o867L766k658p866l441J2348J1779k0366q351o289J5102
13271A0231L365k4793J2736P860J1851J3898J4741P739k429n324k1693j0614P018
13258B4586J3526J1482j6098k3649j3006k8482n425o29K2456o765J683J2984M071
13245c266o947j2028M017j494M01p606K2734L8451J7067j3424r170l775j5478
13232I482P425J1474j9350p962K1068j1498m343O203N314k3613J6804L2457J5381
13219E8842j6849k8118k91J9879l1804o052K0103M50j9379j3156O872K1353m191
13206G659n269j7792j518J5977J1411J7652K321r353l44k4569K936L2316R932
13193D1359J6279J0884J1181J3276k0499k1455J0523p458j3112J184O964l2649
$$ plain form
13181 16477 23514 35436 26877 25646 30298 29970 21164 21200 31378 28784 19931 1376 6026 7868
13167 7868 24974 33199 43444 64775 69483 65060 80027 114089 125885 129023 119961 103803 101778
13154 101778 103507 120962 102027 71036 72371 71937 42745 48902 77249 110051 113046 113161 95152
13141 95152 104363 102181 71432 62050 60264 44741 55140 58420 36119 39487 47291 58626 75327
13128 75327 64962 34871 26670 31717 47525 72844 78642 48478 24208 18946 44176 48505 32691
13115 32691 50514 60745 62260 67933 66622 61920 59885 25884 32487 61770 92290 118443 130744
13102 130744 150982 158568 134476 123065 122811 138042 125330 117176 110362 91991 73476 72964 60793
13089 60793 33789 31787 19588 27420 41036 48728 48009 27990 14693 29680 42442 30667 61373
$$ packed form
13181A6477P037J1922q559j231M652l28q806L6J0178k594q853j8555M650J842
13167G868J7106Q225J0245K1331M708m423J4967L4062J1796L138r062j6158k025
13154A01778J729J7455j8935l0991J335m34k9192O157K8347L2802K995J15j8009
13141I5152R211k182l0749r382j786j5523J0399L280k2301L368P804J1335J6701
13128G5327j0365l0091q201N047J5808K5319N798l0164k4270n262K5230M329j5814
13115C2691J7823J0231J515N673j311m702k035l4001O603K9283L0520K6153J2301
13102A30744K0238P586k4092j1411k54J5231j2712q154o814j8371j8515n12j2171
13089F0793k7004k002j2199P832J3616P692p19k0019j3297J4987J2762j1775L0706
$$ plain form
13076 61373 76975 76670 64813 67291 85283 74470 64490 49277 37663 60540 56417 55301 54590
13063 54590 28617 18708 3013 -2196 23329 31041 37617 31523 39215 25673 20886 44756 68287
13050 68287 59286 42709 21397 21593 18407 -6944 -10115 17698 45174 38545 14043 12902 3233
13037 3233 -6144 10404 6156 18835 24666 4224 27559 63663 69569 32388 15204 19003 9919
13024 9919 17734 58227 68424 43871 49661 65950 56909 31168 49501 66213 67688 35715 -6412
13011 -6412 -6953 -5184 4235 13821 -1214 -10767 10235 29959 35577 36642 35871 37588 17221 35817
12997 35817 45097 53676 64087 62986 46730 62620 70278 61885 45174 56122 58561 46961 32341
12984 32341 21308 7517 -16063 11259 -5613 4053 29746 19930 1156 13413 19438 34134
$$ packed form
13076F1373J5602l05j1857K478J7992j0813r980j5213j1614K2877m123j116p11
13063E4590k5973r909j5695n209K5525P712O576o094P692j3542m787K3870K3531
13050F8287r001j6577k1312J96l186k5351l171K7813K7476o629k4502j141r669
13037C233r377J6548m248J2679N831k0442K3335L6104N906l7181j7184L799r084
13024I919P815M0493J0197k4553N790J6289r041k5741J8333J6712J475l1973m2127
13011f412n41J769R419R586j5035r553K1002J9724N618J065p71J717k0367J8596
12997C5817R280Q579J0411j101j6256J5890P658q393j6711J0948K439j1600j4620
12984C2341j1033j3791k3580K7322j6872R666K5693r816j8774J2257O025J4696
$$ plain form
12972 34134 55308 59986 48060 42547 49310 33500 15807 35593 61712 63917 40973 42717 31482
12959 31482 45662 86434 98700 92076 71543 73535 46991 36137 31864 919 -3503 28842
12947 28842 51811 52641 16140 -8224 -2294 25809 24806 35007 46745 36099 15888 31766
12935 31766 45634 33321 19501 30336 48403 55234 39647 28536 -9554 2460 30236 27235
12923 27235 18187 3394 6857 22922 29147 -6684 1830 35981 34765 25641 65040 58346 56546
12910 56546 65296 51206 44667 61191 61622 39777 41134 85502 80825 67760 87745 91887 70610
12897 70610 54406 22378 -2213 -8675 11661 14019 15054 6015 22872 24326 31515 35713 58956
12884 58956 59748 81093 96457 68332 44763 29293 30580 28759 10769 -5525 17480 42214
$$ packed form
12972C4134K1174M678j1926n513O763j5810j7693J9786K6119K205k2944J744j1235
12959C1482J4180M0772J2266o624k0533J992k6544j0854m273l0945m422L2345
12947B8842K2969Q30l6501k4364N930K8103j003J0201J1738j0646k0211J5878
12935C1766J3868j2313j3820J0835J8067O831j5587j1111l8090J2014K7776l001
12923B7235r048j4793L463J6065O225l5831Q514L4151j216r124L9399o694j800
12910E6546Q750j4090o539J6524M31k1845J357M4368m677j3065J9985M142k1277
12897G0610j6204l2028k4591o462K0336K358J035r039J6857J454P189M198K3243
12884E8956P92K1345J5364k8125k3569j5470J287j821j7990j6294K3005K4734
$$ plain form
12872 42214 46318 36682 44699 53772 58032 52995 38621 32342 17369 17161 -584 -1576 1773 -17784
12858 -17784 -1425 24650 29645 20862 43055 73353 83830 82787 62095 75503 96226 100973
12846 100973 51012 29379 27794 41626 51917 63246 88162 110639 58299 -662 11313 20188
12834 20188 12750 27658 46439 36223 27411 25933 41426 44494 51151 36856 30743 29632 18892
12821 18892 13233 22569 22526 20019 10179 19164 26181 10314 24269 13435 7540 41091 74315 74989
12807 74989 56742 57325 49756 58176 73316 71412 72335 64495 59683 71341 77359 49080 45870 50566
12793 50566 57306 60176 69193 93775 94472 67545 60827 53805 23433 5384 14558 2464 -3617
12780 -3617 -5175 -6152 2877 7024 -2065 -12044 -10563 -4833 -8418 15422 -576 -10436 -1554 14656
$$ packed form
12872D2214M104r636Q017R073M260n037j4374o279j4973k08j7745r92L349j9557
12858a7784J6359K6075M995q783K2193L0298J0477j043k0692J3408K0723M747
12846A00973m9961k1633j585J3832J0291J1329K4916K2477n2340n8961J1975Q875
12834B0188p438J4908J8781j0216q812j478J5493L068O657j4295o113j111j0740
12821A8892n659R336m3k507r840Q985P017j5867J3955j0834n895L3551L3224O74
12807G4989j8247N83p569Q420J5140j904R23p840m812J1658O018k8279l210M696
12793E0566O740K870R017K4582O97k6927o718p022l0372j8049R174j2094o081
12780c617j558r77R029M147r089r979J481N730l585K3840j5998r860Q882J6210
$$ plain form
12766 14656 20756 38889 56841 71523 67976 37209 33541 34780 60496 59851 59000 61401 26247
12753 26247 18938 27449 13492 10670 19711 31931 23346 17183 9842 25544 14324 -199 7107
12740 7107 23392 16606 14989 5572 28744 54701 102076 107676 132018 162523 189858 225557 286535
12727 286535 308957 331381 323419 258304 189491 147741 135346 140921 116692 110259 140094 105154
12715 105154 54598 63082 40926 35607 25502 15356 19977 19225 8886 1118 16187 5395 28758
12702 28758 35295 40336 64390 58741 50328 22279 -8609 -17855 11236 8604 2328 6488 34772
12689 34772 57046 50819 49214 21975 14093 7896 18479 32563 22375 1724 12984 26327
12677 26327 21565 -3482 5836 13205 249 -15646 -11178 -20762 -9516 1474 -13463 -5869 4729
$$ packed form
12766A4656O100J8133J7952J4682l547l0767l668J239K5716o45q51K401l5154
12753B6247p309Q511j3957k822R041J2220q585o163p341J5702j1220j4523P306
12740G107J6285o786j617r417K3172K5957M7375N600K4342L0505K7335L5699O0978
12727B86535K2422K2424p962o5115o8813m1750j2395N575k4229o433K9835l4940
12715A05154n0556Q484k2156n319j0105j0146M621p52j0339p768J5069j0792K3363
12702B8758O537N041K4054n649q413k8049l0888r246K9091k632o276M160K8284
12689C4772K2274o227j605k7239p882o197J0583J4084j0188k0651J1260J3343
12677B6327m762k5047R318P369j2956j5895M468r584J1246J0990j4937P594J0598
$$ plain form
12664 4729 1444 15314 43473 37576 29194 28284 21995 25017 13453 39181 29806 20582 35116 35429
12650 35429 43126 48644 23025 26189 42328 67162 57159 51523 63572 75562 53390 60403 62780
12637 62780 32558 10951 26877 40146 32538 14363 11778 40973 42363 45643 41202 23900 24223
12624 24223 46694 96258 99322 87308 99005 108885 104546 143159 150215 114698 133214 142333 155773
12611 155773 159401 144210 138239 121852 116121 105335 77569 75067 89456 127936 137164 149376
12599 149376 131074 135913 151123 170455 226903 268062 289725 275086 235114 194746 149999 133057
12587 133057 127961 137664 164331 176857 188412 213530 253986 267279 312144 367686 391330 458553
12575 458553 580667 710065 853677 1031231 1203542 1258079 1189915 1045143 902248 775273
$$ packed form
12664D729l285J3870K8159n897q382r10o289L022j1564K5728r375r224J4534L13
12650C5429P697N518k5619L164J6139K4834j0003n636J2049J1990k2172P013K377
12637F2780l0222k1607J5926J3269p608j8175k585K9195J390L280m441j7302L23
12624B4223K2471M9564L064j2014J1697R880m339L8613P056l5517J8516R119J3440
12611A55773L628j5191n971j6387n731j0786k7766k502J4389L8480R228J2212
12599A49376j8302M839J5210J9332N6448M1159K1663j4639l9972m0368m4747j6942
12587A33057n096R703K6667J2526J1555K5118M0456J3293M4865N5542K3644O7223
12575D58553J22114J29398J43612J77554J72311N4537o8164j44772j42895j26975
$$ plain form
12565 775273 664887 558892 469609 404948 349498 298947 276125 240454 187129 171029 184543
12554 184543 190571 197206 193205 198389 192357 199230 207467 207424 224761 201478 200443 225429 253341 234765
12540 234765 215399 233462 259220 314224 332747 367570 373008 372925 365419 369381 371622 352561 319172
12527 319172 289576 273483 281080 270321 244518 253911 263600 273423 263556 264228 249061 211092 198873
12514 198873 220274 208854 178581 156965 133961 127253 125625 144599 152789 136488 135873 149274
12502 149274 144913 134718 130938 111931 100916 126349 156263 169523 148988 131808 155590 180701
12490 180701 172714 159527 155978 148514 158850 181988 185754 198462 205345 220541 220752 202038 197135
12477 197135 179286 152036 151766 183020 222642 267642 313599 341375 302054 267101 231160 196419
$$ packed form
12565G75273j10386j05995q9283o4661n5450n0551k2822l5671n3325j6100J3514
12554A84543O028O635m001N184o032O873Q237m3J7337k3283j035K4986K7912j8576
12540B34765j9366J8063K5758N5004J8523L4823N438q3p506L962K241j9061l3389
12527C19172k9596j6093P597j0759k5803R393R689R823r867O72j5167l7969j2219
12514A98873K1401j1420l0273k1616k3004o708j628J8974Q190j6301o15J3401
12502A49274m361j0195l780j9007j1015K5433K9914J3260k0535j7180K3782K5111
12490A80701p987j3187l549p464J0336K3138L766J2708O883J5196K11j8714m903
12477A97135j7849k7250k70L1254L9622M5000M5957K7776l9321l4953l5941l4741
$$ plain form
12465 196419 193383 169295 145725 156120 155121 179250 171855 164863 163383 143254 133737 129287 129011
12452 129011 121324 124058 145579 144550 120123 116050 132123 149545 169446 171456 190379 220232
12440 220232 253227 290625 304133 321967 402073 524793 739819 1036671 1381575 1744332
12430 1744332 1904839 1677223 1283071 959083 739854 579115 484824 436338 411345 404437
12420 404437 441599 497648 569984 640657 718206 764385 704422 599398 485730 407543 357279
12409 357279 321908 325795 339836 330685 329000 337496 338640 338989 365621 416186 471309 541927 606167
12396 606167 649446 684464 744470 801189 825457 840526 869524 943809 1057513 1128808 1132937
12385 1132937 1010924 841898 693993 598579 524406 467600 435680 422891 395538 368562 354839
$$ packed form
12465A96419l036k4088k3570J0395r99K4129p395o992j480k0129r517m450k76
12452A29011p687K734K1521j029k4427m073J6073J7422J9901K010J8923K9853
12440B20232L2995L7398J3508J7834Q0106J22720K15026K96852L44904L62757
12430A744332J60507k27616l94152l23988k19229j60739r4291m8486k4993o908
12420D04437L7162N6049P2336P0673P7549M6179n9963j05024j13668p8187n0264
12409C57279l5371L887J4041r151j685Q496J144L49K6632N0565N5123P0618O4240
12396F06167M3279L5018O0006N6719K4268J5069K8998P4285J13704P1295M129
12385A132937j22013j69026j47905r5414p4173n6806l1920j2789k7353k6976j3723
$$ plain form
12374 354839 340896 316947 293784 266679 231255 207885 200221 196702 186980 168913 194267 221344
12362 221344 222498 243213 238100 210078 152204 132083 114886 116359 100521 99248 123152 132367
12350 132367 104342 62675 58079 106452 132015 113083 106124 115476 127423 133750 122280 125255
12338 125255 118198 102862 89186 108150 94535 94896 119577 111149 96941 98194 101370 118269 122704
12325 122704 125315 148054 130794 127503 111853 80547 84297 71142 95047 130416 128435 99695
12313 99695 100980 103543 101519 105355 82122 77109 92327 117623 114705 114169 111624 125422 122316 102402
12299 102402 82885 88949 105127 109708 100161 104258 85566 73777 74551 60041 70000 77458 71162
12286 71162 83063 95961 98168 99842 111744 159223 175126 196936 177447 198985 187236 155912
$$ packed form
12374C54839j3943k3949k3163k7105l5424k3370p664l519r722j8067K5354K7077
12362B21344J154K0715n113k8022n7874k0121j7197J473j5838j273K3904R215
12350A32367k8025m1667m596M8373K5563j8932o959R352J1947O327j1470K975
12338A25255p057j5336j3676J8964j3615L61K4681q428j4208J253L176J6899M435
12325A22704K611K2739j7260l291j5650l1306L750j3155K3905L5369j981k8740
12313I9695J285K563k024L836k3233n013J5218K5296k918n36k545J3798l106j9914
12299A02402j9517O064J6178M581r547M097j8692j1789P74j4510R959P458o296
12286G1162J1901J2898K207J674J1902M7479J5903K1810j9489K1538j1749l1324
$$ plain form
12274 155912 139429 139147 178892 205491 197249 180221 184990 170110 161051 175621 197021 203367 197129
12261 197129 193961 181972 185760 202727 194441 195923 197999 172702 180286 207894 251704 261888 236219
12248 236219 238968 254268 291339 292915 277413 296101 319978 365541 415424 476692 484632 441400
12236 441400 384635 353506 315066 255466 191849 187627 167164 146537 143347 177701 203393 210336
12224 210336 218781 232738 213478 212427 221387 216821 195796 161410 147575 194173 231464 241404
12212 241404 251169 260497 264065 266279 274420 270160 262771 271517 251305 223501 205338 206559 190410
12199 190410 197854 203393 206811 210661 227907 273499 285854 301805 326214 362931 416088 473040
12187 473040 528027 554908 597457 597888 583468 591468 593516 571021 530143 518311 482382 479891
$$ packed form
12274A55912j6483k82L9745K6599q242j7028M769j4880r059J4570K1400O346o238
12261A97129l168j1989L788J6967q286J482K076k5297P584K7608M3810J0184k5669
12248B36219K749J5300L7071J576j5502J8688K3877M5563M9883O1268P940m3232
12236D41400n6765l1129l8440n9600o3617m222k0463k0627l190L4354K5692O943
12224B10336Q445J3957j9260j051Q960m566k1025l4386j3835M6598L7291R940
12212B41404R765R328L568K214Q141m260p389Q746k0212k7804j8163J221j6149
12199A90410P444N539L418L850J7246M5592J2355J5951K4409L6717N3157N6952
12187D73040N4987K6881M2549M31j4420Q000K048k2495m0878j1832l5929k491
$$ plain form
12175 479891 512602 508671 496072 492852 492481 493181 504640 521049 547510 562444 625740 691685 774332
12162 774332 873166 997113 1112220 1256518 1425252 1533443 1474806 1234438 1027917 879496
12152 879496 756648 654655 589612 540815 491108 421452 414787 403118 350275 310325 276633
12141 276633 255763 254886 238170 265609 319948 346077 361714 330874 297906 280872 294618 315166
12129 315166 359579 391711 419755 494396 582307 580770 525478 505136 522619 506839 532604 574841
12117 574841 637399 770605 915590 1096399 1214264 1144304 920454 735356 611090 545844
12107 545844 507208 479229 447301 397473 376795 339004 305167 285453 297878 307489 349432 374888
12095 374888 361931 348890 355938 358076 387114 404092 392391 386494 441848 475740 505584 575174
$$ packed form
12175D79891L2711l931j2599l220l71P00J1459J6409K6461J4934O3296O5945Q2647
12162G74332R8834J23947J15107J44298J68734J08191n8637k40368k06521j48421
12152H79496j22848j01993o5043m8797m9707o9656o665j1669n2843l9950l3692
12141B76633k0870q77j6716K7439N4339K6129J5637l0840l2968j7034J3746K0548
12129C15166M4413L2132K8044P4641Q7911j537n5292k0342J7483j5780K5765M2237
12117E74841O2558J33206J44985J80809J17865o9960k23850j85098j24266o5246
12107E45844l8636k7979l1928m9828k0678l7791l3837j9714J2425R611M1943K5456
12095C74888j2957j3041P048K138K9038J6978j1701n897N5354L3892K9844O9590
$$ plain form
12083 575174 714798 917333 1124466 1219380 1105359 918359 822756 799172 797115 858519 981196
12072 981196 1153892 1362958 1518631 1656617 1724664 1571202 1320318 1114924 1003315 960810
12062 960810 962698 960973 939057 940529 919333 894286 886624 827413 817183 857648 898190 932995
12050 932995 1031409 1121499 1190852 1267844 1330770 1367436 1388455 1398062 1422372 1451271 1493321 1542257
12038 1542257 1687061 1910758 2049556 2013538 1873286 1788558 1761484 1784793 1793942 1846883 1948599
12027 1948599 2107982 2303675 2519699 2754619 2939715 2950313 2885787 2905720 2962443 3123423
12017 3123423 3323607 3591423 3828819 3945199 4023019 4204780 4480512 4872225 5363741 6022245
12007 6022245 6833616 7798328 8891350 10014293 10858598 11371549 11873709 12668197 13865716
$$ packed form
12083E75174J39624K02535K07133R4914j14021j87000r5603k3584k057O1404J22677
12072I81196J72696K09066J55673J37986O8047j53462k50884k05394j11609m2505
12062I60810J888j725k1916J472k1196k5047p662n9211j0230M0465M0542L4805
12050I32995R8414R0090O9353P6992O2926L6666K1019R607K4310K8899M2050M8936
12038A542257J44804K23697J38798l6018j40252q4728k7074K3309R149N2941J01716
12027A948599J59383J95693K16024K34920J85096J0598o4526J9933N6723J60980
12017C123423K00184K67816K37396J16380P7820J81761K75732L91713M91516O58504
12007F022245Q11371R64712J093022J122943Q44305N12951N02160P94488J197519
$$ plain form
11998 13865716 15570077 17869526 20946643 25142844 30858671 38945618 50940118 69221282
11990 69221282 97854855 142961718 210411640 295533670 359180114 339083565 253985126
11983 253985126 173036758 118671938 84733009 63109850 48684752 38626913 31370135
11976 31370135 26028572 22081457 19102214 16801310 15098574 13810340 12836914 11905818
11968 11905818 10870062 9792113 8834215 8061277 7498238 7077193 6784430 6616784 6531637
11959 6531637 6592427 6671881 6617661 6358326 6060852 5812092 5622974 5581433 5640648 5758106
11949 5758106 5872577 6016963 6238529 6579553 7008821 7623750 8427781 9415355 10610730
11940 10610730 12159982 14233497 16929936 20581991 25707423 33189065 44373925 61442553
$$ packed form
11998A3865716J704361K299449L077117M196201N715827Q086947J1994500J8281164
11990F9221282K8633573M5106863O7449922Q5122030O3646444k0096549q5098439
11983B53985126q0948368n4364820l3938929k1623159j4425098j0057839p256778
11976C1370135n341563l947115k979243k300904j702736j288234r73426r31096
11968A1905818j035756j077949r57898p72938n63039m21045k92763j67646q5147
11959F531637O0790P9454n4220k59335k97474k48760j89118m1541N9215J17458
11949E758106J14471J44386K21566L41024M29268O14929Q04031R87574J195375
11940A0610730J549252K073515K696439L652055N125432P481642J1184860J7068628
$$ plain form
11932 61442553 87269822 123680016 165287706 189704486 172883925 130628152 92094052
11925 92094052 65520569 48255583 36793888 28882403 23223728 19054194 15959439 13548071
11917 13548071 11666878 10180792 9026250 8121714 7333578 6622796 6012292 5501842 5081094
11908 5081094 4724186 4438569 4183277 3983141 3836333 3721302 3590581 3502606 3418125 3310045
11898 3310045 3245387 3191422 3132807 3141899 3188757 3222962 3209175 3165678 3047461 2882153 2728597
11887 2728597 2551025 2323156 2156374 2034559 1931702 1831923 1783064 1760030 1706702 1627153
11877 1627153 1549481 1483184 1470873 1442989 1373756 1310894 1296048 1259718 1260165 1231153 1233256 1251786
11865 1251786 1279499 1357675 1427402 1490779 1511398 1461703 1348221 1168601 1008426 938124 904485
$$ packed form
11932F1442553K5827269L6410194M1607690K4416780j6820561m2255773l8534100
11925I2094052k6573483j7264986j1461695p911485n658675m169534l094755k411368
11917A3548071j881193j486086j154542r04536p88136p10782o10504n10450m20748
11908E081094l56908k85617k55292k00136j46808j15031j30721q7975q4481j08080
11898C310045o4658n3965n8615R092M6858L4205j3787m3497j18217j65308j53556
11887B728597j77572k27869j66782j21815j02857r9779m8859k3034n3328p9549
11877A627153p7672o6297j2311k7884o9233o2862j4846l6330M47k9012K103J8530
11865A251786K7713P8176O9727O3377K0619m9695j13482j79620j60175p0302l3639
$$ plain form
11854 904485 889278 867965 866664 873285 880968 875051 846683 849967 853817 806384 766740 765077 772211
11841 772211 765744 763842 758944 755287 758785 726360 702825 711004 722219 727071 720694 737016 713739
11828 713739 653018 608295 602574 593457 597604 607311 589642 564387 576010 612877 625860 650997
11816 650997 650342 633675 621818 654301 671939 700489 705850 726339 790728 854031 960810 1110247
11804 1110247 1258298 1351365 1337374 1207644 1055586 942553 867414 788314 740155 704211
11794 704211 647335 576509 554549 596166 643565 669364 706710 752542 763974 728667 684519
11783 684519 628481 555881 528658 529074 530902 561899 593955 683597 779840 899874 1025882 1142638
11771 1142638 1119925 967307 811336 714343 628527 559095 531038 499110 496420 499254 487444
$$ packed form
11854I04485j5207k1313j301O621P683n917k8368L284L850m7433l9644j663P134
11841G72211o467j902m898l657L498l2425k3535Q179J1215M852o377J6322k3277
11828G13739o0721m4723n721r117M147R707j7669k5255J1623L6867J2983K5137
11816F50997o55j6667j1857L2483J7638K8550N361K0489O4389O3303J06779J49437
11804A110247J48051R3067j3991j29730j52058j13033p5139p9100m8159l5944
11794G04211n6876p0826k1960M1617M7399K5799L7346M5832J1432l5307m4148
11783F84519n6038p2600k7223M16J828L0997L2056Q9642R6243J20034J26008J16756
11771A142638k2713j52618j55971r6993q5816o9432k8057l1928k690K834j1810
$$ plain form
11760 487444 487979 504979 519447 505405 522944 525650 517160 544119 597438 626178 642031 665809
11748 665809 682048 730420 799683 855899 905417 974967 1020670 1000095 904595 809250 758748
11737 758748 724586 721602 730384 715525 681400 648711 632532 587670 585746 570190 555441 568449
11725 568449 582768 604785 615188 592854 577292 574089 548911 519776 484585 444942 392896 375049
11713 375049 394998 390806 396224 387398 371323 353726 335023 312713 310536 321108 335486 320670
11701 320670 322239 340945 370583 383669 396807 429352 454921 469674 461637 444993 460395 509164
11689 509164 530167 538769 535730 555731 595810 616360 665476 736987 829108 935820 1101879
11678 1101879 1342860 1578431 1686589 1607281 1391806 1172397 999966 857285 746702 681636
$$ packed form
11760D87444N35J7000J4468j4042J7539K706q490K6959N3319K8740J5853K3778
11748F65809J6239M8372O9263N6216M9518O9550M5703k0575r5500r5345n0502
11737G58748l4162k984Q782j4859l4125l2689j6179m4862j924j5556j4749J3008
11725E68449J4319K2017J0403k2334j5562l203k5178k9135l5191l9643n2046j7847
11713C75049J9949m192N418q826j6075j7597j8703k2310k177J0572J4378j4816
11701C20670J569J8706K9638J3086J3138L2545K5569J4753q037j6644J5402M8769
11689E09164K1003Q602l039K0001M0079K0550M9116P1511R2121J06712J66059
11678A101879K40981K35571J08158p9308k15475k19409j72431j42681j10583o5066
$$ plain form
11668 681636 650955 628588 581330 494882 472892 505551 553206 590337 576755 526184 463068
11657 463068 423784 414221 376164 362404 357290 356600 341405 340469 352167 344712 364872 378866 371662
11644 371662 362639 355200 363860 347499 329652 345697 352335 356595 360979 357723 391792 425448 452909
11631 452909 492937 540003 572976 645250 663665 617532 552155 498205 438930 414194 419079 400169
11619 400169 397721 396002 380250 392046 378014 372517 391139 395815 381934 376236 380265 372215 355386
11606 355386 333892 295013 264347 248337 235303 246425 274144 280524 246568 214206 197849 189907
11594 189907 174223 166695 170499 199317 208889 225260 227691 218412 233362 242726 281981 311557 333347
11581 333347 313098 305150 301676 260818 227981 216504 231477 258354 276320 280854 309794 308912
$$ packed form
11668F81636l0681k2367m7258q6448k1990L2659M7655L7131j3582n0571o3116
11657D63068l9284r563l8057j3760n114o90j5195r36J1698p455K0160J3994p204
11644C71662r023p439Q660j6361j7847J6045O638M260M384l256L4069L3656K7461
11631D52909M0028M7066L2973P2274J8415m6133o5377n3950n9275k4736M885j8910
11619D00169k448j719j5752J1796j4032n497J8622M676j3881n698M029q050j6829
11606C55386k1494l8879l0666j6010j3034J1122K7719O380l3956l2362j6357p942
11594A89907j5684p528L804K8818R572J6371K431r279J4950R364L9255K9576K1790
11581C33347k0249p948l474m0858l2837j1477J4973K6877J7966M534K8940q82
$$ plain form
11569 308912 273152 246471 253754 265643 259608 249291 230354 198797 180395 172048 182031 176247
11557 176247 167686 190424 205520 226551 232059 232134 219281 215668 230219 221794 220744 233388 238145
11544 238145 235985 269656 327544 363598 421062 529903 705351 985755 1339035 1726559 1919408
11533 1919408 1727004 1300103 928332 681809 546922 445881 370507 310809 275895 252420
11523 252420 218394 197812 210130 227074 223094 186730 183765 171827 153312 154087 173611 208289
11511 208289 194926 168230 161504 151489 157921 158440 142587 126521 113355 108873 113060 96395 84353
11498 84353 59053 52818 42109 56288 81022 89375 94090 87252 116522 136465 122252 96272
11486 96272 80355 80932 89774 71057 53444 104866 117529 112700 98519 108713 109004 132805 171480
$$ packed form
11569C08912l5760k6681P283J1889o035j0317j8937l1557j8402q347R983n784
11557A76247q561K2738J5096K1031N508P5j2853l613J4551q425j050J2644M757
11544B38145k160L3671N7888L6054N7464J08841J75448K80404L53280L87524J92849
11533A919408j92404m26901l71771k46523j34887j01041p5374n9698l4914k3475
11523B52420l4026k0582J2318J6944l980l6364k965j1938j8515P75J9524L4678
11511B08289j3363k6696o726j0015O432N19j5853j6066j3166m482M187j6665j2042
11498H4353k5300o235j0709J4179K4734Q353M715o838K9270J9943j4213k5980
11486I6272j5917N77Q842j8717j7613N1422J2663m829j4181J0194K91K3801L8675
$$ plain form
11473 171480 189409 167923 126077 97760 97757 97075 75197 79116 66321 64725 53367 78331 118674
11460 118674 126290 79560 37621 47114 71012 66848 61047 68125 63871 39730 3152 -16580 11148
11447 11148 28968 22667 31676 54670 90055 100491 97453 99792 105864 110517 110462 120407 103932 126392
11433 126392 162749 174261 167749 153921 139774 114080 106204 111366 106011 117284 114482 119746 109488
11420 109488 111770 114744 98729 94152 110378 116997 102153 99443 101524 100254 83251 94550 120652
11407 120652 149987 162902 166375 147866 129623 156639 164422 127365 118411 128877 136397 125256
11395 125256 117955 128158 115908 102795 105959 95790 75571 74044 52422 23885 34185 25264
11383 25264 24690 31740 67643 58806 49993 54317 43309 32931 57585 69184 68868 65720 85032
$$ packed form
11473A71480J7929k1486m1846k8317lo82k1878L919j2795j596j1358K4964M0343
11460A18674P616m6730m1939R493K3898m164n801P078m254k4141l6578j9732K7728
11447A1148J7820o301R009K2994L5385J0436l038K339O072M653n5R945j6475K2460
11433A26392L6357J1512o512j3828j4147k5694p876N162n355J1273k802N264j0258
11420A09488K282K974j6015m577J6226O619j4844k710K081j270j7003J1299K6102
11407A20652K9335J2915L473j8509j8243K7016P783l7057q954J0466P520j1141
11395A25256p301J0203j2250j3113L164j0169k0219j527k1622k8537J0300q921
11383B5264n74P050L5903q837q813M324j1008j0378K4654J1599l16l148J9312
$$ plain form
11370 85032 99765 107418 88811 66813 44374 35098 39800 19752 32606 30582 41064 17916
11358 17916 48101 73878 63286 55302 78115 90491 92252 92177 64068 36661 35161 50598 50290
11345 50290 65221 69039 33699 26371 48136 56495 59138 40634 69192 71562 48997 62070 75989
11332 75989 72893 54884 52207 48374 32545 34141 35668 31525 41349 41422 35634 16279 2925 7219
11318 7219 27536 28508 18787 54399 75357 59716 28883 14503 7503 11864 5104 31612 47237
11305 47237 47924 54553 52928 53667 52445 23964 -14037 21832 28604 19737 30805 24845 -118 6493
11291 6493 21620 29960 35747 27685 19579 1815 -12391 -2392 13249 30348 35872 30818 26473
11278 26473 15225 31752 21574 8865 21750 19272 1203 9345 11287 18825 35455 35187 20945
$$ packed form
11370H5032J4733P653j8607k1998k2439r276M702k0048J2854k024J0482k3148
11358A7916L0185K5777j0592p984K2813J2376J761p5k8109k7407j500J5437l08
11345E0290J4931L818l5340p328K1765Q359K643j8504K8558K370k2565J3073J3919
11332G5989l096j8009k677l833j5829J596J527m143R824P3n788j9355j3354M294
11318G219K0317R72r721L5612K0958j5641l0833j4380p000M361o760K6508J5625
11305D7237O87O629j625P39j222k8481l8001L5869O772q867J1068n960k4963O611
11291F493J5127Q340N787q062q106j7764j4206R999J5641J7099N524n054m345
11278B6473j1248J6527j0178j2709J2885k478j8069Q142J942P538J6630k68j4242
$$ plain form
11265 20945 14509 4685 3411 2080 -1905 18234 20008 18078 29231 47288 42610 26313 21602
11252 21602 47625 16534 8349 20694 8932 25191 36861 32533 47943 48266 43807 42933 42283
11239 42283 48471 43513 36122 56286 77230 50051 32784 33315 55355 33485 29834 24993 27296
11226 27296 -4894 14277 9426 -12155 602 17888 -6958 -14095 -20659 -973 24192 39829
11214 39829 42011 41924 43263 28366 3497 22045 46126 41435 45986 61755 67952 60195 53926 47582
11200 47582 41969 18001 6196 -10597 -25880 -21034 -14274 -8475 -10494 1132 19884 15528 39044
11187 39044 44152 32990 37657 29615 38684 15442 -4926 253 -4150 -2115 22336 11425 452
11174 452 17008 45211 46387 33002 49896 33954 12572 10909 26144 35988 45871 58508 23045
$$ packed form
11265B0945o436r824j274j331l985K0139J774j930J1153J8057m678j6297m711
11252B1602K6023l1091q185J2345j1762J6259J1670m328J5410L23m459q74o50
11239D2283O188m958p391K0164K0944k7179j7267N31K2040k1870l651m841K303
11226B7296l2190J9171m851k1581J2757J7286k4846p137o564J9686K5165J5637
11214C9829K182q7J339j4897k4869J8548K4081m691M551J5769O197p757o269o344
11200D7582n613k3968j1805j6793j5283M846O760N799k019J1626J8752m356K3516
11187C9044N108j1162M667q042R069k3242k0368N179m403K035K4451j0911j0973
11174D52J6556K8203J176j3385J6894j5942k1382j663J5235R844R883J2637l5463
$$ plain form
11161 23045 32256 45742 36184 22621 12251 25022 29469 11423 -5135 -7437 5279 15592
11149 15592 7133 16696 20429 35061 45833 32176 28578 61227 86669 85491 72861 74884 68931
11136 68931 51881 52058 53748 64571 60276 56581 59620 46752 35860 42509 56366 56072 52592 78285
11122 78285 46527 20377 47378 63746 72191 58614 60209 51949 61151 64304 104760 120654 104989
11109 104989 113866 125055 108630 101534 65753 45810 57224 78525 84537 67428 74278 65009
11097 65009 42788 28147 27844 6745 -12038 -26461 -10200 9215 32134 29591 39966 40638 24301
11084 24301 24739 40379 54033 50300 36701 34527 29439 38533 40552 46116 53049 46988 37057 27231
11070 27231 4966 -5232 29954 51734 27400 10212 14099 10863 19812 27521 30647 55356 72356
$$ packed form
11161B3045R211J3486r558j3563j0370J2771M447j8046j6558k302J2716J0313
11149A5592q459R563L733J4632J0772j3657l598L2649K5442j178j2630K023n953
11136F8931j7050J77J690J0823m295l695L039j2868j0892O649J3857k94l480K5693
11122G8285l1758k6150K7001J6368Q445j3577J595q260R202L153M0456J5894j5665
11109A04989Q877J1189j6425p096l5781j9943J1414K1301O012j7109O850r269
11097F5009k2221j4641l03k1099j8783j4423J6261J9415K2919k543J0375O72j6337
11084B4301M38J5640J3654l733j3599k174n088R094K019N564O933o061r931r826
11070B7231k2265j0198L5186K1780k4334j7188L887l236Q949P709L126K4709J7000
$$ plain form
11057 72356 74597 82774 63673 60205 87078 92934 77864 53630 82405 105801 113395 121005 138417
11044 138417 141661 123782 118594 126684 128577 114005 119320 121544 140554 173084 211042 238841 251826
11031 251826 239170 232719 238126 205895 165352 191000 233781 255068 293699 337456 377974 374736
11019 374736 330487 280566 249011 202344 175580 188599 204891 210537 220658 244162 271551 294206
11007 294206 282632 263739 220185 217130 215642 197580 195129 164950 172495 175364 168454 172679 163069
10994 163069 144567 140739 131340 101173 91535 68454 71567 96692 102347 80709 49700 65205
10982 65205 71414 38666 51986 68598 71485 51885 51000 52359 66249 73402 81783 49627 33828
10969 33828 34082 -618 -7970 33646 52930 44913 58887 68644 58735 81606 77076 71546 83031
$$ packed form
11057G2356K241Q177j9101l468K6873N856j5070k4234K8775K3396P594P610J7412
11044A38417L244j7879n188Q090J893j4572N315K224J9010L2530L7958K7799J2985
11031B51826j2656o451N407l2231m0543K5648M2781K1287L8631M3757M0518l238
11019C74736m4249m9921l1555m6667k6764J3019J6292N646J0121K3504K7389K2655
11007B94206j1574j8893m3554l055j488j8062k451l0179P545K869o910M225r610
10994A63069j8502l828r399l0167r638k3081L113K5125N655k1638l1009J5505
10982F5205O209l2748J3320J6612K887j9600q85J359J3890P153Q381l2156j5799
10969C3828K54l4700p352M1616J9284q017J3974R757r909K2871m530n530J1485
$$ plain form
10956 83031 95161 81185 75270 58103 42741 39859 40605 43082 31499 23225 43740 50272 51605
10943 51605 62463 67194 82833 62137 52410 37642 12050 22552 47200 54387 43413 42254
10931 42254 33378 23550 4906 25537 42953 64209 63328 75116 81664 79712 36185 24366 29643
10918 29643 16042 2074 -25886 -56214 -32248 3195 -581 8893 27290 21158 30265 26564 8434
10905 8434 -1834 -10614 -15130 -23636 19358 59926 43754 48893 43499 25444 5351 41519 57893
10892 57893 62988 69500 62989 67749 65258 73320 52994 60425 44060 23422 6515 -2832 20122
10879 20122 31631 47508 18090 33809 32714 36456 35595 47616 69201 45043 34181 43066 43345
10866 43345 36716 49371 61847 54848 36444 24351 39385 30704 32128 48657 46073 30985 53850
$$ packed form
10956H3031J2130j3976n915j7167j5362k882P46K477j1583q274K0515O532J333
10943E1605J0858M731J5639k0696r727j4768k5592J0502K4648P187j0974j159
10931D2254q876r828j8644K0631J7416K1256q81J1788O548j952m3527j1819N277
10918B9643j3601j3968k7960l0328K3966L5443l776R474J8397o132R107l701j8130
10905H434j0268q780m516q506M2994M0568j6172N139n394j8055k0093L6168J6374
10892E7893N095O512o511M760k491Q062k0326P431j6365k0638j6907r347K2954
10879B0122J1509J5877k9418J5719j095L742q61J2021K1585k4158j0862Q885K79
10866D3345o629J2655J2476o999j8404j2093J5034q681J424J6529k584j5088K2865
$$ plain form
10853 53850 67769 79361 47092 1761 1010 4626 8290 -5548 -6091 11611 40952 44249 39914
10840 39914 29610 6768 -6647 4829 12933 39437 41193 35291 30577 21599 28921 16233 19522
10827 19522 12852 33772 25312 15684 -496 12163 19024 15246 22120 2322 -1254 23312 9360
10814 9360 22362 55757 71501 77055 94754 101852 108169 101816 90048 76447 66129 41402 38239
10801 38239 58846 47436 45481 35925 46050 47873 55513 48484 46530 41427 36186 38207 46588 50971
10787 50971 43648 29827 41713 16827 9841 11916 4426 30280 40442 46455 48925 63558 50122
10774 50122 37407 38467 52753 33513 32814 43318 27262 4134 -11550 -1175 -446 3690 56
10761 56 6353 19397 23848 38626 48513 47464 47431 59724 43751 26911 22288 29727 29718 20890 20854 21834
$$ packed form
10853E3850J3919J1592l2269m5331p51L616L664j3838n43J7702K9341L297m335
10840C9914j0304k2842j3415J1476Q104K6504J756n902m714q978P322j2688L289
10827A9522o670K0920q460r628j6180J2659O861l778O874j9798l576K4566j3952
10814I360J3002L3395J5744N554J7699P098O317o353j1768j3601j0318k4727l163
10801C8239K0607j1410j955r556J0125J823P640p029j954n103n241K021Q381M383
10787E0971p323j3821J1886k4886o986K075p490K5854J0162O013K470J4633j3436
10774E0122j2715J060J4286j9240o99J0504j6056k3128j5684J0375P29M136l634
10761E6O297J3044M451J4778R887j049l3J2293j5973j6840m623P439rq828l6R80
$$ plain form
10745 21834 44972 34430 47304 25175 26875 40924 19061 33076 45782 53949 78275 72178
10733 72178 71038 101029 93674 68986 65604 51003 41488 53088 64223 58955 11826 3211 20860
10720 20860 33494 41429 67436 81062 80474 44853 30454 56968 78704 68918 73257 64433 79981
10707 79981 88945 83879 54055 35608 34681 60258 90335 110071 72698 67574 112980 129025 118570
10694 118570 125821 147194 129688 141393 164444 200025 225143 205566 185533 175111 159656 149447
10682 149447 149484 144020 121949 115302 117515 108346 85406 99773 100011 104437 104987 121620 166044 158765
10668 158765 147804 174451 171904 149762 142499 148750 174796 214230 251320 254019 262723 262063 264498
10655 264498 285675 285809 292007 350193 392039 402959 435729 453869 464994 481674 488258 486588
$$ packed form
10745B1834K3138j0542J2874k2129J700J4049k1863J4015J2706Q167K4326o097
10733G2178j140K9991p355k4688l382j4601r515J1600J1135n268m7129q615J7649
10720B0860J2634P935K6007J3626n88l5621j4399K6514K1736r786M339q824J5548
10707G9981Q964n066k9824j8447r27K5577L0077J9736l7373n124M5406J6045j0455
10694A18570P251K1373j7506J1705K3051L5581K5118j9577k0033j0422j5455j0209
10682A49447L7n464k2071o647K213r169k2940J4367K38M426N50J6633M4424p279
10668A58765j0961K6647k547k2142p263O251K6046L9434L7090K699Q704o60K435
10655B64498K1177J34O198N8186M1846J0920L2770J8140J1125J6680O584j670
$$ plain form
10643 486588 511864 536490 567796 581041 647394 720597 804767 914209 1044980 1183749 1328660
10632 1328660 1510608 1702744 1833361 1886255 1937240 2016916 2191655 2436944 2817052 3338627
10622 3338627 4001643 4866654 6002975 7471175 9303000 11541471 14115540 16516854
10614 16516854 18001246 18229162 17606901 16807391 16390152 16658269 17793319 19953915 23284775
10605 23284775 27823161 33112173 37738192 39805504 38501711 35154699 31765086 29420251
10597 29420251 28599347 29400557 31889935 36219781 42224228 48919523 54068275 54959928
10589 54959928 50936970 44364203 38009669 33247264 30322068 29102412 29491390 31408801
10581 31408801 34511622 37911850 40011298 39087108 35015719 29577999 24610335 20925431
$$ packed form
10643D86588K5276K4626L1306J3245O6353P3203Q4170J09442J30771J38769J44911
10632A328660J81948J92136J30617N2894N0985P9676J74739K45289L80108N21575
10622C338627O63016Q65011J136321J468200J831825K238471K574069K401314
10614A6516854J484392K27916o22261p99510m17239K68117J135050K160596L330860
10605B3284775M538386N289012M626019K067312j303793l347012l389613k344835
10597B9420251q20904Q01210K489378M329846O004447O695295N148752Q91653
10589E4959928m022958o572767o354534m762405k925196j219656L88978J917411
10581C1408801L102821L400228K099448r24190m071389n437720m967664l684904
$$ plain form
10573 20925431 18516823 17160265 16745116 17020228 17750482 18483408 18563495 17426353 15158374
10564 15158374 12472302 9990932 7961050 6419359 5255723 4362221 3695377 3185604
10556 3185604 2766120 2472514 2238455 2005623 1873680 1757324 1594022 1433663 1312382
10547 1312382 1220317 1158456 1084969 1008463 954561 917652 863438 828758 782922 760493 756518
10536 756518 715231 668641 634881 615099 580411 559089 544960 534552 522182 508355 522507
10525 522507 511789 468493 441569 430463 416130 397409 385803 395036 365474 356074 375242 362879
10513 362879 354536 326267 322965 368453 380340 351997 321753 307045 272094 254412 276712 275472
10501 275472 246560 233174 206290 223849 236082 224963 251555 270538 263238 266549 300977 302843
$$ packed form
10573B0925431k408608j356558m15149K75112P30254P32926Q0087j137142k267979
10564A5158374k686072k481370k029882j541691j163636q93502o66844n09773
10556C185604m19484k93606k34059k32832j31943j16356j63302j60359j21281
10547A312382r2065o1861p3487p6506n3902l6909n4214l4680m5836k2429l975
10536G56518m1287m6590l3760j9782l4688k1322j4129j0408j2370j3827J4152
10525E22507j0718m3296k6924j1106j4333j8721j1606R233k9562r400J9168j2363
10513C62879q343k8269l302M5488J1887k8343l0244j4708l4951j7682K2300j240
10501B75472k8912j3386k6884J7559J2233j1119K6592J8983p300L311L4428J866
$$ plain form
10489 302843 264061 243372 231899 245684 256737 277332 282546 276267 255941 253189 241545 223917
10477 223917 222432 228279 233279 235036 228938 224882 238144 234955 261944 278215 266601 262814 247151
10464 247151 242185 268508 269763 243484 227145 217943 215744 219233 220163 209099 208861 190541 175632
10451 175632 164000 107582 109207 156879 147918 156769 156593 139373 137768 133650 125404 127749 142594
10438 142594 129414 128478 138789 157446 173782 152524 140994 119113 98115 74872 93960 108891
10426 108891 102756 92454 94058 92434 80130 72876 77735 77970 79576 68694 65325 66272 65598 65418
10412 65418 83239 95756 85293 96080 100388 117604 100120 99333 96673 71222 85815 93032 62955
10399 62955 44765 77646 78653 75379 89969 96550 109934 67204 37085 51404 71015 57434
$$ packed form
10489C02843l8782k0689j1473J3785J1053K0595N214o279k0326k752j1644j7628
10477B23917j485N847N000J757o098m056J3262l189K6989J6271j1614l787j5663
10464B47151m966K6323J255k6279j6339r202k199L489R30j1064k38j8320j4909
10451A75632j1632n6418J625M7672q961Q851j76j7220j605m118q246K345J4845
10438A42594j3180r36J0311J8657J6336k1258j1530k1881k0998k3243J9088J4931
10426A08891o135j0302J604j624j2304p254M859K35J606j0882l369R47o74j80
10412F5418J7821J2517j0463J0787M308J7216j7484p87k660k5451J4593P217l0077
10399F2955j8190L2881J007l274J4590O581J3384m2730l0119J4319J9611j3581
$$ plain form
10387 57434 40188 30426 52355 77219 65144 78590 90960 85378 98305 86669 67360 69197
10375 69197 65821 51872 31085 61732 84167 82489 90874 99645 93446 84494 69457 68346 81604
10362 81604 64511 36022 62455 93059 87418 77278 78347 74494 61562 92812 112296 114830
10350 114830 89629 71119 64004 80405 76284 74484 86089 95907 100249 115868 130178 109527
10338 109527 84846 74069 63690 65259 65674 57472 52167 22002 34745 14384 14342 38423 70707
10325 70707 73454 67605 80213 97450 93598 65058 37735 29985 26246 22380 31193 39502 4291
10312 4291 -6968 -16043 3952 42655 79378 66542 39853 24853 10901 21260 23355 10024
10300 10024 -6845 13588 42640 54568 47056 15472 20961 48557 70891 68799 76762 45954
$$ packed form
10387E7434j7246r762K1929K4864j2075J3446J2370n582J2927j1636j9309J837
10375F9197l376j3949k0787L0647K2435j678Q385Q771o199q952j5037j111J3258
10362H1604j7093k8489K6433L0604n641j0140J069l853j2932L1250J9484K534
10350A14830k5201j8510p115J6401m121j800J1605R818M342J5619J4310k0651
10338A09527k4681j0777j0379J569M15q202n305l0165J2743k0361m2K4081L2284
10325G0707K747n849J2608J7237l852k8540k7323p750l739l866Q813Q309l5211
10312D291j1259r075J9995L8703L6723j2836k6689j5000j3952J0359K095j3331
10300A0024j6869K0433K9052J1928p512l1584N489K7596K2334k092P963l0808
$$ plain form
10288 45954 14942 15724 23488 33500 49338 63938 66937 73816 51502 23715 35773 42570 36411
10275 36411 26287 20376 19336 31699 53910 65323 41209 43193 24093 12559 2573 -6232 3515
10262 3515 20355 46455 50999 73323 66725 49776 30313 27578 44325 51903 35000 10216 -1127
10249 -1127 -13319 9307 2717 -9174 12195 21491 60180 61840 37754 18735 4935 16016
10237 16016 22608 48206 57047 29658 34625 48866 56299 51848 63620 44782 20400 21160 17201
10224 17201 3783 -13910 18193 49433 40941 27376 40384 50006 21562 594 -5820 -12616
10212 -12616 23896 32023 20787 11404 6088 24918 41550 34198 -617 -1678 20836 32960 52964
10199 52964 79137 71353 66751 68353 69928 73609 68886 72018 89057 64073 77024 73684 76383
$$ packed form
10288D5954l1012P82P764J0012J5838J4600K999O879k2314k7787J2058O797o159
10275C6411j0124n911j040J2363K2211J1413k4114J984j9100j1534r986q805R747
10262C515J6840K6100M544K2324o598j6949j9463k735J6747P578j6903k4784j1343
10249a127j2192K2626o590j1891K1369R296L8689J660k4086j9019j3800J1081
10237A6016O592K5598Q841k7389M967J4241P433m451J1772j8838k4382P60l959
10224A7201j3418j7693L2103L1240q492j3565J3008R622k8444k0968o414o796
10212a2616L6512Q127j1236r383n316J8830J6632p352l4815j061K2514J2124K0004
10199E2964K6173p784m602J602J575L681m723L132J7039k4984J2951l340K699
$$ plain form
10186 76383 96686 76236 96587 96000 90196 95210 126259 154563 156067 169331 173506 165614 147995
10173 147995 149564 147599 139272 158768 191456 240831 271326 268110 261801 244451 233846 217473
10161 217473 210055 207127 198287 255980 288327 308832 349841 373250 371854 319982 262573 235925
10149 235925 215259 202064 206060 188121 199743 215135 229923 228939 213266 199013 169640 133268
10137 133268 143421 144674 141298 121799 121310 147088 140218 136748 125355 135218 142223 102781 41346
10124 41346 27674 58734 56489 50013 71725 52980 50006 61319 30152 -20322 -32217 -21243
10112 -21243 -4529 14082 19198 -19879 -14521 7028 -4190 -3457 -2080 -11118 -22512 -34627 -13422
10099 -13422 1906 17906 33772 16894 -6209 -6151 10429 11699 31379 38559 69185 81743 72234
$$ packed form
10186G6383K0303k0450K0351n87n804N014L1049K8304J504J3264M175p892j7619
10173A47995J569j965q327J9496L2688M9375L0495l216o309j7350j0605j6373
10161B17473p418k928q840N7693L2347K0505M1009K3409j396n1872n7409k6648
10149B35925k0666j3195L996j7939J1622J5392J4788r84j5673j4253k9373l6372
10137A33268J0153J253l376j9499m89K5778o870l470j1393R863P005l9442o1435
10124D1346j3672L1060k245o476K1712j8745k974J1313l1167n0474j1895J0974
10112b1243J6714J8611N116l9077N358K1549j1218P33J377r038j1394j2115K1205
10099a3422J5328J6000J5866j6878k3103N8J6580J270J9680P180L0626J2558r509
$$ plain form
10086 72234 58775 25180 7355 19105 39398 37453 35090 19293 5632 22704 24449 14531
10074 14531 32192 57357 27746 -4683 292 97 -1153 16204 19610 33455 36942 31568 30334
10061 30334 46797 73650 76345 65610 59230 61972 56409 38918 52361 46237 36723 27226 31656
10048 31656 17718 27222 25138 15720 30945 35174 15926 -6688 -7707 22852 31500 27884 5170
10035 5170 -29987 -11753 23510 50134 53282 34238 10892 24713 23872 36450 49635 12080
10023 12080 -15247 5723 40035 34689 24126 1122 -3574 12611 -181 -809 -8657 -16897 -33310
10010 -33310 -32911 -40255 -26589 -14164 5737 26848 6715 -22092 -12335 -8168 -26958 -15975 5692
9997 5692 10573 -5799 4104 -8541 -25722 -31648 -16780 24069 28612 19373 18762 40757 46543 23627
$$ packed form
10086G2234j3459l3595j7825J1750K0293j945k363j5797j3661J7072J745r918
10074A4531J7661K5165k9611l2429M975j95j250J7357L406J3845L487n374j234
10061C0334J6463K6853K695j0735o380K742n563j7491J3443o124r514r497M430
10048C1656j3938R504k084r418J5225M229j9248k2614j019L0559Q648l616k2714
10035E170l5157J8234L5263K6624L148j9044k3346J3821q41J2578J3185l7555
10023A2080k7327K0970L4312n346j0563k3004m696J6185j2792o28p848q240j6413
10010c3310L99p344J3666J2425J9901K1111k0133k8807R757M167j8790J0983K1667
9997E692M881j6372R903j2645j7181n926J4868M0849M543r239o11K1995N786k2916
$$ plain form
9983 23627 15033 18550 -397 2813 -2891 5966 11651 26237 14670 14835 39090 46546 31710 40117
9969 40117 36615 33858 36066 40053 39685 39154 34395 39931 28042 15580 11662 5623 6929 -10891
9955 -10891 -8362 -4980 11360 30931 31433 40991 53326 76579 86347 103896 124712 131302 138381
9942 138381 125986 134760 146003 162364 208956 261883 330506 434255 576536 839987 1326744
9931 1326744 2104584 3154507 3668289 2789834 1779298 1262107 1024277 900677 919611
9922 919611 1024683 1256925 1700928 2514809 3996862 6380995 8772895 8060454 5181425
9913 5181425 3146034 2051172 1444698 1090129 857990 693870 556032 466967 406419 356948
9903 356948 291972 214071 159043 140933 103738 92174 86141 88482 98360 101412 97875 63708 75360
$$ packed form
9983B3627q594L517j8947L210n704Q857N685J4586j1567J65K4255P456j4836Q407
9969D0117l502k757K208L987l68n31m759N536j1889j2462l918o039J306j7820
9955a0891K529L382J6340J9571N02R558J2335K3253R768J7549K0816O590P079
9942A38381j2395Q774J1243J6361M6592N2927O8623J03749J42281K63451M86757
9931A326744P77840J049923N13782q78455j010536n17191k37830j23600J8934
9922I19611J05072K32242M44003Q13881J482053K384133K391900p12441k879029
9913E181425k035391j094862o06474l54569k32139j64120j37838q9065o0548m9471
9903C56948o4976p7901n5028j8110l7195j1564o033K341R878L052l537l4167J1652
$$ plain form
9890 75360 92462 109410 120771 91941 88619 76057 69683 78600 83735 72869 60874 82078 82967
9877 82967 72740 75422 70886 79280 76278 21795 -4020 10960 42213 64342 70143 38450 10203
9864 10203 55999 73145 74873 51715 2142 -1915 -10359 -14293 -1729 -1903 921 14101 31408
9851 31408 29927 34544 19807 -14419 8425 31105 28686 24482 403 -2541 27021 36657 51639
9838 51639 6080 -4994 11416 29964 36743 49107 18903 3894 19982 44019 51865 60342
9826 60342 52112 31648 30497 29239 33844 41966 39802 16589 1730 12406 33777 47600 58221
9813 58221 41199 -2898 -24671 -16983 11848 12988 7754 11896 2977 -5133 -10557 1079 18011
9800 18011 5127 -15436 -20821 -8892 -4558 -12289 -16683 -4221 5713 29229 29383 27955 13046
$$ packed form
9890G5360J7102J6948J1361k8830l322j2562o374Q917N135j0866j1995K1204Q89
9877H2967j0227K682m536Q394l002n4483k5815J4980L1253K2129N801l1693k8247
9864A0203M5796J7146J728k3158m9573m057q444l934J2564j74K824J3180J7307
9851C1408j481M617j4737l4226K2844K2680k419m204k4079k944K9562R636J4982
9838E1639m5559j1074J6410J8548O779J2364l0204j5009J6088K4037P846Q477
9826F0342q230k0464j151j258M605Q122k164k3213j4859J0676K1371J3823J0621
9813E8221j7022m4097k1773P688K8831J140n234M142q919q110n424J1636J6932
9800A8011j2884k0563n385J1929M334p731m394J2462R934K3516J54j428j4909
$$ plain form
9787 13046 1849 -22619 -9139 -9068 -16529 -7234 -9848 2925 15203 53449 61610 54518 45081 34580
9773 34580 48030 55567 59071 57589 40284 61828 43046 -4457 -40877 -3912 16100 10699 -14191
9760 -14191 -12463 -12320 -3845 6803 22680 31752 28587 6901 -11164 5392 9690 766 -9555
9747 -9555 -3248 -5962 -10863 -24324 -27538 -32152 -39365 -8841 12365 30084 44047 67853 107056
9734 107056 83177 60592 40020 25618 29735 28803 25589 16611 6158 -3283 3675 -20040 -23612
9721 -23612 -12665 -21358 -15754 58 17574 12062 22032 41554 22074 36815 44044 62357 58087
9708 58087 55440 38627 20277 12811 21737 56029 65254 17791 17814 26910 11236 -9403 -19170 -18690
9694 -18690 -11828 -1615 -5351 16158 26790 -5379 22862 39897 18595 13890 48441 75147
$$ packed form
9787A3046j1197k4468J3480P1p461R295k614J2773J2278L8246Q161p092r437j0501
9773C4580J3450P537L504j482j7305K1544j8782m7503l6420L6965K0012n401k4890
9760a4191J728J43Q475J0648J5877R072l165k1686j8065J6556M298q924j0321
9747i555O307k714m901j3461l214m614p213L0524K1206J7719J3963K3806L9203
9734A07056k3879k2585k0572j4402M117r32l214q978j0453r441O958k3715l572
9721b3612J0947q693N604J5812J7516n512R970J9522j9480J4741P229J8313m270
9708E8087k647j6813j8350p466Q926L4292R225m7463K3R096j5674k0639r767M80
9694a8690O862J0213l736K1509J0632l2169K8241J7035k1302m705L4551K6706
$$ plain form
9682 75147 106055 152077 201162 222476 242881 307957 359029 392189 427328 417637 350429 304166
9670 304166 245217 202977 163133 139297 121831 115100 94000 116067 105667 57643 32500 24374
9658 24374 6163 -13351 12852 39195 70626 69959 32326 27955 52198 54850 28277 43124 57821
9645 57821 39996 29510 8364 -32956 -42144 -30833 -16926 10304 11523 3383 -1232 -9823 -18422
9632 -18422 -38726 -34456 -16505 -20083 -14782 1958 6086 10928 6261 11889 -8586 -39196 -35786
9619 -35786 -6062 -9032 -2498 19804 31355 28557 25565 34944 12024 -8014 -10806 -20897 -36273
9606 -36273 -21749 12632 35171 23274 12056 19599 13905 1930 1126 -16127 -41050 -32605 -28467
9593 -28467 -25252 -41174 -31921 -17998 -16074 8308 8364 -3520 -7559 15717 14411 12542 -1922 9230
$$ packed form
9682G5147L0908M6022M9085K1314K0405O5076N1072L3160L5139r691o7208m6263
9670C04166n8949m2240l9844k3836j7466o731k1100K2067j0400m8024k5143q126
9658B4374j8211j9514K6203K6343L1431o67l7633m371K4243K652k6573J4847J4697
9645E7821j7825j0486k1146m1320r188J1311J3907K7230J219q140m615q591q599
9632a8422k0304M270J7951l578N301J6740M128M842m667N628k0475l0610L410
9619c5786K9724k970O534K2302J1551k798k992R379k2920k0038k792j0091j5376
9606c6273J4524L4381K2539j1897j1218P543n694j1975q04j7253k4923Q445M138
9593b8467L215j5922R253J3923J924K4382N6j1884m039K3276j306j869j4464J1152
$$ plain form
9579 9230 16123 -10042 6106 1515 -27131 -35183 -26920 -15373 -11532 -1590 20126 26374 15445
9566 15445 -18991 -33874 -5156 -276 -3148 8208 3046 4861 -6957 7646 12052 373 2049
9553 2049 -1287 2642 4786 790 -10155 -13246 4755 -3146 -20533 -9044 3760 6360 -21540
9540 -21540 -33959 -28114 -31050 -8476 -5803 -22421 -26283 -18059 -9101 5550 31787 18129 -2926
9527 -2926 -5907 7499 18758 -5592 -31618 -37844 -26710 -13346 2449 17898 24213 1446 -17000
9514 -17000 -31561 -19247 -29279 -32862 -30527 -20657 -32681 -34623 -39468 -8396 -14270 -24829 -34669
9501 -34669 -86164 -85982 -76330 -37109 -13004 -4654 23100 10260 -25344 -29470 -24846 -40431 -61988
9488 -61988 -48906 11911 31507 14048 6896 30732 67806 38743 5630 10770 12248 42298
$$ packed form
9579I230O893k6165J6148m591k8646q052Q263J1547L841R942K1716O248j0929
9566A5445l4436j4883K8718M880k872J1356n162J815j1818J4603M406j1679J676
9553B049l336L929K144l996j0945l091J8001p901j7387J1489J2804K600k7900
9540b1540j2419N845k936K2574K673j6618l862Q224Q958J4651K6237j3658k1055
9527b926k981J3406J1259k4350k6026o226J1134J3364J5795J5449O315k2767j8446
9514a7000j4561J2314j0032l583K335R870j2024j942m845L1072n874j0559r840
9501c4669n1495J82R652L9221K4105Q350K7754j2840l5604m126M624j5585k1557
9488f1988J3082O0817J9596j7459p152K3836L7074k9063l3113N140J478L0050
$$ plain form
9476 42298 28670 -9160 -22666 -25423 -31152 -8805 23596 40601 36654 20487 2520 11835 26516
9463 26516 7315 -25770 -53290 -57088 -51022 -32937 -30263 -64866 -71087 -28700 -33510 -28624 -10042
9450 -10042 18753 5188 9358 24059 18842 -6034 -12965 4081 3300 -14401 -20021 -16941 -27748
9437 -27748 -26128 -348 -3212 -5486 -16141 -25766 -28990 -33345 -8020 -12451 -6768 14019 6371 16488
9423 16488 26934 30662 50749 54468 32379 24872 31934 27503 1487 5029 -10270 -7652 27301
9410 27301 18954 35599 33366 16326 14700 -12314 -29625 -48954 -29353 1506 18705 2719
9398 2719 7441 13379 3895 -7381 -13778 8947 17056 13608 -5070 11416 -2217 -20407 -28460
9385 -28460 -3050 17718 18039 33874 41287 19324 -3699 841 -13492 -12573 -20925 -18931 -20930 -12296
$$ packed form
9476D2298j3628l7830j3506k757n729K2347L2401J7005l947j6167j7967R315J4681
9463B6516j9201l3085k7520l798O066J8085K674l4603o221M2387m810M886J8582
9450a0042K8795j3565M170J4701n217k4876o931J7046p81j7701n620L080j0807
9437b7748J620K5780k864k274j0655r625l224m355K5325m431N683K0787p648J0117
9423A6488J0446L728K0087L719k2089p507P062m431k6016L542j5299K618L4953
9410B7301q347J6645k233j7040j626k7014j7311j9329J9601L0859J7199j5986
9398B719M722N938r484j1276o397K2725Q109l448j8678J6486j3633j8190q053
9385b8460K5410K0768L21J5835P413k1963k3023M540j4333R19q352J994j999Q634
$$ plain form
9371 -12296 -21437 -33540 -38174 -33592 -7151 13493 19600 3486 10811 8497 11643 29371 28795 23371
9357 23371 25215 12619 1639 -8978 -10851 -21399 -24250 -42981 -39163 -24222 -3360 1458 -10907
9344 -10907 -12716 -27229 -14196 -1594 -528 1827 4522 -11820 4439 33362 17484 789 -32075
9331 -32075 -22751 -12038 -8912 -4070 21541 33534 14442 7234 -35821 -56698 -25040 -14156 -32420
9318 -32420 -14838 -9935 -7852 13962 40669 25701 30795 16135 11108 27483 52975 73890 66457
9305 66457 43774 30172 13702 -10092 -9453 -3579 -21812 -20861 -5104 -30933 -38238 -46639 -69026
9292 -69026 -56918 -34362 -12842 5031 13721 -7746 -18244 -19298 -11489 -9209 -15987 8639 10396
9279 10396 -7004 9513 7807 366 -18257 -20469 -29811 -15221 -17362 -6923 22261 10842 6755
$$ packed form
9371a2296r141j2103m634M582K6441K0644O107j6114P325k314L146J7728n76n424
9357B3371J844j2596j0980j0617j873j0548k851j8731L818J4941K0862M818j2365
9344a0907j809j4513J3033J2602J066K355K695j6342J6259K8923j5878j6695l2864
9331c2075R324J0713L126M842K5611J1993j9092p208m3055k0877L1658J0884j8264
9318c2420J7582M903K083K1814K6707j4968N094j4660n027J6375K5492K0915p433
9305F6457k2683j3602j6470k3794O39N874j8233R51J5757k5829p305q401k2387
9292f9026J2108K2556K1520J7873Q690k1467j0498j054P809K280o778K4626J757
9279A0396j7400J6517j706p441j8623k212r342J4590k141J0439K9184j1419m087
$$ plain form
9266 6755 26253 2449 -22899 1579 25508 20648 12519 -1499 -19152 -5383 26580 30164 8486
9253 8486 8394 8131 9052 -7500 7061 9398 4370 5008 -6528 -12719 -17999 -13983 -10039 -23068 -12670
9238 -12670 -9262 19883 36312 27110 9789 -15090 -35654 -33461 -24156 -38503 -41720 -7471 -11329
9225 -11329 -25726 -37863 -26298 -28839 -11730 30759 48946 30900 5962 -12966 -19176 -14645
9213 -14645 -23886 -43532 -25148 -13185 -27138 -29565 -44564 -38430 -21990 -38662 -28430 2035
9201 2035 1110 -19138 -31258 -18255 -2990 -11198 -21871 -26384 489 10611 10759 28810 43779
9188 43779 12442 141 9761 32291 36730 19941 30824 15821 -14119 -13981 19379 30011 73479
9175 73479 71905 81070 67458 48198 35033 17402 28330 3800 7036 48962 60517 55711 34922
$$ packed form
9266F755J9498k3804k5348K4478K3929m860q129j4018j7653J3769L1963L584k1678
9253H486r2k63R21j6552J4561K337n028O38j1536o191n280M016L944j3029J0398
9238a2670L408K9145J6429r202j7321k4879k0564K193R305j4347l217L4249l858
9225a1329j4397j2137J1565k541J7109M2489J8187j8046k4938j8928o210M531
9213a4645r241j9646J8384J1963j3953k427j4999O134J6440j6672J0232L0465
9201B035r25k0248j2120J3003J5265q208j0673m513K6873J0122J48J8051J4969
9188D3779l1337j2301R620K2530M439j6789J0883j5003k9940J38L3360J0632M3468
9175G3479j574R165j3612j9260j3165j7631J0928k4530L236M1926J1555m806k0789
$$ plain form
9162 34922 18329 29465 24995 29069 28846 28644 26845 13898 34842 23370 -91 12561 -8846
9149 -8846 -23260 -11852 7363 -1787 -5994 2140 -11418 -34318 -12187 -3064 3671 -4456 -20871
9136 -20871 -751 16170 11546 -2142 -39940 -20660 -278 120 -32247 -47711 -40077 -32499 -21536
9123 -21536 -23183 -19241 -10744 -24177 -46850 -34992 -16610 -14182 -14972 -9828 -42603 -45570 -17424
9110 -17424 9530 28737 17052 8715 3405 16237 28697 46628 10907 -12706 -27435 -40778
9098 -40778 -30533 -4474 5224 7555 18460 1018 9255 23522 34326 28685 41435 31396 32178
9085 32178 23395 -9667 -14589 11317 35142 7466 -2409 3578 2929 -5139 -4285 6914 14914 15441
9071 15441 20593 3971 -44024 -21842 -1925 -22034 -18357 -16560 -14377 -10065 15153 54184 45370
$$ packed form
9162C4922j6593J1136m470M074k23k02j799j2947K0944j1472k3461J2652k1407
9149h846j4414J1408J9215r150m207Q134j3558k2900K2131R123O735q127j6415
9136b0871K0120J6921m624j3688l7798J9280K0382L98l2367j5464P634P578J0963
9123b1536j647L942Q497j3433k2673J1858J8382K428p90N144l2775k967K8146
9110a7424K6954J9207j1685q337n310J2832J2460J7931l5721k3613j4729j3343
9098d0778J0245K6059R698K331J0905j7442Q237J4267J0804n641J2750j0039P82
9085C2178q783l3062m922K5906K3825k7676r875N987o49q068Q54J1199Q000N27
9071A5441N152j6622m7995K2182J9917k0109L677J797K183M312K5218L9031q814
$$ plain form
9058 45370 29677 37946 44066 61648 58934 61988 84744 90352 51581 75085 84383 104289 66953
9045 66953 15184 -2003 -28190 -42842 -32243 -23440 -60805 -43063 2608 24989 28335 34005
9033 34005 31109 35010 16354 -1016 -18023 -39414 -41867 -15244 -12806 -31733 -15307 9048 5350
9020 5350 -21482 -2952 35753 24832 -12836 -3302 -1167 -4897 -13293 -25139 -12756 11618 11710
9007 11710 -5764 -13230 2781 -6363 -19698 -20677 1862 604 -43 11794 -10923 -3329 19002
8994 19002 29030 6677 -19668 808 16421 17291 32698 45766 77154 85087 67485 69815 53196
8981 53196 22134 -14480 -27060 -7695 -24714 -18192 -24894 -48080 -42443 -35560 -24462 15393 49903
8968 49903 42509 16689 -1978 -19737 -12086 -32462 -26663 -4398 14027 14167 20502 27813 10577
$$ packed form
9058D5370j5693Q269O120J7582k714L054K2756N608l8771K3504R298J9906l7336
9045F6953n1769j7187k6187j4652J0599Q803l7365J7742M5671K2381L346N670
9033C4005k896L901j8656j7370j7007k1391k453K6623K438j8927J6426K4355l698
9020E350k6832J8530L8705j0921l7668R534K135l730q396j1846J2383K4374R2
9007A1710j7474p466J6011r144j3335r79K2539j258o47J1837k2717P594K2331
8994A9002J0028k2353k6345K0476J5613Q70J5407J3068L1388P933j7602K330j6619
8981E3196l1062l6614j2580J9365j7019O522o702k3186N637O883J1098L9855L4510
8968D9903p394k5820j8667j7759P651k0376N799K2265J8425J40O335P311j7236
$$ plain form
8955 10577 339 9375 -392 -9550 -19365 -21341 -5674 -28492 -20591 13365 32245 18453 14894
8942 14894 -26072 -61529 -54199 -34845 -46205 -46845 -42979 -25956 -9187 -11840 -15749 26690 30057
8929 30057 5582 -218 -4185 8362 33883 41199 63793 32796 2682 1472 31289 40461 29974
8916 29974 3549 -9768 19390 42766 33669 10844 11848 -3481 -10649 -14289 10430 19967 17507
8903 17507 -9231 -11656 5248 19514 38005 35311 27892 30258 35002 13154 -2623 -41408 -31474
8890 -31474 -13457 -42 -6740 -12441 -18818 -19127 -148 15163 31699 50047 31246 24141 12622
8877 12622 1092 6923 -3505 -16814 2157 645 -32465 -11054 16589 2130 -19210 -11829
8865 -11829 -12192 -25121 -34844 -34617 -32797 -34317 -16806 -28611 -40764 -15417 -9606 15773 25353 29033
$$ packed form
8955A0577j0238R036r767r158r815j976J5667k2818P901L3956J8880j3792l559
8942A4894m0966l5457P330J9354j1360o40L866J7023J6769k653l909M2439L367
8929C0057k4475n800l967J2547K5521P316K2594l0997l0114j210K9817R172j0487
8916B9974k6425j3317K9158K3376r097k2825J004j5329p168l640K4719R537k460
8903A7507k6738k425J6904J4266J8491k694p419K366M744k1848j5777l8785R934
8890c1474J8017J3415o698n701o377l09J8979J5311J6536J8348j8801p105j1519
8877A2622j1530N831j0428j3309J8971j512l3110K1411K7643j4459k1340P381
8865a1829l63j2929r723K27J820j520J7511j1805j2153K5347N811K5379R580L680
$$ plain form
8851 29033 21417 41531 43614 40648 36090 -3438 -1955 17902 16053 22470 3089 -18210 -38638
8838 -38638 -35453 -28191 -20460 -23570 -13807 -20190 13038 19919 16975 -9163 9753 20038 4411
8825 4411 25104 27689 27755 21352 -7682 -3674 -12366 -12684 -15224 -22004 -23368 -21163 2947 -5376 -10784
8810 -10784 -12699 -2946 -1722 16782 49795 46685 59612 57876 49440 18537 28089 12352 22769
8797 22769 26409 28566 31792 7344 -4697 -4168 -6979 -18687 -16933 -7762 -14728 -13206 16486 22019
8783 22019 28627 32419 64943 76670 89628 73821 79185 98300 116154 124328 126941 95259 76703
8770 76703 76954 78372 58818 54985 60972 100124 109039 119272 122904 104277 113732 105233 93854 67584
8756 67584 33174 24137 50746 61747 45896 50645 60962 55582 79441 84645 60619 45174 51784
$$ packed form
8851B9033p616K0114K083k966m558l9528J483J9857j849O417j9381k1299k0428
8838c8638L185P262P731l110R763o383L3228O881k944k6138J8916J0285j5627
8825D411K0693K585O6o403k9034M008q692l18k540o780j364K205K4110q323n408
8810a0784j915R753J224J8504L3013l110J2927j736q436l0903R552j5737J0417
8797B2769L640K157L226k4448j2041N29k811j1708J754R171o966J522K9692N533
8783B2019O608L792L2524J1727J2958j5807N364J9115J7854Q174K613l1682j8556
8770G6703K51J418j9554l833N987L9152Q915J0233L632j8627R455q499j1379k6270
8756F7584l4410r037K6609J1001j5851M749J0317n380K3859N204k4026j5445O610
$$ plain form
8743 51784 78153 80110 72723 92419 77174 47704 20048 35026 83586 109155 135836 162679
8731 162679 171619 171122 171406 171797 182403 156656 142163 156844 145022 125674 131015 126611 110166
8718 110166 114679 144052 125227 53008 64652 95817 97982 78282 55826 29062 10282 15669
8706 15669 20053 46144 40554 38796 73809 107542 86914 66863 70048 68810 78666 89381 70156
8693 70156 38369 53460 89482 114043 121504 135285 135551 124800 131795 144959 186041 182751 189031
8680 189031 228639 259794 273309 264297 261105 232385 182187 160462 155835 171562 150762 151133 155604
8667 155604 140625 123682 127374 133928 150531 147346 143733 170673 179641 197565 176436 163099 205529
8654 205529 245027 210976 199385 205655 188485 183882 162070 166143 169129 162060 158458 156225 192634
$$ packed form
8743E1784K6369J957p387J9696j5245k9470k7656J4978M8560K5569K6681K6843
8731A62679Q940m97K84L91J0606k5747j4493J4681j1822j9348N341m404j6445
8718A10166M513K9373j8825p2219J1644L1165K165j9700k2456k6764j8780N387
8706A5669M384K6091n590j758L5013L3733k0628k0051L185j238R856J0715j9225
8693G0156l1787J5091L6022K4561P461J3781K66j0751O995J3164M1082l290O280
8680A89031L9608L1155J3515r012l192k8720n0198k1725m627J5727k0800L71M471
8667A55604j4979j6943L692O554J6603l185l613K6940Q968J7924k1129j3337M2430
8654B05529L9498l4051j1591O270j7170m603k1812M073K986p069l602k233L6409
$$ plain form
8641 192634 218853 235798 267951 284527 308344 329609 343750 383870 420539 428116 443554 432708
8629 432708 396716 343149 329988 310940 234068 196047 184968 181823 171856 206579 209422 189207
8617 189207 202754 212366 210349 191160 201514 200459 207988 235485 254598 265438 300296 305199 304806
8604 304806 303298 298086 283861 262781 223417 190813 189087 170511 153055 132775 130631 135819 126865
8591 126865 114575 132044 125459 148345 157055 136149 131178 127514 115144 114636 119369 117981 102600
8578 102600 110037 117603 106306 151498 173445 175671 188433 185632 150767 122443 128311 129291 138133
8565 138133 147996 155370 182084 207373 210039 205994 217922 271392 313359 328822 323104 291353 260262
8552 260262 246927 237221 234373 226221 179114 139998 152419 152314 141837 130127 124302 147641 148592
$$ packed form
8641A92634K6219J6945L2153J6576K3817K1265J4141M0120L6669P577J5438j0846
8629D32708l5992n3567j3161j9048p6872l8021j1079l145r967L4723K843k0215
8617A89207J3547R612k017j9189J0354j055P529K7497J9113J0840L4858M903l93
8604C04806j508n212j4225k1080l9364l2604j726j8576j7456k0280k144N188q954
8591A26865j2290J7469o585K2886Q710k0906m971l664j2370n08M733j388j5381
8578A02600P437P566j1297M5192K1947K226J2762k801l4865k8324N868R80Q842
8565A38133R863P374K6714K5289K666m045J1928N3470M1967J5463n718l1751l1091
8552B60262j3335r706k848q152m7107l9116J2421j05j0477j1710n825K3339R51
$$ plain form
8539 148592 137705 141945 153895 164254 197198 198612 194765 172545 186683 223888 247230 279432
8527 279432 271463 229329 184371 163162 127772 133640 145294 124322 133862 132091 135528 149875 164481
8514 164481 162720 144515 119539 137764 171628 175567 154234 124758 122853 125116 132992 98152 79700
8501 79700 70144 81088 69795 45056 55203 80822 95810 72426 45336 72745 82398 74054
8489 74054 67458 83752 97119 75530 71244 95263 114871 131629 133029 104471 86486 70059
8477 70059 49553 44810 63332 57298 56605 73631 60797 40751 54255 68275 67859 44651 40036
8464 40036 83245 93731 80650 65981 78439 88623 74032 76897 68717 74774 77852 70469 59414
8451 59414 91300 109320 91155 86547 102663 115369 121488 103987 72168 76071 76462 38130 41891
$$ packed form
8539A48592j0887M240J1950J0359L2944J414l847k2220J4138L7205K3342L2202
8527B79432p969m2134m4958k1209l5390N868J1654k0972R540j771L437J4347J4606
8514A64481j761j8205k4976J8225L3864L939k1333k9476j905K263P876l4840j8452
8501G9700r556J0944j1293k4739J0147K5619J4988k3384k7090K7409R653q344
8489G4054o596J6294J3367k1589m286K4019J9608J6758J400k8558j7985j6427
8477G0059k0506m743J8522o034o93J7026j2834k0046J3504J4020m16k3208m615
8464D0036M3209J0486j3081j4669J2458J0184j4591K865q180O057L078p383j1055
8451E9414L1886J8020j8165m608J6116J2706O119j7501l1819L903L91l8332L761
$$ plain form
8438 41891 67216 83656 74076 68220 70181 62615 74632 49030 42934 47654 75981 103887 79214
8425 79214 56973 66356 52581 35729 21934 19426 27091 35120 57794 41994 38272 36982 49730
8412 49730 62523 69865 61733 57863 41236 51030 59787 50291 63278 67437 80753 88134 81899 78162
8398 78162 82284 90185 71602 52285 64708 65634 65945 75387 74207 68229 78888 80997 71154 83878
8384 83878 72357 63803 78065 89781 103994 105606 112680 91247 69051 71260 93646 91900 118728
8371 118728 134626 121332 100926 96306 80088 79118 68874 66573 49836 51696 85609 89324 66839
8358 66839 97003 130521 117532 102633 105009 95048 101024 111097 113361 125417 179608 251387 345751
8345 345751 496026 773484 1178180 1692640 1892479 1502368 965158 639161 480385 380601
$$ packed form
8438D1891K5325J6440r580n856J961p566J2017k5602o096M720K8327K7906k4673
8425G9214k2241R383j3775j6852j3795k508P665Q029K2674j5800l722j290J2748
8412D9730J2793P342q132l870j6627R794Q757r496J2987M159J3316P381o235l737
8398G8162M122P901j8583j9317J2423R26L11R442j180n978J0659K109r843J2724
8384H3878j1521q554J4262J1716J4213J612P074k1433k2196K209K2386j746K6828
8371A18728J5898j3294k0406m620j6218r70j0244k301j6737J860L3913L715k2485
8358F6839L0164L3518j2989j4899K376r961N976J0073K264J2056N4191P1779R4364
8345C45751J50275K77458M04696N14460J99839l90111n37210l25997j58776r9784
$$ plain form
8335 380601 306842 227430 207437 204199 204033 164446 150118 133486 127844 115680 91015 82063 94517
8322 94517 73030 66973 52545 58587 76967 88564 80471 87819 104993 103628 95285 109854 137247
8309 137247 145103 159990 192651 229492 253299 303231 422091 581612 830217 1275198 2047445
8298 2047445 3115179 3791941 3166485 2069368 1312152 875075 642775 495193 356644
8289 356644 289436 247336 235835 213062 180547 161889 159441 156661 137307 102278 116868 118821
8277 118821 118565 123453 112500 97134 118221 114430 116840 116546 106157 96145 96973 79512 88717 115160
8263 115160 109821 96337 113092 144091 171643 221297 315237 510755 861232 1327059 1733118
8252 1733118 1652846 1156795 743106 490693 319882 255201 210641 153582 109115 105094 84213
$$ packed form
8335C80601p3759p9412j9993l238j66l9587j4328j6632n642j2164k4665q952J2454
8322I4517k1487o057j4428O042J8380J1597q093P348J7174j365q343J4569K7393
8309A37247P856J4887L2661L6841K3807M9932J18860J59521K48605M44981P72247
8298B047445J067734O76762o25456j097117p57216m37077k32300j47582j38549
8289C56644o7208m2100j1501k2773l2515j8658k448k780j9354l5029J4590J953
8277A18821k56M888j0953j5366K1087l791K410k94j0389j0012Q28j7461R205K6443
8263A15160n339j3484J6755L0999K7552M9654R3940J95518L50477M65827M06059
8252A733118q0272m96051m13689k52413j70811o4681m4560n7059m4467m021k0881
$$ plain form
8241 84213 73790 85864 86354 89534 91668 82792 49460 13447 -4556 365 13448 27196 63291
8228 63291 51880 34302 2508 -4100 -2938 26077 41972 46796 12639 1175 21036 25976 15400
8215 15400 27910 30497 38696 36984 19043 -3352 11525 33553 29197 32014 14522 -566 -5302
8202 -5302 -3228 5992 2705 18738 57272 85745 90169 78755 63670 40927 25266 2647 -7759
8189 -7759 11480 -1636 -1806 -5191 18058 6582 -4628 16770 19935 18055 17182 37392 30100 11104
8175 11104 9791 49127 37628 22112 43427 80440 102473 65621 37187 51970 59475 66799
8163 66799 49796 69246 63216 70468 96657 93433 86703 76880 70303 81605 94314 93542 69454
8150 69454 43289 7081 5649 27295 43245 54113 56024 60720 25341 26822 63350 81340 79391
$$ packed form
8241H4213j0423J2074M90L180K134q876l3332l6013j8003M921J3083J3748L6095
8228F3291j1411j7578l1794o608J162K9015J5895M824l4157j1464J9861M940j0576
8215A5400J2510K587Q199j712j7941k2395J4877K2028m356K817j7492j5088m736
8202e302K074R220l287J6033L8534K8473M424j1414j5085k2743j5661k2619j0406
8189g759J9239j3116j70l385K3249j1476j1210K1398L165j880q73K0210p292j8996
8175A1104j313L9336j1499j5516K1315L7013K2033l6852k8434J4783P505P324
8163F6799j7003J9450o030P252K6189l224o730r823o577J1302J2709p72k4088
8150F9454k6165l6208j432K1646J5950J0868J911M696l5379J481L6528J7990j949
$$ plain form
8137 79391 49057 23214 15865 18437 -7361 -18445 -3402 -4423 -16957 -17551 -6857 29587 33464
8124 33464 12564 23720 21602 14411 19464 15652 -11621 11356 61127 48441 41040 41612 55973
8111 55973 39433 30285 15006 13552 22749 44730 51021 29151 15615 32200 35715 32698 8092
8098 8092 -1982 28507 28865 -620 -26028 -45131 -28718 -25054 -32989 -30918 -28163 -18212 7501
8085 7501 11751 -2758 4284 8690 7426 39871 39302 33343 13529 6908 20014 51166 60438 12708
8071 12708 -2076 -1983 14215 23115 31244 32680 30129 33810 6909 21565 36330 34482 32346 28051
8057 28051 31706 28702 56256 72509 63593 41574 48165 34961 11619 7691 30854 7627 7691
8044 7691 651 -17680 6023 35294 31031 13917 -11182 -5383 -2220 -33377 -33146 -24900 15626
$$ packed form
8137G9391l0334k5843p349K572k5798j1084J5043j021j2534n94J0694L6444L877
8124C3464k0900J1156k118p191N053l812k7273K2977M9771j2686p401N72J4361
8111E5973j6540r148j5279j454R197K1981O291k1870j3536J6585L515l017k4606
8098H092j0074L0489L58k9485k5408j9103J6413L664p935K071K755R951K5713
8085G501M250j4509P042M406j264L2445n69n959j9814o621J3106L1152R272m7730
8071A2708j4784R3J6198Q900Q129J436k551L681k6901J4656J4765j848k136m295
8057B8051L655l004K7554J6253q916k2019O591j3204k3342l928K3163k3227O4
8044G691p040j8331K3703K9271m263j7114k5099N799L163l1157K31Q246M0526
$$ plain form
8031 15626 27342 28108 8657 -15259 782 7061 22979 28197 25778 4273 -14182 -27133 -37644
8018 -37644 -35209 -19273 -16767 -35280 -50452 -21700 -18420 11888 31921 54132 42963 10989
8006 10989 2618 -7300 -4469 21388 28569 18568 12943 16443 -3488 -2302 -17935 -18284 -25372 -28674
7992 -28674 -11870 -23913 -17820 10696 20277 10669 -24533 -41252 -39936 -13840 -3277 2419 15355
7979 15355 19674 6215 12916 17235 4083 -900 10818 78 5102 8956 30170 38081 37281 34421
7965 34421 29390 21312 24175 18580 977 -273 29707 49605 46909 26509 17988 7102 7872 22445
7951 22445 18973 21710 29643 29305 35849 31224 3447 3814 21801 20336 -4824 -19971 -31707 -23044
7937 -23044 -1926 10560 10308 19157 5157 -10891 -21927 -26342 -7648 -5263 2034 3219 16232
$$ packed form
8031A5626J1716P66j9451k3916J6041O279J5918N218k419k1505j8455j2951j0511
8018c7644K435J5936K506j8513j5172K8752L280L0308K0033K2211j1169l1974
8006A0989q371r918K831K5857P181j0001n625L500j9931J186j5633l49p088l302
7992b8674J6804j2043O093K8516R581r608l5202j6719J316K6096J0563N696J2936
7979A5355M319j3459O701M319j3152m983J1718j0740N024L854K1214P911q00k860
7965C4421n031q078K863n595j7603j250K9980J9898k696k0400q521j0886P70J4573
7951B2445l472K737P933l38O544m625k7777L67J7987j465k5160j5147j1736Q663
7937b3044K1118J2486k52Q849j4000j6048j1036m415J8694K385P297J185J3013
$$ plain form
7924 16232 20032 23593 16786 11256 2034 -17150 -13639 -27436 -25160 -32790 -16543 8069 4054 13812
7910 13812 31016 39999 22728 694 -12250 -15527 -12046 -3356 9412 37089 50337 49765 32368
7897 32368 -4544 -19595 -22144 -15393 -29371 -25646 -23969 -35108 -23023 -26060 -40813 -25246 -8806
7884 -8806 -24448 -30442 -43729 -39982 -5 8457 22561 45572 36271 16856 12046 14866 14681 4674
7870 4674 -4855 -11003 -26859 -32025 -17681 21185 42420 20533 -2974 10244 -5387 -7857 -6059
7857 -6059 7904 11000 -7803 -8988 5177 15715 7727 -2167 -8907 -21556 -12942 -11666 -19126 -1968
7843 -1968 -1733 -23946 -37248 -21878 -8090 -2135 -10746 -6227 -3851 -11794 -34776 -42529 -29553 -21956
7829 -21956 -24513 -23518 -52134 -44038 -54053 -38274 -21348 -32702 -27990 -31526 -17218 4490 33540
$$ packed form
7924A6232L800L561o807n530r222j9184L511j3797K276p630J6247K4612m015R758
7910A3812J7204Q983j7271k2034j2944l277L481Q690J2768K7677J3248n72j7397
7897C2368l6912j5051k549O751j3978L725J677j1139J2085l037j4753J5567J6440
7884h806j5642n994j3287L747L9977Q462J4104K3011r301j9415m810K820j85j0007
7870D674r529o148j5856n166J4344L8866K1235k1887k3507J3218j5631k470J798
7857f059J3963L096j8803j185J4165J0538p988r894o740j2649Q614J276p460J7158
7843a968K35k2213j3302J5370J3788N955q611M519K376p943k2982p753J2976P597
7829b1956k557R95k8616Q096j0015J5779J6926j1354M712l536J4308K1708K9050
$$ plain form
7816 33540 14996 -19451 -41448 -18488 1909 8677 -3434 -30459 -29300 -26403 -17723 7968 286
7803 286 4206 11401 4010 -10856 -4236 -6331 2866 -13078 -25587 -33932 -10051 13982 11703 21896
7789 21896 28563 -4255 -23456 -16687 -3272 -5557 -17418 -35377 -31709 -36785 -44510 -34578 -12249
7776 -12249 5460 -47 -2082 -10353 -29054 -37128 -25340 -14572 -1920 -2239 8579 -24849 -18920
7763 -18920 13760 14662 7677 9071 -321 -9736 -35313 -50961 -27838 -8070 -1004 10304 -410
7750 -410 -29187 -7013 12216 37232 24510 10960 12425 39422 30144 42302 36586 26945 24185
7737 24185 8565 -22107 -49743 -62251 -52904 -26313 -19294 3735 10942 -7390 -7045 15660 18493
7724 18493 -19547 -31200 -27814 -46724 -39631 -27410 -10899 -1683 7556 -21475 -9857 6954 5394
$$ packed form
7816C3540j8544l4447k1997K2960K0397O768j2111k7025J159K897Q680K5691p682
7803B86L920P195p391j4866O620k095R197j5944j2509q345K3881K4033k279J0193
7789B1896O667l2818j9201O769J3415k285j1861j7959L668n076p725R932K2329
7776a2249J7709n507k035q271j8701q074J1788J0768J2652l19J0818l3428N929
7763a8920L2680R02o985J394r392r415k5577j5648K3123J9768P066J1308j0714
7750d10k8777K2174J9229K5016j2722j3550J465K6997r278J2158n716r641k760
7737B4185j5620l0672k7636j2508R347K6591P019K3029P207j8332L45K2705K833
7724A8493l8040j1653L386j8910P093J2221J6511R216R239k9031J1618J6811j560
$$ plain form
7711 5394 -31785 -34446 -19574 -5264 -2106 -19330 -60532 -69984 -48076 -36448 -10062 2205 -14420
7698 -14420 -21118 4007 446 18412 35752 29968 5953 12366 17043 -1836 -18818 70 5934
7685 5934 -12263 -594 -12563 -12699 -12953 -26431 -28027 -29547 -2507 17468 9469 14619 -8113 -14467
7671 -14467 22446 31218 20820 38986 34796 2055 -17056 -10367 -1066 -8079 -22362 -33608 -6119
7658 -6119 -7574 -10013 10885 23153 -6883 -28211 -40760 -33468 -10935 -10738 -4164 -11775 -14738 -20483
7644 -20483 -34234 -29660 -38560 -31322 -18520 -19816 -1407 -1405 -10378 8770 35364 36475 11642 6829
7630 6829 -1823 15589 32616 34251 -1829 -18664 -27873 -3784 -4873 -4117 7050 -20179 -10581
7617 -10581 -13746 -39228 -44045 -40590 -29623 -19860 -2803 -28926 -34688 -20770 -13663 -7554 -8641
$$ packed form
7711E394l7179k661J4872J4310L158j7224m1202r452K1908J1628K6386J2267j6625
7698a4420o698K5125l561J7966J7340n784k4015O413M677j8879j6982J8888N864
7685E934j8197J1669j1969j36k54j3478j596j520K7040J9975p999N150k2732o354
7671a4467L6913Q772j0398J8166m190l2741j9111O689R301p013j4283j1246K7489
7658f119j455k439K0898J2268l0036k1328j2549P292K2533J97O574p611k963n745
7644b0483j3751M574q900P238J2802j296J8409Kq973J9148K6594J111k4833m813
7630F829q652J7412J7027J635l6080j6835r209K4089j089P56J1167k7229R598
7617a0581l165k5482m817L455J0967R763J7057k6123n762J3918P107O109j087
$$ plain form
7604 -8641 -9342 -16150 -19963 -25921 -27198 -38816 -25481 -2518 18075 4833 -21521 -49923 -52431
7591 -52431 -1026 24410 -1445 -25883 -18056 -7676 2043 40650 39175 3100 219 -5737 -25404
7578 -25404 -14723 6829 7092 6333 23634 -4336 -21109 -41426 -36503 -27159 -8197 -12905 -16667
7565 -16667 -11621 7509 16680 -5604 -15937 -3967 -2789 -21426 -31966 -49058 -64367 -32504
7553 -32504 -10205 -20435 -42262 -28796 -1763 864 11938 61855 65085 22904 20683 35111
7541 35111 15586 -5719 12268 9461 -3310 -11944 -13688 -6743 1607 -10693 -26356 -50994 -48644
7528 -48644 -23285 -10855 -31817 -28680 -14258 -9269 -2309 4048 13011 25374 3489 -23928 -26731
7515 -26731 -18743 3153 18869 14160 -1675 -3399 1922 5351 625 2077 -15079 -16721 -6520
$$ packed form
7604h641p01o808l813n958j277j1618J3335K2963K0593j3242k6354k8402k508
7591e2431N1405K5436k5855k4438P827J0380R719L8607j475l6075k881n956j9667
7578b5404J0681K1552K63p59J7301k7970j6773k0317M923R344J8962m708l762
7565a6667N046J9130R171k2284j0333J1970J178j8637j0540j7092j5309L1863
7553c2504K2299j0230k1827J3466K7033K627J1074M9917L230m2181k221J4428
7541C5111j9525k1305J7987k807j2771q634j744O945Q350j2300j5663k4638K350
7528d8644K5359J2430k0962L137J4422M989O960O357Q963J2363k1885k7417k803
7515b6731P988K1896J5716m709j5835j724N321L429m726J452j7156j642J0201
$$ plain form
7502 -6520 -15594 -32556 -26178 -29684 -12003 -21993 -25426 -24966 -14019 -1510 202 -2938 -25249 -32536
7488 -32536 -32464 -6929 -14786 -12962 4269 -31202 -49761 -44624 -54427 -42567 -30708 -35386 -25075
7475 -25075 -9036 1747 -28693 -49296 -42763 -15563 13205 20403 13370 -20117 -34573 -33635 -47643
7462 -47643 -41350 -33777 -24129 -8130 -23610 -17419 8741 7558 8597 -2500 -25647 -49538 -27282
7449 -27282 -41614 -55647 -41843 -31332 -20626 -2685 13421 25546 22919 1062 -16527 -22111
7437 -22111 -20370 6308 -8285 -24004 -20919 5364 14442 -27326 -37725 -27815 -35774 -28524 -36386
7424 -36386 -47125 -55165 -46184 -38221 -5889 9976 23186 26912 34543 29188 44730 57176 23879
7411 23879 7240 43472 38415 -6113 -9305 391 15104 20728 31165 20342 5466 13686 -10172
$$ packed form
7502f520r074j6962O378l506J7681r990l433M60J0947J2509J712l140k2311p287
7488c2536P2K5535p857J824J7231l5471j8559N137r803J1860J1859m678J0311
7475b5075J6039J0783l0440k0603O533K7200K8768P198p033l3487j4456R38j4008
7462d7643O293P573R648J5999j5480O191K6160j183J039j1097k3147k3891K2256
7449b7282j4332j4033J3804J0511J0706J7941J6106J2125k627k1857j7589n584
7437b2111J741K6678j4593j5719L085K6283R078m1768j0399R910p959P250p862
7424c6386j0739q040Q981P963L2332J5865J3210L726P631n355J5542J2446l3297
7411B3879j6639L6232n057m4528l192R696J4713N624J0437j0823j4876Q220k3858
$$ plain form
7398 -10172 -31997 -40576 -68389 -50860 -47879 -27655 -2880 -8752 -9717 -21491 -38564 -49356 -48488
7385 -48488 -75745 -47197 -4772 -7892 -21245 -27600 -24829 -8777 -20546 -15624 -6475 -3736 14855
7372 14855 22346 17638 5414 -30708 -39788 -7476 7794 -3525 1991 -4362 -12308 -22317 -15356
7359 -15356 -22996 -21335 -13357 -29901 -16462 -5061 -18682 -2208 -561 -7056 -22926 -21403 -14135
7346 -14135 -2238 16183 -5078 -20216 -31648 -14114 6257 13275 7841 -7899 -10468 1878
7334 1878 -2550 -23168 921 9022 19115 8833 -29109 -36969 9316 23477 -89 -9436 12743
7321 12743 11535 100 15 6963 -21316 -27555 -9055 4711 6087 11632 -14967 -49431 -43805 -59923
7307 -59923 -65231 -32227 1168 -2323 8958 29901 19193 9978 -661 -12470 405 5352 7044
$$ packed form
7398a0172k1825q579k7813J7529K981K0224K4775n872r65j1774j7073j0792Q68
7385d8488k7257K8548M2425l120j3353o355K771J6052j1769M922R149K739J8591
7372A4855P491m708j2224l6122r080L2312J5270j1319N516o353p946j0009O961
7359a5356p640J661P978j6544J3439J1401j3621J6474J647o495j5870J523P268
7346a4135J1897J8421k1261j5138j1432J7534K0371P018n434j5740k569J2346
7334A878m428k0618K4089Q101J0093j0282l7942p860M6285J4161k3566r347K2179
7321A2743j208j1435q5O948k8279o239J8500J3766J376N545k6599l4464N626j6118
7307e9923n308L3004L3395l491J1281K0943j0708r215j0639j1809J2875M947J692
$$ plain form
7294 7044 -21203 -12920 -5755 -4247 2206 10518 -4704 -7102 28637 26421 -11160 -21844 -10555
7281 -10555 -22443 -4331 -4956 -14118 -29125 -26021 -42770 -31780 -21860 1904 37275 43674 52576
7268 52576 35019 16226 30290 25636 33809 22891 4408 -3082 -18660 -40621 -46136 -61176 -10047
7255 -10047 13404 -1405 2883 16087 9483 23165 20267 -19311 -47339 -56770 -52627 -55702 -29361
7242 -29361 -17119 -36239 -44436 -34220 2565 15169 22175 18317 27362 9209 -312 -16199 5077
7229 5077 23763 36437 29250 -3075 7107 14338 10929 7423 5634 5813 8480 4349 1635 26102
7215 26102 27462 21785 7377 -13916 -30569 -32065 -49290 -29975 6503 11871 -14543 -30727 -4173
7202 -4173 23804 36796 23348 24529 24938 18936 -72 -26857 -37682 -17476 -17438 710 -6599 -17522
$$ packed form
7294G044k8247Q283P165J508O453Q312j5222k398L5739k216l7581j0684J1289
7281a0555j1888J8112o25r162j5007L104j6749J0990R920K3764L5371O399Q902
7268E2576j7557j8793J4064m654Q173j0918j8483p490j5578k1961n515j5040N1129
7255a0047K3451j4809M288J3204o604J3682k898l9578k8028r431M143l075K6341
7242b9361J2242j9120q197J0216L6785J2604P006l858R045j8153r521j5887K1276
7229E077J8686J2674p187l2325J0182P231l409l506j789J79K667m131k714K4467
7215B6102J360n677j4408k1293j6653j496j7225J9315L6478N368k6414j6184K6554
7202d173K7977J2992j3448J181M09o002j9008k6785j0825K0206L8J8148p309j0923
$$ plain form
7188 -17522 -16118 2796 13657 24016 33785 33729 16279 -11321 -40602 -48663 -45104 -15332 -19844
7175 -19844 -47498 -54470 -25337 -10451 -12286 -5451 10149 1930 -25758 -29098 -7870 8976 -20238
7162 -20238 -40970 -18565 3378 1036 -3815 5357 -6895 -30330 -28181 -10659 -43707 -60805 -35921
7149 -35921 -38076 -18489 -11263 -17126 5982 13835 -6713 -38348 -56403 -24951 -5442 -1232 -8310
7136 -8310 1362 -9571 -25899 -937 11767 -2931 -9776 237 21953 32617 12721 -1658
7124 -1658 15439 17601 9 1489 -31439 -68574 -76353 -29484 2459 -8286 -24659 -54419 -61783
7111 -61783 -54466 -46821 -35944 -6980 -4688 -14712 -18977 -19371 -18165 -21250 -26752 -10852 -16090 -17602
7097 -17602 -32923 -68455 -37457 -14371 9482 -7499 -2927 8237 24431 12692 1978 -2820
$$ packed form
7188a7522J404J8914J0861J0359R769n6j7450k7600k9281q061L559K9772m512
7175a9844k7654o972K9133J4886j835O835J5600q219k7688l340K1228J6846k9214
7162b0238k0732K2405K1943k342m851R172j2252k3435K149J7522l3048j7098K4884
7149c5921k155J9587P226n863K3108P853k0548l1635j8055L1452J9509M210p078
7136h310R672j0933j6328K4962J2704j4698o845J0013K1716J0664j9896j4379
7124a658J7097K162j7592J480l2928l7135p779M6869L1943j0745j6373k9760p364
7111f1783P317P645J0877K8964K292j0024m265l94J206l085n502J5900n238j512
7097a7602j5321l5532L0998K3086K3853j6981M572J1164J6194j1739j0714m798
$$ plain form
7085 -2820 -6152 -19590 -12751 -21305 -44088 -18104 -15544 -10858 -17795 -25650 -17618 -14556 -31956 -26155
7071 -26155 -26851 -40814 -34433 -16929 -10871 -31078 -28742 -8226 20281 5667 -2422 -3205 -18450
7058 -18450 -39418 -31541 -42696 -50595 -43962 -50787 -39183 -47246 -47872 -49733 -44857 -30900 -43774 -53264
7044 -53264 -32004 -21098 -1283 -4922 -21564 -36343 -39901 -41855 -42760 -25623 -33337 -39766 -29867
7031 -29867 -2808 35073 26245 -4282 -17696 -5237 13641 7299 -28287 -41542 -37987 -30088 -31740
7018 -31740 -24225 -7830 -17250 4113 27257 9282 -25665 -17845 -2566 14196 37020 14808
7006 14808 -27427 -39344 -35570 -25046 -16221 -18834 -34695 -43550 -48237 -30516 -26811 -33919 -22758
6993 -22758 -26603 -13353 -24198 -3933 -2045 -4989 -14263 -12048 -21339 -36185 -24470 -21602 -37612
$$ packed form
7085b820l332j3438O839q554k2783K5984K560M686o937p855Q032L062j7400N801
7071b6155o96j3963O381J7504O058k0207K336K0516K8507j4614q089p83j5245
7058a8450k0968P877j1155p899O633o825J1604q063o26j861M876J3957j2874r490
7044e3264K1260J0906J9815l639j6642j4779l558j954r05J7137p714o429R899
7031b9867K7059L7881q828l0527j3414J2459J8878o342l5586j3255L555P899j652
7018c1740P515J6395r420K1363K3144j7975l4947P820J5279J6762K2824k2212
7006A4808m2235j1917L774J0524Q825k613j5861q855m687J7721L705p108J1161
6993b2758l845J3250j0845K0265J888k944r274K215r291j4846J1715K868j6010
$$ plain form
6980 -37612 -27824 -8314 4403 18267 1347 -24146 -17601 -5500 164 3948 12977 34591 37821
6967 37821 72257 70827 40103 7198 -19694 -13326 25667 34409 3585 -36460 -50367 -40501 -12689
6954 -12689 -21562 -15623 11510 -2900 -25879 -25728 -26543 -34266 -25741 -4871 -385 -12469 -22589 -15780
6940 -15780 -20977 -48895 -67754 -72065 -79350 -51683 -28129 -34384 -41596 -27775 -31949 -32109 -36379 -42513
6926 -42513 -46251 -33367 5461 24676 33819 39094 24624 15162 7389 -1207 -1904 -2051 -7554 -13356
6912 -13356 -17324 -36643 -38184 -7072 2371 10921 6773 -4166 -7712 -7306 6277 25218 31381 31086
6898 31086 22089 30014 54345 54895 21382 -11348 -10348 -2843 7376 -12036 -9587 -4426 -35397
6885 -35397 -40912 -37635 -43513 -42189 -42698 -31964 -12659 -9068 12246 -11920 -50371 -36630 4008
$$ packed form
6980c7612R788J9510J2717J3864j6920k5493O545J2101N664L784R029K1614L230
6967C7821L4436j430l0724l2905k6892O368L8993Q742l0824m0045j3907R866K7812
6954a2689q873N939K7133j4410k2979J51q15p723Q525K0870M486j2084j0120O809
6940a5780n197k7918j8859m311p285K7667K3554o255p212J3821m174j60m270o134
6926d2513l738J2884L8828J9215R143N275j4470r462p773q596o97j47n503n802
6912a3356l968j9319j541L1112R443Q550m148j0939l546M06J3583J8941O163k95
6898C1086q997P925K4331N50l3513l2730J000P505J0219j9412K449N161l0971
6885c5397n515L277n878J324n09J0734J9305L591K1314k4166l8451J3741M0638
$$ plain form
6872 4008 14232 3262 -8644 -7580 -13478 -12521 -2349 -8818 6197 6107 12282 -1841 -16046 4356
6858 4356 -6663 -8885 10986 -2423 -10463 -4490 -15695 -35527 -40719 -51548 -36968 -33654 -26684
6845 -26684 -7426 21323 2683 -7588 9352 11619 14014 41565 34655 3183 -10538 -20771
6833 -20771 -23320 -19157 -8558 -15049 -24171 -30976 -20286 -22471 -21748 -40912 -24590 -24840 -28260 -26196
6819 -26196 -36319 -42356 -60512 -74775 -48115 -20780 -34510 -12509 10800 -8373 -7210 -18203
6807 -18203 -17117 -20122 -7260 9369 8622 -3318 -23763 -19341 -10712 -3636 18177 30726 17578
6794 17578 8244 -1993 -20650 -11980 8219 13039 16854 3011 -7567 -2375 -15784 -14075 -21761
6781 -21761 -21104 -269 5029 7651 110 -18982 -22591 -40091 -35940 -26965 -37402 -52774 -47506 -65513
$$ packed form
6872D008J0224j0970j1906J064n898R57J0172o469J5015r0O175j4123j4205K0402
6858D356j1019k222J9871j3409q040N973j1205j9832n192j0829J4580L314O970
6845b6684J9258K8749j8640j0271J6940K267K395K7551o910l1472j3721j0233
6833b0771k549M163J0599o491r122o805J0690k185P23j9164J6322k50l420K064
6819b6196j0123o037j8156j4263K6660K7335j3730K2001K3309j9173J163j0993
6807a8203J086l005J2862J6629p47j1940k0445M422Q629P076K1813J2549j3148
6794A7578r334j0237j8657Q670K0199M820L815j3843j0578N192j3409J709p686
6781b1761O57K0835N298K622p541j9092l609j7500M151Q975j0437j5372N268j8007
$$ plain form
6767 -65513 -100013 -80041 -21210 27001 35985 50723 39909 23930 -3843 2478 9248 -15347
6755 -15347 -18433 -25713 -21465 -37132 -51233 -21709 -16298 -39779 -54807 -51417 -46443 -44499 -50916
6742 -50916 -33680 -33417 -22677 -28862 -20339 -4930 -19236 -41511 -39133 -25564 -24982 -4458 12223
6729 12223 14272 3052 -19446 -17142 -3261 -1707 16146 2479 -10936 -3763 3366 2761 11838
6716 11838 11455 13413 28039 26097 11148 72 23278 40019 11893 -6172 -25376 -32684 -31615
6703 -31615 -5853 -17654 -39518 -22061 -21352 -20692 -21930 2360 9832 8858 14342 11642 215 7836
6689 7836 2391 5524 28400 13230 12691 21786 5126 -1775 1262 12502 4522 3371 8290 16911
6675 16911 -6561 -13392 -24363 -33236 -20844 2787 12156 -19471 -38058 -32409 -26920 -5669 9678
$$ packed form
6767f5513l4500J9972N8831M8211Q984J4738j0814j5979k7773O321O770k4595
6755a5347l086p280M248j5667j4101K9524N411k3481j5028L390M974J944o417
6742e0916J7236K63J0740o185Q523J5409j4306k2275K378J3569N82K0524J6681
6729A2223K049j1220k2498K304J3881J554J7853j3667j3415P173P129o05R077
6716A1838l83J958J4626j942j4949j1076K3206J6741k8126j8065j9204p308J069
6703c1615K5762j1801k1864J7457P09O60j238K4290P472r74N484k700j1427P621
6689G836n445L133K2876j5170n39R095j6660o901L037J1240p980j151M919Q621
6675A6911k3472o831j0971q873J2392K3631R369l1627j8587N649N489K1251J5347
$$ plain form
6662 9678 -15740 -12155 -3557 -21675 -19782 -12216 4908 22022 8986 -4609 -7932 5277 16521
6649 16521 16874 17337 -3673 -4992 -13270 -33872 -30494 -22127 -29042 -45108 -34120 -11285 -14891 -22423
6635 -22423 14951 46076 38392 52048 36508 24767 -31 -25350 -30661 -16844 -19546 -33654
6623 -33654 -36030 -23829 -8891 -3859 -18863 9093 -4129 -10540 18470 25647 11665 7427 13696
6610 13696 -2535 -23336 -17741 -20354 -32372 -13145 1444 -3208 -34721 -69074 -70617 -48418 -43762
6597 -43762 -41377 -34078 -16702 -18740 -11375 -547 -265 -11892 12938 28646 20594 -6434 -36853
6584 -36853 22616 15475 -39488 -35905 -32943 -43106 -24873 -19967 1136 8122 -33626 -34343 -15524
6571 -15524 470 -24128 -2824 29329 -8621 -9707 5421 17970 21088 12548 -7129 -5967 -16342
$$ packed form
6662I678k5418L585Q598j8118J893P566J7124J7114j3036j3595l323J3209J1244
6649A6521L53M63k1010j319q278k0602L378Q367o915j6066J0988K2835l606p532
6635b2423L7374L1125p684J3656j5540j1741k4798k5319n311J3817k702j4108
6623c3654k376J2201J4938N032j5004K7956j3222o411K9010P177j3982m238O269
6610A3696j6231k0801N595k613j2018J9227J4589m652l1513l4353j543K2199M656
6597d3762K385P299J7376k038P365J0828K82j1627K4830J5708q052k7028l0419
6584c6853N9469p141n4963L583K962j0163J8233M906K1103O986m1748p17J8819
6571a5524J5994k4598K1304L2153l7950j086J5128J2549L118q540j9677J162j0375
$$ plain form
6558 -16342 -26621 -15720 -16032 -33355 -1278 37086 65855 45854 -10452 -37623 -29884 -18688
6546 -18688 -32743 -56383 -43037 -11785 -1500 16784 21496 -15841 -39921 -14633 30674 64386
6534 64386 47659 26798 27246 25404 30523 24410 29867 20786 -32066 -57429 -31364 7688 16161
6521 16161 -465 -17066 -29059 -32787 -49161 -23637 27868 53197 65058 53173 56834 67125
6509 67125 30246 -8627 -18938 -8020 1111 14734 16166 15852 17872 -137 -4319 -36813 -47445
6496 -47445 -35545 -16500 -11811 -30630 -38356 -25908 -29599 -25837 -36419 -31768 -10194 17204 10495
6483 10495 -4090 -14195 -22277 -13255 -25212 -27750 -32477 -26791 -38382 -36420 -22552 -21927 -17244 -20868
6469 -20868 -3297 -20433 -36921 -61319 -57061 -21779 978 -5222 -29979 -17387 -10963 -29603
$$ packed form
6558a6342j0279J0901l12j7323L2077L8364K8769k0001n6306k7171P739J1196
6546a8688j4055k3640J3346L1252J0285J8284M712l7337k4080K5288M5307L3712
6534F4386j6727k0861M48j842N119o113N457r081n2852k5363K6065L9052Q473
6521A6161j6626j6601j1993l728j6374K5524N1505K5329J1861j1885L661J0291
6509F7125l6879l8873j0311J0918R131J3623J432l14K020j8009m182l2494j0632
6496d7445J1900J9045M689j8819p726J2448l691L762j0582M651K1574K7398o709
6483A0495j4585j0105q082R022j1957k538m727N686j1591J962J3868O25M683l624
6469b0868J7571j7136j6488k4398M258L5282K2757o200k4757J2592O424j8640
$$ plain form
6457 -29603 -40632 1829 8303 -5947 -27996 -12222 -14766 -15332 -15231 -7676 8787 -9869 -22119
6444 -22119 -33203 -15796 -17140 -19202 -39467 -51673 -40357 -54949 -67054 -70807 -74484 -47024 -28178
6431 -28178 -27860 -29554 -42006 -47701 -33181 -11946 -40988 -45284 -32553 -33524 -45055 -1939 37141
6418 37141 39448 9877 -2298 -7362 1105 21445 8157 -1600 -33325 -38685 -46927 -49228 -42367
6405 -42367 -32446 -19307 692 30627 34744 10516 -12569 -27424 -30135 -38895 -44433 -58353 -52303
6392 -52303 -39981 -36544 -5000 9639 3289 14374 17760 7471 -26122 -23482 -12713 8587 16873
6379 16873 16752 -2885 -11090 -19485 -8172 -10827 596 -8566 -38527 -56553 -57887 -42319 -43321
6366 -43321 -17317 -453 -17451 -34605 -7747 4169 -23483 -23293 -2976 -3670 -2495 -4239 7009
$$ packed form
6457b9603j1029M2461O474j4250k2049J5774k544n66J01P555J6463j8656j2250
6444b2119j1084J7407j344k062k0265j2206J1316j4592j2105l753l677K7460J8846
6431b8178L18j694j2452n695J4520K1235k9042m296J2731r71j1531M3116L9080
6418C7141K307k9571j2175n064Q467K0340j3288r757l1725n360q242k301O861
6405d2367R921J3139J9999K9935M117k4228k3085j4855k711q760n538j3920O050
6392e2303J2322L437L1544J4639o350J1085L386j0289l3593K640J0769K1300Q286
6379A6873j21j9637q205q395J1313k655J1423r162k9961j8026j334J5568j002
6366d3321K6004J6864j6998j7154K6858J1916k7652J90K0317o94J175j744J1248
$$ plain form
6353 7009 5453 34512 37047 39709 40575 32783 25527 -192 2283 33452 36940 21743 -8709 -34384
6339 -34384 -17607 10183 32912 26307 -2865 -14104 -9552 -9741 -15780 10805 23151 -6138 -28543
6326 -28543 -45362 -24076 -10009 19787 36389 11943 -1791 16878 19799 21538 13484 -4902
6314 -4902 12242 20532 20040 1089 1898 24910 15490 9516 17085 7735 -14581 -16217 -43448 -49001
6300 -49001 -27087 1651 5624 -9903 -32129 -13917 31757 32361 -18279 -43034 -52402 -19618 8486
6287 8486 898 -9306 -3224 6983 -5949 -11865 -27589 -47601 -35099 -16694 -4623 -20820 -45643
6274 -45643 -30763 -25533 -30367 -16709 5705 13056 -4435 -4809 -5828 -21072 -42375 -39016 -3830
6261 -3830 8833 -15114 -33248 -21109 -27479 -34523 -34996 -26380 -33223 -39817 -20776 -38297 -39651 -29558
$$ packed form
6353G009j556K9059K535K662Q66p792p256k5719K475L1169L488j5197l0452k5675
6339c4384J6777K7790K2729o605k9172j1239M552j89o039K6585J2346k9289k2405
6326b8543j6819K1286J4067K9796J6602k4446j3734J8669K921J739q054j8386
6314d902J7144Q290m92j8951Q09K3012r420n974P569r350k2316j636k7231n553
6300d9001K1914K8738L973j5527k2226J8212M5674O04n0640k4755r368L2784K8104
6287H486p588j0204O082J0207j2932n916j5724k0012J2502J8405J2071j6197k4823
6274d5643J4880N230m834J3658K2414P351j7491l74j019j5244k1303L359L5186
6261c830J2663k3947j8134J2139o370p044m73Q616o843o594J9041j7521j354J0093
$$ plain form
6247 -29558 -20991 -14102 -11638 -7486 -36694 -50733 -28674 -33 4932 4199 -9667 10745 11208 520
6233 520 11596 12437 -30993 -33224 -20780 -7965 9776 -9362 -17685 -7599 9994 19634 15027
6220 15027 19894 3784 -13583 -5519 5101 13875 3736 1944 16242 11474 19371 27544 20371
6207 20371 3230 -10181 -34649 5802 34372 14288 -21016 -13312 -6747 -3209 6045 12362 10470
6194 10470 12579 -4983 -6297 11540 28888 30819 24740 11203 11579 17517 1116 -17650 -28580
6181 -28580 -24696 -15064 11273 21968 7479 3965 13624 27546 35139 1042 -37194 -46624 -39256
6168 -39256 -37302 -37508 -43712 -40864 -20038 12704 7916 15058 13916 8454 26266 32325 44780 20035
6154 20035 14838 15215 19066 29320 3793 -12144 5911 32228 35476 26311 24632 676 -14296
$$ packed form
6247b9558Q567O889K464M152k9208j4039K2059K8641M965p33j3866K0412M63j0688
6233E20J1076Q41m3430k231J2444J2815J7741j9138q323J0086J7593R640m607
6220A5027M867j6110j7367Q064J0620Q774j0139j792J4298m768P897Q173p173
6207B0371j7141j3411k4468M0451K8570k0084l5304P704O565L538R254O317j892
6194A0470K109j7562j314J7837J7348J931o079j3537L76N938j6401j8766j0930
6181b8580L884R632K6337J0695j4489l514R659J3922P593l4097l8236r430P368
6168c9256J954k06o204K848K0826L2742m788P142j142n462J7812O059J2455k4745
6154B0035n197L77L851J0254k5527j5937J8055K6317L248r165j679k3956j4972
$$ plain form
6141 -14296 -5309 10252 33592 22174 18223 30110 22823 -3770 -17493 -14554 -11050 18306 26572
6128 26572 2794 -21503 -38207 -36768 -23675 -25547 -35751 -45885 -23563 1078 14010 13177 1273
6115 1273 -19318 -22731 -30660 -19523 4541 -6369 -34393 -35430 -8266 11735 -240 -20973 -28776
6102 -28776 -50605 -43457 -35602 -36766 -54566 -40650 -15855 -18651 -38832 -21540 18196 -7387 12627
6089 12627 8281 9231 4030 -24646 -6360 -2219 -34976 -52768 -49940 -48375 -37872 -24499 -34180
6076 -34180 -52540 -68450 -46453 -19914 -18366 -5180 -1136 12335 -2178 19516 21549 5104
6064 5104 26301 56291 74673 54788 26356 -2698 -13998 -28211 -25013 -33471 -30043 -24113 -5823
6051 -5823 4388 26890 14160 15391 9237 -4782 11 25691 47088 24152 32766 32059 31625 28824
$$ packed form
6141a4296Q987J5561K3340j1418l951J1887p287k6593j3723K939L504K9356Q266
6128B6572k3778k4297j6704J439J3093j872j0204j0134K2322K4641J2932q33j1904
6115A273k0591l413p929J1137K4064j0910k8024j037K7164K0001j1975k0733p803
6102b8776k1829P148P855j164j7800J3916K4795k796k0181J7292L9736k5583K0014
6089A2627m346R50n201k8676J8286M141l2757j7792K828J565J0503J3373r681
6076c4180j8360j5910K1997K6539J548J3186M044J3471j4513K1694K033j6445
6064E104K1197K9990J8382j9885k8432k9054j1300j4213L198q458L428N930J8290
6051e823J0211K2502j2730J231o154j4019M793K5680K1397k2936Q614p07m34k801
$$ plain form
6037 28824 31166 15044 -18166 -38214 -42714 -53652 -48542 4539 20764 2727 -18149 -19544 -34108
6024 -34108 -18007 -10848 2144 -1215 -11084 -28526 -19734 -9147 -13955 -21758 -25953 -22860 -6179
6011 -6179 -4702 -1982 19584 14958 4685 -3199 3564 -11493 -23271 -27683 -39484 -31621 -32168 -10530
5997 -10530 9366 3349 4783 14451 19302 10359 -8838 29053 29803 13974 37386 45986 17119
5984 17119 7063 -12344 -31149 -22483 -33895 -37684 -28785 -22213 -33353 -48616 -48032 -56189 -20959
$$ packed form
6037B8824K342j6122l3210k0048m500j0938N110N3081J6225j8037k0876j395j4564
6024c4108J6101P159J2992l359r869j7442Q792J0587m808p803m195L093J6681
6011f179J477K720K1566m626j0273p884O763j5057j1778m412j1801P863n47K1638
5997a0530J9896o017J434R668M851q943j9197L7891P50j5829K3412Q600k8867
5984A7119j0056j9407j8805Q666j1412l789Q899O572j1140j5263N84q157L5230
$$ [...]
##END NTUPLES=NMR SPECTRUM
##END=
