##TITLE=Analysis number 325624
Compound Code sb 00117
Book Reference 148136
Project Code adrs fraglib
Chemist Name jom
##JCAMPDX= 6.0         $$ Bruker NMR JCAMP-DX V2.0
##DATA TYPE= NMR SPECTRUM
##DATA CLASS= NTUPLES
##ORIGIN= Bruker BioSpin GmbH
##OWNER= nmr
$$ XWIN-NMR		Version 3.5
$$ Fri Jan  5 10:16:39 2007 GMT Standard Time (UT+0h)  MAYBRIDGE\nmr@NMR_250MHZ
##.OBSERVE FREQUENCY= 250.131544655141
##.OBSERVE NUCLEUS= ^1H
##.ACQUISITION MODE= SIMULTANEOUS (DQD)
##.ACQUISITION SCHEME= undefined
##.AVERAGES= 16
##.DIGITISER RES= 18
##SPECTROMETER/DATA SYSTEM= dpx250
##.PULSE SEQUENCE= zg30
##.SOLVENT NAME= CDCl3
##.SHIFT REFERENCE= (INTERNAL, CDCl3, 0, 16.5185)
##AUDIT TRAIL= $$ (NUMBER, WHEN, WHO, WHERE, WHAT)
$$ ##TITLE= Audit trail, XWIN-NMR		Version 3.5
$$ ##JCAMPDX= 5.01
$$ ##ORIGIN= Bruker BioSpin GmbH
$$ ##OWNER= nmr
$$ C:\u/data/dgb/nmr/ADRS/400/pdata/1/auditp.txt
$$ ##AUDIT TRAIL=  $$ (NUMBER, WHEN, WHO, WHERE, WHAT)
(   1,<2007-01-05 10:16:11.29 +000>,<MAYBRIDGE\nmr>,<NMR_250MHZ>,
      <created by zg, POWCHK disabled, PULCHK disabled
       configuration hash MD5:
       49 4B E0 1D 92 C2 6B 37 9F E6 65 BC 52 41 86 1D
       data hash MD5: 64K
       C1 CE AC 78 C7 F3 9E 75 CE 5A 03 44 B5 3F D0 8D>)
(   2,<2007-01-05 10:16:29.77 +000>,<MAYBRIDGE\nmr>,<NMR_250MHZ>,
      <Start of raw data processing
       ef LB = 0.3 FT_mod = 6 PKNL = 1 SI = 32K 
       data hash MD5: 32K
       77 65 A0 C3 53 66 3F 1E C0 24 B1 C0 3A D2 5B 97>)
(   3,<2007-01-05 10:16:31.70 +000>,<MAYBRIDGE\nmr>,<NMR_250MHZ>,
      <apk 
       data hash MD5: 32K
       67 1A FB 9B 69 7B 82 EE B4 FD CC 55 DD FE 2C 3B>)
(   4,<2007-01-05 10:16:32.41 +000>,<MAYBRIDGE\nmr>,<NMR_250MHZ>,
      <abs ABSG = 5 
       data hash MD5: 32K
       0C DD 08 7E 14 C7 B1 BB 64 5C EB B7 9C 58 E8 75>)
$$ ##END=
$$ 
$$ hash MD5
$$ 41 5A E1 E9 85 04 52 12 B2 D2 38 03 C3 2B AD 76
##$RELAX= 
##$RELAX= 
##$RELAX= 
##$RELAX= 
##$RELAX= 
##$RELAX= 
##$RELAX= 
$$ Bruker specific parameters
$$ --------------------------
##$DU= <C:\u>
##$EXPNO= 400
##$NAME= <ADRS>
##$PROCNO= 1
##$TYPE= <nmr>
##$USER= <dgb>
##$AMP= (0..31)
100 100 100 100 100 100 100 100 100 100 100 100 100 100 100 100 100 100 
100 100 100 100 100 100 100 100 100 100 100 100 100 100 
##$AQSEQ= 0
##$AQ_mod= 3
##$AUNM= <au_zg>
##$AUTOPOS= <29 >
##$BF1= 250.13
##$BF2= 250.13
##$BF3= 250.13
##$BF4= 250.13
##$BF5= 500.13
##$BF6= 500.13
##$BF7= 500.13
##$BF8= 500.13
##$BYTORDA= 1
##$CFDGTYP= 0
##$CFRGTYP= 5
##$CHEMSTR= <none>
##$CNST= (0..31)
1 1 145 1 1 1 1 1 1 1 1 1 1 1 1 1 1 1 1 1 1 1 1 1 1 1 1 1 1 1 1 1 
##$CPDPRG= <>
##$CPDPRG1= <>
##$CPDPRG2= <>
##$CPDPRG3= <>
##$CPDPRG4= <mlev>
##$CPDPRG5= <mlev>
##$CPDPRG6= <mlev>
##$CPDPRG7= <mlev>
##$CPDPRG8= <mlev>
##$CPDPRGB= <>
##$CPDPRGT= <>
##$D= (0..31)
0 1 0 0 0 0 0 0 0 0.06 0 0 0 0 0 0 0.0002 0 0 0 0 0 0 0 0 0 0 0 0 0 0 
0 
##$DATE= 1167992170
##$DBL= (0..7)
120 120 120 120 120 120 120 120 
##$DBP= (0..7)
150 150 150 150 150 150 150 150 
##$DBP07= 0
##$DBPNAM0= <>
##$DBPNAM1= <>
$$ [...]
##$SUBNAM7= <"">
##$SUBNAM8= <"">
##$SUBNAM9= <"">
##$SW= 20.6930455092707
##$SWIBOX= (0..15)
0 0 3 0 0 0 0 0 0 0 0 0 0 0 0 0 
##$SW_h= 5175.983436853
##$TD= 65536
##$TD0= 1
##$TE= 294.16
##$TE2= 300
##$TE3= 300
##$TEG= 300
##$TL= (0..7)
0 120 120 120 120 120 120 120 
##$TP= (0..7)
150 150 150 150 150 150 150 150 
##$TP07= 0
##$TPNAME0= <>
##$TPNAME1= <>
##$TPNAME2= <>
##$TPNAME3= <>
##$TPNAME4= <>
##$TPNAME5= <>
##$TPNAME6= <>
##$TPNAME7= <>
##$TPOAL= (0..7)
0.5 0.5 0.5 0.5 0.5 0.5 0.5 0.5 
##$TPOFFS= (0..7)
0 0 0 0 0 0 0 0 
##$TUNHIN= 0
##$TUNHOUT= 0
##$TUNXOUT= 0
##$USERA1= <user>
##$USERA2= <user>
##$USERA3= <user>
##$USERA4= <user>
##$USERA5= <user>
##$V9= 5
##$VALIST= <valist>
##$VCLIST= <CCCCCCCCCCCCCCC>
##$VD= 0
##$VDLIST= <DDDDDDDDDDDDDDD>
##$VPLIST= <PPPPPPPPPPPPPPP>
##$VTLIST= <TTTTTTTTTTTTTTT>
##$WBST= 1024
##$WBSW= 4
##$XGAIN= (0..3)
0 0 0 0 
##$XL= 0
##$YL= 0
##$YMAX_a= 177065
##$YMIN_a= -530448
##$ZGOPTNS= <>
##$ZL1= 120
##$ZL2= 120
##$ZL3= 120
##$ZL4= 120
##$ABSF1= 16.51853
##$ABSF2= -4.174643
##$ABSG= 5
##$ABSL= 3
##$ALPHA= 0
##$AQORDER= 0
##$ASSFAC= 0
##$ASSFACI= 0
##$ASSFACX= 0
##$ASSWID= 0
##$AUNMP= <proc_1d>
##$AZFE= 0.1
##$AZFW= 0.1
##$BCFW= 0
##$BC_mod= 0
##$BYTORDP= 0
##$COROFFS= 0
##$CY= 12.5
##$DATMOD= 1
##$DC= 0
##$DFILT= <>
##$DTYPP= 0
##$F1P= 14.0000005364418
##$F2P= -0.99999901652339
##$FCOR= 0.5
##$FTSIZE= 32768
##$FT_mod= 6
##$GAMMA= 0
##$GB= 0
##$INTBC= 1
##$INTSCL= 1
##$ISEN= 128
##$LB= 0.3
##$LEV0= 0
##$LPBIN= 0
##$MAXI= 10000
##$MC2= 0
##$MEAN= 0
##$ME_mod= 0
##$MI= 0
##$NCOEF= 0
##$NC_proc= -3
##$NLEV= 6
##$NOISF1= 0
##$NOISF2= 0
##$NSP= 0
##$NTH_PI= 0
##$NZP= 0
##$OFFSET= 16.51853
##$PC= 1
##$PHC0= 226.2289
##$PHC1= 1.151546
##$PH_mod= 1
##$PKNL= yes
##$PPARMOD= 0
##$PSCAL= 4
##$PSIGN= 0
##$REVERSE= no
##$SF= 250.130000865727
##$SI= 32768
##$SIGF1= 0
##$SIGF2= 0
##$SINO= 400
##$SIOLD= 32768
##$SREGLST= <1H.CDCl3>
##$SSB= 0
##$STSI= 32768
##$STSR= 0
##$SW_p= 5175.98343685301
##$SYMM= 0
##$S_DEV= 0
##$TDeff= 65536
##$TDoff= 0
##$TI= <Analysis number 999999
Compound Code 99
Book Reference 9
Project Code 9>
##$TILT= no
##$TM1= 0
##$TM2= 0
##$TOPLEV= 0
##$USERP1= <user>
##$USERP2= <user>
##$USERP3= <user>
##$USERP4= <user>
##$USERP5= <user>
##$WDW= 1
##$XDIM= 32768
##$YMAX_p= 572696773
##$YMIN_p= -102085
$$ End of Bruker specific parameters
$$ ---------------------------------
##NTUPLES= NMR SPECTRUM
##VAR_NAME=  FREQUENCY,     SPECTRUM/REAL,   SPECTRUM/IMAG
##SYMBOL=    X,             R,               I
##VAR_TYPE=  INDEPENDENT,   DEPENDENT,       DEPENDENT
##VAR_FORM=  AFFN,          ASDF,            ASDF
##VAR_DIM=   32768,         32768,           32768
##UNITS=     HZ,            ARBITRARY UNITS, ARBITRARY UNITS
##FACTOR=    0.157963299565203, 1,           1
##FIRST=     4131.77989617844, 0,            0
##LAST=      -1044.20354067457, 0,           0
##MIN=       -1044.20354067457, -102085,     0
##MAX=       4131.77989617844, 572696773,    0
$$ Real data points
##PAGE= N=1
##DATA TABLE= (X++(R..R)), XYDATA
$$ [...]
$$ plain form
21407 35997 25620 32291 36082 55518 25215 -2910 -22381 -23291 -36700 -35535 -6998 11790 5856
21394 5856 -14646 -16013 -15479 -7854 -12708 -25234 3298 13186 9170 15586 13881 15513 -6045 -51929
21380 -51929 -53280 -12210 15903 21002 7462 767 5050 5830 13524 25829 21403 4838 -2896
21367 -2896 2144 16657 -23283 -49074 -38069 -11905 14003 30283 15655 -20923 -29152 -15524
21355 -15524 -10349 -5151 -5132 -11718 -30793 -25833 -12542 4911 9765 5230 8411 11228 13163 8948
21341 8948 18818 31922 32651 20064 25970 16237 4081 -2910 132 4589 6296 -24896 -33230 -44859
21327 -44859 -55864 -45255 -30757 7925 53111 54616 58443 49467 35708 -5384 8526 24083
21315 24083 43630 48259 24160 28411 38977 66730 77672 64585 54978 56392 74825 75169 59092
$$ packed form
21407C5997j0377O671L791J9436l0303k8125j9471r10j3409J165K8537J8788n934
21394E856k0502j367N34P625m854j2526K8532R888m016O416j705J632k1558m5884
21380e1929j351M1070K8113N099j3540o695M283P80P694J2305m426j6565p734
21367b896N040J4513l9940k5791J1005K6164K5908J6280j4628l6578q229J3628
21355a5524N175N198J9o586j9075M960J3291J7453M854m535L181K817J935m215
21341H948R870J3104P29j2587N906r733j2156o991L042M457J707l1192q334j1629
21327d4859j1005J0609J4498L8682M5186J505L827q976j3759m1092J3910J5557
21315B4083J9547M629k4099M251J0566K7753J0942j3087r607J414J8433L44j6077
$$ plain form
21302 59092 44995 73411 94378 101229 101227 75744 75547 93886 102884 106426 103268 100681 117221 153237
21288 153237 160363 134467 126184 106710 97767 103666 93639 70877 70669 94788 94697 100632 84270
21275 84270 56571 49192 69783 80602 51024 20241 28117 28475 21597 21496 19310 3134 4348
21262 4348 12043 38229 68113 83040 91353 71007 35007 37115 34676 396 -16474 14462 21215
21249 21215 32680 41819 38532 22991 5179 16672 1026 5631 -581 -5147 344 2474 -15192
21236 -15192 2659 29208 26468 19324 11933 6670 3680 12042 -698 2718 39239 25101 1535
21223 1535 307 18287 31671 16272 13209 -13737 -27754 -10519 -34992 -23935 -8174 154
21211 154 -13619 -9645 20016 30419 11445 9789 19599 35088 10910 15560 24707 9169 -7963
$$ packed form
21302E9092j4097K8416K0967O851kk5483j97J8339Q998L542l158k587J6540L6016
21288A53237P126k5896q283j9474q943N899j0027k2762k08K4119r1N935j6362
21275H4270k7699p379K0591J0819k9578l0783P876L58o878j01k186j6176J214
21262D348P695K6186K9884J4927Q313k0346l6000K108k439l4280j6870L0936O753
21249B1215J1465R139l287j5541j7812J1493j5646M605o212m566N491K130j7666
21236a5192J7851K6549k740p144p391n263k990Q362j2740L416L6521j4138k3566
21223A535j228J7980J3384j5399l063k6946j4017J7235k4473J1057J5761Q328
21211A54j3773L974K9661J0403j8974j656R810J5489k4178M650R147j5538j7132
$$ plain form
21198 -7963 -8186 9368 15016 42691 70143 31984 15510 10268 -8275 -10524 -32384 -66274 -61338
21185 -61338 -17119 20249 32688 34018 27111 25346 17201 35426 43653 61373 84809 91214 112608
21172 112608 136987 165058 210097 246652 261078 274277 295926 278275 228310 192761 161317
21161 161317 116113 104605 97750 87858 78809 77238 80215 73936 67138 85762 78227 70697 56483
21148 56483 64620 80113 73879 54428 49905 48361 15280 -2119 36102 58903 60564 40899 24158
21135 24158 23208 14304 13625 4106 1958 23088 16947 -34 570 1835 20357 10777 -8396 -28504
21121 -28504 -8494 12831 28414 28689 18590 12335 -5225 5040 -1141 10725 25571 22914 6233
21108 6233 2395 -10574 6664 1150 -1192 21677 44759 27684 2847 -5328 -13276 -2808 7488
$$ packed form
21198g963k23J7554N648K7675K7452l8159j6474n242j8543k249k1860l3890M936
21185f1338M4219L7368J2439J330o907j765q145J8225Q227J7720K3436O405K1394
21172A12608K4379K8071M5039L6555J4426J3199K1649j7651m9965l5549l1444
21161A61317m5204j1508o855r892r049j571K977o279o798J8624p535p530j4214
21148E6483Q137J5493o234j9451m523j544l3081j7399L8221K2801J661j9665j6741
21135B4158r50q904o79r519k148K1130o141j6981O04J265J8522r580j9173k0108
21121b8504K0010K1325J5583K75j0099o255j7560J0265o181J1866J4846k657j6681
21108F233l838j2969J7238n514k342K2869K3082j7075k4837q175p948J0468J0296
$$ plain form
21095 7488 15216 42319 32246 20095 -9654 -23240 -18035 -35063 -22005 -18069 -24557 -17859 13117
21082 13117 34200 34612 46511 50582 57573 63663 59097 68245 76506 72549 63917 72678 59316 19204
21068 19204 38889 39045 44742 50570 17499 30630 60153 99918 142891 146976 157913 192793 245494
21055 245494 305930 327961 290985 232455 197374 164369 126868 127685 115874 108948 122720 106684
21043 106684 70372 53120 45106 64816 91331 92251 70738 70095 89766 90289 95599 127086 194286
21030 194286 223971 225011 213772 232074 239563 230650 223352 205213 170336 123557 116920 132435
21018 132435 115712 70823 66726 35701 30530 33766 29678 24927 8870 14893 13640 29899 -3463
21005 -3463 -22616 -33615 -62117 -66275 -32452 -4329 13404 9385 -10422 -4086 28520 26930 20283
$$ packed form
21095G488P728K7103j0073j2151k9749j3586N205j7028J3058L936o488O698L0976
21082A3117K1083M12J1899M071O991O090m566R148Q261l957q632Q761j3362m0112
21068A9204J9685J56N697N828l3071J3131K9523L9765M2973M085J0937L4880N2701
21055B45494O0436K2031l6976n8530l5081l3005l7501Q17j1811o926J3772j6036
21043A06684l6312j7252q014J9710K6515R20k1513o43J9671N23N310L1487O7200
21030A94286K9685J040j1239J8302P489q913p298j8139l4877m6779o637J5515
21018A32435j6723m4889m097l1025n171L236m088m751j6057O023j253J6259l3362
21005c463j9153j0999k8502m158L3823K8123J7733m019j9807O336L2606j590o647
$$ plain form
20992 20283 39344 26510 -9470 -19100 -7205 -22146 -7987 11055 -715 -7965 -14688 -10918
20980 -10918 -2585 -16189 -19748 -8289 20636 34829 1810 -31400 -18467 858 13 6148 21568
20967 21568 9254 3216 8270 13936 28830 36558 28818 2372 1080 -9207 -10910 -18206 -30289
20954 -30289 -30827 -5116 10534 15932 19427 35525 32138 17306 23432 36869 18565 6820 -6272
20941 -6272 -8500 -5617 -8998 -49839 -58770 -40453 -23795 -5903 8931 15126 7098 -14842 -17437
20928 -17437 -2761 5503 12091 -12849 -15223 7281 13449 18726 30284 19965 29532 19400 10901
20915 10901 4635 -23372 -33570 -32708 -24020 -32015 -38740 -27677 -10012 151 13697 10689 22050
20902 22050 40447 41130 35797 32150 25404 12542 8878 21694 27197 33657 47102 33177 14217
$$ packed form
20992B0283J9061j2834l5980r630J1895j4941J4159J9042j1770p250o723L770
20980a0918Q333j3604l559J1459K8925J4193l3019l3210J2933J9325q45O135J5420
20967B1568j2314o038N054N666J4894P728p740k6446j292j0287j703p296j2083
20954c0289n38K5711J5650N398L495J6098l387j4832O126J3437j8304j1745j3092
20941f272k228K883l381m0841q931J8317J6658J7892J4834O195q028k1940k595
20928a7437J4676Q264O588k4940k374K2504O168N277J1558j0319R567j0132q499
20915A0901o266k8007j0198Q62Q688p995o725J1063J7665J0163J3546l008J1361
20902B2050J8397O83n333l647o746j2862l664J2816N503O460J3445j3925j8960
$$ plain form
20889 14217 9053 4043 18451 28825 13919 -2682 -26686 -14334 554 14602 3692 -137
20877 -137 -47386 -61635 -51143 -12326 10021 43070 41327 10348 15376 5375 2666 -3997 -12040
20864 -12040 -6281 18564 64489 90424 81873 80863 101820 132035 161191 132859 80907 31733
20852 31733 -12446 -28942 -34694 -27769 -3720 14298 6907 -1368 9834 17985 30376 32355 35348
20839 35348 46359 37357 13192 -6420 -5326 5381 27458 37847 41626 40118 32329 32160 40376
20826 40376 28645 65637 67532 44435 36165 41402 57815 56910 10927 1292 9130 4248 -10038
20813 -10038 -301 11212 21464 5365 -3656 -25056 -23722 -1644 38163 41849 24549 -3348
20801 -3348 -20761 -10257 6979 4679 11702 45510 64182 63956 18541 -4354 4040 -5163 -1427
$$ packed form
20889A4217n164n010J4408J0374j4906j6601k4004J2352J4888J4048j0910l829
20877a37m7249j4249J0492L8817K2347L3049j743l0979N028j0001k709o663q043
20864a2040N759K4845M5925K5935q551j010K0957L0215K9156k8332n1952m9174
20852C1733m4179j6496n752O925K4049J8018p391q275J1202Q151J2391J979K993
20839C5348J1011r002k4165j9612J094J0707K2077J0389L779j508p789j69Q216
20826D0376j1731L6992J895k3097q270N237J6413r05m5983r635P838m882j4286
20813a0038R737J1513J0252j6099r021k1400J334K2078L9807L686j7300k7897
20801c348j7413J0504J7236k300P023L3808J8672k26m5415k2895Q394r203L736
$$ plain form
20788 -1427 4346 7276 -6123 -791 8039 681 -15131 -4840 -8632 -9606 -7474 17496 28117 14300
20774 14300 608 5127 5976 11382 28440 43600 48836 22899 21816 15934 9539 6807 -2769 -113
20760 -113 -22519 -19755 4773 44330 64553 54549 34578 20240 8176 15428 -6178 -11281 -11385
20747 -11385 15426 14450 13343 -15737 -36293 -38959 -30860 -17201 -23059 -17081 -615 1021 -15849
20734 -15849 -42661 -45369 -33696 -37115 -12320 13297 18189 42515 8440 -8156 -26395 -41555
20722 -41555 -55761 -51946 -40062 -34007 -4623 17333 23437 2156 24858 45693 37941 19985
20710 19985 -11916 -25923 -26336 -23873 1458 -3257 -10794 21344 40388 44288 25463 36482 21091
20697 21091 -19704 -44035 -32108 -13483 -29170 -32407 -11619 -8116 -5089 -5323 5437 34347 47802
$$ packed form
20788a427N773K930j3399N332Q830p358j5812J0291l792r74K132K4970J0621j3817
20774A4300j3692M519Q49N406J7058J5160N236k5937j083n882o395k732r576K656
20760a13k2406K764K4528L9557K0223j0004j9971j4338j2064P252k1606n103j04
20747a1385K6811r76j107k9080k0556k666Q099J3659n858N978J6466J636j6870
20734a5849k6812k708J1673l419K4795K5617M892K4326l4075j6596j8239j5160
20722d1555j4206L815J1884O055K9384K1956O104k1281K2702K0835p752j7956
20710A9985l1901j4007m13K463K5331m715p537L2138J9044L900j8825J1019j5391
20697B1091m0795k4331J1927J8625j5687l237K0788L503L027k34J0760K8910J3455
$$ plain form
20684 47802 31516 37235 53451 36278 17436 2222 17660 15141 11085 -12226 -29114 2639
20672 2639 20917 27046 18467 13122 -14104 -25880 -7024 -6249 -317 -7211 22379 69471 76310
20659 76310 40300 16250 7862 -1311 -16432 -15998 36958 67299 38782 10804 11919 39485 66544
20646 66544 68318 27095 5265 -13625 7516 35687 16442 7299 -1721 -15302 -7794 20431
20634 20431 37788 16977 3604 -6629 -55 28003 23597 -9913 -13393 -14491 -24080 -35708 -32681
20621 -32681 -34520 -10830 -10723 -24834 -15026 -17000 -16204 14043 35987 8806 -5246 19252 41266
20608 41266 58042 32062 19558 8543 -18932 -22202 -8204 5394 23515 18070 10430 -24659
20596 -24659 -34527 -18573 -15929 -9728 -8477 -8069 -683 -8589 -26259 -4298 8152 163 -39051
$$ packed form
20684D7802j6286N719J6216j7173j8842j5214J5438k519m056k3311j6888L1753
20672B639J8278O129q579n345k7226j1776J8856P75N932o894K9590M7092O839
20659G6310l6010k4050q388r173j5121M34N2956L0341k8517k7978J115K7566K7059
20646F6544J774m1223k1830j8890K1141K8171j9245r143r020j3581P508K8225
20634B0431J7357k0811j3373j0233O574K8058m406l3510l480j098r589j1628L027
20621c2681j839K3690J07j4111R808j974P96L0247K1944k7181j4052K4498K2014
20608D1266J6776k5980j2504j1015k7475l270J3998J3598J8121n445p640l5089
20596b4659r868J5954K644O201J251M08P386p906j7670K1961J2450p989l9214
$$ plain form
20583 -39051 -65667 -29670 1689 -4757 13677 13001 4579 3952 -18017 -41463 -54625 -36328 -30739
20570 -30739 -43987 -33032 -20377 11470 7525 -9205 1336 26574 27269 25133 -393 -11912
20558 -11912 -2340 -4491 -24380 -33448 -17134 5244 -17941 -33523 -44777 -54013 -22731 -16200 -5389
20545 -5389 9274 27950 32248 248 -11364 3132 19305 16838 1626 11575 41863 46244 26600
20532 26600 37626 32477 8602 -5581 -7984 -23609 -57659 -52543 -25212 -7366 12123 44378
20520 44378 67046 50293 37838 31665 14692 -781 -1431 -23325 -8015 24848 25685 31335 21512
20507 21512 5134 -3008 -8567 -3233 -6542 -8521 -2549 -34864 -25071 -2739 -23087 -11519 -8947
20494 -8947 -32936 -58884 -66450 -37187 8918 7667 13529 21065 18302 12589 8185 -11165 -40769
$$ packed form
20583c9051k6616L5997L1359o446J8434o76q422o27k1969k3446j3162J8297N589
20570c0739j3248J0955J2655L1847l945j6730J0541K5238O95k136k5526j1519
20558a1912R572k151j9889r068J6314K2378k3185j5582j1254r236L1282O531J0811
20545e389J4663J8676M298l2000j1612J4496J6173k467j5212R949L0288M381j9644
20532B6600J1026n149k3875j4183k403j5625l4050N116K7331J7846J9489L2255
20520D4378K2668j6753j2455o173j6973j5473o50k1894J5310L2863Q37N650r823
20507B1512j6378q142n559N334l309j979N972l2315R793K2332k0348J1568K572
20494h947k3989k5948p566K9263M6105j251N862P536k763n713m404j9350k9604
$$ plain form
20481 -40769 -13521 2383 451 -17099 -19214 -22038 -29663 -23984 -36574 -47474 -28044 -19640 -21496
20468 -21496 -24740 -20319 -18301 -50679 -56168 -50483 -42900 -21998 13440 36867 15285 6148 -17067
20455 -17067 -9265 -2739 -6483 19117 26379 19286 10157 -5545 -209 43319 41446 21980 2595
20442 2595 -3574 -15393 -31198 -13732 35137 33538 47060 47554 23871 9612 22237 37334 5928
20429 5928 -21963 -12821 272 -2168 -1393 -5808 -22218 -20616 -34182 -49887 -45817 -31031 13180
20416 13180 26308 10065 4140 18677 21135 12314 832 1772 -7801 -27302 -31472 -39872 -15621
20403 -15621 -2282 17958 3529 -20593 -27106 -21622 -19826 -23130 -14163 -8437 -19848 -27712 -53676
20390 -53676 -59146 -46489 -52994 -55788 -66563 -62584 -52515 -27958 -39717 -31044 -42603 -25752 -18385
$$ packed form
20481d0769K7248J5904j932j7550k115k824p625N679j2590j0900J9430Q404j856
20468b1496l244M421K018l2378n489N685P583K0902L5438K3427k1582r137k3215
20455a7067P802O526l744K5600P262p093r129j5702N336M3528j873j9466j9385
20442B595o169j1819j5805J7466M8869j599J3522M94k3683j4259J2625J5097l1406
20429E928k7891R142J3093k440P75m415j6410J602j3566j5705M070J4786M4211
20416A3180J3128j6243n925J4537K458q821j1482R40r573j9501m170q400K4251
20403a5621J3339K0240j4429k4122o513N484J796l304Q967N726j1411p864k5964
20390e3676n470J2657o505k794j0775L979J0069K4557j1759Q673j1559J6851P367
$$ plain form
20377 -18385 -18383 -7580 -23653 -36921 -16657 -19086 -42203 -42815 -45041 -30609 -23432 -6960 22815
20364 22815 -3125 -14733 -9643 -26210 -18645 2382 -6577 -39799 -40544 -33520 -22012 -9236 -9628
20351 -9628 -13430 -7267 -23232 -2245 16575 4404 -7249 6382 -797 -36972 -58055 -78346
20339 -78346 -92683 -52692 -13036 -2432 8167 -42969 -40163 -35728 -62721 -73673 -40658 -6928
20327 -6928 5961 542 13261 22540 20179 11552 19786 3330 -21941 7351 20418 1545 -47
20314 -47 813 -1673 -2132 -215 -9204 4200 -5928 3048 -16142 2285 -39236 -74533 -73919 -61856
20300 -61856 -44808 -30025 -22794 -29498 -25403 -21656 -24166 -23830 5874 11004 17960 -9188 -11542 -8370
20286 -8370 -7356 -19582 -6830 1952 329 10785 17383 19727 30300 32041 1692 -22835 -27011
$$ packed form
20377a8385KJ0803j6073j3268K0264k429k3117o12k226J4432P177J6472K9775
20364B2815k5940j1608N090j6567P565K1027q959l3222p45P024J1508J2776l92
20351i628l802O163j5965K0987J8820j2171j1653J3631p179l6175k1083k0291
20339g8346j4337L9991L9656J0604J0599n1136K806M435k6993j0952L3015L3730
20327f928J2889n419J2719R279k361q627Q234j6456k5271K9292J3067j8873j592
20314d7Q60k486m59J917q989J3404j0128Q976j9190J8427m1521l5297O14J2063
20300f1856J7048J4783P231o704M095L747k510L36K9704N130O956k7148k354L172
20286h370J014j2226J2752Q782j623J0456O598K344J0573J741l0349k4527m176
$$ plain form
20273 -27011 -29230 -16376 21369 15487 356 -29382 -33147 -10570 -14131 -3433 7281 5140 2865
20260 2865 5051 7435 19234 33037 38519 39856 7322 -36042 -43848 -34160 -10733 -3541 -17391
20247 -17391 -7034 17709 -15681 -55930 -50142 -43254 -32135 -16673 -14238 -33150 -51797 -52740 -57425
20234 -57425 -48515 -44152 -27621 -15331 6271 3389 11190 34834 20016 22614 21088 8406 7621
20221 7621 -21532 -23724 -23670 -19185 -20928 8311 8905 -11019 -52733 -48879 -14726 -13452 -44495 -55328
20207 -55328 -54779 -34094 -20132 -3161 17573 34319 44887 56115 37277 37949 54130 25022
20195 25022 9075 -13021 -19232 -18842 -25062 -29950 -21452 -1395 34807 17963 -13866 -19031 -1048
20182 -1048 20506 26604 32139 21702 11627 -3157 -23766 -35922 1941 10551 16123 29808 14662
$$ packed form
20273b7011k219J2854L7745n882j5131k9738l765K2577l561J0698J0714k141k275
20260B865K186K384J1799J3803N482J337l2534m3364p806R688K3427P192j3850
20247a7391J0357K4743l3390m0249N788O888J1119J5462K435j8912j8647r43m685
20234e7425Q910M363J6531J2290K1602k882P801K3644j4818K598j526j2682p85
20221G621k9153k192N4M485j743K9239N94j9924m1714L854L4153J274l1043j0833
20207e5328N49K0685J3962J6971K0734J6746J0568J1228j8838O72J6181k9108
20195B5022j5947k2096o211L90o220m888Q498K0057L6202j6844l1829n165J7983
20182a048K1554O098N535j0437j0075j4784k0609j2156L7863Q610N572J3685j5146
$$ plain form
20169 14662 25886 38518 55605 32648 -2775 -14951 -4785 11128 5026 19676 9302 -8524
20157 -8524 -12680 -2351 8380 16502 9325 12613 2963 -19351 -21526 69 12633 18301 4490
20144 4490 25513 18132 35406 47986 33064 43427 41477 42749 35046 19860 -7464 -25927 -45759
20131 -45759 -57425 -30142 10902 11768 -995 -6626 -30085 -23271 -27032 -19247 2093 -11870 -5869
20118 -5869 -2911 12834 21094 2761 3356 42433 43044 22692 25053 37512 44160 27134 -25708
20105 -25708 -28572 2396 40757 39848 35930 27079 5392 -13631 -9786 -14524 -937 20487 22448
20092 22448 8156 33650 36145 60940 67075 39223 39559 42417 36384 25490 21736 46454 57403
20079 57403 59404 102253 135359 152594 158872 191513 242417 304701 337356 371090 374254 370829
$$ packed form
20169A4662J1224J2632J7087k2957l5423j2176J0166J5913o102J4650j0374j7826
20157h524m156J0329J0731Q122p177L288r650k2314k175K1595J2564N668j3811
20144D490K1023p381J7274J2580j4922J0363j950J272p703j5186k7324j8463j9832
20131d5759j1666K7283M1044Q66j2763n631k3459O814l761P785K1340j3963O001
20118e869K958J5745Q260j8333N95L9077O11k0352K361J2459O648j7026n2842
20105b5708k864L0968L8361r09l918q851k1687j9023L845m738J3587K1424J961
20092B2448j4292K5494K495K4795O135k7852L36K858o033j0894l754K4718J0949
20079E7403K001M2849L3106J7235O278L2641N0904O2284L2655L3734L164l425
$$ plain form
20067 370829 343136 297602 246128 194202 171178 157844 157021 129566 130165 126675 120449 113004 102609
20054 102609 112194 115238 104855 105247 94196 76924 56712 55157 50156 44343 55172 64353 40213
20041 40213 11192 1759 -3005 20951 53974 75643 81268 94203 99881 91991 81459 68004 54616
20028 54616 89701 96057 77122 77939 86419 62845 52045 64973 73489 90171 96094 79043 70300
20015 70300 84340 101012 85572 78091 104911 92694 80175 79259 140942 145893 145688 172980 203969
20002 203969 220982 258606 294356 359923 414853 414429 415217 376120 361545 322050 245181 204440
19990 204440 176519 148782 118336 94920 77225 76996 71954 96129 83384 88007 101303 76743
19978 76743 75296 72460 75324 67493 48356 42313 56556 50188 66997 51282 48344 50547 59639
$$ packed form
20067C70829k7693m5534n1474n1926k3024j3334q23k7455N99l490o226p445j0395
20054A02609R585L044j0383L92j1051j7272k0212j555n001n813J0829R181k4140
20041D0213k9021r433m764K3956L3023K1669N625J2935N678p890j0532j3455j3388
20028E4616L5085O356j8935Q17Q480k3574j0800J2928Q516J6682N923j7051q743
20015G0300J4040J6672j5440p481K6820j2217j2519r16O1683M951k05K7292L0989
20002B03969J7013L7624L5750O5567N4930m24P88l9097j4575l9495p6869m0741
19990B04440k7921k7737l0446k3416j7695k29n042K4175j2745M623J3296k4560
19978G6743j447k836K864p831j9137o043J4243o368J6809j5715k938K203R092
$$ plain form
19965 59639 78787 63286 42965 73273 95068 95090 63860 73317 100679 91029 74625 64802 49941
19952 49941 73395 77766 50626 34473 35303 35100 43185 30082 35401 29725 30992 43066 49896 78660
19938 78660 81802 67158 56657 63784 60625 46562 51636 59170 63648 49165 8870 10138 36709
19925 36709 80863 75305 37128 42511 68506 71826 87903 100932 79557 76621 101252 78136
19913 78136 65682 67740 52620 77486 85039 48764 15734 46359 87069 73723 63862 74299
19901 74299 89888 88629 68070 30875 14764 14790 19983 42620 32817 22284 50315 46804 37644
19888 37644 40746 31242 30552 37340 27047 36796 46253 27148 26056 24971 32446 31884 29224 41994
19874 41994 30539 14858 7541 -16291 20760 38654 44809 57255 75254 75364 53353 69457
$$ packed form
19965E9639J9148j5501k0321L0308K1795K2l1230R457K7362r650j6404r823j4861
19952D9941K3454M371k7140j6153Q30k03Q085j3103N319n676J267J2074O830K8764
19938G8660L142j4644j0501P127l159j4063N074P534M478j4483m0295J268K6571
19925C6709M4154n558l8177N383K5995L320J6077J3029k1375k936K4631k3116
19913G8136j2454K058j5120K4866P553l6275l3030L0625M0710j3346r861J0437
19901G4299J5589j259k0559l7195j6111K6N193K2637r803j0533K8031l511r160
19888C7644L102r504o90O788j0293R749R457j9105j092j085P475n62k660J2770
19874D1994j1455j5681p317k3832L7051J7894O155J2446J7999J10k2011J6104
$$ plain form
19862 69457 55436 21770 24670 24165 39437 39079 42595 28722 19703 21772 16170 -10121 -2522 14627
19848 14627 -492 -20661 -2687 13852 24989 27873 183 6266 43752 70094 76264 58406
19836 58406 9056 -26685 -29634 -30869 -12265 11022 34283 60949 65456 45977 23991 28906
19824 28906 44349 31415 33944 13825 2545 21734 18014 15683 33615 38724 47024 42698 32515
19811 32515 36160 14181 13496 27646 26169 54525 76858 93371 75256 32742 53259 41084
19799 41084 3313 -12424 4532 13049 17789 20126 11026 20375 39522 34468 6064 19225 34617
19786 34617 22472 5349 -12235 -24508 -41706 -33164 -20546 -23954 -16259 -13917 -10138 -3286 15797
19773 15797 18435 9782 38219 21661 -27 -1691 1517 13518 -93 9995 27876 29790 19546
$$ packed form
19862F9457j4021l3666K900n05J5272l58L516j3873r019K069n602k6291P599J7149
19848A4627j5119k0169J7974J6539J1137K884k7690O083L7486K6342O170j7858
19836E8406m9350l5741k949j235J8604K3287K3261K6666M507j9479k1986M915
19824B8906J5443j2934K529k0119j1280J9189l720k331J7932N109Q300m326j0183
19811C2515L645k1979o85J4150j477K8356K2333J6513j8115m2514K0517j2175
19799D1084l7771j5737J6956Q517M740K337r100R349J9147n054k8404J3161J5392
19786C4617j2145j7123j7584j2273j7198Q542J2618l408P695K342L779O852J9083
19773A5797K638q653K8437j6558k1688j664L208J2001j3611J0088J7881J914j0244
$$ plain form
19760 19546 8100 17339 33739 47027 37646 49572 68825 50928 46911 62917 71040 78953 103874
19747 103874 91858 100703 91172 97708 90115 98253 108919 108718 107124 141950 188327 238683 310750
19734 310750 371833 440648 478348 513715 545568 549742 530748 512209 467447 416441 395042 405686
19722 405686 484098 534762 582316 595606 566476 531286 453286 371665 316605 256793 210559
19711 210559 181927 189189 157121 130809 131144 120207 71406 44754 44858 60294 89439 54182
19699 54182 38015 57397 52753 47679 42976 56130 51952 41012 39044 48237 67295 42696 37728
19686 37728 64631 65279 48754 42581 17992 5559 -4093 3283 17495 32120 52702 21964 14731
19673 14731 30291 6593 18722 31188 14954 5739 22900 49117 63152 80941 52161 9777
$$ packed form
19760A9546j1446R239J6400J3288r381J1926J9253j7897m017J6006Q123P913K4921
19747A03874j2016Q845r531O536p593Q138J0666k01j594L4826M6377N0356P2067
19734C10750O1083O8815L7700L5367L1853M174j8994j8539m4762n1006k1399J0644
19722D05686P8412N0664M7554J3290k9130l5190p8000q1621n5060n9812m6234
19711B10559k8632P262l2068k6312L35j0937m8801k6652J04J5436K9145l5257
19699E4182j6167J9382m644n074m703J3154m178j0940j968R193J9058k4599m968
19686C7728K6903O48j6525o173k4589j2433r652P376J4212J4625K0582l0738p233
19673A4731J5560k3698J2129J2466j6234r215J7161K6217J4035J7789k8780m2384
$$ plain form
19661 9777 27681 32225 17910 20934 27081 13455 -6527 -17410 -2797 35945 35849 42115 29795
19648 29795 11037 10055 20766 34412 30953 42917 42419 50853 44109 28531 8184 1051 -3850
19635 -3850 -17586 -2438 3110 28507 8948 -18163 -25780 -22638 -30622 -17575 19704 36071 9446
19622 9446 -14781 9356 9677 14233 4847 -8193 -11822 -9332 -35295 -39831 -29760 -26343 -46137
19609 -46137 -24068 16186 21824 12817 3254 27657 19310 5937 19158 3767 -15759 -23365 -41615
19596 -41615 -22138 -15804 -8209 19918 24346 16918 15489 8973 18169 24200 39423 -4280 -49131
19583 -49131 -56052 -41067 -14925 -24804 -1680 12459 36337 19127 -4948 -33127 -46674 -50658
19571 -50658 -43938 -24443 -11732 -14626 -11187 2295 11097 -7543 -32964 -20241 922 -13523
$$ packed form
19661I777J7904M544j4315L024O147j3626j9982j0883J4613L8742r6O266j2320
19648B9795j8758r82J0711J3646l459J1964m98Q434o744j5578k0347p133m901
19635c850j3736J5148N548K5397j9559k7111p617L142p984J3047L7279J6367k6625
19622I446k4227K4137L21M556r386j3040l629K490k5963m536J0071L417j9794
19609d6137K2069M0254N638r007r563K4403q347j3373J3221j5391j9526p606j8250
19596d1615J9477O334P595K8127M428p428j429o516R196O031J5223m3703m4851
19583d9131o921J4985K6142r879K3124J4139K3878j7210k4075k8179j3547l984
19571e0658O720J9495J2711k894L439J3482Q802j8640k5421J2723K1163j4445
$$ plain form
19559 -13523 116 -3902 -26391 -20719 -5500 1859 911 6742 8236 5615 13870 15309 15059 29995
19545 29995 44306 27148 36776 23594 194 -7054 20870 20490 12147 4990 4667 22875 42845
19532 42845 33251 -4393 -24866 3376 17645 12047 -10673 355 2498 -16648 -19194 -10372 -15686
19519 -15686 -30482 -21342 10038 19717 27519 23542 30700 17341 -20028 -37109 -21090 -11899 -18422
19506 -18422 -4101 18252 12894 -16212 -24939 -40031 -47830 -47564 -62350 -65128 -37330 663 14218
19493 14218 25325 36533 52506 54371 66696 40443 28026 55668 68810 64921 57530 70237
19481 70237 75035 55286 42843 41898 61836 43053 -3232 794 -18539 -19857 -42688 -39773 -12382
19468 -12382 -21633 -11106 -2160 -1504 -5803 -4700 -7334 8098 2353 11000 33820 34307 42193 48178
$$ packed form
19559a3523J3639m018k2489N672J5219P359r48N831J494k621Q255J439k50J4936
19545B9995J4311j7158R628j3182k3400p248K7924l80q343p157l23J8208J9970
19532D2845r594l7644k0473K8242J4269n598k2720J1028K143j9146k546Q822n314
19519a5686j4796R140L1380R679P802l977P158j3359l7369j7081J6019R191o523
19506a8422J4321K2353n358k9106q727j5092p799K66j4786k778K7798L7993J3555
19493A4218J1107J1208J5973J865J2325k6253j2417K7642J3142l889p391J2707
19481G0237M798j9749j2443r45J9938j8783m6285M026j9333j318k2831K915K7391
19468a2382r251J0527Q946O56m299J103k634J5432n745Q647K2820M87P886N985
$$ plain form
19454 48178 36521 18687 45323 52038 26206 37226 60066 42169 22931 34660 42025 6629
19442 6629 22771 30933 6866 -13922 2652 6474 -4475 8760 30061 20969 24879 28200 -2467
19429 -2467 -25326 -34949 -18522 4010 10549 18622 18704 12451 5274 -7118 -7280 -13153 -1288 -13237
19415 -13237 -13625 -12544 -9300 6372 -1617 -30602 -2311 48055 36986 17097 9274 24383 16325
19402 16325 5269 18604 43586 62626 54982 39441 7920 -2044 -1109 -4979 251 -11630 -5348
19389 -5348 -16684 -10945 -14889 -27620 -43289 -22317 -3359 4664 5815 7578 22390 16664 11584
19376 11584 16269 4761 1490 -7021 20213 32020 7318 6259 -14469 1191 29190 23062 29278
19363 29278 29997 7701 15975 14798 -21334 -15483 -11167 6441 11563 -7920 -4497 4831 32651
$$ packed form
19454D8178j1657j7834K6636O715k5832J1020K2840j7897j9238J1729P365l5396
19442F629J6142Q162k4067k0788J6574L822j0949J3235K1301r092L910L321l0667
19429b467k2859r623J6427K2532O539Q073Q2o253p177j2392j62n873J1865j1949
19415a3237l88J081L244J5672p989k8985K8291N0366j1069j9889p823J5109q058
19402A6325j1056J3335K4982J9040p644j5541l1521r964R35l870N230j1881O282
19389e348j1336N739l944j2731j5669K0972J8958Q023J151J763J4812n726n080
19376A1584M685j1508l271q511K7234J1807k4702j059k0728J5660K7999o128O216
19363B9278P19k2296Q274j177l6132N851M316J7608N122j9483L423R328K7820
$$ plain form
19350 32651 50517 23117 -1883 -9652 9973 18181 7401 4238 6437 -17310 -20840 10529 8330
19337 8330 11486 27083 32492 40321 44599 40853 30213 11894 12788 44282 42033 44677 50855 49668
19323 49668 13764 -10496 -3521 8767 27013 33453 21900 -24317 -4913 1371 11645 -11628
19311 -11628 -25631 -19318 -8158 -6469 5095 -11433 -15652 -12048 1365 29368 49063 51270 25760
19298 25760 1995 3084 11743 10936 16399 29664 32573 45761 55550 41608 43654 40127 36428 40053
19284 40053 43166 34109 29012 22869 21344 -2741 -28025 -19522 2820 7250 28475 44102 48077
19271 48077 39852 48735 51587 31305 50367 75492 85615 102330 132371 183778 213827 297603
19259 297603 468468 642604 739310 694215 578724 424214 304718 216203 148637 138375
$$ packed form
19350C2651J7866k7400k5000p769J9625Q208j0780l163K199k3747l530L1369k199
19337H330L156J5597N409P829M278l746j0640j8319Q94L1494k249K644O178j187
19323D9668l5904k4260O975J2288J8246O440j1553m6217J9404O284J0274k3273
19311a1628j4003O313J1160J689J1564j6528m219L604J3413K8003J9695K207k5510
19298B5760k3765J089Q659q07N463J3265K909J3188R789j3942K046l527l699L625
19284D0053L113r057n097o143j525k4085k5284Q503K2342M430K1225J5627L975
19271D8077q225Q883K852k0282J9062K5125J0123J6715L0041N1407L0049Q3776
19259B97603J70865J74136R6706m5095j15491j54510j19496q8515o7566j0262
$$ plain form
19249 138375 132077 110593 95429 101042 113876 102292 106808 126039 110017 94312 72025 33665
19237 33665 45688 43398 6869 -21524 -3270 11489 28021 34509 35123 40116 20228 13135 8380
19224 8380 10632 11473 14936 32888 37325 25127 28932 29216 43633 35073 9877 -5452 6590 37755
19210 37755 78838 68685 64877 48163 17102 11059 17306 35531 43669 33757 24575 43468 51539
19197 51539 57049 45098 36902 19995 6438 -11811 -25846 -26263 6917 20174 23591 2690 -1931
19184 -1931 23544 27276 14341 19952 18289 13549 17970 15509 18644 36110 947 -19544 -8509
19171 -8509 18211 22574 7450 15161 2812 -6537 3880 6089 -2398 35579 44869 5836 -4688
19158 -4688 25918 38216 51652 62013 80138 84717 97367 86456 87949 59130 42738 38388
$$ packed form
19249A38375o298k1484j5164N613J2834j1584M516J9231j6022j5705k2287l8360
19237C3665J2023k290l6529k8393J8254J4759J6532O488O14M993j9888p093m755
19224H380K252Q41L463J7952M437j2198L805K84J4417q560k5196j5329J2042L1165
19210C7755M1083j0153l808j6714l1061o043O247J8225Q138r912r182J8893Q071
19197E1539N510j1951q196j6907j3557j8249j4035m17L3180J3257L417k0901m621
19184a931K5475L732j2935N611j663m740M421k461L135J7466l5163k0491J1035
19171h509K6720M363j5124P711j2349r349J0417K209q487L7977R290l9033j0524
19158d688L0606J2298J3436J0361J8125M579J2650j0911J493k8819j6392m350
$$ plain form
19146 38388 30883 33018 24317 52311 46758 22165 -660 5322 4414 1524 7686 15829 28009 12806
19132 12806 17788 58530 39088 116 -30488 -34278 -32769 -18003 -20905 -21294 -6654 14402 20712
19119 20712 30115 27233 8963 23768 58703 41797 292 -4414 4332 17440 22292 22623 20647
19106 20647 5421 5432 26076 38794 21764 30259 20048 17932 3716 -10096 14316 32906 14049
19093 14049 24992 54619 70450 71532 46626 43982 66514 83211 58964 49075 73530 65157
19081 65157 50167 42168 62478 64963 56322 70499 84931 67999 32599 30893 24767 8599 4796
19068 4796 5728 29227 36135 34428 31967 34342 17691 -21993 -33104 -16685 17494 55889 39425
19055 39425 21055 7492 20410 11583 9016 22154 14132 49893 59921 35956 27541 -1922
$$ packed form
19146C8388p505K135q701K7994n553k4593k2825N982r08k890O162Q143J2180j5203
19132A2806M982M0742j9442l8972l0604l790J509J4766k902l89J4640K1056O310
19119B0712R403k882j8270J4805L4935j6906m1505m706Q746J3108M852L31j976
19106B0647j5226J1K0644J2718j7030Q495j0211k116j4216j3812K4412J8590j8857
19093A4049J0943K9627J5831J082k4906k644K2532J6697k4247r889K4455q373
19081F5157j4990p999K0310K485q641J4177J4432j6932l5400j706o126j6168l803
19068D796R32K3499O908j707k461K375j6651l9684j1111J6419L4179L8395j6464
19055C9425j8370j3563J2918q827k567J3138q022L5761J0028k3965q415k9463
$$ plain form
19043 -1922 -4097 11115 14816 6154 12198 39437 15930 -3178 15399 32372 30232 14147 20952
19030 20952 30109 19642 -7283 -16466 -21549 -4586 18250 -8955 -45425 -25548 39654 58265
19018 58265 32902 24210 39285 39194 51020 56565 51958 39308 36553 42784 44882 35973 29546 23861
19004 23861 16516 16733 11989 3389 10803 31900 56646 76490 77011 78910 74829 42835 26210 42088
18990 42088 70145 46244 732 -5961 14534 27269 46610 42644 31614 35711 40590 11373
18978 11373 -2035 2423 -10032 155 41473 52798 50295 77752 77089 43185 33294 27923 15691
18965 15691 -23996 -15154 -10403 14565 21727 27496 43914 31908 12977 52912 45187 -9700 1085
18952 1085 22006 21909 43098 32622 14781 13134 12536 3 26342 14229 20656 27898 33869 21255
$$ packed form
19043a922k175J5212L701q662O044K7239k3507j9108J8577J6973k140j6085O805
19030B0952R157j0467k6925r183n083J6963K2836k7205l6470J9877O5202J8611
19018E8265k5363q692J5075r1J1826N545m607j2650k755O231K098q909o427n685
19004B3861p345K17m744q600P414K1097K4746J9844N21J899m081l1994j6625J5878
18990D2088K8057k3901m5512o693K0495J2735J9341l966j1030M097M879k9217
18978A1373j3408M458j2455J0187M1318J1325k503K7457o63l3904r891n371j2232
18965A5691l9687Q842M751K4968P162N769J6418j2006j8931L9935p725n4887J0785
18952A085K0921r7K1189j0476j7841j647n98j2533K6339j2113O427P242N971j2614
$$ plain form
18938 21255 24590 34647 43717 30370 31431 31764 40938 26912 44922 45813 43882 59228 56907 43010
18924 43010 38536 35984 36568 50565 29743 15386 2559 23214 3365 -3964 -1707 -4052 -6312
18911 -6312 25948 41545 55342 34446 46809 47201 48650 51398 51913 34171 30590 54894 49856
18898 49856 28416 18453 28738 7737 2728 40106 66413 45344 29747 37567 36888 29224 22808
18885 22808 22736 14339 34817 41945 55694 49936 64010 86819 67975 47877 39421 46752 33915
18872 33915 22779 5497 10720 11567 -34710 -37272 337 34204 17870 10903 14665 19068 888
18859 888 4694 -5675 -321 -3520 -9087 -12461 -4100 -3294 6824 29596 40405 25450 29411 31096
18845 31096 44342 30657 20023 56050 63650 25115 3119 -1230 -1030 13004 22145 26948 25362
$$ packed form
18938B1255L335J0057R070j3347J061L33R174j4026J8010Q91j931J5346k321j3897
18924D3010m474k552N84J3997k0822j4357j2827K0655j9849p329K257k345k260
18911f312L2260J5597J3797k0896J2363L92J449K748N15j7742l581K4304n038
18898D9856k1440r963J0285k1001n009L7378K6307k1069j5597P820o79p664o416
18885B2808p2q397K0478P128J3749n758J4074K2809j8844k0098q456P331j2837
18872C3915j1136j7282N223Q47m6277k562L7609L3867j6334o967L762M403j8180
18859H88L806j0369N354l199n567l374Q361Q06J0118K2772J0809j4955L961J685
18845C1096J3246j3685j0634L6027P600l8535k1996m349K00J4034R141M803j586
$$ plain form
18832 25362 38394 35429 34041 40055 53307 57773 59023 51007 40419 35611 26570 7859 26594
18819 26594 63786 75443 66936 42751 44014 49571 60506 33057 6575 7714 21510 23663 53166
18806 53166 74262 48887 47360 36012 12111 20476 10654 7929 14046 24004 43296 23321 42173
18793 42173 33782 6873 -1644 20268 51756 62358 72500 55279 36425 40106 41788 34730 11748
18780 11748 14135 -4195 28331 66630 90451 103135 97519 65515 36951 57369 82566 130783
18768 130783 244825 345935 348620 279615 218003 191618 137452 122140 122319 76392 67753 70069
18756 70069 67618 93063 88530 80150 69249 60427 69528 87601 56737 73078 72847 50397 33659
18743 33659 3643 -20636 10698 52030 79633 92195 76376 99040 142053 199041 305188
$$ packed form
18832B5362J3032k965j388O014J3252M466J250q016j0588m808r041j8711J8735
18819B6594L7192J1657q507k4185J263N557J0935k7449k6482J139J3796K153K9503
18806E3166K1096k5375j527j1348k3901Q365r822k725O117R958J9292j9975J8852
18793D2173q391k6909q517K1912L1488J0602J0142j7221j8854L681J682p058k2982
18780A1748K387j8330L2526L8299K3821J2684n616l2004k8564K0418K5197M8217
18768A30783J14042J01110K685o9005o1612k6385n4166j5312J79m5927q639K316
18756G0069k451K5445m533q380j0901q822R101J8073l0864J6341k31k2450j6738
18743C3659l0016k4279L1334M1332K7603J2562j5819K2664M3013N6988J06147
$$ plain form
18732 305188 481481 661946 739216 754033 641579 470319 326803 217876 176088 152829
18722 152829 94276 53538 67874 60327 46413 60812 64235 63890 74898 65717 81543 74830 63106
18709 63106 45711 18900 3803 18818 34205 31653 26370 30848 36686 40156 52370 70247 52862
18696 52862 33048 32003 26674 5343 1613 8005 39923 24955 2265 15343 16379 42257 68397
18683 68397 66408 32730 18862 31827 57974 40868 52189 62443 50904 30434 53855 22677
18671 22677 5970 37925 45888 22112 22305 14258 35002 80174 56335 39241 60958 92276
18659 92276 69252 20246 22152 38236 70338 69518 59092 81037 80288 74468 103248 114436 89398
18646 89398 61574 48496 62179 62664 88576 88260 119343 98627 88610 96583 99218 99452 53832
$$ packed form
18732C05188J76293J80465P7270J4817j12454j71260j43516j08927m1788k3259
18722A52829n8553m0738J4336p547j3914J4399L423l45J1008r181J5826o713j1724
18709F3106j7395k6811j5097J5015J5387k552n283M478N838L470J2214J7877j7385
18696E2862j9814j045n329k1331l730O392L1918j4968k2690J3078J036K5878K6140
18683F8397j989l3678j3868J2965K6147j7106J1321J0254j1539k0470K3421l1178
18671B2677j6707L1955P963k3776J93q047K0744M5172k3839j7094K1717L1318
18659I2276k3024m9006J906J6084L2102q20j0426K1945p49n820K8780J1188k5038
18646H9398k7824j3078J3683M85K5912l16L1083k0716j0017P973K635K34m5620
$$ plain form
18633 53832 47882 48631 60459 66822 75728 102366 118976 109203 85811 89155 101939 79384 53301
18620 53301 76023 96895 105737 73606 55884 67106 87031 89068 76139 85647 91407 89235 90134
18607 90134 83788 104605 110418 108827 102183 111726 132138 142848 174257 168736 162328 151766 158601
18594 158601 138728 118342 133543 133295 115692 72827 37521 48822 59053 75798 92687 124615
18582 124615 130019 124512 122097 100781 84991 98768 140031 144918 126890 103531 91759 94891
18570 94891 102050 90449 77604 83527 96536 78773 89790 109990 122522 133156 160248 166121
18558 166121 186698 187978 233092 269414 244520 193087 163325 142831 145183 148451 119437 132392
18546 132392 174552 206625 231894 265110 253073 236561 221348 195709 164236 146870 135710
$$ packed form
18633E3832n950P49J1828O363Q906K6638J6610r773k3392L344J2784k2555k6083
18620E3301K2722K0872Q842l2131j7722J1222J9925K037j2929R508N760k172Q99
18607I0134o346K0817N813j591o644R543K0412J0710L1409n521o408j0562O835
18594A58601j9873k0386J5201k48j7603m2865l5306J1301J0231J6745J6889L1928
18582A24615N404n507k415k1316j5790J3777M1263M887j8028k3359j1772L132
18570I4891P159j1601j2845N923J3009j7763J1017K0200J2532J0634K7092N873
18558A66121K0577J280M5114L6322k4894n1433k9762k0494K352L268k9014J2955
18546A32392M2160L2073K5269L3216j2037j6512j5213k5639l1473j7366j1160
$$ plain form
18535 135710 156377 155632 146128 120444 144000 145919 140761 154921 154313 140813 136633 127294 137779
18522 137779 137341 147423 144024 135640 105677 119643 154594 170554 130000 95249 80188 96233
18510 96233 127935 156075 156646 160122 179768 221915 286569 329910 283330 252297 229798 224537
18498 224537 203283 192618 201776 207197 230757 237873 286525 326791 317628 264461 215686 210336
18486 210336 200671 181346 139587 130563 150560 172617 186047 224831 218424 199906 198733 187306
18474 187306 205661 197043 166148 158921 142106 138943 126728 121031 163638 181914 194064 225555
18462 225555 228764 247022 237820 194425 176402 220120 237189 237585 239999 230728 238898 281124 290797
18449 290797 275822 260704 297023 308067 322344 354421 365427 326816 314946 322607 348143 333794
$$ packed form
18535A35710K0667p45r504k5684K3556J919n158J4160o08j3500m180r339J0485
18522A37779m38J0082l399q384k9963J3966L4951J5960m0554l4751j5061J6045
18510I6233L1702K8140N71L476J9646M2147O4654M3341m6580l1033k2499n261
18498B24537k1254j0665R158N421K3560P116M8652M0266r163n3167m8775n350
18486B10336r665j9325m1759r024J9997K2057J3430L8784o407j8518j173j1427
18474A87306J8355q618l0895p227j6815l163j2215n697M2607J8276J2150L1491
18462B25555L209J8258r202m3395j8023M3718J7069L96K414r271Q170M2226R673
18449B90797j4975j5118L6319J1044J4277L2077J1006l8611j1870P661K5536j4349
$$ plain form
18437 333794 330283 330379 342505 337279 340733 325274 284243 274851 276922 264610 272493 242013 230986
18424 230986 232993 219621 201512 210115 227022 222845 219854 238252 220012 217647 223028 241930 254141
18411 254141 219739 208152 216424 200560 215388 251394 242795 214197 238444 267007 275233 265513
18399 265513 235309 216675 206617 200675 194563 207973 198937 205959 219252 218547 216125 199789 205764
18386 205764 196778 177422 177973 202592 224965 233813 232646 245478 251070 251152 248429 236652 216056
18373 216056 199086 218446 211441 210373 183515 195526 219496 229924 226768 238635 235863 232798
18361 232798 237809 231534 240834 239541 257129 272976 280411 276648 263617 265324 293825 308075 310149
18348 310149 280611 282112 284428 280397 285388 290311 287037 292059 330708 352003 360050 373600 350696
$$ packed form
18437C33794l511R6J2126n226L454j5459m1031r392K071j2312P883l0480j1027
18424B30986K007j3372j8109Q603J6907m177k991J8398j8240k365N381J8902J2211
18411B54141l4402j1587Q272j5864J4828L6006q599k8598K4247K8563Q226r720
18399B65513l0204j8634j0058n942o112J3410r036P022J3293p05k422j6336N975
18386B05764q986j9356N51K4619K2373Q848j167J2832N592Q2k723j1777k0596
18373B16056j6970J9360p005j068k6858J2011K3970J0428l156J1867k772l065
18361B32798N011o275R300j293J7588J5847P435l763j3031J707K8501J4250K074
18348C10149k9538J501K316m031M991M923l274N022L8649K1295Q047J3550k2904
$$ plain form
18335 350696 368133 403908 468336 512940 550709 591084 533971 465034 407188 377595 368002 357611
18323 357611 372665 395379 435099 494282 539272 542764 511105 455814 399100 383323 355140 315218
18311 315218 316394 315650 281677 274405 279257 283668 278126 245762 225285 225738 244229 242984 205516
18298 205516 184843 221900 238840 244195 201320 191158 193768 193982 228808 269480 289567 298730
18286 298730 286197 288593 293370 323385 383409 454559 534607 562210 530959 475846 449097 396647
18274 396647 347692 321747 293977 302668 341109 378781 452207 524686 563095 568336 525449 437163
18262 437163 369292 342814 324640 305392 271265 237658 228339 223277 205946 225145 252384 256721
18250 256721 219449 193537 194822 191517 195426 209148 204607 193940 171253 193545 260785 287715
$$ packed form
18335C50696J7437L5775O4428M4604L7769M0375n7113o8937n7846k9593r593j0391
18323C57611J5054K2714L9720N9183M4990L492l1659n5291n6714j5777k8183l9922
18311C15218J176p44l3973p272M852M411n542l2364k0477M53J8491j245l7468
18298B05516k0673L7057J6940N355m2875j0162K610K14L4826M0672K0087R163
18286B98730j2533K396M777L0015O0024P1150Q0048K7603l1251n5113k6749n2450
18274C96647m8955k5945k7770Q691L8441L7672P3426P2479L8409N241m2887q8286
18262D37163o7871k6478j8174j9248l4127l3607r319n062j7331J9199K7239M337
18250B56721l7272k5912J285l305L909J3722m541j0667k2687K2292O7240K6930
$$ plain form
18238 287715 275488 260341 252011 256282 251832 251351 248046 240039 267250 281450 279180 302096 317211
18225 317211 340668 336659 311486 275273 257116 266074 243704 237313 243826 250473 276121 312084
18213 312084 358934 384430 366339 345854 354096 342390 311007 266754 231190 265123 267527 248013
18201 248013 241305 233051 200427 215207 239711 258100 256634 239637 239629 257117 240673 242017 261637
18188 261637 257514 251756 271543 288555 294555 304096 298438 281180 312520 346257 390339 408578
18176 408578 443856 489678 525528 532152 539578 563155 609435 630348 641985 646102 682920 712188
18164 712188 715482 743945 780078 769066 760137 740510 686836 616923 565062 545847 524641 506875
18152 506875 499939 510871 553105 530961 467256 452819 477336 500185 504094 496380 513101 547127
$$ packed form
18238B87715j2227j5147q330M271m450m81l305q007K7211J4200k270K2916J5115
18225C17211K3457m009k5173l6213j8157Q958k2370o391O513O647K5648L5963
18213C12084M6850K5496j8091k0485Q242j1706l1383m4253l5564L3933K404j9514
18201B48013o708q254l2624J4780K4504J8389j466j6997qJ7488j6444J344J9620
18188B61637m123n758J9787J7012O000R541n658j7258L1340L3737M4082J8239
18176D08578L5278M5822L5850O624P426K3577M6280K0913J1637M117L6818K9268
18164G12188L294K8463L6133j1012q929j9627n3674o9913n1861j9215k1206j7766
18152E06875o936J0932M2234k2144o3705j4437K4517K2849L909p714J6721L4026
$$ plain form
18140 547127 553251 531158 560070 579253 582209 582561 578453 590087 594552 626597 662096 696805 732326
18127 732326 777938 840138 909990 1003898 1111096 1258665 1408737 1542049 1764013 2111017
18117 2111017 2540583 3110935 3904122 5176112 7232088 10949046 18106510 31699091
18109 31699091 53028880 62226899 50999070 33468139 19628668 12545551 8778787
18102 8778787 6533714 5085654 4115859 3414922 2901551 2524706 2203937 1950010 1773300
18093 1773300 1593374 1409768 1269054 1125906 1045784 983697 927275 901082 882741 862623
18083 862623 822311 787178 736142 696119 656321 627658 637685 662688 698676 773194 866491
18072 866491 971633 1055796 1107155 1120289 1083240 979744 871384 787339 695175 629428 655182
$$ packed form
18140E47127O124k2093K8912J9183K956L52m108J1634M465L2045L5499L4709L5521
18127G32326M5612O2200O9852R3908J07198J47569J50072J33312K21964L47004
18117B111017M29566N70352P93187J271990K055976L716958P157464J3592581
18109C1699091K1329789R198019j1227829j7530931j3839471p083117l766764
18102H778787k245073j448060r69795p00937n13371l76845l20769k53927j76710
18093A773300j79926j83606j40714j43148q0122o2087n6422k6193j8341k0118
18083H62623m0312l5133n1036m0023l9798k8663J0027K5003L5988P4518R3297
18072H66491J05142Q4163N1359J3134l7049j03496j08360q4045r2164o5747K5754
$$ plain form
18061 655182 738412 850887 923530 994490 1067369 1085674 1028617 935162 835117 707613 625046
18050 625046 589488 546562 500940 472572 447138 429285 424070 449558 453961 433006 404479 390930
18038 390930 389212 376634 373856 393095 409921 431204 411059 378137 371176 351846 329680 339473
18026 339473 333256 370729 398387 393999 396156 397028 398684 395778 388725 372852 372030 361629 354719 364184
18012 364184 343559 333513 304274 309445 339220 346655 326358 322979 310200 276810 290975 312845
18000 312845 314724 296424 284733 280999 296418 314151 304332 312007 284110 271654 270953 287881 291751
17987 291751 301713 312302 282055 244987 293647 327375 356903 368464 351499 344531 354659 403099
17975 403099 450454 501528 552666 605028 611595 584422 543190 491947 458463 425338 391422 393282
$$ packed form
18061F55182Q3230J12475P2643P0960P2879J8305n7057r3455j00045j27504q2567
18050F25046l5558m2926m5622k8368k5434j7853n215K5488M403k0955k8527j3549
18038C90930j718j2578k778J9239J6826K1283k0145l2922o961j9330k2166R793
18026C39473o217L7473K7658m388K157Q72J656k906p053j5873q22j0401o910R465
18012C64184k0625j0046k9239N171K9775P435k0297l379j2779l3390J4165K1870
18000C12845J879j8300j1691l734J5419J7733r819P675k7897j2456p01J6928L870
17987B91751R962J0589l0247l7068M8660L3728K9528J1561j6965o968J0128M8440
17975D03099M7355N1074N1138N2362O567k7173m1232n1243l3484l3125l3916J860
$$ plain form
17963 393282 393784 374756 336256 316201 285484 259048 238784 197062 179264 197131 211518 233913
17951 233913 273900 286845 284890 270248 275920 257729 259654 263079 316473 332636 314278 317043
17939 317043 307654 305474 326732 309704 291551 278950 248533 232108 243267 263173 251721 235816
17927 235816 244678 227466 206608 212267 246912 252282 254777 279636 317475 305907 283458 291728
17915 291728 305544 302886 276340 261243 269579 285064 297757 300156 302925 298027 285417 265462
17903 265462 267130 286325 293065 291089 291133 286685 267182 285496 314437 329420 317555 321216 324854
17890 324854 347147 346916 340673 333203 322282 324360 373106 459769 538623 603499 634137 628032 595648
17877 595648 539659 480115 422725 394135 395470 420858 463447 552266 699953 846241 946602
$$ packed form
17963C93282N02j9028l8500k0055l0717k6436k0264m1722j7798J7867J4387K2395
17951B33913L9987J2945j955j4642N672j8191J925L425N3394J6163j8358K765
17939C17043r389k180K1258j7028j8153j2601l0417j6425J1159J9906j1452j5905
17927B35816Q862j7212k0858N659L4645N370K495K4859L7839j1568k2449Q270
17915B91728J3816k658k6546j5097Q336J5485J2693K399K769m898j2610j9955
17903B65462J668J9195O740j976M4m448j9503J8314K8941J4983j1865L661L638
17890C24854K2293k31o243p470j0921K078M8746Q6663P8854O4876L0638o105l2384
17877E95648n5989n9544n7390k8590J335K5388M2589Q8819J47687J46288J00361
$$ plain form
17866 946602 968187 881337 729894 583575 487721 423615 390646 348867 321854 338886 346753
17855 346753 321964 328617 336360 316156 300110 300725 301184 283607 285281 284427 277840 282902 304407 324248
17841 324248 312933 280927 285945 298474 305172 306957 305178 309688 308721 282639 287541 309699 300511
17828 300511 293140 271922 252208 253076 267096 278568 298017 286562 270703 296541 333016 336536
17816 336536 302674 297860 311018 291015 260951 259639 258750 263618 264854 257276 255646 271282 287290
17803 287290 275691 281528 296642 308351 305625 312368 294631 237327 243315 270124 275773 277878 268745
17790 268745 275795 296671 316109 325080 317356 299431 319892 324325 323638 317042 329009 338115 355874
17777 355874 356709 365140 378282 357650 335323 310345 269525 251628 270809 296518 302805 298885
$$ packed form
17866I46602K1585q6850j51443j46319r5854o4106l2969m1779k7013J7032P867
17855C46753k4789O653P743k0204j6046O15M59j7577J674q54o587N062K1505J9841
17841C24248j1315l2006N018J2529O698J785j779M510r67k6082M902K2158r188
17828C00511p371k1218j9714Q68J4020J1472J9449j1455j5859K5838L6475L520
17816C36536l3862m814J3158k0003l0064j312q89M868J236p578j630J5636J6008
17803B87290j1599N837J5114J1709k726O743j7737n7304N988K6809N649K105r133
17790B68745P050K0876J9438Q971p724j7925K0461M433o87o596J1967R106J7759
17777C55874Q35Q431J3142k0632k2327k4978m0820j7897J9181K5709O287l920
$$ plain form
17765 298885 295624 278597 253492 260551 282552 281480 266069 263912 294327 254969 237627 273412
17753 273412 291958 295634 281841 258764 255187 225626 228123 227615 251720 295781 298252 286801 268614
17740 268614 264889 260812 236499 202715 202151 208456 220760 262172 288263 288125 276032 273140 264993
17727 264993 262624 271229 288521 278032 280167 290874 281386 282160 302589 327528 331003 362696 366096
17714 366096 369529 418548 462898 517674 543781 524162 501766 465202 444283 453679 480479 514633
17702 514633 558721 602676 616592 655757 720666 763250 741527 698213 701270 700161 689841 671844
17690 671844 680527 670335 646567 650609 626708 590383 575337 550246 500023 489249 528951 531896
17678 531896 484710 441996 418681 379777 351453 338934 336621 353807 380384 401974 401598 402212
$$ packed form
17765B98885l261j7027k5105P059K2001j072j5411k157L0415l9358j7342L5785
17753B73412J8546L676j3793k3077l577k9561K497n08K4105M4061K471j1451j8187
17740B68614l725m077k4313l3784n64O305J2304M1412K6091j38j2093k892q147
17727B64993k369Q605J7292j0489K135J0707r488P74K0429K4939L475L1693L400
17714C66096L433M9019M4350N4776K6107j9619k2396l6564k0919R396K6800L4154
17702E14633M4088M3955J3916L9165O4909M2584k1723m3314L057j109j0320j7997
17690F71844Q683j0192k3768M042k3901l6325j5046k5091n0223j0774L9702K945
17678E31896m7186m2714k3315l8904k8324j2519k313J7186K6577K1590l76O14
$$ plain form
17666 402212 401278 396616 394555 399317 391235 387175 444234 541876 594995 605280 568240 535005 525160
17653 525160 491657 458341 426381 421473 456360 482884 515663 551050 589905 617337 631648 601286
17641 601286 516754 446637 419346 424864 422101 402943 411587 448622 471207 522542 626385 772913
17629 772913 875234 946870 951966 870869 759333 608311 507007 477273 478771 459485 480656
17618 480656 503429 511353 570958 656841 755638 775856 735479 652538 599557 552656 489960 471552
17606 471552 469109 468760 504226 515392 520093 517218 528338 563573 597745 624924 674714 702125
17594 702125 723117 739608 715016 671168 644416 610587 602541 581673 589940 611225 606410 600425
17582 600425 622989 665048 769613 927798 1111358 1219176 1258185 1217974 1094274 922195
$$ packed form
17666D02212r34m662k061M762q082m060N7059R7642N3119J0285l7040l3235r845
17653E25160l3503l3316l1960m908L4887K6524L2779L5387L8855K7432J4311l0362
17641F01286q4532p0117k7291N518k763j9158Q644L7035K2585N1335J03843J46528
17629G72913J02321P1636N096q1097j11536j51022j01304k9734J498j9286K1171
17618D80656K2773P924N9605Q5883R8797K0218m0377q2941n2981m6901o2696j8408
17606D71552k443l49L5466J1166M701k875J1120L5235L4172K7179M9790K7411
17594G02125K0992J6491k4592m3848k6752l3829q046k0868Q267K1285m815n985
17582F00425K2564M2059J04565J58185J83560J07818L9009m0211j23700j72079
$$ plain form
17572 922195 799465 713057 674246 655057 627102 615303 639214 672563 695227 782666 811359
17561 811359 813342 782819 728413 682912 668166 641292 643342 644773 627869 608907 583409 577545
17549 577545 577182 591617 638924 754607 876309 951983 997877 1037175 1026355 940067 863641
17538 863641 830271 826444 861205 906595 927110 909213 824279 753078 693712 667084 641574 650629
17526 650629 665549 685304 707347 789476 876886 912297 895322 827937 759583 669005 599389
17515 599389 572802 567435 561118 534673 526511 541040 532790 567107 614933 623395 627992 627207 637546
17502 637546 643189 683427 701348 746054 772331 802752 839466 862762 844178 830137 810859 779917
17490 779917 733355 713952 689710 657464 660597 693442 691209 672906 648110 665698 688883 688290
$$ packed form
17572I22195j22730q6408l8811j9189k7955j1799K3911L3349K2664Q7439K8693
17561H11359J983l0523n4406m5501j4746k6874K050J431j6904j8962k5498n864
17549E77545l63J4435M7307J15683J21702P5674M5894L9298j0820q6288p6426
17538H63641l3370l827L4761M5390K0515j7897q4934p1201n9366k6628k5510R055
17526F50629J4920J9755K2043Q2129Q7410L5411j6975o7385o8354r0578o9616
17515E99389k6587n367o317k6445q162J4529q250L4317M7826Q462M597p85J0339
17502F37546N643M0238J7921M4706K6277L0421L6714K3296j8584j4041j9278l0942
17490G79917m6562j9403k4242l2246L133L2845k233j8303k4796J7588K3185n93
$$ plain form
17478 688290 670621 679955 705687 744355 746593 766253 783242 762294 776322 792281 797527 792576
17466 792576 772333 762230 784303 829075 845675 846035 844770 872353 876502 861039 899644 988193
17454 988193 1055922 1185938 1329309 1396972 1393424 1389325 1313440 1266558 1227489 1244255 1378082
17443 1378082 1602582 1846835 2071738 2182874 2195631 2138647 1941495 1703067 1521342 1421853
17433 1421853 1413254 1408527 1331298 1232845 1136356 1092733 1081919 1104493 1128922 1185696 1296473
17422 1296473 1419143 1543003 1710699 1856409 1844805 1721811 1561629 1437065 1376195 1374309
17412 1374309 1460285 1607085 1827911 2074796 2268733 2387069 2391987 2286864 2106321 1983795
17402 1983795 1986402 2067678 2266264 2483020 2529410 2386059 2199152 2017809 1847009 1707343
$$ packed form
17478F88290j7669R334K5732L8668K238J9660J6989k0948J4028J5959N246m951
17466G92576k0243j0103K2073M4772J6600L60j265K7583M149j5463L8605Q8549
17454I88193O7729J30016J43371O7663l548m099p5885m6882l9069J6766J33827
17443A378082K24500K44253K24903J11136J2757n6984j97152k38428j81725r9489
17433A421853q599m727p7229r8453r6489m3623j0814K2574K4429N6774J10777
17422A296473J22670J23860J67696J45710j1604j22994j60182j24564o0870j886
17412A374309Q5976J46800K20826K46885J93937J18336M918j05123j80543j22526
17402A983795K607Q1276J98586K16756M6390j43351j86907j81343j70800j39666
$$ plain form
17392 1707343 1650865 1667884 1764436 1931045 2083944 2210078 2266387 2179497 1993852 1830429
17382 1830429 1705572 1604552 1536469 1479302 1400091 1331704 1284661 1271617 1237287 1180004 1123299
17371 1123299 1107910 1103616 1121901 1139863 1156145 1141830 1136084 1133401 1129362 1124422 1164270 1221476
17359 1221476 1312151 1469820 1624049 1730462 1780122 1762922 1660509 1542214 1425638 1360807
17349 1360807 1279461 1187489 1165146 1151191 1125718 1122316 1108028 1070171 1063781 1069233 1095617 1165252
17337 1165252 1239978 1323890 1433879 1558291 1635485 1589731 1483211 1395279 1346002 1365220 1402205
17326 1402205 1450738 1482064 1503316 1559054 1651792 1715483 1665009 1567846 1460711 1410040 1420314
17315 1420314 1470427 1537968 1635105 1791131 1974426 2216564 2410852 2521740 2627742 2704968
$$ packed form
17392A707343n6478J7019R6552J66609J52899J26134N6309q6890j85645j63423
17382A830429j24857j01020o8083n7167p9211o8387m7043j3044l4330n7283n6705
17371A123299j5389m294J8285J7962J6282j4315n746k683m039m940L9848N7206
17359A221476R0675J57669J54229J06413M9660j7200j02413j18295j16576o4831
17349A360807q1346r1972k2343j3955k5473l402j4288l7857o390N452K6384O9635
17337A165252P4726Q3912J09989J24412P7194m5754j06520q7932m9277J9218L6985
17326A402205M8533L1326K1252N5738R2738O3691n0474r7163j07135n0671J0274
17315A420314N0113O7541R7137J56026J83295K42138J94288J10888J06002P7226
$$ plain form
17305 2704968 2725064 2706558 2603223 2451976 2258603 2025175 1832802 1726005 1670104 1646243
17295 1646243 1642352 1642667 1615398 1579827 1555595 1544819 1507974 1517160 1559420 1611265 1671586 1726214
17283 1726214 1810244 1872315 1886452 1840617 1764156 1675474 1615492 1586517 1576900 1585093 1577089 1563113
17271 1563113 1567859 1589351 1652603 1700695 1680223 1640591 1610209 1613796 1573854 1521504 1493775 1489050
17259 1489050 1531673 1592870 1697383 1803055 1888717 1950794 2038831 2139234 2180266 2160035 2033177
17248 2033177 1818986 1604578 1463908 1343052 1244734 1217708 1174314 1142962 1137771 1145362 1181668
17237 1181668 1190835 1219768 1245291 1297278 1335570 1416383 1456431 1454631 1441966 1426881 1414866 1451710
17225 1451710 1465217 1504547 1480036 1408585 1309195 1260959 1252834 1227655 1248059 1263703 1269660 1255392
$$ packed form
17305B704968K0096j8506j03335j51247j93373k33428j92373j06797n5901k3861
17295A646243l891L15k7269l5571k4232j0776l6845R186M2260N1845O0321N4628
17283A726214Q4030O2071J4137m5835p6461q8682n9982k8975r617Q193q004j3976
17271A563113M746K1492O3252M8092k0472l9632l0382L587l9942n2350k7729m725
17259A489050M2623O1197J04513J05672Q5662O2077Q8037J00403M1032k0231j26858
17248B033177k14191k14408j40670j20856r8318k7026m3394l1352n191P591L6306
17237A181668R167K8933K5523N1987L8292Q0813M0048j800j2665j5085j2015L6844
17225A451710J3507L9330k4511p1451r9390m8236q125k5179K0404J5644N957j4268
$$ plain form
17213 1255392 1259184 1255310 1251647 1249873 1250876 1243675 1224256 1195117 1166999 1177057 1199261 1182232
17201 1182232 1169516 1156208 1155880 1151590 1161028 1151434 1156154 1180556 1183789 1173064 1139394 1135429 1146440
17188 1146440 1163310 1170069 1169657 1153813 1155175 1176215 1214700 1267700 1338485 1391064 1417960 1405796
17176 1405796 1409253 1439264 1558148 1706181 1795868 1805743 1726512 1613656 1545972 1533407 1566763
17165 1566763 1610410 1672467 1748483 1833379 1958893 2080374 2141831 2146372 2124322 2098217 2068741
17154 2068741 2078291 2101291 2147899 2195814 2269471 2374945 2465148 2580942 2744199 2929413 3080114
17143 3080114 3229925 3324862 3326965 3287223 3250504 3197650 3113517 3032757 3006237 3065699 3164329
17132 3164329 3273395 3436320 3724570 4153957 4705607 5360074 6112263 6996722 8122936
$$ packed form
17213A255392L792l874l663j774J003p201j9419k9139k8118J0058K2204j7029
17201A182232j2716j3308l28m290R438r594M720K4402L233j0725l3670l965J1011
17188A146440J6870O759m12j5844J362K1040L8485N3000P0785N2579K6896j2164
17176A405796L457L0011J18884J48033Q9687R875p9231j12856o7684j2565L3356
17165A566763M3647O2057P6016Q4896J25514J21481O1457M541k2050k6105k9476
17154B068741R550K3000M6608M7915P3657J05474R0203J15794J63257J85214J50701
17143C080114J49811R4937K103l9742l6719n2854q4133q0760k6520N9462R8630
17132C164329J09066J62925K88250M29387N51650O54467P52189Q84459J126214
$$ plain form
17123 8122936 9801318 12451590 16840375 24636089 38877213 63631126 91094173 103954285
17115 103954285 109310604 95716904 71266262 47111236 30666695 21601281 16221111
17108 16221111 12780990 10512420 9003234 7948312 7175833 6597144 6140055 5730801 5368129
17099 5368129 5025571 4686590 4394097 4201544 4150835 4278904 4477808 4596761 4767799 4870197
17089 4870197 4802981 4613651 4446371 4163018 3883719 3692437 3629567 3779312 4018874 4272636
17079 4272636 4536549 4816094 5200757 5773664 6447581 7307449 8364312 9784436 11986897
17070 11986897 15457581 21268568 31723264 50723438 81724573 109325399 121187040
17063 121187040 122878247 101768471 73196292 47122799 30987271 22148179 16836183
$$ packed form
17123H122936J678382K650272M388785P795714J4241124K4753913K7463047J2860112
17115A03954285N356319j3593700k4450642k4155026j6444541r065414n380170
17108A6221111l440121k268570j509186j054922p72479n78689m57089m09254l62672
17099E368129l42558l38981k92493j92553n0709J28069J98904J18953J71038J02398
17089D870197o7216j89330j67280k83353k79299j91282o2870J49745K39562K53762
17079D272636K63913K79545L84663N72907O73917Q59868J056863J420124K202461
17070A1986897L470684N810987J0454696J9000174L1001135K7600826J1861641
17063A21187040J691207k1109776k8572179k6073493j6135528q839092n311996
$$ plain form
17056 16836183 13357950 10980897 9324827 8160007 7196247 6426563 5738544 5080295 4531273
17047 4531273 4117035 3853712 3688755 3583552 3578343 3597880 3553313 3449693 3406236 3340802
17037 3340802 3229553 3081778 2932228 2702851 2405167 2109208 1915716 1784925 1697460 1686953
17027 1686953 1657559 1624182 1530607 1442558 1388392 1358648 1412822 1423299 1366879 1290465 1207523
17016 1207523 1121603 1075383 1037096 970863 916447 896681 885078 888374 894670 884770 888166 882949
17004 882949 873213 864306 834252 784117 764498 741854 754835 769659 763034 774304 794658 820987
16992 820987 830740 799623 760754 762102 780178 819548 858114 898106 958986 1003447 1041229 1050540
16980 1050540 1044037 1082817 1197313 1290922 1331206 1332515 1245561 1111211 1016904 993595 1010182
$$ packed form
17056A6836183l478233k377053j656070j164820r63760p69684o88019o58249n49022
17047D531273m14238k63323j64957j05203n209J9537m4567j03620m3457o5434
17037C340802j11249j47775j49550k29377k97684k95959j93492j30791q7465j0507
17027A686953k9394l3377r3575q8049n4166k9744N4174J0477n6420p6414q2942
17016A207523q5920m6220l8287o6233n4416j9766j1603L296O296r900L396n217
17004H82949r736q907l0054n0135j9619k2644J2981J4824o625J1270K0354K6329
16992H20987R753l1117l8869J348J8076L9370L8566L9992O0880M4461L7782R311
16980A050540o503L8780J14496R3609M0284J309q6954j34350r4307k3309J6587
$$ plain form
16969 1010182 1088727 1165636 1199017 1301897 1437222 1528682 1631310 1638426 1539250 1399693 1252539
16958 1252539 1112410 1003633 943555 872094 846833 840284 853651 845112 874372 901312 894647
16947 894647 915231 957538 958321 906994 857383 842710 792422 762959 720650 698201 647237 596715
16935 596715 574224 582282 585119 556890 532758 511375 527331 522199 508488 499168 492876 511030
16923 511030 538716 499526 488365 493509 519525 571235 575719 578002 622785 648887 664784 712096
16911 712096 825028 932579 1055566 1075930 1028471 932328 825925 742448 702230 691651 719911
16900 719911 747397 795998 847683 909786 977080 1018940 1019179 961204 878071 799033 733843 693737
16888 693737 717748 791253 903223 999022 1109958 1208327 1277297 1293345 1218771 1099505 996952
$$ packed form
16969A010182P8545P6909L3381J02880J35325R1460J02628P116r9176j39557j47154
16958A252539j40129j08777o0078p1461k5261o549J3367q539K9260K6940o665
16947H94647K0584M2307P83n1327m9611j4673n0288k9463m2309k2449n0964n0522
16935E96715k2491Q058K837k8229k4132k1383J5956n132j3711r320o292J8154
16923E11030K7686l9190j1161N144K6016N1710M484K283M4783K6102J5897M7312
16911G12096J12932J07551J22987K0364m7459r6143j06403q3477m0218j0579K8260
16900G19911K7486M8601N1685O2103O7294M1860K39n7975q3133p9038o5190m0106
16888F93737K4011P3505J11970R5799J10936R8369O8970J6048p4574j19266j02553
$$ plain form
16877 996952 879077 788172 699093 622982 582540 539245 488189 454433 476174 513197 525968
16866 525968 538372 553095 519564 523992 534844 518056 504951 500312 492270 508406 522413 527007
16854 527007 513434 512397 522101 552036 584270 589263 611213 656200 709101 814902 866049 796032
16842 796032 678714 608023 604827 587092 576559 575812 585587 599854 657046 731055 787243 886160
16830 886160 981105 937120 819414 718393 680286 637208 574324 542325 536421 538560 527616
16819 527616 513901 490298 471014 492109 486761 454478 442864 424489 433666 456570 462535 515581
16807 515581 586350 655622 749914 874470 982104 955025 862674 757267 702474 638852 619893
16796 619893 663387 721900 782986 875402 963017 985217 971529 900155 809195 700152 605515
$$ packed form
16877I96952j17875r0905q9079p6111m0442m3295n1056l3756K1741L7023J2771
16866E25968J2404J4723l3531M428J0852j6788j3105m639q042J6136J4007M594
16854E27007j3573j037R704K9935L2234M993K1950M4987N2901J05801N1147p0017
16842G96032j17318p0691l196j7735j0533p47R775J4267N7192P4009N6188R8917
16830H86160R4945m3985j17706j01021l8107m3078o2884l1999n904K139j0944
16819E27616j3715k3603j9284K1095n348l2283j1614j8375R177K2904N965N3046
16807E15581P0769O9272R4292J24556J07634k7079r2351j05407n4793o3622j8959
16796F19893M3494N8513O1086R2416Q7615K2200j3688p1374r0960j09043r4637
$$ plain form
16785 605515 572692 575702 565799 580473 626348 694532 760005 807338 777837 716871 667771 628828
16773 628828 588919 567158 564255 547641 532625 512344 509189 499673 486610 500992 509390 506368
16761 506368 508912 515499 549862 586317 596972 569727 573279 610298 691097 814780 911846 896319
16749 896319 810242 719247 639778 636445 615361 594196 589998 633958 672674 739475 836170 850616
16737 850616 809385 739949 676109 652098 640997 644606 608839 545600 564036 568261 584591 574463
16725 574463 575290 573670 552367 530473 552917 622285 666387 653650 597118 570228 579805 595856
16713 595856 618858 641872 631491 612566 548183 512974 515859 536688 563352 583230 631773 667905
16701 667905 658843 620690 608262 610426 592985 570199 595681 605784 619796 626652 656391 679780
$$ packed form
16785F05515l2823L010r903J4674M5875O8184O5473M7333k9501o0966m9100l8943
16773F28828l9909k1761k903j6614j5016k0281l155r516j3063J4382Q398l022
16761E06368K544O587L4363L6455J0655k7245L552L7019Q0799J23683R7066j5527
16749H96319q6077r0995p9469l333k1084k1165m198M3960L8716O6801R6695J4446
16737H50616m1231o9436o3840k4011j1101L609l5767o3239J8436M225J6330j0128
16725E74463Q27j620k1303k1894K2444O9368M4102j2737n6532k6890R577J6051
16713E95856K3002K3014j0381j8925o4383l5209K885K0829K6664J9878M8543L6132
16701F67905r062l8153j2428K164j7441k2786K5482J0103J4012O856K9739K3389
$$ plain form
16689 679780 710954 736101 773744 779344 750338 726771 766761 842902 884952 929498 911484 830611
16677 830611 784275 769079 756099 729968 696388 664951 647981 665488 664421 667198 668917 675688
16665 675688 648595 639613 645647 630498 632441 630569 643985 635457 614688 615394 605939 596998 598344
16652 598344 612051 624207 621644 617380 619622 657340 690565 693366 684614 681770 713951 726208 723218
16639 723218 712988 711290 691183 700001 753549 778587 800683 834389 873365 915550 996949 1127370
16627 1127370 1204000 1240880 1240073 1213805 1168621 1109738 1081953 1087933 1101939 1133556 1163662 1207840
16615 1207840 1275437 1367800 1475378 1566376 1656762 1710004 1728210 1743506 1732571 1744431 1763768
16604 1763768 1816499 1931832 2075980 2276905 2452341 2708661 3028671 3367328 3640556 3870985
$$ packed form
16689F79780L1174K5147L7643N600k9006k3567L9990P6141M2050M4546j8014q0873
16677H30611m6336j5196j2980k6131l3580l1437j6970J7507j067K777J719O771
16665F75688k7093q982O034j5149J943j872J3416q528k0769P06r455q941J346
16652E98344J3707J2156k563m264K242L7718L3225K801q752k844L2181J2257k990
16639G23218j0230j698k0107Q818N3548K5038K2096L3706L8976M2185Q1399J30421
16627A127370P6630L6880q07k6268m5184n8883k7785N980J4006L1617L0106M4178
16615A207840O7597R2363J07578R0998R0386N3242J8206J5296j0935J1860J9337
16604A763768N2731J15333J44148K00925J75436K56320L20010L38657K73228K30429
$$ plain form
16594 3870985 4066758 4162861 4208999 4323123 4522104 4768747 5217086 5814770 6519176 7328650
16584 7328650 8264902 9554451 11441384 14151014 18409735 25536347 38123480 60313120
16576 60313120 88030550 103080134 110395996 101649448 79037228 55517907 38538866
16569 38538866 29757695 25819519 24764236 26064285 30385187 39549210 57441170 86781423
16561 86781423 111645884 121340350 120919523 99694835 72042907 47370272 32040386
16554 32040386 23528200 18360001 14876271 12435069 10623569 9374008 8427875 7641645
16546 7641645 6980160 6373186 5793839 5271489 4845497 4524142 4177796 3841253 3450482
16537 3450482 3067354 2735706 2501732 2302358 2112817 1953625 1771442 1653569 1551636
$$ packed form
16594C870985J95773R6103M6138J14124J98981K46643M48339N97684P04406Q09474
16584G328650R36252J289549J886933K709630M258721P126612J2587133K2189640
16576F0313120K7717430J5049584P315862q746548k2612220k3519321j6979041
16569C8538866q781171l938176j055283J300049M320902R164023J7891960K9340253
16561H6781423K4864461R694466m20827k1224688k7651928k4672635j5329886
16554C2040386q512186n168199l483730k441202j811500j249561r46133p86230
16546G641645o61485o06974n79347n22350m25992l21355l46346l36543l90771
16537C450482l83128l31648k33974j99374j89541j59192j82183j17873j01933
$$ plain form
16528 1551636 1441583 1391165 1348571 1320712 1269924 1221907 1165200 1120379 1089196 1079079 1047960
16517 1047960 995254 943330 952035 959465 944071 939329 918086 884303 827546 814591 811273 802802
16505 802802 776950 738892 709097 720527 723713 746294 751359 730240 714998 713489 670514 669613
16493 669613 697983 679855 649773 639514 619569 592630 612972 625478 607951 611755 627260 637484
16481 637484 649647 634559 628215 629610 656476 647824 626712 618017 614589 626095 628592 614978 581163
16468 581163 557120 525662 499084 488957 455803 467251 504859 517956 511234 510507 514846 534870
16456 534870 539915 530315 532756 525969 529597 541345 540879 522481 523458 557750 586215 577343 591392
16443 591392 617951 614458 623244 642010 665951 728869 743877 722405 701343 766260 845993 923803
$$ packed form
16528A551636j10053n0418m2594k7859n0788m8017n6707m4821l1183j0117l1119
16517A047960n2706n1924Q705P430j5394m742k1243l3783n6757j2955l318q471
16505H02802k5852l8058k9795J1430L186K2581N065k1119j5242j509m2975r01
16493F69613K8370j8128l0082j0259j9945k6939K0342J2506j7527L804J5505J0224
16481F37484J2163j5088o344J395K6866q652k1112q695l428J1506K497j3614l3815
16468E81163k4043l1458k6578j0127l3154J1448L7608J3097o722p27M339K0024
16456E34870N045r600K441o787L628J1748m66j8398R77L4292K8465q872J4049
16443E91392K6559l493Q786J8766K3941O2918J5008k1472k1062O4917P9733P7810
$$ plain form
16431 923803 1039458 1256967 1605937 2251563 3202376 3649364 3187244 2403144 1742794 1362596
16421 1362596 1130851 990261 935949 904668 892660 845407 848146 819738 795374 786387 748308
16410 748308 713171 707570 713854 722423 714231 722236 741208 762621 784821 801960 798890 816443 820495
16397 820495 849709 836605 846203 864049 885967 919432 937244 980380 1111502 1346839 1630627
16386 1630627 1786896 1766940 1609490 1472503 1446677 1515282 1498990 1451571 1378300 1329048 1312968
16375 1312968 1277758 1280504 1312607 1378792 1512804 1713837 1955454 2176235 2365847 2505445
16365 2505445 2571620 2580477 2545808 2528119 2601587 2741445 2984176 3282220 3718818 4400836
16355 4400836 5349548 6516490 8048450 10326792 14045525 20471501 32156862 52556367
$$ packed form
16431I23803J15655K17509L48970O45626R50813M46988m62120p84100o60350l80198
16421A362596k31745j40590n4312l1281j2008m7253K739k8408k4364q987l8079
16410G48308l5137n601O284Q569q192Q005J8972K1413K2200J7139l070J7553M052
16397H20495K9214j3104R598J7846K1918L3465J7812M3136J31122K35337K83788
16386A630627J56269j9956j57450j36987k5826O8605j6292m7419p3271m9252j6080
16375A312968l5210K746L2103O6185J34012K01033K41617K20781J89612J39598
16365B505445O6175Q857l4669j7689P3468J39858K42731K98044M36598O82018
16355D400836R48712J166942J531960K278342L718733O425976J1685361K0399505
$$ plain form
16347 52556367 76630505 79178348 63138452 42540963 28477327 21118890 17001792
16340 17001792 14647330 13545467 13660618 15111060 18535889 25391051 38418552 59100401
16332 59100401 73120007 64884177 47109174 30527516 21008965 15755724 12550595 10482540
16324 10482540 9212047 8166336 7085452 6063632 5217497 4656844 4341717 4190279 4125299
16315 4125299 4139905 4199632 4252962 4195052 4056629 3842298 3691274 3665788 3766095 3961004
16305 3961004 4283280 4815262 5605648 6681104 8153033 10424049 14215614 20740306 32455709
16296 32455709 52029551 70109747 66377497 50241099 32913369 22474170 17034326
16289 17034326 14001389 12367778 11778285 12219453 13935552 17583824 24736765 38052991
$$ packed form
16347E2556367K4074138K547843j6039896k0597489j4063636p358437m117098
16340A7001792k354462j101863J15151J450442L424829O855162J3027501K0681849
16332E9100401J4019606q235830j7775003j6581658r518551n253241l205129k068055
16324A0482540j270493j045711j080884j021820q46135n60653l15127j51438o4980
16315D125299J4606N9727N3330n7910j38423k14331j51024k5486J00307J94909
16305C961004L22276N31982P90386J075456J471929K271016L791565O524692J1715403
16296C2455709J9573842J8080196l732250j6136398j7327730j0439199n439844
16289A7034326l032937j633611n89493M41168J716099L648272P152941J3316226
$$ plain form
16281 38052991 57143784 64520190 53682087 36867012 23504851 16307903 12229576
16274 12229576 9567612 7655542 6265750 5231628 4488213 3925072 3455072 3105226 2833977
16265 2833977 2637043 2487369 2400915 2430439 2519763 2512216 2427031 2268212 2127051 2034414 2000915
16254 2000915 2001273 1945899 1854116 1735363 1650024 1608309 1611896 1629690 1589824 1521685 1439455 1364411
16242 1364411 1323854 1330872 1354915 1392830 1518821 1846934 2320514 2687847 2647417 2335988
16232 2335988 1980810 1685561 1470509 1299278 1176795 1083162 1037848 1008221 985930 959586
16222 959586 939396 944570 957308 958458 988963 1078246 1188760 1373176 1634472 1977081 2368122
16211 2368122 2470916 2210439 1834123 1529640 1392835 1357153 1367799 1437643 1540474 1713113
$$ packed form
16281C8052991J9090793P376406j0838103j6815075j3362161p196948m078327
16274A2229576k661964j912070j389792j034122p43415n63141m70000l49846k71249
16265B833977j96934j49674q6454K9524Q9324p547q5185j58819j41161r2637l3499
16254B000915L58n5374r1783j18753q5339m1715L587J7794l9866o8139q2230p5044
16242A364411m0557P018K4043L7915J25991L28113M73580L67333m0430l11429
16232B335988l55178k95249k15052j71231j22483r3633m5314k9627k2291k6344
16222I59586k0190N174J2738J150L0505Q9283J10514J84416K61296L42609L91041
16211B368122J02794k60477l76316l04483j36805l5682J0646O9844J02831J72639
$$ plain form
16201 1713113 1955768 2229644 2475937 2626555 2573404 2388488 2227986 2223446 2470882 2809348
16191 2809348 2771424 2438924 2006351 1692687 1520246 1415161 1347524 1302596 1325828 1380285
16181 1380285 1436960 1559779 1734398 1960552 2189997 2182462 1965754 1701156 1480203 1321655
16171 1321655 1204268 1146535 1108975 1080628 1053606 1047645 1059705 1099663 1141835 1136381 1098890
16160 1098890 1066753 1052334 1052261 1049348 1038721 1067723 1125863 1172036 1236048 1343982 1437964 1514197
16148 1514197 1584333 1603033 1543360 1471089 1441959 1406705 1343006 1281951 1268003 1293334 1322557
16137 1322557 1356036 1422451 1535837 1634367 1650610 1680220 1734105 1844376 2050280 2373639
16127 2373639 2932393 3779138 4500640 4423994 3840887 3169176 2673924 2368233 2161998 1999018
$$ packed form
16201A713113K42655K73876K46293J50618n3151j84916j60502m540K47436L38466
16191B809348l7924l32500m32573l13664j72441j05085o7637m4928K3232N4457
16181A380285N6675J22819J74619K26154K29445p535k16708k64598k20953j58548
16171A321655j17387n7733l7560k8347k7022n961J2060L9958M2172n454l7491
16160A098890l2137j4419p3k913j0627K9002N8140M6173O4012J07934R3982P6233
16148A514197P0136J8700n9673p2271k9130l5254o3699o1055j3948K5331K9223
16137A322557L3479O6415J13386R8530J6243K9610N3885J10271K05904L23359
16127B373639N58754Q46745P21502p6646n83107o71711m95252l05691k06235j62980
$$ plain form
16117 1999018 1877711 1825264 1785513 1727738 1696456 1680647 1707352 1746694 1782167 1821587 1790571
16106 1790571 1765706 1747609 1758255 1825466 1995400 2345881 2889017 3436420 3531151 3207174
16096 3207174 2824731 2642158 2707170 2980960 3415785 4147517 5099263 6038159 6603548 6662475
16086 6662475 5979856 4934925 3973761 3317549 2906724 2672469 2540381 2541237 2604665 2542926
16076 2542926 2421759 2325854 2247113 2213943 2283609 2368892 2504888 2708488 3020981 3313621
16066 3313621 3350998 3226681 3034817 2872935 2736172 2581254 2445475 2305095 2230226 2183024
16056 2183024 2123709 2019131 1948893 1935910 2002380 2147313 2286800 2381443 2465820 2413733 2273345
16045 2273345 2154167 2127478 2202759 2361538 2552737 2891369 3479479 4528105 6134763
$$ packed form
16117A999018j21307n2447l9751n7775l1282j5809K6705L9342L5473L9420l1016
16106A790571k4865j8097J0646O7211J69934L50481N43136N47403R4731l23977
16096C207174l82443j82573O5012K73790M34825P31732R51746R38896N65389N8927
16086F662475o82619j044931r61164o56212m10825k34255j32088Q56O3428o1739
16076B542926j21167r5905p8741l3170O9666Q5283J35996K03600L12493K92640
16066C313621L7377j24317j91864j61882j36763j54918j35779j40380p4869m7202
16056B183024n9315j04578p0238j2983O6470J44933J39487R4643Q4377n2087j40388
16045B273345j19178k6689P5281J58779J91199L38632N88110J048626J606658
$$ plain form
16036 6134763 7965544 9327674 9318231 7934814 6130669 4604546 3635674 3067921 2752020
16027 2752020 2524236 2338083 2247902 2260317 2402458 2646947 2959244 3006418 2851785 2654366
16017 2654366 2540000 2540802 2551233 2560952 2497006 2391280 2272957 2103174 1921046 1781161 1688561
16006 1688561 1635488 1618855 1628407 1594109 1600191 1645448 1680814 1672889 1674314 1645371 1596192 1575931
15994 1575931 1567790 1526271 1505752 1498303 1471796 1452471 1437939 1436745 1450295 1434499 1455402 1442110
15982 1442110 1443677 1450037 1442264 1443168 1455240 1465852 1462720 1452524 1486074 1543178 1585998 1627110
15970 1627110 1650700 1644456 1673147 1681249 1657241 1668350 1665301 1680841 1696674 1697152 1691260 1718378
15958 1718378 1751202 1820273 1914415 2030637 2188879 2344636 2472962 2583441 2713115 2855052
$$ packed form
16036F134763J830781J362130r443j383417j804145j526123r68872n67753l15901
16027B752020k27784j86153r0181J2415J42141K44489L12297M7174j54633j97419
16017B654366j14366Q02J0431R719o3946j05726j18323j69783j82128j39885r2600
16006A688561n3073j6633R552l4298O082M5257L5366p925J425k8943m9179k0261
15994A575931q141m1519k0519p449k6507j9325j4532j194J3550j5796K0903j3292
15982A442110J567O360p773R04J2072J0612l132j0196L3550N7104M2820M1112
15970A627110K3590o244K8691Q102k4008J1109l049J5540J5833M78n892K7118
15958A718378L2824O9071R4142J16222J58242J55757J28326J10479J29674J41937
$$ plain form
15948 2855052 2991701 3067305 3118142 3109764 3071184 2980806 2925181 2871079 2780412 2720672 2720476 2765502
15936 2765502 2853523 2950301 2996271 2924570 2802803 2708605 2687605 2671483 2696410 2745327 2804148
15925 2804148 2867539 2948203 3024760 3124606 3198876 3290372 3487297 3746848 3970263 4143123
15915 4143123 4303130 4447944 4559844 4677837 4807214 5028451 5347901 5803957 6419380
15906 6419380 7139668 8046092 9019135 9567839 9845813 10144041 10821687 12030728 13564856
15897 13564856 15408192 17779971 21135190 26041519 33120419 42259577 52794710 67782193
15889 67782193 93661077 142394492 234104972 395623210 572696773 564305208 431188787
15882 431188787 270847552 166652564 112733784 83571145 66179263 53287659 42860806
$$ packed form
15948B855052J36649P5604N0837q378l8580r0378n5625n4102r0667n9740j96M5026
15936B765502Q8021R6778M5970p1701j21767r4198k1000j6122K4927M8917N8821
15925B804148O3391Q0664P6557R9846P4270R1496J96925K59551K23415J72860
15915D143123J60007J44814J11900J17993J29377K21237L19450M56056O15423
15906F419380P20288R06424R73043N48704K77974K98228O77646J209041J534128
15897A3564856J843336K371779L355219M906329P078900R139158J0535133J4987483
15889F7782193K5878884M8733415R1710480J61518238J77073563q391565j33116421
15882D31188787j60341235j04194988n3918780k9162639j7391882j2891604j0426853
$$ plain form
15875 42860806 34664188 28671565 24220067 20889435 18292915 16095706 14124042 12413874
15867 12413874 10997618 9847412 8951179 8161801 7506928 7009458 6614426 6286235 5939840
15858 5939840 5537516 5156210 4860115 4766664 4936928 5332052 5460252 5121668 4570607 4026115
15848 4026115 3569771 3211815 2959285 2824490 2788180 2744215 2614459 2429428 2217700 2036419
15838 2036419 1929429 1862481 1780534 1711242 1598070 1490007 1425016 1419431 1430786 1515098 1521067
15827 1521067 1443954 1340541 1241050 1183228 1130849 1081204 1025412 982129 938687 898329 879369
15816 879369 875580 886679 901358 934732 978097 974518 958551 919765 860564 845593 896973 955750
15804 955750 997374 1004944 939485 879826 867785 839677 847816 857453 861275 884149 915907 947530
$$ packed form
15875D2860806q196618n992623m451498l330632k596520k197209j971664j710168
15867A2413874j416256j150206q96233p89378o54873m97470l95032l28191l46395
15858E939840m02324l81306k96095r3451J70264L95124J28200l38584n51061n44492
15848D026115m56344l57956k52530j34795l6310m3965j29756j85031k11728j81281
15838B036419j06990o6948q1947o9292j13172j08063o4991n585J1355Q4312N969
15827A521067p7113j03413r9491n7822n2379m9645n5792m3283m3442m0358j8960
15816H79369l789J1099J4679L3374M3365l579j5967l8786n9201j4971N1380N8777
15804I55750M1624P570o5459n9659j2041k8108Q139R637L822K2874L1758L1623
$$ plain form
15792 947530 998200 1000651 934550 846551 767271 706898 646102 611741 596383 543956 511884 483117
15780 483117 489664 535161 601988 683021 684019 631836 550683 468660 401741 352467 328210 329375
15768 329375 336700 339369 341642 343225 346608 357739 341431 300320 257553 202165 178156 250328
15756 250328 325789 413491 408476 411059 396358 341167 315661 283411 271836 256973 216534 211501
15744 211501 229035 203336 192414 189344 190893 196320 209437 223802 214037 185878 107648 78222
15732 78222 74355 160597 259218 280874 266820 241000 249902 270827 279933 275302 260287 234527
15720 234527 238484 230234 227698 252843 248024 231882 234713 213337 183378 186411 193757 196213 210672
15707 210672 189396 183047 179873 161277 151110 126062 74800 27374 -36583 -86992 -80513 -51498
$$ packed form
15792I47530N0670K451o6101q7999p9280o0373o0796l4361j5358n2427l2072k8767
15780D83117O547M5497O6827Q1033R98n2183q1153q2023o6919m9274k4257J165
15768C29375P325K669K273J583L383J1131j6308m1111m2767n5388k4009P2172
15756B50328P5461Q7702n015K583j4701n5191k5506l2250j1575j4863m0439n033
15744B11501J7534k5699j0922l070J549N427J3117J4365r765k8159p8230k9426
15732G8222l867Q6242R8621K1656j4054k5820Q902K0925R106m631j5015k5760
15720B34527L957q250k536K5145m819j6142K831k1376k9959L033P346K456J4459
15707B10672k1276o349l174j8596j0167k5048n1262m7426o3957n0409O479K9015
$$ plain form
15695 -51498 2759 9188 23561 25801 39175 61875 59941 38808 44395 52969 108688 172480 199167
15682 199167 221490 252066 254766 231761 188508 151355 121507 101394 132565 134356 135360 145603
15670 145603 153185 141004 115145 98721 95248 115689 119432 84497 69652 75476 66445 64317 91359
15657 91359 116654 146671 144948 111355 76149 74519 77423 92833 97282 121518 104677 85222
15645 85222 77693 66502 83572 98813 98448 105001 111486 100589 98394 126203 166105 213467 261118
15632 261118 322593 429746 534849 501867 407433 331827 266600 217077 141255 104622 118983
15621 118983 123300 120510 117156 108796 73739 49081 75751 81574 86572 116677 114975 103807 79071
15608 79071 57470 72415 62389 67189 72505 65709 56994 32533 23477 16489 51022 72177 42979
$$ packed form
15695e1498N4257O429J4373K240J3374K2700j934k1133N587Q574N5719O3792K6687
15682A99167K2323L0576K700k3005m3253l7153k9848k0113L1171J791J004J0243
15670A45603P582j2181k5859j6424l473K0441L743l4935j4845N824r031k128K7042
15657I1359K5295L0017j723l3593l5206j630K904J5410M449K4236j6841j9455
15645H5222p529j1191J7070J5241l65O553O485j0897k195K7809L9902M7362M7651
15632B61118O1475J07153J05103l2982r4434p5606o5227m9523p5822l6633J4361
15621A18983M317k790l354q360l5057k4658K6670N823M998L0105j702j1168k4736
15608G9071k1601J4945j0026M800N316o796q715k4461r056o988L4533K1155k9198
$$ plain form
15595 42979 30654 21872 27658 41082 36649 39488 44072 10156 -9735 -20530 -43450 -63058 -64652
15582 -64652 -62699 -85613 -94199 -74760 -47544 -18549 22405 37315 73791 97780 97102 107602
15570 107602 98338 107369 150044 139737 112736 115483 100908 74856 82767 78275 54114 27398
15558 27398 36457 49877 47257 29075 26459 47632 51227 75261 84695 69622 67755 59624 41681
15545 41681 27524 55538 63969 41615 30416 26462 7762 -390 17465 41258 12114 -1864
15533 -1864 14400 14262 4276 -11955 -2165 5559 -17119 -24290 -8271 13662 65965 94036 131493
15520 131493 199462 205102 165780 124778 95049 45105 -10656 2612 16090 24202 8575 11154
15508 11154 25059 18489 27322 33151 28105 3406 5846 38046 48180 23165 5310 -6127 8447
$$ packed form
15595D2979j2325q782N786J3424m433K839M584l3916j9891j0795k2920j9608j594
15582f4652J953k2914q586J9439K7216K8995M0954J4910L6476K3989o78J0500
15570A07602r264R031M2675j0307k7001K747j4575k6052P911m492k4161k6716
15558B7398R059J3420k620j8182k616K1173L595K4034R434j5073j867q131j7943
15545D1681j4157K8014Q431k2354j1199l954j8700q152J7855K3793k9144j3978
15533a864J6264j38r986j6231R790P724k2678p171J6019K1933N2303K8071L7457
15520A31493O7969N640l9322m1002k9729m9944n5761J3268J3478Q112j5627K579
15508A1154J3905o570Q833N829n046k4699K440L2200J0134k5015j7855j1437J4574
$$ plain form
15495 8447 11803 -18797 -13205 17955 32254 65003 95648 113597 78780 49951 35554 24505
15483 24505 5737 -22161 -29344 -49325 -60239 -50605 -52430 -53407 -26185 -10049 -28226 -43631 -23769
15470 -23769 -1598 23843 10276 -20289 1548 34759 14615 6726 -3489 -28165 -3135 29134
15458 29134 30849 16266 544 -2561 1337 17200 9101 -28582 -34693 -26982 -6090 -13210 3368
15445 3368 27699 30015 3708 10256 14621 -952 1161 11548 14911 6686 -32544 -60756 -49835
15432 -49835 -9379 13290 13149 21651 7236 1598 -22237 -48408 -58634 -56902 -46546 -11221 23924
15419 23924 22418 15340 17530 -6496 -20454 -24679 -38766 -32313 -36788 -44263 -31021 -54667 -80411
15406 -80411 -67035 -35504 -16275 -8534 24369 9113 8130 31011 36026 10890 -6889 -17873
$$ packed form
15495H447L356l0600N592L1160J4299L2749L0645J7949l4817k8829j4397j1049
15483B4505j8768k7898p183j9981j0914R634j825r77K7222J6136j8177j5405J9862
15470b3769K2171K5441j3567l0565K1837L3211k0144p889j0215k4676K5030L2269
15458B9134J715j4583j5722l105L898J5863q099l7683o111P711K0892p120J6578
15445C368K4331K316k6307O548M365j5573K113J0387L363q225l9230k8212J0921
15432d9835M0456K2669j41Q502j4415n638k3835k6171j0226J732J0356L5325L5145
15419B3924j506p078K190k4026j3958m225j4087O453m475p475J3242k3646k5744
15406h0411J3376L1531J9229P741L2903j5256r83K2881N015k5136j7779j0984
$$ plain form
15394 -17873 -7896 35553 40038 4940 102 1113 -492 -5041 -1021 3355 8654 13061 7369 -8921
15380 -8921 -11900 -2631 3335 24609 35806 34548 8496 -14386 -8129 7190 -8217 5419 29957
15367 29957 42631 20511 30350 14418 13493 43196 40604 39641 41522 60924 65577 43724 29232
15354 29232 53133 60862 34101 40288 57087 62320 82855 95781 103013 74229 84593 123554
15342 123554 196572 268835 325154 434932 651391 1039128 1743745 2664138 3016169 2543019
15332 2543019 1748417 1060146 669042 477587 372779 313931 277777 232869 191675 168929
15322 168929 171372 142541 134097 105686 108343 102280 61045 49243 64286 49604 35264 42707
15310 42707 46999 31408 18646 10132 14472 28085 27270 22863 28635 35137 41736 34837 28179 9281
$$ packed form
15394a7873R977M3449M485l5098m838J011j605m549M020M376N299M407n692j6290
15380h921k979R269N966K1274J1197j258k6052k2882O257J5319j5407J3636K4538
15367B9957J2674k2120R839j5932r25K9703k592r63J881J9402M653k1853j4492
15354B9232K3901P729k6761O187J6799N233K0535J2926P232k8784J0364L8961
15342A23554P3018P2263N6319J09778K16459L87737P04617R20393L52031m73150
15332B543019p94602o88271l91104j91455j04808n8848l6154m4908m1194k2746
15322A68929K443k8831q444k8411K657o063m1235j1802J5043j4682j4340P443
15310D2707M292j5591j2762q514M340J3613q15m407N772O502O599o899o658j8898
$$ plain form
15296 9281 -11190 -8521 -4392 -20718 -50526 -25857 -19826 -16995 -7691 16230 34543 40179 29108
15283 29108 23265 5825 -9502 7094 840 -2862 30338 32658 40502 27362 37362 20127 23488
15270 23488 42960 49433 33584 6343 -33357 -44175 -27930 -44982 -49975 -34752 -6126 18764
15258 18764 3580 16622 40085 32812 19023 -9366 -25839 -21237 -22014 -17452 -2629 12950 6403
15245 6403 807 10604 19211 24318 12018 -39030 -61671 -57168 -11374 14877 1380 -2392 -18839
15232 -18839 -172 -12900 -11982 -12682 -38070 -44658 -35356 -25446 -41166 -32924 -30650 -37030 -17200 -6034
15218 -6034 -1873 -3318 -5144 -22980 -28222 -17843 3229 11497 11889 13384 11337 -16933 -40018 -19698
15204 -19698 19944 38310 43006 48915 45702 18130 8236 25936 9006 18888 8788 -8003 -12603
$$ packed form
15296I281k0471K669M129j6326k9808K4669O031K831R304K3921J8313N636j1071
15283B9108n843j7440j5327J6596o254l702L3200K320P844j3140J0000j7235L361
15270B3488J9472O473j5849k7241l9700j0818J6245j7052m993J5223K8626K4890
15258A8764j5184J3042K3463p273j3789k8389j6473M602p77M562J4823J5579o547
15245F403n596R797Q607N107j2300n1048k2641M503M5794K6251j3497l772j6447
15232a8839J8667j2728R18p00k5388o588R302R910j5720Q242K274o380J9830J1166
15218f034M161j445j826j7836n242J0379K1072Q268L92J495k047k8270k3085K0320
15204a9698L9642J8366M696N909l213k7572r894J7700j6930R882j0100j6791m600
$$ plain form
15191 -12603 -54061 -59626 -23477 -33009 -41656 -26943 -2525 -3934 -20324 -46175 -49079 -29836 -17870
15178 -17870 -19908 -31136 -9583 14504 10210 8658 5216 -35478 -28568 -22535 -26812 -14940 6922
15165 6922 -13864 -22461 -38291 -45948 -40125 -49680 -45481 -58518 -52114 -23823 -1986 -336 -25889
15152 -25889 -25214 -22165 -15427 -17385 -15545 7185 12294 6197 7123 -15168 -21344 2604 15006 1149
15138 1149 -28055 -33253 -45194 -30883 -12647 -18380 -33379 -37382 -32482 -31797 -20898 -29920 -19468
15125 -19468 -5688 -2289 -487 -7124 -23676 -14441 -19251 8432 47567 52288 -18076 -57835 -59053
15112 -59053 -57956 -48042 -25346 -43928 -39415 -18520 -26184 -30695 -48823 -20682 25507 22789 -8138
15099 -8138 -27215 -34162 -33416 -17017 174 -16315 -48924 -33676 -7148 -15208 -28135 -54304 -58333
$$ packed form
15191a2603m1458n565L6149r532q647J4713K4418j409j6390k5851k904J9243J1966
15178a7870k038j1228K1553K4087m294j552l442m0694O910O033m277J1872K1862
15165F922k0786q597j5830p657N823r555M199j3037O404K8291K1837J650k5553
15152b5889O75L049O738j958J840K2730N109o097R26k2291o176K3948J2402j3857
15138A149k9204n198j1941J4311J8236n733j4999m003M900O85J0899r022J0452
15125a9468J3780L399J802o637j6552R235m810K7683L9135M721p0364l9759j218
15112e9053J097R914K2696j8582M513K0895p664m511j8128K8141M6189k718l0927
15099h138j9077o947P46J6399J7191j6489l2609J5248K6528q060j2927k6169m029
$$ plain form
15086 -58333 -38996 -42396 -36939 -34150 -17339 13298 2713 -6932 -31642 -14849 9352 19948
15074 19948 14054 -9016 -20308 -25705 -3188 8679 -15766 -15843 -896 7332 17084 14830 2541
15061 2541 -21790 -23698 -16490 -23013 -5098 12059 12903 -2661 -877 8751 -2748 -4436 -5937 -10185
15047 -10185 -5709 16112 1151 -46015 -49939 -79782 -88617 -47400 -33946 -19102 -34235 -31653
15035 -31653 -31856 -39874 -49349 -17498 -19887 -22936 -34957 -43507 -37472 -17711 -14510 -47333 -42781 -28148
15021 -28148 -32569 -46356 -46568 -39359 -7417 -14890 -57437 -57583 -29415 -35441 -37506 -35578 -35969 -63860
15007 -63860 -71310 -49135 -38201 -52645 -43546 -33098 -15775 -5687 -17207 -30412 -42358 -11953
14995 -11953 3461 -10474 -8868 5215 7535 7708 33350 44669 2583 -7132 -4077 -9489 -27166
$$ packed form
15086e8333J9337l400N457K789J6811L0637j0585r645k4710J6793K4201J0596
15074A9948n894k3070j1292n397K2517J1867k4445p7J4947Q228R752k254j2289
15061B541k4331j908P208o523J7915J7157Q44j5564J784R628j1499j688j501m248
15047a0185M476K1821j4961m7166l924k9843q835M1217J3454J4844j5133K582
15035c1653k03q018r475L1851k389l049j2021q550O035J9761L201l2823M552J4633
15021b8148m421j3787k12P209L1942p473m2547j46K8168o026k065J928l91k7891
15007f3860p450K2175J0934j4444R099J0448J7323J0088j1520j3205j1946L0405
14995a1953J5414j3935J606J4083K320J73K5642J1319m2086r715L055n412j7677
$$ plain form
14982 -27166 -9262 9379 9636 33393 16954 608 2404 -21090 -37705 -16090 275 -2510
14970 -2510 -5731 -19063 -24711 -48271 -37543 -408 4708 13166 23984 22108 4564 -8290 -23088
14957 -23088 -34158 -62652 -42077 -30831 -43866 -31184 -15950 -17195 -32427 -34986 -32882 -25650
14945 -25650 -20312 -9751 -15447 -33018 -22843 -38981 -55447 -26563 -17462 -33472 -35940 -40161 -36450
14932 -36450 -62785 -65581 -53943 -31219 -37728 -29654 -5332 3456 -14236 -10241 3709 -8293 -31278
14919 -31278 -56518 -67743 -46086 -22205 -39249 -48711 -51171 -41723 -14012 3379 -1101 -24608
14907 -24608 -49785 -17914 18875 -6717 -36818 2379 9301 -817 -33218 -35236 -368 3459
14895 3459 -33796 -28860 -23919 -13209 -35820 -47310 -32300 -22534 -18897 -17585 -44535 -35741 -16793
$$ packed form
14982b7166J7904J8641K57K3757j6439j6346J796k3494j6615K1615J6365k785
14970b510l221j3332n648k3560J0728L7135N116Q458J0818j876j7544j2854j4798
14957b3088j1070k8494K0575J1246j3035J2682J5234j245j5232k559K104P232
14945b5650N338J0561n696j7571J0175j6138j6466K8884R101j6010k468m221L711
14932c6450k6335k796J1638K2724o509Q074K4322Q788j7692L995J3950j2002k2985
14919c1278k5240j1225K1657K3881j7044r462k460R448K7711J7391m480k3507
14907b4608k5177L1871L6789k5592l0101L9197O922j0118l2401k018L4868L827
14895C459l7255M936M941J0710k2611j1490J5010R766L637J312k6950Q794J8948
$$ plain form
14882 -16793 -19234 -12987 -4834 -17819 -21943 -34599 -39196 -37809 -48687 -48067 -39405 -21907 -454
14869 -454 5551 1787 9391 13053 6380 -18311 -26131 -14219 -23416 -29171 -17406 -18393 -27915 -50723
14855 -50723 -65055 -48012 -43644 -23576 -11474 -9387 5509 -29544 -24306 -971 -2224 -19459
14843 -19459 -22803 -20103 -20322 -12762 5849 11410 15674 3484 -16741 -42689 -42238 -36128 -14764 9386
14829 9386 -8553 -19566 3883 15269 11914 21824 -1889 -29701 -14893 -22034 -19241 -15878 -35979
14816 -35979 -64201 -49054 -24870 15182 30036 4339 -27599 -29728 -29119 -15570 -3351 -24826
14804 -24826 -50755 -49898 -34074 -24638 -54048 -51811 -57152 -73436 -55827 -57370 -60366 -65679 -55341
14791 -55341 -34300 -43419 -58716 -38101 -28778 -14006 1664 3572 16838 -6056 -22568 -10800
$$ packed form
14882a6793k441O247Q153j2985m124j2656m597J387j0878O20Q662J7498K1453
14869d54O005l764P604L662o673k4691p820J1912r197n755J1765r87r522k2808
14855e0723j4332J7043M368K0068J2102K087J4896l5053N238K3335j253j7235
14843a9459l344K700k19P560J8611N561M264j2190k0225k5948M51O110K1364K4150
14829I386j7939j1013K3449J1386l355R910k3713k7812J4808p141K793L363k0101
14816c5979k8222J5147K4184M0052J4854k5697l1938k129O09J3549J2219k1475
14804b4826k5929Q57J5824R436k9410K237n341j6284J7609j543k996n313J0338
14791e5341K1041r119j5297K0615R323J4772J5670J908J3266k2894j6512J1768
$$ plain form
14779 -10800 -4797 -25545 -29559 -20302 -13629 -3829 20871 20996 4684 -11369 -8397 11149 -9096
14766 -9096 -7426 -4196 -3092 24958 46891 50262 41901 17935 2359 -9956 -901 13014 37321
14753 37321 56309 50331 21372 -6016 -31020 -43698 -20532 -1222 -12938 136 3078 10371
14741 10371 10076 -6219 -23999 -49606 -70658 -44445 -17205 -27677 -8043 10140 -10431 -13039
14729 -13039 -21659 -29505 -38872 -24794 -40788 -51480 -50771 -1381 11623 12986 31492 22155 13647
14716 13647 7239 -19336 -38233 -43070 -37529 -21542 -2661 -9165 -19181 -21135 -6059 25847 13366
14703 13366 -12815 -12606 -11198 -21611 -9308 2926 14453 19539 11495 16577 3065 13450 5202
14690 5202 21729 -6079 -37913 -33069 -16151 18119 27101 58316 53847 33692 16029 -24482
$$ packed form
14779a0800O003k0748m014R257O673R800K4700J25j6312j6053K972J9546k0245
14766i096J670L230J104K8050K1933L371q361k3966j5576j2315R055J3915K4307
14753C7321J8988n978k8959k7388k5004j2678K3166J9310j1716J3074K942P293
14741A0371k95j6295j7780k5607k1052K6213K7240j0472J9634J8183k0571k608
14729a3039q620p846r367J4078j5994j0692P09M9390J3004J363J8506r337q508
14716A3647o408k6575j8897m837N541J5987J8881o504j0016j954J5076L1906j2481
14703A3366k6181K09J408j0413J2303J2234J1527N086q044N082j3512J0385q248
14690E202J6527k7808l1834M844J6918L4270Q982L1215m469k0155j7663m0511
$$ plain form
14678 -24482 -33137 -27177 -6923 -14145 -20069 -5428 29523 36438 13806 -13487 -13087 3093 5594
14665 5594 11574 23701 5100 -4647 -8012 -6357 -25585 -21752 -5734 19898 26161 32783 23094
14652 23094 20426 12589 -373 -13464 23390 25531 4650 2022 4356 -15935 -27203 -25993 -41264
14639 -41264 -35212 -23554 -29279 -36659 -22551 -18570 345 6270 4144 5113 6003 4099 5251 8920
14625 8920 15966 36706 54678 38939 11517 -11432 -31962 -59810 -77123 -77062 -31865 -19939 -25800
14612 -25800 -43337 -34113 -16369 -7334 -23067 -57708 -65699 -50758 2621 7196 -24902 -37470
14600 -37470 -19029 -5832 -8798 -11321 -18914 -35291 -21055 -12347 -23476 4741 8160 -9367 -4134
14587 -4134 -13799 -14222 -14502 16840 44537 78426 53567 20737 11596 31313 38513 -4377 -8932
$$ packed form
14678b4482q655N960K0254p222n924J4641L4951O915k2632k7293M00J6180K501
14665E594N980J2127j8601r747l365J655j9228L833J6018K5632O263O622r689
14652B3094k668p837j2962j3091L6854K141k0881k628K334k0291j1268J210j5271
14639d1264O052J1658n725p380J4108L981J8915N925k126R69Q90j904J152L669
14625H920P046K0740J7972j5739k7422k2949k0530k7848j7313O1M5197J1926n861
14612b5800j7537R224J7744R035j5733l4641p991J4941N3379M575l2098j2568
14600c7470J8441J3197k966k523p593j6377J4236Q708j1129K8217L419j7527N233
14587d134r665m23k80L1342K7697L3889k4859l2830r141J9717P200m2890m555
$$ plain form
14574 -8932 2129 14360 4910 -30822 -21608 3411 9591 11098 -7980 -32202 -29603 -8765 -6333
14561 -6333 -13543 -5027 -9369 -11375 4502 4602 -28916 -47143 -35225 -34986 -28440 -22773 -9276 -24438
14547 -24438 -20179 -13287 -17379 -661 4966 10351 32704 33016 31275 37241 30410 34786 40730 29226
14533 29226 6303 12230 -12859 -33065 -15841 13368 31927 33456 22723 28299 27858 -23881 -14109
14520 -14109 39016 60634 42446 18095 20300 41717 64268 61058 25227 -9717 -7548 -5940
14508 -5940 15516 33692 21177 -1778 -14040 2459 -471 -6844 -509 30816 42480 47022 2932
14495 2932 -36470 -20479 -10886 -15320 -14462 -11046 15418 11473 -4661 -1375 134 8032 5467 -24778
14481 -24778 -49391 -36264 -37326 -38745 -29436 -841 -4751 -282 2441 -1660 2277 3032 -16750 -22799
$$ packed form
14574h932J1061J2231r450l5732R214K5019O180J507j9078k4222K599K0838K432
14561f333p210Q516m342k006J5877J00l3518j8227J1918K39O546N667J3497j5162
14547b4438M259O892m092J6718N627N385K2353L12j741N966o831M376N944j1504
14533B9226k2923N927k5089k0206J7224K9209J8559J529j0733N576m41n1739R772
14520a4109N3125K1618j8188k4351K205K1417K2551l210l5831l4944K169J608
14508e940K1456J8176j2515k2955j2262J6499k930o373O335L1325J1664M542m4090
14495B932l9402J5991R593m434Q58L416K6464l945j6134L286J509P898k565l0245
14481b4778k4613J3127j062j419R309K8595l910M469K723m101L937P55j9782o049
$$ plain form
14467 -22799 8034 -6258 -19598 -9304 -11858 -16631 16216 30258 28132 21630 -1627 5953 16765
14454 16765 31364 19215 16096 3886 -18659 -25678 -13440 11244 2875 11297 6993 12528 14971
14441 14971 11934 -11470 -15143 -11354 15853 20406 13518 12489 13605 2555 -7124 -10384 9794
14428 9794 9421 -17068 -18454 -18521 -20506 -10748 -15088 7366 18819 7615 -11807 -27470 -22112 -12680
14414 -12680 4387 19923 19741 18744 13005 11935 6783 3407 13118 11949 28785 26379 7667 15188
14400 15188 21761 19930 -6282 -26926 -20499 -10825 -13405 -11138 5155 -2207 -11984 12516 10569
14387 10569 759 691 13995 8707 1367 13520 4091 -4746 4018 22560 23605 -5901 -14497 3910
14373 3910 -4110 1782 34162 18606 36684 55271 37569 -1662 -12559 -11537 -27711 -36334 -11691
$$ packed form
14467b2799L0833j4292j3340J0294k554m773L2847J4042k126o502k3257P580J0812
14454A6765J4599j2149l119j2210k2545p019J2238K4684q369Q422m304N535K443
14441A4971l037k3404l673L789K7207M553o888j029J116j1050r679l260K0178
14428I794l73k6489j386o7j985R758m340K2454J1453j1204j9422j5663N358R432
14414a2680J7067J5536j82r97n739j070n152l376R711j169J6836k406j8712P521
14400A5188O573j831k6212k0644O427R674k580K267J6293p362r777K4500j947
14387A0569r810o8J3304n288p340J2153r429q837Q764J8542J045k9506q596J8407
14373C910q020N892L2380j5556J8078J8587j7702l9231j0897J022j6174q623K4643
$$ plain form
14360 -11691 8716 1288 2519 27719 15386 4234 9589 14099 2073 -14726 -9038 861 -8496
14347 -8496 -21764 -5382 46224 71928 59464 24256 9447 32218 24437 40531 34236 26503
14335 26503 5597 4311 37839 48383 24393 10851 -5330 119 -4022 -7056 -3338 -21529 -31871
14322 -31871 -17626 -11364 -6245 -9818 4506 12870 -13283 -25530 9160 33319 24768 17333 25773
14309 25773 27136 31024 36790 17479 28565 27964 -3114 -39212 -47809 -61640 -42560 -40107 -37915
14296 -37915 -17305 6509 26816 38852 26945 14637 10201 35317 14491 -12932 457 5603
14284 5603 27276 30176 46966 48762 35826 17049 2224 -7730 -1614 19901 45411 24658 -11984
14271 -11984 11123 66444 73169 63329 46020 54945 75800 52124 17431 -24178 -26924 -8108
$$ packed form
14360a1691K0407p428J231K5200j2333j1152N355M510j2026j6799N688R899r357
14347h496j3268J6382N1606K5704j2464l5208j4809K2771p781J6094o295p733
14335B6503k0906j286L3528J0544k3990j3542j6181N449m141l034L718j8191j0342
14322c1871J4245O262N119l573J4324Q364k6153j2247L4690K4159q551p435Q440
14309B5773J363L888N766j9311J1086o01l1078l6098q597j3831J9080K453K192
14296c7915K0610K3814K0307J2036j1907j2308m436K5116k0826k7423J3389N146
14284E603K1673K900J6790J796j2936j8777j4825r954O116K1515K5510k0753l6642
14271a1984K3107N5321O725r840j7309Q925K0855k3676l4693m1609k746J8816
$$ plain form
14259 -8108 17070 36987 57357 68195 74108 84700 81050 53855 51062 66232 79996 68505
14247 68505 59754 57948 40704 45196 68116 65754 41843 45451 63484 56135 33758 12668 -1009
14234 -1009 25267 53036 36707 -10415 -3998 10651 11008 -11874 8358 38340 50740 42297 30009
14221 30009 5459 -18228 -46623 -9251 39869 45615 18758 27956 47466 54347 72629 85778
14209 85778 85740 85287 92624 74712 88646 86169 88222 100625 106483 89419 81908 88773 102814 108922
14195 108922 89686 77174 78615 67792 65634 62971 47979 35383 43452 43031 50308 28355 9290
14182 9290 22825 49245 52576 43664 51775 72419 90022 93494 87731 69117 44941 42255 45536
14169 45536 36524 37308 48624 69412 71372 32565 24540 44468 53601 63167 52733 35747 57375
$$ packed form
14259h108K5178J9917K0370J0838N913J0592l650k7195k793J5170J3764j1491
14247F8505q751j806j7244M492K2920k362k3911L608J8033p349k2377k1090j3677
14234a009K6276K7769j6329m7122O417J4649L57k2882K0232K9982J2400q443j2288
14221C0009k4550k3687k8395L7372M9120N746k6857R198J9510O881J8282J3149
14209H5778l8m53P337j7912J3934k477K053J2403N858j7064p511O865J4041O108
14195A08922j9236j2512J441j0823k158k663j4992j2596Q069m21P277k1953j9065
14182I290J3535K6420L331q912Q111K0644J7603L472n763j8614k4176k686L281
14169D5536r012P84J1316K0788J960l8807q025J9928R133R566j0434j6986K1628
$$ plain form
14156 57375 55035 60119 40453 25784 21931 23708 26518 34790 40861 38938 56475 32531 39213
14143 39213 38054 39145 45625 23841 32757 51324 65606 72870 62162 61629 35439 25715 10646
14130 10646 1589 -9841 25548 43935 46212 89235 112649 93234 90214 95558 77719 81304 82812
14117 82812 104669 117922 118518 123581 126094 125818 123636 129784 135023 129815 126351 126651 102767 69603
14103 69603 56066 45723 52302 65310 92094 117110 88654 26313 37763 52359 46094 40161
14091 40161 37432 60478 53589 65826 60112 57383 62969 70448 70482 80849 83879 75680 53835 20450
14077 20450 24064 33718 42271 70060 70882 66346 60812 47669 60175 60032 57693 76273 53226 20170
14063 20170 12570 1209 9165 32141 20263 17782 17182 31760 56841 47232 58332 71125 42567
$$ packed form
14156E7375k340N084j9666j4669l853J777K810Q272O071j923J7537k3944O682
14143C9213j159J091O480k1784Q916J8567J4282P264j0708n33k6190r724j5069
14130A0646r057j1430L5389J8387K277M3023K3414j9415l020N344j7839L585J508
14117H2812K1857J3253N96N063K513k76k182O148N239n208l464L00k3884l3164
14103F9603j3537j0343O579J3008K6784K5016k8456o2341J1450J4596o265n933
14091D0161k729K3046o889J2237n714k729N586P479L4J0367L030q199k1845l3385
14077B0450L614R654Q553K7789Q22m536n534j3143J2506j43k339J8580k3047l3056
14063B0170p600j1361P956K2976j1878k481o00J4578K5081r609J1100J2793k8558
$$ plain form
14050 42567 49539 57972 43933 51332 73676 90122 118260 67280 30870 57743 48360 45295 39170
14037 39170 55700 63356 41005 41807 46985 37108 40558 65294 78997 73756 47871 17347 15985
14024 15985 19807 20994 21763 24198 35842 42904 40251 45605 40177 47681 58312 64516 64681 76618
14010 76618 68994 68094 64469 69936 82862 85674 98103 57535 38344 60700 58866 72036 80578
13997 80578 88801 82622 77694 65333 43615 66033 58008 62129 37514 35978 45987 52890 44636
13984 44636 22150 23583 17431 4606 14608 43955 53706 55713 43469 47950 78477 67827 44023
13971 44023 53319 62329 28625 34946 44747 60872 61283 42412 57052 65405 75017 83443 68074
13958 68074 63312 56793 61233 89326 113944 130492 104905 74232 57186 44398 34412 48626
$$ packed form
14050D2567O972Q433j4039P399K2344J6446K8138n0980l6410K6873r383l065o125
14037C9170J6530P656k2351Q02N178r877L450K4736J3703n241k5885l0524j362
14024A5985L822J187P69K435J1644P062k653N354n428P504J0631O204J65J1937
14010G6618p624r00l625N467J2926K812J2429m0568j9191K2356j834J3170Q542
13997H0578Q223o179m928j2361k1718K2418q025M121k4615j536J0009O903q254
13984D4636k2486J433o152j2825J0002K9347R751K007j2244M481L0527j0650k3804
13971D4023R296R010l3704O321R801J6125M11j8871J4640Q353R612Q426j5369
13958F8074m762o519M440K8093K4618J6548k5587l0673j7046j2788r986J4214
$$ plain form
13946 48626 61634 45670 47875 59613 70748 32857 35535 37667 50537 69909 64973 43994
13934 43994 57696 82258 67337 57359 75741 80735 49218 39553 59166 64458 58086 79110 82972
13921 82972 97529 89353 45374 32505 51242 48834 75356 102974 90831 94328 60223 39078
13909 39078 62872 73801 69201 44300 44082 51765 70855 86832 85801 76920 73078 74514 73112
13896 73112 76559 65456 40084 61434 79522 77741 66703 54864 40343 41811 29627 50609
13884 50609 38474 32586 44021 44380 55710 55340 66054 80035 89967 102145 81231 81511 79051
13871 79051 51545 51289 59109 39942 33810 42278 43757 26068 10330 50544 71824 69689 65857
13858 65857 47211 56132 58814 55270 56122 49367 51022 57477 78822 80328 92815 93687 97680 124717
$$ packed form
13946D8626J3008j5964K205J1738J1135l7891K678K132J2870J9372m936k0979
13934D3994J3702K4562j4921r978J8382M994l1517r665J9613N292o372K1024L862
13921H2972J4557q176m3979j2869J8737k408K6522K7618j2143L497l4105k1145
13909C9078K3794J0929m600k4901k18P683J9090J5977j031q881l842J436j402
13896G3112L447j1103k5372K1350J8088j781j1038j1839j4521J468j2184K0982
13884E0609j2135n888J1435L59J1330l70J0714J3981R932J2178k0914K80k460
13871G9051k7506k56P820j9167o132Q468J479j7689j5738M0214K1280k135l832
13858F5857j8646Q921K682l544Q52o755J655O455K1345J506J2487Q72L993K7037
$$ plain form
13844 124717 121164 89958 69567 55643 56408 49509 82334 95390 88556 76732 55509 42717
13832 42717 51443 80038 80125 61912 55188 63618 76560 81986 73398 54674 53564 38020 27111
13819 27111 39343 48727 41478 41652 60779 49701 39461 46335 43862 47242 33450 21431 27576
13806 27576 55026 73464 71778 74865 95123 82935 71227 92976 92685 97636 80178 80184 77480 62945
13792 62945 64232 75354 56376 30824 26557 25752 27721 47244 81031 108567 86013 76640 72804
13779 72804 58034 67428 58788 57107 69775 70316 68472 53701 54727 48952 76129 107221 127347
13766 127347 100793 80245 64576 57941 64221 69317 90970 97072 80949 47173 21060 41445
13754 41445 41491 44578 62486 70957 70009 101957 76437 75921 96340 96024 87841 76622 78621 74319
$$ packed form
13844A24717l553l1206k0391j3924P65o899L2825J3056o834j1824k1223j2792
13832D2717Q726K8595Q7j8213o724Q430J2942N426q588j8724j110j5544j0909
13819B7111J2232R384p249J74J9127j1078j0240O874k473L380j3792j2019O145
13806B7576K7450J8438j686L087K0258j2188j1708K1749k91M951j7458Ok704j4535
13792F2945J287J1122j8978k5552m267q05J969J9523L3787K7536k2554r373l836
13779G2804j4770R394q640j681J2668N41j844j4771J026n775K7177L1092K0126
13766A27347k6554k0548j5669o635O280N096K1653O102j6123l3776k6113K0385
13754D1445M6L087J7908Q471r48L1948k5520n16K0419l16q183j1219J999m302
$$ plain form
13740 74319 86453 106251 133312 138728 106646 129196 146742 106490 63730 50858 52116 64129
13728 64129 48546 61328 62790 53469 76385 95628 113392 107059 96158 113889 113833 89184 91934
13715 91934 92944 93893 91909 84227 95920 71737 70592 59766 59586 70596 67918 59584 64750 87375
13701 87375 80401 46990 54579 78266 90152 90504 80846 66463 59932 52226 51074 55198 63388 75520
13687 75520 72089 58471 57886 87324 94947 67216 40045 27980 21381 11681 36633 91202 102459
13674 102459 79946 52616 39931 33872 63925 78496 47090 70263 91574 112171 88609 90939
13662 90939 95293 96296 112922 86258 51214 59102 69782 71691 88668 62259 34405 50817
13650 50817 72011 74201 65701 71992 79839 107723 126453 132473 123592 112480 78548 50100 51992
$$ packed form
13740G4319J2134J9798K7061N416l2082K2550J7546m0252m2760j2872J258J2013
13728F4129j5583J2782J462r321K2916J9243J7764o333j0901J7731n6k4649K750
13715I1934J010R49j984p682J1693k4183j145j0826j80J1010k678q334N166K2625
13701H7375o974l3411P589K3687J1886L52r658j4383o531p706j152M124Q190J2132
13687G5520l431j3618n85K9438P623k7731k7171j2065o599r700K4952N4569J1257
13674A02459k2513k7330j2685o059L0053J4571l1406K3173K1311K0597k3562K330
13662I0939M354J003J6626k6664l5044P888J0680J909J6977k6409k7854J6412
13650E0817K1194K190q500O291P847K7884J8730O020q881j1112l3932k8448J892
$$ plain form
13637 51992 47240 69183 117445 122757 112691 92563 79030 76155 80316 116559 99183 84129
13625 84129 71870 74477 112506 89082 105890 108735 121453 111489 87860 82346 68267 74752 84179
13612 84179 54964 71397 103082 90331 105748 104025 117198 124584 117485 90087 59430 81737
13600 81737 99303 123132 107544 112960 115341 106692 81179 69550 82424 64106 56124 60189 68512
13587 68512 61350 70163 91934 98518 90665 76725 76933 81987 79101 88195 96686 88269 90459 66868
13573 66868 30465 69299 85345 90358 75470 56710 86025 82879 98497 121974 96416 77608
13561 77608 89287 114194 91817 70550 82197 76574 81815 85347 102218 79596 60871 70229
13549 70229 90949 85360 97483 126471 121225 112865 127948 129635 120330 97498 109158 146040 149676
$$ packed form
13637E1992m752K1943M8262N312j0066k0128j3533k875M161L6243j7376j5054
13625H4129j2259K607L8029k3424J6808K845J2718r964k3629n514j4079O485R427
13612H4179k9215J6433L1685j2751J5417j723J3173P386p099k7398l0657K2307
13600H1737J7566K3829j5588N416K381q649k5513j1629J2874j8318p982M065Q323
13587F8512p162Q813K1771O584p853j3940K08N054k886R094Q491q417K190k3591
13573F6868l6403L8834J6046N013j4888j8760K9315l146J5618K3477k5558j8808
13561G7608J1679K4907k2377k1267J1647n623N241L532J6871k2622j8725R358
13549G0229K0720n589J2123K8988n246q360J5083J687r305k2832J1660L6882L636
$$ plain form
13536 149676 119682 84570 81726 74204 72301 116748 127044 121761 122987 105363 78677 74835 89993
13523 89993 100272 87466 70484 74394 108714 107576 78389 100205 107439 133831 114123 113472 125987
13510 125987 109324 121916 123578 114755 129990 125559 106295 116647 123024 131191 130940 153146 139133
13497 139133 131213 157128 160444 136581 130900 119686 130013 123023 117353 135928 120770 106489
13485 106489 112066 122032 131599 149446 147600 122599 114560 141748 137347 105982 102490 106495 95454
13472 95454 111096 131636 157443 152503 131487 112041 119668 120131 94648 94387 133167 167711 179919
13459 179919 172471 160850 157090 148034 144179 139235 136261 150235 166428 123124 103335 114073 96398
13446 96398 94599 105242 130877 138879 116602 131977 148239 147382 155843 141530 129556 134085 121160
$$ packed form
13536A49676k9994l5112k844p522j903M4447J0296n283J226j7624k6686l842J5158
13523H9993J0279j2806j6982L910L4320j138k9187K1816P234K6392j9708o51J2515
13510A25987j6663J2592J662q823J5235m431j9264J0352O377Q167k51K2206j4013
13497A39133p920K5915L316k3863n681j1214J0327o990n670J8575j5158j4281
13485A06489N577R966R567J7847j846k5001q039K7188m401l1365l492M005j1041
13472I5454J5642K0540K5807m940k1016j9446P627M63k5483k61L8780L4544J2208
13459A79919p448j1621l760r056l855m944k974J3974J6193m3304j9789J0738j7675
13446I6398j799J0643K5635Q002k2277J5375J6262q57Q461j4313j1974M529j2925
$$ plain form
13433 121160 121121 111421 122286 130931 132429 141749 147806 142519 113138 123742 148936 158183 127456
13420 127456 104157 86110 91951 109809 114655 129269 126594 100487 106428 114523 122471 115656 146131
13407 146131 158912 161004 147795 130894 135997 127361 130698 143994 167670 152670 121713 123348
13395 123348 136262 121980 144060 152569 145315 128265 154786 165414 196899 212022 197963 169766
13383 169766 162947 146972 127564 148155 172383 187155 182875 186685 194387 172715 150213 153947
13371 153947 150657 143740 147404 170578 150493 125197 122682 125110 128433 146089 174651 168701 115669
13358 115669 103157 132801 179505 189579 173813 141094 132836 163662 201216 210180 211306 212854
13346 212854 189731 199889 181910 153621 154254 156967 166430 194895 205292 189227 167850 158955
$$ packed form
13433A21160l9r700J0865Q645J498R320O057n287k9381J0604K5194R247l0727
13420A27456k3299j8047N841J7858M846J4614k675k6107N941Q095P948o815L0475
13407A46131J2781K092j3209j6901N103q636L337J3296K3676j5000l0957J635
13395A23348J2914j4282K2080Q509p254j7050K6521J0628L1485J5123j4059k8197
13383A69766o819j5975j9408K0591K4228J4772m280L810P702k1672k2502L734
13371A53947l290o917L664K3174k0085k5296k515K428L323J7656K8562n950n3032
13358A15669j2512K9644M6704J0074j5766l2719q258L0826L7554Q964J126J548
13346B12854k3123J0158j7979k8289O33K713R463K8465J0397j6065k1377q895
$$ plain form
13334 158955 139950 149559 184721 161446 145458 125538 137932 140625 163197 171605 163045 178562
13322 178562 173252 139127 134978 125131 141496 180289 201977 188651 199288 209467 207473 181991
13310 181991 180821 187952 188035 163736 167932 149983 128253 146354 171679 180882 172281 166727 187876
13297 187876 205457 227776 193334 155920 143583 165488 196344 176949 171586 181055 177499 144081
13285 144081 166001 196204 197209 210956 219723 186540 174861 197925 207931 204799 202342 182082
13273 182082 181222 181647 167258 156984 162562 178922 172449 153765 160865 202623 207894 193967 173130
13260 173130 159899 180329 179724 156278 156987 165251 175186 204882 219793 214081 219146 202931 211610
13247 211610 199003 201470 205307 181640 179303 186274 178381 205620 240189 231428 246701 237178 200390
$$ packed form
13334A58955j9005R609L5162k3275j5988j9920J2394K693K2572Q408q560J5517
13322A78562n310l4125m149r847J6365L8793K1688j3326J0637J0179j994k5482
13310A81991j170P131Q3k4299M196j7949k1730J8101K5325R203q601n554K1149
13297A87876J7581K2319l4442l7414j2337K1905L0856j9395n363R469l556l3418
13285A44081K1920L0203J005J3747Q767l3183j1679K3064J0006l132k457k0260
13273A82082q60M25j4389j0274N578J6360o473j8684P100M1758N271j3927k0837
13260A73130j3231K0430o05k3446P09Q264R935K9696J4911n712N065j6215Q679
13247B11610j2607K467L837k3667k337O971p893K7239L4569q761J5273r523l6788
$$ plain form
13234 200390 180694 183918 212972 208839 223231 241592 232930 225997 204236 195575 192631 186414 176633
13221 176633 192280 192917 222464 205416 175041 182075 195094 206480 215925 209617 197662 197122 205799
13208 205799 217339 221488 229132 188448 182170 182798 191564 210246 192778 199985 218975 218833 221811
13195 221811 227961 229041 230945 223462 231251 242637 223742 207836 203079 218008 223321 241516 232771
13182 232771 213930 214866 222857 214772 200151 207278 207089 200435 218202 242384 234769 254070 249772
13169 249772 251710 254562 245298 210934 208975 241329 230589 237516 228177 217386 225894 228993 201539
13156 201539 195444 221013 251702 247582 216194 199361 191600 188115 204380 236304 257606 232581
13144 232581 230165 269104 241569 242753 241123 261647 261458 265287 265553 262108 248005 243830 247044 244721
$$ packed form
13234B00390j9696L224K9054m133J4392J8361q662o933k1761q661k944o217r781
13221A76633J5647O37K9547j7048l0375P034J3019J1386R445o308j1955n40Q677
13208B05799J1540M149P644m0684o278O28Q766J8682j7468P207J8990j42K978
13195B21811O150J080J904p483P789J1386j8895j5906m757J4929N313J8195q745
13182B32771j8841R36P991q085j4621P127j89o654J7767K4182p615J9301m298
13169B49772J938K852r264l4364j959L2354j0740O927r339j0791Q508L099k7454
13156B01539o095K5569L0689m120l1388j6833p761l485J6265L1924K1302k5025
13144B32581k416L8939k7535J184j630K0524j89L829K66l445j4103m175L214k323
$$ plain form
13130 244721 254258 251516 264701 264302 243548 254770 266571 256508 244270 233136 221522 206449
13118 206449 204429 219590 240847 260308 243785 223795 213817 224367 241476 243967 269679 301855
13106 301855 311220 302898 292823 283117 276963 242376 224784 232920 255483 239497 242785 244225 249195
13093 249195 242416 270729 282112 279146 286693 292290 259680 240107 252227 291903 279173 253107
13081 253107 258216 277362 289887 285507 287301 289974 282391 275869 287668 276499 268528 256555 243087
13068 243087 226223 239606 277206 264248 259350 273714 264626 271587 281814 296775 299608 320665
13056 320665 327275 314975 298078 302005 309524 297480 315098 325715 344842 377382 367979 366155
13044 366155 331954 278790 286810 321516 334574 340083 327570 331347 361019 388034 417489 418953
$$ packed form
13130B44721R537k742J3185l99k0754J1222J1801j0063j2238j1134j1614j5073
13118B06449k020J5161K1257J9461j6523j9990r978J0550J7109K491K5712L2176
13106C01855R365q322j0075r706o154l4587j7592Q136K2563j5986L288J440M970
13093B49195o779K8313J1383k966P547N597l2610j9573J2120L9676j2730k6066
13081B53107N109J9146J2525m380J794K673p583o522J1799j1169p971j1973j3468
13068B43087j6864J3383L7600j2958m898J4364r088O961J0227J4961K833K1057
13056C20665O610j2300j6897L927P519j2044J7618J0617J9127L2540r403j824
13044C66155l4201n3164Q020L4706J3058N509j2513L777K9672K7015K9455J464
$$ plain form
13032 418953 448023 492061 561114 667551 793001 907913 1027106 1139156 1223930 1253869
13022 1253869 1204731 1108423 976029 852195 718708 625153 556052 517012 479765 437560 405831
13011 405831 382609 393774 375866 369679 393180 397073 394064 391859 351158 336941 353725 349209
12999 349209 348891 314502 304811 312731 288297 293342 294248 314207 321589 332022 341654 364138 367404
12986 367404 381146 366466 324386 317006 326096 333353 350085 360903 344371 297442 272012 268783
12974 268783 274551 286001 309432 316600 326581 335202 318707 311490 323643 305991 308034 320152 328547
12961 328547 339316 354059 340076 340115 323220 311291 325046 351119 369702 336155 316885 324903
12949 324903 334306 283098 308121 328991 338125 341192 348929 366540 376630 375005 385801 385781 352353
$$ packed form
13032D18953K9070M4038O9053J06437J25450J14912J19193J12050Q4774K9939
13022A253869m9138r6308j32394j23834j33487r3555o9101l9040l7247m2205l1729
13011D05831k3222J1165j7908o187K3501L893l009k205m0701j4217J6784m516
12999C49209l18l4389r691P920k4434N045R06J9959P382J0433R632K2484L266
12986C67404J3742j4680m2080p380R090P257J6732J0818j6532m6929k5430l229
12974B68783N768J1450K3431P168R981Q621j6495p217J2153j7652K043J2118Q395
12961C28547J0769J4743j3983L9j6895j1929J3755K6073J8583l3547j9270Q018
12949C24903R403n1208K5023K0870R134L067P737J7611J0090j625J0796k0l3428
$$ plain form
12936 352353 321015 323564 323301 311808 332756 347300 333716 337512 365987 379698 388186 385808 358456
12923 358456 369704 380571 371812 370970 383955 369104 373443 378882 380667 373199 396418 444182 434088
12910 434088 405716 403071 396124 388714 370074 366484 373862 382205 391715 383675 393003 382999 373086
12897 373086 357661 359158 381542 393511 403840 405996 396062 395015 400236 385966 365506 367495 407260
12884 407260 420566 411532 412736 408170 399283 395199 352076 355707 389431 413358 417701 413159 415725
12871 415725 419198 424566 423165 414851 403036 384455 379034 411961 403062 399906 401110 405388 423973
12858 423973 416520 404895 398304 420336 430516 421998 393186 388305 410325 414628 424882 440310
12846 440310 461357 454835 453746 462367 453662 439150 440873 434031 407623 395773 423173 462784 468188
$$ packed form
12936C52353l1338K549k63j1493K0948J4544j3584L796K8475J3711Q488k378k7352
12923C58456J1248J0867q759q42J2985j4851M339N439J785p468K3219M7764j0094
12910D34088k8372k645o947p410j8640l590P378Q343R510q040R328j0004r913
12897C73086j5425J497K2384J1969J0329K156r934j047N221j4270k0460J989L9765
12884D07260J3306r034J204m566q887m084m3123L631L3724K3927M343m542K566
12871D15725L473N368j401q314j1815j8581n421L2927q899l156J204M278J8585
12858D23973p453j1625o591K2032J0180q518k8812m881K2020M303J0254J5428
12846D40310K1047o522j089Q621q705j4512J723o842k6408j1850K7400L9611N404
$$ plain form
12833 468188 465161 461702 487661 490039 479905 462135 444522 427890 432407 461398 474260 469325
12821 469325 476923 461236 442398 427485 413350 433881 427765 441800 429719 452214 475577 503052
12809 503052 509676 476718 471299 484024 491865 476253 456995 442188 449906 473132 503005 510008
12797 510008 485069 473438 471920 489799 481149 469753 473583 474117 477273 484271 443849 455804 492892
12784 492892 523473 510251 510741 530527 506422 476117 467705 477235 497737 492768 492746 480012 495858
12771 495858 530335 527231 483527 484720 489974 497629 504065 512884 508391 520331 542650 565561 542415
12758 542415 532824 541908 535879 556389 571647 561557 537797 551987 573834 573096 543565 539442 556150
12745 556150 563965 557395 566857 567549 550324 543842 560285 573569 581847 575436 550418 542679 550022
$$ packed form
12833D68188l027l459K5959K378j0134j7770j7613j6632M517K8991J2862m935
12821D69325P598j5687j8838j4913j4135K0531o116J4035j2081K2495K3363K7475
12809E03052O624l2958n419J2725P841j5612j9258j4807P718K3226K9873P003
12797E10008k4939j1631j518J7879q650j1396L830N34L156O998m0422J1955L7088
12784D92892L0581j3222M90J9786k4105l0305q412R530K0502m969k2j2734J5846
12771D95858L4477l104m3704J193N254P655O436Q819m493J1940K2319K2911k3146
12758E42415r591R084o029K0510J5258j0090k3760J4190K1847p38k9531m123J6708
12745E56150P815o570R462O92j7225o482J6443J3284Q278o411k5018p739P343
$$ plain form
12732 550022 534178 549371 572159 540252 549926 556561 561863 586115 579671 569263 562011 553344 567773
12719 567773 568633 592774 599248 616288 595978 588162 581802 613118 628108 622767 622305 614795 605823
12706 605823 598899 593280 589270 604061 628993 620983 624211 628570 647243 627488 609132 601132 627915
12693 627915 640696 629816 608829 604450 592429 599466 604619 616415 628363 654153 650265 661490
12681 661490 682067 640047 623768 664295 659267 656858 675220 684967 693307 701216 698055 673155 681414
12668 681414 695398 681051 695290 704510 684952 685964 664036 641958 669559 690582 686127 673275
12656 673275 639332 624554 666068 689438 688143 683144 703286 705880 717326 720103 707554 721362
12644 721362 716596 718226 718338 692240 682766 702091 721921 719417 712558 715941 707609 687563 669492
$$ packed form
12732E50022j5844J5193K2788l1907R674O635N302K4252o444j0408p252q667J4429
12719E67773Q60K4141O474J7040k0310p816o360L1316J4990n341m62p510q972
12706F05823o924n619m010J4791K4932q010L228M359J8673j9755j8356q000K6783
12693F27915J2781j0880k0987m379j2021P037N153J1796J1948K5790l888J1225
12681F61490K0577m2020j6279M0527n028k409J8362R747Q340P909l161k4900Q259
12668F81414J3984j4347J4239R220j9558J012k1928k2078K7601K1023m455j2852
12656F73275l3943j4778M1514K3370j295m999K0142K594J1446K777j2549J3808
12644G21362m766J630J12k6098r474J9325J9830k504o859L383q332k0046j8071
$$ plain form
12631 669492 670745 672842 691867 716635 734743 725411 729013 758469 741840 714325 738811 765439
12619 765439 735336 711879 720656 741738 751874 740135 727078 734600 747332 732234 723894 727109
12607 727109 752952 750371 738103 766701 803654 809194 830145 815479 785749 763241 751770 761920
12595 761920 761765 773629 789162 802653 811131 822218 834438 814433 802985 790252 781569 798948
12583 798948 820570 793858 784028 807588 805293 801854 816751 818536 825325 836228 823751 839760
12571 839760 856879 852952 844258 865009 882111 877921 893006 901321 906039 904095 901355 898086 875957
12558 875957 870224 895583 935028 944674 951136 931963 901150 895286 909677 900583 877014 902948
12546 902948 915443 907417 919585 934106 921548 911533 948871 986122 996968 1010202 989889 988112
$$ packed form
12631F69492J253K097J9025K4768J8108r332L602K9456j6629k7515K4486K6628
12619G65439l0103k3457Q777K1082J0136j1739j3057P522J2732j5098q340L215
12607G27109K5843k581j2268K8598L6953N540K0951j4666k9730k2508j1471J0150
12595G61920j55J1864J5533J3491Q478J1087J2220k0005j1448j2733q683J7379
12583G98948K1622k6712r830K3560k295l439J4897J785O789J0903j2477J6009
12571H39760J7119l927q694K0751J7102m190J5085Q315M718j944k740l269k2129
12558H75957n733K5359L9445R646O462j9173l0813n864J4391r094k3569K5934
12546I02948J2495q026J2168J4521j2558j0015L7338L7251J0846J3234k0313j777
$$ plain form
12534 988112 982858 970476 974140 970446 956609 953370 972898 959779 945751 938339 945634 951833 972590
12521 972590 988285 973863 979042 980260 1020059 1009383 989803 990291 991898 1009693 1007965 979398 944037
12508 944037 938785 972004 1010822 1019927 1008525 999288 1012887 1040726 1048840 1038062 1029752 1023214 1029578
12495 1029578 1084072 1099357 1041536 1032097 1033256 1057023 1058576 1084321 1094782 1103960 1109612 1110286 1110827
12482 1110827 1130356 1127773 1110794 1104287 1109135 1116233 1125962 1131031 1122709 1140455 1171131 1179388 1172192
12469 1172192 1163517 1150304 1162269 1167141 1152728 1142829 1169628 1206064 1226117 1200394 1205895 1216475
12457 1216475 1225061 1239809 1222145 1201146 1192753 1188013 1195163 1194385 1162741 1178494 1209994 1228575
12445 1228575 1243686 1255292 1277400 1263310 1288903 1316986 1329852 1329088 1326819 1290895 1263538 1265632
$$ packed form
12534I88112n254j2382L664l694j3837l239J9528j3119j4028p412P295O199K0757
12521I72590J5695j4422N179J218L9799j0676j9580M88J607J7795j728k8567l5361
12508I44037n252L3219L8818R105j1402r237J3599K7839Q114j0778q310o538O364
12495A029578N4494J5285n7821r439J159K3767J553K5745J0461R178N652O74N41
12482A110827J9529k583j6979o507M848P098R729N069q322J7746L0676Q257p196
12469A172192q675j3213J1965M872j4413r899K6799L6436K0053k5723N501J0580
12457A216475Q586J4748j7664k0999q393m740P150p78l1644J5753L1500J8581
12445A228575J5111J1606K2108j4090K5593K8083J2866p64k269l5924k7357K094
$$ plain form
12433 1265632 1285132 1279410 1267996 1283364 1284136 1293068 1314031 1339268 1335914 1306189 1312059 1348047
12421 1348047 1370070 1373364 1363285 1359668 1373902 1381306 1365272 1377789 1377286 1358398 1361148 1379003
12409 1379003 1394016 1390372 1377418 1377078 1389177 1371191 1364993 1365060 1356298 1370849 1393159 1380826 1396268
12396 1396268 1382125 1400439 1417994 1448964 1463048 1488336 1480646 1478939 1463415 1458462 1490503 1502920
12384 1502920 1490149 1483197 1486772 1488125 1500528 1508230 1497323 1500499 1490499 1503003 1534929 1523550
12372 1523550 1506972 1496848 1513936 1528106 1549158 1609605 1627717 1628551 1596312 1579250 1581303 1599064
12360 1599064 1610735 1620891 1621810 1617578 1622439 1642239 1644364 1639292 1638037 1653557 1652744 1649331 1642940
12347 1642940 1651076 1674248 1687230 1698408 1719684 1733368 1720636 1726957 1756196 1776243 1773750 1766905
$$ packed form
12433A265632J9500n722j1414J5368P72Q932K0963K5237l354k9725N870L5988
12421A348047K2023L294j0079l617J4234P404j6034J2517n03j8888K750J7855
12409A379003J5013l644j2954l40J2099j7986o198O7q762J4551K2310j2333J5442
12396A396268j4143J8314J7555L0970J4084K5288p690j707j5524m953L2041J2417
12384A502920j2771o952L575J353J2403P702j0907L176j0000J2504L1926j1379
12372A523550j6578j0124J7088J4170K1052O0447J8112Q34l2239j7062K053J7761
12360A599064J1671J0156R19m232M861J9800K125n072j255J5520q13l413o391
12347A642940Q136K3172J2982J1178K1276J3684j2732O321K9239K0047k493o845
$$ plain form
12335 1766905 1758503 1749676 1740890 1754952 1737473 1740933 1761937 1746299 1733164 1733325 1757220 1763952 1792792
12322 1792792 1805393 1814356 1828040 1839682 1862828 1858498 1859415 1831698 1815808 1838492 1831075 1832613
12310 1832613 1860833 1890989 1882220 1914449 1957660 1958673 1936172 1928889 1917484 1940633 1945937 1935793
12298 1935793 1933420 1924945 1938386 1974927 1973359 1963750 2000845 2044125 2065505 2075156 2064174 2052652
12286 2052652 2046730 2044110 2043828 2072996 2077151 2080570 2091804 2101497 2108829 2116821 2107928 2117014 2127594
12273 2127594 2111859 2114500 2143556 2192055 2201628 2207003 2207814 2216712 2225180 2253429 2283532 2277756 2258551
12260 2258551 2259378 2294064 2317240 2321067 2338529 2328970 2332641 2343204 2359904 2358119 2362011 2394851 2404040
12247 2404040 2400043 2410978 2424553 2422802 2409735 2430338 2465928 2468341 2456890 2432694 2435936 2457441
$$ packed form
12335A766905q402q827q786J4062j7479L460K1004j5638j3135J61K3895O732K8840
12322A792792J2601Q963J3684J1642K3146m330R17k7717j5890K2684p417J538
12310A832613K8220L0156q769L2229M3211J013k2501p283j1405K3149N304j0144
12298A935793k373q475J3441L6541j568r609L7095M3280K1380R651j0982j1522
12286B052652n922k620k82K9168M155L419J1234R693P332P992q893R086J0580
12273B127594j5735K641K9056M8499R573N375Q11Q898Q468K8249L0103n776j9205
12260B258551Q27L4686K3176L827J7462r559L671J0563J6700j785L892L2840R189
12247B404040l997J0935J3575j751j3067K0603L5590K413j1451k4196L242K1505
$$ plain form
12235 2457441 2457289 2453447 2474426 2468521 2466042 2483769 2494469 2495690 2492144 2515152 2531945 2554889 2595527
12222 2595527 2606051 2627298 2670368 2690480 2686051 2690773 2713359 2734453 2744252 2768549 2814165 2806120
12210 2806120 2810274 2863028 2916091 2976966 3013754 3097027 3189228 3247358 3274489 3284456 3275697 3250301
12198 3250301 3216710 3172692 3097655 3043513 3004442 2979719 2964755 2967691 2971715 2950816 2944161 2914118
12186 2914118 2909678 2933354 2963775 2984961 2988046 3015440 3017124 3019440 3026310 3009217 3020377 3051267
12174 3051267 3081575 3117400 3091204 3069078 3063371 3068491 3105746 3132659 3154924 3181505 3167092 3172224
12162 3172224 3220149 3248313 3247128 3259427 3264238 3254921 3253366 3276895 3278674 3279132 3293470 3290913 3290930
12149 3290930 3292620 3337661 3398217 3417399 3426283 3413724 3376365 3371020 3383850 3403379 3420100 3454338
$$ packed form
12235B457441j52l842K0979n905k479J7727J0700J221l546K3008J6793K2944M0638
12222B595527J0524K1247M3070K0112m429M722K2586K1094R799K4297M5616q045
12210B806120M154N2754N3063O0875L6788Q3273R2201N8130K7131R967q759k5396
12198C250301l3591m4018p5037n4142l9071k4723j4964K936M024k0899o655l0043
12186B914118m440K3676L0421K1186L085K7394J684K316O870j7093J1160L0890
12174C051267L0308L5825k6196k2126n707N120L7255K6913K2265K6581j4413N132
12162C172224M7925K8164j185J2299M811r317j555K3529J779M58J4338k557J7
12149C290930J690M5041O0556J9182Q884j2559l7359n345J2830J9529J6721L4238
$$ plain form
12137 3454338 3459875 3470249 3472120 3470433 3470589 3506443 3527590 3535237 3536049 3533912 3526906 3541944 3563002
12124 3563002 3601658 3627417 3659905 3650091 3675469 3694512 3721723 3730355 3701964 3699691 3726034 3736179
12112 3736179 3756241 3759534 3781798 3805571 3820523 3832805 3877085 3888032 3887937 3865163 3875068 3875513 3863706
12099 3863706 3883909 3929076 3960115 3959669 3959613 3969679 3985804 4002761 4012794 4010992 4012988 4055483 4076803
12086 4076803 4059884 4072059 4096838 4102002 4108499 4108454 4121592 4137304 4134318 4159764 4179921 4204995
12074 4204995 4198729 4194720 4229836 4270065 4310590 4295559 4287484 4288207 4293024 4311170 4331787 4331357 4325022
12061 4325022 4327880 4346310 4361286 4379412 4410857 4443296 4457900 4458712 4464538 4475178 4488599 4497854
12049 4497854 4513453 4528783 4550955 4555315 4571128 4601765 4606738 4600983 4624361 4644822 4668589 4704353
$$ packed form
12137C454338N537J0374J871j687J56L5854K1147P647Q12k137p006J5038K1058
12124C563002L8656K5759L2488r814K5378J9043K7211Q632k8391k273K6343J0145
12112C736179K0062L293K2264K3773J4952J2282M4280J0947r5k2774R905M45j1807
12099C863706K0203M5167L1039m46n6J0066J6125J6957J0033j802J996M2495K1320
12086D076803j6919J2175K4779N164O497m5J3138J5712k986K5446K0157K5074
12074D204995o266m009L5116M0229M0525j5031q075P23M817J8146K0617m30o335
12061D325022K858J8430J4976J8126L1445L2439J4604Q12N826J0640J3421R255
12049D497854J5599J5330K2172M360J5813L0637M973n755K3378K0461K3767L5764
$$ plain form
12037 4704353 4694182 4694463 4712166 4731089 4751894 4752510 4754019 4775030 4763126 4746616 4751744 4780607
12025 4780607 4823807 4820957 4804366 4817016 4828849 4833662 4823024 4839441 4837669 4850267 4883206 4906840
12013 4906840 4918371 4931015 4953874 4962366 4966526 4985109 5007761 5010087 4983219 4993798 5018655 5040561
12001 5040561 5067235 5100893 5106580 5085110 5099705 5122649 5124031 5153263 5157783 5142346 5134557 5136568
11989 5136568 5160042 5177191 5172118 5180265 5200868 5226610 5206371 5214113 5211539 5225342 5244282 5282439
11977 5282439 5316437 5308423 5298825 5301199 5282391 5288370 5292249 5289679 5328543 5350996 5348685 5344876 5334761
11964 5334761 5329517 5331781 5340989 5361542 5377135 5384490 5388726 5405884 5408846 5390533 5404215 5410609 5411125
11951 5411125 5411203 5419534 5429207 5416997 5434772 5447944 5455178 5454393 5468827 5477042 5463609 5479390 5486991
$$ packed form
12037D704353j0171K81J7703J8923K0805O16J509K1011j1904j6510N128K8863
12025D780607M3200k850j6591J2650J1833M813j0638J6417j772J2598L2939K3634
12013D906840J1531J2644K2859Q492M160J8583K2652K326k6868J0579K4857K1906
12001E040561K6674L3658N687k1470J4595K2944J382K9232M520j5437p789K011
11989E136568K3474J7149n073Q147K0603K5742k0239P742k574J3803J8940L8157
11977E282439L3998q014r598K374j8808N979L879k570L8864K2453k311l809j0115
11964E334761n244K264R208K0553J5593P355M236J7158K962j8313J3682O394N16
11951E411125P8Q331R673j2210J7775J3172P234p85J4434Q215j3433J5781P601
$$ plain form
11938 5486991 5489491 5488176 5491072 5479584 5460469 5485095 5507569 5488641 5479099 5475010 5502838 5503101 5503911
11925 5503911 5499892 5496272 5521050 5535229 5531722 5549382 5538913 5534465 5549080 5544375 5538727 5543097 5534681
11912 5534681 5522009 5509111 5519826 5546493 5563846 5576539 5573778 5577565 5564511 5556935 5521441 5495582
11900 5495582 5505915 5511639 5531196 5527461 5538865 5538200 5526877 5528338 5520977 5537654 5509182 5497784
11888 5497784 5520031 5511569 5518064 5519671 5548403 5533985 5502176 5483054 5483811 5472108 5481742 5513887
11876 5513887 5478727 5464466 5450650 5453709 5452718 5471860 5470782 5476098 5457799 5426975 5419004 5419036 5402710
11863 5402710 5411919 5423630 5409780 5380333 5385010 5405198 5399620 5398434 5388962 5358987 5342592 5311646
11851 5311646 5317993 5319965 5320663 5318402 5282506 5257016 5256538 5254403 5266151 5264316 5264759 5281607 5289490 5290493
$$ packed form
11938E486991K500j315K896j1488j9115K4626K2474j8928r542m089K7828K63Q10
11925E503911m019l620K4778J4179l507J7660j0469m448J4615m705n648M370q416
11912E534681j2672j2898J0715K6667J7353J2693k761L787j3054p576l5494k5859
11900E495582J0333N724J9557l735J1404o65j1323J461p361J6677k8472j1398
11888E497784K2247q462O495J607K8732j4418l1809j9122P57j1703R634L2145
11876E513887l5160j4261j3816L059r91J9142j078N316j8299l0824p971L2j6326
11863E402710R209J1711j3850k9447M677K0188n578j186r472k9975j6395l0946
11851E311646O347J972O98k261l5896k5490m78k135J1748j835M43J6848P883J003
$$ plain form
11837 5290493 5266866 5220839 5204479 5219067 5220693 5217562 5192041 5195458 5192141 5156319 5152359 5161705
11825 5161705 5165884 5161688 5134867 5107829 5094430 5090761 5083255 5080662 5079670 5060652 5024590 5031702 5020711
11812 5020711 5004591 4980277 4966102 4963577 4953011 4921033 4922444 4952020 4984280 4979815 4973953 4954614
11800 4954614 4929197 4907615 4877275 4845626 4847261 4870376 4859846 4830975 4803701 4781560 4761063
11789 4761063 4780427 4791656 4764932 4727129 4716180 4720510 4730479 4751423 4749722 4726896 4723868 4682142
11777 4682142 4648223 4637460 4686674 4675313 4634910 4629448 4621999 4598073 4595356 4617734 4620469 4609353
11765 4609353 4596159 4562804 4547447 4527517 4490383 4452816 4445716 4449976 4454600 4455155 4438841 4429136
11753 4429136 4403869 4378495 4372006 4371956 4356650 4351464 4323694 4297777 4291109 4256333 4221849 4230844 4251008
$$ packed form
11837E290493k3627m6027j6360J4588J626l131k5521L417l317l5822l960R346
11825E161705M179m196k6821k7038j3399l669p506k593r92j9018l6062P112j0991
11812E020711j6120k4314j4175k525j0566l1978J411K9576L2260m465n862j9339
11800D954614k5417k1582l0340l1649J635K3115j0530k8871k7274k2141k0497
11789D761063J9364J1229k6724l7803j0949M330R969K0944j701k2826l028m1726
11777D682142l3919j0763M9214j1361m0403n462p449k3926k717K2378K735j1116
11765D609353j3194l3355j5357j9930l7134l7567p100M260M624N55j6314r705
11753D429136k5267k5374o489n0j5306n186k7770k5917o668l4776l4484Q995K0164
$$ plain form
11740 4251008 4254915 4233384 4231449 4227670 4217578 4185357 4181125 4157761 4124388 4112113 4095324 4090358
11728 4090358 4062023 4047645 4030701 4040448 4018622 4026455 4042330 4015048 3990338 3991780 3995851 3984891
11716 3984891 3949722 3943015 3921776 3903261 3897044 3882468 3876978 3865886 3837963 3844137 3847973 3853697
11704 3853697 3839394 3813755 3790988 3774916 3760767 3734818 3709377 3715100 3730631 3736163 3734983 3722892
11692 3722892 3695743 3696850 3697752 3672560 3645380 3656446 3616694 3602234 3591403 3560897 3544626 3540536
11680 3540536 3529746 3516707 3507730 3483606 3463006 3476638 3479559 3497131 3506764 3474636 3450855 3421164
11668 3421164 3398710 3401631 3376032 3368770 3385537 3374452 3339474 3323156 3295557 3283684 3301769 3303734
11656 3303734 3287696 3268966 3263206 3213985 3206477 3196654 3176220 3181735 3175877 3171357 3172541 3136097 3101112
$$ packed form
11740D251008L907k1531j935l779j0092l2221m232k3364l3373j2275j6789m966
11728D090358k8335j4378j6944R747k1826P833J5875k7282k4710J442M071j0960
11716C984891l5169o707k1239j8515o217j4576n490j1092k7923O174L836N724
11704C853697j4303k5639k2767j6072j4149k5949k5441N723J5531N532j180j2091
11692C722892k7149J107R02k5192k7180J1066l9752j4460j0831l0506j6271m090
11680C540536j0790j3039q977k4124k0600J3632K921J7572R633l2128k3781k9691
11668C421164k2454K921k5599p262J6767j1085l4978j6318k7599j1873J8085J965
11656C303734j6038j8730n760m9221p508r823k0434N515n858m520J184l6444l4985
$$ plain form
11643 3101112 3103205 3098437 3086458 3088781 3108769 3083074 3060674 3062024 3066799 3063660 3054502 3045609 3052566
11630 3052566 3037015 3008172 3003803 2974841 2932470 2907640 2914248 2926357 2918117 2878125 2845955 2838665
11618 2838665 2826238 2832097 2839338 2835328 2842245 2837015 2818609 2825848 2858358 2868311 2866928 2818331 2802147
11605 2802147 2786346 2769635 2735698 2715142 2706136 2725298 2702579 2677118 2692088 2689854 2664287 2648551
11593 2648551 2615576 2602845 2613256 2622980 2610075 2588412 2589681 2613885 2616902 2624340 2611471 2586470
11581 2586470 2587421 2576740 2536606 2506260 2524783 2523363 2495742 2485308 2494367 2498801 2481528 2451403
11569 2451403 2417196 2419235 2422997 2465380 2472246 2454967 2428173 2436315 2440345 2427623 2386595 2360118
11557 2360118 2330109 2336443 2336193 2328194 2327849 2314773 2288396 2286684 2310756 2293536 2263985 2264626 2236903
$$ packed form
11643C101112K093m768j1979K323J9988k5695k2400J350M775l139r158q893O957
11630C052566j5551k8843m369k8962m2371k4830O608J2109q240l9992l2170p290
11618B838665j2427N859P241m010O917n230j8406P239L2510R953j383m8597j6184
11605B802147j5801j6711l3937k0556r006J9162k2719k5461J4970k234k5567j5736
11593B648551l2975j2731J0411R724j2905k1663J269K4204L017P438j2869k5001
11581B586470R51j0681m0134l0346J8523j420k7621j0434R059M434j7273l0125
11569B451403l4207K039L762M2383O866j7279k6794Q142M030j2722m1028k6477
11557B360118l0009O334k50p999l45j3076k6377j712K4072j7220k9551O41k7723
$$ plain form
11544 2236903 2214754 2224864 2273969 2273375 2263449 2270205 2245187 2218041 2208561 2200807 2185290 2183028 2186119
11531 2186119 2167968 2153921 2151629 2150663 2131136 2129594 2132272 2140282 2128177 2143289 2139414 2153919 2176384
11518 2176384 2199281 2222449 2224017 2187230 2139383 2111963 2103336 2083632 2096705 2106933 2081893 2057925
11506 2057925 2012609 2014619 2021385 2020215 2016961 1994180 1980443 1981271 1971545 1966184 1941126 1940446 1936819
11493 1936819 1917254 1912738 1917524 1921444 1923987 1901561 1878873 1901023 1925814 1915434 1897645 1886237
11481 1886237 1869661 1886012 1886762 1885473 1908704 1913432 1892119 1907990 1939965 1975699 2026584 2028410
11469 2028410 1973450 1903192 1850356 1820273 1805911 1783897 1772474 1766058 1775361 1776942 1735396 1694501
11457 1694501 1698981 1703109 1721998 1725281 1699451 1672257 1675119 1688273 1697803 1690638 1672938 1669468 1647423
$$ packed form
11544B236903k2149J0110M9105n94r926O756k5018k7146r480p754j5517k262L091
11531B186119j8151j4047k292r66j9527j542K678Q010j2105J5112l875J4505K2465
11518B176384K2897K3168J568l6787m7847k7420q627j9704J3073J0228k5040k3968
11506B057925m5316K010O766j170l254k2781j3737Q28r726n361k5058o80l627
11493A936819j9565m516M786L920K543k2426k2688K2150K4791j0380j7789j1408
11481A886237j6576J6351P50j289K3231M728k1313J5871L1975L5734N0885J826
11469B028410n4960p0258n2836l0083j4362k2014j1423o416R303J581m1546m0895
11457A694501M480M128J8889L283k5830k7194K862J3154R530p165j7700l470k2045
$$ plain form
11444 1647423 1608720 1627880 1662207 1684265 1685436 1654197 1644835 1604882 1586186 1569747 1584145 1609181
11432 1609181 1616738 1629924 1635724 1652247 1650748 1637981 1621976 1624637 1603592 1571930 1547689 1537669
11420 1537669 1531215 1526520 1524189 1526783 1554108 1570315 1563441 1556759 1520897 1505934 1507978 1534575 1519755
11407 1519755 1505622 1516718 1507223 1464663 1449069 1472705 1477149 1442742 1446929 1460254 1457502 1444777
11395 1444777 1415564 1410385 1424280 1436108 1442135 1416978 1409920 1410742 1391083 1380473 1387159 1419624
11383 1419624 1426000 1390785 1387315 1396797 1386029 1370507 1367185 1349736 1331957 1327150 1306759 1307645 1301223
11370 1301223 1324610 1332315 1326066 1342461 1355099 1352430 1354959 1359750 1351057 1315817 1300929 1309542 1307731
11357 1307731 1303044 1287891 1274296 1247196 1224460 1227033 1219295 1212289 1214396 1218096 1219432 1203547 1224441
$$ packed form
11444A647423l8703J9160L4327K2058J171l1239r362l9953j8696j6439J4398K5036
11432A609181P557J3186N800J6523j499j2767j6005K661k1045l1662k4241j0020
11420A537669o454m695k331K594K7325J6207o874o682l5862j4963K044K6597j4820
11407A519755j4133J1096r495m2560j5594K3636M444l4407M187J3325k752j2725
11395A444777k9213n179J3895J1828O027k5157p058Q22j9659j0610O686L2465
11383A419624O376l5215l470R482j0768j5522l322j7449j7779m807k0391Q86o422
11370A301223K3387P705o249J6395J2638k669K529M791q693l5240j4888Q613j811
11357A307731m687j5153j3595k7100k2736K573p738p006K107L700J336j5885K0894
$$ plain form
11344 1224441 1227445 1254927 1275790 1262391 1249698 1251119 1258062 1256583 1234163 1235589 1201692 1180219
11332 1180219 1182098 1186268 1171743 1179518 1187304 1203020 1198513 1191533 1191045 1181521 1191085 1181151 1140544
11319 1140544 1129443 1126862 1142188 1140533 1133250 1141021 1133204 1108511 1081695 1091720 1126463 1143951
11307 1143951 1133409 1103865 1099681 1106847 1090902 1103450 1119755 1126491 1111943 1115651 1113506 1099583
11295 1099583 1058056 1058521 1095249 1094505 1113618 1108111 1086860 1104991 1100125 1095909 1095744 1095661 1069345 1073908
11281 1073908 1062710 1033366 1026733 1020475 1012167 1039850 1046241 1038712 1034412 1009099 1021037 1038923
11269 1038923 1035579 1034679 1018715 1028989 1033136 1008086 996196 1017450 1013062 1027819 1046409 1029767
11257 1029767 1020299 1007911 1005556 1021704 1023699 1024741 1019559 1004705 1003551 968932 947979 959084
$$ packed form
11344A224441L004K7482K0863j3399j2693J421O943j479k2420J426l3897k1473
11332A180219J879M170j4525P775P786J5716m507o980m88r524R564r934m0607
11319A140544j1101k581J5326j655p283P771p817k4693k6816J0025L4743J7488
11307A143951j0542k9544m184P166j5945J2548J6305O736j4548L708k145j3923
11295A099583m1527M65L6728p44J9113n507k1251J8131m866m216j65q3k6316M563
11281A073908j1198k9344o633o258q308K7683O391p529m300k5313J1938J7886
11269A038923l344r00j5964J0274M147k5050j1890K1254m388J4757J8590j6642
11257A029767r468j2388k355J6148J995J042n182j4854j154l4619k0953J1105
$$ plain form
11245 959084 973200 977441 990578 969325 950407 944818 927010 914050 919949 908591 914846 921258
11233 921258 905884 917934 911032 915320 898133 884767 885892 914912 919942 898700 865315 856147
11221 856147 874982 884308 869648 884810 913220 915138 921433 890669 857035 855992 857739 846194
11209 846194 859111 873597 879375 873673 850181 844566 856739 858255 858783 874078 885091 878551 872662
11196 872662 870851 865567 817471 797651 830058 874979 872158 853841 858790 838061 822502 833809
11184 833809 858805 872211 873208 844879 809779 792331 812500 810768 799072 775343 753157 771535
11172 771535 801098 795783 785471 806392 804611 779649 760264 777514 780250 779244 786951 791861 786794
11159 786794 782562 783969 787132 780301 779953 778173 779732 790773 781456 765226 731465 735931 739750 763748
$$ packed form
11245I59084J4116M241J3137k1253j8918n589j7808j2960N899j1358O255O412
11233I21258j5374J2050o902M288j7187j3366J125K9020N030k1242l3385r168
11221H56147J8835R326j4660J5162K8410J918O295l0764l3634j043J747j1545
11209H46194J2917J4486N778n702k3492n615J2173J516N28J5295J1013o540n889
11196H72662j811n284m8096j9820L2407M4921k821j8317M949k0729j5559J1307
11184H33809K4996J3406R97k8329l5100j7448K0169j732j1696k3729k2186J8378
11172G71535K9563n315j0312K0921j781k4962j9385J7250K736j006P707M910n067
11159G86794m232J407L163o831l48j780J559J1041r317j6230l3761M466L819K3998
$$ plain form
11145 763748 762603 767939 764235 744351 733585 739701 756195 755632 768891 742861 714954 718280 748998
11132 748998 786835 785416 742517 734551 720298 723927 735885 742591 773850 767744 728954 721667 732851
11119 732851 741897 732953 697223 683402 703876 698360 682103 697023 709542 708616 717933 725985 726759
11106 726759 720343 698338 688781 709143 731922 717927 702411 695109 681353 695337 705352 715018
11094 715018 727755 755803 798554 842457 871260 852982 814558 773070 742679 719420 703902
11083 703902 717813 701437 687960 677521 671651 668590 677672 656284 677795 685703 672238 659747
11071 659747 643644 637786 647932 675075 672234 666675 656594 621176 602016 597730 600258 623282
11059 623282 629856 631820 633504 620819 609664 612317 624268 628512 621346 614323 610229 588137 579517
$$ packed form
11145G63748j145N336l704j9884j0766O116J6494n63J3259k6030k7907L326L0718
11132G48998L7837j419m2899p966j4253L629J1958O706L1259o106l8790p287J1184
11119G32851R046q944l5730j3821K0474n516j6257J4920J2519r26R317Q052P74
11106G26759o416k2005r557K0362K2779j3995j5516p302j3756J3984J0015R666
11094G15018J2737K8048M2751M3903K8803j8278l8424m1488l0391k3259j5518
11083G03902J3911j6376j3477j0439n870l061R082k1388K1511P908j3465j2491
11071F59747j6103n858J0146K7143k841n559j0081l5418j9160m286K528K3024
11059F23282O574J964J684j2685j1155K653J1951M244p166p023m094k2092q620
$$ plain form
11046 579517 599742 616888 626757 627074 642957 632484 605173 613784 610176 617851 613256 615060 582032
11033 582032 598034 646344 634798 619295 633069 620889 618676 623622 627618 629308 634629 657442
11021 657442 693688 742460 781946 824704 830443 785286 725160 676431 639401 624746 594497 570508
11009 570508 549485 544182 554700 563716 535999 521378 514238 535621 520088 520918 524032 531389 545033
10996 545033 561083 562489 557235 548608 533244 548538 539907 537761 532175 523469 522539 535564 555921
10983 555921 559876 549121 525122 514900 502418 497196 510296 536438 522343 520056 540348 538383
10971 538383 534338 537975 506809 489902 496481 514887 512006 522036 519376 509226 480407 497178
10959 497178 505885 511948 494191 510020 530067 501229 472972 467964 473929 449269 468435 497735
$$ packed form
11046E79517K0225J7146R869L17J5883j0473k7311Q611l608P675m595J804l3028
11033E82032J6002M8310j1546j5503J3774j2180k213M946L996J690N321K2813
11021F57442L6246M8772L9486M2758N739m5157o0126m8729l7030j4655l0249k3989
11009E70508k1023n303J0518R016k7717j4621p140K1383j5533Q30L114P357J3644
10996E45033J6050J406n254q627j5364J5294q631k146n586q706r30J3025K0357
10983E55921L955j0755k3999j0222j2482n222J3100K6142j4095k287K0292j965
10971E38383m045L637l1166j6907O579J8406k881J0030k660j0150k8819J6771
10959D97178Q707O063j7757J5829K0047k8838k8257n008N965k4660J9166K9300
$$ plain form
10947 497735 509152 502700 493805 470478 480005 465659 469092 487234 460858 455667 463278 470123 452903
10934 452903 456757 448140 423972 403593 405562 442436 455190 472600 484129 475529 477505 477419 493016
10921 493016 479627 456125 469788 469440 495899 511302 503181 490758 482434 477638 487686 464788
10909 464788 460090 447308 430186 421797 427327 423986 431393 425285 433481 420454 426194 419529 427036
10896 427036 416717 424860 439242 468265 485712 465416 457250 454239 437928 448481 463867 479778
10884 479778 495564 482308 456689 452896 450591 455740 450183 452766 484227 458148 430026 431365 432786
10871 432786 435819 449019 457993 431924 413688 418664 427439 432255 417324 401872 429050 411759
10859 411759 390963 394624 417016 441852 464561 455209 427673 440626 428611 415103 437287 429332
$$ packed form
10947D97735J1417o452q895k3327R527j4346L433J8142k6376n191P611O845j7220
10934D52903L854q617k4168k0379J969L6874J2754J7410J1529q600J976q6J5597
10921D93016j3389k3502J3663l48K6459J5403q121j2423q324m796J0048k2898
10909D64788m698j2782j7122q389N530l341P407o108Q196j3027N740o665P507
10896D27036j0319Q143J4382K9023J7447k0296q166l011j6311J0553J5386J5911
10884D79778J5786j3256k5619l793k305N149n557K583L1461k6079k8122J339J421
10871D32786L033J3200Q974k6069j8236M976Q775M816j4931j5452K7178j7291
10859D11759k0796L661K2392K4836K2709r352k7536J2953j2015j3508K2184p955
$$ plain form
10847 429332 423913 441182 445543 452891 437621 420493 430987 465407 433360 408979 390196 430379
10835 430379 470927 459498 432864 414783 411293 416112 399181 377578 376497 391260 417982 448235
10823 448235 445168 445484 405369 370727 377115 399603 385147 378782 378556 400293 415360 427426 425304
10810 425304 429404 425902 401900 369574 366569 365910 381679 387652 402073 394933 381551 367667 365782
10797 365782 360338 359761 340148 338356 372634 358393 344023 358511 360891 350185 347927 340398 340622
10784 340622 332299 319906 328446 304671 301018 330633 360696 377171 374566 374240 353937 346086 334368
10771 334368 326021 331459 351932 339851 346215 370356 351494 343462 362347 349407 361732 363882
10759 363882 356578 362573 348472 320322 325150 342025 357620 384164 363861 334728 322457 332954
$$ packed form
10847D29332n419J7269M361P348j5270j7128J0494L4420l2047k4381j8783M0183
10835D30379M0548j1429k6634j8081l490M819j6931k1603j081J4763K6722L0253
10823D48235l067L16m0115l4642O388K2488j4456o365k26K1737J5067J2066k122
10810D25304M100l502k4002l2326l005o59J5769N973J4421p140j3382j3884j885
10797C65782n444n77j9613j792L4278j4241j4370J4488K380j0706k258p529K24
10784C40622q323j2393Q540k3775l653K9615L0063J6475k605l26k0303p851j1718
10771C34368q347N438K0473j2081O364K4141j8862q032J8885j2940J2325K150
10759C63882p304N995j4101k8150M828J6875J5595K6544k0303k9133j2271J0497
$$ plain form
10747 332954 331579 328032 346176 343447 338753 341680 372558 372413 357971 355919 360364 349817 347196
10734 347196 364963 364822 349197 340416 346132 346896 348809 342938 342127 338572 330991 327122 335159 340285
10720 340285 338515 333705 331334 361793 330563 308167 299599 318762 356806 377856 366964 365135
10708 365135 371157 336915 302342 314588 341900 325478 307049 300998 324321 294319 292710 290326
10696 290326 298748 285407 283387 291426 304425 308058 313566 333108 335326 322559 335163 365949 377474
10683 377474 387367 382855 354348 324145 315437 338311 337339 318686 305316 332901 343288 340169 327243
10670 327243 319052 337100 350442 323365 318544 312843 299993 295172 298197 292249 290012 309646 334465
10657 334465 335995 316809 322597 318242 311905 316252 290353 276441 265720 277242 301110 300088 293443
$$ packed form
10747C32954j375l547J8144k729m694K927L0878j45j4442k052M445j0547k621
10734C47196J7767j41j5625q781N716P64J913n871q11l555p581l869Q037N126
10720C40285j770m810k371L0459l1230k2396q568J9163L8044K1050j0892j829
10708C65135O022l4242l4573J2246K7312j6422j8429o051K3323l0002j609k384
10696B90326Q422j3341k020Q039J2999L633N508J9542K218j2767J2604L0786J1525
10683C77474R893m512k8507l0203q708K2874r72j8653j3370K7585J0387l119j2926
10670C27243q191J8048J3342k7077m821n701j2850m821L025n948k237J9634K4819
10657C34465J530j9186N788m355o337M347k5899j3912j0721J1522K3868j022o645
$$ plain form
10644 293443 315385 324296 338006 333642 314755 319661 283725 272551 278400 307081 325894 326335 329564
10631 329564 334995 323781 309880 300757 325452 308218 283884 255356 246713 261834 267956 271166
10619 271166 288092 272214 258528 259039 266541 282407 301124 328873 340589 326133 311927 335588
10607 335588 357141 337868 315983 309930 302386 307504 277852 265181 254559 264426 296921 279192
10595 279192 269167 293039 326961 316641 274747 275763 284352 294508 297013 315039 294589 282299
10583 282299 290081 283322 277869 249609 244251 270777 289371 294677 294835 279402 291929 291116 287397
10570 287397 305683 295548 283040 267026 297050 308124 281953 264234 265312 260372 257847 253573
10558 253573 247349 236261 259579 273332 260082 268654 272041 256630 239290 232246 224278 233679 236350
$$ packed form
10644B93443K1942Q911J3710m364j8887M906l5936j1174N849K8681J8813M41L229
10631C29564N431j1214j3901r123K4695j7234k4334k8528q643J5121O122L210
10619B71166J6926j5878j3686N11P502J5866J8717K7749J1716j4456j4206K3661
10607C35588K1553j9273k1885o053p544N118k9652j2671j0622R867L2495j7729
10595B79192j0025K3872L3922j0320m1894J016Q589J0156K505J8026k0450j2290
10583B82299P782o759n453k8260n358K6526J8594N306J58j5433J2527q13l719
10570B87397J8286j0135j2508j6014L0024J1074k6171j7719J078m940k525m274
10558B53573o224j1088K3318J3753j3250Q572L387j5411j7340p044p968R401K671
$$ plain form
10545 236350 199557 194297 229660 254858 249224 238132 244939 253726 254013 256067 259476 240578 241626
10532 241626 287270 298002 281739 298098 290192 265878 243349 247736 266767 250809 223368 228021
10520 228021 270779 287249 259665 258194 255488 278579 273078 243714 209535 191872 201860 233963
10508 233963 247741 264810 229840 243863 283371 283340 248231 254053 257339 238204 243031 249661 259568
10495 259568 273758 278440 292374 285212 276999 244644 217417 220416 202459 222333 217593 219086 229513
10482 229513 235703 252904 253809 250800 259718 268183 281714 268700 279241 272031 251097 230872 236064
10469 236064 269000 273437 283295 309127 312605 284667 261377 269963 312018 338661 344044 343898 323395
10456 323395 317766 327352 325037 343109 369441 379808 358242 328377 287394 264671 257638 248859
$$ packed form
10545B36350l6793n260L5363K5198n634j1092O807Q787K87K054L409j8898J048
10532B41626M5644J0732j6263J6359p906k4314k2529M387J9031j5958k7441M653
10520B28021M2758J6470k7584j471k706K3091n501k9364l4179j7663R988L2103
10508B33963J3778J7069l4970J4023L9508l1l5109N822L286j9135M827O630R907
10495B59568J4190M682J3934p162q213l2355k7227K999j7957J9874m740J493J0427
10482B29513O190J7201R05l009Q918Q465J3531j3014J0541p210k0934k0225N192
10469B36064L2936M437R858K5832L478k7938k3290Q586M2055K6643N383j46k0503
10456C23395n629R586k315J8072K6332J0367k1566k9865m0983k2723p033q779
$$ plain form
10444 248859 235473 228388 244004 251152 233599 209314 203034 234881 260915 269831 268383 254819
10432 254819 265387 254372 247362 252408 253092 236100 225257 211036 226523 231078 221135 219022 223705
10419 223705 214673 259417 262428 244623 241919 246904 229575 218602 201282 213166 213943 197402 191564
10406 191564 193740 188380 176465 169465 213234 222323 217372 200327 175154 178066 189120 195705 202423
10393 202423 208938 218152 206783 201948 196486 200717 206331 185447 164693 155335 191736 194703 198211
10380 198211 215379 246016 230601 199896 169107 168844 176154 161329 153676 139084 141489 173012
10368 173012 200125 203210 201724 183283 170457 197188 194456 200568 179238 176384 185655 205666 195578
10355 195578 198101 215964 213611 203059 222162 228288 184525 176523 162920 153025 162458 137418 132719
$$ packed form
10444B48859j3386p085J5616P148j7553k4285o280L1847K6034Q916j448j3564
10432B54819J0568j1015p010N046O84j6992j0843j4221J5487M555r943k113M683
10419B23705r032M4744L011j7805k704M985j7329j0973j7320J1884P77j6541n838
10406A91564K176n360j1915p000M3769R089m951j7045k5173K912J1054O585O718
10393B02423O515R214j1369m835n462M231N614k0884k0754r358L6401K967L508
10380A98211J7168L0637j5415l0705l0789k63P310j4825p653j4592K405L1523
10368A73012K7113L085j486j8441j2826K6731k732O112k1330k854R271K0011j0088
10355A95578K523J7863k353j0552J9103O126m3763q002j3603r895R433k5040m699
$$ plain form
10342 132719 188414 203920 169652 177453 210637 219916 200120 198677 201437 189014 181265 155782
10330 155782 133719 113078 139614 173026 160384 181179 206318 216748 217645 213988 207479 213052
10318 213052 224449 209913 195618 181944 156486 136494 121151 142253 137968 140797 161361 169104
10306 169104 151444 165900 202316 191861 193949 228888 223602 197764 167917 159879 178238 212364
10294 212364 229147 234097 227370 211015 177730 136100 152900 163395 138763 134441 156898 159161
10282 159161 148431 148494 178131 181930 185769 190239 183128 189950 177939 166235 172350 191609 199702
10269 199702 177399 163457 183918 193543 161541 148448 150804 149153 134098 135652 129039 120050 114324
10256 114324 97451 127416 136176 120714 129784 159093 165999 146588 140460 118967 113323 142556
$$ packed form
10342A32719N5695J5506l4268P801L3184R279j9796j443K760j2423p749k5483
10330A55782k2063k0641K6536L3412j2642K0795K5139J0430Q97l657o509N573
10318B13052J1397j4536j4295j3674k5458j9992j5343K1102m285K829K0564P743
10306A69104j7660J4456L6416j0455K088L4939n286k5838k9847q038J8359L4126
10294B12364J6783M950o727j6355l3285m1630J6800J0495k4632m322K2457K263
10282A59161j0730O3K9637L799L839M470p111O822j2011j1704O115J9259Q093
10269A99702k2303j3942K0461R625l2002j3093K356j651j5055J554o613q989n726
10256A14324j6873K9965Q760j5462R070K9309O906j9411o128k1493n644K9233
$$ plain form
10244 142556 142693 126627 117827 118253 109653 125745 148651 158239 176351 183281 177416 163410 154626
10231 154626 153464 158205 191205 217272 164070 107412 106447 120301 123812 125806 135191 158323 161981
10218 161981 174536 180987 150384 124286 127122 160549 174500 162965 155262 174161 184217 156587
10206 156587 149794 173561 164788 139845 137932 160574 153713 154568 164800 170307 175262 181050 174014
10193 174014 126231 122252 120492 136151 152605 145821 144077 145671 162078 188071 182452 173349 170556
10180 170556 188588 186625 195885 183018 168728 154348 121498 133619 146191 164579 174043 152829
10168 152829 163379 145595 139596 177935 173985 145440 148110 138723 133523 123459 115786 119166 134200
10155 134200 176052 175376 156355 131375 131196 114570 114943 138250 173692 164365 142951 145285 134597
$$ packed form
10244A42556J37j6066q800M26q600J6092K2906R588J8112O930n865j4006q784
10231A54626j162M741L3000K6067n3202n6658r65J3854L511J994R385K3132L658
10218A61981J2555O451l0603k6098K836L3427J3951j1535p703J8899J0056k7630
10206A56587o793K3767q773k4943j913K2642o861Q55J0232N507M955N788p036
10193A74014m7783l979j760J5659J6454o784j744J594J6407K5993n619r103k793
10180A70556J8032j963R260j2867j4290j4380l2850J2121J2572J8388R464k1214
10168A52829J0550j7784n999L8339l950k8545K670r387n200j0064p673L380J5034
10155A34200M1852o76j9021k4980j79j6626L73K3307L5442r327k1414K334j0688
$$ plain form
10142 134597 112129 100416 101634 88293 125087 150404 140888 134741 120202 130033 124430 108854
10130 108854 107324 104612 109755 119186 130135 131240 136699 144586 171002 170898 163322 125383 118237 122550
10116 122550 105831 126304 146502 115009 120341 118246 123900 145315 165568 156682 162067 184663
10104 184663 188019 191605 166863 148830 144172 159889 161245 143447 137650 119132 102497 106213 129817
10091 129817 148915 129795 130005 128749 127934 131014 129700 142663 153201 163258 161306 133518 127289
10078 127289 135490 127511 116072 116376 116203 156023 166544 200531 213148 180698 148176 140238 143042
10065 143042 144952 156761 165318 162334 149954 138098 112182 87724 74228 103928 129479 128036
10053 128036 126462 118123 113744 136169 151069 131460 123296 109723 113952 121398 124923 131521 130856
$$ packed form
10142A34597k2468j1713J218j3341L6794K5317r516o147j4539R831n603j5576
10130A08854j530k712N143R431J0949J105N459P887K6416j04p576l7939p146M313
10116A22550j6719K0473K0198l1493N332k095N654K1415K0253q886N385K2596
10104A84663L356L586k4742j8033m658J5717J356j7798n797j8518j6635L716K3604
10091A29817J9098j9120K10j256q15L080j314J2963J0538J0057j952k7788o229
10078A27289Q201p979j1439L04j73L9820J0521L3987J2617l2450l2522p938K804
10065A43042J910J1809Q557k984j2380j1856k5916k4458j3496K9700K5551j443
10053A28036j574q339m379K2425J4900j9609q164j3573M229P446L525O598o65
$$ [...]
##END NTUPLES=NMR SPECTRUM
##END=
