##TITLE=Analysis number 323871
Compound Code sb 00153
Project Code adrs
Chemist Name ian speare
##JCAMPDX= 6.0         $$ Bruker NMR JCAMP-DX V2.0
##DATA TYPE= NMR SPECTRUM
##DATA CLASS= NTUPLES
##ORIGIN= Bruker BioSpin GmbH
##OWNER= nmr
$$ XWIN-NMR		Version 3.5
$$ Thu Nov  9 16:04:19 2006 GMT Standard Time (UT+0h)  MAYBRIDGE\nmr@NMR_250MHZ
##.OBSERVE FREQUENCY= 250.131544655141
##.OBSERVE NUCLEUS= ^1H
##.ACQUISITION MODE= SIMULTANEOUS (DQD)
##.ACQUISITION SCHEME= undefined
##.AVERAGES= 16
##.DIGITISER RES= 18
##SPECTROMETER/DATA SYSTEM= dpx250
##.PULSE SEQUENCE= zg30
##.SOLVENT NAME= DMSO
##.SHIFT REFERENCE= (INTERNAL, DMSO, 0, 16.522)
##AUDIT TRAIL= $$ (NUMBER, WHEN, WHO, WHERE, WHAT)
$$ ##TITLE= Audit trail, XWIN-NMR		Version 3.5
$$ ##JCAMPDX= 5.01
$$ ##ORIGIN= Bruker BioSpin GmbH
$$ ##OWNER= nmr
$$ C:\u/data/dgb/nmr/ADRS/2540/pdata/1/auditp.txt
$$ ##AUDIT TRAIL=  $$ (NUMBER, WHEN, WHO, WHERE, WHAT)
(   1,<2006-11-09 16:03:53.71 +000>,<MAYBRIDGE\nmr>,<NMR_250MHZ>,
      <created by zg, POWCHK disabled, PULCHK disabled
       configuration hash MD5:
       49 4B E0 1D 92 C2 6B 37 9F E6 65 BC 52 41 86 1D
       data hash MD5: 64K
       C7 CF 61 02 95 7B C5 BC FA DD 98 75 FC 0D 65 E4>)
(   2,<2006-11-09 16:04:09.87 +000>,<MAYBRIDGE\nmr>,<NMR_250MHZ>,
      <Start of raw data processing
       ef LB = 0.3 FT_mod = 6 PKNL = 1 SI = 32K 
       data hash MD5: 32K
       41 75 20 6A 66 4C 6B 72 83 C1 5B 22 1B 37 2A A4>)
(   3,<2006-11-09 16:04:11.46 +000>,<MAYBRIDGE\nmr>,<NMR_250MHZ>,
      <apk 
       data hash MD5: 32K
       C4 B5 69 A4 4B 0C 2A 00 1B 22 84 15 5A 5A 73 92>)
(   4,<2006-11-09 16:04:12.32 +000>,<MAYBRIDGE\nmr>,<NMR_250MHZ>,
      <abs ABSG = 5 
       data hash MD5: 32K
       CE 49 E0 9A EF 21 1D 3B 3D 2F 5E D9 E0 5D 92 70>)
$$ ##END=
$$ 
$$ hash MD5
$$ 81 91 C5 ED 40 6A 77 5A AA B9 C1 9D ED AC 1E 20
##$RELAX= 
##$RELAX= 
##$RELAX= 
##$RELAX= 
##$RELAX= 
##$RELAX= 
##$RELAX= 
$$ Bruker specific parameters
$$ --------------------------
##$DU= <C:\u>
##$EXPNO= 2540
##$NAME= <ADRS>
##$PROCNO= 1
##$TYPE= <nmr>
##$USER= <dgb>
##$AMP= (0..31)
100 100 100 100 100 100 100 100 100 100 100 100 100 100 100 100 100 100 
100 100 100 100 100 100 100 100 100 100 100 100 100 100 
##$AQSEQ= 0
##$AQ_mod= 3
##$AUNM= <au_zg>
##$AUTOPOS= <57 >
##$BF1= 250.13
##$BF2= 250.13
##$BF3= 250.13
##$BF4= 250.13
##$BF5= 500.13
##$BF6= 500.13
##$BF7= 500.13
##$BF8= 500.13
##$BYTORDA= 1
##$CFDGTYP= 0
##$CFRGTYP= 5
##$CHEMSTR= <none>
##$CNST= (0..31)
1 1 145 1 1 1 1 1 1 1 1 1 1 1 1 1 1 1 1 1 1 1 1 1 1 1 1 1 1 1 1 1 
##$CPDPRG= <>
##$CPDPRG1= <>
##$CPDPRG2= <>
##$CPDPRG3= <>
##$CPDPRG4= <mlev>
##$CPDPRG5= <mlev>
##$CPDPRG6= <mlev>
##$CPDPRG7= <mlev>
##$CPDPRG8= <mlev>
##$CPDPRGB= <>
##$CPDPRGT= <>
##$D= (0..31)
0 1 0 0 0 0 0 0 0 0.06 0 0 0 0 0 0 0.0002 0 0 0 0 0 0 0 0 0 0 0 0 0 0 
0 
##$DATE= 1163088232
##$DBL= (0..7)
120 120 120 120 120 120 120 120 
##$DBP= (0..7)
150 150 150 150 150 150 150 150 
##$DBP07= 0
##$DBPNAM0= <>
##$DBPNAM1= <>
##$DBPNAM2= <>
$$ [...]
##$SUBNAM7= <"">
##$SUBNAM8= <"">
##$SUBNAM9= <"">
##$SW= 20.6930455092707
##$SWIBOX= (0..15)
0 0 3 0 0 0 0 0 0 0 0 0 0 0 0 0 
##$SW_h= 5175.983436853
##$TD= 65536
##$TD0= 1
##$TE= 683.16
##$TE2= 300
##$TE3= 300
##$TEG= 300
##$TL= (0..7)
0 120 120 120 120 120 120 120 
##$TP= (0..7)
150 150 150 150 150 150 150 150 
##$TP07= 0
##$TPNAME0= <>
##$TPNAME1= <>
##$TPNAME2= <>
##$TPNAME3= <>
##$TPNAME4= <>
##$TPNAME5= <>
##$TPNAME6= <>
##$TPNAME7= <>
##$TPOAL= (0..7)
0.5 0.5 0.5 0.5 0.5 0.5 0.5 0.5 
##$TPOFFS= (0..7)
0 0 0 0 0 0 0 0 
##$TUNHIN= 0
##$TUNHOUT= 0
##$TUNXOUT= 0
##$USERA1= <user>
##$USERA2= <user>
##$USERA3= <user>
##$USERA4= <user>
##$USERA5= <user>
##$V9= 5
##$VALIST= <valist>
##$VCLIST= <CCCCCCCCCCCCCCC>
##$VD= 0
##$VDLIST= <DDDDDDDDDDDDDDD>
##$VPLIST= <PPPPPPPPPPPPPPP>
##$VTLIST= <TTTTTTTTTTTTTTT>
##$WBST= 1024
##$WBSW= 4
##$XGAIN= (0..3)
0 0 0 0 
##$XL= 0
##$YL= 0
##$YMAX_a= 352375
##$YMIN_a= -407400
##$ZGOPTNS= <>
##$ZL1= 120
##$ZL2= 120
##$ZL3= 120
##$ZL4= 120
##$ABSF1= 16.522
##$ABSF2= -4.171173
##$ABSG= 5
##$ABSL= 3
##$ALPHA= 0
##$AQORDER= 0
##$ASSFAC= 0
##$ASSFACI= 0
##$ASSFACX= 0
##$ASSWID= 0
##$AUNMP= <proc_1d>
##$AZFE= 0.1
##$AZFW= 0.1
##$BCFW= 0
##$BC_mod= 0
##$BYTORDP= 0
##$COROFFS= 0
##$CY= 12.5
##$DATMOD= 1
##$DC= 0
##$DFILT= <>
##$DTYPP= 0
##$F1P= 14.0000005364418
##$F2P= -0.99999901652339
##$FCOR= 0.5
##$FTSIZE= 32768
##$FT_mod= 6
##$GAMMA= 0
##$GB= 0
##$INTBC= 1
##$INTSCL= 1
##$ISEN= 128
##$LB= 0.3
##$LEV0= 0
##$LPBIN= 0
##$MAXI= 10000
##$MC2= 0
##$MEAN= 0
##$ME_mod= 0
##$MI= 0
##$NCOEF= 0
##$NC_proc= -3
##$NLEV= 6
##$NOISF1= 0
##$NOISF2= 0
##$NSP= 0
##$NTH_PI= 0
##$NZP= 0
##$OFFSET= 16.522
##$PC= 1
##$PHC0= -42.4939
##$PHC1= 3.397819
##$PH_mod= 1
##$PKNL= yes
##$PPARMOD= 0
##$PSCAL= 4
##$PSIGN= 0
##$REVERSE= no
##$SF= 250.13
##$SI= 32768
##$SIGF1= 0
##$SIGF2= 0
##$SINO= 400
##$SIOLD= 32768
##$SREGLST= <1H.DMSO>
##$SSB= 0
##$STSI= 32768
##$STSR= 0
##$SW_p= 5175.98343685301
##$SYMM= 0
##$S_DEV= 0
##$TDeff= 65536
##$TDoff= 0
##$TI= <Analysis number 999999
Compound Code 99
Book Reference 9
Project Code 9>
##$TILT= no
##$TM1= 0
##$TM2= 0
##$TOPLEV= 0
##$USERP1= <user>
##$USERP2= <user>
##$USERP3= <user>
##$USERP4= <user>
##$USERP5= <user>
##$WDW= 1
##$XDIM= 32768
##$YMAX_p= 300577938
##$YMIN_p= -345143
$$ End of Bruker specific parameters
$$ ---------------------------------
##NTUPLES= NMR SPECTRUM
##VAR_NAME=  FREQUENCY,     SPECTRUM/REAL,   SPECTRUM/IMAG
##SYMBOL=    X,             R,               I
##VAR_TYPE=  INDEPENDENT,   DEPENDENT,       DEPENDENT
##VAR_FORM=  AFFN,          ASDF,            ASDF
##VAR_DIM=   32768,         32768,           32768
##UNITS=     HZ,            ARBITRARY UNITS, ARBITRARY UNITS
##FACTOR=    0.157963299565203, 1,           1
##FIRST=     4132.6476996994, 0,             0
##LAST=      -1043.33573715361, 0,           0
##MIN=       -1043.33573715361, -345143,     0
##MAX=       4132.6476996994, 300577938,     0
$$ Real data points
##PAGE= N=1
##DATA TABLE= (X++(R..R)), XYDATA
$$ [...]
17557A420020R2799J85029K63808J88953J82906K64881L79834M37318N90534J000375
$$ 1420020 1512819 1697848 1961656 2150609 2333515 2598396 2978230 3415548 4006082 5006457
17547E006457J241783J528930K094683K969128M183419N790507P043912P265733
$$ 5006457 6248240 7777170 9871853 12840981 17024400 22814907 29858819 37124552
17539C7124552O581954N461820L342018j181505m974507n997561o963231q040981
$$ 37124552 43706506 49168326 52510344 51328839 46354332 40356771 33393540 25352559
17531B5352559p172856n107404l211094k142068j471212r57005p07628n58156
$$ 25352559 18179703 13072299 9861205 7719137 6247925 5290920 4583292 4025136
17523D025136m09833k08871j46425j90046j28496p6780j29772r7203j0479o9439
$$ 4025136 3615303 3406432 3260007 3069961 2941465 2864685 2734913 2637710 2627231 2557792
17513B557792j02583j21472j28500p1159Q1955R1373j054R4062J83862N4631k1226
$$ 2557792 2455209 2333737 2205237 2134078 2216033 2307406 2306352 2400414 2584276 2638907 2617681
17502B617681O2969M6152J23451J28557J54544K88110M02687N54126P99638J169480
$$ 2617681 2680650 2726802 2850253 2978810 3133354 3421464 3824151 4378277 5177915 6347395
17492F347395J841342K730003M074974N673350O749752O623175N952062M997615
$$ 6347395 8188737 10918740 14993714 20667064 27416816 34039991 39992053 44989668
17484D4989668K232654k241695m851358n587691o799479p298979n798815l895291
$$ 44989668 47222322 44980627 40129269 34541578 27742099 20443120 14644305 10749014
17476A0749014k547980j744302j199191p91363o81449m26196l08059k66752j52771
$$ 10749014 8201034 6456732 5257541 4466178 3784729 3358533 3050474 2783722 2630951
17467B630951j98305k32393j40248j43318j48231n9381j15340r0105j07605k5706
$$ 2630951 2432646 2200253 2060005 1916687 1768456 1709075 1593735 1503630 1396025 1370319
17457A370319L2872k0861m189r6081p4791L4234j918m9896n5266j31431j30364
$$ 1370319 1403191 1382330 1378141 1282060 1207269 1241503 1239585 1189689 1134423 1002992 872628
17446H72628k3410n8628p2508j5618J7709j4834n2318p3068j29519j5800Q5485
$$ 872628 849218 790590 718082 702464 720173 705339 653021 579953 450434 434634 520119
17435E20119J9901m7787q1756l9965N5488j1635L2148P0438q6137l9688p4560
$$ 520119 540020 492233 410477 370512 426000 414365 446513 516951 430814 391126 316566
17424C16566p5203k9342N2899J8965l1886Q107l7678m3043m1204k7082L2578j7709
$$ 316566 241363 212021 264920 283885 251999 260106 222428 179385 138181 111099 143677 125968
17412A25968R043O7467O7137J9846J03432k0379M360J3821J2676J9732m1572l9854
$$ 125968 135011 202478 269615 289461 392893 372514 376874 390695 403371 423103 381531 341677
17400C41677n0862n2752K3554K8511l1490m2033k91M4996Q7919m5489j31536o058
$$ 341677 290815 238063 261617 290128 258638 216605 216314 261310 349229 303740 172204 166146
17388A66146P4156m7406j6629P2591k1322j22592m76L1853J5426J7820m6674n8933
$$ 166146 240302 192896 176267 248858 227536 104944 104468 136321 151747 169567 122893 63960
17376F3960M6458J0135J4753K4338p2640q1269P2828j2657j4495K0708r6480L2657
$$ 63960 110418 120553 135306 159644 87004 5735 78563 65906 51411 72119 -24361 8296
17364H296o778m9377l9190M5643J21138J03945k1606J549K0013k6343M2096L1493
$$ 8296 1518 -47859 -87049 -41406 79732 183677 162071 163620 183633 157290 199386 230879
17352B30879j06727j3866N2678m2610m6880M1600n0246K754k531o8670M9148M4589
$$ 230879 124152 110286 162964 120354 73474 115074 64828 67582 65051 -3619 45529 90118
17340I0118l0573k9549M5762N2009K6244j6572m0418M473L3066l2062j30943l9781
$$ 90118 59545 29996 75758 127767 154011 137439 97021 101494 134560 102498 -28445 -68226
17328f8226Q6714J27059Q999j29603p2476J8337o626o946l1488M7200L2444k3044
$$ -68226 18488 145547 154546 24943 -47533 -29196 -35822 -42768 -74256 -27056 5388 -17656
17316a7656j3586J5629K7117k2524j1882L3685L0335m8415r5M4353K358M2336
$$ -17656 -31242 -15613 11504 -11020 -22902 10783 41118 -7297 -7392 36961 39319 81655
17304H1655p665K6668M7854l9112l2380J5629l2034K4571m1857K9321n7312K7140
$$ 81655 73990 100658 148512 109400 77020 92649 60615 85186 43329 72650 15338 42478
17292D2478J46658l6162j7041l2775p1910M8168J4370o8707m559L1570N7394K4910
$$ 42478 189136 152974 135933 103158 31248 79416 93786 25079 20520 52090 109484 134394
17280A34394p7395j02908L6831k760N231J03946K0513k631J1997l8469o6675O5974
$$ 134394 56999 -45909 -9078 -11838 -6607 97339 117852 115221 127218 88749 22074 88048
17268H8048K0924j35509l783K9391P5516L3750l0888l8003N4224k52k0844m7356
$$ 88048 108972 -26537 -30320 -929 74587 108337 77449 39446 93670 93418 72574 25218
17256B5218L5510m2144n024n8185L1150R4761q3737K3350O9068Q242n7484l8140
$$ 25218 60728 18584 13560 -44625 -13475 81286 -2451 20899 89967 98209 40725 2585
17244B585l7282O3427J00285L9285p3863l3265R7314Q0806q7722r4970n6419n4662
$$ 2585 -34697 28730 129015 168300 94437 61172 158486 239292 151570 56600 181 -54481
17232e4481l6432R9569N0159k7220o7901o7742P4198O1936p140K800j773r4235
$$ -54481 -90913 8656 58815 31595 -36306 -104048 -29850 32086 24946 27746 25973 -68262
17220f8262l8833R7656J28710k2132m8689J7336p0883m9259K6195N6757o0029
$$ -68262 -107095 -9439 119271 97139 48450 65786 -5097 -54356 -28161 28596 -31433
17209c1433l7027Q3078J63333M5814j0497l2181j10913j42636k3422N1777j7961
$$ -31433 -68460 14618 177951 223765 213268 181087 70174 -72462 -95884 -44107 -62068
17198f2068Q8333P4579k6504o6338m0603j6354l5687Q4078N4121l7204o8774p4338
$$ -62068 26265 100844 74340 8002 -32601 -48955 -84642 -564 53557 16353 -52421 -126759
17186a26759N5981O3257m1215M4154P8224J8751n8332j0608n603L2467k772p1721
$$ -126759 -70778 -7521 -48736 -4582 73642 92393 34061 23453 17850 50317 47545 -24176
17174b4176o8813P578O2351r641M9633K8388J8508k7444L3870O4689l3715o0532
$$ -24176 -92989 -85411 -23060 -32701 16932 45320 63828 36384 70254 134943 101228 40696
17162D0696j07587r3372n642K6603M2680Q812M483m2280Q9553Q4170K2851L0912
$$ 40696 -66891 -160263 -165905 -139302 -96622 -87810 -83327 -125607 -36054 48116 70967 101879
17150A01879J2456L6434L8678m7287j2344Q9539j4854n6764k7421J0275M379n6803
$$ 101879 114335 150769 189447 142160 129816 219355 204501 147737 120316 130591 134970 78167
17138G8167j09327L1931J7797k9986j0181O7685k2653J03516j3756j14361l7416
$$ 78167 -31160 771 18568 -11418 -21599 46086 23433 126949 113193 -1168 -38584
17127c8584M467N2748n0426r5560M7837K8206N0052J6747j2620P44K9489K8952
$$ -38584 -34117 18631 -31795 -127355 -79518 -51312 -1260 15487 2867 3611 33100 62052
17115F2052K5573j4823j13521r3795O5586Q493k4432k1231N0173o8842P1358O9652
$$ 62052 87625 72802 -40719 -134514 -68928 -60435 -84867 -106098 -55925 -124767 -53409 16243
17103A6243j24045J4840P1138k1499k6525m0491L1715N6948Q8736Q3775O3631
$$ 16243 -107802 -92962 -21824 -43323 -69848 -110339 -78624 -21676 67060 150835 214466
17092B14466j16155j30312P9987J891m8814J3355j4920K4866J0492P2269j0618
$$ 214466 98311 -32001 47986 49877 1063 14418 -502 24364 34856 107125 96507
17081I6507o0475K146N4408K1760q6987r218n3506o5775N4044M2342L7775N1594
$$ 96507 36032 38178 92586 114346 27359 18141 -35365 -101140 -47096 -4754 33021 84615
17069H4615l8264j03533M7452P1571j3935M4981P6289n7603q2160J5539o867m0213
$$ 84615 46351 -57182 -9730 61841 47906 92887 169176 111573 29413 44952 38085 -2128
17057b128m5011M3386n2051m537N1306J50102J42499j18861p8792K6898J4135
$$ -2128 -47139 -3753 -55804 -60341 -9035 141067 283566 164705 85913 112811 126946
17046A26946m6376j03155q4944l4826N7525J05806q0436p2267n0312r686R144
$$ 126946 80570 -22585 -107529 -142355 -84830 20976 -59460 -131727 -182039 -191725 -182581
17035a82581L6745R7821j2292p0981l3108n3911O6104J25348k7191L531O0372
$$ -182581 -145836 -48015 -60307 -131288 -164396 -218307 -152203 -26855 -54046 -50515 9857
17024I857m1597n2837k0605R5274J04325N4355M2086o8090n9040q0320q952N834
$$ 9857 -31740 -84577 -105182 -9908 94417 148772 190858 122768 63728 -16592 -25544 -19710
17012a9710L8737l753K2499l7530N9555J13372Q5668R440P4142n6290o9788p5276
$$ -19710 19027 15274 37773 243 59798 173170 258838 268278 342420 286130 216342 141066
17000A41066j3702m3752q360k7853p7925k8800j2686M2378R514M0124K2677K3378
$$ 141066 127364 83612 75252 47399 -30526 -59326 -72012 -29634 -20120 20004 42681 66059
16988F6059l0935Q282k8534K633m193O9602J20241k3904r5086L712J0505j7647
$$ 66059 35124 43406 14872 17505 13312 82914 203155 179251 84165 87877 98382 80735
16976H0735l0587r975R08n7385J1647o324J321J4371O8326N8754o88r1944p059
$$ 80735 50148 40173 41081 -16304 -4657 -10981 -9660 4711 73037 131791 131103 39159 32100
16963C2100K9911M450n5562l6045K3708J7936R6967J14584l1926k2639j28784
$$ 32100 62011 66461 10899 -25146 -1438 16498 113465 228049 196123 173484 44700
16952D4700k5182L0320M9737R8064M1558p1053l5855n2728j05476o7275j3964
$$ 44700 19518 49838 99575 197639 239197 168144 132289 79561 -25915 -93190 -107154
16941a07154M0223R8439J19403M1502j5316j27587o7813J28991Q8373m139p6414
$$ -107154 -66931 31508 150911 192413 177097 49510 -18303 110688 199061 194922 118508
16930A18508j15622K6918M2206j4975p6819k2917J6873m499L975j0582l7394o537
$$ 118508 2886 29804 72010 57035 -19784 -42701 -25828 -30327 -26352 -36934 -74328 -80865
16918h0865J5979L1326N6088J1572o5815M6650m3486P578L8126J9653k0829Q1425
$$ -80865 -64886 -33560 22528 34100 -31715 14935 -28551 -20973 17153 36806 15977 97402
16906I7402J7741m8943o2086j43205p8468Q74N1730K9846O5056N7351R046K8586
$$ 97402 115143 66200 4114 -139091 -217559 -216685 -164955 -135109 -70053 -12702 -3656 24930
16894B4930l7355k5660K2881o28r710J0386k3872l972r694P4276N1900q085j32867
$$ 24930 -12425 -38085 -15204 -15832 -25542 -15156 -39028 -43000 -52694 21582 73482 65397 -67470
16881f7470o5748J15882J54305J6285m0084P686j0791j02308j8867K6878Q873
$$ -67470 -133218 -17336 136969 153254 113170 120856 110065 7757 -11110 15768 24641
16870B4641j9313N0998K0347j27157j9896M029N9747J8092n7964J4859r792n8304
$$ 24641 5328 56326 76673 -50484 -70380 -66351 -6604 11488 -46476 -31617 -41409 -99713
16858i9713l2754J6481J8273J05596M0854p4624k3144j6621k2435J2854j2223
$$ -99713 -132467 -115986 -97713 7883 48737 -25887 -49031 -65652 -88087 -75233 -87456
16847h7456J08660P4727j7040J926K9557l5468j04939K4469R5953k5988k858p2518
$$ -87456 21204 95931 78891 80817 110374 74906 -30033 -5564 90389 64401 61543 -10975
16835a0975p6600J9836J0299o2801J9724P8928o1822o4554M7011O7067O4425k3172
$$ -10975 -87575 -67739 -57440 -120241 -100517 -21589 -83411 -147965 -100954 -33887 30538 7366
16823G366L2597M722q1751k5544j5480N0723M9810N5643j5961o3359P067M5183
$$ 7366 39963 44685 -37066 -62610 -78090 -27367 22443 78086 62125 -1234 5833 51016
16811E1016J4805L8104m6727p5736N5542N470p3289N0781j3493k4740m5099m15
$$ 51016 65821 103925 57198 -18538 37004 42474 -30815 19966 6473 -18267 -63366 -63781
16799f3781K61J38150Q4334q7867j47988k2826N8146L6567m638M7083j7218K0362
$$ -63781 -63520 74630 158964 71097 -76891 -99717 -41571 -5004 -9642 37441 20223 40585
16787D0585J7050l574j0156l5728r0907q722M3724l6271k5697R2691k4905p3040
$$ 40585 57635 54061 43905 8177 -82730 -91452 -47728 -83999 -109696 -17005 -41910 -114950
16775a14950m706M9309K660j4465k9077L092O0031j3511O006J8659K3925M95K1311
$$ -114950 -119656 -70347 -67687 -82152 -111229 -108137 -48106 -61617 -55611 -36952 -13027 -12532 8779
16762H779P9212j7756k7075q6447o9448k3862q510L4758k662K9901N0971R4085
$$ 8779 87991 70235 43160 -43287 -112735 -136597 -145107 -110349 -113011 -83110 -32139 61946
16750F1946j4527K2047m180k4530J3125K3913j7588J1473m3218m9786n2355L2365
$$ 61946 47419 69466 65286 40756 53881 77794 60206 71679 28461 -21325 -73680 -41315
16738d1315L8842J7228m9087l5982M4230K379j385m2985j17036K6261N2951o8180
$$ -41315 -2473 14755 -34332 -70314 -26084 -23705 -25090 -68075 -185111 -158850 -105899 -174079
16726a74079M7044O6451N6311N0535l0065l4932m2955k7794K1057P3444P495o1956
$$ -174079 -127035 -60584 -4273 46262 16197 -18735 -61690 -89484 -68427 5017 12512 -49444
16714d9444n8470p3536J09689Q4783O8407r736m7932K2982q798l332M0536j01256
$$ -49444 -107914 -181450 -71761 13022 81429 71693 23761 46743 37945 34613 75149 -26107
16702b6107o8442J11134O4765j50275j11750J216K1321P3679Q9062O1478o610
$$ -26107 -94549 16585 81350 -68925 -180675 -179459 -158138 -84459 4603 66081 59471
16691E9471n4131N8902q360m3979l5585p4073K1089J510k024Q0199O1339J4840
$$ 59471 5340 64242 55882 11903 -23682 -97755 -76666 -75156 -77180 3019 64358 79198
16679G9198m0078o3921O6204M7718m0245q6486J1092j9426K844l5604j05737K7399
$$ 79198 39120 -24801 41403 89121 48876 -37610 -26518 -45944 -43100 -78704 -184441 -157042
16667a57042M3577R9153R5743R0779l2946j19459K838J0761j01953R00o1226n2314
$$ -157042 -113465 -14312 81431 172210 139264 19805 22643 33404 -68549 -67649 -128875 -181189
16655a81189K1204Q8877k6536l5145R250Q5731l5600J0284J73279J66923o44m8183
$$ -181189 -159985 -71108 -97644 -132789 -123539 -37808 -73408 -63124 110155 277078 276434 228251
16643B28251q7361j589j40520N8651n4399j31238l260M7808L627N5939R004M2110
$$ 228251 140890 139301 -1219 57432 3033 -128205 -131465 -83657 -80030 -24091 -15087 27023
16631B7023j11264K7338O2048k9469p452n3083J8655R908j2158O0779J2074J999
$$ 27023 -84241 -56903 5145 -24324 -31776 -84859 -66204 -56296 -68454 -7675 4399 6398
16619F398j0911Q88K2176K7211p0471K5296P7042j0834p342k512K1521m0799J503
$$ 6398 -4513 -3625 18551 45762 -24709 587 77629 66795 59453 56941 78462 37663 39166
16606C9166m2280l3707P0277J39388l9803j71605k4660m4087L3735J13642M6281
$$ 39166 -3114 -36821 33456 172844 133041 -38564 -63224 -107311 -73576 40066 86347
16595H6347K5857l9262O1052k5164l6168p7400p5999o6242J8429J777P6077J06666
$$ 86347 112204 72942 133994 108830 72662 -4738 -80737 -146979 -128550 -126773 -50696 55970
16583E5970L2402q8499r6650j3712L0100J6804K2408o4757J6246Q0110L9249K081
$$ 55970 88372 -127 -96777 -110489 -80389 -63585 -41177 -105934 -89688 -9578 29671 31752
16571C1752l4794m5898r486P442K3768L2421k0725n3105K5598J5497m6465J9846
$$ 31752 -3042 -48940 -58426 -50984 -27216 5205 -15520 -68625 -43027 -27530 -73995 -54149
16559e4149P9300l9988m6551l8457m8272l1957J19238J31334M9346k4448m0062
$$ -54149 25151 -14837 -61388 -99845 -148117 -180074 -60836 70498 119844 95396 55334
16548E5334o1590l8992n445M3396K403L3004N5496j47806m0577M7735J3777J0475
$$ 55334 -6256 -45248 -50693 -7297 -4894 28110 83606 -64200 -104777 -57042 -43265 -32790
16536c2790n3424J4902k2887R6247K0285J5251J5358o7691j11651n4780O5700
$$ -32790 -86214 -71312 -94199 2048 22333 37584 52942 -14749 -126400 -181180 -115480
16525a15480M9468o6047N228j8831P9269N8348L2771K7879k8409n4959j621L4076
$$ -115480 -66012 -132059 -126831 -145662 -66393 -8045 24726 52605 24196 -30763 -32384 1692
16513A692M7761R5481N9700k7096j31237n7483m203m4488j9206N9656Q2966p2077
$$ 1692 49453 144934 204634 177538 46301 -11182 -15385 -59873 -79079 -19423 63543 -8534
16501h534M7741N972o8728J7776j8149n8471k4903N8546M28k4482J5484k9960
$$ -8534 39207 45179 -23549 -5773 -23922 -82393 -107296 -48750 -48322 -72804 -57320 -87280
16489h7280j173K6130m664n6746l3234N2897P889q5471L2963O2970k8225J09171
$$ -87280 -88453 -62323 -66987 -123733 -156967 -104070 -96181 -181652 -148689 -85719 -113944 -4773
16477d773O0663R921N7697J2346j31408j15284M64P3465L3288O131p9616m3355
$$ -4773 55890 65811 123508 135854 4446 -110838 -110374 -36909 -3621 2510 -77106 -120461
16465a20461O4071M9060J578l5171j8906J3556k6305L7848k8575r6860J4488N2937
$$ -120461 -56390 -7330 -5752 -40923 -59829 -46273 -72578 -34730 -63305 -160165 -145677 -92740
16453i2740l8744q5412j0692L4994K5637O0247m1790J8021J6954J4799M5373M8625
$$ -92740 -131484 -216896 -227588 -192594 -166957 -106710 -148500 -130479 -113525 -98726 -53353 -4728
16441d728P124R3339k0507l7066l0228L4492m4723P723J5547L3334N6769q9848
$$ -4728 2396 95735 75228 38162 7934 42426 -2297 5426 20973 54307 111076 21228
16429B1228K468J08008M0514j13908q4218j2884L413M7776L5054o8880m025o6759
$$ 21228 23696 131704 172218 58310 -25908 -38792 -35379 12397 47451 -21429 -25454 -92213
16417i2213L0080K4323q7895j5575N5523O6308O8718L6868l4961N5038j3813n218
$$ -92213 -62133 -37810 -125705 -141280 -85757 -19449 49269 86137 51176 106214 92401 87183
16405H7183o4296n0069l0639l2110l2238J3666m5775P3393O3043j9173m1709K1538
$$ 87183 22887 -27182 -57821 -89931 -122169 -108503 -154278 -80885 -17842 -37015 -78724 -57186
16393e7186k1962J9731Q875k0669J77273R4545q4139j09856r4246r339J7119o536
$$ -57186 -79148 -59417 -50542 -71211 106062 200607 116468 6612 -87634 -96973 -79854 -86390
16381h6390O9809N5986J3339o8120j10070M5199R4541o6943p9056p3201J926L3378
$$ -86390 -16581 39405 52744 -15376 -125446 -80247 14294 -52649 -131705 -204906 -202980 -169602
16369a69602Q7585P0503O991m1314j8297N677J0322N3503N9954J4044J5538n6985
$$ -169602 -82017 -11514 -4523 -45837 -64134 -58457 -48135 5368 65322 79366 94904 37919
16357C7919o5485m82J8886J9120L1229j3719K8264p0324m0009N6006Q7457P1856
$$ 37919 -27566 -28048 -9162 9958 41187 27468 55732 -14592 -54601 1405 88862 160718
16345A60718O4004J7822k5357k12989n5821q7727p4750L6509O4961O6841k476
$$ 160718 224722 242544 217187 4198 -51623 -139350 -214100 -177591 -112630 -45789 -48265
16334d8265M4687J16185q359j29201j58228N8656J21067R9322K1547m795n2309
$$ -48265 -3578 112607 104248 -24953 -183181 -124525 -3458 95864 117411 112616 60307
16323F0307j4169J9626k6628J7907m3408K4043P2934M3038l1217l3727j038o362
$$ 60307 46138 65764 39136 57043 13635 37678 110612 153650 122433 88706 87668 81306
16311H1306j2934n2773P334M0065L330K4999k1416j12180j7883k4363O513L985
$$ 81306 68372 15599 22933 62998 66328 91327 69911 -42269 -60152 -84515 -78002 -74017
16299g4017j138K4444j4564k114N050R1805O0549J877K6701j01361m62k4983k4685
$$ -74017 -75155 -50711 -65275 -67389 -62339 29466 90015 91892 118593 17232 16770 -8213 -32898
16286c2898J3127q6116o3627L6116K0485k2926K084K0040J9355Q5662J03692L2161
$$ -32898 -19771 -105887 -169514 -133398 -112913 -135839 -133755 -113715 -94360 -8698 94994 127155
16274A27155n9284l1154m7473O6337O8606K1678r3293r444p6111n232P765N3640
$$ 127155 67871 36717 -10756 55581 124187 145865 52572 43128 -32983 -38215 -30450 23190
16262B3190j0012k39o814L1883k1288m8075L4608M7004k2002k6034K2628q0395
$$ 23190 13178 12939 6125 38008 16720 -31355 3253 50257 28255 2221 24849 -55546
16250e5546o0453R7782R0537J2865p050o1128m504l8720N5497o9728m9949K1295
$$ -55546 -115999 -18217 72320 85185 78135 17007 12503 -26217 29280 -40448 -90397 -69102
16238f9102l7797J1689M3032L583r8327M2627P5438P7324o2725k536L7339M3358
$$ -69102 -106899 -95210 -52178 -48595 -146922 -104295 -28857 48467 -14258 -16794 20545 63903
16226F3903L9695q208k0146o7695j4517J1274L4804k4787k815l8247p5632j5045
$$ 63903 103598 95390 75244 7549 -6968 4306 39110 14323 11508 -26739 -102371 -117416
16214a17416M3982O0481M2476k0097p5738L8253M7622p080j3347j18348L0449
$$ -117416 -73434 -12953 29523 9426 -66312 -28059 19563 12483 -864 -119212 -88763
16203h8763K2217L8171l0294L0586Q595K1140N8552L4808p4882r3327L7439P2350
$$ -88763 -66546 -28375 -58669 -28083 -19488 1652 60204 95012 20130 -73197 -35758 36592
16191C6592O0572J1312j04877j4265M7308K7166M618J0579l6620j5632r0351n2528
$$ 36592 97164 108476 3599 -10666 36642 63808 68426 79005 42385 26753 -63598 -116126
16179a16126j6703n9095L353L0611o0160q259R7422K668K2026l3834N9184K3575
$$ -116126 -132829 -191924 -188571 -157960 -218120 -226379 -128957 -126289 -104263 -138097 -78913 -55338
16167e5338j09709j02503N9910n1092P6948N1127K9408M0962J02759j3708K0794
$$ -55338 -165047 -267550 -207640 -258732 -181784 -130657 -101249 -60287 42472 28764 49558
16156D9558K1986J5087K0987J9086l6550q436j042M1903n7362m3257N9008N3625
$$ 49558 71544 86631 107618 126704 90154 81718 80676 122579 65217 21960 80968 134593
16144A34593o571o2436K0538L067J14994j0960n5453j11207m048M2486l5353M7675
$$ 134593 128022 65586 86124 89191 204185 193225 137772 26565 22517 65003 29650 77325
16132G7325J3280o0390o1456M2428M2492J498r019Q0991p6555p940k2881M9974
$$ 77325 90605 30215 -31241 11187 53679 55177 46158 127149 50594 42654 19773 69747
16120F9747K740K6663p2209r889L5752L2740K2058R2691k8447M679j02672m7802
$$ 69747 72487 99150 26941 17052 52804 85544 107602 200293 171846 176525 73853 26051
16108B6051j2241j254N048R780n228n2329q3148j2902L8482L5823P9381O861K2835
$$ 26051 13810 12556 17604 27384 22156 -30173 -113321 -126223 -87741 -51918 27463 34324 57159
16095E7159k6098l6566j8595o3352P0896L6099q7016k1902K0519R8981N4734q448
$$ 57159 31061 -5505 -24100 -87452 -16556 19543 -67473 -89375 -68856 30125 84859 76411
16083G6411l6570n1408k3999Q1741j3166j7280M2886M6212j01507m2378o6312
$$ 76411 39841 -11567 -35566 46175 33009 15729 58615 104827 3320 -39058 -105370
16072a05370o4211L3015P0155N3176M3233R9262k3282m8342m9546J16303K4822
$$ -105370 -169581 -136566 -66411 -13235 29998 129260 105978 57636 8090 124393 149215
16061A49215o7004L1660k3805J6333o2916n5325M3528Q9644q6662j29036J6653
$$ 149215 82211 113871 90066 106399 43483 -11842 31686 121330 34668 -94368 -77715
16050g7715k8653m3483K424P3579K1231J1845k7663K3672k0095K7081n3713K3170
$$ -77715 -106368 -149851 -147427 -73848 -52617 -40772 -68435 -44763 -64858 -37777 -91490 -68320
16038f8320L7036j5313k0011L9145j3226r334q1507l4173K4250M7381O3427O3817
$$ -68320 -31284 -46597 -66608 -27463 -40689 -50023 -131530 -165703 -141453 -94072 -30645 33172
16026C3172p877M674J6227m3624k9387L9695k0852l5743j8611k7271Q959n4509
$$ 33172 25295 29969 46196 2572 -26815 12880 -7972 -43715 -62326 -89597 -80638 -135147
16014a35147q953O4487N0202r953k423K0691j516j2111J1690N2471M2515n6580
$$ -135147 -144100 -79613 -29411 -39364 -41787 -21096 -22612 -34723 -23033 29438 71953 15373
16002A5373N1340k8525j18860p508Q8345O0073k2175q5177k1976O8004M032m2386
$$ 15373 66713 38188 -80672 -88180 165 60238 38063 -47114 -69090 -1086 2946 -39440
15990c9440l7651k992P3921k7150j5621p2161j4283K815P57O3990o7228n8809
$$ -39440 -77091 -80083 -6162 -33312 -48933 -121094 -135377 -132562 -131805 -67815 -135043 -193852
15978a93852k7157Q5423J93j08537Q81J39622M8279j3715j17134L2854J48227
$$ -193852 -221009 -135586 -135393 -243930 -243049 -103427 -55148 -68863 -185997 -153143 -4916
15967d916J01705m9435j8109K0506k2111n8003o165l4405m3533L3738O475R4464
$$ -4916 96789 47354 29245 49751 27640 -30363 -36528 -70933 -114466 -80728 -74253 20211
15955B0211M71m0230O087j1010m1271K7643J8387k3665j8763l2494j1058l0216
$$ 20211 20682 -19548 -13461 -24471 -65742 -38099 -19712 -43377 -62140 -94634 -105692 -135908
15943a35908j5488O6792L5523N2594k1875L9932L2694n6176p3967R671J56906
$$ -135908 -151396 -84604 -49081 3513 -18362 21570 54264 -1912 -75879 -66208 90698
15932I0698Q2816L3779p5318j01126N783K155Q0097O561k8713p244l1261p4869
$$ 90698 173514 207293 131975 30849 36632 38787 118884 125445 96732 89488 58227 -16642
15920a6642m7259J3643n9707q3344n4213P7184M8029J03280N4402j0228q371P603
$$ -16642 -63901 -50258 -109965 -193309 -247522 -170338 -122309 -19029 35373 25145 16774 24377
15908B4377K5244j04146o2310j4844J7692J35323P4978j21442K9571J07437M2347
$$ 24377 49621 -54525 -116835 -131679 -113987 21336 96314 -25128 4443 111880 154227
15897A54227N2564O1759j08643l2906l3492m5884q6817k925P6741O8569k2025
$$ 154227 206791 268550 159907 127001 93509 47625 -39192 -42117 34624 103193 81168
15886H1168r9124r6170j05776Q5995k131K7826L5549k2511q575K5621K6501j7640
$$ 81168 -17956 -114126 -219902 -133907 -136038 -108212 -72663 -95174 -103749 -78128 -51627 -69267
15874f9267k0206m4497m1367N2878M6782j32761L3929O8971Q5926J4129L809N0419
$$ -69267 -89473 -133970 -175337 -122459 -75677 -208438 -174509 -105538 -19612 -5483 -1674 48745
15862D8745m4835J6037J7224p0734r2372L6609k9299J799O2188Q0031m060l2810
$$ 48745 3910 19947 37171 -33563 -125935 -89326 -118625 -116826 -54638 25393 21333 -11477
15850a1477m6774K4727J5495l0869j9055k6338M9638N2900M5316l1030j7426p0789
$$ -11477 -58251 -33524 -18029 -48898 -67953 -94291 -44653 8247 53563 22533 5107 -65682
15838f5682l6681m8139K9334k7358p1574K3711j3937n2372m3801o512R1893J04129
$$ -65682 -102363 -150502 -121168 -148526 -220100 -196389 -210326 -262698 -306499 -313011 -221118 -116989
15826a16989J9156O6482K9990l372K1660R232j2369o1821K6845l9897L8371M2408
$$ -116989 -97833 -31351 -1361 -4733 16927 26159 13790 -48031 -21186 -61083 -22712 19696
15814A9696K2195k2404k2804l253m4980l8687n378M1629n929J3714N8280k419
$$ 19696 41891 19487 -3317 -6570 -51550 -90237 -95615 -53986 -59915 -46201 12079 9660
15802I660O792M7536M3712J6385P0683l5672k9659K2206l1805q0918n6338n7633
$$ 9660 16452 63988 107700 124085 194768 159096 129437 151643 119838 38920 -17418 -75051
15790g5051K5583Q4510r7197q6373J2150P9741M7299m0055k4713O7463K8227j51872
$$ -75051 -49468 35042 -62155 -148528 -136378 -56637 -9338 -49393 -74106 -6643 21584 -130288
15778a30288n0917L9615m7024n525K7560J9302M8569N3374p786o6506R7612R9271
$$ -130288 -181205 -141590 -188614 -194139 -166579 -147277 -98708 -45334 -53120 -119626 -22014 77257
15766G7257K0406P069K2701r3951j7127k6710K8009p5103p3263k4270L2505Q28
$$ 77257 97663 104732 127433 33482 16355 -10355 17654 -57449 -130712 -154982 -122477 -121649
15754a21649M0651K0198L6247r098O944N8577P8168R5484M4050n9742p6501n9389
$$ -121649 -80998 -60800 -24553 -33651 -26707 31870 110038 205522 249572 189830 113329 53940
15742E3940j3317k4647N8476k8491K8906M4598K7435o3170N963K5650J4629l5311
$$ 53940 40623 15976 74452 45961 74867 119465 146900 83730 89693 115343 129972 94661
15730I4661q5377J25041M0063o0443p5461k4463n0279j27074J32457J24213J1542
$$ 94661 9284 134325 174388 113945 38484 14021 -36258 -163332 -30875 93338 104880
15719A04880k3775m8099p6255l4797o9743m3536O382L6735J10674Q1862K294J8989
$$ 104880 81105 33006 -43249 -78046 -147789 -191325 -184943 -148208 -37534 44328 46622 65611
15707F5611n3209J3158J5342q3407n7034l7003J2968J55889M2056p6386j6516
$$ 65611 12402 25560 40902 -42505 -99539 -136542 -123574 32315 74371 -2015 -18531
15696a8531K8640o9492k3238O4387k0753p0037M0917J54796R5888m2985r5397
$$ -18531 10109 -59383 -82621 -18234 -38987 -109024 -68107 86689 182577 139592 44195
15685D4195j12887p3971N4450N1351k7603k4650Q9263P9962m6245J3706O1892
$$ 44195 -68692 -142663 -88213 -36862 -64465 -89115 148 80110 33865 47571 109463
15674A09463p361j53333k7938J22994L1358J399N0276r9995j05589q419Q7948
$$ 109463 102102 -51231 -79169 43825 75183 76582 126858 26863 -78726 -87145 803
15663H03j7228N116k5466K2089j6903m7386O076K7631m330p6164j26692n6984
$$ 803 -16425 -11309 -36775 -14686 -31589 -78975 -72899 -45268 -49598 -125762 -252454 -309438
15651c09438N7513R0851J19517P3763L2896o0879L208o7313q02m3886k5596J16592
$$ -309438 -251925 -161074 -41557 32206 65102 4223 7431 -59882 -60684 -104570 -130166 -13574
15639a3574O2548K9731m0168l1163p1739R7403R1672k6158o5281J487M4963l8204
$$ -13574 48974 78705 38537 7374 -64365 33038 124710 98552 33271 34758 79721 41517
15627D1517m1977m4622k8022j0528l8954Q5262P7511K853K8417M9987J138l9843
$$ 41517 -460 -45082 -73104 -83632 -122586 -37324 40187 43040 71457 121444 122582 82739
15615H2739j33767j2090L3450M8438K3848M9236k6381m0793O0673o1233L6749
$$ 82739 -51028 -63118 -29668 18770 42618 91854 65473 24680 85353 24120 60869
15604F0869L8430O0646n6266n5816o0561l0358p0011o1358R3856J5506o6732k4661
$$ 60869 99299 159945 103679 47863 -12698 -43056 -113067 -174425 -80569 -65063 -131795 -156456
15592a56456J72765R3879k9715p9416o4594k3413J9091K9918K656J08474p72j00162
$$ -156456 16309 110188 80473 1057 -63537 -86950 -67859 -37941 -35285 73189 72417 -27745
15580b7745l4462Q3888l8496m1019k2459o417J0104K1055M0865O14l6687M8799
$$ -27745 -62207 21681 -16815 -57834 -80293 -86710 -76606 -55551 -14686 -14072 -50759 -1960
15568a960n6273J5087J14976K1759m9235l0724k1446l1653q4196q3198j2791O4950
$$ -1960 -58233 -43146 71830 93589 44354 13630 -7816 -39469 -123665 -206863 -219654 -154704
15556a54704P4711N8190N1317N976o4710O770J23562O7404k2383o0175m8031M8845
$$ -154704 -79993 -21803 29514 35490 -29220 -22450 101112 168516 146133 85958 37927 86772
15544H6772O1845l0292O8372L0090k2932r9829q3734n722q0070L1566N4329K2327
$$ 86772 148617 118325 186697 216787 193855 94026 10292 4570 -75500 -43934 10395 32722
15532C2722K0984M6495m0432r2846P508R4642m683m3772o7191L4409j1839J8315
$$ 32722 53706 100201 59769 -33077 -25569 69073 64390 20618 -46573 -12164 -24003 -5688
15520e688P9177J40300Q042l9041j33787k0285k6947K8718j4674o9118k8612L3333
$$ -5688 73489 213789 221831 182790 49003 28718 1771 30489 15815 -53303 -81915 -48582
15508d8582R0394O4653n3040j1332o0882l0316N0116Q2131Q0520l1898j01029
$$ -48582 41812 106465 53425 42093 -18789 -49105 1011 83142 163662 131764 30735
15497C0735m621k037Q4277O3567J6548J6331l5397n464J3115m739p0518m7517
$$ 30735 26114 24077 108354 171921 188469 204800 169403 163939 177054 172315 101797 54280
15485E4280L8934k3823n9740k9504M4643Q0246L6820k9924o9326O0161K2277R792
$$ 54280 93214 69391 9651 -19853 24790 105036 141856 111932 42606 102767 125044 134836
15473A34836N5943m4358n5223J9310J3447m7814m4064k872J8691P496J41669Q376
$$ 134836 190779 146421 91198 110508 123955 76141 32077 29205 47896 55392 197061 205437
15461B05437R855j09908m4783n0102R5295J42136m8683j03975m6458k8007n5962
$$ 205437 215292 105384 60601 10499 105794 247930 199247 95272 48814 20807 -35155
15450c5155L1783M9922J0327n5287L3315R0753M3736r0027m5545r5909J05929
$$ -35155 -3372 46550 56877 1590 34905 125658 169394 79367 33822 -62087 43842
15439D3842J12846n671L9208n1022k9153k3800l8433Q344P5541J04205m5678j2940
$$ 43842 156688 151017 190225 139203 110050 86250 47817 56161 131702 235907 190229 177289
15427A77289j869J8017Q6928L9371n8554L7788l8246j8692q55p1901L3046k2126
$$ 177289 175420 193437 280365 319736 261182 298970 260724 242032 241177 169276 202322 180196
15415A80196L6467O5251K1845q5694q3959L1179O1354k2960j11155L421m5800
$$ 180196 216663 281914 303759 218065 134106 165285 226639 203679 92524 95945 50145
15404E0145m38J1897l435N7767l3852o2491p6412O4958Q1460R1704P1244l0783
$$ 50145 49707 61604 58169 115936 82084 19593 -56819 8139 89599 181303 252547 221764
15392B21764j8094m1239j28770l8254N3914R9040N5450n719n7918l227R393R5236
$$ 221764 203670 162431 33661 -4593 49321 148361 203811 198092 140174 136947 146340 241576
15380B41576L446o5537j12270q5406R181Q6791R5848R345j14237j16966K6535
$$ 241576 245022 179485 67215 -18191 -9010 77781 173629 182974 68737 -48229 -21694
15369b1694P3565M021l4736J1757Q6204J65951N9642j05821j37272o480P0442
$$ -21694 51871 55892 21156 32913 119117 285068 344710 238889 101617 95137 165579
15358A65579K1374o709l0403n3215L4137O7423K7012o2226J7338J1861j08402
$$ 165579 186953 180244 149841 96626 130763 198186 225198 162972 180310 192171 83769
15347H3769m0903L5835k6134J7777l3145n8752O0769k3606o8258M8472J33332
$$ 83769 42866 78701 52567 70344 37199 -21553 39216 15610 -52648 -4176 129156
15336A29156o2004k3352O313L432j5342m4445j0283m5988J2881P0446L1092j5177
$$ 129156 67152 43800 50113 53545 38203 -6242 -16525 -62513 -49632 20814 51906 36729
15324C6729J8618l3137m0137J6511n5219j3086J40644P2912J6826o4849o8372
$$ 36729 55347 22210 -17927 -1416 -56635 -69721 70923 143835 160661 95812 27440
15313B7440M9929J7610r8897M7982p9467q4809N6923Q263j7773m6282l6837K4064
$$ 27440 77369 94979 -3918 44064 -35403 -120212 -63289 -55026 -72799 -119081 -155918 -131854
15301a31854L8387K3793O6498L9421l6725Q2008N911n3994o6204k4479N2947Q4888
$$ -131854 -93467 -69674 -3176 36245 -480 81528 87439 33445 -32759 -57238 -4291 80597
15289H0597j6101j6621K0419L2945n461j25442l4345J3822K9203M9858J0541j155
$$ 80597 64496 47875 68294 101239 95778 -29664 -64009 -50187 -20984 28874 39415 38260
15277C8260j0131P8012l2113r9524L251M7773l5110r957O7315k6544M2674N2154
$$ 38260 28129 106141 74028 -25496 -22245 25528 -9582 -19539 47776 21232 63906 116060
15265A16060P2930K3002q2608p2553q4856k2590O2143L345L6234m3986L9497q80
$$ 116060 188990 211992 129384 56831 -28025 -50615 11528 14873 51107 7121 46618 45738
15253D5738K9443m0152r303n2150J4102j2908j1371L4806n448O852L5975k8635
$$ 45738 75181 35029 25726 -26424 -12322 -25230 -36601 -1795 -7243 -391 35584 6949
15241F949o6280L0267K7808N5314L4909l4646k4419p6210p0090m1624J8335j0955
$$ 6949 -59331 -29064 -1256 54058 88967 54321 29902 -46308 -116398 -158022 -139687 -150642
15229a50642j5184k2812J0911O935n004J8767M9097O0276O6622J8022j8962O8474
$$ -150642 -165826 -188638 -177727 -170792 -175796 -157029 -107932 -47656 18966 36988 18026 86500
15217H6500q0957l8355K4637K7725M512M3193N4994l2335o2272k5363N7109M3736
$$ 86500 5543 -32812 -8175 19550 24062 67255 122249 89914 27642 2279 59388 103124
15205A03124l1248J8716l6884o0929J3898j0535M081J5459R431O0179J3175P9631
$$ 103124 71876 90592 53708 -7221 6677 -3858 223 15682 25113 85292 98467 178098
15193A78098L7972O231j31498p1080m3505m1881R5054O4459m4293R475P5127J15731
$$ 178098 216070 222301 90803 19723 -23782 -65663 29391 93850 49557 59032 134159 249890
15181B49890J2708p1538j08596l4257K0410n6062j33545N9165Q4971N3492o5059
$$ 249890 262598 191060 82464 48207 68617 12555 -120990 -61825 23146 76638 11579
15170A1579K2202K3976l9678k5287l7207M8018j9830o7912k8696N8657N7668j9495
$$ 11579 33781 57757 18079 -7208 -44415 3603 -16227 -84139 -112835 -54178 3490 -16005
15158a6005o9143J2041l7133J8588L6512L0926J5259L6968N9764l4504l1624K770
$$ -16005 -85148 -73107 -110240 -91652 -55140 -24214 -8955 28013 87777 53273 21649 24419
15146B4419l8172m0392J40956o844p4522m1419n367l9557j9959P3644J0835j895
$$ 24419 -13753 -54145 86811 79967 5445 -35974 -41341 -80898 -100857 -27213 -16378 -18273
15134a8273m2817n9071L626J2124n1562k1683P7933O2150l0061l8596N6245L3867
$$ -18273 -61090 -120161 -116535 -104411 -155973 -177656 -99723 -37573 -67634 -106230 -49985 -16118
15122a6118P759R5584M7214J5512k3441P34K033m4358n4092o3933j34464N7473
$$ -16118 -8359 87225 134439 149951 126510 127244 129277 84919 30827 -33106 -167570 -110097
15110a10097J26199Q6202J06505k0465o6603J9284n525R966l917k7359k6815k1205
$$ -110097 16102 102304 208809 188344 121741 141025 135500 145466 141549 114190 87375 66170
15098F6170M0205j7657P013k6532M9442p5663r9031j7517J8955K7152o672K0765
$$ 66170 106375 88718 95731 69199 118641 42978 -56053 -73570 -54615 -27463 -34135 -13370
15086a3370m9137K3854n4824l8735P1677r2018L1629L9753j4648j0862M8848P4702
$$ -13370 -62507 -38653 -93477 -132212 -60535 -152553 -120924 -81171 -95819 -106681 -57833 16869
15074A6869P2775j186k7609J033P4204Q8306k1287r3653r7605q6296p5536P078
$$ 16869 89644 88458 60849 61882 136086 224392 203105 109452 11847 -74449 -149985 -142907
15062a42907K9412m7769J4056J79334M679j8005O1046M393k8653n6381j46641
$$ -142907 -113495 -161264 -147208 32126 36805 18800 79846 84239 55586 -795 -147436
15051a47436j7083L2942L0978R0392P0183K4338J1736j5247j06301J6077N9118
$$ -147436 -164519 -131577 -100599 -10207 59976 84314 96050 80803 -25498 -9421 49697
15040D9697p590R8597p7660p2616L95P7696R2985k091j15995r9959n773J7017
$$ 49697 42107 140704 63044 -9572 -9177 68519 161504 159413 43418 -56541 -62314 -45297
15028d5297M5256p1482o9393J8282J1349L6631O8525k4774K8828P199L4147p790
$$ -45297 -41 -71523 -140916 -122634 -111285 -74654 -6129 -30903 -2075 5124 39271 31481
15016C1481J8818m2787j5581o5328m9338J3787O6138Q3195N758o1139j5888P690
$$ 31481 50299 7512 -8069 -73397 -122735 -108948 -42810 40385 46143 -14996 -30884 -23194
15004b3194L9110m3470N6699r691M962K375P5010j1755o4592l1869k2889M6599
$$ -23194 15916 -27554 29145 19454 24416 26791 101801 90046 25454 -6415 -29304 17295
14992A7295l8189O1760P8714L0399m4291l3505p6742p6274m4784p1034k8939M2019
$$ 17295 -20894 40866 119580 149979 105688 72183 -4559 -80833 -125617 -196651 -225590 -183571
14980a83571R3084O8138K4541j2020K8293j9819o6299o7242O1301O7699K2597
$$ -183571 -90487 -22349 2192 -9828 18465 -1354 -67653 -134895 -73594 -5895 16702
14969A6702n5408J6875P4023j5168k8741k2152k2394N3247P9565j553p8798r1763
$$ 16702 -38706 -21831 52192 37024 8283 -13869 -36263 16984 96549 94996 16198 -75565
14957g5565K6342O6037J3113j8459k1001j814m9936k5974q858L5967L6209j6151
$$ -75565 -49223 16814 29927 11468 -9533 -11347 -61283 -87257 -96115 -60148 -23939 -40090
14945d0090k5190M5512K2717k5680L9127N3569j4698J2723p2117j07376k2166
$$ -40090 -65280 -19768 2949 -22731 16396 69965 55267 67990 -4127 -111503 -133669
14934a33669n9206J5570R1602N9311M656j632l6939O6431K1469L8590L3193q4934
$$ -133669 -192875 -177305 -85703 -26392 -21736 -23368 -60307 6124 27593 66183 99376 14442
14922A4442o3430P5215K9113m3792k3752o3105M9608L1302L2849n4874k6352J3067
$$ 14442 -48988 26227 55340 11548 -12204 -75309 -25701 5601 38450 -16424 -42776 -29709
14910b9709m1918q9876j400N7820N7181j4429M4142K6106k0939n3649r1677P7249
$$ -29709 -71627 -161503 -162903 -105083 -47902 -62331 -18189 7917 -13022 -66671 -158348 -81099
14898h1099K1392M5511K5660l3345q2379j14755P8269J16147N0781O43J3436p5060
$$ -81099 -59707 -14196 11464 -21881 -104260 -219015 -140746 -24599 26182 26825 40261 -34799
14886c4799k0004j37897o3931L100K0937J02993K2283M8237N4450l0153J8790
$$ -34799 -54803 -192700 -256631 -253531 -232594 -129601 -107318 -59081 -4631 -34784 -15994
14875a5994L3905q3862m1757O0741l5854K2881R3895J4813m8782R312k9365k5816
$$ -15994 17911 -65951 -107708 -46967 -82821 -59940 33955 48768 -14 9298 -20067 -45883
14863d5883M1916K4387O4522l799L1054n9820r8310p00N1957p0900n496m694R732
$$ -45883 -3967 20420 84942 81143 112197 52377 -45933 -46633 5324 -65576 -71072 -75766 -66034
14850f6034Q9914L9298j0387o8611J5082L6693J3940k7783p3209j0893L5836K195
$$ -66034 23880 63178 52791 -15820 -738 35955 49895 22112 -51097 -61990 -26154 -23959
14838b3959L9386p4786q1463p9472P9563Q9506J12856n557o1213o5668m3787k4560
$$ -23959 15427 -59359 -140822 -220294 -140731 -51225 61631 56074 -5139 -70807 -114594 -139154
14826a39154J530n684K1395Q7377l1739r4203j5586n980m8124j2787P0576J00770
$$ -139154 -137624 -143308 -121913 -34536 -66275 -160478 -176064 -182044 -230168 -242955 -172379 -71609
14814g1609l5440l0991K2689J01339j9923p1033k7789O7142R4037o3890l4036
$$ -71609 -107049 -138040 -115351 -14012 -33935 -104968 -132757 -65615 28422 -35468 -69504
14803f9504n3053L8396j075l9157L335k2219Q9888N4940j11229l6693P2881N408
$$ -69504 -122557 -84161 -85236 -124393 -121058 -143277 -53389 1551 -109678 -146371 -73490 -68082
14791f8082J3799l329l8578P686J2261p8449l2583L3027p5660o6289J3550K3060
$$ -68082 -54283 -57612 -96190 -88504 -76243 -154692 -187275 -154248 -229908 -296197 -282647 -259587
14779b59587J29563R3882m6273M5370M7638L3714R869k1226k5207K9911m5615
$$ -259587 -130024 -36142 -82415 -37045 10593 44307 54176 32950 7743 37654 -7961
14768g961j5994n947K9723n7994j18912k8041P7386M2336J5467K0407N9628M7502
$$ -7961 -23955 -29902 -179 -58173 -177085 -205126 -127740 -85404 -69937 -49530 10098 57600
14756E7600l4003o9850k433j1872l0880K7420L9908R5534K2567R887L5615L8788
$$ 57600 23597 -46253 -48686 -60558 -91438 -64018 -24110 71424 93991 103878 139493 178281
14744A78281q8131o6464j6558q0693M2457p018K3362N1645K6017j31894L2139
$$ 178281 90150 23686 7128 -73565 -31108 -38126 -14764 36881 62898 -68996 -36857
14733c6857n007P6681k4148o9236J7668q2921r237K0292M0659K3249l8985n3295
$$ -36857 -41864 34817 10669 -58567 -40899 -123820 -133057 -112765 -72106 -48857 -87842 -141137
14721a41137K8500J04571l2084j2844J6131M1857P8199P4073o7341J8143j3973
$$ -141137 -112637 -8066 -40150 -52994 -36863 4994 83193 157266 89925 108068 94095
14710I4095j8461J8931j9673m9814j1560k5720m7224L3913r2244J1807K4306J5747
$$ 94095 75634 94565 74892 25078 13518 -12202 -59426 -25513 -117757 -105950 -81644 -65897
14698f5897N4898n0769n5670k0565K2434M8507j1273P0723J01993p2479j35350
$$ -65897 -10999 -61768 -117438 -138003 -115569 -67062 -78335 -7612 94381 21902 -113448
14687a13448k0570K8062N7655P9370m4966q2618j0650K188p1527K7666O1690K483
$$ -113448 -134018 -105956 -48301 31069 -13897 -96515 -107165 -104977 -176504 -148838 -87148 -84665
14675h4665N4580P4270L6576l4494j6018o6346o7439l8665J43409J3432o224K6572
$$ -84665 -30085 44185 80761 46267 30249 -36097 -103536 -142201 1208 14640 8416 34988
14663C4988n3344L79p237m6839O4595P9032k9284Q115m6550j7234o5783l1587
$$ 34988 -18356 -17977 -25214 -72053 -7458 71574 42290 50405 3855 -13379 -79162 -110749
14651a10749L2671L2276l6327N5326o223m9794K6744Q9525O8495J6766k2929j16576
$$ -110749 -78078 -45802 -82129 -26803 -33026 -82820 -56076 33449 101944 118710 95781 -20795
14639b0795j38064o969J54418k8733q4841j4931q2395N2278J42175Q5260m8469
$$ -20795 -158859 -165828 -11410 -40143 -124984 -139915 -222310 -170032 -27857 57403 8934
14628H934J5280P8595M6911n2070o1202q0612j7469L3696P5038j3570k5461K8621
$$ 8934 24214 102809 149720 97650 36448 -44164 -61633 -27937 47101 33531 8070 36691
14616C6691n5152m4683J03220P4499m5287p000j2407j852m2234j6676L2221p877
$$ 36691 -18461 -63144 40076 114575 69288 62288 49881 48029 5795 -10881 21340 13463
14604A3463o6064m102J6566o8588n3157Q4602O3840P5622m5741j06599j6544O3277
$$ 13463 -52601 -56703 -40137 -108725 -161882 -77280 -13440 62182 16441 -90158 -106702 -43425
14592d3425K1977L5300K7453j8455k5382N665K7114J14720K9221p636q9567n8519
$$ -43425 -21448 13852 41305 22850 -2532 3133 30247 144967 174188 166552 76985 18466
14580A8466m2415M8002K6568j29564K1120P0278M7407q8558n5891O6146J6740
$$ 18466 -23949 24053 50621 -78943 -57823 12455 59862 -28696 -84587 -18441 -1701
14569a701O8565n48Q08J521R595m288K00m9341k9316L6945J6903M1380n5949l8351
$$ -1701 66864 66316 67124 68645 78240 73952 74152 24811 -4505 32440 49343 90723 34774 -3577
14555c577p3058n6288l0298N696J38633K6644m2364k1016M7074k0441O167m2465
$$ -3577 -76635 -132923 -163221 -157525 -18892 7752 -34612 -55628 -8554 -28995 -22828 -65293
14543f5293P4698O7481j1380m9111q2078K7420m4226m6520N4441N8999p1613J9056
$$ -65293 9405 76886 65506 16395 -65683 -38263 -82489 -129009 -74568 -15569 -87182 -68126
14531f8126N0271O7383k6211p9265p5724J8004P2530L5640N728j5363J7793O1675
$$ -68126 -17855 49528 23317 -55948 -131672 -113668 -41138 -5498 230 -15133 2660 64335
14519F4335p296o3832L5016O1438n4839j05327p1819q094N571M7825k9262m6930
$$ 64335 57039 -6793 28223 89661 34822 -70505 -142324 -150418 -144847 -97022 -126284 -173214
14507a73214N3571N3531O4203O1611o0203k5679K5072J08283M1593j31810l7757
$$ -173214 -119643 -66112 -1909 59702 -501 -26180 -1108 107175 148768 16958 -20799
14496b0799P1543K2567q960m0577n7192k1665k516p192O187m734R9051K4698k8157
$$ -20799 50744 73311 64351 23774 -33418 -55083 -57599 -64791 -58604 -63338 35713 60411 32254
14483C2254r0699q1500k6259l6457L3721Q1541N1601n4456L9759J1585o1287J2207
$$ 32254 -58445 -139945 -166204 -202661 -168940 -87399 -35798 -90254 -50495 -38910 -100197 -87990
14471h7990N3325L0643L5725m2929M7780j047p6164j5664J08681N8658o041J7465
$$ -87990 -34665 -4022 31703 -11226 36554 35507 -40657 -56321 52360 111018 104977 122442
14459A22442m9827q7341j930m3126N291j9959l5996m0726K5180K471K916N8323
$$ 122442 72615 -14726 -16656 -59782 -54491 -74450 -110446 -151172 -125992 -123521 -120605 -62282
14447f2282O5695m6686M5921j2547p4639J85L0878o8300N1193K68L8187m6036
$$ -62282 3413 -43273 2648 -9899 -84538 -84353 -53475 -121775 -70582 -70314 -32127 -78163
14435g8163q7221L5860J06893P4661k3981j05160M4594K2881j2171K1885Q262
$$ -78163 -165384 -129524 -22631 52030 28049 -77111 -32517 -9636 -21807 78 8340
14424H340J6473p4625j25045M54j2349p935L1183J09506L7569m9842M2379L272
$$ 8340 24813 -49812 -174857 -174403 -186752 -194687 -163504 -53998 -16429 -66271 -23892 -20620
14412b0620o3030N3701M8169j31271P919N1061m5508O7645P9490l3467k6870q116
$$ -20620 -83650 -29949 18220 -113051 -105132 -54071 -99579 -31934 47556 14089 -12781 -20897
14400b0897q306O4777N3833p2652m4631k4920J9295K1216j03002L229J1287J3079
$$ -20897 -29203 35574 89407 16755 -27876 -52796 -33501 -12285 -115287 -112058 -100771 -87692
14388h7692k6868K2464Q6591K0329J1037q7619m8916k0581j8879L6435Q4097O6527
$$ -87692 -114560 -92096 -5505 14824 25861 -61758 -110674 -131255 -150134 -113699 -29602 36925
14376C6925m0993j1447L6871q861o3488l5251k5868N0937Q1889n4357m156P9646
$$ 36925 -4068 -15515 21356 12495 -50993 -86244 -112112 -61175 20714 -33643 -37799 41847
14364D1847N8208N473o6529p2879N648l1761l3636K3042P8771k3445j9262M6398
$$ 41847 100055 105528 38999 -33880 -28232 -59993 -93629 -70587 8184 -15261 -34523 11875
14352A1875K2588l8657l7703O602N4202O0711j12622q9977J619O8821M5016k4936
$$ 11875 34463 -4194 -41897 -35295 18907 79618 -33004 -122981 -121362 -52541 -7525 -32461
14340c2461K0002o7825o518l540q0555Q4445P8310M7535K7550j7978j09438J6146
$$ -32461 -12459 -80284 -86802 -90342 -170897 -86452 -8142 39393 66943 48965 -60473 -44327
14328d4327N3136r905k1525n1773l6011N3690N0219q6384J0273o609j6945k7310
$$ -44327 8809 -1096 -22621 -74394 -110405 -56715 -6496 -92880 -82607 -89216 -106161 -133471
14316a33471J24919J30516l8931l1299o8604l441j4748l8034L1316J4491N7825
$$ -133471 -8552 121964 83033 51734 -16870 -20311 -35059 -73093 -41777 -27286 30539
14305C0539q625k8483l5804o618L8090K4306j8405p7741K5687J06980K8529J2269
$$ 30539 21914 -6569 -42373 -48991 -10901 13405 -5000 -82741 -57054 49926 78455 90724
14293I0724J2588O9570m8383r0548o8753m4185K690p193L8685o756m4340k7787
$$ 90724 103312 172882 124499 33951 -34802 -78987 -76297 -83490 -44805 -51561 -95901 -123688
14281a23688L4623J20470L5209p0932q3962P4926M1367m3036o497N1308o0782
$$ -123688 -89065 31405 66614 -4318 -88280 -13354 28013 -15023 -21520 29788 -30994
14270c0994p8526J43140M4710J6423J6614j40154j05842k4601Q1854Q6122P0641
$$ -30994 -109520 33620 78330 94753 111367 -28787 -134629 -159230 -77376 8746 79387
14259G9387k9970l1705L4133p264r4168l3513N6910K1015M2969r7320k9865J5138
$$ 79387 49417 17712 51845 44581 -49587 -83100 -26190 -5175 37794 -59526 -89391 -74253
14247g4253J35355M4433m9863j03800n3083L6089J09044K8280l7198o3945r3279
$$ -74253 61102 105535 55672 -48128 -101211 -65122 43922 72202 35004 -28941 -122220
14236a22220k9136K985L7833J0775j7954l3925K9218L498N8818J14312M6718r1816
$$ -122220 -151356 -148371 -110538 -99763 -117717 -151642 -122424 -118926 -60108 54204 100922 9106
14224I106j7812K8611l298j203Q1173j3369j3563o441L0904o0463k3729M3684
$$ 9106 -8706 19905 16607 15404 96577 83208 69645 63204 94108 33645 9916 53600
14212E3600j7031q8626J0776R6924K5053j4753j03125J9290J05754K4034o4941
$$ 53600 36569 -52057 -41281 55643 80696 65943 -37182 -17892 87862 111896 46955
14201D6955p9761o540J790J2403l4622O0618N04p09j1703r249K6809o1927o226
$$ 46955 -32806 -39346 -37556 -25153 -59775 843 1347 638 -11065 -20314 6495 -55432 -61658
14188f1658l019o5060j15223j8143J34327J09840l6897r4277N6525J5565O3289
$$ -61658 -64677 -129737 -244960 -263103 -128776 -18936 -55833 -150110 -93585 -78020 -14731
14177a4731M6923q015k7810r5627n4029O121L463J5154O4219J1702M7103Q6441
$$ -14731 32192 24177 -3633 -99260 -153289 -147168 -143705 -128551 -64332 -52630 -5527 80914
14165H0914J6444J1635k6321k6095j3333l9292n8059p8201N6682O6521l7548k6150
$$ 80914 97358 108993 82672 56577 43244 3952 -54107 -132308 -75626 -9105 -46653 -72803
14153g2803J08k7943Q7156P1803J2183o514o0496j1318J4059j19759K5178J28943
$$ -72803 -72695 -100638 -13482 58321 70504 63990 3494 -7824 6235 -113524 -88346 40597
14141D0597P708P854q7712j1731l2489K8622K2823O417n3524M7737L3351J8703
$$ 40597 48305 56159 -31553 -43284 -75773 -47151 -24328 -17911 -71435 -23698 9653 28356
14129B8356o4497q5730k1830M4924J57855M1990K192M2111O457l2584p9881k6806
$$ 28356 -36141 -121871 -143701 -98777 59078 101068 103260 145371 151828 119244 39363 12557
14117A2557o4925K3590R82L4862K2359m0112M2771Q0709q6305j17822N2320j0572
$$ 12557 -52368 -28778 -27796 7066 29425 -10687 32084 112793 26488 -91334 -39014 -49586
14105d9586o9346j4902K0240J3206N8706K583K4701o091m722M946L6898N4859
$$ -49586 -118932 -133834 -113594 -100388 -41682 -39099 -14398 -20489 -25211 -20265 16633 71492
14093G1492j5766n0780k7486o2189n0531J6581J3526R5496Q7152l903L160L669
$$ 71492 55726 4946 -22540 -84729 -135260 -118679 -105153 -9657 77495 73592 76752 80421
14081H0421o3127j3045J11984r9539j40981j021L6438j875l5438L4657O4302m673
$$ 80421 17294 4249 116233 16694 -124287 -125308 -88870 -90745 -126183 -91526 -27224 -31897
14069c1897Q3219K3262K0566L6829n1513k4186r4532o9695O5218N9575j5663p1
$$ -31897 51322 74584 95150 131979 80466 56280 -38252 -107947 -42729 16846 1183 1112
14057A112o7432k6491p312j2035j4184J01154M5939M3923p7928j38496m5103J8494
$$ 1112 -66320 -92811 -100123 -112158 -126342 -25188 20751 64674 -13254 -151750 -196853 -178359
14045a78359k0483l3395O9263K9395O9752N5581l6807Q3158k109m2885K4792l0991
$$ -178359 -198842 -232237 -162974 -133579 -63827 -8246 -45053 38105 35996 -6889 17903 -13088
14033a3088Q7702Q516K8528R726M2792o6114j12967o7014R00J590J4634K4430
$$ -13088 74614 83130 111658 121384 164176 98062 -14905 -81919 -81019 -79429 -64795 -40365
14021d0365O2517J0615j1684q523l7277l7132L79O5545P8557r5768o7134K0888
$$ -40365 22152 32767 21083 12560 -24717 -61849 -61470 4075 82632 -13136 -80270 -59382
14009e9382j527m112o6002q3905L3568J7657K662j0467l0716J6795K1723K8689
$$ -59382 -60909 -65021 -131023 -214928 -181360 -163703 -161041 -171508 -202224 -185429 -163706 -135017
13997a35017P2506j3754O9270K5174J7477N758L1008n0381l2223O589n0543L4352
$$ -135017 -62511 -76265 -6995 18179 35656 41414 72422 22041 -10182 -3593 -54136 -19784
13985a9784j6551O9257J47967k8037q6343j12366m2549m494l2130O1346K1956
$$ -19784 -36335 32922 180889 152852 66509 -45857 -88406 -92900 -125030 -63684 -41728
13974d1728r2101j515J22939o3576Q8816J6830k5395k5285j59822q867K6029Q878
$$ -41728 -133829 -135344 -12405 -75981 12835 29665 4270 -21015 -180837 -189704 -163675 -154797
13962a54797P0084O805k984J7180p9266p7272N928N1108M1796J849R0913K6493
$$ -154797 -84713 -77908 -80892 -63712 -142978 -220250 -214322 -163214 -121418 -119569 -28656 -2163
13950b163K8541J6820j9693J2237n4039k4083O3227K0826k8845m5653M842Q026
$$ -2163 26378 43198 23505 35742 -18297 -42380 20847 41673 12828 -32825 -27983 -19957
13938a9957P3949J3621k9663m4109L0670K8878K1043j05197n2345O595M6272O6143
$$ -19957 53992 67613 37950 -6159 24511 53389 74432 -30765 -83110 -76515 -30243 35900
13926C5900J4499K366N2549k5226j29926r8653l9094N3576P2374M5532l868O3612
$$ 35900 50399 52765 105314 80088 -49838 -148491 -187585 -134009 -61635 -16103 -19971 43641
13914D3641M4926o8898n3172R423J0353N3692J2021P0430J1285j06648l6726M3708
$$ 43641 88567 19669 -33503 -24080 -13727 39965 51986 122416 133701 27053 -9673 34035
13902C4035j8360l8750K4174J4971n3198n182l735M4831J4674M4086R355R4622
$$ 34035 15675 -23075 1099 16070 -37128 -42310 -46045 -1214 13460 57546 66901 161523
13890A61523m0312l2529n0257k1312o403n8797m7376j07237J0285O5298J1371
$$ 161523 121211 88682 38425 17113 10710 -48087 -95463 -202700 -192415 -127117 -115746
13879a15746p225J148J21349L4561m703l527L7759o0759o5215K4122L0316O7447
$$ -115746 -122971 -121823 -474 34087 29384 25857 63616 2857 -62358 -38236 -7920 59527
13867E9527N7728k295j22531K534O9962L0795O4266P400q2631j64696l6985J26444
$$ 59527 117255 114960 -7571 -5037 64925 95720 159986 167386 84755 -79941 -116926 9518
13855I518M0283k7683l2587P491o9463j0847k5177J62059P7144J7062p442k4531
$$ 9518 49801 22118 -10469 -2978 -72441 -83288 -108465 53594 130738 147800 140358 115827
13843A15827j8014k0546m2114K8169m8412Q148N7089j6975j9408m5101m2123L7998
$$ 115827 97813 77267 35153 63322 14910 23058 80147 63172 43764 -1337 -43460 -5462
13831e462L6805j03715o1880k0179J2001N5826J0257j6707N6812m1137r6474M8304
$$ -5462 31343 -72372 -134252 -154431 -142430 -86604 -76347 -93054 -36242 -77379 -173853 -125549
13819a25549J07459k8118r9583K4615O5381k6757O705J57391N0792m3421j38932
$$ -125549 -18090 -46208 -145791 -121176 -55795 -82552 -75847 81544 132336 88915 -50017
13808e0017m4656P168Q478j7506J9610k4709J9439O1440L115n4949l7987j0573
$$ -50017 -94673 -87505 -79027 -96533 -76923 -101632 -82193 -20753 -17638 -72587 -110574 -121147
13796a21147J2167J1247m024L4679n180K9571P8698m1215j36649K1540Q2492j09612
$$ -121147 -108980 -97733 -101757 -67078 -72258 -42687 36011 -5204 -141853 -120313 -37821 -147433
13784a47433l7633K6129j0196M4161K0108P5976N2820p9661n218J6309j9637q5236
$$ -147433 -185066 -158937 -169133 -124972 -104864 -28888 23932 -55729 -60947 -44638 -64275 -149511
13772a49511p3723O2935J28289M3366k2710j12j6022m7165j0956J9275j3616K4274
$$ -149511 -223234 -160299 -32010 11356 -11354 -11466 -27488 -74653 -85609 -66334 -79950 -55676
13760e5676j6617j6383L1341N878m0555p9139J7260J18088J06184l3061l2696
$$ -55676 -72293 -88676 -57335 -51457 -92012 -171151 -153891 -35803 70381 37320 4624
13749D624N8048L9698o5771m5547p9001n2415q557O9094M2692O1451j1678p9615
$$ 4624 62672 102370 36599 -8948 -87949 -140364 -148921 -79827 -37135 24316 12638 -66977
13737f6977P326J2131j9834R8132r9320j03953M1898P1215O5630l7696q7845r3524
$$ -66977 -59651 -47520 -67354 30778 -68542 -172495 -130597 -59382 6248 -31448 -119293 -212817
13725b12817j8815N8250O130j5599L1597J26634L8446N3895m540j27603n193J2211
$$ -212817 -231632 -173382 -167252 -182851 -151254 -24620 13826 67721 63181 -64422 -69615 -57404
13713e7404N4318k1017Q9014O5572l154j01341l2743K8828L2665l5427O850K0822
$$ -57404 -3086 -24103 64911 130483 127329 25988 -6755 22073 54738 19311 26161 46983
13701D6983r9308M2692l0557r6524J618K9402M057N2508K6525L1765n6856l071
$$ 46983 -52325 -9633 -40190 -136714 -135096 -105694 -101637 -49129 -22604 9161 -47695 -50766
13689e0766j04731r3656p5824j7265M5344N8471J3282J05779O4034k3229o4417
$$ -50766 -155497 -249153 -324977 -342242 -296898 -238427 -225145 -119366 -55332 -78561 -142978
13678a42978k5369O7909N718j06451K8367J21538O2159m8792q2369M4726R1703
$$ -142978 -168347 -100438 -94720 -201171 -172804 -51266 10893 -37899 -120268 -75542 16161
13667A6161K9065k9430p0790j30481k6137P2142N0273K4038L8083P6435O303n1257
$$ 16161 45226 15796 -54994 -185475 -211612 -139470 -89197 -65159 -27076 49359 55662 4405
13655D405k5192K3415p8870K2192L4032k6078J2768N3306J6635Q653L5609j4676
$$ 4405 -20787 2628 -76242 -54050 -20018 -46096 -33328 19978 36613 45266 80875 66199
13643F6199n7424J3339M7562l9661q5432k7137k7885k4815j9110M3610o5500k532
$$ 66199 8775 22114 69676 30015 -55417 -82554 -110439 -135254 -154364 -110754 -176254 -178786
13631a78786J37141K1504O6442L5863L3495q2085m3810K4964k5526L6947J5997
$$ -178786 -41645 -20141 46301 82164 115659 33574 -10236 14728 -10798 26149 42146
13620D2146J0894m3074J4557j4425q7742p4361M0210R8755M8070m8961M5136L1277
$$ 42146 53040 9966 24523 10098 -77644 -152005 -111795 -13040 35030 -13931 31205 62482
13608F2482l1692P6548Q2445j04990n4855q180j3354N3823K9512p8775L1891K5800
$$ 62482 30790 107338 189783 84793 29938 21758 8404 62227 91739 12964 44855 70655
13596G0655L31J7673n4532o2656n8561n722M3350R3849L8837K0563K9773L1943
$$ 70655 70986 88659 34127 -28529 -87090 -92812 -49462 44387 83224 103787 133560 165503
13584A65503l7481p2334J5858N2781p931q3891K5651P1483L6681n3216j7338m6614
$$ 165503 128022 55688 71546 124327 116396 32505 58156 129639 166320 113104 95766 49152
13572D9152O823q655k4115k3327Q9652k0538k956k3208P0344M8590L5207m6564
$$ 49152 55975 47320 23205 -122 89530 68992 66036 42828 113172 161762 196969 150405
13560A50405r4301l3870R925r6690n0731q411j0278K9978J74863J44220K3854
$$ 150405 56104 22234 32159 -64531 -115262 -123673 -133951 -103973 70890 215110 238964
13549B38964n5753p2670p2782j0091m1658q6512o5447M4065J87483M8488q6606
$$ 238964 183211 110541 37759 27668 -13990 -100502 -165949 -121884 65599 114087 27481
13538B7481n5609k7694J677k0964q479k0547o1619K7291k353j4037O6993Q7765
$$ 27481 -28128 -55822 -54145 -75109 -83588 -104135 -165754 -138463 -140816 -154853 -87860 -95
13526i5M4976p1508p9364J31837J08537k9804k7657l7293k9811P545M8866J05360
$$ -95 44881 -26627 -105991 25846 134383 104579 76922 39629 9818 17363 66229 171589
13514A71589r109q8139j09717l1127k0101n770N6323K9562O8413O9530R19k1209
$$ 171589 162480 74341 -35376 -66503 -86604 -92374 -36051 -6489 61924 131454 132373 111164
13502A11164j24005k42j1770r1970J1262N338K6791K3827k5388K0545L8125J5015
$$ 111164 -12841 -13083 -24853 -116823 -105561 -100223 -73432 -49605 -74993 -54448 -16323 -1308
13490a308l1893o3037N985Q576l2364M2935P785P153L1073J7199l3667j02604
$$ -1308 -33201 -96238 -90253 -81677 -114041 -71106 -63321 -56168 -25095 -7896 -41563 -144167
13478a44167K1320K9661L8860p884p1620n5744J9299N1479P4026L0072K3400l2087
$$ -144167 -122847 -93186 -54326 -62210 -133830 -189574 -170275 -118796 -44770 -14698 8702 -23385
13466b3385m9061r5597L6702j8801j8506M7337P7238N0713L8730N4553l0976l7121
$$ -23385 -72446 -168043 -131341 -150142 -168648 -121311 -44073 6640 45370 99923 68947 31826
13454C1826K9811L6413J0294j9501j9033n1783K0398O792Q2174O0119j53079l1873
$$ 31826 61637 98050 108344 88843 69810 18027 38425 45217 127391 187510 34431 2558
13442B558K0662N8308J9782J2387K5502r98j13057j7491k6791j3851o7481n3071
$$ 2558 23220 81528 101310 113697 139199 138201 25144 7653 -19138 -32989 -100470 -153541
13430a53541j2963L4179P4541l9887L291k9810J0721K9285j5900n1327k8653J1210
$$ -153541 -166504 -132325 -57784 -97671 -94380 -124190 -113469 -84184 -100084 -151411 -180064 -168854
13418a68854J0998K3873J14732J7815k4292L8911P9128J5668j1248n5816l4987
$$ -168854 -157856 -133983 -19251 -1436 -25728 13183 92311 107979 96731 40915 5928
13407E928o4954p9298r7919O0322J08473O6726O2916J3205k0744j5229o860k1787
$$ 5928 -59026 -138324 -236243 -175921 -67448 -722 62194 75399 54655 39426 32566 10779
13395A0779p4895K3698J9904K484Q1750K2283j10044j0072J721m7252L8037M8056
$$ 10779 -64116 -40418 -20514 -18030 63720 86003 -24041 -34113 -32392 -79644 -41607 6449
13383F449K3238j57Q416k8216j24006L6965N8718q8463L0212M9267M0962J02307
$$ 6449 29687 29530 37946 9730 -114276 -77311 -18593 -107056 -76844 -27577 13385 115692
13371A15692m3276p1789L7837M8245M2248m864r5491j15745J689K5047l1278j8342
$$ 115692 72416 627 38464 86709 128957 124093 28602 -87143 -85454 -60407 -91685 -110027
13359a10027M3250K8423m7827j3131J076J3731l6739P7193J01057J4099o1413
$$ -110027 -66777 -38354 -86181 -99312 -98236 -84505 -121244 -44051 57006 71105 9692
13348I692J5877K54k4004j15608J5515Q0652p1259k2392L1786P6991K8590K1465
$$ 9692 25569 25823 1819 -113789 -98274 -17622 -88881 -111273 -79487 -2496 26094 47559
13336D7559N1191P8539K4399o5271q0318L0670M167r8201J168Q408k2206J3786
$$ 47559 98750 177289 201688 136417 56099 86769 90936 -7265 -6097 2311 -19895 -6109
13324f109K1542q4218n3614Q6665k6693L0145J0264j05116k4266M4991N8691O141
$$ -6109 15433 -68785 -122399 -35734 -62427 -32282 -22018 -127134 -151400 -106409 -47718 -41577
13312d1577j781J1178p1327J12298O9551l1227j0683K9339q8341q290m676N7560
$$ -41577 -43358 -32180 -103507 8791 78342 47115 36432 65771 -22570 -30860 -35536 22024
13300B2024M7781o5340j0703R073o4721k1887K5164J05447L3823n7518o2336J13707
$$ 22024 69805 4465 -6238 2835 -61886 -83773 -58609 46838 80661 23143 -39193 74514
13288G4514K4234o1929m6307p8869L1228P0442k590o1464N595J18617j7847m2695
$$ 74514 98748 36819 -9488 -88357 -57129 13313 10723 -50741 -45146 73471 55624 12929
13276A2929j5947M7519q3395o5035O7777R4078L6973M0210k1716J4179j4153K4265
$$ 12929 -3018 44501 -38894 -103929 -36152 57926 94899 135109 113393 127572 113419 137684
13264A37684j52667n6655J14757O5634j0497k4824l1546r0710l0496J3793N3827
$$ 137684 -14983 -71638 43119 108753 98256 73432 41886 -48824 -79320 -65527 -11700
13253a1700r273J9929O4530J2296j3427m5393N6110M8968K0795J7166l2864j26487
$$ -11700 -20973 -1044 63486 75782 62355 16962 73072 122040 142835 160001 127137 650
13241F50m2034L4758k6990Q0533L2058k9219r3865j11840L381M0629j8041k4757
$$ 650 -41384 -6626 -33616 46917 78975 49756 -44109 -155949 -152568 -111939 -129980 -154737
13229a54737M2904J06724j3384j4167L4748M7924M2641L7539o6111K5426q377
$$ -154737 -111833 -5109 -18493 -32660 2088 50012 92653 130192 64081 89507 81130
13218H1130q5862r984j04635n307N0955J0959j2357n4996P034O9548M6194n2583
$$ 81130 -4732 -14716 -119351 -124658 -73703 -62744 -75101 -130097 -123063 -53515 -7321 -59904
13206e9904j41072n0055Q5984q030r564M1134M902P8969m1589k5102K2055J30475
$$ -59904 -200976 -251031 -165047 -173077 -182641 -141507 -136605 -57636 -99225 -124327 -102272 28203
13194B8203P9265j081p4266J248K0522k180K6385m7077k2094j6947m9796r45N743
$$ 28203 107468 106387 32121 33369 53891 51711 78096 31019 8925 -8022 -57818 -58763 -53020
13181e3020O4553J27733O397n4189p570j27734o3109J5172Q3795m9465k0596J9098
$$ -53020 11533 139266 145663 91474 83904 -43830 -106939 -91767 -7972 -57437 -78033 -58935
13169e8935k0149J0669J0297L1656j9668m0910J5982L9378n1544L70k8841N2261
$$ -58935 -79084 -68415 -58118 -26462 -46130 -87040 -71058 -31680 -83224 -82854 -111695 -59434
13157e9434q048l0148J0409k0823J22518k9282l9333N1213Q0545o623o4776q0351
$$ -59434 -67482 -97630 -87221 -108044 14474 -14808 -54141 -2928 77617 70994 6218 -74133
13145g4133l2219k5468m5280K8960P461M4222J18350J1410l2114k8190m5612k7951
$$ -74133 -106352 -131820 -177100 -148140 -140679 -96457 21893 33303 1189 -27001 -72613 -100564
13133a00564j5750R4064N9678o6963R89R733j1365P1M3352O7813O2341k0651j6370
$$ -100564 -116314 -22250 37428 -29535 -28546 -18813 -30178 -30107 13245 81058 143399 122748 106378
13120A06378p0395o3537j9028L8076l2589o0260O7259L6023p871k0504o7909O9348
$$ 106378 35983 -27554 -46582 -8506 -41095 -101355 -34096 1927 -5944 -26448 -94357 -25009
13108b5009M0117K6899K9196q650q2348k583N0517L3580o8726o588P0173n3199
$$ -25009 15108 42007 71203 62553 -19795 -22378 28139 61719 -7007 -13595 56578 3379
13096C379N604O6235N7951q7265l3860J5100N319m5942l044O0494k9399o2850
$$ 3379 8983 75218 133169 45904 12044 27144 32463 -13479 -16523 43971 14572 -48278
13084d8278r3122n6440J2085R9958J05251j5015n9665K3577P0031M5001J4495
$$ -48278 -141400 -197840 -185755 -85797 19454 4439 -55226 -31649 38382 83383 97878
13073I7878l8196j0537K3170J3899K397L5584j0421p6847L3649n1760n1975m9944
$$ 97878 59682 49145 72315 86214 88611 124195 113774 36927 70576 18816 -33159 -83103
13061h3103l8482R0661J7121k2478j5129q5211K8389M1049J6326N1437K4834L234
$$ -83103 -121585 -30924 -13803 -36281 -51410 -136621 -108232 -67183 -50857 580 25414 28648
13049B8648K2642n2310m04N290l3138m9212n8750O4863J4386J1312J909k0526
$$ 28648 51290 -1020 -1424 3866 -29272 -78484 -137234 -72371 -57985 -46673 -44764 -65290
13037f5290p2097m9105P4998J42475j7997j2239M3825L4009o1463L766n3690q679
$$ -65290 -137387 -186492 -111494 30981 12984 745 44570 78579 17116 20882 -32808 -41487
13025d1487M3090k7126P2030o6179M2175J00875J3071q6978o0904j03309J8298
$$ -41487 1603 -25523 46507 -19672 22503 123378 136449 49471 -11433 -114742 -96444
13014i6444P3731r109j9126N3016L3964P5975k5458j55318N5007J7484k7413O3859
$$ -96444 -22713 -31822 -50948 2068 36032 112007 86549 -68769 -13762 3722 -23691 40168
13002D0168L2614q3808o5674K303K8659m3919P36J8932M6075J6552l2646k290
$$ 40168 72782 -11026 -76700 -74397 -45738 -89657 -88921 -69989 -23914 -7362 -40008 -42298
12990d2298j9084m1817j6837N5388m3114k089k1946O9876K5236r1532n0284p0285
$$ -42298 -61382 -103199 -120036 -64648 -107762 -109851 -131797 -61921 -36685 -128217 -178501 -248786
12978b48786k1392L2767M1911o451L8932N7011M8749j3860M4271K1486k8794R652
$$ -248786 -270178 -237411 -195500 -201951 -163019 -106008 -57259 -71119 -26848 -5362 -34156 -24504
12966b4504q2601Q899o9471l7597q6446n0619J35653M8502N505N6646K9890J42789
$$ -24504 -107105 -98206 -167677 -205274 -291720 -342339 -206686 -158184 -152679 -96033 -66143 76646
12954G6646R566j47706j8972L6834o769l6137J8357N0565K5242q1893L4203l118
$$ 76646 86212 -61494 -80466 -43632 -50401 -86538 -68181 -17616 7626 -74267 -40064 -43182
12942d3182P4182N6166J2730j9824L2267k7215q4840n1411N6915K0528n2982j325
$$ -43182 31000 87166 99896 80072 112339 85124 284 -51127 5788 26316 -26666 -27991
12930b7991j3309J0617O9635j3916J6959J7876K1178n969j2765j6622p5261M3559
$$ -27991 -41300 -30683 38952 25036 41995 59871 81049 75080 62315 45693 -29568 13991
12918A3991J14393n361n2155L6132m6798j67799L3872M6484M684j3001J431k3822
$$ 13991 128384 123023 70868 107000 60202 -107597 -73725 -27241 -22557 -35558 -34127 -57949
12906e7949k1277M7611J400P3728L5153k1235j34429n4421R4454L2477R4179M8575
$$ -57949 -79226 -31615 -30215 43513 78666 57431 -76998 -131419 -36965 -4488 89691 138266
12894A38266O9294p0704n5617J3404m0398M772k8111k6217l032L2640Q1590N4722
$$ 138266 207560 136856 81239 94643 54245 59017 30906 4689 1657 34297 115887 170609
12882A70609k3041K3645j44381o8826Q598K4949m9732N3327J31696J640o8129
$$ 170609 147568 171213 26832 -41994 -33396 -8447 -58179 -4852 126844 128484 60355
12871F0355l0749K2449L5318N6713o5498q0546j28143P782Q5374R757n4626K0967
$$ 60355 29606 52055 87373 144086 78588 -1958 -130101 -122319 -36945 -27188 -81814 -60847
12859f0847l2751L44N5258M2100M5941L2058j3286j745l7020j37258m9186N5297
$$ -60847 -93598 -93254 -37996 4104 50045 82103 68817 67072 30052 -107206 -156392 -101095
12847a01095O4385R0304j418m9292q7716q1918o2065M7921J14366O9972O2425
$$ -101095 -36710 53594 52176 2884 -84832 -166750 -228815 -180894 -66528 3444 65869
12836F5869n2803J5640p4976o3718M7391P8334k7742j16358n8198N7173M1816
$$ 65869 13066 28706 -46270 -109988 -62597 15737 -12005 -128363 -186561 -129388 -87572
12825h7572N5986Q4137l8608r1733M4156K7195j2252L5747R111l443R2285l0981
$$ -87572 -31586 52551 13943 -77790 -33634 -6439 -18691 17056 26167 22724 115009 84028
12813H4028m5351q671M8188j07955r4183M0237J26798M6903p0608l0395J704K6156
$$ 84028 38677 30006 78194 -29761 -123944 -83707 43091 89994 19386 -11009 -9305 16851
12801A6851J2966n2305M1711J6489L3593l2497o8603L3550K97n100J1039L8650
$$ 16851 29817 -22488 19223 35712 69305 36808 -31795 1755 2052 -3048 7991 46641
12789D6641J04982k0767j6664n2960J072l0171r2932m9842R1372J0149o5766m6419
$$ 46641 151623 130856 114192 61232 62304 32133 -60799 -110641 -19269 -9120 -74886 -121305
12777a21305P325R6229M1105K3799j7901k0259L9548R3711r0599q1129l750l4373
$$ -121305 -113980 -17751 23354 47153 29252 8993 48541 142252 51653 -29476 -33226 -67599
12765f7599K6949O7849R806l1424m5091j03544l8677P6083J36351J00017p0090
$$ -67599 -40650 27199 37005 5581 -39510 -143054 -181731 -105648 30703 130720 60630
12754F0630n9781N133P9497j5354L3710J09601l0366j5629r199j6958p7074P677
$$ 60630 849 5982 85479 70125 103835 213436 183070 167441 158242 141284 64210 71887
12742G1887L4264O854k7313j3029n7469J3685q141j15335M8885J03912O3345P515
$$ 71887 106151 113005 85692 72663 15194 28879 20738 -94597 -45712 58200 121545 129060
12730A29060o7208l4304K6778n1232j4785M6290K8534J260m7178K6775l9924J2501
$$ 129060 61852 27548 54326 3094 -11691 34599 63133 64393 17215 43990 4066 16567
12718A6567K0023j14911j5280L5715K1200K7144N2832J1653n2872q712l0437K7607
$$ 16567 36590 -78321 -93601 -57886 -36686 -9542 43290 54943 2071 -6641 -37078 -9471
12706i471J0891k896n1833m8077O0442J06000M0666L8739l2265l9780o8786n1646
$$ -9471 1420 -1476 -53309 -101386 -40944 65056 105722 144461 112196 72416 3630 -48016
12694d8016K6l7316J09598k0845k3394N4319M8644P0907q3627j3581l3932L0915
$$ -48016 -47990 -85306 24292 3447 -19947 34372 83016 153923 70296 56715 22783 53698
12682E3698R1190j610j7102k2740l053K4479p069q0716n0398J12091k1141p7607
$$ 53698 144888 143278 126176 103436 100383 124862 117793 37077 -13321 98770 77629 22
12670B2K7580J1688k160k093k5766Q461M5863n3124j02657k6921Q770N6033R0129
$$ 22 27602 39290 37130 35037 9271 17732 63595 10471 -92186 -119107 -110337 -54304 35825
12657C5825O4537k8176R89l0793l6174J0450M0355k3488n5309j9915m366L0734
$$ 35825 100362 72186 73175 42382 6208 16658 57013 33525 -21784 -41699 -46065 -15331
12645a5331M5646L7241j01561m9082N4756M5874J35168l1473j73331q4048r6648
$$ -15331 30315 67556 -34005 -83087 -28331 17543 152711 121238 -52093 -136141 -232789
12634b32789P73Q9182N5139k1639n4832M4831L2338N0806O1518m3028l0624P0287
$$ -232789 -232016 -142834 -87695 -109334 -164166 -119335 -86997 -36191 25327 -17701 -48325 21962
12622B1962k2474r2106j1952L6434N4051J5095L1987p3014k2884j1264k5469K3390
$$ 21962 -512 -92618 -104570 -68136 -14085 1010 32997 -40017 -62901 -74165 -99634 -76244
12610g6244M1894L8497j1044p848k1049N0556L536p7333m9288N2747P5651J7165
$$ -76244 -34350 4147 -6897 -14745 -35794 14762 18298 -59035 -108323 -55576 20075 37240
12598C7240K5366M1998Q449m7700j7538K5504o6210K2382j45221l1140J21248
$$ 37240 62606 104604 113053 65353 47815 73319 7109 29491 -115730 -146870 -25622
12587b5622L907K5304r940O0690N5506L3967P180p1639p2196K7535p4173l2865
$$ -25622 -21715 3589 -6351 54339 109845 143812 150992 79353 7157 34692 -39481 -72346
12575g2346O8225K7040m6371L8616k3898m9374k6491m2086o7294L5201O7798M6865
$$ -72346 -4121 22919 -23452 15164 -8734 -58108 -84599 -126685 -193979 -158778 -90980 -44115
12563d4115k343o4019K9269J10834K3966J6172j4791p3155m5345M6027N6600j3897
$$ -44115 -46458 -110477 -81208 29626 53592 69764 54973 -18182 -63527 -17500 39100 25203
12551B5203K6446j8096Q91K8479j12990r125Q7540O170N0393o4946m1998J28934
$$ 25203 51649 33553 34444 62923 -50067 -59192 28348 34518 84911 19965 -22033 106901
12539A06901j4032p3275p3706J00598L8042l9700j05158L6365K1761o7088k7160
$$ 106901 92869 19594 -54112 46486 84528 44828 -60330 -23965 -2204 -69292 -96452
12528i6452K3023j807J50582Q7821l8774o5069o4099j43198K6441O0184L8195
$$ -96452 -73429 -75236 75346 163167 124393 59324 -4775 -147973 -121532 -61348 -23153
12517b3153J8645l9695K186j284L3239l4650k0982k4113L3101j0076M2058R6930
$$ -23153 -4508 -44203 -42017 -43301 -10062 -44712 -65694 -89807 -56706 -66782 -24724 72206
12505G2206M9496q0528k4273O392k8717J7295k2920j0529J9815R3792K6152l2597
$$ 72206 121702 41174 16901 23293 -5424 11871 -11049 -21578 -1763 92029 118181 85584
12493H5584k6304K2879j6150l9752J7865l3354j2412M2124N3262K1249p2285j8183
$$ 85584 59280 82159 66009 26257 44122 10768 -1644 40480 93742 114991 42706 24523
12481B4523N249j4417J9753l615L5249n8033m4791J9385j8267o126J16571j765
$$ 24523 29772 15355 35108 31493 66742 8709 -36082 -16697 -34964 -41090 75481 73716
12469G3716l0470N310L9176K4460r8081J9798M792J0034O5730J3927k5070q3739
$$ 73716 43246 48556 87732 112192 14111 33909 38701 48735 114465 128392 103322 19583
12457A9583N33M2093K2221K5330o0684n6054k5072L7693N3119N46l36N6836j5591
$$ 19583 20116 62209 84430 109760 49076 -6978 -32050 5643 58762 59308 58972 115808 100217
12444A00217j6524j38167n5710L3328M4825J24577J1143j19105q9917K1330j062
$$ 100217 83693 -54474 -110184 -76856 -32031 92546 103689 -15416 -105333 -84003 -85065
12433h5065M1049Q3784p2539j3086K6390L6925M7847O3504o474J1855m1933j2443
$$ -85065 -44016 39768 -32771 -45857 -19467 17458 65305 128809 122335 134190 92257 79814
12421G9814M178l2846K5684o4472n9536q830k5063j2280l8528k4777J4293Q2600
$$ 79814 83992 51146 76830 12358 -47178 -56008 -81071 -93351 -131879 -156656 -142363 -59763
12409e9763k6273p3089p6J15216K4555N1188K0533L2699m9069j32M3649J6516
$$ -59763 -86036 -159125 -159201 -43985 -19430 31758 52291 84990 35921 35789 79438 95954
12397I5954j5312j7439o9795J6395n620M5890p3890l4647L8549k9641m0028J8153
$$ 95954 80642 63203 -6592 9803 4183 50073 -23817 -58464 -19915 -49556 -89584 -71431
12385g1431R7853M854m7649n7470Q206L0976o271Q0537P9123l667l3467l5756
$$ -71431 26422 31276 -16373 -73843 -65637 -34661 -40932 39605 118728 115061 81594 45838
12373D5838o7683J0054J7413m5452l7733K4730Q6744J19739J1487j48811r5520
$$ 45838 -21845 -11791 5622 -39830 -77563 -52833 33911 153650 165137 16326 -79194
12362g9194l5313L7286P8115n9767J1842K8j4704M975J05818o8914j0907M0054
$$ -79194 -114507 -77221 894 -58873 -47031 -47003 -61707 -56732 49086 -19828 -30735 9319
12350I319N3271n5479q8147p403p3093Q1540Q3943J6979k141n7812J16236M1184
$$ 9319 62590 7111 -81036 -88439 -161532 -79992 3951 20930 18789 -39023 77213 118397
12338A18397j0817j17234o1378k4802O9577j0070j235m9747p5490L6403J05624
$$ 118397 107580 -9654 -71032 -95834 -26257 -36327 -37562 -87309 -162799 -126396 -20772
12327b0772K9810n9173J5920j4796P39l032r6056j1111J57144k5328q423O9491
$$ -20772 9038 -50135 -34215 -49011 -48272 -51304 -147360 -158471 -1327 -26655 -35078 34413
12315C4413M9726m089n980j08555o7623K4507N3640j8392k9778J13848P0589j4169
$$ 34413 84139 80050 74070 -34485 -102108 -77601 -23961 -42353 -72131 41717 112306 98137
12303I8137o8594l0498k1134l1064J11556k7672p1690m8051k2732Q5141m4385
$$ 98137 29543 -955 -22089 -53153 58403 30731 -40959 -89010 -111742 -26601 -70986
12292g0986J5400J04504N3105j297k0202l8751P402r625J0980Q8238K9812n9760
$$ -70986 -55586 48918 102023 100726 80524 41773 49175 39550 50530 138768 168580 108820
12280A08820r814J6721l1016k528Q3469k9180n6623Q9597R3613m3828p5849J3764
$$ 108820 99006 115727 84711 82183 165652 136472 79849 169446 263059 219231 143382 157146
12268A57146k7276k8034J1495N3908k8938j4964j7536L0154J9190J9770J4192
$$ 157146 129870 101836 113331 167239 138301 123337 105801 135955 155145 174915 189107
12257A89107j20395M7603K7618k9280o486l6911J6029P346k599j9955N2282p0305
$$ 189107 68712 116315 143933 114653 108167 71256 87285 94631 92032 72077 124359 54054
12245E4054J9362J05795N7742j9628j02584j78640q9503j0973q4471J8993J30396
$$ 54054 73416 179211 236953 217325 114741 -63899 -153402 -164375 -248846 -229853 -99457
12234i9457M9022M473M6066j0124Q6271K5308o1497l0997J15085k9886q9621q962
$$ -99457 -50435 -45962 104 -10020 76251 101559 40062 9065 124150 94264 4643 -4319
12222d319j2581o3015k3953N4020R650L8865L4557j5213l1426m2956k3245O6599
$$ -4319 -16900 -79915 -103868 -49848 -40198 -1333 33224 18011 -13415 -56371 -79616 -13017
12210a3017Q5446R8930M5823J10247P1230o7405Q0494Q8810k2058n9800K9371
$$ -13017 72429 171359 217182 327429 398659 331254 411748 500558 478500 418700 448071
12199D48071n3201o8418K9323l1472p6845j0484N8535M2608O751j7300r0327J4415
$$ 448071 394870 326452 355775 324303 247458 236974 295509 338117 344868 327568 237241 251656
12187B51656j1616M0614J2645K9324m0863r9520P438k9125l1487j9339M0504K0108
$$ 251656 240040 280654 293299 322623 281760 182240 189678 160553 129066 109727 150231 170339
12175A70339K353m6520j961n42O7217J3583n7112l6995p6009K9971P4892L8090
$$ 170339 172692 126172 124211 123669 190886 204469 147357 110362 34353 64324 139216 177306
12163A77306m9343K5914P9077k2574l539j274J2456l1067j4884M6087k0780j9874
$$ 177306 127963 153877 232954 210380 206841 205567 218023 186956 172072 218159 197379 177505
12151A77505J6814Q0815p930j3635q1691K3326O5535n4036L321Q3282j8950j00977
$$ 177505 194319 275134 267204 253569 171878 195204 260739 206703 210024 293306 274356 173379
12139A73379m5394R2042K4176j2346p478L7368J1158M6745L1419o3876j7371P990
$$ 173379 127985 220027 244203 231857 224379 261747 272905 319650 351069 287193 269822 277812
12127B77812l945J8186Q6033J27105l2025r4227o3272o7863k7833N7954O4192
$$ 277812 273867 292053 378086 505191 473166 378939 315667 247804 219971 277925 342117
12116C42117J1085p8463j5642r215o6163m3212J8996O5139p756K4909N8696m1646
$$ 342117 353202 274739 259097 249882 183719 140507 159503 224642 216886 241795 300491 258845
12104B58845Q1468P3736l8468K1093p8288j07557k9756R2460l3018n5960M7623
$$ 258845 340313 414049 375581 396674 318386 210829 181073 273533 240515 184555 232178
12093B32178J5352R1855R2918M183N800J9226K5749m0324k2544M4906O0435J7985
$$ 232178 247530 339385 432303 436486 442286 461512 487261 446937 424393 469299 529734 547719
12081E47719L605q741j0774Q6950P9680K8071L9994L418n8624j01611j16309k2462
$$ 547719 551324 542583 531809 618759 698439 726510 766504 769922 711298 609687 493378 470916
12069D70916R8283j8748k739j4628o9270J8599N8743P7608l548o4603j7621L8183
$$ 470916 569199 550451 547712 533084 463814 482413 541156 618764 615216 550613 532992 571175
12057E71175j07j4973N8498k1889k8598j3434p443J7989J27750K4875j6607K9170
$$ 571175 571068 556095 614593 592704 564106 550672 543229 561218 688968 713843 697236 726406
12045G26406L7435L0143k518N1619n79K3507Q700n6965j31666K2633J73684J09118
$$ 726406 763841 793984 791466 843085 842506 866013 874713 817748 686082 708715 882399 991517
12033I91517n7993N221k3841l5627L6297J18270J32362p163r2332N5168R3310
$$ 991517 933524 938745 914904 879277 915574 1033844 1166206 1159043 1066711 1121879 1215189
12022A215189L3510K201Q9255Q666j0176J42469K5279j02535j5487J00498Q9868
$$ 1215189 1248699 1250900 1340155 1348821 1338645 1481114 1506393 1403858 1388371 1488869 1578737
12011A578737P8792N6370O6769L6867J25031J77352O1587L0304K9591J24542J37462
$$ 1578737 1657529 1713899 1780668 1817535 1942566 2119918 2181505 2211809 2241400 2365942 2503404
12000B503404R7020l3908J8613R0132O6134J17471J34604J24093J67932J98015
$$ 2503404 2600424 2566516 2585129 2675261 2741395 2858866 2993470 3117563 3285495 3483510
11990C483510J65606J29133K22699K80063K18890K07477L76223L82318L37356
$$ 3483510 3649116 3778249 4000948 4281011 4499901 4707378 5083601 5465919 5803275
11981E803275L57716L25496L55349N50581N72461M84784M54385O06719P31156
$$ 5803275 6160991 6486487 6841836 7392417 7964878 8449662 8904047 9510766 10241922
11972A0241922Q88595R93715J143074J262535J389991J634990J973463K308471
$$ 10241922 11130517 12124232 13267306 14529841 15919832 17554822 19528285 21836756
11964B1836756K677276L184805L864434M571711N599626P205859R222190J1751888
$$ 21836756 24514032 27698837 31563271 36134982 41734608 48940467 58162657 69914545
11956F9914545J5137061J9526777K4875190L0352980L4373136L5671762L3101093
$$ 69914545 85051606 104578383 129453573 159806553 194179689 229851451 262952544
11949B62952544K5516705J2108689o509893k5319979l7353729m0054018l6154380
$$ 262952544 288469249 300577938 294068045 268748066 231394337 191340319 155185939
11942A55185939k9598579k3022821j7631549j3636960j0658795q286351o649611
$$ 155185939 125587360 102564539 84932990 71296030 60637235 52350884 45701273
11935D5701273n460603m500527l786946l181034k742497k325567j846833j641740
$$ 45701273 40240670 35740143 31953197 28772163 26029666 23704099 21857266 20215526
11927B0215526j595252j407141j194360j109967j016487q16043p62985p75587
$$ 20215526 18620274 17213133 16018773 14908806 13892319 13076276 12313291 11537704
11919A1537704o50269n52978n23608n02186m11631l25968k95918l24656l60366
$$ 11537704 10887435 10334457 9810849 9308663 8897032 8571064 8275146 7950490 7590124
11910G590124k93268l89417l88352k11442j60401k39964l19215k75106j80783
$$ 7590124 7296856 6907439 6519087 6307645 6147244 5907280 5588065 5312959 5132176
11901E132176j28063k08347k82338j22380N752j03119j60791j90113k11025j60732
$$ 5132176 5004113 4795766 4513428 4391048 4396800 4293681 4132890 3942777 3731752 3571020
11891C571020r8846j56894j90891j82238j40314K1207P4336M3298q5133j57323
$$ 3571020 3472174 3315280 3124389 2942151 2801837 2823044 2897380 2940678 2855545 2698222
11881B698222j44685j31897m1408j9637j33132q7178r7508n2014m5353p6254L0075
$$ 2698222 2553537 2421640 2380232 2360595 2227463 2140285 2042777 1990763 1945410 1869156 1899231
11870A899231M313k6957q4335j4496m6921k8598l1686q9746j0522j9634o5838
$$ 1899231 1903544 1876587 1792252 1777756 1730835 1702237 1670551 1580805 1570283 1550649 1484811
11859A484811j13670p0498o966L5991n3930j9686j3712N1033P0693l9053j67082
$$ 1484811 1371141 1300643 1293677 1329668 1275738 1256052 1242340 1293373 1364066 1325013 1157931
11848A157931j56486N4029P6352m9453n9179m0708j15658m1570P1306l7153r8751
$$ 1157931 1001445 1055474 1131826 1082373 1023194 982486 866828 825258 896564 859411 760660
11837G60660L3688O7480M1916j793o0890j2039R5391M3228m2002j03555J3963
$$ 760660 794348 861828 903744 901951 841061 829022 924413 967641 925639 822084 836047
11826H36047O2347J55986k9281p4876J146j3492k4430k4129l7892j37643o2742
$$ 836047 898394 1054380 1025099 950223 951369 937877 913447 889318 851426 713783 651041
11815F51041j15830J8211O9023k9118k2226j0425m5368l8469J12101m4051j33913
$$ 651041 535211 553422 622445 593327 571101 560676 515308 476839 588940 544889 410976
11804D10976m4964L6006M8371L9012L2352M3060m8565j09726K8336P6762l633
$$ 410976 366012 402018 450389 489401 521753 564813 516248 406522 434858 511620 507987
11793E07987k2982r0459K7984r40O088O429j37659p006N7701k6045N2181R6871
$$ 507987 485005 394546 422530 421590 427678 434107 296448 289442 347143 321098 373279 470150
11781D70150J3156n527p8410J0890k6761k5879j5965o8974m1844O7507l3898n924
$$ 470150 483306 477779 399369 410259 383498 357619 341654 272680 230836 298343 264445 258521
11769B58521O0115P3354r60p9064n0295M9551k7306o1629n7740j669l0480o0970
$$ 258521 318636 391990 391030 311966 261671 311222 283916 222287 164547 162878 132398 71428
11757G1428Q5253J49558R914L4043n1652o5985m1694O3123K8592l2473M7937N0868
$$ 71428 156681 306239 316153 350196 298544 232559 190865 253988 282580 250107 298044 348912
11745C48912o095O403N5726M7500n2605j08935j3849J996j6138j8328J7788K8691
$$ 348912 342817 349220 404946 452446 399841 290906 277057 279053 262915 244587 262375 291066
11733B91066o0239O5575L119K430j3716k1172M2886K5824q9607j49745j1698j1221
$$ 291066 230827 296402 299521 301951 288235 267063 309949 335773 246166 96421 84723 73502
11721G3502P2738Q591m6109j8466Q4413j3092L5055j7288j4286l8167l0882L256
$$ 73502 146240 154831 108722 90256 174669 161577 196632 179344 165058 126891 96009 99265
11709I9265j2064L4531J9017k8330r5388l9624r012p5583K7612R4135J42127r851
$$ 99265 87201 121732 140749 112419 17031 -22593 -31605 -107188 -79576 14559 156686 146835
11697A46835m4008r6513J973k7570r612k3629J61381R2573K7597m7834o2513n4678
$$ 146835 102827 6314 8287 -19283 -28895 -52524 108857 201430 229027 181193 118680 64002
11685F4002o538M4959K7856o1075n5099O1857Q072K9442N0954n1895J107p939
$$ 64002 57464 102423 130279 69204 14105 75962 84034 113476 164430 112535 113642 105703
11673A05703q6812L7012J5783K7237n3600l0950R5031l651o7886j7507Q0693M9179
$$ 105703 18891 55903 71686 98923 45323 14373 109404 105753 37867 20360 101053 150232
11661A50232J7765M1630k3171n5368m0637n7330J8064M282j27781M6475R1149
$$ 150232 167997 209627 186456 131088 90451 33121 51185 55467 -72314 -25839 65310
11650F5310P8858l5732K2044J6477m3507m831m9077j03260K7608Q6500K9979j30826
$$ 65310 144168 108436 130480 146957 103450 98619 49542 -53718 -26110 60390 90369 -40457
11638d0457j6217J00785M0166k2730J4307K93P191J0166J0079j3147r158l9837
$$ -40457 -56674 44111 84277 61547 75854 76147 83338 93504 103583 90436 81278 41441
11626D1441n7522j16594M2341P5189L0437J4615M6403J8867j0507k4009n8947
$$ 41441 -16081 -132675 -90334 -15145 15292 29907 76310 95177 84670 60661 1714
11615A714j15465J9141L2589O8605r477o5602k2559M7751J15080l7543n7620m9188
$$ 1714 -113751 -94610 -62021 6584 -2893 -68495 -91054 -43303 71777 34234 -23386 -72574
11603g2574J9569l0513R1890J31618K9537M2735j1617m3866j1978N113p7842k0066
$$ -72574 -53005 -83518 8372 139990 169527 212262 200645 156779 144801 149914 72072 52006
11591E2006N1084m2474j0421M6726O2962o0703J733J990l39L7966m1535j35893
$$ 52006 103090 60616 50195 96921 159883 99180 100913 102903 102564 140530 98995 -36898
11579c6898m8189Q2245j03226l5551O1901L8249P4271M9859r5143q330L5864k7633
$$ -36898 -85087 -2842 -106068 -141619 -79718 -41469 32802 82661 -12482 -20812 15052 -12581
11567a2581J0912j6014J0894P4531J53407P4630M3206q1329o1053J5506j9618
$$ -12581 -1669 -17683 -6789 67742 221149 295779 338985 257656 196603 212109 192491
11556A92491n3999k5486q6853j6802m6594j04402K905R1583J25119R862m7758
$$ 192491 138492 113006 26153 9351 -37243 -141645 -138740 -47157 77962 87824 40066
11545D0066k5226r1868M74P1606j5809J4875p7504l6103j8303O1002R6661Q3783
$$ 40066 14840 -77028 -76554 -4948 -20757 -5882 -83386 -119489 -137792 -76790 19871 103654
11533A03654N6965j5156K2238K6944j9472M1852O031r7742K7789p9973k0353r7952
$$ 103654 160619 145463 167701 194645 175173 217025 223056 125314 153103 73130 52777 -45175
11521d5175k8940J6571R8747Q390J0414K8913q1498l5648K2525P485r5616l8654
$$ -45175 -74115 -57544 41203 49593 60007 88920 7422 -28226 -5701 1784 -93832 -132486
11509a32486Q3576J43102r0145m8640J14507K4485j31813k9894M8741K3908R4909
$$ -132486 -48910 94192 4047 -44593 69914 94399 -37414 -67308 -18567 5341 100250
11498A00250L0676n5478n200n7310o927L6908m8243q88K773K3457l0014k4914
$$ 100250 130926 75448 70248 12938 6011 42919 -5324 -6212 -3439 20018 -9996 -34910
11486c4910L3463l1079L7698K0400j6980KN6368Q5404Q11o3843j11554j09979
$$ -34910 -1447 -32526 5172 25572 8592 8594 64962 150366 151177 87334 -24220 -134199
11474a34199K8034P2952l0457l5722J7732O0105J11868N2489j462L6951o8708
$$ -134199 -106165 -33213 -63670 -99392 -81660 -21555 90313 142802 141340 178291 109583
11463A09583k7829r990l4724K909P1737K8124r9504j0282l4910o3223j5186R6784
$$ 109583 81754 71764 37040 39949 111686 139810 40306 30024 -4886 -68109 -83295 13489
11451A3489M2860m3550j3953J00193O0320j8534j8152L8778L1102N3380k7511
$$ 13489 56349 12799 -1154 99039 159359 140825 122673 161451 192553 245933 218422
11440B18422n2971p1753K7534N7212m1109N1324K4741R353n7955l7316n3679q0265
$$ 218422 165451 93698 121232 178444 137335 188659 213400 222753 164798 127482 73803 -6462
11428f462K239M3226n3096o1842P9870L3037P0578L0851p8840n7132j64100n3430
$$ -6462 -4223 39003 -14093 -75935 3935 36972 107550 138401 59561 2429 -161671 -215101
11416b15101N8144O695J8382R2411N1364K1272k3570K0934m0848r5096M9982L177
$$ -215101 -156957 -150262 -131880 -39469 11895 33167 9597 30531 -10317 -105413 -55431 -52254
11404e2254P1545K537r1072j81903p8330J11977J47956J22765j907J7837l423
$$ -52254 19291 21828 -69244 -251147 -329477 -217500 -69544 53221 51314 69151 65728
11393F5728l9401l2307m493k0989J508k971P5197r365j33680J01872R5575J6827
$$ 65728 26327 -5980 -10473 -31462 -29954 -32925 42272 32907 -100773 1099 96674 113501
11381A13501m1409j3662J1796Q0410n2124n2306K7588O4056J523N9661J5065o5201
$$ 113501 72092 58430 70226 150636 98512 46206 73794 137850 139373 199034 214099 148898
11369A48898q5955K9020q37j1429j35255q2312J6003k7821m0491L7984J05334
$$ 148898 62943 91963 91126 79697 -55558 -137870 -121867 -149688 -190179 -152195 -46861
11358d6861K288k7261l0357L9382Q754j9786K5387j0041M0385n8034J0741L0787
$$ -46861 -44573 -71834 -102191 -62809 -54055 -73841 -48454 -58495 -18110 -76144 -65403 -34616
11346c4616l0241O8628Q6380m5839r1961K6287K8246J6972K2525l8679m6291K0726
$$ -34616 -64857 3771 90151 44312 -47649 -21362 6884 23856 46381 7702 -38589 -17863
11334a7863N5604R3413J4884L7321K0837L4184j44923j50701J7098L107n1172
$$ -17863 37741 131154 146038 183359 204196 238380 93457 -57244 -40146 -37039 -88211
11323h8211J00640l602k14j4847J2486L6998R866o471O008o732N9040J5333R461
$$ -88211 12429 8827 8613 -6234 6252 43250 53116 46645 52653 45921 104961 120294 129755
11310A29755q4075m0410N3398j07353m9311j0446Q961R5659O2868j2818k9532
$$ 129755 45680 5270 58668 -48685 -97996 -108442 -99481 -3822 59046 46228 16696
11299A6696K3858k2587p9988L385P2621L1297K8404L0825P8292K6128K7799j4628
$$ 16696 40554 17967 -62021 -58636 13985 45282 73686 104511 182803 208931 236730 222102
11287B22102j749k5991n3204j4750K4517k2276p2255k5947O3356P097k841j0395
$$ 222102 220353 194362 141158 126408 150925 128649 56394 30447 93803 100900 98059 87664
11275H7664n7156p5456O569o5051J7033O7556P836N9273j3673k4062J1799J8552
$$ 87664 30508 -44948 -38379 -103430 -86397 -18841 -11005 48268 34595 10533 22332 40884
11263D0884j3487q5309O417j9000m775O5849M0805K3595m5282j3269q8432K5292
$$ 40884 27397 -57912 -51495 -70495 -75270 -9421 31384 54979 9697 -3572 -92004 -66712
11251f6712k608q544J0672L9650R8485J0856n765m25J0327l55n70m2934J0125
$$ -66712 -69320 -77864 -67192 -27542 70943 81799 76034 75609 85936 85581 85011 42077 52202
11238E2202j02846M9913M6459q5902l242N1295L5797l3512L630r561K3132J4527
$$ 52202 -50644 -731 45728 -40174 -43416 7879 43676 10164 13794 4233 27365 41892
11226D1892l5725K9445p533n3145M5636O1890p692m6302m1903l2848j0137L8164
$$ 41892 6167 35612 28079 -25066 20570 82460 74768 28466 -13437 -46285 -56422 -18258
11214a8258K0651l2986j6295l473L4962k0671J6570m0519K4646O1411M9566l2947
$$ -18258 2393 -30593 -46888 -50361 -15399 -36070 -19500 -60019 -35373 26038 75604 42657
11202D2657O781P654l5074L1574m0882j11712K5688K6202Q4333O995O183p108
$$ 42657 49438 57092 22018 53592 12710 -99002 -73314 -47112 37221 44216 50399 43291
11190D3291q428j9999N7195k8663o9336J00480j7861o1410p594K7451l1920p880
$$ 43291 34863 14864 72059 43396 -25940 74540 56679 -4731 -12325 15126 -16794 -24674
11178b4674L705J22133L4070P155j03868K1633J4546n9647o7204j9149K3339L4832
$$ -24674 -20969 101164 135234 142389 38521 60154 74700 15053 -52151 -71300 -47961 -13129
11166a3129n281k6859q2552j03700O5841J01444K4411j0795j2830k878R5614J19488
$$ -13129 -18410 -45269 -127821 -231521 -165680 -64236 -39825 -50620 -63450 -66328 29286 148774
11154A48774N4033n6803j01167j01203M2538j0794J1666o8399m5779K3513P2057
$$ 148774 202807 146004 44837 -56366 -13828 -24622 -12956 -81355 -127134 -103621 -31564
11143c1564M1656o8363K6766L6889K8153J4933Q0511K876J2466k2972p065Q577
$$ -31564 10092 -58271 -31505 5384 33537 48470 128981 131857 144323 121351 114286 122863
11131A22863P5276m2582p2287r38m4607R830o5007o7586O737L0252P0567o4596
$$ 122863 198139 155557 83270 82332 37725 47555 -17452 -85038 -78301 -48049 22518 -42078
11119d2078o2983M2217O2314R5250K6383n6497j8910l8686m671L1431m3044j01856
$$ -42078 -105061 -62844 -530 94720 121103 64606 45696 7010 2339 33770 -9274 -111130
11107a11130q5800K3333N9187Q1623m6323J2774J6761Q79R1208J45846O8226j07213
$$ -111130 -196930 -173597 -114410 -32787 -79110 -66336 -49575 -48696 42512 188358 256584 149371
11095A49371j25851l0277q6128L6711O1624N1754J3456l2897R025N7856m385N8987
$$ 149371 23520 -6757 -92885 -56174 5450 57204 70660 37763 46788 104644 100259 159246
11083A59246K904j51452j25391n090J06661l0424j00331l749L5691N4079O1835
$$ 159246 162150 10698 -114693 -119783 -13122 -43546 -143877 -147626 -111935 -57856 3979
11072C979K0402J4716k5433K4186K1423j0160R966m0612K9928N1040L1318m9463
$$ 3979 24381 39097 13664 37850 59273 49113 59079 18467 48395 99435 130753 81290
11060H1290j5470l4600M6167J4807N4322K8267k9444M9462N3379l2675J4656K4929
$$ 81290 65820 31220 77387 92194 146516 174783 145339 194801 248180 215505 230161 255090
11048B55090k000P450o6421n7966M0067R2969q483L8365L4263J20748m5460k5852
$$ 255090 253090 260540 194119 136153 176220 269189 260706 299071 333334 454082 408622 382770
11036C82770L5592K7781m7605J9671J6127k7503q6662J4751J11027O1707L4240
$$ 382770 418362 446143 398538 418209 434336 406833 320171 334922 445949 507656 541896
11025E41896K8667n5612n7679K2799J18524k4621j47737q3622K2542J21672K5262
$$ 541896 570563 514951 457272 480071 598595 573974 426237 342615 365157 486829 512091
11014E12091m796m3326M6541J04223r3808j18198k7343o3883k3040j11066L0822
$$ 512091 507295 463969 510510 614733 520925 402727 375384 311501 288461 177395 208217
11003B08217Q7199k540l3118M2250N2850l9810o1179Q279J0424J8071j18680j0426
$$ 208217 295416 292876 259758 302008 354858 315048 253869 262148 272572 290643 171963 161537
10991A61537J6926j15991m7198m335l9074N8351Q4771N9384j6076l926O0051n404
$$ 161537 178463 62472 15274 10939 -28135 30216 114987 174371 158295 154369 214420 209016
10979B09016l9776p8697m3675m7286K7644R8581j748k7931l4547j26380j00980
$$ 209016 169240 90543 46868 -418 27226 125807 124059 96128 61581 -64799 -165779
10968a65779R4008J01159m7004r61Q9516J11250q836j52907p0949O6672K3984
$$ -165779 -71771 29388 -17616 -18577 70939 182189 173353 20446 -50503 16169 40153
10957D0153M1218J2395O983J2172n0243n1416n4282L827Q8966j3218q2945l2868
$$ 40153 81371 93766 100749 112921 62678 11262 -43020 -39193 49773 36555 -46390 -79258
10945g9258m9246R8908K7465p6033j0801O6766P8486J3264O8116K29j1876J099
$$ -79258 -128504 -29596 -2131 -78164 -88965 -22199 56287 69551 137667 137896 126020 127119
10933A27119l1639M9942R4794M5306j01420q2581q5033q05p0728K6796O3049J57870
$$ 127119 95480 145422 240216 285522 184102 101521 16488 15683 -55045 -28249 34800 192670
10921A92670M5971j3224l3299L7733j02959o1368l4991L9493n0800o0779P1477
$$ 192670 238641 225417 192118 229851 126892 65524 30533 70026 19226 -41553 29924
10910B9924Q9637m9325L2250J0867m1651m4771N4834J09676M3920o2509j18209
$$ 29924 119561 70236 102486 113353 71702 26931 81765 191441 235361 172852 54643
10899E4643J0117Q1046q818p2272n7304q2554q1568l404J18893K3743N5803Q8446
$$ 54643 64760 145806 136988 64716 7412 -75142 -156710 -160114 -41221 -17478 38325 126771
10887A26771j8737J4984l4218l9339K6500j3362J5281n8523j9182J14388j7097
$$ 126771 108034 123018 88800 49461 75961 62599 77880 19357 175 114563 97466
10876I7466q65L880m3337j7825L741j7885K1025K2552r2389K7815J07252l4298
$$ 97466 96601 100481 57144 39319 43060 25175 46200 68752 -23637 4178 111430 77132
10864G7132p5676J7109Q8281m8535j4977M1546M0327n5675k0941l4111M9970O9907
$$ 77132 1456 18565 106846 58311 43334 84880 125207 69532 48591 14480 64450 134357
10852A34357O1223q950j8575Q596K6616R077O9301J4878j9834o5889m9846j8960
$$ 134357 195580 186630 168055 176651 203267 212344 281645 296523 276689 210800 160954 141994
10840A41994l2928Q247j65Q70q1060M9804L6969k2447m672J05499L9583o6886
$$ 141994 109066 117313 117148 118018 36958 86762 123731 101284 96612 202111 241694 174808
10828A74808j03606l4739m745n6296M8076K3616m9331m7299j07478J4361P5583
$$ 174808 71202 36463 31718 -24578 23498 47114 -2217 -49516 -156994 -142633 -67050
10817f7050R4383L7993j2716l0691J9936P553k6249l8787n7938j6759J09580M2710
$$ -67050 27333 65326 52610 21919 41855 49408 23159 -15628 -73566 -90325 19255 61965
10805F1965l6026O3797N3959L8276j74343p2215J20264P114j9219J36342J4144
$$ 61965 25939 89736 143695 181971 7628 -64587 55677 62791 43572 179914 194058
10794A94058p6996N9015O580j15837j35852o7351j5849L5764J71449J34380o2237
$$ 194058 117062 176077 182657 66820 -69032 -136383 -152232 -116468 54981 189361 127124
10783A27124K706J3100p6867n9220M9076J15064m9030L1146K092k9981m670j2392
$$ 127124 129830 142930 66063 6843 55919 170983 121953 153099 155191 125210 120540 108148
10771A08148K0729q833l9717r604R5126K8849k4364j7496n4626J7927m0574N3055
$$ 108148 128877 120044 80327 70723 165849 194698 170334 152838 98212 116139 75565 128620
10759A28620K4361m6456Q3853Q157m9020j4847j8306J7174p4154L7428P599J2645
$$ 128620 152981 106525 190378 198535 149515 134668 116362 133536 59382 96810 104409 117054
10747A17054P884k5516j182N1892J59J0885j0297P3906n10q915K9250r0350k2328
$$ 117054 124938 99422 98240 150132 150291 161176 150879 224785 224275 215360 244610 154260 131932
10734A31932N228J39126Q4230K070n1227n7749M294m6147L6357M102j7223N3766
$$ 131932 137160 276286 360516 362586 311359 253610 257904 211757 248114 252216 234993 288759
10722B88759R5205O5724p4535n0815M2351k326M0480k4498j1603O724j0896j4867
$$ 288759 383964 449688 375153 324338 366689 364363 404843 380345 368742 375466 364570 349703
10710C49703P0077k2j40669o1219N0744J097k1526N6054J6401j35938J5253P4760
$$ 349703 419780 419758 279089 217870 268614 269711 248185 304239 320640 184702 199955 274715
10698B74715l3806l1553J3436L5580j07192n346Q1885m7480m5370L2695P3785
$$ 274715 240909 209356 222792 258372 151180 145834 227719 180239 134869 167564 241349
10687B41349O5547J7325L5715l080l7011r1366p5237K0346j6524M5557K6211M540
$$ 241349 306896 324221 359936 356856 319845 228479 153242 173588 157064 202621 228832 233372
10675B33372J10120J09574m497n398J8723L8047j9655l7500K9133N7887k2498
$$ 233372 343492 453066 448569 443171 461894 499941 480286 442786 471919 529806 507308
10664E07308n5322N6184J10219N8186L1117O6644P0300L2583N3516N1223L1340
$$ 507308 451986 508170 618389 676575 707692 774336 844636 877219 930735 981958 1013298
10653A013298l0157K6319O937L5524k9212m4253O9343J52335J43295M2745O8054
$$ 1013298 983141 1009460 1016397 1051921 1022709 978456 1047799 1200134 1343429 1386174 1454228
10642A454228J19598Q5520J32002J26579J80333K13046L02494J85583L26737K94348
$$ 1454228 1573826 1659346 1791348 1917927 2098260 2311306 2613800 2799383 3126120 3420468
10632C420468L33756L90919M19803M66749Q35653R85790J132632J518850J926633
$$ 3420468 3754224 4145143 4564946 5031695 5867348 6853138 7985770 9504620 11431253
10623A1431253K579561L281048M159204M748159M685601M055515L064253J800748
$$ 11431253 14010814 17291862 21451066 26199225 30884826 34940341 38004594 39805342
10615C9805342N44238j24068p4255R46974K675622M836204P026804Q427364Q384392
$$ 39805342 40349580 40225512 40151257 41098231 43773853 48610057 55636861 64064225 72448617
10606G2448617O724284M139655J038816k121337m362886m107448j858596J551157
$$ 72448617 79172901 83312556 84351372 82230035 77867149 73759701 71901105 73452262
10598G3452262N133111Q353149R940789R216298O292332K156948k505772p277867
$$ 73452262 78585373 86938522 96879311 106095609 112387941 114544889 112039117 104761250
10590A04761250j0354679j0275524p507871l803877j04684K725746M046353L551241
$$ 104761250 94406571 84131047 76623176 72819299 72714615 75440361 79486714 83037955
10582H3037955J588618j335684m367627p310546q929378q401005o469528m042157
$$ 83037955 84626573 83290889 78923262 71612716 62683338 54282333 47812805 43770648
10574D3770648k040518m85102K59541N6124p75647k027857l305742m380104m886016
$$ 43770648 41730130 41245028 41504569 41560693 40785046 38757189 35451447 31071343 26185327
10565B6185327m672828l882438l132976k356312j755255j368739j029126o96616
$$ 26185327 21512499 17630061 14497085 12140773 10385518 9016779 7987653 7291037
10557G291037m65778m90363n25559n03547m71724k87552k82818l23135k59162
$$ 7291037 6825259 6334896 5809337 5305790 4834066 4546514 4263696 3940561 3681399
10548C681399k85188p4861j14254j35099j54392j36935n3998k6244j61356j50835
$$ 3681399 3396211 3321350 3207096 3071997 2917605 2780670 2726672 2700428 2539072 2388237
10538B388237j25468m0366p6757k6597j23290p1690j31096j18623O0477l1556
$$ 2388237 2262769 2222403 2145646 2119049 1995759 1924069 1792973 1674350 1734827 1703271
10528A703271j04374j14359Q890K9903l84r9962l0798M5906p7227o8153k912l0353
$$ 1703271 1598897 1484538 1493428 1523331 1522947 1422985 1392187 1438093 1360866 1292713 1289801 1259448
10516A259448j27977j41381o7257M7968M4582n8593m6954K3105K8041M1991r783
$$ 1259448 1131471 990090 922833 970801 1015383 956790 909836 932941 960982 1002973 993190
10505I93190j4787O4692p7045j12247k440r9965j07799n9606J489N8538J2041
$$ 993190 978403 1043095 966050 853803 851363 751398 643599 583993 585482 644020 656061
10494F56061L197j7189o3938l2520M7053K2860K8092r3649N1219n921o093l7975
$$ 656061 659258 642069 578131 545611 592664 615524 643616 549967 601186 595265 589172 551197
10482E51197M3266l0227L9329q603r0633o2032P943K7296p6255r2488j9923L6291
$$ 551197 594463 564236 603565 594962 504329 442297 450240 477536 401281 308793 288870 325161
10470C25161K2988o7814J0774N038L2281L9158L5647r4567k8444P1047m6639o0382
$$ 325161 348149 280335 291109 296147 328428 367586 403233 308666 280222 351269 304630 244248
10458B44248m1674J12433J7382l4265l0224L3804L2606P246k7164L5693J9521
$$ 244248 202574 315007 332389 298124 267900 301704 334310 341556 314392 350085 369606
10447C69606p1172p4745n9799k6903J0369L4939K3269l9000k7168K1711P9600
$$ 369606 298434 223689 163890 136987 147356 182295 205564 166564 139396 161107 240707
10436B40707m4243l7897M3812K4990k863r9542L2915P4184k1106L9855P4951m577
$$ 240707 196464 158567 202379 227369 224506 124964 157879 232063 210957 250812 325763 321186
10424C21186J2737o5682l8712j26342m7965K4363k1025k127j8962p3398q3784
$$ 321186 333923 268241 229529 103187 55222 79585 58560 56433 37471 -35927 -119711
10413a19711p7984J42365J18791O9713J9960k9074J294J8930m0488K7511j5274
$$ -119711 -197695 -55330 63461 133174 153134 124060 125354 144284 103796 131307 116033
10402A16033R4638L8729l7555m6434p3947j2167K4385P147j5248J0118l1587n6833
$$ 116033 210671 249400 211845 165411 91464 79297 103682 110829 95581 105699 74112 17279
10390A7279Q073P063Q1123O2675q7467L3819L5796j4702J798l0092k4969j830
$$ 17279 25352 32415 113538 176213 88746 122565 158361 143659 145457 115365 90396 88566
10378H8566N4989K1161L21K8508J6032J9875r2272l9455o1321q2949p196N8648
$$ 88566 143555 164716 165037 193545 209577 229452 137180 97725 36404 -46545 -53741 4907
10366D907M4714J070M1706Q4958Q619L7543M0674m59j13633r0216k7129O4655
$$ 4907 49621 50691 92397 177355 185974 223517 264191 263732 150099 59883 32754 97409
10354I7409N8377P0010o625m6211o6153l9216K8003M2508j5412j3760J0325k6347
$$ 97409 155786 225796 219171 172960 106807 67591 95594 138102 122690 108930 119255 92908
10342I2908P16J47394Q3044p7767j47675j6057n1790J6894k9941k2986K6923L8027
$$ 92908 93624 241018 324062 246295 98620 82563 30773 47667 17726 -5260 21663 59690
10330E9690J3957k592K0022K3028J04711O910k1950K4931p9294q6690j390N3240
$$ 59690 73647 71055 91077 114105 218816 225726 203776 228707 149413 62723 61333 114573
10318A14573J7928J3309j1271m4971j7059O9228R9373k8273n5438j00762m9516
$$ 114573 132501 145810 134539 89568 72509 141737 241110 212837 157399 56637 7121
10307G121N0322k0240q6763j4202P9443Q0998l3967r3695r559p781l2014N5225
$$ 7121 57443 37203 -49560 -63762 15681 96679 62712 -30983 -40542 -48323 -80337 -25112
10295b5112J05007o6409M14k6098K4001L829n8561j1906J5079M8125M5354l4336
$$ -25112 79895 13486 13900 -12198 11803 15632 -42929 -54835 -39756 8369 53723 19387
10283A9387K2584J9570n0566m4380K0568R759n3742r060o826N8241N1003L4208
$$ 19387 41971 61541 10975 -33405 -12837 -3078 -56820 -65880 -72706 -14465 36538 70746
10271G0746K4519j02110K9771m3695j9567j01526j6488J05250Q0357L673k4377
$$ 70746 95265 -6845 22926 -20769 -40336 -141862 -158350 -53100 27257 30930 6553
10260F553m5420K4358J9943j21838J738K9024m3629Q5926R728K3698k5212J03153
$$ 6553 -38867 -14509 5434 -116404 -114666 -85642 -129271 -43345 -33617 -9919 -35131 68022
10248F8022k5127j0732J1776L2228N9505l9225Q786O4182j9148p2607m2602l2779
$$ 68022 42895 32163 43939 76167 135672 96447 105233 169415 150267 77660 35058 2279
10236B279m726L0359r7215m6560K8275M0365k1839J6516P0171m3776K2466L1276
$$ 2279 -2447 27912 -69303 -115863 -87588 -47223 -69062 -52546 17625 -26151 -3685 27591
10224B7591l4143M2202K2199Q9349O9014J427j11891q2440k4319P0484J7595p0450
$$ 27591 -6552 35650 57849 147198 216212 217639 105748 23308 -1011 69473 87068 16618
10212A6618j31723P52L9229J2602j5447N4450l5925K3535J38750Q1233k9808q9588
$$ 16618 -115105 -114353 -75124 -62522 -77969 -23519 -59444 -35909 102841 184074 154266 64678
10200F4678r147j7086N6218N208m7183K9610j3886l5474O923J06235l2623m4953
$$ 64678 55531 38445 94663 99871 52688 82298 68412 32938 39861 146096 113473 68520
10188F8520N6024J7204l1406p8012j8561J07906R8285k6863K6216l8350L0932
$$ 68520 124544 141748 110342 32330 13769 121675 219960 193097 219313 180963 211895
10177B11895P4677K6301M932m9649L8145o707K6875L0418N6593J8837K594o2253
$$ 211895 286572 312873 317805 268156 306301 299594 326469 356887 413480 432317 434911 372658
10165C72658J187n0453p53P0601J52460L0528J0026K4425n4187M1952M7197m0654
$$ 372658 373845 323392 322639 393240 545700 576228 586254 610679 556492 598444 645641 604987
10153F04987p4065p4701k9753k2889K2380L5850j356M2571j09113M1727K7189
$$ 604987 530922 456221 426468 403579 425959 461809 460453 503024 393911 435638 462827
10142D62827l1105o3593j04929l6628Q9818o983j4154M2457r5177j5297P880j22660
$$ 462827 431722 368129 263200 226572 316390 309407 295253 337710 242533 227236 235116 112456
10130A12456n2113l0264m845N5668J2128q6156n2198M4118P6726M4425l8536o2097
$$ 112456 60343 30079 25234 80902 93030 6874 -45324 -1206 75520 119945 81409 19312
10118A9312n9174n5532K6571L9626M7182l5433K9903J22889K4450n3111n53L987
$$ 19312 -39862 -95394 -68823 -29197 17985 -17448 12455 135344 159794 106683 106130 110117
10106A10117p2273m9967n1583J2776O3895j3239j4253o43J606N077Q3758M4813
$$ 110117 37844 -12123 -63706 -50930 12965 -274 -14527 -15170 -13564 -8487 75271 120084
10094A20084m7882j715l5189l4391N9492l531p0652m0491M0457j0444l908O0443
$$ 120084 72202 70487 35298 907 60399 56868 -13784 -54275 -13818 -24262 -28170 32273
10082C2273j01089o0389P6992J4489l318P3896Q2966q793l7769K3626q7133j988
$$ 32273 -68816 -129205 -52213 -37724 -41042 32854 115820 107027 69258 92884 5751 3763
10070C763J3757j5098n7863n592M3615Q3027k010m8661o0764K6788N1237J0497
$$ 3763 17520 2422 -55441 -61033 -17418 65609 63599 14938 -45826 -19038 32199 42696
10058D2696j082o9970O2948N9986N1279m0381l0909l104O5787L2830o5203o9547
$$ 42696 41614 -28356 34592 94578 145857 105476 74567 71463 137250 170080 104877 35330
10046C5330m5257J7202L1010L486m6984r8247m9725P539N008m8647P4787P8217
$$ 35330 -9927 7275 38285 41771 -5213 -103460 -153185 -145646 -140638 -189285 -114498 -36281
10034c6281k1444m4913N103P4063K2131M9730k308n2200k2314l1724O1903P5100
$$ -36281 -57725 -102638 -97535 -23472 -1341 48389 46081 -6119 -28433 -60157 1746 76846
10022G6846p2397j7994n5616O286K1780O4575k1585J323j7593J20400L2946n6066
$$ 76846 4449 -13545 -69161 -62875 -41095 23480 1895 3218 -14375 106025 138971 82905
10010H2905j8223J0497p2067P913L9805p0823o4446J21947J41804n2644j08384
$$ 82905 64682 75179 3112 11025 50830 -19993 -84439 37508 179312 126668 18284
9999A8284K5005k650j11314p8867K5533K0134O5046J18714N9727m6374k5386q18
$$ 18284 43289 40639 -70675 -149542 -124009 -103875 -38829 79885 139612 93238 67852 67034
9987F7034n6580L2801J10877n9169M452k8480q6073j5018Q2116R1343L8134n7571
$$ 67034 10454 43255 154132 94963 99415 70935 -15138 -30156 51960 143303 181437 123866
9975A23866j22271o3675J7509l1164n3941q8475n5479R6894J23722N3575L0741
$$ 123866 1595 -62080 -44571 -75735 -129676 -218151 -273630 -176736 -53014 561 31302
9964C1302O4247l831l0689n5629l3922J1382Q8347j203j03685r61j1767R369M0457
$$ 31302 95549 91718 61029 5400 -28522 -17140 71207 70004 -33681 -34642 -46409 -37040 3417
9951C417L7092k9408n490L7480K6980k8668j9631R9604N0097k7523N292K0798
$$ 3417 40509 11101 5611 43091 70071 41403 21772 121376 171473 143950 149242 170040
9939A70040N3667J08263J49389O9347N3400N5747j3231r1401j00442j75999k14107
$$ 170040 223707 331970 481359 550706 604106 659853 646622 555221 454779 278780 64673
9928F4673K4584M2025J32977J5938m8312r1485n7510o2970P2575q2200p6040J8387
$$ 64673 89257 131282 264259 280197 231885 140400 82890 19920 92495 10295 -65745 -47358
9916d7358P7033k5617l2898l7053p092R9703o4284p5825P6301O2948l4508Q0561
$$ -47358 29675 4058 -28840 -65893 -72985 26718 -37566 -113391 -37090 25858 -8650 71911
9904G1911M8990l4030L2254l1875q0658J0590l7994l3125J0445M1465J7730k0662
$$ 71911 120901 86871 119125 87250 6592 17182 -20812 -53937 -43492 -2027 15703 -4959
9892d959K9255M5112o0338k0853m6026L5941R1456L9195j07681j3087k2815l8433
$$ -4959 24296 69408 9070 -11783 -57809 -21868 69588 108783 1102 -11985 -34800 -73233
9880g3233N6726M2062l3977m3067R449P7727N782m1802n3957K1807K5331K3899
$$ -73233 -16507 25555 -8422 -51489 -42040 35687 41469 -333 -54290 -32483 -7152 16747
9868A6747M4890k2420r9165n3695J4909M0111L4225N0066J4608J2677j9129K1994
$$ 16747 61637 39217 -59948 -113643 -98734 -58623 -24398 25668 40276 52953 33824 55818
9856E5818L795J592m051o2438k0758K2949N8031q988l7184o1869K7127O7071k761
$$ 55818 59613 61205 57154 -5284 -26042 -3093 54938 45950 8766 -53103 -25976 41095 38334
9843C8334O2397J9043k2811p4953J053q902P92K1239m93q0231j8759K3030n3451
$$ 38334 100731 119774 96963 22010 23063 14161 14953 36192 35699 -44532 -63291 -40261 -93712
9830i3712q150p344J26361O1333O2872o8284j08159K0180M1147K8192m7344K2073
$$ -93712 -101862 -109206 17155 78488 141360 73076 -35083 -14903 26244 54436 7092 29165
9818B9165J2531j0414K4390m2343n1850N4342K2932m7395m1436L1361k229o3183
$$ 29165 41696 31282 55672 13329 -38521 15821 38753 -8642 -50078 -18717 -20946 -84129
9806h4129m8298J1647L4333P4728K2352l125n5403k3709K7515R353j6123Q80j4584
$$ -84129 -132427 -120780 -86447 -11719 10633 7508 -47895 -71604 -44089 -34736 -50859 -49979 -64563
9793f4563Q0742J35196m7159o0745l8673O8913K1260k9399m1237j16233q7525
$$ -64563 16179 151375 104216 43471 4798 73711 94971 65572 24335 -91898 -179423
9782a79423P8179J64484K776q7431q187o422M5305j8285j735O1238J572O3674
$$ -179423 -101244 63240 66016 -21415 -29602 -36024 9281 -9004 -10739 50499 52071 115745
9770A15745M5069o5495k8653O1562M7670q0487r9762m9163R0125J4651r154J8950
$$ 115745 160814 95319 66666 128228 175898 95411 -4351 -53514 36611 51262 42108 61058
9758F1058O683k3388l956J3877k5708k7514n1498m223O5910n1396j16335l5867
$$ 61058 67741 44353 40397 54274 28566 1052 -50446 -54669 11241 -40155 -156490 -192357
9746a92357Q5805J333L7948R7840m6814L3425L4482J5151O7570K3173m4943n6228
$$ -192357 -106552 -105219 -67271 30569 -16245 17180 51662 66813 134383 157556 112613 56385
9734E6385J10541n1521n4686j9283L0764R545q8273m7828L8709J7261K1455n2700
$$ 56385 166926 115405 60719 41436 72200 81745 -6528 -54356 -15647 1614 23069 -29631
9722b9631L4394k4928q2071p3155N2698J43606p662j55036o282P8779K0268J23509
$$ -29631 4763 -20165 -102236 -175391 -122693 20913 13251 -141785 -148067 -69288 -49020 74489
9710G4489k3599m981M6519N8532L1463p7717j89309q141N2541N0346M2601L6887
$$ 74489 50890 45909 92428 150960 182423 104706 -84603 -92744 -40203 10143 52744 89631
9698H9631l1182r3505r0122P2044N3085k2801L5276M8345m1654J0817N6561q826
$$ 89631 58449 -35056 -125178 -53134 -49 -22850 12426 60771 19117 29934 86495 77669
9686G7669q7092J9684N5927j12479o1248O7586M2369q6689N5446N2413P6278j30264
$$ 77669 -9423 10261 66188 -46291 -107539 -39953 2416 -84273 -28827 23586 99864 -30400
9674c0400o6357L7242K1042M9820M1573m8513o619j4743j4467r392l049J823P4959
$$ -30400 -96757 -59515 -38473 11347 52920 4407 -2212 -16955 -31422 -40814 -43863 -42040 32919
9661C2919L5349J860K1473k2815k8637P6749J38632m178j2914M5651k9080p3197
$$ 32919 68268 70128 91601 68786 40149 116898 255530 251352 238438 284089 255009 181812
9649A81812r2405k6386Q701M1146p6813j6557j2153q0293r0487O649L1435M2785
$$ 181812 89407 63021 71722 112868 36055 19498 7345 -72948 -163435 -156786 -125351 -82566
9637h2566J10132J44006n8723j44981j6733L4076R002j512O571k5735k3276P3254
$$ -82566 27566 171572 112849 -32132 -48865 -14789 -5787 -7299 -728 -26463 -49739 23515
9625B3515k9957j4076M4015M7950Q295k5785P8502J8203P186n4260n0286o0N8904
$$ 23515 -6442 -20518 23497 71447 79742 53957 132459 150662 157848 103588 53302 53242 112146
9612A12146K6420q240m8656j5464k8187l4512M4359l9734N3802K3328P297K0007
$$ 112146 138566 130326 81670 66206 38019 3507 47866 8132 61934 85262 92559 112566
9600A12566Q440p0657l7948j08738j1729n966k5127K4145l2194K3090J5227K461
$$ 112566 121006 50349 12401 -96337 -108066 -114032 -139159 -115014 -147208 -124118 -108891 -106430
9588a06430J09704N0054j9893p778j09553j378L2173M8451R4351k0016k4924o2461
$$ -106430 3274 53328 33435 25657 -83896 -85274 -53101 -4650 89701 69685 44761 -17700
9576a7700q6554K4915M4824P5070P3816l5177M5424q8312m451R4070M1008j19675
$$ -17700 -104254 -79339 -34515 40555 114371 79194 124618 36306 31855 125925 166933 47258
9564D7258k1149Q352J1003J03532R84j59190j1084O1420k3016k4363j20841m8531
$$ 47258 26109 34461 45464 148996 149980 -9210 -20294 41126 18110 -6253 -127094 -175625
9552a75625M8661L0950M4439N0159p5953o4417L9500R2099L2855K0622k3589K5807
$$ -175625 -126964 -96014 -51575 -1416 -77369 -141786 -102286 -10187 22668 43290 19701 45508
9540D5508L1365n7005m9056O9422l2901K3220N4913j1504m1793m1333k3414K1465
$$ 45508 76873 19868 -29188 40234 7333 30553 85466 73962 32169 -9164 -32578 -11113
9528a1113l3298J7074l9673J8916K4492r7106N4088J4567k5336J4444j4027N0868
$$ -11113 -44411 -27337 -67010 -48094 -23602 -120708 -66620 -52053 -77389 -62945 -76972 -26104
9516b6104K6587k7593J00028J0632p6031n5476q2542J36212O3261j0710L3896
$$ -26104 483 -27110 72918 83550 7519 -47957 -130499 5713 68974 58264 92160
9505I2160l4841l748k0803m4304l9300n3718K0700k4064k4736O3305M0619J03304
$$ 92160 57319 53571 32768 -11536 -50836 -104554 -83854 -107918 -132654 -69349 -28730 74574
9493G4574N7874j6718K3264q8033o3262O6981R8507P4433q0820j02987n1068J3320
$$ 74574 132448 115730 138994 50961 -12301 54680 153187 227620 146800 43813 -7255 6065
9481F065l9323J7994n1988K300N7822p170R158l5624n15M7245k4543j06808J2635
$$ 6065 -33258 -15264 -67252 -64952 -7130 -14300 -5142 -40766 -41281 5964 -18579 -125387 -112752
9468a12752J57566M0250m6410n911K7496j0557K2867M6497j6445o597L0781Q402
$$ -112752 44814 85064 38654 32743 60239 49682 72549 119046 102601 96004 126785 135187
9456A35187n8015K2894j367j1910j61158o5665P1574J01021q832n2565K5124L9610
$$ 135187 77172 100066 98699 86789 -74369 -140034 -68460 32561 23729 -28836 -3712 35898
9444C5898j2886o4081M1982j8134m9439m2782M540P4950j8504m3835Q9856k5879
$$ 35898 23012 -41069 913 -17221 -66660 -109442 -104902 -29952 -48456 -92291 -2435 -28314
9432b8314l2056J5437P0486r9481j1966N3034L8265J8801O9892m8142j19608p4482
$$ -28314 -60370 -44933 25553 -73928 -85894 -32860 5405 24206 94098 45956 -73652 -148134
9420a48134N3240K27Q007Q10J7617O5993M7693r5487k199M0331O4237L1689j05905
$$ -148134 -94894 -94667 -86660 -85850 -68233 -2240 45453 -50034 -52233 -11902 52335 84024 -21881
9407b1881r7368K2183P0060Q9919N3657p7980j665K2007M2790R5l9207p865k4343
$$ -21881 -119249 -97066 -27006 62913 116570 38590 36925 58932 101722 101817 62610 54745 30402
9394C0402n2308l5991m4044O860M2626O0868j2417n7334p388L4843k56n5293L0390
$$ 30402 -21906 -57897 -101941 -95081 -52455 8413 -4004 -61338 -68726 -33883 -34139 -89432 -59042
9381e9042J7614N924J7203m4369o1483J802L5932l0283J9376K597R845N2058K2610
$$ -59042 -41428 -35504 -18301 -62670 -124153 -122351 -86419 -116702 -97326 -94729 -84884 -32826 -10216
9368a0216L1444R5847J9667n9517j55960K7131N6786l135O7889l5218l9821l79
$$ -10216 21228 117075 136742 77225 -78735 -51604 5182 2047 69936 34718 -5103 -5482
9356e482n2654L7169O1422j2049N4757L6169q523o0279l5464o3504L4404l8338
$$ -5482 -58136 -20967 40455 28406 83163 119332 110809 50530 15066 -48438 -14034 -52372
9344e2372p3523L1517N6262M206M2565J5605r1911m2562K0888m4797P926J0898
$$ -52372 -125895 -94378 -38116 -33910 8655 24260 -67651 -110213 -89325 -134122 -126196 -115298
9332a15298J6072J8701K844k0604L9976N8914m4228L8071J01971L4850l6748n580
$$ -115298 -99226 -80525 -77681 -98285 -58309 605 -43623 -5552 96419 131269 94521 88941
9320H8941o715j08617m8681P6411K9692n7721n8569k1332L5340M7631J3209n4777
$$ 88941 82226 -26391 -75072 1339 31031 -26690 -85259 -106591 -71251 -23620 -10411 -65188
9308f5188J6900m3329m0214N6176L6756j1575J06721K7972l4314m0150j1269K6449
$$ -65188 -48288 -91617 -131831 -75655 -38899 -50474 56247 84219 49905 9755 -1514 24935
9296B4935R0514J1959n0500o8099m0055m4965O9806m3132l5830M5570j089L6713
$$ 24935 115449 127408 76908 8809 -31246 -76211 -6405 -49537 -85367 -39797 -40886 -4173
9284d173O1690m8200k1869L1331k8493l0944L9341J0472O4122m0304p7867K1545
$$ -4173 57517 9317 -12552 18779 -9714 -40658 -1317 9155 73277 32973 -44894 -23349
9272b3349Q1741P9607M2442j01793r9900n094R9933K5293m2574j5561n9742k3395
$$ -23349 58392 137999 180441 78648 -21252 -26346 73587 98880 56306 40745 -18997 -42392
9260d2392O9679Q6204J066q4062l4208J3904N21L5341M224j36568m1270M8584
$$ -42392 27287 113491 114557 30495 -3713 10191 10712 46053 50277 -86291 -127561 -78977
9248g8977k2478l5798J22456M2190K3813J04162L9085k2988l6211O3402O1519
$$ -78977 -101455 -137253 -14797 27393 51206 155368 194453 171465 135254 198656 260175
9237B60175r0774k107o1350l6787l8485J4706k339N6526J297o6764j9695k6917
$$ 260175 169401 167294 105944 69157 30672 45378 43039 99565 100862 34098 14403 -12514
9225a2514j6135K6477o0744k3485K9948M5707O4795n6M4913m8334l6787q3185
$$ -12514 -28649 -2172 -62916 -86401 -56453 -10746 54049 53993 98906 50572 13785 -69400
9213f9400Q208R7595n480j3962l61k8612P8N2307O436L6179M1252L6688m2394
$$ -69400 -61192 36403 30923 16961 16600 -12012 -11934 40373 46809 82988 124240 160928 118534
9200A18534l026r6521j33075n7182J01590M6267n4174p5311K2336M2662m1730
$$ 118534 115508 18987 -114088 -171270 -69680 -23413 -77587 -152898 -130562 -87900 -129630
9189a29630K1773P6007L4293k5346l3019n985O3233j5313o5203Q1556J5363k4970
$$ -129630 -107857 -31850 2443 -22903 -55922 -61907 1326 -13987 -79190 2366 17729 -7241
9177g241j4841J4060r469m382l957m6478p108O8018j6268k809Q3363L663o0539
$$ -7241 -22082 -8022 -17491 -21873 -25830 -72308 -79416 -11398 -27666 -30475 52888 56551 -3988
9164c988L3961r345N0518m843r1640o2140l7044Q6788L7907L8518J4457q2117
$$ -3988 29973 20628 71146 66303 -25337 -87477 -124521 -37733 174 38692 53149 -28968
9152b8968j306n5570m0890l4505O7003p559l0113l420o5590N7673M7369J7044
$$ -28968 -30274 -85844 -126734 -161239 -94236 -101795 -131908 -135328 -200918 -143245 -95876 -78832
9140g8832M6210N4081K4251o1907j385O6956p67n1546k9054J9750j7071k7442
$$ -78832 -32622 21459 45710 -16197 -17582 49374 48607 -2939 -31993 -12243 -29314 -56756
9128e6756m2413K4158K2934J7651N8441P5180K2757m0551l0195p6287K2347K0961
$$ -56756 -99169 -75011 -52077 -34426 24015 99195 121952 81401 51206 -25081 -2734 18227
9116A8227r6589J2553Q6372n6040K6701L9374j6828p9433k6775Q2445J3631J8116
$$ 18227 -78362 -65809 20563 -35477 -8776 30598 13770 -65663 -92438 -9993 3638 21754
9104B1754P317k0230l7267R30p0580k8883O7972N703k1405L7834R7010j0360m1031
$$ 21754 29071 8841 -28426 -27496 -98076 -126959 -58987 -53284 -74689 -36855 60155 49795 8764
9091H764Q5629J4219L7331l3630n0011p7879q1104l4513M5142R1477m308k4900
$$ 8764 94393 108612 145943 112313 62302 -15577 -96681 -131194 -86052 5425 1117 -23783
9079b3783n4861l0300k7315k1554J2132N0602P7285Q194r2n0330L2056M6082k5345
$$ -23783 -78644 -108944 -136259 -157813 -145681 -95079 -17794 -9600 -9692 -60022 -27966 18116 -7229
9066g229N503o531n2244J4647n6297j9293K2241M2973M341q1177K3478K816J8227
$$ -7229 -1726 -8257 -60501 -45854 -102151 -121444 -99203 -56230 -51889 -133066 -109588 -106772 -88545
9053h8545M7279M9337J9018m3016j1231j2932j24624K4116L7156L8125O8605Q207
$$ -88545 -41266 8071 27089 -15927 -27158 -40090 -164714 -140598 -103442 -65317 3288 11495
9041A1495N950n1826k8170j417m0718J1232J26145J3639K423Q8413n2628m6075
$$ 11495 17445 -34381 -62551 -63968 -104686 -93454 32691 46330 48753 137166 84538 38463
9029C8463K7108M8003P7720j2497j28388j13458K7556Q15O4552N5677p909p4692
$$ 38463 65571 113574 191294 178797 50409 -63049 -35493 -34678 29874 85551 77642 2950
9017B950K66O9086M1821j6969J5920l5181n6815K7740M3660K2394K7031n387j21748
$$ 2950 3216 72302 114123 97154 113074 77893 21078 48818 92478 114872 141903 136516 14768
9004A4768o7529M1579P1419L3936p3274j8774K812k598k6953m7732j104l4927
$$ 14768 -52761 -11182 60237 94173 20899 2125 4937 2339 -24614 -72346 -73450 -108377
8992a08377l224P9827M2542o8337n6371m6880j3033R0977J52843l4368m1835l931
$$ -108377 -111601 -31774 10768 -57569 -113940 -160820 -173853 -82876 69967 35599 -6236 -10167
8980a0167M3459m8023j6604j2310R8434L4201o7502j3468n1954L7183m763L6611
$$ -10167 33292 -14731 -31335 -43645 54789 88990 21488 8020 -43934 -6751 -11514 25097
8968B5097R6778M521q7893n3225m1119l1306K9913k7794P463O2520N9960L3631
$$ 25097 121875 126396 38503 -14722 -55841 -87147 -57234 -85028 -77565 -15045 44915 78546
8956G8546k6588j4889k0333L4167p2931n4471L2629M3134P775K846p0167l2603
$$ 78546 51958 37069 16736 50903 -22028 -76499 -43870 -736 7039 9885 -60282 -92885
8944i2885o823O7949R399J06674K1410j04616J3669J6332J293o220l4952m3265
$$ -92885 -99708 -31759 -22360 84314 105724 1108 14777 31109 32402 26182 -8770 -52035
8932e2035J41008m9491o6478N6342M7237J2838K6052N240J2845j5008N0081j4980
$$ -52035 88973 39482 -26996 29346 76583 89421 115473 120713 133558 118550 168631 153651
8920A53651r8850n9045J06655l6312l9167j8874P1551M9947k5556k7842k9156
$$ 153651 54801 -4244 102411 66099 26932 8058 79609 129556 104000 76158 47002
8909D7002l286p1273o0530j1909O5868O7234m2375l2146N449K6280R4748J6530
$$ 47002 43716 -27557 -88087 -99996 -34128 33106 -9269 -41415 -35966 -9686 85062 101592
8897A01592k7723k1208n0414p214p3150J0903J26742O4745n822m9429m6252O56
$$ 101592 73869 52661 2247 -4967 -78117 -67214 59528 124273 118451 69022 22770 23426
8885B3426N0964n8959l2692K7490N8828K8076j9342l9622k7915O052k6734n1891
$$ 23426 74390 15431 -17261 10229 69057 97133 77791 38169 10254 16306 -10428 -62319
8873f2319q9419K1532N0892P9855K9324o4516l4270j8161J8247M6921J14772o6068
$$ -62319 -151738 -130206 -79314 541 29865 -34651 -68921 -87082 -68835 -21914 92858 26790
8861B6790k7104j2767O4830O2573j01108k0970k5835M7900O8129M4789k5961j03700
$$ 26790 -314 -13081 51749 114322 13214 -7756 -33591 14309 82438 127227 101266 -2434
8849b434N6039R9556j06370q9333l9947J03458P1120p8799j04612k0104L9608
$$ -2434 53605 153161 46791 -42542 -82489 20969 92089 13290 -91322 -111426 -71818
8838g1818L0179L2186R2021L2755m0181r4168j0774j2434J4062J5088J7761J9675
$$ -71818 -41639 -9453 82568 115323 75142 -19026 -29800 -42234 -28172 -13084 4677 24352
8826B4352K0216m2049k7549M41k1257M0023n949n5656M734Q4597p711p9479J03207
$$ 24352 44568 2519 -25030 -24589 -45846 -5823 -11772 -67428 -62694 21903 14192 -65287 37920
8813C7920n2215m8173O3523M97r323Q3307n4255k2355R023p2555K5386L2125m4786
$$ 37920 -14295 -62468 1055 1552 -7771 75536 21281 -1074 7949 -64606 -39220 -7095 -51881
8800e1881j2160M3287M6432l7418n809J3197J44932j3547j7751J3925p3721l6425
$$ -51881 -64041 -20754 25678 -11740 -17549 -4352 140580 127033 109282 123207 49486 13061
8788A3061l0115l8785R602O6555Q365N5987m371j9149k6508j02380n0757j8223
$$ 13061 -17054 -55839 -46237 20318 28683 84670 80299 61150 34642 -67738 -118495 -136718
8776a36718O4133J2656l2839N5684P965j5032P4142J38611N0724l9989j25427
$$ -136718 -72585 -59929 -92768 -37084 -29119 -44151 29991 168602 219326 179337 53910
8765E3910o2167j02406k0440O6535K6319L5500K1889M76l2037q3360R6005L8842
$$ 53910 -8257 -110663 -131103 -64568 -38249 -2749 19140 19616 -12421 -95781 224 39066
8753C9066j4063l5238j4019K0416k999L7425o9415n907j9816o0230N5679P4103
$$ 39066 25003 -10235 -24254 -3838 -6837 30588 -38827 -44734 -64550 -124780 -69101 5002
8741E002J2501J8126K7937j7599o2946k0516O8144J987k0295o8234O003N2026
$$ 5002 17503 35629 63566 45967 -16979 -37495 30649 32636 12341 -55893 -49890 2136
8729B136K6485p7868J11395N3511m9503j20037p2331m286M8427j0249O6128j2211
$$ 2136 28621 -49247 62148 115659 66156 -53881 -126212 -130498 -82071 -92320 -26192 -38403
8717c8403q1253m8608K6367R6693R7021L5991o5374k5256N1966k1526j1657j7290
$$ -38403 -119656 -168264 -141897 -45204 51817 87808 22434 -2822 49144 27618 15961 -1329
8705a329P0710o8269q3317q5856N0445R3226M9134J42964k6613j25124o9721L2578
$$ -1329 69381 1112 -82205 -168061 -117616 -24390 24744 167708 141095 15971 -53750 -21172
8693b1172R7018N1809p873n1005n6193k3160M0719j144M2513k2712m6794K5321
$$ -21172 75846 127655 119782 68777 12584 -10576 30143 28999 71512 48800 2006 27327
8681B7327O0023k1441L6845L5879k8712j9893k9692M5993j0819J7183N5397m940
$$ 27327 87350 65909 102754 138633 109921 90028 60336 106329 95510 112693 168090 163150
8669A63150o0587o0500n9608N718R750L3842n423O2288J8811n9021j23729k2159
$$ 163150 102563 42063 -17545 -11827 -2077 31765 26342 88630 107441 48420 -75309 -97468
8657i7468P5888O6480n6981o0945o3142J04336q575R4496R3484L5209j11679j44925
$$ -97468 -21580 44900 -12081 -73026 -136168 -31832 -40407 54089 147573 182782 71103 -73822
8645g3822l3089J59954J39514j12221r0801J2813N3816K6859j9740K666N3717
$$ -73822 -106911 53043 192557 80336 -10465 2348 56164 83023 63283 65949 119666
8634A19666N037n0897p1973k8335M9650K5717L1025K3445o6579q3516M9976N4791
$$ 119666 124703 73806 1833 -26502 23148 48865 79890 103335 36756 -46760 3216 58007
8622E8007n0918K5610l7558K8906J05044k6842j14727m4312j3228J05057J0934
$$ 58007 7089 32699 -4859 24047 129091 102249 -12478 -56790 -70018 35039 45973
8611D5973R80m0263N872J6803j15355n6483Q7463P2174r015R6181R4877n3816
$$ 45973 46953 6690 12562 29365 -85990 -142473 -55010 17164 8149 104330 199207 145391
8599A45391q8182j8028j301N5214P6913M755p6808q7343J5488r5583n410J01869
$$ 145391 57209 39181 37880 93094 170007 174762 97954 10611 26099 -69484 -74894 26975
8587B6975J0887J0490O741K6654Q099M4497k6083o7453m1697R146o148M6701j3724
$$ 26975 37862 48352 55093 81747 89846 134343 108260 40807 -890 8256 2108 48809 35085
8574C5085p8004n8022R607R8262O2066l4304J0624M8972j711K4673k4568m6141
$$ 35085 -42919 -100941 -91334 6928 68994 34690 45314 94286 92575 117248 92680 46539
8562D6539l3761m2749M1061L3537M741J4728J1621q6807N5503N7137k1909M3809
$$ 46539 12778 -29971 11090 44627 49368 64096 75717 -11090 44413 101550 79641 123450
8550A23450l3244j0781N9331p0047J3765l4837m4640K4108L8060K8628M453P2952
$$ 123450 90206 79425 138756 68709 82474 47637 2997 27105 65165 93793 98246 171198
8538A71198M2031n7823k2928P8000M3396o3280q7679m3210n2454k8359L9500L9594
$$ 171198 213229 155406 132478 210478 253874 190594 102915 59705 7251 -21108 18392 57986
8526E7986M0533k961K4L8105O7177J5705k3931k3385n5176j06771r2873P4124
$$ 57986 98519 95558 95582 133687 200864 216569 192638 169253 114077 7306 -85567 -11443
8514a1443K9888J7069K4185M6801K5571J2520k5047k9754j719O2161n9498l2648
$$ -11443 18445 35514 59699 106500 132071 144591 119544 89790 88071 150232 90734 58086
8502E8086k1742m3171j2407K7415j7432O896q747N8365R1578J9897j07168L145
$$ 58086 36344 -6827 -19234 8181 -9251 -2355 -11102 47263 138841 158738 51570 54715
8490E4715P0718n9388k0250k0590l8616P5785J7535o8790l7232M0075P8125L4370
$$ 54715 125433 66045 45795 25205 -13411 62374 79909 11119 -26113 13962 92087 126457
8478A26457J9104j27220n6073M9836P8712k2911p8069o9840L0994k4783K3810
$$ 126457 145561 18341 -37732 12104 90816 67905 -10164 -80004 -49010 -73793 -49983
8467d9983R1867Q668K5515K3695j7108k762J08011N8541j12437j11957m8881K9858
$$ -49983 41884 50552 76067 99762 82654 79892 187903 246444 134007 22050 -26831 3027
8455C027J9992K9607K8096N2406J4458j05863k9310M1440q9669o6354J6882O5440
$$ 3027 23019 52626 80722 133128 147586 41723 12413 53853 -35816 -102170 -85288 -19848
8443a9848J3125J2877Q0114K7565k9763r1018j2535j7352k5285Q4147j7783Q645
$$ -19848 -6723 6154 86268 113833 84070 -6948 -19483 -36835 -62120 22027 4244 12889
8431A2889P2808r8105q9225N7202n577j7147m5900M2149R7832j3126j8918O4852
$$ 12889 85697 -12408 -101633 -44431 -50008 -67155 -113055 -70906 26926 13800 -5118 59734
8419E9734o0520j07494L5320O7799r3176M8653L4560K3765p4384O8720j7121r3722
$$ 59734 -786 -108280 -72960 -5161 -98337 -49684 -15124 8641 -65743 2977 -14144 -107866
8407a07866m0680N7360O8724N3151p6222j11857J5075O7291R4180j2777P811k6857
$$ -107866 -148546 -91186 -22462 30689 -45533 -157390 -142315 -75024 19156 6379 14190 -12667
8395a2667k8893k5998R799j3438l3507m040L8343n7711n3512P4558J26759O907
$$ -12667 -41560 -67558 -57759 -71197 -104704 -108744 -70401 -128112 -181624 -107066 19693 26600
8383B6600k7515J0927k3211l655O815n7333j3310J07986J9580K3908j8820o0038
$$ 26600 -915 10012 -13199 -16854 -10039 -67372 -80682 27304 46884 70792 51972 -8066
8371h066k8283p827n1971l6940Q6834M3479O7864K0050j23719O3560J5448n5922
$$ -8066 -36349 -44176 -96147 -133087 -46253 -2774 65090 85140 -38579 24981 40429 -15493
8359a5493O232P7095m5821j5465M369k1086L4149N357l3652j44500k1323O7916
$$ -15493 -9261 67834 22013 6548 10917 -10169 23980 29337 -4315 -148815 -170138 -102222
8347a02222N8564Q4703J03776r8667p3755l9421L353M594P2653k0526L0296J37075
$$ -102222 -43658 41045 144821 46154 -27601 -67022 -63669 -59075 13578 -6948 23348 160423
8335A60423n1365j16481m8603L7373M9545P6249o0735k9544j2447m3547R27J03142
$$ 160423 109058 -7423 -56026 -18653 30892 107141 46406 16862 4415 -39132 -38205 64937
8323F4937L4732j33882l4284p787o4408K2160N8653l5235q0332m6676Q6047N0913
$$ 64937 99669 -34213 -68497 -76284 -140692 -118532 -59879 -95114 -175446 -222122 -136075 -85162
8311h5162K4746J1176J6713j03613J8890K2738m7553P95N0456R5021M2985m1079
$$ -85162 -60416 -49240 -32527 -136140 -117250 -94512 -142065 -141270 -90814 4207 47192 6113
8299F113O9393Q5265r0568n8632p5096k3037J21672l527l289M276l4940M9695
$$ 6113 75506 160771 70203 11571 -63525 -86562 35110 31583 28294 32570 -2370 47325
8287D7325J6046n5110j74499q3700O3956O5840J2680r5705q7813J04854J11966
$$ 47325 63371 8261 -166238 -249938 -185982 -120142 -107462 -203167 -290980 -186126 -74160
8276g4160J07655K5816l5652m3525m4676J6853k5748k665N2559K8874l8186j9248
$$ -74160 33495 59311 23659 -19866 -64542 -47689 -73437 -76102 -23543 5331 -32855 -52103
8264e2103K1734J962k7747N1587Q5495m4727N169n4062m3271M4622O5973Q4922
$$ -52103 -30369 -28407 -56154 -4567 80928 36201 41370 -12692 -55963 -11341 54632 139554
8252A39554j5917k2977r0719r8672J7538m1513p331J1862N1607j8521j5118J2220
$$ 139554 123637 100660 9941 -88731 -71193 -112706 -120037 -108175 -56568 -75089 -90207 -77987
8240g7987K3632M1034j1968k8463L4024j02244J13527O6514q1362k5240m023P105
$$ -77987 -54355 -13321 -25289 -53752 -19728 -121972 -8445 58069 -23293 -48533 -52556 -45451
8228d5451L7473K1754k3912l0231J7632K1193k3276M7403R114J4342O744n7742
$$ -45451 -7978 13776 -10136 -40367 -22735 -1542 -24818 22585 31699 46041 52785 -4957
8216d957n5432o3479P3994R650j092l1628n026N3502L8817q1610j1761J0026J02946
$$ -4957 -60389 -123868 -49874 -40224 -41316 -72944 -77970 -24468 14349 -67261 -79022 -68996 33950
8203C3950P6809L2210r001p5510p45n5982n1784o7524J4363J21580J8491L4563
$$ 33950 110759 142969 133968 58458 57713 1731 -50053 -117577 -103214 18366 36857 71420
8191G1420N8364j7451r0443n1607k4766L8997M4178l4814j9285K6837J8698P9192
$$ 71420 129784 112333 21890 -29717 -54483 -15486 28692 -6122 -25407 1430 20128 99320
8179I9320J8642j45296p6648j6294P2543r0882n5179J02235j2697j5122o6672
$$ 99320 117962 -27334 -103982 -120276 -47733 -138615 -193794 -91559 -104256 -119378 -186050
8168a86050Q2069J7261o80L397l7459N4790L4320o9724M9343N4451m3406L876
$$ -186050 -103981 -86720 -87400 -84003 -121462 -66672 -32352 -102076 -52733 1718 -41688 -37812
8156c7812j462J6487J8946J3462J5723m722n1267q5946J6731M4123J7846q457
$$ -37812 -39274 -22787 -3841 9621 25344 20622 -30645 -116591 -99860 -55737 -37891 -46348
8144d6348K3372N5068n789o8546j2038k3348J7916R7427j7064m4623m5104N9175
$$ -46348 -22976 32092 26303 -42243 -54281 -77629 -59713 37714 20650 -23973 -69077 -9902
8132i902l5292n988O9370P2873j4514q9902L1827L0426N3927q3994L1473j4002
$$ -9902 -45194 -51182 18188 91061 76547 -13355 18472 48898 102825 18831 50304 36302
8120C6302O1903R411n9357l7573m2446L6698O9052J1688j0107K6527m8214q3094
$$ 36302 98205 107616 48259 10686 -31760 4938 73990 85678 75571 102098 53884 -29210
8108b9210k3288j5518L329L7366m72L0703O4048j6854o0234o69M6920K60p7507
$$ -29210 -52498 -68016 -64687 -27321 -27793 2910 66958 50104 -10130 -10799 36121 36381 -41126
8095d1126o9657N6668Q7285j7689p7477N3330k7963k0898Q0315P3398q8603n4384
$$ -41126 -110783 -54115 33170 15481 -61996 -8666 -36629 -57527 22788 96186 7583 -46801
8083d6801r0777k7936J2244J09368K5716n471K3602p5097j1926N4229J8102j7790
$$ -46801 -137578 -165514 -153270 -43902 -18186 -23657 -55 -75152 -87078 -32849 -14747 -32537
8071c2537J2602J5065O0922J3251j78J4376k9598j9638J0681K9768n2447m8754
$$ -32537 -19935 -4870 56052 69303 69125 83501 53903 34265 44946 74714 22267 -26487
8059b6487o7625m2806p674J42542M0675L7971K8717r650o2349k6532Q9806L0345
$$ -26487 -94112 -136918 -144592 -2050 38625 76596 105313 95663 33314 6782 96588 126933
8047A26933n5889l5895J01759k542l0898J6651M895n4484k6569l2144l7160R13
$$ 126933 71044 35149 136908 134366 103468 120119 125014 70530 43961 11817 -25343 -24430
8035b4430O2198k6863L649J1449o2405L391l1714j31919O7417P7312K3624J0784
$$ -24430 37768 10905 14554 26003 -36402 -33011 -64725 -196644 -129227 -51915 -28291 -17507
8023a7507p0038P7428P2474k5792l1774Q2654j4517o2687o0007q1346P3392L6530
$$ -17507 -87545 -10117 62357 36565 4791 87445 72928 10241 -49766 -131112 -57720 -21190
8011b1190N3453o1334m0099k3497k2927l3418K0884J02374K6032R7294q6440q2025
$$ -21190 32263 -29071 -69170 -92667 -115594 -149012 -128128 -25754 278 97572 11132 -70893
7999g0893O1176J6926o5684M9182P7470J2590l3175k0106M3939K2967o2541J7926
$$ -70893 -9717 7209 -58475 -9293 68177 80767 47592 27486 71425 94392 31851 49777
7987D9777L4452Q947j9332q4040q5814j9549Q198J3373M5852J03397k6879p5698
$$ 49777 84229 93176 73844 -10196 -96010 -115559 -107361 -93988 -48136 55261 28382 -47316
7975d7316M960l4141K7173O3542n2929L7992M3997P6211P6175l4451l4679n9290
$$ -47316 -42356 -76497 -49324 14218 -38711 -719 43278 119489 195664 161213 126534 67244
7963F7244j9353M5803K3756l7458o1153M7147K5528n952j41026l9442P1685K0447
$$ 67244 47891 93694 117450 79992 18839 65986 91514 85562 -55464 -94906 -23221 -2774
7951b774l8721J6771O2298j2591q001J0846L104K6422j14544j339M4235j4139
$$ -2774 -41495 -24724 37574 24983 16982 27828 30932 57354 -57190 -58529 -14294 -28433
7939b8433J29323j6680p5863M908j0813N2968m9180m9246M1696L0417P1398j24
$$ -28433 100890 84210 8347 13255 2442 55410 6230 -43016 -1320 29097 100495 100371
7927A00371k081j6960l6547j42670l4367N0248n251J2105K7735N8409J9118J2947
$$ 100371 98290 81330 44783 -97887 -132254 -82006 -87257 -75152 -47417 10992 30110 43057
7915D3057k8686J3579K8495K5822r2473r8603P5913M5154K077l4523k2753J03652
$$ 43057 14371 27950 56445 82267 -10206 -108809 -32896 12258 14335 -20188 -42941 60711
7903F0711P3568n8248r802O9421l9393K6881N0569L7261n6185J8940j21066q6512
$$ 60711 134279 76031 66229 135650 96257 123138 173707 210968 154783 173723 52657 -33855
7891c3855J21820L8169m2872p8835o9067K0094N9878O2631k5161L4068l2913r4800
$$ -33855 87965 126134 83262 4427 -64640 -44546 15332 77963 52802 86870 53957 -40843
7879d0843k5469P3632J21616N9897K2949j56905j20251K4837L8761L8344j6969
$$ -40843 -66312 7320 128936 188833 211782 54877 -65374 -40537 -1776 36568 19599
7868A9599q2121k6627P0988k4451n1489M3169R9243Q2458R425r4084o0246j9890
$$ 19599 -62522 -89149 -18161 -42612 -94101 -50932 48311 130769 140194 46110 -14136 -34026
7856c4026k445j6770m8931Q646n0508k9472Q7892M9687q451Q7577J4367M4326
$$ -34026 -36471 -53241 -102172 -93526 -144034 -173506 -85614 -35927 -44378 43199 57566 101892
7844A01892j3384r5929k2968O605O2559j4191r8996m6209j0142P3492M5758R47
$$ 101892 88508 -7421 -30389 -23784 38775 24584 -74412 -120621 -130763 -57271 -11513 -10566
7832a0566j22758q5242k352Q9962J14362O3212K6532J8187l4304k8096l6458q6200
$$ -10566 -133324 -218566 -220918 -130956 -16594 46618 73150 91337 57033 28937 -7521 -93721
7820i3721L537K5826j8504k7393L5944P0218L2603n2318J08570m1250J3189o1386
$$ -93721 -90184 -64358 -82862 -110255 -74311 -4093 28510 -23808 84762 43512 56701 -4685
7808d685L2285J4192R6602M3980j3732n8132q2043o0357k0621L278P496K7249
$$ -4685 27600 41792 138394 182374 168642 110510 28467 -31890 -52511 -49233 -41737 -14488
7796a4488l5496j283J34853K1390m6073j26357L1699P4988M6713k7009p5622q8668
$$ -14488 -49984 -51267 83586 104976 58903 -67454 -35755 39233 85946 58937 -16685 -105353
7784a05353l9994L6954N3141J04702J31777L5186L2431m1654j8618o4695n5613
$$ -105353 -145347 -108393 -55252 49450 181227 216413 248844 207190 188572 123877 68264
7773F8264k437j318J3384m4648N0034O716K6749K0328j4347q6874m6076O7174
$$ 68264 65827 64509 77893 33245 83279 89995 116744 137072 122725 35851 -10225 56949
7761E6949J24567j4175j01118m0679N3654K3630J1161J7765k9703m1263O3049
$$ 56949 181516 167341 66223 25544 79198 102828 113989 131754 102051 60788 123837
7750A23837K1870j745m9106o8161j6542p682k5006k6042k2864O6395m3993j7307
$$ 123837 145707 143962 94856 26695 10153 2471 -22535 -48577 -71441 -5046 -49039 -66346
7738f6346l8901p6942J5572J56767J2305O3430K1192k6686k6604l7030M0889k4278
$$ -66346 -105247 -182189 -166617 -9850 2455 65885 87077 60391 33787 -3243 37646 13368
7726A3368j3960m2544j3932o6630m899j0488m8482O1934P3772R373j0765j662
$$ 13368 -592 -43136 -57068 -123698 -128597 -139085 -187567 -125633 -51861 -42488 -53253 -54915
7714e4915r0053K4678J00474J296k2260Q2332K9575m7246n651n353m4328k8616
$$ -54915 -144968 -120290 -19816 -18520 -40780 41552 71127 23881 18230 12877 -31451 -60067
7702f0067L4775L9645M647L2077j18377l5978m3133L3348R9384J53887N3992p3972
$$ -60067 -25292 14353 19000 51077 -67300 -103278 -146411 -113063 -13679 140208 194200 120228
7690A20228l174J0923Q7040j7799j44359j22519K8536R6360m7641l2482L6409
$$ 120228 117054 127977 215017 197218 52859 -69660 -41124 55236 7595 -24887 11522
7679A1522J4742n0000m8744m7461m1205J28854J4973O664Q6708K9809O8902n481
$$ 11522 26264 -23736 -72480 -119941 -161146 -32292 -17319 -10655 76053 105862 174764 169283
7667A69283k9100l9989O0148K6620p8131n2086k792k9278K479J1178K6277j01500
$$ 169283 140183 100194 160342 186962 108831 56745 53953 24675 27154 38332 64609 -36891
7655c6891j1813n0574k3898k6648N1602R0026M2383Q823J9556L4603p6451Q21
$$ -36891 -48704 -99278 -123176 -149824 -98222 -8196 34187 43010 62566 97169 20718 21539
7643B1539o7815p5023M6408L6801k5578n0051K5069Q1787O6700o2904p3861j3458
$$ 21539 -46276 -121299 -74891 -38090 -63668 -113719 -88650 -6863 59837 -3067 -76928 -90386
7631i0386M7087j9207J0546Q3708L4694j6511o3577j1143j2913M1965j2226P4398
$$ -90386 -43299 -62506 -51960 31748 66442 49931 -13646 -24789 -37702 4263 -7963 66435
7619F6435J05165J20018m5553j36621q3623r5599L134K6452m792J1760J17844
$$ 66435 171600 291618 246065 109444 25821 -69778 -66644 -40192 -44984 -33224 84620
7608H4620N8388j728n0482K009P046r0590M0415L4923m7039P441L6119j01619
$$ 84620 143008 141280 90798 92807 99853 9263 49678 84601 37562 45003 81122 -20497
7596b0497l2762Q5557N9716l7616j4567j0576M1697N9367O4311J2443k769l5352
$$ -20497 -53259 32298 92014 54398 39831 29255 70952 130319 194630 207073 204304 168952
7584A68952j20419j22666L6195J16326j8286j1099J20282O7331q228m5931k6042
$$ 168952 48533 -74133 -37938 78388 60102 49003 169285 236616 228388 182457 156415
7573A56415n3658J210k1714j23020O425J27797R8126j3519r8008J3068k1551n6171
$$ 156415 102757 103967 82253 -40767 -34342 93455 191581 178062 80054 93122 71571 15400
7561A5400k4139P4832q077n6316N9874j7365m7947L6786L2362O0651Q628j30272
$$ 15400 -8739 66093 58016 1700 61574 44209 -3738 33048 65410 126061 134689 4417
7549D417K2942N8204J1984l978l5483L509L5123r9867k4402P89k3110J6395j1610
$$ 4417 27359 85563 97547 93569 58086 61595 96718 -3149 -27551 -26762 -49872 -33477 -45087
7536d5087l4372J4942O0532J21637j9181l0151j2271O5519M4956K178r3446q5376
$$ -45087 -79459 -64517 -3985 117652 98471 68320 56049 121568 166524 168702 75256 -10120
7524a0120m0910K9951L4661K5991R4043l4452j24350o5769l7527L6079L4454Q2663
$$ -10120 -51030 -21079 13582 39573 133616 99164 -25186 -90955 -128482 -92403 -57949 24714
7512B4714J65566j02637k1504l061j2152M7208k4936R079O065o9947Q53k9754
$$ 24714 190280 87643 66139 63078 50926 98134 73198 82277 88342 18395 19248 -10506
7500a0506L9895R5411k8607r5238M4127R4526L0840l8199p6064j18296k4748l4258
$$ -10506 29389 124800 96193 955 45082 139608 170448 132249 56185 -62111 -86859 -121117
7488a21117j1001N6236L1264P8828k3593j5552N0321o0513L416M0724o423k696
$$ -121117 -132118 -75882 -44618 34210 10617 -4935 45386 -15127 -11711 29013 22590 19894
7476A9894N830r4062m677K7041O153k3699j07479Q273J01280K9387j32339J8024
$$ 19894 25724 -68338 -73015 -45974 -39821 -63520 -170999 -162726 -61446 -32059 -164398 -146374
7464a46374L6077r6629R169R1570J37684Q0470n2849n5738M3354M6555k3100k4553
$$ -146374 -110297 -206926 -197757 -106187 31497 111967 59118 3380 46734 93289 70189 45636
7452D5636n5476m9738N4582j7987M6426j2893k7434j4493j7741l7604J4715O3693
$$ 45636 -9840 -59578 -4996 -22983 23443 10550 -16884 -31377 -49118 -86722 -72007 -8314
7440h314N2202k2216p9899J5832p7221K1686R7534Q5439j577m2924r6772p1050
$$ -8314 43888 21672 -58227 -42395 -119616 -97930 -396 85043 83466 40542 -56230 -127280
7428a27280M0954M8739J1168j3624Q8664K3609r5390J0486J23649O125k8454o532
$$ -127280 -86326 -37587 -26419 -40043 48621 72230 -23160 -12674 110975 117100 88646 82114
7416H2114P81K5597L6374m805q677J6345q8882j12004k1591M9286P296l3232J2582
$$ 82114 82895 108492 144866 140061 131384 147729 58847 -53157 -74748 -25462 -18166 -51398 -38816
7403c8816k5150L2574M3443J26424L4648k1324m3293m1640j05530p9898j0465
$$ -38816 -63966 -31392 12051 138475 173123 151799 108506 66866 -38664 -118562 -129027
7392a29027L2925l4139L8361Q6156n526r629k6592r2803O9145K6717o166o9900
$$ -129027 -96102 -130241 -91880 -5724 -11250 -20879 -47471 -140274 -71129 -44412 -50578 -120478
7380a20478r5R0822l6384l9206o4795p7199J32183J38495m7461m8076j7222P5565
$$ -120478 -120573 -29751 -66135 -105341 -170136 -247335 -115152 23343 -24118 -72194 -89416 -13851
7368a3851N7153m4401k3681O460j873l915O282l4775m783j01359J1544l9100Q6863
$$ -13851 43302 -1099 -24780 -18320 -20193 -24108 -17826 -52601 -57384 -158743 -147199 -186299 -99436
7355i9436J01050M555L1503K1396L6078N1387o7646o7500m7910n6681M4390j13
$$ -99436 1614 6169 37672 59068 95146 146533 78887 11387 -36523 -93204 -48814 -48927
7343d8927Q7932J11654l3613q6894o3644n1844k3089P6510R9156m3655j56056
$$ -48927 39005 150659 117046 30152 -33492 -85336 -108425 -31915 67241 23586 -132470
7332a32470q3868K5839j5475M3896J00506O9141N6865k3092m5574J6606J2573
$$ -132470 -216338 -190499 -205974 -162078 -61572 7569 64434 41342 -4232 12374 24947
7321B4947o8m9919m1936j7258L7203O2452J4803K341Q3424k950j9673j7373o303
$$ 24947 24879 -25040 -66976 -84234 -47031 15421 30224 32565 115989 113039 93366 75993 69690
7308F9690j0358j3948j6420n9742L5325M335O9713L3826r647o6843l6860q7329
$$ 69690 59332 45384 28964 -30778 4547 8882 78595 112421 102774 35931 -929 -88258
7296h8258K7356N3619L2535J12184n242l8669o4766m3370n2233J08374L9586k325
$$ -88258 -60902 -7283 25252 137436 132194 93525 28759 -14611 -66844 41530 81116 78791
7284G8791j8051r2353l2054N0444M9099J0518m1233o3028N6089L1636K2531M5349
$$ 78791 60740 -31613 -63667 -13223 35876 46394 5161 -57867 -1778 29858 52389 97738
7272I7738K8820n5363o8266n6576M2240J7510k5695j0919k2922J2313k796Q1445
$$ 97738 126558 71195 2929 -53647 -11407 6103 -19592 -30511 -53433 -41120 -43916 37529
7260C7529J19827n0622l0307M1726k0044J982M8960k955p8404j2405R971o8025
$$ 37529 157356 106734 76427 118153 98109 100091 149051 146096 67692 55287 65258 -2767
7248b767o6457M7094L2474j06109o4878J29871J78910Q940l3761n18n5500o0302
$$ -2767 -69224 -22130 10344 -95765 -160643 -30772 148138 157078 123317 122799 67299 6997
7236F997m8922l2320k3600l4711o822R8348M9800J7510M507K577q8096j4943K2794
$$ 6997 -41925 -74245 -97845 -132556 -139378 -41030 8770 26280 30787 33364 -54732 -69675 -46881
7223d6881M1129O3396J2137r5215j19943J09302M1826l9012O6024O2133O128o220
$$ -46881 -5752 57644 69781 -25434 -145377 -36075 5751 -33261 32763 94896 101024 94804
7211I4804J1620L5186n9965q7852p3533j5116O944O1347O2074L232k9496K6826
$$ 94804 106424 141610 81645 -6207 -79740 -94856 -87912 -26565 35509 38741 9245 36071
7199C6071j5458m9292N217l1426Q6025N0283o3361j13633J0692N8325O1122k4688
$$ 36071 20613 -28679 -23462 -54888 31137 81420 18059 -95574 -84882 -26557 34565 9877
7187I877k4083j6713l3183O1479K9440O3912K6603n8316k5115n0813k0064N213
$$ 9877 -14206 -30919 -64102 -2623 26817 90729 117332 59016 33901 -16912 -36976 -31763
7175c1763J01638j8712Q318O6104p3841K578k1351m9777J7311r2304l1462P5572
$$ -31763 69875 51163 59481 125585 51744 54322 32971 -16806 505 -91799 -123261 -47689
7163d7689N8667M9244o421N751J4664J3302K6100J4788k4842K6338J3801l6341
$$ -47689 10978 60222 53801 59552 74216 87518 113618 128406 103564 129902 143703 107362
7151A07362k8398j42029r5146J71771J01146o6087j18806O2100J6460q673L367
$$ 107362 78964 -63065 -158211 13560 114706 48619 -70187 -8087 8373 -300 3067
7140C067K6876J8351n5923J3358M1407l0701K620N3856j6498o4257p9844m2512
$$ 3067 29943 48294 -7629 5729 47136 16435 19055 72911 56413 -7844 -87688 -130200
7128a30200M5548P7052M6155n7732q7238J1430n9477r1817l6380J22639M0615
$$ -130200 -84652 -7600 38555 -19177 -106415 -94985 -154462 -246279 -282659 -160020 -119405
7117a19405n173O3677K9367n746j1385P5798J8728m3965n2490J6991Q4415P032
$$ -119405 -124578 -60901 -31534 -37280 -48665 27133 45861 1896 -50594 -33603 50812 57844
7105E7844j23527q044P7768J047k2867l9825j7709M8627j7267Q5389N5904N6034
$$ 57844 -65683 -73727 4041 5088 -17779 -57604 -75313 -26686 -43953 41436 97340 153374
7093A53374m6786m5928J9595J4398p4611l4507N0148j8726O84o8144k338o97l921
$$ 153374 106588 60660 80255 94653 20042 -14465 35683 16957 17641 -50503 -52841 -53538 -57459
7080e7459J5006M7760M7465P2785j7291m8868p0365p519o8776j216J3310L3159
$$ -57459 -42453 5307 52772 125557 108266 59398 -10967 -18486 -87262 -88478 -75168 -42009
7068d2009O7724k652J8768k9739p3095l1467L2076r888n5354Q324O7019K4543
$$ -42009 25715 23063 41831 12092 -61003 -92470 -60394 -70282 -125636 -117312 -50293 -25750
7056b5750O0355J48718j13860j57734K4472J5976J3582L7802J2139j5464J2668
$$ -25750 34605 183323 69463 -88271 -63799 -47823 -34241 3561 15700 236 12904
7045A2904n9389J533n817M7660M08Q542M1268N8217j8033r5240l9621P0816L0797
$$ 12904 -46485 -44952 -50769 -3109 -2701 5841 47109 105326 87293 -7947 -47568 23248 54045
7032E4045J5159m6813q74J8139n6060R361o4511o6985j5913O7792R6539L7770
$$ 54045 69204 22391 21517 39656 -16404 -7043 -71554 -138539 -154452 -86660 9879 47649
7020D7649n6517M7834j6655M9447j5373o2678r756J9331Q2521K4193p8474j40938
$$ 47649 -8868 38966 22311 71758 56385 -6293 -16049 3282 85803 109996 31522 -109416
7008a09416n3012N7845J53749n2499j2889J8247J2538j18457M312o599m2666Q2964
$$ -109416 -162428 -104583 49166 -3333 -16222 2025 14563 -103894 -99582 -106181 -148847 -65883
6996f5883K4053L5651O1699P9579n6884p3038J4180o5534m8188l7404M3681j6685
$$ -65883 -41830 -6179 55520 135099 78215 5177 19357 -46177 -94365 -131769 -88088 -104773
6984a04773J0413j15385l3811J16827R6612J7824O0966Q105n5322k1138R7357
$$ -104773 -94360 -209745 -243556 -126729 -30117 -12293 48673 56778 1456 -19682 77675
6973G7675m1006l4702O156p4752o6525R6919P5109K4384L7531l1207m9741k0555
$$ 77675 36669 1967 8123 -66629 -133154 -36235 38874 63258 100789 69582 19841 -714
6961g14p8762q9179n945L0353K0068k3463n2776N7761K9907K1146Q8869Q4447
$$ -714 -79476 -168655 -174600 -144247 -124179 -147642 -200418 -142657 -112750 -91604 -2735 81712
6949H1712L248j15688r3246m2462L388M6388j555q194k0308k0087K3682M1797
$$ 81712 84960 -30728 -123974 -166436 -163048 -116660 -118215 -126409 -146717 -166804 -143122 -101325
6937a01325R9927J17639p6506k7478J00691k4082l5000K4996K8770r4395q6438
$$ -101325 -1398 116241 39735 12257 112948 88866 53866 78862 107632 13237 -73201
6926g3201n4845k0666N3043k3786K6252M1558l2338J6245M5655J18524l3875j8619
$$ -73201 -128046 -148712 -95669 -119455 -93203 -51645 -83983 -67738 -22083 96441 62566 43947
6914D3947m0552k6240m7061N4670K8851O6210k3862m7991M9463m6322j09651l6166
$$ 43947 3395 -22845 -69906 -15236 13615 79825 55963 7972 57435 11113 -98538 -134704
6902a34704J9503P8665J0763K7837L3439Q960J4495l662p6151j00511l52K3949
$$ -134704 -115201 -36536 -25773 2064 35503 44463 58958 55296 -20855 -121366 -121718 -97769
6890i7769L0205M9558O2729k740k1146P357m4557j2784k020j337J15122Q9429
$$ -97769 -67564 -18006 44723 41983 20837 28194 -16363 -29147 -31167 -32504 82618 172047
6878A72047P128J4235k6843n2064l1809J13727M7319q3164j23845j26525j2080
$$ 172047 179175 193410 166567 114503 82694 196421 243740 160576 36731 -89794 -101874
6867a01874o484q7039k5727Q5491O3219k4049n944o3939O3932J22683j5370j8867
$$ -101874 -108358 -195397 -221124 -135633 -72414 -96463 -102407 -166346 -102414 20269 4899 -13968
6855a3968J47282j8696j600n7211L1479j5097m1991J4388J0051k0780k6979O7794
$$ -13968 133314 114618 113018 55807 87286 72189 30198 44586 54637 33857 6878 74672
6843G4672J4996m5826n4764k4119J19759j5470L3913J2073o7007o6472L9798M2237
$$ 74672 89668 43842 -10922 -35041 84718 69248 103161 115234 48227 -18245 21553 63790
6831F3790q0040K0377K5459o6305L3811M1644J25412L4170N2264q1957o1348n1883
$$ 63790 -16250 4127 29586 -36719 -2908 38736 164148 198318 250582 168625 107277 55394
6819E5394k5969n9669q6475l7655k1175J9313J5503R2959J13257J7131n7271p381
$$ 55394 29425 -30244 -116719 -154374 -175549 -156236 -140733 -47774 65483 82614 25343 17962
6807A7962r8249j08429j5062K0583M133n4492J05856J257M0050O315N6237O1790
$$ 17962 -80287 -188716 -203778 -183195 -179062 -233554 -127698 -126441 -86391 -80076 -23839 37951
6795C7951l6869n200l3997l3336L1413J0701O1853o4616m7547m8676K9658P7232
$$ 37951 1082 -4118 -38115 -71451 -40038 -29337 32516 -32100 -79647 -128323 -98665 -21433
6783b1433O9163J0558m0925o4887r15k1186j9802j9439r0922L1103P5142K0867
$$ -21433 47730 58288 17363 -47524 -48439 -69625 -89427 -108866 -199788 -168685 -93543 -72676
6771g2676K1161l1681p013O2920l2933L7089O6986j01324l4489K5344j09186O3537
$$ -72676 -51515 -83196 -90209 -27289 -60222 -23133 43853 -57471 -91960 -66616 -175802 -112265
6759a12265J21756l3492p1309J1770Q7452o0978l8244K2964O4333N751k8986J4167
$$ -112265 9491 -24001 -95310 -83540 3912 -57066 -95310 -72346 -8013 -2262 -31248 -17081
6747a7081L8325l7634o7413L3566Q1468J7830K0379l7057r457q948Q986Q2513
$$ -17081 21244 -16390 -83803 -50237 31231 49061 69440 32383 22926 13978 22964 105477
6735A05477K3547p8445L356l9046p1522q1900L5915L1981j9291P7623M3466m0391
$$ 105477 129024 50579 53935 14889 -56633 -138533 -102618 -70637 -89928 -12305 31161 -9230
6723i230j2153N5544N2287j9125J7648M4100K7078n2148j00410k2734M4056l715
$$ -9230 -21383 34161 86448 67323 84971 129071 156149 104001 3591 -19143 24913 21198
6711B1198j08931o320M5384J9103m5554j02937M0508K9446R9457J53496O2282
$$ 21198 -87733 -94053 -48669 -29566 -75120 -178057 -137549 -108103 -8646 144850 207132
6700B07132p9031j04081p2445q4493M4626J36281P7925o9070r054L3487O7452
$$ 207132 128101 24020 -48425 -132918 -88292 47989 125914 56844 47790 81277 148729
6689A48729n1591m7074j2662K5435j1330L7036m0897n3225n081m3617K049M833
$$ 148729 97138 50064 37402 62837 51507 88543 47646 -5579 -10660 -54277 -52228 -47395
6677d7395m0187k9380o4194k3451O4580L6959P8477M4423p6158m4625k1084Q8134
$$ -47395 -87582 -116962 -181156 -204607 -140027 -103068 -24591 19832 -56326 -100951 -122035 -33901
6665c3901R1441O2161Q50p0107Q009j0051Q049q8577k7299J9918n385J43486k0022
$$ -33901 57540 119701 120551 50444 58453 48402 56451 -32126 -59425 -39507 -44892 98594 78572
6652G8572p7952M3628M1841p5152n2740j532k6875j0219P3734o9903k4586m903
$$ 78572 620 44248 86089 10937 -41803 -43335 -70210 -80429 -6695 -76598 -101184 -106087
6640a06087P037J5630N5244J5375k3646j6999q3440P647K4661m2911J31717R5511
$$ -106087 -99050 -83420 -28176 -12801 -36447 -53446 -136886 -129239 -104578 -147489 -15772 79739
6628G9739M0983K765K7149o0062j02659n4891k9132j4222L1894J5541l2000L2422
$$ 79739 120722 123487 150636 90574 -12085 -66976 -96108 -110330 -78436 -62895 -94895 -62473
6616f2473O9558M9833P331L2021k5214k4212o447l4127l216K0951M4456l4587
$$ -62473 7085 56918 64249 96270 71056 46844 40397 6270 3054 24005 68461 33874
6604C3874M247l3489o9498p0605m1729N9607J18517J03342O6971J1715K9142j1703
$$ 33874 38121 4632 -64866 -135471 -177200 -117593 924 104266 171237 182952 212094 200391
6592B00391r8903j44083O8930J3082L4575K444k0871k9832m7077N2456j6297m0931
$$ 200391 101488 -42595 26335 39417 73992 76436 55565 25733 -21344 31112 14815 -26116
6580b6116n002L2267l6310R288P263L3247J9586O6204J2549j17515o1410O7846
$$ -26116 -31118 1149 -35161 -25873 -18610 14637 34223 100427 112976 -4539 -65949 1897
6568A897k6529j9393K641n1474l5216Q8620J13959L3061m2577M0423k8185p3790
$$ 1897 -24632 -44025 -41384 -92858 -128074 -39454 74505 107566 64989 105412 77227 3437
6556C437m9993k3046l6975L0390J14302R1771k6432o1367n2218Q694L4213k4896
$$ 3437 -46556 -69602 -106577 -76187 38115 129886 103454 42087 -10131 -1437 32776 7880
6544G880J5787l6507k9278J63870Q1646j17403r101N7687N1129r9247m8368J00595
$$ 7880 23667 -12840 -42118 121752 203398 85995 76894 134581 185710 86463 38095 138690
6532A38690m6860p6088K8350J11954p0264o8772j0015l7103q571o2230j02107
$$ 138690 91830 15742 44092 156046 85782 17010 6995 -30108 -38679 -100909 -203016
6521b03016K5616M3242K1978r787R6389K599R170m508r883L4691m4065m9645m5640
$$ -203016 -177400 -134158 -112180 -121967 -25578 -22979 -13809 -18317 -28200 6491 -37574 -87219 -132859
6508a32859J5354N3426K1165k6392o2509L1533M194M6525l2393l6190N6194R7724
$$ -132859 -117505 -64079 -42914 -69306 -131815 -100282 -96088 -49563 -81956 -118146 -61952 35772
6496C5772K8352p1928M8096K3551o2166N2622L8593o3042K8787K4542j6155o3194
$$ 35772 64124 -7804 40292 63843 1677 54299 92892 29850 58637 83179 67024 3830
6484C830Q5088n4221p943K5171m1336m7614O3547k8903k3736n443r4793M6707
$$ 3830 88918 34697 26754 51925 10589 -37025 26522 -2381 -26117 -31560 -126353 -79646
6472g9646M8505J786l6036k6829j0358M6293M4454J1461J969o8452m3052j6720
$$ -79646 -31141 -29355 -65391 -92220 -102578 -56285 -11831 -370 1599 -66853 -109905 -126625
6460a26625k5020J0899M859L8221R9877N3791m5570n3722j5674n4183M7357P0401
$$ -126625 -151645 -140746 -135887 -97666 2211 56002 10432 -43290 -58964 -113147 -65790 4611
6448D611N588n8109k3373o5948M0388N0613N6524J5594k4884k9529l7197p61r8049
$$ 4611 10199 -47910 -71283 -137231 -96843 -46230 10294 25888 1004 -28525 -65722 -66483 -164532
6435a64532l5840N8600J8085Q2823l9891J00574K3636R644L1126K6634O927p5106
$$ -164532 -200372 -141772 -123687 -40864 -80755 19819 43455 53099 84225 110859 117786 42680
6423D2680O503Q506k1212Q190L5004m4023K1284m860n682P2876J3454R668n0200
$$ 42680 49183 57689 36477 44667 79671 35648 56932 52072 46390 119266 132720 142388 92188
6410I2188r888k3574j1794K1493Q8145q623o1260j8226p3253q9382n8896N3947
$$ 92188 82300 58726 46932 68425 156570 147947 86687 68461 -4792 -94174 -153070 -99123
6398i9123L3621K809K995L9960J7925J9270K1527k8076N0251l0611n3975L0274
$$ -99123 -65502 -62693 -59698 -19738 -1813 17457 38984 10908 61159 30548 -23427 6847
6386F847Q2490J0973m9702k8270m1002P2228O0245k2894l3213K8123k535m2441
$$ 6847 89337 100310 50608 22338 -18664 53564 113809 90915 57702 85825 83290 40849
6374D0849m9420k0961J22544K3678o358O5870j9594l1705j8857l3575p0526j5896
$$ 40849 -8571 -29532 93012 116690 110332 176202 156608 124903 106046 72471 1945 -13951
6362a3951L8718j1986j2384N443n7751K0129N8609O3245Q2889j23337r0124l1006
$$ -13951 24767 12781 397 5840 -51911 -31782 26827 90072 172961 49624 -40500 -71506
6350g1506k4333P7833K7966j8095J4302o6448r0723K716O0873m4149R4837j8413
$$ -71506 -95839 -18006 9960 -8135 6167 -60281 -151004 -148288 -87415 -131564 -36727 -55140
6338e5140K4762K8547K3465L867J9169K217M438K2326k3602m9455L623L3346J5958
$$ -55140 -30378 -1831 21634 25501 44670 46887 51325 73651 50049 594 4217 37563 53521
6325E3521J3614j8727n2280j44556l1166M7763J00389M5731M8807N6644J827m5767
$$ 53521 67135 48408 -3872 -148428 -179594 -131831 -31442 14289 63096 119740 121567 75800
6313G5800m2851k7129R90j8513m6213L4602Q2201Q5896j06877k5218j101q26l9276
$$ 75800 32949 5820 6810 -11703 -57916 -23314 58887 144783 37906 12688 11587 10761 -28515
$$ [...]
##END NTUPLES=NMR SPECTRUM
##END=
