##TITLE=Analysis number 326266
Compound Code sb 00926
Project Code adrs
Chemist Name stores
##JCAMPDX= 6.0         $$ Bruker NMR JCAMP-DX V2.0
##DATA TYPE= NMR SPECTRUM
##DATA CLASS= NTUPLES
##ORIGIN= Bruker BioSpin GmbH
##OWNER= nmr
$$ XWIN-NMR		Version 3.5
$$ Tue Jan 30 13:06:50 2007 GMT Standard Time (UT+0h)  MAYBRIDGE\nmr@NMR_250MHZ
##.OBSERVE FREQUENCY= 250.131544655141
##.OBSERVE NUCLEUS= ^1H
##.ACQUISITION MODE= SIMULTANEOUS (DQD)
##.ACQUISITION SCHEME= undefined
##.AVERAGES= 16
##.DIGITISER RES= 18
##SPECTROMETER/DATA SYSTEM= dpx250
##.PULSE SEQUENCE= zg30
##.SOLVENT NAME= CDCl3
##.SHIFT REFERENCE= (INTERNAL, CDCl3, 0, 16.522)
##AUDIT TRAIL= $$ (NUMBER, WHEN, WHO, WHERE, WHAT)
$$ ##TITLE= Audit trail, XWIN-NMR		Version 3.5
$$ ##JCAMPDX= 5.01
$$ ##ORIGIN= Bruker BioSpin GmbH
$$ ##OWNER= nmr
$$ C:\u/data/dgb/nmr/ADRS/2290/pdata/1/auditp.txt
$$ ##AUDIT TRAIL=  $$ (NUMBER, WHEN, WHO, WHERE, WHAT)
(   1,<2007-01-30 13:06:26.91 +000>,<MAYBRIDGE\nmr>,<NMR_250MHZ>,
      <created by zg, POWCHK disabled, PULCHK disabled
       configuration hash MD5:
       49 4B E0 1D 92 C2 6B 37 9F E6 65 BC 52 41 86 1D
       data hash MD5: 64K
       AA 2E 56 23 14 2F BF 03 7D 94 CB 98 1D D9 02 19>)
(   2,<2007-01-30 13:06:39.48 +000>,<MAYBRIDGE\nmr>,<NMR_250MHZ>,
      <Start of raw data processing
       ef LB = 0.3 FT_mod = 6 PKNL = 1 SI = 32K 
       data hash MD5: 32K
       55 1C B0 78 4A C6 B7 83 FA 33 5B 54 33 FE 19 4A>)
(   3,<2007-01-30 13:06:42.03 +000>,<MAYBRIDGE\nmr>,<NMR_250MHZ>,
      <apk 
       data hash MD5: 32K
       BD EC F3 B5 4E CE 83 98 8B AD 58 42 24 CD D8 8E>)
(   4,<2007-01-30 13:06:42.97 +000>,<MAYBRIDGE\nmr>,<NMR_250MHZ>,
      <abs ABSG = 5 
       data hash MD5: 32K
       FB 39 72 08 97 52 8A 61 7F 25 3D 8B 2C E3 04 F7>)
$$ ##END=
$$ 
$$ hash MD5
$$ 00 46 A0 D4 0C EE 89 4C 82 76 44 E3 56 64 89 4F
##$RELAX= 
##$RELAX= 
##$RELAX= 
##$RELAX= 
##$RELAX= 
##$RELAX= 
##$RELAX= 
$$ Bruker specific parameters
$$ --------------------------
##$DU= <C:\u>
##$EXPNO= 2290
##$NAME= <ADRS>
##$PROCNO= 1
##$TYPE= <nmr>
##$USER= <dgb>
##$AMP= (0..31)
100 100 100 100 100 100 100 100 100 100 100 100 100 100 100 100 100 100 
100 100 100 100 100 100 100 100 100 100 100 100 100 100 
##$AQSEQ= 0
##$AQ_mod= 3
##$AUNM= <au_zg>
##$AUTOPOS= <31 >
##$BF1= 250.13
##$BF2= 250.13
##$BF3= 250.13
##$BF4= 250.13
##$BF5= 500.13
##$BF6= 500.13
##$BF7= 500.13
##$BF8= 500.13
##$BYTORDA= 1
##$CFDGTYP= 0
##$CFRGTYP= 5
##$CHEMSTR= <none>
##$CNST= (0..31)
1 1 145 1 1 1 1 1 1 1 1 1 1 1 1 1 1 1 1 1 1 1 1 1 1 1 1 1 1 1 1 1 
##$CPDPRG= <>
##$CPDPRG1= <>
##$CPDPRG2= <>
##$CPDPRG3= <>
##$CPDPRG4= <mlev>
##$CPDPRG5= <mlev>
##$CPDPRG6= <mlev>
##$CPDPRG7= <mlev>
##$CPDPRG8= <mlev>
##$CPDPRGB= <>
##$CPDPRGT= <>
##$D= (0..31)
0 1 0 0 0 0 0 0 0 0.06 0 0 0 0 0 0 0.0002 0 0 0 0 0 0 0 0 0 0 0 0 0 0 
0 
##$DATE= 1170162386
##$DBL= (0..7)
120 120 120 120 120 120 120 120 
##$DBP= (0..7)
150 150 150 150 150 150 150 150 
##$DBP07= 0
##$DBPNAM0= <>
##$DBPNAM1= <>
##$DBPNAM2= <>
$$ [...]
##$SUBNAM7= <"">
##$SUBNAM8= <"">
##$SUBNAM9= <"">
##$SW= 20.6930455092707
##$SWIBOX= (0..15)
0 0 3 0 0 0 0 0 0 0 0 0 0 0 0 0 
##$SW_h= 5175.983436853
##$TD= 65536
##$TD0= 1
##$TE= 294.16
##$TE2= 300
##$TE3= 300
##$TEG= 300
##$TL= (0..7)
0 120 120 120 120 120 120 120 
##$TP= (0..7)
150 150 150 150 150 150 150 150 
##$TP07= 0
##$TPNAME0= <>
##$TPNAME1= <>
##$TPNAME2= <>
##$TPNAME3= <>
##$TPNAME4= <>
##$TPNAME5= <>
##$TPNAME6= <>
##$TPNAME7= <>
##$TPOAL= (0..7)
0.5 0.5 0.5 0.5 0.5 0.5 0.5 0.5 
##$TPOFFS= (0..7)
0 0 0 0 0 0 0 0 
##$TUNHIN= 0
##$TUNHOUT= 0
##$TUNXOUT= 0
##$USERA1= <user>
##$USERA2= <user>
##$USERA3= <user>
##$USERA4= <user>
##$USERA5= <user>
##$V9= 5
##$VALIST= <valist>
##$VCLIST= <CCCCCCCCCCCCCCC>
##$VD= 0
##$VDLIST= <DDDDDDDDDDDDDDD>
##$VPLIST= <PPPPPPPPPPPPPPP>
##$VTLIST= <TTTTTTTTTTTTTTT>
##$WBST= 1024
##$WBSW= 4
##$XGAIN= (0..3)
0 0 0 0 
##$XL= 0
##$YL= 0
##$YMAX_a= 440546
##$YMIN_a= -328831
##$ZGOPTNS= <>
##$ZL1= 120
##$ZL2= 120
##$ZL3= 120
##$ZL4= 120
##$ABSF1= 16.522
##$ABSF2= -4.171173
##$ABSG= 5
##$ABSL= 3
##$ALPHA= 0
##$AQORDER= 0
##$ASSFAC= 0
##$ASSFACI= 0
##$ASSFACX= 0
##$ASSWID= 0
##$AUNMP= <proc_1d>
##$AZFE= 0.1
##$AZFW= 0.1
##$BCFW= 0
##$BC_mod= 0
##$BYTORDP= 0
##$COROFFS= 0
##$CY= 12.5
##$DATMOD= 1
##$DC= 0
##$DFILT= <>
##$DTYPP= 0
##$F1P= 14.0000005364418
##$F2P= -0.99999901652339
##$FCOR= 0.5
##$FTSIZE= 32768
##$FT_mod= 6
##$GAMMA= 0
##$GB= 0
##$INTBC= 1
##$INTSCL= 1
##$ISEN= 128
##$LB= 0.3
##$LEV0= 0
##$LPBIN= 0
##$MAXI= 10000
##$MC2= 0
##$MEAN= 0
##$ME_mod= 0
##$MI= 0
##$NCOEF= 0
##$NC_proc= -3
##$NLEV= 6
##$NOISF1= 0
##$NOISF2= 0
##$NSP= 0
##$NTH_PI= 0
##$NZP= 0
##$OFFSET= 16.522
##$PC= 1
##$PHC0= 91.80824
##$PHC1= -13.21002
##$PH_mod= 1
##$PKNL= yes
##$PPARMOD= 0
##$PSCAL= 4
##$PSIGN= 0
##$REVERSE= no
##$SF= 250.13
##$SI= 32768
##$SIGF1= 0
##$SIGF2= 0
##$SINO= 400
##$SIOLD= 32768
##$SREGLST= <1H.CDCl3>
##$SSB= 0
##$STSI= 32768
##$STSR= 0
##$SW_p= 5175.98343685301
##$SYMM= 0
##$S_DEV= 0
##$TDeff= 65536
##$TDoff= 0
##$TI= <Analysis number 999999
Compound Code 99
Book Reference 9
Project Code 9>
##$TILT= no
##$TM1= 0
##$TM2= 0
##$TOPLEV= 0
##$USERP1= <user>
##$USERP2= <user>
##$USERP3= <user>
##$USERP4= <user>
##$USERP5= <user>
##$WDW= 1
##$XDIM= 32768
##$YMAX_p= 340930945
##$YMIN_p= -171675
$$ End of Bruker specific parameters
$$ ---------------------------------
##NTUPLES= NMR SPECTRUM
##VAR_NAME=  FREQUENCY,     SPECTRUM/REAL,   SPECTRUM/IMAG
##SYMBOL=    X,             R,               I
##VAR_TYPE=  INDEPENDENT,   DEPENDENT,       DEPENDENT
##VAR_FORM=  AFFN,          ASDF,            ASDF
##VAR_DIM=   32768,         32768,           32768
##UNITS=     HZ,            ARBITRARY UNITS, ARBITRARY UNITS
##FACTOR=    0.157963299565203, 1,           1
##FIRST=     4132.6476996994, 0,             0
##LAST=      -1043.33573715361, 0,           0
##MIN=       -1043.33573715361, -171675,     0
##MAX=       4132.6476996994, 340930945,     0
$$ Real data points
##PAGE= N=1
##DATA TABLE= (X++(R..R)), XYDATA
$$ [...]
19065i801j1563j78O279N412j937k533j025L015L317L388r59n445m688p191n758
$$ -9801 -21364 -21542 -15263 -9851 -11788 -14321 -15346 -12331 -9014 -5626 -6585 -12030 -16718 -23909 -29667
19050b9667L598K215Q735O818k194L86K815J585m617k09k88J608L035O84k339
$$ -29667 -26069 -23854 -15119 -8301 -10495 -10109 -7294 -5709 -10326 -10535 -10823 -9215 -6180 -5496 -7835
19035g835n211n232M859Q10j746K095j86q63K271K042L549l529m638L900N908
$$ -7835 -13046 -18278 -13419 -12609 -14355 -12260 -12446 -13309 -11038 -8996 -5447 -8976 -13614 -9714 -3806
19020c806j063o248N240m1Q37Q908K892m751m179N144p150q109m527P369J242
$$ -3806 -4869 -11117 -5877 -5918 -5081 3827 6719 1968 -2211 2933 -4217 -12326 -16853 -9484 -8242
19005h242l039L60J360m080K471k960k181j938P408P751k331o388l587L033O713
$$ -8242 -11281 -10921 -9561 -13641 -11170 -14130 -16311 -18249 -10841 -3090 -5421 -11809 -15396 -12363 -5650
18990e650K360m439r139j140L71N228l170q675J883Q398j328K927J145K296K430
$$ -5650 -3290 -7729 -16868 -18008 -17637 -12409 -15579 -24254 -22371 -13973 -15301 -12374 -11229 -8933 -6503
18975f503q98K076L226J078J973m395m668j668o501L240O203j902r574j609j497
$$ -6503 -7401 -5325 -2099 -1021 952 -3443 -8111 -9779 -16280 -13040 -6837 -8739 -18313 -19922 -21419
18960b1419O328J986o59j5k1o73R87o013L413L011M410J456K648j759O088J676
$$ -21419 -15091 -13105 -13764 -13779 -13800 -14473 -13486 -19499 -16086 -13075 -8665 -7209 -4561 -6320 -232 1444
18944A444l652o099n319p70k15L837q4k907r50j945k873Q372M558L547J407l134
$$ 1444 -2208 -8307 -13626 -14396 -14611 -10774 -10858 -13765 -14715 -16660 -19533 -11161 -6603 -3056 -1649 -4783
18928d783O377J926o541k607j504K557M575m052j2943L315L544o820m123M060
$$ -4783 1594 3520 -3021 -5628 -7132 -4575 0 -4052 -16995 -13680 -10136 -16956 -21079 -17019
18914a7019N225K150n73L325R69O051J486l24o823q494l78K002M713N66k324l258
$$ -17019 -11794 -9644 -10217 -6892 -5923 128 1614 1290 -5533 -14027 -14405 -12403 -7690 -7124 -9448 -12706
18898a2706J435N744j254l49J320j41N187K362r345p874M33L06j534Q644Q414
$$ -12706 -11271 -5527 -6781 -7130 -5810 -5951 -764 1598 -7747 -15621 -15188 -14882 -16416 -7772 642
18883F42m329l832J195m186n6M93J241K545K076J152l219k919l616M964m08J659
$$ 642 -3687 -7519 -6324 -10510 -10566 -10073 -8832 -6287 -4211 -3059 -6278 -9197 -12813 -7849 -8257 -6598
18867f598M234r30j0868K373O671k28L324Q372n784j0529M38r073j787N233J257
$$ -6598 -2364 -3294 -14162 -11789 -5118 -5346 -2022 6350 566 -9963 -9525 -18598 -20385 -15152 -13895
18852a3895j505j101k66K083Q753N934n811j0020k072n39R441J467q16j869l333
$$ -13895 -15400 -16501 -16767 -14684 -5931 3 -5808 -15828 -17900 -18439 -8998 -7531 -8347 -10216 -13549
18837a3549m696M05P22M82P188M312J73O576K121m903k668p36k106J691M4o47
$$ -13549 -18245 -17840 -17118 -16636 -9448 -5136 -4963 1613 3734 -1169 -3837 -4573 -6679 -4988 -4944 -5591
18821e591K502n300k08J588k458k503K540j683l573l582m241K469K262K113L06
$$ -5591 -3089 -8389 -8597 -7009 -9467 -11970 -9430 -11113 -14686 -18268 -22509 -20040 -17778 -15665 -15359
18806a5359j610K023K662L840M072L538q396n914r34K400n81J704K154L929M113
$$ -15359 -16969 -14946 -12284 -8444 -4372 -834 -9230 -15144 -16078 -13678 -14259 -12555 -10401 -6472 -2359
18791b359j588q34k769k670K200M50l745k709K973R0O624M653J790j0593l622
$$ -2359 -3947 -4781 -7550 -10220 -8020 -7570 -11315 -14024 -11051 -10961 -4337 316 2106 -8487 -12109
18776a2109K773k482n68J951O239P462P554J399K1883L4562K6404q125k8878k6139
$$ -12109 -9336 -11818 -12386 -10435 -4196 3266 10820 12219 34102 68664 95068 86943 58065 31926
18762C1926j7487j0583l563j881L67m928l714K659N154L117k414r84J0580K417
$$ 31926 14439 3856 293 -1588 -1221 -6149 -9863 -7204 -2050 1067 -1347 -2331 8249 10666
18748A0666j2274j0104l083K716Q819L187L684k649J969k470q675o812j78K661
$$ 10666 -1608 -11712 -14795 -12079 -3260 -73 3611 962 2931 461 -8214 -15026 -15204 -12543
18734a2543K965m283L950k155j284K499M992m890l993J927O731O400k602l592
$$ -12543 -9578 -13861 -9911 -12066 -13350 -10851 -5859 -10749 -14742 -12815 -6084 316 -2286 -5878
18720e878M361K491m989o125l923m482j174K211k836P460M85p93J757K120m190
$$ -5878 -1517 974 -4015 -10140 -14063 -18545 -19719 -17508 -20344 -12884 -12399 -13192 -11435 -9315 -13505
18705a3505O01Q16p88Q46K46n624K862O036K383l430J281M937m615o580p93Q58
$$ -13505 -12904 -12088 -12876 -12030 -11784 -17408 -14546 -8510 -6127 -9557 -8276 -3339 -7954 -14534 -15327 -14469
18689a4469j095L400K870k322j914M933J216k382o264L793O620P243N805p960
$$ -14469 -15564 -12164 -9294 -11616 -13530 -8597 -7381 -9763 -16027 -12234 -5614 1629 7434 -526
18675e26r975n54r1k350Q56L097N968m313m740j069L882J690j048L699M168j088
$$ -526 -10501 -11055 -11146 -13496 -12640 -9543 -3575 -7888 -12628 -13697 -9815 -8125 -9173 -5474 -1306 -2394
18659b394o279l352R03M194L565L074n943m30Q65K822k498j725l384J759M7Q477
$$ -2394 -8673 -12025 -11122 -6928 -3363 -289 -6232 -6662 -5797 -2975 -5473 -7198 -10582 -8823 -8776 -299
18643b99O269K167n722n517j0186l78N347k011k949o393j000j998N512M254K154
$$ -299 5970 8137 2415 -3102 -13288 -13666 -8319 -10330 -13279 -19672 -20672 -22670 -17158 -12904 -10750
18628a0750j0177O05O865R620N791m23k437r462r430r08J6M709J725J519K45L362
$$ -10750 -20927 -20322 -13457 -3837 1954 1531 -906 -10368 -19798 -20706 -20690 -15981 -14256 -12737 -12492 -9130
18612i130l455l182K85k08m094J8M692K280O342L217l599k327l415O46J190j172
$$ -9130 -12585 -15767 -15482 -15690 -19784 -19766 -15074 -12794 -6452 -3235 -6834 -9161 -12576 -11930 -10740 -11912
18596a1912N25q17J592k440K077O379K305j386j052p439k749K38n306m319Q026
$$ -11912 -11387 -12204 -10612 -13052 -10975 -4596 -2291 -3677 -4729 -12168 -14917 -14679 -19985 -24304 -16278
18581a6278O720l812J993O00j268K660m648k256o093l526O129K361M115j470J627
$$ -16278 -9558 -13370 -11377 -10777 -12045 -9385 -14033 -16289 -22382 -25908 -19779 -17418 -13303 -14773 -13146
18566a3146J2321K714m989l120k781l624k247k444k136J0864M472j619k117J909
$$ -13146 -825 1889 -3100 -6220 -9001 -12625 -14872 -17316 -19452 -8588 -4116 -5735 -7852 -5943
18552e943m43o491n354L867P51q22n480j717J2167J029o323p572L480N037q34
$$ -5943 -6386 -12877 -18231 -14364 -13613 -14435 -19915 -21632 -9465 -8436 -14759 -22331 -18851 -13814 -14648
18537a4648j607M502K672L157j347J113k850L574N13n746k938j12L197O347q026
$$ -14648 -16255 -11753 -9081 -5924 -7271 -6158 -9008 -5434 -4921 -10667 -13605 -13717 -10520 -4173 -12199
18522a2199o114l818O391M516j752P809k683p409j086L414M389q369l653k649
$$ -12199 -18313 -22131 -15740 -11224 -12976 -5167 -7850 -15259 -16345 -12931 -8542 -16911 -20564 -23213
18508b3213l86L930l616P22M045o035Q310K879o859l017M017k917L724J431k242
$$ -23213 -23599 -19669 -23285 -22563 -18518 -24553 -16243 -13364 -20223 -23240 -19223 -22140 -18416 -16985 -19227
18493a9227K927L317J601k044q888M86J513q53k538M887J935k340n46k611O042
$$ -19227 -16300 -12983 -11382 -13426 -22314 -21828 -20315 -21168 -23706 -18819 -16884 -19224 -19770 -22381 -16339
18478a6339N027o764l797L824m228M060Q546k945j797n362k666P122K164J6n53
$$ -16339 -11312 -18076 -21873 -18049 -22277 -18217 -9671 -12616 -14413 -19775 -22441 -15319 -13155 -13139 -13692
18463a3692p864l523J252n342J645M811O510J680l437k387j617M648L847k464
$$ -13692 -21556 -25079 -23827 -29169 -27524 -22713 -16203 -14523 -17960 -20347 -21964 -17316 -13469 -15933
18449a5933q82j917j616L074Q736J426q509n697J545Q99M130N564j14m061p898
$$ -15933 -16815 -18732 -20348 -17274 -8538 -7112 -15621 -21318 -19773 -18874 -14744 -9180 -9294 -13355 -21253
18434b1253l283M365k759L253k561l624N823j55L591L229K390M271p380M43k353
$$ -21253 -24536 -20171 -22930 -19677 -22238 -25862 -20039 -20194 -16603 -13374 -10984 -6713 -14093 -13650 -16003
18419a6003n695l583N529L206K441J811p525K582O379L62j512j563n149o018O114
$$ -16003 -21698 -25281 -19752 -16546 -14105 -12294 -19819 -17237 -10858 -10496 -12008 -13571 -18720 -24738 -18624
18404a8624L547R49J151n379k119J852n17r77N640J886L20O53M723K840p203n955
$$ -18624 -15077 -14128 -12977 -18356 -20475 -18623 -19140 -20117 -14477 -12591 -12271 -11618 -6895 -4055 -11258 -17213
18388a7213j659m6M592N380n428k817K598P66m574m585j347O571k058m43l884
$$ -17213 -18872 -18918 -14326 -8946 -14374 -17191 -14593 -13827 -18401 -22986 -24333 -17762 -19820 -20263 -24147
18373b4147n396O353l186N61O695R70k8Q160l300n969O789N526J142J638n807
$$ -24147 -29543 -23190 -26376 -25815 -19120 -18150 -18178 -10018 -13318 -19287 -12498 -6972 -5830 -4192 -9999
18358i999n471N695m68L335o373o983l988k614N272M204J944j101R06J024j110
$$ -9999 -15470 -9775 -10243 -6908 -13281 -20264 -24252 -26866 -21594 -17390 -15446 -16547 -15641 -14617 -15727
18343a5727j975L269l234j072J761k987m828j27J314l019K92P818L443J727l665
$$ -15727 -17702 -14433 -17667 -18739 -16978 -19965 -24793 -24920 -23606 -26625 -26333 -18515 -15072 -13345 -17010
18328a7010q32l691K113K015j2547n331J468K762Q14J279k066j942K405Q93j299
$$ -17010 -17842 -21533 -19420 -17405 -29952 -35283 -33815 -31053 -30239 -28960 -31026 -32968 -30563 -29670 -30969
18313c0969p16r96O045K574L639P671L152r170j0152k318O469J184l589L68n255
$$ -30969 -31685 -32681 -26636 -24062 -20423 -12752 -9600 -18770 -28922 -31240 -24771 -23587 -27176 -26808 -32063
18298c2063l110K678J487K390P246J627p436j2894j032K976p53Q210O248M450
$$ -32063 -35173 -32495 -31008 -28618 -21372 -19745 -27181 -40075 -41107 -38131 -38884 -30674 -24426 -19976
18284a9976j06k675n68j239l335L384l408n646O507O730l228k070l569k360K58
$$ -19976 -20082 -22757 -23325 -24564 -27899 -24515 -27923 -33569 -27062 -20332 -23560 -25630 -29199 -31559 -31301
18269c1301M562J356K934l324k188L20L166m746q163J25j081j191P707j056k090
$$ -31301 -26739 -25383 -22449 -25773 -27961 -27641 -24475 -29221 -37384 -37259 -38340 -39531 -31824 -32880 -34970
18254c4970L162N931K723J661K282n184k774N64O6N40M532l317j200N42M687j880
$$ -34970 -31808 -25877 -23154 -21493 -19211 -24395 -27169 -26605 -26539 -25999 -21467 -24784 -25984 -25442 -20755 -22635
18238b2635R19O444p63k323p23J58l696r917j113l998q207k888k499l437J0325
$$ -22635 -21716 -15272 -16035 -18358 -19081 -18923 -22619 -32536 -33649 -37647 -45854 -48742 -51241 -54678 -44353
18223d4353J1262L634o009m282K84l451O141N54p818J919L495k383l077j137L2
$$ -44353 -33091 -29457 -35466 -39748 -39464 -42915 -36774 -36220 -44038 -42119 -38624 -41007 -44084 -45221 -45189
18208d5189M713j614l30L31R60J25M498p30r09L989n56M723K447m231r904l614
$$ -45189 -40476 -42090 -42420 -42089 -41129 -41004 -36506 -37236 -38145 -34156 -34712 -29989 -27542 -31773 -41677 -45291
18192d5291m689m95N420l224j259k68l830k441M759N873K075m348P31j929O876
$$ -45291 -49980 -50475 -45055 -48279 -49538 -49806 -53636 -56077 -51318 -45445 -43370 -47718 -46987 -48916 -42040
18177d2040K980l890j0191j342J915o030q84M481K904J939n795M64P205M878j778
$$ -42040 -39060 -42950 -53141 -54483 -52568 -58598 -59482 -55001 -52097 -50158 -55953 -55489 -48284 -43406 -45184
18162d5184R50P50p638N16o029r192K15O006M189j751l016o661M410N007o879
$$ -45184 -44234 -43484 -51122 -50606 -56635 -65827 -65612 -59606 -55417 -57168 -60184 -66845 -62435 -57428 -64307
18147f4307O40M13J272R602L051k375j068J009o376r49l33k723O91L884J630N45
$$ -64307 -63667 -63254 -61982 -52380 -49329 -51704 -52772 -51763 -58139 -59088 -59421 -62144 -61453 -57569 -55939 -55394
18131e5394K934j491K881k631M09J246J2649J5982J5046K0111L3469M2498M3617
$$ -55394 -52460 -53951 -51070 -53701 -53292 -52046 -39397 -23415 -8369 11742 45211 87709 131326
18118A31326N7253O9427Q5232J49068K54220M28612P45800J337029K433307M139908
$$ 131326 188579 258006 343238 492306 746526 1175138 1920938 3257967 5691274 9831182
18108I831182N436396J711774n131262m816094k665153j381600p61737m77622
$$ 9831182 15267578 16979352 11848090 7031996 4366843 2985243 2223506 1745884
18100A745884l31443k42921k00201j58993j13403q3236n9738m5714m5872m2162
$$ 1745884 1414441 1171520 971319 812326 698923 615687 555949 510235 464363 422201
18090D22201l6533l7624k6947k5576j6274j6278j6455j2241j1908j7439j8292
$$ 422201 385668 348044 321097 295521 279247 262969 246514 234273 222365 204926 186634
18079A86634p912p273m926j912l308j0949j5804j3751pq188j2523n854J611Q363
$$ 186634 178722 171449 166523 164611 161303 150354 134550 120799 120792 112604 100081 94227 95838 104201
18065A04201r28j811M182q307n322k619K776j620m060L752o503q219n587m319
$$ 104201 103273 101462 105644 97337 92015 89396 92172 90552 86492 90244 83741 75522 69935 65616
18051F5616J166J629M89O56l021j0520r542k360j718K585J506K989M776O662m072
$$ 65616 66782 68411 68900 69556 66535 56015 46473 44113 42395 44980 46486 49475 54251 60913 56841
18036E6841o071q95l947K975l162k226J150m240K045J341K524q642r758j591N408
$$ 56841 50770 49875 45928 48903 45741 43515 44665 40425 42470 43811 46335 37693 27935 26344 31752
18021C1752J739l229L061K831J781M039k69l54k951K915j677r860n45J6l47l86
$$ 31752 33491 30262 33323 36154 37935 41974 41705 41351 38400 41315 39638 29778 29233 29249 28902 28516
18005B8516n71J241j937j297O090L599j828L548m496Q59q766q264P727M58j47
$$ 28516 27945 29186 27249 25952 32042 35641 33813 37361 32865 33724 24958 16694 24421 24879 24732
17990B4732k571j666P079M415n638o515o539O007L684M608m607l776k374r93J52
$$ 24732 22161 20495 27574 31989 26351 19836 13297 19304 22988 27596 22989 19213 16839 15846 15998
17975A5998m129l346N355K510J804Kj99k438o742o89K056l310M928J0668K018
$$ 15998 11869 8523 13878 16388 18192 18194 17995 15557 8815 8126 10182 6872 11800 22468 24486
17960B4486m80k062k190r418r373k813j299m863N077J3636O941m23m99K5K43N760
$$ 24486 24006 21944 19754 10336 963 -1850 -3149 -8012 -2935 10701 17642 17219 16720 16745 16988 22748
17944B2748K995k581j0615j934R01L291l867m483M548j973M54P658M169k452r273
$$ 22748 25743 23162 12547 10613 11514 14805 10938 6455 11003 9030 9484 17142 21311 18859 9586
17929I586k043Q485n210J517M202J51j351Q71j570m624j570N17k317K873q86j531
$$ 9586 7543 16028 10818 12335 16537 16688 15337 16208 14638 10014 8444 8961 6644 9517 8631 7100
17913G100N741M456j404n118n43M318j788l283M336j547J190j632k209p88l035
$$ 7100 12841 17297 15893 10775 10232 14550 12762 9479 13815 12268 13458 11826 9617 8829 5794
17898E794k620L60N980p724p19L473L026p553J28J1707l81k226M588J315p802
$$ 5794 3174 3534 9514 1790 1071 4544 7570 17 145 11852 11471 9245 13833 15148 7346
17883G346N83P418L344p899n636l288k928O729J453o093q14R197N359j738r224
$$ 7346 7929 15347 18691 10792 5156 1868 -1060 5669 7122 1029 215 9412 14771 13033 3809
17868C809r14M486J5930l659p533R510N890m603p406k923l974R02r40m450N827
$$ 3809 2895 7381 23311 19652 12119 21629 27519 22916 15510 12587 8613 9515 8575 4125 9952
17853I952K125l922l033P106L983n425j338k549Q206m704q173J449q205L762r98
$$ 9952 12077 8155 5122 12228 16211 10786 9448 6899 15105 10401 2228 3677 -4528 -766 -1764
17838a764k107M274K28m2M282N561L251m169K95k428k706k444k759n471L354R696
$$ -1764 -3871 403 631 589 4871 10432 13683 9514 9809 7381 4675 2231 -528 -5999 -2645 7051
17822G051L583K860R2j318j0338n860L688P80k751L432k281J322J295j807l3j689
$$ 7051 10634 13494 13586 12268 1930 -3930 -242 538 -2213 1219 -1062 260 1555 -252 -285 -1974
17806a974M523J057L745R524l374j3173r69J94l22k389L758K342M85K712o19L378
$$ -1974 2549 3606 7351 16875 13501 328 -641 -447 -769 -3158 600 2942 3427 6139 5520 8898
17790H898L582o79K130o744m341n188K082K401m781K12L235M334Q474M679l086
$$ 8898 12480 11801 13931 7187 2846 -2342 -260 2141 -2640 -2428 807 5141 13615 18294 15208
17775A5208q252o757j696M204K632k179p778j974L173M103L062l64M000L936J790
$$ 15208 6956 199 -1497 2707 5339 3160 -4618 -6592 -3419 684 3746 3382 7382 11318 13108
17760A3108J352j83p005o418m188k683O341P304M66m974j740J521j065l217L283
$$ 13108 14460 14277 7272 854 -3334 -6017 324 7628 8094 3120 1380 2901 1836 -1381 1902
17745A902p2J328j474J372M242M603l081l053m146K017l105J067M111p086O11
$$ 1902 1830 3158 1684 3056 7298 11901 8820 5767 1621 3638 533 1600 5711 -1375 -764
17730g64K770J845p05n30o128o596n603L981O284L975L068m581J349L468O271
$$ -764 2006 3851 3146 2616 -3512 -10108 -15711 -11730 -5446 -1471 1597 -2984 -1635 1833 8104
17715H104P575M981j733j439p190p859j630L987l187n64O528K136l716m294p32
$$ 8104 15679 20660 18927 17488 10298 2439 809 4796 1609 1045 7573 9709 5993 1699 967
17700I67k812N268m321k180j043L421M388L320l453J072L200K952j38o62m714
$$ 967 -1845 3423 -898 -3078 -4121 -700 3688 7008 3555 4627 7827 10779 10641 9979 5265
17685E265j927K84j998K093j527n49k268j544N71O85L087l974L949M379N85p743
$$ 5265 3338 3622 1624 3717 2190 1641 -627 -2171 -1600 -915 2172 -1802 2147 6526 7111 -632
17669f32m058M812K948p747m364K383N602J919L255L489j0612j495M048j15N873
$$ -632 -4690 122 3070 -4677 -9041 -6658 -1056 863 4118 7607 -3005 -4500 -452 -567 5306
17654E306M257M940q33o487R7m047j242k934J069M22j508l24k837k175n821L448
$$ 5306 9563 14503 13670 7183 7280 3233 1991 -943 126 548 -960 -1284 -4121 -6296 -12117 -8669
17638h669J0111m290o656k633O485M45N142P71m193m234L453O651r4j0242j34
$$ -8669 1442 -2848 -9504 -12137 -5652 -5207 -65 706 -3487 -7721 -4268 2383 2289 -7953 -8087
17623h087J367M899J917p57L464L515N765J960q767p856K167J817K744J533m40
$$ -8087 -6720 -1821 96 -661 2803 6318 12083 14043 5276 -2580 -413 1404 4148 5681 5241
17608E241K633N584j149M857L579r904n52m39k209j185J56P39q370J272M88j846
$$ 5241 7874 13458 12309 17166 20745 10841 10289 9850 7641 6456 6612 7351 -1019 253 741 -1105
17592a105p05J803l915o168k222j494M079J1380N666k034O71m177k964j1666j291
$$ -1105 -1810 -7 -3922 -10090 -12312 -13806 -9727 1653 7319 5285 5956 1779 -1185 -12851 -14142
17577a4142L605k423j832R086L010k68L853J747k451j35n74L111O465J872m309
$$ -14142 -10537 -12960 -14792 -5706 -2696 -2964 889 2636 185 50 -524 2587 9052 10924 6615
17562F615k322j948m521J94O374L594j056o031m411n99K464M796M839J780O509
$$ 6615 4293 2345 -2176 -1982 4392 7986 6930 899 -3512 -4111 -1647 3149 7988 9768 16277
17547A6277K423o746l112l748Q28K06l043n438m881J231L478L926j048l6L54o404
$$ 16277 18700 11954 8842 5094 5922 6128 3085 -2353 -7234 -6003 -2525 1401 353 317 671 -5733
17531e733k693P309K187j260R3J554K362j124L514K757K343j548o076r286N804
$$ -5733 -8426 -1117 1070 -190 -97 1457 3819 2695 6209 8966 11309 9761 3685 -5601 203
17516B03L664K991M655m890l644P867P608N455k308J526l335q662k377K823n045
$$ 203 3867 6858 11513 6623 2979 10846 18454 23909 21601 23127 19792 11130 8753 11576 6531
17501F531Q55j335N726k953l459O630k823r90l237m866N650m892p721p3j364J66
$$ 6531 7386 6051 11777 8824 5365 11995 9172 8182 4945 79 5729 837 -6884 -6957 -8321 -8155
17485h155P914J738n82m461r21R764J0283M660K836J6008J5202k14j0979j0201
$$ -8155 -241 1497 915 -3546 -4467 5297 15580 20240 23076 39084 54286 54072 43093 32892
17471C2892j2501n483k351l814Q79j290K354K901O740l16n010p974l870k638k952
$$ 32892 20391 14908 12557 8743 9622 8332 10686 13587 20327 20011 15001 7027 3157 519 -2433
17456b433m314K009N623N752j729j373n183o706P839O529N120L540K121J5731
$$ -2433 -6747 -4738 885 6637 4908 3535 -1648 -8354 -515 6014 11134 14674 16795 32526
17442C2526K3418K5942n723l1279j7690r763j5714m781J3640m67n477l525j127
$$ 32526 55944 81886 76163 44884 27194 17431 1717 -3064 10576 10109 4632 1107 -20
17429b0J413n34J984P008k144p214j547M28M85M986J693M142k26K824k368qm017
$$ -20 1393 859 2843 9851 7707 493 -1054 -626 -141 4845 6538 10680 10454 13278 10910 10902 6885
17412F885o8J489k4m429M730K535m586l197N75M150O050j577j804m454l071P77
$$ 6885 6817 8306 8282 3853 8583 11118 6532 3335 3910 8060 14110 12533 10729 6275 3204 3981
17396C981N147j550L469M955J883o216J437O83L520n800p951n682Q21j860L02
$$ 3981 9128 7578 11047 16002 17885 11669 13106 13789 17309 11509 3558 -2124 -1303 -3163 -2861
17381b861m995k242N275N615M796J904K388L19o951o03j985M470n793j1484j99
$$ -2861 -7856 -10098 -4823 792 5588 7492 9880 10199 3248 2645 660 5130 -663 -12147 -12346
17366a2346J794K395K036J591j589m196K712L174J86k403O81O945Q381l486k089
$$ -12346 -10552 -8157 -6121 -4530 -6119 -10315 -7603 -4429 -4243 -6646 -5965 980 9361 5875 3786
17351C786l746j030m858l024N068L347L165J404l227l349K611K563k235n248j738
$$ 3786 40 -990 -5848 -8872 -3804 -457 2708 4112 885 -2464 147 2710 475 -4773 -6511
17336f511j867K342L824M056M661R01j720J773J529j021m542l726j834k023k470
$$ -6511 -8378 -6036 -2212 1844 6505 7406 5686 7459 8988 7967 3425 -301 -2135 -4158 -6628
17321f628o42M12J508L366O679j076n602K06k45q84k355O450M220M11K500n578
$$ -6628 -7270 -6858 -5350 -1984 4695 3619 -1983 -1777 -2022 -2906 -5261 1189 5409 5820 8320 2742
17305B742j509j031J882P684j509J974J4490L379l838M3m281q078n385J338q354
$$ 2742 1233 202 2084 9768 8259 10233 24723 28102 24264 24307 20026 11948 6563 7901 -453
17290d53J027l853O89K874Q21P312N562o119p424l596R25o62M485J892o760J04
$$ -453 574 -3279 -2590 284 1105 8417 13979 7860 436 -3160 -2235 -2897 1588 3480 -3280 -3176
17274c176K159J0598N119N55M6q780L493l976m36l799L539k001k809l258n677
$$ -3176 -1017 9581 14700 15255 15301 6521 10014 6038 5602 1803 5342 3341 532 -2726 -8403
17259h403k550P420K882l054j447m412J696J0390L81l34q275n271L168O982j89
$$ -8403 -10953 -3533 -651 -3705 -5152 -9564 -7868 2522 2903 2569 -5706 -10977 -7809 -827 -1016
17244a016R92N664L428k726p705l855M288N509N28l475q51k68L773J670J027N015
$$ -1016 -24 5640 9068 6342 -1363 -5218 -930 4579 5107 1632 781 513 4286 5956 6983 11998
17228A1998l65m071k290j530J945J308J557k300n567J739j004J664N74j448L322
$$ 11998 11633 7562 5272 3742 5687 6995 8552 6252 685 2424 1420 3084 3658 2210 5532
17213E532j91k8r310l682k366J245N172R44l900j5J973j493j239L776J633n376
$$ 5532 5341 5313 -3997 -7679 -10045 -8800 -3628 -2684 -6584 -6599 -4626 -6119 -7358 -3582 -1949 -7325
17197g325l411m036O073M867j927M17r23j655j191n087M084J861q105j636R29
$$ -7325 -10736 -14772 -8699 -3832 -5759 -5342 -6265 -7920 -9111 -14198 -10114 -8253 -16358 -17994 -17065
17182a7065j457J567K182m51n812j60L688P233j855n464j760N083k163L551N521
$$ -17065 -18522 -16955 -14773 -15224 -21036 -21196 -17508 -10275 -12130 -17594 -19354 -14271 -16434 -12883 -7362
17167g362l65l748N99K910L681p826q705M185N051Q25N041k81p889l507N963P093
$$ -7362 -7727 -11475 -10876 -7966 -4285 -12111 -20816 -16631 -11580 -10755 -5714 -5995 -13884 -17391 -11428 -4335
17151d335l729J92J838J317O20k778M048O249K519p066P84M80l948j104K054j810
$$ -4335 -8064 -7872 -6034 -4717 -4097 -6875 -2827 3422 5941 -1125 -341 139 -3809 -4913 -2859 -4669
17135d669j072p462j327L328N60j42Q246m04l590L869O591P42J755j39J343r748
$$ -4669 -5741 -13203 -14530 -11202 -10642 -10784 -2538 -2942 -6532 -2663 3928 4670 6425 6286 7629 -2119
17119b119j1492n183l195N417k37K290k963J732k690k806q64k27J856L590O997
$$ -2119 -13611 -18794 -21989 -16572 -16809 -14519 -17482 -15750 -18440 -21246 -22110 -22337 -20481 -16891 -9894
17104i894j76O81m677k091p51P547Q671o25j798o656n104j69J909j295O95J220
$$ -9894 -10070 -9389 -14066 -16157 -16908 -9361 -690 -1315 -3113 -9769 -14873 -15042 -13133 -14428 -13733 -12513
17088a2513j865j1232R672K7224K3658K064o726j1067j9175j3440J645R998j097
$$ -12513 -14378 -25610 -15938 11286 34944 37008 30282 19215 40 -13400 -11755 -1757 -2854
17075b854l009k212O25M436Q48k023n72m01p082k166k800q80j644K745N163K251
$$ -2854 -5863 -8075 -7450 -3014 -2166 -4189 -4761 -5162 -12244 -14410 -17210 -18090 -19734 -16989 -11826 -9575
17059i575J394m892Q507L396p565J06n49L684P275J326m789q75N989o397n221
$$ -9575 -8181 -13073 -4566 -1170 -8735 -8629 -9178 -5494 1781 3107 -1682 -2557 3432 -2965 -8186
17044h186M663L948N46O834K511n246n919K021l648p715k257k888k45p1M452N291
$$ -8186 -3523 425 971 7805 10316 5070 -849 1172 -2476 -10191 -12448 -15336 -15581 -15652 -11200 -5909
17028e909l682N152Q253m872m059r42L157k496q517q079R57O916K843j77M790
$$ -5909 -9591 -4439 3814 -1058 -5117 -6059 -2902 -5398 -13915 -21994 -21037 -14121 -11278 -11455 -6665
17013f665P497O005R67N187J3748R619J1770O171L60m404j1948j4556p610m007
$$ -6665 832 6837 7804 12991 26739 36358 48128 54299 54659 50255 38307 23751 16141 12134
16999A2134r237l587Rj246K89j081L918L707m741n833j742K75L54n062L514K921
$$ 12134 2897 -690 -681 -1927 -1638 -2719 1199 4906 165 -5668 -7410 -7135 -6781 -11843 -8329 -5408
16983e408J04J381L64l454P08k582l490o102J848Q155N704M85o367r07R668L020
$$ -5408 -5304 -3923 -3559 -7013 -6305 -8887 -12377 -18479 -16631 -8476 -2772 -2287 -8654 -9561 107 3127
16967C127m895J637k3P113j892q744L419l576o590N225K750j747l138o97n34o505
$$ 3127 -1768 -131 -154 6959 5067 -3677 -258 -3834 -10424 -5199 -2449 -4196 -7334 -8031 -8565 -15070
16951a5070j951Q365L609K105K957k557K226k241J431n05K238P433p9q676O85
$$ -15070 -17021 -8656 -5047 -2942 15 -2542 -316 -2557 -1126 -1631 607 8040 7961 -715 -30
16936c0R33r39O900l348J866Q01K235J247k425q503k545k525M665K806j929o345
$$ -30 903 -36 6864 3516 5382 6183 8418 9665 7240 -1263 -3808 -6333 -1668 1138 -791 -7136
16920g136j387J091j834k926K82M856M544J216K183k474K4l445m650l557M179
$$ -7136 -8523 -7432 -9266 -12192 -11910 -7054 -2510 -1294 889 -1585 -1561 -5006 -9656 -13213 -9034
16905i034O321N666K132p70k958k351L810j412n024o312m483K810m72K594K447
$$ -9034 -2713 2953 5085 4315 1357 -994 2816 1404 -3620 -9932 -14415 -11605 -12077 -9483 -7036
16890g036o301j207N083K418j725J69J258J898p374l086O112M443l409P075K196
$$ -7036 -13337 -14544 -9461 -7043 -8768 -8599 -7341 -5443 -12817 -15903 -9791 -5348 -8757 -1682 514
16875E14J425n84o035j0494j22J556M452N672L658l768J590m021r98k373R75N253
$$ 514 1939 1355 -4680 -15174 -15296 -13740 -9288 -3616 42 -3726 -2136 -6157 -7155 -9528 -8553 -3300
16859c300M872Q10m025p366k052K575j245p13L633l201k589m76o886m299J0560
$$ -3300 1572 2382 -1643 -9009 -11061 -8486 -9731 -10444 -6811 -10012 -12601 -13077 -19963 -24262 -13702
16844a3702Q402m3k25p40p181n344R065L602m089k261J927L807k888L577M906
$$ -13702 -5300 -5343 -5568 -6308 -13489 -18833 -9768 -6166 -10255 -12516 -10589 -6782 -9670 -6093 -1187
16829a187n047m42N459M436L044K803J0463N874M917M905J8094K0535J1368j3237
$$ -1187 -6234 -6676 -1217 3219 6263 9066 19529 25403 30320 35225 53319 73854 85222 71985
16815G1985k2588j6785j0098n484j725j068M414l672q719j325J480m341k181L282
$$ 71985 49397 32612 22514 17030 15305 14237 18651 14979 6260 4935 6415 2074 -107 3175
16801C175r75J676l028j517m265m868p162n358k873M829M638L389O968J1003K085
$$ 3175 2200 3876 848 -669 -4934 -9802 -16964 -22322 -25195 -20366 -15728 -12339 -5371 5632 7717
16786G717m494J769L940L42l580L275M58M228m569m630l720j755l545L715j099
$$ 7717 3223 4992 8932 9274 5694 8969 9427 13655 9086 4456 736 -1019 -4564 -849 -1948
16771a948l875m503j938J60j999n44N209O42o814k876L422N56N08N009P316O64
$$ -1948 -5823 -10326 -12264 -12104 -14103 -14647 -9438 -8796 -15610 -18486 -15064 -14508 -14000 -8991 -1675 -1011
16755a011q512r330k571N704R111L878j741K743K162q344o129J172L352L389P591
$$ -1011 -9523 -18853 -21424 -15720 -6609 -2731 -4472 -1729 433 -7911 -14040 -12868 -9516 -6127 1464
16740A464n519o473l228q9K87o514m65M53L572m413k792J411M081L895R478J570
$$ 1464 -4055 -10528 -13756 -13845 -13558 -20072 -20537 -20084 -16512 -20925 -23717 -22306 -18225 -14330 -4852 -3282
16724c282k650j096J434J702k243k358l403Q533L759o383m082P46j207k158k462
$$ -3282 -5932 -7028 -5594 -3892 -6135 -8493 -11896 -3363 396 -5987 -10069 -9323 -10530 -12688 -15150
16709a5150L946P649o890r949Q45K213l694j18n52N482Q943L627M852K520K700
$$ -15150 -11204 -3555 -10445 -20394 -19549 -17336 -21030 -21148 -21700 -16218 -7275 -3648 1204 3724 6424
16694F424N312J4174J6774L3860O1079J01295J55450J33951p6691j72457j19421
$$ 6424 11736 25910 42684 76544 137623 238918 394368 528319 451628 279171 159750
16683A59750o1845l0815j7967n749m491n995p711m597P47L33r7j715l969r082
$$ 159750 97905 67090 49123 43374 38883 32888 25177 20580 21327 21660 21563 19848 15879 6797
16669F797m069o243K287M944k943o164K137K95n930k991J377n88O59O977k83m380
$$ 6797 2728 -3515 -1228 3716 773 -5391 -3254 -2959 -8889 -11880 -10503 -11091 -10432 -3455 -3738 -8118
16653h118N387P486m147j762j346j228J769l779q8M287K614o978n109P64M878
$$ -8118 -2731 4755 608 -1154 -2500 -3728 -1959 -5738 -5826 -1539 1075 -5903 -11012 -10248 -5370
16638e370l113p01o01N522J313n117k767K652K768j828l911N410j446n111L998
$$ -5370 -8483 -9184 -9785 -4263 -2950 -8067 -10834 -8182 -5414 -7242 -11153 -5743 -7189 -12300 -8302
16623h302N348o33j309j516R564L037J468k752k382j866o025m502o844j324K799
$$ -8302 -2954 -3587 -4896 -6412 3152 6189 7657 4905 2523 657 -5368 -9870 -16714 -18038 -15239
16608a5239J320M57j687L243p04M674M043L652k387j331o827J121l525J91n408
$$ -15239 -13919 -13462 -15149 -11906 -12610 -7936 -3893 -241 -2628 -3959 -10786 -9665 -13190 -12999 -18407
16593a8407J843R762j787R26l333J701M805L744L015k465p934k637L756O810J41
$$ -18407 -16564 -6802 -8589 -7663 -10996 -9295 -4490 -746 2269 -196 -8130 -10767 -7011 -201 -60
16578f0j868n553J924K64n330j365k126N197L087J41j645l612l767l805N42J150
$$ -60 -1928 -7481 -5557 -5293 -10623 -11988 -14114 -8917 -5830 -5689 -7334 -10946 -14713 -18518 -17976 -16826
16562a6826k070m957L241Q024M868K04n483K694Q019l494k447k236m773N188p08
$$ -16826 -18896 -23853 -20612 -12588 -7720 -7516 -12999 -10305 -2286 -5780 -8227 -10463 -15236 -10048 -10756
16547a0756m056o469J440O05Q400J2860J939n811j437l615k995l683K507M676
$$ -10756 -14812 -21281 -19841 -19236 -10836 2024 3963 -1848 -3285 -6900 -9895 -13578 -11071 -6395
16533f395o267J319j276K686N304l706o721O49M090n06m500O542P936L410l953
$$ -6395 -12662 -11343 -12619 -9933 -4629 -8335 -15056 -14407 -10317 -10823 -15323 -8781 -845 2565 -1388
16518a388m57l711o049N16j616Q215j177j698J33m260O186N727J360p46m573j476
$$ -1388 -1845 -5556 -11605 -11089 -12705 -4490 -5667 -7365 -7232 -11492 -5306 421 1781 1035 -3538 -5014
16502e014l860o406p114K193j33n93Q503P124l589k643J897L432j259o623J427
$$ -5014 -8874 -15280 -22394 -20201 -20334 -20927 -12424 -5300 -8889 -11532 -9635 -6203 -7462 -14085 -12658
16487a2658m656k063M046L877M814o07j939j020L270J787M719L986K030K65l61
$$ -12658 -17314 -19377 -15331 -11454 -6640 -7247 -9186 -10206 -6936 -5149 -430 3556 5586 5851 5490
16472E490J510P86p758m253K204M712Q986P081J1340Q703n313l229m720j1827
$$ 5490 7000 7786 28 -4225 -2021 2691 11677 18758 30098 38801 33488 30259 25539 13712
16458A3712j300j711p016k266K805p04L805J345m956q519l411m818k819Q566M56
$$ 13712 12412 10701 3685 1419 4224 3520 7325 8670 3714 -4805 -8216 -13034 -15853 -7287 -6831
16443f831l70m966j780M395L144k679P272J0370J390L86m925n470j753J961p30
$$ -6831 -7201 -12167 -13947 -9552 -6408 -9087 -1815 8555 9945 10331 5406 -64 -1817 144 -586
16428e86p08k616j620l594n313p407O01O345M340j808k548j291n21q70K354P045
$$ -586 -1294 -3910 -5530 -9124 -14437 -21844 -21243 -14898 -10558 -12366 -14914 -16205 -16726 -17596 -15242 -8197
16412h197K134J14K569l757o71J866K044p654P5l444K48J154k425k290P815k588
$$ -8197 -6063 -5949 -3380 -7137 -7808 -5942 -3898 -11552 -11477 -14921 -14673 -13519 -15944 -18234 -10419 -13007
16396a3007n627k366J9K122R73n743K529Q643o89R2L173J384J076M930P61Q64
$$ -13007 -18634 -21000 -20981 -18859 -17886 -23629 -21100 -12457 -13146 -13054 -9881 -8497 -7421 -2491 -1730 -866
16380h66J810j404r371K242N862m420j976J624Q444k90m618l07o180n09K103k672
$$ -866 944 -460 -9831 -7589 -1727 -6147 -8123 -6499 1945 1655 -2963 -3270 -9450 -9959 -7856 -10528
16364a0528R66O583J452P82l151n359m498j561p76J169M861m49j089j755P66j369
$$ -10528 -9562 -2979 -1527 -745 -3896 -9255 -13753 -15314 -16090 -14921 -10060 -10509 -11598 -13353 -12587 -13956
16348a3956L528M137p03r03j612l193m865j122L661k092k515N680L653K657j650
$$ -13956 -10428 -6291 -6994 -7897 -9509 -12702 -17567 -18689 -15028 -17120 -19635 -13955 -10302 -7645 -9295
16333i295l566k372J125M852J589K646l687o473j329M125R43p920J048M237l874
$$ -9295 -12861 -15233 -14108 -9256 -7667 -5021 -8708 -15181 -16510 -12385 -11442 -19362 -18314 -14077 -17951
16318a7951q30J1689R720j616p109p389L859K688K57m058j260L157N324N180L41
$$ -17951 -18781 -7092 2628 1012 -6097 -13486 -9627 -6939 -6682 -10740 -12000 -8843 -3519 1661 2002
16303B002r94J10k971k652l480p115o602n111N516L876P09J671m291K430Q815
$$ 2002 1008 1118 -1853 -4505 -7985 -15100 -21702 -26813 -21297 -17421 -16712 -15041 -19332 -16902 -8087
16288h087M411l16m884M793K743j333J199l393p760J883M530o126j0346n618N738
$$ -8087 -3676 -3992 -8876 -4083 -1340 -2673 -1474 -4867 -12627 -10744 -6214 -12340 -22686 -28304 -22566
16273b2566K306J094j262j00K753L494K723L259L255m837p13n85l62O54R112J885
$$ -22566 -20260 -19166 -20428 -20528 -17775 -14281 -11558 -8299 -5044 -9881 -10594 -11179 -11541 -10887 -1775 110
16257A10n551l322j296j421k545j902L268o122n531L995J475M848J265m599Q60
$$ 110 -5441 -8763 -10059 -11480 -14025 -15927 -12659 -18781 -24312 -20317 -18842 -13994 -12729 -17328 -16468
16242a6468M92K445P538L938l017j145L514k861p294o425j421n060Q85J0327O523
$$ -16468 -15976 -13531 -5993 -2055 -5072 -6217 -2703 -5564 -12858 -19283 -20704 -25764 -24879 -14552 -8029
16227h029L458m195n297J932J842L049K818n738Q25j274m535k526L554L975l419
$$ -8029 -4571 -8766 -14063 -12131 -10289 -7240 -4422 -10160 -9335 -10609 -15144 -17670 -14116 -10141 -13560
16212a3560L784k01j172M460K753n177n642K750K370j702j283R192o12m611q099
$$ -13560 -9776 -9977 -11149 -6689 -3936 -9113 -14755 -12005 -9635 -11337 -12620 -3428 -4040 -8651 -16750
16197a6750j899O221j694K162j976o16N167M944L869L012M042J0470J8414J8726
$$ -16750 -18649 -12428 -14122 -11960 -13936 -14552 -9385 -4441 -572 2440 6482 16952 35366 54092
16183E4092K0518J6963r321j9046k3407k9970j2095n753j441J173L228M104N14
$$ 54092 74610 91573 82252 63206 39799 9829 -2266 -8019 -9460 -8287 -5059 -955 -441
16170d41o319j980J008L165P19j35mO50o588Ln27J451K351l470k742k810J0093
$$ -441 -6760 -8740 -7732 -4567 -3848 -3983 -3987 -3337 -9925 -9922 -10449 -8998 -6647 -10117 -12859 -15669 -5576
16153e576J4847r19m243k578o98Q15p414j3958M176j925K522O374O78O6J514k4
$$ -5576 9271 8352 4109 1531 833 1648 -5766 -19724 -15548 -17473 -14951 -8577 -7899 -7833 -6319 -6343
16137f343j856l930l81k601M91k142J362O197K455J703M854n665o30J342P563
$$ -6343 -8199 -12129 -12510 -15111 -14620 -16762 -15400 -9203 -6748 -5045 -191 -5856 -6486 -5144 2419
16122B419N50o325J260R187N569P420O648M387n278r666m050l087j778k863n225
$$ 2419 2969 -3356 -2096 7091 12660 20080 26728 31115 25837 16171 12121 9034 7256 4393 -832
16107h32L187K118n958o28p902m300J378J0056M771K090o307m98O88l905L981
$$ -832 2355 4473 -1485 -2113 -10015 -14315 -12937 -2881 1890 3980 -2327 -2825 -2137 -6042 -2061
16092b061J092k991j0344l617L330K247o61k739J619R558O112P940N29j304l85
$$ -2061 -969 -3960 -14304 -17921 -14591 -12344 -13005 -15744 -14125 -4567 1545 9485 10014 8710 8325
16077H325j0892j982k382m318L682N115M308j180j066j590j107m872L276j705
$$ 8325 -2567 -4549 -6931 -11249 -7567 -2452 1856 676 -390 -1980 -3087 -7959 -4683 -6388
16063f388p330m703L674M811J262N16K973P94M954L427K841J130j1147j613K082
$$ -6388 -13718 -18421 -14747 -9936 -8674 -8158 -5185 -4391 563 3990 6831 7961 -3186 -4799 -2717
16048b717M617o192o551k598L094L183K587O04p27K422J117j080j02j611l373
$$ -2717 1900 -4292 -10843 -13441 -10347 -7164 -4577 -3973 -4700 -2278 -1161 -2241 -2343 -3954 -7327
16033g327m334L923L704k36n486p874k863L524O859L983K473L364o50o956n460
$$ -7327 -11661 -7738 -4034 -4270 -9756 -17630 -20493 -16969 -10110 -6127 -3654 -290 -940 -7896 -13356
16018a3356K140N529J462L977j74L274j552n571L08l318j275r32M949m964j1831
$$ -13356 -11216 -5687 -4225 -248 -422 2852 1300 -4271 -3963 -7281 -8556 -9488 -4539 -9503 -21334
16003b1334M456J1138j33L290M700j120m77K026j713m574j659L387J557k371Q35
$$ -21334 -16878 -5740 -5873 -2583 2117 997 520 2546 833 -3741 -5400 -2013 -456 -2827 -1992
15988a992N30k73j509l894lJ5O408L225j756j700J685k137n89J276m546n99N892
$$ -1992 -1462 -1735 -3244 -7138 -7141 -7126 -718 2507 751 -949 736 -1401 -1990 -714 -5260 -5859 33
15971C3K201K188n823L909p31o119J438M693l402Q0L377l685j845k061k755J4
$$ 33 2234 4422 -1401 2508 1777 -4342 -2904 1789 -1613 -1533 1844 -1841 -3686 -5747 -8502 -8488
15955h488L085k95k311Q69J331k917K019j494l61M788M558P019P052M451j966
$$ -8488 -5403 -5698 -8009 -7140 -5809 -8726 -6707 -8201 -8562 -3774 784 7803 14855 19306 17340
15940A7340q159o863n641k357k369L6Q797M786k68J832l954J942N078K313M39
$$ 17340 9181 2318 -3323 -5680 -8049 -8013 784 5570 5302 7134 3180 5122 10200 12513 12952
15925A2952j67J734Q11j912o030k843n061l89j205m259o58n230J338Q744P689
$$ 12952 12785 14519 15330 13418 7388 4545 -516 -905 -2110 -6369 -7027 -12257 -10919 -2175 5514
15910E514K736j074J396J216j3781j018K030j087j468J350k570O671J1451m308
$$ 5514 8250 7176 8572 9788 -3993 -5011 -2981 -4068 -5536 -4186 -6756 -85 11366 7058
15896G058p610j239P41N473M15k804p541k876Q766N74j523J89L693o408p03K165
$$ 7058 -552 -1791 -1050 4423 4838 2034 -5507 -8383 383 957 -566 -377 3316 -3092 -3795 -1630
15880a630l310O474J30m036m876L462J941m901l26n72M395Q147j983j2491l909
$$ -1630 -4940 1534 1664 -2372 -7248 -3786 -1845 -6746 -7072 -7644 -3249 4898 2915 -9576 -13485
15865a3485l19J815L455L315J0351K909j201j231j949o083p487N020m30k325k203
$$ -13485 -13804 -11989 -8534 -5219 5132 8041 6840 5609 3660 -2423 -9910 -4890 -5320 -7645 -9848
15850i848O550J642p465J056k139j180O53J232n25J939Q98l124j086J697L695
$$ -9848 -3298 -1656 -9121 -8065 -10204 -11384 -10731 -9499 -10024 -8085 -7187 -10311 -11397 -9700 -6005
15835f005j955l359l641O435R123j185q575o362M62K789l72j083m16m15K629N623
$$ -6005 -7960 -11319 -14960 -8525 598 -587 -9162 -15524 -15062 -12273 -12645 -13728 -14144 -14559 -11930 -6307
15819f307K413J405m09N6L097m018J299k28n555K836J572p452L706m515r13P720
$$ -6307 -3894 -2489 -2898 -2842 255 -3763 -2464 -2692 -8247 -5411 -3839 -11291 -7585 -12100 -13013 -5293
15803e293J1192n142l99M601m715J729M902Q52j782n509p782J586M562l69M397
$$ -5293 5899 757 358 4959 244 1973 6875 7727 5945 436 -7346 -5760 -1198 -1567 2830
15788B830q11l006K047K179L02j246n314m569K500J606N71l507k320q3q1J333
$$ 2830 2019 -987 1060 3239 3541 2295 -3019 -7588 -5088 -3482 -2911 -6418 -8738 -8821 -8902 -7569
15772g569M40j113k108n03j881K442M735J940p688m359J025k08O882O950K258
$$ -7569 -7129 -8242 -10350 -10853 -12734 -10292 -5557 -3617 -11305 -15664 -14639 -14847 -7965 -1015 1243
15757A243Q92M54j115l857n674m263P953K763L70n87o127K450L963L045K843q181
$$ 1243 2135 2589 1474 -2383 -8057 -12320 -4367 -1604 -1234 -1821 -7948 -5498 -1535 1510 4353 -3828
15741c828n012j749J547L140O850Q45k891J760J57K878Q914M56L923Q248P184
$$ -3828 -8840 -10589 -9042 -5902 948 1793 -1098 662 819 3697 12611 13067 16990 25238 32422
15726C2422q544l438n495n526m473k173p678m870N881N587J1673P989R294j817
$$ 32422 23878 20440 14945 9419 4946 2773 -4905 -9775 -3894 1693 13366 21355 30649 28832
15712B8832q551J487J0069J82o011n144j586k705O165Q899J977K481N728O740
$$ 28832 20281 21768 31837 32019 26008 20864 19278 16573 22738 31637 33614 36095 41823 48563
15698D8563Q116k286p003n223m152r21m911j1123n173L808J0636J3447M663N294
$$ 48563 56679 54393 47390 42167 38015 37094 32183 21060 15887 19695 30331 43778 48441 53735
15684E3735m382m293n014j0773j3163p961L281K848j820l642o002j095K642M626
$$ 53735 49353 45060 40046 29273 16110 8149 11430 14278 12458 8816 2814 1719 4361 8987
15670H987L899r336M1j753o964J408M307M561O58n949j482j527J74l245J862m17
$$ 8987 12886 3550 3591 1838 -5126 -3718 589 5150 5808 -141 -1623 -3150 -2976 -6221 -4359 -4776
15654d776m095j675o47M43M021K325O87O559J0389N329m980o751j064j310l972
$$ -4776 -8871 -10546 -11193 -10750 -6729 -4404 -3717 2842 13231 18560 13580 6829 5765 4455 483
15639D83m679K871j841k159NN841M040K213j854n427k111N01k02N64q7n151r419
$$ 483 -4196 -1325 -3166 -5325 -5320 521 4561 6774 4920 -507 -2618 -2117 -2319 -1755 -1842 -6993 -16412
15622a6412Q72Q282M692J861O11k111k767M111P98N1k931p453n220L172M539r31
$$ -16412 -15540 -7258 -2566 -705 -94 -2205 -4972 -861 -63 -12 -2943 -10396 -15616 -12444 -7905 -8836
15606h836N89o687k503M403J538p623n206K009M661L202k742k815Q028J1504N473
$$ -8836 -8247 -14934 -17437 -13034 -11496 -19119 -24325 -22316 -17655 -14453 -17195 -20010 -11982 -478 4995
15591D995K13L665m817j512n232m456o299m38P604K198o059K904P57J877n427
$$ 4995 5208 8873 4056 2544 -2688 -7144 -13443 -13881 -6277 -4079 -10138 -7234 -6477 -4600 -10027
15576a0027m304j219M577R238P07j05Q049N349Q575L602P48k514p280n088j716
$$ -10027 -14331 -15550 -10973 -1735 -1028 -1133 6916 12265 20840 24442 25190 22676 15396 10308 8592
15561H592K582m110M00J978J956N472M954j673M061k320m201m79n296n676l885
$$ 8592 11174 7064 7464 9442 11398 16870 21824 20151 24212 21892 17691 17212 11916 6240 2355
15546B355m698K706m913r138k264M62M187j352J567k401n496J451l171O973Q389
$$ 2355 -2343 363 -4550 -13688 -15952 -15490 -11303 -12655 -11088 -13489 -18985 -17534 -20705 -13732 -5343
15531e343p96L006R407P78m974k212k975K8j951M164N665k45n149m275j544p22
$$ -5343 -6139 -3133 6274 7052 2078 -134 -3109 -3081 -5032 -868 4797 4552 -597 -4872 -6416 -7138
15515g138l680k233j943O77M726O919l995l137p083N67K318M546M451n181j050
$$ -7138 -10818 -13051 -14994 -14317 -9591 -2672 -6667 -9804 -16887 -16320 -14002 -9456 -5005 -10186 -11236
15500a1236K274J075m397q018N048K124o539k721L040J640J645M244N814Q56n326
$$ -11236 -8962 -7887 -12284 -20302 -15254 -13130 -19669 -22390 -19350 -17710 -16065 -11821 -6007 -5151 -10477
15485a0477l759m047K95j181k533j5R31P175L910N268J003m478M084J359o978
$$ -10477 -14236 -18283 -17988 -19169 -21702 -21717 -20786 -13611 -9701 -4433 -3430 -7908 -3824 -2465 -9443
15470i443l129J066O563O83q63N697j237k904n192m667J406K309O595L402K602
$$ -9443 -12572 -11506 -4943 -4260 -5123 574 -663 -3567 -8759 -13426 -12020 -9711 -3116 286 2888
15455B888M868J549l51m943l263j960L543K797p044j2405K07P135Q43q212n280
$$ 2888 7756 9305 8954 4011 748 -1212 2331 5128 -1916 -14321 -14114 -6979 -6136 -14348 -19628
15440a9628j027L347P361L176P776Q907M04N546j504n098P36P662P331j0198K666
$$ -19628 -20655 -17308 -9947 -6771 1005 9912 10316 15862 14358 9260 9996 17658 24989 14791 17457
15425A7457L047l248O951K248j896p289l48l140P44o157K240P730N204P80J441
$$ 17457 20504 17256 24207 26455 24559 17270 16922 13782 14526 8369 10609 18339 23543 24323 25764
15410B5764K118J831j1126j2154l512j771J504O989j870q730O6L604j714o37k361
$$ 25764 27882 29713 18587 6433 2921 1150 2654 9643 7773 -957 -891 2713 999 362 -1999
15395a999l005R116J313M918P414J452R79J999L472N741n254n458l491L964R373
$$ -1999 -5004 4112 5425 10343 17757 19209 20188 22187 25659 31400 26146 20688 17197 21161 30534
15380C0534O371J122l076K516j049j614p497k520k087l200p951o549k766O4L720
$$ 30534 36905 38027 34951 37467 36418 34804 27307 24787 22700 19500 11549 5000 2234 2298 6018
15365F018Q51K010l696p937j917n648m73L041L07J812q89m724l70Q85P14j037
$$ 6018 6869 8879 5183 -2754 -4671 -10319 -10792 -7751 -7444 -5632 -6521 -11245 -11615 -10730 -10016 -11053
15349a1053O73M164K211r41j095Q87J504M16j937j949N051j924n407l69q13j051
$$ -11053 -10380 -6216 -4005 -4946 -6041 -5154 -3650 -3234 -5171 -7120 -2069 -3993 -9400 -9769 -10582 -11633
15333a1633m785N77M723j125j323J169N2K870J212M399K378J955J873k523K200
$$ -11633 -16418 -15841 -11118 -12243 -13566 -12397 -12345 -9475 -8263 -3864 -1486 469 2342 -181 2019
15318B019k172m363M191J235M47l268l27p018k015M025J796L004j637n149j152
$$ 2019 -153 -4516 -325 910 1357 -1911 -2238 -9256 -11271 -7246 -5450 -2446 -4083 -9232 -10384
15303a0384K647M59K282J875L085M375r355k306N235K866M573J0387K872m382
$$ -10384 -7737 -7278 -4996 -3121 -36 4339 -5016 -7322 -2087 779 5352 15739 18611 14229
15289A4229m585k957r888L79M142n029k548R095L176o405m324r11N026k15q43
$$ 14229 9644 6687 -3201 -2822 1320 -3709 -6257 2838 6014 -391 -4715 -5626 -600 -815 -1658
15274a658P434p602p381J753N207j933J993M791M12M086O58q298K033K816p0J092
$$ -1658 5776 -1826 -9207 -7454 -2247 -4180 -2187 2604 3016 7102 7760 -538 1495 4311 4241 5333
15258E333K200l2j033m029O467Q925N827N271m269k164r124q069l755p636N93
$$ 5333 7533 7501 6468 2439 8906 17831 23658 28929 24660 22496 13372 5303 1548 -6088 -5495
15243e495K604j698N69k767k652L28M95J146j85k572J680M82k240J805N085N978
$$ -5495 -2891 -4589 -4020 -6787 -9439 -9111 -8616 -7470 -7655 -10227 -8547 -8065 -10305 -8500 -3415 2563
15227B563j095J567P185k750l196R083p210p762j43m097n026M029K485M767j789
$$ 2563 1468 3035 10220 7470 4274 13357 6147 -1615 -1758 -5855 -10881 -6852 -4367 400 -1389
15212a389n543M595N560P015k079r656m943P11M452j311k42l466k377k78o345
$$ -1389 -6932 -2337 3223 10238 8159 -1497 -6440 -5729 -1277 -2588 -2830 -6296 -8673 -8951 -15296
15197a5296L43O776L556l190N210N951K11K235l662k344K504N183Q690j027p262
$$ -15296 -14953 -8177 -4621 -7811 -2601 3350 3561 5796 2134 -210 2294 7477 16167 15140 7878
15182G878l059k993o256l476J0107j104p875l991R066L264K022l435k352j553
$$ 7878 4819 1826 -4430 -7906 2201 1097 -6778 -10769 -1703 1561 3583 148 -2204 -3757
15168c757n344p21M865L926j0476Q58j523M59N122M562q38R717m3n754k517R1
$$ -3757 -9101 -9822 -4957 -1031 -11507 -10649 -12172 -11713 -6591 -2029 -2867 6850 6807 1053 -1464 -1373
15152a373K063J333p693m510J230P40j597M675N579L249M360j765o864p423M969
$$ -1373 690 2023 -5670 -10180 -8950 -8210 -9807 -5132 447 3696 8056 6291 -573 -7996 -3027
15137c027Q961N83q448q035K700L156K015n31r59L860K759K865M801J0054P55
$$ -3027 5934 6517 -1931 -9966 -7266 -4110 -2095 -2626 -3585 275 3034 5899 10700 20754 21509
15122B1509n806m768q63o672l975J511o99k643m246m069j261R67L417j0456l523
$$ 21509 15703 10935 10072 3400 -575 936 237 -2406 -6652 -10721 -11982 -11015 -7598 -18054 -21577
15107b1577M668N971l024K978K506J675j119K497K251p566n53R334M028o266n88
$$ -21577 -16909 -10938 -13962 -10984 -8478 -6803 -7922 -5425 -3174 -10740 -11293 -1959 2069 -4197 -4785
15092d785J738k402o088K050o62k932k968L411O609P148k647j019k724K917j825
$$ -4785 -3047 -5449 -11537 -9487 -10149 -13081 -16049 -12638 -6029 1119 -1528 -2547 -5271 -2354 -4179
15077d179l476j228R420J0701Q63o32p086l382K338j229L934L430j1879l644P702
$$ -4179 -7655 -8883 537 11238 12101 11469 4383 1001 3339 2110 6044 9474 -2405 -6049 1653
15062A653j773o692o365K594M413k892n038P5N386O381q41J085k50j324L015j124
$$ 1653 -120 -6812 -13177 -10583 -6170 -9062 -14100 -14025 -8639 -2258 -3099 -2014 -2264 -3588 -573 -1697
15046a697L713k293n72k082k760j473J871M450R51p197n796j22J0173J286J606
$$ -1697 2016 -277 -849 -2931 -5691 -7164 -5293 -843 108 -7089 -12885 -13007 -2834 -1548 58
15031E8n19p439l292Q589P652o269j2763k268J0757N580O246oj638o299Q363K229
$$ 58 -461 -7900 -11192 -2603 5049 -1220 -13983 -16251 -5494 86 6332 6326 4688 -1611 6752 8981
15015H981k841j29L359L241J997n985o860m677k015k458J914Q364J31J85k314
$$ 8981 6140 6011 9370 12611 14608 8623 1763 -2914 -4929 -7387 -5473 2891 3022 3207 893
15000H93R21M840J618k148l378j685l678J321r797K559N567O686M086on417j60
$$ 893 1814 6654 8272 6124 2746 1061 -2617 -1296 -11093 -8534 -2967 3719 7805 7799 2382 2222
14984B222n495J180q6L08L013R318j058J18O016K307p970K61K59K700K782m172
$$ 2222 -3273 -2093 -2179 -1871 1142 10460 9402 9520 15536 17843 9873 10134 10393 13093 15875 11703
14968A1703j2369q19j463m164m587J925l260K080M859K201J59K137j751j172K591
$$ 11703 -666 -1485 -2948 -7112 -11699 -9774 -13034 -10954 -6095 -3894 -3735 -1598 -3349 -4521 -1930
14953a930N103o210L406J0134O82L151M521m583k346J240r22k808j344m141n312
$$ -1930 3173 -3037 369 10503 11185 14336 18857 14274 11928 13168 12246 9438 8094 3953 -1359
14938a359o841L181O215n762l423n65M077p186n146K411R744N675r94O02M065
$$ -1359 -8200 -5019 1196 -4566 -7989 -8554 -4477 -11663 -16809 -14398 -4654 1021 27 629 4694
14923D694q15K935N716k450j980n702r408N806N013O016k536j991L86J625O129
$$ 4694 3879 6814 12530 10080 8100 2398 -7010 -1204 3809 9825 7289 5298 5684 7309 13438
14908A3438K052m293j174K864R05m385m702N134l94l499j969N733J5351N935R698
$$ 13438 15490 11197 10023 12887 13792 9407 4705 9839 9445 5946 3977 9710 25061 30996 40694
14893D0694K789j703K790j937n83m633j0910r219o637L747l933l251q40N471j911
$$ 40694 43483 41780 44570 42633 42050 37417 26507 17288 10651 14398 10465 7214 6374 11845 9934
14878I934l007l670J756J372k191j585n217o574L596O38J2028R755m607o852l944
$$ 9934 6927 3257 5013 6385 4194 2609 -2608 -9182 -5586 -4948 7080 16835 12228 5376 1432
14863A432r56R317k717n135m317k627p549O116J1267J548J492J512j762k567k44
$$ 1432 476 9793 7076 1941 -2376 -5003 -12552 -6436 4831 6379 7871 9383 7621 5054 4810
14848D810O187J0013P286O12j1361j0820k469L6o46r549L90O986M735K074l797
$$ 4810 10997 21010 28296 28908 17547 6727 4258 4294 3648 -5901 -5511 1475 6210 8284 4487
14833D487J23L720o085L609J2246j099p098k819K848K653q71k865M239K6r70l241
$$ 4487 4610 8330 2245 5854 18100 17001 9903 7084 9932 12585 11714 8849 13088 13114 12144 8903
14817H903m568j007ML764J042J213j903m414p641p918l591N970M610R828K1424
$$ 8903 4335 3328 3332 7096 8138 9351 7448 3034 -4607 -12525 -16116 -10146 -5536 4292 25716
14802B5716K3839J0232m085j9009j8780j5821m424M12J023K796j489p94O829N634
$$ 25716 49555 59787 55702 36693 17913 2092 -2332 -1920 -897 1899 410 -384 6445 12079
14788A2079J473L300k110j806Q141n292o910k609r68j122O887M594N087k372N15
$$ 12079 13552 16852 14742 12936 21077 15785 8875 6266 5298 4176 11063 15657 20744 18372 18887
14773A8887m947n118k805n188R46R199J188O540j932o750m011j32K85M070Q275
$$ 18887 13940 8822 6017 829 1775 10974 12162 18702 16770 10020 6009 5877 6162 10232 18507
14758A8507J1298P681j309o308p737j238M183O145n915m862l625J711P148P53
$$ 18507 29805 37486 36177 29869 22132 20894 25077 31222 25307 20445 16820 18531 25679 26432
14744B6432O18k295q16K442m738n394J828K99J784q62k409p378Q073O406M749
$$ 26432 27050 24755 23939 26381 21643 16249 18077 18376 20160 19298 16889 9511 17584 23990 28739
14729B8739m319o002k011Q535J0676J0929O345R765L4P21p09n028j4360j3448
$$ 28739 24420 18418 16407 24942 35618 46547 52892 62657 62691 63412 62703 57675 43315 29867
14715B9867q747k945l646l790O276L797M340P926m199k759J1396j281q191l803
$$ 29867 21120 18175 14529 10739 17015 20812 25152 33078 28879 26120 37516 36235 28044 24241
14701B4241k618l121o351k949O032M842K761L883K452L004j71N607M582L227L364
$$ 24241 21623 18502 12151 9202 15234 20076 22837 26720 29172 32176 32005 37612 42194 45421 48785
14686D8785q701K497N716R531O653P61m309p220K148M211P28r86j1053j2720q47
$$ 48785 40084 42581 48297 57828 64481 65242 60933 53713 55861 60072 60800 59814 48761 36041 35194
14671C5194P25n291J575M179K782N552O531N97J036n696q734p098l163L577l249
$$ 35194 35919 30628 32203 36382 39164 44716 51247 51844 52880 47184 38450 31352 28189 31766 28517
14656B8517k691j435M693O61m733n646J946M85M32L443K325M912k326p539r87
$$ 28517 25826 24391 29084 29745 25012 19366 21312 21797 22229 25672 27997 32909 30583 23044 22057
14641B2057O965N086p611q95K919J033k168k983J145M765J569l950N086L173Q498
$$ 22057 29022 34108 26497 25602 28521 29554 27386 24403 25548 30313 31882 27932 33018 36191 44689
14626D4689J4668P456j962r728p325l638l243n130l621M242M51M9n439k205j787
$$ 44689 59357 66813 64851 55123 47798 44160 40917 35787 32166 36408 36859 36908 31469 29264 27477
14611B7477k059P634N533o029J422Q702O712o000p443k555O709Q6l51l817m107
$$ 27477 25418 33052 38585 32556 33978 42680 49392 43392 35949 33394 40103 40189 39838 36021 31914
14596C1914k803m509o709n116J027O368R275R696j31R898O933M667k209o828j515
$$ 31914 29111 24602 17893 12777 13804 20172 29447 39143 39012 48910 55843 60510 58301 51473 49958
14581D9958L164n867n371K507R972N350P664N952J7928K4584L5257L3685K7922
$$ 49958 53122 47255 41884 44391 54363 59713 67377 73329 91257 115841 151098 184783 212705
14568B12705J7030Q247j1207l4708l2024k8756k3551j9260q414j1064j0794j255
$$ 212705 229735 237982 226775 192067 160043 131287 107736 88476 80062 68998 58204 56949
14556E6949N00P022J04q416m82l159n728J313k126K686n331N082p7j2225j0923
$$ 56949 57449 64471 64575 56159 55677 52518 46790 48103 45977 48663 43332 48414 48337 36112 25189
14541B5189k87L744M293L603J504n38J002J034M364R248J212O296l645Q90n99
$$ 25189 24902 28646 32939 36542 38046 37508 38510 39544 43908 53156 54368 60664 57019 57909 57310
14526E7310N164J6189J0562j531r058r83j0066j2290K293j880o853p81K364N402
$$ 57310 62474 78663 89225 87694 78636 77653 67587 55297 57590 55710 48857 48076 50440 55842
14512E5842N410n671m522P31L046k784Q43n893p882j701p19p114K996J3117q485
$$ 55842 61252 55581 51059 51790 54836 52052 52895 47002 39120 37419 36700 29586 32582 45699 37214
14497C7214l328K275o51R6O458K298Q949M895k940J149n088o788J965L737P344
$$ 37214 33886 36161 35510 35606 42064 44362 53311 58206 55266 56415 51327 44539 46504 50241 57585
14482E7585O277l276j348j2816r175L054Q824O428l913m091J138L154K297m276
$$ 57585 63862 60586 59238 46422 37247 40301 49125 55553 51640 47549 48687 51841 54138 49862
14468D9862o555l024J00Q299J02j327j467k555K69M836N500j498r77k100L81l767
$$ 49862 43307 40283 40383 48682 48784 47457 45990 43435 43704 48540 54040 52542 51565 49465 49846 46079
14452D6079l399L933L612J238L098L490k183K390J802m241r52k960n620k48J84
$$ 46079 42680 46613 50225 51463 54561 58051 55868 58258 60060 55819 54867 51907 46287 46039 46223
14437D6223O852J303N843L124p920K200J149p238n85N534m766m090J0936P381
$$ 46223 53075 54378 60221 63345 55425 57625 58774 51536 50951 56485 51719 47629 58565 65946
14423F5946l519j0095p774j411K858m612n54Q985O772p15P503J838J696N557k704
$$ 65946 62427 52332 44558 43147 46005 41393 40839 49824 56596 55881 63384 65222 66918 72475 69771
14408F9771R75k428k785m212k015M152o117m308j762M824l784j256J700m650J311
$$ 69771 70746 68318 65533 61321 59306 63458 57341 53033 51271 56095 52311 51055 52755 48105 49416
14393D9416J300k587k223N932k165n783J607K416M145m018m026L158L195j866
$$ 49416 50716 48129 45906 51838 49673 43890 45497 47913 52058 48040 44014 47172 50367 48501
14379D8501m464k059p321P0j966N758J1003J379J571q036m970J062O65O357K289
$$ 48501 44037 41978 34657 34727 32761 38519 49522 50901 52472 44436 39466 40528 41193 47550 49839
14364D9839Q988J0936r32p785J530k757j423M574Q66p947m354K150J735o364k498
$$ 49839 58827 69763 68831 61046 62576 59819 58396 62970 63836 55889 51535 53685 55420 49056 46558
14349D6558R950P094m892n538l042P37K39K95O138N415J68j928l097r73j0617
$$ 46558 56508 63602 58710 53172 50130 50867 51106 51401 57539 62954 63122 61194 58097 57124 46507
14334D6507J781J0048j858j662k420n335q08q78j890O833J0055L658q693k099
$$ 46507 48288 58336 56478 54816 52396 47061 46253 45375 43485 50318 60373 64031 55338 53239
14320E3239J0743N107k831m371o2k801q439l998m4N095N644K526m333l188k443
$$ 53239 63982 69089 66258 61887 61825 59024 50585 46587 46543 51638 57282 59808 55475 52287 49844
14305D9844k350l842R57q29j435j049M103Q860L330J1397O323k148p155L11K286
$$ 49844 47494 43652 44609 43780 42345 41296 45399 54259 57589 68986 75309 73161 66006 66317 68603
14290F8603j258j036P47l975r145J356M877N250k543j1516j913J072L280J733
$$ 68603 67345 66309 67056 63081 53936 55292 60169 65419 62876 51360 49447 50519 53799 55532
14276E5532j121l90K406q723N490K458j235L827K82j015J119l727J841k170r49
$$ 55532 54411 54021 56427 47704 53194 55652 54417 58244 58526 57511 58630 54903 56744 54574 53625
14261E3625k452Q70q19k313k208L148n43M941J871n152K04P790l958m456p76l125
$$ 53625 51173 52043 51224 48911 46703 49851 49308 54249 56120 50968 51172 58962 55004 50548 49772 46647
14245D6647M012L97K184L827L566J288k956N05l017j0786k805j151k675O349J0081
$$ 46647 50659 51056 53240 57067 60633 61921 58965 59470 56453 45667 42862 41711 39036 45385 55466
14230E5466j693j111p60j696N269K919N501L698m415p503l58L700P00j646K088
$$ 55466 53773 52662 51902 50206 55475 58394 63895 67593 63178 55675 55317 59017 59717 58071 60159
14215F0159N66K055k650m881j675P024l016n969R058M389m095K492l151p986n449
$$ 60159 60725 62780 60130 55249 53574 60598 57582 51613 60671 65060 60965 63457 60306 52320 46871
14200D6871n00L973L622L295n60r598l359r62J469N117l009L072Q252K00n449
$$ 46871 46371 50344 53966 57261 56701 47103 43744 42782 44251 49368 46359 49431 57683 57883 52434
14185E2434j951k91m324K382P311L997L793n152m616N891L367k446l133j845M728
$$ 52434 50483 50192 45868 48250 55561 59558 63351 58199 53583 59474 62841 60395 57262 55417 60145
14170F0145Q391j927l462k410N09M725L738n088j658l780J490L035J761k879m441
$$ 60145 68536 66609 63147 60737 61246 65971 69709 64621 62963 59183 60673 63708 65469 62590 58149
14155E8149j789L774J223L686m136p76J59J914K165n38L310J672j696M041J865
$$ 58149 56360 60134 61357 65043 60907 60131 60290 62204 64369 63831 67141 68813 67117 71158 73023
14140G3023q081l699L425N922k536k622o529L709N077M804J780J955K842r00J435
$$ 73023 64942 61243 64668 70590 68054 65432 58903 62612 67689 72493 74273 76228 79070 78170 79605
14125G9605k188p241j668J743n043k150J727l373l867M063N397K662M334J961
$$ 79605 77417 70176 68508 70251 65208 63058 64785 61412 57545 61608 67005 69667 74001 75962
14111G5962J41l386j135l421j826N499r15o33M433j68k153p376M559K652j910
$$ 75962 76103 72717 71582 68161 66335 71834 70919 70286 74719 74551 72398 65022 69581 72233 70323
14096G0323J06O544K984m326o284K684r01m925n82P924N881q56J106O350n717
$$ 70323 70429 76973 79957 75631 69347 72031 71130 66205 65623 73547 79428 78572 79678 86028 80311
14081H0311o815n398j602L227k797p526k215P494Q727Q719Q80K801J2593J5220
$$ 80311 73496 68098 66496 69723 66926 59400 57185 64679 73406 82125 83005 85806 98399 113619
14067A13619O979N336n228j4343j1641p344l668j881K307M467L839J929j182j586
$$ 113619 120598 125934 120706 106363 94722 87378 83710 81829 84136 88603 92442 94371 93189 91603
14053I1603j533K555l540k625j820N11o298M077K711Q20J329L605m919k733L905
$$ 91603 90070 92625 89085 86460 84640 85151 78853 82930 85641 86461 87790 91395 86476 83743 87648
14038H7648L359m61M372n946k067L868J693l440J612j4j605n76J177L281K083
$$ 87648 91007 90546 94918 88972 86905 90773 92466 89026 90638 90624 89019 88443 89620 92901 94984
14023I4984q001n514O771J0015p66J340j20m979N631L579j447k399J352p900k267
$$ 94984 86983 81469 88240 98255 97489 98829 98709 93730 99361 102940 101493 99094 100446 92546 90279
14008I0279L074j069L215M351M402j302j261q94k616j912j203q47R77p75L692
$$ 90279 93353 92284 95499 99850 104252 102950 101689 100795 98179 96267 95064 94217 95194 94419 98111
13993I8111M059K526n741j999N120J217L520l179o883j191n681M76N187N532Q879
$$ 98111 102170 104696 98955 96956 102076 103293 106813 103634 96751 95560 89879 90355 95542 101074 109953
13978A09953N629L568o181j1501n439P5N346P185Q70K067P75m052j548j892O027
$$ 109953 115582 119150 112969 101468 96029 96104 101450 108635 109505 111572 112347 108295 106747 104855 110882
13963A10882n975q395L953O788L410k533k662L157J0398m35q151J353O9K474N096
$$ 110882 104907 96512 100465 107253 110663 108130 105468 108625 119023 118588 110437 111790 111859 114333 119429
13948A19429l42kl284m759l468j157K750P495l68o222L792L458j485p08k107l807
$$ 119429 119087 119085 115801 111042 107574 106417 109167 116662 116294 110072 113864 117322 115837 115129 113022 109215
13932A09215j283O836R582P419L812q101m163l725p76L937r653n460K176J462
$$ 109215 107932 114768 124350 131769 135581 127480 123317 119592 118816 122753 113100 107640 109816 111278
13918A11278k032J996p21O28Q461L277k501m560P2N706J983k282r764j932L410
$$ 111278 109246 111242 110521 111149 119610 122887 120386 115826 115898 121604 123587 121305 111541 109609 113019
13903A13019M604L688j773o226j620O093N013j23p534m241J272O016N178K037
$$ 113019 117623 121311 119538 113312 111692 117785 122798 122675 115141 110900 112172 118188 123366 125403
13889A25403k818L001M47J438l09K309J496K017j240k325M195J3050k903o663
$$ 125403 122585 125586 126033 127471 127162 129471 130967 132984 131744 129419 133614 146664 143761 137098
13875A37098N17r321j0190R02P514P090K706k690J881L258j304Q82J386k019k78
$$ 137098 137615 128294 118104 119006 126520 133610 136316 133626 135507 138765 137461 138343 139729 137710 137432
13860A37432m309r68j371J388K638q95L027k281K263l438j269o32J438O377J1206
$$ 137432 133123 132155 130784 132172 134810 133915 136942 134661 136924 133486 132217 131585 133023 139400 150606
13845A50606J8672J8308o923j3463r625p849J339qP84m972m377L478m925L823
$$ 150606 169278 187586 180663 167200 157575 149726 151065 151057 151841 146869 142492 145970 141045 144868
13831A44868K467p878K452L320K189j186L774k394j991k927M07L004k804k651
$$ 144868 147335 139457 141909 145229 147418 146232 150006 147612 145621 142694 143101 146105 143301 140650
13817A40650L965j120J46K057P57M09M350L834j128j514Q75L370r056o335L14
$$ 140650 144615 143495 143641 145698 146455 146864 151214 155048 153920 152406 153281 156651 147595 141260 141574
13802A41574J2005L380r556p394J814O604N238O65o91j430j460L25K649J947j858
$$ 141574 153579 156959 147403 140009 141823 148427 153665 154330 153639 152209 150749 151074 153723 155670 153812
13787A53812k282j444K718N089L787r37O525J543o506K631M841m11n967N197Q182
$$ 153812 151530 150086 152804 157893 161680 160743 167268 168811 162305 164936 169777 169366 163399 168596 176778
13772A76778J717m190L234R284J681J807N478R633J1075L710k471l981l93j0712
$$ 176778 178495 174305 177539 186823 188504 190311 195789 205422 216497 220207 217736 213755 213362 202650
13758B02650j2584n056M010K447j558Q505N790J6994L3436L0514M1939O0432O8489
$$ 202650 190066 185010 189020 191467 189909 198414 204204 221198 254634 285148 327087 387519 456008
13745D56008M3845J336l5870o0631n8278m4039k8776j3872q229j724n644l280
$$ 456008 499853 501189 465319 404688 346410 302371 273595 259723 251494 249770 244126 240846
13733B40846l320p131Q69K087J265r59j746M152M852R219J0287R073j60j4354
$$ 240846 237526 230395 231264 233351 234616 233657 231911 236063 240915 250134 260421 269494 269334 254980
13719B54980q975r00J208P560Q324q58l385p24J4981J7714K5851M2204P1630J10433
$$ 254980 246005 245105 246313 253873 262197 261339 257954 257230 272211 289925 315776 357980 429610 540043
13705E40043J28877J28846R6974n132j08306j42097j26249r2744o0590l5008k2987
$$ 540043 668920 797766 894740 889608 781302 639205 512956 420212 359622 324614 301627
13694C01627j3458j2622p251l842p100k873m947j143k178n224m414N471K128L173
$$ 301627 288169 275547 268296 264454 257354 254481 249534 248391 246213 240989 236575 242046 244174 247347
13680B47347J0321l813m89n632r12k055P12J921J171K314J415K26Q763J1883J6881
$$ 247347 257668 253855 253366 247734 246822 244767 245479 247400 248571 250885 252300 252526 261289 273172 290053
13665B90053L4571M3794N5686N8922N1270O678m9884p7712o1850m5297l2414j9121
$$ 290053 324624 368418 424104 483026 534296 540974 491090 413378 351528 306231 273817 254696
13653B54696j6826j1527n399n681l081j518k446j0958P28K653q82L194K543j694
$$ 254696 237870 226343 220944 215263 212182 210664 208218 197260 197988 200641 199759 202953 205496 203802
13639B03802m893k568l672m275k186M086N154J1741J166r93k548l59O96o324o108
$$ 203802 198909 196341 192669 188394 186208 190294 195448 207189 208355 207362 204814 204455 205151 198827 192719
13624A92719j298M781l986M123J107o114o511L5k995J873k837L913Q630j605p945
$$ 192719 191421 196202 192216 196339 197446 191332 184821 184856 181861 183734 180897 184810 193440 191835 183890
13609A83890q04K519k422j657L471K943o672L002N53k84L915k450r935j454P033
$$ 183890 183086 185605 183183 181526 184997 187940 181268 184270 184823 184539 188454 186004 176069 174615 181648
13594A81648Q394L854K385j76q67j0338r95M499l371m219m082J773R357P396k651
$$ 181648 190042 193896 196281 196105 195238 184900 183905 188404 185033 180814 176732 178505 187862 195258 192607
13579A92607j4048k882K35k060M713Q390Q95l341k227j087M145N94o226p033l363
$$ 192607 178559 175677 175912 173852 178565 186955 187850 184509 182282 181195 185340 185934 179708 172675 169312
13564A69312k152P126K068j227N019K548l820K6P816L944n902p157N051M89K693
$$ 169312 167160 174286 176354 175127 180146 182694 178874 178900 186716 190660 184758 177601 182652 183141 185834
13549A85834O113N616Q69l403l786m013K187j878l658L38j602Q58K374M964m07
$$ 185834 191947 197563 198432 195029 191243 187230 189417 187539 183881 184219 182617 183475 185849 190813 190406
13534A90406n787n926l803L293M427m319p166N524L320j439K333l960m550m726
$$ 190406 184619 178693 174890 178183 182610 178291 171125 176649 179969 178530 180863 176903 172353 167627
13520A67627n011n20k092O710N560O080K235O658J880K178o827j0616n550J794
$$ 167627 162616 162096 160004 166714 172274 178354 180589 187247 189127 191305 184478 173862 168312 170106
13506A70106M860M142n922J079q77n059j1350K63M323P089N85M950k89O756k912
$$ 170106 174966 179108 173186 174265 173388 168329 156979 157242 161565 168654 169239 174189 173900 180656 177744
13491A77744j60K559l697j044j089K573L337m67j63j286k606N401R352k621p482
$$ 177744 177584 180143 176446 175402 174313 176886 180223 179756 179593 178307 175701 181102 190454 187833 180351
13476A80351o158m131k066N346L935k373m388k030J350J130p508K065M308m351
$$ 180351 174193 170062 167996 173342 177277 174904 170516 168486 169836 170966 163458 165523 169831 165480
13462A65480O88m177J87l452L39J912K504n448J067N89M616j587k766N26N527
$$ 165480 166168 161991 162178 158726 159065 160977 163481 158033 159100 159689 164305 162718 159952 160478 166005
13447A66005k193j752K994j55l175l737j93j79l152P757j293n753k84k212O97
$$ 166005 163812 162060 165054 164899 161724 157987 157794 157615 154463 162220 160927 155174 154890 152678 153375
13432A53375J836L801K403o71J431j380l02J364m136m699l700j378M063L81L01
$$ 153375 155211 159012 161415 160744 162175 160795 160493 161857 157721 153022 149322 147944 152007 152388 152689
13417A52689k929p59K904M509K391k109l916p640n140o60L38j011L936M534M14
$$ 152689 149760 149001 151905 156414 158805 156696 152780 145140 140000 139340 139678 138667 142603 147137 147551
13402A47551n42j434K020k547L694N394k875j86j047J16O061l275l286j219o30
$$ 147551 147009 145575 147595 145048 148742 154136 151261 151075 150028 150144 156205 152930 149644 148425 147795
13387A47795j857L29J786P255m413p77L37m814o047k221L803m353M657O531N765
$$ 147795 145938 146267 148053 155308 150895 150118 150455 145641 139594 137373 141176 136823 141480 148011 153776
13372A53776K252l923n135j401k082n756n9P528K03j310K56k072J003n313q59
$$ 153776 156028 152105 146970 145569 143487 137731 137672 145200 145403 144093 144349 142277 143280 137967 137108
13357A37108k503K723R33l33l208Q42P167p62o906K985J0335k534l387P306J005
$$ 137108 134605 137328 138261 137928 134720 135562 142729 141967 135061 138046 148381 145847 142460 149766 150771
13342A50771j0096m489l164l279M430M908O027K69L442J1245J0629J4225J4815
$$ 150771 140675 136186 133022 129743 134173 139081 145108 145377 148819 160064 170693 184918 199733
13329A99733P140r358j7094j3491l140o279j566o98K668k570k762J204M676L00
$$ 199733 206873 197515 180421 166930 163790 157511 155945 155247 157915 155345 152583 153787 158463 158763
13315A58763l604n234j1557j0003m925J747j271m712M414J2099M2r000r271K336
$$ 158763 155159 149925 138368 128365 123440 125187 123916 119204 123618 135717 135759 126759 117488 119824
13301A19824M455Q289O145O613J409l367j686q60J159m567Q547O229Q880J9435
$$ 119824 124279 132568 138713 145326 146735 143368 141682 140822 141981 137414 145961 152190 161070 180505
13287A80505K6767M5323O5770N7725o717o3353n8727l5535j1977k815q551k750
$$ 180505 207272 252595 318365 376090 369373 306020 247293 211758 199781 196966 188415 185665
13275A85665Q265L022o807j1283m518n971o038p730r667o41m527M378J54P023
$$ 185665 193930 196952 190145 178862 174344 168373 162335 154605 144938 144297 139770 144148 144302 151325
13261A51325R045J753p758q040o622q955m697l311N266N976J735J4018Q736K694
$$ 151325 160370 162123 154365 146325 139703 130748 126051 122740 128006 133982 135717 149735 158471 161165
13247A61165M501M05M174r64J4129K7786L5982N0732N2163R011m9539n9521l6375
$$ 161165 165666 166071 170245 169281 183410 211196 247178 297910 350073 359084 309545 250024 213649
13234B13649j5680o503o963J160l206k898k835n221o569n334j0533j0743k21K093
$$ 213649 197969 191466 184503 185663 182457 179559 176724 171503 164934 159600 149067 138324 138103 140196
13220A40196n002m068M227R277M888l175j939J377J5074J8639J7600J8770O444
$$ 140196 135194 131126 135353 144630 149518 146343 144404 145781 160855 179494 197094 215864 222308
13207B22308n191n765j6425j7644k137j363j874M17J460J3824J5517J6532J3750
$$ 222308 217117 211352 194927 177283 175146 173783 171909 172326 173786 187610 203127 219659 233409
13194B33409K5220J1776j8828l5249k4809k3813j6150n644n628P20M210k745j907
$$ 233409 258629 270405 251577 216328 191519 167706 151556 145912 140284 141004 145214 142469 140562
13181A40562m548q195o025J0245J1381R972M133L607J0149J1961N902R846J4960
$$ 140562 136014 127819 121794 132039 143420 153392 157525 161132 171281 183242 189144 198990 213950
13168B13950J8342J4287l154j6943k5348k5134j6781j3167j3611j652M342J5399
$$ 213950 232292 246579 243425 226482 201134 176000 159219 146052 132441 130789 135131 150530
13156A50530J9039J6206J5962K0022K7726K2253j0863k9587l0469k9069j9949
$$ 150530 169569 185775 201737 221759 249485 271738 260875 231288 200819 171750 151801
13145A51801j1958j6214r124P750J53j1632j4787n634j638J073k191j07J602N486
$$ 151801 139843 123629 114505 122255 122408 110776 95989 90355 88717 89790 87599 87492 89094 94580
13131I4580J1917Q715l395K689J0897P254L897N540o786j5171j3163j1520o862
$$ 94580 106497 115212 111817 114506 125403 132657 136554 142094 135308 120137 106974 95454 88592
13118H8592k083O454M082M712J3403N817P239Q387M315j452Q272N993j5407j8165
$$ 88592 86509 92963 97045 101757 115160 120977 128216 136603 140918 139466 147738 153731 138324 120159
13104A20159j2155o417m690m315l839m055K580Q616N58n252m644K658L18n843
$$ 120159 108004 101587 96897 92582 88743 84688 87268 95884 96442 91190 86546 89204 89522 83679
13090H3679m149r497P12K654l119m845J424j859l629L396N387K092j0390l382
$$ 83679 79530 70033 70745 73399 70280 65435 66859 65000 61371 64767 70154 72246 61856 58474
13076E8474J0476k85p2k036J401L069m808J067J893N013M643L103O283J1038M300
$$ 58474 68950 68665 68593 66557 67958 71027 66219 67286 69179 74192 78835 81938 88221 99259 103559
13061A03559J170o993N57l312j1204j1533n606K321j795L089o24N022K426j083
$$ 103559 104729 97736 98293 94981 83777 72244 66638 68959 67164 70253 69629 74651 77077 75994
13047G5994Q753J2849J0260O565j38j4346o700N05p309j2208o637q16k535l987
$$ 75994 84747 97596 107856 114421 114283 99937 93237 93742 86433 74225 67588 66772 64237 60250
13033F0250L250P990P457Q913N935J3622P072j738J333l680j1566q476p306k375
$$ 60250 63500 71490 78947 87860 93795 107417 114489 112751 114084 110404 98838 90362 83056 80681
13019H0681N504M282J80k17Q716P526J3447J4624J1998K5896L8250N2577O9352
$$ 80681 86185 90467 90647 90430 99146 106672 120119 134743 146741 172637 210887 263464 332816
13006C32816J12135J84802L00979M31909M21474K8731m45079m56300k91122j61508
$$ 332816 444951 629753 930732 1362641 1784115 1812846 1367767 911467 620345 458837
12996D58837j08308o3278n0533l8867k0379j4675j3339p875n235o965n513o533
$$ 458837 350529 287251 236718 197851 177472 162797 149458 141583 136348 129383 123870 117337
12984A17337m488j4002o952p051l396o791n914J748k757R16K476O615M866P771
$$ 117337 112849 98847 91895 84844 81448 74657 68743 70491 67734 68650 71126 77741 82607 90378
12970I0378O553M497o463o376k304J856L151P219J764Q561J4418J1911L739k680
$$ 90378 96931 101428 94965 88589 86285 88141 91292 98511 100275 108836 123254 135165 138904 136224
12956A36224o381j6074j2622k17k153r249J630P809k530q910j706J135k349m397
$$ 136224 129843 113769 101147 100930 98777 89528 91158 98967 96437 87527 85821 86956 84607 80210
12942H0210N681J1705O150J57O2r588k390r45K265L248M899o110m290N424l651
$$ 80210 85891 97596 103746 103903 103965 94377 91987 91042 93307 96555 101454 95344 91054 96478 92827
12927I2827j469n125m662m442N690J6175O32j294J303L302O964N39j0257j0866
$$ 92827 91358 86233 81571 77129 82819 98994 99626 98332 99635 102937 109901 110440 100183 89317
12913H9317p042r212J648L387P796O157P819N687j482k586l250n202l889n51j221
$$ 89317 82275 73063 74711 78098 85894 92051 99870 105557 104075 101489 98239 93037 89148 88597 87376
12898H7376p44n532j0039L306L294k552j597O745L246O158Q629N992j0135r574
$$ 87376 86632 81100 71061 74367 77661 75109 73512 80257 83503 89661 98290 104282 94147 84573
12884H4573m905l25Q683R47j964N978J031R287R073m355j0106q94M249J1019J4368
$$ 84573 79668 79343 88026 88973 87009 92987 94018 103305 112378 108023 97917 97023 101272 112291 126659
12869A26659R19p767J984J4141J5904J9871J8486o495k7703j7591J456J1096J0061
$$ 126659 127578 119811 121795 135936 151840 171711 190197 183702 155999 138408 139864 150960 161021
12856A61021J4554R855L819o192j9388j8744k0814q962K107P2L85J1597J5663
$$ 161021 175575 185430 189249 183057 163669 144925 124111 115149 117256 117328 117713 129310 144973
12843A44973J5495R331K1193J9464O533K306M175K9644M0371L0158N1724J02210
$$ 144973 160468 169799 190992 210456 216989 219295 223470 253114 293485 323643 375367 477577
12831D77577J82422K85063L48548J69559k62876l72458k35640j20212o7535l2896
$$ 477577 659999 945062 1293610 1463169 1200293 827835 592195 471983 404448 371552
12821C71552l0359k2061o085n943n364K0076K1674K1894M3404M5838K8311l656
$$ 371552 341193 319132 313047 307104 301740 321816 343490 365384 408788 454626 482937 479281
12809D79281k4532k3298J127J4496J7067J5154L1743P4837J17389J71497K14433
$$ 479281 454749 431451 432578 447074 464141 479295 511038 585875 703264 874761 1089194
12798A089194K58155M35801Q03418J370946J874374R22144j641090j847210j110591
$$ 1089194 1347349 1783150 2586568 3957514 5831888 6754032 5112942 3265732 2155141
12789B155141o00001l29123j94528j32008r2199o0939k3004k587k437j4832l7035
$$ 2155141 1555140 1226017 1031489 899481 807282 746343 723339 720752 718315 703483 666448
12778F66448k4797O52K0798O874o660m16J3814M0097Q5758J39838J92038K16730
$$ 666448 641651 642303 663101 669975 663315 662899 676713 716810 802568 942406 1134444 1351174
12766A351174K41242J80102j0422J208K04321L02240p5416m98232m25615k36843
$$ 1351174 1592416 1772518 1762096 1763304 1967625 2269865 2194449 1696217 1270602 1033759
12756A033759j06973n0367l0936k4700l6751n3488l9597k0717j5854q75J7002
$$ 1033759 926786 876419 845483 820783 784032 730544 690947 670230 654376 653501 670503
12745F70503M1711N7063O5083L3805m9913p1998k9351j1562L269K5097L9115M5326
$$ 670503 712214 769277 834360 868165 818252 746254 716903 705341 708610 733707 772822 818148
12733H18148M3203K6308m1458p1687m0442O248M726j4488q639j2972j7717n944
$$ 818148 861351 887659 846201 774514 734072 740320 745046 730558 721919 708947 691230 685286
12721F85286N381M2384R0575R7554Q122p9586r6588p9080o4422l7792M52J1963
$$ 685286 690667 733051 823626 921180 929302 849716 753128 674048 609626 571834 572286 584249
12709E84249j2443k8964k3610k3862j4083R763P106m816j2295j2235m47J3755
$$ 584249 571806 542842 519232 495370 481287 491050 498156 493340 481045 468810 468363 482118
12697D82118J7902L3642O8210R4425O3747M0457O4303J08298J67058K40638M03100
$$ 482118 500020 533662 601872 696297 760044 800501 864804 973102 1140160 1380798 1783898
12686A783898O91329R78761P88450l69303r23024p22225n20659l46923k15942
$$ 1783898 2475227 3453988 4242438 3873135 2950111 2227886 1707227 1360304 1144362
12677A144362j50150j09109p0017m1859j7979K652K3779K1884L522Q98p774R144
$$ 1144362 994212 885103 815086 773227 755248 757900 781679 803563 807085 807983 800209 809353
12665H09353J6614k1373l8540m1236l1193l9821m2608l5276j7350q548p392O658
$$ 809353 825967 804594 766054 724818 693625 653804 611196 575920 558570 550022 542630 549288
12653E49288K1669K5422K5220J5057j4250j7642k065L0213L5657L2166L7836P0072
$$ 549288 570957 596379 621599 636656 622406 604764 602699 632912 668569 700735 738571 808643
12641H08643J13290Q7608m6003r0118l2074Q618K5627J2207m9911q0159o2839
$$ 808643 921933 1009541 963538 873420 841346 849964 875591 887798 837887 757728 694889
12630F94889l4817q198M141J1266Q127M002J16J1077K2147M779k3887l1697k2368
$$ 694889 660072 651874 656015 667281 675408 679410 679526 690603 712750 717529 693642 661945 639577
12617F39577j6158O372L3639M2706J4870j009K0399K4869M214j1267q666L742
$$ 639577 623419 629791 663430 706136 721006 719997 740396 765265 769479 758212 749546 753288
12605G53288J630N285J9221K7013J9756L6439R3966J42246J70982J44273M1758
$$ 753288 754918 760203 779424 806437 826193 862632 956598 1098844 1269826 1414099 1455857
12594A455857k1443R808O7054O6292P1710Q2580M9225J8021N1454J47022K65527
$$ 1455857 1434414 1444222 1511276 1577568 1649278 1731858 1781083 1799104 1850558 1997580 2263107
12583B263107M32941O83114J118588J570718J268395n88954j688525j281501p35949
$$ 2263107 2696048 3379162 4497750 6068468 7336863 6747909 5059384 3777883 3041934
12574C041934l74819j70203p7818l3602r477K9043P9501P3093J9392k269J3973
$$ 3041934 2667115 2496912 2419094 2385492 2376015 2405058 2484559 2557652 2577044 2574775 2588748
12563B588748M2885J15104J15169J33810J79874K72334L44983M30178O08321P90484
$$ 2588748 2631633 2746737 2861906 2995716 3175590 3447924 3792907 4223085 4831406 5621890
12553E621890J051719J443532J674615J436489J374027K014597L074634M730637
$$ 5621890 6673609 8117141 9791756 11228245 12602272 14616869 17691503 22422140
12545B2422140O941470R594887J5340966K5808669M2644421O6573577Q6827924
$$ 22422140 29363610 38958497 54299463 80108132 122752553 189326130 276154054
12538B76154054O4776891l2578337r3981970p6108089m6414097k6911699j6057381
$$ 276154054 340930945 308352608 214370638 138262549 91848452 64936753 48879372
12531D8879372j0352448p253322n394148m056200k827806j871816j307338j131538
$$ 48879372 38526924 31273602 25879454 21823254 18995448 17123632 15816294 14684756
12523A4684756j439320j552056j299695j041328q80709p64305o27988n29942m49439
$$ 14684756 13245436 11693380 10393685 9352357 8471648 7707343 7079355 6549413 6099974
12514F099974l49110k69423k49179k34586j85662j24050r3082r7263j56987j92166
$$ 6099974 5750864 5481441 5232262 4997676 4812014 4687964 4594882 4497619 4340632 4148466
12504D148466j71923j54761j41116j51085j70772j64592j26990j01981p7710n0046
$$ 4148466 3976543 3821782 3680666 3529581 3358809 3194217 3067227 2965246 2887536 2837490
12494B837490l4825l2148l5604m2905n4476n0289l9144k8894m0026m2141j9100
$$ 2837490 2802665 2770517 2734913 2692008 2637532 2587243 2548099 2519205 2479179 2437038 2417938
12483B417938o204j0642l0741n3869o4484m5145q943L6385P9322J00333R3779
$$ 2417938 2411734 2401092 2370351 2316482 2251998 2206853 2197910 2234295 2313617 2413950 2507729
12472B507729L4671q2544j72748j70719j17661p5856n1997n8435o0432m7423m5594
$$ 2507729 2542400 2459856 2287108 2116389 1998728 1922872 1870875 1812440 1752008 1704585 1658991
12461A658991k2050k318M185j7197l6808k9889k5340j4214Q036M434J324Q104
$$ 1658991 1636941 1634623 1638808 1621611 1584803 1554914 1529574 1515360 1523396 1527830 1529154 1537258
12449A537258J5637L9947R0182Q6653r381j13637j36915r6924n0665j9184O903
$$ 1537258 1552895 1592842 1683024 1769677 1760296 1646659 1509744 1412820 1362155 1342971 1349874
12438A349874K6531L1525M0048P4769Q5309Q2703N7027M3236O9446Q6533N7832
$$ 1349874 1376405 1407930 1447978 1522747 1608056 1690759 1747786 1791022 1860468 1947001 2004833
12427B004833l3735o9906l836O3995J20721J28833R479r1248j03932j41137j21750
$$ 2004833 1971098 1901192 1897356 1961351 2082072 2210905 2220384 2129136 2025204 1884067 1762317
12416A762317n4598J4144J07767K15967K31408J86815K54673K77096J53186q4542
$$ 1762317 1707719 1721863 1829630 2045597 2277005 2463820 2718493 2995589 3148775 3064233
12406C064233k43856k08885p3742J02241K59389L92543N04301O62373J028652
$$ 3064233 2820377 2611492 2537750 2639991 2899380 3291923 3796224 4458597 5487249
12397E487249J644321K196890J922185M51085j487992k507387k293561j540890
$$ 5487249 7131570 9328460 11250645 11701730 10213738 7706351 5412790 3871900
12389C871900r02622n33182l48418k63768k12778j73929j39390q2340j2184M129
$$ 3871900 2969278 2436096 2087678 1823910 1611132 1437203 1297813 1215473 1203289 1207418
12379A207418m2744n6364n0290l9256l3764k4834k4015j4882r885j8375j4698
$$ 1207418 1164674 1108310 1058020 1018764 985000 960166 936151 921269 911384 893009 878311
12368H78311j9628k8404l0755j7677J977m8l986J080J027q652j5071j8061j6359
$$ 878311 858683 830279 799524 781847 783824 783776 779790 780870 781897 773245 758174 740113 723754
12355G23754k5536k3052j5612O56N40O142j345J909o198k037j2805k4347j0536
$$ 723754 698218 675166 659554 660210 660750 666892 665547 667456 661258 659221 646416 622069 611533
12342F11533K16m422j4781j7219q862N645K8479M2537K3287k3124o1035n2018
$$ 611533 611749 607327 592546 575327 566465 572110 600589 643126 666413 643289 582254 530236
12330E30236k7304o172o673r805N173L282Q936K737O341J7721K1088L066j0034
$$ 530236 502932 496760 490087 480282 485455 488737 497673 500410 506751 524472 545560 548626 538592
12317E38592k0054k2301j8452j1803j3558j1535j0689l948l209m416m191J210
$$ 538592 518538 496237 477785 465982 452424 440889 430200 426252 423043 418627 414436 415646
12305D15646Q070K67n798m917m316q560r757o63j1230j6541j0232O620M101M9
$$ 415646 423716 423983 418185 413268 408952 400392 390635 389972 378742 362201 351969 358589 362690 362739
12291C62739K741j454P19K122P411J2169M263q318j3085j6361M432m364p615q153
$$ 362739 365480 364026 364745 366867 374278 386447 390710 382392 369307 352946 357378 353014 345399 337246
12277C37246o711l873m84o574l497J282R45K15K672n999m344L579l781j477K272
$$ 337246 330535 326662 326178 319604 316107 317389 318334 318549 321221 315222 310878 314457 310676 309199 311471
12262C11471r464r849q226m715K403L277K226j478o697J623R972L895n71k488
$$ 311471 302007 292158 283932 279217 281620 284897 287123 285645 278948 280571 290543 294438 293867 291379
12248B91379p829m372k676n095k619j186r669p759L620L202L883J732j607P120
$$ 291379 283550 279178 276502 271407 268788 267602 257933 250174 253794 256996 260879 262611 261004 268124
12234B68124J538P3J066o293j077Q019Q161L288k875l437n286r022p471N255P63
$$ 268124 269662 269735 270801 264508 263431 271450 279611 282899 280024 276587 271301 262279 254808 260063 260826
12219B60826o401n843o541N833J087N14q041m528N251M049J813q927n453j786
$$ 260826 254425 248582 242041 247874 248961 249475 241434 236906 242157 246206 248019 239092 233639 231853
12205B31853j312o3k81j35n579m900j331l274p499k283O393M265m11n447k93R666
$$ 231853 230541 230478 230197 230062 224483 219583 218252 214978 207479 205196 211589 215854 215443 209996 209703 219369
12189B19369n95j028J632p988N593N594K695M342j722o773l915O784N743n234
$$ 219369 218774 217746 219378 211390 216983 222577 225272 229614 227892 221119 217204 223988 229731 224497
12175B24497l538m414n267o12k404k47n693l477j11l216j976K665l033K525O869
$$ 224497 220959 216545 211278 210666 208262 208015 202322 198845 198734 195518 193542 196207 193174 195699 202568
12160B02568L98k242k031k147m863j1529L780N84N24J096L740K893j68N489L888
$$ 202568 202966 200724 198693 196546 191683 180154 183934 184518 185042 186138 189878 192771 192603 198092 201980
12145B01980N343O049P761J5257J2406M186l00o162L096L980N841J6738K4024
$$ 201980 207323 213372 221133 236390 248796 252982 252682 246520 249616 253596 259437 276175 300199
12132C00199K9798L8562M2972N1634N0038O2897J00148J71615K88860M90141Q51021
$$ 300199 329997 368559 411531 463165 513203 576100 676248 847863 1136723 1626864 2477885
12121B477885J502010K588185L659311K143643l246484l766366k109202j057317
$$ 2477885 3979895 6568080 10227391 12371034 9124550 5358184 3248982 2191665
12113B191665n60882l32399k21530j65005j33028r8128n6478l6252l3537l2865
$$ 2191665 1630783 1298384 1076854 911849 778821 680693 624215 587963 554426 521561
12103E21561l2672k8941k2963j6385j7730j5390o438n971q970j2053k2375j6827
$$ 521561 488889 459948 436985 420600 402870 387480 381042 375071 366101 354048 331673 314846
12091C14846q584r80L643Q992M618n963r230m957l565j0574p339L259J1456J4186
$$ 314846 306262 305282 308925 317917 322535 316572 307342 302385 298820 288246 280907 284166 295622 309808
12077C09808J0332N619J7446K0052L9101N2942Q4716J54442K61516L91356M61058
$$ 309808 320140 325759 343205 363257 402358 455300 540016 694458 955974 1347330 1808388
12066A808388K24477l08542m87923l38377j87583r1571m7927k4980j9684j1886
$$ 1808388 2032865 1724323 1236400 898023 710440 618869 570942 545962 526278 514392
12056E14392n650J9922M5826L3052j6362p1599q8500p4541m8468l2487j2361o128
$$ 514392 508742 528664 574490 607542 591180 519581 431081 356540 308072 275585 263224 257096
12044B57096n227j11l853r308l825j091p046k413k331R28J161q71k749K335K875
$$ 257096 251869 251758 247905 238597 234772 233681 226635 224222 221891 222819 223980 223109 220360 222695 225570
12029B25570l643q112o787L602j462J389j337o666j826O592K404K084J9131K4704
$$ 225570 221927 213815 207028 210630 209168 210557 209220 202554 200728 207320 209724 211808 230939 255643
12015B55643J9738m042k0436k3946j0357j495j1690l245L029k00M364J482k468
$$ 255643 275381 271339 250903 226957 216600 215105 203415 200170 203199 202999 207363 208845 206377
12002B06377o3m312m456k651K878Q203O631L215K861k052l02k560K209R828J5176
$$ 206377 206314 202002 197546 194895 197773 205976 212607 215822 218683 216631 216329 213769 215978 225806 240982
11987B40982K9850M4557Q2445J40280K04588K44028K10740Q3581j01574k21699
$$ 240982 270832 315389 397834 538114 742702 986730 1197470 1281051 1179477 957778
11977I57778k31679j77441j19380p5543m6251k7169k0601j4711j313j253K8R201
$$ 957778 726099 548658 429278 353735 307484 280315 259714 245003 243690 242437 242465 251666
11965B51666J5251J2519J4467J8185J3458J8450K5744J7512j0046k0246j7490
$$ 251666 266917 279436 293903 312088 325546 343996 369740 387252 377206 356960 339470
11954C39470j2212k7633j8822r923j8854k0598p197o611k956r24j967l019j43
$$ 339470 327258 299625 280803 270880 252026 231428 224231 217620 214664 213740 211773 208754 208611
11941B08611J1607J6646K1588L1430L6667O940k7689k9742k4622j8860j6878J025
$$ 208611 220218 236864 258452 289882 326549 333489 305800 276058 251436 232576 215698 216723
11929B16723J3188K1597K2854M618q246j5690j3981q696j4310j2532m836k65K1044
$$ 216723 229911 251508 274362 278980 270734 255044 241063 232367 218057 205525 200689 200424 221468
11916B21468L7024N4299J7898n1403m8874l1061j4578m327l288K091k742q644
$$ 221468 258492 312791 330689 279286 230412 199351 184773 180446 177158 179249 176507 167863
11904A67863M739J1635M276n483j1915n817n010n101m639l76L130l226L151M543
$$ 167863 172602 184237 188513 183030 171115 165298 160288 155187 150548 150172 153302 150076 153227 157770
11890A57770O356N575m706k260p36K676Q13N825n31m303q280J940m078o859k737
$$ 157770 164126 169701 164995 162735 161999 164675 165488 171313 170782 166479 158199 160139 156061 149202 146465
11875A46465p17k752J0425J2978Q553P55l00j234q665p08L230j3072k460L94P212
$$ 146465 145748 142996 153421 166399 174952 175707 175407 174173 165508 164800 168030 154958 152498 152892 160104
11860A60104J1883J2760J406r594j1710o295k520Q750O851K346Q498P630N801
$$ 160104 171987 184747 186153 176559 164849 158554 156034 164784 171635 173981 182479 190109 195910
11847A95910m94l835n36R062K1384M4916Q3962J17176R0473j9846j04548j06181
$$ 195910 195416 191581 191045 200107 221491 266407 350369 467545 558018 538172 433624 327443
11835C27443o3932m2087j9055k878j186p671m984j0944j4485k578N266j354j1943
$$ 327443 263511 221424 202369 199491 198305 190634 185650 174706 160221 157643 162909 161555 149612
11822A49612p137M63J270K955K393L533L067K296j357O794K928M087o73n380q541
$$ 149612 142475 142938 144208 147163 149556 153089 156156 158452 157095 163889 166817 170904 170231 164851 156310
11807A56310n932R49j556o573k448L629J2173J4835P845m978p112J563J3384J6852
$$ 156310 150378 151327 149771 143198 140750 144379 156552 171387 179232 174254 167142 168705 182089 198941
11793A98941J7491K1537L6159N3328Q9056J36808J92607J57611p8503k15410j61364
$$ 198941 216432 237969 274128 327456 416512 553320 745927 903538 825035 609625 448261
11782D48261r3983n1629l0069k1482k0036j3721j3685q676M112j434j199L190
$$ 448261 354278 302649 272580 251098 231062 217341 203656 194980 199092 197658 196459 199649
11770A99649M377l122q109J898R822L361J152O072o94o411p558l438N111J115
$$ 199649 204026 200904 192795 194693 204515 207876 209028 215100 214406 207995 200437 196999 202110 203225
11756B03225l171O567j453j6336j2067l28Q52J1970J8858J2437M074M428R617
$$ 203225 200054 206621 205168 188832 176765 176437 177289 189259 208117 220554 224628 229056 238673
11743B38673J1944r109j2619q632j3354o983p316l208l196K463L548k06m656q85
$$ 238673 250617 241508 228889 220257 206903 199920 192604 189396 186200 188663 192211 192005 187349 186464
11729A86464k72L354R693R240R523Q93l206L97p510j2611m462k166m886q746J436
$$ 186464 186192 189546 199239 208479 218002 218895 215689 216086 208576 195965 191503 189337 184451 175705 177141
11714A77141l732J0708l00j541J117Q012P855J059j5004j8719q123l645L683P26
$$ 177141 173409 184117 183817 182276 183393 191405 199260 200319 185315 166596 158473 154828 158511 159237
11700A59237K026P325R32O028O200o459p721j4043J362l384j0031n983n49J868
$$ 159237 161263 168588 169520 175548 181748 175289 167568 153525 154887 151503 141472 135489 134940 136808
11686A36808J306J510p501q331J189j275n642J197P328L477P019L032K635O792
$$ 136808 138114 139624 132123 123792 124981 123706 118064 119261 126589 130066 137085 140117 142752 149544
11672A49544j975J01J2073J3230J4410J9533r027k2488j1472l729J003l16p973
$$ 149544 147569 147670 159743 172973 187383 206916 197889 175401 163929 160200 161203 160887 152914
11659A52914o065q790k162M955J1568J2852J5476L0588K8639R552k1284l0443
$$ 152914 146849 138059 135897 140852 152420 165272 180748 211336 239975 249527 228243 197800
11647A97800j5238j5172j8800j0738M252o546r123q049m116J313p16k568M277
$$ 197800 182562 167390 148590 137852 142104 135558 126435 118386 114270 115583 114867 112299 116576
11634A16576M60L136q606k018J327L954K208p35j927m265L651m585J356P029M211
$$ 116576 117036 120172 111566 109548 110875 114829 117037 116302 114375 110110 113761 109176 110532 117561 121772
11619A21772K268p534j2960M042M212R222K677j1442m100k846j569M392O784l579
$$ 121772 124040 116506 103546 107588 111800 121022 123699 112257 108157 105311 103742 108134 114918 111339
11605A11339j445J487q48P11j819M508N877p0P164J0488N96j0726j3606n736K438
$$ 111339 109894 111381 110533 111244 109425 113933 119810 119740 126904 137392 137988 127262 113656 107920 110358
11590A10358P00m329m805K309L605J784l281j2938l918M215J064P627M838m678
$$ 110358 111058 106729 101924 104233 107838 109622 106341 93403 89485 93700 94764 102391 107229 102551
11576A02551q976q151j980P331P462J597n721m945r49J886L370L420J803P50k860
$$ 102551 93575 85424 83444 90775 98237 99834 94113 89168 88219 90105 93475 96895 98698 99448 96588
11561I6588j044J129L933J413n708l425n250m617O53j910N476k132m227L78J1301
$$ 96588 95544 96673 100606 102019 96311 92886 87636 83019 83672 81762 87238 85106 80879 81257 92558
11546I2558J725m01J878m910J192l454n482j051P213K580p84n748r77l356J0022
$$ 92558 94283 93882 95760 90850 92042 88588 83106 82055 89268 91848 91064 85316 84339 80983 91005
11531I1005P835q067p871K012k706k342j928k421N082M844k454K581j500K820
$$ 91005 98840 90773 82902 84914 82208 79866 77938 75517 80599 85443 82989 85570 84070 86890
11517H6890M106r234n258N42k820K967O718K952k430Q087Q407O2o917n34K569
$$ 86890 90996 81762 76504 77046 74226 77193 83911 86863 84433 92520 100927 100989 94072 93538 96107
11502I6107J23l54p158k495KN334O901Q774R47k735n05k660N969k037K074Q877
$$ 96107 96230 95876 88718 86223 86225 91559 98460 107234 108181 105446 104941 102281 108250 106213 108287 117164
11486A17164J232P621J3494J1527J8654K5905L4591L3731K9202J4484r616k4272
$$ 117164 118396 126017 139511 151038 169692 195597 230188 263919 293121 307605 297989 273717
11474B73717l7213l7268k4166k0328j0679J146j1395r813R994R245k064j0534
$$ 273717 236504 199236 175070 154742 144063 145209 133814 124001 133995 143240 141176 130642
11462A30642n159M324O879M00k764L866l051N34O450j079k264o468L10P337M72
$$ 130642 125483 129807 136686 137086 134322 138188 135137 135671 142121 141042 138778 132310 132620 139957 140429
11447A40429j234O19J902q753l510k798J3m654q11L973R219J1940L967l355J499
$$ 140429 139195 139814 141716 132963 129453 126655 126668 122014 121203 125176 134395 146335 150302 146947 148446
11432A48446N698J296o768j1619o430K190m156L6J927m85j865j881l537k816o522
$$ 148446 154144 155440 148672 137053 130623 132813 128657 128693 130620 130135 128270 126389 122852 120036 113514
11417A13514L996O704P129O567j066p676L503m410o170M208n339M72k571j946
$$ 113514 117510 124214 131343 137910 136844 129168 132671 128261 122091 126299 120960 121432 118861 116915
11403A16915K414K838O355L854K058K882l411r383L735M506M664Q439M1k764n874
$$ 116915 119329 122167 128522 132376 134434 137316 133905 124522 128257 132763 137427 145866 145907 143143 137269
11388A37269J3834Q862K466j752k278K1N233m721m979j997k787L05N695J760k575
$$ 137269 151103 159965 162431 160679 158401 158422 163655 158934 153955 151958 149171 149476 155171 156931 154356
11373A54356N120J0732R879N982L605J0439Q490K935k584j0949j3196r317o871
$$ 154356 159476 170208 180087 186069 189674 200113 208603 211538 208954 198005 184809 175492 168621
11360A68621N90j995p335p510N435O05o271l179L32m526j006Q14J960j58N379
$$ 168621 169211 167216 159881 152371 157806 158411 152140 148961 149293 144767 143761 144575 146535 146377 151756
11345A51756O770l658n541J921J290J313O841K987k067o28k832r237N517O968
$$ 151756 158526 154868 149327 151248 152538 153851 160692 163679 161612 160984 158152 148915 154432 161400
11331A61400O964O849J0776J3165k16L910J3183J1531P720J2536M231K849l876
$$ 161400 168364 175213 185989 199154 198938 202848 216031 227562 235282 247818 252049 254898 251022
11318B51022j2183o550j0164n874j3325j3840j2410j2074j0686J823k916P997
$$ 251022 238839 232289 222125 216251 202926 189086 176676 164602 153916 155739 152823 160820
11306A60820Q215l78k01J102N444j730r949l317M284N587j0004k655n87j208m515
$$ 160820 169035 168657 168456 169558 175002 173272 163323 160006 164290 169877 159873 157218 156631 155423 150908
11291A50908M45k80K470O553O986J200K531M517O403M126J0179J4870Q484J4510
$$ 150908 151353 151073 153543 160096 167082 168282 170813 175330 181733 185859 196038 210908 219392 233902
11277B33902K2o748l476l251K489J912o188n543j0670q598n851j0041K342K405
$$ 233902 233924 227176 223700 220449 222938 224850 218662 213119 202449 193851 188000 177959 180301 182706
11263A82706L479N163j842r04L599R214M471Q313J0359P552J5217L565k504n056
$$ 182706 186185 191348 189506 188602 192201 201415 205886 214199 224558 232110 247327 250892 248388 243332
11249B43332l643j7080j2274l266m640r968j64M732P150M459n046L383N183M656
$$ 243332 239689 222609 210335 207069 202429 192461 192297 197029 204179 208638 203592 206975 212158 216814
11235B16814J0193J6221J1592j008M878m162p936j2700j4891r707p358l360j744
$$ 216814 227007 243228 254820 253812 258690 254528 246592 233892 219001 209294 201936 198576 196832
11222A96832m51k894n742o780k614R591J3524K459L958K759R540J3175R229Q056
$$ 196832 196381 193487 187745 180965 178351 187942 201466 203925 207883 210642 220182 233357 242586 250642
11208B50642J5992J2750K926k935j495r76m718K345n186q525p361j301P62k877
$$ 250642 266634 279384 282310 279375 277880 276904 272186 274531 269345 260820 253459 252158 252920 250043
11194B50043l78o65p035q131m7J875l24J650K894R227J18j2126j2304j3335o178
$$ 250043 249665 249000 241965 233834 233787 235662 235338 236988 239882 249109 249227 237101 224797 211462 205284
11179B05284j357j0814J201m58q617l221J258j729q227k509P66N567K593K64J71
$$ 205284 203927 193113 194314 193856 185239 182018 183276 181547 173320 170811 171577 177144 179737 180001 180172
11164A80172N398O976R732J0490J966N255P440J1005O568J378j899m555p481j3100
$$ 180172 185570 192546 202278 212768 214734 219989 227429 238434 245002 246380 244481 239926 232445 219345
11150B19345j1427p750l180m155j861n497J34R53m776m619J5576N364l094m604
$$ 219345 207918 200168 196988 192833 190972 185475 185609 186562 181786 177167 192743 198107 195013 190409
11136A90409l854J058l184M740P651L608n058j855l134j006J308m397P43q35K02
$$ 190409 186555 187613 184429 189169 196820 200428 195370 193515 190381 189375 190683 186286 187029 186194 186396
11121A86396l299N474Q309l1m244l436o779p343k628L176M149J2645O351K45M579
$$ 186396 183097 188571 196880 196849 192605 189169 182390 175047 172419 175595 179744 192389 198740 198985 203564
11106B03564K841o500q950J60P121k243R8j071q785r105j482J225n544J3275J0833
$$ 203564 206405 199905 190955 191115 198236 195993 196091 195020 186235 177130 175648 176873 171329 184604 195437
11091A95437N390K301j159N725L685j288P386J4691l174n373N492P992N43q685
$$ 195437 200827 203128 201969 207694 211379 210091 217477 232168 228994 223621 229113 237105 237648 228963
11077B28963p571k535j508J954K622K675L817J833m222n428R355m48l596m353
$$ 228963 221392 218857 217349 219303 221925 224600 228417 230250 226028 220600 229955 229507 225911 221558
11063B21558P858L250j1119m212L755K984J1016O678l562J31l52o564l452n726
$$ 221558 229416 232666 221547 217335 221090 224074 235090 241768 238206 238337 237985 231421 227969 222243
11049B22243M777j617l02k430L477Q296o67O833P055P777J610j518j122J345q108
$$ 222243 227020 225403 225101 222671 226148 234444 233777 240610 247665 255442 257052 255534 254412 255757 247649
11034B47649p851q17m514j274j615k641K72K893Q1j134R792Q290K078j009l552
$$ 247649 239798 238981 234467 233193 231578 228937 229209 232102 232183 231049 240841 249131 251209 250200 246648
11019B46648n70Q64l954k068J895N865R619N874L924J088L156K993l883l573K325
$$ 246648 246078 246942 242988 240920 242815 248680 258299 264173 268097 269185 272341 275334 271451 267878 270203
11004B70203r723o467l783j989q257k900k188k438M755K708O855N292P594l333
$$ 270203 260480 254013 250230 248241 239984 237084 234896 232458 237213 239921 246776 252068 259662 256329
10990B56329o36k579m636m974m85j923o465K977J1393M979M378L549k889M272
$$ 256329 255693 253114 248478 243504 243019 241096 234631 237608 249001 253980 258358 261907 259018 263290
10976B63290J0672L717k192J821K254p574p804J755O025M305R772L516O313P772
$$ 263290 273962 277679 275487 277308 279562 271988 264184 265939 271964 276269 286041 289557 295870 303642
10962C03642K848j714n762P942n682j1930j1397j86O12j167n558L091L517L037
$$ 303642 306490 304776 299014 306956 301274 289344 277947 277761 278373 277206 271648 274739 278256 281293
10948B81293p657m054P981L089P623K429K688k114n546p912n602l046P643N867
$$ 281293 273636 269582 277563 280652 288275 290704 293392 291278 285732 277820 272218 269172 276815 282682
10934B82682M002Q395R266L006P119R682k401q327r97J115P378J5518J3859J0247
$$ 282682 286684 295079 304345 307351 314470 324152 321751 313424 312427 313542 320920 336438 350297 360544
10920C60544J5237J1134Q924J0873O869j349M244N4K49j1936j4865l704o599m965
$$ 360544 375781 386915 395839 406712 413581 412232 416476 416530 416779 404843 389978 386274 379675 374710
10906C74710l462l543q312q334o931n377j041m162o452o509K695Q203P483j555
$$ 374710 371248 367705 359393 351059 344128 338751 337710 333548 327096 320587 323282 331485 338968 337413
10892C37413k871j0158n666l065p989r409j261K786M027P945O774J6192J7709
$$ 337413 334542 324384 318718 315653 307664 298255 296994 299780 303807 311752 318526 334718 352427
10879C52427N720M323K471J2248J5596N098Q579O792N154m23p979k072p622m048
$$ 352427 358147 362470 364941 377189 392785 397883 406462 413254 418408 417985 410006 407934 400312 396264
10865C96264m022Q03n9j661l387j2074j6241j4519j4022j0332m894j1311o749
$$ 396264 392242 393045 392986 391325 387938 375864 359623 345104 331082 320750 315856 304545 297796
10852B97796l337K962J046j48J354J902j07l234N493M56l878q187j0048j1903
$$ 297796 294459 297421 298467 298319 299673 301575 301468 298234 303727 304183 300305 292118 282070 270167
10838B70167j0311l095P686m21m075M009L327Q091O318K915k395K802R495R856
$$ 270167 259856 256761 264447 264026 259951 263960 267287 275378 281696 284611 282216 285018 294513 304369
10824C04369O520O255R077M401O43j254M091o732r302j196K078Q92k44l558p359
$$ 304369 310889 317144 326221 330622 331265 330011 334102 327370 318068 316872 318950 319842 319598 316040 308681
10809C08681q838P117J0726K5084L6231N3303P7542P4960L5879k6422p8825q6536
$$ 308681 299843 306960 317686 342770 379001 432304 509846 584806 620685 594263 515438 428902
10797D28902n9170l6263k7731k0004m627M339k791n313o019k275N807J0885N369
$$ 428902 369732 333469 305738 285734 281107 285446 282655 277342 271323 269048 274855 285740 291109
10784B91109j719L3k284K430j844K829K426J722M011N300K4253M0832N7656P7533
$$ 291109 289390 289423 287139 289569 287725 290554 292980 294702 298713 304013 328266 369098 426754 504287
10770E04287O5028K0484k7631m5822l9852k8604j7279j0962M872J9327L3946N5777
$$ 504287 569315 589799 562168 516346 476494 447890 430611 419649 424521 443848 477794 533571
10758E33571R2731J25495J27168P0192k3636q7500j08594r9537p7464o6210n3229
$$ 533571 626302 751797 878965 949157 925521 838021 729427 629890 552426 486216 432987
10747D32987m3878k9551j5109K218J3229O906P167R802P292K2293K8984L0590
$$ 432987 389109 359558 344449 346667 359896 366802 373969 383771 391063 413356 442340 472930
10735D72930K3922K6939R952j1079k4737k9595l0932j7983j6305j2988m044M39
$$ 472930 496852 523791 533743 522664 497927 468332 437400 419417 403112 390124 386080 386519
10723C86519M626R975J1340K709O007N693j018j0718o975k427J5319L5725N0264
$$ 386519 391145 401120 412460 415169 421176 426869 425851 415133 408158 405731 421050 456775 507039
10710E07039P3887Q3331O5124L312n5560p7030p6617n5176l3638q589J457O569
$$ 507039 580926 664257 729381 732693 677133 600103 523486 468310 434672 426083 427540 434109
10698D34109R057J536N320O985J5057K3121L8864N2909O0250M8838J5832l3655
$$ 434109 443166 444702 450022 457007 472064 495185 534049 586958 647208 696046 711878 678223
10686F78223o0959p0074o2748m9276k9994j8907j4148q301j1770J719j142K479
$$ 678223 617264 547190 484442 435166 405172 386265 372117 363816 352046 353765 352623 355102
10674C55102m901k519n356j5177j9305m618K955K254O042P964J3448J1932J1494
$$ 355102 350201 347682 342326 327149 307844 303226 306181 308435 314477 322441 335889 347821 359315
10661C59315J423O017J2053J3115o048j6791l064l912o772j08M807Q288J6837
$$ 359315 360738 366755 378808 391923 385875 369084 366020 362108 355336 355228 360035 368323 385160
10648C85160K2008K3602K5445K7818K1683j613l2698l7251k6210j8207r760j3352
$$ 385160 407168 430770 456215 484033 505716 504103 471405 434154 407944 389737 379977 366625
10636C66625j0345j4046j0752j3289k0417j4523o349j856k931N200L397K502l828
$$ 366625 356280 342234 331482 318193 297776 283253 276904 275048 272117 277317 280714 283216 279388
10623B79388k627P18P497J2085J5273J3017m42K166K135p028p935p877j393J791
$$ 279388 276761 277479 284976 297061 312334 325351 324909 327075 329210 322182 314247 306370 304977 306768
10609C06768k931L919J088J246J0022J0777L433J0918J7965J3704j545q369r977
$$ 306768 303837 307756 308844 310090 320112 330889 334322 345240 363205 376909 375364 366995 357018
10596C57018j7710j4320n203o842j5562j9221p406r396l371l335k652M88j68K332
$$ 357018 339308 324988 319785 312943 297381 278160 270754 261358 257987 254652 252000 252488 252320 254652
10582B54652J1585P874M539P021P788J6332K1535J9839K9703M4999M3352K3409
$$ 254652 266237 274111 278650 285671 293459 309791 331326 351165 380868 425867 469219 492628
10570D92628m180j8287j6177k1302k5094k9421k1145j3662n889O610K1975K9274
$$ 492628 488448 470161 453984 432682 407588 378167 357022 343360 337471 344081 366056 395330
10558C95330L8339J3140j8794j4642P21Q980J1222J4440K346k548j3408j8522
$$ 395330 433669 446809 428015 413373 414094 423074 434296 448736 451082 448534 435126 416604
10546D16604j6799j9566j7649r340K538K056L930J0652J0507J0831P446M646N993
$$ 416604 399805 380239 362590 353250 355788 357844 361774 372426 382933 393764 401210 405856 411849
10533D11849J4566J9783L0846K2553K5773L9184L5725L0625K3935Q444j8582l8848
$$ 411849 426415 446198 477044 499597 525370 564554 600279 630904 654839 663283 644701 605853
10521F05853m5161m3452l1561k2259k1030j5581k0732j1954j2683j2568J924J3213
$$ 605853 560692 517240 485679 463420 442390 426809 406077 394123 381440 368872 370796 384009
10509C84009J9487K3236K1229J4802J4305J3978J0184M887l252j1235j1768r551
$$ 384009 403496 426732 447961 462763 477068 491046 501230 506117 502865 491630 479862 470311
10497D70311r162m177J2376J3957J1162L680r770r275q187j5505j5676l616J333
$$ 470311 461149 456972 469348 483305 494467 498147 488377 479102 470915 455410 439734 436118 437451
10484D37451m374r56K806O575K0615K3505M2063N9261M3833J8656j142l0393l6572
$$ 437451 433077 432121 434927 441502 462117 485622 527685 586946 630779 649435 648293 617900 581328
10471E81328k5842k1692k1397k1236j2540j7711j5799j0330n497R649J7168J3915
$$ 581328 555486 533794 512397 491161 478621 460910 445111 434781 429284 438933 456101 470016
10459D70016J3078J6756R431J4095P123Q091R98q480q243p067m847j4087j9490
$$ 470016 483094 499850 509281 523376 530499 538590 539588 531108 522865 515798 510951 496864 477374
10446D77374k769r969j4825r23l36l006N015R133J3024K625p676j2703o869K924
$$ 477374 474605 464636 449811 448888 448552 445546 450561 459694 472718 475343 467667 454964 448095 451019
10432D51019J2924J5426J3863L307P435K0530K6667L3610J5397j46q526j0328
$$ 451019 463943 479369 493232 496539 503974 524504 551171 584781 600178 600032 591506 581178
10420E81178k1001k6534j6756j1200j5061j7884p968l644l839J1437K7525K9745
$$ 581178 560177 533643 516887 505687 490626 472742 464774 461130 457291 468728 496253 525998
10408E25998K5404J8660N211j1888j3662j2335j9057k9981k5996k6792k5040j1294
$$ 525998 551402 570062 575273 563385 549723 537388 518331 488350 462354 435562 410522 399228
10396C99228r582l635J660K73M952J6109J6449J5908J2611N732P076L809J2581
$$ 399228 389646 386011 387671 387944 392896 409005 425454 441362 453973 459705 466781 470590 483171
10383D83171J4646K2315K5204K9140L1991L8352J9306R240N66j1434j7274j9866
$$ 483171 497817 520132 545336 574476 606467 644819 664125 673365 673931 662497 645223 625357
10371F25357k0639j2053P988J2262L1860M2505N2473O2458N9717M0536K4075L503
$$ 625357 604718 592665 600653 612915 644775 687280 739753 802211 861928 902464 926539 930042
10359I30042j2834j0865P293L6304P0973J07626J48706K05827K61822K96289K60830
$$ 930042 917208 906343 913636 949940 1020913 1128539 1277245 1483072 1744894 2041183 2302013
10348B302013J36881l5833j86450k51633k26901j51925q5243l5474L655M5770
$$ 2302013 2438894 2403061 2216611 1964978 1738077 1586152 1500909 1465435 1469090 1514860
10338A514860Q2969J22185J75565K17545K35483K36585K48297K82519L51245M83107
$$ 1514860 1597829 1720014 1895579 2113124 2348607 2585192 2833489 3116008 3467253 3950360
10328C950360O98610J046109J575955K360977L508018N033080O483917O546651
$$ 3950360 4648970 5695079 7271034 9632011 13140029 18173109 24657026 31203677
10320C1203677M104476m5683l886143o027503o076753m754479l260165k156112
$$ 31203677 35308153 35262470 31376327 25348824 19272071 14517592 11257427 9101315
10312I101315j435083r38482n56971k35974L6265K51828M30902N06270L01843
$$ 9101315 7666232 6727750 6170779 5934805 5971070 6222898 6653800 7160070 7461913
10303G461913j94539o10700p21050o45188m95417l43528k34696j43462m4586N2443
$$ 7461913 7267374 6656674 5935624 5290436 4795019 4451491 4216795 4073333 4028747 4081190
10293D081190J78066L24894M40902N21090N46035N44577N82966O81344Q75293
$$ 4081190 4259256 4584150 5025052 5546142 6092177 6636754 7219720 7901064 8776357
10284H776357J240775J859406K864209M411732O786511J0249664J4298730J6532710
$$ 8776357 10017132 11876538 14740747 19152479 25938990 36188654 50487384 67020094
10276F7020094J2495704P25531j0867431j4830963j3652166j0830180p528204
$$ 67020094 79515798 80241329 69373898 54542935 40890769 30060589 22532385
10269B2532385m890916l251300k305975j732684j258122q12011m43588j94672
$$ 22532385 17641469 14390169 12084194 10351510 9093388 8281377 7837789 7643117
10261G643117j02303j11648k10511l87775n62730o26432n51229m10155k93805
$$ 7643117 7540814 7429166 7218655 6830880 6268150 5641718 5090489 4680334 4386529
10252D386529k11786j60653j20359q6690l2000M6313J39180K21799K92831L52051
$$ 4386529 4174743 4014090 3893731 3807041 3775041 3821354 3960534 4182333 4475164 4827215
10242D827215M03811M59457N91352P91696J085033J563544K357396L640250N463478
$$ 4827215 5231026 5690483 6281835 7073531 8158564 9722108 12079504 15719754 21183232
10233B1183232P444530Q212057O021482J014295m498746p955509q277765o441703
$$ 21183232 28627762 36839819 42861301 43875596 39376850 31421341 23143576 16701873
10225A6701873m315425k784871j868641j320364r64267p12966n13674l65367k83597
$$ 16701873 12386448 9601577 7732936 6412572 5448305 4735339 4221665 3856298 3572701
10216C572701k44949k49114k60322k57822k47887k17991j72233j38877r8868n5603
$$ 3572701 3327752 3078638 2818316 2560494 2312607 2094616 1922383 1783506 1684638 1629035
10206A629035k8304p240j0918k5607m2484n7369n4434l9520j5487q775k352j559
$$ 1629035 1600731 1593491 1582573 1556966 1514482 1457113 1402679 1363159 1347672 1338897 1336545 1334986
10194A334986R440M2496R3582R7129N9769r043q6140j35518j64000j52483j21344
$$ 1334986 1344426 1386922 1480504 1577633 1637402 1628359 1542219 1406701 1242701 1090218 968874
10183I68874j04278p4219n3562l5359k9892j4384j0256m038l380J709l880j3232
$$ 968874 864596 790377 736815 701456 671564 657180 646924 642886 639506 641215 637335 624103
10171F24103j6858j6124k1000k7201j3634j1493j4651q74L432n368j2560j3991
$$ 624103 607245 591121 570121 542920 529286 517793 503142 502268 505700 500332 487772 473781
10159D73781o030o858o000j4552j2013j1756m25J185K99l349j0597j2705j0608
$$ 473781 467751 460893 454893 440341 428328 416572 416147 417332 417631 414282 403685 390980 380372
10146C80372o42K058m694j53P42j789P37k387o225k975l344j68Q68K028M21N292
$$ 380372 379730 381788 377094 376941 377683 375894 376631 374244 368019 365044 361700 361532 362400 364428 364849 370141
10130C70141j354o916R82N43o439j0583j0380q165n761l893Q26J850P576K043
$$ 370141 368787 361871 362853 363396 356957 346374 335994 327829 322068 318175 319001 320851 328427 330470
10116C30470o04l680m865o735q768o593j745p392N193Q355J0601kO10q47j237
$$ 330470 329866 326186 321321 314586 305818 299225 297480 290088 295281 303636 314237 314235 314845 313998 312761
10101C12761P275Q77L399j428p072q15o365o294m488r660k775L192J216K853J227
$$ 312761 320036 320913 324312 322884 315812 314997 308632 302338 297850 288190 285415 288607 289823 292676 293903
10086B93903J393L978J201N739O78n658m400p376o789J11N262M830J3643K0773
$$ 293903 295296 299274 300475 306214 306892 301234 296834 289458 282669 282780 288042 292872 306515 327288
10072C27288K0584J1720l695j2805j9273j1233m752O341J2656J7689J8626R953
$$ 327288 347872 359592 355897 343092 323819 312586 307834 314175 326831 344520 363146 373099
10060C73099l681j5763j9018j1850j0748j603K346j737o05K132r186j4872M658
$$ 373099 369418 353655 334637 322787 312039 310436 312782 311045 310440 312572 303386 288514 293172
10047B93172J069L734r69M214J0539K2475L8380O4216J15106J96027K74045K23695
$$ 293172 294241 297975 297006 301220 311759 334234 372614 436830 551936 747963 1022008 1245703
10035A245703k07308l29178j93474r5489m5772k7476j3906j7224j2664o846m574
$$ 1245703 1038395 709217 515743 420254 374482 347006 333100 315876 303212 296366 291792
10024B91792o089l830L622j583J35M487m09K532m590Q42k067N284N950L876J290
$$ 291792 285703 281873 285495 283912 284047 288534 288125 290657 286067 286909 284842 290126 296076 299952 301242
10009C01242P038J1151Q298J2333N775J0549J2330J5999J9256R926K5127N1739
$$ 301242 308280 319431 327729 340062 345837 356386 368716 384715 403971 413897 439024 490763
9997D90763P6429J23712J47375J22295J09324J07944l808r2104q2691q9509j05268
$$ 490763 567192 690904 838279 960574 1069898 1177842 1174034 1081930 999239 909730 804462
9986H04462q2889m7047k3482R114N6117R5425J67720K32811K10340J72327J65390
$$ 804462 721573 674526 651044 660158 716275 811700 979420 1212231 1422571 1594898 1760288
9975A760288M6813j36839k18608k16980k36349k28729j64697j07573o6347m3032
$$ 1760288 1807101 1670262 1451654 1234674 998325 769596 604899 497326 430979 387947
9965C87947k1450j0283j5606j7595j4982r598j4329j827L13r313n807r071k387
$$ 387947 366497 356214 340608 323013 308031 298433 284104 282277 282590 273277 267470 258399 256012
9952B56012j414o044j1542o881k083k319k311O223k848q26L464J2958l566o466
$$ 256012 254598 248554 237012 230131 228048 225729 223418 229641 226793 225967 229431 242389 238823 232357
9938B32357r577m880j891O595L55j072R270J112k048Q317L04l048N803J4978K7526
$$ 232357 222780 217900 216009 222604 222959 221887 231157 232269 230221 238538 238842 235794 241597 256575 284101
9923B84101L8710M5913K8697k2051n3755l2102j3531j7978q859r363q344m450
$$ 284101 322811 368724 397421 375370 321615 289513 275982 258004 249145 239782 231438 226988
9911B26988L563J0545O339J1825P392J4398J6642J8127K6175K8952J4153n884
$$ 226988 230551 241096 247435 259260 266652 281050 297692 315819 341994 370946 385099 379215
9899C79215j9059j9065k2907j3428j9256k1085j6398o486j058O9K994J228l800
$$ 379215 360156 341091 318184 304756 285500 264415 248017 241531 240473 240542 243536 244764 240964
9886B40964k180L248K443j723j312o375k790L539M76k271L839O238K794n061o075
$$ 240964 238784 242032 244475 242752 241440 235065 232275 235814 236290 234019 237858 244096 246890 241829 235754
9871B35754m62N201P727J2057J2527J0518J2603P070J2479L3706M8753O3321P9011
$$ 235754 235292 240493 248220 260277 272804 283322 295925 302995 315474 349180 397933 461254 540265
9858E40265Q3599P8523N5573M3551P5932J56957K20250J80801R743j95121l00209
$$ 540265 623864 702387 757960 801511 877443 1034400 1254650 1435451 1445194 1250073 949864
9847I49864k48209j50458p5296l9226k9904m2734l3081k5593j4948o139j093K
$$ 949864 701655 551197 475901 436675 406771 364037 330956 305363 290415 284276 283183 283185
9835B83185o914j0788M560q40l542j598n776m156o472j63R862J413k480M873O769
$$ 283185 276271 265483 270043 269203 265661 264063 258287 254131 247659 247496 257358 258771 256291 261164 267933
9820B67933n79k23O970J4359J6206K6955L1856M1448K7898J7412j0592l6604m5294
$$ 267933 267354 267131 274101 288460 304666 331621 363477 404925 432823 450235 439643 403039 357745
9807C57745m3556k8118j4534q541r124o462j0484P0k659k653M131K303l686n393
$$ 357745 314189 286071 271537 262996 253872 247410 236926 236996 234337 231684 235815 238118 234432 229039
9793B29039m38L952J034p26j91j054K82J481P893L652J238m174o665J355o035
$$ 229039 228601 232553 233587 232861 232670 231616 231898 233379 241272 244924 246162 241988 235323 236678 230643
9778B30643k160J680j205q343L936K637j829K531N501K233n786n307L201M901
$$ 230643 228483 230163 228958 220615 224551 227188 225359 227890 233391 235624 229838 224531 227732 232633
9764B32633O93k804l064k66N11k126j079J756o17o027J244K247R614Q326k436
$$ 232633 233326 230522 227458 227192 227703 225577 224498 226254 225637 219610 220854 223101 232715 241041 238605
9749B38605j969m083m391n706L408J43k040M83L06k473n278K352P020J123q15
$$ 238605 236636 232553 228162 222456 225864 226007 223967 224450 224756 222283 217005 219357 226377 227500 226685
9734B26685o71j606L628K904p61K041K881r688M157M265l778m481J368l628L850
$$ 226685 226014 224408 228036 230940 230179 232220 235101 225413 229570 233835 230057 225576 226944 223316 227166
9719B27166O667P976P969m153o721L19p91j485L708M279m157p659k42J468k984
$$ 227166 233833 241809 249778 245625 238904 239223 238432 236947 240655 244934 240777 233118 232876 234344 231360
9704B31360R83N10k51J198Q143K156j582q44Q70P407N638q12n425j733J641L202
$$ 231360 232343 232853 232602 233800 241943 244099 242517 241673 242543 249950 255588 254776 249351 247618 249259 252461
9688B52461J372o272q939l78L557K906P924J446L739k921j266K614J839L199K19
$$ 252461 253833 247561 238622 238244 241801 244707 252631 254077 257816 254895 253629 256243 258082 261281 261500
9673B61500l865J862k921q898N80J493P756J032j999o317LN0q57Q507N473N386
$$ 261500 257635 259497 256576 247678 248258 249751 257507 258539 256540 250223 250226 250276 249419 257926 263399 268785
9657B68785K039L054l527L313M344j943L432L3J3266O710j554l74Q45J493O423
$$ 268785 270824 273878 270351 273664 278008 276065 279497 279530 292796 299506 297952 297578 298423 299916 306339
9642C06339n533j194J4153J1730k694j2853p219L934N338K569n166k498j1259
$$ 306339 300806 299612 313765 325495 322801 309948 302729 306663 312001 314570 309404 306906 295647
9629B95647o05J952M680L86J363L59j3706p014r60N517P668K880m789J638O111
$$ 295647 295042 296994 301674 302060 303423 303782 290076 283062 282102 287619 295287 298167 293378 295016 301127
9614C01127M203k206M778R395O951N813R483p12Q91J3O368M535k192J523P710
$$ 301127 305330 303124 307902 317297 324248 330061 339544 338832 339723 339736 346104 350639 348447 349970 357680
9599C57680M131M513O633M667M865k962l390K54j411O563L128K986K773K680m766
$$ 357680 361811 366324 372957 377624 382489 379527 376137 376391 374980 381543 384671 387657 390430 393110 388344
9584C88344l441k181j198l628j3619k340J743J896L244K789o70l437K910j01O922
$$ 388344 384903 382722 381524 377896 364277 361937 363680 365576 368820 371609 370939 367502 370412 370311 377233
9569C77233N122n30r83P89N14J5517M834m259r866o672J791k180j752J743K748
$$ 377233 382355 381825 380842 381631 382145 397662 402496 398237 388371 381699 383490 381310 379558 381301 384049
9554C84049n036o605J882O468L261P615Q432M536k851j388n09L470P060L031P559
$$ 384049 379013 372408 374290 380758 384019 391634 400066 404602 401751 400363 399854 403324 410384 413415 420974
9539D20974R691L155J1665M033J153Q187k770K919J0790Q892j795q688j5571p251
$$ 420974 430665 433820 445485 449518 450671 458858 456088 459007 469797 478689 476894 468206 452635 445384
9525D45384o28k823O79M136L695N520l590j2329j0087r664j1905o531k150M318
$$ 445384 444756 441933 442612 446748 450443 455963 452373 440044 429957 420293 408388 401857 399707 404025
9511D04025K334L708n42l244k872n619K331M816L410L459M623M396O034K16K504
$$ 404025 406359 410067 409525 406281 403409 397790 400121 404937 408347 411806 416429 420825 426859 427075 429579
9496D29579L716R429P715O685P552K591N546J1151J6577O076p708J132M757L483
$$ 429579 433295 442724 450439 457124 464676 467267 472813 483964 500541 506617 498909 500041 504798 508281
9482E08281n054J823j534J481p20n856q038r123j5123j1458n209r152m909l964
$$ 508281 503227 505050 503516 504997 504277 498421 490383 481260 466137 454679 449470 440318 435409 431445
9468D31445J436N12o270O060R374N997O291O112R797J5705K4641K6662K5679J313
$$ 431445 432881 433393 427123 433183 442557 448554 454845 460957 470754 486459 511100 537762 563441 564754
9454E64754j2071q962j0128r70k103J996J3785K0037J4097P223o633m815m596
$$ 564754 552683 543721 533593 532623 530520 532516 546301 566338 580435 587658 581025 576210 571614
9441E71614n610j763Q364P685j499n880j0294j9634j3604p996n425n391m958j98
$$ 571614 566004 564241 572605 580290 578791 572911 562617 542983 529379 521383 515958 510567 505609 505411
9427E05411J691O342N709M014Q224R225J2196R918J9151K5430J8680L3315M2193
$$ 505411 507102 513444 519153 523167 531391 540616 552812 562730 581881 607311 625991 659306 701499
9414G01499L9214L1011J0977n023j0723k9245m1758k6706r951l720J5361Q071
$$ 701499 740713 771724 782701 777678 766955 737710 695952 669246 659295 655575 670936 679007
9402F79007j894k635O594P769J3703J0027l053j5007j1409j5977q723l710O664
$$ 679007 677113 674478 681072 688841 702544 712571 709518 694511 683102 667125 658402 654692 661356
9389F61356J2411L870L383l204n121n819n949J700n949r05p54L691J0993Q909
$$ 661356 673767 677637 681020 677816 672695 666876 660927 662627 656678 655773 655019 658710 669703 678612
9375F78612J9377K3059J3421K3976K3141J8491P473j3638j4388j1347r688j3881
$$ 678612 697989 721048 734469 758445 781586 800077 807550 793912 779524 768177 758489 744608
9363G44608o019J281j006Q735K5376K6075M4436O6123P5722O9436M5052P264l2665
$$ 744608 738589 739870 738864 747599 772975 799050 843486 909609 985331 1054767 1099819 1107083 1074418
9350A074418n2880n1642m9966m2271k9294j1900n643r808j0521k3035j2569p099
$$ 1074418 1021538 969896 919930 877659 848365 836465 830822 821014 810493 787458 774889 767790
9338G67790o423p096m521m995p861J871Q354j952P046J5187J1519M812R377O974
$$ 767790 761367 754271 749750 744755 736894 738765 747119 745167 752213 767400 778919 783731 793108 800082
9324H00082Q503O491K517J0450Q865J8405K3692K0552K2943L9009N1794O5176
$$ 800082 808585 815076 817593 828043 836908 855313 879005 899557 922500 961509 1013303 1078479
9312A078479P7980P0596L0873j6226n1066n1537l3446j6249m965r102j3443q704
$$ 1078479 1156459 1227055 1257928 1241702 1190636 1139099 1105653 1089404 1084439 1075337 1061894 1053190
9300A053190r054j5962j4886q518q99p084l180P84K257K981o747n875L374N914
$$ 1053190 1044136 1028174 1013288 1004770 1003871 996787 993607 994391 996648 999629 992882 987007 990381 996295
9286I96295R606Q560L440K07k646J2162K1138K1554J3841J3932J0497N826M256
$$ 996295 1005901 1014461 1017901 1018108 1015462 1027624 1048762 1070316 1084157 1098089 1108586 1114412 1118668
9273A118668K966M279J2905J4806P252R866K6204K6269K0304J7748K1334J7878
$$ 1118668 1121634 1125913 1138818 1153624 1160876 1170742 1196946 1223215 1243519 1261267 1282601 1300479
9261A300479K9363K7708L3058L0240K2761K2928J0807m307j9208k5891k2377j9128
$$ 1300479 1329842 1357550 1390608 1420848 1443609 1466537 1477344 1473037 1453829 1427938 1405561 1386433
9249A386433r981q025N046m840q479j0211j7080k1377j3243j0821l512K0457K0568
$$ 1386433 1376452 1368427 1373473 1368633 1360154 1349943 1332863 1311486 1298243 1287422 1283910 1304367 1324935
9236A324935K1481K5020K6287L0406M0461L1115J4768L185l87m347j7389q023
$$ 1324935 1346416 1371436 1397723 1428129 1468590 1499705 1514473 1517658 1517271 1512924 1495535 1487512
9224A487512O80L227O16M438K74P974J8864K3348K4427K8194L3308L1165M3928
$$ 1487512 1488192 1491419 1492035 1496473 1496747 1504721 1523585 1546933 1571360 1599554 1632862 1664027 1707955
9211A707955N8437N0130L7936J1679p312k3543k3070j5762q807J219J5523K2249
$$ 1707955 1766392 1816522 1854458 1866137 1858825 1835282 1812212 1796450 1787643 1788862 1804385 1826634
9199A826634K2811M1139L4949K3065J9497K2926K7454L1781N2502O3280P9475
$$ 1826634 1849445 1890584 1925533 1948598 1968095 1991021 2018475 2050256 2102758 2166038 2245513
9188B245513Q5789J05046J33661J59959J73963J89190K47097L51400M79945N77274
$$ 2245513 2331302 2436348 2570009 2729968 2903931 3093121 3340218 3691618 4171563 4748837
9178D748837M97263K43459j611j00253n3403N5138R1721k3355k11640l29495l24998
$$ 4748837 5246100 5489559 5487948 5387695 5334292 5389430 5481151 5457796 5246156 4916661 4591663
9167D591663k51562j76465j03624j01659j25292j34142j17515q6987o4098m4287
$$ 4591663 4340101 4163636 4060012 3958353 3833061 3698919 3581404 3494417 3430319 3386032
9157C386032j8022J0904L1339O6714J03403J18053J22505J25133J13233J28046
$$ 3386032 3368010 3378914 3410253 3476967 3580370 3698423 3820928 3946061 4059294 4187340
9147D187340J76208K44871L28515M09079M89036N74425O81212Q00227R66901J213098
$$ 4187340 4363548 4608419 4936934 5346013 5835049 6409474 7090686 7890913 8857814 10070912
9137A0070912J497832J697730J579591J043282K89935l31526o42236p15801o58674
$$ 10070912 11568744 13266474 14846065 15889347 16179282 15847756 15205520 14489719 13831045
9128A3831045n28265m27346m41506n73128o98214p33419o43143m57651k43541
$$ 13831045 13302780 12875434 12433928 11860800 11162586 10429167 9786024 9328373 9084832
9119I084832p4804R631n484q7912k05998l07529l56442l48437k78470j96744j37945
$$ 9084832 9010028 9019659 9014175 8926263 8720265 8412736 8056294 7707857 7429387 7232643 7094698
9108G094698r2142o5894m9751j0860N6122J48423K33944L47195M82256O35015
$$ 7094698 7002556 6936662 6886911 6876051 6932173 7080596 7314540 7661735 8143991 8779006
9098H779006Q04267R96788J180389J368283J547687J675927J654647J447096J087358
$$ 8779006 9583273 10580061 11760450 13128733 14676420 16352347 18006994 19454090 20541448
9089B0541448N92698J56333P602J43917K90343J48825l28803p84195r01220o74877
$$ 20541448 21134146 21290479 21298081 21441998 21732341 21881166 21552363 20768168 19866948 19192071
9079A9192071m11245m06649p97299j326539j488012j170612o70314l10343k32200
$$ 19192071 18780826 18374177 17576878 16250339 14762327 13591715 12921401 12611058 12378858
9070A2378858l53324n37384o90400p19111o26877n12681m11083l42593l01625
$$ 12378858 12025534 11488150 10797750 10078639 9451762 8939081 8527998 8185405 7883780
9061G883780k75314k01731j03081k4164N1778J08011J67329K28523K84586L31861
$$ 7883780 7608466 7406735 7303654 7279490 7331268 7439279 7606608 7835131 8119717 8451578
9051H451578L86235M48070N18266O13731O93701P54401Q36742R54906J152135
$$ 8451578 8837813 9285883 9804149 10417880 11111581 11865982 12702724 13657630 14809765
9042A4809765J478503J827127J886186J462052P43674R1288k93019n86453j085671
$$ 14809765 16288268 18115395 20001581 21463633 22207307 22298595 22005576 21419123 20333452
9033B0333452j828975k461866k604145k237396j619666j026316n87982l46456
$$ 20333452 18504477 16042611 13438466 11201070 9581404 8555088 7967106 7620650
9025G620650k93180l65449m51727m69321m08192l18193k26750j51920r6190r1231
$$ 7620650 7327470 6962021 6510294 6040973 5632781 5314588 5087838 4935918 4839728 4748497
9015D748497j19163j33336j28007j32420j59889j66792j53240j15670p0057k8608
$$ 4748497 4629334 4495998 4367991 4235571 4075682 3908890 3755650 3639980 3569923 3541315
9005C541315K8493R4051J68862K45352L41327M32048N40956O60383P93447Q72834
$$ 3541315 3569808 3663859 3832721 4078073 4419400 4851448 5392404 6052787 6846234 7719068
8995G719068Q20407O07797K93467j13702m56783o87983q47972q97828q06377o59031
$$ 7719068 8539475 9147272 9440739 9327037 8870254 8182271 7334299 6436471 5630094 4971063
8985D971063n55152m97865m59146l88324l13596k33246j69690j15268q5326o6789
$$ 4971063 4415911 3918046 3458900 3070576 2756980 2523734 2354044 2238776 2153450 2086661
8975B086661o2992n1822l7139l3951k0689j3660j4790r852n614O445O160Q054
$$ 2086661 2023669 1971847 1934708 1900757 1880068 1866408 1851618 1841766 1836152 1842597 1848757 1856811
8963A856811M506o691j9647l7138n3244m9099m2015l4747l7384l0255k6103j7273
$$ 1856811 1861317 1854626 1834979 1797841 1744597 1695498 1653483 1618736 1581352 1551097 1524994 1507721
8951A507721l0481l0969k0161j2588k2474j2448o466r980k099k917j1261j0624
$$ 1507721 1477240 1446271 1426110 1413522 1391048 1378600 1372134 1362154 1360055 1357138 1345877 1335253
8939A335253j6512L198P029O326L819J4387K1236J7780K5524K8258L0354K9537
$$ 1335253 1318741 1321939 1328968 1335294 1339113 1353500 1374736 1392516 1418040 1446298 1476652 1506189
8927A506189L9075M1544M7665M2826L8286L1625L4590M3997N2864O8813P6861
$$ 1506189 1545264 1586808 1634473 1677299 1715585 1747210 1781800 1825797 1878661 1947474 2024335
8916B024335P3105P6373O0052L0975J4623M405O682J4418L6245O1076P3456Q9656
$$ 2024335 2097440 2173813 2233865 2264840 2279463 2283868 2290550 2304968 2341213 2402289 2475745 2565401
8904B565401J06764J25873J87300K89331M18681M95400M36512K65627J34995Q6532
$$ 2565401 2672165 2798038 2985338 3274669 3693350 4188750 4625262 4890889 5025884 5112416
8894E112416Q1565J08174J67193K33562K23761Q8455j17912k95918l91142l98347
$$ 5112416 5193981 5302155 5469348 5702910 5926671 6015126 5897214 5601296 5210154 4811807
8884D811807l11112j86905r7599n7562n5048m7092K617N5249Q1781R1444Q6435
$$ 4811807 4500695 4313790 4216191 4158629 4103581 4056489 4059106 4114355 4196136 4287580 4374015
8873D374015J04985J51948K19352K72549L04550L30702L33787K88766K10977J15134
$$ 4374015 4479000 4630948 4850300 5122849 5427399 5758101 6091888 6380654 6591631 6706765
8863F706765O0259M5709P1862J41524K15514K47157K31046K39497L54883N59377
$$ 6706765 6767024 6812733 6884595 7026119 7241633 7488790 7719836 7959333 8314216 8873593
8853H873593P90993R87911J093903J035084O94088J60567l02697n11577n00081
$$ 8873593 9664586 10652497 11746400 12781484 13475572 13636139 13333442 12821865 12321784
8844A2321784m07017k81955j47864K8301J50668J26986n0666k85398l72635k86040
$$ 12321784 11914767 11632812 11484948 11513249 11663917 11790903 11740237 11454839 11082204 10796164
8834A0796164q7364J15663J98602R2416j45708l48661l74961k76723j06752N1458
$$ 10796164 10708800 10824463 11023065 11115481 10969773 10621112 10246151 9969428 9862676 9914134
8824I914134J47645J95617K39322K67064K45891J99443K06304K43808K55644K57162
$$ 9914134 10061779 10257396 10496718 10763782 11009673 11209116 11415420 11659228 11914872 12172034
8814A2172034K93071L36756M42189N99048O84613N62785J27621l50192n12264
$$ 12172034 12465105 12801861 13244050 13843098 14527711 15090496 15218117 14867925 14355661
8805A4355661l57698j39294m9812n4329r533O9446K994j96025l10630j95565O7078
$$ 14355661 13997963 13858669 13808857 13754528 13744995 13814441 13817435 13621410 13310780 13115215 13182293
8794A3182293L33787M92695M91420L56304K21100J31981j7332k42562m55047n66314
$$ 13182293 13516080 14008775 14500195 14856499 15077599 15209580 15192248 14949686 14494639 13928325
8784A3928325n19914m17623l90250m45301m73470l87993k05618k3104J56716L01318
$$ 13928325 13408411 12990788 12600538 12155237 11681767 11293774 11088156 11065052 11221768 11523086
8774A1523086L62184K40635r3118m78057o57091n41392k89463p8885L8498Q9114
$$ 11523086 11885270 12125905 12032787 11554730 10897639 10356247 10066784 9987899 10026397 10115511
8764A0115511Q1811N9794P3348J43165K70109M41368O36929P88189Q72349Q78639
$$ 10115511 10197322 10257116 10330464 10473629 10743738 11185106 11822035 12610224 13482573 14361212
8754A4361212O67545K18929j41675j57319O2689K34380K06287L6250j79810m29233
$$ 14361212 15028757 15247686 15106011 14948692 15011381 15245761 15452048 15488298 15308488 14879255
8744A4879255o71037p87082p37201n58440l54870k24243j71615j36692p1749k1918
$$ 14879255 14208218 13421136 12683935 12125495 11770625 11546382 11374767 11238075 11166326 11144408
8734A1144408j7604n1202p0248l6074O8543J97744K96906L01239K01419n953k42919
$$ 11144408 11126804 11075602 11005354 10969280 11037823 11235567 11532473 11833712 12035131 12029178 11786259
8723A1786259m04150m05045k43392k2731J70416L00688L50773M25624N85350P64049
$$ 11786259 11382109 10977064 10733672 10710941 10881357 11182045 11532818 11958442 12543792 13307841
8713A3307841Q97492Q98107O61016K67049j8093j02027j38464k54886l93700m09180
$$ 13307841 14205333 15103440 15764456 16031505 16013412 15911385 15772921 15518035 15124335 14715155
8703A4715155k87668j18841M1533J88332L21444L87409M58622N33062N58149M80565
$$ 14715155 14427487 14308646 14350179 14538511 14859955 15247364 15705986 16239048 16797197 17277762
8693A7277762L05249J17556q192p7876n5360n2252j32336j76483q0169J26212
$$ 17277762 17583011 17700567 17692375 17614499 17559139 17506887 17374551 17198068 17117899 17244111
8683A7244111L57510N54405O78204P65926Q36212Q34599O96002M13448K28857
$$ 17244111 17601621 18156026 18834230 19600156 20436368 21270967 21966969 22380417 22609274
8674B2609274L12279N18729P13793Q51845R17622R19331Q20084N00609L9806k39758
$$ 22609274 22921553 23440282 24154075 25005920 25923542 26842873 27662957 28163566 28203372 27963614
8664B7963614j59858J71244N54608Q94218J112420J139155Q87027L79549p6215
$$ 27963614 27803756 27975000 28529608 29423826 30536246 31675401 32562428 32941977 32865762
8655C2865762r6959K32078M74888M88438M30062M17711O16637J176488K050426
$$ 32865762 32768803 33000881 33475769 33964207 34394269 34811980 35428617 36605105 38655531
8646C8655531K938556L455135L405611K789082J514977l82207k347013l771683
$$ 38655531 41594087 45049222 48454833 51243915 52758892 52376685 50029672 46257989
8638D6257989m214989l578026k361479j357786r24576q43351q97361p81543k58115
$$ 46257989 42043000 38464974 36103495 34745709 33821133 32977782 32080421 31298878 31040763
8629C1040763M61288J007359J262776J433245J524568J177481L95022l38463o68450
$$ 31040763 31502051 32509410 33772186 35205431 36729999 37907480 38302502 37964039 37295589
8620C7295589p34795p12995o79820q15198j161772j508546j702752j638221j373142
$$ 37295589 36560794 35847799 35167979 34352781 33191009 31682463 29979711 28341490 26968348
8611B6968348j035427p79423n65816l92315k27101j5387J47619J67072O8845J596
$$ 26968348 25932921 25153498 24587682 24195367 23968266 23952879 24100498 24267570 24336415 24338011
8601B4338011Q6418L23112N10694N42494L20400j38791n91912p91005p92896p08741
$$ 24338011 24424429 24747541 25258235 25800729 26121129 25982338 25390426 24599421 23806525 23097784
8591B3097784o43993o88963p84964q03973p56010p22253p44740q07365q72880
$$ 23097784 22453791 21764828 20979864 20175891 19419881 18697628 17952888 17145523 16272643
8582A6272643r81976j089512j017949p76548n41584m22376l49987k39123j02747
$$ 16272643 15290667 14201155 13183206 12406658 11865074 11442698 11092711 10853588 10750841
8573A0750841m2839p9202j61931k00062j82568r6416l7622j35761l70806n78115
$$ 10750841 10708002 10628800 10466869 10266807 10084239 9987823 9950201 9814440 9443634 8865519
8563H865519o38279n23897l63248k43180j91389j51294j32856j77423k08084j88841
$$ 8865519 8227240 7703343 7340095 7096915 6905526 6754232 6621376 6443953 6235869 6047028
8553F047028j65634j66961k02915k47420k74073k60097k25964j61295r3962n1482
$$ 6047028 5881394 5714433 5511518 5264098 4990025 4729928 4503964 4342669 4248707 4197225
8543D197225k2252J8445M9761L6608m7247j72876k66298k81612k17981j28449
$$ 4197225 4174973 4193418 4243179 4279787 4232540 4059664 3793366 3511754 3293773 3165324
8533C165324m9946J7040O1276P6312J8561n5226q6884p4256n2854m4627p2282
$$ 3165324 3115378 3132418 3193694 3270006 3288567 3233341 3146457 3072201 3019347 2974720 2902438
8522B902438j19860j36018j23724q6558j6179M3291J17412J41035Q8019j0738
$$ 2902438 2782578 2646560 2522836 2436278 2420099 2463390 2580802 2721837 2809856 2799118
8512B799118j40887k23894k38457k16502j74031j25330r4664q6922q0551q2240
$$ 2799118 2658231 2434337 2195880 1979378 1805347 1680017 1585353 1498431 1417880 1335640
8502A335640p0567n3291l8992l0828r512p220j1295L061K3340L1388M7524N6895
$$ 1335640 1265073 1211782 1172790 1141962 1132450 1125230 1113935 1116996 1140336 1171724 1219248 1276143
8490A276143N1738M7470N1892M4151M271m9747q0433q4310p7156q1537p4674n9764
$$ 1276143 1327881 1375351 1427243 1471394 1475665 1425918 1345485 1261175 1184019 1102482 1027808 968044
8478I68044m0904j9349n116J4082O416j9252n3266m3571l2911k7959k3690l1556
$$ 968044 927140 907791 902675 916757 923173 903921 850655 807084 774173 746214 722524 690968
8466F90968k0467j2724j3981j1415P49k338n404o250n561j1088l149N266M301
$$ 690968 670501 657777 643796 632381 633130 630792 625388 619138 613577 602489 599340 604606 608907
8453F08907j2735q557J617P663Q550J7309J7191K7209J2622j3194k6214k4040
$$ 608907 596172 587615 589232 596895 605445 622754 639945 667154 679776 666582 640368 616328
8441F16328q727k761N585k966l548k662P687J3444O992O719J2582J0530J5187
$$ 616328 607601 604840 610425 607459 603911 601249 608936 622380 629372 636091 648673 659203 674390
8428F74390J8248L3674M3364L0408n871l4222l3514l1535k4064k1174j1826o379
$$ 674390 692638 726312 769676 800084 794213 759991 726477 694942 670878 649704 637878 631499
8416F31499j2547j3828r500r590p602q397q616k448r51L400M304k070l519M675
$$ 631499 618952 605124 595624 586034 578432 570035 561419 558971 558020 561420 565724 563654 560135 564810
8402E64810J4947J7846K3186L9495N2324K2798k0357k6679q207k683P641O719
$$ 564810 579757 597603 620789 660284 712608 735406 715049 688370 680163 677480 685121 691840
8390F91840R573J6638K7275M0183N3039K7207p011k4735k7764k1847q741j2835
$$ 691840 701413 718051 745326 785509 838548 865755 858744 834009 806245 784398 775657 762822
8378G62822l9292n6799n5128l7070k6189k8796j6189j3128j0398n785j0521r536
$$ 762822 723530 666731 611603 574533 548344 519548 503359 490231 479833 474048 463527 453991
8366D53991j2561j0029r894L275L711j2562r82n13k210k681j673R570Q130P163
$$ 453991 441430 431401 421507 424782 428493 415931 414949 414436 412226 409545 407872 417442 425572 432735
8352D32735J4082K8070L6651K6527L299j2474k7113j9473n664J750m000l22o53
$$ 432735 446817 474887 511538 538065 541364 528890 501777 482304 476640 478390 474390 474068 473415
8339D73415K274O994J0753J8381J3841p200l9003l4679k1573n587J584L106K935
$$ 473415 475689 482683 493436 511817 525658 518458 479455 444776 423203 417616 419200 422306 425241
8326D25241q210j0833j1764j0231j1956j0855o705L556N244j586j177P402J6920
$$ 425241 417031 406198 394434 384203 372247 361392 354687 358243 363487 361901 360724 368126 385046
8313C85046K004l857o126j1303k471P199J1546J0965R731j129k391R139K188P874
$$ 385046 387050 383193 377067 365764 363293 370492 382038 393003 402734 401605 399214 408353 410541 418415
8299D18415R188J6805J7520J6798J2648J3927K3729K9306L8068O0340N1358l527
$$ 418415 427603 444408 461928 478726 491374 505301 529030 558336 596404 656744 708102 704575
8287G04575o3889p2733n3043k7487k5842p924k186j1274j2379m142q581o17o410
$$ 704575 640686 567953 514910 487423 461581 453657 451471 440197 427818 423676 415095 414478 408068
8274D08068J503Q5o069O52J7007L2486M0300J9361k3759k9222j4828l574k275
$$ 408068 409571 409656 403587 404239 421246 453732 494032 513393 489634 460412 445584 442010 439735
8261D39735O626R604O276r237j1156O384K2776L4145N5245N9278L4388J8712J9294
$$ 439735 446361 455965 462241 453004 441848 448232 471008 505153 560398 619676 654064 672776 692070
8248F92070K1095K696j7209k0249j4830j2105j6588l2718m6994k8996j3124r003
$$ 692070 713165 715861 698652 678403 663573 651468 634880 602162 555168 526172 513048 504045
8236E04045j1786k454N377J3868P9j3188j2024j3801q053l594p125k12j380j199
$$ 504045 492259 489805 495182 509050 509129 495941 483917 470116 462063 458469 451344 451132 449752 448553
8222D48553J2035Q672O79r687j2580K38n067L495J2812Q567O165J0382J2894J8998
$$ 448553 460588 469260 469939 460252 447672 447910 442843 446338 459150 467717 473882 484264 497158 516156
8208E16156L0305L7163L2151R839m894k3600r809j835J5603K2375J6185J2713
$$ 516156 546461 583624 615775 625614 620720 597120 587311 585476 601079 623454 639639 652352
8196F52352j4266k2103j7426j0004k708j5223j4251j6367j1041j1010j6696q667
$$ 652352 638086 615983 598557 588553 585845 570622 556371 540004 528963 517953 501257 492590
8184D92590j2430k597J6620K7968L2478J2521M436j3548j3061j1838l079R637
$$ 492590 480160 477563 494183 522151 554629 567150 571586 558038 544977 533139 530060 539697
8172E39697J0825P283R636N734M803J2368Q015Q179J3874K0976K5173K8153K6180
$$ 539697 550522 557805 567441 573175 577978 590346 598361 606540 620414 641390 666563 694716 720896
8159G20896K8149L6188L3359K7794K9009K5485R371o669j7082j6647j5889j1625
$$ 720896 749045 785233 818592 846386 875395 900880 910251 903582 886500 869853 853964 842339
8147H42339j1070r589j2934l99K695J1774R546K2950L1604L3551L6305L8633N0156
$$ 842339 831269 821680 808746 808347 811042 822816 832362 855312 886916 920467 956772 995405 1045561
8134A045561N3041N0191L8910K6157J4920M948O897K6825L1620K6135K9965L0832
$$ 1045561 1098602 1148793 1187703 1213860 1228780 1233728 1240625 1267450 1299070 1325205 1355170 1386002
8122A386002L4063M0901L0468K1335J7006O616J1983K5285L8518M7821M3753N3823
$$ 1386002 1420065 1460966 1491434 1512769 1529775 1536391 1548374 1573659 1612177 1659998 1703751 1757574
8110A757574N9202N0735J8163j8278j6855J174J9995K0265K5039K1096J4962J0694
$$ 1757574 1816776 1867511 1885674 1867396 1850541 1851715 1871710 1891975 1917014 1938110 1953072 1963766
8098A963766Q787J9116J0554N540J9479M0416P1621R7983J11811J14645J02688
$$ 1963766 1972553 1991669 2002223 2007763 2027242 2067658 2139279 2237262 2349073 2463718 2566406
8087B566406Q9593Q1549O0321K8961J0839J8975M0303N9833P2400N1411P497j3239
$$ 2566406 2655999 2737548 2797869 2826830 2837669 2856644 2896947 2956780 3029180 3080591 3088088 3074849
8075C074849k6724k4288J2452O3572J02043J17697J14075J05410R9514R2952J02687
$$ 3074849 3048125 3023837 3036289 3099861 3201904 3319601 3433676 3539086 3638600 3731552 3834239
8064C834239J19282J28831J32144J56550K05168K59826L18016L75243M58500N23008
$$ 3834239 3953521 4082352 4214496 4371046 4576214 4836040 5154056 5529299 5987799 6510807
8054F510807N21283M63968L72747K96576K92919L87417N25774O04485O17746P27042
$$ 6510807 7032090 7496058 7868805 8165381 8458300 8845717 9371491 9975976 10593722 11320764
8044A1320764J108699J672194K372656L056846L471493L450202L113082K356134
$$ 11320764 12429463 14101657 16474313 19531159 23002652 26452854 29565936 31922070
8036C1922070J245601L88947l43913j175337j710325j814558j724784j578719
$$ 31922070 33167671 33556618 33212705 32037368 30327043 28512485 26787701 25208982
8028B5208982j398259j257359j178605j007571p08556m00801k12260j25878j13805
$$ 25208982 23810723 22553364 21374759 20367188 19658632 19257831 19045571 18919693 18805888
8019A8805888j39995j77891j04485J54595M76936O49357O91739P96891J035167
$$ 18805888 18665893 18488002 18383517 18538112 19015048 19664405 20356144 21153035 22188202
8010B2188202J239706J202533R96241Q74933Q71135R24832J111839J374942J534515
$$ 22188202 23427908 24630441 25626682 26501615 27372750 28297582 29409421 30784363 32318878
8001C2318878J562411J920754L130322N155464P678773J0477642J3210312J2794322
$$ 32318878 33881289 35802043 38932365 44087829 51766602 62244244 75454556 88248878
7993H8248878L935853r692923j6021314j4285637j0136150o438275l976740k674492
$$ 88248878 92184731 82491808 66470494 52184857 42048707 35610432 31633692 28959200
7985B8959200k137470j889474j671262j413361j158068j005757r64113r39466
$$ 28959200 26821730 24932256 23260994 21847633 20689565 19683808 18719695 17780229
7977A7780229q50714p08386n70970n23212n25981n37658n22420n03465m85701
$$ 17780229 16929515 16221129 15650159 15126947 14600966 14063308 13540888 13037423 12551722
7968A2551722m64811m09962l06949j54336N9283K85486M77271O10864P22645R16914
$$ 12551722 12086911 11676949 11370000 11215664 11274947 11560433 12037704 12648568 13371213 14288127
7958A4288127J271235J764387K324178K768723K881403K684760K349464J641690
$$ 14288127 15559362 17323749 19647927 22416650 25298053 27982813 30332277 31973967
7950C1973967K92235j132650j887166k313122l046290l501114l038755k410429
$$ 31973967 32266202 31133552 29246386 26933264 23886974 20385860 17347105 14936676
7942A4936676k215007k078539j671164j183837p87595n00508l22052k75954k99813
$$ 14936676 12721669 10643130 8971966 7788129 7000534 6500026 6177974 5902020 5602207
7933E602207l15128k91306k63026k43258k27931k12241j97020j75066j63940j74692
$$ 5602207 5287079 4995773 4732747 4489489 4261558 4049317 3852297 3677231 3513291 3338599
7923C338599j89505j92228j75532j62472j47472j43820j42472j35281j12226r5053
$$ 3338599 3149094 2956866 2781334 2618862 2471390 2327570 2185098 2049817 1937591 1842538
7913A842538q3894p7985o8073m9694m9988m7569m2661n1433o3668n7047m8957
$$ 1842538 1758644 1680659 1612586 1562892 1512904 1465335 1422674 1371241 1307573 1250526 1201569
7902A201569m2945m6668n6662n2867m3835l6770l3587k5433j6140j3831j2445
$$ 1201569 1158624 1111956 1055294 1002427 958592 921822 888235 862802 846662 832831 820386
7891H20386j5673k5307j6670j0551q351j4887j6572j9678j8221j2157m482j2242
$$ 820386 804713 779406 762736 752185 743834 728947 712375 692697 674476 662319 657837 645595
7879F45595o208J693n562q652j3145j0698j3286k2091k0944p068r217j1022j6172
$$ 645595 639387 641080 635518 626866 613721 603023 589737 567646 546702 539634 530417 519395 503223
7866E03223k2239j7905j8988j4576j2584o393j4127k1829k1872j1015j802o131
$$ 503223 480984 463079 444091 429515 416931 410538 396411 374582 352710 341695 339893 333762
7854C33762j0076p616O422L968j0621p607n817j1795j5367j0101j860j587l986
$$ 333762 323686 316070 322492 326460 315839 308232 302415 290620 275253 265152 263292 261705 257719
7841B57719j6105j1036l806k849l621M022%Q589o275l719m465j752j0781o467
$$ 257719 241614 230578 226772 223923 220302 224324 224324 232913 226638 222919 218454 216702 205921 199454
7827A99454Q36P83j134m950L364m424q92p933j358o292j4640j0835Q61K632P4
$$ 199454 200290 201073 199939 194989 198353 193929 193037 185104 183746 177454 162814 151979 152840 155472 155546
7812A55546r116j1164j46p68L669M108m915k336J1m66n960P276l576o521l788
$$ 155546 146430 135266 135120 134352 138021 142129 137214 134878 134889 134423 128463 135739 132163 125642 121854
7797A21854M43j132k247m972l471p71j7K12k885l771o528m720K008l073o753j710
$$ 121854 122297 121165 118918 113946 110475 109704 109687 109899 107014 103243 96715 91995 94003 90930 84177 82467
7781H2467P849K993K564J697k537n559L146m759o189k555Q817K468j726k993k929
$$ 82467 90316 93309 95873 97570 95033 89474 92620 87861 81672 79117 87934 90402 88676 85683 82754
7766H2754m323o069K363N927j967Q12j419M17kk19o132n17p77j3628o566J448
$$ 82754 78431 72362 74725 80652 78685 79497 78078 78495 78493 78274 72142 71625 70848 57220 50654 52102
7750E2102K449R050N577l807j633K60k798p412N778O221k148l945Q586M584l24
$$ 52102 54551 63601 69178 65371 63738 63998 61200 53788 59566 65787 63639 59694 68280 72864 72540
7735G2540j165n943j016o134o494P253K939k997M03r45j547O38k521k026m579
$$ 72540 71375 65432 64416 58282 51788 59041 61980 58983 59386 58441 56894 57532 55011 52985 48406
7720D8406o453K063j378M775M727L027K325k346l860O20M139N419K47o243J033
$$ 48406 41953 44016 42638 47413 52140 55167 57492 55146 51286 51906 56045 61464 61711 55468 56501
7705E6501k125j344o100j861j779O833K401n638k550j160l655k255m754Q07O979
$$ 56501 54376 53032 46932 45071 43292 50125 52526 46888 44338 43178 39523 37268 32514 33321 40300
7690D0300k490n007k217J0330N798O63K430q63N641L992j2043o168j411m8N655
$$ 40300 37810 32803 30586 40916 46714 47377 49807 48944 54585 58577 46534 40366 38955 38907 44562
7675D4562L668l473k82K627l694K24N38J44K074M673M64K005O566O298j494l5
$$ 44562 48230 44757 44475 47102 43408 43632 44170 44314 46388 51061 51525 53530 60096 66394 64900 64865
7659F4865j0m819J147j254k783j930M107J743J689k19L593O188J0730O385J7917
$$ 64865 64855 60036 61183 59929 57146 55216 59323 61066 62755 62536 66129 72317 83047 89432 107349
7644A07349K1258K1056K1052K8087K1583M870r069j1459j3634o950j4926j2377
$$ 107349 128607 149663 170715 198802 220385 225255 216186 204727 191093 184143 169217 156840
7632A56840j7043n947j379j377m396n058l542n487o051n724l371m725m280J992
$$ 156840 139797 133850 132471 131094 126698 121640 118098 112611 106560 100836 97465 92740 88460 90452
7618I0452J559N986L941N367Q14J461Q381J3673J0434N840Q341M613O503P230
$$ 90452 92011 97997 101938 107305 108119 109580 117961 131634 142068 147908 156249 160862 167365 174595
7604A74595J2269J9118K5867K8406M3888O1446P5095Q1600L3835l9665q8259q9749
$$ 174595 186864 205982 231849 260255 304143 365589 440684 522284 556119 516454 428195 338446
7592C38446o9446m9665k5961j5411j6562q901q759j6817q340l726l604k341p40
$$ 338446 269000 219335 193374 177963 161401 152500 143741 126924 118584 114858 111254 108913 108173
7579A08173p910j3154m763k268l638k002n15p926j163R451O737k266K717L631
$$ 108173 100263 87109 82346 80078 76440 74438 73923 65997 64834 74285 81022 78756 81473 85104
7565H5104n773K880Q260l123Q466Q643R419O926J6007K1660K6829K5331K6239
$$ 85104 79331 82211 90471 87348 95814 104457 113876 120802 136809 158469 185298 210629 236868
7552B36868J2412L287j9369l8255l4630l0187k1591k4889j6585m440j294o30r661
$$ 236868 249280 252567 233198 194943 160313 130126 108535 83646 67061 62621 61327 60697 51036
7539E1036j1170p124O513J963k734l858O510j094p457k328P8J45L86M173L359
$$ 51036 39866 32742 39255 41218 38484 34626 41136 40042 32585 30257 30335 30480 30866 35039 38398
7524C8398r206r215M114K173l081n732K663r35L259K252N993k585m863k364j191
$$ 38398 29192 19977 24091 26264 23183 17451 20114 19179 22438 24690 30683 28098 23235 20871 19680
7509A9680n912n060J000l356n277j384P656P107l970M84l792p455L599M566L218
$$ 19680 13768 8708 9708 6352 1075 -309 7347 14454 10484 10968 7176 -279 3320 7886 11104
7494A1104o61N793N348M172k885l843l800M011P703P74k082j358p003j0287K99
$$ 11104 10443 16236 21584 25756 22871 19028 15228 19239 26942 27716 25634 24276 17273 6986 7285
7479G285P881L090j568K565k617q610m871L605P379P296J940M04P45n327n545
$$ 7285 15166 18256 16688 19253 16636 8026 3155 6760 14139 21435 23375 23779 24524 19197 13652
7464A3652n107k554M422k332P04M706M57R9j1214m315K542N569M071J058n831
$$ 13652 8545 5991 10413 8081 8785 13491 13948 14047 2833 -1482 1060 6629 10700 11758 5927
7449E927k146Q626M645P310j678p218q159k333O025O639J923m616o36l640K296
$$ 5927 3781 12407 17052 24362 22684 15466 7307 4974 10999 17638 19561 14945 14309 10669 12965
7434A2965K664J306K703O574n163p982m891m486j963Q65N435K680N940J05m324
$$ 12965 15629 16935 19638 26212 21049 13067 8176 3690 1727 2592 8027 10707 16647 16752 12428
7419A2428r242p19M857m043o769q66K983N351M239M041L802r839k560J55O71J526
$$ 12428 3186 2467 7324 3281 -3488 -4354 -1371 3980 8219 12260 16062 6223 3663 3818 4489 6015
7403F015m88J861n828N283L66m726O771N768M533o883j046J052l653l428l21J271
$$ 6015 5527 7388 1560 6843 7209 2483 9254 15022 19555 12672 11626 12678 9025 5597 5276 6547
7387F547K232Q71J679N317p879m859n074j234K040R760J206m768J384k163K86
$$ 6547 8779 9650 11329 16646 8767 3908 -1166 -2400 -360 9400 10606 5838 7222 5059 5345
7372E345l912n32j391r94Q49m467l31M752Q293l440K65l344l302k831j433r747
$$ 5345 1433 901 -490 -1484 -635 -5102 -5433 -681 7612 4172 4437 1093 -2209 -5040 -6473 -16220
7356a6220J480J1341Q231p10Q56j303o234k16k978K021O226k039Q80o504O458
$$ -16220 -14740 -3399 4832 4122 4978 3675 -2559 -2775 -5753 -3732 2494 455 1335 -5169 1289
7341A289M667o449p161k700L132N003M401J508K095r31p684l937P813k435k368
$$ 1289 5956 -493 -7654 -10354 -7222 -2219 2182 3690 5785 4854 -2830 -6767 1046 -1389 -3757
7326c757P710M457j67k329K803l380j806O049J496r734j81L256K563p949k27N559
$$ -3757 3953 8410 8243 5914 8717 5337 3531 9580 11076 1342 1161 4417 6980 -969 -1196 4363
7310D363K805M517j947l074n106j416M680l082K599M078k145o8L931n734m593
$$ 4363 7168 11685 9738 6664 1558 142 4822 1740 4339 8417 6272 6204 10135 4401 -192
7295a92M60M864m668k336M029N597j694n895M313N593l17n116l257J127Q20m051
$$ -192 268 5132 464 -1872 2157 7754 6060 165 4478 10071 9754 4638 1381 2508 3328 -723
7279g23o597l876K337L761R497j412j427P546M416n795m659m361m80N584j028
$$ -723 -7320 -11196 -8859 -5098 4399 2987 1560 9106 13522 7727 3068 -1293 -1773 3811 2783
7264B783J835N394L112k69p178J326M940M709j425n44O293L413p286j3107n176
$$ 2783 4618 10012 13124 12855 5677 7003 11943 16652 15227 14683 20976 24389 17103 3996 -1180
7249a180p00M97j234J536L336L79l332j374M093p49k273k48K927P111j8m24o25
$$ -1180 -1880 -1383 -2617 -1081 2255 2634 -698 -2072 2021 1272 -1001 -1249 1678 8789 8771 8347 7722
7232G722m415n145n663M587K686o49L834O531K02n711l952p538o196P544P394
$$ 7722 3307 -1838 -7501 -2914 -228 -877 2957 9488 9690 3979 27 -7511 -13707 -6163 1231
7217A231M355L70K100M046j354j790m410r879k045J190K387K901K574k935r61
$$ 1231 5586 5956 8056 12102 10748 8958 4548 -5331 -7376 -6186 -3799 -898 1676 -1259 -2220
7202b220m274k805J412m900K799J319j179j974l038p43K664R633J1498K142p330
$$ -2220 -6494 -9299 -7887 -12787 -9988 -8669 -9848 -11822 -14860 -15603 -12939 -3306 8192 10334 3004
7187C004k97K874l015l458J27k488Q10j972M922M458K666O833r59M016j4522l359
$$ 3004 2707 5581 2566 -892 -765 -3253 -2443 -4415 507 4965 7631 14464 13505 17521 2999 -360
7171c60m02k108m186m729J843M528N414Q02j653l677n484M293m271M869N566o453
$$ -360 -762 -2870 -7056 -11785 -9942 -5414 0 802 -851 -4528 -10012 -5719 -9990 -5121 445 -6008
7155f008M524P052j084m363M969M035J508k449K021k302j81M92j685j932j27j259
$$ -6008 -1484 5568 4484 121 5090 9125 10633 8184 10205 7903 7722 8214 6529 4597 4470 3211
7139C211m930o097P744O306j176j556n554p79k876J468L650o096l926j148M222
$$ 3211 -1719 -7816 -72 6234 5058 3502 -2052 -2831 -5707 -4239 -589 -6685 -10611 -11759 -7537
7124g537M501L504L733j564l391l146J234k623M418P02l193m425N072q0L04K974
$$ -7537 -3036 468 4201 2637 -754 -3900 -2666 -5289 -871 -169 -3362 -7787 -2715 -2795 -2491 483
7108D83M080j932m67l617r250k698L42N786m32l420o0j144L077j32M575J694L226
$$ 483 4563 2631 2164 -1453 -10703 -13401 -13059 -7273 -7705 -11125 -11185 -12329 -9252 -9384 -4809 -3115 111
7091A11O76p826j411J170K070L033K921P856L915k345m024q36j605K139n98m763
$$ 111 787 -7039 -8450 -7280 -5210 -2177 744 8600 12515 10170 6146 5310 3705 5844 5246 483
7075D83M117M290l705q379l336k360k561L901Q10k500L556J797m44l573j563J742
$$ 483 4600 8890 5185 -3194 -6530 -8890 -11451 -7550 -6740 -9240 -5684 -3887 -4331 -7904 -9467 -7725
7059g725L762j761n649K32L043j540l090K071N189K871R79L204L377j244k660
$$ -7725 -3963 -5724 -11373 -11141 -8098 -9638 -12728 -10657 -5468 -2597 -1618 1586 4963 3719 1059
7044A059j407L008r47M638k76l544L902j564k211j637K669K915J908m60K416L345
$$ 1059 -348 2660 1713 6351 6075 2531 6433 4869 2658 1021 3690 6605 8513 8053 10469 13814
7028A3814K016n990j374J3o464l779k843K017j56J078k52o28m927j332k615J958
$$ 13814 15830 9840 8466 8479 2015 -1764 -4607 -2590 -2746 -1668 -1920 -2548 -7475 -8807 -11422 -9464
7012i464O110J517M498K006o217k140J458N70k474k252K070L114m455K754L28
$$ -9464 -3354 -1837 2661 4667 -1550 -3690 -2232 -1662 -4136 -6388 -4318 -1204 -5659 -2905 -2577
6997b577J718l943n914P04N688M601k88k30l483l466R009N533J5o791K451N878
$$ -2577 -859 -4802 -10716 -10012 -4324 277 -11 -241 -3724 -7190 1819 7352 7367 576 3027 8905
6981H905n952m427k187l707N61l341K656O453n44l400J1715O167n896J349m50
$$ 8905 2953 -1474 -3661 -7368 -6807 -10148 -7492 -1039 -1583 -4983 6732 12899 7003 8352 7902
6966G902j1775k482M749K03o07j752k134p98q225p72p92J77M956K484Q44J835
$$ 7902 -3873 -6355 -1606 -1403 -2010 -3762 -5896 -6694 -14919 -15691 -16483 -16306 -11350 -8866 -8022 -6187
6950f187O567k125m278K524j280q492r88L023O786Q785K831p203r039M17l809
$$ -6187 380 -1745 -6023 -3499 -4779 -13271 -14259 -11236 -4450 4335 7166 -37 -9076 -8659 -12468
6935a2468j07J864M259o65M6l070k772L702K715k32P95m017l155k994P1N671Q345
$$ -12468 -12575 -10711 -6452 -7117 -7071 -10141 -12913 -9211 -6496 -6728 -5933 -9950 -13105 -16099 -16028 -10357 -2012
6918b012K231j259k519M90p15Q7k684k813m269J909R28m599O859O518j606p833
$$ -2012 219 -1040 -3559 -3069 -3784 -3697 -6381 -9194 -13463 -11554 -10626 -15225 -8366 -1848 -3454 -11287
6902a1287k873N916N787O35l977o874o391J2350M098n831J662N989M607k499p390
$$ -11287 -14160 -8244 -2457 -1822 -5799 -12673 -19064 -6714 -2616 -8447 -6785 -796 3811 1312 -6078
$$ [...]
##END NTUPLES=NMR SPECTRUM
##END=
