##TITLE=Analysis number 325835
Compound Code sb 00932
Project Code adrs
Chemist Name stores
##JCAMPDX= 6.0         $$ Bruker NMR JCAMP-DX V2.0
##DATA TYPE= NMR SPECTRUM
##DATA CLASS= NTUPLES
##ORIGIN= Bruker BioSpin GmbH
##OWNER= nmr
$$ XWIN-NMR		Version 3.5
$$ Tue Jan 16 12:38:44 2007 GMT Standard Time (UT+0h)  MAYBRIDGE\nmr@NMR_250MHZ
##.OBSERVE FREQUENCY= 250.131544655141
##.OBSERVE NUCLEUS= ^1H
##.ACQUISITION MODE= SIMULTANEOUS (DQD)
##.ACQUISITION SCHEME= undefined
##.AVERAGES= 16
##.DIGITISER RES= 18
##SPECTROMETER/DATA SYSTEM= dpx250
##.PULSE SEQUENCE= zg30
##.SOLVENT NAME= CDCl3
##.SHIFT REFERENCE= (INTERNAL, CDCl3, 0, 16.522)
##AUDIT TRAIL= $$ (NUMBER, WHEN, WHO, WHERE, WHAT)
$$ ##TITLE= Audit trail, XWIN-NMR		Version 3.5
$$ ##JCAMPDX= 5.01
$$ ##ORIGIN= Bruker BioSpin GmbH
$$ ##OWNER= nmr
$$ C:\u/data/dgb/nmr/ADRS/1220/pdata/1/auditp.txt
$$ ##AUDIT TRAIL=  $$ (NUMBER, WHEN, WHO, WHERE, WHAT)
(   1,<2007-01-16 12:38:12.32 +000>,<MAYBRIDGE\nmr>,<NMR_250MHZ>,
      <created by zg, POWCHK disabled, PULCHK disabled
       configuration hash MD5:
       49 4B E0 1D 92 C2 6B 37 9F E6 65 BC 52 41 86 1D
       data hash MD5: 64K
       6A 88 3C 75 94 9C 86 B2 70 E1 5E FB 70 9F 11 9B>)
(   2,<2007-01-16 12:38:27.02 +000>,<MAYBRIDGE\nmr>,<NMR_250MHZ>,
      <Start of raw data processing
       ef LB = 0.3 FT_mod = 6 PKNL = 1 SI = 32K 
       data hash MD5: 32K
       8C 0F 59 02 6E 22 07 FC 69 F9 02 2E 7C 39 6A 0B>)
(   3,<2007-01-16 12:38:30.99 +000>,<MAYBRIDGE\nmr>,<NMR_250MHZ>,
      <apk 
       data hash MD5: 32K
       6C A6 8B B5 C3 14 88 E0 00 30 23 3C AC EF 79 36>)
(   4,<2007-01-16 12:38:32.52 +000>,<MAYBRIDGE\nmr>,<NMR_250MHZ>,
      <abs ABSG = 5 
       data hash MD5: 32K
       59 CA E0 8A 95 B0 69 EF 00 D8 0C FD D6 81 D1 3D>)
$$ ##END=
$$ 
$$ hash MD5
$$ A0 2B 6B 06 0C 1A 1E 02 F8 24 9F E7 44 32 BB FF
##$RELAX= 
##$RELAX= 
##$RELAX= 
##$RELAX= 
##$RELAX= 
##$RELAX= 
##$RELAX= 
$$ Bruker specific parameters
$$ --------------------------
##$DU= <C:\u>
##$EXPNO= 1220
##$NAME= <ADRS>
##$PROCNO= 1
##$TYPE= <nmr>
##$USER= <dgb>
##$AMP= (0..31)
100 100 100 100 100 100 100 100 100 100 100 100 100 100 100 100 100 100 
100 100 100 100 100 100 100 100 100 100 100 100 100 100 
##$AQSEQ= 0
##$AQ_mod= 3
##$AUNM= <au_zg>
##$AUTOPOS= <41 >
##$BF1= 250.13
##$BF2= 250.13
##$BF3= 250.13
##$BF4= 250.13
##$BF5= 500.13
##$BF6= 500.13
##$BF7= 500.13
##$BF8= 500.13
##$BYTORDA= 1
##$CFDGTYP= 0
##$CFRGTYP= 5
##$CHEMSTR= <none>
##$CNST= (0..31)
1 1 145 1 1 1 1 1 1 1 1 1 1 1 1 1 1 1 1 1 1 1 1 1 1 1 1 1 1 1 1 1 
##$CPDPRG= <>
##$CPDPRG1= <>
##$CPDPRG2= <>
##$CPDPRG3= <>
##$CPDPRG4= <mlev>
##$CPDPRG5= <mlev>
##$CPDPRG6= <mlev>
##$CPDPRG7= <mlev>
##$CPDPRG8= <mlev>
##$CPDPRGB= <>
##$CPDPRGT= <>
##$D= (0..31)
0 1 0 0 0 0 0 0 0 0.06 0 0 0 0 0 0 0.0002 0 0 0 0 0 0 0 0 0 0 0 0 0 0 
0 
##$DATE= 1168951091
##$DBL= (0..7)
120 120 120 120 120 120 120 120 
##$DBP= (0..7)
150 150 150 150 150 150 150 150 
##$DBP07= 0
##$DBPNAM0= <>
##$DBPNAM1= <>
##$DBPNAM2= <>
$$ [...]
##$SUBNAM6= <"">
##$SUBNAM7= <"">
##$SUBNAM8= <"">
##$SUBNAM9= <"">
##$SW= 20.6930455092707
##$SWIBOX= (0..15)
0 0 3 0 0 0 0 0 0 0 0 0 0 0 0 0 
##$SW_h= 5175.983436853
##$TD= 65536
##$TD0= 1
##$TE= 294.16
##$TE2= 300
##$TE3= 300
##$TEG= 300
##$TL= (0..7)
0 120 120 120 120 120 120 120 
##$TP= (0..7)
150 150 150 150 150 150 150 150 
##$TP07= 0
##$TPNAME0= <>
##$TPNAME1= <>
##$TPNAME2= <>
##$TPNAME3= <>
##$TPNAME4= <>
##$TPNAME5= <>
##$TPNAME6= <>
##$TPNAME7= <>
##$TPOAL= (0..7)
0.5 0.5 0.5 0.5 0.5 0.5 0.5 0.5 
##$TPOFFS= (0..7)
0 0 0 0 0 0 0 0 
##$TUNHIN= 0
##$TUNHOUT= 0
##$TUNXOUT= 0
##$USERA1= <user>
##$USERA2= <user>
##$USERA3= <user>
##$USERA4= <user>
##$USERA5= <user>
##$V9= 5
##$VALIST= <valist>
##$VCLIST= <CCCCCCCCCCCCCCC>
##$VD= 0
##$VDLIST= <DDDDDDDDDDDDDDD>
##$VPLIST= <PPPPPPPPPPPPPPP>
##$VTLIST= <TTTTTTTTTTTTTTT>
##$WBST= 1024
##$WBSW= 4
##$XGAIN= (0..3)
0 0 0 0 
##$XL= 0
##$YL= 0
##$YMAX_a= 705257
##$YMIN_a= -763662
##$ZGOPTNS= <>
##$ZL1= 120
##$ZL2= 120
##$ZL3= 120
##$ZL4= 120
##$ABSF1= 16.522
##$ABSF2= -4.171173
##$ABSG= 5
##$ABSL= 3
##$ALPHA= 0
##$AQORDER= 0
##$ASSFAC= 0
##$ASSFACI= 0
##$ASSFACX= 0
##$ASSWID= 0
##$AUNMP= <proc_1d>
##$AZFE= 0.1
##$AZFW= 0.1
##$BCFW= 0
##$BC_mod= 0
##$BYTORDP= 0
##$COROFFS= 0
##$CY= 12.5
##$DATMOD= 1
##$DC= 0
##$DFILT= <>
##$DTYPP= 0
##$F1P= 14.0000005364418
##$F2P= -0.99999901652339
##$FCOR= 0.5
##$FTSIZE= 32768
##$FT_mod= 6
##$GAMMA= 0
##$GB= 0
##$INTBC= 1
##$INTSCL= 1
##$ISEN= 128
##$LB= 0.3
##$LEV0= 0
##$LPBIN= 0
##$MAXI= 10000
##$MC2= 0
##$MEAN= 0
##$ME_mod= 0
##$MI= 0
##$NCOEF= 0
##$NC_proc= -2
##$NLEV= 6
##$NOISF1= 0
##$NOISF2= 0
##$NSP= 0
##$NTH_PI= 0
##$NZP= 0
##$OFFSET= 16.522
##$PC= 1
##$PHC0= 227.91
##$PHC1= 4.855469
##$PH_mod= 1
##$PKNL= yes
##$PPARMOD= 0
##$PSCAL= 4
##$PSIGN= 0
##$REVERSE= no
##$SF= 250.13
##$SI= 32768
##$SIGF1= 0
##$SIGF2= 0
##$SINO= 400
##$SIOLD= 32768
##$SREGLST= <1H.CDCl3>
##$SSB= 0
##$STSI= 32768
##$STSR= 0
##$SW_p= 5175.98343685301
##$SYMM= 0
##$S_DEV= 0
##$TDeff= 65536
##$TDoff= 0
##$TI= <Analysis number 999999
Compound Code 99
Book Reference 9
Project Code 9>
##$TILT= no
##$TM1= 0
##$TM2= 0
##$TOPLEV= 0
##$USERP1= <user>
##$USERP2= <user>
##$USERP3= <user>
##$USERP4= <user>
##$USERP5= <user>
##$WDW= 1
##$XDIM= 32768
##$YMAX_p= 372253632
##$YMIN_p= -361623
$$ End of Bruker specific parameters
$$ ---------------------------------
##NTUPLES= NMR SPECTRUM
##VAR_NAME=  FREQUENCY,     SPECTRUM/REAL,   SPECTRUM/IMAG
##SYMBOL=    X,             R,               I
##VAR_TYPE=  INDEPENDENT,   DEPENDENT,       DEPENDENT
##VAR_FORM=  AFFN,          ASDF,            ASDF
##VAR_DIM=   32768,         32768,           32768
##UNITS=     HZ,            ARBITRARY UNITS, ARBITRARY UNITS
##FACTOR=    0.157963299565203, 1,           1
##FIRST=     4132.6476996994, 0,             0
##LAST=      -1043.33573715361, 0,           0
##MIN=       -1043.33573715361, -361623,     0
##MAX=       4132.6476996994, 372253632,     0
$$ Real data points
##PAGE= N=1
##DATA TABLE= (X++(R..R)), XYDATA
$$ [...]
19535 -8508 -2547 -8641 -8338 -1247 -2135 -7417 -5580 -6512 -3631 351 3464 -1717 -10794 -13760 -14020 -16394
19519 -16394 -17943 -15626 -11436 -7069 -6714 911 3780 -2724 -2260 2322 2205 -2675 -6567 -5370 4304
19504 4304 5963 5443 2817 -723 -1036 1212 4289 936 3488 6354 4964 1735 2974 -3053 -12451
19489 -12451 -15309 -13906 -16516 -16296 -9258 -2368 -2513 -8765 -8746 -6058 -2958 -188 521 -5074 -7385 -4431
19473 -4431 -6758 -11865 -9213 2556 8261 7867 3909 9876 6576 5875 2294 4051 5701 5178 4251
19458 4251 -1346 -5892 -7043 -11855 -12130 -16606 -19417 -23073 -17820 -16671 -10309 -4440 -63 813 2779
19443 2779 9255 12747 7337 4382 2844 8365 11305 2984 3265 1074 -3469 1032 3713 3484 2145
19428 2145 -1559 2279 -3953 -6594 145 1582 1587 3895 2293 2379 -1640 -3516 -10234 -7776 -13269 -10602
19412 -10602 -4654 -6168 -5297 1929 5191 -3321 -7081 2168 9495 7475 -6906 -14175 -16965 -11380
19398 -11380 -6964 -2540 2176 5387 -145 -4769 -4996 -4347 -2249 -1147 -50 4188 794 -8507 -9521
19383 -9521 -7124 -4081 -3132 -2627 1922 -340 2635 897 -3277 -3638 -4419 -11136 -14714 -10214 -11472 -14201
19367 -14201 -6808 -3269 -2025 -1915 -2738 -5494 -3178 -492 -5034 -9080 -11668 -6317 -903 -2392 1064
19352 1064 -246 -1818 -3566 -1174 871 -1333 -2835 -5509 -5783 -6660 -3775 -2220 3945 12216 14978
19337 14978 10591 2261 -1666 -8361 -7967 -9448 -12693 -7570 -316 -5819 -3277 -816 3479 2510 -3444
19322 -3444 -10276 -12931 -11454 -10100 -10096 -6307 -9097 -7555 -8397 -16066 -18036 -14336 -16573 -16829 -11251 -8047
19306 -8047 -3794 -2336 330 1399 -2371 419 761 -5503 -7076 -3192 1438 -5179 -3321 4767 1407
19291 1407 2124 1260 -2128 -3877 -4723 -1132 920 -7699 -7963 -1452 -3373 -5439 -6519 -4866 -1362 4016
19275 4016 4271 -5610 -13911 -7834 1482 6302 4032 7311 10688 5778 3657 1290 -5558 -7470 -2953
19260 -2953 -1024 2989 3956 -2204 -3755 -10246 -15672 -11665 878 2780 992 7659 6596 1595 567
19245 567 -780 -4120 -1791 -2201 4451 11898 6858 1346 -6733 -8639 -6971 -2372 849 -2189 -5318
19230 -5318 -1322 3847 8382 6779 4286 -2214 -4020 921 -1832 -1722 -1134 -5322 2544 10419 13204
19215 13204 10353 8818 803 -3991 1709 3656 -2476 6728 4295 -905 -4543 -8795 -12569 -14106
19201 -14106 -8814 8052 14977 4797 -4249 -11979 -12162 -10802 -14350 -8121 -3075 -1014 122 7748
19187 7748 11806 9004 10026 9632 6497 10532 7302 5251 5846 6768 7504 5494 4977 2815 7943 8410
19171 8410 1559 2989 908 -2493 -142 1057 5518 13931 11458 17460 20966 29002 44763 52246
19157 52246 65954 85688 104805 141152 191023 229908 249657 237863 207077 176351 141891 124497
19145 124497 126327 128256 137471 160142 189113 225185 250120 260535 264930 252997 233174 218686
19133 218686 197032 168355 138950 113367 86802 75297 68410 61931 51823 42534 42027 48673 46084
19120 46084 38271 30342 33893 46963 57803 58977 53806 61081 75709 96233 101945 94378 78069
19107 78069 70493 64179 56618 61948 71066 86242 112218 148228 189394 242075 287330 316753 320680
19094 320680 306665 288527 273865 264216 249566 222678 215693 222986 239357 242894 227742 196457
19082 196457 156049 126033 112020 100434 91852 82543 72733 60642 55790 52332 50941 39849 30548
19069 30548 25084 29236 35532 27668 19374 13706 16237 16470 17338 15334 8018 -4220 -3267 -1640 -2188
19054 -2188 976 766 2710 -422 -4663 -3445 -2707 3937 2642 -443 -1783 -4106 -7557 -173 1420
19039 1420 -1908 -1285 -2297 571 2484 5370 -2049 -7401 -2231 2550 6000 10179 5442 440 -3365
19024 -3365 -8819 -8359 -5889 5376 16946 22369 26778 31447 32530 33965 42873 43928 48610 61519
19010 61519 77056 98328 131798 176380 212412 231020 231305 209863 181244 155452 130447 104744
18998 104744 90941 86681 83535 88339 96284 90253 77776 66717 55039 42265 35225 35462 36838
18985 36838 33496 26432 24834 25272 20276 15077 19268 27703 28459 25363 31945 36054 26039 23059 21776
18970 21776 31695 44777 52836 63088 74128 85891 89736 85386 77340 80267 90222 104410 131252
18957 131252 160976 189783 223881 259691 279004 275576 254364 210872 155856 115341 96813 88947
18945 88947 75402 71580 76642 79086 82218 69977 60412 52834 51048 46973 42542 45469 46081 44312
18931 44312 44972 39255 29575 31234 31409 30063 23855 28973 33354 24275 21310 28351 29144 28065 23965
18916 23965 18439 17450 17405 21941 21445 13192 6180 10440 18464 16676 18021 11603 10948 13371 13983 19184
18900 19184 15829 22890 29799 26298 27123 28042 33001 44378 46058 47324 54438 55389 56612 56277 63761
18885 63761 70407 79054 82189 87977 83563 75924 68679 60809 47850 43319 41417 38685 31918 28752
18871 28752 29888 35031 36683 25835 20805 19018 16644 11296 17037 19263 17290 12544 7822 7144
18857 7144 10333 12931 11916 1155 4434 8943 6103 3402 -8106 -11671 -2334 8110 19512 31364
18843 31364 33864 35189 45342 45842 43183 37287 34204 29101 33705 39487 48404 56492 63832 66058
18829 66058 69461 68869 68709 58052 50514 44938 28816 17430 12392 9224 12076 12141 19035 19882 18012
18814 18012 16912 15465 10204 5488 6869 8818 8962 211 -3026 1628 6513 850 -2876 2956 5796
18799 5796 13565 12635 13702 22023 26603 24750 27628 26144 24298 30249 33967 34340 26926 21589 21608 16344
18783 16344 15121 14330 13608 9842 7095 -3144 -9509 -7840 -5724 -8739 -8453 -8150 -2702 5572 13227
18768 13227 22115 27126 25772 8753 -9947 -32452 -52076 -67797 -79992 -92312 -93411 -87988 -72591
18755 -72591 -38106 9 26750 50839 71038 86575 89960 84384 79132 78217 81626 86132 106234
18742 106234 137655 167903 182057 189562 191122 191602 196407 196522 195046 201216 213774 224879 239172
18729 239172 249844 248412 235373 209549 181621 157681 140280 128107 119748 114308 111144 105566
18717 105566 102330 98233 99505 109058 117323 120301 118566 102987 83448 72639 64961 57695 58105 76610
18703 76610 112178 162576 218039 274158 325065 363086 378960 389217 411567 450298 476512 496449
18691 496449 504630 509192 525033 550332 579649 617012 649832 680698 706766 714143 709108 690394
18679 690394 668015 654945 659820 682820 732043 796874 853603 895862 925605 943911 963785 992512
18667 992512 1031929 1078996 1115400 1152465 1190845 1224145 1243710 1281144 1356928 1479243 1601141
18656 1601141 1699945 1779824 1868069 1952218 2018416 2067832 2143046 2294730 2540530 2886253 3380228
18645 3380228 4079188 5049042 6354315 7898641 9366951 10384643 10709575 10581507 10591380
18636 10591380 11387338 13583006 17682694 24288906 33784010 45468389 56653866 64317338
18628 64317338 65989650 62566979 56368077 49205371 41908480 34622047 28268942 24200887
18620 24200887 23141730 24235495 26123676 27328396 26735791 23994710 20137266 16268527
18612 16268527 13359126 11570294 10542310 9932155 9507538 9137759 8783097 8428976 8081024
18603 8081024 7738810 7419041 7151804 6955053 6847769 6847679 6982465 7283109 7804657 8660371
18593 8660371 10032616 12167254 15253451 19217176 23438194 26731473 28027752 26964348
18585 26964348 24786395 23118161 23632369 27234791 34105056 44026464 55843418 68008539
18577 68008539 78619440 85847265 87718920 82593568 70340492 55008901 40318398
18570 40318398 29914629 24132588 21263593 20148860 20086253 20321558 20100274 18890339
18562 18890339 16787695 14453741 12435332 11058702 10145886 9478414 8940495 8475974 8059546
18553 8059546 7660499 7246844 6797867 6314598 5813894 5338794 4897573 4492470 4122414
18544 4122414 3794736 3522809 3285919 3065296 2861864 2669153 2495441 2343391 2202018
18535 2202018 2071196 1952952 1851376 1754341 1671787 1597934 1513284 1428381 1350874 1278725 1212083
18524 1212083 1160180 1109898 1060032 1029853 1011458 1000666 998221 999378 1019346 1058386 1106189 1146820
18512 1146820 1168235 1162543 1145915 1116707 1084396 1057466 1068136 1114258 1166094 1211076 1257297
18501 1257297 1288274 1306588 1305674 1285433 1274716 1284235 1292929 1290650 1267390 1217497 1157559 1120485
18489 1120485 1101122 1081782 1062408 1046316 1044566 1046171 1044877 1013407 954643 894287 847155 805267
18477 805267 761334 717532 686464 669469 668944 680213 680423 661595 616364 563821 510871 492805
18465 492805 501747 549024 622892 719532 802443 840158 813657 742525 655293 575155 525063 503104
18453 503104 514597 556879 631399 709556 763128 784952 781883 750337 693693 630224 568058 515925
18441 515925 490965 490743 505175 535393 551974 551844 550511 537318 509095 477848 454660 457682 473242
18428 473242 481296 496678 506998 510896 510813 528389 570121 640018 744257 873503 1004346 1092090
18416 1092090 1099208 1007161 878872 779807 756566 806782 930123 1102973 1269332 1397578
18406 1397578 1436377 1365952 1205991 1008967 834446 749333 750268 810951 883714 929518 931291
18395 931291 884924 814458 714264 602787 510917 456510 424430 419679 419886 417998 407362 387191
18383 387191 365410 343988 317417 298576 286740 268427 261627 261188 250022 231159 223635 209749
18371 209749 193112 180105 173343 162522 163861 166950 162903 154140 141847 127038 115067 113505 110978
18358 110978 112819 109062 90126 74005 68032 66630 72799 88455 117629 172231 253764 359058
18346 359058 499425 673508 856258 1046213 1235466 1414081 1539646 1580586 1584856 1586414
18336 1586414 1597536 1588170 1525999 1427923 1315809 1202435 1097562 1003274 906434 802316 711760
18325 711760 629966 553570 492091 449502 420819 400848 392152 385165 373798 358517 343397 341789
18313 341789 346832 346078 341155 344805 353636 366932 377472 373790 370543 373119 372346 373529 380200 415202
18299 415202 470559 540468 615374 684416 750436 845953 958007 1052725 1138437 1202778 1225397
18288 1225397 1212043 1188137 1177429 1153696 1120044 1082752 1038925 1007364 977515 952226 928713
18277 928713 889867 843311 798745 762085 731940 702371 681967 668247 660505 661615 658767 664356
18265 664356 677402 691991 711519 732390 759937 784216 800009 832063 881774 940716 1025661
18254 1025661 1146227 1293927 1447236 1583265 1692483 1783484 1860660 1921908 1953969 2002727
18244 2002727 2094671 2247086 2480327 2811577 3271527 3917588 4843761 6152349 7850276
18235 7850276 9764367 11517249 12886779 13915661 14882438 16065078 17739543 20611030
18227 20611030 25868568 34236635 45324707 57209209 67216261 74190503 77806456 78166785
18219 78166785 74070328 64988505 54155475 45331060 38259254 32408813 29036928 28223456
18211 28223456 28620710 28904312 28429759 27102996 25147009 22457758 19060357 15705377
18203 15705377 13225710 11611166 10553853 9846442 9351421 8967752 8645494 8353433 8068130
18194 8068130 7796427 7555544 7336409 7162078 7077292 7133225 7405897 7990741 9003559 10594188
18184 10594188 12881668 15752894 18730847 21140998 22677542 23473989 24022963 24584112
18176 24584112 25464422 27564023 31691543 37351858 43790220 50648094 57294768 61944417
18168 61944417 62576600 58904347 53161630 46847826 39129037 30150575 22826817 18608878
18160 18608878 16558325 15655108 15152531 14591092 13833073 12939673 11948386 10763556 9424314
18151 9424314 8262133 7456581 6904127 6478479 6124243 5818450 5532565 5253336 4969193
18142 4969193 4687790 4410546 4131923 3848275 3580709 3337195 3109075 2895949 2714956
18133 2714956 2572684 2451896 2343393 2237357 2136856 2047082 1967612 1888178 1823976 1792356
18123 1792356 1802385 1851907 1946388 2053765 2133129 2169028 2178253 2225125 2406828 2808581 3515203
18112 3515203 4667960 6466930 8931788 11652677 13277541 12686309 9977473 6496496
18104 6496496 4379174 3296130 2668678 2265114 2005890 1847872 1766891 1734527 1729143 1715047
18094 1715047 1691330 1655176 1584775 1488112 1396502 1323207 1266211 1216830 1167436 1121135 1077807
18083 1077807 1038000 994651 947998 895600 851752 825899 813865 823300 847703 889135 935542
18072 935542 971543 974525 926344 838048 759780 714027 697315 699284 705435 703214 666161 608594
18060 608594 551469 517539 497215 485218 478390 468754 461303 458378 476497 487598 502207 515129
18048 515129 500877 473141 452999 437479 436303 440129 463671 488193 513755 535850 548534 549379
18036 549379 523412 485133 453675 431792 430540 429395 422794 413662 403920 399083 397525 389432 377764
18023 377764 365867 362741 366490 362518 342935 327669 320855 308128 290781 280921 268446 259542 251846
18010 251846 252001 247823 239989 228173 224200 226765 232345 242209 249763 251740 243676 230730 215838 204240
17996 204240 199848 196881 194103 193432 195552 193972 190625 184417 187985 184161 187826 182057 179717 188266
17982 188266 200894 210084 224427 230001 228115 218775 209855 211871 216271 211696 200043 187519 180302
17969 180302 172176 163056 154475 152944 148307 144745 144612 148432 142652 135408 128974 130183 126164 122234
17955 122234 124633 130458 129203 126985 126225 124760 120222 122826 122442 116111 108097 103693 102553 93557 95372
17940 95372 104306 109134 109868 108640 105951 101596 111181 113138 110137 113702 111094 108338 109578 112605 119805
17925 119805 122227 120752 112626 106745 103125 97910 93966 93235 91200 86550 84982 86138 79943 76099
17911 76099 65886 55732 52061 46162 55872 64179 68313 75168 74372 73371 67666 64052 65475 65387 73014
17896 73014 73672 72424 64341 56022 55345 52734 48095 50464 52937 58236 57083 54432 56496 55821 54543
17881 54543 60118 64413 63277 64878 65759 61170 59546 58855 56298 52414 49830 44995 45793 44672 55914
17866 55914 65340 66234 56100 50194 49430 45696 44664 41388 39977 43195 55362 54920 46960 46111 50438
17851 50438 50003 54304 62209 64290 66352 59035 51410 46653 44011 42480 42621 42279 44477 43624 50277
17836 50277 49014 49542 45747 44436 46227 45436 47942 47622 42408 39032 42389 38487 35553 35094 42230
17821 42230 45291 33245 33361 40853 51023 51341 35823 39103 45805 48103 47081 44237 43220 43388
17807 43388 42461 44487 46327 47804 44050 39334 41572 45793 43585 37184 36224 36338 34574 35774 32842
17792 32842 32916 38525 44378 46945 47283 48708 48459 44578 42429 46757 47273 51446 57604 58609 61722 54614
17776 54614 47762 46669 44226 40314 36908 36385 39387 37632 32113 28524 29655 33974 41416 45853 43086
17761 43086 42460 44004 47693 49191 44945 45737 46118 42757 45005 47783 43502 42728 43674 43703 44444 44537 44339
17744 44339 43454 45808 46268 46159 44389 43470 39234 41597 43632 44940 48036 53125 58063 63604 63692 73141
17728 73141 83083 95497 102919 110824 130471 154128 176489 200583 219858 230534 236276 254346
17716 254346 259835 262240 270629 280500 298708 323304 333901 333626 331772 317653 301590 267538 220655
17703 220655 181037 152115 142270 131679 125734 121459 118271 120915 118121 120042 122611 121005 119430
17690 119430 118424 116661 110645 101536 86098 80023 77659 78221 76777 72423 74832 77391 84170 94047
17676 94047 104657 116935 139927 162566 184543 210180 233802 254165 267910 272056 272759 262614
17664 262614 244225 223509 199088 183991 172412 161039 169958 197374 232555 263735 280045 281807
17652 281807 269861 249774 220079 182873 151540 124964 105267 91730 75709 68164 71889 70200
17640 70200 67080 61086 58687 55783 52424 53586 52759 50180 45049 43660 51233 49547 46017 43810 44081
17625 44081 47106 48051 39014 30496 28605 28705 34628 34662 31395 22898 19791 20949 20273 25246 29987 28634
17609 28634 29651 33548 24123 17774 17148 19020 18712 23181 22917 25870 25765 30608 24992 23400 26171
17594 26171 29455 21437 19300 16827 22205 34100 29714 20594 9443 16997 23429 25331 26067 27957
17580 27957 19446 21545 28208 28251 26168 21550 14959 14935 18673 20903 25518 27956 25437 23612 22550
17565 22550 21037 23577 21378 19105 19141 18077 25225 34589 30512 22764 19055 16810 15142 19681 20293
17550 20293 21210 29823 26545 19660 11705 16263 18497 15293 16923 23871 24394 26631 28918 25013 24072
17535 24072 27957 32726 18865 8791 11547 23358 28628 27774 31541 34284 30350 26969 17250 14841
17521 14841 17502 12529 9548 15337 17740 19331 19036 14603 8469 7472 7556 7349 13091 18596 21565 15693
17505 15693 14573 16966 16575 17165 19836 18846 17329 16321 14951 9864 10099 11612 9552 10435 14459 18355
17489 18355 22630 20703 12135 8965 12548 10851 20421 25013 21419 22754 28953 31271 22582 21909 19319
17474 19319 17674 18010 8846 11523 15327 17838 21431 22049 15191 16473 22703 24561 19599 18989 12438
17459 12438 7402 8953 13037 18617 20106 24224 22786 18040 16665 19074 14524 17848 20107 22057
17445 22057 28348 45870 56116 70071 79172 74656 54933 31988 20004 20791 20080 14960 14895 14071
17431 14071 11606 7913 10471 11120 19235 20817 23045 18374 11882 10598 13646 11721 12981 13707 9654
17416 9654 10250 4468 -1641 -250 1067 995 -4948 -6528 -7233 -4605 2347 10280 13406 16344 14568 15804
17400 15804 19383 24114 24905 20934 23333 18605 11422 11864 13062 15434 17632 14074 15144 7724 7939
17385 7939 8528 12672 22704 23392 24398 22985 19315 12079 6063 3878 1914 12133 19915 19769 17207
17370 17207 16224 16189 8045 16134 18985 16678 11769 14279 19777 19319 17582 18516 18034 9621 1669 727
17354 727 5993 8893 6066 2462 336 7523 13265 10735 7922 10676 13638 14552 17999 18611 13794
17339 13794 7387 7236 6570 7295 10269 5642 12568 14591 7057 11325 10775 11179 12484 18582 18710 16976
17323 16976 6931 3119 6480 8602 8474 3938 3242 9788 14444 22902 21561 23530 20979 16060 12318
17308 12318 6145 5137 5306 5920 12691 13946 13448 13003 14495 10139 8019 14295 17292 12481 7491
17293 7491 8270 15492 15204 21148 19004 9090 611 2094 2224 4876 7514 8067 8101 9245 14152 24690
17277 24690 22634 11047 20235 21145 11805 2872 -4456 -3444 528 4108 9290 16078 21839 19069
17263 19069 18473 21803 17563 12903 7998 7097 3271 3824 2422 4401 6447 11353 16231 14405 16568
17248 16568 13685 9630 11141 7278 1719 1517 2937 9025 7193 -3148 41 2716 4628 3971 7345
17233 7345 7402 6254 607 1112 355 5750 12828 14679 12882 16344 16337 9304 2680 1104 7915 12849
17217 12849 6256 14410 18748 13064 10921 12656 11075 10250 13735 16016 10710 16084 14882 13871 11813
17202 11813 4987 5523 7151 5521 2253 -1764 -4430 31 4055 3855 4205 8288 11260 16266 21417
17187 21417 17814 12713 11813 6512 302 -126 -3271 525 9322 12504 11566 10115 9835 5757 434
17172 434 6629 5351 6279 6966 6688 12406 13978 4839 -338 -2479 -1168 4947 10646 7295 1236 2066
17156 2066 2687 212 2588 4394 12470 8184 7612 12710 17359 17553 12057 7665 7960 8635 7358 6574
17140 6574 7815 8715 12722 11208 11851 8248 6373 11373 13796 14672 13686 10162 12612 12272 11358 5934
17124 5934 3065 -1877 -6460 -6166 -6083 4098 6716 2412 2126 4123 -492 802 6692 14579 14342 7621
17108 7621 94 -2972 -1160 3074 8010 6428 5260 2499 7973 13867 13640 7944 4161 6126 11420
17093 11420 13821 17299 21876 15614 10609 6055 5411 6439 6702 9414 11939 11773 8767 6578 6661 7800
17077 7800 9166 14204 14441 16165 13624 16521 17620 14739 10752 9568 4157 4874 7624 8133 11801
17062 11801 16772 12449 13622 17445 15383 11106 9139 8593 13814 17056 19413 14102 6758 5565 1720
17047 1720 364 1845 -890 -1000 -2847 274 3048 5067 11317 13345 18362 18887 19124 13274 11891
17032 11891 9618 9272 14038 11541 11754 9987 3825 -7262 -8904 -3386 8710 10785 8167 1277
17018 1277 -2086 -1546 1495 5957 5158 10505 15364 17011 17091 14740 7434 -6390 -5886 -3853 -3940 -2495
17002 -2495 -3535 -3474 3713 12886 15310 12737 4913 5106 3553 5430 11220 11609 13438 11216 503
16987 503 5959 6895 8788 7742 1122 -266 -1908 2080 9052 7604 3944 1047 561 1299 259 -457
16971 -457 3758 9705 11912 3785 -7241 -14119 -14861 -5016 4525 8163 2142 -4122 2871 7150 10391
16956 10391 11166 9900 11599 10799 3234 5180 9019 9365 6422 7166 11635 11120 4012 6960 16658 22194
16940 22194 21327 22572 24084 14692 10182 11333 12828 8035 2173 944 4111 5375 4932 9591 7812
16925 7812 13724 16436 9814 495 -4863 5487 7251 4517 8167 5112 -344 3840 5267 5730 10405
16910 10405 20672 28076 20526 9459 2151 -597 1702 4210 10353 4667 356 376 -1323 -3165
16896 -3165 -3533 -814 3637 10805 6645 4107 3992 10415 15996 15305 12885 5318 4768 1991 1896 3197
16880 3197 4335 6400 11215 15061 16084 13015 6697 4616 11170 12701 9634 812 -3871 -4236 -7386
16865 -7386 -6256 1583 6334 2226 -3762 3390 7342 5926 4938 3518 4126 12296 10510 8717 7770
16850 7770 4766 -5730 -2668 -2238 2247 6097 9421 15791 13260 14462 14610 7842 3541 5836 2412
16835 2412 6758 9339 4590 2808 14484 15426 12684 10539 8189 2685 773 3467 8565 3438 -1489
16820 -1489 3243 3326 326 1359 6427 5538 2549 650 2731 8116 11087 14607 10407 5884 6683 12087
16804 12087 11364 13184 8266 1248 2852 6666 12252 10746 9134 -1500 -7891 -3375 -1785 -2520 4731
16789 4731 9910 10810 5831 4202 1831 3786 5360 5394 7825 9173 4373 -4429 -1235 -409 773 -933
16773 -933 958 -1589 -1546 3114 10275 8242 1357 -2761 -307 7480 4229 4184 3426 650 -1456 -2679
16757 -2679 -141 3788 2723 2919 9265 12599 11992 7333 -805 1975 6833 6317 5042 9420 14592
16742 14592 11468 7925 7687 5549 5104 10988 7331 11416 9737 8438 4081 -3467 883 9801 18349
16727 18349 22351 16111 3711 636 -289 -5505 2526 10042 11631 13153 15499 13665 6246 3741
16713 3741 5330 4072 -759 -1972 1791 7194 4546 1368 3267 1825 3772 3718 5549 13436 16754
16698 16754 16143 5504 1217 3268 6840 3013 -5656 -2761 2061 -832 -4859 -9 1269 505 -5969
16683 -5969 -5429 -664 5513 979 -3039 -5004 -3940 -6721 -2216 144 7965 10512 9733 14485 13467
16668 13467 13429 10865 11319 9522 8787 8891 7626 -706 -3396 -7 -54 258 4276 7741 10652 5993
16652 5993 6207 2836 -4779 -2098 5022 -186 -2148 -3801 -7800 -10408 -3132 5163 7335 7275 4654
16637 4654 10532 10851 688 -1149 2428 347 8454 3754 1054 7511 9496 8442 9717 9805 9543
16622 9543 3978 7073 7995 2404 -3029 -5116 -4518 -4948 -2044 3502 9208 13161 11077 8388 4225
16607 4225 10395 13363 10614 7910 2890 1662 1127 5443 3782 3424 -953 -4948 -3284 2781 7551
16592 7551 10949 4497 4858 27 -6610 -2487 1162 10348 3551 2037 -4639 -2245 1315 -619 9
16577 9 -1730 -837 -3945 -3571 158 -5927 -5623 1792 2149 1217 1447 4448 2920 2852 5222 3569 1081
16560 1081 8421 10671 4779 1259 -547 5455 10336 5146 3309 -2161 3494 3111 3451 628 535 3754
16544 3754 1471 -3283 -7226 -6535 -2630 -3236 -1654 1721 6429 5569 8045 11793 10473 9768 10118 5597
16528 5597 1308 4439 419 -6029 -3452 -5174 -2822 -4153 -4939 850 3543 4897 5379 -1325 -4978
16513 -4978 -2927 238 399 -2835 -5020 -3715 -2024 -10387 -3390 3799 -2995 -9107 -11035 -10173 -9282
16498 -9282 -8093 -3251 5391 7812 7348 3579 -1124 -6510 -9596 -6423 506 11569 8490 2989 6981
16483 6981 7820 4102 664 3591 223 -3926 -6424 -5836 1088 66 -705 -2702 -8040 -2256 6441
16468 6441 8383 7998 10910 13845 10417 6387 8674 11065 11628 16240 12518 4641 2218 6182 3276
16453 3276 1852 2210 -5551 -5752 2026 5004 1382 -8501 -8154 -8806 -13940 -11196 2108 6577 879
16438 879 4217 4259 -3776 87 -1486 -4796 -959 2329 -904 -7581 -8282 -2512 6506 3621 2104 9600
16422 9600 11475 13020 13948 10329 5885 945 4541 8633 10464 9145 9318 9768 5045 1314 1747 5627
16406 5627 2525 3471 5810 1573 1382 3597 5172 9186 13098 14043 16274 17207 4900 5056 2744 -107
16390 -107 419 -1594 2296 10030 16824 17670 12019 5250 2536 4268 3187 1691 1512 -3405 -8422 -7152
16374 -7152 -4573 -8708 -10400 -9361 -6330 340 1907 7627 12650 9217 6983 5777 1630 2568 -1344
16359 -1344 -9462 -9182 -1783 -1954 -2180 -4579 -9169 -11644 -7025 -1002 4842 1459 3258 494 -1325
16344 -1325 -6760 -5799 2568 5121 15344 11739 4413 6136 8217 2984 -1461 -2953 -5657 -4283 -3332
16329 -3332 -1850 -7878 -3465 2263 -168 -1288 -2108 -2611 -6027 -9451 -5360 -1078 -1310 -149 3536
16314 3536 -4595 -6825 -911 -1801 4352 13250 6213 -1922 -702 4406 7880 9192 9514 2921 720
16299 720 -3409 -1017 -1120 903 484 3864 -1068 -1916 2498 10725 6230 -5526 -5131 -520 5022 9632
16283 9632 1701 -2182 -6016 -2826 -2915 -1797 -399 -3576 -3782 -5842 -6083 -1743 4537 11481 8646 2176
16267 2176 3428 4284 6536 1761 2787 3663 -1811 -4320 -2825 -3353 3036 6682 4782 1987 -5692
16252 -5692 -3507 627 539 -121 2336 254 1702 -1716 -1345 -640 -3770 -3747 6078 6392 7947 3408 3954
16235 3954 1760 -8731 -6736 -1109 -1925 -7146 -2294 3093 -2053 -3906 -3392 990 -326 -5597 -5117
16220 -5117 -6250 -4551 -8263 -11300 -11678 -8035 -2021 16 -5202 -4081 2669 7210 8369 6176 2316
16205 2316 -456 -4770 -7025 -10673 -13129 -2489 457 -475 -1047 -110 6391 4410 3014 4916 4002
16190 4002 6380 6353 7102 4608 4948 8842 8653 7903 4469 -3241 -11822 -11434 -10389 -8976 -1690 7648
16174 7648 13527 10946 12353 11897 9887 3054 -3637 935 216 693 -4222 -4123 -3336 -6314 -2646 2416
16158 2416 6843 2610 700 2432 -714 -3324 -3518 -3782 -2080 1168 2669 3805 8337 10986 13254
16143 13254 9131 8157 6145 1867 -364 -1415 4484 4148 1206 -3670 -3214 -9674 -15441 -10701 -2898
16128 -2898 -4601 -5826 -6203 -4437 5475 11709 14242 12408 7299 725 -1313 5264 3378 1365 2705
16113 2705 3082 -3100 -5095 -8139 -3783 -3273 -2886 -2127 1052 -1978 -2470 -4590 -10 4081 9344 7208
16097 7208 10079 13145 1819 -1138 2416 6330 6741 6360 5003 3609 1617 -903 -420 -181 -3493
16082 -3493 -8213 -4643 4649 3039 -1450 -4258 -5735 -2942 -2473 -434 -1315 -2970 -2887 -7040 -12879 -9539
16066 -9539 -1172 3999 11310 11753 11744 8022 4559 4545 6324 8836 2140 -3054 2313 3580 7197 5676
16050 5676 6001 8012 5208 1348 -352 -4748 -4979 -782 -494 -644 3461 3030 2066 4359 2838 -3014
16034 -3014 -5358 3090 7992 7972 7716 4462 -3119 -7127 -5157 -646 1059 3002 -843 -12307 -15288
16019 -15288 -11750 -5908 4619 6200 6348 7477 5123 5954 -232 -4693 -1138 -1146 -2940 -393 1110
16004 1110 -6449 -4980 -5443 -5212 -8300 -872 8927 4553 4273 5058 8742 9158 11174 8120 4639 -520
15988 -520 -2524 -1044 -3836 -8036 -6528 7607 15217 10207 7695 165 -3576 -3080 -3912 -3707 -4099 -9495
15972 -9495 -12004 -13210 -9965 -6496 -4622 -3628 6936 10032 7997 6195 6073 865 -1776 -3507 6870
15957 6870 6285 -7625 -6606 -66 -414 -4545 -7552 -6946 -8104 -12147 -7688 -4089 -54 -2106 -4292
15942 -4292 -3735 966 -861 -3731 -654 6305 15281 15229 9529 3607 4256 9259 10953 1669 -2064 -1833
15926 -1833 -885 1862 2951 8109 12545 9850 7201 8168 6288 11572 9466 9517 11859 3510 -502 -226
15910 -226 2685 4603 5810 11717 7070 7245 11814 13813 8113 3229 2618 2004 139 -2981 -3452 -5292
15894 -5292 -5713 -1509 -5394 -6898 -3760 -7095 -200 4788 -711 -6552 -1848 1258 3006 315 -1103
15879 -1103 -5181 -1545 4995 7254 3694 -4682 -8521 -4753 -1631 4067 5863 10788 15178 16168 11186
15864 11186 9555 6096 8299 8553 7251 1594 1378 -2288 3517 7424 10375 9580 10067 13381 11410
15849 11410 5052 3841 8017 11208 10384 3045 1875 2892 7915 10059 10984 4606 627 -3332 -4844
15834 -4844 -5502 -3568 -6579 -4827 -1850 -4697 -10761 -14542 -12059 -13469 -9897 -8810 -11019 -12374 -10734
15819 -10734 -9783 -5453 -2289 -10007 -13014 -7907 -2545 5661 11511 12529 8107 1794 6477 12269 13753
15804 13753 8337 1036 -673 -3528 -6626 -12109 -6389 -939 2060 2971 11058 15198 15080 11879 11556
15789 11556 6206 2237 3630 5324 7560 7247 -3491 -6013 6621 8326 6595 2335 -1397 -6726
15775 -6726 -4506 -819 2700 3262 1269 -1887 -4309 -1991 -2495 -8051 -6972 -5425 -9236 -10009 -5003
15760 -5003 4315 2021 -5233 -9068 -4405 -2133 -7626 3528 8522 11295 8534 6284 1096 -731
15746 -731 196 4721 5497 1607 344 5468 2461 3194 7216 2449 -3283 -2315 7804 122 1483 3321
15730 3321 5570 8275 3750 1365 -648 381 6531 6189 -1682 -7710 -3749 -4508 -6779 -5084 1687
15715 1687 842 -4466 -4490 -4535 613 -5786 -8493 -7426 -5934 -5233 -5004 -2601 3308 993 818 307 1946
15698 1946 4240 1958 1755 -4352 -6783 -11263 -5817 -2841 -3387 -4165 -2309 3512 6856 5142 -691
15683 -691 -5157 -387 6163 11684 5858 8033 1232 126 753 2376 -1346 -6147 -11285 -13205 -6632
15668 -6632 5097 6765 6780 8592 6396 243 -4851 -4371 -71 -2016 -3880 2884 2570 -4690 -9265
15653 -9265 -7585 -5294 -3531 -5457 -4523 -5953 -3860 -183 2388 1305 3480 2937 -1390 -4690 -6675
15638 -6675 -680 -1603 942 148 1266 -1151 -3534 -1584 1142 1164 4169 2908 -4379 -8243 -8241 -6752
15622 -6752 1489 6664 12490 13544 15737 14523 13779 8501 6018 6329 8569 9900 7789 6597 3975
15607 3975 1038 3950 4563 4826 2931 44 -963 3956 2372 -883 -2181 -5772 -11241 -3608 4201
15592 4201 3801 -6807 -6911 2604 896 -2116 -2979 -11354 -10780 -2205 -1014 -4048 -9920 -13137 -12248 -7605
15576 -7605 -2463 -5578 -4823 -6647 -1766 1459 -485 -4250 -2026 -5582 -7353 -1833 -483 -6516 -9349
15561 -9349 -9882 -9098 -8542 -12475 -13637 -9192 -9211 -2649 3717 5266 3516 -428 -1611 7290 1932 -5371
15545 -5371 -7838 -2948 -1118 -1490 1094 -6210 -1690 2983 3585 5007 9725 8558 6996 5201 2694
15530 2694 2039 4599 3432 -113 1100 4919 3370 740 -90 772 7085 7108 4638 5575 7125 5606
15514 5606 1483 409 2200 101 -1910 -6808 -14052 -11887 -11888 -11397 -10729 -10376 -6333 -2981 -1803 489
15498 489 4290 3395 -1246 2609 2856 3534 9775 7095 3671 10490 5242 2139 9105 10728 5545 -882
15482 -882 -6861 -3234 485 -2538 -947 5847 12153 9568 2358 474 -3214 -7173 -8656 -10698 -13536
15467 -13536 -6658 2305 6110 4492 -520 -2643 -2488 -5500 -3056 2105 -846 -2871 -2084 6285 9264
15452 9264 9499 11129 6851 5055 -1077 -5464 -3859 -6958 -10771 -13928 -6281 -4082 -1906 6046 12093
15437 12093 7658 149 -2613 -3466 1115 5195 7499 8533 4829 4849 10851 12212 14547 9583 6379
15422 6379 -3433 925 341 183 1386 -3910 -2807 4045 1083 -1685 -4476 -3609 7261 12152 12418
15407 12418 7750 7434 2869 1931 -2671 5102 8253 6434 6735 10079 12716 11738 5380 6519 5927 12660
15391 12660 10639 9585 10015 13846 14283 8006 5773 -293 6931 12007 8809 7820 11408 9346 3796
15376 3796 -799 -9500 -13439 -19398 -23469 -19407 -13587 -11694 -8980 -5809 -7027 -3267 -5430 -2334 -1602
15361 -1602 6091 9390 6575 4145 1229 -4551 -12849 -16257 -17075 -11963 -5752 -8546 -13190 -9940 -3696
15346 -3696 1043 -2644 -3572 -847 -7004 -8442 -7081 -4378 -2252 -1041 3161 502 -2899 5330 6649
15331 6649 6005 -271 -6083 -5746 -1380 -1501 -939 11864 17241 17412 15146 10836 6657 6274 5548 851
15315 851 -1804 -1573 217 637 5559 9992 8664 8861 5487 4591 8357 10937 13692 19269 18882 10070
15299 10070 2170 -4637 -8827 5745 14695 11637 11641 8436 9846 14983 8486 9874 9098 13923 20379
15284 20379 20635 32624 42647 40466 43756 51752 74212 90018 100823 102292 100451 103364 110025
15271 110025 123866 133044 126935 116691 103986 94286 89430 90824 89700 84069 73479 67861 62368
15258 62368 49738 43402 34116 25351 24950 27079 19051 13585 15344 14728 11273 9805 16100 12744 6575
15243 6575 4395 6440 10945 10365 6991 2254 -1273 698 3398 453 7083 12156 8144 2624 -3565
15228 -3565 -1995 -2052 2403 3006 -947 241 635 2 1669 2316 2658 2158 1400 6887 6781 5153 -4585
15211 -4585 -5293 1441 9630 7328 1603 5258 8322 8747 10626 12346 12889 5735 3302 -1898 2082
15196 2082 2167 2784 3077 -2156 -4216 1608 3114 737 1006 2187 6804 10721 11510 3846 535 -1462
15180 -1462 2650 10305 9001 3892 6605 7600 7147 13378 10250 15129 16139 11906 -601 -3377 -6165
15165 -6165 -4889 -4757 -4281 -1340 -11778 -13498 -9237 -2839 3570 6105 2009 -5517 -4437 -4690 -2010
15150 -2010 5229 8581 5077 2645 6268 9777 11053 9232 8161 8937 2886 1294 4533 4519 9167
15135 9167 4064 9292 12876 13031 14226 10234 2619 1997 2883 117 -4341 -1045 5419 5797 4063 8963
15119 8963 6052 -759 1331 1456 -872 -8610 -13814 -17957 -11039 -2812 -2650 -2578 -1032 -379 7023 10048
15103 10048 6424 6636 5079 -1386 900 2881 -1787 483 484 -1497 2397 5086 -558 -413 3650 472
15087 472 -10399 -15314 -16162 -8599 -8029 -2395 9365 10300 9898 12696 8809 6841 5407 4136 1688
15072 1688 348 -3485 -7272 -9062 -5740 1465 2600 6246 367 565 6507 -839 -5043 -5391 -3189
15057 -3189 -830 3321 6205 1910 -2220 -1800 -2029 6505 7113 6426 6952 4268 752 7757 7798 11570
15041 11570 12335 3711 774 2255 542 3402 4882 -1543 -3515 -4055 3148 8135 10711 8709 5129
15026 5129 3465 1758 -1004 -2649 2854 4772 -1381 -2624 -2955 2224 2538 5157 9867 5286 167
15011 167 -3857 -422 2271 4884 -608 -445 628 -2413 -1539 4343 4788 6410 4396 2364 828 2074
14995 2074 2902 3319 2654 4226 -2345 -4442 1232 2572 -714 79 -5020 -8207 -9637 -7495 -4217 -6582
14979 -6582 866 7471 4905 1638 -4117 -4255 2132 4348 3357 4589 1905 935 4209 4898 6670 2891
14963 2891 2444 -4287 -12995 -8870 2022 3305 6972 4421 -3111 -471 6494 6761 9413 6727 3255
14948 3255 -563 369 4561 2637 2047 -2558 -1588 -575 5772 11224 9299 -1993 -5215 -1786 1868
14933 1868 5542 10140 12918 20073 23660 26884 31298 34595 29139 15932 13418 21417 37050 52205
14919 52205 60358 61749 58878 59113 57162 64609 81048 88861 98808 105142 105496 98312 90538 76946
14905 76946 73745 73378 69491 73912 82323 82369 68060 52847 49260 47186 35736 27445 25259 22574
14891 22574 23230 23233 22873 27659 21159 12986 10009 3420 -2559 -1908 -4792 -4383 4125 10371 3268 1647
14875 1647 922 -1670 -2389 -3088 -6054 -7585 -1761 2411 6 -7636 -13157 -4553 1001 -4044 -4556 -2672
14859 -2672 -6825 -6906 -4912 5214 6091 4563 9799 9878 6666 588 -4438 -4393 1131 2268 -850 5598
14843 5598 6739 4518 405 -6031 -4445 -5621 -1482 1286 4062 7738 8423 5149 2961 4260 8643
14828 8643 6629 11692 17485 13315 10669 8661 8598 8480 2359 3662 2248 1019 6072 10732 3605
14813 3605 3835 11047 12935 14113 18951 25323 23404 30985 41212 47468 52611 69684 93841 113622
14799 113622 152306 203933 261495 325927 365435 376083 359250 323136 275022 224960 178069
14788 178069 137418 105537 81286 69626 58525 48450 49118 48103 42108 34403 34744 32160 34217
14775 34217 35372 28856 23951 27060 28985 19952 20845 20492 14824 15884 10224 6060 3860 1119 10053
14760 10053 20643 21340 15270 13476 13217 9830 4848 -747 -299 -571 -449 -2296 1972 8471 13669
14745 13669 13406 8279 7841 5223 2319 -4629 -7121 -3437 8235 10706 10976 8410 7529 2963 5181
14730 5181 -34 3496 4322 -1320 -4178 -5704 -4637 -931 6721 6839 4583 2982 -533 2541 3720
14715 3720 483 -2284 3437 4260 -530 5079 5634 3070 3102 6214 1833 -2156 -4351 -5398 -7159 55
14699 55 5006 2567 -1252 1899 2764 11099 11633 9231 6782 5162 -2410 -9872 -11235 -13501 -14296 -8369
14683 -8369 -8328 -4752 -2349 -654 -6417 -4631 3130 9107 11164 10115 9505 11695 10506 13047 18566
14668 18566 20816 14040 19343 26042 23210 26238 28019 22958 14402 9480 12093 15212 15684 14597 14478
14653 14478 13806 19841 19883 21043 29538 29242 25967 37013 44241 51008 58404 73717 109278 148089
14639 148089 187440 230483 272118 293977 306355 304581 279844 241330 202940 167228 128262 89907
14627 89907 66096 46330 40550 43115 35855 24954 26497 33038 34590 34792 33067 35376 27842 16895
14613 16895 17277 18347 9881 4276 6903 8533 5049 -1180 -1439 -5530 -1665 -1753 -5072 -5431 -2375 8972
14597 8972 6092 -106 107 -4477 -9931 -7051 -6491 847 4565 107 -2222 3803 4119 5606 1354
14582 1354 -6288 -12751 -13707 -12308 -8640 1647 7360 3207 -1412 2682 6304 137 -459 -3324 -2284
14567 -2284 4164 4581 2174 -5497 -10808 -6387 -3357 5695 11505 12554 5638 4426 984 -11287 -9229
14552 -9229 -701 -3085 -8594 -10488 -5669 -10926 -5046 3507 3670 2850 -1861 -2415 -3761 -6754 2220
14537 2220 9934 8788 7526 10452 7174 1431 -4236 -4178 -3588 4848 7089 -965 -726 1113 -581 -4674
14521 -4674 -4119 -5234 -5892 -7522 -8506 -14283 -13487 -4966 4749 4329 -3744 -1322 -8431 -18531 -9180 153
14505 153 -5480 -6802 5198 3452 -3844 -2167 -1481 -2976 -1300 5372 8654 7138 9235 5208 5306
14490 5306 -1488 -2774 -4373 -3891 -2877 -3946 -2565 974 1538 -4658 -7891 -2759 6008 6349 295
14475 295 -3902 -1332 3162 5550 2685 4354 8188 592 -1561 -3110 -3529 -3384 -7175 -13477 -6712
14460 -6712 -4183 -1094 -2550 -7742 -7970 -5148 -5996 -3083 -9022 -17079 -10541 -1111 2377 5554 -1010
14445 -1010 -1747 -3461 -10618 -22696 -20341 -11072 -3874 -4332 -3870 -3762 -5275 -4898 -3223 1051 -4041 -5458
14429 -5458 2229 3105 1638 4569 3092 345 -2887 4259 6476 5174 5552 5775 2013 -4422 -3613 -5112
14413 -5112 -468 5333 4074 4468 -2901 -6053 -6054 866 -366 -1361 -11298 -16544 -12452 -10788 -9224 -8387
14397 -8387 -11858 -13613 -9880 -6669 -5802 385 1214 124 -1656 -4767 -1960 -2256 2306 7741 6969 5455
14381 5455 3718 -5128 -6617 -8208 -6558 -7280 -2246 6895 5162 -400 -10853 -13834 -19608 -17997 -11218
14366 -11218 -9323 -4536 -2114 -367 -4635 -7833 -9032 -13155 -15732 -7950 -2966 -2259 2333 -840 -3369
14351 -3369 -2879 1241 8657 12219 1302 -39 963 -7354 -9132 1765 9138 4102 -2055 -574
14337 -574 -1156 1574 5152 9524 13289 7562 1143 548 -2498 -2417 -3156 -9542 -13227 -11964 -12732 -12356 -8262
14320 -8262 -305 1355 1351 -4793 -8533 -4252 -4499 -7704 -3236 1163 3746 3985 -1704 -1138 303 2362
14304 2362 1988 2447 2181 -1451 3281 6442 8436 11207 15302 8315 6784 3946 3098 7874 10362 2711
14288 2711 -6616 -972 962 -3170 -10248 -12482 -9996 -6383 -8297 -11391 -10074 -1376 -9084 -19379
14274 -19379 -17169 -9972 -4280 -9511 -6972 -6439 -567 7393 7084 2321 5114 4262 3471 1399 -4973
14259 -4973 -8130 -13168 -8115 -932 4463 5114 3621 740 1438 2285 1360 -1916 -6452 -4999 -2217 -5732
14243 -5732 -8857 -7106 -1399 7199 7916 5027 3390 -2268 -4086 -1995 -5339 -11054 -9532 -4140 3017
14228 3017 2741 -4451 -3621 -3240 -2194 -2042 -4244 -2720 -5350 -5728 -8572 -11696 -6321 -5748 -7080 -12978
14212 -12978 -14866 -12810 -10625 -6428 -11466 -16593 -15521 -3900 940 4430 4368 742 -2997 -3789 -8410
14197 -8410 -9864 -4854 -2451 -6457 -11710 -14420 -14572 -14143 -14391 -12254 -9673 -12152 -13040 -7506 -1696 2300
14181 2300 -625 -6248 -7518 -9850 -10384 -5489 2835 2646 1204 -1122 -2173 -3970 -1902 -4723 -930
14166 -930 -1644 -6644 -15487 -10042 -7314 -7117 -11558 -16633 -7452 -2449 -2519 94 531 -7931 -6555 -327
14150 -327 115 -733 -2224 -4534 -2180 2945 2357 1227 467 1031 -3042 -1688 2241 766 -4538 477
14134 477 1277 7917 7493 4222 3379 672 6358 1964 -557 784 2083 10833 8062 2731 336 2458
14118 2458 4538 7135 4667 -810 -218 -2170 -3049 -6695 -9995 -9280 -8179 -8643 -9973 -2429 571 -3113
14102 -3113 -6711 -11193 -15718 -9430 -4039 -5696 -3468 5080 3957 -1997 -4385 -5043 -3417 -191 5378
14087 5378 9913 1037 -1818 5239 4436 -196 -4093 -3306 -5870 -4857 -5548 -7297 -8389 -8119 -6803 -7250
14071 -7250 -8951 -7067 -7379 -7986 -12953 -17297 -13114 -6672 -5936 -7438 -8651 -8937 -8296 -4912 -6034 -7646
14055 -7646 -13767 -16463 -16962 -15107 -11257 -6605 -10247 -9219 -7853 -17753 -16405 -7551 -4289 -535 225
14040 225 -2255 1135 -5948 -9876 -2578 -399 1545 -1506 -5334 -6894 -5068 -13720 -20761 -23286 -14240
14025 -14240 -6136 -4627 -6594 -10613 -9759 -3252 -1676 -3041 -5256 -6203 -4759 -4476 -8448 -9607 -12225
14010 -12225 -7491 -4634 -7828 -6179 -1596 -6516 -9853 -8824 -1366 -7490 -8756 -5177 -8591 -11010
13996 -11010 -6243 -1456 -6672 -4489 -3494 3853 1910 -7260 -3468 -4176 -11791 -14859 -4976 4184 4508
13981 4508 3169 -3330 -8749 -2301 2129 -2370 -2614 -5468 -2177 -13 4521 3852 -548 -6355 -13357
13966 -13357 -8740 -4955 -9211 -1916 5100 3841 -3628 -5671 -8385 -14611 -19086 -18914 -14148 -9944 -2482
13951 -2482 -1372 909 3019 -1403 -1247 2181 188 324 -2334 -6777 -3741 353 2485 -6187 -11164
13936 -11164 -11037 -7281 -6314 -1815 -2801 -1391 1200 7734 3683 -1547 -7990 -6693 -4703 -3171 -4749
13921 -4749 -6296 -1528 -818 -3953 -3595 -3543 -4996 -4133 -8028 -8649 -4840 -2436 -5532 -11564 -7914 -7678
13905 -7678 -4294 -2079 -2806 -3458 -350 1114 -5918 -11424 -6611 -4626 -6401 -5572 -6833 -8203 -8511 -1117
13889 -1117 2118 -3217 -5148 -5785 -3253 -1006 -3323 471 305 -8231 -10951 -12993 -9423 -4212 -1129
13874 -1129 -417 -1830 -1957 2398 2226 -3980 -8105 -5408 -5234 -1337 2864 3411 2416 -3378 -7317 -6181
13858 -6181 -3955 -7946 -5897 5262 4667 -1727 -9608 -10134 -1784 1971 5057 -796 -3680 -5197 -10127
13843 -10127 -7714 -6288 -3321 3526 922 -189 2927 5876 2312 -1050 -9408 -9579 -10004 -12934 -6565
13828 -6565 -2467 -2945 -1918 -6158 -6440 -5609 -6009 -4299 -1300 -4970 -10709 -7023 1441 1194 491 306
13812 306 7993 14704 19430 19774 20356 18363 24599 22332 12305 8862 3941 3005 3075 10016 8854 5246
13796 5246 55 -167 -5301 -4145 2262 5675 4705 5288 4020 -659 1095 -915 -4979 -14165 -18839
13781 -18839 -17161 -16768 -11242 -10570 -10101 -10695 -5350 -7814 -13151 -16825 -16530 -11482 -13215 -11837 -5096 597
13765 597 60 -6279 -7424 -5325 -5124 -4005 -1214 -7308 -9686 -10478 -6231 -4335 -3984 -4001 -2294 3216
13749 3216 663 2030 8732 9204 6272 5137 3373 -738 1097 412 -3441 -9103 -9206 -14506 -12747
13734 -12747 -8121 -3790 -1536 4637 5405 2632 -8727 -14923 -6789 -4310 -7399 -11521 -13336 -18006
13720 -18006 -20379 -15197 -14178 -11658 -12322 -13411 -10787 -8329 -5988 -5320 -3117 -1225 -1889 -8621 -7932
13705 -7932 -6372 -10873 -9426 -7949 -10109 -8699 -6694 -8655 -8061 -4460 1502 2192 -45 2148 2938
13690 2938 5516 9793 13228 21198 31668 37342 42959 45625 40453 42783 45067 52738 46903 34530
13676 34530 24622 15432 9805 7366 3894 -448 -3531 -7554 -5619 40 3956 3343 2480 4729 1762
13661 1762 5943 12372 9683 6657 -5766 -10224 -7488 3640 5825 -9 -1143 3268 4190 -884
13647 -884 -472 3432 193 -1588 -4853 -6668 -11671 -11535 -6169 -1185 6562 12685 5548 -2552 -5214
13632 -5214 -5082 -3999 -2380 -4641 -1431 -1091 -2519 -1113 -6888 -2263 846 2822 208 -1999 -9153
13617 -9153 -7957 -5185 -5308 -6225 -4527 -5399 -11261 -17477 -7917 -2099 -4003 -1245 -1533 -3713 -3430 -3771
13601 -3771 1153 -7870 -10950 -10698 -5039 -4494 -8472 -8728 -11135 -9038 -15908 -14815 -14443 -15766 -9223 -4501
13585 -4501 -7600 -8357 -5878 -7786 -12057 -14563 -21936 -11506 -5882 -6256 -4901 -6531 -4630 -13027 -15586
13570 -15586 -13768 -7538 -4499 -4406 -1007 1851 -2708 -4781 -6024 -9676 -12389 -7797 791 7359 4577
13555 4577 -1103 -4915 -7495 -3007 300 -4108 -7183 -6121 -9128 -8124 -6822 -4044 -3122 -3926 -6333
13540 -6333 -5617 -4678 -6194 -7413 -5058 -200 -3796 -9604 -9417 -8284 -2685 -3303 831 3534 -4758 -7878
13524 -7878 -3459 -3423 -4227 -6527 -14313 -18574 -12922 -12985 -7997 -2338 -670 -2968 3608 4550 927 -1600
13508 -1600 5735 3577 1245 -3848 -6580 -9340 -3809 -6133 -13398 -19230 -16165 -5494 -4910 -4343 -203
13493 -203 135 -3546 -6054 -6865 -5342 -7484 -7271 -5241 -6740 -10223 -11280 -8355 -6853 -8979 -11455 -10739
13477 -10739 -9671 -11293 -3920 -6221 -8056 -5439 364 475 -3525 -3648 -1996 -273 -4004 -4157 -3432
13462 -3432 -7298 1134 3499 3869 -2008 -15702 -18643 -11698 -7825 3263 7684 2600 -4830 -3590
13448 -3590 -1308 -6385 -4816 -3326 1999 -1378 -5764 -4745 -9617 -16208 -12589 -10038 -7344 -8071 -6362
13433 -6362 -1540 -2231 -3794 -4634 -5674 -10202 -9143 -4301 -9194 -13505 -15812 -17971 -18977 -9019 -2744
13418 -2744 -6141 -6736 -6184 -8298 -14011 -13376 -14241 -17073 -17021 -15742 -11229 -5905 -7816 -5667 -9685 -14704
13402 -14704 -11312 -7515 -806 -303 -3020 -7434 -3958 -2823 -3201 1700 -2101 -7407 -9464 -6148 -6845
13387 -6845 -9984 -14717 -11775 -15247 -17063 -8263 -2712 -7598 -6741 -8326 -13392 -11981 -9069 -15089 -14572
13372 -14572 -6790 -5179 -4344 -3534 -2987 -124 27 1728 -2026 -9914 -10323 -6929 -5798 -4623 -4155 -4923
13356 -4923 -3338 -1054 -1056 2464 -131 -6519 -5978 -9244 -9743 -7237 -4182 -4942 -2760 -4229 -10018 -10756
13340 -10756 -6239 2510 -1936 -6584 -9919 -12714 -16667 -16364 -15888 -6093 4077 -2185 -6496 -8052 109
13325 109 5199 9981 5332 4440 6109 9905 7261 3731 -3376 -1593 1331 -1240 -189 8561 12148
13310 12148 10106 2028 -5671 -9804 -4254 1643 3027 165 756 4433 2893 -828 -5333 -6074 -8601
13295 -8601 -11838 -8708 -9953 -12343 -3475 634 2112 1749 -7554 -6213 -2700 -7982 -9086 -2585 1867
13280 1867 3867 4128 4067 6875 164 -6093 -5710 -12034 -19049 -11874 -9688 -8702 286 -3637 -8483 -6294
13264 -6294 -6610 -7077 -8944 -8958 -12684 -16189 -12179 -10372 -5559 -2853 -6951 -11189 -8717 -9015 -7591 -7517
13248 -7517 -6892 -845 -1260 -8414 -9050 -4783 -5121 -10702 -13062 -16971 -16642 -6126 -1807 623 -1365 -11047
13232 -11047 -12573 -7749 -4826 -3157 688 1732 750 1723 -1748 -1332 -3656 -11450 -13120 -9789 -2749
13217 -2749 -3202 -14821 -10382 -8656 -17147 -18604 -15572 -15949 -20598 -11100 -8278 -13551 -20858 -20075 -14827
13202 -14827 -13950 -10365 -8298 -13961 -11930 -9102 -6487 -1006 4957 11727 11870 3761 569 7645 4256
13187 4256 -5602 -16024 -10013 -6024 -3781 -2283 -1597 -1604 5823 3716 -5428 -8079 -4848 -3997 -7484 -3897
13171 -3897 -9525 -19782 -18330 -6413 -2667 -2552 -2555 3023 4274 4484 8923 8619 3915 -3799 -2791 2439
13155 2439 3319 -490 452 3349 5786 10768 27787 36103 29114 15815 5192 4465 2012 -4190 287
13140 287 3836 -5615 -10053 -6794 -8911 -10010 -3728 -3561 -3548 1048 7354 8897 7434 3914 3681 3148
13124 3148 1283 7309 6184 -1807 0 -3239 -8845 -14328 -8746 2767 1456 3366 2633 8320 14459
13109 14459 9811 4664 11048 27017 38547 42612 37226 25568 17161 14360 11025 11081 12880 7839
13095 7839 2073 680 8207 9166 6924 9831 7287 -962 -7322 -5649 -7433 -4006 2933 3910 -69
13080 -69 -6350 -2514 3936 -1021 -4343 -9892 -12312 -11904 -11471 -2412 -4 108 -2644 -2857 -4575 4797
13064 4797 6723 3873 3617 4891 4017 5294 6031 -2793 -9624 -3446 -7479 -6441 -2873 -4182 -6520
13049 -6520 -4301 2036 5760 747 -5401 2375 12010 5343 -965 -2635 -10049 -12596 -11405 -10530 -12545
13034 -12545 -12398 -9268 -4894 -2473 -5443 -6681 -8607 -9726 -4068 4050 7234 910 -1156 -4682 -12144
13019 -12144 -11290 -1063 -4055 -13616 -18715 -14613 -13001 -13801 -5205 -1565 -3985 -1295 -1047 3174 5959
13004 5959 -1045 -11431 -17047 -16162 -9620 -12434 -13707 -8095 -10527 -14024 -11911 -9722 -14344 -23328 -26306
12989 -26306 -16838 -15796 -10333 -1087 -7337 -11817 -13587 -13037 -9330 -631 -2031 -4549 -12116 -12690 -10356
12974 -10356 -6290 -6048 -3291 1407 3160 2029 -4057 -6521 -6974 -5491 -4262 -5080 -2290 -3910 -3596
12959 -3596 -8867 -10599 -7926 -7260 -5455 -1693 3051 1260 -1718 -3119 -2698 -3041 -3148 34 1218 -4337
12943 -4337 -8066 -3778 1824 -4258 -13143 -17434 -11809 -4208 -347 -1586 -6519 -11290 -15346 -13440 -4470
12928 -4470 -992 -3488 -436 107 -4476 -5996 -1015 -870 -3906 -1932 1619 998 3932 6991 3120
12913 3120 -790 -1943 -4966 -4616 -11319 -12861 -13489 -11636 -8780 -14253 -18146 -18121 -15205 -9107 -6180 -6518
12897 -6518 -3501 -2609 -3626 -6666 -8833 -6818 -7685 -9350 -1381 5024 3440 1498 -4379 -3459 -3115 -1936
12881 -1936 -3003 -7027 -5287 -4231 -3437 -5438 -4263 -7300 -1924 -973 -1867 -5687 -12724 -10298 -5241
12866 -5241 -505 7385 5851 -637 -2197 1614 5293 2125 -4100 -257 -458 -1528 -9291 -11717 -8103
12851 -8103 -8527 -14054 -14173 -11307 -8878 -8611 -6290 -4281 -8741 -5364 -9556 -7390 -9282 -3154 -7303
12836 -7303 -3700 1233 1592 -3963 -4891 -5502 -5150 -6687 -1085 -181 -3482 -3103 -902 3750 1837 -837
12820 -837 -3789 -7338 -10464 -11494 1367 2306 -229 2696 6075 -3492 -12217 -15450 -16799 -10935 -12050
12805 -12050 -18084 -19026 -17231 -12611 -15921 -16686 -9016 -6918 -11185 -10633 -12418 -10483 -8581 3698 3713
12790 3713 -3388 -10379 -6443 -9525 -8627 -13553 -16409 -17063 -7354 1113 -5323 -3681 8920 11846 13889
12775 13889 16670 14009 12857 8971 9886 14423 13308 8916 2835 -3526 -3205 -5869 -1332 -4823 -14668
12760 -14668 -20550 -14181 -8292 326 1435 -2170 -2835 -4029 -1906 333 -155 -3818 -6531 -4359 545
12745 545 -2009 -8111 -10351 -4481 2023 9898 13016 9885 708 -2283 -174 2176 -2367 -9517 -15354
12730 -15354 -15982 -13293 -6044 1381 3250 -1232 1867 690 -103 238 -3742 -6132 -2852 1981 1222
12715 1222 -1949 3200 661 2208 6807 3999 -1909 -5359 -2963 3069 -368 -3292 666 860 4751
12700 4751 7888 4876 -9636 -15100 -12430 -10341 -9920 -7410 -4487 -728 -741 -6796 -7461 -11096 -19277
12685 -19277 -15818 -10567 -14993 -10271 -13832 -17707 -18600 -19031 -15378 -15043 -13322 -13931 -9636 -1895 -4291
12670 -4291 -10409 -10689 -5167 -2458 -6756 -8368 -5113 -4679 -5142 -5560 -371 6520 8659 9997 9467 -1074
12654 -1074 -9523 -6965 -4951 -7916 -8634 -10674 -2040 -517 2976 2579 -5971 -4528 -1544 -3141 -3552
12639 -3552 7058 11574 4871 -3642 -6056 993 2897 -1169 -3631 1611 13 2425 4456 1168
12625 1168 -1406 -6097 -4172 -3125 -9850 -12014 -11106 -17669 -16647 -10930 -4681 -6063 -11691 -6673 2944
12610 2944 6380 -866 -7977 -15686 -22721 -18364 -10191 -10724 -10126 -3720 2419 3570 2182 3108 5644
12595 5644 7913 7295 190 -836 -5578 -8117 -4350 -694 2175 -667 -212 1531 -2569 -2485 4462 7958
12579 7958 -566 -9318 -7860 -5762 -6249 -3544 294 3264 6762 14761 25660 23716 19320 29113 37729
12564 37729 48829 57629 65084 67115 64259 53713 42073 33464 30996 32814 32306 28145 21026 27240
12550 27240 25922 18226 6905 -1390 4758 4288 8156 10819 15714 15500 13073 7560 7496 12201 21511
12535 21511 21065 17082 16413 16639 15944 20959 26422 32041 43161 50896 55280 61151 81149 101141 120390
12520 120390 147990 174900 195786 212119 208258 193092 173982 146151 120508 93096 78217 65566
12508 65566 61229 53977 51581 48292 42975 41966 41545 39012 34925 30098 30698 29247 21491 12383 13553
12493 13553 18586 21523 25848 27049 28567 36002 35836 37062 43171 50421 52141 55022 54973 60052 68035
12478 68035 80812 102669 128039 149822 182874 205421 208758 201382 184875 162132 141238 120780
12466 120780 96591 77474 69128 62059 57165 50918 36790 35876 33958 33202 35499 25457 15823 25135
12452 25135 25313 22008 23664 21248 21503 23586 23659 14418 8589 4796 4481 10001 12567 20043 23035 26391
12436 26391 30329 33956 33290 35983 48803 58749 66520 70699 72243 69256 64603 57665 57222 47928 38968
12421 38968 36554 31091 24535 15094 11205 4713 733 2650 -303 -1473 -258 5336 4155 4541 2162
12406 2162 -474 8576 7977 2783 227 4002 -708 -6442 -3744 -2808 -5551 -9011 -9667 -5153 -4361 2494
12390 2494 5146 2635 -4306 -10341 -5522 2523 -3014 -3414 -9858 -18597 -23351 -17313 -19851 -23956 -16520
12375 -16520 506 2099 -4535 -6820 -12165 -10389 -11298 -6123 1127 -2502 -5290 3347 8913 2738
12361 2738 891 -2979 785 1893 -296 5443 2687 -6017 -13840 -12904 -15906 -19216 -11787 -1172 2603
12346 2603 -590 1975 555 -3264 -6798 -1239 -2934 -7815 -5512 -2350 -3895 -6374 -3546 1420 286
12331 286 -5368 -5097 -5144 -11639 -12129 -8401 -7420 -9981 -7917 -926 1222 -2247 1404 6075 1376 -5919
12315 -5919 -4767 -7968 -11 -526 -2195 6003 5418 -2872 -10403 -10367 -6324 -5464 -9169 -3755 1495 1142
12299 1142 1965 4074 2494 -5946 -5593 353 4144 2262 2550 2784 4039 1630 -4884 -6184 -10105 -7543
12283 -7543 -5390 -5157 2603 1659 -4697 -9106 -16311 -12749 -13246 -7558 2762 4989 559 -2153 -812
12268 -812 5800 6956 3866 -1777 1601 8028 18772 15333 16913 18839 12498 9051 3528 7674 8058
12253 8058 1909 3274 4333 2941 8938 9267 406 -7081 -10024 -8498 -4178 -8573 -11908 -15290 -12314
12238 -12314 -9768 -8018 -4666 -5367 1055 3333 11170 16152 16265 17106 22025 29904 31775 29192 30580
12223 30580 31381 34612 34004 28491 17318 8351 -3547 -3722 -6321 -13588 -16911 -19114 -16329 -18654 -16502
12208 -16502 -8241 -7432 -7532 338 1249 -5674 -14426 -11983 -8684 -7470 -3774 -3290 1591 -3659 -3177 -2945
12192 -2945 -6323 -4154 -3106 -764 -17 4039 -2113 333 10703 12509 7519 5439 8933 15945 25243
12177 25243 25554 22520 25071 22815 16349 11509 10843 1482 1854 121 2070 6003 -1494 -7256 1782
12162 1782 3849 -2325 -7087 -11082 -13548 -11951 -6039 -1185 138 -4499 -5162 -3910 -2521 -7347 -13046
12147 -13046 -15625 -12413 -12741 -9595 -9641 -16381 -18290 -13693 -4580 -3672 -141 2387 8427 11185 11051 15555
12131 15555 15049 12849 11674 8032 -3225 4858 5479 406 2615 14723 22812 23885 12436 -520
12117 -520 -6081 -7475 -6121 -1040 -2215 -9760 -5390 -608 904 -233 -3203 -3658 -3485 537 4224
12102 4224 818 -5896 -5492 -3883 2297 6461 16405 18055 11541 8022 15066 25259 25307 20398 21289
12087 21289 11326 5193 6758 1332 -446 1511 3925 9489 15784 14768 15275 17530 16703 14984 13164
12072 13164 16079 13422 10917 8452 3983 -2353 -6426 1095 7363 11486 9004 4981 943 4784
12058 4784 9832 19895 29866 35889 45462 55667 79189 100336 115245 129145 134732 140229 137881
12045 137881 126667 103469 86264 68270 52802 44368 35300 32744 31321 28143 22318 19370 20947
12032 20947 18991 11856 11321 16160 16386 13311 14426 18648 22940 28744 30475 31561 30601 34353 35916
12017 35916 42022 41054 43924 48033 55477 74751 100317 128839 169199 217746 271874 318754 350275
12004 350275 368424 362743 338335 299866 254616 209796 171106 134741 104711 82318 67429 61970
11992 61970 57343 56611 53291 52023 48771 52336 55998 61474 53212 54693 60045 60569 54735 51081 52103
11977 52103 55675 51666 46201 48461 55277 60166 71367 86207 102536 132435 171502 214840 267874
11964 267874 337925 405711 465727 503370 504636 488877 456017 397413 333943 272262 214207 170327
11952 170327 134486 107265 90522 85199 75828 67056 65064 66758 67498 66922 64300 62463 62398 59408
11938 59408 56907 58114 57654 60324 60106 60516 65584 62725 57148 52356 53799 62885 73612 96012 119903
11923 119903 148310 187356 234048 290766 341590 379289 395898 396023 369889 316619 262484 221087
11911 221087 180998 142006 115986 89989 74255 68646 59488 51440 51593 52141 42996 39621 41693
11898 41693 40868 40414 39505 31328 27060 27250 23087 23784 33008 32004 19313 24427 33448 34609 40328
11883 40328 46372 46306 48420 55297 66596 89915 111568 130625 141251 149791 152229 146424 136845 122112
11869 122112 98753 78999 56799 44308 40748 42761 34831 27597 23578 24591 21506 15783 15810 16997
11855 16997 12979 2858 3154 2448 6260 4927 8025 5977 8901 9667 13061 8674 3104 -3901 -2850
11840 -2850 -111 4406 -622 -4908 -718 8402 16124 24193 25426 22260 24198 24068 25267 23079 18740
11825 18740 16106 12331 10575 -4643 -12982 -10143 1498 8903 12507 14489 8073 3484 1567 4382
11811 4382 6509 6630 -38 1218 496 -6996 -6071 -2240 -5542 -11301 -11826 -7282 284 -5617 -5896 -6676
11795 -6676 -5596 -2384 -4507 -3228 3114 5233 5599 15795 20794 26606 36276 34570 34570 41050 37003
11780 37003 31761 28460 25957 19968 12796 6395 -2964 1531 5205 2944 -875 -3489 -1286 1640
11766 1640 1242 -3536 -6666 -7736 -6282 -8812 -9324 -2873 -30 -6458 1883 9612 6677 2400 -583
11751 -583 -1270 -1036 4688 15077 18572 22912 24706 23672 36250 53596 64476 74757 75872 77920
11737 77920 84067 82350 72627 62679 52210 41197 29296 14210 9733 15169 15066 8634 13490 14390
11723 14390 12428 7714 12332 16583 10262 -1230 626 7704 7849 5626 6780 5589 12755 19841
11709 19841 19873 10684 4423 5723 15399 18686 16575 24525 30282 44574 64413 79672 93858 111426
11695 111426 119312 120117 119927 112600 101675 95634 83029 71562 60095 51787 46324 43849 45536 45734
11681 45734 35465 36068 41361 36307 30365 27504 21914 15798 18576 20617 24944 20313 16959 17313 18552
11666 18552 20533 27522 26273 24219 26659 25396 25986 32108 31419 40368 50513 64455 78616 90615
11652 90615 93059 98842 104448 101025 95772 93393 91164 85287 75631 67320 62034 61484 62922 64510 58605
11637 58605 57766 56210 57696 49910 34557 28671 30154 27332 26655 22862 22797 19894 13535 15644 18265
11622 18265 14778 15795 15195 12375 8019 10259 10641 22914 30649 31633 32079 37618 44163 45960 47639
11607 47639 46894 47901 47173 52972 58931 59122 57156 63434 64127 63321 64908 70838 74588 75915 74270 67384
11591 67384 58569 45662 34450 35841 35652 35420 22778 12105 11380 15699 11164 8086 1517 3071
11577 3071 15993 19767 20827 19232 17937 21607 18206 13407 16684 24466 17345 12837 16581 21745
11563 21745 22662 20699 20676 22488 21116 18979 22522 24111 30606 45724 53875 58423 62025 66501 62382
11548 62382 59215 52425 50756 45181 46016 40213 32430 30513 25699 23272 22630 16595 11888 5002 -4128
11533 -4128 -10613 -2314 -16 5630 11729 16477 9382 1276 -5242 452 -990 -5604 -3706 -5448 -5638
11518 -5638 -7348 -3770 5428 7970 5965 8324 17499 18241 11743 7908 8273 16230 29165 32002 32923
11503 32923 29385 23273 23547 24189 26502 27362 20517 16296 9323 9858 12472 11812 8981 9863 2117 3274
11487 3274 3077 11081 16512 19433 14158 6109 8688 7522 11193 11108 7807 2569 -318 -4837 1406
11472 1406 10553 5974 7437 7294 2087 1777 209 3230 8467 20096 25319 25225 30335 38729 44113
11457 44113 49048 52123 57933 62965 64520 64813 57839 57424 58268 54415 51530 47794 50350 50924 59308
11442 59308 76225 93090 101123 99201 106818 119654 131775 152362 180501 208456 247942 312340
11430 312340 394882 499902 614298 737078 852356 953071 1025451 1067797 1064038 1011841 925490
11419 925490 829771 723474 624316 540621 474092 427901 391206 366157 354260 348800 346849 342946
11407 342946 337954 332733 335367 342022 353007 365321 378648 401708 436266 470828 502917 550696
11395 550696 603713 654932 723228 808983 921733 1064469 1255201 1534795 1920794 2427086
11385 2427086 3057928 3778203 4542987 5282138 5917349 6359818 6553433 6470515 6117733 5556535
11375 5556535 4870940 4149672 3464802 2860417 2374251 2018641 1768230 1597961 1486644
11366 1486644 1413087 1365594 1330699 1296765 1276389 1267183 1266457 1269264 1283841 1314044 1371529 1435421
11354 1435421 1513811 1607736 1723229 1847842 1981640 2147239 2347750 2607208 2981233 3507234
11344 3507234 4245805 5268530 6599050 8235413 10116039 12080105 13926373 15468696
11336 15468696 16504505 16878189 16524182 15504482 13963129 12129176 10216886 8418827
11328 8418827 6855076 5615854 4701415 4078364 3658932 3376525 3175108 3037993 2938723
11319 2938723 2851514 2783955 2728963 2673224 2632069 2617816 2629716 2667363 2738754 2828259 2942438
11308 2942438 3075155 3222152 3373426 3562380 3813178 4170000 4683091 5415670 6458522
11299 6458522 7905564 9794158 12089425 14679911 17343476 19799657 21774552 23008930
11291 23008930 23311158 22609663 21010680 18754990 16162113 13513051 11056652 8955422
11283 8955422 7306370 6100906 5280333 4744061 4374273 4109661 3919108 3768195 3636765
11274 3636765 3517834 3409253 3307136 3222442 3161183 3120176 3103625 3117326 3158832 3214249 3278957
11263 3278957 3348506 3431789 3546168 3709967 3954670 4327547 4891100 5720380 6871245 8371692
11253 8371692 10184445 12186557 14199546 16011283 17404479 18173816 18196684 17456866 16056636
11244 16056636 14203087 12144495 10101571 8239564 6681329 5470805 4589463 3992049
11236 3992049 3591232 3315584 3119966 2967329 2842453 2740832 2631323 2524195 2431683 2344863
11226 2344863 2264091 2204779 2159718 2129923 2116433 2104117 2097436 2099298 2102076 2115378 2144913 2211048
11214 2211048 2340630 2562619 2906266 3390415 4021135 4771335 5585425 6386047 7075372
11205 7075372 7578047 7802347 7702589 7301377 6647662 5831056 4962066 4117922 3360171 2739034
11195 2739034 2273160 1945742 1722436 1563898 1456377 1367010 1288389 1225885 1173160 1131604
11185 1131604 1080188 1031483 982421 946068 908593 880205 858885 833007 815339 799638 781183
11174 781183 765921 737151 717058 715015 731847 759148 803688 880021 986650 1109589 1252831
11163 1252831 1389178 1485814 1540782 1554850 1511836 1419371 1293221 1139311 979028 831535
11153 831535 700455 585677 500139 440772 402997 380446 360554 344925 327920 309627 294631
11142 294631 284859 269778 251852 239138 229408 221886 215731 210155 198923 190817 183227 177761 169886
11129 169886 168410 165937 160260 150881 148187 148240 147220 143500 142565 143823 144343 142643 139327 133446 127924
11114 127924 118017 106007 104359 107030 113702 108560 101265 95401 85949 86016 82013 78384 81829 87312
11100 87312 85115 79259 74390 68793 68452 59704 58172 58000 55383 52748 49788 52024 57835 59185 54398
11085 54398 49437 49601 50986 46312 40073 48485 56842 58449 60679 57070 53729 50849 58476 60579 56335
11070 56335 54349 48375 42428 41884 45559 47767 44622 41443 41135 47686 53850 47668 42314 37537 36300
11055 36300 32048 29827 29084 27241 23100 17340 21652 23763 25805 30696 27677 31712 41143 43054 42390
11040 42390 39433 40920 39386 40186 36368 31443 26215 17754 18231 23212 26587 20712 20253 26884 29026
11025 29026 20220 21285 27545 23893 18788 16391 13100 16409 25400 26848 21560 22871 20233 21617
11011 21617 20030 10196 5215 8807 7854 16353 24356 17580 11253 13336 11742 14947 14576 18964 17840
10996 17840 11765 16522 15783 9051 11513 11104 11992 12144 11536 11010 7926 8316 12394 11997 6134 4805
10980 4805 -2470 -5544 -858 2488 9705 20139 29727 36940 38888 42992 43775 43777 42488 37355 32541
10965 32541 31554 27675 28827 23646 19031 22818 22793 18547 11180 5000 8383 14493 19173 14094 4980
10950 4980 8171 6746 5466 6397 11372 15504 11049 3043 3636 10686 9720 7067 5102 10546 9905 14903
10934 14903 27919 39028 52104 60338 75222 83876 85806 96346 97407 91514 87029 78077 68991
10921 68991 55196 46629 41960 39488 41846 36319 27890 21259 21692 23306 28266 26437 21217 17219
10907 17219 13638 9973 11282 11772 10900 14183 22807 16527 10535 10032 8772 7447 2503 10946 25502
10892 25502 34552 39537 51312 58850 70780 85629 97881 108646 119327 129492 120201 111541 100641
10879 100641 90702 84275 76282 63146 44822 34494 25235 23205 26199 26271 26854 27099 24286 17895
10865 17895 20364 24995 21437 17604 21969 19382 14158 13340 12019 16501 20972 22990 22703 22094 29375
10850 29375 32668 26106 27228 36072 40771 56145 66135 75425 84130 94659 102786 113724 113820 103549
10836 103549 96435 85815 74641 65014 56811 46384 42759 40103 35193 35553 34255 29756 25562 21000
10822 21000 18324 14097 11595 11122 13426 14677 18489 22037 15529 11090 10298 10444 10899 17180 20615
10807 20615 26160 21202 20838 20599 25911 30233 31516 34970 43436 49120 48388 44523 45689 48094 53667
10792 53667 56918 50810 46901 41790 40662 37546 40901 39467 32497 29824 31809 31547 30911 25106 17929
10777 17929 13297 16106 8949 1915 2372 6045 3868 6962 3156 4116 2473 5285 11034 5055 -4649
10762 -4649 1143 656 -2179 -5374 -5100 103 5728 5112 8042 11054 13511 9886 6042 11210 16672
10747 16672 16422 14719 11762 12406 10562 10638 16670 28541 23722 13143 10478 12586 9836 6045 1858
10732 1858 6510 9948 4656 -4446 -5700 5492 9475 5825 5822 3628 -9547 -17713 -18173 -12376 -5757
10717 -5757 -6183 -4633 -218 -1764 -2646 -3454 -7860 -13531 -11214 -8002 -451 -2017 381 -84 -3410 -7289
10701 -7289 -3812 -6592 -13535 -14909 -10119 -3265 -857 1193 5409 6096 -178 -2688 -2798 -7706 -7734 -1255
10685 -1255 -830 -2518 -3652 -5961 9173 15497 14484 11751 5821 3485 -86 -11108 -14999 -16787
10671 -16787 -15852 -15140 -10224 -5379 -2612 -2314 -1176 1108 -1439 -3343 3789 5866 -1681 -6089 -11305
10656 -11305 -6242 3039 -600 -2205 -11492 -17989 -15648 -11785 -9542 -9499 -9086 -3788 -3289 -14642 -16954
10641 -16954 -14747 -12027 -15273 -19976 -21642 -19653 -19943 -19163 -14635 -8092 -1528 5397 7575 1434 -1433
10626 -1433 -4160 -146 2553 1886 -2382 -3973 -162 672 -747 656 1671 698 -2209 -6069 -10138
10611 -10138 -16128 -14087 -12924 -12523 -9575 -7534 -7339 -2933 -808 4718 13805 21704 23218 25430 27237
10596 27237 26458 21764 17442 16853 12055 8001 7608 1855 -1195 -4020 -3872 -4963 -6319 -3965 -5555
10581 -5555 -3243 -8677 -7539 -5852 -2215 520 821 -3051 1645 -375 4004 7776 1621 72 -983
10566 -983 7436 15572 18721 18329 20320 21989 19564 20063 17492 15754 17627 15610 12244 5135 -208
10551 -208 -5503 -7123 -4485 223 6375 7445 6077 4851 10777 14198 15679 13985 16203 17121 13552
10536 13552 14315 14313 13428 14199 11082 12929 10598 2311 -4290 -6132 -3924 -10 -450 -2981 2412 1944
10520 1944 2623 -1383 -5552 -5955 -1907 -538 -5011 -2974 -8322 -11984 -12911 -11200 -10389 -10328 -5549 -9572
10504 -9572 -12550 -10486 -7579 -7538 -15130 -11821 -9931 -6734 -6606 -11089 -9246 -13375 -18610 -5020 4585
10489 4585 -1779 -1089 -2204 -6804 -7251 -7794 -4287 -3113 -4464 -6760 -7445 -2507 6185 7422 5063 5619
10473 5619 2227 -5350 -14524 -13333 -10533 -4929 -3389 -4760 -1878 -1469 -8408 -13881 -14574 -13340 -9999
10458 -9999 -12239 -6456 -7272 -10749 -7933 5388 11483 3452 -4260 -3342 -6507 -13112 -11448 -9787 -3189
10443 -3189 -1280 -1684 -3952 -12125 -10527 -2735 1627 2532 -871 -5337 -4508 -9568 -9638 -14539 -8997 -9767
10427 -9767 -13524 -10888 -13431 -8372 -3877 2524 2042 3272 5711 3644 -82 -3237 2563 8003 4808
10412 4808 1749 -1166 685 -2774 -11135 -10912 -11479 -11177 -8051 -6689 -8835 -6624 -1938 -1826 -3080 4070
10396 4070 7842 282 -6559 -1703 6236 4540 -558 -2877 -2049 -1417 1028 6468 11477 16826 26964
10381 26964 24336 30125 34078 34041 37015 43506 50141 62918 72554 72682 73611 67078 64036 61883 51939
10366 51939 42836 34828 33787 29169 22671 23863 29548 23675 17144 16535 18577 15477 17355 20036 17770
10351 17770 14228 7628 15877 19314 18115 14774 14762 15138 9925 2534 3772 2596 6836 4491 -2317
10336 -2317 -193 -2712 -2335 -946 -3950 -3886 -8642 -8699 -3170 30 1745 8393 6917 3631 2962 2053
10320 2053 -3428 -2976 3786 7278 3080 -2277 2392 7536 5197 -1199 2029 6727 6858 1150 47
10305 47 -7376 -17093 -12701 -12684 -7156 695 8640 11901 9668 19111 32236 28796 20872 2369 -6510
10290 -6510 -4241 1389 2682 7628 15731 18017 16640 6877 366 6237 13145 13423 14894 11712 4650
10275 4650 374 5836 12336 22924 34552 48825 71037 93015 96493 82088 47533 30655 23318
10262 23318 21638 19289 11086 7297 4993 4099 3307 5680 7279 5444 2906 7024 15175 18512 30395
10247 30395 44487 53796 63285 62217 54626 40762 30105 21790 13614 11979 8458 3211 5501 10224
10233 10224 10386 13075 28241 40948 63556 94506 113877 117914 101885 67022 36833 26152
10221 26152 20906 13015 10020 9725 14500 13945 6214 3954 2359 14606 16841 14032 11118 11179 10586
10206 10586 6726 8325 4075 -5188 -11936 -11373 -4517 -632 2786 2030 2910 6892 9008 8891 2091
10191 2091 -6093 -8363 -8476 -8978 -4505 -3622 -5106 -9754 -10744 -6895 -4293 -3114 -5966 -7209 -5979 -3718
10175 -3718 -7351 -8791 -4938 -8538 -3914 -7073 -6902 -3832 -4735 -13245 -12507 -8463 -12842 -8898 -1661
10160 -1661 -6005 -4126 -5262 -4772 -14711 -15940 -11764 -16230 -11107 -6301 -8132 -8563 -4533 -3414 -3483 70
10144 70 5894 10271 7016 13328 17209 14176 17964 18356 15884 1826 -2665 -2394 -5006 -10537 -5660
10129 -5660 1006 3085 -1408 -4197 -1304 3243 7379 8878 8641 1440 -9039 -15584 -13380 -11888 -10797
10114 -10797 -10147 -3986 -5522 -1897 -1847 -1092 1095 4289 -2022 -6658 -11967 -7855 1271 6518 2099
10099 2099 -5399 -2573 -723 -4416 -2983 -1087 3335 5704 7241 2645 -2560 -5265 -10020 -6158 1453
10084 1453 3035 3985 2665 674 -3034 -11301 -11520 -8653 -6885 -6838 -5732 -173 -1570 -7387 -6422 -4760
10068 -4760 942 4837 2223 -638 8966 12530 5540 855 -14 -4196 -5297 -694 -1648 -5344 -9646
10053 -9646 -12145 -3558 2904 2676 5151 11858 23284 35032 49759 75693 102465 115909 109041
10040 109041 81902 57723 43179 40338 41014 39886 40219 52251 65427 83339 111101 149571 197118
10027 197118 241706 272639 284590 291032 304733 329415 350551 357817 349472 343109 350080 342292 321400
10014 321400 301479 290827 288363 271864 232878 174063 128398 99436 81369 79131 76520 72905
10002 72905 67067 62474 54397 45550 37399 44876 44148 46440 52564 44417 38240 31795 26605 28348 26235
9987 26235 25333 20545 18034 14546 10845 12591 14059 21298 22586 21592 19130 12810 979 -1557 -7230
9972 -7230 -9258 -3060 375 1969 10039 15231 12402 8340 7269 3061 -5903 -8692 -8743 -2782 3859
9957 3859 6694 8407 13637 16523 19167 16725 19287 22391 29664 34234 43432 51545 56863 62331 61980
9942 61980 63055 68268 67430 74410 75690 64512 50792 37625 32344 28176 38545 42955 38402 36085
9928 36085 39580 41091 49045 59980 77117 90251 109619 139474 194042 272120 392990 554177
9916 554177 753107 961227 1162488 1332660 1454015 1473167 1339697 1081735 789508 549090
9906 549090 395568 299139 241938 198394 171622 151748 140647 132407 122615 104755 92429 96999
9894 96999 101864 101875 100973 106068 101913 94315 92745 89464 83982 82629 71908 64263 64507 63990 60485 51803
9878 51803 49194 49047 45855 38694 19240 14940 19436 20614 23859 25021 25809 24741 29464 24210 21533
9863 21533 15852 15582 15069 17130 23223 29029 19979 17196 19506 16606 14472 13397 15328 14704 11844
9848 11844 9463 13466 24561 34711 43234 57680 87078 117319 145502 163490 151610 123053
9836 123053 87492 59439 40111 35358 29220 23323 15221 13348 17774 17855 16743 11235 14248 16069
9822 16069 20479 22416 25534 32286 46590 55109 70835 99973 138509 187000 231336 273947 314625
9809 314625 321043 313313 290633 242139 179363 126599 96047 70818 50475 43518 41089 39301 33664
9796 33664 35854 36226 30045 29818 29291 30913 32267 28795 30130 34053 33424 32120 33865 28854 25664 16007
9780 16007 18446 15366 16506 16641 13841 10852 11580 3563 54 9550 7032 9978 17275 14975 9588
9765 9588 3957 6930 16099 13471 4408 -3141 -1125 4254 7421 13782 16077 10571 2967 4827 3894
9750 3894 7134 2508 2247 2149 4005 4428 301 3458 5541 3600 3242 6230 8711 12698 8368 6181
9734 6181 4325 1342 -1466 8894 12535 -2860 -12483 -14236 -11322 -4305 -705 -168 -4342 -7974 -3045
9719 -3045 4229 6483 5039 -34 -5236 -3573 2049 1565 -670 348 -6014 -7824 -6073 -2717 -4225
9704 -4225 3252 4660 2097 536 -733 -369 -5407 -9342 -7806 -9273 -11318 -9166 -2900 -3624 7120
9689 7120 9984 5169 -947 -5773 -10685 -16006 -10202 -5324 -1941 2435 3824 5436 10979 12875 12999
9674 12999 12825 15510 14631 12361 10916 10000 9299 -1160 -6429 1 1244 -751 3013 -304 -5525
9659 -5525 -10101 -5042 -2122 5289 8441 12420 15336 6542 966 2426 1798 3556 -3168 46 1924
9644 1924 -3433 -944 560 -995 3688 11964 10544 11769 13228 12002 11809 15213 16331 11270 4170
9629 4170 3845 133 -2474 3837 3420 -3120 -5329 1311 2107 2313 -1424 -3454 -4356 -5135 13 3684
9613 3684 -3089 -9102 -10274 -9230 -10957 -4354 936 3976 1836 1535 3035 3766 -534 -7507 -14699
9598 -14699 -5673 -4099 -3779 -2006 -436 9332 10085 3712 1298 1161 4751 -476 -6161 -4275 1940
9583 1940 8485 12066 12685 10921 5479 4054 5575 450 -1649 751 2320 328 -2382 -5426 -1081
9568 -1081 1140 -1823 2014 2819 4958 4866 6999 6770 6740 4505 -1961 -4149 1462 2921 -1219 655
9552 655 211 13 -6132 -4291 157 6520 3524 -8615 -12669 -4848 245 -1424 3155 7742 13793
9537 13793 11695 5766 -719 -3955 -2281 -2793 -834 887 -4971 -7997 -1894 -2685 -4620 -6803 -8809
9522 -8809 -5897 4213 12539 8036 -981 -7764 -663 4876 13073 10509 7107 3761 4371 2326 6135
9507 6135 4236 4584 614 634 7891 8997 8675 12743 14419 13096 13455 8941 4790 3267 4839 8448
9491 8448 14028 14950 3501 -994 112 3296 1230 6945 9096 10435 7067 -3606 -7439 -1489 730
9476 730 2092 5897 6326 5253 2084 -897 -3511 1739 4284 8719 8432 2419 4202 5642 5323 9022
9460 9022 2681 -2741 -2262 8223 16807 24107 20635 11366 6176 7620 10559 13072 17640 12963 7443
9445 7443 8552 10485 14051 12431 11424 6872 5306 7261 6558 3630 4939 5433 2572 -2572 2608
9430 2608 5518 6674 -546 2099 10460 17259 20096 20822 24048 17317 15260 15978 16556 13973 17199 19016
9414 19016 15620 11060 11098 9974 2477 7253 11222 17993 23586 25213 25104 18099 17357 14925 13869 17596
9398 17596 15748 10915 15472 21081 21970 21317 21750 22162 27256 22741 19884 18713 23508 22742 23210 28129
9382 28129 26811 27402 25572 24129 20761 19818 18943 16635 18317 16725 13538 11386 4603 364 7762
9367 7762 19699 20640 18649 23784 24986 27244 24475 22900 21755 20946 22311 18551 16077 21128 27135
9352 27135 28416 26991 30136 26702 22204 21046 20606 18412 11167 16195 22408 21420 13622 18222 20076
9337 20076 20294 25611 27810 27442 26578 27824 24518 15487 13815 19554 24256 32535 34733 33884 29530 31459
9321 31459 30715 38707 35589 30860 32506 33486 27975 23545 20671 22679 29871 37917 41564 34979 32096
9306 32096 28996 28226 29232 31138 28406 31659 36412 40942 46294 48239 53452 54618 54905 52693 53784
9291 53784 48105 52264 61103 59908 57612 53795 56699 50052 41792 44220 45521 49711 57466 57586 56934
9276 56934 50650 53473 56003 59733 60834 57627 61910 71764 76331 74677 70283 69706 71907 75778 81925
9261 81925 85632 89928 92609 96505 95606 98851 104315 111129 111165 114270 127537 129674 129894 133355 129982
9246 129982 140147 149778 157734 168977 181328 193316 199969 201252 207149 214326 216754 219154 218746 221641
9232 221641 227690 229315 236917 245486 262564 281204 297869 320188 343705 364988 376476 395574
9220 395574 424128 450820 485424 518469 559903 612295 663375 711126 765456 829690 901521 982349
9208 982349 1065878 1152435 1239755 1328171 1429316 1533747 1625536 1699523 1758195 1799164 1828033
9197 1828033 1835353 1815126 1774393 1724628 1659332 1578246 1492310 1407590 1321151 1234280 1153932 1080499
9185 1080499 1008481 943841 882314 835622 786381 742351 703609 666219 624535 589028 557107
9174 557107 533907 520138 494592 470657 449277 422543 400967 389540 370481 350200 337903 325104
9162 325104 308161 290519 281860 270803 255684 238030 230263 217374 213595 212774 209470 200441 201345
9149 201345 204760 213825 232331 244811 245212 226163 196872 182580 164436 146820 134192 124536 128434
9136 128434 135257 137522 137063 128571 121354 126049 130351 129322 130143 125109 127609 128102 123910 114212 109970
9121 109970 113333 112911 108347 105820 101389 94541 85837 81672 85131 86235 73725 65251 70995 76580
9107 76580 80228 78964 79361 82978 81941 75842 68145 58918 57605 57606 52789 55778 59488 67362 68005 73647
9091 73647 74109 80273 82273 77584 65985 66600 71641 70463 74593 81797 86226 77492 70184 63127 59215
9076 59215 54219 55433 59778 58884 52278 47443 42752 38073 36586 45053 48747 51297 50829 56814 65020
9061 65020 67419 71222 80513 80565 77513 71276 54468 47609 52893 62516 67603 65518 63278 58503 54926
9046 54926 55358 58829 59033 56935 54486 48762 45014 47913 50575 52860 57727 64803 74093 82334 89959
9031 89959 99971 109536 125385 143115 162817 177712 205739 241833 298771 391046 516963 706425
9019 706425 973997 1296146 1613312 1829714 1867118 1695194 1380254 1037623 763146 573538
9009 573538 453570 376886 330690 295641 273787 261558 251467 242589 228988 212395 192058 183559
8997 183559 178481 180695 176090 171218 172235 178983 174747 167608 159950 160060 167687 178556 183619 198439
8983 198439 220394 236779 254178 290887 342305 426920 562485 758465 1014478 1328699 1636739
8972 1636739 1828048 1822461 1610745 1284892 962314 711189 545253 442594 376904 334052
8962 334052 305473 279114 270050 262623 249065 231112 212394 207376 199906 188984 176943 172881 168248
8949 168248 166051 166451 157097 146378 135210 133169 132244 125314 126402 128775 130136 128620 120539 126273
8935 126273 128779 122410 128629 145641 157154 163856 176354 180135 177612 168308 148824 133086 121259
8922 121259 113254 104396 96083 96039 95711 91021 87003 89373 95273 99367 96599 92652 89081 87141 79041
8907 79041 75232 80219 81950 77306 81804 88450 88883 93067 94514 96252 100891 110769 110015 108417 111550
8892 111550 114288 115589 120512 142639 160128 177326 188470 186189 185157 182316 175206 177486 182244
8879 182244 189178 186248 198866 227144 249449 279185 318904 351135 361410 342345 295185 238883
8867 238883 191008 161538 138507 127949 113846 103253 96377 85357 87596 96259 101558 105914 113703
8854 113703 108824 99900 97494 89239 76231 68848 70037 79091 85302 89616 95977 101117 98635 94679
8840 94679 93639 98646 108557 124128 152255 183281 197352 211209 234110 262347 299114 340242
8828 340242 378108 400098 380515 320111 256600 206300 167269 140225 132569 150291 174665 189208
8816 189208 181707 161391 148855 143542 140027 139863 123056 107480 98277 90831 96075 102844 100501 98442
8802 98442 94672 90954 79817 78504 79306 77424 87582 99829 105374 109890 118817 132020 143881 151102
8788 151102 145912 138439 137668 138784 151429 180605 198241 199928 196999 180994 164863 160187 168216
8775 168216 184159 190033 182440 168643 154138 127593 96725 76187 64282 49241 31892 19381
8763 19381 20905 26065 24467 22982 16348 83 -20029 -40680 -58975 -81493 -111418 -149137 -196933
8750 -196933 -258388 -322093 -361623 -349724 -279312 -114891 149815 455413 663357 720137 703418
8739 703418 673122 648926 629082 608525 590604 570941 554197 535936 529497 521215 519495 523665
8727 523665 533025 531208 527865 526601 530625 546844 573840 602666 639605 690917 740743 797461 859841
8714 859841 944256 1061563 1239506 1521250 1936003 2517571 3289480 4262518 5478128 6821960
8704 6821960 7961723 8280078 7464208 5833455 4322742 3459640 2993540 2662816 2415278
8695 2415278 2235893 2102645 2005946 1942550 1902423 1864739 1833713 1800671 1765732 1738642 1720950
8684 1720950 1705848 1692663 1692321 1695485 1692905 1698783 1725118 1763027 1810290 1864848 1933468 2006438
8672 2006438 2082467 2167396 2273039 2396409 2562063 2808254 3193100 3765557 4605610 5818512
8662 5818512 7395518 9083393 10279068 10410106 9427029 7856341 6532503 5613497 4966155
8653 4966155 4564062 4365878 4289281 4299046 4371637 4482272 4592253 4693905 4791657 4902892
8643 4902892 5047745 5251822 5562878 6019431 6660298 7528779 8673203 10098214 11770023
8634 11770023 13641668 15627218 17671142 19779325 22009085 24676748 28450002 34105737
8626 34105737 42595368 55278442 74424447 103538007 147011019 207418244 279436727
8619 279436727 344187861 372253632 347848566 277024091 193835688 133664380 97816275
8612 97816275 76187024 62153179 52561897 45937837 41392725 38334517 36346795 35019369
8604 35019369 33889991 32589183 31011491 29479658 28326730 27537038 26989813 26518209 25936415
8595 25936415 25240745 24574510 24121482 24014220 24271220 24841993 25645598 26635216 27822837
8586 27822837 29267058 31325036 34623437 39914683 48114171 60642058 79903195 109524603
8578 109524603 153790138 214467485 284573493 343373892 362514101 330382183 256501067
8571 256501067 177981718 123943996 91848215 72219677 59325282 50476094 44297274
8564 44297274 39947782 36927769 34879876 33444682 32155055 30653912 28916522 27280194
8556 27280194 25996237 25008790 24174606 23281292 22128899 20693699 19102662 17486722 15958430
8547 15958430 14591840 13392151 12335517 11411103 10627567 9959581 9371109 8837373 8341973
8538 8341973 7872026 7398471 6925376 6479194 6087610 5750389 5446755 5151705 4876184 4645851
8528 4645851 4459557 4307489 4189547 4060805 3859949 3595539 3318477 3093025 2927411 2793165
8518 2793165 2665488 2540590 2419649 2302081 2186624 2070623 1953362 1841540 1742376 1651401
8508 1651401 1571923 1491030 1416661 1342906 1280596 1230481 1191764 1163115 1148451 1127070 1103403
8497 1103403 1078558 1049757 1034923 1060613 1153566 1305445 1459233 1543333 1523553 1430330 1319747
8486 1319747 1226792 1153185 1101501 1065130 1022124 973064 918880 871482 846718 826671 804114
8475 804114 780095 753657 718051 690342 669463 642852 612845 586220 557153 527478 504424 498839
8463 498839 499257 496451 478480 458867 448818 452740 459346 459609 469519 484423 501689 512361 531306
8450 531306 584000 688337 846583 1027928 1146518 1154930 1089098 1004920 933154 874008 831735
8439 831735 795180 765046 744479 730643 718997 695798 676065 662154 642422 631513 626503 622035
8427 622035 617492 608930 592611 575614 556144 531295 509106 486844 468960 461272 460985 462884 461176
8414 461176 449057 431211 425969 419448 423092 439820 454341 448827 438993 429739 417926 402814 387215
8401 387215 381873 387883 396362 406462 410062 413213 413501 407526 399204 392312 377038 362158 350245 350178
8387 350178 349348 352233 351896 335076 319608 308340 303112 300659 305455 314709 315385 297855 282839 278447
8373 278447 291611 312603 335129 339757 331630 328117 322914 312477 308776 302458 284923 263736 237044
8360 237044 218704 207739 206539 211402 213814 216591 217460 210581 203257 190066 181070 175817 169643 161226
8346 161226 160791 162439 163784 159487 157236 153242 148899 145109 146620 138790 130599 146826 159278 165405
8332 165405 178665 184311 184845 190268 198239 203784 212581 227304 239963 246263 247190 229476 207346 193193
8318 193193 179233 164481 144429 134621 130609 126108 110982 92307 70713 55133 47402 45829 53164
8305 53164 67240 76904 101483 125913 137707 142751 142177 132493 122825 118121 119842 116965 115785 112705
8291 112705 113858 116219 121769 130454 135237 135591 134461 133750 129486 123251 120715 125907 129248 127903 130575
8276 130575 134832 130201 124164 111545 96798 95495 88184 74811 57902 47602 38485 35318 33335
8263 33335 34067 43242 66599 95452 110664 117119 121911 127596 127304 125457 118773 117616 123070 127925
8249 127925 123994 117829 106275 100463 106779 111188 116983 117566 111112 110793 107280 105266 104116 100504 97295
8234 97295 102154 106331 117723 132007 147853 162314 167815 169174 182215 204885 238220 291604 371531
8221 371531 485022 648674 872119 1170550 1505426 1797869 1932808 1839925 1562437 1205215
8211 1205215 895034 674965 533723 443429 388594 349654 319557 296871 282239 272669 269627
8200 269627 268303 263242 252957 250757 246434 240510 226358 213114 198198 194951 198275 206119 214862
8187 214862 219967 215663 211700 216758 223012 235464 247726 277761 334911 409461 518545 692482
8175 692482 929622 1221764 1536100 1789764 1877400 1742248 1447342 1093295 793507 593558
8165 593558 474747 402991 356655 326010 301027 284296 267607 256110 247792 236557 220629 206426
8153 206426 201739 202329 200827 198613 195552 195875 182024 160956 144752 143359 140931 140369 144052 148740
8139 148740 152364 152135 151148 143583 132487 124039 108949 101524 95867 98473 97085 96553 94582 90702 82898
8124 82898 78649 75682 71107 67636 74039 77804 70482 64728 71515 79417 85879 76511 67705 62538 65573
8109 65573 65659 57080 51054 48727 52617 58353 60393 53819 48066 52969 52968 56899 64792 75765 88089
8094 88089 105686 126011 135308 133207 122898 100523 83740 74353 71162 64825 55134 52082 56293
8081 56293 51737 46512 39353 40900 43421 42879 38689 33365 33097 40268 38149 31309 25825 21993 24296
8066 24296 25653 23581 21501 23544 26056 30837 29846 30074 35534 44537 43174 39249 34843 41393 43788
8051 43788 51995 56840 59809 65425 67334 72536 70052 73304 77290 74885 64772 57128 55204 54763 58448
8036 58448 58708 49660 40742 43115 38898 30950 36769 41153 38993 31505 29346 31629 27860 29417 27827
8021 27827 25128 30387 29994 32268 38080 49735 53683 51596 47199 45291 51451 52102 50602 49286 53054
8006 53054 59848 59175 54121 51350 46919 47535 49052 45061 41682 40320 37653 39598 44528 45430 43285
7991 43285 48510 55775 63856 67524 56752 44860 40440 37689 40630 32576 28394 31927 31591 31451 30097
7976 30097 29220 28091 33344 37441 41781 35662 33274 27641 28880 35241 37130 35067 32780 38704 40880
7961 40880 39624 34971 35823 34481 26943 22727 17449 16854 21463 21044 25309 28078 29661 23283 26387
7946 26387 31755 33090 30147 30532 35732 33696 24338 24343 27237 31433 34777 35722 37311 26645 34849 44263
7930 44263 43064 36187 35096 28891 26339 23314 21892 24009 19307 15252 16251 15712 17286 20856 21827
7915 21827 23288 27523 27113 23967 17595 21232 21076 13568 9335 9583 16897 20550 23193 17970 18469 14248
7899 14248 4402 893 4939 15811 16143 23468 34369 37410 32592 26144 23786 24780 24938 23229 26532
7884 26532 31272 31516 33460 36094 27577 21564 16521 15033 17141 16461 19568 21097 18476 23820 25590
7869 25590 15340 14770 14886 14429 11283 7106 13169 8329 6070 8805 8131 14118 15098 10435 14298 17877
7853 17877 19332 15722 14342 14871 19102 18757 20172 20852 19503 28527 26870 26068 30178 32446 25721 23920
7837 23920 20315 11027 10148 12963 9780 7566 6496 7726 12014 10953 6530 3014 7654 14021 18926
7822 18926 14531 14422 15174 14082 12075 9149 11829 10198 6773 8497 6301 -3368 -5446 325 1599
7807 1599 -2053 1416 2737 2726 10449 15634 14838 5636 3809 7772 10200 5973 3801 4414 10470 7766
7791 7766 1027 1756 -1286 6003 11981 7911 10806 13870 12588 895 -1679 5972 6791 10269 10751
7776 10751 7514 9057 10344 9819 4634 -290 4362 918 -2366 -2089 855 7555 11928 11025 8047
7761 8047 8251 9624 5938 6788 9543 12688 10646 11392 8108 5677 11501 10022 1627 3874 4338 2941
7745 2941 3082 6959 10763 14060 6506 3860 9980 15844 12138 13564 11101 7592 5652 -136 -2165
7730 -2165 -5790 -2907 360 1600 -2280 7207 5550 -3457 -5688 3213 11198 11854 3116 9184 15547
7715 15547 18340 22216 16019 7501 2755 7018 4166 7512 8958 8303 11111 8941 7365 6480 4067
7700 4067 1470 1829 5156 13420 6171 3524 5454 5174 5638 9518 12421 3608 2907 6811 11426 16274
7684 16274 12649 6572 8828 6788 7580 15365 13135 8610 6369 5930 6982 9157 7337 5982 3390
7669 3390 -103 6675 11626 11222 7778 7064 8634 2819 3853 577 1755 5183 319 -5547 -9289
7654 -9289 -6253 1301 9076 8176 -2800 920 10454 7024 4444 3387 13023 13921 11250 7472 7561 8337
7638 8337 9898 10395 19675 27536 21303 8100 2962 4240 2794 5380 2922 -1245 629 861 2506
7623 2506 6990 11348 8500 7353 8208 6314 3086 1695 3712 1144 -4568 855 11074 11515 9132
7608 9132 9159 5610 6318 676 -3767 -136 6490 3321 7605 9280 65 -9491 -1572 5039 10904 12235
7592 12235 8557 -731 1287 10753 16122 11706 4393 3769 5117 9476 10702 5070 -1489 -1343 -8624
7577 -8624 -15538 -12804 -9681 -10831 -8211 -2712 -1283 -5618 -10717 -3992 4865 6141 5690 3550 -111
7562 -111 -1004 -4487 -6870 -377 5281 2347 -522 3226 -2499 -6472 5436 14622 4803 160 1350
7547 1350 2506 4995 6082 7886 2751 -1556 3776 2940 8310 -462 1046 3370 863 -1071 -2584
7532 -2584 2145 10152 6819 -1261 -6243 426 4583 1239 2216 4008 604 -935 -915 2015 6259 7719
7516 7719 2683 1830 3525 3261 4841 1532 8267 10335 9407 8625 6568 3339 1214 -4163 -3182 1178
7500 1178 -1139 -6480 -1711 -12563 -18327 -11455 -13734 -7764 -2229 1669 -3801 -4603 545 -1188 -2490
7485 -2490 546 949 -701 -3883 -1360 6015 6127 3772 2331 8796 9166 8450 9466 6690 3059 -864
7469 -864 -6148 -2001 1954 -5798 -1689 -7427 -4046 5564 6592 2081 904 700 -100 -1145 -1082 -5806
7453 -5806 -15804 -16789 -5244 7760 10142 14320 18058 8383 5652 2148 -1943 -9815 -6290 -1466 3133
7438 3133 667 -8354 -8514 -12725 -14005 -8790 1805 3418 5634 3520 880 2071 -1387 -4016 -2301
7423 -2301 610 -658 1598 4642 4484 7282 6989 2540 -2464 -3834 -954 1473 4450 7936 13145
7408 13145 11444 5998 9335 8326 4732 884 -4076 -2182 6848 6475 4526 223 -6376 -5260 1118
7393 1118 3134 3907 5412 4626 4413 5908 8655 5089 1762 5140 -911 -2341 -5718 -5777 -3321 2185
7377 2185 5166 3961 1257 2113 -243 -7493 -7777 -8104 -7873 -5611 -1963 209 7602 5368 623 -4822
7361 -4822 -6968 -16 3542 3593 3564 8482 10726 12542 4321 119 -1373 -892 -5553 -10140 -9498 -2313
7345 -2313 4285 3151 2622 2475 -9558 -11919 -10069 -3200 -1720 1802 3845 592 -648 1894 4836
7330 4836 1124 913 -1591 -252 -2242 704 6207 9664 6590 8222 11561 4228 -2323 -4114 -5081
7315 -5081 2210 8832 7206 1431 -2413 -2086 -1211 5200 7055 15 -4831 -6884 -7943 -12212 -6625
7300 -6625 -7521 -9892 -6136 -3739 1580 4452 13699 12780 4337 5436 12587 17828 7486 9748 6634
7285 6634 5564 5792 6934 7096 13997 14471 12143 8644 8207 10293 10253 5376 4019 708 6429 8950
7269 8950 6595 4624 1282 -3716 -2067 3490 2822 5561 6096 6359 12299 22125 17388 7009 5112
7254 5112 983 4579 11187 9658 5779 5513 5295 642 -6407 -5136 695 8493 7503 4386 2940 7277
7238 7277 6097 -606 1404 9613 6759 3509 5715 11932 12701 14663 16922 16940 11717 1681 165
7223 165 7844 6450 2725 5466 10372 3642 -3111 -2379 -1681 1847 7452 9803 2018 -1204 -962 -265
7207 -265 9148 10105 8977 7982 9098 7084 2091 296 2827 6127 1927 -2217 -4551 3817 -1405 -8516
7191 -8516 -10986 -8101 -7679 -10041 -6732 -3459 621 5768 9717 7717 10199 9231 2301 -2528 -6047
7176 -6047 -8529 -8097 -3974 1748 6914 4978 -950 -5700 -11701 -12837 -12568 -14184 -8185 -5675 -8473
7161 -8473 -6419 56 6599 9886 4159 8329 10668 7837 7362 8906 7456 2863 5586 5775 5780 4230
7145 4230 -4127 -9685 -3100 2951 -4127 -7913 -8959 -4936 2888 -844 -5029 -6266 -6169 -9567 -7382
7130 -7382 -5007 3302 7390 2291 -6970 -17032 -9891 -7355 -11460 -7897 -5395 -3009 -5689 -2002 -4784
7115 -4784 -9355 -10254 -10447 -8425 -3736 -9046 -12530 -11134 -7590 -8403 -3466 -2018 -5226 -4134 -5013 -12685
7099 -12685 -13127 -10016 -7693 -3577 -1034 -9439 -13273 -11071 -10778 -12909 -11931 -8072 -10232 -882 2087
7084 2087 1510 -353 -3718 -1131 -1581 -6622 -12703 -12109 -2952 -2187 -3442 -3297 -311 566 1624 -538
7068 -538 -1443 -5170 -6941 81 10270 11854 8743 10268 11534 12629 10428 2450 -3851 -2623 -377
7053 -377 -1509 -1632 -1668 -3252 -7184 467 1379 -149 -4542 841 6440 6033 487 -1193 -1808 -3346 -4283
7036 -4283 -2021 -3176 -1927 735 1400 -1951 -5777 -448 5994 5225 3054 1798 1719 3865 3505 3304
7020 3304 -1564 -3910 -1175 467 2405 747 -2066 516 2771 -3947 -2549 -4738 -613 -282 -4090
7005 -4090 -7999 -9478 -8548 -10655 -7421 -5501 -1056 108 4618 10703 2495 -2934 544 -385 4392
6990 4392 8851 9332 3458 2195 4472 2608 6804 10165 5820 6522 14413 7215 -4339 -4170 1114
6975 1114 5221 12099 12407 3016 2190 3004 3016 -2678 -4341 -2344 -3415 -4548 -2510 -5819 -4853 -3648
6959 -3648 360 -3347 -1158 1601 2795 4945 813 -1179 3993 5304 888 -10274 -11900 -8096 -243
6944 -243 -303 -1138 -7767 -4482 -5034 -7222 -6511 2016 3838 8972 8362 3065 7189 2308 -7416 -7583 -3088
6927 -3088 -123 -1706 -2193 -1578 -4480 -7617 -6500 -4866 -2148 -1768 -4283 -6183 -5947 -3498 -2552 1784
6911 1784 7363 13703 10413 -1931 -4818 997 -3693 -4749 -2874 5764 8237 -230 2732 6183 6578
6896 6578 12095 14024 10018 4591 285 1040 3176 157 1088 -3889 -6236 -6267 -6356 -647 5775 10370
6880 10370 12663 15666 12946 7189 -6259 -13761 -11353 -6241 -2045 -1958 1589 2354 3387 7612 2951
6865 2951 -3972 -4100 348 2020 32 -5001 2142 6807 7853 5514 -2385 -7357 -413 601 5950
6850 5950 9836 14186 14150 12394 14011 12327 9889 8578 8122 3211 2916 1928 1963 619 888 1123 -598
6833 -598 -3871 -4526 -1974 -10171 -12524 -9408 -9668 -13538 -7011 -1279 -4640 -3003 -8206 -15149 -9950 -7278
6817 -7278 -7391 -13749 -9544 -4795 -8485 -7742 -10972 -10397 -10598 -9406 128 4352 -1189 6446 6974 5420
6801 5420 7058 8291 7088 3118 1766 5592 9628 11254 5592 -196 -2216 4198 1949 -1045 -4965
6786 -4965 639 3635 1591 -517 -8369 -11924 -2800 2508 -5063 -12272 -9242 -2673 -759 -1195 -1526
6771 -1526 -1473 4511 7073 8863 5456 -1622 1409 1846 2429 1639 -3107 -3141 -2282 -2688 -1686 -1049 -2085
6754 -2085 -3834 -10775 -9352 -4200 -4112 -3522 -976 -2538 2571 3974 1341 6718 12559 8448 1726 -516
6738 -516 -3018 -3533 -2111 -6149 -1738 3200 977 3798 8578 8061 14565 10465 4769 5212 179 -1056
6722 -1056 -1145 915 7178 4058 916 4621 4125 9178 10358 10712 7699 4407 7036 14949 15734 10618
6706 10618 -168 -6980 2987 10218 7274 4589 6636 3057 -10101 -9898 -4855 -1055 -1460 -3705 -9238
6691 -9238 -11611 -4672 -3090 2514 4689 -365 -11260 -13025 -5872 -1212 -2001 -3209 -7483 -7298 -6846
6676 -6846 -5067 2304 8387 2639 -1511 -1252 -3852 -8429 -8790 -7730 -2773 -5045 -1917 4993 14033
6661 14033 14680 5679 -3775 -6391 -3208 -7967 -14445 -12680 -5575 -3949 -6613 -4120 -11881 -9469 -4124
6646 -4124 -4866 -10004 -11995 -12697 -16145 -14963 -10030 -6345 -4324 -3898 -1419 -960 4904 1737 -5625 -8650
6630 -8650 -15156 -11492 -5912 1595 2536 -171 -2870 -10527 -9475 -9737 -6989 -2327 743 9299 13326
6615 13326 16576 14380 14369 10066 9987 10766 264 -5593 -4650 -5034 -5561 -5077 -3795 -6451 -6576 296 10757
6598 10757 16442 14367 2818 4594 3710 -234 -3438 -5683 -2486 -3358 1653 1331 2800 2394 5870
6583 5870 13225 10046 7257 4946 1175 -1862 -3422 -9622 -5211 -1790 2717 -3874 -9859 -2561 1132
6568 1132 -800 2628 6994 -3514 -9164 -11656 -6689 -2713 2966 2543 14 2841 771 -3519 -1840
6553 -1840 -2525 -2637 -1435 -4626 -4691 -862 5669 4820 2028 946 8409 8618 1692 -6156 -11610 -6426
6537 -6426 348 -1895 -6435 -6078 -5662 -5440 1195 -4574 -1915 -2226 -3205 -6786 -8992 179 -944 -6152
6521 -6152 -10046 -10493 -11095 -3948 1102 -3287 -11999 -9138 -818 640 1086 7240 9487 5864 6920 3171
6505 3171 1789 -2207 -5069 -7173 -10406 -13128 -8233 -1085 494 -1100 -295 -545 3653 976 828 1704
6489 1704 1852 -511 2892 -1055 -5093 -7234 -4294 -346 1131 1208 -509 -1364 -9031 -8755 -9288 -7283
6473 -7283 -3054 2800 3143 -2747 -6329 -4531 2207 1693 2335 2346 1068 4146 7002 2626 4801 2128
6457 2128 2605 -231 -1546 863 -58 -319 637 -1084 -1448 2557 7190 8976 5125 2936 -3246 -7357
6441 -7357 -9463 -6405 1446 1155 -2508 -6963 -12281 -12502 -8617 1532 8490 5816 5383 7977 6475
6426 6475 12845 4533 7942 5541 2615 3676 -495 -5549 -3042 -1873 318 -1756 -2273 -5930 -10332
6411 -10332 -13774 -8885 -2316 1658 3746 5717 6398 3290 -3438 -5653 -4058 -3790 -6543 -6260 -4438
6396 -4438 -4511 -3162 -3227 -8779 -7244 -8225 -7348 -8032 -13423 -12639 -11197 -5423 4637 7831 9429 1473 -8131
6379 -8131 -11391 -2189 5720 7605 -1510 -3312 -1734 -43 -3965 -5821 -2649 2163 1384 1757 2685 147
6363 147 3340 4693 6259 8011 3640 1328 -4723 -11250 -4465 -4128 -4484 -8534 -9502 -4129 -5500 -5048
6347 -5048 -1283 -1500 -4721 -1281 4837 7216 4960 3137 4420 3882 4964 6318 7980 7757 8857 5575
6331 5575 983 -5181 -6678 -5139 -4478 -3700 -3905 -12480 -17106 -9495 645 3726 -2778 -8563 -12975
6316 -12975 -18200 -14270 -3712 -1831 -11414 -13227 -3399 1866 1214 5046 5190 3825 4357 6687 6319
6301 6319 -3485 -5925 -9737 -11635 -8790 -10925 -12344 -15773 -17360 -9908 -1397 3716 566 -2770 -6989
6286 -6989 -2012 741 -153 2329 10401 13531 7161 -1086 -7715 -18560 -14552 -8252 701 1589 -3139
6271 -3139 -8955 -11847 -3809 -916 -2034 -2553 3260 6343 911 3744 3568 2937 5514 5127 3340 6836
6255 6836 1179 -4239 -6271 -4452 2234 3513 2869 3041 1991 -793 -4464 -7186 -2586 2015 5599
6240 5599 1076 -9220 -8646 -5696 -3056 -4730 -8297 -8646 -6828 -7563 -341 1868 -6172 59 -2035
6225 -2035 -4207 -5021 -5483 -6279 -2552 -558 -2019 -3371 -3532 -4075 615 -574 -8065 -4726 -5451 -4879 -256
6208 -256 1007 770 5323 3851 -6210 -9187 -5031 170 2217 2776 1005 2903 693 -1353 -2346 -3930
6192 -3930 -8506 -13919 -18253 -17163 -14647 -4550 -5670 -3817 2400 -340 -3504 1440 6634 3790 3857
6177 3857 1654 -7630 -6463 -6852 -12024 -12449 -6974 -4300 -9384 -6339 -9004 -8697 1817 10002 4625
6162 4625 775 101 -5048 -5555 717 3786 5774 4744 4675 -458 -2619 -7775 -6001 -5012 -219 -1667
6146 -1667 2477 5178 11897 6007 -6744 -8037 -2482 1177 8065 10844 5531 1204 5752 2421 -1166
6131 -1166 -4258 -6262 -7288 -8210 -2009 -1648 -1272 -1045 -55 1471 186 2972 6045 6364 -1019 -2041
6115 -2041 6032 4327 -3801 -2341 2779 -670 -3311 1585 343 -8623 -10676 -14546 -4938 -357 -6317
6100 -6317 -6962 -6455 -3295 -3090 -4958 -7766 -8935 -5298 -1419 3187 4044 3219 -5242 -6849 -6930 -4223 -7284
6083 -7284 -14677 -11702 -6737 -6843 -8256 -4648 -1595 -1028 -3263 -12313 -6822 -8002 -12417 -15060 -11944
6068 -11944 -13043 -17105 -15537 -9966 -141 -2863 -4748 -8683 -12161 -10125 -12503 -15375 -18678 -16176 -13248
6053 -13248 -10610 -7220 -14573 -18392 -7234 2284 1265 4369 -2317 -4678 -5029 -1791 -4468 -9443 -6436
6038 -6436 -9637 -12308 -10677 -3608 -2073 -7890 -13892 -15389 -9722 -6744 -5499 -4203 882 -5186 -5185 -1862
6022 -1862 1878 -8416 -7353 -1882 -7733 -9898 -2760 -2552 -5684 -7461 -18450 -19139 -15362 -13177 -9268
6007 -9268 -8811 -14360 -11166 -3775 5703 -4228 -6876 -2397 825 551 7093 6453 3529 -872 -3645 -2421
5991 -2421 -13258 -12159 -1169 5898 264 -6954 -10202 -6449 -5421 -9879 -6341 -3694 -7972 -8950 -13359
5976 -13359 -9668 -7260 -10373 -11109 -11691 -7048 -8138 -10379 -7376 -4179 -8676 -12444 -8796 -1831 -3035
5961 -3035 -3953 -2569 -5782 -1550 230 -2940 -1137 -2709 -1385 -3526 -2157 -10399 -8091 -6219 -2375
5946 -2375 5081 7762 9242 5071 -2180 -1854 152 -5953 -13582 -18299 -12246 -10489 -7004 350 1121
5931 1121 2497 955 -553 -116 1701 -1410 -7128 -4495 -2376 -4610 -6695 -5327 -209 -2604 -791
5916 -791 3494 9852 9828 11861 8383 2593 1075 -297 455 -511 -2767 -1267 -4510 -5168 -4347 -9518 -6015
5899 -6015 -7020 -8613 -6104 -4631 965 -1522 1142 1105 210 -4021 2130 -3073 -5940 -8590 -5441 -1015
5883 -1015 2313 3159 -4086 -7519 -1290 5884 12425 6371 3400 -2872 -5451 -4648 -3026 2524 6894
5868 6894 3553 6893 7588 3907 9008 10894 7388 4005 2134 4945 3056 4426 4534 -3168 -4439
5853 -4439 -7001 -1233 4754 6477 6502 2849 -959 1411 6041 6027 10491 10359 14057 12705 6785 1199
5837 1199 1773 -1844 -7688 -1417 4814 7563 3151 274 -2931 -4528 -2967 -3858 -3485 -3504 -1251 -5577
5821 -5577 -9288 -13475 -15959 -10073 -4760 -11282 -15226 -13291 -5758 -484 -2507 908 3222 6759 4585
5806 4585 3377 8695 5715 2426 2896 -1138 -5896 -6473 -3177 -1013 -3276 3863 1941 -861 -2138
5791 -2138 1333 9660 8503 5953 7714 4398 -3308 -6147 -2386 -788 -4465 -10078 -14815 -13330 -11805
5776 -11805 -10028 -6822 -6915 -10527 -13968 -13981 -10182 200 7159 3878 1680 1986 2702 4642 1431 1887
5760 1887 1516 8806 7624 3746 3043 -7570 -4504 -1506 -3743 -2496 2516 4501 4155 3594 1017 1125
5744 1125 -900 -2389 -3998 -3737 -533 -2597 -9602 -11945 -1239 5152 4191 6778 3885 7287 3258
5729 3258 5912 5250 5233 8401 3224 -6165 -7476 -4556 -7992 -15201 -21715 -19884 -13761 -10400 -1525 -1985
5713 -1985 -3551 -3692 -10352 -18159 -20046 -18195 -11715 -14121 -12439 -10135 -8343 -8414 -8726 -6592 -7949 -9449
5697 -9449 -11612 -3811 -4144 -11275 -17887 -13127 -7011 -8037 1210 452 -1617 -6902 -10971 -14369 -12232
5682 -12232 -11043 -16521 -13547 -10062 -4786 -1695 -4293 -3483 -1276 -5868 -4739 -2220 1304 -2728 -4038
5667 -4038 -2317 -4997 -2594 -515 -3303 -5203 -4272 -469 566 2579 8739 2014 -7214 -3560 -4011
5652 -4011 -8477 -12092 -11874 -8668 -9161 -11072 -10399 -1624 201 -624 -4163 -4165 -6798 -9136 -9323 -2477 3761
5635 3761 4975 8295 8584 4164 -1009 -6935 -9598 -8298 -7357 -8836 -6149 -11816 -9884 -8315 -2025
5620 -2025 3959 573 -1828 -7961 -10443 -4086 2870 7778 10480 8890 6478 4067 9539 10916 11699
5605 11699 15956 15059 5037 836 7551 12304 5169 675 -1319 999 8874 7423 1923 -5000 -5088
5590 -5088 -3385 1776 -2902 -9681 -11977 -8719 -9027 -9328 -8660 -15855 -20940 -13832 -7770 -8584 -12078 -13046
5574 -13046 -97 9715 7345 9708 12189 8854 5125 1383 -1674 -5063 -6067 -3859 32 1024 -220
5559 -220 -1865 1236 -19 -2928 -435 -174 -4144 -3232 820 3942 5382 -23 1558 4268 -2092 -10589
5543 -10589 -11318 -13914 -12977 -1898 -3207 -3552 748 7859 6863 2093 -2895 2259 7394 4188 5937
5528 5937 13373 11356 6677 3304 -3837 -13009 -8461 -207 2915 -2327 706 -3397 -9824 -5363 -4611
5513 -4611 -7619 -11021 -13123 -9496 -10393 -5994 -359 3895 10681 11299 5120 -3618 -9349 -4033 -1004
5498 -1004 -3712 -10097 -15196 -16553 -14612 -7951 -8555 -11615 -10133 -10410 -11946 -11054 -8994 -9802 -8172 -2261
5482 -2261 2313 1265 -2745 -2935 -7315 -8817 -7087 -3037 -4006 -2918 -2703 5670 9624 6193 2742 2179
5466 2179 -2605 -2399 -2897 -3606 -2820 253 -2219 -6469 -4827 -2785 -6145 -8243 -10496 -8324 -3050 -3278
5450 -3278 -4039 -9812 -11025 -9451 -8643 -2447 1051 -692 -3687 -2478 -3803 3643 8483 -945 -8887
5435 -8887 -1226 5369 2878 -640 -790 -3886 -8284 -5096 -5926 -11740 -9822 -5786 -6895 -2948 1434
5420 1434 -2213 -6426 -7956 -3207 -4151 -6160 -4188 -996 2154 -5470 -10733 -5150 2286 3050 -832
5405 -832 -2342 -797 887 -4651 -9859 -12275 -15746 -13001 -1912 5041 6624 5834 3055 8377 10386
5390 10386 12882 13015 3111 -4780 -727 -3791 -4237 -27 1121 -3484 -5447 -3003 -11317 -8852 -3404
5375 -3404 -4436 -1686 -4924 -20 1110 -3169 2565 -4110 -5932 -3596 -3685 4880 5037 2789 5169 -914
5359 -914 -5613 -3415 -8007 -7351 -7425 -13376 -13007 -8218 -2842 -2782 -1618 -2358 -12967 -7552 1112 5976 4578
5342 4578 -4700 -1132 -526 -5497 -6646 -6855 -8388 -10358 -8342 -6131 -5274 -2232 -7787 -1955 687 -4754
5326 -4754 -5311 -8994 -3465 5705 1762 -2143 -7811 -12275 -15247 -18165 -15879 -13753 -7636 -6036 -6640
5311 -6640 -1738 -404 1137 -4138 -8893 -5221 -985 4155 1399 -2398 1308 125 -4725 -4727 -3350 -6516
5295 -6516 -4583 2806 5338 1867 4339 -3307 -7251 -5129 921 1428 2235 2997 569 2274 2153 5221
5279 5221 15658 14848 7209 9 -651 5391 8726 2358 8646 10787 14600 12853 8874 9494 6104
5264 6104 900 -5422 -7787 -12251 -10886 -12975 -11423 -533 -2064 -2830 -677 2245 8461 12166 10882
5249 10882 3542 860 3178 -6576 -11204 -6750 -10280 -12758 -5949 -4310 -1177 -5396 -3810 -838 4959
5234 4959 2297 3201 4790 6082 -3449 512 1437 1522 1369 -782 1621 5952 -2395 -1801 -1256 -2081 -2959
5217 -2959 830 847 -665 -1446 -4365 -10772 -11405 -6814 -3714 -4584 -925 3008 1377 5233 10258 9906
5201 9906 6183 2023 1024 1850 -3704 -755 4062 -55 -9605 -7997 -11224 -2973 -14 -1141 -1034 5103
5185 5103 5136 2795 -1586 -8988 -6952 238 863 4750 6168 6301 7400 14033 8565 1880 5810 6356
5169 6356 -2954 -2716 -10683 -6186 3295 368 -6152 -9466 -11083 -12939 -16549 -18241 -13287 -10436 -5872
5154 -5872 -3384 -7705 -7529 1317 4557 5534 2454 -437 -3364 -3833 -4821 -5423 -2865 -5819 -5532 -4464
5138 -4464 -4594 -281 -2481 -1975 963 6093 6716 6494 2843 -3238 -944 1635 -4536 -6860 -3413 -4836
5122 -4836 -9107 -16547 -18738 -14127 -8882 -7809 -9069 -6777 -230 2193 -2611 -375 -1666 -2703 -6415
5107 -6415 -4764 -6625 -6411 -7448 -10179 -7312 -6702 -6717 -12779 -7117 -5549 -7175 -8162 -9659 -5928 10
5091 10 5567 2575 -1696 -2509 -5118 -9150 -10629 -8300 -10689 -8089 -7341 -5224 -6499 -3158 -1006 -3466
5075 -3466 -13001 -19328 -17679 -16323 -13428 -9922 -8064 -6675 -2249 -2461 -2288 463 315 -2878 -5882 -2804
5059 -2804 -6084 -8415 -6301 -2149 -4815 -6326 -8443 -7511 -6972 -4302 -2855 -5101 -11570 -11783 -8416 -10127
5043 -10127 -7591 -2248 -5856 -5637 -4267 -10134 -8238 -4028 1457 3521 32 2419 3601 -3876 -6111
5028 -6111 -6963 -2086 -89 871 -4672 -9483 -4376 3923 289 -6001 -2000 2300 -2547 -4041 -827
5013 -827 1484 635 129 -2191 -4568 -485 743 -3780 -1896 4452 10695 9184 10146 5615 -1645 -5792
4997 -5792 -9063 -5650 -4358 -6265 -7017 -5146 -5404 -7277 -9937 -8503 -3864 -3775 -7041 -5878 -3919 2621
4981 2621 3021 2856 850 -627 879 6675 5385 736 -1890 -2388 -2132 -4753 -6217 -597 2184 651
4965 651 2163 4550 6993 1526 1432 -229 -2156 -431 1562 3194 5939 8361 2558 4595 4887 4028
4949 4028 293 -358 472 733 3497 151 -924 -3619 -1379 -1991 3039 3837 -2962 -7234 -2898 -7952
4933 -7952 -6956 -8325 -7914 -8878 -10463 -10863 -9978 -6876 -5872 -2289 -5903 -7986 -2783 -4014 1795 2649
4917 2649 -1932 -1609 -38 172 4122 9922 6358 3345 5789 4241 1868 2626 3631 1382 2060 3445
4901 3445 2938 -6559 -4470 1499 173 -6120 -6911 -4921 -3828 -2411 1443 1754 -8339 -7059 -145
4886 -145 3960 2472 510 -1419 383 8029 7515 4291 722 -2503 1446 -6301 -6130 -7150 -9364 -9431
4870 -9431 -5218 410 3198 2338 -158 -9850 -11237 -4222 5966 5588 3178 -1931 -5363 -7674 -2773
4855 -2773 6531 12310 1254 -8447 -8781 -3075 7391 1685 -6288 -5768 -6995 -6774 -2390 -429 -1036
4840 -1036 7632 4748 1275 -5354 -4019 -3541 -2191 6277 10487 9626 10730 10806 6879 3041 -6251 -9592
4824 -9592 -7704 -6009 -5652 -8204 -8590 -10721 -10525 -10416 -5149 6667 14103 16175 8977 7749 7945 -911
4808 -911 -5083 -5695 3552 15875 11898 10283 7785 6049 3303 555 -1518 4209 6529 8816 3763
4793 3763 6683 5790 4755 -4483 -3705 -4025 -4989 -1602 2719 4217 3456 1069 -3867 -6708 -4335 -2512
4777 -2512 -4224 -4753 -4555 -7188 -4734 -6074 -7791 -12656 -6596 3194 2104 6843 13313 17721 15017
4762 15017 12450 11052 2543 2525 3679 5199 5847 9711 16317 3763 -1332 2880 -951 -5203 -1286
4747 -1286 -4737 453 -2166 -2838 2451 6206 3600 -6591 -13380 -12920 -8602 -848 -4325 -5551 -7140
4732 -7140 -9667 -14750 -17428 -16849 -19894 -14439 -8905 -6602 -7557 -13190 -14781 -12913 -17294 -19078 -18286 -8576
4716 -8576 -5946 2130 11290 8053 2095 3387 3045 -2916 -3651 -2864 520 -2022 -2258 2838 7115 -15
4700 -15 -8538 -18656 -12443 -1988 -6327 -9561 -7485 -435 762 -199 1130 3979 6365 7516 10774
4685 10774 7975 225 -298 -39 313 387 8223 6919 4594 -344 1247 -1524 -11757 -2176 -255 -920
4669 -920 2205 -610 382 2741 1299 -3132 -2352 -4163 -6046 -11890 -14652 -8867 -905 -9910 -12511 -7724
4653 -7724 -3830 4869 4574 4738 -2594 -7686 -7578 -12628 -10285 -5530 -13025 -15131 -9685 -4528 -3926 836
4637 836 1308 -1756 1216 2823 1460 3580 4624 3285 2246 -3124 -5911 -2497 3741 4933 -433
4622 -433 7154 7336 3935 1679 3662 -4609 -12025 -14127 -11171 -8830 -7232 -9222 -7616 -13130 -8043
4607 -8043 1566 5281 -3291 -8606 -8785 -7395 -6596 -6960 -4561 -2747 -79 2065 -1032 479 -2771 -5416
4591 -5416 -14901 -15240 -12217 -10737 -12408 -15430 -15003 -8825 -1385 -1472 -11757 -14155 -15236 -12898 -8790 897
4575 897 -1691 -10763 -14671 -9391 -4667 -1561 -264 4146 4454 3147 -2315 3701 3638 3483 7099 11028
4559 11028 10265 12783 11466 1278 -5564 -4790 -4478 -4828 -3320 7533 6192 -886 -7118 -5051 -4755
4544 -4755 -3206 -5341 -2142 2289 2212 -2214 2230 -62 -693 -625 1834 1486 -6011 -6619 -1084 -2386 1752
4527 1752 9975 7591 725 2753 6989 3018 -2572 -2199 -2869 -3228 4027 -495 1830 5329 5572 7793
4511 7793 13271 16726 9970 -2720 -11444 -9305 -6451 -8767 -12106 -8242 -2605 2538 -451 -6744 -5558
4496 -5558 -2825 -6771 -6173 -4540 -6987 -5635 -4477 44 -5744 -3919 -773 -3916 -10057 -10274 -6381
4481 -6381 -4690 -1281 -4322 -3485 -3758 -1239 2518 3311 7632 12341 5665 3169 2913 2893 -3332 -7453
4465 -7453 -2031 -7077 -6287 -6842 -9315 -13652 -3928 3527 2749 1805 689 -803 -3977 -7667 -7341 -10035
4449 -10035 -5048 -2435 -4743 -1132 -1138 -351 -916 -4254 -8894 -7423 -92 2701 2426 -4788 -2306 919
4433 919 3446 7039 2887 2855 1874 4699 1862 97 -2287 -1138 4693 2997 582 -529 3475 3432
4417 3432 -1344 -3134 -1650 1077 7819 7019 4533 1394 1318 4921 10728 7507 3274 5652 13208 7386
4401 7386 -134 -2445 -2030 -1765 3554 5002 3155 -3609 759 4080 9081 6861 5475 -1441 -4525
4386 -4525 -6569 -7728 -2711 968 4639 2726 9632 4917 511 2718 2807 -1599 1040 -1798 -4768
4371 -4768 -6903 -10723 -10014 -8235 1975 1101 1532 462 -90 -4532 -8547 -4789 -10352 -9873 -6972 -8165
4355 -8165 -7277 -7096 -9193 -10451 -7889 -10731 -10874 -5550 -3979 2052 3581 699 -5698 -11973 -13155 -12859
4339 -12859 -12050 -9427 -8730 -7023 -1169 10673 17406 16658 11449 7180 3004 3012 6589 6756 6625 9274
4323 9274 9096 606 -7268 -6285 4361 4264 160 -2152 -1788 -615 480 8095 5788 2661 3115 -576
4307 -576 -1365 3466 -6979 -14179 -14102 -10057 -5555 -7031 -5682 -2388 -9965 -11277 -9547 -8703 -5595 -8061
4291 -8061 -4364 -8015 -4668 -8240 -10343 -7583 2119 5927 580 -2533 -1322 3639 3552 379 1253 8744
4275 8744 4860 -4144 -10172 -6586 107 4325 9361 5175 3252 5091 -954 -6347 -12083 -6031 -3509
4260 -3509 -1155 -432 1344 12747 17019 13580 276 -7512 -4620 -3367 -9020 -5500 -3654 -6744 -6987
4245 -6987 -4019 -6746 -9185 -13013 -5384 1324 -3500 -15832 -18520 -10926 -8337 -4335 -2093 -617 -5644
4230 -5644 -11658 -16716 -17160 -14229 -8613 -2660 -3972 -10457 -9522 -7529 -5307 -5368 1899 1381 -7590 -8011
4214 -8011 -10345 -4189 1063 -718 -3057 -2423 -1660 -2117 -3386 -8715 -2653 -5654 -12749 -12437 -6280 -5374
4198 -5374 -7636 -9993 -8846 -3169 6705 9774 6745 2946 915 6788 3701 4318 2918 1894 1629
4183 1629 6435 1340 -6451 -10949 -7465 1457 -458 -2034 -4668 -1639 -3090 123 -5486 -4265 74
4168 74 -3749 -2085 2013 2032 -11396 -14326 -9774 -9883 -14047 -13239 -14503 -15930 -10100 -2509 -1051 -1187
4152 -1187 -2554 -7600 -16597 -7513 -2215 247 -1755 -1536 -2569 1046 574 -2457 -914 -1592 -7079 -366
4136 -366 1374 -1169 -2701 -1662 -2959 -7975 -11030 -9873 -9560 -7588 -7821 -8965 -5775 21 1352 -2644
4120 -2644 -2140 2370 5395 6417 -2999 -3292 -2647 -9 -2030 -6586 -1114 -1540 1525 124 839 -3870
4104 -3870 -6875 -10443 -9764 -180 -1325 4403 -1899 -4571 -4155 588 5655 1033 -8840 -7950 -6115 -2764
4088 -2764 -1406 410 6655 -1525 4879 8198 6555 4748 1777 -3196 -2623 -4105 -5049 508 4418
4073 4418 6901 3034 -2694 -3410 -2050 -5564 -11075 -16077 -14623 -10539 -6406 -10013 -11197 -5688 -5380
4058 -5380 -11416 -10552 -6511 -5331 -3260 2170 1129 2008 -577 478 -3773 231 -41 -403 -762 -1637
4042 -1637 -300 10495 12167 12574 13543 8998 3542 -1895 -7252 -9808 -13836 -7896 -8193 1119 7876
4027 7876 12888 14927 11584 11070 4140 -3502 -7037 -8907 -3673 -9871 -12885 -16007 -9885 -11461 -19066
4012 -19066 -12211 -7245 -7632 -10676 -7722 -2925 -5850 -3154 4410 -1373 -12802 -11965 -6308 -8796 -7469
3997 -7469 -6383 -778 2187 2462 -1577 -4263 391 10009 20524 13398 2769 188 -7673 -10660 -11809
3982 -11809 -8488 -8359 -2978 1039 -2603 -1502 699 4004 2194 287 2369 4169 4176 2686 5235 9813
3966 9813 9833 5801 -2547 -3478 1419 2915 5284 3897 7776 10274 6769 -1804 3614 10270 13636 13054
3950 13054 7244 -399 -6341 -14631 -9970 -3219 -5132 -3729 4496 7684 12967 13633 2757 -43 2157
3935 2157 1660 375 1977 6044 4607 8508 6590 576 -2190 -1262 -2018 -2494 -1214 -1174 2459 854
3919 854 -422 -5821 -8040 -17476 -13290 -6075 -6025 -507 3155 -1562 -6093 -8377 -8552 -4569 -9617 -14950
3903 -14950 -10571 -3666 -1581 -1016 2880 1392 836 -9786 -3875 -3498 -10315 -9791 -13878 -12416 -4302
3888 -4302 2148 7478 9480 8082 5827 8130 6631 4034 2365 797 5413 8098 4977 7319 7794
3873 7794 12230 20478 14767 9617 6221 5198 7178 2529 -2498 44 2578 -2678 2062 7207 2128
3858 2128 -2005 -1703 2787 5608 2963 -3925 -7092 -7680 905 7151 -2815 -14222 -13028 -3646 -5346
3843 -5346 -3855 -386 -4805 1225 6621 4091 3165 -5286 -14225 -16422 -9219 -3121 1369 -4094 402
3828 402 -1025 -5099 -5216 -6208 -6322 -4838 -3732 4 -2906 -3351 2555 641 -1054 -2118 -4963 -12879
3812 -12879 -16085 -8034 -2009 7627 6690 8498 10340 5202 983 -1978 -4652 -12795 -9882 -6410 -6097
3797 -6097 -4498 -4125 -9072 -9944 -4142 -1341 -2005 -2407 -2521 1611 3899 6716 3878 735 5912 2798
3781 2798 1902 2075 -610 -5048 -3223 -9384 -4206 7249 8682 8208 8542 10782 3860 2430 2010 3360
3765 3360 626 -1540 1376 6894 11029 10786 7591 9243 3780 -8910 -11921 -13336 -5730 6759 10805
3750 10805 42 -4059 -4665 -5513 -3855 -3942 -4847 -3854 -6033 -5046 -9445 -11583 -4092 3612 5839 691
3734 691 -6008 -5632 -4251 -7362 -3237 -154 164 3228 4536 2020 2154 -1467 -7043 -9002 -207 -1686
3718 -1686 -10241 -13136 -14999 -14116 -11355 -7040 -7073 -5799 -3 -2650 1925 -657 -4219 -6109 -9618 -7810
3702 -7810 -6690 -8942 -13340 -9638 -479 -4595 -8245 -9649 -4476 -5605 -7751 243 4706 -733 -1560
3687 -1560 -2345 7514 8440 8638 4621 1126 -1444 822 -945 -4101 -8045 -8258 -670 8448 12488 11209
3671 11209 10568 15918 7548 2608 -3359 -5857 -2835 1475 -2429 -7509 -5028 -170 -514 -2830 -7449
3656 -7449 -11072 -8798 -5311 -3075 -747 -4732 -5845 2787 -362 -6163 -7713 -7216 -14692 -13352 -12077
3641 -12077 -11865 -5118 -3677 -3283 629 6757 3859 -662 439 -5467 -12726 -10108 -5779 473 3648
3626 3648 696 -334 -895 891 -3247 -4844 -3575 -260 -350 -2584 -2493 -2996 1629 2990 5385 10819
3610 10819 11363 1584 -1302 -9282 -17229 -9575 -1615 -1449 3101 6028 1276 4194 3516 5935 6244 12786
3594 12786 11328 8898 290 -8604 -8692 -13784 -10631 1183 10883 8027 3524 8639 4802 8206 10210
3579 10210 9094 5511 8098 1265 -1021 -4679 -6743 -2912 -3174 -4149 -3827 -129 340 395 -2364 1817
3563 1817 8109 9355 7640 12183 16073 15650 8307 -589 -1871 4174 4570 -683 -4331 -1011 -986 -6782
3547 -6782 -6144 -1192 -3024 100 -4824 -6921 -9326 -4910 -4801 -8964 -6714 -7882 -8031 -10505 -6881 2328
3531 2328 1375 -2501 -7384 -6249 -2659 -3934 -2608 -5006 -5507 -8543 -8797 -2603 -3723 -7066 -5908 -3407
3515 -3407 -7086 -4504 -1837 897 2201 2939 266 -1653 -6907 -4962 -1991 2110 -1527 -9734 -9183
3500 -9183 -7532 -7803 -1761 496 -2571 -2867 199 -1146 2194 2276 872 3594 6371 10056 10157 9368
3484 9368 2484 292 -1286 1203 4213 4996 7637 1510 -6872 -9614 -9276 -5366 -127 971 -2008
3469 -2008 -1214 1382 6806 2369 -2389 -9659 -8865 -3282 -3670 -3909 81 5634 266 -3874 81 6911
3453 6911 4047 1299 -5005 -5056 -1169 2851 7851 10455 3293 -9034 -9212 -4410 660 2257 774
3438 774 816 4577 -6039 -5035 -4532 -10831 -13802 -10733 -12634 -4999 2036 6439 2517 -3167 6354 8888
3422 8888 8122 1787 -12368 -19318 -12857 -8225 -7139 -11464 -7864 -11640 -10358 -9305 -4370 -2999 -2911
3407 -2911 -4048 -1389 6815 4211 -3724 -4293 550 2760 5481 4551 -637 1403 7487 4673 -1726
3392 -1726 -2003 -10091 -7441 -3388 -2602 -10434 -9695 -7909 -6425 -970 -225 -1833 2598 7295 4627 4407
3376 4407 3889 3219 2387 -412 -2649 -3600 -3558 -3873 -10128 -9714 -190 2643 1357 -7504 -8294 1564 5273
3359 5273 -3725 -8341 -8786 -7147 -3218 -5656 -6061 -5695 -6314 -3239 -2443 -3091 -11964 -8880 -1392 2401
3343 2401 -3477 -5309 2079 -1393 6929 17353 4100 -499 -796 -3916 20 3807 5837 1515 -2465
3328 -2465 -4234 -3661 -2341 -1660 -1561 2094 2996 3904 7225 6601 9791 15877 13612 10144 5288 6474 -1879
3311 -1879 -3846 -436 1510 3090 3942 2570 -2959 -1389 4507 -123 -5792 -5619 -6084 -6525 -2615 3140
3295 3140 4868 -1762 -12003 -10229 -1896 5507 3744 -7238 -7123 -3437 323 -900 2949 3408 851
3280 851 -1670 -8467 -1721 9888 12234 15876 11405 5406 3405 5457 739 2744 7601 969 -1299
3265 -1299 -575 5355 2707 -2003 -8201 -10968 -8715 -5840 -5626 -6451 -7810 480 7749 10194 9005 2916
3249 2916 -1841 -1526 644 -4030 -1103 4588 2573 8944 8590 5670 2856 -5206 -7362 1899 761
3234 761 -7426 -16648 -16536 -13640 -4921 -3704 -5722 -3715 -7063 -6414 -6594 -11993 -7600 1474 8194 4679
3218 4679 4187 3178 5049 15150 18843 17283 11031 3823 -3183 -818 6347 8017 3266 4228 4885
3203 4885 -1482 -9555 -13076 -13824 -7503 713 3847 3341 4439 7335 6644 1186 4742 5922 9396 4555
3187 4555 4081 6848 4797 1746 -707 3686 2580 8047 8658 9649 3254 123 -1048 2789 3990 2075
3171 2075 1980 -2540 890 1755 1275 -3867 -3820 -4317 -3597 4503 9184 3615 -3021 -6309 -7761 -5906 -2732
3154 -2732 -4495 -6089 -11789 -11085 -4197 -3665 -8486 -1254 -3294 -2323 -725 -7146 -14091 -9180 -9043 -9518
3138 -9518 -1874 8040 10388 10086 3597 -4714 153 1178 2084 -10363 -12274 -11050 -7285 -3175 -2807
3123 -2807 2060 8111 12530 7631 5029 4135 106 -3310 -3936 -3674 -783 -2491 -7594 -4203 612 -7504
3107 -7504 -10376 -3783 8026 9573 4862 2119 481 -11 -182 -6043 62 4011 -3913 -423 -109
3092 -109 -6591 -5557 -4568 -2986 -86 812 3551 6455 5357 1990 4436 4315 1969 -2729 -1871 -3242
3076 -3242 -5193 -225 3103 -1626 -5308 -5361 1643 8477 5791 9590 6502 7600 2049 -3869 -3106 1765
3060 1765 6443 5336 -75 5100 6830 4495 -1334 -1646 -1012 -6176 -6315 -3921 1757 6912 10338 8592
3044 8592 5590 6378 4349 2750 2035 302 -2341 -9838 -9180 -2273 -368 3959 7169 4464 2868 4461
3028 4461 2620 -1494 -5169 -4570 -3118 3890 1376 -2964 -7124 -1544 -3522 -9586 -9597 -10628 -10546 -10240
3012 -10240 -5367 -8823 -1863 1528 -1892 -5835 -7321 -1099 1575 -5626 -6852 2065 616 -4403 -3987
2997 -3987 4119 909 3789 10507 6993 5662 8978 8710 10124 8214 214 2331 5234 762 -2344
2982 -2344 -3131 3025 11943 8418 618 -2039 327 -3932 -6658 -3064 -3126 -1080 -6488 -10382 -9644 -8509
2966 -8509 -3883 -9389 -7597 4022 3719 557 3427 5397 3224 243 -1808 -2835 -1760 3109 9825
2951 9825 7894 5033 2862 2369 3845 -1485 -4921 24 2837 1079 -2584 -1476 4706 6633 8105
2936 8105 2863 -4367 -6816 -4278 -6878 -12440 -3594 5801 2585 1591 6962 7672 3259 4379 6421
2921 6421 6814 1613 -1741 -7671 -8368 -4354 -3062 -567 -4224 -7390 -758 247 -5300 -3314 -2274
2906 -2274 -357 2455 5835 11479 9975 6389 381 -2770 -5370 -7261 -239 3600 -606 -2915 -5709
2891 -5709 -3596 -1873 -8380 -3925 2736 -63 1729 4019 1031 -3226 -4900 -376 4067 -2352 -5712
2876 -5712 -2856 -2453 -592 2804 3571 7766 9735 3438 532 -272 3222 9517 4505 736 1309 5300
2860 5300 11084 6225 6178 12295 9025 6682 4258 -718 -5832 -7565 -6129 -7967 -4972 -6683 -5258
2845 -5258 1327 40 -5303 -2330 -60 -5647 -6972 -1666 -552 2837 -1746 -4561 -275 5154 5142
2830 5142 7330 8774 1407 -8173 -7097 -6096 -10143 -6864 -3458 -5763 -1401 3021 3634 -1560 -999
2815 -999 4641 6433 7780 6253 7141 3624 -3291 -282 3355 877 -2078 -4637 -6198 -7403 -10037
2800 -10037 -5313 -5039 -4842 -2538 4752 10632 12767 14800 11686 5037 9161 8431 1004 -8761 -15632
2785 -15632 -13326 -13681 -11679 -5774 2384 4076 461 -4632 -8262 -6239 -3673 1120 8072 8277 5979
2770 5979 -904 -3797 -8119 -11111 -8505 -2376 -3558 -4794 -10226 -7461 -3671 -626 -109 -5928 -6687
2755 -6687 -10552 -18239 -14013 749 5967 8360 6779 198 642 2508 1869 3509 3509 475 2743 4430
2739 4430 -6156 -15405 -3873 1833 2426 2726 3114 1309 2505 -182 3557 3170 -4830 -11653 -9143
2724 -9143 -9542 -9209 -10141 -12542 -6796 1304 1068 -775 -319 5653 2683 1448 -2055 1100 -3211 -6640
2708 -6640 -3775 -2771 -2947 -2526 -6079 -11498 -11255 -3261 -1406 -3254 -6258 -12356 -22396 -23460 -24589
2693 -24589 -23678 -9510 1782 3442 -4236 -11359 -9671 -13409 -9118 -2493 387 2646 -2268 -1598 -4707
2678 -4707 -4916 722 -26 -5819 -10296 -3405 -817 4159 5809 3305 -2909 -2927 357 5837 8070 12132
2662 12132 8603 6369 2729 5773 10681 6031 3127 496 -5608 -12741 -3397 1647 2484 -4557 -6957
2647 -6957 1008 -1219 -4557 -1895 -2654 -1482 3108 1140 -3444 -2708 -1746 -1291 -1857 327 -2422 -5821
2631 -5821 -14357 -11493 -6017 -136 213 1485 1719 -4038 -3483 4227 2998 -6566 -6046 6638 9345 3874
2615 3874 766 -360 3521 8383 9259 3471 2559 -1761 -6743 -11583 -16280 -11913 -8893 -1450 8606
2600 8606 1975 1165 3880 5256 8832 11381 7930 3061 2916 6478 6798 5574 2776 -2697 2080 6285
2584 6285 7228 4559 3230 4282 3582 5350 9051 11986 483 1760 1638 -504 -1334 1723 7304 6713
2568 6713 10051 6366 1324 -983 408 8478 6258 -594 2744 11259 6348 -1492 -14058 -11515 -8630
2553 -8630 -1697 4916 107 -7009 -7374 -4683 101 1278 2230 3444 4239 6563 12604 9776 1422 -3580
2537 -3580 -1699 5209 6552 7635 7894 -33 3541 9036 9461 9692 -539 -4983 -552 753 1555 4746
2521 4746 -517 -5479 -11361 -8374 4251 9131 1544 445 -4710 -4049 -1226 -308 -980 -4341 -1833
2506 -1833 2949 4154 567 2429 5741 5615 4406 -3336 -6463 -2991 -4567 -4398 -5732 -6347 -5296 -6989
2490 -6989 -3559 -5513 -2366 -3936 -11657 -7141 -2559 -1355 -3524 -2197 2754 2831 -1049 8724 16301
2475 16301 12157 2396 -2193 -6810 -4875 -1658 -10255 -8178 -7181 -9191 -6117 -373 2649 -357 -3805
2460 -3805 -758 -113 453 2989 4345 -3472 -5170 -1046 3866 3460 -2541 -2983 -4435 -1406 3376 6446
2444 6446 1388 340 -2194 -5581 -745 5862 3142 5058 2843 -425 -664 -4624 -2566 2564 4731
2429 4731 3483 -5000 -10913 -7074 -3646 2546 -3858 -1808 -4170 -5384 -1276 -2559 -1472 -4553 -5447
2414 -5447 -6354 -3643 -4997 -3072 1451 1090 3717 12843 14265 2986 -2299 -2143 3864 4258 8349 6254
2398 6254 5759 9542 385 -5140 889 4538 9038 6092 9101 6704 5167 4443 4160 3893 2969 1452
2382 1452 10828 11463 9667 5189 6626 4908 7403 11539 14218 4716 -2774 -4600 -11641 -11944 -10021
2367 -10021 -2696 -3461 -1300 -990 -517 8131 6088 6307 7170 5679 4754 10874 8616 -164 472 11328
2351 11328 12285 9668 8217 3729 3437 1639 -2224 -6904 -782 13935 12177 5167 5122 6898 2330
2336 2330 640 3694 4975 -764 -490 -685 -3147 229 3639 6176 5111 6815 11375 3077 2398 5788
2320 5788 1697 1979 4363 2652 3282 -355 278 7301 12816 5638 2644 4863 1348 1789 2079 -7535
2304 -7535 -13565 -11069 -4973 -2120 5621 -2191 -9147 -6503 -4484 4062 4591 3549 5092 -793 -747 -1882
2288 -1882 377 2397 468 -145 3331 -715 -5275 288 1788 -347 -4782 -5790 -10735 -10516 -1461
2273 -1461 6694 3318 2008 5145 1257 -3091 -2401 -2933 3649 3550 -2334 -4108 3138 8250 655 -4725
2257 -4725 -1519 3378 -3252 -5692 -9959 -5615 -133 7950 5947 -182 -4239 -3887 1366 -3105 -6762
2242 -6762 -10684 -8587 -6326 -11472 -11716 -13048 -8445 -10961 -7667 -3054 -5184 947 6895 3390 -1792
2227 -1792 -2821 1608 -2888 -5035 282 6178 6032 -54 -1559 -3929 -10561 -13229 -8311 -5350 -335
2212 -335 5955 938 179 -4573 -7360 -8087 -6994 -1696 3166 4072 4311 7680 8536 5091 -1549 5366
2196 5366 5638 -2756 -6414 -7818 -7180 -10174 -3919 -751 -122 1468 2346 1549 1227 -4745 -6868 -8988
2180 -8988 -3037 4278 4332 389 6490 5333 1013 779 -26 2220 -355 -8576 -12278 -12113 -10236 -6608
2164 -6608 -3180 606 808 5151 6782 -695 759 -5147 -4448 -422 183 3342 2020 -312 1234 2310
2148 2310 5018 5925 2929 3255 5102 6631 3047 -3246 -8022 -3602 -1477 -2952 -7179 -11080 -10350 -3871
2132 -3871 -7233 -10720 -10896 -6225 -556 3259 6689 1526 2245 -1203 -6948 -10145 -2648 4701 10007
2117 10007 18552 17835 13133 13363 13038 14536 5323 1258 4134 3355 -1843 -7437 -3264 4684 4338 3922
2101 3922 -1507 -9510 -13435 -16353 -13086 -4278 -4928 -6942 -3408 5246 11259 8632 1628 793 788 905
2085 905 7786 9500 1891 5237 4414 6321 4798 4188 991 8578 13314 14686 11441 8055 12756 13220
2069 13220 15042 8312 1254 390 785 4379 8531 8155 7675 8435 10519 10813 8185 5810 -1352 -854
2053 -854 -153 5426 9912 11417 8961 5307 -803 -607 -658 416 -6089 -5583 1550 5046 2848 2400 3913
2036 3913 8854 2590 -6773 -7414 -4300 -3805 492 5958 5205 -813 -1713 9525 13902 10634 7110 5770
2020 5770 8563 8878 7605 9374 11343 5154 -2558 -8249 -7619 -2555 -885 -4125 -4723 -1719 8018 13932
2004 13932 13545 10896 10963 12429 3310 -5279 -6336 -4844 -3833 491 1349 -850 -661 116 1905 8994
1988 8994 14107 10249 6876 3925 1462 383 1083 2464 4425 621 -784 -4489 -2415 -8138 -1553
1973 -1553 5882 10129 4158 -10207 -8699 -4256 2943 -1274 -2470 -344 -711 978 1101 6686 3077
1958 3077 5195 5373 6483 3336 -1400 -4764 -1242 2364 8932 7102 6730 5306 -444 1342 3435
1943 3435 1291 -4598 -6830 -5274 -4224 381 4272 4097 3092 6261 8533 8245 -1608 -2198 -1396 4688
1927 4688 2304 2833 4557 4943 11374 10150 7066 9482 2079 3596 5764 7208 6736 9126 12611 15858
1911 15858 14848 9653 6779 9737 16925 12117 2390 1129 1193 -2916 -602 5431 7694 8262 4448
1896 4448 -1325 -2455 -9672 -5205 -2427 4911 4775 4410 7134 5085 13596 14222 10503 8676 8233 4498
1880 4498 -5278 -6276 -11001 -3808 5924 2813 -3980 -1032 5703 3132 5819 4833 9025 13680 15950
1865 15950 12232 9777 14818 16750 10554 3450 3263 -719 1843 7662 11710 9356 8957 7900 -3098
1850 -3098 -5029 -1157 1370 -423 -4644 -8830 1008 209 -376 -1538 1994 4866 3557 11165 13673
1835 13673 11559 9180 14189 12662 1127 1532 5437 11037 10147 11751 4133 137 -1230 -65 2079
1820 2079 2728 897 -698 -232 -2311 857 -27 -2904 450 -1408 -4370 -2219 6071 11627 13967 14733
1804 14733 9352 12380 13922 13286 13159 12137 9966 5479 -5169 -3549 6760 4848 -479 -1046 -3648
1789 -3648 -5096 -3398 -2233 3193 7037 9897 11215 10022 8432 8590 4838 8282 13513 12121 15073
1774 15073 12684 3999 -5497 -5695 -4336 4308 9530 9282 9693 2036 -2778 -4317 -8309 -5281 255
1759 255 2826 -897 3027 2691 104 657 -6172 -5142 7300 3587 -4295 -7532 -3247 1616 3052
1744 3052 4926 7149 4380 -34 -511 4884 13132 15144 17324 18287 15990 14550 11425 10455 5147 -614
1728 -614 -2936 -2346 1331 1249 -1368 -8070 -8269 -10133 -4185 -574 -1254 -1146 -2476 -1327 69 4793 -579
1711 -579 -1351 -138 6588 8243 8564 12236 8330 8950 16110 11231 10696 3175 -133 1366 4145 3472
1695 3472 -5034 -4465 4547 8828 10608 10073 12014 8325 7484 3575 -152 -4974 3302 6921 13779 15318
1679 15318 14156 5457 5685 -4152 -8809 -7687 -8839 -4287 -11747 -9811 -5373 -3211 1106 -499 -1428
1664 -1428 -3266 3319 12087 7797 5366 7917 4207 2297 2195 3921 -3955 -5983 -4513 -4828 -4228 -3289
1648 -3289 -7200 -4371 5318 5944 -2229 -4866 1839 7884 3392 -2554 -4249 -3101 2758 5757 2266
1633 2266 1791 -2994 -9084 -10026 -4647 938 3326 -3041 1669 -787 -3042 -5529 -6372 -6559 -7902 -7452
1617 -7452 -4779 3642 7390 6144 550 3666 7467 7774 8267 9874 6824 4948 1781 -56 39 -1322
1601 -1322 -771 549 7480 10660 12980 12327 12289 9620 2156 3899 7657 6395 2984 -658 -983 -2406
1585 -2406 -3434 1197 2734 -782 -7307 -7946 -11130 -12879 -14193 -10900 -2586 6975 9717 6625 3728
1570 3728 6748 4482 -1527 -3089 -3850 -3380 628 4867 8624 11013 11008 2087 -6757 -5692 1137 6732
1554 6732 5731 6468 3439 5100 5733 9237 8568 8276 2587 -3991 -10070 -6383 -2198 87 -2005 -4024
1538 -4024 -940 5525 11753 14561 8680 3425 6520 10759 11515 10730 11552 7634 4558 -7515 -3200
1523 -3200 5928 11810 17563 12025 8504 5963 3886 -485 -7249 -8762 235 282 -1103 -346 1543 4339
1507 4339 6679 -2472 -1771 2583 5441 2934 6352 9765 9037 8109 6423 546 2688 8008 12167 8791
1491 8791 5779 6315 4964 -546 3060 6442 5093 2628 386 -4335 991 2311 2461 4817 9231
1476 9231 13786 14081 8268 10162 13208 16015 14343 379 -5998 -3772 1402 22 -1510 -1020 -1440
1461 -1440 6468 13825 15114 8826 9594 13910 10704 9263 9458 6019 7570 6757 7663 6955 10580 10208
1445 10208 12868 5762 2827 1053 1675 5118 9123 6302 156 -437 -824 6907 10126 -965 -8372
1430 -8372 -1356 1683 5020 957 -3259 -1200 2483 -1313 4880 10125 10996 8265 4544 968 -4778
1415 -4778 -3249 -5535 724 -2393 -9537 -9170 -6197 -7179 -4648 -585 6528 6204 11195 7318 9909 5569
1399 5569 117 1350 2212 3454 8494 5681 7729 7662 6143 99 -2297 -5669 -7485 -5405 -5305 -3251
1383 -3251 -2888 -7706 -3039 6461 7477 1056 1828 7943 10382 12538 4287 1476 3772 5028 10099
1368 10099 4595 3681 1314 -47 5417 9248 5241 1519 -8636 -5409 -4779 -3693 -7790 -10233 -7014
1353 -7014 -8847 -9059 -10378 -10946 -8178 -9496 -5952 1605 4172 4738 8828 13468 14514 9446 5430 9057
1337 9057 6798 3785 9560 3843 -3133 -7234 -5914 -5064 -10121 -9207 -6886 -7037 -9359 -11100 -6975 -5517
1321 -5517 -5455 -4190 1498 4014 -55 5898 11251 7627 6421 3172 5941 6930 -449 -5593 -9457 -7462
1305 -7462 -573 100 -6503 -4817 -8298 -6658 -619 3207 7774 5352 677 -1319 -1900 -152 8358
1290 8358 1462 167 5432 3977 6222 8220 8293 7940 3319 -4237 -5427 -1119 -4847 -3385 -191 -632
1274 -632 -1519 -945 4123 2438 7130 10988 12026 11660 8620 6433 1768 1844 -4686 -5783 -8055 -8323 -6780
1257 -6780 -8897 -4931 -3829 -222 -2370 -4694 1814 8661 11328 6084 5084 7905 11941 13869 10815
1242 10815 6904 1689 -2106 -1042 4312 850 4166 4978 6874 4074 798 -76 -1630 -2623 -429
1227 -429 3587 -196 -3563 -4934 -5511 -5295 -3814 -42 4002 139 -4170 357 3579 2828 -334 -4129
1211 -4129 -4438 -1061 6903 10412 9048 8568 9353 6688 4831 815 2963 6883 8937 6306 12751 13340
1195 13340 5119 7015 3106 191 -5596 -2223 851 3007 1862 9808 7036 714 4754 11475 15397
1180 15397 12908 5951 2485 -2658 -6388 -7028 -7899 -2258 -4412 -9882 -12867 -9968 -12275 -8265 -2927
1165 -2927 -5729 -10411 -7176 -6151 -6804 -8762 -15264 -11880 -6885 -3570 -2562 -9030 -8965 -5998 -6369 -8994
1149 -8994 -8206 -7381 -7441 -8153 -6641 -3722 -1052 1210 5202 4976 7390 8508 8346 5945 4765 8399 8424
1132 8424 6051 229 6517 5188 -1567 -4232 -3439 -4448 1050 8325 8118 1669 -6565 -5031 -4044 -3557
1116 -3557 -7814 -6997 -12549 -10642 -8887 -3051 6127 11601 8892 10388 7026 3519 1530 2492 6223
1101 6223 6715 3270 4111 13767 9684 3635 6935 7125 7965 9847 5245 4618 11922 8449 1817 1005
1085 1005 -5233 -8558 -6821 -3423 -583 4653 3892 1122 -2848 9289 21462 16690 10804 9938 2259
1070 2259 1440 6633 10622 11771 5018 -1916 -6867 -3570 -1254 -1085 -2788 -4529 -3 2718 7107
1055 7107 4409 2108 1138 437 2800 3016 4027 -336 -1198 4137 3471 -640 -825 948 852 6028 4787
1038 4787 6798 9820 8819 3675 2440 9234 11896 8121 10329 14093 12241 10268 5470 3446 2373
1023 2373 1000 2917 1414 3416 -2659 -4398 1642 1349 -2429 -2065 5477 12236 10834 3887 1183
1008 1183 3168 10342 6736 3859 2863 3268 -3082 204 4881 3715 5421 3992 -5375 -2823 -2646 180
992 180 -2243 -5441 -6185 -2094 4156 3318 1209 2248 14465 17804 9691 4756 9844 5335 -3211 -9697
976 -9697 -9626 284 6280 4669 3205 6513 10398 13490 9505 10564 5115 -635 -5120 2836 16898
961 16898 18697 13609 13408 13225 5271 -54 -5443 1900 6805 4020 5758 5059 902 -2565 3114 4919
945 4919 -1913 -4823 -612 -4259 2017 9153 7778 4014 1280 915 2194 4566 5686 9221 6341
930 6341 2017 1167 3284 7377 2323 -1144 1657 3744 9221 11403 10662 5790 2986 6232 5699 6012
914 6012 4374 1373 -1722 -1338 2188 6908 13317 8925 7503 5060 7985 14493 8633 3530 131
899 131 -4346 -3445 -3614 -5496 1287 3068 7220 4053 3239 -2654 -4602 -1537 -2571 4280 7909 4967
883 4967 -3902 -16854 -6946 2073 9965 7851 8509 12138 7891 6573 7149 4398 -5920 -10304 -7266
868 -7266 -3982 -5080 -1878 -5462 -3537 -2766 2116 5961 9060 10810 9695 10481 4404 5745 3527 4786
852 4786 7920 9158 5288 -4395 -6512 -10706 -8836 -1262 280 1994 6689 8095 8543 3213 -4705
837 -4705 -1330 1155 -3328 -7512 -2280 -451 -2156 -4559 -11158 -9995 -4936 -5990 -8308 -10186 -10342
822 -10342 -4907 4931 14482 8465 1986 3301 10656 8433 7566 3911 2946 1063 -6429 -10781 -4526
807 -4526 1228 2964 4447 -282 -13328 -17721 -12024 -6193 2893 7869 6170 9004 10818 4125 2665
792 2665 -1636 -2929 717 4832 -2805 -1986 1851 3096 5800 3633 3008 1973 4057 7692 14453 13486
776 13486 11643 14490 17922 16220 14539 11528 3600 657 -987 -1999 1698 2731 -4481 -2340 -1346
761 -1346 -737 2364 1905 849 -3571 -7750 1783 9708 5077 1538 2467 5026 3931 7471 15030 15575
745 15575 18963 14730 9377 8253 10008 7862 7716 4736 8586 3565 -531 -4777 -10438 -11572 -5973
730 -5973 -2085 -6705 -4811 -5522 -1855 2516 3120 2422 10468 17191 14169 11139 9483 13662 7022 2146
714 2146 2129 3995 4149 4471 2451 -1782 -207 3591 2922 4604 11192 7795 13 -2277 1939 881
698 881 801 306 -1075 -1856 -1337 -950 1640 -2803 -8206 -10075 -10091 -4755 -14 -3565 -846 -5448 -4351
681 -4351 -6897 -4151 -174 2409 8 -3341 2498 6172 -866 -6598 -3641 3992 9728 14417 8331
666 8331 3855 2341 6036 4452 3512 3117 -7028 -2910 5973 7731 3276 845 -2478 -1538 -5878 -4652
650 -4652 -4437 -8302 -11285 -10099 -5709 -2841 -2996 594 3910 2091 161 1503 -3451 -3380 -3500 -5100
634 -5100 -2126 267 3811 7153 8950 5626 2191 -1529 -4667 -10048 -6243 -6412 -6864 -4434 3615 8455
618 8455 5770 -2532 -4328 -3051 -4756 -2276 2424 6495 4386 2062 2316 3461 3644 4755 2980 804
602 804 2253 12148 14468 14565 14381 9492 1307 -2955 6065 11044 17329 11117 7646 7939 3463 -846
586 -846 1685 8398 3907 -710 -5237 -6798 -3807 -3805 -2341 -2865 -5971 40 5551 8439 12627 9218
570 9218 1843 -2730 -10599 -11960 -13518 -10724 -3570 438 6609 3189 643 6146 41 -1602 -4602
555 -4602 -3757 -237 569 5954 1103 -2032 -1689 -4442 -1851 4786 8134 3807 3846 47 -2091 158
539 158 -2816 -820 2422 5529 2310 17 -4953 -4636 -3832 -4949 -6654 -6360 -14008 -15590 -9954 -6635
523 -6635 -4263 -4239 -642 1892 5907 4206 2824 1966 1095 -627 -4341 -2159 -3143 -8575 -6918 -4213
507 -4213 -6945 -4865 -1521 -5882 -12277 -15162 -13011 -9748 -5821 -4028 -1859 -1332 1094 9412 8723 4091
491 4091 6804 9116 4890 1597 1378 8081 10152 5999 3002 -4442 -7186 -6057 -6285 -1973 3672 2864
475 2864 7108 11652 5070 4225 1407 -4142 -8212 -5804 -10131 -9759 -4591 -9284 -10768 -13675 -15085 -12623
459 -12623 -12135 -10032 -4016 1315 -4633 -3436 2766 7719 1788 -2762 -1967 1566 1590 -2030 -243 -4161
443 -4161 -14857 -18395 -10701 -2326 -808 -5565 -7249 -5000 -5466 -5004 -2537 -5069 -6081 -3688 -7725
428 -7725 -4080 -3724 -2623 -1103 -448 -2415 -5652 -13155 -17926 -17352 -13181 -6002 -7231 -11034 -12181 -13388
412 -13388 -18680 -23123 -16772 -14202 -6730 -6771 -5195 -10047 -14145 -11516 -10818 -8346 -10853 -10004 -9125 -8619
396 -8619 -14404 -17300 -10689 -9244 -8624 -6873 -8814 -13914 -17679 -16376 -13124 -16471 -19195 -19767 -15487 -10308
380 -10308 -9486 -13829 -17286 -14665 -18322 -15385 -10873 -13690 -11190 -13300 -18070 -27515 -17779 -10385 -8450
365 -8450 -16434 -20285 -19318 -15939 -9975 -11292 -13677 -10506 -9153 -9959 -9950 -13358 -16009 -13235 -7868 -2260
349 -2260 876 -4697 -10627 -15423 -20470 -14751 -11792 -15606 -17540 -24278 -27490 -23662 -19364 -19474 -26633
334 -26633 -29927 -27677 -28724 -27727 -22597 -20607 -22303 -27261 -26436 -19433 -19412 -25902 -22191 -18463 -19274 -22288
318 -22288 -24142 -25464 -24080 -22234 -21155 -21832 -19342 -19249 -23210 -22747 -20600 -18321 -14875 -17401 -20644 -23541
302 -23541 -24746 -21878 -21031 -19462 -19270 -21151 -24340 -25641 -27786 -29203 -23238 -26714 -32092 -35490 -38027
287 -38027 -32456 -26589 -25108 -28145 -36051 -40683 -34934 -34778 -30238 -30457 -33343 -35156 -31638 -28932 -31624
272 -31624 -26358 -21786 -28306 -30333 -34268 -33072 -32337 -37983 -43006 -39119 -31539 -21996 -23055 -28449 -26774
257 -26774 -25976 -30103 -28745 -27617 -30343 -35461 -35990 -34644 -36795 -40182 -40839 -43187 -41674 -33567 -28509 -29836
241 -29836 -31999 -33622 -37497 -37912 -37674 -35354 -33292 -38057 -38655 -42464 -39130 -36141 -36087 -40151 -43468 -50988
225 -50988 -53745 -48670 -44679 -39481 -33460 -34258 -31426 -29889 -38151 -46400 -40461 -36782 -42238 -47229 -43207
210 -43207 -45410 -46255 -44167 -37489 -33781 -35929 -41620 -46176 -45528 -46971 -47014 -47577 -51030 -50656 -49943 -46950 -45223
193 -45223 -48597 -52856 -57967 -53690 -52140 -46403 -47498 -48425 -45386 -40985 -38564 -37837 -38930 -46729 -49651
178 -49651 -44530 -46682 -52124 -55908 -56448 -57795 -54789 -52728 -56954 -60934 -63431 -64282 -63042 -59150 -53762
163 -53762 -56302 -61874 -64208 -65392 -62204 -63182 -64040 -59389 -64770 -67134 -67893 -66770 -65799 -63741 -63911 -67545
147 -67545 -66717 -65158 -69555 -70747 -73397 -70365 -67077 -65001 -61234 -62075 -66728 -68662 -66756 -64756 -66394
132 -66394 -67170 -65832 -62534 -64483 -67915 -67097 -69926 -70540 -71575 -70479 -70967 -69777 -69951 -65402 -67069 -71893
116 -71893 -75223 -77254 -76848 -69710 -66495 -64645 -70689 -71842 -70030 -72508 -74327 -76032 -77242 -82325 -76850
101 -76850 -73036 -73618 -75367 -78506 -78672 -76650 -73207 -75163 -78123 -83365 -84863 -86986 -90721 -89712 -85132
86 -85132 -81954 -81052 -81846 -83110 -83082 -87274 -88999 -88328 -82946 -75793 -77140 -76826 -78876 -81399 -79583 -80140 -82556
69 -82556 -86474 -89722 -89379 -83724 -83867 -85353 -88902 -91873 -91348 -94587 -100778 -99311 -98200 -97565 -90997 -88168
53 -88168 -90399 -93124 -95804 -93159 -89289 -89715 -91889 -93656 -98194 -98185 -98206 -95953 -92941 -92696 -95558 -97760 -95311
36 -95311 -92878 -92086 -92409 -95721 -99119 -99258 -101479 -102507 -107952 -108738 -107738 -106632 -104642 -104825 -99820 -96506
20 -96506 -95605 -98207 -100549 -106055 -108338 -109148 -111161 -106023 -105806 -105722 -104333 -107715 -108497 -108483 -107905 -106851 -114915
3 -114915 -117788 -116825 -114700
0 -114700
$$ Imaginary data points
##PAGE= N=2
##DATA TABLE= (X++(I..I)), XYDATA
32767 42274 41352 46380 51133 53724 55056 49180 48001 52325 53503 56407 52341 48717 51996 56879 55990
32752 55990 52913 50925 54862 62257 60242 54992 56669 59097 59916 62775 60684 62142 60490 56342 55640
32737 55640 62796 64466 66473 69423 71469 72529 70220 67825 65879 64822 64591 65489 65858 69066 77974
32722 77974 82834 80262 80986 80119 81646 82880 82665 80636 79689 82184 77134 80463 84645 91245 87639
32707 87639 78844 74034 78973 84037 87242 82018 80916 84946 88706 94710 94191 93164 97288 97018 90671
32692 90671 88852 92318 93482 94502 96507 99520 97186 97636 102646 110842 110851 109167 107387 106373 108853
32677 108853 108644 99897 99000 100839 99847 100538 102369 108294 111735 112686 110422 114298 114534 111829 116978 121376
32661 121376 122284 117294 110048 113072 114909 114851 116685 117583 115069 113085 116166 118697 120098 120028 119917 123583
32645 123583 119730 123703 126251 117432 113208 118950 121782 123387 126750 125616 125368 125274 128448 133546 137765
32630 137765 136118 136239 141146 141486 141601 141578 141846 143084 141006 139821 138272 139096 144169 146203 145724 143579
32614 143579 145082 147483 151908 147984 145503 145925 142872 141861 143152 143093 148823 156008 154542 148481 146409
32599 146409 147947 157154 155213 149994 150341 151607 153462 148476 149702 155338 154251 156044 160648 168395
32585 168395 173836 173729 169207 171433 172352 169308 167073 166407 166193 160251 160997 166917 167816 169990 167799 162086
32569 162086 160870 161873 169443 174391 180831 172023 168959 171329 172049 165955 159079 160154 166772 172931
32555 172931 174122 171895 170899 167912 173009 176922 178372 185957 188864 189208 186993 188371 184672 183309 185651
32540 185651 184090 182695 183465 183134 177196 177059 180310 183764 180404 184224 185486 187410 189961 194713 198551
32525 198551 193951 194308 193384 195771 196481 198402 198360 189774 185715 187551 191705 194138 207312 209845 209554
32510 209554 210947 200916 193774 191176 192209 193043 188827 193854 197159 205466 208476 208652 206026 202340
32496 202340 197636 194508 194275 200067 205664 206658 203572 206971 205942 205068 205458 211592 209660 208715 215531
32481 215531 217463 217844 214009 211751 215680 214088 212017 210360 208566 212005 215040 218108 218119 214468 212324
32466 212324 211670 211881 215710 216981 213415 211681 209629 206306 206038 209266 207364 203961 202333 207507 211836
32451 211836 212932 217522 225226 221465 218511 217229 215380 216297 219845 225943 220016 215349 217963 218769 222776
32436 222776 224058 227775 228123 226991 222509 215445 219203 230153 233303 232208 229010 222831 226169 225982
32422 225982 224118 222190 221787 223516 223987 219861 225131 232613 231236 236714 241957 247150 243472 240921 244462
32407 244462 238889 235510 232643 230766 237728 246329 244945 243404 244642 248553 246125 235454 236787 236806
32393 236806 234122 243374 247207 246757 243229 240594 243913 243948 244937 235564 231759 238002 244733 242447 241211
32378 241211 243705 242859 244746 244503 244689 249762 248810 248541 246133 246239 249527 249936 245971 246113 241614 242014
32362 242014 248811 250478 257813 251951 249247 243612 246550 243737 240701 242608 239196 241502 248863 251827
32348 251827 251493 242398 235249 237557 243342 246274 246260 241753 239602 245158 256452 254664 255206 253191 247754
32333 247754 243066 245546 246729 246514 246572 244627 248249 252709 249480 248750 248805 249462 244654 246831 246424 244064
32317 244064 250168 247390 245638 254882 262077 259609 250487 248137 247755 245221 247776 251601 255689 253590
32303 253590 250403 250528 256493 253735 252188 252609 255524 257846 262218 262063 259632 264421 261146 255119 251559
32288 251559 255689 259207 257403 256994 260714 265215 254739 249239 253368 257438 260323 256384 256452 260461 264438
32273 264438 261478 264604 260484 256442 255956 258172 262718 263870 259969 260712 261014 264469 259887 252811 253544
32258 253544 251045 256556 261460 263493 262112 258223 252773 254245 256965 256001 255778 257732 258074 258590 266427
32243 266427 263621 257121 258848 261684 266406 266259 258924 256561 255216 253000 246511 248851 258377 257440 255078
32228 255078 260054 251042 244265 249880 256470 262561 260762 260222 259681 259039 259505 264650 269394 270757 268011
32213 268011 271194 275577 273836 273481 269796 262745 264989 267907 268915 273628 269261 263641 259918 256139
32199 256139 253619 248609 258050 270761 276467 271355 264737 262034 262205 264379 262162 255481 261177 264562
32185 264562 265796 264573 257362 255870 258599 262236 264662 260089 260490 264501 263297 265396 262968 263142 258642
32170 258642 257696 264238 267341 268616 268498 269281 268955 269420 273567 281989 285428 284776 280982 273863 268738 265353
32154 265353 264020 262319 266970 265938 265639 269024 264637 265334 270274 269215 268520 264410 259507 257898 255950
32139 255950 263482 265849 265377 263204 263013 268246 265763 266390 264969 267185 270397 268000 273056 278707 275362
32124 275362 274184 276993 282181 281455 276688 280318 271686 274161 275854 272783 279878 280622 279410 280199 276901
32109 276901 275717 275464 275978 273584 274005 275069 279996 275188 269371 267148 268213 268295 268231 267947 269904 264259
32093 264259 259762 262664 264094 266415 269783 270254 265740 268031 268515 267191 272487 275101 272037 266135 268267
32078 268267 265962 264862 266535 269577 262352 258989 255536 259115 264311 258593 259529 262133 262761 266934 273285
32063 273285 269272 270498 273866 271912 267051 265413 266353 268165 273239 268818 268072 271854 266795 262671 261741
32048 261741 262021 263930 261354 261539 266063 267754 270602 272803 276002 278646 282419 279536 268242 266123
32034 266123 266045 265083 266700 265641 265481 265440 269314 270126 272859 277081 271567 280576 277548 272967 278514 278493
32018 278493 274360 273599 267391 262499 260062 255479 259015 263734 262030 262505 264892 264712 262893 266299 262906
32003 262906 263450 263459 264870 264418 265679 263242 263380 261009 264592 268137 269978 265855 262925 255270 257290 263598
31987 263598 264551 262664 264136 263313 260115 265292 267201 274066 277696 275740 273917 269190 265995 268547 270055
31972 270055 271779 274556 270960 268865 269710 267334 267703 268525 271425 281167 287951 290907 284795 276620 275048
31957 275048 276367 278151 273946 267240 262458 263352 270834 270054 259733 261225 268002 266895 263628 266742
31943 266742 277153 278202 276500 275887 271194 268670 268256 264566 267691 268729 268083 269296 268084 268086 267910 265651
31927 265651 258521 259429 268660 274923 282717 285416 285513 276827 276104 281708 275601 274942 275906 279658 276988 270162
31911 270162 267040 263625 269306 279754 280667 274933 269299 270304 272539 274586 273879 273178 271997 270845 269420
31896 269420 268422 268959 266967 271524 268016 268029 274129 276242 273429 269870 270841 270865 275944 277855 284182 285122
31880 285122 279469 277933 270348 265799 268240 275403 278370 283003 283867 280415 280293 280304 273658 272789 275919
31865 275919 275543 275654 275009 276927 279261 279645 275293 272740 273902 273417 273723 271847 278315 271233 260701
31850 260701 259817 263908 269385 273442 274728 277917 274017 271788 266275 261287 263724 267834 268655 265287 264421
31835 264421 275904 275511 274739 276249 279404 276168 271832 272329 272028 270868 271568 276085 276780 266682 265719
31820 265719 264690 268269 273422 276179 278669 279378 281680 283583 275416 273411 264880 272545 276553 270805
31806 270805 273569 281494 285334 278157 269263 266793 263911 266422 266828 266445 266766 270500 269030 271953 275641
31791 275641 268758 268797 267260 268872 277733 274869 277323 281448 278146 273655 272603 278709 279705 269255 259301
31776 259301 262471 260697 260530 267325 272792 276929 278186 272716 267715 269846 266090 264170 270135 275535
31762 275535 275164 273451 275117 276467 272978 270393 275017 276969 276216 273876 269697 271257 271048 276380 275250
31747 275250 278673 282225 281998 273230 271234 270866 277106 276080 272210 265428 266335 266926 267390 267388 265895 267294
31731 267294 268775 273251 273755 274711 275137 273458 275644 274618 276679 267715 261125 268173 275746 280931 288223
31716 288223 285650 279159 284191 279159 274901 274604 274718 272486 270506 276670 279563 275638 273163 272371 264506
31701 264506 261051 267917 271721 276523 266572 259692 261461 266372 273456 284387 284743 282097 280407 274117
31687 274117 269813 274390 273119 274153 276640 278139 285023 284386 285343 282189 279788 277393 276175 274647 275810
31672 275810 273567 271997 273793 275134 276787 271995 271016 270748 274574 272450 272299 264269 259784 261671 263012
31657 263012 262925 263531 262172 268915 273385 272705 278232 282445 281635 282789 281984 288265 289062 288988 286492 290546
31641 290546 294751 290375 289538 292872 284476 281532 278576 273134 272032 276265 280657 277813 279107 271929
31627 271929 269089 273796 279137 279963 278835 277335 275466 271289 271633 271063 270065 265697 265316 268036 275403
31612 275403 279690 276463 276208 273595 274407 276499 272561 271885 279702 289643 288776 286630 280869 276812 278788
31597 278788 282608 283332 275868 276411 280847 270971 268971 269783 266701 262212 264846 272844 275447 279188 279475
31582 279475 282498 278694 276057 277992 280386 278514 281708 284623 283859 290419 289327 291583 291586 279170 271816
31567 271816 273850 278597 275936 275611 273026 269166 270345 274143 267529 262832 267306 268563 275857 278030
31553 278030 278542 274086 273495 278624 287509 285826 288764 286780 278230 272126 268476 272125 275960 272067 264460
31538 264460 269501 274886 277059 276656 274932 268480 271467 274212 275904 277665 284097 283823 278645 280021 278994
31523 278994 275990 278553 280155 287105 287167 291411 288626 285160 279923 279563 278468 278432 275474 273201 270550
31508 270550 261961 263886 272359 272627 267676 264133 265901 275915 278724 279595 277148 271428 268475 266594
31494 266594 270894 271033 271538 279583 277670 271422 266155 265073 268850 271961 269108 265640 275037 274008 272278
31479 272278 276770 277164 286348 281750 279480 282721 283096 280993 276657 275274 273410 275644 282645 275474 270855
31464 270855 268262 267410 275941 277947 283293 285516 288235 280987 275602 279665 277149 275963 277966 283474
31450 283474 286227 279829 269447 265588 266273 271701 274946 271451 268499 274109 275238 274209 273280 272192
31436 272192 270936 272989 282097 287497 286599 282222 286114 282429 272453 267263 267844 274356 284197 288409 282776
31421 282776 278187 284799 278492 266506 269012 281395 284730 283891 281840 280097 283249 286612 290233 293469
31407 293469 290801 287395 281267 277184 274544 276072 278430 278033 277542 282636 279757 273628 276785 279122 278306
31392 278306 279309 279918 283535 282531 281487 281535 274472 274145 277837 280685 282709 286268 286734 284625 280946
31377 280946 280743 284764 289739 289628 287458 285784 282263 284367 285338 282972 281453 281187 280887 286229 288797
31362 288797 288704 292845 288773 287883 287064 290180 286513 284272 279620 281209 279247 276711 280099 290180 296361
31347 296361 294500 294529 294566 288780 284498 280730 279754 276877 280341 284367 283163 273514 271287 278998 286283
31332 286283 283994 282997 283925 283217 279060 277927 278562 281785 285363 278965 271954 269564 266382 267655 276010
31317 276010 279261 280813 276378 271997 274095 280301 282700 280681 279114 275411 275290 279260 282055 284006
31303 284006 287664 295611 302244 298439 292070 293135 292517 287839 286636 285533 284431 281599 281785 287343 293674
31288 293674 289287 284292 287190 283465 284222 281528 284918 294657 288485 282746 286095 285874 285535 277571 268270
31273 268270 262403 266079 276644 280998 281142 278764 274127 275901 275377 279821 284286 281708 276931 273798
31259 273798 270022 270082 267228 265576 274555 284689 287273 285359 283139 285435 287477 284137 278585 275659
31245 275659 275757 276263 273673 269438 268232 275861 275584 275406 275340 283434 289312 290965 290413 288614 289500 294302
31229 294302 292125 288681 288404 286237 288270 286605 283739 284003 286379 285708 281364 278629 276695 280029 277916
31214 277916 274797 277512 279560 282168 281641 275729 276543 283469 284505 278844 280480 286710 288212 282623 285675
31199 285675 288309 287277 290058 283965 277630 279641 275607 274621 269537 266275 268038 269962 269796 271091 277502
31184 277502 283201 279612 283572 279318 280931 284302 284644 282835 279779 278270 278963 282095 285683 287310 287076
31169 287076 286337 286284 286805 293591 287525 283309 277708 284411 286490 280756 276483 268627 263433 264175 269616
31154 269616 276379 280740 282252 279611 283187 280661 283954 286076 289940 291461 295096 294498 292837 291475
31140 291475 284290 277072 278419 281869 283900 283314 281279 287577 287273 286078 286111 282557 285725 286589 287235 285611
31124 285611 282343 281527 281506 281368 283245 285920 292163 293909 293050 287214 286643 291171 286197 277610 275905 280501
31108 280501 285899 290159 293853 286585 286709 284410 279711 282492 288765 286877 284507 289400 287178 283415
31094 283415 282941 283129 281680 286784 289121 287945 283165 281600 284351 284112 282175 282045 280263 285458 283394
31079 283394 280412 281491 281417 283975 285791 286882 293258 290565 285156 279412 282919 284095 282488 279088 281155
31064 281155 290326 295617 290264 286647 289610 294605 294116 292710 288700 286223 283801 283850 286217 293201 290161
31049 290161 291285 296903 295210 287372 283563 280519 281113 282712 287005 285044 279971 280447 279169 279071 278061
31034 278061 281873 280004 272709 269471 278899 289082 294406 288259 282586 282946 281896 284651 281426 279838
31020 279838 275838 278497 276377 285634 293585 290662 283728 290940 296873 298138 300739 295018 286886 276607
31006 276607 273811 276674 284768 283012 285469 288563 289284 292652 289178 287812 289632 285963 291504 294466
30992 294466 292920 295050 284385 284567 286739 291354 289135 283851 278994 280057 284523 287187 285075 286235
30978 286235 282609 277986 278225 284135 280277 282644 284880 281083 275723 282729 286193 283439 283980 290478 295672
30963 295672 298089 297340 293552 293515 296991 295943 287091 282702 282864 288256 290769 297304 289848 282023 279922
30948 279922 285941 295629 288496 286617 290839 291429 283721 279360 287468 292225 296523 299338 298765 294577 297570
30933 297570 297800 301505 304019 297214 300724 302593 295410 293252 294852 299930 303466 305352 297349 291994
30919 291994 295979 296156 289598 285927 281905 285410 294000 293532 281217 282074 278581 280117 282274 282892 293237
30904 293237 293886 287864 286242 281824 278558 273181 274970 279382 280453 277961 282893 284024 286511 292878
30890 292878 289009 286868 285173 292712 294929 292035 293796 294279 292231 292355 292890 292563 286655 286878 291546
30875 291546 294048 290071 284203 284422 284079 289067 294771 292292 284260 277866 275239 283116 283834 284878 285390
30860 285390 284169 287081 294663 297534 291971 288318 284197 282055 286579 286109 285567 285132 280546 283383 289543
30845 289543 298233 291711 287209 293472 292375 289788 290354 295933 296175 285794 285814 290879 290641 284269 279040
30830 279040 276900 273864 277842 280421 287059 289495 286524 285505 288879 286720 289832 297377 303127 298932
30816 298932 301452 299667 295779 292369 298038 296701 297415 297960 292495 286350 283616 285981 289601 293666 297566
30801 297566 296777 295613 290762 284062 285287 286794 286516 286645 284129 281963 277957 280000 279910 276773 279535
30786 279535 287094 290051 289525 296265 298466 297618 299430 306258 317030 314900 300361 299834 300481 299046 294449
30771 294449 290299 288696 293977 294199 288224 288917 287644 290547 294132 294249 285323 282662 287995 287442 280354
30756 280354 283046 290222 298447 304416 303229 299646 291529 286701 286820 277340 275739 280696 280730 280422 285425
30741 285425 286903 289218 293324 290439 286261 288948 287229 284333 287236 291455 293055 297396 298560 295782
30727 295782 290414 288889 282958 275983 278516 284090 292181 296996 298289 299491 298471 297452 292814 299296
30713 299296 308043 301629 293427 287968 288971 296034 295436 288701 286696 287654 290358 294330 297306 299367 300644
30698 300644 301650 301588 294230 289919 292645 297136 294546 294841 294963 292927 287246 286929 288796 293166 295067
30683 295067 289478 284124 284525 285939 277089 280557 296812 306128 304946 299725 294741 295218 293640 295691
30669 295691 300046 297232 295000 297361 295397 292420 295607 289385 286632 288650 291871 290109 289476 285832
30655 285832 282574 283048 283702 285450 285422 287510 293732 293573 295725 293685 286095 294602 297152 299007 297276
30640 297276 304830 305089 305954 300930 294975 287861 290753 290293 281501 286689 299052 294189 293991 297511 291410
30625 291410 287529 288470 286679 281586 280834 287010 293071 295651 293405 287280 286232 285389 290565 285239 284888
30610 284888 286814 285031 286777 284268 280020 286672 292950 295124 297699 294325 295727 293669 292355 288864
30596 288864 285655 289585 288805 294808 298619 302889 301100 299213 296168 291132 292114 290092 292368 296451 297076
30581 297076 291640 292236 293097 289891 282109 290287 292749 289870 291220 293603 291004 286575 289699 290761 291290
30566 291290 294320 291835 289499 294141 290812 286792 289847 289564 292518 295559 297521 297689 296738 299300 303546
30551 303546 295121 290608 290461 299518 299801 290271 291846 293403 292980 288795 289675 285341 288122 291524 293166
30536 293166 291758 298009 296556 295223 293831 293080 295291 300964 303965 297970 291097 289445 292199 294771
30522 294771 295127 288309 283069 290033 297222 295275 299767 294202 294961 298962 295649 294844 292116 288485 294166
30507 294166 298115 296900 303574 303275 299414 293538 291951 294703 293535 292748 293671 292916 296283 301095 304746
30492 304746 301650 297396 298215 292535 288966 292350 291090 291006 288330 293157 291570 295633 294715 292254 292987
30477 292987 295227 296626 293419 291429 292416 292256 296051 293609 299864 302137 302074 298140 288063 286465 292329
30462 292329 299103 295103 285647 282959 284717 287901 295264 301690 295115 292992 299014 302314 301853 299066
30448 299066 296486 292820 299962 300391 298966 304240 305170 301222 295987 298928 299016 297637 288992 283283 286040
30433 286040 296948 303031 299841 299787 299497 294006 295622 293686 291226 295787 298631 302354 296518 292797 291958
30418 291958 289534 291347 282616 283817 293492 297228 296509 293583 297255 296959 297027 298755 301249 306214 303432
30403 303432 297538 296327 294801 296140 298964 299177 299031 301497 300652 297543 290180 286621 287658 286867 291003
30388 291003 294733 297853 293467 291884 291961 285473 291787 298559 298992 300516 302086 301023 299830 302190 301825
30373 301825 304402 307279 302261 298419 292748 292137 291391 288518 288233 286476 293685 302238 305688 299825 300340
30358 300340 302662 305579 303316 298352 293629 290797 295702 298758 300542 298065 296191 294568 301719 302735
30344 302735 305541 304187 303833 297348 293779 291163 293696 297178 296855 301561 308464 302892 301632 302919 304652
30329 304652 302126 301882 301071 302087 298890 298018 301612 299573 300844 303160 303304 299461 298665 305227 306935
30314 306935 300838 299219 299655 296114 299853 304811 303894 302352 295829 296439 293478 288713 294461 295153 292710
30299 292710 293090 294840 298411 294750 294217 298025 298499 298858 301481 298326 297598 300280 305645 301818 300100
30284 300100 298419 298838 294862 295970 299282 298834 298314 296764 297148 300815 301602 298125 296665 295711 297361 298573
30268 298573 292193 298806 305519 301323 295124 293277 299599 303628 303238 304332 306830 305566 301866 291585
30254 291585 285064 292758 294179 300968 308174 311408 308604 314071 314803 316952 314172 309457 308374 305452
30240 305452 308296 305160 295692 289669 296732 301303 304891 305911 303636 301828 307630 313999 310010 307602
30226 307602 304064 301388 302854 301156 296657 294639 297274 299165 306913 308895 305200 304770 307097 304066
30212 304066 295463 291893 295231 295762 302909 303760 301422 307348 304132 297808 296121 298723 303410 309091 308313
30197 308313 304615 302458 301297 298700 300136 295571 294849 298500 296175 295139 294051 294587 293133 293596 301801
30182 301801 301296 299589 297934 295036 293132 293972 294466 295956 295564 296222 300198 302437 300459 300686 308705 308628
30166 308628 311098 308711 302442 302607 305209 304750 295261 291624 294650 300052 303991 303657 301804 304729 306242
30151 306242 304666 304955 308053 303022 302693 310497 314674 317982 317321 311783 304972 302957 299934 296378 296465
30136 296465 299084 310009 311533 306268 301817 299391 303547 307222 300545 298611 298220 298788 294029 294340 300805
30121 300805 297786 301970 304634 300262 298363 299509 302138 295291 298071 302354 306858 312670 311876 307695
30107 307695 305831 300428 306361 308669 309664 301917 297504 290705 289288 292571 294965 298639 296518 294390
30093 294390 287962 288413 292689 299442 302957 298514 294890 300574 308558 306805 304192 297156 301604 307200
30079 307200 303245 299828 293423 288333 283875 290626 295605 297517 297214 304645 308931 307268 307458 304610 305576
30064 305576 305203 306408 302467 301237 300787 297809 303796 303976 302450 303171 302060 301947 305244 301394 297549
30049 297549 294985 298151 298649 299645 298897 300114 297747 301769 305598 304678 310312 310294 303606 297532 300916 309450
30033 309450 313217 315406 317766 319557 307685 304600 302863 296679 299913 297692 295328 298679 300820 307100
30019 307100 303699 297663 297295 305560 315834 313391 306883 308529 304965 300588 299642 296748 295120 293310
30005 293310 296829 300539 301124 299802 295225 298255 303791 316623 320046 318139 319387 312811 305639 308166
29991 308166 309292 310308 313262 319053 315943 312709 312707 304696 298128 296348 299778 306193 309069 307082 300313
29976 300313 292178 293244 299407 307616 310444 307876 306430 312654 313393 314302 307429 301516 299838 297858 299411
29961 299411 302274 295983 296320 307993 311258 310873 305926 303620 301534 299870 306448 311954 320128 323461
29947 323461 314466 310535 310666 310159 313557 314344 314720 306977 306434 310064 305230 309494 309899 303836 299171 304702
29931 304702 308343 314091 316051 312469 302526 299812 307004 310774 299445 291919 294307 289898 295487 297750
29917 297750 301149 307773 309798 306969 301360 304277 305781 302241 301301 307332 306048 305475 314744 313459 302762
29902 302762 304530 304345 305463 296428 298383 306046 309126 305356 305997 311191 303308 295048 291648 289031 291062
29887 291062 299328 299174 293596 296648 303121 301621 304109 297147 286942 293135 304305 306654 311747 311093
29873 311093 307302 313432 322979 318618 310142 308335 313626 313984 313197 318301 314934 308068 305706 301425 298840
29858 298840 296955 300964 303485 308026 309661 306471 304655 300190 307704 307342 301765 304713 302850 300818
29844 300818 304514 308584 315619 318217 311860 312137 318243 325100 326562 320163 317716 313423 302070 296474
29830 296474 300027 311029 316959 320545 312426 306567 302702 298893 300531 307024 310436 309051 309018 311466
29816 311466 314204 318477 312508 307345 310766 304407 307198 309558 308849 305325 307832 311087 314786 307610
29802 307610 307489 317613 315491 309726 311936 309865 305760 299689 308778 312649 316229 312647 304656 305904
29788 305904 306532 305072 297375 299408 298765 296436 298823 299335 301855 306066 312022 312955 303967 302740 304942
$$ [...]
##END NTUPLES=NMR SPECTRUM
##END=
