##TITLE=Analysis number 325626
Compound Code sb 00942
Book Reference 148560
Project Code adrs fraglib
Chemist Name jom
##JCAMPDX= 6.0         $$ Bruker NMR JCAMP-DX V2.0
##DATA TYPE= NMR SPECTRUM
##DATA CLASS= NTUPLES
##ORIGIN= Bruker BioSpin GmbH
##OWNER= nmr
$$ XWIN-NMR		Version 3.5
$$ Fri Jan  5 10:55:41 2007 GMT Standard Time (UT+0h)  MAYBRIDGE\nmr@NMR_250MHZ
##.OBSERVE FREQUENCY= 250.131544655141
##.OBSERVE NUCLEUS= ^1H
##.ACQUISITION MODE= SIMULTANEOUS (DQD)
##.ACQUISITION SCHEME= undefined
##.AVERAGES= 16
##.DIGITISER RES= 18
##SPECTROMETER/DATA SYSTEM= dpx250
##.PULSE SEQUENCE= zg30
##.SOLVENT NAME= CDCl3
##.SHIFT REFERENCE= (INTERNAL, CDCl3, 0, 16.5177)
##AUDIT TRAIL= $$ (NUMBER, WHEN, WHO, WHERE, WHAT)
$$ ##TITLE= Audit trail, XWIN-NMR		Version 3.5
$$ ##JCAMPDX= 5.01
$$ ##ORIGIN= Bruker BioSpin GmbH
$$ ##OWNER= nmr
$$ C:\u/data/dgb/nmr/ADRS/420/pdata/1/auditp.txt
$$ ##AUDIT TRAIL=  $$ (NUMBER, WHEN, WHO, WHERE, WHAT)
(   1,<2007-01-05 10:55:19.77 +000>,<MAYBRIDGE\nmr>,<NMR_250MHZ>,
      <created by zg, POWCHK disabled, PULCHK disabled
       configuration hash MD5:
       49 4B E0 1D 92 C2 6B 37 9F E6 65 BC 52 41 86 1D
       data hash MD5: 64K
       BF E9 42 A2 B1 39 F2 2A 5A FC B4 A0 03 AB 2A 85>)
(   2,<2007-01-05 10:55:31.65 +000>,<MAYBRIDGE\nmr>,<NMR_250MHZ>,
      <Start of raw data processing
       ef LB = 0.3 FT_mod = 6 PKNL = 1 SI = 32K 
       data hash MD5: 32K
       DB 5F AE 91 A8 5F EA 33 F3 28 C0 8D 75 A0 5B 4A>)
(   3,<2007-01-05 10:55:33.59 +000>,<MAYBRIDGE\nmr>,<NMR_250MHZ>,
      <apk 
       data hash MD5: 32K
       E2 D4 3F 5D F4 B0 36 10 07 D5 77 E4 13 09 6E 16>)
(   4,<2007-01-05 10:55:34.27 +000>,<MAYBRIDGE\nmr>,<NMR_250MHZ>,
      <abs ABSG = 5 
       data hash MD5: 32K
       AB 47 6D 3F B4 2A 7A 61 39 68 8A 03 77 E3 12 AB>)
$$ ##END=
$$ 
$$ hash MD5
$$ CC 23 C8 20 10 A7 3D 52 E4 0C DC 97 81 80 36 02
##$RELAX= 
##$RELAX= 
##$RELAX= 
##$RELAX= 
##$RELAX= 
##$RELAX= 
##$RELAX= 
$$ Bruker specific parameters
$$ --------------------------
##$DU= <C:\u>
##$EXPNO= 420
##$NAME= <ADRS>
##$PROCNO= 1
##$TYPE= <nmr>
##$USER= <dgb>
##$AMP= (0..31)
100 100 100 100 100 100 100 100 100 100 100 100 100 100 100 100 100 100 
100 100 100 100 100 100 100 100 100 100 100 100 100 100 
##$AQSEQ= 0
##$AQ_mod= 3
##$AUNM= <au_zg>
##$AUTOPOS= <31 >
##$BF1= 250.13
##$BF2= 250.13
##$BF3= 250.13
##$BF4= 250.13
##$BF5= 500.13
##$BF6= 500.13
##$BF7= 500.13
##$BF8= 500.13
##$BYTORDA= 1
##$CFDGTYP= 0
##$CFRGTYP= 5
##$CHEMSTR= <none>
##$CNST= (0..31)
1 1 145 1 1 1 1 1 1 1 1 1 1 1 1 1 1 1 1 1 1 1 1 1 1 1 1 1 1 1 1 1 
##$CPDPRG= <>
##$CPDPRG1= <>
##$CPDPRG2= <>
##$CPDPRG3= <>
##$CPDPRG4= <mlev>
##$CPDPRG5= <mlev>
##$CPDPRG6= <mlev>
##$CPDPRG7= <mlev>
##$CPDPRG8= <mlev>
##$CPDPRGB= <>
##$CPDPRGT= <>
##$D= (0..31)
0 1 0 0 0 0 0 0 0 0.06 0 0 0 0 0 0 0.0002 0 0 0 0 0 0 0 0 0 0 0 0 0 0 
0 
##$DATE= 1167994518
##$DBL= (0..7)
120 120 120 120 120 120 120 120 
##$DBP= (0..7)
150 150 150 150 150 150 150 150 
##$DBP07= 0
##$DBPNAM0= <>
##$DBPNAM1= <>
$$ [...]
##$SUBNAM7= <"">
##$SUBNAM8= <"">
##$SUBNAM9= <"">
##$SW= 20.6930455092707
##$SWIBOX= (0..15)
0 0 3 0 0 0 0 0 0 0 0 0 0 0 0 0 
##$SW_h= 5175.983436853
##$TD= 65536
##$TD0= 1
##$TE= 294.16
##$TE2= 300
##$TE3= 300
##$TEG= 300
##$TL= (0..7)
0 120 120 120 120 120 120 120 
##$TP= (0..7)
150 150 150 150 150 150 150 150 
##$TP07= 0
##$TPNAME0= <>
##$TPNAME1= <>
##$TPNAME2= <>
##$TPNAME3= <>
##$TPNAME4= <>
##$TPNAME5= <>
##$TPNAME6= <>
##$TPNAME7= <>
##$TPOAL= (0..7)
0.5 0.5 0.5 0.5 0.5 0.5 0.5 0.5 
##$TPOFFS= (0..7)
0 0 0 0 0 0 0 0 
##$TUNHIN= 0
##$TUNHOUT= 0
##$TUNXOUT= 0
##$USERA1= <user>
##$USERA2= <user>
##$USERA3= <user>
##$USERA4= <user>
##$USERA5= <user>
##$V9= 5
##$VALIST= <valist>
##$VCLIST= <CCCCCCCCCCCCCCC>
##$VD= 0
##$VDLIST= <DDDDDDDDDDDDDDD>
##$VPLIST= <PPPPPPPPPPPPPPP>
##$VTLIST= <TTTTTTTTTTTTTTT>
##$WBST= 1024
##$WBSW= 4
##$XGAIN= (0..3)
0 0 0 0 
##$XL= 0
##$YL= 0
##$YMAX_a= 333465
##$YMIN_a= -501834
##$ZGOPTNS= <>
##$ZL1= 120
##$ZL2= 120
##$ZL3= 120
##$ZL4= 120
##$ABSF1= 16.51773
##$ABSF2= -4.175442
##$ABSG= 5
##$ABSL= 3
##$ALPHA= 0
##$AQORDER= 0
##$ASSFAC= 0
##$ASSFACI= 0
##$ASSFACX= 0
##$ASSWID= 0
##$AUNMP= <proc_1d>
##$AZFE= 0.1
##$AZFW= 0.1
##$BCFW= 0
##$BC_mod= 0
##$BYTORDP= 0
##$COROFFS= 0
##$CY= 12.5
##$DATMOD= 1
##$DC= 0
##$DFILT= <>
##$DTYPP= 0
##$F1P= 14.0000005364418
##$F2P= -0.99999901652339
##$FCOR= 0.5
##$FTSIZE= 32768
##$FT_mod= 6
##$GAMMA= 0
##$GB= 0
##$INTBC= 1
##$INTSCL= 1
##$ISEN= 128
##$LB= 0.3
##$LEV0= 0
##$LPBIN= 0
##$MAXI= 10000
##$MC2= 0
##$MEAN= 0
##$ME_mod= 0
##$MI= 0
##$NCOEF= 0
##$NC_proc= -2
##$NLEV= 6
##$NOISF1= 0
##$NOISF2= 0
##$NSP= 0
##$NTH_PI= 0
##$NZP= 0
##$OFFSET= 16.51773
##$PC= 1
##$PHC0= 222.6398
##$PHC1= 9.601812
##$PH_mod= 1
##$PKNL= yes
##$PPARMOD= 0
##$PSCAL= 4
##$PSIGN= 0
##$REVERSE= no
##$SF= 250.130001067803
##$SI= 32768
##$SIGF1= 0
##$SIGF2= 0
##$SINO= 400
##$SIOLD= 32768
##$SREGLST= <1H.CDCl3>
##$SSB= 0
##$STSI= 32768
##$STSR= 0
##$SW_p= 5175.98343685301
##$SYMM= 0
##$S_DEV= 0
##$TDeff= 65536
##$TDoff= 0
##$TI= <Analysis number 999999
Compound Code 99
Book Reference 9
Project Code 9>
##$TILT= no
##$TM1= 0
##$TM2= 0
##$TOPLEV= 0
##$USERP1= <user>
##$USERP2= <user>
##$USERP3= <user>
##$USERP4= <user>
##$USERP5= <user>
##$WDW= 1
##$XDIM= 32768
##$YMAX_p= 387039328
##$YMIN_p= -62255
$$ End of Bruker specific parameters
$$ ---------------------------------
##NTUPLES= NMR SPECTRUM
##VAR_NAME=  FREQUENCY,     SPECTRUM/REAL,   SPECTRUM/IMAG
##SYMBOL=    X,             R,               I
##VAR_TYPE=  INDEPENDENT,   DEPENDENT,       DEPENDENT
##VAR_FORM=  AFFN,          ASDF,            ASDF
##VAR_DIM=   32768,         32768,           32768
##UNITS=     HZ,            ARBITRARY UNITS, ARBITRARY UNITS
##FACTOR=    0.157963299565203, 1,           1
##FIRST=     4131.58000085301, 0,            0
##LAST=      -1044.403436,  0,               0
##MIN=       -1044.403436,  -62255,          0
##MAX=       4131.58000085301, 387039328,    0
$$ Real data points
##PAGE= N=1
##DATA TABLE= (X++(R..R)), XYDATA
$$ [...]
26869 -1236 3291 16088 7436 -4941 -7590 -10767 -6678 4212 -1210 4624 15778 9773 -4409
26856 -4409 -11619 -2203 -9258 -18370 -13559 -13636 -4793 14196 15095 15476 21494 23343 21517 14894 8388
26841 8388 60 4618 7105 4412 1349 4818 -7709 -20711 -20565 -6078 -6198 -18533 -18573 -8510
26827 -8510 -3571 -16620 -27737 -25944 -23497 -24266 -12043 -14805 -23142 -33393 -31955 -15732 -16910 -7896
26813 -7896 -12624 286 237 -378 7685 10539 9693 16978 3208 3124 14037 393 7891 -2435 4493
26798 4493 13292 17999 14497 -564 -30171 -17966 -6292 -11730 -10640 5846 36642 41476 29382
26785 29382 13604 24045 24117 11269 17141 5561 1212 -2135 -8992 -11296 -19553 -22097 -21991 -7972
26771 -7972 2692 -5483 -7870 -6013 -1165 -7146 3521 7444 -6950 -6745 -1252 8089 5937 -11289
26757 -11289 -16705 -12282 -17356 -7716 -2899 4103 -11419 -13571 -5309 -15307 -17317 -19456 -8693 -7445
26743 -7445 2678 -4054 -9668 -14300 -216 15956 12844 13094 9991 -6185 -3393 6195 -423 6298
26729 6298 16362 13254 6755 -6609 -11144 861 3895 4372 24701 29625 17781 9362 15225 23336
26715 23336 9077 -1509 -6402 -2685 11841 13457 3874 12544 11736 1135 2320 -7893 -10618
26702 -10618 -14822 -8979 -9503 -17935 -16914 -13900 -21285 -22718 -8508 8294 6903 2699 3500 10196
26688 10196 677 6261 15946 24289 29707 28287 15684 11174 7043 -2438 -12615 -27414 -14798
26675 -14798 10432 22505 16321 13200 12016 16147 12443 17155 17502 25562 33036 24519 26547 29219
26661 29219 28229 2890 -13947 -13379 2872 6649 9082 -1644 -13443 -1005 15626 12690 -3983
26648 -3983 -19320 -12871 -19152 -27138 -24286 -11001 545 21766 11430 2132 -17192 -18943 -7635
26635 -7635 -11561 -16810 -4873 20350 25789 17081 7605 8626 -3085 -20963 -11852 -17244 -13961 1267
26621 1267 6026 9948 8581 15198 17752 9371 5570 -5763 -1350 -2740 -6483 -3687 149 -5224
26607 -5224 -9762 -22965 -15036 -7002 -6826 5122 8415 -180 3866 93 1816 7940 -2463 -3425
26593 -3425 9986 29586 22944 13764 15816 7045 7721 6419 10522 15620 15393 15136 25038 18334 9105
26578 9105 1635 2873 7899 505 5240 22371 12261 11386 29087 29013 19506 7118 15575 25955
26564 25955 41680 35213 24880 12126 9072 15608 16868 6829 20139 28409 29709 24519 18316
26551 18316 16498 -8587 -18946 -8376 637 1730 9371 22533 19475 9400 16753 22022 19427
26538 19427 22436 21790 13727 21648 27513 21186 13625 24199 6737 7621 23108 29277 12938 1727
26524 1727 19513 31079 14874 -6339 -20153 -3837 10623 18737 30519 36215 20340 -5824
26512 -5824 -16019 -19656 -12952 462 11644 3456 -1267 897 -6940 -4225 1685 5129 5051 27428
26498 27428 31479 21885 12888 12120 14946 14689 2454 3577 2096 -3741 -1385 7479 16421 15856 8339
26483 8339 252 -16274 -21416 -17166 -10219 5228 29062 27235 21749 15379 541 -3964 -74 336
26469 336 -3129 -226 -9448 -17015 -12380 -3446 715 7727 8345 -2931 1839 19227 26069 21930 16382
26454 16382 1080 -1079 3072 6775 -11622 -26211 -25301 -27530 -25343 -12292 -14281 -7303 8622
26441 8622 10641 -4654 -15277 -11665 2110 -92 12493 12876 -4558 -20657 -22521 -13255 -161
26428 -161 -8078 -13014 -10054 1263 8878 19977 16417 10838 24082 19523 10175 -1427 2005 5614
26414 5614 7681 21677 17127 22167 28209 14819 8867 -3188 -12412 -6632 12467 5597 -1552 -6912
26400 -6912 36 6026 5570 -2580 -3424 -128 -9246 -6596 6604 18910 17344 4973 -8650 -20886
26386 -20886 -8992 3751 12069 12275 11310 7674 7674 13933 9993 12640 1458 -12579 -8840 -1119 7493
26371 7493 -4851 346 -2522 -6887 -3739 1756 10067 -6394 -2013 553 -190 1488 6722 15578
26357 15578 13005 14186 7394 -2225 -11709 -14797 -2417 16261 16953 12940 5398 -18833 752 18055
26343 18055 22062 13941 3805 10353 1547 10386 20936 22198 15369 14007 5703 10518 4045 18515
26329 18515 30187 29214 4774 -7719 2880 -317 -16740 -24039 -16035 -11009 -15293 -17873 -24809
26316 -24809 -9417 -1660 -7727 -14380 -6385 6511 14854 10788 18489 22770 24501 12607 6901 -7892
26302 -7892 -1337 8623 17363 10403 5580 3611 5188 -8420 -7109 1444 -9956 -4169 -14805 -1319
26288 -1319 17773 17495 14519 7683 8708 9234 -1735 137 1278 418 -14203 -13556 5892 3677 6638
26273 6638 10036 5539 -9050 -12603 -5846 -8263 -18308 -6828 9206 9282 9053 -3357 -710 -6216
26259 -6216 -7253 9567 6304 105 -13135 3609 13972 25005 27992 14179 3360 8903 6939
26246 6939 9565 7187 -1499 394 -3245 -16578 -4091 8433 12161 305 -3298 -5438 -5308 -6801
26232 -6801 -13148 -7277 15414 29018 19948 6049 -3877 -1566 -6028 4574 4334 1110 930 -15541
26218 -15541 -20833 -1635 4134 -6331 -9673 -15380 -4125 4458 -3116 -22603 -25122 -19362 -9140
26205 -9140 5217 -1364 64 -9162 -14253 -24159 -9155 -11195 -23256 -21949 -11365 -10364 -15094 -21485
26191 -21485 -9433 11452 94 -3888 -4278 -9948 -9154 7429 14311 5176 -19867 -31375 -3444
26178 -3444 25451 32520 25948 16893 3833 202 -7504 -14764 -18454 -25881 -28861 -20655 -16086 -13498
26164 -13498 -24269 -20493 -14473 -23379 -25966 -12160 -12366 2492 8976 12256 18524 11711 -9667 -8637
26150 -8637 -2177 -1676 -14944 -13839 136 1150 -13865 -12798 10836 14814 7780 813 -1563 -4499
26136 -4499 2919 25320 20827 15478 3788 -7598 5798 11414 5257 1546 62 11609 3070
26123 3070 -12736 -9888 1548 -3966 -4015 11938 24787 23302 26499 34917 23202 23986 29342 23822
26109 23822 11514 16680 6129 -7083 -16418 -11433 1801 1071 3716 14243 13289 8890 10272 16728
26095 16728 14602 5518 -10462 -8685 -3847 4440 2130 -752 12452 4691 -11725 -8187 -10480 -5127
26081 -5127 -6855 -5622 131 2354 14461 18170 14611 754 -18 -305 -5085 -1323 11551 9868
26067 9868 12759 8954 11703 22640 23535 24483 16929 8634 6156 241 -2648 1121 -11374 -24289
26053 -24289 -24196 -21061 -21591 -13139 -9478 -6292 -5614 -3635 3208 -5618 10318 11476 10329 15116 10770
26038 10770 5039 3358 6482 3780 8222 7430 9926 5921 161 875 7608 18873 8328 -6461
26024 -6461 -1820 -3008 -3469 -13272 -6900 1854 -1741 -12380 -8454 -8423 -2121 -1849 -10826 -30522 -28613
26009 -28613 -20755 -9534 -6381 4193 27474 33905 25582 18666 15631 12020 -13194 -24111 -22948
25996 -22948 -8683 5210 13786 22170 -4316 -15195 -179 9858 17855 18931 1681 4313 -851
25983 -851 -16737 -24231 -29858 -11713 2892 4065 -451 11079 5423 15714 3888 741 -2824
25970 -2824 4181 5564 2236 -2201 -13256 -15458 -3256 4228 10425 -77 -15363 -14352 -13245 -9224
25956 -9224 -8742 6773 4544 7397 12836 13478 11329 28048 31633 28229 14843 14943 28595 26495
25942 26495 18534 9371 -5176 -9731 -12600 -6960 -529 -7531 -15992 -4053 -7110 -16002 -34078 -37456
25928 -37456 -18997 -14082 -286 5096 28006 26943 2833 -9523 -4702 8583 8103 1117 -11768
25915 -11768 -17073 -14332 -3929 13145 10605 2136 -2245 -8585 -19848 -12018 -11442 -7697 9557 166
25901 166 -681 6539 10591 6354 8716 3891 -1088 6320 10200 -6544 -27832 -23586 -10201 -14173
25887 -14173 -17192 -22723 -22163 -14318 -16524 -12953 -5326 -8739 -4967 2560 13909 8276 10794 11724 26124
25872 26124 31129 38193 42761 28187 10712 3708 1130 -6816 -12745 -10470 -4098 -1500 13196 16195
25858 16195 14228 16519 21924 4052 -580 11599 7594 -3180 -9631 -19443 -17998 7888 5567
25845 5567 -9508 -16650 -13196 -2908 1990 3359 -2947 3359 15503 25975 25657 8231 -1932
25832 -1932 3725 7783 21099 6322 -13688 -7505 10568 7590 5572 7888 24834 17100 816
25819 816 -8313 -10900 -16532 -5900 -7194 -12135 -6185 3455 -5343 -5389 -7974 -14198 -14258 -12411 3258
25804 3258 9008 22155 6272 1952 12694 6298 -11071 -23809 -31788 -27263 -24464 -25818 -10362
25791 -10362 -5925 -10498 -8203 -4641 -1759 -1646 420 11134 5776 -1144 1482 8162 4889 6645
25777 6645 13995 14506 10644 10382 17376 12761 11129 -5112 -17103 -20594 -17373 -27260 -24482 -7447
25763 -7447 186 3558 10792 25473 23852 19388 23455 27040 17519 5029 -5931 -9214 -12115 -14112
25749 -14112 -12327 -2663 -3824 5881 23124 17372 6001 6921 -12416 -10067 -3495 -5123 538 -8932
25735 -8932 -15633 -27392 -19239 -10773 -11694 -10661 -11526 -6486 4459 3993 -826 9783 5148 -14679
25721 -14679 -7406 -3226 6613 19958 18824 20334 32695 38719 19873 5929 4977 9486 -2191
25708 -2191 -15642 -16471 -25157 -20388 -13700 -16134 -18731 -6135 -6609 -25325 -26460 -547 3388 7337
25694 7337 14695 12496 18644 21252 18475 10988 19562 14590 3654 6811 11597 4465 8343 24319
25680 24319 22676 3552 4329 1915 -7805 -5902 555 12066 6003 -722 -1522 5937 10135 -372
25666 -372 -10705 894 7094 -13912 -27639 -14172 2890 3881 897 18976 29937 23534 23467 28273
25652 28273 16718 -1952 -11158 -11531 -2449 -11038 -13778 -5464 -5617 3701 16774 11417 4872 2501
25638 2501 2025 14379 15246 12139 18609 15460 -1000 -1658 -10639 -8376 8535 16973 18513 21025 18516
25623 18516 22188 21044 24815 8117 8669 8682 14384 14323 4841 975 2973 -4570 7774 19895 11073
25608 11073 -971 853 1923 -9015 -15969 1983 10909 6103 5770 3064 4592 23256 29011 15855
25594 15855 9796 13107 13181 12265 15480 23224 3889 -13604 -1978 489 1419 -593 7913 14788 -11361
25579 -11361 -22830 -17283 -2415 -8922 -16637 -19317 -17034 -12525 -10258 -14835 -8702 56 3774 -2498
25565 -2498 -1409 8323 1356 1866 -16941 -25982 -22678 -19852 -18124 -5288 2770 -17683 -32814 -19986
25551 -19986 -7450 29122 29697 19289 4447 6585 -4191 2098 -8350 -8206 -7353 -14068 -7880 2664
25537 2664 11076 2003 -14200 -19208 -11533 -5928 -3166 -9684 -301 13959 20579 19951 29792 26239
25523 26239 22118 14386 3884 8369 16118 3467 -934 11306 11620 5951 -10757 -20904 -18552
25510 -18552 -5936 2382 -10739 -4204 2069 457 2894 274 -6449 -19625 -22169 -21446 -21637 -19519
25496 -19519 -25684 -22240 -3021 17449 35055 29768 17159 14450 12807 -8469 -8253 5184 14009
25483 14009 14949 715 2411 -37 4606 12490 6717 -7632 -6965 -6609 -14228 -8193 11601 7668
25469 7668 -6173 -8345 -2311 -3119 -19155 -27366 -21680 -10951 -5772 6099 4813 9744 3178 -1192
25455 -1192 3763 3345 -2651 -8189 -8208 -13492 -17460 -19663 -15569 -9290 -7795 -5064 7649 -6495 -7864
25440 -7864 -2950 1986 7425 -1969 547 -1772 449 -1527 -1791 -28593 -27917 -30521 -13439 -12552 -4047
25425 -4047 -8842 -17808 -19570 -7813 -3868 -1072 -7209 -8893 -6125 -4533 3808 8992 14069 18579
25411 18579 5198 6488 10411 14689 19328 18682 13236 2344 -2630 -7332 -14707 -27705 -23379 -16391
25397 -16391 -16582 -9142 -18844 -16959 -10121 1474 -720 -5282 3483 967 -3112 -5190 -5311 5464
25383 5464 -2727 -11227 -9626 -17222 -22637 -17216 -1235 -5454 -22035 -28667 -22431 -24891 -34708 -21247
25369 -21247 -16447 -13818 -13221 -14390 -1684 4266 2707 5880 25576 15336 19363 18548 10189 -12211
25355 -12211 -11582 -18440 -27859 -35511 -32128 -17971 -2388 -9801 -18260 -11382 8997 17802 26547 30411
25341 30411 10338 -7035 -1339 15691 11470 10103 11937 20689 23948 15929 8196 9325 7633 2111
25327 2111 -1356 -11939 -13987 -9530 -9468 -5949 8738 6340 2126 -9786 -5675 -8684 826 6466
25313 6466 -686 1890 -1959 -2164 5314 3679 -16791 -21744 -22062 -34757 -27560 -12408 6629 12701
25299 12701 13301 11608 -13663 -18452 6443 13366 8871 2436 -7412 -12391 -17679 -18122 -13589 -25155
25285 -25155 -26491 -14123 -5471 5741 19033 37199 35012 24760 3745 -3596 2079 4937 17
25272 17 -1995 -337 -5981 -9642 -15393 -10721 -2510 8467 11382 15697 6233 7964 12317 830 -2075
25257 -2075 -1605 -11509 2139 3069 -9927 -19806 -15517 -5957 793 9123 9190 4645 11849 17231 26324
25242 26324 33633 18174 4058 4807 13286 -4935 -19377 -16268 -5207 511 -7132 10199 9896
25229 9896 -7689 -14526 -182 4960 -5968 -13895 -20711 -12565 -9454 5089 14420 10918 -5943
25216 -5943 -10175 10844 17011 10431 7078 17279 22541 21120 28108 23968 21140 12545 -177 3899
25202 3899 -3293 -12622 -18272 -9657 5607 -7688 6196 23767 29527 23414 13027 10631 1196
25189 1196 -3949 -7124 1211 10004 924 4801 -3520 -15337 -3463 1560 6328 -1507 -3309 -10978
25175 -10978 -11533 -15304 -9126 -5223 -830 6438 11080 14359 21917 13882 10055 7181 10436 20185 15426
25160 15426 -11387 -17934 -14255 -12285 -9580 -5532 6184 -299 5208 15776 19694 16224 4182
25147 4182 1122 8107 13535 6878 1168 -2371 -1614 4467 -6423 -19002 -27327 -28511 -27259 -17613
25133 -17613 1301 104 -11655 -24603 -19797 -9706 -14511 -4842 -7521 -11107 -15056 -3689 -14276
25120 -14276 -26703 -27080 -35040 -33552 -28029 -12741 -16404 -6099 -8320 -16086 -2428 -6611 -18889
25107 -18889 -9826 2823 6025 11774 4796 -5289 -12889 -19838 -28330 -29063 -18050 -4312 -7037 -16231
25093 -16231 -20573 -20652 -1922 24676 15187 2562 -8749 -15454 -14284 -12012 -25140 -24159 -4182 16540
25079 16540 20028 11458 -1393 -310 15321 20254 25360 25007 7514 -13820 -19295 -2062 10306
25066 10306 10116 -2458 -2099 -5209 586 11721 18645 10675 -6966 -15646 3934 6713 4604 12596
25052 12596 7515 7364 -3978 -11297 -8939 3666 -5273 -17011 -12225 -6648 -23773 -39178 -23411
25039 -23411 -7846 -5078 8776 14962 475 -14370 -10638 -5893 -19998 -16887 -15405 -12750 -20718
25026 -20718 -11348 -4075 -14492 -9178 -667 3768 5189 3000 -638 -2781 -2597 -17651 -22023 -16098
25012 -16098 -19577 -21584 -16539 -2188 369 10476 19231 -3823 -20415 -25669 -15285 7528 7933
24999 7933 9534 9002 11926 21186 13495 -13618 -10090 -9732 -14577 -20419 -26014 -15529 -6600 4052
24985 4052 7212 3688 10438 8454 8091 15792 21792 4191 -3007 -13241 -20501 -19512 -15359 -12839 -8225
24970 -8225 -17397 -15368 -14946 -3436 -4522 -17004 -12969 -10732 -3562 -14207 -13833 -16628 -14649 6400
24956 6400 26081 24609 14956 -1712 -1665 10453 9980 9668 21516 29905 24414 19002 11474 5340 18963
24941 18963 19507 3994 -9151 -5220 2271 6916 7552 8239 -2192 1858 17552 4820 -22701 -40922
24927 -40922 -29040 -19164 -4490 12597 15283 1842 -10137 -14755 -873 -2043 -874 4387 756
24914 756 8694 -893 6622 16754 21826 18689 14475 13039 5272 -3402 6536 3544 4472 881 7474
24899 7474 17162 28433 29474 30040 28393 26570 11434 -4055 -6928 -9205 -12439 -10869 -14901 -7617
24885 -7617 535 -2539 -1692 -9598 -1390 -22326 -21794 -10102 -13958 -17068 -7339 -6562 2886 -2113 -5370
24870 -5370 8598 -228 3450 10632 5874 -5718 -6776 -9420 -27650 -26382 -33069 -26107 -18370 -25071
24856 -25071 -19260 -9520 4208 3901 -10450 -11689 -17325 -25242 -25355 -13591 -10574 -20126 -21469 -10040
24842 -10040 -13128 -12794 -13611 -12548 10713 25987 13361 2629 -521 2923 -4286 -14563 -11177 -12477
24828 -12477 -9890 -10539 -740 9041 -2404 -6897 -3482 8240 20030 16056 8432 2927 -141 1429
24814 1429 10452 14477 8669 10601 17248 1482 -16587 -13826 -19124 -35358 -19556 -1034 2409
24801 2409 -4114 -1942 3184 1000 866 5728 24972 23265 10941 13581 18079 20035 10848 -1163
24787 -1163 -14003 -19829 -11866 9411 10768 754 3042 16960 30156 9844 2353 -652 -7598
24774 -7598 9258 25293 25953 18451 17204 -568 -11889 -21428 -12853 -5475 -14149 -21149 1718 19907
24760 19907 12141 13812 26875 26197 17973 2480 -3989 972 -13592 -15403 -13305 -12833 -904 947
24746 947 3844 12321 19886 20802 16696 15714 4179 3009 4948 808 -2746 -549 -4012 3884 16272
24731 16272 35349 28790 6972 -4992 -7359 -14166 -12757 -9398 -12235 -7162 -11297 -12778 -23132
24718 -23132 -29347 -20975 -15363 -10815 -9845 -7323 -19820 -1650 7971 12025 9547 828 -9288 -17146
24704 -17146 -3296 2485 -2033 14 907 8789 3403 -7389 117 19616 20334 8855 8765 14054
24690 14054 2685 6046 -1791 8109 17659 5915 -14979 807 5780 13167 -1128 -12736 -9531
24677 -9531 10176 3617 -15611 -28040 -25474 -14259 -4416 -7211 -9750 -3144 3502 -2889 11631
24664 11631 23663 20782 21959 3740 -15453 -4315 10377 13513 3920 -2860 -13012 -7024 6190
24651 6190 -26 -10419 -11559 -15509 -14190 -12231 -1918 15869 14388 8942 8691 1197 -7560 5809
24637 5809 8871 -4050 -23377 -27031 -27619 -9707 6336 1959 -3146 -10136 -8195 -13401 -2889 4935
24623 4935 -1321 -4914 -13461 -21611 -17428 -7066 -2879 839 -6653 -26194 -20003 -1086 9156 12929
24609 12929 10011 -8818 -12180 -4770 -2658 12632 3152 1930 4027 6654 20260 24593 10675
24596 10675 2062 -5070 -4480 -7645 -12612 -19317 -31638 -19017 5636 7980 660 -1375 -6474 355
24582 355 8030 17117 12991 21360 10903 7024 18479 25594 16881 13955 16248 1976 -5140 -2486
24568 -2486 -8166 8446 14927 12693 -9113 -13276 -4151 -4344 362 1508 -11469 -2191 7749 9965
24554 9965 13527 12062 -5802 -10889 9583 14216 -534 3092 12147 11631 -4701 -4907 1598 552
24540 552 -4393 -8149 -965 5502 12370 12121 7134 -110 3334 -13814 -25319 -15922 -18286 -10299 -13289
24525 -13289 -30744 -31505 -24536 -10432 -3737 3030 -953 -14506 -16188 -8828 1601 -10620 -18430
24512 -18430 -15881 -5081 13284 3707 -7905 -20445 -18931 -3231 9949 4014 -4177 3155 4856
24499 4856 3452 -3528 -14043 -10127 -5576 -10911 -16763 -24269 -21625 -9543 5614 6535 10766 15614
24485 15614 14239 25581 19155 23413 17287 16753 17516 13641 21994 10235 2151 -3108 -13479 -22211
24471 -22211 -24658 -21962 -10605 13481 22338 5348 -3068 2949 16560 18440 5111 -7210 -6625
24458 -6625 -2279 2028 5967 20282 24995 18574 6053 17746 23566 22553 24547 7620 10041 15386
24444 15386 -5440 -12040 -7123 406 9202 753 2416 -6858 1575 10540 4798 9180 -1821 772
24430 772 -5757 -10567 29 3157 2661 -2306 -3207 -11472 -8137 -5936 -19674 -15779 -18877 -15719 1164
24415 1164 15403 -4022 -14608 -10411 -7886 2778 -1437 -9474 503 6620 12973 17089 23059 18738
24401 18738 15619 4473 -4373 -22833 -14174 -10727 -5836 4307 10685 19267 28010 23773 7697
24388 7697 10215 9539 4699 10534 28626 51553 45486 23623 22820 11473 -4332 -8926 -25941 -33022
24374 -33022 -4641 13484 15608 18359 9256 -8402 -21758 -28344 -22545 -8963 -8455 -17697 -14184
24361 -14184 -11251 -9838 -10880 -15804 3809 17766 7531 -840 18840 29645 21451 16792 4630
24348 4630 20000 8009 -2803 -5351 -4143 3881 20479 22698 19132 12291 -2562 -13499 -13138
24335 -13138 -12883 -16328 -16634 -15899 -8674 -7742 -13727 -8501 -9875 -20527 -17466 -11263 -8261 -20822 -23309
24320 -23309 -12575 -12332 532 9544 15177 18178 16488 10118 17843 13388 12105 9461 8782 1938
24306 1938 -6104 -10463 -14236 -23663 -21606 -5725 -6524 -10923 -9800 -5748 500 7548 16220 21976 -1285
24291 -1285 -16308 -15950 -1319 184 12647 18952 -462 -16448 -24196 -30126 -26268 -31976 -21189
24278 -21189 -25541 -34158 -34568 -30067 -22970 -4726 4195 1620 -13174 -26951 -8871 11448 13803
24265 13803 15556 7270 8853 16946 10676 -99 -1274 -11957 -18899 -15744 -13852 -2534 -300 -18028
24251 -18028 -24311 -27240 -24805 -5094 -8070 -2902 1768 1390 15267 15764 11265 9158 6088 -1323
24237 -1323 -14357 -22250 -18528 -27184 -20044 -13421 -123 6733 4352 -13613 -3030 16061 9025
24224 9025 4052 -15119 -27902 -17185 -18078 -13713 -11227 -3722 -4005 -2637 2438 -13958 -22444 -11766
24210 -11766 -6384 -6770 4647 5264 10178 14436 12379 9384 2596 3516 -5585 5760 26701 22528
24196 22528 5592 -3246 2789 1330 6048 7145 -2141 5395 10171 18638 13084 19900 17895 7219
24182 7219 414 -2695 -2135 2218 -4180 973 -9678 -15377 5099 8823 -6271 -14372 -19440 -18054
24168 -18054 -11084 -16587 -9750 554 -2881 7953 11179 2511 -7899 -12700 -20186 -26383 -7339
24155 -7339 3078 -9777 -8776 493 1298 -10123 -2288 12721 16066 26581 20734 13990 -12
24142 -12 3974 580 5673 14453 14012 3723 -10538 -847 20980 15196 10292 12854 11873 756 839
24127 839 8645 -5607 -3737 -1169 -7852 -507 6262 -2999 -1928 5922 1953 -8877 -5268 3349
24113 3349 10609 -946 -19193 -20920 -9198 7749 5206 -4144 -3202 616 -2129 1922 -1155 -4489
24099 -4489 -9778 -2732 9185 15104 12981 10180 4377 -4574 -14009 -15046 -3697 -2960 -7833 6150
24085 6150 -2853 -13248 7373 16267 16566 19308 32164 30999 25956 35186 43298 29190 6868 147
24071 147 -217 -1415 1197 8285 -245 -10039 -5115 1095 9303 -4688 -10297 -9154 -17687 -23673 -25829
24056 -25829 -14754 -25067 -21772 -7237 -9224 -6220 -4288 -2449 -1506 -3258 2506 -2076 -18356 -30597
24042 -30597 -21530 -6247 -14691 -16948 -15269 -25709 -26651 -36384 -40002 -35056 -15210 12632 14415 -2551
24028 -2551 -8587 -16388 -19914 -9832 -20073 -8647 -7041 -7896 -12832 -10620 -4024 -5566 -5886 -17054
24014 -17054 -26136 -19683 -14767 -19459 -13052 -2820 -4276 -5719 -2787 2579 -422 -2498 -2060 -6923
24000 -6923 1384 -2576 -2013 -4048 -8838 815 -1960 4381 8764 38101 30638 7960 1029 25056
23986 25056 20992 8248 16364 5290 -6686 -12460 3452 3577 -11763 -14987 -16030 -28161 -21253
23973 -21253 -22853 -21592 -18387 -24236 -17684 -16721 -2534 7454 -893 -9659 -8214 2807 18294 10775
23959 10775 8220 13704 9502 5269 1892 5559 19147 12106 -7228 -17108 -9456 4903 13695 9076
23945 9076 5410 -867 7240 4360 -6601 -11385 -22022 -21291 2278 -9597 -10018 -4697 -7609 -6864
23931 -6864 211 -6879 -528 -549 -6292 15342 33400 21993 14464 8113 9953 11853 -5367 -17818
23917 -17818 -12967 747 13731 5907 -7838 1037 3743 -3869 -29003 -23561 -7399 10494 9152
23904 9152 -2829 -13019 -3385 5417 5574 13584 24952 24739 8167 2104 -703 569 5355 -3837
23890 -3837 -15179 -11095 -5551 -10785 -11622 -926 18085 20698 13707 14362 3360 -1604 4172 5597
23876 5597 696 -6457 -2018 8083 17797 5576 -7598 -15209 -1483 4229 -1606 -2588 2788 7689
23862 7689 2490 -9217 -95 12287 5537 5592 7801 2247 4365 -54 1541 1521 -8039 8265 19483
23847 19483 20281 -1106 -22493 -22067 -8959 7775 11109 720 -8482 2541 495 -14234 -15651
23834 -15651 -11461 2750 -258 3387 17 5669 9077 1941 -5938 3615 15771 8674 1050 -9242
23820 -9242 2754 8655 4139 5879 11155 12185 29887 33164 17182 20268 12548 13961 29388 24396
23806 24396 18779 11324 13239 16974 527 -3285 3730 11925 -3754 -6976 -13102 -17966 -3101 2372
23792 2372 2869 -2070 -2918 -1538 -15767 -14331 661 7490 8715 6598 3585 -717 665 806 17027
23777 17027 24383 9764 1286 -4529 -7162 -21068 -22829 -10830 -4281 -14224 -22085 -21512 -19620 -13388
23763 -13388 -3488 5519 5164 9144 18376 5070 872 6294 1605 -2886 -977 7544 4019 -9779
23749 -9779 -18883 -18999 -8259 9479 7326 12121 21749 7174 -2243 9994 19063 515 -19381
23736 -19381 -27185 -10751 14951 8155 8342 7026 7334 6356 -5440 -6052 2779 7023 9445 7242 3151
23721 3151 -3086 -8776 7868 14538 16431 16136 707 -2170 -2769 -1757 -6577 -13955 -9481 -373 -1963
23706 -1963 3230 4350 10659 5926 6272 22234 23375 10627 -9538 -18400 -1620 6995 -1716 -3249
23692 -3249 -8552 -7329 -7530 -16264 -19976 -13824 -1014 -706 -5970 -2597 -218 -9830 4161 -6211
23678 -6211 -1490 12631 25514 23218 25268 28555 22532 10237 6571 5758 3895 -1576 -5652 -7772
23664 -7772 -9357 -2911 -7864 -21453 -30443 -38308 -34061 -19345 11770 13008 3657 -539 -4309 -10146
23650 -10146 -14021 -7213 -1886 -14484 5750 16980 14101 10739 -1205 -865 -280 11397 16014 10794
23636 10794 -752 -4796 -4157 10963 5122 -8027 -20905 -23359 -9688 12827 24794 36895 47209
23623 47209 20141 -14038 -25580 -22013 -12429 -2268 10149 -852 -16087 -25700 -21550 -3156
23611 -3156 -4897 -6548 -17665 -27060 -3813 8153 2000 8516 25478 31107 -138 -15941 -17234
23598 -17234 -12909 -5144 12653 4627 -11393 -16977 -28740 -8717 12233 13697 9527 -122 -13285
23585 -13285 -15751 -21896 -14016 -2367 8648 493 -5441 -15102 -27896 -29849 -27193 -23746 -26112 -33348
23571 -33348 -23941 -8706 -7297 -11149 -9391 1274 2955 170 2092 14545 3461 13149 17124
23558 17124 8943 18019 11868 5667 -12193 -8299 6587 -8134 -7410 -9656 -8632 -15392 -8849 -9179
23544 -9179 -7764 -1900 8513 2609 3898 -483 -7542 -5604 -4122 -2707 -8771 -4557 8092 24460
23530 24460 23802 25456 19345 668 -3291 3383 21070 21011 6128 -8832 -11397 6833 5427 12119
23516 12119 -4291 -22859 -19256 -6026 -5171 -7799 -3963 10948 15086 15304 -15754 -31539 -20777
23503 -20777 -12764 -7006 -6601 -6223 -2076 3549 6929 1274 -14199 -22209 -36891 -30725 -8243 7410
23489 7410 966 -2601 -506 12303 14976 280 -6481 8121 12208 7354 -8755 -16141 -14529 -13938
23475 -13938 -7592 -3773 -7206 -12142 6467 42659 39838 24313 19220 18137 15161 1696 2152 -2675
23461 -2675 -20446 -11126 6642 20184 -19 -14831 -11477 -12672 -16486 -12620 3114 -12818 -27216
23448 -27216 -4246 7856 12167 -4846 -3520 -738 -2575 -4656 -19969 -24731 -23362 -2928 2492
23435 2492 3874 3106 13573 21253 14509 4268 -10793 -14351 -3460 4338 16027 33401 24888
23422 24888 17428 1417 7926 7785 5631 3509 1956 -5879 -8464 -1939 5055 8343 9025 8759 -3390
23407 -3390 -14519 -15986 -24001 -22375 -25341 -17160 2072 13573 10858 -9481 -24864 -20741 -7215
23394 -7215 -13245 -19193 -12700 -8956 -21795 -22389 -16864 -20114 -235 -3601 -12278 -12827 -12393 8628 33084
23379 33084 13928 -53 169 396 3013 8484 -2039 6158 8787 2109 7061 8565 14516 20907
23365 20907 4152 3570 5281 5619 3559 4832 4608 1634 20054 17637 -6987 -17801 -12377 -12208
23351 -12208 -14696 -15785 -5445 1560 4468 1669 2313 -6635 4513 12965 8004 4895 -1378 -504
23337 -504 5310 15508 13392 15263 5536 8663 14647 11320 -9945 -10085 3584 24931 43855 43950
23323 43950 28065 12695 -9748 -20227 -21569 -19177 -2865 11105 15550 14816 14813 12008 2778 -2342
23309 -2342 -5047 8536 11975 13253 8433 6652 -5184 -3890 1393 8920 -1500 -7681 -6660 -3455
23295 -3455 12105 17264 25281 26702 14069 -13132 -23300 -10967 -1844 -8597 -5865 -9459 -11837
23282 -11837 -4267 -8617 -10922 -7565 1406 10112 5263 -434 -11594 -11088 -19989 -14917 -9996 -21591
23268 -21591 -22706 -7608 315 -13628 -7587 -401 -3273 937 9593 -615 -15697 -27204 -22452
23255 -22452 -7481 -6119 -17172 -9631 -6153 -7781 -409 -2475 -949 -13103 -21212 -16116 -21167 -29679
23241 -29679 -36720 -25214 -8589 -9283 -5978 1424 9159 10726 7210 -2602 10207 24331 14825 -5123
23227 -5123 -19692 -14504 -6371 8448 24180 17439 10490 6627 -5776 -6012 -16722 -7709 -4391 8122
23213 8122 -9018 -19563 -10600 11141 12016 5864 -1235 2773 5405 9160 2834 7076 6865 3990
23199 3990 587 -6574 -6842 -6657 -6158 -2792 -3719 -303 -4359 8710 1583 -22721 -28865 -13135 -16110
23184 -16110 -13758 -23138 -24483 -32608 -30938 -36601 -32729 -36626 -41175 -27262 -15730 -10643 -4199 1162
23170 1162 4411 15351 5043 -2535 -349 -10461 -10271 -11221 -9375 -6281 -14103 -23706 -28765 -30840
23156 -30840 -20566 -14596 -3405 -10073 -24481 -14662 -3307 -2081 -5375 -2692 -10929 -13354 5378
23143 5378 26745 13056 -10474 -17173 -3988 11307 -4716 -3923 4513 -1782 -9518 -5996 -3248
23130 -3248 1628 7776 -6891 -16146 -13054 -10805 -4655 -3694 -3447 -2274 -2224 -10270 -5833 1206 675 1833
23114 1833 1684 -3905 -7465 -10814 -24527 -29656 -7257 -5612 -2345 7248 6729 9377 -2764 -19650
23100 -19650 -21072 -6743 77 -4485 -279 191 7373 5014 -3560 -4951 3443 16201 11658 6222
23086 6222 6756 7094 10038 8301 5110 -2733 -1264 3378 3695 3052 5221 6225 8800 5278 56 -1241
23070 -1241 -4760 -13034 -4173 17131 12435 -291 -2616 -8320 -2945 -2021 815 3335 21114 22959
23056 22959 10499 -15160 -22902 -26475 -24906 -15176 -10052 -455 8657 4468 -5157 -4833 -5600 -5534 -18283
23041 -18283 -21763 -25956 -10528 -7915 -9958 -12897 -15905 -16293 -9031 -9302 -8656 -4146 -11935 -3403 -581
23026 -581 -1986 3939 -801 -16652 -22958 -18839 -9265 -256 11265 8798 -8208 -13909 -2273 2495
23012 2495 -3407 -2438 -5445 -10728 887 -2062 -26581 -27913 -2594 11097 25063 24830 12304 -1903
22998 -1903 -3349 -9019 -23257 -25226 -17373 -22853 -15066 -10187 -11123 -6381 -2711 84 18551 18545 11214
22983 11214 11529 5355 -7283 -16316 -17741 -21513 -30154 -19353 -25859 -21437 -3978 10536 9182 1826
22969 1826 12116 15585 20774 10662 6310 -7237 -13898 -2883 10948 12678 -9974 -18776 -18279
22956 -18279 -6276 -3771 -15768 -25517 -23917 -16993 -12569 829 -5890 -7467 -10923 -21009 -17163
22943 -17163 -3469 16942 14367 -4470 -12869 -1392 16323 14500 4810 -18704 -25638 -2160 15640
22930 15640 -9 -465 6075 -638 -13237 -27832 -26763 -14460 -8357 -3606 -1532 -12554 -17974
22917 -17974 -22337 -13687 -13887 -18316 -29377 -31245 -16712 -10832 5009 9183 -4382 -22982 -19978
22904 -19978 -257 -2737 -2461 -6976 -187 17589 20601 6494 -13456 -1583 2230 -3076 -482
22891 -482 -4384 -12225 -17080 -7030 8043 1297 -11050 -12254 -8065 -1107 0 3362 -12111 -15899
22877 -15899 -20814 -6307 4065 -1631 -7945 -4455 -8800 -798 11608 8508 7613 -12 -4672 1743
22863 1743 7661 16276 131 -18328 -5359 1705 4077 -1413 -1725 1821 9566 26605 29562 21782
22849 21782 24351 21745 14420 -2618 -22867 -21296 -22185 -17061 -17398 -9357 -1773 -4389 12510 12601 -4936
22834 -4936 -4255 -3415 7565 -5743 -9045 2128 18206 12527 11413 1255 -5412 5706 12565 6523
22820 6523 -3340 -2664 -1630 -2412 12184 -1279 430 1871 1097 354 9674 5850 16565 24561 17030
22805 17030 12122 3132 -2293 -13897 -11038 -12968 -10762 -16703 -14028 -12527 -17794 -17751 -14047 3724
22791 3724 3735 -643 17411 26620 29896 17989 -939 117 18995 11903 7567 4783 -9878 801
22777 801 13072 -5425 -9942 -7588 -23050 -25495 -17568 -23471 -19265 7726 12866 16796 22448 27901
22763 27901 26192 8166 -2428 -11967 -20489 -10650 -17611 -21520 -21510 -13289 -7401 -11983 2499 14500
22749 14500 6210 -445 -11170 -6465 1695 1266 -309 -2191 -5045 -10839 2156 3817 -6440 -19883
22735 -19883 -17050 -6532 52 2909 -1905 728 12468 10491 17964 9501 4632 1434 9730 6650
22721 6650 -14499 -16973 -4704 3257 12939 8737 -4677 998 16592 20682 9436 7267 11131
22708 11131 20207 15817 23075 35540 25857 16672 22060 16041 2425 7121 13559 15892 11618 5604
22694 5604 4415 12212 1229 -17382 -31144 -32179 -29677 -20200 -10703 -4260 -953 11682 2279 -27245
22680 -27245 -30386 -11978 -14058 -21952 -34236 -41071 -23200 3125 9558 -12231 -13716 -6543 -14207
22667 -14207 -15698 -5771 -6982 -24186 -26634 -17338 -6112 -4814 -3884 -12063 -403 7054 12278 6503
22653 6503 4634 2147 -6543 -17280 -17906 -11794 17732 18752 7404 2955 7327 13812 7674 -9240
22639 -9240 -24229 -15514 -9051 -10814 -9807 -7367 -13964 1332 17689 7979 -8369 -8170 -6220 -13719
22625 -13719 -28991 -42588 -38736 -24097 -25546 -38640 -43801 -44165 -33104 -23145 -29755 -38554 -28599
22612 -28599 -14996 -10204 -11654 -9092 -4988 -10278 1111 2641 -6184 -2306 3414 7486 -3620 -7909
22598 -7909 3393 -4128 -18440 -30211 -16045 -14950 -32531 -36957 -30992 -33275 -30874 -20076 -6044
22585 -6044 3156 3666 10949 5157 -223 -11537 -19702 -15530 -8493 -17405 -21498 -18233 -11685 2455
22571 2455 5907 -2681 -24496 -22328 -3953 7838 6683 -6092 -1007 6157 3092 2819 -4647 -18709
22557 -18709 -15784 -24818 -25992 -27436 -17294 -3101 8588 -2747 -4461 -6012 -9743 -11096 -17824
22544 -17824 -20776 -6942 -3603 -23 -4194 -16764 -20430 -7904 202 2712 4512 10649 17688 18121
22530 18121 11704 -2498 -22167 -30585 -28986 -15773 -5425 8216 12250 18362 18162 12851 -1248
22517 -1248 -5606 4030 14592 6362 -1496 6656 13142 14811 -3481 -17409 -25227 -19979 -8878 -659
22503 -659 6013 16696 12993 21448 18951 9333 7505 -6470 -7412 9542 18602 8462 -12849 -20918
22489 -20918 -15059 -12211 -8749 -8538 -7581 -7131 -1120 364 1116 -2658 9926 7893 3866 -7599 -4702
22474 -4702 7603 4381 -5666 -10659 -4614 3102 4724 -3574 -8956 -2612 2332 -3435 -13581 -13049
22460 -13049 -9439 -12136 -18686 -17959 -9547 -1227 6343 -3719 -9675 -13842 -11014 -3701 -4022 -14039
22446 -14039 -5255 -5899 -27336 -30520 -23090 -14100 -3701 -8670 2378 -12377 -11831 -5607 -2238 -9395
22432 -9395 -16512 -19974 -27975 -28367 -11388 17418 23394 12401 21379 17291 -3639 -13445 -3480 12420
22418 12420 7742 336 15836 18809 18675 7470 -13190 -25272 -12450 6270 10007 17331 19820
22405 19820 6530 7743 -6686 -10953 -24116 -34994 -24706 -8866 709 -19634 -12246 -4637 -4773
22392 -4773 7010 13500 945 -6472 176 14810 24814 16917 -2034 -9490 -2325 3620 12972
22379 12972 10594 2277 -4852 -12257 -18209 -13078 -8022 -7007 3381 4175 -4404 10010 3717 -881
22365 -881 -6018 -4972 -4606 -13132 -6156 9738 20270 17890 9969 14191 10994 -3366 -14466 -3660
22351 -3660 3060 4951 2266 11580 1250 -18233 -18351 -6624 5148 5938 -3124 16586 15118 5975
22337 5975 -4477 9412 4642 -10151 -11865 -21622 -10527 4450 -12889 -15008 6243 9021 8467
22324 8467 11161 24124 31409 27109 16871 16201 -2212 -10480 -679 9787 9762 6552 -9955 -9860 -21792
22309 -21792 -19392 -8525 3741 3307 10593 26591 23812 4966 -7557 -15438 -19873 -26781 -34000
22296 -34000 -18300 -24617 -26825 -20707 -14370 -17492 -9961 -202 14864 8751 -4210 -9178 5085
22283 5085 -3448 -13254 -11862 -4813 1145 436 335 -11071 -2791 1186 2815 -5624 -19086 -24643 -13254
22268 -13254 2696 -1131 -11162 -29752 -34245 -19505 -16537 -32918 -30511 -7071 -5543 -2589 -9594
22255 -9594 -15095 -22985 -19870 -18999 -15116 -7681 -9589 -6302 -3127 -9573 -10185 -1322 -1492 -8274 -7083
22240 -7083 -142 14335 2361 -12607 -16393 -21360 -29555 -33510 -15791 11131 6278 -17901 -26404
22227 -26404 -10328 -9608 -12701 3027 16831 26512 33561 29539 20054 5374 8460 5363 5714 12192
22213 12192 -397 963 3399 14446 13464 3878 -11541 -12430 -19837 -24150 -13133 -7632 2738 9866
22199 9866 3525 -4820 -3142 4589 3843 -368 -8479 -6324 1954 11403 14305 1655 -9900 -20100
22185 -20100 -14502 -15491 -19680 -20301 -18533 -17071 -15916 -13380 -21068 -23990 -20280 -8231 -3877 -516 474
22170 474 2850 -668 -8069 2270 -639 4507 21489 19517 13630 12337 17858 6573 2530 11075
22156 11075 18508 13789 10089 9880 4913 -4585 -9155 -7881 -10848 -6839 -8555 -1679 5560 4659 -35
22141 -35 -4977 -11906 -6206 8090 4413 14389 28198 14828 13269 14535 7600 1868 66 -1538
22127 -1538 -8092 -8860 -4139 -9277 -11758 -3811 -17306 -5142 -6376 2718 2589 -4894 -1935 11063
22113 11063 7112 6911 14473 11602 270 1607 -1923 -11503 -12796 -4319 10073 4899 1177 -3411
22099 -3411 -12494 -2966 -12779 -26302 -27452 -8111 9066 653 3147 3732 3654 8997 -3395 -1363
22085 -1363 8645 18472 16767 12810 8062 16946 22240 9666 5030 10215 3906 -67 -7 -1806 1265
22070 1265 15799 10344 -1548 -16946 -25251 -23792 -23873 -22461 -15704 -14446 -21442 -1769 20893 19544
22056 19544 -5745 -7431 -14424 -7612 8216 5157 12139 1109 -2558 -4022 6828 8500 5766
22043 5766 -860 1669 -79 2411 -1627 -5083 -5004 -9931 -10208 -17208 -27015 -27146 -30063 -15906 -19932
22028 -19932 -14562 -7016 -5935 -20211 -31966 -28560 -23163 -27549 -25804 -25091 -19292 -17975 -19511 -7021
22014 -7021 7596 8099 9996 11436 7492 -9377 -22609 -20708 -12605 -20057 -27582 -31547 -18231 -25804
22000 -25804 -34058 -14173 -2255 -1418 6341 -3323 -6730 -6575 -2313 -336 4929 18202 14117 5326
21986 5326 2037 6032 -3481 -14379 -26803 -33333 -28040 -21249 -19417 -10321 -11785 -4738 -3276 -19749
21972 -19749 -37605 -28240 -5255 5890 -9042 -31148 -34610 -9525 -3637 -9840 -15730 -26028 -11642
21959 -11642 -1911 11197 12934 15666 6075 4504 121 -19266 -21674 -13320 -19867 -19801 -3506 2377
21945 2377 -1448 -19695 -25298 -11233 -4644 -1607 -1513 3472 -826 -8293 -15005 -9157 6457 12254
21931 12254 15141 13562 21287 29217 30841 12854 2705 -5410 -5250 -2257 -12883 -51233 -40625
21918 -40625 -13942 -4706 -5290 5696 -1237 -8200 -7979 -2551 7710 9526 1751 -2605 -5750 -5896
21904 -5896 873 31349 39121 29041 5740 2104 4087 6014 -4242 -21632 -11659 1884 14532
21891 14532 24206 11925 -5243 -1394 2384 -9887 -6780 6808 9588 5735 4345 9939 1571
21878 1571 -11334 -11341 -4857 -16628 -16922 -4901 10969 17198 11675 24900 22649 32664 30168 24490
21864 24490 17469 20778 12819 11565 24065 16920 7129 -85 548 -4584 2223 -12251 -20315 -17351
21850 -17351 -7867 -17567 -14263 -77 2345 -1067 6018 2695 14208 9812 7630 13454 15847 9842
21836 9842 3022 11409 947 -9978 -17270 -1824 952 2382 18439 14982 -1392 -17047 -21185
21823 -21185 -11133 -14246 -11586 -18246 -15501 10846 16767 10704 1084 1832 -5078 -1379 2125 -27846
21809 -27846 -32805 -29258 -32636 -37280 -23049 183 7861 7822 28577 33933 33191 31527 22513 17116
21795 17116 12574 2985 -4394 -12870 -18797 -19891 -17226 -5561 -119 -11519 -5623 954 5974 752
21781 752 -12132 -5017 1590 12600 12370 20069 13613 16054 24272 19264 2278 -15576 -19901 -22196
21767 -22196 -22300 -5689 1339 11775 18987 22098 14288 7616 5805 6537 14093 11532 13989 12366
21753 12366 9262 8476 -2810 -12050 -190 16044 26895 43759 24844 -1985 8 8163 6682
21740 6682 13855 23979 39078 24284 10421 480 -2955 -3451 -1406 -761 7678 7794 4188 -8322
21726 -8322 -19896 -16959 -6353 -14694 -8541 -3461 -50 -1961 -18106 -20914 -11715 -20706 -18304 -5395
21712 -5395 11326 2458 -5537 3857 7393 9197 -1362 -9183 -3058 -620 3402 -6058 -7926 -10391
21698 -10391 -15861 -17585 -21918 -30470 -25587 -19709 -13194 -37464 -27566 -21751 -8949 14098 6926 -1664
21684 -1664 3353 9462 14195 14675 1095 -14578 -14678 -10610 -14906 -17446 -20200 -14815 -5582 -3865 -8918
21669 -8918 -15965 -18324 -13984 -18072 -22971 -5035 7183 20417 10081 -8528 -9453 -5526 11632
21656 11632 8537 4446 -9893 -16617 -9190 12701 28234 19199 615 3830 -2245 -21220 -22538
21643 -22538 -20832 -18485 -16387 -4117 10911 12646 3689 -6902 -4043 -4025 -10225 -24011 -15977 -19592
21629 -19592 -22044 -3189 19775 27576 16330 25035 13631 -2185 -2443 -11975 -30332 -31726 -28555
21616 -28555 -28130 -16322 -1232 7062 256 -16850 -14657 -7033 -7671 -10877 -11223 -22438 -25466 -29195
21602 -29195 -23353 -26825 -13208 -15775 -22621 -7784 -417 13664 18557 -285 -8262 -8412 -23905
21589 -23905 -39486 -33811 -32175 -8636 4970 10128 16410 9688 -4107 -9293 -6190 -16649 -12233
21576 -12233 -11544 578 8596 13965 30578 15896 10627 19977 28891 23201 29824 35805 38194 15918
21562 15918 -14741 -15282 1500 12540 8045 -8237 -20281 -26090 -22020 -19723 -12667 -28677 -25361
21549 -25361 -22452 -17643 -7590 -3999 9479 10686 22694 24761 15375 -2082 -15263 -406 18163
21536 18163 16750 6649 373 889 9994 16486 956 -13332 -26575 -29520 -6689 3980 -4615
21523 -4615 -5661 8695 6995 -1693 -10138 -14683 -5603 -8356 -1474 -7056 -9087 -3838 148 270 -6116
21508 -6116 -7696 -2386 8929 118 -4653 151 1886 4384 8242 18444 9227 -85 -19544 -14720
21494 -14720 -20722 -41784 -48866 -38113 -26379 -19832 -18125 -13105 -10171 -1325 -6453 -20041 -19037
21481 -19037 -8703 7236 10485 -3494 -19131 -17681 -14815 -24126 -19236 278 4930 -13670 -9695
21468 -9695 -12832 -26171 -16992 -18281 -10838 -13900 -22197 -34361 -34572 -3253 -1762 -10991 -12302 -855
21454 -855 418 -3373 -14023 -15232 -14187 1722 8451 6319 7670 21231 24248 12426 -9499 -18838
21440 -18838 -9357 -637 8730 14036 18199 11413 9163 -8230 -9874 -6364 -1059 16547 10388 3269
21426 3269 2151 -4433 -30599 -40315 -17512 -12747 -13325 -16162 -23497 -23454 -27666 -36837 -38588 -20687 -18616
21411 -18616 -13445 -17549 -15948 -4148 94 -17211 -15407 -16672 -1024 -69 1082 11418 13440 10906
21397 10906 9864 11432 8753 -10873 486 18725 9205 6141 5819 -7184 -1574 8086 10874 2054
21383 2054 -8765 -16860 -20370 4120 6366 13373 9296 -3018 -8451 5803 8839 2662 -737 2672
21369 2672 4383 1691 8648 6689 -2960 -14128 -7984 -1830 -2013 -6279 -7036 -1858 4485 21524 28902
21354 28902 16483 -850 -4251 -10271 -25257 -28338 -16832 -13496 -7829 400 -13607 -10019 -2129
21341 -2129 170 -10894 -14785 -1233 1152 -5846 -4820 -10986 -431 -1411 -14333 -14115 -5842 -13717
21327 -13717 -18791 -14014 3195 9434 5122 9684 12436 4112 520 10960 8661 -8230 -17679 -22978
21313 -22978 306 17120 13962 806 -16136 -12225 -20165 -15803 3665 863 -10934 -11629 -4146
21300 -4146 -17090 -15036 -8314 -6031 -5492 3411 698 -26621 -28180 -22184 -21162 -11895 -4428 5337
21286 5337 18223 26140 18975 8277 -3889 -11635 -24214 -21847 -21663 -7325 -4949 1737 -9950
21273 -9950 -7494 -3793 2230 -8467 -24102 -36192 -38756 -19555 -9676 -18670 -14879 -8467 -11246 -21203
21259 -21203 -7460 10575 21934 24420 15481 11142 2538 -3980 5211 5888 6345 17815 6253 -5154
21245 -5154 -10277 -3915 2633 -5321 -10382 -4501 2608 8232 -2083 -11275 -9904 7674 10399 16323
21231 16323 11630 2733 1252 -9735 -22652 -18660 -3595 1020 2343 556 132 8539 18162 -403
21217 -403 -14234 -13213 5635 8122 5226 2812 14596 10028 14037 8975 7856 65 -4164 -1086
21203 -1086 -2836 -2571 -10373 -16462 -5471 788 1807 -18562 -22222 -20996 -13343 -5062 -1265 -6823
21189 -6823 4635 9292 16773 14692 13364 8297 2640 -4470 342 -15896 -14236 -5891 -16539 -22646
21175 -22646 -16449 -4309 1307 -2675 -28169 -18510 -5070 -8205 -16889 -8988 -12860 -6850 -69 -4327
21161 -4327 -8639 -5476 3521 -5860 -11023 -5094 -6258 -29190 -32088 -12396 -7916 -8278 -22063 -11800
21147 -11800 -8690 -14219 1693 10944 11347 21650 29711 23953 15854 12191 -7379 -83 12181 14909
21133 14909 11967 13774 10547 14940 10433 7596 6400 7977 11255 13564 9384 -11483 -22264 -13822
21119 -13822 -16364 -32926 -39395 -37658 -19542 -4757 13845 25488 7209 4218 3783 5170 11940
21106 11940 13349 -4480 -17159 -37125 -36724 -23909 -8682 24 -3658 1083 11148 5695 -2698
21093 -2698 -3806 -6036 -121 2027 -4488 -11402 -6027 -6329 -24683 -21611 -5741 -7911 -4353 -14704
21079 -14704 -7257 14537 21929 24576 13702 8273 4518 13634 4426 677 -12351 -16667 -13070 -17469
21065 -17469 -19653 -5703 270 1648 5404 9632 9823 20090 20348 9325 7386 10980 -10508 -14633
21051 -14633 -5755 -12568 -2855 3865 -4523 871 -1516 -1385 -3722 -1764 -7326 -10572 -5998 -13335 -11325
21036 -11325 706 1623 -12782 -16898 -18836 -22474 -19813 -22349 -26552 -22023 -10473 -11813 -8676 -10549
21022 -10549 -10257 -4474 -3214 1559 2611 4642 -6447 -5631 5939 -8814 -8260 -13748 -11894 -12889 -20484
21007 -20484 -36652 -37600 -17815 -4227 -3592 -5180 -4482 1901 -7863 -6178 -14957 -21038 -17233 -11239
20993 -11239 -4005 2703 -16879 -9699 -2521 -4086 -8974 -15649 -17662 -13797 -655 997 154 -5976
20979 -5976 10203 28333 24015 17758 18231 20886 11842 12958 17843 21327 18032 13445 529 -6511
20965 -6511 -11239 -9376 -9406 -11020 -20595 -41712 -35972 -14757 -9680 -10079 -5781 -7758 -15388 -23530 -25098
20950 -25098 -5939 18547 10492 2732 -8889 -2146 9464 4776 -7445 -13448 -6689 -3629 2647
20937 2647 -4202 -7688 -10606 -5218 -7309 -4360 -9373 -8690 -10355 -9714 -5565 7683 12526 5962 -3242
20922 -3242 -7806 -8422 6179 2577 6764 12673 -9265 -13006 -9465 -1419 10008 29132 32740 17699
20908 17699 3260 -4100 -5979 -8523 -11779 -18855 -6583 3201 -1027 -9133 2009 -383 -17140
20895 -17140 -27449 -28799 -29715 -34601 -34782 -21367 2824 12070 2470 -16500 -28493 -22996 -14954 -7471
20881 -7471 -9455 -13302 -17289 -15362 -5422 2584 -4408 -17532 -28902 -25826 -14074 2547 5198 -3646
20867 -3646 3473 -89 2027 18057 18237 15891 -751 -9598 3994 13146 23998 21917 15621 10685
20853 10685 9646 -3507 -11949 -5597 5438 5897 -4380 -20565 -32860 -25944 -11822 -4138 -1137
20840 -1137 -9442 -11105 -7402 -13688 -9126 1340 1755 -3727 -6943 -23187 -30440 -13998 -10379 -3276
20826 -3276 23509 25161 9722 -2188 13219 27833 20321 1341 -13263 -8691 -13094 -12045 -7345
20813 -7345 -9817 -24901 -26824 -18579 -4226 -5934 -134 9359 8888 8020 3261 -7134 -2793 6233
20799 6233 2004 1943 3067 1167 -1283 -7565 -13392 -4508 -778 -2729 -2074 -10194 -11711 -6971 3696
20784 3696 11094 8763 -381 -6912 -3439 10473 16854 5953 -13748 -1008 5236 -11102 -6958
20771 -6958 3181 4124 3191 8108 25198 24704 8302 -1802 -6439 -10673 -4788 19777 30249 -727
20757 -727 -19810 -18884 -4746 2437 -8271 -7564 -6539 1718 5410 21812 24967 7944 11312 15087
20743 15087 7132 8373 -3309 -18729 -22135 -21299 -19912 -5103 -10284 -12790 -8318 -9768 -10246 -7956
20729 -7956 -6398 6367 22503 13641 -50 9071 18732 6340 2228 -650 -6048 -8715 -15902 -17027
20715 -17027 -27679 -29706 -28438 -26750 -16353 -2966 2099 3738 5987 -1283 -12063 5247 945
20702 945 9495 14661 14235 17216 13901 28650 24024 -6310 -18013 -17653 -26595 -25531 -3799 -9579
20688 -9579 -20831 -22345 -11845 -12705 -25630 -20769 -15487 -32214 -36937 -22263 -23178 -29377 -8115 17773
20674 17773 20725 10264 2919 -2799 -742 -8786 -14799 -7236 -888 8946 13149 68 2144 -10559
20660 -10559 -3527 11736 8161 2455 14760 19907 11156 -3760 -20449 -13535 -633 9707 2392
20647 2392 -5652 -3829 3926 6590 -8392 -4945 2602 7582 2583 9160 10924 11929 8723 -13261
20633 -13261 -14168 -7385 -6609 -17995 -30973 -17387 -12610 -9858 5558 4230 13166 14768 15110 1747
20619 1747 -9015 -12942 -17633 -15284 -12517 -14780 -8046 -15750 -15768 -4266 10798 10709 2254 8393 4723
20604 4723 3026 -3487 -11334 -3562 -11949 -15935 -19121 -28308 -19109 -1134 -6990 -7649 -19851 -20891
20590 -20891 -7075 -699 7574 6192 -9511 -18628 -20188 -28476 -18818 -1992 1434 -2019 -19382
20577 -19382 -18456 -14914 -18238 -19858 -16484 -17496 -15400 -9587 4837 3143 -5723 6486 22020 25148
20563 25148 25107 38254 41722 50547 37583 24482 16450 3599 21060 14099 1836 15557 16242
20550 16242 14306 13986 9708 11699 2024 -3688 -11853 -11442 -17001 -16065 -23116 -31077 -17320 -12583 -4640
20535 -4640 1258 -1717 -14255 -15305 -7814 -7534 -1685 -948 7092 -2554 2743 -1145 -3767 9941 18790
20520 18790 6330 -13162 -11701 -15188 -12160 -5122 886 -10352 -24619 -28019 -20465 -9417 529
20507 529 1257 -7164 -1286 -9613 1511 15524 21035 18010 10063 6477 12209 8431 14507 10269 1486
20492 1486 12309 20478 16407 6525 -384 -4572 -3145 -4530 2372 16919 18299 15860 18908 19077
20478 19077 14140 14352 18335 16455 3971 -9123 -11385 -5901 -6273 -4085 -16369 -27525 -11426 -15662
20464 -15662 -14595 -2983 -4454 -6097 4067 19074 22573 16425 26687 25094 22727 9254 472
20451 472 2419 10428 16716 1309 -19932 -26117 -17415 -3378 -169 -12220 -25635 -21485 -8728
20438 -8728 -7261 -10148 -13460 -14478 -18801 -7344 8261 7683 -6112 11292 14899 6541 5583 6854
20424 6854 4337 3015 -5630 -7444 -9782 -7915 -6975 -19671 -14489 -7995 -9690 -12203 -19694 -15050 -14030
20409 -14030 -14971 -13439 -1967 -11463 -9070 -11558 -19712 -4424 15304 16077 13629 -72 -19551 -45069
20395 -45069 -41437 -19570 2941 -4008 3209 6223 13651 1063 865 4152 -9338 -2140 3946 -713
20381 -713 -13265 -11933 6607 25658 29055 14327 -4090 3108 6825 -13240 -19805 -12774 -14832
20368 -14832 -14163 -27840 -35912 -33977 -32200 -38905 -36116 -27518 -20872 -18246 -18572 -7866 -8530 -10661 -13120
20353 -13120 -26046 -32647 -13385 9668 1243 -12174 -18586 -9255 -9964 -3581 5586 9510 -7890
20340 -7890 -21715 -11253 -8022 -20005 -22960 -15689 -22592 -24086 -21343 -21583 -15768 -6891 -9325 -21686
20326 -21686 -16555 -11890 -17184 -27708 -20065 -2377 6604 3652 -12291 -23036 -18405 -14774 -10941
20313 -10941 -8986 151 14348 3311 -13015 -17082 -8560 -2053 4342 2194 -2181 -7022 -3868 -15717
20299 -15717 -12860 -11210 -17153 -10899 -4301 -4417 -7373 4584 11703 6124 5091 -5794 -5050 4245
20285 4245 2002 2037 -4896 -8436 5696 -500 -6080 -15723 -12052 -19534 -24906 -13017 2162 3428
20271 3428 210 -5726 -15499 -22022 -22466 -15262 -20036 -22298 -11234 -23944 -25747 -2175 16922 6698
20257 6698 328 3731 4593 -5882 -13857 -6430 1848 5969 427 -9187 4008 8401 3794 -4018
20243 -4018 5929 7686 10242 8847 -6258 2235 14427 11766 -6021 -5871 -998 -2502 -455 -2941
20229 -2941 -6786 8909 1498 -22303 -32012 -31287 -15369 -7418 1522 967 -18625 -6433 -6198 -6558
20215 -6558 -9779 1711 4353 -6215 7953 15445 11691 23278 21203 13601 2199 7448 -7655
20202 -7655 -1729 10332 -3528 -7589 -12451 -7500 3408 -1535 1494 -5268 -8157 17611 19080 9252
20188 9252 9331 4679 -10493 -1734 23865 33907 3677 -12653 -16786 -10981 -17102 -32865 -28262 -35125
20174 -35125 -40016 -28275 -11995 1606 -2820 7996 -5290 -5414 -1229 -888 7076 16110 10007 -4049
20160 -4049 59 -12865 -4362 7415 12286 4590 8914 10129 29757 24436 16188 -1696 -12588
20147 -12588 -21234 -20164 -10679 -12086 6840 8506 1035 -14762 -22532 -2978 -2397 2771 4186 6669
20133 6669 -8678 -11485 5716 -527 -1339 -6213 1061 8304 12510 17729 13690 -3683 -2969 -2229 8143
20118 8143 15615 4824 3766 2002 -15485 -7296 3811 -2375 -17727 -8347 13056 12690 2766 3037
20104 3037 6887 19374 20064 20239 1677 -8214 9365 9478 14858 2828 -2240 5502 7478 10725
20090 10725 -16895 -30861 -20584 -1351 -6130 -7092 -18675 -32513 -29565 -24579 -13443 -4032 -11523
20077 -11523 -18425 -25019 -21830 -19837 -16509 -11227 -14817 -19374 -18239 -10541 1642 -604 -13355 -14042
20063 -14042 -7885 418 7342 2845 6462 11030 13272 21058 27273 23192 10120 -411 8393 -3263
20049 -3263 -1328 -8176 716 9681 -7505 -16488 -13263 -9339 -3500 2664 -4678 390 -2181 3831
20035 3831 4484 11992 17547 7247 10819 6255 -3055 -378 6477 5428 4178 -3014 -9883 -2922 -11846
20020 -11846 -9334 -3990 12920 20587 10812 -3975 -14040 -18507 -28957 -15839 16841 36699 34468
20007 34468 36179 18237 -5615 -4492 -13697 -9264 7478 13702 -839 1530 -2260 -2469 3731 5865
19993 5865 768 394 8884 12455 2957 -2668 -4775 3442 95 -3405 -11012 -9342 -13466 -21740 -28674
19978 -28674 -32708 -16310 -593 7270 2979 7170 14519 18958 12373 6641 7399 8464 2499 5447
19964 5447 199 4159 -1563 -8963 -19272 -25874 -37210 -27706 -16399 -14999 -5006 1511 4709 287
19950 287 2822 7088 12949 15494 7450 5008 -7911 -11950 2126 10457 7339 -7531 -10037 -10389
19936 -10389 -26638 -31577 -21479 -21003 -26953 -19902 -13688 -10866 -3790 -1304 1474 7849 4767 -952
19922 -952 -264 -5466 -5737 -6000 4860 -660 -5674 3015 8033 208 -7027 -5316 -4135 -588 -7450
19907 -7450 -662 2895 -11272 -16531 -17441 -18565 -12145 -5482 3495 11609 32871 23351 3742 -2138
19893 -2138 12899 15247 -3714 -13996 -18701 -9203 10638 15419 14656 20443 20024 2946 -4026 -6395
19879 -6395 -11650 -2340 -928 -21450 -23059 -11633 -10149 2058 12284 20936 24290 13516 6957
19866 6957 14024 11019 11312 3668 -3476 -16525 -19836 -9980 -4810 -4083 -2052 5381 4254 -4515 7674
19851 7674 7832 -1883 -11140 -8544 -5049 5341 94 -7989 3179 22890 16726 17478 10850 8415
19837 8415 4286 -10456 -14014 -6252 3976 10191 3490 -10836 -1044 -7317 -7246 -2912 -2662 -22203
19823 -22203 -31204 -33621 -26090 -22166 -31866 -41140 -39717 -13572 1824 -305 7289 12466 -548 -993
19809 -993 5141 2191 2656 5182 -2611 8935 32683 40180 33004 15989 6082 12780 22010 18642
19795 18642 19599 5209 -5676 -6268 -14633 -20985 -21659 -22970 -30436 -29848 -20166 -10378 -9258 -12166 1218
19780 1218 19892 21250 14713 10538 5332 -1445 -330 7336 14868 10772 4691 15634 10837 7770
19766 7770 2176 -1793 -8476 -7135 -16679 -12276 -644 -1841 -8999 -1205 -2316 -6363 -4257 -4278 -277
19751 -277 3453 20578 29125 18261 -830 -2775 4101 -1142 4166 -3363 11273 3582 -7710 -15434
19737 -15434 -17026 -14957 4170 1312 -16175 -14269 3641 4141 2678 1055 15445 17694 20522 7535
19723 7535 -9231 -20728 -21307 -20972 -9435 15720 23785 19622 -4397 -5269 -6249 -15330 -19139 -18642 -14930
19708 -14930 -1722 -3265 -11721 -7733 7848 13599 18547 18633 4479 4945 6624 7535 -1985 8221
19694 8221 14873 5919 -10018 -19877 -16189 -8383 -628 1922 4697 -10142 -20461 -13262 -10614 -6244
19680 -6244 -11493 -9272 -4223 -19397 -25670 -10610 -1902 572 2587 -374 -2361 2403 778 -17717
19666 -17717 -16027 -18522 -14861 -18221 -39239 -48186 -45149 -41579 -28354 -21576 -26051 -21448 -14715 -10234
19652 -10234 -7811 -879 20588 17145 6821 -1957 -20837 -9558 1899 -2486 -9640 -9923 -22481
19639 -22481 -19911 -16629 -1386 1593 -13015 -22544 -10668 4008 22395 24009 7532 2893 223
19626 223 -29 -3897 4934 11699 15051 16732 12712 9361 11447 13559 15706 7908 -8438 -10170 -10234
19611 -10234 -12479 -15338 -12753 -24599 -38068 -37790 -18189 -11087 -17369 2611 1569 -10604 -12527
19598 -12527 -12216 -8960 -2145 -9471 -10136 -8239 -7505 -1886 1970 -3570 -12004 -13383 -1230 12769 6577
19583 6577 -7633 1225 14954 10538 293 870 -4951 -17204 -10613 7190 6122 2921 -1289 -9829
19569 -9829 9174 10430 -4529 -2228 3730 561 7817 16419 3682 -539 -3552 -8974 -10887 -566
19555 -566 12098 17906 4265 20 -14566 -24468 -28816 -27481 -20431 -31918 -25338 -17006 -13306 -13086
19541 -13086 -21176 -25029 -26530 -32094 -19350 -17368 -15610 4842 6863 -7816 -3553 10350 1394
19528 1394 -12151 -20606 -11017 4899 -4581 -11380 -19781 -18425 -18737 -27015 -34498 -41783 -30830 -20452
19514 -20452 -22749 -21992 -15238 1002 4881 6445 5011 -3281 457 9738 2890 1579 -5288 124
19500 124 2916 4612 12711 20773 26725 17059 2938 4726 16518 7216 821 4389 -5937 -7812
19486 -7812 -7432 -7829 -19828 -6789 -3070 -16489 -17103 -6471 -8379 -14736 -12683 -2627 -7082 -768
19472 -768 10900 8739 6311 -50 -7666 -45 -1335 -3689 -13962 -3147 -2618 -22834 -23533 -6196
19458 -6196 -3378 -5930 -2948 2365 4928 4381 -4542 -5584 1474 623 5105 15761 25247 10013 -5053
19443 -5053 -1555 8715 13384 21582 17195 -5877 -24857 -35939 -25484 -16387 -13745 -16965 -15355
19430 -15355 -21174 -25406 -18359 -7590 -6330 128 3496 4689 -11070 -16532 -12638 -16402 -19353 -12053
19416 -12053 -12910 -17723 -4966 -412 -13722 -26385 -10860 9596 8159 11992 17105 18233 12175
19403 12175 4300 6404 6985 -1439 -17598 -13139 -4835 -6149 -6077 -9932 -10532 -10458 -3343 12435 10505
19388 10505 20576 14191 6196 18561 3722 -3475 19607 11141 14559 14020 10481 -3240 -19125
19375 -19125 -19463 -19832 -1516 2769 6720 6212 1068 -5253 -15097 -17565 -15446 -9456 -6822 -8983 -9548
19360 -9548 105 -668 -3734 -9840 2898 9786 5075 -953 -1700 -13669 -19774 -29839 -24067 -3858
19346 -3858 1386 7521 14087 5840 -1644 24420 27102 15681 10692 7517 1858 5387 15262 15036
19332 15036 10552 4461 -1612 10213 3717 -4633 -8147 -5961 -5528 -8892 -5271 1645 6442 1927
19318 1927 -11362 -9695 -4893 -2057 945 -1450 924 1270 7322 1955 216 11973 9529 -9685
19304 -9685 -11997 -15495 -27324 -29266 -9989 -10323 -26754 -27128 -1555 22075 31510 33728 17270 -1694
19290 -1694 1766 -12772 -11393 -5072 -4134 -16831 -18913 -6295 -13352 -17879 -12646 -16390 -13486 2308
19276 2308 15408 13645 8991 -1607 -2157 9988 8119 -7475 -14796 -16654 -12438 -7556 2399 798
19262 798 -9686 -13987 -9663 6525 392 -7502 -17975 -31309 -31843 -15188 -14578 -19806 -12486 4221
19248 4221 -2830 -9347 -14557 -21595 -23593 -14554 -11180 -682 4041 6526 3473 9350 25454 25576
19234 25576 19196 15671 -7763 -20355 -6495 -9202 -5828 548 -4667 -5572 1620 10795 7364 12363
19220 12363 6562 5723 12158 16456 12514 -2560 -1488 -6479 -18365 -25310 -25049 -27461 -22002 -9382
19206 -9382 6540 12973 25342 28536 18734 5901 2038 -5586 13136 11923 18689 21615 24812 22865
19192 22865 16380 21125 17603 1603 7265 11299 10301 4011 5394 1632 -335 -3952 -10643 -12162
19178 -12162 -2163 23357 35302 30156 22092 15301 -1352 -5487 9643 15198 10344 15688 27191
19165 27191 29512 30668 28680 44507 44936 28368 5466 -9857 -19088 -24269 -23309 -11668 6704
19152 6704 8425 26044 30948 11708 10546 10117 4867 11939 4209 1021 5745 7847 22975 16389
19138 16389 3037 5960 13282 13884 14474 5538 7255 1757 15783 32056 17435 -1986 -5540 7115
19124 7115 9155 -4871 -22032 -16440 -11113 2083 21106 25384 27047 17279 14635 17095 3405
19111 3405 -15937 -21230 -22637 -13565 -1738 3061 -8278 -17610 -19373 -13026 -17050 -14177 3164 26560
19097 26560 33484 25823 24770 13252 3522 3396 -384 -10753 -5539 1681 3319 -725 -5767 -15958
19083 -15958 -11092 -11708 -14673 -17634 -28840 -35958 -29222 -14443 -8005 -14366 -19111 -34474 -32340 -20763
19069 -20763 -13107 -15300 -9684 -2324 -9133 -15666 -11693 -16398 -1871 4631 -20207 -21177 -14265 -10977
19055 -10977 -6513 -6389 6140 9904 11868 1641 4871 11699 15282 16860 9588 25 10508 18496
19041 18496 16778 19852 8879 -4930 -2973 -10041 -4506 -8210 -18910 -16423 -12625 -25297 -26593
19028 -26593 -25536 -12137 -1925 6162 -2168 -6370 -12708 -6343 19739 24860 15994 17301 14436 10648
19014 10648 25153 19720 15774 18110 25654 25091 30127 38157 26669 27840 26154 11606 1349 -7298
19000 -7298 -2645 527 -13627 -17822 -16400 -20207 -17629 -10272 -30938 -28005 -2846 4652 -7553 -34637
18986 -34637 -27281 -21795 -15876 -4160 3736 24107 39965 43668 36445 13384 3424 -8971 -14837
18973 -14837 -25610 -35607 -31232 -20801 -16546 -14465 -15295 -17346 -19062 -9223 7618 4667 2288 12072
18959 12072 9419 7680 -693 21064 24033 11631 24121 28614 4548 -3719 14501 27744 26017
18946 26017 16711 9427 15923 12545 13677 8034 15054 13427 2410 205 9933 17027 6667 2561
18932 2561 -1745 121 6350 11888 3258 -4068 -21528 -21816 -11796 3968 1742 985 2057 -8044
18918 -8044 -15732 -3468 16595 22239 -4180 -10212 -1637 -7223 -22373 -27482 -19667 -15773 -20454 -12130
18904 -12130 -7403 -6233 -1934 120 -6476 16082 35641 44427 35585 25882 4347 3533 11492 5451
18890 5451 13451 9124 4511 -6963 -4182 9273 13674 15105 8888 4392 8951 9156 -1919 2964
18876 2964 22668 11566 -4673 -3311 5131 11604 23495 13574 -11812 -21570 -19364 -11230 -13982
18863 -13982 -16567 -7827 -11391 -2548 10128 7444 22420 26050 14632 8717 14144 14705 13460 21349
18849 21349 20155 19108 13700 -2173 -2449 -11220 -11726 -9148 -8030 13212 20139 3088 746 -5861
18835 -5861 -13084 -9366 -978 3438 12081 18132 16281 16543 6299 7410 22363 28029 26341 19162
18821 19162 4507 -6481 2400 -8498 -4507 10005 12780 18621 23397 17996 7104 -8533 -16720
18808 -16720 -3508 7598 22262 27540 30169 8381 -4980 -5542 -1314 -1569 1970 2674 16415 11238
18794 11238 -3819 -804 2745 10182 8436 18304 39525 37298 26391 14727 2168 1773 2696 2619
18780 2619 -12272 -22740 4434 30777 25558 16748 11420 12798 23315 37092 59884 75458 102099
18767 102099 163760 223700 171822 87887 51998 33146 22963 13706 13077 24251 21597 7746
18755 7746 5585 13575 10002 5961 16505 26128 30630 12777 3850 -3265 365 9215 17211 18731
18741 18731 6921 10825 22459 21893 20377 15520 7622 -3915 -18164 -8625 -1059 8662 12397 1276
18727 1276 -19634 -27020 -23532 -9737 -1614 13130 20009 22934 32679 30114 25577 16608 13221 12317
18713 12317 6657 13669 10884 6343 1115 -10954 -11528 -18408 -16831 642 670 12507 12487 7500 4466
18698 4466 16664 19674 12984 8626 11911 18697 16027 2726 18344 20400 12974 7320 6403 16240
18684 16240 -1058 -11850 -2419 8062 12937 26426 30846 33530 24593 25258 10806 -126 2291
18671 2291 2893 10792 18990 19954 4192 629 9063 18233 21651 18685 18742 15793 13715 14292 25741
18656 25741 27974 21286 31573 36084 29958 41743 47421 38532 33768 27419 22722 23371 29992 40530
18642 40530 44563 37696 43468 45972 39669 53166 80193 135728 208578 292249 348376 292712 192439
18629 192439 143284 120532 106833 92395 105185 150955 219903 311672 377192 308873 189904
18618 189904 117099 81906 74122 61649 47241 29123 30960 27117 33442 35470 31697 33901 41811
18605 41811 40314 29605 31258 31134 35422 27789 34997 18447 21829 20491 16616 7170 -3740 916
18591 916 7760 13594 32319 55989 69636 74227 83493 119491 163017 232190 347355 376550 286326
18578 286326 209457 157828 125875 125379 124601 125564 160560 245177 362050 412776 319769 208906
18566 208906 132608 101908 98397 84508 79305 68680 46590 41053 29224 26625 18803 10410 7577
18553 7577 13514 9939 9392 15935 28538 44385 51551 47795 32538 21873 42056 53430 47820
18540 47820 38157 33252 27488 12752 15547 23118 28103 30510 32030 20958 11745 1966 -5139 10276
18526 10276 10779 -10538 -5428 24471 17013 6360 -2691 7203 18480 15873 7867 -577 11152
18513 11152 9984 11232 12459 22363 13585 15390 25872 20890 20285 23096 30976 35430 30731 34519
18499 34519 41956 52035 36745 28135 20287 25385 29955 34181 38618 31510 23009 10879 2327 5482
18485 5482 29487 23140 15174 16309 13008 14202 9760 7209 15484 20571 25180 33522 31681 19394
18471 19394 9952 -1457 9563 16633 20115 24200 36680 36405 36838 29313 20628 12487 14640 18268
18457 18268 19210 15120 20700 31089 30130 27579 22118 7656 10250 19019 19685 3161 -11899 -15928
18443 -15928 -6527 -1376 -7775 -452 11439 14080 -428 -5962 1933 2031 -9143 -17486 -817 16594
18429 16594 19433 11182 4911 9839 13985 5380 12827 20931 15885 29715 34989 38363 49310 51913
18415 51913 47541 42129 53314 67390 83393 100998 127562 178936 261168 413135 572057 601790
18403 601790 595195 529634 394127 283858 231631 216418 240025 316887 421149 538706 560681
18392 560681 515828 435731 285535 175688 113653 95403 75252 60956 50355 54515 56154
18381 56154 42434 36801 26869 31036 22295 29125 41774 40381 29467 23060 13561 6751 2750 -5665
18367 -5665 1636 19839 26511 33935 35985 28046 17383 15354 13508 12483 12372 9134 2987 9552
18353 9552 17741 22609 39775 39746 22220 30251 41487 44507 37951 28675 29283 22538 35553 36121 28131
18338 28131 26142 18284 5306 3749 5857 25533 31653 9206 1914 7305 6838 -7232 -23980
18325 -23980 -10376 6943 11489 13801 28607 28851 27638 24523 17586 7479 6883 19272 26147 29569
18311 29569 39006 29425 23505 33402 24975 26188 18847 15535 4552 -5043 12848 22244 25411 29932
18297 29932 32021 39287 41585 21719 31244 16450 14954 9675 9373 11979 19694 20382 29282 40899
18283 40899 38345 32868 2146 7038 16791 24280 27827 32029 19596 20800 15650 8419 21056 32579
18269 32579 32591 40264 37935 28880 17603 25684 29593 5225 -6288 10715 23167 30996 20070
18256 20070 20118 28411 27783 24162 7810 1298 19469 30892 23304 28530 41684 38648 30332 38261
18242 38261 22000 1891 9001 16505 37526 50994 67861 74480 72656 53583 50994 53025 49664
18229 49664 56556 38585 28360 24002 27857 25434 26007 29654 11329 22691 41459 41824 27230
18216 27230 29256 26127 19319 4158 10721 11982 8712 10731 9648 9770 2009 8941 16577 22949
18202 22949 26934 34305 26317 37403 42920 55184 56797 52002 44661 32717 31729 41676 38189 32445
18188 32445 39497 64379 68488 56577 44534 43304 52971 62977 61992 55707 51213 46514 57427
18175 57427 68355 71080 78469 76086 80472 93196 69853 63144 64717 67068 53526 34544 46321
18162 46321 73091 72551 71709 64838 60472 75540 88422 87732 89732 77538 75215 83901 94448 121173
18148 121173 123379 130925 127348 116437 119224 115523 118495 120300 135749 142472 161628 180797 188586
18135 188586 182892 180714 184548 201521 227628 264478 285345 304927 340031 377334 421793 461439
18123 461439 518848 596062 676217 778355 908291 1076353 1323088 1660749 2148098 2931305
18113 2931305 4218175 6454928 10546160 18024658 30242945 42240586 34972400 19348831
18105 19348831 10809805 6772890 4662829 3428603 2608120 2034428 1615741 1306856 1060632
18096 1060632 866461 716157 614363 543017 485743 431966 371718 320618 269825 246854 231474
18085 231474 215885 196391 177511 175632 158743 132356 124319 119553 121742 111253 98620 90554
18073 90554 94138 93578 84129 75871 89139 88853 83785 90929 81997 90492 92243 78122 52360 38085
18059 38085 42989 42405 43173 44318 44080 54433 64062 47546 47588 50525 53919 56518 43728 23622 26292
18044 26292 29630 31293 35134 26742 30896 26913 14689 10027 19391 19041 21751 20500 24241 22508
18030 22508 38519 33903 26255 21285 13801 19591 23570 19067 26189 35235 34757 33541 22131 17678
18016 17678 23190 30434 34580 14758 379 1178 8701 18485 9943 14584 25709 24810 25001 34079
18002 34079 28355 30280 28315 23105 22272 22323 11343 14050 22745 22643 25889 14922 13005 8231 862
17987 862 -5133 -15215 -8752 -5171 14362 15936 9067 24870 28512 15951 -6108 -7643 6906
17974 6906 -3976 -15174 -11752 2815 7049 12208 15128 18638 28712 20442 17990 10206 9213 10010
17960 10010 12159 29685 35180 27040 8005 7254 27533 29521 14148 17023 25754 19567 14641 31437
17946 31437 26997 19157 20425 11036 14268 23186 27549 20976 5996 6030 14685 39325 40323 28377
17932 28377 15488 13575 21738 27222 29038 22746 20244 24898 26626 19769 21842 38780 47910 47251
17918 47251 43101 44622 40765 34376 26126 24252 21251 25494 21423 13278 8193 16204 25178 41654
17904 41654 37619 22391 3357 3580 9315 5283 -1513 -6684 -18081 -8683 5307 8159 8975 9157
17890 9157 3812 3680 15316 21208 25090 25400 10530 2830 178 1080 10564 30433 37992 32182 25587
17875 25587 29061 17820 15743 20625 3478 -6389 -2529 -2302 -929 5731 -6142 -13387 -14208 -10824
17861 -10824 1504 683 6973 16619 12253 12185 29196 40379 52682 55762 50660 37497 20790 19732
17847 19732 27801 27329 29658 35769 36748 21822 -552 1782 19529 24295 31213 35570 26810 20623
17833 20623 32087 36375 35067 29853 23271 29796 37794 25724 17862 13253 19211 14948 7272 10450
17819 10450 25796 25972 23388 16535 10289 21267 49238 51704 45517 30785 19427 30559 36633
17806 36633 40312 34810 25851 30088 24089 18786 34937 41045 40619 27866 17964 14795 25316 30541
17792 30541 33651 34550 25756 27624 27900 32594 39303 36013 27636 24444 27651 26993 29134 29474 20450
17777 20450 21028 32345 37076 32642 18894 10689 4523 1632 8474 23644 29351 34104 10101 -443
17763 -443 20487 43316 52433 40396 23027 34494 35707 27632 35313 54304 67296 69061 47921
17750 47921 44223 51269 45797 34543 40634 51463 36873 45697 53767 42519 40837 42279 41176
17737 41176 50011 40203 26419 26925 33895 35106 37445 21055 26000 42817 37277 25161 25564 19395
17723 19395 515 1175 2427 15902 20436 7547 15284 33861 31785 28788 25287 25563 17038 30886
17709 30886 48675 47894 54615 51280 44091 50772 53927 59202 57995 55895 54251 58520 68886 74644
17695 74644 83487 102729 126730 185605 289134 385162 408941 410810 344526 245269 162478 130466
17683 130466 114856 94632 81148 77940 71452 79321 88679 80504 75386 73203 67057 61375 65196
17670 65196 65328 50150 37858 44049 68055 79621 63398 50444 41516 25303 33103 38909 31129
17657 31129 41012 56030 55609 66039 71352 78869 90504 88912 83201 80342 81046 82340 69699 59216
17643 59216 65165 90389 103815 160281 239500 348407 456505 476709 424270 319149 207760
17632 207760 141965 122658 121341 89304 64099 63601 47657 43106 26064 10816 21966 45676
17620 45676 51815 58001 49015 53007 50696 50106 36048 32395 38185 34158 38666 46724 48716 48367 50761
17605 50761 48838 36527 38344 38860 33460 33360 33839 40037 32260 14415 10344 17759 17300 22715 28963
17590 28963 56866 56064 57646 62157 65308 64279 54851 44029 38200 47951 52755 47142 54695 55689
17576 55689 45285 32831 38684 41326 38511 46774 54559 54061 46347 34731 28946 42960 50673 52293
17562 52293 43053 40817 40929 43764 37064 35147 43415 46833 50924 44749 31188 21158 9844 15306
17548 15306 23197 20678 28653 35964 45197 58536 54294 47587 47333 57673 57047 56554 55377 45621 49070
17533 49070 49696 53822 52791 53376 56658 62813 54966 33495 34771 51799 57923 51940 48103 46895
17519 46895 46085 56568 60570 58141 64365 64474 65937 76681 80486 93667 101323 113444 111717 108236
17505 108236 114575 123454 135227 151704 174837 219204 328514 498553 622957 626694 617186 493324
17493 493324 310220 202054 172617 158209 153590 143820 136820 127888 125107 119369 111466 113690 128934
17480 128934 172975 234355 266285 277358 227467 171524 146032 132356 115135 119160 110607 93173
17468 93173 87179 77854 85142 83435 76333 65514 69571 75014 78643 70238 62984 66337 78534 93205
17454 93205 113118 120772 131753 161036 171494 207654 299997 428518 573907 644327 656581
17443 656581 678466 607344 490510 323940 214179 170397 146749 121407 94609 86682 93663
17432 93663 86845 87720 108801 114483 109974 109473 104417 104379 108984 108628 113324 111926 114765 117976 104576
17417 104576 79234 81452 86973 91684 84556 78956 83280 82740 81841 87113 87329 78111 93280 98486
17403 98486 91442 83254 90299 102361 87872 71071 72812 77852 76850 83538 79453 68585 65561
17390 65561 68789 81397 100759 108622 116984 109588 77523 61010 51286 46054 63854 91280 102958
17377 102958 114551 118443 114488 114204 127870 136035 133116 121612 126281 135150 125155 113290 106013
17364 106013 77383 60263 65683 90390 107324 126623 139336 144300 130902 123355 120902 117010
17352 117010 111643 116103 123998 127580 125988 117188 119116 123420 136807 173246 193618 190659 169421
17339 169421 131598 102344 88273 80535 84138 72505 65481 76127 76338 74401 78965 87581 97187
17326 97187 117288 126779 125170 126634 143025 146436 171231 191512 217171 250067 295142 341284
17314 341284 408271 505505 546026 536086 464101 340588 261279 226092 203229 203110 221373 237152
17302 237152 256155 278492 310205 342962 426556 523096 569471 548179 473508 355573 260209
17291 260209 230870 225138 208113 189110 187314 189375 219070 233909 226213 214220 203090 201086
17279 201086 235197 299365 361688 388730 327547 256643 231352 228325 210864 206616 199833 188740
17267 188740 174774 187931 201949 202632 193565 191024 178224 166921 169863 160007 161257 169207 191186
17254 191186 204899 208337 223884 258536 297441 311521 299333 295527 284840 271576 257994 254310
17242 254310 252899 252738 264316 266132 267030 273380 270308 268655 259187 265241 267281 286374 336943 393575
17228 393575 422903 432843 419327 374563 339451 321906 310271 301318 300602 305158 320988 320278 328392
17215 328392 356951 375319 386386 404222 410066 433309 464961 527056 586911 687197 825057
17204 825057 930242 983446 1023874 1025752 1104228 1250593 1367805 1477539 1524263 1493413 1466813
17193 1466813 1442835 1396558 1394110 1415963 1494969 1616748 1801540 2049260 2376883 2799316
17183 2799316 3245822 3800600 4514394 5667296 7626414 10867057 16419282 26148626 42139583
17174 42139583 61844664 69637174 67310329 55433132 34646359 21060293 13994683
17167 13994683 10058451 7585064 5919978 4779390 3986885 3465726 3091249 2744235 2445720
17158 2445720 2146414 1890441 1720153 1618830 1592313 1656661 1750915 1794028 1836196 1883716
17148 1883716 1906256 1958811 1992840 1930615 1880865 1830862 1767281 1728872 1692799 1674400 1745627
17137 1745627 1902500 2105146 2292369 2510401 2774305 3163092 3624941 4157927 4876661
17128 4876661 5912050 7621035 10458997 15185986 23348723 37301926 58693298 78737095
17120 78737095 81371336 76115721 55766527 33486076 20924230 14312156 10458931 7990863
17112 7990863 6347827 5176032 4320343 3692726 3187097 2748408 2361191 1976272 1686842
17103 1686842 1480199 1336005 1235385 1140048 1093225 1076537 1117810 1177504 1147454 1103637 1009802
17092 1009802 916410 942740 966784 901937 842198 704339 593090 502303 453928 404532 356572
17081 356572 333572 314708 301382 297526 295316 284865 259274 242324 242292 250431 260236 268324 278539
17068 278539 302027 322897 322790 301130 301431 271885 238638 216019 211965 197843 191879 193267 207013
17055 207013 221678 258496 303993 348239 377741 393161 383465 337485 297634 291076 343604 413234
17043 413234 497632 490868 397166 361415 380495 456351 483419 466925 419524 341061 288299 251276
17031 251276 239963 280782 356783 433413 476333 406874 295007 214803 171474 149159 137613
17020 137613 127707 99915 93562 103313 119319 129885 121724 100089 90773 93134 102159 104712 95497
17007 95497 69426 53187 72013 89074 96276 103854 102508 84175 73540 86786 108515 121549
16995 121549 132258 132847 149103 171732 221729 257134 210562 156287 135212 124812 122729 128347
16983 128347 132739 124155 117358 133855 142840 158394 177714 198511 241037 252485 221942 184069
16971 184069 145748 114678 101181 109958 138288 144896 142660 139595 130396 116882 105232 94293
16959 94293 106337 117773 123539 126442 121206 112084 121137 100139 98918 98291 100179 87399 91088 94873
16945 94873 92847 99136 96909 88533 93251 102525 121171 115201 114457 117715 115165 110788 122695 140918
16931 140918 148825 143187 129558 138694 158494 178750 190625 191474 175317 154069 157162 157748 156041
16918 156041 144782 140223 131420 120806 136703 165633 183488 195085 213269 224776 206581 202431
16906 202431 204107 188837 182123 181792 174218 176358 181298 180439 186918 189633 164673 158230 157722 169226
16892 169226 178514 175802 158312 140870 151182 163560 163265 167185 177734 179870 170570 174658 170680
16879 170680 172780 184356 180511 183773 191965 206483 218874 238376 235427 238444 244718 247532 264346
16866 264346 263004 243739 236275 239461 250048 251190 250662 260507 248549 255863 252823 255847 263217 266936
16852 266936 282711 289524 295721 286320 280708 308414 329107 348991 364046 356090 346839 341957 360724
16839 360724 393812 427109 441268 451771 440939 441994 462153 478068 500444 545426 591922 624084
16827 624084 663860 710037 748276 820895 914342 1031431 1195092 1361416 1464217 1551268 1598122
16816 1598122 1695648 1917620 2228658 2575040 2991561 3391132 3655242 3866763 4175081 4751523
16806 4751523 5787859 7482979 10210134 14768912 22728574 36304490 56201829 71253393
16798 71253393 71858679 66059688 46507277 29310662 20180386 15363069 12710665 11379176
16790 11379176 11109179 11968922 14333226 19051500 27800383 43023056 65048479 81071680
16782 81071680 79959900 71659178 49215704 29676970 19201102 13495846 10045567 7744236
16774 7744236 6152048 5039008 4276740 3836775 3647025 3554774 3372720 3035092 2614017
16765 2614017 2189195 1918837 1797753 1659243 1504723 1347023 1142103 972967 863488
16756 863488 792436 721147 663445 630048 607167 600438 596128 593849 588143 564669 530719 493681
16744 493681 435984 411836 416343 436627 474261 525856 617004 725934 822467 844056 781290
16733 781290 651499 526537 422230 356072 315354 295645 269322 249470 231435 207680 199834
16722 199834 209251 214827 208234 190164 177965 170463 148310 150933 132763 126200 129076 127221 112667
16709 112667 97602 89893 90767 106055 109035 101411 100310 99093 87874 86943 82520 76697 86006 85314
16695 85314 78104 72153 73655 83790 93306 92025 82305 70351 76597 83474 81732 80108 75683 69385
16681 69385 75558 91479 93984 105923 119126 103382 92376 109651 129139 131866 147080 161361
16669 161361 176636 174576 159013 135544 131834 133072 142354 151113 154393 170983 197103 233979 305104
16656 305104 347805 351662 368036 346526 273130 206469 170290 156099 146459 143111 144205 151327
16644 151327 145997 147272 153096 151157 167896 190669 191545 175944 167317 176468 171026 166533 142190
16631 142190 128070 138517 143824 144474 143328 153879 151491 150602 152554 141986 150832 155461 155210 162744
16617 162744 185557 204692 208982 193147 184082 202630 214099 226158 238503 252797 306310 385789
16605 385789 515238 655253 697154 679112 672292 569837 434334 353209 309271 301555 293659
16594 293659 286915 273604 269535 270545 270959 278711 279000 295827 301436 289042 281351 283954 296114 302658
16580 302658 335217 376476 442533 517465 624863 667040 586297 525535 500153 496236 501853 521157
16568 521157 543858 577232 618557 671134 734099 827894 967190 1169507 1332218 1341648 1282428
16557 1282428 1276031 1349481 1492597 1665660 1894099 2207079 2633028 3253824 4078648 5211799
16547 5211799 7095979 10377536 16082341 25831696 40919773 54944531 47665253 29423727
16539 29423727 18208748 12600894 9631186 8005450 7099682 6637114 6625218 7125238 8380703
16530 8380703 10852137 15513468 23879256 37030466 49243391 42650554 26310436 16226383
16522 16226383 11006985 8100117 6369894 5221370 4494844 4213068 4353774 4569831 4079693
16513 4079693 3166374 2588040 2315168 2278884 2411777 2544127 2406612 2101235 1849174 1753861
16503 1753861 1757951 1799596 1908126 2090089 2352800 2755895 3324748 4064594 5215603 7215587
16493 7215587 10675484 16595471 26425157 40208902 47015644 34290488 20488000 13139721
16485 13139721 9401813 7359132 6226176 5613730 5406910 5597182 6274998 7685819 10363725
16476 10363725 15341849 24051856 36361691 42445989 30753120 18045399 11206956 7666703
16468 7666703 5620499 4321043 3393499 2732096 2290525 2015761 1745340 1468336 1258574
16459 1258574 1129910 1081699 1107798 1168692 1136644 951484 761741 626895 519306 460883
16449 460883 441096 431841 406488 392607 366391 351713 348484 355109 400554 480732 484260 405404
16437 405404 326188 296198 284876 270411 239830 215571 204806 195579 173443 151966 145524 125507
16425 125507 107985 115291 137122 152843 152088 147117 132348 117579 114128 113895 123112 129982 142640
16412 142640 138748 101150 96974 116784 115769 98969 86015 96222 101888 113408 114321 104914 114958
16399 114958 98699 82927 84020 98342 103028 95250 90596 75545 76425 69543 64798 71938 61808
16386 61808 59359 59886 64543 55115 46185 36064 33684 31464 35528 40481 50753 76618 74789 70527
16372 70527 61380 48515 45897 51701 48421 48811 64456 62031 57705 51935 57126 60115 52813 54379
16358 54379 59130 61254 69580 76969 85451 72541 62266 77275 58287 50066 72074 73396 73889
16345 73889 72825 62280 43294 35933 52334 53786 61532 60528 52685 60841 72830 68970 64697
16332 64697 74332 80744 78247 73448 65736 65890 64912 57551 50664 50707 49591 43318 30347 36266 54789
16317 54789 57459 61567 61621 52120 58972 71455 69762 78837 89202 90376 96356 89631 80517 61389
16303 61389 55274 54212 60096 54072 52542 64669 71769 75289 72853 74792 75694 81526 94479 100353
16289 100353 96620 103308 106558 117992 146582 190211 235217 332574 447232 495970 493866 447740
16277 447740 339817 267220 244908 218723 199083 184338 193657 239622 270081 307572 350497
16266 350497 410715 474265 529089 520259 471679 371924 268099 200219 165716 139029 129210 134574
16254 134574 137333 146206 150640 143590 124000 106675 88908 79058 80593 86498 105093 113854 116851
16241 116851 109259 95813 114583 139542 144640 146248 150578 139430 143935 155721 167332 188873
16229 188873 227450 257771 283899 271714 269097 300744 298202 270278 236805 212296 193683 178231
16217 178231 174150 191111 222443 228446 215384 219019 242468 256416 262697 251853 252704 264925 293511
16204 293511 353248 438092 548092 703933 1024030 1611571 2527948 3310868 2807555 1765836
16194 1765836 1144050 821591 634600 510781 405926 335927 273111 236189 226011 202328
16184 202328 186353 187756 191084 175224 151542 155970 169871 185899 192008 203415 195802 185665
16172 185665 181170 160105 149135 143855 144627 142527 125549 136354 117905 99199 97081 109487 114718
16159 114718 117663 144669 181622 200065 204717 197106 197309 211467 221568 215819 204388 198120 203611
16146 203611 209232 210256 184209 171854 175423 181614 167592 161633 193283 203495 171184 148599
16134 148599 149596 165217 177824 171698 157658 156552 195102 182082 161866 177531 197846 190665
16122 190665 176615 186411 201390 214237 226539 222931 217083 219713 232465 241635 244021 252007 248543
16109 248543 244200 242061 253147 264366 267128 272938 289713 310717 358755 458508 561339 604361
16097 604361 571264 525981 502101 515077 532510 548560 555031 566204 597891 637874 644147 628909
16085 628909 613261 579402 569618 564095 567649 603427 676250 748810 826578 865782 793786 717470
16073 717470 728709 750894 723072 700424 686067 696620 741175 812908 886656 872498 791074
16062 791074 710058 655882 619160 594649 589623 608842 663386 770187 925820 1104625 1179551
16051 1179551 1078669 943709 828687 744103 671991 621402 562769 539920 534120 540993 549480
16040 549480 560844 565461 578229 608129 658410 729464 841246 925775 887552 793785 723667
16029 723667 713611 718525 715420 726953 730064 705996 680604 701186 755565 799785 863962 967746
16017 967746 1072137 1053342 977760 960336 996352 1054653 1126217 1169953 1183390 1201639 1242536
16006 1242536 1295071 1362432 1465746 1563910 1686071 1796629 1920478 2062008 2194782 2339828
15996 2339828 2514703 2695404 2885363 3149725 3469437 3840714 4261469 4743341 5281867
15987 5281867 5967785 6842641 7852399 9041048 10636625 12804543 15895497 20402197
15979 20402197 26578497 34060048 44739520 64442047 101135935 167059578 273044443
15972 273044443 387039328 359883699 220614770 127894147 81275359 57069271 43725040
15965 43725040 35393753 27989161 21489991 16865787 13624884 11292497 9490553 8094246
15957 8094246 7019563 6189080 5480830 4870201 4355541 3911860 3548413 3228220 2960622
15948 2960622 2728518 2517240 2316958 2164496 2040223 1900102 1750228 1632828 1533464 1453780
15938 1453780 1386672 1312855 1202831 1103893 1008922 917001 866693 829978 809673 789596 755729
15927 755729 710809 677069 664935 666719 656641 642344 635718 602293 565799 512330 483290 486224
15915 486224 486182 474460 460434 415914 366505 331889 331091 338469 347602 387982 406992 429302 472952
15902 472952 518804 552597 566780 590715 675299 880218 1222161 1612699 1737923 1375683
15892 1375683 964237 704174 528746 430468 374549 336309 293478 257188 234653 225408 186645
15881 186645 163273 159383 150608 156520 158570 150991 134705 117883 117807 108891 111649 116713 109562 122756
15867 122756 118126 115941 126396 114294 122039 136189 140284 134568 115323 104309 91790 78123
15855 78123 61491 53099 72564 89676 94219 106574 117306 102868 117808 155816 175479 156823
15843 156823 154190 141643 139266 141777 120811 102189 101931 108287 101994 83875 83945 94934 74272
15830 74272 52981 49279 35954 32188 39267 40280 54129 61190 70191 68195 58132 45609 50070
15817 50070 46394 35795 39048 56719 52883 35558 40250 28038 34545 29625 33912 53471 66390
15804 66390 63621 59216 58888 49093 49660 33732 15220 2566 12141 14095 20383 -5666 -19958 -18938
15790 -18938 -570 14681 23118 30417 57231 79029 97510 89409 86114 95170 92526 73870 54072
15777 54072 57274 57878 43687 35577 40097 48938 51319 45982 30404 36401 47427 54444 65742 54708
15763 54708 53271 58104 43008 45082 41462 36468 36617 51583 55756 47824 40581 35299 38145 39954
15749 39954 43314 26945 6826 5717 19178 13480 -3588 -16224 -27796 -31575 -18619 -10897 -5515
15736 -5515 14334 1460 -17780 -15056 -10572 -750 -6179 -6234 -10283 -1419 -132 2606 15214 19358
15722 19358 28899 36372 39760 45908 44634 48806 38067 36527 34006 22610 27247 36956 47535 49148
15708 49148 38149 29312 24489 27273 24664 19502 26242 29231 26035 11181 -1904 5700 18989
15695 18989 23257 23512 24389 11821 -5332 -315 -5705 30 6134 -946 -8503 -1733 -3146 -19451
15681 -19451 -31309 -27856 -40797 -41846 -23281 -35233 -45538 -39588 -28855 -42148 -53331 -41744
15669 -41744 -37965 -19553 34439 59223 50241 25917 -11368 -25420 -28152 -16101 -1835 -6373
15657 -6373 -5063 2529 14703 13472 13680 20003 106 3756 13324 1095 -5635 10650 33051 32420
15643 32420 30266 18506 12505 20587 13630 4995 1363 4560 7948 5384 -9808 -14310 4366 22057
15629 22057 15622 -4202 -123 8222 3346 -4049 -1192 12853 10909 -3714 -7570 -6963 1085 4788
15615 4788 -12183 -6165 8281 12282 15621 19023 20559 9428 3043 3201 10083 10020 5414 1341 -4302
15600 -4302 -184 16739 31623 32692 10511 7524 7754 7347 18114 7793 717 3256 -9472 -32533
15586 -32533 -49147 -42598 -31794 -9864 4430 2820 17392 28381 17383 5930 7277 19894
15574 19894 24817 24630 9761 3468 -8106 -14031 -20263 -17698 -5344 4314 8283 11160 -1790 2237
15560 2237 13874 16162 8893 2356 -3212 -1349 -949 -11093 -9927 -10430 -11769 -5721 -6413 -18513 -24824
15545 -24824 -22470 -39364 -40860 -34623 -18248 -15459 -22867 -22328 -13439 -7376 -15338 -16591 -21761 -29283
15531 -29283 -25810 3086 15911 9184 4184 1695 6330 27568 34575 18225 8413 9751 16044
15518 16044 4306 12088 22918 24004 17755 5344 -11203 -12689 -9267 -12838 -17071 -18514 -29226
15505 -29226 -35785 -27057 -13720 -8648 -12120 -13111 -1019 8767 1994 -6288 -6183 8281 13067 17553
15491 17553 21008 14772 13805 18235 15753 12626 29 -3492 4178 22398 21395 381 -23800 -19781
15477 -19781 8099 6592 -2101 -8845 -4147 5697 12923 29331 17586 575 -1232 12814 3988
15464 3988 4400 21358 23755 12532 4392 12138 10852 -1842 9292 31431 40400 6385 -11768
15451 -11768 -24748 -24683 -17222 -5157 8469 8399 9576 18209 23778 5991 -3776 2174 3788 5959
15437 5959 -6682 -11076 2951 26139 35764 45652 63550 74384 81612 99370 137102 188339 249068
15424 249068 352943 562903 917015 1479800 2022728 1812317 1157650 703396 452607 328502
15414 328502 251077 206183 158125 121803 107054 81053 57498 45103 42394 35993 37485 48306
15402 48306 55723 47511 43361 44870 38302 31973 17621 9433 20160 23213 28423 31552 10726 -5895
15388 -5895 -5806 460 4652 3361 -2163 -9882 -13339 -14505 -10067 8384 8004 8008 392 -12014 -31960
15373 -31960 -25316 -4490 -3338 -8558 -3970 -8759 -11005 -8339 924 11067 11207 4874 -8682 -20133
15359 -20133 -18407 -31050 -45155 -39204 -35369 -21311 -19372 2237 11429 6486 12887 9593 -3670
15346 -3670 -973 1588 -6214 6704 22679 26527 19633 16140 13151 8167 7566 8387 -5338 -22242
15332 -22242 -27169 -20800 -12842 -5642 -7498 -5307 -6179 -5676 -11896 -7166 -2693 -913 -3679 -6275 -8002
15317 -8002 -5953 -5411 -7764 1242 6388 -10506 -11342 -21318 -26445 -7492 -1006 -14696 -32638 -41964
15303 -41964 -33999 -19780 -4977 277 -1354 6784 12747 13399 8910 2958 13503 17864 12671 16241
15289 16241 14472 13215 26365 7501 -3951 8299 5463 -12255 -16774 -22348 -16799 595 -13835
15276 -13835 -20779 -9672 -910 -13620 -26976 -25868 -12695 14600 12213 -14574 -29051 -24450 -19658
15263 -19658 -88 9373 -6921 -23230 -16146 -2137 -6107 1375 12960 7935 1252 -2112 -8836
15250 -8836 -20085 -16269 -9635 -8253 -14881 -33341 -29581 -10870 15176 15855 20341 17791 17804 13012
15236 13012 -3505 -11291 -276 8853 -30 -7567 -11552 -10547 -13793 -17545 -31639 -27946 -17656
15223 -17656 -740 2542 1284 8864 6620 -1692 -5730 1559 13053 14159 23744 31504 20086 -2580
15209 -2580 -1126 9755 20984 4335 5358 8893 -2670 -9993 -11610 -23964 -23489 -5870 -5171 -5099
15195 -5099 9155 18463 9386 918 -2201 -5229 -1808 8501 12358 24752 24485 10825 -3730 -3766
15181 -3766 5315 9525 806 -7915 1392 11426 -2008 -15670 -18506 -8065 -2431 5566 7425 4317
15167 4317 2298 13873 11173 5918 10081 7786 8286 1989 -15652 -35010 -46704 -51776 -40854 -13846
15153 -13846 -532 1944 8914 8576 7058 19690 34297 31362 19591 20639 1943 -28146 -20453
15140 -20453 -6399 -14104 -13332 -23407 -14022 -5749 -10694 -14218 -16895 -27635 -29623 -22001 -22850 -36040
15126 -36040 -32062 -18550 -6359 -7397 -5060 -8326 4064 10193 12949 19464 24554 19123 8143
15113 8143 4711 -3752 -13240 -12373 -9617 -4303 -10238 -19180 -19275 627 10232 5140 2645 7745 9519
15098 9519 22791 24023 12048 9898 7886 6435 15445 19697 21037 10915 257 -3384 -16794
15085 -16794 -12231 -10101 -8239 1725 9655 14387 12620 8066 -2716 -11947 -13890 -8179 -3339 14242
15071 14242 18391 -2676 -2850 18062 16121 12229 -13736 -32071 -23784 -645 5555 5914 4290 1917
15057 1917 -8011 4431 21731 24968 21512 16337 24348 19800 -4362 -16495 -29753 -23918 1643
15044 1643 11355 13471 22058 8809 -1431 -543 10425 19734 19261 25138 14061 8604 20530 30577
15030 30577 26902 14502 11317 13359 11673 26857 30117 18996 13013 15500 11956 -1438 10805
15017 10805 7316 11001 5929 -3405 -367 1742 3608 -3664 4002 10604 8672 -11802 -16736 -600
15003 -600 347 -25257 -33802 -14539 -2278 7059 12488 2117 -567 -4716 4843 -285 -5320 -4086
14989 -4086 -6459 -7642 3205 3127 433 -4844 -25776 -36734 -28327 -24629 -23229 -19615 -9761 -2403
14975 -2403 -13165 -10407 -7557 -13430 -12889 1874 23245 22813 5877 -4691 4709 13086 17074 850
14961 850 -13661 -21335 -38060 -19835 -6223 3449 9585 -2473 -934 13980 18637 30882 38061
14948 38061 42174 46901 39104 35586 26978 28580 14022 -6248 4195 16858 26916 16954 24579
14935 24579 29770 18730 15131 15836 12464 14775 18749 26132 8834 -8389 -6062 1179 18926 15021
14921 15021 9541 12443 11928 14254 23450 27846 24820 14426 10706 20318 22437 16556 -1733 743
14907 743 -7991 -6178 203 832 7482 10332 4347 8336 15934 7142 -575 3688 8920 -7275 -8600
14892 -8600 -10710 -14616 -15506 -4258 7162 15307 -1138 6052 12895 19048 26792 30757 31183 21583
14878 21583 27030 31964 30986 18818 8293 1707 10811 19290 25800 15835 7454 795 -2507 -723
14864 -723 15319 17590 20159 18920 5421 -4507 -8985 -11790 -14019 -8222 160 -8485 -11279 -7161
14850 -7161 -3487 2406 -801 -12438 459 1937 6336 11356 17128 17297 7287 -5782 -5030 714
14836 714 4096 -702 -5135 -11527 -3594 6760 15917 12510 27659 19501 7083 13040 41912 43880
14822 43880 28793 18566 15628 9457 17120 20017 12707 7801 12380 4520 13346 1124 -20146
14809 -20146 -26257 -7452 -3273 13540 25720 25220 19102 29983 39880 26877 22337 24471 23881 23311
14795 23311 12053 10356 6844 7035 13023 23686 18257 14942 10837 14676 10535 7065 2315 -5482
14781 -5482 -3112 14776 12058 111 6566 8220 13144 9789 27357 37181 24365 25109 23085 5146
14767 5146 -8546 -11075 -6411 -12338 -14436 -13711 6787 17721 29360 28307 32218 35872 34408 38835
14753 38835 37217 33359 30844 22753 8814 20305 10152 5168 13666 10337 6630 1996 -3477 6806
14739 6806 15136 18269 4359 -696 -10387 -17038 -20448 -3211 4556 -8768 -17011 -3034 10042
14726 10042 9667 5815 8782 13432 11635 -1509 -7618 6550 15772 12368 5028 -8222 1528 12492
14712 12492 10290 11475 4776 -2006 -4512 -217 10555 19346 21714 6880 -15689 -16291 -3388 7281
14698 7281 12998 20604 20881 19105 10053 -6818 -15923 -20706 -7471 -10658 -18404 -13978 -13020 -7003 -5715
14683 -5715 6184 3810 -671 3047 19682 26480 35665 36835 26100 21758 20792 17501 9243 12491
14669 12491 11100 28272 37477 24927 24268 23876 24426 28914 16718 9133 13559 11318 23328 33905
14655 33905 22771 16159 -822 -8825 -3243 8959 9167 7372 1897 2783 2120 16700 21206 23566
14641 23566 8579 7972 1127 12004 10431 7204 12629 11766 23124 33536 15787 3247 -3815
14628 -3815 -12964 -26323 -10007 971 12097 13165 3495 899 14410 6385 10126 8990 5
14615 5 -2819 4750 16576 10412 8016 1553 -10209 -5446 7813 12994 18963 33404 31845 30048
14601 30048 20934 14549 20299 23436 27272 31888 30148 23260 10605 4885 -4034 3720 21656 28422
14587 28422 26155 15003 -3327 -6776 -9989 -2899 9419 18773 4558 1879 -1847 3350 19404
14574 19404 19115 19119 11551 12957 6905 4352 15304 20197 31988 43355 32061 16047 10986 2355
14560 2355 8478 13207 18122 12790 8192 11174 11804 -264 9240 11897 1484 -9614 981 10220
14546 10220 4312 -7 2376 6815 16924 13640 15035 12318 12603 21115 14345 -2143 -14569 -8670
14532 -8670 4531 23026 44406 40019 15758 -5850 -6466 -4146 16173 38421 28386 17963 5277
14519 5277 -320 -486 -3747 -1432 1215 3543 9831 7154 -12438 -2220 9641 9920 -4561 -5797
14505 -5797 14131 36847 38580 23215 29977 36002 28797 34310 36019 26555 21401 10464 12522 14598
14491 14598 12828 8894 19062 23687 12150 7255 10539 22712 21535 18668 15862 8058 304 15232
14477 15232 13186 8446 6778 7309 14340 28844 31343 35330 32734 26673 24426 16385 22449 24818
14463 24818 13878 10263 12085 12097 18102 29561 24584 12239 17417 33038 37656 15801 6910 14166
14449 14166 12876 5912 18469 26016 13281 13995 16971 8691 11657 33248 34876 21144 5438
14436 5438 9056 12291 16339 19096 28595 18146 32013 45632 37734 19203 20193 19381 22603 26976
14422 26976 14683 17231 1732 -1032 1035 3937 20227 21492 21483 31063 48742 44634 43439 36560
14408 36560 7166 3968 7536 7532 18637 32994 25209 26343 34989 57514 55029 42841 40195 43887
14394 43887 46456 43156 36470 32110 40674 46912 47638 36266 25875 19038 19047 38040 51900 54196
14380 54196 46903 34886 35190 46457 52271 47119 33550 30741 22108 29105 30343 12879 12561 9829
14366 9829 10123 12416 6283 7671 23160 26863 21362 33278 42037 43873 49834 50718 42832 29080
14352 29080 30075 39888 41249 30242 35480 30079 29579 30115 20597 10040 10137 25943 44222 42781 41021
14337 41021 34529 35968 38213 23022 19240 32315 49371 52560 45392 63098 61778 44612 37571
14324 37571 31612 35246 40777 46089 46400 43080 57906 70327 79124 62004 46848 33591 36217
14311 36217 41025 42499 28189 32912 47344 52260 49414 61215 63066 67323 78448 83186 77089
14298 77089 77994 75216 75521 84614 75287 53043 46620 55235 64492 80370 84930 86053 96610 79343
14284 79343 77093 91175 100479 81263 67370 73969 77439 81783 79885 72368 65499 56518 66957
14271 66957 82915 81408 67533 69135 77567 72707 82900 75469 59569 49993 34467 32115 52966
14258 52966 78569 58909 37384 54234 72923 94499 96459 99102 103955 111893 123069 115649 115222
14245 115222 103065 113705 116695 108593 95328 93806 95092 84864 93906 100167 107986 110725 95730
14232 95730 104502 88883 88159 90710 79344 69181 61972 60587 76836 90239 77625 77232 74052
14219 74052 70122 64380 87619 108938 115068 104631 101323 90953 102048 111087 106307 95705 98762
14206 98762 96048 93161 102000 96171 94859 77835 69439 58687 82505 88890 90812 84932 85912 84953
14192 84953 87603 96233 106202 93798 82284 83224 99101 96893 95508 94661 83090 80247 100122 105987
14178 105987 108670 124362 137326 135328 129126 129701 127634 113488 104199 110534 123897 141208 158262
14165 158262 158784 154434 153262 157393 171008 186734 186333 178999 175159 164787 172008 176094 172967 159245
14151 159245 147789 158538 169564 176833 185473 197694 204142 215678 224777 219693 194062 189337 200400
14138 200400 206594 208838 204734 209106 204320 205898 221854 225237 235871 237919 252081 247413 243607
14125 243607 233905 226859 227221 222708 236478 250633 255257 269907 273505 288024 308335 308254 309909 305481
14111 305481 303165 299602 305404 308007 306757 305344 310613 325826 340366 344841 332832 321801 324903
14098 324903 325134 332995 346119 360066 396896 408901 405015 406897 417021 423296 425610 434455 442894
14085 442894 441836 447492 470242 482796 497784 498801 509486 512327 518896 522791 526828 533207 545918
14072 545918 575568 596655 616300 641278 651459 668781 693668 709571 747376 779598 785718 794588
14060 794588 819516 839605 863071 887005 912763 929010 949430 978790 1018735 1045230 1077560
14049 1077560 1107117 1136017 1156641 1189026 1223985 1277013 1326847 1364788 1431755 1489965 1553547
14038 1553547 1615057 1684923 1753607 1822997 1901512 1985135 2086233 2185233 2294255 2394193 2491750
14027 2491750 2608585 2744081 2894607 3035480 3205047 3406687 3607657 3820698 4041733
14018 4041733 4300344 4582489 4892984 5234727 5591689 5988724 6447138 6961273 7518389
14009 7518389 8136300 8829888 9596641 10471544 11458208 12557989 13786692 15177042 16743550
14000 16743550 18491042 20402284 22502484 24762724 27128191 29543125 31887395 34017599
13992 34017599 35761891 36980833 37560386 37426103 36572063 35143948 33259184 31057114
13984 31057114 28705602 26339756 24042925 21882194 19848534 18011008 16349847 14853829
13976 14853829 13517816 12331432 11251333 10294837 9462099 8718831 8033008 7401294 6854935
13967 6854935 6367022 5906182 5498198 5142144 4821798 4517456 4241760 3979997 3750379
13958 3750379 3549875 3352245 3164860 2991142 2841279 2687039 2546036 2415651 2299995
13949 2299995 2194810 2105819 2021811 1932567 1847441 1777799 1700987 1637216 1584068 1525754 1457650
13938 1457650 1381360 1317776 1266512 1229720 1183995 1153140 1115425 1084531 1040990 1007630 980143
13927 980143 960107 926487 871946 846313 811273 789009 783690 765921 736740 709487 682737 664433
13915 664433 651936 643926 624755 609165 587645 586545 563644 537953 533597 529401 517546 513427
13903 513427 498041 486053 478815 451499 422020 411703 420758 407453 397980 400248 406021 393980
13891 393980 369683 363601 355243 342698 338207 333589 310171 297779 289598 287316 277556 276606 283392
13878 283392 277834 277905 281854 281396 281214 269068 263103 254351 256896 250486 243723 234952 230500 236218 241484
13863 241484 240151 234164 231152 214174 195042 190261 203685 211099 224900 216656 210288 193924 195151
13850 195151 179299 179756 177160 166635 171403 183221 182355 172382 172263 163435 149753 140936 147090 155603
13836 155603 166600 169538 169683 160795 146379 143372 144571 134543 120719 124458 128755 121404 123008
13823 123008 128399 112320 109032 105930 110133 111360 116882 105809 96495 95591 92303 99833 106173 110002
13809 110002 98003 95222 97070 98893 112828 123085 113820 93464 83110 78710 86512 95388 89222
13796 89222 91050 94109 85668 81534 90927 102141 95559 83185 73596 71385 83869 90679 97461 82622
13782 82622 79191 81685 81471 76728 77209 84433 93818 86474 82758 88745 97460 86664 80200 72011 81810
13767 81810 89027 80853 68404 57289 50251 62063 60790 57405 58091 53009 53449 54810 65121 69962
13753 69962 69993 67452 62615 52398 69153 75676 72319 59312 49980 42323 38871 33927 18303 36677
13739 36677 45570 36003 55148 68113 61722 50467 47089 52359 59556 55085 43088 41882 46160
13726 46160 48383 51236 46658 48700 41905 35434 39653 50381 39761 29448 36587 40091 46395 52861
13712 52861 38166 51867 47949 49222 43264 36825 44170 34832 39278 39201 22979 32861 35399 28391
13698 28391 21514 14915 22684 23426 16933 16793 9918 827 13230 12062 19313 14652 17709 39059
13684 39059 48906 34725 23213 38776 50198 35070 21636 24794 20831 38968 38009 37687 35463
13671 35463 38323 48035 31508 23551 22130 30293 40824 46787 36056 26031 35391 38304 23332
13658 23332 22313 16552 1592 17645 26262 19006 27080 26922 13226 24096 20668 18143 9977 3161
13644 3161 10978 2719 14135 33941 41994 28479 32089 20320 20042 10678 16104 30120 28421 28726
13630 28726 29771 32177 33916 26602 4091 -2053 -4331 -3439 -5721 14080 25230 19444 15248 7135
13616 7135 -853 1442 -2535 -7468 4707 10336 9306 20110 17392 14555 16093 34935 40378 34297
13602 34297 30042 38279 46145 56883 49582 29358 15450 31219 21218 2651 -8714 1069 11090
13589 11090 2309 5114 11010 5629 -174 1976 -5505 -18664 -16377 -11472 -6118 -13936 -14622 -4788
13575 -4788 6227 19644 14384 6197 7867 28131 41568 42911 39829 12629 6857 14599 10723
13562 10723 9795 9570 10459 6807 19800 24163 38065 29806 4004 -3994 -7634 8015 16065 16839
13548 16839 10515 -12840 -27294 -18881 -24474 -22775 -4605 20795 29942 26388 22991 17351 8391
13535 8391 17828 24833 13100 -3217 -8254 -10835 -11278 -7843 2372 1058 -17677 -14662 20525 35244
13521 35244 23405 7921 -3629 2020 2331 5669 20068 32432 27014 14328 5611 -1318 5048
13508 5048 13666 12269 16038 31998 35211 24561 4132 -7195 -11860 -14072 -1752 3529 1058
13495 1058 10144 31732 33031 16740 7947 10769 15365 7207 1289 -273 7309 17806 17702 28372
13481 28372 36811 35959 20471 10409 10036 20840 16048 3092 -5167 -3728 -22343 -17093 462
13468 462 -2533 2518 6607 18086 10762 1606 -799 -4811 -8140 3302 -12589 -7263 5393 9850
13454 9850 8132 3996 11052 6643 4835 -777 -5207 798 5431 15554 15393 3603 2167 -474
13440 -474 4945 5749 9015 19794 19239 9413 14693 -1460 -18271 -7383 1197 -1485 8904 14321
13426 14321 25157 17925 -6877 -17440 -16158 -2843 6284 8357 9317 7536 10599 5381 945 -2071
13412 -2071 3717 16183 30280 33211 40122 34035 26609 18887 4655 -111 -973 13234 22421 24598
13398 24598 18321 19507 12200 12600 3079 15928 5584 -1805 3993 15971 -7018 -10480 -15781 -2265
13384 -2265 4951 -1055 -2966 -6378 -16970 -15194 -7649 3785 11860 10455 11281 10590 4290 19949
13370 19949 16565 4510 514 -1259 -15498 -24523 -19842 -2803 -1963 -3358 6196 19811 26184 14394
13356 14394 10684 11959 23338 8804 11288 17174 14916 9415 10285 17260 -3656 -18026 -18762 -25694
13342 -25694 -11885 179 2810 -3209 7734 4232 6047 3295 7612 5832 -489 -4276 7630
13329 7630 23681 19519 5606 -5806 -2611 -9378 -774 1050 4231 7735 6894 -9164 -14612 -20560
13315 -20560 -16787 -12348 -11047 -892 13297 -5751 -15121 -16749 -10031 -710 2262 -3349 -12314 -5726
13301 -5726 16099 17315 21366 16024 15524 322 -6610 -1694 -4017 -4333 -4595 -10152 2422 6675 -481
13286 -481 709 3455 -11972 -8717 10522 -527 -11904 -9201 3491 4412 -68 20210 22624 2639
13272 2639 -5706 -5866 -17559 -9717 -1422 12394 13242 10336 7034 14186 8570 7316 4167 303 -7073
13257 -7073 -2581 5630 -1096 2008 19977 31496 26670 7141 -2782 7696 -524 795 -12982
13244 -12982 -21634 -4405 3485 13087 10887 -14006 -16886 -13895 -16160 -11050 5426 5201 -311 -2119
13230 -2119 20192 27718 21177 16514 3154 8191 32733 36694 22590 -187 -6702 -3890 15031
13217 15031 14726 20249 18823 -2716 -17967 -21163 -31948 -33596 -21793 -17426 -18955 -26789 -31595 -7080
13203 -7080 463 4509 -607 6142 3666 -6395 -2161 -10439 -18306 -10949 3882 9550 15440 24408
13189 24408 25007 11144 9641 8284 575 -13198 -10783 1269 647 10988 14809 12070 15008 21996
13175 21996 8271 -2252 -13712 -26414 -10400 274 1086 11574 29 402 5119 11503 22295
13162 22295 18595 23022 24124 21873 26183 25545 17985 4760 6404 -1629 4756 3548 8469 9987
13148 9987 -10563 -17357 -8195 -205 5226 1649 3545 -4732 2648 14448 19958 23776 18198 7050
13134 7050 3067 -4969 10709 4136 7804 11889 938 14210 16080 20670 15193 12495 2156 -6785
13120 -6785 -16606 -5891 -10251 -30436 -27627 -29630 -25483 -26928 -25109 -25335 546 4018 -846 -9243
13106 -9243 -1141 2746 -4091 -4092 2180 7961 11292 11712 2545 4567 20637 23653 15200 807 -19058
13091 -19058 -1708 10667 6035 9308 -1864 4091 25457 28243 11775 8413 -104 -4487 5080
13078 5080 16701 4352 -9600 -7422 -13583 -14346 -3025 1633 -5926 2192 6780 6968 -1386 4833
13064 4833 3097 -8700 -13200 -10310 3770 12541 -4045 -17950 -2093 5876 2040 -13748 -26880
13051 -26880 -28159 -24700 -19277 -22817 -37770 -38448 -30057 -24692 -998 19560 13537 -3826 -3890 -7496
13037 -7496 -19173 -14960 -6618 -4765 1374 2991 -769 1716 955 -2478 -14879 -20111 -25039 -27756
13023 -27756 -23643 -23717 -15368 -8442 -7728 -7621 1955 3458 -1656 10556 15294 12798 -4114 -24771 -28150
13008 -28150 -2037 9710 4942 -2307 2931 -1521 -3889 3349 4520 14574 3979 -16823 -37202
12995 -37202 -23042 -15810 813 13441 -1765 2030 1394 1774 3829 7085 -8135 -6071 -5116 -1408
12981 -1408 -2620 -9929 -14475 -15954 -21253 -16171 -4860 -2488 -10655 -13509 -18549 -24793 -22248 -4679
12967 -4679 -16121 -15577 -4809 12878 8557 5935 -8078 -10365 -2613 -1502 -1922 3449 6144 1104
12953 1104 -10681 -8101 -26387 -32560 -5435 8940 -7259 -5940 4917 9252 7241 -478 -2452
12940 -2452 -7453 -2886 12237 6950 -11075 -16765 -14001 -2501 8082 9187 16291 11576 10123 9881
12926 9881 -228 -6932 -5446 -5445 -14297 289 24095 22342 10957 5671 -13793 -12633 -1922 2159
12912 2159 -1379 -6664 -10222 -6656 4007 12632 13977 -1274 -6923 -4376 -23718 -23482 -8254 -9028
12898 -9028 -7715 -12078 -27501 -22256 -688 2115 7608 7065 5224 -1640 -10250 -9868 -27888 -22842
12884 -22842 -19653 -15857 -22274 -16818 -3612 -5733 4209 10869 17992 10552 2830 735 670 -7949 -6641
12869 -6641 -11338 -12776 -20016 -22039 -13403 -3136 -10748 -31894 -24129 -8439 -15313 -24693 -34707 -39316
12855 -39316 -36139 -23651 -6406 -4591 -2983 -9 -19809 -36794 -29758 -11867 -6847 -12896 -7363
12842 -7363 -13570 -18930 -15317 -16157 -11589 -10537 -25608 -23056 -7572 9178 18080 7565 -14955 -39628
12828 -39628 -34865 -19915 -18645 -19412 -26962 -20897 -11275 12633 16328 3582 6476 12465 8301 7967
12814 7967 887 -7669 -7771 -18365 -22869 -18564 -15166 1755 10786 2496 -1711 -4479 -7474 -220
12800 -220 16704 7652 76 2929 -5293 -5553 -5624 9653 16616 16120 32415 28327 26585 28990 32986
12785 32986 23673 16779 4909 -2204 -4046 -4995 -5250 -782 10631 1826 -11101 -16008 -9469 -14060
12771 -14060 -13718 -1415 2059 1617 33 -6637 -9501 -16111 -20584 -14135 -24350 -27087 -23145 -8268
12757 -8268 2096 1310 -12622 -25710 -25123 -17432 -12362 -1536 -96 -1532 -12586 -3343 9491 6684
12743 6684 2231 -16137 -14946 -3269 -10651 -16285 -9323 -12976 -7042 4528 6681 4900 1523 7894
12729 7894 -3458 -13109 -14919 -22238 -20611 3563 23742 30743 17867 13180 2109 -2635 -7364
12716 -7364 -29696 -29219 -12405 -7937 -7152 -9895 -13970 -28122 -15443 1971 5680 -1225 -14649 -2396
12702 -2396 7869 17303 20200 1515 -2303 -2419 -16484 -25605 -21236 -10802 -6334 -12574 -9803 -4605
12688 -4605 -7120 -9857 -16507 -24531 -20635 -11424 -11645 -11480 -15200 -5121 9213 6491 5860 -7834 -14150
12673 -14150 -13119 -4430 -6315 8873 20426 26216 14862 2329 9129 7243 -13443 -29999 -39218
12660 -39218 -18782 -10961 -10733 -7528 -11606 -196 12014 23158 34425 26055 16946 5865 2
12647 2 2951 -2526 -2929 -16 4190 6118 17956 11170 10750 8678 1600 5829 -480 -7921 -14806 -11080
12631 -11080 -6259 -5695 -5885 -5818 -2011 4523 2666 -1149 -4015 18244 38466 36295 21209 10049
12617 10049 3389 2604 3370 2407 12213 14902 13891 5971 7692 22540 36910 42280 29609 38889
12603 38889 38030 37559 30523 26234 25405 25723 20443 20781 14435 1965 -1083 490 14693 19401 24941
12588 24941 22757 10763 3196 4529 5189 4047 -18639 -27823 -13763 -5948 3611 3161 8923 3510
12574 3510 -19980 -23810 -12767 -6339 1685 -5026 -11103 1084 4348 10979 15564 5513 -11664
12561 -11664 14967 36795 38607 28440 21523 17866 21263 29674 30071 24480 5592 2616 -1329 711
12547 711 5183 -576 1175 11485 -4750 -2287 -1586 -15921 -22758 -27662 -22144 -17892 -24406 -16625
12533 -16625 -4033 4850 6826 6658 2395 8633 11142 -13663 -23704 -27553 -13961 -6981 -8118 -7321
12519 -7321 7387 29225 28496 31285 36217 21399 8307 -1738 -6384 -2288 12525 22634 23607
12506 23607 27643 40067 41353 48191 62309 69404 98604 136011 169648 208676 265656 331643
12494 331643 376900 397000 399801 375001 329197 278111 230295 177975 130445 92740 54650 40224
12482 40224 29196 20395 9239 7732 16481 13548 25653 36561 27519 16499 16013 10902 4089
12469 4089 -1189 -18432 -26017 -13224 408 -458 8543 21211 12890 -3099 -9786 -17091 -7271 3688
12455 3688 -3610 -8107 3436 11602 5195 4081 5226 3483 -3314 3607 3092 1104 343 -6691 -9995
12440 -9995 -16227 -21951 -20998 -10832 -1011 4330 11305 4141 -9413 -6875 1828 7295 125 -12686
12426 -12686 -9628 -15594 -12603 -7257 -3818 -4296 -19924 -15452 -13531 -19064 -29733 -25993 -17703 -27479
12412 -27479 -37016 -30248 -18987 -6267 185 -1097 -5803 -12600 -5672 9350 22682 15598 24912
12399 24912 22096 25931 26206 22342 18200 19195 13232 -1069 -772 2564 -4046 -16373 -9695 -3049 20536
12384 20536 34380 37464 37330 32030 14599 3477 18786 29134 15582 14372 14420 6832 11664 17162
12370 17162 18972 9829 -80 -8999 4217 4859 -8135 -14427 -291 -2954 -12179 -11015 -17615 -23777
12356 -23777 -20848 -18715 -14139 -4175 -1970 1052 -9033 -10387 -24235 -18930 -16962 -4029 5238 3626
12342 3626 -7874 -31373 -39569 -39324 -47383 -49469 -35870 -28403 -29193 -19763 -4174 4693 13446 21466
12328 21466 17776 19542 23310 21870 15792 18888 11437 15263 24551 20340 13948 11092 -4867 -8552
12314 -8552 -3691 -7411 -8378 -8403 -10957 -1137 -14526 -21362 -21174 -15403 -1894 4674 -2608 -4555 8950
12299 8950 15725 8506 14992 15878 12675 -2471 12752 14837 16557 16012 19814 19712 5047 15444
12285 15444 18712 7242 12626 16122 6665 14766 16812 -427 -6995 -7306 -6392 -1566 -11984 -20967
12271 -20967 -11397 -8273 -16508 -17128 -28604 -33264 -26320 -14115 -17585 -21441 -17081 -5741 1186 -13279
12257 -13279 -8678 581 -5498 -7017 -1381 13412 15483 12979 17390 19484 21968 20695 -1663 -1403
12243 -1403 -199 -10737 -16349 -21326 -12549 -453 -9546 -25301 -33256 -29971 -18695 -11883 -13413 -20200
12229 -20200 -15688 -4200 1502 -8950 -10426 -3056 -8008 -5580 5519 5048 5948 27 -4163 -22644
12215 -22644 -26321 -19389 -14271 -18507 -31809 -32485 -40998 -51806 -43048 -23623 -21758 -22190 -7572 -12404
12201 -12404 -12658 11566 15156 -5971 10485 7694 10063 23125 5805 -2966 4943 12088 6104
12188 6104 6343 8676 17643 2631 7712 15754 6350 -13349 -9210 952 -10805 -23456 -14782 647
12174 647 5042 5596 -12773 -11523 -18243 -21008 -10100 2377 -13626 -17987 -6474 -631 9162 2205
12160 2205 -1500 9771 7492 -5426 -27585 -27777 -15188 -2336 13825 4918 -817 9918 11796
12147 11796 10890 20569 10392 6274 12536 11751 10289 1952 -12243 -14670 -9080 -13583 -9148 7684
12133 7684 6968 5989 -9352 -9928 -1818 -4626 -12250 1229 21432 20543 773 -10542 -15961 -17699
12119 -17699 -19656 -11144 4640 49 3879 -8731 -8851 -15587 -26025 -22077 637 -6106 -5670 1441
12105 1441 -7531 -15849 -32057 -38204 -16260 -8610 -5643 -2494 -10800 -2669 15048 10800 -465 388
12091 388 4141 -10637 -15818 -13321 -2542 -8313 -3849 13310 4938 -2694 -11797 3585 1947 3808
12077 3808 11290 29097 14977 -97 -8198 12910 11053 -1902 -10671 -3363 15724 -8431 -15337
12064 -15337 -7954 -6631 2014 -2289 -20126 -31165 -20114 -18430 -38850 -35111 -26667 -24523 -22251
12051 -22251 -19373 -26162 -26645 -34556 -29684 -27774 -9907 -9496 -21705 -27508 -17231 -9178 -13889 -18818
12037 -18818 -29955 -27117 -22295 -25772 -31338 -32909 -29234 -14495 -5936 -1061 -6091 -22059 -33073
12024 -33073 -26249 -20383 -24576 -22826 -27513 -27048 -14322 -16369 -19321 -12393 -4789 -6830 -29827 -41463
12010 -41463 -25905 -15631 -8678 655 3827 -6290 -20015 -26210 -20529 2341 3069 1802 4296
11997 4296 5695 -9947 -24193 -12688 -35881 -40053 -28047 -22292 -20271 -14967 -25233 -33214 -31618
11984 -31618 -35247 -44376 -22112 -986 9937 4064 5912 6528 17645 9246 -4760 -13923 -18746
11971 -18746 -7567 -3962 -10931 -4165 -6510 -11523 -11775 -12628 -9582 -400 -6202 -8934 -23418 -40859
11957 -40859 -28866 -26757 -43536 -41255 -29259 -14344 2006 11312 11547 13885 19469 16615 -8408
11944 -8408 -27203 -27967 -13958 -9007 3373 729 2182 6704 13817 2297 -10168 -9180 4964 14079
11930 14079 -1156 -7358 -5765 -1054 2101 -4041 -8616 -12319 -10763 -10833 -12224 -384 16451 21275
11916 21275 2446 -14461 -521 2513 -4158 -9612 -3120 -13270 -17615 -11517 -7182 -3827 -3830 -16134
11902 -16134 -21991 -24181 -821 16014 16856 6749 19450 9753 -284 -5850 -4144 -5997 2638
11889 2638 13288 4094 -2499 -15366 -26392 -35578 -24733 -17375 -14685 -11994 -16713 -20494 -18865 -5698
11875 -5698 -12506 -12309 -12448 -10977 -22897 -15841 -3049 -2369 -5856 -12274 -16368 -10176 -8868 -11168 -13061
11860 -13061 -16444 -19359 -28325 -22485 -24353 -12815 -19207 -19227 -8462 -4577 5922 11338 5751 8677
11846 8677 6720 -4075 -9858 -9672 4325 6127 5866 -4066 -10011 -9457 -13397 -4954 -912 -5444 705
11831 705 4659 3539 6161 6605 -11957 -12307 -4133 -15477 -17664 -10253 -12162 -2416 -13515 -17953 533
11816 533 3031 4299 5288 3622 -8204 -963 3500 10320 4573 -11511 -10272 -3658 906 -3562 -4155
11801 -4155 -1735 -3704 -6470 -7200 -7966 -3757 -1121 -21667 -38420 -5440 3565 -12514 -21735 -11152
11787 -11152 -16100 -14053 -3562 -5322 -8085 -13620 -13836 -18866 -13751 -20481 -12664 -6903 -13674 -15221
11773 -15221 -11173 -3101 -9724 -29520 -30143 -31810 -34150 -35283 -26482 -18892 -24011 -28004 -29479 -20495
11759 -20495 -18442 -11120 -18350 -18337 -13520 -6951 -19651 -22458 -17241 -6048 -11136 -11477 -889 2714
11745 2714 2514 -850 -1739 -5553 -7544 -2981 -8886 3610 2025 -5632 -17293 -17118 -21946 -12830 -3995
11730 -3995 -12307 -16714 -34121 -22908 -9896 13888 21142 6580 -9190 -1502 -5961 -20607 -23970
11717 -23970 -12137 800 -5035 -3167 12180 17666 5169 -3111 -15422 -15098 -12639 -31503 -43652
11704 -43652 -30752 -26871 -32431 -35075 -32379 -32702 -38168 -30679 -22250 -30665 -26790 -33179 -22154 -14269
11690 -14269 -210 8152 13756 2302 -10287 -13109 367 8835 5714 6578 11756 21231 8433
11677 8433 2014 2575 9609 23705 26664 13207 52 -5354 -8872 -20478 -18631 -13696 13568 9866
11663 9866 -2426 -6723 -11984 -10314 -8414 349 -3018 1595 9462 16393 3962 -11397 -25694 -15556
11649 -15556 -10159 -13403 -26663 -29804 -34378 -28535 -12217 -4344 11392 3158 329 -3591 -9696 -14330
11635 -14330 -12029 -5245 1954 -13626 -18375 -16538 -7256 17187 11841 -6002 -4870 -4 -15989
11622 -15989 -22021 -33963 -35201 -33625 -10185 -9668 -14450 -7510 -7541 3584 7616 6502 -11172 -22070
11608 -22070 -21053 -26735 -19034 -13455 -5929 -436 9138 2297 -3743 -12513 4135 166 -19816 -24606
11594 -24606 -19569 -18834 -27122 -22187 -19889 -8690 -10715 -12248 -22003 -16473 -1814 -942 -1764 10752
11580 10752 12296 -11840 -24727 -22082 -20051 -17609 -28092 -35013 -27296 -6122 12281 10716 3254
11567 3254 5645 483 -3807 -20937 -27265 -22343 -28067 -35008 -36207 -32214 -28442 -12261 1022 -10546
11553 -10546 -19352 -33474 -29357 -27158 -16566 1298 541 -6648 4540 14821 10187 8074 -497
11540 -497 2159 1647 9779 6452 -3788 -6422 -1772 8834 8976 -524 6094 7591 3105 -625 -15429
11525 -15429 -22340 -18688 397 -23 -25538 -17446 1786 12828 21197 33505 34452 35297 26431 14109
11511 14109 -1120 -5027 -15126 -14230 -11472 322 -5334 -27214 -21263 1180 16716 25071 13629
11498 13629 -2052 -4502 -2131 -1335 440 -13586 -20889 -20834 -7849 -5169 -4733 4981 2649 -9633
11484 -9633 -14692 -13859 -11010 -23036 -8001 -4046 -1585 -1836 -6927 1954 -8595 -11331 -2834 -1041
11470 -1041 -13401 -33388 -21509 -706 -5468 -5668 -6606 -7809 -7979 2693 10443 -4033 -17207 -5494
11456 -5494 -6729 26 2320 -13752 -15625 -12317 -20193 -20518 -12150 -4345 -4875 -17675 -9271 -4775 -466
11441 -466 -5641 -6531 5983 13373 4579 -1424 -4848 10313 11249 -1030 -9270 -13604 2825 -12253
11427 -12253 -17905 4650 -5352 -22401 -27258 -28741 -13690 -3909 16197 15537 2356 344 -4036
11414 -4036 -6109 -4464 8576 11984 -171 6963 13308 13154 3467 -10439 -17667 -21423 -29002 -20875
11400 -20875 -6301 3219 -5555 -18192 -26986 -15381 -2201 5454 25268 36671 39368 37932 28014
11387 28014 18935 10608 2795 4728 2322 -9073 -3890 4419 15985 12044 -9414 -14979 -10931 4208
11373 4208 20779 22947 18747 19511 18945 967 -18235 -26397 -20508 -11214 -5414 12055 28067 23093
11359 23093 20253 12421 6581 -3582 -3774 -2033 4569 5449 -7392 -7816 -326 -2145 -11142 -14414 -15055
11344 -15055 -16043 -21466 -12975 -8578 1467 3375 2289 3535 -11415 -23123 -22397 -11179 3484 10589
11330 10589 5866 6824 13441 3778 -3372 -8940 -16312 -3963 -3079 -6939 -16402 -22722 5074 16597
11316 16597 4032 2132 -1590 -18143 -36286 -34586 -22641 -26583 -30285 -19175 -16986 -11957 -9584
11303 -9584 -16668 -21191 -593 15009 13838 2734 -13367 -15900 -20828 -21202 -14978 -9132 -1930 2385
11289 2385 -2282 -3450 -3233 -1367 -2481 -124 2801 -4639 1473 4845 -6144 -12131 -15777 -17435 -23244
11274 -23244 -22887 -15912 -8181 -4625 -5104 -14578 -31046 -16041 6913 5275 -6718 -15364 -11387 -4825
11260 -4825 -17828 -18582 -12150 -1437 -1023 -12125 -19338 -19824 -20178 -10499 -4419 4629 16074 -7703
11246 -7703 -5943 8405 16202 15978 10 -6516 -2350 -1785 -9982 -4057 -13220 -28168 -27988 -22965 -11424
11231 -11424 -14871 -8472 -22542 -29905 -30842 -22537 -14481 -10565 -10115 -2923 9578 2713 -9207 -7429
11217 -7429 772 15124 25943 10981 901 -15211 -29991 -30671 -20339 -30822 -31851 -20408 -16918
11204 -16918 -7718 12229 11490 -4383 -21630 -20867 -13324 9672 9569 -6972 -5170 -98 -14186 -22978
11190 -22978 -5695 8138 11769 9121 3426 1359 -14226 -14284 -12742 -17336 -26154 -37517 -34600 -17256
11176 -17256 -12788 -7569 -8902 5688 13624 13509 5002 -5255 -9467 -9994 -14183 -13221 -11051 -3238 -5768
11161 -5768 -10638 -9254 -2996 2688 7636 1223 -918 -888 -1406 6990 4407 3045 7318 138 -13501
11146 -13501 -8689 593 -1154 -17453 -10793 -10103 -8927 -5381 -3813 -15183 -8439 489 -6535 -1277
11132 -1277 -6904 -1438 511 -1034 -4910 -7345 -14042 -19549 -6805 7292 13990 11678 -1538 -1821
11118 -1821 3331 -4294 -8714 -9117 -12056 -19944 -14878 -14504 -21006 -15541 -4329 13112 13659 7610 11753
11103 11753 11518 14116 13029 14250 10569 5631 651 -3618 -8161 -15864 -19319 -22241 -20537 -13845 -22943
11088 -22943 -19735 -8507 -11322 -11969 -3472 -13034 -14830 -12477 -18044 -15761 -27824 -23004 -7671 -11104
11074 -11104 -15000 3918 8084 7008 13345 12177 4231 8667 5436 -1594 -10128 -14692 -11584 1463
11060 1463 18368 13895 -14753 -10950 -7980 -7953 -10308 -17169 -38207 -34753 -24670 -16013 -7892 -5281
11046 -5281 -3067 3123 -6527 -18451 -2031 15744 17291 15373 -19712 -30419 -28452 -21855 -16710
11033 -16710 -32593 -21608 -8486 3140 16576 632 -8969 -7497 -15444 -24109 -26424 -33414 -34073
11020 -34073 -21073 -17166 -15857 -13493 -10236 -2483 -13123 -9905 -11529 -11434 -3236 7524 7330 3311
11006 3311 -1500 -1337 4492 -5425 -14092 -8666 -18592 -30094 -36891 -30883 -33099 -27855 -8190 8297
10992 8297 -1843 -6244 -5435 -9849 -8587 -1707 4525 -2216 -11709 -16236 -31292 -13922 -2346 -968
10978 -968 -13352 -14061 -722 3950 9662 -1555 -486 7717 8696 -7788 -22168 -26502 -28318 -35097
10964 -35097 -37318 -30237 -27228 -28193 -34809 -32220 -24335 -10930 2731 23721 8780 4000 -11177
10951 -11177 -26350 -17527 -489 6533 5700 1719 -5107 -10660 -11506 -22953 -23620 -20357 -28959 -21983
10937 -21983 -17267 -22278 -19311 -28846 -27617 -15780 -13940 -7349 -5951 -9110 -8309 -3065 8280 7119
10923 7119 -7949 1482 4268 -9145 -11132 -15982 -15255 -3193 -13176 -10501 -9521 -8588 8767 9302 -6022
10908 -6022 -23174 -24911 -8499 3050 -5577 -929 6087 8198 -65 -6611 2271 12254 -8488 -30566
10894 -30566 -38464 -22051 -11491 -4663 1615 -4464 1434 3323 -10110 -14888 -12023 -7909 -9959 -11775
10880 -11775 -14886 -22583 -28242 -24077 -28923 -19981 -16751 -15808 -37912 -29871 -18240 -17540 -12734 -1872
10866 -1872 -12334 -24629 -26296 -41139 -43056 -42581 -33552 -21841 -28573 -15348 -16238 -13648 -1576 -7739
10852 -7739 -11761 -10152 -13673 -20472 -2756 -8322 -14534 1110 14945 13747 22697 13652 -5473 -12110
10838 -12110 -24525 -22906 -21839 -20314 -21871 -20333 -9429 -19360 -32502 -17573 -4794 -1179 -4459
10825 -4459 -4283 3361 -2566 -6184 4753 279 -7081 -13383 -13376 -5640 2990 -847 -5298 -19765 -30773
10810 -30773 -21550 -14669 -20202 -12021 -6713 -9067 -15497 -25217 -19276 -8070 -9302 -10177 -11378 -15986
10796 -15986 -9460 6136 15131 7681 -5407 -10906 -2460 13091 1977 -15689 -10417 -838 -1676
10783 -1676 -5028 -8000 -25567 -41018 -46514 -49562 -30520 -22548 -29640 -41335 -35911 -15125 3360
10770 3360 15708 27958 36360 32057 24128 19185 24603 26590 29458 23852 29474 31568 16141 -4104
10756 -4104 -22913 -6926 6604 3427 43 -1058 3159 -1619 -13837 -5868 8262 17432 13122
10743 13122 1015 -7930 -5177 -2379 3427 21797 22175 11969 3646 -9242 -13857 -20535 -12236 1237
10729 1237 -2278 -12585 -19776 -37823 -25622 2 28329 34793 17196 7228 15272 848 -4153
10716 -4153 -1309 -9806 -24335 -22678 -14260 -7094 1505 4847 -19999 -10638 16923 18260 6059 2815
10702 2815 5087 16244 15962 12691 6201 1036 3313 -196 9906 15965 21021 21529 15167 20880 44723
10687 44723 84052 91131 82444 94642 94884 86536 101251 116436 124521 138068 161625 219325 303990
10674 303990 401533 593053 960718 1585323 2588309 3920636 4604929 3509380 2092433
10665 2092433 1266288 843357 594299 437574 334824 266306 208447 165149 137869 112674
10655 112674 88668 77726 77845 74315 70312 75424 73391 62757 46366 32828 27398 25280 14094
10642 14094 9052 5656 9141 7712 8832 11577 11363 9788 11247 28065 34796 32902 46218 51547
10628 51547 40716 22532 12380 9281 9433 11390 27682 46425 81877 114031 96828 61368
10616 61368 35582 26114 29865 26392 15591 18208 17793 19254 30122 28279 21175 8911 -6995
10603 -6995 -9968 -18113 -32387 -32378 -18188 1088 6526 11381 21306 8149 -790 -8502 -16453 -18545
10589 -18545 -1181 15280 10749 -2121 -15699 -3620 7498 18004 20876 14846 7557 3100 7915
10576 7915 506 -10219 -17823 -13446 -24381 -32490 -27267 -12079 -8473 -9717 -5178 -2719 2791 -618
10562 -618 -550 -5114 -7994 3385 16902 17855 1343 -15009 3002 12193 -2330 -11974 -6322 791
10548 791 8018 -3762 -11045 2386 5313 6975 -2567 11543 2551 -4341 4162 6513 8937 2120
10534 2120 -9455 -17215 -3514 12985 9754 4128 -5100 -14119 1400 24421 24110 16381 -5967
10521 -5967 -10640 4676 6304 3283 -2497 5702 18690 20067 7723 10239 9781 33667 47975 25452
10507 25452 2950 -6940 4046 6287 -1845 -3517 -580 1399 2105 -4245 -8712 -4372 -5418 -19702
10493 -19702 -24401 -25718 -13105 -7690 -9950 1158 -10254 -13399 -4573 -313 -6974 -4857 -4528 -2919
10479 -2919 8656 13633 -5577 -15998 -9991 2867 5231 11568 4107 3241 3521 9400 20576 17221
10465 17221 798 -10202 -12343 -28415 -24168 -4006 -5095 -6684 -15161 -2358 9215 25720 19391
10452 19391 13561 -4891 4128 21391 40595 33356 25273 26813 9471 5906 6827 7833 6759 -7801
10438 -7801 -6614 -7491 -6093 11719 9299 1238 1647 -8683 -15527 -18785 -18159 -11673 -8332 78 -10784
10423 -10784 -29811 -28804 -20815 -20912 -28157 -12841 -12069 -26465 -19016 -9744 -7556 3321 7223 16601
10409 16601 20691 13119 14680 16337 22787 25811 21449 22606 21314 18160 6097 2856 -4963 -9183
10395 -9183 -14892 -23059 -8336 -8230 -12747 -15098 -11742 1256 5543 -6631 -26320 -28713 -31243 -29518
10381 -29518 -20429 -29531 -36113 -23974 -14697 -2526 -7517 3889 12836 8544 9435 10942 -387 11837
10367 11837 13856 2673 9503 8452 2754 10725 14621 15117 9593 776 16115 22598 17922 20319
10353 20319 14187 5850 9800 1964 -11035 -21532 -32097 -42993 -42893 -24926 -15540 -9675 3227
10340 3227 -6961 -12742 -13322 5516 13919 -3270 7566 5818 -5285 -10602 -24311 -32294 -23132
10327 -23132 -23110 -24104 -23596 -21998 -26380 -16686 -9441 -16401 -3413 5736 7422 9306 12288 17827 15905
10312 15905 10978 -2326 -7173 296 331 -2353 -11325 8225 11521 -7408 -9755 -21636 -25637 -32425
10298 -32425 -14945 8691 10422 9590 2947 1185 -809 5883 112 -78 1766 3515 -2477 -9597
10284 -9597 -6660 7290 -1265 2342 1099 -10887 -12388 -16652 -22321 -18546 -16193 -4950 -7071 -6483
10270 -6483 5576 7538 13653 18441 16945 6853 6960 11136 21798 9171 4179 12463 2914 -2083
10256 -2083 -4535 -7053 1152 25979 35536 30993 26089 20241 -1731 -3434 6869 14563 12951 6758
10242 6758 -4824 -6134 -1837 5479 1344 -6683 6610 2543 3596 16458 23177 8218 8909 8471
10228 8471 -7515 -16379 1641 3343 10022 33562 78557 128488 168968 144689 92342 56608
10216 56608 37443 13695 5672 -108 -4282 7139 -8781 -15231 -9637 -8594 5408 23808 21302
10203 21302 12459 9834 -8472 8580 9902 14829 11115 -4198 -9855 -3762 -5571 -10263 6504
10190 6504 3014 -9287 -14079 -9025 9824 16959 17523 21165 12446 7937 3987 2480 1405 -8036
10176 -8036 -10913 -2267 10198 11560 20397 16485 4496 3769 12258 8632 31048 31249 17257 21304
10162 21304 16060 14119 7443 -6753 -14154 -11996 -1690 9404 5791 5923 2072 5655 9646 14185
10148 14185 6586 20053 11730 8241 12067 1396 -1001 4587 -2713 -10248 -1842 11240 10712 11554
10134 11554 10593 13829 7120 4837 4219 -4038 -8637 -14873 -9674 -112 -272 14480 19193 9882 5013
10119 5013 9506 17385 10960 -2054 4487 3666 14641 33538 52680 44877 32787 12797 3181
10106 3181 23384 47688 61226 59021 81803 124314 182685 260632 379003 581275 989635
10095 989635 1734810 2905337 3708427 2597072 1390839 812946 523793 378554 292899
10086 292899 220256 165344 138041 119323 90800 68104 68168 60960 60399 67615 79187 87036 65693
10073 65693 44130 23815 32946 22343 15532 22276 5630 -185 -4111 -1424 9777 159 -2738
10060 -2738 4375 19227 -5994 -19913 -774 2140 24381 43039 14116 636 4279 16309
10048 16309 6365 -4127 -7091 -8197 1556 20701 11698 24135 18774 -2718 12637 25967 23976
10035 23976 72 -19093 -15761 1442 4602 -561 -7902 -3737 173 10500 19304 20939 11434
10022 11434 12486 16149 17026 23245 15890 14742 4442 1142 14688 17732 15109 8725 3508 107
10008 107 1665 10367 13366 20284 27084 23933 15675 20008 27653 33367 32706 6680 -4109 2644 -6194
9993 -6194 -18748 -19049 -15946 -10038 -12779 -5299 -12589 -18700 -9268 -7111 -12179 -6498 -6809 -3190 5850
9978 5850 8054 8222 10273 22081 21081 21150 13780 13256 7110 -6468 -11218 -2125 7212 8443 3257
9963 3257 -4014 -552 31334 68424 68831 28938 365 -3576 7756 19884 14133 743 -2820
9950 -2820 -3965 -7848 -12261 -5010 -10908 -21324 -17392 1185 12656 16406 6870 12336 15338 8044
9936 8044 -10270 -10939 -21992 -23284 -15410 -11552 -21007 -16436 -900 4177 9383 3413 2776 1409 -11792
9921 -11792 -11922 -7092 -1553 11719 8185 6572 18874 22303 23104 12901 2458 10542 4135 -12273
9907 -12273 -21951 -20345 -22013 -9415 -13191 -12551 -6363 5853 14759 13884 10183 10608 13046 3771 18706
9892 18706 27622 9221 900 6430 9239 21664 31256 22957 19365 21631 18290 23200 27966 19932
9878 19932 25523 18893 10509 18510 21241 27032 22524 -1377 -8978 2174 10573 21171 20763 2091
9864 2091 -17330 -20430 -10086 -10875 -3577 21777 20597 9632 5791 5862 14682 13085 15179 20275 19922
9849 19922 20121 15031 23486 20073 9027 1613 -10219 -7867 5852 -1271 -5172 -7035 -4744 -4077
9835 -4077 2923 -828 -5535 10054 18342 29654 26497 22763 24658 13479 -3550 -6359 -3674 -3372
9821 -3372 -788 -777 5842 12119 -1370 -15647 -20522 -16587 -2284 11501 7112 4246 7648 16410
9807 16410 19298 14371 17609 10023 -2123 -4649 17105 23278 4181 -9190 -7616 -3918 -6752 8682
9793 8682 9772 5196 1612 -2178 6928 2647 -916 -4763 1760 9677 2548 -6082 -13427 -27521 -6262
9778 -6262 10096 9030 12767 10500 -6370 -12320 -15718 -11297 -1208 -7821 -4888 1821 14064 4819
9764 4819 -6931 -13967 -13674 -5823 -5106 -5462 10469 -5372 -17918 -6521 -2900 -6385 4775 26566
9750 26566 25301 30848 31525 23648 21280 6948 14507 18888 31491 38237 37955 27076 22292 23190 19288
9735 19288 16158 15442 1773 4783 2583 -1540 -5843 -5310 4432 1740 6585 10516 7194 -5960 -7170
9720 -7170 1184 -4992 7466 12789 11340 15126 25069 37665 25933 23883 28955 24868 17102 21541
9706 21541 19438 13610 -3594 -932 4285 22273 20863 6945 -3251 2542 17032 15082 35024
9693 35024 48031 48397 39307 38529 50579 42398 29736 29236 30615 20835 15433 23423 25370 33069 32277
9678 32277 39012 36505 35128 41818 30322 25405 17825 15447 19311 23731 23495 11767 1572 1425
9664 1425 -11173 -8724 2128 -1592 2354 16221 30476 32218 23548 14057 29700 50834 46641
9651 46641 38406 23764 -730 -17600 -2703 4750 9891 7161 8132 7361 3041 4247 7976 20184
9637 20184 27480 15783 11154 19084 17061 10199 15084 24046 21166 18322 24884 22669 19430 20438
9623 20438 20649 21544 28694 24453 21490 24929 37427 48157 32742 19908 19193 20474 21107 24121 21960
9608 21960 18570 18135 25673 34351 39670 45104 33942 36851 37019 46725 48580 35861 28233 47858
9594 47858 49183 27587 27339 39990 44478 57613 55689 37393 21209 17741 20173 45842 46769 52242
9580 52242 52700 61000 72681 77273 64763 48621 35159 39538 38888 48951 51394 36975 42959 52703
9566 52703 61512 68576 69461 57645 63410 77773 73779 71266 62888 51122 54242 60151 70209 82049
9552 82049 75768 70881 73977 69452 58477 48969 49368 54981 67297 88142 86189 65018 67444 73912
9538 73912 61477 72836 79949 90423 94636 81940 77943 90660 100282 98205 92384 76866 72540
9525 72540 83023 97136 104473 103387 108117 114285 116200 105814 100240 103159 94389 98556 113121 126399
9511 126399 125707 130766 122997 114887 122344 116914 114518 117247 118572 127334 136044 139318 138170 135520 141566
9496 141566 156912 170578 175331 157855 165083 166613 177041 186699 181647 174822 175602 189046 196578
9483 196578 199716 191950 187741 183826 192462 186167 188791 200307 210768 211292 215611 219130 218614 234048
9469 234048 244024 249772 256206 248840 244141 255136 262785 257022 276401 291610 285608 277178 285851 308098
9455 308098 321995 339347 340724 339753 355570 362110 361424 359609 359074 376949 400755 408058 420934 424889
9441 424889 429187 446418 463168 456826 447963 478203 515086 526256 527110 543144 560538 573843 574928
9428 574928 579204 600028 618472 617080 627200 637961 649350 653949 688828 707838 717989 731212
9416 731212 743766 759226 772320 789471 812031 810987 815721 817989 823808 825585 838041 858312 862232
9403 862232 866083 875234 870307 862908 886478 897209 897431 908919 912065 915873 926857 919726 896710
9390 896710 879966 883011 891953 886307 883417 883336 871370 858842 848213 819271 806866 795249 790480
9377 790480 777500 754816 742855 723284 716365 713537 707264 708865 699839 674665 646271 648650 631895
9364 631895 614698 607317 608918 601965 567566 534121 521289 527752 518261 519932 516958 515398 506529
9351 506529 471153 458559 446777 434798 422047 417831 409352 401881 404257 399182 370202 345903 356373
9338 356373 350076 332096 334903 347360 336875 329146 313929 303196 285904 265300 259069 259462 256040
9325 256040 235063 235796 235458 232607 233857 240471 242928 234300 218319 210312 200091 192426 185120 180781
9311 180781 187129 192303 200808 199041 187956 174530 172387 175874 168475 167336 177913 180209 165286
9298 165286 151937 141226 137584 125581 119257 110227 115114 142268 154530 152384 143836 145049 152093
9285 152093 146778 134611 120907 118878 126234 117565 109763 102455 106751 123881 125850 105017 90334
9272 90334 82645 77203 80779 96233 104021 95499 90321 83965 78706 80171 92489 112223 102793 90474
9258 90474 77633 68824 67171 57001 53674 50259 54872 61018 75672 89088 90685 79155 69153
9245 69153 75627 81720 83002 76076 83883 76495 64503 64150 60956 58635 57086 61811 47496 44308
9231 44308 47003 48646 42149 42941 38407 35717 38763 33681 40672 31216 37965 33194 33856 39621 42136
9216 42136 45391 51996 56220 60594 61481 50866 42086 45525 56120 71798 75081 74806 68476 57249
9202 57249 52321 66673 74756 73645 72165 58049 43864 43545 43162 56466 66140 62779 50252 43839
9188 43839 57074 67505 72925 54423 36997 30432 33244 21513 19477 33149 44047 46240 45021
9175 45021 44654 34643 28213 29801 29955 46058 52273 48541 28763 31887 47960 62737 54979 26662
9161 26662 22158 20256 19591 29450 28393 20417 28868 37338 25943 21725 35400 39890 42224 47404
9147 47404 43351 34553 30921 22163 17223 13330 8347 2879 2129 16982 31575 38101 43912 46885
9133 46885 50525 46437 52993 51897 28575 26887 28654 31125 32079 24194 24648 31241 31311 40787 48822
9118 48822 41380 32891 30946 30671 17193 7621 7532 11296 27894 21550 17848 11548 3006 3305 -1803
9103 -1803 -6729 -8538 2537 6487 -4983 7466 20794 21102 19169 24137 4330 3938 15563 9313
9089 9313 12557 7489 15431 14661 11487 8429 3880 11820 9918 14606 22062 2887 -14900 -15950 6581
9074 6581 29715 25099 8187 13064 18893 31152 39949 33435 37635 29822 8104 -14256 454
9061 454 19033 27798 24473 13697 7128 -3716 2830 1517 14179 38106 20526 -5917 9072
9048 9072 26493 22632 3891 -3223 -7131 1729 7855 20066 24508 30648 36779 34356 27131 23801
9034 23801 20319 14577 12337 17834 13794 12802 24453 19364 10161 10683 3823 8547 18367 15528 3846
9019 3846 11555 32315 31918 17143 11393 18150 13378 -6784 -23024 -28329 -25969 -2565 29551 35026
9005 35026 36713 22415 1261 -20634 -19328 -6567 6698 14382 15995 -2770 4767 4179 9962
8992 9962 6856 844 -5582 -2468 -1101 14791 19294 14136 14776 23513 13370 -728 -6830 2635
8978 2635 8009 8528 3238 -3835 2077 15407 11843 5520 13987 19910 14611 5512 5546 12158 6438
8963 6438 84 20780 19247 15409 16293 17491 20436 6157 -3192 -4041 6447 14775 7325 12816 9491
8948 9491 6732 4742 1305 13163 19277 26120 9098 15235 -519 -1202 11301 15025 13020 1991
8934 1991 -14582 3276 7280 22104 32132 26711 28917 27328 26186 13675 6050 8313 17144 23503
8920 23503 28724 31399 16216 12380 6212 -3766 4709 15529 17645 10951 9678 15614 6793 -11062
8906 -11062 -18729 -25155 -19835 -20590 -24523 -14175 -2788 1743 -1390 -4556 619 19028 23507 16337
8892 16337 10786 381 1169 10872 18574 18307 8701 24 -4424 -4575 9125 23144 23790 23751 34761
8877 34761 25415 14410 -1091 -6645 -10541 -15662 -7523 5042 27400 32611 15548 10332 12495
8864 12495 6730 12572 24548 30074 18518 14548 25830 18260 20721 26644 20752 31489 41090 30324
8850 30324 14466 7479 -220 -4502 -11339 -9176 8336 9167 -3572 -777 1933 -4237 6345 -1130
8836 -1130 882 6119 -5246 -15981 -13865 293 12439 13979 5995 15406 24726 7648 2531 27302
8822 27302 36460 18258 6252 -197 -647 -8704 -11150 7267 17798 7558 6537 7972 9079 8214
8808 8214 -4828 7791 -597 -16962 -25906 -11474 -10285 -615 6844 16545 -1877 -12906 -7418
8795 -7418 3131 15199 9353 4555 6738 13720 33122 44787 42125 29977 21831 13006 -5999
8782 -5999 5405 21913 16331 14336 18436 20803 6788 865 3786 -4860 -2556 6962 24324 28342
8768 28342 21675 23932 11991 1186 1845 3284 11327 23506 22533 7933 13779 29411 31623 22374
8754 22374 2166 12841 5154 -8199 -13462 -14054 -18280 -9348 -7443 -2594 -2034 -4773 3990 2343
8740 2343 12489 6337 -8925 -12786 -8377 -5590 -14683 -7763 -2474 -12147 -23490 -207 -5268 -16072
8726 -16072 -14039 -14624 -6885 11504 12737 -10933 -17216 -20881 -29582 -3455 20971 19634 25671 7289
8712 7289 -3022 -5889 -7891 -3727 -2997 5301 9483 12302 -5409 -23122 -11198 -20930 -5693 -2480
8698 -2480 12526 25957 23101 29856 26678 12094 8574 4771 5344 2591 -6063 -8748 -23108 -21770
8684 -21770 -6627 -3468 -14545 -20881 -5957 5508 6470 13402 28250 22375 4600 -4436 1900
8671 1900 14933 14574 6185 2055 3508 12887 20296 23786 21764 16604 11827 7402 8030 11046 19802
8656 19802 29624 44471 28143 25088 36769 38317 24904 13289 2507 -3206 3048 6119 2415
8643 2415 6886 11795 14605 17526 10368 559 -8752 10381 22771 17359 139 6454 13261 27000
8629 27000 34397 35659 30197 11242 6649 7782 7813 9251 26849 28381 39024 38585 26023 27765
8615 27765 19889 16832 16201 34288 39601 53657 71150 65707 73490 80754 90070 94292 88960 89325
8601 89325 86995 85374 86762 96583 97698 93895 90769 75140 59899 50715 37095 18090 16958 8607
8587 8607 28794 36155 14795 3459 9077 18819 -1343 1036 14858 16925 7224 4857 9083 10335
8573 10335 16525 19183 20896 17434 16522 18522 16167 12389 8860 8197 12092 19224 25490 22036 19847
8558 19847 21180 16253 14293 -1367 -11647 -17150 -8833 -4450 -2869 4271 7500 -1114 -3315 23449
8544 23449 15164 2292 -501 6941 13084 11184 12266 1485 3065 7519 -169 -21579 -22030 -14406
8530 -14406 -17897 3359 -6468 -6193 5471 18536 11739 1643 562 10454 19457 26607 37823 29988
8516 29988 17680 3945 10341 17222 17653 6663 -1642 -5078 -500 -3475 -13817 486 14893
8503 14893 15664 3624 7176 10805 1185 17020 36573 40370 34555 16328 1435 -7520 -18159
8490 -18159 -29016 -27819 -24744 -15894 -13218 -5216 -1638 -5288 -13867 -10153 11082 3769 -3569 5620
8476 5620 15363 25442 34230 28982 22888 21543 16337 5123 -2918 11172 15666 -4732 -4530 10916
8462 10916 21721 5811 -4987 -842 11481 3352 -10565 -912 11738 6299 9282 21683 20689
8449 20689 11875 7884 -4217 -882 -8389 -6138 -9789 -7205 -10908 -22666 -19167 -5551 -2236 278
8435 278 -1675 -6493 -7735 -4762 -7391 -5940 -8451 -3916 -4627 -8403 5035 11416 14090 20361 14020
8420 14020 10182 -1117 -10823 902 2930 8488 4602 -16884 -21740 -7712 6631 17252 19559
8407 19559 15725 16756 20488 25923 30183 19807 3631 10596 16465 3612 -3963 370 -2123 720
8393 720 7127 8738 14880 8916 -14296 -26251 -21299 -10331 870 -4301 -12663 -7925 -13318 -10693
8379 -10693 -11508 -13710 -7910 8564 9813 1543 -681 3735 1055 -3417 2966 1615 -1107 -12025
8365 -12025 4420 12084 5909 7889 6869 -5496 -14810 -12996 1277 -2312 -10265 -10307 6601 19512
8351 19512 10241 4860 -4340 -7624 -11514 -9520 -1135 -1040 5458 -3132 -12483 -5328 -2883 6654 12054
8336 12054 -2714 -8860 -16320 -12909 -3433 6706 10397 10760 -3927 -12413 -11014 -1715 8716 -8364
8322 -8364 -32008 -20870 -12428 -4621 -12256 -9364 14090 191 -16338 -4339 -5065 -2713 -115 10766
8308 10766 9715 7795 1990 -457 5750 3155 214 7252 22642 31993 16711 14590 9457 3644
8294 3644 7991 9929 3305 4481 15336 5970 6265 4891 19046 29205 12267 7091 8061 6469
8280 6469 -928 -18558 -26067 -32862 -41712 -47673 -47600 -21658 -1846 1694 -3256 -704 -653 4567 3997
8265 3997 -2491 -3327 9318 -345 8123 2074 4586 1839 5534 1127 5420 17800 11672 -6318
8251 -6318 381 6167 11995 19346 13973 26265 33340 19681 4392 -16214 -34733 -31299 -18270
8238 -18270 -3624 -10639 -10474 -956 -5648 -19723 -17574 -150 -1184 -1756 5143 9815 15476 16588
8224 16588 16232 10290 1405 3568 -5121 -19091 -23299 -15274 -15173 -24891 -22551 -19322 -8187 1969
8210 1969 5376 -10654 -14854 -9591 2732 1276 -4894 -7728 -9575 -5743 5107 -8417 -21229 -32188
8196 -32188 -18680 73 17777 28711 27241 11965 3932 12840 -128 -10239 -6706 -830 -5021
8183 -5021 -7216 12847 13524 732 -2047 -11771 -12471 2705 -643 -25490 -49300 -46666 -40516 -5550
8169 -5550 20503 22068 13471 10361 5904 -4950 -10850 8826 19153 16046 -3797 -11504 -11913 -12139
8155 -12139 -11708 -15147 -18928 -7937 -6545 -7128 -14894 -8299 -1345 8327 17753 22633 10386 8881 15164
8140 15164 6596 -111 3139 14145 -2239 -3137 860 -9207 -17410 -21716 -29770 -48828 -38537 -18543
8126 -18543 6612 6013 7104 14247 18707 291 -8668 -10783 -13017 -295 2459 -6512 -2119 -4830
8112 -4830 2869 -10230 -12969 -7913 -20733 -26397 -16103 -6585 -3132 -5074 -10756 -10328 -7857 3371
8098 3371 7748 -4150 -6583 10958 14530 12156 7222 8811 -2382 -8265 -8330 -16577 -22811 -14412 3394
8083 3394 576 -7420 1207 12400 19605 30287 36439 19684 21200 17246 14358 15304 26094 20758
8069 20758 7527 1115 -9997 2326 23252 33739 28781 15900 4297 2386 10334 480 384
8056 384 8822 13736 19835 18190 26247 32124 15124 -6493 -19497 -21640 -25429 -19110 1671 13649
8042 13649 22993 33851 31705 27780 26291 21933 -1831 -12443 -2967 4278 9252 19905 22088 18005
8028 18005 14290 1217 4142 17166 27435 27170 19498 6535 1970 10469 22620 36305 25756
8015 25756 12195 2394 -258 6129 7186 25675 27513 20047 14377 9574 6051 6123 5632 3349 9230
8000 9230 12432 15260 17218 23427 23311 13948 14053 25184 25077 12134 8327 -4253 -4938 -863 -216
7985 -216 422 6104 14452 12942 9091 4917 -13983 -8509 8724 9028 4051 -1226 -5305 -8445 -10229
7970 -10229 8106 19930 13816 34156 48006 54419 51753 21679 8211 16784 3580 3808 10980
7957 10980 5894 5664 22137 46562 43233 49613 35026 15707 3022 -3722 2142 5162 3045 -4507
7943 -4507 -15715 -11816 5732 4993 1751 12225 27968 20181 8096 21429 19132 22650 17652 17837
7929 17837 21038 27609 24514 9052 15475 20139 21029 16768 8718 -3957 14228 23075 27909 18546
7915 18546 18116 26914 24068 32719 26555 1585 -556 796 -964 11655 4980 1188 -3807 6320
7901 6320 12555 4707 16671 28086 30129 28200 34627 31629 30762 22865 15952 10118 -6308 4345
7887 4345 10338 16005 16780 11770 9084 5683 -12641 -16281 -12257 -17362 -20912 -6483 6144 18576
7873 18576 23449 23917 11378 -2272 5889 212 -6244 -8773 -403 798 -4860 -5804 14365 21636
7859 21636 5709 8269 13534 21615 20769 8396 2531 -6800 -15522 -19738 -17600 -1464 -5894 -16934
7845 -16934 -13002 -6172 -13960 -17153 -17936 -2480 2710 -8607 -9451 -3381 -4295 -3679 -6763 7892 12466
7830 12466 10125 19828 21342 10307 8385 -4875 -22486 -11119 -1067 -12783 -18141 -16324 -19018
7817 -19018 -12544 -14339 -16 14309 4046 -5939 -1580 384 5001 12496 11899 9782 6272 15910
7803 15910 26995 38898 34480 28809 30965 19423 11825 -2181 -7617 -2051 -7092 -13340 -6770 -2868
7789 -2868 -4138 -10788 -12672 -8276 -27 6741 -10873 -26212 -12594 634 -7380 -10696 -431 9694
7775 9694 3683 2885 5943 15978 12282 -7279 -17991 -10209 -4730 -2767 -9784 -7213 -6322 -7525 3054
7760 3054 15726 30711 24247 3502 -5964 -7521 -8433 -7122 16693 23116 13094 11361 12579 21699
7746 21699 28937 21737 13057 20026 22027 13228 12066 3350 1545 -6172 -5089 -650 8476 2358 2332
7731 2332 -5711 -13355 -13828 -23403 -33342 -17387 -5265 -4675 -7197 -6992 -13986 -6467 -10671 -8690 -1492
7716 -1492 -16706 -19363 -8599 -9998 -4987 8990 17704 20640 8017 -11319 -18378 -11144 9257
7703 9257 4984 -820 -12130 -17965 -3906 -5751 -1549 -3730 -11694 -17753 -13468 -11855 -13871 -10022
7689 -10022 -10052 -11716 -15745 -10615 -3699 -1571 -11532 -17531 -11595 -10122 -15831 -10534 -7211 -7080 -23778
7674 -23778 -33497 -23587 -22438 -24550 -12043 -15212 -6185 -4367 -16695 -13445 -13853 -19973 -19156 2740
7660 2740 9186 -845 -1765 -11033 -16117 -20196 -16839 -4090 -11541 -29187 -25911 784 852 -18314
7646 -18314 -14132 5409 9408 13074 8177 -867 7918 348 -13004 -8131 -15416 -22346 -35471 -34190
7632 -34190 -24935 -22967 -2558 4205 1840 5254 10660 1553 -4576 -1538 -475 254 -5327 -2080 -11696
7617 -11696 -15000 -1592 4593 -3424 -5792 -3692 -8488 -20339 -4903 5735 11926 6729 -10492
7604 -10492 -19114 -7393 -12298 -6630 29863 40235 39217 21374 2207 -1331 -1908 12229 7232
7591 7232 -4808 -1971 -1216 -1712 3573 6340 6673 6312 -158 -4176 -16450 -11411 1849 12311 6179
7576 6179 3955 7600 21248 16307 12686 6031 7002 3037 2150 -5218 3590 19928 22312 12909 -3170
7561 -3170 -14187 -24116 -18164 -14374 -14267 -9709 -14315 1009 18875 18784 2432 14991 -5105 -30167
7547 -30167 -23241 -13431 -17203 -34195 -29248 -8344 -8260 -16277 -16792 -22641 -16650 -18284 -18530 -8722 -8387
7532 -8387 -10613 -6118 -7318 -5050 -718 3808 -3959 1940 3881 5288 2231 4197 12048 26465 18033
7517 18033 12030 24950 9562 11753 10612 4812 15342 3027 -14363 -15883 -18339 -21255 -9327
7504 -9327 -7053 -8835 -6228 -7188 -10615 -5863 -8425 -31864 -39313 -26236 -22420 -1760 11029 15635
7490 15635 13017 603 -5856 -8565 -24903 -27705 -12059 3333 -4010 -9124 -10819 -1843 -6739 11048
7476 11048 2330 -19822 -27987 -31970 -19165 -2589 -11205 -25964 -40370 -32691 -18688 -29771 -28707
7463 -28707 -31796 -24713 -8454 7499 22449 14500 19473 8574 -10981 -3098 17026 5763 4855
7450 4855 6501 8282 19755 10827 -6234 -3372 874 -17495 -40140 -26199 -8328 -10618 -10787 -6157
7436 -6157 -1272 -9664 -30426 -62255 -61754 -55866 -49208 -32319 -13154 -12401 -17370 956 7597 -757
7422 -757 -6006 -16517 -11804 -9422 -3076 -3830 821 -1576 8103 9430 -5628 -2101 16472 13688 1949
7407 1949 -5975 -14960 -22206 -6696 3848 1773 -5778 -17288 -15407 -11049 -15809 -4189 444 -8160
7393 -8160 -5379 -4296 -1484 5148 6763 8421 1757 -1272 647 10060 3698 -243 -13030 338
7379 338 11236 -9637 -18860 -22275 -20505 -26372 -41331 -40065 -36813 -39603 -19709 13721 22088 17237
7365 17237 14306 -1429 -14252 -13463 -12736 -11284 -16369 -11827 -8666 -19187 -11544 -1289 -6558 -5584
7351 -5584 -6770 -1495 -8880 -6480 3257 14629 11438 -2837 -8487 -12739 -15544 -2338 -11034 -21653
7337 -21653 -16041 7524 17939 17701 22084 13031 4500 6527 14628 25582 29263 7375 414 5000
7323 5000 3773 3099 -6363 2591 17024 -2052 -9028 1243 -2811 -3214 2232 -3279 659 1136 2530
7308 2530 -7605 -6101 3661 10019 4550 -6461 -5974 -13929 -16991 -13715 -4912 185 -4648 -11425 -7916
7293 -7916 -8795 -15126 1862 13480 -3273 3069 8393 1027 8457 -12221 -32223 -26016 -24439 -15828
7279 -15828 -1298 4157 12251 6672 -6047 -14882 -14463 -10500 -2614 7875 4330 6121 -230 -6700
7265 -6700 2232 7535 -3598 -22273 -27866 -24027 -19516 -8813 -9788 -4496 4695 -4915 -5247 -7022 -7775
7250 -7775 -17531 -17410 -13604 -19376 -30002 -23640 -8816 -2212 -10781 -23321 -28938 -20936 -9559 -4795
7236 -4795 6649 5310 -998 -1904 -15070 -17579 -19698 -20355 -15090 -5834 -2511 -7359 4775 -3636 -12741
7221 -12741 -12520 -8174 -8117 -21547 -14731 -14180 -10100 -4876 38 -4290 -10930 -5596 12086 11032 -5575
7206 -5575 -7016 598 -10800 -24322 -15905 -17725 -24411 -11507 13171 11326 -842 -10222 -8079 -5375
7192 -5375 -10535 -7595 -10369 -6574 -14946 -16981 6391 11615 -414 -12062 -3195 -11871 -17673 -14937
7178 -14937 -13576 -17043 -25299 -17949 -25333 -26492 -17728 -16173 -4474 -4018 5127 6225 3281 373 -3431
7163 -3431 -5358 -8938 7155 18598 21796 19811 24360 23412 11505 -5929 -12139 -12503 -2623 -4716
7149 -4716 -607 7544 5976 13078 10117 15807 5148 515 -10162 -11960 -12117 -13037 -17531 -3218 5233
7134 5233 4929 -9140 -12458 -17767 -19331 -3870 -6474 -1913 -7091 -14249 -13860 -13489 -19092 -11443 -6358
7119 -6358 -20519 -26644 -19750 -14195 -23849 -34617 -18723 -7736 -20799 -23242 -18639 -27837 -35258 -21257
7105 -21257 -2046 -6938 6271 8538 13971 12822 2873 -11363 -8782 -3175 -5384 -10191 -6446 -1539
7091 -1539 -8664 -309 5224 4757 9781 18088 6085 -13304 -14379 -18208 -13876 -5151 5224 -8767
7077 -8767 -23871 -28601 -33053 -36196 -40258 -31769 -32974 -13611 -10133 -168 17330 18865 16484 9497
7063 9497 17297 11002 4068 -43 -12309 -12333 -9563 4067 5859 -7603 -8851 -5533 9633 6837
7049 6837 -6658 -18046 -14743 -6917 -323 1400 -2637 -6831 -8503 -7269 -31418 -27841 -32141 -36397
7035 -36397 -28271 -7978 10261 3739 -24168 -13943 -284 9624 5966 -13083 -16244 -11002 -9968
7022 -9968 -14894 -12284 -8766 -4285 -7528 -7725 -6160 6146 11810 -7419 -25817 -19723 -4523 -1511
7008 -1511 4281 11024 35127 25308 4935 5557 -1623 -3280 -494 5238 6187 -3053 -16238 -7223 -9155
6993 -9155 -13751 -25144 -41416 -31446 -26026 -4712 4345 -4775 -6733 17639 19195 17350 24328 10719
6979 10719 95 -12144 -23350 -22806 -19057 -27123 -24304 -26168 -28777 -17063 1626 18596 20805
6966 20805 9382 4604 -7390 -18324 -14110 -9418 2344 15459 4274 -4030 2065 12283 2407
6953 2407 -12760 1783 20735 18776 9819 27 1457 6835 10093 15168 11940 384 -6887 -7114
6939 -7114 -6970 5363 9725 3835 8429 -9935 -15011 12033 14902 4505 11630 19194 32176 39510
6925 39510 32837 19375 8712 -11956 -22688 -22134 -15994 -10182 -2929 8584 11060 5223 -17670
6912 -17670 -18844 9375 17009 7050 5564 -3039 -2977 -3151 11699 17067 6855 -1672 -8066 -8930 -4263
6897 -4263 9435 14026 17048 3592 4122 13132 26298 7519 -12268 -5972 1673 6506 5225 13241
6883 13241 22713 26840 27975 14980 8252 13499 10775 -12657 -19965 -13669 -10476 -19645 -29241 -32822
6869 -32822 -36914 -29794 -23229 -17370 -18833 -16412 -22754 -24639 -22102 -23174 -30059 -22181 -30560 -32245 -29261
6854 -29261 -12449 -15521 -17497 -27746 -16576 -10434 -13023 -23881 -29097 -13770 3213 3152 -3709 -12961
6840 -12961 -18000 -38295 -39154 -20122 -14047 -9507 -9403 -9030 -12049 -17170 -17241 -16425 -9349 -7937 -2599 8026
6824 8026 17878 -5138 -12904 -5462 -1708 8434 14254 20704 12256 2402 2893 1334 -9107 -13203
6810 -13203 -7967 -2129 19917 6232 916 -1566 1188 -8795 -25294 -28565 -14513 -10511 -17820 -26590
6796 -26590 -22734 -20115 -15590 864 -4889 -11739 -12102 -8496 1006 4288 -1223 1697 -4966 1073 -10610
6781 -10610 -12264 -11279 -5137 -3713 -3576 -6059 -2853 -6579 -5538 8387 31322 24777 18865 -6790
6767 -6790 -11279 4606 10699 11023 13298 -6320 -4882 1908 -695 -16949 -18216 -23595 -26441 -25040
6753 -25040 -15592 -11061 -17039 -5488 8123 11000 15081 16875 4105 -10202 -13268 -21961 -29892 -21352
6739 -21352 -14071 -7799 -6096 -10004 -9594 -2677 -9909 3916 18881 2235 -7630 -7047 -13088 -5060
6725 -5060 7051 957 -16855 -19411 -19691 -20373 -16715 -30342 -37102 -20089 -10721 -23108 -17993 -6447
6711 -6447 -2427 -5391 -2932 5761 202 -12275 -2108 6108 17619 14282 4487 -3431 -5271 -13529
6697 -13529 -12499 -2047 -8448 5431 2767 -7332 -24472 -17598 -22327 -9210 5871 14403 16715
6684 16715 15788 6559 -2796 -32639 -32276 -16144 -5878 -9760 -12168 967 5554 8153 6694 4976
6670 4976 14518 8111 -6504 -25368 -33313 -27094 -26354 -8909 8688 5810 1881 12081 14457 1077
6656 1077 -2576 3442 8328 -8399 -13965 -3364 14209 16046 20728 7530 -17085 -22477 -10495
6643 -10495 -11988 -3699 -53 -8548 4078 6252 11709 26246 25128 44040 62549 50864 32593
6630 32593 32383 31785 14164 14958 18520 23098 33883 51603 55392 77984 107328 130108 150653 204292
6616 204292 293231 453712 777870 1328993 1871685 1520609 840749 479966 307839 216364
6606 216364 175556 160709 128214 92594 65603 58741 67109 60893 56641 54477 50270 35641 14813
6593 14813 4194 20196 40380 52713 29293 14109 24658 25775 27466 28021 22243 15432 10029
6580 10029 -3449 -111 12606 15622 12179 27157 31319 22990 445 6527 20476 19057 12054
6567 12054 8071 12346 4238 -10795 -3090 17732 6958 -5306 -3313 11791 7576 -1830 477
6554 477 3735 10768 17921 23179 14454 5744 -3179 9168 17092 22425 22368 5981 3405 16431 18476
6539 18476 14115 3807 -6994 -10400 -11845 -1560 -7248 -20534 -14188 -11035 -16587 -28111 -22119
6526 -22119 -13279 -9560 -24654 -28374 -5237 5685 1324 -8125 -18677 -6504 -9590 -1724 -2553 -15361
6512 -15361 -6039 2720 -1819 -7762 -1403 11 -7952 -5571 4225 2492 -591 7220 -3871 466
6498 466 786 -8979 -14211 -6528 -10115 -2283 -4223 -11044 -8153 -4900 -13302 -17728 -29113 -24618 -9472
6483 -9472 -3086 -10233 -14642 -8046 -9726 2310 128 -3126 -2589 7115 9329 13387 12253 21863 16688
6468 16688 -1812 -9905 -18546 -6920 -3454 -9877 -11154 -5598 -16589 -28006 -43650 -32272 -26163
6455 -26163 -18487 130 -3357 -6393 -11649 -4913 -5715 -19239 -30203 -21619 -24535 -28303 -34315 -18259
6441 -18259 -11386 -8752 -24042 -24086 -21620 -11718 -1263 3090 -3462 -1404 5123 -6045 -5118 -12822 -13128
6426 -13128 -15014 -14069 5094 6947 1524 6773 6163 127 2508 6168 15806 -4619 -18031 -13538
6412 -13538 -7817 -11834 -7150 483 4604 14574 9235 6907 14700 -5426 -3981 -9261 -19675 -16555
6398 -16555 -3832 10136 16049 6051 -3427 -10995 -16079 -9295 598 -16143 -30869 -27400 -9805
6385 -9805 3816 12426 7110 4399 7467 -7613 -5111 4845 23052 43316 40337 22099 18531 408
6371 408 -3764 -1513 -12812 -11467 -12880 -7352 -10300 -9522 -12253 -16132 -492 3433 11179 18777 21035
6356 21035 10416 10633 6392 -6117 -10629 -11192 -806 7009 -13384 -26723 -27428 -19675 -3833 -4084
6342 -4084 4479 16330 15610 10672 -14377 -26035 -35831 -42604 -24968 -27831 -37186 -30889 -19339 -3023
6328 -3023 -3235 -18411 -23553 -18104 -6867 -1889 -6949 -13748 -7055 -9252 -1941 12048 18488 15711
6314 15711 1005 -9542 -24318 -16600 -933 93 2657 7441 6336 -799 -14845 -10924 -12707
6301 -12707 -5918 10349 22311 14984 -11568 -20002 -12500 539 9831 9969 1695 602 -5501 -28585
6287 -28585 -21422 -25346 -23087 -12877 -7074 -8113 -8402 -4309 -2051 -5903 6917 12229 9470 -1257
6273 -1257 4220 759 -1503 -21 12601 12502 -375 4610 13477 14519 -1046 3699 9580 787 4331
6258 4331 10540 11614 11567 1994 950 5686 -176 -18856 -22958 173 14708 10943 9819 3092 -947
6243 -947 12571 4101 2270 -4155 -3208 -9567 -15949 -6438 -8409 -1232 -12676 -6485 1885 10809 4949
6228 4949 -2123 9483 9532 8525 16938 -187 -16865 -18034 -11168 -2413 -20752 -27526 -16155 -7493
6214 -7493 -7103 2970 12750 11845 -1307 -9500 -10209 10299 -3733 -20795 -16236 -5754 -10641 -31659
6200 -31659 -29752 -10599 -7681 -9084 -833 212 11925 9996 5183 27924 31381 16008 8431 7706
6186 7706 -1799 1737 -7370 -964 -753 -3672 4444 2493 -7738 -16428 -12379 -7178 2834 3656 5138
6171 5138 7933 19735 29096 17387 11133 1839 4917 12762 10473 3241 7371 -1256 -5752 6060
6157 6060 -6935 -16933 1760 14916 16687 12778 4908 2725 346 -144 -11068 -18954 -17237 -16816
6143 -16816 -15688 -14908 799 9898 6641 14256 27485 29291 19768 26057 22804 10197 2777 -7728
6129 -7728 -20654 -16306 -5378 9090 10256 8388 15616 15008 20099 9680 -922 1573 -14215 -11654
6115 -11654 -1330 14254 16021 -3493 1009 4394 -6657 -16001 -20054 -23397 -16259 -17503 -2148
6102 -2148 16116 20942 32209 30971 11581 15044 5147 -17678 -16407 -18573 -7527 3180 -1976
6089 -1976 10512 2506 -11871 -14856 -20588 -21462 -14737 -6411 5862 37015 33597 21777 10627 -6939
6075 -6939 -17413 -14453 1915 14671 1913 -8768 -12527 -8887 640 -1357 -25556 -27333 -13687
6062 -13687 -11437 -28602 -31312 -2538 2435 -225 -927 -9743 -11701 -10534 -8190 -2533 -3711 2957
6048 2957 -627 -4794 2000 9538 13775 6133 1866 -8130 -30289 -25597 -9426 -11574 -15700 -5299
6034 -5299 1136 -64 4706 5068 -1174 -15398 -14929 -9585 -10002 -23053 -25317 -14932 -4356 770 1318
6019 1318 -12780 -20183 -3990 -6713 -3160 1202 7257 -3837 -17157 -36503 -41885 -32852 -13683
6006 -13683 -690 -5098 -11779 6155 13851 -2039 -8996 -14780 -17975 -16478 5131 19584 3548
5993 3548 -4164 3067 12616 26548 30930 17972 5628 2565 -48 1848 6596 4831 8280 -6876
5979 -6876 -31298 -24254 -2352 5079 -2012 9407 13451 19080 4816 3341 21248 13339 1114
5966 1114 5866 2741 -7491 -9066 -21195 -13537 -10346 -1920 -8647 -17766 -21193 -14866 -3126 4577
5952 4577 10289 15055 12547 -247 11074 9264 -5006 1342 6695 -7460 -14518 -17447 -19489 -5967
5938 -5967 1986 10460 10105 353 -4760 11339 30796 19007 5339 -4617 5830 9265 2589 -10836
5924 -10836 -13470 -8039 -5945 -13704 -2020 -4373 8260 9213 23712 11210 5218 2673 7834 5031
5910 5031 -5780 -21068 -11885 4336 25153 19960 -2986 -16133 -3842 -4585 -389 10460 9770
5897 9770 44 10125 13902 19582 39380 28316 7357 3740 13093 978 8619 5603 -8110
5884 -8110 -14233 -29998 -20571 -22165 -16481 -986 14258 12806 788 -10468 -8914 -3576 -10870 -20984
5870 -20984 -28528 -20951 -22489 -23279 -13175 2776 17210 18545 11686 -6491 -5565 -9647 -21994 -20418
5856 -20418 -20190 -3611 477 -7062 -20659 -12512 -1594 -1103 -13465 -2107 -5233 -22441 -20708 -14102
5842 -14102 -23393 -144 1892 -7877 -6869 -2315 -12640 -9074 6752 17638 15431 19565 27482 23749
5828 23749 19798 6781 -4345 -6322 61 -9258 -10674 -10477 -13498 -5204 -7513 -14587 2873 15936
5814 15936 6934 -1539 -8042 -19010 -975 6541 2936 1224 -4322 -3626 -1850 3285 -6386 -2594
5800 -2594 6786 -12374 -31375 -31846 -24888 -18153 -20176 -25087 -21482 -13821 -7731 -10724 -3598 11540
5786 11540 20076 23717 33730 23282 20013 27055 7952 10604 12788 485 -251 9057 -940 -5633
5772 -5633 -5147 -11867 -13581 -8990 -17688 -11206 -13435 -18137 -11421 -16203 -23822 -18719 -7610 -11001 -20824
5757 -20824 -13918 -13439 -14563 -11009 1732 7278 -1365 -18275 -32902 -32187 -31126 -19712 -18481 -30214
5743 -30214 -30368 -21006 -6352 3055 7917 4201 -6911 -11087 -25982 -31363 -24773 -18569 -1091 -8805
5729 -8805 -16377 -16482 -12919 -4674 1701 -8719 -14035 -8191 -6004 2097 13517 19290 15535 14752 16871
5714 16871 23567 31991 26805 5610 -5351 -23040 -17004 -14627 -11369 -3561 4087 -5094 -15326 -18991
5700 -18991 -22161 -12908 -5358 -5435 -10877 102 11780 -12402 -12007 -1836 -106 4076 1375 -9153
5686 -9153 -2797 83 -5290 -8366 -14766 -17076 -4821 110 3753 14858 18015 19639 11468 8264
5672 8264 16436 28161 16646 6236 3764 1242 269 -5310 1085 3307 -15193 -23213 -8196 -6248
5658 -6248 -4799 -9322 -7001 2869 4651 -1825 15989 18442 11297 23522 33204 39676 25563 23800
5644 23800 22210 14324 7903 2982 -266 -11715 -16854 -2907 -5517 -4597 13446 6233 8368 2898
5630 2898 12581 18102 5358 15403 14269 5251 723 8980 4394 -2418 -9701 -12657 -8013 -131
5616 -131 2072 1125 -585 -11736 -11544 -13138 -2813 -11752 -20789 -28359 -11632 -1256 -1417 10609 14683
5601 14683 22993 22273 6815 -4698 -8232 -16386 -14189 -10834 -11905 -11931 -12811 8479 19536 7087
5587 7087 2132 -6396 -2720 12379 6607 -1850 4293 -994 -26027 -30121 -21901 585 20855 22854
5573 22854 27505 23961 30059 26953 10278 16092 20264 7473 9365 15046 21512 20333 36968 33639
5559 33639 26583 13369 -5018 660 437 1130 -6460 -168 6093 11835 13697 8702 19074 14375
5545 14375 3799 -6281 -9549 8344 24772 30264 15535 8845 -19081 -44456 -34372 -30627 -23952
5532 -23952 -19765 -29352 -31941 -9215 -11005 -16772 -1852 -7055 -7611 -13537 -13034 -7302 -11022 -8033 -3186
5517 -3186 -2712 -2554 -6607 -857 7955 6668 -9893 -14319 -17618 -27418 -20225 -18490 -22241 -13602 -3785
5502 -3785 -799 5266 -17198 -23425 -13658 -13383 -27414 -28879 -13002 -13180 -6815 -3428 -11809 -21354 -11692
5487 -11692 2416 3510 -3723 -15164 -17782 -8102 7362 20749 11932 -2687 -20101 -16367 -10690
5474 -10690 -4990 -13797 -18250 -9396 -8750 8662 14940 1780 -16053 -21531 -30541 -52917 -45673 -30352
5460 -30352 -20177 870 5624 -5323 6072 14189 -6084 -24824 -7273 15255 11067 22860
5448 22860 26162 7703 -10989 -25530 -15298 -3845 3226 -6666 -31456 -33906 -25932 -17038 -7544
5435 -7544 -47 -6285 -12855 -29923 -26842 -2034 16383 7105 11750 21219 23925 3446 -12022 -17992
5421 -17992 -25595 -36281 -39664 -32277 -15583 -32533 -39260 -22099 -5712 6425 23584 20005 24146
5408 24146 11462 26359 34744 22798 7223 -1902 932 2143 -7057 -8476 -3297 -13795 -13383 -2502
5394 -2502 -17095 -9546 13802 24194 19732 20417 10453 17377 15807 10548 15591 9976 2246 -6509
5380 -6509 -11589 5851 19816 16858 4372 -2678 -1530 11933 24578 25664 13816 9673 8310
5367 8310 5004 8087 6602 -6482 -12717 -22899 -12029 365 -3250 9793 5006 1721 -3616 -7735
5353 -7735 -9609 -10490 -5994 -20967 -21533 -637 -4668 -17773 -20122 -7787 2145 8491 -2544 -3312
5339 -3312 -4982 -3539 -1575 -9185 -8896 4394 4375 -1328 -14491 -13848 -15364 -11102 -11569 -13627 -15650 -5419
5323 -5419 11368 6092 6868 790 -12179 -10851 -12351 -18957 -21472 -13972 -11015 -8844 -12919 -9272 -6824
5308 -6824 7578 9471 -199 4692 -600 -7237 -19231 -24860 -18900 -16306 -20639 -27948 -14983 -15939
5294 -15939 -17484 -21756 -14291 -9622 -813 16001 35798 37836 26397 16232 -4437 5208 19053
5281 19053 -2132 -14874 -5623 11938 8216 -6254 -14588 -4061 340 12119 14638 15617 12220
5268 12220 13785 -1726 1210 10120 10075 3813 -781 -3570 -14390 -15794 -2853 -2624 -12507 -11928 -8271
5253 -8271 704 15303 27996 27109 16772 11414 2225 -3869 -2029 -4408 -1889 11351 9641 7037
5239 7037 25398 20505 462 11544 17530 17957 19560 -7764 -4020 2653 -5678 -5556 -20358 -9853
5225 -9853 -1581 -13816 -17734 -3759 8174 2402 -875 -12864 -12927 -8286 -3100 -497 -11784 -1327
5211 -1327 -10397 -11546 -12101 -7780 -11021 -9036 -7071 -1359 -683 -10710 -12864 -19286 -14090 -4870 -14602
5196 -14602 -23901 -1087 16313 8312 1880 -3669 -11036 -7112 -952 2412 414 -4678 -12565 -12225
5182 -12225 -12919 -7532 145 10505 14949 10038 2171 -1941 -4310 -10720 -26711 -22814 -10040 11145
5168 11145 8912 3652 7011 -12509 -20881 -15195 -11406 -12074 -12414 -14807 -13875 -13119 -4028 831 9084
5153 9084 9020 913 -13164 -13473 -12635 -18339 -15310 19585 18694 2364 3073 -3368 -5880 -4609 999 4881
5137 4881 7786 14520 10458 6642 11771 2110 2850 3617 17435 4873 -11563 -16199 -4714 1686
5123 1686 5935 203 4361 3776 -2188 -14511 -15312 -10491 -13473 2485 13445 6291 -6435 -11944
5109 -11944 -9265 -16430 -9312 8147 3265 -10357 -18430 -8067 -2566 -12879 -4875 -7768 -15472 -16297
5095 -16297 1059 11524 19178 5670 134 -6656 -2921 -14221 -31183 -18646 -8503 -5132 -1996
5082 -1996 -5545 -7776 3368 -1080 -12050 -13751 -4803 9673 -819 -3425 8353 3271 4235 -9268
5068 -9268 -6890 -5588 -20095 -12587 -7151 -3546 -6299 -3817 -5948 -2135 9201 5986 996 -6786
5054 -6786 -20493 -36249 -39646 -24115 -28870 -32745 -14860 -14231 -20677 -14434 -13170 -24701 -16510 -21403
5040 -21403 -18369 -10489 -2991 -5836 -6955 -3433 5227 13577 13603 8592 15609 10324 -2299 -3623 -7219
5025 -7219 -17778 -17008 789 5854 1463 -1915 -1768 -15790 -25594 -14929 -17892 -17201 -4275 6508
5011 6508 5232 2588 7792 6789 4930 97 -12619 -10398 9300 16555 2941 -5009 2689 11704
4997 11704 8112 14541 22926 8946 -14861 -12122 -1577 1585 -737 5302 -480 -7711 -4616 6203
4983 6203 7354 -1705 6081 17966 -4602 -19263 -13896 -21560 -20309 -7554 -5032 -5126 -10086 -17610
4969 -17610 -24820 -1944 10011 13885 14792 11885 16503 25317 9735 -2174 -3770 -3792 -6458 -20429
4955 -20429 -30031 -29783 -27647 -23821 -17020 -10104 7117 15102 11203 -2907 -3822 -499 3337 11745 11647
4940 11647 10736 12529 6337 -125 -6435 4253 5515 -644 -1807 -1022 2735 10940 6912 6798 19349
4925 19349 12481 -2136 1789 -3791 -17581 -11946 -4813 -6914 -13202 -10096 646 1039 -5088 -2577
4911 -2577 -1147 -7553 -7102 10009 -6554 -8565 -823 8244 10460 5365 2415 11084 17526 9417 10821
4896 10821 11911 4499 -5673 -23666 -31478 -13128 4481 12861 -143 -10778 -4577 9632 8986
4883 8986 151 -10759 -13296 -2981 -7512 -45 8353 12990 -3886 -19013 -18373 -22937 -13771 5094
4869 5094 16042 20433 18025 -3810 -24264 -25516 -31597 -18817 -9880 -5987 -5959 -7264 1648 2221 -13072
4854 -13072 -18822 -4497 6162 9983 17394 15916 3263 6715 20661 29188 25912 24559 23289 4628
4840 4628 6064 7734 17422 12113 1900 -6508 807 23164 22832 16897 19701 17583 8952 8063 7334
$$ [...]
##END NTUPLES=NMR SPECTRUM
##END=
