##TITLE=Analysis number 326270
Compound Code sb 01038
Project Code adrs
Chemist Name stores
##JCAMPDX= 6.0         $$ Bruker NMR JCAMP-DX V2.0
##DATA TYPE= NMR SPECTRUM
##DATA CLASS= NTUPLES
##ORIGIN= Bruker BioSpin GmbH
##OWNER= nmr
$$ XWIN-NMR		Version 3.5
$$ Tue Jan 30 13:38:35 2007 GMT Standard Time (UT+0h)  MAYBRIDGE\nmr@NMR_250MHZ
##.OBSERVE FREQUENCY= 250.131544655141
##.OBSERVE NUCLEUS= ^1H
##.ACQUISITION MODE= SIMULTANEOUS (DQD)
##.ACQUISITION SCHEME= undefined
##.AVERAGES= 16
##.DIGITISER RES= 18
##SPECTROMETER/DATA SYSTEM= dpx250
##.PULSE SEQUENCE= zg30
##.SOLVENT NAME= CDCl3
##.SHIFT REFERENCE= (INTERNAL, CDCl3, 0, 16.522)
##AUDIT TRAIL= $$ (NUMBER, WHEN, WHO, WHERE, WHAT)
$$ ##TITLE= Audit trail, XWIN-NMR		Version 3.5
$$ ##JCAMPDX= 5.01
$$ ##ORIGIN= Bruker BioSpin GmbH
$$ ##OWNER= nmr
$$ C:\u/data/dgb/nmr/ADRS/2330/pdata/1/auditp.txt
$$ ##AUDIT TRAIL=  $$ (NUMBER, WHEN, WHO, WHERE, WHAT)
(   1,<2007-01-30 13:38:01.64 +000>,<MAYBRIDGE\nmr>,<NMR_250MHZ>,
      <created by zg, POWCHK disabled, PULCHK disabled
       configuration hash MD5:
       49 4B E0 1D 92 C2 6B 37 9F E6 65 BC 52 41 86 1D
       data hash MD5: 64K
       68 5C F1 BC 19 A0 2B C8 AA 84 26 F5 EB 3C 29 ED>)
(   2,<2007-01-30 13:38:18.84 +000>,<MAYBRIDGE\nmr>,<NMR_250MHZ>,
      <Start of raw data processing
       ef LB = 0.3 FT_mod = 6 PKNL = 1 SI = 32K 
       data hash MD5: 32K
       47 5D 26 B1 0B 44 10 5A C0 FF 80 78 6C FB 1C F2>)
(   3,<2007-01-30 13:38:24.22 +000>,<MAYBRIDGE\nmr>,<NMR_250MHZ>,
      <apk 
       data hash MD5: 32K
       53 B5 A0 AF 3A 3B 58 81 36 1A FE 59 A1 E4 13 2F>)
(   4,<2007-01-30 13:38:25.81 +000>,<MAYBRIDGE\nmr>,<NMR_250MHZ>,
      <abs ABSG = 5 
       data hash MD5: 32K
       E7 13 EE A0 99 58 30 21 A9 6D 1D 4D D4 CA 59 5A>)
$$ ##END=
$$ 
$$ hash MD5
$$ 2C 54 65 62 1C 3F E0 D3 1A A8 3C DB CD AA 96 12
##$RELAX= 
##$RELAX= 
##$RELAX= 
##$RELAX= 
##$RELAX= 
##$RELAX= 
##$RELAX= 
$$ Bruker specific parameters
$$ --------------------------
##$DU= <C:\u>
##$EXPNO= 2330
##$NAME= <ADRS>
##$PROCNO= 1
##$TYPE= <nmr>
##$USER= <dgb>
##$AMP= (0..31)
100 100 100 100 100 100 100 100 100 100 100 100 100 100 100 100 100 100 
100 100 100 100 100 100 100 100 100 100 100 100 100 100 
##$AQSEQ= 0
##$AQ_mod= 3
##$AUNM= <au_zg>
##$AUTOPOS= <35 >
##$BF1= 250.13
##$BF2= 250.13
##$BF3= 250.13
##$BF4= 250.13
##$BF5= 500.13
##$BF6= 500.13
##$BF7= 500.13
##$BF8= 500.13
##$BYTORDA= 1
##$CFDGTYP= 0
##$CFRGTYP= 5
##$CHEMSTR= <none>
##$CNST= (0..31)
1 1 145 1 1 1 1 1 1 1 1 1 1 1 1 1 1 1 1 1 1 1 1 1 1 1 1 1 1 1 1 1 
##$CPDPRG= <>
##$CPDPRG1= <>
##$CPDPRG2= <>
##$CPDPRG3= <>
##$CPDPRG4= <mlev>
##$CPDPRG5= <mlev>
##$CPDPRG6= <mlev>
##$CPDPRG7= <mlev>
##$CPDPRG8= <mlev>
##$CPDPRGB= <>
##$CPDPRGT= <>
##$D= (0..31)
0 1 0 0 0 0 0 0 0 0.06 0 0 0 0 0 0 0.0002 0 0 0 0 0 0 0 0 0 0 0 0 0 0 
0 
##$DATE= 1170164279
##$DBL= (0..7)
120 120 120 120 120 120 120 120 
##$DBP= (0..7)
150 150 150 150 150 150 150 150 
##$DBP07= 0
##$DBPNAM0= <>
##$DBPNAM1= <>
##$DBPNAM2= <>
$$ [...]
##$SUBNAM7= <"">
##$SUBNAM8= <"">
##$SUBNAM9= <"">
##$SW= 20.6930455092707
##$SWIBOX= (0..15)
0 0 3 0 0 0 0 0 0 0 0 0 0 0 0 0 
##$SW_h= 5175.983436853
##$TD= 65536
##$TD0= 1
##$TE= 294.16
##$TE2= 300
##$TE3= 300
##$TEG= 300
##$TL= (0..7)
0 120 120 120 120 120 120 120 
##$TP= (0..7)
150 150 150 150 150 150 150 150 
##$TP07= 0
##$TPNAME0= <>
##$TPNAME1= <>
##$TPNAME2= <>
##$TPNAME3= <>
##$TPNAME4= <>
##$TPNAME5= <>
##$TPNAME6= <>
##$TPNAME7= <>
##$TPOAL= (0..7)
0.5 0.5 0.5 0.5 0.5 0.5 0.5 0.5 
##$TPOFFS= (0..7)
0 0 0 0 0 0 0 0 
##$TUNHIN= 0
##$TUNHOUT= 0
##$TUNXOUT= 0
##$USERA1= <user>
##$USERA2= <user>
##$USERA3= <user>
##$USERA4= <user>
##$USERA5= <user>
##$V9= 5
##$VALIST= <valist>
##$VCLIST= <CCCCCCCCCCCCCCC>
##$VD= 0
##$VDLIST= <DDDDDDDDDDDDDDD>
##$VPLIST= <PPPPPPPPPPPPPPP>
##$VTLIST= <TTTTTTTTTTTTTTT>
##$WBST= 1024
##$WBSW= 4
##$XGAIN= (0..3)
0 0 0 0 
##$XL= 0
##$YL= 0
##$YMAX_a= 582202
##$YMIN_a= -566252
##$ZGOPTNS= <>
##$ZL1= 120
##$ZL2= 120
##$ZL3= 120
##$ZL4= 120
##$ABSF1= 16.522
##$ABSF2= -4.171173
##$ABSG= 5
##$ABSL= 3
##$ALPHA= 0
##$AQORDER= 0
##$ASSFAC= 0
##$ASSFACI= 0
##$ASSFACX= 0
##$ASSWID= 0
##$AUNMP= <proc_1d>
##$AZFE= 0.1
##$AZFW= 0.1
##$BCFW= 0
##$BC_mod= 0
##$BYTORDP= 0
##$COROFFS= 0
##$CY= 12.5
##$DATMOD= 1
##$DC= 0
##$DFILT= <>
##$DTYPP= 0
##$F1P= 14.0000005364418
##$F2P= -0.99999901652339
##$FCOR= 0.5
##$FTSIZE= 32768
##$FT_mod= 6
##$GAMMA= 0
##$GB= 0
##$INTBC= 1
##$INTSCL= 1
##$ISEN= 128
##$LB= 0.3
##$LEV0= 0
##$LPBIN= 0
##$MAXI= 10000
##$MC2= 0
##$MEAN= 0
##$ME_mod= 0
##$MI= 0
##$NCOEF= 0
##$NC_proc= -1
##$NLEV= 6
##$NOISF1= 0
##$NOISF2= 0
##$NSP= 0
##$NTH_PI= 0
##$NZP= 0
##$OFFSET= 16.522
##$PC= 1
##$PHC0= 78.57404
##$PHC1= 5.536747
##$PH_mod= 1
##$PKNL= yes
##$PPARMOD= 0
##$PSCAL= 4
##$PSIGN= 0
##$REVERSE= no
##$SF= 250.13
##$SI= 32768
##$SIGF1= 0
##$SIGF2= 0
##$SINO= 400
##$SIOLD= 32768
##$SREGLST= <1H.CDCl3>
##$SSB= 0
##$STSI= 32768
##$STSR= 0
##$SW_p= 5175.98343685301
##$SYMM= 0
##$S_DEV= 0
##$TDeff= 65536
##$TDoff= 0
##$TI= <Analysis number 999999
Compound Code 99
Book Reference 9
Project Code 9>
##$TILT= no
##$TM1= 0
##$TM2= 0
##$TOPLEV= 0
##$USERP1= <user>
##$USERP2= <user>
##$USERP3= <user>
##$USERP4= <user>
##$USERP5= <user>
##$WDW= 1
##$XDIM= 32768
##$YMAX_p= 362617838
##$YMIN_p= -13307
$$ End of Bruker specific parameters
$$ ---------------------------------
##NTUPLES= NMR SPECTRUM
##VAR_NAME=  FREQUENCY,     SPECTRUM/REAL,   SPECTRUM/IMAG
##SYMBOL=    X,             R,               I
##VAR_TYPE=  INDEPENDENT,   DEPENDENT,       DEPENDENT
##VAR_FORM=  AFFN,          ASDF,            ASDF
##VAR_DIM=   32768,         32768,           32768
##UNITS=     HZ,            ARBITRARY UNITS, ARBITRARY UNITS
##FACTOR=    0.157963299565203, 1,           1
##FIRST=     4132.6476996994, 0,             0
##LAST=      -1043.33573715361, 0,           0
##MIN=       -1043.33573715361, -13307,      0
##MAX=       4132.6476996994, 362617838,     0
$$ Real data points
##PAGE= N=1
##DATA TABLE= (X++(R..R)), XYDATA
$$ [...]
$$ plain form
16250 -2473 -1287 -950 -1332 -1765 -998 173 -1074 -581 910 1378 558 -657 -1073 -1890 -2559 -1380 -1558
16233 -1558 -1225 174 650 -30 -2079 -1990 -515 833 1516 717 206 13 60 -663 -301 1720 3307 1837
16215 1837 521 -596 -712 -709 -1585 -252 2792 3680 3416 2508 1076 175 -674 -490 -632 -1450 -2093 -2602
16197 -2602 -1722 -3728 -3483 -1143 41 1184 1935 1779 142 -322 324 826 -625 -2296 -2413 -2220 -2469
16180 -2469 -2588 -939 247 1002 -247 -939 -1056 -1600 -2139 -2253 -996 -1049 -943 -304 -1466 -1603 -1320 -249
16162 -249 -1548 -3515 -4021 -2713 -581 -1343 -1229 -1394 -372 -298 -1537 -1520 -1500 -1549 -496 208 -234 -1311
16144 -1311 -257 1577 601 834 2126 2329 870 159 -592 -939 -924 -1403 -715 -735 -2380 -2774 -3039 -3490
16126 -3490 -908 -668 -531 -277 67 1108 -695 -2607 -1963 -1432 -2095 -2593 -1923 -1117 -556 -1203 -1549 1031
$$ packed form
16250b473J186L37l82m33P67J171j247M93J491M68q20j215m16q17o69J179j78
16233a558L33J399M76o80k049Q9J475J348O83p99n11j93M7p23L62K021J587j470
16215A837j316j117j16Lq76J333L044Q88k64r08j432r01q49J84j42q18o43n09
16197b602Q80k006K45K340J184J143P51j56j637m64O46N02j451j671j17J93k49
16180b469j19J649J186P55j249o92j17n44n39j14J257n3J06O39j162j37K83J071
16162b49j299j967n06J308K132p62J14j65J022P4j239J7K0m9J053P04m42j077
16144a311J054J834r76K33J292K03j459p11p51l47J5m79O88k0j645l94k65m51
16126c490K582K40J37K54L44J041j803j912O44N31o63m98O70Q06N61o47l46K580
$$ plain form
16108 1031 2059 1094 239 -948 -462 -383 -1726 -994 -232 -1669 -1342 -768 -696 131 722 1243 1025 832 1997
16089 1997 1627 1018 208 930 225 -1619 -235 486 1169 1830 1632 1584 1668 588 -605 -1808 -3056 -2717
16071 -2717 -2645 -2244 -605 137 -552 -593 173 -83 126 -77 1334 1831 2173 1337 -192 -255 -331 -681 -2313
16052 -2313 -2807 -2593 -1976 -2016 -2724 -1568 -1155 -2531 -3132 -1336 -526 20 718 2150 2603 665 -566 -967
16034 -967 -2022 -149 -2072 -5377 -4492 -2204 -1773 -2103 -3192 -2973 -3698 -4785 -2971 -1853 -1015 -1482 -14
16017 -14 -137 -634 -990 -2126 -1840 -1366 -1024 -1776 -3646 -4453 -3254 -2747 -2604 -1844 -2072 -2414 -297 -193 -1010
15998 -1010 -2131 -2591 -2370 -3556 -3413 -3613 -3525 -3143 -1866 -3095 -3822 -2332 -2349 -1815 -2552 -2333 -2036 -1862
15980 -1862 -1747 -672 -640 -429 76 640 1326 864 85 -1267 -517 -690 -2000 -2600 -1078 -1144 -1150 -1740 -2359
$$ packed form
16108A031J028r65q55j187M86P9j343P32P62j437L27N74P2Q27N91N21k18j93J165
16089A997l70o09q10P22p05j844J384P21O83O61j98m8Q4j080j193j203j248L39
16071b717P2M01J639P42o89m1P66k56K09k03J411M97L42q36j529o3p6l50j632
16052b313m94K14O17m0p08J156M13j376o01J796Q10N46O98J432M53j938j231m01
16034i67j055J873j923l305Q85K288M31l30j089K19p25j087J814J118Q38m67J468
16017a4j23m97l56j136K86M74L42p52j870q07J199N07J43P60k28l42K117J04q17
15998a010j121m60K21j186J43k00Q8L82J277j229p27J490j7N34p37K19K97J74
15980a862J15J075L2K11N05N64O86m62p79j352P50j73j310o00J522o6on90o19
$$ plain form
15961 -2359 -4096 -3644 -2598 -946 -164 -733 -799 264 -289 -1805 -3158 -1326 -1006 -1131 -649 1453 1953
15944 1953 1263 -632 48 -457 -1315 -1362 -445 -175 -1737 -2442 -2152 -3133 -4145 -4205 -4123 -2913 -2693 -2976 -2020
15925 -2020 -902 11 -523 -1323 -879 -757 -404 -738 -1374 -1875 -2251 -2557 -2944 -3511 -3610 -3515 -1134 960 747
15906 747 582 390 1552 17 -634 750 2503 2221 502 -1154 -1091 -1368 -1746 -484 -34 -395 -241 -621
15888 -621 -918 -2627 -2764 -1942 -1789 -1228 -688 915 495 -478 5 1886 2629 2067 657 -485 -1135 -1456
15870 -1456 -134 940 1239 1676 320 -995 -2163 -2221 -1783 -1957 -1603 -1552 -1179 -682 -1166 -606 1272 1130
15852 1130 -685 -970 246 733 -443 -1571 -2535 -2565 -2408 -2117 -1709 -2597 -2793 -2336 -593 671 -497
15835 -497 -778 -1981 -3305 -2599 -3365 -3594 -3902 -4814 -5009 -3945 -2745 -1721 -2270 -1437 -577 -761 -1784 -3289
$$ packed form
15961b359j737M52J046J652P82n69o6J063n53j516j353J832L20j25M82K102N00
15944A953o90j895O80n05q58m7R17K70j562p05K90r81j012o0Q2J210K20k83R56
15925b020J118R13n34q00M44J22L53l34o36n01l76l06l87n67r9R5K381K094k13
15906G47j65j92J162j535o51J384J753k82j719j656O3k77l78J262M50l61J54l80
15888f21k97j709j37Q22J53N61N40J603m20r73M83J881P43n62j410j142o50l21
15870a456J322J074K99M37j356j315j168n8M38j74L54N1L73M97m84N60J878j42
15852A130j815k85J216M87j176j128r64l0J57K91M08q88j96M57J743J264j168
15835d97k81j203j324P06p66k29l08r12j95J064J200J024n49Q33Q60j84j023j505
$$ plain form
15817 -3289 -3877 -3476 -2532 -4079 -4107 -3064 -2728 -3701 -5451 -4511 -3012 -3081 -1362 -146 -1158 -788 -241 694
15799 694 556 -970 -2315 -2119 -556 1038 -266 -633 -1096 -1502 512 135 -409 -1015 -1832 -1986 -1354 54
15781 54 1103 1043 -441 -75 897 665 15 -282 -15 -1033 -1205 -125 1635 1025 -325 -1227 -711 977
15763 977 -10 -1162 -1605 -1314 139 317 304 -303 -341 -1936 -2000 -2665 -2860 -1993 -2544 -4232 -4315 -2578 -1693
15744 -1693 -3499 -3734 -3833 -2523 94 -318 -537 -66 -306 -680 1039 823 -933 -2727 -2548 -1632 -2412 152
15726 152 854 -215 -1500 -2190 -2103 -2152 -1697 -1802 48 1047 696 -372 -210 -824 -1885 -1922 -508 -23 -777
15707 -777 -2268 -2864 -2688 -2442 -2148 -1527 -1754 -1584 -292 -635 -1573 -3621 -5175 -3811 -3515 -3495 -2626 -1825
15689 -1825 -1667 -553 -1099 -795 -1173 -2059 -2658 -646 -305 -659 -1733 -1729 -2118 -2631 -1756 -391 509 336 -1354
$$ packed form
15817c289n88M01R44j547k8J043L36r73j750R40J499o9J719J216j012L70N47R35
15799F94j38j526j345J96J563J594j304l67m63m06K014l77n44o06q17j54O32J408
15781E4J049o0j484L66R72k32o50k97K67j018j72J080J760o10j350r02N16J688
15763I77r87j152m43K91J453J78j3o07l8j595o4o65j95Q67n51j688q3J737Q85
15744a693j806k35r9J310K617m12k19M71k40l74J719k16j756j794J79R16p80K564
15726A52P02j069j285o90Q7m9M55j05J850R99l51j068J62o14j061l7J414M85p54
15707g77j491n96J76K46K94O21k27J70J292l43r38k048j554J364K96K0Q69Q01
15689a825J58J114n46L04l78q86n99K012L41l54j074Ml89n13Q75J365R00j73j690
$$ plain form
15670 -1354 -1821 -625 -351 -880 -725 -1778 -2183 -2471 -4548 -4691 -3875 -1502 -1632 -3136 -3446 -1689 506
15653 506 -44 108 -1252 -2553 -2788 -2629 -3206 -3329 -2524 -2341 -2786 -2607 -3766 -5795 -4601 -3442 -1520
15636 -1520 -1017 -1148 -2017 -1714 -2294 -2472 -2218 -2058 -1722 -1923 -1898 -2154 -3089 -2175 -1844 -1430 -1076 -913 -1079 -2671
15616 -2671 -2641 -1120 -2296 -3634 -3121 -1003 -726 -2323 -1587 -571 514 1676 352 -797 -730 -1569 -2983
15599 -2983 -1578 -1030 -1579 -1446 207 -682 -1203 -882 -536 -758 -1400 -1854 -1841 -198 -857 -2893 -3503 -3167
15581 -3167 -2071 -537 91 -639 -1976 -2492 -2088 -1665 -63 376 -212 -1131 -2704 -1788 -2113 -2779 -4156
15564 -4156 -3508 -2803 -2089 -1340 -231 -1394 491 1305 1253 -1533 -3980 -2901 -2574 -2490 -535 -283 -1285
15547 -1285 -1851 -229 -733 -1549 -2090 -1537 -2656 -3312 -1862 972 919 -432 64 1036 2622 987 -977
$$ packed form
15670a354m67J196K74n29J55j053m05k88k077j43Q16K373j30j504l10J757K195
15653E06n50J52j360j301k35J59n77j23Q05J83m45J79j159k029J194J159J922
15636a520N03j31q69L03n80j78K54J60L36k01K5k56r35R14L31M14L54J63j66j592
15616b671L0J521j176j338N13K118K77j597P36J016J085J162j324j149O7q39j414
15599b983J405N48n49J33J653q89n21L21L46k22o42m54J3J643o59k036o10L36
15581c167J096J534O28p30j337n16M04M23J602M39n88r19j573R16l25o66j377
15564d156O48P05P14P49J109j163J885Q14n2k786k447J079L27Q4J955K52j002
15547a285n66J622n04q16n41N53j119o56J450K834n3j351M96R72J586j635j964
$$ plain form
15530 -977 -1600 -2219 -1141 -745 -940 -610 -1795 -2205 -2913 -3261 -2131 -2379 -1918 -1366 -171 -457 -1316 -876
15512 -876 -2233 -2351 -2152 -1471 -635 -302 147 376 4 935 645 -453 163 320 -1224 -1124 -1209 -1866 -1063
15493 -1063 -1095 -1815 -2031 -2054 -2701 -4299 -4751 -1755 -1557 -1412 -202 -323 -1171 -2945 -3593 -4456 -4143 -3736 -4795
15474 -4795 -3820 -1438 -757 -1981 -3071 -2604 -839 -3089 -2536 -1514 -1160 -2355 -3282 -3331 -5035 -6068 -5155
15457 -5155 -2802 -2332 -2580 -3223 -4527 -4094 -2214 -1599 -1182 -1211 -409 569 1041 572 -73 -543 -991 -2660
15439 -2660 -3856 -4036 -2591 -1576 -1459 -1723 -2408 -1725 111 659 1388 1801 265 -1373 -881 649 -220
15422 -220 -1024 -676 -301 -676 -599 -1738 -1459 -1442 -1954 -2028 -745 -215 -67 109 -420 -1287 114 426 -961
15403 -961 -927 -93 -1110 -1317 -929 -2113 -2491 -2592 -2696 -918 -863 -905 -471 -615 -1075 90 846 522 -749
$$ packed form
15530i77o23o19J078L96j95L30j185m10p08l48J130k48M61N52J195k86q59M40
15512h76j357j18J99O81Q36L33M49K29l72R31k90j098O16J57j544J00q5o57Q03
15493a063l2p20k16k3o47j598m52K996J98J45J210j21q48j774o48q63L13M07j059
15474d795R75K382O81j224j090M67J765k250N53J022L54j195r27m9j704j033R13
15457e155K353M70k48o43j304M33J880O15M17k9Q02R78M72m69o45m70m48j669
15439b660j196j80J445J015J17k64o85O83J836N48P29M13j536j638M92J530q69
15422b20q04L48L75l75P7j139K79J7n12p4J283N30J48J76n29q67J401L12j387
15403i61L4Q34j017k07L88j184l78j01j04J778N5m2M34j44m60J165P56l24j271
$$ plain form
15384 -749 -1012 -1632 -1252 -961 -918 -1445 -2328 -2605 -2327 -2534 -2847 -2059 -2267 -2098 -1887 -1856 -2003 -3140 -3589 -2858
15364 -2858 -2490 -2429 -2479 -1483 -2278 -1944 -1917 -2788 -1820 -1908 -1780 -1449 -2213 -1733 -2818 -3257 -2069 -1419 -823 -712
15344 -712 -1227 -1175 -2547 -2826 -2607 -2375 -1500 -1540 -1774 -2198 -688 43 2182 190 -1055 584 -724 -1899
15326 -1899 -2156 -2619 -1694 -941 -1136 -1180 -1637 -3450 -2746 -1678 -1310 -1568 -1745 -1908 -2246 -2277 -2444 -3192 -3391
15307 -3391 -2567 -1927 -2504 -2516 -1963 -3040 -3390 -3750 -3497 -2158 -1709 -1665 -2301 -2504 -2763 -1596 -1853 -3395 -2486
15288 -2486 -1414 -1262 -445 -58 -22 -475 -432 -1209 -1769 -314 -1706 -2287 -2602 -2806 -879 -893 -300 -1130 -3167
15269 -3167 -2394 -2591 -2112 -1009 161 789 407 -332 243 -1164 -1762 -2407 -940 -38 179 -866 -1457 -117
15251 -117 488 -1382 -2175 -3217 -3898 -2760 -2606 -3381 -4471 -5085 -4634 -4927 -3171 -1597 -1493 -1001 -1616 -2321
$$ packed form
15384g49k63o20L80K91M3n27q83k77K78k07l13P88k08J69K11L1j47j137m49P31
15364b858L68O1n0R96p95L34K7q71R68q8J28L31p64M80j085m39J188O50N96J11
15344g12n15N2j372k79K19K32Q75m0k34m24J510P31K139j992j245J639j308j175
15326a899k57m63R25P53j95m4m57j813P04J068L68k58j77j63l38l1j67p48j99
15307c391Q24O40n77j2N53j077l50l60K53J339M49M4o36k03k59J167k57j542R09
15288b486J072J52Q17L87L6m53M3p77n60J455j392n81l15k04J927j4N93q30k037
15269c167P73j97M79J103J170O28l82p39N75j407n98o45J467R02K17j045n91J340
15251a17O05j870p93j042o81J138J54p75j090o14M51k93J756J574J04M92o15p05
$$ plain form
15233 -2321 -4153 -3527 -2622 -3567 -3575 -2902 -2202 -2309 -3695 -2323 -209 -918 -1288 -1095 -1391 -1358 -1052 -2602 -2917
15214 -2917 -3179 -2090 -2829 -1611 -220 -1152 480 2569 1707 21 -2236 -1895 -983 -1400 -1873 -3506 -4834
15197 -4834 -3779 -2566 -2164 -2171 -2051 -2243 -2448 -1961 -1445 -1261 -1407 -919 -677 -2174 -3693 -3629 -2802 -2390 -3164
15178 -3164 -2324 -1953 -1146 -3 279 860 -30 -2391 -3340 -945 885 1322 349 -621 -19 -800 -1921 -3353
15160 -3353 -2485 -678 123 -319 -665 -639 -610 431 1509 279 -1229 -2717 -3026 -2412 -2443 -1280 -892 -769
15142 -769 -1088 397 -439 -2418 -2683 -2627 -3168 -2020 -3181 -2901 -1173 -1059 -1079 -1317 -560 -941 -537 -166 -1471
15123 -1471 -1811 -3185 -2996 -1306 -504 1147 1307 -412 -1914 -1113 -289 395 -236 -1409 -896 -540 -1798
15106 -1798 -796 1009 2364 -146 -875 -365 -239 -224 -1313 -3383 -3314 -3932 -4052 -1938 -1690 -2288 -2232 -1788
$$ packed form
15233b321j832O26R05r45qO73P00j07j386J372K114p09l70J93k96L3L06j550l15
15214b917k62J089p39J218J391r32J632K089q62j686k257L41R12m17m73j633j328
15197d834J055J213M02pJ20j92k05M87N16J84j46M88K42j497j519O4Q27M12p74
15178c164Q40L71Q07J143K82N81q90k361r49K395J830M37r73r70O02p81j121j432
15160c353Q68J807Q01m42l46K6K9J041J078j230j508j488l09O14l1J163L88J23
15142g69l19J485q36j979k65N6n41J148j161K80J728J14k0k38P57l81M04L71j305
15123a471l40j374J89J690Q02J651J60j719j502Q01Q24O84o31j173N13L56j258
15106a798J002J805J355k510p29N10J26J5j089k070O9o18j20K114K48n98N6M44
$$ plain form
15088 -1788 -924 -139 -861 -2873 -4272 -3253 -3479 -3561 -3568 -3528 -2624 -717 1012 1720 1462 536 845 1534 1003
15069 1003 -587 -1821 -139 210 -1201 -1993 -1357 -808 -1593 -2423 -1130 -354 -393 47 -120 -469 -272 -338
15051 -338 -198 76 279 76 -859 -1677 -1838 -1855 -1281 -1726 -1596 -809 1649 1114 767 810 -190 -663 -1419 -305
15031 -305 -309 -741 -860 -480 -970 -1028 -38 -649 -648 -1121 -1806 -2312 -2825 -4420 -2629 -728 646 812 -131 -1223
15011 -1223 -2212 -2146 -2662 -3453 -3130 -1966 -498 -485 -2916 -3698 -3242 -2808 -1972 -302 -880 29 1471 1360
14993 1360 -444 -886 -1022 -1747 -1937 -479 -515 -1732 -2878 -3152 -1965 -2748 -3666 -4266 -4262 -4159 -3156 -1628
14975 -1628 -1780 -2394 -2140 -2029 -2758 -3505 -2534 -2781 -3552 -3005 -1854 -974 -738 -480 -1265 -1419 507 714 -900
14956 -900 -2460 -2290 -2915 -4115 -4475 -2927 -2211 -3200 -2444 -2422 -2699 -3079 -4245 -2354 -2160 -1962 -1205 -850
$$ packed form
15088a788Q64P85p22k012j399J019k26q2pM0R04J907J729P08k58r26L09O89n31
15069A003j590j234J682L49j411p92O36N49p85q30J293P76l9M40j67l49J97o6
15051c38J40K74K03k03r35q18j61j7N74m45J30P87K458n35l47M3j000m73p56J114
15031c05mm32j19L80m90n8R90o11Jm73o85n06n13j595J791J901J374J66r43j092
15011a223r89O6n16p91L23J164J468J3k431p82M56M34Q36J670n78R09J442j11
14993A360j804m42j36p25j90J458l6j217j146k74J187p83r18o00MJ03J003J528
14975a628j52o14K54J11p29p47R71k47p71N47J151Q80K36K58p85j54J926K07j614
14956i00j560J70o25j200l60J548P16r89P56K2k77l80j166J891J94J98P57L55
$$ plain form
14938 -850 -2654 -2959 -2375 -1172 -1629 -3473 -3434 -3003 -2906 -3173 -4741 -4186 -4357 -3548 -4143 -4320 -3951 -3382 -3169
14919 -3169 -3711 -3291 -3236 -2147 -246 -1276 -342 -1003 -1027 -653 -1342 -2562 -1280 -2313 -3375 -3097 -2129 -2095
14901 -2095 -1111 -150 -117 -1802 -2460 -1097 -1441 -330 -2491 -4437 -4848 -2632 -1132 -1082 -1402 -2527 -2318
14884 -2318 -2135 -1438 389 2225 1472 240 -1684 -1697 -1466 -1580 -653 -1030 -2362 -3061 -4397 -4211 -1394
14867 -1394 -1918 -2612 -1149 -600 -1725 -884 -151 947 -125 -1370 -961 -32 418 -442 -2048 -1836 -2827
14850 -2827 -626 505 -583 -1694 -3064 -2523 -1773 -2214 -2318 -815 -1400 -2290 -2058 80 -64 -1676 -1910
14833 -1910 -1182 -1923 -1924 -2530 -3040 -2005 -1411 -643 -1746 -1852 -1704 -1862 -2695 -3978 -3150 -3474 -4019 -3004 -2490
14814 -2490 -3413 -3761 -3874 -2386 -3000 -2915 -2367 -1470 -881 -116 -320 -684 -2038 -2888 -1311 200 504 211
$$ packed form
14938h50j804l05N84J203m57j844L9M31R7k67j568N55j71Q09n95j77L69N69K13
14919c169n42M20N5J089J901j030R34o61k4L74o89j220J282j033j062K78R68L4
14901b095R84R61L3j685o58J363l44J111k161j946m11K216J500N0l20j125K09
14884b318J83O97J827J836p53j232j924j3K31j14R27l77j332o99j336J86K817
14867a394n24o94J463N49j125Q41P33J098j072j245M09R29M50q60j606K12r91
14850b827K201J131j088j111j370N41P50m41j04J503n85q90K32K138j44j612k34
14833a910P28p41jo06n10J035N94P68j103j06J48j58q33j283Q28l24n45J015N14
14814b490r23l48j13J488o14Q5N48Q97N89P65k04l64j354q50J577J511L04k93
$$ plain form
14796 211 -1129 -2510 -2129 -779 1146 1261 -57 -1953 -3758 -4423 -3997 -2480 -324 -190 -1217 -71
14780 -71 997 -1165 -3134 -2298 -744 -267 -802 -1219 -2330 -2202 -1501 -2391 -3107 -3197 -2615 -1197 691 -132
14762 -132 -1155 -1964 -2890 -1774 -2154 -2431 -1061 -525 -2835 -3306 -2077 -1062 -759 -1192 581 1386 1197
14745 1197 -429 -1157 -1694 -2647 -3073 -3217 -3665 -4309 -4025 -1115 -616 -960 -1219 -2218 -847 679 -462 -485
14727 -485 -965 -1784 -3061 -2509 -1377 -2003 -2588 -2426 -2172 -1174 -2159 -2873 -2274 -2226 -2263 -789 -295 934 1216
14708 1216 -1576 -3159 -2240 -1498 -972 -1536 -1600 -895 1151 1377 444 1095 1433 -69 -2493 -3264 -3601 -3000
14690 -3000 -3268 -2958 -1249 -699 -834 -894 -377 19 -653 59 84 19 67 -1201 -3378 -2445 -2042 -3749 -4111
14671 -4111 -4685 -5368 -3649 -3599 -1496 -1357 -483 -1150 -1352 -1910 -2852 -3608 -3445 -2171 -2177 -3862 -3462 -2615 -1765
$$ packed form
14796B11j340j381L81J350J925J15j318j896j805o65M26J517K156J34j027J146
14780g1J068k162j969Q36J554M77n35m17j111J28P01q90p16r0N82J418J888q23
14762a32j023q09r26J116l80k77J370N36k310m71J229J015L03m33J773Q05j89
14745A197j626p28n37r53m26j44m48o44K84K910M99l44k59r99J371J526j141k3
14727d85m80q19j277N52J132o26n85J62K54R98r85p14N99M8l7J474M94J229K82
14708A216k792j583R19P42N26n64o4P05K046K26r33O51L38j502k424p71l37O01
14690c000k68L10J709N50j35o0N17L96o72P12K5o5M8j268k177R33M03j707l62
14671d111n74o83J719N0K103J39Q74o67k02n58r42p56J63J274oj685M00Q47Q50
$$ plain form
14652 -1765 -2688 -3180 -1743 -2049 -2457 -3780 -3036 -2750 -2116 -1541 -657 -199 -839 -2699 -2273 -776 710 560
14634 560 87 -695 -2322 -3941 -3017 -650 245 1151 -185 -1814 -1691 -433 -1521 -1532 -1847 -3311 -3662
14617 -3662 -3449 -3718 -2870 -273 316 -176 -541 -2054 -2386 -2971 -937 402 817 1275 1095 1499 189 -166
14599 -166 1178 169 -868 -1378 -1164 -306 -103 485 719 1724 1743 919 358 -337 -799 -2223 -3320 -2418
14581 -2418 -937 -1083 -1973 -2527 -1109 334 1055 -750 -1159 -2231 -3511 -4423 -4625 -3173 -2653 -2031 -2068
14564 -2068 -882 -476 -1722 -2706 -4391 -3422 -1680 -48 -398 -1158 -1049 -1593 748 521 485 646 496 -1147
14546 -1147 -1886 -1546 -1287 -2463 -3106 -3609 -2749 -1097 -1765 -3563 -5710 -4811 -3127 -3251 -3193 -2760 -2971 -1961
14528 -1961 -1758 -2243 -1326 29 851 222 1523 1147 858 779 -951 -3237 -2646 -1527 -1155 -1059 -3071 -4211
$$ packed form
14652a765r23m92J437l06m08j323P44K86O34N75Q84M58o40j860M26J497J486j50
14634E60m73p82j627j619R24K367Q95R06j336j629J23J258j088j1l15j464l51
14617c662K13k69Q48K597N89m92l65j513l32n85K034J339M15M58j80M04j310l55
14599a66J344j009j037n10K14Q58K03N88K34J005J9q24n61o95m62j424j097R02
14581b418J481j46q90n54J418J443P21j805m09j072j280r12k02J452N20O22l7
14564b068J186M06j246r84j685R69J742J632l50p60J09n44K341k27l6J61j50j643
14546a147p39L40K59j176o43n03Q60J652o68j798k147Q99J684j24N8M33k11J010
14528a961K03m85R17J355Q22o29J301l76k89p9j730k286N91J119L72R6k012j140
$$ plain form
14510 -4211 -3717 -3097 -1633 -1146 -3030 -5364 -4603 -2625 -858 -2387 -3337 -3563 -2361 -2219 -3228 -1693
14494 -1693 367 545 1007 928 1124 -525 -2389 -1868 -107 865 -270 -1786 -1559 -918 -646 -1637 -2534 -2198
14476 -2198 -1983 -2370 -3601 -4087 -5893 -3886 -2484 -2209 -750 359 -486 -1600 -2732 -2559 -5278 -6182
14460 -6182 -3355 -1637 -1338 -1320 -1741 -2376 -238 634 634 140 -854 -2021 -2569 -1944 -2125 -2056 -612 -585 -1539
14441 -1539 181 1811 2449 1886 1181 1185 1755 230 -1039 -749 -118 -485 -1111 -800 -3796 -5303 -4280 -1795
14423 -1795 -1151 -1237 -959 -2130 -1855 -1996 -2022 -4202 -3998 -4606 -5116 -5170 -3805 -2568 -3382 -2075 -1048 -1319
14405 -1319 323 565 -840 -2416 -2476 -2468 -2648 -2577 -3065 -2743 -1898 -608 4 -1746 -2859 -2982 -441 1429
14387 1429 632 -458 -771 -618 -1130 -615 -200 585 337 658 828 1127 2028 1890 2682 1982 1293 758 -147
$$ packed form
14510d211M94O20J464M87j884k334P61J978J767j529r50k26J202J42j009J535
14494a693K060J78M62p9J96j649j864N21J761R72j135j516K27O41K72r91q97L36
14476b198K15l87j231m86j806K007J402K75J459J109q45j114j132J73k719r04
14460f182K827J718K99J8m21o35K138Q72%m94r94j167n48O25j81O9J444K7r54
14441a539J720J630O38n63p05MN70j525j269K90O31l67o26L11k996j507J023K485
14423a795O44q6K78j171K75j41k6k180K04o08n10n4J365J237q14J307J027k71
14405a319J642K42j405j576o0Qj80P1m88L22Q45J290O12j750j113j23K541J870
14387A429p97j090l13J53n12N15M15P85k48L21J70K99R01j38P92p00o89n35r05
$$ plain form
14368 -147 -695 54 978 1833 1279 320 1412 755 -702 -1670 467 1632 1340 1034 1177 2318 3752 3919
14350 3919 2398 1115 1047 72 -659 -1207 -508 -394 -173 1322 162 -1518 -1112 -794 -1172 -2216 -2482 -3079
14332 -3079 -4184 -2775 -1519 -908 -189 -517 -1047 430 674 11 -1746 -2441 -2574 -2600 -1597 -740 -248 -182
14314 -182 661 764 424 230 -254 -996 360 593 -585 -810 -501 -1340 -3218 -4331 -4353 -2869 -1874 -1437
14296 -1437 -1153 -692 -1076 -2537 -2075 -3848 -3145 -2364 -1860 108 -1345 -2261 -2132 -1258 -1067 -3005 -2584 -1853
14278 -1853 -1706 -730 -921 -2522 -3160 -3115 -2182 -252 -779 -1563 -1945 -1661 253 14 -363 -540 648 1791
14260 1791 2538 1963 1818 988 -703 -108 462 -1454 -1305 -281 -1239 -878 -1277 -526 -178 -18 -135 294
14242 294 638 754 1502 395 -291 222 -1254 -1862 -1647 -768 5 -619 -1060 -1211 -130 -174 -847 -2051 -2138
$$ packed form
14368a47n48P49R24Q55n54r59J092o57j457r68K137J165k92l06J43J141J434J67
14350C919j521j283o8r75p31n48O99J14K21J495j160j680M06L18l78j044k66n97
14332c079j105J409J256O11P19l28n30J477K44o63j757o95j33k6J003Q57M92O6
14314a82Q43J03l40j94m84p42J356K33j178k25L09q39j878j113k2J484R95M37
14296a437K84M61l84j461M62j773P03P81N04J968j453r16J29Q74J91j938M21P31
14278a853J47R76j91j601o38M5R33J930n27p84l82K84J914k39l77j77J188J143
14260A791P47n75j45q30j691N95N70j916J49J024r58L61l99P51L48J60j17M29
14242B94L44J16P48j107o86N13j476o08K15Q79P73o24m41j51J081m4o73j204q7
$$ plain form
14223 -2138 -257 -306 -256 -1082 -2020 -991 -1 -557 -1674 -816 427 -977 -2199 -3431 -3442 -1704 -664
14206 -664 -615 -1269 -804 -1978 -2918 -1969 -1176 -2037 -1290 838 -320 -829 -1965 -2503 -905 538 1141 1982
14188 1982 2498 1247 835 1187 2125 1363 1630 1244 1205 471 -1582 -1655 -765 -1028 -2788 -2051 -1309 -1832 -1606
14169 -1606 -732 -1000 -386 399 -284 165 760 725 -1116 -811 658 1282 514 446 -653 -153 254 507 1361
14150 1361 581 68 -260 -1895 -2211 253 452 -360 -1146 -2382 -2610 -2536 -1819 -2896 -1913 -2158 -1603 -482
14132 -482 60 -694 -509 -756 -495 -1044 -1036 -1683 -3138 -4661 -4293 -4277 -3514 -3520 -2964 -1658 -1024 -732 751 116
14112 116 -2263 -2729 -1648 -1775 -2850 -3290 -3019 -3833 -4285 -3183 -2069 -737 -350 673 835 -845 -2993
14095 -2993 -3079 -3001 -3144 -2273 -2199 -1590 -850 -2419 -3475 -3610 -2869 -3408 -3775 -3076 -1247 -604 -2629 -3755 -3208
$$ packed form
14223b138J881m9N0q26r38J029R90n56j117Q58J243j404j222j232j1J738J040
14206f64M9o54M65j174r40R49P93q61P47K128j158n09j136n38J598J443O03Q41
14188A982N16j251m12L52R38p62K67l86l9p34k053p3Q90k63j760P37P42n23K26
14169a606Q74k68O14P85o83M49N95l5j841L05J469O24p68o8j099N00M07K53Q54
14150A361p80n13l28j635l16K464J99q12p86j236k28P4P17j077R83k45N55J121
14132d82N42p54J85k47K61n49Qo47j455j523L68J6P63oN56J306O34K92J483o35
14112A16k379m66J081j27j075m40K71q14m52J102J114J332L87J023J62j680k148
14095b993q6P8j43Q71P4O09P40j569j056j35P41n39l67O99J829O43k025j126N47
$$ plain form
14076 -3208 -2632 -2228 -2548 -1064 -541 -694 772 1983 52 -166 -715 -1137 349 2012 1619 514 -765
14059 -765 -977 483 1783 1144 -623 -628 -727 -1442 -1108 -128 115 -1133 283 844 27 287 1074 1704 922
14040 922 1439 2719 3595 3740 1458 -244 -1624 453 3699 3638 2350 304 -670 -1447 -1110 -1001 -734
14023 -734 -732 -600 -1613 -2299 465 1330 733 -57 461 -736 -2006 -1935 -444 204 29 -212 528 1371 692
14004 692 -13 729 404 -480 -647 -656 -645 -1008 -534 -1198 -601 308 229 1928 2869 1838 490 -168 -623 979
13984 979 2502 498 -972 -19 -167 518 225 506 435 1034 403 1911 2582 2343 2274 2916 3136 1316 -158
13965 -158 -1681 -377 567 476 289 817 -664 -1677 -2344 -2389 -2460 -2074 -2490 -2131 -491 1454 1877 1172 1323
13946 1323 2023 2323 1076 485 382 254 -285 -688 -679 -55 -857 -1914 -3789 -2126 260 1815 661 -623
$$ packed form
14076c208N76M04l20J484N23j53J466J211j931k18n49m22J486J663l93j105j279
14059g65k12J460J300o39j767nr9p15L34R80K43j248J416N61q17K60P87O30p82
14040I22N17J280Q76J45k282j702j380K077L246o1j288k046r74p77L37J09K67
14023g34KJ32j013o86K764Q65n97p90N18j197j270P1J491O48j75k41P40Q43o79
14004F92p05P42l25q84j67rJ1l63M74o64N97R09p9J699R41j031j348o58m55J602
13984I79J523k004j470R53j48O85k93K81p1N99o31J508O71k39o9O42K20j820j474
13965a58j523J304R44r1j87N28j481j013o67m5p1L86m16L59J640J945M23p05J51
13946A323P00L00j247n91j03j28n39m03RO24q02j057j875J663K386J555j154j284
$$ plain form
13928 -623 537 921 966 1579 2572 2825 3659 4622 4837 1572 -1389 -1535 421 1263 809 918 1512 2402 2250
13909 2250 -552 -3139 -2338 -454 680 242 -416 -391 1013 1315 2583 2964 2555 2289 1536 1049 982 693
13891 693 -695 -407 1185 504 -775 -1886 -2156 -483 215 -288 915 1142 139 304 1457 1754 2311
13874 2311 2304 1455 459 1192 2621 2939 2834 3102 3592 3166 892 1757 1852 275 -1996 -2718 -2524 -1492 1610
13855 1610 3124 2638 2057 1435 1043 663 529 393 1090 1307 639 885 1383 563 -37 -331 -909 -605 583
13836 583 215 614 593 1329 1071 796 1033 1487 1768 -314 -1731 -1442 -818 -906 -196 1099 2053 815 485
13817 485 1855 95 -1476 -43 1200 592 185 2112 3975 2462 1954 2393 2548 3184 2301 1409 836
13800 836 -1382 52 1985 1359 1303 1795 1756 -1139 -2573 -1879 -685 942 534 -599 -1672 -278 -1259
$$ packed form
13928f23J160L84M5O13R93K53Q34R63K15l265k961j46J956Q42m54J09N94Q90j52
13909B250k802k587Q01J884J134m38o58K5J404L02J268L81m09k66p53m87o7k89
13891F93j388K88J592o81j279j111k70J673O98n03J203K27j003J65J153K97N57
13874B311pq49r96P33J429L18j05K68M90m26k274Q65R5j577k271p22J94J032L102
13855A610J514m86n81o22l92l80j34j36O97K17o68K46M98q20o00k94n78L04J188
13836E83l68L99k1P36k58k75K37M54K81k082j417K89O24q8P10J295R54j238l30
13817D85J370j760j571J433J243o08m07J927J863j513n08M39J55O36q83q92n73
13800H36k218J434J933o26n6M92l9k895j434O94J194J627m08j133j073J394r81
$$ plain form
13783 -1259 -1129 -1909 -1788 -2432 -1727 -398 -283 -860 56 243 515 -649 -1354 -611 1538 1098 -571 -1491
13765 -1491 -1057 -242 384 703 1075 -252 -732 -1291 -1474 -2055 -2324 -2709 -3575 -4670 -3637 -1733 -2525 -3543
13747 -3543 -2888 -1111 631 1355 1107 630 -311 -1218 -157 -1056 -2594 -1795 -1238 -1903 -1970 -343 957 750
13729 750 255 350 -364 -759 326 -47 922 1135 -180 -2084 706 752 36 1540 1612 1197 421 1088 1492
13710 1492 684 -722 -243 861 752 706 136 323 695 649 -1996 -3026 -1630 -1880 -1786 -2464 -409 322
13692 322 -981 -2258 -3194 -2864 -1051 -1312 -37 877 97 -285 22 -229 -1510 -2365 -1184 -500 -354 -191
13674 -191 663 -231 -603 -1152 -445 -866 -1593 -901 750 1465 1364 53 -1024 -573 946 3184 2983 1021
13656 1021 1373 -314 -2576 -300 1540 1237 168 505 1729 1461 1500 -854 -1503 -950 -394 1831 1573
$$ packed form
13783a259J30p80J21o44P05J329J15n77R16J87K72j164p05P43K149m40j669r20
13765a491M34Q15O26L19L72j327m80n59j83n81k69l85q66j095J033J904p92j018
13747c543O55J777J742P24k48m77r41r07J061q99j538P99N57o65o7J627J300k07
13729G50m95R5p14l95J085l73R69K13j315j904K790M6p16J504P2m15p76O67M04
13710A492q08j406M79J104j09m6n70J87L72m6k645j030J396k50R4o78K055P31
13692C22j303j277r36L30J813k61J275R14p80l82L07k51j281q55J181O84J46J63
13674a91Q54q94l72n49P07m21p27O92J651P15j01j311j077M51J519K238k01j962
13656A021L52j687k262K276J840l03j069L37J224k68L9k354o49N53N56K225k58
$$ plain form
13639 1573 1795 2062 593 558 1225 1000 793 -338 112 692 235 889 1963 2768 1970 3264 5063 4130
13621 4130 3272 2233 1790 2721 1491 1433 957 1971 2905 1896 1646 1599 -67 37 1088 2487 4137
13604 4137 3387 4295 3854 2936 2166 1690 1877 1794 1738 1227 1498 1082 703 1647 2161 1372 1871 640 571 773
13584 773 1041 454 950 941 1182 2852 3215 2954 1144 479 647 1558 2831 1828 1311 647 135 -240 -750
13565 -750 1583 2242 997 2202 4322 5064 4212 2421 2456 3533 3479 4607 3523 2540 2390 3481 5313
13548 5313 4882 2727 1023 1316 2270 3734 3591 4075 2912 1810 142 -277 -1167 -1269 347 184 -13
13531 -13 1174 1985 2193 1606 -23 455 1614 2554 3004 2573 2831 2098 1295 930 1436 689 125 -237 572
13512 572 -59 -1675 -1580 -437 1256 2225 3142 2933 2025 814 316 523 323 -481 -31 853 1976 2018 2362
$$ packed form
13639A573K22K67j469l5O67k25k07j131M50N80m57O54J074Q05p98J294J799r33
13621D130q58j039m43R31j230n8m76J014R34j009k50m7j666J04J051J399J650
13604D137p50R08m41r18p70m76J87q3n6n11K71m16l79R44N14p89M99j231o9K02
13584G73K68n87M96rK41J670L63k61j810o65J68R11J273j003n17o64n12l75n10
13565g50K333O59j245J205K120P42q52j791L5J077n4J128j084r83j50J091J832
13548E313m31k155j704K93R54J464j43M84j163j102j668m19q90j02J616j63j97
13531a3J187Q11K08n87j629M78J159R40M50m31K58p33q03l65N06p47n64l62Q09
13512E72o31j616R5J143J693R69R17k09r08j211m98K07k00q04M50Q84J123M2L44
$$ plain form
13493 2362 2760 3378 2808 2896 5058 5344 3953 3879 3602 3192 1055 667 2049 1331 748 1353 1907 3327
13475 3327 2831 2704 3242 3335 4169 4819 4318 2415 357 1911 2791 2561 2908 2359 2372 2896 5424 5078 3722
13456 3722 2769 1269 1167 2472 3041 2037 -388 -1639 -411 1454 1777 1425 1498 2093 2326 2407 2788 2535
13438 2535 3830 4136 3131 2871 1382 449 707 2128 2403 2548 3167 2078 1431 2116 2946 4146 4091 2785
13420 2785 1999 2772 2049 1182 -824 -953 280 1624 1922 2439 2149 1422 1345 1567 1583 2216 3632 1741
13402 1741 10 1089 2664 3918 4130 4258 3990 3632 2777 4154 5030 5554 5785 4054 2244 2144 1589
13385 1589 1730 3743 3915 3704 3029 2039 3079 3562 4788 4388 3695 4645 3218 1496 1644 3170 4881
13368 4881 5451 4271 3891 4827 3685 2110 2667 3263 3099 2587 3042 2701 1888 1663 2352 1959 3101 5550
$$ packed form
13493B362L98O18n70Q8K162K86j391p4k77m10k137l88J382p18n83O05N54J420
13475C327m96j27N38R3Q34O50n01j903k058J554Q80k30L47n49J3N24K528l46j356
13456C722r53j500j02J305N69j004k425j251J228J865L23l52P3N95K33Q1L81k53
13438B535J295L06j005k60j489r33K58J421K75J45O19j089o47O85Q30J200n5j306
13420B785p86P73p23q67k006j29J233J344K98N17k90p27p7K22J6O33J416j891
13402A741j731J079J575J254K12J28k68l58q55J377Q76N24K31j731j810j00n55
13385A589J41K013J72k11o75r90J040M83J226m00o93R50j427j722J48J526J711
13368D881N70j180l80R36j142j575N57N96j64n12M55l41q13k25O89l93J142K449
$$ plain form
13350 5550 5977 3522 3220 4026 3994 3242 2033 3738 3787 3129 2597 2865 4064 4613 5136 2656 1459 1789
13332 1789 2098 3240 4943 2895 1692 1442 2091 2536 2031 1933 1848 1847 4597 5333 6099 5154 3853 3484 2287
13313 2287 2543 3953 3683 3402 2898 2959 3262 3009 2677 3236 2901 4154 5709 6060 5392 3685 3605 5243
13295 5243 6242 7315 6336 4339 4971 5946 6137 4897 3477 2809 2979 3520 4104 2998 3259 4277 4519
13278 4519 3926 4561 3743 3989 3560 2702 4708 4619 2864 3622 5044 4508 2938 3329 6833 7249 7176 7036
13260 7036 6276 6195 4029 4214 3758 4222 4785 5391 6604 6706 6720 6009 5809 6305 5518 5690 6413 7618 7401
13241 7401 7104 7698 8649 8803 8870 7851 5434 5789 6626 6015 3801 5199 6512 6967 6316 4592 3351
13224 3351 2841 3408 4218 5624 7147 6958 7578 8070 6518 5178 4328 4400 4653 4874 4816 5269 4869 4101 4740
$$ packed form
13350E550M27k455l02Q06l2p52j209J705M9o58n32K68J199N49N23k480j197L30
13332A789L09J142J703k048j203k50O49M45n05r8q5jK750P36P66r45j301l69j197
13313B287K56J410k70k81n04O1L03k53l32N59l35J253J555L51o68j707q0J638
13295E243R99J073r79j997O32R75J91j240j420o68J70N41N84j106K61J018K42
13278D519n93O35q18K46m29q58K006q9j755P58J422n36j570L91L504M16p3j40
13260G036p60q1k166J85m56M64N63O06J213J02J4p11k00M96p87J72P23J205k17
13241G401k97N94R51J54O7j019k417L55Q37o11k214J398J313M55o51j724j241
13224C351n10N67Q10J406J523j89O20M92j552j340q50P2K53K21n8M53m00p68O39
$$ plain form
13205 4740 5436 5287 6370 7531 7406 6025 7392 8131 6806 5801 6478 6063 4720 3768 3724 4287 4757
13188 4757 4559 4820 2980 3211 4114 4549 4725 6768 7375 6312 5585 5357 6053 6998 7536 8070 8684 7251
13170 7251 6521 8260 9399 8896 7638 9255 8586 7088 6848 5233 5791 7635 7673 6065 4141 5000 6334
13153 6334 7943 8922 9479 8578 8323 7617 7511 9712 9546 8030 6338 4716 5877 7865 9004 8542 8933
13136 8933 8845 7669 7853 6809 8101 8457 6642 5482 6700 7397 7969 9123 7644 5678 6794 6680
13120 6680 7228 7151 6713 6592 5093 4078 5154 4878 5490 7170 7079 5916 7547 9196 9884 7692 6665
13103 6665 6836 7950 8287 8620 8341 7279 7036 6749 7915 8625 9996 10941 9680 9398 8970 9514 11019
13086 11019 10593 8857 7690 6641 7594 10179 10930 9217 8635 9941 10058 9945 10708 9947 9765 9885 8956
$$ packed form
13205D740O96j49J083J161j25j381J367P39j325j005O77m15j343r52m4N63M70
13188D757j98K61j840K31R03M35J76K043O07j063p27k28O96R45N38N34O14j433
13170G251p30J739J139n03j258J617o69j498k40j615N58J844L8j608j924Q59J334
13153F334J609R79N57r01k55p06j06K201j66j516j692j622J161J988J139m62L91
13136H933q8j176J84j044J292L56j815j160J218O97N72J154j479j966J116j14
13120F680N48p7m38j21j499j015J076k76O12J680r1j163J631J649O88k192j027
13103F665J71J114L37L33k79j062k43k87J166P10J371R45j261k82m28N44J505
13086A1019m26j736j167j049R53K585P51j713n82J306J17j13P63p61j82J20r29
$$ plain form
13069 8956 9111 9310 9066 10537 10729 10530 10498 10216 10248 10200 7477 6711 7931 9294 9700 10125 10378 9558 7989
13050 7989 7954 8683 10629 11866 11945 11967 11364 9856 8803 10058 12033 12111 12604 13237 13321 12141 12102 11313 11681
13031 11681 11798 12080 11546 11443 10809 12194 12610 12132 10062 9035 10365 10960 9529 9279 8781 9127 10871
13014 10871 12189 11615 11758 11891 11764 13377 12680 11491 11923 12558 12013 11918 10513 11173 11309 10442 11146 12374
12996 12374 11644 11395 11127 11008 11227 10753 11424 12124 12718 12616 12034 11630 10057 10228 12175 12769 14345 15727
12978 15727 17003 17054 16359 14450 15250 14594 14902 14986 15418 15768 15031 13557 12185 11343 11367 11364 11969 11593 11010
12959 11010 9898 10542 11521 11168 10395 12009 14284 15333 15368 17171 17410 15539 15688 15872 16333 15976 15038
12942 15038 16425 18049 17694 17040 17491 18764 18789 17432 16700 17446 17038 16985 16665 16092 15343 14574 14784 14103
$$ packed form
13069H956J55J99k44J471J92j99l2k82L2m8k723p66J220J363M06M25K53q20j569
13050G989l5P29J946J237P9K2o03j508j053J255J975P8M93O33Q4j180l9p89L68
13031A1681J17K82n34j03o34J385M16m78k070j027J330N95j431k50m98L46J744
13014A0871J318n74J43J33j27J613o97j189M32O35n45r5j405O60J36q67P04J228
12996A2374p30k49k68j19K19m74O71P00N94j02n82m04j573J71J947N94J576J382
12978A5727J276N1o95j909Q00o56L08Q4M32L50p37j474j372q42K4lO05l76n83
12959A1010j112O44R79l53p73J614K275J049L5J803K39j871J49J84M61l57r38
12942A5038J387J624l55o54M51J273K5j357p32P46m08n3l20n73p49p69K10o81
$$ plain form
12924 14103 12740 13763 13870 13852 12467 13675 15592 16877 18427 18509 18587 19012 18136 18645 19214 19027 17763
12907 17763 17330 18979 19473 19566 19894 18334 16909 16519 15136 17065 18159 18518 18275 17671 18713 19205 19572
12890 19572 19901 17493 16840 18958 19873 19082 19777 20321 21118 20918 21350 21011 20078 20848 18961 19609 19981 20781
12872 20781 21684 20883 21728 22480 21922 20623 20912 22299 23252 22942 22563 22267 22996 24798 25613 24486 24728 24025
12854 24025 24188 25477 25303 23793 25273 25677 23626 23317 23472 22938 23222 22843 22719 22556 22921 24033 25506
12837 25506 25782 24922 24411 24302 23927 25362 25663 25797 26380 28932 30931 29460 28117 26237 26376 28228 27390
12820 27390 26670 26871 27971 28330 28941 28548 29032 28688 27871 27009 28557 28999 30655 31095 30994 29906 29269 28729
12802 28729 29020 29281 29214 30177 32733 32643 31973 32613 33182 35433 35864 34259 33357 35316 36847 34840 32288
$$ packed form
12924A4103j363J023J07j8j385J208J917J285J550Q2P8M25q76N09N69j87j264
12907A7763m33J649M94R3L28j560j425l90j383J929J094L59k43o04J042M92L67
12890A9572L29k408o53K118R15p91O95N44P97k00M32l39r33P70j887O48L72Q00
12872B0781R03q01Q45P52n58j299K89J387R53l10l79k96P29J802Q15j127K42p03
12854B4025J63J289j74j510J480M04k051l09J55n34K84l79j24j63L65J112J473
12837B5506K76q60n11j09l75J435L01J34N83K552J999j471j343j880J39J852q38
12820B7390p20K01J100L59O11l93M84l44q17q62J548M42J656M40j01j088o37n40
12802B8729K91K61o7R63K556r0o70O40N69K251M31j605r02J959J531k007k552
$$ plain form
12785 32288 33734 35271 35654 36435 36174 37387 38742 38500 38244 38501 38956 40227 39657 41135 41279 39861 39371
12768 39371 40677 40886 41401 42253 41924 43078 43325 42262 42635 44081 44132 42031 42251 45183 44662 44357 45857
12751 45857 46006 47273 50234 52556 51400 52317 53569 53926 53478 53703 53104 51610 53938 56075 56796 55985
12735 55985 56697 59051 60386 61366 62216 62285 63175 62758 62672 62617 64491 66280 67570 67504 68770 69134 70290 69800
12717 69800 72170 73524 72689 72436 73924 75188 77821 78444 77320 76733 77107 77739 78889 78428 79866 81148
12701 81148 81470 80389 77833 78810 81438 81722 80279 79204 79302 80581 81731 82957 82405 81170 81397 81123
12685 81123 78957 78014 78435 78377 79437 77784 76250 75865 75023 74965 75629 73835 73934 74334 74315 74742 73687 72758
12667 72758 72770 72110 71893 71941 73569 74183 73362 73001 72070 72169 73246 73663 73270 73084 73674 72882 71501 71713 72949
$$ packed form
12785C2288J446J537L83P81k61J213J355k42k56K57M55J271n70J478J44j418m90
12768C9371J306K09N15Q52l29J154K47j063L73J446N1k101K20K932n21l05J500
12751D5857J49J267K961K322j156R17J252L57m48K25n99j494K328K137P21q11
12735E5985P12K354J335R80Q50O9Q90m17q6n5J874J789J290o6J266L64J156m90
12717F9800K370J354q35k53J488J264K633O23j124n87L74O32J150m61J438J282
12701H1148L22j081k556R77K628K84j443j075R8J279J150J226n52j235K27k74
12685H1123k166r43M21n8J060j653j534l85q42n8O64j794R9M00j9M27j055r29
12667G2758J2o60k17M8J628O14q21l61r31R9J077M17l93j86N90p92j381K12J236
$$ plain form
12648 72949 72274 71675 71633 72379 73073 72920 71882 70459 69733 69740 69983 70114 70279 71362 70424 70586 71780 71764 71526
12629 71526 71622 71082 72265 71513 72350 74282 74195 72833 74217 76162 76446 76291 75086 74536 74451 74216 75058 75286
12611 75286 76151 76759 76674 77457 76488 77022 78248 79879 80837 81958 80514 80784 80973 79734 80841 83215 84185
12594 84185 84372 83394 83220 83509 84385 85278 85424 86371 85147 83745 84027 84650 86729 87896 87902 88010 88714 89506
12576 89506 90322 90964 90802 91821 93045 94677 95970 96834 97308 98309 100218 101081 101613 102389 101896 100914 101437
12559 101437 102734 103372 104326 105406 105596 106304 108025 110042 111938 112993 113846 116501 116109 116250 116520 118248
12543 118248 118389 119579 119994 120816 121982 125570 126914 127321 126814 129219 129592 128630 129390 131370 131495 131983 133211
12526 133211 135265 137289 140079 140865 140698 142498 143021 144664 147179 149476 150609 152069 154098 155301 154987
$$ packed form
12648G2949o75n99m2P46O94j53j038j423p26PK43J31J65J083r38J62J194j6k38
12629G1526R6n40J183p52Q37J932q7j362J384J945K84j55j205n50q5k35Q42K28
12611G5286Q65O08q5P83r69N34J226J631R58J121j444K70J89j239J107K374R70
12594H4185J87r78j74K89Q76Q93J46R47j224j402K82O23K079J167OJ08P04P92
12576H9506Q16O42j62J019J224J632J293Q64M74J001J909Q63N32P76m93r82N23
12559A01437J297O38R54J080J90P08J721K017J896J055Q53K655l92J41K70J728
12543A18248J41J190M15Q22J166L588J344M07n07K405L73r62P60J980J25M88J228
12526A33211K054K024K790P86j67J800N23J643K515K297J133J460K029J203l14
$$ plain form
12511 154987 155037 155482 155094 154558 155002 156047 158062 160304 160740 161876 162795 163884 164797 165883 167419 169645
12495 169645 170749 170122 171706 174502 177297 179758 181184 180842 181550 183936 184554 185129 186456 188628 189525 192064
12479 192064 194277 194914 194796 196259 198534 199028 200441 202379 203762 205372 207460 210905 213055 217612 221268
12464 221268 222882 223764 225465 229263 231250 232401 233774 236097 237906 240511 243797 245815 247315 251230
12450 251230 254102 256665 258330 261863 264376 267102 272426 276738 279970 284263 286313 289969 292910 295546
12436 295546 298382 301618 305222 308022 311964 316231 320999 326638 330889 334216 337791 343014 347307 352053
12422 352053 356486 361278 366025 372237 377043 381021 386609 393301 398903 404093 409956 415550 421097 426399
12408 426399 433505 438698 444675 450339 456762 464173 472139 480150 488864 496749 503374 510342 516671 524295
$$ packed form
12511A54987N0M45l88n36M44J045K015K242M36J136R19J089R13J086J536K226
12495A69645J104o27J584K796K795K461J426l42P08K386O18N75J327K172Q97K539
12479A92064K213O37j18J463K275M94J413J938J383J610K088L445K150M557L656
12464B21268J614Q82J701L798J987J151J373K323J809K605L286K018J500L915
12450B51230K872K563J665L533K513K726N324M312L232M293K050L656K941K636
12436B95546K836L236L604K800L942M267M768N639M251L327L575N223M293M746
12422C52053M433M792M747O212M806L978N588O692N602N190N863N594N547N302
12408D26399P106N193N977N664O423P411P966Q011Q714P885O625O968O329P624
$$ plain form
12394 524295 532267 541409 550724 560134 569494 578427 586739 595656 603796 613074 624056 634620 644627
12381 644627 655195 667185 680368 692947 706350 719946 730772 741907 753078 764728 777406
12370 777406 793168 809532 825139 842528 860365 877287 894641 910622 927927 945637 965560
12359 965560 985368 1004657 1024368 1047308 1069181 1092787 1116561 1142699 1166860 1190369 1215454
12348 1215454 1242892 1270680 1299191 1330175 1361424 1391294 1423630 1457877 1491863 1528786 1568440
12337 1568440 1607216 1645714 1686594 1730337 1775184 1821547 1869293 1920033 1972781 2026156 2081266
12326 2081266 2137731 2195929 2257372 2320514 2387128 2458370 2529021 2601644 2679413 2758887 2838443
12315 2838443 2923855 3011765 3102222 3195084 3291668 3389414 3490464 3597256 3705653 3816018
$$ packed form
12394E24295P972R142R315R410R360Q933Q312Q917Q140R278J0982J0564J0007
12381F44627J0568J1990J3183J2579J3403J3596J0826J1135J1171J1650J2678
12370G77406J5762J6364J5607J7389J7837J6922J7354J5981J7305J7710J9923
12359I65560J9808J9289J9711K2940K1873K3606K3774K6138K4161K3509K5085
12348A215454K7438K7788K8511L0984L1249K9870L2336L4247L3986L6923L9654
12337A568440L8776L8498M0880M3743M4847M6363M7746N0740N2748N3375N5110
12326B081266N6465N8198O1443O3142O6614P1242P0651P2623P7769P9474P9556
12315B838443Q5412Q7910R0457R2862R6584R7746J01050J06792J08397J10365
$$ plain form
12305 3816018 3930055 4047034 4169173 4292548 4418820 4548340 4679958 4811226 4942985
12296 4942985 5076376 5210337 5346030 5481594 5615695 5745888 5874380 6001201 6124875
12287 6124875 6245373 6358337 6462210 6559508 6650370 6732004 6803142 6864420 6915476 6954950 6979981
12276 6979981 6995384 6999808 6990682 6969755 6939631 6895869 6840290 6775463 6700305 6616961 6522838 6422002
12264 6422002 6314252 6201474 6083835 5961339 5835200 5709362 5579849 5447112 5313762
12255 5313762 5180298 5046251 4914973 4785867 4655735 4528452 4402871 4278445 4158533
12246 4158533 4042535 3926789 3812827 3703891 3597647 3494518 3393002 3294063 3199255 3107358
12236 3107358 3018175 2934107 2851883 2771502 2693163 2618572 2545345 2475624 2408676 2342804 2276153
$$ packed form
12305C816018J14037J16979J22139J23375J26272J29520J31618J31268J31759
12296D942985J33391J33961J35693J35564J34101J30193J28492J26821J23674
12287F124875J20498J12964J03873R7298R0862Q1634P1138O1278N1056L9474K5031
12276F979981J5403M424r126k0927l0124m3762n5579o4827p5158q3344r4123j00836
12264F422002j07750j12778j17639j22496j26139j25838j29513j32737j33350
12255E313762j33464j34047j31278j29106j30132j27283j25581j24426j19912
12246D158533j15998j15746j13962j08936j06244j03129j01516r8939r4808r1897
12236C107358q9183q4068q2224q0381p8339p4591p3227o9721o6948o5872o6651
$$ plain form
12225 2276153 2213177 2152454 2096154 2041930 1988986 1936963 1886938 1838224 1789763 1743990 1701748
12214 1701748 1660308 1620213 1579907 1541610 1506003 1469277 1433115 1397633 1366183 1336564 1306392
12203 1306392 1275858 1246384 1218178 1191805 1164122 1139660 1114369 1090623 1068167 1046468 1025486
12192 1025486 1004670 983811 964063 944603 926657 907638 889626 872154 856882 842092 826121
12181 826121 809834 794895 779489 764269 748739 736812 724696 711701 699873 686307 674421
12170 674421 665211 654417 644148 633484 623990 612980 602410 591630 581833 572277 564083 555951 545988
12157 545988 538262 530603 522026 512673 505467 500831 495527 489324 480753 473319 466432 458939 453154 447167
12143 447167 440028 434831 429847 423347 415800 410541 405489 400000 394889 389410 383485 378142 374043 367669
$$ packed form
12225B276153o2976o0723n6300n4224n2944n2023n0025m8714m8461m5773m2242
12214A701748m1440m0095m0306l8297l5607l6726l6162l5482l1450k9619l0172
12203A306392l0534k9474k8206k6373k7683k4462k5291k3746k2456k1699k0982
12192A025486k0816k0859j9748j9460j7946j9019j8012j7472j5272j4790j5971
12181H26121j6287j4939j5406j5220j5530j1927j2116j2995j1828j3566j1886
12170F74421r210j0794j0269j0664r494j1010j0570j0780r797r556q194q132r963
12157E45988p726p659q577r353p206m636n304o203q571p434o887p493n785n987
12143D47167p139n197m984o500p547n259n052n489n111n479n925n343m099o374
$$ plain form
12129 367669 362847 361152 356370 350962 347266 343157 338151 333954 330920 327223 322466 319103 313304 308566
12115 308566 307127 304829 300916 296630 293722 290683 287879 285774 282755 280125 276199 273357 270300 265923
12101 265923 263049 260119 256730 253372 249227 247038 244875 242992 240381 237004 234073 230523 228947 227839
12087 227839 225747 224966 223613 221291 218833 215941 213193 210482 208589 205747 204544 204298 202311 199080 197182
12072 197182 195953 192763 191780 190861 188400 185710 184672 183266 180650 180866 179724 177713 176538 176426 174656
12057 174656 172572 170522 169489 167374 165336 164603 164802 162481 160703 160216 158671 157809 155304 153833 154332
12042 154332 153717 152956 152272 149314 146199 144775 143421 143360 143498 144262 142118 139246 137887 136936 135080 135106 134894
12025 134894 133458 131188 128509 128357 126865 125487 127471 126195 124881 124217 124007 121958 119240 116944 115247
$$ packed form
12129C67669m822j695m782n408l696m109n006m197l034l697m757l363n799m738
12115C08566j439k298l913m286k908l039k804k105l019k630l926k842l057m377
12101B65923k874k930l389l358m145k189k163j883k611l377k931l550j576j108
12087B27839k092p81j353k322k458k892k748k711j893k842j203k46j987l231j898
12072A97182j229l190r83r19k461k690j038j406k616K16j142k011j175j12j770
12057A74656k084k050j033k115k038p33J99k321j778m87j545q62k505j471M99
12042A54332o15p61o84k958l115j424j354o1J38P64k144k872j359r51j856K6k12
12025A34894j436k270k679j52j492j378J984j276j314o64k10k049k718k296j697
$$ plain form
12010 115247 114096 114589 113836 112357 112163 110432 108804 108858 109316 109301 107503 106162 104250 102223 102281 102125 100467
11993 100467 100786 101856 100186 97251 95440 95029 94572 94808 92954 90221 89247 89400 88543 88761 89228 88622 86806
11976 86806 86492 86209 87038 84717 84496 84537 84177 84536 84101 82360 80307 79483 79078 79125 78863 78692 77510 77448 76513
11957 76513 74851 75074 74243 73495 73069 72610 72544 70995 70150 70630 72060 71587 69784 70221 71912 70309 69196
11940 69196 67958 67691 67292 65210 65582 66828 66561 67481 67182 67565 67348 63726 62901 62730 62223 62254 61484 60337
11922 60337 60910 60583 61487 61167 60210 59065 60018 59814 58396 57478 57375 57176 57871 58347 56233 56141 55240 53318
11904 53318 52859 52054 50640 49894 49054 48770 48099 49150 49040 50723 52527 52072 50575 49489 48678 48816 48915
11887 48915 49768 49148 48965 50331 49121 47370 46771 45826 47402 46910 46232 45908 45251 44793 44699 44872 44885 44452
$$ packed form
12010A15247j151M93p53j479j94j731j628N4M58j5j798j341j912k027N8j56j658
11993A00467L19J070j670k935j811m11m57K36j854k733r74J53q57K18M67o06j816
11976H6806l14k83Q29k321k21M1l60L59m35j741k053q24m05M7k62j71j182o2r35
11957G6513j662K23q31p48m26m59o6j549q45M80J430m73j803M37J691j603j113
11940F9196j238k67l99k082L72J246k67R20k99L83k17l622q25j71n07L1p70j147
11922F0337N73l27R04l20r57j145R53k04j418r18j03j99O95M76k114r2r01j922
11904E3318m59q05j414p46q40k84o71J051j10J683J804m55j497j086q11J38R9
11887D8915Q53o20j83J366j210j751n99r45J576m92o78l24o57m58r4J73J3m33
$$ plain form
11869 44452 43375 42833 42473 41706 40614 40472 39727 40650 41673 41708 42458 41591 39358 39753 40073 39929 40153 40580
11851 40580 39447 38299 38125 38364 38310 37210 35684 37178 40007 39429 37709 36091 37438 38327 38540 36713
11835 36713 35931 36254 38339 39520 38779 38795 38061 36030 37345 35858 35460 34899 34256 34115 34869 34900 35185 35898
11817 35898 35860 35808 35956 34913 33981 34295 34796 34233 33461 34515 33998 34180 32749 32574 32157 31587 31156 32129 32543
11798 32543 31231 30314 30597 31356 31407 31404 31430 31304 32107 31445 30487 30101 28935 28744 29935 30063 29148 28332 27286
11779 27286 28067 28099 27539 26570 26234 26797 27171 27218 26898 27277 27415 25912 25617 24974 23565 23391 23474 22588 23196
11760 23196 23564 24818 26082 26192 27489 27858 27153 26967 28566 27130 25662 24367 24973 24314 24902 26845
11744 26845 26619 25353 24291 22912 23594 23104 22920 21972 20100 20094 20956 21514 22600 22740 22556 23738 24534 24419
$$ packed form
11869D4452j077n42l60p67j092j42p45R23J023L5P50q67k233L95L20j44K24M27
11851D0580j133j148j74K39n4j100j526J494K829n78j720j618J347Q89K13j827
11835C6713p82L23K085J181p41J6p34k031J315j487l98n61o43j41P54L1K85P13
11817C5898l8n2J48j043r32L14N01n63p72J054n17J82j431j75m17n70m31R73M14
11798C2543j312r17K83P59N1lK6j26Q03o62r58l86j166j91J191J28r15q16j046
11779B7286P81L2n60r69l36N63L74M7l20L79J38j503k95o43j409j74Q3q86O08
11760B3196L68J254J264J10J297L69p05j86J599j436j468j295O06o59N88J943
11744B6845k26j266j062j379O82m90j84r48j872oQ62N58J086J40j84J182P96j15
$$ plain form
11726 24419 24370 24254 22936 21404 21190 19610 18311 18306 19695 19466 19945 19227 18777 18272 17442 18154 20035 21334
11708 21334 20962 20939 21736 22651 20330 18494 17217 17230 16459 18729 20039 19187 19973 20403 20105 20868 20530 19543
11690 19543 18778 17817 16693 15665 15635 16000 17060 17669 15740 16209 18182 19031 16733 17377 18063 18617 19176
11673 19176 18721 18021 17285 16131 17636 18150 17505 16601 17522 17639 18216 18024 17614 17681 17266 16540 17208 15032
11655 15032 14144 14247 13301 13224 15204 14552 14673 15234 15151 15628 15773 16944 18225 16877 16941 17502 15694 15002
11637 15002 15333 14684 14539 13360 12279 11503 12173 11694 11550 12753 13073 12847 12565 12779 12078 14361 15470
11620 15470 14016 13303 14937 15244 14783 14986 13837 12268 12596 13915 13769 13230 13682 15213 14910 15202 14685
11603 14685 14691 15714 14824 14876 13638 13450 14294 13887 14094 13965 13331 12861 13434 13489 12693 13655 13104 12187 13043 13053
$$ packed form
11726B4419m9j16j318j532k14j580j299nJ389k29M79p18m50n05q30P12J881J299
11708B1334l72k3P97R15k321j836j277J3p71K270J310q52P86M30k98P63l38r87
11690A9543p65r61j124j028l0L65J060O09j929M69J973Q49k298O44O86N54N59
11673A9176m55p00p36j154J505N14o45r04R21J17N77j92m10O7m15p26O68k176
11655A5032q88J03r46p7J980o52J21N61q3M77J45J171J281j348O4N61j808o92
11637A5002L31o49j45j179j081p76O70m79j44J203L20k26k82K14p01K283J109
11620A5470j454p13J634L07m61K03j149j569L28J319j46n39M52J531l03K92n17
11603A4685OJ023q90N2j238j88Q44m07K07j29o34m70N73N5p96R62n51r17Q56J0
$$ plain form
11583 13053 12665 12110 14077 14718 13630 11114 11082 11141 10823 10873 10239 9151 9863 10126 11088 13214 15123 14160
11565 14160 13388 12344 12643 11766 12096 12429 11782 11102 11339 12415 11849 11470 11019 10764 10006 9085 8626 10408
11547 10408 10251 10457 12362 13615 12585 11134 10376 10189 9860 8760 9819 11425 10884 11096 9492 9293
11531 9293 9154 8180 8112 9377 10567 11272 11277 9451 9828 10582 12066 10551 9069 10625 10211 10451 10465 8794
11513 8794 8443 9700 10282 8369 8894 9555 9260 9325 9575 8740 8765 10252 9662 8215 9396 9823 10357 10177
11495 10177 8524 7489 6725 6184 6309 6950 7630 9471 10213 11224 9767 7896 6906 8575 8893 9403 8753
11478 8753 8233 8755 7438 7132 6455 7012 8478 9635 8547 8735 9466 8090 7950 9706 9928 9107 8263
11461 8263 7433 8473 9347 8677 7756 8318 8115 6884 7192 7169 8063 7326 6852 6388 5512 5808 7085 6531 9025
$$ packed form
11583A3053l88n55J967O41j088k516l2N9l18N0o34j088P12K63R62K126J909r63
11565A4160p72j044K99q77L30L33o47o80K37J076n66l79m51k55p58r21m59J782
11547A0408j57K06J905J253j030j451p58j87l29j100J059J606n41K12j604j99
11531I293j39r74o8J265J190P05Nj826L77P54J484j515j482J556m14K40J4j671
11513H794l51J257N82j913N25O61k95O5K50q35K5J487n90j447J181M27N34j80
11495A0177j653j035p64n41J25O41O80J841P42J011j457j871r90J669L18N10o50
11478H753n20N22j317l06o77N57J466J157j088J88P31j376j40J756K22q21q44
11461H263q30J040Q74o70r21N62k03j231L08k3Q94p37m74m64q76K96J277n54K494
$$ plain form
11442 9025 9590 8870 9875 8864 8010 7809 8808 6931 5553 4363 4785 6644 9061 8867 6604 4471
11426 4471 5403 4861 4203 3760 2100 1385 2831 4607 5280 6949 5560 6984 5842 5530 6924 7282 5689
11409 5689 6344 7129 6806 6772 5117 5349 6889 7912 8464 8146 8033 7624 7780 8960 6721 7423 7977 7262
11391 7262 7097 7054 7053 6570 6836 7161 6914 5616 5517 5264 4865 4259 5078 5965 5977 6170 6184 5507 4771 6018 7369
11370 7369 7834 8106 7118 6255 7057 6495 5506 5091 4399 4912 6387 5926 3977 3920 3013 4416 4974 3728
11352 3728 4854 7250 6634 5339 4248 5242 5636 5569 4408 2869 2348 2050 4039 4235 3880 3920 3825 2354
11334 2354 2397 1718 2100 2072 1950 2586 1805 1137 2627 2692 3756 4480 3159 2005 3266 4447 5405 5078
11316 5078 4635 4830 3863 3544 3246 3925 5840 4556 3864 4368 5044 5404 4991 5188 4882 4879 4763 3546 1560
$$ packed form
11442I025N65p20J005j011q54k01R99j877j378j190M22J859K417j94k263k133
11426D471R32n42o58m43j660p15J446J776O73J669j389J424j142l12J394L58j593
11409E689O55P85l23l4j655K32J540J023N52l18j13m09J56J180k239P02N54p15
11391G262j65m3jm83K66L25k47j298r9k53l99o06Q19Q87J2J93J4o77p36J247J351
11370G369M65K72r88q63Q02n62r89m15o92N13J475m61j949n7r07J403N58j246
11352C728J126K396o16j295j091R94L94o7j161j539n21k98J989J96l55M0r5j471
11334B354M3o79L82k8j22O36p81o68J490O5J064P24j321j154J261J181R58l27
11316E078m43J95r67l19k98O79J915j284o92N04O76L60m13J97l06lj16j217j986
$$ plain form
11297 1560 2980 3973 4075 4604 6167 4172 3794 4624 2797 3357 3788 3718 4094 3751 4394 4007 3477 4094
11279 4094 4815 5182 3775 3022 2922 2639 3658 3638 2683 2315 2935 4877 3277 2331 2498 1020 1322 2910
11261 2910 3488 3236 2468 3179 1976 1341 3471 5238 5611 5105 5220 5033 4272 3402 2847 1757 3176 3198
11243 3198 2431 3107 4951 5317 5317 5463 4886 5326 5946 5517 4863 4715 4859 4047 3630 4360 4089 4033 2748 3677
11223 3677 3097 1740 2411 628 1760 2528 2149 3519 2823 1871 2737 3249 3979 3705 3362 4007 3844 3463
11205 3463 3597 4862 5072 4369 3107 1672 2180 3720 3546 734 -403 802 1045 1686 2022 3550 3202
11188 3202 1263 1288 2342 801 286 793 1783 2080 2869 2972 2276 2038 1997 1683 2654 3308 4158 4586 3922
11169 3922 2328 2121 1953 2220 2167 2861 2358 1310 -420 241 -713 70 1763 2580 1723 1577 1116 50
$$ packed form
11297A560J420R93J02N29J563j995l78Q30j827N60M31p0L76l43O43l87n30O17
11279D094P21L67j407p53j00k83J019k0r55l68O20J942j600r46J67j478L02J588
11261B910N78k52p68P11j203o35K130J767L73n06J15j87p61q70n55j090J419K2
11243C198p67O76J844L66%J46n77M40O20m29o54j48J44q12m17P30k71n6j285R29
11223C677n80j357O71j783J132P68l79J370o96r52Q66N12P30k74l43O45j63l81
11205C463J34J265K10p03j262j435N08J540j74k812j137J205K43O41L36J528l48
11188C202j939K5J054j541n15N07R90K97P89J03o96k38m1l14R71O54Q50M28o64
11169C922j594k07j68K67n3O94n03j048j730O61r54P83J693Q17q57j46m61j066
$$ plain form
11151 50 1073 1945 3290 4614 3960 3992 3890 3612 3855 3250 2847 2224 1490 571 417 1470 2390 419 962
11132 962 289 -939 -722 940 3778 2877 2645 3701 5933 5588 3522 2253 1786 1120 916 1922 1762
11115 1762 1321 1722 1205 152 -445 372 924 1073 452 1058 1206 1031 -1981 -1809 -1502 -900 -479 -1273 -2042
11096 -2042 -1462 1114 2060 1869 1752 294 922 1561 1068 1924 2751 683 -423 -782 -196 703 -38 -478
11078 -478 -897 677 2011 1241 -34 638 667 3123 5262 5458 5472 5376 3973 1725 1985 3235 3287 3270 2845
11059 2845 2263 2502 980 668 812 1500 1906 2405 2403 2107 3650 4335 3755 3663 3782 2946 1690 1984 1966 1955
11039 1955 1355 -424 566 2062 2810 3431 2614 1521 1367 804 694 1516 2950 2020 1842 2177 2391 3355
11021 3355 3574 2116 1332 1143 1588 2208 2924 2475 3061 4224 4869 3955 3333 4297 3520 471 316 2234
$$ packed form
11151E0J023Q72J345J324o54L2j02k78K43o05m03o23p34r19j54J053R20j971N43
11132I62o73j228K17J662K838r01k32J056K232l45k066j269m67o66k04J006j60
11115A762m41M01n17j053n97Q17N52J49o21O06J48j75l012J72L07O02M21p94p69
11096b042N80K576R46j91j17j458O28O39m93Q56Q27k068j106l59N86Q99p41m40
11078d78m19J574J334p70j275O72K9K456K139J96J4r6j403k248K60J250N2j7m25
11059B845n82K39j522l12J44O88M06M99kk96J543O85n80r2J19q36j256K94j8j1
11039A955o00j779R90J496P48O21q17j093j54n63j10Q22J434r30j78L35K14R64
11021C355K19j458p84j89M45O20P16m49N86J163O45r14o22R64p77l049j55J918
$$ plain form
11003 2234 1826 948 766 100 30 -506 -1025 52 1455 1870 -238 756 1950 1485 1995 2116 1605 1462
10985 1462 1086 886 336 1742 2803 1804 582 773 3106 3583 2762 1835 498 657 1108 639 -220 -1814
10967 -1814 -1079 1623 2384 2054 2826 2474 1568 -387 -241 69 770 -405 -1180 -437 277 856 1230 -576
10949 -576 -922 -2141 -2777 -1453 668 1369 2662 2091 335 780 1802 3058 3618 1995 2894 3437 3782
10932 3782 4025 3911 2834 2268 2194 3831 4038 3562 3185 3332 3248 2268 3066 2988 2767 1546 2305 3381 3220
10913 3220 3051 1378 128 -790 -646 453 -236 -665 -1639 -1316 332 779 850 369 796 477 418 18 245
10894 245 816 1105 1045 905 1155 2996 3222 1560 808 451 -165 -499 179 -354 -90 528 1094 1454 1729
10875 1729 2654 3013 1917 75 -1753 -2110 -705 -1696 -1864 -2548 -1078 73 -436 -1149 -2649 -2888 -1729
$$ packed form
11003B234m08q78j82o66p0n36n19J077J403M15k108R94J194m65N10J21n11j43
10985A462l76k00n50J406J061r99j222J91K333M77q21r27j337J59M51m69q59j594
10967a814P35K702P61l30P72l52r06j955J46L10P01j175p75P43P14N79L74j806
10949e76l46j219o36J324K121P01J293n71j756M45J022J256N60j623Q99N43L45
10932C782K43j14j077n66p4J637K07m76l77J47q4r80P98p8k21j221P59J076j61
10913C220j69j673j250r18J44J099o89m29r74L23J648M47P1m81M27l19n9m00K27
10894B45N71K89o0j40K50J841K26j662p52l57o16l34O78n33K64O18N66L60K75
10875A729R25L59j096j842j828l57J405r91j68o84J470J151n09p13j500k39J159
$$ plain form
10858 -1729 -208 -261 -2303 -903 -842 -1147 227 12 302 -386 -1905 -1532 -1219 -2110 -203 12 1394 2337
10840 2337 1679 1424 2375 3722 3529 1404 756 1320 309 -475 -167 1740 1301 809 1552 2658 2919 1987
10822 1987 442 -167 304 502 524 488 -451 -1132 -1263 6 1429 1170 896 1794 904 953 2287 1580 1348
10803 1348 1866 1312 -508 513 2748 1166 355 270 879 1041 2157 1849 786 900 1159 689 2229
10786 2229 1527 1139 625 322 -718 -2194 -1818 -1942 -3131 -2869 -2721 -792 1247 982 49 -423 -847 -977
10768 -977 847 675 -1125 -1192 -813 -890 1031 2267 1619 352 166 193 -1854 -938 94 -870 -2306 -480
10750 -480 758 2595 2189 638 783 299 -751 -1059 -421 77 19 318 52 -1458 -613 -578 -1348 -102
10732 -102 147 588 204 -352 66 160 -203 829 1923 2432 1322 -224 187 1209 -13 -2095 -2925 -1613
$$ packed form
10858a729J521n3k042J400O1l05J374k15K90o88j519L73L13q91J907K15J382R43
10840B337o58k55R51J347j93k125o48N64j011p84L08J907m39m92P43J106K61r32
10822A987j545o09M71J98K2l6r39o81j31J269J423k59k74Q98q90M9J334p07k32
10803A348N18n54j820J021K235j582q11q5O09J62J116l08j063J14K59m70J540
10786B229p02l88n14l03j040j476L76j24j189K62J48J929K039k65r33m72m24j30
10768i77J824j72j800o7L79p7J921J236o48j267j86K7k047R16J032r64j436J826
10750d80J238J837m06j551J45m84j050l08O38M98n8K99k66j510Q45L5p70J246
10732a02K49M41l84n56M18R4l63J032J094N09j110j546M11J022j222k082q30J312
$$ plain form
10714 -1613 -2142 -2774 -3805 -3707 -970 -748 -1208 -1274 -2542 -3730 -3022 -4390 -5551 -4533 -1893 606 1453
10697 1453 77 -1132 -12 -44 -153 719 2700 1846 650 -758 -1591 -2194 -2328 -3645 -3413 -2049 -2494
10680 -2494 -2702 -1884 -2226 -2120 -533 508 458 -402 -153 -63 396 -1119 -1872 -1814 -605 97 1058 1407 1070
10661 1070 1724 2314 2906 2750 -817 -2872 -2196 -9 1298 114 -323 -483 -2860 -2784 -1998 -1853 -1974 -1223
10643 -1223 -138 -114 -365 292 1992 2284 -252 -2982 -3284 -877 405 2041 740 -641 -614 -664 -1561
10626 -1561 -2529 -2081 -168 58 -2395 -1244 -465 -899 -508 -1049 -2134 -2786 -3317 -1961 -1556 -1273 -1988 -1843
10608 -1843 -1727 -590 694 -1493 -2594 -1461 -2094 -3364 -1624 -1928 -2050 -775 -722 596 534 1216 -1709
10591 -1709 -2450 -944 227 234 209 -265 -664 -1070 188 -51 -645 -634 249 -1283 -1571 -580 -520 -194 912
$$ packed form
10714a613n29o32j031R8K737K22m60o6j268j188P08j368j161J018K640K499Q47
10697A453j376j209J120l2j09Q72J981q54j196j408q33o03j34j317K32J364m45
10680b494k08Q18l42J06J587J041n0q60K49R0M59j515p53N8J209P02R61L49l37
10661A070O54N90N92j56l567k055O76K187J307j184m37j60k377P6P86J45j21P51
10643a223J085K4k51O57J700K92k536k730l02K407J282J636j301j381K7n0q97
10626a561r68M48J913K26k453J151P79m34L91n41j085o52n31J356M05K83p15J45
10608a843J16J137J284k187j101J133o33j270J740l04j22J275N3J318o2O82k925
10591a709p41J506J171Pk5m74l99m06J258k39n94J1Q83j532k88R91O0L26J106
$$ plain form
10572 912 546 -187 -372 -133 121 1696 1115 750 380 638 893 -375 -2087 -1604 -613 950 942 494 -902
10553 -902 -269 -1514 -644 17 1027 1034 896 -41 156 1111 705 1521 778 665 1092 471 -146 -564 319 641
10533 641 481 729 -156 -1101 -422 -455 -462 -203 -730 -1470 -1101 85 451 -383 226 -208 -232 -11 390 0 1373
10512 1373 3589 3753 4018 4306 4072 3153 3208 2913 1557 2392 2273 1754 992 -862 -1410 -1575 -2068 -2520 -1830
10493 -1830 66 215 -408 -534 -831 155 -411 -557 469 684 619 781 366 -148 -1471 -1419 466 193 -58
10474 -58 1102 2583 1830 976 1 507 1434 1538 989 1199 256 520 1430 1378 833 -7 -1422 -1593 -1127
10455 -1127 -1126 -1530 44 -1449 -2326 -2260 -1244 -2037 -4011 -4643 -3008 -766 -110 -186 -734 -1251 -1882 -889 1230
10436 1230 2833 2734 2579 4263 3308 2841 3611 4196 3484 3488 2871 2740 1904 -1300 -2626 -1517 -1067 173
$$ packed form
10572I12l66p33j85K39K54J575n81l65l70K58K55j268j712M83R91J563qm48j396
10553i02O33j245Q70O61J010Pj38r37J97R55m06Q16p43j13M27o21o17m18Q83L22
10533F41j60K48q85r45O79l3pK59n27p40L69J186L66q34O09m34k4K21M01l90J373
10512A373K216J64K65K88k34r19N5k95j356Q35j19n19p62j854n48j65m93m52O90
10493a830J896J49o23j26k97R86n66j46J026K15o5J62m15n14j323N2J885k73k51
10474e8J160J481p53q54r75N06R27J04n49K10r43K64R10n2n45q40j415j71M66
10455a127Jm04J574j493q77O6J016p93j974o32J635K242O56p6n48n17o31R93K119
10436A230J603r9j55J684r55m67P70N85p12Mo17j31q36l204j326J109M50J240
$$ plain form
10418 173 121 333 1369 1168 692 -962 -1837 -551 1157 1746 2499 2308 2227 1443 706 -655 -315 1139
10400 1139 1457 1814 2758 2619 1657 164 609 838 -270 362 2083 1938 1108 2426 816 -692 -366
10383 -366 598 958 1721 2013 1203 -271 -1407 -1498 -1854 -700 703 -415 -723 -808 896 2231 1792 1517
10365 1517 1518 2145 2938 1740 735 91 812 1034 618 164 -735 -1061 -2300 -1793 -1293 -2839 -1940 -8
10347 -8 1855 2892 1644 444 -322 -1567 -258 374 1002 1381 858 -128 -1809 -3188 -2866 -2282 -1892 -1146
10329 -1146 -633 316 1031 1053 16 341 -587 -855 171 1363 572 -586 -637 -498 -1748 -2091 -771 185
10311 185 1237 2325 522 456 695 1127 -229 -1062 -619 -282 -397 -773 -804 -471 169 -371 1044 3008
10293 3008 1523 392 -100 1840 2967 1164 -686 -1963 -1742 -1628 -311 -818 -3635 -3664 -2597 -2556 -1835
$$ packed form
10418A73n2K12J036k01m76j654q75J286J708N89P53j91q1p84p37j361L40J454
10400A139L18L57R44j39r62j493M45K29j108O32J721j45q30J318j610j508L26
10383c66R64L60P63K92q10j474j136r1l56J154J403j118l08q5J704J335m39k75
10365A517JO27P93j198j005o44P21K22m16m54q99l26j239N07N00j546Q99J932
10347hJ863J037j248j200p66j245J309O32O28L79n23r86j681j379L22N84L90P46
10329a146N13R49P15K2j037L25r28k68J026J192p91j158n1J39j250l43J320R56
10311A85J052J088j803o6K39M32j356q33M43L37j15l76l1L33O40n40J415J964
10293C008j485j131m92J940J127j803j850j277K21J14J317n07k817k9J067M1P21
$$ plain form
10276 -1835 -504 -90 -296 743 783 843 652 957 2011 2168 1969 369 -30 -202 322 1431 1770 623
10258 623 -1140 -1107 -47 1175 2521 4049 4893 5858 5426 4245 3536 3402 3848 2287 1874 1582 952 1018
10240 1018 1583 2290 2666 1732 1355 1139 1709 611 -410 -1774 -1276 1328 3000 3019 3310 2982 1061 -1029
10222 -1029 11 960 909 849 1667 2807 3023 3453 2400 1637 1310 2299 2475 2003 2275 1306 130 298 998
10203 998 1523 2195 -19 330 506 -626 -924 22 161 -538 -388 537 1303 135 -579 -339 265 676 -435
10184 -435 -342 -809 -549 -1707 -1997 -773 637 2307 2901 3328 3904 2454 263 204 1118 770 -131 378
10166 378 1736 1674 555 522 -156 -493 276 -226 -255 -666 -1862 -1519 317 296 734 -218 -5 -425 -53 -765
10146 -765 -1003 -1275 291 1719 3468 2374 955 -574 -1277 -1878 -2805 -2527 -2191 -1418 -507 56 -499 -806
$$ packed form
10276a835J331M14k06J039M0O0j91L05J054J57j99j600l99j72N24J109L39j147
10258F23j763L3J060J222J346J528Q44R65m32j181p09j34M46j561m13k92o30O6
10240A018N65P07L76r34l77k16N70j098j021j364M98K604J672J9K91l28j921k090
10222a029J040R49n1o0Q18J140K16M30j053p63l27R89J76m72K72r69j176J68P00
10203I98N25O72k214L49J76j132k98R46J39o99J50R25P66j168p14K40O04M11j111
10184d35R3m67K60j158k90J224J410J670N94M27N76j450k191n9R14l48r01N09
10166C78J358o2j119l3o78l37P69n02k9m11j196L43J836k1M38r52K13m20L72p12
10146g65k38k72J566J428J749j094j419j529p03o01r27K78L36P73R11N63n55l07
$$ plain form
10128 -806 -81 -645 -2079 -2730 -2695 -2477 -59 496 3162 4696 4311 4083 5262 4821 4403 6338 8414 10984
10110 10984 11227 10604 10037 6718 5645 6897 8190 8056 9415 9504 12284 16463 22647 35420 55772
10095 55772 97453 172060 224320 182787 105615 61178 38017 26344 19710 16935 12669 8987
10083 8987 6235 4855 4785 5615 4455 3366 3349 3666 3426 4108 2873 1069 1689 1447 1405 678 225 1325
10065 1325 2023 1044 -335 -324 -503 -49 1117 2870 3024 1919 1574 1523 987 25 -283 1189 3101 3801
10047 3801 2117 1496 1309 1506 700 -460 257 779 1232 1446 1841 1781 1377 1854 2142 1044 648 -49 892
10028 892 1725 1252 289 -309 57 935 657 132 177 1207 196 1006 1329 1031 1845 3123 2877 2083 413
10009 413 189 2287 3108 1792 141 -747 -1277 -1010 206 1208 700 1154 1383 2900 2985 2839 2783 3041
$$ packed form
10128h06P25n64j434o51L5K18K418N55K666J534l85k28J179m41m18J935K076K570
10110A0984K43o23n67l319j073J252J293j34J359Q9K780M179O184J2773K0352
10095E5772M1681P4607N2260m1533p7172m4437k3161j1673o634k775m266l682
10083H987k752j380p0Q30j160j089j7L17k40O82j235j804O20k42m2p27m53J100
10065A325O98r79j379J1j79M54J166J753J54j105l45n1n36r62l08J472J912P00
10047C801j684o21j87J97q06j160P17N22M53K14L95o0m04M77K88j098l96o97R41
10028H92Q33m73r63n98L66Q78k78n25M5J030j011Q10L23k98Q14J278k46p94j670
10009D13k24K098Q21j316j651q88n30K67J216J002n08M54K29J517Q5j46n6K58
$$ plain form
9991 3041 3833 3142 1344 2517 3973 3712 4164 4141 2456 1703 393 -1064 216 493 875 358 796 1500
9973 1500 2072 2883 2774 2441 2672 1140 148 534 1660 3341 3494 3206 3379 1991 1174 1625 1939 2997
9955 2997 2808 3865 3234 2724 2502 3316 2495 2906 3458 2073 -297 -465 200 759 1764 3768 3066 1550
9937 1550 1292 2462 1811 -64 90 315 -189 407 1126 1296 1673 51 -722 -1066 -2233 -2332 -1092 -993 -1000
9918 -1000 -429 957 823 -253 623 2384 3540 3482 3206 3258 3465 4556 4499 1518 -78 676 1497 85
9900 85 171 802 2507 3882 5156 3987 3099 1042 343 1619 1921 1381 1674 2812 4243 4917 3525 2477
9882 2477 1674 3172 4401 4852 3695 3766 2305 2863 3412 3298 3054 1951 627 503 658 2295 4336
9865 4336 2307 927 186 20 -683 1046 1706 2391 2664 2752 2755 2926 2050 818 1508 2772 3250 1793 1133
$$ packed form
9991C041P92o91j798J173J456k61M52k3j685p53j310j457J280K77L82n17M38P04
9973A500N72Q11j09l33K31j532r92L86J126J681J53k88J73j388q17M51L14J058
9955B997j89J057o31n10k22Q14q21M11N52j385k370j68O65N59J005K004p02j516
9937A550k58J170o51j875J54K25n04N96P19J70L77j622p73l44j167r9J240R9p
9918a000N71J386j34j076Q76J761J156n8k76N2K07J091n7k981j596P54Q21j412
9900H5Q6O31J705J375J274j169q88k057o99J276L02n40K93J138J431O74j392j048
9882B477q03J498J229M51j157P1j461N58N49j14k44j103j324j24J55J637K041
9865D336k029j380p41j66p03J729O60O85K73Q8LJ71q76j232O90J264M78j457o60
$$ plain form
9846 1133 2183 4066 3913 3608 2508 3376 4274 4205 4029 2673 979 423 2011 2622 2746 2386 2996 2990 3169
9827 3169 3597 2458 1793 505 1618 2781 3077 2522 3427 3368 2352 2489 2432 2633 2340 2927 4132 4014
9809 4014 4282 2450 2420 4392 5100 5360 2978 1671 1979 2739 3465 4988 5494 5745 5375 3720 4864 5621
9791 5621 5058 4531 4226 4403 4049 4266 4123 3744 3711 3638 4765 4440 3280 3785 4719 5418 4280 5291 7033
9772 7033 7320 6810 6129 5658 4925 4821 4702 4239 3617 3350 2760 1312 1068 1743 2518 2754 2382 2173 2391
9753 2391 2774 3141 4676 4528 4673 5916 6556 6594 6251 6917 6533 6111 3497 2224 4200 5123 4959 5076
9735 5076 4188 3915 3138 2440 4075 4465 5244 5864 7771 8491 8659 6696 5881 7668 7134 6314 5690 5761 7572
9716 7572 6586 5567 5568 5154 6553 7079 6833 5635 5512 4258 5050 6686 6911 7357 6951 6534 5896 6435 7173
$$ packed form
9846A133J050J883j53l05j100Q68Q98o9j76j356j694n56J588O11J24l60O10oJ79
9827C169M28j139o65j288J113J163K96n55R05n9j016J37n7K01k93N87J205j18
9809D014K68j832l0J972P08K60k382j307L08P60P26J523N06K51l70j655J144P57
9791E621n63n27l05J77l54K17j43l79l3p3J127l25j160N05R34O99j138J011J742
9772G033K87n10o81m71p33j04j19m63o22k67n90j448k44O75P75K36l72k09K18
9753B391L83L67J535j48J45J243O40L8l43O66l84m22k614j273J976R23j64J17
9735E076q88k73p77o98J635L90P79O20J907P20J68j963q15J787n34q20o24P1J811
9716G572r86j019Jm14J399N26k46j198j23j254P92J636K25M46m06m17o38N39P38
$$ plain form
9697 7173 8068 8238 8952 9789 9932 9155 8470 7492 7789 7647 8151 8776 7850 6681 5717 6476 8506 10029 7605
9678 7605 4918 4648 6012 6258 6155 4599 3694 5483 7198 7269 7846 6799 7327 7439 8493 8495 9824 10818
9660 10818 8649 7181 6837 5148 4669 4858 5324 4776 4230 5935 7185 7235 7396 7701 7571 5872 6698 7869
9642 7869 8131 8358 7604 6920 7401 8342 8744 10007 10953 12571 13390 12693 12878 12990 12759 10730 9535 8473
9624 8473 8751 8438 7160 8434 9642 10947 10003 9898 12464 14865 14654 13835 13060 10786 12048 14422 15448
9607 15448 15097 15520 14251 11180 12041 11557 10826 10447 12501 13785 14323 13615 13534 14291 13851 13126 11734 11616
9589 11616 13060 13610 13249 13076 13550 13142 12587 12820 12350 13236 13075 12551 12679 14524 16313 16849 17342 17328 15583
9570 15583 16743 17574 16408 16879 18692 19708 17230 16385 14549 14219 13888 14588 15032 18411 19838 19712 20228
$$ packed form
9697G173Q95J70P14Q37J43p77o85r78K97j42N04O25r26j169r64P59K030J523k424
9678G605k687k70J364K46j03j556r05J789J715P1N77j047N28J12J054KJ329R94
9660A0818k169j468l44j689m79J89M66n48n46J705J250N0J61L05j30j699Q26J171
9642G869K62K27p54o84M81R41M02J263R46J618Q19o97J85J12k31k029j195j062
9624H473K78l13j278J274J208J305r44j05K566K401k11q19p75k274J262K374J026
9607A5448l51M23j269l071Q61m84p31l79K054J284N38p08q1P57m40p25j392j18
9589A1616J444N50l61j73M74m08n55K33m70Q86j61n24J28J845J789N36M93j4j745
9570A5583J160Q31j166M71J813J016k478q45j836l30l31P00M44L379J427j26N16
$$ plain form
9553 20228 20406 21221 20878 21237 21943 23664 24349 23002 21296 19278 19743 21078 20587 20016 22362 25233 26897
9536 26897 27639 29978 31512 32463 31610 30301 30146 30273 27647 27621 28332 29113 29695 29915 30746 30745 31044 32226 33302
9517 33302 34216 34579 33877 32962 33331 34141 34649 33488 34042 36304 37862 39316 39781 37400 37707 40607 41677
9500 41677 42142 42457 42312 42635 43452 44019 45345 47579 50279 51664 53039 52966 53318 54372 54083 54134 54283 55610
9482 55610 57283 58345 60016 61118 61515 62966 65837 67416 68764 70462 74504 77215 80231 82516 83974
9467 83974 86191 87418 88173 92345 95689 99604 102388 105820 110370 111719 114989 120383 123408 125890 130719
9452 130719 134133 139197 144997 151653 156631 162764 168883 175057 181502 187340 194731 204091 212995 223042
9438 223042 234001 244288 255337 268022 282091 295335 308547 324637 341659 359906 380390 401967
$$ packed form
9553B0228J78Q15l43L59P06J721O85j347j706k018M65J335m91n71K346K871J664
9536B6897P42K339J534R51q53j309j55J27k626k6P11P81N82K20Q31jK99J182J076
9517C3302R14L63p02r15L69Q10N08j161N54K262J558J454M65k381L07K900J070
9500D1677M65L15j45L23Q17N67J326K234K700J385J375p3L52J054k89N1J49J327
9482E5610J673J062J671J102L97J451K871J579J348J698M042K711L016K285J458
9467H3974K217J227P55M172L344L915K784L432M550J349L270N394L025K482M829
9452A30719L414N064N800O656M978O133O119O174O445N838P391R360Q904J0047
9438B23042J0959J0287J1049J2685J4069J3244J3212J6090J7022J8247K0484K1577
$$ plain form
9426 401967 422224 444130 467907 493809 520940 546202 574150 603632 633452 664429 696742 725326
9414 725326 752523 780854 807539 832509 851373 865864 876219 884531 887672 883453 874649 861861
9402 861861 844689 825410 801992 774746 746134 718060 691092 662691 635657 608077 580673 552475
9390 552475 525229 498767 473404 448875 427554 407607 389276 369325 351482 334125 319055 305822
9378 305822 292813 278697 265947 255422 244642 234347 223737 211290 201543 194842 188147 179762
9366 179762 171660 165235 160140 155469 150182 143209 136165 130809 125821 122631 118550 115418 113934 111214
9352 111214 105941 103286 100270 96295 93121 89930 86883 84000 82470 81277 77769 75636 74539 73242
9338 73242 70668 70334 69152 68469 67802 66429 62901 58716 57915 58464 61634 64869 64874 63659 60998 58845 58037
$$ packed form
9426D01967K0257K1906K3777K5902K7131K5262K7948K9482K9820L0977L2313K8584
9414G25326K7197K8331K6685K4970J8864J4491J0355Q312L141m219q804j2788
9402H61861j7172j9279k3418k7246k8612k8074k6968k8401k7034k7580k7404k8198
9390E52475k7246k6462k5363k4529k1321j9947j8331j9951j7843j7357j5070j3233
9378C05822j3009j4116j2750j0525j0780j0295j0610j2447r747o701o695q385
9366A79762q102o425n095m671n287o973p044n356m988l190m081l132j484k720
9352A11214n273k655l016l975l174l191l047k883j530j193l508k133j097j297
9338G3242k574l34j182o83o67j373l528m185q01N49L170L235Nj215k661k153q08
$$ plain form
9321 58037 57684 56613 57796 57673 57257 57665 55877 54326 52749 52817 51397 49596 48182 44204 40000 36884
9305 36884 37120 36302 37212 40335 42147 40513 39975 41400 42888 41393 39441 37551 38373 37713 36871 36382 35655
9288 35655 34790 34268 36176 35014 32382 31329 31152 31482 32263 33184 32141 30988 29107 28553 27893 26192 24845
9271 24845 22614 21531 20439 20298 21738 22790 23073 25195 26474 27137 28636 29550 29390 29861 29544 29008 28213
9254 28213 28418 27887 25365 24835 25894 25614 27633 29208 28278 27680 27111 25876 26136 26823 27999 28588 28376
9237 28376 26696 24076 25128 25804 25348 23737 21983 22535 25017 27982 29798 30766 30888 29017 26730 24895
9221 24895 24538 23565 24205 22283 21458 21485 21275 20872 19006 17102 15909 17432 18353 20785 21820 23204 23799
9204 23799 26746 30986 36765 37599 35796 35824 35014 33711 30670 26424 23786 23457 22719 22062 22642 22616 23988
$$ packed form
9321E8037l53j071J183j23m16M08j788j551j577O8j420j801j414l978m204l116
9305C6884K36q18R10L123J812j634n38J425J488j495j952j890Q22o60q42m89p27
9288C5655q65n22J908j162k632j053j77L30P81R21j043j153j881n54o60j701j347
9271B4845k231j083j092j41J440J052K83K122J279O63J499R14j60M71l17n36p95
9254B8213K05n31k522n30J059k80K019J575r30n98n69j235K60O87J176N89k12
9237B8376j680k620J052O76m56j611j754N52K482K965J816R68J22j871k287j835
9221B4895l57r73O40j922q25K7k10m03j866j904j193J523R21K432J035J384N95
9204B3799K947M240N779Q34j803K8q10j303l041m246k638l29p38o57N80k6J372
$$ plain form
9187 23988 27753 32385 35391 36509 35881 33626 28064 21874 18158 18001 17635 18387 18733 18908 18360 19861
9171 19861 21677 22316 22611 22777 21093 19087 18720 19336 20317 20623 18803 15551 12239 14841 19731 23386
9155 23386 23194 21648 20204 20931 23222 22759 21625 20320 20218 20059 21565 24535 26444 28676 32811 37099
9139 37099 39577 41318 39947 36585 32999 29467 28293 27126 27122 27668 29610 31251 32335 33879 37450 39730
9123 39730 38317 39741 42887 44597 43797 42505 41751 42803 44693 45920 46183 49124 56384 61877 66285
9108 66285 70889 76421 83507 92297 101045 111367 124841 142162 166106 201401 256252 335852 448514
9095 448514 594645 767607 958440 1139115 1279358 1365508 1371775 1299267 1167580 992548
9085 992548 805934 633922 486050 374870 295195 240503 202252 174993 154702 138961 126354
$$ packed form
9187B3988L765M632L006J118o28k255n562o190l716j57l66P52L46J75n48J501
9171A9861J816O39K95J66j684k006l67O16R81L06j820l252l312K602M890L655
9155B3386j92j546j444P27K291m63j134j305j02j59J506K970J909K232M135M288
9139C7099K478J741j371l362l586l532j174j167mN46J942J641J084J544L571K280
9123C9730j413J424L146J710q00j292p54J052J890J227K63K941P260N493M408
9108F6285M604N532P086Q790Q748J0322J3474J7321K3944L5295N4851P9600J12662
9095D48514J46131J72962J90833J80675J40243Q6150O267p2508j31687j75032
9085I92548j86614j72012j47872j11180p9675n4692l8251k7259k0291j5741j2607
$$ plain form
9074 126354 114141 103432 93797 82885 72128 64012 58393 53434 49769 48404 48832 51581 52043 51332
9060 51332 49957 48393 44853 41683 40224 38339 37340 37310 38568 39981 42149 46388 46271 43557 39445 37494
9044 37494 34623 28950 22211 16842 15531 15817 17959 20885 25318 28776 32580 35554 35200 33139 30591
9029 30591 29319 30521 35703 41015 43484 44485 45260 44795 44316 45361 44027 39750 36389 34205 34508 39524
9013 39524 44058 49190 55231 56459 53733 47265 37506 28309 21161 13381 -612 -13307 -9206 13855
8999 13855 41371 56141 52923 38517 24827 18725 19022 23687 28152 32382 35857 36747 39473 44113
8985 44113 47133 44428 40879 39440 37417 36513 37091 38453 40663 40283 38341 34612 29024 26415 28373
8970 28373 32887 36889 41293 47043 52561 55723 55573 54481 56454 64201 72901 78457 82773 91290 104939
$$ packed form
9074A26354j2213j0709r635j0912j0757q116n619m959l665j365M28K749M62p11
9060E1332j375j564l540l170j459j885r99l0J258J413K168M239j17k714m112j951
9044C7494k871n673o739n369j311K86K142K926M433L458L804K974l54k061k548
9029C0591j272J202N182N312K469J001P75m65m79J045j334m277l361k184L03N016
9013C9524M534N132O041J228k726o468r759r197p148p780j3993j2695M101K3061
8999A3855K7516J4770l218j4406j3690o102K97M665M465M230L475Q90K726M640
8985D4113L020k705l549j439k023r04N78J362K210l80j942l729n588k609J958
8970B8373M514M002M404N750N518L162j50j092J973P747Q700N556M316Q517J3649
$$ plain form
8955 104939 123134 144816 169825 199437 242688 299659 356213 336080 256391 186997 140746 114539
8943 114539 102671 99367 98583 99671 102564 107848 113339 118449 128620 146573 169945 188728 204810
8930 204810 221522 231535 239244 255678 290288 352053 453017 617871 900400 1403647 2251470
8919 2251470 3215404 3434112 2657428 1693083 1072105 733933 545061 431557 361487 320397
8909 320397 295985 284606 273972 253384 221585 191594 177155 180124 193350 202956 201362 192892
8897 192892 183896 174522 162117 142957 120600 97235 71686 48751 34792 34217 40675 48862 54729
8884 54729 57854 60619 67408 79612 87931 90188 84462 76346 67786 57422 49189 45440 47568 51517
8870 51517 55431 60635 65173 64674 62094 53610 41568 25040 8798 5068 18646 41531 62232
$$ packed form
8955A04939J8195K1682K5009K9612M3251N6971N6554k0133p9689o9394m6251k6207
8943A14539j1868l304p84J088K893N284N491N110J0171J7953K3372J8783J6082
8930B04810J6712J0013P709J6434L4610O1765J00964J64854K82529N03247Q47823
8919B251470R63934K18708p76684r64345o20978l38172j88872j13504p0070m1090
8909C20397k4412j1379j0634k0588l1799k9991j4439K969J3226R606j594q470
8897A92892q996r374j2405j9160k2357k3365k5549k2935j3959n75O458Q187N867
8884E4729L125K765O789J2204Q319K257n726q116q560j0364q233l749K128L949
8870E1517L914N204M538m99k580q484j2042j6528j6242l730J3578K2885K0701
$$ plain form
8857 62232 83298 104495 118404 121725 110043 86374 69444 65935 65999 67142 69784 76799 84066 87818
8843 87818 91200 96203 98198 96979 97288 101688 110975 116376 117979 115583 110805 109738 113463 123755 140501
8828 140501 161535 182231 202025 222137 227628 201046 189978 192565 164700 146326 138783 137156
8816 137156 136260 132844 125674 118373 114769 120845 131104 142039 148266 149343 149481 149736 157057 168504
8802 168504 182309 197693 215296 233206 247655 252945 245485 233605 228338 234151 249930 268527
8790 268527 283007 290441 297421 307657 313222 309368 298363 292829 297686 317816 343208 365018 376766
8777 376766 383792 388637 393274 398990 402195 398408 396221 405955 423269 434245 433849 423636 412439 409883
8763 409883 416250 422852 425259 428311 434980 447182 462360 471516 478928 501307 541475 586373 625991
$$ packed form
8857F2232K1066K1197J3909L321j1682k3669j6930l509O4J143K642P015P267L752
8843H7818L382N003J995j219L09M400R287N401J603k396m778j067L725J0292J6746
8828A40501K1034K0696J9794K0112N491k6582j1068K587k7865j8374p543j627
8816A37156q96l416p170p301l604O076J0259J0935O227J077J38K55P321J1447
8802A68504J3805J5384J7603J7910J4449N290p460j1880n267N813J5779J8597
8790B68527J4480P434O980J0236N565l854j1005n534M857K0130K5392K1810J1748
8777C76766P026M845M637N716L205l787k187R734J7314J0976l96j0213j1197k556
8763D09883O367O602K407L052O669J2202J5178R156P412K2379M0168M4898L9618
$$ plain form
8750 625991 664544 709393 767487 826948 877460 913085 927785 936415 961197 1010213 1078190 1160381
8738 1160381 1246039 1326986 1393428 1446814 1491097 1539033 1602315 1692436 1807739 1945893 2096428
8727 2096428 2250344 2423284 2630831 2883425 3173077 3479355 3780270 4074963 4419314 4870367
8717 4870367 5469252 6277910 7393667 8939231 11029653 13578367 15882688 17388168 18874102
8708 18874102 21082020 23224061 24611577 26484883 30520555 37600303 48710174 65842134
8700 65842134 92610191 135324957 202450092 291932120 362617838 362566325 294981330 206380244
8692 206380244 140721781 99700448 73971886 57127244 45723066 37811774 32352962
8685 32352962 28980651 27402558 26288647 24165101 21316969 18744378 16681226 14873302
$$ packed form
8750F25991L8553M4849N8094N9461N0512L5625J4700Q630K4782M9016O7977Q2191
8738A160381Q5658Q0947O6442N3386M4283M7936O3282R0121J15303J38154J50535
8727B096428J53916J72940K07547K52594K89652L06278L00915K94693L44351M51053
8717D870367N98885Q08658J115757J545564K090422K548714K304321J505480J485934
8708A8874102K207918K142041J387516J873306M035672P079748J1109871J7131960
8700F5842134K6768057M2714766O7125135Q9482028P0685718n1513o7584995q8601086
8692B06380244o5658463m1021333k5728562j6844642j1404178p911292n458812
8685C2352962l372311j578093j113911k123546k848132k572591k063152j807924
$$ plain form
8677 14873302 13161810 11569355 10134911 8900088 7885889 7048248 6350062 5770487 5312357
8668 5312357 4949255 4634346 4344104 4065638 3796127 3549476 3338157 3154271 2978222 2803014
8658 2803014 2627482 2454304 2289740 2141946 2015218 1910870 1828488 1752625 1670621 1584198
8648 1584198 1489519 1389920 1298631 1228814 1183896 1158829 1137421 1105916 1069018 1034172 1007693
8637 1007693 988336 955122 909356 871123 842530 813831 782400 750767 719317 689020 660296
8626 660296 627443 590055 552717 526050 514473 508417 493469 466942 441469 421068 406375 391703
8614 391703 376733 367318 362048 364824 373415 377109 369980 351888 329916 313360 307114 304142 301401
8601 301401 296791 295415 303549 309508 304547 290553 271144 254942 248320 251860 262960 273667 282887
$$ packed form
8677A4873302j711492j592455j434444j234823j014199q37641o98186n79575m58130
8668E312357l63102l14909k90242k78466k69511k46651k11319j83886j76049j75208
8658B803014j75532j73178j64564j47794j26728j04348q2382p5863q2004q6423
8648A584198r4679r9599r1289o9817m4918k5067k1408l1505l6898l4846k6479
8637A007693j9357l3214m5766l8233k8593k8699l1431l1633l1450l0297k8724
8626F60296l2853l7388l7338k6667j1577o056j4948k6527k5473k0401j4693j4672
8614C91703j4970r415n270K776Q591L694p129j8092k1972j6556o246k972k741
8601C01401m610j376Q134N959m961j3994j9409j6202o622L540J1100J0707R220
$$ plain form
8588 282887 292734 299937 302941 301921 296457 293469 298078 306706 312598 312921 305872 296901 291031 290385 299012
8573 299012 314852 343475 380164 404071 394445 344884 287300 250739 232582 225838 226002 228996 231695
8560 231695 228882 225273 221439 211476 202562 199199 202624 205655 202811 197739 194355 193159 196100 199190
8546 199190 200851 199302 194452 186535 181950 180949 172734 149744 125638 112874 113198 123181 140360 157329
8532 157329 175516 197025 211217 207471 188344 168954 155296 144627 139208 138150 139412 142785 146418
8519 146418 150668 149433 143156 132094 117992 104587 95722 90280 91771 99683 111367 118909 121129
8506 121129 121642 126638 137757 146696 145683 132656 109720 85154 61616 43142 28489 17686 11723
8493 11723 8699 10476 19592 38346 59613 72158 71103 57843 40661 30336 30915 39731 51313
$$ packed form
8588B82887R847P203L004j020n464k988M609Q628N892L23p049q971n870o46Q627
8573B99012J5840K8623L6689K3907r626m9561n7584l6561j8157o744J64K994K699
8560B31695k813l609l834r963q914l363L425L031k844n072l384j196K941L090
8546A99190J661j549m850p917m585j001q215k2990k4106j2764L24R983J7179J6969
8532A57329J8187K1509J4192l746j9127j9390j3658j0669n419j058J262L373L633
8519A46418M250j235o277j1062j4102j3405q865n442J491P912J1684P542K220
8506A21129N13M996J1119Q939j013j3027k2936k4566k3538j8474j4653j0803n963
8493A1723l024J777R116J8754K1267J2545j055j3260j7182j0325N79Q816J1582
$$ plain form
8480 51313 60701 67115 74326 81666 86771 88317 87999 85076 80602 73980 64894 57385 52457 51686 50875
8465 50875 48984 47073 44890 46022 49396 53170 60563 66183 69928 70900 66309 59185 55086 53054 53765
8450 53765 54999 60504 68601 76596 80056 81637 81770 77663 66911 53781 40387 30098 22101 17204
8436 17204 18733 22586 27830 32663 35454 38683 43756 48532 47739 45381 42157 41417 44539 48345 52746
8421 52746 57601 59833 58077 54639 49926 45433 44111 43833 44883 45297 44205 41747 38761 35008 29432
8406 29432 30114 31897 34232 35914 38581 43692 48641 50978 51780 51286 45865 32333 16695 11927 25736
8391 25736 53371 79524 84163 71432 58567 49770 41486 29553 17895 9815 6084 6192 11915
8378 11915 20247 25326 26657 28064 27420 23997 22220 19245 15599 13639 15654 17301 18486 21416 27066
$$ packed form
8480E1313R388O414P211P340N105J546l18k923m474o622r086p509m928p71q11
8465E0875j891j911k183J132L374L774P393N620L745R72m591p124m099k032P11
8450E3765J234N505Q097P995L460J581J33m107j0752j3130j3394j0289p997m897
8436A7204J529L853N244M833K791L229N073M776p93k358l224p40L122L806M401
8421E2746M855K232j756l438m713m493j322k78J050M14j092k458k986l753n576
8406B9432O82J783K335J682K667N111M949K337Q02m94n421j3532j5638m768J3809
8391B5736K7635K6153M639j2731j2865q797q284j1933j1658q080l731J08N723
8378A1915Q332N079J331J407o44l423j777k975l646j960K015J647J185K930N650
$$ plain form
8363 27066 29948 29638 28999 27853 27778 28261 29404 31388 35899 39502 41996 45048 44473 42578 39042 35357
8347 35357 32232 29675 25614 21809 19178 20682 23777 25250 26421 26299 25887 26255 26910 26524 25745 24972
8331 24972 24201 23121 24553 27516 32799 38106 42682 45725 46344 46220 44824 44680 45468 47540 50750 57591
8315 57591 66040 74030 80403 87006 96004 106998 118441 131081 145967 167549 205135 263559 346826
8302 346826 465148 618658 796542 986458 1161396 1289910 1361547 1352114 1265622 1127027
8292 1127027 949800 766000 599211 460445 354676 279002 225392 186004 158522 138496
8282 138496 123557 112837 102811 93566 84091 74906 66730 58269 49609 42053 35606 30648 28317 25386
8268 25386 24296 24901 26400 26483 25885 26431 26853 29683 30283 26757 22193 17850 14359 10642 8133 6993
$$ packed form
8363B7066K882l10o39j146p5M83J143J984M511L603K494L052n75j895l536l685
8347C5357l125k557m061l805k631J504L095J473J171j22m12L68O55l86p79p73
8331B4972p71j080J432K963N283N307M576L043O19j24j396j44P88K072L210O841
8315E7591Q449P990O373O603Q998J0994J1443J2640J4886K1582L7586N8424Q3267
8302C46826J18322J53510J77884J89916J74938J28514P1637r433q6492j38595
8292A127027j77227j83800j66789j38766j05769p5674n3610l9388k7482k0026
8282A38496j4939j0720j0026r245r475r185q176q461q660p556o447m958k331k931
8268B5386j090O05J499Q3n98N46M22K830O00l526m564m343l491l717k509j140
$$ plain form
8252 6993 7544 10339 13582 14557 16085 18126 20214 21250 22241 21800 19803 16046 14974 15388 17279 17087
8236 17087 16283 15968 19616 21259 23046 21948 18205 16110 16522 19038 20860 22470 21042 18049 16815
8221 16815 17213 17374 17383 16804 15222 16118 16483 16259 14760 13119 9712 5475 1241 -2024 -2227 -1508 788
8204 788 5969 9921 11445 12396 12628 12010 11086 10109 6050 4203 5438 6534 7587 8890 10488 11303 13277
8187 13277 14620 14225 13590 13071 12201 11328 13338 14180 14214 11979 10195 9967 9666 11085 10902 9772 8013
8170 8013 6103 5691 4730 1736 -1068 -332 1424 4112 7713 10687 13087 13368 12799 10517 8602 7315
8154 7315 7444 7839 6722 5331 4696 4812 5095 3926 3835 2373 2991 3417 5667 7478 7963 7704 7358 5417
8136 5417 3499 1976 1560 1818 1147 2553 4777 7311 7148 7889 9932 10673 12211 11280 11237 13171 12761
$$ packed form
8252F993N51K795L243R75J528K041K088J036R91m41j997l757j072M14J891j92
8236A7087q04l15L648J643J787j098l743k095M12K516J822J610j428k993j234
8221A6815L98J61Rn79j582Q96L65k24j499j641l407m237m234l265k03P19K296
8204G88N181L952J524R51K32o18r24r77m059j847J235J096J053J303J598Q15J974
8187A3277J343l95o35n19q70q73K010Q42L4k235j784k28l01J419j83j130j759
8170H013j910m12r61k994k804P36J756K688L601K974K400K81n69k282j915j287
8154G315J29L95j117j391o35J16K83j169r1j462O18M26K250J811M85k59l46j941
8136E417j918j523m16K58o71J406K224K534j63P41K043P41J538r31m3J934m10
$$ plain form
8119 12761 10924 9834 9420 10240 9194 8648 7916 7963 6539 8053 10048 10922 12728 14229 11380 9312
8103 9312 8515 7453 6934 5064 4253 4494 5479 5125 4029 3593 3706 3851 4299 4714 5522 8857 11904 12800
8085 12800 13128 12543 10465 9724 10167 10078 8816 8117 7880 5657 3112 2860 3214 2803 2626 3343 2193 755
8067 755 -2014 -4985 -6146 -3267 459 3192 6249 8241 6923 6739 6514 6128 6713 7953 9560 9289
8051 9289 9275 10073 10193 10458 10618 11622 13738 12149 10740 10097 8970 7007 6013 5516 5359 5722 6748 7593
8033 7593 8191 9154 8900 8609 7894 7044 5465 5462 6869 7770 7937 4490 3912 4633 4066 3938 4514 4832 5959
8014 5959 3832 1224 1788 2715 2954 4257 5103 5444 5469 4240 3584 2645 1676 3243 4605 3995 4006 6446
7996 6446 7428 5468 5196 5252 6128 7101 6540 5109 4255 3448 3710 5232 5887 5747 3609 1031 695 1049
$$ packed form
8119A2761j837j090m14Q20j046n46p32M7j424J514J995Q74J806J501k849k068
8103I312p97j062n19j870q11K41R85l54j096m36J13J45M48M15Q08L335L047Q96
8085A2800L28n85k078p41M43q9j262o99k37k223k545k52L54m11j77P17j150j438
8067G55k769k971j161K879L726K733L057J992j318j84k25l86N85J240J607k71
8051I289j4P98J20K65J60J004K116j589j409o43j127j963r94m97j57L63J026Q45
8033G593N98R63k54k91p15q50j579lJ407R01J67l447n78P21n67j28N76L18J127
8014E959k127k608N64R27K39J303Q46L41K5j229o56r39r69J567J362o10J1K440
7996F446R82j960k72N6Q76R73n61j431q54q07K62J522O55j40k138k578l36L54
$$ plain form
7978 1049 1831 3933 4259 3004 3110 4541 4914 5512 5844 6075 5371 5028 5202 3874 5011 6305 6640 6180
7960 6180 5596 5667 4416 2672 2230 3078 4782 5703 5919 6098 6696 5770 5835 5854 5967 6620 7105 5428 3481
7941 3481 3871 4386 5218 4943 4189 2567 3585 3922 2913 2721 2243 2734 4445 6172 5479 3381 4584
7924 4584 6121 4684 5051 5106 3295 3762 3441 4007 3617 2968 2456 1969 2859 3484 5299 4956 3392 3472 3582
7905 3582 4194 4835 4646 5119 4853 3597 2743 3554 2621 1650 1310 -298 -1548 -664 -204 70 724 1105 420
7886 420 774 2359 1974 768 1448 1363 1863 3249 2949 2404 3489 4764 2384 -466 403 896 811 564
7868 564 132 -608 -69 2371 1283 661 684 337 -58 -599 -1947 -2006 -1505 -3752 -5086 -2136 -1071 -86
7850 -86 -119 -412 882 2306 1755 4078 4181 3268 4674 3952 4471 6099 5845 4383 4444 5697 4202 2570
$$ packed form
7978A049P82K102L26j255J06J431L73N98L32K31p04l43J74j328J137J294L35m60
7960F180n84P1j251j744m42Q48J704R21K16J79N98r26O5J9J13O53M85j677j947
7941C481L90N15Q32k75p54j622J018L37j009j92m78M91J711J727o93k098J203
7924D584J537j437L67N5j811M67l21N66l90o49n12m87Q90O25J815l43j564Q0J10
7905C582O12O41j89M73k66j256q54Q11r33r71l40j608j250Q84M60K74O54L81o85
7886D20L54J585l85j206O80q5N00J386l00n45J085J275k380k850Q69M93q5k47
7868E64m32p40N39K440j088o22K3l47l95n41j348n9N01k247j334K950J065R85
7850h6l3k93J294J424n51K323J03r13J406p22N19J628k54j462O1J253j495j632
$$ plain form
7832 2570 2426 2098 3826 3628 3010 3178 3908 2333 2952 4989 4059 3005 2702 2696 2497 3570 5357 3635
7814 3635 2558 2737 645 38 2269 4063 3343 3179 2348 3002 1714 1324 3620 1430 2613 3685 2969
7797 2969 2366 2206 1159 2113 3289 2366 3419 4893 4621 3065 1328 2183 1664 1491 2118 1324 668 -274
7779 -274 -782 -399 285 -617 -1495 -109 1322 1831 2275 4256 5486 4266 4467 4230 2440 1831 191 -2570
7761 -2570 -3069 -1371 -1681 -2081 -1503 -380 966 735 701 1440 889 1691 2372 3507 3018 1418 957 720
7743 720 1853 1868 2994 3812 3038 2374 1799 1775 2162 1928 986 668 2040 2497 2655 976 476 784 1845
7724 1845 359 -749 107 2143 2536 1125 1308 -338 496 1447 1830 563 -631 -333 -187 -1006 -2946
7707 -2946 -3628 -2535 -1354 -388 -237 -2247 -3221 -1467 -664 -1060 -2431 -3510 -2662 -869 -22 2301 1523
$$ packed form
7832B570j44l28J728j98o18J68P30j575O19K037r30j054l03oj99J073J787j722
7814C635j077J79k092o07K231J794p20j64q31O54j288l90K296k190J183J072p16
7797B969o03j60j047R54J176r23J053J474k72j556j737Q55n19j73O27p94o56r42
7779b74n08L83O84r02q78J386J431N09M44J981J230j220K01k37j790o09j640k761
7761b570m99J698l10m00N78J123J346k31l4P39n51Q02O81J135m89j600m61k37
7743G20J133J5J126Q18p74o64n75k4L87k34r42l18J372M57J58j679n00L08J061
7724A845j486j108Q56K036L93j411J83j646Q34R51L83j267j194K98J46q19j940
7707b946o82J093J181R66J51k010r74J754Q03l96j371j079Q48J793Q47K323p78
$$ plain form
7690 1523 23 31 294 777 -8 -405 -1342 589 1450 1170 1521 1338 1616 2681 1945 1349 1410 1778 1692 1825
7670 1825 684 966 1141 1245 1306 871 1200 1847 3107 3281 4059 4766 3696 2410 -5 597 1564 2329
7652 2329 2874 2662 2937 2091 1914 1253 -115 -2435 -1425 262 2004 1990 1359 776 -33 -781 193 1511
7634 1511 2327 951 1331 1714 3681 4314 2218 1605 935 1516 2614 3169 2123 2114 2249 366 -537 -969
7616 -969 -1613 -1504 -1068 -846 -1116 -2048 -1487 -2010 -1181 1350 2038 1622 1446 1112 949 -393 -36 13 1817
7597 1817 1540 2234 858 -77 -725 210 882 957 1295 1057 1646 2265 1671 610 -412 -2281 -3187 -1127
7579 -1127 395 1366 1457 2007 1050 -1212 564 2482 2963 -54 -1519 133 703 -143 -309 -335 -2836 -4494
7561 -4494 -3273 -2877 -2589 -745 413 1011 395 325 1199 613 -1823 -2547 -1481 41 579 -525 -939 -899
$$ packed form
7690A523j500QK63M83p85l97r37J931Q61k80L51j83K78J065p36n96O1L68q6J33
7670A825j141K82J75J04O1m35L29O47J260J74P78P07j070j286k415O02R67P65
7652B329N45k12K75q46j77o61j368k320J010J687J742j4o31n83q09p48R74J318
7634A511Q16j376L80L83J967O33k096o13o70N81J098N55j046rJ35j883r03m32
7616i69o44J09M36K22k70r32N61n23Q29K531O88m16j76l34j63j342L57M9J804
7597A817k77O94j376r35o48R35O72P5L38k38N89O19n94j061j022j869r06K060
7579a127J522R71R1N50r57k262J776J918M81l017j465J652N70q46j66k6k501j658
7561d494J221L96K88J844J158N98o16p0Q74n86k436p24J066J522N38j104m14M0
$$ plain form
7543 -899 -2367 -2769 -3401 -4574 -2453 -1690 -3195 -3248 -3616 -3136 -793 680 829 2454 1653 2032 2454 1442
7525 1442 -164 -847 288 -202 -1591 -823 -234 1616 2227 1569 1459 1234 982 2174 599 210 1078 1622
7507 1622 1102 484 -106 84 649 485 300 -1185 -1225 100 85 1260 1306 836 231 -64 1404 2939 3219
7488 3219 2282 1673 1481 10 -859 -2116 -1682 -1036 -2179 -2044 -1471 -1110 -365 1002 1553 2453 2985 2512
7470 2512 2725 2443 3731 4127 1887 1137 232 145 -294 1182 964 -316 -1518 -2963 -2792 -3084 -1596 -1610
7452 -1610 159 1017 815 -1101 -2988 -2971 -2567 -1533 -875 -244 684 1426 3175 3744 2725 1279 410 1436
7434 1436 2266 1136 -887 -472 992 811 874 1864 1751 483 -161 -18 -527 276 -4 756 1428 1044 2230
7415 2230 661 -209 -1181 350 2089 901 341 -533 -1671 -1784 -2162 -3169 -2368 -6 823 604 -220
$$ packed form
7543h99j468m02o32j173K121P63j505n3l68M80K343J473J49J625q01L79M22j012
7525A442j606o83J135m90j389P68N89J850O11o58j10k25k52J192j575l89Q68N44
7507A622n20o18n90J90N65j64j85j485m0J325j5J175M6m70o05k95J468J535K80
7488C219r37o09j92j471q69j257M34O46j143J35N73L61P45J367N51R00N32m73
7470B512K13k82J288L96k240p50r05q7m39J476k18j280j202j445J71k92J488j4
7452a610J769Q58k02j916j887J7M04J034O58O31R28P42J749N69j019j446q69J026
7434A436Q30j130k023M15J464j81O3R90j13j268o44J43n09Q03k80P60O72l84J186
7415B230j569q70r72J531J739j188n60q74j138j13l78j007Q01K362Q29k19q24
$$ plain form
7398 -220 -1830 -1886 -146 1313 1476 -155 -1122 -1237 7 -348 -408 -809 -859 -228 1088 2206 1291 1067 213
7379 213 -161 -1961 -3873 -3662 -2613 -1962 -1505 -2511 -3014 -2833 -2147 -1103 -722 431 1527 2319 919
7362 919 -818 -1376 55 1202 2025 1178 1273 2098 1935 1374 1524 2940 2340 992 -274 -308 -311 -750 -960
7343 -960 -1669 -1300 812 871 -1381 -1308 343 1286 1657 1432 1323 165 -1125 -1606 -2181 -3016 -4623 -4330 -3148
7324 -3148 -3324 -2177 -1245 -1924 -1170 244 -199 202 -670 -1947 -3192 -3327 -2864 -2596 -2237 -535 1753 3830
7306 3830 2290 1216 84 -301 265 290 767 863 683 138 -8 2038 1861 75 -102 -185 -78 -838 -971
7287 -971 654 1668 39 397 -1123 -875 -141 -663 -1655 -2355 -1328 -1568 -1385 -1054 -1130 -2166 -1954 -525
7269 -525 -257 372 344 881 671 1088 254 -333 625 90 -1014 -2170 -2295 -3529 -1384 -489 -330 -462 -116
$$ packed form
7398b20j610n6J740J459J63j631r67j15J244l55o0m01n0O31J316J118r15k24q54
7379B13l74j800j912K11J049O51M57j006n03J81O86J044L81J153J096P92j400
7362I19j737n58J431J147Q23q47R5Q25j63n61J50J416o00j348j266l4lm39k10
7343i60p09L69K112N9k252P3J651R43L71k25j09j158j290m81n75q35j607K93J182
7324c148j76J147R32o79P54J414m43M01q72j277j245j35M63K68L59J702K288K077
7306C830j540j074j132l85N66K5M77R6j80n45j46K046j77j786j77q3J07p60j33
7287i71J625J014j629L58j520K48P34n22r92p00J027k40J83L31p6j036K12J429
7269e25K68O29k8N37k10M17q34n87R58n35j104j156j25j234K145Q95J59j32L46
$$ plain form
7250 -116 -512 1449 2136 642 -1302 -203 1372 2276 945 177 -31 -215 476 433 53 -88 463 1663
7232 1663 1712 2837 2568 -288 -78 -485 -1440 -1940 -1052 -952 -2624 -2476 -1497 -1075 -1055 -1037 -1078 -1972 -1675 -1833
7212 -1833 -1170 -628 433 388 263 955 991 400 -463 -233 74 -173 -1165 -1710 -1914 -1432 -2472 -1745 -1700 -3051
7192 -3051 -2529 95 -207 -2135 -2537 -1731 -1087 -2671 -3000 -950 319 -808 -1253 -2346 -2163 -1285 297
7175 297 -1232 -2513 -1262 -402 -2376 -1546 167 867 -645 -1757 -1613 -2396 -2878 -3097 -3428 -2792 -2641 -2506
7157 -2506 -1518 -1160 -2650 -3593 -2366 -16 -402 -1952 -2501 -2912 -2342 -870 -486 -687 259 1118 1573 -640
7139 -640 -2139 -1774 -2096 -1211 -29 332 1353 483 875 -94 -1952 -3195 -2779 -1284 102 159 437 625
7121 625 1277 1420 332 79 778 1133 210 33 580 1776 1222 388 670 1958 125 -1624 -1724 -692
$$ packed form
7250a16l96J961O87j494j944J099J575R04j331p68k08j84O91m3l80j41N51J200
7232A663M9J125k69k856K10m07r55n00Q88J00j672J48R79M22K0J8m1q94K97j58
7212a833O63N42J061m5j25O92L6n91q63K30L07k47r92n45k04M82j040P27M5j351
7192c051N22K624l02j928m02Q06O44j584l29K050J269j127m45j093J83Q78J582
7175B97j529j281J251Q60j974Q30J713P00j512j112J44p83m82k19l31O36J51J35
7157b506R88L58j490r43J227K350l86j550n49m11N70J472L84k01R46Q59M55k213
7139f40j499L65l22Q85J182L61J021q70L92r69j858j243M16J495J386N7K78J88
7121F25O52J43j088k53O99L55r23j77N47J196n54q34K82J288j833j749j00J032
$$ plain form
7103 -692 1685 943 -181 -225 683 1901 2110 1954 3029 3759 4182 3485 1664 1702 676 452 942 -81
7085 -81 -435 -785 -491 726 565 -226 -1204 -1065 -980 -760 -389 1418 1628 2080 3013 789 -122 -1078 -692 -1798
7065 -1798 -2763 -1775 -1535 -2655 -2551 -2840 -2960 -3257 -2877 -1696 -387 -243 -560 1332 1393 -293 -856 -1880
7047 -1880 -1507 -1429 -570 -611 -930 -900 -2584 -2220 -2447 -3353 -3096 -2843 -1381 -1326 -1924 -1781 -1927 -802 -639 -229
7027 -229 310 2219 1179 1116 2560 1851 888 409 325 -177 -130 296 2124 1332 -727 -2333 -820 -239 -507
7008 -507 -1530 -1336 -213 -148 -223 1372 2414 1727 1071 316 -86 -158 171 867 3106 3524 1889 -1738 -3048
6989 -3048 -1520 -200 1907 1936 1391 455 883 -471 -482 216 708 2601 1077 -1400 -1412 -737 -578 582
6971 582 422 729 534 955 1886 1200 -834 -453 52 1143 546 -646 -1397 -1290 -1753 -2217 -773 523
$$ packed form
7103f92K377p42j124m4R08J218K09j56J075P30M23o97j821L8j026k24M90j023
7085h1l54l50K94J217j61p91r78J39Q5K20L71J807K10M52R33k224r11r56L86j106
7065a798r65R88K40j120J04k89j20k97L80J181J309J44l17J892O1j686n63j024
7047a880L73P8Q59m1l19L0j684L64k27r06K57K53J462N5n98J43j46J125J63M10
7027b29N39J909j040o3J444p09r63m79q4n02M7M26J828p92k059j606J513N81k68
7008e07j023J94J123O5p5J595J042o87o56p55m02p2L29O96K239M18j635l627j310
6989c048J528J320K107K9n45r36M28j354j1O98M92J893j524k477j2O75J59J160
6971E82j60L07j95M21R31o86k034L81N05J091n97j192p51J07m63m64J444J296
$$ plain form
6953 523 118 -971 -1062 -71 -819 -359 130 -295 -731 -1167 -1532 -1184 -481 -835 -1059 -194 665 33 -177 -1238
6933 -1238 -1556 -2501 -3910 -4639 -3879 -3493 -4925 -3154 -1510 752 1525 1928 350 -2080 -2023 -587 -331
6916 -331 -638 312 -745 -1685 -734 932 1894 -142 -712 -2161 -2134 -873 214 769 676 -946 -1738 -775
6898 -775 479 973 -32 -169 -999 -2228 -2314 -3779 -2553 -897 714 158 -694 -275 -949 -1415 -2453 -1676
6880 -1676 -2095 -1348 -435 1209 1043 -698 262 897 1582 655 123 -666 -1600 -804 539 516 1107 3257 2699
6861 2699 1797 673 -249 -157 232 1517 1834 2380 2697 326 -1532 -2101 -784 863 1463 935 33 822
6843 822 814 1853 1629 716 472 -269 -1101 -1673 -3458 -3195 -1550 -169 564 658 -363 -12 117 1186 2226
6824 2226 911 1009 2531 1783 -228 -1387 442 447 -831 -1970 -2536 -2157 -1867 -897 -988 1073 2902 1979
$$ packed form
6953E23m05j089r1R91p48M60M89m25m36m36l65L48P03l54k24Q65Q59o32k10j061
6933a238l18r45j409p29P60L86j432J771J644K262P73M03j578k430N7J436K56
6916c31l07R50j057r40R51J666R62k036n70j449K7J261J087N55r3j622p92R63
6898g75J254M94j005j37q30j229q6j465J226J656J611n56q52M19o74m66j038P77
6880a676m19P47R13J644j66j741R60O35O85r27n32p89r34P96J343k3N91K150n58
6861B699r02j124r22R2L89J285L17N46L17k371j858n69J317J647O00n28r02P89
6843H22qJ039k24r13k44p41q32n72j785K63J645J381P33R4j021L51J29J069J040
6824B226j315R8J522p48k011j159J829Nj278j139n66L79K90R70r1K061J829r23
$$ plain form
6806 1979 1285 -31 -830 -871 257 117 513 816 307 -922 -516 593 -686 384 801 911 584 -743
6788 -743 -141 -318 -2409 -3317 -739 -126 -1558 -1372 -1031 57 -2328 -4403 -3673 -2300 -389 -624 -2101
6771 -2101 -2294 -2193 -1441 -160 217 804 617 -588 -388 -1447 -806 -1363 -740 588 1183 2203 2117 1515
6753 1515 2335 1932 633 219 554 815 434 -641 -1532 -1576 -1182 -1735 -587 -625 -806 -473 -601 64 318
6734 318 118 -239 -734 -1117 -719 -556 -440 -1304 -1027 81 584 599 1162 -587 -2864 -2401 -1805 -611 168
6715 168 -1295 -1349 -1909 -1943 -1216 -1621 -2802 -2919 -1694 -2114 -654 314 -1618 -595 639 281 -1177 -1292
6697 -1292 -1166 -1322 -1419 -541 -667 916 1792 924 208 -1632 -744 2193 2369 1951 1829 1002 -551 -679 -908
6678 -908 -485 -848 -2252 -1866 151 1373 1234 -552 -1543 -1342 -1192 -1596 -1940 -2865 -2181 -356 -176 -1389
$$ packed form
6806A979o94j316p99m1J128j40L96L03n09j229M06J109j279J070M17J10l27j327
6788g43O02j77k091r08K578O13j432J86L41J088k385k075P30J373J911k35j477
6771b101j93J01P52J281L77N87j87j205K00j059O41n57O23J328N95J020q6o02
6753A515Q20m03j299m14L35K61l81j075q91m4L94n53J148l8j81L33j28O65K54
6734C18k00l57m95l83L98J63J16q64K77J108N03J5N63j749k277M63N96J194P79
6715A68j463n4n60l4P27m05j181j17J225m20J460R68j932J023J234l58j458j15
6697a292J26j56r7Q78j26J583Q76q68p16j840Q88K937J76m18j22q27j553j28k29
6678i08M23l63j404L86K017J222j39j786r91K01J50m04l44r25O84J825J80j213
$$ plain form
6660 -1389 -1256 -553 563 833 1987 1445 -336 -1117 -1232 -578 -966 -1335 313 491 0 -408 -1909 -1737
6642 -1737 -1665 -889 341 182 1043 1173 1438 -7 195 -448 -1145 334 592 1519 1601 -544 -1387 -883 -344
6623 -344 1266 1683 1634 1583 956 1678 1729 1343 472 -1002 -3503 -2627 -1259 -599 -1903 -1505 -385 -974 -648
6604 -648 -347 -219 -476 -764 -1863 -1588 -1275 -1871 -20 -890 -2156 -2023 -803 -1006 -1245 -1305 -758 -572 -1170
6585 -1170 -650 -734 -464 -1145 -1153 -1008 -839 -1209 -398 -1218 -2127 -1311 -514 -1736 -1259 -901 14 180 -673 -460
6565 -460 450 -503 279 -995 -223 523 405 499 354 1205 1481 1138 214 1278 317 973 -291 -492 -1130
6546 -1130 -685 -831 -1310 -2517 -2493 -2375 -3661 -3683 -3841 -3359 -1606 -1512 -1508 -2195 -2443 -2079 -3898 -4758 -2820 -1608
6526 -1608 -2549 -1885 -1515 -1762 -987 -513 301 -1057 -4090 -4380 -4656 -2340 -1594 -1574 -1923 -885 425 -1027
$$ packed form
6660a389J33P03J116K70J154n42j781p81j15O54l88l69J648J78m91m08j501J72
6642a737P2P76J230j59Q61J30K65j445K02o43o97J479K58R27Q2k145q43N04N39
6623c44J610M17m9n1o27P22N1l86q71j474k501Q76J368O60j304L98J120n89L26
6604f48L01J28k57k88j099K75L13n96J851q70j266J33J220k03k39o0N47J86n98
6585a170N20q4K70o81qJ45J69l70Q11q20r09Q16P97j222M77L58R15J66q53K13
6565d60R10r53P82j274P72P46j18R4j45Q51K76l43r24J064r61O56j264k01o38
6546a130M45j46m79j207K4J18j286k2j58M82J753R4Mo87k48L64j819q60J938J212
6526a608r41O64L70k47P75M74Q14j358l033k90k76K316P46K0l49J038J310j452
$$ plain form
6508 -1027 -1462 -60 952 1821 2415 2237 402 -770 -1826 -2667 -2595 -1194 239 1849 1109 807 1057
6491 1057 1821 3006 2887 2640 1308 -307 -1884 -1028 315 58 285 120 -1023 -775 -1921 -1699 -979
6474 -979 -711 -709 -1032 161 1103 807 1661 959 -404 -2018 -2053 -1649 -1867 -1356 -1655 -2693 -660 -1585 -4391
6455 -4391 -4431 -4457 -2611 -448 -1849 -3303 -3450 -1827 -853 771 1250 650 574 1539 1229 1756 2435 2632 1151
6436 1151 619 1287 1537 1183 709 736 1723 1175 -52 -585 -553 -590 -1086 -1119 -1625 -2154 -2517 -2144 -2631 -2323 -3431
6415 -3431 -3314 -4322 -4155 -2914 -3197 -4080 -2849 -2982 -2153 -1436 -564 -288 1005 485 1725 1353 409 -378
6397 -378 -1441 -1608 327 -443 -808 15 -296 -371 75 669 -132 -235 1225 1410 -343 -1815 -1892 -1715 -1715 -991
6377 -991 -1850 -637 583 191 -89 360 1069 56 876 522 -798 -1494 -2340 -1788 -1509 -1987 -3823 -3799 -3541
$$ packed form
6508a027m35J402J012Q69N94j78j835j172j056q41P2J401J433J610p40l02K50
6491A057P64J185j19k47j332j615j577Q56J343k57K27j65j143K48j146K22P20
6474i79K68Kl23J193R42k96Q54p02j363j614l5M04k18N11k99j038K033r25k806
6455d391m0k6J846K163j401j454j47J623R74J624M79o00p6R65l10N27O79J97j481
6436A151n32O68K50l54m74K7R87n48j227n33L2l7m96l3n06n29l63L73m87L08j108
6415c431J17j008J67J241k83q83J231j33Q29P17Q72K76J293n20J240l72r44p87
6397c78j063j67J935p70l65Q23l11p5M46N94q01j03J460J85j753j472p7J77%P24
6377i91q59J213J220l92k80M49P09j013Q20l54j320o96q46N52K79m78j836K4K58
$$ plain form
6358 -3541 -1951 -2130 -2085 -2477 -2930 -2855 -1191 -1489 -1265 -2053 57 1161 1126 783 -410 -86 133 1090 2567
6339 2567 1545 1091 535 -368 -1004 -1520 -951 -1355 -802 1009 1079 449 -597 -1253 -386 31 705 981 -439
6320 -439 -753 -145 195 -387 -28 -1081 -2662 -3778 -2411 -1553 -1645 -657 -75 426 1648 1977 2023 673 -1546
6301 -1546 -1589 -2588 -3475 -1836 -12 1180 1332 221 -1173 -635 -984 -1412 -856 -1832 -1135 -426 -2456 -3469
6283 -3469 -3394 -2907 -2326 -2467 -1978 -417 -474 -289 -1772 -2666 -2489 -2248 -3854 -4111 -2941 -2042 -2347 -1445 -2770
6264 -2770 -3440 -3556 -1503 -426 1152 1429 -2 550 2246 1539 284 -1210 -2341 -774 2111 3013
6248 3013 2555 987 77 -445 101 -546 -2356 -3060 -1238 35 -1523 -2910 -3912 -3223 -2226 -805 -1055
6231 -1055 -1100 -700 -1029 -1984 -2731 -1945 -2350 -1680 -599 -175 323 404 -761 47 572 834 1272 -13 -825
$$ packed form
6358c541J590j79M5l92m53P5J664k98K24p88K110J104l5l43j193L24K19R57J477
6339B567j022m54n56r03o36n16N69m04N53J811P0o30j046o56Q67M17O74K76j420
6320d39l14O08L40n82L59j053j581j116J367Q58r2R88N82N01J222L29M6j350k219
6301a546m3r99q87J639J824J192J52j111j394N38l49m28N56r76O97P09k030j013
6283c469P5M87N81j41M89J561n7J85j483q94J77K41j606k57J170Q99l05R02j325
6264b770o70j16K053J077J578K77j431N52J696p07j255j494j131J567K885R02
6248C013m58j568r10n22N46o47j810p04J822J273j558j387j002O89R97J421k50
6231a055m5M00l29r55p47P86m05O70J081M24M98Q1j165Q08N25K62M38j285q12
$$ plain form
6212 -825 -870 -1494 -1779 -2445 -1785 -1584 -2469 -2959 -1726 -503 41 -156 -1744 -955 -494 -1009 -472 -2139 -2145 -497
6192 -497 1159 431 -295 -1086 -2671 -2991 -3169 -1164 -1861 -2238 -3128 -3984 -4953 -3940 -2835 -2008 -1592 -1391
6174 -1391 -2427 -2573 -2791 -1890 -3504 -2689 -2695 -2965 -3868 -4364 -2770 -1107 304 -117 -156 549 439 659 964
6155 964 662 562 -1681 -2251 -2264 -2732 -2016 -425 1263 -190 -1004 -490 -1051 -2435 -4024 -2703 -2065 -3255
6137 -3255 -2507 -2922 -2784 -2213 -1356 -3 -230 694 -917 -1707 -3166 -4158 -2443 -1137 -924 388 1926
6120 1926 1154 -303 -15 -207 -1046 -2896 -3347 -1795 -1023 -2232 -3006 -641 1068 2 -190 509 1329
6103 1329 2110 838 779 1290 248 -1025 -1715 -2624 -1599 976 3315 3158 1795 -179 -2067 -2663 -2629
6086 -2629 -1873 -2131 -2584 -2806 -3857 -3721 -3282 -1645 -109 -722 -1528 -3033 -4682 -4654 -1582 897 939 1313
$$ packed form
6212h25m5o24k85o66O60K01q85m90J233J223N44j97j588P89M61n15N37j667oJ648
6192d97J656p28p26p91j585l20j78K005o97l77q90q56r69J013J105Q27M16K01
6174a391j036j46k18R01j614Q15ok70r03m96J594J663J411m21l9P05j10K20L05
6155I64l02j00k243n70j3m68P16J591J688j453q14N14n61j384j589J321O38j190
6137c255P48m15J38N71Q57J353k27R24j611p90j459r92J715J306K13J312J538
6120A926p72j457K88j92q39j850m51J552P72j209p74K365J709j066j92O99Q20
6103A329P81j272n9N11j042j273o90r09J025K575K339j57j363j974j888n96L4
6086b629P56k58m53k22j051J36M39J637J536o13q06j505j649K8L072K479M2L74
$$ plain form
6068 1313 2099 1049 -238 -2087 -1486 -525 271 444 419 -274 -182 -268 792 1144 2382 2433 -136 -868 -1572
6049 -1572 -1815 -1404 -413 -489 -980 -1028 -1656 162 759 240 -721 -902 -564 -863 -774 -2718 -3445 -4286 -2788 -1240
6029 -1240 -881 -907 -798 114 388 -110 990 2443 3093 2051 90 -207 -106 -558 -302 -1414 -1686 -1357
6011 -1357 -1934 -2181 -2308 -1909 -1153 -970 -1816 -3169 -3048 -1461 -102 2666 2537 324 -2117 -1694 -572
5994 -572 -180 -1407 -2594 -699 1102 -17 -846 306 144 399 338 1178 1143 1010 561 981 557 -1201
5976 -1201 -1774 144 946 1118 684 721 722 1093 268 -299 -548 -1436 -64 -375 -1170 -587 -777 -614 -480 -890
5956 -890 -984 -1360 -2559 -3150 -2619 -3086 -2914 -1354 -1330 -318 -1684 -2477 -1050 -1066 -349 -656 519 1954 4377
5937 4377 4548 3591 2482 1743 591 149 -184 837 566 -659 -868 -920 -670 -76 1112 214 -2237 -3385
$$ packed form
6068A313P86j050j287j849O01R61P96J73k5o93R2q6J060L52J238N1k569p32p04
6049a572k43M11R91p6m91m8o28J818N97n19r61j81L38k99Q9j944p27q41J498J548
6029a240L59k6J09R12K74m98J100J453O50j042j961k97J01m52K56j112k72L29
6011a357n77k47j27L99P56J83q46j353J21J587J359K768j29k213k441M23J122
5994e72L92j227j187J895J801j119q29J152j62K55o1Q40l5j33m49M20m24j758
5976a201n73J918Q02J72m34L7JL71q25n67k49q88J372l11p95N83j90J63J34m10
5956h90r4l76j199n91N31m67J72J560K4J012j366p93J427j6P17l07J175J435K423
5937D377J71r57j109p39j152m42l33J021k71j225k09n2K50N94J188q98k451j148
$$ plain form
5919 -3385 -3735 -3712 -2695 -1178 -871 99 -1129 -982 -1157 -2813 -2069 -804 -1250 -549 -512 -926 -1173 -3061
5901 -3061 -2005 -1530 -1786 -636 621 -179 -2140 -2693 -3843 -3985 -3593 -1606 -299 529 991 35 -719
5884 -719 -213 -411 195 356 1008 -83 -1207 -2355 -2026 -1118 -597 -174 -1559 -1671 -380 -847 -499 -337
5866 -337 82 -483 -308 -96 -118 743 567 -1392 -938 -183 151 -1413 -945 -634 -447 -227 -111 -1073 -1776 -2416
5846 -2416 -3433 -2743 -2385 -1609 -541 -311 34 762 1028 855 1739 2171 1155 1539 909 -388 -122 -742
5828 -742 -305 -1789 -1171 -401 -389 -942 -1266 -900 -1003 -2479 -2816 -2121 -2166 -1579 -1729 -1335 521 1535 702
5809 702 -968 -631 -508 -1510 -1106 -848 -1074 -566 -945 -548 -1195 -2192 -2276 -1575 -999 509 159 67 -1262
5790 -1262 -1407 -869 155 -1777 -2032 -1268 -676 -1208 -762 -192 3077 3636 2588 569 -2117 -2653 -2553 -2105
$$ packed form
5919c385l50K3J017J517L07R70j228J47j75j656P44J265m46P01L7m14k47j888
5901c061J056M75k56J150J257q00j961n53j150j42L92J987J307Q28M62r56p54
5884g19N06j98O06J61O52j091j124j148L29R08N21M23j385j12J291m67L48J62
5866c37M19n65J75K12k2Q61j76j959M54P55L34j564M68L11J87K20J16r62p03o40
5846b416j017O90L58P76J068K30L45P28K66j73Q84M32j016L84o30j297K66o20
5828g42M37j484O18P70J2n53l24L66j03j476l37O95m5N87j50L94J856J014q33
5809G02j670L37J23j002M04K58k26N08l79L97o47r97q4P01N76J508l50r2j329
5790a262j45N38J024j932k55P64N92n32M46N70L269N59j048k019k686n36J00M48
$$ plain form
5772 -2105 -2044 -1526 257 -406 -1326 -87 397 401 43 777 -776 -1094 895 135 -2418 -3842 -3240 -1852
5754 -1852 -889 -417 618 1276 475 1538 684 145 -82 417 -242 -1401 -758 -2153 -1964 -2231 -2168 -2024 -1772
5735 -1772 -1639 177 2239 1123 -848 -2528 -1558 -986 -1177 -1418 -1537 -320 1256 1467 2024 653 -86
5718 -86 -916 -1682 -2125 -1055 197 126 836 11 -1961 -2652 1 422 -231 -853 -911 -1499 -2924 -3800 -3312
5699 -3312 -1631 -941 -202 99 1799 497 -1036 -2543 -2773 -2500 -2846 -2697 -1189 -120 252 -846 -792
5682 -792 -471 -64 -620 -559 -2232 -2607 -2368 -3508 -2185 -1372 -1226 -599 -7 180 -196 -1279 -387 589 1186
5663 1186 154 -820 -1383 -2157 -1445 766 1289 -323 -1510 -1606 -1130 -2078 -1834 -670 1287 1517 838 179
5645 179 528 -41 474 1526 164 -993 -1435 -2234 -1232 -1627 -2030 -1444 -830 -501 -883 -2070 -1131 -2200
$$ packed form
5772b105O1N18J783o63r20J239M84Ml58P34j553l18J989p60k553j424O02J388
5754a852R63M72J035O58q01J063q54n39k27M99o59j159O43j395J89k67O3J44K52
5735a772J33J816K062j116j971j680R70N72j91k41j19J217J576K11N57j371p39
5718h6q30p66m43J070J252p1P10q25j972o91K653M21o53o22n8n88j425q76M88
5699c312J681O90P39L01J700j302j533j507k30K73l46J49J508J069L72j098N4
5682g92L21M07n56O1j673l75K39j140J323Q13J46O27N92J87l76j083Q92R76N97
5663A186j032r74n63p74P12K211N23j612j187r6M76r48K44J164J957K30o79o59
5645A79L49n69N15J052j362j157m42p99J002l95m03N86O14L29l82j187R39j069
$$ plain form
5627 -2200 -2428 -281 1094 865 398 -19 -115 -607 -1034 -779 -1502 -536 -602 -1072 -1464 -335 -1820 -2354 -2529
5608 -2529 -2008 -1257 -420 726 1087 527 756 129 1281 2450 2285 982 469 1802 1476 24 -1040
5591 -1040 4 -1314 -2188 -2585 -2742 -2182 -2300 -1328 -1160 -1214 -1876 -1848 -1854 -1546 -422 987 167 -1003 -310
5572 -310 1124 1021 664 -502 -1725 -1212 153 85 1563 2700 2344 1305 1217 955 2270 2242 3239 2312
5554 2312 1007 426 -118 -1521 -949 -408 -1882 -2047 -2164 -1349 -416 -264 -1575 -891 -285 -271 -852 -239 871
5535 871 -334 -818 -1200 -1070 -224 55 531 788 -235 601 1684 1191 1617 446 -373 -1409 -665 -1748
5517 -1748 -2902 -3931 -4000 -4320 -2941 -3013 -2299 -1832 -2533 -3926 -3591 -2531 -2606 -1599 -1811 -752 -161 -794
5499 -794 -3363 -2830 -1111 -415 -737 -1527 -1690 -2081 -3050 -3130 -3182 -1967 -956 610 1398 98 -552 -83 599
$$ packed form
5627b200k28K147J375k29m67m17r6m92m27K55p23R66o6m70l92J129j485n34j75
5608b529N21P51Q37J146L61n60K29o27J152J169j65j303n13J333l26j452j064
5591a040J044j318q74l97j57N60j18R72J68n4o62K8oL08J124J409q20j170O93
5572c10J434j03l57j166j223N13J365o8J478J137l56j039q8k62J315k8R97r27
5554B312j305n81n44j403N72N41j474j65j17Q15R33J52j311O84O06J4n81O13J110
5535H71j205m84l82J30Q46K79M76K57j023Q36J083m93M26j171q19j036P44j083
5517a748j154j029o9l20J379p2P14M67p01j393L35J060p5J007k12J059N91o33
5499g94k569N33J719O96l22p90j63l91r69q0n2J215J011J566P88j300o50M69O82
$$ plain form
5480 599 1139 71 -345 -601 -1934 -1916 -893 1463 -493 -3722 -4727 -3442 -3128 -1909 -1320 -1034 -2700
5463 -2700 -3197 -3663 -2718 -687 2413 2750 956 339 -266 -1340 -846 154 -496 -1337 -2399 -2694 -3097 -1631
5445 -1631 -303 -1175 -504 -2550 -3565 -2278 -1538 0 -1016 -1839 -1161 -1742 -3164 -2796 -2122 -794 -1540
5428 -1540 -3829 -2307 -1222 205 -70 -590 79 464 2126 2787 890 -979 -1159 -1764 -1958 113 -42
5411 -42 77 129 1590 1062 335 815 1561 134 -466 -1351 -739 -484 27 985 963 -1493 -3815 -4716 -3491
5392 -3491 -1689 1234 2263 1396 -485 -1430 -888 54 -58 201 -1490 -1863 -2020 -1715 -1699 -2740 -3569 -4396
5374 -4396 -5289 -5116 -3963 -3910 -3249 -2073 -1471 -1195 -1548 -1141 -1254 -1511 -1092 -998 -548 -766 -1104 -1484 -1688 -1045
5354 -1045 -83 -126 -928 -2887 -3197 -1247 -342 44 1272 -197 -1695 -1830 -1942 -1276 -1742 -1822 -770 -1319
$$ packed form
5480E99N40j068m16k56j333J8J023K356j956l229j005J285L14J219N89K86j666
5463b700m97m66R45K031L100L37j794o17o05j074M94J000o50q41j062k95m03J466
5445a631J328q72O71k046j015J287P40J538j016q23O78n81j422L68O74J328p46
5428a540k289J522J085J427k75n20O69L85J662O61j897j869j80o05j94K071j55
5411d2J19N2J461n28p27M80P46j427o00q85O12K55N11R58k2k456k322r01J225
5392c491J802K923J029q67j881r45N42R42j12K59j691l73j57L05J6j041q29q27
5374d396q93J73J153N3O61J176O02K76l53M07j13k57M19R4M50k18l38l80k04O43
5354a045R62m3q02j959l10J950R05L86J228j469j498j35j12O66m66q0J052n49
$$ plain form
5336 -1319 -2575 -3498 -2407 -1575 -1155 -979 -1514 -1641 -3709 -2917 -1322 -1545 -676 -1075 -2513 -2500 -3291 -1996
5318 -1996 -1341 -1382 -144 623 -1188 -563 1132 3371 1346 -137 848 1043 -168 -1412 -1427 -2605 -2476
5301 -2476 -3000 -3644 -3480 -2982 -3422 -2532 -2228 -2488 -3956 -3582 -2658 -2237 -2218 -1714 -1277 -1037 -1290 -1624 -2664
5282 -2664 -3279 -2844 -3052 -3738 -3637 -3040 -1567 -898 -451 172 72 -143 -2070 -2358 -2250 -2064 -2179 -2910 -2340
5263 -2340 -2412 -1942 -1522 -54 328 1329 1192 20 -1299 -765 -1290 -1882 -1325 -1241 -1351 -754 -1756 -2267 -2646
5244 -2646 -2370 -1716 -1873 -1211 -516 483 421 1825 1761 1301 410 1063 1692 2661 2942 1760 1856 2801 4021 2672
5224 2672 1042 7 -1555 -2343 5 1208 1273 1447 -514 178 1007 -594 -1482 -1600 -1457 -728 -899 -630
5206 -630 111 1207 1527 594 127 425 -71 -1087 -348 -154 -240 2227 1875 2120 1431 101 -1998 -2599 -2256
$$ packed form
5336a319j256r23J091Q32M20J76n35j27k068P92J595k23Q69l99j438J3p91J295
5318a996O55m1J238P67j811O25J695K239k025j483R85J95j211j244j5j178J29
5301b476n24o44J64M98m40Q90L04k60j468L74R24M21J9N04M37K40k53l34j040
5282b664o15M35k08o86J01N97J473O69M47O23j00k15j927k88J08J86j15p31N70
5263b340p2M70M20J468L82J001j37j172j319N34n25n92N57Q4j10N97j002n11l79
5244b646K76O54j57O62O95R99o2J404o4m60q91O53O29R69K81j182R6R45J220j349
5224B672j630j035j562p88K348J203O5J74j961O92Q29j601q88j18J43P29j71K69
5206f30P41J096L20r33m67K98m96j016P39J94q6K467l52K45o89j330k099o01L43
$$ plain form
5187 -2256 -1538 -1328 -519 -327 -846 -330 -1166 -1566 -1507 -865 -1145 -2090 -2521 -1930 -1021 161 -407 291 775 -1409
5167 -1409 -2860 -1681 -315 1553 1456 354 -356 -1503 -3083 -2176 -1739 -1377 -2061 -1310 -1690 -3184 -3458
5150 -3458 -3714 -3120 -1783 -1780 -2623 -1717 -2021 -3674 -1971 -2221 -3996 -4883 -3978 -2025 -736 -1761 -368 -711
5132 -711 -863 -503 775 531 -1052 -1299 -537 193 571 1403 1340 469 123 -51 -459 1053 -4 -543 -1000
5113 -1000 -1142 -532 472 1226 1442 2308 2229 1703 2134 1888 1759 967 127 -197 45 -493 -58 -150 -850 -3704
5093 -3704 -3483 -1782 -1867 -71 1142 1790 528 -694 -2197 -4203 -4820 -4187 -3303 -3532 -2968 -2024 -1263 -1875
5075 -1875 -1516 738 38 -735 242 1716 748 478 -147 -1446 -1120 -846 -481 -649 -190 -847 -1666 -745 -603
5056 -603 -236 -858 -977 -2543 -3631 -3739 -2741 -961 -464 -435 720 761 644 -510 -2262 -2767 -3536 -2252
$$ packed form
5187b256P18K10Q09J92n19N16q36m00N9O42k80r45m31N91R09J182n68O98M84k184
5167a409j451J179J366J868r7j102p10j147j580R07M37L62o84P51l80j494k74
5150c458k56N94J337Lq43R06l04j653J703k50j775q87R05J953J289j025J393l43
5132g11j52L60J278k44j583k47P62P30L78Q32o3q71l46j74m08J512j057n39m57
5113a000j42O10J004P54K16Q66p9n26M31k46j29p92q40l24K42n38M35r2p00k854
5093c704K21J701q5J796J213O48j262j222j503k006o17O33Q84k29N64R44P61o12
5075a875L59K254p00p73R77J474r68k70o25j299L26K74L65j68M59o57q19R21J42
5056f03L67o22j19j566j088j08R98J780M97K9J155M1j17j154j752n05p69J284
$$ plain form
5038 -2252 -614 -1202 -826 -622 -1360 -2017 -1467 -1409 -1823 -4050 -5576 -4056 -3539 -1205 1155 1606 502 -1853
5020 -1853 -3245 -3601 -2708 -826 1022 -348 -588 -1957 -2983 -2167 -1520 -1724 -2040 -1166 74 1016 -170
5003 -170 -726 -452 -1246 -789 -1018 -1704 -1407 -884 -1376 -983 -9 369 995 2651 3481 3322 2173 518 -1362
4984 -1362 -1010 -1706 -1494 -267 574 794 843 1264 1238 322 -132 -402 -1680 -1718 -1244 -1398 -2348 -799 -932 -2418
4964 -2418 -2036 -2349 -519 -940 -529 143 -1566 -1472 281 84 -1569 -152 1424 1719 1302 785 -973 -2949
4946 -2949 -2247 -1359 -1347 855 265 2186 2259 1464 -219 -632 -469 -1678 -1330 1579 1029 439 -1724 -3642
4928 -3642 -3193 -1329 -449 411 1056 960 -540 -1500 -2007 -1520 -2902 -2050 -1550 -2271 -1669 -900 -1066 -1473 -2769
4909 -2769 -1156 2573 4030 3139 763 -49 1073 734 604 931 1847 3095 2098 224 -2197 -2034 -2771
$$ packed form
5038b252J638n88L76K04p38o57N50N8m14k227j526J520N17K334K360M51j104k355
5020a853j392l56Q93J882J848j370k40j369j026Q16O47k04l16Q74J240R42j186
5003a70n56K74p94M57k29o86K97N23m92L93R74L78O26J656Q30j59j149j655j880
4984a362L52o96K12J227Q41K20M9M21k6r16m54k70j278l8M74j54r50J549j33j486
4964b418L82l13J830m21M11O72j709R4J753j97j653J417J576K95m17n17j758j976
4946b949P02Q88J2K202n90J921P3p95j683m13J63j209L48K909n50n90k163j918
4928c642M49J864Q80Q60O45r6j500r60n07M87j382Q52N00p21O02P69j66m07j296
4909b769J613L729J457q91k376q12J122l39j30L27R16J248r97j874k421J63p37
$$ plain form
4892 -2771 -3195 -2255 -3173 -2757 -1888 -1090 -1280 -786 -723 -3275 -4643 -5971 -3268 -613 -539 -922 -1314 -2276 -676
4873 -676 2055 2429 528 -1352 -2635 -3411 -2893 -2282 -3166 -1772 -2221 -2431 -1143 -333 676 2231 360
4856 360 -1157 -1070 -1397 188 1408 939 -352 -704 -1423 -2287 -3040 -1606 -13 1407 989 -689 -229 -13
4838 -13 -815 -167 2106 2890 1777 -222 2 541 1037 1014 1320 2521 2358 1324 -1102 -2273 -1822 -562
4820 -562 -679 -2254 -1462 -61 851 -15 500 632 142 579 1067 990 -116 -747 169 874 -948 -2121 -1886
4801 -1886 -1233 -2612 -1159 -124 656 70 -259 710 988 529 -802 -356 -919 -2492 -2928 -3000 -2232 -2569
4783 -2569 -3263 -2463 -648 -1356 -593 1455 1857 -47 -830 -1840 -1890 -1478 -2648 -3968 -3581 -2519 -1812 -3742
4765 -3742 -1832 -1495 -3123 -2225 -41 -754 -1407 -798 -499 -1727 -1758 -1735 -2636 -2498 -1789 -1483 164 565 -12
$$ packed form
4892b771m24R40r18M16Q69P98j90M94O3k552j368j328K703K655P4l83l92r62J600
4873f76K731L74j901j880j283p76N18O11q84J394m49k10J288Q10J009J555j871
4856C60j517Q7l27J585J220m69j291l52p19q64p53J434J593J420m18j678M60K16
4838a3q02O48K273P84j113j999K24N39M96k3L06J201j63j034k426j171M51J260
4820e62j17j575P92J401R12q66N15J32m90M37M88p7j106o31R16P05j822j173K35
4801a886O53j379J453J035P80n86l29R69K78m59j331M46n63j573m36p2P68l37
4783b569o94Q00J815p08P63K048M02j904p83j010n0M12j170j320L87J062P07j930
4765c742J910L37j628Q98K184p13o53O09K99j228l1K3r01J38P09L06J647M01n77
$$ plain form
4746 -12 -440 -1473 -1754 -552 -621 793 953 167 460 638 371 -232 -1401 -1851 -1408 -1071 -187 496 -703
4727 -703 -868 -92 -536 -1242 967 1319 639 1668 971 -648 -1599 -1881 -2896 -2913 -790 -869 -1301 -374 1150
4708 1150 2182 831 -438 -77 33 -851 -392 -397 451 101 461 1 -833 -1830 -1419 8 815 1159 588
4689 588 215 -247 -444 -44 662 -185 406 863 812 -31 -1084 -1178 -661 -489 -1110 -2315 -3612 -3135 -1010
4670 -1010 -1165 -1143 -187 -597 -1827 -812 435 -548 -1226 -1311 -1780 -1122 -322 -341 -691 -947 -2297 -1508 -571
4651 -571 -510 -833 -186 1712 1736 667 -61 -703 -102 967 984 438 1115 1228 545 -822 -1748 -197 -146 -1247
4631 -1247 -773 -1276 -1390 -188 -271 -1274 -342 211 -1 -229 -1647 -1344 -1844 -1159 874 1034 -98 -132 -293
4612 -293 -377 -2103 -2234 -1926 -1466 638 937 512 780 649 -115 -423 -1353 -838 -530 -2393 -2191 829 2678
$$ packed form
4746a2m28j033k81J202o9J414J60p86K93J78k67o03j169m50M43L37Q84O83j199
4727g03j65P76m44p06K209L52o80J029o97j619r51k82j015j7K123p9m32R27J524
4708A150J032j351j269L61J10q84M59nQ48l50L60m60q34r97M11J427Q07L44n71
4689E88l73m62j97M00P06q47N91M57n1q43j053r4N17J72o21j205j297M77K125
4670a010j55K2R56m10j230J015J247r83o78q5m69O58Q00j9l50k56j350P89R37
4651e71O1l23O47J898K4j069p28o42O01J069J7n46O77J13o83j367r26J551N1j101
4631a247M74n03j14J202q3j003R32N53k12k28j418L03n00O85K033J60j132l4j61
4612b93q4j726j31L08M60K104K99m25K68j31p64l08r30N15L08j863K02L020J849
$$ plain form
4593 2678 3763 1638 -674 -1657 -808 -573 -574 1080 602 613 220 -150 984 -429 -2497 -2773 -2301 680
4575 680 790 -717 -418 -875 -1073 -1691 -862 1491 1431 239 1970 2209 222 -1312 163 -487 -950 -534
4557 -534 -169 -1130 -575 455 -329 -2163 -1800 -1602 -1995 -454 372 -112 116 887 54 -1384 -1177 -271 -193
4538 -193 -533 -1409 -678 822 -89 -1420 -1565 -326 -1094 -1626 -735 -679 -1996 -1967 -774 -372 -1741 -55
4520 -55 816 183 419 -446 -1523 -1026 -893 64 506 -644 -1021 -1897 -1543 -1281 -376 -1552 -858 35 1149
4501 1149 70 279 743 2370 2851 1976 1650 -44 -1224 -842 1412 2263 2507 1697 115 264 67 378
4483 378 141 -423 -2583 -4162 -2671 263 707 175 -969 -873 -486 -1481 -1233 -1502 -392 190 -619 -620 301
4464 301 587 872 145 1405 2448 2414 1731 2900 2413 -410 -1728 -167 684 940 1145 2117 3677 3842
$$ packed form
4593B678J085k125k312r83Q49K35jJ654m78J1l93l70J134j413k068k76M72K981
4575F80J10j507K99m57j98o18Q29K353o0j192J731K39j987j534J475o50m63M16
4557e34L65r61N55J030p84j834L63J98l93J541Q26m84K28P71q33j438K07R06P8
4538a93l40q76P31J500r11j331j45J239p68n32Q91N6j317K9J193M02j369J686
4520e5Q71o33K36q65j077M97J33R57M42j150l77q76L54K62R05j176O94Q93J114
4501A149j079K09M64J627M81q75l26j694j180L82K254Q51K44q10j582J49j97L11
4483C78k37n64k160j579J491K934M44n32j144R6L87r95K48k69J110N82q09jR21
4464C01K86K85p27J260J043l4o83J169m87k823j318J561Q51K56K05R72J560J65
$$ plain form
4446 3842 2476 -295 -1623 -1655 -432 428 280 426 329 -1038 685 1519 672 419 509 -344 -1121 -764 -862
4427 -862 -585 1205 2170 254 -1150 -915 -889 -752 -388 -754 -342 -2023 -2098 -2338 -2185 -1512 -1278 -2100 -1396
4408 -1396 -203 -134 -1208 -1020 -490 2 -103 838 433 -126 -1830 -1117 -1903 -3123 -2656 -1428 -2082 -2054 -2404
4389 -2404 -1496 225 1551 1511 -58 -839 346 -834 -2294 -1878 -1078 -555 -103 984 1097 -187 -1430
4372 -1430 -1973 -610 -994 -1279 -34 159 466 1105 2354 3437 2146 195 -1440 -384 742 989 -79
4355 -79 -1035 -1199 -1302 -1047 -647 4 -1783 -585 582 111 322 -290 -429 -1463 -497 953 -220 -412
4337 -412 -1072 -2153 -2022 -2071 -992 -618 -1027 -242 2622 1693 559 278 1513 1655 1434 1547 1364 1478 -183
4318 -183 -1267 -931 269 1134 761 -39 153 -1184 -2473 -1088 -939 -1024 -2859 -2575 -1233 -937 -474 -1127
$$ packed form
4446C842j366k771j328l2J223Q60j48J46r7j367J723Q34q47k53R0q53p77L57r8
4427h62K77J790R65j916j404K35K6J37L64l66M12j681p5k40J53O73K34q22P04
4408a396J193O9j074J88N30M92j05R41m05n59j704P13p86j220M67J228o54K8l50
4389b404R08J721J326m0j569p81J185j180j460M16Q00N23M52J087J13j284j243
4372a430n43J363l84k85J245J93L07O39J249J083j291j951j635J056J126K47j068
4355g9r56j64j03K55M00O51j787J198J167m71K11o12j39j034R66J450j173j92
4337d12o60j081J31m9J079L74m09P85K864r29j134k81J235J42k21J13j83J14j661
4318a83j084L36J200Q65l73q00J92j337j289J385J49q5j835K84J342K96M63o53
$$ plain form
4300 -1127 -1930 -1844 -941 797 875 -334 524 902 -914 -3443 -4225 -2907 -1769 -2426 -1956 310 -128 650
4282 650 1108 104 -814 -871 -813 1113 1297 -634 -668 -311 -2 756 -1253 -2479 -1247 324 1144 57
4264 57 -1410 -1828 -463 -758 -1448 -261 1154 1387 -722 -582 593 1529 987 -369 1002 1028 -45 93
4246 93 1269 1346 -185 -443 200 677 243 -324 -371 -976 -1420 -489 -790 -2471 -2138 -3463 -3659 -2293 -535
4227 -535 1030 2147 -81 -1564 479 2047 1959 -319 -373 -1139 394 260 -806 -1497 -1804 -1687 -495
4210 -495 499 441 488 1121 1661 427 -522 -774 -1238 -576 350 -219 -273 1466 1155 254 175 1423 1409 874 1798
4189 1798 1871 1021 1346 1382 1643 2088 1635 2897 1595 1519 1874 2713 1399 -1168 -1786 -484 -1086 -887 323
4170 323 377 591 -961 -325 -730 -356 -373 -457 2212 2452 1186 1455 673 -1170 -2067 -1369 -1159 -167 -775 -49
$$ packed form
4300a127q03Q6R03J738P8j209Q58L78j816k529p82J318J138o57M70K266m38P78
4282F50M58j004r18n7N8J926J84j931l4L57L09P58k009j226J232J571Q20j087
4264E7j467m18J365k95o90J187J415K33k109J40J175R36n42j356J371K6j073J38
4246I3J176P7j531k58O43M77m34n67m7o05m44R31l01j681L33j325j96J366J758
4227e35J565J117k228j483K043J568q8k278n4p66J533j34j066o91l07J17J192
4210d95R94n8M7O33N40j234r49k52m64O62R26n69n4J739l11r01p9J248j4n35R24
4189A798P3q50L25L6K61M45m53J262j302p6L55Q39j314k567o18J302o02J99J210
4170C23N4K14j552O36m05L74j7q4K669K40j266K69p82j843q97O98K10R92o08P26
$$ plain form
4150 -49 1005 686 -503 -402 231 -690 -909 -242 199 735 -205 -1272 -1300 163 169 -972 -1304 -1807 -120
4131 -120 605 969 1876 2113 762 -69 -770 -1122 -447 894 869 88 -288 1012 916 1443 730 -844 -971
4112 -971 -1434 -1696 -157 739 368 1406 1223 1247 -454 -1097 -207 968 689 153 356 -472 -1834 497
4094 497 922 1037 743 -625 -2654 -4452 -2075 -30 1078 210 -141 -101 276 836 2576 3379 2741 2535
4076 2535 2437 881 334 484 1217 2015 909 547 -1184 -1467 -498 -909 -1516 -1465 -2922 -3299 -2711 -2471 110
4057 110 534 790 1180 802 137 -1455 -1825 -697 -571 -1446 -1769 -1577 -444 406 -1650 -3063 -1370 -912
4039 -912 503 697 2683 2408 1059 687 382 -24 429 71 535 1396 1851 2398 3560 4215 3239 1042
4021 1042 -851 -1613 -1149 -1144 -487 1367 2702 3184 2058 117 2059 2183 2160 735 -1125 -876 -1379 -935
$$ packed form
4150d9J054l19j189J01O33r21k19O67M41N36r40j067k8J463Oj141l32n03J687
4131a20P25L64R07K37j351q31p01l52O75J341k5p81l76J300r6N27p13j574j27
4112i71m63k62J539Q96l71J038j83K4j701o43Q90J175k79n36K03q28j362K331
4094D97M25J15k94j368k029j798K377K045J108q68l51M0L77N60J740Q03o38k06
4076B535r8j556n47J50P33P98j106l62j731k83R69m11o07N1j457l77N88K40K581
4057A10M24K56L90l78o65j592l70J128J26q75l23J92J133Q50k056j413J693M58
4039i12J415J94J986k75j349l72l05m06M53l58M64Q61M55N47J162O55r76k197
4021A042j893p62M64NO57J854J335M82j126j941J942J24k3j425j860K49n03M44
$$ plain form
4003 -935 -1665 -2050 241 1052 893 2097 2044 565 -398 -1297 -2373 -3246 -4080 -3637 -2426 -1708 -1896 -206
3985 -206 681 590 928 622 185 179 -577 -1310 -401 874 -182 -1763 -1554 -172 481 -554 572 2372 1085
3966 1085 886 1260 2742 2331 2013 1365 858 615 672 1091 211 -783 -1260 -791 82 -346 -976 459 894
3947 894 766 -236 -1608 -1737 -1086 24 -71 870 -725 -955 -1542 -2497 -2317 -1963 -2594 -2145 -314 -891 -2819
3928 -2819 -3025 -2155 -1273 -1415 -1594 -2314 -1208 -787 -2547 -1121 -864 -1212 -916 297 -287 -300 -594 1104
3910 1104 2395 1387 861 514 -610 -840 -847 -108 -531 -915 -1322 -846 -1239 -2001 -2837 -2016 -1070 640 -325
3891 -325 -588 1057 1020 199 424 -216 -266 -1841 -1866 -1571 -1172 -250 -917 -2693 -2496 -383 1311 1342 -411
3872 -411 -558 -833 -623 -944 -275 1119 1938 1396 -220 -1358 -1452 -808 -6 1200 760 845 957 -1777 -2985
$$ packed form
4003i35p30l85K291Q11j59J204n3j479r63q99j076q73q34M43J211P18j88J690
3985b06Q87r1L38l06m37op56p33R09J275j056j581K09J382O53j035J126J800j287
3966A085j99L74J482m11l18o48n07k43N7M19q80r94m77M69Q73m28o30J435M35
3947H94j28j002j372j29O51J110r5R41j595k30n87r55J80L54o31M49J831n77j928
3928b819k06Q70Q82j42j79p20J106M21j760J426K57l48K96J213n84j3k94J698
3910A104J291j008n26l47j124k30pP39m23l84m07M76l93p62q36Q21R46J710r65
3891c25k63J645l7q21K25o40n0j575k5K95L99R22o67j776J97K113J694L1j753
3872d11j47k75K10l21O69J394Q19n42j616j138r4O44Q02J206m40Q5J12k734j208
$$ plain form
3853 -2985 -3115 -1633 -1298 0 359 -2188 -3011 -3445 -3813 -2595 -1224 645 1533 178 -707 -2638 -2668
3836 -2668 -2491 -2586 -2309 -1544 -913 -744 -2241 -3532 -2785 -755 -397 -340 23 -848 -2090 -1504 -1284 -1882 -1175
3817 -1175 -66 1733 2112 936 1735 1145 394 -616 -1086 -1907 -1850 -867 -345 228 -814 -1791 -3117 -3175
3799 -3175 -2498 -1944 -1270 378 1688 993 1466 643 258 23 193 577 98 -1025 549 -121 -574 -1657
3781 -1657 -2249 -1330 -569 1120 1109 884 820 -687 -1287 -1863 -458 775 317 -506 -2362 -2776 -1578 -1642 -2037
3762 -2037 -1663 -2030 -2545 -2492 -2308 -1186 -2013 -1630 -1540 -602 78 1212 644 646 -209 -760 -392 -104 -1280 -3771
3742 -3771 -4616 -3402 -1615 59 484 559 -1322 -2037 604 796 -1497 -3237 -1574 -383 495 610 807
3725 807 -104 -1872 -1495 -542 -269 -1469 -1414 -141 -159 -1469 -1247 -1344 -3163 -3490 -430 -658 -1703 -2278 -1844
$$ packed form
3853b985j30J482L35J298L59k547q23m34l68J218J371J869Q88j355q85j931l0
3836b668J77r5K77P65O31J69j497j291P47K030L58N7L63q71j242N86K20n98P07
3817a175J109J799L79j176P99n90p51j010m70q21N7R83N22N73j042r77j326n8
3799c175O77N54O74J648J310o95M73q23l85k35J70L84m79j123J574o70m53j083
3781a657n92R19P61J689j1k25o4j507o00n76J405J233m58q23j856m14J198o4l95
3762b037L74l67n15N3J84J122q27L83R0R38O80J134n68Kq55n51L68K88j176k491
3742c771q45J214J787J674M25P5j881p15K641J92k293j740J663J191Q78J15J97
3725H07r11j768L77R53K73j200N5J273j8j310K22r7j819l27L060k28j045n75M34
$$ plain form
3706 -1844 -342 1070 2081 616 -462 -393 -483 801 1488 1846 2378 3382 2898 2129 1088 1511 -948
3689 -948 -2002 -350 1534 1151 -486 -901 -696 912 885 -2350 -2944 -2319 -521 -240 -516 -57 -423 -154
3671 -154 975 1611 2520 1629 -540 -1857 -88 1528 1308 874 706 408 144 150 524 368 861 2137 2656
3652 2656 2757 2245 1732 1265 -311 80 920 1384 1258 1265 2460 2422 667 -1432 -1811 -1182 -2532 -1540 -348
3633 -348 -998 -1048 -99 -575 -1591 -1551 -2828 -2856 -712 -73 -375 -169 -395 -950 -249 -1243 -1659 -2129 -2116 -2105 -1931
3612 -1931 -1806 -2292 89 2545 2685 924 -505 -243 -356 -1240 -2127 -4681 -5836 -5437 -3659 -2335 -958
3595 -958 113 -301 -415 177 -32 -1498 -1235 -18 -791 125 235 -1571 -3371 -2566 -154 1368 1676 1791
3577 1791 2809 1660 97 -871 -649 -273 383 -875 -1733 -476 577 2018 959 521 582 -802 -2026
$$ packed form
3706a844J502J412J011j465j078O9r0J284O87L58N32J004m84p69j041M23k459
3689i48j054J652J884l83j637m15K05J608k7l235n94O25J798K81k76M59l66K69
3671a54J129O36R09q91k169j317J769J616k20m34j68k98k64OL74j56M93J276N19
3652B656J01n12n13m67j576L91Q40M64j26PJ195l8j755k099l79O29j350R92J192
3633c48o50n0R49m76j016M0j277k8K144O39l02K06k26n55P01r94m16m70J3J1J74
3612a931J25m86K381K456J40j761j429K62j13q84q87k554j155L99J778J324J377
3595i58J071m14j14N92k09j466K63J217p73R16J10j806j800Q05K412J522L08J15
3577A791J018j149j563r68K22L76O56j258q58J257J053J441j059m38O1j384j224
$$ plain form
3560 -2026 -456 1085 2302 1258 437 -225 -992 -2021 -2412 -1709 -440 -377 -716 67 1477 2261 2264 1771
3542 1771 3009 2976 1304 370 -294 915 1185 590 371 -138 -1439 -2522 -1399 -572 -916 -973 385 955
3524 955 1718 1378 1642 78 -2024 -1632 -1306 -526 -1671 757 1656 1954 3160 2267 1796 297 -1373 -2466
3506 -2466 -2901 -1601 -1591 276 2775 2421 1219 457 -953 243 -738 -2729 -2821 -2067 -1463 -1046 1075 4355
3488 4355 4179 2823 209 -779 -1235 -983 -1756 -523 680 529 -1066 -1196 -1025 -2530 -2125 -1111 -635
3471 -635 -1205 -1277 -3191 -2573 -1056 981 1086 1058 576 871 709 38 264 37 -284 -1256 -1260 -1154 -742 -1050
3451 -1050 -1383 372 79 -393 -557 -440 -394 -1724 -1432 -2509 -3939 -2274 -1051 -556 -304 29 -1004 -237
3433 -237 1278 -127 -1655 -2489 -1557 776 638 311 -612 514 1746 977 -1060 -1699 -1286 -1890 -538
$$ packed form
3560b026J570J541J217j044q21o62p67j029l91P03J269O3l39P83J410P84Lm93
3542A771J238l3j672r34o64J209K70n95k19n09j301j083J123Q27l44n7J358N70
3524I55P63l40K64j564k102L92L26P80j145K428Q99K98J206q93m71j499j670j093
3506b466m35J300J0J867K499l54j202p62j410J196r81j991r2P54O04M17K121L280
3488D355j76j356k614r88m56K52p73J233J203j51j595j30J71j505M05J014M76
3471f35n70p2j914O18J517K037J05k8m82K95j62o71K26k27l21r72mJ06M12l08
3451a050l33J755k93m72j64J17M6j330K92j077j430J665J223M95K52L33j033P67
3433b37J515j405j528q34R32K333j38l27r23J126J232p69k037o39M13o04J352
$$ plain form
3416 -538 1324 2705 1700 665 909 -1232 -2139 -1119 -568 -414 11 -32 719 842 162 654 1073 1067 1426
3397 1426 2088 1916 1754 1800 566 -193 333 1201 695 444 53 411 1925 2375 1322 2132 3544 3633 2637
3378 2637 1246 1007 1066 -858 -2058 -1088 504 417 -445 -1264 -654 -1802 -2371 -235 428 -1455 -857 89
3360 89 458 -227 46 1952 1601 31 -988 -217 254 1437 2330 1845 2334 3674 2241 17 -503 935
3342 935 2466 2559 1050 324 -169 -671 -1003 -1239 -605 1428 210 244 -207 -1439 -1529 -1035 205 1333 1350
3323 1350 893 2423 1137 523 163 -380 939 2129 2604 1483 -211 -520 -627 -414 389 1872 1702
3306 1702 1126 281 442 -259 -1374 -1173 -513 -859 237 0 -402 1444 928 -263 -1094 -1649 -345 -2007
3288 -2007 -1816 146 894 311 581 1516 965 1393 1536 2254 3521 2925 1521 -564 -1434 -149 594 494
$$ packed form
3416e38J862J381j005j035K44k141r07J020N51J54M25m3P51J23o80M92M19oL59
3397A426O62j72j62M6j234p59N26Q68n06k51l91L58J514M50j053Q10J412Q9r96
3378B637j391k39N9j924j200R70J592q7q62q19O10j148n69K136O63j883N98R46
3360H9L69o85K73J906l51j570j019P71M71J183Q93m85M89J340j433k224n20J438
3342I35J531R3j509p26m93n02l32k36O34K033j218L4m51j232r0M94J240J128J7
3323A350m57J530j286o14l60n43J319J190M75j121j694l09j07K13Q03J483j70
3306A702n76q45J61p01j115K01O60l46J096k37m02J846n16j191q31n55J304j662
3288b007J91J962P48n83K70R35n51M28J43P18J267n96j404k085q70J285P43j00
$$ plain form
3270 494 426 -130 662 793 1589 979 976 1480 1208 556 783 387 -157 230 1541 602 767 171 -113 -253 -572
3249 -572 1298 850 -195 -1313 -1380 1000 445 232 -581 -2012 -1479 749 1095 49 -415 -623 -1950 -1902
3231 -1902 -193 -1561 -2386 -571 -162 -803 -502 -1763 -1990 -290 -312 -377 -723 1607 3082 1926 1582 1041
3213 1041 726 -104 621 -269 -855 -1838 -1753 -1298 -892 1023 171 -1807 -2120 -1967 -1767 -702 -373 181 -150
3194 -150 242 1244 -377 -2264 -2540 -503 80 836 1883 1969 -242 -2732 -2640 -1205 -1318 -1305 -806 20
3176 20 -1525 -1925 -1457 -1900 -811 19 -57 1359 1047 -1156 -1498 -534 1393 706 761 570 -796 -1079 37
3157 37 1605 1539 1591 1957 2148 2294 1455 814 1317 16 -808 -199 -36 -605 -1513 -1123 -209 -1980 -2434 -1886
3137 -1886 -1293 -166 -605 -1173 -2688 -1896 -7 520 1477 -260 -2420 -1699 -2284 -2104 -1431 22 -778 -514
$$ packed form
3270D94o8n56P92J31P96o10lN04k72o52K27l96n44L87J311r39J65n96k84j40l19
3249e72J870m48j045j118o7K380n55k13q13j431N33K228L46j046m64k08j327M8
3231a902J709j368q25J815M09o41L01j261k27J700k2o5l46K330J475j156l44n41
3213A041l15q30P25q90n86r83Q5M55M06J915q52j978l13J53K00J065L29N54l31
3194a50L92J002j621j887k76K037N83P56J047Q6k211k490R2J435j13J3M99Q26
3176B0j545m00M68m43J089Q30p6J416l12k203l42R64J927o87N5j91j366k83J116
3157C7J568o6N2L66J91J46q39o41N03j301q24O09J63n69r08L90R14j771m54N48
3137a886N93J127m39n68j515P92J889N27R57j737k160P21n85J80O73J453q00K64
$$ plain form
3119 -514 503 2113 1457 413 -803 -1775 -1032 -360 1198 893 -89 -1737 -1665 -997 548 -722 -563 -750
3101 -750 -335 520 1100 -533 29 1630 1227 21 -1006 -1737 -1862 -1320 -1894 -1096 1770 2739 1998 1159
3083 1159 629 1669 4152 2074 507 270 138 -761 -117 424 1296 1969 2976 2606 1480 645 356 -492
3065 -492 30 79 2180 1937 1401 699 1810 957 474 -1332 -1515 219 647 1038 -135 -1719 -397 1284
3047 1284 45 -1399 -232 2074 2408 1555 494 -1605 -2303 -1230 186 1983 2569 2428 691 262
3031 262 494 632 2062 2962 2830 1337 -1347 -2559 -1835 -633 -224 740 493 89 1746 1748 813 1273 1381
3012 1381 2798 1851 263 -593 -1373 -1327 -276 693 1021 2361 3205 1866 2148 1516 584 -205 -1604 -1141
2994 -1141 -439 -62 493 -489 -503 -996 -3691 -3347 -640 -581 -1513 -2170 -892 -410 1044 1792 481 -2397
$$ packed form
3119e14J017J610o56j044j216r72P43O72J558l05r82j648P2O68J545j270J59j87
3101g50M15Q55N80j633N62J601m03j206j027p31j25N42n74P98K866R69p41q39
3083A159n30J040K483k078j567k37j32q99O44N41Q72O73J007l70j126q35k89q48
3065d92N22M9K101k43n36p02J111q53m83j806j83J734M28L91j173j584J322J681
3047A284j239j444J167K306L34q53j061k099o98J073J416J797N86j41j737m29
3031B62K32J38J430R00j32j493k684j212P24J202M09R64k47m04J657Kr35M60J08
3012A381J417r47j588q56p80M6J051R69L28J340Q44j339K82o32r32p89j399M63
2994a141P02L77N55r82j4m93k695L44K707N9r32o57J278M82J454P48j311k878
$$ plain form
2976 -2397 -3032 -3364 -2988 -2708 -1862 -881 -1450 -1670 -2750 -3356 -3439 -3061 -660 1876 3094 4375 3784 1397
2958 1397 -1394 -2273 -859 1375 1146 507 265 360 -366 834 2686 2992 2654 568 517 2496 2421 -35
2940 -35 1372 1774 2086 2073 1224 375 -1228 -508 1329 770 -305 -886 -136 1937 1499 -744 -1230 -1626 -1333
2921 -1333 -764 -213 -605 -493 -170 -423 -420 -170 -1900 -2981 -899 697 1100 861 1711 2830 2354 1524 1630
2902 1630 -27 -1249 -385 -1675 -1795 -588 -846 -1984 -407 450 324 410 1413 1909 1988 1485 121 -1609
2884 -1609 -2944 -1859 -414 757 -226 -1601 -578 -54 -566 1013 1907 814 -1052 -1169 178 460
2868 460 -251 263 394 -683 -745 -784 282 -354 166 -3 1141 345 865 2982 3578 2431 2135 1400 809
2849 809 1369 2298 1700 1520 1167 1548 629 459 -510 -1876 -2772 -2419 -1746 -1262 687 1680 774 407 2080
$$ packed form
2976b397o35l32L76K80Q46R81n69k20j080o06q3L78K401K536J218J281n91k387
2958A397k791q79J414K234k29o39k42R5p26J200J852L06l38k086n1J979p5k456
2940c5J407M02L12j3q49q49j603P20J837n59j075n81P50K073m38k243m86l96K93
2921a333N69N51l92J12L23k53LK50j730j081K082J596M03k39Q50J119m76q30J06
2902A630j657j222Q64j290j20J207k58j138J577Q57j26Q6J003M96P9n03j364j730
2884a609j335J085J445J171r83j375J023N24n12J579Q94j093j866j17J347K82
2868D60p11N14J31j077o2l9J066o36N20j69J144p96N20K117N96j147k96p35n91
2849H09N60R29n98j80l53L81r19j70r69j366q96L53O73M84J949R93r06l67J673
$$ plain form
2830 2080 2837 2031 517 863 215 -294 509 -660 -188 429 904 565 688 2292 2439 1518 1259 14
2812 14 -144 -517 -2188 -1942 -637 283 1722 2613 1793 1454 3291 2733 2184 244 -372 -37 -191 -1198
2794 -1198 -1017 887 1683 25 -1435 -1585 -1584 212 1118 1795 3373 1061 -506 -1979 -1996 -289 386 -800
2776 -800 -894 850 1019 -433 -88 -29 667 355 -165 -169 -412 540 778 853 414 -207 -202 -989 -445 18 -434 -340
2754 -340 -247 -1494 -2021 -1180 -1515 -1334 -457 -917 190 1644 1108 1461 2361 3377 3713 839 -1205 -973
2736 -973 -1309 -1665 -565 1426 2158 1233 1473 224 489 -622 -448 -258 611 426 492 1097 867 475 316
2717 316 1273 2426 3305 1260 -1692 -2486 -2417 -2306 -2159 -985 -852 -1493 -1730 -2166 -2781 -2478 -1683 -602 665
2698 665 -778 -1065 -1221 -924 -1185 -2774 -2775 -2855 -1257 -24 50 -667 -1388 -1798 -176 1446 1389 2370 2927 2255
$$ packed form
2830B080P57q06j514L46o48n09Q03j169M72O17M75l39J23J604J47r21k59j245
2812A4j58l73j671K46J305R20J439Q91q20l39J837n58n49j940o16L35j54j007
2794a198J81J904P96j658j460j50JJ796R06O77J578k312j567j473j7J707O75j186
2776h00r4J744J69j452L45N9O96l12n20mk43R52K38P5m39o21Np87N44M63m52R4
2754c40R3j247n27Q41l35J81Q77m60J107J454n36L53R00J016L36k874k044K32
2736i73l36l56J100J991P32r25K40j249K65j111J74J90Q69j85O6O05k30l92j59
2717C16R57J153Q79k045k952p94O9J11J47J174J33o41k37m36o15L03P95J081J267
2698F65j443k87j56K97k61j589jq0J598J233P4p17p21m10J622J622n7R81N57o72
$$ plain form
2678 2255 2421 2852 2758 2629 1623 1223 2734 2846 1893 -93 -522 1465 3170 2850 2055 -57 -901 398
2660 398 1776 445 337 258 -214 -1082 -1100 -1408 113 1396 2170 1703 1701 2877 2147 663 315 1365 517
2641 517 -637 52 984 1049 1212 2218 1132 -346 0 921 2571 2045 1495 2661 1194 -1398 -1744 -238
2623 -238 -522 -1957 -2423 -2642 -878 -110 -15 -360 -821 -937 130 1679 1506 1672 2413 1361 -964 -1603
2605 -1603 -830 -937 -1651 -1859 -1696 898 3241 3421 1916 796 -573 -1084 -83 -601 -848 -655 -2082
2588 -2082 -2015 61 826 1027 2120 1410 859 729 -421 -783 844 105 1024 1516 255 -219 -30 238
2570 238 538 -383 -2470 -2533 347 1767 1851 859 1018 673 -390 207 -875 -183 591 201 -93 -736 -709
2551 -709 -1424 309 2532 2926 2841 2890 3463 1660 -1073 -951 303 858 1344 -521 -1406 -1271 -2528 -1676
$$ packed form
2678B255J66M31r4j29j006m00J511J12r53j986m29J987J705l20p95k112q44J299
2660C98J378j331j08p9m72q68j8l08J521J283P74m67kJ176p30j484l48J050q48
2641E17j154O89R32O5J63J006j086j478L46R21J650n26n50J166j467k592l46J506
2623b38k84j435m66k19J764P68R5l45m61j16J067J549j73J66P41j052k325o39
2605a603P73j07p14k08J63K594K343J80j505j120j369n11J001n18k47J93j427
2588b082O7K076P65K01J093p10n51j30j150l62J627p39R19M92j261m74J89K68
2570B38L00r21k087o3K880J420Q4r92J59l45j063N97j082O92P74l90k94o43K7
2551g09p15J733K223L94q5M9N73j803k733J22J254N55M86j865q85J35j257Q52
$$ plain form
2533 -1676 -279 796 1096 1774 829 99 -2010 -4548 -2892 -1473 -1095 -1875 -874 1240 1414 1184 1313
2516 1313 727 2109 2566 1212 170 382 635 -763 -943 -1292 -2332 -2040 -1959 -2509 -2112 -1873 -1395 -1218
2498 -1218 -320 40 258 -1131 -1274 -139 1035 1069 -178 422 -322 -96 1269 1244 740 1364 1970 3473
2480 3473 3959 4499 3037 2401 1932 1498 -387 454 1256 1670 672 -40 1359 778 615 1176 713 1216 2042
2461 2042 1251 -445 -785 -566 -757 78 1154 984 194 354 532 507 -145 896 1745 195 1285 2691
2443 2691 3254 2325 3476 4049 1333 -686 -463 297 1359 1184 1104 1173 530 1788 2771 1802 2552 1152
2425 1152 781 1645 952 560 -205 -117 1107 1135 336 -137 -165 -296 -2599 -3170 -2803 -1635 -1983 -1732 -366
2406 -366 322 562 2272 2495 2907 3523 3160 2085 583 239 -658 -872 -1266 -1177 -533 955 574 -466 -1473
$$ packed form
2533a676J397J075L00O78r45p30k109k538J656J419L78p80J001K114J74k30J29
2516A313n86J382M57j354j042K12K53j398j80l49j040K92Q1n50L97K39M78J77
2498a218Q98L60K18j389j43J135J174L4j247O00p44K26J365k5n04O24O06J503
2480C473M86N40j462o36m69m34j885Q41Q02M14r98p12J399n81j63N61m63N03Q26
2461B042p91j696l40K19j91Q35J076j70p90J60J78k5o52J041Q49j550J090J406
2443B691N63r29J151N73k716k019K23P60J062j75q0O9o43J258R83r69P50j400
2425A152l71Q64o93l92p65Q8J224K8p99m73k8j31k303n71L67J168l48K51J366
2406c66O88K40J710K23M12O16l63j075j502l44q97k14l94Q9O44J488l81j040j007
$$ plain form
2387 -1473 -565 269 283 369 522 1000 1652 977 652 23 946 1806 1654 1132 -297 -640 -420 -428 -34 -1164
2367 -1164 -2083 -204 -18 1904 1817 908 2836 3128 1151 65 -1606 -1795 844 1329 331 -373 709
2350 709 925 145 -188 -1583 -2740 -1169 -686 -2092 -1429 1874 1728 2521 2005 3301 2439 2173 3122 3465
2332 3465 1758 782 666 630 1416 2722 1919 1866 2055 319 323 923 773 564 -117 377 1359 9 -1908
2313 -1908 -2785 -1868 -1060 -982 -255 493 96 -1040 -652 -1646 -1896 -1323 -1438 749 1156 0 -1783 -3096
2295 -3096 -1578 -312 -479 955 1331 998 -1188 -2120 -525 -462 -1249 591 1892 1341 2335 3335 2987
2278 2987 2067 591 180 -1479 -1384 -533 -872 99 619 -1685 -3048 -2185 -639 1327 2796 2993 3116 2224
2260 2224 1838 145 -362 -444 -1587 -2228 -2235 -3462 -1369 561 1854 1670 1978 843 68 865 1177 917
$$ packed form
2387a473R08Q34J4Q6J53M78O52o75l25o29R23Q60j52n22j429l43K20qL94j130
2367a164r19J879J86J922q7r09J928K92j977j086j671j89K639M85r98p04J082
2350G09K16p80l33j395j157J571M83j406O63L303j46P93n16J296q62k66R49L43
2332C465j707r76j16l6P86J306q03n3J89j736MO00j50k09o81M94R82j350j917
2313a908q77R17Q08P8P27P48l97j136L88r94k50N73j15K187M07j156j783j313
2295c096J518J266j67J434L76l33k186r32J595O3p87J840J301n51R94J000l48
2278B987r20j476m11j659R5Q51l39R71N20k304j363Q63J546J966J469J97J23q92
2260B224l86j693n07q2j143o41pj227K093J930J293j84L08j135p75P97L12k60
$$ plain form
2242 917 899 1934 177 -931 -451 2201 3872 3310 920 -349 -1225 -2391 -2590 -2471 -2496 -3296 -3973 -3368
2224 -3368 -3530 -3530 -2050 -523 227 -318 -730 -850 153 628 1081 -20 649 1032 1072 974 -399 -58 614
2205 614 -60 -1533 -1635 -1139 -150 -307 -671 -1424 -336 1868 2431 1165 520 240 -65 -374 -914 -405 -859
2186 -859 978 2377 2263 1398 516 184 801 368 -127 896 1640 1488 699 559 242 -31 -86 -259 304
2167 304 1134 1432 2473 2546 1740 951 1527 464 -869 -770 -1176 -352 -300 202 -185 794 2849 2424 1269
2148 1269 2319 1644 316 -775 -401 108 1166 2026 181 533 911 1309 1779 2130 2651 3142 2039 2476
2130 2476 3486 3224 2034 2776 3194 2708 1820 874 235 289 972 2247 695 92 607 1204 1322 436 -1245
2111 -1245 -2440 -1285 451 1240 -43 -744 1782 2432 1357 329 207 -1324 -2642 -3300 -1267 270
$$ packed form
2242I17j8J035j757j108M80K652J671n62k390j269q76j166j99J19k5q00o77O05
2224c368j62%J480J527P50n45m12j20J003M75M53j101O69L83M0r8j373L41O72
2205F14o74j473j02M96R89j57l64p53J088K204N63j266o45k80l05l09n40N09m54
2186h59J837J399j14q65q82l32O17m33m95J023P44j52p89j40l17k73n5j73N63
2167C04Q30K98J041P3q06p89N76j063j333R9m06Q24N2N02l87R79K055m25j155
2148A269J050o75j328j091L74N09J058Q60j845L52L78L98M70L51N21M91j103M37
2130B476J010k62j190P42M18m86q88r46o39N4O83J275j552o03N15N97J18q86j681
2111a245j195J155J736P89j283p01K526O50j075j028j22j531j318o58K033J537
$$ plain form
2095 270 548 243 -2397 -2739 -2165 69 562 317 461 1975 1192 558 366 -1313 -730 559 2354 2813
2077 2813 2679 2357 1788 437 -82 557 1523 2312 1990 712 319 643 1089 1992 1835 1420 1440 713 106
2058 106 158 224 285 -1173 -1822 -1706 -2270 -1989 -940 -1417 538 -896 -771 -704 1204 665 -258 -859 -1129 -2104
2038 -2104 -921 -1013 -1459 -707 -710 524 317 -968 -462 -377 -1215 -1641 -1519 -945 -142 231 769 452 509 161
2018 161 -461 -175 120 966 1113 2600 3001 1907 2246 2902 2754 2827 2684 2726 2423 1832 362 1348 40
1999 40 644 1786 1127 882 -1058 -1664 39 155 -720 -634 -1244 -1359 28 889 169 117 -252 -62 305 -212
1979 -212 -769 -1636 -2449 -2394 -789 753 2022 2326 3030 2657 3047 3738 1765 533 1988 2233 172 277
1961 277 93 -507 -968 -246 731 1359 2013 2107 1085 1210 1377 1395 1457 -95 -2732 -2885 -1727 -561 -212
$$ packed form
2095B70K78l05k640l42N74K234M93k45J44J514p83o34j92j679N83J289J795M59
2077B813j34l22n69j351n19O39R66P89l22j278l93L24M46R03j57m15K0p27o07
2058A06N2O6O1j458o49J16n64K81J049m77J955j434J25O7J908n39r23o01k70r75
2038b104J183r2m46P52lJ234k07j285N06Q5q38m26J22N74Q03L73N38l17N7l48
2018A61o22K86K95Q46J47J487M01j094L39O56j48P3j43M2l03n91j470R86j308
1999D0O04J142o59k45j940o06J703J16q75Q6o10j15J387Q61p20n2l69J90L67n17
1979b12n57q67q13N5J605J542J269L04P04l73L90O91j973j232J455K45k061J05
1961B77j84o00m61P22R77O28O54R4j022J25J67J8O2j552k637j53J158J166L49
$$ plain form
1942 -212 -839 -599 572 112 -935 -518 -1165 249 -111 -1162 -1319 -368 -225 -371 -842 -1071 -225 582 1036
1923 1036 535 414 1577 1342 542 690 659 560 662 34 1219 2872 3910 4950 4320 2968 2339 980
1905 980 2155 2449 2783 2463 2382 1806 557 2752 5105 3570 1589 732 223 -411 -477 -1120 -434 852
1887 852 1678 954 -401 -493 -704 -881 -610 -308 98 1089 2065 960 246 427 1742 649 -72 -1633 -1491
1868 -1491 -414 -1145 -2861 -2557 -931 -1167 -1084 461 2062 2790 1812 3250 3244 3268 1883 2065 2901 2904 1315
1849 1315 9 -175 1391 1181 582 628 400 708 202 -44 -326 536 468 73 325 1968 1938 734 823 936
1829 936 3732 2922 200 -451 -526 -409 138 1720 2342 2560 1930 1971 1894 1013 -828 -763 -194 -260 2089 1549
1809 1549 87 -344 1624 1030 1007 1946 1472 1608 2417 -194 -1525 -731 -809 -292 425 1672 2116 1805 357
$$ packed form
1942b12o27K40J171m60j047M17o47J414l60j051j57R51J43j46m71k29Q46Q07M54
1923A036n01j21J163k35q00J48l1r9J02o28J185J653J038J040o30j352o29j359
1905I80J175K94L34l20q1n76j249K195K353j535j981q57n09o34o6o43O86J286
1887H52Q26p24j355r2k11j77K71L02M06R91R76j105p14J81J315j093p21j561J42
1868a491J077p31j716L04J626k36Q3J545J601P28r78J438oK4j385J82Q36Lj589
1849A315j306j84J566k10n99M6k28L08n06k46k82Q62o8l95K52J643l0j204Q9J13
1829I36K796q10k722o51p5J17N47J582O22K18o30M1p7q81j841O5N69o6K349n40
1809A549j462m31J968n94k3R39m74J36Q09k611j331P94p8N17P17J247M44l11j448
$$ plain form
1790 357 391 1746 2068 908 -1421 -685 2067 1507 951 2111 1755 1527 1917 2927 1723 -731 -1622 -1141
1772 -1141 -1757 -1351 -38 563 -1399 -1905 -647 416 37 630 1392 1192 2549 2381 934 -540 -638 877
1754 877 308 -516 -452 -639 505 891 476 767 1704 573 -324 -642 -151 -255 -155 753 993 802 1380 2816
1734 2816 3814 4062 3906 1802 81 -161 606 586 -133 192 1449 2054 1326 800 326 933 1195 1207 1876
1715 1876 2060 -1321 -1935 -1780 -1328 506 548 -206 -1197 366 1659 538 -11 1347 1688 1045 170 1011
1697 1011 722 -760 -1418 -1237 -2842 -2801 -1380 85 -378 -832 314 24 874 2320 2317 2235 1874 1346 -262
1678 -262 -1327 -2913 -2984 -1742 -1408 -1048 -975 -1928 -2683 -2715 -2527 -2334 -1260 -1696 -371 140 -773 -1243 -845
1659 -845 -66 2059 1657 1465 2577 1716 1764 2000 1440 754 1651 1854 831 6 96 1011 772 -449 -357 -723
$$ packed form
1790C57L4J355L22j160k329P36K752n60n56J160l56k28L90J010j204k454q91M81
1772a141o16M06J313O01j962n06J258J063l79N93P62k00J357j68j447j474r8J515
1754H77n69q24O4j87J144L86m15K91R37j131q97l18M91j04J00R08K40j91N78J436
1734B816R98K48j56k104j721k42P67k0p19L25J257O05p28n26m74O07K62J2O69
1715A876J84l381o14J55M52J834M2p54r91J563J293j121n49J358L41o43q75Q41
1697A011k89j482o58J81j605M1J421J465m63m54J146k90Q50J446lq2l61n28j608
1678b62j065j586p1J242L34L60P3r53p55l2J88J93J074m36J325N11r13m70L98
1659h45P79K125m02j92J112q61M8K36n60o86Q97K03j023q25R0R15k39j221R2l66
$$ plain form
1639 -723 -987 -307 1821 612 -1082 -1630 -329 884 2329 3302 814 -442 62 137 811 1798 2922
1622 2922 2400 1670 1148 2569 1796 880 444 118 412 -119 -701 264 -449 -1376 294 25 411 1799 1739
1603 1739 -1505 -2651 -2962 -2953 -1483 -7 2511 3613 2420 1468 281 493 -1254 -1488 -1439 -1272 -2470
1586 -2470 -2725 -3894 -4198 -2067 -801 -1461 -1095 -157 911 -886 -2227 -1155 -1365 -925 -712 -2667 -2855
1569 -2855 498 2987 3533 2141 2151 2743 2462 2463 853 -554 -145 -820 -341 395 -362 -461 -415 -1480 -218
1550 -218 2219 2382 1418 -1480 -847 826 1378 1729 1563 -303 -568 -343 923 1278 2177 2012 1822 2257
1532 2257 1857 839 890 689 1285 1457 -343 -1282 -1648 -286 1688 1114 448 562 1225 1645 1407 315
1514 315 -1046 -1228 397 1188 1707 2236 1915 2197 1568 159 -573 187 317 -452 -1054 -1921 -1027 890 1133
$$ packed form
1639g23k64O80K128j209j694n48J301J213J445R73k488j256N04P5O74R87J124
1622B922n22p30n22J421p73r16m36l26K94n31n82R65p13r27J670k69L86J388o0
1603A739l244j146l11RJ470J476K518J102j193r52j187K12j747k34M9J67j198
1586b470k55j169l04K131J266o60L66R38J068j797j341J072k10M40K13j955j88
1569b855L353K489N46j392J0N92k81Jj610j407M09o75M79P36p57r9M6j065J262
1550b18K437J63r64k898O33J673N52L51j66j866k65K25J266L55Q99j65j90M35
1532B257m00j018N1k01N96J72j800r39l66J362J974n74o66J14O63M20k38j092
1514C15j361j82J625P91N19N29l21K82o29j409p32P60J30p69o02q67Q94J917K43
$$ plain form
1495 1133 552 54 481 -213 -436 -513 447 920 1163 2755 2264 96 -1197 -2969 -3662 -3296 -4546 -3626
1477 -3626 -1384 -706 630 1746 1839 2321 3481 3824 2368 762 -961 -842 965 708 -1205 -1378 768
1460 768 2393 245 -487 -274 -1483 -749 -513 -1079 -1154 -828 573 479 902 -371 -1656 -780 -690 529 1167
1441 1167 707 350 17 -504 -815 -1141 -711 -489 -1821 -568 -86 -412 41 1061 1077 1040 1150 1209 828 692
1421 692 273 343 147 -344 -373 -454 944 1486 1419 163 364 156 467 1503 957 1770 2335 1392 1112 714
1401 714 157 -270 791 1652 1857 1554 1035 -279 -1915 -1564 1392 2313 1833 337 309 3 968 1197 623
1382 623 -421 -392 -1121 -1931 -2145 -2213 -2437 -838 979 842 -1178 -1082 287 640 215 -981 -573 224 -168
1363 -168 67 482 422 997 2182 1281 1327 3588 2678 623 480 43 101 1471 1647 965 -1177 -2767 -1412
$$ packed form
1495A133n81m98M27o94k23p7R60M73K43J592m91k168j293j772o93L66j250R20
1477c626K242O78J336J116R3M82J160L43j456j606j723J19J807k57j913j73K146
1460G68J625k148p32K13j209P34K36n66p5L26J401r4M23j273j285Q76R0J219O38
1441A167m60l57l33n21l11l26M30K22j332J253M82l26M53J020J6l7J10N9l81j36
1421F92m19P0j96m91k9q1J398N42o7j256K01k08L11J036n46Q13N65r43k80l98
1401G14n57m27J061Q61K05l03n19j314j636L51K956R21m80j496k8l06R65K29n74
1382F23j044K9p29q10k14o8k24J599J817j37k020R6J369L53m25j196M08P97l92
1363a68K35M15o0N75J185r01M6K261r10k055j43m37N8J370J76o82k142j590J355
$$ plain form
1344 -1412 -47 1077 1678 1210 -888 -1854 -1723 -2756 -4217 -1456 189 907 61 1147 723 -355 -656
1327 -656 -507 -975 -294 32 719 1082 1724 2154 -457 -891 -782 31 839 2792 2297 1610 2039 1194 5
1308 5 -86 1330 1546 2088 1971 1032 -352 -1528 -968 570 605 1298 2293 2216 1621 2454 2410 2314 1880 1695 1247
1287 1247 -66 547 1021 -317 -410 613 882 2354 1674 1889 1499 1489 1238 1469 954 1067 1526 1278 1974
1268 1974 1766 1825 1403 1928 4073 2874 776 206 920 2678 2971 3085 3825 3479 3131 2739 2047 235
1250 235 -694 -1522 -2146 -1215 -152 1352 1231 -891 -1352 280 -306 -943 -988 -2535 -3936 -3347 -1141 -491
1232 -491 -227 50 -804 -1120 -1650 -1331 -196 -986 -1516 64 785 329 -1160 -775 -846 -217 622 -407 913
1213 913 1283 761 719 991 1062 2045 975 -163 -1507 -352 -398 -1896 -2919 -2265 -3015 -1952 -1201 181
$$ packed form
1344a412J365J124O01m68k098r66J31j033j461K761J645P18q46J086m24j078l01
1327f56J49m68O81L26O87L63O42M30k611m34J09Q13Q08J953m95o87M29q45j189
1308Er1J416K16N42j17r39j384j176N60J538L5O93R95p7n95Q33m4r6m34j85m48
1287A247j313O13M74j338r3J023K69J472o80K15l90j0k51K31n15J13M59k48O96
1268A974k08N9m22N25K145j199k098n70P14J758K93J14P40l46l48l92o92j812
1250B35r29q28o24R31J063J504j21k122m61J632n86o37m5j547j401N89K206O50
1232d91K64K77q54l16n30L19J135p90n30J580P21m56j489L85p1O29Q39j029J320
1213I13L70n22m2K72P1R83j070j138j344J155m6j498j023O54p50J063P51J382
$$ plain form
1195 181 -235 -1910 -2766 -3612 -1797 963 675 193 -1005 -1211 -979 -440 -607 -1984 -3458 -2184 -230
1178 -230 191 575 391 -392 749 787 1182 1311 1769 809 736 -614 -1369 149 431 -630 32 167 -210
1159 -210 -43 1801 734 -45 1447 393 940 2537 4410 4036 2142 1031 -196 -1519 -1200 -582 110
1142 110 129 -1108 -2008 -2749 -1335 60 1794 1768 297 -709 -970 171 534 276 310 581 208 884 1879
1123 1879 932 163 -390 -1149 71 2275 2354 386 -1587 -75 1342 272 -387 -253 -765 -2440 -878
1106 -878 -980 -589 1223 2461 186 -2053 -2064 -2076 -1415 -1135 -19 910 1523 991 -757 -622 -893 -890 545
1087 545 1046 606 1332 -136 -404 -348 -367 1582 2387 177 391 412 -739 -1413 -230 24 -930 -917 -1396 197
1067 197 178 -274 85 -1078 -368 -938 -1404 -2042 -3100 -2477 -2086 -1667 -1898 -1678 -2157 -2703 -2975 -3375 -1212
$$ packed form
1195A81m16j675q56q46J815K760k88m82j198k06K32N39j67j377j474J274J954
1178b30M21L84j84p83J141L8L95J29M58r60p3j350p55J518K82j061O62J35l77
1159b10J67J844j067p79J492j054N47J597J873l74j894j111j227j323L19O18O92
1142A10J9j237r00p41J414J395J734k6j471j006k61J141L63k58L4K71l73O76R95
1123A879r47p69n53p59J220K204P9j968j973J512J417j070o59J34n12j675J562
1106h78j02L91J812J238k275k239j1j2O61K80J116R29O13n32j748J35k71LJ435
1087E45N01m40P26j468k68N6j9J949Q05k210K14K1j151o74J183K54r54J3m79J593
1067A97j9m52L59j163P10n70m66o38j058O23L91M19k31K20m79n46k72m00K163
$$ plain form
1048 -1212 -147 -139 -391 -649 924 1539 722 1010 1504 2823 3039 3257 4145 4103 2371 2013 2468 2828 2164
1029 2164 663 -544 -763 514 329 -2340 -2225 -230 1105 1372 1491 575 -90 616 46 -880 -1528 -215
1011 -215 547 35 -636 -885 -690 -1625 -2207 -1236 136 1441 2167 717 593 1470 543 -909 -1539 -1332 -143
992 -143 509 244 -390 814 1189 2864 3660 3710 1888 1457 625 -309 -359 848 859 559 -1058 -2002 -393
973 -393 22 -60 648 592 -172 556 1169 562 461 -698 -1747 -496 98 985 2052 1550 619 827 207 -377
953 -377 223 574 75 -1279 -143 -911 474 857 -34 -2 356 1429 -274 -1801 -1156 -362 -1083 -2597
935 -2597 -2157 -1484 -713 -982 -22 1544 -99 327 200 35 222 -218 -132 -1264 -2198 -3136 -2769 -3663 -3665 -2655
915 -2655 -2043 -1044 -1179 -881 -349 -1668 -3016 -2057 -1461 -1731 -2122 -933 2389 2940 3069 2318 419 -607
$$ packed form
1048a212J065Qk52k58J573O15q17K88M94J319K16K18Q88m2j732l58M55L60o64
1029B164j501j207k19J277j85k669J15J995J335K67J19r16o65P06n70r26o48J313
1011b15P62n12o71k49J95r35n82R71J372J305P26j450j24Q77r27j452o30K07J189
992a43O52k65o34J204L75J675P96N0j822m31q32r34n0J207J1l00j617r44J609
973c93M15q2P08n6p64P28O13o07j01j159j049J251N94Q87J067n02r31K08o20n84
953c77O00L51m99j354J136p68J385L83q91L2L58J073j703j527O45P94p21j514
935b597M40O73P71k69R60J566j643M26j27j65J87m40Q6j132r34r38L67q94kJ010
915b655O12R99j35K98N32j319j348R59N96k70l91J189L322N51J29p51j899j026
$$ plain form
897 -607 1397 4314 3284 566 -579 -1117 -1053 -650 207 1036 633 1079 1242 2300 3200 3401 1200 265
879 265 111 1057 2209 2832 1474 325 402 1420 1519 1817 2086 2378 2067 739 -988 -1447 -1528 -1049 -2166
860 -2166 -1935 -701 -750 -471 578 92 -649 630 249 -860 -1724 -1953 -1110 -12 542 -60 -1133 -1048 -541
841 -541 717 1204 460 -239 -414 478 233 -572 -976 -852 -1210 -1193 -547 -150 -507 -1267 -1154 -569 101 324
821 324 137 -794 -231 686 -222 -1426 -1462 -754 507 1261 2243 1091 693 1305 1530 1580 1011 2165 2530 577
801 577 -744 -917 -2468 -1858 -1296 -1172 -200 -1181 -156 -451 -834 -1319 -838 66 -1608 -2794 -3234 -2826 -1718
782 -1718 -1033 -38 1458 -268 697 1852 1852 738 759 1354 -671 -1704 -83 989 1098 2883 2534 2971
764 2971 2527 771 61 2207 3981 3140 1221 -1580 -2321 -1408 -584 39 917 1081 2540 2149 1645 1684
$$ packed form
897f07K004K917j030k718j145n38O4M03Q57Q29m03M46J63J058R00K01k201r35
879B65j54R46J152O23j358j149P7J018R9K98K69K92l11j328j727m59q1M79j117
860b166K31J234m9K79J049m86p41J279l81j109q64k29Q43J098N54o02j073Q5N07
841e41J258M87p44o99j75Q92k45q05m04J24l58J7O46L97l57p60J13N85O70K23
821C24j87r31N63R17r08j204l6P08J261P54R82j152l98O12K25N0n69J154L65j953
801E77j321j73j551O10N62J24R72r81J025k95l83m85M81R04j674j186m40M08J108
782a718O85R95J496j726R65J155%j114K1N95k025j033J621J072J09J785l49M37
764B971m44j756p10K146J774q41j919k801p41R13Q24O23Q78J64J459l91n04L9
$$ plain form
746 1684 2289 987 -154 -1450 -752 -794 -403 142 2042 2055 842 -965 -1560 -1159 132 2069 -4 -80
728 -80 -824 -1347 -1866 -40 -265 2 1091 979 69 193 -1409 -2977 -2629 -312 1446 1464 2071 1873 1368
709 1368 2341 1959 634 715 1509 -310 -42 2434 1354 -674 -1033 -670 -881 -1850 -2530 -1991 239 2146
691 2146 1723 1784 1085 368 -427 -1930 -1775 -117 506 1678 1521 1128 228 -381 -515 -580 -22 -2061 -3356
672 -3356 -2507 -330 199 -1698 -1663 -615 301 621 920 1148 1351 115 -523 405 748 329 -129 -125 -1747
$$ packed form
746A684O05j302j141j296O98m2L91N45J900J3j213j807n95M01J291J937k073p6
728h0p44n23n19J826k25K67J089j12r10J24j602j568L48K317J758J8O07j98n05
709A368R73l82j325Q1P94j819K68K476j080k028l59L63k11r69o80N39K230J907
691B146m23O1o99p17p95j503J55J658O23J172j57l93r00o09j34o5N58k039j295
672c356Q49K177N29j897L5J048R16L20K99K28K03j236o38R28L43m19m58Mj622
$$ [...]
##END NTUPLES=NMR SPECTRUM
##END=
