##TITLE=Analysis number 325820
Compound Code sb 01117
Project Code adrs
Chemist Name stores
##JCAMPDX= 6.0         $$ Bruker NMR JCAMP-DX V2.0
##DATA TYPE= NMR SPECTRUM
##DATA CLASS= NTUPLES
##ORIGIN= Bruker BioSpin GmbH
##OWNER= nmr
$$ XWIN-NMR		Version 3.5
$$ Mon Jan 15 15:58:32 2007 GMT Standard Time (UT+0h)  MAYBRIDGE\nmr@NMR_250MHZ
##.OBSERVE FREQUENCY= 250.131544655141
##.OBSERVE NUCLEUS= ^1H
##.ACQUISITION MODE= SIMULTANEOUS (DQD)
##.ACQUISITION SCHEME= undefined
##.AVERAGES= 16
##.DIGITISER RES= 18
##SPECTROMETER/DATA SYSTEM= dpx250
##.PULSE SEQUENCE= zg30
##.SOLVENT NAME= CDCl3
##.SHIFT REFERENCE= (INTERNAL, CDCl3, 0, 16.522)
##AUDIT TRAIL= $$ (NUMBER, WHEN, WHO, WHERE, WHAT)
$$ ##TITLE= Audit trail, XWIN-NMR		Version 3.5
$$ ##JCAMPDX= 5.01
$$ ##ORIGIN= Bruker BioSpin GmbH
$$ ##OWNER= nmr
$$ C:\u/data/dgb/nmr/ADRS/1140/pdata/1/auditp.txt
$$ ##AUDIT TRAIL=  $$ (NUMBER, WHEN, WHO, WHERE, WHAT)
(   1,<2007-01-15 15:58:12.61 +000>,<MAYBRIDGE\nmr>,<NMR_250MHZ>,
      <created by zg, POWCHK disabled, PULCHK disabled
       configuration hash MD5:
       49 4B E0 1D 92 C2 6B 37 9F E6 65 BC 52 41 86 1D
       data hash MD5: 64K
       E6 AB 55 DC CE 18 7B 7E B6 D3 A0 DA 4D E2 22 9F>)
(   2,<2007-01-15 15:58:23.48 +000>,<MAYBRIDGE\nmr>,<NMR_250MHZ>,
      <Start of raw data processing
       ef LB = 0.3 FT_mod = 6 PKNL = 1 SI = 32K 
       data hash MD5: 32K
       D6 FB 17 34 6D E8 1D D9 C5 7D DD D1 0E 17 57 49>)
(   3,<2007-01-15 15:58:25.12 +000>,<MAYBRIDGE\nmr>,<NMR_250MHZ>,
      <apk 
       data hash MD5: 32K
       69 46 FF A0 7D 45 C4 B8 29 14 F4 42 E2 38 3F E4>)
(   4,<2007-01-15 15:58:25.79 +000>,<MAYBRIDGE\nmr>,<NMR_250MHZ>,
      <abs ABSG = 5 
       data hash MD5: 32K
       98 6D 2E 31 44 C0 F3 83 8F 3B B0 C1 CB 6B 5B F6>)
$$ ##END=
$$ 
$$ hash MD5
$$ EE 6C 19 7F 78 72 C0 7E 34 AB B5 FB 5E DC 6A AA
##$RELAX= 
##$RELAX= 
##$RELAX= 
##$RELAX= 
##$RELAX= 
##$RELAX= 
##$RELAX= 
$$ Bruker specific parameters
$$ --------------------------
##$DU= <C:\u>
##$EXPNO= 1140
##$NAME= <ADRS>
##$PROCNO= 1
##$TYPE= <nmr>
##$USER= <dgb>
##$AMP= (0..31)
100 100 100 100 100 100 100 100 100 100 100 100 100 100 100 100 100 100 
100 100 100 100 100 100 100 100 100 100 100 100 100 100 
##$AQSEQ= 0
##$AQ_mod= 3
##$AUNM= <au_zg>
##$AUTOPOS= <44 >
##$BF1= 250.13
##$BF2= 250.13
##$BF3= 250.13
##$BF4= 250.13
##$BF5= 500.13
##$BF6= 500.13
##$BF7= 500.13
##$BF8= 500.13
##$BYTORDA= 1
##$CFDGTYP= 0
##$CFRGTYP= 5
##$CHEMSTR= <none>
##$CNST= (0..31)
1 1 145 1 1 1 1 1 1 1 1 1 1 1 1 1 1 1 1 1 1 1 1 1 1 1 1 1 1 1 1 1 
##$CPDPRG= <>
##$CPDPRG1= <>
##$CPDPRG2= <>
##$CPDPRG3= <>
##$CPDPRG4= <mlev>
##$CPDPRG5= <mlev>
##$CPDPRG6= <mlev>
##$CPDPRG7= <mlev>
##$CPDPRG8= <mlev>
##$CPDPRGB= <>
##$CPDPRGT= <>
##$D= (0..31)
0 1 0 0 0 0 0 0 0 0.06 0 0 0 0 0 0 0.0002 0 0 0 0 0 0 0 0 0 0 0 0 0 0 
0 
##$DATE= 1168876691
##$DBL= (0..7)
120 120 120 120 120 120 120 120 
##$DBP= (0..7)
150 150 150 150 150 150 150 150 
##$DBP07= 0
##$DBPNAM0= <>
##$DBPNAM1= <>
##$DBPNAM2= <>
$$ [...]
##$SUBNAM7= <"">
##$SUBNAM8= <"">
##$SUBNAM9= <"">
##$SW= 20.6930455092707
##$SWIBOX= (0..15)
0 0 3 0 0 0 0 0 0 0 0 0 0 0 0 0 
##$SW_h= 5175.983436853
##$TD= 65536
##$TD0= 1
##$TE= 294.16
##$TE2= 300
##$TE3= 300
##$TEG= 300
##$TL= (0..7)
0 120 120 120 120 120 120 120 
##$TP= (0..7)
150 150 150 150 150 150 150 150 
##$TP07= 0
##$TPNAME0= <>
##$TPNAME1= <>
##$TPNAME2= <>
##$TPNAME3= <>
##$TPNAME4= <>
##$TPNAME5= <>
##$TPNAME6= <>
##$TPNAME7= <>
##$TPOAL= (0..7)
0.5 0.5 0.5 0.5 0.5 0.5 0.5 0.5 
##$TPOFFS= (0..7)
0 0 0 0 0 0 0 0 
##$TUNHIN= 0
##$TUNHOUT= 0
##$TUNXOUT= 0
##$USERA1= <user>
##$USERA2= <user>
##$USERA3= <user>
##$USERA4= <user>
##$USERA5= <user>
##$V9= 5
##$VALIST= <valist>
##$VCLIST= <CCCCCCCCCCCCCCC>
##$VD= 0
##$VDLIST= <DDDDDDDDDDDDDDD>
##$VPLIST= <PPPPPPPPPPPPPPP>
##$VTLIST= <TTTTTTTTTTTTTTT>
##$WBST= 1024
##$WBSW= 4
##$XGAIN= (0..3)
0 0 0 0 
##$XL= 0
##$YL= 0
##$YMAX_a= 207272
##$YMIN_a= -278436
##$ZGOPTNS= <>
##$ZL1= 120
##$ZL2= 120
##$ZL3= 120
##$ZL4= 120
##$ABSF1= 16.522
##$ABSF2= -4.171173
##$ABSG= 5
##$ABSL= 3
##$ALPHA= 0
##$AQORDER= 0
##$ASSFAC= 0
##$ASSFACI= 0
##$ASSFACX= 0
##$ASSWID= 0
##$AUNMP= <proc_1d>
##$AZFE= 0.1
##$AZFW= 0.1
##$BCFW= 0
##$BC_mod= 0
##$BYTORDP= 0
##$COROFFS= 0
##$CY= 12.5
##$DATMOD= 1
##$DC= 0
##$DFILT= <>
##$DTYPP= 0
##$F1P= 14.0000005364418
##$F2P= -0.99999901652339
##$FCOR= 0.5
##$FTSIZE= 32768
##$FT_mod= 6
##$GAMMA= 0
##$GB= 0
##$INTBC= 1
##$INTSCL= 1
##$ISEN= 128
##$LB= 0.3
##$LEV0= 0
##$LPBIN= 0
##$MAXI= 10000
##$MC2= 0
##$MEAN= 0
##$ME_mod= 0
##$MI= 0
##$NCOEF= 0
##$NC_proc= -3
##$NLEV= 6
##$NOISF1= 0
##$NOISF2= 0
##$NSP= 0
##$NTH_PI= 0
##$NZP= 0
##$OFFSET= 16.522
##$PC= 1
##$PHC0= 232.2983
##$PHC1= 11.58453
##$PH_mod= 1
##$PKNL= yes
##$PPARMOD= 0
##$PSCAL= 4
##$PSIGN= 0
##$REVERSE= no
##$SF= 250.13
##$SI= 32768
##$SIGF1= 0
##$SIGF2= 0
##$SINO= 400
##$SIOLD= 32768
##$SREGLST= <1H.CDCl3>
##$SSB= 0
##$STSI= 32768
##$STSR= 0
##$SW_p= 5175.98343685301
##$SYMM= 0
##$S_DEV= 0
##$TDeff= 65536
##$TDoff= 0
##$TI= <Analysis number 999999
Compound Code 99
Book Reference 9
Project Code 9>
##$TILT= no
##$TM1= 0
##$TM2= 0
##$TOPLEV= 0
##$USERP1= <user>
##$USERP2= <user>
##$USERP3= <user>
##$USERP4= <user>
##$USERP5= <user>
##$WDW= 1
##$XDIM= 32768
##$YMAX_p= 422608139
##$YMIN_p= -190451
$$ End of Bruker specific parameters
$$ ---------------------------------
##NTUPLES= NMR SPECTRUM
##VAR_NAME=  FREQUENCY,     SPECTRUM/REAL,   SPECTRUM/IMAG
##SYMBOL=    X,             R,               I
##VAR_TYPE=  INDEPENDENT,   DEPENDENT,       DEPENDENT
##VAR_FORM=  AFFN,          ASDF,            ASDF
##VAR_DIM=   32768,         32768,           32768
##UNITS=     HZ,            ARBITRARY UNITS, ARBITRARY UNITS
##FACTOR=    0.157963299565203, 1,           1
##FIRST=     4132.6476996994, 0,             0
##LAST=      -1043.33573715361, 0,           0
##MIN=       -1043.33573715361, -190451,     0
##MAX=       4132.6476996994, 422608139,     0
$$ Real data points
##PAGE= N=1
##DATA TABLE= (X++(R..R)), XYDATA
$$ [...]
##PAGE= N=2
##DATA TABLE= (X++(I..I)), XYDATA
21255 299346 243979 222486 225709 231208 248849 261626 255593 293501 273052 254822 241909 260426
21243 260426 231229 208889 204420 184596 187872 188246 207048 217391 206798 202817 225713 231085 207437
21230 207437 250481 278876 240482 205710 219835 243599 279010 265667 249434 242320 217379 245432
21218 245432 261858 241177 210548 224685 219656 255475 237770 206659 224534 223897 222391 238932
21206 238932 232754 244399 287881 274687 299216 294620 316116 281358 268073 294803 299013 294038
21194 294038 292526 241320 234384 249747 270491 295136 283353 241625 219778 245361 254495 229885
21182 229885 219499 187132 123385 158515 148576 144557 161643 183965 259132 292427 242888 259578
21170 259578 240241 222480 251792 242458 274871 280299 210413 189447 194240 231512 265186 302118
21158 302118 376725 382838 293477 219471 215339 230690 199278 220119 247768 236751 213292 184161
21146 184161 185762 220202 221401 273595 328692 349012 337739 356486 294360 269336 266300 277041
21134 277041 303094 310415 284502 265616 234243 224436 221878 236126 277636 290084 235498 282421
21122 282421 319661 341274 264141 258293 276537 281514 253063 275096 255701 247601 258027 267989
21110 267989 297091 265202 236189 311706 344160 326775 293967 291773 309155 316248 341263 310430
21098 310430 311707 311933 289172 312010 337049 355662 343534 312279 313824 307178 335534 377152
21086 377152 380166 382957 336543 322903 293822 302157 360353 406621 386776 338406 359219 326409
21074 326409 299555 284912 225363 211857 270590 281470 280317 326326 318842 317388 356999 344427
21062 344427 338579 357055 373855 367909 327415 304006 340812 366269 369576 387731 394228 349681
21050 349681 248202 220079 271254 334055 381086 340867 320126 307659 312888 376640 393594
21039 393594 344686 349623 269577 276475 272759 250357 260704 298783 326953 346429 412259 412893
21027 412893 347114 264045 266174 376218 439648 457449 465881 490444 471965 438641 438222 427565
21015 427565 364029 305862 313859 375481 440053 431297 396265 388561 319580 286029 300920 351844
21003 351844 389328 383897 377510 351165 365896 378829 366336 353220 361443 357972 426712 408862
20991 408862 423628 439953 423409 379700 356342 353566 333333 349711 377402 353978 315843 316907
20979 316907 368178 411333 398621 392442 321496 297579 326828 302725 304989 327018 340071 387698
20967 387698 380094 349844 352005 309386 315473 348177 357705 339830 322178 291799 360161 377771
20955 377771 358597 396419 367794 363990 378513 378848 360502 401881 442234 447606 409850 433313
20943 433313 409194 395206 376935 385695 433741 458214 451099 413193 373208 348667 256335 288766
20931 288766 410628 457281 456814 441227 434563 413458 416603 414437 442167 447888 409826 392227
20919 392227 392623 425949 448882 405840 388826 394514 397938 331925 320219 366246 401838 357881
20907 357881 339098 396501 386397 357379 355346 363426 365034 388083 391727 364575 361760 412177
20895 412177 425679 428343 455446 420551 414497 428867 357424 396759 411164 365531 384938 417904
20883 417904 419375 455982 427860 450575 471633 456524 445598 417581 410590 400842 390949 371300
20871 371300 388090 389330 409953 431773 455800 476141 454098 381662 357106 397647 418977 411427
20859 411427 433575 424942 401533 377262 398039 390988 427792 449601 474809 464496 392436 402444
20847 402444 461162 464340 457968 413455 338753 338779 386537 416033 439963 426810 417646 442249 375694
20834 375694 304366 301460 256025 295689 342030 328443 346926 370971 418304 403366 381867 382773
20822 382773 449075 437764 412855 435038 474371 517911 497763 496313 496257 431492 397652 437336
20810 437336 514523 481412 476236 499526 472297 450216 448888 460273 446938 468600 489373 452185
20798 452185 465013 424482 390036 354093 372151 446419 482786 471698 423720 455389 454026 436079
20786 436079 431518 463776 472641 464504 429281 453693 452548 462833 471733 455433 429353 481527
20774 481527 512435 531353 551662 532819 506716 487755 484342 480809 473731 466593 468496 476281 436287
20761 436287 499794 476714 476823 485190 452847 413497 405625 413448 439511 457231 411216 395028
20749 395028 416177 416028 432382 434024 458658 487585 453178 484399 493429 486604 508615 555612
20737 555612 580333 546920 585203 559620 502002 505625 520481 528877 545143 550903 620038 650032
20725 650032 591540 588246 536802 506105 465555 432001 499032 500493 499732 492740 493455 480465 530773
20712 530773 491455 491563 519224 532221 566247 549510 500942 431784 442459 499006 509953 462089
20700 462089 476243 520644 522312 509468 480896 461937 462310 467796 521197 570426 523603 495364
20688 495364 524576 493634 494663 500223 486927 464108 451053 455891 517463 591623 628943 581720
20676 581720 557820 577878 582291 536280 530016 560267 570934 576654 577298 598022 543652 523568
20664 523568 526138 574890 607068 602974 599489 594169 594506 531454 446610 486442 516808 491973 456103
20651 456103 472972 472233 511293 543574 568318 542267 470385 497409 491648 483415 467044 494643
20639 494643 516335 513090 527019 527716 537460 502541 546476 495802 434110 491281 520321 492624
20627 492624 466501 462595 436919 427589 477851 521960 534657 495946 502168 501658 521583 560910
20615 560910 580551 599625 627378 596266 565581 557273 547687 539897 528348 507325 523918 550432
20603 550432 581293 560000 539694 541590 528237 521130 509127 545111 553302 543689 543464 551993 549419
20590 549419 540911 556681 559460 587321 559882 523373 504892 492737 450971 540344 572071 570532
20578 570532 534188 488750 474586 483186 511362 583540 572826 542967 543065 539863 530204 503621 490857
20565 490857 476547 519943 513832 467308 462015 506988 474102 465738 480431 526038 531056 545926
20553 545926 586368 578694 527967 537567 498185 453316 506692 581453 585861 581171 580154 572744 567606
20540 567606 610338 638291 632364 613037 624750 619208 610892 614031 579271 588408 576078 579309 586284
20527 586284 554900 558191 603809 563358 547813 548313 568121 566461 523038 524302 574676 563742
20515 563742 523566 471484 514237 591985 617080 591670 589240 600847 604628 668981 636473 541014
20503 541014 577336 590014 575904 591369 577679 554498 550650 547920 585528 611567 639134 684345
20491 684345 627064 572031 540587 503377 532246 568349 601031 604094 610693 658981 682272 681526
20479 681526 672572 624885 603090 611632 655545 647825 648995 594481 549593 525428 551727 625012
20467 625012 662955 661632 617461 632366 634683 665618 655134 639311 663183 668619 592162 535525
20455 535525 531499 596158 667206 666077 610986 585043 547564 569058 592948 592857 605493 657257
20443 657257 670906 660131 624450 602807 553534 549395 570227 562027 508663 540164 637579 674727
20431 674727 649939 623544 667013 738594 708150 675231 637953 625837 576577 550020 602782
20420 602782 603742 575031 592049 599368 670361 686423 697845 651118 591179 579282 614260 645844
20408 645844 682495 680696 696965 722133 706472 692113 637459 598969 600198 590073 561014 585890
20396 585890 588436 596803 620288 644662 708652 692286 620564 585607 655042 681429 647957 654179
20384 654179 620982 617340 594900 589572 572647 591635 558428 577951 572607 614095 631891 586042
20372 586042 604136 661775 672029 668369 676669 649400 659362 666317 623546 620276 715324 758773
20360 758773 740048 716533 643497 603264 583885 572966 576373 611007 623947 615451 614224 623980
20348 623980 617695 606954 619403 668790 710664 693984 685964 646137 597595 548744 552984 589654
20336 589654 651363 685296 715790 725274 725890 721605 702509 686844 665382 655033 645012 636819
20324 636819 629697 592525 601082 601663 597706 657897 680481 697601 691426 669290 646586 574824 588988
20311 588988 605675 651273 711592 752766 788614 812243 726816 683027 694998 670426 692980
20300 692980 711633 718604 691972 667096 608687 605096 671325 688105 699907 717370 696973 713594
20288 713594 762999 782417 764209 657165 637063 628736 620293 672726 697807 702547 713379 680987
20276 680987 676003 711056 760511 829636 782753 660716 653046 698888 728478 731718 737554 720355
20264 720355 709239 737561 745083 720182 711625 678434 706868 700626 695229 688088 640203 702460
20252 702460 744219 748009 732191 736402 737944 764530 764501 712240 635512 667885 696854 706869 734450
20239 734450 723290 697891 682162 707906 723867 678570 677582 736829 781438 801290 807623 729895
20227 729895 721157 791488 778971 742288 722333 682987 704357 781061 797478 749767 716199 708415
20215 708415 705853 730891 764583 791916 779305 793870 760284 734220 681235 680946 716198 711544
20203 711544 739094 747804 700605 694146 679430 660512 729817 760283 802300 752469 666744 675162
20191 675162 719999 748240 763541 790315 793171 796505 759019 745791 699662 685492 702191 745587
20179 745587 754217 712358 676426 672866 680029 678504 662679 692124 726925 762996 783878 777953
20167 777953 773676 765292 752568 758207 776467 808781 777872 780626 748837 720377 654630 676619
20155 676619 781780 782410 727595 784740 829843 801793 729112 693747 709602 742291 774439 790556
20143 790556 775183 758804 778321 753871 716479 691333 693983 754780 842660 811987 761396 803723
20131 803723 759174 715568 714495 763134 799569 777710 723011 697599 676301 651652 672675 712078
20119 712078 758441 712537 711081 738401 751561 742550 733821 778451 807028 782340 794762 828168
20107 828168 810811 768136 762286 826860 871101 882237 868191 812815 779376 791116 820501 796332
20095 796332 807435 794364 774095 725700 711377 737200 752526 758789 729364 777314 787455 778639
20083 778639 750666 729612 702286 720577 801709 849844 864687 844159 793807 762653 741450
20072 741450 776779 764087 784049 759668 751482 741747 783606 850445 854041 802742 804690 866177
20060 866177 861200 853213 853724 831343 823647 823838 804259 829149 843617 866527 873267 903067 927054
20047 927054 874442 846845 854863 880829 867167 864762 821239 765743 774792 812570 796485 836304
20035 836304 865550 857596 858849 792471 742402 766240 818141 830798 817507 841400 887637 845687
20023 845687 815193 820886 820702 832532 869525 899995 927488 891392 907346 918631 923601 895534
20011 895534 831791 802512 839089 855886 838986 849883 858471 851496 844687 838510 831070 845541
19999 845541 869209 869384 862157 856016 902363 972235 941225 884708 900768 943037 929861 960515
19987 960515 982226 960116 954863 918156 885670 836240 838470 899517 944639 989366 1029413 1067558
19975 1067558 1002012 966684 943071 932898 933478 902364 916497 938844 910649 905519 910535 930581
19963 930581 905483 928864 932389 901429 874551 888267 881631 842891 811405 775544 804189 852024
19951 852024 880026 950047 969804 881462 804284 832232 845604 885508 899028 958299 1008840
19940 1008840 992745 927227 888102 850102 853758 846013 840790 803972 810618 788405 787199 838735
19928 838735 915777 931263 927737 916642 944119 979742 955419 936245 919888 910690 919089 919653
19916 919653 948586 970457 986958 942627 904346 873296 887894 908520 934829 953344 950584 935418
19904 935418 893781 862198 841447 839976 840329 876867 883262 872376 870815 891820 952117 982623
19892 982623 989998 995308 1017946 980728 928258 931297 918717 903267 899956 947859 978853 925061
19880 925061 928652 888131 892322 959442 1001466 952722 963958 962751 929704 956953 973801 964853
19868 964853 993129 1005403 1006251 967254 935593 939090 944245 981680 999363 994069 1052439 1021521
19856 1021521 1018025 1064349 1061375 1020195 966078 956147 950789 965841 959961 951670 994867 1058478
19844 1058478 1078662 1077653 1111162 1103104 1034947 978937 1022693 1059669 996060 968465 918033 938135
19832 938135 929060 908035 929620 975514 1021134 1010530 987355 964773 969612 1037329 1076673 1088167
19820 1088167 1050165 1001663 994800 1015040 1055832 1016143 980003 963939 994008 1037976 1063194
19809 1063194 1022115 1001002 1032092 1059579 1063066 1047481 999114 931616 933684 937639 925140 950028
19797 950028 933317 978906 1002185 948132 955748 1021204 1032438 1030082 996257 983727 1060693 1088273
19785 1088273 1106677 1059437 1012273 1016832 1007070 1034753 1076381 1064000 1049066 1016510 975070 997273
19773 997273 1012041 1012844 1007180 949621 919145 949682 970306 964939 939336 935225 968585 1003673
19761 1003673 981688 1017469 1060912 1030473 1083020 1128785 1160518 1157172 1146357 1120732 1073629
19750 1073629 1072540 1043621 1046387 1073901 1058797 1049376 1089188 1098917 1128317 1169280 1219602 1179944
19738 1179944 1127626 1131255 1117050 1106155 1056481 1067919 1109958 1081650 1047036 1069102 1066590 1026370
19726 1026370 1079913 1177736 1163413 1124750 1131662 1090636 1036904 991884 985682 993191 996138 1058049
19714 1058049 1061578 1091360 1066761 1056007 1046196 1046884 1066872 1091790 1096539 1109248 1159537 1135613
19702 1135613 1148519 1178860 1171443 1122904 1114591 1132648 1123932 1113508 1139424 1198611 1173938 1108941
19690 1108941 1101522 1130432 1100627 1099107 1134388 1137771 1104260 1061330 1050807 1028921 1022586 1040472
19678 1040472 1019057 1074568 1164409 1171688 1149707 1169237 1170720 1188676 1133252 1129456 1165115 1170576
19666 1170576 1191708 1168164 1132122 1118049 1176966 1199963 1187410 1210708 1224928 1208868 1214964
19655 1214964 1215521 1229047 1202415 1112185 1107499 1132261 1168971 1151342 1138678 1157847 1153914 1104062
19643 1104062 1072515 1105646 1119251 1082010 1054464 1125612 1121455 1084105 1109491 1113222 1116221 1179002
19631 1179002 1188222 1181747 1212748 1253348 1241765 1170337 1146104 1154952 1218678 1218197 1171130 1154375
19619 1154375 1145142 1140196 1196425 1308272 1304269 1283100 1261727 1273067 1319931 1317261 1300946 1324649
19607 1324649 1349055 1325121 1251392 1168797 1161486 1197467 1252769 1267589 1232301 1253093 1254141 1265536
19595 1265536 1250434 1272177 1256418 1184230 1158940 1174448 1223288 1267887 1296007 1298137 1261868
19584 1261868 1256592 1257087 1225941 1272308 1265985 1271763 1291734 1291497 1326300 1321949 1291577 1302704 1326598
19571 1326598 1294170 1298598 1316549 1327276 1324643 1332489 1398491 1372266 1338337 1303443 1306200 1343279
19559 1343279 1342137 1319566 1311713 1320092 1297098 1320930 1366218 1355378 1364196 1466452 1444795 1378309
19547 1378309 1344544 1330980 1336126 1369871 1370769 1402330 1373977 1415050 1442969 1413790 1388630 1342552
19535 1342552 1360295 1409185 1451346 1508783 1520416 1536398 1543834 1583541 1585028 1546401 1397740
19524 1397740 1241844 1188844 1196943 1216770 1261367 1358736 1436515 1545974 1540155 1414671 1266483
19513 1266483 1167067 1071830 1052829 1076516 1160860 1175825 1182257 1191897 1236476 1242132 1232683 1261303
19501 1261303 1261794 1295166 1319645 1328856 1336787 1356068 1384550 1357094 1349334 1339006 1317829 1319958
19489 1319958 1328020 1292929 1241131 1246584 1279634 1308196 1323735 1338931 1324927 1333156 1347037 1353738
19477 1353738 1366616 1350283 1323331 1355766 1415020 1397813 1394350 1409044 1373471 1342881 1375649
19466 1375649 1404912 1418223 1397012 1385433 1391629 1374546 1386360 1401940 1429239 1439797 1393398
19455 1393398 1366520 1365224 1413882 1460277 1467572 1498725 1517544 1480950 1405492 1348947 1357986 1402305
19443 1402305 1431811 1471976 1487026 1459762 1438108 1487701 1503413 1483670 1495614 1475104 1434606
19432 1434606 1423940 1451791 1467496 1479214 1523740 1528142 1517561 1528895 1511025 1482523 1521838
19421 1521838 1567793 1614483 1612439 1583429 1601847 1543310 1522392 1525938 1551940 1563046 1572518 1536068
19409 1536068 1543448 1574575 1594684 1592562 1604784 1605614 1619602 1647052 1589555 1596064 1630175 1638941
19397 1638941 1617395 1574759 1566887 1593062 1565066 1562825 1591313 1609014 1623595 1608487 1581023 1599742
19385 1599742 1613974 1602807 1635452 1606120 1524385 1551607 1585726 1599852 1599358 1626209 1680810 1653898
19373 1653898 1625418 1647969 1685979 1673875 1626589 1645181 1613541 1572184 1597322 1646244 1691144
19362 1691144 1688532 1674314 1708398 1709395 1684762 1745810 1758042 1719613 1749907 1752511 1743479 1731266
19350 1731266 1718375 1699144 1712504 1767214 1768186 1700676 1646507 1651303 1700388 1747084 1761091 1710641
19338 1710641 1745252 1785678 1793038 1818088 1834747 1789092 1760581 1734296 1768417 1754340 1785981
19327 1785981 1807658 1804327 1817312 1856374 1868748 1845646 1865818 1870873 1885299 1887749 1904818 1953343
19315 1953343 1898804 1879924 1928552 1944162 1923911 1933321 1919849 1925154 1931668 1946257 1962976 1935894
19303 1935894 1887013 1902035 1932090 1890622 1886782 1942726 1969810 1999536 1997678 1964065 1916282 1911478
19291 1911478 1933462 1955907 1973978 1978881 1943583 1942875 1920651 1932388 1934603 1948463 1973873 2034050
19279 2034050 2070689 2072796 2082755 2064987 2043590 2065429 2121456 2088526 1995208 1942644 1955494 1969151
19267 1969151 1990093 2044943 2094459 2078556 2024050 2024094 2068379 2099203 2090389 2095057 2111484 2083361
19255 2083361 2080918 2140900 2140376 2103214 2089069 2123480 2122973 2140105 2148665 2149433 2221768 2173924 2124534
19242 2124534 2122777 2143338 2167460 2139537 2111531 2141263 2133709 2134121 2192685 2269184 2304162 2317625
19230 2317625 2347585 2321524 2326251 2330596 2332223 2337470 2347978 2345833 2327255 2308295 2351687 2345639
19218 2345639 2342995 2403727 2397173 2394002 2448528 2464886 2423552 2396869 2382298 2380717 2431856 2502307
19206 2502307 2522288 2530344 2530900 2514484 2521319 2503723 2532717 2550961 2584364 2549528 2529335 2535276
19194 2535276 2579029 2643657 2710790 2687293 2607130 2631019 2663544 2619580 2584817 2618984 2662476
19183 2662476 2662167 2686757 2711319 2777114 2791259 2755026 2723167 2694517 2717851 2814603 2836776 2817304
19171 2817304 2795558 2822106 2875851 2912528 2926708 2940526 2928982 2903497 2932969 2983272 3021648
19160 3021648 2988988 2933983 2891820 2875567 2905837 2959909 2987203 3039943 3034497 3056136 3081916
19149 3081916 3051983 3125096 3119004 3126508 3167385 3223756 3231833 3269348 3272770 3260764 3262878 3262323 3239801
19136 3239801 3282471 3309912 3339007 3347358 3334235 3380252 3421836 3452089 3441461 3442485 3480171 3491770
19124 3491770 3509128 3493254 3514030 3592237 3612078 3603055 3610186 3633652 3647645 3673297 3718555 3779846
19112 3779846 3837500 3837839 3849795 3878377 3921417 3962272 3969870 4000482 4013441 4025194 4063519 4122592
19100 4122592 4155898 4170564 4204131 4230306 4273782 4275988 4331943 4414680 4421419 4423897 4421660 4420893
19088 4420893 4411964 4454739 4534858 4593714 4614313 4697452 4787460 4844037 4934866 4978557 5035227
19077 5035227 5041094 5025792 5067688 5159544 5227993 5296720 5335849 5410053 5441236 5515404 5619738
19066 5619738 5694050 5779606 5869780 5964642 6003534 6105106 6180240 6235782 6340881 6442917 6507733
19055 6507733 6600486 6672095 6789949 6885604 6981167 7072603 7125703 7221167 7403891 7593311 7671417
19044 7671417 7799710 7951479 8127206 8278913 8444114 8645270 8879111 9081348 9274500
19035 9274500 9464306 9635263 9868022 10191576 10491487 10833811 11188782 11458665 11667603
19026 11667603 11888149 12238968 12656331 12983566 13320902 13845055 14447123 14961632 15481439
19017 15481439 16041786 16638313 17376766 18309004 19420937 20531327 21897685 23577327 25402439
19008 25402439 27281481 29727313 33028437 37302315 42804871 49854147 56924815 55500404
19000 55500404 29501565 -5825252 -21381260 -19931275 -12441211 -4381272 3503142 11737560
18992 11737560 20651488 27896797 22945653 -8325992 -42495433 -54581299 -51608554 -44735877
18984 -44735877 -38609530 -33833134 -30091103 -27107143 -24671206 -22669542 -20977597 -19561776
18976 -19561776 -18358812 -17123211 -15973603 -15103721 -14388658 -13800644 -13283339 -12684516 -12059221
18967 -12059221 -11524441 -11137988 -10726670 -10279454 -10009182 -9800867 -9601596 -9305871 -9005254
18958 -9005254 -8694175 -8325077 -7975877 -7716773 -7516091 -7332790 -7093562 -6884322 -6719874
18949 -6719874 -6528742 -6337503 -6150835 -5936336 -5765410 -5602576 -5466075 -5345672 -5191179
18940 -5191179 -5085980 -4982265 -4908514 -4829138 -4703112 -4578379 -4395760 -4284792 -4226623 -4161886
18930 -4161886 -4102098 -3984227 -3881920 -3836500 -3742367 -3623634 -3565993 -3538120 -3527546 -3484688 -3353187
18919 -3353187 -3242581 -3157565 -3054415 -3033621 -3050291 -3034168 -2963119 -2843029 -2776972 -2738533 -2675554
18908 -2675554 -2600976 -2574537 -2601744 -2555705 -2513714 -2502519 -2462010 -2372913 -2344288 -2330820 -2289797
18897 -2289797 -2230837 -2153340 -2120975 -2080934 -1995831 -1928253 -1840038 -1858824 -1901649 -1889033 -1866931
18886 -1866931 -1829498 -1851722 -1834633 -1770576 -1684793 -1625404 -1596738 -1604239 -1608605 -1560231 -1506858 -1505611
18874 -1505611 -1470900 -1407056 -1401907 -1425127 -1402906 -1333924 -1309477 -1294158 -1271390 -1189412 -1138604
18863 -1138604 -1209835 -1244221 -1244169 -1172936 -1130447 -1090675 -1040332 -1021709 -1039505 -1056759 -1060017 -1062565
18851 -1062565 -1056937 -1033520 -981237 -922365 -947006 -975301 -996348 -977193 -927089 -826430 -782797
18840 -782797 -740560 -716567 -719728 -707583 -707373 -721344 -734378 -710103 -631332 -549840 -561903 -586864
18828 -586864 -581027 -553571 -524603 -528901 -474556 -386868 -377922 -394913 -391388 -381868 -349844 -323917
18816 -323917 -269927 -230221 -211680 -237591 -286028 -340541 -401721 -453208 -511869 -534440 -468673
18805 -468673 -410347 -288931 -265379 -285493 -245453 -306413 -366413 -422297 -455320 -488313 -526737
18794 -526737 -476458 -447231 -397478 -339642 -325106 -264636 -203564 -164439 -204506 -228194 -235656 -190980
18782 -190980 -107308 -77947 -97443 -124948 -77059 -20534 -46372 -32071 21483 37463 75556
18771 75556 61347 131111 276847 337288 295523 -13699 -350886 -398049 -327664 -255940 -206197
18760 -206197 -125459 -90861 -55476 11806 34694 23300 4425 51522 66089 148346 192164
18749 192164 127258 121937 148736 162349 131436 186903 166227 138850 175922 232691 196998 151111
18737 151111 133710 185081 197085 220693 213868 249040 280229 316629 339113 351357 329930 357958
18725 357958 336941 289438 316597 353531 317476 287141 271899 291154 327979 347202 362443
18714 362443 396739 371069 390784 410758 354830 317491 365628 416834 408985 430836 406263 354769
18702 354769 325798 372494 416946 474640 500780 519889 482046 537479 564598 575138 625249
18691 625249 619310 583821 590235 565430 596759 600222 646550 637672 596488 613131 599696 595481
18679 595481 570249 551954 592997 625598 688476 652477 627592 673563 713124 697490 721523
18668 721523 752971 721256 746814 754037 790330 762714 666044 643831 653497 685332 684039 750064
18656 750064 804337 859127 884120 844320 787202 770165 789596 815564 833445 877759 814679
18645 814679 818287 820840 811335 848672 947620 970304 911197 863267 884524 937332 957069 992659
18633 992659 928631 877083 880453 895420 905908 915188 919463 912419 899212 915990 970456 1031442
18621 1031442 1023104 1061129 1054933 1043722 1073356 1102937 1119688 1125364 1152556 1202715 1168956 1100406
18609 1100406 1087864 1123541 1133744 1164244 1182965 1190667 1214786 1206720 1214861 1222118 1208204 1166466
18597 1166466 1182114 1246089 1275939 1234240 1194611 1253941 1244055 1228283 1226621 1233474 1249286 1272915
18585 1272915 1256129 1216143 1210490 1223396 1250329 1296257 1354604 1387767 1331212 1294759 1319594
18574 1319594 1322560 1325719 1321136 1339988 1344893 1362269 1420579 1497028 1554984 1559590 1589020 1557861
18562 1557861 1544102 1596343 1597786 1612530 1593063 1581634 1610618 1585365 1567119 1553563 1570007
18551 1570007 1556874 1590498 1609317 1621320 1592431 1592769 1618766 1691826 1752638 1719614 1671926 1644325
18539 1644325 1640329 1636454 1648028 1623562 1636248 1683833 1710194 1763232 1805396 1789202 1739207 1717084
18527 1717084 1749107 1737224 1761764 1814556 1814628 1786119 1804488 1778707 1790837 1803280 1842701 1850530
18515 1850530 1851197 1846350 1864302 1886921 1895283 1963618 1994132 1995193 1978057 2000467 2063569 2075933
18503 2075933 2095935 2121599 2144941 2086512 2097747 2108000 2092030 2085200 2101024 2093398 2110173 2159585
18491 2159585 2166621 2137496 2166614 2246014 2272604 2241366 2210581 2210412 2249785 2292167 2364431 2399181
18479 2399181 2400088 2401036 2400077 2393529 2425433 2474039 2500774 2520959 2561005 2585016 2481151 2371449
18467 2371449 2330299 2370887 2400858 2436515 2504655 2571645 2623377 2643706 2655622 2560246 2451995
18456 2451995 2463252 2433207 2511372 2532061 2506619 2528004 2583847 2606443 2636860 2631628 2700456
18445 2700456 2725133 2700357 2710982 2771432 2826753 2856626 2880229 2896852 2882351 2906039 2864708
18434 2864708 2846426 2846255 2881692 2957943 3012992 3033813 3045786 3070871 3117120 3124923 3218531 3272843
18422 3272843 3279509 3309848 3288936 3340677 3362014 3379941 3404147 3451940 3481431 3492820 3560270
18411 3560270 3639027 3669311 3706558 3778896 3788029 3777607 3782396 3770386 3724155 3740505 3799808 3926315
18399 3926315 3966340 4012611 4070818 4155586 4189502 4154473 4131375 4138480 4145868 4230975 4298360 4350423
18387 4350423 4349073 4386197 4428028 4485485 4615479 4709844 4730560 4732408 4777065 4869437 4951575
18376 4951575 5006098 5100792 5164888 5241461 5287464 5306780 5312392 5311369 5392229 5468272 5554264 5638852
18364 5638852 5714614 5789554 5864502 5933841 6008642 6069652 6095548 6105294 6129410 6295257 6464932
18353 6464932 6601182 6767010 6867160 6954312 7017407 7127508 7297727 7441295 7566578 7670818
18343 7670818 7840969 8020256 8215372 8443265 8569372 8739847 8949519 9142917 9346461
18334 9346461 9576897 9796952 10047564 10326402 10609299 10950465 11349663 11750579 12113329
18325 12113329 12466697 12808152 13184466 13530389 13836200 14242922 14875726 15618020 16473684
18316 16473684 17382645 18331443 19201641 20068859 21079723 22289450 23795978 25719093 28032444
18307 28032444 30845401 34212325 38372689 43130103 47317397 48254216 41939755 27244062
18299 27244062 9139883 -6037700 -12687015 -11681394 -6253750 856585 8088902 13653591
18291 13653591 14744710 7718959 -7240597 -24838638 -38618941 -44304923 -43557838 -39620342
18283 -39620342 -35124938 -31181271 -27871167 -25154850 -22914778 -21117008 -19708347 -18544430
18275 -18544430 -17492946 -16555403 -15656319 -14745226 -13837594 -13005436 -12297784 -11668391 -11161982
18266 -11161982 -10808826 -10506157 -10159531 -9857394 -9454239 -9128014 -8809493 -8410567 -8077226
18257 -8077226 -7760949 -7452882 -7177609 -6884707 -6650573 -6405503 -6134294 -5929816 -5782593
18248 -5782593 -5631702 -5441689 -5262585 -5131905 -4980842 -4880223 -4749084 -4570355 -4368339
18239 -4368339 -4241117 -4120706 -3999442 -3917527 -3796293 -3640387 -3557752 -3415580 -3275637 -3177012
18229 -3177012 -3091505 -2997131 -2878853 -2795958 -2708726 -2615247 -2520688 -2421078 -2318260 -2237269 -2147554
18218 -2147554 -2018052 -1904512 -1839157 -1755094 -1696832 -1659861 -1603005 -1547714 -1476183 -1402028 -1328052
18207 -1328052 -1254734 -1179431 -1102767 -1045485 -970050 -918157 -868599 -777418 -681517 -586969 -506303
18196 -506303 -490778 -448423 -393794 -337653 -227586 -144590 -61645 42615 107517 177781 244663
18185 244663 288332 356753 389722 480494 603659 745402 795575 778698 808986 874823 960890
18174 960890 1038818 1186865 1314292 1428362 1473509 1541336 1597590 1700212 1813609 1864498
18164 1864498 1973169 2059724 2177194 2282877 2418881 2580263 2649829 2769378 2880776 3010875
18154 3010875 3161859 3283138 3421724 3572826 3732176 3883974 4056471 4222497 4425093
18145 4425093 4633188 4805864 5001721 5197862 5429073 5659885 5939409 6303400 6630553
18136 6630553 6973019 7310695 7674903 8048316 8492101 8976797 9510003 10048429 10665593
18127 10665593 11316684 12014527 12789499 13678429 14701056 15834497 17088555 18548947 20369293
18118 20369293 22540181 24995522 28086775 32103083 37281477 44003931 53039128 64706553
18110 64706553 75206762 63402581 -27539 -59293087 -74994963 -67775234 -56926417
18103 -56926417 -48115195 -41474223 -36411640 -32338880 -29023670 -26335833 -24160654 -22340460
18095 -22340460 -20758184 -19394324 -18200217 -17134075 -16222449 -15368393 -14557687 -13813454 -13235442
18086 -13235442 -12789510 -12367443 -11851320 -11466506 -11101806 -10796076 -10483568 -10082902 -9813853
18077 -9813853 -9586708 -9318157 -9089808 -8851217 -8596859 -8358523 -8143074 -8013194 -7861328
18068 -7861328 -7677095 -7499583 -7287700 -7156615 -7045875 -6892451 -6739026 -6615061 -6525548 -6425304
18058 -6425304 -6315337 -6251477 -6121248 -6051230 -5963890 -5831389 -5734808 -5622199 -5537032 -5443554
18048 -5443554 -5355383 -5232803 -5137717 -5090692 -5009672 -4953440 -4890898 -4845103 -4820172 -4781535 -4702371
18037 -4702371 -4612153 -4592468 -4521542 -4466068 -4438438 -4418551 -4387842 -4329345 -4280289 -4214669 -4191922
18026 -4191922 -4118066 -4033651 -4006692 -3950707 -3937109 -3924897 -3862276 -3797690 -3720732 -3707662 -3694644
18015 -3694644 -3673680 -3673328 -3602999 -3542828 -3498311 -3472882 -3434668 -3373025 -3332001 -3307374 -3298129 -3326203
18003 -3326203 -3362176 -3275869 -3235573 -3271235 -3237246 -3179105 -3132500 -3126930 -3120249 -3081472 -3009356 -2953558
17991 -2953558 -2963594 -2952488 -2907096 -2903727 -2875036 -2887332 -2913007 -2921495 -2911312 -2912758 -2937390 -2927001
17979 -2927001 -2830716 -2772982 -2762119 -2696564 -2721605 -2685576 -2632377 -2626228 -2678070 -2650651 -2546603
17968 -2546603 -2510917 -2515647 -2531537 -2487206 -2479365 -2493946 -2463526 -2453567 -2472009 -2462420 -2402916 -2356756
17956 -2356756 -2322082 -2339268 -2335580 -2291744 -2266853 -2274107 -2287799 -2263878 -2254760 -2215748 -2200630 -2192538
17944 -2192538 -2172318 -2159821 -2134937 -2118343 -2132209 -2175331 -2205739 -2200804 -2185237 -2097412 -2009332
17933 -2009332 -1990275 -2019337 -2006386 -1971006 -1957734 -1928099 -1910171 -1879927 -1911149 -1941000 -1950263
17922 -1950263 -1910422 -1831598 -1805819 -1791373 -1816244 -1846821 -1851918 -1845378 -1851538 -1890017 -1900941 -1921713
17910 -1921713 -1910053 -1845537 -1797973 -1748689 -1677812 -1663318 -1701396 -1693661 -1659949 -1644547 -1660473
17899 -1660473 -1686074 -1742649 -1765538 -1711505 -1664047 -1672254 -1738023 -1761531 -1689955 -1606215 -1587315
17888 -1587315 -1624192 -1659020 -1579397 -1533224 -1563140 -1597656 -1616634 -1586970 -1557309 -1584910 -1573086
17877 -1573086 -1552463 -1497970 -1466311 -1461424 -1424385 -1393867 -1380683 -1395051 -1356701 -1353234 -1388228 -1400084
17865 -1400084 -1393127 -1344799 -1296303 -1297519 -1345371 -1300803 -1307984 -1326978 -1297050 -1263608 -1252270 -1275132
17853 -1275132 -1256629 -1255645 -1279971 -1313640 -1346709 -1305875 -1280153 -1268628 -1241260 -1247055 -1303863 -1303699
17841 -1303699 -1311194 -1287477 -1280212 -1242089 -1184802 -1166755 -1219467 -1189736 -1170158 -1208218 -1190479 -1143380
17829 -1143380 -1117677 -1094563 -1077608 -1126180 -1178955 -1152787 -1160461 -1163308 -1180540 -1107142 -1092785 -1076187
17817 -1076187 -1003825 -1014110 -1005262 -1020929 -1036457 -1058820 -1066986 -1070368 -1094963 -1040941 -1000177 -992428
17805 -992428 -1003767 -1014412 -993852 -961657 -942582 -892456 -849364 -835572 -814837 -816524 -784934 -720104
17793 -720104 -706823 -765456 -836299 -834100 -762947 -768065 -758260 -759577 -760100 -839951 -948066 -994377
17781 -994377 -1044523 -1017789 -1021885 -988432 -909713 -884452 -875614 -895668 -992309 -1081980 -1142203 -1162630
17769 -1162630 -1168525 -1134784 -1088810 -1056241 -1026692 -1002311 -985534 -974482 -977043 -990512 -986450 -948382
17757 -948382 -892056 -858873 -852376 -876705 -813359 -773519 -788149 -813987 -841870 -834145 -833306 -812306
17745 -812306 -791631 -761160 -782607 -723982 -714739 -774404 -813506 -848466 -873587 -844522 -862935 -812488
17733 -812488 -738880 -731323 -776262 -809761 -792164 -829657 -837848 -821014 -777255 -708297 -684242 -737415
17721 -737415 -766672 -743812 -716279 -735769 -716718 -669346 -677290 -675179 -696160 -726442 -710945 -670896
17709 -670896 -657346 -670752 -662972 -645935 -644851 -668183 -669470 -622821 -645824 -614990 -592357 -620818
17697 -620818 -677882 -651081 -593496 -652262 -668423 -631953 -580387 -562469 -568356 -588015 -595782 -597265
17685 -597265 -561789 -493389 -499954 -512328 -509214 -533161 -515636 -480248 -494039 -522491 -503986 -506241
17673 -506241 -498599 -512716 -511873 -529650 -527270 -504732 -500840 -525238 -533549 -569446 -599048 -566695 -539026
17660 -539026 -489205 -486854 -492896 -450702 -410675 -420257 -429631 -473103 -482781 -444007 -405228 -418926
17648 -418926 -449560 -448262 -438193 -398400 -395665 -391471 -403913 -394291 -369249 -354324 -364359 -364892 -384348
17635 -384348 -419842 -401882 -372693 -390036 -385160 -322919 -292276 -326407 -312054 -289090 -295369 -285691
17623 -285691 -290553 -375071 -407678 -370442 -310607 -323394 -354855 -328595 -313739 -292805 -256783 -277278
17611 -277278 -264978 -192616 -215023 -229434 -250083 -284524 -328494 -346616 -338968 -260854 -270464 -273709
17599 -273709 -256621 -250410 -243746 -223365 -215098 -164652 -122712 -133025 -218782 -208573 -166106 -215031
17587 -215031 -198611 -169480 -184217 -185240 -179316 -154126 -143866 -128996 -148481 -196546 -197942 -162665
17575 -162665 -122121 -94890 -81681 -80523 -77358 -129647 -158115 -160074 -120904 -144326 -134560 -115686
17563 -115686 -102342 -73231 -56363 -85128 -91457 -61733 -61591 -22897 -8038 2180 40014 51125
17551 51125 29171 -16552 -93208 -129427 -122627 -141683 -115819 -87399 -37502 35342 20711 52542
17539 52542 80380 88163 108558 102076 38729 15222 3676 -18435 -8419 18655 43582 85398
17527 85398 107285 117441 137306 162737 166823 110024 109364 99234 96654 87408 83762 107203 123620
17514 123620 191309 177419 128350 60263 35877 83564 166387 156920 119445 107660 107554 98435
17502 98435 112076 116975 136905 182610 209304 228851 229375 205460 198165 250636 281928 276428 241026
17489 241026 250256 222366 155796 163872 193302 248249 282556 313989 262472 290206 314312 302121
17477 302121 285173 291830 321891 371978 368668 303078 315081 296126 325518 348988 337434 352694
17465 352694 354421 329346 359583 355585 374794 438554 431048 400714 468339 447696 429057 412510
17453 412510 380488 408190 475095 546621 571036 639093 695687 749386 859407 867931 778757
17442 778757 496273 137926 6883 35123 106121 131530 164548 257687 297689 308602 357416
17431 357416 352968 333467 332988 344072 354497 419926 477515 517936 503637 477375 477225 490599
17419 490599 493562 489833 542785 549918 565841 609123 589744 498208 529272 587091 616691 564776
17407 564776 590266 652898 622012 606257 609543 604865 574236 611473 629058 679077 670414 652775
17395 652775 638391 667522 682267 686309 644037 669127 694240 706351 689079 684200 689715 687180
17383 687180 718032 773677 766903 836358 904642 876938 812950 857243 894792 921158 964081 960733
17371 960733 971774 955169 920875 912602 947329 978787 957083 947968 1001894 991007 961982 1005225
17359 1005225 1048670 1052377 1063562 1065014 1089079 1080820 1083414 1101923 1117906 1129350 1182709 1214271
17347 1214271 1213652 1173995 1183579 1228382 1287893 1252222 1244060 1242911 1220876 1224988 1246285 1279761
17335 1279761 1286852 1272363 1256363 1257527 1278811 1345118 1365573 1390440 1431768 1454221 1462665 1422290
17323 1422290 1374658 1351592 1399325 1465955 1513577 1482409 1441131 1496391 1522132 1538751 1536566
17312 1536566 1546029 1595910 1622429 1660151 1660815 1643241 1664985 1685292 1692273 1694634 1681571 1728577
17300 1728577 1802719 1831649 1810857 1776101 1802548 1842657 1873018 1906283 1927194 1899561 1901280
17289 1901280 1973486 2003943 2011027 1988597 2025101 2108483 2134496 2143058 2157302 2139504 2136462 2171918
17277 2171918 2213872 2268297 2317052 2372601 2437696 2471813 2451514 2472528 2520098 2501923 2523108
17266 2523108 2549963 2581085 2650256 2734094 2797039 2868851 2883584 2864366 2862564 2910140 2959032
17255 2959032 2989784 3016967 3107261 3184321 3206741 3201811 3194370 3164838 3286098 3349201 3367934
17244 3367934 3399316 3448109 3488206 3524264 3589952 3650200 3689330 3744936 3735983 3784190 3895312
17233 3895312 3962828 4029828 4125910 4210100 4289164 4380263 4468686 4550343 4623783 4667796 4697293
17222 4697293 4751649 4811710 4908851 5053442 5151932 5187876 5277990 5402426 5551517 5670833
17212 5670833 5781630 5891773 5974305 6032564 6145534 6255719 6403668 6530755 6684178 6844162
17202 6844162 7004738 7175581 7284167 7464285 7686182 7841762 7991824 8208314 8432148
17193 8432148 8656968 8873014 9141478 9401634 9625002 9797505 10008836 10306095 10588229
17184 10588229 10831675 11099006 11384400 11604436 11850925 12104643 12313299 12500478 12581551
17175 12581551 12642123 12690943 12656625 12453247 12114519 11580522 10840296 9844301 8599546 7080694
17165 7080694 5263236 3207784 927386 -1360097 -3575061 -5668177 -7508771 -9081716
17157 -9081716 -10351710 -11382667 -12144915 -12690375 -13052075 -13246639 -13315536 -13366491 -13342432 -13259691
17147 -13259691 -13108223 -12950877 -12785687 -12513926 -12274856 -12053289 -11791247 -11514055 -11272423
17138 -11272423 -11065370 -10863197 -10611676 -10346555 -10124086 -9913454 -9728866 -9506635 -9314871
17129 -9314871 -9143228 -8945526 -8751557 -8536654 -8404382 -8257777 -8109105 -7942575 -7768976
17120 -7768976 -7633822 -7579203 -7466782 -7322415 -7160739 -7043299 -6920374 -6831809 -6728054 -6582483
17110 -6582483 -6443612 -6338832 -6218921 -6107244 -6015086 -5953225 -5962039 -5881976 -5796990 -5703373 -5568074
17099 -5568074 -5461673 -5394221 -5343808 -5277955 -5245353 -5172644 -5073119 -5045093 -4975154 -4926774 -4838653
17088 -4838653 -4804119 -4764376 -4698149 -4589223 -4491373 -4460940 -4445957 -4410169 -4419402 -4397555 -4334861
17077 -4334861 -4267349 -4249656 -4247644 -4219510 -4174662 -4146982 -4065673 -4016304 -3942551 -3856561 -3816000
17066 -3816000 -3775412 -3738402 -3755103 -3764922 -3765829 -3682937 -3593066 -3580035 -3600934 -3579489 -3522555 -3474016
17054 -3474016 -3467614 -3439210 -3451070 -3455990 -3464571 -3433311 -3397519 -3372943 -3290166 -3252217 -3246706 -3261015
17042 -3261015 -3196160 -3151632 -3125468 -3086564 -3053929 -3046820 -3041444 -3090048 -3095069 -3024363 -3015588 -3020891
17030 -3020891 -3021504 -2972079 -2916799 -2904256 -2926631 -2888952 -2861601 -2831106 -2806772 -2821706 -2795901 -2741493
17018 -2741493 -2703778 -2723032 -2767654 -2768641 -2757637 -2685304 -2613568 -2634445 -2660267 -2605227 -2627103 -2623267
17006 -2623267 -2644788 -2602150 -2607515 -2569189 -2538483 -2491103 -2476204 -2483464 -2513967 -2486563 -2414666 -2427281
16994 -2427281 -2422268 -2376402 -2362578 -2379454 -2394654 -2419315 -2420347 -2403997 -2352027 -2345127 -2328179 -2281213
16982 -2281213 -2295574 -2287129 -2283866 -2240559 -2185323 -2173287 -2153226 -2156716 -2163872 -2188658 -2228698 -2203857
16970 -2203857 -2151440 -2064771 -2067329 -2089237 -2072282 -2042726 -2079394 -2098309 -2034309 -2044261 -2052698 -2038933
16958 -2038933 -2030264 -1975982 -1984210 -1989806 -1984687 -1944192 -1942019 -1949282 -1919411 -1882931 -1859029 -1850487 -1843681
16945 -1843681 -1827055 -1823253 -1877554 -1873050 -1873184 -1861161 -1821305 -1819173 -1875142 -1867861 -1851293 -1818223
16933 -1818223 -1821822 -1801837 -1792057 -1810393 -1781172 -1767616 -1758881 -1761176 -1779173 -1758508 -1731514 -1706846
16921 -1706846 -1703911 -1760021 -1722055 -1708220 -1750283 -1712304 -1657184 -1638634 -1697857 -1768448 -1726735
16910 -1726735 -1691847 -1692781 -1702284 -1688117 -1710413 -1690505 -1654996 -1671604 -1663764 -1630267 -1655609 -1661854
16898 -1661854 -1607395 -1541118 -1582971 -1645088 -1643696 -1587125 -1529271 -1519145 -1512625 -1484775 -1543871 -1532633
16886 -1532633 -1536012 -1580509 -1554800 -1517095 -1513014 -1509737 -1531795 -1546359 -1535497 -1566534 -1569503 -1564567
16874 -1564567 -1598417 -1580413 -1550105 -1538553 -1549629 -1506073 -1435452 -1405301 -1432074 -1396800 -1349292
16863 -1349292 -1410279 -1426404 -1465368 -1517102 -1503042 -1458596 -1439102 -1439646 -1380330 -1353513 -1353768 -1329166
16851 -1329166 -1368203 -1411289 -1404311 -1398353 -1377316 -1313406 -1298535 -1323063 -1334660 -1339653 -1337056 -1309269
16839 -1309269 -1295596 -1292189 -1320631 -1357894 -1372563 -1329755 -1292988 -1271374 -1245716 -1243084 -1184804 -1195543
16827 -1195543 -1250261 -1299436 -1270976 -1249581 -1271295 -1248621 -1195994 -1175071 -1166990 -1178376 -1177394 -1135868
16815 -1135868 -1133460 -1168910 -1169192 -1169123 -1202207 -1200781 -1204007 -1258927 -1276825 -1286426 -1239231 -1224663 -1257849
16802 -1257849 -1232525 -1239122 -1221498 -1182554 -1161098 -1146442 -1149300 -1096563 -1128519 -1159988 -1208319 -1250079
16790 -1250079 -1177981 -1133978 -1127248 -1130252 -1156244 -1228391 -1240904 -1186577 -1209443 -1219971 -1192991 -1250738
16778 -1250738 -1242703 -1175311 -1123993 -1117325 -1149422 -1164031 -1103213 -1160213 -1201777 -1178428 -1139378 -1161873
16766 -1161873 -1172111 -1194091 -1193169 -1196148 -1173832 -1143904 -1119530 -1135256 -1151962 -1138445 -1153028 -1185094
16754 -1185094 -1139606 -1099859 -1131226 -1068270 -962405 -947011 -986306 -984279 -991120 -996090 -950015 -963575
16742 -963575 -994466 -994050 -995529 -1009479 -995136 -982615 -922673 -914303 -991488 -1028328 -1007645 -1011007
16730 -1011007 -1065606 -1078762 -1091609 -1009646 -998704 -1009135 -1012384 -1019958 -1039392 -1043390 -1083518 -1087931
16718 -1087931 -1053471 -1045815 -1012395 -1000083 -1015163 -1050171 -1051430 -1076105 -1072824 -1060553 -1047608 -1001512
16706 -1001512 -991626 -962524 -961519 -984066 -1002865 -1069833 -1056025 -986384 -946112 -984657 -991852 -977311
16694 -977311 -929924 -914338 -978722 -981297 -974169 -965887 -954690 -945481 -990718 -1018322 -1018801 -1025907 -958419
16681 -958419 -998055 -978268 -953642 -970247 -1010957 -1015675 -947514 -934589 -948071 -938954 -950780 -963976
16669 -963976 -926506 -897843 -884965 -938902 -924973 -903962 -867219 -843988 -885295 -841654 -799226
16658 -799226 -794618 -829429 -865757 -858959 -891527 -895867 -867877 -869277 -872387 -914119 -937843 -941445 -988562
16645 -988562 -1019474 -923291 -902025 -942493 -964794 -953758 -934660 -873219 -872292 -883725 -882346 -892422
16633 -892422 -870528 -881374 -871135 -870799 -895283 -880549 -867965 -868618 -853525 -871440 -941797 -918240
16621 -918240 -894663 -909297 -947643 -964594 -942322 -892897 -924628 -859544 -836463 -871310 -891003
16610 -891003 -890327 -823984 -784413 -772352 -756213 -736438 -702089 -753861 -781165 -794812 -774009 -783131
16598 -783131 -796650 -772792 -717227 -712010 -748297 -790276 -813354 -859581 -833790 -795536 -775182 -819701
16586 -819701 -819163 -852520 -844854 -838111 -869455 -904304 -898047 -887840 -868099 -842781 -797225 -776002
16574 -776002 -738489 -760041 -786946 -828867 -829137 -800062 -741123 -730411 -752386 -800250 -833139 -784440
16562 -784440 -756557 -763170 -792329 -763449 -719798 -678554 -703592 -747680 -720582 -687353 -704096 -771628
16550 -771628 -794647 -820818 -826571 -802379 -787101 -714870 -695952 -713070 -699176 -728811 -791619 -748414
16538 -748414 -720787 -781209 -813997 -735072 -718314 -703710 -696467 -728320 -741569 -690554 -651574 -652515
16526 -652515 -684546 -690700 -720716 -746195 -721079 -720301 -668388 -640735 -575846 -578743 -604020 -680183
16514 -680183 -679540 -681436 -742985 -756156 -731499 -659530 -645114 -673831 -683918 -683476 -682853 -723846 -741233
16501 -741233 -719578 -726772 -732567 -698992 -688422 -689122 -684249 -660955 -680457 -654204 -636447 -660451
16489 -660451 -671592 -655717 -664653 -670957 -654297 -654366 -637271 -637769 -655689 -656249 -618334 -587767 -536873
16476 -536873 -543264 -604617 -632312 -647152 -673192 -663645 -621435 -633766 -672324 -667033 -609162 -607106
16464 -607106 -650752 -732430 -745861 -751483 -761263 -765638 -744651 -670980 -626330 -578074 -571096 -594419
16452 -594419 -594952 -632298 -655638 -666454 -666667 -701792 -704761 -686842 -687683 -690349 -657977 -657574 -653570 -641471
16438 -641471 -646711 -659243 -711464 -657392 -602142 -628190 -622151 -659496 -614462 -615452 -635473 -642726
16426 -642726 -637205 -642462 -620609 -630987 -666235 -647043 -545859 -560962 -584788 -582542 -629672 -637177
16414 -637177 -658858 -649076 -611220 -598364 -574464 -580876 -573027 -572454 -613102 -611520 -657773 -687308 -694844
16401 -694844 -681233 -645906 -636080 -593365 -609497 -609163 -608875 -637102 -630185 -658776 -631747 -622739 -610830
16388 -610830 -597204 -599138 -557826 -513693 -519603 -477827 -501389 -518304 -519486 -584216 -568392 -550664
16376 -550664 -578868 -592486 -535746 -554886 -561926 -583711 -599169 -595203 -535932 -527089 -510338 -508905
16364 -508905 -518437 -478163 -502775 -500798 -463668 -502035 -562602 -555332 -548665 -622268 -666623 -617748
16352 -617748 -609192 -597472 -597531 -557340 -520889 -616206 -613454 -557480 -585149 -639129 -637211 -597366 -573359
16339 -573359 -567939 -556747 -565896 -521320 -515587 -483058 -476889 -508324 -489305 -490280 -540608 -521570 -494165
16326 -494165 -592935 -619178 -624680 -551356 -481553 -477086 -520472 -536189 -550654 -578969 -605804 -591500
16314 -591500 -536341 -488859 -476826 -482012 -535565 -539388 -552261 -618161 -666666 -635443 -628954 -587516
16302 -587516 -564837 -528267 -538749 -540150 -536107 -545354 -538602 -520437 -550836 -538566 -525070 -528722
16290 -528722 -528937 -512156 -534465 -506671 -496545 -469230 -511329 -526806 -436100 -369850 -395553 -454015
16278 -454015 -461994 -524189 -551110 -531887 -498595 -507955 -483753 -499760 -537485 -495764 -423834 -404458
16266 -404458 -385455 -402602 -405800 -431396 -451954 -447803 -442034 -465437 -475876 -465277 -406670 -400426
16254 -400426 -406173 -425436 -425243 -401285 -406792 -374379 -381012 -438829 -449524 -463838 -520369 -513872 -461899
16241 -461899 -422437 -428047 -428607 -447621 -403239 -419543 -498516 -504241 -455228 -428796 -441708 -446858
16229 -446858 -414686 -442458 -442496 -459239 -429007 -396943 -408453 -447920 -516152 -518214 -459108 -440799
16217 -440799 -423678 -416949 -375442 -395747 -377954 -418841 -413939 -435248 -508411 -512667 -428296 -390073
16205 -390073 -430659 -441802 -429490 -430507 -435148 -452857 -487045 -472935 -406693 -384718 -405257 -426493
16193 -426493 -416361 -436174 -420037 -391009 -386731 -440635 -409720 -360347 -329792 -373821 -378417 -352141
16181 -352141 -325265 -324607 -356108 -393839 -396196 -365412 -367669 -360733 -371864 -420010 -431583 -433427 -415903
16168 -415903 -370108 -337315 -337193 -342093 -307345 -286798 -307932 -313802 -324221 -331092 -335413 -326107 -365049
16155 -365049 -436035 -442828 -393958 -367182 -357217 -347286 -398442 -442631 -460592 -431172 -414766 -386871
16143 -386871 -382742 -391493 -410705 -389229 -376786 -360894 -360577 -401450 -459150 -426082 -415780 -445772
16131 -445772 -416761 -383764 -394806 -401269 -387983 -347240 -361767 -348951 -343200 -370807 -373567 -376061
16119 -376061 -343341 -334841 -383738 -404222 -431689 -393972 -299749 -259624 -285900 -312392 -319247 -320955
16107 -320955 -328215 -356644 -391396 -443603 -452184 -424795 -453389 -417916 -366415 -305197 -226707 -220400
16095 -220400 -236936 -305248 -391327 -380154 -325007 -324288 -318073 -353424 -312954 -291509 -342034 -391225
16083 -391225 -439965 -464408 -465928 -450623 -466359 -425357 -388024 -396308 -405862 -380652 -409442 -422942
16071 -422942 -388327 -345545 -397184 -368204 -329411 -333453 -305418 -223264 -237854 -313854 -286750 -306510
16059 -306510 -290977 -273648 -272691 -311904 -357865 -413721 -425567 -438819 -437749 -365645 -360404 -419682
16047 -419682 -454841 -458182 -428399 -430615 -398610 -372354 -399139 -385708 -395806 -378782 -356145 -321033
16035 -321033 -342909 -296137 -293465 -319000 -354877 -408385 -425085 -384204 -368768 -364817 -406951 -417701
16023 -417701 -433289 -424268 -367948 -332577 -278093 -239991 -250757 -279939 -289904 -326753 -352417 -333196
16011 -333196 -316567 -334897 -371399 -302203 -266969 -242307 -355267 -417627 -391012 -318930 -297267
16000 -297267 -313904 -310899 -297443 -274473 -229572 -246762 -246441 -246667 -263010 -319550 -325992 -300562 -288715
15987 -288715 -286483 -292264 -283159 -305508 -321098 -302570 -301947 -310485 -303306 -303681 -338064 -337148 -310209 -262858
15973 -262858 -264787 -266906 -234516 -236612 -305747 -325489 -286047 -306000 -288507 -270036 -328711 -380430
15961 -380430 -387372 -339800 -302954 -283874 -271375 -271196 -293052 -291683 -270004 -266155 -283810 -313309
15949 -313309 -318288 -328687 -366632 -340025 -287754 -233471 -208763 -285209 -321508 -331129 -313336 -311297
15937 -311297 -323573 -354724 -338387 -312175 -281490 -232318 -209264 -232093 -220599 -222532 -258253 -262665
15925 -262665 -289941 -315342 -294018 -223295 -221182 -236571 -314708 -269612 -194250 -205630 -231168 -222954
15913 -222954 -253729 -303200 -276305 -276038 -274176 -261052 -260717 -242922 -297288 -396254 -344190 -288070
15901 -288070 -306193 -329644 -286564 -278174 -288541 -263698 -250081 -169784 -189373 -257241 -265600 -267610
15889 -267610 -260776 -276761 -223011 -217140 -228144 -223367 -225103 -226150 -250283 -226820 -236295 -270920 -325595
15876 -325595 -329246 -301936 -303233 -266970 -256888 -249359 -257121 -288603 -249416 -231962 -234289 -225097 -207880
15863 -207880 -151022 -135367 -148396 -197982 -226504 -243886 -272058 -249245 -192560 -201793 -213244 -220575
15851 -220575 -251230 -309747 -276463 -198242 -179550 -177073 -168482 -202980 -218970 -177043 -169823 -178757
15839 -178757 -146427 -188294 -254312 -276873 -232081 -160955 -156726 -140862 -143101 -196098 -238967 -259010
15827 -259010 -250584 -251294 -251583 -216932 -201654 -192644 -208342 -236495 -267295 -303991 -329050 -305090 -271899
15814 -271899 -240974 -210806 -262245 -266769 -236663 -235222 -230039 -283891 -323335 -379038 -383051 -338713
15802 -338713 -270975 -222703 -272373 -243117 -246272 -324250 -370105 -307292 -265795 -296594 -298083 -267787
15790 -267787 -185940 -201721 -231989 -225834 -262214 -254831 -242500 -245047 -249339 -298264 -287403 -266906
15778 -266906 -254364 -210846 -203867 -260800 -245927 -229913 -299602 -300720 -285778 -252043 -249449 -288059
15766 -288059 -299774 -236002 -139494 -134276 -164048 -165300 -206534 -193394 -156853 -151747 -126619 -141093
15754 -141093 -137852 -146733 -161141 -107496 -68173 -69097 -179370 -246417 -242309 -233894 -241609 -244913 -230157
15741 -230157 -230467 -233970 -170320 -127954 -139223 -177189 -179584 -157246 -210378 -230479 -229783 -185275 -126612
15728 -126612 -171541 -163083 -126601 -137036 -92218 -97140 -149271 -152326 -146734 -142381 -151905 -172275 -204830
15715 -204830 -275210 -236143 -197095 -165101 -117315 -124242 -170777 -185097 -195555 -195643 -215595 -204157
15703 -204157 -205856 -239256 -244155 -199920 -156692 -126690 -116117 -133369 -151508 -144211 -100233 -93224
15691 -93224 -133250 -86881 -31156 -57342 -173861 -199915 -159506 -171549 -206349 -211070 -194020 -195811
15679 -195811 -215592 -238149 -167684 -90893 -93256 -102873 -133114 -173336 -154303 -139087 -162911 -163819
15667 -163819 -150017 -119258 -77245 -69825 -86367 -87469 -130879 -149039 -135792 -161455 -167126 -94998
15655 -94998 -63088 -74301 -62918 -57191 -47651 -78250 -161943 -228798 -191292 -157507 -127701 -156664
15643 -156664 -171511 -179226 -148225 -153878 -144753 -110091 -147990 -151634 -136459 -151297 -93108 -39846
15631 -39846 -57989 -112458 -115861 -144906 -204094 -213657 -160514 -105267 -90933 -102053 -151061 -206633
15619 -206633 -270023 -236625 -221406 -178501 -145311 -177276 -171158 -158284 -123519 -86033 -121935 -137117
15607 -137117 -130602 -133271 -143024 -219433 -268045 -202357 -199118 -206630 -183260 -133607 -88419 -135271
15595 -135271 -122195 -101890 -84724 -83203 -66045 -93059 -105867 -95966 -144847 -154984 -138429 -124407
15583 -124407 -129651 -108041 -50007 -62481 -112924 -103931 -64467 -63125 -63289 -41726 -36295 -30756 -54913
15570 -54913 -125492 -155966 -175754 -157463 -120627 -120371 -144094 -132470 -168667 -217821 -242986 -275546
15558 -275546 -261091 -218012 -140555 -160081 -142071 -122548 -81352 -70733 -89970 -85252 -57456 -67684
15546 -67684 -32489 -59154 -42958 -47649 -89481 -98738 -110915 -158972 -201281 -212559 -189721 -156244
15534 -156244 -145573 -130023 -104861 -83513 -85179 -72263 -96120 -108125 -163380 -171830 -195506 -220531
15522 -220531 -176204 -97342 -29723 10809 -771 -17573 -73719 -71634 -105930 -102615 -57679 -59941
15510 -59941 -93370 -155050 -161021 -165108 -140874 -131420 -125416 -132038 -141859 -109233 -94252 -76163 -63844
15497 -63844 -68115 -51443 -39957 -86252 -83294 -65184 -70583 -107353 -132563 -115586 -52345 -31993
15485 -31993 -20425 -29396 -81802 -97535 -92042 -61168 -32781 -125125 -165533 -118768 -83997 -86107
15473 -86107 -184370 -242471 -235981 -199266 -170834 -135840 -82897 -87918 -113228 -88866 -63732 -82707
15461 -82707 -73775 -37845 -89434 -61604 -83008 -88977 -80129 -78152 -104415 -67548 -71801 -106534 -108608
15448 -108608 -111177 -71729 -59229 -43205 -65361 -63666 -62349 -51650 -103893 -111428 -128916 -152929
15436 -152929 -190069 -149458 -46479 -27862 -13442 -17618 -41943 -34136 -29104 -11004 -80021 -81164
15424 -81164 -83394 -74717 -55315 -77990 -109377 -119004 -88257 -72063 -74982 -71585 -62554 -9213 -17843
15411 -17843 -106169 -129555 -71189 -39954 -39170 -56308 -68641 -59895 -63687 -84620 -68654 -80095
15399 -80095 -71807 -87893 -96496 -131662 -159035 -178794 -121748 -48032 -93372 -84578 -66161 -29290
15387 -29290 6560 -3630 -3797 -27881 -45507 -54294 -39231 -56085 -64094 -64686 -11534 12446 -4389
15374 -4389 -26935 -40378 -87060 -91252 -119245 -123014 -104212 -87387 -111282 -93854 -44340 -17622
15362 -17622 -43010 -97635 -93609 -54323 -36897 -55962 -81736 -47055 -107085 -123453 -87629 -103093
15350 -103093 -98654 -78855 -82852 -75174 -69023 -70738 -33355 -16303 -27317 -17925 -10745 -11792 6009
15337 6009 -17912 -25040 -24989 5963 -1709 -54186 -122655 -110089 -53122 -12413 12413 33257 30487
15324 30487 33187 55415 17950 -54117 -41471 -35568 -61507 -30381 5516 -9811 13133 25624
15312 25624 16061 3387 -76893 -65287 4138 -8698 18140 30603 -21214 -51953 -45529 -49674
15300 -49674 -80169 -31344 -27107 -91713 -52460 -19248 17975 50251 12597 -51659 -51752 -74014
15288 -74014 -81977 -45310 -19607 -35916 -32332 -3331 -5794 23550 -17226 -46015 -51638 -71674
15276 -71674 -79937 -10827 27004 36742 -32798 -26291 20053 44500 31922 46422 39374 13520
15264 13520 47394 59960 55461 13146 43951 57620 68466 95639 36375 18262 83796 71884
15252 71884 42268 12040 -8799 20483 68009 73230 76755 15462 27525 33385 23007 28790
15240 28790 44172 82886 36882 14353 -31961 -24904 31093 3877 22908 49306 65339 77360
15228 77360 78544 25278 -20468 -54115 -76027 -66857 -88010 -29966 21133 30478 2241 -19678
15216 -19678 -67032 -85883 -69833 -41979 -17100 13355 13177 35636 53299 55905 36810 -3496
15204 -3496 12295 73415 123300 119939 96032 115820 117660 63727 55321 55685 66299 30401 -52924
15191 -52924 -44079 6590 56397 97240 88547 40140 46676 67686 48436 -27557 -55193 -51816
15179 -51816 -42590 -29431 4466 -5046 48544 73080 63028 13573 29557 12712 -46648 -97117
15167 -97117 -46270 28084 63515 22515 16417 15750 -21083 -17539 -23784 -50045 -6719 20835 22318
15154 22318 -6673 5059 35982 53058 56859 35009 20814 28606 5238 -27796 -11428 29453
15142 29453 -4166 23743 24639 1648 5748 46064 102229 119307 70134 42279 83133 83956 69119
15129 69119 66130 72343 90769 76750 45579 87023 109760 118407 71663 45382 89733 127717
15117 127717 155499 139267 79379 61008 49371 33125 -4212 31389 70573 47280 34146
15106 34146 10010 -3356 -13206 8122 17085 10937 22467 74433 178354 210817 190401 147492
15094 147492 196181 207119 120743 138629 134506 90666 47626 11974 -37178 -18273 65763 109144
15082 109144 99380 82720 40482 -12293 -31564 -55507 -38185 -60473 -14991 33793 75588 118599
15070 118599 86474 57551 17090 -110 76160 61867 32132 29086 81859 91771 121403 94876
15058 94876 115469 107986 73909 11880 68392 111960 85399 76614 33440 9370 53316 97603
15046 97603 106651 64564 37212 57181 39969 19781 28921 66333 120113 134427 115014 153096
15034 153096 74457 65417 113155 96479 59866 63330 66897 61306 57864 39349 68926 115580
15022 115580 149309 121971 89594 69221 42301 62106 43402 36422 97165 140721 132134 138162
15010 138162 205380 159218 111533 84938 63753 45296 49055 47950 108170 132033 123959 99720
14998 99720 83828 68860 150525 176707 167897 101524 100325 94662 126558 174772 191945 171766
14986 171766 159367 130843 148643 151878 115368 98253 100710 77848 49707 79147 112059 95529
14974 95529 118277 129266 117993 70441 28382 50551 70294 82472 145999 186977 210384 185235
14962 185235 159803 149266 164219 145369 82774 72930 88710 79122 108997 118581 50936 56176
14950 56176 80063 125052 113653 74603 47559 53197 115917 121256 109060 122534 167394 169080
14938 169080 141116 151146 150462 139920 122897 74697 30680 17205 37736 50683 108787 78680
14926 78680 71624 111158 97823 66873 92543 83682 73909 92559 121511 169323 207003 209626
14914 209626 199183 116885 56182 78998 121230 134649 117624 125139 166530 170774 156788 124222
14902 124222 113087 104868 125085 92619 70748 89074 81686 79195 112726 115359 134219 129120
14890 129120 122624 102451 73567 101505 130585 149680 156714 137044 157675 172554 152965 138728
14878 138728 168565 182171 217310 247241 219078 190525 153085 189965 166283 162453 152991 180503
14866 180503 137219 93311 77110 91272 127065 104832 142429 178796 212921 176604 154168
14855 154168 120140 103160 110712 146885 153987 135180 97633 81104 90918 118986 117837 154872
14843 154872 168392 125281 120386 154194 200651 166654 101390 103712 117944 105254 107206 113562
14831 113562 142138 153641 136667 158121 186861 168057 132622 115607 141272 182356 186309 212074
14819 212074 192357 181167 149616 129197 112830 138519 168627 222946 230393 252454 242413 206094
14807 206094 221394 172188 172036 158122 109474 74490 145991 152678 158642 126063 99143 151029
14795 151029 162484 124204 142831 187391 221329 185814 193746 218993 185867 221844 252325 218322
14783 218322 197650 223721 232205 179813 187555 208640 210101 149456 163066 221757 224360 206465
14771 206465 112181 98118 49336 95732 155267 247573 276732 259354 231821 219667 231908
14760 231908 206486 182988 131980 169030 173652 190480 253623 252956 260318 269625 278269 244691 204528
14747 204528 253125 323188 320157 341669 288353 271047 285309 302550 262585 211034 194848 194790
14735 194790 184900 170928 193052 156690 150235 231189 239856 194511 175411 162677 201565 232173
14723 232173 258225 259304 264413 217681 183700 157739 161433 166378 148481 150703 117111 105326
14711 105326 175287 252311 257594 242227 229618 244138 276651 273416 250115 232766 213485 203893
14699 203893 213616 183447 179494 228019 212417 147200 206412 281584 245974 212660 200276 196304
14687 196304 186910 168223 177186 215761 234925 242129 218437 247823 215503 197948 239679 211026
14675 211026 244160 312188 296188 254760 201224 204482 250722 234066 232238 225660 229491 247157
14663 247157 224458 218924 260529 272971 261047 244014 234814 182250 212105 254703 257504 272671
14651 272671 278105 303171 263259 232919 233370 232246 231180 225233 206211 185054 170040 134942 127358
14638 127358 160400 192724 239448 252868 231729 243442 254653 270718 243469 216354 218764 206047
14626 206047 176595 150074 98173 110663 153996 200564 249320 295624 252174 210831 210630 254132
14614 254132 250189 222728 223107 239925 211986 237797 308659 307029 283935 267214 252819 263266
14602 263266 289547 271924 292340 282701 220071 198973 214723 214996 218874 216602 194538 238765
14590 238765 256695 209165 215355 162355 184291 138556 120349 141990 207898 241512 237032 222369
14578 222369 226788 243836 285355 344531 346528 314627 325153 320467 327656 332948 310161 256819
14566 256819 281687 313041 287976 319781 309149 307666 345325 317103 315190 315060 331360 306576
14554 306576 322573 353749 346672 324584 297832 339914 296761 295107 291636 333066 344365 327817
14542 327817 325257 303786 268038 190285 195180 211276 161778 176243 261115 244737 252907 271671
14530 271671 251911 279475 270694 308383 323233 306700 340811 344464 368372 424128 455620 413355
14518 413355 378024 343775 335642 333908 342989 293577 272307 270313 235540 272162 306426 275932
14506 275932 305815 289818 291157 331449 323032 313482 359356 337206 364475 348063 323792 331273
14494 331273 348945 322493 317217 345001 338084 355290 379053 343248 384520 423728 433507 412812
14482 412812 404670 361459 354812 335568 343032 402797 394162 384650 368505 413360 415509 414862 373097
14469 373097 384824 433231 390963 384027 402661 379655 323262 328212 315363 289438 334915 390066
14457 390066 454353 479743 446637 467249 459266 382256 422845 488197 455713 392883 362463 349813
14445 349813 394676 402142 362353 318543 324684 328452 330567 302126 313086 331452 347180 348479
14433 348479 365695 369918 375992 369579 354949 330755 278112 297156 324879 281654 273660 306481
14421 306481 300708 295727 344915 362483 396972 378301 373743 412710 413071 394036 345530 332258
14409 332258 325244 327365 310322 305104 331429 307325 253098 315283 361266 338906 320767 333684
14397 333684 345800 359718 367275 385853 381077 387122 400932 397158 383574 388588 363348 323625
14385 323625 358008 367261 348990 336948 364510 386431 401069 355467 335958 375648 345971 311897
14373 311897 347211 350033 369180 366805 406033 399887 430532 436819 422880 437244 407410 364885
14361 364885 405466 428538 427556 425437 400729 388457 399877 378558 394505 393929 419216 427806 408349
14348 408349 412365 432895 445737 420279 397881 406654 409689 439214 438269 477132 482742 456528 421066
14335 421066 398764 393286 385451 407249 454718 489316 431685 390987 348829 354110 368565 424453
14323 424453 450521 448951 448218 409168 381761 359007 297302 342953 400455 385615 367951 386250
14311 386250 430420 500471 492908 423259 404119 420190 438261 501937 535653 510915 501616 467572
14299 467572 425852 451191 471831 467744 484763 470142 445833 430581 466461 520588 546822 461051
14287 461051 417290 469380 441042 409618 405915 429343 455540 427032 439161 448560 435707 472847
14275 472847 445603 440760 412691 416087 435734 469407 461447 500462 525921 541899 510882 460984
14263 460984 453503 473253 481762 474376 451558 495008 494696 433066 400035 348080 359260 352583 336493
14250 336493 377645 437621 452363 458041 430665 423935 429689 477350 425596 319253 303057 361638
14238 361638 420250 444902 468555 445961 445811 458790 495417 516865 504893 440830 419852 410608
14226 410608 348305 408077 479220 464398 432636 432766 406733 387409 463277 502230 500465 510224
14214 510224 509545 498228 426195 391550 402071 380437 382750 414349 470678 503008 559678 546442
14202 546442 508111 520207 561435 568539 574774 588567 565622 568324 529917 508754 499566 491509
14190 491509 501432 498510 480690 446057 389939 457906 518075 518424 490202 498440 482557 470209
14178 470209 458639 456719 435967 479210 488313 511331 487292 456888 480014 467423 462216 507954
14166 507954 531956 514718 511601 481126 443252 492499 441606 447447 480184 453199 467625 538482
14154 538482 551283 496299 547089 616756 643958 631027 526981 523413 519437 538595 613936 606128
14142 606128 594549 572306 562779 548573 546562 515025 514903 521278 534139 540804 572498 555933 529423
14129 529423 553618 522098 541347 586871 602960 610070 575555 542434 562061 587960 634203 663332
14117 663332 634880 606505 573159 584150 572810 549209 531103 544491 545332 529450 502085 521870
14105 521870 545712 515867 538385 557677 535944 548464 579271 606576 597480 547376 506967 509580
14093 509580 499408 462243 515529 525763 533623 507125 499926 516976 572484 601357 570747 596372
14081 596372 608132 623257 621879 630783 625240 638044 622802 578259 564420 610950 613236 631482
14069 631482 619796 604581 582253 558661 554919 546972 533980 536406 525131 498781 508191 512111
14057 512111 522061 531693 531785 546712 591121 621828 606884 595931 613580 663596 646677 567843
14045 567843 582517 586434 576003 593139 641854 629114 613266 632383 605193 579761 540619 501861
14033 501861 527076 598716 632488 679761 716673 717462 650105 614283 642024 612685 612465 557872
14021 557872 564101 560518 629124 667081 653062 604332 558067 547966 568368 579504 563399 560970
14009 560970 543346 565808 652329 644304 626458 596882 583081 608092 631566 621692 630935 645275
13997 645275 637779 613547 677732 760648 742591 709086 682622 654899 631342 664972 700731 694800
13985 694800 680349 616545 569844 542719 553240 622732 703313 735016 714361 680678 643949
13974 643949 638234 682318 701663 638000 610817 639944 696674 725796 675112 673972 680230 693971
13962 693971 711170 732309 729615 689642 682084 682210 703987 703914 719774 726988 735580 735400 747100 711281
13948 711281 672984 654694 640102 680592 680206 639131 602666 652207 695019 691556 736294 743847
13936 743847 701576 731936 734554 685166 664238 663711 666620 681563 669856 693869 727014 771344
13924 771344 834369 862970 867090 883535 880345 810448 758520 774607 783289 819497 813854 789620
13912 789620 784526 723426 684000 639734 662235 676547 714254 754181 783737 773780 741353 760340
13900 760340 739489 779889 858350 827512 771340 761470 742908 708535 706654 720575 716292 703491
13888 703491 708963 789997 823979 821113 778336 687170 651387 635046 690227 716019 680932 675706
13876 675706 711234 806219 793474 762293 787323 782322 781565 806683 778277 796818 833697 885007
13864 885007 861827 769824 737512 811894 847397 861623 876527 854553 878131 871800 822623 815641
13852 815641 835095 848601 860364 855812 864038 830767 827523 840798 775537 816434 806197 806806
13840 806806 787779 776560 810165 769316 779711 808880 788167 833118 878642 947725 967412
13829 967412 906240 882803 921819 900579 898648 906275 910234 897481 868536 830651 804484 860900
13817 860900 870320 897090 875371 857809 876620 851025 860897 917887 945230 959042 915324 896738
13805 896738 946046 964906 930123 898615 866899 833362 852427 847179 831663 807187 849333 933274
13793 933274 923143 923379 930224 905568 885071 902911 924334 903565 858693 867994 879030 927520
13781 927520 903421 897540 915933 925955 903892 895494 909178 900145 871538 904907 899984 924848
13769 924848 935135 920951 1005745 996397 906156 909065 952827 970825 956216 925318 920757 896461
13757 896461 942444 926412 874603 857726 894690 933743 906033 948008 983338 964179 925509
13746 925509 923867 970740 1036860 1061140 1039537 1013078 1042900 1076291 1062175 1107519 1066179 1076836
13734 1076836 1094304 1030620 995867 964000 984697 1004316 1026010 1054255 1075883 1017493 996847
13723 996847 1028110 1030652 991672 979658 1002352 984714 1026790 1035252 1056515 1040616 1022922 990145
13711 990145 994223 1018960 1016874 1041653 1083493 1097894 1089479 1077159 1113914 1134715 1129880 1152506
13699 1152506 1115805 1098492 1061103 1069064 1105963 1127470 1114139 1104764 1064884 1068439 1081819 1084654
13687 1084654 1058227 1040431 1063514 1071644 1034196 1051672 1092499 1144216 1099516 1105738 1163446 1158560
13675 1158560 1128620 1125361 1107740 1126562 1133091 1113941 1137167 1133516 1107787 1088919 1096133 1063334
13663 1063334 1045878 1075419 1116037 1143883 1150716 1147001 1107311 1102746 1165488 1204113 1154985 1114753
13651 1114753 1114447 1111123 1081823 1113366 1139220 1166286 1157468 1132207 1097464 1108105 1128566 1132033
13639 1132033 1129550 1147672 1113389 1090251 1089702 1096162 1106278 1106583 1146102 1224584 1273642 1263090
13627 1263090 1272977 1248302 1205415 1187080 1194180 1152481 1142335 1144605 1161726 1183664 1196446 1185285
13615 1185285 1234871 1240311 1227064 1191409 1202812 1190369 1174541 1232941 1205727 1199885 1205647 1252732
13603 1252732 1255449 1200412 1158401 1208390 1248184 1231797 1207007 1228251 1231298 1252198 1274013 1281202
13591 1281202 1224995 1203117 1193561 1224295 1273695 1292247 1317248 1325387 1308054 1322676 1337483 1345596
13579 1345596 1334926 1301002 1279909 1321073 1410153 1405720 1299537 1265570 1262393 1241778 1279142
13568 1279142 1326521 1374049 1341173 1265771 1276869 1316984 1303739 1256556 1276073 1344845 1404954
13557 1404954 1398153 1379324 1352275 1282920 1260745 1320668 1348663 1334906 1351357 1312918 1312137 1318070
13545 1318070 1303522 1334214 1381746 1383063 1355373 1348482 1345815 1369620 1393675 1410408 1411358 1434004
13533 1434004 1496825 1469952 1453853 1448421 1445483 1465423 1431675 1450870 1462779 1397886 1325212 1364943
13521 1364943 1382574 1328178 1380709 1382453 1394923 1413614 1467600 1491878 1468788 1416883 1423701 1454487
13509 1454487 1451792 1408003 1391408 1415034 1447262 1461742 1503711 1550460 1552017 1592122 1605143 1513888
13497 1513888 1493619 1498759 1523682 1518400 1480004 1497037 1538402 1554164 1537923 1567819 1607105 1598438
13485 1598438 1592602 1545563 1527807 1527538 1555465 1589329 1598552 1570615 1534671 1584459 1603336 1629469
13473 1629469 1631796 1645004 1668264 1658547 1680301 1712146 1691784 1661749 1671798 1646368 1667976 1721974
13461 1721974 1731330 1726961 1749443 1723158 1726526 1726317 1735974 1722707 1703469 1703378 1726124 1682150 1687859
13448 1687859 1682994 1710106 1716825 1744152 1800057 1766426 1722132 1687770 1672247 1702319 1715463 1760748
13436 1760748 1739974 1723612 1755017 1782923 1797142 1846574 1833122 1834845 1862534 1851109 1793034
13425 1793034 1825527 1830512 1846629 1860665 1877588 1916922 1903596 1845351 1865067 1907562 1944425
13414 1944425 1933532 1942170 1928654 1959616 1986577 1971028 1935681 1921732 1937186 1964838 2044207
13403 2044207 2071313 2048585 1991644 1968931 1941298 1971357 2022235 2015397 2034142 2094991 2082416
13392 2082416 2097680 2102895 2069209 2092495 2146117 2146766 2087911 2074569 2038770 2071125 2176320 2244805
13380 2244805 2263137 2283697 2328814 2398511 2440661 2488154 2551588 2606654 2684174 2773550 2903655
13369 2903655 3093705 3210630 3117870 2721849 2072708 1375847 976693 917034 1049379 1183841
13359 1183841 1286249 1374789 1420949 1483792 1537395 1573096 1624307 1676505 1709036 1747864 1758138
13348 1758138 1793042 1839469 1870553 1847662 1854986 1810640 1822702 1859114 1841224 1794448 1807157
13337 1807157 1850394 1894270 1905107 1913051 1976869 2038788 2036578 2035114 2075526 2086821 2064343 2070698
13325 2070698 2160203 2257589 2208882 2182763 2159683 2134656 2165452 2218783 2217151 2191519 2215917
13314 2215917 2254959 2230696 2218977 2246375 2235310 2273887 2261411 2238941 2309867 2313036 2318858 2335700
13302 2335700 2274206 2247078 2293083 2319820 2305303 2323421 2296898 2291074 2341846 2344948 2325258 2314117
13290 2314117 2345724 2390010 2336432 2300054 2376389 2444177 2452232 2394377 2350313 2368584 2405458
13279 2405458 2424444 2468042 2478523 2489586 2491989 2465677 2482461 2462682 2449992 2478506 2520818
13268 2520818 2500364 2468010 2502507 2530777 2546277 2627008 2696994 2694221 2637515 2606266 2648294
13257 2648294 2661022 2674707 2638923 2647408 2698299 2688723 2690436 2678270 2655630 2665716 2683682 2737835
13245 2737835 2758797 2788943 2785403 2738850 2777947 2783672 2806429 2846804 2850957 2797764 2833167 2921456
13233 2921456 2901210 2912261 2883912 2869009 2893380 2936766 2965472 2971235 2986587 3014930 3065312
13222 3065312 3083105 3099019 3090480 3090783 3061615 3050769 3061292 3054463 3049098 3023216 3051508 3090043
13210 3090043 3164517 3169362 3193033 3193039 3174397 3150908 3170875 3164893 3208300 3196879 3200596 3221099 3268750
13197 3268750 3285135 3274875 3323708 3345189 3289423 3301858 3344736 3371229 3375115 3368826 3399961 3410088
13185 3410088 3373335 3345261 3401783 3445310 3477210 3503381 3508368 3561994 3579680 3614624 3624231 3641051
13173 3641051 3686235 3720780 3735043 3688501 3716518 3791556 3860926 3998378 4029736 4016926 4008177
13162 4008177 3971545 3916636 3854568 3765235 3657757 3634542 3662207 3717970 3740793 3789629 3808812
13151 3808812 3814910 3820756 3846345 3846891 3884294 3936587 3979317 4043011 4053338 4014273 4009610 4045529
13139 4045529 4101453 4071574 4107553 4152181 4138207 4219545 4271999 4257815 4301787 4380344 4407460
13128 4407460 4361347 4377215 4441326 4476555 4456081 4488401 4518641 4507209 4518551 4595505 4615104
13117 4615104 4641437 4663040 4721512 4697516 4699283 4692189 4699631 4730342 4771392 4757653 4783921 4807381
13105 4807381 4798891 4842380 4892050 4906851 4943017 5060735 5145510 5143346 5168137 5171229 5142591 5180111
13093 5180111 5234588 5245486 5291467 5342537 5379202 5387340 5415387 5483060 5446242 5432721 5470939
13082 5470939 5536137 5559303 5613493 5655497 5735577 5777552 5797178 5851349 5926356 5961389 5985248
13071 5985248 6025638 6062683 6125710 6154907 6142022 6138840 6120230 6120193 6156757 6239260 6343593 6461371
13059 6461371 6498299 6541235 6552252 6566523 6613470 6660996 6761014 6817162 6896873 6936355 6932775
13048 6932775 6978859 7061620 7108974 7195056 7232521 7252345 7305104 7385554 7425454 7481419 7555996
13037 7555996 7584063 7600032 7604062 7601406 7623289 7750505 7844358 7903805 7960657 8033204 8133101
13026 8133101 8300472 8408097 8448428 8488476 8560708 8629674 8724119 8805646 8916389 9053261
13016 9053261 9160837 9230632 9321823 9434962 9526132 9634216 9720133 9794650 9861605 9979492
13006 9979492 10107467 10221559 10317245 10374243 10452465 10568184 10649567 10790501 10931395 11033448
12996 11033448 11149566 11224498 11363581 11541224 11687349 11833664 11981626 12148631 12328871
12987 12328871 12475813 12636677 12769743 12907959 13115073 13296202 13483771 13722768 13975415
12978 13975415 14190435 14386668 14636472 14854877 15087113 15283726 15516608 15803384 16044470
12969 16044470 16270483 16519798 16721945 16968353 17291972 17566009 17848455 18169966 18543390
12960 18543390 18951255 19351323 19753762 20118253 20538892 20979850 21465268 22001091 22497160
12951 22497160 23028874 23536580 24098692 24682772 25252060 25912884 26606268 27308306 28020142
12942 28020142 28817474 29658048 30562881 31561040 32628596 33760292 34995207 36359398 37814223
12933 37814223 39361373 41053277 42828664 44737361 46874091 49234163 51751207 54450824
12925 54450824 57486783 60917516 64738342 68809190 72995170 77574855 83125039 90081001
12917 90081001 98776228 109472426 122782498 139458453 160660580 187256253 217878406
12910 217878406 240499867 217124373 115889173 -28076411 -158761846 -219295839 -219650380
12903 -219650380 -196323015 -170926550 -149504851 -132080350 -117759806 -105858252 -95921560
12896 -95921560 -87812000 -81441987 -76279648 -71752036 -67493605 -63446769 -59727651 -56387926
12888 -56387926 -53390861 -50738381 -48378623 -46270451 -44308807 -42483516 -40804560 -39237325
12880 -39237325 -37843447 -36596602 -35450899 -34422718 -33422825 -32401057 -31464896 -30536922
12872 -30536922 -29610822 -28758173 -27977298 -27215112 -26546411 -25935117 -25326069 -24721906 -24144656
12863 -24144656 -23596239 -23027502 -22512578 -22020008 -21577043 -21166586 -20728557 -20290209 -19952542
12854 -19952542 -19656133 -19341973 -19049603 -18707514 -18290797 -17936204 -17674755 -17371300 -17013546
12845 -17013546 -16723021 -16442339 -16201865 -15951415 -15749645 -15504458 -15323695 -15187985 -15007959
12836 -15007959 -14763327 -14525699 -14338119 -14182868 -13997704 -13801687 -13625682 -13417642 -13230689
12827 -13230689 -13066138 -12840043 -12652153 -12500542 -12373718 -12249664 -12121816 -12032770 -11853567
12818 -11853567 -11693231 -11565866 -11388649 -11276135 -11209008 -11122587 -11014527 -10882551 -10752562 -10628041
12808 -10628041 -10520518 -10437166 -10335491 -10215355 -10114815 -10024502 -9933391 -9825222 -9759325 -9674230
12798 -9674230 -9577836 -9529890 -9433094 -9343719 -9252972 -9108875 -9036130 -8925338 -8882231 -8833649 -8741613
12787 -8741613 -8630992 -8566524 -8508563 -8460858 -8433379 -8495918 -8544142 -8460068 -8319770 -8298307 -8228674
12776 -8228674 -8183127 -8115099 -8041625 -7996692 -7970521 -7914514 -7804564 -7765961 -7711236 -7619661 -7569985
12765 -7569985 -7512344 -7467473 -7391968 -7332578 -7302071 -7288636 -7195788 -7139506 -7088614 -7052480 -7029497
12754 -7029497 -7007285 -6961199 -6957401 -6902724 -6791294 -6754566 -6695497 -6589484 -6476609 -6437383 -6417563
12743 -6417563 -6425385 -6411809 -6394450 -6388214 -6363481 -6332009 -6332080 -6307089 -6261416 -6241170 -6205121 -6214533
12731 -6214533 -6132286 -6007036 -5945056 -5948388 -5908583 -5853844 -5866929 -5832939 -5778496 -5709639 -5710193 -5679027
12719 -5679027 -5577948 -5549511 -5483728 -5491229 -5517257 -5565213 -5658887 -5661859 -5610120 -5541932 -5503705
12708 -5503705 -5451553 -5380471 -5305303 -5281894 -5248225 -5205925 -5231789 -5273909 -5209742 -5171066 -5090356
12697 -5090356 -4995617 -4929359 -4951031 -5008999 -5022628 -4978295 -4903217 -4892689 -4893471 -4896846 -4848352 -4834223
12685 -4834223 -4801614 -4752628 -4705142 -4678647 -4692768 -4716931 -4720009 -4755389 -4718502 -4685929 -4671446
12674 -4671446 -4711209 -4712974 -4654059 -4619403 -4570055 -4530812 -4515293 -4482162 -4496897 -4487809 -4411039 -4411924
12662 -4411924 -4418625 -4451979 -4383980 -4342408 -4282691 -4246562 -4258350 -4235358 -4252562 -4252538 -4298498 -4358033
12650 -4358033 -4335493 -4307739 -4255411 -4261371 -4197157 -4135393 -4120763 -4120499 -4115315 -4054769 -4025978 -3988532
12638 -3988532 -4026098 -4069848 -4108727 -4064562 -4034466 -3999995 -3969747 -3920077 -3868778 -3924566 -3989439
12627 -3989439 -3960177 -3930224 -3926962 -3911544 -3924343 -3935014 -3935944 -3905980 -3818538 -3771813 -3787571 -3804048
12615 -3804048 -3811522 -3754143 -3674024 -3668034 -3681896 -3642588 -3610758 -3636451 -3668490 -3636132 -3603916 -3638314
12603 -3638314 -3629941 -3614311 -3614932 -3582997 -3496890 -3455855 -3473309 -3460361 -3410165 -3368605 -3393036 -3402982
12591 -3402982 -3350113 -3391228 -3398650 -3350474 -3323846 -3317814 -3361878 -3411441 -3356507 -3317994 -3337350 -3376359
12579 -3376359 -3337496 -3304700 -3279711 -3279287 -3292281 -3339432 -3338017 -3359059 -3320764 -3289888 -3275810 -3235811
12567 -3235811 -3215249 -3215817 -3217169 -3199866 -3230436 -3223515 -3149754 -3081005 -3042435 -3037866 -3062111 -3075036
12555 -3075036 -3117481 -3112608 -3106963 -3134361 -3099142 -3075664 -3082395 -3102445 -3092791 -3042022 -3048956 -3071347
12543 -3071347 -3085279 -3051932 -2982770 -2938612 -2963030 -2972220 -2957238 -2975616 -2953393 -2924227 -2892844
12532 -2892844 -2919885 -2937803 -2913270 -2889484 -2873030 -2864161 -2812226 -2822895 -2850546 -2848345 -2796405 -2766803
12520 -2766803 -2788770 -2760709 -2775881 -2802310 -2792711 -2739888 -2746318 -2793135 -2772306 -2690327 -2686317 -2699601
12508 -2699601 -2715817 -2728078 -2668599 -2636258 -2704541 -2731041 -2706906 -2709013 -2654833 -2626403 -2619673 -2595727
12496 -2595727 -2560634 -2552531 -2502551 -2501420 -2512168 -2537690 -2515624 -2523670 -2582312 -2620679 -2580094 -2565000
12484 -2565000 -2555983 -2521039 -2533865 -2541264 -2514199 -2498094 -2448912 -2431511 -2441189 -2476123 -2496086 -2439167
12472 -2439167 -2415566 -2420954 -2446741 -2478247 -2449270 -2410791 -2355392 -2322070 -2315002 -2320105 -2266342 -2220408
12460 -2220408 -2177130 -2128519 -2111251 -2106649 -2119069 -2079360 -2015255 -1964268 -1874609 -1837037 -1787443
12449 -1787443 -1770360 -1689970 -1579603 -1452520 -1291837 -1239215 -1475222 -2057602 -2769888 -3330306
12439 -3330306 -3543556 -3524032 -3471446 -3366492 -3235831 -3140529 -3064793 -2960997 -2918210 -2844614
12429 -2844614 -2754393 -2753176 -2732210 -2694118 -2680488 -2665900 -2621939 -2597590 -2553869 -2580756 -2644020
12418 -2644020 -2673973 -2651639 -2613045 -2608636 -2583459 -2548656 -2538566 -2511752 -2490616 -2481085 -2456363 -2409396
12406 -2409396 -2360487 -2347997 -2381028 -2374685 -2366294 -2337586 -2341400 -2297903 -2310729 -2338001 -2354714 -2404353
12394 -2404353 -2387147 -2378960 -2361415 -2374745 -2337939 -2301509 -2283650 -2270924 -2237847 -2166142 -2136378
12383 -2136378 -2182487 -2222776 -2219702 -2231091 -2210949 -2255154 -2277947 -2230545 -2222075 -2269017 -2338295 -2254263
12371 -2254263 -2250439 -2275819 -2196644 -2149495 -2119286 -2103557 -2170528 -2239977 -2303099 -2317234 -2252209
12360 -2252209 -2200498 -2176892 -2156126 -2146083 -2112414 -2125012 -2108965 -2082009 -2086250 -2109661 -2197443
12349 -2197443 -2217284 -2162059 -2183757 -2174278 -2096762 -2082098 -2110597 -2119326 -2107849 -2133105 -2118379 -2073824
12337 -2073824 -2041398 -2079687 -2040221 -2022763 -2009489 -2018865 -2057153 -2044659 -2011998 -2052352 -2061146 -2033967
12325 -2033967 -2018502 -2023090 -1978370 -1966419 -2008034 -2089238 -2087096 -2025954 -2000171 -2021884 -1972587 -1927732
12313 -1927732 -1916674 -1928008 -1962224 -2012053 -1986825 -2010605 -2014892 -1981877 -1967748 -1931794 -1979070
12302 -1979070 -1960285 -1947670 -1992169 -1978617 -1981225 -1976044 -1935837 -1918793 -1921101 -1878747 -1867291 -1813929
12290 -1813929 -1829432 -1825066 -1873768 -1886967 -1889375 -1839773 -1836262 -1826661 -1828611 -1860105 -1931757 -1908252
12278 -1908252 -1866622 -1851580 -1876893 -1906910 -1874590 -1824425 -1871433 -1921872 -1934104 -1925101 -1884973
12267 -1884973 -1829834 -1814110 -1828529 -1860029 -1864140 -1844256 -1889311 -1925827 -1864034 -1841641 -1849091 -1803739
12255 -1803739 -1729162 -1700843 -1721407 -1730999 -1786145 -1813548 -1848459 -1858501 -1844877 -1814040 -1783038
12244 -1783038 -1735612 -1743307 -1754505 -1753674 -1758379 -1759798 -1738269 -1735339 -1775607 -1765849 -1698154 -1737991 -1761189
12231 -1761189 -1765838 -1790028 -1830457 -1866697 -1829204 -1832847 -1841768 -1792567 -1756914 -1711265 -1712818 -1698695
12219 -1698695 -1697950 -1649571 -1662754 -1638385 -1608529 -1612123 -1651646 -1687055 -1720091 -1687497 -1726516 -1759311
12207 -1759311 -1810850 -1781810 -1784381 -1768135 -1731757 -1650911 -1658280 -1692100 -1667663 -1652030 -1665720 -1718498
12195 -1718498 -1765265 -1745023 -1687863 -1690240 -1646040 -1649146 -1683418 -1675655 -1641990 -1621904 -1619852 -1632465
12183 -1632465 -1665376 -1714621 -1729436 -1682786 -1671696 -1663638 -1618391 -1582504 -1623042 -1645130 -1620914
12172 -1620914 -1648097 -1688883 -1631202 -1595552 -1605512 -1578490 -1574895 -1577896 -1604494 -1632906 -1610603 -1620226
12160 -1620226 -1610132 -1602629 -1623814 -1634768 -1630980 -1647494 -1625532 -1616505 -1560497 -1470281 -1467806 -1500632
12148 -1500632 -1506733 -1493052 -1504009 -1525439 -1532447 -1495907 -1519798 -1562784 -1605176 -1626405 -1596966 -1583564
12136 -1583564 -1537533 -1495555 -1506274 -1511448 -1515641 -1536918 -1523959 -1482189 -1474624 -1483838 -1505651 -1544757
12124 -1544757 -1537204 -1529992 -1567610 -1591200 -1543524 -1513515 -1518932 -1540931 -1545104 -1560025 -1583826 -1541952
12112 -1541952 -1558960 -1544252 -1545533 -1535919 -1527656 -1484020 -1431299 -1484776 -1531947 -1472342 -1427967 -1456954
12100 -1456954 -1465283 -1482184 -1442946 -1501004 -1555917 -1580726 -1549374 -1536782 -1548002 -1550859 -1533590 -1508330
12088 -1508330 -1520462 -1516515 -1517344 -1505063 -1532669 -1462143 -1411168 -1423436 -1475815 -1485427 -1426799 -1412797
12076 -1412797 -1403904 -1401121 -1360019 -1359964 -1439033 -1467289 -1483222 -1501704 -1485426 -1482819 -1465178 -1421060
12064 -1421060 -1453601 -1454795 -1444262 -1406757 -1378105 -1400212 -1452843 -1516875 -1452573 -1400902 -1408469 -1407173
12052 -1407173 -1411931 -1389022 -1339321 -1355776 -1380238 -1449715 -1417722 -1385032 -1413184 -1383690 -1382727 -1418898
12040 -1418898 -1434975 -1407053 -1332253 -1350395 -1389604 -1394969 -1413948 -1440552 -1451682 -1413429 -1355504
12029 -1355504 -1351735 -1339073 -1316759 -1335091 -1367686 -1388403 -1409882 -1390659 -1381070 -1387114 -1358763 -1318944
12017 -1318944 -1335512 -1348592 -1429020 -1454750 -1436414 -1423248 -1388137 -1362090 -1360093 -1364488 -1316953 -1258208
12005 -1258208 -1232574 -1229993 -1235320 -1284520 -1286308 -1300737 -1286554 -1258112 -1293229 -1363656 -1390827 -1376187
11993 -1376187 -1374134 -1341453 -1341967 -1325772 -1332581 -1349383 -1337119 -1280592 -1263718 -1307143 -1344028 -1321844
11981 -1321844 -1253563 -1229830 -1273711 -1330959 -1394138 -1405399 -1345847 -1301650 -1330842 -1304243 -1320324
11970 -1320324 -1323192 -1290191 -1275840 -1350649 -1329864 -1341192 -1383794 -1370644 -1338637 -1288037 -1272632
11959 -1272632 -1244488 -1213527 -1263350 -1214475 -1208130 -1247997 -1280339 -1340777 -1333544 -1304341 -1313619 -1319945
11947 -1319945 -1345053 -1291875 -1300192 -1345252 -1326983 -1247735 -1235510 -1224339 -1243888 -1278164 -1337783
11936 -1337783 -1329270 -1325251 -1298915 -1290664 -1284904 -1270472 -1275638 -1273247 -1269761 -1265224 -1281859 -1298186 -1335629
11923 -1335629 -1352935 -1293408 -1319020 -1311360 -1312093 -1271657 -1247843 -1259789 -1277836 -1293370 -1288354 -1253978
11911 -1253978 -1223145 -1241202 -1241058 -1192286 -1169512 -1179444 -1188961 -1142869 -1122671 -1102511 -1095711 -1126873
11899 -1126873 -1136788 -1186654 -1225726 -1209584 -1197630 -1152531 -1161458 -1210562 -1192704 -1203637 -1237146 -1249827
11887 -1249827 -1266265 -1242776 -1207444 -1170914 -1187817 -1240794 -1233660 -1208578 -1194993 -1224147 -1208587
11876 -1208587 -1167756 -1108340 -1081649 -1113024 -1157198 -1203258 -1243598 -1256255 -1217680 -1176866 -1186142
11865 -1186142 -1199567 -1203637 -1192623 -1190285 -1195546 -1201630 -1196116 -1226553 -1252865 -1239735 -1201156 -1160996
11853 -1160996 -1127883 -1041440 -1059302 -1048789 -1040785 -1073827 -1055186 -1122628 -1131078 -1124089 -1144043 -1106171
11841 -1106171 -1111872 -1104503 -1120661 -1127283 -1090807 -1039245 -1052579 -1059275 -1062577 -1051723 -1119050 -1133048
11829 -1133048 -1170778 -1206295 -1255847 -1225005 -1178497 -1160388 -1110281 -1071674 -1055779 -1090269 -1154476
11818 -1154476 -1163688 -1151416 -1147304 -1158318 -1162938 -1174435 -1155665 -1124264 -1074812 -1060093 -1086340 -1073138
11806 -1073138 -1056966 -1031114 -1075985 -1154421 -1178114 -1190188 -1194265 -1177557 -1137581 -1080055 -1056878
11795 -1056878 -1078569 -1091209 -1057380 -1030367 -1014170 -1017704 -1068326 -1084317 -1050252 -1053599 -1089667 -1123607
11783 -1123607 -1129777 -1100425 -1062450 -1081459 -1053146 -1058016 -1052116 -1046243 -1064408 -1053419 -1087683 -1118963
11771 -1118963 -1114495 -1117288 -1087616 -1050942 -1054874 -1065564 -1056977 -1053613 -1091635 -1087962 -1086211 -1057109 -1082761
11758 -1082761 -1101975 -1094324 -1088569 -1096331 -1084036 -1042530 -1029920 -1075070 -1071230 -1053482 -1018936 -994881
11746 -994881 -966739 -996154 -1077723 -1132259 -1173157 -1152170 -1094128 -1039436 -1036953 -1011326 -1032466 -1064404
11734 -1064404 -1111674 -1120524 -1120151 -1126730 -1075688 -1039552 -1062064 -1115757 -1118897 -1093309 -1048381 -1040163
11722 -1040163 -993699 -966629 -973054 -970482 -1013845 -1039082 -994928 -968037 -1021053 -1080011 -1102757 -1102267
11710 -1102267 -1071488 -1014889 -990577 -1033278 -1031364 -988825 -970643 -964605 -965917 -942557 -931354 -924102
11698 -924102 -920742 -926884 -980310 -1017487 -1046909 -1007345 -1055041 -1076757 -1095595 -1036321 -999505 -1037490
11686 -1037490 -1068854 -1004523 -953288 -904047 -906932 -896998 -938673 -1000075 -1013364 -1050312 -1009077 -1006305
11674 -1006305 -1038702 -1067061 -1075632 -1099647 -1093050 -1096162 -1057214 -1009083 -976103 -1032014 -1048071 -1029112
11662 -1029112 -1007361 -1012448 -1057732 -1074639 -1085218 -1088183 -1054308 -1021062 -1000677 -1027475 -1041198 -1043205
11650 -1043205 -1021526 -1006526 -973547 -967402 -984860 -1044661 -1104395 -1087229 -1013950 -1037035 -1078553
11639 -1078553 -1058026 -1044137 -1019485 -969388 -939919 -915510 -949189 -989179 -1003165 -1012398 -985494
11628 -985494 -994259 -1000874 -994273 -1022049 -1002638 -995420 -995301 -983474 -1026169 -1059668 -1046983 -1068082 -1048491
11615 -1048491 -953107 -934462 -986278 -969897 -1022468 -984164 -956834 -972078 -1032542 -1031628 -964024 -995350
11603 -995350 -959408 -972648 -972076 -938405 -968834 -997807 -1001411 -968847 -985825 -1013394 -1003354 -959531
11591 -959531 -976718 -1022683 -1040959 -961890 -939880 -953041 -931429 -946146 -983815 -974621 -1006603 -1038647
11579 -1038647 -1023161 -965933 -949761 -958433 -899911 -890363 -914124 -938807 -946564 -941268 -940009 -980523
11567 -980523 -974091 -943403 -902194 -879050 -966192 -999424 -1000628 -962388 -917299 -900613 -889100 -927579
11555 -927579 -927575 -918788 -910460 -941919 -989184 -955517 -893576 -877674 -835880 -839858 -829436 -874286 -878938
11542 -878938 -872577 -863148 -907396 -902622 -873511 -871677 -827838 -840111 -918479 -935669 -922890 -939845
11530 -939845 -935549 -897233 -894860 -953006 -949303 -947069 -928592 -879581 -797964 -798680 -807817 -849503 -889138
11517 -889138 -862058 -906895 -946493 -974252 -951646 -904423 -848419 -815551 -860555 -874877 -876335 -847707
11505 -847707 -821799 -789916 -795031 -847774 -875116 -854922 -862619 -872356 -833528 -876494 -924383 -925055
11493 -925055 -910288 -909139 -889318 -911890 -919613 -891574 -857470 -832301 -857439 -866764 -875861 -921894
11481 -921894 -927943 -933100 -973612 -931917 -887195 -890208 -858136 -836918 -829875 -861175 -857409 -827623
11469 -827623 -835339 -850196 -825796 -790920 -838603 -890594 -933082 -925871 -948682 -884247 -809446 -785955
11457 -785955 -828545 -849696 -902890 -923699 -904351 -914283 -874796 -830948 -841809 -865287 -853392 -838737
11445 -838737 -890674 -912802 -916915 -909883 -845754 -889404 -988208 -974151 -936617 -919931 -900954 -894429
11433 -894429 -875052 -854133 -860714 -906769 -933171 -939236 -877451 -856535 -846316 -822766 -827238 -841211
11421 -841211 -805520 -808388 -839355 -808179 -815372 -825687 -837666 -880269 -874631 -877625 -879561 -880252 -871792
11408 -871792 -841449 -862145 -976437 -994139 -979552 -943720 -936433 -884706 -810261 -833266 -838432 -811466
11396 -811466 -801738 -810603 -843446 -859658 -856726 -810680 -794877 -837991 -880878 -893177 -904549 -927169
11384 -927169 -922584 -874285 -874769 -835960 -792155 -790964 -809516 -785994 -749789 -739176 -782146 -790049
11372 -790049 -767566 -759208 -746854 -803583 -813250 -828780 -832180 -768626 -765002 -809436 -831427 -836510
11360 -836510 -855861 -854450 -867990 -864087 -830149 -799406 -840775 -949506 -945181 -918032 -914539 -897262
11348 -897262 -866317 -883058 -934666 -944798 -919866 -890528 -856362 -832341 -829467 -800173 -793120 -809839
11336 -809839 -822350 -819122 -832010 -792203 -773171 -757964 -775232 -786081 -791295 -846204 -872872 -856904
11324 -856904 -837169 -834930 -869563 -840079 -839890 -870968 -886837 -839281 -834538 -811405 -805159 -806549 -800956
11311 -800956 -788406 -801931 -812143 -784987 -752318 -752090 -794018 -828237 -797927 -785040 -810837 -766374
11299 -766374 -782298 -797985 -811140 -808425 -825140 -824338 -779836 -806777 -858481 -835079 -843067 -859662
11287 -859662 -849831 -888736 -843266 -819787 -794929 -738027 -680391 -692186 -753511 -823806 -813514 -798027
11275 -798027 -795499 -790638 -780000 -801972 -822632 -825562 -793705 -794119 -793348 -790216 -766185 -770806 -751054
11262 -751054 -795016 -823830 -805085 -824635 -815641 -759055 -783575 -774389 -744530 -729402 -751720 -765098
11250 -765098 -812437 -824905 -815154 -792720 -753941 -790908 -832787 -801918 -759143 -729790 -663587 -680382
11238 -680382 -688201 -738405 -776865 -800997 -760745 -729157 -741948 -751696 -766658 -803310 -798053 -811330
11226 -811330 -821963 -766401 -789800 -789920 -783048 -817029 -810074 -786084 -793797 -786527 -739050 -719812 -754265
11213 -754265 -740059 -727344 -725750 -722711 -704821 -715866 -749833 -788941 -771612 -744961 -752267 -797814
11201 -797814 -824665 -808831 -757021 -734934 -733654 -755442 -782123 -799085 -794002 -800204 -774540 -783863
11189 -783863 -765432 -763682 -772310 -739665 -753821 -791857 -824460 -808126 -765098 -726937 -750356 -743256
11177 -743256 -771079 -767691 -779286 -796257 -803101 -778705 -788451 -795361 -817877 -788591 -777494 -749479
11165 -749479 -750839 -689921 -683805 -752953 -760998 -768201 -714343 -729478 -720082 -734704 -737556 -755435 -729497
11152 -729497 -733906 -756478 -729090 -730269 -755867 -755861 -716602 -693879 -689001 -721891 -755577 -772699 -743066
11139 -743066 -732533 -745194 -734762 -702952 -748987 -780984 -729010 -670596 -653060 -637490 -661933
11128 -661933 -725367 -727657 -739945 -784749 -851181 -809668 -726252 -649607 -643893 -725325 -766253 -751395
11116 -751395 -712924 -741031 -727102 -689584 -646069 -617882 -637923 -696426 -716360 -730807 -718138
11105 -718138 -694557 -660922 -646979 -640229 -646479 -595670 -628093 -696456 -746539 -779930 -785130 -762657
11093 -762657 -748883 -734906 -739999 -724647 -670447 -662716 -674467 -687954 -680490 -664611 -682377 -686106
11081 -686106 -635344 -670601 -738658 -750971 -739395 -755805 -750652 -695996 -670189 -648115 -633204 -652900
11069 -652900 -695395 -757729 -804884 -789012 -778239 -737751 -719118 -696586 -683419 -669040 -606412
11058 -606412 -569657 -553824 -587917 -652121 -698316 -707566 -745868 -772291 -769543 -724920 -694283 -668827
11046 -668827 -679904 -685235 -667121 -635924 -611574 -614079 -639233 -633236 -655955 -701905 -684531 -679253
11034 -679253 -677339 -668354 -648807 -625240 -594264 -681981 -766578 -689206 -683314 -686391 -652653 -679969
11022 -679969 -713165 -686378 -731794 -732453 -698988 -744096 -790257 -763486 -715789 -672970 -696817 -724380
11010 -724380 -710801 -670675 -662591 -669550 -686029 -681654 -658032 -650439 -636185 -689037 -746537 -748943
10998 -748943 -731376 -746914 -680578 -668078 -638857 -592836 -617521 -640448 -668322 -654587 -632579
10987 -632579 -684545 -673775 -638343 -627214 -619969 -610126 -622089 -674562 -697396 -689375 -658339 -650654
10975 -650654 -691927 -687473 -647176 -599610 -599285 -633689 -669467 -715095 -765989 -725054 -719552 -685474
10963 -685474 -644257 -628184 -606409 -599085 -590169 -575229 -596047 -637905 -632607 -669594 -667714 -700284
10951 -700284 -715248 -685763 -682185 -695887 -681695 -648548 -593362 -602752 -633516 -640343 -607831 -577409
10939 -577409 -652623 -657325 -615296 -637938 -686336 -708633 -683150 -641523 -656349 -680042 -695663 -715626
10927 -715626 -767984 -720749 -662689 -665859 -638972 -616371 -650839 -662689 -634608 -643121 -662082 -697466
10915 -697466 -688404 -666412 -693409 -691247 -637154 -602141 -648387 -680044 -703400 -689196 -687325 -713428
10903 -713428 -709254 -659180 -595669 -602036 -615147 -624174 -651821 -714344 -706622 -643469 -597352 -586591
10891 -586591 -634873 -644339 -633113 -645483 -694687 -642220 -598001 -597699 -637813 -597132 -591225 -609574
10879 -609574 -646483 -609429 -577869 -568105 -586125 -578956 -562865 -540692 -587911 -614026 -578766 -558866
10867 -558866 -533240 -550365 -584769 -616727 -540168 -524908 -579339 -589474 -564775 -533151 -548080
10856 -548080 -597487 -636455 -668222 -659616 -636693 -608060 -638336 -672677 -655346 -659814 -676374 -642946
10844 -642946 -630878 -613630 -633690 -666863 -663475 -660592 -652178 -668940 -664858 -671547 -652335 -639329
10832 -639329 -537787 -574568 -606609 -636982 -644408 -599746 -649950 -705377 -662436 -620803 -608961
10821 -608961 -612290 -607616 -642028 -683765 -659339 -667192 -656592 -610265 -646172 -657915 -615106 -639718
10809 -639718 -646249 -647975 -637406 -596690 -542493 -517699 -481269 -473645 -486596 -543144 -583792 -624963
10797 -624963 -642985 -680376 -669554 -672667 -625895 -597133 -616327 -620407 -633665 -608626 -572955 -599482
10785 -599482 -626037 -680184 -640943 -560848 -493296 -513733 -560415 -546131 -566271 -609136 -596712
10774 -596712 -595649 -539635 -536768 -538645 -526770 -542989 -572371 -585298 -603913 -576903 -550024 -595861
10762 -595861 -573290 -581137 -582333 -606839 -620976 -647938 -626791 -641706 -635842 -637046 -610728 -580563
10750 -580563 -555584 -573607 -594038 -592846 -559626 -523990 -514254 -561581 -544101 -551385 -570267 -620836
10738 -620836 -600097 -572545 -573544 -571409 -602156 -606090 -645533 -615640 -640481 -673289 -628982 -587219
10726 -587219 -572825 -554777 -606312 -644022 -651067 -662829 -660432 -611518 -558787 -570293 -600415 -616085
10714 -616085 -615724 -635792 -598770 -577590 -584120 -593122 -643339 -634238 -613139 -606537 -592231 -553402 -616071
10701 -616071 -656655 -607096 -534627 -519055 -566639 -588620 -544372 -529678 -551914 -587260 -609669
10690 -609669 -618100 -619296 -627713 -612986 -604218 -590756 -523850 -528952 -532738 -520736 -531950 -553438 -554541
10677 -554541 -535855 -471102 -492641 -502148 -459615 -479581 -564354 -562899 -487234 -447498 -438959 -431128
10665 -431128 -425934 -464244 -499659 -450167 -455265 -511045 -532103 -522179 -502788 -523252 -528002 -543606
10653 -543606 -594579 -617847 -607319 -612436 -629308 -623344 -615222 -562457 -556031 -607381 -625655 -562624
10641 -562624 -550672 -529915 -563593 -593604 -627955 -586986 -589980 -608354 -607600 -568638 -534493 -510813
10629 -510813 -521950 -561141 -567783 -583773 -572542 -529438 -572329 -592400 -629074 -634385 -626692 -555545
10617 -555545 -514047 -486973 -465104 -498544 -499211 -543986 -629968 -618969 -550657 -528931 -565468 -562460
10605 -562460 -575388 -542246 -542723 -531371 -496946 -475510 -446167 -476143 -530307 -559088 -540698 -523354
10593 -523354 -501314 -572419 -601662 -584602 -586833 -563350 -552501 -549328 -526057 -486622 -515289 -516269
10581 -516269 -510089 -527753 -575416 -608808 -625969 -634551 -593777 -561853 -545126 -496653 -486070 -480929
10569 -480929 -522474 -528870 -459330 -462274 -515186 -500691 -463186 -495082 -519501 -534051 -554851 -543833
10557 -543833 -562146 -544881 -563403 -583387 -592174 -575373 -583186 -597588 -592365 -594512 -546179 -503444
10545 -503444 -535334 -590838 -562110 -575848 -559810 -504124 -496756 -494647 -452071 -474768 -480931 -476000
10533 -476000 -484498 -467395 -490272 -536006 -512374 -513344 -543328 -545957 -540402 -541342 -565287 -582357 -546024
10520 -546024 -518573 -497237 -536666 -530469 -540129 -566737 -616286 -610562 -581032 -550681 -521158 -443781
10508 -443781 -452054 -503896 -525398 -566157 -579195 -565762 -542171 -529168 -512157 -479278 -428895 -449237
10496 -449237 -458287 -470308 -484194 -507255 -519167 -487684 -452499 -465763 -482555 -515001 -541769 -548270
10484 -548270 -552145 -524340 -505597 -527328 -569128 -555900 -557022 -561479 -556157 -572027 -565345 -525042
10472 -525042 -476555 -490312 -495147 -494138 -456391 -509094 -474858 -442789 -477296 -450800 -416157 -464350
10460 -464350 -431086 -372511 -403082 -447888 -480917 -505742 -518172 -517284 -520341 -517088 -490045 -453491
10448 -453491 -475958 -481513 -491386 -534094 -550528 -536037 -501394 -465451 -437617 -426830 -448292 -472843
10436 -472843 -463053 -473208 -458259 -446016 -417697 -413394 -473151 -506500 -531693 -524207 -477380 -443891
10424 -443891 -441165 -426751 -477090 -466596 -461926 -456754 -466295 -455095 -435431 -446151 -484477 -479774
10412 -479774 -479546 -499312 -512696 -500562 -496372 -472864 -415257 -360060 -392089 -362686 -385219 -429512
10400 -429512 -436794 -469492 -493195 -524904 -549009 -487953 -511089 -534644 -520680 -460763 -430719 -437497
10388 -437497 -408393 -419712 -446430 -430566 -479090 -497013 -466830 -459883 -454643 -457917 -487387 -493973
10376 -493973 -479535 -434596 -439030 -515870 -551489 -511832 -484136 -521492 -531114 -505258 -498820 -535612
10364 -535612 -522863 -494759 -448886 -426513 -443208 -448470 -428332 -451283 -447505 -437048 -389176 -375888
10352 -375888 -403261 -411404 -434481 -437327 -448009 -483868 -530948 -576110 -561534 -535306 -482495 -435661
10340 -435661 -432866 -492552 -537643 -562754 -556328 -549602 -532393 -448559 -421752 -435977 -460340 -454545
10328 -454545 -407847 -438469 -423074 -428344 -459989 -479571 -467220 -491210 -485465 -464775 -423468 -370655
10316 -370655 -398643 -406972 -406806 -442837 -454671 -451025 -440241 -420999 -400172 -398577 -385310 -355372
10304 -355372 -345494 -379671 -461433 -483609 -435628 -426016 -435962 -399732 -465845 -494703 -481812 -450633
10292 -450633 -468818 -472760 -501630 -447214 -386783 -387388 -354973 -353381 -357867 -402744 -418474 -423253 -404548
10279 -404548 -381347 -377039 -361485 -362354 -403826 -401795 -431439 -447593 -413137 -418570 -427239 -409828 -407346
10266 -407346 -394783 -366167 -370228 -359872 -355416 -350679 -386615 -426566 -364578 -372708 -440229 -459713
10254 -459713 -456111 -405841 -402161 -403612 -394196 -399173 -414197 -467151 -489445 -470817 -444500 -356239
10242 -356239 -320441 -310693 -377363 -396590 -338360 -291903 -292402 -352216 -326234 -310596 -353632 -391508
10230 -391508 -336037 -301539 -302528 -316740 -301536 -277053 -297462 -320136 -360166 -402661 -404514 -354028
10218 -354028 -313857 -342914 -313489 -308706 -339904 -369932 -343930 -324505 -340810 -371229 -335159 -322986
10206 -322986 -288508 -236908 -300967 -350367 -342744 -352394 -322922 -284863 -256585 -278028 -280941 -314072
10194 -314072 -364287 -410215 -389467 -305324 -260372 -297652 -287852 -295111 -277631 -252605 -215684 -195429
10182 -195429 -219787 -220939 -253560 -316913 -320455 -286244 -303199 -351219 -375831 -348898 -324770 -327831
10170 -327831 -297944 -303760 -336040 -355974 -346240 -340138 -315337 -301395 -298140 -288860 -309350 -299965 -275186
10157 -275186 -237687 -257874 -289628 -299302 -263688 -322049 -367404 -348393 -348879 -364754 -373699 -320465
10145 -320465 -250803 -224515 -261745 -243036 -194069 -155468 -142424 -141126 -153160 -213194 -212513 -212782
10133 -212782 -248459 -270562 -264177 -245060 -198390 -165836 -184154 -226613 -214944 -216704 -198782 -193109
10121 -193109 -205546 -252208 -229631 -166205 -97734 -78075 -82530 -62843 -56550 -62606 -76564 -85349
10109 -85349 -72678 -64855 -40202 -30692 -52107 -64950 -81727 -100648 -108132 -90713 -11549 1796
10097 1796 -31484 23326 -1941 -6802 16864 33447 40901 67722 98739 72242 61842 86802
10085 86802 129722 179677 226438 267090 291704 358693 406477 460256 461568 446819 366995 418141
10073 418141 505983 589734 629126 641404 731971 802690 867987 953407 1067428 1188551 1341567
10062 1341567 1499766 1637296 1913617 2285876 2727866 3281006 4018355 5023049 5952563
10053 5952563 4780082 -836659 -5237274 -6139896 -5465646 -4598222 -3929643 -3463762 -3050147
10044 -3050147 -2774049 -2501529 -2340872 -2202928 -2041766 -1915004 -1839060 -1771162 -1680229 -1524348
10034 -1524348 -1495765 -1483676 -1465865 -1430458 -1392619 -1300829 -1244218 -1214180 -1204713 -1201147 -1204936 -1178695
10022 -1178695 -1134060 -1092374 -1064569 -1042271 -1025091 -993300 -964014 -962637 -937835 -908908 -948337
10011 -948337 -995034 -969206 -930972 -902229 -879789 -875556 -835757 -766768 -797631 -810013 -804212 -833242
9999 -833242 -821851 -770785 -707837 -686168 -679842 -710810 -744340 -762947 -813553 -806075 -744771 -683767
9987 -683767 -718672 -744023 -715694 -691014 -710509 -683924 -670961 -636521 -651973 -698632 -722584 -693627
9975 -693627 -671180 -651784 -645030 -633238 -653972 -624664 -621742 -620904 -645861 -694848 -717779 -692537
9963 -692537 -699258 -662525 -614744 -627786 -611595 -624869 -672191 -697961 -704972 -687057 -651117 -614916
9951 -614916 -572978 -561628 -557978 -596220 -564580 -538469 -514324 -559549 -605543 -654666 -628027 -552369
9939 -552369 -535040 -534298 -579832 -610492 -580893 -534153 -505990 -533818 -554208 -524936 -509998 -567619
9927 -567619 -623648 -661470 -614409 -545091 -509664 -507592 -493169 -494720 -535964 -520299 -529184 -487380
9915 -487380 -461060 -510700 -568627 -588582 -561967 -586609 -537969 -539775 -512677 -480308 -475367 -494484
9903 -494484 -503393 -521455 -557369 -582571 -563580 -579191 -528180 -450638 -389621 -445449 -498003 -505006
9891 -505006 -498911 -492756 -435105 -459656 -426512 -416669 -427522 -451148 -484899 -522613 -463620 -456068
9879 -456068 -507065 -511590 -524773 -497562 -484535 -510577 -501902 -477673 -481562 -487626 -484303 -483266 -500793
9866 -500793 -465050 -461700 -472241 -422255 -393947 -341977 -327524 -358299 -361077 -343112 -340833 -304908
9854 -304908 -263929 -178839 -223899 -344203 -505054 -652521 -665088 -645770 -667210 -610993 -583739
9843 -583739 -584196 -564879 -563700 -577850 -569064 -526222 -479991 -463708 -488063 -481366 -428824 -457735 -498353
9830 -498353 -513424 -537751 -469439 -413441 -430683 -431110 -440750 -498164 -509631 -500730 -496994 -504688 -498042
9817 -498042 -436949 -388858 -391970 -454172 -477391 -508913 -526203 -510618 -551621 -543066 -503398 -491085
9805 -491085 -496703 -431953 -371534 -345905 -374060 -428545 -510292 -479343 -411637 -429424 -410572 -465028
9793 -465028 -469670 -468508 -496101 -517018 -496787 -521346 -510265 -502456 -475695 -432857 -378103 -381838
9781 -381838 -371119 -371681 -420974 -464476 -430718 -464759 -475722 -490533 -425666 -425586 -471688 -481373 -461919
9768 -461919 -401681 -356748 -373708 -408435 -416749 -365788 -383930 -406838 -400370 -407002 -434999 -446329
9756 -446329 -446445 -468015 -481434 -479140 -514856 -523714 -479834 -460672 -470338 -466509 -392231 -383378 -397674
9743 -397674 -448291 -468552 -426526 -334184 -340255 -425432 -414328 -405373 -367568 -349494 -341623 -363623
9731 -363623 -414611 -412248 -429951 -408812 -331892 -316260 -364670 -418918 -445797 -429827 -430044 -417415
9719 -417415 -426442 -430737 -409501 -390205 -360117 -370196 -393904 -413031 -416855 -345290 -322626 -291223
9707 -291223 -297212 -339465 -391113 -450350 -475085 -493138 -484945 -454239 -429645 -402601 -352643 -315597
9695 -315597 -314213 -320767 -360598 -334107 -298905 -318712 -321537 -378152 -421754 -426639 -458029 -463108 -447148
9682 -447148 -445561 -429176 -468195 -433654 -383777 -320900 -322091 -321226 -362621 -429085 -436862 -444320 -410657
9669 -410657 -419334 -428200 -418094 -427829 -394885 -367036 -397800 -382483 -334930 -289826 -278527 -322485
9657 -322485 -382390 -386515 -402334 -420125 -352005 -330955 -337787 -357061 -385570 -414925 -426228 -438620
9645 -438620 -451461 -392552 -349590 -359985 -370751 -394559 -363206 -309133 -311598 -272237 -254251 -305162
9633 -305162 -328016 -342512 -282667 -242760 -279488 -273758 -304140 -309047 -346748 -375313 -383087 -407554
9621 -407554 -404063 -378906 -365818 -307381 -283706 -307690 -315554 -304319 -286074 -289918 -306528 -328959
9609 -328959 -304203 -278667 -280799 -273373 -302122 -349671 -315240 -290215 -298948 -338880 -360268 -382360
9597 -382360 -307754 -260927 -254490 -256340 -256109 -288082 -313549 -328910 -323119 -367808 -382081 -372167 -349005
9584 -349005 -287496 -267965 -264562 -272405 -237152 -237979 -268832 -256300 -268524 -314506 -368091 -357695
9572 -357695 -360743 -334504 -338296 -339565 -316799 -328415 -348348 -346803 -357906 -322163 -289921 -300127
9560 -300127 -268147 -257106 -286965 -300607 -270966 -271231 -302671 -284010 -289423 -349905 -306435 -253600
9548 -253600 -263296 -274702 -297867 -233129 -286224 -298738 -270029 -250910 -226927 -307454 -342309 -311502
9536 -311502 -281883 -272509 -260645 -266294 -281137 -285550 -275495 -264483 -247601 -252430 -251647 -305181 -299554
9523 -299554 -334535 -355987 -329694 -343942 -335891 -342080 -360951 -360462 -301132 -296634 -260351 -293596 -322323
9510 -322323 -256507 -214464 -222835 -213798 -262706 -276953 -259912 -235851 -236156 -275315 -270211 -272858 -291864
9497 -291864 -284527 -286946 -252198 -284101 -305652 -266752 -247244 -265539 -290730 -310438 -313390 -295022
9485 -295022 -305942 -308877 -247182 -224196 -245058 -230129 -219003 -209847 -200089 -233908 -268997 -323473
9473 -323473 -341811 -330173 -350312 -305667 -254259 -237655 -235448 -263746 -254310 -190685 -189777 -231830
9461 -231830 -197979 -192955 -193782 -172149 -209479 -211879 -222082 -243598 -272788 -274710 -253196 -191571 -172690
9448 -172690 -184078 -157032 -159907 -152984 -164036 -180253 -189263 -186203 -229687 -230517 -219698 -207326 -211490
9435 -211490 -216610 -210479 -207672 -205894 -223641 -198887 -186439 -218450 -220903 -225483 -234331 -196872 -180143
9422 -180143 -200274 -231107 -209354 -198245 -188332 -185873 -236255 -287784 -291947 -270293 -208677 -171555
9410 -171555 -129091 -129008 -197711 -237767 -187431 -137377 -117398 -93360 -101093 -135309 -155435 -132785
9398 -132785 -134883 -159909 -117055 -34025 -13226 -16630 -68618 -126777 -135557 -107720 -76855 -85771
9386 -85771 -61235 -93653 -57968 -43157 -73050 -94456 -116991 -143119 -180438 -191342 -195907 -154242
9374 -154242 -119697 -146140 -145898 -87223 -106114 -92616 -77609 -98261 -122830 -168215 -155191 -100363
9362 -100363 -64558 -87010 -94460 -79209 -52720 -37574 -64203 -89456 -94019 -62624 -48266 -47786
9350 -47786 -59290 -70988 -27808 -8309 -30304 -30160 -16148 -9027 43180 79334 -4182 -62673
9338 -62673 -67422 -81646 -83143 -85886 -87710 -96651 -108246 -84632 -88707 -41953 -30219 -57423 -34042
9325 -34042 7424 -16677 -38598 -21796 -20275 38524 61231 52747 -19236 -21216 -4917 -39849
9313 -39849 -55146 7148 27384 59845 48704 -4025 34439 30497 1703 27673 65406 87444
9301 87444 114464 103503 128325 108777 89001 94173 66382 53496 74772 99413 68741 81807
9289 81807 58338 27236 24974 54326 84156 89859 47861 62924 45722 16992 10753 24705
9277 24705 79255 106570 133376 156744 125108 111001 124320 99871 106045 148904 198509 187445
9265 187445 165564 177171 192345 209657 180565 153290 170890 200993 195899 157183 192849 167002
9253 167002 179218 181078 185766 211774 272719 289332 247963 241242 199066 201756 213805 190114
9241 190114 245835 284708 322546 330040 338082 328221 278029 232030 266126 252095 201777 226275
9229 226275 302314 287454 288548 340764 400237 411057 421715 450507 439832 389444 370624 327451
9217 327451 327488 350330 362630 326176 296863 307113 374418 416515 417120 419128 376115 376141 388963
9204 388963 395688 378063 372816 346873 386468 463922 495127 521842 567838 573155 544637 500930
9192 500930 502546 582062 649638 618435 598261 599234 575589 569914 565987 614560 632940 596618 571227
9179 571227 581332 596954 593219 571872 639798 686380 709927 735360 754174 753123 761683 805293
9167 805293 830859 842202 837370 815042 771260 788444 810481 785842 826489 913962 922313 902802
9155 902802 933918 996609 1030203 1030812 993741 963148 1008915 1050134 1072479 1107184 1102770 1053258
9143 1053258 1084236 1107351 1138690 1171879 1186256 1160682 1142868 1198238 1199142 1137703 1091654 1092255
9131 1092255 1106905 1111801 1121541 1139811 1101554 1038409 1021668 1037525 1022911 1001896 1027925 1036881
9119 1036881 984276 855660 825761 851342 840715 836682 767773 670267 592399 521706 445686
9108 445686 428645 357394 210981 61814 -75356 -221585 -319110 -393844 -511760 -665072
9098 -665072 -764399 -827717 -897012 -977272 -1035027 -1136930 -1230113 -1279183 -1364020 -1464873 -1510619
9087 -1510619 -1540028 -1605937 -1610604 -1664637 -1752110 -1788355 -1810096 -1886328 -1908155 -1876849 -1969597 -2032089
9075 -2032089 -1978599 -1902559 -1905342 -1986193 -2023023 -2035140 -2052670 -2050512 -2022240 -2012608 -2018875 -2013514
9063 -2013514 -1985064 -1990863 -1990034 -2012167 -1957298 -1900745 -1918052 -1935163 -1917153 -1909747 -1881110 -1884251
9051 -1884251 -1913957 -1952566 -1925015 -1885650 -1884656 -1868589 -1863266 -1848747 -1827389 -1781210 -1768935 -1770741
9039 -1770741 -1732254 -1730775 -1696652 -1686100 -1708572 -1692427 -1659179 -1697914 -1700674 -1711056 -1679034 -1655315
9027 -1655315 -1657820 -1658968 -1611688 -1634367 -1610927 -1588295 -1562352 -1510695 -1468806 -1460014 -1452982 -1462310
9015 -1462310 -1459512 -1448055 -1474547 -1471027 -1473362 -1474641 -1470177 -1476976 -1462312 -1424955 -1458244 -1468540 -1471569
9002 -1471569 -1400129 -1400444 -1429082 -1454535 -1405488 -1363114 -1344897 -1344116 -1379736 -1416142 -1379221 -1306898
8990 -1306898 -1259982 -1283866 -1311182 -1307708 -1275143 -1279945 -1305053 -1306311 -1313607 -1341994 -1389850 -1375119
8978 -1375119 -1354104 -1334989 -1286484 -1231844 -1256279 -1265376 -1254241 -1259459 -1214459 -1196775 -1217024 -1223833
8966 -1223833 -1219412 -1214506 -1185036 -1206752 -1196910 -1195850 -1175906 -1201904 -1255451 -1233028 -1183641 -1127028
8954 -1127028 -1120524 -1165929 -1169722 -1148970 -1121959 -1094007 -1115080 -1140989 -1140150 -1116906 -1129915 -1089125
8942 -1089125 -1074632 -1065127 -1071829 -1125001 -1116118 -1072689 -1070401 -1037922 -975650 -934568 -937107 -965663
8930 -965663 -1019957 -1074247 -1073123 -1062736 -1031278 -1051432 -1047001 -1049449 -1090519 -1058860 -1011826 -1045529
8918 -1045529 -1058960 -1053049 -1046449 -1008852 -998173 -987733 -1029632 -1073047 -1050346 -1028388 -1002491 -996934
8906 -996934 -917542 -914518 -996955 -996623 -1032374 -1011849 -916726 -883590 -899830 -903943 -897669 -921163 -964330
8893 -964330 -948623 -968721 -961590 -993172 -1027626 -967096 -909850 -903242 -917538 -947437 -956278 -1021299
8881 -1021299 -1023164 -985788 -1008523 -1040306 -1032710 -977052 -919746 -940332 -900315 -928916 -990222 -965388
8869 -965388 -922887 -899749 -882507 -858110 -903604 -960193 -1016434 -998381 -1003757 -1019686 -1009711 -967491
8857 -967491 -926383 -827855 -797853 -835360 -842757 -815315 -829265 -861885 -905258 -957207 -941312 -899404
8845 -899404 -852807 -816794 -815096 -820594 -875226 -844772 -842865 -838437 -880609 -920273 -882655 -851625
8833 -851625 -835974 -812137 -833962 -825303 -843593 -820168 -817189 -845402 -849092 -863550 -841955 -842975
8821 -842975 -881264 -894909 -900665 -913270 -902125 -858244 -856825 -838285 -828288 -823473 -842236 -870721
8809 -870721 -871946 -840880 -820629 -804264 -772777 -761786 -820061 -836959 -809859 -769969 -754994 -748765
8797 -748765 -768280 -765640 -761292 -740331 -682253 -668977 -750662 -781010 -755306 -710928 -722444 -683247
8785 -683247 -679044 -697267 -733064 -784556 -772353 -706258 -700236 -721147 -727691 -742754 -739052 -658361
8773 -658361 -651474 -679180 -667234 -685307 -705859 -657587 -680292 -730032 -707471 -720851 -762148 -807042
8761 -807042 -814796 -788997 -735557 -729000 -678271 -631505 -614346 -629918 -664444 -679750 -685593 -684641 -704961
8748 -704961 -742823 -778413 -772354 -753480 -743166 -719963 -680135 -683606 -655923 -609857 -653480 -726838
8736 -726838 -776204 -832808 -788435 -734195 -770551 -754893 -738602 -762764 -770839 -747358 -722671 -724411
8724 -724411 -685043 -679386 -696335 -752087 -771044 -716487 -720484 -704617 -718439 -705887 -714731 -758308
8712 -758308 -714289 -666776 -680550 -724278 -723215 -688841 -643384 -638116 -709611 -735014 -681827 -637167
8700 -637167 -624341 -644665 -695055 -756486 -729142 -681604 -693685 -684810 -639892 -693309 -689625 -696836
8688 -696836 -718980 -702609 -714149 -708968 -688629 -684513 -690176 -745178 -690182 -702473 -692564 -639293
8676 -639293 -632801 -667719 -723637 -697512 -726269 -743599 -709375 -674594 -622701 -625744 -623926 -600814
8664 -600814 -592895 -611211 -646572 -655700 -605371 -566714 -611881 -628468 -607221 -568814 -557050 -552115
8652 -552115 -576161 -533721 -485156 -497071 -581169 -652788 -681095 -661821 -651091 -642945 -646634 -656029
8640 -656029 -642664 -627120 -606314 -635129 -622457 -686919 -721204 -693007 -633873 -569169 -522831 -535889
8628 -535889 -546395 -589805 -628512 -620154 -590139 -611236 -604048 -566023 -560307 -635054 -620352 -600820
8616 -600820 -636955 -639940 -618351 -599798 -586474 -610153 -584479 -566457 -550656 -541860 -573927 -583774
8604 -583774 -596974 -647473 -789079 -839686 -846332 -818942 -761638 -744614 -697301 -662950 -702086 -697221
8592 -697221 -748125 -777170 -754476 -744652 -730563 -681313 -625674 -593852 -589250 -527521 -508499 -587513
8580 -587513 -643192 -644721 -689093 -679448 -691926 -710414 -697730 -664326 -673466 -689100 -717731 -721194
8568 -721194 -686494 -651217 -629803 -602715 -594754 -618132 -627528 -645015 -630138 -577703 -580968 -688271
8556 -688271 -704731 -673477 -714746 -706023 -646757 -663907 -693907 -681677 -710545 -680855 -673509 -660210
8544 -660210 -657612 -625621 -597419 -537726 -530978 -561684 -596225 -683166 -701856 -738872 -769139 -748269
8532 -748269 -735880 -706737 -661665 -615255 -602201 -634684 -651018 -636327 -636133 -612666 -595262 -598102
8520 -598102 -604012 -599591 -574638 -563285 -600183 -677570 -702560 -628199 -631374 -619017 -605037 -650840
8508 -650840 -691166 -684054 -655178 -600482 -574784 -535818 -494585 -471892 -465310 -529592 -536906 -518787
8496 -518787 -492121 -538475 -554597 -561984 -592218 -605101 -615842 -620282 -677684 -701600 -671767 -641686
8484 -641686 -616054 -603912 -593676 -624219 -610741 -591206 -644086 -654683 -632981 -583338 -509693 -522791
8472 -522791 -548617 -546294 -575191 -619480 -639490 -650360 -658426 -647425 -645154 -594164 -603317 -628900
8460 -628900 -635856 -639114 -629686 -628616 -623223 -605415 -593311 -609510 -620360 -634330 -659244 -634091 -575294
8447 -575294 -561859 -566308 -588886 -615896 -616045 -673656 -752933 -753791 -703277 -650324 -615855 -606055 -593860
8434 -593860 -585419 -625494 -604945 -543115 -506943 -565807 -556525 -568824 -565650 -544412 -550791 -560618 -500019
8421 -500019 -468987 -553958 -611987 -634665 -657207 -600184 -577383 -580561 -560154 -547765 -545739 -544162
8409 -544162 -540788 -566966 -549289 -511889 -528410 -527005 -560475 -531381 -495197 -519354 -560852 -623319
8397 -623319 -608171 -624103 -637313 -680352 -630357 -588322 -576579 -602122 -648580 -615282 -575174 -605738
8385 -605738 -646057 -633661 -601717 -575292 -550649 -563846 -589827 -596111 -547334 -546407 -604711 -609931
8373 -609931 -559699 -583426 -560894 -564132 -548160 -537018 -543336 -537984 -538877 -540474 -523557 -536927 -558226
8360 -558226 -588769 -589266 -566574 -530756 -552911 -526698 -504021 -542486 -556121 -521188 -522447 -566747
8348 -566747 -635235 -649840 -611671 -588882 -572163 -553139 -588250 -576689 -593290 -557314 -522462 -498600
8336 -498600 -467176 -442137 -439055 -454636 -431971 -465397 -511039 -523577 -544571 -535868 -531417 -513580
8324 -513580 -503431 -523860 -537764 -548207 -576768 -531399 -460683 -430419 -481148 -493229 -510960 -527817
8312 -527817 -568018 -510850 -456588 -406944 -439626 -518093 -614627 -642319 -622508 -653309 -589508 -548015
8300 -548015 -534886 -578970 -585208 -579501 -624898 -624008 -589337 -547674 -504923 -534348 -531009 -587720 -613143
8287 -613143 -610203 -592131 -570599 -571030 -579727 -529075 -490265 -505407 -500225 -459237 -432882 -524026 -538040
8274 -538040 -538784 -506394 -519686 -579213 -568200 -551481 -559017 -586583 -648675 -641437 -610253 -595598
8262 -595598 -604608 -591645 -515738 -471074 -460375 -461861 -535964 -560363 -620629 -605561 -576971 -536958
8250 -536958 -498335 -458177 -466623 -486033 -524677 -545557 -569151 -536009 -554322 -552208 -563559 -547455
8238 -547455 -548818 -546545 -528553 -551651 -568376 -546437 -508661 -563674 -582010 -571106 -577760 -548168
8226 -548168 -549014 -556613 -554312 -582244 -555824 -528470 -503150 -536748 -545005 -518580 -536048 -560856 -589624
8213 -589624 -551641 -536272 -501398 -470549 -469987 -522628 -525597 -504730 -515172 -516789 -497373 -493462 -492926
8200 -492926 -532127 -531376 -503839 -563090 -584666 -533871 -503652 -536290 -543272 -540544 -529162 -531928 -547017
8187 -547017 -499969 -478113 -468264 -492977 -499189 -496920 -450853 -459524 -472504 -550760 -551665 -557446 -536196
8174 -536196 -497685 -501278 -536539 -519243 -491992 -487261 -520160 -517289 -492026 -508423 -466105 -469733
8162 -469733 -487372 -456148 -457508 -488960 -540257 -497852 -454941 -511635 -568494 -561585 -577200 -527390
8150 -527390 -497267 -429235 -409071 -473273 -559510 -579300 -560029 -565650 -572912 -537815 -515377 -500199
8138 -500199 -458938 -484572 -535641 -515770 -474122 -496382 -527306 -512952 -502751 -518451 -542438 -531609
8126 -531609 -512959 -509010 -515769 -475108 -463670 -474013 -536299 -565602 -532349 -483571 -495482 -567281
8114 -567281 -592794 -610355 -598546 -611227 -594387 -601824 -610910 -571237 -532292 -551274 -531152 -476084
8102 -476084 -434057 -434653 -461974 -513309 -535166 -525746 -477347 -443140 -466275 -434248 -438416 -402727
8090 -402727 -392349 -378371 -436280 -503394 -571050 -550542 -539536 -510288 -498522 -482184 -473934 -517763
8078 -517763 -489077 -445951 -459432 -505990 -518452 -556879 -554133 -566866 -551734 -500183 -522258 -525789
8066 -525789 -467177 -479460 -500584 -540935 -519365 -500588 -489649 -504705 -533614 -566196 -511508 -550144
8054 -550144 -646670 -656039 -586304 -533673 -517772 -550542 -514067 -484229 -523039 -541765 -515132 -477751
8042 -477751 -438552 -408447 -445741 -465763 -466476 -483494 -480165 -504783 -516029 -518434 -492236 -518990
8030 -518990 -509085 -454725 -446312 -464283 -433715 -459624 -517691 -525837 -512597 -447084 -430713 -499920
8018 -499920 -507750 -497639 -488473 -472335 -494789 -476136 -428322 -439286 -469687 -413159 -364040 -345741
8006 -345741 -381650 -459621 -495428 -476870 -438889 -452843 -474830 -452376 -448741 -476189 -464170 -434645
7994 -434645 -452852 -414592 -417381 -470539 -503147 -522501 -523850 -501021 -442489 -404704 -418357 -460010
7982 -460010 -472212 -443810 -419897 -472854 -487714 -461203 -450955 -450969 -457450 -467260 -416760 -400420 -412800
7969 -412800 -392383 -400553 -423666 -427991 -460599 -470927 -431668 -406604 -371713 -407117 -460486 -464078
7957 -464078 -455370 -412268 -444832 -482234 -481835 -520055 -499026 -441289 -470912 -487309 -480837 -435144
7945 -435144 -431078 -447184 -497627 -500319 -500627 -539829 -523857 -481080 -499406 -550163 -542294 -468540 -441426
7932 -441426 -464495 -429964 -408488 -445929 -455143 -459243 -431506 -429539 -449316 -510562 -557632 -519507
7920 -519507 -490354 -504077 -540929 -555765 -565376 -515213 -560548 -570974 -568348 -507649 -489647 -473239
7908 -473239 -448602 -420890 -432259 -427246 -428452 -408301 -414768 -424540 -450544 -433581 -474038 -526557
7896 -526557 -547895 -555495 -522929 -515516 -500593 -471933 -452074 -478650 -536515 -526883 -489021 -459259
7884 -459259 -454918 -490905 -505542 -479303 -431380 -485453 -547740 -505802 -484003 -493044 -500062 -482154
7872 -482154 -454232 -458894 -472281 -459809 -448150 -429208 -439754 -472273 -434544 -387948 -406489 -394771
7860 -394771 -407177 -445874 -441100 -426797 -426492 -483408 -469051 -426462 -414990 -454668 -395865 -396381 -389309
7847 -389309 -391491 -401349 -450820 -493116 -452673 -424642 -452696 -511441 -478919 -454866 -394246 -393275
7835 -393275 -480017 -474459 -457013 -489933 -491601 -451094 -436527 -453089 -511158 -475421 -471094 -471673 -510826
7822 -510826 -519541 -489819 -498983 -480356 -457865 -454979 -432248 -507508 -529526 -522187 -514540 -488583 -468315
7809 -468315 -503916 -456733 -423768 -427591 -428243 -475388 -490466 -494728 -478134 -508545 -528913 -562505
7797 -562505 -619169 -628547 -562870 -534790 -511858 -481834 -463973 -447701 -469145 -511798 -515323 -527427
7785 -527427 -560839 -568175 -559949 -531609 -491080 -399523 -360048 -374813 -393352 -441476 -478760 -446578
7773 -446578 -398632 -414230 -427847 -459513 -483259 -498947 -417783 -368162 -399099 -456090 -478651 -497013
7761 -497013 -524551 -516454 -503954 -472665 -452192 -462317 -452656 -454572 -443949 -419230 -425036 -449905
7749 -449905 -436086 -461328 -521569 -475924 -442079 -471697 -490915 -464013 -459199 -445238 -368395 -340515
7737 -340515 -409937 -469148 -478664 -437467 -459374 -475567 -447616 -433931 -473284 -466548 -454033 -465764
7725 -465764 -484821 -431782 -394215 -396371 -434371 -443888 -445639 -440433 -469547 -428794 -417361 -463272
7713 -463272 -451694 -422154 -394581 -412840 -410780 -385254 -415392 -489217 -552637 -546481 -514644 -454310
7701 -454310 -419056 -473884 -497602 -492607 -533408 -528580 -464443 -459247 -475505 -492971 -505358 -501391
7689 -501391 -489234 -505572 -455521 -397526 -352014 -365952 -358341 -360004 -399843 -406458 -452461 -473571
7677 -473571 -482602 -498709 -491488 -444066 -461158 -442787 -459703 -476342 -475368 -434726 -436707 -490289 -521681
7664 -521681 -519936 -483103 -443913 -435016 -428259 -467924 -519318 -490023 -456472 -431472 -398890 -349750
7652 -349750 -369833 -397158 -442688 -467171 -459027 -435952 -394669 -368023 -405891 -434661 -461901 -515974
7640 -515974 -540980 -526366 -493773 -442526 -395579 -427924 -427082 -434777 -450776 -448567 -442896 -430925 -483845
7627 -483845 -503272 -491611 -463325 -448252 -448115 -507993 -498724 -475983 -449543 -396273 -405017 -434271
7615 -434271 -454027 -498450 -460827 -438240 -440319 -489045 -525226 -482307 -432241 -503677 -488096 -475872
7603 -475872 -454277 -436655 -492310 -521769 -462643 -509150 -515659 -478059 -482291 -486780 -486462 -483695 -461382
7590 -461382 -475938 -486122 -483255 -452479 -424644 -477338 -506098 -546681 -561911 -507858 -468337 -430089
7578 -430089 -426586 -440479 -394661 -391478 -399948 -445522 -469293 -435109 -377137 -351544 -309241 -281625
7566 -281625 -363725 -364744 -356219 -429561 -447071 -471171 -471182 -475487 -499258 -526359 -504988 -496030 -431616
7553 -431616 -387730 -403835 -429573 -435148 -479482 -467392 -448538 -483831 -493344 -525031 -552846 -542183
7541 -542183 -537505 -506498 -521636 -506619 -515047 -487546 -455649 -435117 -467786 -497229 -487687 -542953
7529 -542953 -571636 -527824 -486901 -455550 -516638 -575427 -548737 -501802 -509285 -538939 -515599 -454381
7517 -454381 -398464 -406798 -453074 -490847 -508855 -516693 -511340 -468909 -434275 -417127 -400313 -381248
7505 -381248 -394176 -382106 -384662 -387244 -384655 -423316 -441982 -438478 -417300 -427946 -463722 -494776
7493 -494776 -447544 -422030 -437866 -445991 -420530 -392956 -404067 -349429 -368863 -393850 -400973 -396813
7481 -396813 -425066 -441330 -481209 -485355 -462508 -448639 -411637 -393668 -424396 -431007 -419327 -399591
7469 -399591 -418927 -371806 -366181 -414604 -442762 -411910 -350813 -357634 -375492 -443203 -437241 -400600
7457 -400600 -387463 -406207 -391003 -361651 -387573 -390071 -392037 -370622 -356309 -370071 -415102 -437515
7445 -437515 -448350 -442805 -452332 -476630 -472625 -494691 -457066 -440740 -433374 -414356 -466945 -498049
7433 -498049 -507947 -484033 -464138 -467545 -418022 -402265 -404620 -437445 -450288 -458646 -414801 -391446
7421 -391446 -394792 -428614 -452697 -461340 -510770 -540067 -510792 -456101 -476429 -505880 -496419 -469891
7409 -469891 -459406 -389479 -380684 -416654 -453751 -502672 -445288 -439258 -456227 -467977 -399872 -377635
7397 -377635 -425544 -425082 -417911 -410218 -363606 -339685 -337878 -349530 -378801 -420387 -456415 -429222 -431397
7384 -431397 -449919 -444655 -473318 -470007 -443631 -415251 -400085 -391807 -386798 -422823 -427391 -437911 -469473
7371 -469473 -463398 -488403 -481050 -487454 -489066 -459128 -442408 -424818 -430954 -397620 -375896 -402474 -457994
7358 -457994 -470660 -465326 -433759 -400374 -442255 -405016 -391791 -388468 -413234 -404514 -395696 -455272
7346 -455272 -469639 -395912 -393792 -400052 -368996 -397431 -411299 -398356 -405628 -370851 -364063 -378114
7334 -378114 -371013 -454004 -473405 -400193 -332468 -361742 -348814 -373729 -382238 -402501 -407853 -391730
7322 -391730 -376573 -349744 -350751 -412201 -457553 -437335 -434372 -395712 -401478 -406451 -428844 -476127
7310 -476127 -469325 -446844 -497778 -543559 -493003 -419574 -422532 -415290 -431535 -442359 -506288 -532150
7298 -532150 -497879 -468847 -465760 -488328 -513301 -457652 -448631 -473896 -447337 -441232 -407541 -335652
7286 -335652 -266554 -285636 -332527 -404920 -405815 -440495 -460572 -463837 -457161 -432371 -410432 -450398
7274 -450398 -489596 -457763 -465709 -462015 -461164 -427137 -372022 -348470 -323109 -353950 -397113 -433344
7262 -433344 -392057 -372950 -381508 -435145 -474088 -464114 -463643 -460088 -477666 -441757 -423654 -445401 -444903
7249 -444903 -437768 -448287 -428904 -381330 -382546 -399576 -426778 -429388 -407227 -396390 -407646 -434561
7237 -434561 -403475 -396122 -403562 -438295 -480635 -458494 -437394 -405777 -381520 -382524 -380535 -385184 -413988
7224 -413988 -444059 -438859 -458609 -420184 -363013 -360744 -368276 -359667 -389018 -442544 -408598 -408572 -451764
7211 -451764 -472224 -441934 -430441 -438256 -411880 -417172 -429770 -393944 -372512 -395997 -437698 -489405
7199 -489405 -437063 -380457 -398976 -430824 -438131 -400229 -420151 -476166 -455893 -426265 -390934 -346232
7187 -346232 -352736 -382054 -395898 -399269 -409947 -362155 -343184 -363146 -376153 -413968 -408244 -415895
7175 -415895 -407760 -418301 -413630 -367344 -354908 -353385 -329184 -326793 -371858 -427665 -432191 -380769 -386783
7162 -386783 -372932 -374339 -413741 -427744 -452688 -443426 -441684 -443760 -386726 -359351 -384701 -414272
7150 -414272 -372668 -346788 -365641 -361012 -354369 -354085 -407426 -423960 -398913 -360924 -315252 -267990
7138 -267990 -269162 -299977 -309092 -312301 -352523 -406086 -399103 -378877 -391045 -426204 -435419 -426387 -369661
7125 -369661 -342841 -319687 -318873 -363168 -404261 -415183 -446563 -421756 -370330 -347128 -381029 -360465
7113 -360465 -362096 -379154 -385473 -411851 -405651 -355514 -314707 -306763 -296727 -307370 -402090 -440815
7101 -440815 -426407 -368527 -347758 -367789 -340580 -342063 -361827 -306895 -285377 -320269 -313881 -327534
7089 -327534 -352925 -358835 -405197 -422427 -390687 -374782 -410161 -463285 -466928 -370817 -331141 -363221
7077 -363221 -349907 -353067 -356811 -447202 -526817 -496260 -489170 -465039 -458092 -432351 -399226 -360352
7065 -360352 -331633 -396289 -487572 -443339 -353441 -383328 -387072 -405381 -397219 -371920 -380569 -400181
7053 -400181 -444531 -372491 -329269 -357801 -367620 -368731 -315778 -339242 -398602 -433158 -401256 -348369
7041 -348369 -331038 -301423 -326993 -316148 -291853 -312624 -333988 -326105 -332329 -336692 -343408 -396817
7029 -396817 -414613 -430041 -431941 -426055 -448594 -456359 -444217 -402181 -378346 -394497 -433827 -412898
7017 -412898 -358760 -391477 -418968 -384322 -364772 -349580 -360690 -305554 -310696 -368923 -409201 -432484
7005 -432484 -431798 -350368 -360281 -419936 -445259 -444983 -389591 -351035 -359003 -375663 -369501 -373047 -377937
6992 -377937 -376906 -371611 -373013 -380887 -369741 -378108 -372314 -362750 -354944 -392432 -402484 -409211 -420225
6979 -420225 -400868 -365294 -380962 -375455 -371005 -356327 -411937 -416284 -415511 -446450 -453593 -406472 -416082
6966 -416082 -400051 -393894 -360107 -355867 -377121 -382095 -400980 -386844 -360318 -381126 -382048 -350477 -335754
6953 -335754 -343076 -366729 -355840 -381603 -407191 -360236 -324245 -327071 -380420 -410918 -373329 -345826
6941 -345826 -377333 -367447 -379750 -375222 -383879 -414285 -410082 -408848 -413890 -383332 -392638 -461467 -526348
6928 -526348 -526222 -467871 -424456 -443077 -454016 -446491 -443195 -465207 -434596 -430151 -431248 -399059 -392908
6915 -392908 -458301 -487714 -426770 -365776 -362343 -393634 -427241 -435988 -423615 -422446 -423894 -420727 -391099
6902 -391099 -381651 -372544 -365328 -373475 -316424 -318222 -378461 -383520 -398739 -424356 -396696 -400684 -427842
6889 -427842 -399235 -379974 -402080 -411707 -420129 -463340 -443526 -382849 -443225 -460113 -428065 -379310
6877 -379310 -398092 -431402 -424048 -324818 -287587 -300683 -320032 -343699 -344955 -342759 -376837 -390667
6865 -390667 -353817 -343811 -359389 -347535 -307369 -312300 -291871 -272833 -249275 -225873 -249500 -279489
6853 -279489 -309764 -378740 -397625 -388787 -399482 -386774 -384012 -413178 -389828 -346946 -379236 -384616
6841 -384616 -360521 -352619 -370222 -391341 -407028 -473931 -504974 -512522 -473397 -402072 -378653 -369401
6829 -369401 -388411 -428811 -426208 -406379 -441428 -416941 -345002 -330618 -331824 -318700 -319895 -349845
6817 -349845 -380197 -329158 -358350 -413452 -393330 -381219 -404845 -417202 -410021 -398291 -386736 -332140
6805 -332140 -385953 -401442 -386105 -356445 -352795 -369881 -370318 -376641 -415360 -458212 -486565 -487146 -438348
6792 -438348 -420870 -426927 -420756 -427187 -412871 -388351 -400909 -397510 -418485 -426022 -436573 -452201 -389359
6779 -389359 -383522 -381894 -376766 -399462 -420805 -483473 -450961 -371810 -330900 -354875 -408426 -412731
6767 -412731 -351743 -330014 -372138 -415614 -407356 -432416 -450107 -422942 -429864 -403037 -389745 -368557
6755 -368557 -371279 -378309 -427101 -416441 -367205 -383969 -427169 -437046 -465065 -450171 -467895 -440918
6743 -440918 -404731 -377781 -339896 -286546 -300368 -337256 -359544 -358146 -388731 -426019 -438241 -420142
6731 -420142 -385446 -372235 -375675 -345782 -342620 -396309 -416521 -426972 -402232 -371948 -357998 -367022
6719 -367022 -382617 -401419 -383723 -375844 -375276 -389957 -386097 -385422 -391193 -405025 -417031 -393986 -387308
6706 -387308 -357604 -374645 -395714 -399131 -372698 -342604 -273610 -293765 -349547 -365759 -377455 -378208
6694 -378208 -359619 -324827 -371494 -435381 -440272 -466209 -518010 -462405 -488323 -485467 -401000 -349669
6682 -349669 -313585 -352448 -365906 -386210 -428516 -407161 -359715 -374080 -404245 -404286 -381501 -404125
6670 -404125 -420876 -364519 -368203 -394521 -408107 -376488 -339936 -341467 -348015 -369044 -399914 -367875
6658 -367875 -350656 -378092 -397544 -388712 -364072 -334500 -294304 -254358 -262483 -283643 -246222 -267625
6646 -267625 -336391 -362805 -370089 -379846 -393855 -387461 -365558 -368664 -404138 -401958 -402152 -379088 -374755
6633 -374755 -358833 -358857 -332300 -331805 -397869 -408420 -385619 -394863 -405571 -398792 -397263 -361209 -320869
6620 -320869 -326087 -367749 -362950 -332038 -331542 -318554 -330062 -387863 -403913 -405911 -393861 -366610 -323765
6607 -323765 -279777 -308456 -359655 -385119 -356236 -335475 -403878 -465808 -436161 -366186 -323528 -310449
6595 -310449 -309438 -325689 -328297 -338595 -283146 -278549 -334705 -392580 -390019 -334817 -341035 -329680 -316521
6582 -316521 -332530 -372820 -427086 -346472 -341871 -373482 -357893 -292312 -252464 -289320 -346205 -387367
6570 -387367 -347167 -335399 -341174 -321355 -311600 -359001 -380460 -410309 -418935 -371720 -372396 -383397 -427502
6557 -427502 -422243 -400715 -385242 -454915 -520423 -481779 -413239 -438659 -414737 -446561 -463808 -398487
6545 -398487 -315741 -280141 -270616 -261878 -315916 -370141 -409729 -390706 -418936 -451763 -389133 -381074
6533 -381074 -369701 -311127 -315361 -316995 -361361 -441050 -455813 -437724 -434266 -382289 -355048 -336145
6521 -336145 -367254 -367506 -386941 -384789 -402124 -400418 -349084 -344356 -386006 -364031 -330961 -299835 -328457
6508 -328457 -344240 -337867 -353666 -348895 -341129 -361860 -375773 -378046 -374257 -306363 -281880 -282321 -299295
6495 -299295 -294924 -332180 -318879 -290363 -301501 -308186 -320390 -282793 -251504 -276004 -346326 -356730
6483 -356730 -335293 -338913 -345766 -309369 -321618 -377824 -397334 -376016 -391460 -421039 -399570 -382562
6471 -382562 -348722 -351268 -389782 -410914 -419144 -446986 -452040 -410704 -364230 -431554 -440074 -416320
6459 -416320 -426283 -434462 -394456 -298926 -322582 -369752 -391039 -390584 -407592 -369122 -396758 -399115 -386702
6446 -386702 -381944 -355780 -299847 -303884 -356891 -345047 -353134 -355289 -357076 -430308 -436164 -433865 -448026
6433 -448026 -444548 -405814 -378839 -384748 -386208 -414563 -386130 -364744 -374340 -294991 -283419 -327946
6421 -327946 -327403 -348655 -335541 -344036 -349330 -367056 -368739 -334573 -346684 -395421 -363554 -326337 -334274
6408 -334274 -315716 -348580 -322737 -293008 -300817 -289181 -311119 -304589 -322725 -382267 -406066 -398592
6396 -398592 -366268 -342809 -328778 -367837 -387533 -374138 -389141 -412039 -379613 -347456 -334268 -349624
6384 -349624 -344468 -379341 -374275 -351559 -326000 -339295 -353192 -334154 -322010 -336660 -384336 -396265
6372 -396265 -388302 -403179 -370641 -332639 -345961 -305178 -338781 -374882 -400179 -475515 -460698 -448015
6360 -448015 -409304 -400366 -369548 -377256 -380989 -421881 -361712 -304574 -304163 -301131 -316688 -339282 -333781
6347 -333781 -319851 -308123 -291909 -327105 -350811 -334746 -334551 -321144 -330959 -340988 -333266 -355623
6335 -355623 -360006 -302556 -275990 -317346 -331383 -372501 -374946 -342778 -352017 -328987 -281100 -260279
6323 -260279 -299801 -322583 -305461 -333864 -395507 -457913 -437605 -411001 -396049 -398673 -396005 -360936
6311 -360936 -341798 -336502 -309552 -329834 -347976 -357270 -324397 -319614 -360237 -368376 -373456 -341617 -378373
6298 -378373 -372193 -388299 -367514 -351977 -363702 -401063 -423208 -410265 -379062 -366127 -412507 -426073
6286 -426073 -398510 -384307 -400178 -385531 -412562 -411645 -364111 -324102 -371977 -407441 -410097 -403618
6274 -403618 -440032 -459075 -445831 -423458 -397961 -376426 -369680 -371774 -363760 -358452 -348985 -346567 -289972
6261 -289972 -305967 -298337 -314213 -336254 -396338 -399652 -362676 -385722 -410449 -374589 -375866 -368294
6249 -368294 -370671 -364804 -334430 -385347 -391691 -390169 -348407 -323816 -310510 -353197 -396113 -361341
6237 -361341 -339184 -335006 -347620 -352177 -329834 -382780 -380284 -350523 -320511 -296918 -258487 -231262
6225 -231262 -236482 -275222 -313779 -329745 -313329 -366109 -393583 -418279 -416575 -369749 -355656 -366108
6213 -366108 -398893 -374855 -358496 -393923 -373639 -326153 -346897 -391222 -385406 -371998 -350269 -382990
6201 -382990 -355968 -310969 -325008 -325645 -330709 -292954 -319683 -328741 -329637 -353826 -381918 -401579 -378249
6188 -378249 -383552 -380905 -344886 -348671 -311984 -299169 -313868 -352738 -365240 -420167 -401998 -377728
6176 -377728 -382084 -428018 -410035 -351169 -375013 -426494 -439824 -417415 -403742 -385329 -390396 -385956
6164 -385956 -351573 -304452 -273845 -361908 -414279 -370775 -381614 -414634 -387912 -346037 -367673 -388571
6152 -388571 -384365 -364273 -381301 -394675 -419140 -367519 -329312 -323943 -299064 -307538 -292979 -308501
6140 -308501 -370269 -369255 -370494 -333947 -352858 -349234 -354480 -337404 -335562 -366232 -420636 -488587 -413288
6127 -413288 -357169 -316192 -343280 -393876 -420809 -475661 -453027 -400278 -351585 -373974 -387116 -364547
6115 -364547 -343938 -310840 -284276 -297994 -317509 -361280 -364046 -375901 -347826 -347005 -344530 -346195 -367705
6102 -367705 -355931 -386895 -370758 -354288 -377545 -348580 -345163 -369634 -366395 -360590 -382041 -365168
6090 -365168 -334823 -376118 -392460 -396117 -363482 -325396 -317605 -370270 -409189 -404678 -386641 -414775
6078 -414775 -421782 -421039 -408982 -351453 -334740 -345080 -366243 -376059 -352318 -367820 -384597 -354694
6066 -354694 -365593 -375554 -365843 -335765 -308921 -293259 -317916 -288722 -221577 -258505 -313355 -307460
6054 -307460 -290682 -306613 -345522 -330874 -326307 -325439 -296173 -302106 -354839 -360869 -312536 -275444 -303659
6041 -303659 -293294 -271028 -298232 -288105 -274914 -311577 -318921 -261675 -283968 -303021 -301630 -299103
6029 -299103 -325808 -341860 -340825 -292280 -274254 -281368 -292370 -255909 -270893 -286322 -291740 -280442
6017 -280442 -294415 -346486 -388744 -428685 -427490 -407207 -362807 -301221 -210320 -263809 -334387 -345741
6005 -345741 -343994 -390681 -351071 -330384 -300327 -248881 -259010 -320778 -352379 -336692 -363801 -330424
5993 -330424 -354811 -432631 -440385 -409764 -343350 -315310 -325959 -302870 -286961 -304038 -286896 -288806
5981 -288806 -290708 -329420 -312697 -327823 -356028 -328270 -352561 -397177 -413143 -406544 -395239 -410634
5969 -410634 -371310 -281773 -234506 -273118 -302430 -327877 -373569 -335987 -329367 -361367 -369003 -329009
5957 -329009 -313378 -308939 -341690 -304785 -263986 -266809 -320686 -355426 -339100 -294180 -241396 -269871
5945 -269871 -294933 -300173 -331601 -334521 -334349 -353621 -395084 -368683 -421295 -422232 -394050 -380741 -402743
5932 -402743 -350056 -317589 -316529 -346544 -306279 -301294 -293485 -291730 -330070 -343785 -362250 -350725
5920 -350725 -357396 -381164 -350601 -311169 -316373 -339340 -329771 -316205 -343311 -351368 -315832 -302338
5908 -302338 -323567 -283602 -269864 -252747 -282863 -320454 -345123 -376247 -381640 -390635 -383669 -403004
5896 -403004 -399773 -392132 -403286 -434841 -438734 -398430 -402344 -408411 -418775 -376283 -338673 -350117 -341784
5883 -341784 -322198 -361966 -438819 -455183 -395658 -357167 -340017 -367670 -400123 -367044 -383493 -367160
5871 -367160 -288576 -290556 -294661 -319974 -341032 -372037 -361746 -354680 -281011 -207047 -215717 -265789
5859 -265789 -276667 -290374 -357923 -389539 -375025 -331022 -336456 -345915 -367473 -384198 -404061 -420511
5847 -420511 -431294 -408201 -377809 -381957 -336564 -301765 -305578 -320045 -303752 -283818 -264230 -310129
5835 -310129 -351353 -352480 -367212 -366868 -334432 -288917 -302877 -365419 -388405 -393366 -353598 -338690
5823 -338690 -303057 -266242 -329245 -321598 -367983 -364972 -419840 -367865 -376818 -377958 -363015 -345335
5811 -345335 -289702 -237237 -283655 -317676 -352575 -329219 -340348 -354381 -345672 -303454 -319226 -334124
5799 -334124 -323147 -295565 -287292 -257761 -287401 -289798 -259040 -266722 -330871 -362498 -319745 -290681
5787 -290681 -313788 -323002 -315463 -299709 -338133 -389823 -372855 -366698 -369635 -392564 -369663 -333584
5775 -333584 -359083 -363086 -353257 -376667 -353189 -315301 -356217 -343000 -317514 -302734 -291564 -310861
5763 -310861 -316987 -319797 -278546 -280851 -315260 -343280 -361976 -330756 -276131 -305870 -326579 -331565
5751 -331565 -253153 -193318 -212845 -260732 -297675 -295314 -297034 -321351 -407497 -411971 -356894 -384526
5739 -384526 -370684 -344784 -342113 -370423 -392259 -374985 -294051 -240163 -215392 -191493 -248078 -257105
5727 -257105 -239616 -259159 -288239 -281159 -333245 -331798 -338890 -369960 -386679 -369443 -322673 -302860
5715 -302860 -321733 -327179 -272239 -316365 -339059 -343861 -376495 -333609 -357971 -419048 -367613 -357172
5703 -357172 -340179 -331981 -340646 -306803 -311983 -331732 -376059 -380010 -339397 -323874 -286540 -306837
5691 -306837 -334154 -309521 -293497 -353933 -400613 -413536 -369338 -315367 -333478 -347225 -305180 -272639
5679 -272639 -272812 -299953 -335294 -310771 -288212 -325562 -321390 -331036 -370096 -356677 -305430 -287129
5667 -287129 -321810 -372726 -382041 -336395 -348795 -344876 -335804 -319963 -309781 -329013 -317901 -296267
5655 -296267 -327340 -335651 -282911 -328236 -318916 -288333 -300275 -274180 -272891 -287488 -268836 -296213
5643 -296213 -336979 -322436 -335815 -358572 -305051 -299555 -302992 -297722 -282134 -285535 -234781 -186316
5631 -186316 -223117 -276474 -215822 -221211 -268737 -320638 -322493 -356908 -331539 -344357 -380994 -351447
5619 -351447 -387017 -416934 -417109 -392450 -360968 -409344 -451541 -479789 -474912 -452885 -442289 -402844
5607 -402844 -341655 -286736 -288388 -288656 -310098 -317815 -292502 -257173 -292695 -336611 -389422 -386713 -386695
5594 -386695 -387931 -374190 -348981 -374459 -417143 -406162 -346131 -354398 -372980 -354046 -356318 -412346
5582 -412346 -434896 -404502 -378999 -409370 -456311 -466687 -417003 -437724 -422282 -362419 -391280 -436359
5570 -436359 -359808 -322529 -362910 -397309 -417809 -377792 -365912 -366170 -372487 -360683 -332015 -290017
5558 -290017 -312397 -327962 -355894 -363300 -386904 -417069 -432976 -427324 -406848 -396873 -421422 -398784
5546 -398784 -393801 -394294 -380669 -323111 -277157 -312834 -341821 -341647 -354164 -368573 -362133 -357897 -340472
5533 -340472 -316991 -312715 -315745 -333790 -371897 -389498 -366809 -364746 -369196 -340361 -357853 -374377
5521 -374377 -342801 -322984 -312471 -269783 -258510 -278296 -277797 -302855 -343532 -315818 -264621 -256210
5509 -256210 -236197 -274070 -319652 -334423 -376009 -365510 -317510 -302154 -262870 -328922 -318123 -302795
5497 -302795 -266746 -310883 -372917 -378707 -323837 -311414 -280001 -257560 -233425 -277912 -343512 -360382
5485 -360382 -362878 -374828 -322601 -292627 -299578 -284996 -302324 -344661 -369870 -328119 -314239 -369526
5473 -369526 -404113 -403185 -388173 -320586 -303269 -314144 -301817 -284940 -307933 -317026 -281914 -255906
5461 -255906 -258185 -242457 -253511 -290078 -343352 -336839 -302592 -317618 -345512 -355661 -341027 -318196
5449 -318196 -246074 -238588 -298740 -283906 -257829 -304590 -325845 -304143 -287951 -272429 -270913 -291075
5437 -291075 -328584 -387930 -355344 -316225 -318878 -306820 -304551 -328609 -337196 -381118 -389735 -371419
5425 -371419 -338860 -315753 -260714 -274106 -297993 -356465 -373084 -376169 -375465 -339073 -295823 -294833 -326539
5412 -326539 -337018 -376571 -403313 -432835 -393068 -295011 -341727 -406042 -353375 -304465 -274659 -308520
5400 -308520 -311913 -292531 -340928 -416218 -446192 -394396 -411528 -447422 -448597 -405821 -359850 -338316
5388 -338316 -314516 -284216 -254385 -271815 -284230 -302951 -291162 -308577 -322804 -373722 -340963 -310196
5376 -310196 -264178 -288870 -301046 -284353 -261750 -268293 -248519 -328800 -321676 -277658 -269081 -298475
5364 -298475 -284379 -245039 -232967 -321740 -351502 -333909 -275967 -233560 -252244 -274692 -302460 -349173
5352 -349173 -355076 -294853 -320080 -349810 -319056 -383768 -433612 -440054 -396341 -403960 -390598 -387580
5340 -387580 -372932 -331376 -360694 -373361 -352384 -309744 -294872 -325503 -330169 -327724 -299392 -286877
5328 -286877 -342056 -326161 -311606 -305132 -260245 -296766 -272681 -302899 -362491 -345880 -326061 -316130
5316 -316130 -301628 -292598 -318647 -297687 -278229 -311942 -333520 -301098 -268312 -259733 -260807 -244672
5304 -244672 -240822 -286233 -266075 -253144 -259625 -313650 -288662 -289168 -288094 -288560 -287884 -245428 -222650
5291 -222650 -202449 -221950 -257504 -262450 -252937 -297335 -311913 -277210 -250962 -234436 -272732 -278849
5279 -278849 -237266 -280453 -311663 -303862 -288666 -271102 -289482 -312365 -338235 -310021 -300003 -306535
5267 -306535 -286373 -306029 -265010 -275209 -299703 -306409 -290115 -254593 -213555 -242410 -294868 -314847
5255 -314847 -295310 -314448 -306603 -313939 -310098 -269321 -206909 -234910 -303836 -304398 -269419 -275206 -324888
5242 -324888 -346711 -350617 -354898 -329218 -311537 -271736 -262879 -272670 -252990 -237044 -267622 -280607
5230 -280607 -332041 -394343 -383729 -350067 -300950 -261670 -271871 -305597 -344391 -347494 -354438 -330976
5218 -330976 -298005 -315296 -330717 -355044 -311347 -303830 -305683 -371034 -345844 -275286 -268850 -247015
5206 -247015 -249624 -281701 -281882 -298685 -270738 -229106 -269184 -322408 -340106 -335000 -306264 -285442
5194 -285442 -279204 -300239 -303748 -363509 -315549 -294368 -310399 -342499 -348075 -338565 -332129 -356131 -339424
5181 -339424 -309337 -335156 -330952 -379984 -372728 -338402 -337726 -313864 -299907 -273802 -303907 -349633
5169 -349633 -370757 -352174 -344529 -356330 -357211 -375928 -362034 -366477 -353339 -339962 -340203 -359355 -323843
5156 -323843 -275573 -267839 -269114 -294466 -304188 -283617 -347455 -392953 -352044 -348587 -344135 -329986 -290032
5143 -290032 -255800 -284643 -304190 -313055 -288400 -273565 -248624 -256768 -261687 -282622 -300507 -277948
5131 -277948 -236838 -234797 -297176 -337151 -395353 -402508 -335037 -317459 -354006 -333044 -336582 -318662
5119 -318662 -266796 -343698 -401689 -398386 -305719 -292777 -305842 -287032 -285204 -265123 -294941 -344092
5107 -344092 -270853 -200432 -231423 -286117 -297817 -293342 -289615 -269172 -275333 -282951 -310467 -322567
5095 -322567 -302789 -287108 -299906 -299632 -285069 -258291 -251047 -231091 -251256 -251262 -260885 -214177 -189604
5082 -189604 -203131 -237186 -268680 -304652 -309180 -288798 -231362 -257954 -294620 -351666 -384597 -351360
5070 -351360 -356207 -338962 -273747 -228323 -237002 -220386 -199513 -221894 -273087 -254842 -282958 -318004
5058 -318004 -371191 -345290 -323438 -329217 -351581 -318818 -275336 -243431 -285202 -295683 -283585 -302652
5046 -302652 -300924 -262000 -216693 -235636 -248856 -256775 -262991 -298184 -289301 -245942 -254321 -272999 -238585
5033 -238585 -223783 -205474 -176937 -251494 -334548 -360675 -341307 -303786 -293974 -341094 -355431 -338324
5021 -338324 -337237 -332353 -285967 -265987 -279330 -329002 -339459 -339098 -324271 -246688 -257600 -276208
5009 -276208 -302406 -312937 -291889 -214230 -233384 -269304 -284575 -274264 -297949 -319725 -278870 -301431
4997 -301431 -319376 -315391 -316915 -314931 -275709 -234155 -226240 -211318 -193241 -247250 -265635 -276598
4985 -276598 -284687 -286514 -269631 -254318 -269405 -320849 -358987 -340467 -295370 -277247 -277887 -325148
4973 -325148 -368519 -330626 -264833 -248982 -299872 -347577 -314093 -297984 -281194 -279485 -293833 -333026
4961 -333026 -325372 -310187 -298246 -316988 -284108 -274144 -290464 -280515 -257256 -255128 -289526 -315577
4949 -315577 -315345 -298415 -289456 -282714 -249657 -243467 -269636 -333458 -391217 -391351 -382143 -371636 -392501
4936 -392501 -296163 -271915 -274082 -314702 -267573 -277505 -306611 -296320 -298341 -314409 -319287 -329839
4924 -329839 -338682 -316989 -322931 -349919 -329120 -276691 -226608 -256971 -260833 -253968 -281166 -285357 -325322
4911 -325322 -370475 -387231 -340669 -333131 -324692 -340197 -355283 -308668 -330758 -328282 -306397 -301219
4899 -301219 -308172 -316369 -289854 -259668 -262295 -268388 -307327 -356264 -324850 -366483 -359235 -341140 -301975
4886 -301975 -293739 -257966 -219245 -207760 -236984 -259555 -268941 -302099 -306009 -325622 -366394 -354111
4874 -354111 -328116 -295587 -310455 -322538 -310019 -334864 -390602 -354692 -340904 -355882 -316623 -266063
4862 -266063 -254543 -278554 -292915 -306668 -360410 -400392 -357776 -304237 -285143 -313821 -305131 -267158
4850 -267158 -243139 -229770 -234580 -266563 -330062 -339260 -312502 -343393 -402226 -397633 -375233 -365657
4838 -365657 -352781 -322893 -321567 -317501 -341360 -392285 -365874 -306844 -290797 -356676 -363864 -331983
4826 -331983 -311019 -312939 -330932 -360759 -338318 -354297 -409375 -379372 -349408 -353756 -317309 -303425
4814 -303425 -277203 -309284 -347418 -301209 -272303 -282162 -300952 -272855 -247737 -234035 -214212 -238440
4802 -238440 -235761 -224171 -248278 -241852 -231958 -202893 -236733 -261021 -237003 -230523 -253847 -233782
4790 -233782 -245175 -260713 -295764 -290487 -300229 -332806 -258129 -213079 -242219 -280677 -327992 -372532
4778 -372532 -340673 -236881 -156558 -185463 -266767 -315296 -303044 -314965 -329049 -355423 -331363
4767 -331363 -304537 -334864 -351970 -321388 -251011 -256669 -270164 -277870 -267243 -271974 -264178 -290495
4755 -290495 -282400 -283278 -371682 -397836 -364649 -327495 -314827 -278566 -250455 -243978 -219355 -208351
4743 -208351 -235256 -294918 -315116 -328291 -327818 -324412 -319537 -284609 -320945 -284268 -242061 -199676
4731 -199676 -222180 -249549 -264534 -272504 -247384 -224814 -286530 -365110 -342275 -286193 -330410 -399846
4719 -399846 -394024 -358242 -350155 -322908 -304549 -317965 -229997 -221806 -255432 -251199 -250464 -290444 -335739
4706 -335739 -288685 -241873 -232566 -218185 -222187 -271379 -306118 -327216 -340231 -340035 -329022 -293792
4694 -293792 -317485 -307499 -281942 -300730 -287645 -290395 -324738 -343114 -354410 -356806 -325481 -297946
4682 -297946 -327119 -339240 -377231 -339977 -291811 -247945 -266537 -286697 -259740 -245063 -273365 -321299
4670 -321299 -311419 -356031 -358600 -349075 -338812 -330516 -308905 -316215 -320747 -322443 -290433 -255302 -297100
4657 -297100 -265757 -234437 -198629 -226851 -264202 -309564 -304163 -282189 -267261 -307578 -361371 -385856
4645 -385856 -351186 -341782 -311323 -257608 -266413 -284002 -324762 -285004 -255669 -251239 -286612 -283768
4633 -283768 -306219 -298271 -313443 -352635 -328265 -283549 -298828 -276917 -288560 -278652 -250573 -232374
4621 -232374 -230361 -214856 -208396 -239246 -290155 -311689 -309876 -287651 -306293 -354067 -281681 -279243
4609 -279243 -296404 -338317 -318047 -339877 -373625 -382589 -356590 -350948 -344210 -358477 -383033 -400476
4597 -400476 -395334 -349070 -368408 -358769 -311271 -302938 -256583 -273395 -296934 -280430 -280836 -322988 -333636
4584 -333636 -341338 -326204 -304814 -326070 -337064 -372897 -397692 -373163 -355306 -309914 -286263 -296705
4572 -296705 -322860 -308465 -274217 -292279 -269833 -280559 -326078 -336276 -319482 -323069 -271664 -282467
4560 -282467 -235590 -207258 -220537 -298233 -308654 -293049 -272220 -286397 -283745 -241802 -258008 -288594
4548 -288594 -299317 -308580 -281983 -294141 -342531 -343114 -314083 -315545 -334047 -403413 -413979 -391161
4536 -391161 -339644 -285141 -276775 -266255 -315256 -348898 -398264 -415847 -379176 -337941 -329499 -344151
4524 -344151 -317163 -235602 -207378 -180468 -199033 -216938 -173995 -221203 -287806 -292359 -246938 -201720
4512 -201720 -233485 -254789 -226370 -249415 -294497 -307835 -305786 -323127 -350716 -319646 -253899 -266117
4500 -266117 -278058 -303696 -287107 -261982 -289736 -334535 -335959 -348531 -327993 -327824 -340726 -376767
4488 -376767 -382738 -361299 -311317 -263775 -259321 -290173 -284570 -301344 -326607 -342827 -309406 -291395
4476 -291395 -327936 -377318 -379617 -329317 -329154 -350589 -383722 -365448 -348467 -312384 -292434 -312991
4464 -312991 -341341 -300281 -280926 -279786 -274735 -260851 -217957 -228156 -250893 -250413 -294581 -315634
4452 -315634 -267607 -261315 -242118 -254795 -270800 -302186 -330735 -360123 -336363 -347561 -354428 -354410 -341485
4439 -341485 -296023 -289242 -238793 -161973 -211258 -288626 -299475 -250967 -226071 -242658 -283078 -256905
4427 -256905 -260152 -245501 -319324 -332961 -348891 -343112 -302913 -253574 -241931 -199753 -208297 -237736
4415 -237736 -280895 -298596 -244638 -269320 -306615 -305279 -286746 -294375 -348446 -353725 -318231 -243890
4403 -243890 -230229 -259633 -307238 -342108 -324106 -269578 -281306 -301795 -276519 -286357 -364661 -406417
4391 -406417 -392182 -345253 -259408 -201729 -196463 -224609 -255558 -288680 -281797 -226341 -216003 -237845
4379 -237845 -263860 -244442 -250298 -275296 -249321 -291395 -345667 -350085 -344291 -386142 -363999 -346405
4367 -346405 -347910 -368555 -345035 -321565 -306276 -295526 -276983 -300335 -328194 -288631 -242309 -270170
4355 -270170 -300725 -309690 -298782 -242951 -209297 -239264 -236376 -204631 -236498 -239442 -234088 -214275
4343 -214275 -208050 -229453 -260536 -291857 -299661 -291598 -272139 -306461 -328446 -314154 -302963 -277645
4331 -277645 -325436 -363990 -374120 -348719 -402304 -422468 -383421 -347612 -306760 -285339 -331208 -353148
4319 -353148 -298355 -279284 -309404 -308545 -328057 -329955 -326471 -331589 -362417 -377996 -364614 -350701 -376573
4306 -376573 -345503 -248579 -227726 -209937 -205690 -295777 -307621 -303366 -309289 -321426 -296512 -298445
4294 -298445 -290737 -305772 -326600 -339778 -338840 -307040 -251674 -255026 -282193 -245755 -238282 -238511 -222416
4281 -222416 -231688 -287593 -321906 -329981 -299530 -324288 -331331 -353436 -343990 -347385 -350615 -317735 -283851
$$ [...]
##END NTUPLES=NMR SPECTRUM
##END=
