##TITLE=Analysis number 325538
Compound Code sb 01264
Project Code adrs
Chemist Name stores
##JCAMPDX= 6.0         $$ Bruker NMR JCAMP-DX V2.0
##DATA TYPE= NMR SPECTRUM
##DATA CLASS= NTUPLES
##ORIGIN= Bruker BioSpin GmbH
##OWNER= nmr
$$ XWIN-NMR		Version 3.5
$$ Thu Jan  4 08:20:07 2007 GMT Standard Time (UT+0h)  MAYBRIDGE\nmr@NMR_250MHZ
##.OBSERVE FREQUENCY= 250.131544655141
##.OBSERVE NUCLEUS= ^1H
##.ACQUISITION MODE= SIMULTANEOUS (DQD)
##.ACQUISITION SCHEME= undefined
##.AVERAGES= 16
##.DIGITISER RES= 18
##SPECTROMETER/DATA SYSTEM= dpx250
##.PULSE SEQUENCE= zg30
##.SOLVENT NAME= CDCl3
##.SHIFT REFERENCE= (INTERNAL, CDCl3, 0, 16.5294)
##AUDIT TRAIL= $$ (NUMBER, WHEN, WHO, WHERE, WHAT)
$$ ##TITLE= Audit trail, XWIN-NMR		Version 3.5
$$ ##JCAMPDX= 5.01
$$ ##ORIGIN= Bruker BioSpin GmbH
$$ ##OWNER= nmr
$$ C:\u/data/dgb/nmr/ADRS/210/pdata/1/auditp.txt
$$ ##AUDIT TRAIL=  $$ (NUMBER, WHEN, WHO, WHERE, WHAT)
(   1,<2007-01-04 08:19:46.14 +000>,<MAYBRIDGE\nmr>,<NMR_250MHZ>,
      <created by zg, POWCHK disabled, PULCHK disabled
       configuration hash MD5:
       49 4B E0 1D 92 C2 6B 37 9F E6 65 BC 52 41 86 1D
       data hash MD5: 64K
       98 3A EB 46 4F C2 A6 56 C8 89 DA A9 FB B7 7C 54>)
(   2,<2007-01-04 08:19:57.80 +000>,<MAYBRIDGE\nmr>,<NMR_250MHZ>,
      <Start of raw data processing
       ef LB = 0.3 FT_mod = 6 PKNL = 1 SI = 32K 
       data hash MD5: 32K
       56 75 FB 76 0E C5 CC BA 46 EA 86 D2 0C 33 ED 21>)
(   3,<2007-01-04 08:19:59.50 +000>,<MAYBRIDGE\nmr>,<NMR_250MHZ>,
      <apk 
       data hash MD5: 32K
       CB 28 81 E4 40 34 35 89 99 D3 24 DC 9E 02 A9 C2>)
(   4,<2007-01-04 08:20:00.19 +000>,<MAYBRIDGE\nmr>,<NMR_250MHZ>,
      <abs ABSG = 5 
       data hash MD5: 32K
       E0 84 7A 76 4F 00 5D 01 C3 11 41 E9 F4 27 0C 92>)
$$ ##END=
$$ 
$$ hash MD5
$$ D1 8C FD 0B FD B0 46 85 D1 82 C7 8A 1E 78 3E B6
##$RELAX= 
##$RELAX= 
##$RELAX= 
##$RELAX= 
##$RELAX= 
##$RELAX= 
##$RELAX= 
$$ Bruker specific parameters
$$ --------------------------
##$DU= <C:\u>
##$EXPNO= 210
##$NAME= <ADRS>
##$PROCNO= 1
##$TYPE= <nmr>
##$USER= <dgb>
##$AMP= (0..31)
100 100 100 100 100 100 100 100 100 100 100 100 100 100 100 100 100 100 
100 100 100 100 100 100 100 100 100 100 100 100 100 100 
##$AQSEQ= 0
##$AQ_mod= 3
##$AUNM= <au_zg>
##$AUTOPOS= <3 >
##$BF1= 250.13
##$BF2= 250.13
##$BF3= 250.13
##$BF4= 250.13
##$BF5= 500.13
##$BF6= 500.13
##$BF7= 500.13
##$BF8= 500.13
##$BYTORDA= 1
##$CFDGTYP= 0
##$CFRGTYP= 5
##$CHEMSTR= <none>
##$CNST= (0..31)
1 1 145 1 1 1 1 1 1 1 1 1 1 1 1 1 1 1 1 1 1 1 1 1 1 1 1 1 1 1 1 1 
##$CPDPRG= <>
##$CPDPRG1= <>
##$CPDPRG2= <>
##$CPDPRG3= <>
##$CPDPRG4= <mlev>
##$CPDPRG5= <mlev>
##$CPDPRG6= <mlev>
##$CPDPRG7= <mlev>
##$CPDPRG8= <mlev>
##$CPDPRGB= <>
##$CPDPRGT= <>
##$D= (0..31)
0 1 0 0 0 0 0 0 0 0.06 0 0 0 0 0 0 0.0002 0 0 0 0 0 0 0 0 0 0 0 0 0 0 
0 
##$DATE= 1167898785
##$DBL= (0..7)
120 120 120 120 120 120 120 120 
##$DBP= (0..7)
150 150 150 150 150 150 150 150 
##$DBP07= 0
##$DBPNAM0= <>
##$DBPNAM1= <>
##$DBPNAM2= <>
##$DBPNAM3= <>
$$ [...]
##$SUBNAM7= <"">
##$SUBNAM8= <"">
##$SUBNAM9= <"">
##$SW= 20.6930455092707
##$SWIBOX= (0..15)
0 0 3 0 0 0 0 0 0 0 0 0 0 0 0 0 
##$SW_h= 5175.983436853
##$TD= 65536
##$TD0= 1
##$TE= 294.16
##$TE2= 300
##$TE3= 300
##$TEG= 300
##$TL= (0..7)
0 120 120 120 120 120 120 120 
##$TP= (0..7)
150 150 150 150 150 150 150 150 
##$TP07= 0
##$TPNAME0= <>
##$TPNAME1= <>
##$TPNAME2= <>
##$TPNAME3= <>
##$TPNAME4= <>
##$TPNAME5= <>
##$TPNAME6= <>
##$TPNAME7= <>
##$TPOAL= (0..7)
0.5 0.5 0.5 0.5 0.5 0.5 0.5 0.5 
##$TPOFFS= (0..7)
0 0 0 0 0 0 0 0 
##$TUNHIN= 0
##$TUNHOUT= 0
##$TUNXOUT= 0
##$USERA1= <user>
##$USERA2= <user>
##$USERA3= <user>
##$USERA4= <user>
##$USERA5= <user>
##$V9= 5
##$VALIST= <valist>
##$VCLIST= <CCCCCCCCCCCCCCC>
##$VD= 0
##$VDLIST= <DDDDDDDDDDDDDDD>
##$VPLIST= <PPPPPPPPPPPPPPP>
##$VTLIST= <TTTTTTTTTTTTTTT>
##$WBST= 1024
##$WBSW= 4
##$XGAIN= (0..3)
0 0 0 0 
##$XL= 0
##$YL= 0
##$YMAX_a= 342956
##$YMIN_a= -410708
##$ZGOPTNS= <>
##$ZL1= 120
##$ZL2= 120
##$ZL3= 120
##$ZL4= 120
##$ABSF1= 16.52939
##$ABSF2= -4.163784
##$ABSG= 5
##$ABSL= 3
##$ALPHA= 0
##$AQORDER= 0
##$ASSFAC= 0
##$ASSFACI= 0
##$ASSFACX= 0
##$ASSWID= 0
##$AUNMP= <proc_1d>
##$AZFE= 0.1
##$AZFW= 0.1
##$BCFW= 0
##$BC_mod= 0
##$BYTORDP= 0
##$COROFFS= 0
##$CY= 12.5
##$DATMOD= 1
##$DC= 0
##$DFILT= <>
##$DTYPP= 0
##$F1P= 14.0000005364418
##$F2P= -0.99999901652339
##$FCOR= 0.5
##$FTSIZE= 32768
##$FT_mod= 6
##$GAMMA= 0
##$GB= 0
##$INTBC= 1
##$INTSCL= 1
##$ISEN= 128
##$LB= 0.3
##$LEV0= 0
##$LPBIN= 0
##$MAXI= 10000
##$MC2= 0
##$MEAN= 0
##$ME_mod= 0
##$MI= 0
##$NCOEF= 0
##$NC_proc= -4
##$NLEV= 6
##$NOISF1= 0
##$NOISF2= 0
##$NSP= 0
##$NTH_PI= 0
##$NZP= 0
##$OFFSET= 16.52939
##$PC= 1
##$PHC0= 225.1533
##$PHC1= 6.124882
##$PH_mod= 1
##$PKNL= yes
##$PPARMOD= 0
##$PSCAL= 4
##$PSIGN= 0
##$REVERSE= no
##$SF= 250.129998150816
##$SI= 32768
##$SIGF1= 0
##$SIGF2= 0
##$SINO= 400
##$SIOLD= 32768
##$SREGLST= <1H.CDCl3>
##$SSB= 0
##$STSI= 32768
##$STSR= 0
##$SW_p= 5175.98343685301
##$SYMM= 0
##$S_DEV= 0
##$TDeff= 65536
##$TDoff= 0
##$TI= <Analysis number 999999
Compound Code 99
Book Reference 9
Project Code 9>
##$TILT= no
##$TM1= 0
##$TM2= 0
##$TOPLEV= 0
##$USERP1= <user>
##$USERP2= <user>
##$USERP3= <user>
##$USERP4= <user>
##$USERP5= <user>
##$WDW= 1
##$XDIM= 32768
##$YMAX_p= 454331418
##$YMIN_p= -264800
$$ End of Bruker specific parameters
$$ ---------------------------------
##NTUPLES= NMR SPECTRUM
##VAR_NAME=  FREQUENCY,     SPECTRUM/REAL,   SPECTRUM/IMAG
##SYMBOL=    X,             R,               I
##VAR_TYPE=  INDEPENDENT,   DEPENDENT,       DEPENDENT
##VAR_FORM=  AFFN,          ASDF,            ASDF
##VAR_DIM=   32768,         32768,           32768
##UNITS=     HZ,            ARBITRARY UNITS, ARBITRARY UNITS
##FACTOR=    0.157963299565203, 1,           1
##FIRST=     4134.49637394843, 0,            0
##LAST=      -1041.48706290458, 0,           0
##MIN=       -1041.48706290458, -264800,     0
##MAX=       4134.49637394843, 454331418,    0
$$ Real data points
##PAGE= N=1
##DATA TABLE= (X++(R..R)), XYDATA
$$ [...]
28925F3455J5595J5277m2949n5636L4056L2842m1629o7035j3407Q271j2844j1607
28913g5611K883k7620N1652O1407L2359Q795j797M42j5948M588k8601M0167K1318
28900G4034l5635k9711L0568L7629k3693o5535r915j7350n9670k0976O1849k2223
28888h0628l8891N7301P6992O5506r1406j03275L2253K7040M7204m76Q350K0781
28876B0751n523k0338m3386K4068L1412M945l5096k5309j4219K3710J5316m4057
28864f7726N4007M0470J6204N2772j1319J7787K2325l006q3116l8305Q2174j3573
28852F8694k1970p321l8607m7769L6614n202j2835P1870M0909j474M3388n8533
28840F7764m3884K4472N4567j531l7737L3336K6972j0271m2902q7579o4856Q220
$$ plain form
28925 63455 79050 94327 51378 -4258 29798 62640 21011 -46024 -59431 -51160 -64004 -75611
28913 -75611 -72728 -100348 -48696 12711 45070 53865 52068 52510 36562 41150 12549 52716 74034
28900 74034 38399 8688 39256 76885 53192 -12343 -22258 -39608 -99278 -120254 -58405 -80628
28888 -80628 -119519 -62218 14774 80280 -11126 -114401 -82148 -55108 -7904 -8380 -30 20751
28876 20751 15228 -5110 -48496 -24428 6984 11929 -23167 -48476 -62695 -38985 -23669 -67726
28864 -67726 -13719 26751 42955 95727 84408 102195 124520 121514 38398 93 82267 68694
28852 68694 46724 39403 796 -46973 -10359 -15561 -28396 43474 84383 82909 126297 67764
28840 67764 23880 48352 102919 101388 63651 96987 123959 113688 70786 -16793 -81649 -73429
28828g3429m3450j3326O2549K4449J9304N3531n5637l9926j9850J9754J8525L4056
28816a3450O3726L5999J3496Q532J2674n801n5285r4474M599O0778M5443j2590
28804F3647m2565k0158j6147Q665p698l9542k6844J3946O0143L6490j8410l311
28792H216n3288l3707K8008j9598r729O5045J7907M2073J5988p1517l6348P9395
28780C2445L0224j7510k8646K0659M5972k5817k8612m2195J0331J0618m3439m1535
28768g7505M8592J9347l8286J2215O4587N227M5832M0553p0095j7097J3066k2209
28756B4227M4159Q5823K0449K3381l1383l9831q2433p6316l0639K4916N3932J7183
28744C3468J3022j621l6420J2238P7071K0019k7880n0288o0006j2807L0539k1719
$$ plain form
28828 -73429 -116879 -130205 -67656 -43207 -23903 29628 -26009 -65935 -85785 -66031 -47506 -13450
28816 -13450 50276 86275 99771 108303 120977 115176 59891 -34583 -29984 30794 76237 63647
28804 63647 21082 924 -15223 -6558 -14256 -53798 -80642 -66696 -6553 29937 11527 8216
28792 8216 -45072 -78779 -50771 -70369 -80098 -15053 2854 44927 60915 -10602 -46950 32445
28780 32445 62669 45159 16513 37172 83144 57327 28715 -13480 -3149 7469 -35970 -77505
28768 -77505 -28913 -9566 -47852 -35637 28950 34177 80009 120562 50467 33370 46436 24227
28756 24227 68386 154209 174658 198039 166656 126825 44392 -31924 -62563 -37647 16285 33468
28744 33468 46490 44869 8449 20687 97758 117777 89897 39609 -20397 -33204 -2665 -24384
28732b4384J6144M6459N236m5198K9133m1521k8797J8020l5248M9686J6091j1315
28720e694k0619k1189m1336L6312N1190n9693j9409J0207J9751J8913r811R128
28708c2250N8317n698r3234n0274L1889O722N8377K9631j3602J0193o653N8354
28696E1772l4100J0678l2070J6665M5929K2023j2270l5768k1688K2168J4879N9984
28684A08202k2769k5416j9091o927j4184P7005j1118m8605K615P843j4665l4091
28672a201J6838P488K8723K5249n1821m3830L4789L9277n6791K0449M4794q1995
28660a8031m8095N6623J1565j440J6824m3966m0524k0983J12734M3947q5761m6864
28648f3971j6936L4355N0430m4009k9954j2078R251N2951N2199o2406j00098M4456
$$ plain form
28732 -24384 -8240 38219 43455 -1743 27390 -14131 -42928 -24908 -60156 -10470 5621 -5694
28720 -5694 -26313 -47502 -88838 -52526 -1336 -61029 -80438 -70231 -50480 -31567 -41378 -32250
28708 -32250 26067 20369 -72865 -123139 -91250 -84528 -26151 3480 -10122 71 -6582 51772
28696 51772 17672 28350 -3720 12945 58874 80897 68627 32859 11171 33339 48218 108202
28684 108202 85433 60017 40926 33999 19815 96820 85702 37097 39712 47555 32890 -1201
28672 -1201 15637 23125 51848 77097 25276 -18554 16235 55512 -1279 19170 63964 -18031
28660 -18031 -66126 -9503 2062 622 17446 -26520 -67044 -88027 24707 68654 -17107 -63971
28648 -63971 -80907 -46552 3878 -40131 -70085 -82163 -72912 -19961 32238 -30168 -130266 -85810
28636h5810J45398K663p8022n7686l1673J4362J2718M4292L1566Q178j6474o2663
28624g3151p288M8463K9916N5547n3830M334j3439l8792k8071l101Q8802K1443
28612C0833p3762n612M030o679P2531L9143j2113k1807q359K5324n820k1345n4442
28599c8078k3927Q870L1966P453J5403j7484K3330j662J4072N4595j7623n96L5287
28586I1606k3037k6185o8944p5653M2909O367o679O655P077M1417L3221m848k8818
28573d912j681K2330R466l7277n5840J3618Q0463L3962l294L736p178l2971m8851
28560b8429o9079j2477L7853J04863j0770l6880j314L0220P104L6228j1614r534
28548C6171o0409m0760O5151l8251o0422J09745O4554k6793R848K5552l5188n0271
$$ plain form
28636 -85810 59588 62251 -15771 -73457 -105130 -90768 -78050 -33758 -2192 5986 -10488 -73151
28624 -73151 -80439 -31976 -2060 53487 -343 3991 -9448 -48240 -76311 -79412 9390 30833
28612 30833 -42929 -48541 -44511 -51190 21341 60484 48371 26564 18205 43529 37709 16364 -38078
28599 -38078 -62005 -53135 -21169 -13716 1687 -15797 7533 5871 19943 74538 56915 56319 91606
28586 91606 68569 42384 -26560 -102213 -59304 -52937 -59616 -52961 -45884 -4467 28754 23906 -4912
28573 -4912 -6593 15737 25203 -12074 -67914 -54296 26167 60129 56835 60571 53393 20422 -28429
28560 -28429 -97508 -109985 -72132 32731 21961 -14919 -16233 13987 21091 57319 45705 36171
28548 36171 -24238 -64998 153 -38098 -98520 11225 75779 48986 58834 84386 49198 -1073
28536a073M3143l2669m2304n9229L003J8768N4461m772L39J9650M110k3302M0101
28523B0226j5402m8442N7028L6802m1619j1756o151L7741j1558j0469k6829k3571
28511d4000j7928M102M472K3934M025j7247l1606J943Q6049l8529j1736N0899
28499A4378l869K949K4276J2271Q18k5105m0059M7024R452l5770J9965k1401n6505
28486e1576K1333K6421l025k9382l8939O0763P2892N8196j095l8762L927p282
28474G3471m2320n5755r54N2108K1570n5947p1210k5502J8132K1972K8741L914
28462c1780K4131m8594j3879J3521L9608Q3277K2887P1861m2571m7751O447k9018
28450D8139m4281k4084j7650p385j2216J473O3047o4273K5010K3284J8988j147
$$ plain form
28536 -1073 42070 9401 -32903 -92132 -89129 -70361 -15900 -20672 -20333 -683 3427 -19875 20226
28523 20226 4824 -43618 13410 50212 8593 -3163 -9314 28427 16869 6400 -20429 -44000
28511 -44000 -61928 -57826 -53354 -29420 -25395 -42642 -74248 -72305 13744 -24785 -36521 14378
28499 14378 10509 13458 37734 50005 50823 25718 -14341 32683 42135 6365 26330 4929 -51576
28486 -51576 -30243 -3822 -6847 -36229 -75168 -14405 58487 116683 115588 76826 80753 73471
28474 73471 31151 -24604 -25558 26550 48120 -7827 -79037 -104539 -86407 -64435 -35694 -31780
28462 -31780 -7649 -56243 -70122 -56601 -16993 66284 89171 161032 118461 70710 77157 48139
28450 48139 3858 -20226 -37876 -45261 -57477 -56004 7043 -57230 -32220 -8936 10052 8905
28438H905q3744o2039k1364k0815M7523L6494j8616m601P5519Q0933J1234j309
28426D8120K5852p668m619J3768n5824j5501L7345j9752k1484j8587N3988J8303
28414E3941m2651r426k1462J1386L0564m3556o3359J8185l1146K2370K3762j6808
28402f8200O291O0157j4223K0461n1441J9353J2534n3569L1329M1385K4517J3288
28390D1882J9699j5566m8937L3062j7365L7343k1739k6011j5647K128k1027p9859
28378a12037J8066N5337M1918L8092M4982Q671q8864l0905j0702J4793M079l7768
28366e4338k3803L1402R579P7255K6763l8350o4173R745L9424L6398K2521m1687
28354C0736m6215k2265N959O4479m035J37j6810j8476r418L8506k3447L1030k2594
$$ plain form
28438 8905 -74839 -136878 -158242 -179057 -131534 -95040 -113656 -118257 -42738 38195 49429 48120
28426 48120 73972 66304 61685 75453 19629 4128 41473 21721 237 -18350 35638 53941
28414 53941 11290 1864 -19598 -8212 22352 -21204 -84563 -66378 -97524 -75154 -51392 -68200
28402 -68200 -61909 -1752 -15975 4486 -46955 -27602 -15068 -68637 -37308 4077 28594 41882
28390 41882 61581 46015 -2922 30140 12775 50118 28379 2368 -13279 -11151 -32178 -112037
28378 -112037 -93971 -38634 3284 41376 86358 95029 6165 -24740 -35442 -20649 -16570 -54338
28366 -54338 -78141 -46739 -37160 40095 66858 28508 -35665 -25920 13504 49902 72423 30736
28354 30736 -15479 -37744 -31785 32694 28659 28796 11986 -6490 -15908 22598 -849 30181 7587
28341G587m6952K0010L5502J3099M115m8010q6838j6798N7220M6945j474o3042
28329g8636j9039K6555M8398L0696m8161l5664K1073R216J1626L7308k7183j8316
28317d2127K6902J6612K3541m1211L5317j3013o4250J5033M6918j9077j7662P909
28305b5108j7021K3754K7616j0022N868M1861n540k5880J4768m508O132m6363
28293a4443j3657N4372J5445Q282L838N5140l7197j19124j1225J6723j3710p0538
28281a26094M0959L8417P2346J9108j7830M607K8114l4465n0010l1856L3089K1559
28269b056L4456L9110N9744J2924J8463q1315r7247l7623j0767n281Q800K4101
28257c6691L9250J0284J1243K9999q573l445L674k158r061K2004l9650o1633j4376
$$ plain form
28341 7587 -39365 -19355 16147 29246 33361 -14649 -101487 -118285 -61065 -14120 -15594 -78636
28329 -78636 -97675 -71120 -22722 7974 -40187 -75851 -54778 -45562 -33936 3372 -23811 -42127
28317 -42127 -15225 1387 24928 -16283 19034 6021 -58229 -43196 3722 -15355 -33017 -25108
28305 -25108 -42129 -18375 9241 -781 5087 46948 41408 15528 30296 25788 31920 -14443
28293 -14443 -28100 26272 41717 49999 53837 108977 71780 -47344 -58569 -41846 -55556 -126094
28281 -126094 -85135 -46718 25628 44736 26906 31513 59627 25162 -24848 -56704 -23615 -2056
28269 -2056 32400 71510 131254 144178 162641 81326 -15921 -53544 -64311 -69592 -60792 -36691
28257 -36691 2559 12843 24086 54085 45512 42067 45741 43583 34522 56526 16876 -44757 -59133
28244e9133J4034l2585r328N5998P5085k652k8151m1746L9567K3637r424k0126
28232E176k5948r913L815J834N6853l191J9615K9698L413L9204J9770j5488k7295
28219I7543l8043j3325k9156k0832l0767J6274K8881M6083L5920l4065J7832K2789
28207I9134l1362j05312r8458K2435M7884k2K784j8672l1822P3201J0116J7141
28195a2953j9449M1033N9585k7218K6894K7976q9849m6238o458n770K1967J7680
28183a2800J6755J471n1969L2485M9211L1817k6847K7939M9285l3995m0293l8114
28171D945j5463l7700j7433r812j1627K2874M3527J7977P8657J7174q753m6348
28159C8018J3063p3721K5529M0740k9414m1891l5431K443M2448J0790l0672K2718
$$ plain form
28244 -59133 -45099 -77684 -87012 -31014 44071 41419 13268 -28478 11089 34726 25302 5176
28232 5176 -20772 -30685 -26870 -25036 31817 28626 48241 77939 81352 120556 140326 124838 97543
28219 97543 59500 46175 17019 -3813 -34580 -18306 10575 56658 92578 58513 76345 99134
28207 99134 67772 -37540 -135998 -113563 -65679 -65701 -62917 -81589 -113411 -40210 -30094 -12953
28195 -12953 -32402 8631 68216 40998 67892 95868 6019 -40219 -46677 -52447 -30480 -12800
28183 -12800 3955 5426 -46543 -14058 35153 66970 40123 68062 117347 83352 43059 4945
28171 4945 -10518 -48218 -65651 -75463 -87090 -64216 -20689 -2712 75945 93119 84366 38018
28159 38018 51081 -22640 2889 43629 14215 -27676 -63107 -60664 -18216 -7426 -38098 -15380
28147a5380R893PL9999m1720l777M0786K8987k5791m3371k2074L8879l769k9423
28134b6754L7979M196k2088j0128j6660J9499j150j80J8709L3815K2128k0533
28122C8833K5712j0231J4222l7863J5069j1548m5954j5447M1627m861l6313M5677
28110A8923N5022n2972j01945L0258N0073K9187K3425m1327k9833k5638k9452
28099g4279L2432Q2769k2088j7559O3747L8804l0918j4507n0185R71m609n5382
28087e0804J1258M1065Q153k8610o0876K0886K3134m431K3660J4039m9865K9551
28075b2840L0554n325L7271j8237q178j1942N4349K503K5899P277k0178r869q5120
28062b3836p5061N9334J01261P588j4956P996l180L7479r108n0988J9230k1126
$$ plain form
28147 -15380 -5487 -5480 34519 -7201 -10978 29808 58795 33004 -10367 -32441 6438 2669 -26754
28134 -26754 11225 15421 -6667 -16795 -33455 -13956 -15106 -15286 3423 37238 59366 38833
28122 38833 64545 54314 68536 30673 45742 34194 -11760 -27207 14420 9559 -26754 18923
28110 18923 73945 20973 -80972 -50714 -641 28546 51971 10644 -19189 -44827 -74279
28099 -74279 -41847 40922 18834 1275 65022 103826 72908 58401 8216 9187 4578 -50804
28087 -50804 -39546 1519 9672 -18938 -79814 -58928 -35794 -40225 -16565 -2526 -52391 -22840
28075 -22840 7714 2389 39660 21423 13245 1303 55652 58155 84054 91331 71153 61284 -23836
28062 -23836 -98897 -39563 61698 69286 54330 62326 59146 96625 87517 36529 55759 34633
28050C4633J6444l0816j7863P6370P241n7119o767K0787l5889k6030k6816k343
28038d8168P470n3825l364L2636J8007N1506L5764L307J1682o9228K5956J9174
28026C0917K6128o3794k6826M1806o671j5696j5498K7782L4298K9250o5478n2173
28014e5955j4792L0111m4113o584M2539M8270L19J5855O876m3554m6967K7656
28002d0339J9498M3502r823P910p6474K5768R5180N079j5411P251J3433j3729
27990F1845l2481k6645n2161P628j140N2263L5444j5669L3596k1547n1254j5649
27978b5770M1755M1588p5810j352Q230k1862N4282M0608q438p1761k2692o801
27966d8023M3413j1508O2155L1000p408j3065l8843N217L1652n3785q7771n203
$$ plain form
28050 34633 51077 20261 2398 78768 86009 28890 22123 42910 7021 -19009 -45825 -48168
28038 -48168 -40698 -94523 -97887 -65251 -47244 4262 40026 43333 55015 -14213 11743 30917
28026 30917 57045 -6749 -33575 8231 1560 -14136 -29634 -1852 32446 61696 -3782 -55955
28014 -55955 -70747 -40636 -84749 -91333 -48794 -524 -205 15650 22526 -21028 -67995 -40339
28002 -40339 -20841 22661 12838 20748 -55726 -29958 65222 70301 54890 62141 75574 61845
27990 61845 29364 2719 -49442 -41814 -42954 9309 44753 29084 62680 41133 -10121 -25770
27978 -25770 15985 57573 -18237 -19589 -11359 -33221 21061 61669 53231 -18530 -41222 -48023
27966 -48023 -4610 -16118 46037 77037 69629 56564 17721 22938 54590 805 -86966 -92169
27954i2169k673K3247K5725j3778Q169J5516J7416k0990m5581l4205O2314J9072
27942c7937K8928j3511p7992L3229M5987R6694M0855q1406o1848n9000K8013L2336
27930b5652N7643J1194J7583j0876K0057l6780J7377L4263K5529l8596m9100K8082
27918E0724L9957o1701m480N219L7965m5562K049O7761J3948m1816M2461J10k1073
27905H5562L7829k827l8943l7521m7237l215o371j2259m9706k9732N3403j9158
27893g0175J6732L6969l509K240k9447O176K5058L8600K1827k5026l3115j7641
27881c1311K4287n65k5157J9516L0584l2162q3873L8856N3116j7713k3225k5132
27869g2779r299P2569O9762n1862q6166N1369K6122L4955l3930q740n0065J2891
$$ plain form
27954 -92169 -94842 -71595 -45870 -59648 -51479 -35963 -18547 -39537 -85118 -119323 -57009 -37937
27942 -37937 -9009 -22520 -100512 -67283 -21296 75398 116253 34847 -27001 -86001 -57988 -25652
27930 -25652 31991 43185 60768 49892 69949 33169 50546 84809 110338 71742 22642 50724
27918 50724 90681 28980 24500 29719 67684 22122 24171 91932 105880 64064 106525 106635 85562
27905 85562 123391 120564 81621 44100 -3137 -6352 -12723 -24982 -74688 -104420 -51017 -70175
27893 -70175 -53443 -16474 -19983 -17743 -47190 -41014 -15956 22644 44471 19445 -13670 -31311
27881 -31311 -7024 -7589 -32746 -13230 17354 -14808 -98681 -59825 -6709 -24422 -47647 -72779
27869 -72779 -82078 -9509 60253 8391 -77775 -26406 -284 34671 741 -7999 -58064 -45173
27857d5173L5272l8293k2769N653M7349N8047L7313L8144l0235L4114m4000l4004
27845D1418l5272l4745j4481j1154o69j6290k7913K1151k7686k2052J0111M6192
27833g1390L9538n1249n22K552q39J2136P5301L808m8338K0378O4530M1734p898
27820G9741j6788j1649J299P732n139j0115j2664L882L8779o1693j9814j9643
27808b6072n2166m878K564M330p938q793N9078L2426m9k0338N716m1942O56J3939
27794d3467p431K73n083M0846j8817K2514P2607M4598m8346m1071l0456Q0805
27782F6972J5318J8759l2537r774j8954m7821j5891j5349K782J2695L6992L3934
27770D7126k1874l1988J8226l674m2241n5090M8915M4680J6424l147O114J9898
$$ plain form
27857 -45173 -9901 -48194 -70963 -65310 -17961 40086 77399 115543 85308 119422 75422 41418
27845 41418 6146 -28599 -43080 -54234 -54903 -71193 -99106 -77955 -105641 -127693 -117582 -71390
27833 -71390 -31852 -83101 -83623 -81071 -81910 -69774 5527 9335 -39003 -18625 45905 87639 79741
27820 79741 62953 51304 52603 60335 55196 45081 32417 36299 75078 13385 -6429 -26072
27808 -26072 -78238 -83116 -80552 -76222 -84160 -92953 -33875 -1449 -1498 -21836 -16120 -58062 -57406 -43467
27794 -43467 -50898 -50625 -55708 -14862 -33679 -11165 61442 106040 57694 16623 -13833 66972
27782 66972 82290 101049 68512 58738 39784 -8037 -23928 -39277 -36495 -23800 13192 47126
27770 47126 25252 -6736 11490 7816 -34425 -89515 -40600 4080 20504 17357 23471 43369
27758D3369M0882j9o9949k1273J6744n7625l0312L8698P7094P2787n979J8157
27746A22574l3669o9793l4597O6184m3837l6190K6785P4619r097k1890j7143K0089
27734D4035O563j2946P514l3050L3824N3755l6095l3180k5546j3250m5161m3202
27722i6739M8936K7694R372N2348j4030q873J9564j5342m3893N5050j3927l8568
27710a8408k3891L2185K7189k6249K5859Q165K6099K019J8673N0614n0435o9887
27698A933k682P29L840k7667k2805J0061M5544K5818j5331O41J842L5892K1328
27685G9143J2465k4548R735K5369j1166n0989l2341n891n596K5445l684J3001
27673C0943j028N7833Q850k5069r5O2668N5172q080l9502j2868l9246P951J9781
$$ plain form
27758 43369 84251 84232 14283 -6990 9754 -47871 -78183 -39485 37609 110396 104417 122574
27746 122574 88905 19112 -15485 50699 6862 -29328 -2543 72076 62979 41089 23946 44035
27734 44035 50598 37652 45166 12116 45940 99695 63600 30420 4874 -8376 -53537 -96739
27722 -96739 -47803 -20109 -10737 41611 27581 18708 38272 22930 -20963 34087 20160 -18408
27710 -18408 -42299 -10114 17075 -9174 16685 24850 50949 52968 71641 122255 71820 1933
27698 1933 -749 -20 3820 -23847 -46652 -36591 8953 34771 19440 20081 21923 57815 79143
27685 79143 91608 67060 76795 102164 90998 40009 7668 1777 -3819 21626 17942 30943
27673 30943 29915 87748 96598 71529 71434 134102 189274 181194 141692 128824 89578 97529 117310
27660A17310P301o1873k2240L0931J18300j4864n0044m5617K992n3531m5734L9072
27648B2003N4437p2195Q724k1242m1947J2629K1287p372M915L092j2387k801M926
27635b5931M5398l4971J4712N1910p566m0873M6590M8210M81k8786k1080O732
27623E4826J5394j9504l0216k2812J0797L7378J0986m4830k6924l3572o558J5096
27611c9939K3942R186n6598n584Q8485J0943o7861j370K9945o1144J5912M3226
27599a0857m8391K3348O9716M9899r707R44k1642j3308n1038q3625l0812N8200
27587f7273K3277j8472J0176K6295L7419O3678k2298j9081r905J8841m2500J630
27575A787l3159J172O8978l3909j2400l299n0249Q73N2820M3627J9235J7675k0768
$$ plain form
27660 117310 124611 62738 40498 71429 189729 174865 124821 79204 82196 28665 -17069 22003
27648 22003 76440 4245 12969 -8273 -50220 -37591 -16304 -23676 -18761 -15669 -28056 -30857 -25931
27635 -25931 19467 -15504 -792 51118 43552 2679 49269 97479 97960 69174 48094 54826
27623 54826 70220 50716 20500 -2312 8485 45863 56849 12019 -14905 -48477 -55035 -39939
27611 -39939 -15997 -6811 -63409 -68993 19492 30435 -37426 -38796 -8851 -69995 -54083 -10857
27599 -10857 -59248 -35900 33816 83715 74008 74952 53310 40002 -11036 -94661 -125473 -67273
27587 -67273 -43996 -62468 -52292 -25997 11422 75100 52802 33721 23816 42657 157 1787
27575 1787 -31372 -30200 38778 4869 -7531 -10830 -61079 -60206 -7386 36241 55476 73151 52383
27562E2383n0509j1355j3870J5176L1859j3780q0j7912J2806N422N2650J0548
27550G3338L0172R794j8419p4695K7162M0397K2458j3082n3784j5629K8740l9590
27538A6862m1505p224N7385J4409n223m267K3490R507R271J0702o2142o447K1923
27525C6741m9595k3654N0256L3361p758m1615o093m2513l0168l071M499J9517
27513f0093K4459O0652n0202p2010K8860N6350j15J688K5634O4003p6848l315
27501i37j3882N5961k2293k3964o3562n2375M3100p787j0526m1108J7527N2813
27489f7033R397L8915K3351k2399k5635j7175j6727M8287O8239P2046J2818n6459
27477F7625o3772P061J9673q444K0403J7096K5058k3443l6560K9134L9715o5131
$$ plain form
27562 52383 1874 -9481 -23351 -8175 23684 9904 9824 -8088 4718 10140 62790 73338
27550 73338 103510 113304 94885 20190 47352 87749 110207 97125 43341 27712 56452 16862
27538 16862 -24643 -31867 25518 39927 34704 30437 53927 63434 72705 83407 21265 14818 36741
27525 36741 -12854 -36508 13748 47109 39351 -2264 -8357 -50870 -81038 -84109 -79610 -60093
27513 -60093 -35634 25018 -25184 -97194 -68334 -11984 -12099 -10411 15223 79226 2378 -937
27501 -937 -14819 41142 18849 -5115 -68677 -121052 -77952 -85739 -96265 -137373 -119846 -67033
27489 -67033 -57636 -18721 4630 -17769 -43404 -60579 -77306 -29019 39220 111266 124084 67625
27477 67625 3853 10914 30587 22143 42546 59642 84700 61257 24697 53831 93546 28415
27465B8415m0382R995o4298l1265P492M1370k2011j9032P5646K742j9706j8172
27453d9206O0300M3448L0791k420L1845j0453J3266P9167j4j4705l9845p1434
27441G0740k7467L4742J7574j04736o8241k4864Q7425Q3874J0549n0269m3084
27430a3757Q238M0472M1867n117j9322j4662Q662J1516j8032K2354J5387Q691
27418H6297k6640r6488J446K3082J1126p55j5047m6882j1835o717J7593K81K4115
27405d0424k8312q572L5486n4502k7301L9978J05095L1955L9945k6573m5467J2440
27393C3748n041J761Q378m050j4945M586j00434j6646J3133J02745J9019q3847
27381d1593k3698K6743L4689m9389K0135m8606L1953L6736m7884J2193R5338O9643
$$ plain form
27465 28415 -11967 -1972 -66270 -97535 -90043 -48673 -70684 -89716 -14070 -11328 -31034 -49206
27453 -49206 11094 54542 85333 82913 114758 104305 117571 196738 196724 182019 142174 70740
27441 70740 43273 78015 95589 -9147 -77388 -102252 -14827 69047 79596 29327 -13757
27430 -13757 -5519 34953 76820 71703 52381 37719 46381 57897 39865 62219 77606 86297
27418 86297 59657 -36831 -35385 -12303 -1177 -1932 -16979 -63861 -75696 -82413 -64820 -64539 -40424
27405 -40424 -68736 -77308 -41822 -96324 -123625 -83647 21448 53403 93348 66775 21308 33748
27393 33748 28707 30468 38846 34796 19851 24437 -75997 -92643 -79510 23235 42254 -41593
27381 -41593 -65291 -38548 -3859 -53248 -33113 -81719 -49766 -13030 -60914 -48721 46617 116260
27369A16260q131r018q378k8623m6508k9608k4729K7665M615l4911N4172k3087
27357a0281m0502j0261J1874K3445n3767n6224M3880L0351J5180K5979q679L7647
27345H642M7785l9410l3361O4655k2031p351p684j9180J129Q988J3424r349L1131
27332C7388L3111m0880j9714k2409m802j866q105J4359l671k8639j7868J7455
27320d5641P7484J4232n601l963o8530m1249j2450Q2726K1775j922L289q301k7638
27307a5789l1154m7426Q2182K4685o8128O765j0378k5065K6207N2094K8000l3488
27295a1495m9628O5033Q0839n9121p9875J7592K8590j4499M1276m957k1771L8746
27283C0730p0297J3701M4528n2269l5612J9210J4050M8776k0232m2528O0881N6241
$$ plain form
27369 116260 108129 99111 90733 62110 15602 -14006 -38735 -11070 -6455 -41366 12806 -10281
27357 -10281 -50783 -61044 -49170 -25725 -79492 -135716 -91836 -61485 -46305 -20326 -29005 8642
27345 8642 56427 17017 -16344 48311 26280 18929 11245 -7935 -6806 2182 15606 6257 37388
27332 37388 70499 29619 9905 -12504 -17306 -19172 -27277 -12918 -16589 -45228 -63096 -45641
27320 -45641 31843 46075 40474 36511 -32019 -73268 -85718 -2992 18783 16861 20150 11849 -15789
27307 -15789 -46943 -94369 -12187 12498 -55630 -48865 -59243 -84308 -58101 -6007 21993 -11495
27295 -11495 -61123 3910 84749 25628 -54247 -36655 -8065 -22564 18712 13755 -8016 30730
27283 30730 -39567 -25866 18662 -33607 -69219 -50009 -35959 12817 -7415 -49943 10938 67179
27271F7179M1570m9450l9614k084m6810R255K1192o8839q1059K2483L1657P9769
27259a4751j140j0240j17672k8935J08581N3415k1801k3607J0769k769K0164R9341
27247G1355K7594m7722n1450l4260P060j1167l0901Q515k7960k0899N8728Q6083
27235C4976N576J0369O8187M994k7811j08917j7866k0522J6268r38J9720L9126
27223B3162o7442O0693k8098l7370N8381K7842n317L147j3789J018J6952j3445
27211B5734K9630M3982L6973L3015o6229j06068m8919J460k2206j3276K5810K6820
27199c3274J5507M1929K2394n3017k2950j2824j2508L6605l2161k7984L6021O3657
27187B1395J2271j5387l7276k4763j4552J6127j7703K378l0445J3957k389j7044
$$ plain form
27271 67179 108749 59299 19685 17601 -29209 -19954 1238 -67601 -148660 -126177 -94520 -14751
27259 -14751 -15891 -26131 -143803 -172738 -64157 -10742 -32543 -56150 -45381 -48150 -27986 71355
27247 71355 98949 51227 -223 -34483 -27423 -38590 -69491 -60976 -88936 -109835 -51107 34976
27235 34976 40552 50921 119108 124102 96291 -12626 -30492 -51014 -34746 -35684 -15964 23162
27223 23162 -44280 16413 -11685 -49055 9326 37168 31851 34998 21209 22227 39179 25734
27211 25734 55364 99346 136319 169334 103105 -2963 -51882 -50422 -72628 -85904 -60094 -33274
27199 -33274 -17767 24162 46556 -6461 -29411 -42235 -54743 -18138 -50299 -78283 -42262 21395
27187 21395 33666 18279 -18997 -43760 -58312 -42185 -59888 -57510 -87955 -73998 -76387 -93431
27175i3431o487O0007k1172k9056K5972N2609N2956k4397J2272N3888j5480n9588
27163H093k9762k0125L1721Q728K2923R0925j6425m5896r015p220k2663R354J492
27150B2130j6217l1667k226K0588J0559K2413q36k0839K8818L824L986n073p4005
27137c8545m478N3570l785j4012M8874j4087j4471j3960m1337O7666J5378n9354
27125a8541N065K041N863L3066j8551j9360L514J2587O549k1012k4602k265n042
27112d0688L8463k10l7605O574K5841j2017l8186m6661j6025K3896M8424q648
27100e6842j1339J9147K9283Q368k6374O122J9232q645j3149m9205L2709M0348
27088a0345j8937k2744K3046N799k308J5025r072n1774m5026k4981P2714Q2623
$$ plain form
27175 -93431 -99918 -39911 -61083 -90139 -64167 -11558 41398 17001 29273 83161 67681 8093
27163 8093 -21669 -41794 -10073 -1345 21578 112503 96078 50182 41167 33947 11284 20638 22130
27150 22130 5913 -25754 -27980 -7392 3167 25580 24744 3905 32723 36547 40533 35460 -38545
27137 -38545 -43023 10547 6762 -7250 41624 27537 13066 -894 -42231 25435 40813 -18541
27125 -18541 -13476 -11435 -5572 27494 8943 -10417 -6903 5684 12233 -8779 -33381 -35646 -40688
27112 -40688 -2225 -2435 -40040 -33466 -7625 -19642 -57828 -104489 -120514 -96618 -48194 -56842
27100 -56842 -68181 -49034 -19751 -11383 -37757 -31635 -12403 -21048 -34197 -83402 -50693 -10345
27088 -10345 -29282 -52026 -28980 -23181 -25489 -10464 -19536 -71310 -116336 -141317 -68603 14020
27076A4020r266J802j9202K8595J4991P4921M9914n5512m7617j0923l4704N003
27064A2022K2159L0969p543r5065m5015K2785J7240K0994q010l9157L796N0718
27052a4107P3357J1293m8794P785j7008n2196L0691J3030J2376J4123m9835p6360
27040i5645j8368N9311j8511K1916j048P9401R150R068J154n3397J3730k1580
27028a4819l2550m2363Q563J2731L4852O6520N5071m4220m2552K9497j2449M5038
27016F3319j0297R243m289J043J189k1422K2739L73l9343l5289n4719r140K8037
27003d8556K5477M5084J4138Q873J0668p6880q2473M0846O310L4213m530m0773
26991f7603l389J00008k8312o2833j9952O375k6726K3768L9624J1747L6511M7000
$$ plain form
27076 14020 4754 6556 -12646 15949 30940 105861 155775 100263 52646 41723 7019 12022
27064 12022 34181 65150 57607 -37458 -82473 -59688 -42448 -21454 -29464 -68621 -64825 -14107
27052 -14107 59250 70543 21749 29534 12526 -39670 -8979 4051 16427 30550 -19285 -95645
27040 -95645 -114013 -54702 -73213 -51297 -52345 27056 36206 45274 46428 -6969 6761 -14819
27028 -14819 -47369 -89732 -81169 -68438 -33586 32934 88005 43785 1233 30730 18281 63319
27016 63319 53022 62265 57976 59019 60208 38786 61525 61898 22555 -12734 -67453 -76593 -48556
27003 -48556 -23079 22005 36143 45016 55684 -21196 -103669 -62823 -56513 -22300 -26830 -67603
26991 -67603 -70992 29016 704 -62129 -82081 -75706 -102432 -78664 -39040 -27293 9218 56218
26979E6218M5066J7540j3374k8472M0154J6592q48q5133q6241l731J4004K9422
26967A197n3546q9647l6444L3838J7550L3405J11129m1377j12299K0963O3887
26956e1344P6306O6367j5352n9601m380K6025K0899j4155n6455q446K5470J6895
26944B2229K7084n9040o884J9399J3197n6432L953M4423M9094k7600k8995L851
26932D279L1461M6891M5105J8156p7018j06042j4770O1760L4605l5690l8401K2467
26920g197K1356m49M3313L71q2295m9221k0216N836J3431N435m6283l9222K9157
26907a25984O3687J8576p841M7544M0581M521k823R717j0249j102l1789N8159
26895F2997K8721p0656k5584k4277p049K6624J6460m6204p1770j2074J9469K7103
$$ plain form
26979 56218 101284 118824 105450 76978 117132 133724 132876 47743 -38498 -42229 -28225 1197
26967 1197 -52349 -141996 -178440 -144602 -127052 -93647 17482 -23895 -136194 -115231 -51344
26956 -51344 24962 91329 75977 16376 11996 38021 58920 44765 -11690 -20136 5334 22229
26944 22229 49313 -9727 -16611 2788 15985 -40447 -36494 7929 57023 29423 428 4279
26932 4279 35740 82631 127736 145892 68874 -37168 -51938 9822 44427 8737 -29664 -7197
26920 -7197 14159 13710 57023 57394 -24901 -74122 -94338 -88502 -75071 -69636 -115919 -155141 -125984
26907 -125984 -62297 -43721 -51562 -4018 36563 41084 38261 47978 37729 36627 4838 62997
26895 62997 91718 21062 -4522 -28799 -35848 -9224 7236 -38968 -110738 -122812 -103343 -76240
26883g6240L3196k2868j2235K9285N003R10l058J3054k0502l5788N2914O1294
26871B4965N811m2062k9057N1484L6481J894n6365n8045m8415n7587M1898N1890
26859g7108K4116J8776M1480P674L2450l7648l3240M2255l2078L8899N993n9965
26847b8396p1708J0009Q3702M4515n6823l6860m0768k498M029L68j2791J1446
26835i5775M9301J8946Q183l060k4514R821O0457o227o4464K4919L2042j4236
26823d607J974K1249j0715k580N6478l5915n0349l6937n624l5270k2179r01m6621
26810a71997K0072J10853R520o3776K0614p769J9831L2995M1548l4615m7583K1527
26798d8780K3483K8914L7987L5225L9530l5931n5852N3436j6092n3074k5077k9335
$$ plain form
26883 -76240 -43044 -65912 -78147 -48862 -43859 -42949 -46007 -32953 -53455 -89243 -36329 24965
26871 24965 30776 -11286 -40343 11141 47622 49516 -6849 -64894 -113309 -170896 -128998 -77108
26859 -77108 -52992 -34216 7264 14938 47388 9740 -23500 18755 -13323 25576 31569 -28396
26847 -28396 -100104 -90095 -6393 38122 -18701 -55561 -96329 -98827 -94798 -94430 -107221 -95775
26835 -95775 -46474 -27528 -19345 -22405 -46919 -37098 23359 17132 -47332 -22413 9629 -4607
26823 -4607 -2633 18616 7901 5321 61799 25884 -24465 -61402 -67026 -102296 -124475 -125376 -171997
26810 -171997 -151925 -41072 -31552 -95328 -74714 -82483 -62652 -29657 11891 -22724 -70307 -48780
26798 -48780 -25297 3617 41604 76829 116359 80428 24576 78012 61920 8846 -16231 -45566
26786d5566k6376K224L2716J8522O7835J3046n4336n8060P7685P1304m1951k9817
26774B7226n3633m4140M583K1057M3416n364o13q300n475k4256l9785o420J2495
26761g9209M1635M7065M1885K2145J7592k957O337m6451n7124M2233r16k9714
26749B521J7606m4974j8858M942L980L3237J2386L064j7080M6041K0448l3030
26737C0283J3842O292K0240l0928j473k0126K9646K9717m0314K9378m4834K4062
26725D5785O7369J8793o5478k1384Q643n7665p68M1525j9688m9078M4151L3898
26713D6103k8583l8615j03291m5819O2939L7859L2798k6780M5087K8067l4333
26702b4568o6225L8415M795L3348M1651M4371L3281l8840j2810q873q145j1702
$$ plain form
26786 -45566 -71942 -69718 -37002 -18480 49355 62401 8065 -49995 27690 98994 57043 27226
26774 27226 -26407 -70547 -65964 -44907 -1491 -6855 -7468 -15768 -21243 -45499 -85284 -91704 -79209
26761 -79209 -37574 9491 51376 73521 91113 88156 94493 48042 -9082 33151 32235 2521
26749 2521 20127 -24847 -43705 -38763 -34783 -1546 10840 13904 -3176 42865 63313 30283
26737 30283 44125 50417 70657 39729 38256 18130 47776 77493 37179 66557 21723 45785
26725 45785 113154 131947 66469 45085 53728 -3937 -4705 36820 17132 -31946 12205 46103
26713 46103 17520 -21095 -124386 -170205 -107266 -69407 -36609 -63389 -18302 9765 -24568
26702 -24568 -90793 -52378 -47583 -14235 27416 71787 105068 66228 53418 44545 36400 24698
26690B4698l0046L0947p807l5265l2396j8616j8361O2990N6815q726P3263j9621
26678G7875q0872j8084O9663L3427P896m8958p7144j216O9682L6353k36O585j01512
26665b6541o1193M893Q942l8286L8898N6755M9145m8000l7082R362O922P364m482
26652c3303j6577J6408K2988k5114O4176N873J1400K074K0493K2336m3506q0094
26640c2846o2413L4975O2210K52J8574J4894J840n298q790J496K7164l564r838
26627C8656l8708o0745J6538L4797N3775k5619m5667j2853P3338N2674K5007L2402
26615A43595p9538q8366O664M9534L2909j4606n2897l7602M8748O6897L8183o3348
26603E0173k2178J4645j9665l4854K6274J9029N5554M1087j6872k6487l5684n830
$$ plain form
26690 24698 -5348 25599 17792 -17473 -49869 -68485 -86846 -23856 32959 24233 97496 77875
26678 77875 -2997 -21081 48582 82009 89905 40947 -36197 -37413 32269 68622 68386 74971 -26541
26665 -26541 -87734 -82841 -73899 -112185 -73287 -16532 32613 -15387 -52469 -43107 -36185 -28821 -33303
26652 -33303 -49880 -33472 -10484 -35598 28578 34451 45851 47925 68418 90754 47248 -32846
26640 -32846 -95259 -60284 1926 2178 20752 35646 37486 32188 23398 24894 52058 48494 38656
26627 38656 -52 -60797 -44259 -9462 44313 18694 -26973 -39826 33512 86186 111193 143595
26615 143595 64057 -24309 -17645 31889 64798 50192 -2705 -40307 8441 75338 113521 50173
26603 50173 27995 42640 22975 -11879 14395 33424 88978 130065 113193 86706 51022 45192
26591D5192l7669J322Q131M4192K7161l5375l0370Q2502K4026j7019j4735k7428
26579F9930m9347o3965J8978k6147K5808O2013J1299R988k903l5500n637K9955
26567D4472J5362L1994m0759J0995K1799j8543O707l5779o4177L3155O2515K6858
26555I4599j7500o594m4719q0045j08855m7635K0895K7509N0924O2880L1982N1766
26543C5207n0275K1518L6072k421n3665l2544k4162L317J84j4098j3729O8242
26531b6354L1125L4542m6870k4435n6204m071K6888L9888k2072Q26J1736k5050
26519f0051L6192N2541n5369j05893J5402L547l1556J617O8072j1271N3221M0282
26507F734j5896j7458m710m731J1160K2049Q221k3501J6726J80N4485K5846l1003
$$ plain form
26591 45192 7523 8845 16976 61168 88329 52954 22584 105086 129112 112093 97358 69930
26579 69930 20583 -43382 -24404 -50551 -24743 37270 48569 58557 55654 20154 14517 44472
26567 44472 59834 91828 51069 62064 83863 65320 72027 36248 -27929 5226 67741 94599
26555 94599 77099 70505 25786 -54259 -163114 -210749 -189854 -162345 -111421 -48541 -16559 35207
26543 35207 -15068 6450 42522 40101 -13564 -46108 -70270 -66953 -66769 -80867 -94596 -26354
26531 -26354 4771 39313 -7557 -31992 -88196 -92267 -65379 -25491 -47563 -46737 -35001 -60051
26519 -60051 -23859 28682 -26687 -132580 -117178 -113631 -145187 -143570 -75498 -86769 -33548 6734
26507 6734 -9162 -26620 -31330 -36061 -24901 -2852 5369 -18132 -1406 -1226 53259 79105 48102
26494D8102K0840o2198K6789k3547j7746n226k0798O172m2677m4043O546K2542
26482h5244l766K6968j3195k044L5820N7323j4216o0781M6643N0153K6916N9339
26470A23916n8888j26184M7924P1382p5896p137l7396o2617M6628j3492Q6987
26459d773O1087l5845l9106q7387p698J15450K4882p951n2208N2089R8388J4341
26447A31269m1808m318n1283q2266J6814O806o191K4863k823p763j7755p260J3952
26434b7763k5989j3655Q276R1626L2239k7254j717j2359J6117L0684j9258n9761
26422h814L8668N4551k1762J8878q046j7430p0549k7910K5030M9385J4250l1987
26410A4264m53K0461k127p7352k1722N6056O4443K1757n9397m4858K7373k5474
$$ plain form
26494 48102 68942 6744 33533 9986 -7760 -12986 -33784 -27612 -70289 -114332 -107786 -85244
26482 -85244 -89010 -62042 -75237 -77281 -41461 15862 1646 -59135 -12492 37661 64577 123916
26470 123916 65028 -61156 -13232 58150 -17746 -24883 -62279 -124896 -78268 -91760 -4773
26459 -4773 56314 20469 -18637 -106024 -113722 1728 26610 18659 -33549 18540 116928 131269
26447 131269 89461 85143 33860 -48406 -31592 -24786 -30977 -6114 -8937 -16700 -34455 -41715 -27763
26434 -27763 -53752 -67407 -59131 32495 64734 37480 35763 23404 39521 70205 50947 -8814
26422 -8814 29854 84405 62643 81521 73475 56045 -14504 -42414 -17384 32001 46251 14264
26410 14264 13811 34272 32145 -45207 -66929 -10873 53570 75327 15930 -28928 -1555 -27029
26398b7029k0180N2902K7385n97K626l2944l342J8928J7506m0900m4025L5803
26386a3867N5357l9510o786j3749k1192j3438K8452p680k9859J9607L2181J1156
26374F72L0620J8713n5549n8222q995N0875k9560j4039L12l345K6127J1012N9215
26361B7836O9643o0422k6385j3379m6050P721N619R93O5734k2975M8657j8909
26349C8083n4881j6633K5102k9627m2262L410N4333m178m9586p977M5165L4386
26337d665k6902N682N1151j407n992p2616l6918J725q880M9155Q5342M9676m1856
26324D3495L130o5162k783L8176n6224j6824J0149j4742k8275k1136O4635L1132
26312a4429J8262K4093k2751l2759m4202n373L9674M3049k6396l3833L2546N2484
$$ plain form
26398 -27029 -47209 5693 33078 32481 35107 2163 -1179 17749 35255 -5645 -49670 -13867
26386 -13867 41490 1980 -4806 -18555 -39747 -53185 -24733 -32413 -62272 -42665 -10484 672
26374 672 31292 50005 -5544 -63766 -72761 -21886 -51446 -65485 -65173 -68518 -42391 -31379 27836
26361 27836 97479 37057 10672 -2707 -48757 -41036 -35417 -34424 31310 8335 56992 38083
26349 38083 -16798 -33431 -8329 -37956 -80218 -76808 -22475 -26653 -76239 -84216 -39051 -4665
26337 -4665 -31567 -25885 25266 23859 17867 -54749 -91667 -89942 -98822 -49667 35675 85351 43495
26324 43495 46625 -18537 -21320 16856 -39368 -56192 -46043 -60785 -89060 -110196 -45561 -14429
26312 -14429 3833 27926 5175 -27584 -71786 -77159 -37485 5564 -20832 -54665 -22119 30365
26300C0365K4479m5098o3709m595K7087M5685n1154k6053M4747K8365J9309n305
26288B4123o8462m5418l1498L0790L5686k8921N6066m6760j0490M994L022l4134
26276a11002M1758N0005J2221N53O0216o16o3823R876J51k9977N1101J970l3986
26263a1553Q600J835J8667L657j5641j6813p9884k2865M5776M0626j4758n8764
26251a01117Q7982N1248L8386J3498k5341p2510M701K3794J3807P923n0433M419
26239c643k5452L4178O34n9236l1395J9745N0979j4182J239r440K5741K1181K5173
26226C5522o4964k9748P773k3073Q775L3203j9574n416M0590l1173Q8971L0688
26214G1574l3200l1670l0122k6776j12434K1377L6642N6060L575J1745O841j6969
$$ plain form
26300 30365 54844 9746 -53963 -58558 -31471 14214 -36940 -62993 -18246 10119 29428 24123
26288 24123 -44339 -89757 -121255 -90465 -54779 -83700 -27634 -74394 -84884 -79890 -76868 -111002
26276 -111002 -69244 -19239 -7018 -6465 53751 53135 -10688 -812 -661 -30638 20463 22433 -11553
26263 -11553 -2953 -1118 17549 21206 5565 -11248 -91132 -113997 -68221 -27595 -42353 -101117
26251 -101117 -13135 38113 76499 89997 64656 -7854 -3153 20641 34448 42371 -8062 -3643
26239 -3643 -29095 5083 5717 -53519 -84914 -65169 -14190 -28372 -27133 -36573 -10832 10349 35522
26226 35522 -29442 -59190 -51417 -74490 -65715 -32512 -52086 -57502 -16912 -48085 40886 71574
26214 71574 38374 6704 -23418 -50194 -162628 -141251 -104609 -48549 -44974 -33229 -26388 -43357
26202d3357M8415L7266r136m354K6492k9013m4976J2227M5682J0690m1733K602
26190A0805L0356j6137O5867N0528m2250n9729m5669j2764l7908j4470R500Q342
26178e3529p899J4118K0315j4853r139L3838O136M6453Q2061m3057M5691m7747
26166G2388n6374N907J9132l4805m6182o8460L5537N8225N1167N8856o20j7899
26154G6872n5054q7510l4841M6626Q4726l1383m8167L8873L510j2452l9555L6995
26142b1360N2959J5641J7109k5174l9147J727J4799p171J3982m6152j23516l731
26130a50034Q1497L5785O484L7924J1131j3056k466K8061k5025l7659m355j7814
26118d9527m1750K9771N6810Q0814k9988j635N0199j6022m4455j5074N3331q173
$$ plain form
26202 -43357 5058 42324 33188 28834 55326 26313 -18663 -6436 39246 49936 8203 10805
26190 10805 41161 25024 90891 141419 99169 39440 -6229 -18993 -56901 -71371 -61871 -53529
26178 -53529 -61428 -47310 -26995 -41848 -50987 -17149 -11013 35440 117501 74444 120135 72388
26166 72388 16014 21921 41053 6248 -39934 -108394 -72857 -14632 36535 95391 94771 76872
26154 76872 21818 -65692 -100533 -53907 30819 -564 -48731 -9858 -6348 -18800 -58355 -21360
26142 -21360 31599 47240 64349 39175 28 1755 16554 9383 23365 -22787 -146303 -150034
26130 -150034 -68537 -32752 -26268 11656 22787 9731 7265 35326 10301 -27358 -31713 -49527
26118 -49527 -91277 -61506 -4696 76118 46130 44495 94694 78672 34217 19143 72474 64301
26106F4301J7150l9456R882J3804n469m4742j0656N8589L3318K1722j7317k5773
26094G5353n0389l3551M0269o404J6064j3265l5516L9994j5333J1060L7952L2211
26082I8445j6644o7649r1551l6333P913N4065N8594K8541o6147k8905k2696J5736
26070f6631J38M2060M2299k0935N25k4111O962M407M9967K73m8047p1551m398
26057h9042J6507N4188L4041j2337L040k9186k5164N968j0522K2413k0603m0549
26045i1246J1391N3914N9329j6316K1324j8132k2701k3098J465L4276l1285n219
26033b6298j8071J6975J4605N0875M8267J9665l1127m9367o603l4228n3777J2244
26021e6840O9947O623k7300m656N6760m9548j9066k0379p430j4285L0358K5768
$$ plain form
26106 64301 81451 41995 51877 65681 60212 15470 4814 63403 96721 118443 101126 75353
26094 75353 24964 -8587 31682 25278 41342 28077 -7439 32555 17222 28282 66234 98445
26082 98445 81801 14152 -77399 -113732 -105819 -51754 6840 35381 -30766 -59671 -82367 -66631
26070 -66631 -66493 -24433 17866 -3069 -2544 -26655 -19693 -15286 34681 34954 -13093 -84644 -89042
26057 -89042 -72535 -18347 15694 3357 6397 -22789 -47953 -41985 -52507 -30094 -50697 -91246
26045 -91246 -79855 -25941 33388 17072 38396 20264 -2437 -25535 -24070 10206 -21079 -26298
26033 -26298 -44369 -27394 -12789 38086 86353 106018 74891 25524 18921 -15307 -69084 -56840
26021 -56840 13107 19730 -7570 -12226 44534 -5014 -24080 -44459 -51889 -66174 -35816 -10048
26009a0048k0861L2407L4068o2018j1522k4395K6846P9733J7127l839o0568O005
25997B935J2661N0022j440l2155m4537r889j9005o444L7255M0060K2606K7235
25985G9304q212L1073o7692k510L62L0746k6933j6547m4309N5565o7076n6904
25973i3133o766L0696O0705j0406K0158L7750L0302K2319l6244K0830j7828o2639
25961d256L362J8476M0654J03900j2034o4664p7574k5222k5500J6161K6979k49
25949C3K6698m956l3204L3496j4258m396J3545K2459j245N153k2403k3113q0325
25936h2516J865L4393J4117L7337l9932l2225j975R05M0520k5729j1449k7544
25924i2233K2527j3109J5784K537N5484J9410L2094k591K317k0929j052m7024
$$ plain form
26009 -10048 -30909 1498 35566 -26452 -37974 -62369 -35523 44210 61337 57498 -3070 2935
25997 2935 15596 65618 64178 32023 -12514 -22403 -41408 -47852 -10597 29463 52069 79304
25985 79304 71092 102165 34473 31963 32325 63071 36138 19591 -24718 30847 -36229 -93133
25973 -93133 -99899 -69203 -8498 -18904 1254 39004 69306 91625 55381 76211 58383 -4256
25961 -4256 -894 17582 58236 162136 150102 85438 7864 -17358 -42858 -26697 282 33
25949 33 26731 21775 -11429 22067 7809 3413 16958 39417 38172 43325 20922 -2191 -82516
25936 -82516 -80651 -46258 -32141 5196 -34736 -66961 -68936 -68031 -27511 -53240 -64689 -92233
25924 -92233 -69706 -82815 -67031 -64494 -9010 10400 42494 39903 42220 21291 20239 -26785
25912b6785q498O5999R025l4457l8610k7898j6101J9763J8557L4191N2991J9832
25900F8009m1570l7315M4249L7803J7494M960l5999p0927q058K7381K6126j6818
25888A5335l8770N2635M4589k7449m2122l4934L7629k1442R791O6799l186o2989
25876d114R868j0335m0408K0711K1762n0005O902K0175P2033j7946L209L8217
25864G0069L6028n9015l6311l4531J2915k2224k5717M0657m2365Q466q873L3878
25852b7023M2727j8659l3475L0961L3631L0938q314q8743k4280K1176K9481P3238
25840F1658J3585l3337J9332l6980m806J6989p795o088K609K0397o286o4081R499
25827a5304j938L4932L247K0736L9822j6022m9356m6901j1354j5640k6812J8430
$$ plain form
25912 -26785 -35283 30716 39741 5284 -33326 -61224 -77325 -57562 -39005 -4814 48177 68009
25900 68009 26439 -10876 33373 71176 88670 93630 57631 -13296 -21354 6027 32153 15335
25888 15335 -23435 29200 73789 46340 4218 -30716 6913 -14529 -4738 62061 58875 -4114
25876 -4114 5754 -4581 -44989 -24278 -2516 -52521 -45619 -25444 46589 28643 31852 70069
25864 70069 106097 47082 10771 -23760 -10845 -33069 -58786 -18129 -60494 -52028 -60901 -27023
25852 -27023 15704 -2955 -36430 -5469 28162 59100 50786 -37957 -62237 -41061 -11580 61658
25840 61658 75243 41906 61238 24258 19452 36441 28646 22558 25167 45564 39278 -24803 -15304
25827 -15304 -17242 17690 20937 41673 81495 65473 16117 -30784 -42138 -57778 -84590 -66160
25815f6160N8984L5926L5614K8600J1947k681Q685k2143j667o8048o5183q716
25803e4842j8294J4159K6616P719L1866N8183l702K454j0340j3705O3536N454
25791A09104j1585m2786k7896l3524m1320m2078O4585K6184O1849L2740m5028
25780E0245l8529k9445J0660P8804k6135j2895j8433J6592j1662N4224M176M052
25768H1654l0689n886J9149k4400r5N306K4581J4258O4068j8128n0446j961j0106
25755F7305k5211k8987l1254l3812K6729K2298J8439n3230p4545k0044M9516O2688
25743b0108m7723r3796l2260O8629R1823J2052p1526J8026J8934M8303K7858k7626
25731g414n4907j9826l485J2541K984j7658K5740K7745k3143j4448J2639P063
$$ plain form
25815 -66160 -7176 28750 64364 92964 104911 102230 110915 88772 87105 19057 -46126 -54842
25803 -54842 -73136 -58977 -32361 -24642 7224 65407 61705 64159 53819 40114 103650 109104
25791 109104 97519 54733 26837 -6687 -48007 -90085 -25500 684 62533 95273 50245
25780 50245 11716 -17729 -7069 71735 45600 32705 14272 30864 19202 73426 77602 81654
25768 81654 50965 45079 64228 39828 39733 45039 69620 83878 147946 129818 79372 77411 67305
25755 67305 42094 13107 -18147 -51959 -25230 -2932 15507 -37723 -112268 -132312 -82796 -20108
25743 -20108 -67831 -161627 -193887 -125258 -33435 -21383 -92909 -74883 -55949 -7646 20212 -7414
25731 -7414 -62321 -82147 -85632 -73091 -70107 -87765 -62025 -34280 -57423 -71871 -59232 -52169
25719e2169K9755L4921Q1941M3148o5005p1052J9035M2197j173l0049K433K5663
25707E9645j2249o7983k0675k1242K8105K1165J8516J1127m4706l9273L1894N0270
25695A4594M31J8925J5852l8068p7539J1934j5160J6425J6314J3467K6686k8503
25683b4642o6406Q627Q5882O6186J1903m5815m1434K7102K5621K6231L2718j9561
25671H6412o164k2226J5547j8652K3814m3919k9166j0027j0504n784j9450N289
25659c4830R644m3943l4207L1399Q9642q259l1792j3199P2870j2J1337J2710m2170
25646A9190m3314j1412J8352J266K0490J5808M7144N4754j4775n6055m2657r771
25634i80P4435L7069o6623n1120l9455k5431O2475J9308L6977P585l6112k1905
$$ plain form
25719 -52169 -22414 12507 94448 137596 72591 1539 20574 62771 61598 31549 33982 59645
25707 59645 47396 -20587 -41262 -62504 -34399 -13234 5282 16409 -28297 -67570 -35676 14594
25695 14594 15025 33950 49802 11734 -65805 -53871 -69031 -52606 -36292 -22825 3861 -24642
25683 -24642 -91048 -82421 3461 69647 81550 35735 -5699 21403 47024 73255 105973 86412
25671 86412 80248 58022 73569 54917 78731 34812 5646 -4381 -14885 -20669 -40119 -34830
25659 -34830 -25186 -69129 -103336 -71937 17705 9446 -22346 -35545 37325 37313 48650 61360 19190
25646 19190 -24124 -35536 -17184 -15918 4572 20380 67524 122278 107503 51448 8791 -980
25634 -980 73455 110524 43901 -7219 -46674 -72105 -9630 9678 46655 54240 18128 -3777
25622c777N3016k441O12l0610m4621p2514l5733K9594Q3501k177j574M9559p381
25609A5454j2571o5825l3697j6678P695N9997N6465K6850N2456P338L3710L4452
25597A65646j2394n0025q5265k7805K3584M6987M6380l5010n8348m4162r590Q225
25585c1777k220K4339O5071J6601j7953k3795L319M7602j573O460l2699K713k7456
25572B8632l0321O2358o2855m5625P5969N6103q262m2019m354J2316k7515j01473
25560h7046j1219P5041J2722r676n2493L0945L4041m752j041j6511p479M2431
25548D963N0779l5049l02M5888K9195l4364Q80K0961l4116R228m732J863M6308
25535A01502n8908o8299n0069J845k614k7019L6020M5682K7547N3531J3693k2121
$$ plain form
25622 -3777 49239 46798 47410 16800 -27821 -100335 -136068 -106474 -22973 -25150 -26724 22835 15454
25609 15454 2883 -62942 -96639 -113317 -105622 -45625 10840 37690 90146 97484 131194 165646
25597 165646 153252 103227 17962 -9843 13741 60728 107108 72098 13750 -30412 -40002 -31777
25585 -31777 -33997 -9658 55413 72014 54061 30266 33585 81187 79614 86074 53375 56088 28632
25572 28632 -1689 60669 -2186 -47811 28158 84261 75999 33980 29626 41942 14427 -87046
25560 -87046 -98265 -23224 -10502 -20178 -72671 -41726 -7685 -12437 -13478 -29989 -37468 4963
25548 4963 55742 20693 20391 66279 95474 61110 61990 82951 48835 58063 53331 55194 101502
25535 101502 42594 -25705 -75774 -73929 -76543 -103562 -67542 -21860 5687 59218 72911 50790
25523E0790P0036l9319r2192k8862J765J09363P0223K422o6274l2299k4181p132
25511A4340j9654n961M3606O7454L4886k0227j12657n5510K9931Q207l755M5581
25499B6241J6934j9480J6782j1342k3895p859J2825J503K1630m1120o0838o1897
25487a30516N2194P7954N0109K5478l8129o8425j9828K504N4020Q903J1597J4418
25475D0279J0674m114k1576j7174n9927K1162L9751O1329l68n4114m7059J0316
25463b0821L7899j0797q4315j7741R850K6051K4856N018k0336L2589K1417j2651
25451h981K0507q2782o2846M9114k0002N657L8818l8056J3545J5424R412J8333
25439d1857K3220L1563M9800J6565j0491J5702n9983M94j3700p8338j2112K4586
$$ plain form
25523 50790 120826 81507 -10685 -39547 -37782 71581 141804 144226 77952 45653 21472 14340
25511 14340 -5314 -11275 32331 99785 134671 114444 1787 -53723 -23792 -15585 -19340 26241
25499 26241 43175 23695 40477 29135 5240 -2619 10206 11709 33339 -7781 -68619 -130516
25487 -130516 -78322 -368 49741 75219 37090 -31335 -51163 -48659 5361 14264 25861 40279
25475 40279 50953 46839 25263 8089 -51838 -30676 9075 70404 70036 15922 -31137 -20821
25463 -20821 17078 6281 -78034 -95775 -85925 -59874 -35018 -30000 -50336 -17747 3670 -8981
25451 -8981 11526 -71256 -134102 -84988 -104990 -99333 -60515 -98571 -85026 -69602 -60190 -41857
25439 -41857 -18637 12926 62726 79291 68800 84502 24519 25013 11313 -67025 -79137 -54551
25427e4551M2737K0768P853l0659q725P3945M5664R897p2635p9387M9960k813
25415B054m1119k8258K2344j070Q0129N9719l9027j01045l1782K7789L4380K7526
25403A1640l7086l1609j6754K5551N4860K0399K9827O3710l8962p1229m1255K6889
25391d019K8560l5279r577J6168J9318J6204R035j2082K6952P331M3896k6232
25379H0275k7655J2213k757k5465Q716J8052l1429J7851m7226p0431j982M5505
25367b4333J2220J9337N0833K0736P5827K5747q0874p7505P362J097K3209K789
25355E6445k2621J7049k1312r3728o788J08415K4550l8565k9878r945p733j203
25343b5314m1966k3829k433P1233K5649k8979k3928j5965J5023O2436L1956j6507
$$ plain form
25427 -54551 -11814 8954 16807 -13852 -22577 51368 97032 106929 34294 -45093 4867 2054
25415 2054 -39065 -67323 -44979 -46049 34080 93799 54772 -46273 -78055 -50266 -15886 11640
25403 11640 -25446 -57055 -73809 -48258 6602 27001 56828 120538 81576 10347 -30908 -4019
25391 -4019 24541 -10738 -20315 -4147 15171 31375 40410 28328 55280 62611 106507 80275
25379 80275 52620 64833 62076 36611 45327 63379 31950 49801 2575 -67856 -69838 -24333
25367 -24333 -12113 7224 58057 78793 154620 180367 99493 21988 29350 30447 53656 56445
25355 56445 33824 50873 29561 -64167 -70955 37460 62010 23445 -6433 -16378 -24111 -25314
25343 -25314 -67280 -91109 -93542 -22309 3340 -25639 -49567 -65532 -50509 11927 43883 27376
25331B7376n5130P426L5891N8492J6133j5222k5457l2136J1051m5089l6987j8878
25319g2530J0890O6391L7568J5719m089m245m3451M7643J8784l0769R437k7815
25307B3533p4154m0392N9374M9385r360l2118R015L7065k7567K4532k834l145
25295A3334J8432k0267n3328p466o986l0183K0312M2083J1606K0899n1745K2604
25283b0705K9255K3820J4647l4261j03554o814L5619K6237J7161J1718j5730j1971
25271c4578j5976L5538P6976l032K1431m5430m9622J5279k0734M1349M0274J7792
25259G9267n8758n5940k8635j8281l731K8584K8508l5122L5707j5014M6595l8815
25247c5635j680M9878n2358k2852N5133O798L4054J05892l1502n2501o7888K1904
$$ plain form
25331 27376 -27754 -20328 15563 74055 90188 74966 49509 17373 28424 -16665 -53652 -72530
25319 -72530 -61640 4751 42319 58038 53949 49704 6253 53896 72680 41911 51348 23533
25307 23533 -50621 -91013 -31639 17746 8386 -23732 -14717 22348 -5219 19313 16479 13334
25295 13334 31766 11499 -41829 -49295 -56281 -86464 -66152 -24069 -12463 8436 -43309 -20705
25283 -20705 8550 32370 47017 12756 -90798 -97612 -61993 -35756 -18595 -6877 -22607 -34578
25271 -34578 -50554 -15016 61960 58928 80359 34929 -14693 586 -20148 21201 61475 79267
25259 79267 20509 -35431 -64066 -82347 -86078 -57494 -28986 -64108 -28401 -43415 3180 -35635
25247 -35635 -37315 12563 -39795 -62647 -7514 -716 33338 139230 107728 55227 -12661 9243
25235I243J0701m356R29k6226K2845M0703Q9r3960l0201M7068r561J5254O2310
25222D4838Q8313N1774j3905q3360j02253n9678j071N8403j2762n4968J4384P5379
25210E094L4250O182j2918q0782n7038L272N6827P094O1556K1323P968j9649m2368
25197i189Q943J9676m3464q0653r56J9253J1001R385j7874p19L0510K757J7487
25184c3843K8484J6477j8684l5078K596R128L2418L970K6376n2514o111K6667
25172a14J4714K4104l0975q363K2785l8745l1126K7924J6493M2990k7370l0397
25160a8080J1698n6750n7902M4769P2138K3377n124K0754j4267M115n609m4095
25148b4976K9399l1138k0148k9639L3267K4731N816N9355l9332k6714M2368Q9205
$$ plain form
25235 9243 19944 15588 16517 -9709 13136 53839 53928 -40032 -70233 -23165 -32726 -17472 44838
25222 44838 133151 184925 171020 87660 -14593 -74271 -75342 -16939 -29701 -84669 -70285 5094
25210 5094 39344 45526 32608 -48174 -105212 -101940 -45113 -38019 23537 44860 52828 33179 -9189
25197 -9189 -246 19430 -24034 -104687 -105643 -86390 -75389 -66004 -83878 -84597 -54087 -51330 -33843
25184 -33843 -5359 11118 -7566 -42644 -40048 -30920 1498 5468 31844 -20670 -26781 -114
25172 -114 14600 38704 7729 -634 22151 -16594 -47720 -19796 -3303 39687 12317 -18080
25160 -18080 -6382 -63132 -121034 -76265 -4127 19250 14126 34880 20613 24728 19119 -24976
25148 -24976 4423 -26715 -46863 -76502 -43235 -18504 -12688 46667 7335 -19379 22989 112194
25136A12194l7182j4173n9738m9598K5680j0617n7507J3732M7228M8490p2134
25125e3625k134N1517N6468n2505m0075k9824R955J1664J8267K789k5044K5590
25113b6957K6815P9201K483l6931k5965j8529n784q090n1235M1428L1423j2316
25101d457k5068k1642K7546p12k5959j2958O163q840m386l7363P5533N0933M0472
25088E9262N7672M089l8223q1748n8999k2240J4321O0029j4694p0675N5475k2732
25076e8463K1620J750L0896J7784r820j7449l8393R685J8797K7295l3239J8271
25064a1266L8684l3973m9731J5289O7943M8301k3052l3622Q672L8921J5800r0550
25052h584m2209K866j0681K4654K9048m9066J4369M3889j0197m0739J3686O2632
$$ plain form
25136 112194 75012 60839 1101 -48497 -22817 -33434 -90941 -77209 -29981 18509 -53625
25125 -53625 -55759 -4242 52226 -279 -40354 -70178 -60223 -48559 -30292 -27503 -52547 -26957
25113 -26957 -142 79059 81542 44611 18646 117 -5667 -13757 -64992 -23564 7859 -4457
25101 -4457 -29525 -51167 -23621 -24333 -50292 -63250 -57087 -65927 -70313 -107676 -32143 18790 59262
25088 59262 116934 121023 82800 1052 -57947 -80187 -65866 -5837 -20531 -91206 -35731 -58463
25076 -58463 -36843 -35093 -4197 13587 3767 -13682 -52075 -42390 -23593 3702 -29537 -11266
25064 -11266 27418 -6555 -56286 -40997 26946 75247 52195 18573 27245 66166 81966 -8584
25052 -8584 -50793 -47927 -58608 -33954 -4906 -53972 -39603 4286 -5911 -46650 -32964 29668
25040B9668J7081p6510j390j6066M7351P128l6873p417j8156J7754N0702k0358
25028g086K8212J8067k0894J1063m871l4567M8903N7406K1416j8513j0966j18426
25016c0256j2461n1254j7467L0636N2457K2695j1389k0051j6026J0716M8877k3050
25004a6573m3248J3255K6423k7792l9414R147P6812l5737l8276K6351J3177K9470
24992f405K6134j4162j5859l4059j1233J7905Q208J9620l5234o0232J7744N1315
24980c6258o453n6434n8343P2916L9222J6878k4277l1719N5605j1481m1628Q078
24968g3894n895o198j7032M7643N3874L2686K5641L1300k624l5724j3031p7067
24956d0321k3323J6511L3652k3225n3091M1064M1713L565p077k2197J3691J4463
$$ plain form
25040 29668 46749 -29761 -31151 -47217 134 7262 -29611 -37028 -55184 -37430 13272 -7086
25028 -7086 21126 39193 18299 29362 24491 -10076 38827 96233 117649 99136 88170 -30256
25016 -30256 -42717 -93971 -111438 -80802 -28345 -5650 -17039 -37090 -53116 -42400 6477 -16573
25004 -16573 -59821 -46566 -20143 -47935 -87349 -78202 -1390 -37127 -75403 -49052 -35875 -6405
24992 -6405 19729 5567 -10292 -44351 -55584 -37679 -29471 -9851 -45085 -105317 -87573 -36258
24980 -36258 -42711 -99145 -157488 -84572 -45350 -28472 -52749 -84468 -28863 -40344 -81972 -73894
24968 -73894 -79789 -85987 -103019 -55376 -1502 31184 56825 88125 85501 49777 36746 -40321
24956 -40321 -63644 -47133 -13481 -36706 -89797 -48733 -7020 -3455 -10532 -32729 -19038 -4575
24944d575m9344J1014M0195M1768l3944m5615m2311n354M0758L6879K2371K222
24932A4064j2173l925j4355k790m0789O552L0573M9620Q7192K052n3023o4593
24920a595l4404J6087J1171L0443q286m4262k3660k8094L6367R215l6387N254
24908f8151M8097N8444M910r0861j8079N73K2185K9927M941m111J0872j3342J1853
24895b742M9439n7325R841L9636n1p6951N911n2762K4080O9166l744M7544K8711
24882H0753l3462q999o357j1472J5139j9667K3878J8420K1962J4513O9k3606n1117
24869B0054j3008k6296P6354O0468n0135k3985L1625m2639l7310R322J0255n9064
24857d4359m5004j8178l0326O447K6577N7380J00039M6433n2405o4886n2857L199
$$ plain form
24944 -4575 -53919 -42905 -2710 39058 5114 -40501 -82812 -88166 -47408 -10529 11842 14064
24932 14064 1891 -2034 -16389 -19179 -59968 -53416 -22843 26777 113969 116021 62998 -1595
24920 -1595 -35999 -19912 -8741 21702 13416 -30846 -54506 -82600 -46233 -37018 -73405 -68151
24908 -68151 -20054 38390 43300 -47561 -65640 -65067 -42882 -12955 -8014 -12125 -1253 -14595 -2742
24895 -2742 46697 -10628 -787 38849 38798 -38153 -32242 -85004 -60924 8242 4498 52042 80753
24882 80753 47291 38292 31935 20463 35602 15935 39813 58233 80195 94708 94777 71171 20054
24869 20054 7046 -19250 57104 117572 67437 43452 75077 32438 -4872 4450 14705 -44359
24857 -44359 -89363 -107541 -137867 -131420 -104843 -47463 52576 99009 46604 -18282 -71139 -67940
24845f7940K0601K1988K3065k2380k5762M5544k28n6852K5965O1529j373j09029
24833h4872L9348R0425M7786p683m7435j4908K4169J4792l8276n5531O742O2339
24821C6896p0731j4696J1018M8977J4955P030k1284J5106l4094l5433L0487M2966
24809C1197N456J7542L331J8697L179J6426k4884l1248j9000k1413k071n0200
24797e2988j9705L3063K9481k1041k5584m0632J9131j8409L5107K7688L367N4035
24785B3513R928o0801L151Q2559L1649k8369J1583l1687P17L9128k0042J786j5947
24772D7168p572K0965K2485j1857l8361o4920p2715j2383R2589N3013o8415r5515
24760a35518K1429N8049K5084R7187N1211n907L742o7575k2047k659L3518M0947
$$ plain form
24845 -67940 -47339 -25351 -2286 -24666 -50428 -4884 -5112 -61964 -35999 25530 24157 -84872
24833 -84872 -45524 44901 92687 85004 37569 22661 46830 61622 23346 -32185 -25443 36896
24821 36896 -33835 -48531 -37513 11464 26419 33449 12165 27271 -6823 -42256 -11769 31197
24809 31197 36653 54195 57526 76223 79402 95828 70944 39696 20696 -717 -2788 -52988
24797 -52988 -72693 -39630 -10149 -31190 -56774 -97406 -78275 -96684 -61577 -33889 -30522 23513
24785 23513 33441 -27360 -24209 58350 89999 61630 73213 41526 42243 81371 61329 63115 47168
24772 47168 39596 60561 83046 71189 32828 -32092 -104807 -117190 -24601 28412 -40003 -135518
24760 -135518 -114089 -56040 -30956 66231 117442 111535 115277 47702 25655 22996 56514 97461
24748I7461O790R906m033n8038k3335L8194k0349n3844n503J8383N498J3815m8304
24735b3359j6919k688q36Q147k350O696J2635O961r314k5101n613K1335J3735
24722a6671N1804Q9543J5095j06367J4122K7093N8581J0587k8859R273N709p7118
24710E2792k4561R498p09Q342M608n4236n5722J0782K6593k4642J9942N8311O0355
24697I1353J4215j3581k1538K9235j74m4877K4434L2826l2346R943r753L392K1627
24684A04756k0297m3278R444J2548m9934n3831M9398k1766p6366P183P6498j3641
24672a9286j2874J5755O362J8260K3646k3825l6510j7623m1921r392O8085o259
24660c5582J2548l5122o378M7968Q479j3279K799J7097r755J0913M3524j0084
$$ plain form
24748 97461 104251 114157 110124 52086 28751 66945 46596 -7248 -12751 5632 11130 24945 -23359
24735 -23359 -40278 -42966 -43802 -35655 -38005 -31309 -18674 -11713 -21027 -46128 -51741 -30406 -16671
24722 -16671 35133 124676 139771 33404 47526 74619 133200 143787 114928 124201 129910 52792
24710 52792 28231 37729 37020 45362 49970 -4266 -59988 -49206 -22613 -47255 -27313 30998 91353
24697 91353 105568 91987 70449 99684 99510 54633 79067 111893 79547 89490 79737 83129 104756
24684 104756 84459 41181 50625 63173 13239 -40592 8806 -12960 -89326 -82143 -5645 -19286
24672 -19286 -32160 -16405 -10043 8217 31863 8038 -28472 -46095 -88016 -97408 -29323 -35582
24660 -35582 -23034 -58156 -64534 -16566 -8087 -21366 -18567 -1470 -11225 -312 43212 33128
24648C3128l5233l48m1765l2127L0820L2236K7409l7187m8733k2605K9517N3123
24636a1765k5379k8366P7063N0542J3417L0875J7770J3060m4562o3570q6811k3686
24624h1412M1766N3098k8021o916o4002k5720L0459M7533K0534k6614l3579K4325
24612d8549j7010L3915O916j6619M9927P69m1545m8546N2784J9568j5724k5039
24600d9153K2720K8733j9165J5401K3415o6163N258j0055P715J6922K1954J2064
24588I646L027k0302j8523l8835l61L7713K5760l2716J1220L2839Q298J0376m0829
24575a2687o803M5195k4000m2169q28M882q4374l4451K4954J1535p628P4191O3548
24562A1365L551N0595L1831k3809J03018l178q7499o0373j3491j5615k1706k9659
$$ plain form
24648 33128 -2105 -2453 -44218 -76345 -45525 -13289 14120 -23067 -71800 -94405 -64888 -11765
24636 -11765 -37144 -65510 11553 62095 75512 106387 124157 137217 92655 29085 -57726 -81412
24624 -81412 -39646 13452 -14569 -21485 -85487 -111207 -80748 -33215 -12681 -39295 -72874 -48549
24612 -48549 -65559 -31644 -24728 -41347 8580 9349 -32196 -80742 -27958 -8390 -24114 -49153
24600 -49153 -26433 2300 -16865 -1464 21951 -44212 -38954 -49009 -41294 -24372 -2418 9646
24588 9646 12673 -7629 -26152 -64987 -65348 -27635 -1875 -34591 -23371 9468 17766 28142 -12687
24575 -12687 -19490 25705 1705 -40464 -41292 -36410 -120784 -155235 -130281 -118746 -126374 -52183 11365
24562 11365 14916 65511 97342 73533 176551 173373 85874 25501 12010 -3605 -25311 -54970
24550e4970Q178L6664m737Q201K7570Q124n5850l627r156k5631K4568M8763j2343
24537d246k1803N4821p057o2875M6072L2814j9402m5349K6740J4725p8967Q619
24525e5908k2046M880O319J1844K1484L1316P4437m2745j0287l5909l368Q3224
24513F3241K0868M5323J3959r947k2140R960p5323p8184k7297N3308p072J992
24501a1312k3002j5758K9503L9858Q029L5122J600l6131J7627N1928k0730r3380
24489a6646O4253K4288j122n3001l2705n6445n046M2884L3695L6683K817l6058
24477C597r186M079K2414K7962l245l6909K8744R8081K379l6480l9122l9164r796
24464A3354l3593N0090R646k1539L515M4372j7461l2665m1998j1773M723M0637
$$ plain form
24550 -54970 -46792 -10128 -14865 -6664 20906 29030 -26820 -30447 -39603 -65234 -40666 8097 -4246
24537 -4246 -26049 28772 21715 -41160 4912 37726 18324 -27025 -285 14440 -64527 -55908
24525 -55908 -77954 -73074 -66755 -54911 -33427 -2111 72326 29581 19294 -16615 -19983 63241
24513 63241 84109 129432 143391 133444 111304 121264 45941 -32243 -59540 -6232 -13304 -11312
24501 -11312 -34314 -50072 -20569 19289 27318 62440 64040 27909 45536 97464 76734 -16646
24489 -16646 47607 71895 70773 17772 -14933 -71378 -76424 -33540 155 36838 39655 3597
24477 3597 -5589 -1510 20904 48866 45621 8712 37456 135537 137916 101436 62314 23150 13354
24464 13354 -20239 29851 39497 17958 21473 65845 48384 15719 -26279 -38052 -33329 7308
24452G308p256N9769J2222O828l1379j9689K4122J2068M792J464M0464k3434n8667
24439B8612n2590o2146M388M7700N0215J7033j7249O1253L6862m0090k5970J3446
24427F1464k2667j4195j5971j2160N245L840k4074l5584l960J0106J0874J282
24415c5800m1420q401J5793K6804j2857J6434M8501Q103j7863m6309J3697K0934
24403a2384L962j3937k7817k5350N8624K4362j9502l1038L4873l714j462M0535
24391B7152L1399j6593q7224M946J9265n240K9544O822J2621r586j8053j3723
24379a8670j041K3535j5260k470J2961n6724J2748n545n34L9303M3410K4279k1693
24366C4299n5575R052J7608M130K2469L8622j8110N560L0831Q957j00924o0892
$$ plain form
24452 7308 52 59821 72043 78871 47492 27803 51925 63993 68785 70249 110713 87279 28612
24439 28612 -23978 -86124 -81736 -34036 16179 33212 15963 77216 114078 73988 48018 61464
24427 61464 38797 24602 8631 -3529 1716 5556 -18518 -54102 -58062 -47956 -37082 -35800
24415 -35800 -77220 -85621 -69828 -43024 -55881 -39447 9054 17157 -706 -47015 -33318 -12384
24403 -12384 -8422 -22359 -50176 -75526 -16902 7460 -12042 -43080 -8207 -11921 -13383 27152
24391 27152 58551 41958 -45266 -40320 -21055 -26295 3249 10071 22692 13106 -4947 -18670
24379 -18670 -19711 3824 -11436 -13906 -945 -57669 -44921 -50466 -51000 -11697 31713 55992 34299
24366 34299 -21276 -12224 5384 9514 31983 70605 52495 58055 88886 97843 -3081 -63973
24354f3973k2678M288k6900l1278J1963J8428M7845M1052O4911N4719m6598m4432
24342G347l9357K2054N9383O9086l0977o598J9841q1642o5920l1775k7309p1816
24330a77683N0446Q4597R7961L0846M043q734j6301O495l8691l1690J7242O3200
24318H1731q497k0627m1523m8442o146l9700j2078P7935M514L4608O8604j3794
24306G6585J9692k6116m2098k3554k8500j5624L4695R011l7636N066N6855K6089
24294E4465o6744n2370j7040J1321K6670L1811m914j0389k9180n6024M2250K6627
24282d3517l6967M9230K6955J0367j4734k7317J745k6823K0309L4458L9136k1475
24270A1367K2775M3250m1684n8986K1998L3287J3370m0592l910n5383k0134n1047
$$ plain form
24354 -63973 -86651 -82363 -109263 -140541 -128578 -110150 -62305 -21253 43658 98377 51779 7347
24342 7347 -32010 -9956 49427 118513 87536 80938 100779 19137 -46783 -78558 -105867 -177683
24330 -177683 -127237 -42640 55321 86167 90210 81476 65175 71670 32979 1289 18531 81731
24318 81731 73234 52607 11084 -37358 -43504 -83204 -95282 -17347 -12833 21775 90379 76585
24306 76585 96277 70161 28063 4509 -23991 -39615 -4920 4091 -33545 -28479 28376 54465
24294 54465 -12279 -64649 -81689 -70368 -43698 -11887 -16801 -27190 -56370 -112394 -70144 -43517
24282 -43517 -80484 -31254 -4299 6068 -8666 -35983 -34238 -61061 -40752 -6294 32842 11367
24270 11367 34142 77392 35708 -23278 -1280 32007 45377 4785 875 -54508 -74642 -125689
24258a25689J10578K6220o0184M900Q5477j2124m173j5161k0649k2569n4137p915
24246i5426L0331M904J2484J4767M2635N5243J797o3927l1230J7652k1317R88
24234c1099j8304n5109K0391m055L5652J08756J7004j3315J0373k1206J454l4057
24222A6485o1987m0278L7930O2426M872m6217R468M1451p589q173M7253K3206
24210G8847l2362j2211K7291m324l3544j6822j3312o3604N944L091J8064K2397
24198b0545L5879l7780k460L6949j5620m7518j2137O4476K735j4920O036K8461
24186B3556J0238p029J3715N6282K4932l1946m0641K0243n3386m7264m8396K6089
24174e3607K3262l9091l5008N1981K3083r224p096O527j9176K6537j3658M0668
$$ plain form
24258 -125689 -15111 11109 -49075 -44175 41302 29178 25005 9844 -10805 -33374 -87511 -95426
24246 -95426 -65095 -60191 -47707 -32940 9695 64938 66735 2808 -28422 -10770 -32087 -31099
24234 -31099 -49403 -104512 -84121 -88176 -52524 56232 73236 59921 70294 49088 50542 16485
24222 16485 -45502 -85780 -47850 14576 19448 -26769 -17301 24150 16561 8388 55641 78847
24210 78847 46485 34274 61565 57241 23697 6875 -6437 -70041 -64097 -61006 -42942 -20545
24198 -20545 15334 -22446 -24906 12043 -3577 -51095 -63232 1244 3979 -10941 -4905 23556
24186 23556 33794 26765 40480 96762 121694 89748 49107 69350 15964 -31300 -79696 -53607
24174 -53607 -30345 -69436 -104444 -52463 -29380 -38604 -45700 -39173 -58349 -31812 -45470 -4802
24162d802M8611k1207R828N7635L9290n7756j214p2782O198l8538k5383O7749
24150G629J21K7569N2243M972o1106o0458n9095k600R2585O5181o5110m5775N1875
24137H031L5348O610o955l6738N8391K9721l407r769P846J3698n33o1448l5074
24124E721p017m3489J6525l8927L991P7281K2635K5825j807q101L887j5607p100
24111C3817M6259O9175J8562l4455j4287Q977j4519j12667k1002M3341q890K0035
24099C4346K6329m2471k7766l8663K524k8224L775P1224j7429p506J9911k753
24087f703j4172O281M0420k7353M0346K247M9730j8441q6188k3259O9809K6787
24075E9504k9225m6199j6549j2821J4103O5793l2564l3983M2739N5931K945j4776
$$ plain form
24162 -4802 43809 22602 32430 90065 129355 71599 70385 -2397 3801 -34737 -60120 7629
24150 7629 7750 35319 87562 92534 31428 -29030 -88125 -90725 1860 67041 1931 -43844 8031
24137 8031 43379 49989 43034 6296 64687 94408 91001 81232 89078 102776 102243 40795 5721
24124 5721 -1296 -44785 -28260 -67187 -63196 14085 36720 62545 60738 52637 56524 40917 33817
24111 33817 80076 149251 167813 133358 119071 128048 113529 862 -20140 23201 14311 34346
24099 34346 60675 18204 -9562 -48225 -45701 -73925 -70150 1074 -16355 -23861 -3950 -6703
24087 -6703 -20875 -14594 25826 -1527 38819 41066 90796 72355 -13833 -37092 32717 59504
24075 59504 30279 -15920 -32469 -45290 -31187 34606 2042 -31941 10798 66729 69674 54898
24063E4898j7681j2048k2491l7086q87r494L4119K8360K3691j5073L4075k2781
24051C7602k1139m2179k121J4175r631J0450j9283J8933r400M950j511k8148o288
24038e3590j7753K3014o4852k1249N4559J0286M925O5695n531l9911p339K1287
24026c0459r73L9781J05906K4153j6091p723l3135o3656k389R34m7721J1256j2540
24013c2657J4017j7152l4288l5674J995K9618j6933R555L8368O4239l980j8800
24001a692O806l8756j0669j7770j894O2052J9416j7344J5426L8097m466K9180
23989G8386l9709L5619k6646m3725k3870j5722L0416o1343j7288K4169R0566J3185
23977D4038p0742k8793M9735M7325K2691m9430L852L2333n3086l1030m4269k384
$$ plain form
24063 54898 37217 25169 2678 -34408 -35295 -44789 -10670 17690 41381 26308 60383 37602
24051 37602 16463 -25716 -27837 -13662 -23293 -12843 -32126 -13193 -22593 -17643 -19154 -47302 -53590
24038 -53590 -71343 -48329 -113181 -134430 -79871 -69585 -64660 1035 -4496 -44407 -51746 -30459
24026 -30459 -31432 8349 114255 138408 122317 114594 81459 17803 15414 16348 -31373 -20117 -32657
24013 -32657 -18640 -35792 -70080 -105754 -103759 -74141 -91074 -81519 -43151 21088 17108 -1692
24001 -1692 5114 -33642 -44311 -62081 -63975 -1923 17493 149 15575 53672 49206 78386
23989 78386 38677 74296 47650 3925 -19945 -35667 -5251 -66594 -83882 -59713 30853 44038
23977 44038 -26704 -55497 -5762 41563 64254 14824 18676 51009 -2077 -33107 -77376 -79760
23965g9760L5665K6695M871j1276J8191O4662K1994j809J8751j4392p1671q6412
23953g4491J3299K4117j8333l2197N9423L7587K5066O305j4397K459J1982o672
23941C4148k7127p1297J6602J3286M28K1652L8489K4617k6368m6748o0754J9922
23929f3150p308r062j0164O435J2310r102O4240J0760J3035p843M663q802L9346
23916C5358J2359L2912j0897k8720K298J6562p464j5618K8687j7533K015J1963
23904F1922n0818j5563M1522N380L709M8971l2388q5325q8033K8491L1393l3221
23892h3960J5776K8138j0963k7654R1345K0304k1750m8497M7118O8318l4290j01478
23880e7593m7004Q053q452J2423L2999M0102J920j6652O3317R333O548l707J3223
$$ plain form
23965 -79760 -44095 -17400 -12529 -23805 -5614 59048 81042 79233 97984 83592 11921 -74491
23953 -74491 -61192 -37075 -55408 -87605 -28182 9405 34471 40776 26379 28838 40820 34148
23941 34148 7021 -64276 -47674 -34388 -33960 -12308 26181 50798 24430 -22318 -83072 -63150
23929 -63150 -70458 -79520 -89684 -83249 -70939 -80041 -15801 -5041 7994 151 4814 -3988 35358
23916 35358 47717 80629 69732 41012 43310 59872 52408 36790 65477 47944 49959 61922
23904 61922 11104 -4459 37063 42443 46152 95123 62735 -22590 -110623 -82132 -50739 -83960
23892 -83960 -68184 -40046 -51009 -78663 12682 32986 11236 -37261 9857 78175 43885 -57593
23880 -57593 -104597 -96544 -104996 -92573 -59574 -19472 -17552 -34204 29113 38446 44994 41287 54510
23867E4510k7702k4067n1238J9645n2345o1582j021L0435O4384L3268l1362L5222
23855a1853k1774K4655N7561q738p0894M958M1327Q746n1308n0961J2267L0623
23843c5391K9926K8325L311J2992O6126q943L3986m8386p4111l2794k1970P1104
23831B4175L3750J5831j2855j9273l8221p583l8606l0361J8158N307p618l1199
23819h8495J14699O1736o5310K7789Q275l7319k6993N3867J6613l7501p8356p880
23807e8875O6993O5596N2381L0303o926p2566l0194J0952J9630J2481m1097N4083
23795A02761p110n1453j2620J4220k5398m2011k0093o319M3691l2443R373K5602
23783a800L0933L3661k6885N38j2235M4484j5432l032R27o4837o3638j29Q175
$$ plain form
23867 54510 26808 2741 -48497 -28852 -81197 -142779 -143800 -113365 -48981 -15713 -47075 -11853
23855 -11853 -33627 -8972 48589 39851 -31043 -26085 15242 23988 -27320 -78281 -66014 -35391
23843 -35391 -5465 22860 26171 39163 105289 96346 130332 81946 7835 -24959 -46929 24175
23831 24175 57925 73756 60901 41628 3407 -4176 -42782 -73143 -54985 -49678 -57296 -88495
23819 -88495 26204 87940 22630 50419 58694 21375 -5618 48249 64862 27361 -50995 -58875
23807 -58875 8118 73714 126095 156398 149472 76906 46712 57664 77294 89775 48678 102761
23795 102761 95651 44198 31578 45798 20400 -21611 -41704 -48023 -4332 -36775 -27402 -1800
23783 -1800 29133 62794 35909 36447 24212 68696 53264 50232 51159 -13678 -77316 -77445 -69270
23770f9270K0423L4606K3693m686L3792P0604L8660k6726m584j4787l2788l0772
23758C8165P764O2402m2227P67j8524K1234J6224n5628j2153k9438p623l4083
23746e3120K5372M7724j5645K3056j0092K42N4239K8408J2633J4385K5044R5472
23734B47718P9645J22931J21774J71834K00449K20766J88795K39565L62696L63088
23724B319261J34605j88368k25730r2724k38155n66448n32219k73280j31865m4798
23714A60279j1042O2994m1521l2918K9564o3921n9882M4979K0050J3532k7905
23703I4209n1826l2759Q2140K0842l8141q2977n2647M4156l63M1876L3879p6492
23691a8103q0650O4453M6045J4330M5374J4989j4058j19K969n8055p981n8139
$$ plain form
23770 -69270 -48847 -14241 9452 4766 38558 109162 147822 121096 116512 101725 68937 38165
23758 38165 45929 108331 66104 66871 48347 69581 85805 30177 18024 -11414 -19037 -53120
23746 -53120 -27748 19976 4331 27387 17295 17537 71776 100184 112817 127202 152246 247718
23734 247718 327363 450294 572068 743902 944351 1165117 1353912 1593477 1956173 2319261
23724 2319261 2453866 2265498 2039768 1947044 1708889 1142441 610222 336942 205077 160279
23714 160279 149237 212231 170710 137792 167356 103435 43553 88532 108582 122114 94209
23703 94209 42383 9624 91764 112606 74465 -8512 -61159 -17003 -17366 24510 58389 -18103
23691 -18103 -98753 -34300 11745 26075 71449 86438 72380 72261 75230 17175 9194 -48945
23679d8945p265O9189L2137Q519J4125l9330j3081M6276k1880K885j4953J284
23667B8961k9541k8222m2938p797J05826K3486n9762J2541M1874j3902j0639R282
23655B9169k6197O0003r136q495q875n5725J1461R560l0809k4510M4149R6316
23643H6911J5668n6806m9916n3229N601j0892K6906P6265J12490k834p6443k6108
23631D7613o3692o0941L3636P3089l086k7551j9343P0903J9029o3354r9577n0706
23619a43980L827K2299J03908L2369p242J2374o8467K0436L2203L5484J6724n3634
23607F301P532L3023o500j1576K4657O666r3509K4986P3590j0302l4764J2216
23595C2320L1655M4717K48P781K9636o5378j6309K4706L4270K076r2760n1030
$$ plain form
23679 -48945 -56210 12979 45116 53635 67760 28430 15349 61625 39745 42630 27677 28961
23667 28961 -580 -28802 -71740 -79537 26289 49775 -9987 2554 44428 30526 19887 29169
23655 29169 2972 62975 53839 45344 36469 -19256 -7795 1765 -29044 -53554 -9405 86911
23643 86911 102579 45773 -4143 -57372 -51771 -62663 -35757 40508 152998 150164 73721 47613
23631 47613 -16079 -77020 -43384 29705 26619 -932 -20275 50628 69657 6303 -93274 -143980
23619 -143980 -140153 -117854 -13946 18423 11181 23555 -44912 -24476 7727 43211 59935 6301
23607 6301 13833 46856 40356 28780 53437 60103 -33406 -8420 65170 54868 20104 32320
23595 32320 63975 108692 108940 116721 146357 80979 64670 89376 123646 125722 32962 -18068
23583a8068Q408J8081J6371K3037J9606N7798J5349j3623l5357j1680J9742o2573
23571C7091r2418k6662O419K7691j9429L3274O5514K7384J5846m3673j8954q089
23559C994n8125M7778M8630O348k2680n1624k696N1658R4959m3467l5786K8723
23547F7712K8209J2919k5714l3395J3754P716m0494l9008O2772P3063N627n1045
23535H2116m0204J2942k4278J9919L590Q923L9791M1885K2517m3406l9810l789
23523H0196m0059o6131j3504O1890J8724m1466k8117j9402n4071p802Q5454N4725
23511C0437L979K0579j451q2294J4855N1244L0116j6550o0255r887J0891L3072
23499B4736j2425l6513N4294M5064l1294k0622K0095O2182M7171k1793r5396n7670
$$ plain form
23583 -18068 -9660 8421 24792 47829 67435 125233 140582 126959 91602 79922 99664 37091
23571 37091 -55327 -81989 -75570 -47879 -67308 -34034 31480 58864 74710 31037 12083 3994
23559 3994 -54131 -6353 42277 48625 25945 -25679 -28375 23283 118242 74775 38989 67712
23547 67712 95921 108840 83126 49731 63485 71201 30707 -8301 54471 127534 133161 82116
23535 82116 41912 54854 30576 50495 54085 63008 102799 144684 167201 123795 83985 80196
23523 80196 40137 -25994 -39498 22392 41116 -350 -28467 -47869 -101940 -109742 -24288 30437
23511 30437 34416 54995 53544 -28750 -13895 37349 67465 50915 -9340 -19227 -8336 24736
23499 24736 12311 -24202 30092 75156 43862 23240 43335 105517 152688 130895 35499 -22171
23487b2171J2175j159K7095l181K6257L7k3066k1404M5351j4137p0877r685K0599
23474c4166k1120K8056q907J0324J3399R779L434O2373K0915j1517m041l2473
23462C6056p609k4032j3973Q499O578L676J4402M3773N1931K1414N6859j5674
23450A81900k0994r2803m5407Q246l5200n689R053p992q265K0633K8467L0079
23438F2028J6589l373m0770N954J0659r674J1903L3297k2256l0995j6053M3242
23426F0551L8150l1963m2329j5829o491n309O5142j2378J8882L7N605L1209p752
23413I7525j2805J7517n6202l0910K4209K9408M5680K6714k2217l179K3381l695
23401A35426m5196l2401L2464L9184k0303O169m4873k6941r256Q3119O7549O4973
$$ plain form
23487 -22171 -9996 -11155 15940 12759 39016 39053 15987 -5417 39934 25797 -45080 -54765 -34166
23474 -34166 -55286 -27230 -36137 -25813 -12414 -2635 799 63172 84087 72570 68529 36056
23462 36056 28447 4415 -9558 -1059 5519 9195 23597 67370 119301 140715 197574 181900
23450 181900 160906 68103 22696 30942 -4258 -9947 -894 -8886 -17151 3482 31949 62028
23438 62028 78617 75244 34474 40428 51087 41413 53316 86613 64357 33362 17309 60551
23426 60551 98701 66738 24409 8580 2089 -3220 61922 49544 68426 68463 74068 105277 97525
23413 97525 84720 102237 46035 15125 39334 68742 114422 141136 118919 115740 139121 135426
23401 135426 90230 57829 90293 129477 109174 115343 70470 43529 34273 117392 184941 249914
23389B49914m7162n4772l7795N1545O1844k1324p7582o06J5524o24m1495M4279
23377A41746J5836L7394J13811k9549k7507k1651m5341Q5782R8908J4725l7577
23366C46577k5197j9711j20621n4096N8391k1507n201k3314k4524l7240j5953
23355E7604J3348J4573j5271J4177m4593J3910M3065j8227k5281l0681K2798j7025
23343B8397L0155L8477K8116R837j1832l1363l9013J9424N2559L5804l6803j012
23331A22746K1314n1622o2223K8640j1089r0975n4999K5647P4275M2643J1621
23320E5978K5319k1002j8211j2058l184m5400M1171Q0716K4242P6781M1209k3410
23308B22151K4394l8937N265m287m1975n909m248n455j5548J6646J7351n3049
$$ plain form
23389 249914 202752 147980 110185 161730 223574 202250 124668 124062 139586 138962 97467 141746
23377 141746 157582 194976 308787 279238 251731 230080 184739 270521 369429 384154 346577
23366 346577 321380 301669 181048 126952 185343 163836 158635 135321 110797 73557 57604
23355 57604 70952 85525 70254 84431 39838 53748 96813 78586 53305 22624 45422 28397
23343 28397 58552 97029 125145 134982 123150 91787 52774 72198 124757 160561 123758 122746
23331 122746 144060 92438 30215 58855 47766 -43209 -98208 -72561 1714 44357 55978
23320 55978 81297 60295 42084 30026 26842 -18558 22613 103329 127571 204352 245561 222151
23308 222151 246545 207608 212873 208586 166611 160702 156454 150999 135451 152097 169448 116399
23296A16399j7723Q368L9285r572p8664k0696O8457j6297n4150M9396Q7113N0482
23284B22398m6849o2328k1257j422o2802p000N3544N1014M7623O5467n9177m574
23272A74637K835L3411j1556n6865l1495N2824L8697l888l1214J2974l6175m662
23260A39523k6291n3197R1640M3893O4675P0769J12874Q1595P7985P5856P5504
23249G54826Q5824R5798n2044j39420j44867p4080n8744q3080o5825p4746p5273
23238A68369m2362M5946L6556j9352o3771J2443k0907K827N5410M9227P3962n5362
23226B42986o925J940N276p108m171J4669l8317k2054R3397R0217O834j022J3134
23213C88856k8888M2168K4685j7030O9886Q0396J79804J86111K16712J08477J61901
$$ plain form
23296 116399 98676 107044 146329 136757 58093 37397 105854 89557 35407 84803 171916 222398
23284 222398 175549 113221 91964 90542 27740 20740 74284 125298 172921 238388 179211 174637
23272 174637 177472 210883 199327 142462 110967 163791 202488 198600 167386 180360 144185 139523
23260 139523 113232 60035 151675 195568 260243 331012 443886 525481 603466 679322 754826
23249 754826 840650 936448 884404 744984 600117 526037 467293 384213 318388 243642 168369
23238 168369 126007 171953 208509 189157 125386 137829 116922 119749 175159 224386 298348 242986
23226 242986 236061 238001 243277 236169 231998 246667 208350 186296 279693 369910 376744 375722 388856
23213 388856 359968 402136 426821 409791 479677 560073 739877 925988 1142700 1251177 1413078
23202A413078L14948L97171M50828K18897k49736k89204l3044R231l80038n87402
23192A264729l88845k09019q8389q2385m8424L479J5383J9777M2151O3316O3468
23181F55241K607j2125O5821K5097N0883Q547N7808R9540J2397M9429O5631K2865
23169A103741M9427O8603k93j9555m641J7691Q8841K6632o5505j6893K4573O751
23157A279372L5804J56814J53606R6474J57982J27113R0387J34489J78085J54926
23147B565052K30768K31156K42324L31321L96219M10753M66017N78754P71249
23138F223613R59000J158944J548766K171666K974671M397165O416083R501694
23130C5351602J5012150K2206324K9532860L4195832L5522207L4517795L6419369
$$ plain form
23202 1413078 1728026 2125197 2576025 2794922 2545186 2255982 2222938 2232169 1852131 1264729
23192 1264729 875884 666865 578476 496091 447667 451146 466529 486306 528457 591773 655241
23181 655241 657848 645723 711544 736641 787524 796071 853879 953419 965816 1015245 1080876 1103741
23169 1103741 1153168 1221771 1221478 1201923 1197282 1214973 1303814 1330446 1264941 1248048 1272621 1279372
23157 1279372 1315176 1471990 1625596 1722070 1880052 2007165 2097552 2232041 2410126 2565052
23147 2565052 2795820 3026976 3269300 3600621 3996840 4407593 4873610 5452364 6223613
23138 6223613 7182613 8341557 9890323 12061989 15036660 19433825 25849908 35351602
23130 35351602 50363752 72570076 102102936 136298768 171820975 206338770 242758139
23123B42758139M4611159O1537629P7283553K8140938n4079427m8176184j5043947
23116C37031860m3004618r2697915q3356635m6775349k3835408j3052184p940516
23109B6369235n522662m029073k917019k197997j648313j287200r98745q27238
23101F940988p88892p33794o42601m48883l49897l66090l13317k17054r9280k02318
23091B778862k28941j29401j15691j78549k03498k14663m2116j5697j39976j28648
23081A381682l8607j05808j47771n9524l5634j0120k8800q438j7114j28754n4471
23070G46641r3324o3019j1682k630j9935N854o325J9956N626k0307k011j5721
23058E43123n8464J1770j3101l0155O2851N2853k5862k0255M4954J46251J04331
$$ plain form
23123 242758139 287369298 348906927 426190480 454331418 400251991 352075807 337031860
23116 337031860 294027242 201329327 117972692 71197343 47361935 34309751 26369235
23109 26369235 20846573 16817500 13900481 11702484 10054171 8766971 7768226 6940988
23101 6940988 6152096 5418302 4775701 4326818 3976921 3610831 3297514 3080460 2981180 2778862
23091 2778862 2549921 2420520 2304829 2126280 1922782 1708119 1666003 1650306 1510330 1381682
23081 1381682 1343075 1237267 1089496 1029972 994338 984218 955418 946980 929866 801112 746641
23070 746641 653317 590298 578616 575986 556051 561905 555580 575536 581162 560855 558844 543123
23058 543123 484659 496429 483328 453173 516024 568877 543015 522760 567714 713965 818296
23047H18296J14550J55805K01412K32611J97607J70207L00697M19888J38092k31526
23037B517639k50135j89442m50901n16289l41636k15603j14909j1517k9712o2396
23027C35099j3448j4628K321k9290o2282j0217l1002L2713N7010k3040k7852k9018
23015A86366j4676k2081j3248j1579M196j7607r76J4375O9282N1541L3051M685
23003B83329j7528K7943J9838k2233m3907q7097q0871j9032p8372j59635q7235
22992b64800M4376N780m6519K2639J52793P2086J5478P3465k2090j5923O3466
22981A00751n870j4425J1197R988j9886p209m1616M3981k9099J3077K5632j3315
22969G3206j2764n4318J7523K2848j1533L6677K8004o286J9964K7036Q012n1666
$$ plain form
23047 818296 932846 1088651 1290063 1522674 1720281 1890488 2191185 2611073 2749165 2517639
23037 2517639 2267504 2078062 1627161 1110872 769236 553633 438724 427207 397495 335099
23027 335099 321651 307023 309344 280054 217772 207555 176553 209266 266276 243236 215384 186366
23015 186366 171690 149609 136361 124782 128978 111371 110395 124770 194052 245593 278644 283329
23003 283329 265801 293744 313582 291349 247442 160345 79474 60442 -17930 -177565 -264800
22992 -264800 -220424 -214644 -261163 -238524 -85731 -13645 1833 75298 53208 37285 100751
22981 100751 94881 80456 91653 101641 81755 74546 32930 76911 47812 60889 86521 73206
22969 73206 60442 6124 23647 46495 34962 71639 99643 93357 113321 140357 148369 96703
22957I6703m2481m0474m9538j831l1127K4312K5394R8590Q2213k71j12717m1450
22945G323N6560K6044n7479K6289r1193j07170j0997n0733L3878L9559N5958j5926
22933h7887j6304k4047m791M826M1911L5928M9407M99P5001j7619K3960L3809
22921A14693J0758k2712m8985j5336k3453k2012o066K7118R940P7223K1528j7680
22909A05016Q390l072N2403m7011k4554j0895n3884p7700o048N3887N2343l4101
22897A4774l7088O948J504J4279L0805L5633l4633n2018J9651L4902M136m1532
22885b639j3402k0484K5178Q5489N1132k7255j7243R34J3382J0611k1353m6202
22873C8148R041j552K28m5745k3042J4268M0399J9426j8476M9284K3192k7544
$$ plain form
22957 96703 54222 13748 -35790 -37621 -68748 -44436 -19042 79548 161761 161490 48773 7323
22945 7323 63883 89927 32448 58737 -32456 -139626 -150623 -201356 -167478 -127919 -71961 -87887
22933 -87887 -104191 -128238 -133029 -128203 -86292 -50364 -957 -458 74543 56924 80884 114693
22921 114693 125451 102739 53754 38418 14965 -7047 -13113 14005 23945 101168 122696 105016
22909 105016 113406 110334 162737 115726 91172 80277 26393 -51307 -57355 -3468 48875 14774
22897 14774 -22314 -15366 -13862 417 31222 66855 32222 -19796 -145 34757 38893 -2639
22885 -2639 -16041 -36525 -11347 74142 125274 98019 80776 81710 95092 105703 84350 38148
22873 38148 47189 45637 45865 120 -22922 -8654 31745 51171 32695 81979 105171 77627
22861G7627n277j151m952J2718J5524r950q267o4093n6371m9329J827K7464J9675
22848d4555L35j6419l6738J5021M272m4180L4904N6791M6517k8011k8120O3421
22836B3238J0535n067O229j3807N9696M2141K6656J1102l6284m9307l3715o5465
22824b4048p5310l5763L4176R069J7982R806j0054j4828l1826j650K7109K4206
22812g1131R892O5671k0500N8366m0256l3174p4606k2930O5525k7393O625N0681
22800c3230L7642l5448o706j0866K6108N7946l0603J3443q276m2568N3645n774
22788A5313l6047l7109K9827M3950j602q4636M7694M3704j5009l1870o6529k8279
22776a20593j1068K7057L2211Q4118J0228j215P8740n2033l7713j0875j4360M878
$$ plain form
22861 77627 72350 71199 66247 78965 94489 84539 76272 12179 -44192 -93521 -91694 -64230 -44555
22848 -44555 -44220 -60639 -97377 -82356 -78084 -122264 -87360 -30569 15948 -12063 -40183 23238
22836 23238 33773 28706 34935 21128 80824 122965 149621 160723 124439 75132 41417 -24048
22824 -24048 -99358 -135121 -100945 -91876 -73894 -64088 -74142 -88970 -120796 -122446 -95337 -71131
22812 -71131 -61239 4432 -16068 42298 2042 -31132 -105738 -128668 -63143 -90536 -83911 -33230
22800 -33230 4412 -31036 -37742 -48608 -22500 35446 4843 18286 10010 -32558 21087 15313
22788 15313 -20734 -57843 -28016 15934 14332 -70304 -22610 21094 6085 -25785 -92314 -120593
22776 -120593 -131661 -104604 -72393 11725 21953 20738 99478 47445 9732 -1143 -15503 -10625
22764a0625k395N8696j5069o435m1377n6852J5608m134j2132o190q452L4439j4180
22751f9098m2410J6739L5246P2420O2473r790k0255k2090R850O3616J6111m5840
22739F6972l8413j2028l7108j04778L287O8591K5649J3295Q772Q7246L4362n9794
22727E6053q9267m1412M2983M9975K6186L6282J3916k6248j7456L162n6866m8117
22715e0809r627K223K0766K5305o4413M1927M976n85l3179K9528O2559p1860o3008
22702a06197P3240O9942j3603p896j3358K9402L6434q466j0887m8322n8607J1905
22690d6413k706N8677K7768p8237l1392N4106q467K1097M0430J2461j0202m2976
22678e854L0377n92j8198N1565J4975k7995j6926j3563j374n8011n1846J2490
$$ plain form
22764 -10625 -13020 45676 30607 24172 -17205 -74057 -58449 -62583 -74715 -80905 -89357 -54918 -69098
22751 -69098 -111508 -94769 -59523 12897 75370 65580 45325 23235 33085 96701 112812 66972
22739 66972 28559 16531 -20577 -125355 -122068 -53477 -27828 -14533 -5761 81485 115847 56053
22727 56053 -33214 -74626 -31643 18332 44518 80800 94716 68468 51012 54174 -2692 -50809
22715 -50809 -60436 -58213 -37447 -12142 -76555 -34628 -29652 -30237 -63416 -33888 28671 -43189 -106197
22702 -106197 -32957 36985 23382 15486 2128 31530 67964 59498 48611 289 -58318 -46413
22690 -46413 -49119 9558 37326 -40911 -72303 -18197 -26664 -5567 34863 47324 37122 -5854
22678 -5854 24523 23931 5733 57298 72273 44278 27352 13789 12415 -45596 -97442 -84952
22666h4952J3117K8838k7501j6779J5212l9893m68Q9186K6287k8768J927K4819
22654A025k2020M3926K2668j6804m8705m6467L4306k2002l44P1694o203j5400
22642d326Q973J4408L7276k805n6855o9927q118P0830Q6272l2618k1860k4403
22630c153k7279l9438L8780K4074j7964J1893N251J2245j9246m1983O6736O3837
22618G3753M1159n4416M4336J955o6558r911n51o459L6433O273N207L3208J9161
22605A23590r7929q2645J0374j3260M5631N5591J0471M3823l0728m0842M449P925
22593C6450P923l1189l7607Q699L5156n8201j5670K4949J0295J9426N6232K5777
22581H2240j7359L718J870L2902j8815n3193o2692o2206K9063L4293o0051k0845
$$ plain form
22666 -84952 -71835 -42997 -70498 -87277 -72065 -111958 -112426 -23240 3047 -25721 -23794 1025
22654 1025 -20995 22931 45599 28795 -19910 -66377 -32071 -54073 -54417 17277 11074 -4326
22642 -4326 4647 19055 56331 53526 -3329 -73256 -81374 -10544 75728 43110 21250 -3153
22630 -3153 -30432 -69870 -31090 -7016 -24980 -13087 -7836 4409 -14837 -56820 9916 73753
22618 73753 114912 60496 104832 106787 40229 30318 29767 23308 59741 66014 71221 104429 123590
22605 123590 25661 -56984 -46610 -59870 -14239 41352 51823 95646 64918 24076 28525 36450
22593 36450 44373 13184 -24423 -15724 19432 -38769 -54439 -29490 -19195 231 56463 82240
22581 82240 64881 68599 70469 103371 84556 31363 -31329 -93535 -64472 -30179 -90230 -111075
22569a11075R400L5871M9884M1491k5463k6482k4348J5500J6013k6176q906P2470
22557A8179M1688n111L9174O5059k5916K6927L3116J8322o1479j07009o7099J5478
22545h671K2732L694L2881j9181O369R481K1190p5O896k0308m2262k2040j0986
22532b0280K1858L004M3339J4702n3325p822l3568J8444O4558j8389K713l386
22520C1848J1129M7516R6564J04438O4142J09295J58823K19107K35307J04554
22510A182723J60399K71422M08086M25250j186l52752j92165j44906l76920m95252
22500H84699l55462j43120j21292p6426m0849l9943k9670k1646l722j478J4693
22489F5784l6487k4287R7414l4555m0308J8023K043K7110O1167n9997m6083P573
$$ plain form
22569 -111075 -101675 -65804 -15920 25571 108 -26374 -50722 -35222 -19209 -45385 -54291 18179
22557 18179 59867 54756 93930 158989 133073 160000 193116 211438 149959 42950 -24149 -8671
22545 -8671 14061 17755 50636 31455 37824 47305 68495 68420 75316 55008 12746 -9294 -20280
22532 -20280 1578 4582 47921 62623 9298 1476 -32092 -13648 50910 32521 35234 31848
22520 31848 42977 90493 187057 291495 355637 464932 623755 842862 1078169 1182723
22510 1182723 1343122 1614544 2022630 2447880 2446694 2093942 1901777 1756871 1379951 884699
22500 884699 529237 386117 264825 188399 147550 107607 77937 56291 52569 51091 65784
22489 65784 29297 5010 102424 67869 27561 45584 47627 74737 135904 75907 29824 37397
22477C7397P518o857n931l9367k1049M3955L8380j1747o583l1354m3684k8430
22465f7752K5815K5015k7531j4971k4799O0689J0654Q379J5236l9105O212j1278
22453c3436J3840j3662J6740j388o5538k5576l730K5843N1081J03935j6267n1358
22441D84l3881k243O255M5450L582l0071K16Q5521L832k5526r3609j1489K6824
22428b4655P901m4220l289k2019r897K1285j2110M0003J4899k0634n304L479L8928
22415a5633J4206k3008j8618M9198K6557k6473n418p024j2526J3028J3447l5167
22403b7431M725l8000M905J3893P1150k314m3883o548n6512l5402M3299K7641
22391d4477K9708K8461l4884q1756K0538O6202M7403N6402P2074m6972p7980m3659
$$ plain form
22477 37397 44915 38058 32127 -7240 -28289 15666 54046 42299 35716 4362 -39322 -67752
22465 -67752 -41937 -16922 -44453 -59424 -84223 -23534 -12880 -4501 10735 -28370 -22158 -33436
22453 -33436 -19596 -33258 -16518 -17906 -83444 -109020 -112750 -86907 -35826 68109 51842 484
22441 484 -33397 -35640 -29385 16065 19647 -10424 -10208 75313 79145 53619 -39990 -51479 -24655
22428 -24655 -16754 -60974 -64263 -86282 -96179 -74894 -87004 -47001 -32102 -52736 -58040 -54561 -15633
22415 -15633 -1427 -24435 -43053 6145 32702 6229 811 -6213 -18739 -5711 7736 -27431
22403 -27431 -22706 -60706 -55801 -41908 29242 26928 -16955 -23503 -80015 -115417 -72118 -44477
22391 -44477 -14769 13692 -21192 -102948 -82410 -16208 31195 87597 159671 112699 34719 -8940
22379h940L7655N2820N1468L3199n4735j0122l6832j6668j8901L431k4246o929
22367A200N5546o670j2697j7120L429m5088l4086m2548l056j2266M7552l9098
22355a04902k9166L9625J4497L6078k8819K9854M1408q507l8041K8538o112N5799
22343C0252N2581l5372j6263m8666k9144k908m8972j0702O8940M7718k2193p3401
22331h8130k7522M8513q7279K4209M2720Q7838R0887l4093m4711n0817r211k269
22319d9865l2896J2551M6745K0548m2465J5013L6507m9380q1778M1058r293N6754
22307c6501j213q153k4064p1715l3050N665k028K8299Q2175O7650J7481n5491
22295c0945n8244L1657K4570J6650J8604O1346k4168m5289J5479l0224O898k4512
$$ plain form
22379 -8940 28715 81535 133003 166202 111467 101345 64513 47845 28944 32375 8129 1200
22367 1200 56746 50076 37379 20259 23688 -21400 -55486 -98034 -101090 -113356 -65804 -104902
22355 -104902 -134068 -94443 -79946 -43868 -72687 -42833 -1425 -9932 -47973 -19435 -25547 30252
22343 30252 82833 47461 31198 -17468 -46612 -49520 -98492 -109194 -40254 7464 -14729 -88130
22331 -88130 -115652 -67139 -154418 -130209 -87489 349 91236 57143 12432 -38385 -47596 -49865
22319 -49865 -82761 -70210 -23465 -2917 -45382 -30369 6138 -43242 -125020 -83962 -93255 -36501
22307 -36501 -37714 -45867 -69931 -141646 -174696 -169031 -171059 -142760 -60585 7065 24546 -30945
22295 -30945 -89189 -57532 -32962 -16312 2292 63638 39470 -5819 9660 -20564 -13666 -38178
22283c8178k9461O0905Q025q2559m3794L8356N5256J1010o54j0458K2040K4534
22271A5022p844l5767J942k0748J5727L760p529M2158Q1380o5465p9282j906J7869
22258d0683K0659L8884J8380Q720L0392m9825m0353k7979n319j8326N624L5743
22246b4083K6376j7446j9325k5903N960M3733O947k1145k0064l2533n340k338
22234h5161J3293J1614Q633J6789O0704k7937m9359L0204J0404J3912k2719j0007
22222b9630j8379j2750O4135j1861K1559m760K3435m3887l1793J0756J1489K4931
22210C245k4602K7596k4682J450p425N090m5711n5639N7318K1344K7419Q466M6550
22197D0419m071K6303K0938k2386n3715m1140J8720K7391j6748n8097l1329P976
$$ plain form
22283 -38178 -67639 -6734 1291 -81268 -125062 -86706 -31450 -20440 -21094 -31552 -9512 15022
22271 15022 7178 -28589 -26647 -47395 -31668 -27908 -35437 6721 88101 22636 -56646 -58552 -40683
22258 -40683 -20024 18860 37240 45960 76352 26527 -13826 -41805 -47124 -65450 -59826 -24083
22246 -24083 2293 -15153 -34478 -60381 -54421 -10688 -3741 -24886 -44950 -77483 -82823 -85161
22234 -85161 -71868 -60254 -51621 -34832 25872 -2065 -51424 -21220 -10816 3096 -19623 -29630
22222 -29630 -48009 -60759 3376 -8485 13074 8314 31749 -12138 -43931 -33175 -21686 3245
22210 3245 -21357 6239 -18443 -16993 -24418 -19328 -65039 -120678 -63360 -42016 -14597 -6131 40419
22197 40419 36348 62651 83589 61203 7488 -33652 -14932 12459 -4289 -62386 -93715 -85739
22185h5739M5936M5954j3683q052M5849J2085q8796n3072j9678j3580Q556L6527
22173h7693N5365j9779j892K0020L4856M7182k818m5082K2323R5444R122m8098
22161G8950j5438l9237m9065J4587L3961L033N191J2701k4243n3099j0836j8881
22149f2376j6637J2875L7558K6498j0152j8755O3122P521j5433K6228J2203j3665
22137D8987n0688j8925K5141k530l9054j3171n467l6406q8917J8524j7075L6743
22125a42838Q4393K0537K0675M5800J4016J7686l8359m51l213Q004M5657m9434
22113B2473m1550j3192P0824P5589m2804n0856P62q922J0699L6192k4752j8723
22101A5740K287k6304k7813m5132J0192M2880o37J5050L0045N0787Q63q4565m5184
$$ plain form
22185 -85739 -39803 6151 -7532 -15584 30265 42350 -46446 -99518 -119196 -132776 -124220 -87693
22173 -87693 -32328 -52107 -53999 -33979 877 48059 45241 159 22482 117926 127048 78950
22161 78950 63512 24275 -24790 -10203 23758 26791 31982 44683 20440 -32659 -43495 -62376
22149 -62376 -79013 -66138 -28580 -2082 -12234 -30989 32133 39654 24221 50449 62652 48987
22137 48987 -1701 -20626 4515 1985 -37069 -50240 -55707 -92113 -181030 -162506 -179581 -142838
22125 -142838 -58445 -37908 -17233 28567 42583 60269 21910 21459 18246 26250 71907 22473
22113 22473 -19077 -32269 38555 114144 71340 20484 21246 12324 23023 59215 34463 15740
22101 15740 18027 -8277 -36090 -81222 -71030 -28150 -28787 -13737 16308 67095 67958 -16607 -61791
22088f1791L7126j5305l4698j2211K3389k635l5980N5725J1767j6210M4207J23699
22076A17083l8587m9008J7287m3633k26J0241k0651n6693J3527O9611k9499o578
22064a7126j1649K2129K388q009m6801Q787k8861J9592L7290n0617K7475P9358
22052C3956L906M675J6652K0746r2896n7591K7470m938M6927L7969P893k0117
22040B4652k0027M8350j5353j5990Q502K8534l1291o6424l2280N5490Q0790Q125
22028G3078J5882P242O4453P992n6978k8740o2478j2072j4127k226j4077j4140
22016c6191l748n176L4058q579j2576J9096K8914o6497k9225M0946O8159J4321
22004D3502J0209R578l6138L921q706j7951J3972L684l3102j1610r4486M529O1196
$$ plain form
22088 -61791 -24665 -39970 -74668 -86879 -63490 -66125 -102105 -46380 -34613 -50823 -6616 117083
22076 117083 78496 29488 46775 3142 2916 13157 -7494 -64187 -50660 18951 -10548 -17126
22064 -17126 -28775 -6646 -4258 -12267 -59068 -50281 -79142 -59550 -22260 -72877 -45402 33956
22052 33956 37862 42537 59189 79935 -12961 -70552 -43082 -48020 -1093 36876 44769 24652
22040 24652 4625 52975 37622 21632 30134 58668 27377 -39047 -71327 -15837 64953 73078
22028 73078 88960 96202 160655 168647 111669 82929 20451 8379 -5748 -7974 -22051 -36191
22016 -36191 -39939 -45115 -11057 -19636 -32212 -13116 15798 -50699 -79924 -38978 29181 43502
22004 43502 53711 63289 27151 31072 22366 4415 18387 22071 -11031 -22641 -117127 -112598 -51402
21991e1402K8065L4865J4534l2955o0891J1567M349m4780J1835L9266O773M9261
21979A0487L1615n699p9280m5320K660M2952J1721j618J9961L8552L2064j3338
21967D4757K241l630n3334K1551O3094k0739j1475J5234p0700L510k7668p7124
21955a14283P0238j8320j1068M6528p546k6630l5077O247J0805N3649P4235m8660
21943A18k127K0562k7399j6193l8181J1744M8528L9239L3927j8874K2068l3738
21931C9674p3172j6892K3110k1446m0870M7679L479K0433J366J0556j0872J4340
21919b615J7417M2150l7272k788k6672J29J6218k3554J4385j0666o2970o5251
21907a41489N6114L4710l2510j4461P2481K1258m7532m6460K9686L2489L6589
$$ plain form
21991 -51402 -23337 11528 26062 -6893 -67784 -56217 -51868 -96648 -84813 -45547 -38774 10487
21979 10487 42102 36403 -42877 -88197 -85537 -42585 -30864 -32482 -12521 26031 58095 44757
21967 44757 46998 43368 -9966 11585 74679 53940 42465 57699 -13001 -9491 -37159 -114283
21955 -114283 -44045 -62365 -73433 -26905 -34451 -61081 -96158 -89911 -79106 -25457 48778 118
21943 118 -2009 18553 -8846 -25039 -63220 -51476 -2948 36291 70218 51344 73412 39674
21931 39674 -33498 -50390 -27280 -48726 -89596 -41917 -38438 -18005 -16639 -6083 -16955 -2615
21919 -2615 14802 56952 19680 16892 -9780 -9651 6567 -16987 -2602 -13268 -76238 -141489
21907 -141489 -85375 -50665 -83175 -97636 -25155 -3897 -51429 -97889 -68203 -35714 875
21896H75r819J7074j4580k6441o145k5600k0319L3255M1182K7516o521k9183K3663
21883D957p739k46m9011j050L4007M773J72K0040o431j3007j4780K3844J0209
21870E738L3232P434p5091m5251N7752M679j3273n190K8405l107j9982M6931K6832
21857D9109o9380m0236J7436P0781J3707j6985k0386K8422J5233o4550k8582R949
21845c5482n2639P0910N534O672L7089k3320k4724N152J4611o0456l6805l696
21833i7154P632K5856O3194Q331m2061l3102O5359L7625q138r0961J3376O4233
21821A4190l0352q7062J6569Q8L5006L7579K7284j7150n8355L5589Q2264L4473
21809I0123L3835r450j0731O156m5187n436j0082l8664L2681O191j97J2553K8767
$$ plain form
21896 875 -8944 8130 -6450 -32891 -39036 -64636 -84955 -51700 -10518 16998 10477 -18706 4957
21883 4957 -2782 -3028 -52039 -53089 -19082 -14309 -14137 5903 -528 -13535 -28315 -4471 5738
21870 5738 38970 46404 -28687 -73938 -16186 -11507 -24780 -29970 -1565 -4672 -24654 22277 49109
21857 49109 -20271 -60507 -43071 27710 41417 24432 4046 32468 47701 -16849 -45431 -35482
21845 -35482 -88121 -17211 -11677 -5005 32084 8764 -15960 -10808 3803 -56653 -93458 -97154
21833 -97154 -89522 -63666 -472 7859 -34202 -67304 -1945 35680 27542 -63419 -50043 14190
21821 14190 -16162 -103224 -86655 -86567 -51561 -13982 13302 -3848 -62203 -26614 55650 90123
21809 90123 123958 114508 103777 109933 64746 59310 49228 10564 43245 49436 49239 61792 90559
21796I0559j2526l6455N1399L245m3817k1122n995j3732J5085l9091k0291O3579
21784C0838J5550n9558R467N2494l7406j2074j5711r2212J6325Q1262N4618n6610
21772a3017l2933j03264O8335N8673j0181O711O1268L0494k9713l4739L0461K1789
21760E3884K0736J0438l3304k0329j8509l6200n2516k095M7684J9193l7240k5702
21748g3960m6153N9381O5603L8318N2879n978l1300k482j102O178k7097K5853
21736F0140l3748j8931m3655J0059O6323K6028l7257j03292l7856K1915K6687
21725f3587O8665N0124L1804K6434l339m7266j470k8192Q295o1874n3394J5260
21713e8540K1839k9674j9365J372k128K8964o391J8490j3712M2919L0089K1165
$$ plain form
21796 90559 78033 41578 92977 96222 52405 31283 25288 11556 26641 -12450 -32741 30838
21784 30838 46388 -13170 -3703 48791 11385 -689 -16400 -108612 -92287 -11025 43593 -13017
21772 -13017 -45950 -149214 -80879 -22206 -32387 -25676 35592 66086 36373 1634 32095 53884
21760 53884 74620 85058 51754 31425 12916 -23284 -75800 -77895 -30211 -11018 -48258 -73960
21748 -73960 -120113 -60732 4871 43189 96068 90090 58790 56308 55206 61384 34287 60140
21736 60140 26392 7461 -36194 -26135 40188 66216 28959 -74333 -112189 -90274 -63587
21725 -63587 5078 55202 87006 113440 110101 62835 61365 33173 41468 -20406 -73800 -58540
21713 -58540 -36701 -66375 -85740 -84368 -86496 -57532 -63923 -45433 -59145 -16226 13863 35028
21701C5028k1911j6867m830j0130L4699J1519l6854q20n878l9691l1581L6566
21689e0750N468m580M5245j6650p7111m551N1295j4060j0322n223o665L3244M7938
21676f722J913K6580p625l4415J4275j1841o0523J6553J01846L0646k4465l955
21664D2267J717n259L6549L4247l4306l8679J0463N7395m1194r2651K7187P1389
21652F9125N7869n9901k1962j3222m0826J4112K0553J4380l5018P730M6983Q712
21640F8535q2818J2882J1106J0065O4328q673k2004m1133l0116k4457L2316o7637
21628g7606q2279N1299P9322N2987J7335m5801j07166L806P0376R03l4746k0217
21616i1787P768L2388R9273p179k7247p7155J6371k471Q815P202O4319J3439k4535
$$ plain form
21701 35028 13117 -3750 -8580 -18710 15989 27508 -9346 -10166 -16044 -55735 -87316 -50750
21689 -50750 -45282 -49862 -4617 -21267 -98378 -102929 -51634 -65694 -76016 -81239 -87904 -54660 -6722
21676 -6722 -4809 21771 14146 -20269 -5994 -17835 -78358 -61805 40041 70687 46222 42267
21664 42267 43984 38725 75274 109521 75215 36536 46999 104394 63200 -29451 -2264 69125
21652 69125 126994 67093 45131 31909 -8917 5195 25748 40128 5110 12840 59823 68535
21640 68535 -14283 -1401 9705 19770 84098 75425 53421 12288 -17828 -42285 -9969 -77606
21628 -77606 -159885 -108586 -29264 23723 41058 -4743 -111909 -108103 -37727 -36824 -71570 -91787
21616 -91787 -84019 -51631 47642 40463 13216 -63939 -47568 -50039 -41224 -34022 30297 43736 19201
21603A9201L0091p1870n6388j0894K6794J0657n656L4831L4585J7390j6524k3295
21591a1078n9816J9631N7469R568n1486n73l2664l5367J1809L4149j4069K9499
21579d2928K9972J5273K4449Q565n0909k6358l3458P823l847J7482K5667M4956
21567A6687K8357l619j4152l3270m2384K6246J7191m8906L3035P9996j1187o6888
21555a8894j7611j5318p6625p711M1624M2952M7915N364K0399o1990j9796P4540
21543A4849R792J1509O6135O2232k5850j5029o379p809m4877O746J7162j1158
21531G7323K8484k8280k4020l1549M046o5588q2576K615M6239M937n283O540q612
21518g5724K7836O0665L3714L2587l745m1271k6938l7035l2356M4311O2322K7587
$$ plain form
21603 19201 49292 -22578 -78966 -89860 -63066 -52409 -58065 -23234 11351 28741 12217 -11078
21591 -11078 -70894 -51263 6206 15774 -35712 -36285 -68949 -104316 -92507 -58358 -72427 -42928
21579 -42928 -12956 2317 26766 35331 -15578 -41936 -75394 -67571 -71418 -53936 -28269 16687
21567 16687 45044 41425 27273 -5997 -48381 -22135 -4944 -53850 -20815 59181 47994 -18894
21555 -18894 -36505 -51823 -128448 -136159 -94535 -51583 -3668 1696 22095 -39895 -59691 14849
21543 14849 24641 36150 102285 164517 138667 123638 117259 109450 64573 71319 88481 77323
21531 77323 105807 77527 53507 21958 26004 -39584 -122160 -119545 -73306 -68369 -73652 -67112 -75724
21518 -75724 -47888 12777 46491 79078 75333 34062 7124 -29911 -62267 -17956 44366 71953
21506G1953o1915J5403L0385n044l8657o9885q925L522j4296l9279k3417O0947
21494g9208P1923l2612n5160p027M7814L1336M6403j6933m4425l5005K4094N4779
21482E979K8879J3688o5002K135K688l372m2123r306N434P276K6951K510k2381
21469d6644p862N4405L8645M0841n0746O850O0166m0291n8401r2021p243N9570
21457d2731j0276r867M6358j5549j2292M0803m377L1823Q661k0228J0032o2243
21445c9886J3576K2290j6438k1793l8203P081k434j7028m394K8799n623M816N6812
21432a2425M09J1048o2743o8159L8992L1260K0964J7436m4354p33q107M822N883
21419f5707L0836l7759k2501k3566P748N7951N0359M1022J0744m6339L2561K7149
$$ plain form
21506 71953 10038 25441 55826 50782 12125 -57760 -66685 -63163 -77459 -116738 -140155 -79208
21494 -79208 -7285 -39897 -95057 -102084 -54270 -22934 23469 6536 -37889 -72894 -48800 5979
21482 5979 34858 48546 -16456 -14321 -11633 -15005 -57128 -66434 -61000 -53724 -26773 -24263 -46644
21469 -46644 -54506 -101 38544 79385 28639 35489 95655 55364 -3037 -95058 -102301 -42731
21457 -42731 -53007 -62874 -16516 -32065 -44357 -3554 -7931 23892 32553 12325 22357 -39886
21445 -39886 -26310 -4020 -20458 -42251 -80454 -73373 -75807 -92835 -97229 -68430 -74053 -69237 -12425
21432 -12425 -12016 -968 -63711 -131870 -92878 -61618 -40654 -23218 -67572 -68305 -76412 -71590 -65707
21419 -65707 -34871 -72630 -95131 -118697 -110949 -52998 -2639 38383 49127 2788 35349 62498
21407F2498n9162l8848J142j6495N1292L4452j4596J3420k275r124J3935N6844
21395I3083K1420n9040n7666K3001J6407N5023j8802P536k8544j14775o4013K2585
21383a03785M1738M3592k2642n740l7653L1528O2358M6712l1348r967m2791j1448
21371c9446o530O1260k2503m4956J375K9988Q6774P23o0606J4379K3621l0768
21359A3311l5442j7654J0710O599j9332L6413Q797L843J9363O3749O267l1009
21347F5615K9821j9480o3647N582k4162l8006K3976J0908J6099j1286j1805m4664
21335f1049j661J4878J1701J3281M2019K1470M7322r7517o7405Q3823o121J4903
21323A5644J8843k1322j9429q8663n1800R913L7336N069N0072K0255q7593j0494
$$ plain form
21407 62498 3336 -35512 -34370 -50865 427 34879 20283 33703 31428 22304 36239 93083
21395 93083 114503 55463 -2203 20798 37205 92228 73426 80962 52418 -62357 -126370 -103785
21383 -103785 -62047 -18455 -41097 -46837 -84490 -52962 9396 56108 24760 14793 -27998 -39446
21371 -39446 -45976 15284 -7219 -52175 -50800 -20812 65962 66685 6079 20458 44079 13311
21359 13311 -22131 -39785 -29075 -22476 -41808 -5395 3402 7245 26608 90357 96624 65615
21347 65615 95436 75956 12309 17891 -6271 -44277 -20301 -9393 6706 -4580 -16385 -61049
21335 -61049 -62710 -47832 -36131 -22850 19169 40639 87961 -9556 -76961 6862 741 15644
21323 15644 34487 13165 -6264 -94927 -146727 -136814 -99478 -94409 -44337 -24082 -111675 -122169
21311a22169K6656k4283N4428Q1958K0877j5161K377L6421k8085k9173l1050O613
21299b0591k675j7756k3788M9334O8946k9105o4378p824K9836J7605l133L1214
21287B7685j2905m1896k2954j8190k3521J7144K0011l8113O8122L2510l6446J4228
21275a4325O3744N20l7815K1313o463m5334l8324q003J4607O0105p215m0030K671
21262c4549P4904N0824m0424r6684k2605J4847N2623N8017O1396l8958j15716
21251c6325J4294N8784J1378O397L716m7769k4711J9398K6818L1116J9048l7752
21239D4392q1631l4389J8396k7167J1479j9127J5826K8563p350r252j3305n0729
21227a24294J2805O8479K8875k460K7498n4109k8173k3618R746N7057l630L5553
$$ plain form
21311 -122169 -95513 -119796 -65368 16590 37467 22306 24683 61104 33019 3846 -27204 -20591
21299 -20591 -23266 -41022 -64810 -15476 53470 24365 -40013 -47837 -18001 -396 -3529 27685
21287 27685 14780 -27116 -50070 -68260 -91781 -74637 -54626 -92739 -24617 7893 -28553 -14325
21275 -14325 49419 49939 12124 33437 26974 -18360 -56684 -64687 -50080 10025 2810 -37220 -34549
21262 -34549 40355 91179 50755 -45929 -68534 -53687 -1064 56953 118349 79391 -36325
21251 -36325 -22031 36753 48131 54528 58244 10475 -14236 5162 31980 63096 82144 44392
21239 44392 -37239 -71628 -53232 -80399 -68920 -88047 -72221 -43658 -51008 -60260 -73565 -124294
21227 -124294 -111489 -43010 -14135 -16595 10903 -43206 -71379 -94997 -85251 -28194 -31824 3729
21215C729O191m4360j4413R202J1853L9681Q092l8598L9851j0016m1040p1206
21203a01034J8574Q3021K4102n1350J3866K413J7307Q061M7202k7797k3890m117
21191F358O2707N0899o007l5660o4012L6450N0352l7590o1808J9069j2644P682
21179A5796n130J3121K803N9959k6229q4528l6846l997m2143p228P4514L1966
21167g942K370J5525o734k9924l9017n9350K097L3706K5852P6718L6663n3423
21155c459m6960j0391L279j4139j7961P0034M0401O003N2443K3425m3699l8462
21143B0514J5787L392K8379j4079l1776M341o0401o20J3457M2160K6675n726j5237
21130B6866J62K8443O3832k8397k1336n3380j6158p417p871J1246L31r299j8094
$$ plain form
21215 3729 9920 -34440 -48853 -39651 -27798 11883 19975 -18623 21228 11212 -29828 -101034
21203 -101034 -82460 561 24663 -26687 -12821 -10408 6899 14960 62162 34365 10475 6358
21191 6358 69065 119964 113957 78297 14285 50735 101087 63497 1689 20758 8114 15796
21179 15796 10666 23787 26590 86549 60320 -24208 -61054 -65051 -107194 -114422 -39908 -7942
21167 -7942 -5572 9953 3219 -26705 -65722 -125072 -122975 -89269 -63417 13301 49964 -3459
21155 -3459 -50419 -60810 -57531 -71670 -89631 -19597 20804 26807 79250 102675 58976 20514
21143 20514 36301 39693 68072 53993 22217 26558 -33843 -34463 -21006 21154 47829 42103 26866
21130 26866 27028 55471 119303 90906 69570 16190 32 -7385 -15256 -4010 -3679 -12978 -31072
21117c1072j7902k001K1840L2516o675M236R512l1974k3700K1569m2849M2702
21105b3798K0156R1292N4613m0019j5897o0282l5179J1962m2371J3897L4879n042
21093D211l8007p1809L5105K6283L6131L1767j2707J4459J6260L6569n1191k6912
21081A59J6869k6371l3485J3171Q195n3898k9343L4098J7145R575J5615J478M4823
21068A8031o4819l343L3521j2326J9867K2917l1210L2251O0886m8518r6446l1641
21056a00830N0899M7782M8327N7754L2384K881n6182R2K192o3470m4312j4933
21044c7416K6632j6579O527Q788R279L6020J7414j0904k2962J5898k718j27780
21032i7801P555O3503K413l7513j4883K9728K9015l8890l6609k2664L7377O0857
$$ plain form
21117 -31072 -48974 -50975 -29135 3381 -3294 942 10454 -21520 -45220 -23651 -66500 -23798
21105 -23798 -3642 87650 142263 102244 86347 26065 -9114 2848 -39523 -25626 9253 4211
21093 4211 -33796 -105605 -70500 -44217 -8086 23681 10974 25433 41693 78262 27071 159
21081 159 17028 -9343 -42828 -29657 -21462 -75360 -104703 -70605 -53460 -43885 -28270 -26792 18031
21068 18031 -46788 -50131 -16610 -28936 -9069 13848 -17362 14889 75775 27257 -69189 -100830
21056 -100830 -49931 -2149 46178 103932 136316 139197 83015 83107 85299 21829 -22483 -37416
21044 -37416 -10784 -27363 -20836 -12048 -2769 33251 50665 39761 16799 32697 29979 -97801
21032 -97801 -90246 -26743 -24330 -61843 -76726 -46998 -17983 -56873 -93482 -116146 -78769 -17912
21020a7912O9015O8929L2746m1386p0891m335o042J9353J5563j8418j4880J7437
21008D9179N5646L6423k8893o2405k020j2386j8951j9700L941K9919L88j7690
20996A3451J7910L3341j5953o7078o2520N020L8044J5115j9243j2812J6318j0581
20984d8988K1439k328l4884J022Q9527m291j9365o3272Q910K2404n535k3534O634
20971e2261l3085k7905j6220l264O1723N8063P780m890N276j7402l6916N9994
20959H93O8072K3667j4940k1935M9556K838m4830k878k1924P871k2971K0818L8765
20946H3002k8273k4125n6997k9893L7891N4480K3036k4350k2311j2746l2656n7766
20934i0708M1053K2002l1766M4053o787M8511K368P97l090k888k6719l3074K6458
$$ plain form
21020 -17912 51103 120032 152778 111392 40501 36166 30124 49477 65040 46622 31742 49179
21008 49179 104825 141248 112355 49950 47930 35544 16593 -3107 834 30753 31141 13451
20996 13451 31361 64702 48749 -18329 -80849 -75829 -37785 -22670 -41913 -54725 -38407 -48988
20984 -48988 -27549 -29877 -64761 -63739 25788 21497 2132 -61140 -52230 -29826 -35361 -58895 -52261
20971 -52261 -85346 -113251 -129471 -132735 -71012 -12949 -5169 -10059 -4783 -22185 -59101 893
20959 893 68965 92632 77692 55757 105313 108151 63321 60443 38519 46390 23419 44237 83002
20946 83002 54729 30604 -26393 -56286 -18395 36085 59121 34771 12460 -286 -32942 -90708
20934 -90708 -49655 -27653 -59419 -15366 -22153 26358 28726 29523 26433 23545 -3174 -36248 -9790
20921i790R122K7777j584j8620k7383L0291l6220j7324k9537J6670l9239k2452
20909a18289M397N6977K6813M8569K6715n3564k9317J1701l3843k6370M3245Q196
20897c4770J4953L0469P191k7503M58N608m1040j1704L9661L3668N0555j8283
20885D9263j1778j1889q916j7916N406O2437Q5952l8134k9373p812m2480j2801
20873B1959Q518K1358L7701k4432m0441L2194j1172k6112O6949p43q3710m1680
20861c9611M9967n946k5180l3639M1482M1115k9903j2196l9176l8446M3147L4483
20849a3903j807N1193k4918j662O573K963O9556O9837o9644n5166j0372Q775r4159
20836f2734K4144k7191k9871N3756r787K5045j0490M2390M2058k5987q2968o1566
$$ plain form
20921 -9790 -668 27109 25525 6905 -20478 9813 -26407 -43731 -73268 -56598 -95837 -118289
20909 -118289 -113892 -56915 -30102 18467 45182 -8382 -37699 -25998 -59841 -86211 -42966 -34770
20897 -34770 -19817 10652 17843 -9660 -9202 -3594 -44634 -56338 -16677 16991 67546 49263
20885 49263 37485 25596 16680 -1236 4170 66607 152559 114425 85052 77240 34760 21959
20873 21959 30477 51835 89536 65104 24663 56857 45685 19573 86522 85779 2069 -39611
20861 -39611 10356 4410 -20770 -54409 -12927 28188 -1715 -13911 -53087 -91533 -48386 -13903
20849 -13903 -15710 35483 10565 8903 15476 18439 87995 157832 88188 33022 22650 31425 -62734
20836 -62734 -38590 -65781 -95652 -41896 -51683 -26638 -37128 5262 47320 21333 -61635 -123201
20824a23201K1510K6120O944k0864P199N0794o0100l657k292J7495N432N7287
20812a7333j2368J6317l1301o9000J7304K9514k9515l4843Q969M8947K5080q0704
20800a28933K0579L3226Q311K3089J6506l5063R30L7213J351j7530L0241M5825
20788C5745j6245M7185r120n4865j3451o444J188J7204N0432K8419j4413j0786
20776E4849m1472M1775o824j12376k4869K8844N6640P6256l3899n32J6482j5191
20764C9683o7501l4864P5811N1830j1036k5368k5039k7239M1331K2005p851J2339
20752D4101o48K1294J3118q0818p7333O2060M8972P1829J6639m7707R193K6376
20740A07076q2650l1076l4286q8138K8037Q1200K3856k8080J0964J5661M3008
$$ plain form
20824 -123201 -101691 -75571 -68627 -89491 -82292 -31498 -91598 -95255 -97547 -80052 -74620 -17333
20812 -17333 -29701 -13384 -44685 -113685 -96381 -66867 -96382 -131225 -122256 -73309 -48229 -128933
20800 -128933 -108354 -75128 -66817 -43728 -27222 -62285 -61355 -24142 -22791 -40321 -10080 35745
20788 35745 19500 66685 57565 2700 -10751 -17195 -16007 1197 51629 80048 65635 54849
20776 54849 13377 55152 48328 -64048 -88917 -60073 -3433 72823 38924 38392 54874 39683
20764 39683 -27818 -62682 13129 64959 53923 28555 3516 -23723 17608 39613 31762 44101
20752 44101 43453 64747 77865 -2953 -80286 -18226 30746 102575 119214 71507 80700 107076
20740 107076 24426 -6650 -40936 -129074 -101037 -19837 4019 -24061 -13097 2564 45572
20729D5572j7973r400K771k1280J7185J1062k8151J5196L4268q342l5593j3381
20717h066j0005L5252r55o798M319l6736L6420N0024J5546M217m3730n4880J2364
20704c028N6722k4831j2049n984j5983K0178J2141K1536J5666m960L4990l1478
20692F2920o7946m1154K2859N876P2303K7284o6867J8904p2157l0600R1450J9952
20680D2824K0484R350k478N9317M4377r3671m1100M2585O124o2068J1853j0227
20668B7370N465J5074l3698j9057o6610N7223P3317O204j4789k8531L3599L7705
20656I3272N374K8044n6937k4444N7747J0276k2996l2134q6145o6518L2144O2342
20644B5M8499M9005n4470l3910j4518L5364J6518j2212l009k6454j5105l9017
$$ plain form
20729 45572 27599 18199 20970 -310 16875 27937 -214 14982 49250 40908 5315 -8066
20717 -8066 -18071 17181 16226 9428 13747 -22989 13431 63455 79001 83218 39488 -15392 -3028
20704 -3028 53694 28863 16814 10830 -5153 15025 27166 48702 64368 59408 94398 62920
20692 62920 -5026 -46180 -23321 -17445 54858 82142 15275 34179 -37978 -68578 22872 42824
20680 42824 63308 72658 70180 129497 173874 80203 39103 81688 87812 25744 37597 27370
20668 27370 32835 47909 14211 -4846 -71456 -14233 59084 65288 50499 21968 55567 93272
20656 93272 98646 126690 69753 45309 103056 113332 90336 58202 -27943 -94461 -62317 25
20644 25 48524 97529 43059 9149 -5369 29995 46513 34301 31292 4838 -10267 -49284
20632d9284j4797N0055o550R046j1499N6209J219j0575K5945L0584j0213j9823
20620E0317j2754j517j4558L8470J5716j8233m8349m0934m5150K5662M1576L1944
20608B2190l2043Q585k3711K7202L1067l9525r055K7027N6383m5139M6398q025
20596F1354J8296o6169m6684J4527o6176J7811P5702K5624K789K7571m7149q0131
20584f2635n957M0619Q005n1365L9966L3383j2531m531K8630K6809j973j9270
20572A9150j7195l7115k6226m15K2738N6678m6321j6063k7740L6125J8570J2597
20560e217J0150L5829Q151K4318m5419k0490K8363K066O250m209K0852M7577j5832
20547I2389p2826K966j4726P2016Q856o9411j04494m2344Q4202R6333o7117k3705
$$ plain form
20632 -49284 -64081 -14026 -20576 -11530 -23029 33180 34399 23824 49769 80353 70140 50317
20620 50317 37563 36046 21488 59958 75674 57441 9092 -31842 -76992 -51330 -9754 22190
20608 22190 -9853 -1268 -24979 2223 33290 -6235 -15290 11737 68120 22981 69379 61354
20596 61354 79650 13481 -33203 -18676 -84852 -67041 8661 34285 37074 64645 17496 -62635
20584 -62635 -68592 -27973 -19968 -71333 -31367 2016 -10515 -15046 13584 40393 38420 19150
20572 19150 1955 -35160 -61386 -61801 -39063 17615 -28706 -44769 -72509 -36384 -17814 -5217
20560 -5217 4933 40762 48913 73231 27812 7322 35685 37751 44001 39792 60644 108221 92389
20547 92389 19563 22529 7803 79819 88675 19264 -85230 -127574 -43372 52961 -14156 -37861
20535c7861Q0720J1457k1366J8564K1145O159j6292j7238j1688j0150K3423R7701
20523A44574l9332o9939L059j8015K4189o280m6469j4440m732M3272K1296k9182
20511H001j9827n8332O4058O0941k624j0556j1086m1721O341N957M8433n3130
20499c545P800K622J6739l8952J5644L2924M1928J713j7795n0003m603j5315j9805
20486c0648J8866k2270m5471j8461k8638J4728N8014k043l361Q886j3247j5900
20474g9545K0913K6032Q2530J61387m0761l0997K1375L5553l4228o3529l2153
20463F6577m4089k80M9293K3940K074o9376Q298J2121k6693j6815J3617k0537
20451a870L057L7842o251K7500k3162M9268K4488m7096l142P6173K4926o6709
$$ plain form
20535 -37861 42859 54316 32950 51514 72659 78818 62526 45288 33600 23450 46873 144574
20523 144574 105242 35303 38362 20347 44536 38256 -8213 -22653 -27385 15887 37183 8001
20511 8001 -11826 -70158 -6100 54841 52217 41661 30575 -11146 -4805 1152 49585 -3545
20499 -3545 4255 6877 23616 -15336 308 33232 75160 76873 59078 9075 4472 -10843 -30648
20486 -30648 -11782 -34052 -79523 -97984 -126622 -111894 -53880 -55923 -59284 -50398 -63645 -79545
20474 -79545 -58632 -32600 49930 211317 170556 139559 160934 196487 162259 98730 66577
20463 66577 22488 22208 71501 95441 97515 28139 36437 48558 21865 5050 18667 -1870
20451 -1870 1187 39029 32778 60278 37116 86384 110872 63776 60634 136807 161733 95024
20439I5024m1486j715P0820j5992k6023k5599m2775l2628L3910Q0257P685m6934
20427E4544N811J1833M3187n4032J290l1514K0411j595k3244n600K1063J9348
20415F1502N66l0096O320J9370l3902J9785J2569J8693j3497J8370N7581K6506
20403A63767j6690k3029k5825l5164k2428Q1393j0760k2381N535J022J2958L2904
20391A41302O656M6314j07445l0726k0679N13k1851R328J512M7244J0435m2677
20379C9926m232K287j462l4580j8106K0949M8065L7529o65n8357J7360M9332M6311
20366A44357n9541n2821j5060K359k7973R320N2910J1378J4234J0858r0778l2078
20354c2835O459Q272n7577j3555M1763P4452N8529k4962j045k7136n9636J8293
$$ plain form
20439 95024 53538 51823 122643 106651 80628 55029 12254 -20374 13536 93793 101478 54544
20427 54544 60355 72188 115375 61343 62633 31119 51530 49935 26691 21091 42154 61502
20415 61502 62068 31972 38292 57662 23760 43545 56114 74807 61310 79680 137261 163767
20403 163767 147077 124048 98223 63059 40631 122024 111264 88883 94418 95440 108398 141302
20391 141302 147958 194272 86827 56101 35422 35935 14084 23412 24924 72168 82603 39926
20379 39926 35694 37981 36519 1939 -16167 4782 52847 90376 89711 31354 48714 98046 144357
20366 144357 84816 31995 16935 19294 -8679 641 53551 64929 79163 90021 -757 -32835
20354 -32835 -26376 -18104 -75681 -89236 -47473 26979 85508 60546 59501 32365 -27271 -8978
20342h978P3309M4936m1536o3335l580J3469j7844J0090L9784J843K4202k8078
20330D4282l7959j8904j107Q202K5696n446m4174N0192N948p413J0215l1083j2091
20317a3642o68j747M3605j4407L1866K8471j5418l1921L3268k7954o0822n677
20305c5046l4987J5061l791J794K2858N2178J4098r419m0760R517K5574P324M5546
20292F9947o406o1177m5414M8547l166J0577J3501n358M4740R9j2611K6704K497
20279H2480K5888n9447r456M5201o807P648L9371r73O77l0790R6999n1198q1724
20266E7869l5665j6463J9334J9578N525J2499N5442M2547m2625o2528l0615P488
20254C2386k7385L777J5808M6109J3213j7651k8934l7430O315K8173J8718K0022
$$ plain form
20342 -8978 64331 109267 67731 4396 816 14285 -3559 6531 46315 48158 72360 44282
20330 44282 6323 -12581 -13688 -5486 20210 14764 -29410 20782 26730 19317 29532 -1551 -13642
20317 -13642 -14310 -16057 27548 13141 45007 73478 58060 26139 59407 31453 -29369 -35046
20305 -35046 -70033 -54972 -58763 -56969 -34111 18067 32165 22746 -18014 -8497 17077 24401 69947
20292 69947 63541 2364 -43050 5497 2331 12908 26409 21051 65791 65890 53279 79983 82480
20279 82480 108368 48921 39465 84666 77859 85507 124878 123905 124582 93792 190791 139593 57869
20266 57869 22204 5741 25075 44653 50178 62677 118119 160666 118041 55513 24898 32386
20254 32386 5001 8778 24586 70695 83908 66257 37323 -107 6208 34381 53099 73121
20242G3121N0044j8178p719j302P81m6662n1300N3571J9386o144K4565K2426j2839
20229I9750M3634l7830j0573L2791l4231k9687j8784k9990N474K3991k6886j4831
20217B828k543N8149N8486n5407o1322L3426O5433q966o1290l054K9688j5520
20205C9908O733j5413k2389M144n2107j3267K5496N7896K7067j6209j7115L346
20193B8090M5936R994K0185K4373j2365j9410K3565k8807M3705n3640l5615k2482
20181B3529K0111L7456K221l4484J6327j8556J18001L3467k7158M468l8537o8749
20169F8096n2285K979j7122K2090Q1226P0488k1396m4103j1287k5907J4811J6671
20157A04261K0186j2000N255N8111M700n8215r4510j2492N248O3555m2570l664
$$ plain form
20242 73121 123165 104987 97268 95966 96747 50085 -1215 52356 71742 65598 90163 112589 99750
20229 99750 143384 105554 94981 127772 93541 63854 45070 15080 20554 44545 17659 2828
20217 2828 285 58434 116920 61513 191 33617 99050 90084 28794 25740 55428 39908
20205 39908 46641 31228 8839 12983 -39124 -52391 -26895 31001 58068 41859 24744 28090
20193 28090 74026 84020 104205 128578 116213 96803 120368 91561 135266 81626 46011 23529
20181 23529 43640 81096 83317 48833 65160 46604 164605 198072 170914 175382 136845 68096
20169 68096 15811 18790 1668 23758 104984 175472 154076 109973 98686 72779 87590 104261
20157 104261 124447 112447 117702 175813 180513 122298 27788 15296 20544 84099 41529 37865
20145C7865M596k5420O201J1928j6414J7208k2830q068N3493M7020k3605J0191
20133I2165L5030k6255p6311L941J9479j247L6854K3335L3051l202q3307o9308
20121a5775L7523J4005k8330M213L7999o158o0832j2745O626K1001k274j4206
20109a8953o63L9660J1426J1711k2082K8207J1699m590l9027L5552R1121k6872
20097A17189o0071K7582j0575m5286K6310K7466o65K977L3400j8056l1282K4226
20085I3215l0929k2245l6100L7017P267n3347p2674k3779K7042K7792O3542O7846
20073H4647j0422j5910j2899k3684j3809O9807K5132k1426L4400L4062j7231m3162
20061H9505M4699J5171j4727K6780j9995o4328n226k2236J9139Q5326l0699m0933
$$ plain form
20145 37865 42461 17041 23242 35170 18756 35964 13134 5066 58559 105579 81974 92165
20133 92165 127195 100940 24629 28570 48049 46802 83656 106991 140042 136840 53533 -15775
20121 -15775 21748 35753 7423 11636 49635 43477 -17355 -30100 -23474 -2473 -4747 -18953
20109 -18953 -19616 20044 31470 43181 21099 49306 61005 56415 17388 52940 144061 117189
20097 117189 57118 84700 74125 28839 55149 82615 81950 84927 118327 100271 68989 93215
20085 93215 62286 40041 3941 40958 48225 -5122 -77796 -101575 -74533 -46741 16801 84647
20073 84647 74225 58315 45416 21732 7923 77730 102862 81436 115836 149898 132667 89505
20061 89505 134204 149375 134648 161428 141433 77105 71879 49643 68782 154108 123409 82476
20049H2476J771J6798L4004l420K0703M4294L5085Q9304J05993O7089N5505J11964
20037F61566M9975n2240l9616L0205j6601o5929k7666n9704Q174M7762J2713m7195
20025E01444j13421K822M7314L7576p1016o1566m1019j9307p0413r0368l4232
20014H7814j8651N6716n268J9160m0432j1211l8799J1957P8611J8866L8595l1682
20002A65676m1874j235O3049J9463K3975J290M5567N1735M1180M8579K6687N9641
19990E03733N4632J17747J21444k907j50569r6552q7594L173R6869K0459m215
19979E76220Q719k1241K9569M0530m968j23231j73826j54962n7224K9946k6578
19968A22954j1401L665k4732J8305p850k2238K970k1701p195N1162M2813o8803
$$ plain form
20049 82476 84247 101045 135049 131629 152332 196626 231711 321015 427008 494097 549602 661566
20037 661566 711541 659301 619685 649890 633289 567360 539694 479990 488164 535926 548639 501444
20025 501444 388023 390845 438159 475735 404719 343153 302134 282827 212414 122046 87814
20014 87814 69163 125879 120611 139771 99339 88128 49329 61286 139897 158763 197358 165676
20002 165676 123802 122567 185616 205079 229054 230344 275911 327646 368826 417405 444092 503733
19990 503733 558365 676112 797556 794649 644080 547528 459934 463107 559976 580435 576220
19979 576220 584939 563698 593267 633797 628829 505598 331772 176810 119586 149532 122954
19968 122954 111553 115218 90486 108791 100941 78703 81673 59972 52777 103939 146752 77949
19956G7949k7011M9623k4404l6906m4394K919P6179o0618M4848P7102n452k3111
19944A06724j8250l6167m2900J1892N5197k0698j8299k4484K1020M8354J0859
19933I3248j8557L2405L3256J5796j7622K7011j7249k2753J555J7979J4199N421
19921A64689k7116j04267l4892O2395j9359k9220M3044N3339P268k4977J1393
19910A02297l4009l2281m5085j2079M9488M9355m758J6998L8231k9477m4466O7258
19898A21472Q8798r757l5258n8067l8123j0534p0828j7441R771M3702J0506M1351
19886G5592J1428Q0285K4913m8627k0697j1712k0498J8182n783l5852q5900n1116
19874f9785K0203L2485Q5273R2603P4451J640k8435k1717L611L878l4856n617
$$ plain form
19956 77949 50938 100561 76157 39251 -5143 -2224 73955 13337 58185 135287 129835 106724
19944 106724 88474 52307 9407 21299 76496 55798 37499 13015 34035 82389 93248
19933 93248 74691 107096 140352 156148 138526 165537 148288 125535 127090 145069 159268 164689
19921 164689 137573 33306 -1586 60809 41450 12230 55274 108613 115881 90904 102297
19910 102297 68288 36007 -9078 -21157 28331 77686 72928 89926 128157 98680 54214 121472
19898 121472 210270 200513 165255 107188 69065 58531 -12297 -29738 -19967 23735 34241 75592
19886 75592 87020 167305 192218 143591 122894 111182 90684 108866 103083 67231 -18669 -69785
19874 -69785 -49582 -17097 68176 160779 235230 236870 208435 186718 190329 194207 159351 153734
19862A53734j4105K5611J431J1329m4879l4768m6968k4227K8413O4071P179N3742
19850A80563m3203k6691j899K2364j2598j1783n6195p4164r209N4642N0832O6140
19838A38799J480o2753k1746m0232J7869Q5703Q5645L906J3195j5388j26827r7941
19826a8290P5880Q9867l090n5965L615l1729J2571P182J1412N6681O1441N568
19814B15143N3471j3789j11361j5209K3466j5190m4658L6343j132M544N8531q0598
19802A09561p5354p07J1422P0854N0621m1332l4499L2968K9629J2294k4608j8092
19790A22757L2314O3974K3118j1416p8373p8731j5626K0226M0292P7460M0219
19779B36214K0198R374q280l6036J0324O6503L8517M0175M0508J7308O5411N4894
$$ plain form
19862 153734 139629 165240 166671 178000 133121 98353 51385 27158 55571 119642 126821 180563
19850 180563 137360 110669 108770 131134 118536 106753 50558 -23606 -32815 21827 72659 138799
19838 138799 140279 77526 55780 15548 33417 119120 204765 208671 221866 206478 79651 -18290
19826 -18290 57590 147457 144367 88402 92017 60288 72859 80041 91453 148134 209575 215143
19814 215143 268614 254825 143464 128255 151721 136531 91873 128216 127084 131628 190159 109561
19802 109561 34207 33500 44922 115776 166397 125065 90566 123534 153163 165457 140849 122757
19790 122757 155071 219045 242163 230747 152374 73643 58017 78243 118535 195995 236214
19779 236214 256412 265786 257506 221470 231794 298297 336814 376989 417497 434805 500216 555110
19767E55110L5175R9675L6954l9052q550j06307j45944n9722M152L4206r40K5432
19755D30189R061Q976J5771j8836M5205J04123O9288j0302j16681l8408M351L8930
19743E41667M4785n84m0150p5918l9291l0083P607J8613J0004o0233L1644L0086
19731D38147L7023l292m7753j9689l0498m1842K5557J5006K6677J7202o958Q0664
19719D90244R4227L8779j9717q6219o3962J4762m507K6945N9558J50863J30894
19708H31867M1586K8149o1625l3639l4275j26717j95515j27860j2666O836j2707
19697C03434n9529q5755J3378R0357P3787qj7814r055l8199k2920j4698N9301
19685B92279J0711l2503j8040L1104L8304J1457k5589p1831p4924P096k0388j9047
$$ plain form
19767 555110 590285 689960 726914 687862 679312 573005 427061 367339 371491 405697 404757 430189
19755 430189 439250 448226 463997 445161 490366 594489 663777 653475 536794 498386 502737 541667
19743 541667 586452 585868 545718 469800 430509 400426 408033 426646 436650 376417 408061 438147
19731 438147 475170 471878 424125 404436 373938 332096 357653 372659 399336 416538 409580 490244
19719 490244 584471 623250 603533 517314 453352 468114 463607 490552 550110 700973 831867
19708 831867 873453 901602 839977 806338 772063 645346 449831 321971 309305 316141 303434
19697 303434 243905 158150 171528 261885 335672 335664 317850 308795 270596 247676 232978 292279
19685 292279 302990 270487 252447 283551 321855 333312 307723 235892 160968 168064 147676 128629
19673A28629j0928J9476N8097M527K2107M5889R400o1028j8877J0805k4915L8217
19661B21399N0753r634K8828l1290n628l3444J2873K1093l3889l5218j4630K8688
19649A99901k2298R124M616j2158m664l0982K3295J19k1667N5459N5340M0712
19637B96797Q0113n596k8754O3512Q2276n658p5835J9427k9303r999J2228L4937
19625D34145j7555l7528L0334M3811m0160p7056n734N0556j8047M19L8331k9732
19613C71784m5387L334M3767k4056l6535J2474J1941J6313j3895o247K2669K2510
19601C78672l6440m5643Q921J6824M1251M6084L3970n7426n3467K4682K1066j3844
19589C64650N3050L8790R72l2102M990N9778N1028O5984L3605L9602M693k173
$$ plain form
19673 128629 117701 137177 195274 199801 221908 267797 277197 216169 197292 208097 183182 221399
19661 221399 272152 262518 291346 260056 254428 220984 233857 254950 221061 185843 171213 199901
19649 199901 177603 186727 191343 179185 174521 143539 166834 166953 145286 200745 256085 296797
19637 296797 376910 371314 342560 406072 488348 482690 406855 426282 396979 386980 399208 434145
19625 434145 416590 379062 409396 453207 413047 335991 330257 380813 362766 363185 401516 371784
19613 371784 326397 329731 373498 349442 312907 325381 337322 353635 339740 333493 356162 378672
19601 378672 342232 296589 305510 322334 363585 409669 443639 386213 332746 357428 378494 364650
19589 364650 417700 456490 457462 425360 430350 490128 541156 607140 640745 680347 685040 682867
19577F82867N5694j6197j2836J46146J00289R2006J12646J17220k1521n3923o4107
19566A138284n0839L0029o9665j55880p6284l610K8233j8335j5437K7445P175
19555H41116L8104K6272K5578M3808O1925j435M2012J38561J68243J72061K13974
19544A770219K93952L42106L40516M04125M20377M48171N62787M52478P7864o9729
19534E042866j5720j80258m94440m90003k59806l7828L4153J4120M1653J12010
19524C766747J71295K89531N00868O20697O95447P91067J014561J328857J929653
19515A1108723K846423M124014N572722O937469Q147309Q529741Q406803Q609669
19507F4282873R869992J2150525J2492326N763072j595860n555244j2214455j4591364
$$ plain form
19577 682867 738561 722364 709528 855674 955963 1047969 1160615 1277835 1256314 1202391 1138284
19566 1138284 1087445 1117474 1047809 891929 815645 812035 840268 821933 806496 833941 841116
19555 841116 879220 905492 931070 974878 1036803 1035368 1077380 1215941 1384184 1556245 1770219
19544 1770219 2064171 2406277 2746793 3150918 3571295 4019466 4582253 5034731 5112595 5042866
19534 5042866 5027146 4846888 4352448 3862445 3602639 3564811 3598964 3613084 3654737 3766747
19524 3766747 3938042 4227573 4728441 5349138 6044585 6835652 7850213 9179070 11108723
19515 11108723 13955146 18079160 23651882 30589351 38736660 47266401 55673204 64282873
19507 64282873 74152865 86303390 98795716 104558788 102962928 97407684 85193229 70601865
19499G0601865r578089l970234L14276M406403Q525737Q392429O8180r105110
19491F9655457j0128472n634621j192296K531577L873226k47087o059343j0946221
19483D1852220j1935273q264428m584344k620473j466317p65885l97740j77788
19475A1639972p3389J67981P29401J222143J927390K775749L720509M865080O370971
19466C3345807P896033Q943836R332842Q915847R030417J0692242J2955199J0805746
19458A11917969K204089n046494j2169931j7213973j2373027l739864K297944
19451F5876713N282057O623778P375193Q787087J1413004J1948690L873078o441905
19443A14737695j2360485k0868346k4719033j8744443j1265619o726970m256398
$$ plain form
19499 70601865 61023776 57053542 57367818 61774221 70299958 78692387 78760567 69655457
19491 69655457 59526985 53892364 52700068 55231645 59104871 58857784 52798441 41852220
19483 41852220 29916947 21652519 17068175 14447702 12981385 12215500 11817760 11639972
19475 11639972 11566583 11734564 12463965 13686108 15613498 18389247 22109756 26974836 33345807
19466 33345807 41241840 50185676 59518518 68434365 77464782 88157024 101112223 111917969
19458 111917969 114122058 109075564 96905633 79691660 67318633 63578769 65876713
19451 65876713 71158770 77782548 85157741 93944828 105357832 117306522 121179600 114737695
19443 114737695 102377210 81508864 56789831 38045388 26779769 20052799 15796401
19436A5796401k785796j852648j265605r94533p37908o51379m68805l85503m03885
19427F250339m70146m81423l98456l36397j80981o4793N6043K07149K03688J94494
19417D979517Q1375J13778J92102K43703L23065M76691M95589M3633n65067j011060
19407E373326j259959r72753o57604m57731k99013j64014j65097n0215o8717p3254
19397A204969j7328K5336N8852K1080L1910J750K0139M8580O4749P1132J00066
19386A631235J75160Q7222n8965r0516j38607j37222k04302k20407j10503p6198
19376H56897o7579k1938j6647K3555L8441n1968J4064N3828P331M683k019N221
19364H43869o9497j09676j11947m2836o119K21M9735L8366L6961l977n2212m9529
$$ plain form
19436 15796401 13010605 11157957 9892352 8897819 8159911 7508532 7039727 6654224 6250339
19427 6250339 5780193 5298770 4900314 4563917 4382936 4318143 4374186 4581335 4785023 4979517
19417 4979517 5060892 5174670 5366772 5610475 5933540 6410231 6905820 6949453 6384386 5373326
19407 5373326 4113367 3140614 2483010 2025279 1726266 1562252 1397155 1346940 1278223 1204969
19397 1204969 1187641 1212977 1271829 1292909 1324819 1326569 1346708 1395288 1460037 1531169 1631235
19386 1631235 1806395 1893617 1834652 1744136 1605529 1468307 1264005 1043598 933095 856897
19376 856897 789318 767380 750733 774288 812729 760761 774825 828653 835984 840667 838648 843869
19364 843869 774372 664696 552749 509913 503794 504015 553750 592116 629077 625100 572888 523359
19352E23359l9255N0798l404l5628j6942q8135J1895k2259p072j5077K7056P0976
19340D56312M1678k6150n577M6076L6258n3218L4824K8897q2845m6617j4742K1237
19328D36133Q7659J6245M317O597N162M6977k1812r0166l7684j885P447M2258
19316E01248K211Q7156Q6634Q418P078M9332j942n8853j7409L0665K4167O1352
19304G80057K3019m1871J1273p213l4503o1449p3197J1252M9314O415k2863Q5887
19292G26121L0331J2430J19208j5068q6391J3059L9932R7023J04644P5461J16697
19281A233447J22017J55875K60080L16291K58277K92821M40495M98964K40890
19272C819157n1583l35190m91155k66832p5474r929J3562R495n2705P3786J28314
$$ plain form
19352 523359 484104 534902 531498 495870 478928 390793 402688 380429 373357 358280 385336 456312
19340 456312 497990 471840 466263 512339 548597 495379 530203 559100 476255 429638 414896 436133
19328 436133 523792 540037 544354 550951 556113 603090 581278 491112 453428 451543 458990 501248
19316 501248 503459 590615 677249 685667 692745 742077 740135 681282 663873 694538 718705 780057
19304 780057 803076 761205 772478 765265 730762 669313 596116 607368 656682 663097 640234 726121
19292 726121 756452 768882 888090 873022 786631 799690 839622 936645 1041289 1116750 1233447
19281 1233447 1355464 1511339 1771419 2087710 2345987 2638808 3079303 3578267 3819157
19272 3819157 3767574 3432384 2941229 2674397 2598923 2588994 2602556 2612051 2559346 2633132 2761446
19261B761446J58460J97596K08210L02964M02876M66343N23210P63741J021691
19252F806537J390509K144186L348160M728716O247181P351587P814801P587758
19244D7419435P491829Q487192J1508713J3541698N063259m274490o768376j5504459
19236F6964801j8173256r864363k020534K684491N363857O461027O458649O782493
19228F4657165Q308130J1556119J2301575J569511q023288j3367390k1401984
19221E5599838j9414824j1416514o037521l343525j895904r70446m10265Q4205
19213A2195044L36099O10540J079092J804499K713576L961184N174919N760017
19205C3634970N501281N087239N712055Q637598J3438931J3419457M999059m935311
$$ plain form
19261 2761446 2919906 3117502 3325712 3628676 4031552 4497895 5021105 5784846 6806537
19252 6806537 8197046 10341232 13689392 18418108 24665289 32016876 39831677 47419435
19244 47419435 54911264 63398456 74907169 88448867 93512126 89237636 82469260 66964801
19236 66964801 48791545 38927182 36906648 39591139 44954996 51416023 57874672 64657165
19228 64657165 72965295 84521414 96822989 98392500 90369212 77001822 55599838
19221 55599838 36185014 24768500 18730979 15387454 13491550 12521104 12110839 12195044
19213 12195044 12531143 13141683 14220775 16025274 18738850 22700034 27874953 33634970
19205 33634970 39136251 44223490 49935545 58573143 72012074 85431531 90430590 85495279
19197H5495279j0901935p737330j227077N165973J2375416J4842656J095740j3877364
19189H5231358j0031594L16880N722948P698092R394514J2995826J8582914J4734164
19181A44645102l907923j2474815j9302205l2200931k8576777j6691130r310458
19174B2180863n471387l365911k293453j559319r44548n91222n05902n23896m26111
19165F499114m26767l57361k88643k82041k13947J6016K39555L72879M66476M33736
19155F459017N71938M27958O02009N28283l88742j079737o60187o44270j178576
19146D637693j253987p70885m39573l15928k89379j49207r5500r5923m6287n9542
19136A121482q4116l8193j3959P477o4504l2977r000r097J6656R2445J09523P7189
$$ plain form
19197 85495279 74593344 66856014 65628937 70794910 83170326 98012982 99108722 85231358
19189 85231358 75199764 75516644 81239592 88937684 98332198 111328024 129910938 144645102
19181 144645102 140737179 128262364 108960159 76759228 48182451 31491321 22180863
19174 22180863 16709476 13343565 11050112 9490793 8546245 7955023 7449121 6925225 6499114
19165 6499114 6072347 5714986 5426343 5144302 4930355 4946371 5185926 5558805 6025281 6459017
19155 6459017 7030955 7458913 8060922 8589205 8200463 7120726 6460539 5816269 4637693
19146 4637693 3383706 2612821 2173248 1857320 1567941 1418734 1323234 1227311 1181024 1121482
19136 1121482 1037366 999173 985214 992691 928187 895210 886210 877113 893769 986214 1095737 1172926
19124A172926Q5240M5055P9681R4525R7501J96335J42942j16494k90924j53222
19114A353565M4588N6451r3921k07552j87420j33161n7525k2841M8575R4791l1036
19103H64514n6742n8957j2935m9966r4260k1705J9796j9035J2280J6449j9250
19092E80189k2383l4322N8374K7020j0827k734L385J0534O6577O0682p0637l0986
19080F34872K1129O5768K2431l5095l3169j7050l1014q4455P2478K0885N6796
19069F93576K0481O0928P2362M6101M335M5119P7061O1776j6447m9773j20294
19058H95225o2663q3601l4787O8640Q1738Q4551J32326L5992J21942J92474P1964
19047A503801L0495P1449J03247J39443M8403J9707J58140K56512L34816M39620
$$ plain form
19124 1172926 1258166 1303221 1382902 1477427 1574928 1771263 1914205 1797711 1506787 1353565
19114 1353565 1398153 1454604 1360683 1153131 965711 832550 775025 752184 800759 895550 864514
19103 864514 807772 748815 735880 685914 591654 569949 589745 570710 582990 599439 580189
19092 580189 557806 523484 581858 608878 598051 595317 598702 609236 675813 736495 665858 634872
19080 634872 656001 721769 744200 709105 675936 658886 627872 543417 615895 636780 693576
19069 693576 714057 774985 847347 893448 897783 942902 1019963 1081739 1065292 1015519 895225
19058 895225 832562 748961 714174 782814 864552 949103 1081429 1117421 1239363 1431837 1503801
19047 1503801 1534296 1605745 1708992 1848435 1896838 1916545 2074685 2331197 2666013 3105633
19037C105633N30822Q39580J239853J615857J791817J940476K008132K162681
19029A5234851K626647L692756M651844K728289j328117p21655K368473J323180
19021C0576268k052492j662950O63520K725566M805286N978989J127385n832358
19013C6329214m385214M30531n34132p327069q365714m923162k479196j320177
19005G425081p83403m32650k18512n9032l7330K6987K2978Q2827K06990K89494
18995F523430L18068N77066R59931J323839J688182K335173L501467N019070O640171
18986B8886397P852871Q530543Q711718R278705J1315154J4644623J7800246J1243726
18978A18263983n000366n407539N797289K315657j3390117j4366408m785254L604088
$$ plain form
19037 3105633 3636455 4476035 5715888 7331745 9123562 11064038 13072170 15234851
19029 15234851 17861498 21554254 26206098 28934387 27606270 26884615 29253088 30576268
19021 30576268 28523776 26860826 27524346 30249912 35055198 41034187 42161572 36329214
19013 36329214 31944000 32374531 31840399 24513330 16147616 11224454 8745258 7425081
19005 7425081 6641678 6209028 5990516 5931484 5894154 5921141 5944119 6026946 6233936 6523430
18995 6523430 6841498 7418564 8378495 9702334 11390516 13725689 17227156 22246226 28886397
18986 28886397 36739268 45269811 53981529 63260234 74575388 89220011 107020257 118263983
18978 118263983 113263617 107856078 113653367 115969024 102578907 88212499 83427245 87031333
18970H7031333J0232012J3156323J849239j3157626r515171R89885j947673j6179737
18962G2458585j7727859q025190L16408N531411Q277185Q615949P160895O087874
18954H2695258Q317206J4994859K3885357J6562952k1475837l9548335k5298464
18947F0132996j0366637j415327M619600R067475J2577170J5379810J7196229
18940A07191316J8302903J9690134K1869361J6742678Q990187J4575987L458955
18933B10821521l5011497n4255389m0276168k0022126p989665j915614J056128
18926E2407190K524027L888950O161994R056022P980009l066937r043785k448069
18918F7459401J026113q609814j4639090r172703k871856J244634M479358P140756
$$ plain form
18970 87031333 97263345 110419668 112268907 99111281 89596110 90585995 88638322 72458585
18962 72458585 54730726 46705536 47021944 52553355 60830540 69446489 76607384 82695258
18954 82695258 91012464 106007323 129892680 146455632 124979795 85431460 60132996
18947 60132996 49766359 48351032 52970632 62038107 74615277 89995087 107191316
18940 107191316 125494219 145184353 167053714 183796392 192786579 207362566 210821521
18933 210821521 175810024 121554635 81278467 61256341 53266676 51351062 52407190
18926 52407190 54931217 58820167 64982161 74038183 82018192 78951255 69907470 67459401
18918 67459401 68485514 59875700 45236610 36063907 33192051 34436685 38916043 46056799
18910D6056799Q349262P914222O368836O008542Q861969J5357921K1222288R952584
18902A30092423k1191899l2994691j9506880o321021N54360L211969L638618L256619
18894F0739498M501577Q714840J5569526J5903767r826926l1138556k3378974
18887D1084752j1923739p306857n622265l911125k419152j614171r63677o54477
18879F669289n16638n06309m95837l12692j92739o3676r3548j20605l0532J46375
18869D483088L72444P08802Q61402J098542J746772K492382K948597K649626K055159
18860A9416814J658881K076611L711966O333369N735524m139574j0654871p045083
18852A7093637k696901l45704O51799Q29087O10918P76057J882664L744723M320011
$$ plain form
18910 46056799 54406061 62320283 68689119 74697661 83559630 98917551 120139839 130092423
18902 130092423 108900524 75905833 56398953 50077932 50632292 53844261 57482879 60739498
18894 60739498 65241075 73955915 89525441 105429208 95602282 64463726 41084752
18887 41084752 29161013 21854156 16231891 12320766 9901614 8287443 7323766 6669289
18879 6669289 6152651 5646342 5150505 4837813 4645074 4581398 4487850 4367245 4336713 4483088
18869 4483088 4855532 5564334 6425736 7524278 9271050 11763432 14712029 17361655 19416814
18860 19416814 21075695 23152306 26864272 33197641 38933165 34793591 24138720 17093637
18852 17093637 14396736 14051032 14702831 15531918 16142836 16918893 18801557 22546280 26866291
18843B6866291k085634q446422o704349l441520j794746j029552o41708l22618
18835B399742k01023k31043j36021j04731j34052q5933j35646r4486J830l9444
18825A239193j71014r1920J9774K0271j8817K3705k6001l8755j5961l3148o2850
18814H44477j68193r1106o7015j46405n9900L1538k1182p2495L8703r342k7355
18803B51725J8059j2285J8577n0908o23l5131p1502N9601O7023K6891L6057j854
18791C05630j948j9327j1060J4527N4734L5285j9838J8421m5206o9567j7296l8881
18779B05474j7685K9146r363j4446K1579J21617Q7839J2427M0227o990O449j1909
18767D64365j8859P6515J45017n2055k44805j91151o2360m107Q535M0336j5217
$$ plain form
18843 26866291 24780657 16334235 9629886 6188366 4393620 3364068 2722360 2399742
18835 2399742 2198719 1967676 1831655 1726924 1592872 1506939 1371293 1276807 1278637 1239193
18825 1239193 1068179 976259 996033 1016304 997487 1021192 995191 956436 940475 907327 844477
18814 844477 676284 585178 518163 371758 311858 343396 322214 249719 288422 279080 251725
18803 251725 269784 257499 276076 225168 224545 189414 117912 177513 244536 271427 307484 305630
18791 305630 303682 284355 273295 287822 342556 377841 358003 376424 331218 261651 244355 205474
18779 205474 187789 216935 207572 193126 214705 336322 424161 436588 476815 469825 476274 464365
18767 464365 445506 522021 667038 614983 370178 179027 116667 112560 121095 161431 146214
18756A46214n0711j5651M2026k3239k0770N0581J2683n0501L3469M9095j5499
18745A57697q6245l4643q137J6146J8998N3768k0946k3054P976j1983l2193K6272
18733F3656N1986n815p024n4481l0352J0587k8995j670N1787N0777j4620r3848
18721h012k1267N1474K9916k2060R2522m8932m6207P787P9309J5653Q099Q4487
18709B22769P5956O7417J01535Q4307P7746J06527N5192j7122o6328l8027j25192
18698E44780j11377L4879P0317J7938J799L3793K9974l0558J28987J19131k8027
18687H11636j89207j87819j13549j07975p1439n696K4095L887L874k8355j2464
18676A26988o33K4916p617p1527o1244K0074N6180O5676L9505J8831j1742N8995
$$ plain form
18756 146214 95503 79852 121878 98639 77869 128450 141133 90632 124101 173196 157697
18745 157697 71452 36809 28672 44818 63816 117584 96638 73584 81560 69577 37384 63656
18733 63656 115642 109827 102803 48322 17970 28557 -438 -2108 49679 100456 85836 -8012
18721 -8012 -29279 22195 52111 30051 122573 73641 27434 35221 114530 130183 138282 222769
18709 222769 298725 366142 467677 551984 629730 736257 791449 774327 707999 669972 544780
18698 544780 433403 468282 538599 556537 558336 592129 622103 591545 720532 839663 811636
18687 811636 622429 434610 321061 213086 141647 135951 160046 163933 167807 139452 126988
18676 126988 126355 151271 143654 72127 10883 30957 87137 152813 192318 211149 199407 258402
18664B58402M3632j8855N5392J04597J2595o1785n7674m1418L9758J9952L8477
18653C93073k3193o2421k4180j1301O1587L7183r316Q6645O2256n4727p8778r4141
18641B82687j07419r7076Q827K3500l2318o2544J6325j6756J038R018K4023Q4806
18629A34111J1301p9707l8992J8146M147M1137K35m3160l3385m1132k9038n944
18617f2281J9525R1678M8855m013r657m0141j6796m2093m9169Q542L7660K7723
18605I833j2129J9507M3636l2612o9241K7969l326l215J1764j578J1021m3883
18593d2254K4783L6268l9783k6267M9118L3501k5514j0056l1210m8896Q9238L0599
18581C9527l5360K0402M3044k9286J0173n8376l0154K3227j0873j0989J6637N7987
$$ plain form
18664 258402 302034 283179 338571 443168 455763 393978 336304 294886 334644 354596 393073
18653 393073 369880 307459 283279 271978 333565 370748 361432 448077 510333 455606 376828 282687
18641 282687 175268 78192 87019 110519 78201 15657 31982 15226 16264 25282 49305 134111
18629 134111 145412 65705 26713 44859 49006 90143 90378 47218 13833 -27299 -56337 -62281
18617 -62281 -42756 48922 97777 93764 84107 43966 27170 -14923 -64092 -55550 -17890 9833
18605 9833 -2296 17211 60847 28235 -41006 -13037 -16363 -19578 -7814 -9392 1629 -42254
18593 -42254 -17471 18797 -20986 -47253 1865 35366 9852 -204 -31414 -80310 8928 39527
18581 39527 4167 24569 67613 38327 48500 -9876 -40030 -16803 -27676 -38665 -22028 35959
18569C5959O2074j7569k7088Q994L1400o287o4142l0511J5765L9868K3977j2479
18557E9961q7893q3522J6672N0164J1151K0716o033O172P4798l8081m7237o9506
18545i2638J5487L5658J4305m6930O4734M7442j5019m8226j546Q2010o6929n4662
18533f6314O2502N217M7233K7741l9679j9190R688J3474O7059L1007n3070l2985
18521E2683m7684n7657l5058N4513O1091J8972l4130m299K8618j7923m6214k7217
18509e4305O126M8699L8861K6966K9338J4037J5408k0884k1417N3549N9367k993
18497A92752J6195N5922J01646L2227L8372j252m9501k5943L7416J2061m5485
18486C64410k1495m548l3207R325K7430o6434r7480o1158p1575q134j1558l3970
$$ plain form
18569 35959 98033 80464 53376 62370 93770 87483 23341 -7170 8595 48463 72440 59961
18557 59961 -27932 -111454 -94782 -44618 -33467 -12751 -18784 -12612 62186 24105 -23132 -92638
18545 -92638 -77151 -41493 -27188 -74118 -9384 38058 23039 -25187 -26733 55277 -11652 -66314
18533 -66314 -3812 1405 48638 76379 36700 17510 27198 40672 107731 138738 85668 52683
18521 52683 4999 -52658 -87716 -33203 27888 46860 12730 8431 37049 19126 -27088 -54305
18509 -54305 -48179 520 39381 66347 95685 109722 125130 104246 82829 136378 195745 192752
18497 192752 208947 264869 366515 398742 437114 435862 386361 360418 397834 409895 364410
18486 364410 342915 338367 305160 314485 341915 275481 178001 116843 45268 37134 25576 -8394
18474h394K4573L5311l845O423p8903r3860L0590L9313k375M735L9353K2104J4748
18461B9773k0868k963L0383J2886L4154m5189m2047K2419R6110R3046Q7386J2158
18449C07248M4688M6016P6430J69079J12167J2013n5929j8500Q931M1890N8368
18438H02401k1860p6454p5805m676Q6933N3573M8438l8225j61632j45750p9332
18427C87611p1318j8166J0263Q126n3930O5480N5548m2706j23706j28328p6747
18416A2127k3871P117N252L5529m177J6706K4926K9377j8820l165N9417M7028
18404A87446p933k0073K3340J1959L7432P027L9044P4108j4698p1487L3259R4835
18392C94259L3756L6627M0146k0930m2275M4551O4228Q9806M573k8034r3218L5538
$$ plain form
18474 -8394 16179 51490 47645 54068 -24835 -118695 -88105 -48792 -51167 -46432 -7079 15025 29773
18461 29773 8905 5942 36325 49211 83365 38176 -3871 18548 114658 207704 295090 307248
18449 307248 351936 397952 474382 643461 755628 767641 711712 693212 702143 744033 802401
18438 802401 780541 704087 628282 623606 710539 764112 812550 774325 612693 466943 387611
18427 387611 316293 298127 308390 316516 262586 328066 383614 340908 217202 88874 12127
18416 12127 -11744 -4627 625 36154 31977 48683 73609 102986 84166 81001 140418 187446
18404 187446 179513 159440 182780 194739 232171 239198 278242 352350 337652 266165 299424 394259
18392 394259 428015 464642 504788 483858 441583 486134 550362 640168 644741 616707 523489 559027
18380E59027J02958K9055p7977p5179L2557R2193m538q0301j27405Q961Q497N592
18368D73440j12968j24864r6080q1568L9575P3952j6509j02173l7759K8738M1416
18357H5200m2169j4666r2463J8406Q1754L304k8293m9722m6983J6417J685m429
18345g1959M4746M3299j0551O913N0137J3728k729N5294K3433j0703o050Q2752
18333B18310P2847M8284j33746p9964Q406J097L3437N553J6648L6802K0109N010
18321B52793j17934m8981m550k1793m6005K8685o006m5745L1241n010l5809k4839
18309d3953j8119K8613J4941k9302n7990j9265K013L1105j3795r231L9159K5180
18297e0644O1210k7078k8870k5830M0991N5734O274K1313n5474P578L8160j439
$$ plain form
18380 559027 661985 691040 613063 537884 570441 662634 658096 577795 450390 459351 467848 473440
18368 473440 360472 235608 139528 57960 97535 171487 154978 52805 15046 43784 85200
18357 85200 43031 28365 -64098 -45692 36062 39366 11073 -38649 -85632 -69215 -67530 -71959
18345 -71959 -27213 16086 5535 12448 62585 76313 73584 128878 152311 141608 135558 218310
18333 218310 291157 339441 205695 125731 134137 135234 168671 174224 190872 227674 247783 252793
18321 252793 134859 85878 81328 59535 13530 42215 36209 -9536 21705 16695 -19114 -43953
18309 -43953 -62072 -33459 -18518 -47820 -105810 -125075 -123062 -91957 -105752 -114983 -75824 -50644
18297 -50644 10566 -16512 -45382 -71212 -30221 25513 31787 53100 -2374 5204 43364 41925
18285D1925q726J1876j6457l6909j0082J324K572J5830j1931K7894j2308q338
18273c330o4788k2174P360J171o0643J6554R353K3132N5367L7269M7191J8078
18261F4540n7496m2880L1738M9920j9877K3783J5411m9570m5058q490j0589M7771
18249g97k5849q137k016m293N0817N479j4193N3523k0176j0930L911J00165J11943
18236B39447M1927L5278m9981q7615j05237k908k3309p837k7612l1977O063q120
18224b1881K6783L2304J5504J0566k0819Q371j5798M4238m0670k5087j0910k3962
18212b1361M471J6225k3274p980r427m3015k7740R133M3756M952L0482j843m648
18199c0269L215K6852Q226L5877m4205o7943j6517O8155L3452j1341m9318m6540
$$ plain form
18285 41925 33199 45075 28618 -8291 -18373 -17049 -14477 1353 -10578 17316 5008 -3330
18273 -3330 -68118 -90292 -82932 -81761 -142404 -125850 -116497 -93365 -37998 -729 46462 64540
18261 64540 7044 -35836 -4098 45822 25945 49728 65139 15569 -29489 -37979 -48568 -797
18249 -797 -26646 -34783 -36799 -41092 9725 15204 1011 54534 34358 23428 27339 127504 239447
18236 239447 281374 316652 266671 179056 73819 70911 47602 39765 12153 -19824 -13761 -21881
18224 -21881 4902 37206 52710 63276 42457 50828 35030 79268 38598 13511 2601 -21361
18212 -21361 -16890 -665 -23939 -31919 -41346 -84361 -112101 -102968 -59212 -54260 -23778 -25621 -30269
18199 -30269 -27054 -202 8024 43901 -304 -68247 -84764 -16609 16843 5502 -43816 -90356
18187i0356O0434M2564M229p4275J4471L2967L9034o670r474m160n7069j0750
18175e9055N2070L7278N6248N0607K3884m0017l5498l2510K0723K7732j9469k3914
18163E8079O4849L2727P738k028p675l028k41J4462K0816p585j9817L033M7128
18150B08458r238N563j1986j9075j8154K0612P3153L4123l5372j715j1718K0449
18138B55100M8606K2687L2237J26026L9659j1068L0418L8489R8997R4367R1562
18127H67080J23830J60816K50859K51141K41190L53377M56827O07270J065853
18118D378243J714735K429563M041031O047218Q100399R015281Q245287N906600
18110D9878357M403680O705765J3623887K4601228J3904976k9982153l9018175
$$ plain form
18187 -90356 -29922 12642 16871 -57404 -42933 -9966 29068 22398 12924 8764 -48305 -59055
18175 -59055 -6985 30293 86541 137148 161032 121015 85517 53007 73730 101462 81993 58079
18163 58079 122928 155655 163393 161365 153690 150662 150421 164883 185699 178114 158297 161330 208458
18150 208458 199220 204783 192797 173722 155568 176180 249333 283456 248084 246369 234651 255100
18138 255100 303706 326393 358630 484656 524315 513247 543665 582154 681151 775518 867080
18127 867080 990910 1151726 1402585 1653726 1894916 2248293 2705120 3312390 4378243
18118 4378243 6092978 8522541 12563572 18610790 26711189 35726470 43971757 49878357
18110 49878357 54282037 60987802 74611689 99212917 113117893 83135740 44117565
18103D4117565k0319637r269388m735473k612551j600827j154771q81086n91384
18095B952448m95657l66963k43849k28630k38769k11718j06436r9080r6364o7177
18085G97805l8914p5362n6760r0537o2606L8122L9087n4616r2821k1898J4913
18074C96413l7188m441n0740o0929k8284r793r551j9335j5794N420m2605j1755
18062A11418K4038k7638r703N446J9618N4071n5793q5867k8402L6794N1913J2214
18050A08109k3993m6525j2047L3106j527O078L3117k198m6189k7437J2003P0610
18038A03107l427J9258l3172q8637k5043j8566N980K5480R7211J895n0540J6664
18026E0210K7219n4738Q182l4221j908j7204J7934P8156K1k8515l1096o2109J3633
$$ plain form
18103 44117565 23797928 14528540 9793067 7180516 5579689 4424918 3543832 2952448
18095 2952448 2456791 2089828 1845979 1617349 1378580 1166862 1060426 961346 864982 797805
18085 797805 758891 683529 626769 536232 473626 511748 550835 496219 403398 381500 396413
18074 396413 359225 354784 304044 243115 214831 205038 195487 176152 160358 165778 123173 111418
18062 111418 135456 107818 98115 103561 123179 177250 121457 35590 7188 43982 95895 108109
18050 108109 84116 37591 25544 58650 57123 63201 96318 94120 47931 20494 32497 103107
18038 103107 99680 118938 85766 -2871 -27914 -46480 -40500 -15020 82191 84086 33546 50210
18026 50210 77429 22691 30873 -3348 -5256 -22460 -4526 73630 73651 45136 14040 -48069 -34436
18013c4436K8013j854k2028j8573O5347M9536q358K4190K076l0072r1157l9360
18001g6676J9547j6709L231j3789M2855M6219q182M334J2286j6107L8711O8439
17989A04159j4944j8389o166m5928o4115o4843n2995J41468M1428p3814l6351
17978i0490K7711N4612N8755k8879K7088O017n3865m2070j6230J1848M5956m5149
17966d4696m3258J7505L1878J0994P4754J7056j3530M1052q4457k7223L0041K0429
17954C0545j0607k1350k1699J4834j0898l9121k3767K6760M8988K9231O933n471
17942B4378k2597k0405j9643K987j7566O777M565k1046J9763Q372j6625n4658
17930a05698m1148q373k1630P8351L2194Q460J9597l6913j9625J6175Q19L6777
$$ plain form
18013 -34436 -6423 -8277 -30305 -48878 16469 66005 57647 81837 83913 53841 -37316 -76676
18001 -76676 -57129 -73838 -70607 -84396 -41541 4678 -3504 830 13116 -2991 35720 104159
17989 104159 89215 70826 64660 18732 -45383 -110226 -163221 -21753 19675 -54139 -90490
17978 -90490 -62779 -8167 50588 21709 48797 54814 949 -41121 -57351 -45503 453 -44696
17966 -44696 -87954 -70449 -38571 -27577 47177 64233 50703 91755 7298 -19925 10116 30545
17954 30545 19938 -1412 -23111 -8277 -19175 -58296 -82063 -55303 -6315 22916 29849 24378
17942 24378 1781 -18624 -38267 -35280 -52846 -46069 -41504 -62550 -42787 -34415 -51040 -105698
17930 -105698 -146846 -155219 -176849 -98498 -66304 -57844 -38247 -75160 -94785 -78610 -77791 -41014
17918d1014J14590L1197l4720p5292J1585l9019R335O5306k9839m4823k9866p518
17906g0078M2613Q687K6545J4617l1516K9409k2113n5235n7067k0073Q2851L7243
17894a4117n2512N16N6798N3294j2478m5345m0250m2780j966M2630K7775O1960
17882C3525k1303n5836q510M8560N3764J3456n3342J3251m4038J0461N2388J2248
17870E4624P486r537k0578l7716j2899M4634l1368k5513j6893J8459O0620J2797
17858D4116k7814K4564m2352q2589n827P881j1613J9526K9683K5248k5113n1132
17846i5422K5884o104q190j5655k3022r508J2640M225J6259r019J0331P457M1274
17833d8850k2139M2164J4769k9490L3083P5470J0517k9759j9573m8604M5683K5461
$$ plain form
17918 -41014 73576 104773 70053 -5239 6346 -32673 -23338 41968 12129 -32694 -62560 -70078
17906 -70078 -27465 -18778 7767 22384 -9132 20277 -1836 -57071 -114138 -134211 -51360 -14117
17894 -14117 -66629 -66113 -9315 43979 31501 -13844 -54094 -96874 -98840 -56210 -28435 33525
17882 33525 12222 -43614 -52124 -3564 50200 63656 10314 23565 -20473 -10012 42376 54624
17870 54624 62110 52573 31995 -5721 -18620 26014 -5354 -30867 -47760 -29301 31319 44116
17858 44116 16302 40866 -1486 -84075 -89902 -82021 -93634 -74108 -44425 -19177 -44290 -95422
17846 -95422 -69538 -75642 -83832 -99487 -122509 -132017 -119377 -115152 -98893 -107912 -97581 -90124 -48850
17833 -48850 -70989 -28825 -14056 -43546 -10463 65007 75524 45765 26192 -22412 23271 48732
17821D8732p107l985K2478r6419j3537K097n862n6642L3605L8933J2902K1269
17809c536l2771q6090J4091M3540L0922N3422K2834K6328L8287r156K104l6660
17797F3315j5778j5305l1342j2162o917k2704k9131j4911M3211K3761L3576J6064
17785C1677N918L2662l047o2068O31j1879L0636L559J1150K7761L8779m7674o3504
17772e399J2630L4714k8477o0200O2118k2722o525j0282r455k9993k73J5855N320
17759d2689o5644j5381r749M9970k2610l5395K1520M6404k1153o6282J5718M5879
17747i9412j720m8692o258j882k342K5208P593P6799O9193n6317o9901K1291J9686
17734f6754K9107O226j2254L9053l0275l1186M956O1699l8016L3646q966N974
$$ plain form
17821 48732 41625 37640 60118 -36301 -49838 -47741 -53603 -110245 -76640 -37707 -24805 -3536
17809 -3536 -36307 -122397 -108306 -64766 -33844 19578 42412 68740 107027 97871 99975 63315
17797 63315 47537 32232 890 -11272 -18189 -40893 -70024 -84935 -41724 -17963 15613 31677
17785 31677 37595 70257 67210 5142 5773 -6106 24530 28089 39239 67000 105779 58105 -5399
17772 -5399 7231 41945 13468 -46732 15386 -7336 -13861 -24143 -33598 -63591 -63864 -48009 -42689
17759 -42689 -108333 -123714 -133463 -83493 -106103 -141498 -119978 -73574 -94727 -161009 -145291 -99412
17747 -99412 -101132 -149824 -156082 -157964 -160306 -135098 -127505 -50706 18487 -37830 -107731 -86440 -66754
17734 -66754 -37647 -31421 -43675 -4622 -34897 -66083 -61127 572 -37444 -3798 -12764 -6790
17722f790J98q645m0844k5593J9355L6242j0005o5991l883n4774q7163O9179R5580
17709h3134M9846J1740J4511K7123N498P8858j2747l1882J4281k6358j6790q0272
17697d9326r625L9390j202K549r2835r2361j5200N4781O5648O7613N3935j3332
17685A0035p9160M298L5439j2149j7787n4758N552L5191q583j8404O1967J7320
17673b1039J2208K5775J9196q6078k3440L5616M6944K6450j2895l4371n5708Q8846
17661B1504k8831k1402J0115N0968P613K5368k3898m9659L3894M1271J863l4831
17649C3975o3381M25N5757O9812j6440q8505J1335O61p7587j8776M1659k2762
17637g3827o302Q912K9221J6516k7653j7318R514L7086l7409O6109j2227l8701
$$ plain form
17722 -6790 -6592 -15237 -56081 -81674 -62319 -26077 -36082 -102073 -105956 -160730 -247893 -178714 -83134
17709 -83134 -33288 -21548 -7037 20086 25584 104442 91695 59813 74094 47736 30946 -49326
17697 -49326 -58951 -19561 -20763 -18214 -111049 -203410 -218610 -163829 -98181 -30568 23367 10035
17685 10035 -69125 -64827 -29388 -41537 -59324 -114082 -108530 -73339 -81922 -100326 -38359 -21039
17673 -21039 -8831 16944 36140 -49938 -73378 -37762 9182 35632 22737 -11634 -67342 21504
17661 21504 -7327 -28729 -18614 32354 39967 65335 41437 -8222 25672 66943 68806 33975
17649 33975 -29406 -28981 26776 96588 80148 -8357 2978 3639 -73948 -92724 -51065 -73827
17637 -73827 -80129 -71217 -41996 -25480 -53133 -70451 -60937 -23851 -61260 4849 -7378 -46079
17625d6079l3207Q100L7163M7122N9760m1565m5113M7080l539K637M086m49L3723
17612F9719L4165k5832l6215k0673l5589j6217k3833j1184M339m15J2939m226
17600e3022P8347k147k4924O2292J2637j7848M14m1701m144J4844l5333M877P351
17587A643j632j6213m9123K3009O8471k6470l8537o484k6702l5644J1137J03687
$$ plain form
17625 -46079 -79286 -71186 -34023 13099 72859 31294 -13819 33261 29722 32359 36445 35996 69719
17612 69719 103884 78052 41837 21164 -14425 -30642 -54475 -65659 -61320 -61735 -48796 -53022
17600 -53022 25325 23178 -1746 60546 73183 55335 55749 14048 9904 24748 -10585 -5708 1643
17587 1643 11 -16202 -65325 -42316 26155 -315 -38852 -45336 -72038 -107682 -96545 7142
$$ [...]
##END NTUPLES=NMR SPECTRUM
##END=
