##TITLE=Analysis number 325539
Compound Code sb 01273
Project Code adrs
Chemist Name stores
##JCAMPDX= 6.0         $$ Bruker NMR JCAMP-DX V2.0
##DATA TYPE= NMR SPECTRUM
##DATA CLASS= NTUPLES
##ORIGIN= Bruker BioSpin GmbH
##OWNER= nmr
$$ XWIN-NMR		Version 3.5
$$ Thu Jan  4 08:27:58 2007 GMT Standard Time (UT+0h)  MAYBRIDGE\nmr@NMR_250MHZ
##.OBSERVE FREQUENCY= 250.131544655141
##.OBSERVE NUCLEUS= ^1H
##.ACQUISITION MODE= SIMULTANEOUS (DQD)
##.ACQUISITION SCHEME= undefined
##.AVERAGES= 16
##.DIGITISER RES= 18
##SPECTROMETER/DATA SYSTEM= dpx250
##.PULSE SEQUENCE= zg30
##.SOLVENT NAME= DMSO
##.SHIFT REFERENCE= (INTERNAL, DMSO, 0, 16.522)
##AUDIT TRAIL= $$ (NUMBER, WHEN, WHO, WHERE, WHAT)
$$ ##TITLE= Audit trail, XWIN-NMR		Version 3.5
$$ ##JCAMPDX= 5.01
$$ ##ORIGIN= Bruker BioSpin GmbH
$$ ##OWNER= nmr
$$ C:\u/data/dgb/nmr/ADRS/220/pdata/1/auditp.txt
$$ ##AUDIT TRAIL=  $$ (NUMBER, WHEN, WHO, WHERE, WHAT)
(   1,<2007-01-04 08:27:34.06 +000>,<MAYBRIDGE\nmr>,<NMR_250MHZ>,
      <created by zg, POWCHK disabled, PULCHK disabled
       configuration hash MD5:
       49 4B E0 1D 92 C2 6B 37 9F E6 65 BC 52 41 86 1D
       data hash MD5: 64K
       9E 71 4B A3 9F 68 BB 6D CF A9 FC 72 0E A7 DD 5A>)
(   2,<2007-01-04 08:27:47.61 +000>,<MAYBRIDGE\nmr>,<NMR_250MHZ>,
      <Start of raw data processing
       ef LB = 0.3 FT_mod = 6 PKNL = 1 SI = 32K 
       data hash MD5: 32K
       78 04 22 0F 93 F0 C4 CB 49 03 56 91 E6 D9 A7 59>)
(   3,<2007-01-04 08:27:49.19 +000>,<MAYBRIDGE\nmr>,<NMR_250MHZ>,
      <apk 
       data hash MD5: 32K
       D9 7D AF 9F 7D 59 EA 74 2E 32 9B F9 A4 05 EF 6C>)
(   4,<2007-01-04 08:27:49.89 +000>,<MAYBRIDGE\nmr>,<NMR_250MHZ>,
      <abs ABSG = 5 
       data hash MD5: 32K
       D5 4A 23 5E 57 3D B2 E0 49 36 A4 10 21 8F F1 E0>)
$$ ##END=
$$ 
$$ hash MD5
$$ 80 DB 31 1A 35 DA 6B 86 A3 47 1D D9 AB 8E 4F A2
##$RELAX= 
##$RELAX= 
##$RELAX= 
##$RELAX= 
##$RELAX= 
##$RELAX= 
##$RELAX= 
$$ Bruker specific parameters
$$ --------------------------
##$DU= <C:\u>
##$EXPNO= 220
##$NAME= <ADRS>
##$PROCNO= 1
##$TYPE= <nmr>
##$USER= <dgb>
##$AMP= (0..31)
100 100 100 100 100 100 100 100 100 100 100 100 100 100 100 100 100 100 
100 100 100 100 100 100 100 100 100 100 100 100 100 100 
##$AQSEQ= 0
##$AQ_mod= 3
##$AUNM= <au_zg>
##$AUTOPOS= <4 >
##$BF1= 250.13
##$BF2= 250.13
##$BF3= 250.13
##$BF4= 250.13
##$BF5= 500.13
##$BF6= 500.13
##$BF7= 500.13
##$BF8= 500.13
##$BYTORDA= 1
##$CFDGTYP= 0
##$CFRGTYP= 5
##$CHEMSTR= <none>
##$CNST= (0..31)
1 1 145 1 1 1 1 1 1 1 1 1 1 1 1 1 1 1 1 1 1 1 1 1 1 1 1 1 1 1 1 1 
##$CPDPRG= <>
##$CPDPRG1= <>
##$CPDPRG2= <>
##$CPDPRG3= <>
##$CPDPRG4= <mlev>
##$CPDPRG5= <mlev>
##$CPDPRG6= <mlev>
##$CPDPRG7= <mlev>
##$CPDPRG8= <mlev>
##$CPDPRGB= <>
##$CPDPRGT= <>
##$D= (0..31)
0 1 0 0 0 0 0 0 0 0.06 0 0 0 0 0 0 0.0002 0 0 0 0 0 0 0 0 0 0 0 0 0 0 
0 
##$DATE= 1167899252
##$DBL= (0..7)
120 120 120 120 120 120 120 120 
##$DBP= (0..7)
150 150 150 150 150 150 150 150 
##$DBP07= 0
##$DBPNAM0= <>
##$DBPNAM1= <>
##$DBPNAM2= <>
##$DBPNAM3= <>
$$ [...]
##$SUBNAM7= <"">
##$SUBNAM8= <"">
##$SUBNAM9= <"">
##$SW= 20.6930455092707
##$SWIBOX= (0..15)
0 0 3 0 0 0 0 0 0 0 0 0 0 0 0 0 
##$SW_h= 5175.983436853
##$TD= 65536
##$TD0= 1
##$TE= 294.16
##$TE2= 300
##$TE3= 300
##$TEG= 300
##$TL= (0..7)
0 120 120 120 120 120 120 120 
##$TP= (0..7)
150 150 150 150 150 150 150 150 
##$TP07= 0
##$TPNAME0= <>
##$TPNAME1= <>
##$TPNAME2= <>
##$TPNAME3= <>
##$TPNAME4= <>
##$TPNAME5= <>
##$TPNAME6= <>
##$TPNAME7= <>
##$TPOAL= (0..7)
0.5 0.5 0.5 0.5 0.5 0.5 0.5 0.5 
##$TPOFFS= (0..7)
0 0 0 0 0 0 0 0 
##$TUNHIN= 0
##$TUNHOUT= 0
##$TUNXOUT= 0
##$USERA1= <user>
##$USERA2= <user>
##$USERA3= <user>
##$USERA4= <user>
##$USERA5= <user>
##$V9= 5
##$VALIST= <valist>
##$VCLIST= <CCCCCCCCCCCCCCC>
##$VD= 0
##$VDLIST= <DDDDDDDDDDDDDDD>
##$VPLIST= <PPPPPPPPPPPPPPP>
##$VTLIST= <TTTTTTTTTTTTTTT>
##$WBST= 1024
##$WBSW= 4
##$XGAIN= (0..3)
0 0 0 0 
##$XL= 0
##$YL= 0
##$YMAX_a= 292043
##$YMIN_a= -248159
##$ZGOPTNS= <>
##$ZL1= 120
##$ZL2= 120
##$ZL3= 120
##$ZL4= 120
##$ABSF1= 16.522
##$ABSF2= -4.171173
##$ABSG= 5
##$ABSL= 3
##$ALPHA= 0
##$AQORDER= 0
##$ASSFAC= 0
##$ASSFACI= 0
##$ASSFACX= 0
##$ASSWID= 0
##$AUNMP= <proc_1d>
##$AZFE= 0.1
##$AZFW= 0.1
##$BCFW= 0
##$BC_mod= 0
##$BYTORDP= 0
##$COROFFS= 0
##$CY= 12.5
##$DATMOD= 1
##$DC= 0
##$DFILT= <>
##$DTYPP= 0
##$F1P= 14.0000005364418
##$F2P= -0.99999901652339
##$FCOR= 0.5
##$FTSIZE= 32768
##$FT_mod= 6
##$GAMMA= 0
##$GB= 0
##$INTBC= 1
##$INTSCL= 1
##$ISEN= 128
##$LB= 0.3
##$LEV0= 0
##$LPBIN= 0
##$MAXI= 10000
##$MC2= 0
##$MEAN= 0
##$ME_mod= 0
##$MI= 0
##$NCOEF= 0
##$NC_proc= -3
##$NLEV= 6
##$NOISF1= 0
##$NOISF2= 0
##$NSP= 0
##$NTH_PI= 0
##$NZP= 0
##$OFFSET= 16.522
##$PC= 1
##$PHC0= 213.4527
##$PHC1= 5.678396
##$PH_mod= 1
##$PKNL= yes
##$PPARMOD= 0
##$PSCAL= 4
##$PSIGN= 0
##$REVERSE= no
##$SF= 250.13
##$SI= 32768
##$SIGF1= 0
##$SIGF2= 0
##$SINO= 400
##$SIOLD= 32768
##$SREGLST= <1H.DMSO>
##$SSB= 0
##$STSI= 32768
##$STSR= 0
##$SW_p= 5175.98343685301
##$SYMM= 0
##$S_DEV= 0
##$TDeff= 65536
##$TDoff= 0
##$TI= <Analysis number 999999
Compound Code 99
Book Reference 9
Project Code 9>
##$TILT= no
##$TM1= 0
##$TM2= 0
##$TOPLEV= 0
##$USERP1= <user>
##$USERP2= <user>
##$USERP3= <user>
##$USERP4= <user>
##$USERP5= <user>
##$WDW= 1
##$XDIM= 32768
##$YMAX_p= 308896793
##$YMIN_p= -110802
$$ End of Bruker specific parameters
$$ ---------------------------------
##NTUPLES= NMR SPECTRUM
##VAR_NAME=  FREQUENCY,     SPECTRUM/REAL,   SPECTRUM/IMAG
##SYMBOL=    X,             R,               I
##VAR_TYPE=  INDEPENDENT,   DEPENDENT,       DEPENDENT
##VAR_FORM=  AFFN,          ASDF,            ASDF
##VAR_DIM=   32768,         32768,           32768
##UNITS=     HZ,            ARBITRARY UNITS, ARBITRARY UNITS
##FACTOR=    0.157963299565203, 1,           1
##FIRST=     4132.6476996994, 0,             0
##LAST=      -1043.33573715361, 0,           0
##MIN=       -1043.33573715361, -110802,     0
##MAX=       4132.6476996994, 308896793,     0
$$ Real data points
##PAGE= N=1
##DATA TABLE= (X++(R..R)), XYDATA
$$ [...]
20939 -39872 -64723 -60600 -53497 -56099 -21997 -10913 8703 27317 50348 77837 39134 -2826
20927 -2826 -13954 -206 -23118 -19904 -37081 -48409 -37845 -7227 -4613 -32353 -24965 10674
20915 10674 2961 12339 5108 16541 35135 44560 28928 1209 -22236 -4526 -3533 -18472 -41699
20902 -41699 -53269 -46622 -48020 -46145 -34083 -18699 -18349 -20895 -15279 -3902 5594 -30461 -29975 -14977
20888 -14977 -18732 -23619 -49645 -37352 -31887 -48131 -72047 -50344 -23067 -25880 -31071 -1061 9801
20875 9801 235 2362 15087 8156 -21026 -30008 -19448 -20814 -42793 -56646 -25053 8329 16499
20862 16499 7289 -8082 -24572 -28729 -27449 -24506 -19758 7692 5622 20138 25162 17124 -19741
20849 -19741 -24558 18312 62463 50948 23139 32248 13524 5477 37081 44590 1693 -29599
20837 -29599 -14441 2612 20 -5440 -20944 -28418 -13291 8325 19379 34728 53773 38949
20825 38949 24190 -15845 -45176 -54511 -39327 -26693 4415 25114 33093 -6595 -28434 -39658
20813 -39658 -40409 -19809 6477 6059 -7753 -22381 -29208 -32239 -34024 -2983 -18939 -37683 -52719
20800 -52719 -53063 -48388 -55159 -43757 -10380 16172 5399 -31223 -37302 -43071 -55195 -48707 -33076
20787 -33076 -35883 -33484 -18372 3496 19595 13112 17758 17722 -18713 -16344 -12700 -37200 -24796
20774 -24796 11545 10869 4367 8567 -1518 -20337 885 35509 25044 3513 -18018 -23453 -35758
20761 -35758 -27912 -5924 20505 33200 -1179 -26942 -17055 -20 -31462 -56197 -55022 -28607
20749 -28607 -17458 -2610 -23609 -20361 -20570 -32829 -10981 -26463 -36015 -61140 -64322 -56021 -53398
20736 -53398 -53326 -65023 -53362 -74457 -69641 -45462 -37553 -43519 -28127 -14001 -14668 -969 -9387
20723 -9387 -33906 -50664 -31204 -31214 -45832 -18940 -445 4566 26923 39699 19399 -24209 -54595
20710 -54595 -48148 -31057 -37246 -45724 -22026 -5596 -37073 -56665 -65830 -72621 -62293 -27259 27022
20697 27022 23277 21264 30897 10333 -12882 6730 13203 2794 41632 51186 9501 -1432 -10845
20684 -10845 -1788 4619 15362 -8265 -7164 -20902 -13097 5045 -6123 -14769 4694 23970 23757
20671 23757 22260 -3151 -22292 -27105 -5192 1597 -1962 -35389 -54229 -23410 649 -7205 -4180
20658 -4180 -5679 -23043 9240 27461 32873 271 -31064 -30526 5252 -12779 -13793 -10332 -6722
20645 -6722 5397 1699 7671 27615 8057 -4285 -9606 -22909 -20906 -20981 -10613 -3993 3074 -10477
20631 -10477 -28192 -19079 -4557 -2827 -78 1617 23658 682 -12107 -17027 3470 -8374 -10553
20618 -10553 4459 4513 24524 39374 49719 7789 -1589 -6968 1468 7721 2624 -2518 24408
20605 24408 40797 263 -42728 -50951 -31880 -9816 -25838 -24207 -56393 -54821 -27296 -2051
20593 -2051 -1258 -30456 -34879 12886 10395 4111 -16541 11571 21325 10885 27279 38948 30168
20580 30168 27751 28978 22846 13981 -35893 -37151 -1002 8891 10766 3153 -967 1489 4917 -11902
20566 -11902 -10477 -13201 -18867 -31381 -24696 1030 -14844 -58692 -63767 -44569 -23433 1820 17350
20553 17350 11444 28324 40785 31509 18275 26618 27975 19651 -4238 -8443 -3112 -53988 -49247
20540 -49247 -26135 -8081 -7259 -15939 4759 -9620 -13433 -19696 -16336 -13403 -36082 -30807 -10988
20527 -10988 13234 -2464 13718 6655 -17325 -17262 -21579 -37582 -42817 -24613 -16766 -54085 -48776
20514 -48776 -14486 -5006 9837 -15989 7223 18069 4277 -6367 -11721 -2035 6237 22418
20502 22418 15297 12168 15205 24594 25817 15627 9354 -13242 -27563 -13694 13768 157 -8201
20489 -8201 22376 10109 -24682 11888 25223 27552 2578 -24460 -11931 -4397 25180 23227
20477 23227 1938 -12235 -22510 -14024 945 -4600 5128 15864 24885 44485 29929 -3913
20465 -3913 -30793 -5103 6619 -25758 -12181 3200 8603 -13315 1091 7185 14825 1721
20453 1721 -26167 -56862 -53428 -23603 -41649 -36195 -4043 -637 -1684 -23299 -40761 -18542 -604
20440 -604 -34506 -66858 -64584 -45223 -26855 -11360 -28204 -56911 -45018 -33173 -130 11341
20428 11341 14694 -1982 -26148 -37498 -33741 -37721 -12292 10582 16870 -15508 -26639 -30383 -55444
20415 -55444 -45773 -34945 -13734 -4708 14065 21479 15308 -1598 -2120 5773 15202 28529 37722
20402 37722 55422 28535 -13862 -20849 -22321 -57398 -61350 -39914 -29586 -4928 147 -10446
20390 -10446 -11278 -3765 -10872 -21832 6746 32896 28985 9906 8956 13366 24516 16738 -15727
20377 -15727 -25006 -28123 -30017 -36788 -55017 -35614 -8691 -2185 7485 11061 -2674 -37171 -58529
20364 -58529 -32829 -9145 -20899 -14481 -7797 -26557 -56403 -64993 -32056 -23573 -26483 -20033 -29692
20351 -29692 -32208 -40049 -35609 -31359 -33746 -22189 -18162 -17178 -22277 -6287 -6357 -19336 -10350 -2777
20337 -2777 -11502 -15308 -17489 -23545 -45528 -52640 -48077 -19529 243 4196 -30148 -42311 -36555
20324 -36555 -44589 -26413 -17057 -2987 22672 23309 32633 12666 -25684 -24931 -33488 -28949 731
20311 731 16970 32941 38772 19238 2526 -28306 -32266 -2231 18811 -10040 -52409 -61628 -66443
20298 -66443 -29404 10034 29756 12528 -20201 -23025 -35627 -43598 -23689 -7723 5649 -4690
20286 -4690 10096 1709 -24060 -37085 -26138 -31980 -14356 -15634 -36340 -50895 -12114 2388
20274 2388 -16108 -17281 -48152 -74784 -58979 -23103 16664 -6887 -34958 -41508 -45112 -50878 -38406
20261 -38406 -18866 11783 954 -11296 -24128 -18717 -29051 -40142 -35157 -39626 -28328 -32331
20249 -32331 5866 54125 42102 -17251 -23170 -772 22098 15820 7786 2041 -4245 -25645 -15718
20236 -15718 2502 15728 11412 -11883 -26539 -37026 -43523 -52189 -63773 -11303 30361 14071
20224 14071 12685 11465 10677 -12674 -10300 -22674 -40879 -43855 -27055 -1757 -11299 -28792 -38852
20211 -38852 -49470 -64119 -43654 5446 -24353 -33016 -26817 -16576 -2991 14288 27278 -1540
20199 -1540 -41757 -43432 -33031 -29943 -59834 -51460 -30914 -30251 -14948 12863 17790 2799 6096
20186 6096 -4736 6039 21962 26387 28320 23623 28532 31868 -4880 -15225 6689 31052 4450
20173 4450 -13430 5050 -23941 -39192 -12397 -7211 3654 -5739 -2883 2441 -847 585 2666
20160 2666 4381 18960 37101 41818 50593 51137 55138 25197 -48808 -62006 -27169 -1548 -3536
20147 -3536 -7562 -2466 -10474 -16207 -27729 -34860 -30662 -22909 -6099 -13476 -19920 -31138 -35844 13956
20133 13956 43227 45799 34881 31884 6440 -17878 -23477 -20818 -2533 5519 28044 36141 24195
20120 24195 -10155 -25405 -27620 2220 1994 12046 -13406 -17305 -11593 -8616 -14000 -2880 23177
20107 23177 19235 -1747 6846 -10423 -31017 -37251 -36202 12494 22364 28574 27578 16781 -2210
20094 -2210 -19479 -40470 -31421 -4904 -8295 -32689 -18747 -14649 -12430 -22759 -12577 21749 671
20081 671 -35235 -42160 -40512 -39545 -19195 -36195 -45062 -30555 -4535 2853 -4623 -12599 -31525 -49303
20067 -49303 -63333 -45852 -43626 -57387 -33906 -26494 -5080 -7971 -33894 -48421 -35021 -34648 -38486
20054 -38486 -54708 -70275 -64011 -51736 -26619 -21765 -66999 -69279 -52399 -27239 -46424 -58134
20042 -58134 -32523 -9225 -29099 -32758 -16473 -14812 -29185 3592 18505 10158 -4397 -345
20030 -345 18135 19067 23394 21714 -5658 -11915 -25966 -16189 -13070 -34179 -47133 -18082 19577
20017 19577 24071 8649 -1379 -33720 -40347 -42941 -5313 -2829 -10922 -13672 -19693 -44230 -12059
20004 -12059 32481 -1470 -55469 -60535 -47841 -44010 -29386 -35053 -2674 4721 -2365 -12779 -10317
19991 -10317 -16920 -30628 -63152 -43829 -2208 10604 8581 -23110 -10079 3230 18144 17728
19979 17728 16973 18714 26646 31840 22550 1261 -32726 -48934 -39751 -62189 -36276 -16058 -7083
19966 -7083 -10 -12147 -7712 -20848 -12044 13291 -4420 13237 20794 20089 38971 63707 57372
19953 57372 34028 36424 40046 43437 18317 -1664 -15205 -39006 -48571 -64034 -54988 -50973 -47984
19940 -47984 -45679 -34639 -25169 2918 34651 34023 31054 42223 33528 28915 74867 81227 32304
19927 32304 22711 -22509 -53660 -34120 -8375 -8978 -41114 -70868 -74254 -59009 -15109 8753
19915 8753 -5559 -20047 -20128 1015 18023 16702 36874 38289 10692 12756 -721 3312 -6166
19902 -6166 -828 -4299 73 -35152 -59552 -26718 -37548 -56703 -42528 -11844 18785 35589
19890 35589 32536 31584 30217 25931 40066 48525 37276 14178 38157 18336 1970 -8117 -971
19877 -971 -8438 -28584 -33476 -21517 -41442 -14914 13253 19453 -12067 -37379 -29640 8407 -11200
19864 -11200 -25802 -21075 -9939 -5429 -2153 13633 -540 6084 28011 13801 14270 -6912 -39094
19851 -39094 -53259 -51494 -24005 -12594 -20329 -27345 -39944 -53727 -22418 16703 19454 4901
19839 4901 10064 13166 7093 -14303 -10026 -5059 -48726 -53643 -35562 -17897 -5060 -23020 -19284
19826 -19284 7122 2181 4788 59833 78386 54024 52955 33070 -5694 -51399 -38158 -18712
19814 -18712 -4245 -18493 -28102 -16807 -30575 -24211 -12413 -29020 -52167 -22368 -8619 -12868
19802 -12868 -1039 -1471 -2170 -10961 -26313 -49117 -19529 626 2054 -24480 -18792 -13558 4741
19789 4741 -3078 457 3168 15137 -20088 -38970 -47875 -12419 22935 23016 -2862 -17789 -24921
19776 -24921 -18809 -22487 5636 -6140 -11610 -8277 -11890 -4140 -10189 -35265 -17500 -15788 -30388
19763 -30388 -13980 -35048 -66257 -36461 -10135 6072 -2745 -47075 -55850 -13032 16281 20766
19751 20766 30564 43100 28050 27414 27559 34525 23700 -7422 -19306 -31323 6010 -7387 -9799
19738 -9799 -22181 -23157 -15244 -1132 9686 18708 43608 31679 9576 1840 9512 21900 23433
19725 23433 11138 1238 -3989 4716 -488 -7186 -35931 -22887 8054 58736 17851 4761 16725
19712 16725 11307 32335 48319 60573 38811 16290 -5624 -26238 -64852 -65884 -20381 9613
19700 9613 9990 7101 -1952 13400 19710 -11835 -22992 -417 1995 9674 -12237 -28522 -37422
19687 -37422 -40459 -29805 -12616 -27492 -17988 -19573 -8357 -993 9358 9382 13620 -6111 -16343
19674 -16343 -30535 -34116 -32200 -30900 -14785 -23084 -5126 -19053 -28876 -19471 -19283 -33314 -11265
19661 -11265 -19186 -28730 -1688 15609 21144 3869 21408 507 1182 -19377 -40762 -35649 -28515
19648 -28515 -26322 -37879 -44964 -63805 -26962 -14560 -12005 -8332 -5847 -41189 -54057 -54203 -56422
19635 -56422 -14572 -1275 -14995 -4820 16741 12253 28673 35215 53900 62209 47912 42020
19623 42020 37232 34694 38152 47571 51510 41987 49339 59219 49635 46166 25676 1010 19410 37032
19609 37032 13983 -9428 -2233 -7212 -2014 3730 8580 -10183 -21927 11132 32082 5711 -14935
19596 -14935 -18772 -12985 -3105 -2272 20049 23318 4311 -6344 -20001 -17404 -30828 2496 1173
19583 1173 -33595 -18804 -2509 -13883 -3742 10459 23434 -1425 -24959 -11619 5412 -20670
19571 -20670 -49060 -45287 -24355 -38308 -37199 -20583 -13537 -1862 10349 -92 -4063 -12879 -29847
19558 -29847 -43315 -22855 -16510 -21047 -30937 -37333 -14507 21001 49282 18354 -8500 -17151 -5354
19545 -5354 17293 7662 -4963 -16166 -19335 -22749 -27307 -16701 -35718 -42000 -45714 -23768 -12168
19532 -12168 35332 30294 -5000 -13623 -59 6465 53967 58328 54432 23516 -8919 -23562 -29800
19519 -29800 -45897 -59485 -57577 -39229 -35126 -25857 -6540 -25262 -37070 -9174 26006 21499
19507 21499 8792 2018 -32675 -63301 -73339 -72858 -51349 -32363 -50729 -42633 -28986 -48855
19495 -48855 -67348 -56441 -29335 -41149 -54644 -31224 4058 14584 29765 35908 2794 7665
19483 7665 6004 -8901 -27882 -37036 -30259 -29871 -10404 -18102 -32717 -42626 -33759 -8565 5857
19470 5857 -4479 -24502 -22282 5370 5783 -20861 -7615 -5784 -31018 -61069 -40939 -23264 -12325
19457 -12325 -8494 9476 7135 -10877 -5774 -24246 -21856 -2686 -12886 -22749 -26913 -24848 -19632
19444 -19632 -9304 8491 -14649 8408 41131 49262 47034 66388 53886 31362 21331 14948
19432 14948 2694 20267 42729 57362 52118 50663 47358 5823 -21577 -12666 10954 368
19420 368 7251 21669 19847 36383 47497 9221 -35658 -2108 17885 9591 -14451 -32886 -21890
19407 -21890 -30966 -34529 -38369 -57848 -48250 -15359 -12272 -33492 -30960 -25492 -26081 -3000 -29021
19394 -29021 -40790 -55796 -45159 6498 -15291 -67905 -36830 -19355 -12489 -3152 -31503 -14539
19382 -14539 -2026 3584 -11546 -42243 -27057 -2161 -2568 -1956 -5357 5197 -10632 -32977 -32300
19369 -32300 -6773 15848 6386 -7843 -861 14783 26509 27151 -3473 -25927 -15659 965
19357 965 31436 43040 13196 -4953 -27530 -69362 -54962 -44855 -11720 6514 -8594 -24336
19345 -24336 -31117 -41567 -40090 -37176 -22087 -11315 22223 26896 28365 39437 60340 43182 36865
19332 36865 42771 -5646 -33616 -13656 -22179 -25564 5311 28645 17132 -1164 7002 -7691
19320 -7691 -23723 -11384 14799 -5952 9907 17770 45961 74589 70421 34955 -293 -1727
19308 -1727 2478 -9373 -7861 -11145 -15265 -17504 -27284 -42234 -26035 -49724 -59764 -43586 -59284
19295 -59284 -52742 -3443 13370 -8677 -32562 -22286 -23909 -41757 -28689 -44402 -40247 -385
19283 -385 25991 21626 15551 -4175 -34463 -35479 6260 27792 44351 30144 9816 5738 4269
19270 4269 25809 28612 6825 -3778 -17971 -29096 -27730 -10867 -10516 -17684 11775 20786 20394
19257 20394 7512 24602 12130 -28286 -36834 3241 8515 4241 -15932 -30513 -9707 21074
19245 21074 28641 47395 62911 45925 26207 22127 15871 -20350 -19465 -17137 -5607 5341 3685
19232 3685 3493 -8580 18896 53212 59460 44839 37988 29267 17817 -10642 -22057 -24759 -30526
19219 -30526 -37512 -32176 1472 -16254 -39406 -40841 -36894 -13346 -24372 -10605 18930 22724 21322
19206 21322 7704 -2453 12658 37689 27572 16896 26680 27841 31725 12172 -8714 -4684
19194 -4684 16799 8656 846 45940 55113 31122 15907 3661 13878 5608 -23925 -91159 -87131
19181 -87131 -47480 -7777 7137 2962 -8693 -449 14105 -23851 -51458 -39835 -15071 -4590
19169 -4590 9942 27991 33058 22766 -4971 -12934 1477 30159 49124 24579 11392 40236
19157 40236 27097 24724 13420 14588 -21440 -21058 -3073 6555 7529 7103 20462 40679 53944
19144 53944 27077 18737 24573 18477 967 -26278 -20164 -4462 -17376 -12414 18646 28546 8692
19131 8692 7561 17111 5123 -13344 -11598 -11978 -25046 -50647 -50208 -37679 -19150 5718 23982
19118 23982 19287 -9936 -14182 3749 47924 50902 29010 2305 11871 8080 24477 15713 11569
19105 11569 20159 31352 26231 27106 16921 -21403 -21157 -27742 -3330 6456 -27721 -41993 -21523
19092 -21523 3212 13155 26547 45335 37431 31464 26070 28215 23504 4249 -23358 -1231 19415
19079 19415 37313 28859 5079 -17739 -43298 -7382 10786 -5750 -2345 -5567 -1094 9293
19067 9293 -5699 -7369 -14990 -34140 -22941 -14089 -31113 -35312 -41593 -29674 -19066 8525 23237
19054 23237 16612 5757 13159 21645 34021 12350 -5365 19173 14330 18056 40025 30187 3447
19041 3447 1529 20506 53141 57101 30143 7022 -4915 -6793 -11044 -6205 24968 53968 50709
19028 50709 49103 50812 29710 22689 34155 70224 78697 105006 124328 112309 81773 36245
19016 36245 54182 69732 70556 52299 41549 44694 67110 74434 75574 85333 67891 63609 56551
19003 56551 52141 29768 17124 3445 23934 48707 46189 29198 51395 54576 55869 44676
18991 44676 63167 62734 56050 61338 81677 102094 83808 54374 61707 61498 49276 33019 34650
18978 34650 13115 -10142 4441 19509 44306 35795 -6334 -19260 -10763 -1839 41312 85553
18966 85553 58007 70918 51798 21571 29753 67521 79209 78972 83440 89371 76070 46835 36255
18953 36255 49297 64299 60149 33364 30602 47218 75134 84939 90694 86157 92690 96286 59535
18940 59535 43525 62482 63486 37721 33176 37060 27688 34584 34785 55893 42513 12687 19211
18927 19211 47723 60370 40993 12760 15683 10589 30619 33237 6239 -6913 5621 20093
18915 20093 21387 35642 30260 31681 52330 75774 82309 64615 35452 19489 5606 -6302
18903 -6302 12875 60449 78031 61642 65427 47228 28134 1192 -13663 11963 20486 2864
18891 2864 21635 25926 17945 31065 16244 27075 46845 62753 28515 2977 -10995 2071
18879 2071 14402 30111 38890 17789 25277 62144 94419 102700 81971 76068 74588 93762 97379
18866 97379 59342 41048 55400 90590 84622 48239 47792 95959 104736 100427 93605 63780 50876
18853 50876 53185 45309 51121 85913 96617 66533 49905 70638 82968 83718 77716 89432 93542
18840 93542 71301 56268 55252 47627 56859 65211 71777 62419 73863 98609 112018 86050 64381
18827 64381 90063 119387 141454 95272 64817 69044 75435 81341 93765 87655 99027 100075 75921
18814 75921 75730 83670 75309 57567 54483 62444 82609 81213 67328 69058 83196 96364 77871
18801 77871 54797 53220 60340 59334 85393 103020 60430 53613 49129 40503 30560 31877 24718
18788 24718 3127 14735 1278 17846 22449 15690 25936 36400 54725 55034 66062 37233
18776 37233 24786 30635 41129 44611 58482 54578 51838 59135 38696 35967 40631 39756 53716
18763 53716 48923 35166 10396 30797 60908 67381 27318 9081 36132 28531 13017 25264
18751 25264 33593 38679 59128 73426 51760 48575 47863 36341 55917 62306 70887 66807 92590
18738 92590 91961 92762 97779 85273 59600 35038 21629 37404 23542 40349 49362 45270 62316
18725 62316 83258 87309 82320 50128 23033 23022 31558 30346 52950 59795 49718 68047 67494 76616
18711 76616 61279 33777 26184 26301 5752 17096 9490 27452 54935 55293 46401 64586 65125
18698 65125 67268 55444 48086 49480 52845 95378 75841 70250 64515 40710 25567 45745 36089
18685 36089 24065 31406 50309 57724 69003 86125 76452 79427 59023 50422 35532 13380 6794
18672 6794 -8109 11518 25962 25882 28472 26736 31710 33341 36517 37749 32310 44494 37680 12381
18658 12381 28101 35222 36983 33329 42922 68639 68991 61851 70535 98264 107315 82033 62236
18645 62236 70102 89484 89839 105490 113634 127190 108946 116286 108922 97680 109621 145490 139321
18632 139321 117072 103355 98915 91910 105345 136060 141063 145124 145290 144975 114176 111807 123227
18619 123227 126214 174560 189773 172327 158805 124535 114325 131556 126954 169255 166711 137293
18607 137293 130457 150221 159514 155256 165960 175470 172213 155571 174746 186098 191758 181094 180211
18594 180211 193262 217872 259362 269353 235521 224010 259863 285504 297880 307880 311903 338859
18582 338859 348630 306145 292589 322370 337300 346812 381827 433119 451527 449503 441221 404965
18570 404965 396344 428473 457558 501281 551195 556767 532295 550528 576941 641112 686524 711081
18558 711081 736222 780557 810536 812287 845352 845522 877110 925778 963715 976028 1040384 1129996
18546 1129996 1203328 1247247 1277758 1350951 1429573 1519789 1609014 1711297 1808608 1946469 2033525
18535 2033525 2155411 2273321 2386633 2515742 2672111 2833207 2959294 3130127 3331521
18526 3331521 3521455 3761404 4008555 4255222 4544516 4814006 5090415 5413614 5764407
18517 5764407 6094697 6462396 6843007 7194075 7544655 7901385 8202583 8454383 8702330
18508 8702330 8959566 9148352 9294712 9394142 9449703 9496480 9524650 9496004 9484110 9440053 9370184
18497 9370184 9313673 9253235 9182435 9133711 9096536 9070922 9070675 9086062 9143568 9225625 9319942 9433064
18485 9433064 9555788 9672472 9812960 9971925 10144149 10312379 10466842 10620049 10766629
18476 10766629 10857432 10965400 11070654 11146429 11206305 11282450 11360222 11402056 11415726 11427946 11436385
18465 11436385 11446279 11463059 11469079 11505674 11535951 11546842 11577498 11641259 11679804 11747776 11767432
18454 11767432 11762058 11725263 11677992 11564138 11360095 11139611 10896431 10614933 10343213 10006793
18444 10006793 9675373 9324522 8973835 8625580 8281535 7954784 7696180 7430864 7180275
18435 7180275 6913433 6671321 6473828 6275116 6088765 5904438 5729084 5609570 5474785
18426 5474785 5346918 5208591 5086983 4989323 4869106 4760765 4630040 4525939 4458306 4391087
18416 4391087 4318530 4238799 4167634 4087766 4025165 3956989 3888981 3856335 3843495 3822638 3808585
18405 3808585 3809074 3810397 3771130 3735349 3760327 3769797 3796422 3776253 3757124 3779343 3842296 3874225
18393 3874225 3910445 3982006 4034404 4095042 4160101 4202044 4249406 4318987 4375368 4443352 4560071
18382 4560071 4660486 4732603 4844901 4926700 5013598 5108146 5216336 5363337 5539783 5729980
18372 5729980 5907610 6069611 6271182 6486761 6717918 7012212 7332632 7646290 7933061
18363 7933061 8246090 8570162 8893038 9215015 9477379 9728493 9930749 10136423 10316004
18354 10316004 10449911 10498103 10545308 10616356 10665408 10689255 10753879 10790507 10820065 10894341 10928376
18343 10928376 10973942 11053860 11124344 11159005 11158843 11176160 11185044 11182632 11176435 11157487 11101353 11051322
18331 11051322 10995049 10936447 10822106 10734433 10660359 10575830 10462427 10355239 10249342 10157653
18321 10157653 10086455 9984313 9879331 9828262 9831806 9885566 9945161 10021483 10137565 10255239
18311 10255239 10410250 10588834 10757697 10879796 11005623 11119186 11191000 11270517 11305547 11336005
18301 11336005 11305706 11227182 11078948 10878799 10617514 10312962 9976708 9584960 9163455 8720675
18291 8720675 8284423 7813285 7345222 6957599 6616929 6258814 5893931 5546799 5218193
18282 5218193 4935074 4674512 4419113 4164052 3929843 3730729 3551827 3346342 3138476
18273 3138476 2970834 2832086 2691315 2544593 2392913 2263715 2156062 2024553 1912825
18264 1912825 1805480 1714599 1643566 1577865 1512932 1426863 1367384 1312633 1263411 1246579 1199103
18253 1199103 1136142 1078694 999383 951772 940350 924217 879958 828119 793045 764382 727694
18242 727694 699685 701631 702731 676474 642165 598150 584597 566218 574627 547647 511733 498923
18230 498923 471317 465700 436238 374404 346558 347205 378262 374301 335043 315210 340796 354636
18218 354636 376939 360526 347962 316946 303308 294075 302436 282641 274683 275996 279137 282772 320119
18205 320119 305906 270821 240948 234171 251640 221403 200801 231403 243161 238187 233924 220756
18193 220756 231453 211233 197318 191910 189290 185585 184886 181657 165488 162050 159881 162227 148472
18180 148472 142543 155838 164607 159001 177129 167722 163748 144177 95246 79632 73502 97220 122662
18167 122662 144851 151915 136831 130668 117825 117593 122102 114979 102534 106543 115358 123656 99478
18154 99478 80010 88584 112716 123887 119178 87278 53924 62193 87337 105002 104727 108060 110646
18141 110646 136679 160593 153788 105281 91566 90053 121513 167227 182169 138936 114621 109039
18129 109039 123787 127800 140206 127865 106554 131374 127572 123392 139189 156769 162775 161883 141971
18116 141971 118231 113595 103165 111340 114982 108832 109958 142139 152934 150718 158517 144781 106304
18103 106304 95458 81136 96069 85964 87166 100925 140694 158469 164552 142284 145063 125815
18091 125815 129550 160011 140170 72781 56657 66527 80225 107228 117928 112167 107576 104955
18079 104955 117326 101371 112129 133253 114759 82644 75629 101332 110719 111706 90531 54272
18067 54272 43316 53953 76437 99658 94309 56578 55334 66255 44509 65819 107176 146070
18055 146070 136159 100299 81891 100105 128797 125287 118128 126765 138839 141298 132049 139226 144963
18042 144963 120744 118331 123173 118076 131979 132290 131347 113639 100441 115800 121191 105519 115079
18029 115079 141319 132336 130392 144412 139322 136858 128566 130741 143455 147942 169292 162271 176907
18016 176907 194405 197044 197233 164919 185463 229667 215802 203750 215730 191141 176218 212132
18004 212132 221829 215394 220511 182011 177156 201550 208518 203622 170740 156512 203027 235805 247288
17991 247288 226757 217544 238345 237248 242727 238268 246730 254481 272500 287559 279894 315227 309599
17978 309599 296002 303837 290697 295699 325614 337359 363249 357926 352760 385887 380049 398539
17966 398539 434870 441359 438729 450031 443468 463243 497732 553268 562570 606076 620568 618253
17954 618253 655887 695812 725881 767482 796914 826935 858654 910448 966764 1030928 1098443
17943 1098443 1129128 1149053 1187257 1276679 1397681 1476477 1539415 1618856 1703784 1813755 1953060
17932 1953060 2097387 2237878 2391167 2586679 2789752 2999187 3251542 3470151 3710017
17923 3710017 4010779 4301333 4557600 4794398 4995158 5146920 5255012 5355355 5391139 5368285
17913 5368285 5274483 5198567 5098320 4996103 4914113 4885425 4933949 5009483 5170773 5401619
17903 5401619 5776814 6286574 6953233 7831378 8977359 10471195 12409212 14873948 17812292
17894 17812292 21046508 24091795 26306905 27264893 27076709 26393024 25894233 26075912 27061486
17885 27061486 28597318 30213975 31108798 30764428 29308444 27311351 25381321 23910057
17877 23910057 23093629 22821877 22976092 23377347 23960644 24591751 25183470 25646997 25943708
17868 25943708 25995633 25785951 25346258 24697587 23928836 23147740 22419334 21796475 21281162
17859 21281162 20935181 20800292 20886041 21176671 21606394 22162470 22766712 23396457 23982195
17850 23982195 24431514 24658791 24654377 24406122 23952447 23346063 22614251 21866620 21204668 20673545
17840 20673545 20386288 20492096 21028078 22026359 23355633 24768311 25825478 26126969 25605968
17831 25605968 24642076 23737315 23258917 23327110 23676270 23748023 23008922 21262962 18782857
17822 18782857 16101481 13600914 11507174 9841317 8540968 7504116 6674354 6023912
17814 6023912 5486826 5073487 4754578 4513327 4300355 4170472 4108123 4087917 4083317 4101204
17804 4101204 4143422 4179207 4219042 4222752 4205346 4144719 4034548 3917030 3778921 3630910 3445343
17793 3445343 3247791 3056055 2876808 2692546 2492190 2331090 2202904 2098151 1966872
17784 1966872 1823132 1671789 1557913 1486550 1406759 1355877 1300248 1234116 1148645 1078238 998458
17773 998458 944967 919054 900794 862062 820204 788610 737927 673911 656047 637681 631016 637523
17761 637523 616657 599105 570641 530918 507663 468591 454037 432484 437612 441275 406867 378150
17749 378150 349946 361024 353388 347402 342289 312234 285802 247984 244119 232427 235331 255321
17737 255321 256614 249080 250550 221099 233815 241019 252965 223670 178096 185958 201874 203177 180572
17724 180572 170330 176548 228045 212652 168032 153385 156484 157957 171208 149456 161625 186275
17712 186275 215270 239550 200392 187356 181130 150021 158077 185618 184917 153854 169427 174042
17700 174042 158338 152968 143882 139519 158110 184648 183036 150723 133456 87761 87015 95160 109341
17687 109341 109376 106487 115030 122060 107001 69870 58671 85745 74767 58459 63814 71957 83890
17674 83890 73902 46357 66050 78502 61791 24970 29723 49098 51891 26867 67756 70953
17662 70953 45788 44964 57083 33643 29009 18409 47708 60610 42511 60942 57753 27663
17650 27663 45046 54170 63929 91301 87250 79633 93052 106740 58986 47166 60331 56364 46645
17637 46645 33304 33241 19324 14881 496 9639 20168 30519 -4081 -11520 4212 -2904 22056
17624 22056 41739 31003 49054 69531 68143 60111 60504 63163 59594 61866 61128 65585 59113 23712
17610 23712 25974 13372 17492 37670 38113 27301 -6411 26446 54389 42244 17365 -6747
17598 -6747 -8709 -38838 -13261 646 10258 25532 31116 15605 1656 6177 27390 35409 55149
17585 55149 53842 39859 36874 35417 3396 3476 4393 2630 -3029 -19029 -20210 11841 26668 32834
17571 32834 38261 27327 2990 -6694 3777 50912 47278 48446 73774 62644 29653 43148
17559 43148 56279 52617 69108 57486 53124 34421 -165 8368 27248 39723 40634 39966 41502
17546 41502 41929 43471 25256 4939 25020 40394 26089 42912 68095 70229 27575 11077
17534 11077 2696 20408 42442 11895 14901 33847 35163 15102 18873 4609 -23769 10828
17522 10828 40404 40788 29386 8556 -7002 -14691 20581 23912 23182 17669 29284 48046 33588
17509 33588 35094 33961 -8849 -9292 -8996 7778 -5153 11688 30216 32265 31406 27591 21470 2475
17495 2475 -19200 -12698 -2632 9752 8767 16498 3574 27651 55115 22684 33338 44965 39708
17482 39708 43941 48744 27855 9440 23595 22508 17045 14393 7540 4314 10015 30503 40273
17469 40273 36501 25128 39286 45071 56821 40365 35517 39104 21877 4558 21847 60856
17457 60856 65288 65183 64672 53111 33512 36895 33297 1043 -5204 -6257 -11605 6896 10477 23823
17443 23823 47307 30220 23966 27873 26878 60702 62832 40576 22901 9359 1206 2950 32107
17430 32107 66863 50272 28516 50010 83568 104198 115004 102591 56923 20555 41712 51872
17418 51872 64333 80430 49797 73580 98374 123041 135520 103092 99367 88970 88339 80681
17406 80681 64064 50850 85859 83817 94887 108696 125884 131333 100919 74866 51532 48192
17394 48192 65779 75810 58143 58415 56357 78716 82874 93173 111120 113410 128626 113719 93951
17381 93951 90358 79121 82364 83388 74855 57926 70892 74772 88596 108933 111238 93168 94621
17368 94621 83623 101028 121956 125050 132777 129477 137622 130127 155220 138430 120581 128809 125071
17355 125071 121457 106121 116749 160778 183623 181576 157696 130896 113429 118805 127810 140294
17343 140294 123669 81846 66468 74378 86368 109828 105648 76891 72509 100646 114163 121963
17331 121963 101851 69039 61190 64803 39192 58309 42661 23558 40282 52219 53065 24076
17319 24076 4647 20745 62827 78820 74321 73017 46376 37071 54462 56339 53158 44086 38435
17306 38435 69394 76882 60112 69757 48704 26049 38750 33238 27627 37124 60124 48034 38677
17293 38677 40629 34832 27503 27755 39479 30936 19314 45620 37954 22763 26980 31068 24512 25835
17279 25835 9646 3566 32448 45905 34246 15704 -5284 -26840 -17804 -40050 -44974 -43683
17267 -43683 -877 -2424 16222 40420 22391 2313 -20070 12971 23224 44457 21402 39594
17255 39594 60497 35853 14657 21511 64433 72908 66026 61840 41110 40759 32736 24118 3569
17242 3569 -56776 -62898 -33504 -21236 2272 9967 22381 19857 9917 -6568 -15836 30144 39796
17229 39796 39034 32014 -3647 957 -27837 -39444 -22399 9220 48955 31279 19254 -12628
17217 -12628 -18843 -6134 5080 28328 24080 8540 24182 37939 10390 14609 -30594 -24334
17205 -24334 16182 15411 2820 15151 15872 30534 48493 39678 26699 33033 21354 16065 -12042
17192 -12042 -3179 9329 16413 37342 27679 14115 26575 25352 8945 9311 26902 19401 45046
17179 45046 53871 42410 8409 -18290 -26630 -29617 -5239 9534 4670 22011 38377 40345 37102
17166 37102 35694 38557 25555 21714 13690 18483 16173 -4706 -12118 28622 45172 39452 37944
17153 37944 24334 20259 27977 11249 -5781 798 15434 21947 12806 -4672 -14853 2717 28741
17140 28741 45924 36630 48030 38906 17436 30646 32363 30372 29956 13954 7634 31095 33808
17127 33808 46207 47895 47730 40242 16573 -20904 -23926 -459 11913 -3624 6918 200 -19526
17114 -19526 -11883 -16950 -28484 -35167 -36648 -4927 -13030 -11515 -15811 -34602 -52526 -41709 -34964
17101 -34964 -9490 -32582 -27902 -12609 -39959 -2910 8646 6853 -11387 -32966 -11109 7688
17089 7688 52795 54542 38611 22241 11976 24126 53648 53293 23004 15563 31735 14720 6357
17076 6357 26521 29179 17796 13233 4433 -582 1593 10659 23934 24672 -10953 -20559 -29063 -4613
17062 -4613 8392 31530 35432 20216 4916 18492 8328 -33103 -51554 -56700 -30986 -27165
17050 -27165 -39568 -17292 -3930 -11523 -11146 4868 -5646 -510 -10458 -49114 -49382 -22566 -5738
17037 -5738 -11770 -38504 -39525 -45831 -24235 -22664 -6569 -8378 -11528 -44759 -43839 -20025 -8263
17024 -8263 941 -4633 -20554 -46126 -24724 18011 52323 67924 81209 63915 21354 -5354
17012 -5354 -16382 -6074 -26356 -24598 -882 41072 11534 14200 17128 -2066 -26312 -23358 1922
16999 1922 1889 5786 10767 -24089 -27626 -12940 -12329 -15345 -29191 -31689 -45212 -44941 -15431 -10856
16985 -10856 1285 15008 -14637 -21351 -20773 9686 40715 41643 30090 33986 37249 34112 3082
16972 3082 26513 28053 -13341 2922 7671 -5822 -4321 -10278 -4572 6488 -14262 -8461 -8209
16959 -8209 -7563 -5230 8672 15761 46937 52701 46310 31722 15315 9750 26987 38412 62725
16946 62725 64972 36709 -243 -25401 -24702 -26012 -44921 -10592 25812 54812 48111 58480 78159
16933 78159 83757 48792 23000 41045 35092 31073 25447 12608 -23399 -6983 31602 34644 54855
16920 54855 59914 32451 16866 8080 27028 4374 27461 42063 9454 -24941 -36948 -1982
16908 -1982 31435 34439 28097 34115 10475 -23667 -46981 -39664 -20758 11641 9052 30476 42611
16895 42611 26033 26142 24687 2368 8566 -17427 -33924 -28929 -46763 -88410 -76394 -63425 -75862
16882 -75862 -55318 -53585 -47627 -34092 -29491 -38458 -19210 -27621 -17760 -3684 -16634 -53109 -44215
16869 -44215 -31332 -38369 -27226 10011 32939 26451 21417 -2854 -29934 -60162 -49841 -32501
16857 -32501 18259 34752 11416 578 -17079 -37185 -69211 -49860 -6631 -5681 -14059 7284
16845 7284 6664 -22718 3322 -4326 -10713 8219 25749 28537 35965 19512 -9962 -21993 8282
16832 8282 33655 12784 7770 9836 10517 43179 41984 26405 22865 18635 48944 45675 -223
16819 -223 -6234 -548 -36567 -56140 -48688 -30231 -25813 73 1358 1675 -16432 -22492 20015 37010
16805 37010 16825 -10070 -26424 -21627 -39780 -53272 -31080 -18902 5637 -7854 -5623 -10411
16793 -10411 -17169 -4885 -20558 15695 22827 19220 16922 4759 22122 29226 34406 11292 -12285
16780 -12285 -6494 -4357 -1305 -2278 21200 45722 54476 6145 -17849 5919 23817 1602 -11830
16767 -11830 -13188 -19143 6712 16861 8949 4653 2621 14063 35856 19837 -28758 -65288 -59647
16754 -59647 -32903 942 -9342 -36605 -40429 -4911 15090 11774 21738 684 -31418 -46450
16742 -46450 -49984 -48004 -38191 -41076 -33029 -33380 -35572 -31550 -39210 -15975 19602 31048 18763 -17044
16728 -17044 -19707 -37459 -28188 -30021 -39548 -49169 -71929 -66015 -26001 2923 4575 -2480 -17915
16715 -17915 -29109 -45758 -28961 -16967 -30759 -40610 -33686 -5504 -365 -10193 -11752 11743 4208
16702 4208 -15709 -20565 -44568 -11888 31903 51375 38873 22806 18113 41810 48404 15084
16690 15084 11327 -22408 -12072 30182 35185 38373 37700 34472 25061 4605 -21974 -8296 -2254
16677 -2254 6240 12592 11447 12919 -15911 -32675 -27569 -26430 -27753 -9601 13564 24532 47244
16664 47244 36973 11758 -32845 -16203 28134 29978 -7338 -15691 251 959 13823 -10392
16652 -10392 -49687 -58852 -45873 -39404 -22266 -8878 9038 27418 20890 35243 38538 11041
16640 11041 -31200 -15912 8737 -8303 -2986 90 8165 -2622 8039 14505 18959 -26128 -35997
16627 -35997 -18648 -7290 -2478 18514 6963 -25292 -41725 -51172 -15058 12330 25934 24567
16615 24567 43263 39847 31562 5784 8572 14463 6255 6623 31160 38538 48458 32216 5091
16602 5091 -26168 1233 -8906 -27819 -11230 -5382 7197 -3503 -23757 -11316 -2215 8437
16590 8437 32488 27693 -13646 -8099 -13287 1233 24088 22133 -13415 -8185 24381 9457 -36266
16577 -36266 -27818 -18234 -10592 -19199 -41778 -62449 -35803 -33692 -38917 -27990 -26537 -13104 -10992
16564 -10992 4486 17750 -14688 -36014 -32370 -23685 -3070 5064 -7633 -12525 293 -10046
16552 -10046 -33343 -26843 -46266 -73422 -60428 -66321 -80850 -74623 -50183 -19386 -32812 -50510
16540 -50510 -50286 -33484 -21933 -6647 -811 -6635 -12388 -37806 -29049 -15036 -27096 -39824 -26348
16527 -26348 -10399 -133 -13283 -15662 -12200 290 -2306 -30676 -31133 -35485 -30730 -3853 31479
16514 31479 6443 -27276 -10933 13162 18458 6421 -1529 -19142 -59565 -51377 -23593 -1250
16502 -1250 -28370 -50130 -36394 -8319 -1945 -18792 -40536 -47012 -48692 -53433 -15959 25744 53206
16489 53206 51426 73097 61412 45890 46337 39537 19677 8214 -26206 -3282 27114 32477 -1633
16476 -1633 -9283 10203 13903 5267 -9168 -19905 -17594 -539 -1913 -19653 6903 19672 17280
16463 17280 30187 37379 35445 18107 14112 30007 31578 62134 59164 18678 -2620 -1066 -382
16450 -382 -6841 -27242 -14094 19515 26695 8309 -7043 12032 23833 12901 6941 -1891 21573
16437 21573 10770 -11983 13104 36162 30957 1216 -18116 -3558 -10330 -34712 -48526 -22909
16425 -22909 11176 19195 38459 36080 33149 14188 4531 -17217 7170 34660 7356 -33888
16413 -33888 -45123 -44149 -49870 -57901 -71121 -83553 -78916 -50978 11568 20049 573 779 9891
16400 9891 -15004 -33459 -20067 26956 33470 29452 25160 -13454 -20253 -26454 -32820 -30776 -30734 -25056
16386 -25056 -15601 -1601 -22861 -39849 -43280 -39452 -33411 -36920 -38210 8507 49066 35963 16054
16373 16054 13127 24869 31863 10983 -9717 -13257 2976 -2445 -16706 -19775 -6235 2169 8317
16360 8317 -8932 -31628 -51670 -35958 -25997 -47759 -34761 -11026 -4805 -2737 19111 -7243
16348 -7243 -30188 11513 23222 30706 11737 -6364 16336 9250 6009 -30720 -41509 -31440
16336 -31440 -474 18662 24190 7817 5962 -12709 -3361 30303 24044 -10228 4939 34316
16324 34316 7292 -1738 -195 282 -6551 -5131 -24169 -44134 -56567 -32426 -35242 -11341 -10068
16311 -10068 -15621 -35417 -56631 -55588 -25738 -7047 37192 33776 -13644 -50065 -44617 -7756
16299 -7756 7388 -416 -17274 -36085 -30140 -16342 -32416 -19463 -17039 -28997 -41454 -38560 -29182
16286 -29182 -22126 -22795 3682 15010 17608 -6674 -9011 -10951 -12161 -5121 -10400 -23691 -6539
16273 -6539 11640 33399 60764 31731 34263 23667 41290 18682 -39212 -46667 -55131 -44813
16261 -44813 -43656 -18717 -9750 -32964 -13707 -17885 -22838 20008 35836 30282 43136 23067 -14595
16248 -14595 -15361 397 21799 -966 -7788 15468 18429 1637 -4745 -6449 -19972 -25659 -32254
16235 -32254 -15423 -3574 9758 15059 18841 -4387 -30070 -12905 -30302 -33669 -35682 7231
16223 7231 6151 -4076 -6234 -11651 -46230 -21687 -14712 -28329 -8682 3308 3774 24837 31903
16210 31903 10721 1090 -6185 -6594 4345 22450 -4691 12651 32091 4539 10052 37464 30989
16197 30989 55363 45224 6833 -10783 -9117 6604 -5012 -16681 -44290 -34487 -55385 -56270
16185 -56270 -19207 -16367 -65092 -61074 -31656 -30787 -48823 -49307 -30719 -20423 -10482 -25064 -35092
16172 -35092 3481 9573 10061 3619 10139 -6407 -8608 -20733 -11935 219 -25475 -26412 -21339 -36176
16158 -36176 -14778 -4054 16014 32928 56274 64018 27148 -34935 -48275 -27811 -20804 -3687
16146 -3687 -1225 3519 122 12354 18050 11712 -5247 11795 27251 24897 -6131 -3616 45464
16133 45464 38130 -4866 -10083 10368 29570 18730 -2160 -16115 -11153 -12292 -789 -29538
16121 -29538 -29790 -35310 -34407 16422 3085 -18364 -2183 16709 -6378 -20379 -1592 -14644 -12898
16108 -12898 -11668 -27901 -29712 -39866 -20937 -13524 -13135 17305 32458 42272 21648 -18531 -26146
16095 -26146 -18918 -13247 21289 25326 11104 8405 3468 -11217 -25780 -29676 -12511 -9154 11208
16082 11208 24177 11509 3045 3816 10840 36190 9834 -5828 -14516 -1384 21141 13744 4722
16069 4722 -885 11025 11058 -4619 -14768 -21396 -30749 -24430 25020 24857 1863 -2616 15400 -3398
16055 -3398 -11414 -7115 -5253 -6532 -25042 -31333 -30936 -21820 -23564 -20627 -6386 9773 17998 25376
16041 25376 14795 11719 16796 2887 11270 4139 -3381 -33656 -24703 -16381 13702 10099 17904
16028 17904 -981 -14258 -38297 -36084 -16596 -21321 15233 15366 1817 7887 -26663 -58910 -71022
16015 -71022 -77104 -61015 -61953 -49677 -45839 -40298 -38877 -29976 3244 23819 60 6355 17553
16002 17553 4598 1677 1153 8015 30009 19571 15503 16305 5874 -10998 -39193 -39205 -33589 -20836
15988 -20836 -21290 -19891 -6148 -6085 -2908 15503 16052 16632 18590 -20669 -59687 -39954 -31580 -20194
15974 -20194 -22426 -12549 -17229 -27664 -39987 -18949 9744 23256 10094 -10436 -14451 -15708 -37121
15961 -37121 -62708 -54187 -46149 -29352 -15896 -33355 -43478 -46350 -67698 -63898 -46545 -42349 -45527
15948 -45527 -20128 -4314 16287 48523 53339 42064 7581 -11219 18534 15409 -7272 -34852
15936 -34852 -44560 -32137 -16969 601 -15939 -40660 -47695 -55677 -54726 -44679 -31835 -31725 -39531
15923 -39531 -9698 -16160 -12605 13891 -1875 -7564 1045 17091 16423 4155 -15904 -39758 -38147
15910 -38147 -25035 1419 -17364 -5117 -10151 -10641 -10566 -8447 -17518 -29363 -30006 -46154 -50928 -29865
15896 -29865 -5178 -5247 -5282 -9848 -10519 -17479 -29016 -20747 -5401 -20212 2985 -12592 -25615 -43392
15882 -43392 -38909 7441 13789 -17215 -31475 -35687 -27541 -43350 -49171 -28393 829 3165 -8179
15869 -8179 3898 16276 627 -5882 9508 38874 31564 18994 40236 27510 6226 -5754
15857 -5754 17794 2529 -41670 -51022 -37028 387 18799 27322 40663 45997 43842 57798 31344
15844 31344 -32802 -22650 9258 13907 19538 11975 -6522 -35310 -63150 -51869 -10004 -7107
15832 -7107 -23725 5660 18806 -20600 -29121 -18476 -5624 11292 10394 604 -20808 -21028 18641
15819 18641 36077 10438 5247 3581 -23474 -13588 1259 24670 44531 66224 52312 66905
15807 66905 63578 38908 16432 7596 -8293 -12733 -1769 -5601 3001 53780 61855 38040 -5739
15794 -5739 -14486 5399 30153 30296 -10854 -14003 -905 -11561 -41784 -35756 -5829 21941 47802
15781 47802 58253 25968 622 -21559 -43285 -25322 -11103 -29243 -38931 -28824 3131 -2156
15769 -2156 -26078 -36752 -5222 5485 -24895 -41816 -32216 -22156 -3385 -27731 -52568 -47481
15757 -47481 -30927 -29438 -24924 -6558 -15305 -38669 -56773 -62947 -33852 -1752 16766 783
15745 783 -1745 -20329 -18519 -9552 -27186 -55998 -42159 -37533 -41771 -66339 -97924 -88732 -58043
15732 -58043 -43451 -9956 -9045 -22000 -27534 -41791 -74658 -46318 -40103 -51405 -9209 1857
15720 1857 26866 35133 42457 33844 10258 9225 22166 18834 6611 15161 23252 16255 1374
15707 1374 -26897 -40910 -32537 -51212 -38563 -22967 -24380 3175 -2684 -15773 -708 18740
15695 18740 24228 23233 37784 -741 9935 42829 42419 50392 38709 58726 76165 73104 57628
15682 57628 51252 11339 19421 10987 7076 2937 -23876 -43497 -37367 -49034 -36661 -51416 -52250
15669 -52250 -11293 7610 -29517 -17444 -16215 425 -1083 -4432 -20324 -25284 5502 9999 11209
15656 11209 5308 16830 35717 14048 7641 -13431 -42787 -53612 -44016 -37128 -15747 15364
15644 15364 43403 39750 -573 3787 23480 27228 18283 4242 -5402 3066 19339 24282 21143
15631 21143 29362 7498 -5808 -39159 -56527 -40376 -14593 -12981 -25725 -22265 -19702 -10629 -26230
15618 -26230 -48843 -28748 -8218 -10568 -47795 -57679 -57596 -37730 -21541 -13365 -26878 -38631 -26226
15605 -26226 -4517 -6598 -16518 10931 9085 11546 15488 3975 8295 -13168 3717 31332 23825
15592 23825 -4610 1054 -17122 -20666 -11007 -24371 -25756 -62201 -95058 -68896 -26192 19069
15580 19069 31383 44793 29693 31804 22893 -22039 -17572 13483 -3856 -19717 -20804 -10660
15568 -10660 -10533 -12505 -13687 -23310 -2781 35033 19822 5067 -307 -47294 -74365 -65093 -69454
15555 -69454 -56076 -51220 -56898 -44645 -23877 -32854 -13648 -6364 -10706 -869 -8813 -3106 -5218
15542 -5218 12217 15557 19193 20056 24840 52601 76668 58106 25896 41841 42072 12797 -21154
15529 -21154 -21537 -15200 -949 11786 18968 31036 28532 -12913 -30536 -9793 11981 42528 33190
15516 33190 -8856 -35756 -9736 8253 26250 37051 17572 21069 24145 21107 21599 38515 33195
15503 33195 28467 39407 30666 8308 23528 57794 64106 49165 8304 -1056 11912 30714
15491 30714 48467 27802 -9629 -5643 19678 40858 26545 5986 49487 69174 51267 13727
15479 13727 -38217 -29599 -29132 5815 4554 11868 -12912 -12528 18785 -9096 -20061 6130 -2848
15466 -2848 -12627 -15187 -33116 -46173 -24961 5720 21337 21555 36778 47387 50907 25286 -4439
15453 -4439 -12996 -16559 2740 11475 4673 -8311 -37533 -41964 -23206 -9948 5297 21568 15199
15440 15199 -19371 -22169 -16370 -26684 -35518 -29604 260 8591 -2481 -4309 -15724 -18109 -16282
15427 -16282 -37081 -46336 -27332 -3666 2483 23254 7302 26192 29584 11175 8729 23089
15415 23089 13573 -7088 -16140 -8731 13884 50605 63967 33516 -2373 -23130 -5029 -9944
15403 -9944 -23696 -37038 -34850 -30301 -34319 -13757 -1847 -25043 -26807 -11066 16474 2379 -10659
15390 -10659 -23090 -13070 -540 -15360 -43408 -46094 -31448 -20501 -52890 -46950 -51161 -36701
15378 -36701 -3458 -7310 -30062 -57986 -41562 -1514 27078 17127 7163 20555 9228 10866
15366 10866 16634 9207 15909 32518 31474 12705 -12590 -4092 23386 39953 15325 7126 -4939
15353 -4939 -6547 -6188 -12698 -42751 -66881 -48471 -38806 -39047 -27147 -16479 -20396 -31920 -33798 -31389
15339 -31389 -18693 -3542 13336 33178 19359 -6472 -23193 -23205 -6773 6537 10019 27274
15327 27274 59740 51538 12527 10305 16003 37943 31439 -19056 -36961 -561 12232 -9624
15315 -9624 -29856 -16458 2130 19324 7674 493 181 -8843 -12207 -4544 5435 -1306 -11433
15302 -11433 15779 32827 16836 2990 35745 11297 -14642 -6788 4602 -7000 -1075 24202
15290 24202 29983 17229 1884 -11331 -14141 -17891 -22699 -34615 -60909 -81360 -104290 -76213
15278 -76213 -58528 -40635 -48099 -29442 4925 -8222 -23930 -14856 -31518 -34479 -6471 -7834
15266 -7834 -14627 -24998 7429 6961 -28858 -35639 -51519 -46519 -16909 -3564 -14126 -3668 -29828
15253 -29828 -35957 -22723 -33923 -47157 -49303 -50092 -36453 -42339 -56426 -44155 144 57155 44513
15240 44513 21036 13117 -23332 -26460 9426 46717 47202 43554 47396 17634 -12819 -21191 -18946
15227 -18946 -13395 19527 41330 17866 1780 -593 -30903 -42732 -9704 -24666 -39137 -14419
15215 -14419 783 10277 -7258 4397 -13012 -43947 -55045 -48887 -43601 -28257 -13338 -6416
15203 -6416 -6565 18448 7309 -41145 -26101 -8988 1941 30841 47962 33091 12714 5815
15191 5815 23131 28957 2047 2914 10438 18167 21851 17613 25527 31139 33705 23017 13098 30175
15177 30175 27738 756 -20555 -16845 -42103 -24595 -10424 8575 29738 22322 18401 8184
15165 8184 7308 34295 39318 25261 16628 30170 37723 33395 33466 56964 74842 83990 63334 42713
15151 42713 42262 28760 13268 2937 -26217 -47455 -41713 -47118 -42254 -24923 21525 22010 -2513
15138 -2513 -8672 -20432 -29250 -16921 15700 10957 -5174 -11047 -31020 -3755 7894 9847 -3246
15125 -3246 -30223 -30182 1163 9968 14483 31257 13606 20634 17440 -1665 -22158 -24664 -32931 -47627
15111 -47627 -21796 -2374 -5690 -15239 -30220 -24234 1253 13842 6893 -8340 -6028 -1445 -3776
15098 -3776 30236 38511 36434 30451 8891 -11557 -2743 -8284 -26346 -57225 -50519 -6763 -14691
15085 -14691 -29461 -41367 -34173 -3558 20425 16468 -12451 -23309 -19077 -2786 6802 -27734
15073 -27734 -36392 3942 31889 39885 22831 24804 39670 46277 15275 -9889 -4304 2449 19010
15060 19010 23959 -1981 -9750 -15974 -43386 -59151 -85450 -74406 -56776 -23956 -17016 -35896
15048 -35896 -53580 -58964 -45507 -28542 -56344 -41234 -23141 6314 6567 1714 -14745 -30707
15036 -30707 -28603 -50992 -20480 -4204 -9919 19450 49046 60068 77562 74587 56809 19103
15024 19103 29405 24117 -3 -11220 -10929 1621 26393 24396 -14588 -31620 -33766 -33123 -27574
15011 -27574 -43811 -54848 -57032 -36198 2968 26837 4607 419 -3320 13111 -3164 -18536
14999 -18536 -12854 -20759 -3761 27695 33472 21374 5146 17607 6940 344 -39958 -40310 -41923
14986 -41923 -37888 -30897 -1767 -3030 -22496 -25421 -18142 -18409 -39924 -36527 -12838 16829 513
14973 513 -22224 -8252 10190 -9301 -43481 -42377 -31401 -39441 -25884 -24585 -2542 -7025 -24450
14960 -24450 -22588 -23646 -12818 -13231 -13004 -16778 -47849 -43414 -51569 -57119 -37999 -11434 -16940 -28432
14946 -28432 -16364 671 -12014 50 3137 5669 22858 28587 -5619 374 3033 17262 34199
14933 34199 19801 -7238 7445 21404 -4841 -14113 -7089 -14723 -825 19602 5395 -5685
14921 -5685 -11019 -3219 -22362 -22913 -27380 -40708 -25881 -12041 -24519 -19157 -22092 4437 3100
14908 3100 -31209 -24499 -8410 -10473 -12719 -3448 -1873 -11347 -19076 -6911 5965 11394 13360 25063
14894 25063 39958 53790 30305 -19717 -30440 -39492 -14490 17279 27074 27004 29664 25525 4524
14881 4524 59 191 20113 27516 19081 5882 -2471 -895 -39844 -54086 -36855 -23649 4961
14868 4961 10059 8032 23424 37499 49245 28099 4052 -6988 -821 -3775 21273 44784 36539
14855 36539 18803 468 -28260 -16280 -157 13462 -10368 -32462 -29956 -42091 -44268 -36092
14843 -36092 -34107 -40712 -38894 -31664 -849 53051 47733 38664 24866 2840 -1289 11581 11900
14830 11900 14960 9134 27998 33963 29033 26289 10708 -26511 -30024 -1252 16021 33132 23362
14817 23362 15315 1220 14179 23597 3078 -9951 76 -751 1396 19849 28641 21351 10671
14804 10671 7476 8692 42264 38036 39904 22513 -9823 -46790 -74120 -53848 -20526 462
14792 462 14214 25880 36663 39263 -14909 -37240 -21413 -27235 -18835 4902 12639 15913 -12377
14779 -12377 -25481 -12215 -24174 -21579 -9604 -1907 -15051 -37723 -42328 8795 26018 22704
14767 22704 928 -24496 -43684 -57856 -36567 11282 1255 -12239 1276 -10260 -23645 -2508
14755 -2508 14717 23785 5052 -23720 -29652 -27166 -12056 -1932 17805 33845 29693 44503 55226
14742 55226 36503 38869 46054 30747 40686 48018 67980 50406 13850 -5173 26556 11315
14730 11315 2021 18433 20522 21525 29322 41447 38299 8309 -12940 -13588 -15779 -3564 -5819
14717 -5819 6110 2503 7762 -4047 -33907 -18629 -7329 -6749 -27145 -9983 7407 -3001 -32395
14704 -32395 -51468 -25350 6596 8985 3261 22476 39274 49763 36081 7060 -14280 8352
14692 8352 18426 -27557 -52173 -21932 5606 24872 1191 -18203 -16354 -36563 -54535 -27381
14680 -27381 638 29732 40452 2907 -2408 -3063 -20932 -42697 -35183 -36374 -48072 -5739 5455
14667 5455 3153 -4943 -24262 -47560 -51982 -22721 -30550 -49452 -67137 -52645 -47507 -65591 -68573
14654 -68573 -36384 -33712 -39215 -32697 -38884 -17372 -8753 -14178 -21692 -16479 -21178 -29620 -24790 -16675
14640 -16675 -21388 -962 -3448 -18495 -39831 -24683 -1942 4128 21213 35762 33757 22966
14628 22966 -9263 140 10197 -595 13051 26935 13031 7457 -14371 -55253 -31513 -15862
14616 -15862 2220 29376 38120 19623 10170 20928 27944 9802 -12211 -8116 -13593 -8019 -10254
14603 -10254 -974 -16579 -21272 -31548 -29899 -7593 -9313 -10076 -5642 14668 53255 50472 19568
14590 19568 13586 -8081 14650 10075 -11274 -9590 -20697 2699 10217 6328 -6837 -14609 -5998
14577 -5998 -11816 3727 -6196 -4395 -2401 227 15936 18740 23641 33568 38885 26911 29420 27927
14563 27927 36845 24512 -36133 -58815 -44948 -46969 -28621 -16596 403 21933 18361 9683
14551 9683 -11595 -28485 -10234 -12989 -27702 -5703 13985 -983 -22520 -11802 -13850 323
14539 323 6300 14240 8309 18728 18790 13355 4724 8969 32810 35708 31414 11482 -15042 -25324
14525 -25324 -41283 -50544 -45835 -29633 -16941 -2032 33101 30113 59407 38922 -8167 4313
14513 4313 4772 -1194 9474 733 -7551 -8676 -18037 -26807 7954 29281 40989 26459 21746 6460
14499 6460 -6455 12576 21557 4437 -11442 1740 7835 5338 -18547 -5102 10601 13414 9071
14486 9071 -10191 -6162 22618 46013 38150 14376 -6380 26515 48387 36106 22570 12079
14474 12079 20750 41213 40699 27772 18829 31848 22759 16652 23868 6896 -19209 -51482 -73849
14461 -73849 -60333 -11413 14477 22729 2020 10231 36313 68049 78673 37888 13350 -15157
14449 -15157 -9636 -36839 -29789 -15031 -17130 -32517 -32039 -34508 -45361 -13806 -2996 -7021 -24943
14436 -24943 -36690 -47732 -51406 -26260 -13375 -21160 -43731 -29830 -10636 13950 -4360 -24913
14424 -24913 -11465 -5813 -14344 -14580 -26092 -56590 -61899 -39257 -24410 -9427 -7837 -5649 9760
14411 9760 27054 22432 18036 12072 20334 22005 6161 -8546 16366 34352 25751 33147 24539
14398 24539 18069 8867 19437 -17725 -32339 -52826 -16674 9346 17325 -11037 -21783 -433
14386 -433 14410 4383 19771 7504 7670 12751 23628 22608 14920 20344 42949 36242 5722
14373 5722 -9628 -24435 -38177 -17808 4398 -4792 -24214 -21040 4816 -158 -10523 -39363
14361 -39363 -53037 -35712 22163 60302 39531 -3288 -3636 -11053 -2062 14008 33419 51799
14349 51799 36578 8704 -14299 -16945 8489 37796 19286 323 604 12785 46908 50402
14337 50402 14397 9597 10744 29313 21037 -18682 -38739 -41001 -57811 -52251 -30754 16612 30585
14324 30585 28355 -10330 -17234 -21240 -18946 -21880 -30302 -43348 -27458 -26709 -6688 -30067 -26841
14311 -26841 8902 14201 28982 17243 -17455 -31172 -11208 -18640 -18182 -7562 22947 4460
14299 4460 -933 -8042 -8522 -19985 -31230 -21055 -25534 -54919 -76045 -43808 -3413 34143 37543
14286 37543 17269 -19424 -16822 -3663 842 -791 -22116 6410 51876 83514 56341 24663
14274 24663 -2694 10953 847 -16937 -20385 -826 -17682 -24379 -21907 -30477 -19352 18746
14262 18746 19807 -926 -17932 -8938 15111 8 5728 2552 -7409 -19198 -37945 -15012 -25306
14249 -25306 2156 15147 -18872 -27514 -20772 -10259 -3916 -5005 -5019 -7614 -401 12241 -3689
14236 -3689 -30369 -35243 -40820 -18940 12977 36188 17764 7432 18738 6459 10173 17983 25886
14223 25886 7844 19539 13681 4908 -25418 15633 49793 16840 -15158 -8810 38181 51463
14211 51463 51838 66169 74932 91705 72201 55186 47258 58493 54004 18674 -12868 -19920 -6530
14198 -6530 -28465 -31201 -26649 4710 22953 28908 15323 -17757 -15980 -22093 2317 -493 -29567
14185 -29567 4868 11556 17155 23790 9909 -13114 -11213 -3715 2288 10871 -827 -7838 -3696
14172 -3696 -13601 -20876 7732 10529 -22775 -29032 -16230 22380 40543 55506 63744 58352 33587
14159 33587 20606 21620 15796 -9391 -10097 11529 8435 -29195 -29623 -10174 3791 9405 23597
14146 23597 34070 33454 23697 26283 19099 1016 -23161 -53364 -67547 -43502 -35509 -2249 23601
14133 23601 12945 3622 -6803 -8695 -16411 -23544 -29206 -34510 -23153 1978 9098 5629 -648
14120 -648 5624 -3722 -4016 9971 5938 -9265 -19784 -7442 56888 54188 -4401 -38701 -20076
14107 -20076 -484 5741 25634 43445 20790 6612 26875 -863 -19078 28682 61907 87157
14095 87157 87196 66007 35214 21128 17547 14730 3780 -4601 -29041 -33595 -39126 -21540 -34587
14082 -34587 -30123 -1240 22320 23736 13994 30529 57636 38215 12799 -1914 2452 16374
14070 16374 42464 58382 30286 -13621 -5742 2229 -12350 -9605 -7723 18225 44154 32384
14058 32384 -12649 -40692 -9368 4877 2955 -6582 -9830 -12285 194 37795 23955 -23189
14046 -23189 -32149 -31176 2211 8596 26202 -25036 -39283 -35789 -17173 -12085 -3740 19015 52829
14033 52829 42759 15544 15703 12171 6159 6517 46935 62201 83887 72778 37281 8824 2908
14020 2908 -20876 -24166 -21682 9604 37787 30882 47382 41214 47284 41942 34941 7547 -9572
14007 -9572 3738 -3566 -8760 11816 -9386 1750 7244 -4442 503 21265 3922 29960 54026
13994 54026 31178 19475 6223 -23604 -3659 -9618 -24967 -26037 -5808 -8857 9176 22853
13982 22853 20359 8963 123 -33890 -38841 -12098 -16115 -20482 -37149 -49348 -37666 -19278 -22160
13969 -22160 -2720 35263 37176 5697 -12669 -12783 -11162 -5021 16215 1124 18188 23312 17809
13956 17809 21113 10513 -20142 -5215 19938 38079 16517 -31908 -39908 -30076 -12275 24478
13944 24478 46815 33857 13917 -9605 -5805 17449 5092 -18920 -15752 -10640 7407 -8596
13932 -8596 -27990 -18041 9837 12654 43990 43646 25550 50054 37305 1774 -47360 -78774 -68967
13919 -68967 -48580 -10001 -17326 25457 41893 30116 14156 35338 42221 21530 -7015 -32363
13907 -32363 -52150 -15754 9499 41459 41996 13614 -215 -27245 -24334 -28927 -25883 -3491 -3565
13894 -3565 -6645 4349 33946 29637 27511 45781 62785 69247 51430 37588 40592 36979 -19675
13881 -19675 -36026 -37911 -19654 6606 11908 14330 -8299 -39501 -36568 -41427 -30364 -323 -13958
13868 -13958 -15277 23089 15151 -742 7087 39124 13660 -10528 -23906 -8906 7288 -3407
13856 -3407 6950 28525 11424 8423 23396 9967 -15069 -25520 -23867 -1330 9477 1553
13844 1553 6917 9919 -5082 -4334 -7553 -22157 -53454 -33213 1742 32820 39900 22177 37330
13831 37330 52691 36865 28612 44202 30327 22445 -5086 -33841 -22457 -39175 -47479 -28464
13819 -28464 -2589 -34647 -54225 -37953 -6901 27880 35621 39979 25629 42941 72221 58325
13807 58325 11300 -20370 23308 47744 5454 -16434 5468 2279 -20294 -46184 -49912 -47055
13795 -47055 -41315 -12313 -9190 -4133 20973 3852 -23526 -23822 -25589 -11702 2561 31888 40169
13782 40169 9374 -6208 3945 -9568 -4873 19283 35283 40886 61732 38523 24506 -1668
13770 -1668 444 6515 1154 -96 -4070 -25710 -72046 -55524 -20971 7973 22293 35354 45578
13757 45578 1449 -10724 36383 47185 50326 52753 37461 42007 27008 7763 12746 10317 -9935
13744 -9935 -30417 -4998 27103 36173 56335 43257 47145 50989 45463 42164 54511 41216 48549
13731 48549 30413 -8196 -25040 -35795 -26435 -11881 25366 21745 13237 6977 -27216 -30117 -32940
13718 -32940 -33260 -6231 10962 30832 33868 28539 14820 -1088 -21304 -31248 -25406 -42776 -30376
13705 -30376 -20501 -14161 11995 -9467 -28537 -10804 2488 14778 4282 13759 33680 19063
13693 19063 19358 38125 26992 36757 24018 -5587 13347 27021 53827 36877 -10889 -25375
13681 -25375 -28314 -7966 27125 28496 -6954 -3373 19419 34184 3147 7813 14348 -17757 -1692
13668 -1692 17721 27255 58333 111047 85912 43439 22037 17527 7708 -13176 -3707 3636 -22
13655 -22 13149 -2787 11657 7322 -2524 -17873 -16559 -12170 -2433 -15542 -32870 -10375 39691
13642 39691 41981 48641 49835 39912 9651 -22758 -9272 18418 50644 59392 35389 13294 -1686
13629 -1686 34912 62131 48962 16622 11255 2097 -1404 -12718 7789 14963 51237 51109 29559
13616 29559 27040 3663 -10363 -33880 25289 62169 56308 34363 7110 7042 17340 19316 23639
13603 23639 619 -8057 -9288 -2574 5440 9477 19488 37319 32674 5539 -11281 3548 26014
13590 26014 64219 54809 38721 28556 5603 27827 24828 24071 2815 -2944 2167 -1182 -2891
13577 -2891 -24290 -16842 36458 18168 -15119 -7705 506 5962 -10401 -20205 -26231 -14450 -6883
13564 -6883 2482 12234 19441 47011 45612 52929 38851 -1808 -222 14956 21783 11031 7801
13551 7801 16322 23077 41938 39348 19199 152 -26727 -37946 -10915 2377 -7525 3843 16466
13538 16466 1375 21047 8824 -15107 -4066 146 -8284 4277 25862 12983 12626 5788 -5748
13525 -5748 -13811 -6814 8282 -14345 -10625 13357 25487 19810 19787 30185 21982 13826 16547 28389
13511 28389 32393 19268 22056 -611 -13725 9769 7344 17845 16215 39006 47893 33134 11600
13498 11600 3769 19737 15526 36294 26665 -752 -20691 -30449 -32767 19993 43500 35231 34501
13485 34501 37520 3970 17453 905 -997 41380 56424 38570 38643 17973 3935 -2506 -37865
13472 -37865 -39677 -35956 -23429 -36359 -37696 -56104 -50887 -21583 10118 5362 16136 -16993 -62302
13459 -62302 -77977 -67492 -47689 -28941 -14001 -27697 -30417 -52005 -49029 -46497 -30187 -32658
13447 -32658 -15215 -27972 -41700 -36750 -37722 -33295 -40983 -37354 -29515 -17903 10601 15376 19367
13434 19367 14026 15544 26366 14959 31193 12295 13996 -9871 -32756 -15273 -5000 14584
13422 14584 17926 -940 -11754 -2045 -13324 -14830 16362 37183 53091 11457 -12284 -28298
13410 -28298 -13217 -3593 19908 20145 32991 57109 47478 671 -43656 -27022 -7240 -32805
13398 -32805 -24231 17847 33454 27834 3145 19395 41737 61963 60378 31484 -307 4120
13386 4120 13264 11794 32013 23899 25241 4242 5626 15832 9472 8625 35627 40906 47264 14819
13372 14819 -6407 40097 41821 38028 27706 1009 16701 46606 13941 -14218 -26943 -39746
13360 -39746 -30283 -21581 -20942 -38567 -15942 -24890 -37078 -38258 -8231 15995 24216 26413 40843
13347 40843 34480 18450 37271 67098 54760 55406 78791 101445 71924 12512 -36345 -53231
13335 -53231 -51507 -31135 -24055 -18479 -23918 -26474 -18108 -28947 -2368 11657 17825 23346 17688
13322 17688 16639 49280 31880 27386 43501 33983 2786 8989 13601 5991 -11858 -13983 -8805
13309 -8805 3503 -9178 -22410 3357 23771 33619 15847 -18889 -39222 -53399 -12403 23209
13297 23209 7680 10994 22762 25173 13425 1395 -22455 -31460 -24811 4820 25841 21900 -15716
13284 -15716 -35178 -1497 30532 11498 -2786 39285 67576 50154 35683 52102 38097 1512
13272 1512 -103 41073 54527 19414 31989 43637 57143 59714 68223 39148 34807 24382 17628
13259 17628 11347 19048 36394 18409 -14911 -24300 8549 -5523 -5731 233 -1476 -18918 1985
13246 1985 21145 3389 17894 33025 16172 12898 12408 34299 59969 70936 63927 45483 3231
13233 3231 3948 -17394 -19549 -30874 -18481 -8130 -11205 -22390 -14849 -20541 5117 32282 54265
13220 54265 57659 26499 35453 41602 42477 50737 31044 35200 33828 11819 13408 10679 26129 5694
13206 5694 3652 17637 -6485 -22117 -29692 -27780 -6985 -3004 -3641 -10725 -16611 -26889 -19521 -12611
13192 -12611 11971 37511 2163 -21093 -35972 -22940 -13538 -15738 -1838 15015 87735 100082
13180 100082 47880 23858 29666 33100 33957 20100 22135 19229 17876 13130 9142 -15967 -39541
13167 -39541 -43184 -25786 -24140 -25971 -45082 -45336 -26978 -5366 -10475 -16082 -9292 -98 -1644 9134
13153 9134 4961 6827 -12898 -23022 -11913 -1388 3830 -6046 3102 709 -9316 -25532 -15561
13140 -15561 11567 14332 18907 -991 -9255 3609 -13495 -8243 6965 -5290 -25101 -21557 -16753
13127 -16753 -15687 15914 12636 7488 9443 5128 6751 -3715 8204 -10197 -12197 23139 6424
13114 6424 -44221 -63718 -51904 -40801 -32650 -25140 -31993 -7802 34031 37095 32251 20092 20912
13101 20912 16546 8587 -17504 -36283 -34621 -13168 9407 34759 26578 9808 2769 31877 21700
13088 21700 1665 -29420 -54868 -36831 -18585 -7040 -25327 -21960 -22475 7621 32366 4861
13076 4861 12330 27616 66594 80581 54091 44607 36053 3256 -12602 -8001 -24270 -27156 -25619
13063 -25619 -1030 11698 16229 -21891 -36750 -30180 -10030 35360 45497 57455 35519 -1005
13051 -1005 13957 40594 57746 40253 26494 25547 57704 68672 46659 38626 40356 16095 -28357
13038 -28357 -40060 -40475 -48628 -39150 -28695 -13329 -30231 -13786 4346 5489 37077 45404 40522
13025 40522 22871 11557 6281 14361 1742 -2096 24620 40007 44130 49947 11044 -27784 -52741
13012 -52741 -60040 -31051 -15944 -16165 5864 31132 42487 8190 10390 35050 30981 22207 14196
12999 14196 -8723 -5061 16078 46557 31847 19958 6634 7162 21203 20612 17525 2788 -4735
12986 -4735 -2358 16926 13155 12334 -9934 -25384 -24363 -2530 27375 57324 45904 25702 13161
12973 13161 18870 38321 39049 16549 12959 36069 43280 35090 17711 8841 1398 7008 12468 19436
12959 19436 -1174 -21328 -10070 10374 19861 16824 12158 1412 -19264 13574 10597 -18650
12947 -18650 -25064 -8181 375 18115 9949 759 16204 6115 7468 -17307 -42773 -45310 -62786
12934 -62786 -48164 -20674 -18843 -8850 -16483 -16960 17302 35093 10760 -17467 -46086 -30919 -14415
12921 -14415 -28491 -8604 8880 28037 21026 18988 8548 30417 48201 48102 52234 71171 65514
12908 65514 53803 61477 58536 62075 55838 18866 -32972 -40465 -30676 -16423 -25873 -25256 -34844 -45725
12894 -45725 -35128 -39250 -18299 -12770 -17126 -18503 -14795 -7671 20560 38130 31662 12969 -9993
12881 -9993 -12395 -8344 2394 -9704 -2501 22 -7449 -14393 -20514 2760 9237 26909 20025 31248
12867 31248 18724 -21585 -40126 -32151 -20668 -27225 -33484 -46583 2037 10777 8050 -3737 3309
12854 3309 12550 35523 49818 50572 52433 31013 28004 22419 -5247 -12913 -11404 -16720 -13862 12028
12840 12028 25127 23115 12839 11846 41937 31301 -3261 -16633 16878 45830 34710 29852
12828 29852 50747 28161 11891 18217 36810 19984 -16959 -20901 -23527 -34155 2896 14430
12816 14430 31125 14901 5806 3777 8954 38854 18055 5670 21725 27027 22869 28784 22985
12803 22985 21166 20117 -4635 -15968 -990 -4209 1164 25188 44296 55084 45411 60864 71018
12790 71018 69542 58962 45561 16083 -4917 17399 -6542 -26605 14376 53906 45029 15619
12778 15619 20271 3312 -17635 -25877 -33426 -38870 -8750 1560 2027 -10438 -3297 9732 -5887
12765 -5887 14025 1976 9470 29513 3969 -8936 -21703 -28502 -21893 5917 30050 -11038
12753 -11038 -6611 43561 55266 57483 32373 12081 -7154 -24366 -40374 -30294 5958 30653
12741 30653 18129 -6408 14572 9990 -17642 -18472 -20405 -30638 -34543 -43451 -43122 -12193 43382
12728 43382 72097 47194 24934 16250 30985 34118 51067 60244 36173 17333 6248 -2206
12716 -2206 7800 82 -6774 11736 53722 68469 57949 28875 11720 -17609 -28483 -25363
12704 -25363 1741 22842 40242 13601 4091 13272 1861 -25335 -15820 -20321 933 31768
12692 31768 59056 37339 7191 13420 12041 -12724 -22275 -8349 30158 37599 40304 29755 4383
12679 4383 27274 24936 11042 -4779 -5278 -5843 2523 6629 18744 42748 47476 38058 21416 12741
12665 12741 -14929 -22377 1455 18146 34191 1178 -5759 -2440 -33251 -43560 -13783 -3629
12653 -3629 9385 28801 756 -17891 -40280 -28110 -2911 22150 19409 1216 9946 1664
12641 1664 -21516 -27158 -5212 8796 14290 12231 14735 7809 -4882 -28957 -17410 -11286 9868
12628 9868 42846 41381 32394 30519 35352 2067 23436 37467 27983 15028 9456 8211 14364
12615 14364 -8611 -29664 -36976 -20502 -3208 10887 21874 8831 7685 16349 -4067 -25080
12603 -25080 -21014 -1345 -4564 -9562 1539 8096 -4147 11056 3358 6679 13900 45782 51613
12590 51613 71305 62463 11158 -8933 -6407 20032 47496 64653 57909 33355 10114 -1102
12578 -1102 27717 35137 10978 3151 5837 13651 56483 58301 54810 63577 29686 4398 -8170
12565 -8170 -3828 -8638 -11276 11043 -833 5143 18342 40624 55427 32754 3373 -16965 -7817
12552 -7817 2578 -2851 -5452 -18919 -22818 4633 -12899 -43112 -41546 -16984 15418 9990 12286
12539 12286 4327 25036 41232 1305 -22932 -25096 -37152 -37667 -17681 6235 23088 11099
12527 11099 22147 8162 -12206 -10275 22980 40370 70015 60960 62544 63184 65949 63629 33776
12514 33776 21725 23591 27349 43206 22160 22695 32691 24985 28526 9322 14203 44999 34811
12501 34811 36512 36274 23350 5607 20644 40211 15926 29833 14661 485 -9978 -12350
12489 -12350 -14051 -23168 -20100 -46423 -26444 1723 7182 17253 -25439 -64412 -75499 -67614 -17080
12476 -17080 18256 19270 35373 49378 52286 23247 -15904 -10034 -7124 -29665 -61503 -29951
12464 -29951 -3134 21984 37059 10107 -9666 -2025 -126 -1404 5785 26922 30226 12357 -4022
12451 -4022 -3799 19922 26146 34258 25826 3410 -7097 13755 19592 3063 42645 50537 33049
12438 33049 11143 15055 26782 10626 30977 35070 36652 16939 10264 -9018 -13769 27008 40081
12425 40081 7492 17920 22842 39179 38767 28092 28296 937 -9511 -12567 -18086 -33556 -29004
12412 -29004 -446 1900 -18771 -2684 15489 -15913 -21720 -51643 -23167 14576 36172 8509
12400 8509 -6126 -1734 -15092 -15699 4934 39963 6880 -18072 -18321 -14261 -10019 -8903 5199
12387 5199 34112 53116 50584 9470 -18926 7985 14045 1518 -12575 -2264 14217 24523
12375 24523 20051 -7391 1365 15712 -7627 1420 16207 23494 -886 -5178 -10301 -28153 -1956
12362 -1956 11845 29650 4005 29955 33091 20805 32485 24073 16782 12668 14867 33052 38645
12349 38645 44429 40577 60654 67364 30097 -8705 377 108 8434 22535 29544 23115 50363
12336 50363 60166 62804 67214 87898 77568 50285 37841 39314 54876 60954 49248 53774 59201
12323 59201 42928 35839 34504 14995 13962 10150 -6752 -3268 1072 -25627 -15711 1929 19361
12310 19361 11698 22426 -4694 -28786 -2979 4913 -16488 -47627 -22303 16549 30056 32864
12298 32864 -18377 -49355 -21827 -16338 -16121 -5546 -3635 -9797 -39927 -10096 -4116 -1501 -869
12285 -869 2085 16841 34297 28756 6403 26603 41425 31454 40023 52837 55800 59015 48898
12272 48898 48951 56598 65821 78262 69802 50187 22077 21387 24182 2733 -30178 -37215 -27159 -17736
12258 -17736 -38394 -47345 -42860 -35114 -34338 -30133 -14493 3252 8228 18738 12037 28377 39149
12245 39149 41733 28446 1361 36272 46469 67024 66601 63830 87684 92331 80923 88390 69747
12232 69747 51568 43152 14131 -1137 -3153 -5807 33148 52427 29460 19792 46126 53755 56341
12219 56341 55893 50571 66384 71495 89418 86496 95804 83533 64830 51138 34462 47170 28970
12206 28970 59216 72758 48504 50775 45174 38711 50740 76716 92767 103447 98361 76585
12194 76585 61780 82821 91227 112011 108295 130841 121855 118128 112794 114660 116477 105804 90803
12181 90803 64229 36154 39518 60336 52402 55999 63703 57234 37832 26426 14121 21688 41414
12168 41414 43795 33124 41371 41092 70013 103458 86748 60211 38024 20967 -261 13139
12156 13139 38193 36291 45453 42701 39580 50459 58716 63728 75293 95531 93967 67648 39557
12143 39557 30438 36511 64997 111791 96925 77575 65655 71628 112865 123604 143339 107965
12131 107965 76618 105018 120642 119694 90586 52901 45579 36983 32219 86266 144973 130766
12119 130766 112440 88102 85022 96819 143671 150717 145614 131632 93752 60807 23699 39521
12107 39521 63209 39635 15890 27398 38374 33756 57811 82716 86402 71360 47009 63318
12095 63318 65147 28135 17346 44016 114510 116551 110409 115034 83908 70398 87095 113731
12083 113731 120677 135975 133540 116238 95649 76624 66052 61154 90982 124428 149625 164898
12071 164898 175862 210570 220216 239042 222805 190252 155921 113613 62732 60959 64917 63946
12059 63946 97127 129706 132899 102273 93632 95735 118256 109667 125493 139055 144529 104283 85873
12046 85873 128976 157933 146179 135269 157389 178722 189422 192370 183370 218493 215663 198008
12034 198008 193701 212145 217170 207759 217659 222606 194264 193967 211079 206810 187434 184419 192229
12021 192229 195498 233376 269012 278349 265209 225680 204359 236039 277641 296213 334489 361776
12009 361776 334312 340195 346632 341647 348307 384379 441584 485491 502045 503266 510924 536952 564833
11996 564833 560714 567121 601707 632851 661533 683359 734178 766568 787266 799699 843253 860139
11984 860139 867558 909670 950594 1027747 1062323 1126673 1218865 1282981 1355447 1424936 1519337 1627956
11972 1627956 1721588 1845170 1991618 2133859 2286266 2482766 2695797 2946142 3214271 3529052
11962 3529052 3874588 4284421 4744659 5283080 5924711 6730808 7696834 8878126 10365762
11953 10365762 12217460 14594380 17726421 21846469 27356271 34860136 45071787 58599091
11945 58599091 75364292 93621702 108915852 115123472 109071201 93851079 75765182
11938 75765182 59428457 46487393 36779577 29585797 24191740 20118377 16968763 14428677
11930 14428677 12387135 10739299 9378125 8239739 7249959 6411368 5712890 5105604 4593391
11921 4593391 4150141 3772576 3447694 3165497 2906810 2714225 2551659 2393296 2227121
11912 2227121 2071045 1958294 1870257 1777759 1693053 1604288 1509009 1445474 1383002 1304846 1209260
11901 1209260 1136413 1071381 1039848 1005687 926695 873914 860655 824146 801770 767589 757469
11890 757469 736973 684971 617618 599675 591118 578289 564893 532324 504383 487276 500351 512283
11878 512283 506786 433307 390248 369352 383067 383462 362252 352779 360351 353544 341965 322446 297860
11865 297860 295269 294300 289679 283187 266792 257154 253764 265456 254671 247395 272656 274540 251773
11852 251773 230003 227101 208772 183771 176802 185094 212014 188778 181728 200123 195239 189896 191561
11839 191561 183077 178665 161362 163123 161289 178194 187603 208994 198842 170785 164824 173048 201342
11826 201342 177818 191121 244032 263952 286926 290583 292837 278098 233619 153508 108602 106640
11814 106640 114814 116592 159727 174910 170103 179111 154431 135428 114516 126368 151632 148519
11802 148519 145395 114547 87356 64892 75427 108261 94418 95507 112523 113922 111133 114310
11790 114310 105479 107083 104227 113697 107856 62717 18362 25534 28298 35727 48968 42135 41290 19755
11776 19755 12679 9217 6875 26242 30260 20605 -252 755 26172 67063 94344 76535 59856
11763 59856 73171 83112 102890 95309 82794 82138 62139 32893 32053 50715 60887 61620 70262
11750 70262 35004 21698 3890 9572 38595 34852 52935 52069 34960 50511 43746 50702 48049
11737 48049 61617 70615 66121 71213 101708 90115 75229 51784 34689 17610 -9755 7059
11725 7059 39898 90271 84113 42435 51116 66546 63608 56328 52218 37127 19383 21524 2592
11712 2592 20557 52149 69630 74298 97714 62947 44640 37934 8320 11284 38188 43646 41071
11699 41071 51604 70492 56467 35032 35837 26330 24126 17367 30377 30423 25782 18627 12564 8184
11685 8184 -2253 20210 50314 52893 26173 37695 25482 25214 40785 60600 82006 93436
11673 93436 99908 78147 66642 64376 68122 42786 32772 57251 41528 13545 -6190 -6583 9026
11660 9026 7011 19294 39913 27830 -16341 -37875 -40655 -11784 -15664 -27443 -12639 29537
11648 29537 36101 11688 30020 27601 13830 -6766 -3387 -9550 -18807 -36480 -25021 -19733 -11649
11635 -11649 23584 69394 115858 125479 116850 133279 147447 144339 124303 86172 58624 60310
11623 60310 58729 63094 49853 34950 32723 35068 33242 2812 4497 17162 20770 29187 32343
11610 32343 18945 17646 17179 22538 21494 35800 54869 26830 4700 5948 27448 23442 10180
11597 10180 24578 43013 35819 13334 27887 34530 35761 34714 38180 22534 8954 31883 6695
11584 6695 3207 4018 -9561 2811 -10321 -6699 -18558 -23678 -13788 2046 8444 2996 6960 18267
11570 18267 34977 39586 21561 26046 47255 62944 58014 50567 36414 39636 38694 24166 31049
11557 31049 15903 2865 8006 29607 11501 6713 18976 21458 25293 19509 13495 13650 15883
11544 15883 35769 26633 43655 65389 62302 52301 61888 48081 25614 12283 25111 17277
11532 17277 -10426 3462 9182 -10357 -48832 -55792 -38426 -16752 -7616 -558 6700 16150 16283
11519 16283 2381 -22204 -23127 -22122 -26223 250 10393 29514 34750 15264 11363 -20923 -32608
11506 -32608 -25237 -4284 -24594 -6987 15771 9485 32822 16573 9702 40893 77690 71680
11494 71680 53202 27039 37304 53007 26881 18150 16074 24559 50245 22133 3486 16471
11482 16471 10025 30062 14133 24709 37622 17284 12209 37629 44189 23681 23169 15092 16856
11469 16856 31173 29427 15738 5577 9715 -9446 -1120 35429 49056 16798 12686 28697
11457 28697 12750 23604 51132 40731 38355 31454 48829 85523 87603 75816 64542 56472
11445 56472 63179 52916 45122 37908 42295 33774 17776 11820 17793 39401 48156 12303 13069 31173
11431 31173 40062 30912 5882 2732 11039 31201 18189 -16185 -10921 1778 28945 13321 8924
11418 8924 20133 22451 34532 40453 31765 15422 -9165 -26107 -35187 -8361 -16397 -28763 -52391
11405 -52391 -22989 -22679 -34190 -46923 -33791 -32064 -4493 22236 12374 4409 12 10479 15350
11392 15350 48499 63077 48647 65647 73668 54270 72637 53140 18676 41449 29574 5531
11380 5531 20884 20739 24634 23872 -277 -21147 -3358 9596 32080 28869 13932 5788 17533
11367 17533 9639 10934 37354 39567 33234 57369 71839 49967 51060 48251 38481 39174 32682 5594
11353 5594 -1966 -26156 -1339 9121 4520 24831 30365 32660 46572 33722 19021 24557 38330
11340 38330 57361 49307 55256 76103 69419 32480 8957 -5087 7912 3257 -19649 -42270
11328 -42270 -36871 -60026 -60883 -32809 -3976 -24280 -32278 -5941 1880 4947 -11289 -6049 -14924
11315 -14924 -2680 -616 24091 44577 71842 74368 75187 69167 50268 31364 32252 39589 33286
11302 33286 13053 26634 47691 30539 23273 43870 84641 58508 6637 -7097 -12357 2861
11290 2861 10802 27518 48557 72821 57217 34602 30055 27559 42644 50622 35712 4905 2944
11277 2944 -3459 -27146 -4834 -3735 -15410 533 1164 10718 9172 19455 15386 -6065 -3120
11264 -3120 25065 65840 40363 -4848 -33891 -35455 -6998 1749 743 24578 44362 38493 39878
11251 39878 31129 28715 15166 18593 17593 -888 -4452 6315 14604 11878 10576 15010 1899
11238 1899 3134 32949 50099 42703 49101 40810 38241 69391 64492 53149 61676 47018 26328
11225 26328 15704 6935 -5899 -30103 -18941 25584 55538 79868 71189 84434 75294 80910
11213 80910 65223 47732 20512 22951 27541 38234 62514 65044 35922 18237 19365 18727 22566
11200 22566 1305 -7330 6399 675 6317 21138 41952 31482 11186 6878 -1825 -136 21679
11187 21679 1311 -14378 -6682 36292 23971 18008 21227 7634 21014 8410 9999 21719
11175 21719 11209 15072 -4426 7387 28509 28854 47452 -1369 -32023 -9003 28710 5278
11163 5278 -40618 -20950 9671 -2296 4818 11691 36802 43991 15861 -8543 -27259 -60109
11151 -60109 -55509 -37655 -18268 -2384 22551 50164 64198 32095 39124 34545 31911 40167 39251
11138 39251 38911 39373 38566 35920 20355 8538 -11189 50412 97213 48266 8803 -18617 -18362
11125 -18362 7866 33505 48040 54003 43698 39894 10945 -4862 -10768 -10356 -21 -4661 -3530
11112 -3530 -5390 -35078 -50946 -23755 -17677 -13920 -6155 -2878 12374 8566 -13664 -1110 -4842
11099 -4842 3499 25866 2738 -5191 21409 29568 12196 -11846 -36883 -12460 -893 -17028
11087 -17028 -5918 18895 33197 45295 36222 50477 48475 11198 -16778 -22654 -9640 -35675
11075 -35675 -22696 7489 32496 39238 64281 62297 41782 39634 20033 4051 25849 45991
11063 45991 53389 57271 57603 83572 80832 60696 26155 16925 42382 53744 48076 69409 73746
11050 73746 55369 46030 47280 90955 124885 121410 119588 120592 94733 83703 99039 94607 77140
11037 77140 105405 146032 186386 216678 241536 264945 249696 218683 187611 152964 165979 195260
11025 195260 212539 211964 238416 286906 319487 341122 340627 329067 327060 282086 248490 259073
11013 259073 249796 243269 275738 271003 248696 236042 203626 178839 152513 140685 124879 112855
11001 112855 129198 160640 165321 162676 165777 154676 152523 139535 127586 109497 72652 38255
10989 38255 13894 3435 -21596 -31550 5333 29824 32788 15784 39376 39832 44255 73728 106675
10976 106675 102076 70871 41929 11641 993 -5476 6168 9463 41241 60575 81009 93249
10964 93249 107406 119915 132253 144262 174026 191951 196436 200398 250716 328894 427475 557828
10952 557828 727453 947865 1217942 1479342 1644659 1626308 1413990 1124724 849190 642075
10942 642075 508587 395909 322742 274357 230188 192832 148349 116353 94747 71832 79717
10931 79717 100264 78108 76284 33413 26796 38990 47807 61856 80473 76875 89612 90775 67845
10918 67845 81142 59401 57833 55088 55901 59502 33693 -3114 -2690 -30917 -37792 -33297 -23448 -30648
10904 -30648 -5466 2024 -7354 -29710 -25451 21839 43649 37942 39374 43292 27558 24694 20458
10891 20458 25941 29084 23008 31905 20808 13059 23544 23094 44423 41531 44711 50156 78780 63667
10877 63667 60201 71534 77356 94586 114296 127482 112777 110581 107492 80994 53095 23763
10865 23763 27764 34849 -4217 -9654 -1051 -38186 -60590 -52799 -62192 -61947 -43276 -48097 -11238
10852 -11238 45996 91159 95546 117698 131893 133472 131596 146858 147510 181353 176802 147549 150629
10839 150629 150109 109721 108573 102641 86652 103273 114902 135241 154426 125960 119181 94959
10827 94959 73160 74424 95136 104156 120112 136473 154085 177530 178866 175640 166755 186155 203607
10814 203607 203314 178131 146706 135651 135613 152669 173977 163626 171561 177395 180774 222742 216978
10801 216978 193125 214288 202007 233018 216377 229373 257640 251309 249784 271614 232570 170363
10789 170363 133060 122925 111675 136037 129660 107291 120613 113382 79521 69641 90894 130786
10777 130786 151905 151169 133009 120006 119013 125921 104548 109908 133149 127743 150340 177764 168474
10764 168474 120465 144092 182335 173241 172351 159907 147289 161842 165984 171867 163634 179176 181214
10751 181214 174774 162348 154462 150326 149720 148766 147457 155294 164571 190365 228278 238420 198715
10738 198715 175129 168106 202467 199581 179398 141652 151258 174009 178006 148622 145943 158849
10726 158849 155157 140361 139831 162005 175496 178232 185123 172427 175745 193973 190484 190349 183608
10713 183608 173135 179339 198199 174843 149935 169275 183278 220154 255087 229947 187871 204188
10701 204188 209168 218801 214626 219994 217788 263216 267831 262083 267617 287398 302687 268174 245354
10688 245354 256139 267456 279457 321011 300326 285802 333338 339398 308052 303375 306574 320443
10676 320443 344880 358557 377949 441440 557802 660043 664832 598633 491058 388735 297279
10665 297279 247239 258122 287439 332413 377391 453270 510796 605058 657962 651063 668587 694526
10653 694526 732269 759727 762740 821340 876426 944527 951844 893158 866905 840990 853953 865157
10641 865157 905629 959807 1010405 1037502 1098836 1143931 1213148 1348960 1492863 1625961 1787757
10630 1787757 1929969 2050024 2206989 2439217 2706276 2975913 3334522 3867694 4525285
10621 4525285 5405110 6570320 8073449 9906072 12025159 14243481 16177203 17398371
10613 17398371 17760331 17537625 17197911 17158687 17703139 19080373 21383725 24592040 28610716
10604 28610716 32821372 36106414 37455085 36674182 34560595 32294184 30771412 30482684
10596 30482684 31636537 34270129 38284222 43259786 48149217 51323319 51388729 48360893
10588 48360893 43599945 38778034 34977943 32609731 31774994 32316184 34015514 36426428
10580 36426428 38678352 39629935 38423614 35276561 31237509 27413552 24463637 22561621
10572 22561621 21641019 21560170 22132632 23081171 23977247 24338823 23734773 22282475 20448886
10563 20448886 18781946 17664512 17153604 17218564 17894903 19176256 21163621 23950145 27778705
10554 27778705 32967055 39969359 49551110 62997792 82192258 109726526 148400731
10547 148400731 198939077 255485284 300200731 308896793 275494465 220042965 166083644
10540 166083644 124189555 94435715 73685226 58921034 48067572 39894329 33516517
10533 33516517 28526958 24498581 21217453 18554353 16295922 14398406 12868348 11651196
10525 11651196 10652258 9868221 9312400 8877545 8391057 7761582 7048982 6355314 5750167
10516 5750167 5259404 4815327 4393756 4032061 3719554 3493546 3232536 3017637 2884758
10507 2884758 2776979 2665426 2540540 2394309 2267066 2168965 2093915 2008704 1921233 1836633
10497 1836633 1776006 1721104 1640898 1603999 1560428 1497566 1451994 1384026 1342296 1327824 1335770
10486 1335770 1325681 1268198 1223724 1183430 1116918 1072853 1050692 1010308 970099 930904 874089
10475 874089 834440 807557 782239 783368 826525 830769 804186 769457 721118 689126 680161 669823
10463 669823 680348 660654 649444 658189 671618 673376 657961 630879 593133 536913 492431 471977
10451 471977 471111 462093 449610 432504 410744 421555 425063 417300 430293 433334 452260 466043 481696
10438 481696 466722 425471 384358 384191 395680 357899 363929 388437 414765 449377 465845 498284
10426 498284 524697 539037 612159 672761 661124 599984 485347 329933 229764 185198 229009
10415 229009 304953 318805 332034 372290 382594 377346 361498 355383 349223 344221 337653 298135
10403 298135 269581 274251 274314 235871 221258 191630 189919 190490 203612 200062 199649 181997 196108
10390 196108 208931 197991 205134 214276 187449 145431 160694 174632 167914 109344 80645 83844
10378 83844 96426 120479 129259 133097 122512 119084 141515 117479 87081 108445 120398 136090
10366 136090 161859 186640 163590 147683 141285 121165 133406 169422 182487 179486 159348 129800
10354 129800 102537 58065 36040 20371 32461 26955 27345 26974 29322 75302 102087 103889 81410
10341 81410 65826 80610 101494 82659 65161 75177 74202 46733 23692 52812 105006 95909
10329 95909 76173 54034 37268 50874 68451 60037 78702 85616 68686 66507 54188 67484
10317 67484 73389 44412 30592 75108 108106 106579 108229 101436 75769 62341 56900 34908 16487
10304 16487 44459 67512 125268 128121 131829 112585 104497 112949 108369 78012 75859 55773 62062
10291 62062 59813 72579 78798 68855 73913 54799 72275 107217 110457 76047 45266 57418 91716
10278 91716 85493 64964 29978 8420 3302 9692 8197 -924 34707 45683 42038 31584 11109
10265 11109 3758 15399 42826 52324 39783 5223 -15134 -39407 -32895 -14834 -2629 -12384
10253 -12384 -10501 -25214 -35697 -43048 -20666 -9288 4045 22172 49005 44408 27681 1003
10241 1003 2328 5393 3795 23076 65916 144555 236938 268749 257075 220145 196317 152672
10229 152672 108662 106091 129301 136062 126353 130734 101946 83702 86008 67313 72758 89497 76880
10216 76880 38692 56222 81431 46982 24622 57267 98571 84119 50682 60916 79680 101820
10204 101820 90480 65541 59873 36357 31749 29818 54414 63883 60218 67675 69983 82671 83269
10191 83269 70198 41813 51815 54110 15556 2403 49534 79376 74961 87314 110046 102989
10179 102989 80244 100502 103443 103062 121773 120013 100658 104080 149214 163895 179462 187464 239613
10166 239613 266893 255153 237209 196464 189008 216931 252281 252712 269816 299643 330610 370058
10154 370058 383779 387515 392067 369466 358820 354911 377322 381697 391405 401537 443886 505531
10142 505531 558457 690077 852600 1040078 1292018 1564427 1722145 1720870 1539345 1241907
10132 1241907 974442 788547 622323 483465 415534 344706 300555 293819 279412 258091 201783
10121 201783 148547 98937 80560 76026 77636 83723 101494 90842 99455 81331 55807 48067
10109 48067 67684 91248 85803 78817 64028 57685 48334 59744 65759 58610 58123 68026 63378 45257
10095 45257 24587 17821 29344 34027 26489 15049 -34112 -36476 18336 44816 51574 58740 43528
10082 43528 11253 -3242 3105 5069 32757 40937 13414 -5458 6930 11229 -4828 10354
10070 10354 38937 72249 75054 54173 49101 36729 18834 29719 15978 -10525 2905 19653
10058 19653 36262 57409 62837 64946 36615 7853 -3743 5209 33237 38585 12741 -17333
10046 -17333 -29003 -3651 31878 25463 -2693 -11861 31762 27782 4696 -3098 6087 -15554 -24574
10033 -24574 -9457 213 9859 -7496 -21560 -20164 14011 50041 36091 4493 -4078 -33690
10021 -33690 -54273 -10202 24800 18447 24662 7312 1145 -6122 10766 38394 26702 7831
10009 7831 -9609 -8898 -18778 -16275 -15547 -16861 -5021 1788 -665 -10883 -16084 -13730 4683 5691
9995 5691 -13236 -49530 -50999 15399 47100 29860 32155 33053 3321 -4117 5114 40496 29681
9982 29681 30053 45397 31556 22517 -238 1041 12276 -17284 -61741 -58084 -63173 -67165 -44304
9969 -44304 -17204 17988 51445 82598 32743 19723 34114 29029 25579 28095 4405 -22523
9957 -22523 -49121 -45891 -28540 -40582 -36236 -24562 1404 -4496 -12466 -13503 -109 16074 3607
9944 3607 -24653 -28937 -15850 19404 28017 21445 13338 -9912 -23918 -31615 -19537 -30004 -22451
9931 -22451 -18121 -64831 -68518 -47496 -11899 -2694 -14100 21816 48851 46811 -6068 -30305 -67214
9918 -67214 -68927 -27742 3754 7458 -23171 -50214 -34971 -8729 1728 30747 26015 13852
9906 13852 -23646 -47807 -64441 -64412 -64828 -43862 -24757 -51091 -47104 -43071 -30491 -39652 -27378
9893 -27378 -16107 -16327 -23677 -1435 30656 38044 20023 44801 90760 73808 47534 25983 17990
9880 17990 17967 27252 27617 19984 10401 36979 35334 -4070 13015 34186 30960 28005 28917 29593 15266
9865 15266 -3098 11540 31126 35916 40686 15313 -11836 9500 38596 9373 -10207 -8206
9853 -8206 -33397 -27358 -2766 -38357 -68902 -47119 -22814 -28299 -17478 7622 -4554 -11067 -49128
9840 -49128 -66848 -53363 -25792 4957 1650 8322 -7198 6438 2696 30612 46929 -47
9828 -47 -34723 -44308 -43481 -29453 -5331 -4098 755 8557 16281 32148 29547 1218 -16196 -20460
9814 -20460 -26328 -21806 -20871 -13991 -7048 12632 -4281 -34454 -37204 -39347 -21365 -186 -5686 219
9800 219 44828 69726 54174 30154 27613 17824 16837 41148 29385 51473 47030 29253 6980
9787 6980 14024 14174 12012 31370 40433 11417 3042 30383 48282 57150 34703 46560 40917 43479
9773 43479 27063 8033 17139 12208 -9336 -26768 -12533 -9716 -2872 32362 57953 57056 25696
9760 25696 -11301 -22667 -16743 -52503 -59420 -51377 -60916 -50199 -15871 -13366 -4141 13115 -172
9747 -172 1868 19971 38580 15538 29982 34636 54217 54576 35702 28608 16027 22867 49968
9734 49968 47299 39422 -39612 -85119 -75696 -56181 -37685 -32490 -20457 3416 -12455 -17352 -23206
9721 -23206 -39679 -25434 -16983 -17696 -53756 -56087 -971 20550 9384 19048 28983 50340 40594
9708 40594 30189 22924 -3188 -18490 -29351 -18395 -5017 11971 8452 8810 -336 -9740 8312
9695 8312 28897 45891 43102 14759 -5651 -9730 -9707 -5615 12064 30152 18146 22871 27875 24386
9681 24386 31433 34267 4846 1862 -21636 -14709 24025 44684 24733 24204 43046 17611 44947
9668 44947 35941 12115 8677 4212 3100 19881 22846 -11738 -11295 5056 8365 9862 9769 10113 4564
9653 4564 11436 13724 15994 12136 7007 11078 24787 26224 20590 -2525 9812 45925 68426 54226
9639 54226 48164 36837 48609 74823 144338 183950 171280 177369 199978 228382 247516 267872
9627 267872 282284 283856 286544 250766 189072 167989 160055 121823 51580 20652 36723 55732
9615 55732 75677 64268 40398 11122 -4390 -7558 -36302 -20413 11775 -1480 -6807 11028
9603 11028 36589 46151 31426 22779 42097 24159 15729 1649 -11780 15638 22432 -23154 -48958
9590 -48958 -16537 8359 10418 11572 3644 10548 6140 -4704 -24680 -32193 -32753 -13501 -18047 -1678
9576 -1678 -1258 20932 25594 21158 14997 2719 1813 3076 -23936 -45387 -27406 -11587 -14948 -22977
9562 -22977 -19067 3766 4869 -286 -14212 -2383 10952 2964 10494 4855 243 -23370 -41067
9549 -41067 -33319 -6003 44827 59165 13136 -25285 -10644 -1216 5857 22166 -4762 -49421
9537 -49421 -37630 -5316 20263 35439 9654 -31241 -38509 -35150 -392 31510 36874 15523
9525 15523 -36363 -34032 -15908 26538 64795 36923 18349 -28450 -27291 -23055 -27740 -29447 -57844
9512 -57844 -33698 -28378 -32304 -22501 -29638 2108 37706 56015 42930 17113 -12134 -12721 -7158
9499 -7158 -16913 -17108 23302 20098 -4643 -18958 -17619 -2188 -1389 -11905 -5180 -7247 -29279 -50232
9485 -50232 -71765 -57639 -33055 -12419 -11378 -9895 -4490 -19505 -15953 -1331 11395 -4738 2420
9472 2420 8508 16417 20042 -4392 -29046 -3023 14535 12351 -3262 2104 3407 -13621 -38639
9459 -38639 -66569 -51048 -12622 -26417 -24850 -8469 24052 4643 -3206 -14154 1414 -12841
9447 -12841 -17758 -19142 -49349 -61591 -39565 -40423 -55684 -28849 -41135 -37134 -29944 -43766 -32897
9434 -32897 -29779 -35037 -8639 607 3761 13740 24981 9670 -34074 -51279 -38917 -19516 22608
9421 22608 52334 17992 -14542 -29234 -39810 -33356 -43727 -44700 -32504 -39914 -60217 -37826 -14320
9408 -14320 -26049 -36169 -6250 40656 43923 19520 10644 -6015 -11817 -1898 -27459 -31764 -7210
9395 -7210 13399 25391 21483 -8407 -35252 -30893 937 5689 8508 10825 10282 7408 39588 33641
9381 33641 26738 15992 8779 7694 11007 8238 -14010 -10690 -25149 -17454 -44663 -19256 8042
9368 8042 2887 -22843 -33420 -49032 -35287 -23072 -37372 -36700 -28832 -695 251 24257 14386
9355 14386 2502 8190 -10595 -17013 6288 -8695 -5083 15397 42681 72413 63314 50614 37120
9342 37120 11495 -1353 20924 16324 36 -1543 -10597 -10997 2085 -13479 -33993 -23664 -24918
9329 -24918 -44577 -53677 -31562 1911 -6914 -32547 -29296 -3364 -12215 -2885 8614 10585 9670
9316 9670 12591 2162 -29801 -24012 -196 672 -11492 -6958 -1423 1475 1855 -13654 -67 9116
9302 9116 7038 1694 -37571 -62287 -35220 -5511 -5133 7459 1456 -32205 -67360 -63405 -45568
9289 -45568 -45476 -27626 -20895 7014 -430 -7686 -9858 47 -1730 4399 58551 68957 36211 -710
9275 -710 -11173 20354 13323 5625 25306 62542 46647 14697 31163 30042 39340 57642 49543
9262 49543 39283 6132 20794 41864 -350 -50 20325 39071 34725 6758 4623 1556 13563
9249 13563 40661 29817 3567 -122 -20997 -43712 -33120 -21215 -5494 -5621 -18987 -9969 -17783
9236 -17783 -13885 -31608 -20833 2480 19579 46920 24568 25228 50344 34365 12763 -256
9224 -256 -13132 -5801 -18954 -4008 1244 1991 16990 17831 -24832 -50667 -35455 -21690 7425
9211 7425 3737 -2432 -30071 -42107 -37881 9329 10507 2547 7387 1742 -15462 -13140 18608 30010
9197 30010 35295 29146 13622 6568 -8194 -15283 -3668 6633 -2561 -11672 16031 36738 41580
9184 41580 34223 12966 -17036 -26479 -10878 -17221 -11388 -16381 -17615 -3106 -7921 -4766 -34679
9171 -34679 -32816 -12438 -11742 3534 1967 2499 10143 42541 11938 -9137 -39446 -65728 -31684
9158 -31684 -27397 -34619 -15864 -38490 -59012 -29419 11996 64521 63079 60605 75043 75731 78788
9145 78788 67926 46755 16564 -29309 -27062 -14176 -17741 -15772 -46879 -33039 9518 11190 -3239
9132 -3239 -248 4584 -2826 13438 21195 21940 3428 -3883 11648 9661 3172 15742 16044 17305
9118 17305 29527 17729 -10476 -8316 -5849 -7777 8369 3974 -26777 -18836 13161 14316 -6356
9105 -6356 -15384 4115 45973 58779 47099 38351 30963 22400 19794 51883 61335 43640 45371
9092 45371 48305 8685 -16413 -10930 -19199 -12160 -7987 10894 6424 -10478 21851 13988 -7935
9079 -7935 -9698 -18392 -15630 1222 22802 19574 32459 45292 34292 28820 47188 52809 35262
9066 35262 22150 -10005 -12644 16309 12184 -4073 -8507 2175 31737 69418 65944 51470 65511
9053 65511 52242 17162 19866 12722 -4105 -28274 -31322 -35339 -10734 -16439 -50436 -60156 -51099
9040 -51099 -14863 -17661 -37210 -39106 -47702 -28059 -16168 1636 -17357 -25235 -34979 -22223 16068
9027 16068 15937 -3723 -5634 -2272 -11630 -11827 -33833 -37567 -35489 -60446 -50302 -9191 6553 -1157
9013 -1157 -3422 -2892 13417 33939 11676 -14213 -31810 -16419 -4956 -16189 -11246 -2285 -1489
9000 -1489 -12575 -33738 5094 33125 -6395 -22857 -15216 -24663 -21860 -33076 -27764 -3781 11227
8987 11227 19140 22692 10038 -24755 -32507 -33774 -20756 -5943 3421 17259 40041 52998 43484
8974 43484 28644 42195 67114 25353 9531 -27519 -25830 5502 -604 -28704 -32075 -35461 -50642
8961 -50642 -57572 -22256 -21967 -3677 35390 32232 26899 20267 18280 -30802 -44012 -14895 -44
8948 -44 -1998 -25 6807 1449 -3519 -9720 -10054 -699 19872 -5436 -42787 -44423 -40370 -40528 -19340
8933 -19340 -42770 -27359 1366 18251 6342 -3159 -20322 -23399 -29404 -44205 -19442 1150
8921 1150 15739 15360 -11841 -20256 -49387 -33497 -18855 -7429 -15677 -26928 -29584 -50408 -53972
8908 -53972 -55194 -79313 -95980 -110802 -84219 -42147 -15926 -14013 4468 23236 26319 28505 6912
8895 6912 -12622 -22639 -22051 17436 16365 -19726 -38043 -58350 -51002 -28197 -103 37059 41279
8882 41279 18672 18083 23603 18729 -7616 -25253 -13027 2255 13929 34226 36749 5051 1914
8869 1914 21407 32791 20323 16279 18795 35774 34908 26652 -4533 -37526 -22614 -15131 -25924
8856 -25924 -21076 -9534 7866 33553 13784 955 21530 38116 18823 1332 -2085 -18296
8844 -18296 8325 13687 683 36693 3657 -40879 -85189 -75016 -56856 -50204 -27678 -30637
8832 -30637 -41790 -23833 -13436 -2932 6263 -7608 -28623 -11162 18854 28730 45586 40872
8820 40872 30692 11079 12345 28712 43303 45219 29071 19373 11572 11038 38005 35013 31818
8807 31818 13103 9425 17720 19415 -4700 -13240 -24932 -43835 -40756 -34978 -33645 -15085 -2072
8794 -2072 -16236 -26264 17575 39677 10294 4868 44166 46307 -1026 -16737 -20783 -8670 -7780
8781 -7780 -18921 -25312 -16671 -3786 1025 -18073 -21316 -50819 -45249 -3582 11007 -1017 -4270
8768 -4270 -3387 -32106 -43151 -17700 17752 -7322 -25739 -1805 970 -27823 -41541 -43915 -36594
8755 -36594 -23864 -31040 -34307 -14437 17956 22843 17473 37384 18276 6183 3340 -13520 -12646
8742 -12646 -2299 -12262 -16092 -12265 -23646 -13679 -13968 -20659 -16974 874 18479 5797 -10638
8729 -10638 -13499 -7962 -3697 -9682 31 16500 22753 16794 10825 5151 -12512 -23469 -35606 -18578
8715 -18578 -16314 -32544 -32439 9053 17380 10430 -5574 5298 23738 26195 41089 44555 38907
8702 38907 53318 54566 39346 7223 -7483 3424 16609 15956 25261 -4986 -32670 -28558 -20693
8689 -20693 -3319 21307 33220 31548 50060 46882 28671 34283 13554 -1663 -5245 5521 8937
8676 8937 -2016 -24542 -49887 -45716 -19773 -26356 -25550 -7255 2147 5436 5463 -11893 12120 -6022
8662 -6022 -8073 -17095 -11426 -15642 -29577 371 26765 8734 2640 12029 25234 47239 36352
8649 36352 28911 44018 50192 42020 32732 35032 21919 13681 7473 39720 41867 43658 38363 45519
8635 45519 36434 14739 30862 29246 8085 -22991 -38465 -13031 -17865 -12632 -7192 5016 -3462
8622 -3462 12470 3959 15474 27361 52566 35820 16120 2303 -1107 15559 29897 48115
8610 48115 33507 1042 2676 5955 38361 29382 6605 1190 -14095 -25342 -14909 -23635 -22729
8597 -22729 -27030 -26261 -24407 9356 31135 52946 42542 38607 29043 28211 39669 33374 46645 18439
8583 18439 18077 34159 54721 51080 66538 64369 520 8211 23570 36431 52918 39663 49535
8570 49535 51851 35809 24867 22360 17353 67008 77123 27025 9965 14260 21797 14954 22913
8557 22913 23360 18972 -11179 -6132 -28251 -58059 -50940 -50212 -44538 -20801 10824 13148 22863 41870
8543 41870 29368 25849 29756 38127 33423 48167 58195 47456 40529 41098 31757 15711 23488 39851
8529 39851 40447 15853 3291 -12021 -7636 -14962 -40877 -30171 -7777 20642 9072 -10575 -14106
8516 -14106 -5849 -23055 -16962 14684 27421 17319 -6109 494 -447 -583 -16098 -24144 -7997
8503 -7997 -13579 -4805 661 -7643 9057 -7785 -18806 -26099 -30815 -20566 -11920 -22068 -36397
8490 -36397 -49586 -33752 -1147 17379 -6592 -29072 -49965 -30662 -16972 -2381 -16425 -25204
8478 -25204 -28467 -40333 -21697 -11784 -31662 -35772 -31680 -36248 -25055 -52338 -38136 -25582 36927
8465 36927 49867 20497 175 -4064 -829 21079 29322 58548 28992 -18663 -44911 -40732 -16112
8452 -16112 31092 76607 64445 48930 49075 25432 -9475 -16307 -1432 -6308 12284 54920 56578
8439 56578 21300 15560 -5688 -8269 -13100 -17662 18415 31012 21453 2903 6196 25547 7875
8426 7875 -16296 -21462 -22894 9391 33611 17103 5870 43 20118 14317 -364 -3872 -11080
8413 -11080 -7144 -8537 2552 -3024 -13994 -36380 -54440 -52687 -28227 19044 28645 7606 -4315
8400 -4315 -13482 -7998 13782 -10193 -55743 -49039 -51724 -47014 -62976 -60863 -40271 -6743 2659
8387 2659 -2423 -3460 -3901 2519 20791 10172 -35992 -30738 -17427 -32378 -12158 -1011 -13587
8374 -13587 -5641 -16598 3582 -2581 9811 11661 -1390 -7562 15076 36895 39340 46076 41148
8361 41148 42065 2955 11644 26863 29518 43905 68661 55687 32859 24613 15473 15371 12864 7269
8347 7269 -21277 -53831 -45804 -20264 -5647 -28423 -20344 -15032 12378 -370 -9929 21025 7761
8334 7761 24965 14757 10302 3 -1070 12936 50901 51833 43832 50292 18835 -739 -369 -2266
8320 -2266 -17517 -25629 -30847 -23275 -31770 -29597 -26205 -18854 -6762 -14420 -42549 -61077 -53888 -34249
8306 -34249 -31225 -13521 -758 14995 7284 -6533 -9641 -13621 923 -3884 -16128 -34191 -38006
8293 -38006 -20371 -3577 -38259 -41682 -34924 -38754 -28509 -36845 -18767 -2040 -13319 -26099 -17116
8280 -17116 -5842 -6330 9107 13872 -20938 -38647 -467 28790 42927 10066 16304 12363 -31937
8267 -31937 -26141 31706 21682 22678 50012 44168 38031 31248 14508 9943 -1420 -23402 -16797
8254 -16797 -19563 -27357 -31876 -41301 -21696 -4168 -658 11139 -1694 -28079 -54089 -29624 -20837
8241 -20837 -32025 -46886 -32891 -43316 -44390 -25320 -29615 -36624 -27341 -14639 -52301 -59730 -74202
8228 -74202 -65893 -51994 -53360 -27932 -11567 -14699 -1400 -12970 -27641 -21242 1922 14476 8835
8215 8835 33569 30208 37712 29747 46527 18450 22479 8549 1408 19523 19727 15689 9426 5674
8201 5674 -4798 3664 18210 14136 15764 27599 36773 18745 -3659 -28453 282 9919 17751
8188 17751 19724 28282 32715 78447 87317 59895 33659 40060 62758 46278 14224 -20754 -6283
8175 -6283 22627 30347 38994 14478 8949 -116 -10836 -21648 -62476 -75199 -55663 -33913 -20259
8162 -20259 -21175 -20739 -27018 -21488 -38312 -45545 -23590 -34323 -24094 -35645 -69388 -55468 -38347
8149 -38347 -23937 -32181 -23025 12753 22865 4455 8544 5692 -7140 7219 -13494 -7486 5640
8136 5640 -4545 -23440 -28241 -21307 -29491 -53539 -31953 8685 11745 17064 -10964 -42853 -30782
8123 -30782 608 14558 219 -12099 177 -12525 -12826 -50094 -78298 -73700 -56455 -42588
8111 -42588 -27284 -7939 -2534 7215 23848 40719 16581 -13366 -26989 -10596 -5628 -19405
8099 -19405 -33708 -13210 -5387 -12884 -38575 -68436 -71457 -47084 -39336 -46129 -37092 -23166 -12551
8086 -12551 -38241 -44569 -50390 -30502 -18566 -36169 -39504 -49581 -56302 -69641 -54883 -4747 26024
8073 26024 28668 25701 -2367 -11451 -1598 -28819 -43445 -34053 -7596 -18409 1157 2225 -28440
8060 -28440 -32395 -9777 -27787 -40082 -8101 6343 4853 6891 23731 29865 26416 14042 1187
8047 1187 -10613 -21634 -25390 -2807 5445 19543 37325 24798 2340 -38708 -12736 5766
8035 5766 -13932 -10887 -29007 -32053 -21421 -31014 -33320 -5523 13888 9126 3715 -17862 -4812
8022 -4812 -10158 -3120 8106 -13945 1256 14917 26310 13744 -23363 -36415 -34853 -33055 -4118
8009 -4118 22095 12448 -12637 -35152 -39282 -16275 -11321 4526 -17695 3991 28355 -3543 -12977
7996 -12977 9063 3591 50 5573 -18284 -32997 -1918 6811 16418 5427 12394 52255 70689
7983 70689 61833 46786 62726 76436 64972 66116 51468 32436 47901 32034 32543 37028 8939
7970 8939 -15240 -12870 -28094 -31473 -24123 -18608 -13110 -10705 6030 13086 16002 1657 -12510 -18040
7956 -18040 -38354 -22921 -12135 -28492 -51479 -21266 13448 30443 6863 -3546 -3623 -4381 -25957
7943 -25957 -17800 2108 -3722 15944 -11773 -23854 -8524 -25074 -49237 -18068 -5560 -2848
7931 -2848 15906 12894 2210 -5481 11860 -21798 -40785 -29802 -14733 -21816 -29948 -47621 -30742
7918 -30742 -20120 -13811 -11545 10577 12533 19438 -14151 -28683 -29962 -58511 -45341 -47113 -51908
7905 -51908 -47612 -35684 -33767 -34508 -45505 -35191 -11619 -4270 18235 52053 23425 4350 32026
7892 32026 57760 641 -33237 -35041 -3945 911 6372 22959 53658 79541 61937 34338
7880 34338 25345 47062 20002 24185 30570 25172 18291 16118 21750 -4922 -4546 21247 18474 7513
7866 7513 -8002 -50813 -64752 -90314 -81385 -86816 -76078 -14112 -1092 -2886 -22331 -35254 -30311
7853 -30311 -27 -7435 -38041 -51665 -29539 -15350 4982 31585 19219 35500 29486 16429
7841 16429 11366 12139 68822 95020 74813 25834 2447 -26295 -31106 -25044 -9533 -23828 -33890
7828 -33890 -16594 -7013 4066 33538 61832 51974 53369 29788 16054 -944 -19067 -28591 -31118
7815 -31118 -32555 -34721 -39919 -40641 -46316 -17273 -6018 -11828 -22711 -3976 9975 797 -7502 -6755
7801 -6755 -213 22607 24249 35235 52762 63243 50216 34566 6480 23336 13377 16467 15359
7788 15359 -780 -12727 -29250 -31834 -18423 4900 244 -3137 -14988 -43537 -39406 -31567 -41452
7775 -41452 -45673 -32636 -36463 -62887 -57567 -35528 -5477 -16530 -25709 -20504 -437 35617 8884
7762 8884 14872 12274 -1007 547 15243 50194 56972 30871 -9660 -25472 -25790 -37295 -29223
7749 -29223 -7410 -7491 -29987 -43102 -50008 -32270 -16952 2756 12882 23896 1853 -45342 -71485
7736 -71485 -62038 -68895 -60523 -44560 -54516 -56691 -16774 28106 44868 34476 20029 421 4067
7723 4067 -2057 959 -12949 -33277 -56421 -59863 -36628 -8075 47387 67500 25263 1156 13444
7710 13444 -12861 3535 8823 11205 22753 -4437 -40617 -27533 -20155 -46052 -39540 6531 -2063
7697 -2063 -27465 -13998 1178 10979 861 2215 -9215 -11018 -16027 4893 19680 17361 -411
7684 -411 -18907 -17763 -28230 -30596 -41409 -47955 -24517 1537 -6868 -14173 -9601 -27297 -11127
7671 -11127 2232 -4170 -18595 -44209 -20909 10250 4015 9731 -9797 -19785 -23488 -5022 2566
7658 2566 -6752 -1614 6553 14564 44153 9084 -17902 -28495 -18567 -5267 897 -24222 -14514
7645 -14514 -3124 -14648 -21271 -16532 -17771 -48508 -43453 -35479 -45108 -23600 -10298 -17654 -4719
7632 -4719 -21286 -34830 -29883 -8984 -1911 -13042 -25487 -37780 -44562 4725 40899 36315 17336
7619 17336 23463 10962 -7136 -2553 39733 27957 13263 -27186 -20034 -20662 -14247 2051 24366
7606 24366 13970 -6513 -737 13198 -3534 -11077 4864 -6594 -8368 4303 23968 28541 19408
7593 19408 10335 -700 -10371 5946 21728 10188 -2093 -43541 -45929 -26086 -25923 -43558 -39181
7580 -39181 -21396 -17452 -24089 -11416 14294 16151 -1243 4182 27141 11730 -19736 -29697 -33910
7567 -33910 -32700 -36264 -46688 -40500 -41212 -48854 -68532 -40571 -1100 -14413 -17160 -3295 4279
7554 4279 8519 22455 34933 50138 2533 -21972 -29724 -58921 -33610 -20274 -1254 18766
7542 18766 11065 19999 27369 21808 46924 48883 51977 44115 11036 -5591 18352 44345 47519
7529 47519 46225 44062 25787 16222 -6504 -29894 -17467 -3010 -3913 10266 15492 21672 8279
7516 8279 -3409 -48918 -50797 -9957 1012 -21981 -41042 -45364 -45192 -35197 -36539 -50597 -53422
7503 -53422 -49292 -32899 -11573 5448 9557 -11358 -19522 -9015 -1692 -20936 -9107 -2874 -27540
7490 -27540 -23511 -8476 -20889 -27440 -9822 -10086 -23 11336 -2411 -7682 518 -2093 -6765
7477 -6765 -17960 -41547 -66728 -46348 -51468 -59437 -43471 -21970 -21103 -28212 -40395 -32729 -17417
7464 -17417 -19218 -28740 -30285 6881 18452 17659 26328 38865 48016 55926 71553 53346 43543 21499
7450 21499 -18987 -42361 -46051 -32615 -32152 -3277 47762 31532 16496 18434 25060 13520 2647
7437 2647 18283 132 -6211 931 10398 -10575 -14626 -7459 -10825 -6096 7458 -7829 -9243 17544
7423 17544 1423 -952 -21876 -15200 6260 11901 1397 -9492 -5957 -27702 -39623 -2308 -1815
7410 -1815 4700 17075 28580 18310 20121 25806 26872 25860 5666 -7134 3492 -13567 -13589 16772
7396 16772 44934 48454 20927 -390 -115 22989 -2076 -14025 -16625 -15630 -4981 14915 17046
7383 17046 5073 -6847 -870 9692 10681 1239 -2828 -14607 -4656 -4013 -15271 -7828 -11408 -35939
7369 -35939 -51002 -28091 -19663 -29969 -53006 -37976 -40918 -48818 -51183 -75697 -29839 9906 12249
7356 12249 5916 -18454 -24247 -1528 4239 -25435 -14911 -20193 -44074 -35401 -18979 -31903 -15058
7343 -15058 1521 -5807 -37701 -39327 -43251 -48353 -31046 -34062 -29535 -34901 -18139 7469 -2748
7330 -2748 -42641 -67887 -53625 -67466 -75418 -48976 -56867 -38066 -14786 -11659 -10846 26234 23144
7317 23144 7983 278 3996 -18031 -15834 9477 -6665 -11253 -10085 6242 5592 -41013 -79928
7304 -79928 -77923 -58730 -61960 -26713 2446 18029 26901 19116 43605 45796 23758 24489 14572
7291 14572 -5362 -25698 -21836 4410 -15399 -5718 13544 -1910 -23276 -10997 -744 3197
7279 3197 -7579 -11903 -19462 -27719 -44460 -45953 -31866 -50344 -74332 -50280 -17359 -22462 -18814
7266 -18814 -9653 -22491 -26721 -13229 -38280 -56770 -29975 4172 26158 31646 15032 -4981
7254 -4981 -1062 -2702 2369 23914 35691 30518 -8900 -14584 -5678 6533 -19707 -24376 -14654 -8519
7240 -8519 -14470 2374 3340 -6416 -5723 -32084 -34311 -45439 -35603 -18226 -25883 -22374 -36952 -58355
7226 -58355 -25754 4843 8607 12364 6401 28664 21810 11088 10645 24124 -1195 -25807 -38943
7213 -38943 -11604 14497 15248 20792 13283 -13318 -44420 9223 53590 52971 10447 -9027 11763
7200 11763 16878 15138 1726 15595 9707 -12130 -3393 6295 -6456 -3520 -1552 -4957 3830 19088
7186 19088 36864 -1093 -42016 -30680 -11442 -508 16151 11459 -20559 -24949 -28589 1782
7174 1782 11361 2138 16841 15175 -28646 -42110 -36713 -25963 -18978 -23094 -13886 -13199 -28294 -45758
7160 -45758 -11493 -7834 -18744 -28442 -42535 -16903 -22949 -51885 -79645 -30206 -29 12871
7148 12871 41 -15919 -392 11045 577 9157 9166 21915 47090 39920 23592 4508 -6556
7135 -6556 6079 13450 2220 -20364 -31347 -31692 -48563 -37504 -11031 11346 9271 20585 14875
7122 14875 -1768 17343 -1623 -11242 1612 21949 12193 -31700 -36138 -54766 -65102 -39495
7110 -39495 -1839 9524 -20057 -43399 -43580 -15486 9473 25699 13628 2415 -4772 -20666
7098 -20666 -24304 -12482 5985 20428 24283 18489 12794 10070 41556 30580 27973 22959 3168
7085 3168 6895 8975 11483 20728 38275 40111 47504 34400 13300 -10230 -7310 -3118 294 19217
7071 19217 38520 31557 23171 24466 11362 23565 -4332 3021 31751 73207 74704 45210 1843
7058 1843 21807 45847 52607 30764 29649 1397 14640 22227 27815 58284 91427 85372 67325
7045 67325 43690 58244 40889 21226 36587 25332 7031 -38521 -41044 -27352 -25734 -16563
7033 -16563 -7536 14975 16846 24080 25258 -12381 -17410 10163 -3579 -12975 -7990 679 16662
7020 16662 -7445 -27479 -12511 -6667 995 -4388 -6556 -11497 9159 35540 43045 35189 23951
7007 23951 -1119 10508 11001 1409 24617 4876 -3145 -4264 -1943 -11766 -25907 -29291 -45215
6994 -45215 -39675 -36564 -28117 -17859 -24536 -27309 -52779 -69805 -59527 -36972 -12895 -3051 -5847
6981 -5847 -9460 -11601 1698 1390 -7113 -13160 -18958 -17047 -26883 -25998 -9569 8633 4005 -20479
6967 -20479 -18264 -21553 -13910 2987 1808 28613 35958 2586 -39730 -14181 24085 35634 31695
6954 31695 24511 16913 -4395 -25215 -46966 -79518 -45951 -5339 -6923 -15473 28771 52861 6608
6941 6608 10550 39202 43994 58823 45386 28822 25501 8080 -20875 -507 -6557 -28564 -65467
6928 -65467 -39664 -30826 -33989 -22190 -32810 -32760 -8270 -23495 -52240 -48173 -33910 4802 55607
6915 55607 24628 -36234 -74609 -52894 -23982 -15292 -22968 -45462 -49484 -36939 -32494 -75747 -97482
6902 -97482 -107896 -83280 -53260 -34163 -29043 -12236 -23184 -37755 -52379 -33761 -16753 -22751
6890 -22751 -9203 -10788 -37560 -52835 -51091 -34030 1395 18126 2826 11768 25352 22676 12664
6877 12664 12964 11108 12394 4911 -35716 -44151 -20484 7849 29059 46465 33420 9856 -9392
6864 -9392 -10374 16472 63015 72264 61100 29855 -8961 -14329 -19404 -37180 -5266 27896 37957
6851 37957 26317 18506 35752 33718 9571 5888 -16105 -681 8263 12776 10142 -10246 -12460
6838 -12460 10297 11386 -2638 -1765 -10098 -11457 -24404 -42201 -49732 -38815 -25412 -28279 -36802
6825 -36802 -37913 -30255 -29339 -31538 1995 30273 37633 37512 40764 43815 34734 41309 3712 -1278
6811 -1278 -4003 -2616 -648 9961 6211 13109 20922 30291 35229 9183 -5379 -5844 -17608 -31160
6797 -31160 -48282 -39630 -15310 7969 17898 25933 35215 32062 -10515 -7162 10276 -134 -34864
6784 -34864 -16077 -11824 -28709 -16315 10778 31896 14794 6205 5319 10536 37854 41382 13500
6771 13500 3079 15327 5745 -999 -24258 -48278 -50702 -45879 -44433 -33682 3753 8972 -5631
6758 -5631 -14564 -35303 -4334 21030 -399 -27578 -30748 -32981 -60777 -50025 -33168 -18873 -41762
6745 -41762 -47937 -51010 -38641 -30732 -22896 -4673 -2695 -20816 -9708 -6868 -14913 -8842 -19364
6732 -19364 -30022 -47542 -43471 -21595 -20518 -32333 -60471 -46371 -39553 -31723 -20524 -1643 31162
6719 31162 38145 28721 -7063 -19731 16639 22173 1921 -6882 12560 25603 30943 -890 -23326
6706 -23326 -38551 -51606 -35000 -35884 -33673 -22397 -9535 -11777 -8404 6171 27876 13608 5139
6693 5139 1772 -4470 -13697 76 3327 23615 6029 -35590 -12581 7817 -9073 4277 19188
6680 19188 21243 -4855 -12987 -7696 -672 24501 34517 25925 20227 -22964 -31655 5924 39624
6667 39624 62454 34818 -3310 7940 7659 3101 12895 -14821 4714 15683 22411 -8470 -11920
6654 -11920 -27960 -12543 -411 3053 1606 12539 15043 -4015 -2369 -33485 -28334 -34845 -47442
6641 -47442 -26921 -16182 -7676 4044 -11563 -14842 8670 18541 8041 -5727 -17834 -32563
6629 -32563 -46373 -46931 -33536 1013 43239 36932 6697 -25176 -42072 -56994 -31895 -27056 -29676
6616 -29676 -30851 -48251 -51990 -19990 -5008 -7352 3732 15764 21307 25127 23781 -8771 -44081
6603 -44081 -16499 -1349 26187 22997 13993 23666 22448 31499 15099 4535 32640 51015 30370
6590 30370 49430 28039 -12218 -30625 -6571 3140 19200 13660 -10270 -23600 -31800 -44323
6578 -44323 -36063 -20282 -11160 24684 29179 8817 2394 2261 -26900 -25561 -24056 -34440 -10959
6565 -10959 -2695 -11512 -28392 -67652 -54543 -25893 -8164 13347 -9470 -21617 -17224 -3154
6553 -3154 -19632 -19958 -21751 -17055 9976 13960 -25704 -46615 -44048 -18849 -1776 -14824 -15810 -31091
6539 -31091 -39619 -72060 -65432 -32412 -6886 7196 -17900 -23828 -13931 -17410 -17516 38198 36854
6526 36854 52777 46756 34897 40324 35617 52067 50730 30503 -2796 8988 18190 13285 -8183
6513 -8183 18097 35603 34259 7677 -26551 -45150 -37404 -39915 -36049 16329 64205 50607 44324
6500 44324 39151 22194 5375 -9355 -23130 751 30903 29124 42638 59319 20383 -25642
6488 -25642 -29071 -65667 -54433 -31956 -28594 -41907 -30392 -21596 -17285 -1783 -8676 36020 38637
6475 38637 19842 25612 28086 7826 19978 17713 10097 -10155 -458 14831 -88 -9810 -8568
6462 -8568 -7538 5385 48375 80179 82066 75304 64924 26715 -21277 -18678 -15900 -39354 -40914
6449 -40914 -38261 -15174 12365 24965 5350 -18687 -48192 -47369 -34496 -28390 -19503 -18 9760
6436 9760 -12658 -27693 -40916 -35174 -23927 -20744 -26735 -16959 -35639 -54336 -38399 -46123 -44514
6423 -44514 -11626 -5028 -1883 -7880 -17217 -6524 11692 20153 30532 65555 66819 30096 -4512
6410 -4512 -10967 3472 -12385 -41789 -41931 -37084 -28657 -5158 12534 6308 -14714 -22754 -27287 -25909
6396 -25909 1812 10046 -696 -442 8548 7592 1206 -11471 -17356 -9305 -12108 25061 25217 12005
6382 12005 -34616 -63395 -64110 -62783 -44267 -36183 -31437 -29435 -13060 712 5222 1546 -12179
6369 -12179 -21757 -57291 -51506 -34381 -28932 -24195 -19012 -31357 10512 21859 4242 -4864 -9348
6356 -9348 -14100 3951 14482 39876 41067 43625 39952 72377 71695 39546 6368 -15988 -13077
6343 -13077 -16866 -10933 -17498 -1047 1151 1792 -22175 -39237 -29814 -21246 -19210 -18456 -740 14475
6329 14475 -402 -18199 -17450 -4057 3936 6659 -4852 4759 26098 17934 19122 26058 1006
6316 1006 -7843 -13582 -9230 3369 -17453 -32108 -38296 -59902 -51723 -49858 -40132 -14941 -15951 -16165
6302 -16165 11892 26211 -16273 -51657 -45697 -64789 -101495 -94994 -67198 -43279 -20756 4348
6290 4348 12790 -745 -5072 18135 13289 -11025 -18444 -20424 -9633 -5750 -2399 7061 759 -6035
6276 -6035 15095 -14035 -31515 -28493 -44625 -15213 26074 9934 42 -27600 -13772 -41256
6264 -41256 -53281 -15585 -38985 -35352 6891 15647 5595 6090 -10699 -9136 7222 21066 50933
6251 50933 40912 19653 27551 23872 26777 15047 -5642 -10727 2650 12624 20913 9405 -27049
6238 -27049 -12328 -30702 -52804 -88876 -53454 -13188 24066 12740 -6486 -8541 -1225 1454
6226 1454 -16047 -29802 -49559 -59371 -39614 -15127 -32677 -41598 324 13718 -4378 -36192
6214 -36192 -38928 -1480 12584 911 -1314 -11952 -12578 -6942 -9718 -7732 13 -19356 -40567
6201 -40567 -50095 -47276 -32304 -11459 25588 54392 64696 34387 31125 33054 41755 60971 70056
6188 70056 64842 45958 24941 18903 3529 15815 18467 -942 15079 17620 9318 -5294 -15649
6175 -15649 -17830 -10177 -19973 4577 46431 51244 5523 -26769 -18783 18728 17715 12728 9194
6162 9194 13694 20878 32389 991 -6066 2670 4640 14395 15575 -1099 20789 2795 -12367
6149 -12367 10213 17833 16956 16109 20487 26461 3819 -2291 -4740 5101 4960 -22809 -29719 -58231
6135 -58231 -66516 -24492 535 -663 8673 33587 28913 33232 27749 22569 3323 -979 -18122
6122 -18122 -47901 -46439 12163 37143 18001 -30263 -50387 -23827 -23112 -7640 -7530 -12942 -30519
6109 -30519 6568 18456 38793 19462 30575 52409 49181 26747 19480 -18581 -36065 -68630
6097 -68630 -68460 -52380 -10948 2201 -18937 -10927 5758 8724 12509 2555 13494 12476 -31261
6084 -31261 -41296 -40090 -36461 -18481 -6101 -10664 -27617 -13076 2475 22547 30850 -5789 -35769
6071 -35769 -44291 -14572 -11480 -876 -33542 -64055 -40580 -19234 -1843 -8282 -28045 -52720
6059 -52720 -48910 -61277 -57269 -41816 -15613 7068 -10702 -14717 -10009 27964 27671 -7346 -13120
6046 -13120 -30592 -33001 -45 9700 -15631 -31731 -755 -1308 -32840 -30094 -19487 -1579 22372
6033 22372 -3340 -14899 -11322 -30264 8302 44592 43613 22643 11663 14604 -3375 8363 33350
6020 33350 44715 21664 6420 4276 17187 40462 16963 7402 14097 2967 19113 26538 40919
6007 40919 10268 -25585 -58604 -42861 -30181 -23557 -35813 -20243 5111 -3625 9733 399
5995 399 -29096 -6644 -22961 -15690 956 -24217 -55044 -49719 -25260 -33023 -68908 -51462 -24101
5982 -24101 -16634 16891 59371 41740 22723 -225 -2383 -12766 -8740 6181 23318 11108
5970 11108 -8709 -9468 -11841 -8191 -19717 -61246 -101381 -104694 -61304 -19549 16554 33324 -8441
5957 -8441 -38642 -34992 -22277 -9692 2349 -8027 -1085 -24478 -24486 17798 38327 35507 12698
5944 12698 4864 -14085 -4349 8328 -19332 -20977 -2764 -956 20362 18369 -3162 -6213 -16019
5931 -16019 -40938 -35698 19446 16403 13573 18180 44570 45205 24776 -2091 316 -17121 -44449
5918 -44449 -45579 -21657 -2539 -16104 -3881 -1268 5950 11997 -13043 -28322 -37738 -24771 -3516
5905 -3516 4378 14643 15545 11761 21314 45882 35247 31465 20863 22664 24105 24529 -3628 -10275
5891 -10275 1991 -17787 -17173 -14869 1280 22007 17599 9280 -32557 -36546 613 22068 42984
5878 42984 35224 22834 15737 9411 9594 31142 6637 -23733 -8569 -9900 -19151 -33806 -42677
5865 -42677 -32955 -25033 -18826 -11733 -14488 -29798 -13581 9170 15357 23413 47430 18387 1566
5852 1566 8584 10783 8241 7441 3735 -10744 -19685 -11428 -11585 -15026 -14077 -5947 -14260 -8850 18588
5837 18588 34188 30140 31387 24062 16337 5816 -15774 -10407 369 -15834 -45006 -48669 -35729
5824 -35729 -7507 -846 243 33038 44379 39347 27560 25860 13688 20565 33538 11641 -39080
5811 -39080 -35468 -4326 12840 31413 18306 -11160 -37181 -26263 -5283 -15566 -37404 -31177
5799 -31177 -7089 8355 1863 -23462 -35355 -20018 -26117 -22919 2443 2178 8298 19961 21757
5786 21757 39404 62379 58415 48853 34075 29978 17826 32624 46630 12790 -19008 -5640
5774 -5640 -31257 -36516 -8161 -654 19546 18645 -690 -18052 -29785 -30291 -47524 -35341 14181
5761 14181 5024 -16303 -39421 -77321 -64710 -41265 -30236 -49026 -47486 -51257 -70212 -65989 -55514
5748 -55514 -42411 -52796 -34602 -21591 -23232 -35308 -37146 -40417 -11994 5825 -4644 -7053 23824
5735 23824 23685 14987 11299 23325 5884 -3497 2040 1295 -18381 -40926 -55044 -24412 -2023
5722 -2023 16288 23975 51432 45780 10536 -5271 -3802 11515 28419 35413 32555 -1546 -25548
5709 -25548 -31568 7848 16134 12055 -4333 -17654 -31288 -30802 -40731 -37355 -13131 -18705 -20144 -5811
5695 -5811 -11161 -1924 -1719 -6130 16048 20271 31584 26643 29186 62189 55342 26058 13367 30531
5681 30531 42045 38052 5812 -21709 -30536 -19704 -5528 3928 -19771 -30581 -27421 -10245 -5664
5668 -5664 -28969 -36890 -16304 -12807 -5742 -14640 -33761 -50976 -30985 -19856 -40432 -52068 -19352
5655 -19352 -9424 2328 26705 18473 26730 35452 46881 33935 36638 25496 37196 38107 -5756
5642 -5756 -23637 -10166 -22807 -50498 -52677 -42937 -23312 -18320 -35368 -41319 -54853 -55403 -54890 -42152
5628 -42152 -24124 -3831 18193 14997 1656 4137 34485 44437 17789 16629 24101 54371 58387
5615 58387 40852 43954 15438 4969 23474 -8619 -11761 5589 -9646 -53479 -24101 15463
5603 15463 21511 39231 2309 -15036 -12016 -14979 -12314 -5302 -26139 -41494 -33294 15887 23832
5590 23832 35094 31088 3379 -47965 -71425 -80395 -75669 -34694 -21922 -2264 26624 38359
5578 38359 58794 49984 41131 20110 -14925 -59844 -49665 -53734 -36946 -12174 -9769 -23912 -18633
5565 -18633 -21632 -33053 -15241 -11090 -21879 -12738 -1206 -28598 -63649 -46561 -55953 -21177 -17322
5552 -17322 -23125 -13061 -12061 -22500 -24364 -8683 -35203 -30605 -32856 -25650 -2415 8030 2084
5539 2084 398 31815 -375 -26212 -14055 -9362 -25374 -36537 -26029 14424 16423 -8560 -32174
5526 -32174 -31184 -31296 -36066 -35731 -23822 -7096 -15138 15341 19412 28545 44142 53086 30919 67779
5512 67779 73067 31321 20163 22917 36291 25436 -26200 -61265 -55224 -46477 -17199 10799 -8466
5499 -8466 -9163 -14636 -15415 -9506 -4931 -26496 -14356 -15618 -1529 2084 -13953 -22489 -10414 26166
5485 26166 41152 3961 -38030 -19542 -3038 38917 58704 46828 19715 15151 16829 6055
5473 6055 -12342 9890 35354 22897 37345 35861 1261 17089 34410 24268 -997 22545
5461 22545 33261 11280 -17321 6428 20147 38050 48942 31131 8301 2652 -12598 -44818
5449 -44818 -56552 -49809 -41107 -26240 7006 -2305 -1475 -4193 -10808 21363 20065 -8738 -9499 -11841
5435 -11841 -23766 -8370 -7057 -27718 -36743 -11813 382 -675 5973 2479 -32895 -36594 -9292
5422 -9292 -4516 10561 -2470 -4767 19337 32665 48014 11584 -25105 -389 31367 31675 4463
5409 4463 -8692 -124 20069 4505 8887 38519 32348 2933 -14655 -9057 -10015 19467 64582
5396 64582 64421 50023 22118 -13323 -1291 -1511 -17939 -24761 3439 36206 29061 10231 -7982
5383 -7982 -7707 8226 35756 31185 -16225 -9723 -27557 -39255 -40388 -31707 -12547 -8300 12864
5370 12864 25797 19753 -11027 -24457 -36325 -35329 -7421 345 2369 5642 11750 9758 10521 25959
5356 25959 44574 59320 28074 -18589 -14180 8165 7517 12603 37646 27071 6106 8015 2332
5343 2332 -14811 -31503 -15924 -8463 -43705 -50262 -36138 -13977 101 -6999 -26864 -4095 20028
5330 20028 12108 19244 43795 14923 -18599 -20649 -18835 2045 6204 5333 3026 2502 12695 22918
5316 22918 31710 30823 37674 1473 -12320 -22564 -24971 -27828 -32498 -35321 -9557 -16007 -20824 -20676
5302 -20676 -18439 2404 6948 -1565 21420 24690 34394 -8785 -27898 -10302 -19616 -19292 -14074 -11666
5288 -11666 -16867 -3180 10396 172 -3956 10575 17385 11587 12531 13165 20795 8478 6838 -27
5274 -27 2884 24308 21727 25302 39405 49130 47011 -65 5782 4588 -867 -16647 -13526 -12677 -14587
5259 -14587 -4743 -5124 8818 14165 11639 -3879 -15659 -27606 -28810 -6889 23980 19085 22114
5246 22114 37713 16892 -3050 2261 20934 19977 13526 13377 19266 6798 -45745 -61023 -50110
5233 -50110 -46163 -57085 -48474 -1288 7103 2314 -879 17524 29632 20458 38790 54540 35760
5220 35760 46716 54021 17320 -26224 -26345 -445 27655 44818 12174 -14988 -18345 436 -2757
5207 -2757 -8343 -1607 5157 16135 -1086 -31778 -3828 7307 14581 57101 67702 30237 9
5194 9 -14296 -26979 -45628 -26775 6085 36637 38552 42677 19590 25173 39027 5186 -2202
5181 -2202 -6423 -18249 -6985 -10176 -15256 -3794 11189 -1798 -24431 -20869 409 2567 -2040
5168 -2040 -15524 -59116 -60471 -9484 17014 11511 -23034 -41508 -32146 -4086 16878 -6641 -22154
5155 -22154 -15652 -5246 -7211 -7586 -690 -11132 -28398 -39086 -21327 -2842 1888 10983 5522
5142 5522 322 -5160 -25291 -15043 -11705 -19848 -45064 -27313 -10628 -18714 -29790 -30522 -64233
5129 -64233 -65162 -21921 -16050 -43834 -28760 8558 8589 -9174 -263 955 -12726 -28460 -13778
5116 -13778 -5999 20799 -14939 -35137 -8082 9541 15229 27609 9980 11792 6915 -2355 -12068
5103 -12068 14374 44038 12530 -4568 -16086 -16416 -27961 -45591 -46098 -28643 16402 36970 26042
5090 26042 17511 24418 3400 -14942 -4477 32318 15163 8888 -20306 12973 15708 20316 1498
5077 1498 18327 37843 46322 42672 3932 -20637 -10047 -9909 -6929 -1500 -7002 1959 -4856 -5370
5063 -5370 10997 15540 27172 12224 -6310 -2356 9260 -6935 -27465 -37759 -12400 -15910 -3285
5050 -3285 12784 25877 54193 27476 6215 -12661 -12837 -16666 4680 10582 -1368 7074 -4843
5037 -4843 -22564 -54393 -42960 -26721 -23292 -37047 -39026 -12684 -8015 -23685 -18472 -14261 -31684
5024 -31684 -50060 -46945 -6641 -7601 -24558 -29173 -27771 -26552 3514 30494 37245 31727 30752 30897
5010 30897 20760 7938 1051 -7555 -24665 6380 27379 19985 17132 -870 7937 28532 11361
4997 11361 -26416 -19828 1491 11625 31677 60927 53396 40214 21149 31505 44495 34322
4985 34322 -5893 -19788 -30626 -21645 -16729 -13201 -7022 4789 8728 28848 28545 -4913 -41243
4972 -41243 -36863 -34549 -9135 9200 -5301 -14557 -11376 -10025 -40152 -65098 -50432 -46725 -24680
4959 -24680 12718 36174 55954 44100 21704 26640 27855 40625 33610 -3125 -26884 -22102 1946
4946 1946 16095 -11494 -45483 -92092 -97196 -67341 -33723 -10558 -29425 -20948 -26945 -35395 -19938
4933 -19938 -11722 -27606 -25913 -33602 -7709 366 -6233 23899 17248 1244 9026 31123 48644
4920 48644 51720 40892 58362 47754 -274 -19964 -19955 -1758 14701 -31247 -43195 -24756 -19288
4907 -19288 13833 14818 33847 44677 35577 33248 45196 37430 30313 8522 11151 16358 4289
4894 4289 -8808 -3361 -2728 -25480 -10807 -1491 -52048 -43458 -3673 -364 19701 38504 38719 30580
4880 30580 54344 73777 55926 50763 24620 1476 10997 -7020 -30730 -5222 -3934 -35165
4868 -35165 -30712 -28545 -22026 -17380 4673 28810 18066 -5040 10738 33266 31038 25672 41187
4855 41187 45762 26722 28505 22385 19906 16867 23518 29601 48468 48038 23311 10669 10029 -5082
4841 -5082 -9657 30735 56523 47245 43771 22085 -15850 -16465 -22635 -46998 -26422 -12439 -6786
4828 -6786 -445 5392 22035 11445 -19251 -21732 -22199 3828 28712 4168 -10492 -37379 -31267
4815 -31267 -13354 -14451 -5086 -11769 12803 28069 5962 -15826 -55424 -47820 -16301 -29390 -27407
4802 -27407 7952 13429 32522 51331 32731 5884 11935 20401 13354 13014 14964 11796 -27423
4789 -27423 -42340 -49087 -15081 -13956 10214 9492 1031 -4903 12296 -2179 -26542 -39576 -24732
4776 -24732 -29823 -54079 -32675 -45830 -54714 -36737 -10030 4723 -10370 1023 10502 16744 726
4763 726 -28041 -80555 -85196 -56117 -46751 -17952 4551 31140 5035 15626 17987 -4925 -20670
4750 -20670 -36285 -35563 -40124 -22900 -21299 -26151 -14224 -13256 -17989 -9547 -15097 392 14907 23557
4736 23557 42837 27526 27719 26810 8449 41752 28871 17428 40044 18054 7438 -23125 -32197
4723 -32197 -36138 -58856 -51484 -66463 -46199 -26309 -20462 -6005 11386 17841 31055 35185 17917
4710 17917 -13283 -34180 -44706 -42702 -22500 -15254 4057 24402 9726 -4612 23918 8986
4698 8986 16271 21671 10745 14834 13763 4531 16003 3755 -16039 3939 24668 29785 34240
4685 34240 21536 19342 26650 46306 7711 -31025 -51963 -18971 11704 32367 35861 14442
4673 14442 12859 23280 57970 53678 14649 -4639 -19363 -28624 18079 49066 55564 46849 38664
4660 38664 41837 19944 -5216 -11896 2722 19807 42353 34616 50265 42878 6725 5092 12904
4647 12904 14795 5333 19669 8870 -7855 -2306 -14179 -24754 -24921 19587 1747 -32700 -36078
4634 -36078 -11443 16736 34719 9216 -49190 -67975 -20179 -25935 -10178 -3838 -6737 -7230 -21208
4621 -21208 -26696 -37430 -33500 -29952 15174 10816 -3033 -12196 -22525 -10117 5799 16584 15515
4608 15515 14171 12751 9291 29295 36643 29794 26837 27286 17010 -2398 3913 3405 11327 15726
4594 15726 17599 12681 26316 48197 54331 54311 9741 -35814 -45756 -8458 -6017 -36883 -44686 -40221
4580 -40221 -20444 13111 18522 22209 14682 -13540 -37529 -42542 -30516 -13901 -8135 7942 26301
4567 26301 24155 28274 46227 27377 -26189 -42894 -43873 -377 26410 18848 39894 24180 25930
4554 25930 10357 -8949 -4601 -19150 -11236 -6397 -16861 -5621 -228 10113 23469 12796 -1083
4541 -1083 36566 40414 34455 9867 -9637 -6357 1817 -3262 5058 8617 20509 36721 21119
4528 21119 6160 10820 -4929 -27949 -25621 21307 9309 8386 18345 23323 16244 -16687 -21885
4515 -21885 -6530 -10022 -4786 6361 -5411 -24535 -24958 -8768 -5875 -5253 -23506 -22350 -21400 -18834
4501 -18834 3374 16421 -5362 -10632 -33051 -32893 -43544 -31152 -22382 1895 28015 40207 9554
4488 9554 -16335 -12467 11824 28064 35866 36221 45863 44406 40660 16261 30310 37605 22984 35100
4474 35100 27519 14642 -2813 -11239 -15243 402 19840 17513 184 4540 11481 -10187 -29477
4461 -29477 -11921 4400 44511 62367 29302 -6705 -6332 -9704 5274 -25949 -48870 -35442
4449 -35442 -33494 -37698 -16234 -8759 9958 -908 -17446 -3340 -5460 10722 13992 20838 21444
4436 21444 10677 12156 18703 32194 43083 39336 28519 23138 33874 34943 44590 57116 25838
4423 25838 -4313 -40244 -47010 -32334 -10901 -21383 -27603 -37745 -45155 -56163 -26121 -11567
4411 -11567 -5346 -9798 -24149 -29060 -28494 -51839 -50281 -30545 -19974 -38159 -44900 -27801 -21934
4398 -21934 -16312 -16237 -19632 -12230 2483 13438 -3560 -9417 -211 -9976 -19895 -6072 -6179 1628
4384 1628 814 -7586 -16059 -5395 16537 -5431 1963 27750 31169 14839 17296 24289 10060 16297
4370 16297 20628 -25712 -11388 1032 832 -5373 -1084 1753 14856 10997 4784 -3106 -28835 -18241
4356 -18241 -16434 -24072 -31718 -19583 1435 7253 23427 12805 -1251 11293 28177 22820 -6790
4343 -6790 -29336 -13148 12221 18675 25191 11950 31906 28527 15482 -15733 5643 21798 25941
4330 25941 47256 28826 53071 56476 66800 42444 28464 15993 -10625 21251 37852 49122
4318 49122 53928 49858 26330 8710 -19173 -49994 -44572 -10053 25338 21238 7683 -14355 -10143
4305 -10143 -15723 1709 41377 33755 16003 -808 130 14580 19708 -19407 -15149 -7383 -25980
4292 -25980 -32251 -19254 4170 7420 18298 34102 39747 31845 22109 16187 11795 -10166 -17089
4279 -17089 -8836 -9297 -22197 -15067 -2903 -2699 6900 43472 38332 3706 -18509 -1078 3453 1368
4265 1368 18657 28001 16548 13901 19624 11812 -14645 -35098 -42895 -24580 -20594 -21487 -37463 -24919
4251 -24919 6661 383 15715 12471 -11736 -35506 -56361 -54926 -6867 9732 4018 -1267 5062
4238 5062 12839 741 14664 14921 13151 29402 35391 28406 -9543 13026 37565 41034 35089 19300
4224 19300 26626 53796 50317 59749 19460 4254 10367 -6382 1596 7339 17434 2893 8447
4211 8447 13177 -74 1897 3607 42119 34770 -21108 -47745 -62282 -45527 -36768 -18186 1481
4198 1481 13473 -4017 -8091 -35318 -36962 -18241 4147 26837 35867 54113 59102 28929 17834
4185 17834 31539 40670 13685 -2340 -10701 1106 -12502 -8976 -29121 -12915 17434 33744
4173 33744 28080 7170 -2686 -9428 -16977 -35206 -28482 -334 18192 9256 -7142 -26550 12996
4160 12996 56509 46070 23381 6208 16100 -27359 -66806 -74263 -37297 -14286 13526 31733
4148 31733 26234 8254 219 -7207 -14790 -18555 -43638 -41315 -17040 15644 6909 -11299 -12607
4135 -12607 -24937 -16970 -5533 -34114 -13249 -13784 -25979 -76381 -92351 -59613 -31346 -27238 5001
4122 5001 14810 -35020 -71206 -36671 -23607 -16989 -13465 3810 2670 -4831 -1494 1092 32203
4109 32203 51607 26600 9903 13902 15780 932 -25657 -24407 2437 25513 1877 2105 6229
4096 6229 -2437 -8508 -4624 -9444 1685 11927 49437 25617 7013 10766 7479 -598 3537 7398
4082 7398 268 -7750 -18826 -29754 -51922 -23757 15300 8741 29821 25999 25712 -3420 -18971
4069 -18971 9183 14985 -4701 598 -13166 -46536 -39930 -16710 -32512 -44435 -30806 -25847 1264
4056 1264 -9293 25061 61099 58805 34055 -18844 -11543 6688 10630 15771 14230 8398 18012
4043 18012 14499 4381 11754 24208 23467 4525 10249 8540 2723 16010 13112 -14043 -23447 -16640
4029 -16640 -12308 -25585 -5410 33203 40360 20712 5217 4754 34854 55483 52187 61982 44575
4016 44575 27395 35740 40164 30418 26184 16337 1583 -74 6633 -2988 15892 28353 14033
4003 14033 -11486 -16373 -29304 -54352 -44548 -31351 3551 12478 4412 -16160 -15043 11197 33736
3990 33736 34094 22732 20162 38108 18694 21138 18959 13117 -10890 -22828 -29791 -32013 3648
3977 3648 548 8072 -8050 -1341 -5063 -18186 -16923 -572 -7913 580 -16176 -27581 -920
3964 -920 7006 -21350 -41094 -24298 -24695 -25835 -21163 17000 14355 7271 11393 -13071 -20297 -3486
3950 -3486 7719 18878 17899 21499 12801 -20802 -34153 -36003 -43081 -17488 -27699 -26547 6345
3937 6345 32879 47923 32061 15597 -15718 -30151 -1642 23260 32311 13043 -5826 -10386
3925 -10386 -1175 -5424 -12746 1562 18862 24823 41013 37083 6105 -7425 22068 6695 8112
3912 8112 24617 4634 -1500 1273 -10496 -39011 -33719 -35278 -18541 28582 53586 22151 -18176
3899 -18176 -29377 -46391 -32428 -20687 -21409 -36018 -42208 -35034 -6718 -7878 -8717 -30011 -40248
3886 -40248 -21301 -13841 -28086 -6118 24045 24487 -9662 -29188 -35507 -28287 -51291 -43339 -12119
3873 -12119 15929 15936 -16393 -12058 -14248 -2082 7154 23183 47081 77652 35515 3272 11730
3860 11730 -2529 -31637 -34896 -4970 3044 7613 -5468 -30784 -8946 22701 38120 11940
3848 11940 -13414 -31874 -14152 9362 16851 -2401 26124 35494 4544 -1968 -23943 -10297
3836 -10297 20374 24846 18411 700 732 -1872 12709 25241 17080 -22625 -54928 -35415 3295
3823 3295 -23748 -38770 -51139 -44734 -24506 -27047 -27823 -49424 -57073 -42747 -16303 -36249 -56407
3810 -56407 -25163 -11149 -5248 12635 7462 8618 -21135 -33197 -30843 -6450 9680 16830 18101
3797 18101 6247 -8528 19070 37084 35294 36374 34469 39255 25790 -5094 -34209 -34191 -39839
3784 -39839 -17729 -16469 -25645 -6443 -4410 34351 41389 55452 48407 43287 45135 50896 36596
3771 36596 31172 47731 40262 38501 33260 54228 57568 49546 45785 38560 34908 20975 27833 1916
3757 1916 10376 4670 -18737 -28598 -26527 -10833 1308 18543 22802 19901 7911 -8625 -39913
3744 -39913 -58439 -49370 -66477 -43574 761 16042 -4368 -2464 3006 -6933 12772 37955 37133
3731 37133 14160 -18680 -9540 17841 1343 10686 628 -46989 -57174 -32752 -42761 -49217
3719 -49217 -37730 -25385 10953 27695 -1547 -7430 -5022 -31802 -40903 -15417 -5187 22619
3707 22619 37999 22758 -21901 -56274 -10549 31932 19934 18695 25717 16917 4855 9381 18287
3694 18287 6267 13059 33456 15407 20699 42730 7971 -5871 512 -305 5437 18869 3787
3681 3787 -20593 -20058 4522 9390 -3630 -14417 -8599 -20096 -24969 423 9494 6582 21184
3668 21184 822 -17915 -18782 -7583 -34903 -15817 11426 20250 13595 6575 5718 -11499 -25764
3655 -25764 -23072 -24342 -52765 -36936 -9694 -10863 -8541 8947 1465 -7141 -26558 -38464 -42322
3642 -42322 -39524 -26667 4498 22159 34180 31160 61139 50036 21961 5353 28466 30965
3630 30965 7537 -6185 25187 32348 43610 73755 45073 20049 17794 -2831 -10149 -11843 -8340
3617 -8340 21603 34205 26562 22769 13002 18 3205 15996 11856 -1260 1133 24382 24219 17114
3603 17114 1354 775 3953 17892 24945 29621 9877 -50349 -19710 -10392 2391 9415 -10112
3590 -10112 -26941 -26760 -27880 -43079 -39968 -29276 7100 13587 22225 50169 62227 49329 34082
3577 34082 9938 2587 -3656 -14933 -28714 -34897 -24708 17958 6383 -19408 -25951 -30023 -32405
3564 -32405 -19997 -3481 5560 14388 8775 -9525 -10699 13230 29204 26078 23147 15458 29415
3551 29415 34938 10564 5274 27604 35354 24919 22335 6311 -8100 -10645 -22062 -18017 15962
3538 15962 5214 -10878 -31156 -31586 -29259 -68999 -88047 -52359 717 25125 13873 2117
3526 2117 7507 41535 77195 84883 38213 -33380 -33656 23654 40405 30545 2456 -15114 -29073
3513 -29073 -22258 14758 16288 30370 53599 55075 48186 43656 14309 5630 -2512 -19652 -25246
3500 -25246 -26543 -25836 -18129 -6523 -2796 -6170 -20070 -37492 -12475 6686 1540 -3713 -2257 -26745
3486 -26745 -32568 -9291 -29269 -17753 25377 49464 33674 4833 37 7694 10610 24125 50003
3473 50003 61373 51013 35766 48381 42610 3285 -29280 12438 22354 -5807 -31189 -3749
3461 -3749 -11446 -29999 -32354 -25915 6367 -1680 -9309 -11892 -9304 -14552 -20116 921 34005 46223
3447 46223 46809 52271 79862 33892 -9222 -10481 33717 45685 13004 -10949 -12528 -35443 -33080
3434 -33080 1568 23025 26251 33358 20427 5143 -19994 -16828 -16809 -5477 -22844 -46311 -46251 -34787
3420 -34787 3451 6677 -13003 -24073 -40950 -34111 -24586 5226 11755 -37892 -46289 -21637 -7979
3407 -7979 -11705 -15612 -19769 -15620 -32493 -52936 -59920 -36281 -27671 -12929 2769 5823 -27099
3394 -27099 -22561 -41028 -38949 -36106 -21547 -10528 -20986 -51968 -55964 -20040 -20786 -12833 -11925 -17598
3380 -17598 -22248 2930 25377 47283 6176 -34258 -26066 -34246 -44325 -40608 22934 61269 28720
3367 28720 -3801 29587 54664 30825 23783 7915 -14927 -26403 -16430 -19975 -29593 -19485 -14969
3354 -14969 9266 19032 42482 36972 -536 -29811 -21992 -11250 -6769 10574 -5804 -25608 -22609
3341 -22609 -19486 -10160 -1367 -9185 1177 -4190 -16162 -9955 -23843 -5584 -15444 -26209 -2578
3328 -2578 -8278 -6165 -7942 -53763 -40065 -4502 9870 10831 23847 9163 24263 36683 20288
3315 20288 5168 -21812 -11304 7618 -2605 13761 16848 14462 18621 19831 41908 68370 39544
3302 39544 4106 -18645 -24772 -12336 6116 3833 -14199 -26789 -22712 -504 26413 30331 29221
3289 29221 52497 54529 56784 50094 28157 5464 13593 25471 51426 59825 46447 13264 8342
3276 8342 12127 22597 -13364 -28718 -46472 -41662 -5133 -12800 -31959 -39506 -30633 -11798 3609
3263 3609 29057 33390 5617 -6812 10893 21874 34526 20929 -7076 -36068 -46239 -38851
3251 -38851 -37441 -17104 -36811 -51389 -35630 -22749 5270 -6344 -11699 -4069 21504 4369
3239 4369 -22742 -2924 8762 -118 2406 7882 8053 29882 28093 23645 7285 -34811 -61716
3226 -61716 -28869 -10327 2813 -99 -9126 -1196 4924 -2669 17832 50502 48637 31460 45726
3213 45726 67580 50388 58308 60942 47733 20871 -731 -17618 -17725 21676 15419 -18888 -22242
3200 -22242 -12856 -9513 152 -4109 -18467 -33395 -32039 -39076 -19944 -25693 -13546 -9648 -39045
3187 -39045 -41706 -29938 -1902 15218 1103 -15684 -21255 -13804 8795 23909 -11368 -17832 -17672
3174 -17672 17708 30170 19750 28442 19972 11283 3832 23486 44500 18179 -19155 -14045 -27477
3161 -27477 -18615 -40467 -28606 -26094 -31313 -12162 11468 24343 12814 -19619 -7855 17691
3149 17691 16627 12498 752 14341 -1761 -6023 -7114 2050 -3824 1103 -12928 -34841 -22307
3136 -22307 -24515 -16288 -27343 -34405 -46878 -67875 -61350 -44399 -37292 -14151 36407 47284 51620
3123 51620 54213 53407 5274 -16970 6059 17973 9183 -5236 -25484 -28137 -51604 -82034 -36485
3110 -36485 -10707 -18537 207 11543 -17983 -35710 -32744 -37731 -35204 -27330 -5457 10544 8220
3097 8220 2959 -15206 6195 18264 -8520 -22128 -11756 -19358 -23366 -24194 -36365 -9959 3227
3084 3227 12406 2878 -4705 9276 27107 26319 -11007 -29111 -46354 -34806 -26636 -42611 -35682
3071 -35682 -27809 387 -6686 -15151 -10024 -9084 -7768 -3670 -11620 -7558 17492 7395 5102 7898
3057 7898 14874 3974 -5237 -22278 -25204 -25638 -28608 -16485 -26639 -31006 -40906 -37452 -21652 -30550
3043 -30550 -55135 -62275 -36331 -8347 -35346 -56071 -41579 -39355 -46084 -32963 -32396 -19197 -20336
3030 -20336 -21817 6880 49485 39327 21808 25366 27810 12777 18889 22088 32100 43146 26095
3017 26095 -18350 -4030 3447 -17721 -10747 15497 20478 14197 6329 21934 48290 61326 50344
3004 50344 44000 30695 21149 14486 10249 9627 -8662 -6023 26911 41618 11385 852 5221
2991 5221 1135 -6742 -13190 -17865 -14748 -7582 645 -9529 10130 25412 14940 6723 -1425 -28202
2977 -28202 -44479 -27367 -26757 -22355 -33587 -27080 -29922 -21600 -7844 -4635 -23730 -55726 -40706
2964 -40706 -59266 -52682 -45961 -30790 -9296 -8181 -25250 -28464 -29467 -42798 -18841 -10090 9356
2951 9356 22054 12903 5712 12432 19942 -19157 -42055 -55100 -52052 -29760 -14757 2330 30163
2938 30163 68122 56386 23656 16027 17511 12364 -12742 -30472 -14841 14971 10705 -1132 27637
2925 27637 24227 -30875 -60539 -49791 -11191 -17266 -870 -14356 429 8144 2829 -12006 -27690
2912 -27690 -28488 -39090 -7725 18732 4583 -8814 -34066 -14771 17437 11858 10861 8165 -14555
2899 -14555 -13759 967 2226 14379 -10973 9501 55604 35459 -1637 -14127 10727 7571 2751
2886 2751 -14612 12107 36110 36646 28025 26134 14900 13420 4247 8332 6733 17370 27558 28344
2872 28344 22134 -12893 -16097 -13588 -1698 -25122 -35761 10031 -10258 -10971 3437 829 21421
2859 21421 5458 -13997 -18258 -48680 -37044 -20886 -13413 44818 66162 63572 32898 -16555
2847 -16555 -132 28989 29068 -2352 -34418 -18561 -13925 -25883 -9804 5094 2002 10747 2798
2834 2798 11395 17876 -11355 -8916 -20307 -6486 26182 17031 -656 -14898 -33069 -59138 -37544
2821 -37544 1392 3455 -9858 -48696 -58053 -33977 14254 50610 29565 10326 -1545 -16729
2809 -16729 -33188 -16289 -5797 -22642 -33867 -22036 -19190 2470 11305 45784 66594 39911
2797 39911 4799 1472 7458 23829 37712 21773 14353 -14397 -209 12162 18146 35662 17490
2784 17490 -18942 -11574 22522 -3142 -46980 -44106 -21578 14690 58958 62041 59795 32550 42424
2771 42424 29788 1341 -23479 -33834 -14760 -196 -3369 1708 32573 40133 22760 34284
2759 34284 42275 32497 21538 46874 57262 39692 2017 -5929 -1916 8264 12453 16011 23359
2746 23359 28711 22244 25101 54906 49920 5934 19197 27395 46787 40707 13506 -11019 3410
2733 3410 40580 44255 29799 29373 2652 -28975 -10212 28613 35794 22607 3673 7455 2299
2720 2299 -1691 -4247 -8784 -22744 -16644 10245 -5687 344 29288 5996 13049 41761 48634
2707 48634 37487 8124 -10009 -5265 -7856 -2104 -6745 -18016 -14146 14304 18805 2048 -7511
2694 -7511 10293 4531 12786 22230 15814 2836 -4811 -35477 -72806 -47675 -11815 12543 67510
2681 67510 36633 1573 37619 50288 28572 16973 20166 42760 30464 33051 43698 38910
2669 38910 41939 25789 21341 23151 7800 -42054 -30006 -6446 -6502 -25657 -31849 -27108 7309
2656 7309 -11896 -24308 -25564 -22821 -42077 -24909 -132 -7486 15543 27253 -293 -32588 -75840
2643 -75840 -76076 -32303 10578 12931 22507 25426 15296 -25978 -57642 -46155 -5708 4540 17099
2630 17099 -3804 6888 3351 -9505 -24414 -17422 18457 14524 -943 -18535 -12948 4909 21436
2617 21436 8288 -17558 -12190 14065 -2024 -23667 -22802 4512 12838 2941 4082 20775 20254
2604 20254 -934 -15211 6112 1045 28358 26004 12283 -2645 19831 44728 33695 45188
2592 45188 36944 32280 40749 30916 16380 3513 1931 -14494 3785 -1374 26601 19838 853
2579 853 16489 19041 33162 31534 -2474 -39399 -37188 -10287 -14721 -16645 -11404 -32798 -21057
2566 -21057 -16246 -19895 -28151 -4323 -2442 -9518 -20560 -45701 -42213 -27091 9639 1406 11106
2553 11106 174 -22515 -7429 -7173 -23693 -3854 -929 -2209 31 -18254 -13470 -4697 -9758
2540 -9758 -11630 -1762 -44696 -59352 -32075 7473 38237 29284 -3647 -15606 -37487 -29745 -24246
2527 -24246 901 13675 9524 13759 4118 8260 9009 21813 17828 -16521 -28049 -18680 -7269
2514 -7269 -22488 -35559 -28288 -36921 -30044 -20137 -31805 -13089 6105 -4169 -52811 -62268 -19693
2501 -19693 -21326 -16024 -15310 -35281 -45586 -51663 -42428 -7072 -39759 -48816 -30843 -12957 -14511
2488 -14511 -31771 -18852 -24076 -62534 -64170 -52404 -38495 -21562 -13440 -12987 -6250 -2045 -17723
2475 -17723 -26810 -35912 -21085 10588 8366 1557 22084 33352 11050 -896 8866 5012 -3412
2462 -3412 -2145 -4876 -49554 -83139 -79777 -51890 -47021 -36591 -34121 -32843 -2902 28634 24295
2449 24295 -6031 -6026 3480 4866 21258 46025 52689 44496 -1006 6583 1380 -16302 27306 52482
2435 52482 17148 7616 6761 2709 7233 40489 55432 53584 36479 3775 -18755 -34645 -13554
2422 -13554 -2450 -11016 -1402 9333 22066 35707 22810 33025 36760 44514 39940 -9909 -5151
2409 -5151 7350 13967 1542 15607 14764 9660 5573 743 -36195 -42666 -6378 4514 17900
2396 17900 17755 -15414 -38060 -40670 -30548 -34396 -42585 -19581 -18558 -1814 -1878 -4362 -5229 10687
2382 10687 -10200 -7631 -1694 -7797 -368 14501 21270 29459 16076 24445 25817 -1207 -20097
2369 -20097 9642 3053 2268 -12298 -44263 -28656 -27652 -1595 11393 24900 33444 16725 -20267
2356 -20267 -50126 -33390 -2586 9423 26819 25569 59294 55822 27034 15509 21048 31861
2344 31861 33104 25682 30031 36888 -891 -22255 -16366 5241 38319 44227 31661 36416 14433
2331 14433 -803 -29821 -34499 -17506 -20330 9246 20409 42677 33052 -5006 -21825 -25550 -19389
2318 -19389 18961 11970 14727 8548 -9102 3755 27785 13012 13638 20629 -22096 -27915 -22786
2305 -22786 -18503 -31140 -13295 42588 67473 68003 45354 32438 33081 5996 7621 25002 24562
2292 24562 8833 4448 1034 9515 19158 12607 5157 3098 14188 10398 27536 24222 8563 8268
2278 8268 3312 -26034 -27680 -29391 -14159 -17317 -27043 -28242 -4310 17500 10694 11353 37109 45292
2264 45292 43075 48187 41755 48776 39684 31227 34433 15235 -19732 -6523 -9820 -10178 -585 -30669
2250 -30669 -45680 -34400 -48009 -40050 -38606 -10294 27793 43873 28398 35343 14960 -3104
2238 -3104 -9443 15484 6180 -4225 -11347 4528 11300 14612 1769 -10493 -39934 -33852 -36248
2225 -36248 -40642 -37017 -35762 -44695 -67119 -72471 -32351 -22102 -15556 -17599 -14668 7647 3267 -16885
2211 -16885 6040 10716 -6129 2247 31856 26025 4240 14186 6452 -6397 -10611 -23617 -40980
2198 -40980 -25382 22706 33746 21649 16425 5974 3850 -9963 -26533 -3024 -18218 -24904
2186 -24904 -17413 -17767 -34890 -32017 -6823 21031 20668 19966 17599 8982 30278 44303 50300 18900
2172 18900 11005 -10017 -12273 -4906 -9865 -11614 -20840 -15242 7549 -3178 -27804 -25416 -2663
2159 -2663 19351 -9241 -23802 -31920 -5652 2681 14626 8816 -20108 -27238 -22211 20849 15892
2146 15892 -1219 -936 -49438 -97179 -103830 -78189 -75379 -70232 -69842 -41015 -21170 -2262 -2958 -3807
2132 -3807 -2380 23028 11919 -13601 -23155 -21448 -3248 32974 43491 24447 -6426 5283 7914
2119 7914 -4156 -9538 -13373 -45630 -70565 -32136 -14531 -8505 25805 63384 45186 25176 30271
2106 30271 35631 31715 13792 15047 2398 16802 18751 22007 11921 13015 55736 44781 -11879
2093 -11879 -34607 -33544 -42505 -49613 -33279 9512 27309 22328 13113 38348 32172 33827 13837
2080 13837 172 -1433 14481 15051 14957 17575 2876 -857 -10002 1086 8213 -19278 -6675 3089
2066 3089 -8562 138 7468 -20009 -21773 -3570 -15762 -42938 -19987 -1370 3149 -12044 -35783
2053 -35783 -28550 -21362 -9380 2993 -18495 -11496 -14335 -37402 -28798 -7943 5799 37740 40657
2040 40657 25709 33870 35054 3593 -7359 2750 21836 1699 2656 28546 35784 21900 4909
2027 4909 6364 -5395 -35874 -42803 -47155 -33542 -2056 -14276 -28442 -32034 -2485 -8366 -20035
2014 -20035 -15875 -633 -19341 -29287 8329 31124 8913 -19370 9000 35750 11998 -7468
2002 -7468 -14553 -11535 -8894 -1757 -5303 11407 3582 -3255 15574 40242 31427 10243 16517 17052
1988 17052 11241 30140 40853 36297 26916 -4488 19596 10371 823 30680 32436 9048 160
1975 160 -7530 12648 1422 -3406 32919 39580 38032 35514 13111 714 15193 14538 11447 28696
1961 28696 9536 -20473 -44628 -14391 4293 7050 14664 9410 -8906 -8177 14062 4625 15380
1948 15380 28064 21857 19730 13443 -6243 -29434 -37948 -38271 -37338 -45121 -40275 -35157 -45829 -44576
1934 -44576 -48519 -47514 -29707 -21694 -34858 -30316 -3193 14373 11546 -3061 -11180 -23653 -39309
1921 -39309 -26565 -28360 -5673 4195 7475 -1397 -34180 -4927 12325 16536 19563 7214 -14872
1908 -14872 13934 36033 3413 6474 4491 13278 7968 19645 5765 9026 29383 39006 44199
1895 44199 16363 -2698 -3826 6655 -3209 -21316 -26427 3276 22645 22786 51910 50209 20377
1882 20377 1426 14064 1565 1408 492 1035 14572 17951 9178 16874 29963 42220 26232 23076
1868 23076 3276 -17651 -25150 -22162 13855 47500 43987 46090 38231 32801 19124 1661 -29736
1855 -29736 -30225 -17761 -1489 -7517 3423 -8152 -6572 -2362 -19180 -14088 4052 -5160 -20463
1842 -20463 -8900 -14391 -34175 -49847 -45680 -13793 -9163 -22391 -25220 -35901 -26246 -27426 -30620
1829 -30620 -23572 -11264 -10887 -6558 -20164 -21624 -18451 16465 3319 -22453 -8730 -11099 -3886
1816 -3886 971 -18434 -39474 -29429 -33181 -1091 -135 10541 26658 22270 54128 52657 37885
1803 37885 -73 13953 -4525 2240 18503 17380 14294 -890 3884 2785 14706 37994 11698
1790 11698 17460 33901 17758 15832 54710 44246 32643 29226 24043 28658 30676 -4158 -30499
1777 -30499 -37017 -40156 -51468 -53507 -30868 -23993 -32101 -35927 -15978 2688 -825 3952 2530 2452
1763 2452 16789 28079 13314 -6964 -9376 10224 29060 36751 16716 1471 8641 32659 49403
1750 49403 32513 6751 9734 -5357 -14057 3896 22886 30205 29810 33504 21489 25225 23554
1737 23554 21854 49714 66048 59082 40067 62235 73242 45001 7120 -11272 3136 8948
1725 8948 4092 -888 -23673 -8195 6858 -17460 -26919 -35991 -33533 -51441 -27931 13068 12773
1712 12773 -4371 -105 -28810 -36184 -31879 -25132 13619 4114 -7397 -19452 -38440 -30165 8290
1699 8290 -3003 -32697 -37730 -14399 -2579 11582 9303 -24037 -27647 -24273 -4692 -444 -5579
1686 -5579 9593 40662 35119 46351 34265 26915 18155 21931 -2478 10658 30451 34739 34901
1673 34901 30175 36919 29315 5770 14333 23439 7979 -13127 -18865 -26684 -21046 1272 -5064 -23923
1659 -23923 -41410 -38538 -32061 -4712 18805 25706 -7112 -31374 -247 11281 -11489 -3088 39288
1646 39288 28239 -6246 -29356 -25832 -12382 -6324 -1360 4697 -1553 -435 3964 11050 17921 18018
1632 18018 5248 -9335 -4548 -23094 -35633 -21635 -48549 -49786 -21590 -36231 -35383 -23893 1942
1619 1942 -1786 -8585 -15956 -29829 -31654 -24526 -7906 -5513 16198 8992 -4755 -39618 -40346 -32605
1605 -32605 -4643 20510 25849 7891 919 30641 61754 21669 24876 24042 17477 24946 40322
1592 40322 32888 14335 -3068 -16002 6964 -15174 -21658 -42230 -33508 -16694 165 29488
1580 29488 38009 7096 -25230 -42812 -41047 -29021 -48793 -34984 -29688 -29398 825 -5377 -602
1567 -602 4231 -21669 -28852 -9282 18947 27819 34208 36204 26301 21795 5165 -9156 12323 16709
1553 16709 29737 26606 -715 -9513 -23322 -13839 5005 31303 5953 -30944 -37130 -19897 30033
1540 30033 30481 28854 21699 129 -10493 2361 -3515 -11047 9485 29980 28993 22448 21628 26349
1526 26349 -8593 -30574 -28054 -28089 -12325 8865 14408 13049 43719 39343 66258 48322 -10330
1513 -10330 10212 13896 15526 23656 30134 14882 13454 24505 37448 23454 30812 39087 39286 11364
1499 11364 -6446 -11105 -370 10280 31040 20011 -1785 -32752 -48689 -42864 -8911 11232
1487 11232 26355 26633 47426 58004 41644 19376 15735 -27233 -50125 -31842 -8794 -11482 -18859
1474 -18859 10194 -8525 -16212 -4454 20521 40238 40304 45685 26265 14808 9431 2493 -9224
1461 -9224 -17451 -5428 -14600 -19362 -14372 28507 29482 25620 20254 2090 -15932 -18128 -20129 -4342
1447 -4342 8684 30884 28997 26113 7477 6212 -6700 713 34778 39462 -2841 -34425 -30112
1434 -30112 -26769 -41899 -62007 -78435 -82619 -60507 -39856 -21341 -18379 -19081 -25830 -15712 -23031
1421 -23031 -28858 -25197 -43859 -66723 -38833 555 19352 28667 16179 13658 -1440 -21499 -4818
1408 -4818 14229 21501 -19410 -30422 15322 29592 30042 16179 7828 17011 19778 23507 28586 35771
1394 35771 33640 12122 5180 19698 -14149 -32833 -41485 -33417 -31417 -30291 -23904 -18404 -16927 -10311
1380 -10311 -4365 -8272 -2751 8527 16233 2139 17409 21698 44011 46627 39433 28963 11226
1367 11226 -17804 -29548 -23333 -44261 -57586 -80463 -75547 -82070 -68720 -32580 2707 45651
1355 45651 32806 11807 19937 20324 1694 21782 24575 -12480 -2297 29308 31458 30567 35154
1342 35154 24162 17045 12869 -3157 -17780 -30597 -45466 -62646 -30380 12383 25291 -27049
1330 -27049 -39056 -28400 -17908 -13810 -20142 -2381 2646 -13329 -5023 -26860 -37565 -35506 -26489
1317 -26489 -29715 -17671 2520 12968 13101 19694 26572 -4626 -25947 8474 26478 20067 26012
1304 26012 -3380 -14017 -21167 -10158 -4585 23353 59278 36099 7050 -4750 14026 3900
1292 3900 9405 24534 19211 39464 68132 52720 5726 78 28168 33716 4252 213 -8873
1279 -8873 -19325 -30030 -31949 -16596 -11886 -15620 6917 24161 36111 17739 6832 8021 -22558
1266 -22558 -58540 -78400 -55556 -10356 21807 9217 2061 -10546 -17374 -9780 7650 30828
1254 30828 18542 20824 22982 7926 -16767 -18055 -11224 -10361 1366 25357 13248 -1834 3779
1241 3779 -12554 -8443 2207 1074 11312 15963 8511 -10998 -18358 -23100 -12156 902 -14175
1228 -14175 -12608 885 7933 -38273 -68952 -72535 -50756 -29124 -9421 -6742 -22324 -13609 5784
1215 5784 18858 21013 21913 3472 -4780 3309 12076 -8463 -22259 9184 20421 24592 16744 2891
1201 2891 -27846 -13213 -3417 -6065 17340 24002 26748 38095 -318 -13460 -15651 -9381 -5891
1188 -5891 -3633 -21213 -23953 23983 66795 74226 41831 4891 4220 15397 13575 -12745 -22708
1175 -22708 -45386 -22348 19580 27877 7031 -16232 -34871 -15191 -1917 33502 41449 21019
1163 21019 9123 31945 19313 22239 16556 1476 -11096 -6118 4504 4505 -7789 -10688 186
1150 186 -12371 -8529 26556 31391 15883 34116 57094 40477 25559 29604 58508 52266 59518
1137 59518 72872 53059 50696 23127 9303 -4682 -19833 -49821 -22013 -12354 23747 14754
1125 14754 -19884 -53064 -30489 1146 18117 7186 -22761 -28999 -23825 -2756 10064 -15782
1113 -15782 -18784 -10515 4691 26363 46748 55017 52709 49752 37332 44605 22852 670 -29209
1100 -29209 -49591 -61880 -34596 -2723 -2531 14396 17387 12014 7520 1133 1251 16959 38170
1087 38170 48638 27535 19521 8198 24013 17397 2896 -32781 -33577 -28922 -16750 8984 35454
1074 35454 61710 68179 64905 50138 44578 47489 5645 11389 12825 1791 -12573 6453 3616
1061 3616 -16617 -22315 4899 20407 13080 -8028 -13682 -11813 -14937 3165 14602 22928 34963
1048 34963 32199 64478 65968 47653 29425 11086 -7728 532 24254 23691 25828 -5982 -12553
1035 -12553 10183 23274 40807 34432 40030 54224 67539 54113 15805 -47186 -58221 -56700
1023 -56700 -56930 -23768 -7304 -28594 -36732 3214 16944 11715 22725 27695 20208 39442 45694
1010 45694 22383 8239 16517 14599 -7809 -18619 -25178 7538 24609 6219 -4926 -4026 6262
997 6262 34978 11491 -20744 -45454 -65342 -78758 -68117 -34070 -21729 -3168 40455 43482
985 43482 14921 16821 28030 31834 35717 31034 42302 23441 4348 10379 37527 52937 8257
972 8257 -7991 -11343 -1204 9805 18168 -9800 -22923 -30476 -28024 -8812 2401 14470 17362
959 17362 -14281 -20792 -12503 -4889 2738 7375 27289 10226 12421 29917 33752 42585 14121 5911
945 5911 1746 20703 18653 8856 18315 33631 35566 47888 32597 14071 5241 -14697 -10005 -18740
931 -18740 -13343 9780 17494 6772 30701 28223 24432 14390 -11656 2839 59078 58315 7067
918 7067 15163 39218 53866 71389 65984 37184 -9642 -30427 -21570 -18940 -24411 -22466 -37873
905 -37873 -54833 -44242 -42814 -19613 -5153 25518 41413 64654 86971 72747 41188 62880
893 62880 54079 43702 63881 75680 46614 22103 13140 24987 186 -5167 36762 53201 16193
880 16193 -4743 -28542 -50154 -47420 -10878 2838 -32206 -9799 544 22255 39217 38483 36523
867 36523 30053 2941 -6439 422 28687 22343 1824 -1824 7743 -8198 15593 28503 11952
854 11952 571 -818 -4644 -21508 -24168 -29561 -50192 -39282 -21829 -23750 -22749 -41244 -12819
841 -12819 -16102 -10669 -5375 -7834 -44140 -51843 -56927 -77509 -73922 -29556 -32848 -31966 -41070 -7262
827 -7262 20049 28503 15958 16598 -10046 -19242 1963 18375 5218 -5400 -4980 -30428 -45241
814 -45241 -26254 -9350 -21785 -7038 -4385 3649 18484 24787 6590 -7129 -5231 3384 10078
801 10078 -7218 -12926 -17580 -34283 -40881 -55685 -88820 -43518 -3740 -14900 -15134 38945 68356
788 68356 40300 24267 -880 3854 5550 -17648 -5989 9204 -32491 -56621 -81589 -69768
776 -69768 -31223 -1587 1558 11336 9687 18713 24472 23670 39127 21080 40187 23079 -1170
763 -1170 12347 30925 38440 47178 28237 14639 32198 35383 21036 -345 16462 40058 39148
750 39148 30344 28989 10721 -17890 -53263 -79149 -52236 -16479 14268 38378 11883 -1216
738 -1216 -6642 -18745 -27161 -11657 15970 30197 21012 -26064 -17574 17638 22187 3547 -11786
725 -11786 -11934 -15737 -26783 -43623 -40099 -37088 -35334 -50034 -31962 -18414 -37537 -41688 -25985
712 -25985 -10516 -16439 -11342 4466 30812 53980 35923 9596 20064 19002 29061 12077 -15416
699 -15416 -11423 -13220 -12748 36562 66027 46841 11547 20443 16787 21121 33559 71059 80769 93460
685 93460 92586 56030 26561 -674 -10212 -28410 -12465 -9093 -9338 -14670 -11521 8296 23096 3019
671 3019 1587 -6201 4150 -3234 3346 23493 21297 -11540 -21781 -3291 -12240 -26925 -6524
658 -6524 -8757 3696 -14332 -21335 -62761 -41810 -18507 -14949 -22088 -7647 17429 27218 14400
645 14400 -8717 -19666 -12203 -22569 13899 30240 -8572 4441 18617 1988 -23132 -31181
633 -31181 -8763 6387 7012 24709 14479 10408 24445 -14830 -9232 4567 9611 10349 -10852
620 -10852 -23740 7960 24230 6893 14899 11063 4608 4368 21550 17667 -14244 1013 6266
607 6266 -12052 -29143 -31428 -19079 -23505 -3246 -6258 -11025 -20983 -6176 11445 -3951 -27789
594 -27789 -15032 -9868 -1988 309 -21159 -18155 -26562 -10023 -9958 -20272 -28914 -20829 -11786 -2907
580 -2907 -16557 -47291 -68043 -83931 -50358 8870 50436 18996 -14269 -23049 -457 -7770 -54392
567 -54392 -30492 25 -13850 4595 30186 13362 -890 3352 -9247 -21055 -33859 -22090
555 -22090 7672 29081 27887 9912 432 -1279 3866 -2889 -36665 -37580 -31833 -28487 -26662 -6498
541 -6498 230 -17996 -15873 -6898 24896 28321 22001 7288 -16232 -3992 14298 32732 41330
528 41330 4953 -4071 -7258 22368 35396 32785 7197 -3603 -2166 -29698 -23542 -27402 -56237
515 -56237 -62852 -29051 -22644 22291 42356 51134 34326 9583 -12690 -28434 -47122 -43853 -25574
502 -25574 9399 6173 724 6630 -7812 -15816 2560 -13395 -16994 -3781 -6022 -19507 -23554
489 -23554 -16976 22862 290 -16054 -29302 -14074 8211 6320 -15357 10882 43495 57127
477 57127 29897 33695 30635 13509 5629 24778 26374 -9622 -11434 -23881 -30014 1957 29693
464 29693 24062 13368 -4289 -12467 -780 -13995 -19073 -1601 -9492 -22032 4757 5836 -5546
451 -5546 -37009 -60875 -37984 -29949 -31983 -32617 -14124 -14389 -9040 7518 26530 -2750 -21194 -16425
437 -16425 -283 8862 13370 17342 38107 32246 -2497 3550 28952 24033 7070 2734 -4342 -525
423 -525 31269 46001 48045 44529 27360 15674 14331 16800 40131 55876 62460 28958 22323 22306
409 22306 20984 7718 -10757 -7102 17975 27176 9035 10837 -665 -33244 -28301 -13377 -19536
396 -19536 -26050 -5578 10734 -12499 -19802 -27094 -18478 -20152 -26007 -32305 -22669 -20036 -6845 -36304
382 -36304 -43010 -35299 -19153 2701 -23 -7736 -29945 -31955 10247 49335 52721 38982 11015
369 11015 9429 -3288 -10952 -7742 1268 -6943 -12213 -6748 2241 14676 23096 8526 -9533 -4524
355 -4524 8351 8494 -7920 -5874 -8594 18843 43174 28356 -9968 -2722 8140 -13353 -60911
342 -60911 -63543 -31871 -12119 -3546 -14025 -2136 15399 17393 -7518 -10657 -31787 -41240 -60736
329 -60736 -57715 -38972 -34818 -28129 -4496 -2923 -642 -14661 -25913 -20151 -34351 -20777 -2590
316 -2590 -5557 2442 7027 34479 37511 56167 52918 55212 38445 22691 25329 40560 56270 76953
302 76953 84789 65314 41581 27664 30704 32779 24130 51103 76482 62932 53803 45216 26728
289 26728 25085 40484 35413 16805 20615 29561 42268 40817 30159 14768 7202 -3326 17214
276 17214 -11193 -32716 -25548 -7191 7322 7164 -7318 -17052 -14219 -12644 -7033 10497 36627
263 36627 31274 32175 29136 8380 8340 12044 -7454 -1845 24547 -14338 -36009 -61937 -63331 -59826
249 -59826 -60840 -47275 -28334 -9800 -22821 -16326 -16885 -25706 -21509 -12425 4935 3498 480 -223
235 -223 -7339 854 6475 -6151 -16828 -15619 6935 11102 976 -11518 -13594 -7526 -17504 -4005
221 -4005 -6951 -31269 -40305 -30639 -25656 -22249 -25060 -16406 -7686 17618 14969 -11123 1407 -4927
207 -4927 -10486 -21623 -30463 -59630 -54935 -20433 -43381 -53355 -24767 11329 3248 -4036 6130
194 6130 4027 -6219 -3530 29544 49540 26907 1446 -27966 -11415 -732 7124 -1258 -6565
181 -6565 -13900 -8094 13839 -1509 -17740 -5039 15575 23130 18009 20560 22160 5057 -18127
168 -18127 3763 21707 11778 -12132 -7121 -16165 -24755 -19100 -11758 13720 31503 16301 -16177
155 -16177 -37140 -37445 -35461 -27424 -36074 -68341 -64827 -56790 -51121 -59240 -46436 -31366 -37979 -17311
141 -17311 -5941 -18763 -23843 -4850 -18023 -21880 1242 7218 3169 15063 24648 17325 41175
128 41175 63967 53122 22579 4107 5137 12330 4134 -11784 1516 7297 5929 12762 6504
115 6504 19201 4849 14911 32493 33263 25397 11979 -14003 -27488 -23324 -1458 126 16498
102 16498 19380 -8178 -22041 -13818 -15372 -13902 -29318 -12315 -7738 10821 23544 22085 19659
89 19659 28028 55068 57346 40966 8357 4280 -3895 -8027 -10604 6608 -2850 22465 24947 15316
75 15316 13664 16444 4307 12023 16743 12174 14255 14990 36229 67325 58655 32389 9206 -9423
61 -9423 -13572 -16845 2894 8289 16787 7729 -1935 -13421 -3854 9850 4747 -3757 -5549 -3877 1106
46 1106 -2809 -16635 -42080 -35403 -11436 4412 -103 400 22282 30336 36620 18956 2200 -3213
32 -3213 4178 -11150 -44728 -55748 -43001 -25724 -9304 11118 12415 16070 -1848 4916 18063
19 18063 15284 -17124 -28778 -29245 1102 9727 6951 8579 -5185 -27008 -40453 -28242 8821
6 8821 30726 19751 17525 6990 -21102 -19680
0 -19680
$$ Imaginary data points
##PAGE= N=2
##DATA TABLE= (X++(I..I)), XYDATA
32767 81280 88579 74806 61066 51345 54475 70174 72224 84489 87198 74858 73819 77548 72543
32754 72543 70645 85284 102446 94104 79530 73162 81802 89608 86651 80009 104680 131292 137630
32741 137630 119446 109432 119885 135758 109133 103856 98201 99279 102038 113876 115530 120080 115237
32728 115237 113412 111456 133077 114570 72430 80650 110594 127436 109528 97074 93580 87258
32716 87258 89047 83444 95096 86077 77550 75710 98929 103915 91973 99167 120545 118119 108377
32703 108377 123795 129128 125291 125879 117266 137615 147244 143399 156798 136114 114186 109593 111402
32690 111402 104866 106370 93902 99126 118587 123590 127103 119845 120523 108168 111086 101934 97256 113102
32676 113102 119966 137127 159377 175937 165248 151729 157360 144247 126859 152434 161357 155184
32664 155184 147080 131639 96994 116100 132991 115635 118252 119315 136309 117088 124044 141279
32652 141279 147590 147909 121427 103349 101216 117345 119936 100368 87973 75624 81468 107949 129478
32639 129478 129311 143719 168597 184663 188311 196972 176813 160359 172592 185277 183590 184557 179989
32626 179989 164985 145537 167864 198127 189028 165244 147072 165951 164716 185231 195417 212652
32614 212652 218735 206921 176858 182325 176818 159584 145333 143561 150622 145142 159458 165712 189311
32601 189311 175501 160157 147864 142735 161647 190619 172716 146652 148969 148657 144411 154376 162221
32588 162221 154745 177305 188110 172604 158238 157193 156594 157852 179460 195621 228532 241903
32576 241903 216023 194267 185650 153916 150994 173733 187461 222935 251321 230325 230386 195435
32564 195435 187724 199629 193227 173827 160545 177038 190057 189597 212322 231760 233455 217778
32552 217778 204774 207992 207281 178853 179595 206816 225409 219450 216686 216088 217444 205821 196738 219722
32538 219722 206702 197165 193468 196242 180718 183782 186624 191340 216958 253348 239062 229275 205106
32525 205106 189000 207728 189121 200290 195380 205219 218776 226270 233299 232800 245478 264645 265783
32512 265783 267979 275859 261775 254519 264851 250822 254690 243334 217928 200384 217258 245962
32500 245962 246539 240764 248114 265408 263182 266277 243707 233331 231657 227246 243429 223856 212426
$$ [...]
##END NTUPLES=NMR SPECTRUM
##END=
