##TITLE=Analysis number 325853
Compound Code sb 01285
Project Code adrs
Chemist Name stores
##JCAMPDX= 6.0         $$ Bruker NMR JCAMP-DX V2.0
##DATA TYPE= NMR SPECTRUM
##DATA CLASS= NTUPLES
##ORIGIN= Bruker BioSpin GmbH
##OWNER= nmr
$$ XWIN-NMR		Version 3.5
$$ Wed Jan 17 09:37:55 2007 GMT Standard Time (UT+0h)  MAYBRIDGE\nmr@NMR_250MHZ
##.OBSERVE FREQUENCY= 250.131544655141
##.OBSERVE NUCLEUS= ^1H
##.ACQUISITION MODE= SIMULTANEOUS (DQD)
##.ACQUISITION SCHEME= undefined
##.AVERAGES= 16
##.DIGITISER RES= 18
##SPECTROMETER/DATA SYSTEM= dpx250
##.PULSE SEQUENCE= zg30
##.SOLVENT NAME= CDCl3
##.SHIFT REFERENCE= (INTERNAL, CDCl3, 0, 16.522)
##AUDIT TRAIL= $$ (NUMBER, WHEN, WHO, WHERE, WHAT)
$$ ##TITLE= Audit trail, XWIN-NMR		Version 3.5
$$ ##JCAMPDX= 5.01
$$ ##ORIGIN= Bruker BioSpin GmbH
$$ ##OWNER= nmr
$$ C:\u/data/dgb/nmr/ADRS/1270/pdata/1/auditp.txt
$$ ##AUDIT TRAIL=  $$ (NUMBER, WHEN, WHO, WHERE, WHAT)
(   1,<2007-01-17 09:37:30.40 +000>,<MAYBRIDGE\nmr>,<NMR_250MHZ>,
      <created by zg, POWCHK disabled, PULCHK disabled
       configuration hash MD5:
       49 4B E0 1D 92 C2 6B 37 9F E6 65 BC 52 41 86 1D
       data hash MD5: 64K
       B0 08 71 78 8D C0 53 DF 84 71 1E 33 2D 34 DF 81>)
(   2,<2007-01-17 09:37:44.49 +000>,<MAYBRIDGE\nmr>,<NMR_250MHZ>,
      <Start of raw data processing
       ef LB = 0.3 FT_mod = 6 PKNL = 1 SI = 32K 
       data hash MD5: 32K
       14 02 4E 39 38 06 9D BC B8 9A BB 4D 6C 0C 75 C8>)
(   3,<2007-01-17 09:37:46.58 +000>,<MAYBRIDGE\nmr>,<NMR_250MHZ>,
      <apk 
       data hash MD5: 32K
       DF B4 1D 9E CE 04 FE 3D 6D 8E D7 7B 00 5B 68 2A>)
(   4,<2007-01-17 09:37:47.41 +000>,<MAYBRIDGE\nmr>,<NMR_250MHZ>,
      <abs ABSG = 5 
       data hash MD5: 32K
       63 B2 A9 F9 56 C4 C7 F3 E0 BA 34 22 A3 84 9D 25>)
$$ ##END=
$$ 
$$ hash MD5
$$ B9 4F 22 94 20 5B 03 4B 9A CC 90 46 C5 C2 28 C5
##$RELAX= 
##$RELAX= 
##$RELAX= 
##$RELAX= 
##$RELAX= 
##$RELAX= 
##$RELAX= 
$$ Bruker specific parameters
$$ --------------------------
##$DU= <C:\u>
##$EXPNO= 1270
##$NAME= <ADRS>
##$PROCNO= 1
##$TYPE= <nmr>
##$USER= <dgb>
##$AMP= (0..31)
100 100 100 100 100 100 100 100 100 100 100 100 100 100 100 100 100 100 
100 100 100 100 100 100 100 100 100 100 100 100 100 100 
##$AQSEQ= 0
##$AQ_mod= 3
##$AUNM= <au_zg>
##$AUTOPOS= <3 >
##$BF1= 250.13
##$BF2= 250.13
##$BF3= 250.13
##$BF4= 250.13
##$BF5= 500.13
##$BF6= 500.13
##$BF7= 500.13
##$BF8= 500.13
##$BYTORDA= 1
##$CFDGTYP= 0
##$CFRGTYP= 5
##$CHEMSTR= <none>
##$CNST= (0..31)
1 1 145 1 1 1 1 1 1 1 1 1 1 1 1 1 1 1 1 1 1 1 1 1 1 1 1 1 1 1 1 1 
##$CPDPRG= <>
##$CPDPRG1= <>
##$CPDPRG2= <>
##$CPDPRG3= <>
##$CPDPRG4= <mlev>
##$CPDPRG5= <mlev>
##$CPDPRG6= <mlev>
##$CPDPRG7= <mlev>
##$CPDPRG8= <mlev>
##$CPDPRGB= <>
##$CPDPRGT= <>
##$D= (0..31)
0 1 0 0 0 0 0 0 0 0.06 0 0 0 0 0 0 0.0002 0 0 0 0 0 0 0 0 0 0 0 0 0 0 
0 
##$DATE= 1169026649
##$DBL= (0..7)
120 120 120 120 120 120 120 120 
##$DBP= (0..7)
150 150 150 150 150 150 150 150 
##$DBP07= 0
##$DBPNAM0= <>
##$DBPNAM1= <>
##$DBPNAM2= <>
$$ [...]
##$SUBNAM7= <"">
##$SUBNAM8= <"">
##$SUBNAM9= <"">
##$SW= 20.6930455092707
##$SWIBOX= (0..15)
0 0 3 0 0 0 0 0 0 0 0 0 0 0 0 0 
##$SW_h= 5175.983436853
##$TD= 65536
##$TD0= 1
##$TE= 294.16
##$TE2= 300
##$TE3= 300
##$TEG= 300
##$TL= (0..7)
0 120 120 120 120 120 120 120 
##$TP= (0..7)
150 150 150 150 150 150 150 150 
##$TP07= 0
##$TPNAME0= <>
##$TPNAME1= <>
##$TPNAME2= <>
##$TPNAME3= <>
##$TPNAME4= <>
##$TPNAME5= <>
##$TPNAME6= <>
##$TPNAME7= <>
##$TPOAL= (0..7)
0.5 0.5 0.5 0.5 0.5 0.5 0.5 0.5 
##$TPOFFS= (0..7)
0 0 0 0 0 0 0 0 
##$TUNHIN= 0
##$TUNHOUT= 0
##$TUNXOUT= 0
##$USERA1= <user>
##$USERA2= <user>
##$USERA3= <user>
##$USERA4= <user>
##$USERA5= <user>
##$V9= 5
##$VALIST= <valist>
##$VCLIST= <CCCCCCCCCCCCCCC>
##$VD= 0
##$VDLIST= <DDDDDDDDDDDDDDD>
##$VPLIST= <PPPPPPPPPPPPPPP>
##$VTLIST= <TTTTTTTTTTTTTTT>
##$WBST= 1024
##$WBSW= 4
##$XGAIN= (0..3)
0 0 0 0 
##$XL= 0
##$YL= 0
##$YMAX_a= 586844
##$YMIN_a= -622563
##$ZGOPTNS= <>
##$ZL1= 120
##$ZL2= 120
##$ZL3= 120
##$ZL4= 120
##$ABSF1= 16.522
##$ABSF2= -4.171173
##$ABSG= 5
##$ABSL= 3
##$ALPHA= 0
##$AQORDER= 0
##$ASSFAC= 0
##$ASSFACI= 0
##$ASSFACX= 0
##$ASSWID= 0
##$AUNMP= <proc_1d>
##$AZFE= 0.1
##$AZFW= 0.1
##$BCFW= 0
##$BC_mod= 0
##$BYTORDP= 0
##$COROFFS= 0
##$CY= 12.5
##$DATMOD= 1
##$DC= 0
##$DFILT= <>
##$DTYPP= 0
##$F1P= 14.0000005364418
##$F2P= -0.99999901652339
##$FCOR= 0.5
##$FTSIZE= 32768
##$FT_mod= 6
##$GAMMA= 0
##$GB= 0
##$INTBC= 1
##$INTSCL= 1
##$ISEN= 128
##$LB= 0.3
##$LEV0= 0
##$LPBIN= 0
##$MAXI= 10000
##$MC2= 0
##$MEAN= 0
##$ME_mod= 0
##$MI= 0
##$NCOEF= 0
##$NC_proc= -2
##$NLEV= 6
##$NOISF1= 0
##$NOISF2= 0
##$NSP= 0
##$NTH_PI= 0
##$NZP= 0
##$OFFSET= 16.522
##$PC= 1
##$PHC0= 229.0596
##$PHC1= 5.676382
##$PH_mod= 1
##$PKNL= yes
##$PPARMOD= 0
##$PSCAL= 4
##$PSIGN= 0
##$REVERSE= no
##$SF= 250.13
##$SI= 32768
##$SIGF1= 0
##$SIGF2= 0
##$SINO= 400
##$SIOLD= 32768
##$SREGLST= <1H.CDCl3>
##$SSB= 0
##$STSI= 32768
##$STSR= 0
##$SW_p= 5175.98343685301
##$SYMM= 0
##$S_DEV= 0
##$TDeff= 65536
##$TDoff= 0
##$TI= <Analysis number 999999
Compound Code 99
Book Reference 9
Project Code 9>
##$TILT= no
##$TM1= 0
##$TM2= 0
##$TOPLEV= 0
##$USERP1= <user>
##$USERP2= <user>
##$USERP3= <user>
##$USERP4= <user>
##$USERP5= <user>
##$WDW= 1
##$XDIM= 32768
##$YMAX_p= 396452732
##$YMIN_p= -35223
$$ End of Bruker specific parameters
$$ ---------------------------------
##NTUPLES= NMR SPECTRUM
##VAR_NAME=  FREQUENCY,     SPECTRUM/REAL,   SPECTRUM/IMAG
##SYMBOL=    X,             R,               I
##VAR_TYPE=  INDEPENDENT,   DEPENDENT,       DEPENDENT
##VAR_FORM=  AFFN,          ASDF,            ASDF
##VAR_DIM=   32768,         32768,           32768
##UNITS=     HZ,            ARBITRARY UNITS, ARBITRARY UNITS
##FACTOR=    0.157963299565203, 1,           1
##FIRST=     4132.6476996994, 0,             0
##LAST=      -1043.33573715361, 0,           0
##MIN=       -1043.33573715361, -35223,      0
##MAX=       4132.6476996994, 396452732,     0
$$ Real data points
##PAGE= N=1
##DATA TABLE= (X++(R..R)), XYDATA
$$ [...]
17691F925574p40771m37528j93367O9766M14169R18475J639047K302331K241839
17682A3139535K205432L506603L894373P49881j033243O87332K73318l345366
17674B0077865m007102k440087k159531k521187j949432j060116l47098K47686
17666E840998O56929O60125Q02595J412203J287309j63339m84943K64268l10569
17657I965576j738135j619227r96477r98101j084302q00289m89389l12836k30181
17648A696639j68794j18102j09601j24115j03703q2984q5321q6808p5934n2198
17638F89079k5509k7327l8488k9968j8959K251j4284k1726j4551j7359k1181j9962
17626D42016k5029k7574j5954j2848j8597j4848j4628m428p456l087o642m009
$$ plain form
17691 6925574 6184803 5747275 5553908 5623674 6037843 6956318 8595365 10897696 13139535
17682 13139535 15344967 18851570 22745943 23495824 22462581 23149913 23423231 20077865
17674 20077865 16070763 13630676 11471145 8949958 7000526 5940410 5593312 5840998
17666 5840998 6497927 7158052 7960647 9372850 10660159 10496820 10011877 10276145 9965576
17657 9965576 8227441 6608214 5611737 4613636 3529334 2729045 2239656 1926820 1696639
17648 1696639 1527845 1409743 1300142 1176027 1072324 989340 904019 817211 741277 689079
17638 689079 663570 636243 597755 567787 548828 551079 536795 515069 500518 483159 461978 442016
17626 442016 416987 389413 373459 360611 342014 327166 312538 308110 300654 297567 290925 286916
17614B86916n244l397j1174j0023l200n967o375j015j025p740m011L86R483J6635
17600B54249Q217j468o426m463k279P586k753n118n101p958q231k926j428n157
17586B16744l128k486q90J027k879n762m654m835l787l046J148K525q981p629
17572A73367j0997l663k338o852j1286m949J0271m388r705k115j709K72j965O035
17558A29978K976K694M244n556p704M459J203l961m065p730j840j2110p920J171
17544I5839K101o634j982L431J500M535R804k033J145P15o681k90Q909L265j0970
17529A02654m144j230l416p660j2592k866O673M315l0n543r518l374L824K96m05
17514F6984q343K239L563M941M163k444j6883M489m269o451j366j849m113k815
$$ plain form
17614 286916 281672 278275 267101 257078 253878 247911 241536 240521 239496 231756 227745 228131 237614 254249
17600 254249 262466 260998 254572 250109 247830 255416 252663 247545 242444 234486 226255 223329 221901 216744
17586 216744 213616 211130 210240 211267 208388 202626 197972 193137 189350 186304 187452 189977 180996 173367
17572 173367 162370 158707 156369 149517 138231 133282 143553 139165 129460 127345 125636 125908 123943 129978
17558 129978 132954 135648 139892 134336 126632 131091 132294 128333 124268 116538 114698 102588 94668 95839
17544 95839 97940 91306 89324 92755 94255 98790 108594 106561 107706 108421 101740 101450 110359 113624 102654
17529 102654 98510 97280 93864 86204 73612 70746 77419 81734 81704 76161 66643 63269 67093 67389 66984
17514 66984 58641 60880 64443 69384 73547 71103 54220 58709 54440 47989 46623 44774 40661 37846
17500C7846M019m578j624Q897l18n441J979J0000K46k778K860j817J225j610k310
17485D6596k607L537L29l153L100O534N1J352O585J13P28L523L21m21n374O3j450
17468E9827j1079p743p66L735n655J332L06j415P231o52l850L893K642J397J417
17453E0620o709r563N435k042k583J477j98K842N832R836J9761K8500K2870j5368
17439A10710l5238j9008p451o887j566j926j321M320l051m345o713m464N167l47
17425B7880j212o75N67O215L234L31L953m372k995m201l527O71M999m451j3122
17410A3295j8m315J1822N528m910j63R4J1338O87o450J52K087j776k583o607P7
17394A8258L555n846J94P525K48J237J549j921p691j76L74q50N018n430l558K274
$$ plain form
17500 37846 41865 37287 35663 44560 44242 38801 40780 50780 51026 48248 51108 49291 50516 48906 46596
17485 46596 43989 47526 47855 44702 47802 54336 54387 55739 62324 62437 63165 66688 67009 66588 61214 61277 59827
17468 59827 48748 41005 40239 43974 38319 39651 39957 38542 45773 45121 41271 45164 47806 49203 50620
17453 50620 43911 34348 39783 37741 35158 36635 36437 39279 45111 54947 74708 103208 126078 110710
17439 110710 75472 56464 49013 42126 40560 38634 37313 41633 38582 34237 27524 23060 28227 27880
17425 27880 26668 25993 26560 32775 36009 36340 40293 35921 32926 28725 25198 25869 30868 26417 13295
17410 13295 13277 8962 20784 26312 21402 21239 21333 32671 33358 26908 27060 29147 27371 24788 18181 18258
17394 18258 21813 15967 16161 23686 23934 25171 26720 24799 17108 16932 17306 16456 21474 16044 12486 14760
17378A4760l417m144J424M771L648J885M570n53j224L43l153M300j612o977j215
17363A3406o980l278O790J0966P766j499r154n036O433N601k650j782L836J383
17349B5802r74l98m597l721j802N311N597j473L906J716m904l206l865K029O806
17334B6227K136m573p985P04N443k471k590P036P191P75p836q692J386Q764J769
17319B7284Q96n8K453J668n754l711K40M7N527n188j185q41R60o959l610o01N095
17302A6263J1386o49m377m736J430k910k949O005M394k645j21k305K88m698j21
17287A4255O44q54J154N258N266J254J199j342j932K171L209k884M76N847P44
17272C4465l803n304j56L927M326P500K330J06J0309N928Q613J9265J2887L771
$$ plain form
17378 14760 11343 7199 8623 13394 17042 18927 23497 22944 21720 22063 18910 23210 21598 14621 13406
17363 13406 6426 3148 9938 20904 28670 27171 18017 12981 19414 25015 22365 20583 24419 25802
17349 25802 24828 24430 19833 16112 14310 19621 25218 23745 27651 29367 24463 21257 17392 19421 26227
17334 26227 28363 23790 15805 16509 21952 19481 16891 23927 31118 31893 24057 15365 16751 25515 27284
17319 27284 28180 28122 30575 32243 26489 22778 23018 23065 28592 23404 22219 21378 22338 15379 11769 11168 16263
17302 16263 27649 27000 22623 17887 19317 16407 13458 19463 23857 21212 21091 18786 19074 14376 14255
17287 14255 14899 14045 15199 20457 25723 26977 28176 26834 24902 27073 30282 27398 27874 33721 34465
17272 34465 30662 25358 25202 29129 33455 40955 43285 43391 53700 59628 68241 87506 100393 104164
17258A04164J4254J8045K4042K4526K2586P862Q214J0001J2128Q496j3329j7379
17246B23610r181l543j4885k1572o582j0638N121J2232J8067K952P526J4199N589
17233B22895J0855P078j678j8704k5591j5745j3029k7093l2358j5809j2663j5404
17221F2754j0476o860o885M510J0438k210j87n288j283n04M698J3723N176O027
17207G3633L908J0265K5962K9310K6941K1805J6362K2753K7765J2624j08l506
17195B67714j98k418r009n175p820q097l844K050L239l47J14R625K935Q180J8104
17180B75053p46m747r540l999q308j4736j0314m167j7948j8264j1089k3626k9490
17167A18079k0968j9737j1327j1501p624j712m587j0579n141j302o792J877K74
$$ plain form
17258 104164 118418 136463 160505 185031 207617 215479 223693 233694 245822 254318 240989 223610
17246 223610 214429 210886 196001 174429 167847 157209 162330 174562 192629 195581 203107 217306 222895
17233 222895 233750 240828 239150 220446 194855 179110 166081 138988 106630 90821 78158 62754
17221 62754 52278 45418 38533 43043 53481 51271 51084 45796 44513 44009 48707 62430 67606 73633
17207 73633 77541 87806 113768 143078 170019 191824 208186 230939 258704 271328 271220 267714
17195 267714 267516 265098 256089 250914 243094 234997 231153 233203 236442 236095 236209 245834 248769 256949 275053
17180 275053 274307 269560 260020 256021 247713 232977 222663 218496 200548 182284 171195 147569 118079
17167 118079 97111 77374 66047 54546 46922 45210 40623 30044 24903 23601 16809 18686 18960
17154A8960m16K25J208M528O747J2957J1755J7523J2638J3283N208P217P027L736
17140A22596o555j9954j5666j3299j3147l547q20N043L972L613R428L822N288
17127H0774J1782K181o738l603J078m219j6841j1545q782j0568j0878k694m782
17114A5165j591k085j663k041J903j498K87L409p879j433M754P593K144j336M643
17099B0372k31N67K69j906o117n375j80N638j076R56m266k264m564N353P760M960
17083A9896j707p395o084q65J56l079o035K449l77o132O481J1859M792l566K68
17068A0661M235r671r84o35p18l901n052J318J293R79K189L238m637Q69L154Q720
17052A1058m93m821L26M767o773p667K431N103J2048L675p991l552L606J825n130
$$ plain form
17154 18960 18544 18769 19977 24505 31252 44209 55964 73487 86125 99408 104616 111833 118860 122596
17140 122596 116041 96087 80421 67122 53975 50428 49608 54651 58623 62236 71664 75486 80774
17127 80774 92556 94737 87999 84396 85474 81255 64414 52869 44087 33519 22641 19947 15165
17114 15165 13574 11489 9826 7785 9688 8190 8477 11886 4007 2574 7328 14921 17065 15729 20372
17099 20372 20141 20708 20977 19071 12954 7579 7399 13037 11961 12917 8651 6387 1823 7176 14936 19896
17083 19896 18189 10794 4710 3845 4001 922 -5113 -2664 -3041 -9173 -2692 9167 13959 10393 10661
17068 10661 14896 5225 4241 3606 2888 -1013 -6065 -4747 -3454 -2475 -286 2952 -1685 -816 2338 11058
17052 11058 10565 5744 6070 10837 4064 -3603 -1172 3931 15979 19654 11663 8111 11717 13542 8412
17037H412k745Q382L432M587o211R50L366l243l229J753n452o275q034n756k269
17022a2332Q119J2677M432j0213l819L535K699L12J014j706l100l389j263m736
17008g770N897K445q24M378R64N502J077p348m591M639j281m216j900K583N192
16993D747M501m787m952n46O435J2876O267j1329j0560j735J132M635L379j345
16979H718o283o018l59K187L198j469L51N460N955K795k192k661n742J273j45
16964E068j906J775l100l66Q92M320L672k5K600K182k037L63j567O08l85k822
16948I272l335N947M537n87n379l723j888P65L416K003K955k647m99k048L99n96
16932H592K202K401P28m626J626J641n500M598n99J845k511l221P18n308l626
$$ plain form
17037 8412 5667 14049 17481 22068 15857 16807 20173 16930 13701 15454 10002 3727 -4307 -10063 -12332
17022 -12332 -4213 8464 12896 2683 -1136 2399 5098 5410 6424 4718 1618 -1771 -3034 -7770
17008 -7770 -1873 572 -252 4126 5090 10592 11669 4321 -270 4369 3088 -1128 -3028 -445 4747
16993 4747 9248 4461 -491 -1037 5398 18274 24541 13212 2652 917 2049 6684 10063 8718
16979 8718 2435 -3583 -3942 -1755 1443 -26 325 5785 11740 14535 12343 9682 3940 5213 5068
16964 5068 3162 4937 1837 1471 2363 6683 10355 10330 12930 15112 13075 13438 11871 12479 12094 9272
16948 9272 5937 11884 16421 15834 10455 6732 4844 5609 9025 11028 13983 11336 10837 8789 9188 8592
16932 8592 10794 13195 13923 9297 10923 12564 7064 11662 11063 12908 10397 7176 7894 2586 -1040
16917a040j752L598O041M2K31L093k904m258n15L26M125L089k22r244l984P57
16901b617O351J546n022L471L180Q546Q898n675o221k161J789j761N07k104m640
16886D087J821L434n757j0169K938l511O52L546K598P636O206r210k29M045r522
16871a435l3P559n189k456J469j899oQ28n48J795k033L163K983R65j06K813j0088
16854b218J69Q758j097k202n104O683K803m375o4K566M960j091p926r044M58P488
16838G64k788M601l365l543N184Q93j125K555k796J75N739J454L612K059m768
16823H651K608M040o160j853k083J855r55Q72L976o50m477L362q231r909J033
16808g921M378n159j215L917M871J662k294J462O266K429q315m250k147j727N52
$$ plain form
16917 -1040 -2792 806 6847 6889 7120 10213 7309 3051 2536 2862 6987 10076 9854 610 -3374 -2617
16901 -2617 3734 5280 258 3729 6909 15455 24353 18678 12457 10296 12085 10324 10831 8727 4087
16886 4087 5908 9342 3585 -6584 -3646 -7157 -6505 -2959 -361 7275 13481 4271 4042 8087 -1435
16871 -1435 -1468 6091 902 -1554 -85 -1984 -1990 -1162 -1710 85 -1948 1215 4198 5163 5057 7870 -2218
16854 -2218 -2049 6709 5612 3410 -1694 4989 7792 3417 3353 5919 10879 9788 1862 -7182 -6724 764
16838 764 -2024 2577 -788 -4331 853 1746 621 3176 380 555 6294 7748 11360 13419 8651
16823 8651 11259 15299 9139 7286 5203 7058 6103 6975 10951 10301 5824 9186 955 -8954 -7921
16808 -7921 -3543 -8702 -9917 -6000 -1129 533 -1761 -299 5967 8396 81 -4169 -6316 -8043 -7491
16793g491r09K020M1J954P311k47Q12j111j442j301m072o277N383N436l239r92
16777d124j404k796K098N943Q655n658o685k464J631j335L401K962K561o705J914
16762b006k141l4K731l162L455o07n15P03N445O686q23j490N490K531n850q212
16746B201q457J643P321N3j269j2306n07J0608L097L544L442K649n067o691j878
16731a617k048n033k541O480J0351j614K798O271n385J328M721n377j340l209
16717C785m337k226Q85L012P98N65p5M628l662n139l400M019N9J47k233N890Q070
16700A0786r173l591k561k155J353l880l446O824R119L960r22M882p622m432K055
16685A197M633L718Q03r6J4m213o000j934O368J49K323K954k528l226L506K421
$$ plain form
16793 -7491 -8400 -6380 -6339 -4385 2926 2679 3491 2380 938 -363 -4435 -10712 -5329 107 -3132 -4124
16777 -4124 -5528 -8324 -6226 -283 8372 2714 -3971 -6435 -4804 -6139 -2738 224 2785 -3920 -2006
16762 -2006 -4147 -4181 -1450 -4612 -1157 -1764 -2279 -1576 3869 10555 9732 8242 13732 16263 10413 2201
16746 2201 -6256 -4613 2708 2761 1492 -10814 -11321 -713 2384 5928 9370 12019 6952 261 -1617
16731 -1617 -3665 -8698 -11239 -4759 5592 3978 6776 13047 7662 8990 13711 8334 6994 3785
16717 3785 -552 -2778 -1893 1119 1917 2482 2407 7035 3373 -1766 -5166 -1147 -1088 -941 -3174 2716 10786
16700 10786 1613 -1978 -4539 -6694 -5341 -9221 -12667 -5843 3276 7236 6314 11196 3574 -858 1197
16685 1197 5830 9548 10351 10255 10269 6056 56 -1878 4490 4639 6962 9916 7388 4162 7668 10089
16669A0089q684n061L96K989L381J1826K946n092k593j968m342L674M950k914
16655I597j839n647j920L913R27L62k730l32L130j969k265M755k937j620o261
16640d836r537K703L240L408N637K80k475L251J6Q222J568o356l787n438M495
16625C91L947k24m106l303j932k787K777N366L164J828r779m779L590k766j958
16610a0571j021J364M885L589N561J435m08o082M515K937j124j549N543P122m402
16595A1794l643r230o376m56N319j885o108J132J994Q649K665J389N21K454K738
16580A0957p893q0J904r39r86l305r90M73L011r12m355L835q66j531l604k988
16564h269k804R593L876K005n315K787O16P56M42j218k365j290q20r62m345n615
$$ plain form
16669 10089 1405 -3656 -3260 -271 3110 14936 17882 12790 10197 8229 3887 7561 12511 9597
16655 9597 7758 2111 191 4104 5031 5393 2663 2331 5461 3492 1227 5982 3045 1425 -4836
16640 -4836 -14373 -11670 -8430 -5022 615 895 -1580 1671 1687 9909 11477 5121 1334 -4104 391
16625 391 4338 4114 8 -3295 -5227 -8014 -5237 129 3293 5121 -4658 -9437 -5847 -8613 -10571
16610 -10571 -11592 -10228 -5343 -1754 3807 5242 4834 -1248 3267 6204 5080 3531 9074 16196 11794
16595 11794 8151 -1079 -7455 -7911 -2592 -4477 -10585 -9453 -7459 1190 3855 5244 5765 8219 10957
16580 10957 3064 2984 4888 3949 2963 -342 -1332 -859 2152 1240 -3115 720 -146 -1677 -5281 -8269
16564 -8269 -11073 -1480 2396 4401 -914 1873 2489 3245 3687 2469 104 -1186 -2006 -2968 -7313 -12928
16548a2928J600O33L344N037M628j586K312L563k152k015R44K170O908q912l729
16533a83K478n498J77o35k355J73K286L865O004j429n304j113n257m550J584P848
16517a909P16n630j748j544N212R416P281J18l97j221n245o826n56L213J250L588
16501E718k799K488J086L889r10k905k787N317Q30m590K919K960N056n535n945
16486D792j087j292k702O42n85j074l790k69M639J539K997O482j322n269n425
16471a724J868l147K136O272K11l858l775P74J183j813j48j967J903L684l79o918
16455e698J922J15K328p96k92L447j405N60k343j05M937K656n86p946j197N930
16439A527j058J477K290k095M553r44m004q430l1l595k24k195O182k22k235o844
$$ plain form
16548 -12928 -11328 -10695 -7351 -2314 2314 728 3040 6603 4451 2436 3380 5550 12458 3546 -183
16533 -183 2295 -3203 -3026 -3661 -6016 -5843 -3557 308 6312 4883 -421 -1534 -6791 -11341 -9757 -1909
16517 -1909 -1193 -6823 -8571 -10115 -4903 4513 11794 11912 11515 10294 5049 -1777 -2333 880 2130 5718
16501 5718 2919 5407 6493 10382 9472 6567 3780 9097 9927 5337 8256 11216 16272 10737 4792
16486 4792 3705 2413 -289 353 -232 -1306 -5096 -5365 -726 813 3810 10292 8970 3701 -1724
16471 -1724 144 -3003 -867 5405 5616 1758 -2017 -1243 -60 -1873 -2021 -3988 -2085 1599 1220 -5698
16455 -5698 -3776 -3661 -1333 -2129 -2421 1026 -379 181 -2162 -2267 2670 5326 4740 -3206 -4403 1527
16439 1527 469 1946 4236 2141 6694 5750 1746 -6684 -6715 -10310 -10534 -12729 -6547 -6769 -9004 -15848
16423a5848j659M096P314L41j926j507MM798j120k425J078L73J74N837Q768J044
16407I342q829m491Q170O331o35m731k992l091J076J897j117q111o040J399Q306
16392c516O737r413j053j232r43R771K648K879j955j941L544l233M789M952k955
16377I079q716J57j865R59J06J412R845P97K056M84p675m188N31k428k121J166
16361d01k748m496K430K69K446K042M683p907r64J920j462M651p112n103K264
16346i488R589M879P37m582j406k921l028l186M159k830J527P467j052o836l29
16331g300N314m82r632N822J0842M33P76l397o020J906l67j293k803K154j231
16316e278K039Q847M164r630o196K067J959m699J884k430L435Q368n107r649J4
$$ plain form
16423 -15848 -17507 -13411 -6097 -5756 -7682 -9189 -9185 -4387 -5507 -7932 -6854 -6481 -6307 -470 8298 9342
16407 9342 513 -3978 4192 10523 9888 5157 2165 -926 150 2047 930 -7181 -13221 -11822 -3516
16392 -3516 3221 -6192 -7245 -8477 -9420 351 2999 5878 3923 1982 5526 2293 7082 12034 9079
16377 9079 363 520 -1345 -386 -280 1132 10977 11774 13830 14314 6639 2451 2982 554 -1567 -401
16361 -401 -3149 -7645 -5215 -4946 -2500 -458 4225 -3682 -4646 -2726 -4188 463 -6649 -11752 -9488
16346 -9488 101 4980 5717 1135 -271 -3192 -6220 -9406 -5247 -8077 -6550 917 -135 -6971 -7300
16331 -7300 -1986 -2468 -12100 -6278 4564 4997 5773 2376 -3644 -1738 -2105 -3398 -6201 -4047 -5278
16316 -5278 -3239 5608 9772 142 -6054 -3987 -2028 -6727 -4843 -7273 -3838 4530 -577 -10226 -10212
16301a0212m313k908J372M247L859l432m509N393O140k591K671N623m323m241
16287g224J333N275K972K013P69J312J430m59k735m635R276O987l026l418n484
16272D386p418Q677M792j181o915l002K703O680J098m909L317J239J934j201J40
16257A0340J574q654K70k602J74m965k931m63O392L120k867m797J750K988N836
16242E165L047p596M355J897L421j121j0818K284O574N20r36n070n282m305L093
16227d772P726Q005j872n968j175N516k621n87l736k696K840k659j884L527l556
16212c912J589k309K38J435k600M726L726j235k645K423o91L580k25R64k46m838
16196b0o560n87k428K814J286k225j486Q93q139K774R965O801N985L105j0704
$$ plain form
16301 -10212 -14525 -17433 -16061 -11814 -7955 -11387 -15896 -10503 -4363 -6954 -4283 1340 -2983 -7224
16287 -7224 -5891 -616 2356 4369 5138 6450 7880 7421 4686 51 9327 16314 13288 9870 4386
16272 4386 -3032 5645 10437 9256 2341 -661 2042 8722 9820 4911 8228 9467 11401 10200 10340
16257 10340 11914 3260 3530 928 1102 -3863 -6794 -7257 -865 2255 -612 -5409 -3659 -671 5165
16242 5165 8212 616 4971 6868 10289 9168 -1650 634 7208 7728 6792 1722 -3560 -7865 -4772
16227 -4772 2954 10959 9087 3119 1944 7460 4839 4252 516 -2180 660 -1999 -3883 -356 -3912
16212 -3912 -2323 -4632 -4394 -2959 -5559 -833 2893 1658 -987 1436 745 4325 4100 5064 4818 -20
16196 -20 -6580 -7167 -9595 -6781 -5495 -7720 -9206 -8313 -16452 -13678 -3713 3088 9073 12178 1474
16181A474k563N362p928o696L538J1457l355m103j049M952O366L573R58l76P95
16166A2405K42j2634k348M883Q48k119m964J022K959L852M392m378M81j137j756
16151A748M109m619m201l88Q48K19l524m586r54L493O788l973Q69P323k096q75
16135A81K116q00M763K772p688l26j965n556k603m446k068O765P934N039k899
16120A219o604M579N970q535j483L531L256Q98M136M036M919p990n981l370N825
16105D406L26p891k716L081L408M228J86q6m987r066j220K649N382L257K745k293
16089A409M803j3j050p620q960j342K510P787K244q752L324K598o169m685N108
16074h808J594J281n663j208N916J152j693J576Q552K094n778J648K705L20j996
$$ plain form
16181 1474 -1089 4273 -3655 -10351 -6813 4644 1289 -2814 -3863 1089 7455 11028 11986 11610 12405
16166 12405 12647 13 -2335 2548 3396 1277 -3687 -2665 294 4146 8538 4160 4641 3504 1748
16151 1748 5857 1238 -2963 -3351 -2503 -2284 -5808 -10394 -11348 -7855 -1067 -5040 -4171 3152 1056 181
16135 181 2297 1497 6260 9032 1344 1018 -947 -6503 -9106 -13552 -15620 -8855 -921 4118 1219
16120 1219 -5385 -806 5164 -3371 -4854 -1323 1933 2831 6967 11003 15922 7932 1951 -1419 4406
16105 4406 4732 -3159 -5875 -2794 614 4842 5028 4942 -45 -9111 -10331 -7682 -2300 957 3702 1409
16089 1409 6212 6199 5149 -2471 -11431 -12773 -10263 -2476 -232 -8984 -5660 -3062 -9231 -13916 -8808
16074 -8808 -7214 -5933 -11596 -12804 -6888 -5736 -7429 -5853 2699 4793 -985 663 3368 3688 1692
16059A692J84k618j418m806j039M667q50M255J389R48m417p01j008J525m95l893
16043f585n913M929L192k936N269K215k177L311O347K052n24l020K360j192j016
16028F312L904m372p717J986M699l67o867N610M968l300j760j75K615M784q3J037
16012A1274Q19m786j477k241j108j0746O41N08J18k128J693O300j672M547Q410
15997A0152j385n428j692K355m3k546k259O20R25l259j387L542k054q202K318
15982h343M477L110k637l859l717P776J521j270K220L49M98M110O757j183n563
15967D246m21N654k962l709j001j896J796L534k328j125m334J547J322k765k274
15952d716l38M681L343N534j198k552l209m507p83j166M106N568M158l697k830
$$ plain form
16059 1692 1876 -742 -2160 -6966 -8005 -3338 -4188 67 1456 2404 -2013 -2714 -3722 -2197 -2692 -6585
16043 -6585 -12498 -7569 -4377 -7313 -2044 171 -2006 1305 7652 9704 9180 6160 8520 7328 6312
16028 6312 10216 5844 -1873 113 4812 4445 -2422 3188 8156 4856 3096 2921 5536 10320 10237 11274
16012 11274 12093 7307 5830 3589 2481 -8265 -7624 -7116 -6998 -9126 -7433 -1133 -2805 1742 10152
15997 10152 8767 3339 1647 4002 3959 1413 -846 -226 699 -2560 -3947 -405 -2459 -10661 -8343
15982 -8343 -3866 -756 -3393 -7252 -10969 -3193 -1672 -2942 -722 -373 125 4235 10992 9809 4246
15967 4246 3825 9479 6517 2808 1807 -89 1707 5241 2913 1788 -2546 -999 323 -2442 -4716
15952 -4716 -5054 -373 2970 8504 7306 4754 1545 -2962 -3745 -4911 -805 4763 8921 5224 2394
15937B394J1479K993j436m026m678p683j1016K455M829K958N783J0368J530p505
15923H445l760O940R91O44m109o394j312p441j862J472P428R816j71l061l657
15908C969m011r95L321O921K367p874p52m867m796N408Q288r12n530o820J621
15893d662Q353q41l075R74k071n549m825J188M164P19K908m194K29q37K032j519
15877g006m817q8O036N277K053R18N999M056k718p396q505O78L777m53M433j087
15861A157r70k658P68m830p052J025o17m71M783O323M345K351r118o60M996J366
15845G38L552J426o448m858n66r59Q091K877m031R42P580k736p57K515J46j856
15829E656k507J489P56j478P131L648p375l045J150l858n993O17R076K393j605
$$ plain form
15937 2394 13873 16866 15430 11404 6726 -957 -11973 -9518 -4689 -1731 4052 14420 15950 8445
15923 8445 4685 11625 12616 13260 9151 2757 1445 -5996 -7858 -6386 1042 10858 10687 7626 3969
15908 3969 -42 -1037 2284 9205 11572 3698 2946 -1921 -6717 -1309 6979 6067 537 -6283 -4662
15893 -4662 3691 2850 -225 749 -1322 -6871 -11696 -10508 -6344 -5625 -2717 -6911 -6682 -7519 -5487 -7006
15877 -7006 -11823 -11911 -5875 -598 1455 2373 8372 12428 9710 2314 -6191 -5513 -1736 -2189 2244 1157
15861 1157 187 -2471 -1703 -6533 -13585 -12560 -13177 -13648 -8865 -2542 1803 4154 -4964 -5624 -628 738
15845 738 4290 5716 -732 -5590 -6156 -7115 976 3853 -178 764 8344 5608 4851 7366 7512 5656
15829 5656 3149 4638 5394 3916 11047 14695 7320 4275 5425 1567 -4426 -3809 5267 7660 6055
15814F055j2022k866O61l352m175j764Q284J1975J1433R39o579j3593l169M790
15800c383Q005m155K26l671j711M080J751j883R497J429q320M1k497l466N288
15785A231O563L491m953J224K722L062k44n377j0877M281K733M632J144l302r503
15770c173q076j746J585o781R52J1105N445j363L887L677k217j474K533J877j719
15755D512m848m340N440Q805j232m101k22j173m555k874J109M916L533j388n740
15740b158K425o732L494N269L010Q79j642p869k404L468o08l037M689R07n254
15725e563j880j521P49O195K053o48N675J499j461m815q36k798M930N797j944
15710E432p847o246O68Q592M046j612k041M647k409m316q193j509O535P063Q521
$$ plain form
15814 6055 -5967 -8833 -8172 -11524 -15699 -17463 -9179 2796 14229 15168 8589 -5004 -8173 -3383
15800 -3383 4622 467 693 -2978 -4689 -609 1142 -741 8756 10185 1865 1906 -591 -4057 1231
15785 1231 7794 11285 6332 7556 10278 13340 13096 7719 -3158 1123 3856 8488 9632 6330 -3173
15770 -3173 -11249 -12995 -11410 -18191 -17239 -6134 -689 -2052 1835 5512 3295 1821 4354 6231 4512
15755 4512 -336 -4676 764 9569 8337 4236 4014 2841 -1714 -4588 -3479 1437 4970 3582 -2158
15740 -2158 267 -6465 -2971 2298 5308 6187 4545 -3324 -5728 -2260 -2868 -5905 -1216 -309 -5563
15725 -5563 -7443 -8964 -8215 -2020 33 -615 5060 6559 5098 283 -553 -3351 1579 7376 5432
15710 5432 -2415 -8661 -7993 599 4645 3033 992 5639 3230 -1086 -9279 -10788 -4253 2810 11331
15695A1331M073l522m790J51l250o22n938n097J183K534l74m82l370L958j88l177
15679g580l637j670J0114Q603l439m596O0O276n92p867J467M18J020L056M561
15664F194j694k823k828j0310L573O230L881Q365l932l969r212j908Q738O708
15650G013l483K269N031m96r349o540K262l143J716K378J0461Q70n581l461m171
15635d224k378N240J751M438N41l088k368J866m084Q59l812n023J627L917K92
15620d446J476o369o67M343M438J0682N107l361p055n305J81l713p02J0160j3
15605D756m86M072m462o937N36n458L699R209K202j198k659J091l181j948K258
15590A494o94j907n75L809J266o658j060Q134L511j321p441o839O422O336j876
$$ plain form
15695 11331 15404 11882 7092 7243 3993 3371 -2567 -7664 -6481 -3947 -4321 -4803 -8173 -4215 -4403 -7580
15679 -7580 -11217 -12887 -2773 5830 2391 -2205 -2145 4131 3539 -4328 -2861 -2443 -1423 1633 6194
15664 6194 4500 1677 -1151 -11461 -7888 -1658 2223 10588 6656 2687 -6525 -8433 305 7013
15650 7013 3530 5799 10830 10334 985 -5555 -3293 -6436 -4720 -2342 8119 8989 3408 -53 -4224
15635 -4224 -6602 -1362 389 4827 5368 2280 -88 1778 -2306 -1447 -5259 -10282 -8655 -4738 -4446
15620 -4446 -2970 -9339 -10006 -5663 -1225 9457 14564 11203 4148 -1157 -976 -4689 -5391 4769 4756
15605 4756 4270 8342 3880 -3057 -2521 -7979 -4280 4929 7131 5933 3274 4365 1184 -764 1494
15590 1494 800 -1107 -1682 2127 3393 -3265 -4325 3809 7320 5999 -1442 -8281 -1859 4477 2601
15575B601P13l107jK178m664n745L441M034l100n554O570M084L167N599m670L287
15559H833J262p902R37K885l848l49O973j946m231k848p319o161j248O940K143
15544e879k477J001M061l832K253r74J131J080j743l627P72JK017J4113j574j938
15528D385J940k558j810L84M50M320O840r206m966j195J410J163N462m09j185
15513E025R53P867k719p937j723O68M836K394K51k646k394q509l278J581q14Q58
15497e587M742M584r00m263n450l011K694K255N539l88o348J674P087J748q22
15482C554l462o54l724m004O561K520K438K437J808m656J074k689l795l955o071
15467a2618M774J840j446K578L056L850k982m955n085MN400j388J974L42J482
$$ plain form
15575 2601 3314 207 206 2384 -2280 -8025 -4584 -550 -3650 -9204 -2634 1450 4617 10216 5546 8833
15559 8833 10095 2193 3130 6015 2167 1818 8791 6845 2614 -234 -7553 -13714 -14962 -8022 -5879
15544 -5879 -8356 -7355 -3294 -7126 -4873 -5847 -4716 -3636 -5379 -9006 -8234 -8233 -6216 7897 6323 4385
15528 4385 6325 3767 1957 2341 2791 7111 13951 4745 -221 -1416 -6 1157 6619 6210 5025
15513 5025 5978 13845 11126 3189 1466 2134 6970 9364 9615 6969 4575 -3934 -7212 -5631 -6445 -5587
15497 -5587 -845 3739 2839 -1424 -6874 -9885 -7191 -4936 603 215 -6133 -4459 2628 4376 3554
15482 3554 92 -562 -4286 -8290 -1729 791 3229 5666 7474 2818 3892 1203 -2592 -6547 -12618
15467 -12618 -7844 -6004 -7450 -4872 -1816 2034 -948 -5903 -10988 -10984 -5584 -6972 -4998 -4656 -3174
15452c174J1773K833p955o206J95J60k031J519K184n722K802N39p915r54J15N47
15436a1290L394K638j181O30L451K319K308k71N347P06j095L302j597l814m666
15421A81m78K371L528k319l711O9j628M825j081J509n787j365M201O473m428n551
15405c191J063P780q01m633l308Q36J402M159j977r88j637J679J725L867n342
15390F34R97l41Q24k79L473L099o557j329K34L978L248K345r36j211l459J065
15374E785m950n027l27q39L247L269M853k493n340l673j662M71L734M567n752
15359d137p268M824P589J881m001k551j580J907p13J741o246l5P057j291K562
15344b61K843K128L297k907K79P01K73K996j702p369j1325j905M886M312m324
$$ plain form
15452 -3174 8599 11432 3477 -2729 -2534 -2374 -4405 -2886 -702 -6424 -3622 -3083 -10998 -11952 -11837 -11290
15436 -11290 -7896 -5258 -6439 -5809 -2358 -39 2269 1998 7345 8051 6956 10258 8661 4847 181
15421 181 -297 2074 5602 3283 -428 -359 -1987 2838 1757 3266 -2521 -3886 315 6788 2360 -3191
15405 -3191 -2128 5652 4851 218 -3090 -2254 -852 3307 1330 342 -1295 384 2109 5976 634
15390 634 1631 1290 2114 1835 5308 8407 1850 521 755 4733 7981 10326 9390 8179 4720 5785
15374 5785 835 -4192 -4519 -5358 -2111 1158 6011 3518 -1822 -5495 -7157 -6686 -2952 1615 -4137
15359 -4137 -11405 -6581 1008 2889 -1112 -3663 -5243 -3336 -4049 -2308 -8554 -8589 -1532 -2823 -261
15344 -261 2582 4710 8007 5100 5379 6080 6353 9349 7647 278 -11047 -12952 -8066 -3754 -8078
15329h078l180K26O818N612m26L822k987n318J720L707L687J115o3m439l326n039
15313f149K57J345m168L127O825o31J783J487J664n2k432j407l213j0698l572
15298a5834M665j615J113M371J112K557K754j812k190M638j009k250L125j034
15284a409j762p43o49P163L614j824j267Q70l549L581j146p358p613L412N181
15269c499L571m091P16P924K459p743p422J735N017l094k694M275N502L758K655
15254I069j255j0062n168L76J0710P48p777k588n123M363L809J529l374j589K096
15239d236M103l824j216j197l611l14M557K598Q48M721K093L301J42J536k343
15224G158k573L286K771l260l67p022K26j0439k701M832j558K544J43j042O8O75
$$ plain form
15329 -8078 -11258 -11032 -4214 1398 972 4794 1807 -3511 -1791 1916 5603 6718 6655 2216 -1110 -6149
15313 -6149 -5892 -4547 -8715 -5588 1237 606 2389 3876 5540 5488 3056 1649 -1564 -12262 -15834
15298 -15834 -11169 -12784 -11671 -7300 -6188 -3631 -877 -2689 -4879 -241 -1250 -3500 -375 -1409
15284 -1409 -3171 -3914 -4563 2600 6214 4390 3123 3993 444 4025 2879 -4479 -12092 -8680 -3499
15269 -3499 72 -4019 -3303 4621 7080 -663 -8085 -6350 -1333 -4427 -7121 -2846 2656 6414 9069
15254 9069 7814 -2248 -7416 -7040 3670 4418 -3359 -5947 -11070 -6707 -2898 -1369 -4743 -6332 -4236
15239 -4236 -133 -3957 -5173 -6370 -9981 -10295 -5738 -3140 -2292 2429 4522 7823 7965 9501 7158
15224 7158 4585 7871 10642 7382 7015 -7 219 -10220 -12921 -8089 -9647 -7103 -6960 -8002 -7934 -7259
15208g259j326M999j721l999K328N255L252P77k66k280n273m590J203N873O295
15193C268n027o54K651P1J50k960n859m486o054j300K668Q390K066j833j006p0
15177i985Q155L341M114Q721k373q019n748k750M087o658q72O608J779P396P843
15162A5639o789q413O790N10j2554m216O99M66M84N122L057j268K315l412j117
15147b687j323j210K822p2J748n485k529M903K803p519M74J502q79j091k566j730
15131a2839K107l3J0891L254m265p109J890O00N174J469j762k489k051M992j46
15116c17j769N010m285m798j588J717L644O037N88R0l436n217n694O898M111K947
15100C938M100l620j16m811R4J426J419j387m008o807o120N170r44J900M669m58
$$ plain form
15208 -7259 -8585 -3586 -5307 -9306 -6978 -1723 1529 2306 2040 -240 -5513 -10103 -8900 -3027 3268
15193 3268 -1759 -2413 238 309 459 -2501 -8360 -12846 -18900 -20200 -17532 -9142 -7076 -8909 -9915 -9985
15177 -9985 -1830 1511 5625 14346 11973 3954 -1794 -4544 -457 -7115 -7987 -1379 400 7796 15639
15162 15639 8850 437 7227 7737 -4817 -9033 -8334 -7868 -7384 -2262 795 -473 1842 -1570 -2687
15147 -2687 -4010 -5220 -2398 -2470 -722 -6207 -8736 -3833 -1030 -8549 -8075 -6573 -7452 -8543 -11109 -12839
15131 -12839 -10732 -10765 126 3380 -885 -7994 -6104 -5504 -330 1139 -623 -3112 -5163 -171 -317
15116 -317 -2086 2924 -1361 -6159 -7747 -6030 -2386 3651 4239 4329 893 -4324 -10018 -3120 991 3938
15100 3938 8038 4418 4302 -509 -415 1011 2430 1043 -2965 -9772 -15892 -10722 -11666 -9766 -5097 -5555
15084e555k849K177Q192j676J265k183m722K165J527M367m179P27N617O46n616
15069i7o867l928o90L770N706M750R3m402L328Q81l065l197J0166j684l985L837
15053D616L428K210l765o724n998M471l30p288l928K466J600N809N266J0639p730
15038D742J801L47l575j678k276K513P07l992K122K746k330O175K393o38n988
15023C069k807O005N04j429k232l720K459L768N321r02j465k993J898K70m851
15008B895L679n25k396k907o709k93Q274L105l054J807k918n660N511K398l314
14993a07k736K061m326m192M143m193L236K576O326m091n076K327L888K659o889
14978d394K457k881p972m530L197K816k150o797j161M306N567O950J016J755K502
$$ plain form
15084 -5555 -8404 -6227 1965 289 1554 -629 -5351 -3186 -1659 2708 -1471 -744 4873 5519 -97
15069 -97 -6964 -10892 -11582 -7812 -2106 2644 2737 -1665 1663 2544 -521 -3718 6448 4764 779 4616
15053 4616 8044 10254 6489 -235 -6233 -1762 -2092 -9380 -13308 -10842 -9242 -3433 1833 12472 4742
15038 4742 6543 6890 3315 1637 -639 1874 2581 -1411 711 3457 1127 7302 9695 9057 3069
15023 3069 262 6267 6771 5342 3110 -610 1849 5617 10938 10036 8571 5578 7476 7746 2895
15008 2895 6574 6049 3653 746 -5963 -6256 2018 5123 2069 3876 958 -4702 809 3207 -107
14993 -107 -2843 -782 -5108 -9300 -5157 -9350 -6114 -3538 2788 -1303 -6379 -4052 -164 2495 -4394
14978 -4394 -1937 -4818 -12790 -17320 -14123 -11307 -13457 -20254 -21415 -17109 -11542 -4592 -3576 -1821 681
14963F81L196k502m915M920N850P33n125l21j566J929R02O21L408L97j3855l026
14947h673j26J402Q85K747k491q030j459J0504J408m076k594J608l645j084M477
14932i147N393j118K396K282J221O210k585n722l382J155M44L166O13k513M083
14917B496j884K04R553O523j780o584n098o018l602N302J49L588P453r93n078
14902D231j822L542M521k149o018M113m66q402q92L018r81k937M213L855M733
14887H559L833o09L830k857j171j688p130P65O962Q325r582m825j282o49l500
14872a019q9L46O67k934J809P018m05l58R3m393k472j24J604k071L691o325K241
14855b721K467P316n352k178L979P683p81p184L418j32l505p749p13K815O64K455
$$ plain form
14963 681 3877 1375 -3540 1380 7230 7963 2838 2517 951 2880 3782 4403 7811 8208 -5647 -8673
14947 -8673 -8799 -7397 -6512 -3765 -6256 -14286 -15745 -5241 -3833 -7909 -10503 -8895 -12540 -13624 -9147
14932 -9147 -3754 -4872 -2476 -194 1027 7237 4652 -1070 -4452 -3297 -2853 313 926 -1587 2496
14917 2496 612 816 10369 16892 15112 8528 3430 -2588 -6190 -888 -739 2849 10302 9309 4231
14902 4231 2409 5951 10472 8323 2305 6418 5952 -2450 -3342 -324 -1305 -4242 -29 3826 8559
14887 8559 12392 11783 15613 12756 11585 9897 2767 3532 10494 18819 9237 4412 3130 2481 -1019
14872 -1019 -1108 -762 -95 -3029 -1220 5798 5393 5035 5128 735 -1737 -1861 -257 -2328 1363 -4962 -2721
14855 -2721 -254 7062 1710 -468 3511 11194 10413 3229 6647 6515 3010 -4739 -5452 -2637 -1973 482
14839D82k84m000M641k783l176k467M925O598N400m896p431K218j854m35K863
14824a99l10l50J805k960q85L633n66l029k491p86K256K148K615j492K405q392
14808f598J112N527l093J788n485q435P421M111K96j438L608j621m976n55O924
14793a414K479k856k93R7l404j230m701R554O765r39j293o352J838l18o34J031
14777a670K870j147P89k833K621k193m814L110N124L810J760q574p157N896O891
14762D483j256l310Q98L503m24j886l206q49L926L783j841J681r35k733k234M154
14746C754o069p837L736M025j767M348O048j488p289n393J152P04Q583O411q510
14731D08j981k966o683M802Q974J414n681M438O57m578J041n916m52P09l475n952
$$ plain form
14839 482 198 -3802 839 -1944 -5120 -7587 -2662 3936 9336 4440 -2991 -773 -2627 -3062 -199
14824 -199 -509 -859 946 -2014 -2899 734 168 -2861 -5352 -6138 -3882 -1734 881 -611 1794 -6598
14808 -6598 -5486 41 -3052 -1264 -6749 -15184 -7763 -3652 -3356 -4794 -1186 -2807 -7783 -8338 -1414
14793 -1414 1065 -1791 -2084 -1987 -5391 -6621 -11322 -1768 4997 4058 2765 -3587 -1749 -2067 -2701 -1670
14777 -1670 1200 53 842 -1991 630 -1563 -6377 -3267 1857 5667 7427 -1147 -8304 -2408 4483
14762 4483 3227 -83 815 4318 3894 2008 -1198 -2047 1879 5662 3821 5502 4567 1834 -400 3754
14746 3754 -2315 -10152 -6416 -2391 -4158 190 6238 4750 -2539 -7932 -6780 -6076 2507 8918 408
14731 408 -1573 -4539 -11222 -6420 2554 3968 -1713 2725 3382 -1196 -155 -6071 -6523 -5814 -9289 -15241
14715a5241P146R362O650j086O271J331J067q728m362l294k736l610Q325q19n743
14700e467k744M730m50K585J592k031k411Q086N063K103P22o330l522o278L464
14685h88M196j718n07m150l706P85r94K62R043J981j717q055N311N047R011m899
14669I002o794n017o173l154K063j342N987l786p9o57k469R22J068N147j172O020
14653d34N153j735j977n328P312L988J576j498k99r100n368j207N552N962P709
14638A0306o789j572r842q74Q729O832M322o52j1319q983M076M013k121l270l0
14623g174j324q86K269j469K897K64j067N877M142m265o044J432K381n762l955
14608a2684m20L435L258M149O28L405k67n294j064K205M509r38n830q754j328
$$ plain form
14715 -15241 -8095 1267 7917 6831 13102 14433 15500 6772 2410 -884 -3620 -7230 1095 276 -5467
14700 -5467 -8211 -3481 -3931 -1346 246 -1785 -4196 3890 8953 11056 11778 5448 1926 -4352 -888
14685 -888 3308 1590 1083 -3067 -6773 -5988 -6982 -6720 2323 4304 2587 -5468 -157 4890 13901 9002
14669 9002 2208 -2809 -8982 -12136 -10073 -11415 -5428 -9214 -9293 -9950 -12419 -11497 -10429 -5282 -6454 -434
14653 -434 4719 2984 1007 -4321 2991 6979 8555 7057 6758 -2342 -7710 -8917 -3365 2597 10306
14638 10306 3517 1945 -7897 -8771 -42 6790 11112 10460 -859 -9842 -5766 -1753 -3874 -7144 -7174
14623 -7174 -8498 -9384 -7115 -8584 -5687 -5423 -6490 -613 3529 -736 -6780 -5348 -2967 -8729 -12684
14608 -12684 -13104 -9669 -6411 -2262 -1634 1771 1504 -3790 -4854 -2649 1860 922 -4908 -13662 -14990
14593a4990J2931j972j647L609m863K477j68M33J533K342K201k122o117m865n93
14578a1811J106K995J983L113M697L231p149l296N643O084m723j4587M48O77N818
14563e771L786m023K35n831L651L129j238k165j526j069j17l13j81K802N524k811
14547e918p177J628r82j053p43K064K009K649M324N262j064o784q836j95J312
14532a3504K149M272j067L174M893J071j603O102qk026l069J144m050l304J0657
14517D831O437k39r887p234N01L430Q534l088m994J413Q307L089q285q835J700
14502d320p16M54N804L67j793o325j561J884J040L400p94l076j373L765J962M892
14486C610J532k128j726J592O336p620o37n50l766O576q74m668O5j887R33M1j066
$$ plain form
14593 -14990 -2059 -4031 -5678 -2069 -6932 -4455 -4623 -4190 -2657 -315 1886 -236 -6353 -11218 -11811
14578 -11811 -10705 -7710 -5727 -2614 2083 5314 -1835 -5131 512 6596 1873 -12714 -12266 -11589 -5771
14563 -5771 -1985 -6008 -5773 -11604 -7953 -4824 -6062 -8227 -9753 -10822 -10939 -11252 -11433 -8631 -3107 -5918
14547 -5918 -13095 -11467 -12449 -13502 -14245 -12181 -10172 -7523 -3199 2063 999 -5785 -14621 -14816 -13504
14532 -13504 -11355 -7083 -8150 -4976 -83 988 -615 5487 5479 3453 384 1528 -2522 -5826 4831
14517 4831 11268 11029 1142 -6092 -5591 -2161 6373 3285 -1709 -296 8011 11100 2815 -6020 -4320
14502 -4320 -5036 -4582 1222 1589 -204 -6529 -8090 -6206 -5166 -1766 -2560 -5636 -7009 -3244 -1282 3610
14486 3610 5142 3014 1288 2880 9216 1596 959 409 -3357 3219 2345 -2323 -2258 -4145 -3212 -3171 -4237
14469d237l189q92R73M378R055L239j312k881o16N266n931m803K43Q18J25N668
14453E904N67q128n980J089k446P247J399k072j609K461R059m76l544l673L419
14438C217L243o40K36o352L67m9k670J539j355M696k73l253k04k00P19j379P82
14421a576r57K642j221o167k670P689N11M853k350K94n118l242m826O671k445
14406g912r79L09j606K329L353k23n003q654N849k92o115k00N038M976n37m668
14390a4335O06J939k416J624O593M502M150j526J259J329l754n372N88O677P041
14375H905k928n847p703L924k469M503M995k449l299n947j049P655L929K424J829
14360F473m788J242J386m871J761k986L427J001q663j553K395J221M879l80m869
$$ plain form
14469 -4237 -7426 -8318 -7345 -2967 6088 9327 8015 5134 4518 9784 3853 -950 -707 111 236 5904
14453 5904 6471 -1657 -7637 -6548 -8994 -1747 -348 -2420 -4029 -1568 7491 7015 3471 -202 3217
14438 3217 6460 5820 6056 -296 71 22 -2648 -1109 -2464 2232 1959 -1294 -1498 -1698 -979 -2358 -1576
14421 -1576 -2533 109 -1112 -7279 -9949 -2260 -1749 3104 754 1048 -4070 -7312 -12138 -5467 -7912
14406 -7912 -8891 -8582 -10188 -7859 -4506 -4729 -9732 -18386 -12537 -12829 -18944 -19144 -14106 -9130 -9667 -14335
14390 -14335 -13729 -11790 -14206 -12582 -5989 -1487 2663 1137 2396 3725 -29 -5401 -4813 1864 8905
14375 8905 5977 130 -7573 -3649 -6118 -1615 3380 931 -2368 -8315 -9364 -1709 2220 4644 6473
14360 6473 1685 2927 4313 -558 1203 -1783 1644 2645 -6018 -7571 -5176 -3955 924 544 -4325
14345d325N230P173j270r158l146n313n057M407K576l423m925M327M709q52K093
14330f954J0214N582J226o678k046M16o82J542k248m584o678P23R092J0715M14
14315A0054q621l932K962M265k618Q15j986l128j257M023k83m221K800M119Q61
14300C853k59j396J047O08K112J290K066j773Q20j056K470J72K987m282q311j697
14284a349N497l578l920O53j104J865o495k494M088K755L170M03O998k043n775
14269a329l725j728J699K085J435N345K186j775l356R072Q65n589q64K054j337
14254E038M167k58p410j720J486J585o842K151N34m675r169j554K812K872L486
14239g497p9J0641K201k596l06j132m80Q48k541p304r63J340J0962M072m70M79
$$ plain form
14345 -4325 905 8078 6808 -2350 -5496 -10809 -15866 -11459 -8883 -12306 -17231 -12904 -8195 -9047 -6954
14330 -6954 3260 8842 10068 3390 1344 1760 1078 2620 372 -4212 -10890 -10167 -1075 9640 10054
14315 10054 1433 -2499 463 4728 2110 2925 939 -2189 -3446 577 294 -3927 -1127 2992 3853
14300 3853 3594 2198 3245 3853 5965 7255 9321 7548 8368 7312 9782 9954 12941 8659 348 -1349
14284 -1349 4148 570 -3350 -2697 -3801 -1936 -8431 -10925 -6837 -4082 -912 -509 6489 4446 -1329
14269 -1329 -5054 -6782 -5083 -2998 -1563 3782 5968 4193 837 9909 10774 5185 4321 6375 5038
14254 5038 9205 8947 1537 -183 1303 2888 -3954 -1803 -1269 -5944 -15113 -16667 -13855 -10983 -7497
14239 -7497 -7576 3065 5266 2670 2364 1232 752 1600 -941 -8245 -9208 -7868 3094 7166 6696 7175
14223G175N9l728l720N817m278l156j299J2J577K418Q418m260p310n481p577L706
14207a1627J3807K59L88K684p792r416M963K767m168j574O114J423K121K463M434
14192F846O970n407J006R99n603m087N411l0j23j1637n918L757O630Q904o5r09
14176F744J112q281k319k819J031k072l17L359K246L360K000l309k823o170M029
14161d229K491p822L704J0043K555j130o61Q43l859k384J320o80m422j206N433
14146dJ694k008J597M37k65j087N42m309n19p40l412l158R92M745j744Q1M860
14129b298j531l853J2298j092p398K355j667n250k76M907J541j386N821J737j847
14114B061l677k685m797j845J007Q811N317J227l274n56j587N027N20m474j167
$$ plain form
14223 7175 7234 3506 -214 5603 1325 -1831 -3130 -3118 -1541 877 9295 5035 -2275 -7756 -15333 -11627
14207 -11627 2180 2439 2827 5511 -2281 -11697 -6734 -3967 -8135 -9709 -3595 -2172 -51 2412 6846
14192 6846 13816 8409 9415 10414 4811 724 6135 6105 5982 -5655 -11573 -7816 -1186 7718 7653 6744
14176 6744 7856 -425 -2744 -5563 -4532 -6604 -6921 -3562 -1316 2044 4044 735 -2088 -8258 -4229
14161 -4229 -1738 -9560 -5856 4187 6742 5612 4951 5794 1935 -449 871 191 -4231 -5437 -4
14146 -4 1690 -318 1279 1716 1451 364 906 -3403 -3922 -4662 -8074 -11232 -10240 -5495 -7239 -7158 -2298
14129 -2298 -3829 -7682 4616 3524 -3874 -1519 -3186 -8436 -8712 -3805 -2264 -3650 2171 3908 2061
14114 2061 -1616 -4301 -9098 -10943 -9936 -1125 4192 5419 2145 1589 2 5029 5549 1075 -92
14099i2l801J395P053L854J562k223m878j521n394M275M203L988R01j671K426
14084A0077L304j2230m612j18J680K04J964R67j928k875j961j45J374j636n994
14069a1929m56l574r45J313O962O775P121n210l134n34J029M326Q81K72j875q66
14053A56M455n425l344N309l209q62K878R524n256o002p12q24J222M91m189L550
14037b238o41j2580j628J0711R704j380p323M573O874m31m992j668j031N51J128
14022c71K114n104m652O225L441O044J136M269K204l645p347J921K088k278o2
14007E983m291l150r31m562M793k83n218k990k546M592N494m749k532p96R695
13992a491J0882O749m279r862k493k448j025j860L227M028j031l690K830P63l696
$$ plain form
14099 -92 -3893 -2498 4555 8409 9971 7748 2870 1349 -4045 230 4433 8421 9322 7651 10077
14084 10077 13381 1151 -3461 -3579 -1899 -1695 269 1236 -692 -3567 -5528 -5673 -4299 -5935 -11929
14069 -11929 -12385 -15959 -16904 -15591 -8629 -1854 5267 57 -3077 -3611 -2582 1744 2625 2897 1022 156
14053 156 4611 -814 -4158 1151 -2058 -2920 -42 9482 4226 -1776 -2488 -3312 -2090 -1599 -5788 -2238
14037 -2238 -2879 -15459 -17087 -6376 3328 1948 -5375 -802 6072 5641 649 -1019 -2050 -1499 -371
14022 -371 1743 -3361 -8013 -1788 1653 7697 8833 13102 15306 11661 4314 6235 8323 6045 5983
14007 5983 1692 -1458 -2389 -6951 -2158 -2441 -7659 -10649 -13195 -8603 -3109 -7858 -10390 -11186 -1491
13992 -1491 9391 16140 11861 1999 -494 -2942 -3967 -5827 -2600 1428 397 -3293 -463 300 -3396
13977c396L17O29r139M22N70O640l801j656O925r27m872n4L254L72j813m236K89
13960a0476K868l663P220K938j65j512k338J401K234k514k217k465J195L073K986
13945a435P43k001o33J332O941K080K554K720j705J111K745m56j1097m791l314
13930e206p71L193m711p68L316O094p44L933j126p43j0138j70j309k282j233M620
13914h045N471K476n131K768l471j199K751j61m710Q70N929k530J125K220m196
13899e833k514J137O162M761k40J166J393j412k604n028r07L08N859J69l736n48
13883a867L779M769N631j198l167q56j1M705n227j2640K814N349J595J675n248
13868A03m990p150J23J95O024M225k891K88j683L634L413l059l138k212P66N187
$$ plain form
13977 -3396 -3079 -2450 -11589 -11167 -10597 -3957 -7758 -9414 -2489 -3416 -8288 -8342 -5088 -4716 -6529 -10765 -10476
13960 -10476 -7608 -11271 -4051 -1113 -1278 -2790 -5128 -3727 -1493 -4007 -6224 -8689 -7494 -4421 -1435
13945 -1435 -692 -2693 -3326 -1994 4947 7027 9581 12301 10596 11707 14452 13996 2899 -1892 -5206
13930 -5206 -5977 -2784 -7495 -8263 -4947 1147 403 4336 3210 2467 -7671 -7841 -9150 -11432 -12665 -8045
13914 -8045 -2574 -98 -5229 -2461 -5932 -7131 -4380 -4541 -9251 -8381 -2452 -4982 -3857 -1637 -5833
13899 -5833 -8347 -7210 -1048 3713 3473 4639 6032 4620 2016 -3012 -3919 -3611 2248 2417 -1319 -1867
13883 -1867 1912 6681 12312 11114 7947 7091 7080 11785 6558 -6082 -3268 2081 3676 5351 103
13868 103 -4887 -12037 -11914 -11719 -5695 -1470 -4361 -4073 -5756 -2122 1291 -1768 -4906 -7118 -6352 -1165
13852a165N797k77K742L067l631K032k259o37N77k237k059m744K17O098o87M184
13836G018K626m465j917m759k637N464N215L429q130j0160L102P366M018m687
13822A483K037N762n197k249J001k106j0109l873J717P775K119l960J822P28R70
13807b080K830J443K793p146l369O136J707p385k879O58L786M749j004K66K038
13792B543J698m232L637k205n953k391O483k226o570K279k956n058o24N13L326
13777a1736M085K439P298N271j737n330j970K313N788j807r691l680R09k360J922
13762h286L684N462j240n60N999O833j846r879q037L7k368m588M502R920L154
13747B787k142j31j463l546k600n515j106o885Q124M686l884j979j479O237M300
$$ plain form
13852 -1165 4632 4355 7097 10164 6533 8565 6306 5669 6246 4009 1950 -2794 -2577 3521 2834 7018
13836 7018 9644 5179 3262 -1497 -4134 1330 6545 9974 1844 -8316 -5214 2152 6170 1483
13822 1483 3520 9282 4085 1836 2837 731 -9378 -13251 -11534 -3759 -1640 -5600 -3778 -3050 -2080
13807 -2080 750 2193 4986 -2160 -5529 607 2314 -5071 -7950 -7292 -3506 1243 239 505 2543
13792 2543 4241 9 3646 1441 -4512 -6903 -420 -2646 -9216 -6937 -9893 -14951 -15575 -15062 -11736
13777 -11736 -7651 -5212 2086 7357 5620 290 -1680 633 6421 4614 -5077 -8757 -7848 -10208 -8286
13762 -8286 -4602 860 -380 -940 5059 11892 10046 167 -7870 -7833 -10201 -14789 -10287 -367 2787
13747 2787 645 514 -949 -4495 -7095 -12610 -13716 -20601 -12477 -7791 -11675 -13654 -15133 -8896 -4596
13732d596l706o791J959M844n473p234J99N127P739L220k407M078M471J433Q82
13717C745M77J567N626j0909j1077l769J453O983K338k934j10J0564R581R54q446
13702F043k965o031n999k132M081R881N783J272J057K131o846j0999J291K536
13688h97K133J906p97q164m869K14J757J970N762M383k653r249l285M244j674
13673i219N11L790R34P807M076m768q855k188J821K143J88q750L838J283O270
13658a119M017O85n94n518k318k515j502R30M792K583j562p110k963L739k566
13643a1021N028O018N528l015r771j635N368J206j943k264N293j569l790N400
13629a167O693M571N78q250q196k723N914j006n865q26J2p35M036N822J108O82
$$ plain form
13732 -4596 -8302 -15093 -13134 -8290 -13763 -20997 -20798 -15671 -7932 -4712 -7119 -3041 1430 2863 3745
13717 3745 4222 5789 11415 506 -10571 -14340 -12887 -5904 -3566 -6500 -6610 3954 13535 14489 6043
13702 6043 3078 -2953 -8952 -11084 -7003 2878 8661 9933 10990 13121 6275 -4724 -3433 -897
13688 -897 1236 3142 2345 -5819 -10688 -10474 -8717 -6747 -985 3398 745 -8504 -11789 -7545 -9219
13673 -9219 -8708 -4918 -3984 3823 7899 3131 -5724 -7912 -6091 -3948 -3760 -12510 -8672 -7389 -1119
13658 -1119 2898 3583 2989 -2529 -4847 -7362 -8864 -7934 -3142 -559 -2121 -9231 -12194 -8455 -11021
13643 -11021 -5993 25 5553 2538 -7233 -8868 -3500 -2294 -4237 -6501 -1208 -2777 -6567 -1167
13629 -1167 5526 10097 10675 2425 -5771 -8494 -2580 -3586 -9451 -10277 -10265 -11000 -6964 -1142 -34 648
13613F48k287r440n167J426l378K523P843O718K058K855l597r672n421L355J385
13598a0151J126N855l54m450j947m63P129N916J142n0l408k666N740J348q936
13583d169O57q6n818r38L696K340O8o346K642O457j311k890R76P20p47N847K912
13566D010j482n075k117O908K260m030k123J1246K202m551l648j521J270J602
13552D951k689p40j850j360L99L923Q282J577l057j2156j271k761m044L592J594
13537e610k349J238O337J723k816j2390k416q21j797N549M642K302L685L219P296
13522G792J468m755j1652J077P958k901n851J434k350R209q09j732j691k033p344
13507a2180O508P990l51K772n26j758n794n254J796M915O419o88m627j307l318
$$ plain form
13613 648 -1639 -11079 -16246 -14820 -18198 -15675 -7832 -1114 944 3799 202 -9470 -14891 -11536 -10151
13598 -10151 -9025 -3170 -3524 -7974 -9921 -10384 -3255 2661 3803 3753 345 -2321 3419 4767 -4169
13583 -4169 -3512 -3598 -9416 -10354 -6658 -4318 -4250 -10596 -7954 -1497 -2808 -5698 -4722 -4002 -4749 1098 4010
13566 4010 2528 -2547 -4664 2244 4504 474 -1649 9597 11799 7248 3600 2079 3349 4951
13552 4951 2262 1522 -328 -1688 -1289 2634 10916 12493 9436 -2720 -3991 -6752 -10796 -7204 -5610
13537 -5610 -7959 -6721 -384 1339 -1477 -13867 -16283 -17104 -18901 -13352 -8710 -6408 -2723 496 7792
13522 7792 9260 4505 -7147 -6070 1888 -1013 -6864 -5430 -7780 1429 620 -1112 -2803 -4836 -12180
13507 -12180 -5672 2318 1967 4739 4213 2455 -3339 -8593 -6797 -1882 4537 3849 -778 -2085 -5403
13492e403R16N430k114N070L674o634o489K325O790m02L94L500j787R65k093q26
13476C316l181o396O16N940K067K975n818l247k328J375J068P27K942j826l822
13461e592Q00O303M459R421Q3k266p344o416K314q683q95K945R94l92m081n801
13445a4151J506O603L985l115p593J71M749K363K18L069J425l319M88K858p996
13430h739o507N132K640L114N655K247n714j0564N940j077o83R49Q656j319O43
13415C73K116K831M817p562m590m878n172K719O720N326J666o859j164j041O479
13400A781J717k650n45J089m824J493N899O831j747j1212q895j093J074j855Q853
13385d084N128J781p05p0j445j331m243k357M617K444J397o102l014N174J319
$$ plain form
13492 -5403 -4487 943 -1171 3899 7573 939 -5550 -3225 3565 3163 3557 7057 5270 6235 4142 3316
13476 3316 135 -6261 -5645 295 2362 5337 -481 -3728 -6056 -4681 -3613 -2886 56 -1770 -5592
13461 -5592 -4792 1511 5970 15391 15474 13208 5864 -552 1762 -6921 -7816 -4871 -3877 -4269 -8350 -14151
13445 -14151 -12645 -6042 -2057 -5172 -12765 -12594 -7845 -5482 -5264 -2195 -770 -4089 -3601 -743 -8739
13430 -8739 -15246 -10114 -7474 -4360 1295 3542 -2172 -12736 -6796 -7873 -8556 -7607 1049 -270 373
13415 373 2489 5320 10137 2575 -2015 -6893 -12065 -9346 -2626 2700 4366 -2493 -3657 -4698 1781
13400 1781 3498 848 303 1392 -3432 -1939 3960 10791 9044 -2168 -11063 -12156 -11082 -12937 -4084
13385 -4084 1044 2825 2120 2050 605 -726 -4969 -7326 -2709 -265 1132 -4970 -7984 -2810 -1491
13370a491q343j036N422J170j344M94J920M193o186R7M307j156k233J485j946
13355d647PK968L655m72n898j245q07O077Q5L062j046m555k332N819N361p379
13339a347p9j989j980m120q74N128N532j248j789J921j344N167J066j32k143o227
13323d458l342J983j664J697n884M089j276j121N469%M401j304k806m802L993
13308e025M308M631j923l38o655P21l30m201p150M947P945j939l082k43J722M145
13292b467Q52l469L778l601m085R744O058j269o146K272r89r169M440K934l182
13277d299k746P61j160n71J315O288K889l700L493m096m002L543N74q085M038
13262e758N003M809L201L45l023j635k245n101Q16j351J001j690K497K955j233
$$ plain form
13370 -1491 -9834 -10870 -5448 -4278 -5622 -5128 -3208 985 -5201 -5104 -797 -1953 -4186 -2701 -4647
13355 -4647 -4640 -1672 1983 1511 -4387 -5632 -6439 -362 -277 2785 1739 -2816 -5148 671 6032 -1347
13339 -1347 -1426 -3415 -5395 -9515 -10389 -5261 271 -977 -2766 -845 -2189 2978 4044 3912 1769 -4458
13323 -4458 -7800 -5817 -7481 -5784 -11668 -7579 -8855 -9976 -4507 -4507 -106 -1410 -4216 -9018 -5025
13308 -5025 -717 3914 1991 1653 -5002 -4281 -4611 -8812 -15962 -11015 -3070 -5009 -8091 -8334 -6612 -2467
13292 -2467 -1615 -5084 -1306 -4907 -8992 752 6810 5541 -605 1667 678 -8491 -4051 -1117 -4299
13277 -4299 -7045 -6284 -7444 -8015 -6700 -412 2477 -1223 2270 -1826 -5828 -2285 -1711 -9796 -5758
13262 -5758 -755 4054 7255 7600 4577 2942 697 -4404 -3588 -4939 -3938 -5628 -3131 -176 -1409
13247a409n666o303j609L820R320P111j706J191Q065N86o866l143L489j83J096
13232G793m276J930q443k188P721R84l75k983p162J684R233Q79m32j037m684m720
13216f076p646K20K094l072P121M507k968L547q53j34L420j433J091M582K52l49
13200D303j505o204n354M472M076L997O645m618m021l491j445m853l716N709L215
13185b790M028J63K593L275p021r74m268l540l733l61L871J246M617L06L409r79
13169a58P08L92N606j067m326L67l535k660M184L926J89l122k372R39o031m905
13153a1865M804Q140K660m084L45L623k24o86o626j756J417j662J168O81l726
13138g791j719k07K726k131n65K357O010M373M84j61K053L550m431J424m429k769
$$ plain form
13247 -1409 -7075 -13378 -14987 -11167 -1847 5264 3558 4749 12814 13400 6534 3391 6880 6697 7793
13232 7793 3517 5447 -2996 -5184 2537 3521 3146 163 -6999 -5315 3918 4797 4365 3328 -1356 -6076
13216 -6076 -13722 -13502 -11408 -14480 -7359 -2852 -5820 -2273 -3126 -3260 160 -1273 -182 4400 4652 4303
13200 4303 2798 -3406 -8760 -4288 -212 3785 10430 5812 1791 -1700 -3145 -7998 -11714 -6005 -2790
13185 -2790 1238 1401 3994 7269 248 -726 -4994 -8534 -12267 -12628 -8757 -7511 -2894 -2588 821 -158
13169 -158 550 942 6548 5481 1155 1522 -2013 -4673 -489 3437 3626 504 -1868 -929 -6960 -11865
13153 -11865 -7061 1079 3739 -345 0 3623 3399 2713 -3913 -5669 -4252 -5914 -4746 -4065 -7791
13138 -7791 -9510 -9717 -6991 -9122 -9687 -7330 -1320 3053 3537 3376 5429 8979 4548 5972 1543 -1226
13122a226j3925k87L227l463Q66k250K926M785L62Q51M726O184j332L530O200
13107A1174L158r891j883L346N84o476k911J83P31O959Q78j577L160N32j347m910
13091A710l122L866K12O28j145l767J383M950L203J287L816k497q960j271k471
13076b178p01K196l113k050j16J018P195j900l481n522k68Q213L902m485J354
13061F4M232r0l502l680m950N153k29l47l478j002p556L406N513P965r6o284k460
13044g341M919K998j918n378L322Q54n13j875K20m395J510K305o66l987q090j418
13028a9453J1889N735n578J275L394P737p747K836K409m421j711O091j02m216
13014a862J108k61l600J480k015J803O894j4l54P72m425k847p37k71J543M057
$$ plain form
13122 -1226 -15151 -15438 -12211 -15674 -14808 -17058 -14132 -9347 -8985 -8134 -3408 2776 1444 4974 11174
13107 11174 14332 4441 2558 5904 6488 12 -2899 -2716 -1985 4974 5852 4275 7435 7967 6620 1710
13091 1710 -1412 2454 2666 3294 2149 -1618 -235 4715 7918 9205 13021 10524 1564 293 -2178
13076 -2178 -2879 -683 -3796 -5846 -5962 -4944 2251 351 -3130 -8652 -8920 -707 3195 -1290 64
13061 64 4296 4206 704 -2976 -7926 -2773 -3002 -3349 -6827 -7829 -15385 -11979 -6466 1499 1403 -4881 -7341
13044 -7341 -2422 576 -1342 -6720 -3398 -2544 -3057 -4932 -4712 -9107 -7597 -5292 -5958 -9945 -18035 -19453
13028 -19453 -7564 -1829 -7407 -6132 -2738 4999 -2748 88 2497 -1924 -3635 2456 2354 -1862
13014 -1862 -754 -1015 -4615 -3135 -5150 -3347 3547 3533 3179 3951 -474 -3321 -4058 -4329 -2786 1271
12998A271J771n817l402J353l55L710q1J134O997m959m258Q594O745p251r518
12983d066l044R946O553q62q622n578O243L701j556j233N34J380l328J33j812
12968a611q87p078n980N434O402J010l912K818M517K051j510O219n254j014o652
12953e447l885R421N608k573O581J404l740j938o980k350l117K685J849L57k154
12938d279p006N794k792n543K259J486j636J751L891K245q094O426J484L163M254
12923C403o91M797K944j3638j1224l816j928L141O920L419l89j535Q99J539M853
12908a306J539Q57j515J04l466L38j918m135L195L930k258J373J497k644k963
12893g372P937O804n182q187l104L107k06N003L708o286J138n307L201r64J263
$$ plain form
12998 1271 3042 -2775 -6177 -4824 -5179 -1469 -1550 -416 6581 1622 -2636 5958 12703 5452 -4066
12983 -4066 -7110 2836 9389 8527 -95 -5673 570 4271 2715 1482 2016 3396 68 201 -1611
12968 -1611 -2498 -9576 -15556 -10122 -3720 -2710 -6622 -3804 713 2764 1254 7473 2219 1205 -5447
12953 -5447 -9332 89 5697 3124 9705 11109 7369 5431 -1549 -3899 -7016 -4331 -2482 -2125 -4279
12938 -4279 -11285 -5491 -8283 -13826 -11567 -10081 -11717 -9966 -6075 -3830 -11924 -5498 -4014 -851 3403
12923 3403 2712 7509 10453 -3185 -14409 -18225 -20153 -17012 -10092 -6673 -7062 -8597 -7698 -6159 -1306
12908 -1306 233 1090 -425 -321 -3787 -3449 -5367 -9502 -6307 -2377 -4635 -3262 -1765 -4409 -7372
12893 -7372 565 7369 2187 -6000 -9104 -5997 -6203 -1200 2508 -3778 -2640 -7947 -4746 -5710 -4447
12878d447j462K165J546j161K887K47j25j378l276p331k394j279k98O145J931
12863h230Q551N285j409j99J334p68J801K294l087k88l856j555k348j662K303
12848a834l972p51J239M270m040q556q458M769J3912M061k27N551N103L15j986
12833I396k892r911p288o097L032J1567Q162n746n907r88J971N902r39o89m775
12818e202p407j632O195M475N121m059n606P501N278n585n991j860K760M281j044
12803b775P699J790l61r88q768m70k798N44Q92n889l943L976j39l550K383N937
12787f460Q010j663o317j867N500J594l17K572m216m445j546M001J0705j609o588
12772b646p276L737o04o42k108P793N381j0666l443M023Q681K800p699k362K1
$$ plain form
12878 -4447 -5909 -3744 -2198 -3359 -472 -225 -350 -1728 -5004 -12335 -14729 -16008 -16306 -10161 -8230
12863 -8230 321 5606 4197 3998 5332 4564 6365 8659 5572 5284 1428 -127 -2475 -4137 -1834
12848 -1834 -5806 -6557 -5318 -1048 -5088 -13644 -22102 -17333 -3421 640 413 5964 11067 11382 9396
12833 9396 6504 -3407 -10695 -16792 -13760 -2193 5969 223 -5684 -6672 -4701 1201 262 -427 -5202
12818 -5202 -12609 -14241 -8046 -3571 1550 -2509 -8115 -614 4664 -921 -6912 -8772 -6012 -1731 -2775
12803 -2775 4924 6714 6353 5365 -3403 -3873 -6671 -6127 -5235 -11124 -15067 -11091 -11230 -14780 -12397 -6460
12787 -6460 1550 -113 -6430 -8297 -2797 -1203 -1520 1052 -3164 -7609 -9155 -5154 5551 3942 -2646
12772 -2646 -9922 -6185 -6789 -7431 -9539 -1746 3635 -7031 -10474 -6451 2230 5030 -2669 -5031 -5010
12757e010N442j358k078j131m022j37p25k641M487M125M748l776N75m329k296
12742h126M330J15j749r00k959l036O193R708K814p120p000J576K35j944k698
12727a0561J404m96M334k006o292j930N606K683K879j692p225n481Q413J0254
12713a10N462q9o602j914O229J018k512p77k194M718O818o390k104K426L932R5
12697H006L11m598J190L191k56k84k819p307K55l807j675K038K900O314L134k373
12681D220j318N195J394p481q85j400o360J524P883P162O394J592l010l834l364
12666G712n675o858j064L971K092M958j215O83M43m407m070M530q95j566L968
12651B607J059l479L092K575L747K37l109l286K444k336j127J890n960l633J495
$$ plain form
12757 -5010 432 -926 -3004 -4135 -8157 -8294 -9019 -11660 -7173 -3048 1700 -2076 -1501 -5830 -8126
12742 -8126 -3796 -3681 -5430 -6330 -9289 -12325 -6132 3576 6390 -730 -7730 -6154 -5919 -7863 -10561
12727 -10561 -9157 -9653 -5319 -7325 -13617 -15547 -9941 -7258 -4379 -6071 -13296 -18777 -10364 -110
12713 -110 5352 5263 -1339 -3253 2976 3994 1482 705 -1489 3229 10047 3657 1553 3979 7911 8006
12697 8006 8317 3719 4909 8100 7844 7560 4741 -2566 -2311 -6118 -7793 -5755 -2855 3459 6593 4220
12681 4220 2902 8097 9491 2010 1125 -275 -6635 -5111 2772 9934 16328 17920 14910 11076 7712
12666 7712 2037 -4821 -5885 -1914 178 5136 3921 4604 5047 640 -3430 1100 205 -1361 2607
12651 2607 3666 187 3279 5854 9601 9838 6729 3443 5887 3551 2424 4314 -1646 -5279 -3784
12636c784J540k251M759J315j146k132M33J440k558O36r24K348K531L139k172
12621C174j461o125n450M155N217n722k908j279l360P521P556j499m93j119k005
12606c798O302l024q752o314l356M031N547L942P065K394m326n662q223L947J1634
12591A407N796j84N36L755n434k022p10m604M70j285k496o554l8k181p7R69l241
12574a5893j60K834J76M614L032l28P232j273k071K935O499Q65k414m434J57l016
12558a245J130r96m849M784R404K991p837J656P9o156l827j895M107r27P43M400
12542A562K199K438l456k317q12m525m977K914J856o55J672M594n257M25R62m563
12526g940Q85L496J699r13k287l798N206P041L416m770o513l56k230k558n237
$$ plain form
12636 -3784 -2244 -4495 264 1579 433 -1699 -1266 174 -2384 -1748 -2672 -324 2207 5346 3174
12621 3174 1713 -4412 -9862 -5707 -490 -6212 -9120 -10399 -13759 -6238 1318 -181 -674 -1793 -3798
12606 -3798 2504 -520 -9272 -15586 -18942 -14911 -9364 -5422 1643 4037 -289 -5951 -14174 -10227 1407
12591 1407 7203 7019 7555 11310 5876 3854 3144 -1460 -990 -2275 -4771 -11325 -11363 -13544 -13621 -12652 -15893
12574 -15893 -16053 -13219 -13043 -8429 -5397 -5725 1507 234 -1837 1098 7597 8462 6048 1614 1771 -1245
12558 -1245 -115 -1111 -5960 -1176 8228 11219 3382 5038 5117 -1039 -4866 -6761 -2654 -3581 -2838 1562
12542 1562 3761 6199 2743 426 -386 -4911 -9888 -6974 -5118 -5773 -4101 493 -4764 -4339 -3377 -7940
12526 -7940 -7055 -3559 -1860 -2773 -5060 -8858 -3652 3389 6805 2035 -4478 -4834 -7064 -9622 -14859
12511a4859M999O70r707m465O813J1849K594n923l584O993M861J606m576l079
12497e808l482J693L391J597q4n214R395K952n734O40J87M924M118k419p90N91
12481E957p965j957j200K027j308k688j125o7n260j162P618R583N498J362j0565
12466a252k067M743L570l742j980N85m928p18m802k65K536K698j993k243K418
12451g440L629M515J601j559n051Q16j794m442K51J191K621J228l568P016R12
12436g4m735O58l30o254m35l826o084M899j263j2705Q75O531J2464M370j068K156
12420d821n44l072j906l82N441J286k016j27K456p16q90m428m876l323N016J640
12404a1262J3773n53m665Q112k353J607M010k337j099l028j1181o444J87J5879
$$ plain form
12511 -14859 -9860 -9190 -18897 -23362 -16549 -4700 -2106 -8029 -11613 -4620 241 1847 -2729 -5808
12497 -5808 -9290 -7597 -4206 -2609 -2693 -7907 1488 4440 -1294 -654 -467 4457 8575 6156 5366 5957
12481 5957 -2008 -3965 -5165 -3138 -4446 -7134 -8259 -8326 -13586 -14748 -7130 2453 7951 9313 -1252
12466 -1252 -3319 1424 4994 1252 -728 -143 -5071 -5789 -10591 -10856 -8320 -5622 -7615 -9858 -7440
12451 -7440 -3811 704 2305 746 -4305 -3489 -5283 -9725 -9474 -8283 -5662 -4434 -8002 -986 -74
12436 -74 -4809 -4151 -4481 -10735 -11170 -14996 -21080 -16181 -17444 -30149 -29274 -22743 -10279 -5909 -6977 -4821
12420 -4821 -5365 -8437 -10343 -10725 -5284 -3998 -6014 -6141 -3685 -4401 -5291 -9719 -14595 -17918 -12902 -11262
12404 -11262 2511 1958 -2707 5405 3052 4659 8669 6332 5233 2205 -8976 -15420 -15233 646
12390F46P088j132k775k167j573o472J795L425k826O672J710p391L892K580j218
12375B254j923m485l984K97M872k202N94J699O590K347o232n897K520J480O478
12360D408p63K022K562P86o216n345K493k701K170K3l913L710O659mQ69j564K800
12343G996P339m879p837L131M637k534l618j817p21j867j566j2O197J0156k114
12328A2491r508r556m20M399P467M28O92P392o51Q90K362j791j3373r548l714
12313a2440K452P546o02n060J158O161L674J827M21L512j54k533q106l556j420
12298g120k745l025N2L564K090l8m193p578L004J224N216O280l871P19Q183K504
12282D266N670j593k677j292m712J600p86j0199P736O577j046m211J449Q30o7
$$ plain form
12390 646 7734 6602 3827 1660 87 -6385 -4590 -1165 -3991 2681 4391 -3000 892 3472 2254
12375 2254 331 -4154 -8138 -7841 -2969 -5171 -4577 -2878 3712 6059 -173 -6070 -3550 -2070 4408
12360 4408 3645 5667 8229 9015 2799 -2546 -53 -2754 -584 -561 -4474 -764 5895 5891 6760 5196 7996
12343 7996 15335 10456 2619 5750 10387 7853 4235 2418 1697 -170 -1736 -1748 4449 14605 12491
12328 12491 2983 -6573 -6993 -2594 4873 5301 5993 13385 12734 13624 15986 14195 822 -8726 -12440
12313 -12440 -9988 -2442 -3044 -8104 -6946 -785 2889 4716 5137 8649 8495 5962 -2144 -5700 -7120
12298 -7120 -9865 -12890 -12838 -9274 -7184 -7222 -11415 -18993 -15989 -14765 -9549 -3269 -7140 -6421 1762 4266
12282 4266 9936 8343 5666 4374 -338 1262 476 -9723 -1987 4590 3544 -667 782 1612 1545
12267A545k873M417m19M07O47J888O70P25L021o811q204J241j331o852m378K506
12251a3801N154M078M087J314l836K645J532k7L45l612j645l29J255K154n366
12236f052q490N322N422K672K66j989J694k443N576K502j304m990k248M168K081
12221B187L066n03k367l191p132O346L778J440N736m295o437p25PJ0945k113m533
12205B209K667j135m49p962n537l719m21P616P451k84J60m307p4M534K02k612
12189a661k471L183J854p174p739K819L131J228N086m0K326j759l141k129J389
12174e098Q34M369J308M389j434m678k184N949j982p215j758O975N280J77n647
12159g15q384l573O475o53k13j293L586J170P721j508l110L124j5k862n213P53
$$ plain form
12267 1545 -1328 3089 2670 3077 3724 5612 6282 7007 10028 3217 -4987 -3746 -5077 -11929 -16307 -13801
12251 -13801 -8647 -4569 -482 832 -3004 -359 1173 1146 1491 -2121 -3766 -4095 -2840 -686 -6052
12236 -6052 -14542 -9220 -3798 -1126 -860 -2849 -1155 -3598 1978 4480 3176 -1814 -4062 106 2187
12221 2187 5253 4750 2383 -808 -7940 -1594 2184 3624 9360 5065 -1372 -2097 -2090 8855 6742 2209
12205 2209 4876 3741 3292 -4670 -10207 -13926 -14347 -6731 720 436 596 -3711 -3785 749 951 -1661
12189 -1661 -4132 -949 905 -6269 -14008 -11189 -8058 -6830 -1744 -1784 542 -1217 -4358 -6487 -5098
12174 -5098 -4264 105 1413 5802 4368 -310 -2494 3455 1473 -5742 -7500 -525 4755 4932 -715
12159 -715 -9099 -12672 -6197 -6850 -7063 -8356 -4770 -3600 4121 2613 -497 2627 2612 -250 -5463 -4710
12143d710J330k17k019o48o15j320l968Q47qM087r82M688K263m438N996p81n551
12126f046J0720L84m782n594k97O069k468p937K770L667K20o35m747J502O688
12111d86P347K80l232j317k655r213j271Q399K424Q638R788o88o901q696j181
12096A236N050m551o591J733k804p623J183M502K774O98j486m173j128L393M727
12081c060N744Q70r084o402O236K790L038j284q159M451J1377K808l685l940q37
12066H63J204M63J816P109o368Q5m756q483j268n14K282n16l151p472K660O380
12050i666R511P722k850j4204j1132k907R626N304N745R087k98k923K088m249
12036H54o917l452L751N464K285L404m106J301m736j142p582j404k445K067L506
$$ plain form
12143 -4710 -3380 -3597 -5616 -6264 -6879 -8199 -12167 -11320 -11328 -7241 -8223 -3535 -1272 -5710 286 -495 -6046
12126 -6046 4674 5058 276 -5318 -5615 454 -2014 -9951 -7181 -3514 -3294 -3929 -8676 -7174 -486
12111 -486 6861 7141 3909 2592 -63 -9276 -10547 -2148 276 8914 18702 18014 11113 2417 1236
12096 1236 6286 1735 -4856 -3123 -5927 -13550 -12367 -7865 -5091 -4393 -5879 -10052 -11180 -7787 -3060
12081 -3060 2684 3554 -5530 -11932 -5696 -2906 132 -1152 -9311 -4860 6517 9325 5640 1700 863
12066 863 2067 2530 4346 11455 5087 5172 416 -8067 -9335 -9849 -7567 -8083 -11234 -18706 -16046 -9666
12050 -9666 -155 7567 4717 -9487 -20619 -23526 -13900 -8596 -2851 6236 5938 3015 5103 854
12036 854 -6063 -9515 -5764 -300 1985 5389 1283 2584 -2152 -3294 -10876 -12280 -14725 -12658 -9152
12021i152J811o437J474K711O721N57p09O24M745Q70o892K967J913Q75k116M74
12005D36k91J708l00K108n164p269j206O431Q191k633L09n448n836L148O528M507
11989E219k77L603j727m472M22L725J378p001l728o95k052J598L265n165o006
11974a1913J85N017P735J469n177L232N30J783j388K657M999k175m154J41N995
11959H936R710m547n311l168L844L070R24j848n748l984p32l978l943J620k32
11944e387k105j626K562P587m604l907P884Q638m035m863L242L201n924k523K552
11929F92n516K839K074J348K190J609l291j2378k011R110K736K460l432J23j622
11914c069k016K629M369P45o83K550R9K943m578n582R80j489o075J948R22Q118
$$ plain form
12021 -9152 -7341 -13778 -12304 -9593 -2872 -2315 -3024 -2400 2345 3215 -3677 -710 1203 2078 -38 436
12005 436 145 1853 1553 3661 -1503 -8772 -9978 -3547 4644 2011 2320 -3128 -8964 -5816 712 5219
11989 5219 4942 8545 6818 2346 2768 6493 7871 870 -2858 -3553 -5605 -4007 -742 -5907 -11913
11974 -11913 -11728 -6711 1024 2493 -2684 548 1078 2861 1473 4130 9129 6954 2800 2941 8936
11959 8936 18646 14099 8788 5620 9464 12534 13458 11610 5862 1878 1146 -2832 -6775 -5155 -5387
11944 -5387 -7492 -9118 -6556 1031 -3573 -7480 404 9042 5007 144 3386 6587 663 -1860 692
11929 692 -4824 -1985 89 1437 3627 5236 1945 -10433 -12444 -3334 -598 1862 -1570 -1447 -3069
11914 -3069 -5085 -2456 1913 2658 1975 4525 4624 7567 2989 -2593 -1613 -3102 -9177 -7229 -6307 1811
11898A811l24p320J300o173j428J414j25l422K558N240N932J84n689n591Q629
11883c004N895o31P46L57L720k452k087K937M40N138j571j315M18J392r504r435
11867h956j096K162N497Q90O27K856j044K433n799k866j884J949j375l725J379
11852h952K634k98j838M346m107L693K206p440J302L904J472L079j906k798k576
11837g279k250N3o440j642j108Q268P59n777O75l14m35J3458O289o102n057k770
11821i672J006l164J40N495L616m917k028K277L203l736J31P229L144Q061m261
11806F524O068L622r739p670k250J069M744p133P4L698K272O648m428r836l450
11791i787K21N498k769r63M498L687J441l774J557L408N240O388K088l718L558
$$ plain form
11898 1811 1487 -5833 -4533 -10706 -12134 -10720 -10845 -14267 -11709 -6469 -537 -353 -6042 -11633 -3004
11883 -3004 2891 2260 3006 3363 7083 4631 2544 5481 5921 11059 9488 8173 8591 9983 479 -8956
11867 -8956 -10052 -7890 -2393 -1503 -876 1980 936 3369 -2430 -5296 -7180 -5231 -6606 -10331 -8952
11852 -8952 -6318 -6616 -8454 -4108 -8215 -4522 -2316 -9756 -8454 -4550 -3078 1 -1905 -4703 -7279
11837 -7279 -9529 -9476 -15916 -17558 -18666 -10398 -9639 -15416 -14741 -15055 -15490 -2032 4257 -1845 -6902 -9672
11821 -9672 -8666 -11830 -11690 -6195 -2579 -7496 -9524 -7247 -4044 -7780 -7649 -420 2724 10785 6524
11806 6524 12592 16214 6475 -1195 -3445 -2376 2368 -4765 -4691 -993 1279 7927 3499 -6337 -9787
11791 -9787 -9566 -4068 -6837 -7800 -3302 385 1826 -1948 -391 3017 8257 14645 16733 13015 16573
11776A6573k354o325k266M212J28M64K388K537J244m347j0941o73J361o71m896
11761c566L187K581P465L015l330q947n740L817J01j163O32j745p33k783k741
11746i950K557p74M470J053M041p52q084j167N212N618L130J0135j51j0520m683
11731A35L717J99m454k758L452j660m617J50N009O477K600L316n380M462K051
11716A2699M555j01m364o98o191K670L220K575j481j6681J43J106r93j880p036
11701a2457r84j398O252O923O039L16o232m161M509p80J99L105Q660j702n797
11686B492o823L179M515n609j4K942j321J857k855k364P101N196o353n611J645
11671b023J706k12K223N378k836K62K982m006r952j637M862L517M491K905q216
$$ plain form
11776 16573 14219 7894 5628 9840 9968 10432 12820 15357 16601 12254 1313 640 2001 1330 -3566
11761 -3566 -379 2202 9667 12682 9352 405 -5335 -1518 -1417 -2580 -1948 -3693 -4426 -7209 -9950
11746 -9950 -7393 -8167 -3697 -2644 1397 645 -7439 -8606 -3394 2224 5354 15489 15338 4818 135
11731 135 3852 4051 -403 -3161 291 -1369 -5986 -5836 -827 5650 8250 11566 6186 10648 12699
11716 12699 17254 17153 12789 12091 5900 8570 11790 14365 12884 -3797 -3654 -2548 -3541 -5421 -12457
11701 -12457 -13441 -14839 -8587 -1664 4375 4691 -1541 -5702 -1193 -1973 -1774 1331 9991 8289 2492
11686 2492 -4331 -1152 3363 -2246 -2260 682 -639 1218 -1637 -4001 3100 8296 1943 -3668 -2023
11671 -2023 -317 -529 1694 7072 4236 4498 7480 3474 -6478 -8115 -3253 264 4755 7660 -556
11656e56q540O697L825p468l583J982Q182M294n21O688J970J33o314p077k420
11641b708m065j636L113l479K33J2768K108q695n040L411N999k187r517J159Q605
11626F9R582m292j739j702N13k689K930M692l944L732j418K056n816o299K432
11611a893k541m869k852J74K201M344R1J788K910j431Q60q643m68N460N51j182
11595e500R04J21L034K88K073m239k275L230O440j139M259J881n8K46n802p226
11579c763K110M495K796m567J677n208k87k625j364N823M904j473n772n72l135
11564f961k173N73M772K352N978j394q118k71M446o0n46j898K862L883J035J825
11548F305q53l098Q17l901o116k659J0534N170o758k537K640r22p459N61K209
$$ plain form
11656 -556 -9096 -2399 1426 -6042 -9625 -7643 539 4833 4312 11000 12970 13103 6789 -288 -2708
11641 -2708 -6773 -8409 -5296 -8775 -8542 4226 6334 -2361 -7401 -3990 2009 -178 -9695 -8536 69
11626 69 9651 5359 3620 1918 2431 -258 2672 7364 3420 7152 5734 7790 1974 -4325 -1893
11611 -1893 -4434 -9303 -12155 -11981 -9780 -5436 -5345 -3557 -647 -2078 -1218 -9861 -10329 -4869 -4318 -5500
11595 -5500 -4596 -4475 -1441 -1153 920 -3319 -5594 -2364 4076 2937 7196 9077 9019 9265 3463 -3763
11579 -3763 -1653 2842 5638 1071 2748 -2460 -2747 -5372 -6736 -913 3991 2518 -3254 -3826 -6961
11564 -6961 -9134 -8561 -3789 -1437 4541 3147 -4971 -5242 -796 -856 -1402 -3300 -438 3445 4480 6305
11548 6305 5452 2354 3171 -730 -6846 -9505 1029 6199 -559 -3096 -456 -1378 -8837 -8276 -6067
11533f067J933R5P03N016j137o770J189M108k74o96N0m923k127N782M774l22K342
11516C676M847j174k976o140n732k27P9L148M564K725q081k008J967O627O440
11501G735J041O293P44j005k574P54n43n213O03o648n464k497J116P209J471M719
11485G741M100k953m290J311j928l333R185j077n235n67R562m669j762K441L0
11470H556n379K891j02n287Q21K576j87Q299P579J079j2269p595j947M586M149
11455G770L524Q40L073l699j031n278q862l720O396Q168l503l163j057L628M852
11440G938n578r448m773l36K791J0733Q129O45l391m974j147J911M706L127K253
11425A2586R161K659r99r850j3054M32M623Q053L753o64n740J346L067l589K74
$$ plain form
11533 -6067 -4134 -4039 -3336 1680 543 -6227 -5038 -930 -1204 -1900 -1850 -6773 -8900 -3118 1656 1334 3676
11516 3676 8523 7349 4373 -1767 -7499 -7726 -7647 -4499 65 2790 -5291 -7299 -5332 1295 7735
11501 7735 8776 15069 15813 14808 12234 12988 12445 7232 7835 1187 -4277 -6774 -5658 1551 3022 7741
11485 7741 11841 8888 4598 5909 3981 648 9833 8756 3521 2954 12516 7847 6085 8526 8556
11470 8556 3177 6068 5966 679 1500 4076 3889 12188 19767 20846 8577 982 -965 3621 7770
11455 7770 11294 12134 15207 11508 10477 5199 -3663 -7383 -987 7181 3678 515 -542 3086 7938
11440 7938 2360 -7088 -11861 -12197 -9406 1327 9456 10101 6710 1736 589 2500 7206 10333 12586
11425 12586 21747 24406 23407 13557 503 935 5558 13611 17364 16700 10960 12306 15373 11784 12058
11410A2058J930k262n589L15K829p12k937k205M670N812m519k489j104j871j7
11395C909L327J157Q60l008M52J473R054p677j4214M078J591Q37O457Q11M989
11380A4096J957r841m60n16j394k73k772K032N557k533M419N895M803O039n756
11365B1253j325m013j308p620l973L076K296j432l501L538m239k23J1466P887
11351B1882m091j932R92k901k539M67k286PM84J057K008j284o054p794k620K188
11335b416M245k384K321M557J960o413m633J569P951q28n620q02P639N344j0013
11320B477J109K413l31M472l464O23K080k376n43l079j1571l958P105K615j596
11305d024Q063N289N816j686L929p822j195n81k418N303K903L937K442r072n365
$$ plain form
11410 12058 13988 11726 6137 6452 9281 8569 5632 3427 8097 13909 9390 6901 5797 3926 3909
11395 3909 7236 8393 9253 6245 6697 8170 17224 9547 -4667 -589 1002 1839 8296 9107 14096
11380 14096 16053 6212 5752 5236 3842 3569 797 2829 8386 5853 10272 16167 20970 27009 21253
11365 21253 19928 15915 14607 6987 3014 6090 8386 6954 3453 6991 2752 2529 13995 21882
11351 21882 17791 15859 16851 13950 11411 11878 9592 9599 10083 11140 13148 11864 5810 -1984 -4604 -2416
11335 -2416 1829 -555 1766 6323 8283 1870 -2763 -1194 6757 5929 309 -493 7146 12490 2477
11320 2477 3586 5999 5668 10140 6676 7299 9379 7003 6460 3381 -8190 -12148 -5043 -2428 -4024
11305 -4024 4039 9328 15144 13458 17387 9565 8370 7789 5371 10674 13577 17514 19956 10884 5519
11290E519q192l572Q402N317J890L571l380J877K277J874m356o365n560k30J0691
11275I763J4679P503l532q134j2437p21K722M375J296l808p099k667P028k09n080
11260C679l819k684L284l419n96J462N140N240j151R309L304l177M21j25m142
11245A2726J183J46M093N436n472j0922l045j347m268K934P202M601J900l173
11231A1994J402O298L09j999r83p860j0398o095r179l590r174n526q0l42Q701
11216b6522L357Q374R042O71j68Q75K391K498Q484N546k308o941O446P514P563
11201B6822l716k033R448J3213Q48L893K654k048J32L288L371Q165J1898P270
11187H3205L949O720r45P84P533J6748J7642K5002M4341P0865J10685J96266K76604
$$ plain form
11290 5519 -2673 -6245 2157 7474 9364 12935 9555 11432 13709 15583 11227 4862 -698 -928 9763
11275 9763 24442 31945 28413 20279 7842 7121 9843 14218 15514 11706 4607 1940 8968 8759 3679
11260 3679 -140 -2824 460 -2959 -3555 -2093 3047 8287 7136 16445 19749 16572 16993 16868 12726
11245 12726 13909 14055 18148 23584 18112 7190 4145 2798 -1470 1464 8666 13267 15167 11994
11231 11994 13396 19694 20003 18004 17021 9161 -1237 -7332 -16511 -20101 -29275 -34801 -34881 -35223 -26522
11216 -26522 -23165 -14791 -5749 -5078 -5246 -4371 -1980 518 9002 14548 12240 5299 11745 19259 26822
11201 26822 23106 21073 30521 43734 44582 48475 51129 49081 49213 52501 55872 64037 75935 83205
11187 83205 87154 93874 92929 93713 101246 117994 135636 160638 204979 275844 386529 582795 859399
11174H59399L01235K63445K59141K83062K22729N8392q0985j83934k21206k28683
11164A532595k57002l03186k88382k00417j13592o7130m5206l6259k8312l3121
11154A59988k3840j1993j3544r641k389j045k287j0567q846q286o963n153p392
11141D8042j2490j0876l619K262K013M466K027m007p273m058k224L835P409M520
11127C0027P64l814M34j515k970j12K642R27j842j43M473K260l619J869L49o14
11111B9116M555K754n260l569L406K486J089J696L143Q42r57M168M551o59p533
11096C9828k524j456N123k263p680k95L187j301j665O92J712m868L642Ml204K112
11080C1044L558j547J0740J616L908j35L073P455R315J27n450o958m069l206j6575
$$ plain form
11174 859399 1160634 1424079 1683220 1966282 2189011 2247403 2166418 1982484 1761278 1532595
11164 1532595 1275593 972407 684025 483608 370016 302886 257680 221421 193109 159988
11154 159988 136148 124155 110611 100970 98581 97536 95249 84682 75836 67550 60587 55434 48042
11141 48042 35552 24676 21057 23319 25332 29798 31825 27818 20545 16487 14263 18098 25507 30027
11127 30027 30791 26977 27411 25896 22926 22814 25456 26383 24541 24398 28871 31131 27512 29381 29730 29116
11111 29116 33671 36425 31165 27596 31002 33488 34577 36273 39416 40258 39301 43469 48020 47361 39828
11096 39828 37304 35848 40971 38708 31028 30733 33920 32619 30954 31646 33358 28490 32132 32136 28932 31044
11080 31044 34602 33055 43795 45411 49319 49184 52257 59712 69027 69154 63704 56746 52677 49471 32896
11065C2896J152r910j7683j2298o227q53N36k287M092Q122J8097P356M853J2519
11051D0365L470L473n24n186K217l490n453k818K643N173Q050L499q66j618p58
11036D8177k201j962K88J0040j008j0494p453J785M226N779M280O61N309p07N652
11021F2372J499J0141K7094M6242L6671L4069M4113M1517L5034R273j0028k5832
11009C12165l4469l4312l6151n1705m0888k8106j5948j4246j4107N371R167o86
10997E6085J294Q527J3605K2466Q576K622O724L499r504j5493m908m529Q10l043
10983H6731p105m819j3040L960M396m373r832k553O792K793M302J4577R267J225
10969I2321O781P721K244N177P379R655J1453N124l927q057n534p852l429p837
$$ plain form
11065 32896 34048 24138 6455 -5843 -12070 -12923 -12387 -14674 -10582 -2460 15637 22993 27846 40365
11051 40365 43835 47308 46784 41598 43815 40325 34872 32054 34697 39870 47920 51419 50553 48935 48177
11036 48177 45976 44014 44302 54342 53334 42840 35387 37172 41398 47177 51457 52118 57427 56720 62372
11021 62372 63871 74012 101106 147348 184019 218088 262201 303718 338752 348025 337997 312165
11009 312165 277696 243384 207233 155528 114640 86534 70586 56340 42233 47604 56771 56085
10997 56085 57379 65906 79511 101977 110553 113175 119899 123398 113894 98401 93493 88964 89774 86731
10983 86731 79626 74807 61767 65727 70123 65750 55918 53365 60157 62950 67252 81829 91096 92321
10969 92321 99102 106823 109067 114244 121623 131278 142731 147855 143928 135871 130337 122485 119056 111219
10955A11219N018N685P227M679q541r607l440o201n138j9901k0951j3341k196
10942D4512M968p60N325K2031J9785J3195j806o951j1414n595p729o036p763J44
10928F1906o876j5539r380k1J603m559n722N487M819j666J542J911m413R37m894
10913B5135q576o864l918O037J302k039l907K66N809p22J783P246Q43J0045R714
10898D2154N491P177O736J2605Q315O097l465j0393j451m88j0862j6078n556M808
10884D5090Q754O712J0611J3339J8533K1835J5518Q266N307K603j263n329j2157
10871A37819o142N894n79J547M894J2377J1897J2999J7304J7928J1502L22J119
10858B28881J673O462K20j1821j3408o221j0847m7J895J346J1642L815O471J768
$$ plain form
10955 111219 116237 121922 129149 133828 125287 115680 112240 106039 100901 81000 60049 46708 44512
10942 44512 49480 48720 54045 76076 95861 109056 107250 100299 88885 83290 75561 69525 61762 61906
10928 61906 55030 39491 30111 30090 31693 27134 21412 26899 31718 30052 31594 33505 29092 30029 25135
10913 25135 16559 9695 5777 11814 13116 11077 7170 7436 13245 12523 14306 21552 22395 32440 42154
10898 42154 47645 54822 61558 74163 82478 88575 85110 74717 73266 72778 61916 45838 40282 45090
10884 45090 53844 60556 71167 84506 103039 124874 140392 148658 153965 156568 155305 149976 137819
10871 137819 131677 137571 136992 138539 143433 155810 167707 180706 198010 215938 227440 227762 228881
10858 228881 230554 237016 237236 225415 212007 205786 194939 194892 196787 198133 209775 213590 220061 221829
10844B21829k427k329p642n455J771l89p33M338N885J7695K0271K4823K8554K6595
10830C32786L3166K8734K6155K2896K8049K4995J9653K4423K9255L6388M4126
10819F50626N6336N0698L5536M3362L6748L5691L0582K0647N907J0676J9849J7240
10807A013898K3255L4528N5526O3862N9249N7203O0249O5964P2800P8987R1098
10796A676619J11561J28398J62488J96120K25911K61097K92434L33296L80537
10787C768461M50220N51776P06717Q70973R73722J034448J099127J212280J309934
10778A1977658J319856J262042J257083J466915J872329K392845L093030M337734
10770B8979492O634716J0698377J7786490K9549607M5426380N5421779M9523660
$$ plain form
10844 221829 219402 217073 209431 203976 205747 205358 204625 208963 214848 232543 252814 277637 306191 332786
10830 332786 365952 394686 420841 443737 471786 496781 516434 540857 570112 606500 650626
10819 650626 706962 757660 793196 836558 873306 908997 939579 960226 966133 976809 996658 1013898
10807 1013898 1037153 1071681 1127207 1191069 1250318 1307521 1367770 1433734 1506534 1585521 1676619
10796 1676619 1788180 1916578 2079066 2275186 2501097 2762194 3054628 3387924 3768461
10787 3768461 4218681 4770457 5477174 6348147 7321869 8356317 9455444 10667724 11977658
10778 11977658 13297514 14559556 15816639 17283554 19155883 21548728 24641758 28979492
10770 28979492 35614208 46312585 64099075 93648682 139075062 194496841 244020501
10763B44020501M2685887M3049095M1450214K5247035l597405k5583847l7122515
10756C30148965m0247362m1344157m7487557n3801767m4687760k8515122j7514795
10749E6550445j1251900p586816n387145m035785l101847k455329k050582j796238
10741A8884803j645983j601378j595319j533822j448428j368940j237955j057620
10733G395358r22005p84471n96768m45271l51242k72727k36158k10460j96315
10724C379941j85665j76057j70053j70763j67843j59263j42119j19245j08996
10715A979937j02837r4190r5311q5093q6382q7342p4408q0938p5621o7739n2201
10704A077875l5584k6585k6536k0122j3507p942r118j6570l0150k3777j4659k4687
$$ plain form
10763 244020501 286706388 329755483 371205697 396452732 392855327 367271480 330148965
10756 330148965 289901603 248557446 201069889 147268122 102580362 74065240 56550445
10749 56550445 45298545 37711729 32324584 28288799 25186952 22731623 20681041 18884803
10741 18884803 17238820 15637442 14042123 12508301 11059873 9690933 8452978 7395358
10733 7395358 6473353 5688882 5092114 4646843 4295601 4022874 3786716 3576256 3379941
10724 3379941 3194276 3018219 2848166 2677403 2509560 2350297 2208178 2088933 1979937
10715 1979937 1877100 1782910 1687599 1602506 1516124 1428782 1354374 1273436 1197815 1130076 1077875
10704 1077875 1042291 1015706 989170 969048 955541 947599 938481 921911 891761 867984 853325 828638
10692H28638r334p102o963q69N208K616n481o821p479j2871r502j5917k7244k8143
10678F98736k3438k1337j6729k4845l3881j8649k923j3622j4858r362j4323j7653
10666D87116j6331j8987j9549k2659j0113j4850j5863r887R78L904k431J477J1602
10653C74407Q568k867J195o660j1711q614M672j748j4463n370J526J6038K2664
10640C77637J1898K7585M9660M6545M0073L4822L1405K2372N828j3766k6530l4995
10628E72534l2064m7307m3365l4222k2234j8293k0492o25N072p717q429j893n318
10615C35647n844J965K458j1888p048k766p620m683j2850j1917k233o233k337
10602B64651p52l168P64k095n056j6347o843K152n477j0098j0744l922q02j5228
$$ plain form
10692 828638 819304 812202 805239 804370 809578 812194 806713 799892 792413 779542 770040 754123 726879 698736
10678 698736 675298 653961 637232 612387 578506 559857 556934 543312 528454 519092 504769 487116
10666 487116 470785 451798 432249 409590 399477 384627 368764 358877 359855 363759 361328 362805 374407
10653 374407 382975 380108 381303 374643 362932 354318 358990 357242 342779 337409 338935 354973 377637
10640 377637 389535 417120 466780 513325 553398 588220 619625 641997 647825 634059 607529 572534
10628 572534 540470 493163 449798 415576 393342 375049 354557 353932 359004 351287 342858 340965 335647
10615 335647 329803 331768 334226 322338 315290 312524 304904 300221 287371 275454 273221 266988 264651
10602 264651 263899 260731 261495 259400 254344 237997 231154 233306 227829 217731 206987 203065 202263 187035
10588A87035k1745j7646j1899j3229p218O42J0063N063J8758J8598J1100j62Q931
10575A88291K0177L809j0425j7703m459p268j4653k2709j9591j0148r97l820j2261
10562H8243j4968p883r716o289r50k091M41K345L873J454O366R113J3494O426
10548H9858p41m481N127M306n51J0117j0306l226L615k122M204R232k199j7290
10534H5543n94j119m564r867q906n730k950O96Q608J8266J2959J0580O727J2094
10520A21743N556K629Q68k167J723O164R976jL177O317J2106J4034N291K923J4939
10505B05278J2312N796O105L680N005P806M276M356J4639L1523N8262Q7240J39315
10492E85593K47614L87628M94688M77684L97222L69901M25329L83494J57500j69763
$$ plain form
10588 187035 165290 147644 135745 122516 115298 115940 126003 131066 149824 168422 179522 179360 188291
10575 188291 208468 212277 201852 184149 179690 172422 157769 135060 115469 105321 104324 100504 88243
10562 88243 73275 65392 55676 49387 48437 46346 46787 49132 53005 54459 60825 69938 83432 89858
10548 89858 89117 84636 89763 94069 93518 103635 93329 90103 93718 91596 95800 105032 102833 85543
10534 85543 84949 83830 79266 69399 60493 54763 51813 52509 61117 79383 92342 102922 109649 121743
10520 121743 127299 129928 130796 128629 130352 136516 146492 146491 149668 155985 168091 182125 187416 190339 205278
10505 205278 217590 223386 229491 233171 238176 245982 250258 254614 269253 300776 359038 446278 585593
10492 585593 833207 1220835 1715523 2193207 2590429 2960330 3385659 3769153 3926653 3756890
10482C756890l90098m16969l47720l74460m73840m88214l73059k32364j48725
10473E11441r3203o3550m1271l1501k2499j0233j2529k3168j5700R55q876r773
10461A80093j2638j3480p829n516j1505j7179j3156q085p576j4228j0351j1783
10449D6767j0364j3595N07P455o17M261P783j336o332K151Q614M043M084k959
10435E0462R30P365N321n062l006n049l401K283Q722J467p158k48J66J507j029
10420E3270M662J836N841L107M711J1474J3048J7376K3800M9551P8306J02416
10408C69398J17021R8057Q5492R1987O6711J9684k7306p3795q8040q4154r7859
10397D77196j13637r8731o5916m4157k8102j1278r732r585r877L67m017M736r4
$$ plain form
10482 3756890 3366792 2949823 2602103 2227643 1753803 1265589 892530 660166 511441
10473 511441 418238 354688 313417 281916 259417 249184 236655 213487 197787 198742 189866 180093
10461 180093 167455 153975 146146 140630 129125 111946 98790 90705 83129 68901 58550 46767
10449 46767 36403 22808 23315 30770 30153 34414 42197 40861 34529 36680 45294 49337 53421 50462
10435 50462 51392 58757 64078 59016 56010 50961 47560 49843 58565 60032 52874 52626 52792 54299 53270
10420 53270 57932 59768 65609 68716 73427 84901 97949 115325 139125 188676 266982 369398
10408 369398 486419 584476 669968 761955 828666 848350 821044 747249 659209 575055 477196
10397 477196 363559 264828 198912 154755 126653 115375 105643 96058 86181 86548 82531 87267 87173
10384H7173n858K587M330j678o774k915j359p848O18J980O2k096J537N679j934
10369G3504L439P776N927r18R786O940l451J173R578L183K325J1269J6890J3479
10355A60900L2275N7029Q5001J48782K38745L04654K94674K58457K54405K43607
10345B078529J73106K0122j26896k13760k42868k44737k73406l01120k58819j64318
10335D45833r7120n9153m6388k5991k4357k2135j9059j0524m65o300p066o430
10323A20845n815j860j0117r775j2109j2162o456k738K789j674o620k427k918
10310D8963k550L948O005Q800R883r90j448M602P056M486M731m247j5709p908
10296F5622k440o537j774o287n118q130n995k620n420m558M90N29j196L405M763
$$ plain form
10384 87173 81315 83902 88232 86554 79780 76865 75506 67658 68276 70256 70318 68222 69759 75438 73504
10369 73504 76943 84719 90646 89728 99514 106454 103003 104176 113754 116937 119262 130531 147421 160900
10355 160900 193175 250204 335205 483987 722732 1027386 1322060 1580517 1834922 2078529
10345 2078529 2251635 2271757 2144861 1931101 1688233 1443496 1170090 868970 610151 445833
10335 445833 348713 289560 243172 217181 192824 170689 151630 141106 140641 134341 127275 120845
10323 120845 115030 113170 103053 93278 81169 69007 62551 59813 62602 60928 54308 51881 48963
10310 48963 46413 50361 56366 65166 75049 74059 72611 77213 84269 88755 93486 89239 73530 65622
10296 65622 63182 56645 54871 48584 43466 35336 29341 26721 21301 16743 17233 17762 16566 19971 24734
10281B4734M714N144k779p989m160l426K518J485J00j869k541O643L278L884J443
10266C1179k288n147j456j043k247M42m940P495L618L804j799Q109P033n828j172
10251C5760Jk656o012k178j535l757m191Q968K966m060J653n34J819K970k585
10236B6629o365j709M09k087k281J031l113K623L994o551n255J884m06o205M980
10221G578J854Q01N714j923K928k778J535K222l78m137J594J767k911J026M603
10206A9495L880L573p497j713L513N049M097j549j432o112n562L654q58J759O005
10191B6302K901o3l670j600j438l028j303L865j243n503o244M699m530k660M18
10176F903L191O208Q31m320P567R99n371q747K42L202n17l927J136K998m47o425
$$ plain form
10281 24734 29448 34592 31813 23824 19664 16238 18756 20241 20341 18472 15931 22574 25852 29736 31179
10266 31179 28891 23744 22288 21245 18998 19440 14500 21995 25613 29417 27618 35727 42760 36932 35760
10251 35760 35761 33105 27093 24915 23380 19623 15432 24400 27366 23306 24959 24425 26244 29214 26629
10236 26629 20264 18555 18964 16877 14596 15627 12514 15137 19131 12580 7325 9209 8803 2598 7578
10221 7578 9432 10233 15947 14024 16952 14174 15709 17931 17553 13416 15010 16777 13866 14892 19495
10206 19495 23375 26948 19451 17738 21251 26300 30397 28848 27416 21304 15742 19396 18538 20297 26302
10191 26302 29203 29140 25470 23870 22432 19404 18101 21966 20723 15220 8976 13675 9145 6485 6903
10176 6903 10094 16302 17133 12813 20380 21379 16008 7261 7503 10705 10188 6261 7397 10395 9948 3523
10160C523k114N261N566n712Q35m004k433P352o12M276L513j533l977l89N965
10145A5517K238k687o33M0K248l704J430o204P41M207j09j125j471j100M60k32
10129I616R80K522J076n280P688Q151j0571l481O809P220M929l189r210p329m640
10114E291L269P158k293p064m833Q96O93P954J00N578k465o441M517N202L802
10099B1364J645P81o949l713l93M304o722M663j541N987L897P40k914m860J683
10084A7972N949J036L728k6k517N534j275K64Q92j016n823M064N466m607p052
10069B2589q048n778k706j690L423N257J503m121j512N546k382J340O343l73l408
10054A5983k376L782J997o097m219J89o652p51p30J920J04N26L403O175J3336
$$ plain form
10160 3523 1409 6670 12236 6524 7359 3355 922 8274 7662 11938 15451 13918 9941 9552 15517
10145 15517 17755 15068 14435 14475 16723 13019 14449 8245 8986 13193 13084 11959 10488 9388 9848 9616
10129 9616 10596 13118 14194 8914 16602 24753 14182 10701 17510 24730 29659 26470 17260 9931 5291
10114 5291 8560 15718 13425 6361 1528 2424 3117 11071 11171 16749 14284 7843 12360 17562 21364
10099 21364 23009 23790 16841 13128 12735 17039 10317 14980 13439 19426 23323 24063 21149 16289 17972
10084 17972 23921 24957 28685 28659 26142 31676 30401 30665 31557 30541 24718 28782 34248 29641 22589
10069 22589 14541 8763 6057 4367 7790 13047 14550 10429 8917 14463 12081 13421 19764 19391 15983
10054 15983 13607 17389 19386 13289 9070 9259 2607 1856 1126 3046 3150 3676 7079 13254 26590
10039B6590J5632j87j3639r154n043o323n25k319j952O413M18m55L941l33K763
10024A5827M661J345m523m812j013N17j033n441j46j233M552j805L837N117k514
10009A3336m277J788O23L557O694R042j999j291m084J019P596K56q258q073j0835
9994E094J510K181k119O385O940o765k853J240r47j469K795J11j130l397J270
9979H846J761N319N8l721j498o997m953k728N570M93k664k503L225j24L805O061
9963I950o54l050m751m800M364L685J480l906q10M611K797m1k262j000o74j48
9947D791l265J320R294k544m813j192N24k986m602N74J569Q28P048J107l866k347
9931A440M180K914l591K239K775o297J413K878M52K472K134l187p53k116K98n21
$$ plain form
10039 26590 42222 42035 28396 19242 14199 7876 7351 5032 3080 9493 9911 9456 13397 13064 15827
10024 15827 20488 21833 17310 12498 11485 12002 10969 5528 5382 4149 8701 6896 10733 15850 13336
10009 13336 9059 10847 11470 15027 21721 30763 28764 27473 23389 24408 32004 32260 24002 15929 5094
9994 5094 6604 8785 6666 13051 19991 13226 10373 11613 10666 9197 11992 12103 10973 7576 8846
9979 8846 10607 15926 15984 12263 10765 3768 -1185 -3913 1657 2150 -514 -3017 208 84 3889 9950
9963 9950 9296 6246 1495 -3305 1059 4744 6224 2318 1508 6119 8916 8875 6613 5613 4939 4791
9947 4791 1526 2846 12140 9596 4783 3591 4115 1129 -3473 -2899 -1330 -502 6546 7653 3787 1440
9931 1440 5620 8534 4943 7182 9957 3660 5073 7951 8403 10875 13009 9822 9069 6953 7251 6730
9915F730O871J413K575n073q315j393K9J421j639N405P240M817n956j1257p9K509
9899E298n370J458P519M059m468k678N32n11k860O44N937K013j257n003j647m68
9883C198J971J1845k40p937o364K780J715O39N83m07J055j341L175K132J868M074
9867A8746K761l346l432J103o196n875l289K192L166r20J381j926k786L144m14
9852D309J349j111K975k825L893L478O1q836J609j119j419L091L991k40o226q774
9836e794N471O326n386K171P054j376k136k19j42L777K186k797n832o04O49L570
9820F918l189l696M955k787n412l621j53K919j32P33J394K067L665N529K418n218
9804F390r071J189J90m8P324j482q752n028k235J562Q025L261J260k107n276k773
$$ plain form
9915 6730 13601 15014 17589 12516 4201 2808 2837 4258 2619 8024 15264 20081 14125 2868 2789 5298
9899 5298 -72 1386 8905 12964 8496 5818 6350 5839 2979 3623 9560 11573 10316 5313 3666 3198
9883 3198 5169 17014 16774 8837 2473 5253 6968 7607 8190 7783 8838 7497 10672 12804 14672 18746
9867 18746 21507 18161 14729 15832 9636 3761 472 2664 5830 4910 6291 4365 1579 4723 4309
9852 4309 5658 4547 7522 4697 8590 12068 12129 3293 4902 3783 2364 5455 9446 9206 2980 -5794
9836 -5794 -323 6003 617 2788 9842 8466 6330 6111 5969 9746 11932 9135 3303 2699 3348 6918
9820 6918 3729 33 4988 2201 -3211 -6832 -6985 -4066 -4198 -3465 -2071 -4 3661 9190 11608 6390
9804 6390 -2681 -1492 -1302 -1350 5974 4492 -4260 -9288 -11523 -9961 -1936 1325 2585 478 -4798 -7571
9788g571L585J971j709M349L611K571L689L701k132o950l539M613N82l17K910
9773I364J442q372q391K334R929M114J998m486m32K624N73l231l211m165l58N864
9757E596M49R35j921o75j739K847K874o234n710n971J518N163l502o025P885K696
9741a814M857K073K654N830O261m327j1264lo503l611K73M632J720Q859L735n992
9725G380q367L118M778L843k734k652j862K696k789k60K509l539K713R232j832
9710A2234n93k845l480k936l981L647M288J341K48l863K55k884m84k132l82p89
9694b356N127l819L562L032n331n847Q30M610R222P999n210q301O41m62O21j226
9678C092L134n13n265L606j289k545m7J0555J392K374j375n839q05J127L627j544
$$ plain form
9788 -7571 -3986 -2015 -3724 625 4236 6807 10496 14197 12065 5115 1576 6189 6771 6454 9364
9773 9364 10806 2434 -5957 -3623 6306 10420 12418 7932 7500 10124 10697 7466 4255 90 -268 5596
9757 5596 6045 6980 5059 4384 2645 5492 8366 2132 -3578 -9549 -8031 -2868 -6370 -12395 -4510 -1814
9741 -1814 3043 5116 7770 13600 19861 15534 4270 4267 -2236 -5847 -5574 -942 778 9637 13372 7380
9725 7380 -987 2131 6909 10752 8018 5366 3504 6200 3411 3151 5660 2121 4834 14066 12234
9710 12234 11641 8796 5316 2380 -1601 2046 6334 7675 7923 4060 4315 1431 947 -1185 -1567 -2356
9694 -2356 2771 -1048 2514 5546 215 -5632 -4802 -192 9030 17029 11819 3518 4159 3697 4318 3092
9678 3092 6226 5713 448 4054 2765 220 173 10728 12120 14494 13119 7280 6475 7602 11229 9685
9662I685k289j4q740j512L874O949j35L54j30K35n637K68J90Q55L485L568K776
9645A3782m055Q46P51q888K326j001k804J182j948l673k861k391J379qn303N666
9629g000K427L475N438k400Q625N807p175m637j754l466O09P603L73p229J80P732
9613H608J975P00O07J012j939k834K236K581j499q205k682J729m654m792M462
9598b695L850R03l837j669L542P799K385j84J75N42R65P98r403p873j14J570O417
9581C171N042L42K41L770K4R946j700p035O16N42j0462m433K359k281l246O521
9565C417K484m320o115j209L364N310O877Q077k16l343JK711n17m632p756o246
9549b113P093L19q027k875N308K710J82j462J561J18M43l648J755n716N116N111
$$ plain form
9662 9685 7396 7382 -1358 -2870 1004 7953 7818 8172 8042 8277 2640 2908 3098 3953 7438 11006 13782
9645 13782 9727 10573 11324 2436 4762 3761 957 2139 191 -3482 -6343 -8734 -7355 -7363 -12666 -7000
9629 -7000 -4573 -1098 4340 1940 10565 16372 9197 4560 2806 -660 -51 7552 7925 696 876 8608
9613 8608 10583 11283 11890 12902 10963 8129 10365 12946 11447 3242 560 2289 -2365 -7157 -2695
9598 -2695 1155 2058 -1779 -3448 94 7893 10278 10094 10269 10811 11776 12574 3171 -4702 -4816 -3246 3171
9581 3171 8213 8555 8796 12566 12590 22536 20836 13801 14417 14959 4497 64 2423 142 -3104 3417
9565 3417 5901 1581 -4534 -5743 -2379 2931 9808 17885 17669 14326 14327 17038 16521 11889 4133 -2113
9549 -2113 4980 5299 -2728 -5603 -295 2415 2597 1135 2696 2814 3257 -391 1364 -4352 764 5875
9533E875m29j709j165j217l827j13K207P940K866l861R24O267q279j2551o225
9518a3297k547K944M763J798L059J93N351j511r188N991Q026K642j605o572n302
9503e255N119j520K724N866K343L044j826k806K06K111l244M39K717k32l250j438
9487D998q72Q973m68n224o047k898k509j39N612j336k197j76M744k571l892l322
9471g324M076M045J930O31K578O485p930O339j062n793n192p357j383L370P393
9456H06Q820L888N57n304k997p724J094o751n763M557O665P201J734J745k530
9441E998o767m742l03R04J159Q287J417o53K25n55l558l274P775P079o698j044
9425E250L697k823o350p358j526P37j564j175P519J438J436K578J824K228k315
$$ plain form
9533 5875 5446 3737 2572 1355 -2472 -2585 -378 7562 10428 6567 7491 13758 5479 -7072 -13297
9518 -13297 -15844 -12900 -8137 -6339 -3280 -3087 2264 753 -8435 -2444 5582 8224 6619 47 -5255
9503 -5255 -136 -1656 1068 6934 9277 12321 10495 7689 7895 10006 6762 7201 9918 9686 6436 4998
9487 4998 4126 13099 12631 7407 1360 -1538 -4047 -4186 1426 90 -2107 -2283 2461 -110 -4002 -7324
9471 -7324 -3248 797 2727 3358 5936 12421 4491 10830 9768 3975 -1217 -8574 -9957 -6587 806
9456 806 9626 13514 14071 8767 5770 -1954 -860 -7611 -13374 -8817 -2152 5049 6783 8528 5998
9441 5998 -769 -5511 -5814 -4910 -3751 4536 5953 5300 5525 4970 1412 -1862 5913 12992 6294 5250
9425 5250 8947 6124 -226 -7584 -9110 -8373 -9937 -11112 -3593 -2155 -719 1859 3683 5911 3596
9410C596j879J933j649M61m44N5P87M676l37m217J396J911o936l424R027N749
9394A0705J393j554J136m033J077o985m162j995j987J2184n16N600R19J212j013
9379A1981r176k327J337O106n536m038l293k54L031K649n85K162n09J932l626
9364a46Q66M924k792o36K139J690m249P241K47m501K690N243M90K968J788o599
9348A1363p123j2967j74J040M310q42M055Q700J194l089m990M216j214k533m660
9333b714K761K489j860J578M446m263j0671j23J847p07L158J0341l430K655J081
9318F588k036J047R16J004P30j237l609M055k299m487Q38M064n089l059Q082l210
9302B298J104j210O336m510p150l436j250m46M238N569M566K468N747J493m821
$$ plain form
9410 3596 1717 3650 2001 2462 2018 2073 2860 7536 7199 2982 4378 6289 -647 -4071 4956 10705
9394 10705 12098 10544 11680 7647 8724 1739 -2423 -4418 -6405 5779 5263 10863 11782 12994 11981
9379 11981 2805 478 1815 7921 2385 -1653 -4946 -5200 -2169 480 -105 2057 1548 3480 -146
9364 -146 720 5644 2852 2216 4355 6045 1796 9037 9284 4783 7473 12716 13206 16174 17962 11363
9348 11363 4240 -8727 -8901 -7861 -3551 -4393 -338 8362 9556 6467 1477 5693 4479 1946 -2714
9333 -2714 47 2536 676 2254 6700 2437 -8234 -8357 -6510 -7217 -4059 6282 2852 5507 6588
9318 6588 4552 5599 6515 7519 8249 7012 3403 7458 5159 672 1510 5574 485 -2574 5508 2298
9302 2298 3402 2192 8528 4018 -3132 -6568 -7818 -8264 -4026 1543 6109 8577 14324 15817 10996
9287A0996J579k555r886O882n183q187K744m651N552N962K718P518o415J92M433
9272A1699m63o359J109n961n686P891L348K957O97k634K981J550K289m366o931
9257B121m766K547J305j143P36k405L26N979L420j869j382O60M565Q69o055j586
9241C322K426j167m728n471M713P694m226N301N208k783L41m671N751J969n795
9226G884K326K490J506j371j859J436j001M400p05k332m02N241l150M007j026
9211A7444q975n45m4j318M887N189O96j969k105k830j041K956J590M50R2K341
9195A6818l8Q814K516l699m143j137K325k93K314Q05O77P351L901n805m088P111
9179C3429M649Q59L822L693K188R132N604R62L334N669O204P875J2640J3909J8137
$$ plain form
9287 10996 12575 10020 134 7016 1833 -6354 -3610 -8261 -2709 3253 5971 13489 7074 7266 11699
9272 11699 11236 4877 5986 25 -5661 2230 5578 8535 9232 6598 9579 11129 13418 9052 2121
9257 2121 -2645 -98 1207 64 800 -1605 -1279 4700 8120 6251 4869 5529 10094 10963 4908 3322
9241 3322 5748 4581 -147 -5618 -905 6789 2563 7864 13072 10289 10630 5959 11710 13679 7884
9226 7884 10210 12700 14206 12835 10976 12412 11411 15811 15106 12774 12372 17613 14463 18470 17444
9211 17444 8469 7924 7880 6562 11449 16638 17334 15365 13260 10430 9389 12345 13935 14385 14477 16818
9195 16818 16780 25594 28110 24411 20268 19131 21456 21163 23477 24282 24959 32310 36211 30406 26318 33429
9179 33429 38078 38937 42759 46452 48640 57772 63376 64338 67672 73341 79545 87420 100060 113969 132106
9164A32106K0249K6406L1785K6560M5099O3012R0648J22153J69473K49229L95432
9153A372152N96405Q27589R94152Q49877N4805q96416j103214q20082n27657l46230
9143A001381k36091j61492j12072q6136o3734n5791l4039k6231k4029k0999k0433
9132A60334k1688j3375j2412r538k210j0906j9858j0768n983m127m309J019L978
9119E0157l454j272j43m307n195q52K434j561l066m958O773L181l855J458k849
9104C2491j372k5j722o886l757K735K596l654q145p978n982K21J80P449L647l398
9088F400O66K399P877N46l672j182K126K685n24j300Q828l935p392m389l99P72
9072I506M626Q11M883j809p63o195l425N74O078J768j0094N06L098q107n999Q229
$$ plain form
9164 132106 152355 178761 210546 237106 282205 345217 435865 558018 727491 976720 1372152
9153 1372152 1968557 2796146 3790298 4640175 4694980 3798564 2695350 1875268 1347611 1001381
9143 1001381 765290 603798 491726 405590 341856 286065 252026 225795 201766 180767 160334
9132 160334 138646 125271 112859 103321 101111 90205 70347 59579 53596 49469 45160 46179 50157
9119 50157 46703 45431 45288 40981 35786 34934 37368 35807 32741 27783 34556 37737 33882 35340 32491
9104 32491 31119 31094 29372 22486 18729 21464 24060 20406 12261 4283 -1699 -1478 -1298 6151 9798 6400
9088 6400 7066 9465 17342 17888 14216 13034 15160 17845 17321 16021 24849 20914 13522 9133 8734 9506
9072 9506 14132 14943 19826 18017 17254 11059 7634 8208 14286 16054 5960 6466 9564 1457 -4542 3687
9056C687N581L331o598n034k409K314N494l78J645K503L055M819l190m342M627
9041A5105k309l989k846j1624K184k142k142K832L249M887J1146L166l781n40
9027A3196m883m134J582J603j394n883l520K674N703L757J48J440m6p45j626j16
9011G756k456J409m792l228K821o098L190l855M751N889n543M075N116l231m267
8996A537l015j083L044j351J943J547o665m231M53J357M385L533K137J820p322
8981a911q511k13L642M235j99j418M960M033J31K069M026K626l000o96j234J794
8965A0334l845k741P22J117K414O61L717J751q932l365Q16l9L848j073k749n635
8949b999l971k010R173K771l193k365q03k454Q429R795n728o155r557J723J0012
$$ plain form
9056 3687 9268 12599 6001 967 -1442 872 6366 5988 7633 10136 13191 18010 14820 10478 15105
9041 15105 12796 8807 5961 -5663 -3479 -5621 -7763 -4931 -1682 3205 14351 17517 13736 13196
9027 13196 8313 4179 5761 7364 5970 87 -3433 -759 4944 8701 8849 10289 10243 9498 7872 7756
9011 7756 5300 6709 1917 -1311 1510 -4588 -1398 -5253 -502 5387 -156 3919 9035 5804 1537
8996 1537 -1478 -2561 483 -868 1075 2622 -4043 -8274 -7821 -6464 -2079 1454 3591 5411 -1911
8981 -1911 -10422 -10635 -6993 -2758 -2957 -4375 585 4618 4749 6818 10844 13470 10470 9774 8540 10334
8965 10334 6489 3748 4470 5587 8001 8662 12379 14130 5198 1833 2649 2610 6458 5385 2636 -2999
8949 -2999 -6970 -8980 193 2964 -229 -2594 -3397 -5851 2578 12373 6645 490 -9067 -7344 2668
8934B668K356j731l716P58l336L064J337J718P057K761p426o25M339K138j0961
8919D01o60o17P099M42m465P6J277N532k627p097p56L818N21J516L882N98j375
8902G565k331m059P02L772K596M937N842L60o079n931l960j468k338k767l643
8887f802l83O633O919J379J573p048k516j06J221K72m388j00n65o638L580J5135
8871H166O252p500K63J248r075p73j379l834J726K600O249j925L503o180K59l538
8855c938J493L311L58J074O7K240L264k27j497j577j267o555o392L868J5173M307
8839A3702m257m115N282n00m097j0183p96M580k660k881K11P207K974k412M288
8824F343m714m959L028N648P610l541p322k502p73l375r93q41l074k078O06N300
$$ plain form
8934 2668 5024 3293 -423 335 -3001 63 1400 3118 10175 12936 5510 4885 9224 11362 401
8919 401 -259 -876 6223 6665 2200 2276 3553 9085 6458 -639 -1395 2423 2944 4460 8342 8940 7565
8902 7565 5234 1175 1877 5649 8245 13182 19024 19384 13305 7374 3414 1946 -392 -3159 -6802
8887 -6802 -7185 -552 6367 7746 9319 2271 -245 -351 870 1142 -3246 -3346 -3911 -10549 -6969 8166
8871 8166 14418 6918 7181 8429 -646 -1419 -2798 -6632 -4906 -2306 3943 2018 5521 -659 -400 -3938
8855 -3938 -2445 866 1224 2298 2365 4605 7869 7642 6145 4568 3301 -3254 -9646 -5778 9395 13702
8839 13702 9445 5330 10612 10112 6015 -4168 -4964 -384 -3044 -5925 -5714 1493 4467 2055 6343
8824 6343 1629 -3330 -302 5346 12956 9415 2093 -409 -1182 -4557 -5550 -6391 -9465 -11543 -10937 -5637
8808e637N857N868j718L32j989K16K907N273p235q157J577P316m065K637M257
8793G439K69J658J086k101k064m669r545L052k348L159J035k317m161N344O035
8778A872j553K497k084n004P99M261L612m153K951j63J586J426l285M250N612
8763A2624j421j694j728l039n042K223k056j207K262l217O99k702n377K443O007
8748a225j165j321K294j768M389M292k726p18j138K82j66P310K047q522k366K628
8732B127m517K565J0170J764r439n520M16L108O94m328J701q27K828K723l628
8717a63o648m00j587o348k336K126N144M203k719k670K456k722P906L451q37L747
8701B603K66j436j354K072j01k919J1704L344L73J402m48J34q987q657M083J023
$$ plain form
8808 -5637 220 6088 4370 4702 2713 2929 5836 11109 3874 -4283 -2706 4610 545 3182 7439
8793 7439 7708 9366 10452 8351 6287 1618 -7927 -4875 -7223 -4064 -3029 -5346 -9507 -4163 1872
8778 1872 319 2816 732 -4272 -3473 788 4400 247 3198 3035 4621 6047 2762 7012 12624
8763 12624 11203 9509 7781 4742 -300 1923 -133 -1340 922 -2295 -1596 -4298 -9675 -7232 -1225
8748 -1225 -2390 -3711 -1417 -3185 1204 5496 2770 2052 914 1196 1030 8340 10387 1865 -501 2127
8732 2127 -2390 175 10345 12109 2670 -2850 -2434 674 1368 -2960 -1259 -2086 742 3465 -163
8717 -163 -6811 -7211 -8798 -15146 -17482 -15356 -10212 -6009 -8728 -11398 -8942 -11664 -3758 -307 -1144 2603
8701 2603 2869 1433 79 2151 2050 -869 10835 14179 14552 15954 15506 15640 6653 -2004 2079 3102
8685C102k134K711L546k879o544k629k778P058K821L618P05j149n7J767n095n170
8669c107L117L436L135l777M112J820o056k879n39K741j848m842k736k420O15
8654i228k356N037M193K350M87K98P62j678j654l580n222N164m27M899L517j351
8638A211Q454j585l524M224J272l63J493N806m381j0203r91L142j693J454L903
8623H219l326q506j040L179J138O634L022j650k380l458j711O979R700r38p733
8608H129j161j093m202l826m366j086l960j015J172O877p32Q222R205K05k193
8593A0176n444k903l77O24l000k786m450m76O108K470J1788K539j0821m672j69
8578a393M393L547j096k48N169p90o450k365n85J512K677m692p102M465N066L21
$$ plain form
8685 3102 968 3679 7225 4346 -2198 -4827 -7605 -547 2274 5892 6597 5448 5391 7158 2063 -3107
8669 -3107 10 3446 6581 2804 6916 8736 2680 -199 -738 2003 155 -4687 -7423 -9843 -9228
8654 -9228 -11584 -6547 -2354 -4 483 781 1543 -135 -1789 -5369 -10591 -5427 -5854 -955 2562 1211
8638 1211 9665 8080 4556 8780 10052 9689 11182 16988 12607 2404 1413 4555 2862 4316 8219
8623 8219 4893 -3613 -4653 -1474 -336 6298 9320 7670 5290 1832 121 7100 16800 15862 8129
8608 8129 6968 5875 1673 -2153 -6519 -7605 -11565 -12580 -11408 -4531 -5263 2959 12164 12369 10176
8593 10176 4732 1829 1452 2076 -924 -3710 -8160 -8636 -2528 -58 11730 14269 3448 -1224 -1393
8578 -1393 3000 6547 5451 5203 10372 9582 3132 767 182 1694 4371 -321 -7423 -2958 2108 2429
8562B429K236q076j630M367M606N0O0l532p866L242Q628R475J600n241N5l214
8546G189l043o705m075P445K568K377r3J859o03j1224l254l520K209M578j679
8531e971j773M531L951o8j062m398l98L487O82O482M260o715m373L380K910O374
8515A1299p325q34J51N008l886j749L81o187k85j450n891L046L335L784R706J595
8499A0698j904M7k25p37p414L550J18J173R22k681n212q19N917J1989k283o451
8483F688J92o604o36K467Q61P137L606k318k856n237M318R206l599k763o911j612
8467A939J400K946k154l81M017l123N230N640L797o794r775m299j951n059J131
8452g436O774O249j107J105k122N57j172p16j82j703M739R69p15k903l606l160
$$ plain form
8562 2429 4665 -3411 -5041 -674 3932 3982 4042 510 -7356 -4114 4514 13989 15589 10348 10403 7189
8546 7189 4146 -2559 -6634 811 3379 5756 5663 7522 6919 -4305 -7559 -11079 -8870 -4292 -5971
8531 -5971 -7744 -3213 738 670 -392 -4790 -5188 -1701 -1019 5463 9723 3008 -1365 2015 4925 11299
8515 11299 3974 3140 3291 8299 4413 2664 3045 -3142 -3427 -4877 -10768 -7722 -4387 -603 9103 10698
8499 10698 8794 8841 8616 7879 465 4015 4133 5306 6228 3547 -1665 -2484 3433 15422 13139 6688
8483 6688 6880 276 -360 2107 2968 10105 13711 11393 8537 3300 7618 16824 13225 10462 3551 1939
8467 1939 3339 6285 4131 3750 7767 4644 9874 15514 19311 12517 2742 -1557 -3508 -8567 -7436
8452 -7436 -662 5587 4480 5585 3463 4020 2848 2132 1950 247 4986 5955 5240 2337 -1269 -4429
8436d429J811L072j286N591M311j226j035N52K531k150j303J912p041k0r10o154
8420e774N441O490L73o386l170J888j541O332L481J188o57k862O675N998n225
8405A2251l397n241j142l680q36N208k92Mm488j946k307J72K764j108k370J58
8389f250m312j481M57L358K171l711j846j067M916j134J127R591M365l8L613N0
8373I809K996j870p29q09j878J796k555m868m54k236p750J421L009l497K955R695
8357E035K486m471n300L629j372L672j818o513q88M691j297l922k436L864Q135
8342C495L013l308J185j075L580j909J385k763q545l246J981M988N553J793L41
8327F468N26K781j401K64o7m312l941j759P331M793K254M115k44n907k77n790
$$ plain form
8436 -4429 -2618 454 -832 4759 9070 7844 6809 7361 9892 7742 6439 8351 1310 1290 380 -5774
8420 -5774 -333 6157 6530 144 -3026 -1138 -2679 3653 7134 8322 7665 4803 11478 17476 12251
8405 12251 8854 3613 2471 -1209 -2045 3163 2871 2875 -1613 -3559 -5866 -5694 -2930 -4038 -6408 -6250
8389 -6250 -10562 -12043 -11586 -8228 -6057 -9768 -11614 -12681 -7765 -8899 -7772 1819 6184 6146 9759 9809
8373 9809 12805 10935 10206 9397 7519 9315 6760 1892 1438 -798 -8548 -7127 -4118 -7615 -4660 5035
8357 5035 7521 3050 -2250 1379 7 3679 1861 -4652 -5540 -849 -2146 -6068 -8504 -4640 3495
8342 3495 6508 3200 4385 3310 6890 4981 6366 3603 -4942 -8188 -6207 -1219 4334 6127 6468
8327 6468 6994 9775 8374 8638 8571 4259 318 -1441 5890 10683 12937 17052 16808 10901 10624 4834
8311D834k962k082r71L5l948o03K635p04L027M500J130n90n187j689l24j304r477
8294a3680k284J962K34P125J706J272N241j059o603k279J075N323N650L87l96
8279C674j777p305j090O697M886k64k205m550k498L652J1198K93l624N015j308
8264A0794p529k761j650q665K520P324Q05k632j675K110K593r51J86R02n396k702
8248f727K237m492k685M958L991M129L802P45n219m976J0658M255n500l095K421
8233D502n531j628N086k756j395q47J104L074J511k060j899o460j332k339O293
8218d677N490m173k695M525j820n103P506n161n701N889K266R8J225o434l631
8203a2396Q616P120O064k751l696l598l269J77p949r52N917n72j306R408N074
$$ plain form
8311 4834 1872 -210 -1181 -1146 -5094 -5697 -3062 -3766 -739 3761 4891 4301 -886 -2575 -2899 -4203 -13680
8294 -13680 -15964 -14002 -13768 -6643 -4937 -3665 1576 517 -6086 -8365 -7290 -1967 3683 4070 3674
8279 3674 1897 -5408 -6498 199 5085 4821 2616 -1934 -4432 -780 10418 10711 7087 12102 10794
8264 10794 3265 504 -1146 -9811 -7291 33 838 -1794 -3469 -1359 1234 283 469 1371 -4025 -6727
8248 -6727 -4490 -8982 -11667 -6709 -2718 1411 5213 5958 739 -4237 6421 10676 5176 2081 4502
8233 4502 -1029 -2657 2429 -327 -1722 -2569 -1465 1609 3120 1060 -839 -7299 -8631 -10970 -4677
8218 -4677 813 -3360 -6055 -1530 -3350 -8453 -947 -6108 -11809 -5920 -3654 -3556 -2331 -8765 -12396
8203 -12396 -3780 3340 9404 6653 2957 -641 -3910 -3733 -11682 -12634 -6717 -7289 -8595 813 5887
8188E887k114m202n182K366k847J289Q44K708J1674M632m723m827l974n185m965
8173h619j5M260M961l03K190J44L969N55k191q872J100P265J619j159O109j246
8157I767k211j475o947j939L805Q965O48j630N576p98r521p306K725Q50J280p311
8141e522m626j23M873R360J03J48J446k173L12O225k880p029n725k605M226P920
8125C930Q589J981j6286p415K909J779J137l50K775O19k166N289j458r692M6K275
8109f038j932K351K89k61L89J500O40m962m086J586O471O929K899q44R90k078
8093C843J853j617o80K226N071p40r484l389K747P108M36j372j1814n499P54p04
8077a1261L804R171L404l702n371j407k567n64Q200J0052N60l773m16L751j901
$$ plain form
8188 5887 3773 -429 -5611 -3245 -6092 -4803 -3959 -1251 10423 15055 10332 5505 1531 -3654 -8619
8173 -8619 -8634 -4374 587 284 2474 2618 6587 7142 4951 -3921 -2821 4444 6063 4904 11013 9767
8157 9767 7556 6081 -866 -2805 1000 9965 10613 8983 14559 13761 4240 -3066 -341 509 1789 -5522
8141 -5522 -10148 -10271 -5398 3962 4065 4213 5659 3486 3798 10023 7143 114 -5611 -8216 -3990 3930
8125 3930 12519 14500 -1786 -9201 -6292 -4513 -3376 -3726 -951 -332 -2498 2791 1333 -8359 -8313 -6038
8109 -6038 -7970 -5619 -5330 -5591 -5202 -3702 -3062 -8024 -12110 -10524 -4053 2876 5775 4931 5921 3843
8093 3843 5696 4079 3399 5625 10696 9956 472 -2917 -170 6938 7374 6002 -5812 -11311 -10557 -11261
8077 -11261 -7457 1714 5118 1416 -3955 -5362 -7929 -8493 -293 9759 10319 6546 6130 9881 7980
8062G980j448m131J51j558M469K230l146l725n416l145M334M901K056r50j445
8047A157o632o731O22J887Q61L606L236l152L997K814n178O5M814k573N080K447
8031F320K617n221J124O692o735n835L844J925k496p66o039l413K430L903l305
8016d955l127J0824P273N753m368n609m331n647J33J734l152J479m801k845K303
8001i336K255M452K263n97n886l614M184q0L422K663Q170N332n336o306n237K02
7985c449O168O268n5p58J251j089J579k399m409l296k26r2k807K625N043M62o9
7968D747o817j950J575R323M217K978K799N45K91j1639p811j708L424K700M71
7953C145K474j862k766M350j375J75M163j270o090j811M523L171M10N405k658
$$ plain form
8062 7980 6532 2401 2552 994 5463 7693 4547 822 -4594 -7739 -3405 1496 3552 2602 1157
8047 1157 -5475 -12206 -11584 -9697 -8836 -5230 -1994 -5146 -1149 1665 -3513 -3448 1366 -1207 3873 6320
8031 6320 8937 3716 4840 11532 4797 -1038 2806 4731 2235 1469 -4570 -7983 -5553 -1650 -4955
8016 -4955 -8082 2742 10015 15768 11400 5791 1460 -4187 -4054 -2320 -5472 -3993 -8794 -11639 -9336
8001 -9336 -7081 -2629 -366 -963 -6849 -10463 -6279 -6359 -2937 -274 7896 13228 7892 1586 -3651 -3449
7985 -3449 2719 8987 8932 8174 9425 8336 9915 7516 3107 -189 -415 -507 -3314 -689 4354 4816 4747
7968 4747 -2070 -4020 -2445 6878 11095 14073 16872 17417 17708 6069 -1742 -3450 -26 2674 3145
7953 3145 5619 3757 991 5341 3966 4141 8304 7034 944 -867 3656 6827 7237 12642 9984
7938I984k149K743o297p88k053O524L158N883k164o137k106j787n37N35Q707P6
7922A3592M819n237m883K001n296m178O433J202p473k978k371M901J100Q81m567
7907b054m770k981K810J0142R67P502M172l887o140k099J274K066l943m202R97
7892a46K123q57j669J048K13J081n848k282L225l648K551O815O671p16J125J978
7876A1664o88o183j0434l200P225M187j632k225M325n623l688M074P945J688r180
7861a745o628P17J61J640L860m247J725M943J03l039k840n141j843M02J156k318
7845a3094L437M37O495M623l824J293N753M934L30K141K371o4q200k954q570n459
7829a0351M113m100K998O360N219n529j903O986j779O075O83m113L679K571m373
$$ plain form
7938 9984 7835 10578 4281 3493 1440 7964 11122 17005 14841 8704 6598 4811 4274 4809 13516 13592
7922 13592 18411 13174 8291 10292 4996 818 7251 8453 980 -1998 -4369 532 1632 2513 -2054
7907 -2054 -6824 -9805 -6995 3147 4114 11616 15788 11901 5761 3662 4936 7002 3059 -1143 -146
7892 -146 1977 1120 -549 499 712 1793 -4055 -6337 -3112 -6760 -4209 2606 9277 8561 9686 11664
7876 11664 10976 4793 -5641 -8841 -1616 2571 939 -1286 3039 -2584 -6272 -2198 5747 7435 -1745
7861 -1745 -8373 -7656 -7495 -5855 -1995 -6242 -4517 426 529 -2510 -5350 -10491 -12334 -11932 -10776 -13094
7845 -13094 -9657 -9220 -2725 1898 -1926 -633 5120 10054 10384 12525 14896 14832 6632 3678 -4892 -10351
7829 -10351 -6238 -10338 -7340 -980 4239 -1290 -3193 3793 2014 8089 8772 4659 8338 10909 6536
7814F536q712l128J201O363L097o207n168P00K089O727M928m500m385J686l238
7799b011q82M922N224l453l448l192K828Q80O13j315K248K976l281j326M547q57
7783D473j451L715K010q588M162k67m795l238J580l309j133J416K920L555l118
7768b068M444l814l64l886p274J986N930O494M246l767j192J886j551O300j21
7753G249o672r24l708k30N69K971J925r87J92j694M43k99L589N121k195K377q91
7736F836m568m595n577M926P09k68l228K288M347Q68k247j924N544J176J329M064
7720I680J170m700k668k037l154k94P64q307k051L259j678J386j598q56O30N403
7704e051M290r52p225k008O65J066N171Q059L532m975q20q860l431J761K670m903
$$ plain form
7814 6536 -2176 -5304 -4103 2260 5357 -850 -6018 -5318 -3229 3498 8426 3926 -459 1227 -2011
7799 -2011 -2893 2029 7253 3800 352 -2840 -12 868 1481 166 2414 5390 2109 783 5330 4473
7783 4473 3022 6737 8747 159 4321 4054 -741 -3979 -2399 -5708 -6841 -5425 -2505 1050 -2068
7768 -2068 2376 -1438 -1802 -5688 -12962 -10976 -5046 1448 5694 1927 735 2621 1070 7370 7249
7753 7249 577 -347 -4055 -4285 -3716 -745 1180 193 385 -1309 -866 -1165 2424 7545 5350 7727 6836
7736 6836 2268 -2327 -7904 -2978 -2269 -2537 -5765 -3477 870 1738 -509 -2433 3111 4287 5616 9680
7720 9680 10850 6150 3482 1445 -1709 -2003 -1239 -9546 -11597 -8338 -10016 -8630 -10228 -11084 -10454 -5051
7704 -5051 -761 -1713 -8938 -10946 -10281 -9215 -4044 4015 7547 2572 1752 -7108 -10539 -8778 -6108 -11011
7688a1011j431P907R087Q010j582k210o076q535j560N66p26j367j654J505J433
7673g644J0499J894m706J203o747k670J160K288O043L797r76l839o940k373M647
7658d364j822k447J948k243o03N174N957m316K25j248m063k775L561P761L397
7643D142o701J334M200m273j586j386J947M99N27k001l633L695K672K791m555
7628b328l339l392J9m793J355K521J0263P880n578l532N496R87j6N89l928m446
7612b242j527M218K464o184J118Q387M511j203n317Q07J856l8k217K486N73o547
7596A145m842M443j400L239K795q770j795J951j077j932r45N544K421l158J047
7581a334P018M785m987n401K77p80n094k418K155L593R891k23m387k923L030O557
$$ plain form
7688 -11011 -12442 -4535 4552 12562 10980 8770 2694 -5841 -7401 -6835 -7561 -8928 -10582 -9077 -7644
7673 -7644 2855 4749 43 1246 -5501 -8171 -7011 -4723 1320 5117 4141 302 -6638 -9011 -4364
7658 -4364 -6186 -8633 -6685 -8928 -9531 -4357 1600 -2716 -2491 -3739 -7802 -10577 -7016 745 4142
7643 4142 -2559 -1225 2975 -1298 -2884 -4270 -2323 -1824 -1297 -3298 -6931 -3236 -564 2227 -2328
7628 -2328 -5667 -9059 -9040 -13833 -12478 -9957 306 8186 2608 -924 4572 5559 5543 6132 2204 -2242
7612 -2242 -3769 449 2913 -3271 -2153 6234 10745 9542 4225 5032 6888 6850 4633 7119 7692 1145
7596 1145 -3697 746 -654 2585 5380 -3390 -5185 -3234 -4311 -6243 -7188 -1644 777 -2381 -1334
7581 -1334 5684 10469 5482 81 358 -422 -5516 -7934 -5779 -2186 7705 7482 3095 172 3202 9759
7565I759j528j744l13N456o367q156L668j158O201n507j0589M023L291k932j058
7550f954M351O03L374k251m139k646q88o273R979L240K429K854n055n202k495
7535i073Q430K807p473RL375J943k589k408m695j414K384m92k694n443M351Q928
7519d054K006K032q455m295m081J614L671Q816N744j0502j051P877l90J623q82
7504c27m523M141j404Q4Q300n21m843n468q14l672l589M348R336R077j501j744
7488F880j845j935j125k177r202k177M528O226Q858K821k708n451P35L279r776
7473c069O5Q01j039l858M165N427J654j283m598M472M228k296l031k788O171N222
7457A0243o407j384m546p85L506q281j860L273M725M756P97O03o0j688l306m316
$$ plain form
7565 9759 8231 6487 6174 11630 5263 -2893 775 -383 5818 311 -10278 -6255 -2964 -5896 -6954
7550 -6954 -2603 -2000 1374 -877 -5016 -7662 -8550 -14823 -4844 -1604 825 3679 -1376 -6578 -9073
7535 -9073 -643 2164 -5309 -5300 -1925 18 -2571 -4979 -9674 -11088 -8704 -9196 -11890 -17333 -12982 -4054
7519 -4054 -2048 -16 -8471 -12766 -16847 -15233 -11562 -2746 2998 -7504 -8555 -678 -1068 555 -327
7504 -327 -4850 -709 -2113 -2029 6271 5750 907 -4561 -5375 -9047 -12636 -8288 1048 10125 8624 6880
7488 6880 5035 3100 1975 -202 -9404 -11581 -7053 -827 8031 10852 8144 2693 3428 6707 -3069
7473 -3069 -3004 -2203 -3242 -7100 -2935 2492 4146 2863 -1735 2737 6965 4669 1638 -1150 5021 10243
7457 10243 3836 2452 -2094 -2879 627 -7654 -9514 -6241 -1516 3240 4037 4640 4580 2892 -414 -4730
7441d730k409j171P217P848N222l410M91q206l718L111j551l491K524o10n294
7426h177n077L804N996Q546J251K413k485o029K233l700n537O97N349N435M485
7411I204m576k823l728j468K715O141K076l054o732o49K44K660j071J553m901
7396d409l249O970O88O952n29o958k386j08J330J17J788l847j747M10l980L14
7380h644J677M782n89m579R74M57l93K177O114j946L3J0176j97m606k819M391
7364G008q30l461o302M547M223k705j35m388K123k681o552o83J950J449q24O870
7348c91M904j458J499j706R69L864n022l812p220J813j47n080l401k096L239M74
7332a3571L360K447q17N150K853k627p194k553K240P721L836k433j667Q860J2334
$$ plain form
7441 -4730 -7139 -8310 -1093 6755 11977 8567 9058 852 -2866 245 -1306 -4797 -2273 -2883 -8177
7426 -8177 -13254 -9450 -3454 5092 6343 8756 6271 242 2475 -1225 -6762 -6065 -716 4719 9204
7411 9204 4628 1805 -1923 -3391 -676 5465 7541 4487 -2245 -2894 -2650 10 -1061 492 -4409
7396 -4409 -7658 -688 0 6952 6423 -535 -2921 -3029 -1699 -1582 206 -3641 -5388 -4978 -8958 -8644
7380 -8644 -6967 -2185 -2774 -7353 -6379 -5922 -6315 -4138 1976 30 63 10239 10042 5436 2617 7008
7364 7008 6178 2717 -3585 962 5185 2480 2345 -2043 80 -2601 -9153 -9836 -7886 -6437 -7261 -391
7348 -391 4513 3055 4554 2848 3817 7681 2659 -1153 -8373 -6560 -6707 -11787 -15188 -17284 -14045 -13571
7332 -13571 -10211 -7764 -8581 -3431 -578 -3205 -10399 -12952 -10712 -2991 845 -1588 -3255 5605 17939
7317A7939m865p615m110p309j78L408O064k10K08L045N228j3522j1125m984J015
7302a7011N832R268K068m6L665L859l241p178p128J659M675k567R515j768k721
7287a119m192m357K047K773J620l757o45j871L60L56P125L287l030j165k92j105
7271c965K022K017j111n507m260j839J102k31j1M908K862k054n637l511K744J3117
7255F46o00m289J783k104O694K381p645l627M066N336K171O24J176k390m428o258
7239f464k641N352j485L679j949K622L350N34M378k078K062K212J244L6m421j678
7223D753M149q63n151m604Q77r22Q135l34n829o175K024K827N509l948p981r52
7207h485O492K748K220M257K916j0091k079J125L757r600l432R147L550m080j232
$$ plain form
7317 17939 13074 5459 1349 -5960 -6138 -2730 3334 3124 3332 6377 11605 -1917 -13042 -18026 -17011
7302 -17011 -11179 -1911 157 111 3776 7635 4394 -2784 -9912 -8253 -3578 -6145 3370 1602 -1119
7287 -1119 -5311 -9668 -7621 -4848 -3228 -6985 -7630 -9501 -9141 -8785 -1660 1627 -1403 -2568 -2860 -3965
7271 -3965 -1943 74 -1037 -6544 -10804 -12643 -11541 -11772 -11783 -6875 -4013 -6067 -11704 -15215 -12471 646
7255 646 46 -4243 -2460 -4564 2130 4511 -3134 -6761 -2695 2641 4812 5436 6612 4222 -206 -6464
7239 -6464 -9105 -3753 -5238 -1559 -3508 -886 2464 2998 7376 5298 7360 9572 10816 10852 6431 4753
7223 4753 8902 8039 2888 -1716 -839 -1761 6374 6040 211 -5964 -3940 -1113 4396 448 -7533 -8485
7207 -8485 -1993 755 2975 7232 10148 57 -2022 -897 2860 -6740 -10172 -1025 2525 -1555 -2787
7192b787o532k825R537J894p499n631N397M780R67O330m777M09J542P641P31k360
7176F817m853r709m398M6L977K118j728Q344k086j121M907J040k297L870N359
7161A0286J853p417p893r13J457k783j183K440K496M361m628K225M310k743l305
7146a437N124k939j528K677k42R821N162j096l879k61m910j1776k185M418J878
7131a173R15k92J90K582K996m374k508J261J382l485m717P033Q49k55m404l701
7115g701o27M666L538n576n63N461L110K393K130K50m738r47j288m668K722n111
7099f949n244L944J983L515K307l181l815n88N23J633M739M68n395k313L141K054
7083c178m496J585K566J130j729j85j973o11J748Q28M457j923n045N011K53k620
$$ plain form
7192 -2787 -9319 -12144 -2607 -713 -8212 -13843 -8446 -3666 -2699 3631 -1146 -737 805 8446 9177 6817
7176 6817 1964 -7745 -12143 -12097 -8120 -6002 -7730 614 -1472 -2593 2314 3354 1057 4927 10286
7161 10286 12139 4722 -3171 -4084 -2627 -5410 -6593 -4153 -1657 2704 -1924 301 4611 1868 -1437
7146 -1437 3687 748 -780 1897 1655 11476 16638 15542 11663 11402 6492 -5284 -7469 -3051 -1173
7131 -1173 -258 -550 -360 2222 5218 844 -1664 -403 979 -2506 -7223 -190 659 404 -4000 -7701
7115 -7701 -8328 -3662 -124 -5700 -6263 -802 2308 4701 6831 7081 2343 1396 108 -4560 -1838 -6949
7099 -6949 -12193 -8249 -6266 -2751 -444 -3625 -7440 -8028 -7505 -5872 -1133 -665 -6060 -8373 -5232 -3178
7083 -3178 -7674 -6089 -3523 -2393 -4122 -4307 -6280 -6891 -5143 -4315 142 -1781 -6826 -1815 -1562 -4182
7067d182K011O953M043k006K431j779q603m06J0615k169j300m11j2113j0127n19
7052a7562N546j874J0804R114l748L821M516n351p037n0l40J2406M551o236M540
7037A3100R92o186M782k521k911m857p447J534m980j938k432m02M666M364j320
7022e556K698K856j939m333M849j725J456P35m996L807J204J079q6k727j688L31
7006d035M57p397m369N142M545m044P50R614o77K625m47q381j991l973K707J570
6990g904J364R76L148O970M212l135m773o082k835R462P912j785L890K252J116
6975A4788q901j648K530K492m18P01N584q719p177J806Q028M571k508j1268r55
6960a094j62j100j370p66l836J236J1370N876k414n860k21n178n367O081J301
$$ plain form
7067 -4182 -2171 4782 8825 6819 9250 7471 -1132 -1538 9077 6908 5608 5197 -6916 -17043 -17562
7052 -17562 -12016 -13890 -3086 6028 2280 6101 10617 5266 -1771 -1821 -2161 10245 14796 8560 13100
7037 13100 14092 7906 12688 10167 7256 2399 -5048 -3514 -8494 -10432 -12864 -13266 -8600 -4236 -5556
7022 -5556 -2858 -2 -1941 -6274 -1425 -3150 -1694 -959 -5955 -2148 -944 135 49 -2678 -4366 -4035
7006 -4035 -3578 -10975 -15344 -10202 -5657 -9701 -8951 663 -14 2611 2164 -6217 -8208 -12181 -9474 -7904
6990 -7904 -6540 -5564 -2416 4554 8766 5631 858 -5224 -8059 1403 9315 7530 11420 13672 14788
6975 14788 5887 4239 6769 9261 8843 9544 15128 6409 -768 1038 9066 13637 11129 -139 -1094
6960 -1094 -1256 -2356 -3726 -4492 -8328 -7092 4278 10154 7740 1880 1659 -3519 -8886 -2805 -1504
6945a504K543L840j0788l74J139m56q454M1R667Q803j039l868l685q5K562N130
6929C472m288o443L755O679L323K311L430j743k954M181J32q374q568q450o70
6914a4207Q861K774P24K954j842M10J125M926l231l291M175M329o965q43P927
6899G826M364j2332N79M442N242n116N98K996p070q289K203K060J864k241m67
6884c341J992n789k458K003k692O891J758l907L310L13J868N51j521l717q63N070
6868e32j598l760J381K179m587J698N757l796p137O969K470l898o985m721J387
6853a5173Q638N503L893M61l497o158o385k4K621J0503Q5j734K209k497k251k951
6837f757j853J779L054k457j320m276j527M237N736L464N049O391j2910q869J720
$$ plain form
6945 -1504 1039 4879 -5909 -6283 -5144 -5600 -14054 -14013 -4346 4457 3418 -450 -4135 -4220 -1658 3472
6929 3472 -816 -7259 -3504 3175 6498 8809 12239 10496 7542 11723 11855 3481 -5087 -13537 -14207
6914 -14207 -5346 -2572 -1848 1106 -736 -326 799 5725 2494 -797 3378 7707 742 -101 7826
6899 7826 12190 -142 437 4879 10121 5005 5603 8599 1529 -6760 -4557 -2497 -633 -2874 -3341
6884 -3341 -1349 -7138 -9596 -7593 -10285 -3394 -1636 -5543 -2233 -1920 -52 499 -1022 -4739 -5602 -532
6868 -532 -2130 -5890 -4509 -2330 -6917 -5219 538 -3258 -10395 -3426 -956 -4854 -11839 -16560 -15173
6853 -15173 -6535 -1032 2861 3322 -175 -6333 -12718 -12742 -10121 382 467 -1267 942 -1555 -3806 -6757
6837 -6757 -8610 -6831 -3777 -6234 -7554 -11830 -13357 -9120 -3384 80 5129 11520 -1390 -10259 -8539
6822h539J111L099l952L579Q5k644j301O578L852K682j515l027p723m111O956
6807d870M929M162L550L38J427n88m174m14j961q670J016Q611k547J892k534p708
6791g541k791M677Q460l037l307R129m22J603L894o824K293j753R71L907j860
6776G399o734m214N91J882K382n62o384l228J890L904n315J481R984k448o256
6761e628j239l391o81K432J7R818j96K65k003J786n618q71K862O464k622j284
6745A11k53j076R199M67l993q78m665n625L623N335L819N67k375l583n72l355
6729c254j565M148M330M440k560n022K394k03j063P534L953m681J956l015n165
6714B227l136j169k618l047N46N776M19k754Q00J468L41j76N83M177m133n951
$$ plain form
6822 -8539 -7428 -4329 -8281 -4702 -4617 -7261 -8562 -1984 1868 4550 3035 8 -7715 -11826 -4870
6807 -4870 59 4221 7771 8109 9536 8948 4774 4360 2399 -6271 -5255 3356 809 2701 167 -7541
6791 -7541 -10332 -5655 2805 -232 -3539 5590 5168 6771 10665 3841 6134 4381 5352 9259 7399
6776 7399 665 -3549 -2958 -1076 1306 744 -5640 -8868 -6978 -3074 -8389 -6908 3076 628 -5628
6761 -5628 -6867 -10258 -10939 -8507 -8490 1328 1132 1397 -606 1180 -4438 -5309 -2447 4017 1395 111
6745 111 -142 -1218 7981 8448 4455 3577 -1088 -6713 -3090 2245 6064 6631 4256 673 101 -3254
6729 -3254 -4819 -671 3659 8099 5539 517 2911 2708 1645 9179 13132 8451 10407 7392 2227
6714 2227 -909 -2078 -4696 -7743 -7197 -1421 -1002 -3756 -2956 -1488 -1147 -1323 -740 3437 -696 -6647
6698f647M902M14K1O820J570q824r806K043M219j849j359o090L450P759j172k973
6682g522O06P168J932r658o247J36P79K641k1L086J1200L208o70j1032L585N000
6666D191m044n607k822R061N247k328P69k548R16k109Q42m035o898M368K513L105
6650F21J482l68l010j1295r41L864J989j233N63k193j16K050J081L521N698J699
6634C412p00m337j987L822k759p933o96q83L425L439k419J261N04p62k748k98
6618i659j870M284Q741M2L661m277k308j431L12N06l6J597m959m533L426J459
6602e045k905M180L628O073M294Q39j757j439o641k181P87J513O071M399j533
6587A0283m403j18R95R75p587k223K730p62k781k526L832q41o615J181L273M686
$$ plain form
6698 -6647 -1745 -1331 -1310 5510 7080 -1744 -11550 -9507 -5288 -7137 -8496 -14586 -11136 -3377 -4549 -7522
6682 -7522 -6916 252 2184 -7474 -13721 -13585 -12806 -10165 -10186 -7100 4100 7308 6638 -4394 -809 4191
6666 4191 147 -5460 -8282 779 6026 3698 4467 1919 2835 726 1568 -2467 -9365 -4997 -2484 621
6650 621 2103 1735 -1275 -12570 -13511 -9647 -7658 -8891 -8328 -10521 -10637 -8587 -7506 -3985 1713 3412
6634 3412 2712 -1625 -3612 210 -2549 -10482 -11178 -12061 -8636 -5197 -7616 -6355 -5851 -6613 -9361 -9659
6618 -9659 -11529 -7245 1496 1538 5199 922 -1386 -2817 -2505 -1999 -2035 -438 -5397 -9930 -6504 -5045
6602 -5045 -7950 -3770 -142 5931 10225 11064 9307 7868 1227 -954 -167 1346 7417 11816 10283
6587 10283 5880 5762 6757 7732 145 -2078 652 -110 -2891 -5417 -1585 -2426 -9041 -7860 -4587 99
6571I9k120m73j046J068P026n27m209l618k139l25N792J221N998P90q828q811
6555a0102Q70j838J499P068m911n702m198P738L825N064j691k840O513L072q239
6540c872p196P907L128l386l506k767L010k546l118P35P581J987n331P065k679
6525b988j974R19J84l86j57k295k451O239P275K860l39j746K215n309l129J147
6509F5n598J782L689K661l947j978M102M08K309L28j009N639j088q228L675J420
6493D230o014k292n695K824L780K729j634N98O92m00k432o290q06O765O831o06
6477B280k928l797o613K515n06k610O172Q37n114k233N132K651q15k13R27L772
6461e43m921m438M441K486l223K080N056Q23n932l761P168l141m589R654L777
$$ plain form
6571 99 -2021 -2494 -3540 -2472 4554 4027 -182 -3800 -5939 -6264 -472 749 6747 7537 -1291 -10102
6555 -10102 -9232 -11070 -9571 -2503 -7414 -13116 -17314 -9576 -5751 -687 -2378 -5218 1295 4367 -3872
6540 -3872 -11068 -3161 -33 -3419 -6925 -9692 -6682 -9228 -12346 -11611 -4030 -2043 -7374 -309 -2988
6525 -2988 -4962 -4043 -3859 -4245 -4402 -6697 -9148 -2909 4366 7226 6887 5141 7356 2047 -1082 65
6509 65 -5533 -3751 -62 2599 -1348 -3326 776 1184 3493 3821 2812 8451 7363 -865 2810 4230
6493 4230 -1784 -4076 -9771 -6947 -3167 -438 -2072 -1474 -782 -1182 -3614 -9904 -10710 -3945 2886 2280
6477 2280 -648 -4445 -11058 -8543 -9049 -11659 -5487 -4650 -9764 -11997 -6865 -4214 -5029 -5242 -4315 -543
6461 -543 -5464 -9902 -5461 -2975 -6198 -4118 938 1761 -4171 -7932 -764 -3905 -8494 1160 4937
6446D937M817k416R3n05k154l672L441l814p646L939k83n794k653M497R127Q671
6430A0585k890l105j332k378j065M713r51m524N3N114L262k560l639n459n69l335
6414h080o305M762K58j66k17n296K165N488P619Q017L612n096l950p015m950O380
6398b774Q770l655o515q83L925j375J135j802N713l283l971L213l180l842p69
6383i293M41K641M791n55O276L09M16j814l781j699k337j72K988N098j414j501
6367C94Q563L639n912p345p299L024O25O0N189O300M204p397o85N433K050Q444
6351A9287q930o645K897o504p094N148N675l897o79J474l487k824j525r01L545
6336d460m72r94L659M440m465q446j789p558Q92Q605P73o69J704R5Q295P174P64
$$ plain form
6446 4937 9754 7338 7431 6926 4772 1100 4541 727 -6919 -2980 -3263 -9057 -11710 -7213 1914 10585
6430 10585 7695 4590 3258 880 -185 4528 3577 -947 -894 4220 7482 4922 1283 -4176 -4745 -8080
6414 -8080 -14385 -9623 -9365 -9531 -9748 -15044 -12879 -7391 228 8245 11857 6761 2811 -4204 -9154 -2774
6398 -2774 5996 2341 -4174 -5057 -1132 -2507 -1372 -3174 2539 -744 -4715 -1502 -4682 -8524 -9293
6383 -9293 -8852 -6211 -1420 -1975 4301 4610 5026 3212 -569 -2268 -4605 -4777 -1789 3309 1895 394
6367 394 8957 12596 6684 -661 -7960 -4936 -4311 -4251 938 7238 11442 4045 3360 8793 10843 19287
6351 19287 10357 3712 6609 105 -6989 -1841 3834 -63 -742 732 -2755 -5579 -7104 -8005 -4460
6336 -4460 -4932 -5926 -2267 2173 -2292 -10738 -12527 -20085 -19193 -10588 -9815 -10484 -8780 -8685 -390 6784 7548
6319G548l06q002p493l488q802J639P766K896M020K148L73K360r50j670L054N165
6303F258p265m270J66j963j626j222P884N95n251M944J431l967K955L643m952
6288b640m806K842l96J562J125l986j148p3J690l395O83k256J596K11Q463J612
6272A084m337q46L330r41K55J420j493m21J952M834k998m411o99K278J298l492
6256c187o606r87m88J606n49k014L942K681k25L270J304n497m72M531N311n68
6240B052J553o40J549N367K802k001k062K939o261k294L729j217l047l476q875
6225i882o707L937N342J0013L749K638M717m290j0577N51K613j532J399m1J186
6210C116N603j624p704j2239L070J0272M531m082j473K962J380k128k623J804
$$ plain form
6319 7548 7242 -760 -8253 -11741 -20543 -18904 -11138 -8242 -4222 -2074 -1701 659 -291 -1961 1093 6258
6303 6258 -1007 -5277 -5111 -7074 -8700 -9922 -2038 -1443 -6694 -1750 -319 -4286 -1331 2312 -2640
6288 -2640 -7446 -4604 -5000 -3438 -2313 -6299 -7447 -7520 -5830 -9225 -8542 -10798 -9202 -8991 -528 1084
6272 1084 -3253 -4099 -769 -1710 -1455 -35 -1528 -1949 3 4837 1839 -2572 -3271 -993 305 -3187
6256 -3187 -9793 -10780 -11268 -9662 -10211 -12225 -8283 -5602 -5827 -2557 -1253 -6750 -7222 -2691 2620 2052
6240 2052 3605 2965 4514 9881 12683 10682 8620 11559 5298 3004 6733 5516 2469 -1007 -9882
6225 -9882 -16589 -12652 -7310 2703 6452 9090 13807 9517 -1060 -509 2104 572 1971 1930 3116
6210 3116 8719 7095 -609 -12848 -9778 494 5025 943 -530 2432 3812 1684 -939 865
6196H65J8p392J825j213q62J365L577k891l354k704k946K394P287O706M66l573
6180d32J95m421k015l39l011Q040M615j228m050M118K914j684J620l434q356j001
6164h469K830L439j702p161J639K561O365K620n497M38K853j270n033p191j57
6149a3735O838j209k115L733M501O83q43m61L1n254K073M332N79m15l749j995
6133g006O622l660l128p129O126K245L36l407L528J280J257m030J66O444M759
6118D403n061R14k25k11K242K924l869p359p14j872l12J452K752o80k994L348
6102e262n63l1P280O290L73K512k455k895j312N483k783j850l641m821j98k527
6086f400J003M209J348j084k511L571m405k811K894M44K065K488R90k408j00N96
$$ plain form
6196 865 883 -6509 -4684 -5897 -6759 -5394 -1817 -4708 -8062 -10766 -13712 -11318 -4031 2675 3141 -432
6180 -432 -237 -4658 -6673 -7012 -10023 -1983 2632 1404 -2646 1472 4386 2702 4322 888 -7468 -8469
6164 -8469 -5639 -2200 -3902 -11063 -9424 -6863 -498 2122 -3375 -2937 -84 -1354 -6387 -13578 -13735
6149 -13735 -6897 -8106 -10221 -6488 -1987 -1304 -2147 -2608 -2577 -7831 -5758 -1426 -847 -1262 -5011 -7006
6133 -7006 -384 -4044 -7172 -14301 -8175 -5930 -5594 -9001 -5473 -4193 -2936 -6966 -6800 -356 4403
6118 4403 -658 256 31 -180 2062 4986 1117 -6242 -6956 -8828 -9140 -7688 -4936 -5616 -8610 -5262
6102 -5262 -5825 -5856 1424 7714 8087 10599 8144 5249 3937 9420 6637 4787 1146 -3675 -3873 -6400
6086 -6400 -5397 -1188 160 -924 -3435 136 -4269 -7080 -4186 -3742 -1677 811 1801 -607 -707 -111
6070a11j140m86r85r016n67O290L430l2m165o539M44M105L569M840J72J433K031
6053C273n894J125o016O44J103K804L870L088k532q153n361J284M954J922l084
6038f973r8L15J782M451O31O067j836k48O759L645k150o087k553o122j298k435
6022f150m62M635l279K21m54j408r59N002M579J796O036q058j0497r540L862R365
6006e311l052M054P860R71o54K365k831k886O996K005n082l136O715k068l106
5991B840K66Q22J847k775l890L148n423j216k473j38M438J311n861l457R289K333
5975A061J152O448m40l045L56Q3n013l142o19L162K760J545j491N39M75l617K896
5958C110m758m901J807J054m346j759J530L451M775n508k124M670N79K464L725
$$ plain form
6070 -111 -1251 -1737 -2722 -11738 -12305 -6015 -2585 -2617 -6782 -13321 -12877 -8772 -5203 -363 -191 1242 3273
6053 3273 -2621 -1496 -7512 -6868 -5765 -2961 909 3997 1465 -6688 -12049 -10765 -5811 -3889 -6973
6038 -6973 -7071 -6756 -4974 -523 108 6175 4339 4091 10850 14495 12345 6258 3705 -2417 -3715 -6150
6022 -6150 -6612 -1977 -5256 -5035 -5489 -6897 -7856 -2854 1725 3521 9557 1499 -8998 -18538 -14676 -5311
6006 -5311 -8363 -4309 3551 4522 3868 6233 3402 516 7512 9517 4435 1299 8014 5946 2840
5991 2840 3106 3928 5775 3000 -890 2258 -3165 -4381 -6854 -6992 -2554 -1243 -7104 -10561 -1272 1061
5975 1061 2213 8661 8221 5176 5532 5615 602 -2540 -3159 3 2763 4308 2817 3356 3831 214 3110
5958 3110 -1648 -6549 -4742 -3688 -8034 -9793 -8263 -4812 -37 -5545 -7669 -2999 -2420 44 3769
5943C769L442m507j796N001q273j514P080M365j411l504P87m99J773j101q5M26
5927C953l238R03J539q52N180O890n72o649k337p073o1L675k90k25K198j738j191
5910A12L336M082M2R18J118j113k12m144n627m840j932L706m666L612J126M885
5894D03O518k7J272L20m941r000n658J022k446m302k58j513K904Q491M218L368
5878C71L299K936o684m556M31L783j128L050K350Q99j930j81J836K156l973n79
5862B080l247j439L081r399m5Q184m059P9Q439m335o770J130O065J946j761p414
5846g465k169l152L651L987k851J900K465K313j356J009l331p949p358j615J0075
5831a1846J3996M337m584k816l789j438M342j417K69R68N299k308j928k840l755
$$ plain form
5943 3769 7211 2704 908 5909 -2364 -3878 3202 7567 6156 2652 3439 2940 4713 3612 3527 3953
5927 3953 715 1618 3157 2305 7485 14375 13803 7154 4817 -2256 -2317 1358 1068 843 3041 1303 112
5910 112 3448 7530 7572 8490 9608 8495 8283 4139 -1488 -6328 -8260 -4554 -9220 -5608 -4482 403
5894 403 6921 6894 8166 8486 3545 -5455 -11113 -10091 -12537 -16839 -17097 -18610 -15706 -7215 -2997 371
5878 371 3670 6606 -78 -4634 -4203 -420 -1548 1502 3852 4751 2821 2640 4476 6632 2659 2080
5862 2080 -1167 -2606 475 -8924 -8969 -785 -4844 -4765 3674 -661 -7431 -6301 -236 1710 -51 -7465
5846 -7465 -9634 -12786 -9135 -5148 -7999 -6099 -3634 -1321 -2677 -1668 -4999 -12948 -20306 -21921 -11846
5831 -11846 2150 6487 1903 -913 -4702 -6140 -1798 -3215 -2946 -1978 3321 1013 -915 -3755 -7510
5816g510M930P411J175J66L43M619j782r652l913R810M873k968l687o226N322
5801B911J811n500M923l115k844l661L888J299n708j020K174K518N095j035n873
5786d137l331m717J704P647N046j168k880J204J10l127n522K36J311k023l221
5771a2868O098J2513n264J193K808P07l521L245p12J306o7J210r9k719l488N223
5755E565N879N20n365k713L143m148l310j447j605J904q06k898J310P392l529
5740a08o346L193J223K996K698k315j146O097K286k202o397l401K743k034p798
5725a0511N46P590J759m568K287j386J041N736r413r79J1115k893n120M34J609
5710b753j613K445j235j280k567o024L959O510J639K810J288m209l645n44L72
$$ plain form
5816 -7510 -2580 4831 6006 6172 6515 11134 9352 -300 -4213 5597 10470 7502 3815 -2411 2911
5801 2911 4722 -778 4145 1030 -1814 -5475 -1587 -288 -5996 -7016 -4842 -2324 2771 1736 -4137
5786 -4137 -7468 -12185 -10481 -2834 2212 1044 -1836 -632 -522 -3649 -9171 -8935 -7624 -9647 -12868
5771 -12868 -6770 5743 479 1672 4480 5187 1666 4911 4199 5505 5438 6648 6549 3830 342 5565
5755 5565 11444 11964 6599 3886 7029 2881 -429 -1876 -3481 -1577 -2383 -5281 -3971 3421 -108
5740 -108 -6454 -3261 -2038 958 3656 1341 195 6292 8578 6376 -21 -3422 -679 -2713 -10511
5725 -10511 -9965 -2375 -616 -5184 -2897 -4283 -3242 2494 -6919 -7898 3217 324 -4796 -4362 -2753
5710 -2753 -4366 -1921 -3156 -4436 -7003 -13027 -9068 -2558 -919 1891 3179 -1030 -4675 -5219 -4847
5695d847J962N50n73L740j738k435J23m93K287j232L684K97l976k377O949M517
5679F438n401p767J872K412p41M276L226j615n011l215m211k668K770Q274K541
5664A180j018m457m929Q07j356j376k07N426M264N745K584m883j186m590k529
5649f525O659L128k014K830p212o152k503J435K838o989K066P578R064L030j122
5634F111j289q605p08J314L328R72p443Q34k352J858J094K986k524q25K313K386
5618e50K582J89J966m897j954M61K408N67l805K966J532o799K143K512l527j459
5602e665n807J378J680m172M62L903J530O889P037j834j1261k549J046j09k808
5587a0280K38Q705l989p444j276K751L445N432o336r680l096P256Q188n0K08n765
$$ plain form
5695 -4847 -2885 -2335 -2908 832 -906 -3341 -3218 -3711 -1424 -2656 1028 1325 -2651 -5028 1921 6438
5679 6438 1037 -6730 -4858 -2446 -3187 1089 4315 2700 -2311 -5526 -9737 -12405 -9635 -1361 1180
5664 1180 162 -4295 -9224 -8417 -9773 -11149 -11356 -5930 -1666 4079 6663 1780 594 -3996 -6525
5649 -6525 134 3262 1248 4078 -3134 -9286 -11789 -10354 -7516 -14505 -12439 -4861 4203 7233 6111
5634 6111 4822 -3783 -4491 -3177 151 1123 -6320 -5486 -7838 -5980 -4886 -1900 -4424 -5249 -2936 -550
5618 -550 2032 2221 4187 -710 -2664 -2203 205 772 -3033 -67 1465 -5334 -3191 -679 -4206 -5665
5602 -5665 -11472 -10094 -8414 -12586 -12124 -8221 -6691 198 7235 5401 -5860 -8409 -7363 -7472 -10280
5587 -10280 -10042 -1337 -5326 -12770 -14046 -11295 -7850 -2418 -8754 -18434 -21530 -14274 -6086 -6136 -5928 -11693
5571a1693k672o66J0678K332R60M71N96j815j273R72k438k703J770j783M18L338
5555c508k325K061R581M436k285j3445l973Q160O832o005j690N02P76o637K509
5540e011L180k003N807J396K471q60o74J681l215o779R52j861m934p555l247R024
5524a1628R392j019l280l224K33N358L721l150m129L383L148J395J860Q382J317
5509A1759l967j558j224j460J286n690j410P19k504K335L606m581k591K028k289
5494e541L744J926q353j092J2420N743o287o904K562p532p684l282K472N957J330
5479a0521k068j161m963J183J4178kj876K01K597p98L540J091j233R45K796j833
5463B076m719k484K928O113j3476l556R349N770K668l359k332M662O129m509k298
$$ plain form
5571 -11693 -14365 -15031 -4353 -2021 -1061 -590 6 -1809 -3082 -2110 -4548 -7251 -5481 -7264 -6846 -3508
5555 -3508 -5833 -3772 5809 10245 7960 -5485 -9458 -1298 5534 -471 -2161 -1659 -883 -7520 -5011
5540 -5011 -1831 -3834 1973 3369 5840 4980 4306 5987 2772 -4007 -3055 -4916 -9850 -17405 -20652 -11628
5524 -11628 -2236 -3255 -6535 -9759 -9526 -4168 -447 -3597 -7726 -4343 -1195 200 2060 10442 11759
5509 11759 7792 6234 5010 3550 4836 -854 -2264 -1545 -4049 -1714 1892 -2689 -5280 -3252 -5541
5494 -5541 -1797 129 -8224 -9316 3104 8847 2560 -4344 -1782 -9314 -16998 -20280 -17808 -11851 -10521
5479 -10521 -12589 -13750 -18713 -17530 -3352 -3354 -5230 -5029 -2432 -3230 310 1401 168 1113 3909 2076
5463 2076 -2643 -5127 -2199 3914 -9562 -13118 -3769 2001 4669 1310 -1022 3640 9769 5260 2962
5448B962K586m698k690M422k625k318R77K861k268L395L241j824k952o248j898
5433g077o688M524R052L178M742L88k782q29J620K69m795l783j54L245M697J915
5417G522n235n259K568o91j394K866M028M758j160l373k06J875J621k558j653
5402C709l847J365J77k379l118R9K69J83k70k300m26K506k863N579j666k804m710
5385a0496n87L192K016J173l583J438Q781Q392m052j0193P95P822K715l68l613
5370C432j541m241M416K633k562k590o075J936L802m458l539k863J165L604K117
5355d764n577l11J342k19L653k574m464k12n10J581J68J990L18L468n12j593M46
5338g770K027K297J993J2901O9m354r107j201Q700m739r537O617K981p188P75
$$ plain form
5448 2962 5548 850 -1840 2582 -43 -2361 -1384 1477 -791 2604 5845 4021 1069 -5179 -7077
5433 -7077 -13765 -9241 -189 2989 7731 8119 5337 4508 6128 6397 1602 -2181 -2335 910 5607 7522
5417 7522 2287 -2972 -404 -1095 -2489 377 4405 9163 8003 4630 4424 6299 7920 5362 3709
5402 3709 -138 1227 1404 -975 -4093 -3994 -3725 -3542 -3812 -6112 -6538 -4032 -6895 -1316 -2982 -5786 -10496
5385 -10496 -11083 -7891 -5875 -4702 -8285 -6847 1934 10326 6274 -3919 -3124 4698 7413 7045 3432
5370 3432 1891 -2350 2066 4699 2137 -453 -6528 -4592 -790 -5248 -8787 -11650 -10485 -6881 -4764
5355 -4764 -10341 -10652 -9310 -9529 -5876 -8450 -12914 -13126 -13636 -12055 -11887 -9897 -9579 -6111 -6623 -8216 -7770
5338 -7770 -5743 -3446 -1453 11448 11517 7163 -1944 -3145 5555 816 -8721 -2104 877 -6311 -5536
5323e536M42k085pk266M19J602M433M389k025Mm904l515O972j835r38n14l820
5306i184k525O954J329j540m843o351l418N727N571J634L667K030P333N785Q77
5291A3046O36j107P34j067r515l881k720R61J715Q38l927k383J03r44O678J653
5275H20K980j826N82q311q279O104J1631J0192j915j0302q392n057k800L057M
5260a1512P31O883J911m51L29p24J397M152j302l566j194k507k46K399l926o010
5244a3636M408Q050m17o419K184M9j275L677P335L749K592O144k453N05o103m451
5228C939p083N795N968j12l028k95j782R85n58l583j1827L350J0386k102r581
5213i528k514l731p00O806O949m918m47J17P664N879l689m875j066M565n024m434
$$ plain form
5323 -5536 -5094 -7179 -7186 -9452 -9033 -7431 -2998 1391 -634 -630 -5534 -9049 -2077 -3912 -4850 -5364 -9184
5306 -9184 -11709 -4755 -3426 -4966 -9809 -16160 -19578 -13851 -8280 -6646 -2979 -949 6384 12169 13046
5291 13046 13682 12575 13309 12242 2727 -1154 -3874 -2913 -1198 -360 -4287 -6670 -6567 -7511 -833 820
5275 820 3800 1974 2556 -5755 -14034 -7930 3701 13893 11978 1676 -6716 -11773 -14573 -11516 -11512
5260 -11512 -10781 -3898 -1987 -2438 -2109 -2833 -1436 2716 1414 -2152 -3346 -5853 -6099 -3700 -7626 -13636
5244 -13636 -9228 -1178 -1595 -8014 -5830 -5781 -7056 -3379 3956 7705 10297 16441 13988 14493 8390 3939
5228 3939 -3144 2651 8619 8507 5479 5184 3402 4387 3829 246 -11581 -8231 2155 53 -9528
5213 -9528 -12042 -15773 -16473 -9667 -2718 -7636 -8083 -7966 -302 5577 1888 -2987 -4053 512 -4512 -8946
5197h946N137L889J005k254l992j876p600K354K291K712J610p11O726k735l633
5182f023n570k834P078M618L271P674N332k385j3561K341m0N15l899J116o510
5167h877l367k66M312Q530j306K755r41o687JO16N438m056M44k042k37N85P158
5150B060l509l36L018o110j214J128K433M539L439q747q9Q34k456m510M415Q06
5134d299k715q18l21K917k912L266K443o743N54M047K039k348k96J62L06k589
5118g307L990J343J558J813M127j953q978J427R98Q82J21P98N884m071L82o43
5102C71m154K987J586m439K708N562k498K138M166k348M055M993q496m738m983
5087c090q52o008L958M860N366k733l858K475J938J480K69n314m625k055M76R377
$$ plain form
5197 -8946 -3809 80 1085 -1169 -5161 -7037 -14637 -12283 -9992 -7280 -5670 -6381 345 -2390 -6023
5182 -6023 -11593 -14427 -7349 -2731 540 8214 13546 11161 -2400 -59 -99 416 -3483 -2367 -8877
5167 -8877 -12244 -12510 -8198 332 -974 1781 840 -5847 -5846 -5230 208 -3848 -3404 -5446 -5683 -5098 2060
5150 2060 -1449 -1785 1233 -4877 -6091 -4963 -2530 2009 5448 -3299 -3388 -2554 -5010 -9520 -5105 -4299
5134 -4299 -7014 -7832 -8153 -5236 -8148 -4882 -2439 -9182 -8628 -4581 -2542 -4890 -5186 -5024 -4718 -7307
5118 -7307 -3317 -1974 -416 1397 5524 3571 -5407 -3980 -2982 -2100 -1979 -1181 4703 632 1014 371
5102 371 -3783 -796 790 -3649 -941 4621 2123 4261 8427 6079 10134 15127 6631 1893 -3090
5087 -3090 -3942 -9950 -5992 -1132 4234 1501 -2357 118 2056 3536 3805 -1509 -6134 -8189 -7713 1664
5071A664R187o395o106J335k165M138K094j176k329m850j77l689O229P759n002
5056E17l547L646k586j334O081O177n209L7L690j68n145p087l851l110K962P754
5040a173k865o215J322R708K397L77j162j344l948o466N371L293J01L324Q792
5025A1512o136l266m497l119p53N505J475M152K959j183o369k826N572k176l280
5010b430k485q351j848N819M595L845J681M776m442m018r20M633k079o224k822
4995a0270m8O669N565q41M59k550j936N76Q245K339m19m905K216l75m36p74l391
4978A24J51J081j359r73J194L366k160o07J948N717K63m316p627l673J719k568
4962g720J310M074m268l470K38N697M461L935m804j930j741l818n23J29K216Q525
$$ plain form
5071 1664 10851 4456 -1650 -315 -2480 1658 3752 2576 247 -4603 -4780 -8469 -2240 5519 517
5056 517 -3030 616 -1970 -3304 2777 8954 3745 3782 7472 7304 2159 -4928 -8779 -11889 -8927 -1173
5040 -1173 -4038 -10253 -8931 777 3174 3551 2389 1045 -2903 -9369 -3998 -705 -604 2720 11512
5025 11512 5376 2110 -2387 -5506 -6259 -754 721 4873 7832 6649 280 -2546 3026 850 -2430
5010 -2430 -4915 -13266 -15114 -9295 -4700 -855 826 5602 1160 -2858 -3778 855 -1224 -7448 -10270
4995 -10270 -10318 -3649 1916 1075 1534 -1016 -2952 -2376 5869 8208 7789 2884 5100 4725 4289 3515 124
4978 124 275 1356 -3 -976 218 3584 1424 817 2765 8482 8745 4429 -3198 -6871 -5152 -7720
4962 -7720 -6410 -2336 -6604 -10074 -9836 -4139 322 4257 -547 -2477 -4218 -8036 -8559 -8430 -6214 2311
4946B311J661k917N96L291m56j455o714N239P536j237j1679k237k955l118P501
4931d633M50p089j135q83M593O406K518k840j361M602j394q94J96p455j488O849
4915c558N659K00P78L507o81L198L159j5375n618O978K717l790k437P921R273
4900A1931K260k727j0969n087L825N394J0845j265j0306J287m271r919j421P592
4886b831J808M325l411M618o36R46l141J531L649N03l248l082M97m460j65N862
4870B765J014l450q502m086J100K105L082N865L622K975J730j036m171L107l025
4855C095o519L156L114o848P731J0754l24p659m590j967l03K102R80N0N89N66
4839C927l53l007m042J850R02P17j098l205J387P793L703j960j858Q82n600M610
$$ plain form
4946 2311 3972 1055 1651 4942 4486 3031 -3683 1556 9092 7855 -3824 -6061 -9016 -12134 -4633
4931 -4633 -4183 -11272 -12407 -13290 -8697 -2291 227 -2613 -3974 628 -766 -1660 -1464 -8919 -10407 -3558
4915 -3558 2101 2301 3079 6586 5905 9103 12262 -3113 -8731 -1753 964 -2826 -5263 2658 11931
4900 11931 14191 11464 495 -4592 -767 4627 15472 14207 3901 5188 917 -9002 -10423 -2831
4886 -2831 -1023 3302 -109 4509 3873 4819 1678 3209 6858 7361 4113 1031 1528 -2932 -3097 2765
4870 2765 3779 329 -8173 -12259 -11159 -9054 -5972 -107 3515 6490 8220 7184 3013 6120 3095
4855 3095 -3424 -268 2846 -4002 3729 14483 14159 6500 1910 -57 -360 1742 2722 2772 3361 3927
4839 3927 3574 567 -3475 -1625 -723 -6 -1104 -4309 -2922 4871 8574 6614 4756 5638 38 4648
4823D648q01j224N469l102J132k892m429q00j841m891M59R01r78j3035L53Q657
4807a2374K549N550N063o418l504o267M364Q623K962j622L385l274o177M971K306
4792A37n637Q65L019O019j872j764M508N070l883n792o805J699R897K147l609
4777C999J373L504n566J181L855k082l330n297Q3K364M930k315n933m222l942
4762a1398L983R093r6M608L52k867l339j975M670J677l523k184j679j806J065
4747c419j754J036J88J385K689m185n207o34k159k789K383K931P688M468N63m050
4731h66j952N233n029o708l332k630K857j747J577N153J0755N438l467p977l162
4716e857r24k816k864M673J335M356K496N595m06j264m129m930M716k625l153
$$ plain form
4823 4648 3847 2623 8092 4990 6122 3230 -1199 -1999 -3840 -8731 -8272 -7371 -8349 -21384 -21031 -12374
4807 -12374 -9825 -4275 788 -5630 -9134 -15401 -11037 -2414 548 -1074 2311 -963 -7140 -2169 137
4792 137 -5500 -4635 -1616 4403 2531 767 5275 10345 6462 670 -6135 -4436 5461 7608 3999
4777 3999 5372 8876 3310 4491 8346 6264 2934 -2363 -2280 84 5014 2699 -3234 -7456 -11398
4762 -11398 -7415 1678 1582 6190 6542 3675 336 -1639 3031 4708 1185 -999 -2678 -4484 -3419
4747 -3419 -5173 -4137 -3949 -2564 125 -4060 -9267 -9901 -12060 -14849 -12466 -9535 -1847 2621 3184 -866
4731 -866 -2818 2415 -2614 -9322 -12654 -15284 -12427 -14174 -12597 -7444 3311 8749 5282 -2695 -5857
4716 -5857 -6781 -9597 -12461 -7788 -6453 -2097 399 5994 5588 4324 195 -4735 -19 -2644 -5797
4701e797K876J863J435k612N808J776l674n88q322j205M218k819P172J567M127
4686E825J36l725p60m235n715j476K023K884k330o074P016Q888L70N25j475j272
4670F05M965q76m205m65M153M967M002j892k998p667m504K021O234K909n299n839
4654c889p00O399r43j615P580J623n271n820j847M179P549J319r72J99O111k588
4638A1314o072n219L274q3l374K463K971n391K281K521k858J613Q036m675r329
4623b528p210M096N463K743Q178J569N41M5K665l446n892m758k924k861O21O32
4607c066r1l53J046K963j260j89N767J11L734p731k003J289k714O945N981J400
4591A1829j770l341j753l821R21n283k425N883K633K400J14J25k245m003J053
$$ plain form
4701 -5797 -2921 -1058 377 -2235 3573 5349 1675 1087 -7235 -8440 -4222 -7041 131 1698 5825
4686 5825 5961 2236 1476 -2759 -8474 -9950 -7927 -5043 -7373 -13447 -6431 2457 2827 3352 1877 605
4670 605 5570 4694 489 24 4177 9144 13146 11254 8256 589 -3915 -1894 4340 7249 1950 -3889
4654 -3889 -4589 1810 867 -748 6832 8455 3184 -2636 -4483 -304 7245 8564 7592 7791 13902 11314
4638 11314 5242 23 3297 3214 -160 2303 5274 -117 2164 4685 1827 3440 11476 6801 -2528
4623 -2528 -9738 -5642 -179 2564 10742 12311 12852 12897 15562 12116 6224 1466 -1458 -4319 -3698 -3066
4607 -3066 -3157 -3510 -2464 499 -761 -950 4817 4928 8662 931 -1072 217 -2497 4448 10429 11829
4591 11829 10059 6718 4965 1144 2065 -3218 -5643 240 2873 5273 5387 5512 3267 -736 317
4576C17J03K923K082K019n049n27K432j78l264K892L825m602J94M64n412k78K91
4559a768K142L167n609m655J345K906P063M289N23j413j186m088l845j259q633
4544a1021q233O166L455O506M854l029j925L943M451k666q46K940l683l360N809
4529C361p18q103l162L830L579j815N736N529l662J940R067J633p689l603j972
4514C951l073K307L416k216L69l031l453k475L642R789R18n714j298m036N60K554
4498B210p66M836O49l655k292J626p48m61p90n05O217l24p495M162J1711m134
4482A0241p716o410O30O060j649L28N191N720o782p572l985L174m78o79l625K99
4466g253L101J054J065k669q37P82N315N980K670r622o266m68n905j882O756M605
$$ plain form
4576 317 420 3343 5425 7444 2395 1868 4300 4122 858 3750 7575 2973 3167 3631 -1781 -2059 -1768
4559 -1768 374 3541 -2068 -6723 -5378 -2472 4591 8880 9403 7990 6804 2716 -1129 -2388 -11021
4544 -11021 -19254 -13088 -9633 -3127 1727 -1302 -3227 716 5167 2501 1655 4595 912 -2448 3361
4529 3361 2643 -5460 -8622 -4792 -1213 -3028 2708 8237 4575 6515 15582 17215 9526 5923 3951
4514 3951 878 3185 6601 4385 4754 1723 -1730 -4205 -563 9226 10144 4430 3132 -904 -344 2210
4498 2210 1444 6280 6929 3274 982 2608 1860 1399 609 104 6321 5997 -1498 2664 14375 10241
4482 10241 2525 -3885 -3255 2805 1156 1484 6675 12395 5613 -1959 -5944 -2770 -3248 -3927 -7552 -7253
4466 -7253 -4152 -3098 -2033 -4702 -5539 -4757 558 6538 9208 -414 -6680 -7148 -13053 -14935 -8179 -3574
4450c574J614K767n99Q38P100J297n256l740R89L465j756k158L144j533J345M826
4434H769L083N273k247n871j657Q24M373K915l742m504M805k746o189k594k10
4419B82j795L217m01l058Q30j646M232m839j445K407P740R363l521r128n528j01
4403c391J368M247k79M204k47l699m537l012l277Q09Q294J134m102j33L134J904
4387B417j109k280K38Q76J505j352l586J0187L900q63o035k952q64m38M340l68
4371C616j1559L194r59j0321n316P077K247k025M447L178n164J126O738J2846
4357I125j555j990J329N382m49n851k60l555J444m662M120K014l588j636j423
4342a555k300J2217o699l045K188k866o774M694Q026O922R04P68r973l981K451
$$ plain form
4450 -3574 -1960 807 208 1046 8146 9443 4187 447 1436 4901 3145 987 4131 2598 3943 8769
4434 8769 11852 17125 14878 9007 7350 8174 12547 15462 11720 7216 12021 9275 3086 492 282
4419 282 -1513 1704 1303 -1755 -925 -2571 1661 -3178 -4623 -2216 5524 14887 11366 2238 -3290 -3391
4403 -3391 -2023 2224 1945 6149 5902 2203 -2334 -5346 -8623 -7814 480 1614 -2488 -2621 513 2417
4387 2417 1308 -972 -734 142 1647 295 -3291 6896 10796 9933 3898 946 82 -356 3984 3616
4371 3616 -7943 -4749 -5708 -16029 -21345 -14268 -12021 -14046 -9599 -6421 -11585 -10459 -3721 9125
4357 9125 7570 5580 6909 12291 11842 5991 5731 2176 3620 -1042 3078 5092 1504 -132 -1555
4342 -1555 -3855 8362 1663 -1382 806 -2060 -8834 -4140 3886 10808 11712 12480 2507 -1474 977
4327I77k339o153p80p841M63P452O333j895k958J412J062j817J711K921o203n26
4311h181J2597M157j255j004K386j719P953N152J887k133K098o953j3102q872
4297f989l969N827K381p828k097O829M68K416J659k954L45L680O605J470k95k758
4281D790n156J342k009q54l483j468p72O271N328L258j608j212J750l695P464
4266I946Q33p163p360M489j315l374m21l930J741Q003Q655j768m432o159J50l348
4250e453j73Q548Q315J872r20k683j50L740o21l677m975o61K05l97O382J518q06
4233A0064m256K305M047K867j166l71J16o587o831k700N396L877j2318l40M153
4218a744l044L290j681k374P278k66k06L32L123r31k857k803J726M953j949k268
$$ plain form
4327 977 -1362 -7515 -8295 -16136 -15673 -8221 -1888 -3783 -6741 -5329 -4267 -6084 -4373 -1452 -7655 -8181
4311 -8181 4416 8573 7318 6314 8700 6981 14934 20086 21973 19840 21938 14985 1883 -6989
4297 -6989 -10958 -5131 -2750 -10578 -12675 -5846 -5378 -2962 -1303 -4257 -3912 -232 6373 7843 7548 4790
4281 4790 -366 976 -1033 -1887 -5370 -6838 -7610 -1339 3989 7247 5639 4427 6177 2482 9946
4266 9946 10779 3616 -3744 745 -570 -3944 -4365 -8295 -6554 1449 10104 8336 3904 -2255 -2105 -5453
4250 -5453 -5626 2922 11237 13109 12189 9506 9356 13096 12475 8798 3823 3162 3367 2970 9352 10870 10064
4233 10064 5808 8113 12160 15027 13861 13490 13606 7019 188 -2512 2884 6761 -5557 -5897 -1744
4218 -1744 -4788 -1498 -3179 -5553 1725 1459 1253 1585 4708 3777 920 -1883 -157 4796 2847 579
4202E79l958Q73p864m9P365O763J012j700o264M2k197R716p53o343n584L543P873
4185C054P461m8l682L193p98j1131k01Q106m42J076n841n061N09O069N827n69
4169G522kL94k822j992O150P63n716j2345k2L755o49j425N950J157j096O267M055
4152I944n021r506L688K771m419m759k698R370M54K69N605L31n047q007K663P418
4136C056N394j719n887j0399p770P275Q267J289r67K979o51O76o73j064l724n79
4120d497M114J891l171p49J144J993m90r020J972K478J030M085M134j80l506l256
4104b028k470k090N446J802m415M230k5l24m417j868j485L277K59o08j633R8l477
4087i728K315K024q96Q11P193k034M28Q35m539k659M024k398J091K587m077j537
$$ plain form
4202 579 -3379 -2506 -10370 -10419 -3054 3709 4721 3021 -3243 -3201 -5398 4318 3565 -2778 -8362 -4819 3054
4185 3054 10515 10467 6785 9978 9180 -1951 -2152 5954 5512 6588 747 -4314 -3805 2264 8091 7522
4169 7522 7520 7914 5092 3100 9250 10013 4297 -8048 -8070 -4315 -4964 -6389 -439 718 -378 5889 9944
4152 9944 4923 -4583 -895 1876 -2543 -7302 -10000 -630 -176 93 5698 6029 982 -7025 -4362 3056
4136 3056 8450 6731 844 -9555 -17325 -10050 -1783 -494 -1461 1518 867 1543 870 -194 -3918 -4497
4120 -4497 -383 1508 -1663 -2412 -1268 725 235 -8785 -6813 -4335 -3305 780 4914 4734 1228 -2028
4104 -2028 -4498 -6588 -1142 660 -3755 475 450 126 -4291 -6159 -7644 -4367 -4108 -4716 -6349 -6251 -9728
4087 -9728 -7413 -5389 -6285 -5474 1719 -315 113 948 -3591 -6250 -2226 -4624 -3533 -946 -5023 -6560
4071f560l271j792N114O900o959k599O909L187L704J364j393K81k149R3m50o238
4055c859p610Q98P291N820k384P77L820L900o28k679P2j553q738M05N277j347
4039e38J831K874J641l503n300L735j684q15P399j635q503k525N083K590J825
4024B475n583m105m036L743O583N90J788o306n557K304J0409M088N65k206M1q734
4008c941m43M712N802p762n138K477J258m162p872P734O145j923n345K174l835
3993a0119J665P968P279L092n232n182R26L143j07l747m776M33N997J547K1M642
3977G550m324m905M795J725j759n670m692o24N691k743J232P474J717k8l724k815
3961a100k321q376Q21Q26K847L392n49K345j129J975m702k468L765l164n476L814
$$ plain form
4071 -6560 -9831 -11623 -6509 391 -6568 -9167 -2258 929 4633 5997 4604 4885 2736 2829 2379 -3859
4055 -3859 -11469 -10571 -3280 2540 156 933 4753 8653 8025 5346 5418 3865 -4873 -4468 809 -538
4039 -538 1293 4167 5808 2305 -2995 740 -944 -1759 5640 4005 -4498 -7023 -1940 650 2475
4024 2475 -3108 -7213 -11249 -7506 -923 -333 1455 -4851 -10408 -8104 2305 6393 6958 4752 4793 -3941
4008 -3941 -4384 328 6130 -1632 -6770 -4293 -3035 -7197 -15069 -7335 -1190 -3113 -8458 -6284 -10119
3993 -10119 -8454 -486 6793 9885 4653 -529 397 3540 3433 -314 -5090 -4657 1340 2887 2908 7550
3977 7550 3226 -1679 3116 4841 3082 -2588 -7280 -7904 -2213 -4956 -3724 3750 5467 5439 1715 -1100
3961 -1100 -3421 -11797 -10976 -10150 -7303 -3911 -4460 -2115 -3244 -1269 -5971 -8439 -4674 -7838 -13314 -9500
3945i500J0780l480q651k458R14P32M119k863J391K323q58L678j974m083L468
3930f462L120J867L074N641nJ518q779m270K128J1287L943m237L527m385k075
3915E892l741j1706J456J1350K300L805N91m481M367O003j671q675m476k059J0466
3900I421L675J450j3024r296l805N09K018o006j705P471Q568l836n632j126O144
3885e174m924K336N557m575O306N730J624J14J484q51r851j554M739O771l743
3870C989r238M450L315k14l75r04R186M576r300l279Mk805j0052k023l106j808
3854a7584K537j148M93J86J5197M629O7r19l95L216N740k230j496k757l732k545
3838g41K236K193j548l443J714o517j750L161K187m256N783K413J370k824j306
$$ plain form
3945 -9500 1280 -2200 -10851 -13309 -12395 -11663 -7544 -10407 -9016 -6693 -7551 -3873 -5847 -9930 -6462
3930 -6462 -3342 -1475 1599 7240 7235 8753 -26 -4296 -2168 9119 13062 8825 12352 7967 5892
3915 5892 2151 -9555 -8099 3251 5551 9356 9947 5466 9833 15836 14165 5490 1014 -1045 9421
3900 9421 13096 14546 1522 -7774 -11579 -11070 -9052 -15058 -16763 -9292 -724 -4560 -10192 -11318 -5174
3885 -5174 -10098 -7762 -2205 -6780 -474 5256 6880 6994 8478 7627 -2224 -3778 961 7732 3989
3870 3989 -5249 -799 2516 2302 1927 1023 10209 14785 5485 2206 2210 -595 -10647 -12670 -15776 -17584
3854 -17584 -15047 -16195 -15702 -15516 -319 4310 4377 3458 3063 6279 12019 9789 8293 5536 1804 -741
3838 -741 1495 3688 2140 -1303 411 -6106 -7856 -4695 -2508 -6764 -981 1432 2802 -22 -1328
3823a328P425l17l009m449M624P066k39k304R142M340M749Q300n900r704p602
3808A0794J866k013p389q356r83K001N957l455l667J990J1270L757k65o01k246
3793H660j3157l409K430j137l940p804l712R399P129Q53K274M126k8l59k180J0795
3777I940N530r816k472o01n689L16P320k352Q51K34j693J204n3m531o24P445M484
3760I493o81n65k776m258k024K852O839l002j262J210K394L199l516L648k090
3745I461m093m517J553o371j0927J939M306N768p84k306L28M942m134k556q641
3730a6032K52M165J5851M054k387J587j88N845j554j0324j723m244o529r49P780
3715d396M931J80o477K904N91k433K104k82m123K014p88k137N903Q37J34N02N929
$$ plain form
3823 -1328 6097 5780 2771 -1678 2946 10012 9773 7469 16611 20951 25700 34000 28100 18396 10794
3808 10794 12660 10647 3258 -5098 -6081 -4080 1877 -1578 -5245 -3255 8015 11772 11507 10906 8660
3793 8660 -4497 -7906 -5476 -6613 -10553 -18357 -22069 -12670 -5541 -4688 -2414 1712 1684 1325 -855 9940
3777 9940 15470 5654 3182 2581 -3108 -2792 4528 2176 3027 3261 1568 2772 2719 -1812 -2436 5009 9493
3760 9493 8812 8247 5471 1213 -811 2041 8880 5878 4616 5826 8220 11419 7903 11551 9461
3745 9461 5368 851 2404 -3967 -14894 -12955 -8649 -2881 -3665 -5971 -5643 -701 -4835 -7391 -16032
3730 -16032 -15780 -11615 4236 8290 5903 7490 7302 13147 11593 1269 -454 -4698 -11227 -12176 -4396
3715 -4396 535 715 -5762 -2858 -2267 -4700 -2596 -2878 -7001 -4987 -5775 -7912 -2009 -1172 -1038 -536 5393
3698E393p258m30L561K368O367j137J459N912n495l157r34r604J613L019N055
3683F732k789j886j708n580J887P501q89l831J295M689m521K94J483J483R86L617
3667H763o024n715J229l14L163p64m172n366L659P769M493M70J944k156o217l99
3651C63P041o19k932K479J071M728k009m872N83L972m721N74l94L048K011m043
$$ plain form
3698 5393 -1865 -2295 1266 3634 10001 8864 10323 16235 10740 7583 6649 -2955 -1342 1677 6732
3683 6732 3943 2057 349 -5231 -3344 4157 3268 -563 732 5421 900 1194 2677 4160 5146 8763
3667 8763 2739 -2976 -1747 -2061 1102 338 -3834 -9200 -5541 2228 6721 7191 9135 6979 762 363
3651 363 7404 6785 3853 6332 7403 12131 10122 5250 5833 9805 5084 5658 5264 8312 10323 6280
$$ [...]
##END NTUPLES=NMR SPECTRUM
##END=
