##TITLE=Analysis number 325956
Compound Code sb 01301
Project Code adrs
Chemist Name stores
##JCAMPDX= 6.0         $$ Bruker NMR JCAMP-DX V2.0
##DATA TYPE= NMR SPECTRUM
##DATA CLASS= NTUPLES
##ORIGIN= Bruker BioSpin GmbH
##OWNER= nmr
$$ XWIN-NMR		Version 3.5
$$ Mon Jan 22 09:43:59 2007 GMT Standard Time (UT+0h)  MAYBRIDGE\nmr@NMR_250MHZ
##.OBSERVE FREQUENCY= 250.131544655141
##.OBSERVE NUCLEUS= ^1H
##.ACQUISITION MODE= SIMULTANEOUS (DQD)
##.ACQUISITION SCHEME= undefined
##.AVERAGES= 16
##.DIGITISER RES= 18
##SPECTROMETER/DATA SYSTEM= dpx250
##.PULSE SEQUENCE= zg30
##.SOLVENT NAME= CDCl3
##.SHIFT REFERENCE= (INTERNAL, CDCl3, 0, 16.4567)
##AUDIT TRAIL= $$ (NUMBER, WHEN, WHO, WHERE, WHAT)
$$ ##TITLE= Audit trail, XWIN-NMR		Version 3.5
$$ ##JCAMPDX= 5.01
$$ ##ORIGIN= Bruker BioSpin GmbH
$$ ##OWNER= nmr
$$ C:\u/data/dgb/nmr/ADRS/1520/pdata/1/auditp.txt
$$ ##AUDIT TRAIL=  $$ (NUMBER, WHEN, WHO, WHERE, WHAT)
(   1,<2007-01-22 09:43:32.18 +000>,<MAYBRIDGE\nmr>,<NMR_250MHZ>,
      <created by zg, POWCHK disabled, PULCHK disabled
       configuration hash MD5:
       49 4B E0 1D 92 C2 6B 37 9F E6 65 BC 52 41 86 1D
       data hash MD5: 64K
       4D 20 D8 F0 60 53 E0 EA 18 7D 21 B8 87 7B EA 44>)
(   2,<2007-01-22 09:43:48.94 +000>,<MAYBRIDGE\nmr>,<NMR_250MHZ>,
      <Start of raw data processing
       ef LB = 0.3 FT_mod = 6 PKNL = 1 SI = 32K 
       data hash MD5: 32K
       41 F6 C4 2A 6B 4C 7E A8 99 9C A3 E5 FC 5C 09 B6>)
(   3,<2007-01-22 09:43:50.61 +000>,<MAYBRIDGE\nmr>,<NMR_250MHZ>,
      <apk 
       data hash MD5: 32K
       BB 7C B2 DF 8E F3 96 A2 1E 13 11 B2 90 50 A8 C7>)
(   4,<2007-01-22 09:43:51.41 +000>,<MAYBRIDGE\nmr>,<NMR_250MHZ>,
      <abs ABSG = 5 
       data hash MD5: 32K
       D6 FA 45 E0 2A CE 69 F6 A9 41 B4 56 36 E9 26 97>)
$$ ##END=
$$ 
$$ hash MD5
$$ C2 4D 00 0C 12 4D 4D 84 51 5B 4F 9C BD A8 7F 86
##$RELAX= 
##$RELAX= 
##$RELAX= 
##$RELAX= 
##$RELAX= 
##$RELAX= 
##$RELAX= 
$$ Bruker specific parameters
$$ --------------------------
##$DU= <C:\u>
##$EXPNO= 1520
##$NAME= <ADRS>
##$PROCNO= 1
##$TYPE= <nmr>
##$USER= <dgb>
##$AMP= (0..31)
100 100 100 100 100 100 100 100 100 100 100 100 100 100 100 100 100 100 
100 100 100 100 100 100 100 100 100 100 100 100 100 100 
##$AQSEQ= 0
##$AQ_mod= 3
##$AUNM= <au_zg>
##$AUTOPOS= <7 >
##$BF1= 250.13
##$BF2= 250.13
##$BF3= 250.13
##$BF4= 250.13
##$BF5= 500.13
##$BF6= 500.13
##$BF7= 500.13
##$BF8= 500.13
##$BYTORDA= 1
##$CFDGTYP= 0
##$CFRGTYP= 5
##$CHEMSTR= <none>
##$CNST= (0..31)
1 1 145 1 1 1 1 1 1 1 1 1 1 1 1 1 1 1 1 1 1 1 1 1 1 1 1 1 1 1 1 1 
##$CPDPRG= <>
##$CPDPRG1= <>
##$CPDPRG2= <>
##$CPDPRG3= <>
##$CPDPRG4= <mlev>
##$CPDPRG5= <mlev>
##$CPDPRG6= <mlev>
##$CPDPRG7= <mlev>
##$CPDPRG8= <mlev>
##$CPDPRGB= <>
##$CPDPRGT= <>
##$D= (0..31)
0 1 0 0 0 0 0 0 0 0.06 0 0 0 0 0 0 0.0002 0 0 0 0 0 0 0 0 0 0 0 0 0 0 
0 
##$DATE= 1169459010
##$DBL= (0..7)
120 120 120 120 120 120 120 120 
##$DBP= (0..7)
150 150 150 150 150 150 150 150 
##$DBP07= 0
##$DBPNAM0= <>
##$DBPNAM1= <>
##$DBPNAM2= <>
$$ [...]
##$SUBNAM7= <"">
##$SUBNAM8= <"">
##$SUBNAM9= <"">
##$SW= 20.6930455092707
##$SWIBOX= (0..15)
0 0 3 0 0 0 0 0 0 0 0 0 0 0 0 0 
##$SW_h= 5175.983436853
##$TD= 65536
##$TD0= 1
##$TE= 294.16
##$TE2= 300
##$TE3= 300
##$TEG= 300
##$TL= (0..7)
0 120 120 120 120 120 120 120 
##$TP= (0..7)
150 150 150 150 150 150 150 150 
##$TP07= 0
##$TPNAME0= <>
##$TPNAME1= <>
##$TPNAME2= <>
##$TPNAME3= <>
##$TPNAME4= <>
##$TPNAME5= <>
##$TPNAME6= <>
##$TPNAME7= <>
##$TPOAL= (0..7)
0.5 0.5 0.5 0.5 0.5 0.5 0.5 0.5 
##$TPOFFS= (0..7)
0 0 0 0 0 0 0 0 
##$TUNHIN= 0
##$TUNHOUT= 0
##$TUNXOUT= 0
##$USERA1= <user>
##$USERA2= <user>
##$USERA3= <user>
##$USERA4= <user>
##$USERA5= <user>
##$V9= 5
##$VALIST= <valist>
##$VCLIST= <CCCCCCCCCCCCCCC>
##$VD= 0
##$VDLIST= <DDDDDDDDDDDDDDD>
##$VPLIST= <PPPPPPPPPPPPPPP>
##$VTLIST= <TTTTTTTTTTTTTTT>
##$WBST= 1024
##$WBSW= 4
##$XGAIN= (0..3)
0 0 0 0 
##$XL= 0
##$YL= 0
##$YMAX_a= 318138
##$YMIN_a= -351336
##$ZGOPTNS= <>
##$ZL1= 120
##$ZL2= 120
##$ZL3= 120
##$ZL4= 120
##$ABSF1= 16.45666
##$ABSF2= -4.236513
##$ABSG= 5
##$ABSL= 3
##$ALPHA= 0
##$AQORDER= 0
##$ASSFAC= 0
##$ASSFACI= 0
##$ASSFACX= 0
##$ASSWID= 0
##$AUNMP= <proc_1d>
##$AZFE= 0.1
##$AZFW= 0.1
##$BCFW= 0
##$BC_mod= 0
##$BYTORDP= 0
##$COROFFS= 0
##$CY= 12.5
##$DATMOD= 1
##$DC= 0
##$DFILT= <>
##$DTYPP= 0
##$F1P= 14.0000005364418
##$F2P= -0.99999901652339
##$FCOR= 0.5
##$FTSIZE= 32768
##$FT_mod= 6
##$GAMMA= 0
##$GB= 0
##$INTBC= 1
##$INTSCL= 1
##$ISEN= 128
##$LB= 0.3
##$LEV0= 0
##$LPBIN= 0
##$MAXI= 10000
##$MC2= 0
##$MEAN= 0
##$ME_mod= 0
##$MI= 0
##$NCOEF= 0
##$NC_proc= -2
##$NLEV= 6
##$NOISF1= 0
##$NOISF2= 0
##$NSP= 0
##$NTH_PI= 0
##$NZP= 0
##$OFFSET= 16.45666
##$PC= 1
##$PHC0= 228.0059
##$PHC1= 9.269032
##$PH_mod= 1
##$PKNL= yes
##$PPARMOD= 0
##$PSCAL= 4
##$PSIGN= 0
##$REVERSE= no
##$SF= 250.130016342265
##$SI= 32768
##$SIGF1= 0
##$SIGF2= 0
##$SINO= 400
##$SIOLD= 32768
##$SREGLST= <1H.CDCl3>
##$SSB= 0
##$STSI= 32768
##$STSR= 0
##$SW_p= 5175.98343685301
##$SYMM= 0
##$S_DEV= 0
##$TDeff= 65536
##$TDoff= 0
##$TI= <Analysis number 999999
Compound Code 99
Book Reference 9
Project Code 9>
##$TILT= no
##$TM1= 0
##$TM2= 0
##$TOPLEV= 0
##$USERP1= <user>
##$USERP2= <user>
##$USERP3= <user>
##$USERP4= <user>
##$USERP5= <user>
##$WDW= 1
##$XDIM= 32768
##$YMAX_p= 498135472
##$YMIN_p= -173708
$$ End of Bruker specific parameters
$$ ---------------------------------
##NTUPLES= NMR SPECTRUM
##VAR_NAME=  FREQUENCY,     SPECTRUM/REAL,   SPECTRUM/IMAG
##SYMBOL=    X,             R,               I
##VAR_TYPE=  INDEPENDENT,   DEPENDENT,       DEPENDENT
##VAR_FORM=  AFFN,          ASDF,            ASDF
##VAR_DIM=   32768,         32768,           32768
##UNITS=     HZ,            ARBITRARY UNITS, ARBITRARY UNITS
##FACTOR=    0.157963299565203, 1,           1
##FIRST=     4116.30446390445, 0,            0
##LAST=      -1059.67897294856, 0,           0
##MIN=       -1059.67897294856, -173708,     0
##MAX=       4116.30446390445, 498135472,    0
$$ Real data points
##PAGE= N=1
##DATA TABLE= (X++(R..R)), XYDATA
$$ [...]
23896 -20523 11075 20190 5365 1426 20708 31505 24343 12102 10935 10883 15422 4220 -14386
23883 -14386 -14711 59 4544 -6767 -3405 -413 7158 -6525 -1268 9780 19756 36796 39950
23870 39950 51745 46324 39803 23765 3631 -14972 343 2224 81 -2011 -16743 -28639 -9790
23857 -9790 1003 6460 15646 8634 2759 -5990 -5375 -17355 -12405 -7572 -11051 -6664 -15800 -23669
23843 -23669 -26255 -32300 -21046 108 5583 2336 316 -4217 -4575 -8424 199 -732 -12350 -2538
23829 -2538 16576 17084 17760 18779 19418 9438 1274 17835 22066 -5184 -12639 -13496 -10612 -3498 -2123
23814 -2123 -12646 -21297 -24467 -25516 -37933 -22245 -5623 3562 -9590 -3811 799 -11446 -11342
23801 -11342 2518 23064 19214 -1042 -10753 -17560 -28703 -8749 -12844 -4245 -3734 -1210 -8413
23788 -8413 -17071 -5096 -1553 -14545 -3655 431 -14842 -21449 3966 13290 -448 -16306 -16234
23775 -16234 -12257 3102 -7007 -10138 -7710 -11739 -7399 11699 17455 9060 8761 6528 343 -4664
23761 -4664 4547 10208 13779 12125 -4760 -22768 -18197 -18382 -20853 -13522 -22573 -9850 -4003 1762
23747 1762 8495 -4419 -18689 -24766 -22214 -11409 6618 2431 -963 20437 12102 -16354 -23081
23734 -23081 -21003 -18612 -16299 520 -767 1944 13743 27302 20692 11058 -11876 -21825 -27799
23721 -27799 -26453 -17571 -7774 -620 8990 4343 -13422 4973 18867 14057 7054 4970 4374 -1285
23707 -1285 -6912 -10782 -15624 -20142 -32854 -32714 -32092 -32940 -21899 -19786 -3525 155 6355 2808 -16392
23692 -16392 -24583 -14050 -10628 -13365 -9654 -8471 -20215 -20826 -7158 2143 14687 7274 -2837
23679 -2837 -8795 -11804 -14339 -37073 -27047 -6763 1673 -2457 -11112 -7069 -4018 1920 22289 23907
23665 23907 14060 9940 7470 -8080 -11779 -17268 -23547 -25540 -5318 15437 7896 8419 4310 -10712
23651 -10712 -18432 -15719 -5556 14065 9860 3405 13071 16098 11246 15678 6561 -2611 2779 -6009
23637 -6009 -24355 -25091 -13402 6553 22086 29368 19529 -232 9389 5782 7656 8471 28 -21904
23623 -21904 -29967 -31400 -14390 -8047 -18398 -2154 4629 11804 6163 3380 19221 18387 18475 18676
23609 18676 6270 -6054 -29121 -41996 -33784 -31672 -30749 -29874 -27711 4738 24034 1479 -12473
23596 -12473 -8097 5729 8715 -11053 -21974 -8152 4243 6271 9424 10398 27092 34389 25468
23583 25468 7613 -3486 -9544 -16583 -22260 -29685 -26556 -13949 -19475 -29663 -826 11915 11988
23570 11988 1216 -2970 10934 16058 10780 17638 13656 15860 25052 14828 13785 20391 31516
23557 31516 29397 19216 14232 -2981 -14877 -2541 23885 24679 20247 12579 -5740 -32057 -29199
23544 -29199 -26083 -33059 -22749 -5335 -2485 -4475 -28271 -18472 -24297 -25770 -21149 -11267 -6759 8851
23530 8851 24350 17334 -1783 -12652 -292 -14326 -12263 1207 -3491 -12865 -14985 -14571 -6968
23517 -6968 -1430 5987 21929 24112 18548 8588 -7586 -12760 -3661 3381 12579 10549 4538 11355
23503 11355 25932 4016 -11163 -15175 -13591 3861 -1270 -1482 3643 385 23267 19569 14794
23490 14794 35358 29250 17464 13741 18382 26564 14207 1060 -4953 2148 -330 14592 12529
23477 12529 -21485 -35388 -38734 -30125 -14230 -8511 -14127 -15594 -11298 1937 8737 -1978 -31468
23464 -31468 -16973 14333 19467 11596 -3262 -8251 -4981 -8298 6655 12699 12917 4335 -2666 -16966
23450 -16966 -1007 15678 780 -25086 -22291 -7886 1872 -12688 -16412 -22551 -26765 -26864 -15797
23437 -15797 -8313 12301 21437 34271 5809 -6716 -1808 1040 9400 3178 9147 12875 7547
23424 7547 -5954 -12736 -9174 -18657 -42338 -38491 -17299 3223 14717 3839 -6398 -6289 -3257
23411 -3257 -6563 -19184 -16840 8 14906 3934 -6502 -12188 -12695 -3349 -1809 8862 9745 -11987
23397 -11987 -11690 -5517 2012 -4749 -21181 -29534 -16487 -4302 -1394 11391 15143 6994 5920 -5213
23383 -5213 -19417 -26379 -14995 -25032 -20754 -19188 -9876 10995 4692 -6082 -10191 323 11363
23370 11363 15599 18124 21462 17359 6731 -4337 -9274 -4363 -5895 -18024 -5792 -6431 -10214 -2485
23356 -2485 3726 16670 20943 17820 10036 7848 203 -5872 6787 14591 23360 43245 39419 22323
23342 22323 2057 -9461 -7132 -19822 -9635 9168 14385 4438 -7437 -2087 3241 9271 5105
23329 5105 846 9889 6399 475 -2262 3955 17182 17164 19836 12756 11577 18085 19448 13119 -1654
23314 -1654 -4003 -8475 -9964 -17008 -3228 16008 27780 20170 21578 25764 19238 12398 8974 4257
23300 4257 1902 2247 5730 16843 8565 -4880 -14666 -10149 -7334 -4936 1837 4049 8340 25750
23286 25750 25778 27150 12510 -5493 26 -343 -12465 -12414 -5189 -2632 -10925 -21679 -20103 -7341
23272 -7341 10782 21656 20354 -4046 -24007 -26389 -12305 2807 2377 -6536 -9402 -1654 19546
23259 19546 21210 18680 -139 -14168 -24218 -5475 -9192 -16573 -15780 -3699 -1044 -1319 -5921 -23511
23245 -23511 -25893 -6556 2953 18943 15887 6472 -2804 -12507 -13207 -18537 -15494 1381 25735 15449
23231 15449 -5190 -22837 -29678 -24543 -9631 7069 13286 17063 19300 17228 14896 22225 27946
23218 27946 20438 32145 30278 39776 28175 11828 3941 20161 20928 7663 9674 17866 3475
23205 3475 6971 12735 3322 1625 9430 -3445 -9072 4237 10197 -4199 -5743 -10339 -15644 -9270
23191 -9270 -4482 -28562 -24839 -25702 -10290 17077 29936 11157 -4372 -17775 -27522 -11242 -3201
23178 -3201 -12225 -2267 149 17290 26596 27435 12319 10214 14420 7727 -5728 -4624 -19746 -1350
23164 -1350 10007 3012 -2243 6618 5025 6219 -1503 -7739 -1841 -875 -2504 1624 13341 5541
23150 5541 -9977 -30529 -12938 3378 6378 -6071 -12227 1023 1679 -11286 -4610 -1361 7615
23137 7615 7000 -10353 -12097 -18918 -29435 -24858 747 13861 1207 -5960 -1218 -1956 -4109 -16867
23123 -16867 -7679 -19924 -15817 -20115 -5494 -7485 -15940 1509 10885 7171 -6558 -11618 -8779
23110 -8779 -16577 -8038 -1352 23385 32870 13826 -914 -10437 -1908 1378 -9435 -28239 -22922
23097 -22922 5832 20257 16848 8870 -810 -13212 -10111 -3189 -5013 -9686 -16349 -9820 5424
23084 5424 4927 -9695 -11016 -3638 -5518 -16989 -27416 -10445 8169 6309 17809 7469 4042
23071 4042 16536 19785 -2586 -4699 4015 -6958 -27964 -22330 -12461 -11654 -19549 -6791 14174
23058 14174 5045 -8950 6371 5206 -5258 -8754 -9497 -6268 -12863 12794 19912 24712 35128
23045 35128 23396 -3253 -6486 -11595 -14089 -5786 7217 1111 -15561 -19011 -9026 -4100 -9061
23032 -9061 -23022 -23365 -29462 -32394 -27706 -21040 -17760 -17004 -18477 -26735 -37266 -21507 -42 21683
23018 21683 29518 23403 5264 -11289 -16628 -17748 -18953 -45408 -52716 -41159 -29443 -20102 -8327
23005 -8327 -11979 -11482 -18173 -10119 -10514 -10756 -12912 -17035 -1429 -3020 -4033 -9975 -8093 6352 22910
22990 22910 27859 24081 31654 11688 5077 2116 7964 810 -3011 5277 -1185 -12385 -5469 2206
22976 2206 -861 13173 6500 5067 1389 -4922 -2000 748 3151 -15943 -17177 -4892 -13519 -13600
22962 -13600 -4084 -2131 -7134 -9417 -4671 2201 -4619 -14597 -2457 8567 773 6045 15676 23286
22948 23286 38757 36552 11681 1169 -9416 -12533 -10008 -16434 -21748 -21354 -10738 -10440 -18568 -13240
22934 -13240 -5438 -14983 -21899 -29283 -30602 -31865 -29781 -14294 -14329 -19198 -11860 -5483 1202 -14007
22920 -14007 -11245 -6966 -15655 1635 19297 23623 2188 -19983 -40948 -37132 -24707 -27997 -29252
22907 -29252 -9565 7275 -1532 -21213 -8613 6673 6181 -1971 -1625 3934 6474 -1610 -3741 6176
22893 6176 -6546 -37592 -34921 -16199 -15715 -3269 5546 12909 23862 25947 16936 8252 -8361
22880 -8361 -10315 -14756 -23782 -29798 -25254 -21144 5599 -1452 -918 -4314 -13388 -20011 -12778 -3091 7931
22865 7931 14533 9053 2367 -2525 -17561 -23197 -12572 7638 -1638 -16559 -15110 6429 559
22852 559 -15224 -9444 -2024 -6932 7924 17497 1644 -5916 -19809 -24657 -14910 1587 -5235 6015
22838 6015 21887 5188 10021 19311 10097 -1601 -22674 -28314 -16301 9256 7073 9875 16555
22825 16555 35821 31347 22563 2392 -5075 -12650 -14737 -18308 -3583 3479 -11219 -18115 -7053
22812 -7053 9720 16528 20008 36723 28628 17110 9997 21788 15551 1030 3595 7155 2634
22799 2634 -3518 -7773 -3256 -14540 -1716 996 2158 1425 492 25426 34647 15900 -14873 -26620
22785 -26620 488 22840 14478 2588 4432 18729 16666 19734 31596 30264 13204 -12383 -21557
22772 -21557 -17944 -25175 -17849 -23988 -38711 -29568 -16095 -16137 -10717 -2893 -17854 -27122 -22577 -28656
22758 -28656 -17958 -9816 -2469 -3123 -1483 -5177 3275 10825 8567 10712 19886 12785 918 -13701
22744 -13701 -9570 2849 6519 -1119 6386 -13907 -16710 -13626 3802 5500 -14868 -6419 -2812
22731 -2812 3697 4680 4749 17473 6606 2100 -14705 -6807 20964 37174 26081 6143 2349 4456
22717 4456 -11587 -25707 -30352 -24361 -27588 -20497 5568 8234 7447 -1705 -15181 -5993 -4516 -4141
22703 -4141 -10289 -3545 -3168 -21557 -22530 -9303 -5101 -7406 -12287 -19768 -12133 257 3461 -4883
22689 -4883 -4887 4288 9829 10906 26020 23719 15153 11997 -5230 -13350 -1606 -6097 -5054 1001 -630
22674 -630 5396 8029 5219 -5750 -7426 -12411 -29460 -33005 -18360 -10833 3749 -9426 -18721 -27989
22660 -27989 -35388 -34927 -38127 -18734 672 3274 5405 2666 470 -8780 -17254 -17521 -16119 -12427
22646 -12427 -13398 -10488 -1935 2005 11961 8031 5308 3560 2563 1303 6682 11134 6574 9747 -2755
22631 -2755 -10317 8149 12600 6239 3871 5783 4593 8291 13177 -5695 -2789 27943 53762 54191
22617 54191 23813 -3638 283 26807 32817 31623 11577 570 16078 1402 8655 16491 3854
22604 3854 1954 18113 19647 12085 20585 24937 8741 -1035 10975 20451 18804 20658 13426 28865
22590 28865 18885 9357 -2661 -13456 6868 17618 11681 11577 -7122 -16595 -5073 23223 11477
22577 11477 9099 10653 9531 5376 15504 9281 -4848 -6867 -10324 -14848 -25487 -22648 -10944
22564 -10944 -5509 1854 -4014 -6732 -8502 -16203 -13637 -21005 -7574 10270 36002 40175 25224
22551 25224 31225 27948 11806 13892 27213 25175 7680 -4931 2723 4582 1127 277 -11703
22538 -11703 -17357 -3438 6774 11658 13383 5121 -3500 -1641 -12262 -22517 -33754 -41767 -45132
22525 -45132 -27508 -7403 -1294 2685 8708 12341 -8355 -12081 -3317 -5517 -16161 -676 -4129
22512 -4129 -8791 -13922 -3930 636 -7875 -11386 2553 1951 1601 5844 17687 30366 16788 -3605
22498 -3605 -11851 -10364 -27126 -6127 17640 23549 5768 -3758 -15645 -21416 -25016 -12207 -7920
22485 -7920 -18276 -30525 -40671 -29187 -20036 1974 -5824 -14998 -4892 7873 18847 4761
22473 4761 4743 -3134 -3600 6182 9904 6304 2269 -4778 -30877 -28380 6369 19707 9090 9784 -2598
22458 -2598 -1467 -4563 -88 5745 5019 7205 21254 4384 230 -10416 -12547 -4559 -16006 -34863
22444 -34863 -29843 -16056 -990 -8766 -2145 -1152 -9946 -13999 -12214 3155 4660 14858 22110 26381
22430 26381 15888 -13577 -22206 -11004 3199 -4823 -11758 -20682 -15340 -2970 -5423 -3137 -8184
22417 -8184 -17916 -12461 -20121 -20481 -15892 -25352 -19282 -16363 -21975 815 6287 10957 6490 5832 15372
22402 15372 12745 3429 -16402 -33229 -33633 -14196 -1562 -12371 -15955 -20589 -24790 -12569 -24244
22389 -24244 -34568 -18771 -11112 -6361 4730 15042 11838 -13309 -17657 -12808 -42943 -46416 -24330
22376 -24330 -9551 -11607 -13861 -7318 2592 2313 12054 13342 -4356 -5656 -2261 138 -4061 -17485
22362 -17485 -1946 -6443 -21308 -31482 -39236 -47608 -36600 -15967 -10561 5412 21980 25418 12328
22349 12328 -3235 -12066 -21732 -25707 -6820 -4579 -18293 -7826 -5150 7322 10768 13364 12379
22336 12379 -1296 2117 1336 3082 8128 12373 3182 8746 19322 14062 -12687 -14475 -18952 -22467
22322 -22467 -32771 -35871 -20194 -14356 -1351 15225 20745 12941 878 1158 -3073 4917 2850
22309 2850 307 9853 16667 14883 15732 6155 3455 -13777 -25893 -4860 -3385 -2934 -664 -14679
22295 -14679 -16789 -11768 -11151 -16357 -8781 -11327 -21101 -6193 13033 18161 6121 1376 -6698 -4245
22281 -4245 -20064 -25422 -25933 -27063 -29330 -27445 -25436 -15732 -7885 -23441 -36510 -27308 -19806 -23506
22267 -23506 -18439 -8517 -3366 -9932 -12016 -6704 6468 1913 16167 20669 5084 -2895 6148 3477
22253 3477 1676 -6983 -13043 3499 8347 782 -13674 -18595 -28586 -44048 -34200 -19118 -2601
22240 -2601 10688 6729 9704 22257 28183 42100 41483 19620 17372 -1665 -5733 -4566 -1486 3150
22226 3150 15594 8753 2862 13922 31933 35650 28550 -9276 -12507 -7088 13164 29323 25561
22213 25561 8807 -9072 -7514 -4434 -2434 -14912 -7815 -18671 -8826 -8432 -13036 -29003 -4682
22200 -4682 14236 7302 14336 13925 5170 7792 -10647 -18750 -4282 3375 20801 32087 28924 18734
22186 18734 8697 18433 23619 23599 19893 15569 24158 15207 8681 11547 2497 -2005 2300 7178 14946
22171 14946 14922 15676 11745 16442 4529 13606 21212 -3677 -20064 -11143 -22695 -32162 -39403 -30866
22157 -30866 -17230 -25758 -17360 -10048 -16693 -29162 -8420 -4119 -8229 -7751 4196 16967 15169
22144 15169 7241 4685 2091 -8548 -9391 -13530 -8305 -16511 -33244 -28660 -5819 10401 12833 -11699
22130 -11699 -21455 -27973 -39177 -29972 -19267 -9323 -20421 -25255 -24257 -23443 -22144 -3072 -8637 -4183
22116 -4183 -103 -9975 1715 12577 33635 41333 31891 12159 -5482 -18056 -4839 -1406 2815
22103 2815 21311 15079 2514 -9462 -7492 3342 22933 19613 1635 2843 17555 16992 15838
22090 15838 6769 9794 8984 -12408 -7324 -3817 -5254 -16323 -32453 -30458 -23942 -17851 -11549 -3417
22076 -3417 -4780 -1147 -11939 -10506 2421 5518 -14280 -14703 -5123 -292 10876 2800 -7265 -7235
22062 -7235 6609 4617 -101 -2785 -6850 -9068 -14425 -17151 -25393 -15732 2844 -7434 -4307 9599
22048 9599 7910 3090 -2726 -746 -10212 -18074 -19822 -4409 -4190 8629 28028 9406 15419 2106
22034 2106 -13091 -8939 -6416 -10736 -11299 -30258 -43098 -38068 -33896 -12268 -8226 -7820 -8858 -1061
22020 -1061 15549 12865 -11136 -2620 -2439 -14608 -4471 12556 30120 12768 -2184 4684 18843
22007 18843 24497 21642 9827 15414 4666 2257 26283 23041 6034 -2655 -15548 -23414 -4034
21994 -4034 12806 7112 -960 -9069 -8086 -4833 -5172 -24144 -34314 -31890 -17209 -8083 14154 -4750
21980 -4750 -27839 -33968 -31444 -18211 -868 -13177 -2403 3028 -3041 -1741 -4680 10328 17582
21967 17582 15999 18756 -1296 -25694 -23870 -22207 -25848 -31402 -26608 -24205 -30877 -31183 -34800 -23551
21953 -23551 -31180 -19065 -3049 853 -16666 -22034 -21 2071 -8077 -18644 -1166 2672 -9528
21940 -9528 -15946 -22980 10127 27238 35180 21113 13359 16537 5230 -739 5163 879 -15170
21927 -15170 -10541 13262 20797 27967 34867 16991 -15570 -21701 -1032 11305 15715 19564 18579
21914 18579 9881 -6344 7036 24598 16246 315 -10382 -2564 -3374 -5193 -2891 5828 -6372
21901 -6372 -20623 -26489 -35412 -23618 -17348 -114 4839 -7285 -13620 -34681 -31617 -39776 -47074
21888 -47074 -49896 -40685 -6795 19697 13260 9111 1952 -6171 23 81 -6769 -17076 -8415 2363
21874 2363 -6096 -11885 -22610 -16560 -11384 -10110 -3720 6519 20792 18276 -795 -4392 5291 12085
21860 12085 14147 10954 -8455 -33743 -18631 4994 9182 13937 14066 18461 6882 13564 25219
21847 25219 23653 16713 2316 -618 -7943 -7297 2661 8472 10227 3357 3666 3643 4598 -6151 -11979
21832 -11979 17493 38259 26112 28658 15797 16490 27268 26228 -590 -10625 -5483 -3322 14520
21819 14520 12357 -8311 -9370 -1949 9039 12677 8876 7332 8619 198 -6213 7833 10501 -5944
21805 -5944 -4570 8147 2953 -5298 3037 7926 7564 -2809 -11203 -11803 3972 17385 14694 -2112
21791 -2112 830 24292 25366 -690 -21917 -25016 -11771 6260 7872 214 -2077 1269 835 -7919
21777 -7919 -13324 -26880 -14610 -16029 -23499 -31809 -16549 -19755 -18045 3573 3030 10875 -915 2231
21763 2231 -14247 -16924 -22208 -10730 17832 19236 9593 21144 21501 7249 -13338 -12114 -7467
21750 -7467 -13781 5632 22307 14154 5666 -1782 269 10931 15143 -5575 -6080 -1020 5279 3859
21736 3859 -6932 -7686 -1443 753 7075 8061 15773 16518 -4415 -6102 2939 6560 -1487 -5038 -11447
21721 -11447 -18650 -25454 -18312 951 19021 12186 -4797 -13324 -28246 -25600 -3764 14339 12556
21708 12556 -2313 -24531 -17824 -17165 -12266 -31245 -38189 -37815 -20377 2978 3033 -12053 -8025 3615
21694 3615 1072 2644 10354 -1977 -1737 3750 11 -2673 745 -10564 -5546 -6465 6874 21298
21680 21298 9560 188 7101 2583 -2447 -783 -5791 -6402 -7048 3518 -449 -181 2789 7588 5003
21665 5003 -1379 -156 -11342 -24277 -22322 -14126 -11763 -3655 4181 6089 10782 14254 39488 51914
21651 51914 17609 -3893 4201 -5779 -1858 14001 16840 7275 2245 15888 1871 -6085 -3385
21638 -3385 -21361 -24327 -23644 -24773 -21770 -20803 -24883 -22160 -22427 -27262 -14859 -14228 -31393 -21637 -822
21623 -822 3467 16768 9343 20697 40300 44979 19994 -7631 -19037 -18524 -5087 -2186 -425
21610 -425 -2959 -1717 -17592 -18968 -7253 -6883 -11822 -14191 -21941 -12825 26604 30870 19615 650
21596 650 -19350 -25228 -34618 -20241 5109 18170 8783 9687 17520 34898 33997 -5932 -6288 12124
21582 12124 10488 2310 -19939 -25697 -26216 -37576 -42046 -37449 -39218 -19537 -11808 -13573 -13562 -19611
21568 -19611 -35451 -33244 -31656 -24635 -22760 -10207 -10205 -16712 -12793 -8811 -10321 -19964 -9882 -745
21554 -745 4393 4794 3807 -8353 -8105 1798 7108 9668 20485 16396 -4573 -14767 -5735 1500 2840
21539 2840 3049 -10535 -15000 -19048 -11535 -14067 -23875 -24517 -19508 -19716 -22275 -14981 -10243 -12450 -7755
21524 -7755 -6581 2204 -11354 -19344 -25598 -11088 -13174 -14337 -4569 -9748 -17835 -18832 -9337 -19231
21510 -19231 -7235 9284 -2109 -3388 1958 -12106 -10718 -8416 -5263 -4388 -8182 12651 8135
21497 8135 -7077 -7491 -9974 -2868 7617 15164 11981 2560 2890 5810 237 -16336 -28720 -36837
21483 -36837 -35230 -17645 -10757 -24044 -15605 -2879 -14071 -14036 6864 12731 3998 -11976 -16688
21470 -16688 -578 4329 28215 28205 11510 14822 3588 -1227 -681 9503 15615 15274 1613 6784
21456 6784 28190 17768 3292 -8505 -10394 -7148 -12421 -13580 -15121 -14298 -11809 -8838 -25807 -17175
21442 -17175 -16157 -25998 -15089 11935 9097 5536 915 1862 5175 1827 -6352 -7977 8392 28501
21428 28501 27458 2719 -5597 -5078 -2675 -478 9443 -11768 -24376 -17635 -14724 -12532 -7810 -13648
21414 -13648 -6922 2158 -17124 -16613 -8840 -6319 2753 929 -3738 -4338 -10963 -13327 -16976 -2904
21400 -2904 2739 -4978 -9393 -15505 -2495 -1628 -18299 -16453 -53 14284 4393 -24296 -29071 -1651
21386 -1651 12704 -509 -1062 2120 -12772 -42257 -39351 -28053 -19490 -2975 -532 1904 -7505
21373 -7505 -11706 -18658 -28893 -25842 -6291 665 11098 6568 4900 -8495 -11798 1547 11432
21360 11432 2872 -1177 -937 -8274 -7424 -3692 -21679 -29208 -32084 -33304 -26561 -17130 -9839 -2856 3539
21345 3539 10256 10261 21955 12327 1627 3121 -425 -13082 -12588 15973 22699 12164 3767 9273
21331 9273 13487 13660 3110 -5348 -10215 -20362 -26378 -36093 -28476 -14221 -20587 -25752 -22739 -28244
21317 -28244 -18770 -7922 -6289 7813 14818 8485 3017 1495 8803 12568 -6945 -6331 -15610 -4824
21303 -4824 -2791 -8132 -5083 -26485 -41322 -44891 -30582 -18203 7180 19121 20797 20853 14931 5646
21289 5646 18279 17566 -10460 -14985 5019 6125 1228 10589 21502 18114 15859 14080 20821 27628
21275 27628 20077 1854 -2320 -11007 -31503 -30586 -13441 -15494 4988 5404 7438 1469 -9758 -5512
21261 -5512 8755 -608 -7544 -7981 -3351 7346 2355 -5142 17728 20938 26603 19370 7666 -5213
21247 -5213 -2286 -4501 -13323 -1654 6759 7997 -14362 -44031 -37708 -33567 -20294 -16874 -5916
21234 -5916 -1159 13989 16263 -2301 -30591 -20653 -16713 -16727 -8622 -20940 -25452 -4683 12695 -7620
21220 -7620 -11312 1893 2113 -6917 -6871 16692 9132 -1765 -12023 -17086 -1476 -11683 -11088 -6451
21206 -6451 2170 8877 -375 1281 10243 13001 11284 3492 -8919 -1623 10665 10702 6155 206 -7080
21191 -7080 -6210 6815 10630 13642 6786 8431 -14808 -11614 13072 22682 14731 -772 -12467 -25269
21177 -25269 -15609 14377 15149 -1724 -3645 -10380 -16169 -20755 -15470 -14545 -10984 -20133 -31339 -26399
21163 -26399 -30772 -25355 -20892 -17149 -1603 24322 26141 6451 2111 -820 -8484 -14212 -7326 -1084
21149 -1084 -5136 -15088 -21836 -28496 -15379 -7711 -622 -5379 -8660 1536 19979 27992 18492 1524
21135 1524 578 9883 7937 -7895 -14943 -383 -5905 1461 7824 14799 5783 2350 -14919 -6718
21121 -6718 781 -9460 -12420 -10671 -13991 -10658 -13787 -30887 -18896 -1432 4845 -8401 -16615
21108 -16615 -14833 -13264 -4101 -11031 -40540 -34371 -15888 -15522 -32137 -20020 -5119 -3019 -4149
21095 -4149 -6199 -1493 -12859 -18658 -21660 -20592 -1802 3465 10140 12238 10524 12849 16373 18630
21081 18630 3261 -24506 -33735 -36628 -34963 -27524 -27389 -32120 -35423 -19172 -10559 -5529 -9562 -166
21067 -166 -8295 -4562 7447 7570 -12184 -15277 -9530 -1347 -2112 -4029 -11684 -9495 2189 19976
21053 19976 18604 3364 4008 -3591 -9945 -6876 -12554 -17847 -13680 -11295 -2671 5422 24502 17258
21039 17258 11332 8826 7341 -4646 -37818 -50337 -39550 -24176 -12887 -5837 -3650 -3759 -6220
21026 -6220 761 -4894 -19540 -21247 -6255 11729 16450 3188 7067 7043 1769 -1918 -11155 -11475
21012 -11475 -9366 -7165 -17184 -14958 -8781 -11847 -19196 -20418 -13991 -1321 2028 -8937 -29425
20999 -29425 -19502 3814 7534 4047 751 1510 4718 -2807 -10086 -18292 -22098 -13234 -5171 6069
20985 6069 -374 -13689 -27898 -27596 -27687 -15771 10154 19642 6845 -6588 -17303 -12794 -2800 -11869
20971 -11869 -4961 -7438 -4197 5676 -12851 -33136 -45186 -27768 -13694 -16674 -22402 -24348 -35137
20958 -35137 -39604 -20381 -17442 -19752 -10535 10608 22311 16507 15044 10808 20056 25975 21850 28624
20944 28624 18951 13314 9753 11105 2669 -9179 -13713 -17083 -22126 -8186 -12741 -24908 -17126 -15756
20930 -15756 -1334 13545 3597 -6875 -478 18617 26592 7408 -681 -3437 -15023 -23627 -21407
20917 -21407 -654 -6057 -9398 -14816 554 -21955 -49139 -43367 -28961 -36786 -39789 -19880 -117
20904 -117 5898 4322 -4708 2060 -12335 -19532 -4327 10661 804 -9678 -17192 -29410 -19320
20891 -19320 -11746 -13546 -28320 -36544 -36877 -22130 610 2822 4442 5116 6579 2872 12648 25374
20877 25374 22620 15047 2145 8061 12928 14532 21803 23043 1721 -5324 -12058 -5288 -19866 -8412
20863 -8412 1931 1983 -8965 -17454 -6206 8768 1056 -3599 -5158 -10528 -4102 -1807 -7363 785
20849 785 6559 3373 7157 9792 -4987 -9311 6438 5770 9295 4249 5943 12556 -17545 -17922 -14921
20834 -14921 -16254 96 5675 11233 17945 4660 2657 -1521 1358 2673 -4181 -12577 -20063 -14482
20820 -14482 -16560 -24577 -17261 7327 2854 -810 -7415 -14328 -23845 -21834 -25338 -20986 -26942 -22580
20806 -22580 -6149 -2390 11462 26290 18617 11393 10969 12403 8027 3095 -1368 6901 16977 15297
20792 15297 8052 19663 44742 50631 28822 17639 18477 12098 -4752 173 4274 -7605 -21960
20779 -21960 -16813 -16730 -15094 -1000 -2195 -5869 -8089 -17616 -4142 10851 19231 19131 7034 8667
20765 8667 18008 17769 3187 -8128 -25816 -14506 3622 15176 18720 210 -14482 -8736 -7472
20752 -7472 -25029 -28341 -23163 -10862 6337 1514 1170 3956 7092 -4399 -9021 -11046 -22971 -31260
20738 -31260 -32291 -33370 -35766 -16548 9384 11898 2223 3770 -462 -10198 -14838 -13179 -7736 1636
20724 1636 -14032 -22143 -13660 434 6776 9354 8682 4639 4351 -4451 -4467 -20561 -22736 6583 16457
20709 16457 6709 6619 8170 11349 13015 -8035 -3320 -10214 -25338 -33084 -35823 -33293 -13114 585
20695 585 -3098 15291 8328 -654 -3816 2186 9994 2767 17172 21449 6377 -7879 -6870 -6898
20681 -6898 -3797 -11788 -11738 -2364 -4732 -15119 134 5936 -1731 -2934 -11512 -16794 -1925 1292
20667 1292 -3352 -2247 -1547 1588 4893 1035 806 -15544 -34871 -35424 -14287 4438 8101 6956
20653 6956 -2200 -8513 159 6408 2626 3745 16203 35588 26401 5921 -5051 -3313 -2148 9994
20639 9994 12367 9843 10507 3431 -6336 -2434 6334 5238 8353 12953 12123 3543 10302 1697 -8807
20624 -8807 -6855 987 2818 -3242 -16268 -23985 -14566 -8940 -7873 -15727 -18277 -10154 -10211 -4628 -5222
20609 -5222 -15636 -18089 -20135 -7309 -7673 8709 30003 30583 10825 -3043 -9409 -2660 5376 9402
20595 9402 7930 10329 20223 34241 23718 23105 25962 19045 5797 8011 13217 24968 28679 39096
20581 39096 26282 23177 10923 -319 -9698 -12747 -11502 5828 5683 1981 8201 13683 11615 -451
20567 -451 8475 2267 -9237 -8527 -1937 -279 -10718 -18761 -22796 -3743 7879 -2344 3960 -9957
20553 -9957 -6714 1091 12886 12843 7516 4116 -11210 -5627 3413 3033 4678 4626 -3316 -7780 261
20538 261 4175 6093 9720 18213 15202 11525 -5139 -8912 -17750 -5526 9385 -2305 4598 5406
20524 5406 -5628 -16410 -28298 -15974 -11248 -6687 5902 1685 14982 17153 -70 -1579 8713
20511 8713 14839 924 -15267 -2604 9122 8932 -6401 16432 29535 21659 14944 -8237 -13788
20498 -13788 -11152 3582 -9282 9759 6507 360 970 -2025 -1958 -1970 -7402 -13329 -6427 4690 16338
20483 16338 24783 21477 1945 14703 22345 5947 5339 13065 -2870 -28402 -21228 -18242 -13633
20470 -13633 -7887 -6926 1100 17685 11993 2579 2991 -24 -10502 -2120 16702 18396 24843 20986
20456 20986 11284 16675 15850 8912 -5097 -21522 -16541 -9529 -6596 -5069 -4346 -2162 -7573 -3094
20442 -3094 14803 26947 28127 17585 14476 5515 -7611 -11307 8677 10672 -2151 -14607 -6258
20429 -6258 8940 18923 -4469 3326 11343 10317 8583 8607 -12202 -22547 -29448 -7159 18433 18517
20415 18517 14649 -6007 -14895 -6720 2189 -9049 -12960 -31032 -38157 -36918 -45638 -32181 -14700
20402 -14700 -8771 -12005 -2331 -1458 -17773 -30997 -29227 -30800 -40697 -39579 -25035 -12599 -16134 -19743
20388 -19743 -10597 -1669 10274 9775 1603 -1601 -489 -4111 1802 27291 15806 9150 29344 36807
20374 36807 32509 15754 6808 9015 29308 21890 3800 -3142 -1379 -2458 -18053 -15738 -24026
20361 -24026 -31732 -37410 -23306 -4141 11667 19305 26723 14750 3458 531 -3399 -10035 -16019
20348 -16019 -8369 3749 -2552 7095 12423 7226 879 5406 18098 14988 17701 2362 -14816
20335 -14816 -4987 9518 19516 14570 10386 10442 11778 13990 -9564 -26629 -4187 6731 8892 1058
20321 1058 -9437 -20853 -25744 -4185 12410 6696 4682 -469 -2318 486 -17440 -13046 -10974
20308 -10974 -3647 -1028 10352 10821 -16086 -28225 -16676 -15799 -35770 -29025 -14277 -14486 -23220 -29673
20294 -29673 -22469 -20482 -12918 -3541 12045 10533 11058 -4178 -4500 -2842 -9629 6639 18987 25417
20280 25417 9451 -5297 3983 10952 -11607 -21015 -24063 -19766 -21203 -24359 -20860 -13827 6921
20267 6921 -3838 411 5407 -11831 -12676 -21128 -7773 -10426 -7782 -8978 -15988 -18368 -8887 12668
20253 12668 21690 20351 7259 -4048 -955 7136 3123 -215 9717 4493 -12144 -4090 16052
20240 16052 7425 9169 16433 20235 10760 -11587 -30854 -15720 -6306 -6666 -3898 -306 7801 9623
20226 9623 6962 7836 -14699 -9718 -3662 17364 8910 -3328 -9003 -8173 7018 6579 2660 3075 4878
20211 4878 23519 27097 9742 -5024 -21430 -21010 -4229 -1035 -18187 -24913 -25858 -13100 -6674
20198 -6674 -16149 -14280 5903 10168 3424 3420 -5457 -448 -5544 -14615 -14631 -17016 -26141 -21602 -16047 -24027
20182 -24027 -27490 -6571 19193 19941 16920 -558 -930 18046 22026 10200 9516 -3965 2046 -8074
20168 -8074 -10274 -10562 -9237 -22670 -12088 -12523 -18908 -15473 -7403 -7141 -8663 -3796 2210 -5070 -19914
20153 -19914 -17343 -12016 -10460 -5519 -17594 -24687 -17634 -13287 -16340 -1379 5299 4128 -3373 2384
20139 2384 3549 -10777 -13783 -32652 -58080 -59922 -31935 -11434 -14568 -6720 1864 9059 -1665
20126 -1665 -14336 1024 2769 9988 19442 13080 28262 19982 14741 -2052 -6874 -8541 -8246 -11145
20112 -11145 -4822 -5533 -14132 -15963 -17457 -15398 1924 8012 16079 28896 11171 -17214 -14414 -4132
20098 -4132 5710 -110 11767 13719 9420 11994 1827 5460 -1565 -25473 -23795 -45759 -53383 -49734
20084 -49734 -32355 -20522 -28053 -14978 -8556 14999 696 -5114 3525 12898 20955 12135 11619
20071 11619 16101 10978 14410 21954 28329 15421 -6934 -15125 -12185 -12857 -19588 -17469 8828 8787
20057 8787 6395 14 -2738 -260 7846 11813 15894 29646 27608 9707 10648 17511 13677 8561
20043 8561 -12632 -19175 -18394 -11480 -1571 9306 5898 2262 3813 6053 7306 6021 18575 20207
20029 20207 8132 26238 8306 -5107 -1775 12469 22308 24159 14769 17967 30431 45636 43931
20016 43931 28533 28057 13552 18388 31529 22377 3451 11902 18941 11874 4612 -7746 -10306
20003 -10306 5172 5072 -9221 -1353 -1959 -6539 251 14916 18922 6867 -3662 -4980 -17769
19990 -17769 -25523 -17941 -20951 -23292 -11669 -12362 -513 -4210 -9475 -27288 -19213 -506 -6816 -15894
19976 -15894 -24948 -36426 -28749 -11051 20997 27012 19026 17099 9799 10069 14838 7737 932 4596
19962 4596 18800 11762 -11931 1203 10815 31426 21323 2213 -5254 1756 6596 20599 38652
19949 38652 29498 152 -1078 -9074 -13158 -3931 -3400 -714 3445 -1526 -6290 -6801 561 -11113
19935 -11113 -13211 -6249 6423 20043 24846 12540 6991 16803 8329 4470 -1966 -21377 -24295
19922 -24295 -15508 1956 13771 8142 2484 15790 22024 21125 18390 -8123 -21437 -11618 -3788
19909 -3788 -517 6239 10568 -6009 -24724 -27690 -19327 -630 -5576 -20661 -26300 -20182 -24449 -28100
19895 -28100 -31835 -18155 6994 16872 15778 3057 -4942 -9611 16277 35041 12767 6588 -7333
19882 -7333 -27740 -32234 -32521 -35440 -34693 -30049 -15059 -14840 -12248 -20359 -11221 -2355 -4030 6300 18265
19867 18265 8285 -4218 2137 3657 6442 -511 -15973 -32610 -31733 -23800 -7890 5631 -2677
19854 -2677 8792 23868 2978 -11361 -18160 -24121 -29755 -4680 -5362 5526 20441 26215 30452
19841 30452 35586 27390 32191 32536 22903 15796 3474 -4357 -14570 -16542 -25440 -33939 -13333 2664
19827 2664 -1243 13416 22983 30544 13709 -2910 -2487 -7282 -19225 1294 7656 -4842 -5767 -19344
19813 -19344 -24482 -31176 -38271 -42160 -15293 -11634 -17228 -21730 -25191 -12976 -9169 -5276 -3515 1247
19799 1247 -12844 -23177 -326 15062 10743 3921 -16968 -21853 -27281 -36057 -35268 -24844 -22515
19786 -22515 -46594 -42884 -13542 -11587 -36892 -44866 -35467 -25452 -9117 -15427 -10121 6822 18973
19773 18973 832 -10425 -12860 -6104 -7966 -2302 11586 346 6857 11927 12414 3774 -10344
19760 -10344 -6436 -5865 -256 -2396 -3352 -18582 -31855 -31619 -26674 -18442 -14579 -6781 1012 10244 7028
19745 7028 5170 3787 1097 -2631 -7016 -7916 -2815 -1457 9049 18278 18915 5210 369 -8217 -21012
19730 -21012 -10368 -13595 4346 14898 13481 8260 -4898 -25188 -17193 5072 11732 2877 -10448
19717 -10448 -1054 -6382 4932 19876 1604 -5128 -11852 3611 6197 -6285 9025 24004 11222
19704 11222 4874 2236 6592 -6047 -14395 -19104 -28313 -20206 -11090 -23980 -31364 -14193 3921
19691 3921 15077 7120 9301 -4196 -8900 -1667 10613 24677 23805 21565 20727 14687 2283 262
19677 262 10921 14016 -3461 2620 11218 9959 16287 9607 -6485 2862 -4019 -9574 -4734 -10075
19663 -10075 -18737 -30568 -34698 -18944 -10939 406 4041 1698 2390 24253 20477 20837 29923 27137
19649 27137 19974 514 -5165 -17354 -20460 -5181 -28995 -48784 -32636 -20770 -16556 -6767 -13196
19636 -13196 -19082 -8464 -6354 -9715 -10543 -3595 19401 26729 8938 -11118 -10737 9795 21617
19623 21617 -7881 -16129 -12291 7608 14144 -3981 -18315 -24673 -34309 -40182 -31856 -13891 -21847
19610 -21847 -21085 -23394 -24159 -1559 17101 19316 -6694 -16976 -18338 -29163 -10002 15088 11304
19597 11304 -6780 14863 22247 4033 12426 1519 -12410 -7529 -10574 -4608 1252 -7916 -17762
19584 -17762 -23627 -32895 -20127 2995 7796 8193 15261 1035 -15998 -11762 -27143 -28987 -11259
19571 -11259 7554 8552 6810 10604 6713 -5929 8874 10939 13586 22769 24605 20152 1061 -7282
19557 -7282 -10626 -13431 -10462 -6456 -23973 -26957 -11875 8750 15845 6014 -4137 -8268 -819 10689
19543 10689 -460 -17922 -10836 -13213 -11466 -1592 -4184 -10662 -3708 22959 22914 1560 5271 11096
19529 11096 21186 16613 6653 5881 18829 7596 -528 4730 -287 -863 -10613 -17353 -35072 -23425
19515 -23425 -11341 -863 3847 12863 19839 25054 29136 14165 8387 14147 15820 12833 -6139
19502 -6139 -23229 -31535 -24832 -17942 -30419 -39614 -31610 -21308 -514 29143 41595 34447 13439
19489 13439 5799 108 12589 13376 16442 4483 20729 27898 4039 15623 19268 -822 -11525
19476 -11525 -17769 -8921 -3302 -14421 -11721 -17426 -19115 2528 19768 34593 21451 9133 6879
19463 6879 -14383 -27971 -26805 -33868 -27104 -21283 -11864 1358 4397 17866 11804 -4667 -5789
19450 -5789 -4165 6421 7521 -3382 -14755 -13352 -12047 -24106 -26784 -20129 -8943 -12768 -17772
19437 -17772 3238 11635 11184 21554 22444 12554 -5141 -11633 -19075 -14614 -1660 14143 23898 20770
19423 20770 16921 8960 -7879 -15973 -10684 431 -15657 -8970 -26399 -30106 -24812 -28142 -26787
19410 -26787 -16937 -15919 -10428 -14940 -16958 -2280 5325 976 8260 9645 2240 -1023 712 -5953
19396 -5953 -4779 -13876 -21649 -22031 -24804 -31632 -29133 455 16353 10483 -10633 -24046 -25500 -30828
19382 -30828 -19566 -7164 5491 10403 3200 -1037 -22079 -33179 -17510 -3962 13415 17095
19370 17095 798 -8107 -11083 -682 -1419 -9543 -2799 -16323 -33482 -34788 -19008 -13194 -9273
19357 -9273 -1723 -10731 -5502 4745 9569 -3478 -7296 -13211 -17799 -17357 -5939 -16585 -13990 -2631
19343 -2631 3789 -5664 -19154 -3785 -4192 1489 -11088 -9873 -10251 1117 12535 6994 9700 14715
19329 14715 7309 7742 12914 13254 2261 1830 -14870 -33884 -44744 -34264 -16967 -22118 -14181 -12390
19315 -12390 -591 9261 -2084 -16776 -15411 2217 11418 -4257 -13578 -364 22369 33861
19303 33861 18736 23681 28502 34427 37491 12115 87 -788 -1276 2534 10543 7011 1676 2582
19289 2582 -8344 -13794 -28748 -39510 -42004 -42279 -31332 -14122 -14947 -32518 -29898 -39353 -21890
19276 -21890 -7752 -19307 -22568 -10951 10566 19342 17953 29497 24372 33156 41323 27488 5598
19263 5598 -8146 -3111 8944 28717 17396 -13583 -25737 -18622 -16617 -5264 15079 15812 3470
19250 3470 -2119 3013 17597 13307 12574 14016 11700 -1528 -9908 -10366 -8669 -9259 -7234 -6440 -10206
19235 -10206 -836 7494 -13094 -31927 -36868 -24589 -11327 703 1558 11738 4274 4636 12482
19222 12482 17240 2949 -19801 -30681 -24934 -24371 -9914 -5892 16180 17051 -3087 -9839 -7311
19209 -7311 -15463 -23275 -14691 -8315 -4543 -18824 -26983 -11752 7329 -2649 521 11487 27117
19196 27117 14071 6473 16781 34379 30368 34324 39199 38734 44121 34489 15220 3212 777
19183 777 10112 10869 3827 -4437 5663 13417 18253 11846 12444 7473 -2151 2123 -8002 -674 -24950
19168 -24950 -30611 -11211 -9422 -19858 -29661 -28480 1965 6714 -3811 -11452 -19652 -19675 -12370 -13876
19154 -13876 -1143 -10994 -28919 -22925 -1235 10225 24304 27201 32253 19866 26717 20935 16342
19141 16342 16267 26553 31372 31368 18243 9333 9088 11446 13167 12879 13059 7815 917 -4673 -2193 -32
19125 -32 2275 2663 542 4833 6627 557 11509 20597 29941 35098 26992 18246 -650 -5068 -5219
19110 -5219 -1730 4348 35815 38992 23308 24260 27287 -4009 -9815 -16842 -33376 -40275 -34774 -32939
19096 -32939 -37861 -28998 -35156 -31412 -9797 5997 9485 8598 3007 578 -869 3514 9984 6173
19082 6173 -6184 -2714 16108 17936 2093 -4643 -232 7464 8106 10860 -5785 -9582 -4377 9594
19068 9594 16513 18050 4347 16414 12218 -7464 -14407 -21281 -5399 4690 -8815 -9963 2500
19055 2500 1197 6842 8696 19581 16024 -9028 -8875 323 10791 9413 8358 -2769 -6943 4961
19041 4961 8432 5408 -1251 4332 8672 7160 5978 8932 4184 -555 5297 4837 -9242 -24917
19027 -24917 -23410 -11185 -10154 -14512 -4054 22717 1942 -6596 -12184 -15368 -14680 -7431 12412
19014 12412 18741 18945 20666 21619 15644 17924 28187 17642 6987 8574 13799 13800 11987 -5968 2471
18999 2471 -19112 -29038 -21109 -5183 5990 9103 2104 -1540 9760 15081 27923 31507 10902
18986 10902 -2793 -10356 -13621 -12883 -6955 -3966 -2988 -2787 -1039 1402 3618 -931 -5612 -8729 -2580
18971 -2580 -11554 -16888 10025 29781 31318 23835 1783 -13675 -8350 1625 -10669 -3846 -10025
18958 -10025 -1179 7479 21922 14544 20304 22964 24121 19911 18338 15147 17617 10817 3644 -3487
18944 -3487 3489 4037 1012 13387 1697 -4543 -4169 -6873 -8799 -4525 -6260 -16727 -7339 4911
18930 4911 11001 12569 -2501 -13447 -17385 -30704 -31722 -18612 -23411 -34092 -48589 -21082 -3716
18917 -3716 -11254 -3539 13140 23753 21564 15712 -331 557 -14351 -10305 -518 -1567 13313 32062
18903 32062 34661 19971 -4317 6182 19513 19328 22621 15167 22521 9865 -2295 -9708 -13590
18890 -13590 -2557 2011 -1907 2626 7364 -1416 -1766 -6416 -8671 -14371 -18815 -10406 11731 28607
18876 28607 25093 8740 -2890 4222 1604 15219 31216 15018 804 7581 23004 22474 43440
18863 43440 51641 40767 42989 27948 19955 19439 10460 9356 26085 31504 30824 51420 82761 125373
18849 125373 189890 297955 409819 427774 309593 204332 136042 93957 56617 34185 22014
18838 22014 14345 8658 8916 8965 3039 11420 24151 39584 65642 67815 64148 85287 146148 228815
18824 228815 354738 481082 456593 307746 187175 126408 92249 65523 51513 44896 38054
18813 38054 30847 15108 21686 39519 42435 29485 35453 35283 24353 15890 5713 1657 10252
18800 10252 18236 36246 45581 40501 27906 33069 40954 42666 24595 -3873 -22587 -20252 -16641
18787 -16641 -15627 -7437 4584 10452 4018 16697 28568 31919 18439 15779 19440 -890 -8030
18774 -8030 10713 39636 66493 90013 97305 126769 189268 295791 382954 387879 400297 463296
18762 463296 441810 315845 200849 137022 88154 56337 49962 45672 36656 24662 24586 30180
18750 30180 24450 28785 39166 39567 39383 48470 79930 106673 151350 240865 363575 455116 424674
18737 424674 294325 208333 129484 53344 20111 27723 32156 32669 25123 22797 26197 23454 13814
18724 13814 7934 5778 -3883 -16568 -7378 12563 27295 34167 14534 4582 11124 22972 31744
18711 31744 25913 16957 585 -13681 -24431 -18008 -4877 10125 7688 9245 7204 15169 18706
18698 18706 25350 35030 18877 11148 39426 44662 32097 27420 26596 30432 19556 13564 12953 12135
18684 12135 10426 -1468 -12249 -15987 -24357 -14529 -11211 -8252 524 25308 15706 -12530 490
18671 490 12694 11247 -1695 -2259 754 -7042 8182 11418 13772 20898 18733 28969 31847 22313
18657 22313 19562 6806 1885 2549 7323 -5169 -9524 -5003 5360 17494 37377 24688 15016
18644 15016 20705 25417 12466 14878 16198 15750 241 1017 3453 9937 5432 16725 13184 18653
18630 18653 30286 22572 19878 15341 10642 6946 -2881 -2376 10914 6361 -13474 -19860 -5111 10231
18616 10231 13051 10476 10813 9656 3404 16513 29165 25550 13197 3658 21055 22863 28290 31558
18602 31558 12718 3120 1295 332 7112 8766 10580 26097 19080 16709 32369 43614 35070 24911
18588 24911 2861 -17375 -21618 5697 26356 35583 33755 24507 17960 13491 14993 26575 28125
18575 28125 26840 24828 30957 19205 1772 -5238 2171 9579 11224 34559 27969 19320 17010 22714
18561 22714 32486 40236 34151 22062 13322 7510 15787 14855 13359 12442 18199 19794 16038 17336 28915
18546 28915 31225 12716 10208 25447 27736 20716 33321 34956 29363 28513 30961 31110 25495 21651
18532 21651 4157 120 4003 12543 5287 6980 12485 13739 20134 30593 17374 17175 22559 26689
18518 26689 20894 15598 8179 5264 17635 12369 11223 7942 -305 -10841 4149 24249 31144
18505 31144 43473 26363 6270 7068 19158 25234 18500 26625 19601 16885 27612 38902 26038
18492 26038 11105 -755 1869 7930 26895 32511 35645 34592 41309 50556 63391 49896 39899
18479 39899 40212 36348 32638 28736 30216 14719 14300 19026 13708 17489 27609 23181 5224 6946
18465 6946 -2080 4156 11770 22313 22929 5387 -14381 1787 6381 1465 21325 20987 26571 47562
18451 47562 57397 41273 30221 28639 23208 12851 14806 4888 23765 32419 25525 16348 16760 31721
18437 31721 50682 59591 63930 54433 55504 69106 71238 56060 39997 43402 54837 58210 36889
18424 36889 8817 -32809 -44488 -24007 -13548 -1587 14985 45041 45961 32863 33683 43210 32567
18411 32567 20383 32431 76496 114833 98070 63603 66962 85976 72180 58247 54644 37704
18399 37704 47189 65888 75588 74429 92163 72843 76584 83362 66853 76965 85486 94323 87498
18386 87498 88979 95759 101893 77524 26564 8929 6099 12755 35118 53831 80174 83978 70742
18373 70742 66154 50338 24659 6980 18823 22348 8177 1638 -3993 22108 37654 35762 34952
18360 34952 45921 56288 67092 84391 90772 84991 62413 60059 69090 76037 76445 59879 51251
18347 51251 39394 36051 42420 50540 59392 74119 63241 44981 55453 78183 88927 90347 93091
18334 93091 110348 134391 155265 166925 163338 137531 111979 91631 80131 78840 76783 69832
18322 69832 67959 86642 86930 76304 86754 113470 121936 121770 128549 119582 116326 135591 142742 168191
18308 168191 175072 194287 194961 162778 152802 162899 161383 170185 197577 192975 184136 172417 159900
18295 159900 191313 230895 252053 254974 275744 294211 311529 313370 322396 338932 398581 516088
18283 516088 664722 737125 673893 626053 629848 643748 672108 719401 759532 819645 918217
18272 918217 1082989 1270699 1359541 1413151 1556676 1788914 2098077 2529952 3144564 4015264
18262 4015264 5197935 7111571 10649452 17265410 28649708 45162555 60753106 53092571
18254 53092571 32557971 20060698 13441790 9693604 7462690 6195101 5519504 5133702
18246 5133702 4781539 4570266 4611846 4828708 5141196 5692365 6696654 8259870 10483489
18237 10483489 14091178 20896016 33895434 56283599 87894053 113637274 94392317
18230 94392317 57465990 35405854 23299221 16210104 11840553 9056973 7152444 5818586
18222 5818586 4887447 4238286 3809749 3443088 3062228 2795744 2693548 2696603 2551024 2220888
18212 2220888 1996535 1953757 2020215 2129351 2157341 2084916 2150979 2237033 2137930 2119689 2101655
18201 2101655 1879980 1672034 1614012 1584403 1569692 1656316 1830682 2086205 2429257 2803807
18191 2803807 3078207 3353784 3775194 4432327 5453452 6986832 9359268 13178772 19884245
18182 19884245 32355003 53744476 84155048 110584980 96971626 60981466 37548622
18175 37548622 24701100 17276698 12736544 9887332 8026955 6854173 6183878 5745428
18167 5745428 5208627 4695638 4449660 4467200 4739557 5331838 6411672 8356226 12024330
18158 12024330 18989011 30887636 47560775 60625971 50410786 31217883 19569548
18151 19569548 13132360 9453206 7280643 5753176 4520551 3696355 3189320 2819317
18143 2819317 2447249 2069401 1777362 1582092 1441370 1308717 1188008 1085998 1011708 972573
18133 972573 954986 959695 979861 1073178 1167640 1187612 1172602 1215022 1263809 1224524 1116109
18122 1116109 1080725 1108298 1174586 1283869 1444806 1660728 1992146 2514902 3336921 4666906
18112 4666906 7066851 11644298 19884975 32243714 44140485 38881572 23398213 13869499
18104 13869499 8920944 6162272 4479622 3400656 2684122 2162943 1777798 1478236 1275036
18095 1275036 1099479 956948 849850 766343 695889 643643 588598 527768 486446 439348 404322
18084 404322 372942 339643 313689 287430 250016 236640 227055 230195 231329 244049 260403 272079
18072 272079 266422 264702 262769 241064 228938 219092 204360 182670 184921 175189 166510 167057 171983
18059 171983 164484 139734 133225 135213 134133 139531 156038 157969 142924 134386 138927 168010 187867
18046 187867 199797 211651 189330 174152 171338 155188 122251 106495 106029 107964 118113 110091
18034 110091 92334 100442 112196 117488 103392 87311 65229 54112 47688 59616 46914 50039
18022 50039 85349 68934 48543 42529 49492 58635 64190 58193 56734 51741 36466 40153 29046
18009 29046 5629 8590 19361 50272 59487 26861 16668 13557 22852 47176 54510 46098 48325
17996 48325 61828 76086 72571 72201 65578 71914 86117 100604 119830 103819 78515 66258 66920
17983 66920 86461 82889 50609 46926 56482 57368 57369 52456 53123 42673 30647 38265 51196 63303
17969 63303 47053 45201 52180 49420 48446 63106 73668 62674 46575 32518 32541 35239 12106
17956 12106 -18879 -13173 15926 38780 34634 48112 46055 28655 11791 22609 37512 33925
17944 33925 23158 5763 19314 32391 28687 25387 30450 31132 25113 14851 6654 14131 18170
17931 18170 17182 14585 19905 26982 17460 6989 11370 5470 1642 5548 16250 21186 9084 15728
17917 15728 21727 16028 16549 26588 29638 17612 -599 -4048 -1603 -1387 13453 24821 26459 29786
17903 29786 12002 8604 29196 28365 18669 20285 29956 26790 10460 -12350 -12904 3245 14959
17890 14959 27131 28406 26883 33457 39988 40967 32801 35966 15039 10976 16120 10898 8761 11025
17876 11025 14808 13383 11584 17320 31790 23960 11930 13829 21445 8847 -6956 -18302 -26414
17863 -26414 -17529 -10430 -7615 -6986 -5913 17144 -496 1374 -1195 -2297 -6689 -2470 -23087 -25800
17849 -25800 -21744 -9949 -7898 -11274 -7889 44 -1415 3237 8564 -13300 -14641 16261 13980 -2548
17835 -2548 6134 21404 28478 19539 9939 6261 -446 1187 -3295 5591 511 -8086 -7479 -2292 -4353
17820 -4353 -4645 -3894 -14698 -17170 -21085 -6395 -11670 -190 -19194 -18704 -7647 -16815 -20796 -38459
17806 -38459 -41287 -33837 -25427 -3656 13072 11251 2929 -4776 -11494 -15597 -20104 -14113 -2550 -1115
17792 -1115 13380 15673 1908 -7693 -7339 -6042 -13098 -10918 -8127 21154 30906 21249 2449 -7023
17778 -7023 -8217 -8103 7639 4094 -11889 -12643 -5955 5925 9507 14000 8277 -3040 842 10430
17764 10430 23183 25283 27881 44861 39832 23006 23815 30088 38849 19209 14971 15053 13978 8401
17750 8401 -416 2386 1447 2767 2834 7723 20629 11578 -1625 -14058 -16876 -3571 -104 -10282
17736 -10282 -12215 -15015 -4718 8503 3189 15268 25052 13290 5047 -92 -981 23031 35333
17723 35333 36147 24475 17366 12890 16317 23452 13446 18864 24235 9937 -5120 -11247 -12183 -3534
17709 -3534 1952 18887 20245 16250 7923 -4880 -5165 -8881 -8172 -11034 -9601 -7164 -12667 -2416
17695 -2416 8615 4244 7429 18586 19870 22756 42586 33737 23721 9865 -5459 -9721 5601
17682 5601 17894 4338 1914 5230 1158 3244 -2388 15722 37097 40685 35686 17954 15135
17669 15135 -215 -1229 10887 17590 21550 21478 34000 48305 50132 72554 101455 155161 272596
17656 272596 413450 463889 344496 215928 134153 78384 48430 38358 30155 13253 24452
17645 24452 34551 33725 21566 19121 22158 23912 18024 35486 52899 84754 136446 191446 288188
17632 288188 406992 422252 283117 177930 119013 93774 64996 32748 14909 34653 39790
17621 39790 30879 29327 15707 -8092 -12869 639 8489 7609 7060 -9682 -22568 -2691 -4369
17608 -4369 -24602 -24261 -1579 -9451 -1912 6105 7169 18062 42062 67313 73888 80828 102816
17595 102816 172998 286606 411877 431757 306123 188644 128218 100258 66278 39439 24767
17584 24767 26020 21218 24083 19168 16383 12278 18164 25188 26081 33595 55256 79736 123507 218485
17570 218485 315988 408140 410139 292997 199614 141078 98066 60790 23960 12602 30533
17559 30533 40917 27436 10569 17138 14789 -4275 -13369 -9543 -4790 -10380 -16836 4846 15642
17546 15642 4102 -2577 12229 16160 2571 1382 8999 16972 35346 26475 26980 32557 21382
17533 21382 16833 26228 20091 17511 12705 6322 2514 7758 8296 -10819 -24230 -24600 -25655 -14051
17519 -14051 5199 1030 -2722 -4814 -10396 -15593 -8177 14872 20465 1322 -8356 -1256 -3208 -5551
17505 -5551 -8401 -8023 -30079 -30870 -24933 -19445 -28580 -31401 -16553 -20543 -32467 -40518 -43746 -19821
17491 -19821 9492 15833 10125 12265 -5401 -4663 -14629 -11999 -6303 -7779 -14121 -11067 -159 8222
17477 8222 10148 18484 20369 27575 11585 -1707 12644 7557 -1404 6451 1736 -12904 -6243 -18503
17463 -18503 -19680 -17881 -11762 -14059 -6707 16217 28381 33240 27084 17439 10449 5559 17905 23679
17449 23679 20726 16120 25257 33109 26578 60622 120285 192896 208714 147800 80428 44730 28234
17436 28234 24965 29414 27045 34177 11352 -5664 2379 6419 2744 -8523 6128 8534 1933
17423 1933 771 -8423 -4815 -4356 2824 9329 20814 12510 -1784 -2402 -3171 -26549 -27977 -8365
17409 -8365 6186 358 -18373 -28654 -33475 -34811 -28151 -16922 -2507 6569 8338 3466 -13443
17396 -13443 -20093 -34236 -27062 -26249 -24715 -21732 -5393 -15325 -14928 -14384 -12117 -30351 -34631 -28076
17382 -28076 -32289 -27026 -13613 -5936 8644 22909 9816 -4005 861 11033 14459 10837 13613
17369 13613 21525 14630 6262 3681 -7226 -6868 -3419 -18878 -9748 -1299 10217 11046 18245 20973
17355 20973 -2312 -32953 -31478 -22832 -8519 3279 20601 24253 12758 529 -9900 279
17343 279 5779 9234 22796 21556 14631 10958 -12951 -13445 -8581 -7878 -8184 -8508 -8325 -11979 -6394 3867
17327 3867 650 -11160 -29924 -23631 -6289 19230 42741 26276 4775 -8749 -8273 160 3569
17314 3569 3709 -7281 65 19012 35927 14720 -11818 -14228 -32929 -26719 -8496 1607 -7127
17301 -7127 -16691 -4880 4019 -4373 -11511 2888 10865 4491 2631 11269 8469 26672 26396 18597
17287 18597 9948 -3187 -11629 -15082 -14382 -13953 3620 4953 4210 -1414 -14660 -11616 -8470 11933
17273 11933 10399 -5646 -17097 -4741 146 531 8445 16416 6967 -11877 -17641 -27951 -31164
17260 -31164 -17482 -8965 -15334 -9567 -8799 9200 30135 40787 32119 11445 -5280 -14003 -7497
17247 -7497 -16667 -7739 1856 278 -7972 -10331 -4621 -10898 -58 -10065 -9013 -25288 -37732 -37809
17233 -37809 -47523 -54670 -32396 -17387 -18818 -19508 -7746 -2995 -22304 -26510 -2410 -717 14114
17220 14114 24106 13569 -1846 -27649 -24179 -15851 -19494 -19021 -28742 -15304 -7677 4628 3880 -5893
17206 -5893 -3151 7410 2710 -14264 -19074 -20871 -13340 -9616 -11629 -18900 -37921 -28115 3542 -4376
17192 -4376 -10480 -7158 -13106 -9527 -1936 -3268 -14440 -5851 2095 -13038 -11057 2048 1887 12726
17178 12726 27835 23760 20966 2349 -20037 -30756 -21145 -14493 -27772 -28997 -22755 -7755 888
17165 888 -2213 5728 6232 15918 16290 28898 21607 9089 1854 6124 17296 5398 2105 -6262
17151 -6262 -5683 2901 9262 7156 5721 -1324 3732 8989 11506 18403 13534 744 6272 2404 -7006
17136 -7006 -10467 -23598 -6777 -1497 -7284 5373 14497 21245 16033 8160 5926 -8073 -1958 7173
17122 7173 4840 -1245 5019 -5016 -11455 -15829 -4447 12495 3202 -5303 -3401 -8481 -4011 -6533
17108 -6533 -7605 -10659 -2789 -9405 -28069 -23842 -13091 209 -7179 -17010 -12590 -16129 -57921 -42875
17094 -42875 1149 20217 3245 -2069 -18303 -25533 -26106 -23077 -29998 -33542 -28399 -7335 -1699
17081 -1699 -5461 14817 15237 -3165 2880 7009 13570 16625 5563 9091 18680 19848 11232 12839
17067 12839 8885 3680 -1649 -9636 -8589 -13941 -16563 -10188 -14519 -6749 -12726 -12573 -21062 -21366 -12852
17052 -12852 -11866 -670 14468 34936 37960 23795 -3998 -28629 -6131 8366 6337 4966 -503
17039 -503 -17274 -19630 -5270 8906 7203 -7489 -28005 -33924 -34380 -18482 -12756 -21913 -24275 -27748
17025 -27748 -23124 -25236 -8149 -11516 2152 33406 35109 21509 6037 811 7645 -4819 -2597
17012 -2597 2597 -7862 -4702 -7878 -19542 -12931 -19745 -16582 3857 16200 30816 43414 19671
16999 19671 1005 9850 4119 -15641 -16273 -9999 -13524 -7334 46 -17611 -13899 -15791 -2509 6938
16985 6938 3001 3139 1802 -10802 -25055 -8578 2899 5969 8851 23677 12386 -1604 -18381
16972 -18381 -28404 -41142 -24391 -10549 -13993 -4519 1488 16987 14034 -14737 -33184 -30402 -13604
16959 -13604 2991 10118 5591 -11981 -3077 15194 19899 1139 -6154 -9607 712 -2228 -4247
16946 -4247 -12527 6591 25500 32357 34573 9857 -12529 -28445 -32959 -9183 4935 8178 11725
16933 11725 4513 6522 16803 19122 28948 33477 27581 18139 10619 3924 1316 2273 3524 22369
16919 22369 31754 23496 21357 7241 13753 24523 15233 3344 -21593 -40219 -48840 -49201 -46855
16906 -46855 -40457 -30994 -21568 -10463 2450 8027 4744 20095 25483 1757 -975 6835 -1416
16893 -1416 -9298 -8178 1978 -6107 4008 552 4242 3058 -7060 -3563 -5908 -3678 -7595 -17691
16879 -17691 -19689 -17889 -23178 -25433 -11361 -1218 -22288 -15893 -14550 -21802 -32047 -29562 -7818
16866 -7818 -7221 -4972 318 6959 6522 -4920 -24007 -22564 -6450 11233 11414 12323 9357 -158 -8233
16851 -8233 -27073 -24851 -8445 -19947 -27315 -11296 10814 14202 10711 -2277 5551 3865 -2389
16838 -2389 -2217 -12104 -7520 -4829 6604 -94 1875 -4491 -9055 -11222 -2795 2495 -12091 -15956
16824 -15956 -7860 -4823 6269 11492 2730 9905 12943 14622 -2278 -15632 -1108 7971 -22980
16811 -22980 -55596 -53533 -34545 -38256 -23986 -12283 12442 -1416 -22091 -26660 -18183 -17935 -5940
16798 -5940 2835 20039 18245 18992 24708 23598 21436 7805 2875 2492 -1536 -7082 -20278 -25396
16784 -25396 -11016 -2646 14320 42505 21348 2567 19011 -3613 -20704 -21617 -29507 -10806
16772 -10806 -3175 -5075 6781 -482 12024 11796 20436 30376 37647 31414 12112 1004 8260 7711
16758 7711 -7073 -1962 600 17265 13827 8354 -908 -9729 -16833 -13635 -5446 5942 5384 -4856
16744 -4856 9467 5102 5794 -3348 3010 19648 8899 21045 9548 -7404 -8930 10389 10970
16731 10970 -6887 -17105 -5340 18469 29416 16562 5487 11961 2727 -16034 -31869 -38127
16719 -38127 -34436 2880 32880 35239 15279 -6677 -12814 -19719 -21241 -24325 -11480 1117 14162
16706 14162 -2965 -24920 -18021 -9511 -19659 -9463 -9615 -20234 -15604 -8881 -8737 -20439 -18672
16693 -18672 -9374 3644 -2502 7166 18660 10404 11205 22734 21553 2067 -9005 -19310 -33023
16680 -33023 -37196 -44200 -28510 -8105 -17313 -7181 1610 2838 -3689 -3366 -14462 -10473 -11522 -25736
16666 -25736 -36198 -24207 -17228 -4355 12305 14843 21477 4139 -19145 -33923 -33992 -38314 -22189
16653 -22189 2107 2359 -2361 1457 10268 11195 10123 21514 17337 2844 11061 16148 18156 2251
16639 2251 8436 19514 5273 -240 -3435 -5287 -9103 -2299 -6873 -14224 -13122 -8743 -8815 -21209
16625 -21209 -20000 -9902 15073 16346 89 -1117 -13870 -2534 -4076 -28510 -38876 -31516 -22900
16612 -22900 -10299 -9974 -3223 -3705 -14288 -29192 -19289 -9223 1997 -6776 -17772 -15290 -17046
16599 -17046 -13998 -30509 -40257 -41248 -31465 -31459 -24199 -17433 5757 13977 2250 -2049 -1987 -6218 4825
16584 4825 16894 19516 6560 8603 11070 3431 8694 10437 16362 21994 12628 8950 6938 1041
16570 1041 -4988 -9808 3780 17416 8365 954 -6914 -18160 -6143 8546 13318 15668 20202
16557 20202 32045 28951 18779 7841 17626 23525 18922 -11091 -24682 -4432 7676 5806 909
16544 909 14572 15102 2309 -10185 -12104 -24090 -26205 -32486 -20601 8497 10119 7505 4107 9642
16530 9642 23272 19157 13224 10794 7958 -10178 -5557 15212 12194 -2279 8198 10022 -10249
16517 -10249 -32882 -25891 -30197 -17827 -4682 5393 -2809 -20483 -36046 -18369 8757 -1666
16505 -1666 -7571 -4223 -3017 -3367 -6896 -7984 6004 274 -13709 -25612 -9399 4870 1932 6577
16491 6577 9895 3957 374 -2970 1307 15541 3792 -5661 -10265 -11469 4580 551 12236 18070
16477 18070 7043 5149 -6034 -28560 -28422 -13932 -5901 -15781 -16768 -987 9108 10730 4730
16464 4730 -11537 -11634 268 3748 11035 8384 -4609 -13263 -13890 -11352 -13703 -26824 -22117 -2872
16450 -2872 7738 -1002 463 -9785 -11656 -14720 -22063 -23837 -10688 -11856 -12148 -4083 -2085 8482
16436 8482 688 -7071 -3051 -2636 1149 15288 27674 34266 35508 4156 -986 -5940 -297 17896
16422 17896 37177 44237 32383 28186 22888 8792 7057 5777 22204 27480 18779 1245 -7625
16409 -7625 -5796 -2028 -5779 -3704 -5450 -6062 2892 -6597 3923 26194 17898 10391 -6154 -19180
16395 -19180 -39914 -40116 -33529 -20347 12941 24153 6401 6251 -1645 9177 34052 43851 35815
16382 35815 27795 29222 25978 11198 33452 29117 16839 5291 -5633 -1745 5173 -8228 -11801
16369 -11801 -7863 1140 7057 7495 25002 33202 24354 21825 17410 5044 -1378 9049 17004 4153
16355 4153 5060 9493 18537 17091 31313 33351 29103 39263 26857 17316 -3793 -19263 -1405
16342 -1405 12218 18662 20898 8819 -2864 -2234 8138 15732 16210 13977 9189 1643 -6042 -10987
16328 -10987 -19955 -22143 -19751 -18962 -14834 -14679 -19984 -16547 -30411 -29017 -9321 8397 8729 16013
16314 16013 9247 -5438 -19556 -21284 -23976 -22314 -4133 -9034 -19628 -11695 -14569 -21208 -21930 -19014
16300 -19014 -8253 -38 -1058 -3595 -1636 554 10680 -4029 -15259 -21677 -18384 10216 9271
16287 9271 -11242 -18700 -58 2622 -1473 4078 23375 18011 -6799 4673 11723 -3373 5976
16274 5976 12869 15280 -747 383 5734 4130 5712 5291 17965 22454 11569 6426 6699 15473
16260 15473 10032 -62 -12502 -24354 -11187 4780 -746 3882 17669 32186 39945 30157 490
16247 490 2223 15010 8454 -4698 -18500 -29024 -18934 -4623 11913 17329 16690 5717 -1450
16234 -1450 -4552 -14930 -786 8090 5684 -569 7005 13047 27518 14597 -3057 -3500 -10957 -26389
16220 -26389 -20297 12629 33629 27628 19969 16611 910 10782 15696 8914 7242 -11609 -19969
16207 -19969 -33184 -21763 -10590 6890 3114 -3267 -25706 -34010 -37178 -32958 -17618 3315 -2456
16194 -2456 -28142 -22096 -10159 -20253 -30035 -9372 1839 -6928 -17825 -26619 -28894 -7114 5616
16181 5616 -16905 -11909 846 1460 -5263 -12771 -12382 -18453 -9610 5869 13356 10816 9042 8743 8487
16166 8487 1661 -7719 -15683 -26214 -28928 -16702 -23903 -23858 -32891 -32550 -14686 -15856 -19331 -17117 -2282
16151 -2282 11247 13979 29078 9074 -13445 -14625 -25263 -28891 -23244 -20421 -8824 -6888 -7124
16138 -7124 -23741 -27336 -18404 -3438 9420 11688 12736 10991 10162 12090 10983 1873 -4551 -10457
16124 -10457 -15556 -5429 2855 2973 13409 14463 9522 9639 8419 6065 20129 6975 -12978 -24349
16110 -24349 -21641 -24515 -16199 -6475 -21617 -34854 -21337 -19292 -12972 -16117 -25464 -5323 -8488
16097 -8488 -3178 5476 1349 -3598 -10470 -6300 7297 5552 14256 21981 14500 12591 3075 14994
16083 14994 20374 -1068 -12069 -6753 -6969 -3441 -5213 -270 -20951 -31716 -37222 -27869 -14970
16070 -14970 -1799 -7885 4911 21584 6512 -5455 3006 3484 16983 9467 6058 159 -18114
16057 -18114 -23736 -26795 -31616 -23933 -17410 -17214 -15262 -6199 -2038 16928 35175 36804 28573 30950
16043 30950 12813 -1583 -6965 -16280 -11755 6478 34245 36615 26195 17563 1017 -24301 -31718
16030 -31718 -34799 -19394 -7048 -13980 -3324 20408 22371 15220 -838 -4790 -20806 -16288 -20955
16017 -20955 -24426 -16555 -12008 -6250 -28251 -40812 -39237 -35816 -23327 -10355 -1841 -861 5010 8952
16003 8952 17700 24478 25837 33839 33503 8767 -2700 -1061 8174 -4519 -18385 -31858 -27530 -9504
15989 -9504 9308 2244 830 -12089 -28063 -16247 -7729 908 14422 405 5955 4283 -8332
15976 -8332 6607 27638 19174 1219 -3958 17698 26953 27132 14147 2851 -3645 1874 -2786
15963 -2786 1162 2483 -2149 7604 5534 -7116 -16665 -9365 -8751 -9832 -4677 -887 8306 -5134
15949 -5134 -29431 -10334 -1953 -21344 -32715 -25311 -16721 -11752 -8247 -5916 -2152 -18707 -22929
15936 -22929 -26428 -13837 88 5686 14278 7172 -1313 -5521 -3953 -10260 -16175 -12297 9918 27195
15922 27195 14381 12234 7607 2590 -2402 -17951 -24708 -10991 9351 14280 -8487 -37588 -51162
15909 -51162 -41998 -25080 2633 7451 8575 -4196 -2186 -6394 -3875 -4288 -13129 -9073 175 545
15895 545 -14209 -7400 -18185 -17780 -18152 -6479 -11818 -15899 -18521 -31216 -20733 -16312 -8774 -17454
15881 -17454 -23160 -12244 -11848 -14375 -33382 -32548 -37 8377 -3118 -2857 2312 -5104 5661 -6967
15867 -6967 -9184 6996 11287 5649 -4855 2459 -6305 -16250 -19650 -5287 -9186 -14301 -9094 5375
15853 5375 18242 3778 -13830 -11815 820 10017 869 -6184 -4190 4820 17772 13138 20473
15840 20473 17410 -16440 -31975 -22793 -18177 -16326 -19779 -11856 -6947 -20984 -38250 -17905 -6809
15827 -6809 -13566 -17202 -6004 24118 31986 28423 18598 10211 14842 16885 10814 2576 -10255 5096
15813 5096 2757 -15953 -9948 -5019 12266 22104 16497 5120 -11399 -8185 -8915 -7190 -620 2740
15799 2740 3956 -12526 -11367 -9512 -12005 12221 11368 16342 17125 15217 3346 -4365 662 9244
15785 9244 13691 12566 1616 -2425 -13708 -16235 -20122 -23738 -20998 -1996 -2762 -16209 -13879 -24532
15771 -24532 -29606 -14008 1266 3861 -1571 -5544 3666 5239 -14117 -12696 4747 9119 11106
15758 11106 -4856 -14478 -15267 -16952 -11359 -17932 -13774 -21829 -14937 -15562 -23018 -6545 20356 10714
15744 10714 -1699 -5061 -8028 -6507 -7601 -11678 -11808 9032 13929 18961 876 -3290 -11094 -8191
15730 -8191 -7798 -5655 -4292 -19685 -9389 -3432 -8610 -244 9898 17880 27424 24165 -706 98
15716 98 16361 17149 -4058 -2128 -10684 -13765 527 -4794 -11900 -10861 -10807 -3630 7960 6395 4337
15701 4337 -7542 -13284 -8174 -7212 -6236 -23164 -22951 -22788 -27389 -19923 -8673 976 2687 -3627 3001
15686 3001 7998 3227 2092 9992 21642 29591 34000 19396 12495 13849 13168 5368 -19299 -10871
15672 -10871 11657 13710 6519 -7787 -28159 -41587 -43200 -24963 -22240 -1185 3380 1850 11441
15659 11441 14066 2077 -12513 -12950 -6557 -13146 -14693 1076 10110 6860 19254 18944 4005 -14314
15645 -14314 -22832 -11557 9710 17238 5409 -7467 2453 6656 -3988 4656 12885 3038 8862
15632 8862 22082 17002 17416 18362 2591 10512 19767 37132 35522 16130 5038 -9957 -13008 -13701
15618 -13701 -19187 -30980 -14463 16775 24496 14640 726 -4224 -16924 -32051 -20688 -11722 -8365
15605 -8365 775 8958 11829 7383 -1266 -12277 -15897 -10034 12259 19180 3606 20532 20497 8442
15591 8442 3137 4782 3756 -21063 -35232 -8564 10277 14008 10482 17067 7393 -2009 3140 13933
15577 13933 101 -3269 10118 16342 17161 3497 6502 8493 -6746 -25293 -29210 -16039 1634
15564 1634 -14026 -658 7071 14452 8194 -12302 -8996 -9551 -9398 -3090 16744 19479 -3652 -17138
15550 -17138 -18779 -7146 -4228 1149 9601 16422 24674 4314 -4549 770 13301 2639 -3239
15537 -3239 -647 -1825 10748 12177 18081 -1986 -8500 -966 -10033 -19744 -19616 -29057 -51795 -55254
15523 -55254 -35614 -3562 -3356 8254 -1764 -19659 -24941 -14929 -4632 4739 17666 12475 5348
15510 5348 907 3890 10249 27653 19356 28940 22802 23444 18199 10849 14085 24456 25740 19259
15496 19259 10891 6510 -2391 -17472 -13392 -26955 -19228 2247 2792 4644 -6872 -6521 -247 -12598
15482 -12598 -7720 -4461 236 16034 18243 3900 -1678 -3810 9866 15079 11594 12876 28125
15469 28125 27125 10594 3430 574 3734 11665 22294 24620 22214 25886 11845 8086 2842 2251
15455 2251 -20364 -18211 -17188 -11905 -5703 4122 -1411 654 3022 -11981 -8122 13337 12731 10749
15441 10749 -16172 -11963 -10969 3677 8024 10509 19430 23234 6927 -8299 -10421 -8418 -26176
15428 -26176 -15317 -5038 -1322 9354 12704 12874 15471 10067 10587 3439 -8367 -3021 -2865 1990
15414 1990 18848 22901 7835 -7143 -6101 -4612 -1850 -6670 -4387 -1363 21644 39543 22735
15401 22735 5232 13231 11689 21614 28705 7315 -17207 -13134 -1624 3603 -4971 2383 17873
15388 17873 6247 -2611 -6021 936 7453 13021 196 -9375 -3923 8257 13896 3754 2860 -3796
15374 -3796 -15128 -13692 -14782 -7105 -5685 -10911 -10119 9715 23484 24732 17035 2128 1499 229
15360 229 1597 4056 22712 29511 14277 1882 13471 25383 27723 9575 -588 16522 14464
15347 14464 11410 15507 12174 4782 -21712 -34373 -39064 -33437 -13581 7436 -5697 -2075 -1302
15334 -1302 12651 8529 6462 7512 -700 -4821 -19896 -15184 -14813 1688 -309 -7280 -16046 -2557
15320 -2557 19164 7954 -336 -3739 -15912 -7114 9807 7202 -3878 -9241 -4128 -298 25345
15307 25345 36989 30145 27770 28047 8872 -8141 -4198 -3867 -24495 -15646 4400 -1619 -11329 -10367
15293 -10367 -8015 -160 77 -1526 -3434 -3991 7029 628 -4510 -8718 -23180 -22438 -32057 -27072 -4187
15278 -4187 -12294 3170 18560 20474 18941 7449 -10695 -8708 -2023 -83 -773 -532 6695 11736
15264 11736 30718 36176 23942 12351 -2057 -8106 -1391 -12115 -24477 -19837 -9487 9 6789
15251 6789 7140 11160 3119 -2442 -5272 -15004 -21277 -13627 1240 2910 -11655 -7860 2665 4188
15237 4188 -3431 -1621 4789 -1738 9203 7383 -4095 -15644 -8789 -3662 -10094 -16305 -9980 -5319
15223 -5319 3122 7831 19041 17406 9218 9320 8625 16130 23979 18970 19904 26830 36660 32058 11290
15208 11290 19241 23941 22067 11872 10655 15963 17144 18804 12826 24799 25405 19170 -3696 1278
15194 1278 -3961 -8563 -2361 -5068 -24569 -13855 906 16165 14893 15666 17644 24000 16409 3214
15180 3214 10217 14056 4310 -2537 -1724 -1411 5852 14089 18586 25985 21832 35497 27801 10383 3849
15165 3849 1767 4619 5911 12734 -2707 1271 6121 22869 35169 18222 6036 12186 20335
15152 20335 17367 18935 13347 17970 13323 -6024 -13996 -21710 -12072 -8671 -10015 -840 20505 16908
15138 16908 -3734 -1155 6146 -251 -2919 -13388 -7021 2688 -4911 -17481 -4790 9008 -12834
15125 -12834 -26105 -29845 -20417 -11506 -5160 11771 -644 -10687 -4083 5279 -11589 -8562 346
15112 346 1622 -7723 -6087 1357 -1106 3398 8365 12575 13314 15199 14772 13679 11274 8680 -904
15097 -904 7153 -9702 -17925 -17981 -9757 12124 9994 9485 16349 9144 8029 5102 -14928 -23814 -11896
15082 -11896 -13714 -20029 -22766 -30907 -19811 -13529 18 2878 22823 12746 -26089 -32054 -8640
15069 -8640 8084 24468 18491 28319 40750 40312 19403 20942 14104 9017 8200 15257 5005 7075
15055 7075 5698 2043 5549 -5309 -11821 -1645 -2353 2943 -14688 -19853 -15949 -6262 -14867 -7852
15041 -7852 1422 13087 3484 18438 19531 15232 -4536 -2059 12975 17978 21251 739 733 2702
15027 2702 7818 -2242 -15975 -15170 -16812 -17928 -26964 -27562 -14492 -10523 -39426 -32661 -24373 -24250
15013 -24250 -10970 6661 7542 -18633 -19016 -4914 17709 39195 21607 13240 6857 441 -4471
15000 -4471 -7426 -10507 -5871 -415 8431 9011 6014 7076 -2585 -5966 -1852 724 -354 20568 16226
14985 16226 7381 -7320 -1269 1462 10434 11057 2799 -1958 1022 6644 -7333 -16150 -9275 -5338
14971 -5338 2328 -6615 -1346 17576 29609 15610 2040 -15105 -27868 -15968 -4561 2913 6006
14958 6006 2415 -2182 -9896 -26374 -19346 -26290 -17901 4386 20992 8817 2261 15165 25374
14945 25374 39876 20973 6649 1549 80 1099 -11616 -25835 -12798 1803 -5904 -10170 -16112
14932 -16112 -22090 -11170 2416 -1554 -11388 -4625 -1974 2620 6209 -3983 -6036 -8913 -15694 -12567
14918 -12567 -4640 229 9527 8388 3121 12111 8793 4847 18075 30522 28736 7598 -16924
14905 -16924 -16720 -16153 -18330 -838 16368 14334 18679 33197 37911 36774 24013 16893 1411 -2194
14891 -2194 -14731 -25675 -18789 -708 23245 40502 34313 11138 -6455 4671 8709 10246 14865
14878 14865 -8182 -26975 -18247 -12207 -22393 -22363 -12844 -24710 -31095 -23423 -14911 -10427 5206 -968
14864 -968 -18880 -4457 17217 12436 -8220 -15306 -13024 -14739 -13459 6498 24617 29438 25025
14851 25025 28750 27042 32217 26028 3979 50 -7340 -2330 10613 15704 7226 5525 2653 3928
14837 3928 -1780 -13099 -9889 -10812 -15767 -8740 -8794 -8968 2490 2143 3575 10592 9139 -663 -6244
14822 -6244 -6542 -14038 -39074 -44335 -32927 -30211 -32511 -22948 -12375 4126 5831 2747 -3300 -8301
14808 -8301 -4877 9012 15039 1608 -2815 -18191 -17066 -3692 -9719 -18410 -15254 -11848 -16719 -10784
14794 -10784 -18400 -16030 -1720 -3908 -18117 -12328 -295 4627 -1863 7140 -7021 -2350 -3633
14781 -3633 -6931 9886 7537 5222 -9882 -4607 7751 4056 1957 -10360 75 3456 -5621
14768 -5621 -12563 5636 28771 18630 -6183 -10154 -1348 -15339 -36058 -48065 -47166 -40067 -25460
14755 -25460 -4554 -11659 -23040 -19421 -2594 6344 9243 -12650 -4064 19880 13960 6343 15410
14742 15410 25512 17614 5997 6356 12576 24492 33254 28133 5575 -1817 1921 1619 2133 6036
14728 6036 11776 11092 7278 2913 7409 19292 17740 -9506 -11596 -3238 7995 24640 18657 8420
14714 8420 4134 4222 10615 15638 26579 19663 8978 5165 4071 -1178 7672 21742 17147 -4931
14700 -4931 -23895 -19733 -16075 -4998 8912 3613 -7620 4763 -2694 -14581 -13559 12269 18786
14687 18786 17997 -5859 -23458 -28733 -18282 -15527 -6167 1028 653 15963 15506 4112 -3194 -21750
14673 -21750 -35946 -21312 -13319 -12705 -22936 -16234 -8820 6567 12565 20779 16784 94 -6505
14660 -6505 -12339 -11901 -12024 -8908 -12687 3036 15345 12756 29100 17515 1070 11328 26360
14647 26360 11313 7189 5544 1940 11943 26223 12209 10845 10110 12408 14514 14545 3749 5450
14633 5450 13315 22474 12981 2503 -27529 -30451 -31269 -15438 -10296 -14796 -16412 -32484 -35067 -22675
14619 -22675 -16300 -13931 -18871 -10796 6669 5384 1612 -10511 -30885 -39032 -21152 -10011 -1938
14606 -1938 1379 10276 34029 28542 6144 -15626 -12499 4684 22836 12331 -920 3689 7941
14593 7941 -6 -16031 -12789 5907 12607 -545 -7735 9755 13805 6368 2722 682 -7626 -18796
14579 -18796 -20815 -9780 7617 9507 17836 21972 20773 21650 11605 -6393 -22157 -23155 -1723
14566 -1723 27448 33060 16694 11104 9280 17594 9189 9481 17261 22351 19550 21724 20075 16042
14552 16042 11142 -2175 -5202 -9539 -4065 -4193 -17037 -13377 -18602 -21376 -11565 -5015 -11489 -23285
14538 -23285 -31171 -26551 -10616 9309 3358 2774 -18872 -9807 2385 10890 1392 -2674 -3044 -515
14524 -515 -12712 -8799 -2681 -15828 -30618 -30728 -33234 -15156 9707 4042 10187 16698 9702 11694
14510 11694 11016 16369 -1640 300 -15483 -20965 -8122 -13081 -13824 -18713 -22632 -32748 -20216 -20754
14496 -20754 -28260 -17408 -14894 4655 18161 3762 912 5432 8118 -3149 -20442 -13863 -3032
14483 -3032 -891 -21106 -29295 -12584 -3754 -2103 -384 -7261 4878 17858 20830 21123 -992 -9527
14469 -9527 -2785 -7195 -15907 -18763 -20005 -25010 -26850 -38691 -49909 -35601 -3829 -8034 -12694 -25525
14455 -25525 -29907 -15283 -17724 -33784 -29448 -4662 12755 3862 -3198 19533 30547 8954 12048
14442 12048 8207 8428 4606 4051 -3891 -10502 -34102 -30938 -24757 -19773 -4629 -20551 -49020 -40620
14428 -40620 -22557 -4162 -1085 3086 10047 -2887 -8139 7535 17290 4205 -286 17320 19958
14415 19958 8817 -8010 -19420 -7823 -7539 -17320 16371 41877 34760 4358 -2568 15870 6128
14402 6128 -5871 -6159 3601 18201 19682 27967 36194 36778 44848 48970 32755 7489 8806 11932
14388 11932 20953 22874 13666 19253 41169 48772 28183 5805 6269 -2580 356 1071 -12380 -14366
14374 -14366 -525 4565 6245 9326 16996 31742 3973 -18080 -15020 -24194 -29218 -10000 -5381
14361 -5381 -7377 -5368 -11210 -19349 -19988 -11476 -21166 -20607 -22841 -25249 -6721 17634 17750 -16385 -24599
14346 -24599 -26219 -8378 6641 16425 30005 16187 15106 17103 13710 19013 32863 37891 35073
14333 35073 30858 33346 23096 10501 4796 7593 23178 20881 13621 -4710 -6345 -7347 -4656
14320 -4656 915 10174 11359 -4334 -14077 -2360 15093 38092 38972 19685 3891 -3932 -6294
14307 -6294 1859 3089 1413 21408 16491 -9108 -13494 -7912 -19314 -9909 19911 30157 29513 9432
14293 9432 -2233 8751 15740 7710 -9458 -27932 -22010 -2674 7813 5156 958 16713 22875
14280 22875 27231 27750 18867 21060 4102 -3838 3554 11156 9500 1383 -6038 -7505 -6224 2343
14266 2343 7880 14019 11248 -2167 -2758 -23516 -27886 -18973 3320 3993 5122 2029 -7980 -15411
14252 -15411 -15877 -9165 -13215 -17384 -5568 -3831 1049 -12103 -14590 -20082 -26042 -30964 -37557 -42146
14238 -42146 -19627 1274 5668 1476 -3124 -2994 -15112 -6544 7144 10373 -5821 -22002 -19271
14225 -19271 -12192 -3793 413 4918 -892 -18782 -23263 -5326 -1250 6192 6273 4652 12516 41138
14211 41138 37154 5252 -17256 -5939 -1474 -7630 -10746 -8980 -3940 -5092 -8351 -13323 2318
14198 2318 31014 43384 28093 13862 6378 6945 8809 -12529 -4883 -2533 -5509 -5190 12030 20213
14184 20213 7585 -2410 -5536 -7900 3211 8645 17642 24621 26036 8574 6366 2566 7083 19035
14170 19035 22107 14926 5984 8179 14607 7597 -6715 -10154 -17737 -10755 -960 -7675 -3006 -6546
14156 -6546 -11190 100 19346 32626 26351 23763 29360 17760 14593 7251 6434 12920 3021 -22418
14142 -22418 -12663 -5367 386 16432 28556 16973 -5177 -12246 -23336 -31629 -33187 -28471 -27315
14129 -27315 -26242 -8035 8420 -3681 -61 4420 1845 -16523 -14219 -5333 -2108 -3050 424 9758
14115 9758 23874 26458 14585 11894 1196 4300 6136 4147 1065 -2754 -1121 -963 8490 18850
14101 18850 1647 -26435 -19017 -11574 6276 9677 1255 1940 -6175 -9527 -9885 -3748 6052 9126
14087 9126 -6729 -21911 -9597 -7345 -16536 -28466 -19616 -5007 -1920 -12688 -9387 -11664 -14788
14074 -14788 12059 25142 19875 14441 5778 -814 -3706 152 -8841 -5121 -13060 -4791 12819 17433
14060 17433 10607 14083 14376 7818 -6850 -12847 -14587 603 12581 12432 3245 -16873 -22238 -14214
14046 -14214 -14455 4593 21017 18462 963 -3068 -61 428 -2812 -10668 -16223 -11432 -12912 -28287
14032 -28287 -27375 -25280 -19837 -22926 -19472 -22520 -15919 -16469 -21907 -18508 -12632 -12174 10007 13872 15586
14017 15586 4252 11768 9327 26019 38139 43691 35931 23330 18382 15607 5811 4152 4844 6760
14003 6760 6055 10066 18401 24748 8664 -539 -9794 -17978 -2048 4516 1455 -14984 -17475 -14039
13989 -14039 -13267 -3693 10009 12708 20026 18834 345 -10125 -484 19637 11270 -1439 1843
13976 1843 2495 -19214 -24826 -24756 -27430 -33901 -37135 -29935 -7098 6909 15995 15355 20920 22263 24857
13961 24857 24125 23911 20807 30970 28551 21516 32062 26005 19427 8605 5246 10602 6308 13204
13947 13204 30057 24873 25590 30053 33549 29735 4506 6228 15824 23449 4954 -3847 922 6354
13933 6354 4399 15266 12169 17630 18016 10942 -5392 -12345 -1203 7791 -2943 -9385 -15883 -11179
13919 -11179 -14453 -19084 -17928 -8720 -1064 -6927 -442 -5676 -27509 -30739 -24654 -28673 -29152 -13715
13905 -13715 10112 17530 25065 6031 6444 11580 16815 20457 21694 18258 14577 15034 11977 13117
13891 13117 32511 19700 11798 6237 -5615 -8460 -16018 -11217 8866 9294 7658 15118 16955 25265
13877 25265 19542 14114 22654 51207 41064 15185 10882 11570 6313 -1130 8775 -855 -4998 5334
13863 5334 3456 3781 -921 -14263 -7766 -9952 -2609 6887 8821 4393 -3442 -11034 -16873 -13893 -8775
13848 -8775 -12368 -11009 6411 8698 765 9945 16181 13208 21852 23942 12528 1329 2966 14769
13834 14769 7818 854 -16781 -8918 -2954 -7305 -8405 12426 17840 17187 14371 12366 12307 8222 15051
13819 15051 11417 1431 18622 45474 51189 41299 47549 54752 48236 26360 23769 13443 10607
13806 10607 -667 -6131 -6929 -7411 148 -9303 -18611 -14350 -4190 -5560 4180 4758 2643 -5064 -9370
13791 -9370 -3655 11470 13949 5539 -8702 6808 35147 20509 12066 6153 -7165 -11211 -19467
13778 -19467 -24027 -1231 13688 19134 21616 19130 18179 2457 1898 -2201 782 -7797 1480 19705
13764 19705 6998 20073 33598 14942 9152 3179 948 13505 23274 22895 37984 30953 33632
13751 33632 25051 -4987 -1250 20956 23553 26674 26509 13512 3127 4342 14525 2578 -4645
13738 -4645 4077 3877 10192 17336 5374 -453 -17577 -17354 -19018 -14871 5724 12267 -994 -16213
13724 -16213 -17472 4525 6549 -5144 10086 30598 28787 -1825 -16096 -14082 137 -8384 -15794
13711 -15794 -6296 -2308 -11128 -22254 -28295 -18762 2780 8974 7271 9836 25607 14523 12242
13698 12242 17344 -5345 -26350 -8529 2657 5695 -5864 -5369 -8435 -12646 -3753 -6092 -9094
13685 -9094 -5921 19990 22282 15159 5137 6182 6206 25886 39623 32512 10291 2663 -4158 -3370
13671 -3370 7347 16328 12780 20803 16425 10166 11282 23654 27130 4611 -10313 6998 17489
13658 17489 5685 -15813 -37958 -22921 -22304 -17869 -7635 16751 25704 10744 4166 13033 6351
13645 6351 7121 -4557 -1116 -6596 -10845 -5094 -17446 -16272 -17201 -9644 -8349 -2506 -619 -19910
13631 -19910 -15131 9121 16114 7749 -3514 -357 -12927 -10039 -2346 2235 5119 19129 16163
13618 16163 -7736 -5112 -12468 -12003 5734 11494 3466 -13499 -20141 -16578 -26916 -30412 -25350 -6772
13604 -6772 -11207 -13923 -15637 -6419 5636 -994 -507 1916 5726 441 -19802 -3376 -1770 1727
13590 1727 5955 -5391 -16468 -1659 -254 -5229 -7222 -266 11177 9979 17359 2343 -6451
13577 -6451 -9426 -6946 732 -3020 1762 8012 24851 44531 34564 18180 13070 11888 3534 -556
13563 -556 3184 -1758 9491 14352 4687 -3021 -590 -1939 -2658 2596 2292 15779 20443 6828 -13616
13548 -13616 -29903 -25889 -21286 -8429 3180 4770 8365 245 -10863 -27106 -21066 -4171 10734
13535 10734 14537 -1180 -19278 -19849 -13247 7840 13439 8554 17314 21681 11416 8242 14432 22688
13521 22688 22951 10984 5785 9585 25700 17346 7102 12228 8294 19453 28092 33694 35373 41000
13507 41000 40571 26414 17480 -6569 -22760 -30615 -30092 -10568 9885 10002 23355 7196 5964
13494 5964 18310 28463 26607 19537 15961 9285 9024 -14343 -11608 670 -401 -2027 -3059 -14291
13480 -14291 -26207 -11622 -8833 15931 24965 15181 15208 16318 8461 -1167 -9013 -21643 -32621 -12021
13466 -12021 -29 10325 -636 -9814 -12351 -10055 3876 12912 17586 8980 9568 11150 14744 26652
13452 26652 23820 11870 -2553 -10033 -4764 -4856 -7097 -17214 -16659 -6822 -642 -5692 1835 13543
13438 13543 28112 23748 11286 9279 19589 19071 8876 527 4352 11157 15356 23430 6236
13425 6236 -9975 -19025 -3604 -8531 -9099 -7495 17303 16727 8356 -13330 -27736 -38254 -23917
13412 -23917 -10183 -16290 -13981 -854 22119 15275 17168 19727 14463 2581 -356 9234 20880
13399 20880 18862 9061 18863 35957 56171 37156 9271 106 12711 11714 25465 38080 45869
13386 45869 54367 55814 68215 77717 86895 99419 103165 115736 145624 210959 337982 544838
13374 544838 867720 1404066 2111027 2640417 2278883 1487940 937070 613201 419075 291601
13364 291601 218607 180926 157318 143208 121123 116005 111076 85762 74785 62049 45489 35841
13352 35841 27798 18332 21345 34793 37478 48136 40549 29174 405 -17584 -6468 5464 13803
13339 13803 707 1630 -2666 -13254 -23749 -24778 -24160 -3386 20670 34040 20215 12455 15478
13326 15478 -6 -21186 -20046 -12993 2879 4456 -2544 -4277 -16523 -26075 -11939 8148 5060
13313 5060 6679 22675 8564 -248 -2984 3764 1954 -13838 -28515 -5516 9616 -364 -14742
13300 -14742 6176 26841 20227 -1842 -3946 1281 5161 14876 22431 14903 -5560 2052 9329
13287 9329 3753 -5320 8320 19605 18863 13578 19113 47171 57796 37157 26039 15774 -8018
13274 -8018 642 2088 11921 11328 12236 9083 3367 -8117 -9184 -9586 -11845 -339 -225 12277 31592
13259 31592 48749 60590 60324 55203 41289 16809 24840 26311 31479 50992 52208 47618 29773
13246 29773 23088 28236 34987 34359 18570 4828 8230 -9432 -12036 11669 4007 603 4851 -1795
13232 -1795 3211 18802 27061 42633 35460 26040 13272 23854 37884 59319 39150 25027 17338
13219 17338 5164 5538 10995 19247 21027 27968 52462 58742 64701 83559 83441 71046 41434 28558
13205 28558 31830 24965 12795 -5100 -26854 -35459 -30602 -29072 -18213 -1103 19734 20644 14450
13192 14450 -2449 -7748 -1794 20480 31476 37406 24140 7243 2706 14723 8499 9482 21307
13179 21307 17831 9057 3331 672 11766 11709 8695 52 -5114 -16500 -7022 16439 38465 35256
13165 35256 11540 73 1054 16698 22553 16573 20210 12268 -2734 2773 10709 31268 50543
13152 50543 52366 55599 65476 64426 44223 24422 18359 21538 33017 44040 30666 13521 23287
13139 23287 7344 -21230 -32451 -35614 -34139 -24864 -2918 3045 -5349 -13882 -5644 -1850 14362
13126 14362 31411 52852 63452 78759 84987 91331 90753 98014 99954 69087 44967 56592 65147
13113 65147 51130 33412 29836 2395 -24216 -28816 -6260 22207 37899 53562 47787 26573
13101 26573 19656 31055 24768 -15423 -112971 -173708 -156818 -140226 -125034 -90009 -61428 -34556
13089 -34556 2936 25706 21671 12617 -2327 4268 19833 48764 46230 53122 68361 80587 90122
13076 90122 88579 80892 67185 57617 40236 19086 17408 45584 52539 61258 83142 91636 88858
13063 88858 71819 74187 98798 143511 181149 209900 240248 219929 111849 35954 10388 -9779
13051 -9779 -32547 -41588 -29571 -14983 -32813 -45916 -24761 -14902 18132 54819 51436 41849 35577
13038 35577 32629 26545 20238 -3284 -9357 -3595 -20283 -18287 -10882 -1529 7999 10004 -4627 -20895
13024 -20895 -24588 -8742 -488 4603 11967 9974 4894 5650 6223 -8848 -37216 -50017 -30121 7000
13010 7000 42288 96934 154183 188952 224950 267921 275464 241436 193114 161195 165668 140930
12998 140930 104366 70849 48722 61898 84466 102834 116496 132070 143676 109350 45353
12987 45353 25855 35685 18022 39890 86006 127257 144791 148446 172779 212679 259679 271722
12975 271722 273098 269683 260123 250143 222900 200108 216699 236014 265535 288321 297411 282822
12963 282822 298367 322596 340823 357084 386545 436090 492859 514028 518707 537068 554127 572825
12951 572825 615023 666360 739855 790070 781316 791570 852878 913023 994904 1068057 1146107 1279542
12939 1279542 1393187 1454339 1478459 1456568 1445466 1525178 1692188 1857126 2045860 2277441
12929 2277441 2513911 2754430 3041334 3370927 3783633 4208092 4611687 5166863 6042213
12920 6042213 7293014 8976106 11122671 13234330 14651608 16366660 19240855 23818097
12912 23818097 30816498 41701953 59557085 90750727 147249692 243043043 377595193
12905 377595193 498135472 456068730 298751117 185737976 121784555 84570131 61426004
12898 61426004 46471819 36306356 29152345 24093174 20584282 18273697 16619853 14712931
12890 14712931 12441227 10562097 9162530 8021448 6968283 6122978 5552738 5075541
12882 5075541 4632721 4266680 3938854 3665200 3440151 3222830 3036456 2856950 2601675
12873 2601675 2289012 2038531 1868305 1774492 1736125 1672751 1585132 1514032 1487270 1426739 1342670
12862 1342670 1238699 1144523 1121301 1111755 1087487 1043791 1009714 975609 921708 880514 871339
12851 871339 873295 844267 817804 807517 768594 733174 705378 688243 685409 674224 671508 675374
12839 675374 703220 717740 702378 636262 558621 527553 517222 506176 489993 488401 499618 516176
12827 516176 535047 557857 589265 565367 521405 509044 487198 447756 420186 420084 427783 441022
12815 441022 473311 482128 476746 469115 473672 490394 486620 464654 412223 378759 372569 391604 446164
12802 446164 501247 550347 600818 631606 654145 637280 556467 489779 444518 417680 394888
12791 394888 376034 364581 355282 344209 330955 323043 329705 347121 362130 373021 363219 342342
12779 342342 290978 257645 254280 261687 272477 264963 240767 208069 187070 180948 171137 172841 197047
12766 197047 208791 219319 220685 244208 258536 248759 241953 243837 240582 211147 160068 109415
12754 109415 10613 -84608 -65094 2847 54483 79870 93545 80268 70933 75966 87103 90119
12742 90119 89592 99357 109874 110303 115289 113267 99936 76786 73294 74403 88297 86644 81985 87733
12728 87733 106791 126514 127355 118344 119552 114210 123967 119449 150452 204939 241130 273863 300086
12715 300086 319568 338510 314742 220730 170770 168251 192482 216528 212238 197738 200546 203588
12703 203588 184732 166141 156753 168791 161413 160673 148992 118691 105540 108658 129028 130121 113403
12690 113403 117301 114247 94772 74730 53037 68072 88591 82841 76467 68329 89350 124763
12678 124763 122881 104915 100268 106288 115034 131502 129850 110481 92107 79417 76423 79238 86153
12665 86153 90157 87653 77879 83871 94783 80727 40233 37005 43146 54053 62579 65435 69935
12652 69935 75843 74735 74011 75002 60626 55694 64647 58275 51542 66335 74751 71119 78460 87890
12638 87890 86336 96395 84764 90639 83239 73149 55413 47073 47494 44532 51350 44969 33748
12625 33748 33023 19408 23869 37475 52556 62119 59534 49762 47718 33696 33544 34553 65080 74741
12611 74741 70477 64096 74486 67615 60832 58315 50217 26717 6103 -38124 -53487 -39544 -33988
12598 -33988 -37817 -5518 27007 29052 31524 32296 22964 29546 26886 23658 -157 9334 34537 33419
12584 33419 41342 24521 27339 46313 24980 1662 6163 23337 38758 40135 22975 29196 37840
12571 37840 37849 34465 32699 35270 35147 22141 25313 33635 38928 34413 38179 37233 36821 36316 30945 8728
12555 8728 -8050 10402 14494 16887 28949 11358 1551 2131 11997 29302 34673 31898 20639
12542 20639 9733 19175 34539 30149 15662 17882 37660 44507 37570 33819 30463 20552 11595
12529 11595 7435 11310 23496 51052 76737 79355 61217 52939 51972 59436 57916 47919 39968 30632
12515 30632 49687 60406 51352 39698 42127 57060 64361 57041 51771 33015 29247 48727 71803
12502 71803 62891 54467 59880 54512 56511 41532 32890 31675 33094 29890 26215 33947 44827 50146
12488 50146 47902 38961 20632 19288 23088 20972 48819 62466 66101 56652 51813 38951 32182
12475 32182 25919 26900 24038 33111 42752 37482 37797 52458 51902 47668 37232 23024 5400 3098
12461 3098 13492 26238 31237 43250 35948 32453 35947 35606 33284 38348 27519 35603 49376 64063
12447 64063 99742 107809 87069 69273 72646 102763 126337 152918 164333 183068 227127 315815
12435 315815 463829 715725 1154878 1808736 2510950 2587052 1845683 1166540 772148 532765
12425 532765 384491 285367 208223 168942 134788 118472 124957 113265 114358 101392 85288 73286
12413 73286 60554 46647 55850 52970 55709 59677 78632 90260 75888 36990 31005 40910 31679
12400 31679 27549 43111 49534 31544 22181 24664 27606 27932 21182 13716 12799 -4571 -5168 14426
12386 14426 32238 41400 30079 14673 9825 -3358 1470 2634 5406 7567 13889 22458 25172
12373 25172 13399 2478 -4220 -11778 -6105 22239 31481 23813 13984 25584 41639 37496 26143
12360 26143 23696 27625 34146 41925 44112 37723 35544 44739 46332 26172 26469 24831 14608 13482
12346 13482 31035 52354 44093 40128 32202 12660 6855 8201 9756 14810 11461 2922 13508
12333 13508 22532 16224 -1468 4793 9478 1362 -14387 7151 28995 21137 -8733 -13073 -8208
12320 -8208 -711 24245 30789 31905 32509 33704 41645 44425 28337 3573 10944 7256 11272 20750
12306 20750 19888 -3154 -16195 -13901 -18060 -29926 -22932 -20756 -12602 -6820 -2291 11515 28570
12293 28570 24013 33639 40817 28585 24976 23779 25238 34903 44320 47923 31369 28283 29611 37458
12279 37458 48476 40125 28101 13157 16482 15998 20227 12610 -4360 9643 11529 2594 11478
12266 11478 38298 38218 24834 25180 25597 18072 22333 25154 15460 16284 7222 -3206 4351 9906 25638
12251 25638 35043 26230 8453 24576 20742 19773 12816 29199 34592 32326 30856 24579 15966 8525
12237 8525 10607 28265 31670 25470 28382 21143 12864 8055 26284 26817 30735 22763 3692 -11433
12223 -11433 -2673 10614 15756 23954 22749 7166 -7247 -6877 -17777 -26973 -26168 -13848 -15023 -21303
12209 -21303 -13491 12469 33831 37626 16830 6293 6245 3865 3199 15737 22523 24533 39160 42402
12195 42402 23043 16302 13003 20683 20979 18947 9702 3369 -1414 4643 23930 37926 31740 20067
12181 20067 40173 37565 34585 36672 39218 32956 32013 22303 18650 16613 5957 -7730 -2226 5763
12167 5763 2021 389 17649 13728 6274 15746 11535 7395 15645 35610 37223 19384 4928 -194
12153 -194 -734 -6589 -1705 -13520 -5649 18036 20312 8012 3551 -3077 -5081 5016 6685 2432
12139 2432 -11809 -12033 -13731 7055 35710 67266 80142 97520 99011 81637 76402 50997 43551
12126 43551 46872 42601 11677 2826 15022 10895 14154 20061 19734 8403 8405 11458 3975 16484
12112 16484 13532 9776 -1670 256 3745 12403 13360 6467 -2977 -13833 -21008 -9093 -2822 2917
12098 2917 -3215 -9465 8076 -3419 -1488 -3278 -9072 -23895 -27313 -28913 -31931 -10082 5503
12085 5503 9535 10672 12428 15942 28864 24819 21192 17925 12898 17413 18673 6314 3724 11838
12071 11838 13723 -3072 -21095 -12917 -10264 2586 -4309 1652 2679 9796 -5396 -23120 -19032
12058 -19032 -14538 -22567 -18970 -9570 8651 10137 -6901 11900 35809 54603 45037 18485 10362
12045 10362 27317 27548 1902 -23185 -30438 -15506 13668 20884 13634 12476 -5727 -15117 -18542
12032 -18542 -16874 -11643 -8742 -12878 -14487 -22645 -18427 -17298 -18886 -21061 -29057 -12005 13643 10139
12018 10139 1869 4694 -9982 -29800 -17253 2648 15546 32211 37505 36040 43583 52617 45304
12005 45304 23558 14567 6354 21023 32370 30716 34087 33525 28124 16706 10925 13510 12429 12375
11991 12375 20543 14912 -66 -9244 -15873 -8202 -6276 -6465 -23008 -44399 -30185 -13352 -14568
11978 -14568 -11856 -29440 -16595 -25356 -25100 -10066 15039 20002 30257 27595 12955 8627 10898
11965 10898 12924 14900 12062 9058 22283 15640 11499 21974 24363 11886 17904 24289 19420 10984
11951 10984 7888 13787 22869 20623 24579 24513 19447 15918 16445 2449 4104 10123 22642 21934 25649
11936 25649 25995 15923 -4853 -18580 -16841 -22996 -25409 -17094 -8850 12006 18092 5286 -3059
11923 -3059 2249 7206 413 5664 8721 15115 32218 25497 23975 10104 16583 2947 -24792 -20344
11909 -20344 5497 19020 23803 18378 13667 1674 8316 -11599 -22804 -466 5519 -2120 14406
11896 14406 15120 14724 11413 5696 11675 23563 26024 24678 31031 20561 15113 21902 16073 18927
11882 18927 21304 12323 12124 35504 29458 3891 18546 15724 16713 27435 28808 25874 38921 41584
11868 41584 34856 8829 -3958 -6788 2213 -7423 -5748 -5921 -1466 9711 19089 23506 20077 9185
11854 9185 7379 -151 10089 24453 23395 10699 -9696 -14917 -7172 -3865 5017 -2137 284 23435
11840 23435 19210 13789 3578 -6392 -10198 -10036 -11969 -1307 6610 7544 -30 2951 -2487 -1029
11826 -1029 11515 6053 -4640 9964 15190 4754 -2488 -10645 -23084 -23453 -19006 -13833 -17335 -12682
11812 -12682 5464 -6141 -18531 -21164 -15546 -7698 13500 10096 -1250 -1419 -51 851 -3991 -5844
11798 -5844 -7171 -5050 4772 1017 5788 2995 7825 27231 37657 26618 28883 40706 31769 23032
11784 23032 23119 30530 31927 27812 20038 -705 -22442 -30007 -16887 -8735 -14714 -21446 -39873 -33228
11770 -33228 -17941 -10883 -2185 12776 9177 7125 15521 15647 -3004 -14847 -17533 -16696 -6073 3143
11756 3143 11338 -3793 -4889 1134 -9196 -18864 -9553 13242 18291 22295 20430 28884 38356 30282
11742 30282 24511 5992 -9318 -7542 -1683 4770 6702 2758 1271 1251 11909 19196 12112 27363
11728 27363 28606 26339 24094 17090 12667 10234 11787 7293 7715 847 -1305 -8830 -7366 -1926 7290
11713 7290 13395 18519 3372 -10078 -5728 -5735 1377 14720 29046 12423 7893 40179 47337 27428
11699 27428 -4252 -5917 8296 10873 -2598 988 -556 9063 15807 15824 -2510 -7130 -189 -1370
11685 -1370 -6842 -5972 -16407 161 12629 2211 -9423 2654 32738 29004 23479 -4142 -15551
11672 -15551 -17558 -1862 4496 -106 -3899 -15080 -8325 1992 3154 -6538 -17005 -10634 14215
11659 14215 18269 34881 22431 8558 26646 20124 -496 4113 8137 8434 10942 17343 11111
11646 11111 -483 -1328 416 9228 4619 2786 -8378 -14871 -25193 -21471 -13531 -27415 -30528 -19388
11632 -19388 16029 28440 36476 22707 9135 -91 -5850 -9553 -6067 3616 -3873 7438 5026
11619 5026 -12671 -26338 -16695 -2257 6153 12024 2097 5526 16583 20289 19117 8317 -13409
11606 -13409 -8890 -1932 2596 -7189 -10308 9163 21883 6459 15719 20769 21651 28890 36062 19490
11592 19490 5402 8545 2381 15901 32364 35708 45233 32381 4258 4173 5090 13472 27782 15428
11578 15428 9392 8040 3689 -4073 -5269 -12498 -24097 -19134 -11028 -15505 557 18741 17365 253
11564 253 4337 603 -3848 -2211 -17666 -17761 -6627 -10269 -6219 -14341 -19939 -18573 -21243 -27705 -15854
11549 -15854 -12873 -6901 5023 663 -1177 1037 -4774 10518 11118 -2411 -18181 -722 15577
11536 15577 7634 -353 1652 9321 18304 21166 10050 5278 -629 18522 25275 11627 15921 23105
11522 23105 18768 10733 9116 13470 13981 1923 -3608 -6949 290 7297 7799 22286 -1797 -14701
11508 -14701 -17492 -4794 15249 14101 16338 1617 -12981 -23084 -20552 -5582 7004 5066 -15258
11495 -15258 -22189 1328 27027 22908 3960 8808 17170 3460 6120 5634 7297 -2254 -14787
11482 -14787 -5995 7538 11668 20068 26097 14971 2165 1757 -3035 1392 18792 18088 5387 -2299
11468 -2299 -6416 -1173 13116 4740 -952 -7187 -2992 -2639 -10920 -9074 -3269 -654 -7302 -1281 5854
11453 5854 1936 14814 5018 -2773 -1430 9928 15972 13431 4556 -5527 -8795 3823 -6191
11440 -6191 -1126 6428 -9207 -5798 20545 20772 18754 8237 -8653 1928 3880 5247 -12186
11427 -12186 -17835 -11850 -8475 -10302 2331 -14596 -13069 -21840 -23653 -4576 11226 19694 22826
11414 22826 33684 22448 4599 16955 24877 27110 28563 26268 25518 17130 3378 313 9757
11401 9757 3199 3264 5334 29055 21042 4188 5700 14522 6565 -7109 7781 10120 18725 16575
11387 16575 20883 8343 3825 -6688 -9988 -18172 4653 28982 26944 14645 497 -1376 1030
11374 1030 -2211 -12827 -14201 -19600 -15336 -6715 -12633 -5260 15172 18908 5593 16913 23082 24473
11360 24473 6839 -1640 9091 9894 16452 16703 22253 19924 11234 8202 -6246 -13505 -11982 -9709
11346 -9709 -12706 -23194 -30648 -20918 1346 18243 16957 4134 -6504 11084 14189 15898 20581
11333 20581 21669 18904 19184 16070 6720 -3360 4537 14808 12676 26013 10158 11553 25453
11320 25453 18267 3086 14393 22578 7309 8428 17910 17921 10730 3335 -6047 -16039 -11680 -1286
11306 -1286 -7254 -9423 -1788 14360 22322 13486 5702 -723 8824 17359 2710 -946 -688 3426
11292 3426 22284 13769 -977 -938 -4222 9120 8833 19370 22839 14860 8385 9705 12731 25010
11278 25010 30904 32974 25698 31133 24551 4542 5159 15769 9193 7825 28365 23729 19725 44319
11264 44319 46019 18741 -4177 -16483 -18126 -8952 -8962 -8138 4096 -2209 714 -18185 -18998 -26525
11250 -26525 -28378 4811 12483 12146 10776 2506 -1809 -2876 3078 -6967 -9274 -14020 -25205 -16534
11236 -16534 -9793 -15005 -14030 2403 12633 24954 16980 8671 -3713 5649 26195 17156 15834
11223 15834 21930 13964 22406 52485 52774 36136 11278 5418 8136 -14771 -25272 -17949 -10495
11210 -10495 -1452 3927 -8007 -5299 -6691 -5676 3416 -6744 -13427 -5786 -3164 -431 -4279 11426
11196 11426 7110 1864 17902 37945 20536 12161 11822 7692 6853 9862 -9566 -22534 -14848 -3657
11182 -3657 4988 10536 10028 10601 4304 18009 15440 -8412 -16780 -12968 -878 -6317 -26521 -22100
11168 -22100 -6974 14705 29358 22316 7777 2600 -5040 6131 15867 19815 16514 -1145 -8596
11155 -8596 -16453 -25517 -16627 -14916 -19469 -23069 -25810 -38200 -26482 -9181 -6016 4663 11630 15614
11141 15614 -7558 -13178 -6417 -6714 -16047 -24433 -9681 21626 26815 3210 -9362 6851 24071
11128 24071 26053 37095 35555 20458 11754 4749 266 -4266 2664 4532 12445 18361 6724 -28
11114 -28 5915 -910 -9572 128 2350 -18280 -30593 -31470 -27821 -9621 -15977 -5288 -4638 -15371
11100 -15371 -19042 -20202 4334 20600 25379 15449 -9936 -24488 -12303 3762 -1737 -13958 -8761
11087 -8761 -25448 -25819 -25606 -29567 -21599 -22826 -10739 9004 9632 14214 19026 8738 8945 6051 15056
11072 15056 6822 4248 -8450 -13341 -15230 -15300 -25915 -9372 9367 12886 17290 4344 4321 -5437
11058 -5437 -6195 -4831 -4326 457 1543 -9751 -8678 -25763 -31651 -19453 -11461 -14722 -23480 -18245
11044 -18245 11354 9933 -20616 -21158 -20127 -32971 -29021 -15939 -1414 13955 3708 9903 19571
11031 19571 -10726 -23137 -16118 -36 4396 -2471 -6645 -10742 1053 3329 -13975 -11799 -13575
11018 -13575 -12018 -5339 -6556 -21081 -19677 -11297 19956 22407 20373 16226 25131 22916 17263 19229
11004 19229 7281 -27474 -24732 -1397 18317 20500 7877 5495 -5574 -4415 10693 13916 11703
10991 11703 2180 -4511 -12496 -4422 -3924 -7902 4229 12618 5601 -786 -1580 9647 9375 15686 -2624
10976 -2624 -6746 -11562 -15372 -7281 -8686 -6090 -15240 -15492 1406 14806 30806 25853 29474 29380 36881
10961 36881 32616 27974 17123 7778 -12698 -11698 -6345 -1561 -5530 -14534 -8874 -11287 -8420 -2777
10947 -2777 -4610 -12786 -15368 -23916 -5851 5773 -9613 -6408 -1908 3991 24177 17778 -6757
10934 -6757 -11508 5111 9245 16468 28431 28501 26779 32488 25894 19732 11311 5190 11812 -2601
10920 -2601 -9574 -586 10194 11699 9777 -2742 -10411 1778 -2558 -11553 3461 7034 6658 10178
10906 10178 14655 1 10351 19116 20679 11252 13585 22377 -2787 -1297 -5104 -858 856 1607
10892 1607 -1513 -22867 -21552 -340 13489 12401 9740 7378 -10419 -18229 -12098 -4712 1357 27028
10878 27028 44756 38549 23860 17184 8358 -3297 -7871 -1121 -782 9835 20011 29665 25328
10865 25328 10773 717 6817 6455 16891 26334 35086 17587 11896 3611 -634 3025 9962 -3646
10851 -3646 -2827 -8648 -23854 -23429 -7825 3435 5550 -367 8850 25959 32915 9641 9841 24873
10837 24873 24433 12840 578 -11084 -14668 -33614 -47065 -34325 -29321 -26248 -22050 -26531 -17634
10824 -17634 -26691 -32808 -26224 -19973 -21639 -21250 -33596 -39868 -28261 -29214 -10050 2137 19 5034
10810 5034 -3041 6449 10691 21492 21300 13369 19183 8958 14829 13082 2719 -6880 -15144 -12725
10796 -12725 -15040 -15601 -10173 13740 29426 19444 -5581 -13725 -18416 -13671 3478 9884 20844
10783 20844 16380 4728 1293 -10498 -9887 -5763 -3219 -11843 -14382 -18356 -15206 -21070 -25022 -16176
10769 -16176 -8499 -5950 -11438 -13214 -27899 -29734 -14932 -3485 3043 -905 3431 14857 28653
10756 28653 24991 17137 -1030 -19640 -14972 -11555 -22779 -21432 -22037 -16367 1896 -2672 6363 20477
10742 20477 15471 10625 7612 -8362 -3909 -15438 -22757 -12879 2460 -1712 -11942 -11170 1487
10729 1487 -5475 -2046 -285 1251 -2915 3378 18976 5710 -9915 -9962 -3855 -8623 -2867 8954
10715 8954 -4296 -6564 -8368 -15025 -11346 -12697 -11472 -16838 -7306 -4187 -4072 -18524 -31231 -17170
10701 -17170 1180 15753 -2842 -26177 -26085 -23677 -15771 -7391 5633 20445 21970 25384 18530
10688 18530 1218 -6388 -6576 -3527 -16788 -16588 2820 -7761 -11068 4681 552 -2634 -5723 3161
10674 3161 -6745 -4944 6795 17346 22638 27405 25726 1159 -9770 -14348 -2574 11195 25209
10661 25209 16602 19592 18327 15581 13702 5949 -5914 4783 -9422 -16357 -14132 -17109 -22928 -29315
10647 -29315 -31224 -31316 -18085 -20658 -18714 -19605 -12266 -15658 -14145 -1151 -3625 -13804 -14239 -28956
10633 -28956 -22201 -16737 -18346 -8684 -16252 -36905 -37078 -32131 -37887 -18073 -8768 -7945 -19202 -39721
10619 -39721 -34308 -15267 -10086 14355 3242 -14529 -6825 1794 17664 18400 3476 -9622 -8750
10606 -8750 -1006 509 -9008 -9230 -6539 -13180 -19819 -4613 -4928 -17887 -7261 -23202 -34329 -30080
10592 -30080 -27738 -25822 -25471 -5840 -4665 -9576 -9660 -1954 8314 944 -19745 -11036 -14937 -22526
10578 -22526 -18058 1624 1174 -15013 -16785 -5119 -533 2673 1781 14901 15619 3987 -1651 -12034
10564 -12034 -19329 -22091 -16696 -191 3816 -5384 -6517 -16444 -7294 3399 -1121 3471 751 -17007
10550 -17007 -20473 -10751 4998 11981 93 -17586 -16260 -10528 -18275 -14934 -5493 -284 -8988 -5694
10536 -5694 -32199 -43383 -33558 -38991 -42717 -29691 -5253 -10173 -21140 -25391 -14926 -9899 -2000
10523 -2000 -487 2451 -2953 -3380 16541 34862 32210 21935 18139 14885 14792 6123 -5341 -11345
10509 -11345 -19493 -24045 -7760 -3173 -5293 -1180 3342 12370 27411 11835 -9440 -20469 -17955
10496 -17955 -8239 -16799 -15075 -4028 21941 27870 11977 24127 42031 29114 16082 -210
10484 -210 -22256 -24346 -13332 -1436 9779 14447 2683 5714 9875 13833 31316 29180 9099
10471 9099 -9480 -15746 -17002 -21084 -17592 1461 -17417 -18767 -9251 -2761 -2338 -17560 -19541 8868
10457 8868 8793 8050 -8841 -15735 -9947 -91 -9070 1593 9444 -7107 -26738 -24160 -3938 11325
10443 11325 19715 15423 -15176 -28423 -19704 -11204 -6931 462 9722 -5369 -21454 -24180 -14232
10430 -14232 -7292 -6422 -8112 -17307 -21392 -29272 -20727 -16908 -19306 -10035 -1339 -22086 -26682 -21953
10416 -21953 -21017 -21536 -8420 1723 1581 2311 -13173 -19301 -3707 8310 17054 21986 15491 9547
10402 9547 13997 20426 18782 9976 6379 -4866 -19470 -16426 -9768 -3392 727 -3545 -8478 -5003
10388 -5003 10008 681 -7954 -7055 -7205 -13519 -2282 2847 6447 18182 2348 11213 28475 42592
10374 42592 31565 24899 15382 -604 -25268 -20209 -3157 21627 30573 22652 19793 25126 23559
10361 23559 23606 37811 40683 19126 15422 15605 -8307 -9707 5400 4967 580 -461 -16314 -11917
10347 -11917 17235 25278 24594 16051 2300 2034 9480 1120 -28885 -27146 -12396 6786 12400 22907
10333 22907 43873 32857 19027 11792 22760 8731 -4542 8519 16022 958 -19718 -1441
10321 -1441 -2098 -23414 -41499 -40471 -35056 -37854 -10363 5435 12475 21571 5578 10753 25052
10308 25052 20869 22931 25883 34259 23085 10252 4756 -2688 -2908 -6926 -15090 -4530 -1561 18018
10294 18018 19457 1565 5020 11923 10894 4734 5320 -8316 -31616 -20027 -2690 8262 17588
10281 17588 12615 5671 -3193 2967 4265 13808 11760 3973 8119 8090 2907 10894 16608 5590 -4666
10266 -4666 -577 11060 21040 12396 -6897 -6197 6312 -6522 -15033 -1829 4572 -9964 -17467
10253 -17467 -18366 -18640 -7412 -5743 -11384 8952 11941 1676 -7251 2180 893 -1210 10437 8471
10239 8471 -875 -4302 -6283 -12299 8935 22649 17641 7816 8926 22051 7350 3638 -13701
10226 -13701 -3672 11463 25709 15549 18467 22376 7813 -12713 -24067 -18097 1647 4771
10214 4771 14367 16387 -4071 -1629 10231 18705 19786 21682 -2885 -19142 -20594 -5793 6622
10201 6622 -448 11557 12387 2373 15947 26934 19586 15501 7214 19473 26487 23066 23336 32591
10187 32591 5051 -18581 10209 16537 8829 -610 -14370 -9974 1499 -8173 -11185 -678 1990
10174 1990 -6072 -11908 -11047 -10719 -1532 2756 10597 11560 10407 184 1044 -10276 -14453 -13128 5550
10159 5550 17448 16457 5855 -15119 -24778 -20225 -3322 5655 -8109 -4754 11211 10265 18711 1442
10145 1442 -5097 -8801 -1172 -30400 -48699 -23115 -8086 11743 30872 25658 17747 11979 16934
10132 16934 16601 3296 -15884 -15143 -24290 -17638 -9692 18160 14802 18804 11006 -652 -7152 -3736
10118 -3736 -6440 -14606 -6001 19539 12681 4305 -2881 7730 16079 13974 1220 -9299 2418
10105 2418 -4650 -5998 2200 -10109 -16208 -17152 -14692 9310 26217 7985 5055 27315 27603 7507
10091 7507 -3510 -13580 -32683 -22960 -4403 17266 11792 5488 609 14585 15018 -2151 -4919
10078 -4919 3654 9893 -782 -34222 -18356 -8214 -14 -9016 2844 -771 -4157 1745 -23025
10065 -23025 -38716 -19932 -22025 -15506 2670 -14364 -12063 -1269 -8698 -20634 -15744 17408 30028
10052 30028 28087 38825 49296 75664 123524 219839 376765 596749 747057 561492 311232
10041 311232 175429 108585 72394 54736 36574 20194 27783 17232 -2447 -14717 -9423 -5999
10029 -5999 -4622 5038 -8713 6756 -7699 -21795 -8917 -5238 486 19681 13013 4812 5163
10016 5163 3331 -4557 8814 7114 -5133 -17445 -18904 -7237 8688 9020 2137 1314 10789 21528
10002 21528 17899 9616 15020 16663 13163 8805 9313 -6018 4066 15939 8873 -12369 -23210
9989 -23210 -4026 -7363 -7790 -12542 -10717 -5718 -1427 -8905 -19594 -26230 -12951 394 -9789 -24205
9975 -24205 -11913 -5869 -16767 -17380 -26520 -14259 -5800 -1221 -2231 -8012 -1869 2927 -9620 -13779
9961 -13779 -27547 -20966 -2399 -145 -16664 -26694 -27618 -11685 -7256 -11281 -10970 -7260 -3311 -3641
9947 -3641 -3506 -4873 -3335 5757 2537 -2883 -5268 -13859 -4146 4792 64 -11978 -7084 7164 4323
9932 4323 -7835 -23122 -20986 -7989 7096 14044 4940 18545 12633 7921 16755 12714 -13735
9919 -13735 -17106 2089 17292 4647 -18632 -20920 -4711 -3954 -14544 -14758 -21557 -18914 -3765
9906 -3765 7715 -11933 -26414 -27231 -30359 -6308 11064 4672 -24244 -15619 -20231 -13206 4687
9893 4687 6323 1061 -10709 2334 1935 8808 15015 18583 9749 10536 11917 11591 -5624 -28730 -12163
9878 -12163 -7460 -9842 -8053 -11172 -6136 -4224 9829 19367 24137 6098 -5326 744 -12957 -11760
9864 -11760 2033 34051 26286 25018 21041 17305 7707 19790 25031 369 -14868 -21775 -10972
9851 -10972 77 -1165 -254 8100 2394 5329 4127 874 -10717 -18187 -14189 -923 8870 20076
9837 20076 33309 20475 9302 13336 -2580 10501 13471 2701 1244 -1490 6251 -12728 -21404
9824 -21404 2400 13886 7897 8303 16790 2177 -5490 713 -4605 -25218 -30320 -30362 -21041 -18390
9810 -18390 -11911 -1433 -4560 4926 3802 10188 20294 5007 309 4196 3605 -8443 -12906 3095
9796 3095 20482 13949 17830 10168 -1479 -14695 -21174 -8409 -6768 -14614 -23016 -2903 10100
9783 10100 17027 16480 15540 21852 8987 -1546 4370 4113 5428 10348 7105 -6980 -11488 -14182 -554
9768 -554 12967 10524 -20665 -26078 -14913 -8613 -3894 -7666 -12044 -10717 194 11121 -4079 2934
9754 2934 1678 -5151 -11987 -21425 -24638 -19044 -19312 -31795 -17705 -7612 -2652 3918 -4411 -11048
9740 -11048 -10317 -2882 7181 11514 -2212 -18786 -18808 -18812 -11118 -20894 -3191 10664 13526 9266 -8758
9725 -8758 -25591 -33927 -16035 -8759 -9739 -5534 5465 26105 34590 29419 13408 4095 -3617 -3778
9711 -3778 5252 9706 18780 21627 16174 10968 7811 5516 -11455 -12947 -12305 2476 -6227 -3074 10236
9696 10236 -2559 -6612 7459 1303 -7538 -6002 -14291 -18839 -89 35570 33861 14126 1195
9683 1195 -16920 -13870 -21287 -35571 -32328 -20018 -7325 5008 4141 -1008 12853 12832 10504 16906
9669 16906 19147 6310 4468 1383 6107 -2953 -20498 -5666 6658 11337 6563 19750 12595
9656 12595 -11873 -21118 -39209 -39524 -30162 -24982 -21054 -24509 -6960 -10658 -8793 10658 35494 50106
9642 50106 36470 21731 10612 11886 10320 -3408 -4544 8901 1858 -6899 -9448 -1414 -449 1887
9628 1887 7568 10383 17031 21568 30571 17712 3432 -3305 -5194 -3826 140 -10657 -5358 -12442
9614 -12442 -20523 -6658 7474 3092 -14313 -36026 -19308 1327 1493 6404 7409 -6804 -15732
9601 -15732 -25057 -10323 7526 15387 19974 17010 3415 2184 10493 -12042 -16093 -20347 -5833
9588 -5833 10038 18730 9767 -3999 -10466 1430 7979 21262 25364 15197 19957 9458 -3371
9575 -3371 -12270 2439 19804 -284 -22988 -18239 -15170 12147 24346 23577 13213 -2206 -18293
9562 -18293 -22122 -32997 -19569 -20401 -27938 -14775 -11572 -11306 -10369 -4440 -10492 -21715 -18670 -21140
9548 -21140 -13327 -17608 -16409 1148 18663 2944 1799 13605 4163 -16100 -6817 -798 -4807
9535 -4807 -8244 -9947 -15056 -11464 5176 5700 7737 11210 15796 18927 4322 -6191 -3007 -13431
9521 -13431 -27942 -25289 -18686 -15755 8672 17997 10052 5080 -1991 -14225 -5618 -6121 -10021 -2208
9507 -2208 -709 -2426 -5214 -7045 -8914 1899 8512 17992 27100 25825 17805 8385 -5805 -20540
9493 -20540 -21296 -7321 87 6375 15207 11765 10883 8881 18283 39099 39199 17165 12479 7019 -3382
9478 -3382 -5778 178 7663 10336 4211 21851 14573 8755 -409 -7670 2718 3315 -730 1573 -210
9463 -210 -4486 -13241 -18259 -9506 -7054 -918 10521 21272 14140 7757 -2868 -7515 -804 3870
9449 3870 -8265 -5831 7835 15501 13280 -747 -2756 3456 2952 14776 23021 19507 15 -14086
9435 -14086 -3358 -586 -9719 -11460 -6012 -2617 3561 4830 -1161 -22984 -19897 -11224 -9602 10716
9421 10716 13176 11905 -4227 -12336 -12726 -16223 -9142 -10420 -10084 -4757 -11293 11380 5571 -3113 -2727
9406 -2727 -1839 -4526 -3797 -2142 -9440 -6412 -637 -8687 -14698 -9737 -9659 -13076 -3831 11691 14269 20373
9390 20373 -11533 -28266 -18431 -738 7777 26280 39010 17050 14362 19759 6318 4291 3032
9377 3032 1603 -5143 12333 22833 13970 9424 8012 4561 3753 -1583 -10783 12160 19252 7223
9363 7223 6924 15739 -2877 -19633 -17901 -17916 -13305 -15991 -16391 -6090 17584 9945 8576 9130 1773
9348 1773 -3214 9032 30946 17458 -12491 -10617 2655 18523 18202 6839 -9461 -13733 -3019
9335 -3019 -20079 -20072 9703 28593 12499 -7340 -26954 -13477 -10656 -28876 -22885 4110 -2456
9322 -2456 -8878 -2644 -19839 -18578 -13786 11622 30525 22996 17969 14182 11443 6860 -10535 1460
9308 1460 -4598 -3614 910 7118 26933 20132 -300 5553 10142 7733 18441 16639 -5508 2199
9294 2199 10567 1700 4135 -8532 -4488 9849 13113 -5815 -12638 -11750 -4448 2801 -8394 -30914
9280 -30914 -36325 -20587 -21350 -20266 -12159 6910 34 -1207 22931 40745 32814 33203 28777 13283
9266 13283 16715 34622 38696 31786 15556 20325 32707 47506 47659 36865 24046 17744 11835
9253 11835 -2136 -4807 -4643 -2487 -1870 27628 43734 42302 50564 40402 34288 27358 26558 5843
9239 5843 754 21814 32284 12598 3957 12764 2155 -5208 -5504 2891 -5951 -222 -8111 -26732
9225 -26732 -20023 -14085 -3590 7240 14393 23268 32694 26392 12782 837 1696 11181 18728 16693
9211 16693 18628 8079 17440 37637 44845 34830 38896 38505 51468 35920 37271 48331 61239
9198 61239 44808 34407 40504 51422 42597 38502 32731 45263 48924 57452 62485 72646 83962
9185 83962 87085 73166 83491 83607 56472 53133 50566 61822 71299 85109 86310 82985 75194 86213
9171 86213 109478 112838 106153 110936 112681 109084 127355 143112 137902 136063 137252 150507 149001 158510
9157 158510 157366 156674 157570 175849 182070 184353 206060 225795 254916 268219 296643 324121 343164
9144 343164 349549 375181 414926 448429 501372 547580 598027 641836 675249 716400 782627 856338
9132 856338 915932 971476 1031571 1101591 1181867 1221412 1273691 1325671 1381550 1411722 1422738 1408986
9120 1408986 1389214 1352356 1298737 1254877 1189880 1123716 1067456 984141 913455 865075 815846
9109 815846 762090 689505 629258 586690 558105 512930 474770 438053 408574 383083 369311 365051
9097 365051 336996 292800 261171 260954 267501 253852 241285 227640 206477 201538 191709 186174 165037
9084 165037 131765 130199 137023 137280 134736 127387 125848 117678 100984 106473 110819 111175 88044 88729
9070 88729 101049 114572 113755 98974 84608 82544 92084 91414 97295 97984 90141 72512 59984 64975
9056 64975 80416 74052 49242 44984 53300 57033 53537 51619 64575 56284 35805 38990 30738 37082
9042 37082 45178 45052 55073 68295 70055 62063 64501 54534 41228 21368 19479 35810 55198
9029 55198 55312 49772 42864 36364 28337 34982 34972 47621 43658 46243 38226 40174 39604 37952 43341
9014 43341 54772 66116 51158 45634 49975 66709 64079 38671 39929 25079 15767 25725 20526
9001 20526 10749 7982 5860 8499 22183 36161 34929 27557 22699 44797 50208 31831 28853 27264
8987 27264 26614 30271 30227 26325 3346 -3572 2227 5471 25611 42433 34146 16522 -11587 -4292
8973 -4292 26940 35840 36517 31746 30488 20855 18818 9123 -2268 -954 -248 -2441 13383 26941
8959 26941 23973 27091 26066 25685 12404 2830 -8672 -18898 -1355 7375 3123 -11968 -6866 2218
8945 2218 13666 13930 18542 16929 12318 13832 22946 15955 8935 21251 16788 9355 13571 13339 16495
8930 16495 7935 6537 21079 23056 -1562 -4598 -4463 -19951 -24653 -15961 7947 10002 5918 -6544
8916 -6544 -6768 3777 13032 23300 27164 20398 15669 16665 22863 18501 9012 -5134 -13005 -17633 -2403
8901 -2403 -11317 -9368 -4687 -3753 11805 12126 3228 -6217 -16079 -14802 -4568 20612 46049 44774
8887 44774 28125 24710 18751 11554 4800 8734 -1355 3783 9577 22257 7810 16491 15307 3012
8873 3012 3547 -3640 -9367 6320 1086 -13618 -22646 -13273 -9260 -7120 6452 6237 13830 26198
8859 26198 13703 5957 8169 14403 24420 27208 4127 -21382 -6233 11217 10067 10595 -2385
8846 -2385 -7485 -9314 22314 36550 21642 11004 29425 34169 15426 1518 9295 2423 -13702
8833 -13702 -10940 7216 19674 7874 5871 19906 25038 23042 8884 1775 7895 7831 -12076 -19532
8819 -19532 -12725 2267 -4608 -5743 11656 15053 19074 14122 19339 12534 11103 5641 321 3546
8805 3546 5350 1121 -3696 -5392 -4305 13750 21015 8912 -6181 -17496 -26532 -6934 823 26267
8791 26267 39466 20293 8081 -118 2328 4586 -16467 -28136 -33398 -21390 -26464 -39649 -14790
8778 -14790 -16169 -12633 -5083 -3585 6309 16739 4590 -5191 1381 -6542 -18133 4051 10520 5935
8764 5935 -4722 -16307 -10218 2957 17147 28578 25236 11196 12169 2269 7641 138 -22097
8751 -22097 -7031 3182 708 -6255 4956 3702 12050 8380 3265 7766 22137 16269 20797 13509
8737 13509 -670 1726 7710 -3074 -25170 -25980 -29098 -33016 -10346 -7762 -3526 -1557 -10600 -9457
8723 -9457 3698 -1496 -1323 13434 30733 16876 -4919 -11279 -2090 3401 -8549 -14591 -15365 7423
8709 7423 23668 34598 41013 30387 20400 15155 12288 16159 16342 16172 6603 -4003 -3135 9340
8695 9340 12595 -3543 2349 12396 -5644 -21177 -7594 3202 -14315 -27696 -16549 3790
8683 3790 17162 16437 6209 2899 4368 10191 18678 24244 23710 25559 21598 15305 18255 6655 -8202
8668 -8202 -2997 -6561 -11378 -154 8112 27063 36299 22563 5165 6968 -6261 -20832 -15387
8655 -15387 -4288 6524 16237 32111 27518 26217 28528 21036 33463 24441 6078 12478 14750
8642 14750 11406 11724 8967 14016 -1140 -28744 -18811 -3141 -1438 -16987 -2131 13857 11251
8629 11251 -5200 -20611 -34784 -18225 1960 6635 -11012 -16493 -8598 -6116 -294 -3669 -26057
8616 -26057 -20598 -1733 -2086 -5429 -8384 -11918 -15437 -28369 -32985 -34615 -32298 -29136 -17251 -15905
8602 -15905 -7028 2235 11064 1781 -342 5051 6120 4837 -3264 -14647 -17603 -17312 -458 18366
8588 18366 28559 17950 11667 26768 42399 34424 28105 32882 30378 15740 10444 8863 22307
8575 22307 29651 15680 -9361 5220 10174 7898 5528 233 -4230 529 4565 12232 6545 13509
8561 13509 21344 13792 10472 -11428 -15378 -12847 -2632 6705 13271 -4424 -13042 -4728 4079 22240
8547 22240 6732 -2279 4810 20168 31954 28752 20764 -4427 -9756 -571 6938 13108 17862 31007
8533 31007 34633 31439 20586 16366 17678 15168 17177 8868 3464 9560 3453 11485 13767 203
8519 203 992 -15490 -13427 -3170 6568 10213 3685 -6141 -4834 -5610 6033 -3440 -18349 -19469 -11402
8504 -11402 -6229 -15385 -12482 -5433 3118 5398 1671 16883 19878 -3124 -14880 -9717 -3439 -3032
8490 -3032 5273 7959 12796 5546 -9059 -14503 -20653 -13524 -10733 5209 18131 14447 14478 12267 10321
8475 10321 -352 20687 33083 33588 20421 5647 3471 13315 13153 1117 -1681 2653 4920 7243
8461 7243 -20086 -36604 -19601 -4665 1487 6317 -1197 7670 6086 814 26133 28637 22848 26585
8447 26585 28363 24976 -2245 -20026 -5210 -7347 -31471 -29897 543 17356 8204 5085 -4229
8434 -4229 -10544 -4970 -632 3669 -5655 -10755 -4465 3935 31407 28555 13505 6073 809 -14265
8420 -14265 -9482 -5283 12855 20007 4318 -1895 812 -9937 -13360 3614 12249 4483 1963 7050
8406 7050 2503 -10913 -2600 7570 18605 11520 3190 -8809 -14400 -10868 -1755 -1282 -4597 -4075
8392 -4075 -1623 4687 9568 4094 -543 -9802 -26509 -25363 -25561 -17474 3676 12228 1466 -6386
8378 -6386 -7162 -3011 2219 -2421 1609 1087 4722 5976 24710 20166 -8966 -3167 10793 36798
8364 36798 30489 11601 5943 -1514 12362 15752 2565 -16597 -24679 -15463 -27991 -12115 14955
8351 14955 24069 14547 8211 6378 1267 14937 24699 8030 323 3352 18304 17926 8807 5531
8337 5531 5475 12495 31191 27285 19562 15739 7574 9652 2835 6311 15706 20810 25599 15749 12378
8322 12378 7580 1334 -1903 -10937 -15314 -1820 4871 -4876 -6880 -7570 -26891 -36283 -27213 -114
8308 -114 17922 10870 4516 14907 33450 17268 1318 -1667 7704 17818 31532 39723 29401
8295 29401 13585 10975 11467 11740 27684 19983 18385 22128 18010 27128 31763 34182 27050 470
8281 470 -7777 -15188 -6508 -5351 -10414 -6788 -11976 -18870 -14090 2351 934 -7512 14805 39297
8267 39297 19246 14048 17932 23719 25003 24967 10121 -16795 -20172 -29436 -22292 -11262 -15117 -17485
8253 -17485 -8876 4474 -3205 -15407 -370 5617 5890 -5436 -7834 -23981 -24142 -10124 8750
8240 8750 12265 12548 14371 21811 259 3532 14824 17007 6443 985 1519 -4690 -3712 951 7828
8225 7828 12528 4689 4884 12315 3416 -22731 -26167 -16013 -14932 -24396 -29065 -33808 -30944 -20162
8211 -20162 789 4939 -469 -14997 -29068 -6878 -2848 -6684 -9791 -11661 -23822 -32880 -21013
8198 -21013 -5630 -6258 -15586 -24895 -22104 -20707 -18943 -13928 1616 12912 15584 13697 19132 22874
8184 22874 -1697 -10749 -16690 -6887 -15759 -16132 4218 3584 4694 -1889 -947 10190 6364 5569 5442
8169 5442 -8230 -11398 -8078 -2289 2216 -5850 -10847 -2258 4022 3607 -13262 -8079 19729 12337
8155 12337 23994 15943 19662 15870 31002 27397 19544 11865 13949 19393 4106 -16315 -16892 -19376
8141 -19376 -28911 -10834 -1532 -9212 -24929 -18715 1407 1459 -1215 -9936 -15891 -23179 -18869 -27619
8127 -27619 -35342 -45604 -21287 -8377 -1104 -9080 -17900 -9505 -10958 -23609 -23824 -20566 -18312 -9851
8113 -9851 -4740 -3966 -9971 -12494 -13009 -8785 -8765 -13145 -2855 23962 26914 16459 -5051 -4174 2224
8098 2224 11930 9389 9833 2358 5708 27 -5289 -1442 -20490 -34647 -25667 -14164 -7073 -13001
8084 -13001 -16823 -27552 -13340 9642 14614 10733 19666 5353 -9199 -19231 -14691 -8521 4908
8071 4908 17857 18847 6748 2956 -1970 -11712 -16910 -25477 -37950 -38784 -32215 -15105 174 -9773
8057 -9773 2439 -8234 -29818 -33942 -22991 -6942 6897 -5973 -14256 -9609 -8292 -19648 -33064
8044 -33064 -19289 5046 -15854 -12795 6762 2867 -14443 4693 1876 -20900 -23579 1224 2102
8031 2102 -9236 -18062 -21601 -18403 -17572 -6715 -637 17686 12742 12326 5717 5177 500 -5072 2780
8016 2780 3500 3080 4884 -3657 -862 -3883 935 5343 -7528 -7717 -6537 -4643 2213 13884 10142
8001 10142 2186 5365 8131 10925 12724 20034 14984 5400 -18646 -27853 -8918 -1977 1605 3709
7987 3709 3099 2443 -14561 -20001 -16322 -29525 -15967 -6438 -197 -13962 -21485 -17286 -11588 -5011
7973 -5011 12738 27236 21086 11685 4110 1740 3574 -8828 -10700 -5294 -343 22207 14146 16081
7959 16081 25104 26904 21692 24656 15895 -3058 -12338 -18517 3061 -5615 -11062 -7089 14869 19892
7945 19892 28773 9370 -6866 -13859 -20192 -17923 -4397 21566 16456 4073 8964 19224 19275 7168
7931 7168 -13092 2298 18503 8411 3091 3941 12344 21728 23624 23161 7979 318 -6963 -23041
7917 -23041 -12301 -3103 3559 17319 -4310 -19181 -18763 -20415 -13370 -8503 -2341 -10543 -6459 -9108
7903 -9108 501 11116 12998 6953 -2062 -1032 7862 14958 18658 25192 8307 6213 2014 9926
7889 9926 24350 26649 19148 1338 -3348 -6188 9339 -3527 1095 6401 11054 18041 16146 19927
7875 19927 6082 -19989 -24593 -24702 -9584 -5623 -16919 -18645 9050 12014 7670 -4622 -12002
7862 -12002 -15915 -16780 -12502 -8080 -8920 -948 221 13492 8304 -9000 2809 16199 30542 30460
7848 30460 18900 -9088 -14213 -9924 12069 9775 16137 21828 177 -12066 -6368 -558 -13053
7835 -13053 -23522 -14998 1730 12896 11571 -1168 -9583 25 -7514 1138 -9687 -14512 -5736
7822 -5736 -8377 -5323 338 -9646 -12034 -14880 -15104 -9879 -7926 -8399 -12331 -24695 -21952 -13373 -12532
7807 -12532 -23913 -45278 -35575 -14866 -37403 -39014 -27632 -30273 -27317 -7972 9963 12306 21971
7794 21971 24588 5942 -15047 -16233 -26749 -24144 -6809 -2991 -7670 -9559 -22482 -27361 -27569 -20158
7780 -20158 -15921 -22195 -20458 -17259 -6285 -3337 13884 18546 14985 4718 -260 1840 -6900 -23872
7766 -23872 -40925 -44859 -20796 -24250 -7880 3421 -2462 5794 -7520 -16919 -18031 -13542 -7901
7753 -7901 -897 7445 13899 11536 -7131 -7892 5000 9693 1408 -7363 -9838 -3844 6011 24633
7739 24633 21291 6510 -5036 716 5038 -13706 -1583 5862 15334 29531 15716 26 -11027
7726 -11027 -10335 2844 4950 -14100 -10785 -2536 5695 18615 3979 -12817 -3133 16487 -4403
7713 -4403 -6033 -8942 -9041 1623 -9931 -33722 -31809 -34354 -32471 -18460 -4347 7501 -1664 -24384
7699 -24384 -6758 20299 26012 15456 20206 21770 20458 19028 4926 -7008 -9993 -16725 -12948
7686 -12948 6246 16487 13719 13423 15247 433 -7108 -16424 -24071 -32170 -14588 1231 14356
7673 14356 2655 -12085 -14340 -16631 -7715 16456 11317 1660 13414 15305 -688 130 -2387 3568
7659 3568 -6047 -8169 1868 8231 18925 15291 -743 -13129 -12303 -22098 -21868 -11178 -4821 -2028
7645 -2028 184 -3989 -9143 -5143 15186 5892 -10637 -6766 -13326 -15251 -17628 -20037 -22856 2422
7631 2422 16041 11450 -22032 -32835 -19332 -21587 -28043 -19296 -18010 -24481 -3978 9102 301
7618 301 -4258 805 -15398 -9458 -8502 -18853 -7004 6412 14051 6942 923 -14144 -22914 -5787
7604 -5787 5214 4021 -8232 -20207 -21236 -17176 -13787 -3800 -6144 3443 1077 -16588 -23394 -10059
7590 -10059 -10494 -28697 -24333 -6332 -19976 -30131 -13065 1744 3352 284 -8834 5517 41695
7577 41695 20568 -15205 -10562 -3712 -11167 -14006 -33581 -22384 -15579 -5512 2796 12106 -1081
7564 -1081 -8335 -7521 -1454 -1429 -9002 -4150 -10823 -10153 -8131 -3071 -7378 -13796 -13829 2327 -477 -1467
7548 -1467 106 3866 1470 -3451 -9038 -5258 -6893 -16464 -4355 -4368 -28247 -35612 -25294 -20545 -19856
7533 -19856 -17779 -8508 -1009 8045 263 5075 14937 14700 -7567 -25099 -33861 -30479 -24234 -17763
7519 -17763 7222 26336 30888 14255 -10819 -13108 3637 3601 -266 7178 584 3743 1730 -9431
7505 -9431 9202 8615 3902 -937 -8618 -12852 -9900 -21672 -12479 -10469 -6436 -4212 5557 16593
7491 16593 20502 4751 -1014 894 -5240 -6440 -7536 -6310 -1389 5465 7124 -3981 3492 1879
7477 1879 7270 11221 17495 9653 7069 5163 7632 4442 7384 18475 10139 14150 26136 13120
7463 13120 524 -5060 -15036 -8672 -6278 -16635 -28684 -27224 -19719 -30280 -40664 -28327 -14406
7450 -14406 10818 5626 -6659 -15109 -15988 -10112 3672 8090 15865 12422 17769 19953 34254 41098
7436 41098 26653 40189 27320 14150 25380 19537 12860 14 3262 3040 19120 20761 26345
7423 26345 24070 10802 13109 4640 -3520 18104 26230 33498 26768 18769 8152 -9038 -20956
7410 -20956 -20974 -29507 -3481 -4475 -14296 -14921 -15298 -6685 -4957 1286 -562 5023 11231 4819 -5293
7395 -5293 -1721 6638 -8311 173 3617 -677 -6785 -12402 -19251 -18840 7250 1670 3560 -2189 -6610
7380 -6610 -4390 4909 9037 6453 6732 10106 3515 9054 24992 24242 21252 8451 18393 29180 30902
7365 30902 26476 26125 32550 11098 -20475 -20968 -7447 -3236 1064 8597 3650 10089 11192 9552
7351 9552 12797 14926 13452 11923 -14080 -15620 -11167 -7475 637 4579 -10170 -6882 -343 -5709
7337 -5709 -7339 -3747 -4233 -9000 432 -13760 -20332 -29367 -19612 -2114 -13163 -9836 -5290 -8201
7323 -8201 -17970 -15851 -8375 11799 4243 13941 23390 24063 19036 10172 10552 6825 5903 -10230 -12677
7308 -12677 -20587 -35406 -28945 -23783 -11229 -7713 171 -3402 -3207 2900 -6203 -18471 -6050 -1243
7294 -1243 -19835 -24200 -19351 -9160 304 -6031 -6283 -3298 9024 7637 -3808 -10007 -13031 -6407
7280 -6407 6634 8849 4888 11050 4667 4989 6268 -2503 3824 13790 8174 1179 -7358 -8991 -4459
7265 -4459 2207 10898 25768 14682 4800 -17968 -28868 -26133 -3601 -13407 -17135 -23017 -5152
7252 -5152 1016 -12186 -2885 12000 9305 6607 -1554 -11885 -5776 6364 6076 -2693 2175 9506
7238 9506 20666 15269 14921 19818 10903 8293 3815 -9727 -17815 -7184 -5367 -7556 -14500 -18479
7224 -18479 -17628 -15289 -6397 1847 -2116 2130 -8036 2732 5016 -9749 -9665 1978 20109 19218
7210 19218 3980 -5964 -3056 184 9127 9220 9860 -4075 -2126 14371 10123 -742 -19379 -22463
7196 -22463 -15858 -21490 -18147 -11853 -22787 -5561 -4230 -69 -22 -6737 -7549 -3158 1500 8551 101
7181 101 -7170 -12767 -14430 -57 217 2783 17814 21317 23082 21208 9607 -14 4528 11587 -4892
7166 -4892 -18468 -20758 -35727 -33125 -11384 -7527 -24411 -21510 -24461 -33556 -24063 -22986 -10507 -609
7152 -609 4595 14394 3905 -6158 -30557 -30498 -30181 -26349 -22110 -27549 -25440 -24145 -5802 24135 16832
7137 16832 -9615 -14252 -2338 -393 5964 7445 -2562 -8004 -6224 -2152 -24140 -16187 -26146 -18752
7123 -18752 -3989 -13900 -29888 -25024 -21063 -15957 -8408 -1646 493 12925 18600 12031 -14108 -16350
7109 -16350 -16520 -8094 -2924 -10987 -7178 -3813 655 -4694 -10757 -5753 -10011 -19085 -7482 -2731 2959
7094 2959 -8997 1820 -680 1338 7604 652 -151 210 6460 15583 -2284 -29785 -28341 -20895
7080 -20895 -34099 -25645 -17374 -9973 -26577 -37418 -14818 -9234 -16189 -16433 -37976 -25394 -19504
7067 -19504 -11581 -6060 6330 28366 19073 1393 1291 19104 30500 19319 20595 26090 17980
7054 17980 -3310 -3525 134 8218 14465 3291 2971 -951 -5648 8585 -1509 -14826 -13322 -10999
7040 -10999 21 12414 -3915 -2381 635 6658 11534 21815 18753 9668 9611 -11735 -17723 -10097
7026 -10097 2044 14895 12784 10147 -83 -12611 -14253 8435 15887 -2619 -5655 -10505 -23152
7013 -23152 -25066 -12514 -2545 -2739 3362 1239 -11149 -13498 -27340 -38139 -52453 -38766 -24456
7000 -24456 -24094 -29932 -29657 -26089 -32983 -33462 -10248 -7259 4239 11358 25970 20026 -13281 -12587 -4290
6985 -4290 -3516 -19421 -22541 -17351 -25371 -36042 -10425 -1550 2455 5534 10750 7796 12818 3798
6971 3798 -6264 -10496 -24101 -19812 -28420 -24824 -7206 -6029 -17139 -18113 -18459 -6543 1864 -7553
6957 -7553 -14691 -23765 -9694 -7002 -4051 -5767 -8186 4863 -7186 -12440 -13760 -3977 -5159 -5183 -11311
6942 -11311 -18854 -23426 -29109 -38646 -30128 -22370 -17682 4444 18747 12732 15685 14849 8697 10191
6928 10191 5049 -13461 -8151 -14533 -18914 -16657 -16362 -25422 -25014 -30385 -33638 -34385 -7977 13643 4758
6913 4758 1534 5625 5827 10694 23884 22310 -7438 -12294 7573 21673 8420 -17731 -16807 7931
6899 7931 1910 1434 17385 13464 13281 16270 9424 -12992 -11508 -17438 -20484 1769 15937 -7189
6885 -7189 -28099 -36596 -44059 -23706 370 -7352 -20253 -10445 -4115 -14277 -7125 24489 46887
6872 46887 35317 19742 23845 -8813 -25582 -27927 -22997 -1210 14027 8682 8115 20389 38880
6859 38880 43535 41752 16232 -2722 -5465 -11177 -13470 -23118 -26546 -25834 -17005 -21845 -20767 -2123
6845 -2123 18169 6042 2804 6731 -4817 -11866 1570 8529 14243 22296 23640 24118 -27 3982
6831 3982 18743 15287 11123 7982 1622 -9328 -12343 -13711 -11541 4199 9555 5989 12261 16436
6817 16436 4371 -12410 -3546 13179 -9122 -22353 -12276 8312 2939 -15393 -14084 -5296 2562
6804 2562 -6214 1561 1610 16487 12259 3076 3060 -769 -11036 935 -2295 1170 -18035 -26483 -18892
6789 -18892 -18979 -17260 -5058 4021 8565 11777 14521 42544 35888 20279 10078 3632 -17624 -26202
6775 -26202 -21636 -14879 1645 1785 18100 31578 24742 14548 167 4473 -4466 -9529 -7728 -2940
6761 -2940 366 8611 13888 -3348 -39399 -45590 -32281 -16491 3740 4791 5838 9490 10967 9636
6747 9636 2349 -21446 -19924 -20235 -13758 -10694 218 -2028 -2472 -11013 -956 -5812 -2948 14976
6733 14976 12868 18738 22119 7629 9295 11149 24550 38676 47988 37727 28594 19432 27842 58953
6719 58953 58789 52621 54274 66005 91390 105529 130461 168889 231785 293671 341510 336638 290180
6706 290180 233471 158334 101372 69045 61285 57234 66838 73507 55848 47528 38156 26219 9010
6693 9010 -1007 8439 17356 11794 7285 10542 -5254 -5849 -1908 27670 33004 13773 966 6214
6679 6214 -1533 -10701 -9282 3880 21185 8043 9632 20995 28928 35127 35956 19276 1870 -7720
6665 -7720 -4971 5023 27423 19098 14783 14605 18702 17280 22666 8788 -361 19004 25030 27726
6651 27726 5641 1192 -5463 6065 17693 21498 15557 -6651 -12890 -16171 -16761 -22134 -22990 -9448
6637 -9448 -1357 -4216 -6704 1616 -920 3504 15027 7836 16123 21600 21026 3768 6729 11845 2815
6622 2815 1746 -8657 4849 2048 -7077 -18419 -5028 22304 23088 22038 19964 1363 -7342 -8599
6608 -8599 13908 19031 1083 -34156 -40624 -30791 -18081 -8607 -12201 -15415 -15688 -2603 7424 17761
6594 17761 18822 15474 21332 15800 3306 -9670 10542 17998 18798 2513 -22984 -21759 -17518 -39481
6580 -39481 -39675 -18157 -1994 -5886 -3974 -352 5152 7510 -10685 -26597 -15379 -17744 -25023 -8132
6566 -8132 -1260 -12924 -4152 -3350 2332 22626 28423 13453 18146 5325 -7653 5799 13194 25638
6552 25638 19361 10889 17070 22346 17812 14785 6837 -8233 -6088 -221 -17130 -32358 -37107 -25307
6538 -25307 -13427 -13712 -22635 -33808 -35897 -20626 -20159 -17395 -6902 -7939 -11999 -12647 -18190 -33136
6524 -33136 -21326 -891 -42 3291 6838 2412 10026 22239 30012 35050 26940 8696 6566 1168
6510 1168 -3919 -15183 -12099 9018 14462 17668 18282 174 -5420 368 -16299 -26017 -22347 579
6496 579 8185 1148 -13817 -8882 -16072 -28862 -12790 -5410 6568 13970 3401 -5126 2865 -14200
6482 -14200 -13516 -16508 -8336 -14920 -17291 -16562 -23861 -31545 -17983 -5127 2619 -5307 -21877 -34417
6468 -34417 -35036 -21130 -13430 -22552 -14125 -6297 465 -11956 -12314 471 12536 12856 6351 14566
6454 14566 33612 22788 2510 -12513 -21705 -29014 -34198 -38704 -39350 -30161 -9112 6645 -9657
6441 -9657 -5474 10096 23256 27422 27407 36515 22151 17074 6478 10947 17198 4477 -12088 -20707
6427 -20707 -17912 -16726 -14889 -30966 -32684 -1415 25552 25409 25235 16690 20125 11922 -1012 -10824
6413 -10824 -12783 -1813 -21530 -16988 11435 27759 19394 -11253 -21506 -26901 -42940 -35501 -37940
6400 -37940 -27205 -14053 -7701 -17924 -16357 -13986 -13516 -1428 13550 15865 11368 -340 11745
6387 11745 13629 -147 -16799 -9999 11145 21199 11423 13637 29360 27376 18898 21327 17416
6374 17416 14428 9651 9256 1863 4573 7600 810 1790 18246 28229 18772 26583 1260 -7928 7625
6359 7625 16252 10172 1229 -11896 -19122 -27489 -7879 -2083 -15184 -18604 -21001 -2406 -7041 -13101
6345 -13101 -7903 10554 102 -13198 -17062 524 9688 15113 4555 -4174 6072 9626 -5537
6332 -5537 -15955 -5859 -3806 -20788 -29219 -16842 -9359 687 -410 -13019 -14658 -7427 -10211
6319 -10211 -15525 5387 11782 4701 -8987 -18932 -18799 -6158 -9054 -14409 -26633 -16719 -12898 -6343
6305 -6343 4958 -3530 -17281 -26139 -34469 -51739 -44923 -37717 -31309 -12930 1671 9252 -6208
6292 -6208 -17425 -20219 -21474 -15243 -8997 -24980 -34022 -20305 -18427 -12939 -14601 -3906 -9473 5387
6278 5387 196 -6121 -9769 2121 -108 4776 -1743 -24335 -21266 -17640 -14343 -1716 -10611 -5313
6264 -5313 -6908 -15665 -18793 -17733 -11531 -7951 -7337 -17961 -33646 -34989 -34349 -28506 -21554 -20111 -24735
6249 -24735 -36430 -36272 -11397 -2066 -7246 1776 526 -13531 -14677 -29036 -22444 -16359 -12824 -16305
6235 -16305 -25564 -34204 -45836 -41221 -30487 -35710 -17467 -10594 -8794 -13401 -6463 -3920 -7909 -6817
6221 -6817 -9473 -14095 -13050 -15322 -26624 4418 15766 13995 14658 4695 -1371 -19708 -48265 -67092
6207 -67092 -58126 -41553 -22529 -5852 -7301 7716 7340 -2559 -7911 -19628 -11376 -1311 -8937
6194 -8937 -32498 -25229 -6799 3731 1022 11749 8425 -6376 7681 7540 210 9122 11717 -7376
6180 -7376 1741 -854 1364 16928 22707 16933 5931 7967 4566 10074 23693 28990 33461 25639
6166 25639 10936 -11619 -12195 -2474 11083 14066 -16650 -14960 -4879 -21725 -11879 2559 -10785
6153 -10785 -16034 -7624 -10422 -9611 -12411 -17652 -16349 -6447 6004 7303 5584 -6684 -21157 -18810
6139 -18810 2694 7825 9371 -6184 -15477 938 -5459 -22970 -35952 -46444 -41799 -12638 6757
6126 6757 36252 54124 37961 9936 -10836 -20812 -16100 2834 4041 -10972 -32739 -45982 -34857
6113 -34857 -822 3796 10344 -5503 9166 12600 -4504 -545 8819 -1459 -3407 -10412 -9650 -17545
6099 -17545 -23199 -24359 -3095 -6749 -16794 -21978 -13403 -17959 -18749 -18567 -2885 -5867 -21347 -19587
6085 -19587 -5075 12230 10903 -2352 -318 7386 13829 26773 21713 21840 17888 7200 2359 -5003
6071 -5003 -6481 8079 10881 1216 -12125 -11892 -11257 -18340 -28850 -26202 -28016 -14278 -14976 -22250 -33807
6056 -33807 -26132 -4877 8523 9905 4938 -17177 -42041 -50640 -35050 -23295 -15899 -20905 -15879
6043 -15879 -10197 -12457 -11840 -2932 1331 5084 5841 7286 3929 783 -6237 -5363 5395 9192 -2281
6028 -2281 -712 2054 1238 9974 1628 8810 17774 26914 39174 33951 9155 -10476 -25604 -13351
6014 -13351 5493 3255 -10205 -13634 -185 -2219 -18382 -34988 -35441 -24529 -300 4036 -4314
6001 -4314 -5359 2717 19324 14170 8129 3393 9106 1501 -21804 -38229 -9453 16556 21647 10870
5987 10870 6722 -1233 -9556 -4272 -12000 -24531 -17019 -3548 -4644 -16879 1649 10707 16165 9988
5973 9988 1253 -1288 -3093 -8302 -1157 17712 18596 -4695 -25030 -20094 -4005 5888 -1699 -3498
5959 -3498 14980 11821 13574 8675 14217 10033 13692 23535 17407 7682 10788 15652 18584 26588 13944
5944 13944 -291 -315 6599 9688 -10348 -21725 -20888 -35411 -35392 -29942 -20002 13518 9364 11980 16898
5929 16898 19584 24334 8484 -4512 -11767 -2751 1852 5095 18120 26054 21883 15940 -5668 -13785
5915 -13785 -9272 -5609 7643 6334 6123 -108 -1899 8340 9899 22369 16890 8071 10513 11285
5901 11285 -1185 -11614 -16454 -19461 -24044 -20662 -11316 -246 7663 10923 6346 -7634 -12157 -17061
5887 -17061 -23159 -12876 -11994 -5993 -14204 -42612 -33439 609 17937 11766 8704 8947 16123 9918
5873 9918 -3076 -30394 -37226 -33618 -33863 -20574 -20670 -31746 -49075 -38001 -13579 -9196 -4555 3280
5859 3280 184 888 2811 -7947 -13992 -16277 -6504 -7333 -11815 -8451 -14262 -31032 -32252 -22410 -20022
5844 -20022 1035 16185 21429 -2992 -15137 -20392 -26805 -16194 -14019 -21878 -27582 -17618 -10400
5831 -10400 -11313 -8033 -10320 629 9038 -3976 -11839 -5117 4135 1410 -1403 -12685 -31395 -20133
5817 -20133 -1299 -6675 -6715 3479 6481 -14031 -30365 -33389 -19102 -22470 -47494 -42922 -28305
5804 -28305 -19623 -23855 -32769 -22911 -29107 -27772 -6312 9446 1672 489 9830 25734 34868 18530
5790 18530 5237 10215 9781 11347 23976 7051 2267 -2964 -22464 -23303 -21565 131 17919 18505
5776 18505 23473 19269 22302 14077 5407 3517 -10153 -2724 7921 7678 -2530 -21577 -16401 11912
5762 11912 33629 27292 5322 -12163 -991 10054 10477 19759 18631 23401 10847 -6850 -7773
5749 -7773 -4593 -13994 -4351 -10482 -28019 -11613 -1930 -4851 -7369 -2398 15140 33580 23543 6654
5735 6654 -17027 -18030 -5700 8869 6038 8445 10927 -3368 -27112 -34966 -37494 -23178 -2739
5722 -2739 17865 8824 -80 -715 550 -3919 -9996 -18769 -17674 -11102 7941 9508 5681 13551 14099
5707 14099 12689 -9513 -29090 -24738 -23816 -8545 -19399 -29001 -27400 -32898 -19825 -21253 -15740 -11652
5693 -11652 -6818 -7312 -2053 981 5255 10838 18446 1796 -29637 -25444 -13767 -19973 -7639 7266
5679 7266 8483 -39 -17177 -24145 -12978 6957 8974 2628 442 8444 11022 19738 18718 17255
5665 17255 17507 9664 -9468 -21114 -14917 8995 11656 15233 13082 -1865 4053 -5834 -12877 -10723
5651 -10723 -21476 -21445 -11651 -9203 -12133 1539 764 -10375 -18585 -20537 -10881 3259 17335 15374
5637 15374 6639 3620 780 3307 -1559 4265 3538 5904 10911 9306 7793 7758 1258 14802 26173
5622 26173 14218 -441 -4573 -3755 -2770 3525 5635 -2265 -6699 -871 -6061 224 1111 6688 12947
5607 12947 10726 7767 10956 15341 14087 18288 18365 17935 17872 14209 8482 10846 -2829 -18407 -33713
5592 -33713 -32784 -14993 -16558 3777 -4588 -21185 -18575 9812 -588 -8520 -11078 -4372 4427 -211
5578 -211 -9773 -19141 -23030 -21672 -14334 1161 -7302 -15322 -15894 -22653 -31990 -22479 -18009 -17872 -13866
5563 -13866 -12244 -31604 -37919 -32886 -27061 -24442 -28831 -17276 477 -2348 -27804 -40223 -44199
5550 -44199 -37175 -50888 -39203 -28709 -11653 196 -9682 2786 6939 21910 12762 -3033 -19057
5537 -19057 -20357 -30500 -27682 -40199 -49670 -36890 -23207 -18150 -16667 -27324 -32109 -23277 -25021
5524 -25021 -21092 -26643 -25672 -12989 -1566 -7450 -2902 4139 2585 1275 2450 6982 2542 10940
5510 10940 9731 6771 3246 418 -23125 -21858 -9579 -584 -6658 -5917 11649 17190 1954 2629
5496 2629 11309 18888 25722 9991 3010 12521 4931 -1094 1349 12386 11953 -7386 -16992 -23796
5482 -23796 -26817 -28333 -31251 -15592 -11038 -10095 6764 15945 16876 19456 15250 21024 15467 27481
5468 27481 31209 27467 10779 139 -8762 11291 12130 17087 15378 6831 -3170 -5082 3222 9476
5454 9476 2602 -9795 -14981 -6280 -7669 -6274 -3180 10423 18024 23421 26428 12969 24648 15864
5440 15864 3388 9597 14947 656 -10932 -18446 -14655 -9397 -17126 -17595 1762 11075 17239 5848
5426 5848 -14073 -10359 12963 6924 -10599 -5437 -820 9326 7072 -5612 -15091 -17034 -2864
5413 -2864 4568 9665 -98 13859 9366 -11837 -13798 -13129 -11218 4815 8270 -3408 336 5911
5399 5911 -7008 -18850 -40130 -29827 -29142 -27494 -15155 -4627 18008 11836 3244 5854 7368
5386 7368 15703 11645 3542 4713 19840 23590 889 -22051 -21017 -11984 -7007 -2805 690 -5295
5372 -5295 -15641 -3790 -3793 -590 17238 28089 23696 3500 -5788 -17871 -6613 -2428 -6616 -13790
5358 -13790 -18998 -26975 -28024 -20217 -8805 3477 15000 24513 25768 16587 29541 29607 23984 17532
5344 17532 5926 -2006 -422 2168 5179 -7081 -2660 919 -10902 -6560 -15532 -6418 13804 10536
5330 10536 22354 13853 -1400 9841 15314 18903 16997 9107 2064 8121 7645 -5917 -12116 -13474
5316 -13474 -17986 -4631 4123 11636 11561 17438 9790 11191 16523 13571 8997 8660 -5061 -5756 11289
5301 11289 13446 9643 16365 14602 25521 14770 -5336 -2317 2944 -6272 -22693 -40218 -50361
5288 -50361 -40449 -37148 -32546 -31909 -8718 4798 7990 5228 -2148 27180 40433 21907 6125
5275 6125 7071 15371 9753 -5150 -12901 -2387 17480 19164 18233 16530 1087 -826 -1680 14551
5261 14551 20838 16205 6834 24928 20528 10955 1415 -2024 3451 2261 -9970 -12886 -12329 -8849
5247 -8849 -12480 -25485 -18701 -2574 3851 -17904 -6140 -15313 -20970 -20637 -22168 -21231 -8381 4362
5233 4362 12081 -8264 -25250 -9392 -7480 2748 14269 18963 -2910 -19862 -34291 -38612 -15278
5220 -15278 4323 12144 1276 -1145 -1142 -14038 -20420 -18246 -19990 -24757 -30852 -10949 -2245 11597
5206 11597 6782 -3243 -11050 -15564 -26499 -26792 5391 10241 19226 15026 649 -12716 -2230
5193 -2230 17886 20280 24767 33237 18333 5375 818 5002 13334 11824 11418 25800 -4454 -36882
5179 -36882 -47919 -32722 -31792 -27950 -23699 -7191 -3418 -7958 -10972 -11630 -440 15465 18886 9567
5165 9567 -2736 -7151 -1888 2553 3508 -8648 1410 4002 -8655 -7747 4801 527 -5410 -16380
5151 -16380 -5564 1901 -1158 -5305 -10934 -14788 -152 9666 -3718 -1134 -11968 -2758 -1664 -18704
5137 -18704 -10197 -3352 -1171 -2919 -8080 -6348 -24394 -28819 -10081 -3986 1939 -4235 -15502 -4667
5123 -4667 -920 -8641 -2448 -4395 -4658 -357 -7091 -12344 -13805 -6268 7405 18183 16036 29366
5109 29366 25496 8668 -328 1537 5426 2144 2257 -8058 -13177 -265 4352 5381 8484 1033
5095 1033 9203 21864 15464 1329 8290 7892 -58 5831 3378 1865 4193 11544 13309 15195 14587
5080 14587 5532 3503 -3493 -20913 -13355 1346 -4890 -11253 587 -9208 449 10391 -8764 -20638
5066 -20638 -8173 -5332 -17431 -29913 -22839 -24165 -9472 -6922 -2956 15265 12308 9700 13116
5053 13116 30235 33865 35092 20570 14994 8154 4790 -5217 -22598 -35528 -27588 -18775 -11789
5040 -11789 -16666 -12627 -11685 1114 11170 21579 38745 26994 8905 5014 2233 5403 11312
5027 11312 6049 351 -1757 15190 4594 3822 897 -3102 -996 -3863 -9371 -12245 2985 8245
5013 8245 -2678 -4982 -2613 5653 8143 11438 24412 29350 30356 30044 20026 13863 14775 19175 18640
4998 18640 2894 2400 22335 29623 14355 -5601 -6231 2241 -4005 -9458 -5065 -5569 -6897 18000
4984 18000 23201 14344 -8330 -21201 -6781 4267 -618 523 13772 16295 4080 -17138 -8866
4971 -8866 -270 -4696 -1854 21178 21363 -1481 -13808 -29622 -29115 -18396 -16071 -18283 -27461 -27840
4957 -27840 -22046 -27031 -25557 -27202 -26868 -27741 -32699 -5399 8762 4500 -3693 -20864 -20795 -13654 -13475
4942 -13475 3368 10342 17622 3159 -3960 -17006 -12975 4529 1828 -11451 3578 12353 11620
4929 11620 -2668 -7609 -7360 865 18288 24203 10605 14884 13757 16906 10417 11312 11068 9366 -1211
4914 -1211 -17713 -14384 -5300 -7717 -13806 9555 26277 26190 32641 9585 7134 306 -3465 -6899
4900 -6899 -8719 -3297 2668 6930 -980 -8103 -9899 -20362 -26986 -19962 -12225 -1681 11657 15348
4886 15348 12813 29299 55629 41507 22253 24122 16080 15443 17380 7720 4249 -584 2355 1650
4872 1650 -734 -22789 -18139 -11957 -1689 -7327 -24020 -15002 -14252 -11182 8130 8721 5187 12147
4858 12147 30076 24479 28829 34119 18681 1759 -4008 -5550 8246 10091 -6339 -20879 -21727
4845 -21727 -11777 -15078 -27881 -12296 1314 5286 435 14239 10300 -12494 -21111 -26538 -25531
4832 -25531 -18110 -23790 -14811 -14316 -30625 -20424 780 -5488 1218 -2009 -2800 -2523 -20181 -28650
4818 -28650 -15920 -4876 7905 10348 10578 12421 25041 30051 10123 -2185 -3859 11597 1200
4805 1200 -12755 -7335 7355 7046 -16458 -30354 -36485 -25608 -23206 -37925 -27923 -12033 -6134
4792 -6134 -15284 -6745 14023 8759 5140 20822 22008 17394 21459 2174 -10747 -19641 -11436 6158
4778 6158 11749 12229 4285 -629 -11258 -17558 -16192 -16468 -27594 -20324 1117 11560 31433 18289
4764 18289 15331 12253 15234 11063 12 12419 13959 -9710 -20926 -5853 16466 6105 -6235
4751 -6235 -13710 -12659 -10269 -8992 -5639 4241 9013 -5004 -178 3385 -8623 -15903 -392 -2798
4737 -2798 1033 14263 -4606 -17142 -16953 -21464 -21303 -8836 -6028 -28179 -26374 -11918 -19638 -18941
4723 -18941 -18607 -21404 -20428 -7201 -11463 -12611 -7892 12622 2376 -2009 13180 3461 373 -8485
4709 -8485 -25219 -11085 -5160 -26805 -40606 -28639 1383 12000 12068 1363 -8086 -2469 -5003
4696 -5003 -166 12049 17735 21240 6857 1692 -14338 -28384 -19282 -18320 -19720 1828 8735 -12483
4682 -12483 -14439 -4823 6128 783 -23737 -18589 1711 -4092 -16191 -31874 -33840 -18109 -6085
4669 -6085 -6996 -10302 -8575 -434 -6163 226 10634 23315 15789 949 9501 3078 10178 634
4655 634 -16664 -20744 -14930 2138 10365 27462 35896 24577 27747 24326 11059 11299 20228 26196
4641 26196 16334 11276 2202 13241 37606 25953 14725 -3843 -25449 -10622 7243 12023 21201
4628 21201 14822 5179 12324 -9477 -24169 -19296 -17181 -4515 10081 14582 11102 -682 -11905
4615 -11905 -14049 -15701 109 11793 1754 -11042 -11185 -13403 -11577 -957 4179 -12502 -20683
4602 -20683 -17374 -4800 7433 9422 -6148 -5124 -18980 -33282 -31083 -27787 -16214 -7622 -16117
4589 -16117 -1506 11167 11042 6751 873 1859 2959 11922 4521 8069 3234 4426 -6716 -9250
4575 -9250 -16819 -27856 -28586 -23273 -20799 -6057 -5020 9742 15748 18976 26458 40698 36589 22350
4561 22350 4476 -2482 9328 12143 3260 18751 24487 27942 25319 14611 6004 2385 23759
4548 23759 26295 44248 43974 26200 11898 9035 -859 -4588 -2276 823 -1203 -10018 2394 9913
4534 9913 11301 10706 1013 -15079 -28867 -34584 -30141 -13165 -7878 -10446 -20147 -8113 5724 6114
4520 6114 8363 -11846 -5702 7484 6667 1391 -7753 -13125 -13684 -6346 4633 2352 -12881 -20284
4506 -20284 -10406 586 3494 24040 36601 6836 -12802 -3537 -657 1537 23331 28292 19551
4493 19551 12727 -2119 -9620 -4704 -471 -369 13660 14209 25988 26141 16542 -507 12885 8999
4479 8999 1803 -1454 4142 19649 13247 22761 26530 19385 11479 -10654 -25893 -19020 11717 12445
4465 12445 8577 13949 24439 25377 39320 41839 40519 39408 30627 12238 9347 9694 4830 14349
4451 14349 9604 -18354 -24416 -18469 3218 5671 4724 840 -3964 -17322 -26427 -14254 -1591 14898
4437 14898 -1496 -1501 7732 14362 7573 -10607 -18914 -25031 -14666 -5553 -10207 6614 19436 -1352
4423 -1352 -9511 -21808 -11355 -8447 7355 16628 9550 -4168 -12321 3777 6672 -24886 -42631
4410 -42631 -20448 14424 4326 3400 19183 11708 6159 8829 -6924 -21158 -21816 -4503 2976
4397 2976 -6243 -7799 -10427 -12283 -900 2149 12089 14419 14926 25190 32335 24012 16271 8036 6295
4382 6295 11372 -13799 -8948 -8728 -12108 -5105 -5568 216 -11091 -29255 -18527 2503 7008 -13995
4368 -13995 -19066 -6379 3981 10152 35373 57819 48732 39416 26803 19374 13900 -5013 -19175
4355 -19175 -16868 -20526 -10606 -10176 -9469 3281 355 -17781 -16330 -5580 10002 26984 22624 2546
4341 2546 -9702 -3209 4633 6943 1249 -13250 -20831 -1903 5293 16677 24096 34215 18004
4328 18004 1006 241 4965 -2849 -18412 -40909 -38970 -25411 -24535 -14926 -1021 7149 16610 3210
4314 3210 -14838 -14570 -11253 -8310 -16159 -34093 -26594 -25614 -12998 -13876 -1490 5015 2105 -3068 -16045
4299 -16045 -7468 -235 -5439 7451 3885 -5187 -26433 -15498 -11356 -5160 -5228 -2036 -1247 3656 16414
4284 16414 20123 19199 4830 738 -23 -10875 -17003 -18696 -18580 -13532 -12658 -22732 -5685 -2393 -10118
4269 -10118 -12873 -12304 -20659 -11118 -20576 -9847 13978 15596 7215 12234 2891 -355 -3792 7162
4255 7162 9060 11634 9035 7887 4512 11603 21156 23761 27981 27886 12202 -11602 -11708 -10863 -13141
4240 -13141 -20183 -30290 -22433 -33629 -46307 -36322 -33063 -29309 -29379 -25475 -16005 -15013 -6268 1340 -8190
4225 -8190 -1976 -17471 -30716 -26513 -11158 7748 10874 18124 14892 2819 -9865 -23647 -8662
4212 -8662 6912 7595 8839 -5012 -9103 -10744 -6611 -12212 13251 23962 11496 1371 4362 13641
4198 13641 12087 19123 6542 -7390 -5097 10061 23043 24815 11433 -1679 -4007 455 4828
4185 4828 -4942 -3745 -3506 179 -10174 -6214 4092 26474 28825 11306 21083 22669 2411 523
4171 523 -6388 -22072 -26925 -20820 -5052 2382 9595 22477 9680 4423 -3777 -17856 4632 36112
4157 36112 51644 35197 23439 14085 22282 22371 22807 10112 10752 -315 -7760 -9922 7957 36065
4143 36065 32839 23034 16855 3721 -5833 7271 3514 4369 5397 -5351 -13853 -16118 -11374 -10687
4129 -10687 4167 20523 22488 5047 -14523 -14381 6058 13669 7322 -10722 2636 2022 -9753
4116 -9753 -6071 21315 26504 25844 28285 -2863 -13555 -6109 -7429 -16290 2071 22720 34030 38110
4102 38110 24116 2384 2865 16724 14035 10207 4517 6580 2073 13884 15965 194 -5490 -9350
4088 -9350 -19265 -23965 -6032 -8903 -13418 -17248 -18598 -27528 -28804 -3352 7538 1788 2255 -2663
4074 -2663 -10868 -16589 -11503 3853 10950 -11068 -4581 13233 1604 -7505 -22808 -23891 217
4061 217 12193 4095 14634 20897 10244 13220 13490 13861 10756 18405 14480 11313 -7782 -17621 -32779
4046 -32779 -32672 -14669 2065 7550 8087 17677 23102 29890 35180 12370 -5984 -20715 -12953 -4943
4032 -4943 -1914 7634 15819 14032 12952 11531 2721 3556 9314 20802 -55 -14569 353 22730
4018 22730 41233 18009 6075 -602 -5775 -12880 6624 22152 27998 13414 8350 20804 23409
4005 23409 22332 18642 18488 12681 4643 -11529 -21992 -35942 -25501 -11802 -11580 -17992 -18319 -19540
3991 -19540 -12491 -8400 -3206 -6421 -18225 763 5824 -380 -6542 -5082 -11666 -4865 17004 17007 18765
3976 18765 11912 14173 4913 -3470 -27802 -21734 -22327 -1030 -2500 6524 11691 21132 12982 2439
3962 2439 8662 8732 10274 -3113 -8718 -5562 -12823 -18870 -11777 -13796 -11152 -4006 -11788 -15765 -29380
3947 -29380 -44874 -22388 -15833 -24255 -20629 -10362 -13515 -16465 -9982 1511 -2844 -1204 8852
3934 8852 -3690 -1614 9581 16340 9980 10030 12048 11329 -3638 -5823 -10201 -18621 -10779 13358 9945
3919 9945 2045 18464 21647 -2289 -12270 -3509 -4358 -4606 -3674 6709 11304 22123 26847 20002 16366
3904 16366 -1925 5698 8557 8524 -2053 5139 18049 19848 11149 -5822 -10194 -6584 1960 18175
3890 18175 24583 24477 6020 3877 8863 20341 12159 25643 30819 10927 31454 38978 28256
3877 28256 9342 -5283 3935 7291 -2291 -13314 -20579 -8547 14828 17090 -2014 9914 43156
3864 43156 40834 24277 -3535 -18018 -4288 -3766 -7786 -7215 -16622 -24491 -25842 -25805 -17846 7522
3850 7522 15015 18809 33167 40866 15495 -4504 -10885 -5904 -5024 15350 12365 17703 11256 -15826
3836 -15826 -18598 -4375 -3973 -3900 -7604 -15846 -2661 -4408 14654 28717 19369 1503 -2834 -5841
3822 -5841 -5076 2845 2380 -20529 -6727 7486 -7079 -16683 -12479 3179 4261 -7938 -14674 -11690
3808 -11690 -12875 943 634 -14567 -10521 750 -7250 -11336 -6900 -2971 1704 1174 4087 4424 -11085
3793 -11085 -5270 5200 825 -6520 17026 31145 27063 28284 25677 14835 -13886 -19844 -22653
3780 -22653 -19663 -16979 -19500 -21720 -11963 -10444 -3293 19188 36849 36998 20336 -5671 -12195 -3381
3766 -3381 -6428 -6496 -2189 -273 -1178 1158 12146 -828 -4696 6924 7208 868 -1340 -3706 -3806
3751 -3806 -15740 -2960 29972 16287 -7239 -20841 -30496 -9597 5237 4767 4611 5446 1120 8824
3737 8824 24574 24001 9344 8531 6261 -2657 7761 13820 11031 -2112 -9736 -12374 -10685 -915
3723 -915 -7629 -6868 9293 31524 35952 25519 14413 9607 3167 657 6219 19399 6056 4904
3709 4904 1398 -4044 3906 4880 1988 6964 18581 13587 9708 5724 2772 4585 29511 56049
3695 56049 61366 42229 14885 8844 16331 21203 24351 24836 6149 -5423 70 12438 19598 27529
3681 27529 35246 24673 5785 -15092 181 11547 3752 11731 7339 18118 19833 796 2532
3668 2532 24801 22126 6657 -1534 -11030 -8967 -24085 -31844 -45175 -57124 -65883 -49194 -23258
3655 -23258 -3328 13318 18495 16977 16122 20536 28037 10061 12934 -5962 -16040 -9590 -15202 -18297
3641 -18297 -8305 -3673 -13853 -7811 4324 -2348 -13868 628 -11483 -22779 -24211 -25009 -32875
3628 -32875 -29292 -17142 -24198 -38196 -50192 -50214 -41752 -21580 -13667 -14116 -6972 -6015 -17800 -18827
3614 -18827 -16232 -9510 -3438 -19969 -27962 -35118 -35931 -17859 -977 1383 -3966 3191 -7810 -4162
3600 -4162 -10393 -9462 6076 20399 22225 15516 14201 14047 122 -26303 -3174 14559 11484 2359
3586 2359 4911 9015 -987 526 -1022 -8074 906 10442 20958 8579 11828 -115 -16807 7553
3572 7553 10350 10862 8712 -1628 -2246 10245 -12783 -21169 -10632 -4096 9918 -8825 -14926 -17896
3558 -17896 -29941 -18593 10942 7894 -357 1325 14141 12629 4194 1297 4117 -2712 -15461
3545 -15461 -19979 -16460 5267 5153 -2730 2873 26399 33623 8613 -11126 -23712 -38023 -39104
3532 -39104 -14683 -7023 8604 12752 -13275 -24916 -16893 2118 12951 15536 17501 5142 -3536
3519 -3536 -15933 -19091 -4732 7491 -8600 -15627 -15998 -2262 9169 13037 11647 -1819 1931
3506 1931 -11650 -19709 -13466 -6039 1485 525 9124 -684 -6349 9801 27331 20230 4454 -15233
3492 -15233 -18588 -6531 5133 3790 -111 -420 -2224 6102 7219 9415 24264 11909 2933 1431
3478 1431 15497 11313 -9551 -25434 -23266 -21874 -24726 -36608 -31357 -33042 -26664 -11448 -12858 -8526
3464 -8526 -17563 -17555 -19946 -29546 -30525 -17124 -411 16584 20362 21798 14690 5832 -4104 10028 20905
3449 20905 12343 9478 17897 32646 18910 -2054 -12598 10720 19344 12462 -519 -158 2559
3436 2559 3246 3965 3833 3964 -3521 2835 -7451 -11406 -3212 -89 -5616 1986 3673 -5686 -10542 -12859
3420 -12859 6789 4648 7047 9080 11559 3095 596 5801 -1191 14462 37141 34010 23161 31326
3406 31326 7183 1013 5718 5179 8837 -8623 -18738 -30746 -11923 5266 12563 16331 10013
3393 10013 4164 -2655 8977 17600 10156 908 -2717 -19898 -26697 -29685 -33558 -36731 -17554 4471
3379 4471 9777 22943 23073 12572 4516 7162 -1407 -2702 -4647 1418 10562 2598 1326 -1366 -8573
3364 -8573 -17420 -14714 4050 17445 -9327 -40180 -44796 -39654 -36584 -32371 -20583 -19471 9506
3351 9506 2937 3076 5899 19 2791 4992 -9926 -7288 1263 19095 21041 18721 17391 21546 12667
3336 12667 8842 -10301 -4654 -1911 -8756 938 769 14720 6124 -4588 -11337 -7653 -5788 21034
3322 21034 25615 5283 10361 -3753 -13945 -13275 -11604 -609 8574 -2292 -9125 -5838 -21438
3309 -21438 -31211 -19519 -30044 -42511 -31660 -17393 -15446 -17812 -25907 -33963 -19564 -6004 14358
3296 14358 12854 15205 24081 23610 7632 212 -7544 -2316 -6801 -66 -8593 -2219 9853 25177
3282 25177 22874 14299 21119 23183 18956 -9898 -18820 -23446 -14694 596 12056 9515 567 7481
3268 7481 -1506 -656 -2808 -5743 4308 -6917 -5163 -7449 27 1360 -9737 -10185 -1382 17953
3254 17953 21318 11302 -2845 -446 -184 -382 6168 5824 7089 13972 1177 -14630 -10990 -5254
3240 -5254 -3252 2645 -22737 -6341 22559 2195 -31929 -34296 -22095 -7406 8954 12300 11049
3227 11049 3809 1459 3908 -1781 3971 17132 12881 15621 25015 17413 28678 30219 18685 13578
3213 13578 9030 9947 574 -8486 -6034 -406 2663 2006 -8795 -10481 -9381 -23237 -31430 -23837 -3527
3198 -3527 -3101 -7860 -11514 -13791 -9922 10334 9488 -7431 -12012 4162 629 -3549 -2362 5747 8051
3183 8051 12611 8890 6929 -9342 -19962 -13555 -19371 -7313 3842 28837 31299 24108 27547 27470
3169 27470 25721 30886 31861 30632 22945 12945 18381 14058 8822 -119 1690 3460 13657 8129
3155 8129 14653 10740 10937 6170 -646 14498 33974 19111 10451 9770 8988 16694 2375 -6040 -2150
3140 -2150 15530 18843 10403 985 -4451 -6253 -8596 -10719 -11625 -17177 113 -2293 7371 8799 9526
3125 9526 208 -4725 7772 20504 31206 31314 31160 9342 12188 14378 16283 18185 28185 9984
3111 9984 -10576 -14820 -8617 -25829 -9289 12342 29507 28326 14744 -4414 -23037 -18202 -17145
3098 -17145 -13325 -8949 -13867 -15151 -22405 -22530 -22815 -31213 -20250 -5332 2620 26654 29059 27687
3084 27687 8403 23604 20773 3839 5700 12436 20078 29064 34528 19926 5242 -12178 -15788
3071 -15788 4431 21928 10594 11776 15251 13600 7967 -6525 -5200 -6323 8442 41425 32572
3058 32572 2869 -8406 -1649 16826 21978 20387 15086 14243 16973 26431 13232 3631 -4940 4569
3044 4569 12714 3398 -7991 -14558 -16189 4256 29853 12186 2612 26690 39570 26404 21752
3031 21752 4174 996 -4856 -5933 5448 1922 -16966 -30273 -36490 -37471 -24392 -7648 -8773
3018 -8773 -17674 -10528 -14927 -11680 -4549 -8900 -13362 -3454 1829 -3837 -21537 -22951 -17943 -15325 -11801
3003 -11801 -31134 -33558 -33972 -11377 10291 -5237 -6369 -5248 -4620 148 6751 4148 -11940 -24992
2989 -24992 -19933 -15892 -14019 -25243 -12458 1067 -3060 -5249 -15401 -19371 -16200 4611 2299
2976 2299 -6275 -17283 -8759 -581 14794 -9558 -20608 -4075 12891 34890 16564 -18105 -21771
2963 -21771 -729 -7353 -14366 -10345 -17715 -11682 12418 36383 38372 28862 16521 12948 4742 20070
2949 20070 24540 27363 24376 16213 12672 12266 -5114 -6093 -6424 -8220 -3096 1298 11726 17519 23606
2934 23606 24011 18119 16882 16691 -15903 -18242 -540 5016 8416 10474 8030 2171 -593 -4650 -6781
2919 -6781 850 1471 4359 3969 -15674 -18489 -15796 -16180 -18637 -19534 -24126 -33437 -27977 -19047 -11019 6213
2903 6213 6976 -4317 -8755 -15594 -30165 -20652 -16430 -3414 -3971 -10692 -13617 -14933 -5173 -17987
2889 -17987 -12341 -3807 -5462 12634 19182 13316 -249 -4496 -14175 -24359 -26242 -17062 244 -9187
2875 -9187 -18601 -21111 -25601 -19886 -15943 -2964 -10144 -16190 -18701 -23049 7953 22899 19238 23050
2861 23050 14020 17646 4479 6390 8403 -9822 -16116 -20298 2842 10740 9860 -5995 -9711 -2564
2847 -2564 5824 17599 11453 15573 15941 13128 16621 3939 -865 7185 -9096 -19497 -7376 13430
2833 13430 20472 20945 19511 -1853 -12270 -8876 -5665 1001 13432 15995 -845 -4489 -10157 -20744
2819 -20744 -28985 -21812 -11976 -17685 -23203 -12963 -2539 -6481 -9796 9690 11958 6906 23127 12508
2805 12508 7016 6048 3425 14183 8238 7600 7258 -4955 -3229 3507 -1816 -14082 10758 23686
2791 23686 8641 -594 5240 3290 13893 13348 12099 10505 6990 4038 1887 9469 21754 12418
2777 12418 15461 15821 -4875 -4896 -7584 -1678 -14364 -31663 -34438 -25375 -21046 -8896 4098 1811
2763 1811 -11778 -31108 -28891 -14550 -6386 3511 13645 19605 13606 -15032 -32871 -24224 -18929
2750 -18929 -19901 -11124 -6767 -25452 -19284 -1510 17370 19511 1789 5113 -2221 -7708 1080 8490
2736 8490 1479 4486 -11262 -21197 -13910 -13659 -11890 -954 -5645 -1178 -9565 -7740 7547 7804 3625
2721 3625 21146 30252 31964 22394 15401 24560 27848 41953 34589 11651 1062 5966 22477 19309
2707 19309 20912 19594 17993 15846 6690 -2694 -10478 -17159 -21967 -15569 -20324 -23314 -22411 -20090 -24102
2692 -24102 -25223 -18913 -14235 -17051 -26418 -23610 -11631 -24676 -17584 -16461 -13781 4894 5668 3462
2678 3462 -2340 -2529 -4767 -3875 -7279 -2671 13131 7751 7990 11996 20454 20627 4069 13021 18650
2663 18650 4708 3091 15232 15423 -3184 -932 5058 3208 -974 8584 6892 2700 5832 -12970
2649 -12970 -13286 -448 5029 -8027 -1746 403 -5139 5060 29285 33672 20941 14296 8421 8354
2635 8354 10381 -3799 -8508 -4076 -15284 -998 7768 16173 16860 15088 20062 20103 4351 -5120 -1464
2620 -1464 780 -5925 -4953 8363 -5732 -21271 -7396 -7756 -12531 -12316 -2125 4961 -2932 -3605 6920
2605 6920 2889 -14282 -16780 10219 18095 15874 11298 1783 -11320 -4376 -2198 -1497 -7000 -10451
2591 -10451 4567 5038 5899 7661 10391 18453 23455 13764 11951 15676 6950 12861 17869 17739 3341
2576 3341 -788 20009 31057 16099 -1331 -13975 -14737 -9745 -14017 -25946 -22093 -3229 7823
2563 7823 -5013 -9035 -28227 -31264 -28315 -13730 -17890 -21942 -4023 12687 -3882 -11187 -455
2550 -455 9377 14453 2700 -3160 -5719 -14380 -20272 -22505 -19301 -5541 -4134 -737 431 26327
2536 26327 34673 34325 34608 37500 34927 17683 8111 1319 -6166 -13995 -886 10861 -12351 -23952
2522 -23952 -5385 2992 9040 1561 -2698 -12822 -12767 -12661 -24599 -38102 -32755 -17834 -7064 11723
2508 11723 3916 -730 -5583 -2420 -7939 -10932 1173 9868 4933 -19881 -22801 1603 22739 2746
2494 2746 -3904 7397 38112 42119 30814 16527 16430 30705 19444 19443 12662 11318 21502 31460
2480 31460 31204 26358 30790 21977 -3021 -20258 -17206 2387 1103 -19688 -22513 -7840 -396 13386
2466 13386 2252 208 -6169 -2240 3290 -3827 -11172 -6784 17604 9050 1562 3217 -8136 -19331
2452 -19331 123 17160 16775 19003 26359 23498 17703 20011 24211 4371 2341 3244 8993 700
2438 700 -20276 -13526 -7708 -16293 -11749 -12558 -21689 -25869 -30224 -28186 -42274 -26511 -4956 -2108
2424 -2108 6409 13907 20939 14869 6090 -4904 460 2228 3973 8361 -1742 -10584 2552 6626
2410 6626 10833 942 -6757 -18158 -19853 -5228 -3395 -4686 -6114 -3979 -2795 -8587 -15959 -10098
2396 -10098 9964 14260 1135 -5620 -4743 -12646 -29099 -34493 -32099 -14377 -12794 -21945 -23314 -24355
2382 -24355 -28654 -31536 -16877 2836 4451 670 -2029 -5583 -5439 1360 -5398 -11691 -3617 -959
2368 -959 -249 16166 27281 20221 19519 18671 8777 -6645 -6487 2289 15825 3689 -10698 -7392 3223
2353 3223 6636 6409 7995 5526 23400 21017 11452 6284 -6734 -10154 3981 21409 39132 37584
2339 37584 31887 27683 23462 12338 -3905 -7602 -4775 -4145 2620 6374 12349 10267 13639 27744
2325 27744 26264 15912 27773 31565 6848 -15930 -11741 760 -7443 -1822 3873 -6217 -217
2312 -217 11132 4276 -2190 1383 -6909 -25704 -21953 -27914 -22642 -31518 -31184 -14125 -27115 -27938 -9873
2297 -9873 -22808 -28841 -21410 -27890 -41622 -44080 -42708 -31597 -10020 70 -1879 -19094 -25001
2284 -25001 -21161 -5125 -2559 -13883 -27248 -11684 -13248 -3759 -2523 -4374 -2862 -1572 -5809 -1515
2270 -1515 321 3000 -8702 -15020 -3947 12035 11288 6522 1452 10503 14217 10471 3289 -5379
2256 -5379 4444 19725 18278 11801 17699 20094 12851 -212 -7261 -19616 -33827 -27514 -11330 -847
2242 -847 10291 213 -12592 24673 33539 21649 26562 47044 55785 38656 29008 9919 9912 14512
2228 14512 10228 9412 -3500 -7498 -243 -1585 2526 -10805 -12259 4542 19882 31744 34944 38563
2214 38563 32521 8093 6705 6438 6480 1005 13078 10858 4561 780 3592 6902 10871 -5348 -24874
2199 -24874 -18039 -5901 414 24558 17422 12716 12460 32486 45344 32208 11966 10519 25172
2186 25172 24825 16051 -9189 -10439 -5282 963 -6254 -18912 -14093 -8968 -21457 -19064 -25048 -15584
2172 -15584 -7188 -4386 -9433 -13942 -3295 -756 -15093 -11896 -11731 -13605 -20435 -9734 15032 20958
2158 20958 1599 -2163 -4251 -6954 -8871 -20121 -30815 -29748 -10134 -182 795 -2251 6380 8632
2144 8632 -5046 -12264 -8713 -7142 6652 19500 21213 -8060 -5502 -6095 -2014 -16778 -23246 -12487
2130 -12487 -15464 -10460 -5621 -6735 -4305 1697 17600 13887 13146 30853 16018 -8886 -8999 -14963
2116 -14963 -11333 14196 27016 17337 -3811 -8852 395 1777 6731 -528 1041 -9502 -9080 -3856
2102 -3856 -4678 5916 9857 8771 17733 9789 -18150 -20274 -20414 -28863 -17523 -1874 22901 20572
2088 20572 20826 19925 -344 -26155 -33781 -31793 -26899 -23451 -17382 -1101 -6126 -6724 -746 -2322 -12530
2073 -12530 -985 26179 34160 13471 -5595 7676 14514 6974 -5846 -6462 -4314 -9772 -8618
2060 -8618 -27255 -12293 11045 8969 9131 15576 9774 -13603 -9788 11105 21045 20012 6917 8026
2046 8026 -1081 311 12958 11016 633 -27891 -16446 -20335 -10691 -11459 -14947 -18286 -19579 -22375
2032 -22375 -19043 -18567 -24565 -10413 12312 14586 20056 9416 -6731 -2889 14470 13439 8958 22027
2018 22027 13528 -4750 -23106 -18711 4496 -2737 -13465 -9824 -5037 656 -6923 -10774 -5329 14397
2004 14397 25504 6055 -16372 -17826 -23372 -9592 7098 415 -5888 -15530 -14928 3534 -1850
1991 -1850 -7893 -975 473 -21216 -32743 -13596 8352 22650 21214 189 -8140 -7626 -2541 -284
1977 -284 24683 37351 21928 6628 13845 25694 22284 20066 2241 4465 3728 -12604 -101
1964 -101 12530 7383 1708 -9451 -15135 -2055 9175 21088 7479 8551 12937 10821 -339
1951 -339 149 -241 5851 27999 39653 32504 39761 30981 44156 45221 50115 37001 16694 -2925
1937 -2925 -21731 -23398 -11155 -529 11941 21011 9608 -81 5219 -12706 -13553 -15131 -19923 -21764
1923 -21764 -22774 -32872 -19567 13933 11431 -2017 8887 540 -2352 -1325 -11497 -11509 -7273 -15087
1909 -15087 -6073 -4496 -4590 -15189 -12011 -2055 7619 12012 7195 -8956 -20014 -14730 -3785 15933
1895 15933 20936 32528 30898 7461 9578 4458 4899 7631 3285 6256 14191 16488 15710 6672 5456
1880 5456 21842 30503 14043 7437 4634 19298 3794 -32090 -29268 -7665 -9093 -14600 -15349 -15149
1866 -15149 561 9217 13265 17793 15636 8046 11136 7394 15321 1982 -11717 -19401 -18718 -8155
1852 -8155 -3572 -9345 -11022 2650 9231 18627 15417 -10168 -23876 -1942 7552 1839 -9225 -3885
1838 -3885 -5023 -2088 10040 -20688 -30537 -31455 -26954 -2480 5443 6334 7888 13334 12219 885
1824 885 -9313 3480 23084 26751 33695 18575 -7108 -3531 -5711 -17991 -29494 -22322 -31600
1811 -31600 -45282 -32876 -25305 -25831 -22537 -13230 -9131 -6932 -17166 -26600 -23333 -9882 -12204 8915
1797 8915 26196 19990 8767 6817 6559 -6108 -22406 -21501 -14592 -11223 -6386 9797 18309 18764
1783 18764 25122 14341 3986 9226 14072 18478 22255 23438 25548 20243 7643 8976 508 -19568
1769 -19568 -16775 366 12701 12834 22161 26043 13442 16890 18629 15336 17388 10682 2411 -7044
1755 -7044 -10774 -9140 -19722 -10458 -10462 -145 4016 7236 8298 14859 14155 9663 9111 -456 -14094
1740 -14094 -22839 -23447 -22637 -11914 -2008 3459 18100 18880 23346 22700 1926 -1621 5382 7611 7922
1725 7922 16349 21862 141 -1131 3740 1124 -839 9864 4693 -7456 1587 22817 22639 21496
1711 21496 11721 13484 24424 31479 14357 2193 2030 3788 -1279 -1263 5675 2107 4104 8599 15861
1696 15861 6415 1659 8257 12128 8747 3056 10304 12464 16068 4353 10539 10687 20636 21523 17857
1681 17857 14631 9856 -3039 -941 5404 13671 11268 8178 13779 -4232 7594 15632 27795 13943
1667 13943 -4593 2521 -96 5024 11790 17697 23050 20302 24531 31688 13714 260 9677 16168
1653 16168 15078 -7149 -6280 -5261 -7879 -2136 -1799 -3782 -8240 -14282 -15218 -3797 -2981 -917 17265
1638 17265 -1829 -25721 -23906 -1396 1195 11403 23011 13697 -210 -842 -2793 5138 2898
$$ [...]
##END NTUPLES=NMR SPECTRUM
##END=
