##TITLE=Analysis number 325723
Compound Code sb 01739
Project Code adrs
Chemist Name stores
##JCAMPDX= 6.0         $$ Bruker NMR JCAMP-DX V2.0
##DATA TYPE= NMR SPECTRUM
##DATA CLASS= NTUPLES
##ORIGIN= Bruker BioSpin GmbH
##OWNER= nmr
$$ XWIN-NMR		Version 3.5
$$ Thu Jan 11 10:01:29 2007 GMT Standard Time (UT+0h)  MAYBRIDGE\nmr@NMR_250MHZ
##.OBSERVE FREQUENCY= 250.131544655141
##.OBSERVE NUCLEUS= ^1H
##.ACQUISITION MODE= SIMULTANEOUS (DQD)
##.ACQUISITION SCHEME= undefined
##.AVERAGES= 16
##.DIGITISER RES= 18
##SPECTROMETER/DATA SYSTEM= dpx250
##.PULSE SEQUENCE= zg30
##.SOLVENT NAME= CDCl3
##.SHIFT REFERENCE= (INTERNAL, CDCl3, 0, 16.5225)
##AUDIT TRAIL= $$ (NUMBER, WHEN, WHO, WHERE, WHAT)
$$ ##TITLE= Audit trail, XWIN-NMR		Version 3.5
$$ ##JCAMPDX= 5.01
$$ ##ORIGIN= Bruker BioSpin GmbH
$$ ##OWNER= nmr
$$ C:\u/data/dgb/nmr/ADRS/870/pdata/1/auditp.txt
$$ ##AUDIT TRAIL=  $$ (NUMBER, WHEN, WHO, WHERE, WHAT)
(   1,<2007-01-11 10:01:04.14 +000>,<MAYBRIDGE\nmr>,<NMR_250MHZ>,
      <created by zg, POWCHK disabled, PULCHK disabled
       configuration hash MD5:
       49 4B E0 1D 92 C2 6B 37 9F E6 65 BC 52 41 86 1D
       data hash MD5: 64K
       F5 BA 8C 35 28 5C 47 78 E2 0B 70 9C 54 58 1E 10>)
(   2,<2007-01-11 10:01:18.89 +000>,<MAYBRIDGE\nmr>,<NMR_250MHZ>,
      <Start of raw data processing
       ef LB = 0.3 FT_mod = 6 PKNL = 1 SI = 32K 
       data hash MD5: 32K
       1E 66 FB 27 79 4F AC DF E6 52 8E B6 63 E0 8B CA>)
(   3,<2007-01-11 10:01:20.64 +000>,<MAYBRIDGE\nmr>,<NMR_250MHZ>,
      <apk 
       data hash MD5: 32K
       B1 CB 00 8F 72 B6 4C C1 A3 07 42 75 8D F0 99 F6>)
(   4,<2007-01-11 10:01:21.36 +000>,<MAYBRIDGE\nmr>,<NMR_250MHZ>,
      <abs ABSG = 5 
       data hash MD5: 32K
       9E 58 D0 C0 19 88 B6 B9 6C 84 B0 3E 6B 65 55 6B>)
$$ ##END=
$$ 
$$ hash MD5
$$ 6A F1 DA 17 0D A3 D4 F7 33 3F C4 13 57 EF CA 14
##$RELAX= 
##$RELAX= 
##$RELAX= 
##$RELAX= 
##$RELAX= 
##$RELAX= 
##$RELAX= 
$$ Bruker specific parameters
$$ --------------------------
##$DU= <C:\u>
##$EXPNO= 870
##$NAME= <ADRS>
##$PROCNO= 1
##$TYPE= <nmr>
##$USER= <dgb>
##$AMP= (0..31)
100 100 100 100 100 100 100 100 100 100 100 100 100 100 100 100 100 100 
100 100 100 100 100 100 100 100 100 100 100 100 100 100 
##$AQSEQ= 0
##$AQ_mod= 3
##$AUNM= <au_zg>
##$AUTOPOS= <51 >
##$BF1= 250.13
##$BF2= 250.13
##$BF3= 250.13
##$BF4= 250.13
##$BF5= 500.13
##$BF6= 500.13
##$BF7= 500.13
##$BF8= 500.13
##$BYTORDA= 1
##$CFDGTYP= 0
##$CFRGTYP= 5
##$CHEMSTR= <none>
##$CNST= (0..31)
1 1 145 1 1 1 1 1 1 1 1 1 1 1 1 1 1 1 1 1 1 1 1 1 1 1 1 1 1 1 1 1 
##$CPDPRG= <>
##$CPDPRG1= <>
##$CPDPRG2= <>
##$CPDPRG3= <>
##$CPDPRG4= <mlev>
##$CPDPRG5= <mlev>
##$CPDPRG6= <mlev>
##$CPDPRG7= <mlev>
##$CPDPRG8= <mlev>
##$CPDPRGB= <>
##$CPDPRGT= <>
##$D= (0..31)
0 1 0 0 0 0 0 0 0 0.06 0 0 0 0 0 0 0.0002 0 0 0 0 0 0 0 0 0 0 0 0 0 0 
0 
##$DATE= 1168509663
##$DBL= (0..7)
120 120 120 120 120 120 120 120 
##$DBP= (0..7)
150 150 150 150 150 150 150 150 
##$DBP07= 0
##$DBPNAM0= <>
##$DBPNAM1= <>
##$DBPNAM2= <>
$$ [...]
##$SUBNAM7= <"">
##$SUBNAM8= <"">
##$SUBNAM9= <"">
##$SW= 20.6930455092707
##$SWIBOX= (0..15)
0 0 3 0 0 0 0 0 0 0 0 0 0 0 0 0 
##$SW_h= 5175.983436853
##$TD= 65536
##$TD0= 1
##$TE= 294.16
##$TE2= 300
##$TE3= 300
##$TEG= 300
##$TL= (0..7)
0 120 120 120 120 120 120 120 
##$TP= (0..7)
150 150 150 150 150 150 150 150 
##$TP07= 0
##$TPNAME0= <>
##$TPNAME1= <>
##$TPNAME2= <>
##$TPNAME3= <>
##$TPNAME4= <>
##$TPNAME5= <>
##$TPNAME6= <>
##$TPNAME7= <>
##$TPOAL= (0..7)
0.5 0.5 0.5 0.5 0.5 0.5 0.5 0.5 
##$TPOFFS= (0..7)
0 0 0 0 0 0 0 0 
##$TUNHIN= 0
##$TUNHOUT= 0
##$TUNXOUT= 0
##$USERA1= <user>
##$USERA2= <user>
##$USERA3= <user>
##$USERA4= <user>
##$USERA5= <user>
##$V9= 5
##$VALIST= <valist>
##$VCLIST= <CCCCCCCCCCCCCCC>
##$VD= 0
##$VDLIST= <DDDDDDDDDDDDDDD>
##$VPLIST= <PPPPPPPPPPPPPPP>
##$VTLIST= <TTTTTTTTTTTTTTT>
##$WBST= 1024
##$WBSW= 4
##$XGAIN= (0..3)
0 0 0 0 
##$XL= 0
##$YL= 0
##$YMAX_a= 246645
##$YMIN_a= -226892
##$ZGOPTNS= <>
##$ZL1= 120
##$ZL2= 120
##$ZL3= 120
##$ZL4= 120
##$ABSF1= 16.52254
##$ABSF2= -4.170633
##$ABSG= 5
##$ABSL= 3
##$ALPHA= 0
##$AQORDER= 0
##$ASSFAC= 0
##$ASSFACI= 0
##$ASSFACX= 0
##$ASSWID= 0
##$AUNMP= <proc_1d>
##$AZFE= 0.1
##$AZFW= 0.1
##$BCFW= 0
##$BC_mod= 0
##$BYTORDP= 0
##$COROFFS= 0
##$CY= 12.5
##$DATMOD= 1
##$DC= 0
##$DFILT= <>
##$DTYPP= 0
##$F1P= 14.0000005364418
##$F2P= -0.99999901652339
##$FCOR= 0.5
##$FTSIZE= 32768
##$FT_mod= 6
##$GAMMA= 0
##$GB= 0
##$INTBC= 1
##$INTSCL= 1
##$ISEN= 128
##$LB= 0.3
##$LEV0= 0
##$LPBIN= 0
##$MAXI= 10000
##$MC2= 0
##$MEAN= 0
##$ME_mod= 0
##$MI= 0
##$NCOEF= 0
##$NC_proc= -4
##$NLEV= 6
##$NOISF1= 0
##$NOISF2= 0
##$NSP= 0
##$NTH_PI= 0
##$NZP= 0
##$OFFSET= 16.52254
##$PC= 1
##$PHC0= 231.3823
##$PHC1= 9.36805
##$PH_mod= 1
##$PKNL= yes
##$PPARMOD= 0
##$PSCAL= 4
##$PSIGN= 0
##$REVERSE= no
##$SF= 250.129999864912
##$SI= 32768
##$SIGF1= 0
##$SIGF2= 0
##$SINO= 400
##$SIOLD= 32768
##$SREGLST= <1H.CDCl3>
##$SSB= 0
##$STSI= 32768
##$STSR= 0
##$SW_p= 5175.98343685301
##$SYMM= 0
##$S_DEV= 0
##$TDeff= 65536
##$TDoff= 0
##$TI= <Analysis number 999999
Compound Code 99
Book Reference 9
Project Code 9>
##$TILT= no
##$TM1= 0
##$TM2= 0
##$TOPLEV= 0
##$USERP1= <user>
##$USERP2= <user>
##$USERP3= <user>
##$USERP4= <user>
##$USERP5= <user>
##$WDW= 1
##$XDIM= 32768
##$YMAX_p= 402322508
##$YMIN_p= -319935
$$ End of Bruker specific parameters
$$ ---------------------------------
##NTUPLES= NMR SPECTRUM
##VAR_NAME=  FREQUENCY,     SPECTRUM/REAL,   SPECTRUM/IMAG
##SYMBOL=    X,             R,               I
##VAR_TYPE=  INDEPENDENT,   DEPENDENT,       DEPENDENT
##VAR_FORM=  AFFN,          ASDF,            ASDF
##VAR_DIM=   32768,         32768,           32768
##UNITS=     HZ,            ARBITRARY UNITS, ARBITRARY UNITS
##FACTOR=    0.157963299565203, 1,           1
##FIRST=     4132.78271255453, 0,            0
##LAST=      -1043.20072429848, 0,           0
##MIN=       -1043.20072429848, -319935,     0
##MAX=       4132.78271255453, 402322508,    0
$$ Real data points
##PAGE= N=1
##DATA TABLE= (X++(R..R)), XYDATA
$$ [...]
19772 -67052 -88338 18523 30700 -57749 -47939 3048 -625 -92607 -42134 -29637 -71539 -87653
19760 -87653 -57419 22018 58427 6062 21395 22044 26272 23298 62638 126950 148575 105277
19748 105277 38674 21667 -3315 55773 89477 111517 110927 56972 41748 58562 45423 42547
19736 42547 -51315 -28009 -40806 -104453 -28179 49512 101083 95655 89434 44582 48848 8487
19724 8487 -78894 -81749 -22720 38568 -27838 -72360 -103530 -95999 -58502 -43295 -135953 -134487
19712 -134487 -142165 -51504 3511 3378 10440 59190 97959 37672 -56689 27920 27556 -37273 -73852
19699 -73852 -105042 -79306 -52595 -30983 -14966 -52891 -98369 -35745 75241 50185 -46634
19688 -46634 -98537 -38459 -49050 -73138 -52132 10666 32669 12808 -45232 -57025 -32493 15430
19676 15430 84376 97832 30066 11117 -37517 -79495 -81363 -40687 -109153 -49846 -44682 22372
19664 22372 21058 -48024 -56019 22684 92313 78684 -38198 -78946 -40631 -10831 67331 129600
19652 129600 94962 64977 36305 90602 177284 179822 145196 81372 84201 31563 -84064 -100320
19640 -100320 -122991 -38110 20254 86063 29157 6132 -17106 -49581 -79736 -23056 46790
19629 46790 72229 47523 46468 -41399 -122221 -86576 -45202 74306 184535 123497 10620
19618 10620 -51848 -43602 -17069 -37486 -136962 -109726 -50888 -55485 -102239 -22526 -41745 36371
19606 36371 24336 -65392 -40114 36253 -62598 -103824 -124276 -4836 106974 126952 54041
19595 54041 -10794 2683 29595 -42467 -21530 20023 12568 38978 29774 -22365 -102761 -169936
19583 -169936 -193616 -125275 -79904 -3580 38879 47763 -11240 -60714 -22217 40438 127238 62514
19571 62514 20748 -55188 -200779 -169652 -92438 -20717 107252 66262 53467 41048 -56191
19560 -56191 -42212 -35379 -29597 -48132 8578 -8036 19767 131208 128351 127767 101459 74812
19548 74812 -46509 -167973 -196210 -188676 -99232 9500 -34733 -48291 13112 -415 -17932
19537 -17932 -46276 40906 47105 56108 -1786 -12931 -35566 -19256 -17417 47100 23625 -38109
19525 -38109 30746 83314 87118 -9351 -6585 11883 -322 6361 29136 48156 75558 30524
19513 30524 -13018 48875 112195 103922 40578 26293 76805 110193 97024 81142 40515 50800
19501 50800 3158 12487 50840 66300 -9231 -99962 -145346 -98084 29898 73315 34408 -22740
19489 -22740 30090 84707 88109 35323 2852 71587 22321 -48130 -3382 -8996 27128 76783
19477 76783 67949 32931 54401 64979 -85421 -126242 -49919 -34631 -100154 -91649 -56581 8546
19465 8546 69104 102326 77845 5221 44951 29530 2129 -9219 -14808 -38503 27605 109425
19453 109425 75505 -45463 -71315 -12023 -18296 16289 -24853 -36905 19568 5156 8660 -73766
19441 -73766 -58129 10514 -12246 54999 146892 149623 12140 -117362 -102556 -35128 -52539
19430 -52539 34450 16018 -28309 3649 16871 53507 51822 116860 139724 55007 11847 2372
19418 2372 -33555 27849 53225 54951 46317 6042 -17985 -26577 -64264 -24352 29784 7684
19406 7684 -149893 -194644 -123822 -25250 104664 94320 -516 -62973 -64521 -117200 -141056 -42415
19394 -42415 63212 23260 -26139 -61882 -36645 43923 -6053 -66623 -133988 -182493 -244775
19383 -244775 -134125 -94093 -62037 -60162 -44309 44101 64651 28689 -74276 -69746 41182
19372 41182 73648 137917 102718 102054 26832 33908 6527 -30518 -16153 -28725 -118042 -83729
19360 -83729 -20123 21158 48276 -48916 -143008 -142156 -111847 -45592 -19801 -22857 -32765 11404
19348 11404 81953 144415 163898 265606 368132 440751 400771 249905 180965 119745 152869
19337 152869 137422 49249 2157 -7075 -108932 -279948 -191509 -89448 3441 1939 -55261
19326 -55261 -16368 51759 77183 118291 62979 83616 84558 79184 77298 -9581 -70923 -80052 -96613
19313 -96613 -81309 -94233 -52780 -4895 -42270 -47187 -10122 29468 98370 40951 23245 60311
19301 60311 92823 108022 66245 54860 47991 20867 25282 9585 3160 23235 52070 162559
19289 162559 218224 294885 181996 148165 187430 215548 185949 164758 133323 163547 146016
19278 146016 135865 123684 55866 66700 87549 70962 52764 -19871 60740 73845 36957
19267 36957 16213 12224 30430 -66403 -110923 -104190 -70946 8761 27963 30426 38058 109558
19255 109558 79732 -9859 -31595 33520 84294 74882 -1469 -2441 52969 75392 92670 103081
19243 103081 174551 146501 35879 -33660 51243 43114 56959 27078 11430 -27266 -11745
19232 -11745 -71044 -58357 -26963 1882 -36648 -15386 13378 28248 41938 81823 37602 17740
19220 17740 62591 56153 35468 57634 90882 72009 -85267 -97740 -89799 -120528 -78861 -67503
19208 -67503 2665 -15588 -38704 40749 42220 -9476 -100833 -86868 -19801 -23126 -202747 -174545
19196 -174545 -164168 -136433 -102743 -84652 -74340 -87475 -75223 12329 -39997 -71815 -46533
19185 -46533 -9121 9155 65077 115239 26245 -36700 21469 25804 7144 -30000 -71447 -26944
19173 -26944 39975 31162 -16797 -54697 -97992 -97446 -94781 -61573 51277 39887 52390 71751
19161 71751 29073 -94491 -120096 -92484 -80174 -75471 4694 67863 13977 16123 79323 106202
19149 106202 66081 58513 75892 46705 -13340 -27201 50266 61275 68545 51426 35856 69434
19137 69434 166973 98903 64594 15386 -28256 46664 78937 55123 -21672 -40611 49854 89465
19125 89465 100291 51514 40658 18482 -100268 -134352 -93445 -25394 24346 43755 86012
19114 86012 158181 128077 168884 95830 79770 108544 114647 79268 39038 83584 176844 133294
19102 133294 -15466 9462 74828 42090 90273 114293 69773 50391 38174 -3940 -12148
19091 -12148 -13718 40057 27492 32157 22753 63831 108093 74893 32907 10394 39222 9252
19079 9252 -54278 46521 162166 71689 21723 -40898 24865 59056 39551 32836 37825 109491
19067 109491 116262 75866 6399 -45387 -11485 60562 131616 173091 178046 134503 149787 161479
19055 161479 123686 94832 185599 97026 44396 78606 74060 23453 89065 121642 106727 127480
19043 127480 133139 127603 149804 222836 134574 118111 84476 48098 55659 73630 69202 27504
19031 27504 -75175 -14572 62773 118744 36302 106279 197301 116187 81644 134246 169192
19020 169192 188265 81194 53750 176060 189125 183166 110624 93470 99236 103293 111919 138923
19008 138923 169283 151831 140574 80814 8596 -12280 -1872 17257 -23721 -56532 -31699
18997 -31699 -33073 -28897 8342 46943 82684 125440 215745 211886 204024 196518 222393 196149 192185
18984 192185 166585 20165 -26924 -5312 10965 3641 1694 50520 59025 75080 96639 177328
18972 177328 246230 215050 173258 2973 -44695 -61084 -94785 -69287 -64337 -118495 -118730 -21590
18960 -21590 31876 16606 55514 99424 119636 123149 93327 94763 32655 -25995 -41572 -130936
18948 -130936 -126799 -54524 5603 79187 72339 80874 187553 196834 100100 130566 180897 158856
18936 158856 133730 151321 125755 128900 134942 130610 102667 140896 144365 125524 66504 78599
18924 78599 160077 215570 230266 136256 78441 122975 274427 286136 253889 231837 120331
18913 120331 49780 -41789 -54322 -4473 -32097 -55260 464 128222 223551 257730 356945
18902 356945 382991 411420 415612 398964 321113 233221 199199 269185 342355 352207 287182 272645
18890 272645 304339 329250 365948 349335 374150 334832 325795 343412 387631 534595 611563
18879 611563 657147 684203 732236 897678 921729 901035 863700 796290 804727 807420 796900 851056
18867 851056 927520 955304 991199 1047554 1095544 1212218 1376494 1624495 1944451 2223017
18857 2223017 2553532 3052418 3607581 4396956 5583697 7372744 10165305 14357795 20346545
18848 20346545 27958412 36162798 42951388 46470574 45337615 40229575 32833764 25096118
18840 25096118 18473029 13578599 10146436 7768170 6158913 5043083 4252039 3637371
18832 3637371 3215259 2852906 2528924 2300452 2155916 2075024 2049534 1924238 1757432 1686075
18822 1686075 1729118 1677881 1587962 1691486 1794162 1766027 1689931 1660907 1626346 1670610 1687429
18811 1687429 1684498 1742101 1802220 1959208 2076765 2206290 2414182 2664209 2903987 3249110
18801 3249110 3742219 4315648 5106985 6287766 7930198 10401231 14133408 19501633 26807993
18792 26807993 35637000 44512722 50988352 53066478 49866521 42765899 33794541 25186995
18784 25186995 18178044 13207296 9834261 7594087 6132816 5102990 4222559 3553109
18776 3553109 3067116 2676162 2291376 2003253 1772154 1599399 1459457 1386090 1515290 1866036
18766 1866036 2040206 1756541 1422251 1187225 1083065 1077731 1027542 897432 776257 774979
18756 774979 777990 788528 756099 744212 662344 562187 496197 502427 538193 544098 656435 713114
18744 713114 781658 809169 763871 704374 604913 501403 393175 328327 272496 329895 253205
18733 253205 228154 215030 210075 186670 203935 274066 357926 365284 291429 265660 326057 303422
18721 303422 289786 225680 184050 127646 90057 79249 38306 121694 164195 123508 141070
18710 141070 233532 191139 161622 192852 167598 90343 137724 157820 171714 122191 99597
18699 99597 52369 26590 15245 19478 21821 43618 13364 -4192 55563 33674 44038 159611
18687 159611 208502 190346 139068 78663 20072 51168 124288 141149 92457 112548 112229 98682
18675 98682 65626 110315 116693 102545 139231 192875 238633 250220 175343 82719 73084 106047
18663 106047 104571 131481 112647 78343 84134 102640 97461 39670 38003 28555 34267 39259 81793
18650 81793 57800 92760 111744 116592 88694 180243 247594 242633 231263 163530 62471 46531
18638 46531 25711 80443 145789 138804 15205 -35507 -60866 -134434 -140348 -123571 -42737 46652
18626 46652 59487 79246 34789 50566 53236 107214 212214 254931 204629 112696 61320 86600
18614 86600 56225 54269 76955 103578 67247 51588 44562 -22321 -54670 -13012 22364 111091
18602 111091 171842 168356 137873 161151 180055 127586 143438 222233 213708 62066 45977 87128
18590 87128 166691 198144 288022 220472 130706 43119 40378 85403 138697 205205 237561 172480
18578 172480 222172 218280 228658 279072 303277 246226 238934 251342 271894 302987 214472 17917
18566 17917 -39058 26265 78673 93113 73836 86162 137360 114156 102115 154287 125408 115710
18554 115710 92881 120408 139007 200831 292236 309215 255395 185172 171851 199686 261665
18543 261665 328249 379451 432785 367704 383726 470166 580052 546707 508349 496397 530703
18532 530703 561160 599058 627550 654316 810583 964371 1064314 1192786 1272190 1417219 1478340
18521 1478340 1576647 1664577 1722055 1745829 1729092 1618504 1576511 1576125 1508631 1553924 1703735
18510 1703735 1877726 2072513 2148206 2278041 2296949 2323034 2309392 2179179 2017536 1856066
18500 1856066 1736785 1619837 1529593 1541257 1594743 1619192 1632480 1661576 1614052 1536876 1465442
18489 1465442 1397935 1315763 1123966 905542 831817 801117 678236 506035 481564 514526
18479 514526 512632 531059 515234 426965 493667 516638 546609 457147 384492 466040 491874 479809
18467 479809 515190 522698 420360 422644 416900 396891 400238 430104 460694 437311 430982 324695
18455 324695 201040 220532 342471 382975 324803 324671 301253 302887 299126 272560 367055 397368
18443 397368 437058 468560 421099 311751 241690 297023 397450 414846 407617 355658 338714
18432 338714 420541 369435 347592 351442 342259 389711 402954 357919 343509 362886 414158 456182
18420 456182 503533 521732 366877 278784 294970 235248 143988 159375 257122 328993 281790
18409 281790 311343 388089 348930 448285 469440 483507 479478 459480 551765 491967 368185
18398 368185 363896 471420 604223 614276 578422 540825 514748 464261 440464 393602 409360
18387 409360 467923 472012 461591 445606 450972 506829 538610 457151 474698 450881 398437 463027
18375 463027 508102 582364 642742 652078 611040 606480 650262 647057 644586 681427 659937 633093
18363 633093 727627 850612 906507 936156 873204 826052 773120 783615 757094 688403 740316
18352 740316 769617 828651 838307 855527 825224 842039 799200 885015 963002 1027153 1068087 1082926
18340 1082926 1030455 1049870 1059426 961266 954882 989483 985860 1010216 1022676 991907 994115 977394
18328 977394 1024738 1115108 1229518 1178727 1207275 1194755 1162958 1187833 1208938 1237988 1333612
18317 1333612 1343407 1329149 1381930 1378047 1455166 1585676 1671510 1686512 1709585 1838078 1925892
18306 1925892 1902438 1969098 2128393 2194286 2263227 2344186 2448602 2409979 2379640 2283085 2336239
18295 2336239 2407180 2525005 2707240 2851755 2917730 3067035 3287586 3421860 3475216 3515241
18285 3515241 3559411 3656669 3669907 3690769 3780147 3864520 3903799 4093416 4306990 4434303 4445527
18274 4445527 4592071 4738964 4848274 4973332 5106870 5290585 5437318 5644412 5881056
18265 5881056 6170376 6461755 6689079 6914623 7100066 7344901 7625899 7854045 8166436
18256 8166436 8584876 8904131 9242824 9425777 9704072 10028824 10407109 10707732 11027843
18247 11027843 11299608 11476847 11686645 11918973 12109887 12310965 12507367 12665287 12728916
18238 12728916 12832081 12981103 13012335 12933062 12859674 12737161 12696092 12536282 12310292 12148750
18228 12148750 11921251 11752420 11612301 11365586 11114872 10761603 10379301 9997672 9757610
18219 9757610 9488781 9126797 8819086 8539669 8291249 7984629 7714221 7499079 7239854
18210 7239854 6963259 6778441 6525678 6281418 6006214 5743384 5485839 5297485 5146391
18201 5146391 4980372 4818944 4751967 4603349 4393307 4161065 3989446 3927261 3795738 3690023
18191 3690023 3551644 3434704 3341977 3313073 3216188 3027617 2952390 2893034 2816316 2744104 2637173
18180 2637173 2572606 2550969 2559619 2558306 2482018 2359511 2330178 2264151 2201325 2176545 2114129
18169 2114129 2193351 2212992 2261745 2246893 2140208 2133447 2105193 2004772 1854958 1819614 1799827
18158 1799827 1797205 1786792 1769680 1785713 1807619 1814627 1788534 1765625 1797702 1838762 1728062
18147 1728062 1701859 1705991 1823626 1912330 1903171 1848180 1849850 1951084 2025145 1995613 1941358
18136 1941358 1930478 1967760 1983774 2043807 2085293 2210338 2349477 2433523 2553089 2708053
18126 2708053 2901325 3123503 3327358 3602957 3901814 4198220 4714055 5452758 6310974
18117 6310974 7406936 9019815 11453968 15286169 21600593 32565357 53171575 92097107
18109 92097107 154252896 199445015 157323610 92100725 53441873 34118160 23863074
18102 23863074 17800066 13926593 11215353 9168431 7509353 6310125 5459443 4750212
18094 4750212 4190158 3706486 3389182 3205697 2998602 2834585 2686297 2531318 2329949
18085 2329949 2280411 2206311 2149894 2128109 1963780 1895139 1778855 1616049 1473881 1466966 1552604
18074 1552604 1629086 1675904 1620362 1624334 1729604 1746051 1767915 1772719 1736746 1658614 1731850
18063 1731850 1746260 1722471 1696048 1672581 1665919 1657075 1653765 1713459 1742811 1703957 1732710 1737714
18051 1737714 1725553 1711425 1744240 1746502 1833172 1805392 1767990 1736882 1837588 1916798 1830470
18040 1830470 1841916 1887905 1887615 1911867 1882922 1854968 2006226 2122647 2223759 2371328 2494499
18029 2494499 2519209 2504855 2692107 2815123 2943515 3124332 3293580 3557466 3925885 4344619
18019 4344619 4858960 5363394 5931005 6695070 7683132 8878497 10240739 11752850 13295250
18010 13295250 14762240 16073603 16898196 17174119 16921489 16335514 15655369 15139950 14885022
18001 14885022 14910245 15359923 16048082 16983897 18074442 18910868 19339406 19320742 18719840
17992 18719840 17537577 15984943 14320375 12670131 11136209 9755034 8660932 7724568
17984 7724568 6991929 6402728 5874582 5410226 4905007 4543714 4341825 4182039 4044982
17975 4044982 3893709 3832261 3818135 3802716 3800085 3826633 3866914 4017904 4154061 4270477 4458442
17964 4458442 4717971 5068350 5487186 6010348 6747877 7645697 8682447 9920199 11265346
17955 11265346 12676077 14000566 14985782 15568251 15737212 15586445 15233546 14916143 14760711
17946 14760711 14754790 14915549 15176482 15612773 16065749 16595104 17145300 17346974 17032502 16030467
17936 16030467 14619027 13059001 11510673 9999394 8673071 7585385 6703041 5830097
17928 5830097 5066043 4525877 4109593 3729509 3415795 3156537 2879431 2659544 2436319
17919 2436319 2252220 2186806 2087641 1919588 1800669 1715200 1634954 1516308 1482573 1420263
17909 1420263 1364562 1313372 1242433 1215766 1173227 1206642 1154939 1121294 1157906 1362486 1456871
17898 1456871 1463818 1593266 1765478 1879501 1909463 1858668 1774053 1515162 1376325 1222366
17888 1222366 1134869 1013327 856460 716276 622142 580262 617605 640813 675352 663332 619710
17877 619710 579404 505406 471679 617214 605233 657271 750870 663909 498020 438748 434179
17866 434179 441590 398550 447315 385401 351408 461971 504846 440733 423215 421000 441627 504079
17854 504079 511460 574784 525457 554274 622499 688982 631505 582398 573295 611478 664908 609228
17842 609228 575536 682316 668751 629830 657660 636459 764317 722470 587690 620200 722436
17831 722436 717247 730354 819762 844152 818000 878624 886986 896555 946376 971319 1056864 1134380
17819 1134380 1232472 1281544 1317386 1465234 1659132 1815104 1922434 2034384 2211959 2406733
17809 2406733 2625939 2824485 2985764 3167064 3469152 3798543 4207726 4708344 5307879
17800 5307879 5985229 6890363 8018213 9443251 11432281 13941092 17295852 21797916
17792 21797916 27296705 33494024 39307984 43315242 44543643 42827952 38783336 33851254
17784 33851254 29346726 26099859 24312909 23837750 24825543 27274058 30838541 34908393
17776 34908393 38320375 39901569 38921569 35573137 30673215 25168838 20228285 16371732
17768 16371732 13299046 10971100 9218845 7805573 6731360 5865231 5193998 4640841
17760 4640841 4189279 3691198 3338807 3057111 2737004 2422398 2206440 2027485 1871024
17751 1871024 1744660 1597056 1445013 1353406 1208818 1112811 1044413 911830 773397 696086
17741 696086 725401 784580 752763 721882 718411 695633 669614 642480 596325 521579 514165 479773
17729 479773 404894 394449 389691 432596 441733 409493 371709 390377 489137 484693 421074 372349
17717 372349 403343 534633 605022 567580 502667 410194 395697 333203 320236 262173 235055
17706 235055 118657 82548 173502 230657 273027 283430 242799 245153 185389 169641 151287
17695 151287 159675 161414 156447 84842 17105 19200 -48128 30900 43087 27393 57860 88585
17683 88585 121331 64131 42787 68227 7746 -7150 -35685 -48895 -4320 -6674 55803 91296
17671 91296 93485 118054 158503 163136 199962 190131 206147 136391 70925 73042 68508 26942 96589
17658 96589 135671 236943 227293 221084 175348 116078 21750 -61904 -54660 10470 19424 3581
17646 3581 44245 6916 74516 170909 197250 199919 152305 95940 141896 170961 57058 11284
17634 11284 -21300 -86708 -89488 -92510 -47507 21031 42076 -27232 -102370 -73000 -121801 -63976
17622 -63976 -49644 -133066 -157599 -97572 -14881 32557 3276 23999 16269 16337 55650 66812
17610 66812 39750 22533 -30229 -90620 -102739 -52580 -77871 -73672 -44068 12650 83415 116534
17598 116534 70400 47659 81929 83037 31800 39884 73197 56631 33063 8974 55862 122622
17586 122622 78682 68153 78386 2419 -37530 -18673 1152 -13396 55744 42227 -11365
17575 -11365 17743 77150 117511 175509 160310 110916 119507 171706 56713 -37962 -86898 48200
17563 48200 202755 162543 80250 41995 112 -73967 -60243 -61021 -62254 -25349 13651 -24014
17551 -24014 -87943 -10967 5485 19331 1423 17252 90489 60579 -12600 37171 86620 73765
17539 73765 8345 -76233 -60862 -9053 57440 30670 12949 40660 -16840 -31524 32155 48838
17527 48838 25053 -22221 -954 -45241 -92417 -110046 -53467 13962 -45686 -71987 -78347 859
17515 859 31494 -45284 -27584 -64393 -99255 -80718 -89492 -49964 -3187 89380 126021 131186
17503 131186 160745 177893 64788 28451 22465 1978 37268 -79076 -57947 -5818 53615
17492 53615 19173 -57922 -29421 19015 144785 207200 235331 202846 95695 116018 146917
17481 146917 195918 214332 153318 121683 176802 184893 140645 58940 13027 10691 12729 49176
17469 49176 88615 138572 238335 176004 111564 97732 64275 71776 91378 106117 54235 48370
17457 48370 62275 52243 35492 29451 10942 -47094 -22447 45983 28330 -38752 -43577 -14050
17445 -14050 132284 406682 708352 1006128 873471 607463 329653 85773 58105 111213
17435 111213 89730 33301 20441 71234 27395 72825 171581 199515 201255 152573 60157 40473
17423 40473 69512 34378 -21133 55342 147699 217197 139195 84164 121508 217506 259294 240078
17411 240078 115950 29373 11611 -16339 16448 46596 151146 194351 198552 146025 150946
17400 150946 127654 193396 127978 110176 95376 97666 89791 153375 152597 61321 77588 116646
17388 116646 141704 56923 -7247 8691 52150 62501 41947 54789 13513 -27690 53994
17377 53994 109916 132872 117833 -39004 -50897 -16771 -13736 -90017 -117536 -86989 -7242 -47095
17365 -47095 -76569 -7710 9807 -4858 -17001 -25490 -74024 -104796 -27759 -99992 -155004 -185803
17353 -185803 -153182 -100314 -48962 -101680 -105811 -60833 -33777 -11532 -15484 23006 7941 -13462
17341 -13462 24709 104593 135841 64643 3919 71306 96401 92119 86603 119263 164619 117373
17329 117373 68364 94752 51915 49929 111772 182205 70588 32032 125222 277447 331058
17318 331058 437541 584338 673876 796537 949900 1055426 1173378 1305973 1328286 1335937
17308 1335937 1416995 1415059 1432977 1482291 1404463 1274267 1232026 1227884 1243002 1171601 1145029
17297 1145029 1217112 1247191 1181443 1168818 1041045 827290 718570 684807 577575 515745
17287 515745 488557 432256 334129 323420 384473 415252 383505 290122 227101 263332 308130
17276 308130 405686 386133 385102 423360 423927 436559 469539 467591 515629 564912 631812 767715
17264 767715 912658 1062795 1239119 1234895 1287338 1326210 1294122 1377033 1305252 1250661 1169298
17253 1169298 1153536 1187144 1192167 1188967 1222710 1203672 1123235 1131536 1052162 974309 917987 855287
17241 855287 818219 656410 506000 396730 352036 364975 307879 254820 229578 222473 159751
17230 159751 126655 130700 114762 124549 98978 66992 -31347 -100351 -23870 54087 25936 39161
17218 39161 99108 83779 47431 33524 -20382 -87212 -35045 12932 14001 -7009 64655 121771
17206 121771 77320 58271 31112 25009 49810 89151 29194 29686 -7647 12279 -16484 -54417
17194 -54417 -64057 -32912 49235 18198 39245 76422 136766 171911 75071 36130 44334 61761
17182 61761 70393 110448 191827 113181 67248 111985 187529 188996 152206 61692 87661 98962
17170 98962 113886 86344 125474 169776 179569 194927 143891 77556 70897 49394 54244 77912
17158 77912 67407 59633 92887 148684 92763 64332 178810 159904 83930 119518 148646 178774
17146 178774 156290 140633 155708 179510 255543 259849 295792 333254 369765 366937 448352 557579
17134 557579 654200 724165 859378 980383 1108200 1163841 1215514 1233868 1167039 1171945 1119123
17123 1119123 1007783 859210 890892 927441 916808 891888 900946 925201 966688 1084454 1078588
17112 1078588 1021684 1087466 1105255 1075813 942955 852173 753349 623461 521064 502908 466763
17101 466763 435798 253084 141438 40245 919 90662 103334 98270 115664 136683 210483
17090 210483 236989 161223 256317 275077 334324 355271 416188 447477 514665 624219 724125
17079 724125 878684 898133 919103 945471 988182 1005901 1005505 965791 858902 788224 773736
17068 773736 712572 663619 753547 865566 953088 986009 952123 976017 934659 916007 972388
17057 972388 875897 799922 689705 537654 403724 309684 272050 262655 247158 284460 288774
17046 288774 276417 183367 54846 -62484 -60660 14217 63307 24828 4469 -33507 -25668
17035 -25668 -86367 -118303 -107823 -112217 -99142 -3394 124196 135063 79055 137861 92720 -1474
17023 -1474 -45860 -37188 -4596 52549 62964 -3096 -22069 -25872 -36292 8978 -599 313 119961
17010 119961 133874 12886 -32875 -38196 -36431 6849 61018 67173 112679 61730 33109 46901
16998 46901 139890 105723 19239 19665 56361 100936 59902 12528 -4023 36349 16101 72965
16986 72965 60469 68478 86969 23809 7316 -1057 -47688 -68854 -79397 -6989 10619 -13
16974 -13 -3223 38997 92553 69458 -35472 -63569 -41068 -67865 -68364 -41784 -5267 4665 -34418
16961 -34418 -55325 -49691 -23218 21022 36637 110023 137538 92168 61372 74475 8860 2652
16949 2652 18409 11231 -1575 18691 76018 101301 116055 80486 47707 16916 -68127 -69275
16937 -69275 -2057 43314 64704 25591 -121906 -155804 -198057 -187150 -131855 -41208 78626
16926 78626 61865 -75845 -209677 -216024 -182900 -162894 -114260 -128430 -88858 37423 139630
16915 139630 70064 -48777 -25352 -104782 -104134 -62896 -8538 -5181 8034 58760 19144 -53714
16903 -53714 -51290 -79827 -54889 -41007 17618 82965 11262 -56566 12856 11479 -2067 -56292
16891 -56292 -168314 -120049 -77636 -22560 76044 97932 34457 16148 5078 5332 23448 40572
16879 40572 50402 -42813 -81806 -88183 -31036 -20469 -99920 -113789 -169700 -169265 -111077 -155458
16867 -155458 -206369 -218225 -106460 -107582 -112979 -122254 -129011 -80829 23463 59365 31923 12157
16855 12157 29431 -26937 -93173 -98197 -82386 -84170 -83870 -79078 4721 -30802 -39761 -58717 -21460
16842 -21460 -14222 -71297 -25779 35954 38027 -44748 -16580 -52066 -48140 -16400 73176 116393
16830 116393 87340 -11939 -38880 -1141 52122 65598 104709 153320 108499 41391 -22540
16819 -22540 23348 67711 -19345 -25942 44855 75079 31629 4511 20678 70554 37997 -93086
16807 -93086 -172921 -79365 -4288 17942 25132 38013 -12368 -27115 -111907 -119673 -12674 49628
16795 49628 50760 3278 -65413 -20417 -85196 -73251 -102 20848 9051 47657 38613 38218
16783 38218 3245 -100658 -146563 -167832 -115058 -147755 -65351 -76392 -55334 -35645 74700
16772 74700 172115 114495 42779 -30007 -88806 -5561 28969 9347 28768 91014 81692 29350
16760 29350 -21721 -2767 -28011 -119 -57480 -102259 -46097 -101473 -134378 -151840 -145897 -96100
16748 -96100 -91315 -92703 -78591 -115765 -146747 -43328 17078 65951 57240 -14987 -77858 -62764
16736 -62764 -81278 -84823 -135760 -229845 -206455 -153604 -85341 -31648 31241 -5347 -80174 -33565
16724 -33565 16367 81019 122387 94963 69890 113756 66438 28483 -13109 -16274 -56070 -72902
16712 -72902 -93036 -95456 -84565 -35667 21171 46358 -19886 -92103 -3658 68750 22420 -5614
16700 -5614 -31895 -104570 -56816 -42766 -105467 34165 156157 254477 162237 -9290 -85513
16689 -85513 -6561 98863 151615 112019 15324 -4460 49665 115334 109994 148068 162215 175666
16677 175666 119533 84909 110134 125675 106718 177308 170666 61651 29511 39063 -91396
16666 -91396 -157355 -97117 -110464 -100163 -78458 -54391 -70687 -114435 -5172 71462 62111 60188
16654 60188 89518 -8194 -12790 121315 170983 68235 -93859 -125206 -61457 -8667 -12347
16643 -12347 -38117 -82353 -27938 -43737 -53803 963 129425 79436 -33299 -42549 -44216 -26644
16631 -26644 -94601 -87864 29255 105968 116193 27422 -61073 -147557 -143711 -78118 3889 -54415
16619 -54415 -73348 -97173 -87795 -62383 -46145 -51572 -99768 -138494 20830 70835 -31830 -60441
16607 -60441 -29426 -13017 -40892 -46180 14261 74492 157684 140843 81718 39428 -40622 -19931
16595 -19931 -19745 -64952 -91979 -15501 -8443 17324 57048 -20646 32938 118311 128553 105804
16583 105804 79197 99824 107727 31256 -42548 -39592 -59673 -46956 -48076 -16217 -37136 -33052
16571 -33052 44497 84918 46392 59504 44935 41206 43841 79201 40099 13913 61479 109034
16559 109034 103238 20979 84555 161082 141777 100328 138088 79975 51504 108948 225067
16548 225067 180088 116985 171083 156481 140221 274572 268032 313956 410341 426395 533049
16537 533049 514389 511652 554549 667654 758860 863027 916750 963924 1109591 1162735 1274702
16526 1274702 1375885 1472021 1638400 1743092 1818443 1950128 2018088 1979253 2039867 2137300
16516 2137300 2140914 2030445 1855362 1727218 1697198 1617914 1449318 1361710 1293993 1171528
16506 1171528 1084865 981575 954041 928576 829025 714200 691364 720125 630006 593425 601145
16495 601145 617606 538140 464938 382246 321397 381380 455930 392663 296833 282576 168638
16484 168638 125688 116604 35250 157910 239814 277828 266780 280698 247979 185902 168763
16473 168763 243213 248834 163465 155125 212359 169277 130782 100119 108847 93249 66122 47527
16461 47527 6895 -61 -17302 47176 68559 66159 30474 -30095 -37357 10663 78498 40032
16449 40032 25119 -7858 -14012 8991 51390 -2430 19612 -30538 -26348 84146 80865 20611
16437 20611 -55394 -117163 -73072 -2984 -10584 27519 49480 42746 31120 119551 88307 73150
16425 73150 35950 -9443 6170 40405 2556 -59591 -111633 -10632 26819 -12636 63455
16414 63455 117220 59138 46328 -19921 -92200 -22996 42886 121402 165617 129583 122827 55720
16402 55720 -25623 -34304 -75699 -130486 -15021 76511 77109 19983 4759 21362 66294 75798
16390 75798 38815 8176 -64544 6968 17033 35153 37355 66628 88880 108699 85517 94383
16378 94383 136721 109197 48022 47520 23157 -27513 74807 133570 69168 62311 54020 69058
16366 69058 35230 -17248 -37642 -5443 -39011 -68997 -86298 -65152 52746 14595 -113869
16355 -113869 -129071 -26221 128362 140281 134002 87434 -39592 -149899 -144566 -74888 -25533
16344 -25533 27909 39054 19275 1484 -7897 11358 22657 56581 73633 63279 -29949 -110882
16332 -110882 -111783 -74062 -20677 43448 2524 55441 18744 8030 19354 55385 52478 106542
16320 106542 64596 4101 86498 156259 113023 167565 58788 62571 66645 74638 7824 -85179
16308 -85179 -70279 4366 -39188 -69069 -24646 37169 138332 244304 253122 339515 385274
16297 385274 337759 225823 174928 143602 121193 124179 -9768 48117 93296 90654 33282
16286 33282 19025 44798 22650 -38652 -38112 -3275 25114 61043 116523 91846 -32508 -25276
16274 -25276 46468 -43851 -64414 -22219 -7308 -2856 51499 55463 177097 190329 67890 -26600
16262 -26600 -99474 -72016 -81235 -126885 -75703 -66230 -28123 9164 -39974 -87406 -121070 -127981
16250 -127981 -144553 -79606 -37772 -75119 -58051 -69852 -90960 -86611 10250 5336 -72290 -123843
16238 -123843 14104 18501 -32844 41622 145854 156350 71548 43223 98637 147250 159728
16227 159728 161628 89002 -64 -8232 -59403 -14725 48229 57512 76630 103666 34545 -22278
16215 -22278 34743 115297 124850 46053 -18014 19772 30081 50854 21892 74187 47193 -26576
16203 -26576 -3753 -2735 -30718 -57507 -69274 -62486 -27359 72575 108152 62906 54124 82956
16191 82956 65787 17983 -33590 -45562 -44630 -60950 -122464 -106568 -83854 -100623 -58347 9287
16179 9287 99191 112857 74200 48388 -8666 -70754 -103824 -79484 -6793 25042 9723 -5880
16167 -5880 -62297 -91878 -65234 -52569 -65850 -108569 -49301 -61009 -141958 -65509 -5230 63190
16155 63190 49898 51885 15405 -884 8098 -12563 29815 -3837 -94316 -137847 -135223 -56541
16143 -56541 -100438 -107451 -44868 60144 117265 83750 6876 5694 8864 9862 -52441 -55863 -27743
16130 -27743 -50377 -71029 -26694 -68114 -39351 3108 -27856 -49077 8157 63003 98126 8097
16118 8097 -46442 19809 -15162 -106375 -87688 -53886 -58598 -66713 -63404 -54874 -107035 -61610 82409
16105 82409 43242 32879 -20956 -33821 -117571 -84103 -74075 -134328 -69478 -34813 -130121 -114916
16093 -114916 -118345 -33590 72543 97065 37178 -63722 -78217 -55711 -54751 -61750 -120974 -89910
16081 -89910 -70945 -146407 -120834 -109092 -82427 -49217 -67294 -84281 -139517 -145528 -80182 -59162
16069 -59162 39823 33323 -985 -29456 34292 41217 -18592 -58288 -23225 43569 59165 34915
16057 34915 -14236 -87189 -50312 18521 6740 8729 20648 53085 13282 6103 17481 -33139
16045 -33139 -96737 -81780 -111576 -135147 -129303 -84104 -13768 13434 34951 78585 -3340 -81502
16033 -81502 -67143 19510 44912 74864 91289 28069 -46151 -36166 -71674 -82028 -26781 20039
16021 20039 18379 -13915 -28397 -18945 67723 123103 76136 54373 20773 -16597 11966 75794
16009 75794 94579 53786 -39114 -53077 -17234 29628 45870 -52018 20024 146614 132104
15998 132104 111089 115922 109136 134926 209196 159289 120629 91794 750 -1626 46040 58881
15986 58881 -49085 -114932 -113360 5430 78536 73309 35363 -13994 -41717 2201 -15046 67271
15974 67271 47337 -50763 -45225 -128252 -114376 -77640 -63175 2649 1454 -53216 3879 6373
15962 6373 -45078 -101841 -163810 -152283 -160182 -66015 9605 74438 27930 37354 39536 113299
15950 113299 180708 187775 16212 -48432 40429 108857 147442 25067 46660 105679 110223
15939 110223 143485 152508 109510 103857 31689 76600 96771 72938 75550 49696 -7262 -13052
15927 -13052 -116606 -119832 -46111 -446 -80959 -105838 -38094 -1641 -90656 -170788 -205866 -113081
15915 -113081 41189 28981 -3332 -72616 -104200 -104632 -44678 -17514 -14705 -48375 -74240 -79666
15903 -79666 -88198 -83191 14029 31293 57455 129334 123546 22347 -39192 -50200 64088 129184
15891 129184 151857 174022 201351 109183 36672 24211 85400 20500 -14067 23376 55544
15880 55544 -28599 -68337 22555 12872 -68202 -98060 -46289 -26732 -18149 -69000 -115155 -49209
15868 -49209 -25628 -103486 -113776 -94262 -43533 -4280 -54879 -66090 -75444 -30524 -14199 -31026
15856 -31026 33949 26301 45242 12935 -54587 -21163 -27298 -1499 5972 -169650 -229818 -246116
15844 -246116 -228457 -189321 -170301 -105576 -71785 -14195 -4235 32378 66773 105508 34745 -35577
15832 -35577 -186693 -185805 -114102 -99350 -212977 -168928 -116226 -120165 -131241 -160170 -205577 -143615
15820 -143615 -60653 -93794 -116549 -157306 -232076 -224569 -228643 -187110 -127261 -105292 -153567 -162451
15808 -162451 -117816 -26836 67486 88865 14440 -7850 74802 27104 43666 59982 170168
15797 170168 147929 80647 3978 -48316 -38224 41720 12726 2533 20219 46875 -6086
15786 -6086 -5151 -75594 -101447 -55772 -98032 -187961 -183503 -72806 -36531 -35132 -46699 24073
15774 24073 -22069 -120992 -83355 -48392 -11584 60802 109204 46647 80485 14937 -35884 -65194
15762 -65194 -101773 -109010 -108042 -109344 28204 44863 -58044 -96877 -69594 -41259 -38054 -65678
15750 -65678 -26969 1064 42002 51289 -47610 -25764 38096 -16715 -35550 -15229 -50427 -154592
15738 -154592 -130010 -36604 -60469 -97138 -36579 -16823 13964 -19274 -87693 -58103 -62201 -103727
15726 -103727 -193989 -138891 -48830 25911 29731 -22822 -19379 31692 56846 109320 178641 202598
15714 202598 119042 48928 58879 -6550 -133539 -132036 -22104 -21018 -121631 -63039 -49939
15703 -49939 -84260 -93108 -75739 -77452 7103 -29141 -31387 -32535 14910 11120 55294 -23032 -87347
15690 -87347 -92455 -68562 -1162 -9135 54500 137849 140723 12148 -30359 -76036 -104394 -108776
15678 -108776 -86715 -62130 -25608 -20925 -75635 -178762 -197057 -170655 -135384 4515 93586
15667 93586 113756 60143 42109 57105 126851 210987 93054 -62704 -52519 -85039 -7434
15656 -7434 -1088 23022 32106 -78756 -119256 -144209 -123609 -63774 -62722 -107318 -175360 -193923
15644 -193923 -123528 -84348 -31672 -71286 -75886 37121 86700 142513 185875 172895 135045
15633 135045 119556 43759 -34945 -22006 22463 4252 -25799 50520 46022 18313 38314 32595
15621 32595 5954 51281 30649 11097 -7918 -59491 -153229 -161528 -131795 -132433 -116215 -105661
15609 -105661 -127864 -57508 -46987 6147 42135 47345 22954 26350 58868 58413 94337 118613
15597 118613 46729 -33161 38900 32680 4962 38747 -4255 2934 55565 15801 -90715 -108631
15585 -108631 27485 75013 107022 85797 84885 107446 93081 -47753 -155571 -120894 -34332
15574 -34332 -35596 -29315 -12090 19141 60468 43612 -28486 -15057 19848 16187 3820 35398
15562 35398 104356 46630 29794 -677 -20699 40246 -13796 23175 -26316 -46908 4827 -2545
15550 -2545 -21216 -1846 32798 63900 126385 183476 73025 -7224 -1635 29592 27449 -9513
15538 -9513 37535 60925 57202 39195 38632 -4216 -3233 19911 -4223 11867 10826 -18761 -45958
15525 -45958 -83959 -152571 -122859 -5611 23400 52773 67915 7285 -20792 -53365 -61027 38209
15513 38209 176214 185811 117464 46658 -66174 -141394 -130341 -122478 -119202 -59766 -39035 -131502
15501 -131502 -28322 80185 122339 84482 35770 103332 141120 107743 125611 142360 92029
15490 92029 80416 88814 111052 111079 91677 -20717 -15712 -25512 -93012 -53131 -49194 -27133 73036
15477 73036 70069 48541 78326 31659 -91395 -93169 -51380 -5720 16812 -38979 -26411 -2510
15465 -2510 30121 1199 -69813 -57104 14503 93780 62421 -34335 -57078 -98391 -87326 -54734
15453 -54734 25161 67506 46876 -38842 26615 111700 93091 46485 118036 145260 28250
15442 28250 -63380 -161695 -154563 -45784 -21938 -25721 -64873 -38296 18641 51865 68985 105250
15430 105250 122641 90333 -7286 -54072 -68717 686 -80969 -162102 -54734 -41081 -14975
15419 -14975 37244 38229 -27143 26545 49947 67457 13556 -44608 -87331 -70701 -30799 -13876
15407 -13876 40522 13092 -15341 -10024 -169611 -100774 -84899 -22617 -53044 -64883 -32955 2291
15395 2291 -38498 -50763 15838 -58200 -54254 -63610 -96486 -76214 -31038 -12281 -41368 -109659
15383 -109659 -103430 18281 44053 46125 34749 -4794 -38228 -44537 21006 48083 31817 39281
15371 39281 -50904 -135476 -131229 -145449 -107247 -33726 -53802 22437 105096 50485 -7062 -59128
15359 -59128 -131653 -223804 -238179 -170274 -226990 -217240 -143159 -186797 -208088 -162660 -96737 -11512
15347 -11512 53841 87230 93933 131037 99497 48565 58228 38077 26787 36769 -91943 -101689
15335 -101689 -105162 -103202 -85868 13902 33094 -58051 -40923 23887 15181 2032 107316 103651
15323 103651 39379 -30517 -89845 -97427 -34204 -34617 26889 95239 187283 152015 33126 46679
15311 46679 97868 111721 95515 72983 51048 20202 258 -15625 54061 121649 161819 88487
15299 88487 -29205 -63935 -84070 -42995 -28567 -23745 22068 47792 50905 57791 112605 157837
15287 157837 114465 500 -10588 81042 40938 31022 36974 1852 -13775 -11847 -40454 -45252
15275 -45252 9246 31654 -7742 1859 89757 67915 67779 80971 5914 -37956 20030 46479
15263 46479 52235 81439 6491 15042 75073 -7489 -4497 -82602 -153071 -148232 -60489 60563
15251 60563 82048 25873 36497 35831 24650 61149 103247 77308 64601 48980 68647 92026
15239 92026 19620 -36452 46531 94838 96194 102870 113858 70368 12573 -3202 -97520 -60760
15227 -60760 -73466 -59110 23088 32034 -9019 -50110 -40433 36561 13996 -11554 -3363 110697
15215 110697 196390 98688 12777 24294 43109 79195 71920 -71828 -123510 -98341 -46045
15204 -46045 -70170 -65211 -105946 -68706 22615 5482 -8585 -44695 -131516 -132710 -189835 -162602
15192 -162602 -159207 -172486 -138525 -118808 -154733 -153910 -93307 -62510 -66088 -53886 -77423 -55295
15180 -55295 -15333 10017 56734 66703 40560 -68738 -75196 -52462 -142224 -122214 -121404 -112181
15168 -112181 -157006 -155475 -130842 -4755 87101 29815 -15726 -2152 11559 -15044 43683
15157 43683 -4335 -48239 -101008 -168255 -115540 -63726 -103253 -81315 4671 69435 10900 -36722
15145 -36722 -808 -10798 -27760 -12975 30636 32177 -26396 -11605 -45600 -107402 -155788 -86637
15133 -86637 -12426 -52190 -20739 -38562 -84878 -8533 -11356 11742 31035 57662 23047 -1547
15121 -1547 25955 59556 101027 139914 143939 132581 125992 79638 55428 21301 56740 12259
15109 12259 -27604 -77949 -86631 9845 32829 80413 108989 58758 -49951 -45032 37405 61327
15097 61327 47058 14148 44119 61079 147979 153730 91745 45637 15046 21905 4021 -19987
15085 -19987 -37941 -75081 -87382 -59919 5167 32578 66007 80112 137045 112906 37254 -473
15073 -473 -62923 -91710 1531 38421 -40604 -74489 -85931 10009 36089 18965 39637 14580
15061 14580 9522 -21589 -80240 -38913 7733 40086 30490 84002 61169 -9201 -41792 -18760
15049 -18760 94101 136097 195986 161548 162041 136368 73979 101733 89802 -8232 1898 42439
15037 42439 22271 37864 59320 50699 -24958 66503 57033 26242 67490 9498 -55993 27287
15025 27287 9812 -43370 -32749 -9574 237 -32699 -33392 -86628 -94333 -90629 -82845 -15112 -30374
15012 -30374 -53109 -126691 -136685 -59633 43404 23201 74924 179643 96013 -30332 -92054
15001 -92054 -45202 20843 -2270 -29431 -7014 10125 79339 74608 -4926 -18470 45382 68446
14989 68446 53033 -86925 -141851 -101950 -44850 -72415 -49793 -33493 -54855 -42928 8682
14978 8682 -1370 27782 71977 118333 49372 -119998 -170296 -89803 -18743 24545 41040 74727
14966 74727 34047 73160 96508 39343 80577 19682 93479 172721 122101 73167 9324 -16080
14954 -16080 -8161 -22851 -104432 -161426 -101475 -55454 69633 113500 81805 45529 81607 27144
14942 27144 -12927 -19062 32493 68276 79678 79534 95274 104486 123608 58122 65544 5790 -128586
14929 -128586 -141519 -194812 -95551 -36755 -39337 52703 88466 43682 4291 57582 86196 64148
14917 64148 21378 -46265 -134191 -152308 -103270 32589 65666 33897 65082 47623 -56771
14906 -56771 -114285 -76656 -39482 -20237 21948 82466 89553 27146 -31289 -75561 -120409 -80342
14894 -80342 -44668 -12464 -35746 -114851 -85375 -38250 17386 -57970 -76460 -35200 -71002 -27514
14882 -27514 65197 145921 41125 8036 -16048 -64349 -169343 -147730 -72638 -32924 244
14871 244 -30733 -8734 184 16430 -4613 -12677 -7362 -34915 30509 17339 61475 126039 134927
14858 134927 156017 152550 86733 53789 11946 55040 76862 63009 57454 39346 -873 10152
14846 10152 -719 -11941 20511 56791 -17791 32323 176104 189632 92768 -41051 -133356
14835 -133356 -180502 -181757 -108095 -98305 -105144 -57194 -82545 -23240 11616 -40021 -40363 -23957
14823 -23957 -20880 -132005 -201322 -220212 -213780 -218901 -173036 -185729 -94117 -52385 22407 66106
14811 66106 99223 87566 58328 31310 -20211 -124678 -123236 -104050 -64669 -28007 -38737 -34150
14799 -34150 -14420 -26114 -43612 -127753 -208110 -137755 -107739 -52772 -39886 -1533 -43551 -147627
14787 -147627 -157962 -157989 -95890 -40178 -12126 -61240 -41804 35123 14114 13070 24615 38375
14775 38375 23926 16749 9591 -19230 29343 75051 76818 23788 3676 55318 85577 89546
14763 89546 -34666 -53570 -41420 -48133 -68116 -34379 -57841 -84371 -121688 -78690 -93010 -28276
14751 -28276 49357 -28652 -47778 8416 -49604 -50101 2179 42844 66795 49633 84187 119357
14739 119357 65031 -19629 35135 59594 41775 86051 164800 143201 98108 68836 32006
14728 32006 -50292 -57230 -8055 46394 22162 11761 -4460 -130771 -73021 54919 59485 1159
14716 1159 -79124 -114342 -104538 -35212 -50206 -43243 -32649 -15864 39977 33117 39012 67437 67262
14703 67262 62936 84293 120534 68252 33027 2570 -19379 -26532 -17045 -58965 -58900 -37741 40687
14690 40687 60868 33058 14364 -14335 10727 76926 32411 -74621 -123107 -55099 6407
14679 6407 -15425 -6904 -57549 -104520 -149789 -221634 -133560 -57007 -119724 -179301 -111304 14889
14667 14889 88036 113250 -65 -70572 -71220 -47431 17137 -27950 -55356 -86831 -3501 43267
14655 43267 36812 -59493 -110929 -107820 -94725 -79932 41364 68261 68112 24579 -94105 -71856
14643 -71856 -32006 -93214 -102752 -17681 19134 -56405 -119875 -98506 -35832 -94974 -98155 18063
14631 18063 58623 63576 45037 109588 83493 -8639 -87206 -135776 -144659 -200874 -194103 -115720
14619 -115720 -69142 46128 64247 59125 99293 127356 59076 70699 153982 204984 172572
14608 172572 68313 31561 31342 59944 107706 163568 106211 53480 49186 -45516 -37748 10335
14596 10335 105397 110987 78787 133031 62077 -11651 -44600 -65281 -92991 -48750 -116609 -124945
14584 -124945 -145744 -107531 -94854 -148064 -123665 -140039 -108963 29531 -36510 16889 51545
14573 51545 170546 193501 97540 20100 54854 -17318 -83106 -54671 -39811 8722 26754
14562 26754 3918 -27331 -5582 30213 6791 -2682 37927 -32165 -72677 -70789 -26841 2765
14550 2765 78409 115610 107622 99272 77492 6383 3979 -22561 -3040 100291 149211 101091
14538 101091 -15338 -13432 -62829 24227 57508 88572 38602 -5452 15760 37458 22298
14527 22298 49953 88053 106282 45406 832 -14148 -21207 -30421 -30033 49671 -830 13889
14515 13889 -8866 -11239 -17675 49332 139204 180565 190292 61107 -42350 -27750 32111 6054
14503 6054 -20379 23530 100458 138710 68695 -60942 -85840 -75564 -91536 -43122 -53557 -12938
14491 -12938 -62411 -128548 -114489 -130312 -98781 -55222 30300 114810 31232 -5796 12237 30461
14479 30461 -19054 -26557 70963 91604 107384 183085 174785 134233 49929 -28800 -42738 -88348
14467 -88348 -143303 -121885 -107086 -39863 -21136 -101428 -118551 -87098 -112250 -244651 -319935
14456 -319935 -243786 -131245 -10652 -17881 -85067 -90500 -79658 -33179 26191 -19731 -37576
14445 -37576 44392 53134 -60643 -44462 -25502 56665 60117 -10901 -73703 -90591 -120158 -191890
14433 -191890 -206389 -148024 -143076 -136374 -122074 -66110 -67597 12284 49070 12882 -18800 -5774
14421 -5774 29353 85657 -23859 -35205 3939 30219 -31377 -104036 -29644 44096 -30752 -22658
14409 -22658 19890 -28602 -34618 -23259 -49652 18876 186179 146077 75481 49723 4895 -18847
14397 -18847 -38650 -13270 -16617 17682 47494 -20171 25843 55698 2008 26202 41479 -34011
14385 -34011 -96067 -69032 -48612 -36469 -12662 59180 28129 -45125 -106287 -54612 41392 97331
14373 97331 137756 122365 25407 -61413 -87942 -48701 2157 -81743 -131772 -150892 -121484 -77350
14361 -77350 -21159 16668 34043 42515 4445 -3691 -69640 -120672 -185673 -151274 -96630 -70580
14349 -70580 -4551 108201 204745 136944 71282 3148 -50860 -11642 52366 4880 73657
14338 73657 123124 62852 -2753 32020 13000 -35178 -97943 -130725 -133039 -114895 -100617 -52811
14326 -52811 -59490 -40188 37312 -4354 -33931 -5082 109705 147509 110082 103709 131900 86900
14314 86900 26066 13101 73852 -2215 -84399 -63097 -121959 -84162 -58675 21877 51355 24107
14302 24107 -49503 16689 131996 118809 40610 -35866 -10305 -124279 -168405 -94135 -94594 -171818
14290 -171818 -102687 -20822 -28144 4861 29777 -72197 -84325 45099 55923 -66647 -164619
14279 -164619 -107374 -69565 -51464 -23885 -107644 -43949 -76006 -85718 -50771 2332 -78528 -181059
14267 -181059 -158561 -90696 -35603 -43394 -31140 -99820 -110652 -73485 -6214 -12741 39166 41048
14255 41048 17150 -15509 -62499 -19089 75137 120583 138670 1210 -47663 67068 106878
14244 106878 101037 133501 195964 144134 117833 119875 147382 142142 87929 99597 75087 78700
14232 78700 92725 51216 37237 37820 -7763 -42267 -38731 14121 88417 165139 143912 33530
14220 33530 -8830 -2985 42449 96998 151774 138212 55509 22825 -36529 40483 50319 -398
14208 -398 37977 14172 67369 81486 30446 -1106 -14492 -83514 -65280 -2765 63113 45791
14196 45791 20593 39140 38209 31254 123907 175983 110040 111979 16928 1749 17762 -27957
14184 -27957 -30048 -49923 -79618 -53225 24009 -11672 4805 -23186 6667 -12614 27483 29832
14172 29832 -30616 -9936 73306 109097 150656 85959 55834 94042 113033 9687 -18154
14161 -18154 -22433 -48083 30674 44026 -12736 -38234 -71091 -63645 -28649 1728 23585 30657
14149 30657 56943 72258 2994 51000 73281 -29575 -60780 -122438 -111799 -115914 -96191 -54405
14137 -54405 -6363 52566 45803 7532 -2259 55580 32258 -51076 -109565 21154 64871 118813
14125 118813 145785 138812 21279 -100463 -78120 -45219 16961 13152 53098 22480 -48503
14114 -48503 -36751 8525 54031 32345 39449 -14161 -19362 71987 16339 -52143 -67004 -75447
14102 -75447 -18252 23101 -7911 -84452 -22593 -18128 -132342 -96749 -48362 59039 72814
14091 72814 62307 93558 51074 4482 30362 33108 60485 50228 85199 82738 26225 -17749
14079 -17749 -19910 -87383 -31790 112804 199542 69950 -47414 18518 64753 78005 63232
14068 63232 35431 94749 153983 122413 58911 67524 -7963 -93104 -81748 5177 -70506 -138679
14056 -138679 -101245 -32699 -120185 -57350 -9107 -75750 -139467 -113056 -101243 -147967 -129760
14045 -129760 -125824 -90895 -118229 -48981 -14 21417 4950 -50222 -90669 -46723 -55428 -84987
14033 -84987 -25129 117187 169718 48080 -1026 43205 98675 109403 121095 177943 156947
14022 156947 78129 55821 83984 128639 132006 67803 79033 67536 -76202 -71716 -50027 -81854
14010 -81854 -80188 -128833 -68817 55246 79864 57522 12221 -22652 -121957 -125440 -208721 -254317
13998 -254317 -190053 -110924 -146651 -160679 -125352 -70655 -80851 -102725 -65984 28940 34886 33954
13986 33954 55926 29752 -24674 -82719 -140695 -189360 -141085 -61733 -60537 -61060 -50309 -25997
13974 -25997 -128288 -169896 -151421 -115439 -104952 -76623 -9548 30061 46728 40611 6329 12995
13962 12995 2963 -34367 -47062 -86602 -67943 42921 111160 98372 113968 107398 62236 52151
13950 52151 72068 85957 1057 11087 30640 -42395 -123541 -123045 -176074 -168551 -80483 -33577
13938 -33577 -37394 -12626 148150 201491 19963 -64802 -59366 -12112 14818 -266 -22611 7087
13926 7087 65086 80723 89963 116187 50819 -7067 -11852 -34564 -42371 -49364 -39361 -68206 -61317
13913 -61317 -78065 -48852 57585 59700 12011 -97274 -90513 -15813 116354 79577 70639 108139
13901 108139 96897 31266 17246 18063 -28439 -11602 102097 23318 -109776 -134587 -50731
13890 -50731 -23613 -53859 -16191 4963 55555 39249 3622 -81764 -69289 -58819 -97072 -133929
13878 -133929 -68257 -70304 -75337 -48816 -43319 -91105 -33327 19659 13120 -72035 -128572 -35360
13866 -35360 -9073 34507 55651 342 -6164 -10324 49312 7988 79120 157806 145893 130977
13854 130977 89409 -34253 -72329 -72967 -143149 -182339 -196782 -169781 -213663 -160869 -104249 -137211
13842 -137211 -154258 -78873 -79279 -133012 -78431 -35989 39019 41721 44093 -18103 -23423 -7318
13830 -7318 38868 2495 3040 -9947 -7574 -6877 17944 84383 59053 23650 798 -26489 -14165
13817 -14165 28468 30030 -25264 -23450 79393 96479 35658 -98723 -131776 -51875 -61402 -64229
13805 -64229 -1185 -31799 -20487 -19461 -62771 -105049 -48415 14732 -3480 10511 48909 167639
13793 167639 113911 127165 145059 50857 -62425 -86898 -132842 -80255 -36811 -35409 2791
13782 2791 13313 93895 62896 -14390 -34742 -31423 -13538 5203 2652 36783 -15225 50055
13770 50055 107702 58720 25044 60020 5371 -49785 -73950 -55411 -73423 -39835 31370 -31432
13758 -31432 -122115 -109504 -123053 -112128 -35018 98986 121129 131481 129192 85880 -46118
13747 -46118 -42781 -24802 -23127 -60467 -68645 -109056 -57073 61861 110553 116987 146044 172406
13735 172406 141663 147612 160445 93673 65779 109310 179550 137222 70667 -44903 -131026
13724 -131026 -147881 -181312 -174724 -145295 -116227 -45209 4481 -9941 9690 83053 88122 -15430
13712 -15430 -64277 -40638 -5895 -68003 -63753 -71120 -73959 -60897 -24941 -44828 -80593 -149145
13700 -149145 -111655 19964 69670 58892 -2798 -59466 -85309 -52828 -36190 -129657 -192257
13689 -192257 -180793 -89201 -6140 -37164 -21441 -23144 -47046 -18626 93680 48142 -46915
13678 -46915 -76325 -81038 -97265 -40959 -7338 -7727 31644 -3437 -21171 -59021 -115026 -104273
13666 -104273 -25038 12299 -7048 -47871 14675 51631 16017 42551 7694 64 -50052 -52538
13654 -52538 17959 41617 41929 65388 26552 52227 64854 107399 68200 -86623 -65055 56398
13642 56398 73995 132179 110144 118740 134822 179340 133056 91418 99163 38942 55638 122735
13630 122735 46950 28562 -11462 -57295 -80487 -20479 -99652 -145554 -172180 -136085 -41360
13619 -41360 5041 11952 -54399 -130742 -65671 20245 22031 -66971 -138045 -95282 -59194 -34840
13607 -34840 62459 129098 87458 -3184 -32458 15907 11649 73012 94523 95117 95754 113179 79821
13594 79821 104990 148943 140272 109988 56255 18263 45606 73330 94202 97601 95166 18078
13582 18078 -34678 4151 42622 64471 59702 23371 73643 135388 162733 80482 68884 123437
13570 123437 129374 131441 156636 130377 63210 9286 -9328 -60304 -74989 -39286 -45088 -31875
13558 -31875 -35124 -7866 3572 67086 78581 93631 61535 68713 21698 -36948 -46353 -29601
13546 -29601 6174 76418 -24330 -109500 -93409 -34710 7706 64636 63481 36965 27609 -79328
13534 -79328 -96707 -7683 33261 35070 59091 27955 -34325 -37180 -15582 35983 -10300 -63817
13522 -63817 -13764 6495 -17779 -23507 -48137 -63104 -50769 -31356 -13502 -58460 -29837 -103630
13510 -103630 -164986 -151662 -81345 -61645 -105588 -45878 28434 119937 133665 110229 26427
13499 26427 53758 152794 102003 30579 49979 48724 -28694 -97503 -83166 -33577 -76285 -20450
13487 -20450 5285 17572 65583 54028 -33962 -64357 -4902 -30373 13060 101123 49412 -32587
13475 -32587 -105720 -100512 -12306 36379 48528 68849 50381 -37218 -100866 -32799 9298 -2941
13463 -2941 -4568 24526 6646 43192 88162 61141 48312 61324 2294 -23503 -44994 3456
13451 3456 -17954 -20203 -97405 -80280 100 43574 -10466 -54896 -66233 -111538 -67046 -92626
13439 -92626 -86826 -92749 -46527 -8295 -60818 -84657 -71706 -39880 -16751 32086 9100 5691
13427 5691 -37103 -58520 -6685 51869 51840 18492 -1999 28643 53147 48252 7410 -28834 -91602
13414 -91602 -62648 -65121 10808 4498 -101082 -118578 -87357 -34831 317 -320 -8323 71477
13402 71477 141684 146740 61555 58445 62449 1084 100636 91189 6598 -103954 -82122 -23753
13390 -23753 -69893 -70160 -38462 -53802 -1053 -23083 -42768 -90909 -100490 -22825 28470 25131
13378 25131 -45882 -25435 -138983 -97363 27538 24388 68941 47336 -8092 57760 19173
13367 19173 15520 19529 -40577 5229 -16154 26688 95428 52270 -24531 -5885 49933 62258
13355 62258 93631 105249 91618 86606 93335 -15915 -71893 23819 74479 50688 52656 14621
13343 14621 36267 49776 4442 15592 24823 48263 63356 155109 154053 36849 -55438 -37930
13331 -37930 3255 41111 10217 -39189 -40269 11507 -31125 -118464 -57723 24941 28653 -24743
13319 -24743 -82022 -28440 43279 44052 32729 -15184 -19371 -51159 -30679 -15688 4805 -25737
13307 -25737 -69476 -70725 -64243 -9912 122345 114275 70966 77077 22264 8542 10557 -53955
13295 -53955 -43654 5480 121049 86792 17779 -8042 -7378 -10433 115983 94773 -24666 -76815
13283 -76815 13676 86503 28213 -39226 -62516 -53772 -8532 -39764 -128483 -96687 -73452 -71758
13271 -71758 -17586 -51385 -74998 20292 -5830 -50326 -49346 -68019 -101302 -98251 -117878 -103083
13259 -103083 -67427 -60145 29152 61835 101987 66586 73897 64648 -26134 -50147 -60913 -47150
13247 -47150 -59020 -58508 -340 21094 23278 20979 39506 -42353 19452 11384 -51553 -65520 20987
13234 20987 35062 -32009 -136732 -101295 -58280 -26113 -44334 11647 84997 104969 71525
13223 71525 19738 34738 36150 23991 -3326 17063 67525 114103 31516 -24833 2829 34336
13211 34336 18513 76809 156027 111327 50702 62064 -8124 -14592 -120996 -162051 -109314 -30416
13199 -30416 -9905 25958 27327 1330 -1343 -48154 -26562 41135 38334 128923 70481 20863
13187 20863 17933 15067 84363 123172 45736 66580 2638 -11787 35156 27882 -68158 -54835
13175 -54835 657 67910 79138 64264 21881 -32503 -88678 37846 10583 -93422 -54013
13164 -54013 -62465 -40744 -93902 -118630 -95671 -29063 -70022 -87926 -36216 -24931 6422 -39799
13152 -39799 -44980 -48837 -40207 -3324 -69226 -22773 -18017 6925 38526 -12625 -18721 -66795 -70214
13139 -70214 -38884 -17581 -40551 28931 91216 -23321 -130315 -209654 -192672 -164661 -173398
13128 -173398 -151597 -80302 -40415 -19174 61168 100301 103437 59859 -65251 -149130 -96830
13117 -96830 -124194 -46809 51867 6249 26491 100239 112070 105250 111733 102459 70772 -108685
13105 -108685 -125980 -130619 -95300 27952 119434 114186 -20592 -2357 81118 -13219 -30788
13094 -30788 -4821 40843 30718 -30616 -102591 -146586 -159412 -83528 37844 73595 39521
13083 39521 -39849 -45480 6502 64797 79208 64504 59098 77731 66792 60184 72965 52379
13071 52379 -29485 -98401 -84678 -82755 -68718 -18866 35806 -40047 -59578 -112733 -140170 -128364
13059 -128364 -172294 -88129 -20893 3655 -36331 -78434 -69098 -83421 -111569 -116250 788 32182
13047 32182 32851 31681 -43830 -103731 -70966 -13765 43475 123266 195065 160191 -23425 -128250
13035 -128250 -109303 -110166 -85622 -72144 -35455 -58545 -70980 -81198 -21245 -37471 -71475 -27468
13023 -27468 -39178 31414 194779 117202 32402 29884 64445 -2637 -15653 -63921 -36652 29288
13011 29288 64192 88172 42419 30403 160269 168183 130421 44863 1386 55459 92204 -25627
12999 -25627 -118841 -109817 -180638 -146908 -48736 -2284 -20427 21615 106160 103201 -30907 -67853
12987 -67853 -67629 -72234 -166421 -59423 -37782 -81502 -114614 -195984 -146826 -70026 49818 -5593
12975 -5593 -63814 -72655 -97812 -77165 -9793 13589 -10713 3796 8686 33422 -17165 -131984
12963 -131984 -129700 11503 -19913 -32831 -12922 -36417 -42576 8089 -20882 -104420 -163984 -147352
12951 -147352 -104814 -27157 6252 30181 62989 131051 90433 76271 34858 53421 49340 -18527
12939 -18527 -59693 6279 3290 28060 -6573 -11327 -22096 -41002 -153579 -238046 -180981 -158394
12927 -158394 -181008 -158093 -8482 48098 13512 57079 57073 40215 -32870 -76790 1631 42714
12915 42714 67051 107359 -15301 -75236 -23285 -61811 -24341 -13664 -22750 -46459 3771 68115
12903 68115 9913 -64041 -71235 -66058 -39826 -76253 -50855 13723 31855 91406 122372 57978
12891 57978 -42044 -137013 -115909 -115459 -73982 -62455 7790 51565 32868 8653 12072 85872
12879 85872 113378 118802 190444 108563 19575 7448 77022 34292 81412 111912 34073 -29493
12867 -29493 -57842 -84574 -86807 -82005 -114536 -111179 -77561 -41315 -58200 -34785 -4300 -60930
12855 -60930 -41957 78632 88962 30333 -10775 -2485 36768 132195 173217 97318 80972 28405
12843 28405 -8292 -8837 39500 24116 -21091 -84344 -59670 -53911 -47768 11015 -25504 -18264 -7462
12830 -7462 -28023 -39550 -71459 -36952 -28935 13834 106255 149514 24306 -49106 -17199 -30467
12818 -30467 -52501 -107951 -122236 -70984 -50111 -87807 -73081 -65461 23508 73811 34615 40766
12806 40766 -6395 -25925 -12754 24801 93619 144762 156043 92136 12831 47604 31907 11923
12794 11923 67761 12759 -11988 -87797 -120989 -194161 -126839 -28577 -53904 -27477 -33070 -116584
12782 -116584 -165517 -125592 -79100 -67943 -65779 -56814 -22001 15452 -53502 -125784 -78634 13780
12770 13780 49634 -39589 -102738 -113769 -87395 -48159 -120439 -123863 -115448 -129112 -88108 -11260
12758 -11260 31612 -44671 -73955 65864 255246 224613 48811 12350 118731 147324 144084
12747 144084 132769 110329 166545 85495 12137 -71031 -177778 -133671 -95302 -63389 -11669
12736 -11669 -12800 -60660 -40188 -14894 -241 -48359 -53392 -16712 35580 187975 224710 143316
12724 143316 127127 97899 47025 -15323 26023 77407 129590 104899 -16117 -70584 -67880
12713 -67880 -40549 8483 16621 40174 46009 -22544 -63598 -129899 -86636 -41055 -85874 -158158
12701 -158158 -267660 -296474 -258925 -288528 -254085 -185526 -102625 -63614 -49439 -36687 -151953
12690 -151953 -161636 -131661 -151240 -84765 3757 7426 -37839 -145636 -190042 -111937 -41153 -45926
12678 -45926 -51452 24977 -5401 -4155 73320 72435 -36820 -63182 18297 -9621 -3510 57175
12666 57175 -57067 -148827 -155139 -181402 -159337 -115756 -58792 -89636 -97094 -53760 -121923 -130310
12654 -130310 -61956 -13116 -53985 -24612 -73315 -101720 -35417 11216 28046 16435 -54680
12643 -54680 -21615 19656 29077 69760 1734 -121970 -165405 -145668 -86664 43050 69521
12632 69521 4175 -38170 -26500 -31860 -70550 -54505 -79319 -8663 -11563 -89868 -194187 -211960
12620 -211960 -126406 -46018 -9069 11074 -23891 -6440 24859 10245 -209 -28884 -52562
12609 -52562 -41483 42012 -9612 -72208 -16540 -41051 -6598 3305 -9426 37057 -26478 -68294
12597 -68294 -118779 -64548 51500 57263 53474 137087 121291 100811 141217 102659 26233 -37946
12585 -37946 6075 4839 -582 -47886 -74629 1662 30528 6189 -54256 -167755 -202725 -158808
12573 -158808 -121032 -136016 -161832 -110817 -59986 -81666 -98714 10005 47762 32581 18020
12562 18020 6522 -2702 -90583 -117848 -97874 -55168 -34111 27003 -12796 -1273 35105 38530
12550 38530 -26974 -28491 -96177 -119261 -36199 14905 -47716 -21611 -38258 -48583 80844 71333
12538 71333 -56865 -44472 103704 104062 -1277 -44427 -126742 -165452 -62478 -143039 -156802
12527 -156802 -237217 -200322 -185985 -139664 -152593 -111556 24723 76486 49112 58532 53795 5371
12515 5371 -31504 -79230 29913 114501 75077 36886 -4460 -105135 -205111 -158276 -40180
12504 -40180 -24213 -12970 -54047 18120 1664 30452 -3858 -32651 -90154 -121020 -143397 -164597
12492 -164597 -140711 -96489 -108969 -43436 -34281 -56439 -58642 6299 20007 29122 -60221 -112980
12480 -112980 -13622 41097 53729 67286 279 -46313 -33072 -42828 -27373 -83391 -76752 -66227
12468 -66227 -38772 -67503 -71595 -104980 -45688 19700 73761 120545 83737 57226 -25469 -67565
12456 -67565 -33685 -40582 -43084 15210 29311 69804 58046 24619 12977 -1055 -89911 -129990
12444 -129990 -76280 -25306 90509 71938 -31035 889 36568 -13755 -99957 -140153 -122097
12433 -122097 7877 47762 6025 45966 92447 24103 -28986 -46996 -78102 -71638 -124690
12422 -124690 -168363 -151383 -128264 -93847 -77659 -1859 59410 133527 103645 18135 28965
12411 28965 28586 -3657 -57307 -103414 -137541 -72094 12448 -6432 -35729 -89804 18384 -6293
12399 -6293 -69346 -40242 -15665 -58532 -33588 -55938 -119958 -121567 19934 101387 123382 103743
12387 103743 59142 12585 31476 15025 -71696 -171782 -137044 -32620 -34444 -27676 -36516 -90642
12375 -90642 -74949 -61701 42830 -22144 -11403 42195 40591 23852 4456 -25409 31796 22624
12363 22624 -49332 -99330 -90076 -58432 -21528 -9012 1249 35402 39353 46821 24999 -34911
12351 -34911 -20014 -65064 -35066 -3121 -10685 70538 21226 -33475 -91438 -35069 -40550 42969
12339 42969 80792 54142 -16424 38117 82370 28662 -11737 -19548 -52968 -69828 -539 30476
12327 30476 -35123 -34027 -13242 -29851 -31802 22059 9447 9477 25917 -71535 -83327 -60777 -40445
12314 -40445 -34991 -42989 -51604 -36631 -73555 -53215 20928 -21623 32302 124133 210389 111294
12302 111294 -14934 -20100 -3332 15886 -6885 25652 -47126 -14374 -29008 -31915 33607 59281
12290 59281 -2991 -48752 -16683 -22503 -38822 -30012 -50329 -14059 -6053 43076 102130 57617
12278 57617 80495 83574 6153 3421 -13591 -147959 -214820 -212047 -245065 -207588 -73931 -54453
12266 -54453 -120702 -60575 10426 -3426 12374 -14634 -58197 -13901 -13660 -19623 28533 20932
12254 20932 -33237 -59945 -61572 -36786 -43074 -59448 -83879 -145525 -126891 -182533 -224797 -153114
12242 -153114 -71203 -76044 -180124 -126361 -154440 -128753 -113017 -124584 -114704 -156962 -105670 -51286
12230 -51286 -34884 -19228 -52309 -85338 -46294 -35496 -42137 -24000 1474 -3305 47592 -34245
12218 -34245 -95641 -126707 -22138 18100 13838 17793 -11381 -66991 -117005 -80819 -156470 -118958
12206 -118958 -53677 -16920 9207 74450 58376 -6458 -61274 -98722 -79634 -94386 -106957
12195 -106957 -58412 -92360 -82335 -13499 -11592 45892 50124 -30367 -35083 -72455 -60360 -33875
12183 -33875 52654 42951 11303 -13711 -78699 -112410 -151728 -108940 -41367 -73847 -139793 -105432
12171 -105432 -60162 -25348 -90693 -119531 -150758 -58002 -57348 -94133 -101550 12185 28365 22988
12159 22988 34997 44869 -56903 -71514 -39380 -84633 -89588 -170389 -216668 -156711 13249 154489
12147 154489 98545 20405 -29457 -15876 28171 11044 -3863 -25148 -69190 -100682 -115172
12136 -115172 -79518 -4379 9610 -84825 -37244 16703 2729 -45311 -136378 -87348 -42
12125 -42 -53765 -70715 -118696 -92877 -26029 -45267 -121709 -115379 -44015 -66803 -118342 -140680
12113 -140680 -97755 -49773 -30340 -86548 -66021 3791 10691 -14360 -89928 -84564 -44073 -6110
12101 -6110 -9828 -82788 -45602 -16541 -13183 -50730 -136548 -99333 -48712 14774 -22964 -93396
12089 -93396 -49727 -31630 -172399 -157124 -138202 -87064 -130819 -119754 -89592 -138194 -127256
12078 -127256 -83098 -60595 -49982 -11263 16527 4260 -55167 5685 -18508 -19506 -53681 -107836
12066 -107836 -48295 20246 114123 167476 158467 116310 59997 -25951 -85548 -86961 -113335 -104451
12054 -104451 -137473 -180228 -72960 26679 84223 66549 38406 -84761 -91328 -1580 -22219
12043 -22219 -41038 -8497 19600 -20320 43825 -5613 -135840 -119656 -70719 -45926 55328
12032 55328 97672 55659 89098 121654 102592 25026 -10538 -78245 -109731 -129263 -62237 -28296
12020 -28296 -111050 -148706 -115132 -19625 40993 22191 -57164 -62888 -119600 -102347 -122616 -56307
12008 -56307 2408 5178 24570 26791 62399 92900 55422 34313 47360 55212 42441 37360
11996 37360 34568 54001 7491 20736 90379 4833 -121985 -132720 -85878 -53600 -109812 -52468
11984 -52468 5451 43276 71344 27617 -15076 -25465 -81359 -46974 -153 537 -16860 -11001
11972 -11001 -81594 -104773 -59421 -67614 -40573 -41005 -12623 -64808 -165974 -256316 -249191 -196129
11960 -196129 -179299 -223414 -217310 -51705 -9311 -100369 -126083 -181972 -173209 -173837 -118164 -93636
11948 -93636 -89971 -18991 -15581 -53553 -85449 -86957 -23976 -11244 -37882 -84663 -175440 -135856
11936 -135856 -53695 -52636 -79868 -96145 -157060 -196184 -176404 -148853 -204108 -147816 -57139 -51988
11924 -51988 -19785 4332 8185 4031 -4543 8230 18903 -4126 -68766 -58389 -25571 -13285
11912 -13285 -40989 4294 -27656 12710 51655 55025 120942 214240 154206 141722 145920 50380
11900 50380 -40709 -190050 -212763 -50399 93016 69696 -17988 -24787 22348 66049 87183
11889 87183 85989 126786 95511 50161 13841 21172 30125 67636 57257 -1558 -131583 -93192
11877 -93192 -39865 75351 66477 -34017 -99750 2822 129592 116211 66193 9086 -18444
11866 -18444 -129782 -158486 -129014 -43683 25486 -109650 -176909 -147763 -127952 -66265 -239
11855 -239 64894 21110 20257 67481 4132 -91092 -110454 -62300 -11617 -11050 -72895 -58270 -50409
11842 -50409 -55317 -110685 -26957 -68519 -174756 -203034 -110083 -88103 -85045 -71073 -125798 -89733
11830 -89733 -18401 -39400 -36900 -29635 -37628 27811 70096 56435 16325 -63568 -9150 83658
11818 83658 119417 88070 1302 -40521 -38226 41469 -10805 39815 91388 77688 25502 63046
11806 63046 122451 73250 -34094 -182822 -185659 -100756 -85144 -103870 -101668 -136100 -83129 -111563
11794 -111563 -175155 -126206 -113589 -112028 -93707 -104999 -55953 -82778 -110931 -120010 -65097 3915
11782 3915 -15624 -45138 -54754 -46772 -51198 -63938 -40920 -46883 -81397 -45693 62863 78370
11770 78370 -1743 529 -8975 67517 96663 37648 -26566 -18434 27267 78672 82564 17748
11758 17748 14741 -5752 -70790 -84852 -37014 1795 24220 -19602 -16823 -18853 -35486 -94443
11746 -94443 -147031 -164356 -93769 -19894 -27994 -64363 -99246 -102981 -109546 -60921 -82594 11158
11734 11158 14238 -55576 -17023 -48046 -124968 -123115 -65535 -31458 -36887 -157767 -208093 -167691
11722 -167691 -97153 -90416 -100264 -57511 -60792 -96145 -47442 47610 -4353 -13878 -59313 1270
11710 1270 44870 23260 -66591 -33200 -2127 -78882 -115801 -63567 12367 61073 105597 71356
11698 71356 92481 42967 -19851 -133810 -137712 -122182 -139151 -86838 21849 70000 12866
11687 12866 17461 -24176 -74960 6499 115825 147175 127431 61890 -58122 -97002 -77030
11676 -77030 -61587 -22858 -76382 -96193 -107329 -76265 -47500 -43013 -79258 -72172 -10636 153697
11664 153697 141019 15288 -19669 78814 120298 204942 252713 249689 214154 122776 84872
11653 84872 64987 20625 -109709 -128386 -71513 -88851 -81461 -64831 -64466 -14765 14426 -27577
11641 -27577 -69807 -108465 -176425 -137982 -160098 -76690 31709 48755 56822 12013 28191 90944
11629 90944 88643 3079 -34674 -78814 -58523 -37426 -36615 -50484 -14177 53370 82177 116576
11617 116576 117452 183664 320661 352146 350888 363776 432066 420977 425795 321976 249254 154453
11605 154453 221734 221607 150347 171606 186683 140913 99036 113090 153892 81445 -2458 -80987
11593 -80987 -64276 34480 -6089 -63000 11282 22926 68508 52521 -73317 -97892 -112953
11582 -112953 -34771 -13117 -21978 -23080 -900 -24972 -78688 -118630 -3902 112191 76188
11571 76188 35033 40128 91375 125833 170285 281880 307416 284317 286211 271222 162591 139288
11559 139288 173575 131547 87106 71936 50697 -39297 -34621 -60096 -62733 -56013 -49186 -9470
11547 -9470 -40228 -35841 -13170 16112 -56370 -95347 -21747 -42041 -110242 -144622 -77824 -76892
11535 -76892 -104931 -92446 -190730 -195111 -185879 -219081 -107110 33985 35798 -40880 -18356 13218
11523 13218 84276 140304 152448 184578 196362 124965 18482 -1754 81006 105654 93112
11512 93112 67891 34797 5217 -16079 60356 107864 71750 22199 -54998 -78436 -62733 -128354
11500 -128354 -147412 -101709 -73039 -93253 -44634 -39363 -39556 -4601 -12070 60046 134152 54359
11488 54359 -27341 -104380 -194880 -179942 -89417 -13135 -57834 -85527 -102339 -36597 -46794 -51896
11476 -51896 -94612 -61198 43854 112309 54262 36077 3886 -14141 -37716 -16665 -37773
11465 -37773 -126086 -59911 -5755 9827 1519 -6207 -24402 -35792 10914 -40725 -91815 -6003
11453 -6003 32397 24584 46861 82070 57734 33022 50230 74557 87909 83658 46107 65062
11441 65062 96286 74527 50333 48736 58289 56277 82120 -12859 -8449 15607 38343 -841
11429 -841 -25776 -64424 -84022 -63319 -25104 -38296 -86007 -49462 -31677 -29814 7462 -42561
11417 -42561 -72857 -6941 78579 23030 -48911 -59266 -76266 -66525 -41713 -57071 -5237 94853
11405 94853 50154 16319 9556 33882 31632 30482 75832 70408 120808 104290 133829 148920
11393 148920 128704 80511 32047 -33277 -118634 -159804 -68432 10295 83499 129961 66372
11382 66372 69726 43640 -13111 -43078 2364 9551 73706 113348 80810 181922 295169 207305
11370 207305 91479 -4468 2909 -5003 49312 110896 129702 46781 7027 -59429 42417
11359 42417 113850 176508 160992 13572 -33465 -43030 -75959 12073 146704 262707 291754
11348 291754 244960 225307 138832 6854 -49477 -22442 -35324 27904 79918 92388 68399
11337 68399 -10380 13187 23155 104655 127045 134793 102109 78889 150254 195076 165860 75263
11325 75263 -32466 -30055 65936 93067 110576 84929 53375 131108 101447 47246 112559 142784
11313 142784 61336 2651 132441 154041 139255 136136 103639 116384 140257 257234 311312
11302 311312 304951 284721 352690 313935 325114 396627 419386 275348 174977 260655 375064
11291 375064 369178 355891 445018 506981 507491 600869 733236 847662 1036546 1265977 1533342
11280 1533342 1687038 1843933 2081420 2332927 2559034 2730312 2932039 3274009 3754494
11271 3754494 4467069 5664343 7459848 10151581 14230813 20327478 28965373 39225766
11263 39225766 47931739 51270966 47753619 39251429 29667796 21653676 15924491 12060068
11255 12060068 9442589 7630790 6334715 5407236 4836422 4411454 4078658 3910787 3651888
11246 3651888 3478844 3291012 3104593 2976135 2831030 2835206 3129167 3357138 3741090 4314123
11236 4314123 5068970 5865806 6612266 7140309 7494348 7657526 7658470 7561790 7677601 8059412
11226 8059412 8760808 10075497 12164004 15474913 20640588 28746363 40419649 54883886
11218 54883886 69320501 79675253 82617604 78271030 70097269 61309250 52672837 43804329
11210 43804329 34802771 26665523 20276615 15708151 12638856 10577150 9150119 8208726
11202 8208726 7618243 7374850 7393131 7709028 8219324 8421557 8063235 7148161 5936561
11193 5936561 4941786 4289784 4027221 3876500 3724110 3632099 3639522 3675227 3815549 3921645
11183 3921645 4112648 4344827 4610552 4938148 5346423 5986794 6994565 8546962 11067646
11174 11067646 14960106 20929044 29486302 40355610 51033927 57195296 55786066 47511116
11166 47511116 36452224 26404247 18947675 13928807 10663275 8425114 6885555 5817862
11158 5817862 4954936 4287348 3849744 3556342 3332237 3075353 2860438 2638238 2376354
11149 2376354 2150619 1911985 1742137 1562211 1429554 1335792 1142701 998364 883102 807582
11139 807582 666951 652410 653108 712401 687888 602173 578295 483339 404336 365605 298487 350444
11127 350444 338937 252707 303928 434748 422507 446491 455691 432915 412797 339751 260965
11116 260965 201398 219567 239764 189775 177443 203698 226482 223646 190700 188361 264638 316485
11104 316485 187273 141415 202169 194581 199604 190118 245103 284918 230466 212303 225410 289286
11092 289286 295104 278614 233891 193185 168033 161030 141038 142404 105934 42547 80418 76212
11080 76212 81152 144193 177503 159790 187506 306891 209091 84937 37790 134225 298024
11069 298024 326274 195438 104855 62849 87962 69890 5338 -38997 4435 29541 58019
11058 58019 87294 52813 5684 12854 103817 119294 68927 34599 9506 45098 138838 246275
11046 246275 332958 356819 296889 238763 130285 87310 99836 56267 38067 93056 136808
11035 136808 124530 39703 -41938 -95788 -35392 46888 68838 201608 292992 249842 136995
11024 136995 136762 61083 32590 75558 131797 164853 75114 -36577 -39428 -17820 -61624 -30287
11012 -30287 -73345 -137828 -83348 -55856 23323 16002 47160 84691 21649 -47425 -27006 26149
11000 26149 128298 78396 41894 90128 99972 45708 25833 -22646 -4855 33219 28142 86767
10988 86767 120511 125913 43132 -39963 -17910 133874 173738 203450 193150 124937 28300 55588
10976 55588 60785 13203 20310 72489 138824 116545 -16373 -4304 103836 74728 5978 -49199
10964 -49199 -4763 -77938 -73275 40956 138975 135068 20981 33413 55817 76194 43699 40929
10952 40929 83641 45013 65103 30701 6676 67499 78561 5335 -20929 -18476 -90046 -95037
10940 -95037 -75513 -34013 43352 50555 50568 34232 -7616 38606 72936 61988 113488 138854
10928 138854 132786 155089 71658 25316 56322 -29562 -49904 46086 104982 66851 -81425
10917 -81425 -91636 -50904 15786 55847 52184 35560 112122 139886 236816 182718 124435 28182
10905 28182 16339 -42972 -54354 -47564 -70807 17022 3339 -7573 18614 21357 9637 39312
10893 39312 -21009 -88722 -72906 -77711 -95255 -15164 -10589 -71482 -46700 -46221 -67255 -79687
10881 -79687 -45243 17768 56349 76660 19277 -10360 -6926 -57696 -92789 -87287 -18533 -67538
10869 -67538 -118644 -39313 113577 146324 108040 200307 238089 246137 290206 297366 282865 223008
10857 223008 246617 233331 155156 132094 166771 175770 130724 24658 14432 6070 -98043
10846 -98043 -98953 -39814 60086 92145 47045 52634 77795 46250 85449 122652 94012 -17486
10834 -17486 -63342 -34364 -24652 -12092 -9395 39302 50036 41689 35370 105980 189819 82399
10822 82399 20864 89783 68660 97085 271572 410823 475651 459812 428912 454160 427645
10811 427645 289865 213614 176737 259861 212382 208301 195988 161145 98095 85759 147650
10800 147650 91715 36372 60502 35374 -25038 -41169 -32423 -63002 -42724 -5957 9900 46102
10788 46102 160619 237992 231131 163822 64332 12429 -6799 28906 95774 75984 74804 38892
10776 38892 49591 92596 83788 82573 134847 152422 194893 232293 359263 403237 290161 125888
10764 125888 -20912 -43859 -138682 -115645 -71324 -6310 -10451 25630 43040 58390 1241
10753 1241 19776 57046 8791 -42037 -31806 -88478 -156506 -170313 -178075 -188328 -240287 -224198
10741 -224198 -209572 -156008 -84454 -93255 -147238 -87083 28294 14324 -30271 -46018 -93831
10730 -93831 -66190 -95909 -127852 -87202 -110417 -75410 -1338 46414 114394 106009 58679 91709
10718 91709 127357 168189 44527 34581 108276 140555 127400 158653 195458 230538 350658
10707 350658 388543 688837 1235974 2072409 2971422 3336310 2784293 1926263 1313482 935254
10697 935254 711315 454498 334472 237472 105496 108438 220347 159966 57452 49455 83889
10686 83889 160396 187420 104687 66739 86550 119545 102231 -35355 -58525 60887 100779
10675 100779 70562 31130 50593 -818 44677 61964 138787 151011 158677 111451 72931 -14460
10663 -14460 -79828 -20314 -269 15900 39930 -53396 -123288 -124941 -61872 -46037 -42028 -83769
10651 -83769 -90766 -94030 -97159 -139232 -134289 -58727 -9569 5312 37230 -32938 -138896 -190971
10639 -190971 -220853 -234960 -243284 -141810 -55043 -50198 -97186 -110403 -111583 -129285 21204 -25189
10627 -25189 -98549 -90070 -129444 -122134 -114271 -15178 23323 13980 -54960 -78065 -49414 -20929
10615 -20929 8077 83334 95036 22059 -50967 -83499 -86524 -59493 -102382 -23890 -10034 -34438
10603 -34438 -125278 -131480 -94527 -105925 -49993 11992 -27530 -86581 -156015 -79030 -55546 -65012
10591 -65012 -67309 -137511 -102081 -76864 -147700 -163999 -166941 -56275 9026 540 -54209 -13409
10579 -13409 -3747 5294 33983 33899 -52271 -106042 -12945 54435 20254 52254 -1261 -104931
10567 -104931 -96634 1518 63081 6262 61356 139692 53817 -8972 3674 53980 35592 -51338
10555 -51338 1204 -10365 -36873 11628 -20504 -31422 106486 119219 110372 136187 88402 41856
10543 41856 -20878 -26268 20703 57861 32986 84937 109075 40951 -80374 -103982 -142048 -29381
10531 -29381 15550 -29657 42051 86860 48585 54355 58794 19684 -1254 38981 98439 75699
10519 75699 92787 180668 216528 149679 112906 207200 389120 572349 838312 1222124 1654979
10508 1654979 1869439 1746062 1348309 908609 609664 357513 192916 134352 215461 185555
10498 185555 133172 139098 146052 108332 31755 -64489 -30921 -43318 -15748 -20738 -12411 19810
10486 19810 27917 87096 155172 121015 201103 109024 -13129 1080 49441 21602 -4799 41137
10474 41137 55453 68328 30666 -34016 3206 96916 47686 4638 34414 38914 95750 48178
10462 48178 -19702 -58717 -74776 -54331 62983 92593 81385 41705 17086 13767 21378 17840
10450 17840 -7636 72177 56078 82767 154038 86001 -30628 -22830 23969 -4565 -67928 -89063
10438 -89063 -13504 31718 38830 47116 -34254 -171463 -237104 -227902 -166164 -83339 -64230 -107190
10426 -107190 -90172 -68102 -75695 17087 84246 105658 161212 118166 62777 46423 105195 143997
10414 143997 68475 9620 48676 39242 43508 71955 109379 90114 72429 21189 -59850 -26349
10402 -26349 60301 132914 195584 160131 185530 237552 304062 265293 114818 60477 53646 25067
10390 25067 -28158 -50313 -49940 -42076 -50419 -76304 -71020 -65024 -51346 -4098 -39255 -10327 -31150
10377 -31150 776 29443 -33402 -42466 16620 500 -46303 -39936 93256 114744 118442 116159
10365 116159 93772 22326 -64671 36205 161668 200927 258057 410866 467249 414523 421200
10354 421200 345880 348282 362299 460672 406788 315712 292321 227542 218828 265434 263889 187403
10342 187403 115698 112424 174718 254779 154841 39150 -4126 92944 92597 -167 -16813 2048
10330 2048 -14558 22002 60471 -24718 -55145 -65319 8022 92289 103791 79318 121100 164779
10318 164779 127386 80840 32232 43647 57022 29039 81287 138152 65679 -13824 -47833
10307 -47833 -55737 70499 181566 230069 292988 270973 259277 165112 74532 -33415 -41103
10296 -41103 21480 56241 40644 -47352 -16248 -14804 -74261 -76386 56425 78688 84634 185465
10284 185465 131292 55703 3668 45815 85447 89025 71955 95543 158213 211257 166056 52822
10272 52822 9424 -41152 19571 30713 83071 117215 136544 182411 177298 135909 82501 182972
10260 182972 281989 198240 198531 238582 205647 232281 211054 181800 255297 289870 278732 186982
10248 186982 153200 130609 142367 132882 129858 185941 181613 232555 356864 410453 457233 423968
10236 423968 418125 370467 343150 304478 272517 108670 -91122 -166930 -41219 -29995 -27679
10225 -27679 -70470 -39501 34547 70757 128924 131667 118085 97469 105656 167146 127088 56115
10213 56115 43362 64102 97389 76062 73654 187109 186846 125138 71164 90988 62400 -3190
10201 -3190 1017 92271 139222 74066 56077 75016 57665 110985 149117 170632 176852 230922
10189 230922 242160 224693 270388 339051 395522 416379 538467 618748 630549 532811 351318
10178 351318 301326 281282 176902 116850 85502 182961 218225 242381 376530 381145 321314
10167 321314 370622 428127 344085 410616 439106 389063 489956 603819 600608 557930 574071
10156 574071 701126 747064 791352 888966 962897 945295 850558 808609 850590 922056 951577
10145 951577 973041 1035001 1161655 1327508 1483319 1593164 1706260 1868678 1982833 2050674
10135 2050674 2120633 2159867 2248659 2323546 2477533 2636803 2969007 3311114 3791210 4497769
10125 4497769 5347221 6352061 7301969 8068677 8449091 8894520 9602306 10713113 12086034
10116 12086034 13863179 16235007 19408783 23620407 29536493 38239117 51306202 71362671
10108 71362671 102378983 151556744 228036282 328033024 402322508 379469710 284130951
10101 284130951 192694246 131462096 93739269 69872826 53986743 42939760 35064965
10094 35064965 29189810 24738510 21330866 18828071 17006463 15700468 14942607 14810439
10086 14810439 15218087 16146262 17576512 18946994 19861399 20308800 20158751 19156793 17315495
10077 17315495 15137699 12981364 11032282 9390451 8095147 7036071 6152819 5487889
10069 5487889 4952747 4501062 4158682 3837471 3550432 3303172 3067792 2926576 2792063
10060 2792063 2601997 2497717 2390815 2341621 2224212 2058311 1934698 1880430 1775507 1605234
10050 1605234 1528079 1399594 1298193 1363614 1387577 1397260 1226259 1137851 1137891 1052363 1120980
10039 1120980 1197274 1119423 1045718 1022733 1021386 969123 875229 833555 812142 786417 736600
10028 736600 775236 774490 718264 734400 774030 759371 737945 682291 618715 630015 628602 574011
10016 574011 463900 460892 453334 536699 523273 596091 694684 694564 677747 637853 666519 620556
10004 620556 510186 502432 425158 395987 440236 437448 421601 427757 470542 412014 330241 350558
9992 350558 362612 343450 307576 390067 460129 502118 458561 365899 405568 476411 518805 552960
9980 552960 572888 635365 721609 701438 490339 295677 316468 274568 207749 255753 302509
9969 302509 315574 230356 101208 14968 62855 130672 195119 205227 205094 146740 118163 160870
9957 160870 110772 57504 101128 105811 63191 38930 48439 131967 230537 249014 249291 187099
9945 187099 153227 108794 122058 125240 135664 134601 148241 211902 268455 256650 289647 327111
9933 327111 370176 407794 324397 184641 74864 -39446 -40777 23050 91965 120258 116704
9922 116704 140605 246525 224574 152748 121474 133349 111747 132845 212238 239472 231001 152816
9910 152816 79936 24769 150851 189606 262998 237099 227255 233126 171550 126301 102714 78776
9898 78776 21539 26701 32910 39894 86818 252902 317666 307362 292538 219821 152614 105461
9886 105461 81741 34623 105144 241436 274824 298824 322162 297304 276835 212524 179601
9875 179601 280930 321277 291016 199511 160944 86490 9146 -45237 -38276 71173 118719
9864 118719 109231 149964 99860 49452 103335 157854 87911 71421 68158 108267 204682 238933
9852 238933 164326 78905 61781 97394 97486 58916 47869 109463 112939 75541 130109 148280
9840 148280 221860 217477 212597 320608 321528 350953 349748 291826 141128 111210 160181 87524
9828 87524 2055 -5486 10296 105869 233864 204456 156690 84325 93358 135283 133536 115909
9816 115909 60338 -26363 -35922 16182 44053 39045 37887 16455 72656 129248 214045 284198
9804 284198 303068 263798 239622 171107 106989 149468 103380 55769 -2008 33975 97555 144093
9792 144093 178633 179182 231487 312566 342777 341564 354633 314478 165960 163778 111183 89688
9780 89688 81426 64899 47909 31578 43541 51387 -3995 40613 36523 36419 33183 120363 107614
9767 107614 84656 111810 121353 121361 88532 68748 72461 107275 107456 127113 149859 204433 180728
9754 180728 148453 125462 145903 174365 177822 136056 109344 99366 119419 136509 173745 187786
9742 187786 133995 188904 223099 169896 71718 49644 8346 8275 78646 94518 111620 18446
9730 18446 -1454 -18024 -10039 52066 28183 -31517 -35808 -90582 -108707 -33201 12283 -16280
9718 -16280 -90305 -107851 -64083 -146743 -173589 -204546 -127727 20092 4881 -76067 -10328 102847
9706 102847 173249 258755 219077 244147 256709 273265 419679 539056 724904 1090766 1603566
9695 1603566 2010876 2155313 1894357 1450180 1073562 779519 575671 503379 370823 289973
9685 289973 264770 274372 270790 266436 288539 294969 216178 157692 190050 221991 158960 155483 152198
9672 152198 198014 127490 117863 167765 177045 217558 266086 238656 128704 93735 94169 62198
9660 62198 48591 19941 24863 36565 68231 115586 137046 12539 -5334 -52568 -105311 18478
9648 18478 121677 80461 4450 -27741 -33786 11081 19138 22919 -72330 -68117 -93558 -91222 -45707
9635 -45707 -6248 -66250 -83760 21450 48221 62468 112474 143399 117370 51963 48606 113921
9623 113921 129411 63331 56490 -27393 -59911 68528 125922 75427 70863 120159 155374 58044
9611 58044 21805 85025 45105 -12740 54823 176912 126459 95602 166803 172322 102693 65467
9599 65467 92860 79007 22431 24327 43386 143757 125720 81660 83325 122205 207056 187150
9587 187150 102833 21102 5454 106639 193972 148778 166388 264743 261652 275119 219094 140827
9575 140827 178146 147681 110648 160101 160619 148227 172617 205880 205431 206114 170423 105365 117698
9562 117698 171149 97015 63763 98142 85320 40106 44229 -155 24498 59707 61682 60175
9550 60175 68010 134868 190518 188665 202621 161658 139381 154526 198321 235007 235833 229802 247884
9537 247884 354872 505706 590622 635415 740687 832494 1059508 1380145 1926569 2765358
9527 2765358 3862521 5019480 6039623 6333155 5774345 4722106 3571733 2684856 2091651
9518 2091651 1648584 1380850 1182184 1052608 1006179 980210 901911 927457 886980 908166 849174
9507 849174 783161 750248 726232 593923 601624 653774 753735 835354 991195 1128329 1305833
9496 1305833 1446967 1611024 1663821 1741703 1838333 1978833 2202250 2450644 2689572 3088554
9486 3088554 3658658 4515980 5807664 7808937 10640184 14333280 18503106 22557481 26183532
9477 26183532 28507441 27315532 22702500 17280504 12863197 9802775 7726065 6302664
9469 6302664 5360785 4579388 4016288 3651331 3407466 3248510 3201918 3144596 2992729 2796960
9459 2796960 2522328 2377657 2280793 2221350 2301250 2362873 2543332 2929220 3287389 3629244
9449 3629244 3919022 4103002 4076043 4046244 4275741 4556415 5012748 5779971 6519584 7568111
9439 7568111 9029024 11185908 14377520 18858143 24588173 31552710 38616440 44232419
9431 44232419 48431974 50625470 49543857 44357366 35698130 26744308 19954088 15374028
9423 15374028 12351299 10240563 8751788 7581421 6726712 6198210 5894406 5743272 5565335
9414 5565335 5349387 5255563 5015980 4529436 4088879 3842581 3722978 3795969 3926282 4041373
9404 4041373 4284711 4651119 4846000 4697295 4580698 4788809 5167374 5488670 5923243 6622350
9394 6622350 7500693 8801502 10743103 13452448 17240075 22121358 28054985 34618693
9386 34618693 40279166 44791414 48412593 50264931 48851886 43372875 35489723 27173807
9378 27173807 20247849 15361028 12072474 9901523 8434073 7329723 6459701 5877561
9370 5877561 5493678 5207450 5043644 4933219 4788467 4588816 4198377 3706631 3371091 3141651
9360 3141651 2931509 2831707 2886751 3017773 3045972 3017868 3006018 3016124 3107399 3208102 3428898
9349 3428898 3767148 4172619 4615671 5217868 6278400 7822377 10054029 12796910 15589839
9340 15589839 18313512 21431872 24966814 28081403 28787844 25831769 21044243 16429972
9332 16429972 12547559 9648610 7539095 6132375 5143634 4325977 3770417 3293674 2939253
9323 2939253 2745148 2610208 2433254 2373740 2266178 2077809 1863001 1705623 1534306 1403681
9313 1403681 1371186 1388471 1436321 1361547 1304377 1271191 1339070 1407069 1404196 1348087 1344995 1309673
9301 1309673 1296744 1382150 1527978 1751701 2084922 2392585 2891419 3797875 5026717 6426507
9291 6426507 7424581 7555252 6679859 5389379 4173534 3233649 2584388 2092866 1730049
9282 1730049 1477553 1275983 1235022 1203466 1120652 1008704 884644 846095 759045 706306 727019
9271 727019 689154 675146 632164 626918 683459 564136 548819 544569 507407 456086 500063 643119
9259 643119 717595 669549 634841 660865 658139 668503 656405 671229 707540 687233 677127 652808
9247 652808 634080 659979 690789 736293 773681 748439 721779 692587 719967 705325 758707 851308
9235 851308 787025 780942 826879 826087 737247 785365 857390 891823 886055 877891 905097 915858 937790
9222 937790 1063259 1152969 1182201 1220906 1184252 1125934 1176689 1200360 1291185 1314192 1341370
9211 1341370 1297764 1301180 1449842 1605296 1713074 1796114 1762480 1868114 1996657 2100810
9201 2100810 2152917 2223798 2412700 2447163 2518078 2584519 2703450 2877047 3125227 3281948
9191 3281948 3319543 3462461 3730643 3959236 4166463 4341810 4597333 4940844 5259157 5659732
9181 5659732 6051265 6432099 6902672 7452205 8040361 8740261 9562588 10479444 11483008
9172 11483008 12553576 13907666 15460726 17308998 19427346 21870013 24794391 28179084
9164 28179084 32273745 37294666 43337614 50674776 59592729 70145737 82330284 95638576
9156 95638576 109308960 121631267 130192539 133186252 129868982 121199500 109213299 96089850
9148 96089850 83206850 71483349 61433380 52874878 45691763 39561848 34523661 30299800
9140 30299800 26834994 24000980 21532449 19330348 17564880 15932052 14436214 13151490
9132 13151490 12107082 11113572 10247771 9547321 8877732 8209627 7639208 7092989 6640329
9123 6640329 6308908 6001773 5578246 5224923 4991347 4758324 4472317 4185173 3995568 3832840
9113 3832840 3688031 3500697 3352977 3205520 3117924 2947016 2854398 2742158 2653155 2503266
9103 2503266 2473270 2446223 2297114 2117608 2020662 2029283 1973282 1838583 1798302 1756971 1719129
9092 1719129 1624549 1637886 1646939 1569981 1473621 1486476 1504461 1440536 1454908 1476388 1452645 1359459
9080 1359459 1422382 1441122 1447359 1411481 1233697 1026691 999912 1021734 948099 991013 1116395
9069 1116395 1059966 949612 895740 951521 938926 934002 885355 868273 861449 822546 830461 832715
9057 832715 803293 775041 739521 761521 849981 826881 711317 735653 796008 772091 689317
9046 689317 702817 730188 650888 598777 623511 656098 646643 618335 585542 617942 638784 645153
9034 645153 721600 722978 653433 682038 676468 611984 636503 598197 609319 616146 603523 587724
9022 587724 604528 650565 651595 639027 640535 598491 493628 453729 391731 423111 459963 416508
9010 416508 320366 246676 272057 304768 382063 284503 231338 303256 267902 144057 114017
8999 114017 161210 178188 174075 253022 298441 304456 266770 269736 344765 367317 413596 430706
8987 430706 328618 258867 295206 309822 286511 220127 310893 370237 350080 328493 336281 406377
8975 406377 417002 376124 372032 400315 400719 318239 232634 207359 258739 292943 206233 195324
8963 195324 164845 191193 180565 198516 211574 256362 228881 212322 177638 205144 169487 240004
8951 240004 269146 230939 254353 292694 379297 331701 252175 225735 152209 97359 99719 128535
8939 128535 232126 249432 194342 172450 150454 170311 166805 200537 175859 189149 306047
8928 306047 333263 353961 351888 395762 339629 302072 255508 193067 49115 -39819 -83885 -93076
8916 -93076 -42252 136698 138086 155205 96682 -21611 33087 101730 113318 116913 149159 131153
8904 131153 121963 124598 183387 114017 108663 199237 245104 219164 222898 281672 341364 292157
8892 292157 208676 173412 123823 142936 180887 78642 96506 209494 206258 91108 40828
8881 40828 7419 27580 48056 36307 -75937 -159995 -123881 -28573 41186 101457 67978 49517
8869 49517 41108 5708 -17964 -34305 -47938 -42331 -16027 -12936 -27837 -32345 -24362 37143 73436
8856 73436 78386 43630 44728 63971 133458 159733 189536 117350 102493 138223 97564 179978
8844 179978 134104 92756 -20555 24232 23491 65241 155600 168387 161162 126741 43198 1665
8832 1665 112286 114632 83209 22689 -36695 50555 43208 6956 -14702 11932 59595 110906
8820 110906 108018 94999 45027 -26013 44728 105028 102674 -1549 -58303 -42870 -28498 -92311
8808 -92311 -67240 -6681 -12620 -15108 32449 8660 -5173 111651 158515 217670 162668 127108
8796 127108 88355 62125 88239 89140 53823 77242 124221 179036 105470 36016 -19197 -9775
8784 -9775 -25443 23131 55889 131220 183774 186687 136336 62427 70073 110301 104107 57291 4581
8771 4581 -53806 -86613 55701 155182 193782 99834 32260 640 -43397 -35092 -37304 -56755
8759 -56755 -40098 -37933 -46707 -14715 -22096 3598 -41280 19733 42107 94264 126709 17090
8747 17090 -48816 16595 31250 66841 122382 48448 2664 -13918 -53184 -71176 -102561 -70306
8735 -70306 43938 67385 6102 -74569 -51696 -9603 76336 69498 71789 61237 -4235 -52611
8723 -52611 -37754 31615 27497 -65085 -66885 81678 132370 158738 95359 78869 -60841 -70947
8711 -70947 41097 42854 92306 143410 158262 195434 168017 154389 156341 82090 14220 15308
8699 15308 10469 1704 -40672 -75330 -145785 -52746 48763 84872 100005 102910 110328 91603
8687 91603 67311 66454 87486 78410 69494 106099 75007 81789 136178 100669 55538 29215 -24153
8674 -24153 4261 23495 -127344 -78722 -17416 -3929 92349 211825 223697 194842 222140
8663 222140 202308 167026 122008 183380 240239 367150 512523 494060 435258 429682 406275
8652 406275 314044 133508 -11454 -73684 -16569 -12319 38601 22440 23313 18556 69604 148310
8640 148310 174017 152880 144816 125812 79481 155661 175105 178308 158027 97610 79798 82178
8628 82178 -66256 -147092 -131101 -115465 -96829 -18980 -36124 -82544 -7066 79257 49091 78307
8616 78307 89158 74200 128324 207700 339359 601514 783492 830278 839813 791053 638513
8605 638513 466934 399630 375744 335030 303865 219851 180897 125136 191551 134539 138876 174440
8593 174440 265893 352161 375281 305297 209574 191251 142255 74782 35706 -57277 17332 34911
8581 34911 -1569 -44651 -99954 -74570 45516 84154 107659 90050 111816 129897 49343 8431
8569 8431 -23569 47812 107056 122622 187751 291883 333460 344168 340503 329310 254370 267196
8557 267196 292688 277291 220343 117589 91709 172658 152305 136199 139733 57867 54671 30377
8545 30377 71174 144421 120216 65980 29896 91511 134666 137990 135284 139615 123741 8303
8533 8303 -43674 -61349 -68539 -11536 -18527 -128640 -136278 -99312 -55367 -83630 -61664 -93160
8521 -93160 9618 63769 54372 67959 33856 -48665 -2081 23044 25841 67922 54431 7196
8509 7196 -46664 -56295 29002 47126 -16353 12981 37642 91258 117768 81510 54696 25932
8497 25932 23785 5145 -23343 -76031 -39078 65099 48842 38811 54830 35924 -3422 -44832
8485 -44832 -53662 -7601 14682 39446 96218 55610 -99471 -111669 -19363 -34102 -21742 41123
8473 41123 2339 -46647 -27678 56934 174350 268660 206313 164500 130503 130904 133521 102035
8461 102035 9840 -44963 -39489 -134 1485 20305 27716 28052 -7425 -61048 -40958 2780 20328
8448 20328 15904 -15346 29601 12256 -57212 -90300 -49723 -23148 -9713 48810 34807 -66252
8436 -66252 -100268 -5693 26849 76431 110052 110672 100620 153862 120019 100228 62732 -29481
8424 -29481 -39034 53136 96758 54117 65559 81671 54293 96662 77312 82940 190202 150886
8412 150886 37797 27596 93595 173645 135721 79090 69170 28345 63625 138634 173981 202072
8400 202072 158469 179868 230643 244353 177126 110349 145163 221874 272659 243286 213780 154898
8388 154898 127075 53583 -65079 -13590 13656 26385 -52021 -93922 -62178 -52822 -35338 -67070
8376 -67070 -52769 -5218 29000 95244 118513 122299 56761 27352 57517 29586 104944 196727
8364 196727 164304 175149 109066 84892 92811 110535 84828 30528 9330 -83847 -104891 21857
8352 21857 20216 52804 149861 122117 110668 162006 175001 156656 107633 22281 -21396 -87340
8340 -87340 -100179 -87406 -81246 20649 89470 105014 122716 112893 196611 98239 -22192 -8046
8328 -8046 32340 68424 132743 178922 202208 136057 77429 159828 247266 301074 300082 320024
8316 320024 302216 274735 394143 331040 316579 249462 118264 116971 169690 220125 265003
8305 265003 357996 366877 277394 183670 200578 374201 359020 335771 340529 430391 526648 544493
8293 544493 540347 516531 434107 470208 552646 676752 858547 972758 1017012 1095089 1309170
8282 1309170 1540981 1798902 2182680 2621809 2974821 3217958 3543316 3954184 4432668 5045301
8272 5045301 5770738 6786312 8200522 10444249 13888066 19193879 27325714 39665503
8264 39665503 56478665 75151804 89354663 91741557 80929568 63079603 45611116
8257 45611116 32507160 23819100 18241352 14499877 11995986 10111425 8783405 7713025
8249 7713025 6831950 6216885 5822670 5443406 5074137 4755246 4542091 4359447 4072552 3944640
8239 3944640 3883213 3813157 3889274 4057354 4358560 4749473 5205915 5603849 5972444 6394370
8229 6394370 6960299 7676834 8471671 9475554 10721966 12370604 14890337 18689982 24545118
8220 24545118 34034933 49679328 75480721 114423909 159173455 185678544 177624139
8213 177624139 144759121 105821161 74138253 52559273 38819761 30107732 24260939
8206 24260939 19925228 16562589 13981768 12063957 10704702 9768445 9053861 8404038 7714980
8197 7714980 7132678 6669924 6276037 5839266 5342595 4969513 4627028 4460653 4412938 4396812
8187 4396812 4402738 4472820 4539710 4685331 4721758 4854885 5124624 5488475 5971267 6645260
8177 6645260 7617752 8989393 11101546 14392671 19457567 27216474 38627737 53401432
8169 53401432 68250840 77434531 75879962 64990513 50074938 36155684 25795025
8162 25795025 18908316 14538874 11654408 9521866 7917766 6707303 5788434 5082054
8154 5082054 4624734 4273649 4017371 3634258 3246971 2871139 2694521 2431592 2214105 2035208
8144 2035208 1979207 1863786 1694552 1573376 1407828 1310396 1239542 1141672 1095941 1065577 1045661
8133 1045661 932511 849142 811148 790667 758539 746511 693371 657580 647824 592322 593771 591669
8121 591669 615555 676092 619269 575375 504661 488419 424657 446574 450390 428618 348455 345677
8109 345677 378561 444346 493579 427553 419873 443981 464195 528144 518491 456706 433188 485906
8097 485906 447959 425211 430925 448656 494461 505074 498187 486749 503311 500204 395923 286383
8085 286383 192750 167875 256475 286687 280759 209853 167952 205424 214258 180535 179555 179646 231625
8072 231625 226358 238278 195968 202373 154446 54435 13779 49882 -19798 -33220 40118 143752
8060 143752 143325 176421 265209 223689 175452 189882 245737 220455 308406 412963 372081 271158
8048 271158 263479 236406 342195 446639 399154 394135 320904 173689 176647 142485 113670 98287
8036 98287 89405 113752 107293 123073 61852 107230 57343 81245 122655 212473 266083 223889
8024 223889 205256 121519 -15353 -69377 -46931 8383 60933 130539 152036 141962 130700
8013 130700 202321 202434 204411 207402 276147 348432 285853 172541 109970 87964 27063 64798
8001 64798 126272 138645 134838 161181 125691 68668 71214 112811 131697 118865 118791 138625 135906
7988 135906 87687 137512 80399 105061 94320 66020 126529 190836 246613 196459 200312 173594
7976 173594 99297 72018 64481 100094 107105 71022 32678 22006 106285 186813 145185 169729
7964 169729 223353 180916 176490 182586 125915 183014 234254 261715 272023 270600 307429 275186
7952 275186 203880 189270 165039 85053 37244 -20349 102861 151807 131757 38752 15849
7941 15849 97375 151292 155429 124315 79344 49557 40128 153787 148172 93017 57455 30837
7929 30837 29043 89941 220556 192444 220819 192068 107156 72986 134274 170788 164464 220152
7917 220152 214828 146195 152497 169928 173159 160729 173541 183209 117712 25425 -29705 -38388 -65511
7904 -65511 -27161 21596 111040 183884 179297 113837 160721 225695 247287 175754 135037 173213
7892 173213 161087 238394 208150 104588 138549 152447 81402 52022 7837 -5270 -30542
7881 -30542 35486 47112 31819 22536 -8535 -38140 -34758 55803 109035 122167 94349 145070
7869 145070 191546 170904 164161 169501 259649 383307 430010 517972 601252 537836 450365 303509
7857 303509 246123 245452 211441 279849 226361 191157 99694 71809 121288 38494 16140 103216
7845 103216 134535 69649 -26859 -54983 -47413 20809 22219 39137 83068 184858 160817 120894
7833 120894 123619 54195 -29261 19386 61975 58118 104502 156718 199639 200944 133136 51902
7821 51902 38545 157406 274275 383152 538387 786226 1013757 1019043 863904 762564
7811 762564 582569 407650 274482 190490 146250 140374 184135 49213 -30362 7304 15821
7800 15821 57758 116830 126571 89657 91130 109050 150726 195464 198259 188289 87023 94291 11137
7787 11137 -83899 -194859 -154405 -87818 -48696 22103 78042 80223 143362 132806 62398 132734
7775 132734 136771 100364 102453 170230 241980 199167 300159 407654 463884 421918 315802
7764 315802 235813 155494 73257 122875 111580 89143 -6280 -16947 3215 -27514 -10968 -20606
7752 -20606 505 47701 -891 -14165 -76120 -79728 -72261 -86131 -130337 -90208 -21258 9140
7740 9140 -4992 471 -11092 -5899 78377 156704 115279 141429 97775 117121 136542 152111
7728 152111 179058 113150 -19529 -140489 -132265 -104331 -83778 -27342 -104375 -44871 -4842
7717 -4842 12469 34552 22754 -48980 -31145 44301 67818 -16470 -111149 -59626 -42392 89904
7705 89904 78099 52791 43454 16943 -87735 -142016 -75960 -53158 -4688 -4775 -31019 -24840 50518
7692 50518 184922 196725 52358 -25825 -25515 -29538 -17998 1022 -28686 -140632 -133211 -47258
7680 -47258 -73801 -82315 -41740 54370 106793 101194 96622 105099 79541 88213 58622 22935 91299
7667 91299 78125 49982 -362 -68952 -15233 -45449 -47623 -115362 -34573 118428 166505 74508
7655 74508 38029 85779 93237 159395 109927 72924 71014 11140 25308 21777 72849 67565 -55988
7642 -55988 -77548 -129934 -196985 -193455 -150581 -94778 -52326 -85914 -98891 -67666 -28445 52846
7630 52846 134410 125014 43859 48234 -17634 -61888 -72625 -22389 99182 126008 44846 -3536
7618 -3536 2981 -14505 -45001 30488 57459 21738 71332 54965 1922 -47504 -46373 -46974 -2468
7605 -2468 781 -5985 -34459 -31567 16232 74691 -21711 10673 2068 -19459 -95068 -89503 -79244
7592 -79244 -2550 -54044 -190183 -160564 -22738 39407 16320 -50640 -87392 -33794 -25497 -18868
7580 -18868 55746 30946 -88113 -100305 -158505 -143444 -144242 -129811 -150860 -92379 -17847 33340
7568 33340 52540 55795 62827 107825 -38961 -57683 55281 32239 -24686 -90054 -88026 -56591
7556 -56591 -73100 8564 -49358 -110555 -49430 18517 36827 44696 31368 -44421 -88930 -8376
7544 -8376 40816 91652 118179 177630 103712 38544 35265 22672 59166 31493 26392 -18063
7532 -18063 -9489 51684 33894 -32581 -34115 -24041 38507 109756 143352 89874 10793 -19062
7520 -19062 34405 57423 85268 37194 51853 -34099 -31573 64833 57699 18215 -19302 -66245
7508 -66245 -36800 25338 59173 -332 52934 90859 138723 80640 45255 9079 -23294 -192
7496 -192 -37086 -81256 -51689 305 5047 52689 25386 44381 -14553 -79352 -29557 21704
7484 21704 -33111 -62439 -64315 -132681 -173852 -106833 -208295 -233751 -127120 18953 44593
7473 44593 -94532 -101626 -85136 -116038 -98455 -76173 27905 26012 23043 59212 30282 30278 56054
7460 56054 38985 -90570 -62747 -32550 61048 80270 55149 96362 18385 -54754 -47186 28041
7448 28041 48383 53135 49356 -5922 -46662 -25251 32886 -12669 -44959 37769 10743 -35166
7436 -35166 -49123 -35673 -156 11216 14050 23246 -74715 -124653 -53779 -43854 -54918 -63822 -30008
7423 -30008 -1515 -5616 -52091 -26919 -78769 -87826 -974 65879 112644 153721 135005 143433
7411 143433 189715 125199 121760 25971 -31339 83687 119199 39789 -10181 68571 90534 86789
7399 86789 57572 11852 -1479 68864 103192 56622 -53748 -103234 -87921 -32172 -35434 -31696
7387 -31696 33161 23867 40644 76748 75102 36630 71491 21825 -17621 425 -25955 21235
7375 21235 66309 78731 69445 60761 45409 53555 15410 -32881 29804 45827 60582 110517
7363 110517 54356 52636 48594 1568 1519 8231 -22973 -57195 -55191 -90245 -87194 -91038 -195776
7350 -195776 -192941 -142063 -77337 -77006 -94500 -84097 -70421 -48243 -26203 -17059 -24648 -34872 -95567
7337 -95567 -55587 -71224 -65600 -56393 -111506 -32637 -20276 -33587 -36239 18456 -30796 -16872
7325 -16872 51075 18251 14037 97735 66013 9621 52164 109396 2904 -97361 -121648 12894
7313 12894 64213 -28869 -30540 -20119 -95775 -50907 -28025 -5622 103098 136070 229201 216421
7301 216421 87460 -29260 -109834 -23972 1468 -19265 -105593 -88272 -64024 -40560 -16305
7290 -16305 37147 30727 -4765 -36332 -14967 11548 51375 42058 -8640 -32114 -89186 -138406
7278 -138406 -97350 -98475 -55278 -21099 -38419 60927 -2000 -69589 -2294 62225 37377 -35148
7266 -35148 44204 29952 -71351 -20724 -18657 18695 133014 85929 -5036 -7027 20590 -297
7254 -297 -18395 -37647 -53989 -18139 -13670 -73517 -136948 -139849 -148953 -116192 -88875 -72500 -63741
7241 -63741 -4218 -9775 -144103 -189672 -23188 85156 38926 -41119 -54990 -90405 -107026
7230 -107026 -55596 21248 79575 167044 226351 174073 117415 89093 42390 39340 -595 30880
7218 30880 107241 38143 -33562 -62359 -52351 -118925 -152428 -187775 -165882 -86333 -83095 -55221
7206 -55221 -35858 -51511 -3957 -45838 -67087 -37174 -33954 -61190 -48288 15584 21085 -53094
7194 -53094 -126288 -147454 -207494 -174200 29488 161196 182452 109039 -56087 -102310 -128145
7183 -128145 -86722 -120649 -107456 -60323 -11024 -33811 -123407 -84694 27306 77244 33852
7172 33852 -41820 -27047 -53131 -72547 -68600 -32174 -42417 16 73599 34007 -29712 -121050
7160 -121050 -201005 -173365 -107514 29549 107032 89402 69254 38533 -78643 -114400 -42473
7149 -42473 -3669 -135776 -141451 -133299 -79995 -17719 42596 67176 55132 36680 -1891 -7451
7137 -7451 -30352 -925 -96439 -162955 -133669 -152564 -151759 -74361 -32113 76414 23420 -100025
7125 -100025 -112228 -107832 -84589 9232 49079 31919 1406 -54719 -38369 -18763 19732 59894
7113 59894 124584 53351 36367 7448 33997 1629 40215 118660 167077 147176 139324 119655
7101 119655 100395 28514 31302 -21129 -28948 -42131 77994 113001 134138 28329 -47218 -107013
7089 -107013 -48179 -24903 -2242 64312 46067 33800 -56192 -63754 8581 -21940 -5849 35511
7077 35511 74379 13693 -483 -32100 -138570 -190904 -119957 -22474 57460 20592 7530 39448
7065 39448 30312 16413 61958 6321 43768 70032 81874 90600 71034 22538 -11541 -18040
7053 -18040 3270 35964 11580 -38251 78593 88309 -37645 -73478 -103148 -107935 -96298 -48591
7041 -48591 -64197 -41372 59994 913 -52311 -13317 -6474 38684 7933 -17416 -10907 41621
7029 41621 84721 37421 -34526 2718 -78496 -30586 16013 14619 -40037 -103916 -122682 -18524
7017 -18524 -8148 25602 -7058 18954 76621 -63204 -157611 -99202 -63626 -18227 -5145 59448
7005 59448 183489 180190 109732 107413 62800 57173 25644 -58259 -166626 -222526 -246058 -224895
6993 -224895 -214859 -133897 -94036 -86321 9738 72002 41560 37728 34192 18726 26174 45918
6981 45918 32027 43841 80159 81062 10602 45256 76699 71989 23861 -78677 -34130 99731
6969 99731 102714 87808 52800 7999 -30449 12402 52057 84176 53953 -80388 -24456 -56252
6957 -56252 -95312 -91162 -45610 15356 13351 -5176 -7790 61891 113592 52637 4926 -12546
6945 -12546 -1968 12629 39221 -12130 -6964 35631 35923 38063 1199 9199 62879 104854 -45208
6932 -45208 -156610 -179691 -115356 -89845 -41907 -24552 -45307 -89708 -34198 -7091 9064 -21836
6920 -21836 -94409 -106901 -97582 -106076 -177855 -166914 -109592 -68282 -128197 -148707 -119959 -52972
6908 -52972 -100728 -87005 -99413 -147266 -58538 -48097 -100717 -65772 -41 11914 50755 79596
6896 79596 -7290 -72954 -12616 -4619 -10251 -7775 -7034 -23442 -158463 -261606 -238650 -109046
6884 -109046 -30111 -11702 -80996 -139241 -145338 -157990 -149647 -89006 -72513 -86567 -41687 -8769
6872 -8769 -17627 58178 74949 19445 -38589 -119637 -100747 -14247 24959 89185 137027 57022
6860 57022 12036 -37381 -110164 -71382 -90982 -71789 -38424 -202358 -202693 -45856 -11488 -78273
6848 -78273 -79211 -86516 380 42456 -7820 -36225 26240 138418 104361 7747 -36524 -23892
6836 -23892 -64969 -91285 -72781 -22934 86264 68733 -13261 -60439 -27093 -765 -14394 -95737
6824 -95737 -168366 -65148 46610 25102 35402 14412 -24466 -62116 -25616 -4769 -19059
6813 -19059 -31609 -16223 19847 34813 83918 90239 19525 7344 12415 -12609 -12400 -10745 -39383
6800 -39383 -57892 -37700 39172 -17023 -92165 -81856 -84756 -107128 -163516 -106227 -114587 -132268
6788 -132268 -56510 -24198 50824 63900 -20132 -65357 12208 9619 28908 -8542 -106808 -168660
6776 -168660 -137107 -64468 13340 123107 125903 120981 131930 148111 157159 44182 -41483 -82912
6764 -82912 -146706 -106695 -123018 -94758 -76669 -68799 -66214 -95288 2095 18757 -10933 -68388
6752 -68388 -54739 -51886 -71042 -8229 -4247 -76057 -97814 -95348 -4613 110803 141988 106455
6740 106455 74950 37217 32689 15292 42134 -1028 34177 93482 41018 -51959 -56205 -33590
6728 -33590 -55538 -155258 -160213 -102600 -109857 -58055 37299 74296 22079 -61026 -81313 -58874
6716 -58874 -87911 -153412 -31063 49633 79939 109193 99594 90759 95147 72441 21010 17790
6704 17790 91809 124048 126548 144019 133658 57444 -40092 -42185 -89850 -122006 -85100 -40615
6692 -40615 -26973 -17213 7182 -70388 23316 117579 87881 6126 -79843 -153453 -155632 -140000
6680 -140000 -141813 -112429 -28656 -5638 50772 142591 86074 52407 -34679 -42753 21943 43004
6668 43004 -12411 -60215 -72556 -78853 -51974 -24050 -9328 20011 56006 93519 118244 111780
6656 111780 5158 -45597 -61098 -62767 -39474 6096 26861 46443 20060 67091 65463 45434
6644 45434 23395 -63886 -71810 390 85951 99086 84542 46672 -30537 -13815 6837 -26104
6632 -26104 -23871 -37488 -143014 -74913 -12510 -73959 -42271 43446 30446 73920 102949 101187
6620 101187 58813 40212 55694 -4226 62541 187289 180800 143317 166667 214494 254643 207486
6608 207486 291230 427295 677789 1065417 1175294 791809 477613 315922 176047 163618
6598 163618 175705 185462 143709 55218 16174 3356 27750 -19388 -45968 -85554 -124741 -179972
6586 -179972 -168298 -79130 -5812 24070 94538 59266 -23327 -51549 32033 121129 105926 66213
6574 66213 60457 69783 17091 -19177 -62743 -112468 -31881 129909 191802 136113 48937 4815
6562 4815 28282 60927 89235 81094 38108 16777 63744 21376 -14449 -25787 -105100 -102525
6550 -102525 -24778 20836 -79036 -39949 -4586 -48226 -61199 -18775 64459 73195 74920 103872
6538 103872 88006 131401 180242 113255 163279 183337 98960 128895 41829 -2759 36418 -21248
6526 -21248 41482 86165 114684 87269 37077 43296 38742 93627 88688 -46540 -82953 -102794
6514 -102794 -171635 -275759 -202443 -123936 -129998 -111907 -122870 -131996 -88295 6385 22620 78121
6502 78121 95562 72814 1411 -18603 -5408 -92244 -64495 39114 1869 210 20248 16086
6490 16086 2173 -83761 -22466 48302 18584 -19878 -108119 -130834 -155047 -113776 -63450 -90317
6478 -90317 -6327 56320 75605 63464 91154 45869 2710 60353 58416 64245 75482 8576
6466 8576 35199 121880 104258 115959 159164 108285 67094 -42969 -40243 31111 37295 -42680
6454 -42680 -95118 -53409 608 7885 1661 -44537 15095 -22005 -53397 -43640 13335 26530
6442 26530 -18860 -9923 -16445 3373 33734 6470 -44018 10325 38913 3446 -2252 -25670
6430 -25670 -22610 -11736 25594 -9579 -3364 -5618 -123383 -52126 140 -58861 -71275 -19825
6418 -19825 24209 -7635 11820 -6745 -32342 3929 -2039 64858 98631 29899 -3128 -119658
6406 -119658 -118487 -134740 -184116 -126211 -34132 -33292 -67173 -65737 -23135 -34590 -7462 16423
6394 16423 41876 41280 -15808 -75366 -57690 -103612 -132831 -157272 -124349 -83684 -49322 -164784
6382 -164784 -152925 -93262 -87845 -2494 44686 81234 88419 111986 60291 22520 -24347 -112629
6370 -112629 -145378 -113466 -6812 -41655 -35556 -17506 -99343 -210702 -174377 -128400 -137448 -91580
6358 -91580 -68821 -12155 43564 -16965 21760 -3283 2118 -9517 -114298 -166003 -220210 -174659
6346 -174659 -225762 -187936 -78627 -4296 6519 -23691 -117204 -91200 -25867 57208 84130
6335 84130 62463 160495 143571 88834 -21086 20258 71547 124763 123515 84035 37766 91583
6323 91583 140275 62282 10326 16253 68743 37241 4485 -115107 -88312 -80197 -88625 -25752
6311 -25752 25012 57795 70651 -29924 -37819 2227 18066 20701 -12220 -23931 -41643 -126029
6299 -126029 -110313 -49652 -34676 -38044 -22886 -16742 1263 -31031 -153452 -176827 -189239 -160335
6287 -160335 -41512 82379 151789 161665 84611 83920 56624 52145 96489 53578 52940 74498
6275 74498 8358 -40272 -93343 -41481 -73018 -72784 -101352 -122953 -90116 -4420 -12211 -52474
6263 -52474 -70405 -98530 -61038 -38494 -29054 -71805 -16882 25829 -38681 -3479 52357 -11000
6251 -11000 -35267 -72069 -60468 -24918 -36731 -145948 -127706 -41330 -100262 -116938 -89983 -145855
6239 -145855 -212096 -218325 -158740 -70287 -57864 -120624 -153545 -86145 55598 38101 42953 54457
6227 54457 68785 107152 131746 41012 4345 40885 82592 101701 126741 134238 181562 70572
6215 70572 -83366 -130711 -67990 12842 99427 88260 80110 98129 25183 68895 -38296 -101781
6203 -101781 -63438 -52796 -36441 -54957 -101253 -22053 36871 109181 137542 79257 3379 -47210
6191 -47210 -2800 17665 37716 -10540 -20665 -20870 30359 29999 62313 133621 107470 89254 153333
6178 153333 117665 3751 2325 20685 11632 -6436 -51432 4192 80852 105191 72057 72917
6166 72917 -13146 -50424 -99509 -34170 32937 29183 66940 157817 153186 93187 10318 -63844
6154 -63844 -59711 -108284 -120057 -110614 -74280 -15477 46119 70822 69925 53822 63968 72154 67255
6141 67255 20773 29179 40705 19353 114626 160180 104680 37735 2097 -71021 9887 107160
6129 107160 72522 54876 -9596 -4028 43430 130674 168444 185805 122005 58773 -10802 -15130
6117 -15130 35451 -2322 -67984 -113230 -156285 -235310 -205282 -174141 -45253 26528 -22635 -55500
6105 -55500 -106629 -31170 27295 6667 30943 -64333 -61721 -37603 -57848 3734 46524 140467
6093 140467 137311 100633 31902 24017 40113 91171 3826 -20086 -3668 82461 107228 197781
6081 197781 196119 101406 18062 30822 64589 58506 93917 65066 -30636 -25501 -45313 -90976
6069 -90976 -104736 -51392 -1625 15024 5846 -68132 -46585 -84294 -91802 -128473 -46966 -18215
6057 -18215 -16609 8153 100936 93987 -15364 -68988 -51427 -1321 -50654 -16419 5096 88570
6045 88570 85231 115186 144953 106764 30719 36639 -23567 -125304 -123295 22088 51795 39326
6033 39326 -92510 -161916 -113513 -36564 -55070 -138882 -138146 -51676 -3785 34200 21500 -36042
6021 -36042 -93060 -33450 80173 89858 9100 43319 121064 55501 56107 -1252 -77071 -178877
6009 -178877 -136938 -71327 -83540 -84922 -51658 44821 14663 -62874 -103471 -101408 -117827 -74203
5997 -74203 -49070 -30045 -125481 -77069 -88799 -9337 4989 -59608 -77444 -75950 -133580 -34991
5985 -34991 141937 227410 212975 166167 106546 82804 32650 33557 18045 48674 52543 -10325
5973 -10325 -90183 -70192 -39957 2752 -21940 -57632 -87636 -174391 -136459 -103456 -78236 -36350
5961 -36350 19573 24361 14775 -22190 -49174 -96881 -72583 -51413 -115452 -121258 -41124 -62462
5949 -62462 -127290 -120733 -146042 -152283 -102752 -120925 -112827 -103100 -88324 -19052 39756 26545 -46232
5936 -46232 -131837 -92340 -26233 -24803 1736 -29532 19477 72356 82549 88721 49516 19663
5924 19663 33444 34025 -13874 -59278 -46924 44564 75880 84060 42575 -12493 -34839 -20396
5912 -20396 -25996 3478 114032 89460 57041 33189 48617 58594 87879 93976 27467 -40209
5900 -40209 -26113 -33517 -123525 -158269 -140824 -86824 -60681 -55010 -53175 -74823 -65763 -125129 -113463
5887 -113463 -109237 -96537 -109151 -8820 -17037 -68549 -14772 -69604 -52993 28994 -12590 -71511
5875 -71511 -90593 -144269 -142299 -141363 -108397 -64355 -26660 -73902 4120 31731 16819 -31451
5863 -31451 -28985 -23566 -28477 -57997 -78384 -97007 -53798 -33074 -2476 -98427 -81093 -61949
5851 -61949 -100254 -107390 -28617 28032 25200 34270 -20483 -96538 -13949 -1396 109955 207412
5839 207412 139734 16918 -72525 -109643 -34352 -6553 -68988 -77369 186 39570 46257 -51106
5827 -51106 -96468 -142652 -51191 25924 -76951 -136936 -165644 -203563 -150964 -45810 -62407
5816 -62407 -99125 -181320 -114276 -101758 -144337 -69357 -87334 -19313 40092 -52163 535 -3399
5804 -3399 7653 14260 18012 10051 -7683 -42112 -89900 -51442 -5839 -16123 -215 -18820 -29655
5791 -29655 -28953 -82584 -77396 -99208 -77411 -103821 -100138 -54514 -76751 11447 38462 -42116 -84761
5778 -84761 -20667 -25587 -110683 -140437 -96120 -34325 -56524 -115313 -159216 -196952 -225476 -114416
5766 -114416 -68813 -13595 30967 47333 87492 90530 36676 -47071 -562 56904 17778 -86716
5754 -86716 -54366 -104649 -90334 -103536 -56180 23527 19300 41498 -26674 -117448 -109361 -54382
5742 -54382 -60022 -72346 -41418 36089 33742 9956 -6793 -17230 -96889 -206071 -172958 -148474
5730 -148474 -187806 -132346 -83561 -36576 -6100 -5666 -108648 -102128 -72663 -56953 -73481 -67262
5718 -67262 2521 664 -44015 -45753 -71458 -148802 -209719 -197062 -175449 -250675 -146377 1198
5706 1198 63464 17755 -24449 -41147 -11493 66853 145549 147117 42389 47317 5208 -37818
5694 -37818 -76812 -116769 -116715 -89588 -63758 -71993 -79140 -169559 -251098 -195181 -138444 -61027 -55120
5681 -55120 -47310 -39999 61499 70240 78955 66552 8219 -16491 -30131 3372 33003 -7180
5669 -7180 -43938 -136777 -106973 -34453 33623 31983 48383 65838 59689 46234 110786 129248
5657 129248 48204 17269 50599 94277 123197 17437 -85601 -94676 -82624 -142220 -92262
5646 -92262 -43347 -45133 -39615 -102164 -95344 -101206 -120028 -56673 8501 80992 87579 -19196 -42325
5633 -42325 -75844 -72296 41423 76793 103282 81762 74860 63236 27719 -74693 -7581 -6570
5621 -6570 13146 24090 78738 11184 -98867 -61906 -4209 32547 -2803 -45584 -93901 -65383
5609 -65383 60487 80534 86833 50944 96791 83732 62857 51139 -5073 -11470 34887 58400
5597 58400 103923 78774 -67118 -107285 38037 96790 123338 122402 105197 75009 18182 -70051
5585 -70051 -80627 -27282 -72213 -77034 27538 53804 10411 -40499 -13859 -7854 -84438 -139243
5573 -139243 -98628 -51215 -68711 -72022 -8228 16383 30475 45285 50804 49155 17760 -24134
5561 -24134 -80887 -58177 -668 -6599 -20552 14938 -49649 -72516 -2086 118401 67378 12586
5549 12586 21322 -3135 27049 55822 28208 16838 118055 155874 83299 -7410 -79908 -120320
5537 -120320 -141427 -161498 -150228 -84716 -91948 -97719 -132619 -113572 -166492 -91419 18564 12258
5525 12258 -53099 -75830 -76132 -70449 -19765 25124 36801 26839 -29266 -69445 -126808 -139539 -137698
5512 -137698 -33698 45432 45013 18960 17683 55290 27901 28586 23196 43578 40618 8426 88817
5499 88817 89166 32860 -8137 28769 19506 -6191 -72373 -88355 -160268 -92939 21090 34643
5487 34643 63652 109978 20432 -48479 -51484 -63285 -91705 -50907 65584 92461 26328 -67370
5475 -67370 -69586 -31252 36859 63254 5555 -85122 -105157 -42150 -44551 -65788 -320 9217
5463 9217 -24455 26273 67611 -41403 -85487 -104518 -65545 -24138 -14973 -81011 -125569 -127095
5451 -127095 -81036 13066 18454 -6901 5351 -16571 -67780 -65916 1525 73056 36334 -18712
5439 -18712 -30618 -70491 -95009 -42677 31014 -42631 -78839 -57817 -96174 -43419 29739 45029
5427 45029 20503 -63713 -119626 -157643 -103963 -84667 1846 47206 67894 37971 34485 51320
5415 51320 54385 42272 -2916 13165 -167 -61810 -93251 23158 61141 73065 11485 34631
5403 34631 111826 163835 83670 23694 -56568 -27336 -11694 -54481 -27981 18879 -40776 -59915
5391 -59915 -19888 -74170 -9143 68400 74987 49590 58309 15754 -7031 21909 56784 -15078
5379 -15078 -82706 -40224 -32277 -66361 -93503 -54810 -53673 -62655 -29316 -8615 44721 68883
5367 68883 6408 42169 96925 28343 -57897 -8416 8695 -20025 -73332 -119764 -147603 -94146
5355 -94146 8058 124015 158043 22274 -44719 14143 83929 86388 76238 181970 158515
5344 158515 122149 19231 -31658 -26834 17043 28258 38742 37240 22211 24580 16976 79683
5332 79683 80669 36376 18766 11800 67982 108432 49424 6430 27047 33104 7668 -85557 -149442
5319 -149442 -37134 35980 20966 -13940 -3166 -43758 -109465 -109316 -109936 -72023 -67695 -72515 -113347
5306 -113347 -89598 -155456 -132576 -19493 33053 35831 8990 -67291 -75059 -110895 -52990 -39024
5294 -39024 -75134 -109002 -54178 -77866 -94565 -95291 -141824 -98928 18997 -21617 -86970 -74950
5282 -74950 -55966 -31729 -4144 7966 1450 81628 67068 -16341 -14940 21346 72635 52372
5270 52372 -54842 -102595 -45796 25963 86580 110547 57315 74246 74750 23785 -31330 -51257
5258 -51257 -81663 -70168 64228 115726 60412 52361 43647 48859 66576 118069 126943 23860
5246 23860 -11728 -9901 -103213 -212521 -138875 -61081 -15275 28888 83846 68233 169945 239668
5234 239668 113211 56084 -1845 -99678 -144302 -205487 -250514 -164041 -59873 -26849 -40316
5223 -40316 56669 85887 56175 -22411 -36678 60108 89930 120068 82675 82572 103771 -25103
5211 -25103 -66484 -109701 -58558 -56839 -352 17367 -36871 -67733 -77859 -59785 -35590 -27998
5199 -27998 38234 50087 -32304 -67859 -10283 67032 58483 108583 75390 68191 83972 34641
5187 34641 3285 70403 89590 55681 -32454 -68372 -92514 -55844 -49102 -6259 -39077 -40902
5175 -40902 -48849 -102482 -223492 -250094 -184091 -142243 -127485 -59686 -15804 -75122 -3520 20115
5163 20115 56441 21036 87162 156063 89824 32010 14571 54273 114704 66191 108143 7950
5151 7950 11444 -28905 -36095 -9297 -13374 20506 36813 39982 38948 -26332 -37361 -25404 60992
5138 60992 118568 99747 -35032 -66543 -52030 -5302 -68389 -89364 -53514 -59052 -119160 -177637
5126 -177637 -115964 29646 118264 103601 57024 36773 47408 51377 16629 -54485 -194434
5115 -194434 -252512 -227937 -171037 -116531 -52978 -2303 -68927 -115452 -105284 -29899 -8483 -21525
5103 -21525 1403 39003 118830 67190 -17191 -39054 -112104 -139735 -164116 -169277 -145587 -106870
5091 -106870 -162636 -173552 -105355 31154 37192 49766 -43102 -89623 -148203 -163342 -156450 -162449
5079 -162449 -95213 -20533 52170 120391 71533 28662 47289 41563 50435 43488 23190 79245
5067 79245 69904 37958 39177 40178 29497 57107 54937 91578 74786 84361 74489 35892 1992
5054 1992 -87751 -11499 125304 54918 -28391 37978 33351 -44547 62094 154913 113644 34368
5042 34368 55037 53026 49667 11617 12505 29582 19464 -25534 -81732 -38827 -19672 -33960 19098
5029 19098 -39725 -106802 -100599 -23998 51008 42167 -62914 -98287 -113111 -120761 -53793 -51892
5017 -51892 -56210 -49945 -35274 -17233 38281 81049 138726 54499 23300 66700 -5967 -131936
5005 -131936 -142024 -103682 -29205 19376 -33144 -84084 -58866 -29296 -28149 7888 -22262 -75621
4993 -75621 -78773 -75283 15344 -29678 -116808 -167793 -177208 -200904 -207479 -162034 -34476 67319
4981 67319 128043 117968 -13580 -129919 -100042 -12687 14474 -30920 -38696 61214 104414 39984
4969 39984 -72457 -76505 -46516 -139922 -169970 -190930 -243925 -215513 -186668 -150541 -124027 -48410
4957 -48410 30359 42451 37525 18018 15690 55884 7979 -28594 -56457 -31226 -1428 -4800
4945 -4800 -32409 -55729 -66893 -140543 -127672 -35974 22609 -59177 -92099 -88975 -104295 -137622
4933 -137622 -183087 -167100 -206657 -180963 -35793 -56465 -21560 7746 -8661 -21473 -89306
4922 -89306 -79967 -58201 -115075 -151464 -134284 -163385 -89792 -17365 -27306 -54732 -48103 -55559 -5563
4909 -5563 13384 -2372 -17712 -42593 -77266 -86226 13064 62819 66667 -32940 -70373 -43729
4897 -43729 3512 -70693 -119033 -159086 -62842 -47520 -78120 -57557 -64055 -82809 -112475 -55139
4885 -55139 -35420 -63222 -45011 -58168 -39831 28774 15527 -60396 -60499 -66127 -14683 40380
4873 40380 -37898 -14915 43293 7695 14103 22130 96954 97827 76400 86177 43204 -47344 -110787
4860 -110787 -95815 -74109 -122951 -16120 122913 61270 54969 37931 17263 -24172 28329
4849 28329 -41222 -160106 -178052 -179836 -135872 -135893 -153440 -139103 -43062 29691 -41163 -76111
4837 -76111 -29616 -61253 -122525 -203074 -219490 -137337 -92278 -115561 -174621 -105243 -142595 -120674
4825 -120674 -140471 -225140 -150360 -1422 39153 -9010 28980 144180 129929 159546 89649
4814 89649 -9416 -51273 -52974 -16376 12324 -60515 -107824 -27702 -18257 -63714 8874 -100322
4802 -100322 -184258 -137610 -58788 -67423 -143322 -170323 -97124 -99454 -108747 -90957 -43711 -65643
4790 -65643 -136454 -63274 15248 -63573 -42021 -49047 1373 32770 31205 3138 35296 55033
4778 55033 -9006 -77609 -135562 -162364 -81844 2547 59358 54093 35106 536 -67627 -74429
4766 -74429 -55256 -24448 94721 142684 60353 16379 -9240 -52220 -19935 27092 63362 10832
4754 10832 31783 34707 28072 153109 174833 185440 82613 96213 186468 139725 67640 -32523
4742 -32523 -76401 -19503 -19655 -86584 -124661 -136920 15226 60374 82513 107497 -48399 -151153
4730 -151153 -138743 -95152 -115471 -196229 -212047 -151864 -84962 -49175 -44282 -39910 -9134 -28194
4718 -28194 -89319 -122075 -110757 -102541 -170060 -110854 -82817 -101280 -73924 -45020 -16910 11255
4706 11255 32714 -20503 -15509 -30343 14167 83698 166070 179828 111544 56311 62936 122963
4694 122963 45909 -98553 -149629 -68828 34700 66579 23642 19050 -78301 -34936 -21744
4683 -21744 -40647 -21986 -54993 -35625 36332 100731 69725 7936 -10304 67628 62124 49097
4671 49097 -36830 -47881 -27 -72548 -151914 -175478 -76638 -44354 -19629 -30674 -69343 -47958
4659 -47958 -53188 -39692 -31253 -37305 -28739 25092 58636 35364 8891 55337 -41286 -111145 -81972
4646 -81972 7371 52552 -47796 -116484 -58575 -71723 -41026 -30725 -16144 35391 48948 53905
4634 53905 61033 2798 100788 121010 181316 219384 86401 40108 137852 98904 43456 71432
4622 71432 126143 94252 32340 -2135 -18819 -512 20613 -31057 -94357 -41564 18514 -27971
4610 -27971 -70748 -12017 -34314 -47013 -34351 2878 -1419 -58689 -139534 -144681 -85339 -51148
4598 -51148 -65587 -81291 -21454 137491 154273 118891 132937 180550 118504 25777 -5531 -110086
4586 -110086 -137799 -70718 -91395 -130375 -83430 14272 18449 48607 39553 44997 11864 -36307
4574 -36307 -73545 -98244 -96924 -34215 29165 130074 96462 59642 31968 13748 -48077 -137320
4562 -137320 -117564 -70338 -7973 25994 107627 65289 -18245 20458 3314 77822 142275 190117
4550 190117 206159 136916 95218 55762 -36730 -77194 -39962 2651 22437 19311 48448 -3028
4538 -3028 -11666 29029 15267 -69016 -115329 -155669 -82628 11018 21787 -86803 -73900 3069
4526 3069 30546 103870 51594 80114 78738 -14238 -80555 -55469 9929 42232 -5610 -56642
4514 -56642 -34037 47895 109360 100374 118106 94000 38237 66416 114702 106693 56649 6836
4502 6836 -15945 45779 77296 40739 22620 13401 -65587 28293 138998 33019 -28467 -45849
4490 -45849 -12354 -109543 -69781 34911 80852 84859 89643 -56265 -117058 11867 87342 16880
4478 16880 21984 102278 197882 114716 -61186 -126593 -62697 -98436 -73635 -66982 -70724 -106793
4466 -106793 -35524 5998 -19668 -15689 7982 38482 -5959 -51778 -48518 -15716 -32645 -20528
4454 -20528 -45844 -68514 -25903 -41969 -49997 -14643 10765 84737 111334 71225 54671 66183
4442 66183 50841 38626 34010 85745 186398 249998 173107 82034 77883 64514 16847 59919
4430 59919 79600 32065 69012 65994 127331 66782 62564 122957 89676 44741 69106 111075
4418 111075 36420 -55928 -63898 -69625 -57984 -58828 -88858 -70834 -112096 -42679 20011 -37234
4406 -37234 -988 49397 44714 9855 32693 75353 70244 42216 -19650 -163746 -66157 -11902
4394 -11902 -57432 -91244 -130706 -167197 -128753 -143599 -135339 -81890 -129443 -97900 -37599 8394
4382 8394 -18986 -104191 -126519 -149632 -53930 91787 119685 20716 -12853 -82369 -87434 20295
4370 20295 -7749 -17848 37206 120718 130527 170287 90336 1990 -9751 -18121 -27321 -84436
4358 -84436 -26466 7252 -11570 -1758 -77814 -89792 -10414 -66563 32186 68528 77699 108474
4346 108474 110411 -30977 -7262 55339 37395 21615 34884 149412 78026 71440 186768
4335 186768 152728 119448 -31473 -49339 44023 60554 113769 110642 64597 33255 -5019 3048
4323 3048 4587 -90714 -132040 -37165 -7183 -31603 -61761 -70384 -41553 -82293 -148788 -112605
4311 -112605 -30989 -35633 -54678 -131829 -153265 -139436 -123811 -143001 -144450 -116744 30046 -2957
4299 -2957 -71005 16826 75295 32771 65447 52467 -36085 40844 70459 80922 83151 -43696
4287 -43696 -187181 -209806 -112273 -67232 -36820 -61245 -2549 -13209 -81662 -63287 -36438 -84458
4275 -84458 -60855 32544 96428 118081 112768 65182 82008 129184 -5810 -115835 -102604 -39395
4263 -39395 14171 -53154 35678 126941 55915 23781 33770 9576 -63491 -92551 -68322 45238
4251 45238 152151 178340 68248 19298 5256 -30427 -17626 -8709 -17366 5609 -61752 -58412
4239 -58412 -5886 -11841 -60032 -20378 -42278 -123883 -115490 -66189 -104310 -140198 -111472 -98436
4227 -98436 -50173 -41279 -26559 16406 49001 50907 43514 27807 48257 -15447 -55279 -50040 -44218
4214 -44218 4155 -36415 -85375 -28195 31468 42751 -680 17428 76402 126818 104709 67238
4202 67238 54131 -10269 -90245 -31686 44936 110975 182041 159369 16404 -98828 -151471
4191 -151471 -114061 -120604 -134258 -139717 -151802 -191282 -167480 -123018 -97821 -34560 52443 68237
4179 68237 83382 95454 55391 19849 -19881 -50845 -12092 -55890 -89864 -87195 -50378 -20390
4167 -20390 3187 -12082 20703 -70741 -144059 -24308 14260 -113043 -143835 -69864 25150
4156 25150 -13039 -21610 2848 -21058 -528 146378 168307 136142 122567 94433 -39211 -102395
4144 -102395 -25818 95278 112953 98965 -2196 -82939 -65371 -38983 -51042 -30784 11132
4133 11132 -64158 -205 9161 82258 115208 34483 33459 120535 73765 -46401 -63428 -48897
4121 -48897 -9807 6366 18964 34766 32247 48135 34800 -33730 -78658 -53750 -76612 -70349
4109 -70349 -95790 -109543 -123687 -45576 -10710 -31979 -9372 -8010 -3772 -39103 7431 -42196
4097 -42196 -68232 -126928 -52605 12320 71452 -31728 -137708 -186348 -140151 -93259 -100029 -171111
4085 -171111 -173296 -144344 -107666 -87935 -58100 14291 62967 27897 75723 72961 82269 103095
4073 103095 56203 128559 80024 102311 98988 141166 251244 197850 30258 -37740 -62657
4062 -62657 2867 18251 -14408 19251 71671 70392 77962 94820 160197 94016 74430 12301
4050 12301 -23671 -12712 35274 36255 -21207 23017 119166 154840 107331 49654 43886 28977
4038 28977 61327 85798 102084 61733 -6918 -21557 -96913 -78580 -46199 -559 80711 85162
4026 85162 22153 -55002 -168875 -142756 -94183 -87915 -105207 -58079 -44158 -71476 -55401 36049
4014 36049 82097 13970 -63439 10917 26536 -7604 -3340 137 85438 75799 31405 -134799
4002 -134799 -189743 -131324 -70749 969 41871 2171 1842 8598 -2747 -93115 -115370 -18207
3990 -18207 120223 61587 -53570 -126491 -79098 -63713 -137764 -94008 -31162 56331 90110
3979 90110 129780 84948 49042 77370 111857 138615 60024 36382 43693 7793 10685 -66376
3967 -66376 -81049 -136211 -150700 -135345 -134728 -68212 -4275 21834 -114297 -169487 -106715 59752
3955 59752 65770 51360 44296 7046 -39924 -152313 -206064 -143952 -124753 -11655 77549 11318
3943 11318 -39044 -44946 -63867 -36335 -31326 -54656 -92491 -72128 -50685 -2138 -32848 -45492
3931 -45492 9335 -110985 -188086 -50280 9472 -18097 33928 46987 9559 -18973 -20786 -99240
3919 -99240 -100114 -30650 31210 77822 92545 10916 -53758 -99409 -121002 -89891 -22378 31794
3907 31794 70537 72735 51837 67382 73887 111561 152484 156498 159029 191249 182131 233237 157604
3894 157604 47081 51605 35468 37514 59136 27097 12947 -65675 -134164 -28388 -18731 -41186
3882 -41186 -43625 3751 21787 16713 -39274 -85165 -63406 -64385 -86835 -112678 -137769 -150440 -100225
3869 -100225 -35217 61667 53499 43655 37687 78596 67680 87121 134240 34411 -73145 -76301
3857 -76301 25603 136316 49258 -25240 59052 60969 13159 2338 19529 -7463 -25694 -19263
3845 -19263 -65703 -94989 -71400 -79946 -112293 -134074 -97006 -205694 -210857 -165664 -84948 -136765
3833 -136765 -147534 -89780 -105877 10295 73474 -23909 1395 75283 16405 -43616 -76053
3822 -76053 -11602 19440 6492 1628 3978 -61546 -128331 -74093 -42883 85594 224026 186848
3810 186848 111901 52915 71974 104828 41875 18749 1238 -50758 -10073 2559 56 -26859
3798 -26859 -81304 -65135 -126783 -131337 -58055 -11519 -5605 36420 62288 -51219 -169305 -106153
3786 -106153 -55864 -144033 -167526 -125586 -64164 -66524 -81279 -17682 67386 32434 4051 -47139
3774 -47139 -70934 -47280 -131007 -47011 44663 94979 61897 132403 69834 -33160 -38440 49207
3762 49207 67846 41083 119795 150761 97992 -11364 -43405 -25874 -222 10879 83408 122298
3750 122298 110626 98939 83709 130999 90149 34416 71113 15939 13457 38293 10463 81803
3738 81803 144242 160267 203250 220243 155444 104426 -32564 -93832 -177404 -149685 11597
3727 11597 15074 -85362 -99246 -77276 -63980 -92381 -29020 -31241 26216 94490 108955 117345
3715 117345 83779 16969 43942 49844 6119 -30668 -74452 11753 38783 3036 -42247 -80545
3703 -80545 -87949 -42544 -35797 -71199 -85958 -107248 -43879 54282 71037 7793 -34491 -52516
3691 -52516 -8275 26202 73313 57210 46537 92253 165969 153075 149230 130448 44939 43185
3679 43185 71022 72127 11679 -1297 39556 -528 -10988 -51284 -103055 -53874 17567 34079
3667 34079 54727 5005 58592 81531 90548 77511 20842 -12011 -36572 -90414 -127014 -81056
3655 -81056 -155834 -223050 -169985 -91984 -82640 -84941 -12284 73040 60461 95359 103567 104928 71620
3642 71620 238 -104031 -127232 -76434 -17090 34420 6399 -82169 -103193 -62253 -85323 -164461
3630 -164461 -153576 -87156 -86439 9553 93235 67824 -3559 -74139 -6090 28729 32223 -35230
3618 -35230 -105484 -111059 -99586 -90798 -96624 -56630 -70158 -98957 -108245 -56425 47645 111692
3606 111692 119470 141567 123834 60665 -50859 -51397 -38208 -57174 -22252 72971 78130 62697
3594 62697 32292 -20793 -100554 -152691 -72628 18773 53774 48771 47954 72051 96181 73516
3582 73516 66422 132521 144948 62904 57779 -3821 20117 84597 70173 39057 -11311 -55172
3570 -55172 -8796 -64695 -160973 -128673 -126042 -142358 -8318 71823 85290 119815 108673 60254
3558 60254 -21054 34137 101042 62358 81829 97096 89064 57812 40917 29980 35974 53951
3546 53951 116739 94975 74092 38204 81299 129616 158516 48091 -9424 -9715 31957 64986
3534 64986 126402 76005 16753 1789 99107 77143 28404 -32759 -32289 48740 29336 -3276
3522 -3276 -66717 -24996 62422 159608 282861 218750 78566 -21962 -98762 -74473 -80358 11497
3510 11497 87975 33208 -35874 -21968 -24478 -11442 -41324 -10359 -7059 11476 -54334 -108814
3498 -108814 -40743 6932 -25414 -43662 -27610 -62055 -68968 -30314 -18313 35928 90385 80978
3486 80978 102247 41434 21878 51956 102841 103171 -13523 -105356 -108079 -54445 -59203 -54271 -86975
3473 -86975 -88166 -11113 25384 8571 7411 81097 126121 165417 82500 33174 45505 61310
3461 61310 148127 183214 85596 -26311 -68722 -63334 -55910 -758 -64553 -56932 -55133 -80983
3449 -80983 -76326 -67474 -108543 -155927 -53423 -88461 -143123 -41407 -32095 -4785 69896 64625
3437 64625 124058 97734 17454 -342 4685 -45909 -65661 -51265 -48246 -101857 -158678 -108878
3425 -108878 -9383 34863 47591 27856 13592 -754 63527 91612 86097 181958 252248 253990
3413 253990 190166 123031 62340 12705 14177 -70383 -112771 -84469 -30622 30268 98570 81785
3401 81785 -12245 -64012 1267 -68525 -88575 25619 111688 107614 -26403 -51648 -61624 -43924
3389 -43924 15788 42001 100633 121157 105270 181729 204063 37894 -23687 -37868 -18717 20389
3377 20389 -9890 -5432 15197 -22408 -24352 -32523 -14643 -35023 15657 27110 134235 270056
3365 270056 273153 171331 94699 22449 -48924 -88182 372 58416 61819 -13270 12914 43648
3353 43648 19928 22431 -28036 -105700 -150193 -84398 -36915 85668 145900 161535 168042 164125
3341 164125 141590 79317 113856 167212 145743 160160 126457 108313 93411 90997 39380 36178
3329 36178 -39229 -69057 32090 75862 16130 -3532 -14066 3397 -26047 -20226 -69776 2258
3317 2258 -8199 26049 37424 103319 83123 92089 43704 90793 63270 57489 12872 -54456
3305 -54456 -72278 -49380 -66041 -95546 -89311 -117116 -131216 -104065 -147869 -123117 -61571 -12438
3293 -12438 -16944 12457 19052 23101 19832 9139 -26898 5382 55490 41085 58293 32068 -84430
3280 -84430 -62959 86275 31986 -67549 -89385 -72117 -106607 -91533 -133121 -120450 -114697 -70277
3268 -70277 26014 -155 -35333 -38137 -6769 -32328 -55994 -37476 118098 132455 86223 75225
3256 75225 24851 20123 -20215 -16478 -76348 -91486 -44375 -34596 -57490 -64795 -52378 -112955 -135983
3243 -135983 -28143 -9997 -89805 -43421 -18402 -7580 18452 14514 31485 -70163 -81797
3232 -81797 -205060 -215666 -178602 -157159 -141822 -119395 -102214 -108556 -78046 -150404 -215659 -129048
3220 -129048 -20222 -36929 -52206 -28070 91819 121344 91253 16782 -13511 21677 -32798
3209 -32798 4674 -16683 -50496 -17452 36283 106635 108611 57804 27989 53726 20965 20275
3197 20275 54413 37406 100680 117700 71113 -28057 -9255 -20682 -60719 90368 169595 118441
3185 118441 113399 69406 43906 62452 43542 64299 19187 -35627 -30350 -69463 -99283 -36030
3173 -36030 62970 57343 73270 65781 37674 23005 48142 -38354 -86795 -63343 10946 -24594
3161 -24594 -122374 -148086 -195287 -259845 -194425 -149043 -37165 -44458 -36066 -60653 -141007 -134129
3149 -134129 -11702 87530 94008 29350 -23260 -255 5360 -39901 -59985 -146875 -98220 17329
3137 17329 7275 12455 42813 16202 86106 137590 104750 95640 132692 128306 71095 -12320
3125 -12320 -54754 -63449 -62217 -46478 931 -62318 -74001 -82332 -65900 -28440 -15642 52043
3113 52043 77531 183 -85087 -94563 -87359 -75897 -53310 -63851 -120978 -126053 -53862 -34100
3101 -34100 34067 76328 67677 72640 -24452 -81705 -42722 -5345 -54227 -25258 65572 118669
3089 118669 148994 110453 15364 -60670 -90111 55515 44066 56400 6340 -63585 23594
3078 23594 59050 78273 32417 -33535 -24589 -225 -58855 -89485 -99948 -67805 -82509 -145170
3066 -145170 -106530 -30964 37804 41133 -5204 20524 55454 119795 82705 -39783 -114412 -163215
3054 -163215 -159692 -55243 38553 44749 34705 -15449 -71430 -99968 -190578 -100435 -47971 -36719
3042 -36719 -59243 -85478 -45888 11465 -14832 29312 91745 53039 34123 32214 -21715 -17376
3030 -17376 50202 24400 -44937 -17236 -3145 62093 134841 154262 99826 40024 56272 92897
3018 92897 1148 -28753 11380 66477 127189 88045 37164 -72651 -161612 -266886 -247330
3007 -247330 -159323 -18288 3152 75851 103487 51130 20703 22572 58356 59382 14018 -33554
2995 -33554 -39188 -15775 -12959 -51914 -33373 -136414 -140616 -100303 -57887 -7680 41553 44823
2983 44823 48351 73852 62599 -27050 -95837 -58423 -7797 36732 -44682 -62291 -50786 -659
2971 -659 89930 77408 79411 99369 33029 18226 83938 41394 11535 -21890 -46579 -36423
2959 -36423 -52102 -43179 -28946 -125416 -116096 -60666 -71176 -80396 -8085 65144 187867 175549
2947 175549 50223 12285 -12568 11429 131952 116318 74869 68111 39661 14383 48190
2936 48190 -22976 -54983 85536 159218 135452 70979 30537 -6825 -64287 -62984 85157 76061
2924 76061 80138 77229 121066 94062 91603 87362 123960 130723 69916 25646 32808 16283 -11825
2911 -11825 -33158 -52799 -9491 -20303 -56197 -37017 -37449 -151673 -129968 -79339 -36483 -68742
2899 -68742 -62570 -98207 -125348 -136753 -239141 -246889 -86912 -61286 -57457 -22070 23849 49017
2887 49017 20884 -10735 -29565 -92355 -30421 42559 79760 18014 -51110 -38553 -64332 -36120
2875 -36120 29462 56426 57314 18354 -21731 -55870 10886 48026 69582 49945 13990 21196
2863 21196 45213 14014 -31282 -15723 -40155 37600 132477 95071 27178 -3570 3363 11319
2851 11319 53963 -6207 -32759 12866 -93790 -26592 94492 121337 114114 27601 -9947 -16135
2839 -16135 3666 -62625 -91508 -86090 -176806 -155302 -101820 -69719 -45117 -19687 37987 75484
2827 75484 80156 61895 -9676 -51867 -81031 -28467 4368 46851 106743 104364 50463 -58378
2815 -58378 -80241 -31433 28299 59968 71051 33251 31717 21617 34438 68681 85978 5588
2803 5588 -83545 -84614 -57919 42052 116003 71789 50826 64981 57745 42612 42756 -47889 -34840
2790 -34840 -31684 -10018 17305 99322 106879 80874 73673 97397 112582 132495 130212 130005 69883
2777 69883 15757 26504 11049 -48701 -20485 42402 54532 110561 120378 45878 145624 147140
2765 147140 144455 139304 147100 196405 188321 129536 85574 111664 146931 59810 12054 -61086
2753 -61086 -83022 31740 111199 115796 106482 151978 109031 81686 95743 53247 46389 26017
2741 26017 45212 -66063 2814 6839 -33579 -65642 -48164 -2368 -33963 -83723 -107425 -102614
2729 -102614 -45710 -13283 46247 9055 -86498 -53941 31257 57106 -17238 -92976 -145868 -114614
2717 -114614 -14535 -14106 23219 76236 49654 61995 -16031 -17524 40504 -10049 -37587 14327
2705 14327 -6479 -13992 12649 -16667 -85124 -74481 -114103 -188988 -73100 -65748 -524 6178
2693 6178 43939 56378 34960 43808 36147 -63170 -77032 33639 69604 50164 58696 54473 -58370
2680 -58370 -60457 -61994 -66140 -45871 7568 -10517 -66697 -83001 -22192 30309 -3863 -22361
2668 -22361 -68180 22636 83604 38163 -28391 -48260 3191 -28903 -67466 -16543 -24140 -103731
2656 -103731 -75750 -39870 -102086 -44778 12760 32365 -15519 -40512 -61170 7297 11503 7858
2644 7858 28641 65848 66673 -32764 -113319 -110883 -64447 -40327 -49713 -58088 -451 -44185 -83214
2631 -83214 -96388 -75092 -67691 22018 64193 33417 16762 73663 57640 -624 -93716 -25927
2619 -25927 -70377 -36942 24834 -95069 -177258 -156299 -90592 -54380 -18010 36608 89157 -9693
2607 -9693 -140061 -109927 -74671 -98589 -1114 100657 69520 -14065 -48695 -30355 -32389 83365
2595 83365 92906 1604 65701 65483 110228 118013 47908 50562 45435 -4011 -5317 -29961 -76160
2582 -76160 -106799 -109456 -67993 -58632 16263 -5768 -109485 -134451 -188024 -191764 -113671 -60605
2570 -60605 -65469 -17474 -21709 -76129 -56482 -88601 -113476 -11982 -41083 -50179 -32131 -9100
2558 -9100 -7425 -101001 -65743 -10793 34847 109670 99426 52201 103972 65087 56402 -23526
2546 -23526 -25003 59422 8252 -21760 -42048 -20917 -64204 -135274 -79331 -31442 7313 80641
2534 80641 60515 57990 19561 -80231 -142796 -30113 19781 -38187 -79513 21757 23171 -46786
2522 -46786 -81088 -132589 -109887 -3414 60947 99728 77760 77964 -39371 -120981 -115131 -110346
2510 -110346 -20749 15966 -12296 -95840 -59563 -22656 -67607 -71625 -41258 47468 150759 79254
2498 79254 -94480 -123564 -35607 -26411 -4943 -29919 26340 178281 174942 87428 -4610 59768
2486 59768 108785 33606 -20636 -36814 -65583 36030 30593 -81371 -97276 -12013 129100
2475 129100 257283 184528 128099 78496 -9604 16617 2525 -16995 -21565 69710 131122 20906
2463 20906 1540 55185 51031 110179 111173 3438 -115715 -147736 -36432 32310 49150 61769
2451 61769 139304 119125 133909 155088 173142 149297 -29855 -117043 -194886 -115084 32018
2440 32018 28047 -39796 -69635 4784 23592 -26949 25903 53825 48622 86896 82804 64228
2428 64228 -64706 -143896 -80834 6007 4426 -95932 -120895 -10785 20285 106978 104220 42399
2416 42399 63031 96906 -5883 -38846 62411 159529 111867 -17926 -12085 87302 125318
2405 125318 126903 -6799 -34258 -14806 19367 105309 102976 46104 -61323 -31681 -32680 35489
2393 35489 30464 -50511 -99659 15924 -1483 -70668 -177143 -186291 -130742 -95980 -76844 -32736
2381 -32736 24845 33642 91625 97875 19176 -26939 76526 44502 -25852 14113 17433 49988
2369 49988 191566 160745 37533 36768 -44096 -95064 -82891 -15650 90602 145377 128458 72824
2357 72824 -60029 -113446 -91830 -31496 30114 18827 -7227 74012 152385 191199 150201 61346
2345 61346 -5203 8395 42150 29447 31679 21384 -60693 -101830 -101961 -129619 -77168 14738
2333 14738 38517 46093 2216 -17314 60287 97810 123103 136147 -10223 -84523 -84666 5846
2321 5846 97803 168390 172888 135981 29195 -41928 -56381 15841 30171 35973 82167 100592
2309 100592 150092 160138 132587 121608 39918 -64517 -107452 -29017 -23266 -39649 -45711 -88693
2297 -88693 -117054 -72684 -53257 -17414 58286 11241 -41953 -85687 -88974 -80303 -84106 -103688
2285 -103688 -66439 3075 -16426 -52043 -122771 -112468 -144455 -170913 -119675 -60239 -3673 -16997
2273 -16997 -38529 37500 7396 -105196 -109095 3199 38088 14417 -30897 -24645 -18021 -50366
2261 -50366 -97957 -70334 36965 8484 18903 16425 19747 29101 16616 -19286 -8528 -9974
2249 -9974 -45125 -66011 -94918 -18949 -20775 694 31977 33422 -63857 -94606 -57551 -49239 -79889
2236 -79889 -79415 -27539 -34052 -102659 -124596 -109251 -35804 -55644 -71851 -122767 -98792 -121594
2224 -121594 -50152 13896 33204 64999 86493 95644 46386 11487 42401 121927 63345 -30644
2212 -30644 12655 30576 -2910 -13504 8889 87714 23879 27091 77139 83688 75653 29985
2200 29985 -897 27668 11980 -51365 39481 101262 7254 74359 58439 50375 78492 -6068
2188 -6068 -61204 1325 71278 12644 20464 8128 6661 23890 25785 58511 65970 19941 -125818
2175 -125818 -218407 -221728 -182957 -184977 -112855 -16867 -2115 -40648 -17407 56758 110166 49155
2163 49155 34554 11110 -594 -67954 -19145 -39329 -91824 -104929 -98518 -61692 -84013 -97643
2151 -97643 -74304 -118 59047 -1188 10354 64121 97001 139928 139013 30122 -3191 -17942
2139 -17942 10924 97863 80337 98547 72682 -20699 -82297 -21909 12978 -26000 29173 60968
2127 60968 47129 28131 -12391 -19251 -33727 -107985 -100277 -118426 -66073 -69936 -86280 -77704 -60087
2114 -60087 -31316 4237 -43392 -101758 -135470 -93085 -10913 96527 37403 -24232 -28830 -54338
2102 -54338 -61396 -32625 -6519 27597 -73 -90664 -151194 -214355 -219322 -132136 -102272 -38156
2090 -38156 42438 99642 21915 -14971 -6366 40992 33901 26442 46903 61030 85612 45642
2078 45642 -8477 -82301 -67565 -33430 95489 110068 83822 35993 99391 76632 15720 -33726
2066 -33726 -79299 -71704 -3711 111161 124873 109158 89994 114202 165682 117385 148465 128023
2054 128023 -9464 -64941 -66288 1936 43793 59749 48391 54784 51647 67162 53605 -50057
2042 -50057 -150748 -121413 -59904 1995 5876 7415 27996 -4858 -1072 113439 96994 21902
2030 21902 15929 -26343 -113156 -155695 -101653 8124 24250 10309 -38017 -51722 -44613 -29509
2018 -29509 -74886 -117314 -70333 -40940 -63969 -40029 25600 -45005 -154197 -81080 -40144 -1783
2006 -1783 -15310 8041 -9510 -30845 -63740 -15618 -2663 -9443 57110 72619 110515 134347
1994 134347 45978 -21325 -33364 -28317 91479 80676 73124 96554 136828 71943 88512 66773
1982 66773 93770 131159 64045 8363 51924 53121 77318 147684 201476 224611 219574 117690
1970 117690 87311 116254 149637 152748 86706 62661 79295 76142 23018 -342 -30660 8571
1958 8571 9857 14769 -24545 -113024 -128335 -112306 -79305 -4326 38519 105005 57682 18813
1946 18813 81190 88876 68645 34418 -28153 36114 95497 103990 154968 228778 250609 180698
1934 180698 187172 217417 164235 110002 69283 50911 23564 -14449 -83771 -129916 -135150 -89908
1922 -89908 -82622 -57978 -11423 67739 65867 7722 -52088 -99312 -78221 -22351 -3440 -50091
1910 -50091 -41182 20920 90773 80860 129534 87334 -24169 -15931 49367 59295 55232 -28597 -91060
1897 -91060 -51248 91021 27360 -17118 20731 24111 35976 -43435 -70357 -66513 -147920 -150898
1885 -150898 -209759 -194018 -161479 -59738 -9822 4634 95780 65374 -5076 813 -48346 -27063
1873 -27063 -36699 -76157 -160165 -265741 -257114 -197492 -77943 -43845 33993 96797 8749 -53700
1861 -53700 16200 102697 110872 55971 6407 -23577 -100203 -180590 -135384 -101989 -143094 -222127
1849 -222127 -141744 -70187 -31097 26742 68037 70873 106535 104548 109016 69436 40378 -38929
1837 -38929 -76842 -37506 19712 19461 19951 99359 75122 -17827 -68548 -41973 -20879 34892 11997
1824 11997 6838 62010 54153 43060 -15949 -64414 499 -95178 -156776 -183748 -130311 -54196
1812 -54196 -104299 -116866 -44365 -46447 -31634 -54337 -125096 -162297 -140101 -114018 -110938 -194581
1800 -194581 -234185 -115779 -83338 -29541 51399 132481 102560 50863 -11076 -13833 -15945 -96410
1788 -96410 -14875 -27325 -18377 -73275 -14553 70417 97296 5021 -49254 -40150 32397 36458
1776 36458 53359 12478 96474 139492 40436 -37923 -8516 13894 37938 -29153 -118469 -31075
1764 -31075 -29860 -16617 -10260 -54784 -90927 -72986 -102957 -156642 -135615 -78767 -21948 -40672
1752 -40672 -55056 4577 37541 18440 -31433 -25108 -2782 -4549 -54036 -84292 -38510 -87441
1740 -87441 -117884 -65122 40354 67364 17728 -31163 -82924 -21089 70436 56930 83367 40327
1728 40327 -10781 -9016 72402 46116 -54358 -25814 52267 23138 -2513 -12953 -20489 20881
1716 20881 -696 -27880 -21412 -16072 36680 4769 31954 35774 23992 76399 126641 79525
1704 79525 99494 161135 144942 117867 81667 78086 25567 25576 -41363 -47780 1271 88053 72967
1691 72967 99673 44402 19849 116258 77417 48438 -485 6133 -16365 -63616 -51110 -43160
1679 -43160 -6947 97077 56836 -32143 -50714 34400 5150 -1769 44823 105952 159081 128825
1667 128825 47771 39353 63505 75954 66020 62130 66937 4670 -27853 -20391 12799 28013 107703
1654 107703 114016 -9885 -46521 -29556 -6197 64011 74975 120202 126072 110814 9898 10538
1642 10538 37447 18895 24015 24203 -7855 -95068 -40593 -9344 -98917 -70402 32493 6954
1630 6954 -75977 -153377 -81181 -55948 -59117 -51627 6338 84905 65636 61010 89198 5382 17879
1617 17879 61079 54266 104236 4602 -64797 -66228 -88209 -82160 -13243 -99031 -106655 -76691 18696
1604 18696 -3828 -6275 -7254 67053 94788 93544 147939 115000 108368 111743 51982 25499 32030
1591 32030 2423 -837 -106741 -37368 34309 -61818 -154240 -52235 -48268 -68637 -57314 -65042
1579 -65042 -171678 -153772 -96081 -40164 43184 133142 59126 1272 -6047 -49584 -107075 -80348
1567 -80348 -1358 24922 -36367 -72226 30532 2035 -35647 -123344 -120931 36076 57044 75580
1555 75580 157005 180288 160355 -5320 -76926 -74291 -92385 -104570 -142495 -156750 -131147 -99077
1543 -99077 -33613 53503 72385 82914 82788 83401 46094 -37215 -92581 -45093 30173 55055 92675
1530 92675 60151 34007 14895 47927 105697 -27169 -61393 180 -50526 -108030 -108059 8449
1518 8449 56805 33976 2320 -53796 -98940 -65867 -62735 -59357 1452 45870 -39664 -14857
1506 -14857 44650 81986 51409 -23917 -75265 -46502 -94162 -79234 -106387 -109785 493 5292
1494 5292 -105597 -111410 -19849 139101 142337 19785 41780 20666 24548 27128 -3643 59180
1482 59180 157474 252008 197069 165806 111646 86867 104974 58778 125607 153145 121585 61968
1470 61968 5068 -16932 23555 31634 104170 109120 78184 12596 55503 114733 125987 67931
1458 67931 -37711 -88054 17483 114312 140486 108913 139960 168568 171660 86580 9127 78756
1446 78756 137930 64601 -25038 -35793 -70400 -104247 -118724 -96398 -28784 26125 8565 -62402
1434 -62402 -123062 -129521 -50114 -17936 -59858 -18725 10981 64325 45944 35845 1278 26181
1422 26181 42982 -12448 -95203 -78369 -59454 -92121 -29035 -105687 -102371 -79706 -56297 -13223
1410 -13223 64362 4080 -21468 -101938 -43115 -15123 -18513 8175 114646 199610 181707 88956
1398 88956 13666 10913 25149 -3609 23734 14286 -7112 12174 138909 85010 46829 119905
1386 119905 81599 49671 86065 48177 95687 143682 34931 -40393 -118121 -43854 -5343
1375 -5343 79492 171374 110510 68460 49927 32464 34261 21588 53683 70378 135678 118727
1363 118727 39691 -3652 -55209 -6075 46351 80359 111637 194172 207957 182344 66781
1352 66781 -32569 -19374 7379 -9696 9863 12504 40429 97049 70160 20859 -98849 -54749
1340 -54749 -86992 -27516 39464 118025 85465 6865 -37283 36306 58860 -53072 -92727 -45856
1328 -45856 -64836 -77492 -20358 101370 166841 117877 26922 -5041 -72879 -57392 -3732 -19576
1316 -19576 15578 7762 -31074 -35046 -56936 -59836 -47237 14153 -12778 32902 -19688 32018
1304 32018 103311 103015 87415 147623 206836 92981 14105 -1797 -8144 20057 -10941 50399
1292 50399 90237 55083 -44340 -25672 46473 27843 6246 32245 67140 67497 10834 32972
1280 32972 27902 49453 53700 11942 105246 67915 9717 -4306 -15339 -32272 -102383 -52718
1268 -52718 9975 90737 89887 148336 2942 -63082 -7323 8688 17230 123881 131547 83279
1256 83279 63119 104344 38706 45310 4338 -31418 -56731 -35331 -69465 -95247 -52583 -21143
1244 -21143 -20963 18030 12886 61964 27783 61475 66693 64980 59215 -10480 2240 78362 145723
1231 145723 157695 208761 187576 93633 139617 185174 188046 132284 106533 25758 76168 87356
1219 87356 38004 -66338 -12998 106024 160224 198335 211734 149300 21354 -48887 -46944
1208 -46944 -118328 -108053 -67081 4125 27141 -40103 -37543 -40805 -58716 -127635 -122048 -38766
1196 -38766 -89001 -95720 -60808 -84024 -83347 -57889 -26336 -49032 -55134 -107660 -101514 -44161 -3027
1183 -3027 2592 -55537 -77571 -30320 75899 40203 22666 39162 35009 4608 24903 -2266
1171 -2266 -97948 -119460 -161410 -117533 21541 106002 195565 176603 131931 121267 133610 150430
1159 150430 113061 50528 12987 25058 27495 9645 -74708 -59470 -29853 22398 43474 -24833
1147 -24833 -13449 -88044 -173043 -167028 -144433 -102897 -118127 -123912 38222 165641 214875 199275
1135 199275 65286 -61304 -114765 -68991 5937 -28620 -53275 -89008 -34262 15835 -9759
1124 -9759 17401 75324 61173 -9714 -77965 -65876 -79546 20368 67663 35820 -45329 -15062
1112 -15062 -7526 15943 67300 72919 99624 -4464 -142597 -113576 -57317 50298 76134 75230
1100 75230 69346 83302 91209 153353 187979 120898 62008 39252 1361 60304 -3234 2581
1088 2581 4378 -38471 -72885 -75843 -52037 -5227 34268 55493 -3048 -37689 -93117 -75830
1076 -75830 -34895 -45206 -101785 -100943 -116572 -116361 -84551 -112172 -121179 -57431 -8257 37004 101380
1063 101380 170752 115647 7145 -30845 15843 -4052 5284 29995 46201 -4339 -18367 28434
1051 28434 69563 75974 40288 52246 89869 118697 120114 -39794 -92492 -70131 -2970 13210
1039 13210 -28661 40244 -5491 -130454 -97027 -55362 -77122 -70465 17645 -4755 -54743 -37991
1027 -37991 7384 -3018 -45057 -40892 48638 69846 19659 -23903 4614 127963 224993 182948
1015 182948 51609 52040 51050 42153 -20726 -136261 -196823 -128684 -51776 -47075 714 -45680
1003 -45680 13887 44929 25255 -101 -102827 -220955 -186944 -134124 -57209 49520 140113
992 140113 113303 144574 70784 8770 -29217 -22345 49752 85440 57207 53877 29631 -11407
980 -11407 -18158 21382 50213 71020 88444 95099 93765 -5883 -61055 -63676 -18832 -42230 22426
967 22426 24056 296 -24756 16861 -13201 -6658 -528 45004 31684 28059 5388 -7069 22330
954 22330 67003 -29002 -65265 -1231 32859 -16752 -113114 -219004 -192088 -173543 -32447 22725
942 22725 -7322 -24359 7842 -10042 45759 32682 -36881 24824 113758 143422 71968 80511
930 80511 35153 42896 30850 -55163 -60406 -33613 -129461 -114776 -80099 9680 97586 128738
918 128738 173615 214755 187684 99286 24539 -40068 -48545 -23700 -37847 -81136 -18550 15023
906 15023 -32560 74705 100822 145809 212437 196990 145029 112321 101759 158845 145743 74296
894 74296 64270 62318 16230 -71156 63075 99529 -25192 -35001 8164 -8901 -42151 -50021
882 -50021 -23856 -37773 17149 -31143 -50693 -74638 -98916 -63332 -69824 -5439 134212 175693
870 175693 193049 124106 67962 40614 19079 -19117 -93464 -150992 -106777 -44418 -78716 -103779
858 -103779 -78958 -49057 24157 69404 46745 -36709 -45092 -43890 -6768 62432 95361 144587
846 144587 154012 124917 106342 94759 63049 47016 99315 40597 20380 92401 125011 55451
834 55451 -1624 -51435 20462 69042 2098 -67650 -80540 22558 72621 199696 266975 201619
822 201619 224432 239602 89238 59451 19558 -45862 -5404 62398 49326 11780 -56602 -50730
810 -50730 -48896 -37544 841 31414 -2475 -3322 -59236 -92527 -104578 -173891 -174455 -104805 -75937
797 -75937 -42022 -29074 -12103 -6632 47718 12723 -14282 -25815 -105853 -37187 76574 46684
785 46684 -4171 -22043 -49746 -103629 -160244 -123895 -93015 -18027 -21385 77763 25227 29813
773 29813 57202 143098 53949 80650 94563 109611 72577 -69883 -156627 -153552 -128080 -152489
761 -152489 -156334 -155178 -178593 -165255 -170034 -74148 -78091 -128578 -196477 -214095 -61314 -13577
749 -13577 -55926 -107749 -78850 -44318 -4823 34260 108713 85841 37206 26305 -30250 -85690
737 -85690 -38330 -17076 -6348 -27228 -49095 -151882 -123235 -105183 6398 28848 33009 22238
725 22238 -27184 -27163 -5989 -88360 -97138 -51253 10214 33992 -19579 -15012 13962 104302 172432
712 172432 139744 42922 -23545 -106170 -63200 -59826 -30578 -103939 -144051 -75077 -56004 -26073
700 -26073 -57831 -99392 -112974 7685 82585 39459 -75168 -101400 -61665 -45456 -11356 -42386
688 -42386 -115371 -48270 -60752 -27994 104687 76952 -64075 -79871 -79353 -107105 -35883 53488
676 53488 44007 32515 100288 143423 101896 100374 49267 -30019 10362 44497 -5982 -30655
664 -30655 -49057 -1458 -4459 -47092 -20777 30123 71104 49574 -23946 6808 51820 28191
652 28191 19044 -54119 -33308 10151 -18948 -93668 -113278 -74915 35176 125572 148938 127680
640 127680 55132 31905 7829 -89916 -89646 56 89915 54391 -23850 -45129 -35611 -19845
628 -19845 6087 29062 -59851 -74684 -44568 -45555 -93810 -106207 -190393 -101236 -52133 -24713
616 -24713 41651 25883 75751 69886 47823 85005 -3056 -73521 -28422 69573 38912 -33846
604 -33846 -14933 33175 24174 21454 95886 85283 121603 42119 16061 11171 -33874 -145950
592 -145950 -159509 -131840 -75541 -11509 -906 -51046 -93002 -128525 -123910 -185941 -183147 -166046
580 -166046 -81206 -90571 -1067 19665 -96341 -150318 -144241 -124453 -129443 -162048 -158903 -148257
568 -148257 -98159 -41893 -46354 -59781 -62972 -47537 -18564 -4970 46588 14430 -90563 -145819
556 -145819 -99462 30671 65829 63934 8826 -50520 -66474 -51129 -62793 -82511 -51435 -84512
544 -84512 -54098 -65210 -38638 -41305 7363 40666 -5908 -111102 -182140 -161444 -157537 -204315
532 -204315 -115492 -67183 -128140 -74807 -64233 -64814 -93963 -81807 -72810 -105845 -56131 -34704
520 -34704 62185 2371 -66094 -77199 -40213 -3101 -13025 -44553 -38851 -43055 -22887 -50461 -32655
507 -32655 -11425 -22218 16261 -14567 -67710 -49004 -93861 -119318 -91607 -97224 -112444 -77826
495 -77826 -104438 -52492 -100719 -99497 -117352 -86284 -82372 -52249 -28829 17503 -2753 -37775
483 -37775 10984 54418 -32211 10635 30718 29837 61493 -15090 12568 36403 50458 153328
471 153328 144337 170211 107539 111858 120523 51322 12365 -6172 83784 113273 51998 1768
459 1768 -18550 -53779 -103775 -125484 -133538 -129796 -115038 -49841 -37493 -68282 -34860 50428 111561
446 111561 196783 138697 28229 -33864 -91835 -64237 15626 65563 83085 73680 27257 -87595
434 -87595 -63777 -23967 8823 38171 -25547 -5791 -10971 -68100 -4758 -2427 2879 103421
422 103421 99802 -24514 -73919 -96046 -148150 -184407 -127694 -79988 21132 29589 -24697 -26274
410 -26274 29994 59376 116499 31163 -88544 -131299 -82990 -48090 -86917 -24854 -14777 -10847
398 -10847 -14818 -64872 -37065 -39293 -65630 -658 82272 85933 30931 -42462 -64053 -57935 -102042
385 -102042 -147302 -112324 -38210 -43634 41674 51731 34359 10601 20084 22518 7742 -59 -49743
372 -49743 -49316 51066 15572 -20877 57458 46740 60175 -63697 -148516 -124539 -156139 -164700
360 -164700 -169460 -72610 -50212 -47160 16306 56519 3314 -60816 -74360 -109134 -69600 -64735
348 -64735 -135624 -153746 -38985 -7503 402 12177 -40632 -24732 -31739 -38139 15062 -16341
336 -16341 -4579 -30560 3794 46758 90129 9220 -64382 -84657 -93134 -32778 27615 33820
324 33820 29358 27692 80172 87842 14242 -14104 24651 -26207 -92014 -89000 -72011 -39179 -40060
311 -40060 16712 -1648 -1620 -54258 -93506 -141217 -123425 -49652 -47156 13599 71720 139827 41220
298 41220 -4146 -1852 49900 101682 95326 51240 -16648 -61247 -119217 -136956 -60012 -6053
286 -6053 -78931 -76036 -81742 -75356 -84967 -82249 21320 -55 -60747 -18526 -15061 59730 23357
273 23357 -28778 8308 18421 -15141 -23574 -36991 -35951 -14332 1099 -47821 -27048 -34190 -30528
260 -30528 -19534 -51648 -88064 -74116 -82413 -107660 -149920 -145876 -123755 -48981 -55203 -61432 -40676
247 -40676 4415 -11211 -25927 -4998 45674 26539 -21570 10902 14971 -26804 -63416 -84579
235 -84579 -44084 -45895 9832 30242 94716 67163 33403 12094 33514 45414 86711 -27306
223 -27306 -106080 -58838 -21567 -8200 -27198 -36306 -54136 3980 -9905 30301 73566 107916
211 107916 51531 55753 19473 -70041 -84917 -76531 -69988 -104812 -127172 -106526 -116589 -57646
199 -57646 -26761 -25150 -68481 -110154 -118249 -119575 -53981 -70955 -30260 23048 -31582 -72050 10737
186 10737 30126 -13515 -27064 -67783 -65159 -22661 -3383 -31528 -55496 -80901 -124656 -132646
174 -132646 -72726 -112434 -47552 -25719 -22619 -34483 -16296 49482 60684 -18843 4661 17322
$$ [...]
##END NTUPLES=NMR SPECTRUM
##END=
