##TITLE=Analysis number 325360
Compound Code sb 02118
Project Code adrs
Chemist Name namiki
##JCAMPDX= 6.0         $$ Bruker NMR JCAMP-DX V2.0
##DATA TYPE= NMR SPECTRUM
##DATA CLASS= NTUPLES
##ORIGIN= Bruker BioSpin GmbH
##OWNER= nmr
$$ XWIN-NMR		Version 3.5
$$ Thu Jan  4 08:45:57 2007 GMT Standard Time (UT+0h)  MAYBRIDGE\nmr@NMR_250MHZ
##.OBSERVE FREQUENCY= 250.131544655141
##.OBSERVE NUCLEUS= ^1H
##.ACQUISITION MODE= SIMULTANEOUS (DQD)
##.ACQUISITION SCHEME= undefined
##.AVERAGES= 16
##.DIGITISER RES= 18
##SPECTROMETER/DATA SYSTEM= dpx250
##.PULSE SEQUENCE= zg30
##.SOLVENT NAME= TFA
##.SHIFT REFERENCE= (INTERNAL, TFA, 0, 15.5898)
##AUDIT TRAIL= $$ (NUMBER, WHEN, WHO, WHERE, WHAT)
$$ ##TITLE= Audit trail, XWIN-NMR		Version 3.5
$$ ##JCAMPDX= 5.01
$$ ##ORIGIN= Bruker BioSpin GmbH
$$ ##OWNER= nmr
$$ C:\u/data/dgb/nmr/ADRS/290/pdata/1/auditp.txt
$$ ##AUDIT TRAIL=  $$ (NUMBER, WHEN, WHO, WHERE, WHAT)
(   1,<2007-01-04 08:45:35.30 +000>,<MAYBRIDGE\nmr>,<NMR_250MHZ>,
      <created by zg, POWCHK disabled, PULCHK disabled
       configuration hash MD5:
       49 4B E0 1D 92 C2 6B 37 9F E6 65 BC 52 41 86 1D
       data hash MD5: 64K
       D1 84 2D 9B 97 4A 82 9B A5 7C 14 76 B9 A8 7B CA>)
(   2,<2007-01-04 08:45:47.74 +000>,<MAYBRIDGE\nmr>,<NMR_250MHZ>,
      <Start of raw data processing
       ef LB = 0.3 FT_mod = 6 PKNL = 1 SI = 32K 
       data hash MD5: 32K
       FF E1 60 A5 62 C6 31 D0 29 0B 14 5A F4 97 C2 1E>)
(   3,<2007-01-04 08:45:49.39 +000>,<MAYBRIDGE\nmr>,<NMR_250MHZ>,
      <apk 
       data hash MD5: 32K
       A3 D7 2B F7 AF 8A B5 E1 50 06 EB 5D 6F 13 7D 55>)
(   4,<2007-01-04 08:45:50.14 +000>,<MAYBRIDGE\nmr>,<NMR_250MHZ>,
      <abs ABSG = 5 
       data hash MD5: 32K
       5A 5C 4D D2 B5 2C 5B 2B 9F BF 61 C4 87 F9 33 1E>)
$$ ##END=
$$ 
$$ hash MD5
$$ E9 48 11 8B 38 28 93 48 F2 4F 27 0A 52 28 A7 0E
##$RELAX= 
##$RELAX= 
##$RELAX= 
##$RELAX= 
##$RELAX= 
##$RELAX= 
##$RELAX= 
$$ Bruker specific parameters
$$ --------------------------
##$DU= <C:\u>
##$EXPNO= 290
##$NAME= <ADRS>
##$PROCNO= 1
##$TYPE= <nmr>
##$USER= <dgb>
##$AMP= (0..31)
100 100 100 100 100 100 100 100 100 100 100 100 100 100 100 100 100 100 
100 100 100 100 100 100 100 100 100 100 100 100 100 100 
##$AQSEQ= 0
##$AQ_mod= 3
##$AUNM= <au_zg>
##$AUTOPOS= <12 >
##$BF1= 250.13
##$BF2= 250.13
##$BF3= 250.13
##$BF4= 250.13
##$BF5= 500.13
##$BF6= 500.13
##$BF7= 500.13
##$BF8= 500.13
##$BYTORDA= 1
##$CFDGTYP= 0
##$CFRGTYP= 5
##$CHEMSTR= <none>
##$CNST= (0..31)
1 1 145 1 1 1 1 1 1 1 1 1 1 1 1 1 1 1 1 1 1 1 1 1 1 1 1 1 1 1 1 1 
##$CPDPRG= <>
##$CPDPRG1= <>
##$CPDPRG2= <>
##$CPDPRG3= <>
##$CPDPRG4= <mlev>
##$CPDPRG5= <mlev>
##$CPDPRG6= <mlev>
##$CPDPRG7= <mlev>
##$CPDPRG8= <mlev>
##$CPDPRGB= <>
##$CPDPRGT= <>
##$D= (0..31)
0 1 0 0 0 0 0 0 0 0.06 0 0 0 0 0 0 0.0002 0 0 0 0 0 0 0 0 0 0 0 0 0 0 
0 
##$DATE= 1167900334
##$DBL= (0..7)
120 120 120 120 120 120 120 120 
##$DBP= (0..7)
150 150 150 150 150 150 150 150 
##$DBP07= 0
##$DBPNAM0= <>
##$DBPNAM1= <>
##$DBPNAM2= <>
##$DBPNAM3= <>
$$ [...]
##$SUBNAM7= <"">
##$SUBNAM8= <"">
##$SUBNAM9= <"">
##$SW= 20.6930455092707
##$SWIBOX= (0..15)
0 0 3 0 0 0 0 0 0 0 0 0 0 0 0 0 
##$SW_h= 5175.983436853
##$TD= 65536
##$TD0= 1
##$TE= 294.16
##$TE2= 300
##$TE3= 300
##$TEG= 300
##$TL= (0..7)
0 120 120 120 120 120 120 120 
##$TP= (0..7)
150 150 150 150 150 150 150 150 
##$TP07= 0
##$TPNAME0= <>
##$TPNAME1= <>
##$TPNAME2= <>
##$TPNAME3= <>
##$TPNAME4= <>
##$TPNAME5= <>
##$TPNAME6= <>
##$TPNAME7= <>
##$TPOAL= (0..7)
0.5 0.5 0.5 0.5 0.5 0.5 0.5 0.5 
##$TPOFFS= (0..7)
0 0 0 0 0 0 0 0 
##$TUNHIN= 0
##$TUNHOUT= 0
##$TUNXOUT= 0
##$USERA1= <user>
##$USERA2= <user>
##$USERA3= <user>
##$USERA4= <user>
##$USERA5= <user>
##$V9= 5
##$VALIST= <valist>
##$VCLIST= <CCCCCCCCCCCCCCC>
##$VD= 0
##$VDLIST= <DDDDDDDDDDDDDDD>
##$VPLIST= <PPPPPPPPPPPPPPP>
##$VTLIST= <TTTTTTTTTTTTTTT>
##$WBST= 1024
##$WBSW= 4
##$XGAIN= (0..3)
0 0 0 0 
##$XL= 0
##$YL= 0
##$YMAX_a= 404235
##$YMIN_a= -347585
##$ZGOPTNS= <>
##$ZL1= 120
##$ZL2= 120
##$ZL3= 120
##$ZL4= 120
##$ABSF1= 15.58975
##$ABSF2= -5.103403
##$ABSG= 5
##$ABSL= 3
##$ALPHA= 0
##$AQORDER= 0
##$ASSFAC= 0
##$ASSFACI= 0
##$ASSFACX= 0
##$ASSWID= 0
##$AUNMP= <proc_1d>
##$AZFE= 0.1
##$AZFW= 0.1
##$BCFW= 0
##$BC_mod= 0
##$BYTORDP= 0
##$COROFFS= 0
##$CY= 12.5
##$DATMOD= 1
##$DC= 0
##$DFILT= <>
##$DTYPP= 0
##$F1P= 14.0000005364418
##$F2P= -0.99999901652339
##$FCOR= 0.5
##$FTSIZE= 32768
##$FT_mod= 6
##$GAMMA= 0
##$GB= 0
##$INTBC= 1
##$INTSCL= 1
##$ISEN= 128
##$LB= 0.3
##$LEV0= 0
##$LPBIN= 0
##$MAXI= 10000
##$MC2= 0
##$MEAN= 0
##$ME_mod= 0
##$MI= 0
##$NCOEF= 0
##$NC_proc= -3
##$NLEV= 6
##$NOISF1= 0
##$NOISF2= 0
##$NSP= 0
##$NTH_PI= 0
##$NZP= 0
##$OFFSET= 15.58975
##$PC= 1
##$PHC0= 222.7872
##$PHC1= 2.196243
##$PH_mod= 1
##$PKNL= yes
##$PPARMOD= 0
##$PSCAL= 4
##$PSIGN= 0
##$REVERSE= no
##$SF= 250.130233179009
##$SI= 32768
##$SIGF1= 0
##$SIGF2= 0
##$SINO= 400
##$SIOLD= 32768
##$SREGLST= <1H.TFA>
##$SSB= 0
##$STSI= 32768
##$STSR= 0
##$SW_p= 5175.98343685301
##$SYMM= 0
##$S_DEV= 0
##$TDeff= 65536
##$TDoff= 0
##$TI= <Analysis number 999999
Compound Code 99
Book Reference 9
Project Code 9>
##$TILT= no
##$TM1= 0
##$TM2= 0
##$TOPLEV= 0
##$USERP1= <user>
##$USERP2= <user>
##$USERP3= <user>
##$USERP4= <user>
##$USERP5= <user>
##$WDW= 1
##$XDIM= 32768
##$YMAX_p= 337339126
##$YMIN_p= -656102
$$ End of Bruker specific parameters
$$ ---------------------------------
##NTUPLES= NMR SPECTRUM
##VAR_NAME=  FREQUENCY,     SPECTRUM/REAL,   SPECTRUM/IMAG
##SYMBOL=    X,             R,               I
##VAR_TYPE=  INDEPENDENT,   DEPENDENT,       DEPENDENT
##VAR_FORM=  AFFN,          ASDF,            ASDF
##VAR_DIM=   32768,         32768,           32768
##UNITS=     HZ,            ARBITRARY UNITS, ARBITRARY UNITS
##FACTOR=    0.157963299565203, 1,           1
##FIRST=     3899.46787521946, 0,            0
##LAST=      -1276.51556163355, 0,           0
##MIN=       -1276.51556163355, -656102,     0
##MAX=       3899.46787521946, 337339126,    0
$$ Real data points
##PAGE= N=1
##DATA TABLE= (X++(R..R)), XYDATA
$$ [...]
31027D9848O94l3022R424Q007J3724j7655k5566j3359K1045K4693n230l8325k3563
31014b9285P872K4028M649j7878J1354J7156q428p440L516l9826k2780J1426J3001
31001c2635M674J631K6288L0890k3631j1133L0562J2433l5757n7132J3855M0469
30989E14P997K9389O891q027j2229K165R935L40Q831J3213k7257j6263m511M810
30975A5798m707L1326j5564j2659R444j9385k2422J8493J0284R304J429p196J998
30962A6143j4412R753o393q118M6096J6900n839j7861l560j3440o836m05j9427
30949g399J3286j6494J3082J7742o400k2208j1578j2165L3879K021J5454K7236
30937D6456j4887j7421j9426j8843J8651K9l364N499n765r12k1286L4302J4657
$$ y = [49848, 50542, 17520, 26944, 34951, 48675, 31020, 5454, -7905, 13140, 37833, 32603, -5722, -29285, -21413, 2615, 7264, -10614, 740, 17896, 9468, 2028, 5544, -34282, -57062, -45636, -32635, -27961, -26330, -42, 30848, 7217, -3916, 26646, 39079, 3322, -53810, -39955, 514, 8511, 37900, 44791, 36764, 24535, 26700, 36635, 36975, 45806, 59019, 31762, 15499, 10988, 15798, 11091, 42417, 26853, 14194, 23638, 4253, -18169, 324, 10608, 19912, 21341, 14145, 16143, 1731, 11484, 5091, -3027, 43069, 59969, 54130, 36269, 32709, 19269, 12433, 12028, -7399, 5887, -10607, 2475, 20217, 13817, -8391, -19969, -32134, 1745, 3766, 19220, 46456, 31569, 14148, -5278, -24121, -5470, -5441, -8805, -3306, -9071, -9983, -31269, 3033, 17690]
30924A7690j7287K4605j2020N408K2104O269O229j7165k9737k9148L708L328p323
30911b3339q806J831R579q425J5628m379l7465J1974O659p33K4008L3589L2555
30898E2676L4707l1821k0217J8220J6258Q499l1687n1012j6439K2565j5086O803
30886f534L2937j8340k9796o560L988j7813N868K0989L811l465o52l1211J0234
30873c6544L1271J2194K6814j049j6803k4088k4858p07O788q416L7561K5229k3982
30860C410j6081j4889O240R549K2382J9376j7146j8376k0j8738k0200j3747M5388
30847a2852J7414p22k1933K098N012J9042J0786j4414K644M844J0685O485o542
30834B2547k1833J3024j6068r606j0890Q656L5351k2173o9110L0074J4778l530
$$ y = [17690, 403, 25008, 12988, 18396, 40500, 46769, 52998, 35833, 6096, -23052, -19344, -16016, -23339, -32145, -30314, -20735, -29160, -13532, -17911, -55376, -43402, -36743, -37476, -13468, 20121, 52676, 87383, 55562, 35345, 53565, 69823, 78322, 46635, -4377, -20816, 1749, -13337, -6534, 26403, 8063, -21733, -28293, -24305, -42118, -36250, -15261, -11450, -14915, -15567, -46778, -36544, -5273, 6921, 33735, 32686, 15883, -8205, -33063, -33770, -26982, -35398, 2163, 27392, 3410, -12671, -27560, -21320, -11771, 10611, 29987, 12841, -5535, -5555, -24293, -44493, -58240, -12852, 4562, 3840, -18093, -15995, -10983, 8059, 18845, 4431, 7075, 11919, 22604, 29089, 22547, 714, 13738, -2330, -11936, -22826, -14170, 21181, -992, -70102, -40028, -25250, -28780]
30822b8780j5931n097j4577L5483K7756K3806N377k6417j4375J9391L1567q448
30810B9755j9004j0531k0260l282R5K1942K5991l961k8328j8941n562J3973J1450
30797f663p646L0433J6758J3312j1090j8377j8492j3994j6968K537M259J3281
30785a2650L1995L847J1178J8057P156J62k6051j2143J4524J0728R178k0469n6717
30772b1205k9045K9588K9064o412p352j8333k6854j7711J3874K2164K8674J6893
30760A3345l0698l9038n411K2282J2140O00L7852p879J502K5758Q21J2897m412
30747C9759l5990j6878j628N450L4094J2585K614l943l3395l1N066N78Q706j6922
30733F5k2967k6389Q54L226L4879J2202l543j9802M319N4724J7214K890L338l5388
$$ y = [-28780, -44711, -49808, -64385, -28902, -1146, 22660, 28037, 1620, -12755, 6636, 38203, 29755, 10751, 220, -20040, -23322, -23227, -1285, 24706, 20745, -7583, -26524, -32086, -18113, -6663, -14309, 16124, 32882, 46194, 35104, 16727, -1765, -15759, -32727, -30190, -25931, -12650, 19345, 23192, 34370, 52427, 59583, 59745, 33694, 21551, 36075, 46803, 55981, 35512, -21205, -50250, -20662, 8402, 1990, -5362, -23695, -50549, -68260, -54386, -32222, -3548, 13345, -17353, -56391, -61802, -39520, -27380, -26780, 11072, 3193, 4695, 30453, 31274, 44171, 39759, 3769, -13109, -14737, -9287, 24807, 37392, 40006, 36063, 2668, 2637, 7703, 8281, 16987, 65, -22902, -49291, -48437, -45211, -10332, 1870, -1673, -21475, -17156, 37568, 54782, 57672, 61010, 25622]
30719B5622k8890k804K4974r501K4944K6457r631k7145r595j525n101L634k4855
30706a3416j7224o560k194N89R913Q366K617k050m434L223L2527R371P728j8860
30692I596j283o928Q851L5575k450o327K227O165P405j240j3413k2059J8814L249
30678C8182j8641P445J3328k8373j6432n599p016J1533Q778N926j0985j5624m0954
30665e8432r901N721J3049l232K629p96j2604J6775K0241K123n1929k152J7893
30652f0615K8000J2224K2870J1190J1436j1470k6772J1766K9766J2960k2628l0575
30640a1848n973J9113k2441k5736K2908J4575k392k1861k0565j0551M891J2733
30628d7147O035j2601k3646j0478J4857J8507J6751Q350L2739L2390J1672j663
$$ y = [25622, -3268, -6072, 18902, 9401, 34345, 60802, 51171, 24026, 14431, 12906, 7805, 11439, -13416, -30640, -37200, -39394, -38805, -28892, -20526, -17909, -19959, -24393, -21170, 11357, 20728, 28456, 9596, 8313, 1385, 10236, 45811, 43361, 37034, 39261, 45426, 52831, 51591, 38178, 16119, 34933, 38182, 19541, 26986, 40314, 11941, -4491, -10090, -17106, -5573, 3205, 9131, -1854, -17478, -58432, -68333, -62612, -49563, -52795, -50166, -50962, -63566, -46791, -26550, -24427, -76356, -78508, -60615, -32615, -20391, 2479, 13669, 25105, 13635, -13137, -1371, 28395, 41355, 18727, -11848, -17821, 1292, -21149, -46885, -23977, -9402, -11794, -33655, -54220, -64771, -59880, -47147, -41112, -53713, -77359, -87837, -72980, -54473, -37722, -29372, 3367, 35757, 47429, 45766]
30616D5766K396l4114m487o637J5492k9419j3280j4024K8851J2045R23j7213j530
30603a5231R331J7974L513j1856j3054j852J0767J1767P864j6742L076J387N576
30590A2520j1967J224j4852j0056L70L5512J9899k6402k1128n769j8990l5886
30578g5525J4916L8855k1939k2273j4865J0292O7026M4932j0201j0706p895j2263
30566C54R490K9826N44j5103l5234J6258Q8j5312j1402J1056J8732k5391o864
30553b2958J2435M2158J8602j0350m3490o0839K6486M0851L1031K3539l3214l5968
30541a1717j3342K0946K4055K7024j5476n2204j6932K1326J2059j5339J5983J8892
30529A5275J290l0032Q906M389j5438R825J3679j0894j0760P479o545k0527o690
$$ y = [45766, 48162, 14048, 9561, 2924, 18416, -11003, -24283, -38307, -9456, 2589, 3512, -13701, -15231, -5900, 12074, 15587, 3731, -9323, -11175, -408, 11359, 19223, 2481, 5557, 6944, 12520, 553, 1777, -13075, -23131, -22761, 12751, 32650, 6248, -14880, -20649, -39639, -75525, -60609, -21754, -43693, -65966, -80831, -70539, -3513, 41419, 31218, 20512, 12617, 354, 9844, 39670, 40214, 25111, -10123, 6135, 6223, -9089, -20491, -9435, 9297, -16094, -22958, -10523, 31635, 50237, 39887, -3603, -64442, -37956, 2895, 33926, 57465, 24251, -11717, -25059, -4113, 19942, 46966, 31490, -20714, -37646, -16320, -4261, -19600, -3617, 15275, 16565, -13467, -4561, -172, -15610, -5785, 7894, -3000, -13760, -6281, -12826, -33353, -40043]
30516d0043o92l542L0574J7265l479J8801J0448j1771q325k9332o201R692K4967
30503H362O687J77J972n00k824j6433n947K6050J1507P18j7293p977N829p505
30489B823j0984K3492k2351m982J3854K0421J5288l997l706j0144k9503l6098
30477d5887R465L7291J9552l405k6194j1798M001j4151M9979L3261j175Q98O571
30464E8408l400k3315k5432n425k8176q55j517j2221L7896N8211n548k2339k4831
30451A456q912P3l6152k9940P061J9445L0583k2714J123j833m26P471K4035J4520
30437E790J2697j9116l3536J611K6081J2687J1521j0088j5465j8537k437M456
30425b4336R285j9708K2394R816J0780L3018J4045l6371l3026N155J0015K4693
$$ y = [-40043, -40735, -44277, -13703, 3562, 83, 18884, 29332, 17561, 9236, -20096, -26297, -16605, 8362, 15049, 15226, 17198, 16698, 13874, -2559, -8506, 17544, 29051, 29769, 12476, 4499, 10328, 2823, -8161, 15331, -7020, -12002, 1852, 22273, 37561, 33564, 29858, 19714, -9789, -45887, -36422, 869, 20421, 17016, -9178, -20976, -16975, -31126, 18853, 52114, 50939, 51837, 58408, 55008, 31693, 6261, 836, -27340, -28195, -29712, -41933, -4037, 54174, 48626, 26287, 1456, -7456, -7383, -43535, -73475, -66414, -46969, -16386, -39100, -37977, -39810, -40236, -32765, -8730, 5790, 18487, -629, -34165, -32554, -6473, 6214, 17735, 7647, -7818, -26355, -28792, -24336, -15051, -34759, -12365, -2549, 8231, 41249, 55294, 18923, -14103, -8948, 1067, 25760]
30413B5760o634k6993k9657R890j095j9983m023L6473L4610L924k2052l5545K2697
30400a2628J2792j654m718J2947J1382j6968J3246J1830r44q795k3076k5782N464
30387b6904L9171J5716l428n775q418Q164J1363n900j3787j3794M292k1916q140
30374b9356J2670K917J4936J0227m163J2199j3729P901L1687j733o0875k1413
30362c8732K3353J2273J9841k3411o289J4344J3373k233j2624O436l2957k2721
30350d9347P328n159K2501n313j074q087k796J7943J4389n537j3401J4956K0152
30337F555J9463L8949q346r748L619R69l1730l0792J652J8122K6885R028k9135
30324A5491J3586j2114l0474j908J5890m907k309j229K3556r485j4066j1417K7806
$$ y = [25760, 19126, -7867, -37524, -27634, -28729, -48712, -52735, -16262, 18348, 22272, 220, -35325, -12628, 164, -1490, -6208, 6739, 18121, 1153, 14399, 26229, 25285, 16490, -6586, -32368, -26904, 12267, 27983, 24555, 18780, 10362, 18526, 29889, 23989, 10202, -3592, 700, -21216, -29356, -16686, -13769, 1167, 11394, 7231, 19430, 5701, 13602, 45289, 43556, -17319, -38732, -15379, -3106, 16735, -6676, -12965, 1379, 14752, 12519, -105, 6331, -26626, -49347, -42019, -47178, -24677, -29990, -31064, -39151, -41947, -24004, -9615, -15152, -28553, -13597, 6555, 26018, 64967, 56621, 46873, 50492, 51461, 19731, -11061, -9409, 8713, 35598, 44626, 15491, 29077, 16963, -13511, -15419, 471, -4436, -6745, -7974, 15582, 6097, -7969, -19386, 8420]
30311H420L2805j978N694p592l0846j7036M646p004k5943q831L6277L9678j2307
30298A5983J192l45j6585J3944O198K009L433k4748j0102M4089L1417k0869k9064
30285A6552j5218k4711P077j0944J8526m447p96J6603K0581Q181N513J5494p058
30272D5353l4742j239J0218J0656J3080N126k6508j2221K1923K2492l4487q397
30260A1254j6230l1435J3091J0646J6477J840j7052j552j2910N82J6134k0936
30248c0091j8541J2717K0434K1768L948k0429k3803J6433L6135K9324j1841j3878
30236B2176j4499j2157K849l867j9867J5136M467n348J5589L2687Q571k3966R229
30223C1000P985k8042l418J3040j6084k9061j5989p003k9961J0235J5990O251
$$ y = [8420, 41225, 39247, 44941, 37349, 6503, -10533, -5887, -12891, -38834, -47665, -11388, 28290, 15983, 17175, 16830, 245, 14189, 20387, 22396, 25829, 1081, -9021, 35068, 66485, 45616, 16552, 1334, -23377, -16300, -27244, -8718, -13165, -13961, 2642, 23223, 31404, 36917, 52411, 45353, 10611, 9372, 19590, 30246, 43326, 48452, 21944, 9723, 31646, 54138, 19651, 11254, -4976, -36411, -23320, -12674, 3803, 5643, -11409, -12961, -25871, -25289, -9155, -30091, -48632, -35915, -15481, 6287, 10235, -10194, -33997, -17564, 18571, 47895, 36054, 22176, 7677, -4480, -1631, -5498, -25365, -10229, -5762, -11110, 4479, 37166, 45737, 21771, 31000, 38985, 10943, 7525, 20565, 4481, -24580, -40569, -47572, -77533, -67298, -51308, -45057]
30211d5057Q661R340K312j3943M280j7141o235L1613L1947L5878J5221k3474R125
30198D2527L582k0030k2378L768k1576K582P122J0910k3152j6603J283J9905L0796
30185A8736k1637j4708J4427J4061L410m589j2122o765J8568J2006J276o808j6507
30172f52k807J5162J6755O958j128K0819m994J2049O933k3302j7926K9528j5970
30159D1425m2734j005j2609k6977R686k118k4667J5428J8074L290K2481M197m098
30146C73K3153L0886j1015l8411k5150o521L28Q54L2030j4144k9378k0803j593
30133e9391J249L7428K8039l3286n256L363N431P025L51K2336K2867k8138l6847
30120c4829J7873J3295O382r056Q551J4123l6206l4565k1779J2571M5985J9180
$$ y = [-45057, -36396, -27056, -24744, -38687, -34407, -51548, -57783, -26170, 5777, 41655, 56876, 33402, 42527, 46109, 26079, 3701, 7469, -14107, -11525, -4403, 6507, -16645, -33248, -31965, -12060, 18736, -2901, -17609, -3182, 10879, 14289, 9700, -2422, -9187, 9381, 21387, 22663, 15855, -652, -3459, 11703, 28458, 35416, 34288, 55107, 50113, 62162, 69095, 45793, 27867, 57395, 41425, -1309, -2314, -14923, -41900, -32214, -34332, -58999, -43571, -25497, -22207, 274, 4471, 373, 23526, 54412, 43397, 4986, -20164, -26685, -26357, -25503, 6527, -7617, -36995, -57798, -59391, -58142, -20714, 7325, -25961, -31217, -27854, -22423, -15398, -15047, 7289, 30156, 2018, -34829, -16956, -3661, 2721, -6335, 2216, 16339, -19867, -54432, -76211, -63640, -17655, 1525]
30108A525K2534J7590J4129j5926j2545k8805j0816J6804J8522N039p448k0097
30096E06K8162K0799k1470l4824q613q902j2322K1822L0538L102j7103J0829M359
30083A6883m965j3525k2282L309J0858O205K2501k976l1722L2633J8487L3214
30071F8620n030k2520M99m291l8736j3301K7382L3105q452m3411j2289P219j0300
30058b1505k8704L685M6699J1249p639j244J131L832p850k177J1460J1650J6546
30045C7133j1740l5044k1785J1784J0831J9410N185k6149m5993j1566J9076K8393
30033b0465m019J7247N0316j8015j8513p039j6351K1188j9920k6213j6828L511
30021e5101J2009Q642l688L1388J3460j6323q819j2806j0167p631J1809K2779
$$ y = [1525, 24059, 41649, 55778, 39852, 27307, -1498, -12314, 4490, 23012, 28051, 20603, 506, 28668, 49467, 27997, -6827, -15440, -24342, -36664, -14842, 15696, 18798, 1695, 12524, 16883, 11918, -1607, -23889, -20580, -9722, -3517, 18984, 16008, -15714, 16919, 35406, 68620, 63590, 41070, 41569, 37278, -1458, -14759, 12623, 45728, 37276, -6135, -18424, -11205, -21505, -50209, -46524, 175, 11424, 3785, 2541, 3672, 7504, -346, -2523, 8937, 20587, 37133, 25393, -9651, -31436, -19652, -8821, 10589, 15774, -10375, -56368, -67934, -48858, -20465, -24484, -7237, 43079, 25064, 6551, -488, -16839, 4349, -15571, -41784, -58612, -55101, -43092, -34450, -38138, -6750, 6710, -9613, -18432, -31238, -41405, -49036, -37227, -14448]
30009a4448j131J8238Q845l4502j3200k3136L937J796J5735J661k0325L1139M8510
29996B3119J3027o330j0086l6480k6370N048J3795j5056n680j8888q555J925L6252
29983c4279J6323R413J0490m845J1607q336k6031k4328p911K6131J8087K9616
29971A5937M4317j9132j2307j2468j8067j5588N600J8636j4535m4515J1811L1423
29959h888n857l9129R433J4512Q55j3867j8888R027L564L0775J7231j4360m3132
29946e8724j4230M2664o460o144l12L7772Q783j1868Q269J9117p117j9989K3084
29933A4845J2915p127J3721j9427j9273q627o233N920K4487J744k0397j0199K7443
29920I792m516K0905J3478R422n7957j7411Q467K888K0993J5171k5410l2742j7004
$$ y = [-14448, -15579, 2659, 11504, -22998, -36198, -59334, -55397, -53601, -37866, -36205, -56530, -25391, 23119, 36146, 29816, 19730, -16750, -43120, -38072, -24277, -39333, -45013, -63901, -72456, -70531, -34279, -17956, -8543, 1947, -2898, 8709, 373, -25658, -49986, -57897, -31766, -13679, 15937, 60254, 41122, 28815, 16347, -1720, -17308, -11708, 6928, -7607, -52122, -40311, -8888, -14745, -53874, -44441, -29929, -29074, -42941, -61829, -52802, -49238, -18463, -1232, -15592, -58724, -72954, -30290, -36750, -42894, -43206, -5434, 3349, -8519, -250, 18867, 11750, -8239, 14845, 27760, 20633, 34354, 14927, -4346, -12973, -19206, -13286, 11201, 12945, -7452, -17651, 9792, 5276, 26181, 39659, 49081, -8876, -26287, -17820, -14932, 6061, 21232, -4178, -36920, -53924]
29907e3924Q297K0565L2811K3157J542j3580j1497O612P110m51k6723R282N006
29894H207k774p007M998j9153j1503L714J4346P767p49Q925m541j809J7364m182
29880A3603j16K24j4785M203O607J2555l257l300r944J5468m021j4408j7340J1814
29866b697M526J2629R203O564M069L929q945m4857l8412j5256o357J9009L3111
29853b3484M3377K6575J415k9994j8996k2826j3915K0950J1771o16p379k0538
29841c3660O882M714J3851K1181R923K477j3448K0291p394k8926l6744P817J2836
29828b0200Q316m2854O73j3200k7725O266L3250M172J4461L5428J0503P038K2272
29815C8400P342o568j7417k1845R346o239R783P595j1218K1325j5469k5809j0303
$$ y = [-53924, -45627, -25062, 7749, 30906, 32448, 18868, 7371, 13983, 21093, 20642, -6081, 3201, 8207, 5433, -1574, 3424, -15729, -27232, -23518, -9172, -1405, -2154, 6771, 2230, 421, 17785, 13603, 13487, 13711, -1074, 3129, 9736, 22291, 19034, 15734, 5790, 21258, 17237, 2829, -14511, -2697, 1829, 14458, 23661, 30225, 34294, 38223, 29278, -15579, -53991, -69247, -75604, -56595, -23484, 19893, 46468, 47883, 17889, -1107, -23933, -37848, -16898, -5127, -5743, -13122, -33660, -26778, -22064, -8213, 12968, 22891, 25368, 11920, 32211, 24817, -4109, -40853, -33036, -20200, -11884, -54738, -54065, -67265, -94990, -88724, -55474, -51302, -36841, -1413, 9090, 16128, 38400, 45742, 39174, 21757, -88, 9258, 3019, 12802, 20397, 9179, 30504, 15035, -10774, -21077]
29802b1077Q932q168P09q432m560L8127J6379n393j4631j8078k8584J6445l086
29789c1417m208k3040P309J8556J0024j6449O25M43K746J0024M792J0409K553
29776g633K2784N312O302P019J417p530l2512n802j5365J5J3490K3478k1028r595
29762a9648O976L7099k3850k2056L5160N408Q147j8436P87L0390R72l9033k6626
29749b4710Q041M182k148M734Q836j230k218K364K9419m159l3232m880K3581K084
29735A0664k8798k9194M239J0500r908L8728J414J4967j4090Q152j0255j9128
29723b2709k7933J011M106K0265p252J6836p243J6383M9673j1016j4845m391R281
29710B2166J7270j3422l7106j0553j8991J5602L1170r774r861j1711k020J6864
$$ y = [-21077, -12145, -20313, -19604, -28036, -32596, 5531, 21910, 16517, 1886, -16192, -44776, -28331, -31417, -35625, -58665, -51356, -32800, -22776, -39225, -38600, -38157, -35411, -25387, -20595, -10186, -7633, 15151, 20463, 26765, 33784, 35201, 27671, -4841, -10643, -26008, -25993, -12503, 10975, -10053, -19648, -12672, 24427, 577, -21479, 13681, 19089, 27236, 8800, 9587, 39977, 40949, 1916, -24710, -16669, -12487, -14635, -9901, -1065, -2295, -4513, -2149, 27270, 23111, -10121, -15001, 8580, 10664, -18134, -47328, -43089, -32589, -42497, -3769, -2355, 12612, -1478, 6674, -3581, -22709, -50642, -49631, -45525, -25260, -32512, -15676, -22919, -6536, 43137, 32121, 17276, 12885, 22166, 39436, 26014, -11092, -21645, -40636, -25034, 6136, -3638, -13499, -25210, -27230, -10366]
29698a0366Q266N96k6395j1548J8697L5829K2022j685n419k8429k2673j1405j7060
29685d9570J0147M1763K4179j4557j0168K6730n921m8584l0026J371L7977J7472
29673H13j6549j2002m673J4759q040J0335J6509o501j9581N076L2129L8811P720
29660E8806o861j7299j6488J196J493K33q404j6372j2178K7102J462j861k485
29647H344J1630J2498L795K290Q79j5984n124k0516J1133J3948j451j4074j6861
29634i493N463j4202K011R973j7561j0772Q795R816j8505m796j599J1452J488
29621b7930j8466J4765K3020K204R586n183Q707k3149k1437K9021J3100R073L0521
29608D3832P851j2330J0163J1958l9874k0073l886j4591j6628L36K5034Q73J0634
$$ y = [-10366, -2100, -1504, -27899, -39447, -20750, 15079, 37101, 35416, 29997, 1568, -21105, -32510, -49570, -39423, 2340, 26519, 11962, 1794, 28524, 22603, -25981, -56007, -54636, -16659, 813, -15736, -27738, -32411, -17652, -25692, -15357, 1152, -5349, -24930, -19854, 12275, 51086, 58806, 51945, 34646, 18158, 19354, 20847, 21080, 12676, -3696, -15874, 11228, 12690, 10829, 8344, 19974, 32472, 36267, 38557, 39436, 23452, 18328, -2188, 8945, 22893, 21442, 7368, -9493, -4030, -18232, -16221, -6248, -23809, -34581, -25786, -15970, -34475, -39271, -40870, -29418, -27930, -46396, -31631, -8611, -6407, 3179, -2004, 6703, -16446, -37883, -8862, 4238, 13311, 43832, 51683, 39353, 49516, 61474, 21600, 1527, -2359, -16950, -33578, -33242, -8208, -7335, 3299]
29595C299k057o960N894O085m288R755P23k1004m915N159k9169j3271M004K0046
29581b6699M136Q88M864k9057j4829n045J5756q395L8596J8011j0209k4063l732
29568c9778L6839l782m790j0839l137L596j478J6576Q503K7434j0985l5967r2
29555a7900j603n435K484P747l6566j5418K0595L767n371p636J588P038K170o895
29541e1435j3463L4095L7776K8745J0186O378k194j4601l0435j1669o784M801
29529h600K6216J2247k0837j3958Q335R819j8353n594j4426K5654K0177j3899
29517F781k0929J6194J5686j4329j5206J515j9346J1125K3757k094J742J3327
29505A8223k2187n076L036K235R067m954j5666P632J1938L0725J488l7093J2639
$$ y = [3299, 1242, -5718, 176, 6261, 1973, 11728, 12451, -8553, -13468, -8309, -37478, -50749, -46745, -26699, -22563, -21675, -16811, -45868, -60697, -65742, -49986, -58381, -19785, -1774, -11983, -36046, -39778, -2939, -6721, -11511, -22350, -25487, -21891, -23369, -6793, 1710, 29144, 18159, -17808, -17900, -19503, -24938, -22454, -14707, -51273, -66691, -46096, -42329, -47700, -55336, -53748, -46710, -44540, -51435, -64898, -30803, 6973, 35718, 45904, 52282, 50088, 35487, 5052, -6617, -13401, -8600, 17616, 29863, 9026, -4932, 3403, 13222, -5131, -10725, -25151, 503, 20680, 6781, -14148, 2046, 17732, 3403, -11803, -10288, -29634, -18509, 5248, 3154, 4896, 18223, -3964, -9040, -6004, -3769, 5298, 344, -15322, -7690, 4248, 34973, 36461, -632, 12007]
29492A2007j083l244r006J2758K33M503l1914Q311M4567m989k0764K3022M334
29479C8735Q608l898r583o964j1644K2957J5376L2587J947k5419k4340k7407j4967
29466d012o883k7122J8078P515J4396p336N807k0898j1101l509L0144l267n83
29453h771K5174L036m3786k7091K8851n723j8962M954K7936J8973q819J141j6865
29440a9952m718m158j9790O132K9679P719J1430p273k0248J8972K897j7134j9533
29427c5977r658K4650J6792k339j0312q111j2055k2067O938L1418O582k335o884
29414b3358J3704k2168p869n377k07K0600K5809j2049r073O925R817N0101K6810
29401G3665k1620l7639r692k5246m17M7492L6952Q564k1694R134q704m681k1568
$$ y = [12007, 10924, 7680, -1326, 11432, 11665, 16168, -15746, -7435, 37132, 32143, 11379, 34401, 38735, 47343, 43445, 33862, 26898, 15254, 38211, 53587, 86174, 88121, 62702, 38362, 10955, -4012, -10895, -38017, -19939, -12424, 1972, -5364, 443, -20455, -31556, -35065, -4921, -8188, -8771, 16403, 19439, -24347, -51438, -22587, -28310, -47272, -42318, -14382, 4591, -4228, -3087, -19952, -24670, -28828, -48618, -42486, -12807, -5088, 6342, -931, -21179, -2207, 690, -16444, -35977, -45635, -20985, -4193, -6532, -16844, -24955, -37010, -59077, -52139, -20721, -14139, -16474, -23358, -9654, -31822, -39691, -45068, -45275, -24675, 1134, -10915, -19988, -13063, -3246, 46855, 73665, 52045, 14406, 4714, -20532, -20949, 26543, 63495, 72059, 50365, 59499, 50795, 46114, 24546]
29388B4546k518j591n407J3083k0072j6284Q581p054j0823J5938k3715J22j8212
29375d3406J735j1305K885J2917N694R515J993k9095j0097L0371N002J9821M315
29362C45J018o875Q107N850J6494K156J0660o182j0141j9034j061P202m44l3294
29348b5199m8536J1396L2130R280K4310J4267j3613J4998l4880l4557P206J3906
29336b9292K843p773k864k4943j0803j6243Q250M0628J0268m531r56O973O525
29323b1918K0066Q799J8505l612l5934P48M3802J1793q41l8113j7893j4512M637
29310b4473L0541m866P837j9684L6726J921k3302q672j7185j4818j3399k71M795
29297d4850K6628K3896K0765m363l2218J5022p365L027j877p143l637r133j6063
$$ y = [24546, 22028, 20437, 15030, 28113, 8041, -8243, 338, -6716, -17539, -1601, -25316, -25194, -43406, -41671, -52976, -50091, -37174, -31480, -21965, -19972, -49067, -59164, -28793, -23791, -3970, 345, 1363, -5512, 2595, 8445, 24939, 27095, 37755, 31573, 21432, 2398, 1337, 8539, 8095, -25199, -73735, -62339, -30209, -20929, 3381, 17648, 4035, 19033, -15847, -50404, -43198, -29292, -26449, -34222, -37086, -62029, -72832, -89075, -80825, -40197, -29929, -34460, -35416, -28443, -21918, -1852, 6947, 25452, 21840, -14094, -13346, 30456, 42249, 41408, 3295, -14598, -29110, -24473, 6068, 1202, 9039, -10645, 26081, 28002, 4700, -3972, -21157, -35975, -49374, -49645, -44850, -18222, 5674, 26439, 22076, -10142, 4880, -2485, 542, -1335, -8478, -12115, -21248, -37311]
29284c7311R657K3952J7329k199J2175P191J15p137k0840j0808J1094o75J951
29271D494r53J909k8856J9330K4285K1060o424l5574m0327O590J7499k204J7581
29258a590j1558j2929L451k4891l3754j1743J9992M2052Q428J4052J0538j9856
29246a7808Q172p385Q436K8069J2382k1662r437J2093p704j3850m684O220J6125
29233H967j697k7931M2334K2422k926j7508j6192p506j683J6511J4093n237k5588
29220a941K4246K8353j8229q095Q403j9905o558R658N387j2553j9495J8231O834
29207A4336P21M576m968J64J6345k6162p731J327n264J9995j1349j6401j0031
29194b4442j9404J1960J3023k0868J0006m213N608L517k299J1903j7877K598k125
$$ y = [-37311, -27654, -3702, 13627, 11428, 23603, 30794, 30909, 23772, 2932, -7876, 3218, 2543, 4494, 3541, 5450, -23406, -4076, 20209, 41269, 34845, -729, -41056, -34466, -16967, -19171, -1590, -13148, -26077, -22626, -47517, -81271, -93014, -73022, -30970, -22542, -8490, 2048, -17808, -9636, -17021, -8585, 19484, 31866, 10204, 767, 12860, 5156, -8694, -13378, -7158, 8967, 7270, -20661, 21673, 44095, 41169, 23661, 7469, -37, -1720, 14791, 28884, 23647, -1941, 22305, 50658, 32429, 24334, 32737, 12832, 6274, 15932, 21319, 8766, -10729, 7502, 14336, 15057, 19633, 14665, 14829, 31174, 5012, -2719, -1392, -6656, 13339, 1990, -14411, -24442, -43846, -31886, -18863, -39731, -29725, -33938, -28330, -24813, -27112, -15209, -33086, -30488, -32613]
29181c2613L6609M8110j3633l3220k5260k5167j2135K9073K0039r378J5529L106
29169A060m1976j8372M2408J0122j2042J6236j4892J2712m59r197p164m497j0577
29156c6638j160n152j2229j0640J5470l173J7499j5747j5649K968M0210K3747
29144d94n46p412L670j9169k1722l1637R108K9726K4455M3831J4509J221l3675
29131A1865j0954J1170m3311P392L221N912J6448r793l492N971N537j969j6350
29118a8353O963k7667l2933L4926N7358q94k2980j1949K4658J6045k5184j2610
29106a2620k2105j3458K503j2928K5833K7511J7327n413L146k0433j5930K1974
29094d593L0980j8556k1583k501K3295K7305l5455j3552m438l601J4505J1245
$$ y = [-32613, 3996, 52106, 38473, 5253, -20007, -45174, -57309, -28236, -8197, -17575, -2046, 1060, -40916, -59288, -16880, -6758, -18800, -2564, -17456, -4744, -5203, -14400, -21564, -26061, -36638, -37798, -42950, -55179, -65819, -50349, -53522, -36023, -51770, -67419, -64451, -24241, -494, -1040, -8452, -4782, -23951, -45673, -77310, -68202, -38476, -14021, 29810, 44319, 45540, 11865, 911, 12081, -31230, -23838, -20617, -14705, 1743, -8050, -11542, -5571, -34, -2003, -18353, -11390, -39057, -71990, -37064, 20294, 19400, -3580, -15529, 9129, 25174, -10, -12620, -34725, -48183, -45680, -58608, -32775, -5264, 12063, 6650, 9796, -10637, -26567, -4593, 26387, 7831, -13752, -16253, 7042, 34347, -1108, -14660, -19098, -22699, -8194, 3051]
29082C051J1519m897q570Q135Q89l7550l2209L456L2445Q979J4208k6781o833
29069c4158j4855R165J2958J0744J4909J5757Q48J775k970J3752J8929L2745l2767
29056D6832k5096L463L831k5544j0738J0836k5904k658K7211r043j4279Q901K6879
29043A4691M554P999o832j5602j493j5389k9374K5880n418k5847J4789L3663K1835
29030B3456l4820n503L003N836k988J1022k0669r612j4810j3260J5382J4456j1418
29017c9925J8295M9489k131j3285J4173l3266m7244o842N736k4210j8242L2884
29005f4568N52K7204J1507J87R609J9962J0159N81l98K4283J780J108j3289k7459
28991A218k6886l7734j797L3049J4064r654L726L7751J4929j5353j6037k9176
$$ y = [3051, 14570, 9673, 1103, 9238, 10127, -27423, -59632, -56176, -23731, -14752, -544, -27325, -34158, -49013, -39848, -26890, -16146, -1237, 14520, 15368, 17143, 14173, 27925, 46854, 79599, 46832, 21736, 25199, 29030, 3486, -7252, 3584, -22320, -24978, 2233, -6810, -21089, -12188, 14691, 19245, 27244, 20412, 4810, 3317, -12072, -41446, -15566, -20984, -46831, -32042, 1621, 23456, -11364, -16867, -13864, -8028, -11016, 6, -20663, -30275, -45085, -58345, -42963, -28507, -39925, -21630, 27859, 25728, 12443, 26616, -6650, -53894, -60736, -55000, -79210, -97452, -64568, -64016, -36812, -25305, -25118, -15509, 4453, 14612, 15193, 14795, 39078, 40858, 41966, 28677, 1218, -25668, -63402, -65199, -32150, -18086, -27740, -24014, 13737, 28666, 13313, -2724, -31900]
28979c1900j7969r69L6009L9496j3372k843j3341N023K9088L9145M902l2001l5565
28966E703m7103j772J2526K5849K6605k5372n991n512J1888J9989L0350p382m9589
28953i811r398l3965l430J3078J7321k463k3332L1981L0347k1572j5096J6084
28941a0256J0091J2779m4110j578J290m209L7135J8625O750j7977j8930q141k0194
28928c8725k8629J3124J5913n788j295q687j0129p499L1790J5022J3414N2521
28916D1032K0489k7979K4233p014k5935l5732m6170K6546J7446k09N635J430J1117
28903D889J8505J0589l1414p540j2797j3669J3652L8765L7024k9960n3195K2367
28891b784j0096l0063J9324J2930j0712K572L8690J9538o200j1063j1492O758
$$ y = [-31900, -49869, -50838, -14829, 24667, 11295, 8452, -4889, 134, 29222, 68367, 73269, 41268, 5703, -41400, -43172, -30646, -4797, 21808, -3564, -9555, -15067, -3179, 16810, 47160, 39778, -9811, -19209, -53174, -56604, -43526, -26205, -28668, -52000, -20019, 10328, -11244, -26340, -10256, -165, 12614, -31496, -33074, -31784, -35993, 1142, 19767, 26517, 8540, -10390, -18531, -38725, -67354, -54230, -38317, -44105, -45400, -54087, -64216, -71715, -39925, -24903, -11489, 41032, 61521, 33542, 57775, 50761, 24826, -10906, -57076, -30530, -13084, -13293, -7658, -6228, 4889, 23394, 33983, 2569, -4971, -17768, -31437, -17785, 20980, 58004, 28044, -25151, -2784, -12880, -42943, -23619, -10689, -21401, -18829, 19861, 39399, 33199, 22136, 10644, 17402]
28879A7402m703O173p226j8017q630l3484O442K3249K0271R185m1679L944J3428
28866a3645j1591L053M115M8569J00j5781K3554M852o3003l7751K7804K6965L372
28853F13m66K0852j4300l0276m769J4588q854k348j4995j8008J1421J1817j8006
28840e2731q510K6621M2814j0827j5065j5719L6307K7369K9740j2036j7940k0988
28828I035l173j2878r537K4662n956j1124m767J350J5819J399k0176M009K6671
28815A5334p672k528k069l1714l088J1773J952j2346l696P537J8545p032j566
28802a6570l5777k7799J3602O4347J6411l7307R959m788j0836K7669j3045j2368
28790b6502n228N254P332r485r993l361p911r486j949K4596r467l01O799J9569
$$ y = [17402, 12699, 18872, 11646, -6371, -15001, -48485, -42043, -18794, 1477, 10662, -31017, -27073, -13645, -25236, -22183, -18068, 30501, 30601, 14820, 38374, 43226, -19777, -57528, -29724, -2759, 613, 147, 20999, 6699, -23577, -28346, -13758, -22612, -24960, -39955, -57963, -46542, -34725, -52731, -61241, -34620, 8194, -2633, -17698, -33417, 2890, 30259, 59999, 47963, 30023, 9035, 5862, -7016, -16553, 8109, 2153, -8971, -13738, -12388, 3431, 4830, -15346, -11337, 15334, 7662, 5134, 3065, -28649, -31737, -19964, -18012, -30358, -34054, -26517, -7972, -15004, -16570, -52347, -80146, -66544, -2197, 14214, -23093, -13134, -17922, -28758, -1089, -14134, -26502, -31730, -26476, -19144, -28629, -38622, -41983, -49894, -59380, -61329, -36733, -46200, -46501, -39702, -20133]
28776b0133J136j669j860K1919L3988O307o358k8550J1492N056k5968n78p790
28763a3008k4207l78J0749J2659j2069R16L986j4496j0207j0215L265l721k3153
28750g9879K8332k643R970M0259m620m64l0019k8555M0902J2216J3938N266p386
28737b683R432m384J0437k1699k8653N447J3390K7903L481P227J8353k8328m3480
28724c3557j0849K6166m614J0335N1832K5744j5073j9692j9540N905k3007l3834
28712d0184q193P704n591Q26j5861J5137J8716j5433J1778L2165n437P023l562
28699i12n246k2573o863K8787j5238j8946K2451l333j2872J600j3454N812j1672
28686e2459J4964L9450K1923R448j1870j3387J1163J4623j8300j7278j3342m744
$$ y = [-20133, -18997, -20666, -22526, -607, 33381, 39688, 33330, 4780, 16272, 21328, -4640, -5218, -13008, -37215, -37593, -26844, -14185, -26254, -25338, -21352, -35848, -46055, -56270, -53005, -56726, -79879, -51547, -54190, -44220, -3961, -8581, -9045, -39064, -67619, -26717, -14501, -563, 4703, -2683, 6749, 2365, 12802, -8897, -37550, -32103, -18713, 9190, 12671, 19898, 38251, 9923, -33557, -44406, -18240, -22854, -12519, 39313, 65057, 49984, 30292, 10752, 16657, -6350, -40184, -48377, -40673, -46264, -45438, -61299, -46162, -27446, -42879, -31101, 1064, -4373, 2650, -912, -6158, -28731, -35594, -6807, -22045, -40991, -18540, -21873, -34745, -33145, -46599, -40787, -52459, -37495, 1955, 23878, 33326, 21456, 8069, 19232, 33855, 15555, -1723, -15065, -19809]
28674a9809Q861K4836o661p408j0707l4459k064j2427L074n343O631J3615p619
28661d9480o66k3262m479k2965m446L0935O3114K2111m5056O444j348L337L364
28648b2397k0039L065O103l574N786N698N625R176o713j0942j3009k0588k1382
28635h3191J9188K5992J6348l828j1927K2078j4058k176M063N740j1244p875J6264
28622b4626J4793p897m307k6984K3287k0341l289J3391J4993K4034J1543j9685
28610e088J7569n341j3309l0322k5851K2365M2400K0430L769K1275L540j2188
28598C9249r115k8012l311J4340k3326p520M345K5309r542j6081K4000K5430j7623
28585A8143k2188j2853j26O32n059p408j9523L5504K674M392k6658k4496J8512
$$ y = [-19809, -10948, 13888, 7227, -181, -10888, -45347, -47411, -59838, -56764, -62107, -55476, -41861, -49480, -50146, -73408, -77887, -100852, -105298, -74363, -11249, 10862, -34194, -27750, -29098, -25761, -22397, -42436, -39371, -33268, -36842, -31056, -25358, -19733, -10557, -17270, -28212, -41221, -61809, -83191, -64003, -38011, -21663, -25491, -37418, -15340, -29398, -31574, -27511, -21771, -33015, -40890, -24626, -9833, -17730, -22037, -49021, -25734, -46075, -49364, -35973, -20980, 3054, 14597, -5088, 12481, 7140, -6169, -36491, -62342, -39977, 2423, 22853, 26622, 47897, 51437, 39249, 30134, 2122, -1189, 13151, -10175, -17695, -13350, 11959, 2417, -13664, 10336, 35766, 18143, -4045, -16898, -17024, -16392, -21451, -28859, -48382, -12878, -10204, -5812, -32470, -56966, -38454]
28572c8454K4185l930O02j2778j0695J4743J0592j6089j3352k3854J163J6087
28560e1780K4392J2897L7186K3446L196m7135j0876N208p515k7859j1935K3789
28548b6986J3586K1028j5938j8471J949J8106L3766L5171q698j8296M687l233
28536C6671m4710q732Q114K0448J4779J1197k724J1256l4964l1653P676L1133
28524A8491M335k0942J3435J8510k249l0333k4691p479J6037J386J4954L199j5695
28511a1042j7194Q923J5781K1692M28k4263k2078j1269P21K934R423K4575j0275
28498a1644m2849r066J6318J1801j8726R470M9539Q879l6788k5119l9436K1452
28486f6169J4938J8185J7419J645p847Q124j3724k88K6556p978k379j7261P792
$$ y = [-38454, -14269, -18199, -17597, -30375, -41070, -26327, -15735, -31824, -45176, -69030, -67867, -51780, -27388, -14491, 22695, 46141, 49337, 2202, -8674, -3466, -10981, -38840, -50775, -26986, -13400, 7628, -8310, -26781, -24832, -6726, 27040, 62211, 53513, 35217, 39904, 36671, -8039, -16771, -8657, 11791, 26570, 37767, 35043, 46299, 11335, -20318, -12642, 18491, 22826, 1884, 15319, 33829, 31580, 1247, -23444, -30923, -14886, -13500, 1454, 4653, -11042, -28236, -19313, -3532, 18160, 18588, -5675, -27753, -39022, -38301, -35367, -25944, -1369, -11644, -54493, -63559, -47241, -35440, -54166, -44696, 4843, 13722, -23066, -48185, -87621, -66169, -51231, -33046, -15627, -13982, -21829, -13705, -27429, -27717, -1161, -9139, -11518, -28779, -20987]
28473b0987K3872M600j6984p614P853k9351J080K351K5134J1681J8915M693n8290
28460c3047k039N0401o953K0304j2049l3381o826J0874Q288O671M697K0488l801
28447B3627k0365J7008J9168J8882j8105J6279k6232j7214K0207p450k297K644
28435B6152K4186J1341k1169l5191j1236M483L983k539n968J3737r282J9462J3839
28422C1798J986m8060k3739J1840N728K4506K4389K1705j1005l426j0541l8251
28410a3070j3300J838J1372K1212k197j9377p602J2569j0840M003Q000K269K854
28397b269o948J0603m216J2677K0987Rl0431l0568j9651Q805J379J1718K752k5249
28383e0402k0913M1329J4873j4758j7979o511J0353K9673L0065l0660k3320J011
$$ y = [-20987, 2885, 7485, -9499, -17113, -9260, -38611, -37531, -35180, -10046, 1635, 20550, 25243, -33047, -35086, 15315, 8362, 28666, 16617, -16764, -23590, -12716, -4428, 2243, 6940, 27428, 23627, 3262, 20270, 39438, 58320, 40215, 56494, 30262, 13048, 33255, 25805, 23508, 26152, 50338, 61679, 40510, 5319, -5917, -1434, 2549, 10, -5958, 7779, -1503, 17959, 31798, 33784, -14276, -38015, -26175, -20447, 4059, 28448, 50153, 39148, 35722, 25181, -13070, -26370, -24532, -13160, 8052, 5855, -13522, -21124, -8555, -19395, -15392, -7392, -5123, -2269, -9217, 1386, -2830, 9847, 30834, 30843, 412, -30156, -49807, -41002, -39623, -27905, -25153, -50402, -71315, -29986, -15113, -29871, -47850, -54361, -44008, -14335, 15730, -14930, -38250, -37239]
28371c7239M5548J0093j2783j1509l036k978j993K8627K9021k9637l6113J4650
28359g349K1680J003q123j3699r851j5865m995L3372P482M958J3135N990j4454
28346A3284n067k0426k5966K370J7707R048Q020q484L580j8130J5667L474J1896
28333F973m602K996J6350o199j9377m234j8144j5807K6514N661R933J2436J3195
28320B5695j0001j3436M191J0347L4054n640k4025j43O180k3544r786J5238L124
28307A2254o041O041p806J0321l365j8171N285j25J4399J5885M224l0954p184
28294e237J5732J728j3892k5826m160j3530J3048L700p872N314J5712j9620j0425
28281d5328R141K0431J4783Q459K199j475k6275k2549j1464J8834O054K3397J5121
$$ y = [-37239, 8309, 18402, 5619, -5890, -8926, -11904, -13897, 14730, 43751, 14114, -21999, -7349, 14331, 15334, 7211, -6488, -16339, -32204, -37199, -3827, 3655, 8613, 21748, 27738, 13284, 8217, -12209, -38175, -35805, -18098, -9050, -1030, -9514, -5934, -24064, -8397, -4923, 6973, 2371, 5367, 21717, 15518, -3859, -8093, -26237, -42044, -15530, -9869, 64, 12500, 25695, 15694, 2258, 6449, 16796, 50850, 45210, 21185, 21042, 27222, 3678, -6108, 9130, 12254, 6213, 12254, 4448, 14769, 11404, -6767, -1482, -1607, 12792, 28677, 32901, 1947, -5237, 10495, 12223, -1669, -27495, -31655, -45185, -32137, -28437, -36309, -30995, -15283, -34903, -45328, -36187, -15756, -973, 7486, 9685, 8210, -18065, -40614, -52078, -33244, -27190, -3793, 11328]
28268A1328J6075k3406m3120m252R47m596n601j2732n185L4485K3842J7272j5870
28255a0813p943j1736q118J5223k3426j2397J8570M401p325J0289K9730J5240
28243A1695j929k0975j511r499j0563M442K9993J0633q22M906L022k709o495j743
28229H445j0575l9751L249J6935n739j1849L852N378J9460j147J2673o921j368
28216g358j2845k085K5898J5761K217n7917q982K9224J7074L383n136L880K0173
28203B3287l2503r226J5889l569M847m716j8710l755N087K6853j7367k4877q280
28190d7040J3415N1626J9692l5325K092n826j2435m0401O320M4780R026m106J9892
28177B1710m480J4530k266p094j1552j0451j2697j0958k3349l244q407o618J7733
$$ y = [11328, 27403, 3997, -39123, -43375, -42428, -47024, -52625, -65357, -70542, -36057, -12215, 5057, -10813, -18756, -30492, -38610, -23387, -46813, -59210, -40640, -36239, -43564, -33275, -3545, 11695, 9766, -11209, -12720, -22219, -32782, -28340, 1653, 12286, 11464, 16370, 19392, 16683, 10188, 8445, -2130, -41881, -38632, -21697, -27436, -39285, -35433, -30055, -10595, -11742, 931, -5990, -7358, -20203, -22288, 3610, 19371, 21588, -36329, -45311, -16087, 987, 4370, -766, 3114, 23287, -9216, -18442, -2553, -6122, -1275, -5991, -24701, -28456, -23369, 3484, -13883, -38760, -47040, -33625, 18001, 37693, 2368, 4460, -1366, -13801, -54202, -47882, -3102, 5924, 1818, 21710, 17230, 31760, 29494, 22400, 10848, 397, -12300, -23258, -46607, -49851, -58258, -64876, -47143]
28164d7143J199M878L8608n593k991j1132l886j2381L291M4428r201k5297r452
28151c4672J1428K5334J8315o5j2473j0517n955Q661K549J58J7710N396R027K0738
28137E5634r975l7912j7517n716K3302r848O4m728J168j8838k2791K2793J4606
28124i758K378j5845l7757J2594K8880P185k2023M132K6529L2102K4178j8169
28112C4426j4061k4669K984J3430j4520j5613j0634J2424K0226J0103j6462k4327
28100b6693j2777j6191q929J6893O999Q019J529K8460J9865j4281j3173k9180
28088c9459k2115O4867L9907J5518l4903k322J3274q576R514j2379j5773N364
28076A2917j9105J2174n567K635j9279j1237P766o756l2767J9150N6108K6293
$$ y = [-47143, -45944, -41066, -2458, -8051, -11042, -22174, -26060, -38441, -35150, 9278, 77, -25220, -34672, -23244, 2090, 20405, 20340, 7867, -2650, -8605, 56, 2605, 2763, 20473, 25869, 34896, 55634, 45659, 7747, -9770, -15486, 7816, -2032, -1968, -6696, -5528, -24366, -47157, -24364, -9758, -7380, -23225, -60982, -48388, -19508, -12323, -34346, -30214, -3685, 28417, 52595, 34426, 20365, -4304, -1320, 12110, -2410, -18023, -28657, -16233, 3993, 14096, -2366, -26693, -39470, -55661, -64590, -47697, -40698, -32679, -31150, -2690, 17175, 2894, -10279, -39459, -61574, 3293, 43200, 58718, 23815, 21493, 34767, 26191, 35705, 23326, 7553, 12917, -6188, 5986, 419, 3054, -16225, -27462, -19696, -26452, -59219, -40069, 16039, 42332]
28064D2332p615J3059j8606q313J8950j1294k7132j1660O367J2515J164k7775
28052a8008k2908J5397M5407J2396J6813J0829j510r43K6552j5321n7888m1753
28040c0937Q514M3515L0205k1024j1957j9696P468J9923O447J2172p900k3883
28028A2847K725k9179k0801m041L532q123j1190n820L6393K8786k9968n665k627
28015c3131J5510Q213M939K849M789j7068N511J6356K700p665o062J1029R890
28002A7860l0893M613K5109k710l461j2911l3703Q025R827L1717j6538J0038J6164
27989B3137l4486k0456J303J1551J9112p769j0233K0266m772j2354k962N114j3441
27976b5990l727J1518P890j5497j8267K0860L7760M2058l601k2713j0563q112
$$ y = [42332, 34717, 47776, 29170, 20857, 39807, 28513, 1381, -10279, -3912, 8603, 9767, -18008, -40916, -25519, 19888, 32284, 49097, 59926, 58416, 57473, 84025, 68704, 10816, -30937, -22423, 21092, 51297, 30273, 18316, -1380, 6088, 26011, 32458, 44630, 36730, 12847, 15572, -13607, -34408, -38449, -34917, -43040, -54230, -60050, -23657, 5129, -24839, -30504, -33131, -17621, -9408, -4469, -1620, 3169, -13899, -8388, 7968, 10668, 3003, -3059, 7970, 17860, -13033, -8420, 16689, 13979, 10518, -2393, -36096, -28071, -18244, 13473, -3065, 6973, 23137, -11349, -31805, -30502, -18951, 161, -7608, -17841, 2425, -2347, -14701, -17663, -12549, -25990, -29717, -18199, -10309, -25806, -44073, -23213, 14547, 56605, 53004, 30291, 19728, 11616]
27964A1616K986Q32l9707j215K8660N7671M437n1665o4171l486K5464k356N254
27951b5680L4076L666k946k2539n70J8186k6526j247j887K500K6594P704J3274
27938B4605m200J0781K5279n840k1030m0569r433K7439J9770m880l198j3282J0453
27925A5895r007l6330J5502J6396p94K202k429J2523j0038j9422J9217J2302j2398
27912C619N362j3768P665k1983l5833Q250J4529j21M840K1453K2349J5686L370
27899C5418J893j1519k9137r042R592K0332r003j2683j0303J9906J0132k9176
27887a3590o486m343k4601p009P511M9149P52r946j1638K7910J7892j1980J6019
27874B9640n264n866j6810J0847j2293k9565J7225K6373j743j2304J2014N788
$$ y = [11616, 14602, 15434, -24273, -25488, 3172, 60843, 65280, 13615, -50556, -54042, -28578, -30934, -25680, 8396, 12062, 9116, -13423, -13993, 4193, -22333, -23580, -25467, -22967, 3627, 11331, 24605, 20405, 31186, 56465, 50625, 29595, -10974, -20407, 7032, 26802, 21922, 18724, 5442, 15895, 6888, -29442, -13940, 2456, 1662, 3864, 1435, 13958, 3920, -15502, 3715, 16017, 3619, 8981, -4787, 2878, -19105, -54938, -46688, -32159, -32280, -27440, -5987, 16362, 32048, 35418, 37311, 25792, -3345, -12387, -2795, 17537, 8534, -4149, -14452, 5454, 15586, -13590, -20076, -24419, -49020, -56029, -48518, 631, 1383, -8563, -20201, 7709, 25601, 13621, 29640, 24376, 18510, 1700, 12547, 254, -29311, -12086, 14287, 12544, 240, 12254, 18042]
27862A8042j5052M06J713j7951j1197J7551R561n772o137J9574J0702k1292j0898
27849a0750M675j3415r832R440M997J340j7510j186J1627J4045M077J1681L1358
27836D0547K9756j6628r452j9208k3509J57J3985J0732J1605n705j8851r015k0961
27823a6547l880q423l983n997O615K6711O576j0182j5540k722j1745J6901o727
27810b8943m501J0843K1405J3367p494K1965J2989O059J3749j7212m344R092l0284
27797A6691m878J1399p420k886J3862j7769j117j3380k546J6412l492J7339r789
27784A2426J1491j2294p107J0783K014l3218K373K0090J111k8917m08J6306L2089
27771B6739K9232n020j9104j2587j8300k3645j7618J3386J1588k2002q883J3651
$$ y = [18042, 2990, 3396, 5109, -12842, -24039, -6488, 3073, -2699, -8836, 10738, 21440, 148, -10750, -6075, -19490, -29322, -19882, -14885, -13545, -31055, -32241, -20614, -6569, -2492, 9189, 40547, 70303, 53675, 44223, 25015, 1506, 1663, 15648, 26380, 37985, 32280, 13429, 4414, -16547, -20427, -28850, -32833, -38830, -32215, -5504, 1072, -9110, -24650, -27372, -39117, -22216, -28943, -33444, -22601, -1196, 12171, 4677, 26642, 39631, 45690, 59439, 42227, 37883, 46975, 16691, 11813, 23212, 15792, 12906, 26768, 8999, 7882, -5498, -8044, 8368, 4876, 22215, 12426, 23917, 11623, 4516, 15299, 17313, -15905, -13532, 6558, 7669, -21248, -21656, -5350, 26739, 55971, 50951, 31847, 19260, 960, -22685, -40303, -26917, -15329, -37331, -46214, -32563]
27759c2563L755J2293p154p887j3162L7316K672j5262J0515L490m224J9479j3497
27746d229j0699m200K584J7708J5474j7827j9844N698R982j4218O644m2368J4104
27733d1191L6339K4876J6470J7411l3323K859r40r143J2353k2600l2283j8465
27721d7637J1969N484K3204K8816J8043r219l1238N804L1303m445o345k761k9166
27708f188m0227R36M1097M0842K5617R42R00k3001j2617j5805R985k1367k0530
27695a9416L202R919J0263k7514J7956O705j049K0523k6006l115p860Q037J4050
27682E695m4649J2147j0059k5772J2589p843J7358K1956k1109p60J267j1972o171
27669e7323M488P843o196K740K5237k6451k115j93J7392R379P987L5785L390k8503
$$ y = [-32563, -28808, -16515, -23669, -31556, -44718, -7402, -4730, -19992, -9477, -5987, -10211, 9268, -4229, -14928, -19128, -16544, 1164, 16638, -1189, -21033, -15335, -5353, -19571, -12927, -55295, -41191, -4852, 20024, 36494, 53905, 20582, 23441, 22501, 13358, 25711, 3111, -29172, -47637, -35668, -30184, -6980, 21836, 39879, 30660, -578, 5226, 36529, 32084, 25739, 22978, -6188, -46415, -45479, -4382, 36460, 62077, 63019, 63919, 40918, 28301, 12496, 22481, 1114, -19416, -16214, -6295, 3968, -23546, -5590, 1115, 66, 20589, -5417, -8532, -16392, -8355, 5695, -38954, -26807, -36866, -62638, -50049, -57892, -40534, -18578, -39687, -40447, -39180, -51152, -57323, -52835, -44992, -51188, -48448, -23211, -49662, -51777, -51970, -34578, -25199, -17212, 18573, 21963, -6540]
27655f540N592J5567j6654J413K819m2414k1992K3204L2253J3760j9417j6514
27643b8923r979n954m783Q296J6654j7861J5155j951K0248K6535j5376l2522K3572
27630f889M3783j6044n020m590j5865K2080O340O938j7712j76j005k2350m696
27617a5206k185J6509O85j1945J768K8567L2722p653j8374J5671o039o521J1585
27604C9584m331k9983J16q445j192P868k4393M923l037j1857P795k635R938J2015
27590c634J2857K9939k860o855k9412l0912K1291R763J9055N30j7930k4360O18
27577b1910P572k0292K784j10K520K998L5043K8432J0746J2500j6410k4513k2872
27564c512l5741R256J1140J4809Q358k333j9604q716l0432j8049K6617L2989j3667
$$ y = [-6540, -948, 14619, -2035, -622, 2197, -40217, -62209, -39005, -6752, 7008, -12409, -28923, -38902, -44856, -49639, -41343, -24689, -42550, -27395, -29346, -9098, 17437, 2061, -30461, -6889, 36894, 20850, 15830, 11240, -4625, 17455, 23795, 30733, 13021, 12845, 11840, -10510, -15206, -17391, -882, -197, -12142, -10374, 18193, 50915, 43262, 24888, 40559, 34520, 27999, 39584, 35253, 5270, 5386, -3059, -4251, 3617, -20776, -15853, -18890, -30747, -22952, -25587, -15649, -3634, 9223, 39162, 36302, 29447, 35, -30877, -9586, 177, 19232, 19762, 1832, -22528, -21910, -14338, -34630, -31846, -31956, -29436, -26438, 8605, 37037, 47783, 60283, 43873, 19360, -3512, -39253, -29997, -18857, -4048, 4310, 1977, -17627, -26343, -56775, -74824, -48207, -15218, -28885]
27551b8885k1628M8638Q718J1031J5374j7557m0644j2606J3818k057R348J0772
27539e678Q730J9497J182j803k828l8630J2192R359j4669l713K5209r88l179k3138
27525a8457j4942K8362K01q960p997J2908J781N3J4625N128K221J4045N895j3041
27511B1822k7812o410j1210P113N003j418N41j253k6972P649J5593L0529R676
27498B2851j4557j0000O211J5680k5632N151M758K3044J746J1115K3484k4450
27486C9401m0801j0770J626L9117K2328j3634Q06k3177j0608J3901q92J8516K2135
27473E7948p489k5978n383J4833m150j9382K1045j4128n692j1531j0672k2161
27461c2740J0499J1270J7340o76j3755l727K1420j808k4013l8981k0311K1304
$$ y = [-28885, -50513, -1875, 6843, 17874, 33248, 15691, -24953, -37559, -23741, -25798, -16450, -5678, 3052, 22549, 23731, 21928, 19100, -19530, -7338, 2021, -12648, -16361, 8848, 7860, 4681, -18457, -33399, -5037, -4836, -13796, -21793, -8885, -7104, -7051, 7574, 12702, 14923, 28968, 34863, 21822, -5990, -12400, -23610, -16497, -11494, -12912, -12371, -13624, -40596, -32947, -17354, 13175, 22851, 8294, -1706, 4505, 20185, -5447, -296, 4462, 27506, 29252, 40367, 63851, 39401, -1400, -12170, -10544, 28573, 50901, 37267, 38073, 14896, 4288, 18189, 17297, 35813, 57948, 50459, 24481, 19098, 33931, 29781, 10399, 31444, 17316, 11624, 93, -10579, -32740, -22241, -10971, 6369, 5693, -8062, -11789, 9631, 7823, -16190, -55171, -75482, -54178]
27449e4178K6733l733M014K0326J7664J5853P620j7984M052M791k9595k591K2195
27436A5167J6806l510m1638J1339K6929J4647K319J359j8766j1634n690o683k7425
27423b6780m730L0917L8370J4884k2724k0900J954J7996j3631P257K2767K47Q532
27410E4159j4577p645K1672j4084k5363l565j0279P869K7490m497p583J9190k8625
27397A4162k1431r888o212J2616K4289J4776J7213m745L461K3416J0890m0421
27385C8126m3551J3238L8470Q365k5954o590m169O592m3893J6516K3598n247k1133
27372e632p20J3308l210R121K3823J6328k6176k0177k1732m520J9294j4J7468
27359A7161K7717R753j8203m2509J2523L4463j4455j244k9389m8211k2791P161
$$ y = [-54178, -27445, -31178, -27164, -6838, 10826, 26679, 34299, 16315, 20367, 25158, -4437, -7028, 15167, 31973, 28463, -13175, -1836, 25093, 39740, 42059, 43418, 24652, 13018, 7328, 645, -26780, -31510, -593, 37777, 52661, 29937, 9037, 10991, 28987, 15356, 22613, 45380, 45627, 54159, 39582, 31937, 53609, 39525, 14162, 10597, 318, 8187, 35677, 31180, 23597, 42787, 14162, -7269, -17157, -23369, -10753, 13536, 28312, 45525, 40780, 44241, 67657, 78547, 38126, -5425, 7813, 46283, 54648, 28694, 22104, 17935, 24527, -19366, -2850, 20748, 15501, -5632, -6352, 6956, 3746, 12867, 36690, 53018, 26842, 6665, -15067, -19587, -293, -307, 17161, 44878, 54631, 36428, -6081, 6442, 40905, 26450, 25206, -4183, -52394, -75185, -68024]
27347f8024N988j1422K3150L0271m100P357K1721M000p160j9532q086M0041M8702
27334F2906j9260k0032J6943q3l080k03L264J0979j470l4121K1500L4961j0518
27321F1786k0761j6997o587J7006K8345k642j6005q970l5238k1292J5933K4058
27309A8636J5983k1442J0270P504j8924l70K2951L5448o523l169j0007o494k1563
27296B2300l6951l3218J4778K4602L8279n172k997K5498N033q195j6120J9229
27284D7066J4332j2737j0552R855j171L312k0936p898K9198j1211k828o182q439
27271B1809j8301j4094J6172K4137M065Q54J7221j0154j2810L085K4527j680m17
27258E4414J3645Q54l89o2532K588R673j5731k6140j347L6683J5339j4445o681
$$ y = [-68024, -62036, -73458, -50308, -20037, -24137, -16780, 4941, 8941, 1781, -17751, -25837, 14204, 62906, 43646, 23614, 40557, 40474, 37394, 37191, 40455, 51434, 49964, 15843, 37343, 72304, 61786, 41025, 24028, 17441, 34447, 62792, 60150, 44145, 35175, -63, -21355, -5422, 18636, 34619, 13177, 23447, 30951, 12027, 11657, 34608, 70056, 63533, 60364, 50357, 43863, 22300, -14651, -47869, -33091, -8489, 29790, 24618, 21621, 47119, 52152, 43957, 27837, 47066, 61398, 48661, 38109, 47964, 46793, 50105, 29169, 21271, 50469, 39258, 36430, 30248, 21809, 3508, -10586, 5586, 29723, 33788, 34642, 51863, 41709, 28899, 31984, 56511, 54831, 54414, 68059, 68913, 68524, 5992, 8580, 18253, 2522, -23618, -24965, 11718, 27057, 12612, 5931]
27245E931J7191R614j9999K419K6039J7106j5405j7394R248L1413o869k2996k1539
27232A4759j3379J6992K9077J5379l4040m0792K2037L9434R188J1317j6861j8563
27220C4548N590L298l2772j1135J6294K0643J1083N332m10O638J39j1151j0323
27207C7774l4070K605r686J0748K9995l1628N529j4116j2068O756J1462L1693
27195C4994P164O684K0835j7395j3548j0J2977p780O362O300j7911l2490J0776
27182A6958n634j5659p642J9841K4565j548j7902k1766l666R560j1441K1877J6376
27169B3919j3831j9255l4766L2967J7930j264j4167L884K5676K6885j8375P404
27157C7007J7705r436j1036J681k229k03J4765Q200l0864k8129J5803P946P400
$$ y = [5931, 23122, 32736, 12737, 15156, 41195, 58301, 42896, 25502, 34750, 66163, 59294, 36298, 14759, 1380, 18372, 47449, 62828, 28788, -12004, 10033, 49467, 58655, 69972, 53111, 34548, 40138, 43436, 10664, -471, 15823, 36466, 47549, 52881, 52471, 59109, 59248, 48097, 37774, 3704, 6309, -3377, 7371, 37366, 5738, 11267, -2849, -14917, -8161, 3301, 34994, 42158, 48842, 69677, 52282, 38734, 38724, 51701, 43921, 50283, 56583, 38672, 6182, 16958, 11324, -4335, -11977, 7864, 32429, 30881, 12979, -8787, -12453, -2893, -14334, 7543, 23919, 10088, -9167, -43933, -10966, 6964, 5700, -8467, -4583, 21093, 47978, 29603, 37007, 54712, 45276, 34240, 35921, 33692, 33489, 48254, 56454, 25590, -2539, 13264, 21210, 28610]
27144B8610N456q20p899j892j5650k4539K2566J4177K0439Q653l5324k194J9095
27131C0678j1418n664K2842J1827k5997j4018M1708j6932l5760K4784L9641L6688
27119I8379j17j1342j6894j2372j9748n197P118L8863K1699j7063j0510k3216
27107D9600l3452J9100n29l1798P477j2059k316r00k6225J3150m619M784J6297
27094a490L8504J5136J3742M574m367m1285j9859l900j0131r67M1889K6909M08
27081E9163k2328J4807L407J671P375k5213J5020M411J673k044K6914L111k6011
27068F1956q371k6658n0337L812K2407L052O808L428j8457j6241K11K2239J9464
27055B3313L2829K0985k8214j5680K5550k618j9688l4008l4368R054o329j4401
$$ y = [28610, 34066, 33246, 25347, 23455, 7805, -16734, 5832, 20009, 40448, 49101, 13777, 11583, 30678, 19260, 13596, 36438, 48265, 22268, 8250, 49958, 33026, -2734, 22050, 61691, 98379, 98262, 86920, 70026, 57654, 37906, 32709, 39827, 78690, 100389, 83326, 72816, 49600, 16148, 35248, 34719, 2921, 10398, -1661, -3977, -4877, -31102, -17952, -22571, -17787, -1490, 37014, 52150, 65892, 70466, 66099, 24814, 4955, 1055, -9076, -10043, 31846, 58755, 59163, 36835, 51642, 55049, 56720, 64095, 38882, 53902, 58313, 59986, 57942, 84856, 87967, 61956, 53585, 26927, -23410, -19598, 2809, 5861, 12669, 16097, -2360, -18601, -18390, 3849, 23313, 56142, 77127, 48913, 33233, 58783, 56165, 36477, 2469, -31899, -22845, -29174, -43575]
27043d3575J4080M2851K186K360J2210K2842J4114k938n8545j4504J0914j4242
27031a2247O056L6164L510r635J6094N393K0488J1945M538k2803n965k7571k5231
27018G36N657k3612J2261L7151R974J2364mQ532l425o145L1373l2153o318j1124
27004C5267J8039p348n0539n140j382M7620J5990j278Q555k1985n91L9081O97
26991G6986K0693j5673j4685R754O891k3860m4420N266R719J1746j9383k295K6817
26978D7556J3965K869Q714k8083m666o799k0125K6278L8930o266k4885J0511J3654
26965G1653j3116N176K8229j5590L31M6441r705l5051N017k6057l325K5922J2836
26952I2761M723J5171j3651k1344J4645k59J2946J0385Q669k6367j9454j32K5735
$$ y = [-43575, -29495, 13356, 15542, 17902, 30112, 52954, 67068, 64130, 5585, -8919, 1995, -12247, -6191, 29973, 33483, 23848, 39942, 45335, 65823, 77768, 82306, 59503, 53538, 25967, 736, 6393, -17219, -4958, 32193, 42167, 54531, 54527, 63059, 59634, 53489, 84862, 52709, 46391, 35267, 53306, 45958, -4581, -9721, -11103, 36517, 52507, 51229, 59784, 37799, 37208, 76289, 76986, 97679, 82006, 67321, 77075, 83966, 60106, 15686, 20952, 30671, 42417, 23034, 20739, 47556, 61521, 64390, 73104, 45021, 40355, 33556, 13431, 39709, 78639, 72373, 47488, 57999, 71653, 58537, 63713, 91942, 76352, 76683, 123124, 113419, 78368, 83385, 57328, 54003, 79925, 92761, 97484, 112655, 99004, 77660, 92305, 92046, 104992, 115377, 124046, 97679, 78225, 78093, 103828]
26939A03828N86m68K2580P670j6472l2942k7048K3236r762l0469J4561L5365j1723
26926G8942j6135J0294Q303n05j2943j240p952L198j9273k2921J4998K6996L4021
26913I5783p285P218j6709j4635n462P623j2136J9396K7394K2655k3476j8909
26901H1457n785L960K9119J7263R006k9785n080o16N739J9062k9322l4546l790
26888E6682p97q96L7970K2964q096k608J0515k6092j6833K1383K7775j1924M347
26875A14390j8103L942j8832p889m800l756o381K6520J2962n576l0471J3204J5791
26862I1001n318J145k2080M034K1955K1234l3753k3949p078P28j157j0022j485
26849C5255N121L3342J832l4642q783K1240O706l801J4443R205j0744n2128j2404
$$ y = [103828, 104414, 103946, 126526, 134196, 117724, 84782, 57734, 80970, 71208, 40739, 55300, 90665, 78942, 62807, 73101, 81404, 80899, 67956, 66716, 58764, 61962, 42689, 19768, 34766, 61762, 95783, 88498, 95716, 79007, 64372, 58910, 66533, 54397, 73793, 101187, 123842, 100366, 81457, 75672, 79632, 108751, 126014, 135020, 105235, 100155, 99539, 105278, 124340, 95018, 60472, 56682, 55885, 54989, 92959, 115923, 107827, 105219, 115734, 89642, 72809, 94192, 121967, 110043, 114390, 96287, 100229, 81397, 73508, 68708, 64952, 58571, 85091, 98053, 92477, 62006, 75210, 91001, 85683, 86828, 64748, 68782, 90737, 111971, 78218, 54269, 47191, 47919, 46762, 36740, 35255, 40376, 73718, 75550, 40908, 32125, 53365, 60071, 56270, 70713, 79918, 69174, 17046, 4642]
26836D642J5814L3643J5147J2219k7102J8454M450j0517K3688J3652j9206J4997
26824I9881j322j4087j8878j5407O434Q984O94Q00K2312M379m5441j1648j0227
26811B6474k933K6776P045M6036J5284o632k5356J922l330R218J964k5742k8948
26798D1778r288j2310L1667K6704k043j9867J0144r086j0944k3445K258J3936
26786C9504p796P88R134J1265j0496m5744J8174J1046K0184L7959k8665j5867
26774C9486m00o210L4211J5713l12k8939j6215P503j6508j2330j4089J7521J4024
26761C3455Q422J8616p205K346k5562P051j152r980q317l2713L0620K4128j8023
26748B1686J4531J939j0445K842r256M90J0376r848k3158r864J1080N616K5744
$$ y = [4642, 20456, 54099, 69246, 81465, 54363, 72817, 77267, 66750, 90438, 104090, 84884, 99881, 98559, 84472, 65594, 50187, 56621, 65605, 66299, 67099, 89411, 93790, 48349, 36701, 26474, 23541, 50317, 57362, 103398, 118682, 112050, 86694, 88616, 85286, 94504, 96468, 70726, 41778, 32490, 20180, 51847, 78551, 76508, 56641, 66785, 57699, 46755, 23310, 25568, 39504, 31708, 32496, 41630, 52895, 42399, -3345, 14829, 25875, 46059, 84018, 55353, 39486, 39086, 32876, 67087, 82800, 82488, 53549, 37334, 44837, 28329, 15999, 1910, 19431, 33455, 41877, 60493, 53288, 55634, 30072, 37123, 35971, 25991, 17674, -15039, 15581, 39709, 21686, 36217, 38156, 27711, 30553, 21297, 21787, 32163, 22315, -843, -10707, 373, 5989, 31733]
26735C1733Q436k906k8103j1873J6362o026K0718K9997K8251L361l1442k2526
26723C5982J2630l9092j3389J7673J383L435r901K816N402q939j1633O825j5717
26710a2525l837j4806k943k212J4836L0144J1786J9651M1225k1212j8136m2420
26698d49j5302J4922J3705q563J6098J1741j2268n217L4361M305m5039M420N5
26685A2769K2037J9326j4770j0162J4801j4679L891J4902j0000p38r987o947J1271
26672C1714j6072j507K4420j1313L1356o435l2323j0973j2822K2215J6351j1633
26660B2978Q3p063m84R78O275K4681J0169J1136k5040j7571m7151l0235K6910
26647b4334J0478J8907J2834M372n863k3094p219N580J731J0616J5549O011j2584
$$ y = [31733, 40169, 37263, 9160, -2713, 13649, 7623, 28341, 58338, 86589, 89950, 58508, 35982, 48612, 9520, -3869, 13804, 15187, 18622, 8721, 11537, 16939, 8000, -3633, 3192, -12525, -16362, -31168, -34111, -36323, -21487, 8657, 20443, 40094, 81319, 60107, 41971, -449, -15751, -829, 12876, 4313, 20411, 32152, 19884, 14667, 49028, 53333, 8294, 12714, 12769, 34806, 54132, 39362, 29200, 44001, 29322, 33213, 48115, 38115, 37377, 27390, 20443, 31714, 15642, 14135, 38555, 27242, 58598, 52163, 19840, 8867, -3955, 18260, 34611, 22978, 23061, 15998, 15514, 16492, 22767, 47448, 57617, 68753, 43713, 26142, -21009, -51244, -24334, -13856, 5051, 17885, 22257, 16394, -6700, -13919, -8339, -6608, 4008, 19557, 25568, 12984]
26634A2984j8610K5640R13m917l113r988j1353O881K3922Q247j0086k5021j1446
26621a5947L0480J3634L7398O717R520k179k1499j6542l5549J3974l257j7986
26609a236j9730R928n977K4135J5303J1963k4157j9849N256K0712M685k1657J9068
26596A8444q76J1515L605j0146J526j222j6550j2771n279j637J9014J4105J8177
26583C7905J0983l5318m7303j7640K0764K5525J2819m31O514l2302j4553R214
26571b3823J2725N341L2258J9779j8689k4944l151m412n482L326J3915K0801k5433
26558B211o537j230N362K1780l209J9650J7473j169j7275j473Q205J7806K71J503
26544F3368j9768j6350K904K3001k6161l0188J9689M427k2948l976J3398J3385
$$ y = [12984, -5626, 20014, 20927, 16010, 12897, 2909, -8444, -1563, 22359, 30606, 20520, -4501, -15947, 14533, 28167, 65565, 72282, 81802, 79623, 58124, 41582, 6033, 20007, 16750, -1236, -20966, -11038, -17015, 7120, 22423, 34386, 10229, -9620, -4364, 16348, 21033, -624, 18444, 17568, 29083, 32688, 22542, 24068, 22846, 6296, -6475, -11754, -13391, 5623, 19728, 37905, 48888, 13570, -33733, -51373, -30609, -5084, 7735, 7304, 13818, -18484, -33037, -23823, -11098, -5757, 26501, 46280, 27591, 2647, -504, -4916, -10398, -7072, 6843, 27644, 2211, -4326, -5556, -194, 21586, 18377, 38027, 55500, 54331, 37056, 35583, 43788, 61594, 61865, 63368, 43600, 27250, 30154, 53155, 26994, -3194, 16495, 20922, -2026, -6002, 7396, 20781]
26532B0781R878k1740l0848J4680Q564j9694l2625p67K2377L1016P272j5366O486
26519A4J8422k3019l588K7249J3529M602p495j6106j9252R46j908l5702j1362
26506e3670J7234N3533M409l0431L298O615n173q470K3289p732N880J8692j3142
26493A4332l7127K9425K2915k2384j6284j4694K9532j9185j3791J4526J2102J6439
26481A5806N192L0855N790p502j0001q455l5842j8557L107r289N277r226O402
26468b6443J1401K008M1429L0236j785p004j9192l3555r007J2017J9225j3718
26456E612l0250M982M07K0351k8147l3531J0545L6825p584K8281L9372k9534j2779
26443D550q369K2134O954J3093J947k7848N343M691P696P642P262l414r136k7204
$$ y = [20781, 30659, 8919, -21929, -7249, 1315, -18379, -51004, -51771, -29394, 1622, 8894, -6472, 14, 18436, -4583, -8171, 19078, 32607, 37209, 29714, 13608, -5644, -4698, -6606, -42308, -53670, -36436, 17097, 21506, -8925, -5627, 988, -4185, -12655, 10634, 2902, 8782, 27474, 14332, -22795, 6630, 29545, 7161, -9123, -23817, 5715, -13470, -27261, -12735, -633, 15806, 20998, 51853, 57643, 50141, 40140, 31685, -4157, -22714, -19607, -28896, -23619, -32845, -26443, -15042, -13034, 28395, 58631, 56846, 49842, 30650, -2905, -11912, 105, 19330, 5612, -24638, -19656, -19249, 1102, -27045, -60576, -50031, -13206, -20790, 7491, 46863, 17329, 4550, -3819, 18315, 25269, 38362, 40309, 12461, 17804, 22495, 30191, 37833, 45095, 41681, 32545, 5341]
26429E341m785o222j1614o381j014N232K6851K6571j3043n222j7942k9732M274
26416b7686p960J160J2096J2672o706j2989J850P097j5628O821K1054L510O215
26403A506j9286J1812k1805m45M854M265Q615L2525j5265Q821k264j6274j9716
26390b2657J8578P354K3870j3765j271p241J2127K1751k2434r352K1034K3231
26378E1225l3404j8368K5270j5532k8264j1350j8056K4532K6638J5548J4842l1116
26366A965j5364R362K9015J374J6311J4128j2201j7079l633J1795k4114R039j0685
26353I913k6217J0676K5156K570K700O760L148n2781r455K2614J7920k5366n249
26340a7611J8438K3596L739n851K5762o514k0323j0169j7848L034J8848R613k9849
$$ y = [5341, 556, -5666, -17280, -23661, -24675, -19443, 7408, 33979, 20936, 15714, -2228, -31960, -27686, -35646, -34486, -22390, -9718, -16424, -29413, -27563, -20466, -36094, -29273, -8219, -4709, 1506, -17780, -5968, -27773, -28218, -23364, -19099, -10484, 22041, 6776, 15597, 13333, -2941, -22657, -4079, 3275, 27145, 13380, 12109, 4868, 16995, 38746, 16312, 6960, 27994, 51225, 17821, -547, 24723, 9191, -19073, -30423, -48479, -23947, 2691, 18239, 33081, 1965, -13399, -4037, 24978, 26352, 42663, 56791, 44590, 27511, 23878, 35673, 11559, 20598, 9913, -16304, -5628, 19528, 22098, 24798, 31558, 34706, -18075, -27530, -4916, 13004, -12362, -17611, 827, 24423, 28162, 22311, 48073, 41559, 21236, 11067, -6781, -3747, 15101, 24714, -5135]
26327e135O667M041J0215k049j3619r726p8M827K2805J9474n196m2803j8498p991
26313c7066j4222J7274J0416j9833J2398Q516r418Q916L4718k0836l9065r791
26301e7993l714J3439K5650j2368l3756L2480L1470J3412J9651J8354n345o659
26289C4621q569l0129J9121L8191J5811m7342k2002K5899M853j2859j6531M0339
26277D1403K550j9815k1248l0694Q291r87r224J591O843K2983L7934p734m503
26264B7390j3760j776l7238O566o350k1470m179j2076L2128j0450o867m705R037
26251d3750N3563M3195m5952j6486j7447J756P197J1750N329j0177J197j6711
26239b6536j1452J2009q292o281l0662R111J7998O134j5749k055p850R157L9482
$$ y = [-5135, 1532, 5573, 15788, 13739, 120, -9606, -9684, -4857, 17948, 37422, 32226, -10577, -29075, -37066, -51288, -34014, -23598, -43431, -31033, -22517, -31935, -23019, 11699, -9137, -48202, -57993, -61707, -48268, -22618, -34986, -68742, -36262, -4792, 8620, 28271, 46625, 41280, 34621, 26052, -4077, 15044, 53235, 69046, 21704, -298, 25601, 30454, 17595, 1064, 41403, 43953, 24138, 2890, -27804, -19513, -20500, -29724, -28133, -21290, 1693, 39627, 31893, 27390, 13630, 11854, -25384, -18818, -25168, -46638, -50817, -62893, -30765, -41215, -48082, -52787, -43750, 9813, 53008, 7056, -9430, -26877, -25121, -17924, -6174, -845, -11022, -9825, -26536, -37988, -25979, -34271, -40552, -71214, -62103, -44105, -37971, -53720, -55775, -63625, -54468, -14986]
26226a4986K6070j7162j3688J5170K0046k763M137L5089L3595m75N84l3094j3784
26213C8739j4716L889k446l3901k650K5287K0118J5064J4615k3637j1562j5703
26201A3097k5103k738K207R186L3280j0633l7538k075p025j0063N987K9893J1898
26188A0373j3685M160k2504N789j5110J5623J7206o143j4594r225Q678R584k0970
26175c0818N2288K9271j8035k8406k7151M084K1402l30K029j4653k1732J5128
26163a6923j9911r217L5216J0106J0461M073l1170J23J8673k293J5262R417k115
26150B1702J2307m642p990M215J5506l717k5090J0016m023n795P542J2952K7167
26137F0150l099j6714p3987l2409K5386r426L77j061j5829j0495O304J1284Q522
$$ y = [-14986, 11084, -6078, -19766, -4596, 15450, 12687, 16824, 51913, 85508, 85033, 85617, 52523, 38739, 24023, 27912, 25466, -8435, -11085, 14202, 34320, 49384, 63999, 40362, 28800, 13097, -12006, -14744, -12537, -3351, 29929, 19296, -18242, -20317, -27342, -37405, -31418, -1525, 10373, -3312, 848, -21656, -15867, -30977, -15354, 1852, -4291, -18885, -28110, -19432, -9848, -30818, 21470, 50741, 32706, 4300, -22851, -18767, 2635, 2305, 4334, -10319, -32051, -16923, -36834, -46051, -10835, -729, 9732, 13805, -17365, -17242, 1431, -862, 14400, 23817, 21702, 34009, 29367, 21377, 25592, 41098, 37381, 12291, 22307, 18284, 12489, 20031, 32983, 60150, 57051, 40337, -33650, -66059, -40673, -50099, -49722, -50783, -66612, -77107, -70803, -59519, -50997]
26124e0997o13J4126M8453j5229j3211K055m534P238J6760n54q029M026J5468
26111A4959j4114L959L83j8949m184K4883J0101J3668l910k4843l790l962O49
26098e150k3751J7220K6742J1194j4006m3496k9112N492K8396L6356J5776J0785
26086C6446j9236k8704N721L5387J173Q296j1516j8024o304P354K986r116q617
26073d154R621N856K1725J34k946m018o477j7907l88N348J3897P281J5816p539
26059C6249j3594l9268j9805k32L7172K1244j4085K4002j9583q802J3076k720
26047A3654r21J3238P448n846j0436N991r435j1586N164m447r54O317q444k2101
26033b2358K6220K529k6079l5375l5020J1410M9134K433O31K6590m436o83k3394
$$ y = [-50997, -51610, -37484, 10969, -4260, -17471, -15416, -19950, -12712, 4048, 3494, -4535, -509, 14959, 845, 4804, 5187, -13762, -17946, 6937, 17038, 30706, 26796, 1953, -1837, -5799, -5150, -28901, -11681, 15061, 26255, 12249, -31247, -60359, -54867, -26471, 9885, 25661, 36446, 17210, -11494, -5773, 29614, 30787, 39083, 27567, 9543, 3239, 10593, 13579, 4463, -4154, 5467, 11323, 33048, 33182, 30236, 26218, 19741, 1834, 1446, 6794, 20691, 27972, 43788, 36249, 22655, -16613, -36418, -36650, 522, 21766, 7681, 31683, 12100, 3298, 16374, 13654, 12733, 25971, 33419, 27573, 17137, 23128, 13693, 2107, 7271, 2824, 1870, 8187, -257, -22358, 3862, 6391, -19688, -55063, -90083, -78673, -29539, -27106, -26475, 115, -4321, -5004, -28398]
26020b8398k6682J6109O444k144O928N316p780J3400j124L7176M200q451J4375
26007B9369n238j0810q505m5203p549L4953L7085j9904M640P342r499l2071m5574
25994g0964P510L4125K909o589Q278M068n732l6495j518n60J6456J1031Q251J0215
25980a9015j5681J6844J0562J8572k1403L961L3943J1457k0441k977k7635k2367
25968c4180j7451J8601J9152J7753P46l1103k3871j2397K1886J9152n391R438
25956a7665K3760J8608q606k4552M805O131j9929k0670k7921K3907L7205M395
25944e32l5058q933L4219L3312m5789j1960K9152M1915l501j5435j1361J1359
25932A7388R06l0348k3672J3058J607k3734j8618l5134R615n203J0279N36p427
$$ y = [-28398, -55080, -38971, -32527, -34671, -27743, -22427, -30207, -16807, -17931, 19245, 23445, 14994, 29369, 24131, 13321, 4816, -40387, -47936, -12983, 24102, 4198, 8838, 16180, 6681, -25390, -70964, -63454, -29329, -26420, -33009, -24731, -20663, -26395, -62890, -64408, -64968, -48512, -37481, -29230, -19015, -34696, -17852, -7290, 11282, -10121, -6160, 27783, 39240, 18799, 15822, -11813, -34180, -51631, -33030, -13878, 3875, 4621, -26482, -50353, -62750, -40864, -21712, -27103, -17665, 6095, 24703, 16097, -8455, -3650, 2481, -17448, -38118, -66039, -42132, -4927, -532, -35590, -44523, -10304, 23008, -22781, -34741, -5589, 36326, 32825, 17390, 6029, 17388, 18294, -12054, -35726, -22668, -21061, -44795, -63413, -98547, -88932, -94135, -83856, -83320, -90747]
25919i0747L5528M5695O0402j9826l5822J3675j1715m1248p914J6544J2575j380
25907b4233j1276l932M155P171K5426K8726k426K0259P180k5829r512P264l874
25894A9099k8952J6453K6837R729j8294j7151J5285N100J8211j7770o86m3840
25882a5979n155K5203j7255k686k609L1264L2688L186k7384j5648l88O589M2714
25869E4540J8560l4148k3383l766J3792J7313N821l1236K767M2749J6410l4239
25857D5180k3559j3065N238r082j637L0622L0060l273l0946M237J7065j073O674
25844E6441N216J4879P837p794j0211J95j6988r186J9830J0934j5916j5216l7059
25831B962J7707K7255J975m1950k0261k1360J7432L2532J7920j0603k5658n913
$$ y = [-90747, -55219, -9524, 50878, 31052, -4770, 8905, -2810, -44058, -51972, -35428, -22853, -24233, -35509, -39441, -35286, -28115, -2689, 26037, 23611, 43870, 51050, 25221, 15709, 22973, 19099, -9853, 6600, 33437, 43166, 24872, 7721, 23006, 28106, 46317, 28547, 27861, -15979, -21134, 4069, -13186, -15872, -18481, 12783, 45471, 48657, 21273, 5625, 5237, 11826, 54540, 73100, 38952, 15569, 11803, 25595, 42908, 48729, 17493, 20260, 63009, 79419, 45180, 21621, 8556, 13794, 4712, 3075, 33697, 63757, 60484, 29538, 33775, 50840, 49767, 56441, 61657, 76536, 84373, 76579, 66368, 66563, 49575, 40389, 60219, 71153, 55237, 40021, 2962, 20669, 47924, 49899, 7949, -12312, -33672, -16240, 16292, 34212, 23609, -2049, -7962]
25819g962N937j9168j2641J7034L8012J2763J5819N454l7617k6272L0409j5453
25807F315Q316n431J3872K7047K1561j0499k2837k1024J3128j5796m0012r649
25795c5009q49o517K057J7149j2705j5696n506P139k1486k345k5978n162k004
25782a06912L8669L4470j6547Q287Q698k912N651l053J0368L7395J9113N191n9689
25769b1271n2791m3472p926K5738J3280L0794M318o985J2209j4230k7007L845
25757h3498J2705j9656J5368J6458J1352K1557M135j0400r817o236j8366M668
25745f1730K3275J0295m762j3797l266J9910J8524K4247o826j7407r956k231R392
25732a4332Q436j0559P698O063N791P048k632m868j2918k5206j8747j0183L4762
$$ y = [-7962, -2025, -21193, -33834, -16800, 21212, 33975, 49794, 55248, 17631, -8641, 21768, 6315, 14631, 9200, 23072, 50119, 71680, 61181, 38344, 17320, 30448, 14652, -25360, -35009, -35858, -42375, -40318, -23169, -35874, -51570, -57076, -49937, -71423, -73768, -99746, -104908, -106912, -68243, -33773, -50320, -42033, -33335, -36247, -30596, -33649, -23281, 14114, 33227, 38418, -21271, -74062, -117534, -125460, -99722, -86442, -55648, -51330, -58315, -46106, -60336, -87343, -83498, -70793, -90449, -75081, -58623, -47271, -25714, -21579, -31979, -41796, -48032, -66398, -61730, -38455, -28160, -32922, -46719, -49985, -30075, -11551, 12696, 5870, -11537, -21493, -23724, -14332, -5896, -16455, -8757, -2694, 3097, 10145, 7513, 2645, -10273, -35479, -54226, -64409, -29647]
25719b9647J6857J2124J0483r834P755o775Q058o799k8634m755K6901n713j6230
25706b6209J3440J9363n816j1336J009J7013J0942O632J6283j9735k5026n1503
25694e4943O116J9597k022J0458J7024R771K552k6729K5286J5777K4093o87n147
25681D1146l5173n142l399l481l6024k9199j806R337j3682r896K5377o975R488
25668e9429K7987J4045R350l6J0850j1454J77j035K7857R271K5941L689j9857
25655C7356k3237j7425K3972j9253J8978K4612l400n1902k8847J6902K9096j0495
25643c643k6081L2312L3687j5570j8140J0105o052j3704Q584K5542L0228j3497
25631D3771j0771l596j2262j7498K083K4098k7604l6835O472K3409J3523o073
$$ y = [-29647, -12790, -666, 9817, -17, 7738, 963, 9021, 2222, -26412, -31167, -4266, -9979, -26209, -12769, 6594, 778, -10558, -9549, 7464, 18406, 25038, 41321, 21586, -3440, -54943, -48827, -29230, -31252, -20794, -3770, 6001, 8553, -18176, 7110, 22887, 46980, 46293, 41146, 5973, 831, -2568, -6049, -42073, -71272, -73078, -63741, -77423, -87319, -61942, -68917, -59429, -31442, -17397, -8047, -8083, 2767, -8687, -8510, -9545, 18312, 27583, 53524, 57213, 37356, 14119, -3306, 20666, 1413, 20391, 45003, 41603, -10299, -39146, -22244, 6852, -3643, -29724, 2588, 36275, 20705, 2565, 12670, 6618, -7086, 1498, 27040, 57268, 43771, 33000, 29404, 17142, -356, 1727, 25825, -1779, -38614, -32142, -8733, 4790, -1283]
25619a283M426M4497K072r018Q588J2682l579J5729k4914m3395j7044R186p758
25606i811l1619K682k9533l0528O466j7289K8030K5713k8967j7267l1874j8913
25594a52910o699L7456K5780L6989J7670j4284K8193R727j3317p140K0192N352
25582a2991J895q023k2577p15j0945J4886K6490J2804j1519k4634k3201K5321
25570c3209M8562j7391l2849k4071p517J0506K664J3765K2740j7880j3987J6008
25558c2659j1630k3061J2690J0668Q39K3825J4194j370j099k492l802P15k0682
25545c3864k1478K5544J7006K3676J4288l8693J0321K0032j4103J8265l580j9757
25533b343m2577m2875m2137J1095K5969L7266j7280l0090J5048J0044K2111q667
$$ y = [-1283, 3143, 47640, 49712, 40694, 49282, 61964, 58385, 74114, 49200, 5805, -11239, -2053, -9811, -41430, -38748, -68281, -98809, -92343, -109632, -81602, -55889, -84856, -102123, -133997, -152910, -159609, -122153, -96373, -59384, -41714, -55998, -27805, -18078, -31395, -38535, -18343, -12991, -11096, -19119, -41696, -42411, -53356, -38470, -11980, 824, -10695, -35329, -58530, -33209, 15353, -2038, -34887, -58958, -66475, -55969, -53305, -39540, -16800, -34680, -48667, -32659, -44289, -67350, -54660, -43992, -43153, -19328, -5134, -6504, -7603, -10095, -13897, -13182, -33864, -55342, -29798, -12792, 10884, 25172, -13521, -3200, 16832, 2729, 20994, 17414, -2343, -44920, -87795, -129932, -118837, -92868, -55602, -72882, -102972, -87924, -77880, -55769, -64436]
25521f4436K648P920J4211O665J611m700j0624n310l259J1393M1016J4102N1927
25508F3164J6368m2321k673J810J5471J3397L132p379j6616k045K6126p582k6145
25495C4707q188n521J2854N747k2620j6318l0047J1090K1259J5952l285K2080
25483C7710M6467R356N789n957j0540l1601m801J5121k4481O335P301K2032L0508
25470A03239O984J0749L7524K2923R845k560j8208k4306p935L7898j920j4109
25458A60124o651M528k4211n2565m8669m6822m057o164Q306J6339L2939p533k5304
25445B60M457m373Q03j4829n5202o754j6906J955k79J4137K1310J9369L4470J1123
25431I541J7101L4980L5235L6925j7067j764j1218l320q531k3685j6761k0061
$$ y = [-64436, -61788, -53868, -39657, -32992, -31381, -36081, -46705, -52015, -55274, -43881, -2865, 11237, 63164, 79532, 37211, 34538, 36348, 51819, 65216, 68348, 60969, 44353, 42308, 68434, 60852, 34707, 26519, 20998, 33852, 39599, 16979, 661, -29386, -18296, 2963, 18915, 15630, 37710, 84177, 93533, 99322, 93365, 82825, 51224, 46423, 61544, 37063, 43398, 50699, 72731, 103239, 110223, 120972, 158496, 181419, 191264, 188704, 170496, 146190, 138255, 176153, 174233, 160124, 153473, 158001, 133790, 81225, 32556, -14266, -18323, -24487, -16181, 158, 33097, 25564, 260, 4717, 344, 1147, -13682, -68884, -75638, -92544, -90589, -90868, -76731, -55421, -36052, -1582, 9541, 26642, 61622, 96857, 133782, 116715, 114951, 103733, 100413, 91882, 68197, 51436, 31375]
25419C1375l1825k795n402N366K1768p343j1789J2257Q94R988J5996K4097m777
25406E7810j7291k349k7005l6097k5644J0967N669m827J3177J9820M7650M3865
25394H5745O224l1322m3044j1890r762k8698P344J7501K8659n025j0999J3215
25382A7948J6130J8052j0571J4091l1422l853j1582J1073r659q485L5501J0297
25370D7520K7712L332j2247n802k1240p306m609K1174J912j9067n9336k9716j3047
25357g0720k319j2310l2751l6577j7976Q500K1015J3705r139J1644j7589k6134
25345a70651K1758L8339M598K8401M2089k127n1545j7782k3676o086k4140P945
25333a52877L37j6800K3980J6581r942j6382K6043j2105k429K5781J7284p702
$$ y = [31375, -450, -3245, -8647, -3281, 18487, 11144, -645, 11612, 12506, 22494, 38490, 62587, 57810, 40519, 38170, 11165, -24932, -50576, -39609, -33940, -38767, -25590, -5770, 41880, 85745, 91969, 60647, 17603, 5713, -4049, -32747, -25403, -7902, 20757, 15732, 4733, 17948, 34078, 52130, 41559, 55650, 24228, 20375, 8793, 19866, 10207, 1722, 37223, 47520, 75232, 78564, 66317, 60515, 39275, 31969, 27360, 48534, 50446, 31379, -27957, -57673, -70720, -73039, -85349, -118100, -154677, -172653, -164153, -143138, -129433, -138572, -126928, -144517, -170651, -148893, -110554, -105956, -77555, -35466, -37593, -89138, -106920, -130596, -136682, -160822, -152877, -152540, -169340, -145360, -128779, -138721, -155103, -129060, -141165, -143594, -117813, -100529, -108231]
25321a08231K7629L5342J9504L8082M3205J4850R978J2660k1042r479O475N152
25309G4125K2746L9804L0942K3007K8137L504K7606J7402K3891k229O106L5504
25297C30545q129N071N972j6157n7555n7362n4611K990K264q252J6266L5541N0218
25284B46801M6917J2974k206q472J5656J145P591j3229p906K4239J543k0178j6002
25271B88873J0578K2747J3260k3378L56r726j6510l4186k4005J3237J8031L4288
25259B93565N0296n938o845J1914j3827j548J4089N314J5851L1280N2053J3839
25247D60043L218o164L0654j9903l6150k3996m1872j0688j4810l7432l4168j1957
25235B56775l850N560k2330k8682j0466J5832J3245K5964N479K109M656m2003
$$ y = [-108231, -80602, -45260, -25756, 12326, 55531, 70381, 80359, 93019, 71977, 62498, 68973, 74125, 96871, 136675, 167617, 190624, 218761, 222265, 249871, 267273, 291164, 288935, 295041, 330545, 322416, 327487, 333459, 317302, 259747, 202385, 147774, 150764, 153028, 144776, 161042, 196583, 246801, 293718, 306692, 304486, 296014, 311670, 312815, 320406, 307177, 299271, 323510, 325053, 304875, 288873, 299451, 322198, 335458, 312080, 312436, 302710, 286200, 252014, 228009, 241246, 259277, 293565, 343861, 337923, 331078, 342992, 329165, 327617, 341706, 347020, 362871, 394151, 446204, 460043, 463261, 457097, 487751, 467848, 431698, 407702, 365830, 355142, 340332, 302900, 268732, 256775, 252925, 258485, 236155, 207473, 197007, 212839, 226084, 252048, 257527, 259636, 264292, 222289]
25223B22289M06K4322n410j4781N483K091j6862l4326p6091p4689m8455n4830
25211g0853o5835n1641q7950o3726k6459l0157k7085m3818l9156j8948J1200k2899
25199e37327m2190j263J8585r113o666l7129m0999M046L7659N454M5549O5867
25187d97527P2583N6357K9823M7464J2891M3671M0797O9792J36602Q6318M8156
25176A46927O3053P2411M0222M4102L2499k0408m3829l8809k664J0066N2772M6732
25164D03074Q0078N7700N7549N9352L4573m6060l9597l3921j4191k4608j2133
25153E21816L1813Q081O430K678l0924n898p213R760J0834J783j888j0401k9786
25140E07085q68l4465m3609m7389P577M3897O5174K4888L4967M277k8438q9831
$$ y = [222289, 222695, 247017, 241607, 226826, 232309, 234400, 217538, 183212, 107121, 32432, -16023, -70853, -136688, -188329, -276279, -340005, -366464, -396621, -423706, -467524, -506680, -525628, -514428, -537327, -579517, -580780, -562195, -571308, -577974, -615103, -656102, -652056, -614397, -608943, -563394, -497527, -424944, -368587, -338764, -291300, -278409, -234738, -193941, -124149, 12453, 98771, 146927, 209980, 282391, 322613, 366715, 399214, 378806, 334977, 296168, 293504, 303570, 356342, 403074, 483152, 540852, 598401, 657753, 692326, 646266, 606669, 572748, 558557, 533949, 521816, 553629, 561710, 568140, 570818, 539894, 533996, 526783, 536543, 547377, 549160, 547272, 536871, 507085, 506217, 471752, 428143, 380754, 388331, 432228, 497402, 522290, 557257, 561534, 533096, 443265]
25128D43265j62237j74073j30300o3287k1720N5261J29011J77714J64250J30543
25118E48427Q4076O5209N5836J9140M0310P4178J8477k2721m2979p9496q4849
25107F75608p6961j8504K7462P7176J03187J08797Q6420P4482N5149j6483l1198
25096A065135J4441M5830K3241N7599M0503M3443M3857M6309J9597M9506K2506
25085A471967R001J853j8355k4785p8863j22289q9484j3883J7131L3981O0208
25074A246482N0106Q2630J37926J53938J72070J35932J29553J11285J18968P8240
25064B417130O0724M2880R6368J43870J67771J84286K25912J65508J57873J10753
25054C773075J61874J66251J32686O1388m8520j34770j46826j13281l3504P6104
$$ y = [443265, 281028, 106955, -23345, -86632, -108352, -53091, 75920, 253634, 417884, 548427, 632503, 697712, 753548, 772688, 812998, 887176, 905653, 882932, 839953, 760457, 675608, 598647, 580143, 607605, 684781, 787968, 896765, 983185, 1057667, 1112816, 1096333, 1065135, 1079576, 1125406, 1148647, 1206246, 1246749, 1290192, 1334049, 1380358, 1399955, 1449461, 1471967, 1480968, 1482821, 1464466, 1439681, 1360818, 1238529, 1149045, 1135162, 1152293, 1186274, 1246482, 1296588, 1379218, 1517144, 1671082, 1843152, 1979084, 2108637, 2219922, 2338890, 2417130, 2477854, 2520734, 2617102, 2760972, 2928743, 3113029, 3338941, 3504449, 3662322, 3773075, 3934949, 4101200, 4233886, 4295274, 4246754, 4111984, 3965158, 3851877, 3818373, 3894477]
25044C894477J59125K06340J14900N0289N3660J17025K03232K30306K91514L90977
25034E711845M51170N63366N83219N72900O07846N95626N25519N43925O91539
25025A0846955Q10840Q96114R33621R62890J091195J246395J447734J643681J951521
25016B1830946K375782K845810L284171L883515M679366N659565O852824Q392523
25008E9804502J0402173J2742009J5799846J9972775K5178192L0890055L6347161
25001B11136713M0161975M0158073L2296999J3585366r041348k3423496k6998969
24994B77875313k4388434j9822164j6092821j4626103j5439616j7094437j7944657
24987A52467081j7315161j5983274j4523986j2857874j1036437r274521p846172
$$ y = [3894477, 4053602, 4259942, 4374842, 4425131, 4478791, 4595816, 4799048, 5029354, 5320868, 5711845, 6163015, 6726381, 7309600, 7882500, 8490346, 9085972, 9611491, 10155416, 10846955, 11657795, 12553909, 13487530, 14450420, 15541615, 16788010, 18235744, 19879425, 21830946, 24206728, 27052538, 30336709, 34220224, 38899590, 44559155, 51411979, 59804502, 70206675, 82948684, 98748530, 118721305, 143899497, 174789552, 211136713, 251298688, 291456761, 323753760, 337339126, 328297778, 304874282, 277875313, 253486879, 233664715, 217571894, 202945791, 187506175, 170411738, 152467081, 135151920, 119168646, 104644660, 91786786, 80750349, 71475828, 63629656]
24980F3629656o809139o135030n618491n178034m590704l763830k831486k072223
24972B6630719j591753j384957j287241j309387j298723j205124j086143j053688
24964A6413703r72446r42431q04284p19448p42143p76418q27404q47149p96844
24955H985136p46732o17498n33400l95836l49857l69620m20280m54918m92114
24946D604881n02399m35664l84814l53199l72996l55502k86557k33867j37668
24937A542215j04233q8371o0079o4032r3586j17351r0669p1371o8485n021J26666
24926I05683J93865J76016J76240J30528Q9325M5508R233k2419o1635p9826j09418
24915A453100j06177r1492j00094r1700q8880o0518k2872J7035j2740m2739p8147
$$ y = [63629656, 56820517, 50685487, 45066996, 39888962, 35298258, 31534428, 28702942, 26630719, 25038966, 23654009, 22366768, 21057381, 19758658, 18553534, 17467391, 16413703, 15441257, 14498826, 13694542, 12975094, 12232951, 11456533, 10629129, 9781980, 8985136, 8238404, 7620906, 7087506, 6691670, 6341813, 5972193, 5551913, 5096995, 4604881, 4102482, 3666818, 3282004, 2928805, 2555809, 2200307, 1913750, 1679883, 1542215, 1437982, 1349611, 1289532, 1225500, 1131914, 1014563, 923894, 852523, 784038, 779017, 905683, 1099548, 1275564, 1451804, 1582332, 1671657, 1717165, 1726398, 1703979, 1642344, 1562518, 1453100, 1346923, 1255431, 1155337, 1063637, 974757, 914239, 891367, 908402, 895662, 852923, 774776]
24904G74776m6352L0545L5597N5610O8604O3979O3860O8106Q6132J07336J13441
24893A421634O5219j8500p1721j42346j75162j89830j30046o7554l1923l8060
24883F21711o0199n8990o7552q1832n4113R360K1447O8311R3579J54918J75526
24872H22166J38843Q2063O5933Q866n6027n3725o5260l7225R620J7213K3180p448
24860I48199n092r195Q5l1193l2655k6047k9579l7931m3487o2539p0953p7366
24848E22247l6100o4721j00615l0079p895k951l3962k7476k3667l3218O545p854
24836A60254J1180L2069K6382M5205P798q002j6792l465J3563K3971J4819J2916
24824C19898P106J5712J8573M2525M4624N1790K6835K3112K7813M7588L9883N3534
$$ y = [774776, 728424, 758969, 794566, 850176, 918780, 982759, 1046619, 1114725, 1200857, 1308193, 1421634, 1486853, 1468353, 1396632, 1254286, 1079124, 889294, 759248, 691694, 659771, 621711, 561512, 502522, 434970, 353138, 299025, 308385, 329832, 398143, 491722, 646640, 822166, 961009, 1043072, 1109005, 1117871, 1061844, 1008119, 942859, 905634, 915254, 932467, 955647, 948199, 943107, 933912, 933997, 902804, 870149, 844102, 814523, 776592, 733105, 670566, 599613, 522247, 486147, 421426, 320811, 290732, 282837, 279886, 245924, 218448, 194781, 161563, 168108, 160254, 171434, 203503, 229885, 275090, 282888, 274886, 258094, 254629, 268192, 292163, 306982, 319898, 327004, 342716, 361289, 403814, 448438, 500228, 527063, 550175, 577988, 625576, 665459, 718993]
24812G18993O2453N7129O2162N5396O9196M0871K1226M8715K9383j3561j7021
24801A134942j4400k9934n8229l2422K7112m569p309j5776j2970l1528o5835o6073
24789H23009m8840q1788o5210o6961q0059n1128l8058m4579o2501l7775q390k4677
24777B13043k210J2861l4664m3945k7457k3449k9341l3291j1819N593J1903o64
24765C6560J5481O075J2509n023J2254M5649K6009K7259o128L4336K4107J9648
24753B48736k0151Q011p516m6454r278K4921l3378k1527j4190K0140l2418l0993
24741H5903n665L003j899L713J275L345Q850M274P948J6080J3526l0838j4012
24728I5503j0328j4436j3566J7857Q327j4071j9131k2405j9115n8678k0092m168
$$ y = [718993, 781446, 838575, 900737, 956133, 1025329, 1066200, 1087426, 1136141, 1165524, 1151963, 1134942, 1120542, 1090608, 1032379, 999957, 1027069, 1022500, 1015191, 999415, 986445, 954917, 889082, 823009, 774169, 692381, 627171, 560210, 480151, 429023, 390965, 346386, 283885, 246110, 237720, 213043, 210833, 223694, 189030, 145085, 117628, 94179, 64838, 31547, 19728, 25321, 37224, 36560, 52041, 58116, 70625, 65602, 77856, 123505, 149514, 176773, 170645, 204981, 229088, 248736, 228585, 236596, 229080, 182626, 173348, 198269, 164891, 143364, 129174, 149314, 116896, 85903, 80238, 83241, 81342, 85055, 86330, 89675, 98525, 102799, 110747, 126827, 140353, 109515, 95503, 85175, 70739, 57173, 75030, 83357, 69286, 50155, 27750, 8635, -50043, -70135, -74303]
24716g4303l8846k6834J241n612J8826M2308M9010J4562O877J3583O757j4228
24704f659m1046k2273Q552k0839j9948k7084m4913J3499J6918L0136R2146O4521
24692D3010L1188R759O223J329j7172J4845L4984K9655K3131K744k9360l1801
24680A18535K890K2917P408o010j57L5100J9362R973K0140J6566k7123J125J8156
24667B38882j179l4336j1432J3104J6915J0490K090J1179j0013k3646L8075M671
24655B54800n172q341j7460l2030J6505P233R269j2858k2330l6359l1134o557
24643A15566O763J6870j5077k2592j3618P10K8542K689l5155l5438J0244j048
24631E8456j660L7835J4147J4640M2596K8146m532k0239k2898p182M496L3135
$$ y = [-74303, -113149, -139983, -138742, -144354, -125528, -83220, -34210, -19648, -12771, 812, 7569, -6659, -47705, -69978, -61426, -82265, -102213, -129297, -174210, -160711, -143793, -113657, -21511, 43010, 74198, 83957, 90180, 91509, 74337, 89182, 124166, 153821, 176952, 179696, 150336, 118535, 121425, 144342, 151750, 145740, 145583, 180683, 200045, 210018, 230158, 246724, 219601, 220726, 238882, 237703, 203367, 191935, 205039, 221954, 232444, 234534, 245713, 235700, 212054, 250129, 254800, 249628, 241287, 223827, 191797, 208302, 215535, 224804, 211946, 189616, 153257, 122123, 115566, 122329, 139199, 124122, 101530, 87912, 88622, 117164, 119853, 84698, 49260, 59504, 58456, 56796, 94631, 108778, 123418, 166014, 194160, 189628, 169389, 146491, 139309, 143805, 176940]
24619A76940K0747J9659l748j3490k0135M570l4542k5613J2407j2303K303Q566
24607A35361K4847J6536k1224l4936K0967j6962M12r050o684J6947P523K0228
24595A53965R124J2041Q834k1541m970k4039N134P115R935N598j0272R197k1993
24582A38128k0566m4261m3247m242K6970Q382L904j0758j3462o710j7248j4399
24570B491k3422n44j2434l5310N035M7498J3211j128J7409J5005L541J5082J7091
24557F3525M1318L8400k5410l8792j0683K5533L4050P555k4180K4372k259J2985
24545A46414M6175k4003j5101j5860k6214l3151m2205j5461O997o804j5002p986
24533b201j951k4162j3852j9039M429n05K4299m581k0045j1217j5780K2818N985
$$ y = [176940, 197687, 217346, 213598, 200108, 179973, 184543, 150001, 124388, 136795, 124492, 126795, 135361, 160208, 176744, 155520, 120584, 141551, 124589, 125001, 115951, 109267, 126214, 133737, 153965, 163089, 175130, 183964, 162423, 157453, 133414, 138548, 145663, 155598, 161196, 150924, 160121, 138128, 117562, 73301, 30054, 25812, 52782, 61164, 65068, 54310, 40848, 34138, 16890, 2491, -20931, -21475, -33909, -69219, -64184, -16686, -3475, -4603, 12806, 27811, 31352, 46434, 63525, 104843, 143243, 117833, 79041, 68358, 93891, 127941, 135496, 111316, 135688, 133429, 146414, 192589, 168586, 153485, 137625, 111411, 78260, 36055, 20594, 27591, 20787, 5785, -2201, -4152, -28314, -42166, -61205, -56776, -57281, -32982, -37563, -57608, -68825, -84605, -61787, -55802]
24520e5802j2685j675j920j2070J0834L1384M7788L1653p094N931M342M293j485
24507D3494j4379r04J6436O274r120k272k102k7853k0607k0112K0776K017K8706
24494B0354K7323K3829K4898J3319L204l1962K558n238Q611J6701k6903j4001
24482F2693q003K6066k536J2804J5642K4066K5544J5505j1113J1756l389J2144
24470A81179J4894k9127k2488p475j4187o940K711L3193M460k985k6788k8061
24458I8386k9649O971K0271l0451K2783n836n1923l5446j3379M205O37M5354q812
24445B3111n6606K5611O312K483J076M188J7572q577m627J2848q532r06L8173
24432E2126M0724k8014m2105M663j409M099J0217K3675k662J5257l597j8277l550
$$ y = [-55802, -68487, -70162, -72082, -84152, -73318, -41934, 5854, 37507, 30413, 36344, 40686, 44979, 43494, 29115, 28211, 44647, 50921, 41801, 39529, 37427, 9574, -11033, -31145, -10369, -8352, 20354, 47677, 71506, 96404, 109723, 112927, 80965, 83523, 78285, 86896, 103597, 76694, 62693, 54690, 80756, 78220, 91024, 106666, 130732, 156276, 171781, 160668, 172424, 169035, 181179, 196073, 166946, 144458, 136983, 122796, 115856, 118567, 151760, 156220, 153235, 126447, 98386, 68737, 75708, 95979, 65528, 88311, 82475, 30552, -4894, -18273, -14068, -13431, 31923, 23111, -33495, -7884, -1572, 911, 1987, 6175, 23747, 15170, 10543, 23391, 14859, 13953, 52126, 92850, 64836, 22731, 27394, 25985, 30084, 40301, 63976, 61314, 76571, 72974, 54697, 51147]
24419E1147j2214K198p531P912J7557N679J1832L2835K0193k0k3343J0231O587
24406A23063J1997J7381j2062k0131j725K7536K6526j3924k6269K4249K5547j7847
24394A64341J2348j6934m9347J3186j7671k8451k9951O370K4182j0724O899k1210
24382E3038l5096M832J2683J0126m0190k0853O087J2119j8938j4141J6795K2655
24370I117j9401P67J0393j0921J1107K4721J3370P707M116k768K0564J3441J8498
24357A00711J5411k7863l5316k218j1642j4858J1150k3624J3430n201l71N764
24345B5373J8160M579j4296q331J6746L5106j5696j6126j2693K877J201p166l2355
24332b621j0343j4518j845K5800M850K6663K1370M859p105j2529J8873J573j5851
$$ y = [51147, 38933, 41131, 33600, 41512, 59069, 64748, 76580, 109415, 129608, 129588, 106245, 116476, 123063, 135060, 152441, 140379, 120248, 118523, 146059, 172585, 158661, 132392, 156641, 182188, 164341, 176689, 159755, 110408, 123594, 105923, 77472, 47521, 53891, 78073, 67349, 74248, 53038, 17942, 22774, 35457, 45583, 5393, -15460, -9373, 2746, -16192, -30333, -13538, 9117, -10284, -9517, 876, -10045, 1062, 25783, 39153, 46860, 50976, 48208, 68772, 82213, 100711, 116122, 88259, 52943, 50725, 39083, 24225, 35375, 11751, 25181, 19980, 19609, 25373, 43533, 48112, 33816, 25485, 42231, 77337, 61641, 45515, 32822, 35699, 36900, 29734, -2621, -12964, -27482, -29327, -3527, 1323, 27986, 49356, 54215, 47110, 34581, 53454, 55027, 39176]
24319C9176P754J757K2724p03j9149O058N91j3049N819l846J5451J4673n475J3324
24305H5105k0542k4383j1510K7606J1954l4708k0966J4665P54O580n558k2850
24293F147N090L2350m865k6503L9900M875J690R862K2616J175m1296q437K5307
24280F7911L211j516r285K305l717k7181n252L677k437l4097J1461K6947j5176
24267A6851K9298K7615L4215j1692k5107k3906k571k568K896j894L5040J9913
24255I8090j6651n2321J4145K6131J493n475n938q62j3765k2581J1565R143R3
24242D3067j4354O823M3219L1590j849l9130n556L2121J5372K776o010O568j976
24229A12661P874k0779l0151n9589n5488J7902L1120m07j6289J4422L0270J4998
$$ y = [39176, 46930, 48687, 71411, 70708, 51559, 57617, 58208, 45159, 50978, 47132, 62583, 77256, 71781, 85105, 64563, 40180, 28670, 56276, 68230, 33522, 12556, 27221, 27975, 34555, 28997, 6147, 11237, 43587, 38722, 12219, 52119, 56994, 58684, 68546, 91162, 92337, 51041, 42604, 67911, 71122, 69606, 60321, 62626, 58909, 31728, 26476, 30153, 27716, -6381, 5080, 32027, 16851, 46149, 73764, 107979, 96287, 71180, 47274, 44703, 42135, 45031, 43137, 78177, 98090, 81439, 29118, 43263, 69394, 70887, 65412, 59474, 58612, 44847, 22266, 33831, 42974, 43067, 28713, 35536, 78755, 110345, 108496, 69366, 63810, 95931, 111303, 114079, 108069, 114637, 112661, 120535, 99756, 69605, 10016, -45472, -27570, 3550, 3143, -13146, 1276, 31546, 46544]
24217D6544L4121J9583k3067k2675L0684J6660J3536j0395k8931J1190O108J3241
24205A06599k0946j4621k6308j6583J6824K1442l6265j0559K9084J095k6500l331
24193A9931N886J9406j6104J197L635o242j0303j5237K0142N012J649J6370K646
24180D7988l8328o557J2191J3283k6401p164L8795N166r268j0003q57o711j7946
24167e812n585j2455n888L511j6890J2775L498q557l2609j231L0224O1076J4291
24154C6348Q291j2960l9k519J5452k2312l2548j1161K306j3043M822J7736O648
24141b979L594k1801l1444l4318Q151M3841K5967K256K9730j2584p899L885j9590
24128a3191j6828o154J8896O664j4869J4123J1843j4322O222L0535J2014k6714
$$ y = [46544, 80665, 100248, 77181, 54506, 85190, 101850, 115386, 104991, 76060, 87250, 93358, 106599, 85653, 71032, 44724, 28141, 44965, 66407, 30142, 19583, 48667, 49762, 23262, 19931, 25817, 45223, 29119, 30316, 33951, 27709, 17406, 2169, 22311, 27323, 28972, 45342, 47988, 9660, 3103, 15294, 28577, 2176, -4988, 33807, 38973, 29705, 19702, 18845, 12134, -5812, -11397, -23852, -29740, -26229, -43119, -30344, -26846, -35403, -68012, -69243, -39019, 22057, 36348, 44639, 31679, 31640, 29121, 44573, 22261, -10287, -21448, -19142, -32185, -27363, -9627, -2979, 615, -21186, -52630, -86948, -78797, -34956, -8989, -6733, 22997, 10413, 2514, 6399, -13191, -30019, -36173, -17277, -10613, -25482, -11359, 484, -13838, -7616, 22919, 34933, 8219]
24116H219k4409j4407N616n775L1385q621L452L69n774J5154J9140J5772P040
24103D7161k4944j4352r148j4066o549r030m776L3036Q605n97p227L248j6325
24090a4964L949q359L205M6871K3771j5704j5162N795M055q879n722P733O916
24077C3505J6975J2798r021J4216o393n2544m152k4644j0646r292L5997J1268
24065H067K5771L4645k6892L323L928O38j8639J2915o642k1535k801K2711K0666
24052E6155k7722k4283k0576J2269J3836K4787J1972J6035L785k6003j3113o005
24040B1137n840O019j1305k4535k141L0361K3130m75n673j933k762J2844K5398
24027F4225L25j5558j4114J0771k7730Q604j209q456L2546j3048p364n383j8328
$$ y = [8219, -16190, -30597, -24981, -30756, 629, -7992, -4540, -4171, -9945, 5209, 24349, 40121, 47161, 22217, 7865, -1283, -15349, -21898, -30928, -35704, -2668, 5937, 5340, -1887, 1361, -14964, -11015, -19374, -16169, 30702, 54473, 38769, 23607, 29402, 33457, 24578, 18856, 26589, 33505, 50480, 63278, 54257, 68473, 62080, 9536, 5384, -19260, -29906, -39198, -3201, 8067, 33838, 68483, 41591, 44914, 48842, 49480, 30841, 43756, 37114, 15579, 12778, 35489, 56155, 28433, 4150, -16426, -4157, 9679, 34466, 46438, 62473, 66258, 40255, 27142, 21137, 15297, 21316, 10011, -14524, -16665, 13696, 36826, 36351, 30678, 28745, 25983, 38827, 64225, 64550, 48992, 34878, 45649, 17919, 26523, 25314, 16858, 49404, 36356, 28992, 23609, 5281]
24014E281J2952N2823j6271k9882k095j6309r063J9247o20j3057p165k8315J2236
24001b0238L0604J716m806J1360l0508m7560J5751K7266J5010j539P973K1214
23989B6243J9177K4074O54j0042k2719m2873k1820L0271m64J9140M1490J2547
23977G5678m0187l3508l726L1950K5461O360l4511j6952j7J1525K8377n384l7535
23964G531k3914J7632K1519K472Q181J0503J9810l9521o001o508j0937R39J6755
23951A8461J2141K0481Q998k0770j1956j4047j3594Q181p320J6935l082M700k9939
23938a0811l7704k644M3495L3759p649k7305j1858l1774J0808J3060J4988M380
23926i255k6846k169K1165M70N819q337j2861J6718K8093r393k042j4581J5680
$$ y = [5281, 18233, 71056, 54785, 24903, 22808, 6499, -2564, 16683, 16063, 3006, -4159, -32474, -20238, 10366, 12082, 7276, 18636, -11872, -59432, -43681, -16415, -1405, -2944, 5029, 26243, 45420, 69494, 70148, 60106, 37387, -5486, -27306, 2965, 2501, 21641, 63131, 75678, 35491, 1983, -1743, 30207, 55668, 62028, 27517, 10565, 10548, 22073, 50450, 45066, 7531, -16383, 1249, 22768, 25240, 33421, 43924, 63734, 24213, 18212, 11704, 767, 1706, 18461, 30602, 51083, 60081, 39311, 27355, 13308, -286, 7895, 575, 17510, 14428, 19128, -10811, -48515, -51159, -7664, 26095, 18446, -8859, -20717, -52491, -41683, -28623, -13635, -9255, -36101, -38270, -17105, -16635, -10816, -19153, -32014, -15296, 12797, 3404, 1362, -13219, 2461]
23913B461l594J3208m521k5844O5K8439J0700l0286R506K5522J3090J6072j3720
23900D1098m8647j3423J562j112j2717k1677K961M2240K5892O234j4829j6760
23888i178J0457N716q261P313J1480n139p4L8702J099j7075k3550J9077J4542
23875D5109j9657j9240j6183r436R164J9168M072j7418J6488J8861j7575j2841
23863E12o73K7277J098j213k7844j7084j2121q129K148J9190L95j88o956q441
23849c2029m085J8966k497j510R68N461P709j213j1000j5559N330K1364j3023
23836b1118j5176Q970K1460M054j7702Q105K4385r03j1666J6696P140M09J2920
23823C7574J6980r171k931J0025l2845j062Q272k514J0048j4544j812N273k8722
$$ y = [2461, -1133, 12075, 7554, -18290, -18225, 10214, 20914, -9372, 134, 25656, 38746, 54818, 41098, -7549, -20972, -19410, -20522, -33239, -54916, -51955, -9715, 16177, 22411, 7582, -9178, 1279, 6995, -1266, 6047, 17527, 12388, 12314, 51016, 52115, 35040, 11490, 30567, 45109, 25452, 6212, -9971, -19407, -10243, 8925, 12997, -4421, 12067, 30928, 13353, 512, -161, 27116, 28214, 27001, -843, -17927, -30048, -38177, -36029, -16839, -16444, -16632, -23588, -32029, -36114, -17148, -19645, -21155, -20187, -14726, -7017, -8230, -19230, -34789, -29459, -8095, -21118, -36294, -27324, -5864, -1810, -19512, -11407, 12978, 12075, 409, 17105, 24245, 24654, 37574, 54554, 45383, 42452, 52477, 19632, 18570, 26842, 24328, 34376, 19832, 18020, 23293, -5429]
23810e429r24J962J6149o941j5497j9002J4161N754N299N620J0412k887j3358
23797d681M303K67r667p080p163j1130K1418O557l1370o160o364J2724j2583J7800
23783c3129K6581M830p295K3381P722k4810r669J6912o630l4602K9270K7441J3443
23770C3445J484k4618j2400j9972j84P812K3331n550j6042L915K6489P598k3990
23757A318J1327N079j8804k0498j4776K6846Q908J0403j3874o808J4631M729K0921
23744B9402J4733J810l2087l5899J3343k1743j6079J5682R908L3387Q325K1876
23732D2658J7208P573m4326m725n982M300K8564K8130L232k7023j8093l9552j7064
23719b5100K410K977L697J4795o061J3014R914j0805l425q966k582J8297l88K1824
$$ y = [-5429, -6353, -4391, 11758, 4817, -10680, -29682, -15521, -9767, -4468, 1152, 11564, 8677, -4681, -378, -111, -9778, -16858, -24021, -35151, -13733, -7176, -38546, -44706, -51070, -38346, -50929, -33129, -6548, -1718, -9013, 14368, 22090, -2720, -12389, 4523, -2107, -36709, -7439, 20002, 33445, 34929, 10311, -2089, -22061, -22245, -14433, 8898, 3348, -12694, -8779, 17710, 25308, 1318, 12645, 17724, -1080, -21578, -36354, -9508, -600, 9803, -4071, -10879, 3752, 8481, 29402, 44135, 45945, 13858, -22041, -8698, -30441, -46520, -30838, -20930, 12457, 20782, 42658, 59866, 67439, 23113, 18388, 12406, 16706, 45270, 73400, 76632, 49609, 31516, -8036, -25100, -22690, -19713, -16016, -1221, -7282, 5732, 15646, 4841, 1416, -7550, -10132, 8165, 7777, 29601]
23705B9601O605o872l54P794j6548j4441j0142O628K6654r681K197K9000R55j4939
23691C6457m686m75r260j7470j9906Q357k2j4173l3819O153K5717J0548K8848
23678A6269k130k7697k1003R858L5547J2720j6566j9084o115J5537L4578j2991
23666A8923K63k1913j189j699L788J603o408k9129j3459K1238K4850J190J7215
23653A5273K6052j6182m7578j9176m204K7787J02k0582Q944M565J2831J7426k9751
23640b4493J2115K4133J2225J2276M42R562J057l78j8197m9043j9622K5105L0649
23627A5831N368l4436j1584j425K1377P598k891M59j4696L119K9585o679J3561
23614B5187l070l230J9201M542k7879J680k348r928k071Q593J2477k4176q351
$$ y = [29601, 36206, 29334, 28980, 36774, 20226, 5785, -4357, 2271, 28925, 19244, 21441, 50441, 51396, 36457, 31771, 31296, 22036, 4566, -15340, -6983, -7005, -21178, -54997, -48844, -23127, -12579, 16269, 14139, -13558, -34561, -24703, 10844, 23564, 6998, -12086, -18201, -2664, 31914, 18923, 19186, -2727, -3916, -5615, -1827, -224, -6632, -35761, -49220, -27982, -3132, -1942, 15273, 41325, 25143, -22435, -41611, -45815, -18028, -17926, -38508, -29564, -24999, -12168, 5258, -24493, -12378, 11755, 23980, 36256, 36698, 46260, 47317, 46939, 28742, -20301, -39923, -14818, 15831, 21199, -13237, -24821, -26246, -4869, 2729, -162, 297, -14399, -11280, 18305, 11626, 25187, 22117, 18887, 38088, 42630, 14751, 16431, 14083, 4155, 2084, 10677, 23154, -1022, -9373]
23601i373M3867j4937m5970j974K1498K0636k7291j179j5706l0056q548M590L708
23588f0735K2872J6244q304K872K7737K6574Q476j5007q074n070p310K5251l183
23575B2343r054q578k0167q223P621o456J8271L0583K9588r031k6722K36K4011
23562D4422j6284l1093k9470n72R151P855K0842J8090J227j3425J722p826J6799
23549B1438l815j8251o682l834n0J8289M3302J3809m6275k1554P296q31P969J4027
23535B4838J8292k510j6197m3214K0334J7009P003j3109n384j9855o741K4628
23523E094O717j5067Q699j6505J1154r690j1167k5894j4063L327j7596L6800O589
23510c1602j5005J1597K8682O392J414j5416j768p676O295l44K4501Q054q774
$$ y = [-9373, 34494, 19557, -26413, -28387, -6889, 13747, -13544, -14723, -30429, -60485, -69033, -64443, -60735, -37863, -21619, -29923, -27051, 686, 27260, 35736, 20729, 12655, 7585, 275, 25526, 22343, 13289, 4711, -15456, -23679, -16058, -22514, -4243, 26340, 55928, 46897, 20175, 20411, 44422, 28138, -2955, -32425, -32997, -23846, -15991, 4851, 22941, 24168, 10743, 12465, 4639, 21438, 17623, -628, -7310, -11144, -11194, 7095, 50397, 64206, 17931, -3623, 3673, 2842, 10811, 24838, 43130, 40620, 24423, -18791, 1543, 18552, 25555, 12446, 7062, -12793, -19534, 5094, 11811, -3256, 5443, -11062, 92, -9598, -20765, -46659, -60722, -57395, -74991, -38191, -31602, -46607, -35010, -6328, 64, 1478, -13938, -15706, -23382, -17087, -17431, 7070, 15124, 6350]
23497F350k239m022j9764j4484K3348J9940k877J3449J6592n114q458l7367l4682
23484d9328J5438J0564k503K5460J9498k475L358q211j1252K978j533Q293J4709
23471B4996L2611J3464l4200j2995j7282l9548l2554J0347K0943J5652j9155J7834
23459a9887K6153j1560q239j5581J5166K0417O935r306j0735m569O271j239K5669
23446A9495P89k0412j283j4346l207n670j0751O39k1315k951K7069q03k762M893
23432c0615J9000K0446k1462p341o291J0256M011L6114L660mk2732l811K6444
23419B7675Q694l715m273j6819m2441j8669J5435p852J5771J2245j4805J8270
23407a0484J5708j1713J3320J3410o642N533J6982N482o254j3383L4280l6562
$$ y = [6350, 4111, 89, -19675, -34159, -10811, 9129, 6252, 19701, 36293, 31179, 22721, -14646, -49328, -33890, -23326, -25829, -369, 19129, 16654, 20012, 11801, 549, 3527, 1994, 10287, 24996, 57607, 71071, 36871, 23876, 6594, -32954, -65508, -55161, -34218, -18566, -37721, -19887, 6266, -5294, -13533, -29114, -13948, 6469, 13404, 4098, -6637, -11206, -4935, -6174, 19495, 20284, -128, -1411, -15757, -18964, -24634, -35385, -34746, -56061, -59012, -31943, -32746, -35508, -30615, -11615, 8831, -12631, -19972, -26263, -16007, -11996, 24118, 27778, 27774, 5042, 1231, 27675, 36369, 32654, 28381, 11562, -30879, -49548, -34113, -41965, -26194, -13949, -28754, -10484, 5224, -6489, 6831, 20241, 13599, 19132, 36114, 41596, 35342, 21959, 56239, 19677]
23395A9677k7087J5127J3512J8963R402j9871j0753r203m2690K396L2316M0669
23383D2458l739j4844n852o942K0515j1045l5020j7050r819M0546M5928k2664
23371B2472j8177l5583J1296L5488J7298k7521j0967o808Q746J6186K404n132
23359I702j4335k7807J5331L4854J480l3743q845K5M3253Q623j7441j6343J0320
23346E074M997K1968o748k635Q770k6469k0615j0862o451M0482L0373k3949j8300
23333d365J0767J9915J1338k1468j1293n956j8420K221N931O337L0339O079n859
23320B5566j5549K3464q973n471K7380o696k238j6359M574j4199l4595m680J20
23307b7656O76L458o16k817M672J3184m882N49J0423N60L2558j9756L691J2604
$$ y = [19677, -7410, 7717, 21229, 40192, 49594, 29723, 18970, 9767, -32923, -30527, 1789, 42458, 38719, 23875, 18023, 11081, 31596, 20551, -14469, -31519, -41338, -792, 45136, 22472, 4295, -31288, -19992, 15496, 32794, 5273, -5694, -12502, -3756, 12430, 14834, 9702, -4633, -32440, -17109, 17745, 19225, -14518, -23363, -23338, 19915, 28538, 11097, -5246, 5074, 10071, 32039, 25291, 22656, 31426, 4957, -15658, -26520, -32971, 7511, 37884, 13935, -4365, 6402, 26317, 37655, 16187, 4894, -1062, -19482, -17261, -11330, -4993, 25346, 31425, 25566, 10017, 33481, 24508, 19037, 46417, 39721, 37483, 21124, 25698, 11499, -23096, -27776, -27656, -26980, -23522, -24138, -26955, -22283, -9099, -13981, -13432, -3009, -2449, 30109, 10353, 14044, 26648]
23293B6648j2680q595k7727j6438L2295L0878j4791o500n727j4055n850n190m546
23280c2278K0338L2654J1694l3192R05J428J487j0692P160l605j8680J020L2530
23267A0769J8764k813m6761m6150K6491L2724K9036N250L854R46K2397k2838k9174
23254B495K835J6165p271L313P874L753J2364L306j1477j2239k4648K0517J0755
23241B7742k7459J0032J3605j488K3020J9196j0304j0300k3270p841Q564j5282
23229F215L006k414L0844R116l8062j9019j3870K2319M8612j4752j9075j3507
23217e87j0431K8258o782J190j8694O994J6460K6241N128j7431j6250k6848K3447
23204A0695K7170J8855j3517J5350J829o794j6213j2787j7028L561r49j3129j6605
$$ y = [26648, 13968, 5373, -22354, -38792, -6497, 24381, 9590, 3090, -2637, -16692, -22542, -27732, -32278, -11940, 20714, 32408, -784, 121, 1549, 3036, -7656, -496, -4101, -22781, -21761, 10769, 29533, 26720, -20041, -66191, -39700, -6976, 22060, 27310, 31164, 32110, 54507, 31669, 2495, 5330, 21495, 14224, 17537, 25411, 29164, 41528, 44834, 33357, 21118, -3530, 16987, 27742, 283, 10315, 23920, 22432, 45452, 64648, 54344, 44044, 20774, 12933, 21497, 6215, 9221, 6807, 37651, 46767, 8705, -10314, -24184, -1865, 46747, 31995, 12920, -587, -11018, 17240, 10458, 11648, -7046, -52, 16408, 42649, 47777, 30346, 14096, -12752, 10695, 37865, 56720, 43203, 58553, 60382, 53588, 37375, 24588, 7560, 11121, 10172, -2957, -19562]
23191a9562k1248L636J7724K4283J8775l174j8338J1114J0849o836m6577k2900
23179e2254J4010j487K380J040n741j9919L7618N3673M1037k4428m2151j3061
23167i283k777K1368q294l76q063k6465J5277L7339J7167l713j2174P964J1182
23154C9152j3628k2479j4666J2728K4399k4909k7468j333K117o934J2257J194
23142a9570l778Q383M238J3235J9610j2914J3509j9716R52P384o960k6017K1536
23129a08k5087k6960J9687M3280L5341k3009j0918J812k5039J7978r563k1512
23117b4098J1835J7798o853J5183K1421k0002l9889k0289L441l2115n939K0868
23105e8639K3049Q532p551k895J3424P726K803N858j416L0802k4568J3891R429
$$ y = [-19562, -40810, -37174, -19450, 4833, 23608, 20434, 2096, 13210, 24059, 17223, -29354, -52254, -38244, -39731, -37351, -36311, -42052, -61971, -24353, 29320, 70357, 45929, 3778, -9283, -12060, 9308, 1014, 638, -7425, -33890, -18613, 18726, 35893, 32180, 20006, 27970, 39152, 25524, 3045, -11621, 1107, 25506, 597, -26871, -28204, -26087, -33021, -20764, -19570, -23348, -14965, -10727, 2508, 22118, 9204, 22713, 2997, 3949, 11333, 4373, -21644, -108, -25195, -52155, -32468, 10812, 46153, 23144, 12226, 14038, -11001, 6977, -2586, -24098, -12263, 5535, -1318, 13865, 35286, 15284, -24605, -44894, -41453, -73568, -79507, -58639, -35590, -27058, -34609, -37504, -24080, -16354, -13551, -7693, -9109, 21693, -2875, 11016, 20445]
23092B0445n725l570l4138K4799K47j4625M910J7706k679j5208K4375J7844k4836
23079I545j0758j0491K984J9997R526j092L425j1247n881J3661l665j9085j5772
23066a8853J3597l3673O513J2383p159L913q712K7007P281J0558l551j792K582
23053A0094P663K2343j0270Q327N515k5659p394k0833j0392J910j0051J5083K2744
23040I080j1323R356J8258M265J8987r716k0799q676J724L63L3Q903L2408l130
23026D9733k8825k0250M888p512n943J0209K082j8985o375k7972r422L7829J7828
23013b715j0290n170j3966j825Q987J2005k825J2901L091L1985j2970l2896m149
23000a7837K1079J8452K4248m900k8745j2653j4117l432J5890q828j0054j3240
$$ y = [20445, 14720, 11150, -22988, 1811, 2058, -12567, -7657, 10049, 7370, -7838, 16537, 34381, 9545, -1213, -11704, -8720, 11277, 20803, 19711, 23136, 11889, 6008, 19669, 16004, -3081, -18853, -5256, -38929, -32416, -20033, -27192, -23279, -31991, -4984, 2297, 12855, 9304, 7512, 10094, 17757, 40100, 29830, 38157, 43672, 18013, 10619, -10214, -20606, -18696, -28747, -13664, 9080, -2243, 7113, 25371, 29636, 48623, 38907, 18108, 9432, 11156, 11519, 11552, 20455, 52863, 49733, 20908, 658, 5546, -1966, -7909, 2300, 4382, -14603, -20978, -48950, -58372, -20543, -2715, -13005, -18175, -32141, -33966, -24979, -12974, -15799, -2898, 193, 32178, 19208, -13688, -17837, 3242, 21694, 45942, 41042, 12297, -356, -14473, -17905, -2015, -10843, -20897, -34137]
22988c4137j2826j06N934K2762R868N847l076R684N156k7456p490j4962J1791
22975b9011K4351o239m56M180K6665j5080O081L3489k2814j0810J5493j1687P218
22962B1380j5129r389L2473J6161k1328r887J5652J1492j6194l7371k5564j4905
22950e2609J5305K4564K8437q600j1841l5278m894L7570O912m611J1399k6730
22938b0376l3507L1059M86p926O611J6288k1119J1692K0287k718l2605j3608K1479
22925b3957K8496J0919q603N309l4064k6218K5536J1047n555K0260J1728P572
22913B2470n337l6903j2281o697J7505J4357J4397j9571k4370l2972J6631N4804
22901B033K6522j7498k6226q899O781J2413l1137J2169R693L4375j3939j4478
$$ y = [-34137, -46963, -47069, -41135, -18373, -8505, -2658, -5734, 3950, 9106, -18350, -25840, -40802, -29011, -4660, -10899, -11355, -7175, 19490, 4410, 10491, 43980, 21166, 10356, 25849, 14162, 21380, 6251, -3138, 29335, 45496, 24168, 14281, 29933, 41425, 25231, -12140, -37704, -52609, -37304, -12740, 15697, 7097, -4744, -40022, -44916, -7346, -434, -5045, 6354, -20376, -53883, -22824, -22338, -30264, -23653, -7365, -28484, -16792, 3495, 777, -31828, -45436, -23957, 4539, 15458, 6855, 12164, -21900, -48118, -22582, -11535, -17090, 3170, 14898, 22470, 17133, -19770, -32051, -38748, -21243, -6886, 7511, -12060, -36430, -69402, -52771, 2033, 28555, 11057, -15169, -24068, -17287, -4874, -36011, -23842, -14149, 20226, 6287, -8191]
22889h191j7145J6887K4281m171j7560j8701K3818L0590J3048J8787o642k401
22877E2600j6337j9952j2701J3146j5895j7089K811J7619j7826j0887j1527M1474
22865E436R993k6132o742k553R84M1825J5561j6531k514Q226j0301j8502j1548
22852a2798p175p201J0466K389K4295L0021J5563j794j0119r425J6547j0079L669
22839D4359J7593r992p060J3545K7294j5503j7751k5186k1588K12J5136M263L672
22826B8994K142m2235j9936P047l996j2274L3648R538k5133k1393n376K5341J1237
22813a2396j280M937m776L2429K3024J6788J2931k5614k7311k614k3950j4056
22801b1888R813J2487J0988j0033K492p59k41j036J9067J3203P493l2240j9220
$$ y = [-8191, -25336, -8449, 15832, 11661, -5899, -24600, -782, 29808, 42856, 61643, 55001, 52600, 36263, 16311, 3610, 16756, 861, -16228, -13417, 4202, -13624, -24511, -36038, 5436, 15429, -10703, -17445, -19998, -19014, 22811, 38372, 21841, 19327, 27553, 17252, -1250, -12798, -19973, -27174, -16708, -14319, 9976, 39997, 55560, 53766, 43647, 34222, 50769, 40690, 44359, 61952, 51960, 44900, 58445, 85739, 70236, 52485, 27299, 5711, 5923, 21059, 25322, 28994, 31136, -11099, -31035, -23988, -27984, -40258, -6610, 2928, -22205, -43598, -48974, -23633, -12396, -13676, -8739, -13515, 18914, 41938, 58726, 71657, 46043, 18732, 16118, -7832, -21888, -12075, 412, 11400, 1367, 3859, 3100, 2859, 1823, 20890, 34093, 41586, 9346, -9874]
22788i874J3572L398j5503q062J0192J9668k1142m862K1333K157j6451k0549K6879
22775G56K4348j4299J0445J2772j500J8667k021l9370j4742k222j7564r279j871
22762c5880J9726L946m42n210j3492R318L8723k567j3874j5040J9311K1541P166
22749C3226j2725k7231n0J451p092N893l908J5493J9491j0880k888p691j0926
22736g837n536m249L4788j381k8075j7910k628K5992K664k1589K2427m428j2950
22723b0712J0289P221k7467j5155L4096J7040K2405q040m4990j9487J8804J8085
22711g911q134P456j2644K0544J8610k5803k3777J464P928J6156k0636l9022J240
22698f4529O295J8161J8381K4753K0209L1955q295k1675J1183j6346j0311L687
$$ y = [-9874, 3698, 7096, -8407, -16469, -6277, 13391, -7751, -12613, 8720, 10877, -5574, -26123, 756, 25104, 10805, 21250, 34022, 32522, 51189, 49168, 9798, -4944, -7166, -24730, -34009, -35880, -16154, -12208, -12650, -17860, -31352, -22034, 16689, 14122, 248, -14792, 4519, 26060, 33226, 20501, -6730, -6780, -5329, -12421, -6528, -10436, 5057, 24548, 13668, 10780, 3089, -7837, -13373, -17622, 17166, 15785, -12290, -30200, -32828, -6836, -4172, -25761, -3334, -7762, -20712, -10423, -3202, -30669, -45824, -11728, 5312, 27717, 19677, -25313, -44800, -25996, -7911, -16045, -8589, -21233, -689, 17921, -7882, -31659, -30195, -22267, -6111, -26747, -65769, -64529, -58234, -40073, -21692, 3061, 23270, 55225, 46930, 25255, 36438, 20092, 9781, 13468]
22686A3468J650j0246Q472m464n999r230r307m809L5012k35Q952j4774k8288J2046
22672g752R44j1125p869M2381O364m4699o612j0172O859j378m890Q45j2697K015
22658d7786L8157P733j2281K2529m551k3875J2330K2708j8754j7018P066O678
22646g064K4985Q009m936l2514l7255p732K9554J6299K0506j1197k7590M183J8995
22633e757o239k668J6416J0643O599l11j9526l2906j6076P944R724J3149J2317
22620f691j5386J5942M7648L385Q060n787m5746k0607o79O319o73P490o396j4378
22606b7499k3044q584j0878j8524J3666L3459Q158o62r318j157K1378N454q435
22593b5986p814K969r111j307J8562M965N231r307N780J5973J6333J0312j809
$$ y = [13468, 15118, 4872, 13344, 8880, 2881, -6349, -15656, -20465, 14547, 14312, 23264, 8490, -19798, -7752, -6808, -17933, -25802, 16579, 22943, -21756, -28368, -38540, -31681, -33059, -37949, -37104, -49801, -47786, -9629, -1896, -14177, 8352, 3801, -20074, -7744, 14964, -3790, -20808, -13742, -7064, 17921, 25930, 20994, -11520, -48775, -56507, -26953, -10654, 9852, -1345, -28935, -24752, -5757, -11996, -14664, 1752, 12395, 18994, 18683, -843, -33749, -49825, -41881, -32157, -19008, -6691, -22077, -6135, 41513, 44898, 52958, 47171, 1425, -19182, -19861, -13542, -14215, -6725, -13121, -27499, -50543, -59127, -70005, -88529, -74863, -41404, -33246, -33908, -43226, -44383, -23005, -17551, -25986, -33800, -30831, -39942, -41249, -22687, -17722, -12491, -21798, -16018, -45, 16288, 26600, 24791]
22580B4791j2247j0578K4850j7513k3905J4906J4927j3099k2285Q413J3586J0665
22568A2511J2881j9143j5559j8901k696N294J1856K766J8202J9220J0800Q873
22556D6104q474j5404p731Q541n618O852P879k3342j1975K7866J3140r753k0705
22543G380o949j168L4101J3675n8221k6051j0043J8615J3501J5915j8433m19J3021
22530e076M868Q083r484k8049N799K6776J7410k1434K7369k863j6876R025l2749
22517a7201O072J1175m4256K4453J9493j7075k4009J607J9646k3113j7450J3233
22505d7425J8741K3472l989j4557j1469Q560K0460K0435l590j0163n991k9212
22493c4728M5J5533p283j3924J429L2251k495j1547L475J7756j9541r887P64N489
$$ y = [24791, 12544, 1966, 26816, 9303, -14602, 304, 15231, 2132, -20153, -11740, 1846, 12511, 25392, 6249, -9310, -28211, -30907, -25613, -13757, -10991, 7211, 26431, 37231, 46104, 37630, 22226, 14495, 23036, 17418, 24270, 32149, 8807, -3168, 24698, 37838, 28085, 7380, 431, -737, 33364, 47039, -11182, -37233, -47276, -28661, -15160, 755, -17678, -18097, -5076, -208, 7875, -1609, -29658, -23859, 2917, 20327, -1107, 26262, 23399, 6523, 15548, -17201, -11129, 46, -44210, -19757, -264, -17339, -41348, -39741, -20095, -43208, -60658, -47425, -28684, -5212, -9201, -23758, -35227, -26667, -6207, 14228, 10638, 475, -5516, -34728, -34683, -19150, -26433, -40357, -38928, -6677, -9172, -20719, -17244, 512, -19029, -28916, -28152, -22663]
22479b2663j5371q736l055P481k6p634J3077J6327j042L2053m609o237j245j1676
22465a3356q056L9198K3797l303j9951k6247j3673l7067O367J7089K3802J9679
22453H279n624P613j6041J0144J4768k5504r50M0843m895j5575k8531J948M3435
22440B9910J6001l2837r026R765L433j0951k6250r556L4485J1617K3532L241j5033
22427B8331J8464o329l607J08K5457l1427k3393o539J2982K5257K428j3215k4023
22414D494j5852L235J7634R336O191l0801m71k031J2947j244j5663j3575J4179
22401a1621j5550j6819L0166K2283m2369k6632m956J2092r569k9665J5020O232
22389g1388J8688L3204K7480J049j285j361j6564r826r784J4482J607j5906P502
$$ y = [-22663, -38034, -46770, -49825, -42344, -42370, -50004, -36927, -20600, -21642, 10411, 5802, -435, -1680, -13356, -21412, 17786, 41583, 38280, 18329, -7918, -21591, -58658, -52291, -35202, -11400, 8279, 2655, 10268, -5773, 4371, 19139, -6365, -7315, 33528, 28633, 13058, -15473, -13525, 29910, 45911, 13074, 4048, 13813, 17246, 6295, -19955, -29511, 4974, 16591, 40123, 43364, 28331, 46795, 40466, 36859, 36967, 62424, 30997, 7604, 1065, 14047, 39304, 41732, 28517, 4494, -11358, -8123, 9511, 18847, 25038, -5763, -6234, -8265, 4682, 3438, -12225, -25800, -11621, -27171, -43990, -13824, 8459, -33910, -60542, -65498, -53406, -62975, -92640, -77620, -71388, -52700, -19496, 7984, 9033, 7748, 6387, -10177, -20003, -29787, -15305, -13698, -29604, -22102]
22376b2102P316l2267P042J7517J039l262j5754j0528N492N250Q935J3554P998
22363i770J3128N863L78M84J7516J9287q283j1639l9741j2106J3169k087n446
22350a9247r780o052K1017J6710O529O382J1128L618n991J2874k3003j2077J9281
22337B1389n448l265o767p495J6136N318j5959l640J5213q207r5J863M530K791
22323A6364m434Q99M390q790k2488O029J210q623k3208J6786L8078p818J9382
22310B7777p960K680J1172L443k5361m1084J1638K1785P112j2548n609L5665L64
22297B9074l2838j3600J7127J0466K4345j7343j547L81j0824k1246j3855n185
22285c5045j3233K1534K5741J75k4572k3406l4997J8163K7061r239K6575M2131
$$ y = [-22102, -14786, -47053, -40011, -22494, -21455, -24717, -40471, -50999, -45507, -40257, -31322, -17768, -9770, 3358, 9221, 9599, 10083, 27599, 46886, 38603, 26964, -12777, -24883, -11714, -13801, -19247, -29027, -35079, -14062, 2648, 9177, 15559, 26687, 30305, 24314, 37188, 14185, 2108, 21389, 15941, 12676, 5909, -1586, 14550, 19868, 3909, 269, 15482, 7275, 7180, 9043, 13573, 16364, 11930, 12829, 17219, 8429, -14059, -8030, -6820, -15443, -38651, -21865, 16213, 8395, 27777, 19817, 22497, 33669, 37112, 11751, -29333, -17695, 4090, 11202, -1346, -6955, 28710, 29074, -3764, -17364, -237, 10229, 34574, 17231, 15684, 16065, 5241, -16005, -29860, -35045, -48278, -26744, -1003, -828, -25400, -48806, -83803, -65640, -38579, -47818, -21243, 20888]
22273B0888J6270n761j8658j7748m655k0829j5766J553J0789l438L0344j4748
22261b1759j9241j5397J9508M1236M413m3248J994L1741K9366j1j7232K452J2057
22248B5879M746l935l7893m3261N009K2034J5727L371J0687K694M557k5323q029
22235b3737K8721K0814l4485n363R632m12l3841r27J7375J2004j0987Q133m437
22222a7510m788J1456J823J8838o862k4272j4418J2406J3623L2186K5129l651
22210D3960p1449k8053j705j1970J4393l172j9566J6669o163o657n727j6820J4526
22197h1734L2704J5573R137K6634K5748J222J1122j503k7257k291j1294l727j6723
22184b2389L403j9428L909L2982J0048j4888K4156j183l019k13K765k0019r140
$$ y = [20888, 37158, 31397, 12739, -5009, -9664, -30493, -46259, -44706, -33917, -37355, -7011, -21759, -41000, -56397, -36889, 4347, 8760, -34488, -32494, -753, 28613, 28602, 11370, 13822, 25879, 30625, 26690, -11203, -54464, -49455, -27421, -11694, -8323, 2364, 5058, 9615, -15708, -23737, 4984, 25798, -8687, -14050, -4418, -4830, -38671, -39598, -22223, -10219, -21206, -13073, -17510, -22298, -10842, -9019, 9819, 2957, -21315, -35733, -23327, -9704, 22482, 47611, 43960, -27489, -55542, -57247, -69217, -54824, -57996, -77562, -60893, -67056, -73713, -79440, -96260, -81734, -49030, -33457, -24320, 2314, 28062, 29284, 40406, 38903, 11646, 9355, -1939, -5666, -22389, -18986, -38414, -34505, -1523, 8525, -6363, 17793, 16610, 13591, 13378, 16143, -3876, -13016]
22171a3016L34O948J266l1972K1189M2195J6985l2175l8848k3467j0748l065J2413
22158e1961M0086M3416O67m6902j2625J2606K9825Q536j6229j0642M783L0804
22146C2364j4765k1495j8720k2262R770J4615j8293J3975M036K959J9417K3688
22134B5289j9748j7136J8399j1732n403p691o610L1806l599m982q688K024j094
22121i165j8545k3671L573J6944K3323l700j0366K723l400j3135k4383N582J3662
22108d0558q192m218q157J1912J2514K2840J5248J0654J1904k9329l4762K2893
22096a7251K1668Q413n3437o185J8119j2703M406Q856r919l0814J4175O7574R65
22083A3867q939k1345j7747J2240J9269N308L978p883o580j6140J2461J0481l856
$$ y = [-13016, -12682, -5734, -4468, -36440, -15251, 26944, 43929, 11754, -27094, -50561, -61309, -64374, -51961, -11875, 31541, 32208, -14694, -27319, -14713, 15112, 23648, 7419, -3223, 1560, 32364, 17599, -3896, -22616, -44878, -35108, -20493, -38786, -24811, -20775, -17816, 1601, 25289, 5541, -11595, 6804, -4928, -10331, -18022, -24632, 7174, 3575, -1407, -10095, -8071, -9165, -27710, -51381, -47808, -30864, -7541, -11241, -21607, -18884, -22284, -35419, -59802, -54220, -40558, -48750, -52968, -61125, -49213, -36699, -13859, 1389, 12043, 23947, -5382, -40144, -17251, 4417, 12830, -40607, -46792, -28673, -41376, -36970, -28114, -38033, -68847, -54672, 12902, 13867, 4928, -16417, -34164, -21924, -2655, 2653, 6631, -1252, -7832, -23972, -11511, -1030, -4886]
22070d886r877J4607p505l6201Q004R087J548L745O045K4365l587j3287L3215
22057B5273r529j9290Q949K0018m0947k4990K9167L4751l119l0843J7951J1117
22045A8508k9195p704J8033K4560m747j7594l1790m1865K9642L3853K9538K793
22033B4032j2201j388l665q872N872P030N197k1630k9298n160J114K3330m902
22020b0541m62O484J4490k2833J0959p51L5781K5772L764j8763k040k297N983
22007C5546j05j7838j4676j9843p444K6551J7644J0391k348l7245m620K4426Q257
21994A8696o666l844K1594L363j4146P215J8021j8075k0404K490J461k534J4698
21981B1869o966j0425J8097r034J5871j7738k6897o420R007K5161N776j9501l0486
$$ y = [-4886, -14763, -156, -7661, -43862, -35858, -26771, -25223, -21478, -15433, 8932, 5345, -7942, 25273, 15744, -3546, 5403, 25421, -15526, -40516, -11349, 23402, 20283, -10560, 7391, 18508, -10687, -18391, -358, 24202, 19455, 1861, -29929, -71794, -42152, -8299, 21239, 24032, 11831, 10443, 6778, -2094, 3778, 10808, 16005, -5625, -34923, -40083, -38969, -15639, -20541, -21003, -14519, -29, -22862, -11903, -12654, 23127, 48899, 52663, 33900, 31860, 29563, 35546, 35441, 17603, 2927, -16916, -24360, 2191, 19835, 30226, 27878, -9367, -13987, 10439, 18696, 12030, 8186, 29780, 33143, 18997, 26212, 44233, 26158, 5754, 8244, 9705, 7171, 21869, 14903, 4478, 22575, 13541, 29412, 11674, -15223, -21643, -12636, 12525, 18301, -1200, -31686]
21968c1686K2390N3834j7649k2525J355k7010L54l309J9992P082k3467P215O766
21955f658M19Q457j3989j7288L0096P484J4047k2620L120j5205k0732r838O851
21942c5856J6380J1883J7938K967o573j3022j4261r1k785P61k9457k4273J0410
21929f5979J3201J7371K6050R902k245j4669n614J030J3793J7441j2341J5021
21917A2961L526K229q225N620K3421k948q461o240q170K544k6928j0599M0038
21904A8768J3397j5846n274P420k2549j1731J1552j906l7395k1892j7L0974K9399
21891e100N149J6535J8163k7086l1285J797j4881R354P760N000o70k8323j8226
21878f1813K2781J0508J3939J0173k1658r890J2464K4844K2394K624O683K5345
$$ y = [-31686, -9296, 44538, 26889, 4364, 5719, -21291, -20937, -24246, -4254, 2828, -20639, -13424, -6658, -6239, 2218, -11771, -29059, 1037, 8521, 22568, -52, 3068, -12137, -32869, -42707, -35856, -19476, -7593, 10345, 13312, 6739, -6283, -20544, -20635, -23420, -22659, -52116, -76389, -65979, -52778, -35407, -9357, 545, -1700, -16369, -21983, -20953, -7160, 10281, -2060, 12961, 16487, 18716, 10491, 16111, 39532, 36584, 28123, 21883, 13713, 16257, -10671, -21270, 18768, 32165, 16319, 11045, 18465, -4084, -15815, -4263, -6169, -43564, -65456, -65473, -34499, -5100, 49, 16584, 34747, 7661, -23624, -21827, -36708, -27354, -19594, -14594, -15264, -43587, -61813, -39032, -28524, -14585, -4412, -26070, -35960, -23496, 1348, 23742, 26366, 33049, 58394]
21866E8394j0817l5649k1439J9847Q202k5078l3977j445K0820p258p274L5145
21854e29K4131j6473J1499j1831j4825N888R59l80J8914k3386j9769J5333J6625
21841F156j6054J1170L4616O398k429P514j3262O431K699j5532j8645l4711J027
21828b4622N534L7043K7701J451j5279l961l5687k3127K7952L5999k760n344o019
21815A8881J7596q204m1689k8604J9694r85N943J5544J9046j2412j8710j0794
21803b4694j2844k739Q528K5375J2164L821l0836r236L3460n129j4133L884q330
21790b0709j4576k916j6908J7920J9961J2962L502l825m7N65J3741K2788j0898
21777B1560k5058K160j441L394j0929m5816K57L5899n183L263r926K250J1091
$$ y = [58394, 47577, 11928, -9511, 10336, 18538, -6540, -40517, -41962, -21142, -28400, -35674, -529, 23602, 7129, 18628, 6797, -8028, -2140, -1181, -1561, 17353, -6033, -25802, -10469, 6156, -9898, 1272, 35888, 42286, 39857, 47371, 34109, 40540, 43239, 27707, 9062, -25649, -24622, -19088, 17955, 45656, 47107, 31828, 27867, -7820, -30947, -2995, 33004, 30244, 24900, 18881, 36477, 28273, -13416, -42020, -22326, -23311, -17368, -1824, 17222, 4810, -13900, -24694, -37538, -40277, -31749, -6374, 5790, 9611, -21225, -30461, 2999, -2130, -16263, -12379, -20709, -35285, -38201, -55109, -37189, -17228, -4266, -764, -4589, -4636, -4071, 9670, 32458, 21560, -3498, -1338, -2779, 615, -10314, -56130, -55873, -19974, -25157, -21894, -31820, -29570, -18479]
21764a8479l007j9050k2633Q867K5600j3806o354n639K4761J0853J0345j9754
21752b8296n058j761j3614j8553R609L4855J8114j939M4776J1803q972l3983l2236
21739b5255j5301n394o1k765n987J5478J9388J9711o182Q072n22L4130j7077r999
21725H236m666J0680L3308j0703j4781j957l0769j9132m324J9650k6499j8163
21713e9120O45j568o861k206r582J4726R599j2014J5989L5433J3986L158j6348
21700a4163k4056P098K8670K3274j7858j9620n824L3598j0037k1857j4098M10
21688c4463K2234P926l326O059K0019j7646K0837M0562r111m8798o661j7915j7015
21675c7298K5778K1630J0897j7108j9744j9404j1267M604L3111R061j6430J5812
$$ y = [-18479, -21486, -40536, -63169, -54302, -28702, -42508, -48862, -54501, -29740, -18887, -8542, -28296, -33354, -35115, -48729, -67282, -57673, -22818, -4704, -6643, 38133, 49936, 40964, 6981, -25255, -40556, -45950, -46011, -48776, -54763, -39285, -19897, -186, -6368, 1704, 1182, 35312, 18235, 8236, 3570, 14250, 47558, 36855, 22074, 20117, -10652, -29784, -34108, -14458, -40957, -59120, -58475, -60043, -66904, -69110, -78692, -63966, -54367, -66381, -50392, -14959, -973, 2185, -14163, -38219, -31121, -2451, 20823, 2965, -16655, -22479, 11119, 1082, -20775, -34873, -34463, -12229, -4303, -7629, -1570, 18449, 803, 21640, 62202, 53091, 4293, -2368, -20283, -37298, -11520, 10110, 21007, 3899, -15845, -35249, -46516, -41912, -8801, 260, -16170, -358]
21663c58L777q95K0272K3425K434j2889k4414l4950P42M467J0679k0849j3235
21650d1794J9156n894j1955l857j3181J2154R94L592J4053K1451M025j5817n263
21637b2336j2253J7794J1133j1042N789j8796n731R089Q986j167m557k46K3509
21624A72J7842j5211J4401J7846j6980n519k992L91m695j7264k880L7654J7055
21611C9820k789j630J7965j9526n0607m2158q723Q97P879L8439L1588q594n468
21598b907J0129J3795J1136k1048l2654K5500m951R240l7356O609J1800k4236
21586c4943j0628M9367N3092o082m2922R597K530R52l304l508m4654p834L3895
21573d442J9621K8044j2544j9321j4634r964P176p211K0034m354L950J2398L293
$$ y = [-358, 3419, 2524, 22796, 46221, 48655, 35766, 11352, -23598, -22856, -18389, -7710, -28559, -41794, -22638, -28532, -40487, -44344, -57525, -45371, -44377, -40785, -26732, -5281, -1256, -17073, -22336, -34589, -16795, -5662, -16704, -10915, -29711, -35442, -26353, -17367, -18534, -23091, -23337, 172, 18014, 2803, 17204, 35050, 18070, 12551, 9559, 9950, 5255, -12009, -14889, 22765, 39820, 37031, 35401, 53366, 33840, -16767, -58925, -67648, -66751, -58872, -20433, 11155, 2561, -2907, 7222, 21017, 32153, 11105, -21549, 3951, -1000, 8240, -29116, -22507, -10707, -34943, -45571, 3796, 56888, 50806, 7884, 17481, 20011, 20963, 17659, 14151, -30503, -38337, -4442, 15179, 43223, 30679, 11358, -3276, -13240, -6064, -13275, 6759, 2405, 6355, 18753, 22046]
21560B2046K143k4687j2619q07j4389J0568k4816K0477M0551L390j1924m4691
21548c4758j5324O790J8238K6371m416j0618j8464J2621J8476k7950r12J4795
21536a5151j6380l6905j2038K2413N388M430J907K9687Q481L106K211J497n462
21523f816N3829N499N965l1864l4818L853O253j4194j5959J141J0312j8051r735
21510d4585K5874L1255J2990P22k1270k7308j5248K5005K4651K493l581N157L6481
21497E2636k4819l7987j3802J0246J2165j6648j2795L0488J956l1358o232K007
21485c4143J9607P274k0100K2321k5154R608K6152K7215j3798n81j6361j4172
21473a2132J4073L794K2317M2591l74k1002m3979k8096j9922k9133J2535Q292
$$ y = [22046, 24189, -498, -13117, -13924, -28313, -17745, -42561, -22084, 18467, 21857, 9933, -34758, -50082, -43292, -25054, 1317, -3099, -13717, -32181, -19560, -1084, -29034, -29946, -15151, -31531, -68436, -80474, -58061, -52673, -48243, -46336, -16649, -8168, -5062, -2851, -1354, -6816, 47013, 52512, 58477, 26613, -8205, -4352, 1901, -12293, -28252, -27111, -16799, -34850, -44585, -18711, 12544, 25534, 26256, 4986, -22322, -37570, -12565, 12086, 14579, 10998, 16155, 52636, 27817, -10170, -23972, -13726, -1561, -18209, -31004, -516, 1440, -29918, -36150, -34143, -14536, -7262, -27362, -5041, -30195, -20587, 5565, 32780, 18982, 18401, 2040, -12132, 1941, 5735, 28052, 70643, 70269, 49267, 5288, -22808, -42730, -71863, -59328, -51036]
21461e1036K799m534K5209K4071L6788j9163k5132k3092J380r92J2226J9453K0981
21448A8958N613l232j5370j0329J6833o854J293J4417k5162j3499J3572o381L0025
21435A9884L0379p155j8766j6067R142K6054l762k8332k143K2976J850j3044k2359
21422a343j3064J8855J6206o454j1295J3814k8996k4126K3837K3087n876k0108
21410a5463m265m781l183O226L6642L7915l8204m892J7968q363j9113L82J0536
21397A1405L0453l816m6911j2737j9720J0157J4241J9665j755m044J344o541r529
21384a7788r362L1707K8593L49k7016j5874j447K0887J080M583L503r452P80N095
21370A5638m2819l3154Q967M412l155Q162N250L0755P597L200j4171k0670j3877
$$ y = [-51036, -48237, -52771, -27562, -3491, 33297, 14134, -10998, -34090, -32710, -33702, -21476, -2023, 18958, 24571, 21339, 5969, -4360, 12473, 5619, 6912, 21329, -3833, -17332, -3760, -10141, 19884, 50263, 43108, 24342, 8275, 17417, 43471, 39709, 11377, 9234, 32210, 34060, 21016, -1343, -14407, 4448, 20654, 14200, 2905, 16719, -12277, -36403, -12566, 10521, 4645, -15463, -19728, -24509, -27692, -21466, 15176, 53091, 14887, 9995, 27963, 19600, 487, 869, 11405, 41858, 38042, -8869, -21606, -41326, -31169, -16928, 2737, 982, -3062, -1718, -8259, -17788, -27150, 4557, 33150, 33499, 6483, -9391, -10838, 10049, 11129, 15712, 19215, 9763, 10543, 15638, -27181, -60335, -51368, -46956, -50111, -41949, -36699, -5944, 1653, 4853, -9318, -29988, -43865]
21357d3865J7899J1695n083J8119K6045J153k2585k243k365j1668l955K0321n919
21344b451J2536m046k3923p926n769K3338O622j0401N855K1936K7813P959r25
21331E0618k2744j5621J1340k0281m0842j9574M3625j0820J9597K1275k4764O386
21319a805K2699k4833k5019N74l588o683J5238L6553j2755k0444k0859J077Q181
21306c1664N716L838j1795k0581K5337K8950J2230l979p555K1898Q426m1186P155
21293c210J7107M871m5345q98L2122R937l3759o524L861j539j295q288j282K4294
21279i948J7498J8046k8391j6267J6226q067M820J6732n463j9596j0446O161P20
21266a7975j0490Q92K1831j7021l9155J3090R895j5644n41l500J3764m099L1541
$$ y = [-43865, -25966, -14271, -19354, -1235, 24810, 25963, 3378, 1135, -1230, -12898, -16853, 3468, -2451, 10085, 6039, -17884, -25810, -31579, -8241, -1619, -12020, -6165, 15771, 43584, 51543, 50618, 27874, 12253, 23593, 3312, -37530, -57104, -13479, -24299, -4702, 16573, -8191, -1805, 20894, -3939, -28958, -28384, -31972, -38655, -23417, 13136, 381, -20063, -40922, -39845, -31664, -25948, -22110, -33905, -54486, -29149, -199, 12031, 8052, 497, 22395, 30821, -10365, -3210, 13897, 18768, -26577, -27475, 4647, 14584, -19175, -25699, -21838, -23377, -24672, -32960, -34242, -9948, 7550, 25596, -2795, -19062, -2836, -10903, -6083, 10649, 5186, -14410, -24856, -18695, -17975, -28465, -27573, -5742, -22763, -61918, -48828, -38933, -54577, -55118, -58618, -44854, -48953, -17412]
21253a7412Q406l894J0754m597N389K8080j3559q781j0719j0921l160K7072k1996
21240a5338J0217J5011j4487K0149L3564q792j0496L395k5529o996M731J121k3730
21227a7180j1259J9648J0579k1906r241k172j267R151J548n532p86J9831J7390
21214H804O519j2785m655K006J7923j3805j7392L081M736J151j3088j4264n529
21201c7298k1816l638J4654J7943K147L0954P869J6520k5683j044K4303n438l4316
21188a4843k5042L698J9074K5846J9365m367m146K3331J4871j4659N506K638l5148
21175A6124j2381K5878K0121J0021k4336j9837J7073K754k6913j7625m063j8226
21163c1410R039M795Q895L791J0687O992j9930j3475J3374O856P220J4631p079
$$ y = [-17412, -9006, -12900, -2146, -6743, -1354, 26726, 13167, 4386, -6333, -17254, -20414, 6658, -15338, -5121, 9890, -4597, 15552, 49116, 40324, 29828, 33223, 7694, 698, 5429, 6550, -17180, -28439, -8791, 1788, -20118, -29359, -31531, -32798, -23647, -22099, -27631, -28417, -8586, 8804, 15323, 2538, -2117, -111, 17812, 4007, -13385, -10304, -5568, -4417, -17505, -31769, -37298, -59114, -62752, -48098, -30155, -28008, 2946, 10815, 27335, 1652, 608, 24911, 19473, -14843, -39885, -36187, -17113, 8733, 28098, 23731, 19585, 42916, 57787, 43128, 48634, 51272, 16124, 3743, 29621, 49742, 59763, 35427, 15590, 32663, 35417, 8504, -9121, -13184, -31410, -22371, -17576, -8681, -4890, 5797, 12789, -7141, -20616, -7242, -386, 6834, 21465, 14386]
21150A4386j3550O145l471j5432J2094O2005L4547k0142m0385p985r044l4537
21138a5369j9908J715k0536j0896O083j8829j7289K6837M4189O260L6139q05k5241
21125g650J272Q489K4351o421N956j7539k7016O028m323J3518L376R020k495l4188
21111b7622k041J9770P705R479o721k0430m151l100J013J4862L4499n246P223
21098B5240m342Q23K3620j1756j552j9383J028j1875k4081p307j2344j1745p31
21085e4405o752K5264L2883J737J5433K1677L739k8882k6071P029J9570K826j8480
21072d432j2623k0625L5550J0544j4226K6001J6997j9279j6530P569l088K363
21060H221j0746m381J7404j1162j7700R642M1891m397k8619k3854l802Q215L906
$$ y = [14386, 836, 6981, 3510, -11922, 172, 62177, 96724, 76582, 36197, 28212, 19168, -15369, -35277, -33562, -54098, -64994, -58911, -77740, -95029, -68192, -24003, -17743, 18396, 17591, -7650, -6378, 2111, 26462, 20041, 25997, 8458, -18558, -12530, -16853, -3335, 41, 9061, 6566, -27622, -29663, -9893, -2188, 7291, 570, -19860, -24011, -27111, -26098, -11236, 23263, 18017, 25240, 20898, 21721, 45341, 33585, 32033, 12650, 13678, 1803, -22278, -29585, -41929, -53674, -54405, -61157, -35893, -3010, -1273, 14160, 35837, 39576, 10694, -15377, -8348, 11222, 14048, -4432, -17055, -37680, -2130, 8414, -5812, 20189, 37186, 17907, 1377, 8946, 5858, 8221, -2525, -6906, 10498, -664, -18364, -8722, 33169, 28772, 153, -23701, -27503, -19288, -15382]
21047a5382q355K7394j2058k3808j0155K6318P112J5114m788l2620m999J8579
21035a7648J0210L2278J9325Q440l7799l3666j590O294J6855N130q603r359k1449
21022c1582k0998k2134J9152L0997j0606K4923J6923j3068O098r368k6182k7639
21010f3484r034j0394K7704R178J7012n05K8086J3257l493P03p289M922O52k010
20996E305L3186J1397k2170j0221Q836j3631k0871L82p748p400R312m148O250
20983a1521J8188j4733j177J8830o00J8449n957j1659j9756l4055R121L385k5283
20970e6768q237J1810K5329J3254j2815l1450J427J2081L28K4130j6542o39l6949
20957g5041K1932K7657J7815J0990K7580L238J1978k5416k0237k689J2745l2346
$$ y = [-15382, -23737, 3657, -8401, -32209, -42364, -16046, -8934, 6180, 1392, -31228, -36227, -17648, -7438, 24840, 44165, 52605, 14806, -18860, -20450, -14156, 2699, 7829, -774, -10133, -31582, -52580, -74714, -55562, -24565, -35171, -10248, 6675, -6393, -295, -9663, -35845, -63484, -72518, -82912, -55208, -46030, -29018, -29523, -1437, 11820, 8327, 9030, 1741, 6663, 7315, 5305, 38491, 49888, 27718, 17497, 26333, 12702, -8169, -7787, -15535, -22935, -13623, -17771, -11521, 6667, -8066, -9243, 9587, 8987, 27436, 21479, 9820, -9936, -43991, -34870, -31485, -56768, -65005, -53195, -27866, -14612, -27427, -58877, -57450, -45369, -45041, -20911, -37453, -38092, -75041, -53109, -25452, -7637, 3353, 30933, 34171, 46149, 20733, 496, -2193, 10552, -21794]
20945b1794J0412K6895J3551P453j5186k1910j3040q707O549R574K2959L3098
20933D9854p841k4033K4762j9777k6811m6689j4677J0986R412k3458K4263K0970
20921b3039K1195r701Q450L4329L0259k0874q762j8328k0767k735l893l0152R908
20908c4110L9830L989j1627j6100k8301j2086M3835L398P39j0117Q160n677j299
20895a9366l436R069J8915Q834j3157j5246m201j4830R702J4784J0007l615M070
20882A530l6350j4478J1628K0601L0122m960j2825r771P551J4223k0904k4904
20870c8537K6131K6010J8852r365l240n967k568O110l654j5971n059J8176k9386
20857a8468j9053N331J9025o483J8337J8856J2842k1716j3478K5444j8672J719
$$ y = [-21794, -11382, 15513, 29064, 36517, 21331, -579, -13619, -22326, -15777, -6203, 16756, 49854, 42013, 17980, 42742, 22965, -3846, -50535, -65212, -54226, -44814, -68272, -44009, -23039, -1844, -11545, -3095, 31234, 61493, 40619, 31857, 13529, -7238, -9973, -13866, -44018, -34110, 5720, 9709, -1918, -18018, -46319, -58405, -14570, -11172, -10433, -20550, -12390, -18067, -19366, -22802, -13733, 5182, 14016, 859, -14387, -18588, -33418, -23716, -8932, 1075, -2540, 1530, -34820, -49298, -37670, -17069, 13053, 8093, -4732, -14503, -6952, 7271, -13633, -38537, -12406, 13604, 32456, 23091, 19851, 13884, 11316, 17426, 13772, -2199, -7258, 10918, -18468, -37521, -32190, -13165, -19648, -1311, 17545, 30387, 8671, -4807, 20637, 1965, 3684]
20845C684J2961k20m4837k8534J1709M8617J5498J7128k5190l2468L039J145K148
20832a5320q708j6557K8080L0476J6299J0816l7193r830j449l3398k3946l346
20820f4076L0212K4253j0188k8849Q794J7892J2284J9978k2270m885J6318J1433
20808A0896P066k2389o961k0845J6927o372m362J7411r265J0616j052k9162n510
20795d3002M1866L3273k3119k1907L7513J9213l2328k1690r726r665K6325J660
20783a587n35r302n387J2325k4943q680J9278M0020J7508J979j0614k227o118
20770B1717K50p827J823J5964K919m0700l3468K0143R660r061J743K2513J0463
20757A6139j0036M692p135J2557r099j3526k7671J7197j1883k4572M668j2700
$$ y = [3684, 16645, 16425, -28412, -56946, -45237, 3380, 18878, 36006, 10816, -21652, -18613, -17468, -15320, -24028, -40585, -12505, 17971, 34270, 45086, 7893, -1937, -3386, -36784, -60730, -64076, -33864, -9611, -19799, -48648, -39854, -21962, -9678, 10300, -11970, -16855, -537, 10896, 17962, -4427, -11388, -32233, -15306, -21678, -26040, -8629, -17894, -7278, -8330, -37492, -43002, -1136, 32137, 9018, -12889, 24624, 43837, 11509, -10181, -19907, -29572, -3247, -1587, -2122, -11424, -16811, -4486, -29429, -38109, -18831, 21189, 38697, 40676, 30062, 27835, 21717, 21967, 14140, 15963, 31927, 34846, -5854, -39322, -19179, -9519, -18580, -16837, 5676, 16139, 6103, 10795, 3660, 16217, 7118, -6408, -34079, -16882, -28765, -53337, -48669, -61369]
20745f1369L7172M9840k5094o681m229j171k7820j9804L7685J1516N012L0888
20733B5945K904O65k291R419m1607j4812K6540L4941N618l0349o552j2212l2046
20720c3837J3060M2543j1151j6946Q651Q218j4364l703J9472J1478j2681j1452
20708g12J0594j1985k650n252k708M332N994m314j5518k3890P112J0831L834J6335
20694g997j5135M838J3060K6311M0177N872j4237O215l282m3014K3333K2594L5488
20681I4223p125j9217m7359k6936l899q709j3696k348J7762j4913r122J0188N571
20668b5580L5584L0624L1291k7441m1357R293J8482M775k6105l677P902J2973
20656B6764K988M743N827l308J791m26k5261k9510J5521L8550k7113l9683j5990
$$ y = [-61369, -24197, 25643, 549, -6132, -10361, -11532, -39352, -59156, -21471, -9955, -4943, 25945, 28849, 29514, 27223, 36642, -4965, -19777, 6763, 41704, 47322, 16973, 10421, -1791, -33837, -20777, 21766, 10615, -6331, 2320, 10538, -3826, -7529, 11943, 23421, 10740, -712, 9882, -2103, -4753, -10005, -12713, -8381, -2387, -6701, -22219, -46109, -38997, -28166, -24332, -7997, -23132, -18294, -5234, 21077, 61254, 67126, 52889, 59104, 55822, 12808, 36141, 58735, 94223, 87098, 67881, 20522, -6414, -10313, -19022, -32718, -35066, -17304, -32217, -41339, -31151, -25580, 10004, 40628, 71919, 44478, 3121, 12414, 30896, 35671, 9566, 5889, 13791, 26764, 29752, 34495, 40322, 37014, 38805, 38379, 13118, -16392, -871, 37679, 10566, -29117, -45107]
20643d5107N731M7094j7713n515k231m686l457M556k669k1513R681K7703J8178
20630A0052j3348k9467K5432k551k0276J2168L0342K6325K091k0974R074l3872
20618e004j7598J9606J9878N45j256r296l3968l2099J8762L4080k0798K343j9189
20605d3994J0183J1625K7992j274j3668R396L4135P716J5792m697k2839P072J5744
20592E3183j681n4609p467n238M9828K4590j7037o487J3314l855J9905J2984o85
20579G6745k9474p173k1336L0312j1130P685m861K422j7555m474o101k3353L758
20566d535L7529m635q300J5839J7237j077j7979l7911j511R931m193n742l930
20553i277j250J7419n703k3306q607l15J4741j4Q57J9617r340K9381q603n139
$$ y = [-45107, -39376, 7718, -9995, -15510, -17741, -22427, -25884, -21328, -23997, -45510, -35829, -8126, 10052, -3296, -32763, -7331, -9882, -30158, -17990, 12352, 38677, 40768, 19794, 28868, -5004, -22602, -2996, 16882, 17427, 16171, 6875, -27093, -59192, -40430, -6350, -27148, -24805, -43994, -33811, -22186, 5806, 4532, -9136, 260, 34395, 42111, 57903, 53206, 30367, 37439, 53183, 51502, -3107, -10574, -15812, 34016, 58606, 41569, 35082, 48396, 44541, 64446, 77430, 76745, 47271, 40098, 18762, 49074, 37944, 45629, 40768, 43190, 25635, 21161, 15060, -8293, -4535, 32994, 28359, 20059, 35898, 53135, 52058, 34079, -3832, -5343, 4588, 395, -5347, -9277, -10527, 6892, 1189, -22117, -30724, -31039, -16298, -16312, -15455, 4162, -5178, 24203, 15600, 10461]
20539A0461j0724m8943k1026K3607K9895J8913K3867k281j8067J4375k1652k6688
20527b8263j8909L1152K0089j1509j6824J5241J5237L6367l721k4705J941K909
20515A9005m3913j6796k494j1998J2653j0257J0419K2943m450K1369j1489O433
20503h575j8277j0853J8275l327j5068P800K9531j374J1751R432r25j4598j7602
20490a3810j2460k037K505J8564K2073j7904j1230J7307Q787j1610j7969j0070
20478b7854q70J7927L3815P607j6189m180q130j4020J2823k9580K2736K103j1058
20465a4870J858Q494M977J4166O216p708q181R037L186R441K9436K87l1755k3664
20451I20j1833J2493R657k2154n774K2511J0247J214J3182k0318q177J845l193
$$ y = [10461, -263, -49206, -70232, -46625, -16730, 2183, 26050, 23769, 5702, 20077, -1575, -28263, -47172, -16020, 4069, -7440, -24264, -9023, 6214, 42581, 38860, 14155, 16096, 19005, -24908, -41704, -44198, -56196, -43543, -53800, -43381, -20438, -24888, -3519, -15008, -8575, -26852, -37705, -19430, -22757, -37825, -30025, -494, -1868, 9883, 19315, 18390, 3792, -13810, -26270, -28307, -25802, -7238, 14835, -3069, -14299, 3008, 11795, 185, -17784, -27854, -28724, -10797, 23018, 30625, 14436, 10256, 2126, -11894, 929, -28651, -5915, -3812, -14870, -13012, -4518, 459, 14625, 20841, 13133, 4952, 13989, 17175, 26616, 56052, 56339, 24584, 920, -10913, 1580, 11237, -10917, -16691, 5820, 16067, 17281, 30463, 10145, 1968, 3813, 620]
20438F20L4737J2587k5602k4793k1245n1227j4721O2426L6277p818J3062K5575
20426C9878J374j8564j1029J9041K1590o147m9088n037K9227k3817k2426n650
20414c0648j0767J1943j5932K4154O208J1448J5110j1441P84k505K5707P009j7625
20401A3445P673L9497R566K7947k8682l0091j614q220J2821J9689R45k686q352
20388E1938l4441Q567j0735K8269K8861J5537k481J0195J7910L7045M3037K1276
20376B14978J362N9485N3269k4546k6560P355m2012m8981k8532k166m704q893
20364A50055J858n074k9359o4044k3070K0840K1193J8424J011j3007j3022K170
20352F7975j8990m6175J3485M51j7910n860L2198K0313l9984k3776j0987P090
$$ y = [620, 35357, 47944, 22342, -2451, -23696, -74923, -89644, -27218, 9059, 1241, 14303, 39878, 41252, 22688, 11659, 30700, 52290, 46143, -2945, -7982, 21245, -2572, -24998, -30648, -41415, -29472, -45404, -21250, -15042, -3594, 11516, 75, 859, -1646, 24061, 31070, 13445, 21118, 60615, 70181, 98128, 69446, 39355, 37741, 29521, 42342, 62031, 62976, 60290, 51938, 17497, 26064, 15329, 43598, 72459, 87996, 85515, 95710, 113620, 150665, 193702, 214978, 216340, 275825, 329094, 304548, 277988, 285343, 243331, 194350, 165818, 163652, 158948, 150055, 151913, 146839, 117480, 53436, 30366, 51206, 72399, 90823, 91834, 78827, 65805, 67975, 48985, 2810, 16295, 16746, -1164, -7024, 25174, 45487, 5503, -18273, -29260, -22170]
20340b2170k0081o256K2556J7497J5571J0775J1348j1962K6578K4297j4534k6495
20328B7124O9O725j1810j9169j0111k7120K2386L0625m456l2192m000K1191j6743
20315a7481J2843K3366o370k6165k944M1608j501K2137j95J2261K728k4789L004
20302C8502J3606j8497P823R354k4289l9742J9503K8432O2l6851j2243Q39J1417
20289b084m803j2328K1806K1656J4643R946l5018p010j1898K2002K36l0480l655
20276a6987k9843j2818L4811J3913j296j8786J7774L9396r533J220J3286j5177
20264A5960l594J934J8885J8933k7847j05N364O061j2311M971j7839l3j2805J1002
20250H576J3010k8015l790N722P667p986l2910K666K4146J3194q859m992m631
$$ y = [-22170, -42251, -48507, -25951, -8454, 7117, 17892, 29240, 17278, 43856, 68153, 53619, 27124, 27193, 33918, 22108, 2939, -7172, -34292, -11906, 18719, 14263, -17929, -21929, -738, -17481, -4638, 18728, 12358, -13807, -16751, 24857, 23356, 45493, 45298, 57559, 60287, 35498, 38502, 52108, 33611, 41434, 50788, 26499, -13243, 6260, 34692, 34754, -2097, -14340, -13501, -2084, -6887, -19215, 2591, 24247, 38890, 48836, 13818, 6808, -5090, 16912, 17148, -13332, -16987, -46830, -59648, -24837, -10924, -12220, -31006, -13232, 26164, 16631, 17851, 31137, 15960, 12366, 14300, 33185, 52118, 24271, 24166, 29530, 35591, 23280, 28251, 10412, 10379, -2426, 8576, 21586, -6429, -10219, -4497, 3170, -4816, -37726, -35060, -10914, 2280, -6579, -11571, -16202]
20237a6202J5706O924M197j0902J2196M0185k311j9206j0720R373j8932K8085
20225C8393M3908j8487J685n711m3394j6942j1108P983j3892J5062k3465j1798
20213c7766J8038K3705K511J0600J4107J035J1453J1085j3980m9017j5262K1976
20201a515q267k2909O372J3773j3072J0432K1243J2068K1317r2j9720N475J506
20188B6611K9609M8309q797l0060l8269N202L1485j133k190J7925j3207j5691
20176D9794j0518n938J326r806k984K9639K28j4224K9847J2106m2737l9013k0184
20163b2464p973K1451J0133J7799O407Q485r358j3344k2928j7511L969L572K8237
20150F475J1318M662O204j2612j8384o770P664J5353k9876p675o745K7874M130
$$ y = [-16202, -496, 6428, 10625, -277, 11919, 52104, 49793, 30587, 19867, 29240, 10308, 38393, 82301, 63814, 65499, 59788, 16394, -548, -11656, -3673, -17565, -2503, -25968, -37766, -19728, 3977, 6488, 17088, 31195, 32230, 43683, 54768, 40788, -8229, -23491, -1515, -9782, -32691, -26319, -12546, -25618, -15186, 6057, 18125, 39442, 39350, 19630, 25105, 26611, 56220, 104529, 95732, 65672, 27403, 32605, 64090, 62957, 60767, 78692, 65485, 49794, 39276, 33338, 34664, 24858, 21874, 51513, 51741, 37517, 67364, 79470, 36733, -2280, -22464, -30437, -8986, 1147, 18946, 25353, 33838, 24480, 11136, -11792, -29303, -25334, -21762, 6475, 17793, 22455, 28659, 16047, -2337, -9107, -1443, 13910, -15966, -23641, -30386, -2512, 1618]
20137A618k1918j3910j2k2115J6423J9042n380j834L2086L518j4028m3995k781
20124e3286K2074l656r106J648L9046L0105O463J957K027N506j093m0117j7878
20111a6310J9358J8422k4106N192K3881j696l2821k5110l1017M108M367l551L40
20098e8943J6378j2047M058J2141k7743M5267K3524k471N8196K1411K346J2786
20086I4903J1759n197J3155o859k2118k8629n979o885l1008J3685J9388j380r168
20073C5667k3425j4707K496Q830k3154j5802P416J6569O682L3305K8644O45j0648
20060E2518l2400J8057R663O846k3940l4930j2260j840n600J8619k527J4887J7751
20047B4844P783j6776k297j0750p094J127J0849k5905J6543M0028Q54j5544j2200
$$ y = [1618, -20300, -34210, -34222, -56337, -39914, -20872, -26252, -28086, 4000, 7518, -6510, -50505, -53286, -31212, -34868, -43974, -42326, -3280, 26825, 33288, 35245, 37272, 42778, 41685, 1568, -16310, 3048, 21470, -2636, 2556, 26437, 24741, -8080, -33190, -64207, -60099, -55732, -59283, -58943, -42565, -54612, -50554, -38413, -66156, -20889, 2635, 164, 58360, 79771, 82117, 94903, 106662, 101465, 114620, 107761, 85643, 57014, 51035, 44150, 13142, 26827, 46215, 44835, 35667, 12242, -2465, 31, 8861, -14293, -30095, -22679, -6110, 572, 33877, 62521, 63166, 52518, 20118, 38175, 47838, 54684, 30744, -4186, -16446, -18286, -23886, -5267, -7794, 7093, 24844, 32627, 15851, 13554, 2804, -4290, -3163, 7686, -18219, -1676, 38352, 39206, 23662, 11462]
20034A1462M006j2502k935o239l750j1805R333J5826K8397M564J7680J4079o972
20021F1144k5986J3022J8033k8266o638J6652J5234j8403j1735j2706N20J4161
20009C5032j6293j8308O523K1682M1235L1356L1176j4643q790j8714m9449j1375
19997B9432K7587j3184O840K5167K17j5489k2047Q48m190l6036J724K1073O684
19984B8626J3013R177l469R137K687J1898j5980k8731J0376J5049J7690j4801
19972E4672m14J3201N5108J1024j0868j040J0137j5180l117r028l1308J6531j8279
19959G1439Q937J3545p53n768l202k4793k0864M4358N3743P327K5440o063j6852
19946A46494k7434J3417J6046K0100n202Q514J4728J7562N2555J9686o0320l3806
$$ y = [11462, 15468, 2966, 31, -6208, -9958, -21763, -12430, 3396, 31793, 36357, 54037, 68116, 61144, 35158, 48180, 66213, 37947, 31309, 47961, 63195, 44792, 33057, 20351, 20871, 35032, 18739, 431, 6954, 28636, 69871, 101227, 132403, 117760, 108970, 90256, 40807, 29432, 57019, 43835, 50675, 75842, 76059, 60570, 38523, 39371, 35181, -855, 869, 21942, 28626, 41639, 50816, 47347, 56484, 59171, 71069, 55089, 26358, 36734, 51783, 69473, 54672, 54258, 67459, 122567, 133591, 122723, 121683, 131820, 116640, 113523, 104495, 73187, 89718, 71439, 80376, 93921, 93168, 87400, 84198, 59405, 38541, 82899, 136642, 143969, 169409, 163346, 146494, 119060, 132477, 148523, 168623, 163421, 171935, 186663, 204225, 256780, 276466, 216146, 182340]
19934A82340K4171J508k3507j8139o302n064p451l7984M665k5523m7128j3555
19922B8031k1267k2267l7835k574M7558J8743M401l8634k7198j1272L3850R329
19910a9135J3333p595p948R765L9506K027j5131M190M4984J5707J2449L0823K2428
19897A45403J7022J5713L6092J4211K0437M478L45J439K490j711k9746J6320L4453
19884B76946R433L1528J7613l4834j4006j6960j2438J3159r188l3736l148j9054
19872B05315j931M1218J0835m3681l4669J3138L0647j9770p004J6309n3555j3211
19860A43641j6509j8777k6990j0910M974J0309K8672L2675J2781M082q120m0385
19848A15443q8737l5616j9994j0058k0727J2763P6382O2233K9735M9561L331k841
$$ y = [182340, 206511, 208019, 184512, 166373, 160071, 155007, 147556, 109572, 114237, 88714, 41586, 28031, 6764, -15503, -53338, -55912, -8354, 10389, 14790, -23844, -51042, -62314, -28464, -19135, -5802, -13397, -21345, -11580, 27926, 29953, 14822, 19012, 63996, 79703, 92152, 122975, 145403, 162425, 178138, 214230, 228441, 248878, 253356, 253701, 255140, 257630, 255919, 226173, 242493, 276946, 286379, 317907, 335520, 300686, 286680, 269720, 257282, 270441, 261253, 227517, 224369, 205315, 203384, 244602, 255437, 211756, 177087, 190225, 220872, 201102, 194098, 210407, 156852, 143641, 127132, 108355, 81365, 70455, 75429, 85738, 114410, 147085, 159866, 163948, 155828, 115443, 26706, -8910, -28904, -38962, -59689, -46926, 29456, 91689, 121424, 170985, 174316, 171475]
19836A71475L113R085j1794J4275m407K8723N270n5469l4747m1731k0386K9408
19824I2815K9509j2185J5723j036M2128k454q327K0085J5292R598k2102K5206
19812B04252L7680r942k837r561J7172J3512J9736N613l4971k4016J135l0084
19800A87689l5711J780j6642p123N7185J9946M997J6405R10K9699M0645O878L811
19787C10469K4902K8030J4895J4993k4053O198Q907P723K1694P2838M4992J2250
19775E43838M2152M8250J6067L2925Q438m1857q4210n1460o3510k004P4309Q1349
19763F04287M0318j8459l7908k7294L196K9687P4117N8645R3476J30560J10064
19752A060689J17709J23745J50271J37185Q4056R0344N9170J41749J84937J22907
$$ y = [171475, 174588, 183673, 171879, 186154, 181747, 210470, 215740, 160271, 125524, 83793, 63407, 92815, 122324, 110139, 125862, 124826, 166954, 164500, 156173, 176258, 191550, 201148, 179046, 204252, 241932, 231990, 229153, 219592, 236764, 250276, 270012, 275625, 240654, 216638, 217773, 187689, 151978, 153758, 137116, 129993, 187178, 207124, 212121, 228526, 229436, 259135, 299780, 306658, 310469, 335371, 363401, 378296, 393289, 369236, 375434, 384341, 392064, 413758, 486596, 531588, 543838, 585990, 634240, 650307, 683232, 691670, 649813, 565603, 514143, 450633, 448629, 522938, 604287, 644605, 626146, 588238, 560944, 564140, 593827, 667944, 726589, 820065, 950625, 1060689, 1178398, 1302143, 1452414, 1589599, 1673655, 1763999, 1823169, 1964918, 2149855, 2272762]
19742B272762J46192J84747J38425J23170R9588J49577L48838M43079M46394N26294
19732D879066P35073Q76540R65580J343362J751011K090450K863140M050608N507776
19723B5062606P150926Q840492J0372202J2025065R850000r88222r451833r391471
19715E3469765p342690m992256k908828j662744j674186k782542l790199l826624
19707B4489696l291666k984433k783750k286583j749044j322979j041908r00068
19699H129265q75911q88574q94819p54135n01861k56967j06970j04550j28861
19690C616617r8933j61760j54689j42271k30585k32326j90360j26369j15857j04663
19680B058804j36518j46277j49575j50879j69199j70024j45350n6058k7882k7237
$$ y = [2272762, 2418954, 2603701, 2742126, 2865296, 2964884, 3114461, 3463299, 3906378, 4352772, 4879066, 5614139, 6490679, 7456259, 8799621, 10550632, 12641082, 15504222, 19554830, 25062606, 32213532, 41054024, 51426226, 63451291, 73301291, 72313069, 62861236, 53469765, 46127075, 41134819, 38225991, 36563247, 34889061, 32106519, 28316320, 24489696, 21198030, 18213597, 15429847, 13143264, 11394220, 10071241, 9029333, 8129265, 7253354, 6364780, 5469961, 4715826, 4213965, 3956998, 3850028, 3745478, 3616617, 3517684, 3355924, 3201235, 3058964, 2828379, 2596053, 2405693, 2279324, 2163467, 2058804, 1922286, 1776009, 1626434, 1475555, 1306356, 1136332, 990982, 934924, 907042, 879805]
19670H79805l4464k4954r4348j37194p4708l8020m8194j00919j24121o1031k4289
19659A17563R114K3399L832J2503k619m0314o490j5655n0137p6224j6594N0298
19647H676Q0907P8202N9207N1511K1379p998k3125j2951m6417j5239k0622l2753
19635A40777p160K223J0100k2352m8201l0871J3116J2660q646O150j8805R654
19623E8645J7356K0825J9999j7228q514K4519K3068L8674N7298K6664J7325k0756
19611B57875k1766j6605m403n9176m6696k4115p39L3881J7091j5751k9625m4765
19599D5206n539M8155J1612k492K7676O5159L7059L8185L3646j4008k8499l1345
19587B24815k1826j3950J5069L1k364l8480j6204L8650L5850k9191m8324R438
$$ y = [879805, 845341, 820387, 726039, 588845, 514137, 476117, 427923, 327004, 202883, 141852, 117563, 126677, 150076, 153908, 166411, 163792, 123478, 116988, 101333, 51196, -25028, -41622, 8676, 89583, 167785, 226992, 278503, 299882, 291884, 268759, 255808, 209391, 194152, 173530, 140777, 133617, 135840, 145940, 123588, 75387, 44516, 57632, 70292, 61646, 67796, 48991, 58645, 76001, 96826, 116825, 99597, 91083, 115602, 138670, 177344, 234642, 261306, 278631, 257875, 236109, 219504, 215101, 155925, 109229, 85114, 84375, 118256, 135347, 119596, 89971, 45206, 39667, 87822, 99434, 96942, 124618, 189777, 226836, 265021, 298667, 284659, 256160, 224815, 202989, 189039, 204108, 204139, 201775, 163295, 147091, 185741, 221591, 192400, 144076, 153514]
19575A53514L3849k042Q154k9j9274k5919l0787k4561m1717m6087J7274K1824
19563D4199j8322N64K4745M2987K6250M24O14j813j0702k622K7582K3105J1806
19550A68817R499L2146N3379J2578j3523J4165P434n672j6523K870L9969N380
19538C10519q2K1471j4090K6022L6002Q331k0781J0807K0853M7220M8326K1023
19526E15621k4904K483J131l426j5407M779O856n057l4910n336K2294J4823R091
19513D88038N663k2489l6476k8627m6310m162l6114J441K6821L425J2424J5408
19501C79042R604J9069l4756k8481K2336L1323L3748L2950p85q770J3914J6035
19489D85229M6402K0383M9599L8188P21j8261M1556M3109M480L461j6284R822
$$ y = [153514, 187363, 185321, 193475, 193446, 174172, 148253, 117466, 92905, 51188, 5101, 22375, 44199, 25877, 26441, 51186, 94173, 120423, 120847, 121461, 119648, 108946, 106324, 133906, 157011, 168817, 178316, 210462, 263841, 276419, 262896, 277061, 284495, 278823, 262300, 265170, 305139, 310519, 310437, 331908, 317818, 343840, 379842, 388173, 367392, 378199, 399052, 446272, 494598, 515621, 490717, 493200, 494331, 490905, 475498, 480277, 487133, 482076, 447166, 441830, 464124, 478947, 488038, 493701, 471212, 434736, 406109, 359799, 355637, 319523, 320964, 347785, 351210, 363634, 379042, 388646, 407715, 372959, 344478, 366814, 398137, 431885, 464835, 464050, 455280, 469194, 485229, 531631, 552014, 601613, 639801, 640522, 622261, 663817, 706926, 711406, 714867, 698583, 708405]
19477G08405J3090K5113j812K620O0781K5361L2715N5635J9727J6416L7312P6247
19465A071610M9082L3441M4007R5885J46425J34772J10200J32633J17629J50729
19455B086413J89974K19016K73611L13013L54121M10233L98545L52462L69060
19446D966448L03560L31455M33489O15309P57964R61197J222772J565280J918125
19437A3075599K351415K781299L116302L027412K438379J936918J979596K184069
19429C2890989J961340J431947J002663K71973j080809j914402j757439j285291
19421C1520971r26123p36754o37171o46327q15102j215096j721846k077800k112727
19412B0632025j912411j633800j293124j056295r11312q13034p72578p12054n70234
$$ y = [708405, 721495, 746608, 744796, 747416, 808197, 833558, 866273, 921908, 941635, 958051, 995363, 1071610, 1120692, 1154133, 1198140, 1294025, 1440450, 1575222, 1685422, 1818055, 1935684, 2086413, 2276387, 2495403, 2769014, 3082027, 3436148, 3846381, 4244926, 4597388, 4966448, 5270008, 5601463, 6034952, 6650261, 7408225, 8369422, 9592194, 11157474, 13075599, 15427014, 18208313, 21324615, 24352027, 26790406, 28727324, 30706920, 32890989, 34852329, 36284276, 37286939, 37558912, 36478103, 34563701, 32806262, 31520971, 30594848, 29858094, 29220923, 28574596, 27759494, 26544398, 24822552, 22744752, 20632025, 18719614, 17085814, 15792690, 14736395, 13825083, 13012049, 12239471, 11527417, 10957183]
19403A0957183l78816k24407k5817J42868K91047M82102O33467P08189O73636
19394A3259452N96433N59271N70403P43446J045117J454443J987855K582530L236249
19385B6035199L745048M038234L785170K831717J439441j16612j210637j402963
19377C9144597q07890l8236O02364R82104Q60726l6195j432257k353633k586960
19368C4334620k603050k684447k650523k428914k248711k101246j985596j838921
19360A5793212j674050j539747j408765j259238j049273q90670p95363o96311
19352F479795o17380n68942n11542m52301m06139l44513k62101k21883k10264
19343B884730j67410j88262k01536j69842j15351j38113j65983j07742q2986j11618
$$ y = [10957183, 10578367, 10353960, 10328143, 10471011, 10762058, 11244160, 11877627, 12585816, 13259452, 13855885, 14415156, 14985559, 15729005, 16774122, 18228565, 20216420, 22798950, 26035199, 29780247, 33818481, 37603651, 40435368, 41874809, 41758197, 40547560, 39144597, 38336707, 38298471, 38900835, 39882939, 40743665, 40707470, 39275213, 36921580, 34334620, 31731570, 29047123, 26396600, 23967686, 21718975, 19617729, 17632133, 15793212, 14119162, 12579415, 11170650, 9911412, 8862139, 7971469, 7176106, 6479795, 5862415, 5293473, 4781931, 4329630, 3923491, 3578978, 3316877, 3094994, 2884730, 2717320, 2529058, 2327522, 2157680, 2042329, 1904216, 1738233, 1630491, 1547505, 1435887]
19333A435887j05307q2055j00363j32643j12945q1053m4164r3626o5361k9534
19323E88836j0662m6545l6155l5865m1635l5476k5854m0165k3619l8583k1884
19312B32393l3102k145J2041l279k0402N1182N6583M242l316j7168j552k1084
19300B54393j9866n827j454K6169R8N286j358k8861j7151q838m079j5242m991
19287A78279j6881k2704j917O947n237J1462r342Q998L697K5413J9836r677m8026
19274A40848j9320p25j2637j0972j5852m479q300L1683L1568j6186m2219m6374
19262B7035L451K2422j4410J5669K2783M2542J8663l8756k1077J5668R355K3739
19250A27084J6018L854L7696M9824J0846Q780j547r879J1165m635j0931r934M438
$$ y = [1435887, 1330580, 1248525, 1148162, 1015519, 902574, 821521, 777357, 683731, 618370, 588836, 578174, 531629, 495474, 459609, 417974, 382498, 356644, 316479, 292860, 254277, 232393, 199291, 197146, 209187, 205908, 185506, 236688, 293271, 297513, 294197, 277029, 275477, 254393, 234527, 228700, 227246, 253415, 253513, 258799, 257441, 228580, 211429, 202591, 198512, 183270, 178279, 161398, 138694, 136777, 143724, 138487, 149949, 140607, 149605, 153302, 178715, 198551, 188874, 140848, 121528, 120803, 108166, 97194, 81342, 76863, 68563, 100246, 131814, 115628, 73409, 27035, 30486, 52908, 38498, 54167, 76950, 119492, 138155, 99399, 78322, 93990, 103345, 127084, 143102, 146956, 184652, 234476, 245322, 254102, 252555, 242676, 253841, 249206, 238275, 228341, 232779]
19237B32779M8388J3904k7467J0345L2182q300n059j4895k0184j1397k4638j8377
19225B07281K1822L996j8255m0974j2428K4956k6037j9714k95n737k691j2716
19213A19208K1733K9756j139j6010k4661l984k458L0425M0598j7527K582q826
19201A69697M640K8400L7587K1218J640l41L603Q555k640K2618L8010J7255J1178
19188C61420L643K8455K4953o086m6R24j503L824O949J2467j7254J238l116j5098
19174D00770r569o867j4612j4000J5597Q893Q687p79l1907j1720R714J4317j1420
19161C57104J5767O034L0460K1466l001j7792j7633j3130L3066j0333j5420k0650
19149C65938P15o537j6153K8452M2955J4782L6466M1428L4117K0125O5334M4931
$$ y = [232779, 281167, 295071, 267604, 277949, 310131, 301831, 296772, 281877, 261693, 250296, 225658, 207281, 229103, 233099, 214844, 173870, 161442, 186398, 160361, 140647, 140352, 134615, 131924, 119208, 140941, 170697, 169558, 153548, 128887, 124903, 122445, 152870, 193468, 175941, 178523, 169697, 174337, 202737, 240324, 261542, 263182, 262841, 266444, 274999, 272359, 294977, 332987, 350242, 361420, 365063, 393518, 418471, 412385, 412339, 413263, 411760, 415584, 422533, 435000, 417746, 418984, 415868, 400770, 391201, 384334, 369722, 355722, 371319, 380212, 388899, 388120, 356213, 344493, 354207, 368524, 357104, 372871, 378905, 409365, 430831, 427830, 410038, 392405, 379275, 412341, 402008, 386588, 365938, 366653, 360116, 343963, 372415, 415370, 430152, 466618, 508046, 542163, 562288, 627622, 672553]
19137F72553P8612M1237M4466R9761R7430J27129J91376K40760K52164L16975
19127B162463L91864M24511M06228L21851K63480K79470K82928M02262N11916
19118E446973N74526M59822R8237j76128k51105k07094j01018J9375M8119l6617
19108E875090k09393l98551m48931m24714l41363k53643j84331j60179j77196
19099C276789j49365j20887j03478q9491m6016K9196M9608J05359K08420K57418
$$ y = [672553, 751165, 792402, 836868, 936629, 1034059, 1161188, 1352564, 1593324, 1845488, 2162463, 2554327, 2978838, 3385066, 3706917, 3970397, 4249867, 4532795, 4935057, 5446973, 6021499, 6481321, 6579558, 6403430, 6152325, 5945231, 5844213, 5863588, 5911707, 5875090, 5665697, 5267146, 4818215, 4393501, 4052138, 3798495, 3614164, 3453985, 3276789, 3127424, 3006537, 2903059, 2813568, 2767552, 2796748, 2846356, 2951715, 3160135, 3417553]
$$ [...]
##END NTUPLES=NMR SPECTRUM
##END=
