##TITLE=Analysis number 307269
Compound Code sew 02871
Book Reference 409/148/3
Project Code adrs
Chemist Name peted
##JCAMPDX= 6.0         $$ Bruker NMR JCAMP-DX V2.0
##DATA TYPE= NMR SPECTRUM
##DATA CLASS= NTUPLES
##ORIGIN= Bruker BioSpin GmbH
##OWNER= NMR
$$ XWIN-NMR		Version 3.5
$$ Tue Apr 26 14:08:10 2005 GMT Daylight Time (UT+1h)  MAYBRIDGE\NMR@NMR_250MHZ
##.OBSERVE FREQUENCY= 250.131544655141
##.OBSERVE NUCLEUS= ^1H
##.ACQUISITION MODE= SIMULTANEOUS (DQD)
##.ACQUISITION SCHEME= undefined
##.AVERAGES= 16
##.DIGITISER RES= 18
##SPECTROMETER/DATA SYSTEM= dpx250
##.PULSE SEQUENCE= zg30
##.SOLVENT NAME= CDCl3
##.SHIFT REFERENCE= (INTERNAL, CDCl3, 0, 16.522)
##AUDIT TRAIL= $$ (NUMBER, WHEN, WHO, WHERE, WHAT)
$$ ##TITLE= Audit trail, XWIN-NMR		Version 3.5
$$ ##JCAMPDX= 5.01
$$ ##ORIGIN= Bruker BioSpin GmbH
$$ ##OWNER= NMR
$$ C:\u/data/dgb/nmr/ADRS/2270/pdata/1/auditp.txt
$$ ##AUDIT TRAIL=  $$ (NUMBER, WHEN, WHO, WHERE, WHAT)
(   1,<2005-04-26 14:07:50.74 +100>,<MAYBRIDGE\NMR>,<NMR_250MHZ>,
      <created by zg, POWCHK disabled, PULCHK disabled
       configuration hash MD5:
       62 19 C7 07 E1 42 D1 B7 37 6C 3D D0 77 39 F9 E6
       data hash MD5: 64K
       A2 5F 5F E8 7B 82 48 88 AA CF F6 71 B0 CB 62 B0>)
(   2,<2005-04-26 14:08:02.74 +100>,<MAYBRIDGE\NMR>,<NMR_250MHZ>,
      <Start of raw data processing
       ef LB = 0.3 FT_mod = 6 PKNL = 1 SI = 32K 
       data hash MD5: 32K
       6A 42 85 2D 6E B6 CC B3 06 B6 B2 DA 46 BF 35 A9>)
(   3,<2005-04-26 14:08:04.30 +100>,<MAYBRIDGE\NMR>,<NMR_250MHZ>,
      <apk 
       data hash MD5: 32K
       17 D2 0C 69 7B 0F C5 E2 79 1D 08 17 C4 FF 30 54>)
(   4,<2005-04-26 14:08:05.05 +100>,<MAYBRIDGE\NMR>,<NMR_250MHZ>,
      <abs ABSG = 5 
       data hash MD5: 32K
       CF 26 1A ED 60 78 76 05 1B A3 1D 53 99 68 6D 95>)
$$ ##END=
$$ 
$$ hash MD5
$$ 22 CA 67 97 4B 84 3E 07 B3 48 3C A8 EF 47 C5 45
##$RELAX= 
##$RELAX= 
##$RELAX= 
##$RELAX= 
##$RELAX= 
##$RELAX= 
##$RELAX= 
$$ Bruker specific parameters
$$ --------------------------
##$DU= <C:\u>
##$EXPNO= 2270
##$NAME= <ADRS>
##$PROCNO= 1
##$TYPE= <nmr>
##$USER= <dgb>
##$AMP= (0..31)
100 100 100 100 100 100 100 100 100 100 100 100 100 100 100 100 100 100 
100 100 100 100 100 100 100 100 100 100 100 100 100 100 
##$AQSEQ= 0
##$AQ_mod= 3
##$AUNM= <au_zg>
##$AUTOPOS= <34 >
##$BF1= 250.13
##$BF2= 250.13
##$BF3= 250.13
##$BF4= 250.13
##$BF5= 500.13
##$BF6= 500.13
##$BF7= 500.13
##$BF8= 500.13
##$BYTORDA= 1
##$CFDGTYP= 0
##$CFRGTYP= 5
##$CHEMSTR= <none>
##$CNST= (0..31)
1 1 145 1 1 1 1 1 1 1 1 1 1 1 1 1 1 1 1 1 1 1 1 1 1 1 1 1 1 1 1 1 
##$CPDPRG= <>
##$CPDPRG1= <>
##$CPDPRG2= <>
##$CPDPRG3= <>
##$CPDPRG4= <mlev>
##$CPDPRG5= <mlev>
##$CPDPRG6= <mlev>
##$CPDPRG7= <mlev>
##$CPDPRG8= <mlev>
##$CPDPRGB= <>
##$CPDPRGT= <>
##$D= (0..31)
0 1 0 0 0 0 0 0 0 0.06 0 0 0 0 0 0 0.0002 0 0 0 0 0 0 0 0 0 0 0 0 0 0 
0 
##$DATE= 1114520869
##$DBL= (0..7)
120 120 120 120 120 120 120 120 
##$DBP= (0..7)
150 150 150 150 150 150 150 150 
##$DBP07= 0
##$DBPNAM0= <>
##$DBPNAM1= <>
$$ [...]
##$SUBNAM7= <"">
##$SUBNAM8= <"">
##$SUBNAM9= <"">
##$SW= 20.6930455092707
##$SWIBOX= (0..15)
0 0 3 0 0 0 0 0 0 0 0 0 0 0 0 0 
##$SW_h= 5175.983436853
##$TD= 65536
##$TD0= 1
##$TE= 295.16
##$TE2= 300
##$TE3= 300
##$TEG= 300
##$TL= (0..7)
0 120 120 120 120 120 120 120 
##$TP= (0..7)
150 150 150 150 150 150 150 150 
##$TP07= 0
##$TPNAME0= <>
##$TPNAME1= <>
##$TPNAME2= <>
##$TPNAME3= <>
##$TPNAME4= <>
##$TPNAME5= <>
##$TPNAME6= <>
##$TPNAME7= <>
##$TPOAL= (0..7)
0.5 0.5 0.5 0.5 0.5 0.5 0.5 0.5 
##$TPOFFS= (0..7)
0 0 0 0 0 0 0 0 
##$TUNHIN= 0
##$TUNHOUT= 0
##$TUNXOUT= 0
##$USERA1= <user>
##$USERA2= <user>
##$USERA3= <user>
##$USERA4= <user>
##$USERA5= <user>
##$V9= 5
##$VALIST= <valist>
##$VCLIST= <CCCCCCCCCCCCCCC>
##$VD= 0
##$VDLIST= <DDDDDDDDDDDDDDD>
##$VPLIST= <PPPPPPPPPPPPPPP>
##$VTLIST= <TTTTTTTTTTTTTTT>
##$WBST= 1024
##$WBSW= 4
##$XGAIN= (0..3)
0 0 0 0 
##$XL= 0
##$YL= 0
##$YMAX_a= 430510
##$YMIN_a= -275343
##$ZGOPTNS= <>
##$ZL1= 120
##$ZL2= 120
##$ZL3= 120
##$ZL4= 120
##$ABSF1= 16.522
##$ABSF2= -4.171173
##$ABSG= 5
##$ABSL= 3
##$ALPHA= 0
##$AQORDER= 0
##$ASSFAC= 0
##$ASSFACI= 0
##$ASSFACX= 0
##$ASSWID= 0
##$AUNMP= <proc_1d>
##$AZFE= 0.1
##$AZFW= 0.1
##$BCFW= 0
##$BC_mod= 0
##$BYTORDP= 0
##$COROFFS= 0
##$CY= 12.5
##$DATMOD= 1
##$DC= 0
##$DFILT= <>
##$DTYPP= 0
##$F1P= 14.0000005364418
##$F2P= -0.99999901652339
##$FCOR= 0.5
##$FTSIZE= 32768
##$FT_mod= 6
##$GAMMA= 0
##$GB= 0
##$INTBC= 1
##$INTSCL= 1
##$ISEN= 128
##$LB= 0.3
##$LEV0= 0
##$LPBIN= 0
##$MAXI= 10000
##$MC2= 0
##$MEAN= 0
##$ME_mod= 0
##$MI= 0
##$NCOEF= 0
##$NC_proc= -3
##$NLEV= 6
##$NOISF1= 0
##$NOISF2= 0
##$NSP= 0
##$NTH_PI= 0
##$NZP= 0
##$OFFSET= 16.522
##$PC= 1
##$PHC0= -66.82984
##$PHC1= 2.766138
##$PH_mod= 1
##$PKNL= yes
##$PPARMOD= 0
##$PSCAL= 4
##$PSIGN= 0
##$REVERSE= no
##$SF= 250.13
##$SI= 32768
##$SIGF1= 0
##$SIGF2= 0
##$SINO= 400
##$SIOLD= 32768
##$SREGLST= <1H.CDCl3>
##$SSB= 0
##$STSI= 32768
##$STSR= 0
##$SW_p= 5175.98343685301
##$SYMM= 0
##$S_DEV= 0
##$TDeff= 65536
##$TDoff= 0
##$TI= <Analysis number 999999
Compound Code 99
Book Reference 9
Project Code 9>
##$TILT= no
##$TM1= 0
##$TM2= 0
##$TOPLEV= 0
##$USERP1= <user>
##$USERP2= <user>
##$USERP3= <user>
##$USERP4= <user>
##$USERP5= <user>
##$WDW= 1
##$XDIM= 32768
##$YMAX_p= 303516402
##$YMIN_p= -238589
$$ End of Bruker specific parameters
$$ ---------------------------------
##NTUPLES= NMR SPECTRUM
##VAR_NAME=  FREQUENCY,     SPECTRUM/REAL,   SPECTRUM/IMAG
##SYMBOL=    X,             R,               I
##VAR_TYPE=  INDEPENDENT,   DEPENDENT,       DEPENDENT
##VAR_FORM=  AFFN,          ASDF,            ASDF
##VAR_DIM=   32768,         32768,           32768
##UNITS=     HZ,            ARBITRARY UNITS, ARBITRARY UNITS
##FACTOR=    0.157963299565203, 1,           1
##FIRST=     4132.6476996994, 0,             0
##LAST=      -1043.33573715361, 0,           0
##MIN=       -1043.33573715361, -238589,     0
##MAX=       4132.6476996994, 303516402,     0
$$ Real data points
##PAGE= N=1
##DATA TABLE= (X++(R..R)), XYDATA
$$ [...]
24068A0430N3297j6182k7331j3664m1566j8384K0120k8122L545J4468M698k7538
$$ 10430 63727 47545 20214 6550 -35016 -53400 -33280 -61402 -57857 -43389 -38691 -66229
24056f6229K6708K7231J9856l0311n511p3320k4388j7212M6633K2325J6342L0671
$$ -66229 -39521 -12290 7566 -22745 -28256 -101576 -125964 -143176 -96543 -74218 -57876 -27205
24044b7205J4994J2673l6588k4325L1359L1822L3990J6674m7905k4040k2402J4052
$$ -27205 -12211 462 -36126 -60451 -29092 2730 36720 53394 5489 -18551 -40953 -26901
24032b6901J5204J6728M1315j8293j8844N0274P4614J7995l3087n9462J9653N4369
$$ -26901 -11697 5031 46346 28053 9209 59483 134097 152092 119005 59543 79196 133565
24020A33565n6363j17668l610K9317L5992K4370L3357m007m2687k1142m456K5648
$$ 133565 77202 -40466 -44076 -14759 21233 45603 78960 74953 32266 11124 6668 32316
24008C2316j3187j0931J4907M6688l7595L368Q353n3902l959O164L3600o68l0106
$$ 32316 19129 8198 23105 69793 32198 35566 43919 -9983 -13942 -7778 25822 25154 -4952
23995d952k1948j0554J1081l6371J7986N3727Q233m7646j0761K8442q265J07372
$$ -4952 -26900 -37454 -26373 -62744 -44758 8969 17202 -30444 -41205 -12763 -21028 86344
23983H6344O9275j8435k5416o5929l4857l4848N586q795k7366m0419n729J2289
$$ 86344 155619 137184 111768 45839 10982 -23866 -18280 -27075 -54441 -94860 -100589 -88300
23971h8300Q1365N0570m640k9843k9179L9861L8590j9239k2731o0255O6614m593
$$ -88300 -6935 43635 38995 9152 -20027 19834 58424 39185 16454 -43801 22813 18220
23959A8220M179J9778n1470l9465R3669M2612o5404l7931k3488M426K3016J7959
$$ 18220 22399 42177 -9293 -48758 44911 87523 22119 -15812 -39300 -34874 -11858 6101
23947F101k5725L1238l809j364q71L4186P379n9527J5004j589k2596l0962j9242
$$ 6101 -19624 11614 7805 6441 5570 39756 47135 -12392 2612 1023 -21573 -52535 -71777
23934g1777M8865Q1306L0634m7834M9349r139r107L7012K0845l1162r5763N2640
$$ -71777 -22912 58394 89028 41194 90543 81404 72297 109309 130154 98992 3229 55869
23922E5869J7415o0786j0892M1722o729k1132l4236J0792k7382K0845L036m273
$$ 55869 73284 12498 1606 43328 36599 15467 -18769 -7977 -35359 -14514 -11478 -15751
23910a5751m4808j3664J5712Q8261J4111q1201R234L4344l5774l9444j0012J9413
$$ -15751 -60559 -74223 -58511 29750 43861 -37340 -28106 6238 -29536 -68980 -78992 -59579
23898e9579P361M1394L1344J4440k1330m9618O139M9564K0429j6501m6359o0004
$$ -59579 -52218 -10824 20520 34960 13630 -35988 -29849 19715 40144 23643 -22716 -82720
23886h2720J2242J5225M7338J4179J5992k4693l2195k6640K3886K2546L6612K3725
$$ -82720 -70478 -55253 -7915 6264 22256 -2437 -34632 -61272 -37386 -14840 21772 45497
23874D5497j9839K5131N94n3738J2268m2251m0231m960J8123l2918L8619J5850
$$ 45497 25658 50789 51383 -2355 9913 -32338 -72569 -77529 -59406 -92324 -53705 -37855
23862c7855J7778L0602k9612l1746M4554O420n6192j7858R413L2796L6453l6866
$$ -37855 -20077 10525 -19087 -50833 -6279 141 -56051 -73909 -64496 -31700 4753 -32113
23850c2113k5147k9125j4499J2498M7905J4179K4453O6477l1344j26134q4961
$$ -32113 -57260 -86385 -100884 -88386 -40481 -26302 -1849 64628 33284 -92850 -177811
23839a77811m767O089L3569J03034K714J0881j1711l549k4679K0785J123K4925
$$ -177811 -182578 -176489 -142920 -39886 -37172 -26291 -38002 -41551 -66230 -45445 -44322 -19397
23827a9397Q440k5437K4441m7204o1965O444J1511Q0139J4763J4669j760p8471
$$ -19397 -10957 -36394 -11953 -59157 -121122 -114678 -103167 -23028 -8265 6404 4644 -73827
23815g3827m3262K2688R7936P3149o110k4410l2059k5732k200L0132k9053m9898
$$ -73827 -117089 -94401 3535 76684 70574 46164 14105 -11627 -13827 16305 -12748 -62646
23803f2646K1126n4267m195K6224O7229J7108j2480q308L6228q349k3416p813
$$ -62646 -41520 -95787 -99982 -73758 -6529 10579 -1901 -10209 26019 17670 -5746 -13559
23791a3559j4440k9274k4461r533P948P716j0901P9045Q3400k2110L118l877Q328
$$ -13559 -27999 -57273 -81734 -91267 -83319 -75603 -86504 -7459 75941 53831 56949 53072 61400
23778F1400P086k1894l1401N860j6328j374j0100j5594j2361j9499N7985O4913
$$ 61400 68486 46592 15191 21051 4723 3349 -6751 -22345 -34706 -54205 3780 68693
23766F8693k5719n3153o5307J8676J7497M0364L3584J830m8819k6305J12159J8122
$$ 68693 42974 -10179 -75486 -56810 -39313 1051 34635 36465 -12354 -38659 73500 91622
23754I1622q8127n1415L9375O244j4310m5750l9964K949P931J1722M6852J0797
$$ 91622 3495 -47920 -8545 -2301 -16611 -62361 -102325 -99376 -91445 -79723 -32871 -22074
23742b2074L4133N6845K2863j3193k9397N4753K3314j00988J4193k9726k1842
$$ -22074 12059 68904 91767 78574 49177 103930 127244 26256 40449 10723 -11119
23731a1119l1034K2410M740J3804N0496J3912m1796n9841N650O5553P575Q276
$$ -11119 -42153 -19743 -15003 -1199 49297 63209 21413 -38428 -32778 32775 40350 48626
23719D8626j8073j2186o468k1717k0460M2345J7814q134K2854K2130n1760l0209
$$ 48626 30553 18367 11899 -9818 -30278 12067 29881 21747 44601 66731 14971 -15238
23707a5238K0411K9592o4184q1731J3006L5236J0867M4375m153L6100Q401J2046
$$ -15238 5173 34765 -29419 -111150 -98144 -62908 -52041 -7666 -11819 24281 32682 44728
23695D4728k3428l0002j7528l6318o1265M0145L9659P505l6086j1198N0271L1073
$$ 44728 21300 -8702 -26230 -62548 -123813 -83668 -44009 -36504 -72590 -83788 -33517 -2444
23683b444N8580R564k6748m7713K0493j5352l5831k6992J0611M0601l5290K6557
$$ -2444 56136 65700 38952 -8761 11732 -3620 -39451 -66443 -55832 -15231 -50521 -23964
23671b3964M2764R197k3239J6917l3229l6071K1267M403R290K8778j1818p891
$$ -23964 18800 27997 4758 21675 -11554 -47625 -26358 -21955 -12665 16113 4295 -3596
23659c596Q0343K3259n7675k5306N567L9132J479m542J8012j4224l3599m0904
$$ -3596 76747 100006 42331 17025 22592 61724 63203 58661 76673 62449 28850 -12054
23647a2054p423k091m8196L8689R083k5574l4549K770j5628P084M7991O6740Q98
$$ -12054 -19477 -21568 -69764 -31075 -21992 -47566 -82115 -79345 -94973 -87889 -39898 26842 27740
23634B7740j4238o5639j01093K2311M8536Q7052K0661L836k5574k4018j6028N8828
$$ 27740 13502 -52137 -153230 -130919 -82383 4669 25330 29166 3592 -20426 -36454 22374
23622B2374J4101l7362q090j0496j8516J3372k456j7407o0986n4633L4953J1476
$$ 22374 36475 -887 -8977 -19473 -37989 -24617 -27073 -44480 -105466 -160099 -125146 -113670
23610a13670N7634O1065N4305o3121j01767N4719o054j0502M4550o8561j7647
$$ -113670 -56036 5029 59334 -3787 -105554 -50835 -56889 -67391 -22841 -91402 -109049
23599a09049Q1495O7962j848l0361J8426N1115l0861n5887q841L1663O2526k1062
$$ -109049 -27554 40408 38560 8199 26625 77740 46879 -9008 -17849 13814 76340 55278
23587E5278k7902o0858o0667k212M5892J9842N3159O766k6239K5628J1237k3080
$$ 55278 27376 -33482 -94149 -96361 -50469 -30627 22532 29298 3059 28687 39924 16844
23575A6844j836q407j8904R427P077k2876l3567L2774J0776O2199L2532m0086
$$ 16844 15008 6601 -12303 -2876 4201 -18675 -52242 -19468 -8692 53507 86039 45953
23563D5953O098j0706m299k8831o7331j3338M7890J6177J7988L6689N3114n8769
$$ 45953 52051 41345 37046 8215 -59116 -72454 -24564 -8387 9601 46290 99404 40635
23551D0635q6309O020O0866M893K7109J5912m6053n1058k1978l9813K880o027
$$ 40635 -45674 -39654 21212 26105 53214 69126 23073 -27985 -49963 -89776 -86896 -92923
23539i2923J3771M2985l8760L8910K2577k7213O7616J2737n1659m7034L1897M6167
$$ -92923 -79152 -36167 -74927 -36017 -13440 -40653 26963 39700 -11959 -58993 -27096 19071
23527A9071m8130l1585M3048P6206l9462j4942k5324m450N3676j9768l9067k2067
$$ 19071 -29059 -60644 -17596 58610 19148 4206 -21118 -25568 28108 8340 -30727 -52794
23515e2794n6441k8737K5368Q555K6577q752K3177J6946L2505p652K37k0449J6860
$$ -52794 -109235 -137972 -112604 -104049 -77472 -86224 -63047 -46101 -13596 -21248 -21011 -41460 -24600
23502b4600K6641L0231n0063j6042N1930N2641j3093m8166l9901J5707N834K9905
$$ -24600 2041 32272 -17791 -33833 18097 70738 57645 9479 -30422 -14715 -8881 21024
23490B1024K6274m1114k5632l0695N4772J0021M2874J9785M1004n4789o3729m6325
$$ 21024 47298 6184 -19448 -50143 4629 14650 57524 77309 118313 63524 -205 -46530
23478d6530p891O7965M523k8620R298o498J6225P3631K4138p6432j09394l6645
$$ -46530 -54421 13544 18067 -10553 -1255 -7753 8472 82103 106241 29809 -79585 -116230
23466a16230M162J2401K2088p900o980O5403N8181K5017l1794j8442j2306p8337
$$ -116230 -112068 -99667 -77579 -85479 -92459 -27056 31125 56142 24348 5906 -6400 -84737
23454h4737L1670L8436k4691J7043O3977l9366q711l8362K5477k4741O298R780
$$ -84737 -53067 -14631 -39322 -22279 41698 2332 -6379 -44741 -19264 -44005 -37707 -27927
23442b7927J4319M7059L8759m9484J2673K5321l4232q091l6436L6945O5001p553
$$ -27927 -13608 33451 72210 22726 35399 60720 26488 18397 -18039 18906 83907 76354
23430G6354R164j07339o6605M7832J7516k2921l8562j6789M6267N120l0788r376
$$ 76354 85518 -21821 -88426 -40594 -23078 -45999 -84561 -101350 -55083 -49963 -80751 -90127
23418i0127J3439o674L7408Q1838P95r617k4576p361m8359N5937l1981J4418k6093
$$ -90127 -76688 -83362 -45954 35884 36679 27062 2486 -4875 -53234 2703 -29278 -14860 -40953
23405d0953J3451P8706K1847l4881J8101k9719L9423L8822l9153l207j9642m333
$$ -40953 -27502 51204 73051 38170 56271 26552 65975 104797 65644 62437 42795 38462
23393C8462j1036m4468J9532O701p1831n4242N5407Q6931R517j2823j8960m9754
$$ 38462 27426 -17042 2490 9191 -62640 -116882 -61475 25456 34973 22150 3190 -46564
23381d6564j608N5689M8186o409n3727q4461j7490M1937K7061K9558N1647k9258
$$ -46564 -48172 7517 55703 49294 -4433 -88894 -106384 -64447 -37386 -7828 43819 14561
23369A4561J2610j3560n6419K227K5500o210l0665j0352k6242l0386k0926O663
$$ 14561 27171 13611 -42808 -40581 -15081 -21291 -51956 -62308 -88550 -118936 -139862 -133199
23357a33199J3230L1524M4872L5599l5625k9127k7692j5150M5336M3254m3907
$$ -133199 -119969 -88445 -43573 -7974 -43599 -72726 -100418 -115568 -70232 -26978 -70885
23346g0885L39J2821j1566n1266J08982P8934n1326q9789k4323L0692m361J1810
$$ -70885 -70546 -57725 -69291 -120557 -11575 67359 16033 -73756 -98079 -67387 -71748 -59938
23334e9938M9167q373k1207j4073p3486K2702N8551K5070k1127l985j8604J8825
$$ -59938 -10771 -19144 -40351 -54424 -127910 -105208 -46657 -21587 -42714 -46699 -65303 -46478
23322d6478O4418k7657k843j7530j8070K0672j6700q600k6702m0037P6598O3177
$$ -46478 17940 -9717 -12560 -30090 -48160 -27488 -44188 -52788 -79490 -119527 -42929 20248
23310B0248K2029r3040O1277o709J1824l8094L751J1908P441K1938j8750J0102
$$ 20248 42277 -50763 10514 3805 15629 -22465 -18714 -6806 635 22573 3823 13925
23298A3925R026k8137K8249J76l066O1739l8857j6506J8511k3545J6531n996L2661
$$ 13925 22951 -5186 23063 23239 20173 81912 43055 26549 45060 21515 38046 32050 64711
23285F4711J2120M4937k1729l6358o6010J9987L7305o906k1694m1071j6393l0821
$$ 64711 76831 121768 100039 63681 -2329 17658 54963 48057 26363 -14708 -31101 -61922
23273f1922P353M0610k5317m0467o9212K962Q8738Q8775L2020L4247L9477j0147
$$ -61922 -54569 -13959 -39276 -79743 -148955 -145993 -57255 31520 63540 97787 137264 127117
23261A27117n9695k1246L6492q316K0224l1667J6481j4259L5244n9259p0168M6754
$$ 127117 67422 46176 82668 74352 94576 62909 79390 65131 100375 41116 -29052 17702
23249A7702n043K8744l1544j6170P0389k176J1709q3425o2688J6783J8769M2964
$$ 17702 12659 41403 9859 -6311 64078 61902 73611 -9814 -72502 -55719 -36950 6014
23237F014K0450M8253J219m7992o2692j1501K063P1359M5481j1889k5058K0070
$$ 6014 26464 74717 75936 27944 -34748 -46249 -44186 27173 72654 60765 35707 55777
23225E5777J8176k0767l8643k8885l5705L162r041J9875q983L3012k5984K4671
$$ 55777 73953 53186 14543 -14342 -50047 -46885 -55926 -36051 -45034 -12022 -38006 -13335
23213a3335j3151K5776O0104l4412K1584K9737K9341n1507n7421M611K6781k2818
$$ -13335 -26486 -710 59394 24982 46566 76303 105644 54137 -3284 1327 28108 5290
23201E290m0592l7232o16K2771J7279P20K5347k5025K9416L2158o850L2829n6190
$$ 5290 -35302 -72534 -73150 -50379 -33100 -32380 -7033 -32058 -2642 29516 22666 55495 -695
23188f95k5949N0516l2912k7521N1392p243o5699M6648R3074K5160j11752n6485
$$ -695 -26644 23872 -9040 -36561 14831 7588 -58111 -11463 81611 106771 -4981 -61466
23176f1466L123N7949P0244k53K215K0805L1635n466r0777l9690o951K3496J7535
$$ -61466 -58343 -394 69850 69597 71812 92617 124252 118786 28009 -11681 -18632 4864 22399
23163B2399k4M854j5553O442n4324M3779J9865j12192k0953L0593N6228L0069
$$ 22399 22375 27229 11676 18118 -36206 7573 27438 -84754 -105707 -75114 -18886 11183
23151A1183l2182L7211R3555M6614m5057o9699n4812m131M2800N0998m1349o4415
$$ 11183 -20999 16212 109767 156381 111324 41625 -13187 -17318 25482 76480 35131 -29284
23139b9284k3549m3801Q359J1329l004Q875M8588P170K4448p111L4271k313k6737
$$ -29284 -52833 -96634 -88275 -76946 -79950 -71075 -22487 -15317 9131 2020 36291 33978 7241
23126G241J5853L093n582m8906l5038J9723M7826k9972n0585R588N8032L840l8740
$$ 7241 23094 26187 20605 -28301 -63339 -43616 4210 -25762 -76347 -66759 -8727 -4887 -43627
23113d3627k7396M1357K0037k806j3336j245k4079O287N6795j6113k6675k9378
$$ -43627 -71023 -29666 -9629 -12435 -25771 -27016 -51095 -44808 11987 -4126 -30801 -60179
23101f0179O7039O9153K9674n4309n977m0256K556M1902M8869n1389r896L4524
$$ -60179 6860 76013 105687 51378 45401 5145 7701 49603 98472 47083 37187 71711
23089G1711n581K1138m8049Q24J7388K0296m1325j3794m375J7915J0259k2932
$$ 71711 66130 87268 39219 40043 57431 77727 36402 22608 18233 36148 46407 23475
23077B3475L2022L7940j2559n5299m7269n1444n2796J5863R5385L0146j0001L0017
$$ 23475 55497 93437 80878 25579 -21690 -73134 -125930 -110067 -14682 15464 5463 35480
23065C5480J7272q90k0853K0756J4783J793K977n7526j1316J1871N9321j1918
$$ 35480 52752 51862 31009 51765 66548 68341 71318 13792 2476 14347 73668 61750
23053F1750m2708k5926M8665N1292k2706j985p6578n4740k1711r205N189P1496
$$ 61750 19042 -6884 41781 93073 70367 68382 -8196 -62936 -84647 -93852 -88663 -17167
23041a7167O0736N2250l4940L3465r915l5977o941j562J6991K6309n1143j1494
$$ -17167 43569 95819 60879 94344 84429 48452 41511 39949 56940 83249 32106 20612
23029B0612m308r523L313K2920j8084j2473j9170J1445K5527p548n2728m5217
$$ 20612 16304 6781 10094 33014 14930 2457 -16713 -5268 20259 12711 -40017 -85234
23017h5234K086r533K2854K3245L9143K3970M5132n9898m5137p421K7688q517
$$ -85234 -83148 -92681 -69827 -46582 -7439 16531 61663 1765 -43372 -50793 -23105 -31622
23005c1622m5664N5605Q2808K1247j0349l7115K3987J9027l7959M4295N0248k3330
$$ -31622 -77286 -21681 61127 82374 72025 34910 58897 77924 39965 84260 134508 111178
22993A11178k5675n3935m6780j2538k6633J7939K2390L9565P9011K8584q0111
$$ 111178 85503 31568 -15212 -27750 -54383 -36444 -14054 25511 104522 133106 52995
22982E2995q757L6905o9327l0731Q295K7136J9106J4929J2111m6901o473J5868
$$ 52995 44238 81143 11816 -18915 -10620 16516 35622 50551 62662 15761 9288 25156
22970B5156m2340O213P684L176J6702j0196n3362j780j531j4299K9729J13307
$$ 25156 -17184 -10971 -3287 -111 16591 6395 -46967 -48747 -50278 -64577 -34848 78459
22958G8459q835l5434l3909p021k8570k4166k8003M6357K7510O436j08J3184L0237
$$ 78459 69624 34190 281 -6740 -35310 -59476 -87479 -41122 -13612 -7176 -7284 5900 36137
22945C6137n3897k0946j2534N1751O2284k0655j4743J4644o4855l6993L1568l0529
$$ 36137 -17760 -38706 -51240 511 62795 42140 27397 42041 -22814 -59807 -28239 -58768
22933e8768o826K0391K7395M9387l3792m9329N8248R0896m1814m2811l6290m5812
$$ -58768 -65594 -45203 -17808 31579 -2213 -51542 6706 97602 55788 12977 -23313 -69125
22921f9125L9305O5073P81k4594L1173m4420P086p780J0817N626o337n0397m5602
$$ -69125 -29820 35253 36034 11440 42613 -1807 5279 -2501 8316 13942 7605 -42792 -88394
22908h8394J8073K8429N1652M0608j7928o2127o2139R162M4242O471N4628r739
$$ -88394 -70321 -41892 9760 50368 32440 -29687 -91826 -82664 -38422 -31951 22677 12938
22896A2938l1824J0390k0815k1060M9887j4909L636l689J4788N259q208R868L3200
$$ 12938 -18886 -8496 -29311 -50371 -484 -15393 -11757 -15446 -658 4601 -3607 6261 39461
22883C9461K2831n1389j8260j6796M3364K0611M4867O2054l020o6310n0121L8298
$$ 39461 62292 10903 -7357 -24153 19211 39822 84689 146743 143723 77413 27292 65590
22871F5590J2436p8554o0938p4693K2700L3902J3218N2126J6462j7829K5433k2354
$$ 65590 78026 -528 -61466 -136159 -113459 -79557 -66339 -14213 2249 -15580 9853 -12501
22859a2501J4335J9765n0671j9426O7593P2648L2132n7505k5478Q289m9965o4990
$$ -12501 1834 21599 -29072 -48498 19095 91743 123875 66370 40892 49181 -784 -65774
22847f5774l054M0261O1519K3146o6181o9364J3092J2709M0981L2876J5110o6780
$$ -65774 -68828 -28567 32952 56098 -10083 -79447 -66355 -53646 -12665 20211 35321 -31459
22835c1459Q222L2572K8681J3213K6091L6755q746j8972j120J3338q1511j00669
$$ -31459 -23237 9335 38016 51229 77320 114075 105329 86357 85237 98575 17064 -83605
22823h3605K133J01563L6930K6455L5709o8542k3857L794L7871P3101Q511l5121
$$ -83605 -81472 20091 57021 83476 119185 50643 26786 30580 68451 141552 150063 114942
22811A14942j6123n8390o9738j2326l1840K3874m1498M3901r674k7791j83K1105
$$ 114942 98819 40429 -29309 -41635 -73475 -49601 -91099 -47198 -56872 -84663 -84846 -63741
22799f3741L6732K526n596k0224N7506p0033q443r069p256M1173N9455j4185J1771
$$ -63741 -27009 -24483 -30079 -50303 7203 -62830 -71273 -80342 -87598 -46425 13030 -1155 10616
22786A0616K9626J6128N8668K586J0166l8798q9566o1652j7004M9799N5106k4194
$$ 10616 40242 56370 115038 117624 127790 88992 -574 -62226 -79230 -29431 25675 1481
22774A481j6932P4420p0604m1671M9829M8910k8579m6403Q3253j9114l538r0k7268
$$ 1481 -15451 58969 -11635 -53306 -3477 45433 16854 -29549 53704 34590 31052 30962 3694
22761C694l182j5156n2936n7163Q452J2430N5594m8507m6214N0294K2557m2036
$$ 3694 512 -14644 -67580 -124743 -116291 -103861 -48267 -96774 -142988 -92694 -70137 -112173
22749a12173m1539N0543Q0055L44o0987K5844N22n7096K2906O5542L3402N7865
$$ -112173 -153712 -103169 -23114 -22770 -83757 -57913 -57391 -114487 -91581 -26039 7363 65228
22737F5228L7133l3569n7352m9189K516Q0494Q510J0680o6468m1110J54p5777
$$ 65228 102361 68792 11440 -37749 -35233 45261 53771 64451 -2017 -43127 -42973 -118750
22725a18750m544M2296R522K9602J6710K2093O4165k4562k0333L6148j7419n6587
$$ -118750 -123294 -80998 -71476 -41874 -25164 -3071 61094 36532 16199 52347 34928 -21659
22713b1659K5709K0734j5492l919l0110K0118J2168M6977k5485n2470m1336M2157
$$ -21659 4050 24784 9292 5373 -24737 -4619 7549 54526 29041 -23429 -64765 -22608
22701b2608N8369q977O999L2100k7517J1141k8460l4010M3516K8004k1259o869
$$ -22608 35761 26784 33783 65883 38366 49507 21047 -12963 30553 58557 37298 30429
22689C0429k7915k1419R316K6572k3060n0032k7933N4497L5724M9935l987L6205
$$ 30429 2514 -18905 -9589 16983 -6077 -56109 -84042 -29545 6179 56114 52127 88332
22677H8332j4519k2213l0670m8221n368M3654K9969l5744k0494L5007K6872j3311
$$ 88332 73813 51600 20930 -27291 -32659 10995 40964 5220 -15274 19733 46605 33294
22665C3294m138K6216p871J040n3220K516J1430P596O6131N595n0366j7901k3859
$$ 33294 29156 55372 47501 48541 -4679 -2163 9267 16863 82994 88589 38223 20322 -3537
22652c537o184R7466r864J2078J3084j2417o3350k3302O4223K6924O373j6656
$$ -3537 -9721 87745 77881 89959 103043 90626 27276 3974 68197 95121 101494 84838
22640H4838l9858O752k3220m7406n2384K7852K1975J536n2674l9187L4878j3330
$$ 84838 44980 51732 28512 -18894 -71278 -43426 -21451 -19915 -72589 -111776 -76898 -90228
22628i0228l260M0000J1774L1995M6358J014R397k8919m1529O998L6885m3208
$$ -90228 -93488 -53488 -41714 -9719 36639 37653 47050 18131 -23398 -16400 20485 -22723
22616b2723J1690j2850l5644J9556p6377j8632O4043P476l1336N6520M8569j3480
$$ -22723 -11033 -23883 -59527 -39971 -116348 -134980 -70937 -63461 -94797 -38277 10292 -3188
22604c188Q21O700M4672m2101n2816o1692k7535O5358N3808K4063j0041j3975
$$ -3188 -2367 4333 49005 6904 -45912 -107604 -135139 -69781 -15973 8090 -1951 -15926
22592a5926j2028L0871K9628M637r6172r777j3945J1649M0684K8864o346L0143
$$ -15926 -27954 2917 32545 37182 -58990 -68767 -82712 -71063 -30379 -1515 -7861 22282
22580B2282m6678j01195r421J30130N2659k2402n5117k3089k0594L0012Q59n3794
$$ 22282 -24396 -125591 -135012 -4882 47777 25375 -29742 -52831 -73425 -43413 -42554 -96348
22568i6348j0047N4548r890K4255J29j4479J7880J7421l918n3677k59P9440J4996
$$ -96348 -106395 -51847 -61737 -37482 -37353 -51832 -33952 -16531 -20449 -74126 -74385 5055 20051
22555B0051m5350k5904k7930k9466k5128J7735L4968P7266O9698l1402m4813n3542
$$ 20051 -25299 -51203 -79133 -108599 -133727 -115992 -81024 -3758 65940 34538 -10275 -63817
22543f3817j1080J5067k6139J708n3576J3078N8699p8k041J1362J3012K319l4897
$$ -63817 -74897 -59830 -85969 -84261 -137837 -124759 -66060 -66138 -68179 -56817 -43805 -41486 -76383
22530g6383l2709J5738L470K8896N6147Q59K1306L1897N792k1391m1378n3688
$$ -76383 -109092 -93354 -89884 -60988 -4841 -3982 17324 49221 55013 33622 -7756 -61444
22518f1444j366M7794J2632K8587j8298k5351m6668j4168L3867O2216q588J1099
$$ -61444 -62810 -15016 -2384 26203 7905 -17446 -64114 -78282 -44415 17801 9213 20312
22506B0312K0611l4980j2706J8331N8626m8240p0157l3273l4638M9459R4337M1827
$$ 20312 40923 5943 -6763 11568 70194 21954 -48203 -81476 -116114 -66655 27682 69509
22494F9509k0934m2896n6238r7274m885N0643P7662L2435k8778N9112J6518l2726
$$ 69509 48575 5679 -50559 -147833 -152718 -102075 -24413 8022 -20756 38356 54874 22148
22482B2148N598J5419L2605o3691q397K4702K5791m4490l4896J086l3367J5855
$$ 22148 27746 43165 75770 12079 3682 28384 54175 9685 -25211 -24125 -57492 -41637
22470d1637K4122j0164J293J2907J867K3979M2831o0050r0705l4589J6966L1526
$$ -41637 -17515 -27679 -26386 -13479 -11612 12367 55198 -4852 -95557 -130146 -113180 -81654
22458h1654M0412P3591K8777J988n0229o1015l6818o578Q567Q712M2237M7735
$$ -81654 -41242 32349 61126 63114 12885 -48130 -84948 -91526 -82959 -74247 -32010 15725
22446A5725L356K53k8838n990Q2533k3254n9135Q942k6470k8898J0417L2903m1828
$$ 15725 19081 19334 -9504 -15494 67039 43785 -15350 -6408 -32878 -61776 -51359 -18456 -60284
22433f0284o2201L3032L0178L9997m1766l2027R4174J9231K1583L9114q0085J386
$$ -60284 -122485 -89453 -59275 -19278 -61044 -93071 1103 20334 41917 81031 946 2332
22421B332N1932L5033m1006m0631m3655j2477K7809m1017o554K0486J8302K7951
$$ 2332 54264 89297 48291 7660 -35995 -48472 -20663 -61680 -68234 -47748 -29446 -1495
22409a495q00o7n7229J4563J9900L3155K2605m224J4127k9944o1652j9423L264
$$ -1495 -2295 -2362 -59591 -45028 -25128 8027 30632 26408 40535 10591 -51061 -70484 -67220
22396f7220J5007j3503R092L786P3349M8864o3390l2022o833P387K1382P029l4536
$$ -67220 -52213 -65716 -56624 -52838 20511 69375 5985 -26037 -32870 -25483 -4101 2928 -31608
22383c1608m0489k04M7713K3737k8719n245M5211J2712r186l9382n7701P0795
$$ -31608 -72097 -72301 -24588 -851 -29570 -34815 10396 23108 13922 -25460 -83161 -12366
22371a2366M3719P993j8321K187K7104K997m8511o7954M8605K7916r578p952M478
$$ -12366 31353 39346 21025 23212 50316 53313 4802 -63152 -14547 13369 3791 -4161 317
22358C17k6298o494L732N0410O6650j0755n073j1147j5909l4716o2193L919l1376
$$ 317 -25981 -32475 -28743 21667 88317 77562 72489 61342 45433 10717 -51476 -47557 -78933
22345g8933q73J12093J4445J7278k4699k2401N299m1233o7865O276L1029J6882
$$ -78933 -79806 32287 46732 64010 39311 16910 22209 -19024 -86889 -80613 -49584 -32702
22333c2702j3218n704j6529k6395m1910j0250N3426J5222L882O165K0761P3410
$$ -32702 -45920 -51624 -68153 -94548 -136458 -146708 -93282 -78060 -74178 -68013 -47252 26158
22321B6158O97k177k4250n2100N3254N3558j9471J2268n1324N8529M9966j0745
$$ 26158 26855 24678 428 -51672 1582 55140 35669 47937 -3387 55142 105108 94363
22309I4363k9456p4252k8931l0396L0302J8761m4433k6706K9110J5649k9192K4114
$$ 94363 64907 -9345 -38276 -68672 -38370 -19609 -64042 -90748 -61638 -45989 -75181 -51067
22297e1067N6030L0845K809n1393J196J7288k3660j6309N052J7998Q0347K3890
$$ -51067 4963 35808 38617 -12776 -11580 5708 -17952 -34261 -29209 -11211 69136 93026
22285I3026o5702n957l7877k4125k4672o8559N6441Q4954J8584l8472k3381n7211
$$ 93026 27324 21367 -16510 -40635 -65307 -133866 -77425 7529 26113 -12359 -35740 -92951
22273i2951N2167K3230j6457q526j9969K3211j7038K443O1606K5494P176k4728
$$ -92951 -40784 -17554 -34011 -42537 -62506 -39295 -56333 -53890 7716 33210 40386 15658
22261A5658j3269m6670m5258j0483M2971M8494P304OP210m1913j460Q0953n4643
$$ 15658 2389 -44281 -89539 -100022 -57051 -8557 -1253 -1247 5963 -35950 -37410 43543 -11100
22248a1100J6112l0230p0315J025J099o9533K8747Q8692O7917J4019j1385n0362
$$ -11100 5012 -25218 -95533 -94508 -93409 -162942 -134195 -45503 22414 36433 25048 -25314
22236b5314m689l616o9069j4467O5955j1954O531R1337o307l9902N07l3397o844
$$ -25314 -30003 -33619 -102688 -117155 -51200 -63154 -56623 34714 28407 -11495 -10988 -44385 -51229
22223e1229m537J5154J1472L2783J4500p5989q004L1295j9830l1433j4886k2621
$$ -51229 -55766 -40612 -29140 3643 18143 -57846 -65850 -34555 -54385 -85818 -100704 -123325
22211a23325P989J9680L3048P6547O0527o3900k3492m9811K0J3146R596J9268
$$ -123325 -115336 -95656 -62608 13939 74466 10566 -12926 -62737 -62717 -49571 -39975 -20707
22199b0707K4167R509j6078k7144j077m0501j3829J5739N031j8351P724J2065
$$ -20707 3460 12969 -3109 -30253 -31330 -71831 -85660 -69921 -64890 -83241 -75517 -63452
22187f3452K4305M686m359K1458J1514K986M0481k7714m0537l410o653K4490L8790
$$ -63452 -39147 -34461 -38820 -17362 -5848 -2862 37619 9905 -30632 -34042 -40695 -16205 22585
22174B2585l2843m2891L5681J2847k4353l7841L3228p158r913Q384o428J8782
$$ 22585 -10258 -53149 -17468 -4621 -28974 -66815 -33587 -40745 -50658 -42274 -48702 -29920
22162b9920N3384K08k4177K87O795L4477k1868m5683k7238J9218l7408l654K2460
$$ -29920 23464 23672 -505 -218 6577 41054 19186 -26497 -53735 -34517 -71925 -75579 -53119
22149e3119j3667L232J2163J8891K2294K2520J0077L3515J4166n8860p5755r661
$$ -53119 -66786 -63554 -51391 -32500 -10206 12314 22391 55906 70072 11212 -64543 -74204
22137g4204N161J9185L4477L3201k1242j4400J1218j7733J3029N3892l9550k994
$$ -74204 -69043 -49858 -15381 17820 -3422 -17822 -6604 -24337 -11308 42584 3034 40
22125D0M4837o8205m0105L9597P9773K0044k4469j0023q499q032N253j7583J7584
$$ 40 44877 -23328 -63433 -23836 55937 75981 51512 41489 32990 24958 30211 12628 30212
22112C0212K4867j1119k4805K1538m8730q759j2399N652K9566J5258O6192M0870
$$ 30212 55079 43960 19155 40693 -8037 -16796 -29195 -23543 6023 21281 87473 128343
22100A28343n2563n5194l8252r3652l557q409M4658M3072j3506k8313N275N3684
$$ 128343 75780 20586 -17666 -111318 -114875 -123284 -78626 -35554 -49060 -77373 -72098 -18414
22088a8414P9047J4140o0870m6244n3562M3457k3292L9392J7400k626j5451L6117
$$ -18414 60633 74773 13903 -32341 -85903 -42446 -65738 -26346 -8946 -11572 -27023 9094
22076I094M6921k1335p0356n7166j7068J0084L7281N2804j817k5006n564j8178
$$ 9094 56015 34680 -35676 -92842 -109910 -99826 -62545 -9741 -11558 -36564 -42128 -60306
22064f0306q136L5716Q733J3748M5100j4213j3131N1049k076j9776J0883m5714
$$ -60306 -68442 -32726 -23993 -10245 34855 20642 7511 58560 56484 36708 47591 1877
22052A877l8388J448J0933J067J604K86J8254n241J8310M7172j2341Q843m917
$$ 1877 -36511 -35063 -24130 -23063 -21459 -21173 -2919 -8160 10150 57322 44981 53824 48907
22039D8907m7267L231K3468m6570n871N6011M3665J5704l077j5037r2174j7978
$$ 48907 1640 4871 28339 -18231 -24102 31909 75574 91278 88201 73164 -19010 -36988
22027c6988M5755r158J9701o218k5342k0783K9800Q0589K9270j5751k3786n9143
$$ -36988 8767 -391 19310 13092 -12250 -33033 -3233 77356 106626 90875 67089 7946
22015G946J2513M2005J879K3329l6924l2770o501o4053P021j8790N5006p258l1791
$$ 7946 20459 62464 64343 87672 50748 17978 11477 -52576 -45555 -64345 -9339 -16597 -48388
22002d8388l342m7081l917N6497m92L0777m913n170k267p673O452J0178l6065
$$ -48388 -51730 -98811 -102728 -46231 -46723 -15946 -20859 -26029 -28296 -35969 -29517 -19339 -55404
21989e5404N661J5458m1793M8307Q9636L9408n8798l1405n8909M840J705N265
$$ -55404 -49743 -34285 -76078 -27771 61865 101273 42475 11070 -47839 -42999 -41294 -36029
21977c6029J704l7730o548j1358J0091N9446L8551o658q7879l0433O8690K2447
$$ -36029 -34325 -72055 -78603 -89961 -79870 -20424 18127 11469 -76410 -106843 -38153 -15706
21965a5706K5856K6328K2804O99P099l6695j0749j2875L186J518j039k6989P114
$$ -15706 10150 36478 59282 59981 67080 30385 19636 6761 9947 11465 10426 -16563 -9449
21952i449M999J0251L3037m7800L0255l2487j135K1668n256l4458k0041k8730
$$ -9449 -4450 5801 38838 -8962 21293 -11194 -12329 9339 4083 -30375 -50416 -79146
21940g9146l9192O4394M164R122L8432N12K5855O9072K8576n6086n1542k1969
$$ -79146 -118338 -53944 -49780 -40658 -2226 -1714 24141 93213 121789 65703 14161 -7808
21928g808m1238l0495O934l557N2744J139L7557K8123n2898l9758m7092l0248
$$ -7808 -49046 -79541 -72607 -76164 -23420 -22281 15276 43399 -9499 -49257 -96349 -126597
21916a26597r468L2035L5619P607M8314K9987k2628j093k822N7122M8907j1770
$$ -126597 -136065 -104030 -68411 -60804 -12490 17497 -5131 -6224 -9046 48076 96983 85213
21904H5213o6292m3736L4362O573n0875k717m081O9896j0005k3358M8016l6342
$$ 85213 18921 -24815 9547 16120 -34755 -37472 -41553 28343 18338 -5020 42996 6654
21892F654j3317l323o327L290k5090j1697K4165j6233l2939j9365J5456K6489
$$ 6654 -6663 -9986 -16313 -13023 -38113 -49810 -25645 -41878 -74817 -94182 -78726 -52237
21880e2237J2628M4071O4853j173n1923j2282k6585m8341J8443M2488j6865l2544
$$ -52237 -39609 4462 69315 68142 16219 3937 -22648 -70989 -52546 -10058 -26923 -59467
21868e9467Q393L1323k6440j5286j193M6626O4280l539l8266k296L5030R20l0452
$$ -59467 -51074 -19751 -46191 -61477 -62670 -16044 48236 44697 6431 4135 39165 40085 9633
21855I633k6353n2581Q8435N8513K921j3061K4085k3030o9000K7339l4850L3429
$$ 9633 -16720 -69301 19134 77647 80568 67507 91592 68562 -438 26901 -7949 25480
21843B5480K7248R072k5955m7171q699k515J3157Q151K6626o4650J8629J2836
$$ 25480 52728 61800 35845 -11326 -20025 -22540 -9383 -1232 25394 -39256 -20627 -7791
21831g791o505o8313j7008q92R141O4499R380l1986k9551k2954J3041O6889m293
$$ -7791 -14296 -82609 -99617 -100509 -91368 -26869 -17489 -49475 -79026 -101980 -88939 -22050 -26343
21818b6343L643K0543K0457O291l9939l2696k5032r481j5914L4500K0977L7959
$$ -26343 -22700 -2157 18300 24591 -15348 -48044 -73076 -82557 -98471 -63971 -42994 -5035
21806e035k3784j3542N324J7922j1411K637J9269l2600N680Q1408J2337o8404
$$ -5035 -28819 -42361 -37037 -19115 -30526 -27889 -8620 -41220 -35540 45868 58205 -10199
21794a0199k4884m7669K4334K6959J3858K2473j7382O101N3862L0996j5568k8440
$$ -10199 -35083 -82752 -58418 -31459 -17601 4872 -12510 -6409 47453 78449 62881 34441
21782C4441J4622J425n3759n6551o4260P715j6068K3202O2875J4149k8184Q950
$$ 34441 49063 50488 -3271 -59822 -124082 -116367 -132435 -109233 -46358 -32209 -60393 -51443
21770e1443k826J3266n5107j4574K7603L2475L9958n478j7396M1206M9522o7239
$$ -51443 -54269 -41003 -96110 -110684 -83081 -50606 -10648 -16126 -33522 7684 57206 -10033
21758a0033K5569Q8338J7504k5303m2222j4652J7551j2048J232p664n0696r1645
$$ -10033 15536 103874 121378 96075 53853 39201 56752 44704 45936 38272 -12424 -104069
21746a04069N7870L3755O324j2k006O639L9795O246l1540p5770J3923P1373P8917
$$ -104069 -46199 -12444 -6120 -6132 -8138 -1499 38296 44542 13002 -62768 -48845 22528 101445
21733A01445k0248l5085j837l570j2565p3531k3948L9145L8661k9152m971k3086
$$ 101445 81197 46112 44275 40705 28140 -45391 -69339 -30194 8467 -20685 -25656 -48742
21721d8742l9184j0663K0386J0693j0273K8515M6412L9195j0362m197J4248P901
$$ -48742 -87926 -98589 -78203 -67510 -77783 -49268 -2856 36339 25977 21780 36028 43929
21709D3929j9446j1367n6542K1480j2442j2065K261j3916K0429P6882k1603k2625
$$ 43929 24483 13116 -43426 -21946 -34388 -46453 -44192 -58108 -37679 39203 17600 -5025
21697e025j9524r111N791m3276L0613K1395M9713j07L1044n716j6131N2411L5903
$$ -5025 -24549 -33660 -27869 -71145 -40532 -19137 30576 30469 61513 55797 39666 92077 127980
21684A27980m3264r0379k5985M0189k6249k7576O5379J5895p670J8285K1337n5508
$$ 127980 84716 -5663 -31648 8541 -17708 -45284 20095 35990 28320 46605 67942 12434
21672A2434o9223J2734l198L66K6750j6985L2937m7276j8901L6113L2440q276
$$ 12434 -56789 -44055 -47253 -46887 -20137 -37122 -4185 -51461 -70362 -34249 -1809 -10085
21660a0085J8634K0935J6937M206J5734p6985p0513j8991J7695M0655l8638k3913
$$ -10085 8549 29484 46421 50627 66361 -10624 -81137 -100128 -82433 -41778 -80416 -104329
21648a04329J6427L1448j8968N2467Q6597L1171l4273K1870J9536n112L9005o0176
$$ -104329 -87902 -56454 -75422 -22955 63642 94813 60540 82410 101946 96834 135839 75663
21636G5663o5150k5655J7997J1726j1124P4259j2461o1693p772M9422l2519q3848
$$ 75663 10513 -15142 2855 14581 3457 77716 65255 3562 -4210 45212 12693 -71155
21624g1155k8065O1078N2514J0281K3499m8851l51m0997j8742M0815L1802n4779
$$ -71155 -99220 -38142 14372 24653 48152 -699 -1050 -42047 -60789 -19974 11828 -42951
21612d2951K2429J1929k5769l2637L776J2983n4452o6660K2939Q5396P6778k9759
$$ -42951 -20522 -8593 -34362 -66999 -63223 -50240 -104692 -171352 -148413 -63017 13761 -15998
21600a5998P340Q7848r944p4570K5649M6179O3830r464o5934K5766K6097j6612
$$ -15998 -8658 79190 69246 -5324 20325 66504 130334 120870 54936 80702 106799 90187
21588I0187K712J8489j9277l9466o5827o1203L0709J1203J1612L209J28K468J1658
$$ 90187 92899 111388 92111 52645 -13182 -74385 -43676 -32473 -20861 -17652 -17524 -15056 -3398
21575c398N4269O224m738L5725p3111k1199L2970Q84M8740K5848n368l3111j5070
$$ -3398 50871 57095 52357 88082 14971 -6228 26742 27626 76366 102214 96846 63735 48665
21562D8665M1712m1375m7219J8396O7701K4312l3408n0460p0006L6979M6666k3285
$$ 48665 90377 49002 1783 20179 87880 112192 78784 28324 -41682 -4703 41963 18678
21550A8678L95K0433K5257o083j7196K1252p458n5422o0277n8335K7442K2282
$$ 18678 19073 39506 64763 58680 41484 62736 55278 -144 -60421 -118756 -91314 -69032
21538f9032N2143p28K0286M4503N0249o8449o8666o2324j2659M4067L9890j0282
$$ -69032 -16889 -17617 2669 47172 97421 28972 -39694 -102018 -114677 -70610 -30720 -41002
21526d1002P412j1503j2529r856P5259N927l0193l346n117j4679O602K6925J7051
$$ -41002 -33590 -45093 -57622 -67478 7781 13708 -16485 -19831 -24948 -39627 -33025 -6100 10951
21513A0951k4395q496m781k6220l3027P0417O9465k7602n0985j2263L0849J9725
$$ 10951 -13444 -21940 -26721 -52941 -85968 -15551 53914 26312 -24673 -36936 -6087 13638
21501A3638l3342J4068K0184q453j0832M0842j629k9348K0357N1794K3704p563
$$ 13638 -19704 -5636 14548 6095 -4737 36105 34476 5128 25485 77279 100983 93420
21489I3420n3798J1357L588m4464k14j6155k1198q748K4166N3909l498M618j6809
$$ 93420 39622 50979 54567 10103 9889 -6266 -27464 -36212 -12046 41863 38365 42983 26174
21476B6174m0742j8485K9571L5498k1941m2367J9187L5194m3293l206J7018K9834
$$ 26174 -14568 -33053 -3482 32016 10075 -32292 -13105 22089 -21204 -24410 -7392 22442
21464B2442K0602j199m6202l5074j4570J0626j270n9942j0095O7587O4863p817
$$ 22442 43044 41845 -4357 -39431 -54001 -43375 -44645 -104587 -114682 -47095 17768 9951
21452I951m1481K1860j0288o0210j5570Q7565L0322K6559J8853N3011j8208n9851
$$ 9951 -31530 -9670 -19958 -80168 -95738 -8173 22149 48708 67561 120572 102364 42513
21440D2513l4021l8928l074P97L1626k2767l7515L3514P162j7463O6088l7052
$$ 42513 8492 -30436 -33510 -32713 -1087 -23854 -61369 -27855 -20693 -38156 27932 -9120
21428i120k9120k4312m33K674K2006k8123j0413K214K6381J3589J3494J6226n86
$$ -9120 -38240 -62552 -62985 -60311 -38305 -66428 -76841 -74627 -48246 -34657 -21163 -4937 -5523
21415e523K0657m995j4881o9248O9770J5344k752j9721m65l3123j0813K4817O7187
$$ -5523 15134 10139 -4742 -73990 -4220 11124 8372 -11349 -11814 -44937 -55750 -30933 36254
21402C6254j9123M4846P859n4871m3589k3091K7906l2710n9139j3207P9201N3051
$$ 36254 17131 61977 69836 14965 -28624 -51715 -23809 -56519 -115658 -128865 -49664 3387
21390C387r300L7529R510m314r725m1795o6855j4031N8017P166j3524Q2191M4505
$$ 3387 -5913 31616 41126 36812 27087 -14708 -81563 -95594 -37577 -30411 -43935 38256 82761
21377H2761r9721m5851k9966L578O2549L9828p0925l0397J8319L2649J4015J1006
$$ 82761 -16960 -62811 -92777 -89199 -26650 13178 -57747 -88144 -69825 -37176 -23161 -12155
21365a2155j1983r566M0620K6103l2424m8964k0761M1407J0349n5065K7292M5236
$$ -12155 -24138 -33704 6916 33019 595 -48369 -69130 -27723 -17374 -72439 -45147 89
21353H9J4015J0675o2618J8476j3038Q0382m0036l5003q987j093j075n866J0089
$$ 89 14104 24779 -37839 -19363 -32401 47981 7945 -27058 -36045 -37138 -38213 -44079 -33990
21340c3990L4509j7729m3796L6741K5289K7404L9279m2784q1805n7386l729K5528
$$ -33990 519 -17210 -61006 -24265 1024 28428 67707 24923 -56882 -114268 -117997 -92469
21328i2469L6277P686K8238r590n0562M0685L4533O799j3705l997o491O563L0329
$$ -92469 -56192 -48506 -20268 -29858 -80420 -39735 -5202 1597 -12108 -16105 -22596 -16033 14296
21315A4296p0516J019J6913N1774R238o2052l3831k3680K5534m917j3663R810
$$ 14296 -56220 -55201 -38288 13486 22724 -39328 -73159 -96839 -71305 -76222 -89885 -80075
21303h0075J9299k4596L7039M2543j7018k2668k3574O2012j5334l4912j2918K586
$$ -80075 -60776 -85372 -48333 -5790 -22808 -45476 -69050 -7038 -22372 -57284 -70202 -67616
21291f7616L4394K084K1152j4388K9993m9803L5962J406Q876R245K3152K5959
$$ -67616 -33222 -31138 -9986 -24374 5619 -44184 -8222 -6816 2060 11305 34457 60416
21279F0416k9710l2074j8674m1212O087L596N31l457j9783O692K5228l4234J455
$$ 60416 30706 -1368 -20042 -61254 -55167 -51571 -51040 -54497 -74280 -67588 -42360 -76594 -75139
21266g5139J9985O3299K3504J8355p1667o9961N1336K4075j2370m9039L9230L6395
$$ -75139 -55154 8145 31649 50004 -21663 -91624 -40288 -16213 -28583 -77622 -38392 -1997
21254a997m3983K3552J519p896k6556O381L4009l5403j04349l7291O0696M6082
$$ -1997 -45980 -22428 -20909 -28805 -55361 -48980 -14971 -50374 -154723 -192014 -131318 -85236
21242h5236n289m1484M1354N6780l4989m8618L6981J093j2423K2414M5266k127
$$ -85236 -90525 -132009 -90655 -33875 -68864 -117482 -80501 -79408 -91831 -69417 -24151 -26278
21230b6278L4439o657K3763k7972k5064r894K0363Q3161Q008o3061j7378J9897
$$ -26278 8161 1504 25267 -2705 -27769 -37663 -17300 65861 73869 10808 -6570 13327
21218A3327K7972l9057o4162K9046J0286K6735K6578l7639N9209M7393m1241m6044
$$ 13327 41299 2242 -61920 -32874 -22588 4147 30725 -6914 52295 99688 58447 12403
21206A2403K3569J6609m5702l9530l6583j1875J6671K9492R603J4817j023L0277
$$ 12403 35972 52581 6879 -32651 -69234 -81109 -64438 -34946 -25343 -10526 -11549 18728
21194A8728k0741m0270K7294P5715k5246k659p3802j8525J2550o859J454P6474
$$ 18728 -2013 -42283 -14989 60726 35480 32821 -40981 -59506 -46956 -53815 -52361 24113
21182B4113p032m1782m7577%J4259O096M4780L3024l5507J451l2341j6066M2320
$$ 24113 17081 -24701 -72278 -72278 -58019 -51923 -7143 25881 -9626 -8175 -40516 -56582 -14262
21169a4262K7936l6054j1324k3595j0799r042J7531L5694L2592n280n4976K3842
$$ -14262 13674 -22380 -33704 -57299 -68098 -77140 -59609 -23915 8677 3397 -51579 -27737
21157b7737N5928l812n141J5672L939o8757o9457L6051N0415L8317k2226m6389
$$ -27737 28191 24379 19238 34910 38849 -29908 -99365 -63314 -12899 25418 3192 -43197
21145d3197N8110J9696m638O1693K5782P20O322p6411k5796K7246l6720j1250
$$ -43197 14913 34609 29971 91664 117446 118166 124488 48077 22281 49527 12807 1557
21133A557j1458l2863j9175J1360M5499L0126J0319o4186l1863R329K8091K0451
$$ 1557 -9901 -42764 -61939 -50579 -5080 25046 35365 -28821 -60684 -51355 -23264 -2813
21121b813J2005j5530k9123q855l3649j6948l2388L7279J19050J5624L1253j0628
$$ -2813 9192 -6338 -35461 -44316 -77965 -94913 -127301 -90022 29028 44652 75905 65277
21109F5277l2990k0029j951k9805o849K8822R436m1385k8405O2771j1784K4942
$$ 65277 32287 12258 10307 -19498 -26347 2475 11911 -29474 -57879 4892 -6892 18050
21097A8050q295m5714o344K8135Q470j5144l8833N221K5731N8349j565n5469J1213
$$ 18050 9755 -35959 -42303 -14168 -5698 -20842 -59675 -54454 -28723 29626 28061 -27408 -16195
21084a6195K3369j4335k9851J9193J8566l5425L7161O1707k3637j2796N6913j0682
$$ -16195 7174 -7161 -37012 -17819 747 -34678 2483 64190 40553 27757 84670 73988
21072G3988m1935k6434n0536N819k9475O6383R7569n9355p4654k696k248L5169
$$ 73988 32053 5619 -44917 -39098 -68573 -2190 95379 36024 -38630 -41326 -43574 -8405
21060h405j343K749K1341j1420m185k9063m7480j5610J05070O0244l3002l6917
$$ -8405 -9748 -6999 14342 2922 -1263 -30326 -77806 -93416 11654 71898 38896 1979
21048A979N6687J6630n7447m9306k2240l2375l3423L7565P6114O9838m9949p260
$$ 1979 58666 75296 17849 -31457 -53697 -86072 -119495 -81930 -5816 64022 14073 6813
21036F813Q527j3572N4072J0419l6205j9444q468M7791k006k0212l8265j2172
$$ 6813 15340 1768 55840 66259 30054 10610 2142 49933 47927 27715 -10550 -22722
21024b2722K8280q804o0863o030l489j8948K8615P5485j3445Q270O2783n2130
$$ -22722 5558 -3246 -64109 -70139 -73628 -92576 -63961 11524 -1921 6349 69132 17002
21012A7002n9058q81K0616j0212l6325n5383Q1153O8973M268p1416k9146N2567
$$ 17002 -42056 -42937 -22321 -32533 -68858 -124241 -43088 25885 30153 -41263 -70409 -17842
21000a7842J2419l2266M6278P4544P450n2426j9480k602l0847J1289J6238k7838
$$ -17842 -5423 -37689 8589 83133 90583 38157 18677 16075 -14772 -3483 12755 -15083
20988a5083L4083L3444j3238R594J2302r282l0803j0764j1160O256N681M1844
$$ -15083 19000 52444 39206 48800 61102 51820 21017 10253 -907 5349 11030 52874
20976E2874o5959l4584O9669K6128o5649J4742j2318J3971M316k5494k7392K2015
$$ 52874 -13085 -47669 22000 48128 -17521 -2779 -15097 -1126 3190 -22304 -49696 -27681
20964b7681n237L1786K508N0976M5175M177n7274Q315n6596m4699j5460L7159
$$ -27681 -32918 -1132 1376 52352 97527 101704 44430 52745 -3851 -48550 -64010 -26851
20952b6851O9490j0680m3642o901j9952J2457j9051l4813p4339L7415O0721M2088
$$ -26851 42639 31959 -11683 -18584 -38536 -26079 -45130 -79943 -154282 -116867 -56146 -14058
20940a4058K4696m9859l1036K7200K3942J4860j580q21p437k4049k1863j0491
$$ -14058 10638 -39221 -70257 -43057 -19115 -4255 -5835 -6656 -14093 -38142 -60005 -70496
20928g0496l1r7212j1154J5526P6238J3408l4113J67O0849l9554J2403K2867K029
$$ -70496 -70527 -167739 -178893 -163367 -87129 -73721 -107834 -107667 -46818 -86372 -73969 -51102 -49073
20915d9073p68l8018N6001N145k7535Q963J5768j695j6340N2807L685l5936j5365
$$ -49073 -49841 -87859 -31858 -26713 -54248 -45285 -29517 -31212 -47552 5255 8940 -26996 -42361
20902d2361m262R7212K2925J2759k4672n4366j0498k1854l1660K6900M5131j1979
$$ -42361 -46623 50589 73514 86273 61601 7235 -3263 -25117 -56777 -29877 15254 3275
20890C275K0777p603j521r632j914L1772m4497p4199j0832J443N7117Q0062M3227
$$ 3275 24052 16449 14928 5296 3382 35154 -9343 -83542 -94374 -92931 -35814 44248 87475
20877H7475j5186r1295o6853L2751K0428K6020K9464j03815J2845O8775L7875
$$ 87475 72289 -19006 -85859 -53108 -32680 -6660 22804 -81011 -68166 609 38484
20866C8484M425n958o4405M641j9467J6766P073k9656j9428Q2460L6612L8529
$$ 38484 42909 36951 -27454 -22813 -42280 -25514 -18441 -48097 -67525 14935 51547 90076
20854I0076K7767n1294J627k4333m7513o036M0742J4698j2622O1178m5880L749
$$ 90076 117843 66549 68176 43843 -3670 -9706 31036 45734 33112 94290 48410 52159
20842E2159K7650J3775l8433l962N0750J859N278o7299o8262j3428Q326l3176
$$ 52159 79809 93584 55151 51189 101939 103798 109076 41777 -26485 -39913 -31587 -64763
20830f4763m5913Q9677K0071J0388m2154l1155M5168J034n996m1101n1318o4405
$$ -64763 -110676 -20999 -928 9460 -32694 -63849 -18681 -17647 -23643 -64744 -116062 -180467
20818a80467P5167J12488K5985l2090l3042K7268N4445R629n8482m1216n2752
$$ -180467 -105300 7188 33173 1083 -31959 -4691 49754 59383 901 -40315 -93067
20807i3067N8925O7315J9783k3289J0452K6817j7564p0936q94Q0807l1489m3945
$$ -93067 -34142 33173 52956 29667 40119 66936 49372 -21564 -22458 58349 26860 -17085
20795a7085l808Q5048o081j3974l3747k738J1422k4303q808l0202j1239N6916
$$ -17085 -20893 64155 58074 44100 10353 7615 19037 -5266 -14074 -44276 -55515 1401
20783A401k7277m7977J1483N9188J1447q5989k8411L1257O8479P907J9551K180
$$ 1401 -25876 -73853 -62370 -3182 8265 -77724 -106135 -74878 -6399 1508 21059 23239
20771B3239L4488l8212o8347M8794j7156q1428l6045L1810K3426P1926L5723l1796
$$ 23239 57727 19515 -48832 -38 -17194 -98622 -134667 -102857 -79431 -7505 28218 -3578
20759c578O658L2226P2018L7612k9242n0867k7376J4289J2169k8828l0139K0822
$$ -3578 3080 35306 107324 144936 115694 64827 37451 51740 63909 35081 4942 25764
20747B5764m2344L981k2396n9299l4462J7426Q3287N5520m5583l5231Q082M5254
$$ 25764 -16580 -12599 -34995 -94294 -128756 -111330 -28043 27477 -18106 -53337 -45255 -1
20735aj0443m8603q747M6044L1307k9897K1845J14624M8717m3148l9202m8425
$$ -1 -10444 -59047 -67794 -21750 9557 -20340 1505 116129 164846 121698 82496 34071
20723C4071k3743p0203K7797j2655j3642N309L0676l3151M6395k5054j0567J7165
$$ 34071 10328 -59875 -32078 -44733 -58375 -53066 -22390 -55541 -9146 -34200 -44767 -27602
20711b7602l6497J532p94K2959o7157R69N4461K4680K0675K9669k2246K7286l770
$$ -27602 -64099 -62567 -63361 -40402 -107559 -106590 -52129 -27449 -6774 22895 649 27935 24165
20698B4165m2544J5109M8017J1440o695K0360n5291n8091O7127L0915j2236m6922
$$ 24165 -18379 -3270 44747 56187 49492 69852 14561 -43530 23597 54512 42276 -4646
20686d646l9967j2927R177l2549n3473J1554L6857L5812J8301Q8930k3201l3837
$$ -4646 -44613 -57540 -48363 -80912 -134385 -122831 -85974 -50162 -31861 57069 33868 31
20674C1K2860Q4547m5015o3484l5962K2853k9264Q33J8739o0617N4403J00888
$$ 31 22891 107438 62423 -1061 -37023 -14170 -43434 -42601 -23862 -84479 -30076 70812
20662G0812l0991n1035j9911m596K1528N4141m391n7798K2268j94J0128J0599
$$ 70812 39821 -11214 -31125 -35721 -14193 39948 35557 -22241 27 -167 9961 20560
20650B0560m1759R370j2882r2979J7305R5296O3974K4401l105l5037m951R137
$$ 20560 -21199 -11829 -24711 -117690 -100385 -5089 58885 83286 80181 45144 40193 49330
20638D9330K4343p2800j4700j8171m0337J0015L9596N7725k8037j8648J2967k104
$$ 49330 73673 873 -13827 -31998 -72335 -62320 -22724 35001 6964 -11684 1283 -821
20626h21L4686K8852q25L8m8107m48J8524q2782R459L1491o567o6277K1098N2545
$$ -821 33865 62717 61892 61930 13823 13375 31899 -50883 -41424 -9933 -16500 -82777 -61679 -9134
20612i134O0705N537n3789j2007m0292k5263j7247L1367o2j6407j310N8637M1668
$$ -9134 51571 57108 3319 -8688 -48980 -74243 -91490 -60123 -60185 -76592 -77902 -19265 22403
20599B2403l0723p5737J0971P0861k2186L464Q6050l983j4534p1933k6681M3911
$$ 22403 -8320 -84057 -73086 -2225 -24411 -20947 65103 61120 46586 -25347 -52028 -8117
20587h117J1835n7788J5855l3973m4593j8645K9806k8385Q0643J63756J7791o4824
$$ -8117 3718 -54070 -38215 -72188 -116781 -135426 -105620 -134005 -53362 110394 128185 63361
20575F3361j7964K5177o1204m7417M2516N7212k0570p8361j7787K8248N6031M0460
$$ 63361 45397 70574 9370 -38047 4469 61681 41111 -37250 -55037 -26789 29242 69702
20563F9702K3741j4323r437J2691j8981l0175l5010r082j7783m0299K4531J8779
$$ 69702 93443 79120 69683 82374 63393 33218 -1792 -10874 -28657 -68956 -44425 -25646
20551b5646O146K3223j9946L0544k8109k5610J8375M2693J6353o344l0476j7209
$$ -25646 -19500 3723 -16223 14321 -13788 -39398 -21023 21670 38023 31679 1203 -16006
20539a6006r099J5907L0265J3623L838l209L9513P249o591J6602n0841m6231j2927
$$ -16006 -25105 -9198 21067 34690 38528 35319 74832 82081 75490 92092 41251 -4980 -17907
20526a7907K5130j1851l3069n4360l1560K6704P4793K4724k4091j7123M9731K2198
$$ -17907 7223 -4628 -37697 -92057 -123617 -96913 -22120 2604 -21487 -38610 11121 33319
20514C3319J3960J0329k5831L5776N3297j2499m012l0234N944L0251l0738j616
$$ 33319 47279 57608 31777 67553 120850 108351 104339 74105 80049 110300 79562 77946
20502G7946J9186K1785j4962K1774P8963o1208l1804k501J5953N4630Q863j5364
$$ 77946 97132 118917 103955 125729 204692 143484 111680 109179 125132 179762 188625 173261
20490A73261o8614O2242N8836O115L3007k3151k146J7630l2146n6321p640l0668
$$ 173261 104647 166889 225725 231840 264847 241696 239550 257180 225034 168713 161073 130405
20478A30405K7460K0240p0438m2690O7691P038j5640l1425m1186J55k387m5407
$$ 130405 157865 178105 107667 64977 132668 139706 124066 92641 51455 51610 49223 3816
20466C816Q82k1441K9749k8400J1287L7229K339K8952J3843k2545K4467K5038
$$ 3816 4698 -16743 13006 -15394 -4107 33122 35461 64413 78256 55711 80178 105216
20454A05216m3900j1683K0163l5238k9655n621N5484J5763n9016p221L3230K1230
$$ 105216 61316 49633 69796 34558 4903 -718 54766 70529 11513 4292 37522 58752
20442E8752m299L181m1955k8822k6033M5682O820m2660j4924P8320k0663j0872
$$ 58752 54453 57634 15679 -13143 -39176 6506 13326 -29334 -44258 34062 13399 2527
20430B527k7349M9066L744l6831M1912L0686n2669o3174l3702k164J6706M8880
$$ 2527 -24822 24244 27988 -8843 33069 63755 11086 -52088 -85790 -87954 -71248 -22368
20418b2368p015K8326J6124l2545l8989J7811L4023L3624M1907n8052k3151n9191
$$ -22368 -29383 -1057 15067 -17478 -56467 -38656 -4633 28991 70898 12846 -10305 -69496
20406f9496j7988P1404L5817M6402J0520m0083j3269K4936r374n3257j0982L2081
$$ -69496 -87484 -16080 19737 66139 76659 36576 23307 48243 38869 -14388 -25370 6711
20394F711N312j8091k1840J4679J1661m7512j1233l0488K3706P4953L0018q138
$$ 6711 12023 -6068 -27908 -13229 -1568 -49080 -60313 -90801 -67095 7858 37876 29738
20382B9738L6953l1102l1885J9135N4393N8332J8136M6310p061k7353k1164M730
$$ 29738 66691 35589 3704 22839 77232 135564 153700 200010 192949 165596 144432 149162
20370A49162K504m0927l5086K4495M2483l2103j6712J7575K768k2116k7416m6580
$$ 149162 151666 110739 75653 100148 142631 110528 93816 111391 114159 92043 64627 18047
20358A8047k6334j2554J4157N9787L0398l254n5572l1865N5027J8504n7659K4156
$$ 18047 -8287 -20841 -6684 53103 83501 80247 24675 -7190 47837 66341 8682 32838
20346C2838j6361k7031n1185p4353O846K4311P73K7639N9016M4472P4854m3233
$$ 32838 16477 -10554 -61739 -136092 -129246 -104935 -104162 -76523 -17507 26965 101819 58586
20334E8586p557M4720J2221m2598m5571l9214K1772Q4197P3011k9097n638j3498
$$ 58586 51029 95749 107970 65372 19801 -19413 2359 86556 159567 130470 124832 111334
20322A11334j3563k9582J1449P9366N076k3940L2320N494n7809n5281p0559L0349
$$ 111334 97771 68189 79638 159004 164080 140140 172460 177954 120145 64864 -5695 24654
20310B4654O6692K4488n2675l7014j7335k9117Q375r025J3768K8987J25718L4262
$$ 24654 91346 115834 63159 26145 8810 -20307 -11932 -20957 -7189 21798 147516 181778
20298A81778m4118l5595k7923m0872k4131l4747M3877j8208p9897L1653M0219
$$ 181778 137660 102065 74142 33270 9139 -25608 18269 61 -79836 -48183 -7964
20287g964q569l2973j6618k95M9017q3386j0741K4781K8946j4676L28j4956J0247
$$ -7964 -16533 -49506 -66124 -66419 -17402 -100788 -111529 -86748 -57802 -72478 -72150 -87106 -76859
20274g6859L9227N3722K2943p3866l1577J6889O2976M5116n4294m2724k5603k5331
$$ -76859 -37632 16090 39033 -34833 -66410 -49521 13455 58571 4277 -38447 -64050 -89381
20262h9381K3141J2900R657p118l1386K6981M4082J7970r584J5235Q446K9691
$$ -89381 -66240 -53340 -43683 -50801 -82187 -55206 -11124 6846 -2738 12497 20943 50634
20250E0634k0888k8803l7650j6582J3366L9672O9305n0399k915N1911K8922m8051
$$ 50634 29746 943 -36707 -53289 -39923 -251 69054 18655 15740 67651 96573 48522
20238D8522m1202l5724N2936j7321r701q279L0615N311o317J1507j0221M2291
$$ 48522 7320 -28404 24532 7211 -2490 -10769 19846 25157 18840 30347 20126 62417
20226F2417q881l5032J978l80p5098l581M3960L1759k5092L734R158j9717N5488
$$ 62417 53536 18504 20482 20102 -54996 -58577 -14617 17142 -7950 -4216 4942 -14775 40713
20213D0713M8497J8851m2754j3866j6699J9693k6772p923j4904k5650L9426K2977
$$ 40713 89210 108061 65307 51441 34742 54435 27663 19740 4836 -20814 18612 41589
20201D1589J1556J2309J3884m3536l8981l3361K9543Q402K6188J2975k7220l8609
$$ 41589 53145 65454 79338 35802 -3179 -36540 -6997 1405 27593 40568 13348 -25261
20189b5261J9388l0640O2694L9144q346J0889l0483m423j1529J2896J4992M0096
$$ -25261 -5873 -36513 26181 65325 56979 67868 37385 32962 21433 34329 49321 89417
20177H9417j778n6343p1543o2430P8L4659j884M9885j0638o9544J634N9148N0322
$$ 89417 87639 31296 -40247 -102677 -102599 -67940 -69824 -19939 -30577 -100121 -98487 -39339 10983
20164A0983l6751k9844k0099n234m796O229n4910N061N9252M2740K0506O750J7730
$$ 10983 -25768 -55612 -75711 -80945 -85741 -79512 -134422 -129361 -70109 -27369 -6863 -113 17617
20151A7617J1528j6151J036m2566j1608m9170L6804J04320K3319p3701o643j1397
$$ 17617 29145 12994 14030 -28536 -40144 -89314 -52510 51810 75129 1428 -5215 -16612
20139a6612N654j7961N883J0942L9131j1554n6560l5065m1360P6529P6611j2570
$$ -16612 -10958 -28919 -23036 -12094 27037 15483 -41077 -76142 -117502 -40973 35638 23068
20127B3068j0661j78l4502k994K1856M6970L4870K9504N538j9740p4475k6724
$$ 23068 12407 12229 -22273 -25267 -3411 43559 78429 107933 113471 93731 19256 -7468
20115g468J1314K0896l5257n6216L9977M7240k4765L8686L4750j4175n3745L8393
$$ -7468 3846 24742 -10515 -66731 -26754 20486 -4279 34407 69157 54982 1237 39630
20103C9630L1527l5158l0476l377J8524j6546j3338k4256L5766M2979L4201k4221
$$ 39630 71157 35999 5523 2146 20670 4124 -9214 -33470 2296 45275 79476 55255
20091E5255L5075N13r535J5116M2683K9620m0795q1557O7086J3788L1899N6887
$$ 55255 90330 90843 81308 96424 139107 168727 127932 46375 113461 127249 159148 216035
20079B16035m098k1842q486K7945l6474l6925l7428l5306K1852L1548n1318M5246
$$ 216035 211937 190095 181609 209554 173080 136155 98727 63421 85273 116821 65503 110749
20067A10749O7547l22m9283n3541J1958m3140L5206j743P9720L4854o7597k4226
$$ 110749 178296 177974 128691 75150 87108 43968 79174 77431 157151 192005 124408 100182
20055A00182J7820K5165M6291R707k8915m8917J1383j2423k0544r885J582k8657
$$ 100182 118002 143167 189458 199165 170250 121333 132716 120293 99749 89864 91446 62789
20043F2789m7123J2515M3289M1205J16132L9259p6227o6058N331n3404O3754O5040
$$ 62789 15666 28181 71470 112675 228807 268066 191839 125781 131112 77708 141462 206502
20031B06502J2610m963J4982N5492k8588J4433n6294K416M9749M3554k9652k2428
$$ 206502 219112 214149 229131 284623 256035 270468 214174 216590 266339 309893 280241 257813
20019B57813q273n272K9143K5003p620L4726P9097R696M187J9402K1598K7842
$$ 257813 249540 244268 273411 298414 290794 325520 404617 414313 418500 437902 459500 487342
20007D87342N3351L850L4431L4645L4121Q149J70175J79725R466R007J09702P7260
$$ 487342 540693 544543 578974 613619 647740 655889 826064 1005789 1015255 1024262 1133964 1211224
19995A211224J16856J72479J63750J91229K53389K81616M03779N17948O63209
$$ 1211224 1328080 1500559 1664309 1855538 2108927 2390543 2794322 3312270 3975479
19986C975479Q25217R32528J151287J345592J507885J605155J614926J730234
$$ 3975479 4800696 5733224 6884511 8230103 9737988 11343143 12958069 14688303
19978A4688303J790837J820436J780056J698903J748781J834173J833997J917989
$$ 14688303 16479140 18299576 20079632 21778535 23527316 25361489 27195486 29113475
19970B9113475J973149J708064J673356J639726J362461Q74357M19940J05955
$$ 29113475 31086624 32794688 34468044 36107770 37470231 38344588 38764528 38870483
19962C8870483l01733o67634q39765r32807j172623j348889j260012j259573j447165
$$ 38870483 38568750 37901116 37061351 36128544 34955921 33607032 32347020 31087447 29640282
19953B9640282j601964j542694j702065k011639k098752k037684j947101j997686
$$ 29640282 28038318 26495624 24793559 22781920 20683168 18645484 16698383 14700697
19945A4700697j871302j604477j370972j225389j085655r81911p76201o59587
$$ 14700697 12829395 11224918 9853946 8628557 7542902 6560991 5784790 5125203
19937E125203n84662n40439m73372l32885k93278l14225k79670k38970j56310
$$ 5125203 4540541 4000102 3526730 3193845 2900567 2586342 2306672 2067702 1911392
19928A911392j30901j69138j51872j54930n1724j76148j19874M575n8848p9772
$$ 1911392 1780491 1611353 1459481 1304551 1252827 1076679 956805 961380 902532 822760
19918H22760l6214O1941J239p5913m9134m9138r8778o8920K0358K4708K3912P414
$$ 822760 786546 848487 849726 773813 724679 675541 576763 507843 528201 552909 576821 584235
19906E84235J677m2748k2080N5824k1305q980j3616l5789M3368J4987L8717P4543
$$ 584235 585912 543164 521084 576908 555603 546623 533007 497218 540586 555573 594290 668833
19894F68833M9726m5627m8357m993N1902P3889L8854j1588M0871N5005P8086M1851
$$ 668833 718559 672932 624575 619582 671484 745373 784227 772639 813510 868515 946601 988452
19882I88452P2070N6904J05166J16487J17589J35346J54697J59182J96073L78767
$$ 988452 1060522 1117426 1222592 1339079 1456668 1592014 1746711 1905893 2101966 2480733
19872B480733N59379N76552P10693R22245J092254J288900J403236J355505J349632
$$ 2480733 3040112 3616664 4327357 5249602 6341856 7630756 9033992 10389497 11739129
19863A1739129J386774J237780J055345J040240J169979J134005R26145Q35321
$$ 11739129 13125903 14363683 15419028 16459268 17629247 18763252 19689397 20524718
19855B0524718Q18037M20950M1617j17156m75170p88760q12309p66554q89281
$$ 20524718 21342755 21763705 21805322 21688166 21212996 20424236 19611927 18845373 17956092
19846A7956092r70539q15853q06546j008693j177487j215777j189398j246280
$$ 17956092 16985553 16169700 15363154 14354461 13176974 11961197 10771799 9525519
19838I525519j159653j029149q83231o75355n41706m13925m15061l42969k80199
$$ 9525519 8365866 7336717 6453486 5778131 5236425 4822500 4407439 4064470 3784271
19829C784271j64768j32121p6811J7808R0661K07239L31151M88928P54236Q84966
$$ 3784271 3619503 3487382 3410571 3428379 3519040 3726279 4057430 4546358 5300594 6185560
19819F185560J103330J304533J464567J408768J375286J404172J376175J111759
$$ 6185560 7288890 8593423 10057990 11466758 12842044 14246216 15622391 16734150
19811A6734150J094858J197537J196176R93487R55766R85122O05391J30228o6908
$$ 16734150 17829008 19026545 20222721 21216208 22171974 23157096 23762487 23892715 23825807
19802B3825807l87540q30359r43171q70131r72819j096669j001721r29809j182212
$$ 23825807 23438267 22607908 21664737 20794606 19821787 18725118 17723397 16793588 15611376
19793A5611376j341620j349474j370052j475350j400494j176856j000632q69873
$$ 15611376 14269756 12920282 11550230 10074880 8674386 7497530 6496898 5627025
19785E627025p05943n62083m57777m70592l91072l32153k72877k85376k47121
$$ 5627025 4921082 4358999 3901222 3430630 3039558 2707405 2434528 2149152 1902031
19776A902031j34828j24200j75806k03937q9065n3698j29777j30083j25128n0419
$$ 1902031 1767203 1643003 1467197 1263260 1174195 1120497 990720 860637 735509 685090
19766F85090l178l5808n1135n9731o4415q8229K828J2306N3966r13j0301j6783
$$ 685090 681912 646104 594969 535238 470823 382594 385422 397728 451694 450781 440480 423697
19754D23697r523J5395k1866l6552L0462K850n8601N8233L4621k5467o6195j6229
$$ 423697 414174 429569 407703 371151 401613 404463 345862 404095 438716 413249 347054 330825
19742C30825O8991L9357J4544J1170k7382r736L888M6620L8581l9475n924K6138
$$ 330825 399816 439173 453717 464887 437505 427769 431657 478277 516858 477383 471459 497597
19730D97597L241n4151j3127o6147j6530J2671L3882L9390M83m0880p9699l3109
$$ 497597 500838 446687 433560 367413 350883 363554 397436 436826 437309 396429 316730 283621
19718B83621L6456K240j1312o7145j0776k4822j3440O078q699K8706M6883m0311
$$ 283621 320077 322317 311005 243860 233084 208262 194822 200900 192201 220907 267790 227479
19706B27479j8437N31n6657n7365l2925L6323P0137K543M3315O0215J1233l6769
$$ 227479 209042 209573 152916 95551 62626 98949 169086 171629 214944 275159 286392 249623
19694B49623k0512n3949m8004J3517O8677m2296K8844L495m3587q744j8792l3397
$$ 249623 229111 175162 127158 140675 209352 167056 195900 199395 155808 147064 128272 94875
19682I4875K3580M444k4896n7418m5993M3808M8363L8056N5881J5680J4515r170
$$ 94875 118455 122899 98003 40585 -5408 38400 86763 124819 180700 196380 210895 201725
19670B01725m4166K9924R0j9892K5493M8346k8649m1513R0154k4940l5239j7224
$$ 201725 157559 187483 187573 167681 193174 241520 212871 171358 261512 236572 201333 184109
19658A84109L9830m885j9850L228J7724l2384n4152l4065j3451K4293K6999j851
$$ 184109 223939 219054 199204 202432 220156 187772 133620 99555 86104 110397 137396 135545
19646A35545Q1347M249r3423m3883N6371o2419l843N3321l9774l7758n1461L190
$$ 135545 216892 221141 127718 83835 140206 77787 73944 127265 87491 49733 -1728 1462
19634A462l0882n7199K82N4870P4143m1788L3813P2086l6740l1246M4401N2014
$$ 1462 -29420 -86619 -86337 -31467 42676 888 34701 106787 70047 38801 83202 135216
19622A35216j6660k5832k0138J0491J2115j8931n720j6814L641l4945J0829K9169
$$ 135216 118556 92724 72586 83077 95192 76261 70541 53727 57368 22423 33252 62421
19610F2421P473K3522Q483L8970m7580l3690l2609k8139L78K7365L5554n2992
$$ 62421 69894 93416 101899 140869 93289 59599 26990 -1149 -771 26594 62148 9156
19598I156k5896J8201N6647J1116n0962j0088P0428k9298m0737L1001N804j4905
$$ 9156 -16740 1461 58108 69224 18262 8174 78602 49304 8567 39568 45372 30467
19586C0467O3518Q505j3954j6903k6546j0801M2676P004J2152J3278j4727j2310
$$ 30467 93985 102490 88536 71633 45087 34286 76962 83966 96118 109396 94669 82359
19574H2359L9610o5224j4259j7609L4734j0535k854j0603K6861M4550J9766K8307
$$ 82359 121969 56745 42486 24877 59611 49076 46222 35619 62480 107030 126796 155103
19562A55103J665k1115q6852m9599J2672M9326M5919j6765p248m667k9758l4069
$$ 155103 156768 135653 48801 -798 11874 61200 107119 90354 83106 78439 48681 14612
19550A4612K3545Q4137M7747P769j3220n9049l0528M008J0639j3503K2433J8565
$$ 14612 38157 122294 170041 177810 164590 105541 75013 79021 89660 76157 98590 117155
19538A17155m6J1591k3080M2489K1632J1027J4957k2803J1537o7838p7028J3260
$$ 117155 117109 128700 105620 148109 169741 180768 195725 172922 184459 116621 39593 52853
19526E2853M6370j5141k796k1109J0554M6478N2810O4783o2501l1052j0214k4841
$$ 52853 99223 84082 81286 60177 70731 117209 170019 234802 172301 141249 131035 106194
19514A06194j9898l4208p8677R485L2411J8332N4713j7471m6617J9369j3439L5658
$$ 106194 86296 52088 -26589 -17104 15307 33639 88352 70881 24264 43633 30194 65852
19502F5852M8557J5896k3577p2393o175Q5407L4075l7297o2507m7697l5173o6742
$$ 65852 114409 130305 106728 34335 28160 113567 147642 110345 47838 141 -35032 -101774
19490a01774M9489J2968K4662K3867r00L3853k3024k1057n612M5854Q6521m1512
$$ -101774 -52285 -39317 -14655 9212 8312 42165 19141 -1916 -7528 38326 124847 83335
19478H3335l3161J4915M8878M7500m0949l825O6970K7787p956j0939l0321N5394
$$ 83335 50174 65089 113967 161467 120518 116693 183663 211450 203494 192555 162234 217628
19466B17628M0942l1562m5626K8648P114L3297m5324L808l9984j8351M0288r681
$$ 217628 258570 227008 181382 210030 217144 250441 205117 208925 168941 150590 190878 181197
19454A81197K0971L7984J7762k4556j8155j547r932m5748J9750l678N2653o435
$$ 181197 202168 240152 257914 233358 215203 213656 203724 157976 177726 174048 226701 220266
19442B20266k9941J6582P0227O0504K7786o802K0615M7480k2395R644K863k9028
$$ 220266 190325 206907 277134 337638 365424 358622 379237 426717 404322 413966 416829 387801
19430C87801j9081p3671L851M774n5535l8618j7089m26j4510J1002l1220m3292
$$ 387801 368720 295049 298900 303674 248139 209521 192432 192006 177496 188498 157278 113986
19418A13986P770l0420m7433P305k611J037K6776k9183j3528N9764K4930j1567
$$ 113986 121756 91336 43903 51208 48597 49634 76410 47227 33699 93463 118393 106826
19406A06826k9447Q475j6106N761j7203K4788K379k7281Q815L7044K039o3304
$$ 106826 77379 85854 69748 75509 58306 83094 85473 58192 67007 104051 106090 42786
19394D2786k0242l1011O1228j6369r499k9385m379N0445L1098L6737R525j6510
$$ 42786 22544 -8467 52761 36392 26893 -2492 -6871 43574 74672 111409 120934 104424
19382A04424j6553N1978k6116m3782k9106L1661L0814J5446p0408K5017K8516
$$ 104424 87871 139849 113733 69951 40845 72506 103320 118766 48358 73375 101891
19371A01891P752r437p374L3953N326q195j524m7016m3595K8751J4994N2111N164
$$ 101891 109643 100206 92832 126785 132111 123916 122392 75376 31781 60532 75526 127637 132801
19358A32801J9655n161o0166r9352j603N0683L683k3072m861M5122L8334l235
$$ 132801 152456 147295 87129 -12223 -13826 36857 40540 17468 12607 57729 96063 92828
19346I2828r077L0378J2030o9372m694M4870k667r41j409J1333L2434J6843m9810
$$ 92828 83751 114129 126159 56787 52093 96963 94296 93355 91946 103279 135713 152556 102746
19333A02746k366L7167P8801K0448L5934M4205j8244J90l9318J5773N3683o3599
$$ 102746 100380 137547 216348 236796 272730 316935 298691 298881 259563 275336 329019 265420
19321B65420m5348o4106k6782r487K132J11181N7474q737o2803n9978k7377j0620
$$ 265420 220072 155966 129184 119697 121829 233010 290484 281747 218944 158966 131589 120969
19309A20969j5256M5042P4695L9493j9537m7461m079l3616l0784k7302K1797Q1386
$$ 120969 105713 150755 225450 264943 245406 197945 193866 160250 129466 102164 123961 205347
19297B05347P6399L269n2949l0400j3231K8667r223L752l0621l1484M1378M9281
$$ 205347 281746 285015 232066 201666 188435 217102 207879 211631 181010 149526 190904 240185
19285B40185J5133J8287M9159m5227j7547M4238K9445J5653L0096p5837j3083
$$ 240185 255318 273605 322764 277537 259990 304228 333673 349326 379422 303585 290502
19274B90502K3148K3113l9672M5308K7071J8341m1420q4472K4738j4957L263J1053
$$ 290502 313650 336763 297091 342399 369470 387811 346391 261919 286657 271700 274963 286016
19262B86016j076k806l9168P772n793n7132j0224N1466R4001J1079J5961Q166
$$ 286016 284940 282134 242966 250738 244945 187813 177589 229055 323056 334135 350096 358262
19250C58262o7609j2918p703O375N0672K7534l9333q747Q0356J1469j9412K6099
$$ 358262 290653 277735 270032 276407 327079 354613 315280 306533 386889 398358 378946 405045
19238D05045j4488m223L568N4499N16L5115R5423N8995N8829N7241K718p245M6077
$$ 405045 390557 386334 389902 444401 444917 480032 575455 634450 693279 750520 753238 745993 792070
19225G92070P0293Q8001P9848R336N5088K2537P9910J20750J15150O2450J41094
$$ 792070 862363 950364 1030212 1039548 1094636 1117173 1197083 1317833 1432983 1495433 1636527
19214A636527K34739K56660K15190K45723L22706M63286N90105Q66492J175950
$$ 1636527 1871266 2127926 2343116 2588839 2911545 3374831 3964936 4831428 6007378
19205F007378J677999K232740K566766K275105J564080R91548M87432L00230R09895
$$ 6007378 7685377 9918117 12484883 14759988 16324068 17315616 17803048 18103278 19013173
19196A9013173K442593M400525O401856O742436L641470N59596j160038l931324
$$ 19013173 21455766 25856291 32258147 39000583 42642053 43201649 42041611 38110287
19188C8110287m490210k223583P31883L660535N743463M658803O14849j760118
$$ 38110287 33620077 31396494 32128377 35788912 41532375 46191178 46806027 45045909
19180D5045909m201893o870852o072690l769179j736170j14689O10677j05902
$$ 45045909 40844016 33973164 27900474 24131295 22395125 22280436 22891113 22785211
19172B2785211j275645j823493k744998l129663k534766j784253j291802j010788
$$ 22785211 21509566 19686073 16941075 13811412 11276646 9492393 8200591 7189803
19164G189803p62976o97825o45047n46538m72492n19394m44222k78205l01387
$$ 7189803 6426827 5729002 5083955 4537417 4064925 3545531 3101309 2823104 2521717
19155B521717k65361j42222j44891j43075j85197k01363j20865j07239j06613
$$ 2521717 2256356 2114134 1969243 1826168 1640971 1439608 1318743 1211504 1104891
19146A104891r5061j16630j7814K6261k3237p3942l6889p1387l9620m9534m5505
$$ 1104891 1009830 893200 875386 901647 878410 804468 767579 696192 656572 607038 561533
19135E61533o8325k502M7867M3444m5931o7522r0222q420R5316J0606q1887l54
$$ 561533 493208 490706 538573 582017 536086 468564 378342 369922 465238 475844 393957 393603
19123C93603q069n49j6061J8311p795o225j7181n6124o0853M8530L2233j7127
$$ 393603 385534 384985 368924 387235 379440 373215 356034 299910 239057 287587 319820 302693
19111C02693l3156J1688k6445M1316L848j14730l5171J2258Q362L6100L4305j8098
$$ 302693 269537 281225 254780 296096 299944 185214 150043 162301 170663 206763 241068 222970
19099B22970n302M7217j1171J1036n877j9378k9067k6727N7994L1401Q612n0221
$$ 222970 217668 264885 253714 264750 258873 239495 210428 183701 241695 273096 281708 231487
19087B31487l6849K8344P2160k0821o5517j6754K0129K0042J9020P7392L4644
$$ 231487 194638 222982 295142 274321 208804 192050 212179 232221 251241 328633 363277
19076C63277K6149q1582n7215K0372r030K0864J6270j3492m2524M8030K9470k6091
$$ 363277 389426 307844 250629 271001 261971 282835 299105 285613 243089 291119 320589 294498
19064B94498L2247L0029l4296n629r160m1585r28K31K8139J5972O6480L3650N6321
$$ 294498 326745 356774 322478 316849 307689 266104 265176 265407 293546 309518 375998 409648 465969
19051D65969J435k1616j5845q996J0617L2800J1250n523k821K8921K8793j5320
$$ 465969 467404 445788 429943 420947 431564 464364 475614 470091 467270 496191 524984 509664
19039E09664L0229M7681O8715K6596N6838N6105J04046J19500P1603J65080J58837
$$ 509664 539893 587574 656289 682885 739723 795828 899874 1019374 1090977 1256057 1414894
19028A414894J75314K53508K80550M28016O01697O43795O89144Q10671R69295
$$ 1414894 1590208 1843716 2124266 2552282 3153979 3797774 4486918 5297589 6266884
19019F266884J004859R18290R40124R82924Q13239P34647Q71501R81646P74450
$$ 6266884 7271743 8190033 9130157 10113081 10926320 11660967 12532468 13514114 14288564
19010A4288564N40491N02885O40100M49031J15764J21756M8331k26525m10174
$$ 14288564 14829055 15331940 15972040 16421071 16536835 16658591 16706922 16480397 16070223
19001A6070223m41371l77034m95669o45059n98763o36961p42538q36743q35479
$$ 16070223 15628852 15251818 14756149 14111090 13512327 12875366 12132828 11296085 10460606
18992A0460606q31083r04197r14511q22242p46498o20811m70768l80783l34302
$$ 10460606 9629523 8725326 7810815 6988573 6242075 5621264 5150496 4769713 4435411
18983D435411k50443j93138j30044k924J55774J43843K24579L67966N91897P77068
$$ 4435411 4184968 3991830 3861786 3858862 4014636 4158479 4383058 4751024 5342921 6119989
18973F119989Q87356J038712J335410J473213J453689J364387J423077J514643
$$ 6119989 7007345 8046057 9381467 10854680 12308369 13672756 15095833 16610476
18965A6610476J307549J187546J280740J237165Q72832O96835Q59291Q20511N50192
$$ 16610476 17918025 19105571 20386311 21623476 22496308 23193143 24052434 24872945 25423137
18956B5423137K44331J30295J6554m23273p42545o69900p25882r96653j143894
$$ 25423137 25667468 25797763 25814317 25391044 24648499 23978599 23252717 22256064 21112170
18947B1112170j043070j080419j284068j424977j363121j377298j514444j488939
$$ 21112170 20069100 18988681 17704613 16279636 14916515 13539217 12024773 10535834
18939A0535834j245782j149955r74612q63668q00827o79546n45039m47333l68899
$$ 10535834 9290052 8140097 7165485 6301817 5500990 4821444 4276405 3829072 3460173
18930C460173k50996k88069l05943j97421k32360j84895j47079j66527j11450
$$ 3460173 3209177 2921108 2615165 2417744 2185384 2000489 1853410 1686883 1575433
18921A575433j02794q2816j48595j79556r9377j3118N6483l4266p4673l277m9512
$$ 1575433 1472639 1389823 1241228 1061672 962295 949177 1005660 971394 896721 893444 843932
18910H43932l0761k7507l4392p3722o4791k4297J572l4164o368R618K1999j3306
$$ 843932 813171 785664 751272 677550 612759 588462 590034 555870 549502 559120 581119 567813
18898E67813m5278k0410k7332o3610M3553N402n0640l0352l6246L1319M5642L2235
$$ 567813 522535 502125 474793 411183 454736 460138 409498 379146 342900 374219 419861 452096
18886D52096J5042k7483j1626R362L7420N0672L8667m4445k6172j8128R234L0286
$$ 452096 467138 439655 428029 437391 474811 525483 564150 519705 493533 475405 484639 514925
18874E14925K4351n702M916p7194p0880N4892L7881k8244m4042p0J9313n5332
$$ 514925 539276 533574 538490 461296 390416 445308 483189 454945 410903 410833 430146 374814
18862C74814Q10j3101o1946l6839O5192N0004K435j751l0983k0588l6406n0125
$$ 374814 375624 362523 300577 263738 328930 378934 381369 379618 348635 328047 291641 241516
18850B41516j9533q630M6980J7514l4168L9634L6629k1772l1774l3486O9211R896
$$ 241516 221983 213353 260333 277847 243679 283313 319942 298170 266396 232910 302121 312017
18838C12017k4319M2980L0652L5087k5741N6200P2903N9688P2810P364N5028R8430
$$ 312017 287698 330678 361330 396417 370676 426876 499779 559467 632277 639641 694669 793099
18826G93099K9701M3397j1465j019L1854L8536J09735J06586O7894J36750J72550
$$ 793099 822800 866197 854732 853713 885567 924103 1033838 1140424 1208318 1345068 1517618
18815A517618J88349K48821L22210M61114O32265Q24140J005422J194785J382688
$$ 1517618 1705967 1954788 2276998 2738112 3370377 4194517 5199939 6394724 7777412
18806G777412J671095J801757J719449J545123J533475J394630J087930N99274
$$ 7777412 9448507 11250264 12969713 14514836 16048311 17442941 18530871 19130145
18798A9130145J68353j30405m68835r26813j255289j252099j352994j528738j505686
$$ 19130145 19298498 19168093 18699258 17772445 16517156 15265057 13912063 12383325 10877639
18789A0877639j395754j244921j031759q70310p45595o25096n30328m72418l67925
$$ 10877639 9481885 8236964 7205205 6334895 5589300 4964204 4433876 3961458 3593533
18780C593533l13387k58170k24820j27736j19358j43080r1155q8646J6916K8507
$$ 3593533 3280146 3021976 2797156 2669420 2550062 2406982 2315827 2227181 2244097 2272604
18770B272604M6156Q3930O2231Q1563J95771K07361L18871M86261P88439J139069
$$ 2272604 2318760 2402690 2464921 2546484 2742255 2949616 3268487 3754748 4543187 5682256
18760E682256J416829J684171J921542K246925K549663K685619K430583K283026
$$ 5682256 7099085 8783256 10704798 12951723 15501386 18187005 20617588 22900614
18752B2900614K278795J923144J261194N86511L7270n04417j130184j652357j914285
$$ 22900614 25179409 27102553 28363747 28950258 28987528 28483111 27352927 25700570 23786285
18743B3786285k015089k230860k381227k224165j967222j681532j546382j302328
$$ 23786285 21771196 19540336 17159109 14934944 12967722 11286190 9739808 8437480
18735H437480j078299q90437p40691o40123n25702l98714l12066l28414l37329
$$ 8437480 7359181 6468744 5728053 5087930 4562228 4163514 3851448 3523034 3185705
18726C185705l15678j76545j67740j25547j43471r3765q0104l7690n2623m2484
$$ 3185705 2870027 2693482 2525742 2400195 2256724 2162959 2082855 2045165 1992542 1950058
18716A950058M0658Q9534J66571K29402L81580M43761N75258O57899P97128R11019
$$ 1950058 1990716 2080250 2246821 2476223 2857803 3301564 3876822 4534721 5331849 6242868
18706F242868J043949R95527Q72579Q95607Q71658O39961L20068Q6850p3128l11577
$$ 6242868 7286817 8282344 9154923 10050530 10922188 11562149 11882217 11969067 11895939 11584362
18696A1584362n80343p26934q20046q88009r84558q90723p76159p37681p53239
$$ 11584362 11004019 10277085 9457039 8569030 7584472 6693749 5917590 5179909 4426670
18687D426670o13171m35266l92591l39562k77659k40967j59960j81453k06295
$$ 4426670 3813499 3378233 2985642 2646080 2368421 2127454 1967494 1786041 1579746
18678A579746j95099j20377j00381r1434o5392o5615m4431o1797l7404J644L362
$$ 1579746 1384647 1264270 1163889 1072455 1007063 941448 897017 835220 797816 799460 802822
18667H02822j05818j32261p9862K9356L4723k7353r2711k2384J1445n7599q6784
$$ 802822 697004 564743 484881 514237 548960 521607 428896 406512 417957 360358 273574
18656B73574k0211N2495K1698Q153N1805k4752O2144L2730q5395K5660N9979J162
$$ 273574 253363 305858 327556 335709 387514 362762 424906 457636 372241 397901 457880 459042
18644D59042L4187J3104m322M7465K3460J5493l8168n6619M1693N7056q971k5932
$$ 459042 493229 506333 502011 549476 572936 588429 550261 493642 535335 592391 583420 557488
18632E57488j4245R937M3397k6673K292J5749m8857p3803n0233N2664P9635L2254
$$ 557488 543243 553180 596577 569904 572196 587945 539088 465285 415052 467716 547351 579605
18620E79605j0814K0643j9343m5617l3294l4849k635J4590m2043m2523J500J7881
$$ 579605 568791 589434 570091 524474 491180 456331 453696 468286 426243 383720 385220 403101
18608D03101l2834l0657j962K5161K0563L3485J8706J9120l7117l2322K2639M6241
$$ 403101 370267 339610 337648 362809 383372 416857 435563 454683 417566 385244 407883 454124
18596D54124L8733J7943M2632N8850N1979L7892p4568o642o6098M006Q060j8271
$$ 454124 492857 510800 553432 612282 664261 702153 627585 620943 554845 558851 566911 548640
18584E48640J6268L1663P3610Q2331Q2824k705l5573q9705k3448M7379p228K0774
$$ 548640 564908 596571 670181 752512 835336 832631 797058 707353 683905 731284 724056 744830
18572G44830L237l4467K4388j0620k0099n0668K4567J8278m0861k5053J4295j5785
$$ 744830 748067 713600 737988 727368 707269 656601 681168 699446 658585 633532 647827 632042
18560F32042j3481l0150N543k3107N5308K2140R81M6891L7977J2787K3402j0924
$$ 632042 618561 588411 593954 570847 626155 648295 649276 696167 734144 746931 770333 759409
18548G59409n6113o8084l77K4943O549J6744N7170M0340N175J0929L5369M7525
$$ 759409 703296 635212 634835 659778 666327 683071 740241 780581 785756 796685 832054 879579
18536H79579L0765l081p349K2438O6735L5782j719L2887J00113J30997J01990
$$ 879579 910344 907263 899914 922352 989087 1024869 1023150 1056037 1156150 1287147 1389137
18525A389137N525M5683J17816J26025J95129J63312J55469J68098J29351J31467
$$ 1389137 1394662 1440345 1558161 1684186 1879315 2042627 2198096 2366194 2495545 2627012
18515B627012K17028K38038J97268K43458K87993M03687M34242N38140O44372
$$ 2627012 2844040 3082078 3279346 3522804 3810797 4214484 4648726 5186866 5831238
18506E831238O38876P55263P25972N48949K75998n228k42638m40568m57351l58139
$$ 5831238 6470114 7225377 7951349 8500298 8776296 8771068 8528430 8087862 7630511 7272372
18496G272372k44319j2852K08724L06197L36062L60187L07393K93251K23833K36161
$$ 7272372 7028053 7015201 7223925 7530122 7866184 8226371 8533764 8827015 9050848 9287009
18486I287009K76510M26289N80267P13367J008867J437793J753464K179511K592410
$$ 9287009 9563519 9989808 10570075 11283442 12292309 13730102 15483566 17663077 20255487
18477B0255487K790544L057990L556812M129979M967212O104405P197259Q157311
$$ 20255487 23046031 26104021 29660833 33790812 38758024 44862429 52059688 60216999
18469F0216999R037661R813310J0788316J1864711J3630990J6657753K0236281
$$ 60216999 69254660 79067970 89856286 101720997 115351987 132009740 152246021
18462A52246021K3965138K7513621K9433252K8742819K4324248J5371910J919393
$$ 152246021 176211159 203724780 233158032 261900851 286225099 301597009 303516402
18455C03516402j3752311k5855567l1940455l2808274k7699648j9603674j3999912
$$ 303516402 289764091 263908524 231968069 199159795 171460147 151856473 137856561
18448A37856561j1489790j0229809j0909773j1929186j1405162j0405924r271917
$$ 137856561 126366771 116136962 105227189 93298003 81892841 71486917 62215000
18441F2215000q106051p054932n923391m815197l909308l161652k567404j903993
$$ 62215000 54108949 47054017 41130626 36315429 32406121 29244469 26677065 24773072
18433B4773072j436496j209269j184432j213103j210189j350719j410359j339367
$$ 24773072 23336576 22127307 20942875 19729772 18519583 17168864 15758505 14419138
18425A4419138j369274j292647j160057r60806p49591n90715m69863l53377k11644
$$ 14419138 13049864 11757217 10597160 9636354 8886763 8296048 7826185 7472808 7261164
18416G261164r1862L0587Q9794J18842J03012J53486N8516O9687N5409p564j05668
$$ 7261164 7169302 7199889 7289683 7408525 7511537 7665023 7723539 7793226 7848635 7841071 7735403
18405G735403k21367l23467m36207n78380n65651l88903l27911l12815j30318
$$ 7735403 7514036 7190569 6754362 6175982 5610331 5221428 4893517 4580702 4450384
18396D450384k18576l15412k78005j93600j67788j50091q1346k1136P8309J39067
$$ 4450384 4231808 3916396 3638391 3444791 3277003 3126912 3045566 3024430 3102739 3241806
18386C241806K13036R5226Q3074j4088j99510k22541k92734k81016k11727k13811
$$ 3241806 3454842 3550068 3633142 3619054 3419544 3197003 2904269 2623253 2411526 2197715
18376B197715j39704j00048j39925q1112p9304o8719j07101r0590p5708k9878
$$ 2197715 2058011 1957963 1818038 1736926 1657622 1588903 1481802 1391212 1315504 1285626
18366A285626r8518J554J0996r9960o8215M983N1823m4697n1750O9l1951o6763
$$ 1285626 1187108 1188662 1199658 1099698 1031483 1036466 1088289 1043592 991842 991911 959960 893197
18354H93197j9742j03379q7309M0693N3866n424m1129n8676n1209l3836r532J9365
$$ 893197 873455 770076 682767 723460 777326 771902 730773 672097 620888 587052 577520 596885
18342E96885l3365o2156L3193K0010n769L7331l0776n846K9413l498p2028L5472
$$ 596885 563520 501364 534557 554567 548798 586129 555353 549507 578920 575422 503394 538866
18330E38866Q1426J2976m2532j5785l5523N8883R017j15717o5132J6686r42j6791
$$ 538866 620292 633268 590736 574951 539428 598311 607328 491611 426479 443165 442223 425432
18318D25432m137k4042l6111l0318l4083L840N8255J1871j8736l5742n2713o8127
$$ 425432 421295 397253 361142 330824 296741 300581 358836 370707 351971 316229 263516 195389
18306A95389J0289j7092p294L0103O588M0684O4700J7676l1705M761K4036l90
$$ 195389 205678 188586 181292 211395 217983 258667 323367 341043 309338 314099 338135 337745
18294C37745O402m212J3317j5572m5563N585m296j3168K587O8384L792n3012q5503
$$ 337745 344147 339935 353252 337680 292117 297702 293406 280238 282825 351209 355001 301989 216486
18281B16486k0705L1811J10819N5903j4569n1039o9333p3670L8503L2706j6679
$$ 216486 195781 227592 338411 394314 379745 328706 259373 185703 224206 256912 240233
18270B40233N1505J4384m2259o7046L657J3373M9727N3661m4889j2189M5097m173
$$ 240233 291738 306122 263863 196817 200474 213847 263574 317235 272346 260157 305254 301081
18258C01081l7426k2189o8647p531m340k4307L0975j0332J4561L4923l0936L3100
$$ 301081 263655 241466 172819 165288 160948 136641 167616 157284 171845 206768 175832 208932
18246B08932N9312j9697n8416N3656N855k3401j8346P708N970j1419Q915N3719
$$ 208932 268244 248547 190131 243787 249642 226241 207895 215603 221573 210154 219069 272788
18234B72788O9670M9941J3076l9359J2814L5977m9667m9418O433n8975o47J6192
$$ 272788 342458 392399 405475 366116 378930 414907 365240 315822 322255 263280 262633 278825
18222B78825J7420j7459J7702l5194m9499m420j9074j0624j1500k3052K8557j5809
$$ 278825 296245 278786 296488 261294 211795 207375 188301 177677 166177 143125 171682 155873
18210A55873J1374o308M5702R351l1722j3333N0931L7410M02n990J1377o622n2088
$$ 155873 167247 160939 206641 215992 184270 170937 221868 259278 259680 253690 265067 258445 206357
18197B06357j9068L0027L8342j4477k4557n3327p8980j9636P4981M5557Q517K6549
$$ 206357 187289 217316 255658 241181 216624 163297 84317 64681 139662 185219 193736 220285
18185B20285M9089L8962J0530j0274L7818m639r5298l3396j3716K1685r624J3945
$$ 220285 269374 308336 318866 308592 346410 341771 246473 213077 199361 221046 211422 225367
18173B25367j9808K1245O868m5186K2850L0321M1474M2850L6263M6102J9599N778
$$ 225367 205559 226804 233672 188486 211336 241657 283131 325981 362244 408346 427945 433723
18161D33723Q8669R336l239Q173K6659N2272M5325N8856L8209M8154O0094P9194
$$ 433723 522392 531728 528489 536662 563321 615593 660918 719774 757983 806137 866231 945425
18149I45425Q6065O3712P8577J5654k4980r3248p4119n3018l0248q712K6809K3385
$$ 945425 1031490 1095202 1173779 1189433 1164453 1071205 997086 944068 913820 905108 931917 955302
18137I55302J8694k0090M8041O4357O1915J06666J04858R5021M9451O6480J24261
$$ 955302 973996 953906 1001947 1066304 1128219 1234885 1339743 1434764 1484215 1550695 1674956
18126A674956K38515L06813K01903K54259L16535M65119P27627R63125J297557
$$ 1674956 1913471 2220284 2422187 2676446 2992981 3458100 4185727 5148852 6446409
18117F446409J763786K469328L675067N792673R293917J4721398K0464472J6281766
$$ 6446409 8210195 10679523 14354590 20147263 29441180 44162578 64627050 80908816
18109H0908816K140329j913234q587311j8950747j5924982r765353n699048l316739
$$ 80908816 83049145 81135911 72548600 53597853 37672871 27907518 22208470 18891731
18101A8891731j942910j403827j713501j749172j611072j461390j260599j033099
$$ 18891731 16948821 15544994 13831493 12082321 10471249 9009859 7749260 6716161
18093F716161r15087q98567o96390n07651m46458m12605l57648k45700k08839
$$ 6716161 5801074 4902507 4206117 3698466 3252008 2839403 2481755 2236055 2027216
18084B027216j87383j53172j63870j65777j50004j13043j13891j32918r7098q3631
$$ 2027216 1839833 1686661 1522791 1357014 1207010 1093967 980076 847158 750060 666429
18074F66429O407j4685r7601j0741o874j00011n1170K1219N774p2969o8792L3288
$$ 666429 672836 658151 560550 549809 542935 442924 391754 412973 418747 345778 276986 310274
18062C10274L9751j063J963p607k7861l1977k1356m8299K4808Q5990L1096k0731
$$ 310274 350025 348962 350925 343318 315457 283480 262124 213825 238633 324623 355719 334988
18050C34988k7102m0758k024j2569l5834l7831j5203K1314k6583m9991j5420M742
$$ 334988 307886 267128 265104 252535 216701 178870 163667 184981 158398 108407 92987 97729
18038I7729R2103P0043K8972j9008j3166p8859l6214N626k0750K2763K5826O2932
$$ 97729 189832 259875 288847 269839 256673 177814 141600 147226 126476 149239 175065 237997
18026B37997k7845n7516j1985Q503K2298j6544j2399N4918L6796n0982k5428j8672
$$ 237997 210152 152636 140651 149154 171452 154908 142509 197427 234223 183241 157813 139141
18014A39141k397r069k2251n0513r223J2703l2728K876N5770J0551j1888J190
$$ 139141 136744 127675 105424 54911 45688 58391 25663 28539 84309 94860 82972 84162
18002H4162K2246N349N2004M4255J4737J2116m9039L1825N1775K1001N7339k3052
$$ 84162 106408 111757 163761 208016 222753 234869 185830 217655 269430 290431 347770 324718
17990C24718k7995M3184l587k2569k3024r559l8941K6502O6582L1662k6950N2000
$$ 324718 296723 339907 336320 313751 290727 281168 242227 268729 335311 366973 340023 392023
17978C92023O1709l9925J0740k585L883k0834k4876k1946N55M442l5933n590j6183
$$ 392023 453732 413807 424547 421962 425845 405011 380135 358189 358744 363186 327253 321663 305480
17965C05480M931L0837n357k6165l9678O216N8729L0702l5030K0234O186K6269
$$ 305480 310411 341248 335891 309726 270048 276264 334993 365695 330665 350899 357085 383354
17953C83354j4287k1853K1100R0029M2612l7647l9722o263J7012L0211k4125m9723
$$ 383354 369067 347214 368314 458343 500955 463308 423586 417323 434335 464546 440421 390698
17941C90698n2532r594K5461k740o0237k5915m500r292J5862M1430K4755J7531
$$ 390698 338166 328572 354033 351293 291056 265141 260641 251349 267211 308641 333396 350927
17929C50927L979k277J7461m4252j8617J5626L3064R1430R109n0797j6939K7375
$$ 350927 354906 352629 370090 325838 307221 322847 355911 447341 456450 405653 388714 416089
17917D16089k6675j06147o8528l7163j0247k5004K6797L9629k422k0461k0789
$$ 416089 389414 283267 214739 177576 167329 142325 169122 208751 206329 185868 165079
17906A65079O370o13k9408r300Q643k3647l5039n177J0869L336j1765L6799L9592
$$ 165079 171449 170836 141428 132128 140771 117124 82085 76908 87777 91113 79348 116147 155739
17893A55739M2108O4403m0147k2340o5392K5493J848p9193o7415k8061K1905M4061
$$ 155739 197847 262250 222103 199763 134371 159864 161712 82519 15104 -12957 8948 53009
17881E3009J5628J4952j8824j2374L117j1509L0738K1568K599k9381k7486k3258
$$ 53009 68637 83589 64765 52391 55508 43999 74737 96305 98904 69523 42037 18779
17869A8779j5121J6285K3490O451p877N6102m6849N7990L7080m8879k5921K1029
$$ 18779 3658 19943 43433 49884 42007 98109 51260 109250 146330 97451 71530 92559
17857I2559O984q728k9760J1872O970l3614J2142q019m5677l2553O1339K8749
$$ 92559 99543 90815 61055 72927 79897 46283 58425 50406 4729 -27824 33515 62264
17845F2264m6412O9522K5161m8988j0229j9672P183M7078L3021j3027k8773n1190
$$ 62264 15852 85374 110535 61547 51318 31646 38829 85907 118928 105901 77128 25938
17833B5938k3594K708J1824M6355Q294l909J4381j7611p6224J4546K812j3882
$$ 25938 2344 5052 16876 63231 71525 67616 81997 64386 -11838 2708 5520 -8362
17821h362J1256m4480J5267M2477L8593N1595k2966p0865n7297k0766M9852M4938
$$ -8362 2894 -41586 -26319 16158 54751 106346 83380 12515 -44782 -65548 -15696 29242
17809B9242Q35J5816K7700l2576j3100M2006N1698L3690L2765J5169J9546q660
$$ 29242 30077 45893 73593 41017 27917 69923 121621 155311 188076 203245 222791 214131
17797B14131K4750J2600l0262m2956l6204k6362l4068L210J2034m329k2230J5369
$$ 214131 238881 251481 221219 178263 142059 115697 81629 84839 96873 92544 70314 85683
17785H5683j78o8624k7602J5594L0588O2915l2145j9747j5995L716j1929m718
$$ 85683 85505 16881 -10721 4873 35461 98376 66231 46484 30489 34205 22276 17558
17773A7558r155M207L898m4843K321j4970J1918M5000K4525j4652K4071j2813
$$ 17558 8403 12610 16508 -28335 -26014 -40984 -29066 15934 40459 25807 49878 37065
17761C7065J5664J6057k546j3200K4508M033k0777q3963o1018K0580K9938K0777
$$ 37065 52729 68786 66240 53040 77548 81581 60804 -23159 -84177 -63597 -33659 -12882
17749a2882j5231j8415n577L6487O495J3106N0176k537J3391k009K5255o038o858
$$ -12882 -28113 -46528 -52105 -15618 -9123 3983 54159 51622 65013 63004 88259 82221 75363
17736G5363K4163J0493M4008n9833j04870J7837O0780L6473j1425p8316m3302
$$ 75363 99526 110019 154027 94194 -10676 7161 67941 104414 92989 14673 -28629
17725b8629K9898l293L4816k0826m1213k299n1966k0024L7747M6782N2519o927
$$ -28629 1269 -2024 32792 11966 -29247 -31546 -83512 -103536 -65789 -19007 33512 26585
17713B6585J4744l4063k116J6586n1240p1498L0263R3680m883K1263J0045j2513
$$ 26585 41329 7266 5150 21736 -29504 -101002 -70739 22941 18058 39321 49366 36853
17701C6853j0522O092K2686J0926o1588l371J1471j2695O9331N1834L760l2766
$$ 36853 26331 32423 55109 66035 4447 1076 12547 -148 69183 121017 124777 92011
17689I2011J2700K4066j7689k5157l1253p7406k9073L0088M0015P6835l1008o6854
$$ 92011 104711 128777 111088 85931 54678 -22728 -51801 -21713 18302 95137 64129 -2725
17677b725k1266K0542k5328K4566M6888O5674l3817m4132L5778M5565k4665j3886
$$ -2725 -23991 -3449 -28777 -4211 42677 108351 74534 30402 66180 111745 87080 73194
17665G3194L0446K6077k7797q5360j9766M2250j3478n0358l7963L2192L9519J5266
$$ 73194 103640 129717 101920 16560 -3206 39044 25566 -24792 -62755 -30563 8956 24222
17653B4222j226p6861P862L9000J1339L3193M1841n3879m9687k8111K2492k807
$$ 24222 22996 -53865 -46003 -7003 4336 37529 79370 25491 -24196 -52307 -29815 -32622
17641c2622J1356r765R2222L4727m7971M4674Q939o4522n7171m7278j3164O4929
$$ -32622 -21266 -31031 61191 95918 47947 92621 101560 37038 -20133 -67411 -80575 -15646
17629a5646J08384k6255j9830L5436j8387o101l528l8080K801K7244l983m0169
$$ -15646 92738 66483 46653 82089 63702 57601 54073 15993 18794 46038 42055 1886
17617A886k8031M9086K7671o0609q798k842K2097K4968K2120j1215l1120l9347
$$ 1886 -26145 22941 50612 -9997 -18795 -21637 460 25428 47548 36333 5213 -34134
17605c4134M4688k261q1824K5179J5454q760M1350M3045R52l2608N112j2543l9680
$$ -34134 10554 8293 -73531 -48352 -32898 -41658 -308 42737 43689 11081 16193 3650 -36030
17592c6030j2904L335J6480M719Q255K1615M7244J558J8728L1088k4965r2432
$$ -36030 -48934 -45599 -29119 -24400 -16145 5470 52714 54272 73000 104088 79123 -13309
17580a3309l6846q40J8998K3136K5013R103q9582J465J0682J0071J9718J1516
$$ -13309 -50155 -50995 -31997 -8861 16152 25255 -64327 -62862 -52180 -42109 -22391 -10875
17568a0875j1713J0364M059J0132K3024J4303K2480n1693k6965K4425K3290j9397
$$ -10875 -22588 -12224 -8165 1967 24991 39294 61774 10081 -16884 7541 30831 11434
17556A1434k7823m1497M7259L8895L152l6903M0573j4352L0807O795k6460K0145
$$ 11434 -16389 -57886 -10627 28268 31420 -5483 35090 20738 51545 58340 31880 52025
17544E2025j3118j0656p13K914j1418L5220n971k831M8910K4470j5600l9736k8573
$$ 52025 38907 28251 27538 30452 19034 54254 48283 45452 94362 118832 103232 63496 34923
17531C4923j1216Q143m8557n7130l1253L2549P1473j517M212J857l7024J3562
$$ 34923 23707 31850 -16707 -73837 -105090 -72541 -1068 -2585 1627 3484 -33540 -19978
17519a9978P6185M2859o014k0836N901m0773k6299m4455L0907j1511K5679M2783
$$ -19978 56207 99066 93052 72216 78117 37344 11045 -33410 -2503 -14014 11665 54448
17507E4448J1365K4370l9064l3521j6755m1073K2793J2291N711K8855M8378k6531
$$ 54448 65813 90183 51119 17598 843 -40230 -17437 -5146 565 29420 77798 51267
17495E1267l5488j3576j7065l457M0665K3284j372l1596k1163l5267l2001L1971
$$ 51267 15779 2203 -14862 -18319 22346 45630 44258 12662 -8501 -43768 -75769 -43798
17483d3798L8246L8279L0985m1655P6482K8129o3698n8672K7844K4548N6325j2577
$$ -43798 -5552 32727 63712 22057 98539 126668 62970 4298 32142 56690 113015 100438
17471A00438l0450k2328m952j5835o3308n4925N1720k3424o226R0826L2741k9632
$$ 100438 69988 47660 42708 26873 -36435 -91360 -39640 -63064 -69290 21536 54277 24645
17459B4645k5106K996O7094N0141O894o0049j7470k2079M4161J2380j9745M7006
$$ 24645 -461 2535 69629 119770 126664 66615 49145 27066 71227 83607 63862 110868
17447A10868Q3906J19880R2839N5552k3891l4967m5046p9473m0395k5943k8881
$$ 110868 194774 314654 407493 463045 439154 404187 359141 279668 239273 213330 184449
17436A84449r246r128n9428j7026J2402l914l4774N868n0696p4897K208M9952
$$ 184449 175203 166075 106647 89621 102023 98109 63335 69203 18507 -56390 -54182 -4230
17424d230O0182L5710K838j7080m5555m220L685m1749l8639M7661N3611k5816
$$ -4230 55952 91662 94500 77420 31865 27645 31330 -10419 -49058 -1397 52214 26398
17412B6398P755p756p381k5874J932L0671K6322J2345o6634Q228M3315o0759o5369
$$ 26398 34153 26397 19016 -6858 -4926 25745 52067 64412 -2222 6006 49321 -11438 -76807
17399g6807L2537K4886k1122N4225j9881k2566N6347n1208j5658M3477k9714k6524
$$ -76807 -44270 -19384 -40506 13719 -6162 -28728 27619 -23589 -39247 4230 -25484 -52008
17387e2008j4245J2411J3404M314K139j7474K7665n163r03n1303k4718L6327M6835
$$ -52008 -66253 -53842 -40438 -36124 -33985 -51459 -23794 -28957 -29860 -81163 -105881 -69554 -22719
17374b2719L6165N030J4618J6793J3599p616j7405O2325l0813k7038j6549K2631
$$ -22719 13446 18476 33094 49887 63486 55870 38465 100790 69977 42939 26390 49021
17362D9021m2646l4495q4613K6923Q581L8270k379J294o767R067o961n101k7123
$$ 49021 6375 -28120 -112733 -85810 -77229 -38959 -41338 -40044 -46811 -37744 -44705 -49806 -76929
17349g6929l5333L5819N746Q0487J9545r382k5710q53j2423K0644l2676J2244
$$ -76929 -112262 -76443 -70697 9790 29335 19953 -5757 -6610 -19033 1611 -31065 -18821
17337a8821k5551k9420J5739M5424K6540O195M855m519J3951M182j0576J9174
$$ -18821 -44372 -73792 -58053 -12629 13911 20106 24961 20442 34393 38575 27999 47173
17325D7173m1989n1822p46M438M9134n386L3852k7126J3458J9167m7689n168N3083
$$ 47173 5184 -46638 -47384 -42946 6188 802 34654 7528 20986 40153 -7536 -12704 40379
17312D0379P114p6112M5927K4110l3630l3129p6482M1229N9603R084J9754L6400
$$ 40379 47493 -28619 17308 41418 7788 -25341 -101823 -60594 -991 8093 27847 64247
17300F4247j0713j13539j4510L7752p031K4941N5546J9172O5981j6140p8439J3639
$$ 64247 53534 -60005 -74515 -36763 -43794 -18853 36693 55865 121846 105706 27267 40906
17288D0906L8147k3436l4336j8723j5469m257J7395K6087k249k2557K9860N6293
$$ 40906 79053 55617 21281 2558 -12911 -17168 227 26314 24065 1508 31368 87661
17276H7661K1767l3217j7361l3680l6677k8281M061m2425P401K8315j5891N0325
$$ 87661 109428 76211 58850 25170 -11507 -39788 -35727 -78152 -70751 -42436 -58327 -8002
17264h002j6423l0325j3612L8911J00771N060o6680O904M086j0909l9861J629
$$ -8002 -24425 -54750 -68362 -29451 71320 76380 9700 16604 20690 9781 -30080 -28451
17252b8451J1741l2685l0638j9668o6098L525O7122Q1170N4115k5132k0116o3298
$$ -28451 -16710 -49395 -80033 -99701 -165799 -162274 -95152 -13982 40133 15001 -5115 -68413
17240f8413j0770K6936k1897n9112J6405K9965L5545O816J6337L5102L2005l7429
$$ -68413 -79183 -52247 -74144 -133256 -116851 -86886 -51341 -44525 -28188 6914 38919 1490
17228A490l9336k44J0241j1808J2849j960L6610j8743N055M2207M8036r4918P422
$$ 1490 -37846 -38090 -27849 -39657 -26808 -28768 7842 -10901 -5846 36361 84397 -10521 -3099
17215c099M0952n4286k2205J5648j0178l2789j053N2979J5029J8237L8962k0480
$$ -3099 37853 -16433 -38638 -22990 -33168 -65957 -67010 -14031 998 19235 58197 37717
17203C7717o7181q249k028L8066K8235l6306J1526K397J9948J4709r9j6751n2906
$$ 37717 -29464 -37713 -39741 -1675 26560 -9746 1780 4177 24125 38834 38735 21984 -30922
17190c0922r329l1852R102L5028J4391J1928K18m5636J1369L1222J6320o1450
$$ -30922 -40251 -72103 -63001 -27973 -13582 -1654 -1436 -47072 -35703 -4481 11839 -49611
17178d9611N4097N8749m3515m8637m5294K4419M0086K9061M1812O846o4323j5363
$$ -49611 4486 63235 19720 -28917 -74211 -49792 -9706 19355 61167 68013 3690 -11673
17166a1673L854J4636M726j9508n3876m7703p624O9255O3740O1697j5553p823
$$ -11673 -7819 6817 11543 -7965 -61841 -109544 -117168 -47913 15827 77524 61971 54148
17154E4148p797m900N479k7532n3890K7237l5809J7229q977j5415N1236N372L906
$$ 54148 46351 41451 46930 19398 -34492 -7255 -43064 -25835 -34812 -50227 1009 6381 10287
17141A0287O2005Q0553m9287j05875l8234Q1562m1099k9488J0108P6278J6969
$$ 10287 72292 152845 103558 -2317 -40551 41011 -88 -29576 -19468 56810 73779
17130G3779l2417l3692j4004j2585j6076K4323L090o30N6502n074m3715l391L2885
$$ 73779 41362 7670 -6334 -18919 -34995 -10672 -7582 -8212 48290 43216 -499 -3890 28995
17117B8995k6235j1642K5175O082J2360j7303m3733k9669K2643k8106k4137L9632
$$ 28995 2760 -8882 16293 22375 34735 17432 -26301 -55970 -33327 -61433 -85570 -45938
17105d5938L4002m7385l4544P375L0037L7521K3800J3677j7800r962L3051L0057
$$ -45938 -11936 -59321 -93865 -86490 -56453 -18932 4868 18545 745 -9217 23834 53891
17093E3891m5688J812R663j2924j8583n4569N817K7447N2432k0799k3983J9546
$$ 53891 8203 10015 19678 6754 -11829 -66398 -60581 -33134 19298 -1501 -25484 -5938
17081e938K8492J2008k1708j8012l0406N103P2689J0199j8249l999j1950L7632
$$ -5938 22554 34562 12854 -5158 -35564 -30461 42228 52427 34178 30179 18229 55861
17069E5861P5207m1220m0597j6764J090L6986k9503k2223K7312K0725p8875k0295
$$ 55861 131068 89848 49251 32487 33577 70563 41060 18837 46149 66874 -12001 -32296
17057c2296M724n874m596J5281N1183k2882l9269K8042N995j3880l9865l286K9861
$$ -32296 -27572 -33446 -38042 -22761 28422 5540 -33729 -5687 308 -13572 -53437 -56723 -26862
17044b6862N6969L3711N4469l0102p4401k4542K3159j548P9732J0766r252o7387
$$ -26862 30107 63818 118287 88185 13784 -10758 12401 10853 90585 101351 92099 24712
17032B4712j9825j1516L2393J8646n5828o256K655M638j1994O0494j2311o4503
$$ 24712 4887 -6629 25764 44410 -11418 -17674 -15019 -10381 -22375 38119 25808 -38695
17020c8695K1993O1691Q662k0616j8370k5500J0469M0543L1199K0837m769k2524
$$ -38695 -16702 44989 53651 33035 14665 -10835 -366 40177 71376 92213 87444 64920
17008F4920o1525l8105j3001L4506L6431o415m767q384J9357R69J6657L1216L2164
$$ 64920 3395 -34710 -47711 -13205 23226 16811 12044 3660 23017 23986 40643 71859 104023
16995A04023k9252p9653k1579J8806m6628K5853K8341m906j7849K5394j6148Q384
$$ 104023 74771 -4882 -26461 -7655 -54283 -28430 -89 -4995 -22844 2550 -13598 -5214
16983e214L3713J0473P2750M227N486J2978r671j0921p9958r753k1354L2626R615
$$ -5214 28499 38972 111722 115949 121435 134413 124742 113821 33863 24110 2756 35382 44997
16970D4997n660q272j7294J2102n2539m4678L3969M0117r002L9702K2815O731
$$ 44997 39337 31065 13771 25873 -26666 -71344 -37375 2742 -6260 33442 56257 62988
16958F2988l647M826k0863k6789j2430r093K5676N5372p020k9780j1368j1746
$$ 62988 59341 64167 43304 16515 4085 -5008 20668 76040 69020 39240 27872 16126
16946A6126K1098p526Q5K9650j3512l5863l8052k6662j4590K6537P775L1934K6321
$$ 16126 37224 29698 29783 59433 45921 10058 -27994 -54656 -69246 -42709 -34934 -3000 23321
16933B3321l0297m9113R90K3870O0831K6778J0634k5124n8065o8904j5168M9497
$$ 23321 -6976 -56089 -55099 -31229 29602 56380 67014 41890 -16175 -85079 -100247 -50750
16921e0750L7251l4525J9271n140J2268J1794J2789Q0051k1239l1988R188K786
$$ -50750 -13499 -48024 -28753 -33893 -21625 -9831 2958 83009 61770 29782 38970 41756
16909D1756j593k7160l3487J8321k0477l6594P497L3001l7504P428M7886J4264
$$ 41756 40163 13003 -20484 -2163 -22640 -59234 -51737 -18736 -56240 -48812 -926 13338
16897A3338K5605l5748j3550j6130j3301L9324L8216n208j1162J2656J2492O5308
$$ 13338 38943 3195 -10355 -26485 -39786 -462 37754 32546 21384 34040 46532 111840
16885A11840M711m1524n939K1925k3582k4877J0737j3899n4028L4206L5733j1902
$$ 111840 116551 75027 69088 91013 67431 42554 53291 39392 -14636 19570 55303 43401
16873D3401l836P38R935k7250j2881r253O521R182J9581R450M2556j6452q383
$$ 43401 39565 40303 50238 22988 10107 854 7375 16557 36138 45588 88144 71692 63309
16860F3309n0172l7754M1026K9503o197o7668J3667p66n3872M5097N3054M3743
$$ 63309 13137 -24617 16409 45912 39715 -27953 -14286 -15052 -68924 -23827 29227 72970
16848G2970j3706k1628j1284n4139n6257K5567L856M970o2446K0211Q0839Q030
$$ 72970 59264 37636 26352 -27787 -84044 -58477 -54621 -49651 -112097 -91886 -11047 -3017
16836c017j1843P18k9871k7834L7719l640q136M4598j1912l065k0923M4649k6129
$$ -3017 -14860 -14142 -44013 -71847 -34128 -37768 -45904 -1306 -13218 -16283 -37206 7443 -18686
16823a8686K727L2668J957k4308K768M2436J3245K1009O401q164l5856l3603j3430
$$ -18686 -15959 16709 18666 -5642 -2874 39562 52807 73816 80217 72053 36197 2594 -10836
16810a0836o5090P288N3089N8243L8264M110k2365m1206p2979l5205P1315M5212
$$ -10836 -75926 -68638 -15549 42694 80958 85068 62703 21497 -51482 -86687 -15372 29840
16798B9840n130L2628O2085l0626l7697L2241L2051q1765j6346r719j1m698N1962
$$ 29840 24710 57338 119423 88797 51100 83341 115392 33627 17281 7562 7551 2853 54815
16785E4815l7675j8769K8925k0482p3571n2877J6624L5573N5155J8122m289Q68
$$ 54815 17140 -1629 27296 6814 -66757 -119634 -103010 -67437 -12282 5840 1551 2419
16773B419r604M1393m6700k6421L6585K4176M0327m4082m8741Q339J56J2688K0721
$$ 2419 -7185 34208 -12492 -38913 -2328 21848 62175 18093 -30648 -22309 -22153 -9465 11256
16760A1256P0305O354K3412j9674l3510l5408n1218l4089L4763J3008L3864L7070
$$ 11256 81561 87915 111327 91653 58143 22735 -28483 -62572 -27809 -14801 19063 56133
16748E6133n7720m3512L0998M0557P5531k5143q8002l7445M9467K7437j2652J7345
$$ 56133 -1587 -45099 -14101 26456 101987 76844 -11158 -48603 864 28301 15649 32994
16736C2994n653p4563n3225m9261M7182L4314M8702N1254L670o0787k6297O6489
$$ 32994 27341 -47222 -100447 -149708 -102526 -68212 -19510 31744 35414 -25373 -51670 14819
16724A4819K3096p6994L4669N2390J836J0510M9445j6443j03703q5647k5223l0353
$$ 14819 37915 -39079 -4410 47980 49816 60326 109771 93328 -10375 -96022 -121245 -151598
16712a51598P3449M0624L7977J2822K900J0415K2579L1629l6629j9078j7791N1062
$$ -151598 -78149 -37525 452 13274 16174 26589 49168 80797 44168 25090 7299 58361
16700E8361J9116k8739k5661p7956q390J4552l4215L0103M6796L2342K11L7901
$$ 58361 77477 48738 23077 -54879 -63269 -48717 -82932 -52829 -6033 26309 26520 64421
16688F4421j3087n7557l1578n300n093l2497j9775L6746J8612m5870J3113Q500
$$ 64421 51334 -6223 -37801 -43101 -48194 -80691 -100466 -63720 -45108 -90978 -77865 -69365
16676f9365J1978L5836P495M2591J7378l2637o8487n8266M4754L3586M2972m7821
$$ -69365 -57387 -21551 -14056 28535 45913 13276 -55211 -113477 -68723 -35137 7835 -39986
16664c9986J6348N1325l5077j8819q2149n5949M0323O907M5382K8045j0596J3515
$$ -39986 -23638 27687 -7390 -26209 -108358 -164307 -123984 -117077 -71695 -43650 -54246 -40731
16652d0731L1959K0103K95j8837J0270l2255K4664P272J8957L487k9755o9064
$$ -40731 -8772 11331 11626 -7211 3059 -29196 -4532 2740 21697 25184 -4571 -73635
16640g3635m1596j9903R455O5254J0463L3144N7142M2120O125l1098m4126n2161
$$ -73635 -115231 -135134 -125679 -60425 -49962 -16818 40324 82444 88569 57471 13345 -38816
16628c8816J9033J8067K3866p165r761l7032k2128k0388n7654j4314K5263M8242
$$ -38816 -19783 -1716 22150 14985 5224 -31808 -53936 -74324 -131978 -146292 -121029 -72787
16616g2787j9448k977J6383J002K9544M6215k3532p126k582l8246K7381j2373
$$ -72787 -92235 -95212 -78829 -77827 -48283 -2068 -25600 -32726 -35308 -73554 -46173 -58546
16604e8546J5334j4165O1024R4240n6601p5485k3302P3348j799j6699k6131l601
$$ -58546 -43212 -57377 3647 97887 41286 -34199 -57501 15847 14048 -2651 -28782 -32383
16592c2383j5018J6599J0332j8550K1655N721J1048L6169l6907m1207N853k1567
$$ -32383 -47401 -30802 -20470 -39020 -17365 -11644 -596 35573 -1334 -42541 -36688 -58255
16580e8255K6686k3885m3832M791j087J0930L2993K6149J0097o537O349L0055
$$ -58255 -31569 -55454 -99286 -94495 -95582 -84652 -51659 -25510 -15413 -21950 -15601 14454
16568A4454L557m9827m214J8602k4530l7584K7319J3740j9458N7989N3774j855
$$ 14454 18011 -31816 -36030 -17428 -41958 -79542 -52223 -38483 -57941 48 53822 51967
16556E1967J8902m2441k4852J7433L7929k0201j9396j0345M8231j2066l328R747
$$ 51967 70869 28428 3576 21009 58938 38737 19341 8996 57227 45161 41833 51580
16544E1580L8561J4113o9007l7070k3990o807K0942J2751q522K7739m0823q318
$$ 51580 90141 104254 35247 -1823 -25813 -32620 -11678 1073 -7449 20290 -20533 -28851
16532b8851k8722k698N5938N4317K0467o6473j5665L2194N9804K0878n0759n524
$$ -28851 -57573 -60271 -4333 49984 70451 3978 -11687 20507 80311 101189 50430 44906
16520D4906k3283N258j2879n3677p696o77Q0371O6616l7967N716p0953k9858m060
$$ 44906 21623 26881 14002 -39675 -47371 -48048 32323 98939 60972 66688 -4265 -34123 -38183
16507c8183K4059J8774n3N03K0719o572o969j5691j6594L2517J9092j1611k8426
$$ -38183 -14124 4650 4597 5100 25819 19247 12278 -3413 -20007 12510 31602 19991 -8435
16494h435p148Q0076K8061k3994R301m861m4252n1662j8827L2322K2752K1540
$$ -8435 -15583 64493 92554 68560 77861 73000 28748 -22914 -41741 -9419 13333 34873
16482C4873P88L6946l3327p6147R0744K478p1515K245K2684k1649J988k4335L1063
$$ 34873 35661 72607 39280 -36867 53877 56355 -15160 -12915 9769 -11880 -9892 -34227 -3164
16469c164r039l4792m1466J8087K0226Q3046R6295m3199l0065P757l0327q999
$$ -3164 -12203 -46995 -88461 -70374 -50148 32898 129193 85994 55929 63686 33359 24360
16457B4360n0992J0052N0574P6711l9422o3416l3773n54m7515K7502N2606l745
$$ 24360 -26632 -16580 33994 110705 71283 7867 -25906 -26460 -73975 -46473 6133 2388
16445B388l0356m5853j0422Q0205J08643K5499o3965k3367j6914k344M5443N4929
$$ 2388 -27968 -73821 -84243 -4038 104605 130104 66139 42772 25858 23514 68957 123886
16433A23886l8366l4810o566k6900K5607J0668m3444K7439k5320m211K7669J6776
$$ 123886 85520 50710 44144 17244 42851 53519 10075 37514 12194 7983 35652 52428
16421E2428k8891j4722L0241k7261N1241P761k2093j3767n0287J3146L0941J1838
$$ 52428 23537 8815 39056 11795 63036 70797 48704 34937 -15350 -2204 28737 40575
16409D0575M6184J7048j6716l5026l7635o1137m191K591J0701k598k0207k5503
$$ 40575 86759 103807 87091 52065 14430 -46707 -50898 -48307 -37606 -40204 -60411 -85914
16397h5914J4470P263j9096M1302M0718L4231K6807m4704j4988J5128M8605k173
$$ -85914 -71444 -64181 -83277 -41975 -1257 32974 59781 15077 89 15217 63822 61649
16385F1649Q208k9279k342J9946l9549J6728j2992o2356J0942J5338O46j6336
$$ 61649 69857 40578 38236 58182 18633 35361 22369 -39987 -29045 -13707 -13061 -29397
16373b9397j265k9349J3931J26l0759L1428j5921K6637J5674J7844O3115J8138
$$ -29397 -30662 -60011 -46080 -45954 -76713 -45285 -61206 -34569 -18895 -1051 62064 80202
16361H0202k0590J1400l2438l8304Q7L0379j148J9777n902J2350J0211l3052k4002
$$ 80202 59612 71012 38574 270 357 30736 29588 49365 43463 55813 66024 32972 8970
16348H970k5196L5095L0348k5711J6654j1544M735M6326l79l331j4990J1847m3378
$$ 8970 -16226 18869 49217 23506 40160 28616 33351 79677 79298 75967 60977 72824 29446
16335B9446R845l3155k8552m991J919M1636r81j3170l5363j2400K9342J6876N3835
$$ 29446 39291 6136 -22416 -27407 -25488 16148 15167 1997 -33366 -45766 -16424 452 54287
16322E4287Q6993K9947p6448m0434j332Q162q176m1527n4327J6194J9988j679
$$ 54287 141280 171227 94779 54345 53013 61175 52999 11472 -42855 -26661 -6673 -8352
16310h352o263N1197L5246k4548Q758n0431m0912L3056j9125q9026R74O8300K6925
$$ -8352 -14615 36582 71828 47280 56038 5607 -35305 -2249 -21374 -110400 -109426 -41126 -14201
16297a4201L4298J6223r743l3121l0927j9378K7506r203j0474M5393K0127j694
$$ -14201 20097 36320 26577 -6544 -37471 -56849 -29343 -38546 -49020 -3627 16500 14806
16285A4806J4240j9971l953J8449N2818P224j12142L464M163k8810L0702J7765
$$ 14806 29046 9075 5122 23571 76389 83613 -28529 -25065 -20902 -49712 -19010 -1245
16273a245K687k993L8295k9596j1278M8386M9415m3070j7510J1895R970J1501
$$ -1245 1442 -1551 36744 7148 -4130 44256 93671 50601 33091 44986 54956 66457
16261F6457l8017o6253j7346N3873M5538k9663n9302l8005P2339L6549p0303l3334
$$ 66457 28440 -37813 -55159 -1286 44252 14589 -44713 -82718 -10379 26170 -44133 -77467
16249g7467J7973L5629M4739m2914q187l3265k5031L7278M8643M3981L1630j800
$$ -77467 -59494 -23865 20874 -22040 -30227 -63492 -88523 -51245 -2602 41379 73009 71209
16237G1209J2033j8091k5986k375m0234k9555K257K5041n496K0663l5477k7959
$$ 71209 83242 65151 39165 36790 -3444 -32999 -30742 -5701 -11197 9466 -26011 -53970
16225e3970P6145O866o1458j6875K6270L1849o020j8264n0770K7257J4875j8503
$$ -53970 22175 29041 -32417 -49292 -23022 8827 2807 -15457 -66227 -38970 -24095 -42598
16213d2598j2639L7734k0019K5699N5133k6250n3445M7533L3529k9534J133m5921
$$ -42598 -55237 -17503 -37522 -11823 43310 17060 -36385 11148 44677 15143 16276 -29645
16201b9645n287M0767J6342N5284o973J37L5850j7662k2083j38N6456j6964p8060
$$ -29645 -34932 5835 22177 77461 70488 70625 106475 88813 66730 66592 123048 106084 28024
16188B8024j1268j0269M5621K0290l0677L634K1929m8039p1502j8211M5678O9840
$$ 28024 16756 6487 52108 72398 41721 45355 67284 19245 -52257 -70468 -24790 45050
16176D5050j8083j3752l140k6090O287j3029k625p945m7332J565N1538M5331N3867
$$ 45050 26967 13215 10075 -16015 -9728 -22757 -25382 -33327 -80659 -79094 -27556 17775 71642
16163G1642j8704l4328R333l3666Q286L039m933M0578O387j1642m0047K6555O08
$$ 71642 52938 18610 27943 -5723 2563 5602 669 41247 47634 35992 -4055 22500 23108
16150B3108l6295k9212j6226k5405M0333l7974q232P430K2696P1113P4174O3564
$$ 23108 -13187 -42399 -58625 -84030 -43697 -81671 -89903 -82473 -59777 11336 85510 149074
16138A49074m4936p5207K2723K6642R932n7815m5726J253N6411K5302O768j0611
$$ 149074 104138 28931 51654 78296 88228 30413 -15313 -14060 42351 67653 74421 63810
16126F3810N6804M242l8641j3276k2433n9259J75O2202l0688j2304K1634L1640
$$ 63810 120614 124856 86215 72939 50506 -8753 -8578 53624 22936 10632 32266 63906
16114F3906j8790k6667K4335r298m2463r876l5756j287J8189M689l69k0280M4995
$$ 63906 45116 18449 42784 33486 -8977 -18853 -54609 -55896 -37707 -33018 -33387 -53667 -8672
16101h672J9141k8326J3520J8115j8299M0021j5580m3891k9840M5289J4981J3721
$$ -8672 10469 -17857 -4337 13778 -4521 35500 19920 -23971 -53811 -8522 6459 20180
16089B0180n1367m5845k630M7120P0626J350q768J4012p154J5372p6910l868J5480
$$ 20180 -31187 -77032 -79662 -32542 38084 39434 30666 44678 37524 52896 -24014 -27882 -12402
16076a2402l1580j3857j1407L7105K893M5027m1366j4829l408j0531K1909O6916
$$ -12402 -43982 -57839 -69246 -32141 -29248 15779 -25587 -40416 -43824 -54355 -32446 34470
16064C4470L3090q481O227M767l2222n4617J1785K4483j7895l3624J8241M3560
$$ 34470 67560 59079 65306 70073 37851 -16766 -4981 19502 1607 -32017 -13776 29784
16052B9784l4936K136L4533m747j7006k3754L828O5799O2444j3937m1155J5514
$$ 29784 -5152 -3016 31517 26770 9764 -13990 -10162 55637 118081 104144 62989 78503
16040G8503m5261l9532k8362k4842K9944L1998l434P241l1002J3086l8987m239
$$ 78503 33242 -6290 -34652 -59494 -29550 2448 -986 6255 -24747 -11661 -50648 -54887
16028e4887Q333M0495L0521J813O540N8804M3978O591m32j2440o1476k1808k7246
$$ -54887 -46554 -6059 24462 26275 32815 91619 135597 142188 141756 129316 67840 46032 18786
16015A8786L599J6625M9500k1722p1252j8608L4147j0858M1751O7713J6794n9067
$$ 18786 22385 39010 88510 66788 -4464 -23072 11075 217 41968 109681 126475 67408
16003F7408P84m5918k1598P778j4193l937n3431j3032J2041M7950L5389J5579
$$ 67408 68192 22274 676 8454 -5739 -9676 -63107 -76139 -64098 -16148 19241 34820
15991C4820k293K5605m2109m455n6759j8916j4229L4365L3218J457J9172J6015
$$ 34820 32527 58132 16023 11568 -45191 -64107 -78336 -43971 -10753 -9296 9876 25891
15979B5891k5736n0871j0591M0919K327n391l7728n262N4990K3290Q663M503K4193
$$ 25891 155 -50716 -61307 -20388 -18061 -23452 -61180 -66442 -11452 11838 20501 25004 49197
15966D9197l075n7432q5549j2621k3772M8889M5839n329l8185K315R320R631M089
$$ 49197 46122 -11310 -96859 -109480 -133252 -84363 -38524 -43853 -82038 -79723 -70403 -60772 -56683
15953e6683L8242n661J4091J9819k2733O979J146J272r349J1002l7460j3693O771
$$ -56683 -18441 -24102 -10011 9808 -12925 -5946 -4800 -3528 -12877 -1875 -39335 -53028 -46257
15940d6257K3503J0770J4700o728P040N283K4275k5838p521N1079k399J0149l8743
$$ -46257 -22754 -11984 2716 -4012 3028 8311 32586 6748 -773 50306 47907 58056 19313
15927A9313o9778Q23J8354q670O5733K3312j4274J4162l4024j9189j6213K015
$$ 19313 -50465 -49642 -31288 -39958 25775 49087 34813 48975 14951 -4238 -20451 -18436
15915a8436M3423K9225j9310K921M9298l6356r0315L1879J677L0354j1221J1183
$$ -18436 24987 54212 34902 37823 87121 50765 -39550 -7671 -5994 24360 13139 24322
15903B4322J2164O9155M7075j9821n7560n5696Q934N6571P0987l043j1121J1071
$$ 24322 36486 105641 152716 132895 75335 19639 28573 85144 156131 153088 141967 153038
15891A53038j9003n4574O913j3874j1136K5968j8924l5230P2879j3920q7282k2932
$$ 153038 134035 79461 86374 72500 61364 87332 68408 33178 106057 92137 4855 -18077
15879a8077l7116L6009L9094q943J352m4475J3687J499K1588l2272m4787l2668
$$ -18077 -55193 -19184 19910 10967 12319 -32156 -18469 -16970 4618 -27654 -72441 -105109
15867a05109L0147k1211m5712K1600P3213N7075M0676j3311k1089q062j6854N0594
$$ -105109 -74962 -96173 -141885 -120285 -47072 10003 50679 37368 16279 8217 -8637 41957
15855D1957r280N1950O494j0402n3033l2138o685M2342j2905o2216j1026M5556
$$ 41957 32677 84627 91121 80719 27686 -4452 -11137 31205 18300 -43916 -54942 -9386
15843i386l0632M3654M2144n898p0127k9111j4581m4945L3669N0025p3623j0723
$$ -9386 -40018 3636 45780 39882 -30245 -59356 -73937 -118882 -85213 -35188 -108811 -119534
15831a19534M5346P489J9603L6653L0895k7082o6069K9215M7903J583m901M860
$$ -119534 -74188 -66699 -47096 -10443 20452 -6630 -72699 -43484 4419 6002 1101 5961
15819E961j9561l7762k4734l3744J7582j129q475P7904N2331j7662J0599L9338
$$ 5961 -13600 -51362 -76096 -109840 -92258 -93387 -101862 -23958 28373 10711 21310 60648
15807F0648J0646K0117l4042q0555m7341k0090m673K6848N0928j5001j8621j636
$$ 60648 71294 91411 57369 -23186 -70527 -90617 -95290 -68442 -17514 -32515 -51136 -52772
15795e2772k4360J2369L3236l79j5822q046o763k7023j5137J0563K3666L0554
$$ -52772 -77132 -64763 -31527 -31906 -47728 -55774 -62537 -89560 -104697 -94134 -70468 -39914
15783c9914m2501O0533L2068k3768k0115J1875P052j7718j2766K7114L5868o5312
$$ -39914 -82415 -21882 10186 -13582 -33697 -21822 -14770 -32488 -45254 -18140 17728 -47584
15771d7584J4555J4844K6280j0399K8241L8110n46j5684j0608j8836q371j2646
$$ -47584 -33029 -18185 8095 -2304 25937 64047 63501 47817 37209 18373 10002 -2644
15759b644J1581j9812l9060m1076K8477M2129K2276J0823K2193p086l4352k880
$$ -2644 8937 -10875 -49935 -91011 -62534 -20405 1871 12694 34887 27801 -6551 -9431
15747i431M53j850L3173m9327k2643L8780J2389M2182n1452K1817K1905q358q2089
$$ -9431 -8978 -10828 22345 -26982 -49625 -10845 1544 43726 -7726 14091 35996 27638 -54451
15734e4451p034O6732K3986m7938M6367j8628L0336J2810k4514j162j694p6858
$$ -54451 -61485 5247 29233 -18705 27662 9034 39370 52180 27666 26504 24810 -52048
15722e2048o3330P00J3172O8122J7049k993L6278k6680K3105K5391k8764j9739
$$ -52048 -115378 -114678 -101506 -33384 -16335 -19328 16950 -9730 13375 38766 10002 -9737
15710i737J2334L418L2552N9262o5723l4614N4264m4690m9770K5875O914k9539
$$ -9737 2597 6015 38567 97829 32106 -2508 51756 7066 -42704 -16829 -9915 -39454
15698c9454q210P508K6046P4270L2140k0194n2180k0211k3148M62O0316j1166
$$ -39454 -47664 -40156 -14110 60160 92300 72106 19926 -285 -23433 -22971 37345 26179
15686B6179j978q920p441J63J1072J85j8418j9007J9301M5689k8399r3850k2831
$$ 26179 24201 15281 7840 8003 19075 19260 842 -18165 1136 46825 18426 -75424 -98255
15673i8255P0410P8009n1121k3001M271L1370k4301m6729M5170N5392l0692m9451
$$ -98255 -27845 50164 -957 -23958 -19687 11683 -12618 -59347 -14177 41215 10523 -38928
15661c8928J2302N2228q032m4483K3858O8428M5454m4880M6345k0400o2991l1392
$$ -38928 -26626 25602 17570 -26913 -3055 65373 110827 65947 112292 91892 28901 -2491
15649b491k2558N3086K7689p840o1114o823n104K8895j1808K8624k5683k0696
$$ -2491 -25049 28037 55726 47886 -13228 -20051 -25155 3740 -8068 20556 -5127 -25823
15637b5823J5678M1309p079o08J147J2827O941j3720o1171j4883K8458m6372l8973
$$ -25823 -10145 31164 24085 23477 24624 37451 44392 30672 -30499 -45382 -16924 -63296 -102269
15624a02269M953L2828P731O3205K3461n4014L8000L4730m9122n309J4760j3966
$$ -102269 -97316 -64488 -56757 6448 29909 -24105 13895 48625 -497 -5806 8954 -5012
15612e012J0757M3952K162K5335J2579o0207r671N748N1731p527p0262P753m783
$$ -5012 5745 49697 51859 77194 89773 29566 19895 25643 77374 69847 -415 7338 2555
15599B555n4398k2032P006Q513M7582L8609l8181k0916m4413j3551L9713L7970
$$ 2555 -51843 -73875 -66869 -58356 -10774 27835 -10346 -31262 -75675 -89226 -49513 -11543
15587a1543K0412N877L6570K4502k8704n1060K3852J06922L2060m7024o9552k3365
$$ -11543 8869 14746 51316 75818 47114 -3946 19906 126828 158888 111864 42312 18947
15575A8947N695K9569M7478o0431o4962O038r568L3148K186J3201j3153m8647
$$ 18947 24642 54211 101689 41258 -23704 -17666 -27234 5914 8100 21301 8148 -40499
15563d0499L4978K4774J6693j6566j8990P4923J8129k6309l2635p6754o3649N1400
$$ -40499 -5521 19253 35946 19380 390 75313 93442 67133 34498 -42256 -105905 -54505
15551e4505Q1422L0002r925o7934K1183N2232O3681l3112n0644l7858j873M6556
$$ -54505 26917 56919 46994 -20940 243 52475 116156 83044 32400 -5458 -7331 39225
15539C9225L2064O1921M8100k3581m6891l9883M3177j5511k839j8665L6394L1282
$$ 39225 71289 133210 181310 157729 110838 70955 114132 98621 95782 77117 113511 144793
15527A44793J2815n0699j3216K949m2853l1119l1552M407N1982j0556o1338J844
$$ 144793 157608 106909 93693 96642 53789 22670 -8882 -4475 47507 36951 -24387 -22543
15515b2543J3690m7475k6449J4201K2750L5336K6070M2786L3756o0343l7813K5998
$$ -22543 -8853 -56328 -82777 -68576 -45826 -10490 15580 58366 92122 31779 -6034 19964
15503A9964k6698k7920P1735Q2934n0131m9125l8153k359M1187m404m9480Q906
$$ 19964 -6734 -34654 37081 120015 69884 20759 -17394 -19753 21434 17030 -32450 -23544
15491b3544j5563L2431L2474n3429j7678k14m3391m3743K2222L7275l268n656
$$ -23544 -39107 -6676 25798 -27631 -45309 -45523 -88914 -132657 -110435 -73160 -76428 -82084
15479h2084L9445K5704K7613K5327J4526j5406j5069N7384O110o1037j9411K9098
$$ -82084 -42639 -16935 10678 36005 50531 35125 20056 77440 83550 22513 3102 32200
15467C2200r118k8809L9216l211j7884q336o649L1080K4701J9537k6344q8278
$$ 32200 23082 -5727 33489 30278 12394 4058 -2591 28489 53190 72727 46383 -41895
15455d1895m1198L1703j0188j3703j0398k5547N5572M4881l3841O3074M4456j4522
$$ -41895 -83093 -51390 -61578 -75281 -85679 -111226 -55654 -10773 -44614 18460 62916 48394
15443D8394l4444K4866R933j2999m6105j5097L0264J574l8607K2239k8678J1076
$$ 48394 13950 38816 48749 35750 -10355 -25452 4812 6386 -32221 -9982 -38660 -27584
15431b7584p039K096K986l8692K8260Q1699J4417k2134L239N2404J8234p56p6732
$$ -27584 -34623 -32527 -29541 -68233 -39973 41726 56143 34009 37248 89652 107886 107130 30398
15418C0398o3619m656N6002M7796J0743J5699k364j8735k2228J2816J5424m1064
$$ 30398 -33221 -37877 18125 65921 76664 92363 89999 71264 49036 61852 77276 36212
15406C6212j3159k8556o3801N351M9668K5765o0044q0002k4489K3661M5262O5634
$$ 36212 23053 -5503 -69304 -63953 -14285 11480 -48564 -128566 -153055 -129394 -84132 -18498
15394a8498O2804k6351J6420L7625p812l2760j1171q6061l4110N5575M934P508
$$ -18498 44306 17955 34375 72000 64188 31428 20257 -65804 -99914 -44339 -39405 -31897
15382c1897L0608J5863J0555J3467k6415n3070l1803J3346N3097K0039m2757J4528
$$ -31897 -1289 14574 25129 38596 12181 -40889 -72692 -59346 -6249 13790 -28967 -14439
15370a4439J1658L2956j1785j8241N016j2059k6936m819n6731j0066M4754M6697
$$ -14439 -2781 30175 18390 149 5165 -6894 -33830 -38649 -95380 -105446 -60692 -13995
15358a3995L7706J9447j661K137k3242K696o717q8096l10L1346ML3212J2278N7503
$$ -13995 23711 43158 41497 43634 20392 23088 16371 -71725 -72035 -40689 -40685 -7473 4805 62308
15344F2308j4002j05670p3605Q2658M7005J0623j0146P051K8270O7854q602o0029
$$ 62308 48306 -57364 -130969 -48311 -1306 9317 -829 6222 34492 102346 93744 33715
15332C3715M994L8182o1242J9239R8080J2831n1227m9149j0047n5290n8779L9711
$$ 33715 38709 76891 15649 34888 132968 145799 94572 45423 35376 -19914 -78693 -38982
15320c8982K8409m5974J5223M1349J9001k0095J8597L3776p2516m5799N0974l183
$$ -38982 -10573 -56547 -41324 25 19026 -1069 17528 51304 -21212 -67011 -16037 -19220
15308a9220l8563m538j3924J4790P3943L6240p883k2570r3065O51n454k4151N343
$$ -19220 -57783 -62321 -76245 -61455 12488 48728 40845 18275 -74790 -74139 -79593 -103744 -98401
15295i8401M7872M1839j4312l4340l3180L9958l0125N7688J471j4352n09k6436
$$ -98401 -50529 -8690 -23002 -57342 -90522 -50564 -80689 -23001 -21530 -35882 -36391 -62827
15283f2827K6464J174j5184o240N407K2462J7757K7628l076M4453l5092k1210
$$ -62827 -36363 -35189 -50373 -56613 -51206 -28744 -10987 16641 13565 58018 22926 1716
15271A716q258K7495Q65L1448k0849n7255J2281o919j1250Q334K5294J9277M2382
$$ 1716 -6542 20953 21818 53266 32417 -24838 -12557 -19476 -30726 -22392 2902 22179 64561
15258F4561J401q577o1814n4678j3412L8741P5040J7991l7333j059Q809M6372
$$ 64561 65962 57385 -4429 -59107 -72519 -33778 41262 59253 21920 20861 29670 76042
15246G6042m8777r976j4417k9592J3772M124m6264l5861K6223L3009q063Q117
$$ 76042 27265 17289 2872 -26720 -12948 -8824 -55088 -90949 -64726 -31717 -39780 -31663
15234c1663M3419O3452m0393k0493J6755N0642L735l7987n4125K5301J1588m4098
$$ -31663 11756 75208 34815 14322 31077 81719 85454 47467 -6658 18643 30231 -13867
15222a3867m6806k1753R3917n842j2822J8863k2240l2391j1351P171N6012k9907
$$ -13867 -60673 -82426 11491 5649 -7173 11690 -10550 -42941 -54292 -47121 8891 -21016
15210b1016m6525l3744K8345K0099O177L4415Q1161L663l7430L9361k0666J3326
$$ -21016 -67541 -101285 -72940 -52841 -46664 -12249 68912 72575 35145 74506 53840 67166
15198F7166M5050l6763k5719m2264l1923l6447P289L3050n658k7587L5739J02684
$$ 67166 112216 75453 49734 7470 -24453 -60900 -53611 -20561 -26219 -53806 -18067 84617
15186H4617J5384N901o409n1137l7846k6063L4916l615L105K7661k0975m0098
$$ 84617 100001 105902 99493 48356 10510 -15553 19363 15748 18853 46514 25539 -14559
15174a4559m4j960m0993j6275M4525M8412O3307l4042j1331O553l3981n5349M2067
$$ -14559 -14603 -16563 -57556 -73831 -29306 19106 82413 48371 37040 43593 9612 -45737 -3670
15161c670Q4693j7211j2788J2952k3230m7051n7919K8615K6341N0520j7765j339
$$ -3670 81023 63812 51024 63976 40746 -6305 -64224 -35609 -9268 41252 23487 22148
15149B2148Q2648K5514o4277n3631J5569K5426n5463o0157K1887M8650M1610O260
$$ 22148 104796 130310 66033 12402 27971 53397 -2066 -62223 -40336 8314 49924 56184
15137E6184m0673p6614l098O4847P0932K7379K3602j0873p987l0541J3090K0853
$$ 56184 15511 -61103 -64201 646 71578 98957 122559 111686 103699 73158 86248 107101
15125A07101n7378m940M1156k4404o3736o2047n0542M5483J1103L7242K8038K8279
$$ 107101 49723 44783 85939 61535 -2201 -64248 -114790 -69307 -58204 -20962 7076 35355
15113C5355p511n3568l038M9954L4570k6278J4061R406K3352m5722m589j1932
$$ 35355 27844 -25724 -28762 21192 55762 29484 43545 52951 76303 30581 25992 14060
15101A4060l2783K4975j109M9748K3216J1871l0025n1834l2322J98L0318k8694
$$ 14060 -18723 6252 5143 54891 78107 89978 59953 8119 -24203 -24005 6313 -22381
15089b2381n2949k5047L3871K106Q692J2631j2378m3308l3624q499K3641L0858
$$ -22381 -75330 -100377 -66506 -64400 -55708 -43077 -55455 -98763 -132387 -140886 -117245 -86387
15077h6387M7433L0065l1450J3980j0310m3178k0620l0385o702r047L469L5375
$$ -86387 -38954 -8889 -40339 -26359 -36669 -79847 -100467 -130852 -137554 -146601 -143132 -107757
15065a07757o222Q8135N5320m4931l7536r174K8353K2340R4950k9434J4302J8063
$$ -107757 -113979 -25844 29476 -15455 -52991 -62165 -33812 -11472 83478 54044 68346 86409
15053H6409j0562k7222k8700l3088l2164j5760p679n4550n308M94l003L6937N7240
$$ 86409 75847 48625 19925 -13163 -45327 -61087 -68766 -123316 -128624 -128130 -131133 -94196 -36956
15040c6956M4064j7032j9639K6956k091l1182p8165N7273M1348j3218P4104M1144
$$ -36956 7108 -9924 -29563 -2607 -4698 -35880 -114045 -56772 -15424 -28642 45462 86606
15028H6606m644p469o9512k9603R587K1101q091k0215N7226K4740k619j2374m9397
$$ 86606 81962 74493 4981 -24622 -15035 6066 -2025 -22240 34986 59726 57107 44733 -4664
15015d664j6003L9176J5591P704k3653j7494q665J5758L5223J4542n1533r9497
$$ -4664 -20667 18509 34100 41804 18151 657 -8008 7750 42973 57515 5982 -93515
15003i3515K032L929N6315L0859L8628o766k2242R584K7417k1772N954p0980m8293
$$ -93515 -91483 -87554 -31239 -380 38248 31482 9240 18824 46241 24469 30423 -40557 -88850
14990h8850J4120K4800J9768L5141o03j2611k0582J527M9511M1433K2265o829
$$ -88850 -74730 -49930 -30162 4979 4376 -8235 -28817 -27290 22221 63654 85919 79090
14978G9090o6440j8863j5803l0540l6739K211M4887K7468j1960l5769q003L5366
$$ 79090 12650 -6213 -22016 -52556 -89295 -87084 -42197 -14729 -26689 -62458 -70461 -35095
14966c5095R661J3881n638J2606l6284N4131l429l1546k7200J4793O5902q259
$$ -35095 -25434 -11553 -17191 -4585 -40869 13262 9833 -21713 -48913 -34120 31782 23523
14954B3523J1674K9404j8673k2562j0676o340J0724o902M0649L3556N5367K4229
$$ 23523 35197 64601 45928 23366 12690 6350 17074 10172 50821 84377 139744 163973
14942A63973n0586m2665l7806J7868M4413k1325p2546L4579L0480p7716n80J786
$$ 163973 113387 70722 32916 50784 95197 73872 1326 35905 66385 -11331 -11911 -10125
14930a0125l1472l8129K4707J3528L9197j7033j2982j5251L8554l9755K1612K8588
$$ -10125 -41597 -79726 -55019 -41491 -2294 -19327 -32309 -47560 -9006 -48761 -27149 1439
14918A439L775K0424k489k562N553k6883K4260j1995q753J4206k9270K634K6904
$$ 1439 5214 25638 23149 20587 26140 -743 23517 11522 2769 16975 -12295 -9661 17243
14905A7243P3173k4110n0876l0572M8080J7230m9717J8344K2123o124K3932j2693
$$ 17243 90416 66306 15430 -15142 32938 50168 451 18795 40918 34794 58726 46033
14893D6033q0557j1820L0808l8790q205o504n3621J7194L2087M8325N3207K1530
$$ 46033 -34524 -46344 -15536 -54326 -62531 -69035 -122656 -105462 -73375 -25050 28157 49687
14881D9687K7973L8734j9352r690r189m5847P728K1074N550J2205j4652J3703
$$ 49687 77660 116394 97042 87352 78163 32316 40044 61118 66668 78873 64221 77924
14869G7924k6767j785m422n7501q4264L7107Q2423L3833K1195n4559k7229J337
$$ 77924 51157 49372 44950 -12551 -96815 -59708 22715 56548 77743 23184 -4045 -2708
14857b708N242j208L168Q007n0391l4657n6027K5337K580O277K4766n911L5717
$$ -2708 2534 1326 4494 12501 -37890 -72547 -128574 -103237 -100657 -94380 -69614 -75525 -39808
14844c9808K3377L8756l8579k967J9260m7655J7726K4734P5310j9845n9809m2690
$$ -39808 -16431 22325 -16254 -19221 39 -47616 -29890 -5156 70154 50309 -9500 -52190
14832e2190R791J7240k6385M0o837N1786j6315j1650K8943K5216J2257k1647Q033
$$ -52190 -42399 -25159 -51544 -51504 -58341 -6555 -22870 -34520 -5577 19639 31896 10249 18282
14819A8282N0164o429r463l9305M252N114L905J5272J6706M3424k4994l6904J3005
$$ 18282 68446 62017 52554 13249 17501 22615 26520 41792 58498 101922 76928 40024 53029
14806E3029M1056j3191m5549J2516j697R237M9999l947r0941m2701N0329L2360
$$ 53029 94085 80894 35345 47861 46164 55401 105400 101453 10512 -32189 18140 50500
14794E0500l176l7278K9062p270k7101O510k9695m1047M5469K3812k5672j7952
$$ 50500 47324 10046 39108 31838 4737 11247 -18448 -59495 -14026 9786 -15886 -33838
14782c3838J613P206R5310l975k5525m2607n960j0317J7959N0184J5001m3674
$$ -33838 -32225 -25019 70291 66316 40791 -1816 -7776 -18093 -134 50050 65051 21377
14770B1377m5082j0037L9829l4421l9306N6687K0820o032l2054n282O5247M0163
$$ 21377 -23705 -33742 6087 -28334 -67640 -10953 9867 3835 -28219 -33501 31746 71909
14758G1909J0857K81l7352n3155o830P9281L9003n3263l7534k805k2769l0349
$$ 71909 82766 83047 45695 -7460 -14290 64991 103994 50731 13197 10392 -12377 -42726
14746d2726M2391k6980n2945P438M1078L0322k6917j8821J6080K6893m087m3406
$$ -42726 -335 -27315 -80260 -72822 -31744 -1422 -28339 -47160 -31080 -4187 -8274 -51680
14734e1680k5625p455R7357M6041J4794L1450J116m7953m1247k0202J7613L0066
$$ -51680 -77305 -84760 12597 58638 73432 104882 105998 58045 16798 -3404 14209 44275
14722D4275J8037J1695p111k631J0189j5543l4092p721L2379j3787p2669p0503
$$ 44275 62312 74007 66896 64265 74454 58911 24819 17098 49477 35690 -36979 -107482
14710a07482m649N9123J6475n9197K3956m3210L5087L6920P047k3819l053j7386
$$ -107482 -112131 -53008 -36533 -95730 -71774 -114984 -79897 -42977 -35930 -59749 -62802 -80188
14698h0188M6439M5706K3042P622j8660n2294M183j4105K3983k454P295k3796
$$ -80188 -33749 11957 34999 42621 23961 -28333 -24150 -38255 -14272 -16726 -9431 -33227
14686c3227l9405L8856R6479k1663m9012k8559L4262M7405j578m8176K2594m129
$$ -33227 -72632 -33776 62703 41040 -7972 -36531 -2269 45136 43558 -4618 17976 13847
14674A3847j6513M3769L5580j9695m498k6286M2191j720j2501k639p2521r981
$$ 13847 -2666 41103 76683 56988 52490 26204 68395 66675 54174 51535 -20986 -30967
14662c0967J2249j2461M3037p465K7278P9373m2147L594P652m7128k0340r755
$$ -30967 -18718 -31179 11858 4393 31671 111044 68897 72491 80143 33015 12675 2920
14650B920j1653N587J0312l1724m148J4103K5094k836n2804N600L2851P488R48
$$ 2920 -8733 -3146 7166 -24558 -28706 -14603 10491 7655 -45149 -39549 -6698 790 1738
14637A738m5494n1507n629J1537j3043l570L6708N0693M1512k7735l6083J4364
$$ 1738 -43756 -95263 -100892 -89355 -102398 -105968 -69260 -18567 22945 -4790 -40873 -26509
14625b6509R330M2116j8088j7839k5779M5830K740j464j2992M4145J0611R61p0374
$$ -26509 -17179 24937 6849 -10990 -36769 9061 11801 10337 -2655 41490 52101 53062 -17312
14612a7312m2007j3803N4745M2728r656k7581r504P0570L0524j2146m0581J6798
$$ -17312 -59319 -73122 -18377 24351 14695 -12886 -22390 48180 78704 66558 25977 42775
14600D2775j447j4326q4954k6099O5979O3567o6469m7941K5698J5563l5554M7380
$$ 42775 41328 27002 -57952 -84051 -18072 45495 -20974 -68915 -43217 -27654 -63208 -15828
14588a5828M4262p556J134o5154o191Q9105L9715l8191J0974K5365k0650j9467
$$ -15828 28434 20878 22012 -43142 -49333 39772 79487 41296 52270 77635 56985 37518
14576C7518J3977L4410O516j9793j3059q4321m7929L4001O0577K3978q068l1983
$$ 37518 51495 85905 92421 72628 59569 -24752 -72681 -38680 21897 45875 37807 5824
14564E824M9262l5748o1939L238N861P283J073o295P02N5740O0619n4127J7060
$$ 5824 55086 19338 -42601 -39363 -33502 -26219 -25146 -31441 -30739 25001 85620 31493 48553
14551D8553M9315L3697l1722m8724m2035R134K7571k8358j9910r991j0700J5633
$$ 48553 97868 131565 99843 51119 9084 18218 45789 17431 -2479 -12470 -23170 -7537
14539g537K2629Q459J3935K3649j2696k4700j5914K2293K449m6973m813K6742
$$ -7537 15092 23551 37486 61135 48439 23739 7825 30118 32567 -14406 -19219 7523
14527G523L9502K2053m9851l2993J2421M4618K3326j6373l2918j3231j6587n2730
$$ 7523 47025 69078 19227 -13766 -1345 43273 66599 50226 17308 4077 -12510 -65240
14515f5240K6462M3384k2362q293j9155M172k1035O2667O6291o806l3172p911
$$ -65240 -38778 4606 -17756 -26049 -45204 -41032 -62067 600 66891 60085 26913 19002
14503A9002l7171j0254K009P2077K6651p577q3743O450J289P465n6371l5581L5238
$$ 19002 -18169 -28423 -26414 45663 72314 64737 -19006 -12556 -11267 -3802 -60173 -95754 -60516
14490f0516l1905M8772L3844l2976K659j8272j5077K8527J3603L8396m6246l4578
$$ -60516 -92421 -43649 -9805 -42781 -40122 -58394 -73471 -44944 -31341 7055 -39191 -73769
14478g3769k6541K9870P5160L1552J6045l3325R250k1295J2973O6663m0498l2998
$$ -73769 -100310 -70440 4720 36272 52317 18992 28242 6947 19920 86583 46085 13087
14466A3087n4580l125N443R259M5487o5409n0002m3710K0997Q1747P4548m111
$$ 13087 -41493 -44618 -39175 -29916 15571 -49838 -99840 -143550 -122553 -40806 33742 29631
14454B9631k7624k3325J2967m9808r002K8833M8336j77k4049M2502j2076L1925
$$ 29631 2007 -21318 -8351 -58159 -67161 -38328 10008 9831 -14218 28284 16208 48133
14442D8133J1985l5247k198K738o066L4858m7339J3404O277l5133j8341j909Q663
$$ 48133 60118 24871 22673 25411 19345 54203 6864 20268 26545 -8588 -26929 -28838 -20175
14429b0175k8402K7445K0726j6929n1613K855Q4786N6532L9205K7791k1890r2880
$$ -20175 -48577 -21132 -406 -17335 -68948 -66093 18693 75225 114430 142221 120331 27451
14417B7451o8733M2720N4167J1035l4426l8046Q66M9302l9468p2052k2322N4113
$$ 27451 -41282 1438 55605 66640 32214 -5832 -4966 44336 4868 -67184 -89506 -35393
14405c5393k2625J1737L9219Q0716k0490n546J6999m2847l4781L1584K5059m6709
$$ -35393 -58018 -46281 -7062 73654 53164 47618 64617 21770 -13011 18573 43632 -3077
14393c077N6041J0028m3071K9747L340l9323N145K9538j1366j55O590J7465L8661
$$ -3077 52964 62992 19921 49668 53008 13685 18830 48368 37002 36847 43437 60902 99563
14380I9563k1755l0277l1626p525K0444L166M2685L7953k9345j9097m2237k8736
$$ 99563 77808 47531 15905 8380 28824 31990 74675 112628 83283 64186 21949 -6787
14368f787O8881J2819n1199K2980o136q0895l9814K5651J8949k2099q055j677
$$ -6787 62094 74913 23714 46694 40558 -40337 -80151 -54500 -35551 -57650 -65705 -67382
14356f7382q250K1518P0961N8374K1797o1376j4055K8053n5150n2008M664K1154
$$ -67382 -75632 -54114 16847 75221 97018 35642 21587 49640 -5510 -57518 -52854 -31700
14344c1700L9818j5694m463Q188J0115j2172m1509m2651J2154O6548J0966J2625
$$ -31700 8118 -7576 -12039 -3851 6264 -5908 -47417 -90068 -77914 -11366 -400 12225
14332A2225j1623j0659j6238k0071j4509K8387L3773q950l7359j8170j0282J2613
$$ 12225 602 -10057 -26295 -46366 -60875 -32488 1285 -7665 -45024 -63194 -73476 -60863
14320f0863J7124n3678K0243Q578M5538N4313k1485k5930n286j2140K8355M2654
$$ -60863 -43739 -97417 -77174 -68596 -23058 31255 9770 -16160 -21446 -33586 -5231 37423
14308C7423k4157J732l4054l1326P0491L1690j8237j9558m177n2969j1026j3617
$$ 37423 13266 14998 -19056 -50382 20109 51799 33562 14004 9827 -43142 -54168 -67785
14296f7785Q911p449M0430K0586j6880o417l1470k1320J845j3641J9270M880K6746
$$ -67785 -58874 -66323 -25893 -5307 -22187 -28604 -60074 -81394 -79549 -93190 -73920 -69040 -42294
14283d2294J5696M1453M3341K723N541K3341M58k5307l1029o9855m3659k2857
$$ -42294 -26598 14855 58196 60919 66460 89801 90259 64952 33923 -35932 -79591 -102448
14271a02448j8030K9526O0005Q052o769l4842j0301O2904k0678L5539Q0754K5215
$$ -102448 -120478 -90952 -30947 -22895 -29664 -64506 -74807 -11903 -32581 2958 83712 108927
14259A08927j6227k0105m645n577J2670j8812n9679P698M753L9857n054j0519
$$ 108927 92700 72595 67950 62373 75043 56231 -3448 4250 9003 48860 43806 33287
14247C3287j4039n6871L340K2792L0532K6791l0834M9790j568m7891k2821m366
$$ 33287 19248 -37623 -34283 -11491 19041 45832 14998 64788 63220 15329 -7492 -11858
14235a1858K8493p792j8100l5120P7767j0403m4762j0893L2544K7346k3940J3791
$$ -11858 16635 8843 -9257 -44377 33390 22987 -21775 -32668 -124 27222 3282 17073
14223A7073j6235k5909N0677l7172k248K3620J138J5622j363l4088j4066J1489
$$ 17073 838 -25071 25606 -11566 -13814 9806 10944 26566 25203 -8885 -22951 -11462
14211a1462L8780k9254m9498L2518M4970K6504N510q117o9964k9782J4524k48
$$ -11462 27318 -1936 -51434 -18916 26054 52558 58068 49951 -20013 -49795 -35271 -35519
14199c5519M1481l463k8540l5312J5183o295k0531K9448K4473k3971J7643j1748
$$ -35519 5962 2499 -26041 -61353 -46170 -52465 -72996 -43548 -19075 -43046 -25403 -37151
14187c7151k9525q866K7593O8406j0504k8718J7654K2550L8713J6179j0371J454
$$ -37151 -66676 -75542 -47949 20457 9953 -18765 -1111 21439 60152 76331 65960 67414
14175F7414P816R779k2226o829q940j2518j1862o0669J4879K9216M2902n296n7372
$$ 67414 75230 85009 62783 55954 47014 34496 22634 -38035 -23156 6060 48962 43666 -13706
14162a3706r1111L5369N8809N3128j3325p057L8039L5691j4143M255k3597k4569
$$ -13706 -104817 -69448 -10639 42489 29164 22107 60146 95837 81694 85949 62352 37783
14150C7783J6716j6622l8100p8883j3203M0215J4107M5208J5270q275J8008m727
$$ 37783 54499 37877 -223 -79106 -92309 -52094 -37987 7221 22491 14216 32224 27497
14138B7497q313K0814r445n0867k0916j996J36000J2593j06797m8340L4827M0214
$$ 27497 19184 39998 30553 -20314 -41230 -43226 92774 105367 -1430 -49770 -14943 25271
14126B5271j1335J8696m6385n8752P4753L0224J7725j4432m018k3543o73k52M2361
$$ 25271 13936 32632 -13753 -72505 2248 32472 50197 35765 31747 8204 7531 7279 49640
14113D9640J1190o233j639k5233m4023l992K4916q3117j5898N6060N8121j5214
$$ 49640 60830 54597 52958 27725 -16298 -20290 4626 -78491 -94389 -38329 19792 4578
14101D578L4987J0195j9532M835o781N7197J3363n7098m0345p1551n0281L3316
$$ 4578 39565 49760 30228 35063 28282 85479 98842 41744 1399 -70152 -120433 -87117
14089h7117J6195j385q298k642Q8k5503m804M0345P7149p528K6308k364k7172
$$ -87117 -70922 -72307 -80605 -83247 -83159 -108662 -113466 -73121 4028 -3500 22808 20444 -6728
14076f728k5238K5853l5507l839N8239P180J3240N7324J5125m4677l7068l2694
$$ -6728 -31966 -6113 -41620 -45459 12780 19960 33200 90524 105649 60972 23904 -8790
14064h790p058k9343j4795L1029K7843L7910L1729k4194o5191k0884M4888k5622
$$ -8790 -15848 -45191 -59986 -28957 -1114 36796 68525 44331 -20860 -41744 3144 -22478
14052b2478R435n3458l9881L0379M1955J0541K4835M0268O5598l3083o6943p016
$$ -22478 -13043 -66501 -106382 -76003 -34048 -23507 1328 41596 107194 74111 7168 152
14040A52j8443L7068J08186p929p5519J1496j4247M5818j7069k8329K5981l084
$$ 152 -18291 18777 126963 119034 43515 55011 40764 86582 69513 41184 67165 64081
14028F4081K5659J5939k7455k2155L3006l9799m3774p430K3771j8937j0281l687
$$ 64081 89740 105679 78224 56069 89075 49276 5502 -1928 21843 2906 -7375 -11062
14016a1062n238j5210j7227J7175L8325O9303K8574k0989k2487m1281j642K680
$$ -11062 -16300 -31510 -48737 -31562 6763 76066 104640 83651 61164 19883 18241 20921
14004B0921J0117j09625j4960P9880N0569l2167m7391N0203N5959m922l4389q9157
$$ 20921 31038 -78587 -93547 -13667 36902 4735 -42656 7547 63506 58584 24195 -64962
13992f4962m3958P4788L8040l3602j733M3577N4766P308n5070k7311L5858j8111
$$ -64962 -108920 -34132 3908 -29694 -31427 12150 66916 74224 19154 -8157 27701 9590
13980I590n9569k6138P943K6593r251L0486K1417Q960l5514J3772k7205L8731
$$ 9590 -49979 -76117 -68174 -41581 -50832 -20346 1071 10031 -25483 -11711 -38916 -185
13968a85L0440J3501J1025J9098Q467p3104r067P2861K3648o3260j2702J9143
$$ -185 30255 43756 54781 73879 82346 9242 175 73036 96684 33424 20722 39865
13956C9865P372P736k4410O9962o601n6223K6347M4510m9311N339L2833J4346
$$ 39865 47237 54973 30563 100525 93924 37701 64048 108558 59247 64586 97419 111765
13944A11765L8272J2801o9164k6437p731l7740l3708n165J9498k1615k2623J6508
$$ 111765 150037 162838 93674 67237 59506 21766 -11942 -17107 2391 -19224 -41847 -25339
13932b5339j7552M6560K3647n6816l5884K4372J5649j2145L2102J7292l5575l4597
$$ -25339 -42891 3669 27316 -29500 -65384 -41012 -25363 -37508 -5406 11886 -23689 -58286
13920e8286K571J3641N5290N346j8061L6241J5160k463P6547P445o9817l796l7113
$$ -58286 -55715 -42074 13216 18562 501 36742 51902 49439 125986 133431 63614 59818 22705
13907B2705o8368j4483p207M4987K759j1176j7943K3173R160n0898j1160J9480
$$ 22705 -45663 -60146 -67353 -22366 -19607 -30783 -48726 -25553 -16393 -67291 -78451 -58971
13895e8971J0283p114j5226M9429K4943l5343O4618K3987l2206j3807p245L307
$$ -58971 -48688 -55802 -71028 -21599 3344 -31999 32619 56606 24400 10593 3348 6655
13883F655p808l5027K1543k2091k138J2860N6702j4322l1849O3186L6775p5660
$$ 6655 -1153 -36180 -14637 -36728 -38866 -26006 30696 16374 -15475 47711 84486 8826
13871H826n4403j4095k3773J0865M2345J6011m368r495j7967m1406P625j1001
$$ 8826 -45577 -59672 -83445 -72580 -30235 -14224 -18592 -28087 -46054 -87460 -79835 -90836
13859i0836q775P0547L2714k3561j488j8671m631k5608k6493k6811J2113Q2138
$$ -90836 -99611 -29064 3650 -19911 -21399 -40070 -44701 -70309 -96802 -123613 -111500 -29362
13847b9362K1397p888N259J1578J8177j6410M0072R932K3209j0609j8921j1292
$$ -29362 -7965 -15853 -10594 984 19161 2751 42823 52755 75964 65355 46434 35142
13835C5142l1269n7404J9302O3747K4891j9371l7014J3313L510m042k0730j0031
$$ 35142 3873 -53531 -34229 29518 54409 35038 -1976 11337 14847 10805 -9925 -19956
13823a9956J2636k9322J2209K9783P7560o432m6629j2498M288J7720M2816M8147
$$ -19956 -7320 -36642 -24433 5350 82910 76478 29849 17351 21639 39359 82175 130322
13811A30322j877K1190n0997j25290p4995l0498j7170K8595K4025N0221K9882
$$ 130322 128445 149635 98638 -26652 -101647 -132145 -149315 -120720 -96695 -46474 -16592
13800a6592k3997L7079P5969O48o4044m4215L4242M703N5331J1846j4456j3800
$$ -16592 -40589 -3510 72459 73107 9063 -35152 -910 3793 59124 70970 56514 42714
13788D2714R381J3813j1590l4378k5536l9488p96K4911K4579J2400l0555J3622
$$ 42714 52095 65908 54318 19940 -5596 -45084 -45880 -20969 3610 16010 -14545 -923
13776i23K5118J5472m2252q2993r429L7211L0218K0873J3433l2345L8693J871
$$ -923 24195 39667 -2585 -85578 -95007 -57796 -27578 -6705 6728 -25617 13076 14947
13764A4947q1613l7494P113P5605J6830l7287j2014M758j5966N2531J8184k6177
$$ 14947 -66666 -104160 -97047 -21442 -4612 -41899 -53913 -49155 -65121 -12590 5594 -20583
13752b0583L076R020O672j126k0771M4403O7813j224l5248m0716n4667o679j1766
$$ -20583 -17507 -8487 -1815 -2941 -23712 20691 88504 87280 52032 11316 -43351 -50030 -61796
13739f1796L8640J499l3603M925M8210M9532j3388q26l9726m7974k4842k413N8209
$$ -61796 -23156 -21657 -55260 -50335 -2125 47407 34019 33193 -6533 -54507 -79349 -81762 -23553
13726b3553J6270n2523q954J7939n161k36N7608j0282M9669J5145l2751o400l7741
$$ -23553 -7283 -59806 -68760 -50821 -55982 -56218 1390 -8892 40777 55922 23171 16771 -20970
13713b0970q284O1472K4050m7494m9280o4872J6057K5111J3933N8973k02o9539
$$ -20970 -29254 32218 56268 8774 -40506 -105378 -89321 -64210 -50277 8696 8494 -61045
13701f1045K901N0899k7005K7611N4411j388J7944l2637K994K3042l0564k4230
$$ -61045 -58144 -7245 -34250 -6639 47772 46384 64328 31691 34685 57727 27163 2933
13689B933n1509k6026M5934P2301J3414l5267n7951n3541n897L9985N9796O524
$$ 2933 -48576 -74602 -28668 43633 57047 21780 -36171 -89712 -95609 -55624 4172 10696
13677A0696M5942k2927l4036j8232K7505P766J8451j4872n5999l4311K0590p813
$$ 10696 56638 33711 -325 -18557 8948 16714 35165 20293 -35706 -70017 -49427 -57240
13665e7240R5746R637q8756k2741m6418l1672O770L6030O3482J8321m9587N411
$$ -57240 38506 48143 -40613 -63354 -109772 -141444 -134674 -98644 -35162 -16841 -66428 -61017
13653f1017M2487Q2592K6075L4523n1318J0201J2315l1274m3170j9914J4358r339
$$ -61017 -18530 64062 90137 124660 73342 83543 95858 64584 21414 1500 15858 6519
13641F519M913L3157k3147J6347l010n0283N0270L8697n5218r6186R126k6121
$$ 6519 11432 44589 21442 37789 34779 -15504 34766 73463 18245 -77941 -68815 -94936
13629i4936K3194K5710J8677K905l1613K7002K7650K172M0878m3385o1007N1926
$$ -94936 -71742 -46032 -27355 -24450 -56063 -29061 -1411 761 41639 -1746 -62753 -10827
13617a0827j0326m397K1615J6485L9040L0343J2024n9797o4588L4700M4968Q522
$$ -10827 -21153 -25550 -3935 12550 51590 81933 93957 34160 -30428 4272 49240 57762
13605E7762p411m4806N2239J1436M113k8812k9352m2032m563N1702O936l6805
$$ 57762 50351 5545 57784 69220 73333 44521 15169 -26863 -31426 20276 27212 -9593
13593i593J9468L0187M5041J1973K5607j05452n7320J284k967J0359K7329J7895
$$ -9593 9875 40062 85103 97076 122683 17231 -40089 -38805 -41772 -31413 -4084 13811
13581A3811M9883n95k5469J8850J1431j2896N2176j4501m9986k3457j9212m3935
$$ 13811 63694 63099 37630 56480 67911 55015 107191 92690 42704 19247 35 -43900
13569d3900o0059J0462L9651k447N1758J2651l754k3325k9868m7365M6603N4045
$$ -43900 -103959 -93497 -53846 -56293 -4535 8116 4362 -18963 -48831 -96196 -49593 4452
13557D452k8502k4144L9328J0685m8472j6626N2256P7079j2070o030l5847k6935
$$ 4452 -24050 -48194 -8866 1819 -46653 -63279 -11023 66056 53986 47956 12109 -14826
13545a4826k9377K4399K6837J7032J7249j3950J3896J3835n0981n4517l8794k0439
$$ -14826 -44203 -19804 7033 24065 41314 27364 41260 55095 4114 -50403 -89197 -109636
13533a09636J5031L547M7829K2434J1248J7854N7827M1512k563n5239j25070K0075
$$ -109636 -94605 -91058 -43229 -20795 -9547 8307 66134 107646 105083 49844 -75226 -55151
13521e5151L142N5056J6591K9088j5327j8550k6085o9424o0598J287J6468K8321
$$ -55151 -52009 3047 19638 48726 33399 14849 -11236 -80660 -141258 -139971 -123503 -95182
13509i5182J452M6064P902J1804Q572k7339L7988K8441m5605j9584O5901M7229
$$ -95182 -93730 -47666 -39764 -27960 -19388 -46727 -8739 19702 -25903 -45487 20414 67643
13497F7643k9424n6611m7488l4224O584R0074L1906L7870R930j2873r0356m6307
$$ 67643 38219 -18392 -65880 -100104 -93520 -3446 28460 66330 76260 63387 -26969 -73276
13485g3276J3803O9085M3676M4645M4346L163p1228p9358K6022P2479k8073m547
$$ -73276 -59473 9612 53288 97933 142279 145442 74214 -5144 20878 93357 65284 60737
13473F0737j3000o7093m6200M1578J23338n3988j01442J4596P3560N7649J0184
$$ 60737 47737 -19356 -65556 -23978 99360 45372 -56070 -41474 32086 89735 99919
13462I9919l2933l7651q4073k7592N0211P132K228O2601N1784j9660l5247k6414
$$ 99919 66986 29335 -54738 -82330 -32119 -24987 -22759 39842 91626 71966 36719 10305
13450A0305l198L2875n4771k5952K594L0805J7225L674j5912J7200R845q404L3091
$$ 10305 7107 39982 -14789 -40741 -38147 -7342 9883 13557 -2355 14845 24690 16286 49377
13437D9377M7769J4164p5074j12867m1993M5188O2240R899R293J5387J787o356
$$ 49377 97146 111310 36236 -76631 -118624 -73436 -11196 -1297 7996 23383 25170 18814
13425A8814J5798k5384p8958K1218L0109O2792K0602m9193j3466K2464l6862j4388
$$ 18814 34612 9228 -69730 -48512 -18403 44389 64991 15798 2332 24796 -12066 -26454
13413b6454J9590j5859L60M3554J5412n7501l0072J2537J4524k2652J0953O3175
$$ -26454 -6864 -22723 -22363 21191 36603 -20898 -50970 -38433 -23909 -46561 -35608 27567
13401B7567n3705n9862J1544L8848m825K4761M424J9620m8874k7440K2808O1433
$$ 27567 -26138 -86000 -74456 -35608 -40433 -15672 -11248 8372 -40502 -67942 -45134 16299
13389A6299o474k438m1353J3130n94p163P6314N3794l8726o7985K1931k3978k6768
$$ 16299 9825 7387 -33966 -20836 -21430 -28593 47721 101515 62789 -5196 16735 -7243 -34011
13376c4011K0354N0908j6557j4461O920j6616J396j8474k6530J6940p590l6487
$$ -34011 -13657 37251 20694 6233 13153 -3463 -2067 -20541 -47071 -30131 -37721 -74208
13364g4208N4046P2492j5968K0972L3013K1184k2557o1719m0905l1994J3331r750
$$ -74208 -20162 52330 36362 57334 90347 111531 88974 27255 -13650 -45644 -32313 -42063
13352d2063Q252M7942r076j5753J9860M122p768k6710J4716j6647m0014P5031
$$ -42063 -33811 14131 5055 -10698 9162 13284 5516 -21194 -6478 -23125 -63139 11892
13340A1892L3702K7999j3954q2041m8512R204j6728J2451K5288N1098o303K6747
$$ 11892 45594 73593 59639 -22402 -70914 -61710 -78438 -65987 -40699 10399 4096 30843
13328C0843M6917k0684p8554m6035L3785M5783q03k3358m6723J0247O2078L5464
$$ 30843 77760 57076 -21478 -67513 -33728 12055 11252 -12106 -58829 -48582 13496 48960
13316D8960o151p8386N421L8812L772j6921K1177K2376J8409P1935M0090k2118
$$ 48960 42809 -35577 -30156 8656 12428 -4493 16684 39060 57469 129404 169494 147376
13304A47376m7170j15152n0422k1164l5705L9865K2868L6313l0010j4780J2926
$$ 147376 100206 -14946 -65368 -86532 -122237 -82372 -59504 -23191 -53201 -67981 -55055
13293e5055L9113q446M6647o841j8068j9266M3328m597k4846n468l141k6808K1735
$$ -55055 -15942 -24388 22259 15418 -2650 -21916 21412 16815 -8031 -13499 -16640 -43448 -21713
13280b1713R227l0443N4494J5686N2799K9102m4631J4160m2209q0716L2497r887
$$ -21713 -12486 -42929 11565 27251 80050 109152 64521 78681 36472 -44244 -11747 -21634
13268b1634j0384L7675J8454M1493L1954l3663l6249o8642J6843L9434m2318J7753
$$ -21634 -32018 5657 24111 65604 97558 63895 27646 -40996 -24153 15281 -27037 -9284
13256i284j5888k9661L603j9306k837L8212L6913P308q877o0366k354M4427M1247
$$ -9284 -25172 -54833 -51230 -70536 -73373 -35161 1752 9060 183 -60183 -62537 -18110 23137
13243B3137k7519l1591j056M1954j0167k4151J1328n6016J5258O3192J9663J805
$$ 23137 -4382 -35973 -37029 4925 -5242 -29393 -18065 -74081 -58823 4369 24032 25837
13231B5837L170q7573N4717K6428K0279Q013j4265k8067j1756k4834m4450k8671
$$ 25837 29007 -58566 -3849 22579 42858 50871 36606 8539 -3217 -28051 -72501 -101172
13219a01172K0814K3990K0168O758O0676p566L995N0671o7496l9776l7166L9983
$$ -101172 -80358 -56368 -36200 -29442 31234 23668 27663 78334 10838 -28938 -66104 -26121
13207b6121L3973J9555J9693k3927l7774j8473K0493j4866o705L544N2265j6722
$$ -26121 7852 27407 47100 23173 -14601 -33074 -12581 -27447 -34152 -30608 21657 4935
13195D935l0902L5386k2988q174N3206R224N83o8387K7921J3835o683l5910P940
$$ 4935 -25967 9419 -13569 -21743 31463 40687 41270 -27117 804 14639 7956 -27954 -20014
13182b0014K7773K6572L9546N54n6035L8836j3598l2747J1060o271L1303K8778
$$ -20014 7759 34331 73877 74431 18396 57232 43634 10887 21947 15676 46979 75757
13170G5757n6328o940n7139k2776j8080K2090N9259L0656j1630M7268k7139L7256
$$ 75757 19429 12489 -44650 -67426 -85506 -63416 -4157 26499 14869 62137 34998 72254
13158G2254M1890p4568o3891O9296K0034J2862p8826p4874m9595L7950N5195K094
$$ 72254 114144 39576 -24315 44981 65015 77877 -949 -75823 -125418 -87468 -32273 -30179
13146c0179M3224L026j4910n6824k443L2485j9222J769k1261j4774Q529K2816
$$ -30179 13045 16071 1161 -55663 -58106 -25621 -44843 -43074 -64335 -79109 -70580 -47764
13134d7764j8484J659o091L0244Q7365L6092j1387n0586J0259j2402m1710O913
$$ -47764 -66248 -64589 -70680 -40436 46929 83021 71634 21048 31307 18905 -22805 -15892
13122a5892K4762O279q8077o442J8056J8336P558L1138q58k7189K8466M3406q4302
$$ -15892 8870 15149 -72928 -79370 -61314 -42978 -35420 -4282 -5140 -32329 -3863 39543 -44759
13109d4759o2599K7376N5735N2607l1687K2340j2452M5309K3421J1110m6140l9906
$$ -44759 -107358 -79982 -24247 28360 -3327 19013 6561 51870 75291 86401 40261 355
13097C55O213K4430J3768Q108o5118L3041N661k228J753L19J7890k3572r504j5167
$$ 355 6568 30998 44766 52874 -12244 20797 26458 24230 25983 26302 44192 20620 11116 -4051
13083d051k2805K7380J2384p120L882L8142L958l7102P81m1972q8531l1687Q6706
$$ -4051 -26856 524 12908 5788 9670 47812 51770 14668 15449 -26523 -115054 -146741 -60035
13070f0035J4374N577O026k2682j8874p694J570Q7550J5185j6534J9395k4334
$$ -60035 -45661 -40084 -34058 -56740 -75614 -83308 -81738 5812 20997 4463 23858 -476
13058d76K7009Q44m1824k1583k3117J3554k8744p867M5883M2957k2090P256k4617
$$ -476 26533 27377 -14447 -36030 -59147 -45593 -74337 -82204 -36321 6636 -15454 -8198 -32815
13045c2815J5209K3444K9596L0048j587k7908m5049l3141J5308j4596o895M3107
$$ -32815 -17606 5838 35434 65482 63895 35987 -9062 -42203 -26895 -41491 -48386 -5279
13033e279k911l1057n8450L1274L2540Q235k5284L4962l2122j8589L5365K6936
$$ -5279 -8190 -39247 -97697 -66423 -33883 -25648 -50932 -15970 -48092 -66681 -31316 -4380
13021d380M3405J2898n0729j2959M9875J51o1675m0607Q0465N0277J6180m1603
$$ -4380 39025 51923 1194 -11765 38110 38261 -23414 -64021 16444 66721 82901 41298
13009D1298l759O359M1101M1108m887j4987j07402n3019j7887j0417L979L9807
$$ 41298 37539 43898 84999 126107 121220 106233 -1169 -54188 -72075 -82492 -78513 -38706
12997c8706K9854L0492Q298R130k6548j2248M6511n541j089O997k5933j02557
$$ -38706 -8852 21640 29938 39068 12520 272 46783 41242 40153 47150 21217 -81340
12985h1340K4265L3364P762Q763n29k1532k5085o568P706O4216J4748k0191p2095
$$ -81340 -57075 -23711 -15949 -7186 -7715 -29247 -54332 -60900 -53194 11022 25770 5579 -66516
12972f6516l0344O0168K9710k039J118k7454j6693L2975j8887k5204j0739K4262
$$ -66516 -96860 -36692 -6982 -9021 -7903 -35357 -52050 -19075 -37962 -63166 -73905 -49643
12960d9643j1476M9041J836q5623K6388Q0613n5521k3676O6829M1276K9807P2205
$$ -49643 -61119 -12078 -10242 -95865 -69477 11136 -44385 -68061 -1232 40044 69851 142056
12948A42056M131q9241n1388j5334m2200j2714J3953j294K7922J9706o1268m1729
$$ 142056 146187 56946 5558 -9776 -51976 -64690 -50737 -52031 -24109 -4403 -65671 -107400
12936a07400L1547k1132M1697N2326L1887K148M0037R836q8232n0091k5301k4952
$$ -107400 -75853 -96985 -55288 -2962 28925 31073 71110 80946 -7286 -57377 -82678 -107630
12924a07630L3930K4840J0648K3837L0840j9163o6943j9265K167M2673j3843J4689
$$ -107630 -73700 -48860 -38212 -14375 16465 -2698 -69641 -88906 -86739 -44066 -57909 -43220
12912d3220R386L8077L1916K4804k8977O772r729O210n5363o963j6267O3932J12196
$$ -43220 -33834 4243 36159 60963 31986 38758 29029 35239 -20124 -27087 -43354 20578 132774
12899A32774J2103n5832q2820J8874M9854K6751K0468l528o0831k7988j6614k917
$$ 132774 144877 89045 6225 25099 74953 101704 122172 118644 57813 29825 13211 10294
12887A0294j0141O443o117L7822M3063J3970o2935p4990k1996K6957P4751l474
$$ 10294 153 6596 479 38301 81364 95334 32399 -42591 -64587 -37630 37121 33647
12875C3647o1889m5260N5104O9993m7617p834k6360j3710K7622M37o9222k0961
$$ 33647 -28242 -73502 -18398 51595 3978 -3856 -30216 -43926 -16304 -15867 -85089 -106050
12863a06050K9809P4624m589o5297K0584L1250M1119P9225j0116o9464l7058L5726
$$ -106050 -76241 -1617 -6206 -71503 -50919 -19669 21450 100675 90559 21095 -15963 19763
12851A9763K5039L7656l9291j8493L5608K0497O934N772n8203J9622l0025r7054
$$ 19763 44802 82458 43167 24674 60282 80779 87713 93485 35282 54904 24879 -72175
12839g2175m015L7181l9273R8265N1144o0473r1700K2353l351P195J3837p06O886
$$ -72175 -76190 -39009 -78282 19983 71127 10654 -81046 -58693 -62044 -54849 -41012 -41718 -34832
12826c4832M5904M6467N64k5228o4236M6783o26l5678j6074L4477m7439K2333
$$ -34832 11072 57539 58103 32875 -31361 15422 14796 -20882 -36956 -2479 -49918 -27585
12814b7585O7626j9222K1038L6784j6494q2681j5404P6663J0746N5599K4252n8007
$$ -27585 40041 20819 41857 78641 62147 -20534 -35938 40725 51471 107070 131322 73315
12802G3315l4323J4482j7445k0659L831K6970M4117l0842l9975q339L4430M677
$$ 73315 38992 53474 36029 15370 19201 46171 90288 59446 19471 11132 45562 50239
12790E0239n8550j0928M9J8410l7056k0445K4877k0946M2839N2962J5377o6618
$$ 50239 -8311 -19239 -19190 -780 -37836 -58281 -33404 -54350 -11511 41451 56828 -9790
12778i790m892N1764J1964l498k2280k8750K3779M8192j4063n6022n9677J2563
$$ -9790 -14682 37082 49046 45548 23268 -5482 18297 66489 52426 -3596 -63273 -50710
12766e0710J3116M0992K4853M2395l2413J414L4332q222P243l8945k0769J0616
$$ -50710 -37594 3398 28251 70646 38233 39647 73979 65757 73000 34055 13286 23902
12754B3902M9680K833r765k3640R6l2398o0703J6259m973r011m128k0756K9195
$$ 23902 73582 76415 66650 43010 43106 10708 -49995 -33736 -38709 -47720 -51848 -72604 -43409
12741d3409M9683K4352K0341J8875j5762n4466j6184l6762n8654K1788P1897J2483
$$ -43409 6274 30626 50967 69842 54080 -386 -16570 -53332 -111986 -90198 -18301 -5818
12729e818J0417J2611o2083o5311N0026K5333K9191k124J8475o989J4283l949
$$ -5818 4599 17210 -44873 -110184 -60158 -34825 -5634 -7758 10717 3728 18011 14062
12717A4062J9870L6180Q520n8195k3429k9722L574p444l4985J8764O59L5735R0062
$$ 14062 33932 70112 78632 20437 -2992 -32714 -29140 -36584 -71569 -52805 -52146 -16411 73651
12704G3651M8488J5595j221m0256n646k1258p380j7576j4717N063k2442j1928
$$ 73651 122139 137734 136513 96257 90611 69353 61973 44397 29680 34743 12301 373
12692C73l0095M7764j5413k0890M2318J2492r0749j7628O0886K8258l307M7487
$$ 373 -29722 18042 2629 -18261 24057 36549 -54200 -71828 -10942 17316 14009 61496
12680F1496M2315m5291m3850M758k8720O1483l8598o6605J1560M766L1848N725
$$ 61496 103811 58520 14670 19428 -9292 52191 13593 -53012 -41452 -36686 -4838 887
12668H87k2335j1319l401J2943k1995M3148L0371P083k6735J0018N081M5696J1585
$$ 887 -21448 -32767 -36168 -23225 -45220 -2072 28299 35382 8647 18665 23746 69442 81027
12655H1027o1202K5070r13j054p0175q0511k265L2261J0903L3381K3238O628N843
$$ 81027 19825 44895 43982 42928 -27247 -107758 -110023 -77762 -66859 -33478 -10240 -3612 2231
$$ [...]
##END NTUPLES=NMR SPECTRUM
##END=
