##TITLE=Analysis number 326186
Compound Code sew 03081
Project Code adrs
Chemist Name endeavour
##JCAMPDX= 6.0         $$ Bruker NMR JCAMP-DX V2.0
##DATA TYPE= NMR SPECTRUM
##DATA CLASS= NTUPLES
##ORIGIN= Bruker BioSpin GmbH
##OWNER= nmr
$$ XWIN-NMR		Version 3.5
$$ Mon Jan 29 08:46:35 2007 GMT Standard Time (UT+0h)  MAYBRIDGE\nmr@NMR_250MHZ
##.OBSERVE FREQUENCY= 250.131544655141
##.OBSERVE NUCLEUS= ^1H
##.ACQUISITION MODE= SIMULTANEOUS (DQD)
##.ACQUISITION SCHEME= undefined
##.AVERAGES= 16
##.DIGITISER RES= 18
##SPECTROMETER/DATA SYSTEM= dpx250
##.PULSE SEQUENCE= zg30
##.SOLVENT NAME= CDCl3
##.SHIFT REFERENCE= (INTERNAL, CDCl3, 0, 16.522)
##AUDIT TRAIL= $$ (NUMBER, WHEN, WHO, WHERE, WHAT)
$$ ##TITLE= Audit trail, XWIN-NMR		Version 3.5
$$ ##JCAMPDX= 5.01
$$ ##ORIGIN= Bruker BioSpin GmbH
$$ ##OWNER= nmr
$$ C:\u/data/dgb/nmr/ADRS/2140/pdata/1/auditp.txt
$$ ##AUDIT TRAIL=  $$ (NUMBER, WHEN, WHO, WHERE, WHAT)
(   1,<2007-01-29 08:46:05.81 +000>,<MAYBRIDGE\nmr>,<NMR_250MHZ>,
      <created by zg, POWCHK disabled, PULCHK disabled
       configuration hash MD5:
       49 4B E0 1D 92 C2 6B 37 9F E6 65 BC 52 41 86 1D
       data hash MD5: 64K
       AE A4 48 D1 CB F5 4E 5C BA BE 9B BA E6 6E 5B 0D>)
(   2,<2007-01-29 08:46:23.36 +000>,<MAYBRIDGE\nmr>,<NMR_250MHZ>,
      <Start of raw data processing
       ef LB = 0.3 FT_mod = 6 PKNL = 1 SI = 32K 
       data hash MD5: 32K
       7D 5E 10 50 46 89 F0 B5 2C FD B8 D4 03 00 55 06>)
(   3,<2007-01-29 08:46:25.28 +000>,<MAYBRIDGE\nmr>,<NMR_250MHZ>,
      <apk 
       data hash MD5: 32K
       C2 14 BA 8A 1D 50 91 24 86 2E EE 1E F8 32 93 51>)
(   4,<2007-01-29 08:46:25.98 +000>,<MAYBRIDGE\nmr>,<NMR_250MHZ>,
      <abs ABSG = 5 
       data hash MD5: 32K
       1E 04 D6 88 CF 33 5D BF B7 6A F7 B3 5B 5E 01 A8>)
$$ ##END=
$$ 
$$ hash MD5
$$ 59 15 15 9F 67 31 39 1B C3 BB DB 68 5E DF F9 A1
##$RELAX= 
##$RELAX= 
##$RELAX= 
##$RELAX= 
##$RELAX= 
##$RELAX= 
##$RELAX= 
$$ Bruker specific parameters
$$ --------------------------
##$DU= <C:\u>
##$EXPNO= 2140
##$NAME= <ADRS>
##$PROCNO= 1
##$TYPE= <nmr>
##$USER= <dgb>
##$AMP= (0..31)
100 100 100 100 100 100 100 100 100 100 100 100 100 100 100 100 100 100 
100 100 100 100 100 100 100 100 100 100 100 100 100 100 
##$AQSEQ= 0
##$AQ_mod= 3
##$AUNM= <au_zg>
##$AUTOPOS= <1 >
##$BF1= 250.13
##$BF2= 250.13
##$BF3= 250.13
##$BF4= 250.13
##$BF5= 500.13
##$BF6= 500.13
##$BF7= 500.13
##$BF8= 500.13
##$BYTORDA= 1
##$CFDGTYP= 0
##$CFRGTYP= 5
##$CHEMSTR= <none>
##$CNST= (0..31)
1 1 145 1 1 1 1 1 1 1 1 1 1 1 1 1 1 1 1 1 1 1 1 1 1 1 1 1 1 1 1 1 
##$CPDPRG= <>
##$CPDPRG1= <>
##$CPDPRG2= <>
##$CPDPRG3= <>
##$CPDPRG4= <mlev>
##$CPDPRG5= <mlev>
##$CPDPRG6= <mlev>
##$CPDPRG7= <mlev>
##$CPDPRG8= <mlev>
##$CPDPRGB= <>
##$CPDPRGT= <>
##$D= (0..31)
0 1 0 0 0 0 0 0 0 0.06 0 0 0 0 0 0 0.0002 0 0 0 0 0 0 0 0 0 0 0 0 0 0 
0 
##$DATE= 1170060365
##$DBL= (0..7)
120 120 120 120 120 120 120 120 
##$DBP= (0..7)
150 150 150 150 150 150 150 150 
##$DBP07= 0
##$DBPNAM0= <>
##$DBPNAM1= <>
##$DBPNAM2= <>
$$ [...]
##$SUBNAM7= <"">
##$SUBNAM8= <"">
##$SUBNAM9= <"">
##$SW= 20.6930455092707
##$SWIBOX= (0..15)
0 0 3 0 0 0 0 0 0 0 0 0 0 0 0 0 
##$SW_h= 5175.983436853
##$TD= 65536
##$TD0= 1
##$TE= 294.16
##$TE2= 300
##$TE3= 300
##$TEG= 300
##$TL= (0..7)
0 120 120 120 120 120 120 120 
##$TP= (0..7)
150 150 150 150 150 150 150 150 
##$TP07= 0
##$TPNAME0= <>
##$TPNAME1= <>
##$TPNAME2= <>
##$TPNAME3= <>
##$TPNAME4= <>
##$TPNAME5= <>
##$TPNAME6= <>
##$TPNAME7= <>
##$TPOAL= (0..7)
0.5 0.5 0.5 0.5 0.5 0.5 0.5 0.5 
##$TPOFFS= (0..7)
0 0 0 0 0 0 0 0 
##$TUNHIN= 0
##$TUNHOUT= 0
##$TUNXOUT= 0
##$USERA1= <user>
##$USERA2= <user>
##$USERA3= <user>
##$USERA4= <user>
##$USERA5= <user>
##$V9= 5
##$VALIST= <valist>
##$VCLIST= <CCCCCCCCCCCCCCC>
##$VD= 0
##$VDLIST= <DDDDDDDDDDDDDDD>
##$VPLIST= <PPPPPPPPPPPPPPP>
##$VTLIST= <TTTTTTTTTTTTTTT>
##$WBST= 1024
##$WBSW= 4
##$XGAIN= (0..3)
0 0 0 0 
##$XL= 0
##$YL= 0
##$YMAX_a= 432054
##$YMIN_a= -471219
##$ZGOPTNS= <>
##$ZL1= 120
##$ZL2= 120
##$ZL3= 120
##$ZL4= 120
##$ABSF1= 16.522
##$ABSF2= -4.171173
##$ABSG= 5
##$ABSL= 3
##$ALPHA= 0
##$AQORDER= 0
##$ASSFAC= 0
##$ASSFACI= 0
##$ASSFACX= 0
##$ASSWID= 0
##$AUNMP= <proc_1d>
##$AZFE= 0.1
##$AZFW= 0.1
##$BCFW= 0
##$BC_mod= 0
##$BYTORDP= 0
##$COROFFS= 0
##$CY= 12.5
##$DATMOD= 1
##$DC= 0
##$DFILT= <>
##$DTYPP= 0
##$F1P= 14.0000005364418
##$F2P= -0.99999901652339
##$FCOR= 0.5
##$FTSIZE= 32768
##$FT_mod= 6
##$GAMMA= 0
##$GB= 0
##$INTBC= 1
##$INTSCL= 1
##$ISEN= 128
##$LB= 0.3
##$LEV0= 0
##$LPBIN= 0
##$MAXI= 10000
##$MC2= 0
##$MEAN= 0
##$ME_mod= 0
##$MI= 0
##$NCOEF= 0
##$NC_proc= -1
##$NLEV= 6
##$NOISF1= 0
##$NOISF2= 0
##$NSP= 0
##$NTH_PI= 0
##$NZP= 0
##$OFFSET= 16.522
##$PC= 1
##$PHC0= 221.3201
##$PHC1= 19.90035
##$PH_mod= 1
##$PKNL= yes
##$PPARMOD= 0
##$PSCAL= 4
##$PSIGN= 0
##$REVERSE= no
##$SF= 250.13
##$SI= 32768
##$SIGF1= 0
##$SIGF2= 0
##$SINO= 400
##$SIOLD= 32768
##$SREGLST= <1H.CDCl3>
##$SSB= 0
##$STSI= 32768
##$STSR= 0
##$SW_p= 5175.98343685301
##$SYMM= 0
##$S_DEV= 0
##$TDeff= 65536
##$TDoff= 0
##$TI= <Analysis number 999999
Compound Code 99
Book Reference 9
Project Code 9>
##$TILT= no
##$TM1= 0
##$TM2= 0
##$TOPLEV= 0
##$USERP1= <user>
##$USERP2= <user>
##$USERP3= <user>
##$USERP4= <user>
##$USERP5= <user>
##$WDW= 1
##$XDIM= 32768
##$YMAX_p= 504666998
##$YMIN_p= -230106
$$ End of Bruker specific parameters
$$ ---------------------------------
##NTUPLES= NMR SPECTRUM
##VAR_NAME=  FREQUENCY,     SPECTRUM/REAL,   SPECTRUM/IMAG
##SYMBOL=    X,             R,               I
##VAR_TYPE=  INDEPENDENT,   DEPENDENT,       DEPENDENT
##VAR_FORM=  AFFN,          ASDF,            ASDF
##VAR_DIM=   32768,         32768,           32768
##UNITS=     HZ,            ARBITRARY UNITS, ARBITRARY UNITS
##FACTOR=    0.157963299565203, 1,           1
##FIRST=     4132.6476996994, 0,             0
##LAST=      -1043.33573715361, 0,           0
##MIN=       -1043.33573715361, -230106,     0
##MAX=       4132.6476996994, 504666998,     0
$$ Real data points
##PAGE= N=1
##DATA TABLE= (X++(R..R)), XYDATA
$$ [...]
20975a0585j0828Q01M901l377l546K149M121O986j876L68m058J610M339n376K239
$$ -10585 -21413 -20612 -15711 -19088 -22634 -20485 -16364 -9378 -11254 -10886 -14944 -13334 -8995 -14371 -12132
20960a2132K032J347L480O328o081o92J4790m606q602L171j971q27p428m911J2263
$$ -12132 -10100 -8753 -5273 1055 -5026 -5718 9072 4466 -4136 -965 -2936 -3763 -11191 -16102 -3839
20945c839N818p581m23N244P16o61L82k5j168j694k009n62L626r41j620M30M20
$$ -3839 1979 -5602 -6025 -781 -65 -726 -344 -369 -1537 -3231 -5240 -5802 -2176 -3117 -4737 -4307 -3887
20928c887J714M023O492o080n671L743j180M706K537q638j0016J49K987L057j240
$$ -3887 -2173 1850 8342 2262 -3409 334 -846 3860 6397 -2241 -12257 -12108 -9121 -6064 -7304
20913g304l279m774L549q72P3J275N111L140j155k15O289J86m985j83m332l661
$$ -7304 -10583 -15357 -11808 -12680 -12607 -11332 -6221 -3081 -4236 -4451 1838 2024 -2961 -3144 -7476 -11137
20897a1137K29O247K706K658m89N342p016J206R147n755l865r666r027P1P130
$$ -11137 -10908 -4661 -1955 703 214 5556 -1460 -254 8893 3138 -727 -10393 -19420 -19349 -12219
20882a2219J827P114P311o797p92m570q71O085L825l943j3121K825J775k51N379
$$ -12219 -10392 -3278 4033 -2764 -3556 -8126 -8997 -2912 913 -3030 -16151 -13326 -11551 -11802 -6423
20867f423L837O270J318k799m092J510q88k590K104Q453j507j783q4m018J121
$$ -6423 -2586 3684 5002 2203 -1889 -379 -1267 -3857 -1753 6700 5193 3410 3326 -692 429
20852D29M004j467r172m739L737M298O161o350k429L99O687j696q595j033J850
$$ 429 4433 2966 -6206 -10945 -7208 -2910 3251 -3099 -5528 -5129 1558 -138 -8733 -9766 -7916
20837g916j329l61L885J163L847o43l056m643n176L362j00K549K363L464K863
$$ -7916 -9245 -9606 -5721 -4558 -711 -1354 -4410 -9053 -14229 -10867 -10967 -8418 -6055 -2591 272
20822B72j565r658L478J487R320K212K055Q13j984l893n321l765K098m52m112
$$ 272 -1293 -10951 -7473 -5986 3334 5546 7601 8414 6430 2537 -2784 -6549 -4451 -4903 -9015
20807i015M804N358L42J441M739P65n260K08l315k477J0982P84K910m548l773
$$ -9015 -4211 1147 1489 2930 7669 8434 3174 3382 67 -2410 8572 9356 12266 7718 3945
20792C945J806M46M133N585l638l233j4639m048P082q9N38j283k471P00M30j366
$$ 3945 5751 6197 10330 15915 12277 9044 -5595 -9643 -2561 -2650 -2112 -3395 -5866 -5166 -4736 -6102
20776f102N628n466J235L046J973j305N817J355R08Q292k336o907r0Q206N863
$$ -6102 -474 -5940 -4705 -1659 314 -991 4826 6181 7089 15381 13045 6138 6048 14254 20117
20761B0117k217q968j3102l045j09J070Q215L217m526n491Q0l090l32q75Q597
$$ 20117 17900 8932 -4170 -7215 -7324 -6254 1961 5178 652 -4839 -4759 -7849 -8181 -9056 -459
20746d59j043k125j804P681k488p24N718J040n47L298o243l743K526L598J845
$$ -459 -1502 -3627 -5431 2250 -238 -962 4756 5796 5249 8547 2304 -1439 1087 4685 6530
20731F530k122r429q870R51O412L590k348p429K73J2471K372j660P42n476k465
$$ 6530 4408 -5021 -13891 -12940 -6528 -2938 -5286 -12715 -12442 29 2401 741 1483 -3993 -6458
20716f458K457j038P91P39m844J499N252L161k63o676M30J682j750j306J541j444
$$ -6458 -4001 -5039 -4248 -3509 -8353 -6854 -1602 1559 1296 -5380 -4950 -3268 -5018 -6324 -4783 -6227
20700f227m399k494N294Q258R993N90j061l601q736k301J832L8N940L330K65R02
$$ -6227 -10626 -13120 -7826 432 10425 11015 9954 6353 -2383 -4684 -2852 -2814 3126 6456 6721 7623
20684G623j1598j0548K642K722K204m98M920L402K801j703j78n55k921O317l137
$$ 7623 -3975 -14523 -11881 -9159 -6955 -7453 -2533 869 3670 1967 1789 1234 -1687 4630 1493
20669A493l336J933o964j110K166m489m393K490L499N4p52K255K365K09k824P931
$$ 1493 -1843 90 -6874 -7984 -5818 -10307 -14700 -12210 -8711 -8657 -9409 -7154 -4789 -4580 -7404 527
20653E27l15j2047N518N192n967M404K483M748o29r271n315Q658R601L234M946
$$ 527 212 -11835 -6317 -1125 -7092 -2688 -205 4543 3914 -5357 -10672 -2014 7587 10821 15767
20638A5767M364K942k161q957r484P675m635M210J226q485p826N01o58K068J092
$$ 15767 20131 23073 20912 11955 2471 10146 5511 9721 10947 2462 -5364 -4863 -5521 -3453 -2361
20623b361o70R608K345K012R73k158m920n10l546O386L629J422o004k38l974k211
$$ -2361 -3031 6577 8922 10934 11907 9749 4829 4319 773 7159 10788 12210 6206 5968 1994 -217
20607b17l469j213O178O496j097n025N55k280n247k004J268M963N304L709j0399
$$ -217 -3686 -4899 1279 7775 6678 1653 2208 -72 -5319 -7323 -6055 -1092 4212 7921 -2478
20592b478R46o145L15L77L705L140p09n291m783j378j968M351J0571R398J247
$$ -2478 -1532 -7677 -7362 -6985 -3280 -140 -849 -6140 -10923 -12301 -14269 -9918 653 10051 11298
20577A1298n648o459m906j003M495J169m006j568J040J528R143K038n838J23l885
$$ 11298 5650 -809 -5715 -6718 -2223 -1054 -5060 -6628 -5588 -4060 5083 7121 1283 1406 -2479
20562b479n468Q641J25J205j924m029M721J349k29k332j697O71k40j179l949J241
$$ -2479 -7947 694 819 2024 100 -3929 792 2141 1912 -420 -2117 -1446 -1686 -2865 -6814 -5573
20546e573l60J437p337l189M800N129J18l211L501K505k754n382K303l826n751
$$ -5573 -5933 -4496 -11833 -15022 -10222 -5093 -4975 -8186 -4685 -2180 -4934 -10316 -8013 -11839 -17590
20531a7590j398J268R041Q740P04j489j859K375O332k105m427j961l922q265M962
$$ -17590 -18988 -17720 -8679 61 765 -724 -2583 -208 6124 4019 -408 -2369 -6291 -14556 -9594
20516i594K811N291N56j29O98L087N41J831L813q707n717L609K972k131n233J835
$$ -9594 -6783 -1492 -936 -1065 -367 2720 3261 5092 8905 198 -5519 -1910 1062 -1069 -6302 -4467
20500d467N170q120QL033M072m754N681j169k270N735l293j832J189k894n35m068
$$ -4467 703 -7417 -7409 -4376 -304 -5058 623 -546 -2816 2919 -374 -2206 -1017 -3911 -4446 -8514
20484h514R707J0424k87l808j747K838N079k014p098q339K32P151L065l67k604
$$ -8514 1193 11617 11330 7522 5775 8613 13692 11678 4580 -3759 -3527 3624 6689 6322 3718
20469C718J433k021p503j94k475q14O384K590k579M875l787j650k294q65k49j489
$$ 3718 5151 3130 -4373 -4567 -7042 -7856 -1472 1118 -1461 3414 -373 -2023 -4317 -5182 -5431 -6920
20453f920Q602N517P09r238m351L239R49K384p789K395R274J2180j581k991n162
$$ -6920 1682 7199 7908 -1330 -5681 -2442 -1493 891 -6898 -4503 4771 16951 15370 12379 7217
20438G217q020Kj453l764M708P107j117m474m49K654Q0m762J525K569o3j205J606
$$ 7217 -803 -801 -2254 -6018 -1310 5797 4680 206 -243 2411 2491 -2271 -746 1823 1760 555 2161
20421B161k391m257k668L978J66j089k608N068O572k420j0423l40P617N959N836
$$ 2161 -230 -4487 -7155 -3177 -3011 -4100 -6708 -1640 4932 2512 -7911 -8251 -634 5325 11161
20406A1161n703m064n46o066p89q599K7R503L457j592j065n744n081N828L610
$$ 11161 5458 1394 848 -5218 -6007 -14606 -14579 -5076 -1619 -3211 -4276 -10020 -15101 -9273 -5663
20391e663J472N165M448J019m197K400p586m490J815J043J472m748o334l33j083
$$ -5663 -4191 974 5422 6441 2244 4644 -2942 -7432 -5617 -4574 -3102 -7850 -14184 -14517 -15600
20376a5600j250J2096J262M377P162O46L887m275k059m543m990N695l124q131
$$ -15600 -16850 -4754 -3492 885 8047 8693 12580 8305 6246 1703 -3287 2408 -716 -8847
20362h847M802R511L198J131J794o707l791j218n751K784J3140L519m066l870
$$ -8847 -4045 5466 8664 9795 11589 4882 1091 -127 -5878 -3094 10046 13565 9499 5629
20348E629j0763j355K475J700J563L480L9q74N034n121m840J814n835L91l173
$$ 5629 -5134 -6489 -4014 -2314 -751 2729 2768 1894 6928 1807 -3033 -1219 -7054 -6663 -9836
20333i836j1818K368L630Q487J0663J710R25L403p266l949L792l559j0782J434
$$ -9836 -21654 -19286 -15656 -7169 3494 5204 6129 9532 2266 -1683 2109 -1450 -12232 -10798
20319a0798O650Q392N913l941p518m397k270n657l637r35N359K389N991N522r00
$$ -10798 -4148 4244 10157 6216 -1302 -5699 -7969 -13626 -17263 -18198 -12839 -10450 -4459 1063 163
20304A63l571r827J562N700J3327m022p157N869n50p60L917J637k15m931n663
$$ 163 -3408 -13235 -11673 -5973 7354 3332 -3825 2044 1494 734 4651 6288 6073 1142 -4521
20289d521o030O62k269l330J62m04o22O668K686K170J0108P944n631j1522m845
$$ -4521 -10551 -9889 -12158 -15488 -15326 -15730 -16352 -9684 -6998 -4828 5280 13224 7593 -3929 -8774
20274h774j11m261K745m722J7O764M449J374L770J770K882l277o062L396N643
$$ -8774 -8885 -13146 -10401 -15123 -15106 -8342 -3893 -2519 1251 3021 5903 2626 -3436 -40 5603
20259E603Q95K561J277j0073j0157J297K118m974P233L359n578Q214j0556q683
$$ 5603 6498 9059 10336 263 -9894 -8597 -6479 -11453 -4220 -861 -6439 1775 -8781 -17464
20245a7464J820N864O608J0496j921p093p81L070m097n174j482J073O005N391
$$ -17464 -15644 -9780 -3172 7324 5403 -1690 -2471 599 -3498 -8672 -10154 -9081 -3076 2315
20231B315P539j646j5m936m270k481L11p743m074L316o94K591L704k716K7k160
$$ 2315 9854 8208 8193 3257 -1013 -3494 -3183 -10926 -15000 -11684 -12378 -9787 -6083 -8799 -8772 -10932
20215a0932O333k826k48M145J510m748K713k562K920m03M423l512n720r817L186
$$ -10932 -4599 -7425 -7673 -3528 -2018 -6766 -4053 -6615 -3695 -4098 325 -3187 -8907 -18724 -15538
20200a5538Q901Q510L004k772l225m859P935O16K47M325M91n351m00j920L909
$$ -15538 -6637 1873 4877 2105 -1120 -5979 1956 2572 2819 7144 7635 2284 1884 -36 3873
20185C873j752M829M026j1557o015N929r067m946L626J881q98Q081K30k918N209
$$ 3873 2121 6950 10976 -581 -6596 -667 -9734 -14680 -11054 -9173 -10071 -1990 -1760 -4678 531
20170E31N495l317j311J475L272l071o796Q50Q575j1313n079L232N078n416N649
$$ 531 6026 2709 1398 2873 6145 3074 -3722 -2872 5703 -5610 -10689 -7457 -2379 -7795 -2146
20155b146n06p952L458M170K684j855l480N67J319j422p785J293J726j962N352
$$ -2146 -2652 -10604 -7146 -2976 -292 -2147 -5627 -5060 -3741 -5163 -12948 -11655 -9929 -11891 -6539
20140f539L677M863L997m313K836k321k156P783N097k872m476q258L703j035K974
$$ -6539 -2862 2001 5998 1685 4521 2200 44 7827 12924 10052 5576 -2682 1021 -14 2960
20125B960r28j0986p292O80M708l356j251Q499J360J051K477j679K677K443L500
$$ 2960 2032 -8954 -16246 -15566 -10858 -14214 -15465 -6966 -5606 -4555 -2078 -3757 -1080 1363 4863
20110D863p41J318L223o502j6J185M416q265n69L170J411J963l720o208K34N871
$$ 4863 4122 5440 8663 2161 2145 3330 7746 -519 -1088 2082 3493 5456 1736 -4472 -4238 1633
20094A633L369m818j0153J112K603r829J310J440q622n298j138K316J1170N236
$$ 1633 5002 184 -9969 -8857 -6254 -16083 -14773 -13333 -21955 -27253 -28391 -26075 -14905 -9669
20080i669L697J359M377J559O393J304l869l701k85n037n965j400L0L015k369
$$ -9669 -5972 -4613 -236 1323 7716 9020 5151 1450 1165 -3872 -9837 -11237 -11207 -8192 -10561
20065a0561j014M551k53R809Q222P99J026l984p535k022O318k973k377K51l007
$$ -10561 -11575 -7024 -7277 2532 10754 11553 12579 8595 1060 -962 5356 2383 6 257 -2750
20050b750K635k546l278o55R54N60l722q91M307N7l523N309L30p862p073N290
$$ -2750 -115 -2661 -5939 -6594 -5640 -5080 -8802 -9693 -5386 -5329 -8852 -3543 -3213 -11075 -18148 -12858
20034a2858m259j298J769O13J0094N887o837n400M029N600p48K591j168k090K832
$$ -12858 -17117 -18415 -16646 -16033 -5939 -52 -6889 -12289 -8260 -2660 -3408 -817 -1985 -4075 -1243
20019a243N393K074m169J543L980k50j1025q532m362M81P865O531P232j786j0
$$ -1243 4150 6224 2055 3598 7578 7328 -3697 -12229 -16591 -16110 -8245 -1714 5518 3732 3722
20004C722o022j5368J70L144J541L767k654o62J1521j436R87m965K049o462k423
$$ 3722 -2300 -17668 -17498 -14354 -12813 -9046 -11700 -12362 -841 -2277 -1290 -6255 -4206 -10668 -13091
19989a3091k416J561o50P355O300J375p049j0031L101N561R090k182k652O81k457
$$ -13091 -15507 -13946 -14596 -7241 -941 434 -6615 -16646 -13545 -7984 1106 -1076 -3728 -3047 -5504
19974e504k925J628j258K122m42j591J958j01L393J575j126q2o449m900K495m48
$$ -5504 -8429 -6801 -8059 -5937 -6379 -7970 -6012 -6113 -2720 -1145 -2271 -2353 -8802 -13702 -11207 -11655
19958a1655P742K159J327K928L893J817M39m989p542k00P026N443J148M97l098
$$ -11655 -3913 -1754 -427 2501 6394 8211 8650 3661 -3881 -4081 2945 8388 9536 10033 6935
19943F935L178K046j371p77j244o125p786j536l109l967k93J429K136Q861J2038
$$ 6935 10113 12159 10788 10011 8767 2642 -5144 -6680 -9789 -13756 -14049 -12620 -10484 -1623 10415
19928A0415l310m835P547J125m461l228N708N811l761l414k002q073l294m367
$$ 10415 7105 2270 9817 10942 6481 3253 8961 14772 11011 7597 5595 -2478 -5772 -10139
19914a0139L530P334l968p508M007N474K872j991J657J866m003j275M081M393
$$ -10139 -6609 725 -3243 -10751 -6744 -1270 1602 -389 1268 3134 -869 -2144 1937 6330
19900F330K51K60n367l194J616R72j250M787k974j562J442k341o128N435R59j632
$$ 6330 6581 6841 1474 -1720 -104 868 -382 4405 1431 -131 1311 -1030 -7158 -1723 -764 -2396
19884b396k74k277j04Q416J100r36m808k291J154J627m282k692k47K560l870N561
$$ -2396 -2670 -4947 -5051 3365 4465 3529 -1279 -3570 -2416 -789 -5071 -7763 -8010 -5450 -9320 -3759
19868c759L888o179K097j661J213n366L372L681p42N472k041R487K038k102P33
$$ -3759 129 -6050 -3953 -5614 -4401 -9767 -6395 -2714 -3456 2016 -25 9462 11500 9398 10131
19853A0131J266j007K994R2k991j0220j752j415m710j340N354j526q48L632l155
$$ 10131 11397 10390 13384 13476 10485 265 -1487 -2902 -7612 -8952 -3598 -5124 -5972 -2340 -5495
19838e495k050O35m119n696K075O175O326M850o16l824l111p257Q145Q690q403
$$ -5495 -7545 -6910 -11029 -16725 -14650 -8475 -2149 2701 2085 -1739 -4850 -12107 -3962 4728 -3675
19823c675L84j027k796K711N782J1854j843l867l962j455l364P30M654q438M715
$$ -3675 -3291 -4318 -7114 -4403 1379 13233 11390 7523 3561 2106 -1258 -528 4126 -4312 403
19808D03O594m99m205J925k125p414J858q086K335P162N728O126O768q547j2096
$$ 403 6997 6498 2293 4218 2093 -5321 -3463 -11549 -9214 -2052 3676 9802 16570 8023 -4073
19793d073o919L875J1278j947l188p41M253k784r335m528N076L928N703r560r782
$$ -4073 -10992 -7117 4161 2214 -974 -1715 2538 -246 -9581 -14109 -9033 -5105 598 -8962 -18744
19778a8744K405J0226L65L812n570l940j835O627J37n359O308R925ql215K953
$$ -18744 -16339 -6113 -5748 -1936 -7506 -11446 -13281 -6654 -6517 -11876 -5568 4357 4349 1134 4087
19763D087J6k404O900k332k389K55K935k96m533k141l813n727L321O362J94l398
$$ 4087 4103 1699 8599 6267 3878 4133 7068 6772 2239 98 -3715 -9442 -6121 241 435 -2963
19747b963l55n275K598o72J560l811m54l492L709R553k759o115p66k128j0196
$$ -2963 -3318 -8593 -5995 -6667 -5107 -8918 -9372 -12864 -9155 398 -2361 -8476 -9242 -11370 -21566
19732b1566k911O047J1358Q517l494J142k556m51l52k339Q88j610Q07J0522P265
$$ -21566 -24477 -18430 -7072 1445 -2049 -907 -3463 -3914 -4266 -6605 -5717 -7327 -6520 4002 11267
19717A1267n871K541n45J570j643j297r701J253K135k225p6p640M978J448L209
$$ 11267 5396 7937 7392 8962 7319 6022 -3679 -2426 -291 -2516 -2592 -10232 -5254 -3806 -597
19702e97l600p398k210L042K193r27J057O873L533L140L767l457l776l332L569
$$ -597 -4197 -11595 -13805 -10763 -8570 -9497 -8440 -1567 1966 5106 8873 5416 1640 -1692 1877
19687A877P518J0594l320j1565r59k752j3260p735M30L534L696j871N126P325
$$ 1877 9395 19989 16669 5104 4145 1393 -11867 -19602 -19172 -15638 -11942 -13813 -8687 -1362
19673a362K809L511j319k355NK135n804o555K540L962n04r188k694O064m42j710
$$ -1362 1447 4958 3639 1284 1289 3424 -2380 -8935 -6395 -2433 -2937 -12125 -14819 -8755 -9197 -10907
19657a0907K071K471L349p463k897L656J717N476M644j921p517O27N32K722J294
$$ -10907 -8836 -6365 -3016 -10479 -13376 -9720 -8003 -2527 2117 196 -7321 -6694 -6162 -3440 -2146
19642b146n935R03L18k444j092P013N075q11m313m736j035K291K038O35K850q97
$$ -2146 -8081 -7178 -6860 -9304 -10396 -3383 1692 881 -3432 -8168 -9203 -6912 -4874 -4239 -1389 -2286
19626b286P257K985J917J235q34n722K216o350L21J556K621o177o313k553m353
$$ -2286 4971 7956 9873 11108 10274 4552 6768 418 739 2295 4916 -1261 -7574 -10127 -14480
19611a4480K184L019N151J696K301l935m74K724p074m665R233M996K624K30O576
$$ -14480 -12296 -9277 -4126 -2430 -129 -4064 -4538 -1814 -8888 -13553 -4320 676 3300 3530 10106
19596A0106M333j1868n806j419k580K180N120J049l304m321l72L325L594K752
$$ 10106 14439 2571 -3235 -4654 -7234 -5054 66 1115 -2189 -6510 -6882 -3557 37 2789
19582B789L681j403k893l343n318O700P82q89J773o88l150J088k800L227m72J1718
$$ 2789 6470 5067 2174 -1169 -6487 213 995 106 1879 1191 -1959 -871 -3671 -444 -916 10802
19566A0802m58m763k691L711K423n536j0417m219O27j664k722n30P133K442J477
$$ 10802 10344 5581 2890 6601 9024 3488 -6929 -11148 -10521 -12185 -14907 -15437 -8304 -5862 -4385
19551d385M450o649J821L248r91q950j457n88P268j111m450K628N128p02j682
$$ -4385 65 -6584 -4763 -1515 -2506 -11456 -12913 -13501 -6233 -7344 -11794 -9166 -4038 -4740 -6422
19536f422l917o740P148N831k646n193l549J1336N600o073m061l249r61K974P239
$$ -6422 -10339 -17079 -9931 -4100 -6746 -11939 -15488 -4152 1448 -4625 -8686 -11935 -12896 -9922 -2683
19521b683m587j89M202j41k08N018Q061N51J013N423K404K027K823o166l340q602
$$ -2683 -7270 -7459 -3257 -3398 -3606 1412 9473 10024 11037 16460 18864 20891 23714 17548 14208 5606
19505E606j0982N06k413n354L885J901q46n563k877M438L843K839k778k663O014
$$ 5606 -5376 -4870 -7283 -12637 -8752 -6851 -7697 -13260 -16137 -11699 -7856 -5017 -7795 -10458 -4444
19490d444N859M512l399n00P53m531M707m643m463l357l852L775n27N618P973
$$ -4444 1415 5927 2528 2028 2781 -1750 2957 -1686 -6149 -9506 -13358 -9583 -10110 -4492 3481
19475C481n275k67K07P20L605N445O684K204m866n628k205n943k759J138K854
$$ 3481 -1794 -2061 -1854 -1134 2471 7916 14600 16804 11938 6310 4105 -1838 -4597 -3459 -605
19460f05N060r49j397J586O368k523j1351p847l670O05J060k232J919M325K194
$$ -605 4455 3506 2109 3695 10063 7540 -3811 -11658 -15328 -14723 -13663 -15895 -13976 -9651 -7457
19445g457j525L06K465O668k408p711l260m496J560J4293L973J122K792K490r650
$$ -7457 -8982 -8676 -6211 457 -1951 -9662 -12922 -17418 -15858 -1565 2408 3530 6322 8812 -838
19430h38n107N756M186J885k159P49N20l59j323k543r184J825N779N729L962r401
$$ -838 -5945 -189 3997 5882 3723 4472 4992 4633 3310 767 -8417 -6592 -813 4916 8878 -523
19414e23n764k112L592j167r306j0549J356Q656M855j154N258L332o106q622j554
$$ -523 -6287 -8399 -4807 -5974 -15280 -25829 -24473 -15817 -10962 -12116 -6858 -3526 -9632 -18254 -19808
19399a9808P97Q98p18r773n572J0966J2445K102R702r09R381K750o112o618j315
$$ -19808 -19011 -18113 -18831 -28604 -34176 -23210 -10765 -8663 1039 130 9511 12261 6149 -469 -1784
19384a784N005L186l409K303K911r582m213L581J219j997l106O732K553o968q489
$$ -1784 3221 6407 2998 5301 8212 -1370 -5583 -2002 -783 -2780 -5886 846 3399 -3569 -12058
19369a2058J0400N538L287J499L204K264k451m264l508o233o915p472m218P179
$$ -12058 -1658 3880 7167 8666 11870 14134 11683 7419 3911 -2322 -9237 -16709 -20927 -13748
19355a3748Q485P057l743n889j970M179m309p075O376J0889k994k159L188j008
$$ -13748 -5263 1794 -1949 -7838 -9808 -5629 -9938 -17013 -10637 252 -2742 -4901 -1713 -2721
19341b721k032m799N039K339l04J126l332O016L893j609O65J805k814q32N418
$$ -2721 -4753 -9552 -4513 -2174 -2478 -1352 -4684 1332 5225 3616 4281 6086 3272 2440 7858
19326G858j458q6K114j315j3513l938N848K223J670l907J623k433l756l786j835
$$ 7858 6400 6314 8428 7113 -6400 -10338 -4490 -2267 -597 -4504 -2881 -5314 -9070 -12856 -14691
19311a4691L206J5654P656n314j211k530n588L43k721n101M610J4925O466j1331
$$ -14691 -11485 4169 11825 6511 5300 2770 -2818 -2475 -5196 -10297 -5687 9238 15704 4373
19297D373k032k50J099K65j26m626j1221q79Q956k299n644m548m722N83Q190M222
$$ 4373 2341 2091 3190 3455 3329 -1297 -12518 -13397 -4441 -6740 -12384 -16932 -21654 -21071 -12881 -8659
19281h659k746k392O650M927L366N621N929j561k114m730p310l400M842j532K100
$$ -8659 -11405 -13797 -7147 -2220 1146 6767 12696 11135 9021 4291 -3019 -6419 -1577 -3109 -1009
19266a009Q34P08P59J1040Q43n766L4p80J291l871k250J91J387J719L089m656
$$ -1009 -175 533 1292 12332 13175 7409 7443 6663 7954 4083 1833 2024 3411 5130 8219 3563
19250C563n815m487J624m14Q612N371l826n859k957L209k78p184n963O612L11
$$ 3563 -2252 -6739 -5115 -5529 3083 8454 4628 -1231 -4188 -979 -1257 -8441 -14404 -7792 -7481
19235g481L219R545j233J961L256o434n301L690K605O22n806j891L33L728k15
$$ -7481 -4262 5283 4050 6011 9267 2833 -2468 1222 3827 4449 -1357 -3248 -2915 813 598
19220E98o758m841m263M669Q007M702r67j2504k670M99M996K352J679l255K757
$$ 598 -6160 -11001 -15264 -10595 -2588 2114 1147 -11357 -14027 -13528 -8532 -6180 -4501 -7756 -4999
19205d999Q622M896K025m69N470q69p088m865p497J620p0j339k737l192J135j154
$$ -4999 3623 8519 10544 10075 15545 14676 7588 2723 -4774 -3154 -3224 -4563 -7300 -10492 -9357 -10511
19189a0511M90K622O578l735j692l118M936L609j670M971K935m948m252K642J008
$$ -10511 -10021 -7399 -821 -4556 -6248 -9366 -4430 -821 -2491 2480 5415 467 -3785 -1143 -135
19174a35J360O969K87q073l186N849N660k474o269o574k13J0988P166l354n329
$$ -135 1225 8194 8481 408 -2778 3071 8731 6257 -12 -6586 -6799 4189 11355 8001 2672
19159B672l778j173l786O389O886L231L342p765o025l879j978q30J448L07j242
$$ 2672 -1106 -2279 -6065 324 7210 10441 13783 6018 -7 -3886 -5864 -6694 -5246 -4939 -6181
19144f181k608m391k834N472M961O71o119j759J608J851O588J85k396K899k062
$$ -6181 -8789 -13180 -16014 -10542 -5581 -4910 -11029 -12788 -11180 -9329 -2741 -2556 -4952 -2053 -4115
19129d115n296K456j786K087M582k431K846k264j941p02m454N805O366o069o465
$$ -4115 -9411 -6955 -8741 -6654 -2072 -4503 -1657 -3921 -5862 -6564 -11018 -5213 1153 -4916 -11381
19114a1381p90j846j910J0552N90l813L817j527K63l520j446N174O262M58l644
$$ -11381 -12171 -14017 -15927 -5375 -4785 -8598 -4781 -6308 -6045 -9565 -11011 -5837 425 883 -2761
19099b761k828N22j78l131M460q23J921R06j526k982n749k951N624R386k95P106
$$ -2761 -5589 -5067 -5245 -8376 -3916 -4739 -2818 -1912 -3438 -6420 -12169 -15120 -9496 -110 -405 6701
19083F701N074J988n693r141J780R983o60j598j778j2846l322L792N673l946r421
$$ 6701 11775 13763 8070 -1071 709 10692 10032 8434 6656 -6190 -9512 -5720 -47 -3993 -13414
19068a3414M745K802m249l972m974K092P376L162K970L33k243P72J539J093l253
$$ -13414 -8669 -5867 -10116 -14088 -19062 -16970 -9594 -6432 -3462 -3129 -5372 -4600 -3061 -1968 -5221
19053e221o102m885K725K651l577k416m967p5K897L892P628Q08o117p009m2N818
$$ -5221 -11323 -16208 -13483 -10832 -14409 -16825 -21792 -21867 -18970 -15078 -7450 -6642 -12759 -19768 -19810 -13992
19037a3992J847O411M041P08R211L56k748l773l165J952J0118l93q191k378q94
$$ -13992 -12145 -5734 -1693 -985 8226 8582 5834 2061 -1104 848 10966 10573 2382 4 -890
19022h90K509n861r3m83O060M556l584k547n417P113k062o134k52N03l531l662
$$ -890 1619 -4242 -4335 -4818 1242 5798 2214 -333 -5750 1363 -699 -6833 -7085 -6582 -10113 -13775
19006a3775K401j050Q775P790L899j643R33O866Q53o569j343K572pk124j712M418
$$ -13775 -11374 -12424 -3649 4141 8040 6397 7330 14196 15049 8480 7137 9709 9702 7578 5866 10284
18990A0284J120o05q354m832R96k894J168N225p458o794L423J1679r71J115J343
$$ 10284 11404 10799 2445 -2387 -1391 -4285 -3117 2108 -5350 -12144 -8721 2958 1987 3102 4445
18975D445J064L859m87K664J598l822p572k821P291k465k791j691k604M737J86
$$ 4445 5509 9368 8881 11545 13143 9321 1749 -1072 6219 3754 963 -728 -3332 1405 1591
18960A591p769R20l673j833j944M687M520l222k490J52J838K90n077J38M568L289
$$ 1591 -6178 -5258 -8931 -10764 -12708 -8021 -3501 -6723 -9213 -9061 -7223 -6933 -12010 -11872 -7304 -4015
18944d015K97L883M856k376j253q97l111j883n519M601M108K97K928L297q030
$$ -4015 -3718 165 5021 2645 1392 495 -2616 -4499 -10018 -5417 -1309 -1012 1916 5213 -2817
18929b817o661p368nR681N45R18N007j064n949n142l38l268J689J463J400R387
$$ -2817 -9478 -16846 -16851 -7170 -6625 -5707 -700 -1764 -7713 -12855 -13193 -16461 -14772 -13309 -11909 -2522
18913b522J736K353mL209M42p036Q96N102p62M105l747m918K275O225n254l333
$$ -2522 -786 1567 1563 4772 5214 -1822 -926 4176 3414 7519 3772 -1146 1129 7354 2100 -1233
18897a233M876N269K834j0434j0359k860J107m031L342j983m086Q658O874J1885
$$ -1233 3643 8912 11746 1312 -9047 -11907 -10800 -14831 -11489 -13472 -17558 -8900 -2026 9859
18883I859K781l051p526r303j621o287r76P350K000J535O599l205k09L41l458
$$ 9859 12640 9589 2063 -7240 -8861 -15148 -16124 -8774 -6774 -5239 1360 -1845 -2054 -1713 -5171
18868e171K236k287n398K742M053n328j329j82K61M393m655M6J162J755L073J841
$$ -5171 -2935 -5222 -10620 -7878 -3825 -9153 -10482 -10664 -10403 -6010 -10665 -10619 -9457 -7702 -4629 -2788
18852b788M881l514l740o266m75K600P36k603J289l34J082J134o427K146J4147
$$ -2788 2093 -1421 -5161 -11427 -11902 -9302 -8566 -11169 -9880 -10214 -9132 -7998 -14425 -12279 1868
18837A868P286l659J060O95k224k818M17l282m563n241k011M14L688Q870L094
$$ 1868 9154 5495 6555 7250 5026 2208 2625 -657 -5220 -10461 -12472 -12058 -8370 500 3594
18822C594O51K433Q132k807o203l850l933J892p2K873K030L543K904n851l073
$$ 3594 4245 6678 14810 12003 5800 1950 -1983 -91 -163 2710 4740 8283 11187 5336 2263
18807B263J473Q152N846m224j2598q96k29p197K40O206k479m316M121q147k459
$$ 2263 3736 11888 17734 13510 912 16 -213 -7410 -7170 -964 -3443 -7759 -3638 -11785 -14244
18792a4244L82K421L30N886M720q05N549M977m43K820o375q502L646j8K784J1435
$$ -14244 -13862 -11441 -11111 -5225 -505 -1310 4239 9216 8773 11593 5218 -3284 362 344 3128 14563
18776A4563M582j2201l531K309O146p43M902J4004J8188L6936P727l3994k4379
$$ 14563 19145 6944 3413 5722 11868 11125 16027 30031 48219 85155 92882 58888 34509
18763C4509q324j5482m044l888l782j956R316K243N68p82j0931n668l925N214
$$ 34509 26185 10703 6659 2771 -1011 -2967 6349 8592 9160 8378 -2553 -8221 -12146 -6932
18749f932J2902j924k149J410l005l824K331J642K261M231j276l938o481P61M38
$$ -6932 5970 4046 1897 3307 302 -3522 -1191 451 2712 6943 5667 1729 -4752 -3991 -3553
18734c553o014k763M065L563N39N395M752N443N099p005k552M91p251p358k062
$$ -3553 -9567 -12330 -8265 -4702 -4163 1232 5984 11427 16526 9521 6969 7460 209 -7149 -9211
18719i211R369J931P559j707j415m257m965k965L046L008P04l732K132N449l098
$$ -9211 158 2089 9648 7941 6526 2269 -2696 -5661 -2615 393 1097 -2635 -503 4946 1848
18704A848M452m673r535p1j869m397P617J2581L11n942J832M998j78m276j960
$$ 1848 6300 1627 -7908 -7979 -9848 -14245 -6628 5953 6264 322 2154 7152 6974 2698 738
18689G38k118J52K931r97N364Q530q149L285o62J130m085O32N369J298Q79l619
$$ 738 -1380 -1228 1703 706 6070 14600 6451 9736 9074 10204 6119 6751 12120 13418 14297 10678
18673A0678k273p667q943j938K969N757K822Q9M350j0397q801K186R18Q620M517
$$ 10678 8405 738 -8205 -10143 -7174 -1417 1405 1494 5844 -4553 -13354 -11168 -10250 -1630 2887
18658B887j503j008m120j803M774o51o318L344J604L330J0004M68j3437k737j375
$$ 2887 1384 376 -3744 -5547 -773 -1424 -7742 -4398 -2794 536 10540 11008 -2429 -5166 -6541
18643f541l117J936k326n273m413Q346L911n91N242k410p504j886J1559M948M73
$$ -6541 -9658 -7722 -10048 -15321 -19734 -11388 -7477 -8068 -2826 -5236 -12740 -14626 -3067 1881 2354
18628B354q713K739Q212k274q403l037J1096j80l059o9m586k759K690L173p40
$$ 2354 -6359 -3620 4592 2318 -6085 -9122 1974 1794 -1265 -1334 -5920 -8679 -5989 -2816 -3556
18613c556j61j751m395M265K890l151k29K175R85L22m562P649L260L156M981p813
$$ -3556 -3717 -5468 -9863 -5598 -2708 -5859 -6088 -3913 -2928 -2606 -7168 481 3741 6897 11878 4065
18597D065j0733M694O178k808K021N14K409R026l700j1181k995J0398M009m846
$$ 4065 -6668 -1974 4204 1396 3417 3931 6340 15366 11666 485 -2510 7888 11897 7051
18583G051p848L346K482J219L824l375k45R74k329k907M540R326k569m837q855
$$ 7051 -797 2549 5031 6250 10074 6699 6454 7428 5099 2192 6732 16058 13489 8652 -203
18568b03l032J257J139J293l355K081j37n262o500j395P707O524N551n744k429
$$ -203 -3235 -1978 -839 454 -2901 -820 -957 -6219 -12719 -14114 -6407 117 5668 -76 -2505
18553b505M927J22Q4M229J429o313J280l94l396O974J357J693n200l766j263n496
$$ -2505 2422 2544 2628 6857 8286 1973 3253 2859 -537 6437 7794 9487 4287 521 -742 -6238
18537f238j96M825K167p836q991l736M490M169M175J1128L776k043r785n392Q967
$$ -6238 -6434 -1609 558 -7278 -16269 -20005 -15515 -11346 -7171 3957 7733 5690 -4095 -9487 -520
18522e20n255j613J010l836J1469n106o351m7N445K5J980o411o171r4K168O029
$$ -520 -5775 -7388 -6378 -10214 1255 -3851 -10202 -10249 -4804 -4779 -2799 -9210 -15381 -15475 -13307 -7278
18506g278N830J171N80j724R906k769j879n50P96k853k198O94M604K184j40M74
$$ -7278 -1448 -277 303 -1421 8485 5716 3837 3287 4083 1230 -968 -274 4330 6514 6374 6848
18490F848K014m916O663m120n011l940k166J660k553K902m322l54N740K109L650
$$ 6848 8862 3946 10609 6489 1478 -2462 -4628 -2968 -5521 -2619 -6941 -7295 -1555 554 4204
18475D204L843P52n873j637l17q69J457L980o066M893J661k486m62q18p047m899
$$ 4204 8047 8799 2926 1289 972 103 1560 5540 -526 4367 6028 3542 3080 2262 -4785 -9684
18459i684j115J728M573l914n564j669O107N128o854N352O521m62M400k370p324
$$ -9684 -10799 -9071 -4498 -8412 -13976 -15645 -9538 -4410 -11264 -5912 609 147 4547 2177 -5147
18444e147l251l255L58L962o275j837O141k48j773Q495M336o722Q2J854p257K421
$$ -5147 -8398 -11653 -11295 -7333 -13608 -15445 -9304 -9552 -11325 -2830 1506 -5216 -5134 -3280 -10537 -8116
18428h116l23J207j4j839L557P488J853k319l131k177q927m491M770Q667L233
$$ -8116 -8439 -7232 -7246 -9085 -5528 1960 3813 1494 -1637 -3814 -12741 -17232 -12462 -3795 -562
18413e62K452k132K079l229J149k822n357J006K209P879N282o056o535N88M312
$$ -562 1890 -242 1837 -1392 -243 -3065 -8422 -7416 -5207 2672 7954 1898 -4637 -4049 263
18398B63P857R74p0q592N004M312k1j3031k893j218k703N811N102l128Q545j957
$$ 263 8120 9094 9024 432 5436 9748 9727 -3304 -6197 -7415 -10118 -4307 795 -2333 6212 4255
18382D255j96J852k627J56r58k9j154k747O21m987N469M777j546l229j910o798
$$ 4255 4059 5911 3284 3440 2482 2453 1299 -1448 -827 -5814 -345 4432 2886 -343 -2253 -9051
18366i051J983J1331J520j331P550O22O742J949j1500j2596L134J173n993M816
$$ -9051 -7068 4263 5783 4452 12002 12624 19366 21315 9815 -2781 353 1526 -4467 349
18352C49P097l351o551J327P775m70r357l01j411p530P082P187m712k615J185
$$ 349 7446 4095 -2456 -1129 6646 6176 -3181 -3482 -4893 -12423 -5341 1846 -2866 -5481 -4296
18337d296j249o05R697j397Q09k110M498m52k851j649L967L569o049M858k101
$$ -4296 -5545 -6150 3547 2150 2959 849 5347 4895 2044 395 4362 7931 1882 6740 4639
18322D639k919j424M123M323O051M865j657K082P759n458j6408q075j572K980
$$ 4639 1720 296 4419 8742 14793 19658 18001 20083 27842 22384 5976 -2099 -3671 -691
18308f91l290m952O06Q824L957r84q90K095L7n174j700J409m049q319N234Q956
$$ -691 -3981 -8933 -8327 497 4454 3470 2580 4675 4712 -462 -2162 -753 -4802 -13121 -7887 1069
18292A069N37r07j570J952J899o556L085M163k755K319N170j925m783R57J0542
$$ 1069 1606 699 -871 1081 2980 -3576 -491 3672 917 3236 8406 6481 1698 2655 13197
18277A3197j008o035p89N27R557k102l855l005M64m423l755r10J371Q16j722J592
$$ 13197 12189 6154 5365 5892 15449 13347 9492 6487 6951 2528 -1227 -2137 -766 50 -1672 -80
18261h0P31N808K79Q91m242K270j905Q233k926j2237o401K280P22O933j716N853
$$ -80 651 6459 6738 7629 3387 5657 3752 11985 9059 -3178 -9579 -7299 -6577 356 -1360 4493
18245D493K571L911J24n872P379L212K57m416p182l731m769O578N923j510q581
$$ 4493 7064 10975 11099 5227 12606 15818 16075 11659 4477 746 -4023 2555 8478 6968 -1613
18230a613l542O686L186k960P129J846J019L700Q070j592k913L639k569k496l328
$$ -1613 -5155 1531 4717 1757 8886 10732 11751 15451 23521 21929 19016 22655 20086 17590 14262
18215A4262r031j773q684J650M219J163L362J0873Q715m953K877J434p721n996
$$ 14262 5231 3458 -5226 -3576 643 1806 5168 16041 24756 19803 22680 24114 16393 10397
18201A0397Q72J282m686K732L742m529k279K614M454L749K3M384j423L239n493
$$ 10397 11269 12551 7865 10597 14339 9810 7531 10145 14599 18348 18371 22755 21332 24571 19078
18186A9078j1210M760O088K027K099r269k572K476J860Q656O563n947k858j039
$$ 19078 7868 12628 18716 20743 22842 13573 11001 13477 15337 23993 30556 24609 21751 20712
18172B0712p111M035L214P446P472j430p704m680M869J3360J328Q73j971q41l817
$$ 20712 13601 17636 20850 28296 35768 34338 26634 21954 26823 40183 41511 42384 40413 39572 35755
18157C5755K811M397k831M396M891L521l260o52M016N669J032o24q691K148j407
$$ 35755 38566 42963 40132 44528 49419 52940 49680 49028 53044 58713 59745 59121 50430 52578 51171
18142E1171K680J1061L875J447L847L40R661J1002J2663J611l15J141N605J2152
$$ 51171 53851 64912 68787 70234 74081 74421 84082 95084 107747 109358 109043 110184 115789 127941
18128A27941J5445L0232L1314J7043J5033K5372L2940M6345N4936P4053J05358
$$ 127941 143386 173618 204932 221975 237008 262380 295320 341665 396601 470654 576012
18117E76012J11071J36527K22646L47700N59632R72199J786144L358032N746765
$$ 576012 687083 823610 1046256 1393956 1953588 2925787 4711931 8069963 13816728
18108A3816728O064987k773450p482882m332208k033374j049695o17676l97631
$$ 13816728 19881715 17108265 9625383 5293175 3259801 2210106 1592430 1194799
18100A194799k86391k16478j48720j03497p5081n6293m9235l1208l6012l1643
$$ 1194799 908408 691930 543210 439713 364632 308339 259104 227896 191884 160241
18090A60241k4211j6203m144p266r627j6472q781q219r517r433m090K926j8827
$$ 160241 136030 119827 115683 108417 98790 82318 73537 65318 55801 46368 42278 45204 26377
18077B6377j4797r316l166M244o87k150K092k476p986l151M022K164n554O973
$$ 26377 11580 2264 -902 3342 2655 505 2597 121 -7865 -11016 -6994 -4830 -10384 -3411
18063c411Q570L527N645l494m825j736l710l552j421N011k986k47l209n598K548
$$ -3411 5159 8686 14331 10837 6012 4276 566 -2986 -4407 604 -2382 -2629 -5838 -11436 -8888
18048h888k293m069j176M055J746J010Q595j0376j2354P184Q833M113j520m24
$$ -8888 -11181 -15250 -16426 -12371 -10625 -9615 -1020 -11396 -23750 -16566 -7733 -3620 -5140 -5564
18034e564N36p706j2539o94M009N557Q959N543m848J852k735m128m42j133O060
$$ -5564 -5028 -12734 -25273 -25967 -21958 -16401 -7442 -1899 -6747 -4895 -7630 -11758 -12200 -13333 -7273
18019g273L368m979m588L107L776L103J278m445q112K473P543r06J694k2K283
$$ -7273 -3905 -8884 -13472 -10365 -6589 -3486 -2208 -6653 -14765 -12292 -4749 -5655 -3961 -3983 -1700
18004a700p358j0371N87M413k491N06K158l074K24O142N120J383m074M378L345
$$ -1700 -9058 -19429 -18842 -14429 -16920 -16414 -14256 -17330 -17106 -10964 -5844 -4461 -8535 -4157 -812
17989h12M966m124j1259o064L79P617M350p75Q333L717o479l811j439K488J394
$$ -812 4154 30 -11229 -17293 -16914 -9297 -4947 -5722 2611 6328 -151 -3962 -5401 -2913 -1519
17974a519k503k926J115r83J710N960N027p61p957k398j41L137K174q48l958l619
$$ -1519 -4022 -6948 -5833 -6816 -5106 854 5881 5120 -2837 -5235 -5376 -2239 -65 -913 -4871 -8490
17958h490L975Q41l162l543J93L120M079o305o899n620k061K309Q67O387J858
$$ -8490 -4515 -3674 -6836 -10379 -10186 -7066 -2987 -9292 -16191 -21811 -23872 -21563 -20696 -14309 -12451
17943a2451o30m631K605J0580J177K957R9p294p87J935L501p932j369L775N905
$$ -12451 -13081 -17712 -15107 -4527 -3350 -393 -294 -7588 -8375 -6440 -2939 -10871 -12240 -8465 -2560
17928b560j731j590K636O577p11K598O96l503O17k471j297p49K671m196k875q930
$$ -2560 -4291 -5881 -3245 3332 2621 5219 5915 2412 3029 558 -739 -1488 1183 -3013 -5888 -14818
17912a4818r99N644M211k045m61r5m201n795n460J983J1137R367M506o371o347
$$ -14818 -15817 -10173 -5962 -8007 -8468 -8563 -12764 -18559 -24019 -22036 -10899 -1532 2974 -3397 -9744
17897i744k938L662j681N246L154k947m233l462N336N535m640q097m211O424Q667
$$ -9744 -12682 -9020 -10701 -5455 -2301 -5248 -9481 -12943 -7607 -2072 -6712 -14809 -19020 -12596 -3929
17882c929j732n84M496l599N820L154M287k364n648m12p693M472J658l478R80
$$ -3929 -5661 -6245 -1749 -5348 472 3626 7913 5549 -99 -511 -8204 -3732 -2074 -5552 -4572
17867d572K422k310q422J656L713p38k833n205j862k113k41Q925J1415P782p865
$$ -4572 -2150 -4460 -12882 -11226 -7513 -8251 -11084 -16289 -18151 -20264 -20505 -11580 -165 7617 -248
17852b48j1336j059N666j913Q865R803P033o368n905j3043J62L171q52n73q11
$$ -248 -11584 -12643 -6977 -8890 -25 9778 16811 10443 4538 -8505 -8343 -5172 -6024 -6597 -7408
17837g408L763L588k786l426j608j734N429j697k745o377J1965Q429l04j884l171
$$ -7408 -3645 -57 -2843 -6269 -7877 -9611 -4182 -5879 -8624 -15001 -3036 5393 5089 3205 34
17822C4j337n281p75n147K517J0855j655n290m250N98K390o523L42J1892J0930
$$ 34 -1303 -6584 -7359 -12506 -9989 866 -789 -6079 -10329 -9731 -7341 -13864 -13522 -1630 9300
17807I300k121m874K217M56r080m114j378k497o952n793O249P219M972L504n162
$$ 9300 7179 2305 4522 4978 -4102 -8216 -9594 -12091 -19043 -24836 -18587 -11368 -6396 -2892 -8054
17792h054m224j106Q624k841l652K580n94r345J616Q383j744N6J412O500m006
$$ -8054 -12278 -13384 -4760 -7601 -11253 -8673 -9267 -18612 -16996 -8613 -10357 -10301 -8889 -2389 -6395
17777f395n125L409k036p624o056N003P272L52p211N610L556J841l96k572m308
$$ -6395 -11520 -8111 -10147 -17771 -23827 -18824 -11552 -11200 -18411 -12801 -9245 -7404 -7800 -10372 -14680
17762a4680P277Q293J256j680l713l476k268k569M251j266J329M402J884p288
$$ -14680 -7403 890 2146 466 -3247 -6723 -8991 -11560 -7309 -8575 -7246 -2844 -960 -8248
17748h248n689j00J268l71L044K557J91M888q919k773n04O549K262Q14K083K322
$$ -8248 -13937 -14037 -12769 -13140 -10096 -7539 -7348 -2460 -11379 -14152 -14656 -8107 -5845 -5031 -2948 -626
17732f26J411j1620n282J6626R837l51n131J709k380n030J0160L740p187K73K999
$$ -626 785 -10835 -16117 509 10346 9995 4864 6573 4193 -837 9323 13063 5876 6149 9148
17717I148M463o935n074o599L417L987J873J473Q39p295O012K949P66m226k762
$$ 9148 13611 6676 1602 -4997 -1580 2407 4280 5753 6592 -703 5309 8258 9024 4798 2036
17702B036k572j712o467J085L798r731m505N151j042j233L259O570R97K405l072
$$ 2036 -536 -2248 -8715 -7630 -3832 -13563 -18068 -12917 -13959 -15192 -11933 -5363 -4366 -1961 -5033
17687e033m126K921O264k736k827R517J590L390J785k665q173o242k729n42K463
$$ -5033 -9159 -6238 26 -2710 -5537 3980 5570 8960 10745 8080 -93 -6335 -9064 -9606 -7143
17672g143J2302L98p934m755J4357J1252r731k425p29l152k617j942R41k58n723
$$ -7143 5159 5557 -2377 -7132 7225 18477 8746 6321 5592 2440 -177 -2119 -1178 -1436 -7159
17657g159l476L030N529l321j520o34L756M657N107q64o742j849m20j1853m050
$$ -7159 -10635 -7605 -2076 -5397 -6917 -7551 -3795 862 5969 5105 -1637 -3486 -3906 -15759 -19809
17642a9809M441J1755n895l185l32K516l88m901N524N63J559M285O758j881Q19
$$ -19809 -15368 -3613 -9508 -12693 -13025 -10509 -10897 -15798 -10274 -9711 -8152 -3867 2891 1010 1829
17627A829J1641P253m296j0877q437l159l729L643N424J007o549R12O103l579
$$ 1829 13470 20723 16427 5550 -2887 -6046 -9775 -6132 -708 299 -6250 -5338 765 -2814
17613b814q275p132M54J3868J309J327O76n923p141l031M330j22J37O343R127
$$ -2814 -11089 -18221 -17767 -3899 -2590 -1263 -587 -6510 -13651 -16682 -12352 -12474 -12337 -5994 3133
17598C133J531m548m753M146m978j144N929M2q476r05M67L389R348q53k222M759
$$ 3133 4664 116 -4637 -491 -5469 -6613 -684 -642 -9118 -10023 -9556 -6167 3181 2328 106 4865
17582D865O456o82r66m714q120o058P64J513k069n59M966j874K897J688Q02J105
$$ 4865 11321 10639 9673 4959 -3161 -9219 -8455 -6942 -9011 -9570 -4604 -6478 -3581 -1893 -1091 14
17566A4K45k664M104J70J294m844m263m29l138q59k545k435L494l88j0960K435
$$ 14 259 -2405 1699 1869 3163 -1681 -5944 -6373 -9511 -10370 -12915 -15350 -11856 -12244 -23204 -20769
17550b0769K661Q440O233q855j516O590N201l112l473k655J091N248k867r93M148
$$ -20769 -18108 -9668 -3435 -12290 -13806 -7216 -2015 -5127 -8600 -11255 -10164 -4916 -7783 -8776 -4628
17535d628O075j210l645J983K007K747L522k465l173l873K41J571K20k577N375
$$ -4628 1447 237 -3408 -1425 582 3329 6851 4386 1213 -2660 -2419 -848 -628 -3205 2170
17520B170L14j695M983N641j66k6K173l014m436j251m375m10J086N702l64R97
$$ 2170 2484 789 5772 11413 11247 11221 13394 10380 5944 4693 318 -92 994 6696 6332 7329
17504G329j095j2830p385J743m436M520N627L3o60M234K023M184J05l141j706
$$ 7329 6234 -6596 -13981 -12238 -16674 -12154 -6527 -6494 -7154 -2920 -897 3287 3392 251 -1455
17489a455l560N325j55n18N627j923o075M600J308J832p32k610M00j563N257k925
$$ -1455 -5015 310 155 -363 5264 3341 -2734 1866 3174 5006 4274 1664 2064 501 5758 2833
17473B833L888k619m118L67p56o351n457L757M733M177j296p092K71O249R528
$$ 2833 6721 4102 -16 351 -405 -6756 -12213 -8456 -3723 454 -842 -7934 -7663 -1414 8114
17458H114M477m848p936K548K637m433k800j962Q009J5790k984m382O429M849
$$ 8114 12591 7743 -193 2355 4992 559 -2241 -4203 3806 19596 16612 12230 18659 23508
17444B3508K434J3625L6873K5639l1713m3125j8633j901K819Q54j4428r073M10
$$ 23508 25942 39567 76440 102079 70366 27241 8608 6707 9526 10380 -4048 -13121 -12711
17431a2711M086j400L78l20R801N828m2m891K682K959k633o303k976k166l808
$$ -12711 -8625 -10025 -9647 -9967 -166 5662 5620 729 3411 6370 3737 -2566 -5542 -7708 -11516
17416a1516l907L599J420o627R819M609N05L41K457K784L651K001J150r688k249
$$ -11516 -15423 -11824 -10404 -17031 -7212 -2603 -2098 -1757 700 3484 7135 9136 10286 598 -1651
17401a651L257o644r443l223P925J1521P411j668l536K684N587m193j5929p171
$$ -1651 1606 -5038 -14481 -17704 -9779 1742 9153 7485 3949 6633 12220 8027 -7902 -15073
17387a5073O646M365j032M574l958M418n846j4159L954J0244P901k879m936n725
$$ -15073 -8427 -4062 -5094 -520 -4478 -60 -5906 -20065 -16111 -5867 2034 -845 -5781 -11506
17373a1506M157N688k605m608J0913L708L7l166j188p134M787m174m45k418l576
$$ -11506 -7349 -1661 -4266 -8874 2039 5747 5784 2618 1430 -5704 -917 -5091 -5536 -7954 -11530
17358a1530J080M63k579P517K787N018m977p250m04L218K272k075j692M814N599
$$ -11530 -10450 -9987 -12566 -5049 -2262 2756 -2221 -9471 -9875 -6657 -4385 -6460 -8152 -3338 2261
17343B261J785j755j434o40m301l052p407O862M998l027O131K092m865N119N231
$$ 2261 4046 2291 857 217 -4084 -7136 -14543 -7681 -2683 -5710 421 2513 -2352 2767 7998
17328G998l392k520k012j083L561K784l370p360j79k614r38p3M091J415m868J267
$$ 7998 4606 2086 74 -1009 2552 5336 1966 -5394 -5573 -8187 -9125 -9198 -5107 -3692 -8560 -7293
17312g293J0105K940M740J934o56n761r226j893O440o443m907p541m41O852N001
$$ -7293 2812 5752 10492 12426 11770 6009 -3217 -5110 1330 -5113 -10020 -17561 -18002 -11150 -6149
17297f149K586m433l996p86k148M190l786N087O230N243r12j695q95j172p291
$$ -6149 -3563 -7996 -11992 -12778 -14926 -10736 -14522 -9435 -3205 2038 1126 -569 -1464 -2636 -9927
17282i927m26P50P833L433M127K289N3k295N608l485j7394l57J0339n943l93P275
$$ -9927 -10353 -9603 -1770 1663 5790 8079 8132 5837 11445 7960 -9434 -9791 548 -5395 -5788 1487
17266A487P429m136m500j305J237K028n792p707K762o39p3J378L290Q125n666
$$ 1487 8916 4780 280 -1025 212 2240 -3552 -11259 -8497 -9136 -9209 -7831 -4541 3584 -2082
17251b082K06m881j770K995M868o958OO127M421m532J397L852l295k829m404J733
$$ -2082 -1876 -6757 -8527 -5532 -664 -7622 -7616 -1489 2932 -1600 -203 3649 354 -2475 -6879 -5146
17235e146Q108k537N397R099n99l169j0066r477m823M881L04o376O272N750m868
$$ -5146 2962 425 5822 14921 14322 11153 1087 -8390 -13213 -8332 -8028 -14404 -8132 -2382 -7250
17220g250k340K901K607R237K32j717L884m492k742k997Q772M74m205q184k718
$$ -7250 -9590 -6689 -4082 5155 5387 3670 7554 3062 320 -2677 6095 6569 2364 -5820 -8538
17205h538P038Q645J554p060o85L362M723J39K652N454J268o253m776n752n052
$$ -8538 -1500 7145 8699 1639 954 4316 9039 9178 11830 17284 18552 12299 7523 1771 -3281
17190c281L563P182l820m162r98L85k921l658k174R713O942n501l246R69l292
$$ -3281 282 7464 3644 -518 -1516 -1131 -4052 -7710 -9884 -171 6771 1270 -1976 -1007 -4299
17175d299l127j209O948M670k626M386O805J020k406r138p290J721J499m696p402
$$ -4299 -7426 -8635 -1687 2983 357 4743 11548 12568 10162 1024 -6266 -4545 -3046 -7742 -15144
17160a5144M020L514r35N084P833K341R44o805j2072j663L323M065l933R33M546
$$ -15144 -11124 -7610 -8545 -3461 4372 6713 7657 852 -11220 -12883 -9560 -5495 -9428 -8495 -3949
17145c949R780K789M41j360M435n662K28J63m212r5M867L248K346o979p081L455
$$ -3949 5831 8620 9061 7701 12136 6474 6702 6865 2653 2558 7425 10673 13019 6040 -1041 2414
17129B414O743M372J014l781K444P441o82m874l889j1175n420k065l349P920P772
$$ 2414 9157 13529 14543 10762 13206 20647 19965 15091 11202 27 -5393 -7458 -10807 -2887 4885
17114D885K444O334Q329O700N823O186N436m59J1431M1765O5300J23819K35660
$$ 4885 7329 13663 21992 28692 34515 40701 46137 45678 57109 98874 164174 287993 523653
17101E23653K89945n0527l33596k04615r1660m4995k1213j6523j7812j2090j1065
$$ 523653 813598 763071 429475 224860 133200 88205 66992 50469 32657 20567 9502
17090I502m839K216M034L728N86p410q519j1326K970M004N489k815j1903N261
$$ 9502 4663 6879 10913 14641 15227 7817 -702 -12028 -9058 -5054 435 -2380 -14283 -9022
17076i022M561O192M453k400j955K82k097J71L0l685k318J612P278r45O33M547
$$ -9022 -4461 1731 6184 3784 1829 2111 14 185 215 -3470 -5788 -4176 3102 2157 2790 7337
17060G337K496j875N249j622L522k05l696o6K517K387j892m233q781q222p513
$$ 7337 9833 7958 13207 11585 15107 14902 11206 11140 13657 16044 14152 9919 1138 -7084 -14597
17045a4597M579L559J708K780Q55L050k779k885R464M045Q80m871j0626q92k192
$$ -14597 -10018 -6459 -4751 -1971 -1116 1934 -845 -3730 5734 9779 10659 5788 -4838 -5730 -7922
17030g922L078K052m547j948o26N298M047k16j381k82K849J04L870m086r844N22
$$ -7922 -4844 -2792 -7339 -9287 -9913 -4615 -568 -784 -2165 -2447 402 506 4376 290 -9554 -9032
17014i032Q322j994P859M707K37m732n594o325J30J160n172O701P296O922o542
$$ -9032 -710 -2704 5155 9862 10099 5367 -227 -6552 -6422 -5262 -10434 -3733 3563 10485 3943
16999C943j2534L731N050L440M279j735p345l957j798k780m454J884K983J071
$$ 3943 -8591 -4860 190 3630 7909 6174 -1171 -5128 -6926 -9706 -14160 -12276 -9293 -8222
16985h222N561K685O24n512J412N505r56J155l7Q91J686l656o774L372R100L081
$$ -8222 -2661 24 648 -4864 -3452 2053 1097 2252 2215 3106 4792 1136 -5638 -2266 6834 9915
16969I915j4601n045O668L382j800j645q075o625K142P826J650P809L586L510
$$ 9915 -4686 -9731 -3063 319 -1481 -3126 -11201 -17826 -15684 -7858 -6208 1601 5187 8697
16955H697M655k516m906n25J492M920M345K747r922j1172j738j777O708o372n926
$$ 8697 13352 10836 5930 5405 6897 11817 16162 18909 8987 -2185 -3923 -5700 1008 -5364 -11290
16940a1290P839J136l265p26K722j255p91L282O763Q448k496k486q831r09R21
$$ -11290 -3451 -2315 -5580 -6306 -3584 -4839 -5630 -2348 4415 12863 10367 7881 -950 -1859 -938
16925i38L449r63q750O95J395K076k522p31K532k324L845N924M31J803R943k017
$$ -938 2511 1548 -7202 -6507 -5112 -3036 -5558 -6289 -3757 -6081 -2236 3688 4119 5922 15865 13848
16909A3848n249m165l539j714q97m4M578k978k282J867j194q131P528O738O164
$$ 13848 8599 4434 895 -819 -1716 -1760 2818 -160 -2442 -575 -1769 -9900 -2372 4366 10530
16894A0530J393J316j632J506L413m88o293p148j179K033J270r12j314l519J12
$$ 10530 11923 13239 11607 13113 16526 16038 9745 2597 1418 3451 4721 3809 2495 -1024 -912
16879i12J71J951J135r230j22K888k994L33M900j142K138k514K60Q920J573k365
$$ -912 -741 1210 2345 -6885 -7007 -4119 -7113 -6780 -1880 -3022 -884 -3398 -3138 5782 7355 4990
16863D990L96j530p119j035L43K694L773J736J966K063m991j715l233n784K067
$$ 4990 5386 3856 -3263 -4298 -3955 -1261 2512 4248 6214 8277 3286 1571 -1662 -7446 -5379
16848e379Q902J0045o64k794M59p07o355M885O07l088J657k5o281K214L050l990
$$ -5379 3523 13568 12904 10110 10569 9862 3507 8392 8999 5911 7568 7543 1262 3476 6526 2536
16832B536M534r1k383o39j619J867n089l065J090J346K202K748j108j920N91M245
$$ 2536 7070 6979 4596 3957 2338 4205 -884 -3949 -2859 -1513 689 3437 2329 409 1000 5245
16816E245m006m735l222m220l385P251Q671M754K706j29n773j324L478J753l618
$$ 5245 1239 -3496 -6718 -10938 -14323 -7072 1599 6353 9059 8930 3157 1833 5311 7064 3446
16801C446r974l039o01M675O875J709J297J615n175n552O030l982m055j289k277
$$ 3446 -6528 -9567 -10168 -5493 1382 3091 4388 6003 828 -4724 1306 -2676 -6731 -8020 -10297
16786a0297R702R429o03p022o111r55N054q08o25K863J278r739L286O164j904
$$ -10297 -595 8834 8231 1209 -4902 -5857 -803 -1611 -2236 627 1905 -7834 -4548 1616 -288
16771b88M344K646k124m974j298J810m380K869k438K638l043k831M812L582m3
$$ -288 4056 6702 4578 -396 -1694 116 -4264 -1395 -3833 -1195 -4238 -7069 -2257 1325 1282
16756A282J544R25q089J194O94L584O558j977n476j822K929l915o71N49j5R53
$$ 1282 2826 3751 -4338 -3144 -2450 1134 7692 5715 239 -1583 1346 -2569 -3240 -2691 -2706 -1753
16740a753j0311k488R794L333n196n950k122P471J2842L090n545p161J15k903
$$ -1753 -12064 -14552 -4758 -1425 -6621 -12571 -14693 -7222 5620 8710 3165 -3996 -3881 -6784
16726f784Q499K147o469n356k787N98J423j609K723r80J218P677M34m510m264
$$ -6784 1715 3862 -2607 -7963 -10750 -10152 -8729 -10338 -7615 -8595 -7377 300 734 -3776 -8040
16711h040L611N727J620m757j0964j372Q059o288r62J603Q04O24j637M242O624
$$ -8040 -4429 1298 2918 -1839 -12803 -14175 -6116 -12404 -13366 -11763 -10959 -10335 -11972 -7730 -1106
16696a106N944R35m002o717l411L706k365K302J955n160P730Q774n161p185R22
$$ -1106 4838 5773 1771 -4946 -8357 -4651 -7016 -4714 -2759 -7919 -189 8585 3424 -3761 -2839
16681b839P29l354K289j578Q86L556L566n23o497l544l474K195M303M218n02l783
$$ -2839 -2110 -5464 -3175 -4753 -3867 -311 3255 2732 -3765 -7309 -10783 -8588 -4285 -67 -569 -4352
16665d352M876Rk221l278o97p61J821o43M050J958m705M900R643l006r003j879
$$ -4352 524 533 -1688 -4966 -5663 -6424 -4603 -5246 -1196 762 -3943 957 10600 7594 -1409 -3288
16649c288M775K250m938l697k801M442P939R59m82j0N260k344p876J883O824k700
$$ -3288 1487 3737 -1201 -4898 -7699 -3257 4682 5641 5159 5149 10409 8065 189 2072 8896 6196
16633F196m030j21J798L18l853l127J566j100P67M67l591o31J625P130l999m465
$$ 6196 2166 2045 3843 4161 308 -2819 -1253 -2353 -1586 -1119 -4710 -5341 -3716 3414 -585 -5050
16617e050m259N378K115n417M688K218o851O717N616J814k359j793k38J1211L494
$$ -5050 -9309 -3931 -1816 -7233 -2545 -327 -7178 -461 5155 6969 4610 2817 2579 13790 17284
16602A7284p082n163l593o209m068Q83P03k186o484Q928J4444K760k88O31P6q495
$$ 17284 10202 5039 1446 -4763 -8831 -7948 -7245 -9431 -15915 -6987 7457 10217 9929 10560 10636 2141
16586B141L24m431q079N586R09k350M280N016L623r817o50o84M105l17l355k51
$$ 2141 2465 -1966 -10045 -4459 -3550 -5900 -1620 3396 7019 -2798 -3448 -4132 -27 -344 -3699 -3950
16570c950N192N958P283M328p649k405K922k565R58O447k062j3191j0349O851
$$ -3950 1242 7200 14483 18811 11162 8757 11679 9114 10072 16519 14457 1266 -9083 -2232
16556b232N000m675p348R297P96m61q33j228k595M302n818o36K008L047J331p36
$$ -2232 2768 -1907 -9255 42 838 377 -456 -1684 -4279 23 -5795 -6431 -4423 -1376 -45 -781
16540g81N287R6o635J249L910Q7j789k992j0468j165J2184J0750L347J422j091
$$ -781 4506 4602 -2033 -784 3126 3213 1424 -1568 -12036 -13201 -1017 9733 13080 14502 13411
16525A3411j3868k749M242N332K243Q236L382r068n079k324K263L938k938j990
$$ 13411 -457 -3206 1036 6368 8611 16847 20229 11161 6082 3758 6021 9959 7021 5031
16511E031o40R651j994n573K930J1395l158o014M17l087o717J087J528M21o761
$$ 5031 4391 14042 12048 6475 9405 20800 17642 11628 12045 8958 2241 3328 4856 5277 -1484
16496a484O387J1869M488k418m094j702m63j3702j1798K354P515M195k82P9l107
$$ -1484 4903 16772 21260 18842 14748 13046 12583 -1119 -12917 -10563 -3048 1147 865 944 -2163
16481b163p652N424N276K940n719n534Q69N366L657j75k509J774J74M834N415
$$ -2163 -9815 -4391 885 3825 -1894 -7428 -6559 -1193 2464 2289 -220 1554 1728 6562 11977
16466A1977p778J88M732M807J388l607q032k149o666k929L077O500l592J853J0461
$$ 11977 4199 4387 9119 13926 15314 11707 3675 1526 -5140 -8069 -4992 1508 -2084 -231 10230
16451A0230l152o704L261O308l06k149L941l746J598r26o49k236r95N0M470K873
$$ 10230 7078 374 3635 9943 9637 7488 11429 7683 9281 8355 7706 5470 4475 4525 8995 11868
16435A1868k549j188M184m88m089k172k327K485m538m172L121O827j824j069p627
$$ 11868 9319 8131 12315 11827 7738 5566 3239 5724 1186 -2986 135 6962 5138 4069 -3558
16420c558k620j523N93O543J803j09M433M424p095l039K608P435K663J14m164
$$ -3558 -6178 -7701 -7108 -565 1238 1129 5562 9986 2891 -148 2460 9895 12558 12672 8508
16405H508r081M851j118o738k647j378L198j832J902J460J584J048n95k305K265
$$ 8508 -573 4278 3160 -3578 -6225 -7603 -4405 -6237 -4335 -2875 -1291 -243 -838 -3143 -878
16390h78L864L251m207J484N705K687J068rr258o338J72M0n319K58P565M073j981
$$ -878 2986 6237 2030 3514 9219 11906 12974 12965 3707 -2631 -2459 -2419 -7738 -7480 85 4158 2177
16373B177q484N465N829k995J296k128k721J916l625m127j796K441J0m21k888
$$ 2177 -6307 -842 4987 1992 3288 1160 -1561 355 -3270 -7397 -9193 -6752 -6742 -7163 -10051
16358a0051m27K847n829P93J797P115N390q64l557k723k538n483L396Q764K551
$$ -10051 -10478 -7631 -13460 -12667 -10870 -3755 1635 771 -2786 -5509 -8047 -13530 -10134 -1370 1181
16343A181j043L135N751o204q607j563L544J1601L781n643K483O374m712j360
$$ 1181 138 3273 9024 2820 -5787 -7350 -3806 7795 11576 5933 8416 14790 10078 8718
16329H718m292k81J489J327j96p920r253L181M131m718K640j77N04M739n071k826
$$ 8718 4426 4145 5634 6961 6765 -1155 -10408 -7227 -3096 -7814 -5174 -5351 -4847 -108 -5179 -8005
16313h005j202O090M73K816J274N89j260J408K808K654j657o474m608o910Q864
$$ -8005 -9207 -3117 -2644 172 1446 2035 775 2183 4991 7645 5988 -486 -5094 -12004 -3140
16298c140L546K078K344K259l994m609K381O318m233k054p956p710P81L88J015
$$ -3140 406 2484 4828 7087 3093 -1516 865 7183 2950 896 -7060 -14770 -13989 -13601 -12586
16283a2586R825N506K30K585j820p113o662k630O38K822m532k033l20L886O226
$$ -12586 -2761 2745 2975 5560 3740 -3373 -10035 -12665 -12027 -9205 -13737 -15770 -16090 -12204 -5978
16268e978M289L209k958k69m529m021o473K926m60N739Q246Q628P122m697n16
$$ -5978 -1689 1520 -1438 -1707 -6236 -10257 -16730 -13804 -14264 -8525 -279 8349 15471 10774 10258
16253A0258j319p76m019M452J199n215m289L711j113o233l372k030O719O454n467
$$ 10258 8939 8163 4144 8596 9795 4580 291 4002 2889 -3344 -6716 -8746 -2027 4427 -1040
16238a040n961k942m971k925J0563M650M203N143m079q93Q10k958L891M329J092
$$ -1040 -7001 -9943 -14914 -17839 -7276 -2626 1577 6720 2641 1748 2558 -400 3491 7820 8912
16223H912m928l790k775k286q3P689N528l576q755l859K843m321o473N194L002
$$ 8912 3984 194 -2581 -4867 -4950 2739 8267 4691 -4064 -7923 -5080 -9401 -15874 -10680 -7678
16208g678m738m257P941Q786j9n78m112j804O146J0779K513n847J427M126J531
$$ -7678 -12416 -16673 -8732 54 35 -543 -4655 -6459 -313 10466 12979 7132 8559 12685 14216
16193A4216p217n772P85q158l088Q435O636N845k47n096o722n10P871N028j009
$$ 14216 6999 1227 2012 -6146 -9234 -799 5837 11682 11435 6339 -383 -893 6978 12006 10997
16178A0997m033j193O267j184j0920k46J620J25J070r273Q99R177N10L918n768
$$ 10997 6964 5771 12038 10854 -66 -312 1308 1433 2503 -6770 -5871 3306 3816 7734 1966
16163A966J03N094M083m144o274l429l759K887o397o105K670N492O345m090p720
$$ 1966 2069 7163 11246 7102 828 -2601 -6360 -3473 -9870 -15975 -13305 -7813 -1468 -5558 -13278
16148a3278K021P001P712Q517R712J842n635k726N13M574O05m903o107n499k443
$$ -13278 -11257 -4256 3456 11973 21685 23527 17892 15166 15679 20253 20858 15955 9848 4349 1906
16133A906j741L125K356k92L464l68J42l359k501r21M960Q89j4836N041O193j062
$$ 1906 165 3290 5646 5354 8818 8450 8592 5233 2732 1811 6771 7660 -7176 -2135 4058 2996
16117B996j357K233l755k725L843k597n204P470L271J446r71J318p956l521j21
$$ 2996 1639 3872 117 -2608 1235 -1362 -6566 904 4175 5621 4650 5968 -1988 -5509 -5630
16102e630J01J837N291L614m006o24l504l776k985L185O00J983M883n97K773K499
$$ -5630 -5529 -3692 1599 5213 1207 583 -2921 -6697 -9682 -6497 -5897 -3914 969 372 3145 5644
16086E644k65o450j0182k511O139K315l793m498R924N206J963K072p629P89m751
$$ 5644 5379 -1071 -11253 -13764 -7625 -5310 -9103 -13601 -3677 1529 3492 5564 -2065 -1276 -6027
16071f027J063Q103R546K632k644q226J0N02l44k331J092m723n058L384P837Q34
$$ -6027 -4964 3139 12685 15317 12673 4447 4457 4959 4615 2284 3376 -1347 -6405 -3021 4816 5650
16055E650l99K538p507j0717L081N170P98N883j076R852P117n542m484K969k859
$$ 5650 5251 7789 282 -10435 -7354 -2184 -1386 4497 3421 13273 20390 14848 10364 13333 10474
16040A0474m948L576O07o578l711l35J0460P557k355l889K516M854j61P316k835
$$ 10474 5526 9102 9709 3131 -580 -915 9545 17102 14747 10858 13374 18228 18067 25383 22548
16025B2548o114o43K78O4P423O319M469Q476J0434N796J5264J6055L0287M8667
$$ 22548 16434 15791 16069 16133 23556 29875 34344 42820 53254 59050 74314 90369 120656 169323
16011A69323Q4004J55465K83990N47328Q30819K75107q58215p00555l23680j57010
$$ 169323 253327 408792 692782 1240110 2070929 2346036 1487821 787266 463586 306576
16001C06576r1638n5398l6171l2064k3707j3884o702m067O72o491j4301q142o06
$$ 306576 214938 159540 123369 91305 67598 53714 47012 42945 43617 37126 22825 14683 14077
15988A4077K740m097J762J60l746J407J991o418L888L276m298m310l916K558N07
$$ 14077 16817 12720 14482 14642 10896 12303 14294 7876 11764 15040 10742 6432 2516 5074 5581
15973E581J29M673O118k414k68M470j147k305j0714o170k408M118J1304M091k917
$$ 5581 5710 10383 16501 14087 13819 18289 17142 14837 4123 -2047 -4455 -337 10967 15058 12141
15958A2141n775n374n436L755O8N44R4l594q683J213N468K161n28n323j30M633
$$ 12141 6366 992 -4444 -689 -621 -77 17 -3577 -12260 -11047 -5579 -3418 -3946 -9269 -9399 -4766
15942d766J2452Q282o117r711l304j827l084N850M627R8L193L66l93p640o550
$$ -4766 7686 15968 9851 140 -3164 -4991 -8075 -2225 2402 2500 5693 6059 5666 -1974 -8524
15927h524j604k082J1569j707L619O696J0847o513j0829n417p191O384J541K32
$$ -8524 -10128 -12210 -641 -2348 1271 7967 18814 12301 1472 -3945 -11136 -4752 -3211 -2979
15913b979K962Q741k392p969r04k803J2902L267l689q930K866L684K82k408L782
$$ -2979 -17 8724 6332 -1637 -2541 -5344 7558 10825 7136 -1794 1072 4756 5038 2630 6412
15898F412R23m162M831M085J109J052j297r620M622N809r294l903k460M99K050
$$ 6412 7335 3173 8004 12089 13198 14250 12953 3333 7955 13764 4470 567 -1893 -1394 656
15883F56m536K218O435K637J309n645l09q899m87M394k158l802N802K966j625
$$ 656 -3880 -1662 4773 7410 8719 3074 2765 -6134 -6621 -2227 -4385 -8187 -2385 581 -1044
15868a044k026L218p63n940N647K065j981j578P317M8M376L387o198p583K945
$$ -1044 -3070 148 -615 -6555 -908 1157 -824 -2402 4915 4963 9339 12726 6528 -1055 1890
15853A890j932m422K046N170J99Q197J0716q121r198j204l769J912M160l844p851
$$ 1890 -42 -4464 -2418 2752 2951 11148 21864 13743 4545 3341 -428 1484 5644 1800 -6051
15838f051k193n744J483L928P643k47M67O748P92l332Q958K968r898l648j944
$$ -6051 -8244 -13988 -12505 -8577 -934 -1181 -714 6034 6826 3494 12452 15420 5522 1874 -70
15823g0j111P898M40n79K412L976j169n577j5953n008K164N252L162M729J199
$$ -70 -1181 6717 7157 6578 8990 12966 11797 6220 -9733 -14741 -12577 -7325 -4163 566 1765
15808A765q420r275N358J864J43k11j275J222J328M543N024P225k472k24l151
$$ 1765 -6655 -15930 -10572 -8708 -8565 -8776 -10051 -8829 -7501 -2958 2066 9291 6819 6595 3444
15793C444N296j637l885l960J69m3o67O354L95j1808O62P753L784J300n5p922
$$ 3444 8740 7103 3218 -742 -573 -616 -1283 5071 5466 -6342 -5680 2073 5857 7157 7102 -820
15777h20r68N86j417k681J491k104Q64N815J211p65k458p60m150l619R798K102
$$ -820 -1788 -1202 -2619 -5300 -3809 -5913 -5049 766 1977 1212 -1246 -2006 -6156 -9775 23 2125
15761B125J897J171l918n820L431J578r27N009o636L198N450O583J087j884o318
$$ 2125 4022 5193 1275 -4545 -1114 464 -463 4546 -2090 1108 6558 13141 14228 12344 6026
15746F026k768j940M259o66l599L025j530l945N714N129M748P14j435l66j231
$$ 6026 3258 1318 5577 4911 1312 4337 2807 -1138 4576 9705 14453 15167 13732 13366 12135
15731A2135n823m811m350N375L145m307k513J623N123L216J162L394K863j372
$$ 12135 6312 1501 -2849 2526 5671 1364 -1149 474 5597 8813 9975 13369 16232 14860
15717A4860J511n757l935l587q43K34O808J2232J2598O74q654j0223q942R3J1437
$$ 14860 16371 10614 6679 3092 2249 2483 9291 21523 34121 34795 26141 15918 6976 7069 18506
15702A8506P816J532j1594j0732m488R80l056J388N536N92n422m339q823j625
$$ 18506 26322 27854 16260 5528 1040 2020 -1036 352 5888 6480 1058 -3281 -12104 -13729
15688a3729J3778P335m643k813K823N412l08j556n699l858L424N38l56J514m113
$$ -13729 49 7384 2741 -72 2751 8163 7855 6299 600 -3258 166 704 348 1862 -2251
15673b251J966K891k86n43k429K715M638l842o452J054K204n787p36M291P875
$$ -2251 -285 2606 2320 1777 -652 2063 6701 2859 -3593 -2539 -335 -6122 -6858 -2567 5308
15658E308n00q913k099K663n15R92p536r69Q465N876M439L207M20l930N974L867
$$ 5308 4808 -4105 -6204 -3541 -4056 -3064 -10600 -11569 -3104 2772 7211 10418 10838 6908 12882 16749
15642A6749n782k925m882J346O137M35j573K898N065n65m471l261l189n881j80
$$ 16749 10967 8042 3160 4506 10643 11078 9505 12403 17468 16903 12432 9171 5982 101 -79
15627g9J84k426R58K699N390P49n482n06M292j333p42j183o665q892k26O868O440
$$ -79 105 -2321 -1363 1336 6726 7475 1993 1487 5779 4446 3704 2521 -4144 -13036 -13262 -6394 46
15610D6P146m374M65l45p455k224O001r24p286m352R36P434P627L386M835k650
$$ 46 7192 2818 3283 2938 -4517 -6741 -740 -1664 -8950 -13302 -12366 -4932 2695 6081 10916 8266
15594H266k398k341p740r066M76P791n450p773K443L778J0316Q611o517m486L487
$$ 8266 5868 3527 -4213 -13279 -12803 -5012 -10462 -18235 -15792 -12014 -1698 6913 396 -4090 -603
15579f03L498J810M532k955O23R458j419P05n917o622K225O744M901l92j814n057
$$ -603 2895 4705 9237 6282 6905 16363 14944 15649 9732 3110 5335 12079 16980 16588 14774 9717
15563I717o288n475J163j279J137M247R370o98o929l493J716K01L165l467Q02
$$ 9717 3429 -2046 -883 -2162 -1025 3222 12592 11894 4965 1472 3188 3389 6554 3087 3889
15548C889Q044j237l306l056k291P920l683k326O772L641Q122l193J0k39l383
$$ 3889 11933 10696 7390 4334 2043 9963 6280 3954 10726 14367 22489 19296 19306 19067 15684
15533A5684M354m353n994k091k197M449Q962l307q57j563L603o14r474j378m870
$$ 15684 20038 15685 9691 7600 5403 9852 18814 15507 14650 13087 16690 16076 6602 5224 354
15518C54K965J269o367N34L05K420O856K564q881o25K210R140k412j411N945n423
$$ 354 3319 4588 -1779 -1245 -940 1480 8336 10900 2019 1394 3604 12744 10332 8921 14866 9443
15502I443L742J465j805o500j789J835L494O573k795q590k973j431j387J1033
$$ 9443 13185 14650 12845 6345 4556 6391 9885 16458 13663 5073 2100 669 -718 10315
15488A0315k241n185p4O051K741m115J352o183n072K012l926K128j133j057O24
$$ 10315 8074 2889 2815 8866 11607 7492 8844 2661 -2411 -399 -4325 -2197 -3330 -4387 -3763
15473c763Q847O697J456K836j011j553m327J691o97p388Q11k449J595O655K313
$$ -3763 5084 11781 13237 16073 15062 13509 9182 10873 10176 2788 3599 1150 2745 9400 11713
15458A1713L968l930n232K730p22l640K370J49m510o633K790R280o98L114K88
$$ 11713 15681 11751 6519 9249 8527 4887 7257 7406 2896 -3737 -947 8333 7635 10749 11037
15443A1037j905K674L681J615q891n510L027m011n738K819R208O599l203n28k534
$$ 11037 9132 11806 15487 17102 8211 2701 5728 1717 -4021 -1202 8006 14605 11402 10874 8340
15428H340j602m150J1261K659j213P225n165n266k766J263N680L317j981O08R18
$$ 8340 6738 2588 13849 16508 15295 22520 17355 12089 9323 10586 16266 19583 17602 18210 19128
15413A9128k448K613L977J845n510q564k909M032k38l599q588n67N513M579j442
$$ 19128 16680 19293 23270 25115 19605 11041 8132 12164 11926 8327 -261 -828 4685 9264 7822
15398G822o852j232P82R05J69K686k92N28J818O588Q042L253r507K33j556n730
$$ 7822 970 -262 520 1425 1594 4280 3988 4516 6334 12922 20964 24217 14710 14943 13387 7657
15382G657j0391l331N580M402M273k864j021N78L870l258l582K919L819N216N181
$$ 7657 -2734 -6065 -485 3917 8190 5326 4305 4883 8753 5495 1913 4832 8651 13867 19048
15367A9048P1K855j972J815m866j1363l509j751k72K869O10n784k975N774j60
$$ 19048 19119 21974 20002 21817 16951 5588 2079 328 56 2925 3535 -2249 -5224 550 390
15352C90O292R027n08J123q465p144j477P247L621R98o729m141N519P52L355M295
$$ 390 6682 15709 15201 16324 7859 715 -762 6485 10106 11104 4375 234 5753 6505 9860 14155
15336A4155p45p132l653j27P987L664k097l105o187k717k958M260R253L08k63
$$ 14155 13410 6278 2625 2498 10485 14149 12052 8947 2760 43 -2915 1345 10598 10906 10643
15321A0643j848M047o551j191P768o905m600m601O937K720k990J643L205K499
$$ 10643 8795 12842 6291 5100 12868 5963 1363 -3238 3699 6419 3429 5072 8277 10776
15307A0776j068n68j530k041N691l505M87K676j659J331j084l252R502N738p394
$$ 10776 9708 9140 7610 5569 11260 7755 8242 10918 9259 10590 9506 6254 15756 21494 14100
15292A4100J549n832o678m062O994k828o375p104J486R670O604J868K964j813
$$ 14100 15649 9817 3139 -923 6071 3243 -3132 -10236 -8750 920 7524 9392 12356 10543
15278A0543K348q274K049L67l626K93k25R490n16k043m834l670N498K320m373
$$ 10543 12891 4617 6666 7033 3407 3700 3475 12965 12449 10406 5572 1902 7400 9720 5347
15263E347k140M766j580J488o003k761P4M230K613n987k704l984k819P123Q064
$$ 5347 3207 7973 6393 7881 1878 -883 -809 3421 6034 47 -2657 -6641 -9460 -2337 5727
15248E727M375O855j017r447p356K477N260k205n50J461K107l438K505N378l424
$$ 5727 10102 16957 15940 6493 -863 1614 6874 4669 4119 5580 7687 4249 6754 12132 8708
15233H708k880m267M461N654L161j559N51m678J769j476m948k487n227j808j191
$$ 8708 5828 1561 6022 11676 14837 13278 13829 9151 10920 9444 4496 2009 -3218 -5026 -6217
15218f217k633K714j19l47j091O026L561j814p659p050N447J2484L811J424j200
$$ -6217 -8850 -6136 -6255 -6602 -7693 -1667 1894 80 -7579 -14629 -9182 3302 7113 8537 7337
15203G337K705k965L612J683r029p716P97P138M686J609j0535m674O815P406J0356
$$ 7337 10042 7077 10689 12372 3343 -4373 -3576 3562 8248 9857 -678 -5352 1463 8869 19225
15188A9225K869p389L131k681n133M728O456k614o758n201j126J1897O698p245
$$ 19225 22094 14705 17836 15155 10022 14750 21206 18592 11834 6633 5507 17404 24102 16857
15174A6857J633O05m992l824N66j395r78J777l568p33m49l612O691l200J781R39
$$ 16857 18490 19095 14103 10279 10845 9450 8472 10249 6681 5948 5499 1887 8578 5378 7159 8098
15158H098P6L557M58n923M163m80l451K620L191j313K287j702k972L518J450o35
$$ 8098 8174 11731 12189 6266 10429 9949 6498 9118 12309 10996 13283 11581 8609 12127 13577 12942
15142A2942l905k926O362J394N999K780k518q92n576o365l406j840K179l445j417
$$ 12942 9037 6111 12473 13867 19866 22646 20128 19236 13660 7295 3889 2049 4228 783 -634
15127f34n801m627j890L455L102J0511J773o427k142j146L179O168M239k332k780
$$ -634 -6435 -11062 -12952 -9497 -6395 4116 5889 -538 -2680 -3826 -647 5521 9760 7428 4648
15112D648o559P456N413j939k543l343M920K742n656O88r85j0994Q145N381k201
$$ 4648 -1911 5545 10958 9019 6476 3133 8053 10795 5139 5827 4842 -6152 1993 7374 5173
15097E173j027M956K094n741L011j310n65M038m664l476J368L613N33p929M064
$$ 5173 4146 9102 11196 5455 8466 7156 6591 10629 5965 2489 3857 7470 8003 74 4138
15082D138P630j05p227J652j724l545O201O827m17o486L066o856L860O63l693
$$ 4138 11768 11663 4436 6088 4364 819 7020 13847 13430 6944 10010 3154 7014 7677 3984
15067C984k505n018r39L662J263o372k546N382K526M396J913r888O885L199r6
$$ 3984 1479 -3539 -4478 -816 447 -5925 -8471 -3089 -563 3833 5746 -4142 2743 5942 5846
15052E846P10K251j2299j424K408N139R076k104l189L398j475q159o85Q997J11
$$ 5846 6556 8807 -3492 -4916 -2508 2631 11707 9603 6414 9812 8337 178 -507 8490 8601
15037H601j553m995L050M364J617l143p211L245J582M35p419n847N530J404j031
$$ 8601 7048 2053 5103 9467 11084 7941 730 3975 5557 5992 -1427 -7274 -1744 -340 -1371
15022a371j11N27J691L446P409J291o370j463l23M735n54L893l088k704P224l518
$$ -1371 -1482 -955 736 4182 11591 12882 6512 5049 4726 9461 8907 12800 9712 7008 14232 10714
15006A0714l560l884N102m724j980Q685K755P85m723p874M512O03l052J261Q9
$$ 10714 7154 3270 8372 3648 1668 10353 13108 13893 9170 1296 5808 6411 3359 4620 4709
14991D709K754n912P839O977Q741J0184o838j1169p351N123m327L552k669m336
$$ 4709 7463 1551 9390 16367 25108 35292 28454 17285 9934 15057 10730 14282 11613 7277
14977G277P63Q554N511l053j676l240p219J154M758m924m91J815j887M71L973
$$ 7277 8040 16594 22105 19052 17376 14136 6917 8071 12829 7905 7414 9229 7342 7813 11786
14962A1786J653k821L289l450j713K101l281j864L363L235p78K692j147m816l169
$$ 11786 13439 10618 13907 10457 8744 10845 7564 5700 9063 12298 11520 14212 13065 8249 5080
14947E080K344q088m906O978K369K208l123M789L999l784m966o694m132K595j929
$$ 5080 7424 -664 -5570 1408 3777 5985 2862 7651 11650 7866 2900 -3794 -7926 -5331 -7260
14932g260j219Q147N178O528k774m957J409o65l899P302K380K937m602m585L054
$$ -7260 -8479 -332 4846 11374 8600 3643 5052 4387 488 7790 10170 13107 8505 3920 6974
14917F974n4n189L272L229m596N796J632p185n449O101L351L472O04k687k289
$$ 6974 6920 1731 5003 8232 3636 9432 11064 3879 -1570 4531 7882 11354 11958 9271 6982
14902F982l957p916O432M134J426m438q97K928K973M441o412k256l9J846L502
$$ 6982 3025 -4891 1541 5675 7101 2663 1766 4694 7667 12108 5696 3440 3401 5247 8749
14887H749k088o363N776J0355j617k786m995L76k354n892L940K043o052J776M471
$$ 8749 6661 298 6074 16429 14812 12026 7031 7407 5053 -839 3101 5144 -908 868 5339
14872E339M650l052k664r31K131K144K91L972m830l589m14O114O05k967N298O313
$$ 5339 9989 6937 4273 3342 5473 7617 7908 11880 7050 3461 3047 9161 9766 6799 12097 18410
14856A8410O254l128o387j291n75L694N66M054l87j648l241K040j14J504k60L985
$$ 18410 24664 21536 15149 13858 13283 16977 17543 21597 21210 19562 16321 18361 18247 19751 19491 23476
14840B3476N476J044j81p734n004j705M606n64j0853k281L342L857l623j27j33
$$ 23476 28952 29996 29815 22081 17077 15372 19978 19414 8561 6280 9622 13479 9856 9729 9596
14825I596P582p056n386L050n82K474o05L686J54K596n84m255J738J751M635o540
$$ 9596 17178 10122 4736 7786 7204 9678 9073 12759 12913 15509 14925 10670 12408 14159 18794 12254
14809A2254o936N94j779L87l19o043K636J04P705J2766m574J63n871q118o922
$$ 12254 5318 5912 4133 4520 4201 -1842 794 898 8603 21369 16795 16958 11087 2969 -3953
14794c953j698O047j376R78J4036n140R4M743N737q58l723k871P78J930L262O106
$$ -3953 -5651 396 -980 -2 14034 8894 8988 13731 19468 18610 14887 12016 12794 14724 17986 24092
14778B4092o217o329L80Q02K435p844q03n487O165O957L529k033p343m296k790
$$ 24092 17875 11546 11926 12728 15163 7319 6516 1029 7194 14151 17680 15647 8304 4008 1218
14763A218P340K510n84m046J920J531n565k120K00r071M280Q413O0M784M109q66
$$ 1218 8558 11068 10484 6438 8358 9889 4324 2204 2404 -6667 -2387 6026 6086 10870 14979 14113
14747A4113p798J62j0703m924M759L615K359J641k405n830M077O437K532p17L783
$$ 14113 6315 6477 -4226 -9150 -4391 -776 1583 3224 819 -5011 -934 5503 8035 7318 11101
14732A1101m180L06j092j08J0310L300o623j583l827j402J935M630N849O50k113
$$ 11101 6921 7227 6135 6027 16337 19637 13014 11431 7604 6202 8137 12767 18616 19266 17153
14717A7153l522o540k37n112J712R553m66m283j566j434L095P350j217J845k684
$$ 17153 13631 7091 6854 1742 3454 13007 12541 8258 6692 5258 8353 15703 14486 16331 13647
14702A3647Q49L177q563n933N41j553j363M453K725m802k036J0417K546L718K39
$$ 13647 14496 17673 9110 3177 3718 2165 802 5255 7980 3178 1142 11559 14105 17823 18062
14687A8062o336n152k453K717N987Q915P013L969n291j744l796O36M90n533j1585
$$ 18062 11726 6574 4121 6838 12825 21740 28753 32722 27431 25687 21891 22527 23017 17484 5899
14672E899L83J1762j269k069j672K622l861K670o48J151m565n725K525N604L098
$$ 5899 6282 18044 16775 14706 13034 15656 11795 14465 13817 14968 10403 4678 7203 12807 15905
14657A5905l564k206K341m45q944p95K788r77J99K539k923k528K356j342N582
$$ 15905 12341 10135 12476 12031 3087 2292 5080 4103 4302 6841 3918 1390 3746 2404 7986
14642G986M415O52R50L517P906J602j621l556j438Q784j793l106L094n380m800
$$ 7986 12401 13053 14003 17520 25426 27028 25407 21851 20413 29197 27404 24298 27392 22012 17212
14627A7212l239P615M311l58K653m224m765p580m055O79j034M13l499m663p8M399
$$ 17212 13973 21588 25899 25541 28194 23970 19205 11625 7570 8249 7215 7628 4129 -534 -612 3787
14611C787J1220O593L123k572l59R26o058j0270L38J68Q741L899o257K363L520
$$ 3787 15007 21600 24723 22151 21792 22718 16660 6390 6728 6896 15637 19536 13279 15642 19162
14596A9162L572L620rK684J037k648N332J153J692m228N752P49j1789n819J321
$$ 19162 22734 26354 26345 29029 30066 27418 32750 33903 35595 31367 37119 37868 26079 20260 21581
14581B1581Q032O615o005L491J1617J1561n202m689K150k641K544Q68M865O631
$$ 21581 29613 36228 30223 33714 45331 56892 51690 47001 49151 46510 49054 49922 54787 61418
14567F1418R344M342K898J8436K1111J6057K2447M3409O4019J05221J82804L39821
$$ 61418 70762 75104 78002 96438 117549 133606 156053 199462 263481 368702 551506 891327
14555H91327N83391Q54316N74220n97750r11636n47464k83512j59166r2707o3286
$$ 891327 1474718 2329034 2903254 2305504 1393868 846404 562892 403726 311019 247733
14545B47733m6303l6585l3404j7469q111j0985j4007J114n023j0554j3459k7709
$$ 247733 201430 164845 131441 113972 105861 94876 80869 81983 76960 66406 52947 25238
14533B5238j0027J256q242j2430q189K006L140j3798j265J2937J4480K5878J8142
$$ 25238 15211 16467 8225 -4205 -12394 -10388 -7248 -21046 -22311 -9374 5106 30984 49126
14520D9126Q999r295k460r87n173M112P249M860R2o488r609o699O0L237M396M28
$$ 49126 58125 48830 46370 45383 40210 44322 51571 56431 56523 50035 40426 33727 33787 37024 41420 41848
14504D1848n160m756l624J0m497j854J277J096k643j852L381Q359Q04m91M078
$$ 41848 36688 31932 28308 28318 23821 21967 23244 24340 21697 19845 23226 31585 32389 31898 35976
14489C5976k685q07l006m90j780l001O82J565O600L016o911k869k406n031n328
$$ 35976 33291 32484 29478 28988 27208 24207 24889 26454 33054 36070 29159 26290 23884 18853 13525
14474A3525m219K543J0683J254o985l36P04O464j458m968O2o5m576L882J0074
$$ 13525 9306 11849 22532 23786 16801 16465 17169 23633 22175 17207 17269 17204 12628 16510 26584
14459B6584M272j530K022M86m139R085J018q460p03L884P104k069J478M263J626
$$ 26584 30856 29326 31348 31834 27695 36780 37798 29338 28635 32519 39623 37554 39032 43295 44921
14444D4921j0143p943P8K041j270l057k584m139m406k560P094M323K069L510l499
$$ 44921 34778 26835 26913 28954 27684 24627 22043 17904 13498 10938 18032 22355 24424 27934 24435
14429B4435n371M149J1439j90Q21K424M494R967j388j0349r902K281o0R67O732
$$ 24435 19064 23213 34652 34462 35283 37707 42201 52168 50780 40431 30529 32810 32750 33717 40449
14414D0449o880K521j647N396n05o000K540N999j943j0598j0576q308J061O511
$$ 40449 33569 36090 34443 39839 39334 33334 35874 41873 39930 29332 18756 10448 11509 18020
14400A8020Q098J2263P329P350k860q915K037O02k389Q231M829M088R511M644
$$ 18020 26118 38381 45710 53060 50200 41285 43322 43924 41535 49766 54595 58683 68194 72838
14386G2838L06J0891J4857J6233J5090q777l5989k6909K88j4218k9723j4613j211
$$ 72838 73144 84035 98892 115125 130215 121438 85449 58540 58828 44610 14887 274 -937
14373i37j0983j9319j8966J4850K4367J6826K70r326N022J0540P567p64L859R293
$$ -937 -11920 -31239 -50205 -35355 -10988 5838 6108 -3218 1804 12344 19911 19147 23006 32299
14359C2299M835q330k134j451q883k45J7858P290P02p08l617p066J391P580J0026
$$ 32299 37134 28804 26670 25219 16336 16091 33949 41239 41941 41233 37616 30550 31941 39521 49547
14344D9547R988J739m164l295p83m929N13J404J3135R514J603k872q61P892J2869
$$ 49547 59535 61274 57110 53815 53032 48103 48616 50020 63155 72669 74272 71400 70539 78431 91300
14329I1300J8209J6872L1668O0089J13605Q5854j5221m9829p6049j6911P4479
$$ 91300 109509 126381 158049 218138 331743 417597 402376 352547 276498 259587 334066
14318C34066J52012K53099K80565P6882j7826q4033k90014k51781j50915r1244
$$ 334066 486078 739177 1019742 1096624 1078798 994765 704751 452970 302055 210811
14308B10811n4997l7039j8173j8811j1513n001o494k902Q735K359O232P572O677
$$ 210811 155814 118775 100602 81791 70278 65277 58783 55881 64616 66975 73207 80779 87456
14295H7456J0285Q193J3325L905m842N068J9623J3241j9184k6268j0010k073q297
$$ 87456 97741 105934 119259 123164 118322 123390 143013 156254 137070 110802 100792 98719 90422
14282I0422N02k354j1979j758P22j0337p378q064q133R762K3892L4150K6314O018
$$ 90422 90924 88570 76591 74833 75555 65218 57840 49776 41643 51405 75297 109447 135761 141779
14268A41779m015k5761l3975k4873k2622j6744j4931j018J5934k033r373M439
$$ 141779 137764 112003 78028 53155 30533 13789 -1142 -2160 13774 11741 2368 6807
14256F807J1486Q357j633Q761J6054J6522m575j1504j4735j1804P23J5852J6301
$$ 6807 18293 26650 25017 33778 49832 66354 61779 50275 35540 23736 24459 40311 56612
14243E6612J2086L813J882n412N968J5585J8908J1398j2432j7818R93l928j4619
$$ 56612 68698 72511 74393 68981 74949 90534 109442 120840 108408 90590 91583 87655 73036
14230G3036j8339j1866o935j776j402Q870Q036r359p837J2154K0012J1363P416
$$ 73036 54697 42831 35896 34120 32718 41588 49624 40265 32428 44582 64594 75957 83373
14217H3373l320m397j1898j7642k925J223k442m814P51R719L895o200k3368q125
$$ 83373 80053 75656 63758 46116 43191 44414 41972 37158 37909 47628 51523 45323 21955 13830
14203A3830o691k8332m2792n2188n6830n7103P4043K33205J09640K6965k911j2912
$$ 13830 7139 -21193 -63985 -116173 -173003 -230106 -156063 77142 186782 213747 210836 197924
14191A97924j3721r486k21q778k4317k1703o078m574k094K5116M0168Q162J0776
$$ 197924 184203 174717 174496 165718 141401 119698 113620 109046 106952 132068 172236 180398 191174
14178A91174O794k935r766q977O753J5005J1142J9199J0388K579m26j280L535
$$ 191174 197968 195033 185267 176290 183043 198048 209190 228389 238777 241356 240930 239650 243185
14165B43185O009r83P411O512J9713J1777l210j586O394L050r337k1434j8666
$$ 243185 249194 248211 255622 262134 281847 293624 290414 288828 295222 298272 288935 267501 248835
14152B48835p914M314K9254K6676J2685J3125P399p91J2826K3042J6020K1022
$$ 248835 240921 245235 274489 301165 313850 326975 334374 333583 346409 369451 385471 406493
14140D06493K5336K6607M178m3083o5579l7100J0340M8121O5198M4653J0288j6466
$$ 406493 431829 458436 462614 419531 353952 316852 327192 375313 440511 485164 495452 478986
14128D78986j4035L2380O3831N5900M4218L8784M2554K3572r695K73L1188O1349
$$ 478986 464951 497331 561162 617062 661280 700064 742618 766190 756495 756768 787956 849305
14116H49305Q8007Q3435M9052K0811J7402L5854L5064K4433K7975N9749N4685
$$ 849305 937312 1020747 1069799 1090610 1108012 1143866 1178930 1203363 1231338 1291087 1345772
14105A345772O6740J22764J55158J38253J11559J15524J68726K17137J86265R5639
$$ 1345772 1412512 1535276 1690434 1828687 1940246 2055770 2224496 2441633 2627898 2723537
14095B723537P1681J25216K65058M75424O79929Q53733J009691J221843J563192
$$ 2723537 2795218 2920434 3185492 3660916 4340845 5194578 6204269 7426112 8989304
14086H989304J289091J81527M04919J244031K048336K938543L779014M990075
$$ 8989304 10278395 10459922 10864841 12108872 14157208 17095751 20874765 25864840
14078B5864840O807497R888856J5572436K6647167M7533353Q4845938J37012913
$$ 25864840 32672337 42561193 58133629 84780796 132314149 217160087 354173000
14071C54173000J50493998q319331j67793519j33417996p1307141l8455607k2686406
$$ 354173000 504666998 496347667 328554148 195136152 123829011 85373404 62686998
14064F2686998j4356761j0095760p890811o225860m416691l006130k278209j703773
$$ 62686998 48330237 38234477 30343666 24117806 19701115 16694985 14416776 12713003
14056A2713003j119566o20324l73563j282735j751121j121226o39257m65419m54961
$$ 12713003 11593437 10973113 10599550 9316815 7565694 6444468 5805211 5339792 4884831
14047D884831n12272n17567m81790l84026k40253j52534j67730k23204j78647
$$ 4884831 4372559 3854992 3373202 2989176 2748923 2596389 2428659 2205455 2026808
14038B026808r2972n1307p9873j29671j12613q8155j14237j26745q7804p8378
$$ 2026808 1933836 1882529 1802656 1672985 1560372 1472217 1357980 1231235 1143431 1065053
14028A065053p9125o7788l1866N023J2606j7387l9389n9536o7185l4501q646l452
$$ 1065053 985928 918140 886274 891297 903903 886516 847127 787591 720406 685905 677259 673807
14016F73807J3024L5349L7862j2714o5055l7179K1495N4064Q5183R4748Q8098
$$ 673807 686831 722180 760042 747328 682273 645094 666589 720653 805836 900584 988682
14005I88682J59283L35117O49437R00793N31101m39663r51776p32278l97294k26902
$$ 988682 1147965 1483082 2132519 3033312 3564413 3124750 2172974 1440696 1043402 816500
13995H16500j49376r6270n3915l6586j9248p023k2837l1086l6956l3413j4938
$$ 816500 667124 570854 516939 480353 461105 454082 431245 400159 363203 329790 314852
13984C14852k5358k2217j7092j8929r280k740r375j4356j0439n006M317r178q593
$$ 314852 289494 267277 250185 231256 221976 219236 209861 195505 185066 180060 184377 175199 166606
13971A66606K473P490K929q879L470K160p365j4050j2420J350R898J6820K5856
$$ 166606 169079 176569 179498 170619 174089 176249 168884 154834 142414 143764 153662 170482 196338
13958A96338J8319k490r512q104j7228j5445j2749j549l614L172K5168O0839Q8032
$$ 196338 214657 212167 202655 194551 177323 161878 149129 147580 143966 147138 172306 233145 321177
13945C21177J72220K62647J580j43807j32493q9555m7621k1517k6452l4896k4355
$$ 321177 493397 756044 757624 613817 481324 391769 344148 322631 296179 261283 236928
13934B36928k1384j0548J476j848j1913n918p078j2747j4089j2847l416L544O723
$$ 236928 215544 204996 206472 204624 192711 186793 179715 166968 152879 140032 136616 140160 146883
13921A46883J2102J2581Q524K454j3907j5995r773N107r79q751j1104j3059r381
$$ 146883 158985 171566 180090 182544 168637 152642 142869 147976 146997 138246 127142 114083 104702
13908A04702j1537j0948j8853j0118J5235K0071R306n699K942P51n332J0858K1723
$$ 104702 93165 82217 63364 53246 68481 88552 97858 92159 95101 95852 90520 101378 123101
13895A23101J5871l029j5129j5650k463m423K796R026Q692J1565J1191R829M24
$$ 123101 138972 135943 120814 105164 102701 98278 101074 110100 118792 130357 141548 151377 151801
13882A51801q546O86K69m869r953j5207k2063l2125m1382k7589m845J2541L6383
$$ 151801 143255 143941 144210 139341 129388 114181 92118 59993 18611 -8978 -13823 -1282 35101
13869C5101K9368J8055N393q068j0470j515N649j90r269j9268m989O801Q986J5167
$$ 35101 64469 82524 87917 79849 69379 67864 73513 73323 64054 44786 39797 46598 55584 70751
13855G0751k070m938j0579q018q042j4243j2944M232J7336J7024O913J3435J4300
$$ 70751 68681 63743 53164 45146 37104 22861 9917 14149 31485 48509 55422 68857 83157
13842H3157R931N075L949R410O674L022J0849P110L332m393j0178k179O320J5803
$$ 83157 93088 98163 102112 111522 118196 121218 132067 139177 142509 138116 127938 125759 132079 147882
13828A47882J9901J8028J2959K6505K2425L4157L7157J4147M4852O8637O5583
$$ 147882 167783 185811 198770 225275 247700 281857 319014 333161 378013 446650 512233
13817E12233P1761J06446J45285K01771L15932N43225R71412J790352L219072
$$ 512233 583994 690440 835725 1037496 1353428 1896653 2868065 4658417 7877489
13808G877489M804049K871370l840845m881197k721669j382889p75206m84672
$$ 7877489 12681538 15552908 11712063 6830866 4109197 2726308 1951102 1466430
13800A466430l19813k28051j76328j36523r0805n5007m2136l0140k5588j8592
$$ 1466430 1146617 918566 742238 605715 514910 459903 417767 387627 362039 343447
13790C43447l5956m4614k2976k3835j9496j9207k5916j6153q118o181m133j549
$$ 343447 307491 262877 239901 216066 196570 177363 151447 135294 127176 120995 116862 115313
13778A15313m726L963M087J628j376j856J380R173R472j5344j5949j0463j5071
$$ 115313 110587 114550 118637 120265 118889 117033 118413 127586 137058 121714 105765 95302 80231
13765H0231k1279k4355j3912r524k4181l3568n569J3677J6031J2423Q683M607
$$ 80231 58952 34597 20685 11161 -13020 -46588 -52157 -38480 -22449 -10026 -1343 3264
13753C264P277M474P540M915p99m504j169j720K847L862R994M103K188l961O289
$$ 3264 10541 15015 22555 27470 26671 22167 20998 19278 22125 25987 35981 40084 42272 38311 44600
13738D4600J421j1919j0201p684K263j096m664o184n782M203K1932J5060l68n72
$$ 44600 46021 34102 23901 16217 18480 17384 12720 6536 754 4957 26889 41949 41581 41009
13724D1009p106m135J538q793q793m187J230k975O521k449K84n844M98M734J1248
$$ 41009 33903 29768 31306 22513 13720 9533 10763 7788 14309 11860 12144 6300 6798 11532 22780
13709B2780O230J0906O309J2115K1572L8219K2013l2016m8708k2986j0999m509
$$ 22780 29010 39916 46225 58340 79912 118131 140144 108128 59420 36434 25435 20926
13697B0926p51p900n91j066l48O471P849j382r923n522J658J3397L401j118l349
$$ 20926 20175 12275 11684 10618 10270 16741 24590 23208 13285 7763 9421 22818 26219 25101 21752
13682B1752N071M902l435K249r43n031m674q473M51K795J502k014o38L906M361
$$ 21752 26823 31725 28290 30539 29596 24565 19891 11418 11869 14664 16166 14152 13514 17420 21781
13667B1781k927j140L066M102j0193r465p39R19K68K148K231l038p635L227J240
$$ 21781 18854 17714 20780 24882 14689 5224 4485 5404 5672 7820 10051 7013 -622 2605 3845
13652C845r094J863L66M848L212l561l519k59L548O365l461l290N725J219m140
$$ 3845 -5249 -3386 -3020 1828 5040 1479 -2040 -2299 1249 7614 4153 863 6588 7807 3667
13637C667N93P63L286O757Q288L66j2728j3122r916k290Q870L945K899l270q050
$$ 3667 4260 5023 8309 15066 23354 23720 10992 -2130 -12046 -14336 -5466 -1521 1378 -1892 -9942
13622i942n036L190P092J9078K6901J1126O627n609r647N98N466k058r211k874
$$ -9942 -14978 -11788 -4696 14382 41283 52409 59036 53427 43780 44378 49844 47786 38575 35701
13608C5701j683M942j471L134J241k80o36j470m722J905O588J5723J0156O893
$$ 35701 34018 38960 37489 40623 41864 41584 40948 39478 34756 36661 43249 58972 69128 76021
13594G6021N415O569R084J7672L0853L5868M7799O5224J03979K10907L81647O39869
$$ 76021 81436 88005 97089 114761 145614 181482 229281 294505 398484 609391 991038 1630907
13582A630907Q81693L91949p61335q72840m95846k44551j33768q8110o1410m2936
$$ 1630907 2512600 2904549 2143214 1270374 774528 529977 396209 308099 246689 203753
13572B03753l8757k9968j1220k2388k2705j2858q885o44j0292l496k850l54L001
$$ 203753 164996 135028 123808 101420 78715 65857 56972 56328 46036 42540 39690 39336 42337
13559D2337o740p928q93Q57K507r874l312J289J603o47l229p803Q312J190j915
$$ 42337 35597 27669 26776 27633 30140 20266 16954 18243 19846 19199 15970 8167 16479 17669 15754
13544A5754N191O142J890O747N639j1756r603n486J284Q96J609N669J4791K3534
$$ 15754 20945 27087 28977 35724 41363 29607 20004 14518 15802 16698 18307 23976 38767 62301
13530F2301L6875O7846P8313j6642p9750o2189k8560j4227o064n083m316l289
$$ 62301 99176 167022 245335 228693 148943 86754 58194 43967 37903 32820 28504 25215
13518B5215p204k421m553j845K904O23m687m897M596P496k205j2793o718L645
$$ 25215 18011 15590 11037 9192 12096 12719 8032 3135 7731 15227 13022 229 -6489 -2844
13504b844O038M583l486K26M791N011m14j1749r561N442R522l524p34J4311O965
$$ -2844 3194 7777 4291 4517 9308 14319 13905 2156 -7405 -1963 7559 4035 3301 17612 24577
13489B4577p064k292m699L999q42l581M627q69o305R155m824k030n608L41K283
$$ 24577 17513 15221 10522 14521 13679 10098 14725 13856 7551 16706 11882 9852 4244 4585 6868
13474F868N135l522L083K145l70r75j603p395n442p83L879K681n506K9L64M562
$$ 6868 12003 8481 11564 13709 13339 12364 10761 3366 -2076 -2859 1020 3701 -1805 -1776 -1412 3150
13458C150L128J025N95j739P82M468N34j488j161l77l149N390L901L105L607j45
$$ 3150 6278 7303 7898 6159 6941 11409 11943 10455 9294 8917 5768 11158 15059 18164 21771 21626
13442B1626m505m012Q66L29J301q653n02K792n919L772j267l930N493j674p744
$$ 21626 17121 13109 13975 14304 15605 6952 6450 9242 3323 7095 5828 1898 7391 5717 -2027
13427b027o93L289L445o016l667l998K513N163J321L363P518j041n821l989L874
$$ -2027 -2720 569 4014 -2002 -5669 -9667 -7154 -1991 -670 2693 10211 9170 3349 -640 3234
13412C234Q620L077L109k376K110N361l172p312m413J175M894L87o733q189k864
$$ 3234 11854 14931 18040 15664 17774 23135 19963 12651 8238 9413 14307 14694 7961 -228 -3092
13397c092L324N677m460j788J942K462j856M819O950n891m374M25K54K343P520
$$ -3092 232 5909 1449 -339 1603 4065 2209 7028 13978 8087 3713 4138 4392 6735 14255
13382A4255l762l970J557j955k931k18k478M023K893P38K797k937L35L678l729
$$ 14255 10493 6523 8080 6125 3194 2976 498 4521 7414 8152 10949 8012 8347 12025 8296
13367H296o450j125l530m023p107N506R845l017m138J2164K894l221L726P91m764
$$ 8296 1846 721 -2809 -6832 -13939 -8433 1412 -1605 -5743 6421 9315 6094 9820 10611 5847
13352E847J641N290k997Q36O56j3039m244Q565J0654j273m082m17J586K984J660
$$ 5847 7488 12778 9781 10617 11273 -1766 -6010 2555 13209 11936 7854 7437 9023 12007 13667
13337A3667M268k101q733m510k219J2196J0356l279l370k983j0618O22M253J0870
$$ 13667 17935 15834 7101 2591 372 12568 22924 19645 16275 13292 2674 3296 7549 18419
13323A8419N072O800K4205K8144J685j8983j8666j7477o735M401m015j567k079
$$ 18419 23491 30291 54496 82640 84325 65342 46676 29199 22464 26865 22850 21283 19204
13310A9204l499K855N879L302o190m768k670m076m04m617J330Q610Q400P773K27
$$ 19204 15705 18560 24439 27741 21551 16783 14113 10037 9633 5016 6346 14956 23356 31129 31356
13295C1356j617L838k171j0231k44o194K69M785o264K613P210K182q37n433m720
$$ 31356 29739 33577 31406 21175 20931 14737 15006 19791 13527 16140 23350 25532 24695 19262 14542
13280A4542K700J529l449O310K744Q300N182K019M207K565K030J2748J3487J184
$$ 14542 17242 18771 15322 21632 24376 32676 37858 39877 44084 46649 48679 61427 74914 76098
13266G6098M754J5467N946J6487K2273M741o321K238M17O051J5501K1317K0537
$$ 76098 80852 96319 102265 118752 141025 145766 139445 141683 142100 148151 163652 184969 205506
13253B05506K3333L2149L9735P0935R5539O3092M0908Q1205J16760J72753K68532
$$ 205506 228839 260988 300723 371658 467197 530289 571197 652402 769162 941915 1210447
13242A210447M35022P11994J255090K318174M316996P196910O880396l934239
$$ 1210447 1645469 2357463 3612553 5930727 10247723 17444633 24325029 20390790
13234B0390790q513183m977987k462232j340087q08936n36985l78377k82860k04996
$$ 20390790 11877607 6899620 4437388 3097301 2288365 1751380 1373003 1090143 885147
13225H85147j26158o2393l6132n3456r4220q6254o3192m7040l0083j8032j5151
$$ 885147 758989 696596 660464 607008 512788 426534 363342 316302 286219 268187 253036
13214B53036j1164m53R671K4098M2478J09126K19088L26945R5804l63673k87549
$$ 253036 241872 241419 251090 275188 317666 426792 645880 972825 1068629 704956 417407
13203D17407j30895o9917m2481k9795j8816j8372k1195j1958j682o66m829o668
$$ 417407 286512 216595 174114 144319 125503 107131 85936 73978 72296 71630 66801 60133
13191F0133o873k717O62j68l164l381m570p671j1494M281J928j87k573k076n18
$$ 60133 53260 50543 51205 51037 47873 44492 39922 32251 20757 25038 26966 26779 24206 22130 21612
13176B1612M194Q75O204O153K817m437j417J569L743l846K514N311k09M55J1147
$$ 21612 25806 26681 32885 39038 41855 37418 36001 37570 41313 37467 39981 45292 45083 45538 56685
13161E6685n943o041J353L177j932m379R630K1437K4929L5123R200m8444m1703
$$ 56685 50742 44701 46054 49231 47299 42920 52550 73987 98916 134039 143239 94795 53092
13148E3092j7267o708j443j88N83l861j788k918K089K155q42j927J021Q731K502
$$ 53092 35825 29117 27674 27486 28069 24208 22420 19502 21591 23746 22904 20977 21998 30729 33231
13133C3231j2265p343l425J613j202j476M20k344l76J2849k738l78j86J075r16
$$ 33231 20966 13623 10198 11811 10609 9133 9553 7209 6833 19682 16944 16566 16380 17455 16539
13118A6539K132J68N958n355p249N084m07p150Q915J7240m05o81m104j1035j375
$$ 16539 18671 18839 24797 19442 12193 17277 16870 9720 18635 35875 35470 34789 30685 19650 18275
13103A8275K76K020p566j198L955M01p251K32k908J495M710J697l04j305j0499
$$ 18275 18551 20571 13005 11807 15762 16163 8912 9144 6236 7731 12441 14138 13834 12529 2030
13088B030K941M799j274j501L65N120M401j555J3n912l242N936P213m663l389
$$ 2030 4971 9770 8496 6995 7360 12480 16881 15326 15339 9427 6185 12121 19334 14671 11282
13073A1282j332r31M912N169J154J053q315j893J503m438j1101K25R434M70J117
$$ 11282 9950 9019 13931 19100 20254 21307 12992 11099 12602 8164 -2937 -2712 6722 7192 8309
13058H309K540m96K361j92N484l406k232K190j034j0L201O869O614J4664J4083
$$ 8309 10849 10353 12714 12522 18006 14600 12368 14558 13524 13514 16715 23584 30198 44862 58945
13043E8945M952k2310j5964j586n228o056K45j845L855K211K025L270k180n375
$$ 58945 63897 41587 25623 24037 18809 12753 12998 11153 15008 17219 19244 22514 20334 14959
13029A4959J021J632P545o270n652n912J940m962L395Q395O297k625J803l251
$$ 14959 15980 17612 25157 18887 13235 7323 9263 4301 7696 16091 22388 19763 21566 18315
13015A8315K574L903j872m49R597J0346P138J5040J4008J6774M8467J14116J88020
$$ 18315 20889 24792 22920 22471 32068 42414 49552 64592 78600 95374 143841 257957 445977
13002D45977K69833Q6801k65569k35186j09130n6658l1357k0178j6777q833j0586
$$ 445977 715810 802611 537042 301856 192726 136068 104711 84533 67756 58923 48337
12991D8337j61K606N364j3549r954l810J80n280r500J249J744Q9N767o377j1053
$$ 48337 48176 50782 56146 42597 32643 28833 29013 23733 14233 15482 17226 17315 23082 16705 5652
12976E652J524N135j698j956M738L755L124K020p32n787L701L243o107J116p236
$$ 5652 7176 12311 10613 8657 13395 17150 20274 22294 21562 15775 19476 22719 16612 17728 10492
12961A0492j121K480K913m53L008Q511j071o889J024k099N346M08o153o264l162
$$ 10492 9371 11851 14764 14311 17319 25830 24759 17870 18894 16795 22141 22549 16396 10132 6970
12946F970L800M000L135j037O644m292k453N146R163l268L741J3275K21O17R653
$$ 6970 10770 14770 17905 16868 23512 19220 16767 21913 31076 27808 31549 44824 45045 45662 55315
12931E5315J0834J1414K2278K5685N0522Q8807J71897L03273N03622N24438k97231
$$ 55315 66149 77563 99841 125526 176048 264855 436752 740025 1243647 1768085 1470854
12920A470854o31949l56828j68713r0803m8053l4773k7296k4283j8117l663M649
$$ 1470854 838905 482077 313364 222561 174508 139735 112439 88156 70039 66376 71025
12909G1025m547n601l638p941n427K540o605j2795p400Q412K383k754N55n380
$$ 71025 66478 60877 57239 49298 43871 46411 39806 27011 19611 28023 30406 27652 28207 22827
12895B2827L890K126l732o191K878J353j231m174r70J526M974O13L453j140j185
$$ 22827 26717 28843 25111 18920 21798 23151 21920 17746 16776 18302 23276 23889 27342 26202 25017
12880B5017n98n103J105n69m396o051m36P954r17O457J4789j170k89P27l799q168
$$ 25017 24419 19316 20421 19852 15456 9405 8969 16923 16006 22463 37252 36082 35793 36520 32721 24553
12864B4553k584M279n581n066N578p583n722M770O278m176Q126N80n306l19J241
$$ 24553 21969 26248 20667 15601 21179 13596 7874 12644 18922 14746 22872 23452 18146 17827 19068
12849A9068O263K429K992l82l497o005l506o5L847J5114L600m514K689m295m600
$$ 19068 25331 27760 30752 30370 26873 20868 17362 17297 21144 36258 39858 35344 38033 33738 29138
12834B9138k555m42L994m192n753O46m34J595O354k05L854M794J278M728J595
$$ 29138 26583 26141 30135 25943 20190 20836 20402 21997 28351 28146 32000 36794 38072 42800 44395
12819D4395j003L825O291N472M122L703j856m737J0048J7043J7195J1253J0485
$$ 44395 43392 47217 53508 58980 63102 66805 64949 60212 70260 87303 104498 115751 126236
12806A26236K0739L6050L6699M0674O8323J11911J84139L24543O15198J170940
$$ 126236 146975 183025 219724 260398 328721 440632 624771 949314 1564512 2735452
12796B735452K066229K316032q76024k655878j546388p31625l92506k30633j46125
$$ 2735452 4801681 7117713 6241689 3585811 2039423 1307798 915292 684659 538534
12787E38534j04075q9632o1040m0015l0685k1253k1546k2369j5351p809m780o190
$$ 538534 434459 344827 283787 243772 213087 191834 170288 147919 132568 124759 119979 113789
12775A13789m443j1128p270O18N64n774n115P52J497P054q79m356J4773K1878
$$ 113789 109346 98218 90948 91566 92130 86356 81241 81993 83490 90544 89665 85309 100082 121960
12761A21960L7660K5327l4541l5861k9862j8464m493m619o37N13L704K462m38
$$ 121960 159620 184947 150406 114545 84683 66219 61726 57107 56470 56983 60687 63149 62711
12748F2711O018j200O82k055n698L216R291N965k834l046O18P56J576l751o651
$$ 62711 68729 67529 68211 66156 60458 63674 72965 78930 76096 73050 73668 74424 76000 72249 65598
12733F5598M895P742L418r66m878n303l057o995j127k971p9N65L485P034k924
$$ 65598 70493 78235 81653 80687 75809 70506 67449 60454 59327 56356 56277 56842 60327 67361 64437
12718F4437n59L410O695P461J407o512m95Q47L060O235l683n376l165Q50N930
$$ 64437 63878 67288 73983 81444 82851 76339 75844 76691 79751 85986 82303 76927 73762 74612 80542
12703H0542R604P175O329J2148K2904K6110J7334k1558k4936k2142j0929p770
$$ 80542 90146 97321 103650 115798 138702 164812 182146 160588 135652 113510 102581 94811
12691I4811L17M339M157r836j1626k144R840L434l631J90o15K400R558J848L477
$$ 94811 95128 99467 103624 93788 82162 80018 89858 93292 89661 89851 89236 91636 101194 103042 106519
12676A06519k249l349L362J2698N471k365n154N995K672K58j787O49n324o31j161
$$ 106519 104270 100921 104283 116981 122452 120087 114933 120928 123600 123858 122071 122720 117396 116765 115604
12661A15604%L693O760J551J22l90R42P767M683j518M644L963K611K472R933J5408
$$ 115604 115604 119297 126057 127608 127730 127340 128282 136049 140732 139214 143858 147821 150432 152904 162837 178245
12645A78245K1718K860j8021j1804j1984l075l572q612p22n1k049M363N422R2
$$ 178245 199963 202823 184802 172998 161014 157939 154367 145755 145033 144982 142933 147296 152718 152810
12631A52810k557K615R349N879Q30l592k088M388l246p867p99M608k349M948M313
$$ 152810 150253 152868 162217 168096 168926 165334 163246 167634 164388 156521 155722 160330 157981 162929 167242
12616A67242p87N996K15P041O187n260K659N398k27j2274j0769K826m027j013
$$ 167242 166455 172451 172666 179707 185894 180634 183293 188691 188464 176190 165421 168247 164220 163207
12602A63207p214j989l482q395m650J1499P521j2751o531O634Q477K278N16j0146
$$ 163207 155993 154004 150522 142127 137477 148976 156497 143746 137215 143849 152326 154604 155120 144974
12588A44974p37j573l060k291j875j93K483N016N203N318o656n662L730J235k219
$$ 144974 144237 142664 139604 137313 135438 135245 137728 142744 147947 153265 146609 140947 144677 145912 143693
12573A43693N477L712Q065o464q857q560l596l626k617r028K294M387K20K540
$$ 143693 149170 152882 160947 154483 145626 137066 133470 129844 127227 118199 120493 124880 125100 127640
12559A27640m130q824m789o643J920O055M139m014o771k86j77K54k106n640Q83
$$ 127640 123510 114686 109897 103254 105174 111229 115368 111354 104583 104297 104120 104374 102268 96628 97511
12544I7511m118J32l743m24L261K20Q3n955l545M404Q169N054m817N378L56r300
$$ 97511 93393 93525 89782 89358 92619 92839 92922 86967 83422 87826 95995 101049 96232 101610 101966 92666
12528I2666j698n638n503J392p601m514m17Q505R540L75J246Q6m530j0655n895
$$ 92666 90968 85330 79827 81219 73618 69104 68687 77192 86732 87107 88353 88439 83909 73254 67359
12513F7359P58k322j782m408p973O679M790n630m0n89K968M152j0567o766L638
$$ 67359 68117 65795 64013 59605 51632 58311 63101 57471 57431 56842 59810 63962 53395 46629 50267
12498E0267L99j927k841N711O450J184j580j786O02m167l424j008N67l36R89k016
$$ 50267 50666 48739 45898 51609 58059 59243 57663 55877 56479 52312 48888 47880 48447 48111 49100 47084
12482D7084m750K95Q23K059p12j987r57P626M388J778m598n872K130j604k356
$$ 47084 42334 42629 43452 45511 44799 42812 41855 49481 53869 55647 51049 45177 47307 45703 43347
12467D3347l58m107k33P092K759l544j891p497j902j28o38K538L94K525q713L133
$$ 43347 42989 38882 38649 45741 48500 44956 43065 35568 33666 33538 32900 35438 35832 38357 29644 32777
12451C2777R456L077l786p293p701O132R740Q030J23o446K531l87l086l439l99
$$ 32777 42233 45310 41524 34231 26530 32662 42402 50432 50555 44109 46640 46253 43167 39728 39329
12436C9329K700K01j427o370k021k253K596M808K242j1993l530N976k019m061
$$ 39329 42029 42230 40803 34433 32412 30159 32755 37563 39805 27812 24282 30258 28239 24178
12422B4178j186j480O445m73M324n187k418j063N984J7214J7608J2361k2684j2009
$$ 24178 22992 21512 27957 27484 31808 26621 24203 23140 29124 46338 63946 76307 53623 41614
12408D1614p748p110q5J406M151l57n725k331N823m000j671j589L136j053j854
$$ 41614 33866 26756 26671 28077 32228 31871 26146 23815 29638 25638 23967 22378 25514 24461 22607
12393B2607N594P868J408j0373r569j166M104J679N485Q787n378K482M195l908
$$ 22607 28201 36069 37477 27104 17535 16369 20473 22152 27637 36424 31046 33528 37723 33815
12379C3815K962n491l30j996j1426L77M013j12J418O927M118n387j0125n475m777
$$ 33815 36777 31286 30956 28960 17534 17911 21924 21812 23230 30157 34275 28888 18763 13288 8511
12364H511q09K861R585M791l148n523j674K731J3922K61j767n748N255O271p437
$$ 8511 7702 10563 20148 24939 21791 16268 14594 17325 31247 31508 29741 23993 29248 35519 28082
12349B8082J254p69J579l553N47n900j136j62n528k276M61J688K958l6L743J243
$$ 28082 29336 28567 30146 26593 27140 21240 20104 19942 14414 12138 12599 14287 17245 17209 20952 22195
12333B2195p943q43M917M406l119l680k337P833K167l497K986J0474J2209R903
$$ 22195 14252 13409 18326 22732 19613 15933 13596 21429 23596 20099 23085 33559 45768 55671
12319E5671m380j4216j1676n66m122o824q586l425O413J0214K031M0p124K795
$$ 55671 51291 37075 25399 24833 20711 13887 5301 1876 8289 18503 20534 20574 13450 16245
12305A6245K14M542m654k539R10o128k730j705J740Q04J536n591l07N136N745
$$ 16245 16459 21001 16347 13808 14718 8590 5860 4155 5895 6699 8235 2644 2337 7473 13218
12290A3218K107m076j360K196M862p154p282K923P063J053k139M740K972m65J485
$$ 13218 15325 11249 9889 12085 16947 9793 2511 5434 12497 13550 11411 16151 19123 18658 20143
12275B0143o480J659J896N92l833m061l374m340j74O229J345k553k431N995M922
$$ 20143 13663 15322 17218 17810 13977 9916 6542 2202 2028 8257 9602 7049 4618 10613 15535
12260A5535L662P19o705j116J493J733p68o465N495k902n645o363L23P59N870
$$ 15535 19197 19916 13211 12095 13588 15321 14553 8088 13583 10681 5036 -1327 -1004 -245 5625
12245E625M145r9j0192J429O956P54o34l731K198J1074j532l317p694j538J896
$$ 5625 9770 9671 -521 908 7864 8618 7984 4253 6451 17525 15993 12676 4982 3444 5340
12230E340Q373L411n742j0420N68O628Q6q51m190J843M684O354m067j980N89k844
$$ 5340 13713 17124 11382 962 1530 8158 8244 7393 3203 5046 9730 16084 12017 10037 10626 7782
12214G782Q414L588l099n25l06J312k405J737K208Q596m656n854N28k814M379
$$ 7782 16196 19784 16685 16160 15854 17166 14761 16498 18706 27302 22646 16792 17320 14506 18885
12199A8885J958j312K147q70k846K441M32N576o589N76O478O821j217K289K392
$$ 18885 20843 19531 21678 20808 17962 20403 20835 26411 19822 20398 26876 33697 32480 34769 37161
12184C7161l6O276J1652J4509J0684N429J061J0086P688J2051J4078K4661L3714
$$ 37161 37125 43401 55053 69562 80246 85675 86736 96822 104510 116561 130639 155300 189014
12171A89014N2035P8509J27230K38995M21347P76038J319310J569207L98133j346092
$$ 189014 241049 319558 446788 685783 1107130 1883168 3202478 4771685 5169818 3823726
12161C823726j543222r11563m71079k62311j56936j07182p6988o1056m5727k4498
$$ 3823726 2280504 1368941 897862 635551 478615 371433 294445 233389 187662 163164
12151A63164k0259k0391q975r435r704n167j4352o987o757n181n194k940p258
$$ 163164 142905 122514 113539 104104 94400 89233 74881 67894 61137 55956 50762 47822 40564
12138D0564r32m196N165M52j300o179j599L996L158P29m641k894l601j0550K814
$$ 40564 39632 35436 40601 41053 39753 33574 31975 35971 39129 39858 35217 32323 28722 18172 20986
12123B0986J796K420J730K185q758K244N211K926J0996L434j1295j0470j836m466
$$ 20986 22782 25202 26932 29117 20359 22603 27814 30740 41736 45170 33875 23405 21569 17103
12109A7103j797J000j66Q157k226j2737n027L569L180n46N25K944J653q71n09
$$ 17103 15306 16306 16140 24297 22071 9334 4307 7876 11056 10510 11035 13979 15632 14761 14252
12094A4252l891m718l24Q410N178m827m913m696l008n820K277J0374K804k01N91
$$ 14252 10361 5643 5319 13729 18907 14080 9167 4471 1463 -4357 -2080 8294 11098 10897 11488
12079A1488n606n326j308j203L493Q6L196j533K890J285k903O33O283M5m942l307
$$ 11488 5882 556 -752 -1955 1538 1624 4820 3287 6177 7462 4559 5192 11475 11520 6578 3271
12063C271O408J1324m085o220m553M136L902n602m962m853l483j14P658K208j404
$$ 3271 9679 21003 16918 10698 6145 10281 14183 8581 3619 -1234 -4717 -4831 2827 5035 3631
12048C631N548L272J716K173o012m998l048M151p66J627j29K252M464P09r85l998
$$ 3631 9179 12451 14167 16340 10328 5330 2282 6433 5667 7294 7165 9417 13881 14590 13605 9607
12032I607j56j385j862r75l325k787L072K389J979k374P65l02J078m877l815O160
$$ 9607 9451 8066 6204 5229 1904 -883 2189 4578 6557 4183 4948 4646 5724 847 -2968 3192
12016C192P942n7j899k139J3184R373l086n435j1319M949p00k229n315J816l78
$$ 3192 11134 11077 9178 7039 20223 29596 26510 21075 9756 14705 14005 11776 6461 8277 7899
12001G899k382k563L233q844j1218l855P683O318m413j174k27P623Q936P50r26
$$ 7899 5517 2954 6187 -2657 -13875 -17730 -10047 -3729 -8142 -9316 -9543 -1920 7016 7766 6840
11986F840l734o578J67j717K216O676L309J695K588r786j663R74l258k625O637
$$ 6840 3106 -3472 -3305 -5022 -2806 3870 7179 8874 11462 1676 13 987 -2271 -4896 1741
11971A741l352M438J1709m958m48K28N26n207Q58O33L482p352m738j419j349M188
$$ 1741 -1611 2827 14536 9578 9130 9358 9884 4677 5535 6168 9650 2298 -2440 -3859 -5208 -1020
11955a020m84K790O879l861P2j088M866l688j266K82M622J193M469M027M597j63
$$ -1020 -1504 1286 8165 4304 4376 3288 8154 4466 3200 3482 8104 9297 13766 17793 22390 22227
11939B2227L59n005j69l917r602l215j014Q971L876m640j157J020R130j720m771
$$ 22227 22586 17581 17412 13495 3893 678 -336 8635 12511 7871 6714 7734 16864 15144 10373
11924A0373j368J50o832K223R69M59J364L021q843j049K522O642J799n527n992
$$ 10373 9005 9155 2323 4546 5515 5974 7338 10359 1516 467 2989 9631 11430 5903 -89
11909h9l511J1285N908n907j3879M149j72p758O116J5428J279j2355R46O63R618
$$ -89 -3600 7685 13593 7686 -6193 -2044 -2216 -9974 -3858 11570 12849 494 1440 2103 11721
11894A1721o979j0578N769R363K719q303l326p27J833L382L866l465q716J300
$$ 11721 4742 -5836 -67 9296 12015 3712 386 -341 1492 4874 8740 5275 -3441 -2141
11880b141R753N988K201n816k899J322J0243N375l435r784m883r160K65P246l907
$$ -2141 7612 13600 15801 9985 7086 8408 18651 24026 20591 10807 5924 -3236 -2971 4275 368
11865C68m357J733J0080L21j802q18k63l447p739K6L844p744J503J125j508P11
$$ 368 -3989 -2256 7824 8145 6343 5525 5262 1815 -5924 -5898 -2054 -9798 -8295 -7170 -8678 -7967
11849g967K96O957N082J15m52k705j207l362L417p7m01K856j868N382j8Q90j489
$$ -7967 -7671 -714 4368 4483 4031 1326 119 -3243 174 97 -304 2552 684 6066 6048 6938 5449
11832E449k610M567P78o978O039L74M157L72K57L23K16M48n239m997J447k669
$$ 5449 2839 7406 8184 1206 7245 7619 11776 12148 12405 12728 12944 13392 8153 3156 4603 1934
11816A934K05m530l663K09R75k230j342L930K616O762m67m03L195L525n880m673
$$ 1934 2139 -2391 -6054 -5845 -4870 -7100 -8442 -4512 -1896 4866 4399 3996 7191 10716 4836 163
11800A63n420j042O132O760K843p408n073n534l002O1j904j418K210M234N775
$$ 163 -5257 -6299 -167 6593 9436 2028 -3045 -8579 -11581 -11520 -13424 -14842 -12632 -8398 -2623
11785b623M662l985k653j76o732P709N267J755k153m524k552L274j013k773n68
$$ -2623 2039 -1946 -4599 -4775 -11507 -3798 1469 3224 1071 -3453 -6005 -2731 -3744 -6517 -7085
11770g085M562J18l33o595K869L647j606m516K577J0659j078M55k824l926j251
$$ -7085 -2523 -2405 -2738 -9333 -6464 -2817 -4423 -8939 -6362 4297 3219 3674 850 -3076 -4327
11755d327O10K962K310j688j236M154J335m120J569m016K167K607l106p047j201
$$ -4327 -3717 -755 1555 -133 -1369 2785 4120 0 1569 -2447 -280 2327 -779 -7826 -9027
11740i027M433l697l3K007r94M175O65n8O754O08M167O175n641p311l424K412
$$ -9027 -4594 -8291 -8324 -6317 -7311 -3136 -2471 -2529 4225 4833 9000 15175 9534 2223 -1201 1211
11724A211L925q58J545m107j478j360j131M19L95k521R683J5147P395P550j346
$$ 1211 5136 4278 5823 1716 238 -1122 -2253 -1834 -1439 -3960 5723 20870 28265 35815 34469
11709C4469L49q773j5040k598j545P383n721l365R86n125p363L298j876n638j866
$$ 34469 34818 26045 11005 8407 6862 14245 8524 5159 6145 1020 -6343 -3045 -4921 -10559 -12425
11694a2425Q277R266j124k661k831k334K007L895k988R6O409K189n523j252O499
$$ -12425 -4148 5118 3994 1333 -1498 -3832 -1825 2070 -918 -822 5587 7776 2253 1001 7500
11679G500N319P82n740o184n534m836p019J470L404M383j785p43L53j034K771
$$ 7500 12819 13601 7861 1677 -3857 -8693 -15712 -14242 -10838 -6455 -8240 -8983 -8630 -9664 -6893
11664f893N109R201q547r464L533K541j247j313n36J226o41K241j772k926M885
$$ -6893 -1784 7417 -1130 -10594 -7061 -4520 -5767 -7080 -7616 -6390 -7031 -4790 -6562 -9488 -4603
11649d603R149N67l752j867J197j065J347J257j679k79k007k362j213j423n613
$$ -4603 4546 5113 1361 -506 691 -374 973 2230 551 272 -1735 -4097 -5310 -6733 -12346
11634a2346J399m97r11K06O763p40k131L326K527o425l232j865O367K914j983
$$ -12346 -10947 -11444 -12355 -12149 -5386 -6126 -8257 -4931 -2404 -8829 -12061 -13926 -7559 -4645 -6628
11619f628o443l397n822N478O896J401J861l820O476J375k268J546M567J437o774
$$ -6628 -13071 -16468 -22290 -16812 -9916 -8515 -6654 -10474 -3998 -2623 -4891 -3345 1222 2659 -4115
11604d115m328m350P770N550N490K285m216l676O417j042j104r470j830O577o54
$$ -4115 -8443 -12793 -5023 527 6017 8302 4086 410 6827 5785 4681 -4789 -6619 -42 -696
11589f96n335o432J267Q628J2185K116p238m497N98K207l605M99j266k812N481
$$ -696 -6031 -12463 -11196 -2568 9617 11733 4495 -2 596 2803 -802 -303 -1569 -4381 1100
11574A100O261J567K883r174J73M617l734n575n420N319N123O277j526j356K035
$$ 1100 7361 8928 11811 2637 2810 7427 3693 -1882 -7302 -1983 3140 9417 7891 6535 8570
11559H570p36K470J29O37k896L630p629j0031m126k717r5L50Q902L95P758N903
$$ 8570 7834 10304 10433 11070 8174 11804 4175 -5856 -9982 -12699 -12794 -12444 -3542 -3147 4611 10514
11543A0514k466m703j133M666M76l503L418n526o060L956K394j329l685l493K452
$$ 10514 8048 3345 2212 6878 7354 3851 7269 1743 -4317 -361 2033 704 -2981 -6474 -4022
11528d022o416M807L525J239J275L806n787k925L585O735j470k709o933L34N174
$$ -4022 -10438 -5631 -2106 -867 408 4214 -1573 -4498 -913 5822 4352 1643 -5290 -4956 218
11513B18R149J752J076m256n720L654M205J29o496n919M070J900n850l013P396
$$ 218 9367 11119 12195 7939 2219 5873 10078 10207 3711 -2208 1862 3762 -2088 -5101 2295
11498B295J695j117m670M45k98K503j564N44j738m556l614J727K128K369o457
$$ 2295 3990 2873 -1797 -1352 -1650 853 -711 -167 -1905 -6461 -10075 -8348 -6220 -3851 -10308
11483a0308k250j524M113L796Q529l449m004O16l774k929o102m982K748L885J035
$$ -10308 -12558 -14082 -9969 -6173 2356 -1093 -5097 -4481 -8255 -11184 -17286 -22268 -19520 -15635 -14600
11468a4600J892O6l641M36R182J917k039N616q55m762p125Q345P940k220k335
$$ -14600 -12708 -12642 -16283 -15847 -6665 -4748 -6787 -1171 -2026 -6788 -13913 -5568 2372 152 -2183
11453b183m10l919o5M592l35P51K356o457l934l544L287L862K662L974j796l519
$$ -2183 -2593 -6512 -6577 -1985 -2320 -1569 787 -5670 -9604 -13148 -9861 -5999 -3337 637 -1159 -4678
11437d678J870j846P759J104j080k430M935K489L591q685l685n212L360k015o835
$$ -4678 -2808 -4654 3105 4209 3129 699 5634 8123 11714 3029 -656 -5868 -2508 -4523 -11358
11422a1358j0076K043P498M176L918J507N554n135q767L106J716J0955p77l906
$$ -11358 -21434 -19391 -11893 -7717 -3799 -2292 3262 -1873 -10640 -7534 -5818 5137 4360 454
11408D54j904P149Q716k747k436k730j139l406l201P13Q3R81j882M344k127n529
$$ 454 -1450 5699 14415 11668 9232 6502 5363 1957 -1244 -531 -448 533 -1349 2995 868 -4661
11392d661k319m194L465L268K540j858m176o038J268K21J555l745L417K670J2982
$$ -4661 -6980 -11174 -7709 -4441 -1901 -3759 -7935 -13973 -12705 -12484 -10929 -14674 -11257 -8587 4395
11377D395m708p728m031N485R76N59L232m14o220Q57P827K545M650K483r31l112
$$ 4395 -313 -8041 -12072 -6587 -5611 -5052 -1820 -2234 -8454 -7597 230 2775 7425 9908 8977 5865
11361E865o381q85L847m03O49P56l093j674l87l097K859o61j938P388O295K925
$$ 5865 -516 -1401 2446 2043 2692 3448 355 -1319 -1706 -4803 -1944 -2605 -4543 2845 9140 12065
11345A2065r615L919k205j1503J205N161m393o263k044k919l344J353J240J286
$$ 12065 2450 6369 4164 -7339 -6134 -973 -5366 -11629 -13673 -16592 -19936 -18583 -17343 -16057
11331a6057M511M039k160j977P612J4015J060j0490k978J445o517m133m59J744
$$ -16057 -11546 -7507 -9667 -11644 -4032 9983 11043 553 -2425 -980 -7497 -11630 -12089 -10345
11317a0345J1329K753q484L074K091p375J977L316l561P15l139p926K165N657
$$ -10345 984 3737 -4747 -1673 418 -6957 -4980 -1664 -5225 -4510 -7649 -15575 -13410 -7753
11303g753M507K10j279l145j61O447r28m2J802O665L156K48n661O69m12j897o007
$$ -7753 -3246 -3036 -4315 -7460 -7621 -1174 -2102 -2144 -342 6323 9479 9727 4066 4735 4323 2426 -3581
11286c581l348k379j247N431N451L425L523J33l011n05m84m508o716o825K254
$$ -3581 -6929 -9308 -10555 -5124 327 3752 7275 7408 4397 3892 3408 -1100 -7816 -14641 -12387
11271a2387J0208l239J556j351J049N19j923o33J487j089l871k597K093N580J36
$$ -12387 -2179 -5418 -3862 -5213 -4164 -3645 -5568 -6201 -4714 -5803 -9674 -12271 -10178 -4598 -4462
11256d462N235O606Q725r183q620P16N406n55j889k482j2660j0967P244M958k326
$$ -4462 773 7379 16104 6921 -1699 -983 4423 3868 1979 -503 -13163 -24130 -16886 -11928 -14254
11241a4254k437k70j233K630k72L573N923J45l084K452K760L485r145N525Q635
$$ -14254 -16691 -16961 -18194 -15564 -15836 -12263 -6340 -6195 -9279 -6827 -4067 -582 -9727 -4202 4433
11226D433k418m29K044L177p903l404k624o42J39N820J605O35n127n435J1559
$$ 4433 2015 1586 3630 6807 -1096 -4500 -7124 -7766 -7627 -1807 -202 433 -4694 -10129 1430
11211A430M455k384p248J202L851r82j989K969l869m01q59L291j875P59k817l007
$$ 1430 5885 3501 -3747 -2545 1306 324 -1665 1304 -2565 -2966 -3825 -534 -2409 -1650 -4467 -7474
11195g474P778m859p814m740R505J0084K179j761j515l038l880n587k706J0729
$$ -7474 304 -4555 -12369 -17109 -7604 2480 4659 2898 1383 -1655 -5535 -11122 -13828 -3099
11181c099M697q0J61N42n442l142k044l840J878P044M275l252l393j337J436J33
$$ -3099 1598 1518 1679 2221 -3221 -6363 -8407 -12247 -10369 -3325 950 -2302 -5695 -7032 -5596 -5463
11165e463l003N597P814O424n016o78K262j923l174r974k081N608M226K290O940
$$ -5463 -8466 -2869 4945 11369 6353 5675 7937 6014 2840 -7134 -9215 -3607 619 2909 9849
11150I849L028m829p616n916K44L993j293m309K719j88K990n99K174j54k154o19
$$ 9849 12877 8048 432 -5484 -5240 -1247 -2540 -6849 -4130 -4318 -1328 -1927 247 93 -2061 -2680
11134b680K622L402J022p304j637K239L024K29J919k056q183k307Q595K25p263
$$ -2680 -58 3344 4366 -2938 -4575 -2336 688 917 2836 780 -7403 -9710 -1115 -890 -8153
11119h153J89L430o136K084P025L956O623o044r49L704k733j264L352l391m309
$$ -8153 -7964 -4534 -10670 -8586 -1561 2395 9018 2974 2025 5729 2996 1732 5084 1693 -2616
11104b616L240N496j975L014J42l856n995M722K573m928J212j364q648r000n462
$$ -2616 624 6120 4145 7159 7301 3445 -2550 2172 4745 -183 1029 -335 -8983 -17983 -23445
11089b3445O310P094N510j099k454M371m333m467P951R333J820n305r347J551
$$ -23445 -17135 -10041 -4531 -5630 -8084 -3713 -8046 -12513 -4562 4771 6591 1286 -8061 -6510
11075f510P074K271j254k986P82Q125J230p049m028P128K949J839l403k725J905
$$ -6510 564 2835 1581 -1405 -623 7502 8732 1683 -2345 4783 7732 9571 6168 3443 5348
11060E348j154K478M166m996K392Q29o967o681J614L36L394P814p836l374Q49
$$ 5348 4194 6672 10838 5842 8234 9063 2096 -4585 -2971 -2635 759 8573 737 -2637 -1788
11045a788P146L258O5p926j1862K514R423J433J376l998p377J746K905J468k33
$$ -1788 5358 8616 8681 755 -11107 -8593 830 2263 3639 -359 -7736 -5990 -3085 -1617 -1850
11030a850J162R82j317k202L670J999q793m52J581N795M572L654q796q686j240
$$ -1850 -688 294 -1023 -3225 445 2444 -6349 -6801 -5220 575 5147 8801 5 -8681 -9921
11015i921J300Q596N84N141O56n35J992m559K65J970J488p756p958k945L323N586
$$ -9921 -8621 -25 559 5700 6356 5821 7813 3254 3519 5489 6977 -779 -8737 -11682 -8359 -2773
10999b773N726j992r123K088M941R651O763j690m060o167o833K377J410Q676k430
$$ -2773 2953 961 -8162 -6074 -1133 8518 15281 13591 9531 3364 -3469 -1092 318 8994 6564
10984F564P58m314o094J929N295K57L387n737o099K007K174q47l033P81N456Q48
$$ 6564 7322 3008 -3086 -1157 4138 4395 7782 2045 -4054 -2047 127 -720 -3753 -2972 2484 3332
10968C332l300N167L076M224P933N046j0858j5525l672P102m223j183K745l5L278
$$ 3332 32 5199 8275 12499 20432 25478 14620 -905 -4577 2525 -1698 -2881 -136 -171 3107
10953C107m866K36K079M510k057r093l91K452J594O147K824m228p025m99M302
$$ 3107 -1759 -1523 556 5066 3009 -6084 -6475 -4023 -2429 3718 6542 2314 -4711 -5210 -908
10938i08K173o4n589j11n556J175P685L689p639k547M434J498k07J419k486l027
$$ -908 1265 1201 -4388 -4499 -10055 -8880 -1195 2494 -5145 -7692 -3258 -1760 -1967 -548 -3034 -6061
10922f061k651R212n2M502p032K673N11p439j195k929J064J61M654L033J992K23
$$ -6061 -8712 500 448 4950 -2082 591 1102 -6337 -7532 -10461 -9397 -9236 -4582 -1549 443 666
10906F66k098J525j121J765K140k546l544L176L009k082J826Q620J1567r030j2396
$$ 666 -1432 93 -1028 737 2877 331 -3213 -37 2972 890 2716 11336 22903 13873 1477
10891A477n479N433J573j2367j378O141j721M719L207l56l820P94N814m298J258
$$ 1477 -4002 1431 3004 -9363 -10741 -4600 -6321 -1602 1605 1249 -2571 -1777 4037 -261 997
10876I97K163k84o244Q83l96l734J816k09Q107O206j75q869m220L499J602l73
$$ 997 3160 2876 -3368 -2485 -2881 -6615 -4799 -5008 3099 9305 9130 261 -3959 -460 1142 769
10860G69L178J857L03r959l390k972J808j484J340l122k08K044N844K625k765
$$ 769 3947 5804 6107 -3852 -7242 -10214 -8406 -9890 -8550 -11672 -11880 -9836 -3992 -1367 -4132
10845d132j846M457o833o082P67J975M829J768j357L623P100m80N653m340p609
$$ -4132 -5978 -1521 -8354 -14436 -13669 -11694 -6865 -5097 -6454 -2831 4269 3789 9442 5102 -2507
10830b507L281M814n967j873o456j402J577J486K777O7j00J257k116m447O852
$$ -2507 774 5588 -379 -2252 -8708 -10110 -8533 -7047 -4270 -4203 -4303 -3046 -5162 -9609 -2757
10815b757j592j535L025j277L363L052k020j417k900k355R12r59K791O481o753
$$ -2757 -4349 -5884 -2859 -4136 -773 2279 259 -1158 -4058 -6413 -5501 -6460 -3669 2812 -3941
10800c941km841p34O035K034P657Q900q05p907n520k173K812O943j389m776o65
$$ -3941 -3943 -8784 -9518 -3483 -1449 6208 15108 14303 6396 876 -1297 1515 8458 7069 2293 1628
10784A628k903N76L654L838k585l471M879N151O041m689k791m343l672n107m407
$$ 1628 -1275 -699 2955 6793 4208 737 5616 10767 16808 12119 9328 4985 1313 -3794 -8201
10769h201L588J863R92N692m335l786J175p775K578Q543K451o39L331k769k380
$$ -8201 -4613 -2750 -1758 3934 -401 -4187 -3012 -10787 -8209 334 2785 2146 5477 2708 328
10754C28l139l672K1N112j911j999l666M884O346n50m139k069q277O684M860L720
$$ 328 -2811 -6483 -6462 -1350 -3261 -5260 -8926 -4042 2304 1754 -2385 -4454 -12731 -6047 -1187 2533
10738B533k872r64N646J713j903l408q868m186J575Q073M372k115N19k963j962
$$ 2533 -339 -1303 4343 6056 4153 745 -8123 -12309 -10734 -2661 1711 -404 115 -2848 -4810
10723d810m350O050Q818k045q338j04N371j234P69K861K423L371R60l180n569
$$ -4810 -9160 -3110 5708 3663 -4675 -4779 592 -642 127 2988 5411 8782 9742 6562 993
10708I93q642j0075J529Q092J1572K423m119o740m898k324P81k419J635M576J99
$$ 993 -7649 -17724 -16195 -8103 3469 5892 1773 -4967 -9865 -12189 -11408 -13827 -12192 -7616 -7417
10693g417O659K652r969n170J00n33J1306P893L046m265k408j473Ok307o895n585
$$ -7417 -758 1894 -8075 -13245 -13145 -13678 -2372 5521 8567 4302 1894 421 427 -1880 -8775 -14360
10677a4360N649r79P043K008P295M972p645o424n77K227o247j212K311L526K290
$$ -14360 -8711 -9690 -2647 -639 6656 11628 3983 -2441 -3018 -791 -7038 -8250 -5939 -2413 -123
10662a23j460q32l611j917K287L885N3o512J817L882M611J417J842l935N44n32
$$ -123 -1583 -2415 -6026 -7943 -5656 -1771 -1718 -8230 -6413 -2531 2080 3497 5339 1404 1948 1416
10646A416q288l37N26j096K409p136L887q04N487M875L86o731l312j761j465J168
$$ 1416 -6872 -7209 -6683 -7779 -5370 -12506 -8619 -9423 -3936 939 1325 -5406 -8718 -10479 -11944 -10776
10630a0776M097N016j69j221J863j551m254n011k86L571L729O466K060p630o533
$$ -10776 -6679 -1663 -1832 -3053 -1190 -2741 -6995 -12006 -12292 -8721 -4992 1474 3534 -4096 -10629
10615a0629l128o102M520R155N655N448N105j079p870m933k223P844K563J600
$$ -10629 -13757 -19859 -15339 -6184 -529 4919 10024 8945 1075 -3858 -6081 1763 4326 5926
10601E926K359J53j97j274q335J815r52K926K457L146m240M048K740n474J223
$$ 5926 8285 8438 8241 6967 -1368 447 -505 2421 4878 8024 3784 7832 10572 5098 6321
10586F321j0456n061k170R92K541N299J12k902J545J615j086L762L705K353j617
$$ 6321 -4135 -9196 -11366 -10374 -7833 -2534 -2422 -5324 -3779 -2164 -3250 512 4217 6570 4953
10571D953R6o81k684n867o53m35L212J181p259j135L425o837p73J7072L687r198
$$ 4953 5049 4368 1684 -4183 -4836 -5271 -2059 -878 -8137 -9272 -5847 -12684 -13457 3615 7302 -1896
10555a896k142o434j016K983L220P910l86o287r553j019J025K587J774j796j182
$$ -1896 -4038 -10472 -11488 -8505 -5285 2625 2239 -4048 -13601 -14620 -13595 -11008 -9234 -11030 -12212
10540a2212N09K165P697m811O843m56k396O943R70m685L935L278j850l915n319
$$ -12212 -11703 -9538 -1841 -6652 191 -265 -2661 4282 5252 567 4502 7780 5930 2015 -3304
10525c304m388O810J5591m061n558J618j561k215J455J061P92N03P62j767k977
$$ -3304 -7692 -882 14709 10648 5090 6708 5147 2932 4387 5448 6240 6743 7505 5738 2761
10510B761k14J212Q531P765J0697J7011K7694L2491j0857l2002k4030j5475l1
$$ 2761 2547 3759 12290 20055 30752 47763 75457 107948 97091 65089 41059 25584 25553
10497B5553K23j0038p443p87Q21m694J590K816k114OL58j0956k811K826M603q62
$$ 25553 25776 15738 8295 7508 8329 3635 5225 8041 5927 5933 6291 -4665 -7476 -4650 -47 -909
10481i09J454n725m213M067L777o628L142R012M935n00p123o573l276k860j122
$$ -909 545 -5180 -9393 -5326 -1549 -8177 -5035 3977 8912 8412 1289 -5284 -8560 -11420 -12542
10466a2542K112K264l810N617N218L461o08O02K213K317j801J225M847J579j121
$$ -12542 -10430 -8166 -11976 -6359 -1141 2320 1712 2314 4527 6844 5043 6268 11115 12694 11573
10451A1573J007L974L34j0096j3039N436N799R386O633m308p785o61n382k634
$$ 11573 12580 16554 16888 6792 -6247 -811 4988 14374 21007 16699 8914 8253 2871 237
10437B37j69l073M266J532M374L76R70r576l537k172K829N687P28p851j1482j305
$$ 237 68 -3005 1261 2793 7167 7543 8513 -1063 -4600 -6772 -3943 1744 2472 -5379 -16861 -18166
10421a8166M390K807M505K52L273N865j033k354m08l094J59Q54N485K732o403
$$ -18166 -13776 -10969 -6464 -6212 -2939 2926 1893 -461 -869 -3963 -3804 -2950 2535 5267 -1136
10406a136p301p85j589L435L910j114j632N665j661Q32M736M153J836k599o693
$$ -1136 -8437 -9222 -10811 -7376 -3466 -4580 -6212 -547 -2208 -1376 3360 7513 9349 6750 57
10391E7l750j16n834r162j552m321O85O215J1772M302L953j0003j1772K817M521
$$ 57 -3693 -3809 -9643 -18805 -20357 -24678 -23993 -17778 -6006 -1704 2249 -7754 -19526 -16709 -12188
10376a2188N305K319p025N312Q573N56L33Q76k740l724M100O214K566Q55P297
$$ -12188 -6883 -4564 -11589 -6277 2296 2852 3185 4061 1321 -2403 1697 7911 10477 11332 18629
10361A8629j205n546j051l088K778k1k241m962m493k139P074j186j275j056m301
$$ 18629 17424 11878 10827 7739 10517 10496 8255 3293 -1200 -3339 3735 2549 1274 218 -4083
10346d083l254J2848O997j1651k423K997J365j259j964L019m61m536l519l150
$$ -4083 -7337 5511 12508 857 -1566 1431 2796 1537 -427 2592 2131 -2405 -5924 -9074
10332i074Q246N532P16q191m841P387J658j572r76p730o165L895R663m868o586
$$ -9074 -828 4704 5420 -2771 -7612 -225 1433 -139 -1115 -8845 -15010 -11115 -1452 -6320 -12906
10317a2906Q599q3o977j611L061J4j294P317J1314L999j996j607m339q304J595
$$ -12906 -4307 -4390 -11367 -12978 -9917 -9903 -11197 -3880 7434 11433 9437 7830 3491 -4813 -3218
10302c218o66m020m639J529l592k312J368J134Q989Q146N634m834k449K165k183
$$ -3218 -3884 -7904 -12543 -11014 -14606 -16918 -15550 -14416 -5427 2719 8353 3519 1070 3235 1052
10287A052q94j13j0558k130N688j266R07k330Q719N498M851k786M0q512J2483
$$ 1052 158 45 -10513 -12643 -6955 -8221 -7314 -9644 -925 4573 9424 6638 6678 -1834 10649
10272A0649Q367o351j0614k898L765l158j630N983M67j195l471m89N778n078J095
$$ 10649 19016 12665 2051 -847 2918 -240 -1870 4113 4580 3385 -86 -575 5203 125 1220
10257A220R2n629j910N269K829k325L173K90P818j0332k178p990J884J736k858
$$ 1220 1312 -4317 -6227 -958 1871 -454 2719 3009 10827 495 -1683 -9673 -7789 -6053 -8911
10242h911q56P06j543j615Q987M660l17K646L439q13r001q66k153o48J641N157
$$ -8911 -9767 -9061 -10604 -12219 -3232 1428 1111 3757 7196 6383 -2618 -3484 -5637 -6285 -4644 513
10226E13o584l712m35N202J660k35M198K788M07j629k460k547k894P005M27m721
$$ 513 -6071 -9783 -10218 -5016 -3356 -3591 607 3395 3802 2173 -287 -2834 -5728 1277 1704 -3017
10210c017N496K534n303n641m132K550M359J539j906K688L538L991K613l992o4
$$ -3017 2479 5013 -290 -5931 -10063 -7513 -3154 -1615 -3521 -833 2705 6696 9309 5317 5253
10195E253m758m196J920p89M610L785k644K47K241L060n276M935q48m304l330
$$ 5253 495 -3701 -1781 -2570 2040 5825 3181 3428 5669 8729 3453 8388 7540 3236 -94
10180i4k951L774M400p803J4K832K32O45k427p866K675N522o091p542J728J944
$$ -94 -3045 729 5129 -2674 -2660 172 404 1049 -1378 -9244 -6569 -1047 -7138 -14680 -12952 -11008
10164a1008j362K970J618k526J0008j103j688N499j266n588o586L903O040J427
$$ -11008 -12370 -9400 -7782 -10308 -300 -1403 -3091 2408 1142 -4446 -11032 -7129 -1089 338
10150C38o279l084L393j041O270P041P724q76q55m289j3684q003O446P154J972
$$ 338 -5941 -9025 -5632 -6673 -403 6638 14362 13486 12631 8342 -5342 -13345 -6899 255 2227
10135B227j134R195K50M249j24o35r11k385r210L578K255n131m614L731k18k43
$$ 2227 1093 10288 10538 14787 14663 14028 13117 10732 1522 5100 7355 2224 -2390 1341 1123 880
10119H80K83J175J793L379o636n555L957J2441R40j2064o433J827r6j832O432
$$ 880 1163 2338 4131 7510 874 -4681 -724 11717 12657 593 -5840 -4013 -4109 -5941 491
10104D91M382L526j653j79Q36m498m878M771k345m996j498l20r58M369J510l941
$$ 491 4873 8399 6746 6567 7403 2905 -1973 2798 453 -4543 -6041 -6361 -7319 -2950 -1440 -5381
10088e381j622J465j550n798O014J718Q88o231L850R637P96l74m020m479R748
$$ -5381 -7003 -5538 -7088 -12886 -6872 -5154 -4266 -10497 -6647 2990 3786 3412 -608 -5087 4661
10073D661R728m162J713j778l116r50n712J852K264l305k157K748J866Q108l577
$$ 4661 14389 10227 11940 10162 7046 6096 384 2236 4500 1195 -962 1786 3652 11760 8183
10058H183n380k148J331L476J1411J7392L698j698q354j042n47j6642j6923L786
$$ 8183 2803 655 1986 5462 16873 34265 37963 36265 27911 26869 26322 9680 -7243 -3457
10044c457Q02P059M014k953R053n623n957j828M943K202K680J695k39q106q9N965
$$ -3457 -2655 4404 8418 5465 14518 8895 2938 1110 6053 8255 10935 12630 12391 4285 4196 10161
10028A0161n446p016o600L364R611o024l161l82O950j36l067J097m362n639l603
$$ 10161 4715 -2301 -8901 -5537 4074 -1950 -5111 -5493 1457 1321 -1746 -649 -5011 -10650 -14253
10013a4253K062K187L888L083j916j1274Q09Q709K529P962J1041j078m012L256
$$ -14253 -12191 -10004 -6116 -3033 -4949 -16223 -15414 -6705 -4176 3786 14827 13749 9737 12993
9999A2993m459K888j475l895j712k234q267j435l89J489k263J262j29p390J279
$$ 12993 8534 11422 9947 6052 4340 2106 -6161 -7596 -7985 -6496 -8759 -7497 -7626 -15016 -13737
9984a3737K421Q145P111o768r118l336k995k587L060J836J1703j541j649K576
$$ -13737 -11316 -3171 3940 -2828 -11946 -15282 -18277 -20864 -17804 -15968 -4265 -5806 -7455 -4879
9970d879K620L721m2l560P039N188j885n174K732j129r523l372J052k108L656
$$ -4879 -2259 1462 1420 -2140 4899 10087 8202 3028 5760 4631 -4892 -8264 -7212 -9320 -5664
9955e664L922L281N856n68L55M395j870l535q138j0111o93k39j559R816J489l044
$$ -5664 -1742 1539 7395 6827 7182 11577 9707 6172 -1966 -12077 -12770 -13009 -14568 -4752 -3263 -6307
9939f307M027P383J591k161R10j249k185K296n714m512O397J756N022Q98L242
$$ -6307 -2280 5103 6694 4533 5443 4194 2009 4305 -1409 -5921 476 2232 7254 8152 11394
9924A1394k978n534j614L572K648p818q06L400K029k075J371k384K127R769M472
$$ 11394 8416 2882 1268 4840 7488 -330 -1136 2264 4293 2218 3589 1205 3332 13101 17573
9909A7573j45k13K830R2p463n558n133N792l915o913k259k909L07J810o35l655
$$ 17573 17428 17215 20045 20137 12674 7116 1983 7775 3860 -3053 -5312 -8221 -7914 -6104 -6739 -10394
9893a0394O066P156n731q170J634K196Q698P94q515j127R34O477o050j367R824
$$ -10394 -4328 2828 -2903 -11073 -9439 -7243 1455 2249 -6266 -7393 -6459 18 -6032 -7399 2425
9878B425K436r037J200M866N402M400j768l347r526J077R28M855L027p531K210
$$ 2425 4861 -4176 -2976 1890 7292 11692 9924 6577 -2949 -1872 -944 3911 6938 -593 1617
9863A617N538p9l152m634l148m203J398P991k419l196L969J0071l807K897K840
$$ 1617 7155 7076 3924 -710 -3858 -8061 -6663 1328 -1091 -4287 -318 9753 5946 8843 11683
9848A1683l414o975p564m024J255l108k407P034N645l15q122j239j57M088J044
$$ 11683 8269 1294 -6270 -10294 -9039 -12147 -14554 -7520 -1875 -2190 -10312 -11551 -11708 -7620 -6576
9833f576J749M297k724K444l798m293N861O770m73K783k390k696l153k187J696
$$ -6576 -4827 -530 -3254 -810 -4608 -8901 -3040 3730 3257 6040 3650 954 -2199 -4386 -2690
9818b690P756m00o018j911P934N035j111P98m257k444l798K513K516j655o185
$$ -2690 5066 4666 -1352 -3263 4671 9706 8595 9393 5136 2692 -1106 1407 3923 2268 -3917
9803c917l381j2757R24M619L326P1n561P794L059L892K98k4J812n54n666N894
$$ -3917 -7298 -20055 -19131 -14512 -11186 -11115 -16676 -8882 -5823 -1931 -1633 -1657 155 -399 -6065 -171
9787a71K247j700K755o284K562N206l553O336O819J048o957j0150p890l215M464
$$ -171 2076 376 3131 -3153 -591 4615 1062 7398 14217 15265 8308 -1842 -9732 -12947 -8483
9772h483L720J244N245j556k813l861m346N671R245N097l817K91j171q059q65
$$ -8483 -4763 -3519 1726 170 -2643 -6504 -10850 -5179 4066 9163 5346 5637 4466 -3593 -4458
9757d458L927l187J45P836m293o422n367j6N559q18M708j13P49k9J88k693K132
$$ -4458 -531 -3718 -3573 4263 -30 -6452 -11819 -11835 -6276 -7094 -2386 -2499 -1750 -1779 -1591 -4284 -2152
9740b152j444Q41N082L479m748k756l150O843j59n566M258k261K322l701r161
$$ -2152 -3596 -2755 2327 5806 1058 -1698 -4848 1995 1836 -3730 528 -1733 589 -3112 -12273
9725a2273m20R489l58K804M062J067n863n166Q928N614n241j0501K601K491k029
$$ -12273 -12693 -3204 -3562 -758 3304 4371 -1492 -6658 2270 7884 2643 -7858 -5257 -2766 -4795
9710d795m580M71L425m519m528L663Q723n723o761J1695O74j803L943L664P469
$$ -4795 -9375 -8904 -5479 -9998 -14526 -10863 -2140 -7863 -14624 -2929 -2255 -4058 -115 3549 11018
9695A1018m837m139K878o329q043K119n74L297R35m040q550P039R248l19m990
$$ 11018 6181 2042 4920 -1409 -9452 -7333 -7907 -4610 -3675 -7715 -16265 -9226 22 -297 -5287
9680e287O069M907Q560L152m875k996n415j733p550J119l882k619m858J855M297
$$ -5287 782 5689 14249 17401 12526 9530 4115 2382 -5168 -4049 -7931 -10550 -15408 -13553 -9256
9665i256N41N965O239n27K365L885n565m643O73O54m36q903n630O430N338m47
$$ -9256 -8715 -2750 3489 2962 5327 9212 3647 -996 -323 331 -105 -9008 -14638 -8208 -2870 -3317
9649c317O78k864n877L443O064o28j0479m222J5313N777n9O249K183J137j0206
$$ -3317 -2639 -5503 -11380 -7937 -1873 -2501 -12980 -17202 -1889 3888 3829 10078 12261 13398 3192
9634C192j2846n652N587J0797M694l714l05M36j739K339m335o441P20l759k701
$$ 3192 -9654 -15306 -9719 1078 5772 2058 1753 2189 450 2789 -1546 -7987 -7267 -11026 -13727
9619a3727M815K57K634J465k721O742m543j325J304l698j294j348j168r30J571
$$ -13727 -8912 -8655 -6021 -4556 -7277 -535 -5078 -6403 -5099 -8797 -10091 -11439 -12607 -13537 -11966
9604a1966l60P37L193Q499N872j398n702r403l374N144K669J0141M562r564n532
$$ -11966 -12326 -11589 -8396 103 5975 4577 -1125 -10528 -13902 -8758 -6089 4052 8614 -950 -6482
9589f482L217J068p764j1009L944K495M133O30k149N627O082o196l058n371q06
$$ -6482 -3265 -2197 -9961 -20970 -17026 -14531 -10398 -9768 -11917 -6290 -208 -6404 -9462 -14833 -15639
9574a5639J361P48p99K272P578p530q275J0059M770j064L4J116N745mO141M381
$$ -15639 -14278 -13530 -14329 -12057 -4479 -12009 -20284 -10225 -5455 -6519 -6485 -5369 376 372 6513 10894
9558A0894n182j888O44m292L990K540m554o62P02l332K736J277q132l185L353
$$ 10894 5712 3824 4468 176 4166 6706 2152 1490 2192 -1140 1596 2873 -5259 -8444 -5091
9543e091L080q926M184J0565P951K874m155m776l971N751j611p268r452J797J566
$$ -5091 -2011 -10937 -6753 3812 11763 14637 10482 5706 1735 7486 5875 -1393 -10845 -9048 -7482
9528g482j59j787L033o22J503K1k647p320l649N738J884J027J166n33l915p55
$$ -7482 -7641 -9428 -6395 -7017 -5514 -5493 -8140 -15460 -19109 -13371 -11487 -10460 -9294 -9827 -13742 -14497
9512a4497P415M846L86M727K789O137j772o500m674N728M185m136J016N280m402
$$ -14497 -7082 -2236 -1850 2877 5666 11803 10031 3531 -1143 4585 8770 4634 5650 10930 6528
9497F528N581j1530L4n089P360Q736k986q559l187l036O348K356n605K96O077
$$ 6528 12109 579 613 -4476 2884 11620 8634 75 -3112 -6148 200 2556 -3049 -2753 3324
9482C324M554k243O141J612j5212L165L549l043j509M261J96r850j2568K08M058
$$ 3324 7878 5635 11776 13388 -1824 1341 4890 1847 338 4599 4795 -5055 -17623 -17415 -13357
9467a3357L538M126m159m636M430N164l19M52o77P601L905l83l463k138k823J949
$$ -13357 -9819 -5693 -9852 -14488 -10058 -4894 -5213 -4761 -5438 2163 6068 5685 2222 84 -2739 -790
9451g90n968n210L788M298L675j265M923J290p15k64p39P53R085l72l345k441
$$ -790 -6758 -11968 -8180 -3882 -207 -1472 3451 4741 4026 3762 3023 3776 12861 12489 9144 6703
9435F703k283k180K096q335J807N284l753k710Q526K195o438n002m189m517n908
$$ 6703 4420 2240 4336 -3999 -2192 3092 -661 -3371 5155 7350 912 -4090 -8279 -12796 -18704
9420a8704j160P222J0160P706q63K203O857L153m923o19J685p025j0849l962J448
$$ -18704 -19864 -12642 -2482 5224 4361 6564 13421 16574 11651 11032 12717 5692 -5157 -9119 -7671
9405g671R751J807q932r508k16J0286O135k432L51M292j373m009p535j904o49
$$ -7671 2080 3887 -5045 -14553 -14769 -4483 1652 -780 -429 3863 2490 -1519 -9054 -10958 -11607
9390a1607K295N62N74K220L791K016k825K663l04J312J269L57n04L44o098l68
$$ -11607 -9312 -8750 -8176 -5956 -2165 -149 -2974 -311 -615 697 1966 2323 1819 2163 -3935 -4303
9374d303O244J248j549J810qr161p358M560N024J286k240p098o599k068J238O243
$$ -4303 1941 3189 1640 3450 3442 -5719 -13077 -8517 -3493 -2207 -4447 -11545 -18144 -20212 -18974 -12731
9358a2731J875l179N033J858J466L912j480j178q73k99l804K616M08j290K759
$$ -12731 -10856 -14035 -9002 -7144 -5678 -1766 -3246 -4424 -5297 -5596 -9400 -6784 -6376 -7666 -4907
9343d907R849K355p886k968n275k85O791N522q32m046r80O036q307J241O0L651
$$ -4907 4942 7297 -589 -3557 -8832 -9117 -2326 3196 2364 -1682 -2662 3374 -4933 -3692 -3632 19
9327A9M699m075r37j820m378m500L447Q212O089m024q141J947K212o70N781m685
$$ 19 4718 643 -294 -2114 -6492 -10992 -7545 667 6756 2732 -5409 -3462 -1250 -1920 3861 -824
9311h24n378p740j588J662O028O152K814l958K167k83L254O84l366M849Q622R82
$$ -824 -6202 -13942 -15530 -13868 -7840 -1688 1126 -2832 -665 -948 2306 2990 -376 4473 13095 14077
9295A4077m746L815Q92m741n272K614l988l424K263L840j84k211M128O49K21n66
$$ 14077 9331 13146 14038 9297 4025 6639 2651 -773 1490 5330 5146 2935 7063 7712 7933 7367
9279G367O55k782O901p060k171P945n513O21N70j212M870K375l713m062N319R174
$$ 7367 8022 5240 12141 5081 2910 10855 5342 5963 6533 5321 10191 12566 8853 4791 10110 19284
9263A9284L174r63O237L677M603l544o296o89R365O983O454J3912J4882L782J6132
$$ 19284 22458 21495 27732 31409 36012 32468 26172 25483 34848 41831 48285 62197 77079 80861 96993
9248I6993J0928R714K2051K3393K8083M1288N6762P4501R5631J43912K23993L53183
$$ 96993 107921 117635 139686 163079 191162 232450 289212 363713 459344 603256 827249 1180432
9236A180432O00909J038269J656177K006114P25558j559327j928728j259274p37309
$$ 1180432 1781341 2819610 4475787 6481901 7207459 5648132 3719404 2460130 1722821
9227A722821m53115l04127k03840j40786j20340p9328n7110n5208n4159k9772
$$ 1722821 1269706 965579 761739 620953 500613 421285 364175 308967 254808 225036
9217B25036j9805j9397j5830j5424j0698n220q599j7975r914n578p126j4587n509
$$ 225036 205231 185834 170004 154580 143882 138662 130063 112088 102174 96596 89470 74883 69374
9204F9374o579J567m646m617L97M632J11p698j1394O601M77m731l861l192L027
$$ 69374 62795 64362 59716 55099 55496 60128 60239 52541 41147 47748 48225 43494 39633 36441 39468
9189C9468o304j296p77k354J460Q857o335k15l728k709M325j669j627l666n554
$$ 39468 33164 31868 31091 28737 30197 39054 32719 32504 28776 26067 30392 28723 27096 23430 17876
9174A7876j473M276K284j868K29k78N5l877j928q48n31p37L605K58j132n103l584
$$ 17876 16403 20679 22963 21095 21324 21046 21101 17224 15296 14448 13917 13180 16785 17043 15911 10808 7224
9157G224K284l048P920k177l222K691l912l443j164l825L695J3361J784k496l765
$$ 7224 9508 6460 14380 12203 8981 11672 7760 4317 3153 -672 3023 16384 18168 15672 11907
9142A1907L109K528R156K095k641j233j1079m322N115L071m874m5o58L327N451
$$ 11907 15016 17544 26700 28795 26154 24921 13842 9520 14635 17706 12832 12787 12129 15456 20907
9127B0907N90l33o098K71O818j325n898l07j587m705o24M251K156j723k88O377
$$ 20907 21497 21164 15066 15337 22155 20830 14932 14625 13038 8333 7709 11960 14116 12393 12105 18482
9111A8482l80p274J083k178Q01J1652M44L58O508K15n89j1076j2440j468R90k379
$$ 18482 18102 10828 11911 9733 10534 22186 22630 22988 29496 29711 29122 18046 5606 4138 5128 2749
9095B749r493P06M651O882o0O53k931p085j716N261l359k628k57N035J2227k604
$$ 2749 -6744 -6038 -1387 5495 5435 6088 3157 -3928 -5644 -383 -3742 -6370 -6627 -1592 10635 8031
9079H031n566L683j835J338k927k739K470J738M913Q76j471J970J0295Q696J08
$$ 8031 2465 6148 4313 5651 2724 -15 2455 4193 9106 9982 8511 10481 20776 29472 29580
9064B9580m443j4420p362L077K203K433m35k046J411J56o147j036L52k33P14M020
$$ 29580 25137 10717 3355 6432 8635 11068 10633 8587 9998 10154 4007 2971 3323 3090 3804 7824
9048G824k093l491l561K952m537M841Q07K471p61K243M12P323k443n731j271m982
$$ 7824 5731 2240 -1321 1631 -2906 1935 2742 5213 4452 6695 7107 14430 11987 6256 4985 3
9032Cl967o7J0871M509N947K92m137K8o75N803j705n757j253j17L002r164n210
$$ 3 -3964 -4031 6840 11349 17296 17588 13451 13479 12804 18607 16902 11145 9892 9775 12777 3613 -1597
9015a597q70m668q073P648J415N193J0540O290j797l155q96K513n552M621Q70
$$ -1597 -2467 -7135 -15208 -7560 -6145 -952 9588 15878 14081 10926 10030 12543 6991 11612 12482
9000A2482k854J213k805o853o474N199k291k12Q611K363Q132J769m599K126m35
$$ 12482 9628 10841 8036 1183 -5291 -92 -2383 -2595 6016 8379 16511 18280 13681 15807 15372
8985A5372l758q534n475K918L997K597K882N772o648j425j713m202Q333N010K0
$$ 15372 11614 3080 -2395 523 4520 7117 9999 15771 9123 7698 5985 1783 10116 15126 15146
8970A5146r30k186p543k878K137Q46m412J627k554k997k671m023K80Q338M742
$$ 15146 14216 12030 4487 1609 3746 4592 180 1807 -747 -3744 -6415 -10438 -10158 -1820 2922
8955B922m796K219J1136q01o514J940n143M72r16r80n42N340O803o72m783l871
$$ 2922 -1874 345 11481 10680 4166 6106 963 1435 519 -461 -1003 4337 11140 10468 5685 1814
8939A814M996J2300J046k901J180o5l284L020K129J46p705L66N927j196j2038
$$ 1814 6810 19110 20156 17255 18435 18370 15086 18106 20235 20381 12676 13042 18969 17773 5735
8924E735m460P795N980j801J072O08R27m66p897L52K686N46n395m362K487O801
$$ 5735 1275 9070 15050 13249 14321 14929 15856 15390 7493 7845 10531 11077 5682 1320 3807 10608
8908A0608L494J335j141N635q526P81M48O464P636K913M234l971k481o571l411
$$ 10608 14102 15437 14296 19931 11405 12186 12634 19098 26734 29647 33881 29910 27429 20858 17447
8893A7447L057K144L983k627m204j329O002j402q200l033K771m9j292n990k025
$$ 17447 20504 22648 26631 24004 19800 18471 24473 23071 14871 11838 14609 14560 13268 7278 5253
8878E253K899m05M839m913j0877n41R998J2412k335n778m771l233J31o914l040
$$ 5253 8152 7747 12586 7673 -3204 -3745 6253 18665 16330 10552 5781 2548 2679 -4235 -7275
8863g275k53Q048R898M850O548J1311q5j6981j2963J787O212K445N815K739J436
$$ -7275 -7528 520 10418 15268 21816 33127 33042 16061 3098 4885 11097 13542 19357 22096 23532
8848B3532p594K561K085p015L606j186M196j777o102l064L699L232j387j524Q277
$$ 23532 15938 18499 20584 13569 17175 15989 20185 18408 12306 9242 12941 16173 14786 13262 21539
8833B1539R323j493m050p699p314P13K353j332r603m966r311L73P975O587L665
$$ 21539 30862 29369 25319 17620 10306 11019 13372 12040 2437 -2529 -11840 -11467 -3492 3095 6760
8818F760j486L123M150M662J849K273p69q661p761o265K35M727Q67O17K181l130
$$ 6760 5274 8397 12547 17209 19058 21331 20562 11901 4140 -2125 -1890 2837 3704 4321 6502 3372
8802C372N297l465n91Q289O422J2243J8072J4304K3058K0675j3251k9385j7546
$$ 3372 8669 5204 4613 12902 19324 31567 49639 63943 87001 107676 94425 65040 47494
8789D7494j4613j0614j1182j947J0769Q71k555o276J361L668j333r664K245P75
$$ 47494 32881 22267 11085 9138 19907 20778 18223 11947 13308 16976 15643 5979 8224 8999
8775H999J156p508N5P632J439q265k450k745O54k830L606j161k785P471O692m049
$$ 8999 10155 2647 2702 10334 11773 3508 1058 -1687 -1033 -3863 -257 -1418 -4203 3268 9960 5911
8759E911l762L244J2810J3434K5599L0595n730k8540j8256p770j332m160O36m924
$$ 5911 2149 5393 18203 31637 57236 87831 82101 53561 35305 27535 26203 22043 22679 17755
8745A7755n620m214l265q719o29J0477k453k180N535N51k858o900l000l41P337
$$ 17755 12135 7921 4656 -4063 -4692 5785 3332 1152 6687 7238 4380 -2520 -5520 -5861 1476
8730A476L236L605j337o007m048L475m484j276R223N138o05k218p534r15Q671
$$ 1476 4712 8317 6980 973 -3075 400 -4084 -5360 3863 9001 8396 6178 -1356 -2271 6400
8715F400K708q374k016k593k638k199Q427Q011k52K210J868j935n743k442K81
$$ 6400 9108 734 -1282 -3875 -6513 -8712 -285 7726 7474 9684 11552 9617 3874 1432 1713
8700A713P68k509k164N462K11m831L050R32l034m117j632j266m594O416M456N522
$$ 1713 2481 -28 -2192 3270 3481 -1350 1700 2632 -402 -4519 -6151 -7417 -12011 -5595 -1139 4383
8684D383J373j016l454o011N378K825n047l136P037J754j498k459N39N457J502
$$ 4383 5756 4740 1286 -4725 653 3478 -1569 -4705 2332 4086 2588 129 668 6125 7627
8669G627N355N207q392k645L97L135n297N595N877j745n205k45L404O184L268
$$ 7627 12982 18189 9797 7152 7549 10684 5387 10982 16859 15114 9909 9664 13068 19252 22520
8654B2520p091o215l331j692L2k454K364o078j179n107j596P19P688k668J580
$$ 22520 15429 9214 5883 4191 4223 1769 4133 -1945 -3124 -8231 -9827 -9108 -1420 -4088 -2508
8639b508K278k923J591K666L318k875j834K430L388k9j564K494J498K420N96n556
$$ -2508 -230 -3153 -1562 1104 4422 1547 -287 2143 5531 5502 3938 6432 7930 10350 10946 5390
8623E390j2718L265J0668r40n44K227n47o6m149K306K513K318K869K052m027p207
$$ 5390 -7328 -4063 6605 5665 5121 7348 6801 6735 2586 4892 7405 9723 12592 14644 10617 3410
8607C410n076n402J97K345M138L330l343M262L717J44l08K40K655o4l114L048
$$ 3410 -1666 -7068 -6871 -4526 -388 2942 -401 3861 7578 7722 7414 7654 10309 10245 7131 10179
8591A0179L781k481m717M858K081j504J4J140m978J862k885l936J748O057L797
$$ 10179 13960 11479 6762 11620 13701 12197 12211 13351 8373 10235 7350 3414 5162 11219 15016
8576A5016q721n351K624M78M969M471Q162K644n16q292o93n732k766j797q704
$$ 15016 6295 944 3568 4046 9015 13486 21648 24292 23776 15484 14791 9059 6293 4496 -4208
8561d208p616N017J4354Q324k806q22k269o464J71k55J161K263j604K641j602
$$ -4208 -11824 -6807 7547 15871 13065 12243 9974 3510 3681 3426 4587 6850 5246 7887 6285
8546F285L145r74p985r17j6n748l866R095N300O153L476l273p54j059K336O686
$$ 6285 9430 8456 471 -446 -462 -6210 -10076 -981 4319 10472 13948 10675 9921 8862 11198 17884
8530A7884K380o135p994O462j663p205M044N815O678n204o277m243l043k404n684
$$ 17884 20264 14129 6135 12597 10934 3729 7773 13588 20266 15062 8785 4542 1499 -905 -6589
8515f589k019m5N60K42O284m02j972N096j770l142R661k288l472J1414J874m950
$$ -6589 -8608 -8653 -8093 -7851 -1567 -1969 -3941 1155 -615 -3757 5904 3616 144 11558 13432 8482
8499H482q44j544J29K405j253p096j481l748M03R29L037l644k97J0205j818J220
$$ 8482 7638 6094 6223 8628 7375 279 -1202 -4950 -4547 -3618 -581 -4225 -4522 5683 3865 5085
8483E085M271L122j669l203o14M808j887j1374m025k438l107J646L780K860L24
$$ 5085 9356 12478 10809 7606 6992 11800 9913 -1461 -5486 -7924 -11031 -9385 -5605 -2745 -2421
8468b421l154M46R272m367J84N41m944j607J140J832N180L385r67M30N467k44
$$ -2421 -5575 -5129 4143 -224 -40 501 -4443 -6050 -4910 -3078 2102 5487 4520 4950 10417 10173
8452A0173p527j398L577L865L735j003o354r61K213L059q276p724N981O264o799
$$ 10173 2646 1248 4825 8690 12425 11422 5068 4107 6320 9379 1103 -6621 -640 5624 -1175
8437a175o851K440R332l114J20K424M928k984j602m264m756K87Q1L385K580K06
$$ -1175 -8026 -5586 3746 632 752 3176 8104 5120 3518 -746 -5502 -5215 -5134 -1749 831 1037
8421A037L458L781o664m907N736j583J472l325j208l929p291m70L568M87K15M711
$$ 1037 4495 8276 1612 -3295 2441 858 2330 -995 -2203 -6132 -13423 -13893 -10325 -9838 -9623 -4912
8405d912R272N056m129J349m972n331p038M480K16m858M452M820O794p013l527
$$ -4912 4360 9416 5287 6636 1664 -3667 -10705 -6225 -6009 -10867 -6415 -1595 5199 -1814 -5341
8390e341q976O715j144N97N061q033j123M919J0202N384l405j0652l265L314M211
$$ -5341 -14317 -7602 -8746 -8149 -3088 -11121 -12244 -7325 2877 8261 4856 -5796 -9061 -5747 -1536
8375a536n585K660M087j57Q695r84p200j021nj905K042J26O960k542L384M310
$$ -1536 -7121 -4461 -374 -531 8164 7180 -20 -1041 -1046 -2951 -909 -783 6177 3635 7019 11329
8359A1329m696l456m010o712j267L399J0628K486M1j685n211k860J092N145r36
$$ 11329 6633 3177 -833 -7545 -8812 -5413 5215 7701 7742 6057 846 -2014 -922 4223 3287
8344C287R79P699k605l979j666j272J1599p32n629o148K569p058l772L125o456
$$ 3287 4266 11965 9360 5381 3715 2443 14042 13310 7681 1533 4102 -2956 -6728 -3603 -10059
8329a0059k20M243L140o91L652k274oJ129l603M789j415R37K326K629M11m605
$$ -10059 -10279 -6036 -2896 -3587 65 -2209 -2215 -1086 -4689 100 -1315 -378 1948 4577 4988 383
8313C83m670l171R089k61q483n886O519k040N841J779N801j202m396L865K254
$$ 383 -4287 -7458 1631 1370 -7113 -12999 -6480 -8520 -2679 -900 4901 3699 -697 3168 5422
8298E422O113N170l814j0493k397m470j1440p07Q599P095k904K553k245J652J719
$$ 5422 11535 16705 12891 2398 1 -4469 -15909 -16616 -8017 -922 -3826 -1273 -3518 -1866 -147
8283a47jk480p794L410R562M676q380n352o58O985J198m276k212K843j935J467
$$ -147 -148 -2628 -10422 -7012 2550 7226 -1154 -6506 -7164 -179 1019 -3257 -5469 -2626 -4561 -3094
8267c094N178L709N261l230J873j1260j0515N55R263J544M095Q02m324K119J150
$$ -3094 2084 5793 11054 7824 9697 -1563 -12078 -11523 -2260 -716 3379 4181 -143 1976 3126
8252C126K049P563m396k237M598K612l632O571L64p453M165k024j596q616q15
$$ 3126 5175 12738 8342 6105 10703 13315 9683 16254 16618 9165 13330 11306 9710 1094 279
8237B79j653j829n449p28R273J770n786M101N009m570J304k692j1226j728L849
$$ 279 -1374 -3203 -8652 -9380 -107 1663 -4123 -22 4987 417 1721 -971 -12197 -13925 -10076
8222a0076l051J308N733m675M094O369j71n638n040K648K500N432o686j985J0851
$$ -10076 -13127 -11819 -6086 -10761 -6667 -298 -469 -6107 -11147 -8499 -5999 -567 -7253 -9238 1613
8207A613j209l436J784J10Q20L610o711K528K903o409R35J506j740k514q19P81
$$ 1613 404 -3032 -1248 -1138 -318 3292 -3419 -891 2012 -4397 -3462 -1956 -3696 -6210 -7029 -6248
8191f248Q37O384O24O30Q707k17r219j960J674K597n874j723O530N552M66j022
$$ -6248 -5411 973 1597 2227 10934 10717 1498 -462 1212 3809 -2065 -3788 2742 8294 8760 7738
8175G738N04n757J880m574k014J140m984j87j641J218P892M387m489L155J838
$$ 7738 8242 2485 4365 -209 -2223 -1083 -6067 -6254 -7895 -6677 1215 5602 1113 4268 6106
8160F106o85k151K288n651l454K777l111j100J2436Q194p293L25Q31q575p79R851
$$ 6106 5421 3270 5558 -93 -3547 -770 -3881 -4981 7455 15649 8356 8681 9512 937 158 10009
8144A0009O474r609o083l191P088P344O7n57p028j644j89L527L019n476j832p522
$$ 10009 16483 6874 791 -2400 4688 12032 12099 11542 4514 2870 2681 6208 9227 3751 1919 -5603
8128e603l930N577P488N276n849n562k527l907P325R983J826o77l605P48j832
$$ -5603 -9533 -3956 3532 8808 2959 -2603 -5130 -9037 -1712 8271 10097 9420 5815 6563 4731
8113D731r465k115J724K229K477K844p3o946l763J28l883J0218Q966k367l110
$$ 4731 -4734 -6849 -5125 -2896 -419 2425 2352 -4594 -8357 -8229 -12112 -1894 7072 4705 1595
8098A595j034l106J411p77j79J073o154r78O078M480l449M295P27k029j521M976
$$ 1595 561 -2545 -1134 -1911 -2090 -1017 -7171 -8149 -2071 2409 -1040 3255 3982 1953 432 5408
8082E408m553m302J90m374l863L166M319J978k507j472J003j154R21K382m656
$$ 5408 855 -3447 -3257 -7631 -11494 -8328 -4009 -2031 -4538 -6010 -5007 -6161 -5240 -2858 -7514
8067g514p644J911M402J294K537o21j1494m319L891J16K971J994l43M803K87R38
$$ -7514 -15158 -13247 -8845 -7551 -5014 -5635 -17129 -21448 -17557 -17441 -14470 -12476 -12819 -8016 -7729 -6791
8051f791O236M97K01J779M257m33m765l559P00j238m002k06L693M968m58J860
$$ -6791 -555 -58 143 1922 6179 5746 981 -2578 -1878 -3116 -7118 -7324 -3631 1337 879 2739
8035B739N524R66l067k625j859l527M843K089K1O422l421p802n416k257K275k610
$$ 2739 8263 9229 6162 3537 1678 -1849 2994 5083 5104 11526 8105 303 -5113 -7370 -5095 -7705
8019g705n43O531K871K8K976K577k840K327m27k379l91k747N22o96j941m360m93
$$ -7705 -8248 -1717 1154 1182 4158 6735 3895 6222 5795 3416 3025 278 800 104 -1837 -6197 -6690
8002f690K921M940N03O081O54l156l998N383J348l80o438L171K936q205n775j204
$$ -6690 -3769 1171 1674 7755 8409 5253 1255 6638 7986 7606 1168 4339 7275 -930 -6705 -7909
7986g909j496oN116O335J027J152j593k017k302l35P025J73k526K580J12q92N30
$$ -7909 -9405 -9411 -4295 2040 3067 4219 2626 609 -1693 -2028 4997 5170 2644 5224 5336 4444 4974
7969D974p69K674n555m835J14o18O329n491k750j535M852o216l83P944K131K508
$$ 4974 4205 6879 1324 -3511 -3397 -4015 2314 -3177 -5927 -7462 -2610 -8826 -9209 -1265 866 3374
7953C374l507r949P809P990K387m828n153k752J509p08L152J406J7M047l064l144
$$ 3374 -133 -10082 -2273 5717 8104 3276 -1877 -4629 -3120 -3828 -676 730 747 4794 1730 -1414
7937a414L645K258j827M762J309O51l971n652P57m645p736K880N761M157L07P45
$$ -1414 2231 4489 2662 7424 8733 9384 5413 -239 518 -4127 -11863 -8983 -3222 935 1242 1987
7921A987K050m153j902P892K236n940k567J796k381J0879J870O20l549j4266K123
$$ 1987 4037 -116 -2018 5874 8110 2170 -397 1399 -982 9897 11767 12387 8838 -5428 -3305
7906c305K695Q81P408j444n289P023P095N278k486n937n684l375o833K370N505
$$ -3305 -610 271 7679 6235 946 7969 15064 20342 17856 11919 6235 2860 -3973 -1603 3902
7891C902J101K568J638L994k837r273n582j463l050n075p41N870L999N379K479
$$ 3902 5003 7571 9209 13203 10366 1093 -4489 -5952 -9002 -14077 -14818 -8948 -4949 430 2909
7876B909l051K200J591J916l874J41l855j798K14l362Q51L681N091j65r58q780
$$ 2909 -142 2058 3649 5565 1691 1832 -2023 -3821 -3607 -6969 -6118 -2437 2654 2489 1531 -7249
7860g249N412L550j273l372k90K486M11o302R169L409M154L980n989j261o535
$$ -7249 -1837 1713 440 -2932 -3222 -736 -325 -6627 2542 5951 10105 14085 8096 6835 300
7845C00M445l453p337o108j36k39k63M496P012K363k113o363q54M66L205n777
$$ 300 4745 1292 -6045 -12153 -12289 -12528 -12791 -8295 -1283 1080 -1033 -7396 -8250 -7784 -4579 -10356
7829a0356j0067N088P944L472K083l422J427N601M720L017M269n120n886o41L123
$$ -10356 -20423 -15335 -7391 -3919 -1836 -5258 -3831 1770 6490 9507 13776 8656 2770 2129 5252
7814E252K558k510j354j158q170o531O677K058n446O488K857l867M81k939n04
$$ 5252 7810 5300 3946 2788 -5382 -11913 -5236 -3178 -8624 -2136 721 -3146 -2665 -5604 -6108
7799f108N188L05k353N006N991n499j0190m466n410n475j153O611j35K294K072
$$ -6108 -920 -615 -2968 2038 8029 2530 -7660 -12126 -17536 -23011 -24164 -17553 -17688 -15394 -13322
7784a3322L713J0069N615r471n188L247p965j208M85J297J3O281O131k518q583
$$ -13322 -9609 460 6075 -3396 -8584 -5337 -13302 -14510 -14025 -12728 -12715 -6434 -303 -2821 -11404
7769a1404M129L516M854J580m511k326l268k160M246M098M747M166j902q031m216
$$ -11404 -7275 -3759 1095 2675 -1836 -4162 -7430 -9590 -5344 -1246 3501 7667 5765 -2266 -6482
7754f482n735l174M59J932O701J0526Q893l777p535m744M593K110l199J0051n27
$$ -6482 -12217 -15391 -14932 -13000 -6299 4227 13120 9343 1808 -2936 1657 3767 568 10619 10092
7739A0092l493M032O881l518L28M460r129m464l752k44l816J825J485K851P274
$$ 10092 6599 10631 17512 13994 14322 18782 9653 5189 1437 1193 -2623 -798 687 3538 10812
7724A0812M779o030r039j970p507j998k045J607O544p085L765k599P830J966L395
$$ 10812 15591 9561 522 -1448 -8955 -10953 -12998 -11391 -4847 -11932 -8167 -10766 -2936 -970 2425
7709B425M785K220k258j1085m225m71O50L409Q921M345Q25m063j434M592n282
$$ 2425 7210 9430 7172 -3913 -8138 -8609 -7959 -4550 4371 8716 9541 5478 4044 8636 3354
7694C354k391k323n265j849l610N567O181R63L024J532l313k285j641L176m936
$$ 3354 963 -1360 -6625 -8474 -12084 -6517 -336 627 3651 5183 1870 -415 -2056 1120 -3816
7679c816p150M531N232l172K568P51J415j82j475P029J416N975k45n743j3473
$$ -3816 -10966 -6435 -1203 -4375 -1807 -1056 359 177 -1298 5731 7147 13122 12877 7134 -6339
7664f339m526r1K026L118l749L295j510L730K721P99L596p03k344K520k454J411
$$ -6339 -10865 -10956 -8930 -5812 -9561 -6266 -7776 -4046 -1325 -526 3070 2367 23 2543 89 1500
7648A500o631m0J903J553o40k301p452K324P364l84n920m492P956M008P272l680
$$ 1500 -5131 -5171 -3268 -1715 -2355 -4656 -12108 -9784 -2420 -2804 -8724 -13216 -5260 -1252 6020 2340
7632B340r475l61L125j718K665L50j618M345K566N747N583l854L299j267j2856
$$ 2340 -7135 -7496 -4371 -6089 -3424 -3074 -4692 -347 2219 7966 13549 9695 12994 11727 -1129
7617a129o405M733J155J179L812J18m842j976p092M452K019o998k965J0147L057
$$ -1129 -7534 -2801 -1646 -467 3345 3463 -1379 -3355 -10447 -5995 -3976 -10974 -13939 -3792 -735
7602g35o429p453Q99Q508m80J565M19J425L891j767o191J158L362r011J760O479
$$ -735 -7164 -14617 -13718 -5210 -5690 -4125 -3706 -2281 1610 -157 -6348 -5190 -1828 -10839 -9079 -2600
7586b600J1505M38m874o239k377j545m458K149K995R66k16p596k70k31J1153n31
$$ -2600 8905 9343 4469 -1770 -4147 -5692 -10150 -8001 -5006 -4040 -4256 -11852 -12122 -12353 -1200 -1731
7570a731j1123J767N984J855L722K175j287k524N970L028m572j1758p215P93j793
$$ -1731 -12854 -11087 -5103 -3248 474 2649 1362 -1162 4808 7836 3264 -8494 -15709 -14916 -16709
7555a6709K71N305Q066J81q66K740N918J588N029L729q000J149n00k770l873L523
$$ -16709 -16438 -11133 -3067 -2886 -3752 -1012 4906 6494 11523 15252 7252 8401 7901 5131 1258 4781
7539D781M61J570m136j046r175n702K555J667L928O365m93O325L150r661K046
$$ 4781 5242 6812 2676 1630 -7545 -13247 -10692 -9025 -5097 1268 775 7100 10250 589 2635
7524B635Q34l553o122n290J783K734m564N144L474O180J327Q47J257k822O28M355
$$ 2635 3469 -84 -6206 -11496 -9713 -6979 -11543 -6399 -2925 3255 4582 5429 6686 3864 4492 8847
7508H847N515k134j2561j694k639n508l13N53O57j302J09M420J265l286q647N905
$$ 8847 14362 12228 -333 -2027 -4666 -10174 -10487 -9934 -9277 -10579 -10470 -6050 -4785 -8071 -16718 -10813
7492a0813L022o023O355P539N019K158l714N305J617p012m84k258K224Q79m859
$$ -10813 -7791 -13814 -7459 80 5099 7257 3543 8848 10465 3453 2969 711 2935 3814 -1045
7477a045n648O163N774l384r01j1164o751L267J355J685L164K369N137M160r255
$$ -1045 -6693 -530 5244 1860 959 -10205 -16956 -13689 -12334 -10649 -7485 -5116 21 4181 -5074
7462e074q113j574m591k285L251L498J0595N703l269r938m103o74O668J2338p73
$$ -5074 -13187 -14761 -19352 -21637 -18386 -14888 -4293 1410 -1859 -11797 -15900 -16574 -9906 2432 1659
7447A659p370o740M262P732J634l798n397N462K448n495k387M930P165L050l023
$$ 1659 -5711 -12451 -8189 -457 1177 -2621 -8018 -2556 -108 -5603 -7990 -3060 4105 7155 4132
7432D132P291M469n891r076q715k645L023O366K957K331J407J928p086l778O59
$$ 4132 11423 15892 10001 925 -7790 -10435 -7412 -1046 1911 4242 5649 7577 491 -3287 -2628
7417b628O740L446L925n058m710R92O405L345K073j1249q618L289l593L765j237
$$ -2628 4112 7558 11483 6425 1715 2707 9112 12457 14530 3281 -5337 -2048 -5641 -1876 -3113
7402c113j040l864q289N046R278J949N111O28j474n132L38K789J0603J67l665
$$ -3113 -4153 -8017 -16306 -11260 -1982 -33 5078 5706 4232 -900 -562 2227 12830 12997 9332
7387I332j0175q09n422m55m49O939N434n445L234l05K879n323K703K763n827o670
$$ 9332 -843 -1652 -7074 -7529 -7978 -1039 4395 -1050 2184 1879 4758 -565 2138 4901 -926 -7596
7371g596j686L916q08K943L87l386r177q23K840K475L924m203k925J803k152r484
$$ -7596 -9282 -5366 -6174 -3231 -2844 -6230 -15407 -16230 -13390 -10915 -6991 -11194 -14119 -12316 -14468 -23952
7355b3952J379L353J3836R851J763l196n865M139O2K04j292j558L409L169K623
$$ -23952 -22573 -19220 -5384 4467 6230 3034 -2831 1308 1370 1574 282 -1276 2133 5302 7925
7340G925M56l358j66n215m798J071K764p90k276O509J627o204M409L30L138J429
$$ 7925 8381 5023 4857 -358 -5156 -4085 -1321 -2111 -4387 2122 3749 -2455 1954 2284 5422 6851
7324F851J913O58O61p593J40k81l602l281m936K904J53l02O027j113m676k098
$$ 6851 8764 9422 10083 2490 2630 2349 -1253 -4534 -9470 -6566 -6413 -6715 -688 -1801 -6477 -8575
7308h575l456K350N274L841L277o930j775M505M968j79m573Q27k433q219L658
$$ -8575 -12031 -9681 -4407 -566 2711 -4219 -5994 -1489 3479 3300 -1273 -446 -2879 -11098 -7440
7293g440l45p16k415L582p00j414Q001n868O107L80q700k109n81L429N564j0733
$$ -7440 -7785 -8501 -10916 -7334 -8034 -9448 -1447 -7315 -1208 -828 -9528 -11637 -12218 -8789 -3225 -13958
7277a3958n296O826N902Q440o709o098k977J566r84o42R137L988J807J388M08
$$ -13958 -19254 -12428 -6526 1914 -4795 -10893 -13870 -12304 -13288 -13930 -4793 -805 1002 2390 2798
7262B798j568n10l273o85k003N619P25L153K216j123j3426k391M934j0152j329
$$ 2798 1230 720 -2553 -3238 -5241 378 1103 4256 6472 5349 -8077 -10468 -5534 -15686 -17015
7247a7015Q161K781K822N543m144j159M068M787j81k442r874k366N054Q004n850
$$ -17015 -8854 -6073 -3251 2292 -1852 -3011 1057 5844 5663 3221 -6653 -9019 -3965 4039 -1811
7232a811K915L380J963l392K814M03p79n274j736P032N922n329l796M174J403
$$ -1811 1104 4484 6447 3055 5869 6272 5493 219 -1517 5515 11437 6108 2312 6486 7889
7217G889n33m81k741p940k875M101L167N155m673l370N579L32j238J934k077n94
$$ 7889 7356 6875 4134 -3806 -6681 -2580 587 5742 1069 -2301 3278 3610 2372 4306 2229 1635
$$ [...]
##END NTUPLES=NMR SPECTRUM
##END=
