##TITLE=Analysis number 323563
Compound Code sew 03804
Project Code adrs
Chemist Name fudan
##JCAMPDX= 6.0         $$ Bruker NMR JCAMP-DX V2.0
##DATA TYPE= NMR SPECTRUM
##DATA CLASS= NTUPLES
##ORIGIN= Bruker BioSpin GmbH
##OWNER= nmr
$$ XWIN-NMR		Version 3.5
$$ Fri Oct 27 13:07:06 2006 GMT Daylight Time (UT+1h)  MAYBRIDGE\nmr@NMR_250MHZ
##.OBSERVE FREQUENCY= 250.131544655141
##.OBSERVE NUCLEUS= ^1H
##.ACQUISITION MODE= SIMULTANEOUS (DQD)
##.ACQUISITION SCHEME= undefined
##.AVERAGES= 16
##.DIGITISER RES= 18
##SPECTROMETER/DATA SYSTEM= dpx250
##.PULSE SEQUENCE= zg30
##.SOLVENT NAME= CDCl3
##.SHIFT REFERENCE= (INTERNAL, CDCl3, 0, 16.522)
##AUDIT TRAIL= $$ (NUMBER, WHEN, WHO, WHERE, WHAT)
$$ ##TITLE= Audit trail, XWIN-NMR		Version 3.5
$$ ##JCAMPDX= 5.01
$$ ##ORIGIN= Bruker BioSpin GmbH
$$ ##OWNER= nmr
$$ C:\u/data/dgb/nmr/ADRS/1850/pdata/1/auditp.txt
$$ ##AUDIT TRAIL=  $$ (NUMBER, WHEN, WHO, WHERE, WHAT)
(   1,<2006-10-27 13:06:43.62 +100>,<MAYBRIDGE\nmr>,<NMR_250MHZ>,
      <created by zg, POWCHK disabled, PULCHK disabled
       configuration hash MD5:
       49 4B E0 1D 92 C2 6B 37 9F E6 65 BC 52 41 86 1D
       data hash MD5: 64K
       C8 67 A2 EE 81 33 E7 75 E4 8A 4F 2B 63 F6 88 8A>)
(   2,<2006-10-27 13:06:57.90 +100>,<MAYBRIDGE\nmr>,<NMR_250MHZ>,
      <Start of raw data processing
       ef LB = 0.3 FT_mod = 6 PKNL = 1 SI = 32K 
       data hash MD5: 32K
       4D 45 02 E7 B0 1D 5F 70 14 F9 A8 48 74 0F 3B B3>)
(   3,<2006-10-27 13:06:59.53 +100>,<MAYBRIDGE\nmr>,<NMR_250MHZ>,
      <apk 
       data hash MD5: 32K
       FC DB 1E CD DD EA FB F2 5C 8F 1C 26 F3 8B B1 42>)
(   4,<2006-10-27 13:07:00.29 +100>,<MAYBRIDGE\nmr>,<NMR_250MHZ>,
      <abs ABSG = 5 
       data hash MD5: 32K
       EA 49 AA AA 47 E3 74 12 8D B7 91 FB 65 6B 58 19>)
$$ ##END=
$$ 
$$ hash MD5
$$ D2 05 68 5B 78 80 95 7D DC A0 75 BB 6B 73 E4 22
##$RELAX= 
##$RELAX= 
##$RELAX= 
##$RELAX= 
##$RELAX= 
##$RELAX= 
##$RELAX= 
$$ Bruker specific parameters
$$ --------------------------
##$DU= <C:\u>
##$EXPNO= 1850
##$NAME= <ADRS>
##$PROCNO= 1
##$TYPE= <nmr>
##$USER= <dgb>
##$AMP= (0..31)
100 100 100 100 100 100 100 100 100 100 100 100 100 100 100 100 100 100 
100 100 100 100 100 100 100 100 100 100 100 100 100 100 
##$AQSEQ= 0
##$AQ_mod= 3
##$AUNM= <au_zg>
##$AUTOPOS= <28 >
##$BF1= 250.13
##$BF2= 250.13
##$BF3= 250.13
##$BF4= 250.13
##$BF5= 500.13
##$BF6= 500.13
##$BF7= 500.13
##$BF8= 500.13
##$BYTORDA= 1
##$CFDGTYP= 0
##$CFRGTYP= 5
##$CHEMSTR= <none>
##$CNST= (0..31)
1 1 145 1 1 1 1 1 1 1 1 1 1 1 1 1 1 1 1 1 1 1 1 1 1 1 1 1 1 1 1 1 
##$CPDPRG= <>
##$CPDPRG1= <>
##$CPDPRG2= <>
##$CPDPRG3= <>
##$CPDPRG4= <mlev>
##$CPDPRG5= <mlev>
##$CPDPRG6= <mlev>
##$CPDPRG7= <mlev>
##$CPDPRG8= <mlev>
##$CPDPRGB= <>
##$CPDPRGT= <>
##$D= (0..31)
0 1 0 0 0 0 0 0 0 0.06 0 0 0 0 0 0 0.0002 0 0 0 0 0 0 0 0 0 0 0 0 0 0 
0 
##$DATE= 1161950802
##$DBL= (0..7)
120 120 120 120 120 120 120 120 
##$DBP= (0..7)
150 150 150 150 150 150 150 150 
##$DBP07= 0
##$DBPNAM0= <>
##$DBPNAM1= <>
##$DBPNAM2= <>
$$ [...]
##$SUBNAM7= <"">
##$SUBNAM8= <"">
##$SUBNAM9= <"">
##$SW= 20.6930455092707
##$SWIBOX= (0..15)
0 0 3 0 0 0 0 0 0 0 0 0 0 0 0 0 
##$SW_h= 5175.983436853
##$TD= 65536
##$TD0= 1
##$TE= 683.16
##$TE2= 300
##$TE3= 300
##$TEG= 300
##$TL= (0..7)
0 120 120 120 120 120 120 120 
##$TP= (0..7)
150 150 150 150 150 150 150 150 
##$TP07= 0
##$TPNAME0= <>
##$TPNAME1= <>
##$TPNAME2= <>
##$TPNAME3= <>
##$TPNAME4= <>
##$TPNAME5= <>
##$TPNAME6= <>
##$TPNAME7= <>
##$TPOAL= (0..7)
0.5 0.5 0.5 0.5 0.5 0.5 0.5 0.5 
##$TPOFFS= (0..7)
0 0 0 0 0 0 0 0 
##$TUNHIN= 0
##$TUNHOUT= 0
##$TUNXOUT= 0
##$USERA1= <user>
##$USERA2= <user>
##$USERA3= <user>
##$USERA4= <user>
##$USERA5= <user>
##$V9= 5
##$VALIST= <valist>
##$VCLIST= <CCCCCCCCCCCCCCC>
##$VD= 0
##$VDLIST= <DDDDDDDDDDDDDDD>
##$VPLIST= <PPPPPPPPPPPPPPP>
##$VTLIST= <TTTTTTTTTTTTTTT>
##$WBST= 1024
##$WBSW= 4
##$XGAIN= (0..3)
0 0 0 0 
##$XL= 0
##$YL= 0
##$YMAX_a= 551175
##$YMIN_a= -458860
##$ZGOPTNS= <>
##$ZL1= 120
##$ZL2= 120
##$ZL3= 120
##$ZL4= 120
##$ABSF1= 16.522
##$ABSF2= -4.171173
##$ABSG= 5
##$ABSL= 3
##$ALPHA= 0
##$AQORDER= 0
##$ASSFAC= 0
##$ASSFACI= 0
##$ASSFACX= 0
##$ASSWID= 0
##$AUNMP= <proc_1d>
##$AZFE= 0.1
##$AZFW= 0.1
##$BCFW= 0
##$BC_mod= 0
##$BYTORDP= 0
##$COROFFS= 0
##$CY= 12.5
##$DATMOD= 1
##$DC= 0
##$DFILT= <>
##$DTYPP= 0
##$F1P= 14.0000005364418
##$F2P= -0.99999901652339
##$FCOR= 0.5
##$FTSIZE= 32768
##$FT_mod= 6
##$GAMMA= 0
##$GB= 0
##$INTBC= 1
##$INTSCL= 1
##$ISEN= 128
##$LB= 0.3
##$LEV0= 0
##$LPBIN= 0
##$MAXI= 10000
##$MC2= 0
##$MEAN= 0
##$ME_mod= 0
##$MI= 0
##$NCOEF= 0
##$NC_proc= -4
##$NLEV= 6
##$NOISF1= 0
##$NOISF2= 0
##$NSP= 0
##$NTH_PI= 0
##$NZP= 0
##$OFFSET= 16.522
##$PC= 1
##$PHC0= -46.16787
##$PHC1= 2.386355
##$PH_mod= 1
##$PKNL= yes
##$PPARMOD= 0
##$PSCAL= 4
##$PSIGN= 0
##$REVERSE= no
##$SF= 250.13
##$SI= 32768
##$SIGF1= 0
##$SIGF2= 0
##$SINO= 400
##$SIOLD= 32768
##$SREGLST= <1H.CDCl3>
##$SSB= 0
##$STSI= 32768
##$STSR= 0
##$SW_p= 5175.98343685301
##$SYMM= 0
##$S_DEV= 0
##$TDeff= 65536
##$TDoff= 0
##$TI= <Analysis number 999999
Compound Code 99
Book Reference 9
Project Code 9>
##$TILT= no
##$TM1= 0
##$TM2= 0
##$TOPLEV= 0
##$USERP1= <user>
##$USERP2= <user>
##$USERP3= <user>
##$USERP4= <user>
##$USERP5= <user>
##$WDW= 1
##$XDIM= 32768
##$YMAX_p= 277990518
##$YMIN_p= -263488
$$ End of Bruker specific parameters
$$ ---------------------------------
##NTUPLES= NMR SPECTRUM
##VAR_NAME=  FREQUENCY,     SPECTRUM/REAL,   SPECTRUM/IMAG
##SYMBOL=    X,             R,               I
##VAR_TYPE=  INDEPENDENT,   DEPENDENT,       DEPENDENT
##VAR_FORM=  AFFN,          ASDF,            ASDF
##VAR_DIM=   32768,         32768,           32768
##UNITS=     HZ,            ARBITRARY UNITS, ARBITRARY UNITS
##FACTOR=    0.157963299565203, 1,           1
##FIRST=     4132.6476996994, 0,             0
##LAST=      -1043.33573715361, 0,           0
##MIN=       -1043.33573715361, -263488,     0
##MAX=       4132.6476996994, 277990518,     0
$$ Real data points
##PAGE= N=1
##DATA TABLE= (X++(R..R)), XYDATA
$$ [...]
22178 31208 28150 24485 -5301 -23641 -16335 -29645 -55922 -111207 -79634 -23956 -29350 -50836
22166 -50836 -38822 -70439 -63609 -29388 -25631 -23030 -4287 -32295 -30118 -20018 -39318 4769
22154 4769 58780 50405 -12485 7963 -13791 18849 22692 7217 4955 -27746 -66435 -83681
22142 -83681 -27250 1497 -3365 -25436 -43539 -42136 -56053 -52320 -6942 1884 6081 5262 -5848
22129 -5848 693 18186 45687 69227 48998 28058 38123 8638 -47410 -78222 -22349 58611
22117 58611 86517 37528 32527 36757 41229 5824 7273 23107 18186 25818 46732 47764 -3707
22104 -3707 -16361 -19513 -8270 -771 -54901 -90594 -108166 -70920 -11935 1852 875 -4723 -34911
22091 -34911 -37537 -28016 -22637 -25460 -51941 -47956 -39979 -56574 -64815 -69688 -49115 -37785 -25795
22078 -25795 -11783 -1999 -38851 -45165 -23554 8169 8202 -6109 461 11609 41165 32572 29253
22065 29253 -36619 -46772 -21770 6458 36971 32023 21777 10379 13488 -25436 -22316 -232
22053 -232 8876 -12517 -50679 -45047 -20695 -10045 -34399 -45172 -40512 -23159 -27806 -7829 -13182
22040 -13182 10442 16570 3491 -18071 30626 66835 19070 -4184 2551 -22737 -25819 10482
22028 10482 -8447 11000 24044 20251 18405 33444 36046 32830 21693 23586 12650 5397 28221
22015 28221 20579 -47067 -71063 -61949 -39507 7326 201 8286 -8533 -40091 -53391 -32096
22003 -32096 -36672 -18044 29361 42069 -9127 -27342 -17049 3885 9339 17898 10853 13752 -3668
21990 -3668 -41275 -79136 -47685 -13297 -14705 -14555 -6302 14084 16639 -39440 -76072 -48503 16806
21977 16806 31930 -2640 -38464 1000 -8255 -41590 -46219 -49687 -84434 -74837 -19925 -4722
21965 -4722 -46431 -64205 -48394 -56822 -46421 -31157 -23216 -16133 -16625 -46169 -23884 2133 11395
21952 11395 16239 7654 -8269 16324 -48830 -72986 -64033 -38880 20291 50810 51182 84403 67660
21939 67660 31553 -4707 -12643 -8000 -19713 -14040 -18299 -16771 3239 -3922 -21839 -46694 -60699
21926 -60699 -45682 -3199 -10427 -34809 -41829 -41967 -48196 -34609 -69527 -83598 -62229 -18276 -56069
21913 -56069 -45252 -13980 -16574 -18200 -1181 17449 -44975 -73876 -107739 -90757 -48652 -77651
21901 -77651 -61383 -52420 -68746 -56936 -35619 -46151 -59077 -22917 1417 -21698 -16449 4464
21889 4464 -7312 -5835 4219 38078 13574 -8023 1516 4677 -13652 -52803 -20432 14169
21877 14169 4853 4504 -20520 -33518 -29384 45369 66792 34163 7796 -37246 -60362 -62455 -69629
21864 -69629 -63478 -93728 -77727 -54712 -13449 -33600 -3534 -35757 -37856 -42819 -43629 -12893 -10733
21851 -10733 -46516 -76067 -55129 -23405 -49982 -86245 -51241 -41753 -58210 -47928 -18635 -9345
21839 -9345 51829 38567 -1487 3428 25921 31420 40781 52553 13472 23013 18210 24919 19685
21826 19685 14814 7563 -33335 -45102 -12349 1606 -2114 4625 -11512 -25932 -25688 -52365 -58927
21813 -58927 -10847 -19281 -7259 36655 42035 62693 40379 -1093 -17502 -4027 -436 -40085
21801 -40085 -40199 -16007 -12490 -31795 -7197 -2218 -7578 -3881 5 -34625 -34285 -32179 7665 32606
21787 32606 18797 44643 57850 17927 -4827 15185 9312 -4938 -14364 -31911 -16757 19193
21775 19193 -9818 -9384 -11701 34242 70977 46535 33437 -30242 20574 43978 3591 -26284
21763 -26284 17537 18122 17736 53513 33550 12412 21225 22441 38402 44668 13372 -25941 -74415
21750 -74415 -76642 -62990 -64996 -21370 -11134 -70193 -110528 -153066 -183529 -137817 -98299 -36831
21738 -36831 -13554 -46252 -78850 -23883 21792 75251 49140 1499 8712 3794 -45875 -52584
21726 -52584 -36870 -50255 -23784 17812 -4298 -9956 27462 -1977 -11379 14397 -67 18713
21714 18713 14066 -16861 -29345 2225 32195 43038 81575 82658 37387 37997 62332 86089
21702 86089 100552 79652 76777 50717 -6602 -51674 -73742 -104895 -85301 -52836 -4969 -38864
21690 -38864 -46994 -34661 -22115 -15688 -33371 -59206 -62365 -49152 -33089 -39445 -17555 -21082 -11162
21677 -11162 17511 -2287 -53347 -52604 -68551 -47308 11524 -23428 -42908 16223 33564 31482
21665 31482 9741 -28585 -45894 -36670 -38124 -16066 -44235 -53172 -42498 -37404 -35178 -60430 -52667
21652 -52667 -41941 -34074 -15335 21073 62088 24655 46097 31692 22238 -15147 -16761 27481
21640 27481 23469 21188 87802 79898 4778 -12566 -32059 -67684 -62666 -39031 -91034 -84759 -34030
21627 -34030 -54603 -48691 -40469 -5327 24230 -42886 -63923 -61658 -41943 -13286 -31741 -54477
21615 -54477 -38457 -47214 -28664 6617 25828 40106 73989 44351 6817 -46345 -39623 -4806
21603 -4806 10846 38423 47353 54068 45934 56412 63728 87479 92083 56007 15778 -53904 -64416
21590 -64416 -35569 -44282 -30587 31877 24085 -6324 9617 20757 14237 5785 11075 22840 42180
21577 42180 35297 16310 -50913 -38569 11235 18519 40014 914 8420 27895 48192 8480
21565 8480 -33 -15917 871 505 -39238 -15359 -12909 -47411 -74917 -52021 -60756 -63207 -61711
21552 -61711 -91841 -65401 -41122 -71200 -90791 -89920 -67869 -30041 8770 32180 -490 -42128
21540 -42128 -49915 -13158 50584 50524 11655 -6097 -44471 -31252 -32920 -52637 -107994 -91239 -69260
21527 -69260 -121177 -99851 -59470 -57478 -28504 2319 19178 25617 4199 -12469 11915 52981
21515 52981 56246 41649 38109 57130 47487 38563 35912 17311 -35219 -4154 -9853 -11366 -20750
21502 -20750 -88940 -113690 -121276 -100048 -45961 -26099 -16546 12106 29980 17991 3482 -10263
21490 -10263 -7267 -45405 -104781 -134475 -72837 -38070 -19896 -12405 -29266 -48042 6829 30062
21478 30062 -1734 -67796 -71559 -67731 -58064 -54936 -73514 -89144 -71395 -56118 -53604 -52487 -60732
21465 -60732 -30149 -15356 -79445 -78611 -49930 -1613 19235 -34530 -50156 -56723 -33206 -57336
21453 -57336 -67543 -65918 -48238 -34594 -5263 64495 56938 17902 -68791 -88186 -83358 -92027
21441 -92027 -97506 -96324 -41068 41569 22155 -26508 -102689 -115970 -62043 -24603 -144 -4924
21429 -4924 -32008 -56327 -87036 -129183 -143910 -120825 -88991 -38276 41285 55207 17380 50593
21417 50593 82751 4649 -41931 -58175 -69577 -60280 -21134 36561 22249 34047 14439 -30823
21405 -30823 -17384 -68188 -64560 -10016 32207 57462 43298 29013 35577 31602 32684 46329
21393 46329 45678 54994 6845 -8995 7364 52238 35293 -31823 -1774 30119 16151 -30495
21381 -30495 -74725 -69311 -69001 -64335 -44229 -70576 -93653 -103855 -59756 -37776 -16712 21721
21369 21721 2339 -31309 -37268 -76047 -65601 -21037 -36152 -18254 16016 41211 33344 -23092
21357 -23092 -78064 -64257 -67557 -109101 -106104 -105398 -95907 -81478 -113598 -126767 -134258 -96234 -44675
21344 -44675 -44574 -25996 -324 34076 51512 29868 -34681 -60843 -70633 -100286 -49627 42574
21332 42574 99483 57966 35342 18540 12733 75029 101825 99096 9621 -46022 -92128 -76839
21320 -76839 -68215 -78168 -42435 -10933 -53922 -83487 -97951 -152118 -140982 -75832 -9544 -5041
21308 -5041 -30114 -55252 -3026 54931 46604 39050 14766 19948 -9089 27581 47902 4729
21296 4729 3842 -7398 14943 -19635 -59800 -61049 -12518 40317 23175 19586 257 -43202 -52298
21283 -52298 -29428 -52102 -40046 -24052 -19262 13482 27778 71696 11305 -24018 -44052 -4552
21271 -4552 12477 11680 -38417 -77502 -86382 -75688 -55071 -52539 -88678 -75403 -67500 -43819 -32908
21258 -32908 -48565 -47009 -60100 -34809 836 -15805 -53866 -118026 -127364 -107846 -49583 318
21246 318 28111 50001 30005 -21549 -40136 -23119 -21410 -30482 -7598 -16129 -22954 31059 63873
21233 63873 19144 36451 34186 -20310 -39877 -36712 -20783 -18709 -8994 15691 -26547 -31614 -50775
21220 -50775 -65642 -57163 -25616 4434 413 3483 38947 93414 146732 116892 67222 56834
21208 56834 23534 -8655 -6305 48599 35122 45731 70643 56855 51720 21886 36009 52544
21196 52544 23367 -32430 -20404 -6905 -143 16183 32681 30739 16883 -6817 -22163 -55306
21184 -55306 -79189 -67479 -7020 33418 -7987 -19078 -31426 12080 46467 34568 40194 2006
21172 2006 -32787 14451 27425 14471 -10848 -17288 -7953 -8026 1042 18215 28676 36859 3716
21159 3716 -39050 -25736 -29032 -61394 -60088 -8934 5158 -19752 -50485 -35755 -30535 -10980
21147 -10980 8065 8486 10302 -15481 30109 28256 -16614 -17097 -7940 -35209 -29763 -72099 -85438
21134 -85438 -68588 -41720 9233 -9031 -50507 -63061 -14254 -35955 -7327 23939 55043 20816
21122 20816 -15181 13064 7315 -5147 -52019 -63136 -28395 4369 -34185 -22143 -31738 5165
21110 5165 11138 32480 68489 31994 10369 -38396 -49858 -18592 27415 60314 104062 109783
21098 109783 90862 72677 25995 7132 -61778 -102098 -98463 -101202 -62202 -46881 -21770 -42556
21086 -42556 -24234 3417 19362 14361 42089 -21556 -68132 -78613 -41791 -3428 -13031 -7446
21074 -7446 -49836 -32329 13609 11240 -44507 -23458 -45528 -67346 -41302 -46595 -9388 52723
21062 52723 -5058 -48199 -29757 -50786 -72159 -68055 -28386 -39201 -66518 -50729 278 22885
21050 22885 3512 -14980 4966 -39743 -67115 -66348 -38685 -44031 -67513 -73933 -49180 -46038 -48533
21037 -48533 18138 65691 33883 6226 14883 27357 4222 -36238 -36567 -30211 15538 24869 9483
21024 9483 -10923 -57265 -13865 -9826 -27051 -7903 -4910 -22298 -38317 -40472 -41631 -28128 -6275
21011 -6275 -23949 -58167 -57697 -41134 -27811 -12885 -26226 -21962 -56131 -81926 -39050 14630
20999 14630 20640 -18574 -13898 35835 49886 -9393 -36947 -6490 -37679 -25067 29315 32677
20987 32677 2641 -11077 11971 19093 -19101 -31207 9471 -17763 -28705 -46670 -14543 22701
20975 22701 23809 8845 17998 15016 -11420 -12706 -19892 -11247 -22599 -51140 -49175 -63484 -46090
20962 -46090 -15319 -3545 8201 -14511 -75654 -120219 -124303 -94753 -103570 -29303 52233 28689
20950 28689 -36072 -53532 -33119 -27539 -39786 -22310 -4998 14889 1899 -59 -9075 -37639
20938 -37639 -29810 -27328 -47096 -15044 -462 -39788 -67005 -45529 -53927 -43028 -44023 -23482 -26676
20925 -26676 -32303 -32364 -16146 12966 -15577 -30673 -38524 -66918 -69642 -82343 -79858 -67081 -41179
20912 -41179 -61461 -60179 -49298 -41095 -36767 -41955 -52254 -35208 31523 8552 -30689 -17844
20900 -17844 -4794 -30737 -21073 -4158 -21377 -32674 -31529 -45388 -80221 -55893 -61383 -23892
20888 -23892 13404 8354 -30947 -42351 -34988 -16743 -62008 -83641 -57576 -55834 -4123 -238
20876 -238 4125 -22228 338 63680 49584 23667 6576 19019 300 -19820 -16648 -4652
20864 -4652 -21594 -58638 -40047 -66446 -74736 -22563 -36826 -73750 -37481 -18866 -15019 -26200
20852 -26200 3074 67420 40795 -6775 -20992 -33390 -22271 -35376 -97157 -106423 -45331 -24749
20840 -24749 -34106 -36025 -27535 17326 65758 68106 62945 64999 23688 -43543 -39298 -5154 189
20827 189 -26960 -19732 5587 -4588 -49756 -70963 -26634 -41217 -58524 -35443 -47495 -64400
20815 -64400 -59433 -8762 28141 7242 16753 19485 22726 -1409 -15808 -10202 67830 82545 66781
20802 66781 59727 71660 50938 -324 -20878 -62078 -67788 -93022 -81034 -29301 -26624 -10314
20790 -10314 4118 -25948 -64671 -109268 -77622 -48910 -8205 30654 38578 -4404 -34842 -19681
20778 -19681 -12795 -34367 -43599 -24096 10796 47294 73930 58104 35996 -26370 -43723 -52382
20766 -52382 -57179 -22914 -11802 4829 26785 -13566 20561 73116 87100 54773 15575 -31005
20754 -31005 -76189 -71341 -65844 -87029 -77568 -38068 56262 64325 16799 7986 -2845 -5603 -14116
20741 -14116 -20745 -35608 -9108 -51760 -29692 -36397 -62124 -54922 -82254 -46921 -41289 -42904 -51341
20728 -51341 -32181 -12009 -48798 -86369 -59249 -42977 -64407 -98543 -77600 -45108 -30430 48495
20716 48495 56719 -28919 -69311 -77864 -35887 -5768 12472 60086 81540 62865 63292 77400
20704 77400 1662 -40111 7812 42506 46232 37934 -1379 -11340 6322 7107 -8489 -14936 12262
20691 12262 10656 10556 14098 27903 93133 108668 98897 101638 66120 13866 -21982 2503 2147
20678 2147 -9864 -6896 -9138 -13798 -21764 -53536 -65482 -38790 14264 40167 -27997 -78326 -115114
20665 -115114 -89631 -59367 -24949 -13023 -18435 -45067 -21877 -28998 -11793 42819 53607 23282
20653 23282 -28166 -20992 908 44326 55935 88665 124351 61071 11956 -17742 -31764 -36618
20641 -36618 -37607 -30301 -34576 -54707 -96840 -67769 -25574 -40731 -94436 -106284 -114950 -90137 -12553
20628 -12553 12818 -3318 -30799 34765 30144 -4322 -16292 6475 6203 6878 9580 4525 -41902
20615 -41902 -27883 -2018 -32936 -64617 -54358 -7255 50516 72605 67025 16666 -13240 -27783
20603 -27783 -59383 -84574 -65661 -18490 9749 -25401 -65616 -61533 -13680 -1033 3239 -23786
20591 -23786 -13667 13642 -4703 -27833 -44737 -27744 -15658 -26255 -46545 -47319 -35745 -5379
20579 -5379 -27030 -36098 23516 35793 13775 35310 30567 -8794 -52518 -58728 -4788 62445
20567 62445 71817 39113 -18366 -61815 -31029 5978 -24211 -49474 -41393 -6743 37416 17923
20555 17923 21843 -7033 -68528 -58542 -50684 -53415 -82915 -95840 -51582 -22753 8806 24795
20543 24795 13946 49304 17462 -19942 -64419 -73851 -74869 -63262 -42863 -32724 -59861 -57649
20531 -57649 -61817 -80644 -41717 -16866 -26666 -59396 -56702 -67755 -65513 -45908 -97608 -138049
20519 -138049 -158582 -111609 -93859 -53417 -53528 -47732 -55711 -39937 14410 21192 -2907 11266
20507 11266 2677 1499 21909 29779 32435 24251 -11996 -35777 -22420 -43488 -68650 -75232 -84516
20494 -84516 -38543 57503 6479 -53236 -69085 -99253 -100894 -60729 -22941 -25427 -12378 5404
20482 5404 -2569 -31902 32294 37556 -15268 -50093 -27443 9909 57718 66454 49281 50258 82704
20469 82704 72703 27400 -13657 18049 24564 10214 5045 3542 -17331 17547 42995 18788
20457 18788 22536 -27471 -74894 -87252 -69039 -54020 -39853 -34705 -18469 7735 -19762 5645
20445 5645 -6228 -39377 -16182 9588 24969 -24315 -29259 -28958 -38546 -51446 -51970 -68291 -43285
20432 -43285 -13116 -56397 -101576 -119124 -63645 -40104 -82280 -99611 -66446 -31095 -49547 -38914
20420 -38914 -24705 -40949 -57745 -61439 -45978 -25102 -46767 -30267 -593 46655 95317 68202
20408 68202 3368 -28137 13437 15155 -7332 -11527 -1607 34831 3810 -46852 -36485 -12574
20396 -12574 -9354 -68419 -58776 7862 -9018 -40132 -53571 -23489 7590 -25332 -35346 -29336
20384 -29336 -14382 -32836 -3316 -41149 -80004 -71073 -45016 -37315 -48657 -58235 -44980 -46080
20372 -46080 -33702 -23099 -15219 -9466 -12521 -22406 -22640 -7585 -10337 -3446 -27584 -46800 -30138
20359 -30138 -16381 -44979 -56153 -66769 -73751 -64762 -92254 -127596 -135483 -143049 -119276 -74857
20347 -74857 -11709 -14433 11692 45517 71328 37041 14984 16981 8054 63651 71820 66829 31472
20334 31472 8845 -8976 -28580 -24150 -31587 -21533 -66769 -64862 -18496 -7296 -5663 4444
20322 4444 34874 74044 35952 -27767 -39595 -46312 -30725 -47685 -16345 8703 -10715 -18301
20310 -18301 40205 55111 71417 80152 53578 56341 53423 10859 -8653 -35781 -50193 -30523
20298 -30523 -5995 2527 -5995 -47240 -39927 -38453 -10437 -3114 -45713 -73713 -82359 -75588 -64687
20285 -64687 -6881 4004 14456 58599 33770 -9806 -43398 -42412 -44030 -73206 -81647 -113838
20273 -113838 -89464 -58748 -47377 -31249 -33832 -47000 -53318 -59168 -82902 -24397 12456 2272
20261 2272 -22613 -16871 -36427 -119647 -97162 -41742 -22833 -71912 -70009 -24101 -3035 19235
20249 19235 8421 -26798 -44546 -27107 9963 41939 28611 4204 -7127 -17742 -25792 -51830
20237 -51830 -56048 -28965 7952 20423 38741 55663 55543 -26207 -36641 -17245 -311 -4881
20225 -4881 -26923 -19208 -12852 -47320 -23875 4849 -34659 -54871 -35243 -10416 26011 18811
20213 18811 3087 4460 -16910 -33129 -1922 29744 13370 -7619 2011 -74360 -128919 -104374
20201 -104374 -68652 -100423 -83929 -37653 13941 26098 2174 -42427 -47571 -18506 -32885 -8596
20189 -8596 -17773 -36088 -24530 -40940 -41398 -22934 -7953 -42463 -71982 -63169 -66982 -31475 17228
20176 17228 41790 25712 17655 344 25322 29924 -27424 -119751 -137512 -74820 -35680 -69962
20164 -69962 -129861 -140210 -112235 -48572 -33303 -59694 -36278 -37600 -93960 -98345 -89617 -48890
20152 -48890 -11627 19139 10594 -37046 -30835 -30795 -22213 598 -26337 -65501 -79375 -64894 -21308
20139 -21308 17748 58269 14060 -40556 -38811 -42906 -37154 5544 57564 38331 -2466 -44964
20127 -44964 -4357 17182 -6177 -14161 -21221 2763 -25795 -35814 -26714 -47865 552 35719
20115 35719 11563 -42064 -42406 3664 -3100 -22973 -19335 -14057 5595 9507 35934 27784 14108
20102 14108 32117 75514 18892 -5584 26242 9397 20347 -31257 -42705 -27904 -184 -11584
20090 -11584 19345 22345 2872 45085 44173 25750 -1770 -64327 -95106 -64368 -50550 -37618
20078 -37618 -38799 -52400 -60706 -68733 -21537 6057 12771 4303 -25140 4397 46753 84518 26105
20065 26105 -11178 -20187 10436 26961 -5047 -36076 -51238 -64169 -28915 22422 73019 86068
20053 86068 34951 21488 22906 34552 26852 11625 5507 -26385 -30719 42527 4451 -35020
20041 -35020 -61858 -122150 -109205 -58312 -57831 -19306 -34966 -29189 19385 -19063 -38089 -88855
20029 -88855 -57969 8167 31914 33152 -9881 -3705 45195 64762 43984 35524 27114 22887 49661
20016 49661 73804 80018 92845 65758 18821 -60208 -66305 489 5486 7040 43751 4367
20004 4367 -7918 -15944 1959 -11741 -71267 -83115 -69891 -73740 -118001 -136544 -95001 -58347
19992 -58347 -52548 -85081 -57724 -35406 -37972 -4477 -9255 -20935 -37043 -34054 -39751 -55428 -37204
19979 -37204 -10245 -41005 -55805 -73584 -94165 -115439 -60903 14685 29343 30321 34624 49916
19967 49916 45987 3378 -58936 -47036 -57278 -48435 -951 8407 -18984 -27479 -10441 -3544 -44649
19954 -44649 -51006 -45256 -59146 -40913 -39660 -28901 -42221 13389 42006 1632 2194 19683 -4604
19941 -4604 -73048 -64323 -62784 -56896 -24915 -16567 -28134 -51213 -36931 -35765 -39258 -33316 -96140
19928 -96140 -140534 -148978 -81485 7592 72014 54382 33513 57402 39113 10106 -29463 -40542
19916 -40542 -54160 -70659 -55581 -40500 -58342 -98266 -91400 -113945 -106051 -116187 -111084 -86595
19904 -86595 -53454 -15572 15571 14295 -28147 -81866 -86187 -40123 -8945 -24593 5496 39085
19892 39085 -14810 -35942 -552 -16097 21537 22353 17621 5803 -39023 -84980 -69260 5653
19880 5653 50640 46592 37959 4521 -13372 -38474 -39314 -2239 -16768 -24790 -56681 -46666 -20958
19867 -20958 -45064 -74661 -49538 -52212 -35080 -4174 3497 -4387 66803 88190 77990 27650
19855 27650 -23253 -67959 -86905 -43729 -35987 -11656 2111 37959 11208 -38741 -61806 -51028
19843 -51028 -71858 -67985 -24469 -29913 -14657 -48374 -91909 -160138 -111785 -33203 -240 -26623
19831 -26623 -45898 -60011 -70122 -46722 -38569 -93501 -78975 -24353 -50257 -115985 -115038 -65268
19819 -65268 -38510 -46868 -55821 -83167 -89240 -52742 -54921 -32444 -33979 -69575 -57922 -28597 -4397
19806 -4397 15241 11852 -45057 -77262 -40665 2051 18949 1145 6360 -13017 8608 984
19794 984 -16437 -17799 -13415 16167 18373 36009 17158 -47219 -88911 -81588 -7711 17193 -26707
19781 -26707 -47857 -68396 -29435 5122 24880 -24499 -21113 -52430 -93563 -91536 -24233 3117
19769 3117 1083 -10330 3910 -22492 -26227 -50753 -46292 -77501 -97671 -108247 -35404 -16857
19757 -16857 4450 25836 -10494 -34243 -10197 1999 22301 -18860 -83256 -75073 -59941 -46776
19745 -46776 -60501 -67881 -78492 -103921 -109691 -121701 -110681 -96081 -72736 -14841 7191 919
19733 919 -3997 -4569 11009 28195 -6683 -31442 -28315 -5232 -13767 -21737 -7576 7124 -14336
19720 -14336 -32349 -10220 9415 25606 -13383 -7491 -48917 -50850 -74158 -53395 -26912 -37442
19708 -37442 -25220 41365 37168 22068 4134 -5267 34350 65317 18695 -18304 -32170 -52639
19696 -52639 -21253 -6064 -25603 -33168 5292 17211 57936 450 -44133 -57499 -73596 -49567
19684 -49567 -22875 -27916 -3405 -12193 -51429 -82146 -62198 -45384 -66715 -88946 -74538 -86904
19672 -86904 -41989 -13169 -329 -40842 -9933 56450 23340 -13250 9318 11699 -28468 -32301
19660 -32301 -30963 -32459 -465 30611 11480 9179 7368 -21411 -71360 -68653 -14355 25155 32970
19647 32970 -1088 -47829 -64004 -58657 -45844 26138 4167 -13130 4151 -10146 -52861 -44726
19635 -44726 -26496 -44956 5093 35334 32358 12841 37142 36610 12252 -22202 -45393 -42295
19623 -42295 -55497 -73771 -37266 -43069 -30422 -29246 -37147 -21542 9675 -5139 -35070 -84910
19611 -84910 -55702 10101 11638 19845 -7120 -16556 10101 21300 36636 -5686 -22924 9522
19599 9522 9169 40259 25363 14425 47954 20133 -21767 15499 43997 27380 -8462 -64211
19587 -64211 -114709 -140034 -87384 -36124 -32713 -44045 -60111 -13174 20707 -6236 -59840 -35232
19575 -35232 20030 30140 -4201 3912 5022 -26920 -7734 -11944 -17889 -21057 -62464 -32006 -18729
19562 -18729 -14998 -30758 -68606 -82339 -63742 -38353 -20789 -28763 -27865 -33318 -18693 8545 51831
19549 51831 42866 -42908 -82681 -73610 -81450 -52118 -73420 -60825 -18562 -22163 -30433 -20254 -38282
19536 -38282 -77806 -60678 -36176 -12939 -14446 10267 44038 46565 6372 -34862 -53230 -25577
19524 -25577 -32781 -25438 -23135 -70149 -71333 -35065 18384 27670 -53910 -63065 -32006 -28041 -47276
19511 -47276 -85147 -69873 -61159 -36474 -45854 -61348 -45465 -31413 -27531 -30243 -4171 -21396
19499 -21396 -35687 -54661 -97664 -120679 -121717 -94365 -63025 -39683 -58469 -46213 -51736 -43139
19487 -43139 -12815 -5071 4584 -3725 16621 -13781 -9303 -6288 -1996 19243 36093 16355 -25955
19474 -25955 18844 -3078 -11212 38839 45508 44296 65211 98475 78399 67918 34069 26637
19462 26637 48715 67616 63093 59221 54853 26532 -39012 -14553 -10395 -42472 -22633 -37994
19450 -37994 -57803 -32779 13460 -25999 -58990 -49715 -19421 19019 7014 -33628 -35241 -67072
19438 -67072 -87658 -86606 -30074 -1840 -87470 -99201 -71094 -50239 -54778 -83080 -83385 -138541
19426 -138541 -163936 -164473 -82642 -72023 -101524 -64004 -49917 -63081 -36133 41315 60648 65094
19414 65094 68629 36869 29086 -5085 33047 -6359 2971 -790 -26993 -35768 7900 -23246 -84027
19401 -84027 -99609 -82735 -96287 -34891 -56803 -70185 -76404 -93295 -55572 -59701 6163 37111
19389 37111 56924 6987 28287 79146 30460 -9672 -15305 4407 16467 7296 -9044 -25625
19377 -25625 -20218 1891 -1934 -43323 -31496 -33717 -13817 23394 76394 47298 33994 73285
19365 73285 43465 -6760 -8475 -11591 -38323 -44773 -46763 -19438 -2548 12512 -27231 -44306
19353 -44306 -14062 7094 17642 -31807 -46028 -25565 -53855 -76966 -83935 -103607 -80905 -18581
19341 -18581 6386 -22193 -31134 -25929 -42355 -35159 -28474 -407 -22305 -64365 -88323 -112695
19329 -112695 -104900 -63919 16018 15596 2101 70829 64384 19831 1494 2973 -15210 -20735 -82785
19316 -82785 -119383 -108409 -80607 -17063 8207 -6990 -435 3542 12704 -9256 -1449 29667
19304 29667 79441 44926 18762 703 -47555 -25843 -27089 -53424 -60056 80 -6812 -35130
19292 -35130 -20490 -69764 -98192 -63114 -45373 -32057 -6535 -12292 -15515 -38586 -36331 -11890
19280 -11890 25039 2933 -22898 -57978 -78540 -37831 -13064 -73357 -18183 22223 5986 2790
19268 2790 -62117 -44107 16523 16565 -21104 7797 30520 34649 43214 47691 -902 -30781 -57106
19255 -57106 15566 45902 15118 -81584 -146981 -126348 -92470 -52112 -59148 -26782 3601 -49760
19243 -49760 -37369 -72731 -135076 -141520 -129483 -150468 -109391 -100412 -109010 -100928 -96830 -88678 -53841
19230 -53841 7440 -29191 831 11262 -48313 -45901 -11325 -12085 33130 18062 23777 13123
19218 13123 -48552 -58052 -87530 -113135 -55472 -45237 -44961 17297 55603 14434 -32852 -63907
19206 -63907 -95945 -99903 -42506 -55111 -75114 -47366 -26027 -39692 -2822 20300 -42373 -73661
19194 -73661 -57621 -49163 -8159 29119 10168 -70833 -65881 -49505 -55748 -47778 -81728 -71815 -95148
19181 -95148 -68644 -1566 20405 19988 28474 -11275 -33375 -30958 24383 -18258 -18097 25629 55869
19168 55869 49497 53548 35711 44438 40518 45195 1657 25354 93786 90757 86221 116973 143959
19155 143959 123591 76876 97557 120896 87957 101320 113103 132141 187525 247202 240276 200395
19143 200395 200500 213864 189771 187167 162140 138551 152016 141618 91286 106494 96396 61302
19131 61302 86690 129988 94018 14792 -46072 -59291 -21025 22656 15734 -16947 -19269 -17360
19119 -17360 10094 69527 37767 -15307 -5628 -60985 -107380 -82884 -26395 27393 66329 71697
19107 71697 102448 137843 151311 231535 262230 235624 285765 338650 342195 325233 303675 287123
19095 287123 316014 320075 332493 321746 297709 244014 209425 210929 205131 188484 191561 165646
19083 165646 119658 146532 136240 67095 17123 21606 55103 82040 83484 94433 92503 94007
19071 94007 78408 59762 36175 39410 89893 78746 -10273 -16279 439 28688 -17679 -51783
19059 -51783 1357 20770 1732 4251 50670 104064 162031 194555 218958 178974 188787 258173
19047 258173 321816 380037 394910 359474 310039 271359 224431 201548 189594 190365 220250 256756
19035 256756 217831 140728 102949 6614 -74724 -86446 -39949 49032 48507 50177 24614 -3578
19023 -3578 -29160 -5383 37315 47966 97123 52929 46601 67234 7155 -10258 64881 57664
19011 57664 49799 60513 75831 87862 89699 97304 116371 90746 43907 7960 20164 44745
18999 44745 75225 41279 26450 51719 54183 13073 -18080 -52283 -49028 -25724 -34773 -32789
18987 -32789 -79781 -107179 -85540 -37533 -14790 -80966 -92569 -5796 6726 -1515 -33667 -47191
18975 -47191 -44906 -15890 -18467 -21407 -21274 8036 6698 5268 -1705 12999 -1202 -4335 -837 7033
18961 7033 5654 -7856 21875 55772 13064 -14963 -5769 -903 -12104 -8425 35275 62010 73989
18948 73989 45897 22721 18512 46196 75878 62803 33915 -16381 -26535 -3057 23803 -4770
18936 -4770 35327 50806 11899 -14691 -21994 -106 -22893 -18435 6162 41794 9323 34615
18924 34615 53663 13822 -61352 -20562 -33510 -49900 -54358 -59971 -70564 -50796 -50867 -36312 18214
18911 18214 62733 76861 48996 76247 121172 155311 110173 95931 83668 110332 105542 148365
18899 148365 102011 54120 77624 131336 113303 58892 72623 116749 90690 100125 136734 96146
18887 96146 42138 18922 10962 31587 17346 -3341 -37163 -23955 -24769 -20037 -28196 -22674 -39973
18874 -39973 -17147 24958 5691 8810 -9701 -14584 -47014 -72228 -86292 -49108 13776 56728
18862 56728 8212 -20575 -13354 15963 -33646 -34366 -15024 -22570 3439 8767 26637 -3586 9216
18849 9216 15530 35189 32058 17365 51555 50733 129182 133002 105076 115101 73892 72321 76548
18836 76548 77585 75517 44506 22111 -30336 -18427 -45858 -86794 -40969 -41394 -58917 -38671
18824 -38671 -40773 -58851 -67347 -88413 -133254 -78145 -39337 -20907 -33606 -69156 -76191 -93396
18812 -93396 -86797 -59502 -35022 -25368 -44987 -52655 -50737 -48231 -4476 -17424 -44119 -39161 -8549
18799 -8549 -5831 -5774 -12736 31128 68580 93671 125553 150801 108526 63710 32453 19754 26816
18786 26816 21818 21985 11827 30568 43750 48194 16220 25847 7228 27500 54226 54410 18730
18773 18730 -20248 22103 111648 165211 259576 364434 404448 351470 248559 153375 112729
18762 112729 89877 45621 347 41011 40734 21476 28978 48920 20554 42336 32439 24003
18750 24003 -35697 -51716 -13831 8999 1201 18510 71930 83818 92574 121677 148340 139458
18738 139458 128166 170915 147599 165184 199718 203794 186299 163850 120516 89041 128296 118924
18726 118924 96013 118611 104039 141475 163727 165661 180693 171024 170771 217342 208718 201686 210962
18713 210962 172147 146848 205174 266588 269675 242353 271115 300237 353434 339729 301260 291299
18701 291299 318746 332227 309927 317665 274407 231295 210975 236269 208446 235141 290981 319500
18689 319500 362964 413832 415788 425364 447662 451158 404106 401913 428247 471182 501330 525302
18677 525302 559273 556547 568148 555963 526565 565976 723711 795219 875534 964658 1033603
18666 1033603 1093938 1182140 1282118 1392582 1511990 1618375 1680024 1746434 1839341 1873724 1899703
18655 1899703 2024285 2223135 2492685 2829993 3209349 3695415 4459470 5586941 7128220
18646 7128220 9215950 12029013 15583868 19553928 23645160 27708455 32241339 37205479
18638 37205479 41606250 43929080 43446814 42680253 42597560 42048561 38898412 33114719 27841932
18629 27841932 24018322 20861797 17475133 13858291 11020338 9084665 7783321 6901116
18621 6901116 6300344 5903606 5598880 5426524 5331754 5214103 5142364 5188691 5255423 5327184
18611 5327184 5369659 5375765 5443083 5573183 5792430 6088235 6460775 6991204 7650311 8660093
18601 8660093 10161264 12302961 15236179 19020061 23475101 28378635 33406600 38985492
18593 38985492 45457419 52167028 57846322 61171305 63832966 67705712 71721638 73696413
18585 73696413 72894458 72021768 72071055 70905107 66661816 61856322 58264306 55083209 49775205
18576 49775205 42197392 35591588 30800827 26895692 22773059 18604012 15231134 12843316
18568 12843316 11209806 10084718 9276388 8646642 8104725 7736369 7435972 7198570 6963493
18559 6963493 6764233 6549505 6374091 6262221 6112392 6005124 5951462 5991776 6146856 6382521
18549 6382521 6769220 7487189 8542617 10002128 12157018 15185524 19069313 23605550
18541 23605550 28403505 33189363 38325123 44068138 49481676 53128416 53273412 51938214
18533 51938214 51467682 50991557 48174526 41753946 34837618 29659398 25751343 21813495
18525 21813495 17395278 13532996 10797593 8904107 7577159 6614976 5927743 5404449
18517 5404449 4948674 4602158 4301615 4062998 3902877 3735627 3600178 3467497 3316136
18508 3316136 3142975 2979295 2850213 2670187 2432067 2226186 2092246 1990674 1842493
18499 1842493 1728140 1662690 1573130 1499257 1471638 1422733 1375423 1324091 1294478 1249511 1190667
18488 1190667 1121945 1068713 1045638 959675 918639 883714 855293 882986 840532 794640 775186
18477 775186 762487 721966 711756 701490 692987 645997 610317 619064 654438 632355 616797 643316
18465 643316 648547 624692 615346 585914 585174 596284 584533 611074 609567 581595 529998 514343
18453 514343 519892 495856 501189 480650 415238 379731 345349 367558 314107 321995 332905 326367
18441 326367 257233 208512 250617 287686 278740 285239 320200 348214 309434 244127 228542 208246
18429 208246 216726 223459 277773 315890 298325 287704 300623 304966 340019 359290 369382 349154
18417 349154 356388 345072 303299 277091 266671 266825 286479 251881 243045 199044 193218 195468 226696
18404 226696 243907 261859 275373 205132 164850 143624 114044 151096 198713 176723 147252
18393 147252 159450 138962 142096 166649 153831 143083 107006 94173 132754 159893 127709 52031
18381 52031 44526 61527 117515 152648 164846 188834 174966 177585 198232 205294 198370 164714
18369 164714 149916 159109 191937 228763 235724 181307 153717 189368 145571 69521 77586 52730
18357 52730 14616 30149 69918 64083 56039 5464 8981 96102 121738 82168 115283 179971
18345 179971 167273 131619 133516 142849 153646 152803 154675 192855 204786 216966 217643 159327 127619
18332 127619 87307 83369 83189 105971 125618 161938 116566 76194 58291 35867 7612 -12968
18320 -12968 2599 2804 33664 31486 -1192 -18833 1483 68860 122562 162027 202673 184751
18308 184751 107736 39285 22947 16929 30099 13908 5475 47644 86802 114349 108405 48887
18296 48887 27659 27833 13617 60899 67428 94194 95980 123088 140018 123151 77931 51352
18284 51352 66638 104027 107706 62404 37106 11471 33734 49993 36190 42356 40364 60188
18272 60188 14947 6595 39547 19216 18752 475 -17336 -28296 -13181 -31590 -37874 10155
18260 10155 77021 68358 27539 37671 38489 18583 56151 67122 55471 19333 25791 22659 17770
18247 17770 6323 7921 51688 90704 89185 114544 106201 39733 -27453 9553 39552 56883
18235 56883 22538 33773 59810 103380 118947 73155 46870 42473 946 -3177 64457 36337
18223 36337 24165 -6925 -3863 35903 59837 46639 100289 128219 131568 176174 180330 112646
18211 112646 95461 113262 82915 53878 49508 121081 95850 33670 37676 63651 75705 87503
18199 87503 81507 119434 85248 60430 16624 5694 39463 50945 39156 59435 77322 72290
18187 72290 72972 32422 624 -24846 -8847 23723 55413 90160 65714 45516 53512 72253
18175 72253 129421 126435 85041 77227 110099 122384 104571 95835 130209 123982 112904 122723 118854
18162 118854 138410 129864 141551 154091 186600 214749 230070 244201 281568 251901 246274 254131
18150 254131 251177 250855 293780 318648 332972 340087 327618 366624 446075 487704 563642 573524
18138 573524 605074 743047 919906 1047507 1079775 1167988 1244624 1346944 1511774 1541146
18128 1541146 1566426 1607705 1676526 1776566 1880826 2008730 2218307 2585046 3018951 3622271
18118 3622271 4516973 5874606 7882369 10993788 15835456 23237576 34720580 49509410
18110 49509410 62145767 69469645 61702358 40930627 25439936 16605692 11610317 8624189
18102 8624189 6751627 5555146 4713651 4073514 3638263 3302558 2933154 2662978 2450375
18093 2450375 2270785 2142207 2042027 2016909 2044691 2040928 1982693 1936371 1910813 1869875 1768147
18082 1768147 1734522 1616366 1421913 1294885 1238621 1176545 1124926 1102610 1072920 1034383 977061
18071 977061 974813 1033310 988326 985103 1005911 963088 899009 892855 864031 865651 887737 813255
18059 813255 683937 569997 501749 503978 490961 453644 412151 346067 373308 413329 431422
18048 431422 403379 352627 302424 304913 317717 352517 328385 260713 246200 198206 218442 200098
18036 200098 172191 212401 186505 170131 221983 245038 272200 264917 238191 278530 272865 290935
18024 290935 346908 376516 423179 458449 414103 382851 409488 433376 422786 389807 363109
18013 363109 373430 319001 215804 191233 154548 122674 41373 36971 53433 42720 66825
18002 66825 68517 29985 44105 96977 77276 85294 135414 120087 86247 81558 46228 33671
17990 33671 52917 73437 67377 83675 74668 78273 98274 85298 90922 88985 121046 147956 126808
17977 126808 68463 23152 43770 15779 59174 70444 57111 62026 86773 63123 68790 79350
17965 79350 76443 70235 13887 -1390 51274 91273 72029 52500 22905 33181 109508 128432
17953 128432 127453 78850 64395 69270 40278 1754 9885 42365 45271 10985 27798 102930
17941 102930 122852 134353 132709 97986 77656 75803 70868 76683 115847 116971 97630 106173 115101
17928 115101 50247 41261 43420 84955 159409 166866 147977 125943 121945 147927 197183 233978
17916 233978 217668 148005 161245 160212 170952 183336 222598 229245 240242 234680 211060 154254
17904 154254 138858 119525 112759 63483 20028 30954 47165 47574 53343 47307 27319 -1070
17892 -1070 4503 14919 52535 95964 78978 68294 84609 79521 71765 29501 39457 78701 83404
17879 83404 134150 82026 63741 90529 94567 83975 131653 133259 148532 138990 148894 172155
17867 172155 156726 210442 252660 256995 273125 219019 171253 145940 170507 167438 183866 209911
17855 209911 223840 249728 339632 427924 460996 511270 538640 554388 565779 562147 561272 554591
17843 554591 541956 540786 511810 393594 352736 231602 170463 150025 120286 140326 141904
17832 141904 74353 28693 12325 22719 54220 80060 47230 21309 43203 91478 122717
17821 122717 98918 68214 95988 159488 200768 181931 105446 53890 64493 63448 63659 110532
17809 110532 167918 149631 211197 247973 210196 139094 99333 123271 107785 98356 196115 273040
17797 273040 289493 332913 373648 414705 457150 472957 465930 458310 469438 482521 398514 336118
17785 336118 353991 334060 282291 223773 159648 155736 163095 109174 53382 50136 36952 -3284
17773 -3284 -10919 3070 -35615 -59061 -44355 -29115 -21659 -13221 -28128 -53667 -40028 -18979
17761 -18979 3636 -14672 -6935 468 -23775 -38861 -45762 -20824 15244 48199 93360 94568
17749 94568 80054 39051 8232 34884 58774 84787 120808 167105 161562 135820 97643 43766
17737 43766 61441 81679 112131 135084 162813 140641 119930 129155 133218 143315 155824 185647
17725 185647 219259 221980 176696 155359 211951 201572 160614 139317 109995 69422 26778 21682
17713 21682 55076 75707 70247 81899 95377 181340 224717 237412 261420 239710 232506 279212
17701 279212 299420 304860 304757 310554 306483 296229 285358 279844 283424 287773 290027 310683 310104 293234
17687 293234 292030 297701 324513 371245 355545 349285 356892 396384 386041 433253 425275 416645 457274
17674 457274 510160 468097 437055 405907 376635 357978 355314 375556 393601 438101 482307 495874
17662 495874 493469 450135 438902 472129 501695 548645 591511 642266 683669 645190 611670 619088
17650 619088 651640 711980 746677 766472 803056 893807 925274 899162 863060 912860 930435
17639 930435 924622 946649 964085 995947 1100732 1216946 1350661 1403624 1494971 1544038 1651907
17628 1651907 1822589 1989758 2120535 2289900 2564167 2839699 3099771 3338724 3577033
17619 3577033 3908366 4252492 4623024 5042207 5571699 6340532 7403927 8853602 10887478
17610 10887478 13779479 17943710 23950935 32419620 44018100 58971645 76561862 94744964
17602 94744964 110839307 122420556 128192112 127922466 121903696 110305874 94020117 75457554
17594 75457554 57702009 43184736 32587255 25386132 20580555 17243817 14897099 13183221
17586 13183221 11826615 10775118 9978418 9383405 8871745 8465423 8157039 7905440 7718085
17577 7718085 7537946 7360588 7256600 7203170 7147834 7236935 7386160 7591004 7937491 8447230
17567 8447230 9134716 10189055 11788820 14071808 17348079 22136518 29107361 38817154
17559 38817154 51658888 67257972 84149904 99699277 111361101 117649251 118203225
17552 118203225 113416608 103827943 90109435 73730354 57163329 42887650 32121550
17545 32121550 24667974 19693850 16214174 13683699 11853207 10484740 9445019 8615503
17537 8615503 7980348 7457921 7034002 6605044 6153203 5701929 5285661 4881093 4462802
17528 4462802 4165387 3888411 3642809 3381832 3217799 3091597 2967916 2842284 2743945 2634803
17518 2634803 2534783 2470443 2412194 2282367 2164284 2106113 2042746 1976234 1884457 1807016 1736259
17507 1736259 1702180 1611786 1494213 1374564 1323176 1296073 1295769 1264975 1226447 1200800 1167521
17496 1167521 1104800 1050974 1004038 997523 1006771 1014129 1006533 992662 948422 903087 853301 844571
17484 844571 866556 862112 854512 787052 738662 715100 671012 692189 727365 727456 703829 738870
17472 738870 717842 679608 692765 698477 692355 652846 583286 619619 677276 674908 645466 610099
17460 610099 556458 586154 572563 533076 514529 477790 428650 394095 382820 401138 399121 397571
17448 397571 394294 452084 562205 672688 775524 824725 873164 793022 692278 630486 589823
17437 589823 596576 579734 559132 584203 591343 604830 629506 613024 620764 663492 679535 679530 639283
17424 639283 593430 563234 612376 642661 616361 566019 515990 544385 541690 566912 570231 612563
17412 612563 633921 623772 638807 603703 559173 598679 629525 613162 638832 635130 593221 589151
17400 589151 620693 629694 657372 679842 690333 742601 763493 764849 774110 800660 820371 780273
17388 780273 739738 768527 797488 844153 882800 904055 922773 938404 994184 1048302 1068508
17377 1068508 1075836 1110687 1137602 1193362 1238052 1316279 1428240 1527242 1584519 1672997 1744470
17366 1744470 1815343 1955391 2120296 2271727 2457684 2707020 3012609 3241788 3532824 3821021
17356 3821021 4176172 4646834 5118363 5640702 6449779 7530259 8913987 10844998 13562501
17347 13562501 17296462 22257086 28581234 36187248 45008587 54948626 65628477 76308900
17339 76308900 85809156 93417058 99030143 102514803 102836443 99325046 92839542 84872471
17331 84872471 75892440 65759788 55155819 45332547 36946061 29868477 24039846 19493465
17323 19493465 16152538 13767230 12024166 10738110 9809175 9079879 8409760 7847085 7444757
17314 7444757 7123907 6806975 6570257 6332532 6112845 5943882 5822853 5775069 5792734 5788027
17304 5788027 5747716 5760991 5855869 6082376 6350550 6701043 7163892 7774547 8616805 9831197
17294 9831197 11568645 13944551 17206691 21676302 27383248 34337375 42404389 51445183
17286 51445183 61162371 70926953 79735452 86709478 91744624 94858062 95261298 92013178
17278 92013178 85946909 78506064 70215618 60871027 51055359 41892600 34120973 27638503
17270 27638503 22200904 17890809 14717136 12421458 10720643 9478625 8573972 7826769
17262 7826769 7210314 6649620 6209078 5818416 5424914 5087099 4782415 4495556 4138755
17253 4138755 3851906 3579938 3350618 3159051 2995059 2808828 2647607 2502127 2367279
17244 2367279 2236738 2165970 2101841 2036328 1977176 1915766 1864147 1802315 1751668 1743265 1704655
17233 1704655 1624428 1542157 1462562 1388886 1308685 1270059 1305898 1298627 1279908 1212371 1191558
17222 1191558 1155195 1118021 1126159 1112888 1112262 1113683 1092840 1021815 916781 887646 869373 855100
17210 855100 835002 840997 775854 733450 734368 764841 731406 715717 673530 586853 563588 563755
17198 563755 565526 584047 621741 613237 540466 496251 484700 501857 514329 477197 420646 387310
17186 387310 375631 396950 428912 433507 408098 467978 475622 481648 542600 536735 476337 472350
17174 472350 438260 433970 449607 433195 453141 437892 434568 434256 447666 439835 390844 352058
17162 352058 324758 323818 342047 346463 366677 339637 319477 341534 329576 286557 282365 275847
17150 275847 277103 313338 348841 338798 288044 241283 244222 259053 297358 277121 263459 278645
17138 278645 260326 235679 195713 142635 114760 128947 179864 202499 168544 149914 129994
17127 129994 187933 207481 173035 183267 205041 231994 224913 202286 191686 203732 232200 274066
17115 274066 267498 239822 241775 242018 203309 176510 173210 195720 206806 238282 215284 141681
17103 141681 135494 146639 122676 102471 106299 125164 90529 64774 114186 186329 163546 146122
17091 146122 127948 128123 186694 195520 199813 220547 179794 158392 181528 196819 188157 162128
17079 162128 143689 137416 140233 189756 187632 228319 246365 271629 322398 367587 424457 523664
17067 523664 603533 662839 662883 721712 774705 774389 742239 710458 636509 541357 476428 440555
17055 440555 351991 217289 159782 111957 121918 132102 166195 154134 139925 118673 139480
17044 139480 151608 147656 158509 217245 225906 181188 145234 136349 80999 78109 99820 111525
17032 111525 95158 80350 68583 66841 61573 42260 77129 134663 134608 165606 238790 316880
17020 316880 406119 531571 615878 604457 614944 628625 595201 555839 489979 364154 260844
17009 260844 216370 193484 193922 129530 89955 61663 104689 88457 87053 84684 60003 87978
16997 87978 100921 125959 98699 91883 73996 30965 94901 105062 89240 76572 74892 105418
16985 105418 92544 44680 53150 86021 22216 -27201 -18259 -34878 -18489 -27173 -34681 -29715
16973 -29715 -59492 -76743 -47228 -29072 -11034 -15809 -52627 -51560 -33562 16639 689 -32136
16961 -32136 -26269 -29286 5658 48927 52172 42230 10060 2729 26451 65671 53173 46216 26945
16948 26945 42812 26066 36232 46707 76773 121274 123185 49068 18989 11085 -1678 2161
16936 2161 -14829 -4837 28856 5759 19630 40009 -1637 1790 35803 52753 6626 -39387
16924 -39387 -74667 -75228 -87649 -83911 -27475 -47027 -56908 -13226 27265 -1031 -11828 -15520 16394
16911 16394 27230 -29426 5165 24589 35593 23736 42321 43208 25776 17710 18914 -15123
16899 -15123 -55510 10674 36873 35715 87605 64841 55009 5054 -44112 -113234 -142003 -119645
16887 -119645 -99574 -22774 30155 20537 38665 49949 38641 30136 24731 -21922 -45000 -78583
16875 -78583 -41943 12441 74348 105375 57971 80568 53678 61334 63761 18522 46404 48366
16863 48366 49279 26688 64239 55663 29075 28455 34649 33255 11060 24028 55053 72502 47065
16850 47065 39218 45454 24384 -4390 473 14119 6863 55251 83110 68216 2474 -20667
16838 -20667 -49948 -24337 20630 77062 87567 122443 149815 141248 154799 197621 245404 275478
16826 275478 330592 402836 391972 384469 395600 423430 467461 485304 472780 405871 350500 312133
16814 312133 274256 228134 191848 172808 133528 106369 82255 31037 16828 50016 41379 24550
16802 24550 35596 38330 7811 -48630 -38424 48604 70764 42687 54026 95409 116248 74824
16790 74824 78827 128502 136561 161019 198814 205704 185276 165460 170927 213462 183023 143384
16778 143384 91832 124116 148734 190190 187255 216844 291764 332930 360522 380296 410516 450775
16766 450775 488527 509406 475879 441970 396977 345312 357718 348273 293506 221898 168816 159401
16754 159401 191689 196186 166261 129202 105510 111214 105654 91125 53404 52958 54111 41843 -9590
16741 -9590 5422 6784 25416 -14313 -50418 -81072 -50052 2150 5160 -3649 8625 28574
16729 28574 35810 9482 3649 65445 79278 44821 66892 66939 127152 128332 98315 31177 4817
16716 4817 -33306 -14443 -4696 -4618 1801 -9809 -16185 -15964 -57577 -49877 13351 22461 13418 50685
16702 50685 42137 43177 5614 26213 63455 59526 39147 -17553 -28151 8779 12677 14365 52079
16689 52079 53700 23385 37273 72953 88838 33117 28095 35864 61595 56827 22814 46676
16677 46676 36617 2494 -22231 -39542 -32334 -9277 -32055 -47577 10295 9307 14973 66747
16665 66747 99769 117897 118102 112798 111938 106340 91267 55710 24461 -10020 -461 314 4170 32634
16651 32634 40742 35472 39531 -2120 -33920 -70176 -22210 -30840 -42140 -30607 -18261 33782
16639 33782 56749 92210 53405 33425 45237 31939 17707 15649 -15373 -17307 -37805 -1818
16627 -1818 32608 37503 45943 51589 60080 78337 58239 76824 106141 61993 30488 44994 38777
16614 38777 37188 53727 -15089 -8636 -15327 17554 1987 -39667 -54673 -40048 -22084 -30367
16602 -30367 -30539 13976 27051 -22983 -43976 -21417 -4159 -41137 -34562 38314 6876 -34134
16590 -34134 -7603 -15185 -19196 -16940 605 31161 52937 32551 70878 90124 70940 27491
16578 27491 29272 -6986 -72008 -26599 23458 19944 -12581 -3158 12127 -28825 -66825 -47829
16566 -47829 -22832 -1517 13075 15677 31237 41574 59380 67535 10216 -28636 -22822 -10426
16554 -10426 -6027 4367 23253 67047 50947 44207 5607 -24617 -35127 -50626 -13342 -12694
16542 -12694 21472 32398 7180 7701 49926 60690 58767 57767 78652 120031 97338 64225
16530 64225 25056 18218 66712 21615 -34158 4866 36812 19170 -12754 -9921 27014 4702
16518 4702 1105 24680 43776 66136 75246 80584 97686 67322 28406 27975 39929 66472 19544
16505 19544 18950 40154 -3997 -48305 -25043 -4125 25799 13194 39363 36537 -17984 7963
16493 7963 51761 19622 -31098 -33115 -21055 21583 39796 36880 53924 64417 7028 -30791
16481 -30791 -39812 -59651 -76292 -41996 -28991 -38824 -50079 -12736 39810 11299 38609 63433
16469 63433 53387 42463 40624 25257 67732 92433 36120 15922 -18357 4086 22683 19641
16457 19641 98528 61282 -23742 -44305 -36037 3306 57868 62266 21723 12185 -116 10298
16445 10298 37175 70574 93114 71086 50910 20633 64437 66550 40992 38879 57043 75853
16433 75853 40738 14140 59961 79304 80061 57258 39140 19887 1555 -17392 4780 10730
16421 10730 22103 41870 33424 -1830 -29410 -17091 976 9282 -26918 3112 12083 39
16409 39 -19088 -49018 -57743 -72454 -88381 -90233 -51889 -57229 -22254 19590 66259 69001 18368
16396 18368 -21167 -4390 12756 48292 40500 -22502 -32733 -30702 -33339 -6035 27012 17834
16384 17834 -18594 -56749 -64502 -54926 -55826 -33339 -12077 10276 -5969 12928 23950 -32926
16372 -32926 -66187 -82055 -42062 -44249 -35978 21272 8849 -10931 -75574 -85862 -17721 8574
16360 8574 20076 5050 15554 44275 5862 43758 75046 84224 58782 25728 15925 20178
16348 20178 53912 73138 76668 66754 35469 2423 -16964 -59757 -112152 -62813 -72411 -77502
16336 -77502 -73857 -40163 -7453 -16841 13926 -4904 -37091 -59082 -63475 -55076 -28220 -18616 -27066
16323 -27066 -11220 -12955 -19759 -24640 -10104 -17603 -37968 -38451 1720 -9143 -40996 -58938 -68365
16310 -68365 -80596 -63446 -54565 -33571 46808 79476 79854 112381 88168 47235 8038 -26554
16298 -26554 -32455 32086 91714 89217 68549 35554 26988 15610 57712 80724 105285 48346
16286 48346 -8811 -17946 -21026 -60284 -95562 -97860 -90787 -76983 -35958 -33121 -49697 -63674 -29505
16273 -29505 -16004 -27422 -10454 -35644 -23742 12513 10565 -19932 -28736 -5012 20275 74535
16261 74535 104277 110240 141048 171671 173700 164312 111096 64776 8469 -12583 30069 65191
16249 65191 74585 56335 47712 45148 -3910 8005 32169 12160 -5379 -16053 -50146 -46740
16237 -46740 -20350 35288 56359 24849 -10400 -11745 13623 -15735 -76833 -117975 -123962 -79223
16225 -79223 -54727 -34124 -41533 -49301 -48811 -18168 6539 -13449 -38342 -48173 -48052 -15050 3432
16212 3432 -28151 -42043 1141 2256 -34830 -59250 -41111 -53525 -25557 3089 -1783 -21153
16200 -21153 4553 -12681 -15901 45530 55231 17449 -3868 5367 -12089 -1449 40816 25996
16188 25996 -47018 -32301 -55902 -66907 -44806 -47406 -37143 -21010 -6632 -22919 -42965 -44299
16176 -44299 -76833 -51984 -41850 -53410 -55143 -94337 -82548 -26226 -5696 19717 11504 1644
16164 1644 9315 -4862 30890 14498 24040 42031 54965 12753 2090 -9849 -42147 -48730
16152 -48730 -59639 -78241 -53953 -81369 -100383 -63921 -18984 32665 29916 20776 38812 80017
16140 80017 125046 102951 77741 30148 -1643 -7283 15276 27038 -7544 -34328 -23472 -11933
16128 -11933 -10471 -14684 63491 131667 109572 77872 64207 87859 73305 122247 101118 21530
16116 21530 42419 58322 26164 -18821 -23677 -15154 10571 -6962 17153 19114 34353 49400
16104 49400 29383 -31159 -41408 -24186 17478 18507 26138 -20509 -68867 -64429 -91434 -49733
16092 -49733 -65424 -39366 -383 -29085 -67668 -22338 8056 4893 28880 -5199 -42955 -77263
16080 -77263 -110327 -125340 -112415 -86329 -42609 -15055 5176 -26737 -71564 -51778 496 1345
16068 1345 -10999 -5654 -40911 -64065 -42524 -91947 -110671 -42116 -29390 -75446 -77879 -28334
16056 -28334 6608 3462 -33244 -49519 -37496 16252 51811 45763 3282 -61100 -44120 10085
16044 10085 32765 29784 32713 -27052 -63100 -76477 -55238 -42454 -25386 -30112 -28139 48409
16032 48409 110187 123297 71932 45268 1654 -33949 -2924 31323 49590 16519 -18051 29207
16020 29207 57293 89605 110736 89089 38222 12339 2205 -4396 -18793 -17877 -60191 -93493
16008 -93493 -80169 -41906 -34025 -26542 -17715 2566 -3983 -15148 -74180 -71344 -37809 -23722 48308
15995 48308 77542 64215 4468 -20080 -44998 -34572 -35269 -68022 -32145 7960 -12291 -39271
15983 -39271 -5188 -13459 -74297 -74659 -46884 13729 22880 4736 20845 12541 17009 444 -12694
15970 -12694 35293 -19015 -43327 6208 8310 -4863 -36055 -82445 -69242 -21092 37302 47972
15958 47972 -35050 -46512 -23699 -66074 -65223 -108721 -118457 -37570 -40050 -72137 -53371 -94687
15946 -94687 -107211 -45886 -49868 -70923 -89232 -51852 -28907 -48925 -43316 -33873 -28300 -28766 -39599
15933 -39599 -26687 -15718 -367 -12816 -30039 -20261 -35402 -50719 -55551 -34167 24892 37598
15921 37598 19521 -6323 1023 -33022 -82654 -79796 -50432 -40731 -4314 -39031 -46966 -42056 -22144
15908 -22144 -19921 -1175 8034 31913 29714 39331 46419 52888 61816 57073 26044 14770 16488
15895 16488 15659 11428 -11805 -3685 20400 44645 -8770 -34546 -27881 -46579 -42618 -23296 8762
15882 8762 35969 1173 -39067 -37279 -31033 -44053 -10202 6296 -23459 -36986 12199 17137
15870 17137 5201 7320 6610 -19672 -68305 -89494 -36784 7013 -16480 -31716 -98010 -138302
15858 -138302 -135609 -94735 -40136 -35186 14203 23344 45223 73845 40606 4970 -20960 5767
15846 5767 36282 5840 -1848 7517 -28041 -21118 -2109 43478 82527 79046 41521 15757 15088
15833 15088 39958 61186 44890 69148 27090 -34124 -31157 37255 39119 20439 16963 58181
15821 58181 54597 25042 16369 -35990 -41088 -44997 -59192 -44558 -102668 -108559 -121729 -136072 -124599
15808 -124599 -79703 -10736 31679 43897 52400 35663 -8269 -25432 -45456 -24069 -27666 -43703
15796 -43703 -53179 -48830 -34641 -36310 -78641 -97430 -110457 -85077 -37842 -14779 -17707 18930
15784 18930 8849 12928 -30074 -29313 -39886 -59871 -62851 -49807 -61314 -78132 -32905 9252
15772 9252 35189 -9035 -3938 -3378 -23989 -3772 2134 -31991 -7091 -35146 -42583 -28800 -38618
15759 -38618 -9365 41907 51167 53300 36606 -28278 -63745 -89218 -43554 2030 19516 2446
15747 2446 -18020 -5085 11638 23672 -20713 -63215 -46394 -40036 -24133 44818 34081 21479
15735 21479 54468 75418 88266 75780 39068 49732 99880 57446 18603 1920 -54119 -60385
15723 -60385 -20532 45692 40913 18967 -5311 -31257 -21418 -2990 -32965 -8721 11335 34667
15711 34667 18661 -11036 15556 41135 12128 -17231 -82927 -71300 -55519 -64453 -53649 -36810
15699 -36810 6878 27867 26272 20560 15558 6522 25157 21850 -33577 -63223 -30610 -19670 -48182
15686 -48182 -32830 -43539 -53026 -51242 -30616 -57393 -22954 13051 5032 15006 31924 60532
15674 60532 -898 -52217 -42402 15039 47623 39974 2762 1947 -24170 -74992 -89618 -120989
15662 -120989 -80374 -51099 -74522 -107191 -75072 -73767 -74175 -54613 -89521 -74889 -70758 -118415
15650 -118415 -117798 -59407 -67700 -49548 12328 5310 -28921 -26638 -2951 16403 4991 -11598
15638 -11598 -13177 -46304 -71169 -44094 -27254 -16122 -9396 -28595 -57603 -47253 -1433 31810
15626 31810 24575 -18184 -53266 -38654 21290 9561 -34638 -40208 -45019 -67811 -34477 -27998
15614 -27998 -30294 -51847 -32945 21847 -770 -42302 -46060 -20263 -7932 -16376 -70544 -80371
15602 -80371 -73888 -14274 17555 6436 29445 27874 3442 136 -38094 -40188 -38889 -61097 -89262
15589 -89262 -81672 -73766 -67903 -59942 -104502 -167418 -191136 -149363 -100066 -77381 -72939 -67233 -52158
15576 -52158 -9483 -1276 -11072 -15028 8786 17498 23310 -39732 -86452 -64293 -66965 -32254 -82544
15563 -82544 -105633 -88283 -52110 -17974 -28845 -79910 -47552 -1527 29597 17903 10103 12763
15551 12763 26876 -35777 -63221 -123897 -105189 -32233 23524 -10918 -60196 -61449 -1204 72839
15539 72839 65751 15402 -52579 -54807 -47878 -14641 -15475 -57806 -88839 -63160 -28003 14758 32021
15526 32021 19345 -3458 -6955 -7538 -12076 -30591 -49125 -46665 -32403 -8968 -2836 -7679 -83292
15513 -83292 -124953 -81916 -60822 -20421 -10486 -52614 -77734 -39199 -24757 13793 36238 29168
15501 29168 31126 63611 15919 -13019 -48775 -76044 -15574 36166 -13307 -39743 -55253 -72674
15489 -72674 -73882 -36009 -46186 -71624 -29979 23908 -5255 -29080 -55386 -19343 20447 7899
15477 7899 -39605 -80981 7573 -14243 -16646 -16996 -28705 -36903 -15394 14932 1576 -47118 -100946
15464 -100946 -91219 -79434 -22825 -40463 -25875 -26704 -67872 -65983 -50911 -24123 -11094 13032
15452 13032 37161 42360 55162 24366 7637 -9746 -39893 -57031 -47500 -41330 -49991 -32568
15440 -32568 -13253 -9036 -11777 -18917 -54158 -87458 -61492 -5051 -21735 -41284 -46779 -19793
15428 -19793 -16502 9252 -8080 -9487 3298 33098 16641 -2224 -18363 -57255 -108746 -106809
15416 -106809 -47564 -62341 -37410 -32563 -54386 -35043 -36758 -59942 -98405 -121124 -165158 -123874
15404 -123874 -99789 -22482 -13056 -33546 -17987 -6403 -42869 -51063 -32510 -36766 -52626 -34214
15392 -34214 -26882 -51362 -54254 -69629 -32766 -22713 -11249 -1975 -15222 -10085 33731 -9806
15380 -9806 -14226 27855 49898 38021 8652 -26314 -33293 10661 45758 44990 47054 35799 -25413
15367 -25413 -28582 -52301 -40640 18840 33022 7506 -36425 -46827 20358 40740 16272 -667
15355 -667 34078 16091 28563 54342 5714 -24059 -43203 -72948 -22895 -27744 -24911 -10973
15343 -10973 11739 -15307 -15619 -55366 -61631 -35529 1728 33783 14346 16167 27304 12560
15331 12560 -27823 33169 73159 32088 3667 -11358 -3705 -37741 7451 7612 -20056 1012
15319 1012 -32458 -58617 -75173 -79309 -64307 -10859 10644 20536 8628 -88487 -107471 -85501
15307 -85501 -71156 -60266 -72809 -59843 -39108 -36778 -2142 21693 3707 -34958 -29452 -18714
15295 -18714 -22917 -8055 13813 17000 -32613 -89973 -109805 -63913 -18231 35394 12339 18860
15283 18860 46734 10628 -8636 -44282 -91254 -36667 2381 29454 19510 -8723 12809 -18932
15271 -18932 -53083 -52836 -66568 -64618 -69108 -29631 -57808 -84958 -94409 -99902 -99375 -33825 2200
15258 2200 -28342 -31539 -15476 -11416 -12154 -1087 50160 14171 -30059 -56534 -61504 -42626 -32781
15245 -32781 -29659 -415 -18997 -45886 -36913 -78376 -52586 -35953 -19729 -19790 15693 -54063 -105544
15232 -105544 -69581 -76670 -95986 -111208 -119062 -134949 -95033 -42438 10826 3978 507 18231
15220 18231 64537 38788 34564 55816 53765 87334 34725 -634 -31199 -24919 -33389 -78661
15208 -78661 -18630 -8440 -59790 -46551 -14220 2638 21790 2343 -25440 -57601 -68703 -37680
15196 -37680 -23878 -31100 -28220 -18794 23506 26161 -12248 -4731 7781 -7991 -73308 -87419 -48641
15183 -48641 -43084 -31766 -59303 -63292 -56201 -90873 -144036 -149611 -164497 -100836 -66573 -80941
15171 -80941 -72957 -56007 -107893 -122959 -115159 -48914 -38606 -52444 -53786 -87185 -83155 -49557
15159 -49557 -13030 -19916 -52821 -65940 -39861 -47118 -118575 -96433 -55088 -56623 -51766 -58760 -23867
15146 -23867 -26506 -23729 -48373 -77703 -45166 -51321 -7781 32283 -7861 -21866 -23193 -17705 -21970
15133 -21970 -65545 -46498 12673 44030 54295 3326 -41259 -68248 -80635 -100915 -62731 7125
15121 7125 9434 -33896 -40228 -12868 -11042 38533 37362 12124 -82862 -124199 -67413 -21497 -11689
15108 -11689 27939 71396 74886 65518 41163 7988 11217 27591 -13412 -48712 -23846 -22618
15096 -22618 30644 4873 28985 67730 33443 -41016 -72399 -66326 -9783 -22012 -19035 -37983
15084 -37983 -8639 34309 65700 50156 21201 20301 -33890 -58538 -17153 -11628 -37354 13127
15072 13127 -6146 -33884 15742 19453 29791 9121 -38955 -30833 -23022 -27674 -16761 -29811
15060 -29811 -38706 -53396 -85766 -80113 -54887 -33407 -33586 -50909 -26548 -33846 -57556 -45606 -57296
15047 -57296 -84073 -112312 -113883 -34626 19894 -21474 -53535 -946 -27371 -78475 -43734 -3092
15035 -3092 -12030 -29278 -80784 -109613 -117556 -113307 -77266 -16329 -39644 -33565 -583 -42719 -41418
15022 -41418 -57177 -42511 -18989 3190 42467 46783 34152 7825 5311 -25627 2138 16363
15010 16363 12573 24267 -9320 7076 46074 5041 -13813 -42122 -47709 -56603 -47109 -42027 -60258
14997 -60258 -86527 -77724 -64003 -49708 -47947 -20548 7803 37481 42984 1764 -4207 9770
14985 9770 -23178 -53812 -55252 -15873 -1671 8955 18563 34075 32468 26193 -3043 -22495 -12052
14972 -12052 32862 32295 10453 65027 94301 46613 -50587 -120338 -117398 -62403 -37994 -55994
14960 -55994 -68623 -83100 -107167 -45518 -46563 -85275 -39877 -71131 -47336 20838 55992 25967
14948 25967 843 -11290 48181 28330 -11568 -41933 -49625 -26960 -15829 15183 34508 -13661
14936 -13661 -11612 -16992 -29592 -50672 -37562 -27756 3197 42837 22141 -35609 -23288 -51333
14924 -51333 -8359 10521 3157 -3126 32839 65298 54819 17879 3026 14553 -15605 -72838
14912 -72838 -93369 -88973 -34784 -7855 -41870 -75655 -92003 -95731 -92146 -47975 -47428 -57332 -31720
14899 -31720 23234 41212 47231 10149 -3399 2461 12110 8408 20014 22269 -32723 -8670 65157
14886 65157 67845 97883 98828 105883 74632 35900 -6010 9367 82038 104032 89672 79590
14874 79590 49003 53337 54411 -11122 -33955 -45277 -37291 -50640 -86568 -132692 -119132 -69568
14862 -69568 -26796 -25767 -19085 -43933 -23125 -35540 -37014 -7194 -9413 -53058 -49742 -28384 -32345
14849 -32345 -4954 1350 19363 55229 43947 29697 -8979 -46086 -73854 -103599 -62042 -18737
14837 -18737 28996 63950 26375 -2455 -23959 -62804 -68462 -60974 -55464 -63893 -101319 -114813
14825 -114813 -63365 -14025 -42562 -77647 -68961 -97961 -135798 -99536 -79263 -30528 -13589 -14943
14813 -14943 -33656 -16699 -18834 -42272 -34709 5987 -3097 -5966 -38747 -39111 -54907 -35946 -74209
14800 -74209 -88461 -72420 -65393 -55480 -34597 11454 17964 37720 30827 -31190 -50349 -28422
14788 -28422 -15307 -52046 -79786 -119405 -69770 -21064 -29190 -45958 -42595 -45865 -29344 -49497
14776 -49497 -74302 -36915 -4852 -18213 -20259 23590 15880 -12762 -31370 -36938 -70647 -66826
14764 -66826 -26131 -47334 -64730 -51224 -34350 -35977 -30625 -3633 66302 78627 91446 70864
14752 70864 41269 19293 27102 31650 38986 17445 17634 14722 21941 21415 8843 -64168 -92742
14739 -92742 -50993 -2925 -13869 -8761 8871 -18896 -49625 -25927 -9976 -10592 -14771 -31301
14727 -31301 -39766 -40080 -12836 -23735 -4079 23659 43245 62432 56429 13176 -25756 -41049
14715 -41049 -83149 -105999 -102802 -45551 -22383 -66346 -50952 -18767 18055 17157 -26926 5329
14703 5329 -6410 -22544 -13690 -17253 -29365 12750 107178 74413 20168 -25274 -17692 -65141
14691 -65141 -28474 32911 13988 -25159 -25902 -10957 36441 47228 24602 -4233 -16236 -4279
14679 -4279 -29656 -46492 -19785 -14361 -23563 -15032 -11833 -25407 -40082 -10717 -28228 -44187 -32263
14666 -32263 29033 23473 -29296 -41900 -36425 -30385 5539 -13056 -38894 6546 35713 37839
14654 37839 4689 16834 -4377 -13391 22388 50749 47174 44595 16870 -35642 -14380 -765
14642 -765 -53848 -32753 -45897 -18988 -14276 -18132 -36995 -21645 32421 9846 21683 7247
14630 7247 -27862 -28775 -27393 -65810 -53014 -12550 16612 -2201 -41514 -18114 -2944 12560
14618 12560 3948 27778 41091 3178 -36687 7792 30795 20750 -173 -17832 -8222 -1082
14606 -1082 -31825 -35333 -75553 -88800 -63085 -51634 -14401 19177 28740 12580 11777 32005 -9044
14593 -9044 -54645 -53309 -51630 -24167 -41486 -36866 -31327 -6664 17865 -7772 -757 4957 -8843
14580 -8843 -28359 -23574 -31217 -17147 8233 -4073 -18657 -35045 10527 40169 21289 1651
14568 1651 12818 21037 -18349 -41035 2687 8358 4957 32757 25073 20517 12360 52215 66005
14555 66005 63349 61132 -9230 -35978 -21524 -50754 -81530 -77013 -85215 -102382 -74585 -38443
14543 -38443 -9469 -20413 14580 16222 -31205 -15800 17404 6955 18813 -25587 -314 47164
14531 47164 35989 52942 43208 26049 10915 8752 -18627 -30183 -17619 -1336 5753 -22263
14519 -22263 -37915 -32934 -67280 -83254 -61629 -59529 -58563 -54081 -24672 24967 27195 -24531 -47291
14506 -47291 -36366 -9351 24093 74274 60930 -13233 -24142 29092 7790 -13914 -8322 40303
14494 40303 -39516 -56562 -51056 -38501 887 -8591 -68491 -94925 -82337 -44128 -48480 -28095
14482 -28095 3457 -8548 -29966 -20553 1093 -50362 -44998 -22562 -57968 -63368 -72331 -65538 -71917
14469 -71917 -20831 13288 -18753 -22260 -43012 -21023 -13175 -31079 -27187 686 9779 1947 -1347
14456 -1347 -13739 -119552 -175102 -95055 -50765 -58891 -94653 -60223 -30778 -12718 -7134 -24968
14444 -24968 -13028 28141 36447 -3423 -14682 -31082 -17482 -24869 -35899 -6757 13413 52213
14432 52213 14731 -4534 34488 32203 -31322 -67156 -23421 5722 -26372 -30085 -13875 -2189
14420 -2189 6435 -4575 -35672 -52531 -78061 -42150 -50797 -22728 -11092 6319 9816 -17336
14408 -17336 -59817 -33068 -4111 15066 46638 79606 39853 -27947 -47993 -18361 -35145 -64426
14396 -64426 -66528 -40301 -45307 -67168 -78363 -51143 15770 12524 32689 28507 10699 -13454
14384 -13454 -11116 -17566 -40176 -59148 -20053 4070 7576 -13061 -45501 -101751 -100416 -87682
14372 -87682 -53688 -30345 5286 21355 18149 41855 29827 14740 45348 78876 30616 6508
14360 6508 34869 31625 4601 -18232 -2244 9546 16212 25948 28106 52500 44690 34560 -4205
14347 -4205 -15517 -13341 -14756 -50254 -63382 -38950 9203 -10355 -42822 -102676 -112218 -85019
14335 -85019 -50576 -5039 -25770 -27498 9590 27690 -17167 -53575 23852 -22694 -102671 -103893
14323 -103893 -47069 6772 -5144 -43182 -62004 -79616 -60394 -63631 -43852 -5992 -21099 -36248
14311 -36248 -62737 -50264 -56537 -53087 -41294 -35313 10074 42627 34615 33964 10115 28135 11644
14298 11644 8597 -8184 -51892 -69092 -27062 -29262 -83747 -61613 -36102 -75193 -67602 -48816
14286 -48816 -76808 -46755 -49482 -43213 -26348 13828 34317 101541 75308 7100 -33062 -75287
14274 -75287 -44565 -27872 -36207 -21348 -32553 -50707 -90608 -87997 -78380 -83826 -64991 -21639
14262 -21639 -33749 5820 -12415 29768 61996 43691 32100 34460 -8344 2218 2339 18145
14250 18145 2244 -29034 -28534 -9838 15258 -10708 -68826 -48846 -52795 -44998 -62528 -71866 -53302
14237 -53302 -69005 -52005 -41870 -21117 17414 488 -34134 -113837 -153105 -130216 -103245 -64349
14225 -64349 -52710 13997 29304 -15292 -73791 -49087 -71121 -129063 -119599 -90783 -92273 -96322
14213 -96322 -74872 -69096 -60186 -41452 -59266 -87183 -95167 -69876 -68931 -103610 -90143 -72845 -70737
14200 -70737 -26762 18501 46588 29313 34391 -22744 -45120 -18464 35035 26916 36883 16722
14188 16722 -20098 -7294 -8946 -23591 -10809 36436 14899 -4716 -20508 -4560 29986 176
14176 176 -19958 -6759 -54891 -24168 4641 -19424 7081 -14367 -32028 -41076 -13927 -3399
14164 -3399 31619 63679 83072 11010 -37786 -83255 -78508 -35096 -43760 -79851 -64121 22205
14152 22205 97993 73642 -13654 -24075 31127 45920 9036 -9618 -53024 -73696 -112080 -24244
14140 -24244 -2456 -20145 11252 423 39950 49881 25998 23517 -22736 33395 59072 41382
14128 41382 -12709 -22395 -33192 -41167 -41139 -23965 -51998 -33725 -4185 -13887 -71528 -133966 -110635
14115 -110635 -55523 -32586 -102443 -142578 -125844 -88911 -65180 -73787 -62249 -19068 2714 -23278
14103 -23278 -47713 -58971 -65532 -102884 -73971 4988 6348 6467 -23997 -63049 -37107 8799
14091 8799 18153 -12650 -28082 -17066 -25969 -24353 -4134 10486 40793 70215 27447 38856
14079 38856 34850 33091 4228 -6749 23635 61386 78827 37436 -3031 -39481 -48966 -24419
14067 -24419 -11995 12791 43749 21491 51392 42504 58209 50777 -19598 -51617 -79377 -76681
14055 -76681 -88455 -130318 -80159 -35354 37623 54944 45006 74014 32550 -35758 -40710 7615
14043 7615 17699 -15275 -4221 44021 54187 18518 2504 -19124 -32147 -25285 -42998 -83508
14031 -83508 -73376 -69843 -54856 -32268 -74296 -52807 -24696 -1522 -8445 -58084 -51209 -61854
14019 -61854 -87629 -63095 -28850 5365 25819 39063 -670 -11263 -41518 -23669 4579 -6245
14007 -6245 44788 66240 37057 35701 26736 11693 -51948 -75887 -50136 -13495 11855 -13711
13995 -13711 -10546 -65049 -51444 -1566 4778 -22227 -30335 -12894 -14771 -45155 -28610 -16059
13983 -16059 -63995 -49682 -16069 -7822 -4098 -12521 6226 15293 2331 -41554 -78077 -69787 -55881
13970 -55881 -67033 -77155 -78657 -108374 -105222 -81025 -87801 -62466 -35094 -10719 3321 -1177
13958 -1177 21941 19263 25035 -37791 -28467 2726 25261 47897 57528 83810 62305 17970 -26086
13945 -26086 -30800 -29506 -45738 -37673 -8951 33736 4096 -12229 -26102 -15162 -19098 -21082 -19631
13932 -19631 -68481 -59931 -41013 -38563 -49544 -81432 -95305 -101950 -72343 -84440 -65611 -38801
13920 -38801 9051 -6765 -52238 -111831 -63337 -53460 -23524 -30281 -54495 -51932 -22150 25940
13908 25940 69096 48836 11582 2421 -16652 -77418 -113232 -168827 -152864 -90309 -48574 -53635
13896 -53635 -5344 17385 -18791 -12449 -21211 -48424 -59802 -76853 -19796 -22606 -28433 11512
13884 11512 -3572 21701 48252 -3009 -85648 -104446 -73921 -25570 21462 30973 -5579 -29498
13872 -29498 -36046 -23073 2527 12630 -6412 -1776 -11705 -6848 11060 146 -43455 -86847
13860 -86847 -76730 -36528 -37804 -32923 -11849 2078 -8991 -31738 -6266 -28328 31639 32328
13848 32328 31148 21678 22815 -13628 9901 20181 8032 -13042 -61498 -81347 -59080 -75816
13836 -75816 -59587 -55954 -67073 -29138 29678 -13519 -42850 -58478 -77511 -22482 -43945 -39673
13824 -39673 2152 50092 18548 26865 30714 22923 -19624 36531 43051 30601 21428 24423 51619
13811 51619 59940 59378 68128 45933 58671 41782 36074 48662 16360 -30195 -4500 58952 35735
13798 35735 27464 29848 44885 31853 4250 -32528 -74023 -53744 -25311 -43155 -8995 56523
13786 56523 72883 6015 -7147 -42104 -30425 -47438 -28355 -18995 -51110 -24001 426 3244
13774 3244 -22590 -30914 -67326 -37492 -43584 -8120 16548 5798 2461 47124 69715 73751 48878
13761 48878 6717 23472 8455 2985 -5785 -40529 -14754 -48713 -26206 -37694 -39854 -33119
13749 -33119 -12981 19464 17356 -2344 4976 6767 13303 -41149 -66164 -56575 -45672 -32090 -18182
13736 -18182 -41161 -66367 -61499 -53808 -1597 27278 56202 50016 -9771 -305 1467 1449 3591
13723 3591 29297 22990 13382 490 -1484 -10750 -37684 -10772 3470 -505 -15117 -55751 -56274
13710 -56274 -34646 -3005 -7958 28490 65993 50740 71765 58768 57990 19389 874 -20905
13698 -20905 -61201 -12496 22281 4823 -18548 10796 30488 11100 11418 33274 55193 31354
13686 31354 12080 -57826 -39044 -12698 13914 37257 36173 18714 24580 73853 88264 50404
13674 50404 19733 -760 -4291 23364 -3822 -21295 -26055 11938 34793 45619 -9605 -34315
13662 -34315 -24147 -15967 -53697 -65053 -44774 -43528 -61545 -75596 -79017 -17264 15067 -25268
13650 -25268 -1202 -10003 -55931 -63181 -89269 -87435 -73928 -28354 -30460 -22308 952 -14554 10100
13637 10100 -14596 -46786 -32764 -32476 -64405 -8774 32765 53559 56536 32423 17984 -13926
13625 -13926 585 3140 5054 38892 15391 -7329 -15704 -50499 -12705 21722 48571 43804
13613 43804 -37159 -43846 -10131 41331 72406 36303 -19563 -35378 1104 -2755 -43365 -20373
13601 -20373 12600 23060 -3076 8319 5988 -9933 36111 29039 8853 -50354 -49989 -8997
13589 -8997 -38247 -77666 -84682 -29529 -23558 -12826 21485 43817 67183 65391 11230 23046
13577 23046 -17777 -53744 -105117 -77787 -36708 -34421 -20913 -27328 -138 -395 23573 54507
13565 54507 74198 54857 31575 7879 -22898 -53127 -29263 23222 51274 42337 26965 -10955
13553 -10955 -2725 -17371 -59649 -59580 -41691 -37853 -50155 -65576 -54818 -40246 -30342 -19419 13802
13540 13802 -29940 -72813 -55584 -37096 20577 -3013 -7755 9794 -17465 -35497 40697 78957
13528 78957 58462 53299 57162 94329 69701 -46412 -74852 -81803 -76670 -62022 -35057 -31119
13516 -31119 -39657 -1185 6265 -22799 -45944 10386 73108 60517 61811 50420 93894 83710
13504 83710 25814 10287 -26359 -93905 -127747 -135721 -122775 -86679 -21066 30184 22399 -7680
13492 -7680 -17303 -7780 35789 76225 63591 -12909 -24622 -29154 -17048 -6536 27440 76463
13480 76463 9869 -5560 -513 -10950 -28588 9100 23093 41807 56936 54808 543 -26998
13468 -26998 45137 39402 49814 56002 20186 11889 -401 -56223 -69262 -44931 -22898 -23537 -34779
13455 -34779 15671 -5992 -54134 -39698 50213 75307 65255 70212 52695 72009 70925 15120
13443 15120 -31538 -40503 -22886 25532 47572 25310 146 -6565 31642 35461 24431 -3114
13431 -3114 -24773 -29579 -27544 -50346 -64111 -20545 -21597 -51780 -71918 -75781 -44829 -15937 19591
13418 19591 46329 58674 80629 109053 91168 124435 55522 -16586 -28706 -47567 -41085 -59804
13406 -59804 -72434 -46968 3400 43369 40907 22857 -883 13783 43290 -3847 -31817 -9022
13394 -9022 16714 15918 20151 -821 -18511 -69886 -42204 -16376 -35446 -36987 -34390 -33477 -64682
13381 -64682 -87950 -47741 -10227 -10972 24141 -11398 -66093 -69357 -19058 21348 4690 19394
13369 19394 48301 47334 39640 27656 42547 48285 84391 30791 34700 31322 51029 96319 108699
13356 108699 23636 -26452 -40309 -54112 -33539 11074 54432 62724 82820 50266 62164 55596
13344 55596 28434 26229 41637 49323 488 27289 79543 67901 22183 -10480 10893 13072
13332 13072 33800 51718 25306 9738 9957 57165 106812 139991 156389 125850 78574 88587
13320 88587 39091 81503 106749 94108 34385 -6020 4969 -11785 -594 -22296 -79538 -90362
13308 -90362 -64123 -33404 -36342 -24962 -25364 -44779 -64290 -11089 12905 40396 63190 78616
13296 78616 55187 9170 -3937 51710 114503 114125 108766 85258 78246 48238 45873 56111 52430
13283 52430 73148 100643 88948 71331 77927 16133 -50056 -57440 -12214 1629 27902 27971 40035
13270 40035 57646 40375 30209 66533 79893 98149 62907 -14813 -47408 -17410 -25930 -53156
13258 -53156 -51033 -68479 -63848 -16284 -19211 -22407 -54271 -62155 -43005 1458 41590 28473 -1640
13245 -1640 5478 -5530 -27671 3701 28828 40136 84132 82544 119515 95731 67726 50271
13233 50271 82730 50245 29436 46925 -904 21045 55534 67507 61596 60564 92874 111425
13221 111425 80622 98620 169455 164433 130714 136507 131218 102953 132166 94052 72741 95388
13209 95388 98517 78594 89511 64466 111010 87824 87253 63746 46725 13667 -27592 -59377
13197 -59377 -45758 -4047 48825 57950 53758 -3668 -8005 6305 40218 9194 -12982 -985
13185 -985 4488 37207 53308 3623 -11708 -26835 20709 42582 59224 67736 95480 104573 103447
13172 103447 64937 56574 31934 15461 4459 10076 19324 19336 73374 92122 75075 71928 56463
13159 56463 -5320 -55553 -54700 -30466 42619 58672 10026 2984 -12604 2502 -29397 11854
13147 11854 17390 28439 43922 57069 30873 -11496 -19012 5313 -1481 -17898 1878 -14678
13135 -14678 -32515 2902 31178 57211 79639 47487 41913 20294 17973 -9841 -14095 -20655
13123 -20655 -15865 -19027 29814 23254 18003 8117 7563 12405 -11948 -48670 -39131 -49316 -85007
13110 -85007 -49833 -28267 4762 32492 -989 -36519 -28911 17694 43690 32168 -13425 -6356
13098 -6356 -19610 -57160 -64132 -36791 24570 33556 19123 -7560 -45823 -16640 23001 66099
13086 66099 54150 31387 63273 45734 6482 32924 65759 26066 56736 45168 42413 51314
13074 51314 64183 61124 57943 91914 50280 6569 41956 63729 62775 39552 -3239 18948
13062 18948 61793 87036 105917 109709 61680 7757 23595 13884 -18722 -45193 -19965 23179
13050 23179 24296 2136 16606 32575 44901 17930 909 -13406 -23057 15833 60114 114414
13038 114414 73788 39467 31069 14362 16282 12929 7159 -3395 17184 25734 45756 40304 13383
13025 13383 -34897 -34377 6600 7684 46041 21192 24854 38164 58999 55269 75612 92971 49251
13012 49251 51378 29793 59614 54349 58804 52686 59568 34970 -21444 8991 43427 20873 -16042
12999 -16042 -14606 -21712 -20383 8615 29394 45465 6552 -4725 40748 91463 50823 9711
12987 9711 28873 13101 -41691 -31817 -2168 4228 4900 20223 57349 26601 62558 63931 37375
12974 37375 91366 69621 52869 84081 87047 53722 27197 -14578 -7099 -1858 31657 53528
12962 53528 70861 57748 34104 31834 93585 81475 55978 57250 49849 19845 33720 33429 15945
12949 15945 44271 48151 51676 17996 -19854 -35295 -25938 -30083 -70497 -12441 14496 43524
12937 43524 52653 113686 116179 90560 81484 119341 113587 86897 63866 57193 44501 37683 20790
12924 20790 31905 24093 28701 47589 57587 84142 61388 20111 26123 62976 77122 77945 73953
12911 73953 34594 11255 70689 75962 76757 41864 55073 69794 35577 60411 116522 110820
12899 110820 84053 50722 50083 75431 49444 34072 49352 48724 29005 34820 35464 36997 20585
12886 20585 27641 38415 52953 43855 39569 42168 53428 45929 48136 69725 22722 -4657 16728
12873 16728 83648 53290 86654 112229 105183 68787 47711 64110 73909 61248 62332 67850
12861 67850 67352 53570 40840 2731 18578 55067 134842 131691 93039 53470 41074 57559
12849 57559 84027 73904 56106 83544 76106 50964 66091 60557 97552 92136 105915 109641
12837 109641 129683 109844 117528 133627 107082 69697 84891 98872 131117 170442 136021 49438
12825 49438 52123 74125 77214 60073 38890 30722 17539 73947 104117 82148 40272 41132 61524
12812 61524 96803 63921 58619 110292 147572 140007 136786 133118 113190 61894 42793 48839 30318
12799 30318 36702 77913 74530 29459 30492 63942 80703 97094 85565 99981 121712 174437
12787 174437 167681 125694 120593 187563 145971 91769 112908 141669 139392 113491 93247 96665
12775 96665 156790 201352 181066 180610 186008 183701 171514 136462 177619 183014 175802 131220 133942
12762 133942 130000 96135 68981 88708 128362 170647 177181 162348 164315 229316 223531 150205
12750 150205 145173 152501 130098 155447 218633 240509 217875 195162 256887 237491 222567 217240
12738 217240 239451 211376 162646 156158 188442 214596 254500 277833 290711 307274 328881 346899
12726 346899 357656 381446 439408 527209 562301 583866 721428 854845 983797 1173328 1333262
12715 1333262 1420331 1436368 1367435 1216930 1054210 889525 761619 674731 610430 566577
12705 566577 537211 516516 521263 567657 605636 635600 638010 690352 790852 868530 903794 926755
12693 926755 998321 1055565 1007961 991994 1038751 1140091 1237926 1307413 1399540 1490861 1546856
12682 1546856 1514723 1446752 1350884 1247196 1128653 1053434 1008458 953468 899260 891051 913541
12671 913541 868894 799108 803572 823638 793573 725123 676014 645327 560541 582807 637004 634464
12659 634464 691507 724050 792579 872434 950674 1057236 1175099 1282402 1386049 1489738
12649 1489738 1512206 1429106 1196916 957757 844482 715035 525051 477124 456882 403115
12639 403115 412822 446633 410755 398462 364316 314877 294330 336020 322105 273953 241815 237437
12627 237437 276446 304354 308321 272736 252070 262487 304379 319272 322189 284481 216618 218683
12615 218683 209343 198377 188350 205719 234357 236967 205573 174483 174871 225883 292254 336072
12603 336072 300021 265751 316202 363495 359406 325803 385951 437416 449554 408941 362963 408864
12591 408864 350656 259650 281769 258600 222605 192355 148971 187224 237087 224234 203785
12580 203785 204787 211473 277786 285543 304832 311204 335245 370883 397622 396254 442224 502476
12568 502476 608364 669828 761800 892056 941808 940299 849623 721345 617946 540326 483128
12557 483128 439664 346654 262378 277103 276264 287184 294895 289519 270504 289504 340794 343837
12545 343837 335542 320185 342691 343155 379806 430005 491589 541070 535225 513547 517297 523338 510138
12532 510138 502709 495051 484341 444176 423601 463724 434123 369464 333002 303807 298748 279463
12520 279463 273033 245430 273867 281808 258339 225257 262195 270951 284355 323248 401246 431292
12508 431292 451567 461800 494571 484970 500580 469636 467154 452724 384772 359111 358637 290896
12496 290896 258093 337595 430527 437770 457351 463296 456946 442448 416548 372143 340563 339244
12484 339244 342457 334076 350103 324092 340269 349958 341493 311941 313366 317629 336646 351141 420304
12471 420304 481531 500077 438419 368338 355732 343989 278823 199202 127109 121864 100267 126072
12459 126072 116466 83743 83155 78443 64449 104464 125249 106349 118797 161990 121141 86125
12447 86125 118917 182336 186648 134311 109827 185067 168944 103722 134656 235917 333749 371997
12435 371997 398063 423218 453859 459828 463008 504283 539528 487710 419606 417766 423048 429828
12423 429828 444942 432036 424367 454507 495408 487823 543974 598003 632821 754060 875701
12412 875701 945103 962282 1019069 1096896 1108736 1072878 1051846 1053441 1027808 986392 964204 980359
12400 980359 998310 1026715 1034247 1030075 1034858 1083730 1094468 1139152 1193529 1225534 1222273 1170851
12388 1170851 1186751 1205872 1236819 1237323 1276058 1318653 1281763 1254410 1322592 1389486 1418987 1438126
12376 1438126 1426921 1464301 1515153 1587365 1563515 1585295 1627949 1656443 1684315 1721034 1723426
12365 1723426 1722642 1719075 1726119 1784835 1809976 1830268 1860944 1947298 1933955 1954713 1971858 2047820
12353 2047820 2079867 2072147 2098336 2159086 2195949 2272747 2317101 2355636 2434267 2487321 2467017
12342 2467017 2504693 2529285 2507235 2472977 2495807 2569858 2628697 2701094 2742429 2825072 2894402
12331 2894402 2986121 3115789 3248710 3376792 3543757 3670463 3744306 3875519 4089452 4262708
12321 4262708 4350665 4517508 4701063 4950854 5237084 5472878 5679097 5835897 6094075 6378082
12311 6378082 6724347 7090830 7514652 8058891 8630340 9210293 9884079 10726210 11755543
12302 11755543 12962229 14316170 15931759 17920570 20352571 23303713 27002044 31674904
12294 31674904 37617640 45224664 55122407 68151586 85285447 107316689 134489623
12287 134489623 165458185 196352176 220963330 232605683 227298701 206951177 178489768
12280 178489768 149235275 123766261 103681034 88924678 78670775 72141634 68456337
12273 68456337 67162914 68052144 71215708 76881534 85183597 95825628 108064653 120658892
12265 120658892 132397544 142516628 151026466 158192723 164065435 168877065 173716391 180551498
12257 180551498 191177331 206489052 225657192 245476338 261035829 267505409 262095973
12250 262095973 245872783 223297030 199756440 179565133 164985875 156607315 153773387
12243 153773387 154760363 157155233 158549483 157275593 152933592 146086303 137338097 127170239
12235 127170239 115902536 104411400 94095237 86221243 81418467 79767740 81112511
12228 81112511 85521617 93432490 105578193 122811368 145695893 173883725 205437233
12221 205437233 236075608 259567240 269332148 261321129 236415266 201040309 163712652
12214 163712652 130651617 104235294 84224811 69446267 58568728 50401483 44113215
12207 44113215 39106232 34940720 31371444 28298787 25681333 23457739 21558950 19945777
12199 19945777 18507673 17242601 16182114 15171655 14239683 13360172 12609886 11966671 11371259
12190 11371259 10797891 10245497 9730610 9243903 8859518 8512522 8165979 7861878 7543294
12181 7543294 7269050 7046254 6796535 6581308 6404837 6178738 5966101 5810182 5608576
12172 5608576 5359568 5161869 4916547 4700554 4522699 4382522 4216418 4058067 3935492
12163 3935492 3825298 3716503 3636028 3546781 3458895 3393601 3327177 3199939 3028437 2916292
12153 2916292 2807925 2677030 2561793 2447333 2349595 2249062 2195250 2170722 2132768 2111926
12143 2111926 2042503 1968214 1929128 1865916 1814463 1765951 1680469 1650951 1587744 1594003 1606394
12132 1606394 1628243 1643522 1634160 1631322 1648501 1623125 1598829 1595083 1547340 1521140 1435122 1385050
12120 1385050 1379910 1339467 1310094 1278182 1199371 1159124 1131148 1132157 1084324 1061904 1057669 1039112
12108 1039112 1043691 1058334 1064217 1114980 1158946 1186019 1167775 1186139 1313651 1413500 1489650
12097 1489650 1590070 1680899 1796990 1880683 1898273 1835142 1744696 1609457 1471391 1380429
12087 1380429 1251285 1147125 1072289 1072380 1050449 1000780 946741 894784 848534 787240 752438
12076 752438 699390 655240 655681 675336 713718 770213 758179 753462 748249 712113 753632 777122
12064 777122 772665 826300 851802 816857 806763 795599 784127 782553 773090 746631 762629 757910
12052 757910 758490 692817 636835 647119 633969 712427 678844 631054 641373 654237 634136 603437
12040 603437 612204 537134 514827 524612 562054 598313 581122 607459 645164 612365 603667 557702
12028 557702 515024 550711 576555 546941 536591 551332 559351 520201 486084 424782 428148 469655
12016 469655 431515 443530 500617 484278 423541 411794 416319 451624 472791 471840 452261 418189
12004 418189 397200 389543 391761 435189 481113 458611 399765 343867 328412 359042 342803 389808
11992 389808 408490 427664 409129 431450 445236 428994 411425 398484 353866 328876 271204
11981 271204 262799 263707 263107 228969 220650 206405 173389 170320 157500 154495 146082 134575 145175
11968 145175 164149 208408 240537 256119 225640 232612 254702 271250 232531 271686 263038 256504
11956 256504 257754 254760 218244 188910 177204 170766 99719 69190 72993 40346 18566 20528
11944 20528 -38737 -123159 -102285 -22461 5457 -9682 -19126 -21599 -14763 13337 20709 15232 25779
11931 25779 51814 55893 42742 22574 -19512 -11396 24378 20470 -8978 36724 52178 87945
11919 87945 88559 89742 70283 47846 61404 16854 -67875 -142347 -156800 -167009 -159077 -130094
11907 -130094 -114068 -92337 -93517 -107063 -64913 5988 12990 11223 41426 114543 142516 119155
11895 119155 67127 64951 40620 67219 99700 51275 43739 53816 33109 62432 82134 115190
11883 115190 104536 66838 53572 55579 60109 88408 94557 43044 49144 76952 103169 126249
11871 126249 143629 177859 173079 143277 156915 118419 135918 175072 159514 129573 140251 195504
11859 195504 290234 329419 318567 358622 412361 482534 545083 652457 834985 955455 1078007
11848 1078007 1163538 1196426 1141569 1019188 864292 731204 638411 601946 569205 520616 496894
11837 496894 483202 473512 462189 506007 558914 547928 532020 579063 683458 777761 886448
11826 886448 990548 1031525 1108524 1189724 1203132 1214648 1262205 1362421 1448444 1507740 1545632
11815 1545632 1539721 1468691 1392438 1308887 1226434 1122883 1066673 1043061 1053395 1048701 1065761
11804 1065761 1082820 1064628 1101518 1029136 958140 902353 836209 770198 734777 680995 632755
11793 632755 635004 660160 723167 800072 863773 940436 1131722 1315378 1425458 1552250 1628763
11782 1628763 1689229 1699896 1605099 1474193 1383691 1253595 1182456 1265850 1373631 1437904 1580024
11771 1580024 1776866 1854801 1845902 1749230 1590494 1368476 1187571 1026054 894412 802053
11761 802053 736483 716652 695981 676999 659021 664567 711082 817896 897419 973402 1046192
11750 1046192 1049700 1002497 997445 970108 945124 944632 952118 1000518 1041200 1127332 1197906 1290570
11738 1290570 1440284 1552686 1580135 1588814 1543959 1454187 1326671 1239382 1194267 1199353 1204364
11727 1204364 1160316 1134031 1081058 1024171 976531 894692 788209 716962 620871 608264 613512
11716 613512 581821 556635 531429 551915 633523 677427 746118 868057 1013574 1112925 1199036
11705 1199036 1251161 1233279 1192130 1089529 974458 816305 682183 583841 488991 480294 429342
11694 429342 324205 319834 322937 261327 222564 240558 270363 305957 347890 303326 285844 298822
11682 298822 271362 240188 240950 229333 218796 222497 274247 267550 299521 300620 277460 244591
11670 244591 204399 252799 284088 293811 295598 279604 342164 370924 349250 322485 365100 401563
11658 401563 444426 525276 520618 452700 465879 470071 435566 365032 275332 225203 174716 188841
11646 188841 191864 208414 264828 271656 270128 286786 218312 214669 201929 207918 216291 294165 348836
11633 348836 365995 364591 362488 314621 300665 327806 340947 293685 276475 343745 452298 462120
11621 462120 446272 430975 401731 374945 328189 286472 261154 260484 305358 335257 314813 333196
11609 333196 342086 286238 277341 322765 333661 314620 355449 409713 521391 572805 598802 588389
11597 588389 569186 507045 460517 454381 483923 480484 426282 397245 442808 450691 446230 420464
11585 420464 402310 323196 303086 280881 332280 338994 354923 361524 316762 306012 294699 274710
11573 274710 252479 305894 335223 301408 261206 310919 418920 507311 493702 459224 467922
11562 467922 466238 502564 511385 523598 529515 522201 469481 462782 453183 417581 404177 386730 380871
11549 380871 318658 322043 317561 276622 194144 171868 144234 158205 212560 282705 306773 323899
11537 323899 408946 467568 496622 464418 440582 465713 446782 411202 425307 420209 352197 286802
11525 286802 297671 331128 281674 251700 279879 251261 213554 179467 138192 169993 155145
11514 155145 101851 78608 77742 38791 13031 70953 105139 133509 120396 141600 121707 160360
11502 160360 196304 209538 258488 365266 451034 513039 484768 498057 568391 566204 524658
11491 524658 481772 497676 540261 545338 487824 453852 475478 490008 497472 539141 585096 661627
11479 661627 686529 759314 838403 905462 1004632 1182607 1392040 1532335 1680966 1722967 1709762
11468 1709762 1637142 1551573 1429069 1338072 1281266 1275537 1275030 1227630 1163367 1145814 1162217 1167684
11456 1167684 1178682 1206830 1180487 1193989 1249452 1227230 1246996 1297555 1292561 1266929 1244313
11445 1244313 1239412 1220762 1261013 1283076 1293658 1308936 1357690 1401561 1435389 1492893 1568492
11434 1568492 1645888 1748178 1719573 1716858 1752201 1792145 1785366 1794217 1845109 1889548 1905878 1881670
11422 1881670 1884185 1935016 1952216 1984706 2027078 2025544 2044481 2120566 2138623 2168288 2185472 2241368
11410 2241368 2282911 2285780 2345909 2380470 2433937 2521427 2579982 2607268 2653870 2736527 2798754
11399 2798754 2832119 2921467 3001242 3093189 3200131 3242106 3286840 3342082 3453030 3643464 3785122
11388 3785122 3914781 4023825 4150079 4316640 4459478 4613145 4794313 5015965 5236666
11379 5236666 5491074 5743067 5972966 6280790 6574439 6854731 7208881 7636764 8117104
11370 8117104 8677312 9334782 10143482 11028498 11990799 13134985 14464243 15851719 17405269
11361 17405269 19113581 21163515 23640054 26669525 30546158 35734277 42674961 51908357
11353 51908357 64285838 80861927 102794484 130894992 164999671 202851058 238961169
11346 238961169 265398567 274267911 261626350 232077260 195599111 160382250 130873344
11339 130873344 108596033 93090513 83054300 77158660 74470334 74636457 77371996 82703306
11331 82703306 90656727 101054462 113290450 126488597 139250260 149538476 155818484
11324 155818484 157602970 155549529 151719617 148761018 148864261 153575107 163850299 179832374
11316 179832374 201265798 226369261 251317795 270469066 277990518 270617506 250894359
11309 250894359 225940505 202716457 185093949 174272555 169201912 167582673 166622153
11302 166622153 163839913 157540007 147245385 134067769 119655306 105701289 93563918
11295 93563918 83765572 76480225 71632235 69077392 68809428 70888235 75587365 83426733
11287 83426733 95171720 111611137 133340061 160123728 190118952 218843670 239596483
11280 239596483 245296061 231856950 202166440 165921516 131953675 104125974 82869250
11273 82869250 67197066 55827743 47418350 41109815 36219068 32379592 29259955 26679896
11265 26679896 24465406 22591950 20880069 19375300 18040461 16775328 15641852 14567117
11257 14567117 13584780 12702934 11938125 11277882 10642551 10076410 9600023 9121945 8693899
11248 8693899 8317694 7981967 7645073 7336111 7018573 6720386 6457351 6187629 5935319
11239 5935319 5769961 5583116 5402950 5207224 5032766 4858723 4674024 4546813 4434928
11230 4434928 4245756 4041643 3895942 3806680 3718878 3608643 3448582 3326245 3217468 3182684
11220 3182684 3121835 3055420 2975344 2885302 2819887 2687273 2549997 2486723 2367086 2240137
11210 2240137 2160419 2116978 2052125 2012596 1978035 1900798 1830085 1788110 1746993 1663719 1598936
11199 1598936 1532921 1471397 1431249 1431220 1458492 1470380 1416564 1381259 1355506 1374093 1371201 1420429
11187 1420429 1462652 1403736 1359263 1325713 1289052 1203932 1134464 1108443 1051234 1045913 1069324
11176 1069324 1028055 1002935 1020004 1026805 980238 942571 900471 912090 934221 895269 890175 900048
11164 900048 892116 894495 909275 912994 959722 1036485 1125442 1192910 1297257 1386599 1389026 1356712
11152 1356712 1337379 1287843 1230110 1149215 1065939 980518 960567 917172 879611 835443 805079
11141 805079 773006 713274 674088 642342 628808 646587 630335 645672 604453 536181 488773
11130 488773 500094 537181 532501 563005 643430 689180 719063 699121 674365 713831 702406 740238
11118 740238 694056 636667 644785 625431 592166 578041 644479 675391 634375 580593 584387 612102
11106 612102 611710 586200 541351 547062 534207 501554 481555 489580 498638 456299 435826 463838
11094 463838 509629 504001 487122 507762 506129 477049 444860 426492 373260 390421 420845 425323
11082 425323 392325 345515 339651 345520 350644 288594 277985 314435 333800 301860 305582 313966
11070 313966 319246 301860 289507 304814 333616 312823 281351 263804 286065 289490 275799 263912
11058 263912 288791 339848 299863 215135 195589 170859 183404 201272 222191 238407 244144 222458
11046 222458 214005 211873 171218 172346 168030 144756 105728 43547 33919 -1859 -34361 -46782
11034 -46782 33267 31365 47261 73641 75220 58061 38724 49281 66400 99656 148763 145195
11022 145195 140808 134032 92634 86334 63885 21440 16235 11085 1205 22668 39057 37873 26333
11009 26333 28860 13997 -19077 -29943 -64254 -88477 -41107 -22793 -53413 -86411 -48401 -20181
10997 -20181 -38680 -55043 -74072 -52521 -119110 -130823 -117707 -107712 -106368 -147709 -121063 -85923
10985 -85923 -66416 -71161 -54896 -37372 -45877 -27813 25686 28176 -17613 -44539 -41508 -101913
10973 -101913 -130188 -185923 -244086 -263488 -258569 -193721 -143744 -133065 -145125 -118865 -82565 -102679
10961 -102679 -112195 -95938 -89038 -61264 -48787 -38731 -44946 -65599 -49657 -11438 37372 46588
10949 46588 8707 15650 36493 69445 65115 69456 96782 -17316 -51397 14674 8555 38081
10937 38081 26800 11153 34763 50646 50470 25739 36330 74319 105189 137643 179301 207339
10925 207339 173053 190804 284786 410973 486538 561970 686705 873890 1029491 1173173
10915 1173173 1244223 1305983 1247048 1138625 926198 769297 664799 551345 468991 387385
10905 387385 317601 290436 253960 305537 355500 392194 408223 477871 543217 603924 646804
10894 646804 732429 758558 777614 818963 815531 792416 842144 896107 937358 994985 1087308 1234411
10882 1234411 1326941 1312871 1257894 1184168 1070641 982317 903568 847284 803444 768696 714380
10871 714380 735820 698801 647648 627000 594478 499099 452716 399863 324352 269374 231184
10860 231184 261901 305339 381536 454238 525532 545173 630921 781843 934529 1067906 1150997
10849 1150997 1179465 1135604 1020694 871515 695126 577628 481360 348948 261005 176074
10839 176074 123885 87425 80867 67418 75650 91441 93663 89390 63523 39457 11665 -30603
10827 -30603 -82786 -84193 -19567 -5359 -58920 -124433 -149018 -77517 -35408 -45546 -16342 -30437
10815 -30437 -41491 -55317 -846 -1290 -18480 -23802 17970 41100 9193 -25075 -76050 -88909
10803 -88909 -59733 -6653 56328 32776 -12910 14043 8094 -15743 -13835 -60745 -36416 -35303
10791 -35303 -62903 -50576 -98352 -111171 -72058 -57015 -27754 34250 59478 7048 13958 58345
10779 58345 4621 -70979 -40064 -19025 -16631 -80959 -69364 -45103 5108 68070 48749 24470
10767 24470 21786 -21920 -63224 -97294 -64633 -18052 28590 35485 16594 13513 -11044 -36415
10755 -36415 18718 75350 32645 2574 17151 -12390 -27945 -48491 -64891 -87126 -62997 13923
10743 13923 20991 42357 16524 12031 21338 33007 57614 41607 22939 -29598 -41368 -9317
10731 -9317 29304 -11838 3145 35389 17283 -31698 -49036 -45183 -65731 -70476 -79107 -54696
10719 -54696 -27604 -4002 16152 41496 43822 38835 17197 -452 32137 34923 31285 37966 25083
10706 25083 34897 12828 14609 -7308 16951 6811 2666 -23162 12795 75256 84710 65951
10694 65951 9022 1695 82802 103973 81725 78443 58189 -2097 -41875 -24265 -2914 -26162
10682 -26162 -49047 -89722 -46196 4416 -477 -19183 4534 10729 -7970 -27037 -3162 -15744
10670 -15744 -17304 -44898 -51589 -6121 56794 90232 80783 69924 46524 26992 14103 65982
10658 65982 111405 137282 126136 68130 16272 28487 43422 15308 6220 51129 71881 73178
10646 73178 60464 110111 137784 130785 142775 122898 85674 48942 2397 -20634 -27707 -20751
10634 -20751 33950 55763 64402 60226 71855 35358 23082 13749 21984 104219 131765 103523
10622 103523 73412 48810 40399 33426 37681 50970 81884 54016 87438 105249 85581 5231
10610 5231 -48489 -31904 -31592 -62254 -63920 -51785 -41218 -585 48495 102435 135086 127016 158481
10597 158481 87548 47415 49127 33292 -14697 -68114 -91207 -36105 58153 99341 86651 84242
10585 84242 97421 122781 92525 39525 78960 109311 84959 22586 33577 84458 63742 26685
10573 26685 26384 29344 36186 81879 44540 4182 11266 44147 64495 40174 16497 24103 27604
10560 27604 -6652 445 37557 32606 37601 30952 66944 69650 93995 83407 46160 27736 2573
10547 2573 20391 -11695 -54244 -69753 -25654 -17330 -46446 -18609 -331 12262 53329 13926
10535 13926 -35375 -21925 65594 119780 153072 146405 101310 73280 57930 -1903 -51151 -42245
10523 -42245 -16227 32901 29560 -2760 -13134 45289 107973 114776 92093 105523 58178 44670
10511 44670 6823 -29108 -38394 -58773 -76030 -38267 -41003 -14743 6386 53418 56358 48664
10499 48664 62843 26549 22551 11653 9357 64667 43282 571 4352 40137 48195 41074 36325
10486 36325 59638 39284 12886 32236 30751 -23434 -47913 -30172 -21619 -28228 -3884 49303
10474 49303 43653 -2120 -8581 22317 96749 102019 81007 48782 24297 26406 -13001 -3255 7360
10461 7360 24316 25039 19128 -25556 -50965 -40382 -13414 27908 38715 -56153 -109109 -47196
10449 -47196 -44281 -22436 -4823 -28720 -44151 -59165 -47805 -16998 -34029 -66343 -15723 3018
10437 3018 -39709 -87790 -45322 3876 31382 33661 -40933 -76380 -47816 -60870 -71472 -61871
10425 -61871 -27343 -29259 -33073 -44033 -44573 -37448 -17658 -34177 -74684 -60468 -49696 -35447 -16213
10412 -16213 -23267 -31856 -23197 9878 61582 23781 -2674 -4686 93 -2340 -31815 3648 30621
10399 30621 2675 -10471 -25938 -32305 -2045 -1346 9254 38995 15090 31750 27513 37532
10387 37532 28904 -17583 -22733 4368 -4915 -79201 -136612 -130528 -120792 -75025 -805 26952 -2794
10374 -2794 -3963 44825 34289 49457 2937 -8359 1187 3944 9450 -10776 -4044 11695 -23218
10361 -23218 3959 -19368 -68899 -88503 -81364 -83908 -59320 -64359 -52702 -49446 -31278 -26649 -52477
10348 -52477 -77695 -33626 30705 58991 65632 64186 131352 91899 46361 63034 49333 4738
10336 4738 23012 53733 35123 32702 4641 1411 39515 47569 84165 144342 115361 80442
10324 80442 64114 -889 -40736 -93824 -43200 18683 51102 35589 3983 -51450 -70211 -46487
10312 -46487 -21302 37936 42429 6377 -29054 -36926 -41991 -51924 -38946 -55760 -68965 -88020
10300 -88020 -99897 -63207 22191 57546 -27041 -47020 -7598 51302 -14271 -37039 -32730 -12433
10288 -12433 40781 49430 58775 103402 173851 196545 203165 243407 255353 253881 287064 297109
10276 297109 241793 254139 267092 212533 203875 185060 165223 157631 133485 86734 28179 67291
10264 67291 42541 10669 16521 39670 46203 41944 56491 44751 36095 -7614 -42174 33467
10252 33467 51136 42501 36517 31151 -20857 -29120 -68497 -71615 -88926 -62859 -27788 -16067 -1070
10239 -1070 34640 97605 108513 69342 24601 -6898 -33937 -54713 -41366 4620 14559 6702
10227 6702 -24016 -13150 48911 81756 120719 134563 99277 6487 -75759 -114256 -123052 -105206
10215 -105206 -43030 -36853 -29784 -12140 -13092 63121 75934 19355 11475 -1197 -32298 -13240
10203 -13240 9528 6233 35599 47284 26960 33732 42902 37284 21327 -14067 -24471 4770
10191 4770 8519 -36040 -9803 1212 -26215 -33839 -35824 -28771 6128 4128 31769 37926 3478
10178 3478 -7242 7563 -20224 -26323 -11544 -7254 25833 46448 54262 54353 84426 50134 29450
10165 29450 40738 27947 -212 -45754 -28168 -22153 24599 44935 23063 -1937 22192 26279
10153 26279 27268 44966 54911 48116 19609 19059 15808 20413 7888 -11839 4047 10830 44577
10140 44577 13020 12624 -52011 -83404 -97056 -84334 -69360 -46828 -44677 -54439 -30068 -11046
10128 -11046 13468 -3656 16393 18843 24647 19035 50322 35215 22724 40952 64172 75578
10116 75578 39860 -4802 -11330 -49136 -86693 -74288 -17154 -1772 9940 30099 44770 48780
10104 48780 42554 74337 73108 34264 31767 26042 25943 10851 -21247 -46482 -29950 -64105 -62570
10091 -62570 -33943 -12668 -23068 -28790 -41525 -57353 -103696 -89570 -58292 -58932 -55554 -42216
10079 -42216 -5656 -6534 -29064 -8697 18302 31453 39415 1921 2366 22174 49606 96664 112451
10066 112451 119536 61145 4884 1862 48090 61267 42567 64213 54444 70706 84427 50870
10054 50870 76886 130787 127041 111420 67483 64935 35975 40426 92707 128759 209700 321956
10042 321956 536209 789390 965407 1030554 819053 495767 352678 325250 270253 158190
10032 158190 120352 122135 145049 130870 173596 143385 120065 77642 36170 1479 37640 106359
10020 106359 117836 128247 114715 103828 93275 79129 64652 57072 67095 68616 77137 65875
10008 65875 -33151 -57386 -53716 -37751 -40033 -12525 -361 42383 169060 168643 46204 -19852
9996 -19852 -9167 43076 72571 53455 27227 5844 37566 75991 87064 90940 78088 70171
9984 70171 92889 77198 46352 51655 53232 59002 56318 31628 37650 30254 49139 87927 92963
9971 92963 76695 60743 5633 -26572 -9742 159 2467 15820 47762 61784 79863 102351
9959 102351 95267 28883 11928 6697 25169 59447 57179 91320 96530 87325 111897 132496 75995
9946 75995 53773 64309 93534 75429 55032 51238 24362 20896 7555 -13425 10495 14855
9934 14855 8595 37535 23141 22467 20814 58907 108862 125507 69513 33090 68131 101690 112804
9921 112804 39575 67484 68943 32945 -1610 -4592 -5514 11307 54016 49551 29164 51881 49422
9908 49422 54105 91673 77401 47969 55287 84371 100478 27691 -6998 41293 64685 69892
9896 69892 50954 20503 1922 18091 46404 46863 42548 47207 95024 159700 159126 142255 136282
9883 136282 104192 43247 38079 84442 78234 92458 144547 157952 146821 162268 135518 99644
9871 99644 116048 111472 110060 119540 115595 91054 70142 93629 99147 87203 85580 68670 75592
9858 75592 123637 159645 174904 185894 171003 131038 69973 57538 96231 84065 105861 121917
9846 121917 100971 153591 138190 91483 106131 151355 170929 129403 79741 9627 -30071 7638
9834 7638 41562 71142 94459 90669 90470 129261 136778 118554 101800 113025 103339 144398 193061
9821 193061 136179 135876 158892 149915 131606 156009 155456 144001 109500 105213 65281 30940 43123
9808 43123 58815 112355 143335 129111 120840 86023 113050 156076 159045 153362 167801 160707 130581
9795 130581 124909 141396 143708 135941 119098 115204 154508 135379 91731 146414 153155 173308 134279
9782 134279 118378 80996 67203 140904 147913 181834 232254 246723 205549 197868 216508 213762
9770 213762 144335 85514 68245 94183 137161 135187 146851 177483 178780 157978 191206 216397
9758 216397 206457 171754 145568 140859 115896 95306 57420 55972 100850 122295 107892 87430
9746 87430 118893 127121 115875 106767 129719 111560 79847 43625 58329 31056 71047 87861
9734 87861 106925 140233 162632 150875 106003 120444 124196 97342 106626 125298 128548 112503
9722 112503 84884 98671 170089 168681 107246 104923 168991 164681 162887 168158 168775 139745 149434
9709 149434 166710 146941 144367 168979 209934 225803 172047 167685 179779 161459 147188 138623
9697 138623 133641 161270 198038 189773 188265 139756 138225 127287 176621 183924 181734 175543 190158
9684 190158 164622 179626 167723 204979 216323 183824 187655 210466 171180 162384 146196 122028
9672 122028 117383 139139 149464 136177 158642 133139 148645 171696 194816 238387 253547 277927
9660 277927 257163 220123 193689 174793 186301 212075 219390 303185 353932 316579 253661 188890
9648 188890 187573 170948 167270 149333 106055 148682 185118 177766 177487 156548 178263 205970 216798
9635 216798 214891 185861 197600 209591 226704 211819 149192 214011 236943 170824 197708 234208
9623 234208 241393 266048 321025 321181 320397 297419 319473 319228 260102 290961 329714 356708 390703
9610 390703 312658 269279 312122 357169 361471 347519 354125 287809 259342 266005 232363 196854
9598 196854 203144 190391 206949 231812 193429 152286 152821 196084 221190 202908 207023 193447
9586 193447 164004 198818 257958 279118 250388 221435 163782 102425 160916 216712 262536 274698
9574 274698 252848 194308 198669 259503 291454 290193 295142 273129 278292 291341 314931 322971 351210
9561 351210 397524 366415 384008 426743 403154 399504 419028 428172 418542 411128 441491 442006 393475
9548 393475 356691 388186 443458 485739 462103 441515 436196 406006 394728 366075 377467 346252
9536 346252 359061 336841 335975 300751 308837 316611 322471 314273 323085 330460 291953 280415 358812
9523 358812 406126 414038 414298 409964 359192 368962 416654 408462 370283 348589 290072 320635 370582
9510 370582 376677 391166 432228 438654 441508 390061 396474 411835 396706 344919 351318 385863 416180
9497 416180 392555 398991 456789 501041 490195 504946 509409 459541 473774 493870 498798 492647
9485 492647 509476 537848 523537 520914 468138 487217 517560 522354 508488 554600 595113 608789
9473 608789 557203 590799 643551 626223 606903 581187 598613 563221 553349 585203 635937 676554
9461 676554 650055 622439 625365 661058 705658 730049 743676 736017 775054 846335 874837 885072
9449 885072 943763 981470 1032000 1037500 1026389 1027664 1085555 1098277 1086374 1059804 1024105 1073925
9437 1073925 1099338 1156161 1193058 1188482 1133178 1214068 1235612 1191121 1225343 1261477 1244623 1227927
9425 1227927 1280115 1306056 1336395 1372421 1419715 1447751 1496781 1538252 1518980 1545799 1542377 1521751
9413 1521751 1489670 1512156 1540111 1617904 1664489 1716830 1715078 1687285 1675913 1734282 1794709 1825947
9401 1825947 1872376 1929427 1950325 1954051 1947815 1962008 2035958 2126573 2172269 2218221 2279237 2330623
9389 2330623 2362167 2330661 2387462 2425830 2470082 2562469 2638031 2717730 2792141 2833221 2870390
9378 2870390 2958715 3024767 3057018 3178343 3241160 3305495 3357408 3410677 3514631 3622726 3716609
9367 3716609 3839021 3976720 4104129 4245285 4358722 4427448 4503227 4637653 4779043 4851652
9357 4851652 5023473 5277511 5532163 5738588 5859021 6003512 6226332 6455218 6704609 7029907
9347 7029907 7316380 7563677 7815911 8103431 8444615 8808892 9198671 9554680 9970232 10404404
9337 10404404 10908097 11407278 11956440 12559775 13183012 13837078 14539893 15316018 16186541
9328 16186541 17120850 18125579 19238478 20412606 21616525 23071891 24624527 26260579
9320 26260579 28084519 30113852 32289434 34659065 37351905 40317935 43582945 47157975
9312 47157975 51078849 55280780 59818071 64789142 70139641 75716481 81431027 87229405
9304 87229405 92884982 98158057 102887826 106778984 109528205 111090325 111363634 110275770
9296 110275770 107901239 104393199 99894502 94814709 89386494 83774980 78170813 72778080
9288 72778080 67594837 62732856 58169425 53949006 50065678 46541911 43305699 40293909
9280 40293909 37588564 35156140 32924084 30860820 28943371 27249376 25673488 24177735
9272 24177735 22816941 21551500 20398066 19345915 18333821 17449094 16606546 15826944 15120049
9263 15120049 14457455 13822533 13184359 12595817 12042664 11539307 11119820 10704244 10298531
9254 10298531 9896517 9483118 9140453 8793081 8427528 8108362 7844375 7590540 7358795
9245 7358795 7122806 6881704 6623420 6403562 6209160 5950944 5763413 5597236 5435251 5277029
9235 5277029 5105495 4899384 4746695 4619016 4522317 4383034 4242722 4147767 4039846 3919856
9225 3919856 3767475 3693943 3618302 3510215 3371163 3243545 3180873 3150063 3089191 3013459 2935920
9214 2935920 2847128 2790292 2711638 2633466 2572032 2501587 2404458 2310831 2272172 2238375 2211508
9203 2211508 2168220 2120536 2025202 1968768 1950532 1945768 1945261 1865353 1820528 1828252 1796545 1801084
9191 1801084 1767190 1709076 1671343 1642556 1583538 1516235 1484411 1473159 1478691 1433667 1438337 1408694
9179 1408694 1423429 1418515 1359083 1289938 1276741 1246478 1189062 1205749 1224735 1231830 1253254 1219540
9167 1219540 1145906 1084457 1035806 1049070 1070587 1065695 1072573 1055466 1024217 987324 927129 895873
9155 895873 881760 923312 939152 892845 852432 866268 870898 844846 777866 745875 723848 753687
9143 753687 834549 872050 883252 870044 838597 784189 753692 799766 817047 812282 807188 758699
9131 758699 735569 728786 716290 700793 725554 737453 742836 790476 796068 788501 731519 717507
9119 717507 726931 716930 718791 738072 720016 703060 715571 715026 672961 605280 612514 631514 652865
9106 652865 678609 658753 648855 621198 574111 556013 532024 591232 611305 601078 529612 509472
9094 509472 495975 458429 438900 450458 528228 513895 455543 477554 485415 427581 393358 426785
9082 426785 460100 455525 459353 451725 399560 368932 388342 403625 400532 395354 364213 389220 463955
9069 463955 484833 434690 378713 362517 377134 352963 302696 328215 328847 347942 325934 314747
9057 314747 325553 305700 299727 320365 325405 339741 363165 369078 370744 349755 319381 281665
9045 281665 245072 269494 324271 288696 238587 264484 275504 292194 273653 256523 249218 290231
9033 290231 333078 318527 307619 325514 325409 294067 266009 207490 197486 226739 273877 293956
9021 293956 341983 320185 261318 272857 266634 240889 166034 113399 133532 127269 106161 158989
9009 158989 223034 272604 269299 267959 299641 305940 262829 196005 163906 172459 178268 185876 168902
8996 168902 155550 157786 196950 204717 170158 145804 114881 121663 91123 41043 51028 47411 10317
8983 10317 26182 10041 -5386 33443 63605 76022 83797 106656 67760 66634 80169 113532
8971 113532 121749 120415 117967 138375 144404 127422 132165 143094 153965 177336 174337 145963 157662
8958 157662 140036 149477 174143 166286 157121 190087 249871 209227 163482 168685 121055 148246
8946 148246 171265 152175 184965 213004 207614 134877 149393 103797 80172 100394 81698 42341
8934 42341 53866 81808 87655 102075 87980 84386 88474 101728 137820 137652 139583 102001 73469
8921 73469 46990 39018 20367 57247 76026 120855 145142 177639 156998 114577 121618 86741
8909 86741 94035 111880 103728 111867 80364 112426 118704 100094 114590 117725 122727 95723 57669
8896 57669 93472 103564 97791 99600 122028 129922 133079 108144 94272 143788 137402 111720 94675
8883 94675 112651 124453 128807 133039 131856 145933 135651 143476 155131 159055 136952 121923 141552
8870 141552 134769 153096 189440 142841 37709 8932 52454 69698 118418 169128 152931 176660
8858 176660 171066 148339 136724 127945 118153 88100 99795 140653 154143 147697 127229 129851 113051
8845 113051 71734 61687 50760 65470 91997 86885 75266 49439 14 -66404 -84721 17506
8833 17506 50534 -4748 -7539 -1560 3672 6432 6739 30195 39168 29144 66419 77326 94328
8820 94328 86308 54043 21557 -4366 9262 -29205 -5623 41226 24904 63504 79702 35980
8808 35980 -8761 12988 44779 15015 -45282 -79371 -42336 21282 64302 67928 90726 93123
8796 93123 80287 36164 57652 104253 117021 74791 -8012 -19814 -11320 -14488 35609 37406
8784 37406 24794 52393 48103 25731 51730 79468 98921 112897 37581 72656 115549 73070
8772 73070 5860 -24130 45940 55793 36455 13338 -2518 18499 19489 30136 -35734 -100311
8760 -100311 -82928 -56704 -26012 -14829 2044 3441 45296 41446 47130 33541 56089 23802
8748 23802 15119 55519 79912 50722 34898 -23713 -52963 -15535 -47531 -56524 -42798 7346
8736 7346 3447 8234 75205 88392 120871 126872 63836 60926 73412 103743 137190 162488 107674
8723 107674 144854 71668 22841 54444 55558 94674 142194 145913 153863 151239 121321 87936
8711 87936 59355 49110 73525 43789 71081 110634 120105 144014 141634 83103 19359 -9486
8699 -9486 -10660 17921 51092 61207 81197 60192 61995 59725 86092 91245 145381 147502 92790
8686 92790 49161 2780 579 37771 48630 34964 51383 82517 91479 70233 41348 22795
8674 22795 20251 50438 75145 20486 24640 28631 16593 51148 50334 18146 22774 41444 43525
8661 43525 32303 24058 41035 81571 80222 41214 35160 44957 59860 53704 72803 107992 104713
8648 104713 81791 54940 61294 42652 45172 76286 133314 83721 2538 17904 86919 87443
8636 87443 113507 151824 143139 154121 174502 141104 115867 128880 126031 146028 133824 171119
8624 171119 184706 155152 117993 99910 104164 136749 164252 160274 158211 93363 109190 116283
8612 116283 122794 167099 192857 253510 245913 286387 273939 220992 231374 285377 312614 348855
8600 348855 364477 444243 474707 478045 532190 587404 642492 727922 787258 844855 887088 930304
8588 930304 930640 920092 927123 881374 858529 766011 642914 565955 486046 397900 319958 281713
8576 281713 282010 309044 299169 296802 264100 215887 192733 196658 210265 182624 203452 221698 167906
8563 167906 152780 126963 138483 170696 178946 163498 159689 145115 131480 175132 160295 128773
8551 128773 92219 154398 169907 178816 200093 184441 175139 166927 136540 126902 126222 74864 38575
8538 38575 33608 20209 50922 80331 84963 126616 156248 153685 123676 82690 87749 142647 166207
8525 166207 145855 142142 96486 63066 47066 61864 130756 155998 117069 62659 48390 39650
8513 39650 36902 24374 38907 62453 91933 92511 97856 93859 110897 53200 22208 72469 88150
8500 88150 45971 5586 21910 31780 16807 41915 22519 62561 72002 45026 35630 46962
8488 46962 75242 80445 71867 53536 11631 25672 17529 3778 7217 59140 73880 98992 109139
8475 109139 132919 125758 115856 131229 162102 151331 193433 203935 158669 150241 124908 62478
8463 62478 37852 82888 97963 117158 99989 109213 107781 100654 102437 64109 73500 98038 89273
8450 89273 186090 271425 275728 288099 351864 469580 571596 590942 608590 590037 565132 560179
8438 560179 511444 407949 351404 284134 189412 150638 151598 120855 79368 96067 96129 60091
8426 60091 71342 45444 22625 14030 22363 42921 51461 78287 108890 34248 -7011 19668
8414 19668 66033 84067 102715 96591 28766 10751 33979 77726 119184 122356 141499 200588
8402 200588 233845 213343 246328 356021 419401 360986 367158 343733 302580 280248 232474 131418
8390 131418 78487 47721 36036 14756 -9393 -57681 -7670 42766 31813 18670 70057 94413
8378 94413 72033 41697 34489 15188 49115 109448 84127 51715 61931 67274 50903 73010
8366 73010 52524 48656 68791 47486 53733 63646 79635 87716 106956 123124 121841 106303 104760
8353 104760 69473 104283 150662 130492 101474 91264 63075 34406 35085 54017 48090 49620
8341 49620 44188 26809 41660 55654 60449 48070 74472 73798 54949 41990 25080 5134 -1734
8328 -1734 19440 64235 79183 98897 96500 38657 -7166 -16537 20979 34525 99178 98977 70646
8315 70646 32468 -6040 11089 15631 33532 53288 24228 61371 78711 63561 36204 8378
8303 8378 -1584 -28806 -66204 -59555 -266 62228 100626 54018 44672 17478 -20215 -58300 -61178
8290 -61178 -52419 -50240 -19199 17970 72173 78073 59922 40350 7738 71554 81899 102539
8278 102539 91658 82056 35272 11405 8259 -638 -4944 -26750 -47637 -36906 8632 43317
8266 43317 42578 23330 32046 40968 30804 18541 32188 15477 -25423 -27044 -75499 -37743 -4145
8253 -4145 43528 82020 88968 21730 -41533 -31149 -61283 -43546 -9953 -27080 -2871 -32990
8241 -32990 -33190 -11674 -30272 -49293 -33020 -28672 -23949 -19168 -21498 23285 1975 9950 36054
8228 36054 7892 6890 46546 57864 85446 118437 114181 129884 100632 66862 35567 43791
8216 43791 22042 31818 2616 28324 51374 28231 34847 8454 7712 42339 -1465 2630 50238
8203 50238 13512 -32372 -7738 -39564 -37011 -44027 -83804 -94406 -40205 -30344 -68549 -45353
8191 -45353 -30183 -15858 14751 51636 52086 45081 25917 5672 29950 60764 65093 53550 13132
8178 13132 -38137 -31381 37458 97226 65619 86204 73726 45900 27822 7390 -13776 -50232
8166 -50232 -63168 -67614 -97633 -62141 -38774 -41623 -31116 -32713 -18010 -34006 -22318 42023
8154 42023 125944 122483 61561 28077 93431 137839 97398 69178 22539 -47020 -54915 -23792
8142 -23792 -1473 46268 21825 21385 34908 14132 13321 64341 131371 159188 68337 59205 83239
8129 83239 81027 59461 42532 33617 49794 106449 133272 101372 16771 7756 -12652 -1111
8117 -1111 -3370 9323 30719 44049 41051 27654 21047 -7393 32848 38099 27980 9352 35307
8104 35307 26456 64445 122364 112237 93540 90091 81630 81195 70090 73518 49792 34289 1605
8091 1605 48273 50129 2971 5255 4091 27297 10014 1474 -37481 -37494 -16188 -44453 -39421 -6244
8077 -6244 15470 -14998 13521 28642 57810 86399 60958 36214 25128 54051 38093 11460
8065 11460 15908 30608 51225 82999 83127 34385 25683 64759 89447 97887 46183 43498 86986
8052 86986 110055 76200 93754 76228 51683 65785 120874 131843 74301 -1121 -11251 29638
8040 29638 48263 27845 41043 69702 90461 68341 2668 -17340 52269 35931 42199 51031
8028 51031 22108 20579 47147 55121 70842 72472 31263 91983 115110 49389 -8864 15848
8016 15848 41843 6050 -33575 -20896 7407 56295 57398 73339 104867 88466 78017 65360
8004 65360 99259 153433 188692 153669 168631 134181 113609 112313 62230 115394 157403 199692
7992 199692 202197 153741 182909 161652 173006 138808 90322 108591 120256 120940 144022 133126
7980 133126 171188 132760 125536 130977 138540 127448 155023 138131 150027 139339 181272 186492
7968 186492 183405 172397 167384 119937 122151 142268 169482 197374 175192 140536 160891 198894
7956 198894 196321 117629 102781 129400 161751 208022 251132 260842 164886 116797 133653 179043
7944 179043 220006 205906 152959 154556 174487 166852 179450 223741 228826 232591 232455 229836 203525
7931 203525 175033 171678 161696 180089 226191 172102 110765 113144 169858 208762 198770 219856
7919 219856 248637 251808 242668 229581 173025 226708 274560 241543 315036 299633 234135 200255
7907 200255 200545 172852 162115 164476 201797 278938 219187 163718 164915 172199 171383 181845 225039
7894 225039 245353 195168 184971 173759 223259 205850 153078 134343 119204 118808 131866 136792
7882 136792 99063 92620 107645 162199 156011 127002 104286 125028 151003 146971 132136 133179
7870 133179 133640 96486 77489 26957 19558 32699 26434 30426 51384 42120 50069 54721 77364
7857 77364 77556 110227 84876 40797 50380 98797 112043 79106 76757 53956 24305 38718 67501
7844 67501 64273 -20056 -30638 -35363 6207 26695 17493 5919 15705 18501 -14107 -20088 -36790
7831 -36790 -50508 -68973 -78502 -46026 12154 33379 38153 32947 44672 40855 1166 44664 20393
7818 20393 10340 42772 47036 31435 14447 -24375 11952 47559 64055 70902 44073 52789
7806 52789 59523 52653 28844 -33187 -21355 -10879 -17282 -26559 36630 79230 53041 77695 79333
7793 79333 7258 -52875 -23907 -23375 -24894 -646 8447 47460 16793 -27801 -10169 6407 33275
7780 33275 29592 6985 63867 73474 27543 26605 73790 17432 -31002 -19845 1012 35026 24488
7767 24488 -15405 -80642 -69177 -31895 -39235 -42608 -49338 -23279 -8775 22714 -1957 6585 52501
7754 52501 94359 32115 26125 66923 100538 59655 22810 68497 27850 -35476 -67303 -30914
7742 -30914 -38836 -39176 -3419 -3329 -18657 -8729 38168 53347 26888 -6174 41237 57052 27604
7729 27604 12705 10677 -13812 -36791 -78034 -105037 -94429 -59938 -14558 -49702 -71272 -28037
7717 -28037 7427 -20863 -74948 -105606 -100469 -60990 -12711 -27371 -30631 -16965 -27693 -71208
7705 -71208 -72611 -59965 -37474 1906 -11017 -33129 -25941 -38594 -24463 -593 22896 -10666
7693 -10666 -6200 7911 21984 47116 53722 18380 -11316 -30673 -36866 -21121 19229 5817
7681 5817 -15912 -12384 3431 33385 18473 24046 -9156 -38276 -21437 -81287 -103996 -118406
7669 -118406 -90250 -42462 -1219 -34960 -41120 2044 40519 7969 -13750 -52217 -87554 -69345
7657 -69345 -50940 -81852 -54118 -55530 -42440 -42632 -26222 -64386 -105006 -43456 23805 -19906
7645 -19906 -40671 -13524 54923 70187 37041 38857 24052 -27803 -86009 -54183 -24964 -17422
7633 -17422 -42909 -51994 -49531 -19648 -65080 -84888 -55471 -38925 -20484 -37786 -6919 26322
7621 26322 30706 -9571 -36734 -32480 -14467 21226 -37553 -46962 -18790 117 -28604 -22414 -1846
7608 -1846 -14470 -39229 -41468 -36835 -51965 -76751 -11034 -23712 -22186 -43984 -36796 -32774 -24721
7595 -24721 -79924 -64922 -69640 -63404 -54062 -75703 -61316 -61469 -59108 -52023 -76980 -114392 -96463
7582 -96463 -43462 5766 7488 40644 90919 108307 88654 61855 948 -24238 -33337 -24060
7570 -24060 -9685 -27278 -32121 -39185 -52873 -33446 -30603 -17613 -30118 -21502 -74655 -35651 -362
7557 -362 -45302 -28131 -14837 -43774 -18329 -7041 -4965 -33520 -21343 -43941 22366 50633
7545 50633 11852 -27538 -31602 -36446 -62929 -61848 -19673 20029 26901 85710 80835 47320 15809
7532 15809 -34924 -72628 -77852 -93654 -61100 -36759 -26935 -48480 -52222 -14000 30670 -1567
7520 -1567 -60781 -65934 -88727 -71466 -52605 -66654 -85140 -40091 -13741 -32538 14176 -32633
7508 -32633 -71097 -67317 -33217 -27761 -42999 -29926 75 51526 39763 56939 122550 125455
7496 125455 86716 54792 34078 22420 34649 61767 32477 20782 -68375 -56280 -36763 -32825
7484 -32825 8315 -3030 -39642 -51535 -73502 -34619 -22090 -47484 -45364 -53295 -78264 -43708
7472 -43708 -46262 -59809 -42701 -27648 -32377 -28971 -31134 -30873 -41644 -5629 -31353 -57210 -405
7459 -405 13639 -42704 -47750 -45610 -58111 -76458 -107676 -85457 -70667 -45063 -30895 -58177 -57418
7446 -57418 -2918 -33478 -46787 -65181 -69598 -28540 -59946 -77929 -80767 -65058 -42180 -6917
7434 -6917 -4078 -58594 -25241 -28066 -65290 -39538 14531 -14508 -53407 -45857 -52747 -67901 -64097
7421 -64097 -91400 -78262 -29680 -45095 -17163 -19662 -71221 -35513 1957 -41452 -26858 15031
7409 15031 23887 37770 2351 -51833 -10032 -9848 34111 59962 81379 46012 40461 32446 11883
7396 11883 17624 -4010 -7298 -49822 -113628 -128208 -93098 -37407 -19274 -24273 -79646 -102245
7384 -102245 -57898 -22604 -52122 -36605 -29603 -30796 19150 -2485 -73682 -98419 -121681 -64602
7372 -64602 -9295 25216 20228 30264 -29278 -64940 -28598 -1157 -2495 -35551 -29551 -52479
7360 -52479 -96602 -111903 -85919 -97740 -90853 -70559 -21077 30155 4785 16176 32459 -971
7348 -971 -25789 -10871 3157 14197 -32200 -39741 -5641 12742 42524 47631 14374 -50808 -65495
7335 -65495 -55352 -41441 -14788 34228 46034 29024 15134 44949 10794 -3747 695 -13515
7323 -13515 -55509 -76533 -69884 -80741 -57874 -3385 17246 -25182 -85885 -74285 -73062 -45004
7311 -45004 -62452 -87608 -48465 -59963 -42514 -24168 -93536 -114131 -83718 -29574 21584 29378
7299 29378 13984 -24158 -24070 -11273 13017 23355 7903 -34946 -88323 -117061 -120225 -62345 -59717
7286 -59717 -13250 6199 -40101 -37317 1236 3406 8003 15022 -32597 -32527 -35403 5522 2062 40604
7272 40604 6686 -6646 23358 24618 45821 25797 -23777 -32458 -14654 -5099 6993 32686
7260 32686 29961 41740 44373 40809 10475 -50393 -71123 -47115 -17198 -30363 -3159 41464
7248 41464 36384 41259 91491 63712 54917 86883 79990 43273 51836 52209 40138 7860 28807
7235 28807 17610 -38325 -31392 -44206 -4608 -17431 -61950 -27776 -40591 -87933 -96381 -123092
7223 -123092 -91672 -64200 -41710 -12934 -28158 -17084 -6169 -25069 -54656 -27854 -6141 -17519
7211 -17519 -31743 -24226 3613 30946 34834 29563 59613 30939 -34084 -44412 -46464 -56324 -24258
7198 -24258 -30624 -80527 -77502 -63808 -52972 -9033 26111 -9099 19454 5733 -9588 -46403
7186 -46403 -10604 -11662 -34172 -49156 -80948 -102124 -111672 -116051 -88842 -79233 -51739 1047 1600
7173 1600 -37587 -72004 -88507 -71826 -68538 -36043 -39311 -37960 -45365 -56103 -40983 -46664 -45553
7160 -45553 -34049 -19728 -17826 12318 22130 25608 40925 175 -22176 406 994 18405 91793
7147 91793 87753 16616 -74464 -65564 -74210 -138592 -120357 -65113 -23847 -13429 35175 22696
7135 22696 -17826 -64359 -59796 -59703 -73351 -71454 -64249 -33625 -8273 -67798 -62044 -16773 189
7122 189 -16840 -10413 42913 24035 -67890 -105625 -111319 -108823 -96174 -43737 -33124 13260 -6889
7109 -6889 -9305 14221 28750 27836 -9204 -5414 2340 34853 32941 11288 -11506 -5888 -23149
7096 -23149 11809 34258 9731 -15604 -21913 -43815 -73558 -107076 -118711 -102259 -94469 -53863
7084 -53863 -71629 -112566 -135340 -120457 -90954 -40393 20981 15571 2437 23548 47054 -10453
7072 -10453 -92063 -94472 -54301 -37850 -40147 -61006 -30535 10867 29488 46505 91167 33763
7060 33763 -27275 -23257 -16532 -36689 -42779 14597 3826 -54360 -93329 -101091 -61708 -43870 -41532
7047 -41532 -42439 -42311 -27553 -17846 -670 46280 23310 248 -8137 37653 74033 47295 28376
7034 28376 -36868 -33859 -30928 -23826 -58968 -30343 -33755 -64776 -91506 -123096 -96355 -62596 -57112
7021 -57112 -67484 -74302 -93951 -71456 -81038 -42821 -31133 -39408 -12917 529 19276 -7369
7009 -7369 -16414 -14986 -23438 -54387 -48823 -34087 7434 39026 -16882 -79355 -58712 5910 17022
6996 17022 -4911 -15732 -7444 13355 9123 -459 5388 -61102 -68888 -73637 -53004 -32030 -24038
6983 -24038 889 -6151 -61610 -138787 -142767 -113981 -123060 -135876 -130575 -107784 -89253 -65622 -41596
6970 -41596 -39878 -10409 -14826 -3257 -19967 -12805 19050 1395 6636 32532 49895 29217 647
6957 647 -167 -24075 -33434 -18269 4234 -31143 -23477 -14591 -51158 -59607 -7625 -684 -1899 -2003
6943 -2003 -5340 -18367 2771 11032 21214 30200 24219 -58194 -112712 -98476 -91751 -96177 -102864
6930 -102864 -79407 -82271 -113347 -94441 -94098 -78305 -72674 -96333 -90319 -47002 -18177 -54000 -89033
6917 -89033 -71372 -47907 -57763 -76656 -86965 -49025 -23731 -11465 -5259 21029 -23268 -43256
6905 -43256 40833 60276 47572 25562 18421 1895 -23975 -46537 -39146 -11379 -19508 -11962 -2369
6892 -2369 -28938 -46053 -72449 -65411 -86159 -102840 -107005 -131523 -131882 -106754 -30129 5733 -14306
6879 -14306 -2445 -6294 -5785 -7207 -21135 -39332 -13770 194 10220 27864 62262 67682 69900
6866 69900 78650 73719 49934 33438 3173 -1532 28658 29414 -25152 -36875 -12855 -10379 -43329
6853 -43329 -110708 -151002 -92720 -24993 18889 -514 -38994 -42258 -23775 3457 8806 -33053
6841 -33053 -37234 -29799 -12492 -102471 -149333 -159862 -103984 -62785 -37433 -24723 21072 46318
6829 46318 11595 24436 -6724 -11333 -29359 -27579 -33930 -65818 -43640 -25245 -7380 -56268
6817 -56268 -69811 -63646 -61423 -32071 23497 8793 -12576 -19264 15536 20496 -12787 -34051 -14824
6804 -14824 -26489 -58159 -36897 -21590 -17767 3912 -1822 24097 14207 -38100 -89691 -131390
6792 -131390 -101604 -53673 -67878 -72909 -23352 -26194 -36472 -54228 -47469 -61435 -91581 -20094
6780 -20094 -23090 -46400 -66490 -44652 -7248 29000 49593 25138 -12282 -19540 -4212 -26031
6768 -26031 -24566 -4258 27640 57567 81192 64163 -11315 -32178 -32276 -18328 24595 24261 22909
6755 22909 4593 18347 51949 66187 37931 21282 -34054 -51456 -22103 23967 4901 -29754
6743 -29754 -16921 10928 -16461 -89724 -77544 -32187 -11990 8083 46718 30907 25937 15607
6731 15607 -15957 -43686 -46565 -25238 -12159 -7835 -33294 -83155 -103197 -84167 -102258 -103309
6719 -103309 -8674 41132 -4826 -4731 8063 1865 25653 26679 24163 6583 -28828 -57660 -41934
6706 -41934 -14914 20706 27802 26371 27691 22996 60915 54337 10005 12007 38694 -10318 -31156
6693 -31156 25871 38308 -42268 -69523 -81059 -128764 -113055 -90917 -72513 -87439 -26304 2494
6681 2494 -15248 -13476 -47009 -53510 -60020 -77156 -81385 -104116 -93161 -33462 8251 22247 -38366
6668 -38366 -46082 -14169 -45690 -40891 -86736 -91336 -107947 -88098 -115293 -114895 -49335 13335 17825
6655 17825 32091 35531 22797 -15735 -29191 -44120 969 -9067 -58995 -73122 -36236 -43531
6643 -43531 -45128 -35375 -55359 -38077 -45492 -103845 -130034 -85350 -44233 -16692 28083 16147
6631 16147 -36306 -54315 -11761 2898 -4326 -3503 23432 29517 -9596 -23378 30086 71036 55266
6618 55266 53615 34322 -27120 -31070 3576 17145 -2602 2611 -56452 -94613 -92600 -76411 -72778
6605 -72778 -54802 -14950 -10330 -51304 -49539 -89851 -112490 -95704 -102818 -66284 -99256 -104807 -37418
6592 -37418 10564 2837 2444 30744 30464 3279 -39256 -50562 -59059 -51561 2647 79260 96534
6579 96534 27601 -41434 -44201 -50743 -38123 -37862 -38697 -56108 -49537 -20175 28224 -12889 -58894
6566 -58894 -79413 -99869 -66358 -71855 -135028 -137792 -120476 -71533 -43358 -52110 -57000 -104526 -86895
6553 -86895 -36985 14195 7305 -12111 -10242 -8200 -8370 -20022 -45296 -68417 -46275 -61837 -95131
6540 -95131 -54056 -47839 -43916 -51614 -69886 -68428 -72948 -58455 -64198 -37564 4368 25940 34162
6527 34162 -27656 -27718 27018 36435 16753 43227 43738 30074 -2601 -11596 1091 16634 32669
6514 32669 51673 11748 -79 31375 46824 21046 1168 -43760 -26654 4311 60333 63682
6502 63682 31730 4153 -15749 -16851 -23964 -34523 -51050 -51612 -10686 -31843 -19911 -13717 -50884
6489 -50884 -61206 -67322 -75583 -67327 -81136 -99426 -89385 -15689 -18976 -61549 -75192 -80847 -80663
6476 -80663 -65512 -46194 -60929 -43454 8851 6834 -31414 -42364 -14686 -7122 32608 30960
6464 30960 -32573 -64068 -40979 -46763 -34931 -53727 -29760 -54897 -81555 -98348 -71269 -31311
6452 -31311 -849 27962 36210 81384 78632 57858 21415 32193 6788 -822 -5502 55183 62667
6439 62667 43345 34733 25761 30410 77469 122113 134088 123725 78853 57689 10766 15705 81094
6426 81094 93116 48183 -10384 3430 -10791 -28798 -64027 -69175 -11128 -8105 4877 -48033
6414 -48033 -52632 21541 50504 35190 -354 -61094 -80752 -19913 -15279 -72160 -44522 -34360
6402 -34360 -18094 -63543 -75498 -47210 -644 26935 36510 70503 40285 5294 -48410 -54
6390 -54 -1489 -21588 -69467 -73413 -99458 -100016 -84879 -44069 -16457 -13801 -36583 -33582 -12510 -19562
6376 -19562 -31956 -10990 20670 7663 -26496 -61972 -81545 -43787 44685 73235 93558 113128
6364 113128 78077 44784 -51486 -89191 -113734 -83736 -42153 -23530 -43451 -28895 10091 46266
6352 46266 47129 77671 27373 16083 -18391 -25537 16645 7735 -30254 -17964 -11370 -1924 36894
6339 36894 48426 77758 51101 18107 -22630 14100 -7032 -25507 -20559 -749 26322 7843
6327 7843 53523 47022 44238 -43062 -64201 -89175 -116864 -103702 -79610 -94321 -85701 -74114 -62709
6314 -62709 -16178 -31900 -73516 -119210 -154752 -104008 -59628 -56707 -56091 -70672 -83755 -78331 -68458
6301 -68458 -53413 -57644 -42884 -72232 -110468 -144823 -150742 -159159 -158999 -155119 -120657 -125353 -100253
6288 -100253 -60300 -39731 -74352 -75634 -47390 -80017 -74715 -48906 -78903 -94380 -85511 -61927
6276 -61927 -48918 -87986 -75044 -29628 -55166 -74302 -74247 -76048 -79176 -20705 49527 5154 -28348
6263 -28348 -14763 -29268 -16164 37526 9952 -32509 -32948 -15298 -33801 -35839 -1746 29662
6251 29662 93498 97248 79299 71442 17232 11074 25207 4478 -25562 -47521 -41774 17705 -18166
6238 -18166 -103573 -143720 -103328 -73440 -71191 -69797 -74503 -64433 -59879 -34591 -12264 70472 114874
6225 114874 108406 42734 22515 -29592 -13784 -353 18970 -329 -29809 -21672 -38181 -34936
6213 -34936 -28443 3096 4088 -39903 -48375 -36085 -73356 -104611 -97181 -23422 -25790 -16016 10970
6200 10970 25121 47789 48699 -9114 10427 44607 83819 100526 78612 82702 82013 105067 131575
6187 131575 95334 39587 -929 -35835 -65237 -116843 -134322 -90562 -77975 -110824 -78543 -31556
6175 -31556 -34471 -30988 11667 61131 65165 37726 1426 -28056 -58771 -88187 -72348 -104704
6163 -104704 -65649 -32360 -41804 -96194 -72434 -47793 -73632 -93486 -42197 -50871 -29985 -42200
6151 -42200 -31622 -6219 4636 -28516 -89758 -136144 -116449 -87598 -77019 -83217 -96727 -87285
6139 -87285 -56531 -43211 -33031 44071 75330 19908 -5615 -17002 -25097 -508 32649 43966
6127 43966 3683 -12341 81372 80057 51339 -14391 -52937 -30215 -10704 2043 -18005 7791
6115 7791 -13448 -59873 -46385 -45443 -29450 -20891 -15377 -18027 -17718 -50134 -70460 2952 38442
6102 38442 35561 5997 -65360 -71456 -64298 -47809 -1768 29140 57155 53496 -5724 -15523 -7372
6089 -7372 -11683 -42209 -33866 -58374 -23557 -17958 22265 6342 -23755 -27075 -26953 -33006 -12804
6076 -12804 -146 -3440 -32482 -8574 -26134 -42147 -39985 -3510 29467 26216 32837 19861 15837
6063 15837 42615 42071 3665 -43594 -54416 -83690 -129100 -76136 -39697 -32283 -63192 -83688
6051 -83688 -81432 -44980 -59801 -69235 -42334 -51709 -56428 -30629 -39963 -121966 -152391 -137019 -118202
6038 -118202 -110663 -97035 -66241 -46968 -44584 -79475 -75280 -100815 -104851 -67994 -89842 -61935
6026 -61935 -24781 14074 -22241 -59299 -36850 -12246 6606 -10641 -35953 -29883 -45087 -49946
6014 -49946 -80698 -84253 -47834 -13722 -711 8176 30908 42108 26269 18615 -20397 -24832 -22731
6001 -22731 24229 30180 -2454 -12258 -5999 168 -9060 -22625 -16690 -45423 -39811 -55168 -77032
5988 -77032 -4211 2193 -41758 -85807 -113610 -58974 -9464 20419 35608 6401 -21529 -30689
5976 -30689 -38800 -12174 4133 -51746 -56951 -73082 -67189 -35510 -14146 19143 33642 10872
5964 10872 -992 19285 -13022 -22170 -17109 -42390 -59202 -41317 13237 1149 -6208 -41277
5952 -41277 -67354 -132013 -104866 -47099 -60077 -83262 -40445 -22677 -3784 -4409 -9946 -29005
5940 -29005 -90784 -101394 -61159 -58282 -23318 30678 56089 53350 -10680 -27130 -45677 -77565
5928 -77565 -77396 -26534 -18958 -14175 -24242 13605 1572 -62231 -63570 -68976 -26535 19049 20190
5915 20190 41901 10483 20304 28592 -3434 -34483 -39518 -837 8674 17139 78697 50870 -6839
5902 -6839 -61478 -46336 -26999 -40088 -48387 -53862 -42296 -49902 -29758 -20370 -43009 -25559 21414
5889 21414 55846 46632 33769 33710 16758 -44253 -70956 -124717 -106114 -83348 -95424 -70383 -80227
5876 -80227 -76818 -79415 -22491 -44668 -64322 -42051 -58379 -84957 -55521 -34024 -22856 2629
5864 2629 12556 -15152 -20852 8884 25454 57077 28037 19910 12911 -5674 10577 -11438 2938
5851 2938 49304 6888 -26633 4510 16239 -6492 17999 45197 30039 45208 58084 46080
5839 46080 -29930 -83296 -53241 -41010 -79614 -111742 -88177 -86897 -43760 -45723 -16951 47560
5827 47560 44138 23903 -16512 -86178 -102219 -53130 -16609 -8112 -14407 4621 21800 19063 -22377
5814 -22377 -48067 -47589 -86615 -86689 -32411 -30830 -56307 -74205 -81222 -75361 -82366 -116229 -25542 1022
5800 1022 -19252 -64050 -42718 -68404 -63541 -15459 12472 -8834 -89674 -117683 -63980 -37555
5788 -37555 -1681 28704 51930 40638 38146 36792 -57835 -55239 -19168 -4957 -8342 -42263 -68952
5775 -68952 -43820 -80300 -62487 -21148 33539 51430 40759 61135 47812 -33062 -39222 -24283
5763 -24283 -12200 16114 15744 19152 9790 -7903 -21915 -30368 -34543 -2094 20546 -6674 -41522
5750 -41522 -91611 -47876 -389 1063 32296 34984 -575 -15722 -12085 1080 16068 8438 -34891
5737 -34891 -60961 -57369 -26198 -20484 28498 13037 18849 2859 -15383 38597 57348 77401
5725 77401 42991 38415 39752 6544 11722 14092 22559 43211 49050 57765 79832 82584 63311
5712 63311 38652 -15281 -19995 -1048 -14323 19703 45994 53409 8398 -17031 -28108 -57904
5700 -57904 -45255 -35719 -90607 -123122 -117527 -102506 -64904 -29310 6194 11690 14061 20950 50576
5687 50576 57718 77038 81786 76285 61775 55451 17686 -13068 -39933 -55306 -66660 -64012 -45675
5674 -45675 -97175 -64892 -3522 74955 75097 59450 45757 28589 -23719 -51541 -21236 387
5662 387 -16305 -15818 -40789 -71151 -86467 -103294 -78889 -43929 -71407 -46295 24523 36381 42083
5649 42083 37217 15585 -3691 -1398 -42849 -23358 -11317 -37150 -59189 -52589 -57317 -21816 177
5636 177 1275 24941 16855 -31378 -52270 -59854 -16862 8670 87 28767 54364 16739 -24827
5623 -24827 -34095 -12127 2170 -54206 -85695 -56715 -26595 6655 -10489 -6923 8063 -18620
5611 -18620 -21427 -52246 -53473 -20000 -18401 -16364 25121 52844 89450 -14437 -81967 -38474
5599 -38474 18197 3298 -26383 -29873 -54059 -35753 11604 -36130 -52593 -32565 -55616 -62506
5587 -62506 -27815 -11564 -33957 -84059 -57645 -66225 -84279 -26777 6143 769 -23484 -55405
5575 -55405 -47309 -49694 -35790 -44436 -15915 -12931 -37880 -32580 -31265 -22829 -2294 -3323 -56425
5562 -56425 -53662 -5589 38998 77948 68952 52319 95802 95528 75172 57219 44965 42239 56581
5549 56581 -6174 -56773 -102656 -95498 -68244 -57502 -32538 42719 44037 42329 -3759 -7913 20275
5536 20275 41891 3867 36633 1296 -50477 -21045 -37662 -33118 -4253 2544 19291 51701
5524 51701 4283 -60747 -81468 -63423 -28194 -36368 -56273 -4522 -36568 -58310 -66457 -56039
5512 -56039 -21766 -15148 6378 -4049 -4605 -26730 -44110 -54948 -49124 -59028 -81496 -41482 -11673
5499 -11673 -11433 -38318 -13597 31360 33959 -39330 -53852 -86115 -58781 -53115 -91748 -61976 -43019
5486 -43019 -30947 -61384 -110111 -110637 -95453 -80873 -127136 -133687 -142341 -179149 -153567 -121855 -106153
5473 -106153 -123282 -139308 -107472 -22964 47537 28954 -27184 -8023 21880 9959 14539 -24939
5461 -24939 -55363 -13823 -18254 -82528 -51323 -18671 -27937 -45442 -26566 -80101 -35338 3987
5449 3987 8436 -70566 -111638 -119903 -101104 -64166 -68846 -44028 -9060 32664 23788 30945 41818
5436 41818 5695 -33326 -1218 37198 18145 19010 -16156 -2989 41284 24364 -19029 -47857
5424 -47857 11982 86115 89556 82703 58630 18947 -35071 -88171 -82799 -29999 34831 64534
5412 64534 80094 53878 40104 16005 -29727 -47144 -8168 -13879 -29587 -60985 -83807 -41244
5400 -41244 -18207 7286 5339 3509 30464 47318 47607 22543 -3991 -23708 7781 17073 -16431
5387 -16431 -54532 960 6075 -18290 -7689 1103 -1065 57733 83959 77670 16639 22042 62996
5374 62996 -14146 -41619 1550 27139 -8824 -12713 -14254 -18385 3628 -12526 -59902 -91812
5362 -91812 -40417 6893 -9012 -6281 -39896 -54837 -45661 -29311 -44467 -56888 -53585 -73682
5350 -73682 -85270 -48269 9780 -38324 -62103 -43040 -56410 -15291 -25281 -37811 -39100 -36466
5338 -36466 -6591 -4667 -8055 3719 14523 11323 16494 17193 13490 5344 14714 34990 42114 -1416
5324 -1416 -27096 -13598 -59331 -79384 -85863 -66174 -97600 -59783 -37018 -11506 2733 -46171
5312 -46171 -79416 -133694 -109895 -87274 -27392 28591 32394 -5973 -1912 64380 47527 57173
5300 57173 57882 56866 72411 38000 13660 66208 54941 -14443 -26320 -70215 -33248 -34735 -89190
5287 -89190 -110632 -67196 -37776 -31071 -4298 25295 70774 11660 -52949 -77993 -108774 -50897
5275 -50897 -8817 -27832 -37098 -57262 -59329 -65650 -75301 -93740 -74968 -97837 -81725 -103179 -54609
5262 -54609 -33857 -7151 -20324 -50917 -40776 -18147 -67986 -62313 -22253 -11056 -194 -2331
5250 -2331 -8154 -18377 -37422 -33639 13538 13722 -9908 70517 44859 29173 -5375 -34385 -42005
5237 -42005 -45654 -33350 -20884 20946 19197 54820 55570 27826 61855 54530 -18112 -18069 -12659 -26657
5223 -26657 40628 73981 49376 25731 14260 46405 42418 28222 -2751 -46772 -37247 5261
5211 5261 32296 -16185 -61570 -70588 -81058 -64075 -58996 -38291 -58542 -97831 -81455 -22912
5199 -22912 437 3094 18810 -12047 -21629 -44947 -82124 -61174 -18072 20345 33776 29547
5187 29547 5775 -17928 -30109 2224 504 4436 41502 42684 -22587 3969 35323 48396
5175 48396 4657 -4169 4202 -9914 -33882 -65651 -89915 -99541 -98684 -105488 -45748 -81653 -56340
5162 -56340 21881 1063 -10066 19411 66080 47455 32497 84946 66288 -16699 -37699 -7097
5150 -7097 32800 11949 35036 39367 -17362 -55347 -41768 7319 33043 26408 11199 31988
5138 31988 18115 16725 11709 29183 82961 76359 -16815 -36820 -15802 -53693 -44261 -33729 -84068
5125 -84068 -114785 -85554 -8892 50853 42281 -27686 -33794 -17151 6208 26670 3072 -34808
5113 -34808 3377 -382 35570 32198 1892 -24450 -17628 -44959 -60663 -74345 -63596 -66001 -52058
5100 -52058 -46660 -32772 -40180 -46677 -39916 -5997 2886 1029 -18908 -12397 544 -28880 -11633
5087 -11633 17730 -11776 -20435 -24500 -8807 -40764 -54523 -53541 -105616 -81755 33323 45083
5075 45083 22858 24119 1505 -18490 -15424 -23024 -33798 -66512 -81486 -40954 18073 1394
5063 1394 -685 -15316 -6306 -508 -17880 -23471 -54896 -47296 7287 -18221 -60376 -76986 -68529
5050 -68529 -69146 -94115 -85964 -67021 -68003 -46504 10908 25930 24896 -3396 -15785 21412 56481
5037 56481 26252 -1615 -31432 11636 23725 -4201 -44723 -81088 -81212 -30242 261 -20562
5025 -20562 -34391 -30588 -26593 -4918 -30252 -63565 -64371 -42108 4273 76604 66382 24371 -17212
5012 -17212 -559 44052 12066 -15516 -39051 -5488 3687 -7224 -30526 -77785 -27790 8645
5000 8645 -1526 -36964 -68388 -66195 -46035 3432 -12961 -22478 -18790 -54744 -49579 -18649 13877
4987 13877 45783 20753 -9928 -38498 -56567 -40783 -57192 -48321 -5208 49971 86274 74628
4975 74628 54501 10157 -70943 -88716 -31188 -20864 -38936 -47039 -37544 -27792 -87481 -103001
4963 -103001 -98041 -74443 -16661 16801 -13822 -27996 -2 4031 -23623 -48447 -53491 -61344
4951 -61344 -17095 42780 8789 19358 16366 5494 -26125 -68304 -41400 -56595 -22647 -32341
4939 -32341 -56365 -63147 -87763 -55996 -23206 -59548 -90247 -63917 -67874 -45759 -31679 10336
4927 10336 85775 52526 37818 36622 38531 31367 17412 5416 -55461 -82967 -90549 -40064 -32087
4914 -32087 -86090 -116564 -127584 -83774 -67497 -71718 -44635 -29500 -4687 42724 63781 44879
4902 44879 18810 -17478 -50072 -23649 -1672 -15631 16949 67173 35582 -17266 -18850 33176
4890 33176 37656 13822 43570 33431 23676 9468 41059 44330 35650 29169 33728 27377 -25318
4877 -25318 -23874 -5297 3018 -1333 15602 -9219 -19501 -18530 -55745 -101474 -101464 -101052 -50886 12914
4863 12914 51676 44956 1240 -10814 19597 4565 -17517 -59080 -67167 3346 -20675 -73431
4851 -73431 -90960 -58394 -21295 -25455 -336 21458 -10088 -53443 -36076 -72564 -70820 -76823
4839 -76823 -99268 -74174 -88650 -92002 -51079 -20421 -58040 -70060 -68959 -75580 -54731 -59602 -70098
4826 -70098 -76446 -43254 -11490 3017 8378 -28971 -9827 -21367 -82584 -97006 -47643 -27950
4814 -27950 -52069 -40286 -53055 -86868 -51249 18321 21366 -11252 18959 48299 -20600 -34861
4802 -34861 -20424 2033 23465 35085 15327 38968 29862 1709 -2768 -9484 2782 20941
4790 20941 35828 40375 17648 -32125 -91965 -100595 -102085 -64374 -55906 -25431 21835 -7325 328
4777 328 10068 20795 38855 61973 60255 58617 66413 40316 31150 3225 -2166 30266 49873
4764 49873 48503 61924 26564 -17042 -48516 -63519 -55349 -10926 1839 -15025 -12808 -8307 6004
4751 6004 -10090 -23125 -37870 -15809 -43890 -97037 -133172 -111369 -89194 -67974 -29869 -13832
4739 -13832 -55107 -51923 -544 -16738 -16285 -11324 -18378 3917 36205 41539 22405 -1755 -282
4726 -282 11093 -61644 -72457 -49818 -41347 2138 -9285 -23625 9231 42847 14069 465
4714 465 -21639 -47067 -85323 -82787 -35964 10338 -31858 -104022 -112866 -40584 16275 -28901 -54601
4701 -54601 -31847 -65375 -91062 -52826 -9615 -4245 12911 26981 30394 -28172 -48751 -38372
4689 -38372 -8024 15668 45836 64708 84214 105084 19599 -32737 -31805 -39471 -62534 -838
4677 -838 10236 -3638 -44495 -110127 -119116 -92971 -67011 28887 82246 86670 92301 120930 99934
4664 99934 125352 93200 10906 -25167 -34779 -11058 21868 63297 52403 22386 45471 55272
4652 55272 41954 21391 -48419 -73637 -26581 9802 -27827 -39304 -40659 -31136 -16919 -36173
4640 -36173 -12574 -155 14863 7344 -14070 -51784 -54642 -67537 -63666 -32955 5419 -21991
4628 -21991 -61735 -17320 54833 88648 72531 30096 -3804 -36972 9139 46518 18937 15962
4616 15962 9123 27228 22471 -882 -22238 -24656 6743 -9278 -20813 -9229 -2579 30025 36204
4603 36204 5100 -31491 -45766 -70754 -97844 -41953 -7082 -24962 -18866 -12001 -47302 -32373
4591 -32373 -8992 -24104 -3246 -37546 -65196 -35318 15436 -2303 -51719 -69206 -81287 -55757
4579 -55757 -61952 -8714 -45712 -103499 -93553 -71984 -11735 12111 -7209 -9402 -82598 -89746 -47179
4566 -47179 -77774 -45200 -28173 -13566 30883 47325 28053 -6081 -26383 -5242 3602 19754
4554 19754 -2751 2934 3173 -15958 -21915 -23999 -16085 -23875 -11995 -8480 -97344 -83394 -31359
4541 -31359 -952 -44301 -88150 -66419 -58630 -52957 -9575 -25334 -21386 23290 55733 13381
4529 13381 -20663 -7128 -45243 -63301 -108045 -97469 -46399 1134 -9503 -12593 -17390 -37992
4517 -37992 -37393 -37022 -12729 2871 30411 76979 91377 79817 34009 -31133 -47684 -90511 -84730
4504 -84730 -30838 21731 17488 -11784 44488 74386 16491 -51156 -75293 -72029 -41584 -29088
4492 -29088 -13891 1187 -9068 5243 20466 -5456 -22129 -27353 -50702 -80638 -73352 -36844
4480 -36844 898 19863 16891 23191 74779 59480 -3083 -34835 -56704 -52431 -47747 -42841 -4354
4467 -4354 11772 7702 16929 -8529 26838 32958 13610 -41695 -24404 -6640 -45371 294 20133
4454 20133 3349 -6590 15298 53636 36414 -20647 -62262 -50247 -62097 -34780 -44712 -64028
4442 -64028 -49042 -76256 -103268 -102832 -18685 37213 -20639 -59055 -43427 -38812 -63232 -53618 -39561
4429 -39561 -45851 27926 38115 26967 -4240 -36839 -60024 -83013 -50863 -55973 -61187 -37748
4417 -37748 -19742 -65134 -87706 -44876 -2846 -28712 -41298 -3851 4287 21037 33777 -5590
4405 -5590 -4387 21327 17856 -9850 -8921 8479 6560 21775 26263 1288 -6332 -8421 -6359 40265
4391 40265 31206 53824 56908 -23411 -24916 18137 -4950 -28673 -48469 -64283 -80163 -44440
4379 -44440 -58520 -73455 -113745 -74911 -54404 -56808 -87899 -106954 -102338 -115441 -86801 -34016
4367 -34016 -61546 -37381 23235 -28133 -24322 -9597 -10892 -48647 -55668 -42546 -703 15742
4355 15742 6934 -9410 -13724 -15075 42207 29740 -7291 -30278 -34895 -17285 -27776 -26567 -23758
4342 -23758 -17560 3329 -8192 -42963 -56746 -66496 -79886 -112692 -79727 -95490 -96793 -104915 -105046
4329 -105046 -58707 -43454 -34230 -38294 -68823 -16158 28577 32802 35525 26962 -26581 -35244 -29834
4316 -29834 13471 33226 5691 28339 76305 86881 41232 -3600 -32725 -11431 2040 -8471
4304 -8471 -58128 -87205 -51978 -37229 -45910 -56556 -60071 -65541 -53257 -26831 -15405 14777 32439
4291 32439 47347 16074 -5213 12331 34425 17902 19023 12658 16918 13389 10759 15534 15801
4278 15801 3401 67077 40887 -27670 -68140 -82032 -88900 -74106 -43151 -1324 -11981 -44943
4266 -44943 -99127 -68265 -42517 -27287 12927 -30111 -45380 -82168 -49407 -25060 -51878 -47743
4254 -47743 -41530 -2854 41560 20754 6056 19509 26797 -16391 -12228 -1602 26936 39484
4242 39484 67926 73377 40065 10180 -26775 -59966 -41938 29930 12017 -10536 -41037 -59567
4230 -59567 -44004 -49480 -42310 -31051 -35228 -6617 -27220 -59177 -39384 -46788 -52676 -25812 12538
4217 12538 68462 70898 59121 54271 32804 50697 116030 174753 81419 11830 15055 -8659
4205 -8659 -30980 -6368 27278 16621 41834 28408 47259 60592 31909 -5874 8208 -11113
4193 -11113 -60059 -46350 -41931 -57141 -35189 -7109 -47526 -138919 -138137 -87775 13154 49413
4181 49413 47385 63805 62643 57123 64798 45255 34680 19851 7507 -16202 -40332 -42673 -50399
4168 -50399 -73459 -69192 -56634 -60121 -70830 -64857 -30267 40279 -712 -44487 -27962 -13278
4156 -13278 -12251 -9035 10967 78848 79973 -21042 -49399 -22372 -23084 -30581 -21588 -14698 -14987 20161
4142 20161 42775 -25850 -79230 -83955 -34665 34552 70555 22402 4731 31999 51957 29013
4130 29013 3540 -5443 -28476 -49230 -38284 -37637 -46988 -84285 -26800 13741 15185 25805 45177
4117 45177 49694 38413 10701 8764 14143 35652 12202 16371 27597 27170 9380 -1667 1182
4104 1182 8831 37625 26909 -16416 -56045 -86859 -50503 -23657 -19707 -46244 -42313 -58934 -80309
4091 -80309 -93181 -57337 -14487 -13144 29214 29215 24074 45212 30532 12425 22482 45321 10656
4078 10656 -92182 -91064 -61275 -46069 -48912 -844 54090 25902 3191 -14433 -42075 -24557
4066 -24557 12270 -1143 5002 16118 -11191 -17512 -39642 -21056 33566 23587 36805 40159 -17338
4053 -17338 -37284 -24045 6002 15493 -22032 3230 18959 -21278 -79176 -81651 -45484 -18341
4041 -18341 17943 -32055 -40784 -43503 -84690 -47675 -56054 -113421 -109634 -69033 -69414 -32276 22251
4028 22251 -7140 -37264 -22971 -25569 -45779 -37194 -4272 -15170 -43624 -22327 19718 45426
4016 45426 26476 31098 32129 14939 3801 -32826 -58836 -64094 -57487 -22021 1933 38676 33628
4003 33628 -7860 -12551 40552 42030 -27767 -37750 -55039 -40115 -57061 -43225 -6104 15909
3991 15909 35601 69925 122016 118627 77951 56638 25456 -1 291 -31313 -22652 23649 68451
3978 68451 76420 63704 42169 40549 -3784 -25477 -75829 -112140 -87156 -51941 -15191 -3367
3966 -3367 29933 50377 66569 28844 17991 381 -36316 -45218 -20817 -64866 -55789 -39419
3954 -39419 -66715 -69945 -109814 -108288 -98189 -105027 -66741 -8501 14587 17153 24502 9005 10558
3941 10558 31499 77516 64935 28433 -19880 -35516 -179 -30827 -6093 11514 6796 42136
3929 42136 59165 46250 281 17618 56691 49383 12020 9512 46145 48033 45795 -984 -20870
3916 -20870 10371 60433 83656 41511 -43659 -6199 9999 26075 42518 87295 54542 34979
3904 34979 20780 -5565 45347 77803 63247 5240 -57420 -18584 56371 99873 109207 78967
3892 78967 64652 67159 41583 38648 61366 19764 35389 66926 54362 66258 35779 -12824
3880 -12824 -44200 -46981 -48000 -2061 14395 -28326 -8223 58314 76066 48065 29372 6965
3868 6965 1436 -23552 -37861 2064 34293 11775 -3937 -61478 -46325 -24410 -17149 -40252
3856 -40252 -34403 -38308 -43137 -72459 -43454 -26387 13303 27004 -2264 -52105 -63520 -38978
3844 -38978 -32166 3615 20943 -23828 -43314 -43582 -6704 -37916 -62989 -8983 -23320 -54820
3832 -54820 -41843 -16958 25278 26716 15175 13825 9082 -3151 -16512 -31578 -30564 -15807 -12514
3819 -12514 -7648 -30816 -48082 -44628 -33066 -33037 -8468 13481 1363 34435 31360 -12045 -33028
3806 -33028 -44093 -8947 7188 -23815 -67243 -54363 -47308 -52471 -93669 -80377 -70186 -46543
3794 -46543 -2281 -1857 1426 58589 81825 62931 21174 31675 58729 93752 83857 48958 -5245
3781 -5245 -45742 -29194 -26639 14550 27756 11882 -7380 -7717 13665 523 25081 -6319 3744
3768 3744 36464 9825 -20012 -45183 -28597 -4537 -16975 -15183 -4297 19649 85570 81506
3756 81506 43018 34541 5512 -3967 -31396 -12887 23837 53382 45154 55759 109314 74980
3744 74980 15184 -23977 -29654 10625 4134 -11586 13403 -3787 4185 8049 28404 21276 22865
3731 22865 45256 45856 61740 13272 -30911 -9981 -40894 -53154 -46668 -71659 -69052 -35431 -16279
3718 -16279 -28179 -34103 -23806 -24448 -20584 -12912 17077 54567 73754 41829 -13264 -56335 1117
3705 1117 36280 62215 106143 84008 45748 -16615 -46759 -18003 -8409 11340 39463 63755
3693 63755 66829 71471 70651 11714 -9302 40201 48383 53589 42219 62492 40864 29796 27574
3680 27574 36371 48177 21497 -17634 -29902 -34760 -55069 -58439 -78402 -71807 -37905 -50372 -15631
3667 -15631 7221 29953 39075 -18301 -59084 -71694 -8363 -11505 16953 32578 18204 -29735
3655 -29735 -31452 -25371 -26203 14553 23626 3479 -13027 48503 85520 56628 36318 27979 20092
3642 20092 -32250 -28584 39777 77262 58605 8793 -34337 -12965 51095 37773 -9034 11578
3630 11578 104331 132136 127098 73559 50830 100939 95448 62972 39788 12546 -2303 19163
3618 19163 40023 87443 34104 32519 34969 11656 30611 54425 14909 -62843 -62304 -52072 1079
3605 1079 24590 47909 64424 71447 72969 30636 -12919 -29558 -16521 -12830 24245 6495 9639
3592 9639 10937 -2663 -45119 19069 69030 27447 6322 41367 68334 62391 62535 81606 40256
3579 40256 -23059 -42875 -80469 -37415 -28482 -40339 -51515 -2071 58897 82915 73086 30540
3567 30540 -9024 -24876 -38663 -34623 -36828 -29156 -5157 -12291 -22054 13490 30161 -3524 -33853
3554 -33853 -17306 7689 11168 12588 12496 41004 44960 15568 -11725 -2780 21613 702 -11166
3541 -11166 -1096 14918 8016 -8266 -12296 11600 -31112 -68151 -63997 -66153 -11887 -10150 -14602
3528 -14602 -57843 -24797 29426 72532 59408 64395 33154 -13572 -65493 -60899 -49694 -26516
3516 -26516 -15581 16420 56076 15644 -60547 -74144 -27673 -2785 -3020 -24189 -27074 -53936
3504 -53936 -63009 -17449 7497 5277 -23395 -26945 22496 34127 67549 61489 33219 8623 -3058
3491 -3058 -35596 9249 49641 17931 -47184 -91154 -94994 -16586 -1501 -17461 -1273 18296
3479 18296 -20071 -34395 -13703 -73350 -94790 -94546 -104933 -63500 -31494 -28511 -46116 -61172
3467 -61172 -63545 -71776 -46939 -8427 -31579 -7152 33866 66949 45786 -6061 -35327 -45061
3455 -45061 -27136 -26832 -9125 41222 35735 -12901 -16377 35706 76047 78251 44706 23559 -3814
3442 -3814 17018 64274 23082 -25968 -42607 -69886 -64212 -10460 574 3578 4813 -9777 -7685
3429 -7685 -43542 -30233 19449 15683 6353 31124 49848 -29402 -6501 20021 -10941 537
3417 537 22158 43462 48006 812 -18052 -13003 -7603 -19066 -10390 -6170 14261 34888 22245
3404 22245 -13503 -22569 -28431 -14413 6144 -21965 -61768 -31548 14977 -32399 -59442 -84396
3392 -84396 -53223 -21326 -49620 -60817 13430 47397 12920 11585 33315 57167 19834 -31019
3380 -31019 -27250 19222 25086 24706 71664 43610 31739 48316 45282 38982 -4496 -7987 18144
3367 18144 58370 33780 4599 40761 46437 -10392 -7572 7062 12860 49934 70984 5691
3355 5691 -39170 -6161 38992 43512 45531 4445 7439 20246 31332 34828 -31739 -17888 -48651
3342 -48651 -28858 13227 24680 22478 1520 -9338 -17187 -26466 16167 27726 40986 44811 23688
3329 23688 5905 -11643 -59956 -69606 -60876 -65201 -52692 -31029 -66011 -72296 -70627 -6771 39643
3316 39643 30882 18956 66047 15864 -30827 15418 58366 33642 -24411 -25534 -3884 -17813
3304 -17813 -15123 10015 55321 22724 -14474 -31203 214 -24357 -20027 -40910 -77373 -68398
3292 -68398 -89716 -102099 -49614 -12790 -34560 -5690 5180 -12043 -19341 -6969 10943 15891
3280 15891 -26577 -53851 12976 60346 81710 50748 11903 -26513 -50807 -10322 38832 58619
3268 58619 64519 100649 111288 50012 11103 4689 -17294 16599 23438 45711 57984 75771
3256 75771 90219 38970 45313 44778 -16042 -58910 -90688 -51860 -18529 -38455 -7785 1359 40363
3243 40363 23888 25266 27188 -4526 -51500 -21773 -24614 -74884 -96931 7003 52086 20136
3231 20136 -6636 -1201 42892 55622 5113 -10406 7522 47988 70656 36653 11195 10227
3219 10227 24613 9988 -49569 -51818 -13268 23172 14441 17106 49708 20404 7525 14851 81663
3206 81663 68687 63367 47880 -2310 31271 49602 43199 39729 79380 72946 42163 -12520 -72363
3193 -72363 -61987 9611 8398 26429 76938 36183 6600 1733 -22667 -18790 -15213 -22287 -21389
3180 -21389 -22370 -39941 -29537 -41663 -43607 -15691 -33855 -75417 -58998 1573 41309 29102
3168 29102 20073 -26057 -62649 -13366 40679 58277 35889 23768 -33961 -26610 15021 -25370
3156 -25370 -54209 -25235 5374 18932 16319 -170 32199 17676 -18417 -21938 -20227 12779
3144 12779 36932 66694 59835 12891 -6014 -1115 -21606 -23047 10118 10905 -3299 18603 67040
3131 67040 96626 97617 51953 35863 47622 32577 -17219 -12589 4743 40618 46853 14946 8393
3118 8393 53296 45156 16576 32129 10651 -43339 -69127 -44495 15896 29689 31341 27963 -9172
3105 -9172 -34374 -49837 -16439 -18486 -37110 5184 16697 20201 26550 7810 -2119 -15353 -62460
3092 -62460 -105868 -76412 -40274 -14282 -5047 1977 -11448 17730 40826 -16938 -73478 -40739
3080 -40739 -6215 -19838 -69004 -54592 9461 7906 -2024 73 -29737 -30121 -34748 -27469 -30103
3067 -30103 7520 -5954 -60037 -50240 11010 30800 13679 12865 -8603 43408 81692 62824
3055 62824 36903 14492 -2027 23752 31068 8392 -2215 24264 36033 18950 -3041 7778
3043 7778 8233 4826 41206 64705 36848 31929 14293 -8011 -38812 -30682 -8990 -16949 -66389
3030 -66389 -15543 30850 57704 78702 50379 18877 24349 -1757 -16618 12188 11159 -25308
3018 -25308 2640 34431 30752 44017 -7742 -64357 -43241 10744 44138 51902 79168 68685
3006 68685 98781 101022 60354 50455 54033 55085 50910 11982 15943 38593 37016 52613 34770
2993 34770 4806 -509 -8910 -15665 -35019 -20260 28379 59011 60536 43642 8325 42806 68609
2980 68609 16290 8058 38795 29124 19343 17760 45485 50148 59065 30791 76483 68986 27447
2967 27447 -10587 -41226 -92932 -125675 -128316 -53441 -52629 -27867 26584 13328 -21196 -16777 39505
2954 39505 81987 41192 -31598 -38821 -44366 -28894 -49964 -41103 -30887 1899 10968 -33480 -44060
2941 -44060 1411 50695 79852 79775 13443 -17249 -13846 -4801 27885 28740 -5859 35747 26730
2928 26730 -32970 -37484 -51817 -80087 -82169 -38712 1885 23908 20288 13771 -12725 -43153 -36900
2915 -36900 -2389 -6938 -12208 -26367 -32562 -12674 4563 33322 48879 46633 9159 -4682 23225
2902 23225 4852 16802 -3261 7408 27557 -25906 -25900 -58283 -55275 -37639 13135 36623 38398
2889 38398 45109 15832 4287 3648 15839 46802 19908 43877 44856 49160 25920 2886 24617
2876 24617 -12315 -30663 -16839 440 13273 -1793 -27967 -25077 -13756 7732 28412 -2258
2864 -2258 -22314 -1933 -238 37217 42847 21656 50578 31597 13429 15953 -165 -56293 -85165
2851 -85165 -68669 -31708 -8829 -32619 -20908 11768 16147 33608 23380 -10210 18660 30081
2839 30081 10648 -3695 -15903 -20144 18835 8587 1889 8971 -45044 -17716 26454 4894
2827 4894 -11527 1364 -21871 -39700 485 -10780 -25305 -46248 -90490 -96083 -32220 9740
2815 9740 -17340 -54944 -86225 -99644 -40772 881 9098 2672 10907 -5414 3284 12953 9110
2802 9110 19933 -39316 -73426 -32217 33663 50109 48016 31933 54359 84296 70012 -9577
2790 -9577 13988 25109 25657 67858 1916 -35619 12129 19216 -12098 -8156 7843 -14302 -4897
2777 -4897 29879 68774 63234 49082 17551 -16374 1335 -32995 -20358 10883 61269 23521
2765 23521 892 39869 22829 -6751 4063 40666 41253 44064 37255 29888 50047 60583 46408
2752 46408 59259 99897 89284 63926 78319 108549 120699 84617 15012 -1444 29617 -1905
2740 -1905 -32657 -18234 -19740 -45716 -40035 -23050 -8888 -33494 -46546 -3397 70694 57119
2728 57119 -13535 -41079 -30064 -4581 33436 30969 2547 -12529 4563 56168 33092 956
2716 956 3156 -5294 -9989 -2951 -32031 -60959 -59431 -62306 -23894 -23184 -30604 -35470 -29995 41997
2702 41997 61864 52481 97247 91708 97038 106789 18536 -20457 -20025 29863 873 -5119 -29737
2689 -29737 -6467 331 7108 -39356 -110965 -99369 -42929 -6728 8879 69506 78083 95674
2677 95674 88949 85483 31443 -29881 -32989 21395 26162 6666 -34235 -47865 1233 33818 10056
2664 10056 -27850 -18098 -13233 -41163 -10047 25297 -18088 -50593 -54665 -44206 -50880 -39426 4003
2651 4003 -20085 -2406 41955 50957 20749 24133 11777 34736 90171 84276 69893 106503 97264
2638 97264 63436 62440 70380 25838 16146 15942 -15570 -45347 -476 42829 56189 68980 48571
2625 48571 27574 42069 59173 42774 18744 -18722 -19911 -12771 -12040 -28085 -93399 -134041 -127174
2612 -127174 -92531 -39313 37251 -1133 -9986 -20190 -30917 732 11832 48775 87272 98853
2600 98853 77289 55303 32063 26124 19958 33206 41398 -3337 -10978 -22767 -17532 3879 -8588
2587 -8588 14859 32205 12893 12680 25210 40973 47012 68167 51007 10707 39901 76925 77228
2574 77228 40863 4259 19390 13294 -19034 -9709 14062 -9452 -25104 -16993 -39868 -40988 -74637
2561 -74637 -56374 -36425 33267 37200 -20860 -1514 4106 -1148 -7208 35099 86976 112829 88029
2548 88029 55396 60192 17979 7028 -21805 -35683 -17659 -4767 -19305 -46091 -75405 -49649
2536 -49649 -62999 -82122 -20989 24436 40105 20529 29323 24139 23827 -16896 -41551 -32401 -46242
2523 -46242 -26090 12927 -31723 -40723 -32760 -34736 -42756 -33871 6787 26918 70334 55745 55286
2510 55286 31875 26435 -19592 -22858 -14536 -6059 24424 31357 15877 -3754 -21844 17669 29218
2497 29218 31565 -21669 -59751 -19167 28008 71762 87804 51566 36582 37910 -781 -1506 -85
2484 -85 -33058 -447 57460 34963 18394 -50320 -80765 -35980 -15687 -66910 -24038 -478
2472 -478 22644 5869 -1513 43285 102460 138152 95819 38191 28560 23047 -4137 -43065 -62659
2459 -62659 997 19934 17845 -15859 -14716 -6147 4344 7246 -49105 -92024 -30504 -15264 -9256
2446 -9256 36770 29885 19557 1742 21566 63051 62935 16946 20822 50313 49606 -9588 -69030
2433 -69030 -98760 -83188 -91666 -64260 -49375 -14459 -3969 -72776 -75433 -62792 -86855 -50521
2421 -50521 -53439 -34929 -24463 27890 40992 24697 31327 42619 41564 44455 14681 -21434 -44013
2408 -44013 -23536 -4439 36287 32635 6482 8884 38068 11319 21043 3691 -12044 -14693 -4199
2395 -4199 8429 35407 69619 63660 63993 83212 44459 11198 15825 27429 -3694 13538 32225
2382 32225 -4493 -13390 -51763 -64306 7396 24518 12841 -19331 -7399 2272 -731 16914
2370 16914 51134 63169 89356 75978 49109 74578 57015 35683 59656 70619 -1269 -1618
2358 -1618 6490 40243 115288 74846 51040 26004 18007 10142 -16124 35238 29307 14572 29106
2345 29106 58172 46798 64875 -12041 -60176 -29946 -34056 -6403 19796 -19200 -20304 -11867
2333 -11867 -438 6880 -32887 -33445 15511 22404 22379 11808 28474 37651 13363 16153 41253 45827
2319 45827 52485 44861 2887 -18800 -22410 -1611 -1239 -10088 -62219 -22084 -10064 -1592 35745
2306 35745 17295 -5998 -30711 -200 35353 26061 -26423 -4121 45564 71237 52908 30897
2294 30897 20886 30360 49838 21560 28430 41642 -12606 -83459 -73567 -26485 29949 45935
2282 45935 3563 -30018 -68678 -58965 15589 46767 42819 46503 25241 -4734 32178 46305
2270 46305 55400 45317 7446 34105 56919 27434 35843 14076 12944 14880 -13285 -39649 -69276
2257 -69276 -81669 -70017 -22680 12638 -9731 -46546 -26629 3215 10582 35750 28393 -42850
2245 -42850 -45265 -19074 -78366 -78220 -38158 38157 41539 -373 -56363 -84396 -32391 15985 22034
2232 22034 22201 9412 -12657 -50900 -51024 -63909 -38888 15855 21715 10197 -9482 -37928 15628
2219 15628 26122 -5040 -62807 -32263 -28093 -24062 1684 14937 25892 53412 84796 73426
2207 73426 49143 41353 28262 9753 11959 24261 191 -16364 -32500 -20011 36210 34872
2195 34872 -22484 -10291 30473 26298 30950 39829 -11088 -36055 -86938 -47726 12422 46403
2183 46403 27012 -8105 31259 16557 65891 74799 19591 -35867 -23821 -34124 -62765 -89175
$$ [...]
##END NTUPLES=NMR SPECTRUM
##END=
