##TITLE=Analysis number 326164
Compound Code spb 01278
Project Code adrs
Chemist Name aci
##JCAMPDX= 6.0         $$ Bruker NMR JCAMP-DX V2.0
##DATA TYPE= NMR SPECTRUM
##DATA CLASS= NTUPLES
##ORIGIN= Bruker BioSpin GmbH
##OWNER= nmr
$$ XWIN-NMR		Version 3.5
$$ Thu Jan 25 15:48:54 2007 GMT Standard Time (UT+0h)  MAYBRIDGE\nmr@NMR_250MHZ
##.OBSERVE FREQUENCY= 250.131544655141
##.OBSERVE NUCLEUS= ^1H
##.ACQUISITION MODE= SIMULTANEOUS (DQD)
##.ACQUISITION SCHEME= undefined
##.AVERAGES= 16
##.DIGITISER RES= 18
##SPECTROMETER/DATA SYSTEM= dpx250
##.PULSE SEQUENCE= zg30
##.SOLVENT NAME= CDCl3
##.SHIFT REFERENCE= (INTERNAL, CDCl3, 0, 16.522)
##AUDIT TRAIL= $$ (NUMBER, WHEN, WHO, WHERE, WHAT)
$$ ##TITLE= Audit trail, XWIN-NMR		Version 3.5
$$ ##JCAMPDX= 5.01
$$ ##ORIGIN= Bruker BioSpin GmbH
$$ ##OWNER= nmr
$$ C:\u/data/dgb/nmr/ADRS/2110/pdata/1/auditp.txt
$$ ##AUDIT TRAIL=  $$ (NUMBER, WHEN, WHO, WHERE, WHAT)
(   1,<2007-01-25 15:48:28.41 +000>,<MAYBRIDGE\nmr>,<NMR_250MHZ>,
      <created by zg, POWCHK disabled, PULCHK disabled
       configuration hash MD5:
       49 4B E0 1D 92 C2 6B 37 9F E6 65 BC 52 41 86 1D
       data hash MD5: 64K
       F2 C8 CB 7E EC D4 A4 47 8B E7 A9 B5 72 76 6C 65>)
(   2,<2007-01-25 15:48:43.37 +000>,<MAYBRIDGE\nmr>,<NMR_250MHZ>,
      <Start of raw data processing
       ef LB = 0.3 FT_mod = 6 PKNL = 1 SI = 32K 
       data hash MD5: 32K
       3E A9 4D CA 6C A7 69 F5 C9 51 96 06 44 DE 95 97>)
(   3,<2007-01-25 15:48:45.15 +000>,<MAYBRIDGE\nmr>,<NMR_250MHZ>,
      <apk 
       data hash MD5: 32K
       AC F3 F8 16 4A 43 35 E8 29 AE 4D A7 34 1F 09 F4>)
(   4,<2007-01-25 15:48:46.10 +000>,<MAYBRIDGE\nmr>,<NMR_250MHZ>,
      <abs ABSG = 5 
       data hash MD5: 32K
       A9 B5 29 59 D8 26 29 35 CD F0 0C 30 45 BC 68 91>)
$$ ##END=
$$ 
$$ hash MD5
$$ 8A 10 FA FA 26 C7 2F 9F C5 D4 C5 C0 6B 59 4E 0B
##$RELAX= 
##$RELAX= 
##$RELAX= 
##$RELAX= 
##$RELAX= 
##$RELAX= 
##$RELAX= 
$$ Bruker specific parameters
$$ --------------------------
##$DU= <C:\u>
##$EXPNO= 2110
##$NAME= <ADRS>
##$PROCNO= 1
##$TYPE= <nmr>
##$USER= <dgb>
##$AMP= (0..31)
100 100 100 100 100 100 100 100 100 100 100 100 100 100 100 100 100 100 
100 100 100 100 100 100 100 100 100 100 100 100 100 100 
##$AQSEQ= 0
##$AQ_mod= 3
##$AUNM= <au_zg>
##$AUTOPOS= <47 >
##$BF1= 250.13
##$BF2= 250.13
##$BF3= 250.13
##$BF4= 250.13
##$BF5= 500.13
##$BF6= 500.13
##$BF7= 500.13
##$BF8= 500.13
##$BYTORDA= 1
##$CFDGTYP= 0
##$CFRGTYP= 5
##$CHEMSTR= <none>
##$CNST= (0..31)
1 1 145 1 1 1 1 1 1 1 1 1 1 1 1 1 1 1 1 1 1 1 1 1 1 1 1 1 1 1 1 1 
##$CPDPRG= <>
##$CPDPRG1= <>
##$CPDPRG2= <>
##$CPDPRG3= <>
##$CPDPRG4= <mlev>
##$CPDPRG5= <mlev>
##$CPDPRG6= <mlev>
##$CPDPRG7= <mlev>
##$CPDPRG8= <mlev>
##$CPDPRGB= <>
##$CPDPRGT= <>
##$D= (0..31)
0 1 0 0 0 0 0 0 0 0.06 0 0 0 0 0 0 0.0002 0 0 0 0 0 0 0 0 0 0 0 0 0 0 
0 
##$DATE= 1169740107
##$DBL= (0..7)
120 120 120 120 120 120 120 120 
##$DBP= (0..7)
150 150 150 150 150 150 150 150 
##$DBP07= 0
##$DBPNAM0= <>
##$DBPNAM1= <>
##$DBPNAM2= <>
##$DBPNAM3= <>
$$ [...]
##$SUBNAM7= <"">
##$SUBNAM8= <"">
##$SUBNAM9= <"">
##$SW= 20.6930455092707
##$SWIBOX= (0..15)
0 0 3 0 0 0 0 0 0 0 0 0 0 0 0 0 
##$SW_h= 5175.983436853
##$TD= 65536
##$TD0= 1
##$TE= 294.16
##$TE2= 300
##$TE3= 300
##$TEG= 300
##$TL= (0..7)
0 120 120 120 120 120 120 120 
##$TP= (0..7)
150 150 150 150 150 150 150 150 
##$TP07= 0
##$TPNAME0= <>
##$TPNAME1= <>
##$TPNAME2= <>
##$TPNAME3= <>
##$TPNAME4= <>
##$TPNAME5= <>
##$TPNAME6= <>
##$TPNAME7= <>
##$TPOAL= (0..7)
0.5 0.5 0.5 0.5 0.5 0.5 0.5 0.5 
##$TPOFFS= (0..7)
0 0 0 0 0 0 0 0 
##$TUNHIN= 0
##$TUNHOUT= 0
##$TUNXOUT= 0
##$USERA1= <user>
##$USERA2= <user>
##$USERA3= <user>
##$USERA4= <user>
##$USERA5= <user>
##$V9= 5
##$VALIST= <valist>
##$VCLIST= <CCCCCCCCCCCCCCC>
##$VD= 0
##$VDLIST= <DDDDDDDDDDDDDDD>
##$VPLIST= <PPPPPPPPPPPPPPP>
##$VTLIST= <TTTTTTTTTTTTTTT>
##$WBST= 1024
##$WBSW= 4
##$XGAIN= (0..3)
0 0 0 0 
##$XL= 0
##$YL= 0
##$YMAX_a= 446409
##$YMIN_a= -389127
##$ZGOPTNS= <>
##$ZL1= 120
##$ZL2= 120
##$ZL3= 120
##$ZL4= 120
##$ABSF1= 16.522
##$ABSF2= -4.171173
##$ABSG= 5
##$ABSL= 3
##$ALPHA= 0
##$AQORDER= 0
##$ASSFAC= 0
##$ASSFACI= 0
##$ASSFACX= 0
##$ASSWID= 0
##$AUNMP= <proc_1d>
##$AZFE= 0.1
##$AZFW= 0.1
##$BCFW= 0
##$BC_mod= 0
##$BYTORDP= 0
##$COROFFS= 0
##$CY= 12.5
##$DATMOD= 1
##$DC= 0
##$DFILT= <>
##$DTYPP= 0
##$F1P= 14.0000005364418
##$F2P= -0.99999901652339
##$FCOR= 0.5
##$FTSIZE= 32768
##$FT_mod= 6
##$GAMMA= 0
##$GB= 0
##$INTBC= 1
##$INTSCL= 1
##$ISEN= 128
##$LB= 0.3
##$LEV0= 0
##$LPBIN= 0
##$MAXI= 10000
##$MC2= 0
##$MEAN= 0
##$ME_mod= 0
##$MI= 0
##$NCOEF= 0
##$NC_proc= -3
##$NLEV= 6
##$NOISF1= 0
##$NOISF2= 0
##$NSP= 0
##$NTH_PI= 0
##$NZP= 0
##$OFFSET= 16.522
##$PC= 1
##$PHC0= 76.78167
##$PHC1= 9.125111
##$PH_mod= 1
##$PKNL= yes
##$PPARMOD= 0
##$PSCAL= 4
##$PSIGN= 0
##$REVERSE= no
##$SF= 250.13
##$SI= 32768
##$SIGF1= 0
##$SIGF2= 0
##$SINO= 400
##$SIOLD= 32768
##$SREGLST= <1H.CDCl3>
##$SSB= 0
##$STSI= 32768
##$STSR= 0
##$SW_p= 5175.98343685301
##$SYMM= 0
##$S_DEV= 0
##$TDeff= 65536
##$TDoff= 0
##$TI= <Analysis number 999999
Compound Code 99
Book Reference 9
Project Code 9>
##$TILT= no
##$TM1= 0
##$TM2= 0
##$TOPLEV= 0
##$USERP1= <user>
##$USERP2= <user>
##$USERP3= <user>
##$USERP4= <user>
##$USERP5= <user>
##$WDW= 1
##$XDIM= 32768
##$YMAX_p= 363233724
##$YMIN_p= -397159
$$ End of Bruker specific parameters
$$ ---------------------------------
##NTUPLES= NMR SPECTRUM
##VAR_NAME=  FREQUENCY,     SPECTRUM/REAL,   SPECTRUM/IMAG
##SYMBOL=    X,             R,               I
##VAR_TYPE=  INDEPENDENT,   DEPENDENT,       DEPENDENT
##VAR_FORM=  AFFN,          ASDF,            ASDF
##VAR_DIM=   32768,         32768,           32768
##UNITS=     HZ,            ARBITRARY UNITS, ARBITRARY UNITS
##FACTOR=    0.157963299565203, 1,           1
##FIRST=     4132.6476996994, 0,             0
##LAST=      -1043.33573715361, 0,           0
##MIN=       -1043.33573715361, -397159,     0
##MAX=       4132.6476996994, 363233724,     0
$$ Real data points
##PAGE= N=1
##DATA TABLE= (X++(R..R)), XYDATA
$$ [...]
20561e003O339J588l679J162M22k814P99N336j934k408m256J718K827k705p09
$$ -5003 1336 2924 -755 407 829 -1985 -1186 4150 2216 -192 -4448 -2730 97 -2608 -3317
20546c317j600J2513m696j2587p764N795M547O201j688r9q298L96N531J819K943
$$ -3317 -4917 7596 2900 -9687 -17451 -11656 -7109 -908 -2596 -2695 -10993 -10597 -5066 -3247 -304
20531c04k371j644J441k721L845Q506j263k262p834p907m807J0350J307n92P832
$$ -304 -2675 -4319 -2878 -5599 -1754 6752 5489 3227 -4607 -12514 -17321 -6971 -5664 -6256 1576
20516A576M999k702p856l585j938j930J257P709J655N68p123O81K454p042K951
$$ 1576 6575 3873 -3983 -7568 -9506 -11436 -10179 -2470 -815 -247 -7370 -6689 -4235 -11277 -8326
20501h326Q806K2m296k523K150N603n462k420L716R12l410q72J780l188n86O404
$$ -8326 480 502 -3794 -6317 -4167 1436 -4026 -6446 -2730 -1818 -5228 -6100 -4320 -7508 -8094 -1690
20485a690K449m651k041K138j854m462n782L558J306O068M504J106k239l252N68
$$ -1690 759 -3892 -5933 -3795 -5649 -10111 -15893 -12335 -11029 -4961 -457 649 -1590 -4842 -4274
20470d274L922k886j21L172p71p827J631N253l75j646j419K592O463k494r743
$$ -4274 -352 -3238 -3359 -187 -958 -8785 -7154 -1901 -2276 -3922 -5341 -2749 3714 1220 -8523
20455h523J310P430j0711j158P298Q666M394L952r903N05l625m215L788M552k082
$$ -8523 -7213 217 -10494 -11652 -4354 4312 8706 12658 2755 3260 -365 -4580 -792 3760 1678
20440A678k548l164J221l630o702m917K239j633K274R007J596l269Q583k5l958
$$ 1678 -870 -4034 -2813 -6443 -13145 -18062 -15823 -17456 -15182 -6175 -4579 -7848 735 710 -3248
20425c248l490K240m856K64M300n620k462O324O212o902o66K816N339k810M648
$$ -3248 -6738 -4498 -9354 -9090 -4790 -10410 -12872 -6548 -336 -7238 -7904 -5088 251 -2559 2089
20410B089m273O41L559L411K192p619q648l4J444O128M674J242j513l307Q32K615
$$ 2089 -2184 -1543 2016 5427 7619 0 -8648 -8682 -7238 -1110 3564 4806 3293 -14 818 3433
20394C433k273k215m6n793j19J424K60k394P32M816L352K577j499k488j639m481
$$ 3433 1160 -1055 -1101 -6894 -7013 -5589 -5329 -7723 -6991 -2175 1177 3754 2255 -233 -1872 -6353
20378f353l078J611J815N237k347R55J187m104J402P962j310n780N094M194m431
$$ -6353 -9431 -7820 -6005 -768 -3115 -2160 -973 -5077 -3675 4287 2977 -2803 2291 6485 2054
20363B054l394n808L412K735K025K431n987o474k577R058J358j0303N934O258
$$ 2054 -1340 -7148 -3736 -1001 1024 3455 -2532 -9006 -11583 -2525 -1167 -11470 -5536 722
20349G22J419j495J730j814j854k428l366L234N215J30o57k212l543r69n079K55
$$ 722 2141 646 2376 562 -1292 -3720 -7086 -3852 1363 1493 836 -1376 -4919 -5888 -10967 -10712
20333a0712j782o176m351L773P159K42N729J990J351k853K212r44p77j911K689
$$ -10712 -12494 -18670 -23021 -19248 -12089 -11847 -6118 -4128 -2777 -5630 -3418 -4362 -5139 -7050 -4361
20318d361L234J144N71J586p736J128O035L508j57K541q420m656k444J624M271
$$ -4361 -1127 17 588 2174 -5562 -4434 1601 5109 4952 7493 -927 -5583 -8027 -6403 -2132
20303b132n2k624O577M690O628o103n257M71J384L217K841m897o320M023p789
$$ -2132 -2184 -4808 1769 6459 13087 6984 1727 2198 3582 6799 9640 4743 -1577 2446 -5343
20288e343r776M144P295j487r43N164k230N920k009m641q32J262J085P510N62
$$ -5343 -15119 -10975 -3680 -5167 -6110 -946 -3176 2744 735 -3906 -4738 -3476 -2391 5119 5681
20273E681j816J768l304n686j790N041J1938L673n690p263p79L779n70o102l493
$$ 5681 3865 5633 2329 -3357 -5147 -106 11832 15505 9815 2552 1773 5552 4982 -1120 -4613
20258d613k677m099K483K281J476J30j425M071J1389P017O5l428r938k183J648
$$ -4613 -7290 -11389 -8906 -6625 -5149 -5019 -6444 -2373 9016 16033 16098 12670 2732 549 2197
20243B197K063m135K262O566O57l30k690O395J016J791K193j427n717L640Q12
$$ 2197 4260 125 2387 8953 9610 9280 6590 12985 14001 15792 17985 16558 10841 14481 15293
20228A5293m081K61N411N835N155k808o5L737R710O242J058N240N639N899J9245
$$ 15293 11212 11473 16884 22719 27874 25066 25001 28738 38448 44690 45748 50988 56627 62526 81771
20213H1771K1964K1807M6612Q1830J27434K00142K61325R1796j43101p4963J05636
$$ 81771 103735 125542 172154 253984 381418 581560 842885 934681 791580 716617 822253
20202H22253K84143M36920J78300m39237m10466j60197P715J15150N8371k17228
$$ 822253 1106396 1543316 1721616 1282379 871913 711716 719431 834581 892952 675724
20192F75724k59401j57778p8631m0333k6984k3724j3163q372n219l135r559j7634
$$ 675724 416323 258545 179914 139581 112597 88873 75710 67338 62119 58984 49425 31791
20180C1791m479o905n286j178O109N646L064J698l396n147o043k456o41k151O09
$$ 31791 27312 20407 15121 13943 20052 25698 28762 30460 27064 21917 15874 13418 12777 10626 11235
20165A1235l230p96j783J208k683N545N921J424j900m286k736l123J293L860n927
$$ 11235 8005 7209 5426 6634 3951 9496 15417 16841 14941 10655 7919 4796 6089 9949 4022
20150D022n727k882O703L229l160l700l490J338N15J378M419K693l036o682O06
$$ 4022 -1705 -4587 2116 5345 2185 -1515 -5005 -3667 -3152 -1774 2645 5338 2302 -4380 -3774
20135c774R54j91Q6J743j414m47l456K848l486m327K58p525o702O749N502r18
$$ -3774 -2820 -3011 -2925 -1182 -2596 -3043 -6499 -3651 -7137 -11464 -11206 -18731 -25433 -18684 -13182 -14100
20119a4100P989Q719k458K367J810K410m069p635o118P71K95N232N748J270M384
$$ -14100 -6111 2608 150 2517 4327 6737 2668 -4967 -11085 -10314 -10019 -4787 961 2231 6615
20104F615P67m922o818J772J0081O036k968q874p997M402N186j216k598j504O20
$$ 6615 7382 2460 -4358 -2586 7495 13531 10563 1689 -6308 -1906 3280 2064 -534 -2038 -1418
20089a418J130k330m41L261K777l010q144J265O822L756J759l455J758l328m027
$$ -1418 -288 -2618 -3059 202 2979 -31 -8175 -6910 -88 3668 5427 1972 3730 402 -3625
20074c625n113J392L260L170Q16M024m241k243J319L388K740j0757K089L136J043
$$ -3625 -8738 -7346 -4086 -916 -100 3924 -317 -2560 -1241 2147 4887 -5870 -3781 -645 398
20059C98P279Q193k612q986j0477k129M348K386J544M573l543m273l093N765m172
$$ 398 7677 15870 13258 4272 -6205 -8334 -3986 -1600 -56 4517 974 -3299 -6392 -627 -4799
20044d799J805j463l490L823K37O1K562k461m506j492L999L81j039k738N7m465
$$ -4799 -2994 -4457 -7947 -4124 -3887 -3826 -1264 -3725 -8231 -9723 -5724 -5343 -6382 -9120 -9063 -13528
20028a3528J094R035K078J749Q89K12n248l676m238j480K131O453K305l438k29
$$ -13528 -12434 -3399 -1321 428 1317 1529 -3719 -7395 -11633 -13113 -10982 -4529 -2224 -5662 -5891
20013e891k099k698M411L787L738J30k407k371L711K420M753R071O686m595n00
$$ -5891 -7990 -10688 -6277 -2490 1248 1378 -1029 -3400 311 2731 7484 16555 23241 18646 18146
19998A8146J0056J3134Q50n383m413p766P64k44j1427p469l793m471k941J970
$$ 18146 28202 41336 42186 36803 32390 24624 25388 25144 13717 6248 2455 -2016 -4957 -2987
19984b987K175j242k591l124K770n10L203l089K703O983j895m744m162M217M799
$$ -2987 -812 -2054 -4645 -7769 -4999 -5509 -2306 -5395 -2692 4291 2396 -2348 -6510 -2293 2506
19969B506P04n907k345O89K527m155j087K797l102j0132k517N282J0764j98L785
$$ 2506 3210 -2697 -5042 -4353 -1826 -5981 -7068 -4271 -7373 -17505 -20022 -14740 -3976 -4174 -389
19954c89J47r060r222N18M598K953P85m719p97N429Q434J078j632K397J054Mn69
$$ -389 -242 -9302 -18524 -18006 -13408 -10455 -9670 -14389 -15186 -9757 -1323 -245 -1877 520 1574 1578 1009
19937A009p783J782P986k567m30L042o209k962j565K56n05L506L850l250M141
$$ 1009 -6774 -4992 2994 427 -3 3039 -3170 -6132 -7697 -7441 -7946 -4440 -590 -3840 301
19922C01P012N203J463n792l791j0068m711R552M872P25r504l815P23l72O123
$$ 301 7313 12516 13979 8187 4396 -5672 -10383 -831 4041 4766 -4738 -8553 -7830 -8202 -2079
19907b079P884J688k977Q47j223K483j204m640n637l405M592j331l404N202N616
$$ -2079 5805 7493 4516 5363 4140 6623 5419 779 -4858 -8263 -3671 -5002 -8406 -3204 2412
19892B412J623R4Q35K57O22m533m724M128l87r408p3L05J022J482O97P057l660
$$ 2412 4035 4129 4964 5221 5843 1310 -3414 714 327 -9081 -9154 -8849 -7827 -6345 -5648 1409 -2251
19875b251o35j917O772M981m300m233k122o667N707O52j0089l846O606O38n993
$$ -2251 -2886 -4803 1969 6950 2650 -1583 -3705 -10372 -4665 -4013 -14102 -17948 -11342 -10704 -16697
19860a6697L726N655m063J403M214J735k627q095N23M821L599L784L874j826K823
$$ -16697 -12971 -7316 -11379 -9976 -5762 -4027 -6654 -14749 -14226 -9405 -5806 -2022 1852 26 2849
19845B849P94j44j786q867k481k644k51P563Q761P574k729m494n767O27K848P32
$$ 2849 3643 3499 1713 -7154 -9635 -12279 -12530 -4967 3794 11368 8639 4145 -1622 -995 1853 2585
19829B585k828k710k219m419q022L300Q713m36L336L698J287j199m573n829p21
$$ 2585 -243 -2953 -5172 -9591 -17613 -14313 -5600 -6036 -2700 998 2285 1086 -3487 -9316 -10037
19814a0037K678K665p96K810M007n517J820N10p1O335k919r49j908m026N259k259
$$ -10037 -7359 -4694 -5490 -2680 1327 -4190 -2370 -1860 -1931 4404 1485 536 -1372 -5398 -139 -2398
19798b398l035p03P321L180m12L693L604j707o759J523R70O15o849J981Q700Q090
$$ -2398 -5433 -6136 1185 4365 3953 7646 11250 9543 2784 4307 5277 5892 -957 1024 9724 17814
19782A7814K310N724J2047M439p914r85j477l165p117q694m872l40J562l635n622
$$ 17814 20124 25848 37895 42334 34420 33435 31958 28793 21676 12982 8110 7770 9332 5697 75
19767G5l98K14k766j856l083M961J224m920j526J022j525k233P372j652J182N938
$$ 75 -323 -109 -2875 -4731 -7814 -2853 -1629 -6549 -8075 -7053 -8578 -10811 -3439 -5091 -3909 2029
19751B029O633J020m992k248j931l699J389J038Q32l511k237Q82J613M462q78
$$ 2029 8662 9682 4690 2442 511 -3188 -1799 -761 71 -3440 -5677 -4795 -3182 1280 402
19736D02o644m934K670L721j419m60N181J150n424m904O02r96j271P28J1094L148
$$ 402 -6242 -11176 -8506 -4785 -6204 -6664 -1483 -333 -5757 -10661 -10059 -11055 -12326 -11598 -504 2644
19720B644m581L875L034R5k767p10M575M26n936n488j71K537O470m926p49J773
$$ 2644 -1937 1938 4972 5067 2300 1590 6165 6591 655 -4833 -5004 -2467 4003 -923 -1672 101
19704A01Q18O48l692J83j252K264j78n014j040l11J626K503L653K048l916m620
$$ 101 919 1567 -2125 -1942 -3194 -930 -1108 -6122 -7162 -7473 -5847 -3344 309 2357 -1559 -6179
19688f179K290k283N69L538J302L432k186l586r00K004L309O11l779R46r51m176
$$ -6179 -3889 -6172 -5603 -2065 -763 2669 483 -3103 -4003 -1999 1310 1921 -1858 -912 -1863 -6039
19672f039J709J487j069j612k10m898J294j060q057K77M065L53J177n248R55J0569
$$ -6039 -4330 -2843 -3912 -5524 -5734 -10632 -9338 -10398 -18455 -18178 -14113 -13760 -12583 -17831 -16876 -6307
19656f307J573k701l284M941P202l268l504k753N472N089N26r79k912N954O618
$$ -6307 -4734 -7435 -10719 -5778 1424 -1844 -5348 -8101 -2629 2460 2986 2007 -905 5049 11667
19641A1667%o749n533l474M528j513J386K194l551l437m046O968O324M608j238
$$ 11667 11667 4918 -615 -4089 439 -1074 312 2506 -1045 -4482 -8528 -1560 4764 9372 8134
19626H134q65N522N311j760K916O795J0748J4332J4670J0798P863J7593J5043
$$ 8134 7269 12791 18102 16342 19258 26053 36801 51133 65803 76601 84464 102057 117100
19613A17100M529p733m650j1627o688Q631P023P410L908j111M418J366j0497j5030
$$ 117100 121629 113896 109246 97619 90931 99562 106585 113995 117903 116792 121210 122576 112079 97049
19599I7049p147j3779j5752j5068j6161o978o094o507R08M816l654o068j878k594
$$ 97049 89902 76123 60371 45303 29142 22164 16070 9563 10471 15287 11633 5565 3687 1093
19585A093j662o24J695O511N097m144n78L83m354K009k328L213j724o006J245
$$ 1093 -569 -1193 502 7013 12110 7966 7388 7771 3417 5426 3098 6311 4587 -1419 -174
19570a74J421L968O303o806l715K459j456j334J469K989Q072P222L401L072K812
$$ -174 1247 5215 11518 4712 997 3456 2000 666 2135 5124 13196 20418 23819 26891 29703
19555B9703l95l870K099N226k207l222M126N376q353r13K452j1501n923o475l943
$$ 29703 29308 25438 27537 32763 30556 27334 31460 36836 28483 27570 30022 18521 12598 6123 2180
19540B180J639j2K574J60M76n985p859k013L423N597k189L906p73o94j978j248
$$ 2180 3819 3807 6381 6541 7017 1032 -6827 -8840 -5417 180 -2009 1897 1124 430 -1548 -2796
19524b796j757p36L070q95k493k223M365N946m18O942K541J165m224N15M297j668
$$ -2796 -4553 -5289 -2219 -3114 -5607 -7830 -3465 2481 2063 9005 11546 12711 8487 9002 13299 11631
19508A1631l395N63Q183J0531O515P382o574p108O15m703j9189m723m376n917
$$ 11631 8236 8799 16982 27513 34028 41410 34836 27728 28343 23640 4451 -272 -4648 -10565
19494a0565Q49O121N082J156n168n640J218M599L631M373j856j380m452j928K054
$$ -10565 -9716 -3595 1487 2643 -2525 -8165 -6947 -2348 1283 5656 3800 2420 -2032 -3960 -1906
19479a906K98N198j902J710L815J236m892N157m189p69K710Q44M205L1o721o57
$$ -1906 -1608 3590 1688 3398 7213 8449 3557 8714 4525 3756 6466 7310 11515 11546 4825 4168
19463D168j259K185J435K270m824m776j425L501j211N104Q759K784J803j423J7810
$$ 4168 2909 5094 6529 8799 3975 -801 -2226 1275 64 5168 13927 16711 18514 17091 34901
19448C4901K2560R153J141n308K824J7561J8199j0303l1651j6478m752M796O693
$$ 34901 57461 66614 67755 62447 65271 82832 101031 90728 59077 42599 37847 42643 49336
19435D9336j1407j5890j2436m216K808j849n863J902L737m508p59K708L357J528
$$ 49336 37929 22039 9603 5387 8195 6346 483 2385 6122 1614 855 3563 6920 8448
19421H448j006l385m06K58n331l354J959r123k593P338N981O96J41j62L031J0655
$$ 8448 7442 4057 3651 3909 -1422 -4776 -2817 -11940 -14533 -7195 -1214 -518 -377 -539 2492 13147
19405A3147P067K468J047q846p196o751r954L333P399M009m991k451P237m117
$$ 13147 20214 22682 23729 14883 7687 936 -9018 -5685 1714 5723 732 -1719 5518 1401
19391A401k480K06J180K029m835K052L860L191l155j0015m467L341Q749M410j927
$$ 1401 -1079 -873 307 2336 -2499 -447 3413 6604 3449 -6566 -11033 -7692 1057 5467 3540
19376C540J2261J2779O036k17K872K262M761J847n56p32k297M8o637j1926m611
$$ 3540 15801 28580 34616 34399 37271 39533 44294 46141 45585 44853 42556 42604 35967 24041 19430
19361A9430O03N893K022l51m335j928N61k965m939k244R17Q134P080m780Q83m328
$$ 19430 20033 25926 27948 27597 23262 21334 21895 18930 13991 11747 12664 20798 27878 23098 23981 19653
19345A9653J794j531p711k982P146M26j0951M571O278q26k493k206M42m85m455
$$ 19653 21447 19916 12205 9223 16369 16795 5844 10415 16693 15867 13374 11168 11610 11125 6670
19330F670p835P236J069K522Q190Q069P468J2832O429j1867j4051m068l525j298
$$ 6670 -1165 6071 7140 9662 17852 25921 33389 46221 52650 40783 26732 22664 19139 17841
19316A7841J229P706R919M975j511p144l897j234j740o130k571l576o46O779N962
$$ 17841 19070 26776 36695 41670 40159 33015 29118 27884 26144 20014 17443 13867 13221 20000 25962
19301B5962M700j04k88j437L531K668j3626l612J034k538m963q27o65J0511N687
$$ 25962 30662 30558 30270 28833 32364 35032 21406 17794 18828 16290 11327 10500 9835 20346 26033
19286B6033q352k467j962L467M255j617o646m665m490q400Q78L615P622N977j572
$$ 26033 17681 15214 13252 16719 20974 19357 12711 8046 3556 -4844 -3966 -351 7271 13248 11676
19271A1676m797l713j787p359l158J645p63O025j980m141m829P283m076Q814R948
$$ 11676 6879 3166 1379 -5980 -9138 -7493 -8256 -2231 -4211 -8352 -13181 -5898 -9974 -1160 8788
19256H788m376M87O992L404M777R27K105J72N999M079q28K47p405p192j1510p763
$$ 8788 4412 4899 11891 15295 20072 20999 23104 23276 29275 33354 32526 32773 25368 18176 6666 -1097
19240a097P9P504M63j652l207k242P327L401m974o111K024J209J961J871q09o593
$$ -1097 -1018 6486 6949 5297 2090 -152 7175 10576 5602 -509 1515 2724 4685 6556 5747 -846
19224h46j758N946Q60J1002M881n872l945L402q4k209k53M394l435p415j280n19
$$ -846 -2604 3342 4202 15204 20085 14213 10268 13670 13586 11377 11124 15518 12083 4668 3388 2869
19208B869M687k179q215m698n689M644J3256j1117l864R477N986l112o887q79
$$ 2869 7556 5377 -2838 -7536 -13225 -8581 4675 -6442 -10306 -829 5157 2045 -4842 -5721
19194e721j8Q59M626N491J034K427L730o368n764K3J506N039L19m876j106n467
$$ -5721 -5739 -4880 -254 5237 6271 8698 12428 6060 296 319 1825 6864 7183 2307 1201 -4266
19178d266m140r168J418O516M270J702Q723j116j3258j880J2173L811L157L389
$$ -4266 -8406 -17574 -16156 -9640 -5370 -3668 5055 3939 -9319 -11199 974 4785 7942 11331
19164A1331M105m973o083o107k240M323j033p243Q273P846L026m254j087O831
$$ 11331 15436 10463 4380 -1727 -3967 356 -677 -7920 353 8199 11225 6971 5884 12715
19150A2715k609p932R51K296p69n354K613k838n696J203M604K618N319k976K152
$$ 12715 10106 2174 3125 5421 4652 -702 1911 -927 -6623 -5420 -816 1802 7121 4145 6297
19135F297N954j537k459l109L658j327J006K036o124j0277k186P829M725m072
$$ 6297 12251 10714 8255 5146 8804 7477 8483 10519 4395 -5882 -8068 -239 4486 414
19121D14m352p839L68L335R035N471P308J0317k745j4910O292K8032k717j4174
$$ 414 -3938 -11777 -11409 -8074 961 6432 13740 24057 21312 6402 12694 40726 38009 23835
19107B3835k0823n28J0412k092p421n330J678n096j620M589K655L879Q443L913
$$ 23835 3012 2484 12896 10804 3383 -1947 -269 -5365 -6985 -2396 259 4138 12581 16494
19093A6494J296l104n27J130j478m55n151j0562m085J109J1639J0266Q005j5078
$$ 16494 17790 14686 14159 15289 13811 13356 8205 -2357 -6442 -5333 6306 16572 24577 9499
19079I499o395L175N156k905k801Q236M427K950q968o919J317L390J72n403j061
$$ 9499 3104 6279 11435 8530 5729 13965 18392 21342 12374 5455 6772 10162 10334 4931 3870
19064C870N242n82m665J398O778m346n730J305L645M249j23j0565J433j836j310
$$ 3870 9112 8530 3865 5263 12041 7695 1965 3270 6915 11164 11041 476 1909 73 -1237
19049a237O987L846J182m731j707K123j488j928R051J924N68k416l089J306M239
$$ -1237 5750 9596 10778 6047 4340 6463 4975 3047 12098 14022 14590 12174 9085 10391 14630
19034A4630J005K739n361j297n734M178N417O11j208j1180n169n57O052L380l751
$$ 14630 15635 18374 13013 11716 5982 10160 15577 16188 14980 3800 -1369 -1926 4126 7506 3755
19019C755k576n694J1846M857j257R51r167M094L189M786J138J62O899j659J517
$$ 3755 1179 -4515 7331 12188 10931 11882 2715 6809 9998 14784 15922 16084 22983 21324 22841
19004B2841N982q487j223L978J426k84l844L658o808n640K11k946p495J088N547
$$ 22841 28823 20336 19113 23091 24517 24233 20389 24047 17239 11599 11810 8864 1369 2457 8004
18989H004o208R332j281k369l576l364o529N498N617J640J1374J862m542p602
$$ 8004 1796 11128 9847 7478 3902 538 -5991 -493 5124 6764 18138 20000 15458 7856
18975G856P675J408M03l832m580l246m100j423j434N903M294O36j681l067L020
$$ 7856 15531 16939 17342 13510 8930 5684 1584 161 -1273 4630 8924 9560 7879 4812 7832
18960G832q73Q19O624l02n604L151O357K44r227n764j722L492m106l928O382K836
$$ 7832 6959 7778 14402 14100 8496 11647 18004 18248 9021 3257 1535 5027 921 -3007 3375 6211
18944F211k378j132L191R75M80p25J005n064l922Q252Q498r31j671o918q425j0001
$$ 6211 3833 2701 5892 6867 7347 6622 7627 2563 -1359 6893 15391 14460 12789 5871 -2554 -12555
18928a2555K527J1272M205K203l009m160R4j237m610K308Q781M77o796l86K469
$$ -12555 -10028 1244 5449 7652 4643 483 577 -660 -5270 -2962 5819 6296 -500 -886 1583
18913A583K687M486K500q243j1469q56j489Q23L782j5M962j706L290L564L932
$$ 1583 4270 8756 11256 3013 -8456 -9312 -10801 -9978 -6196 -6211 -1249 -2955 335 3899 7831
18898G831M14M07J581N785L194k922l234o141l384o83n877J560Q544j49j754k680
$$ 7831 8245 8652 10233 16018 19212 16290 13056 6915 3531 2848 -3029 -1469 7075 6926 5172 2492
18882B492K86L807j387m117M078M724o30j1029l775N521M82m477K263N141L461
$$ 2492 2778 6585 5198 1081 5159 9883 9253 -1776 -5551 -30 452 -4025 -1762 3379 6840
18867F840n178J016R30j309J844j605p292k007L498J362M843J853k28m592P22
$$ 6840 1662 2678 3608 2299 4143 2538 -4754 -6761 -3263 -1901 2942 4795 4567 -25 697
18852F97M249n982l297O10M11k284L124K207K700L379q30l155M008L686j35J493
$$ 697 4946 -1036 -4333 -3723 -3312 -5596 -2472 -265 2435 5814 4984 1829 5837 9523 9388 10881
18836A0881m145k204j359l405R323M293m429j847J975M898o0q585l210O282K505
$$ 10881 6736 4532 3173 -232 9091 13384 8955 7108 9083 13981 13921 5336 2126 8408 10913
18821A0913l227L980p41k397j102j967n474q760K485L989m21N508M767J061n221
$$ 10913 7686 11666 10925 8528 7426 5459 -15 -8775 -6290 -2301 -2722 2786 7553 8614 3393
18806C393j370K003j593P87J213j188K249P006m954m838O012N172l817r676j922
$$ 3393 2023 4026 2433 3220 4433 3245 5494 12500 7546 2708 8720 13892 10075 399 -1523
18791a523L242M017m727l093m016J659M027N607J1982O249R32j2511l051J3266
$$ -1523 1719 5736 1009 -2084 -6100 -4441 -414 5193 17175 23424 24356 11845 8794 22060
18777B2060k457n811j6151Q94J0816M660j544J0108J6753K9785L2124J0082l4828
$$ 22060 19603 13792 -2359 -1465 9351 14011 12467 22575 39328 69113 101237 111319 76491
18764G6491k5817k1043j0036j937p633l615M616R871L970j611j0505n896k316
$$ 76491 50674 29631 19595 17658 10025 6410 11026 20897 24867 23256 12751 6855 4539
18751D539p681K409L462K281l353j22O142N716K38k932K566k122L657J4985J3468
$$ 4539 -3142 -733 2729 5010 1657 1535 7677 13393 13631 10699 13265 11143 14800 29785 43253
18736D3253K480j3201o861J1745m710q976q213l346O19l62q21J18J449j06J999
$$ 43253 45733 32532 25671 37416 32706 23730 15517 12171 12790 12428 11607 11725 13174 13068 15067
18721A5067k478m339k215k454P465N399m905k941O016J735k578J066k597K31L533
$$ 15067 12589 8250 6035 3581 11046 16445 11540 8599 14615 16350 13772 14838 12241 12472 16005
18706A6005k818k648R86P162p296m285P111L666Q60K36q945n550o07Q078K180
$$ 16005 13187 10539 11525 18687 11391 7106 14217 17883 18743 18979 10034 4484 3877 11955 14135
18691A4135o466n417O88Q231N12J52K217N949N54N621O149L34n558m829N341L141
$$ 14135 7669 2252 2940 11171 11683 11835 14052 20001 20555 26176 32325 32659 27101 22272 27613 30754
18675C0754p032r78L116n77m01P23j65m071l880L387P313j088o728m602K345O244
$$ 30754 23722 22744 25860 25283 24882 25605 25440 21369 17489 20876 28189 27101 20373 15771 18116 24360
18659B4360Q030n831l894P92K148k08j000o121n50R828m757j1046n772M940M640
$$ 24360 32390 26559 22665 23457 25605 25397 24397 18276 17726 27554 22797 11751 5979 10919 15559
18644A5559R71j878j135p48Q78J051m269j600O227K227K494M443k835j0540M059
$$ 15559 16530 14652 13517 12769 13647 14698 10429 8829 15056 17283 19777 24220 21385 10845 14904
18629A4904M150k492N548K876L663L928p434k854M976K602l277K442K468L318
$$ 14904 19054 16562 22110 24986 28649 32577 25143 22289 27265 29867 26590 29032 31500 34818
18615C4818K690q360r656R46M318j435n965K665M02k447o33l153K033K890K5m894
$$ 34818 37508 29148 19492 20438 24756 23321 17356 20021 20423 17976 17343 14190 16223 19113 19138 14244
18599A4244L527P838L690L273K616k832k364j166k845K107k442k887N299K055
$$ 14244 17771 25609 29299 32572 35188 32356 29992 28826 25981 28088 25646 22759 28058 30113
18585C0113J517J46Pk411J560j746q14N602P991k051j442K611P329N451k861J032
$$ 30113 31630 31776 31783 29372 30932 29186 28372 33974 41965 39914 38472 41083 48412 53863 51002 52034
18569E2034K350m281p811l009L727J403L136j945R88q37j872n395K357L029N62
$$ 52034 54384 50103 42292 39283 43010 44413 47549 45604 46592 45755 43883 38488 40845 43874 44436
18554D4436o057k963K487L736k227k771J735m495j482L869J63l952N067R382N157
$$ 44436 38379 35416 37903 41639 39412 36641 38376 33881 32399 36268 36431 32479 37546 46928 52085
18539E2085N037L893l370j965K165r265K854Q351R43J242K27J104M405K034m371
$$ 52085 57122 61015 57645 55680 57845 48580 51434 59785 60728 61970 62197 63301 67706 69740 65369
18524F5369q615L666k417p437q718M427o09m276R61M671o98k973L728k568m509
$$ 65369 56754 60420 58003 50566 41848 46275 45666 41390 42351 47022 46324 43351 47079 44511 40002
18509D0002j543m338L12m060l705o056J320L224L11L063J130K05N341q277l802
$$ 40002 38459 34121 34433 30373 26668 20612 21932 25156 25467 28530 29660 29865 35206 26929 23127
18494B3127K230k592N085P83n434L095LL58L154J643l0M525m26J643O7k309p39
$$ 23127 25357 22765 27850 28633 23199 26294 26297 26655 29809 31452 31422 35947 35521 37164 37231 34922 34183
18477C4183K100l241q160l97L294N717O624n85n183n643M424P282P161M294k645
$$ 34183 36283 33042 24882 24485 27779 33496 40120 39535 34352 28709 33133 40415 47576 51870 49225
18462D9225p345K73J431M46j398L033L840k224k685o001N320P644Q821l957r961
$$ 49225 41880 42153 43584 44030 42632 45665 49505 47281 44596 38595 43915 51559 60380 56423 46462
18447D6462L006M15o336N721O325M130j759k084p521o027J0010J2854M561k289
$$ 46462 49468 49883 43547 49268 55593 59723 57964 55880 48359 42332 52342 65196 69757 67468
18433F7468l065M179j825l439N46k09m762m055M444K463N900n862J233M428L385
$$ 67468 64403 68582 66757 63318 63864 63655 58893 54838 59282 61745 67645 61783 63016 67444 70829
18418G0829K091N042K308O049N277j553Q913L925j0537q932n910L860L885k442
$$ 70829 72920 77962 80270 86319 91596 90043 98956 102881 92344 83412 77502 81362 85247 82805
18404H2805n292j3437j0336j2991j710O525k175j985M928K15l6L600q20N625k757
$$ 82805 77513 64076 53740 40749 39039 45564 43389 41404 46332 46547 46511 50111 49291 54916 52159
18389E2159n030M526p18L086N957Q861l583q205K76O17L091L38l795m889L115
$$ 52159 47129 51655 50937 54023 59980 68841 65258 57053 57329 57946 61037 61375 57580 52691 55806
18374E5806O487N844M070o399p84l0P37O177R131J2152J0510N701m411J797J281
$$ 55806 62293 68137 72207 65808 65024 64994 65731 71908 81039 93191 103701 109402 104991 106788 108069
18359A08069j5086j8671j0432k767k720O378L518p493m041m727n139M90n116L108
$$ 108069 92983 74312 63880 61113 58393 64771 68289 60796 56755 52028 46889 47379 42263 45371
18345D5371N292N290L597L257k040k841o7O174j398j782k931R54L609n451J486
$$ 45371 50663 55953 59550 62807 60767 57926 57859 64033 62635 60853 57922 58876 62485 57034 58520
18330E8520q69J751j487r84J582N391M867K069J328K157K495M230Q940Q906n093
$$ 58520 57651 59402 57915 56931 58513 63904 68771 70840 72168 74325 76820 81050 89990 98896 93803
18315I3803m491l506j724o36K668Q515q331p208j392K378m88J394k38r50K166
$$ 93803 89312 85806 84082 83446 86114 94629 86298 79090 77698 80076 79588 80982 80744 79794 81960
18300H1960L82m27o393M503Q08j502J523M609k426P40K217K493Q818J913N734
$$ 81960 82342 81915 75522 80025 80833 79331 80854 85463 83037 83777 85994 88487 97305 99218 104952
18285A04952N64n361j47N444M539M557M874J05k718p29P522L930k938j334k167
$$ 104952 105516 100155 100008 105452 109991 114548 119422 119527 116809 116080 123602 127532 124594 123260 121093
18270A21093N133J0670Q861l901M328M934L279k764j512K236J0772l230L814P093
$$ 121093 126226 136896 145757 141856 146184 151118 154397 151633 150121 152357 163129 159899 163713 170806
18256A70806K857M253J374J0558J1005k349N497J8351O563K920K190M870M40K889
$$ 170806 173663 177916 179290 189848 200853 198504 204001 222352 228915 231835 234025 238895 239335 242224
18242B42224r874p931j28j351k661P337l35N08J6183M5594L5765m2645n0813k4273
$$ 242224 232350 224419 224291 222940 220279 227616 227281 227789 243972 289566 325331 282686 231873 207600
18228B07600o721p609n310N217R487O396N574N043Q933j153J744K215K302R751
$$ 207600 200879 193270 187960 193177 202664 209060 214634 219677 228610 227457 229201 231416 233718 243469
18214B43469Q283Q401P73l391m579J317J547m24l820m531L782o31l807J3322M242
$$ 243469 251752 260153 260926 257535 252956 254273 255820 255396 251576 247045 250827 250196 246389 259711 263953
18199B63953o030k649o773K664J4278P534M946K415j220N1k168m336p349l095
$$ 263953 257923 255274 248501 251165 265443 272977 277923 280338 279118 279169 277001 272665 265316 262221
18185B62221R19J606k535P571J801L720j104N273N072K433q329n274K044O614
$$ 262221 263140 264746 262211 269782 271583 275303 274199 279472 284544 286977 278648 273374 275418 282032
18171B82032O629n341O095L922O162R372K0135J5788J9678R497M878O370m448
$$ 282032 288661 283320 289415 293337 299499 308871 329006 344794 364472 373969 378847 385217 380769
18158C80769l891r588m019J1339J7974J6205J1598P101J102J0930J5458P004M639
$$ 380769 376878 367290 363271 374610 392584 408789 420387 427488 428590 439520 454978 461982 466621
18145D66621M224o484r640r259k320j301L506J0886R938K704m005j740j166K987
$$ 466621 470845 464361 454721 445462 443142 441841 445347 456233 466171 468875 464870 463130 461964 464951
18131D64951o420q437n226o126O948J6201K7202K8810K7956K3625K3110L2364
$$ 464951 458531 450094 444868 438742 445690 461891 489093 517903 545859 569484 592594 624958
18119F24958N2230Q3578J16305J49105K13634L13645M92847P79680J287621K144814
$$ 624958 677188 760766 877071 1026176 1239810 1553455 2046302 2825982 4113603 6258417
18109F258417L489047N416174L718835m782594o072589l198714j554815q54881
$$ 6258417 9747464 15163638 18882473 14099879 8027290 4828576 3273761 2418880
18101B418880n29292l58896k52995j78211j33335j00487p7382p4847n5389l2707
$$ 2418880 1889588 1530692 1277697 1099486 966151 865664 788282 713435 658046 625339
18091F25339j8873j9598j2888j9729k2643j1377j4130j7924o774l909j4791j3412
$$ 625339 606466 586868 573980 554251 531608 520231 506101 488177 481403 477494 462703 449291
18079D49291j8920j2997N466J2041R128J0816R221j4337l9533m4099k8994j8409
$$ 449291 430371 417374 422840 434881 444009 454825 464046 449709 410176 366077 337083 318674
18067C18674j2638q954j321l408q895j706L388l975K540K0498J5637J5295K1022
$$ 318674 306036 297082 295761 292353 283458 281752 285140 281165 283705 304203 319840 335135 356157
18054C56157K0703K8158K6494L2474N9986P0674O7683N5025L0242M929l3641m9662
$$ 356157 376860 405018 431512 463986 523972 594646 662329 717354 747596 752525 718884 669222
18042F69222m1622l4741j1181Q191Q020m403r688l104j804n364j2829j8495k4350
$$ 669222 627600 592859 581678 589869 597889 593486 583798 580694 578890 573526 560697 542202 517852
18029E17852k6147l9559l3104k3874j4047j0275j4560r433j0940j5832j4234k0894
$$ 517852 491705 452146 419042 395168 381121 370846 356286 346853 335913 320081 305847 284953
18017B84953j7386j0348k996K118J5P558R888J1044J0188Q954O125J920K920N43
$$ 284953 267567 257219 254223 256341 256356 263914 273802 284846 295034 303988 310113 312033 314953 315496
18003C15496R202J1571J2137K1667Q523L366l014r800r072J43j415j0787j4419
$$ 315496 324698 336269 348406 370073 378596 381962 378948 369148 360076 360219 358804 348017 333598
17990C33598j542N88j2143j8763r574n522j891N870J932K829m901k6358j9491
$$ 333598 332056 332644 320501 301738 292164 286642 284751 290621 292553 295382 290481 264123 244632
17977B44632j2594j0280q031j2306r168o560l647n2J868K327q069q027L71Q477
$$ 244632 232038 221758 213727 201421 192253 185693 182046 181994 183862 186189 178120 170093 170464 178941
17963A78941j10r297j5504J009m362K57l883l645j0814K53j391j775k427Q67l723
$$ 178941 178831 169534 154030 155039 150677 150934 147051 143406 132592 132845 131454 129679 127252 128119 124396
17948A24396r349m272J34M31m713l366R096J4269M593l898m311L656M995M969
$$ 124396 115047 110775 110909 111340 106627 103261 112357 126626 131219 127321 123010 126666 131661 136630
17934A36630J608o483o193k142L924j572p731N904J459N088J265n712m381l35
$$ 136630 138238 131755 125562 123420 127344 125772 118041 123945 125404 130492 131757 126045 121664 121329
17920A21329J45k126L036m229l749L020M776j767r216j4317q699p195m361O031
$$ 121329 121474 119348 122384 118155 114406 117426 122202 120435 111219 96902 88203 81008 76647 82678
17906H2678N530n187q322j920k285j871J0162K524J281O764K764L038M710n033
$$ 82678 88208 83021 74699 72779 70494 68623 78785 81309 82590 89354 92118 95156 99866 94833
17892I4833M58r39k800m878n154N739L016J31m133p236o300J725N337L229O548
$$ 94833 95291 94352 91552 86674 81520 87259 90275 90406 86273 79037 72737 74462 79799 83028 89576
17877H9576L625K796m408L040J746k264k391m823p388k562K528k431l486O062
$$ 89576 93201 95997 91589 94629 96375 94111 91720 86897 79509 76947 79475 77044 73558 79620
17863G9620m36k462M590L501K292L051R809J3264J2688K2454J9327J6904M5986
$$ 79620 79184 76722 81312 84813 87105 90156 99965 113229 125917 148371 167698 184602 230588
17850B30588O4172R1129J29683R9969J7967M8515J46694J35170q0923j75087q8021
$$ 230588 294760 385889 515572 615541 633508 682023 828717 963887 882964 707877 619856
17839F19856j4349o2093j42380j16932n9680l9392k7355j5217q731q133q383j246
$$ 619856 605507 543414 401034 284102 224422 185030 157675 142458 133727 125594 117211 115965
17827A15965k009n215n650m650l577l885l96k194j141N231R74k157k384N343k47
$$ 115965 113956 108741 103091 98441 94864 90979 90583 88389 87248 92479 93453 91296 88912 94255 94008
17812I4008n207l821l937l827o114l187M596J542j234J86L186O410o363l257P064
$$ 94008 88801 84980 81043 77216 71102 67915 72511 74053 72819 73005 76191 82601 76238 72981 80045
17797H0045M32r16k627o423n11L894J782O143M879k924j2117m681k250L779k425
$$ 80045 80477 79561 76934 70511 70000 73894 75676 81819 86698 83774 71657 66976 64726 68505 66080
17782F6080p253l006L985L464K934O985N457J396j3807l399J981J0441K424p023
$$ 66080 58827 55821 59806 63270 66204 73189 78646 80042 66235 62836 64817 75258 77682 70659
17768G0659o751l220l5k947P16K531k77J366m349m668J246m605m774k306L648
$$ 70659 63908 60688 60653 57706 58422 60953 60676 62042 57693 53025 54271 49666 44892 42586 46234
17753D6234O687l348p83O134Q480p036j0275K273m60P45k832j166m551j934o450
$$ 46234 52921 49573 48790 54924 63404 56368 46093 48366 47906 48651 45819 44653 40102 38168 31718
17738C1718M858Q442M504l670m421l969j801o062l785M524l069n443j970J230
$$ 31718 36576 45018 49522 45852 41431 37462 35661 29599 25814 30338 27269 21826 19856 21086
17724B1086K543J237R158P834N516L786P907J469m0j456J0253j941j5801j626
$$ 21086 23629 24866 34024 41858 47374 51160 59067 60536 60496 59040 69293 67352 51551 49925
17710D9925O048k948p860k514R59j23K53j4056J50J528N936o32m199J994P749
$$ 49925 55973 53025 45165 42651 43610 43487 43740 29684 29834 31362 37298 36666 32467 34461 42210
17695D2210J973k381j257l010n144j191o422l957O02J0124L969j824j460l543
$$ 42210 44183 41802 40545 37535 32391 31200 24778 20821 21423 31547 35516 33692 32232 28689
17681B8689L430M709j563O94k293r164J34L933N600O613Q190j321p230k22J037
$$ 28689 32119 36828 35265 35959 33666 24502 24636 28569 34169 40782 48972 47651 40421 40199 41236
17666D1236l971j0195J113P55L106P658J429j528r178k843O140K15o405k003K121
$$ 41236 37265 27070 28183 28938 32044 39702 41131 39603 30425 27582 33722 33937 27532 25529 27650
17651B7650n072N2P439K160l955j915K719K094m837O482N699K95o78o392l630
$$ 27650 22578 22630 30069 32229 28274 26359 29078 31172 26335 32817 38516 38811 38133 31741 28111
17636B8111j789M107P44k598M44L719K871o63m834l085K421q26m382J293J0158
$$ 28111 26322 30429 31173 28575 29019 32738 35609 34946 30112 27027 29448 28622 24240 25533 35691
17621C5691L48k31J98k048L181M552P02J15L31m440l437k323k773o311k328N705
$$ 35691 36039 35808 36006 33958 37139 41691 42393 42508 42839 38399 34962 32639 29866 23555 21227 26932
17605B6932M260L449J651j109m644N051j615j624M568N8k760m546p4n484M317
$$ 26932 31192 34641 36292 35183 30539 35590 33975 32351 36919 36977 34217 29671 29597 24113 28430
17590B8430J2447J311n09P74l384j04K534q24k190R487l767o514m243o486l062
$$ 28430 40877 42188 41679 42453 39069 38965 41499 40675 38485 47972 44205 37691 33448 26962 23900
17575B3900n261Q128J3639J2555K36m024k588j207k67q942Q243J8080o32p974
$$ 23900 18639 26767 40406 52961 53197 49173 46585 45378 45111 36169 44412 62492 61860 53886
17561E3886P547K6177J2453l566p739M424M712j1165p232r457n010n365n64m359
$$ 53886 61433 87610 100063 96497 88758 93182 97894 86729 79497 70040 65030 59665 59101 54742
17547E4742j1105k892K646M200J445J180q451m753N520j634J455n091l996N126
$$ 54742 43637 40745 43391 47591 49036 50216 41765 37012 42532 40898 42353 37262 33266 38392
17533C8392M181Q0k054L772j681n487k087q528L022Q227m317O17J685K756n036
$$ 38392 42573 42653 40599 44371 42690 37203 35116 26588 29610 37837 33520 34137 35822 38578 33542
17518C3542q02P928O197J1817O440L419J1940P746Q639P395O711M570J350j4433
$$ 33542 32740 40668 46865 58682 65122 68541 80481 88227 96866 104261 110972 115542 116892 102459
17504A02459k117J5710o167k1004j9593j1389L395O48j0476p465m295l000J123
$$ 102459 100342 116052 109885 88881 69288 57899 61294 61942 51466 44001 39706 36706 37829
17491C7829K850L815K425K041K890k715J299K796N280O32o646o467k494j499o177
$$ 37829 40679 44494 46919 48960 51850 49135 50434 53230 58510 59142 52496 46029 43535 42036 35859
17476C5859M904M354L014m458L454M657L466K440l69p06n141O9O943m470k827
$$ 35859 40763 45117 48131 43673 47127 51784 55250 57690 57321 56615 51474 51543 58486 54016 51189
17461E1189j640j772j393q423n13J908L46l034l606j772K6K703j170m968m121
$$ 51189 49549 47777 46384 37961 37448 39356 39702 36668 33062 31290 31316 34019 32849 27881 23760
17446B3760J042J0327J527R590J5539K0923K5669j1863l0945j8231q721M46l728
$$ 23760 24802 35129 36656 46246 61785 82708 108377 96514 65569 47338 38617 39063 35335
17433C5335J908J1403N498O552P311L304J016K792m93m32K522m951p921l992r440
$$ 35335 37243 48646 54144 60696 68007 71311 72327 75119 74626 74194 76716 71765 63844 59852 50412
17418E0412j1967r276j942K718m208k320N918K576P806q380r013L356J7640K1687
$$ 50412 38445 29169 27227 29945 25737 23417 29335 31911 39717 31337 22324 25680 43320 65007
17404F5007n828j1922O843J9220J1943L290j0758o845j1248p402J915P35o255
$$ 65007 59179 47257 54100 73320 85263 88553 77795 70950 59702 52300 54215 54950 48695
17391D8695p058L916p48r715m930j5963l0486l3952r668R664k9667n9857q156
$$ 48695 41637 45553 44805 35090 30160 14197 -16289 -50241 -59909 -50245 -79912 -139769 -147925
17378a47925O5979N4220o465n36L7633N3027L5110J6062M031l40l373K075r31
$$ -147925 -81946 -27726 -34191 -34727 2906 55933 91043 107105 111136 110796 107423 109498 108567
17365A08567M114L353M605L592M943J924Q056M031k385M743R131J1124J0731N948
$$ 108567 112681 116034 120639 124231 129174 131098 139154 143185 140800 145543 154674 165798 176529 182477
17351A82477n542o913R190M618p631m645k063l142L711J383m298K143P014J0811
$$ 182477 176935 170022 179212 183830 176199 171554 169491 166349 170060 171443 167145 169288 176302 187113
17337A87113M107J459P456J4669J2220P729J0027o16k36K973J750l257J769J657
$$ 187113 191220 192679 200135 214804 227024 234753 244780 244164 243928 246901 248651 245394 247163 248820
17323B48820M892P941Q251J8067L3901K1183P190K7381M3352L8344o530j1369
$$ 248820 253712 261653 269904 287971 321872 343055 350245 377626 420978 459322 452792 441423
17311D41423L219J5423J4279L976M184K0688N0154N3208M0301K5867L9738P0839
$$ 441423 444642 460065 474344 478320 482504 503192 553346 606554 646855 672722 712460 783299
17299G83299O9127k8297m8162j3853M136j0080j8862J162M0642N6601M7537O6401
$$ 783299 852426 824129 775967 762114 766250 756170 737308 738470 779112 835713 883250 949651
17287I49651J20479J97091J71676Q2352J22920K44217K64495K4759m3631L9134
$$ 949651 1070130 1267221 1438897 1521249 1644169 1888386 2152881 2177640 2134009 2173143
17277B173143J15238Q4109M4386R0758J56840K32191L33127M67794O01159O14827
$$ 2173143 2288381 2372490 2416876 2507634 2664474 2896665 3229792 3697586 4298745 4913572
17267D913572O80565R50234J377786J744095K273305L539222N697345R038221
$$ 4913572 5594137 6544371 7922157 9666252 11939557 15478779 21176124 30214345
17259C0214345J4146059K1736379K6128673J0206629j97390J5309462L3798553
$$ 30214345 44360404 66096783 92225456 102432085 102234695 117544157 151342710
17252A51342710J4407237l4928539k9987014o731958l94201j9468886k6563930
$$ 151342710 165749947 130821408 100834394 94102436 93708235 74239349 47675419
17245D7675419j6923971r374641n557060l626659k411931j584949j109108j042080
$$ 47675419 30751448 21376807 15819747 12193088 9781157 8196208 7087100 6045020
17237F045020j009271p24297m72467m06224m78963m27884l10679k14036j60671
$$ 6045020 5035749 4311452 3838985 3432761 2953798 2525914 2215235 2001199 1840528
17228A840528j17444p7714j2117N4236L1613l8197K2524J04013P2236j83333k17561
$$ 1840528 1723084 1645370 1633253 1687489 1719102 1680905 1703429 1807442 1879678 1696345 1478784
17217A478784j18336j01007j63822j92880j43623r9293p1761n4486l8768k8095
$$ 1478784 1360448 1259441 1095619 902739 759116 659823 588062 533576 494808 466713
17207D66713k2433k1242k3511l2186k8818k5614k0232j2329j7791j1810j9203
$$ 466713 444280 423038 399527 367341 338523 312909 292677 280348 262557 250747 231544
17196B31544j5627q497o604o81m840k58O47L949K41o240j2274l954j302q378j1516
$$ 231544 215917 207420 200816 200135 195295 195037 195684 199633 199874 193634 181360 177406 176104 167726 156210
17181A56210q47l418k702j0491m293j224J586r370j9487j1890k86j775o204o230
$$ 156210 155363 151945 149243 138752 134459 133235 134821 125451 105964 94074 93788 92013 85809 79579
17167G9579l395R335k280o930k94J863J56l586K224j25j3340o39p466L947j071
$$ 79579 76184 85519 83239 76309 76015 77878 78034 74448 76672 76547 63207 62568 55102 59049 57978
17152E7978r868K118J3990J0607J4432J7047N184l005J0798L0646K8393Q86l1521
$$ 57978 48110 50228 64218 74825 89257 106304 111488 108483 119281 149927 178320 179206 147685
17139A47685k5864j1974l94J0483j0618j1317N47J8962M6315O2850K3137P275
$$ 147685 121821 109847 109453 119936 109318 98001 98548 117510 163825 226675 249812 257087
17127B57087L9755Q4337K7169o8063n5766j1058J0499l7550n8044l5633j6606
$$ 257087 296842 381179 408348 340285 284519 273461 283960 246410 188366 152733 136127
17116A36127j0330j0636j5508j0321r893r372k56N090l086p895j0668p468L991
$$ 136127 125797 115161 99653 89332 79439 70067 69811 74901 71815 63920 53252 45784 49775
17103D9775Q910L764k0233o464K0675K5691N750j1697p042M976K284m05l076j1580
$$ 49775 58685 62449 42216 35752 56427 82118 87868 76171 69129 74105 76389 75984 72908 61328
17089F1328j3518l909K351m037m465o080o529o621m805P71m661r161o10J0257
$$ 61328 47810 43901 46252 42215 37750 31670 25141 18520 13715 14486 9825 664 54 10311
17075A0311M903j516O062R779Q754R494L162J457K826M369Q3l960o948j521r815
$$ 10311 15214 13698 19760 29539 38293 47787 50949 52406 55232 59601 59684 55724 48776 47255 37440
17060C7440m036P62J15J837K419n74k500l608o294P255L043k668N411l818q143
$$ 37440 33404 34166 34281 36118 38537 37963 35463 31855 25561 32816 35859 33191 38602 34784 26641
17045B6641n932J78L961K616n629j0625j3101p686M733R036J0383l43j460N240
$$ 26641 20709 20887 24848 27464 21835 11210 -1891 -9577 -4844 4192 14575 14232 12772 18012
17031A8012k172k983k776j355J36L457j857l908M213m961j0193J557J030j388
$$ 18012 15840 12857 10081 8726 8862 12319 10462 6554 10767 5806 -4387 -2830 -1800 -3188
17017c188j31R079m602K534J0155j144l532k301p42K629M851R165L4N27K665J139
$$ -3188 -3319 5760 1158 3692 13847 12703 9171 6870 6128 8757 13608 22773 22807 23334 25999 27138
17001B7138l171K241P965P422j013o107o562J386k895n694m436J086N849Q013
$$ 27138 23967 26208 34173 41595 40582 34475 27913 29299 26404 20710 16274 17360 23209 31222
16987C1222o263n916K793m512m437l024n999q60J558L269l804l822j439l8L367
$$ 31222 24959 19043 21836 17324 12887 9863 3864 3004 4562 7831 4027 205 -1234 -1272 2095
16972B095m167p480l246m40L162k53j045o422m208R880P728O65M96q691p445M96
$$ 2095 -2072 -9552 -12798 -13238 -10076 -10329 -11374 -17796 -22004 -12124 -4396 -3731 -3235 -11926 -19371 -18875
16956a8875n055l978n22k015j1276q155r139n034L649M432q370P85K1855J7178
$$ -18875 -23930 -27908 -28430 -30445 -41721 -49876 -59015 -64049 -60400 -55968 -64338 -63553 -41698 -24520
16942b4520N821o458J2205J0917O273O700K000R842m424r135J698J601m142K349
$$ -24520 -18699 -25157 -12952 -2035 4238 10938 12938 22780 18356 9221 10919 12520 8378 10727
16928A0727N643r49J323l023p150j2902k173J0556M331k053m147J227j277k326
$$ 10727 16370 15421 16744 13721 6571 -6331 -8504 2052 6383 4330 183 1410 133 -2193
16914b193K810k21P78K31l409l653O58l417l443J461O608K417r683K336J0431
$$ -2193 617 396 1174 1405 -2004 -5657 -4999 -8416 -11859 -10398 -3790 -1373 -11056 -8720 1711
16899A711L657k216o997k875J482K894N095P160M137k021j2679q657l904N684
$$ 1711 5368 3152 -3845 -6720 -5238 -2344 2751 9911 14048 12027 -652 -9309 -13213 -7529
16885g529R484p770n855p313P834P292J539O061M487k747m511L646j4k054m161
$$ -7529 1955 -5815 -11670 -18983 -11149 -3857 -2318 3743 8230 5483 972 4618 4604 2550 -1611
16870a611r673k383j154K175J164l213Q557j219k200L992P966K955l207j0964
$$ -1611 -11284 -13667 -14821 -12646 -11482 -14695 -6138 -7357 -9557 -5565 2401 5356 2149 -8815
16856h815r37K084J018q71Q22N940m21j388p524p752M34O359J826j248L65o9M45
$$ -8815 -9752 -7668 -6650 -7521 -6699 -759 -1180 -2568 -10092 -17844 -17410 -11051 -9225 -10473 -10108 -10177 -9732
16839i732L863K388j484r156p568k111J0887M344l212q08n260P781K682J011n008
$$ -9732 -5869 -3481 -4965 -14121 -21689 -23800 -12913 -8569 -11781 -12589 -17849 -10068 -7386 -6375 -11383
16824a1383l253K827M411O76P82K913M955J186m040n482P742P044J839p97j95
$$ -11383 -14636 -11809 -7398 -6722 -5940 -3027 1928 3114 -926 -6408 1334 8378 10217 9420 9225
16809I225m212p524l185L351j788r97j908l105o228n916j156K17m705K53l038
$$ 9225 5013 -2511 -5696 -2345 -4133 -5130 -7038 -10143 -16371 -22287 -23443 -23226 -27931 -27678 -30716
16794c0716N830J148j4097r172P608R656M003N781O559O767P755N020K335N735
$$ -30716 -24886 -23738 -37835 -47007 -39399 -29743 -25740 -19959 -13400 -6633 1122 6142 8477 14212
16780A4212l85J170k539o880l653J912N420r318o732j140J234n172n044O388M097
$$ 14212 13827 14997 12458 5578 1925 3837 9257 -61 -6793 -7933 -6699 -11871 -16915 -10527 -6430
16765f430k058O83O286m399k516l349o80m252J42R39j902L574N360lM508r71l124
$$ -6430 -8488 -7805 -1519 -5918 -8434 -11783 -12463 -16715 -16573 -15634 -17536 -13962 -8602 -8605 -4097 -5068 -8192
16748h192P58R03K088q092q285k990L956O952r40k800K012J794l131n572J825
$$ -8192 -7434 -6531 -4443 -12535 -20820 -23810 -19854 -12902 -13842 -16642 -14630 -12836 -15967 -21539 -19714
16733a9714o26J505J5728O230j920j240j553J536N105o861K973J581j348O682
$$ -19714 -20340 -18835 -3107 3123 1203 -37 -1590 -54 5051 -1810 1163 2744 1396 8078
16719H078k406j4108l877Q224L947n075m127M9J04N79M428J621N176M815L115
$$ 8078 5672 -8436 -12313 -4089 -142 -5217 -9344 -9295 -9191 -8612 -4184 -2563 2613 7428 10543
16704A0543l750l570o85Q431L646L40j0228l368k091q573j525k011N902P343R441
$$ 10543 6793 3223 2538 10969 14615 14955 4727 1359 -732 -9305 -10830 -12841 -6939 404 9845
16689I845q2p063n108m791j467J705N803M33r08J902M544P202j758l864K802l697
$$ 9845 9763 2700 -2408 -7199 -8666 -6961 -1158 -725 -1633 269 4813 12015 10257 6393 9195 5498
16673E498M611M648L632L477M692J0619R763J1446K8387L5152M9603Q1335J20211
$$ 5498 10109 14757 18389 21866 26558 37177 46940 58386 86773 121925 171528 252863 373074
16660C73074J25342N1796J4829R0071J57170M7192j61401j44421m3741k9468r9307
$$ 373074 498416 550212 565041 655112 812282 859474 698073 553652 509911 480443 381136
16649C81136j20779q6536n6524l4057j9992j3072j983j0213l526l400o073m941
$$ 381136 260357 173821 117297 83240 63248 50176 48193 37980 34454 31054 24981 20040
16637B0040M69j881N016o848j0634l085p79N261K671K578K440k096P347J7035
$$ 20040 20509 18628 23644 16796 6162 3077 2298 7559 10230 12808 15248 13152 20499 37534
16623C7534J5617J4875J6466j593M335K6200L2080o584k8825r745O656P913q023
$$ 37534 53151 68026 84492 82899 87234 113434 145514 138930 110105 100360 107016 114929 106906
16610A06906p52j134r294Q467K8935Q30l9650k1561k606q399j7496j6201k791
$$ 106906 106154 105020 95726 104193 133128 133958 94308 72747 70141 61742 44246 28045 25254
16597B5254n842j5374M77K637J579J584M92p212r063J842R84L031l736j416l639
$$ 25254 19412 4038 4515 7152 8731 10315 10807 3595 -5468 -3626 -2642 389 -3347 -4763 -8402
16582h402j997n133J67k79N415O022L781k619q122o400O23Q126K547m72K694K815
$$ -8402 -10399 -15532 -15365 -15644 -10229 -4207 -426 -3045 -11167 -17567 -16944 -8818 -6271 -6743 -4049 -1234
16566a234o255K55N491k275n631N40K127L135k212J73J45n905k656M895N530N109
$$ -1234 -7489 -7234 -1743 -4018 -9649 -9109 -6982 -3847 -6059 -5886 -5741 -11646 -14302 -9407 -3877 1232
16550A232M944J648k238q007o343n037l81K164M920l849m763J2630J622q984m703
$$ 1232 6176 7824 5586 -2421 -8764 -13801 -14182 -12018 -7098 -10947 -15710 -3080 -1458 -10442 -15145
16535a5145L704P945N112J121l977n908R28j405n088J585P114j69q541P33L543
$$ -15145 -11441 -3496 1616 2737 -1240 -7148 -6220 -7625 -12713 -11128 -4014 -4183 -12724 -11991 -8448
16520h448K65q54j85K228k958l44k37L05j117O45r03K553k705N4J480K181L988
$$ -8448 -8183 -9037 -9222 -6994 -9952 -10296 -10533 -10228 -11345 -10700 -11603 -9050 -11755 -11701 -10221 -8040 -4052
16503d052k409J219m48o541N473J555q194j576o86q02R938K28J364K511N426k325
$$ -4052 -6461 -5242 -5690 -12231 -6758 -5203 -13397 -14973 -15659 -16461 -6523 -6295 -4931 -2420 3006 681
16487F81r593N960L661o666k97K228L471M095J341J54q985n329l531L666j595
$$ 681 -8912 -2952 709 -5957 -6254 -4026 -555 3540 4881 5035 -3950 -9279 -12810 -9144 -10739
16472a0739q15K880N644K198k882L219K806M49j762l285K339k856J737M98o07
$$ -10739 -11554 -8674 -3030 -832 -3714 -495 2311 2760 998 -2287 52 -2804 -1067 -569 -1176
16457a176N232k058q066j109M259n853j678j1j515j033k597m083L283l51J479
$$ -1176 4056 1998 -6068 -7177 -2918 -8771 -10449 -10460 -11975 -13008 -15605 -19688 -16405 -16756 -15277
16442a5277M256L046q643p961O777N854j160L712K828p041k629J204k363O323
$$ -15277 -11021 -7975 -16618 -24579 -17802 -11948 -13108 -9396 -6568 -13609 -16238 -15034 -17397 -11074
16428a1074O028m318L469k25q504L047M069l386r74Q683m365o156l252m93L574
$$ -11074 -5046 -9364 -5895 -6120 -14624 -11577 -7508 -10894 -11868 -3185 -7550 -13706 -16958 -17451 -13877
16413a3877O628O05K779k24L070o272l234k370L276q32k275J203p29j094K076
$$ -13877 -7249 -6644 -3865 -4089 -1019 -7291 -10525 -12895 -9619 -10451 -12726 -11523 -12252 -13346 -11270
16398a1270k419N96M412K845R37j546o789j808J357O06l710J108M967N213k819
$$ -11270 -13689 -13093 -8681 -5836 -4899 -6445 -13234 -15042 -13685 -13079 -16789 -15681 -10714 -5501 -8320
16383h320j023n488M307O583N158r919k469o0M54K099j306k26K078J115P754J775
$$ -8320 -9343 -14831 -10524 -3941 1217 -8702 -11171 -11231 -10777 -8678 -9984 -10210 -8132 -7017 737 2512
16367B512r975o140j517m310N457J656M5M159R10j499k089m92M34N009M040k035
$$ 2512 -7463 -13603 -15120 -19430 -13973 -12317 -12272 -8113 -7203 -8702 -10791 -11283 -10849 -5840 -1800 -3835
16351c835k242Q2j988j173J882l366k553K81M206J067n30Q205N369n701j1480
$$ -3835 -6077 -5995 -7983 -9156 -7274 -10640 -13193 -12912 -8706 -7639 -8169 36 5405 -296 -11776
16336a1776j216L828j517k487L701k355P200M862O62o544k918J460L183m05j1901
$$ -11776 -12992 -9164 -10681 -13168 -9467 -11822 -4622 240 902 -5642 -8560 -7100 -3917 -4322 -16223
16321a6223j459J044N918P781Q347J184o358o328q4k590m194l126K9L167Q1K441
$$ -16223 -17682 -16638 -10720 -2939 5408 6592 234 -6094 -6178 -8768 -12962 -16088 -16059 -12892 -12811 -10370
16305a0370n128P150M656m58K187k23m745K229L067O712o804n984NJ888J996m539
$$ -10370 -15498 -8348 -3692 -4150 -1963 -2186 -6931 -4702 -1635 5077 -1727 -7711 -7706 -5818 -3822 -8361
16289h361K408K941l604m616K524N58J035k58O230M687K376J518o183p877m438
$$ -8361 -5953 -3012 -6616 -11232 -8708 -8150 -7115 -7373 -1143 3544 5920 7438 1255 -6622 -11060
16274a1060O90K670N726J327k105J348j27L328K465l627j1515m847K686M016L070
$$ -11060 -10370 -7700 -1974 -647 -2752 -1404 -1531 1797 4262 635 -10880 -15727 -13041 -9025 -5955
16259e955N408j989o444J444J280K459j347j827o879N619P674L643l205n896p373
$$ -5955 -547 -2536 -8980 -7536 -6256 -3797 -5144 -6971 -13850 -8231 -557 3086 -119 -6015 -13388
16244a3388J905M322j135M601P02j662K663q475M62Q584N801k376j761j635J858
$$ -13388 -11483 -7161 -8296 -3695 -2993 -4655 -1992 -10467 -10005 -1421 4380 2004 243 -1392 466
16229D66N337n648o484p168p18q57j04j149j564J555j195Q29N680N228J756J532
$$ 466 5803 155 -6329 -13497 -14215 -15072 -15176 -16325 -17889 -16334 -17529 -16700 -11020 -5792 -4036 -2504
16213b504m131m411j197n535K628K222K725o83k600k033N098k27j146o696k663
$$ -2504 -6635 -11046 -12243 -17778 -15150 -12928 -10203 -10886 -13486 -15519 -10421 -10648 -11794 -18490 -21153
16198b1153j560O145O445J710K63j188M3K307n245Q5J1009L446q08j999k502j243
$$ -21153 -22713 -16568 -10123 -8413 -8150 -9338 -9295 -6988 -12233 -12148 -1139 2307 1499 -500 -3002 -4245
16182d245j188M371P13K229m729K854k457j794J209k147P65p36M321J039L945
$$ -4245 -5433 -1062 -349 1880 -2849 5 -2452 -4246 -3037 -5184 -4419 -5155 -834 205 4150
16167D150m296o172j646q539P16P577j607M052j97j933J609M48K483N276k743
$$ 4150 -146 -6318 -7964 -16503 -15787 -8210 -9817 -5765 -5962 -7895 -6286 -5838 -3355 1921 -822
16152h22n998l257p60N739L635N967M325j114J728o500r469m490K369J647N175
$$ -822 -6820 -10077 -10837 -5098 -1463 4504 8829 7715 9443 2943 -6526 -11016 -8647 -7000 -1825
16137a825Q360N200q211n687j40k523L91n266p803k934l462O28Q379P800J689
$$ -1825 6535 11735 3524 -2163 -2303 -4826 -4435 -9701 -17504 -20438 -23900 -23272 -14893 -7093 -5404
16122e404k966O341K974J916J954Q6L208j96Q08m138o638k018O59o22l831m419
$$ -5404 -8370 -2029 945 2861 4815 4901 8109 7913 8721 4583 -2055 -4073 -3414 -4036 -7867 -12286
16106a2286j796K740j839M314N784J237k411l273K181N874k330P54K652j969k796
$$ -12286 -14082 -11342 -13181 -8867 -3083 -1846 -4257 -7530 -5349 525 -1805 -1051 1601 -368 -3164
16091c164j283M700N684P44l345j0742n800M367J0023M699l316M75l122k703N243
$$ -3164 -4447 253 5937 6681 3336 -7406 -13206 -8839 1184 5883 2567 3042 -80 -2783 2460
16076B460k914K588M79M876M116j435k652m576k868p4J459n248l22m98K259k49
$$ 2460 -454 2134 2613 7489 11605 10170 7518 2942 74 0 1459 -3789 -4111 -4609 -2350 -2599
16060b599p225j642M065j724L56M021o309n369Q118O331m866k948K27L968r0j701
$$ -2599 -9824 -11466 -7401 -9125 -8769 -4748 -11057 -16426 -8308 -1977 -6843 -9791 -9564 -5596 -5686 -7387
16044g387R905P41m901j589L742J87k66K739k590j0399m609K052O83K314J3361
$$ -7387 2518 3259 -1642 -3231 511 698 432 3171 581 -9818 -14427 -12375 -11692 -9378 3983
16029C983J606n449j150L213P725J790K441o773r877k754O76j69l819J12r03J429
$$ 3983 5589 140 -1010 2203 9928 11718 14159 7386 -2491 -5245 -4569 -4738 -8557 -8445 -9348 -7919
16013g919O998K670J174J191M09L336r1r306l527N484O012j336Q65k914m0m76
$$ -7919 -921 1749 2923 4114 4523 7859 7768 -1538 -5065 419 6431 5095 5960 3046 3006 2530
15997B530Q80j565k850p040j526N398k19r342k274J894l690J708O224P856J422
$$ 2530 3410 1845 -1005 -8045 -9571 -4173 -4392 -13734 -16008 -14114 -17804 -16096 -9872 -2016 -594
15982e94m34J565j251k572N07k426k542m104J451J686L689J822k586j340K267
$$ -594 -1028 537 -714 -3286 -2779 -5205 -7747 -11851 -10400 -8714 -5025 -3203 -5789 -7129 -4862
15967d862P730j271n009K680j373K157j471p98J637q22K819O466o525n465q12
$$ -4862 2868 1597 -3412 -732 -2105 52 -1419 -2217 -580 -1402 1417 7883 1358 -4107 -4919
15952d919k006p104l099j96q262K781J2443L484J408J540K551j583k331J051j614
$$ -4919 -6925 -14029 -17128 -17324 -25586 -22805 -10362 -6878 -5470 -3930 -1379 -2962 -5293 -4242 -5856
15937e856M506O175n31k461j362l037j109R63J04J506k436m895j483L221m917
$$ -5856 -1350 4825 4294 1833 471 -2566 -3675 -2712 -2608 -1102 -3538 -8433 -9916 -6695 -11612
15922a1612l07L786j445Q056K954M796o083j924k624p55l349J129M080R488J778
$$ -11612 -11919 -8133 -9578 -1522 1432 6228 145 -1779 -4403 -5158 -8507 -7378 -3298 6190 7968
15907G968M1o772o834m479L717j53o860O998J909o723j727j772O289J575M440
$$ 7968 8009 1237 -5597 -10076 -6359 -6512 -13372 -6374 -4465 -11188 -12915 -14687 -8398 -6823 -2383
15892b383O476O88n551q68j165L709Q23J270j178j257n201o871K865j981m478
$$ -2383 4093 4781 -770 -1638 -2803 906 1729 2999 1821 564 -4637 -11508 -8643 -10624 -15102
15877a5102J175M880P794m436r16m346o59j654k932M313P743K874K698L420n923
$$ -15102 -13927 -9047 -1253 -5689 -6605 -10951 -11610 -13264 -16196 -11883 -4140 -1266 1432 4852 -1071
15862a071k466J777M682R397L331o749j3393l597l414J731K694p725Q77J0565
$$ -1071 -3537 -1760 2922 12319 15650 8901 -4492 -8089 -11503 -9772 -7078 -14803 -13926 -3361
15848c361j510K053K900L119j198K091m777J023l47l779l436O719R265l407m414
$$ -3361 -4871 -2818 82 3201 2003 4094 -683 340 -7 -3786 -7222 -503 8762 5355 941
15833I41J412o910j537k23o570L570O006Q618P399J845n535l912k023J829k553
$$ 941 2353 -4557 -6094 -6317 -12887 -9317 -3311 5307 12706 14551 9016 5104 3081 4910 2357
15818B357k454j841k715N815K700k554J192Q031J343p188l170k285M11l670o417
$$ 2357 -97 -1938 -4653 1162 3862 1308 2500 10531 11874 4686 1516 -769 -358 -4028 -10445
15803a0445K812O839L48q225o471k2P724M283M1N348j055j918m025m717j021O043
$$ -10445 -7633 -794 -446 -8671 -15142 -15164 -7440 -3157 -3116 2232 1177 -741 -4766 -9483 -10504 -4461
15787d461L276N009l006p723k22O2j309j893L099K523R28k029K223N349J259m762
$$ -4461 -1185 3824 818 -6905 -7127 -7065 -8374 -10267 -7168 -4645 -3717 -5746 -3523 1826 3085 -1677
15771a677J41Q568L110M63m67m628n393j790n031m712K95j107L311K85O760P745
$$ -1677 -1536 7032 10142 10605 10138 5510 117 -1673 -6704 -11416 -11121 -12228 -8917 -8632 -1872 5873
15755E873j483n507J606L787j83K696J590o988m113p616p052Q039j046M4n59N456
$$ 5873 4390 -1117 489 4276 4093 6789 8379 1391 -2722 -10338 -17390 -9351 -10397 -10353 -10912 -5456
15739e456L746o503o373O090J296j1309M441J2227M819J736l495o787J65L568
$$ -5456 -1710 -8213 -14586 -8496 -7200 -18509 -14068 -1841 2978 4714 1219 -5568 -5403 -1835
15725a835O527j042k714k824k055n306K897L652k145m215O983q69K0L636r22n738
$$ -1835 4692 3650 936 -1888 -3943 -9249 -6352 -2700 -4845 -9060 -2077 -2946 -2926 710 -212 -5950
15709e950l083N83j21j951k02M305K941k020O286M856r48K29R85n999P44K327
$$ -5950 -9033 -8450 -8571 -10522 -10724 -6419 -3478 -5498 788 5644 4696 4925 5910 -89 655 2982
15693B982k475L004K930l715j719j831o240M9L949Q88L477N230L623k333p159
$$ 2982 507 3511 6441 2726 1007 -824 -7064 -7015 -3066 -2178 1299 6529 10152 7819 660
15678F60q513m156k037J607Q216P007Q75k277J348O725k119m523m235j203M233
$$ 660 -7853 -12009 -14046 -12439 -4223 2784 3659 1382 2730 9455 7336 2813 -1422 -2625 1608
15663A608l083l169O55K298j63n859j811L767P095N30q714j828M553L678p54j898
$$ 1608 -1475 -4644 -3989 -1691 -1854 -7713 -9524 -5757 1338 1868 -6846 -8674 -4121 -443 -1197 -3095
15647c095n921j740J768q344L23o17J23n1j342J534N195L6k002J107L549P44M377
$$ -3095 -9016 -10756 -8988 -17332 -17009 -17626 -17503 -17554 -18896 -17362 -12167 -12131 -14133 -13026 -9477 -8733 -4356
15630d356j788n23P246Q705n536j498n002j106Q7l725j794Q031J0407N161p173
$$ -4356 -6144 -6667 579 9284 3748 2250 -2752 -3858 -3771 -7496 -9290 -1259 9148 14309 7136
15615G136l504Q34K362N220k211p941p310q417j766N228P397N143K493N25K435
$$ 7136 3632 4466 6828 12048 9837 1896 -5414 -13831 -15597 -10369 -2972 2171 4664 5189 7624
15600G624k428j009k490n04J406k55o180l743K788K885M289L112n865o931K449
$$ 7624 5196 4187 1697 1193 2599 2344 -3836 -7579 -4791 -1906 2383 5495 -370 -7301 -4852
15585d852k591p474K266N656k134p124j221M399K625O864M248K108j521p488m771
$$ -4852 -7443 -14917 -12651 -6995 -9129 -16253 -17474 -13075 -10450 -3586 662 2770 1249 -6239 -11010
15570a1010r93L21K353L750m276k546N11P62J2044R805q64n009r359n355Q419
$$ -11010 -12003 -11682 -9329 -5579 -9855 -12401 -11890 -11128 916 10721 9857 4848 -4511 -9866 -1447
15555a447O866l027j616l600J39l996o219k77o23J55J951j612M26j704j270O049
$$ -1447 5419 2392 776 -2824 -2685 -6681 -12900 -13177 -13800 -13645 -11694 -13306 -12880 -14584 -15854 -9805
15539i805K775M755L236n184k902p05L077M560p7k577L945N114j709L729M114
$$ -9805 -7030 -2275 961 -4223 -7125 -7830 -4753 -193 -270 -2847 1098 6212 4503 8232 12346
15524A2346o743p484K648j553n286j526L999j802j898O459L676R702l372q712
$$ 12346 5603 -1881 767 -786 -6072 -7598 -3599 -5401 -7299 -840 2836 12538 9166 454
15510D54M537j035o279l401O174J0644p92q713m022k831p844K963J048M058K207
$$ 454 4991 3956 -2323 -5724 450 11094 10302 1589 -2433 -5264 -13108 -10145 -9097 -5039 -2832
15495b832K845j242r57K076J669j16j469L13K656L461j225l158N121J343L393
$$ -2832 13 -1229 -2186 -110 1559 1443 -26 287 2943 6404 5179 2021 7142 8485 11878
15480A1878K92l988r622m5j017M254K545J78m173j931Q403j994q539M764Q629
$$ 11878 12170 8182 -1440 -1485 -2502 1752 4297 4475 302 -1629 6774 4780 -3759 1005 9634
15465I634l30l816m318r81M68L430p87O314k502l583L5M265J970M57k28K518p498
$$ 9634 9304 5488 1170 189 657 4087 3300 9614 7112 3529 3564 7829 9799 10256 10028 12546 5048
15448E048n777J57l950k66q45P048J6K212M996l305N459k460k188l665l030r36
$$ 5048 -729 -572 -4522 -4788 -5633 1415 1431 3643 8639 5334 10793 8333 6145 2480 -550 -1486
15432a486q093O806O738l53l216k913J059o2k262j86K278P859K07q886K63n89
$$ -1486 -9579 -2773 3965 3612 396 -2517 -1458 -1520 -3782 -3968 -1690 6169 6376 -2510 -2247 -2836
15416b836j56L257l494k581K247J2066N723p780j483M68o449p085p255J705J387
$$ -2836 -2992 265 -3229 -5810 -3563 8503 14226 6446 4963 5431 -1018 -8103 -15358 -13653 -12266
15401a2266p50q60Q97N161l69k248K581O697k38l798j753N885N045K136m947K238
$$ -12266 -13016 -13876 -12979 -7818 -8187 -10435 -7854 -1157 -1395 -5193 -6946 -1061 3984 6120 1173 3411
15385C411K377k055n40J201k322L0J228L230J697q28k175R484l051q152O935P223
$$ 3411 5788 3733 3193 4394 2072 2102 3330 6560 8257 7429 5254 14738 11687 3535 10470 17693
15369A7693r545p722L785K991m093J81j500J400O181Q850n052q659J73L924l378
$$ 17693 8148 426 4211 7202 3109 3290 1790 3190 9371 18221 13169 4510 4683 8607 5229
15354E229p350l877m785P077J830q98K556M196J959n247J824K894K331q21R7m068
$$ 5229 -2121 -5998 -10783 -3706 -1876 -2774 -218 3978 5937 690 2514 5408 7739 6918 7015 2947
15338B947K844j728m689n05O098r56k091K367m527R27M837M473K275L57n004k953
$$ 2947 5791 4063 -626 -1131 4967 4011 1920 4287 -240 687 5524 9997 12272 12629 7625 4672
15322D672j963l395M390K789q698j393K516O031j905o30j513n067N38j948O02
$$ 4672 2709 -686 3704 6493 -2205 -3598 -1082 4949 3044 2414 901 -4166 -3628 -5576 -4974
15307d974M764N286K638m69K816M53J137N30N27m863r057K328K445N57N121Q45
$$ -4974 -210 5076 7714 7245 10061 10514 11651 12181 12708 7845 -1212 1116 3561 4118 9239 10084
15291A0084l692M99L976k503m871j940M061L431l245J243P72m959j1440J225O948
$$ 10084 6392 6891 10867 8364 3493 1553 5614 9045 5800 7043 7815 2856 -8584 -7359 -411
15276d11J778l911o513J01L399O441j375p326m432L401L348K722p90M4N721k304
$$ -411 1367 -2544 -9057 -8956 -5557 884 -491 -7817 -12249 -8848 -5500 -2778 -3568 -3524 2197 -107
15260a07n007m27L451n8J124j262K211J0017M075r33J955Q297R295N476j204o136
$$ -107 -5114 -5541 -2090 -2148 -1024 -2286 -75 9942 14017 13084 15039 23336 32631 38107 36903 30767
15244C0767q77P49L246q377j7118j1822M22J490M680K696o19K561k324j87M34
$$ 30767 29890 30639 33885 25508 8390 -3432 -3010 -1520 3160 5856 5237 7798 5474 5287 5721
15229E721n335o192j665Q603J1610l56n433o254J183L449M385O07o781n643Q06
$$ 5721 386 -5806 -7471 1132 12742 12386 6953 699 1882 5331 9716 10323 3542 -2101 -1295
15214a295P423M357M024K079k479j829l02Q3m35p37j516j213M596l179Q80m684
$$ -1295 6128 10485 14509 16588 14109 12280 11978 12061 11626 10889 9373 8160 12756 9577 10457 5773
15198E773n733l204mO834L443J710J251K613o179L4L05J076p916L215P751q70
$$ 5773 40 -3164 -3168 3666 7109 8819 10070 12683 6504 6538 6843 7919 3 3218 10969 10099
15182A0099k117q131J548J801J0696j320n040N740k843m091o86k25m082j024M14
$$ 10099 7982 -149 1399 3200 13896 12576 7536 13276 10433 6342 5656 5431 1349 325 739
15167G39k26P20K377K909K935J633L777R313L40k619q512r778k194n697k985K008
$$ 739 513 1233 3610 6519 9454 11087 14864 24177 24517 21898 13386 3608 1414 -4283 -7268 -5260
15151e260o32j222r49K781O651K308m159J206K063J827K870r382j552M944M47
$$ -5260 -5892 -7114 -8063 -5282 1369 3677 -482 724 2787 4614 7484 -1898 -3450 1494 1941
15136A941L192l194m450K227O453P46k825p641O133J0177K179m165j686P35J839
$$ 1941 5133 1939 -2511 -284 6169 6915 4090 -3551 2582 12759 14938 10773 9087 9822 11661
15121A1661J148J468m625k162o52K469J743J171K46k942J659L429k316m12m383
$$ 11661 12809 14277 9652 7490 6838 9307 11050 12221 12467 9525 11184 14613 12297 11885 7502
15106G502l657k8k704M12J762m609J798O828P149K679J287k965q41m019r237l00
$$ 7502 3845 3817 1113 1525 3287 -1322 476 7304 14453 17132 18419 15454 14613 10594 1357 1057
15090A057K599m173J534P227q265R24R286J952n643O377M096J085J023P49r249
$$ 1057 3656 -517 1017 8244 -21 903 10189 12141 6498 12875 16971 18056 19079 19828 10579
15075A0579n92R59J706J925M982O134k690J048k537o88L200J211N78m190K007
$$ 10579 9987 10946 12652 14577 19559 25693 23003 24051 21514 20826 24026 25237 25815 21625 23632
15060B3632l679M361l372l819L866r104l672P75l326K352M475J868L449K407l034
$$ 23632 19953 24314 20942 17123 20989 11885 8213 8988 5662 8014 12489 14357 17806 20213 17179
15045A7179k321k943n38N01o035o095p50q15R668N486J132K76N791L155k351N160
$$ 17179 14858 11915 11377 11878 5843 -252 -1002 -1817 7851 13337 14469 14745 20536 23691 21340 26500
15029B6500O12K902J6704J4828K108J387K156k687m106m741p103m391p437k692
$$ 26500 27112 30014 46718 61546 63654 65041 67197 64510 60404 55663 48560 44169 36732 34040
15015C4040j350N010L480k38m269o665R054J5386J2773K4766K9024J3017o68J1038
$$ 34040 32690 37700 41180 40942 36673 30008 39062 54448 67221 91987 121011 134028 133360 144398
15001A44398K2783K0436M181k3072k9514j3806M662P9k8188k7222j3994L640p776
$$ 144398 167181 187617 191798 168726 139212 125406 130068 130147 101959 74737 60743 64383 56607
14988E6607o998J597N971N145P273J0691J5736N841J664N272j533k736o596q780
$$ 56607 49609 51206 57177 62322 69595 80286 96022 101863 103527 108799 107266 104530 97934 89154
14974H9154k0339j2938p458r42J151k602M833J0189M361R837M309L442J0878o81
$$ 89154 68815 55877 48419 47477 48628 46026 50859 61048 65409 75246 79555 82997 93875 93194
14960I3194Q10K997o106r335p709j1275n556m220m52j348o727j48l692p783l633
$$ 93194 94004 97001 90895 81560 73851 62576 57020 52800 52348 51000 44273 44125 40433 32650 29017
14945B9017M508L160J603o093K139M236L019K16R6L926l759k210k695l381M531
$$ 29017 33525 36685 38288 32195 34334 38570 41589 41805 41901 45827 42068 39858 37163 33782 38313
14930C8313L521K445j99O944N428K735J104J0734J0324P942Q588J2646L7453M9742
$$ 38313 41834 44279 44080 51024 56452 59187 60291 71025 81349 89291 97879 110525 147978 197720
14916A97720P2978J10049J49031J54094L0442n7809o888M7458l7857j68088j67130
$$ 197720 270698 380747 529778 683872 714314 656505 649617 697075 659218 491130 324000
14905C24000j04672n8821l3256j4012j3214j3620j0966m504m122p317n147k995
$$ 324000 219328 160507 127251 113239 100025 86405 75439 70935 66813 59496 54349 51354
14893E1354n657k934m645o670L538j894P58r32o968o346r63m433m046l178R051
$$ 51354 45697 42763 38118 31448 34986 33092 33850 32918 25950 19604 18641 14208 10162 6984 16035
14878A6035P732M369l31J004p42p214K978O474O87n847J862Q00K524j721K3j575
$$ 16035 23767 28136 27805 28809 28067 20853 23831 30305 30992 25145 27007 27807 30331 28610 28633 27058
14862B7058p876o93M659R467M513O362N628k043k502k97o560m02O635j540n483
$$ 27058 19182 18489 23148 32615 37128 43490 49118 47075 44573 44276 37716 37314 43949 42409 36926
14847C6926Q35N601j174M219M18L817K571N065M891M313P804J4240L3786M7161
$$ 36926 37761 43362 42188 46407 46825 50642 53213 58278 63169 67482 75286 89526 123312 170473
14833A70473L8308O130j1054n242J777j4215l8188m1382k4431j4692j6389q332
$$ 170473 208781 214911 203857 198615 200392 186177 147989 106607 82176 67484 51095 42763
14821D2763q919M641k528k722k044p490k956k238l42M580J350q90m664P343L972
$$ 42763 33844 38485 35957 33235 31191 23701 20745 18507 18165 22745 24095 23205 18541 25884 29856
14806B9856J537l539l989p746j67O416q83o99j26l524o13K954Q678n333q677o923
$$ 29856 31393 27854 23865 16119 15952 22368 21485 20786 20660 17136 16523 19477 28155 22822 14145 7222
14790G222J243M926R36M24J426L95O48K163O795K37o787p288R221k368k646M87
$$ 7222 8465 13391 14327 14751 16177 16572 17220 19383 26178 26415 19628 12340 21561 19193 16547 17034
14774A7034j193l131J81m39m959J797K205k725K519M663l1r91N304K884k77Q0
$$ 17034 15841 12710 12891 12452 7493 9290 11495 8770 11289 15952 15921 14930 20234 23118 22841 22921
14758B2921k9P177k020j122j99R868K180r604j2113P43m133m931m749k640p086
$$ 22921 22892 30069 28049 26927 26728 36596 38776 29172 17059 17802 13669 8738 3989 1349 -5737
14743e737j908L112N808R498M545j058o51k54K96r69j947j737J963L267O552j91
$$ -5737 -7645 -4533 1275 10773 15318 14260 13609 13355 13651 12682 10735 8998 10961 14228 20780 20589
14727B0589j921l471L507j536m277Q157N67n342k169N666L831L211m988m860l038
$$ 20589 18668 15197 18704 17168 12891 21048 21615 16273 14104 19770 23601 26812 21824 16964 13926
14712A3926r081M758M008r44k047P173K019O38N65J970N002L749M704m739k021
$$ 13926 4845 9603 13611 12667 10620 17793 19812 20450 21015 22985 27987 31736 36440 31701 29680
14697B9680J077M264l97K086M058m111j662M706n332j867K019K381J440r035k322
$$ 29680 30757 35021 34624 36710 40768 36657 34995 39701 34369 32502 34521 36902 38342 29307 26985
14682B6985Q206K061o386p897r029J153M021N99P593M272m129l809j441J723M804
$$ 26985 35191 37252 30866 22969 13940 15093 19114 19713 27306 31578 27449 23640 22199 23922 28726
14667B8726R17j0219o690K390M032k197l247m905k650L118M20K40l042K163K45
$$ 28726 29643 19424 12734 15124 19156 16959 13712 8807 6157 9275 9695 9935 6893 9056 9301
14652I301j478r17L309K241O445r70m19O212M402q251j013Q650m38o373K778K988
$$ 9301 7823 6906 10215 12456 18901 17931 17512 23724 28126 19875 18862 27512 27074 20701 23479 26467
14636B6467n499m985M161L617L89j59L022N910k549q517k297O461P832j822j34
$$ 26467 20968 15983 20144 23761 24150 23991 27013 32923 30374 21857 19560 26021 33853 32031 31897
14621C1897j707j862L50m384P21k775l794J0160J598Q79M04P08k696k866j037
$$ 31897 30190 28328 28678 24294 25015 22240 18446 28606 30204 31083 31487 32195 29499 26633 25596
14606B5596Q754J183q753q12J312k941l360m381m537q84M902N427j995l347P292
$$ 25596 34350 35533 26780 25968 27280 24339 20979 16598 12061 11177 16079 21506 19511 16164 23456
14591B3456K000k690n8L601n643p080O037M088j42l264k312p51J153R394r0M94
$$ 23456 25456 22766 22708 26309 20666 13586 19623 23711 23569 20305 17993 17242 18395 27789 27699 28193
14575B8193k159j761n73L634j179k540j673q157l25O712N968K286q758p480k799
$$ 28193 26034 24273 23700 27334 26155 23615 21942 13785 13460 20172 26140 28426 19668 12188 9389
14560I389N266L803k355j120l005L158L216n306j60J573j158j092N608m36L427
$$ 9389 14655 18458 16103 14983 11978 15136 18352 13046 12886 14459 13301 12209 17817 17381 20808
14545B0808P843q447o050l5l271J606M135k847J08R20M631L825j734o933O353
$$ 20808 28651 20204 14154 14119 10848 12454 16589 13742 13850 14770 19401 23226 21492 14559 20912
14530B0912M139j0619j75M96K431J598M01L223l576l574K694K251k331J106J674
$$ 20912 25051 14432 14257 14753 17184 18782 19183 22406 18830 15256 17950 20201 17870 18976 20650
14515B0650K980Q519R041O706M307R82j712m978R10q28Q90K358o019m372j968
$$ 20650 23630 32149 41190 47896 52203 53185 51473 46495 47405 46577 47467 49825 43806 39434 37466
14500C7466j2701N248Q318k60m381j063r4M216M745p451l471J0582l63j786L893
$$ 37466 24765 30013 38331 38071 33690 32627 32533 36749 41494 34043 30572 41154 40791 39005 42898
14485D2898O227k438j795K409p820j98N165k909k251M218J1931K997k573L154
$$ 42898 49125 46687 44892 47301 39481 39283 44448 41539 39288 43506 55437 58434 55861 59015
14471E9015L353L81L730J8475J3594K403m716k865l631J795n30k516M28N065J1225
$$ 59015 62368 62749 66479 84954 98548 100951 96235 93370 89739 91534 91004 88488 88916 93981 105206
14456A05206J4508K0257K3211J7470K5905M3798O1590R8021J62987K49925L71640
$$ 105206 119714 139971 163182 180652 206557 250355 311945 409966 572953 822878 1194518
14445A194518M28815K86857q9012k08420N324J40958j44952m72862l90926k26204
$$ 1194518 1623333 1910190 1821178 1612758 1618082 1759040 1614088 1141226 750300 524096
14435E24096j36361q4194k7460J4372L4207L5293m5970q8976o4958k3445j2009
$$ 524096 387735 303541 276081 290453 324660 359953 313983 225007 160049 136604 124595
14424A24595j2P882N142j4899j0180N884J4727K64k4971k7173j0806j3967q762
$$ 124595 124583 132465 137607 122708 112528 118412 133139 133403 108432 81259 70453 56486 47724
14411D7724J944o525q402k12M835m852k644l602n098m582m309J888M391Q292l365
$$ 47724 49668 43143 34741 34529 39364 34512 31868 28266 23168 18586 14277 16165 20556 28848 25483
14396B5483j0803M39N064j457L700r769n020K357Q235N155j517OM532K731n691
$$ 25483 14680 15119 20183 18726 22426 12657 7637 9994 18229 23384 21867 21873 26405 29136 23445
14381B3445L81k071r725K482J4617P274J124o105r734J423l686J718j536m845
$$ 23445 23826 21755 12030 14512 29129 36403 37527 31422 21688 23111 19425 21143 19607 14762
14367A4762J756O466m681m481L062K939O366N237M142m739o560k386O443O963
$$ 14762 16518 22984 18303 13822 16884 19823 26189 31426 35568 30829 24269 21883 28326 35289
14353C5289L86o632m745Q179L716p532m306n991j970J345m50J46o042K941N062
$$ 35289 35675 29043 24298 32477 36193 28661 24355 18364 16394 17739 17289 17435 11393 14334 19396
14338A9396L355J80q086l063O051k772k217K110O468k811n189j131K933P547O648
$$ 19396 22751 22931 14845 11782 17833 15061 12844 14954 21422 18611 13422 12291 15224 22771 29419
14323B9419L819j039K252q015k908M518K865M26n241J460K696K341n631O825m9
$$ 29419 33238 32199 34451 26436 23528 28046 30911 31337 26096 27556 30252 32593 26962 33787 33738
14308C3738o28M052J712Q104q45n394o451Q064R498J9r332q734o490J84n020K743
$$ 33738 33110 37162 38874 46978 46133 40739 34288 42352 51850 51869 42537 33803 27313 27497 22477 25220
14292B5220m31k420m807K888R99P6k25K819k659n520q956K13R189O190j030k947
$$ 25220 24789 22369 17562 20450 21449 21525 21300 24119 21460 15940 6984 7197 16386 22576 21546 18599
14276A8599r35M694N062M980J387Q503J1710L3961M7431J6438n053Q959M1539
$$ 18599 17664 22358 27420 32400 33787 42290 54000 87961 135392 151830 146777 155736 197275
14263A97275K4974j8243k4736j5832j9575j9522j6072j4715j2230p963p276j225
$$ 197275 222249 204006 179270 163438 143863 124341 108269 93554 81324 73361 66085 64860
14251F4860m456L689N707J650Q339Q426m14O051J7995K1495L0663M5399N2118
$$ 64860 60404 64093 69800 71450 79789 88215 87801 93852 111847 133342 164005 209404 261522
14238B61522M8940m98l2660j2963J4865K4912k4928p1072n5585k9520j7198j1759
$$ 261522 310462 309964 277304 264341 279206 304118 279190 208118 152533 123013 105815 94056
14226I4056j0478p552p36l027j722R785J5607K0669K4435K8685L5151L1238P181
$$ 94056 83578 76026 75290 72263 70541 80326 95933 116602 141037 169722 204873 236111 243292
14213B43292j4542K450J1831l578l2697m5788j5662o070j6205j0799j3054p445
$$ 243292 228750 231200 243031 239453 206756 160968 145306 139236 123031 112232 99178 91733
14201I1733m037k692j157K144L953N691l695j617m835r029l838q38O124o664j2600
$$ 91733 87696 85004 83847 85991 89944 95635 91940 90323 85488 76459 72621 71783 77907 71243 58643
14186E8643j773L349R50o865K61P221J1668R89o303L521J0150J2120N573M24o915
$$ 58643 56870 60219 61169 54304 54565 61786 73454 74443 68140 71661 81811 93931 99504 99928 93013
14171I3013J542N839m060j0380j0485j0799o146l278o726m711N215M731n480N253
$$ 93013 94555 100394 96334 85954 75469 64670 58524 55246 48520 43809 49024 53755 48275 53528
14157E3528R164J1020P779O390o72j2262j8433n810N999o492j1795J4625K8765
$$ 53528 62692 73712 81491 87881 87209 74947 56514 50704 56703 50211 38416 53041 81806
14144H1806M1741O7263P6198O8445J9965m0356m6223k5667k0014j4313j1723q557
$$ 81806 123547 190810 267008 335453 355418 315062 268839 243172 223158 208845 197122 188565
14132A88565j0139j2M224r848k1083j3862j6106j5967j1615r867O642M718m372
$$ 188565 178426 178414 182638 172790 151707 137845 121739 105772 94157 84290 90932 95650 91278
14119I1278p417j7335j6180O278J5616L9971K1801j7700j6618K7180N0376J3877
$$ 91278 83861 66526 50346 56624 72240 112211 134012 116312 99694 126874 177250 191127
14107A91127j7692n056J6842J4340K1880K9405L2188M6946P6001J27483J76714
$$ 191127 173435 168379 185221 199561 221441 250846 283034 329980 405981 533464 710178
14096G10178K03935Q0798j69801k50126j73457j20534j33757j67118j55741k8750
$$ 710178 914113 994911 825110 574984 401527 280993 147236 -19882 -175623 -204373
14086b04373Q9074K1499q2376k5345J14879J60503J00851M3925J7642Q077J699
$$ -204373 -115299 -93800 -176176 -201521 -86642 73861 174712 218637 236279 244356 246055
14075B46055o818r219o570J1008J0104p993N943J3458P672Q545Q832J9033J9317
$$ 246055 239237 230018 223448 234456 244560 236567 242510 255968 263640 272185 281017 300050 319367
14062C19367K896p501M630J3929K7260L5373M2573O5710Q9827J28811J92899K39915
$$ 319367 322263 314762 319392 333321 360581 395954 438527 504237 594064 722875 915774 1155689
14050A155689J28588j26921k44945j76034r5556m8772k7171k4499j4091P717R879
$$ 1155689 1284277 1157356 912411 736377 640821 592049 564878 540379 526288 534005 543884
14039E43884K741q992J763K1400L2530M2040M7733K7297K4494M3102Q2353J68281
$$ 543884 546625 537633 539396 560796 593326 635366 683099 710396 734890 777992 860345 1028626
14027A028626K80309M30714O54234R44117O22535n44180o98204j73026K90993
$$ 1028626 1308935 1739649 2393883 3338000 3960535 3416355 2718151 2545125 2836118
14018B836118O82774N54114o00120j024088o09935l05584j77343j02330n2762
$$ 2836118 3518892 4073006 3472886 2448798 1838863 1533279 1355936 1253606 1200844
14009A200844m713N1464J17413J05839K9133o9210n9684J7545M2090J3632j2911
$$ 1200844 1196131 1247595 1365008 1470847 1499980 1430770 1371086 1388631 1430721 1444353 1431442
13998A431442J2777K6127L8628P9511R4888M9047K4170O0287J38688K13086K42889
$$ 1431442 1444219 1470346 1508974 1588485 1683373 1732420 1756590 1816877 1955565 2168651 2411540
13987B411540K47638K48380K78591L27139L72721L83102M16499N22851P07540
$$ 2411540 2659178 2907558 3186149 3513288 3886009 4269111 4685610 5208461 5916001
13978E916001R67815J263724J282733Q85185R73923J617587K256036K462952K770595
$$ 5916001 6883816 8147540 9430273 10315458 11289381 12906968 15163004 17625956 20396551
13969B0396551L751437N286391Q281951J3006904K0155839L1288576M8343316
$$ 20396551 24147988 29434379 37716330 50723234 70879073 102167649 150510965
13962A50510965P1628875Q1916483J8512747m3821051j4173677L2041591J4510749
$$ 150510965 222139840 304056323 322569070 278748019 264574342 296615933 311126682
13955C11126682p0604670q6584010n4367840l0634468j8372710j1884660p821831
$$ 311126682 240522012 153938002 99570162 68935694 50562984 38678324 30856493
13948C0856493n290723l981278l346606k498637j680614j468623j484400j140656
$$ 30856493 25565770 21584492 18237886 15739249 14058635 12590012 11105612 9964956
13940I964956q30648p26531r85119j001213q58692p36183n58060l86015k74339
$$ 9964956 9134308 8407777 7422658 6421445 5562753 4826570 4268510 3882495 3608156
13931C608156k42220k25965j89813j41898j15324j26381j77879k18154j83530
$$ 3608156 3365936 3139971 2950158 2808260 2692936 2566555 2388676 2170522 1986992
13922A986992j41795j32840j25948j16884p2752j8432j9002k5108m4043o0444
$$ 1986992 1845197 1712357 1586409 1469525 1396773 1378341 1359339 1334231 1290188 1229744
13912A229744m2958n5960o0611p5037r1227n8707m2550l4383k1520j5901n210
$$ 1229744 1186786 1130826 1070215 995178 903951 845244 802694 768311 746791 730890 725680
13901G25680k1528l8245k1416q390o195l125j870J084O539R330R147j2186j8225
$$ 725680 704152 665907 644491 636101 629906 626781 624911 625995 632534 641864 651011 638825 620600
13888F20600j2002k4302k0521j1724n893r307k3389l7389l4861k3910j5912j0993
$$ 620600 608598 584296 563775 552051 546158 536851 513462 476073 441212 417302 401390 390397
13876C90397j0551j2116n221p391q845m327j046o971l065J193K173j2315j3393
$$ 390397 379846 367730 362509 355118 346273 341946 340900 333929 330864 332057 334230 321915 308522
13863C08522n572p000j3135j0909k2771j5592l184J94p25r021p313l86m307L912
$$ 308522 302950 295950 282815 271906 249135 233543 230359 230553 229828 220807 213494 213108 208801 212713
13849B12713J5403J9594J3843J5733J1322J68p896J4O779K2563L2455N5997P3731
$$ 212713 228116 247710 261553 277286 288608 288776 280880 280894 287673 310236 342691 398688 472419
13836D72419Q1367J35060J83457K1084q5998j8597Q5346K3592j50774j53682r6096
$$ 472419 553786 688846 872303 893387 807389 788792 874138 897730 746956 593274 497178
13825D97178o2646m2242j7607j0976j9381j6447k7020l6385j7974j2122j9248
$$ 497178 434532 392290 374683 363707 344326 327879 300859 264474 246500 234378 215130
13814B15130j4256K960P191O97j7690k2157L578M0749M4572k43l2108p813J8306
$$ 215130 200874 203834 211025 211722 194032 171875 175453 216202 260774 260531 228423 220610 238916
13801B38916Q280Q139M858j783n438j864l863q002n470q612k1848k9584k7914
$$ 238916 247196 255335 260193 258410 252972 251108 247245 239243 233773 225161 203313 173729 145815
13788A45815l0360k4277j0336p13O022J7023L0930K9322J2295N63J8130K0599
$$ 145815 115455 91178 80842 80129 86151 103174 134104 163426 175721 176284 194414 215013
13776B15013J4340J0907l068j2852o286J080j297j6527j4105o217Q852O59p740
$$ 215013 229353 240260 237192 224340 218054 219134 217837 201310 187205 180988 189840 190499 182759
13763A82759j713K473M806P259q614l3999o3682m6545K9735Q7916P5624L5578
$$ 182759 181046 183519 188325 195584 186970 152971 89289 42744 72479 160395 236019 271597
13751B71597k730j1420p326k658k351j3457j1207j0038p834o923l056K309J3015
$$ 271597 268867 257447 250121 247463 245112 231655 220448 210410 202576 195653 192597 194906 207921
13738B07921K2644L4023K6461L687j1943j592J5347K3080J5189j893J665P74N74
$$ 207921 230565 264588 291049 294736 282793 281201 296548 319628 334817 332924 334589 335363 335937
13725C35937R61j859K158K0557N4511O3719O3048O9818J09203J55117J50685J9426
$$ 335937 336898 335039 337197 357754 412265 475984 539032 608850 718053 873170 1023855 1043281
13713A043281j79689k31403j58215l7046R1012J26380J06767L7937l1705k3249
$$ 1043281 863592 632189 473974 436928 527940 654320 761087 799024 767319 744070
13703G44070K3878M6907M4714L2587K3649J4930P589K9513N2622P1256R6934J21698
$$ 744070 767948 814855 859569 892156 915805 930735 938324 967837 1020459 1091715 1188649 1310347
13691A310347J42797J57088J78536K35323L16765M09465N30708O32318P44001
$$ 1310347 1453144 1610232 1788768 2024091 2340856 2750321 3281029 3913347 4657348
13682D657348R96056J396052K075519L262930N115817P814378J1318829J3684229
$$ 4657348 5653404 7049456 9124975 12387905 17503722 25318100 36636929 50321158
13674E0321158P582480p811718j4814346j1187672o528453l933061k985363k248907
$$ 50321158 57903638 50091920 35277574 24089902 17561449 13628388 10643025 8394118
13666H394118j507700j022018p45829n91662m98565m33593l93771k80257j47983
$$ 8394118 6886418 5864400 5118571 4526909 4028344 3594751 3200980 2920723 2772740
13657B772740m5412K795J87j4674j1957L8981Q2335J01162J35327K33594L32187
$$ 2772740 2727328 2730123 2730310 2715636 2703679 2742660 2824995 2926157 3061484 3295078 3627265
13646C627265M09874M71624N29268O31148Q12287J077680J449676J814501K074894
$$ 3627265 4037139 4508763 5038031 5669179 6481466 7559146 9008822 10823323 12898217
13637A2898217K693349L857847N713855Q942205J4020245K1516079L1634886M1505251
$$ 12898217 15591566 19449413 25163268 34105473 48125718 69641797 101276683 142781934
13629A42781934L4651418j1737575m9083475m1155460k4277591j3988745q948909
$$ 142781934 177433352 165695777 116612302 75456842 51179251 37190506 28241597
13622B8241597o089603m014677k774095k176921j856692j674892j469189j148092
$$ 28241597 22151994 18137317 15363222 13186301 11329609 9654717 8185528 7037436
13614G037436q30742n76024l38052j82634j71414k14844k01487j61485r4069l1235
$$ 7037436 6206694 5630670 5292618 5109984 4938570 4723726 4522239 4360754 4266685 4235450
13604D235450K2033J01884K03890L37026M52173M95435N69291P22295R59324J323026
$$ 4235450 4257483 4359367 4563257 4900283 5352456 5847891 6417182 7139477 8098801 9421827
13594I421827J720879J988244K484849L562178N293662Q229519J2898081J9856031
$$ 9421827 11142706 13130950 15615799 19177977 24471639 32701158 45599239 65455270
13586F5455270K9511011M0206126L9964995J326740m6362396m6430729k8611757
$$ 65455270 94966281 135172407 175137402 176464142 130101746 83671017 55059260
13579E5059260j6437375r978181o371425m135688k832774k195358j904777j743517
$$ 55059260 38621885 28643704 22272279 18136591 15303817 13108459 11203682 9460165
13571I460165j565091j255988r14625o58502m57420k98178k61049k99040k81949
$$ 9460165 7895074 6639086 5724461 5065959 4608539 4310361 4049312 3750272 3468323
13562C468323k31945j83065j41396j18321q3318k0227N2483J27444J56946J71261
$$ 3468323 3236378 3053313 2911917 2793596 2710278 2690051 2742534 2869978 3026924 3198185
13552C198185K09176K73868M04191N64075O78496Q14277J095499J601907K478135
$$ 3198185 3407361 3681229 4085420 4649495 5327991 6142268 7237767 8839674 11317809
13543A1317809L924588O114360R196502J2846907J3602448L016984j2760822j5731573
$$ 11317809 15242397 21356757 30553259 43400166 57002614 60019598 47258776 31527203
13535C1527203j0731980o385091l843406k394159j532969j036080p86126o79607
$$ 31527203 20795223 14410132 10566726 8172567 6639598 5603518 4817392 4137785
13527D137785o28842n55091m43005l41101k51853j85214j45135j21316j09183
$$ 4137785 3508943 2953852 2510847 2169746 1917893 1732679 1587544 1466228 1357045
13518A357045r9815q6981p4584q0053p8369p2462n4279m4401l4161j1624M589
$$ 1357045 1257230 1170249 1095665 1015612 937243 864781 810502 766101 731940 720316 724905
13507G24905p280M159J1858L0618M5976L0195p5268j25683q3741l2805j3680k5514
$$ 724905 717625 721784 733642 764260 810236 840431 765163 639480 555739 522934 509254 483740
13495D83740k5607P656K2589J2657J0271K2670J2284k3003l7801l4315k3764j9617
$$ 483740 458133 465789 488378 501035 511306 533976 546260 523257 485456 451141 427377 407760
13483D07760j3107m003N307J6134J6966J4694Q523L7872J00236J64850K27402
$$ 407760 394653 390650 395957 412091 429057 443751 452274 490146 590382 755232 982634
13472I82634L33824M36801K83924j18558j51931O6619J19839k34178m78853l45946
$$ 982634 1316458 1753259 2037183 1918625 1766694 1833313 1953152 1718974 1240121 894175
13462H94175j89558r8381l9162Q403M3042O1095l1523j04081q4947n5091m4602
$$ 894175 704617 606236 567074 575477 618519 679614 648091 544010 459063 403972 359370
13451C59370l1956j0195J926M457M566J4522K8498J7691r595l8184m3598k8053
$$ 359370 327414 317219 319145 323602 328168 342690 371188 388879 379284 341100 297502 269449
13439B69449j3313j3592j4466l381L404N044j0631j8010j2301J0764J6589R300
$$ 269449 256136 242544 228078 224697 228101 233145 222514 204504 192203 202967 219556 228856
13427B28856m449j5052m345r81q957n165k184p470r27M320j934M048J5179J616
$$ 228856 224407 209355 205010 204029 195072 189907 187723 180253 179326 183646 181712 185760 200939 202555
13413B02555J1401K7486M0k4271k3103n517O89q44P74m804k410N753J2160J2672
$$ 202555 213956 241442 241482 217211 194108 188591 189280 188436 189210 184406 181996 187749 199909 212581
13399B12581J7387O658j1626k1408j1470j8311j2229j2432j0689K932M355N088
$$ 212581 229968 236626 225000 203592 192122 173811 161582 149150 138461 141393 145748 150836
13387A50836M228M30J5544K9824L9962M4115N1485J0750n1497o5797l9658j8147
$$ 150836 155064 155494 171038 200862 240824 284939 336424 347174 295677 229880 190222 172075
13375A72075l606q185j1149j7466j0682j2686n582m773K685J2130J6452J7332
$$ 172075 168469 160284 149135 131669 120987 108301 102719 97946 100631 112761 129213 146545
13363A46545K7046K1072K2862K4301o824l4060l4162p192P639k818j2131j638
$$ 146545 173591 194663 217525 241826 235002 200942 166780 159588 167227 164409 152278 150640
13351A50640o721o110j2326j4878p782m116K089j864O680O817p396k38M985m343
$$ 150640 143919 137809 125483 110605 102823 98707 100796 98932 105612 112429 105033 104795 109780 105437
13337A05437K220J4488R26k708n016p681K696M212l671j6263o293q012j0209l987
$$ 105437 107657 122145 123071 120363 115347 107666 110362 114574 110903 94640 88347 80335 70126 66139
13323F6139q8L392K3774M2129M9322N0406P0842Q4339R8019K4360j05595j21443
$$ 66139 66051 69443 93217 135346 184668 235074 305916 390255 488274 512634 407039 285596
13311B85596o2646k8028j7641j9218k0451r995o819j0041j1759r477k62K163R051
$$ 285596 222950 194922 177281 158063 137612 127617 120798 110757 98998 89521 89259 91422 100473
13298A00473J3045j228r410m934J203l635l814l61p985k236M782K360j98l991
$$ 100473 113518 112290 102880 97946 99149 95514 91700 91339 83354 81118 85900 88260 88062 84071
13284H4071o809k632p487K90L519r084n777j168K3536O0871N9660M6345O1467
$$ 84071 77262 74630 67143 67433 70952 61868 56091 54923 78459 139330 198990 245335 306802
13271C06802Q2435J00411M9233p8181j18817q1399m9764l3926k1764j6117j6889
$$ 306802 389237 489648 538881 460700 341883 260484 210720 176794 155030 138913 122024
13260A22024j1506q51l690m676l684q593m905M180j0322o986O80N238P911M273
$$ 122024 110518 109667 105977 101301 97617 89024 84119 88299 77977 70991 71671 76909 84820 89093
13246H9093K658o593n549k764J184q340k082p40k87J105o739K964M934K219O501
$$ 89093 91751 85158 79609 76845 78029 69689 67607 66867 66580 67685 60946 63910 68844 71063 77564
13231G7564R408J2046J3309J9413J5552J4432K6905J2755k1024m2235k8622j7689
$$ 77564 86972 99018 112327 131740 147292 161724 188629 201384 180360 138125 109503 91814
13219I1814j6226K229N476J416n577j837j614j562n87P15K381L424J1787L598
$$ 91814 75588 77817 83293 84709 79132 77295 75681 74119 73532 74247 76628 80052 91839 95437
13205I5437J2383K0186K3080L4529N9123P4073M7744k7457p7748o3909l5638k8605
$$ 95437 107820 128006 151086 185615 244738 318811 366555 339098 261350 197441 161803 133198
13193A33198k0223k237o694m915j81k815p48n799p814k861p112o472l451j658
$$ 133198 112975 110738 104044 99129 98948 96133 95385 89586 81772 78911 71799 65327 61876 60218
13179F0218m994l281O36l584n394L392R294j948j834q143k983l854O152J2475
$$ 60218 55224 51943 52579 48995 43601 46993 56287 54339 52505 44362 41379 37525 43677 56152
13165E6152J5132K2058J4162J7998K9829L1459M6805P1591R7988J56766K05383
$$ 56152 71284 93342 107504 125502 155331 186790 233595 305186 403174 559940 765323
13154G65323J90935P098k18229k27852j56481r7581o1505l2418j6158j0013j6557
$$ 765323 956258 963356 745127 517275 360794 263213 201708 169290 153132 143119 126562
13143A26562o031n293n878m194j770k177q060O526J4503K1331Q193j4918l0991
$$ 126562 120531 115238 109360 105166 103396 101219 93159 99685 114188 135519 143712 128794 97803
13130I7803j3808j0823j7510p949k087k128R46j088N258J9044J3124J2532J4516
$$ 97803 83995 73172 55662 47713 45626 43498 44444 43356 48614 67658 80782 93314 107830
13117A07830J8815K0368K5759L8835O7942J04614J44380J93608K09943O6536j86252
$$ 107830 126645 147013 172772 211607 279549 384163 528543 722151 932094 998630 812378
13106H12378k53570j85963j10101o7473k9526j7151j6357r273q73m999O17n414
$$ 812378 558808 372845 262744 195271 165745 148594 132237 122964 122091 117092 117709 112295
13094A12295n765j8331j3748q905j2946r048p79J054k844m401K032j486l203l202
$$ 112295 106530 88199 74451 65546 52600 43552 42773 43827 40983 36582 38614 37128 33925 30723
13080C0723J061M200P03k176O443P461N929P250O06K391Q132R797K0858M0178
$$ 30723 31784 35984 36687 34511 40954 48415 54344 61594 62200 64591 72723 82520 103378 143556
13066A43556M6209N4642P1138L3235l8094p7450p0516m5157k2233j6878l799n360
$$ 143556 189765 244407 315545 348780 310686 233236 162720 117563 95330 78452 74653 69293
13054F9293r082p600k508Q34n600o278J505O06J769p867J286N871k798o654j925
$$ 69293 60211 52611 50103 50937 45337 39059 40564 41170 42939 35072 36358 42229 39431 32777 30852
13039C0852J585p03L110l392n19O113J620m927J277M120R943J3682P312J3603
$$ 30852 32437 31734 34844 31452 30933 37046 38666 33739 35016 39136 49079 62761 70073 83676
13025H3676P995o374j8451j6454k228k176p371m343O843j756p770o848l112Q31
$$ 83676 91671 85297 66846 50392 48164 45988 38617 34274 41117 39361 31591 24743 21631 22462
13011B2462J161O676L327p76j437J047L218K62L401m959J039m0J860K338l827
$$ 22462 23623 30299 33626 32850 31413 32460 35678 35940 39341 34382 35421 35381 37241 39579 35752
12996C5752P30j363k226N526K625n955q909o713L175N350J2049L93l262L64O24
$$ 35752 36482 35119 32893 38419 41044 35089 26180 19467 22642 27992 40041 40434 37172 37536 38160
12981C8160J249j403n85K044K260O312K976P701O049P68k833q668j1592O80L288
$$ 38160 39409 38006 37421 39465 41725 48037 51013 58714 64763 65531 62698 54030 42438 43118 46406
12966D6406n375o159j561p53l47M890M143k429L123n401k446K533L655n985k767
$$ 46406 41031 34872 33311 32558 32211 37101 41244 38815 41938 36537 34091 36624 40279 34294 31527
12951C1527N14N434N522j701m132K545m118m741O23k739L95M636K809p273n069
$$ 31527 32041 37475 42997 41296 37164 39709 35591 30850 31473 28734 29129 33765 36574 29301 24232
12936B4232O352N472K38l556Q581K212k796m82j611M549K211l444k920k392j3661
$$ 24232 30584 36056 36294 32738 41319 43531 40735 40253 38642 43191 45402 41958 39038 36646 22985
12921B2985l281L588Q105L728N618K879P776k768j096m761n554M544Q866j847
$$ 22985 19704 23292 31397 35125 40743 43622 51398 48630 47534 42773 37219 41763 50629 48782
12907D8782n470n908r479K262Q038j272M72Q896L98O024k385n415m971m11m139
$$ 48782 43312 37404 27925 30187 38225 36953 37425 46321 46719 52743 50358 44943 39972 39561 35422
12892C5422n64J327l90o364L009R093m918j353J831L008M851N196R15N283M017
$$ 35422 34858 36185 35795 29431 32440 41533 36615 35262 37093 40101 44952 50148 51063 56346 60363
12877F0363N093O345J7106K4786R057k7293k4775j6343r957l174J2944k826j1438
$$ 60363 65456 71801 88907 113693 122750 95457 70682 54339 44382 41208 54152 51326 39888
12864C9888l007o345M028K269n64K53L813l914nj418k39n430P337K399m599j2141
$$ 39888 36881 30536 34564 36833 36269 36522 40335 36421 36416 34998 34759 29329 36666 39065 34466 22325
12848B2325k891N94K217M680J2104j174p586p572q690k656N645P088p8J84M810
$$ 22325 19434 20028 22245 26925 39029 37855 30269 22697 14007 11351 16996 24084 24006 24190 29000
12833B9000N933M812J814k192q46m505p492k658K049J527j0545k279K351M649
$$ 29000 34933 39745 41559 39367 38521 34016 26524 23866 25915 27442 16897 14618 16969 21618
12819B1618K676j824L001m780r22j564m90L858K471m322M331m869J323R454k949
$$ 21618 24294 22470 25471 20691 19769 18205 17715 21573 24044 19722 24053 19184 20507 29961 27012
12804B7012O89o759M913J4330K522q96J278j104o205j1736J403K424L344j207
$$ 27012 27701 20942 25855 40185 42707 41811 43089 41985 35780 24044 25447 27871 31215 30008
12790C0008N448J5m617j539P77L884O686m098q469k033K136k956m242O677M512
$$ 30008 35456 35471 30854 29315 30092 33976 40662 36564 28095 26062 28198 25242 21000 27677 32189
12775C2189L43o674j746M120L729k920m809L558K921k04M956J715j0818k394Q560
$$ 32189 32532 25858 24112 28232 31961 29041 24232 27790 30711 30507 35463 37178 26360 23966 32526
12760C2526J109J414J823p297J991K413l88m977K7N147K285Qj257l5J090m38l17
$$ 32526 33635 35049 36872 29575 31566 33979 33591 28614 28641 33788 36073 36081 34824 34789 35879 35441 35124
12743C5124J460m244j114j822K63K036k413o253N060M890L437J769J045M085k246
$$ 35124 36584 32340 31226 29404 29667 31703 29290 23037 28097 32987 36424 38193 39238 43323 41077
12728D1077J691j628m067l969M95L2l935J238l057N814L968l298O001M998k797
$$ 41077 42768 41140 37073 33104 33599 33631 29696 30934 27877 33691 37659 34361 40362 45360 42563
12713D2563r730m089L067l409k214J312Q54J800J479o712L920M599j338J524o703
$$ 42563 32833 28744 31811 28402 26188 27500 28354 30154 31633 24921 28841 33440 32102 33626 26923
12698B6923j038p5P28l035o110J102p93O395L589K720J377L717l02p759m895K659
$$ 26923 25885 25810 26538 23503 17393 18495 17702 24097 27686 30406 31783 35500 35198 27439 22544 25203
12682B5203L937K759M914M66J577j054M432J0425K697j088l517m682J028k490
$$ 25203 29140 31899 36813 37279 38856 37802 42234 52659 55356 54268 50751 46069 47097 44607
12668D4607j667p122j946Q914L624M91J204j382m378M281J201l573l534l204N34
$$ 44607 42940 35818 33872 42786 46410 46901 48105 46723 42345 46626 47827 44254 40720 37516 38050
12653C8050N934M561o407n494M401J668O353P706O285j06j778p908n848L845M30
$$ 38050 43984 48545 42138 36644 41045 42713 49066 56772 63057 62951 61173 53265 47417 51262 51692
12638E1692n165N959M593l684m322p49k525k169N429N567M148J382p406j946J208
$$ 51692 46527 52486 57079 53395 49073 48324 45799 43630 49059 54626 58774 60156 52750 50804 52012
12623E2012q03K116L530m567K890N08k85m89J574m94K024N850O634J101P517J578
$$ 52012 51209 53325 56855 52288 55178 55686 55401 54912 56486 55992 58016 63866 70500 71601 79118 80696
12607H0696O190J0123J3296J4123J7835K5674L6102M1972M5943L7187J6488j8926
$$ 80696 86886 97009 110305 124428 142263 167937 204039 246011 291954 329141 345629 326703
12595C26703n3823n2570l7349k6716j8089j3778j5028k49N314l463r330q956p350
$$ 326703 272880 220310 182961 156245 138156 124378 109350 109101 114415 110952 101622 92666 85316
12582H5316n506j647r0R8J211M508J912l025j238j671r01l790N592l475m523J931
$$ 85316 79810 78163 78073 78171 79382 83890 85802 82777 81539 79868 78967 75177 80769 77294 72771 74702
12566G4702N015R61N53l103m15K24j634j171M404K416K000N409J2616J1230J5120
$$ 74702 79717 80678 81231 78128 77713 77937 76303 75132 79536 81952 83952 89361 101977 113207 128327
12551A28327K5769K6309K3990K4519P423j6800k6767k2834j4384n506m149k090
$$ 128327 154096 180405 204395 228914 236337 219537 192770 169936 155552 150046 145897 143807
12539A43807m705q735j0691o061J925q18j828j559k206O262O612k347N059L85
$$ 143807 139102 130367 119676 113615 115540 114722 112894 111335 109129 115391 122003 119656 124715 125100
12525A25100K39J1951J5804J0657J2603J8047J1475J3933L1502M8713O4663O5909
$$ 125100 125339 137290 153094 163751 176354 194401 205876 219809 251311 300024 364687 430596
12513D30596P1232J17662K15906L17479M56088N13925J82546m14120n84494m21710
$$ 430596 501828 619490 835396 1152875 1608963 2122888 2305434 1891314 1306820 885110
12503H85110k55153j52131r4774n9127l7287k9342j9045j1180j2309j1522j2099
$$ 885110 629957 477826 383052 323925 286638 257296 238251 227071 214762 203240 191141
12492A91141j1167j1075J807Q523J2152J9279K5371J6511q872m4133k6806j6570
$$ 191141 179974 168899 170706 179229 191381 210660 236031 252542 243670 199537 172731 156161
12480A56161r317j865J2205J9058K5350L3474M4293M9991J8299m531R016J720
$$ 156161 146844 144979 157184 176242 201592 235066 279359 329350 347649 343118 352134 353854
12468C53854j7485k3732j1392P372O876j0860l9229m4278l6917l0853k1850k0220
$$ 353854 336369 312637 301245 308617 315493 304633 265404 221126 184209 153356 131506 111286
12456A11286q702l231r7k72J127J584K936J151J426j336R13m0o468o897p821m342
$$ 111286 102584 99353 99256 98984 100111 101695 104631 105782 107208 105872 106785 106745 100277 93380 85559 81217
12440H1217o187j66j84O345L687J061n277k169K431R47N098J204R229J5505J2090
$$ 81217 75030 74864 74680 81025 84712 85773 80496 78327 80758 81705 86803 88007 97236 112741 124831
12425A24831m942j7333j5561j1593l367K560J034n902k841P147L902Q590J0386
$$ 124831 119889 102556 86995 75402 72035 74595 75629 69727 66886 74033 77935 86525 96911
12412I6911j055m798q144l377M551j645l933m059N8P14k746l146o081K366K502
$$ 96911 95856 91058 82914 79537 84088 82443 78510 74451 74509 75223 72477 69331 63250 65616 68118
12397F8118j14M27n13k146J0R412L721L663M51j1793q224j556M942P434M799R171
$$ 68118 68004 68431 67918 65772 65782 75194 78915 82578 83029 71236 63012 61456 66398 73832 78631 87802
12381H7802J71j1383j3085k697L667P146M371m140L063m145j0733l143P033O490
$$ 87802 87973 76590 63505 60808 64475 71621 75992 71852 74915 70770 60037 56894 63927 70417
12367G0417L734m85M425m561o982j584l504j917L67Q074l065J253N555j899l370
$$ 70417 74151 73666 78091 73530 66548 64964 61460 59543 59910 67984 64919 66172 71727 69828 66458
12352F6458L717O975K757k817j5321n524J97M249O332k832m019l123n079r469
$$ 66458 70175 77150 79907 77090 61769 56245 56442 60691 67023 64191 60172 57049 51970 42501
12338D2501k347L325N785j600Q268N120R07j113l729k634k720j368j717l990J1167
$$ 42501 40154 43479 49264 47664 55932 61052 61959 60846 57117 54483 51763 50395 48678 44688 55855
12323E5855N984k43O519m199K469P229n172q210j06K094K018Q03J919Q237P506
$$ 55855 61839 61596 68115 63916 66385 73614 68442 60232 60126 62220 64238 65041 66960 75197 82703
12308H2703J520N072K3021O267j9752k3844j4866n693m692L125K186O55k076o90
$$ 82703 84223 89295 112316 118583 98831 74987 60121 54428 49736 52861 55047 55702 53626 52936
12294E2936P925o699J164O317m426n288j31k225J197L873j527m100R24j501J019
$$ 52936 60861 54162 55326 61643 57217 51929 51798 49573 50770 54643 53116 49016 49940 48439 49458
12279D9458k617n384p68j027l50j539k66R581L132k098M255R268l514k591o545
$$ 49458 46841 41457 40689 39662 39312 37773 37507 47088 50220 48122 52377 61645 58131 55540 48995
12264D8995j232k011J156q550J838M689l129r158j465L491M911M656k574n63M14
$$ 48995 47763 45752 46908 38358 40196 44885 41756 32598 31133 34624 39535 44191 41617 41054 41468
12249D1468L863M941J136n317n86L665K832k639l76K861L81K042k974o172L677
$$ 41468 45331 50272 51408 46091 45505 49170 52002 49363 48987 51848 52229 54271 51297 45125 48802
12234D8802Q305N989P94P422O33m758j0932n152K429m2j546l287l285o547j609
$$ 48802 57107 63096 63890 71312 71945 67187 56255 51103 53532 53490 51944 48657 45372 38825 37216
12219C7216R103J701N681j383K981o222n942P192J913j080m161m355R57L2R97
$$ 37216 46319 48020 53701 52318 55299 49077 43135 50327 52240 51160 46999 42644 43601 43633 44630
12204D4630M035P97n070k8J401m56L581jk296R93O44K221J3092m130p206k255
$$ 44630 48665 49462 44392 44364 45765 45309 48890 48889 46593 47586 48230 50451 63543 59413 52207 49952
12188D9952J0321P592l046r993o745K78N150O168k783q054m655j200k77K193J989
$$ 49952 60273 67865 64819 54826 48081 48359 53509 59677 56894 48840 44185 42985 42708 44901 46890
12173D6890L971K004R67m444q22l513n436M165J0800j591r237O91r68l894N159
$$ 46890 50861 52865 53832 49388 48566 45053 39617 43782 54582 52991 43754 44445 43477 39583 44742
12158D4742J587R16J091Q35n03N68R2N008O028M463l506j3142l7M194Q42k175
$$ 44742 46329 47245 48336 49171 48668 49236 49328 54336 60364 64827 61321 48179 48142 52336 53178 51003
12142E1003n572Q162O206N59K989R86o692m453O221O144k405m139j342p19J835
$$ 51003 45431 53593 59799 60358 63347 64333 57641 53188 59409 65553 63148 59009 57667 56948 58783
12127E8783j77O1j215k022K934K702N41K354j395J484l986K819Q77j0778m110
$$ 58783 58606 58667 57452 55430 58364 61066 61607 63961 62566 64050 60064 62883 63760 52982 48872
12112D8872P87j354K064K206J939M327K392J0437M533N484j4946j0493J1674M604
$$ 48872 49659 48305 50369 52575 54514 58841 61233 71670 76203 81687 66741 56248 67922 72526
12098G2526j3621k2612P593K353m75L595P48L564L548j511L793r34l69K826K818
$$ 72526 58905 36293 43886 46239 45764 49359 50107 53671 57219 55708 59501 58567 58198 61024 63842
12083F3842N542K725K698j788n117O872k809J271R296N622j3217p615l675N733
$$ 63842 69384 72109 74807 73019 67902 74774 71965 73236 82532 88154 74937 67322 63647 69380
12069F9380Q37K297l44o738P010L443J304M437n178l510r041l601n86k808L743
$$ 69380 70217 72514 72170 65432 72442 75885 77189 81626 76448 72938 63897 60296 59710 56902 60645
12054F0645Q329J0010O966k996n187J625L429N958n206o993L418J264N392R94
$$ 60645 68974 78984 85950 82954 77767 79392 82821 88779 83573 76580 79998 81262 86654 87648
12040H7648p158j632O222K843P40p86K935L675k890m05k905j0572j1521o238L550
$$ 87648 80490 78858 85080 87923 88663 87877 90812 94487 91597 91192 88287 77715 66194 59956 63506
12025F3506J02J155J952r21l706m084N185N785l060K416J110m934k937m35K668
$$ 63506 63608 64763 66715 65794 62088 58004 63189 68974 65914 68330 69440 64506 61569 61134 63802
12010F3802R259N704p775m640P585O311M42M513k304l311K304O52j693l251j092
$$ 63802 73061 78765 70990 66350 73935 80246 80688 85201 82897 79586 81890 82542 80849 77598 76506
11995G6506J122r21l18k384k635p90M191m701o621R28M967K526K041J470M088
$$ 76506 77628 76707 76389 74005 71370 70580 74771 70070 63449 64377 69344 71870 73911 75381 79469
11980G9469k903l035j008r23P495O186n607k984K671J570K970j837j983K055l111
$$ 79469 76566 73531 72523 71600 79095 85281 79674 76690 79361 80931 83901 82064 80081 82136 79025
11965G9025P0o97k365K67P121N245L303P172r97l360o092k665k715l1l192L007
$$ 79025 79095 78398 76033 76300 83421 88666 91969 99141 98144 94784 88692 86027 83312 83281 80089 83096
11949H3096j688k237j785L389Q929K466Qk713J581O119l547j126O096N364m213
$$ 83096 81408 79171 77386 80775 89704 92170 92178 89465 91046 97165 93618 92492 98588 103952 99739
11934I9739q873l566m517l623o35J320N838m391j1201P715O594K82J579m78l647
$$ 99739 90866 87300 82783 79160 78525 79845 85683 81292 70091 77806 84400 84682 86261 85783 82136
11919H2136L352M558j978K231j134p53j42M545n31o973k127j039Q782O125j0112
$$ 82136 85488 90046 88068 90299 89165 88412 88270 92815 92284 85311 83184 82145 90927 97052 86940
11904H6940l103k18M114N332O260r87j361k999M136O85q795l529L742N683J878
$$ 86940 83837 83619 87733 93065 99325 98338 96977 93978 98114 98799 90004 86475 90217 95900 97778
11889I7778n385m508L246L987m23L633p83n144K912L965K94M428r32o03N605L711
$$ 97778 92393 87885 91131 95118 94695 98328 97545 92401 95313 99278 99572 104000 103068 102465 108070 111781
11873A11781J717P325J169n430M97k185j013K042l52L77P521M566l903l793M55
$$ 111781 113498 120823 121992 116562 117059 114874 113861 115903 115551 115928 123449 128015 124112 120319 120774
11858A20774N166j661J947O848M010o935M51P91P63k7P30j548n821o358m047k813
$$ 120774 125940 124279 126226 133074 137084 130149 130600 131391 132154 132127 132857 131309 125488 119130 115083 112270
11842A12270l901L405K492K67O448n266m201p99J62O760K3l214J118m29k023O084
$$ 112270 108369 111774 114266 114533 120981 115715 111514 110715 110877 117637 117660 114446 115564 115135 113112 119196
11826A19196M158J735J5641O317L208M072M814M689J562P107L720M327l544J737
$$ 119196 123354 125089 140730 147047 150255 154327 159141 163830 165392 172499 176219 180546 177002 178739
11812A78739p68p894p667M01N268j984l761l953Q27n365j263k87P39K366q835
$$ 178739 177971 170077 162410 162811 168079 166095 162334 158381 159208 153843 152580 152293 153032 155398 146563
11797A46563l405k36J16n161P112L356o6j12K848n884j644J361K432K862K970
$$ 146563 143158 142922 143038 137877 144989 148345 148279 148167 151015 145131 143487 144848 147280 150142 153112
11782A53112m409M752J2947O274l363l579r92J338K609Q209R828N168R313O291
$$ 153112 148703 153455 166402 172676 169313 165734 164742 166080 168689 176898 186726 191894 201207 207498
11768B07498J625J830L019J255P910j684p691j2355k520m592k226O049M693K083
$$ 207498 209123 210953 213972 215227 223137 221453 213762 201407 198887 194295 192069 198118 202811 204894
11754B04894J0260Q319P216L782L30O880O197l812m239p794m72m205j5495j0233
$$ 204894 215154 223473 230689 234471 234801 241681 247878 244066 239827 232033 231561 227356 211861 201628
11740B01628M216m76n659j10r64o49R67N707J0551J3833J8831J0311R042O921
$$ 201628 205844 205368 199709 199599 198635 197986 198953 204660 215211 229044 247875 258186 267228 274149
11726B74149j717O643r89r911j0511j1327j1264j3825j7204q932n408n436n310
$$ 274149 272432 279075 278086 268175 257664 246337 235073 221248 204044 195112 189704 184268 178958
11713A78958l239k683M755P101j0329K66O45j455M353L053J631j896K651k483
$$ 178958 175719 173036 177791 184892 174563 174829 175474 174019 178372 181425 183056 181160 183811 181328
11699A81328j1155k211m012J2873J2539K991P885J436j720J188J865O378Q353
$$ 181328 170173 167962 163950 176823 189362 192353 200238 201674 199954 201142 203007 209385 217738
11686B17738J8286J7213J5181K414J0156J6203J7072J3972Q934N163O080n417
$$ 217738 236024 253237 268418 270832 280988 297191 314263 328235 337169 342332 348412 342995
11674C42995j649K074p098j3864q410j1314j2994r844n775m546p942m625r211
$$ 342995 341346 343420 336322 322458 314048 302734 289740 279896 274121 269575 261633 257008 247797
11661B47797j1714k0059j8233q063P00p776j0545l126j253k225q01m203k549N203
$$ 247797 236083 216024 197791 189728 190428 182652 172107 168981 167728 165503 164702 160499 157950 163153
11647A63153Q437L099O355Q34J605L232K988J092m449L680l438m584r451p033
$$ 163153 171590 174689 181044 181878 183483 186715 189703 190795 186346 190026 186588 182004 172553 165520
11633A65520M359N840k907k849L08R73O275P226Q550J780p522o132Q27J023K134
$$ 165520 169879 175719 172812 169963 170271 171244 177519 184745 193295 195075 187553 181421 182248 183271 185405
11618A85405K152l7L50L355J858o528p253l696K284J450j343k338k56m427k550
$$ 185405 187557 187520 187870 191225 193083 186555 179302 175606 177890 179340 177997 175659 175403 170976 168426
11603A68426j330n699q205k387J218k340J605J040j639N534J361k073r60j765
$$ 168426 167096 161397 153192 150805 152023 149683 151288 152328 150689 156223 157584 155511 154551 152786
11589A52786l708n938n255m504p12m093n579k809k333j215l179p31L738N269o56
$$ 152786 149078 143140 137885 133381 132669 128576 122997 120188 117855 116640 113461 112730 116468 121737 121081
11574A21081l513p30O8K086N654L16n684l726l084l289j813m262j0098n134K560
$$ 121081 117568 116838 116906 118992 124646 124962 119278 115552 112468 109179 107366 103104 93006 87872 90432
11559I0432M540M805m011O43P541j450o554M42m299L14K21p424K327L22n048m271
$$ 90432 94972 99777 95766 96409 103950 102500 95946 96388 92089 92403 92624 85200 87527 87849 82801 78530
11543G8530N609J793L538m498J1951K777n547K232o432q387j663Q24l29m638k390
$$ 78530 84139 85932 89470 84972 96923 99700 94153 96385 89953 81566 79903 80727 80398 75760 73370
11528G3370J779p875n222O92P533R030O406j085n012j164j421L38k156m498m159
$$ 73370 75149 67274 62052 62744 70277 79307 85713 84628 79616 78452 77031 77369 75213 70715 66556
11513F6556L531k406J589O926n309p395N412J90N933M106K409p172k950l140r421
$$ 66556 70087 67681 69270 76196 70887 63492 68904 69094 75027 79133 81542 74370 71420 68280 58859
11498E8859r203l294j614K024J1475N789k863r688Q151M797p186J199O820j338
$$ 58859 49656 46362 44748 46772 58247 64036 61173 51485 59636 64433 57247 58446 65266 63928
11484F3928k517M443r43j200OK938L169n610o770P165L620J786m835l917L650
$$ 63928 61411 65854 64911 63711 63717 66655 69824 64214 57444 64609 68229 70015 65180 61263 64913
11469F4913M461J649k107J601m645N27J382l093j0457K356K420N69J779j00O336
$$ 64913 69374 71023 68916 70517 65872 66399 67781 64688 54231 56587 59007 59576 61355 61255 67591
11454F7591L624M763k197j452k051p7R7j550p4J020q72r049o451l342J530J0454
$$ 67591 71215 75978 73781 72329 70278 70201 70298 68748 68674 69694 68822 59773 53322 49980 51510 61964
11438F1964L70q051J627P681M026k275l202J674K210p671L956P27j366N082P96
$$ 61964 62334 54283 55910 63591 67617 65342 62140 63814 66024 58353 62309 63036 61670 66752 67548
11423F7548O91J973J205o694M019K008j633j237O010L759m69m101k617j937l13
$$ 67548 68239 70212 71417 64723 68742 70750 69117 67880 73890 77649 77180 73079 70462 68525 68212
11408F8212j951K319M783J658j982N016o24K618l967j70j831M526J1026k307l681
$$ 68212 66261 68580 73363 75021 73039 78055 77431 80049 76082 75912 74081 78607 89633 87326 83645
11393H3645Q22n7m833o422l989k470P941M624M584M581o948R79N03n691L275P349
$$ 83645 84467 84410 79577 73155 69166 66696 74637 79261 83845 88426 81478 82457 82960 77269 80544 87893
11377H7893J63M840J339K917j254M140M896m228L554k506k970j830P74k29J194
$$ 87893 88056 92896 94235 97152 95898 100038 104934 100706 104260 101754 98784 96954 97728 97499 98693
11362I8693n882N7j946n795q620K005J679J462l555J628J019J717K12p552q50
$$ 98693 92811 92868 90922 85127 76507 78512 80191 81653 78098 79726 80745 82462 82674 75122 74272
11347G4272K112K409j139K161L528k724L46L837n175L861j891l563R49j085j500
$$ 74272 76384 78793 77654 79815 83343 80619 80965 84802 79627 83488 81597 78034 78983 77898 76398
11332G6398j276L103R763k360l424R50M600o99n194j975l316Q753M949k562J64
$$ 76398 75122 78225 87988 85628 82204 83154 87754 87055 81861 79886 76570 85323 90272 87710 87874
11317H7874P626O615L43o588k66l848m337j966P74M792j042p54k864k797q354
$$ 87874 95500 102115 102458 95870 95604 91756 87419 85453 86227 91019 89977 89223 86359 83562 75208
11302G5208m48m473j222l878l560L268M067K4j300J396l43K537L758P18o480r356
$$ 75208 74760 70287 69065 65187 61627 64895 68962 68986 67686 69082 68739 71276 75034 75752 69272 59916
11286E9916l32J99P898L187J613j054k333l252O106N665J558P08p98l696j3724
$$ 59916 59584 59783 67681 70868 72481 71427 69094 65842 71948 77613 79171 79879 79081 75385 61661
11271F1661p660N694R662M187N531K338m489l364k752K103L18J186m784q914j544
$$ 61661 54001 59695 69357 73544 79075 81413 76924 73560 70808 72911 73229 74415 69631 60717 59173
11256E9173n184k436k862K792l206k225N146M672k193o350N68O383P351l03M258
$$ 59173 53989 51553 48691 51483 48277 46052 51198 55870 53677 47327 47895 54278 61629 61326 65584
11241F5584k477q165q254p756j942K237N067O525L671N097M184k800Q25m944o771
$$ 65584 63107 54942 46688 38932 36990 39227 44294 50819 54490 59587 63771 60971 61796 56852 50081
11226E0081o83L336J168m062K3Q146L155n390k436k305k553p76J004l387l967
$$ 50081 49398 52734 53902 49840 49863 58009 61164 55774 53338 51033 48480 47704 48708 45321 41354
11211D1354j629J818M585P622j591j778N069Q76o154k459M951m597N891L503R30
$$ 41354 39725 41543 46128 53750 52159 50381 55450 56326 50172 47713 52664 48067 53958 57461 58391
11196E8391l001l087R92l389n63O684J679j95N504J7216J8815K1456J5984J4012
$$ 58391 55390 52303 53295 49906 49343 56027 57706 57511 63015 80231 99046 120502 136486 150498
11182A50498N911m24j0037j5711j9918j7124j4409n497P86n743o878r190k851
$$ 150498 156409 155985 145948 130237 110319 93195 78786 73289 74075 68332 61454 52264 49413
11169D9413l95n79k529N60N739K664m325Q25Q12L423j527K221P039L070l093o571
$$ 49413 49018 48439 45910 46470 52209 54873 50548 51373 52185 55608 54081 56302 63341 66411 63318 56747
11153E6747l893O980L049L459q581j474n95J802O547M076o99k644o277J413o36
$$ 56747 52854 59834 62883 66342 57761 56287 55692 57494 64041 68117 67418 64774 58497 59910 59274
11138E9274k346J214j585m967Q99K920O77L832J466l509J847O921k636n523j160
$$ 59274 56928 58142 56557 51590 52489 55409 56086 59918 61384 57875 59722 66643 64007 58484 57324
11123E7324K511P28J799P66P567l49M096l372q993l660J113j698j995K741L947
$$ 57324 59835 60563 62362 63128 70695 70346 74442 71070 62077 58417 59530 57832 55837 58578 62525
11108F2525m766P30O427l476j552p8m472q856O530P365j842K04K744J414n747
$$ 62525 57759 58489 64916 61440 59888 59810 55338 46482 53012 60377 58535 58739 61483 62897 57150
11093E7150n763o490K798l917m90P943J4563J163K639o767n582K628K450M834
$$ 57150 51387 44897 47695 43778 43288 51231 65794 66957 69596 62829 57247 59875 62325 67159
11079F7159M14m1r974r544J673K207O336K958L983q443k162M500O064k22L90l172
$$ 67159 67573 67532 57558 48014 49687 51894 58230 61188 65171 56728 54566 59066 65130 64908 65298 62126
11063F2126j012r295n141J644R453J37j411L869M214l766N76j954j422L730K441
$$ 62126 61114 51819 46678 48322 57775 57912 56501 60370 64584 60818 61394 59440 58018 61748 64189
11048F4189m200p698n36L76N817K070o09J019k972o998k405L969L500q463n209
$$ 64189 59989 52291 51755 52131 57948 60018 59409 60428 57456 50458 48053 52022 55522 47059 41850
11033D1850R383J0408P00M9L707k85K725p53m927n911l681L15R065L603l102n816
$$ 41850 51233 61641 62341 62390 66097 65812 68537 67784 62857 56946 53265 53580 62645 66248 63146 57330
11017E7330m610j372p66q718m895M574Q894L039M411M053k462j610m835n943r67
$$ 57330 52720 51348 50582 41864 36969 41543 50437 53476 57887 61940 59478 57868 53033 47090 46123
11002D6123K104L522L435P31m873N999L351l495j941Q83M714K786k571R532P615
$$ 46123 48227 51749 55184 55915 51042 57041 60392 56897 54956 55839 60553 63339 60768 70300 77915
10987G7915j942p004o41o811p206K550j428j828L033J176L894M449M339m793l611
$$ 77915 75973 68969 68328 61517 54311 56861 55433 53605 56638 57814 61708 66157 70496 65703 62092
10972F2092O846M023k706m15l90M697J061l454n693l236j247L007O70m431l639
$$ 62092 68938 72961 70255 69840 69450 74147 75208 71754 66061 62825 61578 64585 65255 60824 57185
10957E7185j15%O694K088L635P761O049O506p877j154m44p72q240m682J1131J315
$$ 57185 57070 57070 63764 65852 69487 77248 83297 89803 81926 80772 80328 79556 71316 66634 77765 79080
10941G9080k241p834j22O087j398j0635m015R163J0098K147l401j077k501m547
$$ 79080 76839 69005 68883 74970 73572 62937 58922 68085 78183 80330 76929 75852 73351 68804
10927F8804p14J418r03l731j832j782l214q08n301N066J2153L338k7P562P050
$$ 68804 68090 69508 68605 64874 63042 61260 58046 57238 51937 57003 69156 72494 72467 80029 87079
10912H7079j162n95o03Q792L55j101m170j270o234p77O650Q196P570l851J063
$$ 87079 85917 85322 84719 93511 93866 92765 88595 87325 81091 80314 86964 95160 102730 98879 99942
10897I9942k762K392L464j996R327M667k957M249L265j0600j2252r679p358n606
$$ 99942 97180 99572 103036 101040 110367 115034 112077 116326 119591 108991 96739 87060 79702 74096
10883G4096k546l201J726r00j993O031K854R5k272N333M453J411m123l79N987
$$ 74096 71550 68349 70075 69175 67182 73213 76067 76162 73890 79223 83676 85087 80964 80585 86572
10868H6572L50M801K858N38p21o574L684L160L073Q364N412M263k014l812m096
$$ 86572 86922 91723 94581 95119 94398 87824 91508 94668 97741 106105 111517 115780 113766 109954 105858
10853A05858K416L849k189p723r191l083L32l63N459J344R77k662l365p596j357
$$ 105858 108274 112123 109934 102211 93020 89937 90269 89906 95365 96709 97686 95024 91659 84063 82706
10838H2706L708l591M4L53K388R155K868l842j3499q226j168N663l653L00P549
$$ 82706 86414 82823 82867 83220 85608 94763 97631 93789 80290 72064 70896 76559 72906 73206 80755
10823H0755K942q878K187K991O470n73k669M02K096p18n491K047O642N740O311
$$ 80755 83697 74819 77006 79997 86467 85894 83225 83627 85723 85005 79514 81561 88203 93943 100254
10808A00254o68m533Q38J857k72K386L000k563l143j0637p640j649j900J293M015
$$ 100254 99586 95053 95891 97748 97476 99862 102862 100299 97156 86519 78879 77230 75330 76623 80638
10793H0638p93o236l781L503l232k71K19k271o819m269N101L305o038m522P78
$$ 80638 79845 73609 69828 73331 70099 69828 70047 67776 60957 56688 61789 65094 59056 54534 55312
10778E5312Q51Q981M516j3556k063N246J371J012R8K679N270J47o509n146L11
$$ 55312 56163 65144 69660 56104 54041 59287 60658 61670 61768 64447 69717 69864 63355 58209 58520
10763E8520j462R458M77m265O177L846M09M607J942j341k6l407q88j43r797j0363
$$ 58520 57058 66516 66993 62728 68905 72751 73160 77767 79709 78368 78342 74935 74047 73904 64107 53744
10747E3744k187l625K319k720M547j37R324L138n356l513m170m664L507L867k953
$$ 53744 51557 47932 50251 47531 52078 51941 61265 64403 59047 55534 51364 46700 50207 54074 51121
10732E1121n49J645R25k218l800q68j470O758L143k053l350K398P007J01q133
$$ 51121 50572 52217 53142 50924 47124 46256 44786 51544 54687 52634 49284 51682 58689 58790 50657
10717E0657q451o069l736O37M319J290j5907o647P106J9326J0994p247m493j266
$$ 50657 42206 36137 32401 33038 37357 38647 22740 16093 23199 42525 53519 46272 41779 40513
10703D0513J4992M476n5q699j6910m200J0770P797n010P858K014m517K703k702
$$ 40513 55505 59981 59926 51227 34317 30117 40887 48684 43674 51532 53546 49029 51732 49030
10689D9030k94m625J108K277J601J21K164j811K288m655M430M457N660L412o453
$$ 49030 48736 44111 45219 47496 49097 49218 51382 49571 51859 47204 51634 56091 61751 65163 58710
10674E8710k416j441k038J3016K4543M557k728k681K3974L0162J8203j9095m4808
$$ 58710 56294 54853 52815 65831 90374 94931 92203 89522 113496 143658 161861 142766 97958
10661I7958k573j927n589j1597o196P93m068N030J7502J7357J7450K4549L5598
$$ 97958 95385 93458 87869 76272 70076 70869 66801 71831 89333 106690 124140 148689 184287
10648A84287K5358l3401m4617k1791j5528n815M257n2N854j823n654L6j127Q192
$$ 184287 209645 176244 131627 109836 94308 88493 92750 92698 98552 96729 91075 91111 89984 98176
10634I8176L809K1069Q729j9204j3727q601n832j2863p830j890m606l6L191l548
$$ 98176 101985 123054 131783 112579 98852 90251 84419 71556 63726 61836 57230 57194 60385 56837
10620E6837q533m393Q760P308L417p141L404J5261O783l351l342k861m834L563
$$ 56837 48304 43911 52671 59979 63396 56255 59659 74920 81703 78352 75010 72149 67315 70878
10606G0878O480Q507L040m469p72k383j046O654J355l978q826j2921p472j339
$$ 70878 77358 85865 88905 84436 83664 81281 80235 86889 88244 84266 75440 62519 55047 53708
10592E3708M224k26o695K705N44L810M667o646m561j11l137l438L300p39l870
$$ 53708 57932 57706 51011 53716 54260 58070 62737 56091 51530 51419 48282 44844 48144 47405 43535
10577D3535J581N616Q889L251o476r978l79J942J94M017J88n13o672n384K658
$$ 43535 45116 50732 59621 62872 56396 46418 46039 47981 48175 52192 52380 51867 45195 39811 42469
10562D2469L762L471O917N076m936j1016n1O602O073l383j2460j624P203J924
$$ 42469 46231 49702 56619 61695 56759 45743 45692 52294 58367 54984 42524 40900 48103 50027
10548E0027l491l887o82R56j949m010K999P747K66j611n123q050k848Q567n01
$$ 50027 46536 42649 41967 42923 40974 36964 39963 47710 47976 46365 41242 33192 30344 38911 38410
10533C8410O288L613k781m874n390j375l605k748R149N189m930l96J538l111r48
$$ 38410 44698 48311 45530 40656 35266 33891 30286 27538 36687 41876 36946 36550 38088 34977 34029
10518C4029j867L641M947R64r394o074K646O726J1405k364o475J144J730j161
$$ 34029 32162 35803 40750 41714 32320 26246 28892 35618 47023 44659 38184 39328 41058 39897
10504C9897R17J672m472n427m332l018N383J028N88J922l721P998K480n515n994
$$ 39897 40814 42486 38014 32587 28255 25237 30620 31648 32236 34158 30437 38435 40915 35400 29406
10489B9406l742l625L887O194M165l577R95L710o36m348M281K361k211N33N320
$$ 29406 25664 22039 25926 32120 36285 32708 33703 37413 36777 32429 36710 39071 36860 37393 42713
10474D2713n438p210k156P18P24M165m910L579L886J644m213m833K101K289L826
$$ 42713 37275 30065 27909 28627 29351 33516 28606 32185 36071 37715 33502 28669 30770 33059 36885
10459C6885O698k859m583q279R69P162n53N213M310K173k343j446q88K053n619
$$ 36885 43583 40724 36141 27862 28831 35993 35440 40653 44963 47136 44793 43347 42459 44512 38893
10444C8893q12J264K344K285p129J092l106K899j809j080m408J683k026k108L241
$$ 38893 38081 39345 41689 43974 36845 37937 34831 37730 35921 34841 30433 32116 30090 27982 31223
10429C1223k152Q68j219J3j695J089P9J202K474m8J226J073J10k806n225K424
$$ 31223 29071 29939 28720 28733 27038 28127 28206 29408 31882 31834 33060 34133 34243 31437 26212 28636
10413B8636Q66o303n575K720P790O318M12P96J736o551k287P883J828J634j502
$$ 28636 29502 23199 17624 20344 28134 34452 34864 35660 37396 30845 28558 36441 38269 39903 38401
10398C8401j714P19M502K850K58k2m135j4673j1074L479J91n585M669J0641k183
$$ 38401 36687 37406 41908 44758 45016 44994 40859 26186 15112 18591 18782 13197 17866 28507 26324
10383B6324o977m473M721K057k044N760M290J174L883l730n073L50k190L652M239
$$ 26324 19347 14874 19595 21652 19608 25368 29658 30832 34715 30985 25912 26262 24072 27724 31963
10368C1963l459n452p527j119J332O3q98M066J3423L60q946j938J398K101j956
$$ 31963 28504 23052 15525 14406 15738 15801 14903 18969 32392 32752 23806 21868 23266 25367 23411
10353B3411N396k943j241J016P67k965j561m854K446P358K650M435k848j654n557
$$ 23411 28807 25864 24623 25639 26406 23441 21880 17026 19472 26830 29480 33915 31067 29413 23856
10338B3856p693J106J1444O56n63p372j0109M76O912O266p516q20R002M082k994
$$ 23856 16163 17269 28713 29369 28806 21434 11325 11801 18713 24979 17463 16643 25645 29727 26733
10323B6733P056L743r525Q39J215N121k875l265Q24M399O725o704m054r265n458
$$ 26733 33789 37532 28007 28846 30061 35182 32307 29042 29866 34265 40990 34286 30232 20967 15509
10308A5509k750J465N684j891K073l045M576J085M587L486M6K656P73J369k357
$$ 15509 12759 14224 19908 18017 20090 17045 21621 22706 27293 30779 30825 33481 34254 35623 33266
10293C3266k034N040R55O37M353J4133J4873N586R284J2221J2926J0554Q892M443
$$ 33266 31232 36272 37227 37864 42217 56350 71223 76809 86093 98314 111240 121794 130686 135129
10279A35129l741p050j1738q976j7283j6112j3721o131l133k424j0283k563j927
$$ 135129 131388 124338 112600 103624 86341 70229 56508 50377 47244 44820 34537 31974 30047
10266C0047k053J32M422p837p01j143j693J388N913m79J823j974o716l333l204
$$ 30047 27994 28126 32548 24711 24010 22867 21174 22562 28475 27996 29819 27845 21129 17796 14592
10251A4592L511o9J275j965L532m9m416M34p817M439M168K821l11k408Q5m07m993
$$ 14592 18103 18034 19309 17344 20876 20827 16411 16845 9028 13467 17635 20456 20145 17737 17822 17415 12422
10234A2422J90J568j355K596L413j164m278R208N480m270l552n28k80J086K329
$$ 12422 12612 14180 12825 15421 18834 17670 13392 22600 28080 23810 20258 19730 19450 20536 22865
10219B2865L877j448J271O052k530j0393l077J64K847l284l794J787P272M336
$$ 22865 26742 25294 26565 32617 30087 19694 16617 16781 19628 16344 12550 14337 21609 25945
10205B5945k104q762k288Q35j095j590O566M402L458L036q594K358m866j7N891
$$ 25945 23841 15079 12791 13626 12531 10941 17507 21909 25367 28403 19809 22167 17301 17284 23175
10190B3175M89J406k309p876r491j20R043L426L471l161L15Q649N0l37L118M455
$$ 23175 23664 25070 22761 14885 5394 5274 14317 17743 21214 18053 18368 27017 27067 26730 29848 34303
10174C4303o443K124J479l230O015Q528O33L22J705r138m059L570n00R1j046p258
$$ 34303 27860 29984 31463 28233 34248 42776 43409 43731 45436 36298 32239 35809 35309 35400 34354 27096
10158B7096J479R670OK017R073J6241K3434J1941p234k1960j1170j759M999J4160
$$ 27096 28575 38245 38251 40268 49341 65582 89016 100957 93723 71763 60593 58834 63833 77993
10144G7993K3519k98k9462k0612j6562j3023m879j874K928Q385l004k492n216
$$ 77993 101512 101214 71752 51140 34578 21555 16676 14802 17730 26115 23111 20619 15403
10131A5403p81L722L064J516k499r096l668M651l826n76N89q38J329L553K998
$$ 15403 14622 18344 21408 22924 20425 11329 7661 12312 8486 7910 8499 7661 8990 12543 15541
10116A5541J677j906K260K613J144N51O783K736m710M24K608K793l926o00O07
$$ 15541 17218 15312 17572 20185 21329 21880 28663 31399 26689 27113 29721 32514 28588 27988 28595
10101B8595m922l787n031N45J915L83N556K636R835M381R497O509l218m031j256
$$ 28595 23673 19886 14855 15400 17315 17698 23254 25890 35725 40106 49603 56112 52894 48863 47607
10086D7607l748P38L998m1q605r127K224K132k605l766r290j5P340j577j135K588
$$ 47607 43859 44597 48595 48554 39949 30822 33046 35178 32573 28807 19517 19502 26842 25265 24130 26718
10070B6718l74M157j255m554J41k704J950J616l46o111o372K726k593j365J983
$$ 26718 26344 30501 29246 24692 24833 22129 24079 25695 25349 19238 12866 15592 12999 11634 13617
10055A3617K559R26N950j960j970o449k913j779n14K429O327J224L373N689p628
$$ 13617 16176 17102 23052 21092 19122 12673 9760 7981 7467 9896 16223 17447 20820 26509 18881
10040A8881m503m644J358J0130n88l492m144l601n104K185J654M039J0007Q58
$$ 18881 14378 9734 11092 21222 20634 17142 12998 9397 4293 6478 8132 12171 22178 23036
10026B3036R163P82o394k658R392P174J73o756K953R825J0635J0195m425m523
$$ 23036 32199 32981 26587 23929 33321 40495 40668 33912 36865 46690 57325 67520 63095 58572
10012E8572O287J4064N583J1234K4570K4558M2283N4175P9622J37711K43617M03173
$$ 58572 64859 78923 84506 95740 120310 144868 187151 241326 320948 458659 702276 1105449
10000A105449O71617J090619R40891q85687j307481o83994l27381j75351j11531
$$ 1105449 1777066 2867685 3808576 2922889 1615408 931414 604033 428682 317151
9991C17151o7179m1441m2474k9526j8450k1798k0824j7427j1214J97L358O259
$$ 317151 249972 208531 166057 136531 118081 96283 75459 58032 46818 47015 50373 56632
9979E6632M045o781j0482p055l093j177k930Q151J488l646l142m210L343m558
$$ 56632 60677 53896 43414 36359 33266 32089 29159 37310 38798 35152 32010 27800 31143 26585
9965B6585n474L261J549q048K528P707M34j271J608k879L564Q683R312R738J3390
$$ 26585 21111 24372 25921 17873 20401 28108 28542 27271 28879 26000 29564 38247 47559 57297 70687
9950G0687J2135P435K9312M4576O6498R9529J29629N8716q9022j39553j08550
$$ 70687 82822 90257 119569 164145 230643 330172 459801 518517 429495 289942 181392
9939A81392o6979l3642j1316j1481j4931j0069j0969k672L783k805j355j071N294
$$ 181392 114413 80771 69455 57974 43043 32974 22005 19333 23116 20311 18956 17885 23179
9926B3179l731o854k771j762M963l62j500k356L88j2152k698L435K073K883J611
$$ 23179 19448 12594 9823 8061 13024 12662 11162 8806 9194 -2958 -5656 -2221 -148 2735 4346
9911D346l053J160K324N049k526K701m851P82K091j572L065L618K887K473k098
$$ 4346 1293 2453 4777 9826 7300 10001 5150 5932 8023 6451 9516 13134 16021 18494 16396
9896A6396o008K534J80j271M8k203k131k231Nq8P62m133N400M962L394K646O22
$$ 16396 10388 12922 13102 11831 11879 9676 7545 5314 5319 5231 5993 1860 7260 12222 15616 18262 18884
9879A8884l459K339k374N612r677r71P570J3819P84l659K240K2332L0220L8490
$$ 18884 15425 17764 15390 21002 11325 10354 17924 31743 32527 28868 31108 53440 83660 122150
9865A22150m026l0715l5843j7724l114p156p854K908o095l363j464M907m108l028
$$ 122150 118124 87409 51566 33842 30728 23572 15718 18626 12531 9168 7704 12611 8503 5475
9851E475Q81L490L142L524l477o192p569L553p47j801R14L769j400P62j833l425
$$ 5475 6356 9846 12988 16512 13035 6843 -726 2827 2080 279 1193 4962 3562 4324 2491 -934
9835i34j597o30j544M139j813k52l9R81R034K122p317p09j130O38J840m605L242
$$ -934 -2531 -3161 -4705 -566 -2379 -2631 -2670 -1689 7345 9467 2150 1441 311 949 2789 -1816 1426
9818A426R24K467l702o032O324K466l691J310P831l655o492n664L368j873K696
$$ 1426 2350 4817 1115 -4917 1407 3873 182 1492 9323 5668 -824 -6488 -3120 -4993 -2297
9803b297J0654O946p230K587k64n592k762k392J782j599M731J833K210M992O526
$$ -2297 8357 15303 8073 10660 10396 4804 2042 -350 1432 -167 4564 6397 8607 13599 20125
9788B0125m108j743j9l946n626k853L176M556j362p190K902N552k002n960l26
$$ 20125 16017 14274 14255 10309 4683 1830 5006 9562 8200 1010 3912 9464 7462 1502 1176
9773A176j24m105L098K209k322j997N14R201L734p195P20R670n65R76O877K407
$$ 1176 1052 -3053 45 2254 -68 -2065 -1551 7650 11384 4189 4909 14579 14014 14990 21867 24274
9757B4274j1304j1653l021k664n813K757J1346J0505J009Q34K93p536o560j46
$$ 24274 12970 1317 -1704 -4368 -10181 -7424 3922 14427 15436 16270 16563 9027 2467 2321
9743B321L825J064J804p045k506k688P079Q898p77m434j086N052l624n018j998
$$ 2321 6146 7210 9014 1969 -537 -3225 3854 12752 11975 7541 6455 11507 7883 2865 867
9728H67m940m171j225L649o39L883O447k539m298j833j71k626O75P863m669l24
$$ 867 -4073 -8244 -9469 -5820 -6459 -2576 3871 1332 -2966 -4799 -4970 -7596 -6921 942 -3727 -4051
9712d051o24l47N888K899m573n116q548q598N456L054L648P279O975N385k081
$$ -4051 -4675 -5022 866 3765 -808 -5924 -14472 -23070 -17614 -14560 -10912 -3633 3342 8727 6646
9697F646k282M72O18j83J30K687K8j828q072r044L904J68r46O927M747j546j685
$$ 6646 4364 4836 5454 5271 5401 8088 8116 6288 -1784 -10828 -6924 -6756 -7702 -775 3972 2426 741
9680G41q19Q49j0193P30K658k31m408L980R093O630n20m754k906N271k525l378
$$ 741 -78 771 -9422 -8692 -6034 -6265 -10673 -6693 2400 9030 8510 3756 850 6121 3596 218
9664B18k3m194p99J506l986p224J837l74j320Q793K886k427J59J101M424m295
$$ 218 195 -3999 -4798 -3292 -7278 -14502 -12665 -13039 -14359 -5566 -2680 -5107 -4948 -3847 577 -3718
9648c718k617o67L898K054J173j852m336l896q71L28L234k13J289M846M607Q69
$$ -3718 -6335 -7002 -3104 -1050 123 -1729 -6065 -9961 -10832 -10504 -7270 -7483 -6194 -1348 3259 4128
9632D128K138p194m005N21N152k494k56j670Q424M660N632l029j152M804K973
$$ 4128 6266 -928 -4933 -4412 740 -1754 -2010 -3680 4744 9404 15036 12007 10855 15659 18632
9617A8632k213o264N588J1073K1730R819p180j7703j1411n155m153j0935m259
$$ 18632 16419 10155 15743 26816 48546 58365 51185 33482 22071 16916 12763 1828 -2431
9604b431k96R73N68l816r757N280P084k059N599Q842l088p354j565j152o124k683
$$ -2431 -2727 -1754 -1186 -5002 -14759 -9479 -2395 -4454 1145 9987 6899 -455 -2020 -3172 -9296 -11979
9588a1979Q408L064j046o08l605m13J869j641J885J0626L000o678o744j417P654
$$ -11979 -3571 -507 -1553 -2161 -5766 -6179 -4310 -5951 -4066 6560 9560 2882 -3862 -5279 2375
9573B375L869Q279J0508J4802Q092O829l206j6784k0008j1972k730r399O075K413
$$ 2375 6244 14523 25031 39833 47925 54754 51548 34764 14756 2784 54 -9345 -3270 -857
9559h57k202Q85n736l12N237m328l723n85M648M946M581K205o642j573J720K604
$$ -857 -3059 -2174 -7910 -8222 -2985 -7313 -11036 -11621 -6973 -2027 2554 4759 -1883 -3456 -1736 868
9543H68N287k156j601k279o81L368K469P661L356J213r189r061Q319j211l883
$$ 868 6155 3999 2398 119 -562 2806 5275 12936 16292 17505 8316 -745 7574 6363 2480
9528B480l835l100J819n099p338j221O36Q515N601m569K092j230L00P070K104
$$ 2480 -1355 -4455 -2636 -7735 -15073 -16294 -15658 -7143 -1542 -6111 -4019 -5249 -4949 2121 4225
9513D225l873q419o369J733M519m083q53J671J873K792k00k203k820K151P056
$$ 4225 352 -8067 -14436 -12703 -8184 -12267 -13120 -11449 -9576 -6784 -6984 -9187 -12007 -9856 -2800
9498b800j885j138J808L503R816M543j92M24j1087m413m861o634K144Q429n131
$$ -2800 -4685 -5823 -4015 -512 9304 13847 13655 14079 2992 -1421 -6282 -12916 -10772 -2343 -7474
9483g474m107N269l745L478l829o524O12R87N658L624L039P747R124k847o44j2410
$$ -7474 -11581 -6312 -10057 -6579 -10408 -16932 -16320 -15333 -9675 -6051 -3012 4735 13859 11012 10368 -2042
9467b042o610L27O473o381j2038N895Q940n18J316K150N308J462O32j4996m73
$$ -2042 -8652 -8325 -1852 -8233 -20271 -14376 -5436 -5954 -4638 -2488 2820 4282 4914 -10082 -10555
9452a0555N941N134N582q911l219J718R97n126O65L310m022N068O185K014K438
$$ -10555 -4614 520 6102 -2809 -6028 -4310 -3313 -8439 -7774 -4464 -8486 -3418 2767 4781 7219
9437G219j876p260j0149j866n08P191j835K342L596P418J74k196Q8n692n86m27
$$ 7219 5343 -1917 -12066 -13932 -14440 -7249 -9084 -6742 -3146 4272 4446 2250 2338 -3354 -3940 -4367
9421d367j916l703J912K510K304o384j269N484N41l541l371M598P66L927l26K162
$$ -4367 -6283 -9986 -8074 -5564 -3260 -9644 -10913 -5429 -4888 -8429 -11800 -7202 -6436 -2509 -2835 -673
9405f73o87K71M841j43r198n292J684M959M443r04k032m387j437O560o662q252
$$ -673 -1360 -1089 3752 3609 -5589 -10881 -9197 -4238 205 -699 -2731 -7118 -8555 -1995 -8657 -16909
9389a6909J129m13r834P712J1562m394p710N75P786L675O6k654k428J280P514
$$ -16909 -15780 -16193 -26027 -18315 -6753 -11147 -18857 -18282 -10496 -6821 -6755 -9409 -11837 -10557 -3043
9374c043j776j541n294J670j246J615P315P963j94p092j145k75M540L28L766o115
$$ -3043 -4819 -6360 -11654 -9984 -11230 -9615 -2300 5663 5469 -1623 -2768 -3043 1497 1825 5591 -524
9358e24q154j942M545K115l607N13k469M690M018P06l323j007j229o085O93N813
$$ -524 -8678 -10620 -6075 -3960 -7567 -7054 -9523 -4833 -815 -109 -3432 -4439 -5668 -11753 -11060 -5247
9342e247Q81k616M837l175L237k382L299O883j5m540p951m463j636J244M769n07
$$ -5247 -4366 -6982 -2145 -5320 -2083 -4465 -1166 5717 5702 1162 -6789 -11252 -12888 -11644 -6875 -7382
9326g382M14J115M84N525M410k108k113L676Q971J3652P994Q155P419j1031j8686
$$ -7382 -6968 -5853 -5369 156 4566 2458 345 4021 12992 26644 34638 42793 50212 39181 20495
9311B0495m203L111l363k707n634m650l407j222k807M071P116J296p701m934j829
$$ 20495 16292 19403 16040 13333 7699 3049 -358 -1580 -4387 -316 6800 8096 395 -4539 -6368
9296f368J811L237k077k724j596J872J0416J2799J3436p899k8328j5764l159n21
$$ -6368 -4557 -1320 -3397 -6121 -7717 -5845 4571 17370 30806 22907 -5421 -21185 -24344 -24865
9282b4865j755J0053J5002K45j436J273N417J0623N770L716K903J2598L1235L0642
$$ -24865 -26620 -16567 -1565 -1320 -2756 -1483 3934 14557 20327 24043 26946 39544 70779 101421
9268A01421P94j9051j6501M549L907J776J3467J9356K5251M1493P1115J07850
$$ 101421 102215 83164 66663 71212 75119 76895 90362 109718 134969 176462 247577 355427
9256C55427J66186K29579K10307j4494k44744k40462j53569r0228n9348k9869
$$ 355427 521613 751192 961499 947005 702261 461799 308230 218002 158654 128785
9246A28785k1424j3204q908q718k819j9244k1121j7543j0315j877N938J1684L400
$$ 128785 107361 94157 85249 76531 73712 54468 33347 15804 5489 3612 9550 21234 24634
9233B4634m707n471K157N539N947j266O062P121Q504J0619P647P47K118J1199
$$ 24634 19927 14456 16613 22152 28099 26833 32895 40016 48520 59139 66786 67533 69651 80850
9219H0850R491J1738K0965L7890M9896P3958J22401J99742L01429M32051N02220
$$ 80850 90341 102079 123044 160934 210830 284788 407189 606931 908360 1340411 1842631
9208A842631J29256m50932n31106l51805k02912j24560p7378m8165l2978k8989
$$ 1842631 1971887 1520955 989849 638044 435132 310572 233194 185029 152051 123062
9198A23062k3100j7812j2151o141o116j2286j1795o034m882o334r943P153J2569
$$ 123062 99962 82150 69999 63858 57742 45456 33661 27627 22745 16411 6468 13621 26190
9185B6190J4044O15j9086j727J5275J586j562k215o554q766l166L488R177Q197
$$ 26190 40234 40849 21763 20036 35311 36897 35335 33120 26566 17800 14634 18122 27299 35496
9171C5496K6814K7628L2742N5979R0425J27495J75930K20261J37940j12790k25555
$$ 35496 62310 89938 122680 178659 269084 396579 572509 792770 930710 817920 592365
9160E92365j68792j11968q1133n3734m5579k3958j3465j9401k0401j1187n685
$$ 592365 423573 311605 230472 176738 131159 107201 93736 74335 53934 42747 37062
9149C7062k867j4750m370n935j5533p917K09J1367J6739J0917N805j4468j2639
$$ 37062 34195 19445 15075 9140 -6393 -14310 -14101 -2734 14005 24922 30727 16259 3620
9136C620J0833P524j2508j4944j1133m800k990o089k451N546N131L314L932j517
$$ 3620 14453 21977 9469 -5475 -16608 -21408 -24398 -30487 -32938 -27392 -22261 -18947 -15015 -16532
9122a6532n345k105K290O667O338K6363N9606O6933K0032j0528j0271j401m008
$$ -16532 -21877 -23982 -21692 -15025 -8687 17676 77282 144215 164247 153719 143448 142047 138039
9109A38039Q27Q845k539k2708l1486j8615r318j6521j0157l381q990M06J060m259
$$ 138039 138866 147711 145172 122464 90978 72363 63045 46524 36367 32986 23996 24402 25462 21203
9095B1203j3597M281K114L675M761O310k819j483j531l636l766k407j2417p142
$$ 21203 7606 11887 14001 17676 22437 28747 25928 24445 22914 19278 15512 13105 688 -6454
9081f454K775R241Q3o195r889m913P902J3339Q934N757K6141L5071L0178M01K04
$$ -6454 -3679 5562 5645 -550 -10439 -15352 -7450 5889 14823 20580 46721 81792 111970 112371 112575
9066A12575J1191J3210K7643L5022K5059j7378n8641m5202j7868j9129j6407j3699
$$ 112575 123766 136976 164619 199641 224700 207322 148681 103479 85611 66482 50075 36376
9054C6376p528m953j211r045j2536r738O120J7404O593L972l083m016j1942j1796
$$ 36376 28848 23895 22684 13639 1103 -8635 -2515 14889 21482 25454 22371 18355 6413 -5383
9040e383j1132n367N688J0024J981J0134Q345J847j0647p569o659P466J4570K2818
$$ -5383 -16515 -21882 -16194 -6170 -4189 5945 14290 16137 5490 -2079 -8738 -1272 13298 36116
9026C6116K2056J243J491M744j181m494j2112N130J6620J8204P611k0340l3209
$$ 36116 58172 59415 60906 65650 64469 59975 47863 52993 69613 87817 95428 75088 41879
9013D1879k4513j2055j4425j4596k0996n737J5931K4571J4741n557m347P943J1226
$$ 41879 17366 5311 -9114 -23710 -44706 -50443 -34512 -9941 4800 -757 -5104 2839 14065
9000A4065L687j2099j9907k0135j7029j2853k294K943J3308R321N900O832O059
$$ 14065 17752 5653 -14254 -34389 -51418 -64271 -66565 -63622 -50314 -40993 -35093 -28261 -22202
8987b2202k781Q250M185L652p779m2131p4000o3216J3988Q1786P6273L0704L797
$$ -22202 -24983 -16733 -12548 -8896 -16675 -58806 -132806 -196022 -182034 -100248 -23975 6729 10526
8974A0526J202M992k892K411J830j4315j1604l758k180j4083j3392J540K5682
$$ 10526 11728 16720 13828 16239 18069 3754 -7850 -11608 -13788 -27871 -41263 -39723 -14041
8961a4041N9546M7416n212l2097k116J9386J3270J422k0280j7372j8585j0176
$$ -14041 45505 92921 87709 55612 53496 72882 86152 87574 67294 49922 31337 21161
8949B1161j552m894o672O611R872K456j62K565J2976Q454r859m2592r0399j59888
$$ 21161 19609 14715 8043 14654 24526 26982 26820 29385 42361 50815 40956 -1636 -92035 -251923
8935b51923j45236M359J86788J91613J00959M6897K6064R845J8751J2955j63j8593
$$ -251923 -397159 -392800 -206012 -14399 86560 133457 159521 169366 188117 201072 200909 182316
8923A82316j4125r481N25R629J5225J8450L1056L7982L9573J4578j2531O36K6277
$$ 182316 168191 158710 159235 168864 184089 202539 233595 271577 311150 325728 313197 313833 340110
8910C40110K3895K6294J7966j618m999j157p624j851J5614K5856N2700N8258M3717
$$ 340110 364005 390299 408265 406647 401648 400491 392867 391016 406630 432486 485186 543444 587161
8897E87161K1150l97K2978O1355R1215J02290J18000J60010K90639N19578P00224
$$ 587161 608311 607914 630892 692247 783462 885752 1003752 1163762 1454401 1973979 2674203
8886B674203M55927k77714n45165l53837j55025j8368M9007P5221R5870J08402
$$ 2674203 3130130 2852416 2307251 1953414 1798389 1780021 1829028 1904249 2000119 2108521
8876B108521J03177Q1066R5392J64254K41773L36743M46373N43760O23111P55527
$$ 2108521 2211698 2292764 2388156 2552410 2794183 3130926 3577299 4121059 4744170 5499697
8866E499697Q90318Q43249Q59957J173296J729642K626047L928496N948511R193655
$$ 5499697 6390015 7233264 8093221 9266517 10996159 13622206 17550702 23499213 32692868
8857C2692868J4271865K2033540L3049171M4981400L8997555j0007351n0358074
$$ 32692868 46964733 68998273 102047444 147028844 186026399 176019048 125660974
8850A25660974m4487177k7159815j5745768r433059n861787l831203k597246j600879
$$ 125660974 81173797 54013982 38268214 28835155 22973368 19142165 16544919 14944040
8842A4944040o23543k43334j379122j957211j414394r88989p58826m97699l02360
$$ 14944040 14320497 14077163 12698041 10740830 9326436 8337447 7578621 7080922 6778562
8833F778562j91041r6691n5930j21987r6659N5556K47590M72757P28904R78425
$$ 6778562 6587521 6490830 6434900 6312913 6216254 6271810 6519400 6992157 7721061 8699486
8823H699486J134719J338884J610195J506620J400376J984443K980408M534867
$$ 8699486 9834205 11173089 12783284 14289904 15690280 17674723 20655131 25189998
8815B5189998O870397J0492312J6220378K5251401L9270196N9772820Q6105302
$$ 25189998 32060395 42552707 58773085 84024486 123294682 183067502 269172804
8808B69172804R1563814K497106r6575284r4717755n9329897l4474572k0689811
$$ 269172804 360736618 363233724 266658440 171940685 112610788 78136216 57446405
8801E7446405j2988206q709484o317086m701742l355031k248882j999605k016455
$$ 57446405 44458199 35748715 29431629 24729887 21374856 19125974 17126369 15109914
8793A5109914j488612j237410j434133j244340r04124p03457n51828m47751m01393
$$ 15109914 13621302 12383892 10949759 9705419 8801295 8097838 7546010 7098259 6696866
8784F696866l58710k80567j56619J3539K19409L95835M84642N35592O06151O27754
$$ 6696866 6338156 6057589 5900970 5914509 6133918 6529753 7014395 7549987 8156138 8783892
8774H783892O43660Q63026J269254J926491K992397M641096P197150J1169896
$$ 8783892 9427552 10290578 11559832 13486323 16478720 21119816 28316966 39486862
8766C9486862J7241030K6245303L8056884M4641753J6633300l6650488m9687603
$$ 39486862 56727892 82973195 121030079 165671832 182305132 145654644 95967041
8759I5967041l3778659j9644896j1600413p176862m848002l570852k713246k088347
$$ 95967041 62188382 42543486 30943073 23766211 18918209 15347357 12634111 10545764
8751A0545764j548990j097943q05166n60628m71266o29318o81190n31534m18833
$$ 10545764 8996774 7898831 7093665 6533037 6061771 5432453 4751263 4219729 3800896
8742C800896l43651k80498k38773k28405k23463k03117j56874r7799n3263k5981
$$ 3800896 3457245 3176747 2937974 2709569 2486106 2282989 2126115 2028316 1975053 1949072
8732A949072k6946m4690n0101l8756n032J8080n927j00046j32896q6432k4314
$$ 1949072 1922126 1877436 1827335 1788579 1783547 1801627 1795700 1695654 1562758 1476326 1452012
8721A452012j6504n3024o6664n1830m0398k4844k7225r877J8796N6689Q3995P5304
$$ 1452012 1435508 1382484 1315820 1263990 1223592 1198748 1171523 1161646 1180442 1237131 1321126 1396430
8709A396430K5298r1072j75660j45458q1759k6281j5332k2223n1143m9984j7311
$$ 1396430 1421728 1330656 1154996 1009538 927779 901498 886166 863943 812800 762816 745505
8698G45505O681l642n501J666j3941k4765k4682k8170l1109j9233Q587K7919M1159
$$ 745505 752186 748544 743043 744709 730768 706003 681321 653151 622042 602809 611396 639315 680474
8685F80474P6568R8976J21433J64998J89035k5077j88714j49613p9616l6536j5809
$$ 680474 757042 856018 977451 1142449 1331484 1306407 1117693 968080 888464 851928 836119
8674H36119j3329o190P576J8752L5777N6728Q5152J20649J60779K21891K44873
$$ 836119 822790 816600 824176 842928 878705 935433 1020585 1141234 1302013 1523904 1768777
8663A768777Q089k59993k53107j55885r8070p3813p4958q7516o6224j248K2437
$$ 1768777 1776866 1516873 1263766 1107881 1009811 935998 861040 773524 707300 706052 728489
8652G28489m02j9347k7412k9072k2427j4788j3892j5247j0084o665p310o879R951
$$ 728489 728087 708740 681328 652256 629829 615041 601149 585902 575818 569153 561843 554964 564915
8639E64915L7019N3128O7828Q5481K3750q6732q2128l7440l048n32O108J6119
$$ 564915 601934 655062 722890 808371 832121 745389 663261 625821 622773 622241 628349 644468
8627F44468L5685N0618N3538N1314O4098Q4393R0125Q1965Q7781N123j44727j75442
$$ 644468 680153 730771 784309 835623 899721 984114 1074239 1156204 1243985 1249108 1104381 928939
8615I28939j25756p3131l6638l8807m0549k4701j575J6509J8030M498q735j7548
$$ 928939 803183 730052 693414 654607 614058 589357 587782 604291 622321 626819 618084 600536
8603F00536k2023j5791j1011r314o138j2460j9221j9510j9592k1329k2966j4468
$$ 600536 578513 562722 551711 542397 536259 523799 504578 485068 465476 444147 421181 406713
8591D06713k1063j9652n676J634J1416O658L046q060j2969k650J217p61l630M489
$$ 406713 385650 365998 360322 361956 373372 380030 383076 375016 362047 359397 360614 359853 356223 360712
8577C60712O841n938p474o920k286k967n20l955J0238K3040K0982J9799J7630
$$ 360712 367553 361615 354141 347221 344935 341968 341448 337493 347731 370771 391753 411552 429182
8564D29182J4393o547j7727j6139j4576j3214o037j610j347M581Q003j3019k0371
$$ 429182 443575 437028 419301 403162 388586 375372 369335 367725 366378 370959 378962 365943 345572
8551C45572j3447j6501j7486q615j8042k0863K153K3545J7633N342j663p337o225
$$ 345572 332125 315624 298138 289523 271481 250618 252771 276316 293949 299291 297628 290291 284066
8538B84066n045q670r485o027l191o216n263j0644p945j1751q938p107j966J4484
$$ 284066 279021 270351 260866 254839 251648 245432 240169 229525 221580 209829 200891 193784 191818 206302
8524B06302J2609J2636J2308L2854M1208m666m0567l6798j6899j2138j4944j9333
$$ 206302 218911 231547 243855 276709 317917 313251 272684 235886 218987 206849 191905 172572
8512A72572n382k264M81j94p215r693k5273k0829j0683p654j7238k1742M157N0426
$$ 172572 167190 164926 165407 165213 157998 148305 123032 102203 91520 83866 66628 44886 49043 99469
8498I9469M5064K4521R062O08N820J0809n847p935N317o834P834O454p032p023
$$ 99469 144533 169054 178116 178724 184544 195353 189506 181571 186888 180054 187888 194342 187310 180287
8484A80287l52R54J0649K1214J4090L065m402J4432J7869j309k5297k8397j5324
$$ 180287 179935 180889 191538 212752 226842 229907 225505 239937 257806 256497 231200 202803 187479
8471A87479j4515j0868l409n521l074j525m520q250m954k497r87l922m463K340
$$ 187479 172964 162096 158687 153166 150092 148567 144047 135797 130843 128346 127359 123437 118974 121314
8457A21314M673O629J0790M4563N7281N0368N9011Q9709J38503K13541K40910
$$ 121314 125987 132616 143406 187969 245250 295618 354629 444338 582841 796382 1037292
8446A037292R8736j79154k59504j78583r3594n3005l6389k2959j9299j3928k009
$$ 1037292 1136028 956874 697370 518787 425193 372188 335799 312840 293541 279613 277604
8435B77604O054n191l1656j4163k947j4774j5278j7808l897N75K833J118o786
$$ 277604 283658 278467 246811 232648 229701 214927 199649 181841 177944 178519 181352 182470 175684
8422A75684j1357k080l768P00N998J3167J3137R225j237M285J4714J8688J8473
$$ 175684 164327 162247 158479 159179 165177 178344 191481 200706 199469 203754 218468 237156 255629
8409B55629K5382M7021P4041J18022J80250K85439M12305N23594L08671l32943
$$ 255629 281011 328032 402073 520095 700345 985784 1398089 1921683 2230354 1897411
8399A897411n65924m09638k48655j52299r7991p7939n9975m3369k8730n871J614
$$ 1897411 1331487 921849 673194 520895 422904 344965 284990 241621 212891 207020 208634
8388B08634p567r279q10j1400j4480J532P76o746P16L031L201j0307j1617k741
$$ 208634 201067 191788 190978 179578 165098 166630 167406 160660 161376 164407 167608 157301 145684 142943
8374A42943J183j3025m459J2984J0976O54K379J4403R464J0804J8463K4404L9905
$$ 142943 144126 131101 126642 139626 150602 151256 153635 168038 177502 188306 206769 231173 271078
8361B71078O4454Q2216J08477J56700K10323J57439q2068k50186k22270j35046
$$ 271078 335532 417748 526225 682925 893248 1050687 968619 718433 496163 361117
8351C61117q5733o4512m5200l4852m0749k8162Q169J6707P046Q95N937J456o594
$$ 361117 275384 210872 165672 130820 90071 61909 70078 86785 93831 94726 100663 102119 95525
8338I5525L610J992m125O876Q260O569N571q376j0221n485k5727j8307N672N940
$$ 95525 99135 101127 97002 103878 112138 118707 124278 115902 105681 100196 74469 56162 61834 67774
8324F7774O504R587O453l6o6r018o652K869j78n480K587k090j0661k324o39N772
$$ 67774 74278 83865 90318 90282 90216 81198 74546 77415 77237 71757 74344 72254 61593 59269 58630 64402
8308F4402M902M341r553p361m755r884q912K494O038J1258Q707J883j475j091
$$ 64402 69304 73645 64092 56731 51976 42092 33180 35674 41712 52970 61677 63560 62085 60994
8294F0994o235N060K460K34j00m71N084M686J446O861p463j8976p919R59N508
$$ 60994 54759 59819 62279 62513 62413 61942 67026 71712 73158 80019 72556 53580 45661 46620 52128
8279E2128K958N88N490r11N901R76m541j95m386j357p305k95K473L041J0276L081
$$ 52128 55086 55674 61164 60253 66154 67130 62589 62394 58008 56651 49346 49051 51524 54565 64841 67922
8263F7922p379j266O089L378k238k51K545j648k098L198M621M742m393r048m134
$$ 67922 60543 59277 65366 68744 66506 66255 68800 67152 65054 68252 72873 77615 73222 64174 60040
8248F0040P273P37k462J875K427M69k364m281K14n96r009k699K188J4502J41m881
$$ 60040 67313 68050 65588 67463 69890 70359 67995 63714 63928 63332 54323 51624 53812 68314 68455 63574
8232F3574k848M380O535j033p1o340n993m214m763r39L700k006L089J044m708
$$ 63574 60726 65106 71641 70608 70537 64197 58204 53990 49227 48288 51988 49982 53071 54115 49407
8217D9407k713M174P740J0340j679m981n799J766l756m875m899L846K141N237
$$ 49407 46694 50868 58608 68948 67269 62288 56489 58255 54499 49624 44725 48571 50712 55949
8203E5949j778l262O803R612p731p738O256J280q582l92L194n983J908j856k580
$$ 55949 54171 50909 57712 67324 59593 51855 58111 59391 50809 50417 53611 47628 49536 47680 45100
8188D5100K070Q626L902m600J117r88K298l604m406r11o997o683K028L272N326
$$ 45100 47170 55796 59698 55098 56215 55227 57525 53921 49515 48604 41607 34924 36952 40224 45550
8173D5550M438k578n007j861K430L491n11l289J799m749p963P21N245K566O586
$$ 45550 49988 47410 42403 40542 42972 46463 45952 42663 44462 39713 31750 32471 37716 40282 46868
8158D6868K685l209M874J944m747m336n950l501N794l48j873J307P691N86n869
$$ 46868 49553 46344 51218 53162 48415 44079 38129 34628 40422 40074 38201 39508 47199 47785 41916
8143D1916p549j1k049p488P39m44Q334Q696J590r797j0395k103L359Q463L013
$$ 41916 34367 34356 32307 24819 25558 25114 33448 42144 43734 33937 23542 21439 24798 33261 36274
8128C6274N608P793q55l341L07L98m299n256j764M30j966m945J932K527N050j253
$$ 36274 41882 49675 48820 45479 45786 46184 41885 36629 34865 35295 33329 28384 30316 32843 37893 36640
8112C6640L87j038J309J75M980J639L378n394p729j869J287k263m514k434j624
$$ 36640 37027 35989 37298 37473 42453 44092 47470 42076 34347 32478 33765 31502 26988 24554 22930
8097B2930M851j119L30k256L67M950R428O584Q27n734j232p44J821K687q55L520
$$ 22930 27781 26662 26992 24736 25103 30053 39481 46065 46892 41158 39926 39182 41003 43690 42835 46355
8081D6355J921k992l032j339j602L520O57k459P425L51q152r413o619l778M087
$$ 46355 48276 45284 42252 40913 39311 42831 43488 41029 48454 48805 40653 31240 24621 20843 24930
8066B4930R235J482n258m3N499J422k760L049N930p215j909p06r8q70L877L350
$$ 24930 34165 35647 30389 30346 35845 37267 34507 37556 43486 36271 34362 33656 33558 32688 36565 39915
8050C9915l462j0752O19Q050R351o109o343m901n495L145Q056M25L55p635R36
$$ 39915 36453 25701 26320 34370 43721 37612 31269 26368 20873 24018 32074 32499 32854 25219 26155
8035B6155O929K590l188J12J013K578m263M395Q140J638N08m566m945j438l782
$$ 26155 33084 35674 32486 32598 33611 36189 31926 36321 44461 46099 46607 42041 37096 35658 31876
8020C1876m412J359M028J3043P785n379m444j235o864j551J55K283o109j337J441
$$ 31876 27464 28823 32851 45894 53679 48300 43856 42621 35757 34206 34361 36644 30535 29198 30639
8005C0639j551L548j565k189J0519o7j947N276k798k184M04K864l72m061j387
$$ 30639 29088 32636 31071 28882 39401 39334 37387 42663 39865 37681 38085 40949 40577 36516 35129
7990C5129k770l254l877K937j2241k749O166O119Q538O828k613p269l157M347
$$ 35129 32359 29105 25228 28165 15924 13175 19341 25460 33998 40826 38213 30944 27787 32134
7976C2134K78p848j577O40M1k238p29P365N174O048j204r169J086J983Q620O397
$$ 32134 32412 24564 22987 23627 23668 21430 20701 28066 33240 39288 38084 28915 30001 31984 40604 47001
7960D7001o97m628j8m961m079j274J295J363j20j166K430K062n874M91O968J017
$$ 47001 46304 41676 41658 36697 32618 31344 32639 34002 33882 32716 35146 37208 31334 31825 38793 39810
7944C9810k807j0558m186N37n95L626Q072L582K615q906o050p68P76J634p79K069
$$ 39810 37003 26445 22259 22796 22201 25827 33899 37481 40096 31190 25140 24372 25148 26782 26003 28072
7928B8072Q255P869n917k481J3885L040q543n732r37n583p48P71J110P457K051
$$ 28072 36327 44196 38279 35798 49683 52723 44180 38448 37511 31928 31180 31951 33061 40518 42569
7913D2569L077O372k915o638m263M144M389j637N412n39j074J623j1681o228o10
$$ 42569 45646 52018 49103 42465 38202 42346 46735 45098 50510 49971 48897 50520 38839 32611 32001
7898C2001M712o222n577K15N114k404p187M624N996q84l830K653L819k235n275
$$ 32001 36713 30491 24914 25129 30243 27839 20652 25276 31272 30388 26558 29211 33030 30795 25520
7883B5520O66l237L853L47O249j713j660O27L572M732j432m176K878l328J032
$$ 25520 26186 22949 26802 27149 33398 31685 30025 30652 34224 38956 37524 33348 36226 32898 33930
7868C3930L42l66k65l373m100k621P109Q758k986p588j0687n147L983O800l84
$$ 33930 34272 33906 33641 30268 26168 23547 30656 39414 36428 28840 18153 13006 16989 23789 23405
7853B3405L921O266N845j657n498p156P660R70k353n163k079l282k401L18J0888
$$ 23405 27326 33592 39437 37780 32282 25126 32786 33756 31403 26240 24161 20879 18478 18796 29684
7838B9684M308o034o538m386M08J773L237m493o99j664K679k185k933K086R62
$$ 29684 33992 27958 21420 17034 17442 19215 22452 17959 17260 15596 18275 16090 13157 15243 16205
7823A6205M140K323k570j461k673M60o71J857J734o637l129R029J700n077j925
$$ 16205 20345 22668 20098 18637 15964 16424 15753 17610 19344 12707 9578 18607 20307 15230 13305
7808A3305O708L01Q20L36J0507r90m709l270j179K622O119j519p796p614l913
$$ 13305 20013 20314 21134 21470 31977 30987 26278 23008 21829 24451 30570 29051 21255 13641 9728
7793I728n68N31J293M26J086K049o02l323n05j17L889M412L394K980o973r793
$$ 9728 9160 9691 10984 11410 12496 14545 13943 10620 10115 9998 13887 18299 21693 24673 17700 7907
7777G907k672N155O089l353m137K518K167n909n589K026M562L709L36j861J634
$$ 7907 5235 10390 16479 13126 8989 11507 13674 7765 2176 4202 8764 12473 12809 10948 12582
7762A2582N4J72R36j534K694M789l343J154K848Q652l876q252k423L015J758L603
$$ 12582 12636 12808 13744 12210 14904 19693 16350 17504 20352 29004 25128 16876 14453 17468 19226 22829
7746B2829l38J069l829q239M024M379M935L005l191m783o591l205P55J549j28
$$ 22829 22491 23560 19731 11492 15516 19895 24830 27835 24644 19861 13270 10065 10820 12369 12241
7731A2241n666N781L623O56l310k993L970J130R43p132Q65N284k71P305L780J282
$$ 12241 6575 12356 15979 16635 13325 10332 14302 15432 16375 9243 10108 15392 15121 22426 26206 27488
7715B7488j0889j5109L9L340K917N620n78K893L868k052l358k132l84K821J317
$$ 27488 16599 1490 1529 4869 7786 13406 12828 15721 19589 17537 14179 12047 11663 14484 15801
7700A5801n653j474L879J0196j607J122k909m723m350m719M657P01J200j988j188
$$ 15801 10148 8674 12553 22749 21142 22264 19355 14632 10282 5563 10220 10921 12121 10133 8945
$$ [...]
##END NTUPLES=NMR SPECTRUM
##END=
