##TITLE=Analysis number 326094
Compound Code spb 02288
Project Code adrs
Chemist Name hixia
##JCAMPDX= 6.0         $$ Bruker NMR JCAMP-DX V2.0
##DATA TYPE= NMR SPECTRUM
##DATA CLASS= NTUPLES
##ORIGIN= Bruker BioSpin GmbH
##OWNER= nmr
$$ XWIN-NMR		Version 3.5
$$ Wed Jan 24 14:35:10 2007 GMT Standard Time (UT+0h)  MAYBRIDGE\nmr@NMR_250MHZ
##.OBSERVE FREQUENCY= 250.131544655141
##.OBSERVE NUCLEUS= ^1H
##.ACQUISITION MODE= SIMULTANEOUS (DQD)
##.ACQUISITION SCHEME= undefined
##.AVERAGES= 16
##.DIGITISER RES= 18
##SPECTROMETER/DATA SYSTEM= dpx250
##.PULSE SEQUENCE= zg30
##.SOLVENT NAME= CDCl3
##.SHIFT REFERENCE= (INTERNAL, CDCl3, 0, 16.522)
##AUDIT TRAIL= $$ (NUMBER, WHEN, WHO, WHERE, WHAT)
$$ ##TITLE= Audit trail, XWIN-NMR		Version 3.5
$$ ##JCAMPDX= 5.01
$$ ##ORIGIN= Bruker BioSpin GmbH
$$ ##OWNER= nmr
$$ C:\u/data/dgb/nmr/ADRS/1770/pdata/1/auditp.txt
$$ ##AUDIT TRAIL=  $$ (NUMBER, WHEN, WHO, WHERE, WHAT)
(   1,<2007-01-24 14:34:27.78 +000>,<MAYBRIDGE\nmr>,<NMR_250MHZ>,
      <created by zg, POWCHK disabled, PULCHK disabled
       configuration hash MD5:
       49 4B E0 1D 92 C2 6B 37 9F E6 65 BC 52 41 86 1D
       data hash MD5: 64K
       09 3B E6 7B 25 90 31 83 F3 78 C3 C6 DA C5 D8 BD>)
(   2,<2007-01-24 14:34:56.45 +000>,<MAYBRIDGE\nmr>,<NMR_250MHZ>,
      <Start of raw data processing
       ef LB = 0.3 FT_mod = 6 PKNL = 1 SI = 32K 
       data hash MD5: 32K
       AC 6B BA F3 E2 AE 28 A8 EB 69 10 E8 91 3E 32 BC>)
(   3,<2007-01-24 14:34:58.37 +000>,<MAYBRIDGE\nmr>,<NMR_250MHZ>,
      <apk 
       data hash MD5: 32K
       1F E6 22 8E 97 C4 FB 1A 41 88 EB B3 8D 9B 6C 7C>)
(   4,<2007-01-24 14:34:59.33 +000>,<MAYBRIDGE\nmr>,<NMR_250MHZ>,
      <abs ABSG = 5 
       data hash MD5: 32K
       95 F0 9D 5A B9 A1 BF 19 00 18 AD B3 D0 4A 0A 81>)
$$ ##END=
$$ 
$$ hash MD5
$$ 78 1D 81 53 0E 71 62 F0 AA B0 A7 8F 1F 40 26 B2
##$RELAX= 
##$RELAX= 
##$RELAX= 
##$RELAX= 
##$RELAX= 
##$RELAX= 
##$RELAX= 
$$ Bruker specific parameters
$$ --------------------------
##$DU= <C:\u>
##$EXPNO= 1770
##$NAME= <ADRS>
##$PROCNO= 1
##$TYPE= <nmr>
##$USER= <dgb>
##$AMP= (0..31)
100 100 100 100 100 100 100 100 100 100 100 100 100 100 100 100 100 100 
100 100 100 100 100 100 100 100 100 100 100 100 100 100 
##$AQSEQ= 0
##$AQ_mod= 3
##$AUNM= <au_zg>
##$AUTOPOS= <34 >
##$BF1= 250.13
##$BF2= 250.13
##$BF3= 250.13
##$BF4= 250.13
##$BF5= 500.13
##$BF6= 500.13
##$BF7= 500.13
##$BF8= 500.13
##$BYTORDA= 1
##$CFDGTYP= 0
##$CFRGTYP= 5
##$CHEMSTR= <none>
##$CNST= (0..31)
1 1 145 1 1 1 1 1 1 1 1 1 1 1 1 1 1 1 1 1 1 1 1 1 1 1 1 1 1 1 1 1 
##$CPDPRG= <>
##$CPDPRG1= <>
##$CPDPRG2= <>
##$CPDPRG3= <>
##$CPDPRG4= <mlev>
##$CPDPRG5= <mlev>
##$CPDPRG6= <mlev>
##$CPDPRG7= <mlev>
##$CPDPRG8= <mlev>
##$CPDPRGB= <>
##$CPDPRGT= <>
##$D= (0..31)
0 1 0 0 0 0 0 0 0 0.06 0 0 0 0 0 0 0.0002 0 0 0 0 0 0 0 0 0 0 0 0 0 0 
0 
##$DATE= 1169649265
##$DBL= (0..7)
120 120 120 120 120 120 120 120 
##$DBP= (0..7)
150 150 150 150 150 150 150 150 
##$DBP07= 0
##$DBPNAM0= <>
##$DBPNAM1= <>
##$DBPNAM2= <>
$$ [...]
##$SUBNAM7= <"">
##$SUBNAM8= <"">
##$SUBNAM9= <"">
##$SW= 20.6930455092707
##$SWIBOX= (0..15)
0 0 3 0 0 0 0 0 0 0 0 0 0 0 0 0 
##$SW_h= 5175.983436853
##$TD= 65536
##$TD0= 1
##$TE= 294.16
##$TE2= 300
##$TE3= 300
##$TEG= 300
##$TL= (0..7)
0 120 120 120 120 120 120 120 
##$TP= (0..7)
150 150 150 150 150 150 150 150 
##$TP07= 0
##$TPNAME0= <>
##$TPNAME1= <>
##$TPNAME2= <>
##$TPNAME3= <>
##$TPNAME4= <>
##$TPNAME5= <>
##$TPNAME6= <>
##$TPNAME7= <>
##$TPOAL= (0..7)
0.5 0.5 0.5 0.5 0.5 0.5 0.5 0.5 
##$TPOFFS= (0..7)
0 0 0 0 0 0 0 0 
##$TUNHIN= 0
##$TUNHOUT= 0
##$TUNXOUT= 0
##$USERA1= <user>
##$USERA2= <user>
##$USERA3= <user>
##$USERA4= <user>
##$USERA5= <user>
##$V9= 5
##$VALIST= <valist>
##$VCLIST= <CCCCCCCCCCCCCCC>
##$VD= 0
##$VDLIST= <DDDDDDDDDDDDDDD>
##$VPLIST= <PPPPPPPPPPPPPPP>
##$VTLIST= <TTTTTTTTTTTTTTT>
##$WBST= 1024
##$WBSW= 4
##$XGAIN= (0..3)
0 0 0 0 
##$XL= 0
##$YL= 0
##$YMAX_a= 333077
##$YMIN_a= -318250
##$ZGOPTNS= <>
##$ZL1= 120
##$ZL2= 120
##$ZL3= 120
##$ZL4= 120
##$ABSF1= 16.522
##$ABSF2= -4.171173
##$ABSG= 5
##$ABSL= 3
##$ALPHA= 0
##$AQORDER= 0
##$ASSFAC= 0
##$ASSFACI= 0
##$ASSFACX= 0
##$ASSWID= 0
##$AUNMP= <proc_1d>
##$AZFE= 0.1
##$AZFW= 0.1
##$BCFW= 0
##$BC_mod= 0
##$BYTORDP= 0
##$COROFFS= 0
##$CY= 12.5
##$DATMOD= 1
##$DC= 0
##$DFILT= <>
##$DTYPP= 0
##$F1P= 14.0000005364418
##$F2P= -0.99999901652339
##$FCOR= 0.5
##$FTSIZE= 32768
##$FT_mod= 6
##$GAMMA= 0
##$GB= 0
##$INTBC= 1
##$INTSCL= 1
##$ISEN= 128
##$LB= 0.3
##$LEV0= 0
##$LPBIN= 0
##$MAXI= 10000
##$MC2= 0
##$MEAN= 0
##$ME_mod= 0
##$MI= 0
##$NCOEF= 0
##$NC_proc= -3
##$NLEV= 6
##$NOISF1= 0
##$NOISF2= 0
##$NSP= 0
##$NTH_PI= 0
##$NZP= 0
##$OFFSET= 16.522
##$PC= 1
##$PHC0= 228.5381
##$PHC1= 12.08911
##$PH_mod= 1
##$PKNL= yes
##$PPARMOD= 0
##$PSCAL= 4
##$PSIGN= 0
##$REVERSE= no
##$SF= 250.13
##$SI= 32768
##$SIGF1= 0
##$SIGF2= 0
##$SINO= 400
##$SIOLD= 32768
##$SREGLST= <1H.CDCl3>
##$SSB= 0
##$STSI= 32768
##$STSR= 0
##$SW_p= 5175.98343685301
##$SYMM= 0
##$S_DEV= 0
##$TDeff= 65536
##$TDoff= 0
##$TI= <Analysis number 999999
Compound Code 99
Book Reference 9
Project Code 9>
##$TILT= no
##$TM1= 0
##$TM2= 0
##$TOPLEV= 0
##$USERP1= <user>
##$USERP2= <user>
##$USERP3= <user>
##$USERP4= <user>
##$USERP5= <user>
##$WDW= 1
##$XDIM= 32768
##$YMAX_p= 536296669
##$YMIN_p= -482957
$$ End of Bruker specific parameters
$$ ---------------------------------
##NTUPLES= NMR SPECTRUM
##VAR_NAME=  FREQUENCY,     SPECTRUM/REAL,   SPECTRUM/IMAG
##SYMBOL=    X,             R,               I
##VAR_TYPE=  INDEPENDENT,   DEPENDENT,       DEPENDENT
##VAR_FORM=  AFFN,          ASDF,            ASDF
##VAR_DIM=   32768,         32768,           32768
##UNITS=     HZ,            ARBITRARY UNITS, ARBITRARY UNITS
##FACTOR=    0.157963299565203, 1,           1
##FIRST=     4132.6476996994, 0,             0
##LAST=      -1043.33573715361, 0,           0
##MIN=       -1043.33573715361, -482957,     0
##MAX=       4132.6476996994, 536296669,     0
$$ Real data points
##PAGE= N=1
##DATA TABLE= (X++(R..R)), XYDATA
$$ [...]
16870B1097O277k909k5837n826J1928j2703m1211J9163N3628J8704j6175l586
$$ 21097 27374 24465 -1372 -7198 4730 -7973 -49184 -30021 23607 42311 26136 22550
16858B2550j0815k270o203j8287k3278O750K1254J7443j5466j997L1295K0978
$$ 22550 11735 9465 3262 -15025 -38303 -31553 -10299 7144 -8322 -10319 20976 41954
16846D1954l1701m1041J8531K6679K8235R04j497k2881j3654k037Q04m1414L8640
$$ 41954 10253 -30788 -12257 14422 42657 43561 42064 19183 5529 3492 4296 -37118 1522
16833A522o469j4964L480K2086K380l176J6562L0210k0110l6486j3639M3444k833
$$ 1522 -4947 -19911 -16431 5655 8035 4859 21421 51631 31521 -4965 -18604 24840 22007
16820B2007k7298r030J5581j1351n300J2956l940j2632q366m010K6604K6820k6789
$$ 22007 -5291 -14321 1260 -10091 -15391 -2435 -6375 -19007 -27373 -31383 -4779 22041 -4748
16807d748k0575L4755N835l3436J1666J1179r920M235J8121j1458j2546N884N295
$$ -4748 -25323 9432 15267 -18169 -6503 4676 -5244 -1009 17112 5654 -6892 -1008 4287
16794D287L066j0626j2086j3237k621j9300j1770K3721K2184L06R657j9482J2220
$$ 4287 7353 -3273 -15359 -28596 -31217 -50517 -62287 -38566 -16382 -16076 -6419 -25901 -13681
16781a3681Q973L007l4063k700L5571j518r079K813R590O347J3629j4722k2223
$$ -13681 -4708 -1701 -35764 -38464 -2893 -4411 -13490 -10677 -1087 5260 18889 4167 -18056
16768a8056m339n259J892O933K995p532M133o087j4500J0730L4038K0899k8392
$$ -18056 -22395 -27654 -25762 -18829 -15834 -23366 -19233 -25320 -39820 -29090 4948 25847 -2545
16755b545R74l469m719J8878L7517M909j9522k3212o617O552K0319J4845q072
$$ -2545 -1571 -5040 -9759 9119 46636 51545 32023 8811 2194 8746 29065 43910 35838
16742C5838j8718o445m0449J4840o135L0463J5111k4032j2506o439r336L3835
$$ 35838 17120 10675 -29774 -14934 -21069 9394 24505 473 -12033 -18472 -27808 6027
16730F027J879L812j2024l4730j1134J3188J5204M8745N54o959l243k2932k2394
$$ 6027 7906 11718 -306 -35036 -46170 -32982 -17778 30967 31521 24562 21319 -1613 -24007
16717b4007J0411P632L4587m673Q195K4084m5960l7567P153L2186M2405L673k970
$$ -24007 -13596 -5964 28623 23950 32145 56229 10269 -27298 -20145 12041 54446 58119 55149
16704E5149k0272o338j11j2705k4528L7598N756K3009K6282n253j8918j4490L132
$$ 55149 34877 28539 28428 15723 -8805 28793 34549 57558 83840 78587 59669 45179 48311
16691D8311k7721j3889j3881o34j1376K952J7925J3088R768k23j0832K542k5829
$$ 48311 20590 6701 -7180 -7814 -19190 -16238 1687 14775 24543 24320 13488 16030 -9799
16678i799K4021R545N223L2465Q032j069r496n584n876m0969j2744m8j1276K1556
$$ -9799 14222 23767 28990 61455 69487 68418 58922 53338 47462 6493 -6251 -6299 -17575 3981
16664C981j6726j9914M460M3212K1568m633j8560q357k1258j2464R224J3270J4637
$$ 3981 -12745 -32659 -28199 15013 36581 31948 13388 5031 -16227 -28691 -19467 -6197 8440
16651H440j6968K6330j8644j3875L3734O787l1477m006j866k6114j1173K0973
$$ 8440 -8528 17802 -842 -14717 19017 25804 -5673 -9679 -11545 -37659 -48832 -27859
16639b7859L4542J3334J810k789l278O334k9671n878j1295j8820m722K7913o948
$$ -27859 6683 20017 21827 19038 15760 22094 -7577 -13455 -24750 -43570 -48292 -20379 -27327
16626b7327l983j6030M296K8105K9483J6973J0036R97o700J597j2808q703J0326
$$ -27327 -31310 -47340 -43044 -14939 14544 31517 41553 42550 35850 37447 24639 15936 26262
16613B6262k602l2383m8246J2801J9779K6595J0687K206P562k262m5474p166K321
$$ 26262 23660 -8723 -56969 -44168 -24389 2206 12893 15099 22661 20399 -25075 -32241 -29920
16600b9920j1548j191n932j8356P345K6647K6203k670l070J2744j1285J1365N861
$$ -29920 -41468 -42659 -48591 -66947 -59602 -32955 -6752 -9422 -12492 252 -11033 332 6193
16587F193N839J4347k821j2899p761k1460n472M069j7436J5096J3552l3208K046
$$ 6193 12032 26379 23558 10659 2898 -18562 -24034 -19965 -37401 -22305 -8753 -41961 -39915
16574c9915N428K9051k505l156j994J2380L137K1479l223R292j8318j6523r921
$$ -39915 -34487 -5436 -7941 -11097 -13091 -711 2426 23905 20682 29974 11656 -4867 -14788
16561a4788k8279j9471M665L6845J148k2850o371J8397J8346j4553K5483r3M006
$$ -14788 -43067 -62538 -57873 -21028 -19880 -42730 -49101 -30704 -12358 -26911 -1428 -1521 2485
16548B485j4304o578k8415L286J5525K8162P351l9938j1963K6568j3403l8329
$$ 2485 -11819 -18397 -46812 -43526 -28001 161 7512 -32426 -44389 -17821 -31224 -69553
16536f9553J6958N6213m217k8607m709k0653o188J3631M8237L11j7447j7218j3151
$$ -69553 -52595 3618 -599 -29206 -33915 -54568 -60756 -47125 1112 1423 -16024 -33242 -46393
16523d6393J6602L1523j2508k7805J5630Q248P439j2282O243m47M350K4963J5968
$$ -46393 -29791 1732 -10776 -38581 -22951 -14703 -7264 -19546 -13303 -13750 -9400 15563 31531
16510C1531J8281J2481q907m4793n46o375R100R670O80R183k676k2116p776j8926
$$ 31531 49812 62293 53386 8593 8047 1672 10772 20442 21122 30305 27629 5513 -2263 -21189
16496b1189N43J1420J923k5458L345L736r857r228K536J5819K1739q229K1953
$$ -21189 -20646 -9226 -7303 -32761 -29416 -25680 -35537 -44765 -42229 -26410 -4671 -12900 9053
16483I053K2473l067j1691q224R905K6315j572J1382l2275n136J3472N227P242
$$ 9053 31526 28459 16768 8544 18449 44764 43192 54574 22299 17163 30635 35862 43104
16470D3104k5879k3958J2834J5895K505j5086q56k525n304J8584N3688K6209l096
$$ 43104 17225 -6733 6101 21996 24501 9415 8559 6034 730 19314 73002 99211 96115
16457I6115j5682l1215l4860J091L0382J3996J1997k2751k7346Q027L168m437
$$ 96115 80433 49218 14358 15449 45831 59827 71824 49073 21727 29754 32922 28485
16445B8485L1498L0794p820m4728l2914K381R450J682n948L291k9776j6358J6656
$$ 28485 59983 90777 82957 38229 5315 7696 17146 18828 12880 16171 -13605 -29963 -13307
16432a3307K1437k041L193l679j4263N840L1905K8152k1174j2125k9108n5840
$$ -13307 8130 6089 9282 5603 -8660 -2820 29085 57237 36063 23938 -5170 -61010
16420f1010j2464L6714N5637K5677j7069j7657j0790r248K0914J201R497K5812
$$ -61010 -73474 -36760 18877 44554 27485 9828 -962 -10210 10704 11905 21402 47214
16408D7214p148P43k5312k1224j1586J153J3532K0613n010n004K6096j049k6478
$$ 47214 40066 40809 15497 -5727 -17313 -16160 -2628 17985 12975 7971 34067 33018 6540
16395F540j0049j8528j0003L653L8766k2032j5556k8194k0733L881K0154O684
$$ 6540 -3509 -22037 -32040 -28387 10379 -11653 -27209 -55403 -76136 -72255 -52101 -45417
16383d5417J9273N10J900K8632K1243j2981Q414r491R12k873n24j7066M246L573
$$ -45417 -26144 -25634 -23734 4898 26141 13160 21574 12083 12995 10122 9598 -7468 -3222 351
16369C51o993K593r241L41j0385k917K9968o65k3614k1844l213k398m076J003
$$ 351 -6642 -4049 -13290 -12949 -23334 -26251 3717 3052 -20562 -42406 -45619 -48017 -52093 -51090
16355e1090l990k164J5377J5081p500m326l5572R334L4106M1181P472j9198k6181
$$ -51090 -55080 -57244 -41867 -26786 -34286 -38612 -74184 -64850 -30744 10437 17909 -1289 -27470
16342b7470j3776K0018q443q821Q613J300r917J0125K2896l096Q791K8323k1332
$$ -27470 -41246 -21228 -29671 -38492 -29879 -28579 -38496 -28371 -5475 -8571 220 28543 7211
16329G211J7576J1928j5782j0793l3575j4537J6472J9661K3412k614R667K3761
$$ 7211 24787 36715 20933 10140 -23435 -37972 -21500 -1839 21573 18959 28626 52387
16317E2387k2120k0971j2541l5933j4109j1108R864L0843J5712R076j5962J6978
$$ 52387 30267 9296 -3245 -39178 -53287 -64395 -54531 -23688 -7976 1100 -14862 2116
16305B116P533N703j4544p105K5858M550l882M355j635Q35P169j8078j6255L138
$$ 2116 9649 15352 808 -6297 19561 24111 20229 24584 22949 23784 30953 12875 -3380 -242
16291b42J8355k139o657k2512L727l555k574K4306L1590q76R659p132j386K4431
$$ -242 18113 15974 9317 -13195 -9468 -13023 -15597 8709 40299 39423 49082 41950 40564 64995
16277F4995k0290l9908K557Q069J202J5430J6881n674j3432Q754J6273k3403r59
$$ 64995 44705 4797 7354 15423 16625 32055 48936 43262 29830 38584 54857 31454 30495
16264C0495K5829J7529N618l2281j9752k0129J2350J5667k1647j663M6740K8280
$$ 30495 56324 73853 79471 47190 27438 7309 19659 35326 13679 12016 58756 87036
16252H7036j0112k6716j3680l6140l945J8430n830j8081J1311M370m1226L162
$$ 87036 76924 50208 36528 388 -3557 14873 9043 -9038 2273 6643 -34583 -31421
16240c1421J9509L0253j0352l5197J3012J1481k1272o820L9814M1465j0623l2037
$$ -31421 -11912 18341 7989 -27208 -14196 -2715 -23987 -30807 9007 50472 39849 7812
16228G812j8952O195K9556o049L27k8906p110K3935j5629q059J9645o803p554
$$ 7812 -11140 -4945 24611 18562 18889 -10017 -17127 6808 -8821 -16880 2765 -4038 -11592
16215a1592N137o838Q055J8970j9640K691n842j3249J2591p182p848J4568M624
$$ -11592 -6455 -13293 -5238 13732 -5908 -3217 -9059 -22308 -9717 -16899 -24747 -10179 -5555
16202e555M156J0876J0905j9881q373L7663P359k1070j1561l635o259P258J4403
$$ -5555 -1399 9477 20382 501 -7872 29791 37150 16080 4519 884 -5375 1883 16286
16189A6286K4643O38r369o227J173q454p408M4690L1169K0303j2820m4237l2178
$$ 16286 40929 41567 32198 25971 27144 18690 11282 55972 87141 107444 94624 50387 18209
16176A8209M3065L5378p05n754q912l9228k6485K1115k692j474m748r522j0003
$$ 18209 61274 96652 95947 90193 81281 42053 15568 36683 33991 32517 27769 18247 8244
16163H244o219j3187J3404l103n740O768J4105k4576l272k645J9479M446L319
$$ 8244 2025 -11162 2242 -861 -6601 167 14272 -10304 -13576 -16221 3258 7704 11023
16150A1023N586K5798R890j4452m3700k2413J1311J0653L1606K1274k4906k4949
$$ 11023 16609 42407 52297 37845 -5855 -28268 -16957 -6304 25302 46576 21670 -3279
16138c279j0493j3123j8446J9630J4485r941m582k3914K4208O60j01k996J37j4735
$$ -3279 -13772 -26895 -45341 -25711 -11226 -21167 -25749 -49663 -25455 -24795 -24896 -27892 -27755 -42490
16124d2490j3858M085M2321J4520P19J932K53k7888n274R086j1680q836q54p65
$$ -42490 -56348 -52263 -9942 4578 5297 7229 7482 -20406 -25680 -16594 -28274 -37110 -37964 -38729
16110c8729Q399m745J9822J292l851K698n885J3618J4197J0611M1479k7453k6095
$$ -38729 -30330 -35075 -15253 -13961 -17812 -15114 -20999 -7381 6816 17427 58906 31453 5358
16097E358P981j2649k3786J6860L963K457K7854k4450L795m0089l1137K2035K6152
$$ 5358 13339 690 -23096 -6236 -2273 184 28038 3588 7383 -32706 -63843 -41808 -15656
16084a5656L579J6312J6734j0012K9119q33L121l5837m7031j2797M5037J8702
$$ -15656 -12077 4235 20969 10957 40076 39243 42364 6527 -40504 -53301 -8264 10438
16072A0438R728k7218l9285l7022Q896J417q717N5892j728P32k816k3743J6168
$$ 10438 20166 -7052 -46337 -83359 -74463 -73046 -81763 -25871 -27599 -26867 -29683 -53426 -37258
16059c7258L0496k4338m572K1384J6279k6684j5705j5467J9179o502N311J6947
$$ -37258 -6762 -31100 -35672 -14288 1991 -24693 -40398 -55865 -36686 -43188 -37877 -20930
16047b0930J7987N513o483j321j3412k2595l0318K9366L9859L2494l275P86P574
$$ -20930 -2943 2570 -3913 -5234 -18646 -41241 -71559 -42193 -2334 30160 26885 27671 35245
16034C5245K39j0534j1849l6894K6956J8557L330l1255j6302m29o275o904K7673
$$ 35245 35484 24950 13101 -23793 3163 21720 25050 -6205 -22507 -22936 -29211 -36115 -8442
16021h442L9735j345p887k7480p434q77k1070J0860K3032J8084o828p126j729
$$ -8442 31293 29948 22061 -5419 -12853 -13730 -34800 -23940 -908 17176 10348 3222 1493
16008A493p450j1734j6022j1367J3713J9436L20P185O602j1526K994q47l6748
$$ 1493 -5957 -17691 -33713 -45080 -31367 -11931 -11611 -4426 2176 -9350 -6356 -7203 -43951
15995d3951l9497k012J2384L558J9812J1313k0735j6918p36N07r785J5117M547
$$ -43951 -83448 -85460 -73076 -69518 -49706 -38393 -59128 -76046 -76782 -76275 -86060 -70943 -66396
15982f6396K30K4642k4436q020O218m563r393k209M931J3727L5968J1401K2034
$$ -66396 -66166 -41524 -65960 -73980 -67762 -72325 -81718 -83927 -78996 -65269 -29301 -17900 4134
15969D134J4573K7532n08J0113o794m1408j277J9260j8343k8925j7241J5949j8064
$$ 4134 18707 46239 45731 55844 49050 7642 6365 25625 7282 -21643 -38884 -22935 -40999
15956d0999n08K2232p602j172p027r955j1499q093K0317O081l0511k8771L5354
$$ -40999 -41507 -19275 -26877 -28049 -35076 -45031 -56530 -64623 -44306 -38225 -68736 -97507 -62153
15943f2153K0687k6108P957J6118J6237J7997j2513j4752k1735k6589K0262L172
$$ -62153 -41466 -67574 -59617 -43499 -27262 -9265 -21778 -36530 -58265 -84854 -64592 -61420
15931f1420K3800L665j2033j7360p44L1274K2800J1908K59j4077L1003J1301K5656
$$ -61420 -37620 -33955 -45988 -63348 -64092 -32818 -10018 1890 2149 -11928 19075 30376 56032
15918E6032m811j9464P187k6008k2485l48O187l1265K5108L6359M796J2325j8475
$$ 56032 51221 31757 38944 12936 -9549 -9897 -3710 -34975 -9867 26492 31288 43613 25138
15905B5138k7707j3402k7318R617K4867M6722r048k2874k0866J5270j3694O494
$$ 25138 -2569 -15971 -43289 -33672 -8805 37917 28869 5995 -14871 399 -13295 -6801
15893f801m600O190P588j3575R697J1774p50K795M369n257p779k67K5878J715
$$ -6801 -11401 -5211 2377 -11198 -1501 10273 9523 12318 16687 11430 3651 3384 29262 30977
15879C0977k3087j4686k1956k6524L925q738j894N1763K6704j475k5033k9615
$$ 30977 7890 -6796 -28752 -55276 -51351 -60089 -61983 -10220 16484 15009 -10024 -39639
15867c9639p830J3676O022J6838J16J0865L8613j9821l2182l362J5580O153M786
$$ -39639 -47469 -33793 -27771 -10933 -10817 48 38661 18840 -13342 -16704 -1124 5029 9815
15854I815k3923j7773j0707M7380K6465K587O303P393j0713j459l2315J9317J4882
$$ 9815 -14108 -31881 -42588 4792 31257 33844 40147 47540 36827 35368 3053 22370 37252
15841C7252j0771k169o936j8697O313m0650k1802J0084P116J700l16J1841J5399
$$ 37252 26481 24312 17376 -1321 4992 -35658 -57460 -47376 -40260 -38560 -38876 -27035 -11636
15828a1636K4668r154K036r630Q33m161M822J1349K063l0165R866K5315j9271
$$ -11636 13032 3878 5914 -3716 -2883 -7044 -2222 9127 11190 -18975 -9109 16206 -3065
15815c065J9385R183k9135l0100j0183n724K3763K3080r944j9521j6725J4297
$$ -3065 16320 25503 -3632 -33732 -43915 -49639 -25876 -2796 -12740 -32261 -48986 -34689
15803c4689j499J0742o641O501J0643J895p703k1757k1373J5249k1884K7726l347
$$ -34689 -36188 -25446 -32087 -25586 -14943 -13048 -20751 -42508 -63881 -48632 -70516 -42790 -46137
15790d6137J899K63J9736J4517q958m789k9960M615R252M6j689K1310Q870M031
$$ -46137 -44238 -43975 -24239 -9722 -18680 -23469 -53429 -48814 -39562 -39516 -41205 -19895 -11025 -6994
15776f994J0040O979j3460q464p604L4041J3079j4321K1302P944p099N181j1825
$$ -6994 3046 10025 -3435 -11899 -19503 14538 27617 13296 34598 42542 35443 40624 28799
15763B8799L743j1280J4460n587m066p238j4120n663k7631l5303j2752K6780L2531
$$ 28799 32542 21262 35722 30135 26069 18831 4711 -952 -28583 -63886 -76638 -49858 -17327
15750a7327j427m770O795j8520J1444K6165j9179m407J2381J8162J4384n136J810
$$ -17327 -18754 -23524 -16729 -35249 -23805 2360 -16819 -21226 -8845 9317 23701 18565 20375
15737B0375R737m8867K360J5571K8943k7333k9265J5536q866M376Q196j4389l6880
$$ 20375 30112 -18755 -16395 -824 28119 786 -28479 -12943 -21809 -17433 -9237 -23626 -60506
15724f0506j5527J5927J5813L1181K9225r760j9344m307j1035n759m145K5372
$$ -60506 -76033 -60106 -44293 -13112 16113 6353 -12991 -17298 -28333 -34092 -38237 -12865
15712a2865l340J3595M574J8409M246j6686o508k1080J7718K7000L971P122J1882
$$ -12865 -16205 -2610 1964 20373 24619 7933 1425 -19655 -1937 25063 29034 36156 48038
15699D8038K141k1133O600q824j3577j0101P852K2902m503O04l5526j2851j0635
$$ 48038 50179 29046 35646 26822 13245 3144 10996 33898 29395 29999 -5527 -18378 -29013
15686b9013m594K9744J6158L2922q71k045k0854K687n959j5740o50j792j6434
$$ -29013 -33607 -3863 12295 45217 44346 42301 21447 24134 18175 2435 1785 -7 -16441
15673a6441Q155L4331O754k8784k1963l567M542J9273J2036r893p180j7481J2727
$$ -16441 -8286 26045 32799 4015 -17948 -21515 -16973 2300 14336 4443 -2737 -20218 -7491
15660g491L5699J5411j7732m1164j6514J8234k0554P159K2352L6064K3762k4606
$$ -7491 28208 43619 25887 -15277 -31791 -13557 -34111 -26952 -4600 31464 55226 30620
15648C0620k7794k1999k650K7823o790J568j0298k709M987k0889j6635J4547K5922
$$ 30620 2826 -19173 -21823 6000 -790 778 -9520 -12229 -7242 -28131 -44766 -30219 -4297
15635d297M956M315J391O136p186l635J0555l727J6655Q440k3902k4638Q961K1538
$$ -4297 659 4974 6365 12501 5315 1680 12235 8508 25163 33603 9701 -14937 -5976 15562
15621A5562p12k5049J1004J3182L898m5172k9472J5225J6845q441o819k1718J5384
$$ 15562 14850 -10199 805 13987 17885 -27287 -56759 -41534 -24689 -33130 -39949 -61667 -46283
15608d6283K9627J1570k133Q367l2794l967J8296j9072J147O180L3522L3155k127
$$ -46283 -16656 -5086 -7219 1148 -31646 -35613 -17317 -36389 -35242 -29062 4460 37615 35488
15595C5488l7436j1217J9155j5589j0959p562j0072O263J5723K1306L3607l7414
$$ 35488 -1948 -13165 5990 -9599 -20558 -28120 -38192 -31929 -16206 5100 38707 1293
15583A293m3681k3470J0848M1861q83j0158J3008J0993k2245J5634M625J3154
$$ 1293 -42388 -65858 -55010 -13149 -14032 -24190 -11182 -189 -22434 -6800 -2175 10979
15571A0979j121k3592L1960K8207q992Q907K187l0008j5065m774k2077K5742L5797
$$ 10979 9858 -13734 18226 46433 37441 46348 48535 18527 3462 -1312 -23389 2353 38150
15558C8150L928j7062j0202j248J0442j80J0713j2256j3738K795j9822k3410K2149
$$ 38150 42078 25016 14814 13566 24008 23828 34541 22285 8547 11342 -8480 -31890 -9741
15545i741J4047J0846o259l225k9987n766K3724J2895J5807k012k6587N257J6265
$$ -9741 4306 15152 8893 5668 -24319 -30085 -6361 6534 22341 20329 -6258 -1001 15264
15532A5264q457P669j776m246J230j9847k5395o698k0864J2722K3728L3965q271
$$ 15264 6807 14476 12700 8454 9684 -10163 -35558 -42256 -63120 -50398 -26670 7295 -976
15519i76R971r479J1958o505K2407L7794l4132k9169o11p011k1091K8926j2819
$$ -976 8995 -484 11474 4969 27376 65170 31038 1869 1258 -5753 -26844 2082 -10737
15506a0737k7107M45Q175r450M563K753O714j2981k6281J6606K6323J0148l1373
$$ -10737 -37844 -37399 -29224 -38674 -34111 -31358 -24644 -37625 -63906 -47300 -20977 -10829 -42202
15493d2202J6079J6379M843j2148l3620j5071j1053M1023R396K149K5058K1350
$$ -42202 -26123 -9744 -4901 -17049 -50669 -65740 -76793 -35770 -26374 -24225 833 22183
15481B2183L484l960K8808O704k7730m2036j2123r489L3181k2756p8724o904M4115
$$ 22183 25667 21707 50515 57219 29489 -12547 -24670 -34159 -978 -23734 -102458 -109362 -65247
15468f5247L2947Q631N231O392q187K640r722J491K6796L5891J8520J3464q800
$$ -65247 -32300 -23669 -18438 -12046 -20233 -17593 -27315 -25824 972 36863 55383 68847 60047
15455F0047k5069r836J9038L6031l432m3724k7249R31L7776l7354l3822r076J328
$$ 60047 34978 25142 44180 80211 76779 33055 5806 6737 44513 7159 -26663 -35739 -34411
15442c4411j1417q989M862K5510L3K2521J1241k8585l543K041M980n014k481K6794
$$ -34411 -45828 -54817 -49955 -24445 -24412 -1891 9350 -19235 -22778 -20737 -15757 -20771 -23252 3542
15428C542m035J3113p986k9718m589p634L111n557k6724J3879l241R542J0857
$$ 3542 -493 12620 4634 -25084 -29673 -37307 -34196 -39753 -66477 -52598 -55839 -46297 -35440
15415c5440M662n371K4220J7079Q372l6121m688m311J4538L5815K0057j3042N96
$$ -35440 -30778 -36149 -11929 5150 13522 -22599 -27287 -31598 -17060 18755 38812 25770 26366
15402B6366j1940J2532J3620k6113j2939j3300j216K6628L4250j9976r457p735
$$ 26366 14426 26958 40578 14465 1526 -11774 -12990 13638 47888 27912 18455 10720
15390A0720k2345j9594R857J2689n557n629j1474j6683J6407K950J5223R850N943
$$ 10720 -11625 -31219 -21362 -8673 -14230 -19859 -31333 -48016 -31609 -28659 -13436 -3586 2357
15377B357K816j3858j3514Q530Q879k1467K009K1032o153k3542l392L0883J1473
$$ 2357 5173 -8685 -22199 -13669 -4790 -26257 -24248 -3216 -9369 -32911 -36303 -5420 6053
15364F053m0300Q981M4922l9985m3469J9021R067q393K4841j3964j7425n213M598
$$ 6053 -34247 -25266 19656 -20329 -63798 -44777 -35710 -44103 -19262 -33226 -50651 -55864 -51266
15351e1266O826O095K7591J3283Q822n183M373m3543p704j7095J7164j4044j2927
$$ -51266 -44440 -38345 -10754 2529 11351 6168 10541 -33002 -40706 -57801 -40637 -54681 -67608
15338f7608L1026Q210m258J2840j3614L6490P693j8969n938K0050k5138j7058
$$ -67608 -36582 -28372 -32630 -19790 -33404 3086 10779 -8190 -14128 5922 -19216 -36274
15326c6274m141J5472j6884j9119K8343K2786j6511j1452J1173L0937L0171n098
$$ -36274 -40415 -24943 -41827 -60946 -32603 -9817 -26328 -37780 -26607 4330 34501 29403
15314B9403m4666k2791J4969j4753j3578j6415K6839J5191o223m2924j8869L2669
$$ 29403 -15263 -38054 -23085 -37838 -51416 -67831 -40992 -25801 -32024 -74948 -93817 -61148
15302f1148j0776J3023J1453K0463J0641j6514L3407j889j326p779P97j2645p112
$$ -61148 -71924 -58901 -47448 -26985 -16344 -32858 549 -1340 -2666 -10445 -9648 -22293 -29405
15289b9405R806k725O194j0068m4782J0834K6152K8937m904k1917j7878m319P192
$$ -29405 -19599 -22324 -16130 -26198 -70980 -60146 -33994 -5057 -9961 -31878 -49756 -54075 -46883
15276d6883o504j7663Q158J0643J2564J300K7594L922k5364p93J9790M715J7560
$$ -46883 -53387 -71050 -62892 -52249 -39685 -38385 -10791 -6869 -32233 -33026 -13236 -8521 9039
15263I039J3568j0126K3328J1667j0814J4638p98r262j4156k4453j2281k9812
$$ 9039 22607 12481 35809 47476 36662 51300 50502 41240 27084 2631 -9650 -39462
15251c9462J7138R742J5818J2485j2096P182j3539L511J9789r041K0088j6932
$$ -39462 -22324 -12582 3236 15721 3625 10807 -2732 779 20568 11527 31615 14683
15239A4683j708J1352n266J6331k438m3479P656K3880k7453l5469j0293L849L267
$$ 14683 12975 24327 19061 35392 32954 -10525 -2869 21011 -6442 -41911 -52204 -48355 -45088
15226d5088j5321Q817K6195K4626m198R58J9261m3493j7765K9763k385m8162j06
$$ -45088 -60409 -51592 -25397 -771 -4969 -4011 15250 -28243 -46008 -16245 -18630 -66792 -66898
15213f6898J9018K2945K2613m372M275K7671j3320n2355j808J6417j3562k0879
$$ -66898 -47880 -24935 -2322 -6694 -2419 25252 11932 -40423 -42231 -25814 -39376 -60255
15201f0255r510K019J0192J7226p906J3044J2535j1656R94J138J2698M7808K6197
$$ -60255 -69765 -67746 -57554 -40328 -48234 -35190 -22655 -34311 -33317 -32179 -19481 28327 54524
15188E4524k1076l1214j9725J055K322K1770J6284p183j4063R60L7794j8854l607
$$ 54524 33448 2234 -17491 -16436 -14114 7656 23940 16757 2694 3654 41448 22594 18987
15175A8987j4190r939j4219j7713J7007K4509j7832m081L204L404o492j3641O082
$$ 18987 4797 -5142 -19361 -37074 -20067 4442 -13390 -17471 -14267 -10863 -17355 -30996 -24914
15162b4914r009l803j910M3979J2038K46j7839j6126j341l003j6322j1494J5556
$$ -24914 -33923 -37726 -39636 4343 16381 16627 -1212 -17338 -18679 -21682 -38004 -49498 -33942
15149c3942J3935Q81j1060l425K319J4589N230l6204n184K2188K9485J9925j7496
$$ -33942 -20007 -19126 -30186 -33611 -31292 -16703 -11473 -47677 -52861 -30673 -1188 18737 1241
15136A241j9050m100P857J299J2365N227J5627N121j5098j2022P428P644k2029
$$ 1241 -17809 -21909 -14052 -12753 -388 4839 20466 25587 10489 -1533 5895 13539 -8490
15123h490j8756R31O378l0238j6817J471L5736K4518J1484n449K0004J4558j9707
$$ -8490 -27246 -26315 -19937 -50175 -66992 -65521 -29785 -5267 6217 768 20772 35330 15623
15110A5623p320J3794K0902N894l5861j2885j3262J7096J9603j7607k786k609
$$ 15623 8303 22097 42999 48893 13032 147 -13115 3981 23584 5977 3191 582
15098E82J2771M580k8626l6166p70J9266J7157K0406m187k6190p367J7782K471
$$ 582 13353 17933 -10693 -46859 -47629 -28363 -11206 9200 5013 -21177 -28544 -10762 -8291
15085h291J3166K4370j4688J6478k4518r825J0753J2440k4088k3748p52J6007
$$ -8291 4875 29245 14557 31035 6517 -3308 7445 19885 -4203 -27951 -28703 -12696
15073a2696Q674k0150K082J9590K3491j5723k8519j2664P472j3647R498j1387
$$ -12696 -4022 -24172 -22090 -2500 20991 5268 -23251 -35915 -28443 -42090 -32592 -43979
15061d3979J2298l908J665J5382r974j5062J1382K2102j6551o593Q87j855J792
$$ -43979 -31681 -35589 -33924 -18542 -28516 -43578 -32196 -10094 -26645 -33238 -32351 -34206 -32414
15048c2414L5182P435L1283j9627m4391k4262j6409K975J7097K3314k0009J021
$$ -32414 2768 10203 41486 21859 -22532 -46794 -63203 -60228 -43131 -19817 -39826 -38805
15036c8805r72k239J2425K7661Q184k8052m0492M02L1190J0376l373J6262K357
$$ -38805 -39777 -42016 -29591 -1930 6254 -21798 -62290 -61888 -30698 -20322 -23695 -7433 -5076
15023e076j4244j1552j053j0630k8135J0495L2741L0159L396q983o506P414R66
$$ -5076 -19320 -30872 -31925 -42555 -70690 -60195 -27454 2705 6101 -2882 -9388 -1974 -1008
15010a008j2827l605j3299N320L250j3350J4653r105k4784J308P621j6659J135
$$ -1008 -13835 -17440 -30739 -25419 -22169 -35519 -20866 -29971 -54755 -53447 -45826 -62485 -61350
14997f1350J2765M1622R771j2691k1931J490J0896J9471J6450K554k5975p457
$$ -61350 -48585 -6963 2808 -9883 -31814 -30324 -19428 43 16493 19047 -6928 -14385
14985a4385J3102l262L911n196J3398M5429o88m684k1253k278k1759k7906o0J2949
$$ -14385 -1283 -4545 -634 -5830 7568 52997 52309 47625 26372 24094 2335 -25571 -25631 -12682
14971a2682Q714J8624j5927j2497k5522J6285J2173j429O90K0573K1517J6862
$$ -12682 -3968 14656 -1271 -13768 -39290 -23005 -10832 -12261 -11571 9002 30519 47381
14959D7381j9349k2556m841l4O452L754N730j8746n889l0267k064J5971j7155
$$ 47381 28032 5476 635 601 7053 10807 16537 -2209 -8098 -38365 -40429 -24458 -41613
14946d1613P033J7667R016j0883m789J2934L269J1015K1273m843j4305k8332M600
$$ -41613 -34580 -16913 -7897 -18780 -23569 -10635 -7366 3649 24922 20079 5774 -22558 -17958
14933a7958q22m138n928j1831j8437l496J4799K4391J3069q521k5431Q0J612J4179
$$ -17958 -18780 -22918 -28846 -40677 -59114 -62610 -47811 -23420 -10351 -18872 -44303 -44223 -42611 -28432
14919b8432K119j9664K9286M2327J982j9060j7137j72j0735J1487L3026K00J1374
$$ -28432 -26313 -45977 -16691 25636 27618 8558 -8579 -8751 -19486 -7999 25027 25227 36601
14906C6601M175j3984l0082j1077P847J5382j6426p654j0316L3732K7612k8409
$$ 36601 40776 26792 -3290 -14367 -6520 8862 -7564 -15218 -25534 8198 35810 7401
14894G401j4970n577l835K5226J7241m841j8904k5617k1804n271j3695n274J9778
$$ 7401 -7569 -13146 -16981 8245 25486 20645 1741 -23876 -45680 -50951 -64646 -69920 -50142
14881e0142K0346J0489J6934J0120k2818R825K6764J490o859n985n4275o397M0916
$$ -50142 -29796 -19307 -2373 7747 -15071 -5246 21518 23008 16149 10164 -44111 -50508 -9592
14868i592p807j9156J7426K3803j1300j8289L5503m891p509k8951k1638J8407
$$ -9592 -17399 -36555 -19129 4674 -6626 -24915 10588 5697 -1812 -30763 -52401 -33994
14856c3994P738K119M5811j866j863l2867k0648P325R756K9775J4917m0154l0566
$$ -33994 -26256 -24137 21674 19808 17945 -14922 -35570 -28245 -18489 11286 26203 -13951 -44517
14843d4517j2345M786O314K0965J6849r355k21n263p849Q85L1774k0509n3256
$$ -44517 -56862 -52076 -45762 -24797 -7948 -17303 -17524 -22787 -30636 -29751 2023 -18486 -71742
14830g1742l4900L4355K9077j493J8784J4340r967M765K886j4103j2756J4055
$$ -71742 -106642 -72287 -43210 -44703 -25919 -11579 -21546 -16781 -13895 -27998 -40754 -26699
14818b6699R5K239k827K4962M055j7345k5225l467p493M230Q99J9476K0690j9251
$$ -26699 -26604 -24365 -27192 -2230 1825 -15520 -40745 -44212 -51705 -47475 -46576 -27100 -6410 -25661
14804b5661k8187n3L1738J9632m312j7471j5638l2717L750m988j884M1704K3774
$$ -25661 -53848 -53901 -22163 -2531 -6843 -24314 -39952 -72669 -68919 -73907 -75791 -34087 -10313
14791a0313O698k1212j6272J6468j7467q990L0383J3754J1949r96O548L780L847
$$ -10313 -3615 -24827 -41099 -24631 -42098 -51088 -20705 -6951 4998 4002 10550 14330 18177
14778A8177P847j532j341J35K3388j1427k7862k4681p496J5643L5027K3958N279
$$ 18177 26024 24492 23151 23286 46674 35247 7385 -17296 -24792 -9149 25878 49836 55115
14765E5115J7549q032o610p422m616k2474j4098J4195K3836M2342J5822j6442
$$ 55115 72664 64632 58022 50600 45984 23510 9412 23607 47443 89785 105607 89165
14753H9165k2967k034L1639R718k9167l2688k3784k3620k0969q277P406L297n910
$$ 89165 66198 64164 95803 105521 76354 43666 19882 -3738 -24707 -32984 -25578 -22281 -28191
14740b8191K3085M714m1991j9992m143K1045K4007n946N083J0705n508k03q153
$$ -28191 -5106 -392 -42383 -62375 -66518 -45473 -21466 -27412 -22329 -11624 -17132 -17335 -25488
14727b5488K0040J5986J7921J5538k0712L203j7128M901J2651o9304j1173L3579
$$ -25488 -5448 10538 28459 43997 23285 26488 9360 14261 26912 -42392 -53565 -19986
14715a9986J6529K511N033r087j6379N934K0169J1623j5475K630M8J125m520P90
$$ -19986 -3457 -946 4087 -5000 -21379 -15445 4724 16347 872 3502 3550 4675 155 945
14701I45J732l1634m433J7684J357j1284k0672j5546J7923J3469J7982R070J6488
$$ 945 2677 -28957 -33390 -15706 -14349 -25633 -46305 -61851 -43928 -30459 -12477 -3407 13081
14688A3081L2930m4382l3456P448J8090M783j4564K0432L922J476J391m985k1735
$$ 13081 46011 1629 -31827 -24379 -6289 -1506 -16070 4362 8284 9760 11151 6166 -15569
14675a5569Q725J9533J2743q210k5603m0298j6817n046R541O644k056J5034p839
$$ -15569 -6844 12689 25432 17222 -8381 -48679 -65496 -70542 -61001 -54357 -56413 -41379 -49218
14662d9218p324L2478L4791Q116o437n293J6226o131R82m769m5199q635N2813
$$ -49218 -56542 -24064 10727 18843 12406 7113 23339 17208 18190 13421 -31778 -40413 12400
14649A2400K5150m7564j441L5605L0177j2805l0850r871m7496O251L0074K6083
$$ 12400 37550 -10014 -11455 24150 54327 41522 10672 801 -46695 -40444 -10370 15713
14637A5713J1793K0687j3309m1869K4716P798K692J0626j009j1074k2278q181
$$ 15713 27506 48193 34884 -6985 17731 25529 28221 38847 37838 26764 4486 -3695
14625c695J1269j078J6338l0354O094J5780J326m132n874Q941K8834j6238n7655
$$ -3695 7574 6496 22834 -7520 -1426 14354 15680 11548 5674 14615 43449 27211 -30444
14612c0444l9754n364K6354K7543K2413j156j8286l4877K3502L4621J8010j303
$$ -30444 -70198 -75562 -49208 -21665 748 -408 -18694 -53571 -30069 4552 22562 21259
14600B1259j5204j7931J5818L0261j4593j7989j7316j727p253R77j2892P984k760
$$ 21259 6055 -11876 3942 34203 19610 1621 -15695 -17422 -24675 -23698 -36590 -28606 -31366
14587c1366j0081J9185J8466L487o75l318o065j6585P183J7946r180k1008l236
$$ -31366 -41447 -22262 -3796 -309 -984 -4302 -10367 -26952 -19769 -1823 -11003 -32011 -35247
14574c5247n585Q246L3421M6243j417k1396j0845q001j2345m747p387J2409K1595
$$ -35247 -40832 -32586 835 47078 45661 24265 13420 5419 -6926 -11673 -19060 -6651 14944
14561A4944J6361j5942j9278p45n537J1113l2216N511L7658j4868m2079J4186
$$ 14944 31305 15363 -3915 -4660 -10197 916 -31300 -25789 11869 -2999 -45078 -30892
14549c0892J5887J0118K6014K370m0738k7763m442N814K1582J3030K2537L6326
$$ -30892 -15005 -4887 21127 23497 -17241 -45004 -49446 -43632 -22050 -9020 13517 49843
14537D9843k0477j937r514l2174J6299K5414j1514o6339k4993J2185K5528P840
$$ 49843 29366 27429 17915 -14259 2040 27454 15940 -50399 -75392 -63207 -37679 -29839
14525b9839j320k2478K7866R439j8895J5547M2504j209k327o454o930R292o267
$$ -29839 -31159 -53637 -25771 -16332 -35227 -19680 22824 21615 19288 12834 5904 15196 8929
14512H929l085R624Q118K5072k9887l0383K0684R155K785q188L013J4689q692
$$ 8929 5844 15468 23586 48658 18771 -11612 9072 18227 21012 12824 15837 30526 21834
14499B1834n796j3958k8637q070K3259N694k1351J3575J4231o837l4037M091L7664
$$ 21834 16038 2080 -26557 -34627 -11368 -5674 -27025 -13450 781 -6056 -40093 -36002 1662
14486A662K084L014k5399m508L242l9057K2920L3547p96R226K019k2170j5031
$$ 1662 3746 6760 -18639 -23147 -19905 -58962 -36042 -2495 -3291 5935 7954 -14216 -29247
14473b9247Q274K3356R276j5214j3198P841M816Q567l7252n958K3216K105R443
$$ -29247 -20973 2383 11659 -3555 -16753 -8912 -4096 4471 -32781 -38739 -15523 -13418 -3975
14460c975J034j6372p944k181M0106K7194m220q381M425L629o24k024r006M17
$$ -3975 -2941 -19313 -27257 -29438 10668 37862 33642 25261 29686 33315 32691 30667 21661 22078
14446B2078p681j422R943M671J1196K3469O23l0423l1992j788Q870J1662o387
$$ 22078 14397 12975 22918 27589 38785 62254 62877 32454 462 -1326 7544 19206 12819
14433A2819J652l813j3772l5737J1965N1592M295j2092K3824q268j4849p107k1553
$$ 12819 14471 10658 -3114 -38851 -26886 24706 29001 16909 40733 32465 17616 10509 -11044
14420a1044J3495k5820j1872k189p077Q264J7989K7530K4785O191K2338k4115
$$ -11044 2451 -23369 -35241 -37430 -44507 -36243 -18254 9276 34061 40252 62590 38475
14408C8475j4593O862l769k48j1665j0875j7095k1114R522N931J1272R640J2735
$$ 38475 23882 30744 26975 26727 15062 4187 -12908 -34022 -24500 -18569 -7297 2343 15078
14395A5078k6718k0559N612M018J3539k830K366J057L9233L4617J8995k265j9381
$$ 15078 -11640 -32199 -26587 -22569 -9030 -11860 -9494 -8437 30796 65413 84408 82143 62762
14382F2762m2016j6473K0701P469k3496m89j843O33N4942K096l0164J8895J4260
$$ 62762 20746 4273 24974 32443 8947 8458 6615 7248 62190 64286 34122 53017 67277
14369F7277k141o081j0929J8011j2156k6374j1430o698K233q474L059J1190K1577
$$ 67277 65136 59055 48126 66137 53981 27607 16177 9479 11712 3238 6297 17487 39064
14356C9064K3092K5337L917m7545k4704J4380L742l7916J5118J8818P250k1683
$$ 39064 62156 87493 91410 43865 19161 33541 37283 -633 14485 33303 40553 18870
14344A8870J6982J0683M966m811k9911j6791j1976J9044j7575k3197L6694O802
$$ 18870 35852 46535 51501 46690 16779 -12 -11988 7056 -10519 -33716 2978 9780
14332I780j4801j8449j3787J0528J1782l442P004J863l511K1228k4290k6469J5624
$$ 9780 -5021 -23470 -37257 -26729 -14947 -18389 -11385 -9522 -13033 8195 -16095 -42564 -26940
14319b6940n753j0066K0741J4120K0329k580m709Q631q886J5171k299l8684j7084
$$ -26940 -32693 -42759 -22018 -7898 12431 9851 5142 13773 4887 20058 17759 -20925 -38009
14306c8009K2539J3273O632j6018j2165j1165n447P676R494L92K0393J1530R646
$$ -38009 -15470 -2197 4435 -11583 -23748 -34913 -40360 -32684 -23190 -22798 -2405 9125 18771
14293A8771K0557r969J883J4815j6926p80j9557N912R877P373k862K0871l2045
$$ 18771 39328 29359 31242 46057 29131 28351 8794 14706 24583 31956 29094 49965 17920
14280A7920m78K3692N896k4681J11j7560K1405j1316J824J7414p701o805l4013
$$ 17920 17442 41134 47030 22349 22460 4900 26305 14989 16813 34227 26526 19721 -14292
14267a4292r989r024K6696M7111J852j7459j259n338j956L552k1791j0221k1394
$$ -14292 -24281 -33305 -6609 40502 42354 24895 23636 18298 16342 19894 -1897 -12118 -33512
14254c3512k0549M4563K3784l0483L1818L1306m414k4376l705J824r78r391r212
$$ -33512 -54061 -9498 14286 -16197 15621 46927 42513 18137 14432 16256 15278 5887 -3325
14241c325L2733j4621j1348m494M094j0849L5997k688m168K721o802J4436k6593
$$ -3325 29408 14787 3439 -1055 3039 -7810 28187 25499 21331 24052 17250 31686 5093
14228E093j0031j3139J0348J9540n764l2543P527M1855n357j346l3615J0360M107
$$ 5093 -4938 -18077 -7729 11811 6047 -26496 -18969 22886 17529 16183 -17432 -7072 -2965
14215b965J3643J2871o008J5381J8782l8553j3051k929j0408J4714L1246r716
$$ -2965 10678 23549 17541 32922 51704 13151 100 -2829 -13237 1477 32723 23007
14203B3007m3902j3335n553K0975J7688L295J6063o271l1180l6915K3003J7245
$$ 23007 -20895 -34230 -39783 -18808 -1120 2175 18238 11967 -19213 -56128 -33125 -15880
14191a5880j186j118J760L0774q458j6256l9076J6119L7051l4J7011J3317m10
$$ -15880 -17066 -18184 -16424 14350 5892 -10364 -49440 -33321 3730 3696 20707 34024 33614
14178C3614k88K2485K679n628m1874j4857J4073k213k2251m138J7246k7469K4110
$$ 33614 33326 55811 58490 52862 10988 -3869 10204 7991 -14260 -18398 -1152 -28621 -4511
14165d511K1428J7266l5846k3321j6032O315Q876Q821K5764P515k2616k418k6845
$$ -4511 16917 34183 -1663 -24984 -41016 -34701 -25825 -17004 8760 16275 -6341 -8759 -35604
14152c5604J0005O846Q14P429L3397j401k6864o963J3522K4364N107j6097k5400
$$ -35604 -25599 -18753 -17939 -10510 22887 21486 -5378 -12341 1181 25545 30652 14555 -10845
14139a0845k0085R793J0373K1679O9789Q9859N3306k6150p6373p9876l8688j1477
$$ -10845 -30930 -21137 -10764 10915 80704 170563 223869 197719 121346 41470 2782 -8695
14127h695J7506o638j9530R84o909n462M079K1423K329N440K0648K2680m3288
$$ -8695 8811 2173 -17357 -16373 -23282 -28744 -24665 -3242 -913 4527 25175 47855 4567
14114D567l3719K3466P766J7686j1765K958l332P253J957L6381Q491j6549o967
$$ 4567 -29152 -5686 2080 19766 8001 10959 7627 14880 16837 53218 61709 45160 38193
14101C8193L97k204j3130q985J0771L1895M1654K3217K3238O6927J06122J36244
$$ 38193 38590 36386 23256 14271 25042 56937 98591 121808 145046 211973 318095 454339
14089D54339J49707M9409r0017j46220j09586r3106q2630l1726l4122l3587k2897
$$ 454339 604046 653455 563438 417218 307632 214526 131896 100170 66048 32461 9564
14078I564p586O996o781j3453K0746J7190J9627K2144J396j9085l2767k3428R536
$$ 9564 1978 8974 2193 -11260 9486 26676 46303 68447 69843 50758 17991 -5437 4099
14065D099m027r58L142l726J0975K2250J6530k9817k110L426Q35K9836j3567J4654
$$ 4099 72 -886 2256 -1470 9505 31755 48285 18468 16358 19784 20619 50455 36888 51542
14051E1542L962K6770L6510M3284L8755J06979J46814J62121N9889r1315j57063
$$ 51542 55504 82274 118784 162068 200823 307802 454616 616737 676626 585311 428248
14040D28248j41572r3191q3080k9683k0072j1411k5601j3749J5722j0746k2939
$$ 428248 286676 193485 110405 80722 60650 49239 23638 9889 25611 14865 -8074
14029h074J3854J8518l706j8740N001K011J1805K3664R363J2477k6641m0339L478
$$ -8074 5780 24298 20592 1852 6853 8864 20669 44333 53696 66173 39532 -807 2671
14016B671j8508k3533K1708J3999k7734k0837k254K8031L3694k3182Q419k5014
$$ 2671 -15837 -39370 -17662 -3663 -31397 -52234 -54488 -26457 7237 -15945 -7526 -32540
14004c2540p913N4056K6586L8107L7829M7883N5009j8265n0519l3254m6835l6051
$$ -32540 -40453 13603 40189 78296 116125 164008 219017 200752 150233 116979 70144 34093
13992C4093j8914o060k7522p676J1198K6521j66k5562j2103J9745K665N860J8299
$$ 34093 15179 9119 -18403 -26079 -14881 11640 11474 -14088 -26191 -6446 -3781 2079 20378
13979B0378J100j2006M725j7794j8570j924L9191j7551l2083j9543K6324L5067
$$ 20378 21478 9472 14197 -3597 -22167 -24091 15100 -2451 -34534 -54077 -27753 7314
13967G314k3588k4970P799j5899M044O739r779j7851j3187K5616J621K4693N989
$$ 7314 -16274 -41244 -33445 -49344 -45300 -38561 -48340 -66191 -79378 -53762 -52141 -27448 -21459
13954b1459l713R539J2289k1506k5096O49L739q465J6225J0151N214m008j2084
$$ -21459 -25172 -15633 -3344 -24850 -49946 -49297 -45558 -54023 -37798 -27647 -22433 -26441 -38525
13941c8525J9224N4760J9903j250l080j6617M283k1390k0703k380k5691j5312
$$ -38525 -19301 35459 55362 54112 51032 34415 38698 17308 -3395 -5775 -31466 -46778
13929d6778J3868L3063P951J4697l3199k3005n563K9621o20K1572N474j9973k417
$$ -46778 -32910 153 8104 22801 -10398 -33403 -38966 -9345 -9965 11607 17081 -2892 -5309
13916e309k3467K365K3946r443J0145k755l1008o757J1809n109j4005j299N802
$$ -5309 -28776 -26411 -2465 -11908 -1763 -4518 -35526 -42283 -30474 -35583 -49588 -50887 -45085
13903d5085j5065Q872O674K5133j0164q684k272j9798J4399J1468r477N539J3024
$$ -45085 -60150 -51278 -44604 -19471 -29635 -38319 -40591 -60389 -45990 -34522 -43999 -38460 -25436
13890b5436N289K3795J3374r352l5180q698N553J4780J0214Q17o41J1471K7579
$$ -25436 -20147 3648 17022 7670 -27510 -36208 -30655 -15875 -5661 -4844 -5485 5986 33565
13877C3565N617j6641k6637j2023N945J3901J8630j6891j9284l2978J7612q069
$$ 33565 39182 22541 -4096 -16119 -10174 3727 22357 5466 -13818 -46796 -29184 -37253
13865c7253j0390J6839J1818K759L946j7283L139k978k0267J3068J3059O016J5620
$$ -37253 -47643 -30804 -18986 -16227 -12281 -29564 -26425 -29403 -49670 -36602 -23543 -17527 -1907
13852a907j7363p38M6791n783Q252K5343J6825l3707j4394k625k4136j6534R124
$$ -1907 -19270 -20008 26783 21000 29252 54595 71420 37713 23319 20694 -3442 -19976 -10852
13839a0852J6010o931J1940K7074M8871J3749j659n715n4402l2032K8781R863
$$ -10852 5158 -1773 10167 37241 86112 99861 98202 92487 38085 6053 34834 44697
13827D4697K4050k2749k1090k2633q758K6241j5902r600j8429R844J9395l722
$$ 44697 68747 45998 24908 2275 -6483 19758 3856 -5744 -24173 -14329 5066 1344
13815A344k465N208L9173j9157m0946K3914J2655m519K6977K631P511j0775j3112
$$ 1344 -1121 4087 43260 24103 -16843 7071 19726 15207 42184 44815 52326 41551 28439
13802B8439K4749l6060l360j083M417P926L9024J0074O060l341L53k613o026j0186
$$ 28439 53188 17128 13768 12685 17102 25028 64052 74126 80186 76845 77198 74585 68559 58373
13788E8373k2819l0241j4532R052K8451L268q159k139k9736j3616k7207j6883
$$ 58373 35554 5313 -9219 -167 28284 31552 23393 21254 -8482 -22098 -49305 -66188
13776f6188o018J7293M0105K5828o888p80o753M152N514o993l7887k7521n120
$$ -66188 -72206 -54913 -14808 11020 4132 3352 -3401 751 6265 -728 -38615 -66136 -71256
13763g1256M471k272K7004J3724L4176K0953k7321p25O403K2777Q939K765Q055
$$ -71256 -66785 -69057 -42053 -28329 5847 26800 -521 -1246 5157 27934 36873 39638 47693
13750D7693K3456J4894K8207o818j7339m7906j344j4289l9369R368L3997K2474
$$ 47693 71149 86043 114250 107432 90093 42187 40843 26554 -12815 -3447 30550 53024
13738E3024P128j2158j8698R169j1076n499m4923L299K9403M006K4295J9285P119
$$ 53024 60152 47994 29296 38465 27389 21890 -23033 -19734 9669 13675 37970 57255 64374
13725F4374j0005m6300M834J7434j9810L80K874M9880K0821k5127K6492K2091
$$ 64374 54369 8069 12903 30337 10527 10907 13781 63661 84482 59355 85847 107938
13713A07938R403j2433k5198L1970M4371K1015n184M5046L289K802L020m2151
$$ 107938 117341 104908 79710 111680 156051 177066 171882 216928 220217 223019 226039 183888
13701A83888r529m844j854L60J3180L0550K1477K3163L8160O5711O0986K9747
$$ 183888 174359 169515 167661 168021 181201 211751 233228 256391 294551 360262 421248 450995
13689D50995k765J3041M1201P5196P7931J04128J76987K28866K82936L55543L55497
$$ 450995 448230 461271 502472 577668 655599 759727 936714 1165580 1448516 1804059 2159556
13678B159556M57580O31860Q77307J451531K357102L836323O239122R196864R735698
$$ 2159556 2617136 3248996 4126303 5577834 7934936 11771259 18010381 27207245 36942943
13669C6942943L403259n363626r465523q119555n209550l123639j948789j268355
$$ 36942943 40346202 34982576 25517053 17397498 12187948 9064309 7115520 5847165
13661E847165q62714o44411n10045m47777m16172l95698k87241k20256j36214
$$ 5847165 4984451 4340040 3829995 3382218 2966046 2570348 2283107 2062851 1926637
13652A926637j01084n6162k0366K2547J5622J4443N8969M1867N1364J08136J31801
$$ 1926637 1825553 1769391 1749025 1771572 1787194 1801637 1860606 1902473 1953837 2061973 2193774
13641B193774J61768K21993L34390M17282N73100P77740R58341J034083J279074
$$ 2193774 2355542 2577535 2911925 3329207 3902307 4680047 5638388 6672471 7951545
13632G951545J755819K566091L992149O536545J0875255J7800682K7301922L2813719
$$ 7951545 9707364 12273455 16265604 22802149 33677404 51478086 78780008 111593727
13624A11593727J6680008j4050872l1045323k8064604j7641828j0252503o277301
$$ 111593727 128273735 114222863 83177540 55112936 37471108 27218605 20941304
13617B0941304m086746k755463j963735j527468j323298j211657j002316q34375
$$ 20941304 16854558 14099095 12135360 10607892 9284594 8072937 7070621 6236246
13609F236246o85601n13118m05031k66156k44827j93991j66137j46606q7958l925
$$ 6236246 5550645 5037527 4632496 4366340 4121513 3927522 3761385 3614779 3526821 3522896
13599C522896r755J3933R3901J57654J80716K78463L61150M84555P04858R18683
$$ 3522896 3513141 3527074 3620975 3778629 3959345 4237808 4598958 5083513 5788371 6707054
13589F707054J024844J248467J684901K457142L851573O281849J0417024J7065874
$$ 6707054 7731898 8980365 10665266 13122408 16973981 23255830 33672854 50738728
13581E0738728K6413738L3345977K0415413j0969401l0907962k9966706j9279960
$$ 50738728 77152466 110498443 130913856 119944455 89036493 59069787 39789827
13574C9789827j1186873o777882m366812k900907k059256j635364j358887j257441
$$ 39789827 28602954 21825072 17458260 14557353 12498097 10862733 9503846 8246405
13566H246405j051164q56947p30522n66938m27801l49693k82067k79953k26540
$$ 8246405 7195241 6338294 5607772 5040834 4613033 4263340 3981273 3701320 3474780
13557C474780j67159j40947j05252m8290o8837m8968k4766J429O7614P0677J25387
$$ 3474780 3307621 3166674 3061422 3013132 2944295 2895327 2870561 2871990 2939604 3010281 3135668
13546C135668J62127K49356L09788L82293N43186P77017J225785K013842L378926
$$ 3135668 3297795 3547151 3856939 4239232 4782418 5559435 6785220 8799062 12177988
13537A2177988N513674Q509362J0609759O780951k652120r397119r779272o737485
$$ 12177988 17691662 26201024 36810783 43591734 40939614 31542495 21763223 15025738
13529A5025738m078355k515082j604768j077851p46141n84755m83719m24919m14362
$$ 15025738 10947383 8432301 6827533 5749682 5003541 4418786 3935067 3510148 3095786
13520C095786l22959k22616j86872j70042j51578j32647j34634j01703o4177o8473
$$ 3095786 2772827 2550211 2363339 2193297 2041719 1909072 1774438 1672735 1608558 1540085
13510A540085n7326m8532l4527k6920l7334m5354m8016m3550Q839L7666j9496
$$ 1540085 1482759 1434227 1399700 1372780 1335446 1290092 1242076 1198526 1207365 1245031 1225535
13499A225535l1943m7275m5710r128q457n2493k5326q991O629M9418M4095K1071
$$ 1225535 1193592 1146317 1100607 1091479 1083022 1030529 1005203 996212 1002841 1052259 1096354 1117425
13487A117425k1950o8497o1669l2871o858n1253l4841k7362L582K5635L6759K5549
$$ 1117425 1095475 1026978 965309 932438 925580 874327 839486 812124 815706 841341 878100 903649
13475I03649L3198L9725J6747j2742n4668m8289R381K861l3538k9674J843p938
$$ 903649 936847 976572 993319 980577 925909 877620 887001 889862 856324 826650 828493 820555
13463H20555m863K5118K1071l5722k5798J401L2748N7263R856j4101N392J4193
$$ 820555 815692 840810 861881 826159 800361 801762 834510 891773 901629 887528 892920 907113
13451I07113n1052j0930j4196k4101J2132N8073M3433M9775O5615P5172K9270
$$ 907113 856061 845131 830935 806834 818966 877039 920472 970247 1035862 1111034 1140304
13440A140304o6840o4245n5059m5942n0030J0J2388M1222N1441N5635K0215k0381
$$ 1140304 1073464 1009219 954160 908218 858188 858198 870586 911808 963249 1018884 1039099 1018718
13428A018718j75n440m1942m7284k0144j1693J4578Q798k6763o012J2830J0975
$$ 1018718 1018543 1013103 971161 923877 903733 892040 906618 915416 888653 882641 895471 906446
13416I06446o494k6714j871L9234J9994j7239J4988L2826k012L7207J0001j1467
$$ 906446 899952 873238 871367 910601 930595 913356 928344 961170 959158 996365 1006366 994899
13404I94899J3698k1183j4034O743M1310N4624O5792O1461l273n1308o5068p7831
$$ 994899 1008597 987414 973380 980123 1021433 1076057 1141849 1203310 1200037 1148729 1083661 1005830
13392A005830o8244l3290p788J3401Q0703O9200M0630l999J5098J741l4063o1680
$$ 1005830 937586 904296 896508 909909 990612 1059812 1100442 1096443 1111541 1113282 1079219 1017539
13380A017539l6929J2248M3296j9861m1788o409K7119R969k2632l1051j1990J8066
$$ 1017539 980610 992858 1036154 1016293 974505 968096 995215 1005184 982552 951501 939511 957577
13368I57577Q444j1895N675J5616J3189K9452O3599O4822O2714L8950n266k0005
$$ 957577 966021 954126 959801 975417 988606 1018058 1081657 1146479 1209193 1248143 1242877 1222872
13356A222872L9836j7975n5052m5418j9946j7022k788l1461k9041m246j1442k105
$$ 1222872 1262708 1244733 1189681 1144263 1124317 1107295 1104507 1073046 1044005 1039759 1028317 1026212
13344A026212M988j3802J6607K6322K2646K2882J746M429K2171l2269n1260k2146
$$ 1026212 1031200 1017398 1034005 1060327 1082973 1105855 1107601 1112030 1134201 1101932 1050672 1028526
13332A028526o15J3863K3922J7321J5555J1594j7403k1296j026j1790k6057k5818
$$ 1028526 1027911 1041774 1065696 1083017 1098572 1110166 1092763 1071467 1070441 1058651 1032594 1006776
13320A006776p753K4990M0905N7210O9707M6118J8549K657l0791R625Q001n2789
$$ 1006776 999023 1024013 1064918 1122128 1191835 1237953 1256502 1259159 1228368 1237993 1245994 1193205
13308A193205p2725m4504m7346J7269K0608o314m6452j2067m3416m7986l3483
$$ 1193205 1120480 1075976 1028630 1045899 1066507 1060193 1013741 1001674 958258 910272 876789
13297H76789J0688J6787j9837K8141J8464J2406K6309k675R487j3418j2570m095
$$ 876789 887477 904264 884427 912568 931032 943438 969747 967072 976559 963141 950571 946476
13285I46476K1957N4311L9517O595r212j7349m0952m9967l1965o1979k5919j4110
$$ 946476 968433 1022744 1062261 1068856 1059644 1042295 1001343 951376 919411 857432 831513 817403
13273H17403Q706M1484N2209M2158j6117k7127R002N170m2583m5825n815N488
$$ 817403 826109 867593 919802 961960 945843 918716 927718 932888 890305 844480 838665 844153
13261H44153J5503j180L0060j4239m9304j9132j5231j1605O187l9244k5792K0116
$$ 844153 859656 858476 888536 874297 824993 805861 790630 779025 785212 745968 720176 740292
13249G40292L5253Q52j0822k8214k3633J6089J3751J7969j7180l756n59k859l796
$$ 740292 775545 776397 765575 737361 713728 729817 743568 761537 744357 740601 740042 737183 733387
13236G33387L0483k0252K130j7325l5625m8345l5609J098J0093k9989j1073j3983
$$ 733387 763870 743618 745748 728423 692798 644453 608844 609942 620035 590046 578973 564990
13224E64990j4353j4096q103j5459R757j5433n907K2245L0765K0259O440J020
$$ 564990 550637 536541 528438 512979 522736 507303 501396 523641 554406 574665 581105 582125
13212E82125J0225m5359l9929l1061O51J5532j4584o129j430K868K5177P153m430
$$ 582125 592350 546991 507062 476001 476652 492184 477600 471471 470041 472909 498086 505239 500809
13199E00809O2029R1705M2791j9343o2284p8428m5604l6489j9996k2630K6472
$$ 500809 562838 654543 697334 677991 615707 537279 491675 455186 435190 412560 439032
13188D39032o292j2657J3938L2403k5851m2739k6811Q558l0663l6464k166r731
$$ 439032 432740 420083 434021 466424 440573 397834 371023 379581 348918 312454 310288 300557
13176C00557Q611M368m0972Q784O633O922K2793j8339q375R796K4084J4816R464
$$ 300557 309168 313536 272564 281348 287981 294903 317696 299357 290982 300778 324862 339678 349142
13163C49142n951j9783n976K2174M96Q045K6409L7146P6321J31387J35927J24480
$$ 349142 343191 323408 317432 339606 340102 348147 374556 411702 488023 619410 755337 879817
13151H79817L4304j03234k01191j12961m4206j1485m5424k2618m5594n493N617
$$ 879817 914121 810887 609696 496735 452529 441044 395620 373002 327408 321915 327532
13140C27532m5084j1464k9834o176K0261L955k5781M438Q595k5626j1948K4236
$$ 327532 282448 270984 241150 234974 255235 259190 233409 237847 246442 220816 208868 233104
13128B33104L1270L522m4152o970p957k899J290j1370j3848m060j3274J3931K7551
$$ 233104 264374 267896 223744 216774 208817 205918 207208 195838 181990 177930 164656 178587 206138
13115B06138N2636L5639r111j0000N8680R8474R8918J08779J64895M3875r3721
$$ 206138 258774 294413 285302 275302 333982 432456 531374 640153 805048 848923 755202
13104G55202j70218j46215r1097k8664l3620l0740N711l0138J873L89k3673l4401
$$ 755202 584984 438769 347672 319008 285388 254648 260359 230221 232094 232483 208810 174409
13092A74409m1272J8596n951K2161J7869n742k6071j2312K9145P769k0779k0657
$$ 174409 133137 151733 145782 167943 185812 180070 153999 141687 170832 178601 157822 137165
13080A37165P421P434j787o730j216J916j9376j2581j2772J5740L7707L5786L356
$$ 137165 144586 152020 150233 143503 142287 144203 124827 112246 99474 115214 152921 188707 192063
13067A92063n147l6070M272N3404L9764K6105M0553j3258n4849l1606j9015l7088
$$ 192063 186916 150846 155118 208522 248286 274391 314944 301686 246837 215231 196216 159128
13055A59128k626J623k662n489j3463k2141j9670L607J6300j1269l432O199l655
$$ 159128 156502 158125 155463 149974 136511 114370 94700 98307 114607 103338 99906 106105 102450
13042A02450m886K3716P62p950L1012o593m003L830j1688l7886j9843L70K0795
$$ 102450 97564 121280 122042 114092 145104 138511 134508 138338 126650 88764 68921 69291 90086
13029I0086K3045J0929j8479J180k3708j7541R349M7587K6628J4105k362n441
$$ 90086 113131 124060 105581 106761 83053 65512 74861 122448 149076 163181 160819 155378
13017A55378j1178l0847n753O320k2861o101o799q880J5274K7739K423J5054K045
$$ 155378 144200 113353 107600 113920 91059 84958 78159 69279 84553 112292 114715 129769 131814
13004A31814p822k5796j4181J9140K3322j1406n684J1199N746k0755l2990M555
$$ 131814 123992 98196 84015 103155 126477 115071 109387 120586 126332 105577 72587 77142
12992G7142K522L4776J2301l4853k6804j305r081K6226R881N861J8255l775L828
$$ 77142 79664 114440 126741 91888 65084 63779 54698 80924 90805 96666 114921 111146 114974
12979A14974J142j8303m384K3212J952k2325p608j5317J405n756N126j532M250
$$ 114974 116116 97813 93429 116641 118593 96268 88660 73343 74748 68992 74118 72586 76836
12966G6836l078L5654j250L659j541l523j3431l3090P647J228J5472j1196J5270
$$ 76836 73758 109412 108162 111821 110280 106757 93326 60236 67883 69111 84583 73387 88657
12953H8657j2849O66N03j4186l6661o660J2822L0650Q209J4N070J922R816L2658
$$ 88657 75808 76474 76977 62791 26130 19470 32292 62942 71151 71165 76235 78157 87973 120631
12939A20631K40l175N681J6544K313m326j8214l4015k2976P551O925k9037l2925
$$ 120631 120871 117696 123377 139921 142234 137908 119694 85679 62703 70254 77179 48142 15217
12926A5217J1533K8061K1834P886J003J9928M883P187L1l451K184p847r214K296
$$ 15217 26750 54811 76645 84531 85534 105462 110345 117532 117563 114112 116296 108449 99235 101531
12912A01531N233j1409J678J1189j6839J7036M959k5380m7751j5927m612m944
$$ 101531 106764 95355 97033 108222 91383 108419 113378 87998 40247 24320 19708 14764
12900A4764K7125l933j3004q028j1939O722L725m785j6K0362K9335P805M007J3974
$$ 14764 41889 37956 24952 16924 4985 11707 15432 10647 10631 30993 60328 68133 72140 86114
12886H6114n79N217J1064O392J238j9598r289Q247k2545k9138K4363J9992J3037
$$ 86114 85535 90752 101816 108208 109446 89848 80559 88806 66261 37123 61486 81478 94515
12873I4515l142K359j2399o928L2657J0190l2562m0581q379j2093p688J0282L0332
$$ 94515 91373 93732 81333 74405 107062 117252 84690 44109 35730 23637 15949 26231 56563
12860E6563K6629N5706J4948l1573k5051k5542J0176J6629P911M660J6390J8231
$$ 56563 83192 138898 153846 122273 97222 71680 81856 98485 106396 111056 127446 145677
12848A45677l2567k3515k5279L038J5220K0593J067l2837O483K2124j0978q539
$$ 145677 113110 89595 64316 67354 82574 103167 104234 71397 77880 100004 89026 80487
12836H0487O378k074p813J339k2591j3407O969K5395J6206J1059p336J6673k8488
$$ 80487 86865 84791 76978 78317 55726 42319 49288 74683 90889 101948 94612 111285 82797
12823H2797j3262J696k38J7946J7825j8241k3175M006R724m805j0382j11j828
$$ 82797 69535 71231 70993 88939 106764 88523 65348 69354 79078 74273 63891 63780 61952
12810F1952j3282j1109l572j2162K041L7822K6493J2396k5705j0850R070r68J0412
$$ 61952 48670 37561 33989 21827 23868 61690 88183 100579 74874 64024 73094 72126 82538
12797H2538j3649M3929o064j2418l5525l2179j5278Q641Q410k213N646J9276N2764
$$ 82538 68889 112818 106754 94336 58811 26632 11354 19995 28405 26192 31838 51114 103878
12784A03878l375o861m328J922M518J7834K631k2990l3013p911J1798J1934R65
$$ 103878 100503 93642 89314 91236 95754 113588 116219 93229 60216 52305 64103 76037 77002
12771G7002l314m405l8436k3614K2828K2644L2401N878l6033l9621K1680J6862
$$ 77002 73688 69283 30847 7233 30061 52705 85106 90984 54951 15330 37010 53872
12759E3872j9440k1337J8894L898P744R755L7280j203J490L4200P657k0638r594
$$ 53872 34432 13095 31989 35887 43631 53386 90666 89463 90953 125153 132810 112172 102578
12746A02578j3217M010L977m806kj820N485k676k1696M84o883n324K2747J7924
$$ 102578 89361 93371 97348 92542 92540 90720 96205 93529 71833 72317 65434 60110 82857 100781
12732A00781j4415K848j0560j0697l0299j4082K1944L7236Q001k3929j5661j6198
$$ 100781 86366 89214 78654 67957 37658 23576 45520 82756 90757 66828 51167 34969
12720C4969J2250J8330j9798k6788K9255L3908J5145N72J0839m509l4737j62L6807
$$ 34969 47219 65549 45751 18963 48218 82126 97271 97843 108682 104173 69436 69274 106081
12707A06081J2326J7701l4832m8344j0591M720K0768j6428j4034J2427P331J6888
$$ 106081 118407 136108 101276 52932 42341 47061 67829 51401 37367 49794 57125 74013
12695G4013J2803P63j523J3726j8239m6979j3720L417K6327K4940K2734J1950
$$ 74013 86816 87579 86056 99782 81543 34564 20844 24261 50588 75528 98262 110212
12683A10212N445k2339K6220k3l64r595L898p186m5614l598Q008J7427k044K875
$$ 110212 115657 93318 119538 119515 119151 109556 113454 106268 60654 57056 65064 82491 80447 83322
12669H3322L1858j272O823J5641j7392r514J1871J2970r26l4173l481J3470K2920
$$ 83322 115180 113908 120731 136372 118980 109466 121337 134307 133381 99208 95727 109197 132117
12656A32117m1034n739K1372k7882m662j5688j2163J4727J4718P437K330J8451
$$ 132117 91083 85344 106716 78834 74172 58484 46321 61048 75766 83203 85533 103984
12644A03984j8553q505l272l8500j2346K0235N3285J5273J4721l332n548k7549
$$ 103984 85431 76926 73654 35154 22808 43043 96328 111601 126322 122990 117442 89893
12632H9893l0149J5378q201J3442K9700P952k1230j653r208K7398K2928J0746
$$ 89893 59744 75122 66921 80363 110063 118015 96785 95132 85924 113322 136250 146996
12620A46996J3215l8355k2721L072j6409q693K9773Q03k2907j880K5279Q472q797
$$ 146996 160211 121856 99135 102207 85798 77105 106878 107681 84774 82894 108173 116645 107848
12607A07848P374l7J5797M159O331p03k5919L5878L317j8825n776J2032J7112
$$ 107848 115222 115185 130982 135141 141472 140769 114850 150728 154045 135220 129444 141476 158588
12594A58588k4213k4191j5628J4466J3350J5153j7567l085k194j3097L552R392
$$ 158588 134375 110184 94556 109022 122372 137525 119958 116873 114679 101582 105134 114526
12582A14526J5429q057M14Q906N230l495Q011M349l6400q897J866j5019q72j5954
$$ 114526 129955 121898 122312 131218 136448 132953 140964 145313 108913 100016 101882 86863 85991 70037
12568G0037r004J5674J1172K3146j3807o438L492K8140K9627L8450J5194j8676
$$ 70037 61033 76707 87879 111025 97218 90780 94272 122412 152039 190489 205683 187007
12556A87007J5838L690k5158o639j6612l064J5067L441m230l9883m7143N99K1620
$$ 187007 202845 206535 181377 174738 158126 155062 170129 173570 169340 129457 82314 82913 104533
12543A04533M6244R688j4744l6394j5335J0463P060n914J1832J2074p587J3184
$$ 104533 150777 160465 145721 109327 93992 104455 111515 105601 117433 129507 121920 135104
12531A35104J5544J1529k6953l4190J791L784k5031J2486M5168N453J3229R28
$$ 135104 150648 162177 135224 101034 102825 106609 81578 94064 139232 144685 157914 158842
12519A58842q204K1778R16j1951J9925Q194n0753q083J689Q145j877q334N314
$$ 158842 150638 172416 173332 161381 181306 189500 138747 130664 132353 140498 138621 130287 135601
12506A35601N510j6613j0556m572p488K4575J8911J9471j7530n3454l6257J9997
$$ 135601 141111 124498 113942 109370 101882 126457 145368 164839 147309 93855 57598 77595
12494G7595J7349J4132J6828k2246m925J4433J8693k2364j0334k4182l5844K6650
$$ 77595 94944 109076 125904 103658 98733 113166 131859 109495 99161 74979 39135 65785
12482F5785N7351K078N154J7123O525k9001j1392j1596K0386k6885p318M856J880
$$ 65785 123136 125214 130368 147491 154016 125015 113623 102027 122413 95528 88210 93066 94946
12469I4946k222J5985O891j4579k0826k929K5016j8346K228L4328K1522M534l4046
$$ 94946 92724 108709 115600 101021 80195 77266 102282 83936 86164 120492 142014 146548 112502
12456A12502k9191R785j3550j2153j6689l782J8779J3391k089k0184J5909J2982
$$ 112502 83311 93096 79546 67393 50704 46922 65701 79092 77003 56819 72728 85710
12444H5710j2977P258j0374J6524L2964M838K3294J0254j5807l4595K349k0052
$$ 85710 72733 79991 69617 86141 119105 123943 147237 157491 141684 107089 109438 89386
12432H9386N895P894L3022K1476m939j0322P712L5997p45j0320j9305P870J596
$$ 89386 95281 103175 136197 157673 152734 142412 150124 186121 185376 175056 155751 163621 165217
12419A65217j2931j9339q752K788K6773J6883k2527j4926p44k1081j8781j2165
$$ 165217 152286 132947 124195 126983 153756 170639 148112 133186 132442 111361 92580 80415
12407H0415r447n78j6578J9795M6J1940O316K716m092J5873L7527J8661K3504
$$ 80415 70968 70390 53812 73607 73653 85593 91909 94625 90533 106406 143933 162594 186098
12394A86098m597L661k0958j6952K5027k6195k9922J7338k659L141k2525l430
$$ 186098 181501 185162 164204 147252 172279 146084 116162 133500 130841 133982 111457 108027
12382A08027L3153J1272O510K6533k5817l9968N71n805P266N1149J7053j7900
$$ 108027 141180 152452 158962 185495 159678 119710 120281 114476 121742 172891 189944 172044
12370A72044L7714K47K12l474m137J1244J729m580J431k769k6674J607M7257L1312
$$ 172044 209758 210005 210217 206743 202606 213850 215579 210999 212430 209661 182987 184594 231851 263163
12356B63163K8171O9989J54492J86099J54727o512j23706j29571j05729r7646
$$ 263163 291334 361323 515815 701914 856641 850129 726423 596852 491123 393477
12346C93477o5857n6386l5382K8548J2489j1874K0301K8337K3029L7474L4033
$$ 393477 327620 271234 235852 264400 276889 265015 285316 313653 336682 374156 408189
12335D08189j8648m2886p2161m4891k5436K520j2308o184K0325R232N045j435
$$ 408189 389541 346655 274494 229603 204167 206687 194379 188195 208520 217752 222797 221362
12323B21362p433n928N007P558o572j640R02j1438m1754j3040l155l846J1054
$$ 221362 213929 208001 213008 220566 213994 212354 213256 201818 160064 147024 143869 140023 151077
12310A51077J1296L632O302P098R749Q364J0814K4118p458j3359k4091j845q268
$$ 151077 162373 166005 172307 179405 189154 197518 208332 232450 224992 211633 187542 185697 177429
12297A77429K4572J4728K8504L5537M5969M0406L9999k2714l0252m8377l2337
$$ 177429 202001 216729 245233 280770 326739 367145 407144 384430 354178 305801 273464
12286B73464j8650J868l948k1510j1776K0031Q439M9069N6005r583m0303j6205
$$ 273464 254814 256682 252734 231224 219448 239479 247918 296987 352992 343409 303106 286901
12274B86901j4084J0310l8132m0955m1371N300R599J0987j9083J4122K7598K1584
$$ 286901 272817 283127 244995 204040 162669 167969 177568 188555 169472 183594 211192 232776
12262B32776l2119l5780J6535l247J4245K5642j2759P835J3447K0080K0699O546
$$ 232776 200657 164877 181412 178165 192410 218052 205293 213128 226575 246655 267354 273900
12250B73900J3939q433l1259K9778K2966r707j8873k6012j8505k0726J6152K3031
$$ 273900 287839 279406 248147 277925 300891 291184 272311 246299 227794 207068 223220 246251
12238B46251l978j1954J0124M5095K1172k0082k3563q886K7225j4274m8959o995
$$ 246251 242273 230319 240443 285538 306710 286628 263065 254179 281404 267130 218171 211176
12226B11176N059m950K8793J6224n465n562J1063o419k8186l8812k1966R317p198
$$ 211176 216235 211285 240078 256302 250837 245275 256338 249919 221733 182921 160955 170272 163074
12213A63074K612K9697r706l068M041L3263L4681R148O906j0676l7978m1882o215
$$ 163074 165686 195383 185677 182609 186650 219913 254594 263742 270648 259972 221994 180112 173897
12200A73897K1257o72J4472o547q520l4653j034K123J6330K0094K1844L5755L0553
$$ 173897 195154 194482 208954 202407 193887 159234 158200 160323 176653 196747 218591 254346 284899
12187B84899r938k5178k9663j8723O603l75L100K3326J8639L4359N5154K7265
$$ 284899 274961 249783 220120 201397 208000 207625 210725 234051 252690 287049 342203 369468
12175C69468l0148m2043o2283j1213l2141n1688n707j2083R815J1233N1006L6420
$$ 369468 339320 297277 234994 223781 191640 139952 134245 122162 131977 143210 194216 230636
12163B30636K4244N2555J8687p173l9506n1435Q19k8278n717J3064j4943j8079
$$ 230636 254880 307435 326122 318949 279443 228008 228827 200549 194832 207896 192953 174874
12151A74874J0051k420m259n264K7037J0533j1652m783N065j7454J0083l1351
$$ 174874 184925 182505 178246 172982 200019 210552 198900 194117 199182 181728 191811 160460
12139A60460J3938R861L9398J1249j7546j8168K314M9927N1776l2756m9159k7583
$$ 160460 174398 184259 223657 234906 217360 199192 201506 251433 303209 270453 221294 193711
12127A93711j2734M243J4414k0485k7926J5673M6361L0108N7326O7080K4220J4776
$$ 193711 180977 185220 199634 179149 151223 166896 213257 243365 300691 367771 391991 406767
12115D06767m010m4409o0747m5702p47l4027k0997q914M3227L783j6735K1139
$$ 406767 402757 358348 297601 251899 251152 217125 196128 187214 230441 234224 217489 238628
12103B38628K700K6578k593n125j8614j8827l6824k9509j5305j0255k187J6656
$$ 238628 241328 267906 265313 260188 241574 222747 185923 156414 141109 130854 128667 145323
12091A45323K9802J0109J7231K167r369l692k5304o35k5907N885R737l2136J7003
$$ 145323 175125 185234 202465 204632 195263 191571 166267 165632 139725 145610 155347 123211 140214
12078A40214M2647K4512L6453N075M3881J8695j7787k5925j5529m7558m1875Q844
$$ 140214 182861 207373 243826 248901 292782 311477 293690 267765 252236 204678 162803 171647
12066A71647J8857p686m4246j6000K5006j280J3818M544M8694J0850k8268j0428
$$ 171647 190504 182818 138572 122572 147578 146298 160116 164660 213354 224204 195936 185508
12054A85508o9477m2264m2138J4167J5826Q880J110Q360M1490O506J370q632K355
$$ 185508 116031 73767 31629 45796 61622 70502 71612 79972 121462 127968 129338 120706 123061
12041A23061J0788l2883n0885o211L2081J1301R351j1064M487R411r75O728j402
$$ 123061 133849 100966 50081 43870 75951 87252 96603 85539 90026 99437 98462 105190 103788
12028A03788J0088K2447J2142j7138o1090m1323j702j2437p20K1198J7970J3102
$$ 103788 113876 136323 148465 131327 70237 28914 27212 14775 14055 35253 53223 66325
12016F6325N624l0825J6593L4687O202l719L1738K1534j314j5141j4167k7371
$$ 66325 71949 41124 57717 92404 98606 94887 126625 148159 146845 131704 117537 90166
12004I0166l4243M236R919k210J5847K2945r479j2241p349J2122o388j1099j4279
$$ 90166 55923 60159 70078 67868 83715 106660 97181 84940 77591 89713 83325 72226 57947
11991E7947k1803j0046q644R302j5661K5383J3920P878k2378j8604P275J3500
$$ 57947 36144 26098 17454 26756 11095 36478 50398 58276 35898 17294 24569 38069
11979C8069J3813r944j3687M8248J7977m924q398n703j9534K0826P188j9148j5952
$$ 38069 51882 41938 28251 76499 94476 89552 81154 75451 55917 76743 83931 64783 48831
11966D8831k135j0320K7466n395k5816o64J438J1714J0989j1594J0570o273k0792
$$ 48831 46696 36376 63842 58447 32631 31967 33405 45119 56108 44514 55084 48811 28019
11953B8019k3873K334q880M021O916n594k3466o18J3085O617o900J934J5296K9916
$$ 28019 4146 6480 -2400 1621 8537 2943 -20523 -21141 -8056 -1439 -8339 -6405 8891 38807
11939C8807J5281J0634j0154l0686j3022o7K8638J7996o495k1958J5746j7040
$$ 38807 54088 64722 54568 23882 10860 10793 39431 57427 50932 28974 44720 27680
11927B7680n336p366K923L472J4104N462j8389o455p121k2146m517n881N621K1762
$$ 27680 22344 14978 17901 21373 35477 40939 22550 16095 8974 -13172 -17689 -23570 -17949 3813
11913C813K5273o356M232J2934r4j2801r684J5278L883l461N064j1137K4601m636
$$ 3813 29086 22730 26962 39896 39802 27001 17317 32595 36478 33017 38081 26944 51545 46909
11899D6909l9768j8583L5674K2497k1317k049r769k1286J2826J411k0613J3728
$$ 46909 7141 -11442 24232 46729 25412 23363 13594 -7692 5134 6545 -14068 -340
11887c40J2883K9025k2245k0691O54j0222J290K2442K0535r60k5256J3506K8809
$$ -340 12543 41568 19323 -1368 -714 -10936 -9646 12796 33331 32371 7115 20621 49430
11874D9430k320k7549p843o592M776J6746L257k307M586R255O70k4818J2939m05
$$ 49430 47110 19561 11718 5126 9902 26648 29905 27598 32184 41439 42109 17291 30230 29825
11860B9825l3167n170L4808j7j3145k1666M51P451j5798J1589K9661m895K2726
$$ 29825 -3342 -8512 26296 26279 13134 -8532 -8081 -630 -16428 -4839 24822 19927 42653
11847D2653K7571k8629r515j325J0647n567j9330r339K0249R820K9582J5077m02
$$ 42653 70224 41595 32080 30755 41402 35835 16505 7166 27415 37235 66817 81894 81492
11834H1492k7220N095k145j8550j4911L625k1068K3249J3730l281n791o909n506
$$ 81492 54272 59367 57222 38672 23761 27386 6318 29567 43297 40016 34225 27316 21810
11821B1810j5262O276r324l3548j2799M340L6413m841M157J7973l0182P166P534
$$ 21810 6548 12824 3500 -30048 -42847 -38507 -2094 -6935 -2778 15195 -14987 -7821 -287
11808b87p912N1887M5728l188j3493j5790p176J5273J8454k995J5056J9916j5097
$$ -287 -8199 43688 89416 86228 72735 56945 49769 65042 83496 80501 95557 115473 100376
11795A00376j0384j5307p273m8143j21j8027J9696J3399l3871k0817J0007r29
$$ 100376 89992 74685 67412 19269 19148 1121 20817 34216 345 -20472 -10465 -11394
11783a1394K6681J0280j5185M564j0335K728l726j7269J067J7793M2857q695o736
$$ -11394 15287 25567 10382 14946 4611 7339 3613 -13656 -12589 5204 48061 39366 32630
11770C2630m1994M497j4401q15K4596r924k1564M883K2264K5528M8863k9316j7810
$$ 32630 -9364 -4867 -19268 -20083 4513 -5411 -26975 -22092 172 25700 74563 45247 27437
11757B7437K242L569k9458l7131K4275M1344O048m2680k1100J1160K2543j2290
$$ 27437 29679 33248 3790 -33341 -9066 32278 38326 -4354 -25454 -14294 8249 -4041
11745d041j9701J9299N61k9028J3663J1088O164J1059K3942J2351j4927R659J0452
$$ -4041 -23742 -4443 -3882 -32910 -19247 -8159 -1995 9064 33006 45357 30430 40089 50541
11732E0541K3296K113j953P712l637j7549Q0p797k2039K2260k1439j0003K2303
$$ 50541 73837 75950 73997 81709 78072 60523 60603 52806 30767 53027 31588 21585 43888
11719D3888j5682o964K9383j8351l5525O574R871J0215K0584j8447r451j4974
$$ 43888 28206 21242 50625 32274 -3251 3323 13194 23409 43993 25546 16095 1121
11707A121K4509o913j6334J3933L3634j000l1420j5554J4737j9628m4076j1701
$$ 1121 25630 18717 2383 16316 49950 48950 17530 1976 16713 -2915 -46991 -58692
11695e8692J5097N75K7145L725K5782P444o452J9473P896L09j0977k105l639j7845
$$ -58692 -43595 -43020 -15875 -12150 13632 21076 14624 34097 41993 42302 31325 29220 25581 7736
11681G736j8047J0466j5607Q181J3735j3228j2845j9103k111J6250J6286j3750
$$ 7736 -10311 155 -15452 -7271 6464 -6764 -19609 -38712 -40823 -24573 -8287 -22037
11669b2037M673K2823L8373M803l2931l8662o36J416r414J9683j89O815J699n18
$$ -22037 -17364 5459 43832 48635 15704 -22958 -23594 -22178 -31592 -11909 -12098 -5283 -3584 -4102
11655d102O410O478k6178J0982L2037J1685q227j8943Q040k4053l5903N3517K8276
$$ -4102 2308 8786 -17392 -6410 25627 37312 29085 10142 18182 -5871 -41774 11743 40019
11642D0019j4711N011j6988k1398p034j5773K050P852p410k3854J6891L1514K727
$$ 40019 25308 30319 13331 -8067 -15101 -30874 -28824 -20972 -28382 -52236 -35345 -3831 -1104
11629a104M067j642J3974r203p121j8876j4504J3669K189L1269N164j0431k7150
$$ -1104 2963 1321 15295 6092 -1029 -19905 -34409 -20740 -18551 12718 17882 7451 -19699
11616a9699Q62l293r034K1403J0212J388l1652k6900J9387K8005K1006j5068q172
$$ -19699 -18837 -22130 -31164 -9761 451 1839 -29813 -56713 -37326 -9321 11685 -3383 -11555
11603a1555j1659k1591o362J8794L222K0482M102k1913Q312j2730Q09J6122K1527
$$ -11555 -23214 -44805 -51167 -32373 -29151 -8669 -4567 -26480 -18168 -30898 -30089 -13967 7560
11590G560J6813l93p577k2727L669k166j6892j3630j5961K0328j59j2255n715
$$ 7560 24373 23980 16403 -6324 -2655 -4821 -21713 -35343 -51304 -30976 -31135 -43390 -49105
11577d9105M062K1077Q072j3578J3799j147J6389J795j8003j0817K5987J508K23
$$ -49105 -45043 -23966 -15894 -29472 -15673 -16820 -431 1364 -16639 -27456 -1469 39 262
11564B62J4686K5778j0092j8260j7023k4218k1201P496L2243J0215l3074k2440
$$ 262 14948 40726 30634 12374 -4649 -28867 -50068 -42572 -10329 -114 -33188 -55628
11552e5628J0950j826J5179k3799n075J2213J5537k4269j8901K4561K4069j3927
$$ -55628 -44678 -46504 -31325 -55124 -60199 -47986 -32449 -56718 -75619 -51058 -26989 -40916
11540d0916j7303k872J1773M95j1350O657j38o262M052J893K4967P269j628j5163
$$ -40916 -58219 -61091 -49318 -48823 -60173 -53516 -53654 -59916 -55864 -53971 -29004 -21735 -23363 -38526
11526c8526J9711O502n5675J433J2132K8721J1985p576L949j5072j9647j2573
$$ -38526 -18815 -12313 -67988 -66555 -54423 -25702 -13717 -21293 -17344 -32416 -52063 -64636
11514f4636K3823L8285L0790j0174l5396J7260q598j2093l0129N123J2902L2964
$$ -64636 -40813 -2528 28262 18088 -17308 -48 -8646 -20739 -50868 -45745 -32843 121
11502A21n543j0446l0013j8854J7122L2126K0848J9857j5984k0471k4016m3042
$$ 121 -5422 -15868 -45881 -64735 -47613 -15487 5361 25218 9234 -11237 -35253 -78295
11490g8295J2804K7397K9893j5711K33o094K8110K0988j0977l5473j8966k8742
$$ -78295 -65491 -38094 -8201 -23912 -23679 -29773 -1663 19325 8348 -27125 -46091 -74833
11478g4833K4918K3536J5605J0228k437J6412k309j3883l1445k9373K1583N531
$$ -74833 -49915 -26379 -10774 -546 -2983 13429 11120 -2763 -34208 -63581 -41998 -36467
11466c6467n119q05N012M490k1435j7001K2461J6014K2752L2689j8160L312K4707
$$ -36467 -41586 -42391 -37379 -32889 -54324 -71325 -48864 -32850 -10098 22591 4431 7743 32450
11453C2450M375l8986j6034j6874j6762l932r592j3105o212K658L360K6638q962
$$ 32450 36825 -2161 -18195 -35069 -51831 -55763 -65355 -78460 -84672 -82014 -78654 -52016 -60978
11440f0978j9241j0844K8863J5383j6252o745j6589L470K5147P45l756J8826m6058
$$ -60978 -80219 -91063 -62200 -46817 -63069 -69814 -86403 -82933 -57786 -57041 -60797 -41971 -88029
11427h8029l8555J5686l822K4456L9202M3321j3673p547p128K7444J315r699O368
$$ -88029 -126584 -110898 -114720 -90264 -51062 -7741 -21414 -28961 -36089 -8645 -7330 -17029 -10661
11414a0661J6055J5684Q629L4814J3280o816j9316Q540L2354J1514O1497J09289
$$ -10661 5394 21078 29707 64521 77801 70985 51669 60209 92563 104077 165574 274863
11402B74863J63320K70326M74401O90964P47597K14628m77093p41277n85336l49467
$$ 274863 438183 708509 1182910 1873874 2621471 2836099 2359006 1617729 1032393 682926
11392F82926k12355j08828q0929k9029m3264o6845n5873n2261k3993r275M856
$$ 682926 470571 361743 280814 251785 208521 141676 85803 33542 9549 274 5130
11381E130q244J5780J5482j1731K9543l771m6814j3395O4494P493k4598O665J0775
$$ 5130 -3114 12666 28148 16417 45960 42189 -4625 -18020 46474 53967 29369 36034 46809
11368D6809n955K600k249m668j3585k0891j4053J2762j4403j653m9963o991J2766
$$ 46809 40854 43454 41205 36537 22952 2061 -11992 770 -13633 -15286 -65249 -72240 -59474
11355e9474K5987m62j7786J7839K9855J0116j0588k6209k820J1084L5580k6387
$$ -59474 -33487 -33949 -51735 -33896 -4041 6075 -4513 -30722 -33542 -22458 13122 -13265
11343a3265j0753Q254q50p742k281j2269j7269L518j6122k840N302K3658K0395
$$ -13265 -24018 -15764 -16614 -24356 -26637 -38906 -56175 -52657 -68779 -71619 -66317 -42659 -22264
11330b2264M614j6628l6075k2531J8085m835j5476J2132L7430K7119j7255j1553
$$ -22264 -17650 -34278 -70353 -92884 -74799 -79634 -95110 -82978 -45548 -18429 -35684 -47237
11318d7237l6418l4821L6572L6480K228k3500N4K335J659J9223M5821q448m7819
$$ -47237 -83655 -118476 -81904 -45424 -43196 -66696 -66642 -64307 -62648 -43425 2396 -6052 -53871
11305e3871l4288j6475K1452L5200J6491L9290K5536K0807l138l2623l8398j8148
$$ -53871 -88159 -104634 -83182 -47982 -31491 7799 33335 54142 51004 18381 -20017 -38165
11293c8165n7830O999J1580j3488p5028l8601N045L6813J866Q737L5348J1974
$$ -38165 -95995 -88996 -77416 -90904 -165932 -204533 -199488 -162675 -160809 -152072 -116724 -104750
11281a04750J7601j0932l2093r47O793J085r293j238q147K2610M0217k5534l300
$$ -104750 -87149 -98081 -130174 -131121 -124328 -123243 -132536 -133774 -141921 -119311 -79094 -104628 -107928
11268a07928k322k067J914m476K3636K4818K3668j9662j3795j7064j6523k1555
$$ -107928 -110250 -112317 -110403 -114879 -91243 -66425 -42757 -62419 -76214 -93278 -109801 -131356
11256a31356K2937K9580M360m2989k2711K7965K1455L0720j4596O3L0653N9206
$$ -131356 -108419 -78839 -74479 -117468 -140179 -112214 -90759 -60039 -74635 -74572 -43919 15287
11244A5287N8623Q0529Q7730N3842n2274o7277o8955n9932l6716m3168j6818J918
$$ 15287 73910 154439 242169 296011 243737 176460 107505 47573 10857 -32311 -49129 -47211
11232d7211j806M60n5650m4386L867J6841K20K4797J350N028j5179p361J8744
$$ -47211 -49017 -48557 -104207 -148593 -144726 -127885 -127665 -102868 -101518 -96490 -111669 -119030 -100286
11219a00286p881k3540J6346K4907L296J0283L764k607J3137L0679J9213K57l821
$$ -100286 -108167 -131707 -115361 -90454 -87158 -76875 -73111 -75718 -62581 -31902 -12689 -12432 -16253
11206a6253K1361o801K828n282l2964l23j47Q243J5359K8850J1293m9995l0693
$$ -16253 5108 -1693 1135 -4147 -37111 -37434 -37581 -29338 -13979 14871 26164 -23831 -54524
11193e4524k796j3811l9033k6727K8534K3173M009p467R64o327Q08k941p429j1843
$$ -54524 -57320 -71131 -110164 -136891 -108357 -85184 -81175 -88642 -87678 -94005 -93197 -96138 -103567 -115410
11179a15410O981R633O349J818j2329l3209m191L4304M4997L8226q653k9655R950
$$ -115410 -108429 -98796 -92447 -90629 -102958 -136167 -140358 -106054 -61057 -22831 -31484 -61139 -51189
11166e1189J1086K2894J702j8878m548J8027K731J5512m6144j0518L2414l3141
$$ -51189 -40103 -17209 -15507 -34385 -38933 -20906 -18175 -2663 -48807 -59325 -26911 -60052
11154f0052m2773j9590k6691q057K2736R817J893N298L4511q955j03112j28840
$$ -60052 -102825 -122415 -149106 -157163 -134427 -124610 -122717 -117419 -82908 -91863 -194975 -323815
11142c23815q1193l2091k5287k0571O6575J13326Q7796L7339L4171j5725N333
$$ -323815 -405008 -437099 -462386 -482957 -416382 -303056 -215260 -177921 -143750 -159475 -154142
11131a54142Q937j5257p14k2766j7322j3386j7991J9310M7378O9046M4842Q251
$$ -154142 -145205 -160462 -161176 -183942 -201264 -214650 -232641 -213331 -165953 -96907 -52065 -43814
11119d3814q068L8495K7173j4156k7076l4874q7505n0573k4145K055K3753j5672
$$ -43814 -51882 -13387 13786 -370 -27446 -62320 -149825 -200398 -224543 -222488 -198735 -214407
11107b14407K0199K8549J9972L990P828k6047k2225p291J6408m654J7945L6564
$$ -214407 -194208 -165659 -145687 -141697 -133869 -159916 -182141 -189432 -173024 -177678 -159733 -123169
11095a23169r482j6485L48K806l572k0091o358J3239M754P152L724l5455J6529
$$ -123169 -132651 -149136 -148788 -145982 -149554 -169645 -176003 -162764 -158010 -150858 -147134 -182589 -166060
11082a66060j4934m803j5038j4618o953l231j2563m000J1262J4073Q924L5871
$$ -166060 -180994 -185797 -200835 -215453 -222406 -225637 -238200 -242200 -230938 -216865 -207941 -172070
11070a72070K1679j6217J0010K005l0965q416L897k9338k0180K0012K1451M1440
$$ -172070 -150391 -166608 -156598 -154593 -185558 -193974 -190077 -219415 -239595 -219583 -198132 -156692
11058a56692L9500K0831J1498M2425N1848K0536o777k6539o0615m7372k2710K2141
$$ -156692 -117192 -96361 -84863 -42438 9410 29946 23169 -3370 -63985 -111357 -134067 -111926
11046a11926L9212J1673M8747M7183N808l2757l6436l799J2220m960m1224j0524
$$ -111926 -72714 -61041 -12294 34889 40697 7940 -28496 -32295 -20075 -25035 -66259 -76783
11034g6783L2989k112J9454M3848Q2835J26202J26363Q5781Q2996P6352P3111
$$ -76783 -43794 -45906 -26452 17396 100231 226433 352796 438577 521573 597925 671036
11023F71036K7004p575L8922J5141M6014J30400J26681J35699K64906M40065O58156
$$ 671036 698040 690465 729387 744528 790542 920942 1047623 1183322 1448228 1888293 2546449
11012B546449R53165J154126Q12869J1276n47125m32354k0928L36667N75661Q11390
$$ 2546449 3499614 4653740 5466609 5477885 4930760 4498406 4477478 4814145 5389806 6201196
11002F201196J082820J297016J751841K363037L074449M069429N433283P636561
$$ 6201196 7284016 8581032 10332873 12695910 15770359 19839788 25273071 32909632
10994C2909632J1845433J9746346L3352967N6569107R4361885J42131474J33552293
$$ 32909632 44755065 64501411 97854378 154423485 248785370 390916844 524469137
10987E24469137J1827532j08618631j40287822j01362512n9072878l4622626k1635594
$$ 524469137 536296669 427678038 287390216 186027704 126954826 92332200 70696606
10980G0696606j4382137j0138322p651503o050488m827357l723943k882046k363779
$$ 70696606 56314469 46176147 38524644 32474156 27646799 23922856 21040810 18677031
10972A8677031j960528j590128j340763j096419r29852q00314m86507l2254L00124
$$ 18677031 16716503 15126375 13785612 12689193 11759341 10959027 10472520 10440266 10740390
10963A0740390o7814p77711j131575j001344p84997o32701n09771m25335l48010
$$ 10740390 10672576 9894865 8763290 7761946 6976949 6344248 5834477 5409142 5061132
10954E061132l21022l16834k99413k66796j95338j28274j32760j59149p7336l3331
$$ 5061132 4740110 4423276 4123863 3857067 3661729 3533455 3400695 3241546 3164210 3130879
10944C130879k7413n3292p3584j37946j83410j38569j22184j05320p3762p5919
$$ 3130879 3103466 3050174 2976590 2838644 2655234 2516665 2394481 2289161 2215399 2139480
10934B139480j14774p9625o5805o9641m6483l9487k8680l8861o5577q4913r8842
$$ 2139480 2024706 1945081 1879276 1809635 1763152 1723665 1694985 1656124 1590547 1505634 1406792
10923A406792p5082l3385l0594k7859j8562m2453j245J0456m825R705K4386j3744
$$ 1406792 1331710 1298325 1267731 1239872 1221310 1178857 1177612 1188068 1183243 1192948 1217334 1203590
10911A203590j5813l6443l9128j5902k6518o2705m0751j8434l4655m9770k3366
$$ 1203590 1187777 1151334 1112206 1096304 1069786 1007081 966330 947896 913241 863471 840105
10900H40105P913Q281J9567j5921l1878n4397j7784j4434p680J0489L9204n419
$$ 840105 848018 856299 875866 859945 828067 773670 755886 741452 733772 744261 783465 778046
10888G78046l5698j905M948m1767j0280r930k1480k9242J1247P554j6338J2536
$$ 778046 742348 740443 745391 703624 693344 683414 661934 632692 643939 651493 635155 647691
10876F47691K195J1523j470j0632j7196l1434r090J3087L5700M7129O458L0752
$$ 647691 649886 661409 659939 649307 632111 600677 591587 604674 640374 687503 693961 724713
10864G24713K1448M2837K5695o2964n4582q0426o8130m4276l5172n511m911K3914
$$ 724713 746161 788998 814693 751729 697147 616721 548591 504315 469143 463632 458721 482635
10852D82635J5699N4981N6335J4544j8291k0417j7796n5541l1361J4128L874l1183
$$ 482635 498334 553315 609650 624194 605903 585486 567690 512149 480788 494916 498790 467607
10840D67607K7056O6471N9603N6534N7968M3320j7675p7901p5996n1682r1056
$$ 467607 494663 561134 620737 677271 735239 778559 760884 682983 606987 555305 464249
10829D64249l3847J6159j2729j9867r390j5513j1205J2874K1186R006k2205j5065
$$ 464249 430402 446561 433832 413965 404575 389062 377857 390731 411917 420923 398718 383653
10817C83653l2252l3456J254k4075j5941J3200r038p198O855M059M910r913j0565
$$ 383653 351401 317945 319199 295124 279183 292383 283345 276147 283002 287061 291971 282058 271493
10804B71493K5195j1428K0658J2524q736l9332n2873l668O1965K9793q005J8474
$$ 271493 296688 285260 305918 318442 309706 270374 217501 213833 275798 305591 297586 316060
10792C16060M029J053Q894R116k1775l2358l8871l3131K0763K3242m526k8784
$$ 316060 320089 321142 330036 339152 317377 285019 246148 213017 233780 257022 252496 223712
10780B23712l8649M311J7861J7636L5904p043k458m70j6653l5441j7527j9878
$$ 223712 185063 189374 207235 224871 260775 253732 251274 250804 234151 198710 181183 161305
10768A61305j0841m544J4988M5847N5645L4996j2173K944n163q440M112J8286
$$ 161305 150464 145920 160908 206755 262400 297396 285223 288167 283004 274564 278676 296962
10756B96962m966q887j1543k9211j1396O397j392L1758M0623k7967r739l2136
$$ 296962 291996 283109 271566 242355 230959 237356 235964 267722 308345 280378 270639 238503
10744B38503o903j1977r480J5341J985l4238l303j3661L189M3431K609o356k1279
$$ 238503 231600 219623 210143 225484 227469 193231 189928 176267 179456 222887 225496 219140 197861
10731A97861n480n095j2960J1452J2833l7193k2157M86O952J7417J0586N511P65
$$ 197861 192381 187286 174326 185778 198611 161418 139261 139747 146699 164116 174702 180213 180978
10718A80978k6020K098L2707J4668J0412j1749o724P531J2901Q065J8431j5241
$$ 180978 154958 157056 189763 204431 214843 203094 196370 203901 216802 224867 243298 228057
10706B28057j0048K077k3171l5884K59k325j9166J8034O736j836k924k474L9375
$$ 228057 218009 220086 196915 161031 161290 158965 139799 157833 164569 162733 159809 157335 196710
10693A96710L4010L2152k3792R93L1868N1025l261l0026m5589o5632j9983n869
$$ 196710 230720 262872 239080 240073 271941 322966 319705 289679 244090 178458 158475 152606
10681A52606m813j2516K3950M853j6892l2341l3658r650L1693K6211K0184K4148
$$ 152606 147793 135277 159227 164080 147188 114847 81189 71539 103232 129443 149627 173775
10669A73775j9914k2985k4085m297L34K9552J1040l9562n380J42J6248J8473p331
$$ 173775 153861 130876 106791 102494 102828 132380 143420 103858 98478 98620 114868 133341 126010
10656A26010J1464J4761R719k7004r314j8899q437J6107M6678J0062m824j1572
$$ 126010 137474 152235 161954 134950 125636 106737 98300 114407 161085 171147 166323 154751
10644A54751J3465o813k98q331k9726j4747p875Q929Q559o1551P82O2685N809
$$ 154751 168216 161403 161105 152774 123048 108301 100426 109355 117914 56363 57145 119830 125639
10631A25639m9847J6235l31R660L2432O957K0544L6045J5490J2733j3289o6043
$$ 125639 75792 92027 91696 101356 133788 140745 161289 197334 212824 225557 212268 146225
10619A46225l507R654k7146k9903L541J170L288J3560l644j2612J34l124n125
$$ 146225 142718 152372 125226 95323 98864 100034 103322 116882 113238 100626 100760 97636 92511
10606I2511k1425K2673J0783K129J7375p070j392o900m780K3255J5094R907k068
$$ 92511 71086 93759 104542 106671 124046 116976 115584 108684 103904 127159 142253 152160 150092
10593A50092k9256Q103K7867j0974n65p34L2705L0950M300K2739K0996J7460P2210
$$ 150092 120836 128939 156806 145832 145267 144533 177238 208188 212488 235227 256223 273683 345893
10580C45893O0452O5680Q1791P8206K19847M20805O58263P80276L72310l55247
$$ 345893 406345 472025 553816 632022 851869 1272674 1930937 2711213 3083523 2728276
10570B728276p56285o59156l90107j86118j64773j13488r9263n4452o3641l4404
$$ 2728276 1971991 1312835 922728 736610 571837 458349 359086 304634 240993 206589
10560B06589p671j7950j0757K8110m377R256J8598k4496l0428j3370L1498L1785
$$ 206589 198918 180968 170211 198321 193944 203200 221798 197302 166874 153504 185002 216787
10548B16787j3845k423n0273l5539O248L9817K937N070Q024k4674q051k6691k159
$$ 216787 202942 200519 150246 114707 120955 160772 163709 168779 176803 152129 144078 117387 115228
10535A15228r201o539k9582j5678O338q134m989k697J0697J5494L0406K3454l1992
$$ 115228 106027 99488 69906 54228 60566 52432 47443 44746 55443 70937 101343 124797 92805
10522I2805k5216M49k6609j7658l937J0231J3418N0138J7342j1996n02j58p588
$$ 92805 67589 68038 41429 23771 19834 30065 43483 93621 110963 98967 98465 98307 90719
10509I0719o621n493J1314L1388r812l4600k8548q738K728J1261j4468j2784k8594
$$ 90719 84098 78605 89919 121307 111495 76895 48347 39609 42337 53598 39130 26346 -2248
10496b248J9395P419M766O675l79J13J9144N074J07r469j6710J81J4156m199m864
$$ -2248 17147 24566 29332 36007 35628 35741 54885 59959 60066 50597 33887 34068 48224 44025 39161
10481C9161k6305m268J0640M3947K0628n836n911k0330j7610R82k2212M153j6511
$$ 39161 12856 8588 19228 63175 83803 77967 72056 51726 34116 35098 12886 17039 528
10468E28j6831P343J6261N4866M770j6614k7915P686M1972k2795k6602R887J6074
$$ 528 -16303 -8960 7301 62167 66937 50323 22408 30094 72066 49271 22669 32556 48630
10455D8630K649K0618o429l475p736J6223l1198k7380j9225L6573j931l1753l3797
$$ 48630 51279 71897 65468 61993 54257 70480 39282 11902 -7323 29250 27319 -4434 -38231
10442c8231j502L4462K0520K2160K451l5241J054M4312o546l4579k4089J2707
$$ -38231 -39733 -5271 15249 37409 39860 4619 5673 49985 43439 8860 -15229 -2522
10430b522K4874M0138O30q839O731Q621k1973j4478J3828j1595m559M5094N5228
$$ -2522 22352 62490 63120 54281 61012 69633 47660 33182 47010 35415 30856 75950 131178
10417A31178P259m5850m8002j9398k3356j0082L7304Q16k9090j2244J227q742
$$ 131178 138437 92587 44585 25187 1831 -8251 29053 29869 779 -11465 -10238 -18980
10405a8980J8594l039o888J2542k8251j1792L3943O93J8332M172k6681j9871j2074
$$ -18980 -386 -3425 -10313 2229 -26022 -37814 -3871 -3178 15154 19326 -7355 -27226 -39300
10392c9300L817M270K9204K9813J3858J5198p590N275j7754j0226Q417J2388q086
$$ -39300 -35483 -31213 -2009 27804 41662 56860 49270 54545 36791 26565 34982 47370 39284
10379C9284j8507k4031J2643L282k9927j8737p852J1767L3463J2900J2291m889
$$ 39284 20777 -3254 9389 12671 -17256 -35993 -43845 -32078 1385 14285 26576 21687
10367B1687j5514K3352K1236L713K5152j9426N61M3549k925k4008j0890j2643
$$ 21687 6173 29525 50761 54474 79626 60200 60761 104310 101385 77377 66487 53844
10355E3844j3444K587j4201j8741M0222n54l3173l1480k242L7876N1122O525m3612
$$ 53844 40400 42987 28786 10045 50267 49713 16540 -14940 -17182 20694 71816 78341 34729
10342C4729n135L4479q257m8312k3256M4937Q091l0019P556Q854K789k428K9886
$$ 34729 29594 64073 55816 7504 -15752 29185 37276 7257 14813 23667 26456 24028 53914
10329E3914J4940J8692J5601j1084L627M356l5017o2072O695j0939J3959j776
$$ 53914 68854 87546 103147 92063 95690 100046 65029 2957 9652 -1287 12672 10896
10317A0896n883J7062J9070m373j1599K0700J3458j6626j06L127n927R372k6400
$$ 10896 5013 22075 41145 36772 25173 45873 59331 42705 42599 45726 39799 49171 22771
10304B2771m0433n797J3227K8243M016P866p412l159J8398j3359k5920r732L4812
$$ 22771 -17662 -23459 -10232 18011 22027 29893 22481 19322 37720 24361 -1559 -11291 23521
10291B3521J533J3892m495N280J1627O462k808o845k4488j2837l181k974j6009
$$ 23521 25054 38946 34451 39731 51358 57820 55012 48167 23679 10842 7661 4687 -11322
10278a1322Q276P881j0641K9416M2625N956n064l568j1915l4180k9667J7616J1085
$$ -11322 -3046 4835 -5806 23610 66235 72191 67127 63559 51644 17464 -12203 5413 16498
10265A6498j7540l262o320L1869L0310J8748j3948j2599J7250K0924pp873k4992
$$ 16498 -1042 -4304 -10624 21245 51555 70303 56355 43756 61006 81930 81923 74050 49058
10252D9058O177j1625J8308M521j658K4020l6331l9034n113j6587J8976J5015
$$ 49058 55235 43610 61918 66439 64781 88801 52470 13436 8323 -8264 10712 25727
10240B5727J821L04p941l430Q852p653j9949n868K1145P236k5824l347L558L3832
$$ 25727 27548 27852 19911 16481 25333 17680 -2269 -8137 13008 20244 -5580 -8927 -5369 28463
10226B8463J8445j1384L099l7227j4446J5825o875q043K1470O861j8663R324L2368
$$ 28463 46908 35524 38623 1396 -13050 2775 -4100 -12143 9327 16188 -2475 6849 39217
10213C9217L5265R894K9418p221k5637k981J3047J890l527J3788n848j6913J4933
$$ 39217 74482 84376 113794 106573 80936 77955 91002 92892 89365 103153 97305 80392 95325
10200I5325l080j9857J0096J5462J2518j6406n089p198l8238j95O12o035j5299
$$ 95325 92245 72388 82484 97946 110464 94058 88969 81771 43533 43338 43950 37915 22616
10187B2616m283j8683L615o834k7096j3120K4475J7071L784r863J663K6568M3850
$$ 22616 18333 -350 3265 -3569 -30665 -43785 -19310 -2239 1545 -8318 -6655 19913 63763
10174F3763k2836l8597P131J2584P44K0872J6897k5141Q773k0472m8796R752J6332
$$ 63763 40927 2330 9461 22045 22789 43661 60558 35417 44190 23718 -25078 -15326 1006
10161A006l2585M0314K4279k4764N741K3608K0324K8497l428j1072j0936j9122
$$ 1006 -31579 8735 33014 8250 13991 37599 57923 86420 82992 71920 60984 41862
10149D1862j3704k0667j991J0772J4805K815j7042k9820Q187K4331J2077J5546
$$ 41862 28158 7491 5500 16272 31077 33892 16850 -12970 -4783 19548 31625 47171
10137D7171L707R884j1572l1969L85J338P435q33k6329N347J956J7382P78l5679
$$ 47171 50878 60762 49190 17221 17606 18944 26379 25546 -783 4564 6520 23902 24680 -10999
10123a0999K4780j9600m178K369K3463J1701j3778j380r817k9508J0740m15J3813
$$ -10999 13781 -5819 -9997 -7628 15835 27536 13758 12378 2561 -26947 -16207 -16622 -2809
10110b809K783K1014k2027j4209M185m739m399R701P203K6121P924K298J0470
$$ -2809 -26 20988 -1039 -15248 -11063 -15802 -20201 -10500 -3297 22824 30748 33046 43516
10097D3516J61J3861j4052j3419R469k1217L541N844k9450p362o218m652j9K2838
$$ 43516 43677 57538 43486 30067 39536 18319 21860 27704 -1746 -9108 -15326 -19978 -19997 2841
10083B841n164K000J7417m027k533j3175Q552J4107o623M034k0984j1089J9140
$$ 2841 -2323 -323 17094 13067 10534 -2641 5911 20018 13395 17429 -3555 -14644 4496
10070D496j3385j1722L7576J8324k4292n460K0583j5021J1L661K3859K1530m5641
$$ 4496 -8889 -20611 16965 35289 10997 5537 26120 11099 11110 14771 38630 60160 14519
10057A4519j3738R395K8448M735j6091j0330o895k7743K3127J2910m764M225K8966
$$ 14519 781 10176 38624 43359 27268 16938 10043 -17700 5427 18337 13573 17798 46764
10044D6764L0072o675j1748K1698L3611J31900J54377K59236J57007j04660k33642
$$ 46764 76836 70161 58413 80111 113722 245622 399999 659235 816242 711582 477940
10033D77940j78140j10002l2655k1728j4786L2835M0970L6392L1471m0507l9562
$$ 477940 299800 189798 157143 135415 120629 153464 194434 230826 262297 221790 182228
10022A82228l1147n3713o9809q333J6936M052q430q978k4051J0371L5934P925
$$ 182228 151081 97368 27559 19226 36162 40214 31784 22806 -1245 9126 45060 52985
10010E2985L6867M634l3092l4539j7279K5963k785n299K7669J0218J0006k124
$$ 52985 89852 94486 61394 26855 9576 35539 32754 27455 55124 65342 75348 73224
9998G3224j9180l7804J884J5892o328q544l3R029K8234j798J48J035P920p232
$$ 73224 54044 16240 18124 34016 27688 19144 19111 28140 56374 54576 54724 55759 63679 56447
9984E6447j2542j7373O601L5557J0066j2818o085o064q912O817K9910R255o572
$$ 56447 43905 26532 33133 68690 78756 65938 59853 53789 44877 51694 81604 90859 84287
9971H4287j943K2239J36l3314j5293k6577k3196j7003J5181K3137J1552j1508
$$ 84287 82344 104583 104719 71405 56112 29535 6339 -10664 4517 27654 39206 27698
9959B7698m249L7287J7837k3544j9288l586r653k00J0217n608l561l5219k0276
$$ 27698 23449 60736 78573 55029 35741 32155 22502 22302 32519 26911 23350 -11869 -32145
9946c2145J407L421J0200L1211K549Q394p953m448q270J1196j603j7668K0488
$$ -32145 -30738 -27317 -17117 14094 16643 25037 17084 12636 4366 15562 13959 -3709 16779
9933A6779J7182K0242J7545p025j952p097J5045J7723l3560j4739K6747M4568
$$ 16779 33961 54203 71748 64723 62771 55674 70719 88442 54882 40143 66890 111458
9921A11458K6955m3581o911M516k9054j7752k2455m155M3938N2858J0732J1206
$$ 111458 138413 94832 87921 92437 63383 45631 23176 19021 62959 115817 126549 137755
9909A37755j2186j5603J7300j554J383j6640k990K1970p881l008L8662Q703m3282
$$ 137755 125569 109966 127266 125712 127095 110455 107465 129435 121554 118546 157208 165911 122629
9896A22629K330Q732O991K1030R911K9340j126k9057R624L3527n055p536M1029
$$ 122629 124959 133691 140682 161712 171623 200963 199837 170780 180404 213931 208876 201340 242369
9883B42369K5031l031J9323J1707J9426j4704K38M3556K9760K3501J0145p582
$$ 242369 267400 264369 283692 295399 314825 300121 300359 343915 373675 397176 407321 399739
9871C99739L897K6072Q78r974j9835K8l0575m7675l0109j6437l5496k7043N15
$$ 399739 403636 429708 430586 420612 400777 400805 370230 322555 292446 276009 240513 213470 213985
9858B13985P616K9694L8975L4199r014p11m884K190J6275p911k9551o0202m9909
$$ 213985 221601 251295 290270 324469 315455 314744 309860 312050 328325 320414 290863 230661 180752
9845A80752k1674J4344L5991J7067q524j5634l5060j1981k359j1215L3595Q105
$$ 180752 159078 173422 209413 226480 217956 202322 167262 155281 152922 141707 175302 183407
9833A83407j0640K897N8322J4850l7559j8653m824L2616L9743k5820l0914l2607
$$ 183407 172767 175664 233986 248836 211277 192624 187800 220416 260159 234339 203425 170818
9821A70818O967N687O902L1127L658l0087J9938J9718j0005n0708j7423K4277
$$ 170818 177785 183472 190374 221501 225159 195072 215010 234728 224723 174015 156592 180869
9809A80869o205q97o006J022J1339j6114J1083L7130M0971j2665j5217j486k9107
$$ 180869 174664 173767 167761 168783 180122 164008 175091 212221 253192 240527 225310 223824 194717
9796A94717j5158j3344j2242K3196P801j8648p612l880l2750k859r645P929L738
$$ 194717 179559 166215 153973 177169 184970 166322 158710 154830 122080 119221 109576 117505 121243
9783A21243j6414K326J2685L6766K9756n588j3081l6903k0803j3858K3900O963
$$ 121243 104829 107155 119840 156606 186362 180774 167693 130790 109987 96129 120029 126992
9771A26992k1716l1791j5714Q98l585p144k859k6220J7611J5344j3447k5040j0379
$$ 126992 105276 73485 57771 58669 55084 47940 45081 18861 36472 51816 38369 13329 2950
9758B950K6053J1747j4194R747M6843M930k2823l5849j5217L4084J1340n3155
$$ 2950 29003 40750 26556 36303 83146 88076 65253 29404 14187 48271 59611 6456
9746F456n9796J509L7765M7656K4674r379j0532l1182P286O590Q329k2433l477
$$ 6456 -53340 -51831 -14066 33590 58264 48885 38353 7171 14457 21047 29376 6943 3466
9733C466J0689j7787j8583L4920J7195J0859j380n1576J158L1909L3948q21j9265
$$ 3466 14155 -3632 -22215 12705 29900 40759 39379 -12197 -11039 20870 54818 53997 34732
9720C4732j7539J0920R227j4020m073n380M7o442k8086L961J0688l112J2934R277
$$ 34732 17193 28113 37340 23320 19247 13867 13914 7472 -20614 -16653 -5965 -9077 3857 13134
9706A3134J2366N961j8630o217R300l3646l7167j4619J2648K9638K6620j7862
$$ 13134 25500 31461 12831 6614 15914 -17732 -54899 -69518 -56870 -27232 -612 -18474
9694a8474j2073L0034K2064J6862m4408j1717m566j9026J9829J7509K4093K205
$$ -18474 -30547 -513 21551 38413 -5995 -17712 -22278 -41304 -21475 -3966 20127 22332
9682B2332K2411M439k2630j282j1878m1N902o750J0822N863k7022R780k26r065
$$ 22332 44743 49182 26552 25270 13392 13351 19253 12503 23325 29188 2166 11946 11720 2655
9668B655R887J309k7797l4039k6797L1671L1610j9792K9690N2753k69r774p103
$$ 2655 12542 13851 -13946 -47985 -74782 -43111 -11501 -31293 -1603 51150 50881 41107 34004
9655C4004k209j1304J138n444n360J5494j8799j0832K083l2763Q389O3430l04
$$ 34004 31795 20491 21629 16185 10825 26319 7520 -3312 -1229 -33992 -25603 37827 37523
9642C7523m82q987j1232q75J1598J1107O066J2923k719p385j6209o775l209O122
$$ 37523 37041 28054 16822 15947 27545 38652 44718 57641 54922 47537 31328 24553 21344 27466
9628B7466n362q209L243L1263J9794N651m4405j895R876j8432M858L1696j4000
$$ 27466 22104 13895 17138 48401 68195 73846 29441 27546 37422 18990 23848 55544 41544
9615D1544j7001J9882j7836k7023j2687r41K7245J3843l0164k4939J9370j3911
$$ 41544 24543 44425 26589 -434 -13121 -14062 13183 27026 -3138 -28077 -8707 -22618
9603b2618q898J6184O315q839q331j6380k092K393J5401L8609k146j0892l4954
$$ -22618 -31516 -15332 -9017 -17856 -26187 -42567 -44659 -42266 -26865 11744 9598 -1294 -36248
9590c6248r729L4962J6368N879o720j948j1517j2234r456K5614j3232q778L089
$$ -36248 -45977 -11015 5353 11232 4512 2564 -8953 -21187 -30643 -5029 -18261 -27039 -23950
9577b3950L16N973N897k93j7218J1374M1031J4812k7049j3877K1229K779k3544
$$ -23950 -23634 -17661 -11764 -12057 -29275 -17901 23130 37942 10893 -2984 18245 21024 -2520
9564b520O494n474k2611r765k4913j717M3314K0223R940j6913l485O376j7994
$$ -2520 3974 -1500 -24111 -33876 -58789 -60506 -17192 3031 12971 -3942 -7427 -1051 -19045
9551a9045j2912K4890P804k2324l1863j3849o143K8544L3623n524J1659J2052
$$ -19045 -31957 -7067 737 -21587 -53450 -67299 -73442 -44898 -11275 -16799 -5140 6912
9539F912J9321N58m298j9648k4500k1251L5959L8198j0341l7442k8662N6552L2139
$$ 6912 26233 26791 22493 2845 -21655 -42906 -6947 31251 20910 -16532 -45194 11358 43497
9526D3497L0355r562l6042l9772o972L1759k330p012O757J7645R015k738k3300
$$ 43497 73852 64290 28248 -11524 -18496 13263 10933 3921 10678 28323 37338 34600 11300
9513A1300r738J2103K0433j1847q414Q738m054K610J0077M482J5894j9414j4357
$$ 11300 1562 13665 34098 22251 13837 22575 18521 21131 31208 35690 51584 32170 17813
9500A7813K904n28j6795Q40O600M473K2585M266k684J1813K4006K785m5958L617
$$ 17813 20717 20189 3394 4234 10834 15307 37892 42158 39474 51287 75293 78078 32120 35737
9486C5737K0142j5036J2104Q868j7020k0122J136J978K5549N4181k565l0567l8871
$$ 35737 55879 40843 52947 61815 44795 24673 25809 27787 53336 107517 104952 74385 35514
9473C5514m4336K802M1278M4830j0998l5491k5586K7966K7369L0460o465k6372
$$ 35514 -8822 -6020 35258 80088 69090 33599 8013 35979 63348 93808 87343 60971
9461F0971k8093L394M3286K360k7046q623K7895J2901J7276Q856j2765k7608o372
$$ 60971 32878 36272 79558 81918 54872 46249 74144 87045 104321 113177 100412 72804 66432
9448F6432J3559K7419J2052k5397J1037j3866k084k7971n574J38K1921N6728K3003
$$ 66432 79991 107410 119462 94065 105102 91236 89152 61181 55607 55745 77666 134394 157397
9435A57397P325o420q262o396j8715p504J5738O294M480L265r995q709k2531J2346
$$ 157397 164722 158302 150040 143644 124929 117425 133163 139457 143937 147202 137207 128498 105967 118313
9421A18313N840q272P653K2063K4639N410J0790j6989k5395J7609K7049j3938
$$ 118313 124153 115881 123534 145597 170236 175646 186436 169447 144052 161661 188710 174772
9409A74772k1438l814K466J1127l982k830J836L2789J3349l1854j3273L1715L0838
$$ 174772 153334 149520 151986 163113 159131 156301 158137 190926 204275 172421 159148 190863 221701
9396B21701J2715K1580j9270K1555M639J6553K7097o604j2941q37j4642k0536
$$ 221701 234416 255996 236726 258281 262920 279473 306570 299966 287025 286188 271546 251010
9384B51010P94K2808J9899L653K490P639L1196J8239K725p013K50J6775K3283
$$ 251010 251804 274612 294511 298164 300654 308293 339489 357728 360453 353440 353690 370465 393748
9371C93748J992J0771K0009J2388L672J5048O741k3058N646L4738K5326K2520
$$ 393748 395740 406511 426520 438908 442580 457628 464369 441311 446957 481695 507021 529541
9359E29541N352J467O216L4599J3740L6963J6364K3084K9076K4051P437K2628
$$ 529541 534893 536360 542576 577175 590915 627878 644242 667326 696402 720453 727890 750518
9347G50518L4611M0957R299K8936M6741K9369M3815J5897M0340M3043L6252K1177
$$ 750518 785129 826086 835385 864321 911062 940431 984246 1000143 1040483 1083526 1119778 1140955
9335A140955K0937J9604L2592P7453O9967N1965P1280O2340P4345J03881P9013
$$ 1140955 1161892 1181496 1214088 1291541 1361508 1413473 1484753 1547093 1621438 1725319 1804332
9324A804332M8415L5378R6690Q3063P8131O8065N7966J17230J29190J15051J17328
$$ 1804332 1852747 1888125 1984815 2067878 2146009 2214074 2272040 2389270 2518460 2633511 2750839
9313B750839P1840R8568J38039J32438J19618J14216J33974J52245J56349J50389
$$ 2750839 2822679 2921247 3059286 3191724 3311342 3425558 3559532 3711777 3868126 4018515
9303D018515J21927J44677J35582J31510J07353J03209J16143J07807J00525P5715
$$ 4018515 4140442 4285119 4420701 4552211 4659564 4762773 4878916 4986723 5087248 5162963
9293E162963M0044O602N602N3173J7790K3316k7212q3262o7429n3810n5601p7991
$$ 5162963 5203007 5209609 5215211 5268384 5286174 5309490 5282278 5199016 5131587 5077777 5022176 4944185
9281D944185r6669j13462q7112j47070r6743q4807r7383j33450j16615j03611
$$ 4944185 4847516 4734054 4646942 4499872 4403129 4318322 4220939 4087489 3970874 3867263
9271C867263r2288q0026M616P5035L1349r3279k05837k50982k49608j95133j62166
$$ 3867263 3774975 3694949 3699565 3774600 3805949 3712670 3506833 3255851 3006243 2811110 2648944
9260B648944j15042r5815j16713r8601m9184p7105q5744r0850q4125n4202p2929
$$ 2648944 2533902 2438087 2321374 2222773 2173589 2096484 2010740 1919890 1835765 1781563 1708634
9249A708634o8924l9751k9795o0241l3311j6936k7937q1839o1955k5087J001l9166
$$ 1708634 1639710 1599959 1570164 1509923 1476612 1459676 1431739 1349900 1287945 1262858 1263859 1224693
9237A224693p2248o1840j259k8784j4960O641J7049m196k4596q684L4338O7243
$$ 1224693 1152445 1090605 1089346 1060562 1045602 1052243 1069292 1065096 1040500 1031816 1066154 1133397
9225A133397J23408K46400L09841K93627j9322l12801l69570k67225j92325q4776
$$ 1133397 1256805 1503205 1813046 2106673 2087351 1774550 1404980 1137755 945430 860654
9215H60654m2677n9624k9672l2358n8295k2092n9251l8915J5016n631k8914m0661
$$ 860654 817977 758353 728681 696323 638028 615936 556685 517770 532786 527155 498241 457580
9203D57580l8306j5480J2226Q972q979o161l845J7731K618m916N885j1514j6982
$$ 457580 419274 403794 416020 424992 416013 409852 406007 423738 426356 421440 427325 415811 398829
9190C98829l9921l7915K297l1030N432N9609K9878N696K7388M9537L8875Q6032
$$ 398829 358908 320993 323290 292260 297692 357301 387179 392875 420263 469800 508675 594707
9178E94707J62947J73638M4668j17444j86898j57884n8961p1199o0559n0712j3196
$$ 594707 757654 931292 975960 858516 671618 513734 454773 383574 323015 272303 259107
9167B59107l548k8721m9951O923K4365P122J918k0219k6064l4537k4538k2069
$$ 259107 255559 226838 176887 183810 208175 215297 217215 196996 170932 136395 111857 89788
9155H9788P893j0393k139J571J7592L6892K3052N100j0595k5454q664J2173K0377
$$ 89788 97681 87288 85149 86720 104312 141204 164256 169356 158761 133307 124643 136816 157193
9142A57193J1272k9529m7305k5740L3056J4457L3591j434M1093J1560o2859n1054
$$ 157193 168465 138936 91631 65891 98947 113404 146995 145561 186654 198214 135355 84301
9130H4301j5180J2833K3853j1707Q169m9760r849J7745O137J8904K5632K9983
$$ 84301 69121 81954 105807 94100 102269 52509 42660 60405 66542 85446 111078 141061
9118A41061k2255L229k192j7839J681n066m6038j2373L073L955J4103N392l163
$$ 141061 118806 122035 119843 102004 103685 98619 52581 40208 43281 47236 61339 66731 63568
9105F3568j3869J8841P885L85k5685m8833n551O909L661J33n113J4058K7013J2847
$$ 63568 49699 68540 76425 76810 51125 2292 -3259 3650 7311 7444 2331 16389 43402 56249
9091E6249P68Q032R603N2717J4273o524k0636o50r99K9199J8711j9175N995L602
$$ 56249 57017 65049 74652 127369 141642 135118 114482 113832 112833 142032 160743 141568 147563 151165
9077A51165L2853L3821J7381j2734k3555j9244j9283k5334m4619j1070k0996k067
$$ 151165 184018 217839 235220 222486 198931 179687 160404 135070 90451 79381 58385 56318
9065E6318k4302k7058K126K6498q919j0738j7026l9834j754K5214k8511l8241
$$ 56318 32016 4958 7084 33582 24663 13925 -3101 -42935 -44689 -19475 -47986 -86227
9053h6227J8400n408j2003P898M603j4126K9083L3226j4067j3349M8946O38O162
$$ -86227 -67827 -73235 -85238 -77340 -72737 -86863 -57780 -24554 -38621 -51970 -3024 -2386 3776
9040C776K2442J657J1102K3630L9944O6075M8504R3115J75776K04109J25301l3459
$$ 3776 26218 27875 38977 62607 102551 168626 217130 310245 486021 690130 815431 781972
9028G81972j66793j75372j58294r0753l5199o7475p0346n0939l3796k6515j1382
$$ 781972 615179 439807 281513 190760 155561 88086 17740 -33199 -66995 -93510 -104892
9017a04892K1661J363N694M329o651M0369K4636l7685n209k6433j7912Q89P269
$$ -104892 -83231 -81868 -76174 -71845 -78496 -38127 -13491 -51176 -56385 -82818 -100730 -99841 -92572
9004i2572L9383R342j6101M8750L4971J7790k758k4505O668J9528J4428j8377
$$ -92572 -53189 -43847 -59948 -11198 23773 41563 38805 14300 20968 40496 54924 36547
8992C6547n1201l2929k4955k1389l420J9012Q765R856J5628K923K1111J0594r042
$$ 36547 -14654 -47583 -72538 -93927 -97347 -78335 -69570 -59714 -44086 -41163 -20052 -9458 -18500
8979a8500l9658n3891n5658m1084J8289j7000k2807N5101L4981M6128K1953L0033
$$ -18500 -58158 -112049 -167707 -208791 -190502 -207502 -230309 -175208 -140227 -94099 -72146 -42113
8967d2113K4090n35n3306n7490J25j648J0749k683j0953K1083J179j3957J1317
$$ -42113 -18023 -18558 -71864 -129354 -129229 -130877 -120128 -122811 -133764 -112681 -111502 -125459 -114142
8954a14142M0586J5174M4053K3591J2147j0400l9983n3125l1975K639j658J5042
$$ -114142 -73556 -58382 -14329 9262 21409 11009 -28974 -82099 -114074 -111435 -113093 -98051
8942i8051N2110K1374n370k57L0833J6021P19R537o293m5831p0683l6471J2092
$$ -98051 -45941 -24567 -29937 -30194 639 16660 17379 26916 20623 -25208 -95891 -132362 -120270
8929a20270J8120J2929N1498N521J7385J247j3220L165j4127k6145j3868L646
$$ -120270 -102150 -89221 -37723 -32202 -14817 -13570 -26790 -23625 -37752 -63897 -77765 -74119
8917g4119m119n930R989m900O449L855L0731M5966L1002L5526M1262L9350P465
$$ -74119 -78238 -84168 -74179 -79079 -72630 -68775 -38044 7922 38924 74450 115712 155062 162527
8904A62527k4049k6623k3595q192M462Q289M2952P0663P5442R1202R8033J34605
$$ 162527 138478 111855 88260 80068 84530 92819 135771 206434 281876 373078 471111 605716
8892F05716J65226R9848M3273O528J5715M892P2794J49207K33131L19314M00414
$$ 605716 770942 870790 914063 920591 936306 941198 1013992 1163199 1396330 1715644 2116058
8881B116058M73102M85517M87378M94883O33254J013189J525859K286103L647809
$$ 2116058 2589160 3074677 3562055 4056938 4690192 5703381 7229240 9515343 13163152
8872A3163152O044148J0003322J6657934K6905187L5988098K4810885p308021
$$ 13163152 19207300 29210622 45868556 72773743 108761841 133572726 126264705
8865A26264705l0219407l1366587k1004048j2431966p610340n016440l456296
$$ 126264705 96045298 64678711 43674663 31242697 23632357 18615917 15159621
8858A5159621k510037j890692j433292j036394p29510m90243l93749l87128m16606
$$ 15159621 12649584 10758892 9325600 8289206 7559696 7069453 6675704 6288576 5871970
8849E871970m23389k73294j56750j63712j61469r7978n1751k6156M0966J78661
$$ 5871970 5448581 5175287 5018537 4854825 4693356 4595378 4543627 4517471 4558437 4737098
8839D737098K93574M39931O71379Q66644Q80803Q42022Q49703J118280J736773
$$ 4737098 5030672 5470603 6141982 7008626 7889429 8731451 9581154 10699434 12436207
8830A2436207K734069M166994O589184J0847373J8146983L0742743N1462947P4989052
$$ 12436207 15170276 19337270 25926454 36773827 54920810 85663553 137126500 212115552
8822B12115552N7896063j0433234o1740143o6060180m4005859k5669835j5460983
$$ 212115552 270011615 259578381 197838238 131778058 87772199 62102364 46641381
8815D6641381j0043594o921289n006466l717504k811662k119513j521933j028075
$$ 46641381 36597787 29676498 24670032 20952528 18140866 16021353 14499420 13471345
8807A3471345p92117q86152j099890j032125q21552o22853n39062m38403l11938
$$ 13471345 12679228 11793076 10693186 9661061 8839509 8216656 7677594 7239191 6927253
8798F927253k04689j82380j32191l3052R736Q2171J59292K22582L27183L07113
$$ 6927253 6722564 6540184 6407993 6374941 6384677 6466848 6626140 6848722 7175905 7483018
8788G483018L37849M52624P64456J256927J985210L152516N153007Q443730J4003033
$$ 7483018 7820867 8273491 9037947 10294874 12280084 15432600 20585607 29029337 43032370
8779D3032370K2907947L3133960K9362845O87300k6048558l2269726k3197449
$$ 43032370 65940317 99074277 128437122 129124422 103075864 70806138 47608689
8772D7608689j3809520q253153n247095l637985k625368j953792j415198j037684
$$ 47608689 33799169 25546016 20298921 16660936 14035568 12081776 10666578 9628894
8764I628894q08569n81887m82068m96719n22125n31551m34856l49187k55695j93043
$$ 9628894 8820325 8238438 7756370 7259651 6737526 6205975 5771119 5421932 5166237 4973194
8754D973194j04958o0330j69844k22830k02153j71738j56016j01026q7474j30028
$$ 4973194 4868236 4807906 4638062 4415232 4213079 4041341 3885325 3784299 3696825 3566797
8744C566797j25136j09759q8030m8597p1064l9823n1768n3379o1863k7835k0801
$$ 3566797 3441661 3331902 3243872 3195275 3124211 3084388 3032620 2979241 2917378 2889543 2868742
8733B868742J5273K6447n3603o5580n7669j1818J7233Q098r923J0947K1857O4992
$$ 2868742 2884015 2910462 2856859 2791279 2733610 2721792 2739025 2747123 2737200 2748147 2770004 2834996
8721B834996J19610J53293J10713K281m7940j05904l0861l561j5990q392L1588
$$ 2834996 2954606 3107899 3218612 3220893 3172953 3067049 3036188 3032627 3016637 3008245 3039833
8710C039833Q5222J22733J15436j3435j50867j50372r1535l7662k0519j2648l3925
$$ 3039833 3125055 3247788 3363224 3349789 3198922 3048550 2957015 2919353 2898834 2886186 2852261
8699B852261j3709N74L2818N5533k1028o7744q0081o5858J9154L6527K1439J7037
$$ 2852261 2838552 2839126 2871944 2927477 2906449 2838705 2758624 2692766 2711920 2748447 2769886 2786923
8687B786923L754K2562j8701q5758p4932j4433J5368L6732K3095O7244J07983
$$ 2786923 2790677 2813239 2794538 2708780 2633848 2619415 2634783 2671515 2694610 2761854 2869837
8676B869837J36549J57488J89111J17184L0508r7700j56791j13738r3939r9077
$$ 2869837 3006386 3163874 3352985 3470169 3500677 3402977 3246186 3132448 3038509 2939432
8666B939432o9900j2074K0353O2478M5155k1964m5852l1495n4918O526k174j9606
$$ 2939432 2869532 2857458 2877811 2940289 2985444 2963480 2917628 2886133 2831215 2837741 2835567 2815961
8654B815961O852k3881l7731k2118l4278l205k3017p1423m6516l47L6520K1984
$$ 2815961 2822813 2798932 2761201 2739083 2704805 2701600 2678583 2607160 2560644 2560297 2596817 2618801
8642B618801M0620j9196o6714r4113p0317J4187J2792N6356N5706K9789j5812
$$ 2618801 2659421 2640225 2573511 2479398 2409081 2423268 2436060 2492416 2548122 2577911 2562099
8631B562099J9126R2982J38094J41091O6480q6214j79529k20122j83782q5024
$$ 2562099 2581225 2674207 2812301 2953392 3019872 2933658 2754129 2534007 2350225 2265201
8621B265201p4803n6259j3821L133R0L3940M5292J4104k6133l7036L0042L2963
$$ 2265201 2190398 2134139 2120318 2123451 2123541 2157481 2202773 2216877 2190744 2153708 2183750 2216713
8609B216713O6108L8971m0217r3271l5295k3432k1022j7101j0398R17n251P6934
$$ 2216713 2282821 2321792 2281575 2188304 2153009 2129577 2108555 2091454 2081056 2081973 2076722 2153656
8597B153656J18825O9721m1274j48602j00600p2454k4448J7798r28m186K5282
$$ 2153656 2272481 2342202 2300928 2152326 2051726 1979272 1954824 1972622 1971694 1967508 1992790
8586A992790J2763R8898J88190K30896N7214j73218k27201j86549j59969j01734
$$ 1992790 2005553 2104451 2292641 2523537 2580751 2407533 2180332 1993783 1833814 1732080
8576A732080n3318m9377o6232k9945J5826o402K6725K1175j7561K9611O0571J32491
$$ 1732080 1678762 1629385 1563153 1533208 1549034 1542632 1569357 1590532 1572971 1602582 1663153 1795644
8564A795644J07902j162p6850q6015p2876q4687k290P1081L4356L2584P3839J43724
$$ 1795644 1903546 1902384 1825534 1739519 1666643 1581956 1579666 1650747 1685103 1717687 1791526 1935250
8552A935250J66586K5212r4685j57249j63870j05856l5810k7930k6727l3529r408
$$ 1935250 2101836 2127048 2032363 1875114 1711244 1605388 1569578 1541648 1514921 1481392 1471984
8541A471984K6686M3240M8839K7548j6273j24490j32039j10586n1148m6276p9485
$$ 1471984 1498670 1541910 1590749 1618297 1602024 1477534 1345495 1234909 1183761 1137485 1058000
8530A058000l1020J1224K867J0390J8348R76n251L9425N6181O5803M6491L078
$$ 1058000 1026980 1038204 1041071 1051461 1069809 1070785 1065534 1104959 1161140 1226943 1273434 1276512
8518A276512l649k5546n6568o9163n8181k0474K0138j5633K9270Q5596R4166O2680
$$ 1276512 1272863 1247317 1190749 1121586 1063405 1042931 1063069 1047436 1076706 1162302 1256468 1319148
8506A319148J5024l2608r9262r1148p6846j1508J0337l2972l8897m8279p4482
$$ 1319148 1334172 1301564 1202302 1111154 1034308 1022800 1033137 1000165 961268 912989 838507
8495H38507j2120L626k8091O789m881k8740l4334k455j5264k000n950M950R208
$$ 838507 826387 830013 801922 808711 803830 775090 740756 738301 723037 721037 715087 720037 729245
8482G29245J0323n725o786J9599r126L678p282o293m060J5263J1456m7995j9384
$$ 729245 739568 733843 727057 746656 737530 741208 733926 727633 723573 738836 750292 702297 682913
8469F82913l837K938J6823L4966Q2395J40145J66700J43837L9406j24210j59137
$$ 682913 679076 682014 698837 733803 816198 956343 1123043 1266880 1306286 1182076 1022939
8458A022939j34420r9724n7845j2833k4691l6523k4362l6832k3578o399j8636
$$ 1022939 888519 788795 730950 718117 693426 656903 632541 595709 572131 565732 547096
8447E47096j9648q188J7403J3652j3064J7112r55j0694N978q995L973k295p235
$$ 547096 527448 519260 536663 550315 537251 554363 553408 542714 548692 539697 543670 541375 534140
8434E34140k72r456L888J9731K9436L0751j9169j5595k2271k8314K2516L5618
$$ 534140 533868 524412 528300 548031 577467 608218 589049 573454 551183 522869 545385 581003
8422E81003Q1153P4884J22409J98390L16349L57014J01458k32338l56398k87340
$$ 581003 662156 737040 859449 1057839 1374188 1731202 1832660 1600322 1243924 956584
8412I56584j63529q7973m6418l7848n6050l3423l2876k2943j5844q668N157L207
$$ 956584 793055 705082 658664 620816 564766 531343 498467 475524 459680 451012 456169 459376
8400D59376k6173j3491j3128P368k1917j6884L6946l03j4125o042K6027M548j4892
$$ 459376 433203 419712 406584 413952 392035 375151 412097 411794 397669 391627 417654 422202 407310
8387D07310R788Q108k1712l0130j2348J2204M26Q287J7287R770L6917L6655P3690
$$ 407310 417098 425206 403494 373364 361016 373220 373646 381933 399220 408990 445907 482562 556252
8374E56252J16652J19752J37728M9543q7055j62549j38643m8036m6206n9383k0404
$$ 556252 672904 792656 930384 979927 892872 730323 591680 543644 497438 438055 417651
8363D17651J929N726R951L918j3040j8715o059k4478k1861j9497l26K8424J5638
$$ 417651 419580 425306 435257 439175 426135 407420 401361 376883 355022 335525 335199 363623 379261
8350C79261q323l0205k4351K72n896m139Q060n301o533k5802J0791L5322r022
$$ 379261 370938 340733 316382 316654 310758 306619 314679 309378 302845 277043 287834 323156 314134
8337C14134l9559j3410K5559O501r411P659k267k4825J4209M1202j4698k4688
$$ 314134 274575 261165 286724 293225 283814 291473 289206 264381 278590 319792 305094 280406
8325B80406R919q148l8993Q654K8407K1107m5546l1666J1836J074p189K1643L3664
$$ 280406 290325 282177 243184 251838 280245 301352 255806 224140 235976 237050 229861 251504 285168
8312B85168P322j125J8968J4549l8416k9154m681J7031p695k0306J0934K3105
$$ 285168 292490 291365 310333 324882 286466 257312 252631 269662 261967 241661 252595 275700
8300B75700k0496m4966k998r26k3827r259K6633J3450J3513J9775o777k6477m717
$$ 275700 255204 210238 207240 206314 182487 173228 199861 213311 226824 246599 239822 213345 208628
8287B08628R338k9315n4915M994M5668J7875j343l4225J3960L9756j8947m4369
$$ 208628 217966 188651 133736 138730 184398 202273 200930 166705 180665 220421 201474 157105
8275A57105P231J6159K4748K6746o65p847J371L2253o480k6854j5265j2525J7398
$$ 157105 164336 180495 205243 231989 231324 223477 224848 257101 250621 223767 208502 195977 213375
8262B13375j3558M999k806j6785L2363J8823k8425j7108j1999K3328J6074J3896
$$ 213375 199817 204816 202010 185225 217588 236411 207986 190878 178879 202207 218281 232177
8250B32177L0323j5140l7073J7155J2728K743k1623j3480L521P188l2356L158
$$ 232177 262500 247360 210287 227442 240170 242913 221290 207810 211331 218519 186163 189321
8238A89321J3782L4384k3626l9543O389K104k458N161m0986K818L3582J7824m1601
$$ 189321 203103 237487 213861 174318 180707 182811 180353 185514 144528 147346 180928 198752 157151
8225A57151m9747l14J2057Q977J4188K2186K097L266j6441j4028Q659J8339j498
$$ 157151 107404 107090 119147 128124 142312 164498 166595 169861 153420 139392 148051 166390 164892
8212A64892k7192J5880L3787j6240n2065o264L0929j4846k437K3898O004k9358
$$ 164892 137700 153580 187367 171127 119062 112798 143727 128881 126444 150342 156346 126988
8200A26988j5356P06j330J964J3968J9840L2013R075l6680j2290r277q827p848
$$ 126988 111632 112338 111008 112972 126940 146780 178793 187868 151188 138898 129621 120794 112946
8187A12946j967M269J8797J5424l220K0876l0941j6318q654J926K2048L4093k0593
$$ 112946 110979 115248 134045 149469 146249 167125 136184 119866 111212 113138 135186 169279 148686
8174A48686k8277j830K0176L1495J937q090l293J219m385K742R595o313j4279
$$ 148686 120409 118579 138755 170250 172187 164097 160804 162023 157638 160380 169975 163662 149383
8161A49383p031k157J5107k1375j5897J2694J9525J5317r366K3446J1182l628
$$ 149383 142352 140195 155302 133927 118030 130724 150249 165566 156200 179646 190828 187200
8149A87200j4111k5016j9009l070J0807L5718l961j3232l587O548L087n886j2376
$$ 187200 173089 148073 129064 125994 136801 172519 168558 155326 151739 158287 161374 155488 143112
8136A43112J3057J7318j7918j6805P835r147k6869M477o23K1392R831j4220k1999
$$ 143112 156169 173487 155569 138764 146599 137452 110583 115060 114437 135829 145660 131440 109441
8123A09441k4747J0317L2184J3494k3072m61m4186N856K3398J7034J1234J7594
$$ 109441 84694 95011 127195 140689 117617 117156 72970 78826 102224 119258 130492 148086
8111A48086K7750j393k4462R890K8820k749j8807n384k0428m538J9224J7886p562
$$ 148086 175836 174443 149981 159871 188691 185942 167135 161751 141323 136785 156009 173895 166333
8098A66333k7876J2005K5741k1679k5295O035j7827K144K626j3749q821K6786
$$ 166333 138457 150462 176203 154524 129229 135264 117437 119581 122207 108458 99637 126423
8086A26423K7011k5416l5094p820j3623J4947j500J4070k221k3555J1932L4921
$$ 126423 153434 128018 92924 85104 71481 86428 84928 98998 96777 73222 85154 120075
8074A20075Q463q58j0369j2864q826M589O0367J021l7075j9390k4137Q78J1193
$$ 120075 128538 127680 117311 104447 95621 100210 160577 161598 124523 105133 80996 81874 93067
8061I3067J3380K5064R65l2726k6840k0j0077J4740L0219k0154j5811k0742p003
$$ 93067 106447 131511 132476 99750 72910 72890 62813 77553 107772 87618 71807 51065 44062
8048D4062M468J0975l928K7202L0440J2525J1309k7553j2898J1099K7857K489
$$ 44062 48530 59505 55577 82779 113219 125744 137053 109500 96602 107701 135558 138047
8036A38047j4182m1976R219r728j3392l380K434J1116K3785K3934k1348j4326
$$ 138047 123865 81889 91108 81380 67988 64608 67042 78158 101943 125877 104529 90203
8024I0203J1037J432m458l2421k1571Q671L2620l856j509k245K050O145p612J167
$$ 90203 101240 102672 98214 65793 44222 52893 85513 81657 80148 77903 79953 86098 78486 79653
8010G9653j3103K0003K6333M674J6999q67j7756k442k4276J1594K3149P461j896
$$ 79653 66550 86553 112886 117560 134559 133692 115936 113494 89218 100812 123961 131422 129526
7997A29526j1216J055k9990p417K4853M4921m940m2726r936J6299j0099j499K764
$$ 129526 118310 119365 89375 81958 106811 151732 146792 104066 94130 110429 100330 98831 101595
7984A01595J9323Q985J6426J423j9691P89J8501n143l5003L020n839j1665J0165
$$ 101595 120918 129903 146329 147752 128061 128850 147351 142208 107205 110225 104386 92721 102886
7971A02886k1976j7345J0818J9189K350j3799j2957K534j2042j4853K048j865
$$ 102886 80910 63565 74383 93572 95922 82123 69166 71700 59658 44805 46853 44988
7959D4988K5808J0299j1978l516J6813L0851P076K5902j4475l3861L0571J4000
$$ 44988 70796 81095 69117 65601 82414 113265 120341 146243 131768 97907 128478 142478
7947A42478k3916n109O043j1644k3525K8714L1458J3349j4654j546O542p656K6493
$$ 142478 118562 113453 119496 107852 84327 113041 144499 157848 143194 141648 148190 140534 167027
7934A67027j0925k9114l5291J993K5723L1959K523j7851k664k118R966j4736l4134
$$ 167027 156102 126988 91697 93690 119413 151372 153895 136044 133380 131262 141228 126492 92358
7921I2358K388P287j0305j3698l398K7286m489K844P910j1197l1405n569K8459
$$ 92358 94746 102033 91728 78030 74632 101918 97429 100273 108183 96986 65581 60012 88471
7908H8471k3263n909K0356k8645j7504K7326J8886J1490p078k8156R482L3332
$$ 88471 65208 59299 79655 51010 33506 60832 79718 91208 84130 55974 65456 98788
7896I8788j7957j8076J1730q420j0372L155k747j4722O90n092N740M2725K0776
$$ 98788 80831 62755 74485 66065 55693 58848 56101 41379 42069 36977 42717 85442 106218
7883A06218j775J8745j0356o38J1752k1168j7393j8268n75L6306m270k4877l4497
$$ 106218 104443 123188 112832 112194 123946 102778 85385 67117 66542 102848 98578 73701 39204
7870C9204j6631K7339L6289p325k6150O242P246K3462J4191j8554p71l623j4880
$$ 39204 22573 49912 86201 78876 52726 58968 66214 89676 103867 85313 84542 80919 66039
7857F6039M811J7682P175k1531j2141J4985L3658L653p143k4398j3753n533k6638
$$ 66039 70850 88532 95707 74176 62035 77020 110678 114331 107188 82790 69037 63504 36866
7844C6866k782K814J1384K974j6885L6330J6544j0885J5556o328m7876K644Q312
$$ 36866 34084 36898 48282 51256 34371 70701 87245 76360 91916 85588 37712 40356 48668
7831D8668P877l1904l077L0290N264R375l2290k2100K1827K9258J4774J7387k5099
$$ 48668 56545 24641 21564 51854 57118 66493 34203 12103 33930 63188 77962 95349 70250
7818G0250l861p278J1501O18N163j6482L3723o036l3305j555R323J3225K660K4808
$$ 70250 66389 59111 70612 71230 76393 59911 93634 87598 54293 52738 62061 75286 77946 102754
7804A02754j6217k9510m19J0347N600j9641p934l363o610k344K4839Q952j1574
$$ 102754 86537 57027 56608 66955 72555 52914 44980 41617 35007 32663 57502 66454 54880
7791E4880Q216M406J8296o846p513n195P934K047l5671L999j9658O29J2702K8260
$$ 54880 63096 67502 85798 78952 71439 66244 74178 76225 40554 44553 24895 25524 38226 66486
7777F6486R84j0350J7800P56k1139N075J3536k596k2291k6927l4735j9689l539
$$ 66486 67470 57120 74920 75676 54537 59612 73148 70552 48261 21334 -13401 -33090 -36629
7764c6629L5065L7826K2798O077P266J3233j3800j9009K0764j8976k3203k9179
$$ -36629 -1564 36262 59060 65137 72403 85636 71836 52827 73591 54615 31412 2233
7752B233K6009Q87Q807J7478M915J3009j357L27Q441J5583J2525L180j4606o107
$$ 2233 28242 29129 37936 55414 60329 73338 71981 72308 80749 96332 108857 112037 97431 91324
7738I1324o74q52J131J6576l1143k3853n872K1667J1264P403j8474l4217K879
$$ 91324 90650 89798 90929 107505 76362 52509 46637 68304 79568 86971 68497 34280 37159
7725C7159K415K6996J7765k4882m843J4492P799n0518j9050L7471r753j0430L7817
$$ 37159 39574 66570 84335 59453 54610 69102 76901 26383 7333 44804 35051 24621 62438
7712F2438L6652r330J986K1045n474l7683l7723K472J2104K768j5642k3473J1732
$$ 62438 99090 89760 91746 112791 107317 69634 31911 34383 46487 49255 33613 10140 21872
7699B1872M4044J851r674j2243Q175k2590J117K3203M59K4280J983k3226n71j2109
$$ 21872 65916 67767 58093 45850 54025 31435 32552 55755 56214 80494 82477 59251 58680 46571
7685D6571K6344K1845l111j0978j4300j2212k6973J2608j2378k6031p684J9145
$$ 46571 72915 94760 91649 80671 66371 54159 27186 39794 27416 1385 -6299 12846
7673A2846J4218K693J5352K3929j5726k535Q600q269n592k5739k051J3168q566
$$ 12846 27064 29757 45109 69038 53312 50777 59377 51108 45516 19777 17726 30894 22328
7660B2328O025J201J6605j4062l522k0041l89K3121J2370J3215j6320k3724p356
$$ 22328 28353 29554 46159 32097 28575 8534 8145 31266 43636 56851 40531 16807 9451
7647I451J0585K1474J1171o343J8753K1643j7396l090o276N676J6896p781l1365
$$ 9451 20036 41510 52681 46338 65091 86734 69338 66248 59972 65648 82544 74763 43398
7634D3398k4321L404K218j6132K2318L171J5115O761j2226k3729k6761l669L803
$$ 43398 19077 22481 24699 8567 30885 34056 49171 55932 43706 19977 -6784 -10453 -6650
7621f650J1153K5026N920n386M6122K7488k711l9214k2451j3175P572J8781j4741
$$ -6650 4503 29529 35449 30063 76185 103673 100962 61748 39297 26122 33694 52475 37734
7608C7734N580k2047M208J3023J7669L1729J4910k179k8630n5935k325k0787j40
$$ 37734 43314 21267 25475 38498 56167 87896 102806 100627 71997 16062 13737 -7050 -7190
7595g190K1366L2402Q285n581r942j1233j5985N22J9467J2921l4180k2060J8234
$$ -7190 14176 46578 54863 49282 39340 28107 12122 12644 32111 45032 10852 -11208 7026
7582G026N8666J3739m443j8014K5654j9119m9239M842K8630J4402k0766q566l417
$$ 7026 65692 79431 74988 56974 82628 63509 14270 19112 47742 62144 41378 32812 29395
7569B9395m393r796K6676L400L7708O001p340o831n814j8044j2647l5675m4088
$$ 29395 25002 15206 41882 45282 82990 88991 81651 74820 69006 50962 38315 2640 -41448
7556d1448N0476J8701M075Q245P577j2629j4575L183j4005J625N726j7997j5074
$$ -41448 9028 27729 31804 40049 47626 34997 20422 23605 9600 11225 16951 -1046 -16120
7543a6120j1013m672K4946k042R109k128R884P368k3458J0364J126K3716K6434
$$ -16120 -27133 -31805 -6859 -8901 208 -1920 7964 15332 -8126 2238 3364 27080 53514
7530E3514K4238l46k3645j7362m116J2629J5909J6397L836J0848m3038k4115J0377
$$ 53514 77752 77406 53761 36399 32283 44912 60821 77218 81054 91902 48864 24749 35126
7517C5126M546j0868j8212J4670M500j7268j5077M369P446j7873K439K3266K6624
$$ 35126 39672 28804 10592 25262 29762 12494 -2583 1786 9232 -8641 -6202 17064 43688
7504D3688Q595L266J2869n764m6036n077K5577L02k9283J7444K5651p972k6646
$$ 43688 52283 55549 68418 62654 16618 11541 37118 37420 8137 25581 51232 43260 16614
7491A6614Q075Q399j1904L2689K4433j6545j6802j8264j6001K1476n67k2475k3791
$$ 16614 24689 33088 21184 53873 78306 61761 44959 26695 10694 32170 31603 9128 -14663
7478a4663k4634J839L1652N1748J4203K39k8954k3160J6282J5466N310k8804q64
$$ -14663 -39297 -37458 -5806 45942 60145 60384 31430 8270 24552 40018 45328 16524 15660
7465A5660j0847k4267J3216K1091q98r171j4872j5513K5142K5705j6172N145K9065
$$ 15660 4813 -19454 -6238 14853 13955 4784 -10088 -25601 -459 25246 9074 14219 43284
7452D3284J2457j0957j8581j3542J3713k5932L751K6892J7726m14O049Q634J6762
$$ 43284 55741 44784 26203 12661 26374 442 4193 31085 48811 48397 54446 63080 79842
7439G9842l1395j9202Q612j1542k2406k1687J090L208P349r47j9395J2830K4901
$$ 79842 48447 29245 37857 26315 3909 -17778 -16688 -13480 -6131 -7078 -26473 -13643 11258
7426A1258N711K1109l738L960J8076N597j1866k7916o907Q531J2019l118q548
$$ 11258 16969 38078 34340 38300 56376 61973 50107 22191 15284 23815 35834 32716 24168
7413B4168j7406L3170J7832R130j7211k3380l720q031j5663L4347m938L452J4313
$$ 24168 6762 39932 57764 66894 49683 26303 22583 14552 -1111 33236 28298 31750 46063
7400D6063L3588j8685k8840O775o128O22j526Q484l739l0819l2242Q235M4095
$$ 46063 79651 60966 32126 38901 32773 33395 31869 40353 36614 5795 -26447 -18212 25883
7387B5883k0617o873J8325K9697l107l573j7763n85n585J1459M1880O283P933
$$ 25883 5266 -1607 16718 46415 43308 39735 21972 21387 15802 27261 69141 75424 83357
7374H3357L494J963j3764q181K80n520j5190k64k9992j1678l522J3347L9338R582
$$ 83357 86851 88814 75050 66869 67149 61629 46439 46175 16183 4505 983 14330 53668 63250
7360F3250R590j5200l1311l2590P90k1893j4313j664K8613Q005J7514M1256N023
$$ 63250 72840 57640 26329 -6261 -5471 -27364 -41677 -43341 -14728 -6723 10791 52047 57070
7347E7070m6101L267R648J8869m784q582k7524m8494K3673J9720J3765J279K757
$$ 57070 10969 14236 23884 42753 37969 29387 1863 -46631 -22958 -3238 10527 11806 14563
7334A4563j6843j6129m310K354O917j2340k6757K6282L3166J3595k5385l740K2400
$$ 14563 -2280 -18409 -22719 -20365 -13448 -25788 -52545 -26263 6903 20498 -4887 -8627 13773
7321A3773J9268r692n559K11P377j397p87k7663j4551r74J1703p81n944K6040
$$ 13773 33041 23349 17790 18001 25378 23981 23194 -4469 -19020 -19994 -8291 -9072 -15016 11024
7307A1024P242m891m825j6225J0581j1171J8628J2929M792q446r60J817P891k6461
$$ 11024 18266 13375 8550 -7675 2906 -8265 10363 23292 28084 19638 18678 20495 28386 1925
7293A925m368p90M662l803k5129r77L2212k5213K966l730J2857J1170J2547q556
$$ 1925 -2443 -3233 1429 -2374 -27503 -28480 3732 -21481 -18515 -22245 -9388 1782 14329 5773
7279E773l2727j2934j9769K8394K572J2375o19j0445J9028J791l5702M024L2447
$$ 5773 -26954 -39888 -59657 -31263 -28691 -16316 -16935 -27380 -8352 -6561 -42263 -38239 -5792
7266e792Q111k565J3924j792K3102n178p472J2127k1199j724J8754m337q067M964
$$ -5792 2319 -246 13678 11886 34988 29810 22338 34465 13266 11542 30296 25959 17892 22856
7252B2856J4270m251k515J5476O020M7127j2029k8796j5727j9129k3715o650K4850
$$ 22856 37126 32875 30360 45836 51856 98983 86954 58158 42431 23302 -413 -7063 17787
7239A7787M0311J4927m694j7080n1686J8692L9434K4828J867j0282k3394n914
$$ 17787 58098 73025 68331 51251 -435 18257 57691 82519 84386 74104 50710 44796
7227D4796k5106j5436Q370Q286k3571m0888L6992N0394J4661k6378M823O608j9669
$$ 44796 19690 4254 12624 20910 -2661 -43549 -6557 43837 58498 32120 36943 43551 23882
7214B3882k9952j077K6371J7780j0116p537J3385k8608k9758j2435M753K6559
$$ 23882 -6070 -7147 19224 37004 26888 19351 32736 4128 -25630 -38065 -33312 -6753
7202f753K4188l8531n3437L3681L4821J1374n203j2815n390O474m846n288k6637
$$ -6753 17435 -21096 -74533 -40852 -6031 5343 140 -12675 -18065 -11591 -16437 -21725 -48362
7189d8362J7826M4310o862J5641n493L1633m467k6249j0647N59p480m120K4429
$$ -48362 -30536 13774 6912 22553 17060 48693 44226 17977 7330 7889 409 -3711 20718
7176B0718J1787J4555j068j6426j8962j3216k5942j334K868M255k173L1114R573
$$ 20718 32505 47060 45992 29566 10604 -2612 -28554 -29888 -27020 -22765 -24938 6176 15749
7163A5749J5196j7301j1067K1471k544j7377r299o27j9085N375K2628L6285j4135
$$ 15749 30945 13644 2577 24048 21504 4127 -5172 -5799 -24884 -19509 3119 39404 25269
7150B5269P232K5462k3481l0095K1021P91k0004m0488R774K1310k296k798K0862
$$ 25269 32501 57963 34482 4387 25408 26199 6195 -34293 -24519 -3209 -5505 -8303 12559
7137A2559K7829l933l9708k6111J5372P3349L3794k5970j7833j0398L326r353
$$ 12559 40388 36455 -3253 -29364 -13992 59357 93151 67181 49348 38950 42276 32923
7125C2923K650N875k1637J1565K5195j0283K264k5914q567o358J7996N621k437
$$ 32923 35573 41448 19811 31376 56571 46288 48552 22638 14071 7713 25709 31330 28893
7112B8893L165j4033K5741J0591K6621p067k4097k2283J1545j8028l7186O68M1716
$$ 28893 32058 18025 43766 54357 80978 73911 49814 27531 39076 21048 -16138 -15470 26246
7099B6246J4520P530O9m188j1138Q289j282J17j355R911q102J2718m376l9035
$$ 26246 40766 48296 48365 44177 33039 41328 40046 40163 38808 48719 40617 53335 48959 9924
7085I924j4054J2125K220n29J802J8932n862l7604j7980J9041j4455J4471J1582
$$ 9924 -4130 7995 10215 9686 11488 30420 24558 -13046 -31026 -11985 -26440 -11969 -387
7072c87J3336j7846j4782Q197O219k5498j926O143n516J0256K5817p105M577m37
$$ -387 12949 -4897 -19679 -11482 -5263 -30761 -32687 -26544 -32060 -21804 4013 -3092 1485 1048
7058A048j3448p84J143l3738k5081J6276K4928K2721k841j2467O2086L667q771
$$ 1048 -12400 -13184 -12041 -45779 -70860 -54584 -29656 -6935 -9776 -22243 39843 43510 34739
7045C4739J006p744k0127K0155p944K4715j3627k4211k185J7981J4101J2435J6454
$$ 34739 35745 28001 7874 28029 20085 44800 31173 6962 4777 22758 36859 49294 65748
7032F5748Q665J276j8100l3476r746J4900J2643j8423j0422j3430M511K9165K3676
$$ 65748 74413 75689 57589 24113 14367 29267 41910 23487 13065 -365 4146 33311 56987
7019E6987n975j4485k0395Q710j3144J4986o22l499L0072Q208k8868K349K9382
$$ 56987 51012 36527 16132 24842 11698 26684 26062 22563 52635 60843 31975 34324 63706
7006F3706J9370l5434n9618k603M1275R244k1055r181j6472R754L7164J1968j657
$$ 63706 83076 47642 -11976 -14579 26696 35940 14885 5704 -10768 -1014 36150 48118 46461
6993D6461J5119K0409l9220k9831j9555j9729j5017M58J7577J6622J7255P126
$$ 46461 61580 81989 42769 12938 -6617 -26346 -41363 -40905 -23328 -6706 10549 17675
6981A7675J1644j5949r784j0424m38l990k898J637N860L1861Q166M065p833J6465
$$ 17675 29319 13370 3586 -6838 -7276 -11266 -14164 -12527 -6667 25194 33360 37425 29592 46057
6967D6057K1449k3285m2935k2634j7936q323J6332m935k57p681J7828N458j342
$$ 46057 67506 44221 1286 -21348 -39284 -47607 -31275 -36210 -36467 -44148 -26320 -20862 -22204
6954b2204q417L1070M986j347L1071R490r225Q570O50j1453r539m9950J197J2279
$$ -22204 -30621 449 5435 4088 35159 44649 35424 43994 44644 33191 23652 -26298 -25101 -12822
6940a2822J1540j740N171J0170J2634R293o809p682J6575k917j821J1209O381
$$ -12822 -1282 -3022 2149 12319 24953 34246 27437 19755 36330 33413 31592 42801 49182
6927D9182J4789p108l0309J1119r593j6845k847N39K118k8986q975j1222k2029
$$ 49182 63971 56863 26554 37673 28080 11235 8388 8927 11045 -17941 -26916 -38138 -60167
6914f0167k9649J9139M0390L8171r118K3949L4666k71m4708n669R600J592j4852
$$ -60167 -89816 -70677 -30287 7884 -1234 22715 57381 57110 12402 6733 16333 17925 3073
6901C073J4581K7852L18j0831R399k1515p543L2492J9840r389r867l054J9608
$$ 3073 17654 45506 45824 34993 44392 22877 15334 47826 67666 58277 48410 45356 64964
6888F4964K5587k6781l4730J4809R72q360j8018k570k6226N246m548J2747K9839
$$ 64964 90551 63770 29040 43849 44821 36461 18443 15873 -10353 -5107 -9655 3092 32931
6875C2931J4915K324J3431O904l2038l9025K3385Q956J3454m956l6599j8764R601
$$ 32931 47846 50170 63601 70505 38467 -558 22827 31783 45237 40281 3682 -15082 -5481
6862e481M1240M072l3513r063Q087j195K6105J2657k556J4032K2644j583j8069
$$ -5481 35759 39831 6318 -2745 5342 4147 30252 42909 40353 54385 77029 75446 57377
6849E7377k1311p742j6401o62p614k1830J0485K1082N478J5888J5790k0021j9428
$$ 57377 36066 28324 11923 11261 3647 -18183 -7698 13384 18862 34750 50540 30519 11091
6836A1091m391q175L3529K0752k7640m2102j9224J2665J2656j0158M785J7956
$$ 11091 6700 -1475 32054 52806 25166 -16936 -36160 -23495 -10839 -20997 -16212 1744
6824A744J7891j1154k859k450l276J3760J2095J8073j0233M510m34j5830j9907
$$ 1744 19635 8481 5622 3172 -104 13656 25751 43824 33591 38101 37667 21837 1930
6811A930K5604o500N891N994j1756j0627P663K51j3851r242K8176J6694q674j4059
$$ 1930 27534 21034 26925 32919 21163 10536 18199 18450 4599 -4643 23533 40227 31553 17494
6797A7494j0211P850L740P725l1640l0301J5561P973R260m273N74n364J8735L8156
$$ 17494 7283 15133 18873 26598 -5042 -35343 -19782 -11809 -2549 -6822 -6248 -11612 7123 45279
6783D5279J6095j6321m471k1228k0421j2910J0271K848q133j5175j8059Q892R791
$$ 45279 61374 45053 40582 19354 -1067 -13977 -3706 -858 -8991 -24166 -42225 -33333 -23542
6770b3542J7889J0499m401k3507L4181P889k4227J3659J751j8793k2296Q320l489
$$ -23542 -5653 4846 445 -23062 11119 19008 -5219 8440 10191 -8602 -30898 -22578 -26067
6757b6067k9132J6682K0262J4276J1080j4850j4996O41P360J0692N950J9229j7878
$$ -26067 -55199 -38517 -18255 -3979 7101 -7749 -22745 -22104 -14744 -4052 1898 21127 3249
6744C249k1497J321k627j004j5266m1189J3339J0689q921M5640K2397Q202M518
$$ 3249 -18248 -16927 -19554 -20558 -35824 -77013 -63674 -52985 -61906 -16266 6131 14333 18851
6731A8851p90J3786J6904O541k218n522j2679k5695l9859j7021R307O3231K2580
$$ 18851 18061 31847 48751 55292 53074 47552 34873 9178 -30681 -47702 -38395 24836 47416
6718D7416J2142l874n418Q264K652k7299k0692p331J9257J2043K7684J375n514
$$ 47416 59558 55684 50266 58530 61182 33883 13191 5860 25117 37160 64844 66219 60705
6705F0705Q129J055J7978J8398k4846k3921m038J0634m258k3157l7538k0309O314
$$ 60705 68834 69889 87867 106265 81419 57498 53460 64094 59836 36679 -859 -21168 -14854
6692a4854J1068N420J2178L7356l853L691k8436k8588m096K2994J3669J8273K3510
$$ -14854 -3786 1634 13812 51168 47315 51006 22570 -6018 -10114 12880 26549 44822 68332
6679F8332j4973m5925p210q760j6720J3386K2625k2674J4072L2204O7788K72l6072
$$ 68332 53359 7434 224 -8536 -25256 -11870 10755 -11919 2153 34357 102145 102417 66345
6666F6345k2618j2893J9687j790j6015k878j6231j1624q656J729N777j3005l814
$$ 66345 43727 30834 50521 48731 32716 29838 13607 1983 -6673 -4944 833 -12172 -15986
6653a5986J6938J5515J5284K843o398O861L386p772k2960l058r721L000J6404
$$ -15986 952 16467 31751 34594 28196 35057 38443 30671 7711 4653 -5068 -2068 14336
6640A4336o949P48O911J2896Q937k8944m173j04J3437n268l4019M648J9416L377
$$ 14336 7387 8135 15046 27942 36879 7935 3762 3658 17095 11827 -22192 -17544 1872 5249
6626E249k9172J7246J900K0457q974p050L153Q249J1412j2718l2481K1269K8669
$$ 5249 -23923 -6677 -4777 15680 6706 -344 2809 11058 22470 9752 -22729 -1460 27209
6613B7209K3167j4533k6529P877J8277n093L32K697j1055r233J691K3468k150
$$ 27209 50376 35843 9314 17191 35468 30375 30707 33404 22349 13116 14807 38275 36125
6600C6125J7185k9042k5918k810L2341M4862n853l0378n745j3979k409j1394j7506
$$ 36125 53310 24268 -1650 -4460 27881 72743 66890 36512 30767 16788 14379 2985 -14521
6587a4521k5938J8215J35P38K286K2847l086L44L2227m317n2306o951L8267J9131
$$ -14521 -40459 -22244 -22109 -21371 -19085 3762 676 1020 33247 28930 -23376 -30327 7940 27071
6573B7071M706k3203K052J6574o5J5224K883j2067k5640N269k7363o367K2887
$$ 27071 31777 8574 10626 27200 27135 42359 45242 33175 7535 12804 -14559 -20926 1961
6560A961J4137q088R122l1523k5393N290L3101J4586J642l2780j3231K835K141
$$ 1961 16098 8010 17132 -14391 -39784 -34494 -1393 13193 14835 -17945 -31176 -28341 -26200
6547b6200k536J1441L984P316p434O426J0503q062R730K7960L1799j6224P360
$$ -26200 -28736 -17295 -13311 -5995 -13429 -7003 3500 -4562 5168 33128 64927 48703 56063
6534E6063R424j1527Q865l6588l8872k4182K8786L7798K3185k5016k7440j7082
$$ 56063 65487 53960 62825 26237 -12635 -36817 -8031 29767 52952 27936 496 -16586
6522a6586k360L644J7281O252P01J0805j115n858K917L4458K7540P285k7726j5076
$$ -16586 -18946 -15302 1979 8231 8932 19737 18622 12764 15681 50139 77679 84964 57238 42162
6508D2162l284r744j2722K205j2830J560o350j6406k9251j5482J6995K9379j6449
$$ 42162 38878 29134 16412 18617 5787 7347 997 -15409 -44660 -60142 -43147 -13768 -30217
6495c0217r046M0092P637J743K1304L729n078l1567K6510o07J0354r423j8013
$$ -30217 -39263 829 8466 10209 31513 35242 30164 -1403 25107 24500 34854 25431 7418
6482G418M1848K1408J0126q956n0380r228p71j5485K5046L783j0033j9047m578
$$ 7418 49266 70674 80800 71844 21464 12236 11465 -4020 21026 24809 14776 -4271 -8849
6469h849J700M820k5346k4515J9888K3839J6649J1679l981O516j9377j6829J5281
$$ -8849 -7149 -2329 -27675 -52190 -32302 -8463 8186 19865 15884 22400 3023 -13806 1475
6456A475K7062j8929J4369K3914k0135j3209o867k0007K396P301J1216r716k4549
$$ 1475 28537 9608 23977 47891 27756 14547 7680 -12327 -9931 -2630 8586 -1130 -25679
6443b5679K1811l626m993o943k2618k0644K1545L1849J6580J7926q720k8646R301
$$ -25679 -3868 -7494 -12487 -19430 -42048 -62692 -41147 -9298 7282 25208 16488 -12158 -2857
6430b857r870j0173P829L0663K5940j3952k9351j1290J6308J8097K4413l1716
$$ -2857 -12727 -22900 -15071 15592 41532 27580 -1771 -13061 3247 21344 45757 14041
6418A4041j2689K3202l4099O289J0627L950j7759k628J2988l3978p954J8819k1055
$$ 14041 1352 24554 -9545 -3256 7371 11321 -6438 -9066 3922 -30056 -38010 -19191 -40246
6405d0246j5283O260J2830P389N038P5K8664K9465l633j8758j5607J9J5223R195
$$ -40246 -55529 -49269 -36439 -29050 -24012 -23937 4727 34192 30559 11801 -3806 -3787 11436 20631
6391B0631J2330j3349k9648j1383J2586K4576K027J1224K899j2460J423J8290
$$ 20631 32961 19612 -10036 -21419 -8833 15743 17770 28994 31893 19433 20856 39146
6379C9146K0665j1499l6746k9045q157J9047J3515Q136K8763k2622k8584j7945
$$ 39146 59811 48312 11566 -17479 -25636 -6589 6926 15062 43825 21203 -7381 -25326
6367b5326j131L442j620o177J0544K4794M481j8962k0605J8301l688Q074K3993
$$ -25326 -26457 -23015 -24635 -30812 -20268 4526 9007 -9955 -30560 -12259 -15947 -7873 16120
6354A6120L8225k0194j4232k2569l4745j647J3941p13K6138J1606j0668m624M2468
$$ 16120 54345 34151 19919 -2650 -37395 -39042 -25101 -25814 324 11930 1262 -3362 39106
6341C9106O784n0544j4452J6504p796K6540L2997N511m1317j3597j5394k7437
$$ 39106 45890 -4654 -19106 -2602 -10398 16142 49139 54650 13333 -264 -15658 -43095
6329d3095J3939O72J5731M6171L0269L544l7659r809J6962l509n473j4513k3462
$$ -43095 -29156 -28484 -12753 33418 63687 67231 29572 19763 36725 33216 27743 13230 -10232
6316a0232K3547P759j8033n995j4760J9164J6475j5035n725p305J0263K6375P680
$$ -10232 13315 21074 3041 -2954 -17714 1450 17925 2890 -2835 -10140 123 26498 34178
6303C4178o840R995J8714k8004l8456j3421j9727j7832O958K4991K8888k9977
$$ 34178 27338 37333 56047 28043 -10413 -23834 -43561 -61393 -54435 -29444 -556 -30533
6291c0533k1638J7277K4611J4485L002j2691j496k5908J7098q788l2259o894R419
$$ -30533 -52171 -34894 -10283 4202 7204 -5487 -6983 -32891 -15793 -24581 -56840 -63734 -54315
6278e4315L1557J7390J5887j2610l4553K5700K1348j6626k0249J8961J0734J4480
$$ -54315 -22758 -5368 10519 -2091 -36644 -10944 10404 -6222 -26471 -7510 3224 17704
6266A7704L7124J5169j7515j347p410r81k1187k3030p534L618J7209k550M412
$$ 17704 54828 69997 52482 51135 43725 42744 21557 -1473 -9007 -5389 11820 9270 13682
6253A3682K2956k4590j3992J9706J3814j2295M578p239j1199j2995L6936N244
$$ 13682 36638 12048 -1944 17762 31576 19281 23859 16620 5421 -7574 29362 34606
6241C4606k6089k1986K3448k813P187Q135r911M177k9920j55O437J3208n427j0073
$$ 34606 8517 -13469 9979 7166 14353 22488 12577 16754 -13166 -13321 -6884 6324 897 -9176
6227i176J8412k79j261r15l7415K0232J0584M053l744K4512l161P935k902k9984
$$ -9176 9236 8957 7696 6781 -30634 -10402 182 4235 491 25003 21842 29777 26875 -3109
6213c109k7820k1055J6238K1739J2371j8698J223P375l91j1528J0099K2486j4460
$$ -3109 -30929 -51984 -35746 -14007 -1636 -20334 -19111 -11736 -12127 -23655 -13556 8930 -5530
6200e530j4424R279n415M070P158O444J483l465J139O185J4660j5518l4128N2630
$$ -5530 -19954 -10675 -16090 -12020 -4862 1582 3065 -400 739 6924 21584 6066 -28062 24568
6186B4568K8000r659l9316j7712r542J5878K2329J5278L508R228N775j6539k130
$$ 24568 52568 42909 3593 -14119 -23661 -7783 14546 29824 33332 42560 48335 31796 29666
6173B9666L163O089j7717o689K2026r709j8240k1787o398K8348n227l6230K593
$$ 29666 32829 38918 21201 14512 36538 26829 8589 -13198 -19596 8752 3525 -32705 -30112
6160c0112N2605K4941n380j8410q54k9552j0340k554O413j1699j2542O344J8834
$$ -30112 22493 47434 42054 23644 22790 -6762 -17102 -19656 -13243 -24942 -37484 -31140 -12306
6147a2306J8889K3277M4350j0774l3591m012P851J132n839j3346l408R36M104
$$ -12306 6583 29860 74210 63436 29845 25833 33684 34816 28977 15631 12223 13159 17263
6134A7263p027P79J2582j8805r22j4016j2103k6413K4881R550K5171K0599j8980
$$ 17263 10236 11015 23597 4792 3870 -10146 -22249 -48662 -23781 -14231 10940 31539 12559
6121A2559q910j8548j0368J1056R097M8231J4300j0073k9956k5174q624j0696
$$ 12559 3649 -14899 -25267 -14211 -5114 43117 57417 47344 17388 -7786 -16410 -27106
6109b7106P043J8819J1232P7K628n949J0218j8998j2996j1385j963m525j7357
$$ -27106 -20063 -1244 9988 10065 12693 6744 16962 -2036 -15032 -26417 -28380 -32905 -50262
6096e0262R02P425K9460P517l877m532J2311k962l732K918N49j3315j2487o877
$$ -50262 -49360 -41935 -12475 -4958 -8835 -13367 -1056 -4018 -7750 -4832 -4283 -17598 -30085 -36962
6082c6962l198P672N718r749j2673J3432n377k5453J0448M5391N8005l1870m4809
$$ -36962 -40160 -32488 -26770 -36519 -49192 -35760 -41137 -66590 -56142 -10751 47254 15384 -29425
6069b9425K4490L0585J0184j9981O413l2926j1406K1856O744M97r148p547K077
$$ -29425 -4935 25650 35834 15853 22266 -10660 -22066 -210 6534 7031 -2117 -9664 -7587
6056g587j6n119j0583o577L1553K2124J7934j3965j7348J3169K593k3311l5052
$$ -7587 -7603 -12722 -23305 -29882 1671 23795 41729 27764 10416 23585 26178 2867 -32185
6043c2185q216K2881K9220K6258k612l8910j3323K960k634k5168J2359J6127k3178
$$ -32185 -40401 -17520 11700 37958 35346 -3564 -16887 -13927 -16561 -41729 -29370 -13243 -36421
6030c6421j3288K4146K015J1074J5903J0718N155l5213j9394J5665N829K866j0458
$$ -36421 -49709 -25563 -23548 -12474 3429 14147 19302 -15911 -35305 -19640 -13811 -10945 -21403
6017b1403m728n48K0162p270q812L3080J0540k1601j1330O415J0576j1115j805
$$ -21403 -26131 -26679 -6517 -13787 -22599 10481 21021 -580 -11910 -5495 5081 -6034 -7839
6004g839K3478O52j9745l080k9258l78j945o923K88J1786j062K4723L5342n687
$$ -7839 15639 16291 -3454 -6534 -35792 -36170 -38115 -45038 -44750 -32964 -34026 -9303 26039 20352
5990B0352n9474j4007L5300K4426R088j6416l2170j4672j227M2615l230n762K4622
$$ 20352 -39122 -53129 -17829 6597 15685 -731 -32901 -47573 -48800 -6185 -9415 -15177 9445
5977I445k1185n114J5405J8053j0966k3453K6688J1769m464l6459O191j735l512
$$ 9445 -11740 -16854 -1449 16604 5638 -17815 8873 20642 16178 -20281 -14090 -15825 -19337
5964a9337K5911n351Q161L805k6817n388j3921k501M5553J0567j9640J4546N155
$$ -19337 6574 1223 9384 13189 -13628 -19016 -32937 -35438 10115 20682 1042 15588 20743
5951B0743p955j9035l0783k4690j1446k753J5285K8089K505O465O601J1824m165
$$ 20743 12788 -6247 -37030 -61720 -73166 -75919 -60634 -32545 -30040 -23575 -16974 -5150 -9315
5938i315J0435R836j4493R947r85o701k0602Q360n210k5339K3544R096J6115M610
$$ -9315 1120 10956 -3537 6410 5425 -1276 -21878 -13518 -18728 -44067 -20523 -11427 4688 9298
5924I298J7014K2716n8188l6730L1143J3342k6370k2848k909J4867j3869K0096
$$ 9298 26312 49028 -9160 -45890 -14747 -1405 -27775 -50623 -53532 -38665 -52534 -32438
5912c2438K1013j0030J3345K3694q756k6958J9225J7956Q342J1499l4572n1299
$$ -32438 -11425 -21455 -8110 15584 6828 -20130 -905 17051 25393 36892 2320 -48979
5900d8979Q712K5999o30K2124p377k8022R650K0906J1796j1124J6312K9978j2742
$$ -48979 -40267 -14268 -14898 7226 -151 -28173 -18523 2383 14179 3055 19367 49345 36603
5887C6603l2273k4316l061j2450K7605K8786L93l6753k8899J4622J4297j4225
$$ 36603 4330 -19986 -23047 -35497 -7892 20894 21287 -15466 -44365 -29743 -15446 -29671
5875b9671k2753K5866J8913J8020j1108J939k6020Q271J7921J6214p715j4918
$$ -29671 -52424 -26558 -7645 10375 -733 1206 -24814 -16543 1378 17592 9877 -5041
5863e041L6255j025l4381j1397J2823k4044L545K479j6435o585O166K3384Q890
$$ -5041 31214 30189 -4192 -15589 -2766 -26810 -23265 -20786 -37221 -43806 -37640 -14256 -5366
5850e366j2000k684m683p196l153q987J8133K9529R189L763J0393J2975J1800
$$ -5366 -17366 -20050 -24733 -31929 -35082 -44069 -25936 3593 12782 16545 26938 39913 51713
5837E1713k4298j4150k6041j5665j077l605J091R536P371Q623J946K9637j4675
$$ 51713 27415 13265 -12776 -28441 -29518 -33123 -32032 -22496 -15125 -6502 -4556 25081 10406
5824A0406j5788k2948r105K8404J7684J1054p513l6582j7416l427J2937M89O305
$$ 10406 -5382 -28330 -37435 -9031 8653 19707 12194 -24388 -41804 -45231 -32294 -31805 -25500
5811b5500J5261j1344o874J7J7603l672n965k872J0378o830j6432K2284J8774
$$ -25500 -10239 -21583 -28457 -28440 -10837 -14509 -20474 -23346 -12968 -19798 -36230 -13946 4828
5798D828r026k3926J8773M1915J9304m8324o563P914J3993K1818l810m908k0476
$$ 4828 -4198 -28124 -9351 32564 51868 3544 -3019 4895 18888 40706 36896 31988 11512
5785A1512J597L096k2268j2219L555K2099j3697K4773M047l3551K1859o997k3870
$$ 11512 13109 16205 -6063 -18282 -14727 7372 -6325 18448 22495 -11056 10803 3806 -20064
5772b0064l539K58J8922l330K2641K7990R024k8904k0203o15K171q509K1058o850
$$ -20064 -23603 -23345 -4423 -7753 14888 42878 51902 22998 2795 2180 4351 -4158 16900 10050
5758A0050j5197j0597J3992J3540N572j0144j2172j6462k5075J1282P513K2611
$$ 10050 -5147 -15744 -1752 11788 17360 7216 -4956 -21418 -46493 -35211 -27698 -5087
5746e087M223K4719k392l1305k9854O025L2620k037k5033J0967J3241j7142J7419
$$ -5087 -864 23855 21463 -9842 -39696 -33671 -1051 -3088 -28121 -17154 -3913 -21055 -3636
5733c636K1509j0302Q227l655j4003l4163j8346m643k459L0690L0865K3728j7775
$$ -3636 17873 7571 15798 12143 -1860 -36023 -54369 -59012 -61471 -30781 84 23812 6037
5720F037j1963m0187L1220M6101L0391N434j3116n800J2498l3013l1267j2297
$$ 6037 -5926 -46113 -14893 31208 61599 67033 53917 48117 60615 27602 -3665 -15962
5708a5962J852J1952r820l552j5056J308j9665k0959j3724K4741L7931O071K299
$$ -15962 -14110 -2158 -11978 -15530 -30586 -29278 -48943 -69902 -83626 -58885 -20954 -14883 -12584
5695a2584l380K3481p219O26n021j7864j9721j8297j666p140J3478L9867J6219
$$ -12584 -15964 7517 298 924 -4097 -21961 -41682 -59979 -61645 -68785 -55307 -15440 779
5682G79j2646K5525L6831o00k1963m0738k7643j8677k4639J002K5451K3474L6943
$$ 779 -11867 13658 50489 49889 27926 -12812 -40455 -59132 -83771 -82769 -57318 -33844 3099
5669C099L5862m560k2879k5987k8163l1439j152J4853K9443R305k376J1140k577
$$ 3099 38961 34401 11522 -14465 -42628 -74067 -75219 -60366 -30923 -21618 -23994 -12854 -15431
5656a5431J3042K2752j0263j9632k3324n60J5008o74k9392j5617L0111M8213J5122
$$ -15431 -2389 20363 10100 -9532 -32856 -33416 -18408 -19082 -48474 -64091 -33980 14233 29355
5643B9355p885j613Q10r376j544j6373j4313L401j5200j4613J4129o2J0261J3368
$$ 29355 21470 19857 20667 11291 9747 -6626 -20939 -17538 -32738 -47351 -33222 -33284 -23023 -9655
5629i655J0975K7862L2804j7327l0583j4218n034K2430L6802K253l5675j4791
$$ -9655 1320 29182 61986 44659 14076 -142 -5176 17254 54056 56309 20634 5843
5617E843J4756m39j3811Pk2025r698N238j779m46J0015K1927l5195j2279k0483
$$ 5843 20599 20160 6349 6356 -15669 -25367 -20129 -21908 -22354 -12339 9588 -25607 -37886 -58369
5603e8369K0253N025j2432L4130J2316j1356K4657J6426J0245j4654n1941p556
$$ -58369 -38116 -33091 -45523 -11393 923 -10433 14224 30650 40895 26241 -25700 -33256
5591c3256K4606j2998n532J9820j8188J4041K5492J1302P057l9661p586R533J1826
$$ -33256 -8650 -21648 -27180 -7360 -25548 -11507 13985 25287 32344 -7317 -14903 -5370 6456
5578F456M9772N898o7159j0977J6284K801k011K2190j7150j5883J367N845j0152
$$ 6456 56228 62126 -5033 -16010 274 3075 1064 23254 6104 -9779 -8412 -2567 -12719
5565a2719O602k038J2299J1892n772j5579j7723L4657j027n753l5890j6828J9615
$$ -12719 -6117 -8155 4144 16036 10264 -5315 -23038 11619 10592 4839 -31051 -47879 -28264
5552b8264L6238Q178n914m889l2279J0632P511j1858J8544J2070J224j5181l7322
$$ -28264 7974 16152 10238 5349 -26930 -16298 -8787 -20645 -2101 9969 11193 -3988 -41310
5539d1310J0244J8190M7541R741q264n520k4613p133K3533J2699k0011j0010k0852
$$ -41310 -31066 -12876 34665 44406 36142 30622 6009 -1124 22409 35108 15097 5087 -15765
5526a5765k2970R452K000r643K7402J2720o399j6810k447K4461J3547J4012k750
$$ -15765 -38735 -29283 -27283 -36926 -9524 3196 -3203 -20013 -22460 2001 15548 29560 26810
5513B6810M429j3147j3691l6051j954o253P359O888j6847J2802l1743m3805N999
$$ 26810 31239 18092 4401 -31650 -33604 -39857 -32498 -25610 -42457 -29655 -61398 -105203 -99204
5500i9204N2752N4069K0656j6557j2367M983J1784q297j1226K1299L1143J883
$$ -99204 -46452 7617 28273 11716 -651 4332 16116 7819 -3407 17892 49035 50918
5488E0918M019k8380j8770m919K3016K8610j8285N31k6558r859o785j8132j6756
$$ 50918 54937 26557 7787 2868 25884 54494 36209 36740 10182 323 -6462 -24594 -41350
5475d1350k3865o277K5774J2452K2424J5430K5857L2699k6903l2683K64J9019
$$ -41350 -65215 -71492 -45718 -33266 -10842 4588 30445 63144 36241 3558 3822 22841
5463B2841k640m4509l10J0214o910R726N578M601K2647K5674K153k8084j5716
$$ 22841 20201 -24308 -24618 -14404 -21314 -11588 -6010 -1409 21238 46912 49065 20981 5265
5450E265j8323K702K691K1044k6565O326P279o704j1090J2047M734J603K486j8375
$$ 5265 -13058 -10356 -7665 13379 -13186 -6860 419 -6285 -17375 -5328 -594 1009 3495 -14880
5436a4880J8385j0677K8119P575J0682j3455j590j5196K0191K3015n994j7206
$$ -14880 3505 -7172 20947 28522 39204 25749 24159 8963 29154 52169 46175 28969
5424B8969j7674J1784l0000l0324j3042p339J2066M9974J1486N765r942j1750
$$ 28969 11295 23079 -6921 -37245 -50287 -57626 -45560 4414 15900 21665 11723 -27
5412b7R186k3319j5465j0887J8109M830l9035K48K1174J9838M083j3842J5673
$$ -27 9159 -14160 -29625 -40512 -22403 -17573 -56608 -56360 -35186 -15348 -11265 -25107 -9434
5399i434p528k5567J4138P802K954o493l747N7010q321L336j2508j3599k157L494
$$ -9434 -16962 -42529 -28391 -20589 -17635 -24128 -27875 29135 20814 24150 11642 -1957 -4114 -620
5385f20J3590j9142J1266K2949K3892n329l0974k5592l4702k4193J1302M0280
$$ -620 12970 -6172 5094 28043 51935 46606 15632 -9960 -44662 -68855 -57553 -17273
5373a7273K3291j0689R962M144l389O220J4257P656j6689k7277o458O162J5161
$$ -17273 6018 -4671 5291 9435 6046 12266 26523 34179 17490 -9787 -16245 -10083 5078
5360E078p759l075R753j3706r903l164m752j7316l0523J4977K0252J6012K2834
$$ 5078 -2681 -5756 3997 -9709 -19612 -22776 -27528 -44844 -75367 -60390 -40138 -24126 -1292
5347a292J5745o815m923R135q193K1369j1466l211j288j9787k8145k6441j6477
$$ -1292 14453 7638 2715 11850 3657 25026 13560 10349 9061 -10726 -38871 -65312 -81789
5334h1789j8105J2844j1784P835N4787P85m1790J5525K7612J0366j1695j1887
$$ -81789 -99894 -87050 -98834 -90999 -36212 -35427 -77217 -61692 -34080 -23714 -35409 -47296
5322d7296J7632J7120j6469L0484J9668j6497k1547J1593j866N631K3203J8264
$$ -47296 -29664 -12544 -29013 1471 21139 4642 -16905 -5312 -7178 -1547 21656 39920
5310C9920j9869o849n14j3535k9409j2031k1709L0645M212O544j296j209J0053
$$ 39920 20051 13202 12688 -847 -30256 -42287 -63996 -33351 -29139 -22595 -23891 -25100 -15047
5297a5047J4043n328k652r543M148k9069K1224m862L401J8300k9044K0873M0152
$$ -15047 -1004 -6332 -8984 -18527 -14379 -43448 -22224 -27086 -23685 -5385 -34429 -13556 26596
5284B6596J6899j4667k4828o777j1135J0017K0527k181k266j426J503l804J2371
$$ 26596 43495 28828 4000 -2777 -13912 -3895 16632 14451 12185 10759 12262 8458 20829
5271B0829N353m35k168p859j7835l2727k834L949j650R230P121r30m720L039N467
$$ 20829 26182 25747 23579 15720 -2115 -34842 -37676 -33727 -35377 -26147 -19026 -19956 -24676 -21637 -16170
5256a6170O735j400J0770j5808J3822j4154M912L73k1904j4165K352J9939O688
$$ -16170 -9435 -10835 -65 -15873 -2051 -16205 -11293 -10920 -32824 -46989 -44637 -24698 -18010
5243a8010J1091p321K0025K5777O327J4641k7057j1186p183j4881p476o832R517
$$ -18010 -6919 -14240 5785 31562 37889 52530 25473 14287 7104 -7777 -15253 -22085 -12568
5230a2568K6613r216j3777J0046k307j3522J0179j2389J5298J8061K0454n047
$$ -12568 14045 4829 -8948 1098 -1209 -14731 -4552 -16941 -1643 16418 36872 31825
5218C1825j4707m0271K0610K4709j4599j21K600m729k2779o765O34k0687J3166
$$ 31825 17118 -23153 -2543 22166 7567 7446 10046 5317 -17462 -24227 -23593 -44280 -31114
5205c1114K7952J3750j0676o023P550K3819p773J971r848J064K0121L252l9388
$$ -31114 -3162 10588 -88 -6111 1439 25258 17485 19456 9608 10672 30793 34045 -5343
5192e343j9720j6001K661m073K1947L1735J4916k0517L750j925k632N38N288J4331
$$ -5343 -25063 -41064 -38403 -42476 -20529 11206 26122 5605 9355 7430 4798 5336 10624 24955
5178B4955k217k8187q330K1086L0666q278l1193j2634k335J5298K0258o68n970
$$ 24955 22738 -5449 -13779 7307 37973 29695 -1498 -14132 -16467 -1169 19089 18421 12451
5165A2451j6015J2772L114k8453j0821K6631K146J1347n579j4425k3434k7885
$$ 12451 -3564 9208 12322 -16131 -26952 -321 1825 13172 7593 -6832 -30266 -58151
5153e8151p365J6566M2675L5995j8990k3941J1360P27j7021n394K2851j133n955
$$ -58151 -65516 -48950 -6275 29720 10730 -13211 -1851 -1124 -18145 -23539 -688 -1821 -7776
5140g776q573K0902J6301p265L518L2442N001j4929M598J3191j9983P799K354
$$ -7776 -16349 4553 20854 13589 17107 49549 54550 39621 44219 57410 37427 45226 47580
5127D7580j8582m0454l498m947k170j7099k1678q726J3431J7384k4375j3329J185
$$ 47580 28998 -11456 -14954 -19901 -22071 -39170 -60848 -69574 -56143 -38759 -63134 -76463 -75278
5114g5278M70N716K3551K5930J4904J9526j7921j7508Q369R391j3309K0169k2230
$$ -75278 -74808 -69092 -45541 -19611 -4707 14819 -3102 -20610 -12241 -2850 -16159 4010 -18220
5101a8220j4917o140K679M108j074J6429L808k0954J4221K0547J3253o781j1188
$$ -18220 -33137 -39277 -36598 -32490 -33564 -17135 -13327 -34281 -20060 487 13740 6959 -4229
5088d229K7570L027j2712Q206o957k8570j4921O488k9056K611K1242q732J6992
$$ -4229 23341 26368 13656 21862 14905 -13665 -28586 -22098 -51154 -48543 -27301 -36033 -19041
$$ [...]
##END NTUPLES=NMR SPECTRUM
##END=
