##TITLE=Analysis number 325223
Compound Code spb 06290
Project Code adrs
Chemist Name aci
##JCAMPDX= 6.0         $$ Bruker NMR JCAMP-DX V2.0
##DATA TYPE= NMR SPECTRUM
##DATA CLASS= NTUPLES
##ORIGIN= Bruker BioSpin GmbH
##OWNER= nmr
$$ XWIN-NMR		Version 3.5
$$ Thu Dec 14 15:08:12 2006 GMT Standard Time (UT+0h)  MAYBRIDGE\nmr@NMR_250MHZ
##.OBSERVE FREQUENCY= 250.131544655141
##.OBSERVE NUCLEUS= ^1H
##.ACQUISITION MODE= SIMULTANEOUS (DQD)
##.ACQUISITION SCHEME= undefined
##.AVERAGES= 16
##.DIGITISER RES= 18
##SPECTROMETER/DATA SYSTEM= dpx250
##.PULSE SEQUENCE= zg30
##.SOLVENT NAME= CDCl3
##.SHIFT REFERENCE= (INTERNAL, CDCl3, 0, 16.5322)
##AUDIT TRAIL= $$ (NUMBER, WHEN, WHO, WHERE, WHAT)
$$ ##TITLE= Audit trail, XWIN-NMR		Version 3.5
$$ ##JCAMPDX= 5.01
$$ ##ORIGIN= Bruker BioSpin GmbH
$$ ##OWNER= nmr
$$ C:\u/data/dgb/nmr/ADRS/1600/pdata/1/auditp.txt
$$ ##AUDIT TRAIL=  $$ (NUMBER, WHEN, WHO, WHERE, WHAT)
(   1,<2006-12-14 15:07:52.67 +000>,<MAYBRIDGE\nmr>,<NMR_250MHZ>,
      <created by zg, POWCHK disabled, PULCHK disabled
       configuration hash MD5:
       49 4B E0 1D 92 C2 6B 37 9F E6 65 BC 52 41 86 1D
       data hash MD5: 64K
       04 D0 86 BE 76 EA E7 EA B6 B4 15 48 D8 D7 C4 CD>)
(   2,<2006-12-14 15:08:03.89 +000>,<MAYBRIDGE\nmr>,<NMR_250MHZ>,
      <Start of raw data processing
       ef LB = 0.3 FT_mod = 6 PKNL = 1 SI = 32K 
       data hash MD5: 32K
       39 18 75 AF 45 17 D4 D8 99 24 D7 3D 96 3A AA 46>)
(   3,<2006-12-14 15:08:05.50 +000>,<MAYBRIDGE\nmr>,<NMR_250MHZ>,
      <apk 
       data hash MD5: 32K
       CC 30 71 05 98 D7 67 9F 89 01 3B CF 84 4C C3 71>)
(   4,<2006-12-14 15:08:06.17 +000>,<MAYBRIDGE\nmr>,<NMR_250MHZ>,
      <abs ABSG = 5 
       data hash MD5: 32K
       77 5E 33 77 D3 19 68 6E B3 40 5F 9E 38 96 77 21>)
$$ ##END=
$$ 
$$ hash MD5
$$ 42 43 7B 54 D0 68 09 D9 FE EF 74 7E 91 B9 6F 77
##$RELAX= 
##$RELAX= 
##$RELAX= 
##$RELAX= 
##$RELAX= 
##$RELAX= 
##$RELAX= 
$$ Bruker specific parameters
$$ --------------------------
##$DU= <C:\u>
##$EXPNO= 1600
##$NAME= <ADRS>
##$PROCNO= 1
##$TYPE= <nmr>
##$USER= <dgb>
##$AMP= (0..31)
100 100 100 100 100 100 100 100 100 100 100 100 100 100 100 100 100 100 
100 100 100 100 100 100 100 100 100 100 100 100 100 100 
##$AQSEQ= 0
##$AQ_mod= 3
##$AUNM= <au_zg>
##$AUTOPOS= <25 >
##$BF1= 250.13
##$BF2= 250.13
##$BF3= 250.13
##$BF4= 250.13
##$BF5= 500.13
##$BF6= 500.13
##$BF7= 500.13
##$BF8= 500.13
##$BYTORDA= 1
##$CFDGTYP= 0
##$CFRGTYP= 5
##$CHEMSTR= <none>
##$CNST= (0..31)
1 1 145 1 1 1 1 1 1 1 1 1 1 1 1 1 1 1 1 1 1 1 1 1 1 1 1 1 1 1 1 1 
##$CPDPRG= <>
##$CPDPRG1= <>
##$CPDPRG2= <>
##$CPDPRG3= <>
##$CPDPRG4= <mlev>
##$CPDPRG5= <mlev>
##$CPDPRG6= <mlev>
##$CPDPRG7= <mlev>
##$CPDPRG8= <mlev>
##$CPDPRGB= <>
##$CPDPRGT= <>
##$D= (0..31)
0 1 0 0 0 0 0 0 0 0.06 0 0 0 0 0 0 0.0002 0 0 0 0 0 0 0 0 0 0 0 0 0 0 
0 
##$DATE= 1166108871
##$DBL= (0..7)
120 120 120 120 120 120 120 120 
##$DBP= (0..7)
150 150 150 150 150 150 150 150 
##$DBP07= 0
##$DBPNAM0= <>
##$DBPNAM1= <>
##$DBPNAM2= <>
$$ [...]
##$SUBNAM7= <"">
##$SUBNAM8= <"">
##$SUBNAM9= <"">
##$SW= 20.6930455092707
##$SWIBOX= (0..15)
0 0 3 0 0 0 0 0 0 0 0 0 0 0 0 0 
##$SW_h= 5175.983436853
##$TD= 65536
##$TD0= 1
##$TE= 295.16
##$TE2= 300
##$TE3= 300
##$TEG= 300
##$TL= (0..7)
0 120 120 120 120 120 120 120 
##$TP= (0..7)
150 150 150 150 150 150 150 150 
##$TP07= 0
##$TPNAME0= <>
##$TPNAME1= <>
##$TPNAME2= <>
##$TPNAME3= <>
##$TPNAME4= <>
##$TPNAME5= <>
##$TPNAME6= <>
##$TPNAME7= <>
##$TPOAL= (0..7)
0.5 0.5 0.5 0.5 0.5 0.5 0.5 0.5 
##$TPOFFS= (0..7)
0 0 0 0 0 0 0 0 
##$TUNHIN= 0
##$TUNHOUT= 0
##$TUNXOUT= 0
##$USERA1= <user>
##$USERA2= <user>
##$USERA3= <user>
##$USERA4= <user>
##$USERA5= <user>
##$V9= 5
##$VALIST= <valist>
##$VCLIST= <CCCCCCCCCCCCCCC>
##$VD= 0
##$VDLIST= <DDDDDDDDDDDDDDD>
##$VPLIST= <PPPPPPPPPPPPPPP>
##$VTLIST= <TTTTTTTTTTTTTTT>
##$WBST= 1024
##$WBSW= 4
##$XGAIN= (0..3)
0 0 0 0 
##$XL= 0
##$YL= 0
##$YMAX_a= 350207
##$YMIN_a= -348329
##$ZGOPTNS= <>
##$ZL1= 120
##$ZL2= 120
##$ZL3= 120
##$ZL4= 120
##$ABSF1= 16.53217
##$ABSF2= -4.161005
##$ABSG= 5
##$ABSL= 3
##$ALPHA= 0
##$AQORDER= 0
##$ASSFAC= 0
##$ASSFACI= 0
##$ASSFACX= 0
##$ASSWID= 0
##$AUNMP= <proc_1d>
##$AZFE= 0.1
##$AZFW= 0.1
##$BCFW= 0
##$BC_mod= 0
##$BYTORDP= 0
##$COROFFS= 0
##$CY= 12.5
##$DATMOD= 1
##$DC= 0
##$DFILT= <>
##$DTYPP= 0
##$F1P= 14.0000005364418
##$F2P= -0.99999901652339
##$FCOR= 0.5
##$FTSIZE= 32768
##$FT_mod= 6
##$GAMMA= 0
##$GB= 0
##$INTBC= 1
##$INTSCL= 1
##$ISEN= 128
##$LB= 0.3
##$LEV0= 0
##$LPBIN= 0
##$MAXI= 10000
##$MC2= 0
##$MEAN= 0
##$ME_mod= 0
##$MI= 0
##$NCOEF= 0
##$NC_proc= -3
##$NLEV= 6
##$NOISF1= 0
##$NOISF2= 0
##$NSP= 0
##$NTH_PI= 0
##$NZP= 0
##$OFFSET= 16.53217
##$PC= 1
##$PHC0= 222.7053
##$PHC1= 9.006759
##$PH_mod= 1
##$PKNL= yes
##$PPARMOD= 0
##$PSCAL= 4
##$PSIGN= 0
##$REVERSE= no
##$SF= 250.129997454811
##$SI= 32768
##$SIGF1= 0
##$SIGF2= 0
##$SINO= 400
##$SIOLD= 32768
##$SREGLST= <1H.CDCl3>
##$SSB= 0
##$STSI= 32768
##$STSR= 0
##$SW_p= 5175.98343685301
##$SYMM= 0
##$S_DEV= 0
##$TDeff= 65536
##$TDoff= 0
##$TI= <Analysis number 999999
Compound Code 99
Book Reference 9
Project Code 9>
##$TILT= no
##$TM1= 0
##$TM2= 0
##$TOPLEV= 0
##$USERP1= <user>
##$USERP2= <user>
##$USERP3= <user>
##$USERP4= <user>
##$USERP5= <user>
##$WDW= 1
##$XDIM= 32768
##$YMAX_p= 462083380
##$YMIN_p= -131359
$$ End of Bruker specific parameters
$$ ---------------------------------
##NTUPLES= NMR SPECTRUM
##VAR_NAME=  FREQUENCY,     SPECTRUM/REAL,   SPECTRUM/IMAG
##SYMBOL=    X,             R,               I
##VAR_TYPE=  INDEPENDENT,   DEPENDENT,       DEPENDENT
##VAR_FORM=  AFFN,          ASDF,            ASDF
##VAR_DIM=   32768,         32768,           32768
##UNITS=     HZ,            ARBITRARY UNITS, ARBITRARY UNITS
##FACTOR=    0.157963299565203, 1,           1
##FIRST=     4135.19147544722, 0,            0
##LAST=      -1040.79196140579, 0,           0
##MIN=       -1040.79196140579, -131359,     0
##MAX=       4135.19147544722, 462083380,    0
$$ Real data points
##PAGE= N=1
##DATA TABLE= (X++(R..R)), XYDATA
$$ [...]
16754c9671K649K5673M6994K405l2910J174R594J636l2387j8066j9439J8001J7972
16741a6375n986M571K3528P763L6245n253n102n3358j3637M214j0637k1488L869
16728e1646J7918M1594K6818j2815l4581j1613N1543J9201q432j1209l024K4701
16716D8455j7710j8878M848J3207j9596r350J0818k1234m1040k772J6207j881
16704c8926q340K7653K4656J0228P826R995k5309l7593j2586L9011J9986J7717
16692C4318N007k5880r830J1019Q379j0890k8080P902J6227j6895K6216m189l0895
16679a7591J3296L6892L3772j0595m489k8574j9391k2757J1177j0930Q055K0667
16667I532j4522l3850K3034L0964k368m6730m2802K2077K9377j1845k286l3102
$$ plain form
16754 -39671 -37022 -11349 35645 38050 5140 6314 15908 17544 -14843 -32909 -52348 -34347 -16375
16741 -16375 -22361 -17790 5738 13501 49746 44493 39391 -13967 -27604 -23390 -34027 -55515 -51646
16728 -51646 -33728 7866 34684 21869 -12712 -24325 27218 46419 37987 26778 23754 48455
16716 48455 30745 11867 16715 29922 10326 976 11794 -9440 -50480 -53252 -37045 -38926
16704 -38926 -47266 -19613 5043 15271 23097 33092 7783 -29810 -42396 -3385 16601 34318
16692 34318 39325 13445 3615 14634 23013 12123 -15957 -8055 8172 -8723 17493 13304 -17591
16679 -17591 -4295 32597 66369 55774 51285 22711 3320 -19437 -8260 -19190 -11135 9532
16667 9532 -4990 -38840 -15806 15158 12790 -33940 -76742 -54665 -25288 -37133 -39419 -72521
16655g2521j7682K9538O382K0685L5583o32r869M844j0746j1664l2130L910L2172
16642b2130N635p897J7639R727j7063J5888N373o960k434j6468p550M9422J558
16629B4740j8307k1674J3482o91n087j3068R836K2337l710r384m0272j3727O590
16616d8935J2095r069J2897M7352O786l7359Q005L8744m063l4123L731K5557j8918
16603B700k8356K0480J0140k74k8420M957K5251j0122r244Q165J1644j1548J496
16590c131J339j4651L0692R832k7468j4012q97l241K4472R521J9267k8491m3903
16577d0671J8527K2556K4662O41l2547k268N151l1116l4476J7210J5502K4868
16565a1961N193M506m709O513J5124M390m833k456k242k0517j331j0440k757J3155
$$ plain form
16655 -72521 -90203 -60665 -54283 -33598 1985 1353 -8516 -3672 -14418 -26082 -58212 -54302 -22130
16642 -22130 -16495 -24392 -6753 2974 -14089 1799 7172 212 -2222 -18690 -26240 23182 24740
16629 24740 6433 -15241 -1759 -2450 -7537 -20605 -10769 11568 7858 -1526 -41798 -55525 -48935
16616 -48935 -36840 -45909 -33012 14340 21126 -16233 -8228 30516 26453 -7670 -3939 21618 2700
16603 2700 -25656 -5176 4964 4690 -23730 -18773 6478 -3644 -12888 -4723 6921 -4627 -3131
16590 -3131 -1792 -16443 14249 24081 -3387 -17399 -18296 -21537 2935 12456 31723 3232 -40671
16577 -40671 -22144 412 25074 25715 -6832 -9100 -3949 -35065 -69541 -52331 -36829 -11961
16565 -11961 -6768 -2262 -6971 -458 14666 19056 14223 11767 9525 -10992 -12323 -22763 -25520 -12365
16551a2365j7915l4318J8218M8763J9709J2710K910n1824j7949K7270K6727k0795
16539A141p085J2197p182l501r960j7906P74J0909O899K4926K9385k6493j1836
16526B268J7732O168K9328Q720R444L8162k8656k6091n905j9487J7202j3368j8255
16513A7262J9646K7000q211j7009M496j2697M624j4102O309k1042j5434R331J2704
16500A2877j2530J0406j9492M590J0257j5501j1341j1806J5192j2746J3557P797
16488h740j1137O29K7783O375J5627k1501k3695J2818P634J1051J0812K773N890
16475C6319k0668j6743k025k2210j5658j027Q957K4598J073J2177Q359j2948J6933
16462A7137J9893q943j4338J388j6290j5613K842j6222q786p550K8902j0896o575
$$ plain form
16551 -12365 -30280 -64598 -46380 2383 22092 34802 37712 -14112 -32061 -4791 21936 1141
16539 1141 -5944 6253 -929 -4430 -14390 -32296 -31522 -20613 -13714 11212 40597 14104 2268
16526 2268 20000 26168 55496 64216 73660 111822 83166 57075 51170 31683 48885 35517 17262
16513 17262 36908 63908 55697 38688 43184 30487 35111 21009 27318 6276 -9158 173 12877
16500 12877 347 10753 -8739 -4149 6108 -9393 -20734 -32540 -17348 -30094 -16537 -8740
16488 -8740 -19877 -19248 8535 14910 30537 9036 -14659 -1841 5793 16844 27656 30429 36319
16475 36319 15651 -1092 -3117 -25327 -40985 -42012 -33055 -8457 -7384 4793 13152 204 17137
16462 17137 37030 28087 13749 15137 -1153 -16766 -13924 -30146 -38932 -46482 -17580 -28476 -35051
16449c5051L2931J8813J4333n60r487n632o540k6403J1083j184k0151M189n596
16436b9255P292n053P673J5979J3630k9037k6842k2454K4528L9754J9696j7343
16424a432r549J598J3279J0006j3972K2138K4295n961k9099j0305Q158K0214j0257
16411A9113j1652L30k3852j9983K5416J2422J6629k0345r540l169J62Q109Q160
16398A800p559q855J9994K18j7441j3714j9163m677J4534L6454J3421l4268L933
16385a5323K7543J0450k3016j1596O545J9220K7482j1074j347J0305J11q70j6318
16372B2112J6621K5322j3605k2674q753K629L706l552J1794R35l4323j7547p526
16359b4861k1893P882J317q375J3352j089O511K0720j9929N671O017j2511J8108
$$ plain form
16449 -35051 -2120 16693 31026 30466 20979 15347 8807 -17596 -6513 -7697 -27848 -23659 -29255
16436 -29255 -21963 -27016 -19343 -3364 10266 -18771 -45613 -68067 -43539 -3785 15911 -1432
16424 -1432 -10981 -9383 3896 13902 -70 22068 46363 40402 11303 998 9156 29370 19113
16411 19113 7461 7791 -16061 -36044 -10628 1794 18423 -1922 -11462 -14631 -14469 -6360 1800
16398 1800 -5759 -14614 5380 5598 -11843 -25557 -44720 -49397 -34863 1591 15012 -19256 -15323
16385 -15323 12220 22670 -346 -11942 -5397 13823 41305 30231 28884 39189 39300 38430 22112
16372 22112 38733 64055 50450 27776 19023 21652 25358 21806 33600 34535 212 -17335 -24861
16359 -24861 -46754 -38872 -37555 -45930 -32578 -33667 -27156 -6436 -26365 -20694 -14677 -27188 -9080
16346i080P225l7142j1210K9122J9153J1352J0482j4685k274O005J6588k5054
16334D82l100j8181l0296m531j7990m657M541J4766P531K8614J4900m157K225
16321i853Q071k8045J7695K3160l971O390r682m2334j8836J2L5622M8443J3176
16308C9848L582l1766l1501Q808J7392K0858N068n7148l5117K1831J5419j5428
16296c8154J3260j1293k4302J0725Q58p338K148M8542K7761P468K4676J4339p017
16283F1673l4081k2430P211j1144n284l108J3540j2588J4218J1985k0678j3672
16271a4358j7090Q962o127J3037o860k7841n3765j8790N0357L6859k6801j6789
16259g9206Q629M0893K2181L339J1649K6642k6324k3745R511r115K197P70N010
$$ plain form
16346 -9080 -1855 -38997 -50207 -21085 -1932 9420 19902 5217 2943 8948 25536 482
16334 482 -2618 -20799 -51095 -55626 -73616 -78273 -73732 -58966 -51435 -22821 -7921 -12078 -9853
16321 -9853 -1782 -29827 -12132 11028 7057 13447 3765 -38569 -57405 -57393 -21771 26672 39848
16308 39848 43430 11664 -19837 -11029 6363 27221 32289 -24859 -59976 -38145 -22726 -38154
16296 -38154 -24894 -36187 -60489 -49764 -48906 -56244 -54096 -5554 22207 29675 54351 68690 61673
16283 61673 27592 5162 12373 1229 -4055 -7163 6377 -6211 8007 19992 -686 -14358
16271 -14358 -31448 -22486 -28613 -15576 -22436 -50277 -104042 -122832 -72475 -35616 -62417 -79206
16259 -79206 -70577 -29684 -7503 -4164 7485 34127 7803 -15942 -6431 -15546 -13349 -12579 -7569
16246g569N236j1711l202K4195l371M9464K6499j2336k1651l2912j9922O886j0648
16233a1042J500p579l1273n0444O900M0661j0761l398K9049J4616R261O359J1712
16220E561R987J2549n347l0144k173O090J1190k8638L198L878p604j71L355J0211
16206h058K4268J7187j0993n0595k2611K6559j2278J3272K5332m155p31K3089
16194B0286k6544m2189J3334N2753J6409k374K0376j210m5714l072Q832l1635
16182b0748j6122o041K0318K5126j6342j7790k5999l70l909K3150Q635o242j2802
16169d9136J5062J362K0748k491J5723K6942p742k7596R8J7126K8790k0910n326
16156A2650Q402j3823k012j6500Q29N171l185M923k7071j9055M885K758L5356
$$ plain form
16246 -7569 -2333 -14044 -17246 6949 3578 53042 79541 67205 45554 12642 -7280 -394 -11042
16233 -11042 -9542 -17121 -48394 -98838 -91938 -51277 -62038 -65436 -36387 -21771 -12510 -6151 5561
16220 5561 15548 28097 22750 -7394 -9567 -3477 7713 -20925 -17727 -13849 -21453 -21624 -18269 -8058
16206 -8058 16210 33397 22404 -28191 -50802 -24243 -36521 -23249 2083 -2072 -2803 20286
16194 20286 -6258 -48447 -35113 17640 34049 31675 52051 50841 5127 2055 10887 -20748
16182 -20748 -36870 -42911 -22593 2533 -13809 -31599 -57598 -57968 -61877 -38727 -30092 -36334 -49136
16169 -49136 -34074 -32712 -11964 -14455 1268 28210 20468 -7128 -7030 10096 38886 17976 12650
16156 12650 21052 7229 5217 -11283 -10454 -5283 -8468 -3545 -30616 -49671 -44786 -42028 -6672
16143f672L0141j8924q440J0113k8977l6018L054J9407K9598N351L574r142M685
16130b250r068O327J672j8046j4561K9433k068j6278o132J930j5035J5826K2269
16117e981R650L719L200r970Q756K0975j1140o925J490j0590p071J3227J1895
16104B1235l9391k4506K0963j7151O967P958J4046J2438R662J1286p027k623p941
16091E916L592k3433Q829m24j9457P814J2297r951k1452K8349J0261L251M439
16078A0031l218j5569o7J3495l1404J7692L1744J8579N342j6905j2938j6762l297
16065c277K434l048k115j6003k5502j1194n553O295J3485L4077K451l9249k5744
16052g2943L8857K291q737p38k143N74K556L3489K6357k297k1631N817K1179p523
$$ plain form
16143 -6672 23469 4545 -3895 6218 -22759 -58777 -55723 -36316 -6718 -1367 2207 -6935 -2250
16130 -2250 -11318 -4991 -3319 -21365 -35926 -6493 -8561 -24839 -30971 -29041 -44076 -28250 -5981
16117 -5981 3669 7388 10588 618 9374 30349 19209 12284 13774 3184 -3887 9340 21235
16104 21235 -18156 -42662 -21699 -38850 -31883 -23925 -9879 2559 12221 23507 16480 13857 5916
16091 5916 9508 -13925 -5096 -5520 -24977 -17163 -4866 -14817 -36269 -7920 2341 5592 10031
16078 10031 6813 -8756 -8823 4672 -26732 -9040 22704 41283 46625 29720 16782 20 -3277
16065 -3277 -843 -3891 -6006 -22009 -47511 -58705 -64258 -57963 -44478 -10401 -7950 -47199 -72943
16052 -72943 -34086 -31795 -40532 -41270 -43413 -42839 -40283 -6794 19563 17266 -4365 1452 22631 15108
16038A5108k0195l5782n908k795J5673j2040l785P640O910K3816L2565J6648J9119
16025E6974j0994k0865n3277k7098M102L7468K0443K1589k396l6864k0544l3174
16013f4636K2415K5491M5286n606k4281K138L2508J2023L885k0549L386J1764
16001D3824n168k0457q786j4756j2598j1591J591J1626k0643j0508L5688J5540
15989C762k3419k626l985L597j48J0301J4249K3204J0722Q403m540p715k7632
15976D173m9850K0265L7816L5265j3056l6900j119K2000J5634R950j2445k4846
15964F887O323L7886k0508k8615J939M434k5699j3482P972O110K1276R124j3098
15951E49l4090L8077N0820j1774J3396N070j2326l6349j3189J0553L6885J6388
$$ plain form
16038 15108 -5087 -40869 -46777 -49572 -33899 -45939 -49724 -42084 -35174 -11358 21207 37855 56974
16025 56974 45980 25115 -28162 -55260 -51158 -13690 6753 28342 25946 -10918 -31462 -64636
16013 -64636 -42221 -16730 28556 22950 -1331 807 33315 45338 49223 28674 32060 43824
16001 43824 38656 18199 9413 -5343 -17941 -29532 -27941 -16315 -36958 -47466 -11778 3762
15989 3762 -19657 -22283 -26268 -22671 -22819 -12518 1731 24935 35657 44060 39520 31805 4173
15976 4173 -45677 -25412 12404 47669 34613 -2287 -3406 18594 34228 44178 31733 6887
15964 6887 13210 51096 30588 1973 3912 8346 -17353 -30835 -22863 -16753 4523 13647 549
15951 549 -33541 4536 55356 43582 56978 62048 49722 13373 184 10737 47622 64010
15939F4010j3003k046O277k407r382n9088m001L801J1143j7516j6163K3465j6326
15926c1236N581K5723R443l420K80N472j6228j0446M167j0995L2407K2147j0575
15913B2320Q420m568j5932n23K48m893J1693j4114k4663L017k731n231L2274N250
15899A0567l2281P845k1349J755K9556q43j2081j4666J3683R169P160Q407K8796
15886C5718k7170p266L5554K7089k7521j7493j0168j5572p7P869K6071J8907k3978
15873B1963k8584j7837J0199k478k7284q612n096K2503o340M969O704L7488J6401
15860B3996p878l0165l729R918k4039R220K1394M281L577k6659k1725J4013K8601
15847H05j4515l7677j0876J8701M3486J808k360j9330l928R429K4163J3803r460
$$ plain form
15939 64010 51007 48961 55238 52831 43449 -15639 -19640 -15839 -4696 -22212 -38375 -14910 -31236
15926 -31236 -25655 68 9511 6091 6371 11843 -4385 -14831 -10664 -21659 10748 32895 22320
15913 22320 30740 26172 10240 9717 9965 5072 16765 2651 -22012 -18995 -21726 -26957 5317 10567
15899 10567 -21714 -13869 -35218 -33463 -3907 -4750 -16831 -31497 -17814 -8645 -1485 6922 35718
15886 35718 8548 1282 36836 63925 36404 18911 8743 -6829 -6906 963 27034 45941 21963
15873 21963 -6621 -24458 -14259 -16737 -44021 -52633 -57729 -35226 -41566 -36597 -29893 7595 23996
15860 23996 16118 -14047 -17776 -7858 -31897 -22677 -1283 2998 6575 -20084 -41809 -27796 805
15847 805 -13710 -51387 -62263 -43562 -76 1732 -628 -19958 -23886 -14457 9706 23509 14049
15834A4049k8131q840m463M166J0757J3517k581l5843L0605K2788K7102R397l2392
15821B0131j8023q403j2094O743L6119m974j8853O670Q090J6077K6105q811k3385
15808B5392o867J100J3290R37k1488j0965J8389o875N871L22j9993Q087j2672
15795e472o970o918N1608J4917k7723j0083k0140m465l398m62j1449J8074J8448
15782E967J0477K2551L888j5355j3459k6338j6576J3678n571n466L259o421K291
15769b7075K0812l2426m236L0195Q23l3069q866K7253R51j3032q317q360J4294
15756d1053J2039n253o757L8181K4303l296j4075k0708K7450J5066j1769k2503
15744h375R738k0990R46K0992K9678k2238N41R107j3164r668k7890J0702j8354
$$ plain form
15834 14049 -14082 -22922 -27385 -23219 -12462 1055 -1526 -37369 -6764 16024 43126 52523 20131
15821 20131 2108 -6295 -18389 -11646 24473 19499 646 7316 15406 31483 57588 48777 25392
15808 25392 18525 19625 32915 33852 12364 1399 19788 12913 18784 19106 -887 7200 -5472
15795 -5472 -12442 -19360 32248 47165 19442 9359 -10781 -15246 -18644 -19106 -30555 -12481 5967
15782 5967 16444 38995 42883 27528 14069 -12269 -28845 -15167 -20738 -26204 -22945 -29366 -27075
15769 -27075 -6263 -38689 -42925 -12730 -11907 -44976 -53842 -26589 -25638 -38670 -46987 -55347 -41053
15756 -41053 -29014 -34267 -41024 -2843 21460 18164 4089 -16619 10831 25897 14128 -8375
15744 -8375 1363 -19627 -18681 2311 31989 9751 10292 19399 6235 -3433 -31323 -20621 -38975
15731c8975k1469J8190J9747l353o337J042l1304r08J4790K1219J8695j3137j6853
15718c8653P130K2390m146J2827K5913k1907k8034k459J2505K5488Q614j740p945
15705I983m964j0167j5360J3204K303K2099R764k8552l694j6047n643r6j1145
15692c8315O94K864q057J3972K4246j826j9435M3821J3005j1441j3404j4919j0047
15679a8842j3618k3310p071K6639l589Q802j1785K2692K6516l0429M929L2967
15667A3901j6416m345J1933l500k2069K422R172K9216k531P41j5796M020j5456
15654h708q127M714J6186L9665k2508n6154j5350O215O904j6476j7560J4381L8873
15641a7945M9098j7781l1949P379J5285k4127j6372j5412K9853N85j1290k0016
$$ plain form
15731 -38975 -60444 -42254 -22507 -25860 -32197 -31155 -62459 -63367 -48577 -27358 -8663 -21800 -38653
15718 -38653 -31523 -9133 -13279 -452 25461 3554 -24480 -26939 -14434 11054 19668 17928 9983
15705 9983 5019 -5148 -20508 -7304 -5001 17098 26862 -1690 -5384 -21431 -27074 -27170 -38315
15692 -38315 -37621 -34757 -42814 -28842 -4596 -6422 -25857 17964 30969 19528 6124 -8795 -18842
15679 -18842 -32460 -55770 -62841 -36202 -39791 -30989 -42774 -20082 6434 -23995 -19066 13901
15667 13901 -2515 -6860 5073 1573 -20496 -18074 -8902 20314 17783 18524 2728 6748 -8708
15654 -8708 -16835 -12121 4065 43730 21222 -34932 -50282 -44067 -37163 -53639 -71199 -56818 -17945
15641 -17945 31153 13372 -18577 -11198 4087 -20040 -36412 -51824 -21971 -21386 -32676 -52692
15629e2692L1440K5809k691J0241k4715J5102P768Q16k396K065L4420J8895l0084
15616C3978m3382k4500j497J0965M0272K6057r774l3953J0183J5720K596j310
15604B5355k5242N175m8934m3124Q075L5806K2860l858p451p104P277J1070o879
15591b6974R574M315n49Q54m92K536K275J7151j2961n4128j3148J9859J7804J8433
15577a5451j620L38K1293J9986J7367k4108k4107l3401L663o442L1462N679n674
15564a1015K217Q794J1696j9307K336J4918n693k625k6002j333J4529K7460r397
15551F578k0011j1065j4681k8081K9236K5515j3558k6856J7899L0519L2004j9841
15539G658k2108M55j0696q261J2527j0745O397J8628j1477n187Q024Q148q649
$$ plain form
15629 -52692 -21252 4557 1866 12107 -12608 2494 10262 11078 8682 10747 45167 64062 33978
15616 33978 -9404 -33904 -35401 -24436 15836 41893 32119 -1834 8349 24069 26665 25355
15604 25355 113 5288 -43646 -86770 -78695 -42889 -20029 -23887 -31338 -38442 -31165 -20095 -26974
15591 -26974 -17400 -13085 -13634 -12780 -13272 -10736 -8461 8690 -4271 -58399 -71547 -51688 -33884 -15451
15577 -15451 -17071 -16733 4560 24546 41913 17805 -6302 -39703 -36040 -42482 -11020 -5341 -11015
15564 -11015 -8798 -4 11692 -7615 -5279 9639 3946 1321 -24681 -26014 -11485 15975 6578
15551 6578 -13433 -24498 -39179 -67260 -38024 -12509 -26067 -52923 -35024 -4505 27499 7658
15539 7658 -14450 -13995 -24691 -32952 -20425 -31170 -24773 -6145 -17622 -22809 -14785 -6637 -15286
15526a5286J8996k3043j5814M1351O168j0347k634j4487K6414J4214k2561j2060
15514i089L957k4239J1383K8663J3810m148o782j2596M495L723M032J1105R945
15501C4259l1633q074l125j366L5571M633j067R884k0793n843K834k2209L061
15488c868k8K1051R014j1816n455k9900k3455K983q949j4494L704J1662K8520
15475b1031Q260K171M871J8212J8439J5938k7623k7823K6111K5007J1106k1863
15463C1775n3085n463K4010PK4524J5320P459M667j2613J937j5679m2271J1751
15450g661K1109j2373j3015q819j4949J1868J0945J3282j5240j2009J760M147
15438b0955J6230J1094p36j8747k6196k59L1638K6257m254L359j6022j2914J2357
$$ plain form
15526 -15286 3710 -19333 -35147 6204 12372 2025 -609 -15096 11318 25532 2971 -9089
15514 -9089 -5132 -29371 -17988 10675 24485 20337 13555 959 5454 9177 13209 24314 34259
15501 34259 2626 -5448 -8573 -9939 25632 30265 29198 39082 18289 12446 15280 -6929 -3868
15488 -3868 -3896 17155 26169 14353 8898 -21002 -44457 -41474 -50423 -64917 -61213 -49551 -21031
15475 -21031 -12771 -10600 -5729 12483 30922 46860 19237 -8586 17525 42532 53638 31775
15463 31775 -21310 -26773 -2763 -2756 21768 37088 44547 49214 36601 38538 22859 -19412 -7661
15450 -7661 13448 1075 -11940 -20759 -35708 -23840 -12895 387 -14853 -26862 -25102 -20955
15438 -20955 -4725 6369 5633 -13114 -39310 -39569 -7931 18326 14072 17431 1409 -11505 852
15425H52j6252l2374J3662L746j0768J3307p78l828P631j0q495K119J6913n532
15411a9807R209J468J107K271m350k4034j021L0156j0544j6965j2770n1060Q187
15398h8153K2718K5057K7959K531r45J1179K1564l5264k1180M2355K5462l7466
15386d183m4311m279j1836m594K5100K2386M1732K210k0853q930l5734L213K8075
15373a2004J9145k4593k0876j6854L0469O208P884K7898k308k2050L475L940k0562
15360b0228M698j8345L0804P954o523J422j1517j9588K2502k633l9241R238j0529
15347e1986K1682J2587Q698j6560K6805N1533K2321k8177j3327j8058l0068n777
15335b0327j3335M0819K3836J5434K131j3425k0598j9524k1624k275M141j0256
$$ plain form
15425 852 -15400 -47774 -34112 -30366 -41134 -27827 -28605 -32433 -24802 -24812 -33307 -31188 -14275 -19807
15411 -19807 -10598 -9130 -8023 -5752 -10102 -34136 -35157 -5001 -15545 -32510 -45280 -96340 -88153
15398 -88153 -65435 -40378 -12419 -9888 -10833 346 21910 -13354 -34534 7821 33283 -4183
15386 -4183 -48494 -52773 -64609 -69203 -44103 -21717 20015 22225 1372 -7558 -43292 -40079 -12004
15373 -12004 7141 -17452 -38328 -55182 -24713 -18505 -10621 17277 14969 -7081 -3606 334 -20228
15360 -20228 -15530 -33875 -3071 4883 -1640 -218 -11735 -31323 -8821 -11454 -50695 -41457 -51986
15347 -51986 -30304 -17717 -9019 -25579 1226 52759 75080 46903 33576 15518 -14550 -20327
15335 -20327 -33662 7157 30993 46427 48558 35133 14535 -4989 -26613 -28888 -24747 -35003
15323c5003k6389j7356M832L524j9631J674L003K3871L7191N653r202l78j1177
15310c9388K0529N808J834r075k1127K2012J2647m518j8259m4503j3166J0925
15298g6281K0903K8886r284j4019L4587K8586J1573l6965o709J3988K643q502
15286a0594k7145J8485K2918M169J3055J7005l4758J3622O696j0304J7927k134
15274B8942j8692k9560j5874K0327l309p984O887j6701J3068J38j3513j2567Q723
15261d0115L786K1562J089K6285R31p866J9697n226j5660k2064M5515L6066j2765
15248E1235j5287k8044j1405j6348j2049O120j4150O017O589l0997K6532Q070
15236b3717j4694Q494q04J6158p334j0013k4267k2676J6963K0254N257J5976Q984
$$ plain form
15323 -35003 -61392 -78748 -73916 -70392 -90023 -88349 -85346 -61475 -24284 -18631 -27833 -28211 -39388
15310 -39388 -18859 -13051 -11217 -20292 -41419 -19407 -6760 -11278 -29537 -74040 -87206 -76281
15298 -76281 -55378 -26492 -35776 -49795 -15208 13378 24951 -12014 -18723 -4735 -2092 -10594
15286 -10594 -37739 -19254 3664 7833 20888 37893 3135 16757 23453 13149 31076 28942
15274 28942 10250 -19310 -35184 -14857 -18166 -26150 -19263 -35964 -22896 -22758 -36271 -48838 -40115
15261 -40115 -36329 -14767 -13678 12607 13538 5672 25369 20143 4483 -17581 27934 64000 51235
15248 51235 35948 7904 -3501 -19849 -31898 -25778 -39928 -33911 -27322 -58319 -31787 -23717
15236 -23717 -38411 -29917 -30721 -14563 -21897 -31910 -56177 -78853 -61890 -41636 -36379 -20403 -11419
15223a1419J4555J7332O901k3936j8706M7152J4453k6168k3431j8154m686J9346
15211f761K9765R54J4294N58l4918P800O272j3906K078Q201L036k6371q140j3232
15197c0370m686L4881L1957k6746l6733R736J0998R784K305k4731j3400J7534
15185a9471J3555M1082k0158j4502J9522j7697j5496L535l1162j8685j766J5377
15173d5866J4920j6265n662J6440j7945J7650L6108J471J6005Q53j48L540j8149
15160B952q654m555M658j591p093k839P144J5682k5452j8969J3147K7129J211
15147B770M9J6331m026q478l0428L164j1355L2n37O351K1241j7664j4078M0j2695
15132d9283m793J7933K9486J9684J8739j2808J1418n17j5214j3434J1322j197
$$ plain form
15223 -11419 3136 20468 27369 3433 -15273 31879 46332 20164 -3267 -21421 -26107 -6761
15211 -6761 23004 23958 38252 38810 3892 11692 17964 4058 6136 14337 17373 -8998 -17138 -30370
15197 -30370 -35056 -175 31782 5036 -31697 -21961 -10963 -1179 1126 -23605 -37005 -19471
15185 -19471 -5916 35166 15008 506 20028 2331 -13165 -9630 -40792 -59477 -61243 -45866
15173 -45866 -30946 -47211 -52873 -36433 -54378 -36728 -620 851 16856 17709 17561 21101 2952
15160 2952 -5702 -10257 -5599 -7190 -14283 -17122 -9978 5704 -19748 -38717 -25570 1559 2770
15147 2770 2819 19150 15124 6646 -23782 -20618 -31973 -31941 -32478 -26127 -4886 -22550 -36628 -36588 -49283
15132 -49283 -54076 -36143 -6657 13027 31766 18958 30376 29859 14645 1211 12533 11336
15120A1336l8341n593n791j429K5703j507n663j425m75j3787J047K0035K243n911
15106a9558R083L855j5715L180J1220j8286J2665P997j5090k8673J9992J5253
15094a4077q720J2366J0023l51o413n207m307M50k2020K6344J5627K0674j8718
15081E671l6212M921K8572M350k4101L3665Q156j1767j0475l531l1117j130J0341
15068b2657j7335J3287k2558m4l472L7135L1284P591q00j4804J0509j6747k7178
15055b5789j6096J9229L1634Q384J2095j7803Q606P508N285j6830j5090l9013
15043c7880Q773K0440m941p91o096M787l107L954P428o04r68L6408q497q267j265
15028I374J7250l428k2145L1137J1274k6148j0038r568K2690j5646j8109N493
$$ plain form
15120 11336 -27005 -32598 -38389 -39818 -14115 -15622 -21285 -22710 -23185 -36972 -35925 -15890 -13647 -19558
15106 -19558 -10475 -6620 -22335 -19155 -7935 -26221 -13556 -5559 -20649 -49322 -29330 -14077
15094 -14077 -22797 -10431 -408 -759 -7172 -12379 -16686 -16236 -38256 -11912 3715 24389 5671
15081 5671 -30541 -25620 2952 7302 -16799 16866 25022 13255 2780 -751 -31868 -32998 -22657
15068 -22657 -39992 -26705 -49263 -49307 -52779 -15644 15640 23231 22431 7627 18136 1389 -25789
15055 -25789 -41885 -22656 8978 17362 29457 11654 20260 27768 33053 16223 1133 -37880
15043 -37880 -29107 -8667 -13608 -14399 -20495 -15708 -18815 -14861 -7433 -8037 -9005 27403 18906 10639 9374
15028 9374 26624 23196 1051 32188 43462 17314 7276 -2292 20398 4752 -13357 -7864
15016g864K9694J172o397Q143r429p800j5253q648J5814J0539l194L402J1274
15003B1453J5039k4771l3671N0621J3901l0116j314K8803P7377R2370j6192o0301
14991A33199n7600m1915o393j77J0165j3813j6889m5173J2711K3577N667L5409
14979C8768J2041k0952r351J144l7150n642P797J1979L5575R865l3523j964J7176
14966B5763k4909L304j1006J8491m650m644o694J2043P001j2978l0366N620L935
14953a9090M773j9992j2879Q920k0750K0515J6879J570q5k6233J4055J8886R283
14940d148k7216L420N417J1637q120r278J4620n087J5211M4865K904m392k40R143
14926D8736j2476o133j492P696r816n302r227K219j3555m396q276J4173j2150
$$ plain form
15016 -7864 21830 23002 16605 24748 15319 7519 -7734 -16382 -568 9971 6777 10179 21453
15003 21453 36492 11721 -21950 28671 42572 12456 11142 39945 117322 209692 193500 133199
14991 133199 75599 33684 27291 27114 37279 23466 6577 -38596 -25885 -2308 3359 38768
14979 38768 50809 29857 20506 21650 -15500 -21142 -13345 -1366 34209 44074 10551 8587 25763
14966 25763 854 4158 -6848 11643 6993 2349 -4345 7698 14699 1721 -28645 -23025 -19090
14953 -19090 -14317 -34309 -47188 -38268 -59018 -38503 -21624 -20054 -20139 -46372 -32317 -13431 -4148
14940 -4148 -31364 -27944 -22527 -10890 -19010 -28288 -13668 -18755 -3544 41321 44225 39833 39593 48736
14926 48736 36260 30127 28635 36331 26515 21213 11986 14205 650 -3746 -12022 2151 -9999
14913i999J1141l768m912j0093K1711P668r881k4840J0620J384k5216j7829j488
14900e5502J3041m648K7938K4611q998n091J6265M374j5503L148K6684P239k7651
14887E907k5513j2365K0581j2985L3110K4947l7069k3721K4013j0317l2530q534
14875e4476J3299J8239Q667Q380j4402P995K2518k4322K0786q052P517k8923m827
14862b7601J7570O888k179Q173J5577K1901j8737j2517J5375J3056J6499l9808
14850A4197m5180q512k259O735L884p184J7636K0241l8171l4129J1314K4445K6357
14837a0626Q141J670l0331m447M4824R180P023K232l546j3090P856K469n5577
14824c4222j3084J0575M983j7878M74J7417L2637O817k4967m404L3584k4242P26
$$ plain form
14913 -9999 1142 -2626 -7538 -17631 4080 11748 1867 -22973 -12353 -10969 -36185 -54014 -55502
14900 -55502 -42461 -47109 -19171 5440 -3558 -8649 7616 11990 -3513 -365 26319 33558 5907
14887 5907 -19606 -31971 -11390 -24375 8735 33682 -3387 -27108 -3095 -13412 -45942 -54476
14875 -54476 -41177 -22938 -14271 -5891 -20293 -12298 10220 -14102 6684 -1368 6149 -22774 -27601
14862 -27601 -10031 -3143 -5322 2851 18428 40329 21592 9075 24450 37506 54005 14197
14850 14197 -30983 -39495 -41754 -35019 -31135 -38319 -20683 -442 -38613 -72742 -61428 -36983 -10626
14837 -10626 -2485 -815 -31146 -35593 9231 18411 25434 27666 24120 11030 18886 21355 -34222
14824 -34222 -47306 -36731 -31748 -49626 -49152 -31735 902 7719 -17248 -21652 11932 -12310 -11584
14811a1584J1786p142K8412J7700k3545k0969k2442j5607R74J7816K1889K4425
14799B1713J329k0334J2520P779o54m9841L351K4047m418j2532O673p119j7910
14786c5396j4900j926K6171M1226j852O647k4225n969P06K690J3043J8281K4752
14773D9248o34l3045o807j7547L383j2493K328K5447l8345J5460J0547O072N715
14760I329K083l069n479J2890k5056k8536R876k290l305K0597K1766J0646j716
14747A7736J9004j8502J6296K6450J8887p761m5514k4356j6640j4699j684K517
14735b8266J024K3531L1041M517M28k5993l4171j1235J7016J2299j610l511J5153
14722B23K2849k650j4964N094J1967R100k2095k4595m1653j9129r062R631K1292
$$ plain form
14811 -11584 202 -6940 21472 39172 15627 -5342 -27784 -43391 -42417 -24601 -2712 21713
14799 21713 23042 2708 15228 23007 22353 -27488 -24137 -90 -4508 -17040 -10367 -17486 -35396
14786 -35396 -50296 -52222 -26051 15175 13323 19970 -4255 -10224 -9518 -6828 6215 24496 49248
14773 49248 48614 15569 8762 -8785 -5402 -17895 -15567 9880 -28465 -13005 -2458 3614 9329
14760 9329 11412 8343 2864 15754 -9302 -37838 -27962 -30252 -33557 -12960 8806 19452 17736
14747 17736 36740 18238 34534 60984 79871 72110 26596 2240 -14400 -29099 -30783 -28266
14735 -28266 -27242 -3711 27330 31847 32275 6282 -27889 -39124 -22108 -9809 -11419 -14930 223
14722 223 23072 20422 5458 10552 22519 31619 9524 -15071 -56724 -75853 -84915 -75284 -53992
14709e3992N0711O837k2441l134M3191J8939M823k4392j3175l0797k5480L1672
14697a7238O115m1326J7785K6521k705P964p321n173J2743q14J4160k6620o22
14684a6531K6341J1966L7443L2893j1566j0728l3410j9280p921n556K166P288
14672A3105J7339O003n283k7719n663p220N438J9319J5109n00J740l0573J5952
14659A7047K7105J2499j7047j291n654J1586k0712k6349j3548K4183n851J8455
14647B0423K6247N984J4100K4372k4096j4513N462m3837q292j3545k30J010L1337
14634B4422P916Q157q637R200k5878j3616N471k8931K3847J9129K490j4200j9455
14621a0085K361J9131n835Q567J1284N094J9561k3676P521K150k0965j0962J7865
$$ plain form
14709 -53992 -3281 3556 -18885 -22019 21172 40111 44934 20542 7367 -23430 -48910 -17238
14697 -17238 -11123 -52449 -34664 -8143 -10848 -2884 -10205 -15378 -2635 -3449 10711 -15909 -16531
14684 -16531 9810 21776 59219 92112 80546 69818 36408 17128 9207 3651 5817 13105
14672 13105 30444 36447 31164 3445 -2218 -9438 -4000 15319 30428 29928 31668 1095 17047
14659 17047 44152 56651 39604 38313 32659 44245 23533 -2816 -16364 7819 1968 20423
14647 20423 46670 52654 66754 91126 67030 52517 57979 14142 5850 -7695 -7925 -6915 24422
14634 24422 32338 40495 31858 41058 15180 1564 7035 -21896 1951 21080 23570 9370 -10085
14621 -10085 -7724 11407 5572 14139 25423 30517 50078 26402 33923 36073 15108 4146 22011
14608B2011K967l110k7424N685p959J5649L611k0260J5599M867j1781k4170j471
14595b5786R776J0316n008r267N211R392L505j4068k7976o076L7353K4817L252
14582A5441J3316p063K6669R594l0446j3220J1308l156k6078L282J7208j3175
14570C680l2642k2281L3962L6456l3290j6743J5678K9356J5048k6285k4365k0335
14558d1761J6409J2345M0469M4038p761k2445k2554m0358k908J084J0559k3640
14546c6523N056m735l406L7426K5113K8050j169l6900o730J3977j9128j8948j8723
14533c6640J567M9291M0349L271l1727l3430L29p921K7620l611l865N132J8355
14520B8720o604j9412j687K1634j767K835j0447J5828k0521k2100Q021Q150l145
$$ plain form
14608 22011 24978 21868 -5556 129 -7830 7819 11430 -8830 6769 11636 -145 -24315 -25786
14595 -25786 -16010 -5694 -10702 -19969 -14758 -5366 -1861 -15929 -43905 -49981 -12628 12189 15441
14582 15441 28757 21694 48363 57957 27511 14291 25599 22443 -3635 -353 16855 3680
14570 3680 -28962 -51243 -17281 19175 -14115 -30858 -15180 14176 29224 2939 -21426 -41761
14558 -41761 -25352 -13007 27462 71500 63739 41294 18740 -21618 -24526 -23442 -12883 -36523
14546 -36523 -31467 -36202 -39608 -2182 22931 50981 49812 12912 6182 20159 1031 -17917 -36640
14533 -36640 -35073 14218 54567 57838 26111 -7319 -6990 -14911 12709 9098 5233 10365 28720
14520 28720 22116 2704 1017 22651 20884 23719 13272 29100 8579 -13521 -5500 2650 -495
14507d95K480J2701J4611j057j8429r667J4220L0067j0561k9801r017L6750R085
14494D0887l222P029n842l0553j1887j5002j3186R407J0415J9596n881k3052L562
14481a7729Q05n156j2644j0583P025L3896J3407k4259o530K3011M866k799N129
14468H439q808J980L375N535K6326m387Q574L698q904j4606k3073j7905L1859
14455A2103R672J7139J35l32J2577K178l5107r454j0599p321K7404J1517k5182
14442D730j1704R322L3308J0531l331l2351k6274N570N365j6804M757L4448P610
14429B5177l0396j7913j5736R418K7068J622Q553n037N706J7604J3930J882j8619
14416B3259K1354M068j8877r92k4520q086k019L878J1681j0270m087J9128K0477
$$ plain form
14507 -495 1985 14686 29297 28240 9811 144 14364 44431 33870 4069 -4948 31802 40887
14494 40887 37665 44694 38852 8299 -3588 -18590 -31776 -22369 -11954 7642 1761 -21291 -17729
14481 -17729 -16924 -22080 -34724 -45307 -38282 -4386 9021 -15238 -21768 1243 6109 3310 8439
14468 8439 -369 1611 4986 10521 36847 32460 41034 44732 35828 21222 -1851 -19756 12103
14455 12103 21775 38914 39049 38717 51294 53472 18365 8911 -1688 -9009 18395 29912 4730
14442 4730 -6974 2348 35656 46187 42856 10505 -15769 -10199 -4834 -21638 -16881 17567 25177
14429 25177 -5219 -23132 -38868 -29450 -2382 -760 7793 2756 8462 26066 39996 41878 23259
14416 23259 44613 48681 29804 28812 4292 -3794 -5813 -1935 9746 -524 -4611 14517 34994
14403C4994j4558L219K3285Q176R403j906k835K7130M082j2673l4451l8281k5925
14390b0340J962L0079r324k5134Q579K5596J1477o144k1566r071J2285J4118j9965
14377g448J1553J7190j0438k5500O142J8647K6238l4818K31j5233K0923J6703
14365B4190J0216k2620p737M160L819K5550l4242l2773r952J526J4805O82j9342
14352d1718r333M0707J1602J1355K8497P136M88o10p592o182L118k0631k6687
14339i850K104J8518L0413K3065K86r135k2329l0355k8063k3274j423L4884L2276
14326A7117j4602o43j7189k8701j5604r340K7971J7574o127K2685K5424J369K3243
14313D3177O040J2655m673l2707n1549l0617K1329L3131l257J8831R905K87J5527
$$ plain form
14403 34994 20436 23655 46940 55116 64519 62613 59778 86908 90990 78317 43866 5585 -20340
14390 -20340 -18378 11701 2377 -22757 -14178 11418 22895 16751 -4815 -13886 -1601 12517 -7448
14377 -7448 4105 21295 10857 -14643 -8501 10146 36384 1566 1797 -13436 7487 24190
14365 24190 34406 11786 4049 8209 12028 37578 3336 -29437 -39389 -37863 -23058 -22376 -41718
14352 -41718 -51051 -10344 1258 12613 41110 48246 48734 48124 40532 34350 37468 16837 -9850
14339 -9850 -7746 10772 41185 64250 64536 55401 33072 2717 -25346 -48620 -50043 -15159 17117
14326 17117 2515 1872 -15317 -44018 -59622 -68962 -40991 -23417 -29544 -6859 18565 19934 43177
14313 43177 49217 61872 57199 24492 -27057 -57674 -36345 -3214 -6471 12360 22265 22552 38079
14300C8079r954n748J9818J7660o836o663o099J486J0928j0330l220r145Q351
14287C8327Q524J3734k1142j2073o114K237K0691J0557j9941L934J2223j6282
14275C4675j8212J3485n288J5269q563K556o813n198k249r590J8494J4174j5849
14262B6891k5235L245L1296N158Q83N552j9866j90j3649J0684P373N217J9767
14249E7126K1170L9744K1032M800K9277L2727l573q99j0847j9442k5462j7986
14237A27667k1151j5964r116o589r079N767Q550k0892o792J3685L456j5105m1204
14224A3233j8881j1866O293k0189J776J2701M864m465J2089Q777M652R146L7494
14211E5624L3007j21j252m595J0246J1867K7314J1074k4367M327O4153R3429J18823
$$ plain form
14300 38079 28125 22377 42195 59855 53019 46356 40257 41743 52671 42341 39121 29976 38327
14287 38327 46851 60585 39443 27370 21256 23493 44184 54741 34800 38734 50957 34675
14275 34675 16463 29948 24660 39929 31366 33922 27109 21911 19662 10072 28566 42740 26891
14262 26891 1656 4901 36197 41355 42238 47790 27924 27734 14085 24769 32142 37359 57126
14249 57126 78296 118040 139072 143872 173149 205876 202303 201404 190557 171115 145653 127667
14237 127667 106516 90552 81436 74847 65768 71535 80085 59193 52401 66086 69542 54437 13233
14224 13233 -5648 -17514 -11221 -31410 -29634 -16933 -12069 -16534 -4445 4332 8984 18130 55624
14211 55624 88631 88510 87258 82663 92909 104776 132090 143164 118797 123124 187277 280706 399529
14198C99529J83284J74642J7740j35595j87845j20670r5376p2238l4658J9129
14188A47942M178j9587l7534j7422J309K874k3400L331K9268O269m5536r064J2659
14175E5287K879q522r951J5167m684j4031K9545o340k2390K3176j0685O568l946
14162E2073k7220m726Q221M952K0833L1650P2117J13052J54116J34204J75409
14151G34681L7334j69115k04007j02100o8752o8368l5133m6975j7578J025L3958
14140I4970J2620j4692j3634l4211k5169j758l475j663k5448P105R671L529K5394
14127C3239J7517K8564J2208l0253j8017L2392K7964P44j7367j1740J0159r616
14115G5794j3813k9907r71J8744L0322L0965O8343M8467J5444j716m2252n6498
$$ plain form
14198 399529 582813 757455 775195 639600 451755 331085 235709 163471 128813 147942
14188 147942 152120 132533 94999 77577 78886 81760 58360 61691 90959 97228 51692 42628 55287
14175 55287 58166 49644 39693 54860 50176 36145 65690 59350 36960 60136 49451 56019 52073
14162 52073 24853 20127 28348 33300 54133 85783 157900 270952 425068 559272 734681
14151 734681 772015 602900 398893 296793 228041 159673 124540 77565 59987 61012 94970
14140 94970 107590 92898 79264 45053 19884 18126 14651 12988 -12460 -5355 4316 7845 33239
14127 33239 50756 79320 91528 61275 43258 75650 103614 104358 86991 75251 85410 75794
14115 75794 61981 32074 31103 49847 80169 111134 179477 227944 243388 241672 199420 142922
14103A42922o6881m3178O024K0267j1629k2340R97Q681J0403J7668J1372p009
14091F7297l4746K410n549q356L8271K9333j763j3361l3192k0932j930R487M611
14078C1580l304j2490K797N926k166P854k179l0878J6203K8683j6677K07M945
14065C0501J6360J4147k2314k8245k0489J5429K3921L3321j3891j7071j9095L789
14053A6363q093J5818K1896k2001Q285k145O470j3416k2929J8322K9532j800J7431
14040F3733M979J7677J1569r31O079j8162j2535k5333l3093M684J6835Q305n799
14027C8008K302k2986l3792j6008J0058k5974l13K3658K5096K5273M883k0027
14015A0178P629j34L745j7990Q516J2969L2851j680J850J1864J7484j6121j5336
$$ plain form
14103 142922 76041 32863 38887 59154 47525 25185 26182 34863 45266 62934 74306 67297
14091 67297 32551 34961 29412 21056 59327 88660 86897 73536 40344 19412 17482 26969 31580
14078 31580 28276 15786 18583 24509 22343 30197 28018 -2860 13343 42026 25349 25556 30501
14065 30501 46861 61008 38694 10449 -10040 5389 29310 62631 48740 31669 12574 16363
14053 16363 8270 24088 45984 23983 32268 30123 36593 23177 248 18570 48102 46302 63733
14040 63733 68712 86389 97958 97027 103106 84944 72409 47076 13983 18667 35502 43807 38008
14027 38008 40310 17324 -16468 -32476 -22418 -48392 -48705 -25047 49 25322 30205 10178
14015 10178 17807 17673 21418 3428 11944 24913 57764 56084 57934 69798 87282 71161 55825
14002E5825J9143k6692k3542m599p29k4292n965K0029p988p501K9913M880k4561
13989C921Q965N678J3131K3504L5724L6904J375j644m3013l4269k5201n062J5872
13976C5885j0959K7190R354O713j1635J7546k8112j9891j9485K9079k2881m616
13964H188K2371l189N308L19n615K9862j129P015R468K382J643J8065J1863j6353
13950I0198m1146j3530J3728K8919K999j4441k3157J5686J2174R804L5959M6569
13938A63762k11j6720l352n273l5421m3948r132J1406J2601L6074j142M432p626
13925A05450k1525l1648O458j877q660j4442O846L8479M165K6559L9369J5479
13913A64653o199O125k5015r599l617j2115L099Q616k3610k6402q441j845K3975
$$ plain form
14002 55825 74968 48276 24734 20135 19406 -4886 -10851 9178 1190 -6311 23602 28482 3921
13989 3921 12886 18564 31695 55199 90923 127827 129202 127558 84545 50276 25075 20013 35885
13976 35885 24926 52116 61470 68183 56548 74094 45982 26091 6606 35685 12804 8188
13964 8188 30559 27370 32678 32997 27382 57244 56115 63130 72598 74980 76623 94688 106551 90198
13950 90198 49052 35522 49250 78169 81168 66727 43570 59256 71430 81234 117193 163762
13938 163762 163551 146831 143479 138206 102785 58837 49705 61111 73712 109786 108644 113076 105450
13925 105450 83925 52277 58735 56858 48198 33756 40602 79081 83246 109805 149174 164653
13913 164653 158454 164579 139564 129965 126348 114233 117332 125948 102338 75936 67495 65650 89625
13900H9625l864P482r293j403R718J3899K4203L895k3329j3734J1728K669J514
13887A13110j5261l616J9480P707J5611K7111Q011k2741k1781J9718j5566l7036
13875I4747j3800k0642L4654M0251K4683l861J2453Q309K64j893k0725R752K3493
13862A87685j475Q360J9660n158J6326K0136m6019o1845k3666k0144j8054L1209
13850A07015M1804P199N114k3503j8533R558K8977k0140K2332J2117P041K6420
13838B05401L5293M4578R120k2004j993k3592J4399K4140K7292K1819l576j7859
13826C13018r448J3224k19R038r379R037K2113L0271r634k5634q299J6452K4223
13813C74763N7228K9626o8935m9095j1532J2529L7621J3789K3467K7245M4276
$$ plain form
13900 89625 85761 93243 83950 82547 92265 106164 130367 134262 110933 97199 108927 111596 113110
13887 113110 97849 94233 113713 121420 137031 164142 172153 149412 127631 147349 131783 94747
13875 94747 80947 60305 94959 135210 159893 156032 168485 176794 177058 175165 154440 164192 187685
13862 187685 186210 194570 214230 209072 225398 245534 199515 137670 114004 93860 75806 107015
13850 107015 148819 156018 161132 137629 119096 128654 157631 137491 159823 171940 178981 205401
13838 205401 240694 285272 294392 272388 270395 246803 261202 285342 312634 334453 330877 313018
13826 313018 303570 316794 316575 325613 316234 325271 347384 377655 368021 342387 334088 350540 374763
13813 374763 431991 461617 392682 343587 332055 344584 382205 395994 419461 446706 490982
13802D90982L2170K0941L6727M0246M6431N0554O2846M2063O4822R2958R6727
13791A077467J20339J52033K40352K89053L86266M56521N02327N13311N92314
13782D329983P66617J216570K031373L398670N788163R259831J1616826P354244
13774D5762277l166505j0528336r961306o518101l970992k502685j658820j141915
13766F313617q29362n94387m78909m36107l88848l37435k14087j45268j27879
13757B761335q0791j4671o552J2980M8633M6627M4716O4608J20310J95583K30095
13746C422873K78214L37441M35263O34739Q87248J170469J418485J545936J788860
13737A1919528K382679L452479N558567R365819J5951025K6454258L7111891L0385232
$$ plain form
13802 490982 523152 544093 580820 621066 667497 718051 780897 822960 887782 980740 1077467
13791 1077467 1197806 1349839 1590191 1879244 2265510 2722031 3224358 3737669 4329983
13782 4329983 5096600 6313170 8344543 11743213 17531376 26791207 38408033 45762277
13774 45762277 42595772 32067436 22106130 15588029 11617037 9114352 7455532 6313617
13766 6313617 5484255 4889868 4410959 3974852 3586004 3248569 3034482 2889214 2761335
13757 2761335 2680544 2665873 2659321 2672301 2720934 2767561 2812277 2876885 2997195 3192778 3422873
13746 3422873 3701087 4038528 4473791 5108530 5995778 7166247 8584732 10130668 11919528
13737 11919528 14302207 17754686 23313253 32679072 48630097 75084355 112196246 142581478
13729A42581478l297430l3777789l5209019k2425021j3223142q193787n388489
13722B1066801l644880k514071j838667j499954j386358j297584j076626q39565
13714F969096o30761m72974l50194k59264j51855o6370j11313j69651j47594q6943
13704D522177k1582N5043J73102K42960L10229L54258M94263P42061J048846J324461
13694I245818J475473J771946K344924L368991N286935Q780214J4899257K4893764
13686G2067322L6390041L4051067K796250l1505273l7729213k4983812j4593533
13679C6492849q951950n849039l937821k709447j924982j627398j523502j374263
13671H594447j156941r12065o91155n28335m25048k71679k32405k07145j51799
$$ plain form
13729 142581478 139284048 105506259 70297240 47872219 34649077 26455290 21066801
13722 21066801 17421921 14907850 13069183 11569229 10182871 8885287 7808661 6969096
13714 6969096 6338335 5865361 5515167 5255903 5104048 5037678 4926365 4756714 4609120 4522177
13704 4522177 4500595 4555638 4728740 4971700 5281929 5636187 6130450 6872511 7921357 9245818
13694 9245818 10721291 12493237 14838161 18207152 23494087 32274301 47173558 72067322
13686 72067322 108457363 142508430 145304680 113799407 76070194 51086382 36492849
13679 36492849 27540899 21691860 17754039 15044592 13119610 11492212 9968710 8594447
13671 8594447 7437506 6525441 5834286 5305951 4880903 4609224 4376819 4169674 4017875
13662D017875k15634k53517j82589j53649r3190k4284O653K9160J8095M6164J77208
13651C372292L03131L95243M67916N90181P79531J131049J730963K816566M707511
13642A6294383P761636J1328089J0930056K049242q738977j1942546q773123n375809
13634A3532951l331219k169135j455055j007456p23196n91976n50117n12691m40030
13625B752076l40958k77270j76977j67913j23318q5115p5082p2428q9845q6434
13615A256736r4780q8974n8279o0047n5465n4218n3326o1701J8238L0035j491
13604G76728m4995j03530q2301k3710K6932J3915l6590m0209o1702k8959j7619
13593C77960n422l9627l4676m2374J0479J8489M79m27j6496j108J2124J936Q315
$$ plain form
13662 4017875 3802241 3548724 3366135 3212486 3119296 3095012 3101665 3130825 3148920 3195084 3372292
13651 3372292 3675423 4070666 4538582 5128763 5908294 7039343 8770306 11586872 16294383
13642 16294383 24056019 35384108 46314164 48363406 39624429 27681883 18908760 13532951
13634 13532951 10201732 8032597 6577542 5570086 4846890 4254914 3704797 3192106 2752076
13625 2752076 2411118 2133848 1956871 1788958 1665640 1580525 1505443 1433015 1343170 1256736
13615 1256736 1161956 1072982 1014703 954656 899191 844973 791647 729946 748184 778219 776728
13604 776728 731733 628203 545902 522192 549124 563039 526449 486240 424538 395579 377960
13593 377960 372538 332911 298235 255861 266340 284829 285308 284881 268385 267277 279401 281337 289652
13580B89652Q364l2320k7752N776K1541j708n421k4295R759K0806k8550l397J4187
13567B46642l965m1693l4004J7159L2897J4400N1161L8692R149l5713p6692n9839
13555A58194k4939l0302L1156M1002J3236k9203n426k4845k3285j7503k0608J3258
13543H0735M4209M6262K1769m043k7544l1479k2112O69r20J1232Q794J7931J5302
13530A60805Q119K4294n341j1455k082l2459k3340J1310L866J5931j443k9989
13518A18216k7580j1465J8457K0611J1269j1826J4254M321K0284l1609k6999K956
13506A00889j3657m0065j8949k4859k1538k6502j9419L2672P3060K6988j2584
13495E6036J0716N1255j2372k5945m214j4438L61j051j3005P414N4180K1254j0955
$$ plain form
13580 289652 298016 265696 237944 243720 265261 263553 258132 233837 243596 264402 235852 232455 246642
13567 246642 242677 200984 166980 184139 217036 231436 282597 321289 330438 294725 218033 158194
13555 158194 133255 102953 134109 175111 188347 159144 153718 128873 105588 88085 67477 80735
13543 80735 124944 171206 192975 188932 161388 129909 107797 108466 107546 118778 127572 145503 160805
13530 160805 168924 193218 187877 176422 174340 141881 118541 129851 133717 149648 148205 118216
13518 118216 90636 79171 97628 118239 129508 117682 131936 136257 156541 124932 97933 100889
13506 100889 87232 47167 28218 3359 -18179 -44681 -64100 -31428 41632 68620 56036
13495 56036 66752 118007 105635 79690 75476 61038 61399 60348 47343 54757 108937 130191 119236
13482A19236J6133J4313j5294n802P227P321k3322p959l781L047K012q721K613
13469A07023O896j369l1251k3031J2377j4469Q071K3428n400n385J1894o405Q34
13456H3213K0045j5380j6558L753K4840L5190K5563l9453m2437j7206n367J1179
13444F7382J8925P610l913l3594L6768K1916m1803m435J8237o201J0663O694l2513
13431F5736j6359R258j5626N084L053K4257k456m1023L400n102O909L6661k7363
13418D6429n0380k2731J1136J3742N316L2603j3993j4682P920L1237J6269R274
13406G2140J1039q523j4180k3958k4460M732L5462J6845l0130l4930J0213K2148
13394C6398K1332k9653j8170K640K203k9122Q562k2046o076K6462J5808j770n925
$$ plain form
13482 119236 135369 149682 134388 128586 135813 143134 119812 111853 108072 111119 113131 104410 107023
13469 107023 113919 112550 81299 58268 70645 56176 64247 87675 82275 76890 88784 82379 83213
13456 83213 103258 87878 71320 75073 99913 135103 160666 121213 78776 61570 56203 67382
13444 67382 86307 93917 90004 56410 93178 115094 73291 68856 87093 80892 91555 98249 65736
13431 65736 49377 58635 43009 48093 51146 75403 72947 31924 35324 30222 37131 73792 46429
13418 46429 -3951 -26682 -15546 -1804 3512 36115 22122 7440 15360 46597 62866 72140
13406 72140 83179 74656 60476 36518 12058 16790 52252 69097 38967 4037 14250 36398
13394 36398 57730 28077 9907 12547 14750 -14372 -5810 -27856 -33932 -7470 8338 6568 643
13381F43o362k2409J4179J4522j2699K4648M79j8308K2702J806k26O754j9613
13368F116k6832j6905N990K7225J0608k944m74R366M7170J2100R621J271l4919
13355D7393n256k4530j4959p089J932J3749n356l08K2528l7507k3193j2095l102
13342d7793J8529l699J0770p601J1380l66j1562L0966J5729K247k3375j5072K518
13329a7329R377k1595J2833J3887K6346p183K180L286j0647k4424l8861O578L6297
13316i255r892l251j1966O099J9642L0781K59K2206j9386P452J168K0L0202J0930
13302G5009L3217M5595L3906J0206O628m2909l7143k3427k5135l4164j0734j4027
13290A7022m186K8979Q927J7149l7440M407k0j8505j6356n832K3181J9805r893
$$ plain form
13381 643 -5719 -28128 -13949 573 -12126 12522 13001 -5307 17395 19201 18975 25729 6116
13368 6116 -20716 -37621 -31631 -4406 6202 3258 2784 12150 59320 71420 81041 82312 47393
13355 47393 42137 17607 2648 -4441 -2509 11240 5884 5576 28104 -9403 -32596 -44691 -47793
13342 -47793 -29264 -32963 -22193 -29794 -18414 -18780 -30342 624 16353 18600 -4775 -19847 -17329
13329 -17329 -7952 -29547 -16714 -2827 23519 16336 18516 21802 11155 -13269 -52130 -45552 -9255
13316 -9255 -19147 -22398 -34364 -28265 -8623 22158 22417 44623 25237 32689 33857 33877 64079 75009
13302 75009 108226 153821 187727 197933 204561 161652 124509 101082 75947 41783 31049 17022
13290 17022 12836 41815 50742 67891 30451 34858 34838 16333 -23 -5855 17326 37131 27238
13277B7238P559M839J734J1201j0042L7090k0100j8947j1283j3165K9370R78j4546
13264C1926J2366M6285R427J1014L5733M4638N7894J21056J58772J61469O2441
13253G53021q9720j74938j43473j21274o5686k2926j7060j7790j4320k1333j9908
13242D4593j1960p2Q946J707l102k095j3019j2378k5779J3421K4226m2498K664
13229a5346j1305k214L5909K214K6299L1038k357j216r855K5161k9088l1763q160
13216I317M2452N1395L8303N4949R7075J46275J74075J13294o6741j93419j26328
13205C40647q8705r0961m3183k930k4321l3677k4582j2121J4789N228j0470j8899
13193A0815n154l5279N349N014k0470n756K3481j960K0972K4226k0605O647k1794
$$ plain form
13277 27238 34797 39636 41370 52571 42529 79619 59519 40572 29289 16124 45494 46472 31926
13264 31926 44292 90577 100004 111018 146751 191389 249283 370339 529111 690580 753021
13253 753021 663301 488363 344890 223616 157930 135004 117944 100154 85834 64501 44593
13242 44593 32633 32561 41507 43214 40112 38017 24998 12620 -13159 262 24488 -18010 -15346
13229 -15346 -26651 -28865 7044 9258 35557 66595 64238 63022 53167 78328 49240 17477 9317
13216 9317 51769 103164 141467 196416 293491 439766 613841 727135 660394 466975 340647
13205 340647 251942 160981 117798 114868 90547 56870 32288 20167 34956 40184 29714 10815
13193 10815 5661 -29618 -24269 -19255 -39725 -45481 -22000 -23960 -2988 21238 633 7280 -14514
13180a4514j0417L0394O127N135J7415K1450p328m8027j3333O357M5597N7392
13168I6248K1458j0995L1962P6437R604k1056l4673n0756n3038n4290k3777J5287
13156B411L8398k2795l427l3764r623J9968L6704R075j4228k8579r154j1268r006
13143c5288R325k260P631R373K701J3832P347m326L451j052R754P220o65j0412
13129A6631j555j1738l2772j6470N353J2008M971L1743R90j0671M784J8014j4035
13116G253k3572k629R401r544p059k0633J2126L4287K9923K3119l1710k0018k311
13103a367l728j6149R161J810J4993j8607j0297m266j1856J2704L4088J4587q311
13090A2762n95J1498R040k932k8415q013j6892L7079R699M023J1580J486q797
$$ plain form
13180 -14514 -24931 5463 11590 16725 34140 55590 48262 235 -13098 -6741 38856 96248
13168 96248 117706 106711 138673 215110 224714 203658 168985 118229 65191 10901 -12876 2411
13156 2411 40809 18014 14587 -19177 -28800 -8832 27872 36947 22719 -5860 -15014 -26282 -35288
13143 -35288 -25963 -28223 -20592 -11219 -8518 5314 12661 8335 11786 10734 20488 27708 27043 16631
13129 16631 15076 3338 -29434 -45904 -40551 -28543 -23572 8171 9161 -1510 3274 21288 7253
13116 7253 -16319 -18948 -9547 -19091 -26150 -46783 -34657 -370 29553 52672 20962 944 -1367
13103 -1367 -5095 -21244 -12083 -10273 4720 -13887 -24184 -28450 -40306 -27602 6486 21073 12762
13090 12762 12167 23665 32705 29773 1358 -6655 -23547 13532 23231 27254 38834 40320 31523
13077C1523K7162m971j6335j4421K331k5394j5157q23M617J8558K1098k0303k8193
13064b0308J0550J4242q548j2366k252K1944K889k8118j9359n795K0317J4527
13052a2277N627j281l4874O518N923K0077l1380k570J1114m921M31M928k452j0535
13038d5672M818J743J2551K9831J7682J1721j7052O841k0612o338m588Q733r49
13025a291Q969l088k9687m250K5762j831j5717N992J1756k2179j30Q859K6156
13012I321p453j0025q007j0226n335J1263L8413l611k9890K5835L7661L5501K1163
12999A04610N6282J13575J45117J69668J10453j983n636J1936p2822j84811j77760
12988B68629n6336m7211n1430j1827j5555j1512r528J624k3994k7724J3317k504
$$ plain form
13077 31523 58685 53714 37379 22958 25289 -105 -15262 -16085 -11468 7090 28188 7885 -20308
13064 -20308 -9758 4484 -4064 -16430 -18682 3262 6151 -21967 -41326 -47121 -26804 -12277
13052 -12277 -6650 -7931 -42805 -36287 -30364 -10287 -41667 -44237 -33123 -38044 -37613 -32685 -35137 -45672
13038 -45672 -40854 -39111 -26560 3271 20953 32674 15622 22463 1851 -4487 -9075 -342 -1291
13025 -1291 7678 4590 -25097 -29347 -3585 -5416 -21133 -15141 -3385 -25564 -25694 -16835 9321
13012 9321 1868 -8157 -16164 -26390 -31725 -20462 17951 14340 -15550 10285 47946 83447 104610
12999 104610 160892 274467 419584 589252 699705 697722 692086 704022 631200 446389 268629
12988 268629 212293 165082 113652 101825 86270 74758 65230 66854 42860 15136 28453 25949
12976B5949l9160k2063J529R304M7953K2671K8427O377N621o592l4707j8379k4811
12963B119Q545j2221l989J7042k502k4631j0652j5244k208J2963r401l117J2041
12950c1255L5790K22M919l720l55l3848J8909L7557j2234j4896J0459J1805k1206
12937B147k222j3752k047J4388P510J6804j071L617j1843r660K127J8001m2q172
12923A5785k4798j288n787P146j8096j0935K050J5013K2228K84p842q480q076
12910b2796L6934K8535R617N141k2801k8828J4259n70J2578l4817k3479M3152
12898A6925K7238l191J768K967j2957l533P182r195Q669J7684n942j5172k5186
12885G257j2033j4404J965M1740l047k8649k4719K4670J8526J0312j054j3732
$$ plain form
12976 25949 -13211 -35274 -33745 -24441 23512 46183 74610 80987 86608 80016 45309 26930 2119
12963 2119 10664 -1557 -5546 11496 8994 -15637 -26289 -41533 -43741 -30778 -40179 -43296 -31255
12950 -31255 4535 4757 9676 5956 5601 -28247 -9338 28219 15985 1089 11548 23353 2147
12937 2147 -75 -13827 -15874 -1486 6024 22828 21757 25374 13531 3871 5998 23999 23957 15785
12923 15785 -9013 -10301 -16088 -8942 -27038 -37973 -35923 -20910 1318 1602 -6240 -14720 -22796
12910 -22796 14138 42673 52290 57431 34630 5802 20061 19491 32069 -2748 -26227 16925
12898 16925 44163 40972 42740 45707 32750 29217 36399 27204 35873 53557 47615 32443 7257
12885 7257 -4776 -19180 -17215 24525 21478 -7171 -31890 -7220 11306 21618 20564 6832
12873F832l3535O250K6649J5485l1435M361k6865j3106L583L2758K0709N3911
12861F5597K0728l3476j2948K1327m953n0961k2365J5615L837k314M35j231j0403
12848a1112j0693K2330o85K2204J0031K20j0539P334l7947m9017J0571O504p067
12835d7866P054J4930L195j2720k5352P342K3654q590L1677K2645k5513Q325J8191
12822A6972q181k5827l2543n419L469K9799K6930P785J934m801o732J1752K1856
12809C6994M041l5798k7442J9595J0380M615K079r847l9245K090J5708K3232J8568
12796B4970o11k5082l4303q105J4518Q376k887K4883J5728k0817o515j2744j3212
12783c5801J9962M9j1219j5213p042q015O387j5938r356K0963Q873K5708n453
$$ plain form
12873 6832 -26703 -20453 6196 21681 -9754 -5393 -32258 -45364 -41781 -9023 11686 65597
12861 65597 86325 52849 39901 61228 56275 5314 -17051 -1436 2401 87 522 -709 -11112
12848 -11112 -21805 525 -160 22044 32075 32295 21756 29090 -8857 -57874 -47303 -40799 -47866
12835 -47866 -40812 -25882 -22687 -35407 -60759 -53417 -29763 -38353 -6676 15969 -9544 -1219 16972
12822 16972 8791 -17036 -49579 -54998 -51529 -21730 5200 12985 14919 10118 3386 15138 36994
12809 36994 41035 5237 -22205 -2610 7770 12385 14464 4617 -34628 -32538 -16830 6402 24970
12796 24970 24359 -723 -35026 -43131 -28613 -20237 -23124 1759 17487 -3330 -9845 -22589 -35801
12783 -35801 -15839 -15790 -27009 -42222 -49264 -57279 -50892 -66830 -76186 -55223 -46350 -20642 -26095
12770b6095k269j1680L349K2490O011j2169K865J4999K7602J3670p299j3246n2493
12757c4265N084L3051J666k1269J1759m380N799J3463q537j4148r353R03o841
12744b7068K7524L3522q054j9819r581K677K7594j7197m224j8982l763k1679J07
12731c8943R258j14M37P563K1587j3888Q803J424r691L688K5879m729R38J3963
12717B6175l4303m1430K2294N3695P869l84l2513L105M2054Q779k8665j5330l4227
12704b2881M230l431K9636J5856L597j7462J654p298k257K1305J5918J0698k9919
12691A9646j8469n87k037l0286l3929l4480K2867O9668N206j5373K2513K2451
12679B7190J4279M35l727M483k6050r486O568p414O118J8543J6930l6014l1265
$$ plain form
12770 -26095 -28364 -40044 -36695 -14205 -8194 -20363 -17498 -2499 25103 38773 31474 18228 -34265
12757 -34265 -29181 3870 5536 -15733 -3974 -8354 -2555 10908 2371 -11777 -21130 -20227 -27068
12744 -27068 456 33978 25924 6105 -3476 -799 26795 9598 5374 -13608 -17371 -39050 -38943
12731 -38943 -29685 -29799 -29362 -21799 -212 -14100 -5297 -3873 -13564 -9876 16003 11274 12212 26175
12717 26175 -8128 -49558 -27264 26431 34300 33916 1403 4508 46562 55341 26676 11346 -22881
12704 -22881 -18651 -22082 7554 23410 27007 9545 11199 3901 1644 22949 38867 49565 19646
12691 19646 1177 590 -1447 -31733 -65662 -100142 -77275 -7607 -2401 -17774 4739 27190
12679 27190 41469 41904 38177 42660 16610 7124 13692 6278 12396 30939 47869 11855 -19410
12666a9410K885j0217Q606O264Q013J4197R345K947j6621j5470m262j5179Q115
12653b0787J8550j5252q680l2028M557Q269J7936m749K5922K0195j4587p483J6038
12640G901l8394j5651J0612n655j1843j5931K3935K9338j2200J426j9202J9372
12628b6292K4237j3496j8214k989k5688k2896J6509l77L842P701J2904R640J10
12615c5009J5545P381j3321q167j7155o680J6174L0308l6975k7314L431K2560
12603d9222j634K173K0351J0086J2700J5018j6053j7535J0831R627J9017J1781
12591B7140Q911k5251m3440M234J6905K3632J9469r205j8552J2N676k1367j9975
12578c1811J0214K1481J3528k1732m436J8685r753K486k969j866J31Q196p715
$$ plain form
12666 -19410 -16525 -26742 -18136 -11872 -3859 10338 19683 22630 6009 -9461 -13723 -28902 -20787
12653 -20787 -2237 -17489 -26169 -58197 -53640 -45371 -27435 -32184 -6262 13933 -654 -8137 7901
12640 7901 -30493 -46144 -35532 -41187 -53030 -68961 -45026 -15688 -27888 -26462 -45664 -26292
12628 -26292 -2055 -15551 -33765 -36754 -62442 -85338 -68829 -69206 -65364 -57663 -44759 -35119 -35009
12615 -35009 -19464 -12083 -25404 -33571 -50726 -57406 -41232 -10924 -47899 -75213 -71782 -49222
12603 -49222 -50856 -48683 -28332 -18246 -5546 9472 -6581 -24116 -13285 -3658 15359 27140
12591 27140 36051 10800 -32640 -28406 -11501 12131 31600 22395 3843 3855 9531 -11836 -31811
12578 -31811 -21597 -116 13412 -8320 -12756 5929 -3824 -1338 -4307 -6173 -6042 2154 -5561
12565e561j1545o204K0561K8078L6710Q960l6175l1626j1462M581k4290K8994
12553A021J4074J5162J415K562K2699Q803j5786K1327M3265K8877J2709l1930
12541A24198n909k7478J477k0147J742j6423j0253m8695k0343O685O608j0829
12529a9367l9985K145N2935j174j2914p881l819J5718O06R797J5334k694r912
12516a211L240r37J9803J7059J3993j8787m8535n816L2200J4889k9802l6913K3596
12503a7221R86j8634j9780L1910K5681K4992O067j9187L556j2314J4250m012j773
12490A4521P731l0565k5700N0000K5968j5152K4824R959o328j9326k3433k4920
12478a2421N694J8251O642N288j2863j7048l365k4575M591K5387K2020P614k3850
$$ plain form
12565 -5561 -17106 -23310 -2749 25329 62039 70999 34824 3198 -8264 -3683 -27973 1021
12553 1021 15095 30257 31672 34234 56933 65736 49950 71277 114542 143419 156128 124198
12541 124198 118289 90811 92288 72141 73883 57460 47207 -1488 -21831 -15146 -8538 -19367
12529 -19367 -59352 -57207 -4272 -5446 -18360 -26241 -30060 -14342 -13736 -3939 11395 8701 -1211
12516 -1211 2029 1092 20895 37954 51947 33160 -15375 -21191 11009 25898 -3904 -40817 -17221
12503 -17221 -16235 -34869 -54649 -22739 2942 27934 34001 14814 18370 6056 20306 16294 14521
12490 14521 22252 -8313 -34013 15987 41955 26803 51627 61586 55258 35932 12499 -12421
12478 -12421 -6727 11524 18166 23454 10591 -6457 -9822 -34397 -29806 -4419 17601 25215 1365
12465A365j7188k2114n434K5423j2119m875J3704k9635K8423L7755Q188l2993
12453i500l1636l871L9037q309K484j6574Q759K7219L6239m2800j4890J4155K5471
12440B5784J309j1116m8403p486J2462l440k0504j8452k743M2897j48K4050j1159
12427a6949J2189J096j5520m967l988R198N452N851j1106l733m717J3513J8872
12414E191R640J9988q707l5968N578n00r146l208J6140m903L634J7949K2599k4883
12400A3404k6693j4719J5262J0179j5726j5054N77r653l358J0359L913N889K3846
12387a774K2423J6061o702K5119l982k5619q008j7809r118K881j6987R782K8952
12374A5219J4877J8575K30m978j1028q14k4843L935K209m175p304K8738k5510
$$ plain form
12465 1365 -15823 -37937 -43371 -17948 -30067 -34942 -21238 -50873 -22450 15305 23493 -9500
12453 -9500 -41136 -45007 -5970 -14279 -11795 -28369 -19610 7609 43848 1048 -13842 313 25784
12440 25784 27093 15977 -32426 -39912 -27450 -30890 -51394 -69846 -72589 -29692 -29840 -5790 -16949
12427 -16949 -4760 -3664 -19184 -24151 -28139 -18941 -13489 -7638 -18744 -22477 -27194 -13681 5191
12414 5191 14831 34819 26112 -9856 -4278 -4778 -13924 -17132 -992 -5895 -2261 15688 38287 13404
12400 13404 -13289 -28008 -12746 -2567 -18293 -33347 -32770 -42423 -45781 -35422 -31509 -25620 -1774
12387 -1774 20649 36710 30008 55127 51145 25526 17518 -291 -9409 -6528 -23515 -13733 15219
12374 15219 30096 48671 48901 43923 32895 32081 7238 11173 13382 9207 1903 30641 5131
12361E131l7959O134K6328J3013J1202O975j7768P94J0522k0002q790k4166k0435
12348d9021N731J136J1256K6368J2854m761j5902p705k1072J2288Q17J6351R825
12335a835K1758o297j0582k483j5459Q813o533j0512p405K0738j173o143j5888
12322c3001J3515j368k2167p343J3795J5991O172k784n899K260J482k7102N056
12309d1393l250k117r0J9511M800N6977K8913k8302k5630j6880Q886K0202l131
12296A8496l408l627k248k2778r33N578J5044r056k3756J7567K1370j0184k6689
12283b4624k8676j0681O676J1354K941N389k6559L896L0460M0388J4656k449j6036
12270F735q551p601K3732M870q037J0338J1953M04j7871j3062k7j3151p386p692
$$ plain form
12361 5131 -32828 -26694 -366 12647 23849 30824 13056 13850 24372 4370 -4420 -28586 -49021
12348 -49021 -43290 -42154 -30898 -4530 8324 3563 -12339 -20044 -41116 -28828 -28011 -11660 -1835
12335 -1835 19923 13626 3044 561 -14898 -6085 -12618 -23130 -30535 -9797 -10970 -17113 -33001
12322 -33001 -19486 -20854 -43021 -50364 -36569 -20578 -14406 -17190 -23089 -20829 -19347 -46449 -41393
12309 -41393 -44643 -46760 -46850 -27339 -22539 34438 63351 35049 9419 -7461 1425 21627 18496
12296 18496 15088 11461 9213 -13565 -14498 -8920 6124 -2932 -26688 -9121 12249 2065 -24624
12283 -24624 -53300 -63981 -57305 -45951 -43010 -37621 -64180 -60284 -29824 10564 25220 22771 6735
12270 6735 -1816 -9417 14315 19185 11148 21486 33439 33843 15972 2910 2883 -10268 -17654 -25346
12256b5346m021L3546q099k9965K0561j2383j6200K6257J4797j8147j7502K2214
12244a4288K3103J2537o127J5182O331m7963m0013J6790L8705N700O036j8400
12232b407P927p535k3495j0009N1730q099l8241q518J6924J7364J6367L0903j6180
12219B6731p285Q446m361j1092J4061K076l8m566P789R330j1328o326r423k3999
12205i985j0169o022P079J0283J2401K1884k9736l8224o912K7825J0856k1232
12193c1952K0088K9047K4560j9066k0913O661J5604k3388r620K5120k9792J45
12181a3506M1343K0095n496j0905J6379J847k6176l8936M803p43j2894L746K888
12168a7555L04L6182O390L039J1140j4573m1354k541K318j0381J2992L5016j2922
$$ plain form
12256 -25346 -29367 4179 -3920 -33885 -13324 -25707 -41907 -15650 -853 -19000 -36502 -14288
12244 -14288 8815 21352 15225 30407 36738 -11225 -51238 -34448 4257 9957 15993 -2407
12232 -2407 5520 -2015 -25510 -35519 16211 8112 -30129 -38647 -21723 -4359 12008 42911 26731
12219 26731 19446 27892 23531 12439 26500 28576 28538 23972 31761 41091 29763 23437 14014 -9985
12205 -9985 -20154 -26176 -19097 -8814 3587 25471 -4265 -42489 -49401 -21576 -10720 -31952
12193 -31952 -11864 17183 41743 22677 1764 8425 24029 641 -8979 16141 -13651 -13506
12181 -13506 27837 47932 42436 31531 47910 49757 23581 -15355 -10552 -11295 -24189 -20443 -17555
12168 -17555 -17251 18931 25321 28360 39500 24927 -16427 -18968 -16650 -27031 -14039 20977 8055
12155H055J1098l038o983m11J9636j787L731j2158p916k7613J8344L4497J0901
12142D6356J4455l4375j703R961j7295K108Q315l3424q511j2240k5243k2625M205
12129g0016K3588k674J8398L9832K7759j9921k2200l691j6529O951L67J079m391
12116b1448j907K6466K0983J9065l0204L139n863J1698j8900n958N934P658J4899
12103B5562k0867j0443n55q517n779j1026N641Q731l637K7060P406l349k8071
12090a7844o6J9645P263o35J7642k981n325R728p184l697o297j8496l346N030
12076f563j6499R581K705j5923J1661J1116K4287K92l4302m333P726J3580k521
12063H07N902P220k0874j0988j3647j223J6791L5306J3575j5113k0152m536P639
$$ plain form
12155 8055 19153 16115 9132 8721 28357 26570 30301 18143 10227 -17386 958 35455 46356
12142 46356 60811 26436 24733 34694 17399 19507 27822 -5602 -14113 -26353 -51596 -74221 -70016
12129 -70016 -46428 -49102 -30704 9128 36887 16966 -5234 -8925 -25454 -18503 -18136 -17057 -21448
12116 -21448 -23355 3111 24094 43159 12955 16094 10231 21929 3029 -2929 3005 10663 25562
12103 25562 4695 -5748 -6303 -14820 -20599 -31625 -25984 -17253 -20890 6170 13576 10227 -17844
12090 -17844 -17910 1735 8998 8363 26005 23024 17699 27427 20243 16546 10249 -8247 -11593 -6563
12076 -6563 -23062 -13481 -10776 -26699 -15038 -3922 20365 20657 -13645 -17978 -10252 3328 807
12063 807 6709 13929 -6945 -17933 -31580 -32803 -16012 19294 32869 17756 -2396 -6932 707
12050G07j4357k4251R229K2618P34r308k4856l589l501K3294n97J4548j6835L0438
12036D274r544J1317K2203j4823m2562J679K2155j7700r880J3514K3600L9495
12024D3728J5225k3222k1108m0228k1391J8182J2594j765R298K6689L270k1678
12012d06L2731M154j8835J0010j6452J0245J4353R59O16j9859m415K4753K2887
11999F0741j5312k4400j3956K2627m69j9120j6862N627J3366n688k923j9489R935
11986e923L5623K464N540j9162K0229K5202k6571l1388m295J1680Q385K804r15
11973B3673K3039K0785N142l8654j9990J2291r356j884k0068l4663J4147J1465
11961a4073M513q503K1131l147j1610n84M400j1937K8461J3542j5187M834J2302
$$ plain form
12050 707 -13650 -37901 -28672 -6054 -5320 -14628 -39484 -43073 -46574 -23280 -23877 -9329 -26164 4274
12036 4274 -5270 6047 28250 13427 -29135 -27456 -5301 -23001 -32881 -19367 4233 43728
12024 43728 58953 35731 14623 -25605 -46996 -28814 -16220 -17985 -8687 18002 21272 -406
12012 -406 32325 36479 17644 27654 11202 21447 35800 36759 37375 17516 13101 37854 60741
11999 60741 45429 21029 7073 29700 29231 10111 -6751 -1124 12242 6554 3631 -15858 -5923
11986 -5923 29700 32164 37704 18542 38771 63973 37402 6014 1719 13399 21784 24588 23673
11973 23673 46712 67497 72639 33985 13995 26286 16930 15046 -5022 -39685 -25538 -14073
11961 -14073 -9560 -18063 3068 -79 -11689 -12273 -7873 -19810 8651 22193 7006 11840 24142
11948B4142m922j1626l443k0791K892l67j8149J94O827l605l356J7402P154N045
11934b603P677l2563k0880j0073L2784L1273J4405K8105J0720k9878l8753p933
11922a7719J1640k1155J2440J2616j2071r055J3566j3321o241K6977J8622j732
11910A4567N607j1090k5204K521q25K0909J2337k6028J0311j48l3618k0625K6610
11897b4676J1452J4934r324M721J3646j848j0302n404k837J4647R123Q446K6216
11884D8794m440j3674j3293Q269j4908n566j141j8254J6601M0681R346l1342k9779
11871h706r151O369l5451j0900K4948J9973L354J0794P55K933J2993J4375k9206
11858C080j1331N724J204l819k0256n903O865N713j79K0563o351O048L4837j840
$$ plain form
11948 24142 19220 7594 4151 -16640 -13748 -14115 -32264 -32070 -25243 -28848 -32204 -14802 -7648 -2603
11934 -2603 5074 -27489 -48369 -58442 -25658 5615 20020 48125 58845 28967 -9786 -17719
11922 -17719 -6079 -27234 -14794 -2178 -14249 -23304 -9738 -23059 -29300 -2323 16299 14567
11910 14567 20174 9084 -16120 -13599 -14424 6485 18822 -7206 3105 2957 -30661 -51286 -24676
11897 -24676 -13224 1710 -7614 -2893 10753 8905 -1397 -6801 -9638 5009 14132 22578 48794
11884 48794 44354 30680 17387 25656 10748 5182 4041 -14213 2388 43069 52415 21073 -8706
11871 -8706 -17857 -11488 -46939 -57839 -32891 -12918 -9564 1230 1985 4918 17911 32286 3080
11858 3080 -8251 -2527 -1323 -5142 -25398 -31301 -24436 -18723 -18902 1661 -4690 1358 36195 34355
11844C4355l583J1242M528l1585N929L0372j7503q473P614m080p205O61j0390
11831A1882k1075J7502k310l689L414K9579K1686j8565k6374j6777J4037K2643
11819C1953l043j9381J3947k250K374j020k45K994j0681p894q76O709J0952j2499
11805A1040q144P433j2166K4050L7468k1280k6576O006K4400K5576r119j9779
11793C8909k6459L40J9991K2530Q925j3714l4783J7254L6511J0632j7187j7704
11781D5245k096L5134N814j0496l8036m6913J0800L3890n895j9027l2826Q452
11769a5954L1999O724r263J6405K3210R35j8040k7804k3554k4646l80M095j945
11756c8218L4713K7695j1848l21m759r439J3529J1377k2287k5786k3795J1242
$$ plain form
11844 34355 30772 42014 46542 14957 20886 51258 33755 25282 32896 28816 21611 22272 11882
11831 11882 -9193 8309 5999 2310 5724 35303 56989 38424 12050 -4727 9310 31953
11819 31953 28910 9529 23476 21226 23600 22580 22335 25329 14648 6754 5878 12587 23539 11040
11805 11040 2896 10329 -1837 22213 59681 38401 11825 17831 42231 67807 58688 38909
11793 38909 12450 12790 32781 55311 64236 50522 15739 32993 69504 80136 62949 45245
11781 45245 43149 78283 84097 73601 35565 -11348 -548 33342 27447 8420 -24406 -15954
11769 -15954 16045 22769 13506 29911 53121 54056 36016 8212 -15342 -39988 -40368 -36273 -38218
11756 -38218 -3505 24190 12342 12021 7262 -2177 11352 22729 442 -25344 -49139 -37897
11744c7897J6689M6559J0133o976R66J586k6524j8280J7974J9964j5424k561J0958
11731A7167R985K0413L991j7818M239k4199p892l0665m696P118J3802N0474L226
11718D5145l3898j6375J7195K038L103k426j3955R615m957K5325l4549n757j041
11705a0537j2175r716k733K6720K0634j6614J0293L103L6021m517l7244L012K8532
11692C4779Q501j4234j4771j3337k446j7503Q547L3539j1956j4473k508K2450
11680A6588M521j1189J2636j2318n630k4352l2516p979M8646L5494j8554m366
11668I81j0775o41J376j6795p710J3562m450j5447m922l425J4206J3259Q363Q226
11654d192j2029J6293l258o131L7238J8332on6k9051j8693o053p337K3129k6106
$$ plain form
11744 -37897 -21208 25351 35484 28508 29474 31060 4536 -13744 4230 24194 8770 6209 17167
11731 17167 27152 47565 51556 33738 37977 13778 5886 -24779 -29475 -22357 -8555 41919 45145
11718 45145 11247 -5128 12067 14105 17208 14782 827 10442 5485 30810 -3739 -9496 -10537
11705 -10537 -22712 -32428 -35161 -8441 12193 -4421 5872 8975 44996 40479 3235 6247 34779
11692 34779 43280 29046 14275 938 -1508 -19011 -10464 23075 11119 -3354 -5862 16588
11680 16588 21109 9920 22556 10238 4608 -19744 -52260 -60239 -11593 23901 5347 981
11668 981 -9794 -10435 -9059 -25854 -33564 -20002 -24452 -39899 -44821 -48246 -34040 -20781 -12418 -4192
11654 -4192 -16221 72 -3186 -9317 27921 46253 46247 46191 17140 -1553 -7606 -14943 8186 -17920
11640a7920j8670J0028J7682o496j8149l578j535k0485J9344K9117j0853l4744
11628e6259k3864M9284M3646L34k4516P926R693K0836K5125k2033k0212j8066
11616h106j4518N288j2304M744J7742l5548K6164Q885j4893J2069Q140o209K1921
11603A3375j1310m1445j6723J4249K8205K3401r022j9169R651j2179P135K770
11591a1062J3123Q670M323j8715r948j4449r321K1138L5718L2206J6960m3584
11579B5059l8211q708k3052K1085L2558K3981k6130l9077m1942J3445R077K1450
11567c0465k784J2603K4121k500j8997j806M428L5969k5820k4894j538j0422O577
11554c5528O0666J7273M343k2128R48K916n860k7232J1054J0681J795j3432q855
$$ plain form
11640 -17920 -36590 -26562 -8880 -15376 -33525 -37103 -38638 -59123 -39779 -10662 -21515 -56259
11628 -56259 -80123 -30839 12807 13141 -11375 -3449 6244 27080 52205 30172 9960 -8106
11616 -8106 -22624 -17336 -29640 -24896 -7154 -42702 -16538 -7653 -22546 -10477 -2337 -8546 13375
11603 13375 2065 -39380 -56103 -41854 -13649 9752 730 -18439 -8788 -20967 -13832 -11062
11591 -11062 2061 10731 15054 -3661 -13609 -28058 -37379 -16241 19477 51683 68643 25059
11579 25059 -13152 -21860 -44912 -23827 8731 32712 6582 -32495 -74437 -60992 -51915 -30465
11567 -30465 -33249 -20646 3475 975 -18022 -19828 -15400 20569 -5251 -30145 -31683 -42105 -35528
11554 -35528 25138 42411 46754 24626 25574 28490 22630 -4602 6452 17133 18928 5496 -3359
11541c359j5710Q092N685o378r242k582n670K3418K3412J766L698K7681L2945
11528H3756j2770l7398j2460j281J0461k0815j3192K3863L241j7638n74r868J4837
11515A0162K3184J3574j5479j1825j0267k335r848O046R60P893K2936K4292J1193
11502G0486q473k3553j794m1562j4381J8399K4445l4200k597N99J2093j1052r572
11489b1162J8573j389K2773L5995P091r671k7569N688r87O920k8337j9956j8674
11476c0705j2815j0486K1774k5696l884L8196J2372l3941j1192K9521J2705l248
11464a7399q687q418L8553j8784k9976P903K476J280J4656J391m023J5941O9J0830
11450E812j7441r765J9711J2863k943J0033k786J2604n220o773j6750k3826k7437
$$ plain form
11541 -3359 -19069 -10977 -5292 -11670 -20912 -23494 -29164 -5746 17666 19432 23130 50811 83756
11528 83756 70986 33588 21128 19847 30308 9493 -3699 20164 23405 5767 5193 -4675 10162
11515 10162 33346 46920 31441 19616 9349 7014 -2834 3212 4172 12065 35001 59293 70486
11502 70486 62013 38460 36666 -4896 -19277 -878 23567 -10633 -13230 -12631 -538 -11590 -21162
11489 -21162 -2589 -3978 18795 54790 61881 52210 24641 30329 29342 36262 7925 -12031 -30705
11476 -30705 -43520 -54006 -32232 -57928 -61812 -23616 -11244 -45185 -56377 -26856 -14151 -17399
11464 -17399 -26086 -34504 4049 -14735 -44711 -36808 -34332 -33052 -18396 -17005 -21028 -5087 -5018 5812
11450 5812 -11629 -21394 -1683 11180 8237 18270 15484 28088 22868 16095 -655 -24481 -51918
11437e1918J638r102J1537L1068K1295Q068k1992k3663J6353m351j4973k0816
11425e6856k918K7061j1886j3484J7594K9194q968k8985r451K0061J5373N448
11413a7817L3367m319k7819j4552L817j1623Q926j840J0211J3019n091k734m439
11400b0894J0708L767o418K0862p562j5569k4485Q494J3088J838J4489K5517k6129
11387b294N693K4812K8055j3553j7110J3545J006k5595M746k9314l7859q210q848
11374f4926l748L1464J4225K4176K7055J5887Q172k6760j7715j6408p00j4750
11362b4028J212j4763l2357j5730J9221J1162O906K9449K3531O122n699m041l0355
11349b9370p754j8693l734J5899l0175j6615J0901L2541q043O872j5871L662L3466
$$ plain form
11437 -51918 -50280 -59382 -47845 -16777 4518 12586 -9406 -33069 -16716 -21067 -36040 -56856
11425 -56856 -59774 -32713 -44599 -58083 -40489 -11295 -20263 -49248 -58699 -38638 -23265 -17817
11413 -17817 15550 11231 -16588 -31140 -27323 -38946 -30020 -31860 -21649 -8630 -13721 -16455 -20894
11400 -20894 -10186 -6419 -12837 8025 463 -15106 -39591 -31097 -18009 -16171 -1682 23835 -2294
11387 -2294 3399 28211 56266 42713 25603 39148 40154 14559 19305 -10009 -47868 -56078 -64926
11374 -64926 -68674 -37210 -22985 1191 28246 44133 52305 25545 7830 -8578 -9278 -24028
11362 -24028 -22816 -37579 -69936 -85666 -66445 -55283 -48377 -18928 4603 10725 5026 985 -29370
11349 -29370 -37124 -55817 -59551 -43652 -73827 -90442 -79541 -47000 -55043 -48171 -64042 -60380 -26914
11336b6914K6591J6731l4724l0180k5168K2961R567Q965J7533m724M9630J5928
11324D6196p554n41k6714k1505L652Q224j5409j3181M5367P580L385J1060l197
11311C7363k3777K6758J3706j6570L3497r197j0441o806r887k5057M946p314R182
11298A6403O331J6944l9347j5444O536J7793Q403K456J8390j6510j7635K6763
11286C1083Q837j1098k9243K900L3971K0687L011J5893o526j4597k6692j5340
11274A2886k5718n657N681k45J0621K8905k0368J411J2363M6733p597M504p602
11261E5917j1642l091L914j6504m2477l4797j1134K0880K0454J5511L5481R011
11249D1523q518l0337J0751J2601j595j8057j2357O496J3989l405J9166l364o401
$$ plain form
11336 -26914 -323 16408 -18316 -48496 -73664 -50703 -41136 -32171 -14638 -19362 30268 46196
11324 46196 38642 38101 11387 -10118 -6466 1758 -13651 -26832 18535 26115 29500 40560 37363
11311 37363 13586 40344 54050 37480 70977 61780 51339 44533 34646 9589 14535 7221 16403
11298 16403 22734 39678 331 -15113 -8577 9216 17619 20075 38465 21955 4320 31083
11286 31083 39920 28822 -421 2479 36450 57137 60148 76041 69515 54918 28226 12886
11274 12886 -12832 -18489 -12808 -13053 -2432 26473 6105 7516 19879 66612 59015 63519 55917
11261 55917 44275 41184 45098 28594 -13883 -48680 -59814 -38934 -18480 -2969 32512 41523
11249 41523 33005 2668 13419 26020 24425 6368 -5989 507 14496 11091 30257 26893 20492
11236B0492p109k7115r598M167Q090k867p794J3850K4709n66k867K8844m981p419
11222B9836L3310J1090M762k1346J4780K7137m271j6041K1977J7128l970O602
11210A20994k2731L911J5464L2872M8303K8965P6882Q3417J02180K21939L80173
11199A092369N46079N59578L32175M3811p4782l26574n91972n35046l30469k05934
11189E09235j23549p3523k2406l6890n0534m9224l4420k2642o884K0414O69r318
11177A00928P137j9168j1793k5791N370J4700J8519j880l1069j8935J0976j4751
11165C4243M540K6230Q188l7874k5419j871J6612M6554N614J139J7260n655k4122
11152F5439k4117n261Q878k0188j0830K854r309j6327K3514j6348k7554R858J9739
$$ plain form
11236 20492 13383 -13732 -23330 -19163 -11073 -13940 -21734 -7884 16825 16259 13392 42236 37255 29836
11222 29836 63146 74236 78998 57652 72432 99569 95298 79257 101234 118362 114392 120994
11210 120994 98263 102174 117638 150510 198813 227778 304660 388077 490257 712196 1092369
11199 1092369 1638448 2198026 2530201 2574012 2499230 2172656 1580684 1045638 715169 509235
11189 509235 385686 312163 289757 252867 202333 153109 118689 96047 89163 109577 110246 100928
11177 100928 108065 88897 77104 51313 56683 71383 89902 88022 56953 38018 48994 34243
11165 34243 38783 65013 73201 35327 9908 8037 24649 71203 76817 77956 95216 89561 65439
11152 65439 41322 36061 44939 24751 13921 16775 7466 -8861 14653 -1695 -29249 -19391 348
11139C48J0803J5052j5406j9996k9449R887L5122K01j0619L2005L0781k57j2444
11126D6028k3203L183J9496R735R648j9716r962J1255K4502l6357k3841K0531
11114C1299J1497j5298pK3036n923l03k5875k2102k7459J6646J3375J9649K9181
11101D7716J2801Q372j4302q231m1242m7542k8226J7995K5116K7470n551J746
11089c878j1311J4918J7291l835q045j305J8471J318o154k325o3j061J1543O713
11075C2277J4841l965k2284O700J8519k4468j0694M492J896J2124k936o3486l6294
11062g3278K6943L9053K8764J3065r196j6725K3923N725J1818o146k2307R365
11050C1004M1989M620M0310O9422O2223L7130K5558J9204m9179o7296m0920k6563
$$ plain form
11139 348 11151 26203 10797 -9199 -38648 -28761 6361 6562 -4057 27948 58729 58472 46028
11126 46028 22825 26008 45504 55239 64887 45171 35209 46464 70966 34609 10768 31299
11114 31299 42796 27498 27491 50527 44604 44301 18426 -3676 -31135 -14489 -1114 18535 47716
11101 47716 60517 68889 54587 46356 5114 -42428 -70654 -52659 -27543 -73 -5624 -3878
11089 -3878 -15189 -271 17020 13185 5140 3835 22306 23624 17470 15145 15082 14021 25564 32277
11075 32277 47118 43153 20869 27569 46088 21620 10926 15418 17314 29438 26502 -36984 -73278
11062 -73278 -46335 -7282 21482 34547 25351 8626 32549 38274 50092 43946 21639 31004
11050 31004 72993 77613 117923 187345 249568 286698 312256 331460 282281 214985 174065 147502
11038A47502m2688n0967k4578K842k103j5746J9956M667j9214M659K8828M4793
11026I7951N020k3651j2995o854O536J8898m0703k2074o680n406J8259k773o009
11013A9519j316k3843q757J1752j7020q852j4076P454M3082L4563r508k2776l6882
11000b6660K705j5581J3355k811J4951J5673K0969j9211R374N9610J4041m260
10988H2155j5184P661M6212J6692o1468n6928m9549J0855L3368M3647R2845N2196
10976B02502N2454N6967N260m3006p8282j4587L326k0214m2748k5156J7746J2034
10964A26296M4833J0473k4646k5985k7940k2359j9J6704m825K5179L8442j3352
10952A42801n4805o9078k6032j5338L1454N2230j346L0279J9538M7480J5283Q372
$$ plain form
11038 147502 104814 53847 29269 32111 30008 14262 34218 38885 19671 24330 53158 97951
11026 97951 102971 79320 66325 59471 66007 84905 44202 22128 15448 10042 28301 25528 19519
11013 19519 18203 -5640 -14397 -2645 -19665 -28517 -42593 -35139 7943 42506 32998 10222 -26660
11000 -26660 -23955 -39536 -26181 -28992 -14041 1632 22601 3390 12764 72374 86415 82155
10988 82155 66971 74632 120844 137536 76068 19140 -30409 -19554 13814 57461 150306 202502
10976 202502 254956 311923 317183 274177 195895 181308 184634 164420 121672 96516 114262 126296
10964 126296 171129 181602 156956 130971 103031 80672 80653 97357 92532 117711 156153 142801
10952 142801 87996 18918 -7114 -22452 9002 61232 59886 90165 109703 157183 172466 180838
10940A80838J7032j3380J2719P0421j0547l7911L470j3155J544J4742j6072O300
10928B16001q28P841J123J9444N3807K9257K8093O9191N1523o4090p2911n9421
10916B79030j05074q6054j6839K0784L493J0194K2076m090k329L1793J9196o593
10904A65587j1790J0393K9317M8899L7462P72k7666J0517J010k1708q632k6452
10892B07709L4336N078j2286J926K6331K5493J9074M0L7909N4004L1814R607K132
10879D43167K4560n741k0290r175J042N3850R2536J30015Q1066M321j1688M429
10867G88092p2268q2659o6725k1703j8653L7766M1128L7310L8694J4695J4319
10856G09996J9570k648n973K968K4331N7662M4875L1317N7097J5184K8482L6024
$$ plain form
10940 180838 197870 184490 197209 267630 257083 219172 222642 209487 211031 225773 209701 216001
10928 216001 215173 223014 224137 243581 297388 326645 354738 423929 475452 411362 338451 279030
10916 279030 173956 87902 71063 91847 95340 105534 127610 123520 121191 152984 172180 165587
10904 165587 153797 164190 193507 242406 279868 280640 252974 263491 264501 242793 234161 207709
10892 207709 242045 247123 234837 236763 263094 288587 307661 307701 345610 399614 431428 441035 443167
10879 443167 467727 461986 441696 432521 433563 487413 579949 709964 791030 795351 783663 788092
10867 788092 715824 633165 566440 544737 526084 563850 604978 642288 680982 695677 709996
10856 709996 729566 726918 720945 723913 748244 805906 850781 882098 939195 954379 982861 1018885
10844A018885OJ9392L6825L9760J7256M6375Q5219N8711J6811k6184k0189m148
10832A288719M2120J05477R9091R0033J36402J50339J43775J74862J82108J83854
10822B596780K05474K02710K20193K71403L20289L50283M04746N65660Q01792
10813E939330J032736R89807P20452P12956P58782N90323P44635J324326J945368
10804A4758715K367558K740699L327846M090453N305383P576407J1522489J8601432
10796G0290982L1698599N6007757R4259907J18063532P5179428J6583175q29203
10789D61254177l8703553j00475884j07805505o9174094m0157250k4752057j6335324
10782F3850510j1321014q119768o138568m982243m148715l570053l151639k661085
$$ plain form
10844 1018885 1018891 1038283 1075108 1114868 1132124 1178499 1263718 1322429 1339240 1313056 1292867 1288719
10832 1288719 1330839 1436316 1535407 1625440 1761842 1912181 2055956 2230818 2412926 2596780
10822 2596780 2802254 3004964 3225157 3496560 3816849 4167132 4571878 5137538 5939330
10813 5939330 6972066 7961873 8682325 9395281 10154063 10744386 11489021 12813347 14758715
10804 14758715 17126273 19866972 23194818 27285271 32590654 40167061 51689550 70290982
10796 70290982 101989581 157997338 252257245 370320777 445500205 462083380 461254177
10789 461254177 422550624 322074740 214269235 145095141 104937891 80185834 63850510
10782 63850510 52529496 44409728 38271160 33288917 29140202 25570149 22418510 19757425
10774A9757425k024075j384022q77462q43545j029383r87805j085795j337277
10766A0188061j240376r32174p27845n88616n18103m27683m22459l58891k90039
10757D681875k16729k07203k30399k22072j73933j67473j94117j92459j28581
10748B948909j18580j19969j65183j69499j30178j48563j45834r3268n8641o1988
10738A737206p2250m0351n1958r0148p5857m5761l1299l2076m2055o554m3332
10727A205565o0005l2085m2804m2420j7194j1847l5033o0586m4984j6307m8053
10716G94247m3452j1267p802J0912n4569q4732j2418j435j3802k1610k1716K920
10704E35276J5491j2262l6281p4718j8262J5350J0792o050k5136q844K2728K1668
$$ plain form
10774 19757425 17733350 16349328 15471866 14628321 13598938 12611133 11525338 10188061
10766 10188061 8947685 8015511 7287666 6699050 6180947 5753264 5330805 4971914 4681875
10757 4681875 4465146 4257943 4027544 3805472 3631539 3464066 3269949 3077490 2948909
10748 2948909 2830329 2710360 2545177 2375678 2245500 2096937 1951103 1857835 1799194 1737206
10738 1737206 1664956 1624605 1572647 1482499 1406642 1360881 1329582 1297506 1255451 1248897 1205565
10727 1205565 1145560 1113475 1070671 1028251 1011057 999210 964177 903591 858607 842300 794247
10716 794247 750795 739528 731726 742638 688069 603337 590919 589484 575682 554072 532356 535276
10704 535276 550767 538505 502224 427506 409244 424594 435386 429336 404200 395356 418084 439752
10692D39752l5759j4679L0478j9981l6253k0761j9367j1105L2589k446q966K9162
10680C62664R589J671k665K0812J5199K7384m275k0961L130K9156L0701M7676
10668E20081O3848J0278n4421r7664p0193p3130r4342p2550m3728K2019K3510
10657A33708L1183K1731l2755k5637j2374Q87K0584n45k2302L762M957R05J3176
10644A37280K4366Q643l3173k4352Q560l97K8368O899L0077P0910K3549K9998
10632C10728j4885n3248m8322l9391j644j6124J789J5518J504J9297k0219k4816
10620A30187l0452K0221N996l6038p543K2682r312r681m8810o1111j0269l1532
10608f5662m0512k5185K9795O4727P7827Q5292J12299K146m5961j0172J0423Q732
$$ plain form
10692 439752 403993 389314 419792 399811 363558 342797 323430 312325 344914 342468 333502 362664
10680 362664 372253 373924 371259 392071 407270 434654 430379 409418 412548 441704 472405 520081
10668 520081 583929 594207 539786 442122 371929 298799 204457 131907 88179 110198 133708
10657 133708 164891 186622 153867 128230 115856 116743 137327 136782 114480 118242 123199 124104 137280
10644 137280 161646 170289 137116 112764 121324 120927 149295 156194 186271 257181 280730 310728
10632 310728 295843 242595 194273 154882 153238 137114 138903 154421 155925 175222 155003 130187
10620 130187 99735 119956 125952 89914 82371 105053 95741 86060 37250 -23861 -34130 -65662
10608 -65662 -106174 -131359 -101564 -36837 40990 126282 238581 240727 194766 184594 195017 203749
10596B03749j5156k0611m7240k5777L201k4303J6787K7037L0225Q749l6466j0143
10584A10052J5880N249P826L8669n752k9053j436p362o729K0560j0486M7J2847
10571A50312k8596k8108K5513k618j3551j0955l6407r633J2390K6271l154K5833
10559A07297J356m699j3201M811j3494j4566K5714q172j7841R247J5473k476k0017
10546F9432o537M006K1945J9256M460j0987j4863l376p719K7244J3293J118o668
10533A10604k4582k986K1120j3557r659j4349Q663m773J5706o835J1126n580j3951
10520G0947k1091r420j3922J0307L6804J017j8703o373j1124K85M593K4955L2920
10507A01195J4650k9865n4241q961J7694J8634p613r044l819O029l753k8197J357
$$ plain form
10596 203749 188593 167982 120742 94965 98166 73863 90650 117687 147912 156661 120195 110052
10584 110052 125932 131181 139007 177676 171924 142871 141435 134073 127344 147904 137418 137465 150312
10571 150312 121716 93608 119121 116503 102952 91997 55590 45957 58347 84618 81464 107297
10559 107297 108653 103954 90753 95564 82070 67504 93218 85046 67205 76452 91925 89449 69432
10546 69432 62895 66901 88846 108102 112562 101575 86712 83336 75617 102861 116154 117272 110604
10533 110604 86022 83036 104156 90599 80940 66591 75254 70481 86187 79352 90478 84898 70947
10520 70947 49856 40436 26514 36821 73625 74642 55939 49566 38442 38727 43320 68275 101195
10507 101195 115845 85980 31739 22778 40472 59106 51493 42449 38630 44659 40906 12709 14066
10494A4066K9760J1162l624n474J9093K4173j7471m081m835j1779m3061j9136
10482a1207K7606K7428K8846o906q425J9624L082K3116j5183j641R459l400j1623
10469H0776K0685O375j3002L339K3318M7439M2337K8793Q89k6269l5681m2834
10457A36165m0515j0800O616K1500k6278m5841j4099J4310N678j855j1367j660
10445C1854J1116Q977R764J7635J5483p990K477j128J5783Q862k6366R616L2973
10432A29056r730m3673j0912l700m3321k516L0830J2955k0899j9165r157L94J4704
10419B4866J6112j920K9120j20l0036j6787J5782J7329k3362j9387K2316K6641
10407F0554L254k9311l272J6460J7481m513p164K4095j2108P256L5273L8598K9177
$$ plain form
10494 14066 43826 54988 51364 45890 64983 89156 71685 67604 62769 50990 7929 -11207
10482 -11207 16399 43827 72673 65767 57342 76966 80048 103164 87981 86340 95799 92399 80776
10469 80776 101461 107836 94834 98173 121491 168930 211267 240060 240949 214680 178999 136165
10457 136165 95650 84850 91466 112966 86688 40847 26748 41058 46736 44881 33514 31854
10445 31854 42970 51947 61711 79346 94829 86839 89316 88188 103971 112833 86467 96083 129056
10432 129056 119326 75653 64741 61041 17720 15204 46034 58989 38090 18925 9768 10162 24866
10419 24866 40978 39058 68178 68058 38022 21235 37017 54346 30984 11597 33913 60554
10407 60554 63808 34497 31225 47685 65166 60653 53489 77584 65476 72732 108005 146603 175780
10394A75780M71j576J5811L077Q141J8238N1703Q4413J40416K04140L38840N00451
10382A539905N73554L28748N5867l2187k55081n46695n42210l12957j91491j03259
10372E14194q0961o1204p8325n6571l3824m3489J367j5131m6016M569R123k3688
10360I0044j7260j3778m68m497J201K3084K77k3547l6306k4522j3614M727L2518
10347A7859M2214K6253q603j1620m416L611M630J2886Q647R317k0346m0714k3922
10334A5796O183J5959p119l646K233M1364M1407L8082L2483K4899m117j138K8401
10321B30787K5903K6521m011k9600m8794m0127k5620k1413j9521j5962K623j8641
10309F2145L050L8014M386k4560k5099M610n981R629j9903k9926j5776J2690M8782
$$ plain form
10394 175780 176251 174675 190486 193563 201704 219942 271645 356058 496474 700614 1039454 1539905
10382 1539905 2113459 2442207 2498074 2465887 2210806 1664111 1121901 808944 617453 514194
10372 514194 433233 372029 293704 237133 203309 159820 161187 146056 100040 104609 113732 90044
10360 90044 72784 59006 58538 54041 55242 78326 78603 55056 18750 -5772 -19386 -14659 17859
10347 17859 60073 86326 77723 66103 61687 65298 69928 82814 91461 100778 80432 39718 15796
10334 15796 21979 37938 30819 27173 29406 70770 112177 150259 182742 207641 203524 202386 230787
10321 230787 256690 283211 279200 249600 200806 160679 135059 113646 94125 78163 80786 62145
10309 62145 65195 103209 107595 83035 57936 62546 56565 66194 46291 16365 589 13279 62061
10296F2061J6922m4189j4524J5920m143l0928J8004M2572J1171l5235k1235k3533
10284g137m438K080k286J1987p170j5359K814N347J3717J299N613L7780K6090
10271G0337k1845j8999r685j2617j3692m222k2454K8068k177K443j1543K2810
10259F424O306n625k77k8028k3250k629L9856J3663J8547j6453K8534M050m0990
10246A28k0212J8384J078k339J1910n140q266L658n996m432L391m005j2190o5
10232b4096J9759N241n05J2918K887J4808J370p229j6805l7487q5L2051Q428P540
10218A8795j1733j6615K1092l6224l5030J9369O9976k100k2877K1053L0423k420
10206E3709j6074r388k2075j0544J6746K9727L2746j334l0891m4130r908l86n613
$$ plain form
10296 62061 78983 34794 20270 36190 32047 1119 19123 61695 72866 37631 16396 -7137
10284 -7137 -11575 -9495 -11781 206 -6964 -22323 -19509 -14162 -445 854 6467 44247 70337
10271 70337 48492 29493 19808 7191 -6501 -10723 -33177 -5109 -7286 -4843 -16386 6424
10259 6424 12730 7105 6828 -21200 -44450 -47079 -7223 6440 24987 8534 37068 41118 128
10246 128 -20084 -1700 -622 -2961 8949 3809 -4457 -799 -6795 -11227 -7836 -11841 -24031 -24096
10232 -24096 -4337 904 399 13317 16204 31012 32382 25153 8348 -29139 -29224 2827 11255 18795
10218 18795 7062 -9553 11539 -24685 -59715 -40346 29630 27530 4653 25706 56129 53709
10206 53709 37635 28247 6172 -4372 12374 42101 74847 73513 42622 -1508 -11416 -11802 -17415
10193a7415K72j5003K1567M8049R403L759j1127r119m584j4687j3321j2875J1267
10180c814k2584J0832J8156K0162L612j896j894J9791R173l791j3489O340j0860
10167B9738j030N04o15P648J6055J95l370l1067k4051L093R878L440k405J8742
10153B6755r447j1101P463M690p073k491Q278j3297J6786k4034M299l07j2363
10140a1842k6842k374k908r799r5K3244K9884J1874M780J1972q910r777Q766l989
10126A3984J6073L0995K702m1300k7007J825K460j0948K204J4887K2368J3094
10114D1337k1953l7492l899L464R679K0940j2496N263l5233K8642K5241J1377
10102C4870J1882K102q233Q58j1434p750M639j2899M6226j709k7402j743N0513
$$ plain form
10193 -17415 -17143 -32146 -10579 37470 46873 50632 39505 30386 25802 11115 -2206 -15081 -3814
10180 -3814 -26398 -15566 2590 22752 26364 24468 22574 42365 51538 47747 34258 40598 29738
10167 29738 28708 29212 28597 36245 52300 52495 49125 18058 -5993 -2900 6978 10418 8013 26755
10153 26755 17308 6207 13670 18360 11287 8796 17074 3777 20563 -3471 828 521 -11842
10140 -11842 -38684 -41058 -43966 -53765 -53860 -30616 -732 11142 15922 27894 18984 9207 17973 13984
10126 13984 30057 61052 63754 22454 -4553 -2728 -268 -11216 -9012 5875 28243 41337
10114 41337 19384 -18108 -22007 -18543 -8864 12076 -420 4843 -30390 -1748 23493 34870
10102 34870 46752 48854 40621 41479 30045 22295 26934 14035 60261 58552 31150 29407 79920
10089G9920J1544M58k6465j863n547m5573K9646L0735j4483j9293r865L2097J036
10076F2347j5819J03M4962R700j1587n026L429M376n87Q23L927K3362P407M748
10062A32165L6863K863L788j8338K5540N6266O7190Q9921J12409Q9883K5516j2395
10050F11671j8904K1992N0924J24122J88844K19538K91754M03508N78936Q59511
10040C331896J456094K763207N558604J0752641J3468546K282583j1275839j2099925
10032A6237807o190605l130039j815933j147272q14298n84429m13452l21847k61089
10023A558843j81189j83284j75384j07279r3560l6319L6217R20q8828j13158o1710
10012E55269n0505r6239l6940j7710m0997k4153j9095j8733K780l357j0722k5822
$$ plain form
10089 79920 91464 91922 65457 63594 58047 12474 42120 72855 58372 39079 29214 61311 62347
10076 62347 46528 46631 91593 101293 89706 84680 88109 92485 91898 92721 96648 120010 127417 132165
10062 132165 169028 171891 175679 157341 182881 239147 306337 396258 508667 598550 624066 611671
10050 611671 592767 614759 665683 789805 978649 1198187 1489941 1893449 2472385 3331896
10040 3331896 4787990 7551197 13109801 23862442 37330988 39613571 28337732 16237807
10032 16237807 10047202 6917163 5101230 3953958 3139660 2555231 2141779 1819932 1558843
10023 1558843 1377654 1194370 1018986 911707 818147 781828 818045 818965 730137 616979 555269
10012 555269 504764 408525 371585 353875 312878 288725 269630 250897 253677 250320 239598 213776
10000B13776k8727k0027j0164k2988K6380M5150j5911l9609M484k1176j2093l5120
9988H3975j7105N199J4071M128j5831j4698k0239j2753O817K5544N0815l525q10
9975A05588j584m872k3863k3288K3166L799k9222q800J1322k5686o406J4886K0669
9962E5709j9233o53Q679j2311j9120j6315o337J6147J8043K5371J1336j8578o90
9949D2048j1515j3150p973L4249j5425K239L1999K279l3550l9375J907j1402J8184
9936E15L0777j471k3614R824K8715J0827m690L126l955K0766J8098j2124p802
9923F8992k1908m322K1447j2479q714K8829j3629q98j072j9334k0917L921M7929
9910F7845k5204m9850o311L470Q162k0142p008N210L061N592P666J0209Q299j6368
$$ plain form
10000 213776 185049 165022 154858 131870 158250 203400 187489 147880 152364 131188 119095 83975
9988 83975 66870 72069 86140 90268 74437 59739 39500 26747 33564 59108 109923 106398 105588
9975 105588 104004 99132 75269 51981 75147 78946 49724 40924 52246 26560 20154 35040 55709
9962 55709 36476 35823 44502 32191 13071 -3244 -9581 6566 24609 49980 61316 42738 42048
9949 42048 30533 17383 9410 43659 28234 30473 62472 64751 31201 -8174 -6267 -17669 515
9936 515 31292 29821 6207 16031 44746 55573 50883 54009 50054 70820 88918 76794 68992
9923 68992 47084 42762 64209 51730 43016 71845 58216 57318 56246 36912 15995 19916 67845
9910 67845 42641 -7209 -13520 -10050 -1888 -22030 -29038 -23828 -20767 -15175 -7509 2700 10999 -5369
9896e369O060J3574k8986r504K769l1995j6299K0669J9579p275k8658J9309J0310
9883c5816L6789k9311j6920O177K5717K7644K0974K6973R19l3799L911r496j2039
9870A1723j0738J8205l3030k4846r054l387R566j1027q827l210L2243M417M2421
9857A4456K3027n764j6967j4855m6473j2569o22J3818o928r936j3881Q016J3209
9844e5469K5821K5253J9607R137j2502m744k59J6632m0279l3121q300R552n641
9831e4313J2926J8087K5204l754k0380n069j1381J9676J6591N602J5042j6155
9819B076p202L359N913k921j9890J5873L540P297k737k3598r137l458j4856o80
9805d6421K8447J9931Q545o515P71k7262K428Q806n904n727K2325L726j9615m838
$$ plain form
9896 -5369 691 14265 -14721 -24225 -21456 -53451 -69750 -49081 -29502 -36777 -65435 -46126 -35816
9883 -35816 973 -28338 -45258 -39081 -13364 14280 35254 62227 63146 29347 33258 23762 11723
9870 11723 985 19190 -13840 -38686 -47740 -51127 -41561 -52588 -61415 -64625 -32382 -27965 14456
9857 14456 37483 31719 14752 -103 -46576 -59145 -59767 -45949 -52877 -62813 -76694 -68678 -55469
9844 -55469 -29648 -4395 15212 24349 11847 7103 6844 23476 -16803 -49924 -58224 -48672 -54313
9831 -54313 -41387 -23300 1904 -1850 -22230 -27299 -38680 -19004 -2413 3189 18231 2076
9819 2076 -5126 -1767 4146 1225 -18665 -2792 748 8045 5308 -18290 -27427 -30885 -45741 -46421
9805 -46421 -17974 1957 10502 3987 4758 -22504 -20076 -11270 -17174 -22901 -576 3150 -16465 -21303
9791b1303R809L973k260L892j2915j8628j5719R086M600P231K6005J6479J1164
9778B1414J7033N51l479r965k1505J0522K8566L393k7622l3621L58J8508k997
9765A156J6580M342p191q112j3075j7932R837k669O332l495J1560M685j7205p767
9751b2954m437K1216J4606K243N263j5084k9990K9485J6949k766k8262k22Q093
9738e860R848k0111j3935k72J4171j461m3J1745K0857K0419q983k549l5955n6353
9724f8482R507K315J8481J6837K9396L5971m0993j9607l3318l2781K1909K9950
9712c0815j458p149P705J2173L3935J2443J016k319j403j5855j1476j1701K2142
9699G238j0275k7887L973N663j919J467J4282j9635K6414J4966l2183J9086J052
$$ plain form
9791 -21303 -11494 -7521 -9781 -5889 -18804 -37432 -53151 -44065 -39465 -32234 -6229 10250 21414
9778 21414 38447 38998 35519 25554 4049 14571 43137 46530 18908 -14713 -14355 4153 1156
9765 1156 17736 22078 14887 6775 -6300 -24232 -14395 -17064 -10732 -14227 -2667 2018 -15187 -22954
9751 -22954 -27391 -6175 8431 10674 15937 853 -29137 348 17297 14531 -13731 -13953 -5860
9738 -5860 3988 -16123 -30058 -30330 -16159 -17620 -17663 -5918 14939 35358 26375 23826 -12129 -68482
9724 -68482 -58975 -56660 -38179 -21342 8054 44025 3032 -16575 -49893 -82674 -60765 -30815
9712 -30815 -32273 -39422 -31717 -19544 14391 26834 27850 25531 24128 8273 -3203 -14904 7238
9699 7238 -3037 -30924 -26951 -21288 -23207 -21740 -7458 -27093 -679 14287 -17896 1190 2242
9686B242P33k527o335M964j4966j3666k0032Q298P617l434L8k221J1241J0954
9672a7094J1482K2671k3946l1034M932l416l613K2232j5284J1812p769l4231J6567
9659d6691M4232J8012m442J1817R695J5904j3744m3308n9769M137N807K1288K0779
9646a6283j9568j4557L1945K4005K0970J6913p052j185j9117L320J7877J9378
9634E6646K6690J083L342p313J2178o691k4792j1259k828N05k0434m4134J007
9621a6000J8259p590p35j0501J607J1142j001P738j0293k3008m842P765j169L8692
9607A0064l670P7J0087k0334Q350M2124j0079j0459j8580K0707L199j5759l8110
9594b2383l4719K9870K9345J3107j7586k0010r662P192J3219J6153J2422j3165
$$ plain form
9686 2242 2975 448 -5887 -923 -15889 -29555 -49587 -41289 -33672 -37106 -37068 -39289 -28048 -17094
9672 -17094 -5612 17059 -6887 -37921 -32989 -36405 -40018 -17786 -33070 -21258 -29027 -63258 -46691
9659 -46691 -2459 15553 11111 22928 32623 48527 34783 -8525 -68294 -64157 -58350 -37062 -16283
9646 -16283 -35851 -50408 -18463 5542 26512 43425 36373 35188 16071 19391 37268 56646
9634 56646 83336 84419 87761 80448 92626 85935 61143 49884 47056 47561 27127 -17007 -16000
9621 -16000 2259 -5331 -6066 -16567 -14960 -3818 -4819 2919 -7374 -30382 -35224 -27459 -28628 10064
9607 10064 6394 6471 16558 -3776 4574 46698 36619 26160 7580 28287 31486 15727 -22383
9594 -22383 -57102 -27232 2113 15220 -2366 -22376 -32038 -24846 -11627 4526 16948 3783
9582C783j1022K4684R528l2909l216l7843R91L2721J9047J1316k1397R453n058
9569G8j1698j628R448k6181n638J8285J7137k213j8938l860J3197M144J738l671
9555i800K4135L2978J8370j7219N81Q735j2137l5716j5853O577J6879j440j4962
9542A128l0690p514M634L9668O380j387J7187o146l6675m0123L664P083K4370
9529a8421J1530K9113K5231o157k643j3238q957J039L0157J8385j1800m478l2539
9516A7222l544n41K9505J7428j8545l0179k6858j5153K6155L4940J0326k8869
9504A1887j4325j3785Q869J382J0850J1394M430j0065j3025p464J8274K843k2524
9491a1259j0303r233J3678P55j2085K278J7460K162K1304J6795n455j4948K1135
$$ plain form
9582 3783 -7239 17445 26973 -5936 -9152 -46995 -46004 -13283 5764 17080 -4317 5136 78
9569 78 -11620 -13248 -3800 -29981 -35619 -17334 -197 -2410 -21348 -25208 -12011 -7867 -6129 -9800
9555 -9800 14335 47313 65683 48464 49045 57780 45643 9927 -5926 651 17530 16090 1128
9542 1128 -29562 -37076 -32442 7226 13606 12219 29406 23260 -13415 -53538 -49874 -42791 -18421
9529 -18421 -6891 22222 47453 41296 38653 25415 16458 17497 47654 66039 54239 49761 17222
9516 17222 13678 13137 42642 60070 41525 11346 -15512 -30665 -4510 30430 40756 11887
9504 11887 -2438 -16223 -7354 -5972 4878 16272 20702 10637 -2388 -9852 8422 11265 -11259
9491 -11259 -21562 -30795 -17117 -16362 -28447 -26169 -8709 -6547 14757 31552 26097 11149 32284
9478C2284k892j6163k3735j052L3953J5650m528R786R223j8844P388j3058k2076
9465E936j6365n790m852r944o59L9129j0234l3070p664K2265J0554o825K0414
9452B895L9059J9157j3145l6275J7447p528J722J7824k8062j9658q597J437M847
9439h877L8727L1100J5877j8099j3182j1814r912K8898r226j1548J2882J5475
9427F0301k9992l6514K5606K4778L2180k876k2556q686o42j1357N577L026q184
9414C0661p272n75J1457r646O213j5554k1539j0354n678r96Q684L6791K4514J7080
9400F3786l1205k7146J0726M286J3341m6990j7780J6929O007P836L186L0400L9668
9387G3044K0062k8570o673M785o570L81L14j2708j7219J7363M293k5539l3588
$$ plain form
9478 32284 29392 13229 -10506 -11558 22395 38045 33517 43303 52526 33682 41070 28012 5936
9465 5936 -10429 -16219 -21071 -31015 -31674 7455 -2779 -35849 -43513 -21248 -10694 -17519 2895
9452 2895 41954 61111 47966 11691 29138 21610 23332 41156 13094 -6564 -15161 -13724 -8877
9439 -8877 29850 60950 76827 58728 45546 33732 23820 52718 43492 31944 44826 60301
9427 60301 30309 -6205 19401 44179 76359 73483 50927 42241 41599 30242 35819 38845 30661
9414 30661 23389 22814 34271 24625 30838 15284 -6255 -16609 -22287 -23283 -14599 22192 46706 63786
9400 63786 32581 5435 16161 20447 33788 -13202 -30982 -14053 -8046 -210 2976 33376 73044
9387 73044 93106 64536 57863 62648 56078 56459 56773 44065 26846 44209 48502 22963 -10625
9374a0625P009J5262p459m813R677o848Q570J5082j2905K2771K1303j4689j2329
9361C0006J3843O26j9551J2546J534P029K046k207N817J4059j619k4483j1166
9348B8480j4133j2660Q747O577J4797J4489J9950n882J6886k066q903M46J6669
9335H3397q114q864k7109J9663K2607k612K2037R552N884p212r624O759M8252
9322A54616L2289O8090J17926J94515J80574P7949j17276j84080j51454j04461
9312B68688n9439p695R307l7908j6213o125O484j1819j1908l5134K3398J5730
9300A37366k7890k4404k3125J8523K4305J8749R761j2791K021J6354m174j9889
9288A14806K5190M2430K9370J2592n3176L7405N1662O108J3055J4819L5156O0443
$$ plain form
9374 -10625 -3616 11646 4187 -626 9051 2203 10773 25855 12950 35721 57024 42335 30006
9361 30006 43849 44475 24924 37470 39004 46033 48079 45872 51689 65748 64129 39646 28480
9348 28480 14347 1687 10434 17011 31808 46297 66247 60365 77251 75185 66282 66728 83397
9335 83397 75283 66419 39310 58973 81580 78968 101005 110557 116441 109229 99605 106364 154616
9322 154616 186905 254995 372921 567436 748010 825959 708683 524603 373149 268688
9312 268688 209249 201554 210861 172953 156740 150615 157099 145280 133372 98238 121636 137366
9300 137366 109476 85072 61947 80470 104775 123524 133285 120494 122515 138869 134695 114806
9288 114806 139996 182426 211796 224388 171212 208617 260279 266387 279442 294261 329417 389860
9276C89860J14844K12805L56243M19113K66087j58737l90193l30881k19423j25307
9266E34411q1121n2015n2198k7747j4042j5100k586j9490j0993K8917q956j6565
9254B62515K3551K7410K6766R348k2556r255l366K6547J5406L272L0123J9324
9242D09085L2969l280k6059O379N8152N0075J6300J0659K8566L1003N1157R4488
9230G59494J20355J62650K21517J66930k4863j19794j07388p6502K7960K5201
9220A155560M649j8417O8519J04968Q1239N6715P9292J07548O8569J41236J57101
9209B006979J41512J27110J50521J73981K06032J80791J96281K29779K00175K00122
9199C813283J88417J69813J69097J46229R2914O0586L1694k1451j06293q9705
$$ plain form
9276 389860 504704 717509 1073752 1492865 1758952 1600215 1210022 879141 659718 534411
9266 534411 453290 401275 349077 321330 307288 292188 289602 270112 259119 288036 279080 262515
9254 262515 286066 313476 340242 349590 327034 317779 314413 340960 356366 359638 389761 409085
9242 409085 442054 438774 412715 419094 477246 527321 543621 554280 582846 613849 665006 759494
9230 759494 879849 1042499 1264016 1430946 1406083 1286289 1178901 1102399 1130359 1155560
9220 1155560 1160209 1141792 1210311 1315279 1396518 1453233 1532525 1640073 1708642 1849878 2006979
9209 2006979 2148491 2275601 2426122 2600103 2806135 2986926 3183207 3412986 3613161 3813283
9199 3813283 4001700 4171513 4340610 4486839 4579753 4640339 4672033 4650582 4544289 4454584
9189D454584j44834j71242j77853j68464k00129j95401j77159j79734j80951j55707
9179B703110j76827j92829j65446j75218j20009r7477n2016o9152o5684r3016
9169A495436q9168l9240o5417r4567j02600o7739n7190n0989m7878l3878p8858
9158G67912n8570j7767j8095m43j4055l3863l6220k5853M063p649o2056j4558
9146D82846k908j5869m5184n6119o408K997L807n270p950M839j7179m259k2288
9133C11055l3947k2216k656j2736K6655K7932J3067M2490N4316K0128l1175n0000
9121C42913l4712n2751k1799J3320r911n179j4789k5150l204k4399k4614k2030
9109A17695j8228j0852J6832q906k6409L7876N2216L9324J1936J451l5040m3321
$$ plain form
9189 4454584 4309750 4138508 3960655 3792191 3592062 3396661 3219502 3039768 2858817 2703110
9179 2703110 2526283 2333454 2168008 1992790 1872781 1775304 1723288 1654136 1588452 1495436
9169 1495436 1406268 1367028 1301611 1207044 1104444 1036705 979515 928526 880648 846770 767912
9158 767912 709342 691575 673480 673037 658982 625119 588899 563046 567109 559460 497404 482846
9146 482846 479938 464069 418885 362766 356358 359355 363162 357892 349942 354781 337602 333343 311055
9133 311055 277108 254892 252236 239500 266155 294087 307154 349644 403960 424088 392913 342913
9121 342913 308201 255450 233651 246971 237060 231881 217092 191942 188738 164339 139725 117695
9109 117695 99467 88615 105447 96541 70132 108008 160224 199548 211484 212935 177895 134574
9097A34574m2613j8293J2026J5403K5426m026j8611M635M23J5560o814k5974j3353
9084G8363K5377L2311k221M0103J7151k3070J1007l9355l0419k4811j2826P75
9072G2385p34J2723L9821K0165M521k2173k1424J140Q435k590m9106l7464Q017
9059C3716N5495N6070Q2687N6661L235m9400l7180l4033l6033j0073L0808K678
9047A54631j6614K3566Q689N822k8426l3746m9253m3476J234J1703L2949J4188
9035H1267M3766K6833j0593l3372k9154k6021j9338J7882K6386M5875M4594N951
9023A74076k5797k1214R163l651n845j848L5983k474j2222K2435K5914L1338N39
9010B26397K8141J7528P458j0401k5768O32J5571J926K6079L6403K5918K1459
$$ plain form
9097 134574 91961 73668 85694 101097 126523 122497 103886 108521 108944 124504 117690 91716 78363
9084 78363 103740 136051 133830 173933 191084 168014 179021 139666 109247 84436 71610 72385
9072 72385 71651 84374 124195 144360 148881 126708 105284 106424 114859 112269 63163 25699 33716
9059 33716 89211 145281 227968 284629 287864 238464 201284 167251 131218 121145 151953 154631
9047 154631 138017 161583 170272 176094 147668 113922 64669 21193 22427 34130 67079 81267
9035 81267 125033 151866 141273 107901 78747 52726 33388 51270 77656 123531 168125 174076
9023 174076 148279 127065 136228 132577 126732 124884 160867 158393 146171 168606 194520 225858 226397
9010 226397 254538 272066 279524 269123 243355 243987 259558 261484 287563 323966 349884 371343
8998C71343n3823o9979o6461k1064K0107R475N354J9807M9217j208l6343k4169
8986B02256P088j3717J1489M0503M8273M7968K1807L5348J3752j7636p1645R905
8974C35391K2351J6326L1174K8531L8660J7031L0559R719k7197k6652J9171N0128
8962E45192K3357J7957j5117n848M8465L9016K3278M6378M0982J1835L8273K4673
8950H38441J1278O0347J04034J00290J03458J56935J51819M2178L894J520M5144
8939A619338Q6373J28927J43656J69467K24258K40068L09666L87905N16022O92075
8929D517755O93471O33967P43916J072531J528363K174587L144151M819360P810237
8920B7138338J3266429K2946813L6228568L9770588J3404073k5010599l9292932
$$ plain form
8998 371343 317520 247541 181080 160016 180123 189598 194952 214759 263976 262768 226425 202256
8986 202256 209344 195627 207116 247619 295892 343860 365667 401015 414767 397131 325486 335391
8974 335391 357742 374068 405242 433773 472433 489464 520023 529742 502545 475893 495064 545192
8962 545192 568549 586506 571389 565541 614006 653022 676300 722678 763660 775495 813768 838441
8950 838441 849719 910066 1014100 1114390 1217848 1374783 1526602 1568780 1572674 1574194 1619338
8939 1619338 1705711 1834638 1978294 2147761 2372019 2612087 2921753 3309658 3825680 4517755
8929 4517755 5211226 5845193 6589109 7661640 9190003 11364590 14508741 19328101 27138338
8920 27138338 40404767 63351580 99580148 139350736 152754809 127744210 88451278
8913H8451278k9051628j7429219j0611006o903051m744901l359912k471678j804134
8905A2075749j309996r65289o47629m23952l09217j87468j90537l65088m85661
8896G190912m46466l76967k69393j27552J5427R7696J77162K83380M63972O42133
8886G650304Q91908J163146J207772J077077J238449J807830K677262L813283
8878B1527031N539322Q445194J3695419K3533649M1854409P1240564Q8882966
8871B74718554L9091196m7168849q4381700o2393852l6715323k2010887j4145267
8864D6993872r655051o827430m948248l677927k783591k093498j511380j023438
8856A4473309p90295q57040r20798p87312p73803q76995q90127p44824n32199
$$ plain form
8913 88451278 59399650 41970431 31359425 24456374 19711473 16351561 13879883 12075749
8905 12075749 10765753 9800464 9152835 8728883 8419666 8232198 8041661 7676573 7190912
8896 7190912 6744446 6367479 6098086 5970534 5985961 6083657 6260819 6544199 7008171 7650304
8886 7650304 8542212 9705358 10913130 11990207 13228656 15036486 17713748 21527031
8878 21527031 27066353 35511547 49206966 72740615 114595024 185835588 274718554
8871 274718554 313809750 266640901 182259201 119865349 83150026 61139139 46993872
8864 46993872 37338821 30511391 25563143 21885216 19101625 17008127 15496747 14473309
8856 14473309 13683014 12825974 11905176 11117864 10344061 9467066 8576939 7832115 7299916
8847G299916l73291k29901j19877m3502N4801J13102K42926L36670M06691M64455
8837H151990N83769Q72959J265551J788212K639463M009705O390932J0704344
8829C6406925J8359520L0421652L9572208K3949405j3848724l7839805l2657947
8822F4363234k0030301j1942681p589900n143001l600490k622013j966853j518567
8814I949428j103607p97644n55569m30869n54402o21086m97256l78980m40860
8805D569155m65251m15863l57337k96366k07734j23869q3888n4218j02079j80863
8795B281687j74287j28856q5997p7990o9502j11362j29824r6780p8678n0526q062
8784A269823m9890q0581m3778p3434m0652l7142m3800m3676n751l1918j8320k3440
$$ plain form
8847 7299916 6926625 6696724 6576847 6533345 6588146 6701248 6944174 7280844 7687535 8151990
8837 8151990 8735759 9608718 10874269 12662481 15301944 19311649 25702581 36406925
8829 36406925 54766445 85188097 124760305 148709710 134860986 97021181 64363234
8822 64363234 44332933 32390252 24800352 19657351 16056861 13434848 11467995 9949428
8814 9949428 8845821 8048177 7492608 7061739 6507337 5886251 5388995 5010015 4569155
8805 4569155 4103904 3688041 3330704 3034338 2826604 2702735 2618847 2564629 2462550 2281687
8795 2281687 2107400 1978544 1892547 1814557 1745055 1633693 1503869 1407089 1328411 1277885 1269823
8784 1269823 1219933 1139352 1095574 1022140 981488 944346 900546 856870 851119 819201 800881 777441
8772G77441j7300l561K747l7679O87k528K2725j9128k9570j1336k5743j1678j207
8759F43870N272L1854J887m2806j0212J4252l533n498J8030n110k4609L7891O1188
8746G22476l432j08590j48695j22721m3681k0541K0606J9848n956l6302J5080
8735B88092K3213k6185o2864l7470q18L2057L3106L5865K674k1154p886j5930
8723B42700q735j2438K5963J1257Q739n647k974J2868N1574K9817m743q108j9716
8710C20557k8106k9322j2960J5201J6730J2060J6944K6889J0838k130l0088n5388
8698B61225o6898m9539j4728K9444M4773j2656m5066k6523j6572l3379j3538l1300
8686B5243N915M8689O9292L8129J7995L0557m556m5960n4724M849k895k900J1110
$$ plain form
8772 777441 760141 756580 759327 721648 722335 719807 742532 723404 693834 682498 656755 645077 643870
8759 643870 649142 680996 682883 640077 629865 644117 640584 635086 653116 648006 623397 661288 722476
8746 722476 719044 610454 461759 339038 295357 274816 295422 315270 309314 273012 288092
8735 288092 311305 285120 222256 184786 183968 216025 249131 284996 287670 266516 258630 242700
8723 242700 233965 221527 247490 258747 267486 261839 258865 271733 323307 353124 348381 340273 320557
8710 320557 292451 263129 250169 265370 282100 294160 311104 337993 348831 346701 316613 261225
8698 261225 194327 144788 130060 159504 204277 191621 146555 120032 103460 70081 56543 25243
8686 25243 31158 79847 149139 187268 205263 235820 231264 185304 130580 135429 132534 129634 140744
8673A40744L160L02J4681L9236J0922j9447k8800k9422J5016M4991O0008K3214
8661B74605r205l866J5803J2715l2592k9626l820l2287P387j9672m2783J1090
8649A47749L762j3832k1890n360J2428J3204k8110k6318K8261J5060P854J9671
8637A52479R776K7891J5385k4529m1776k1093J8836j2219J6669k7303j4037K9696
8625A29775J4857K5847j1970j4392K6563J996o107k186k098L8364J749m0963J3074
8612A74509j0154m0074j4702K438L4056J7573j3110k2098K491K92K2298L3883
8600A87402J9933k3890k2665j0693k285j0219q292M595J2052l3775O133p704L4411
8587A45003N528o432j6617p270Q700P164q213k6384j6114N1586L2094M77j1143
$$ plain form
8673 140744 143904 144206 158887 198123 209045 189598 160798 131376 146392 191383 251391 274605
8661 274605 265400 261534 277337 290052 257460 227834 224014 191727 199114 179442 136659 147749
8649 147749 151511 137679 115789 110429 122857 136061 107951 81633 109894 124954 132808 152479
8637 152479 162255 190146 205531 181002 139226 118133 136969 124750 141419 114116 100079 129775
8625 129775 144632 170479 158509 144117 170680 172676 166569 164383 162285 200649 202398 161435 174509
8612 174509 164355 124281 109579 112017 146073 163646 150536 128438 130929 131221 153519 187402
8600 187402 207335 183445 160780 150087 147802 137583 129291 133886 145938 112163 118296 110592 145003
8587 145003 150531 144099 127482 120212 128912 136076 127863 101479 85365 136951 169045 169522 158379
8574A58379k2720j5967j9291k4137q984q101J6722J5961j584N239l299o261j1251
8561G4706j5232J7093J5407J5283j252j1319k0571j0104j3990j1409k3007p958
8549G647J2104P097Q061l299J0111K4915j333J5229q363k3574J9798L990J041
8536G3424o277j8625j4552J4894J8382J1272J6781k6709q157m786k2671m017q569
8523B0390j4344K0738J2400j5869K3693L6306J1884M9877L4948N4143P8834J26631
8511D39631K04528J93458k2010j70309j74478j08434q5067o3242q98k0785o845
8500A85549m1746k4053J35O578m736k8969n721j1492Q892L9557J1687l1687r172
8487I4822m649L509J0521M621j0206j745l0700j8339O705l750J4821L1052M6374
$$ plain form
8574 158379 135659 119692 100401 76264 67280 59179 75901 91862 90278 95517 92218 85957 74706
8561 74706 59474 76567 91974 107257 106005 94686 74115 64011 50021 38612 15605 7647
8549 7647 19751 26848 34909 31610 41721 66636 65303 80532 72169 48595 68393 72383 73424
8536 73424 67147 48522 33970 48864 67246 78518 95299 68590 60433 55647 32976 28959 20390
8523 20390 6046 26784 39184 23315 47008 83314 95198 145075 180023 234166 313000 439631
8511 439631 644159 837617 815607 645298 470820 362386 277319 214077 213179 192394 185549
8500 185549 143803 119750 119885 126463 121727 92758 87037 75545 84437 123994 135681 103994 94822
8487 94822 90173 93682 104203 108824 98618 96873 66173 47834 54539 50789 65610 96662 143036
8474A43036k895l161K1115p151P0419J25019J83121K96836M31378L63831k7337
8463A594211l71507l75280k48256j38221j07067j07995m2471m4984p031j4878
8453A36521j6542K2531k2941j5961O585k6958k5199O487j2661j4104p68J1292
8441D8282J8870q179J3505L0024J860K549J8656J0033k9978j58j6666p214J2442
8428I4026O693L6633O699K8662O1175O3359J24034J98016J74986J0946j57990
8417F47239j83016j27614o7638o6605m2871o082J377O582K0481k8483l7984P715
8405A23101j6934j6231K100k793o702l5662l9198j1566r46J9596K3027O49k3211
8392A5230k894j218J2981j005m711M068o038L307K8673M108Q197j3870M519J0560
$$ plain form
8474 143036 140141 136980 158095 150944 221363 346382 529503 826339 1257717 1621548 1594211
8463 1594211 1222704 847424 599168 460947 353880 245885 203414 158430 151399 136521
8453 136521 119979 142510 119569 103608 110193 83235 58036 64523 51862 37758 36990 48282
8441 48282 67152 58973 72478 102502 104362 106911 125567 135600 105622 105464 88798 81584 94026
8428 94026 100719 137352 144051 172713 233888 297247 421281 619297 794283 805229 647239
8417 647239 464223 336609 268971 202366 159495 153413 154790 161372 181853 153370 115386 123101
8405 123101 106167 89936 92036 89243 82541 46879 7681 -3885 -4831 14765 37792 38441 15230
8392 15230 12336 11118 24099 23094 18383 22451 16413 19720 48393 52501 60698 46828 51347 61907
8378F1907m6955l1992K0018J0172r820J0969j2287l893n043p968k5999J8275k041
8365b4657L1328m458l297K1003J893J3162K0494m4919q5542K726K7561J2294K2159
8352a0253K8267L1110J3340l4848q162R354m547J4244J6154l7910J4374P683L023
8339D1829l49o632j845j1914j5740N892k5113k2460j2779R002J9394J6788K7868
8326B3941q890k6460j7818Q828K0336J3258l66R49k926k5227j3192N365K1211
8313i91J3998K3287r013n584J1027M151J4769K716k746j6160j3593p813j1447
8300B601j0463K2261K080N922J5131K5323J9156j3843p474l8172r261R238p879
8287A4620R424k541j8224R717J9023O43k1281q012L2005M09k603K4684n739k3725
$$ plain form
8378 61907 14952 -17040 2978 13150 3330 14299 2012 -1881 -6924 -14892 -40891 -22616 -24657
8365 -24657 6671 2213 -1084 19919 21812 34974 55468 10549 -74993 -72267 -44706 -32412 -10253
8352 -10253 18014 49124 62464 27616 19454 28808 24261 38505 54659 16749 31123 38806 41829
8339 41829 41480 34848 33003 21089 5349 11241 -13872 -36332 -49111 -40109 -20715 -3927 23941
8326 23941 15051 -11409 -29227 -20399 -63 13195 12829 13778 10852 -14375 -27567 -22202 -991
8313 -991 13007 36294 27281 21697 32724 36875 51644 54360 51614 35454 21861 14048 2601
8300 2601 -7862 14399 16479 22401 37532 62855 82011 68168 60694 22522 13261 22499 14620
8287 14620 24044 21503 3279 12996 32019 32662 11381 3369 35374 35783 33180 57864 52125 28400
8273B8400j0456R119K0378j1992k5181M23j4764J4220j5814j4368K3695J0553
8261A4213j2470P892L7840Q827k4630l2955q627K2035k3097K97K1799j5846P102
8248B380J5344j6593k4511j7536J131K0389L4330K4756P845k2117r023j7796j4371
8235a5772k894j940p951L8715K1631j5129P466K0713Q974j428j0245m4120j8730
8222b0710O191P674K2711J8695j3176L114j9976m364k052R897n528k5327J1393
8209a1458m295J0180j8575k1143k606J8289o529K1229K4553L268J4159k6137Q990
8196I925J4368k6409p855j040j2625J8201m022P996l290J8303J3457J75M306R098
8182D0588k2340j7871K6601K3458K0227q687j2465j5216j4790p598K8100N041
$$ plain form
8273 28400 17944 27063 47441 35449 10268 10691 -4073 10147 -5667 -20035 3660 14213
8261 14213 1743 9635 47475 56302 31672 -1283 -9910 12125 -10972 -10675 11124 -4722 2380
8248 2380 17724 1131 -23380 -40916 -39785 -19396 14934 39690 47535 25418 16395 -1401 -15772
8235 -15772 -18666 -20606 -28557 10158 31789 16660 24126 44839 53813 52385 42140 -1980 -20710
8222 -20710 -14519 -6845 15866 34561 21385 24499 4523 159 -1893 8004 2476 -22851 -11458
8209 -11458 -15753 -5573 -24148 -45291 -47897 -29608 -36137 -14908 9645 12913 27072 935 9925
8196 9925 24293 -2116 -9971 -11011 -23636 -5435 -9457 -1461 -4751 13552 27009 27184 31490 40588
8182 40588 18248 377 26978 50436 70663 61976 49511 34295 19505 11907 40007 45048
8170D5048j231l1779K601P457n204L0667m248k9957l2704Q408J6953p204o4693
8157f5886l2649O205K7815J0825N090L550K2197J7567k8650l5040k076J7277K7976
8144b5799K2232j9270J9891K7091J1671j788j6388l124j1909L445J2911J2299
8132C1262L036n454p936j6903q162M3303K0774K526j9359J3013o553n1255n3770
8119e5478L2364K0312J7622K1661j2199l7376P873K722j51J0924J3483L987j813
8106B3931j0759m468j980q978R569J2940r225J868n285r558J938p75J4042j3891
8092f31r662Q852k0817J8014j0715j542J1105K3243n146o710l530j8484O183K0079
8078A0239j725o535O97J9483q382j1433m714P460q303m640k817k507J9977J675
$$ plain form
8170 45048 43817 12038 14639 22096 16892 47559 43311 13354 -19350 -10942 6011 -1193 -65886
8157 -65886 -98535 -92330 -64515 -53690 -48600 -45050 -22853 -5286 -33936 -68976 -71052 -53775 -25799
8144 -25799 -3567 -22837 -2946 24145 35816 34028 17640 14516 2607 6052 18963 31262
8132 31262 34298 28844 20908 4005 -4157 39146 59920 62446 43087 56100 49547 -1708 -55478
8119 -55478 -23114 -2802 14820 36481 24282 -13094 -5221 -2499 -2650 8274 21757 25744 23931
8106 23931 13172 8704 6724 -2254 7315 20255 11030 12898 7613 -1945 -7 -782 13260 -631
8092 -631 -10293 -1441 -22258 -4244 -14959 -16501 -5396 17847 12701 5991 2461 -16023 -9840 10239
8078 10239 8514 1979 2676 22159 13777 2344 -2370 5090 -3213 -7853 -10670 -13177 6800 8475
8064H475k3046j4411k850j1810K967L4275k3099k0155J123J0257K1600R05K1682
8051E913n984n626L228r949N636r422k3366O796K8617L1144k5229j3202l937j9396
8037c4777l3763J5473N6782J0908j4315k4636l3744P764K0348K6659R190J9241
8025B5130Q550o057p143m647j1140o748M2680K84l5975j2010J7972L0436J2189
8012E3521j2879k8158j5557k639N620j8005M093J5038K6745J7744J1997j5780
8000D1740k7206J0030J8867K3282n776k0775j7705O865K4991J3193K220K295O324
7987G8345k7573k5324K1179k1579K0694L681l1450l065J3451K514j280l2360K2674
7974A9907J7779P58j6975m5200k1438J8547J7908J953J0414L1408K0573k2991
$$ plain form
8064 8475 -14571 -28982 -31832 -43642 -40675 -6400 -29499 -49654 -48531 -38274 -16674 -15769 5913
8051 5913 -71 -5697 -2469 -12418 -6782 -16204 -39570 -32774 -4157 26987 1758 -11444 -15381 -34777
8037 -34777 -68540 -53067 3715 14623 308 -24328 -58072 -50308 -29960 -3301 5889 25130
8025 25130 33680 27623 20480 15833 4693 -2055 40625 40909 4934 -7076 10896 41332 53521
8012 53521 40642 12484 -3073 -5712 -92 -18097 -14004 1034 27779 45523 57520 41740
8000 41740 14534 24564 43431 66713 60937 40162 22457 29322 54313 67506 69726 72021 78345
7987 78345 50772 25448 46627 25048 45742 49423 17973 14908 28359 30873 29593 -2767 19907
7974 19907 37686 38444 21469 -23731 -45169 -26622 -8714 -6761 3653 35061 55634 32643
7962C2643k6114j0705P531K7771K4615L761l5900j8466l004R216k3463M487N982
7949a646j3875J7068K5926J9425L2934K800r347K302j7928j0470P245R503m0561
7936B3376l2014K2131j7508L410K29N05J4445k196j7152K0498K4962m123M337
7923D0900o571m5512k706J8102J19K53k2062J4011Q662j2135j7469Q374K008k721
7909a6747J4775N337J1530n489k2316M340K6055J5152K4941L4345o175k7488j3568
7896D4692r792K1013O893j6195k6253k5526P770N936P519K0225R734j3237j8783
7883A3996P691J3879p713k79L0066j1578M482N870l1918k1861J8968J1363l616
7870B9350j8507l291J4295l246N334q154m832R114K1234l7410l7533Q519r699
$$ plain form
7962 32643 6529 -4176 3355 31126 55741 59502 23602 5136 2132 11348 -12115 -7628 -1646
7949 -1646 -15521 1547 27473 46898 79832 82632 73285 75587 57659 47189 54434 63937 23376
7936 23376 -8638 13493 -4015 -605 -376 129 14574 12378 -4774 15724 40686 36563 40900
7923 40900 34329 -11183 -13889 4213 4332 4585 -17477 -3466 5196 -6939 -24408 -16034 -14026 -16747
7909 -16747 -1972 3365 14895 9406 -12910 -8570 17485 32637 57578 91923 85748 58260 44692
7896 44692 34900 55913 62806 46611 20358 -5168 2602 8538 16057 36282 46016 32779 13996
7883 13996 21687 35566 27853 27574 57640 46062 50544 56414 24496 2635 21603 32966 29350
7870 29350 10843 7552 21847 18601 23935 15781 10949 20063 41297 3887 -33646 -25127 -34826
7857c4826q805K1726K4280J4263J9939l596j3239m1430o531N397J0989P853j1204
7844a5184k058m500K538r384o874k178K3586l44K0159J093J9390J1029P584k129
7830D2728J8459k227k3311m3118j6222j5121J3777K9168L1387J901L650k1150
7818A9921J826K1228j5973j8393J218p077k0113o462Q476J0130j0901J622M0147
7805B5649J8244p656j9930O560k2678j076j4568R605K0156m812N644K1843j5740
7792B1241P499J9752K099k7107L863K137k8282P112J3483r7j578J7821O70o514
7778C2099k101j2765J6210k4089k389p27l104L086J0963k738R513k710j0267l029
7764G952n962q359m1654j5540K6602L5705Q234k897l754j9675j1789N153J4952
$$ plain form
7857 -34826 -43631 -21905 2375 16638 36577 32981 19742 -21688 -28219 -22822 -11833 -3980 -15184
7844 -15184 -17242 -21742 -19204 -28588 -35462 -37640 -14054 -14398 5761 6854 26244 37273 44857 42728
7830 42728 61187 58960 35649 -7469 -23691 -38812 -25035 4133 35520 37421 41071 19921
7818 19921 21747 42975 27002 8609 9827 2750 -17363 -23825 -15349 -5219 -16120 -14498 25649
7805 25649 43893 36237 16307 22867 189 -887 -15455 -5850 14306 9494 15138 36981 21241
7792 21241 28740 48492 50591 23484 27347 29484 1202 8314 21797 21700 20122 37943 38613 32099
7778 32099 29998 17233 33443 9354 6965 6238 3134 6220 17183 14445 23958 21248 10981 7952
7764 7952 1990 -6369 -48023 -63563 -36961 -1256 6978 4081 327 -19348 -31137 -25984 -11032
7751a1032l992K2750K8122J7442q273l6047k6353J541J3596J2295m513J9264p534
7738A7266o546k894N57r486j503R083j953j1747m925m779Q584K9739r053j2334
7724IR188l210J3956J7430J7061j1797k1816R8j3350m875J5483j1664p420j4999
7710a5906k0258o941M1788j712k3088j3261k370K8315l3101m580R980M5774K433
7697G073j8249J9340p733L788K1177p989q205m947M122q915l2479j3379J6154
7684c0242l835J4729M6788K4571m8517m5460N210J6230L8026P012J4477J9043
7672E8032J8633j3563j5309k0181N390K1175R021k9861J088o433k937l487Q31
7659B2399J697j5943k3263J3406R857L560l5928L036K1384k099N74p70J6543J5313
$$ plain form
7751 -11032 -15024 7726 35848 53290 45017 8970 -17383 -15842 -2246 10049 5536 24800 17266
7738 17266 10720 7826 8383 -1103 -2606 6477 4524 -7223 -12148 -16927 -8343 21396 12343 9
7724 9 9197 5987 19943 37373 54434 42637 20821 20919 7569 2694 18177 6513 -907 -15906
7710 -15906 -36164 -43105 -1317 -3029 -26117 -39378 -41748 -13433 -46534 -51114 -41134 4640 7073
7697 7073 -11176 8164 431 4219 25396 17407 9202 4255 8377 -538 -33017 -46396 -30242
7684 -30242 -34077 -19348 27440 52011 3494 -41966 -36756 -20526 17500 24512 38989 58032
7672 58032 76665 63102 47793 27612 33002 54177 63198 33337 34425 27992 25055 21568 22399
7659 22399 24096 8153 -15110 -1704 8153 11713 -24215 -21179 205 -1894 -1320 -2090 14453 29766
7645B9766k4118m187N593l0491K0282n367j5962j8725K2459O974k4982q289j3491
7632f0538K3825J4364m981j5536O438M276N396K479J564K8491J4075j3760n164
7619I29J1621Q955j0840p875J861k5911J208J2773K2287K7590n404k2664q684
7606E846k2584j026J1127J6857J9688r399J6893j5099j7213j6528k7781j0157
7594d9376K9219J5552o47J3350j7700l7668K2291K6161R825M455r533J57J1867
7581A7953K0549m318l1470p838j6792R922J6758K6312R753j6160k9329o599J0483
7568g76q239k513K8231L6911p118k0866j8634k1426j0553J0385Q616K5702j3726
7555E994K112Q794p02o73J6612j1535n825k0774j3045N770J6377p697o505j1392
$$ plain form
7645 29766 5648 1461 7054 -23437 -3155 -8522 -24484 -43209 -20750 -13776 -38758 -47047 -60538
7632 -60538 -36713 -22349 -27330 -42866 -36428 -32152 -26756 -24277 -22713 5778 19853 6093 929
7619 929 12550 21505 10665 2790 4651 -21260 -20052 -7279 15008 42598 37194 14530 5846
7606 5846 -16738 -17764 -6637 10220 29908 20509 37402 22303 5090 -11438 -39219 -49376
7594 -49376 -20157 -4605 -5252 8098 -9602 -47270 -24979 1182 11007 15462 5929 6086 17953
7581 17953 38502 34184 2714 -5124 -21916 -11994 4764 31076 40829 24669 -4660 -11259 -776
7568 -776 -9015 -11528 16703 53614 46496 25630 6996 -14430 -24983 -14598 -5982 19720 5994
7555 5994 8106 16900 16198 15525 32137 20602 14777 -5997 -19042 -13272 3105 -4592 -11097 -22489
7541b2489Q74k394J6011J2332q09l930l4712k4457O380m003L2293N517J6046k2625
7527b5966N531R731l84N608j4086M279L5176k130j4002q613l1099k6612J9355
7514d3212k23O906P139J5809N321j7342P345J6197j7224j3409K0032J9719L231
7501A0289j1882k6038j2108J4173J0356Q924K0962L1008l7563J439J0430r514
7489A0476k7731K0016J2295j9356l870K3040k6454O7j2521j9406j9887l978J9779
7476d7530K7909j0973k7598j3085M4551N622J4417J2156r709k3355R407R437R030
7463B79j0292j9L94k046n002k4717j1150R727q146J9533R807K9069p688r124J5693
7448F318k3168j7046L360J7370j4451J5276J1674M962O455k226q178k61k0817
$$ plain form
7541 -22489 -21615 -24009 -7998 4334 3525 -405 -35117 -59574 -53194 -57197 -24904 -19387 -3341 -25966
7527 -25966 -20435 -10704 -11088 -5480 -19566 -15287 19889 17759 3757 -4856 -35955 -62567 -43212
7514 -43212 -43435 -36529 -29390 -13581 -8260 -25602 -18257 -2060 -19284 -32693 -12661 7058 10289
7501 10289 -1593 -27631 -39739 -25566 -15210 -6286 14676 45684 8121 9560 19990 10476
7489 10476 -17255 2761 15056 -4300 -8170 14870 -11584 -11517 -24038 -43444 -63331 -67309 -47530
7476 -47530 -19621 -30594 -58192 -71277 -26726 -21104 -6687 5469 -4240 -27595 -18188 -8751 279
7463 279 -10013 -10032 -9638 -11684 -16686 -41403 -52553 -42826 -50972 -31439 -21632 7437 -251 -9375 6318
7448 6318 -16850 -33896 -30536 -13166 -27617 -12341 -667 4295 10750 8524 346 85 -20732
7435b0732j5084M522N137L101J1061J2755j9504Q206R893J0830L0981l2998k8106
7422a9938J2437J7386j8573L918J878j3787j8755k8274j6931R693L621K0815K4307
7409b2203j0908j2453M1076R696j7869j3775r9l451N598l057o709K1665Q583K6633
7395B2727j4277l1722j8496j9353j1920Q391K4819O875j533M0204O609k6085k1270
7382c5031l307L730o602K8662J0568L641o495k5008j4346n773m014K5464o170
7369c4681J7603K7948j4631q762k322K5846K5662l4043k2843L616l510p822O15
7356b7324l132J7197K1014M005n31o566l0485k8032k3132p398K1780L5496R516
7343a7592n846k178J0752J8541j4952l2042J3581m481j8360J1214j1631Q102O403
$$ plain form
7435 -20732 -35816 -31294 -26157 -23056 -11995 760 -18744 -10538 -645 10185 41166 8168 -19938
7422 -19938 -7501 9885 -8688 -4770 -2892 -16679 -35434 -63708 -80639 -70946 -67325 -46510 -22203
7409 -22203 -33111 -45564 -4488 5208 -12661 -26436 -26535 -29986 -24388 -27445 -34154 -12489 -3906 22727
7395 22727 8450 -23272 -41768 -61121 -73041 -64650 -39831 -32956 -34489 5715 12324 -13761 -35031
7382 -35031 -38338 -34608 -41210 -12548 -1980 1661 -4834 -29842 -44188 -49961 -53975 -28511 -34681
7369 -34681 -17078 10870 -3761 -12523 -14845 11001 36663 2620 -20223 -16607 -20117 -27939 -27324
7356 -27324 -30456 -13259 7755 11760 11229 4663 -25822 -53854 -76986 -84384 -62604 -27108 -17592
7343 -17592 -23438 -25616 -14864 3677 -11275 -43317 -29736 -34217 -52577 -41363 -52994 -44892 -38489
7330c8489K264P946K7512j079L093J0549J1790K8487k9769j816K3326l2577k6533
7317a5296q273O473R626K3934K136p920J0588l437j0455q434k3755M646J547m734
7303b3354m962J555j874L4695j2332j3666J4677P808n1049l590L3522K4563j8427
7290a2434k3745K4600m210j0342J3390L0210Q485l0500k41j4528J7453J3086P981
7277A9205l3945r159J2604k648K3252P149q669m3r343K6834M329j0204K0495J5472
7263E5329m251k3509l1392j5350J4160L261j1410j7699J3716o26j8437j337R483
7250b8062r024J0370K1325M9105Q845J311j8587o058k1952M17R812m430k2137
7237i065q525r641k021m219J1434J3988j6863L132K3617J4801P589r245j2260
$$ plain form
7330 -38489 -36225 -28279 -767 -1846 1247 11796 23586 52073 22304 20488 43814 11237 -15296
7317 -15296 -23569 -17096 -7470 16464 18600 10680 21268 17831 7376 -1058 -24813 -20167 -18620 -23354
7303 -23354 -28316 -26761 -28635 6060 -6272 -19938 -5261 2547 -48502 -52092 -18570 5993 -12434
7290 -12434 -36179 -11579 -15789 -26131 -12741 17469 25954 -4546 -4787 -19315 -1862 11224 19205
7277 19205 -14740 -23899 -11295 -13943 9309 16458 7789 7746 -1597 25237 29566 19362 39857 55329
7263 55329 51078 27569 -3823 -19173 -5013 -1752 -13162 -30861 -17145 -17771 -36208 -37545 -28062
7250 -28062 -37086 -26716 -5391 43714 52559 53870 35283 29225 7273 7690 17502 13072 -9065
7237 -9065 -17590 -27231 -29252 -33471 -22037 -8049 -24912 -21780 1837 16638 24227 14982 2722
7224B722J515L583o987j9485j2980K1852J8329J6824L833J918N7l742l0354k8074
7210c0989R31l12M625J0162q669J4600L5386q623N576m6838m7987J6505K9458
7197b6175J3448j2383j4423J4914J3911j8368k1195R86K627j4615J1796L6250
7185a3227K9635J7084k9470j5152j7907j8101K9413p91j6792J8049N0269Q328
7173D1338k1671k0754k2250K332M124J1318k1485o390K1217J9577K6097q282j2885
7160A2286o469j6828p409J3781L187Q271J7877K179Q55O469r369j0980J386L4
7146A5270k6675q181J8986l07l764L139L4987N632r494J7841p020k1902j7630
7133H82l0983j3981M874L3014L542k6083j1187J2970P135J395m4978R252K5924
$$ plain form
7224 2722 4237 7820 833 -18652 -31632 -9780 8549 25373 29206 31124 31181 27439 -2915 -30989
7210 -30989 -30058 -30370 -25745 -15583 -24252 -9652 25734 17111 22687 -24151 -72138 -55633 -26175
7197 -26175 -12727 -25110 -39533 -24619 -10708 -29076 -50271 -49285 -46658 -61273 -49477 -13227
7185 -13227 16408 33492 4022 -11130 -29037 -47138 -17725 -18516 -35308 -17259 33010 41338
7173 41338 19667 -1087 -23337 -21005 -16881 -5563 -27048 -33438 -12221 7356 33453 25171 12286
7160 12286 5817 -11011 -18420 -4639 -1452 6819 24696 26875 27730 34199 24830 13850 15236 15270
7146 15270 -11405 -19586 -600 -907 -4671 -1532 33455 39087 29593 47434 40414 18512 882
7133 882 -30101 -44082 -39208 -6194 -2652 -28735 -39922 -26952 -19817 -18422 -63400 -54148 -28224
7120b8224J8251J342q875m3052J216K9018J5661M861o738j0709P852L2009K205
7107A4817k7517q941P106J9277K0935q619j8040o166J2168J3836o318k7511K306
7094a2667K3766M344M336L828m1292j055J6076j0817j218m788k1981J1679Q541
7081b1248m795M973j523n789P243J0467k4013R26M0688N135Q858J0364J0441m510
7067C7217k2250j5407l110k9145o894j0904q305l739J616L0900M0439k844Q51
7054H425K8977k905j036k0452j2592j0903L844K9321p556l6172L777K1536R74
7041E238J363j0323k7523J016J2315R917j3523j883K909K4532J9409M221m8432
7028b0764k8513K5616K5326K8873k4924l4490K222L4361M037q840j2818k9534
$$ plain form
7120 -28224 -9973 -8631 -17506 -60558 -59342 -30324 -14663 -9802 -16540 -27249 -19397 12612 14817
7107 14817 -12700 -21641 -14535 4742 25677 17058 -982 -7148 5020 18856 12538 -14973 -12667
7094 -12667 11099 15443 19779 23607 -17685 -18740 -2664 -13481 -14699 -19487 -41468 -29789 -21248
7081 -21248 -26043 -21070 -22593 -28382 -21139 -10672 -34685 -33759 6929 12064 20922 31286 41727 37217
7067 37217 14967 -440 -3550 -32695 -39589 -50493 -58798 -62537 -60921 -30021 10418 7574 8425
7054 8425 37402 34497 33461 13009 417 -10486 -6642 22679 15123 -21049 -17272 4264 5238
7041 5238 6601 -3722 -31245 -30229 -17914 -7997 -21520 -23403 -20494 4038 23447 27668 -20764
7028 -20764 -49277 -23661 1665 30538 5614 -28876 -26654 7707 11744 2904 -9914 -39448
7016c9448K703M0558O072m7798j1592j4177q246M9059j768k3162J5862L0164P067
7003E294J955l914K0660q241l605P121J5069j1043j5640J1337J174k3798r234
6990a2865j234J243O363Q429L2237K790o276l9054k5364K9390L7899o959m2466
6977a5867r522K4344j5868k1872j1213k026K3805J7243j1195r238Q944L8816K3340
6964C9691j917J2789L3032J5907m260j3414k9268j0728J8065j3356k6581r294
6952A0666j5686k9590Q634j6617m0611o851L4908K7602l224q613J1590L3752r368
6939c408r422K8323L5418j1440k7446j7225j1702Q377N779L185O606k0208m174
6926a7337J0958J748m484K456N247L6164J041j5010l2231j6539J887J9674L694
$$ plain form
7016 -39448 -36745 3813 9885 -37913 -49505 -63682 -71928 -22869 -24637 -47799 -31937 -1773 5294
7003 5294 7249 3335 23995 15754 12149 19270 34339 23296 7656 18993 20167 -3631 -12865
6990 -12865 -14099 -12856 -6493 1936 34173 36963 30687 -8367 -33731 -4341 33558 26599 -15867
6977 -15867 -25389 -1045 -16913 -38785 -49998 -52024 -28219 -10976 -22171 -31409 -22465 16351 39691
6964 39691 37774 50563 83595 99502 95242 81828 52560 41832 59897 46541 19960 10666
6952 10666 -5020 -34610 -25976 -42593 -83204 -90055 -55147 -27545 -30769 -39382 -27792 5960 -3408
6939 -3408 -12830 15493 50911 39471 12025 -5200 -16902 -8525 -2746 439 7045 -13163 -17337
6926 -17337 -6379 -4631 -9115 -6659 -1412 34752 35793 20783 -11448 -27987 -26100 -6426 -2732
6913b732j0706k0158K5929M809j1069p227J6508K9367J559k0145k1225J6048J1665
6900A2623n249j8570O923L5186p658j5786j729k9270j6864Q777M1333Q066k2036
6887d254n524l923J5905J2902R115k2628k2446j1912L2453N868j413K502J7447
6874B4092j5414Q199j1626m5059q528L3110J871p769n476P224n602k3505Q042
6861d0441J3249K4783N828K904o531M296m934r625j7098N681L826P347j6257k1747
6847d8719l217R234o514L7910L8544K0150J585k1094j5122n4656l9321j9530K5880
6834g4870N7129J3456M325k2328m4825L69J2771J979m062m14Q122L8603o556J0462
6820e839K0299j328J4825Q651j0608l882m0534k6815j9188M524J6531J8762l945
$$ plain form
6913 -2732 -13438 -33596 -7667 -2858 -13927 -21154 -4646 24721 26280 6135 -15090 958 12623
6900 12623 7374 -11196 -4273 30913 23255 7469 5740 -23530 -40394 -31617 9716 17782 -4254
6887 -4254 -9778 -13701 2204 15106 24221 1593 -20853 -32765 -312 5556 4143 6645 24092
6874 24092 8678 16877 5251 -39808 -48336 -15226 -13355 -21124 -26600 -19376 -24978 -48483 -40441
6861 -40441 -27192 -2409 3419 6323 -208 4088 -846 -10471 -27569 -21888 -18062 -10715 -26972 -48719
6847 -48719 -51936 -42702 -49216 -11306 27238 47388 48973 27879 12757 -41899 -81220 -100750 -74870
6834 -74870 -17741 -4285 40 -22288 -67113 -66744 -53973 -51994 -56056 -56470 -48348 -9745 -16301 -5839
6820 -5839 14460 13132 27957 36608 26000 22118 -18416 -45231 -64419 -59895 -43364 -24602 -28547
6807b8547m677K718j1897K1798R767n216j4360o576q083L3211K4799J1996J808
6794B6741k4786l769J418J185K0612j6793j1268j9334M82K3745k5101j5682L3831
6781h719j7072k9190k7698K8788K2640K9814L1280j6244l5975k7596P364K6553
6769a6055K0397J3333q715j7837n329K3975j0796K612O700k574j3792K1740o054
6756G605N615K3356n773k4278Q067k5523n0596k0655J9295J6311J2683L5549M266
6743E922j0421K670m697J0824Q658j6972j0193J6758r52j4796K8263n80K707L6471
6729E3662j118l7019K675j4295n530R945j0398l3428J0849J2829J7734K2543L236
6716C1685k5996N345J3720n429k5346k4575P065o277L3896Q455K8806L8931O3581
$$ plain form
6807 -28547 -33224 -30506 -42403 -20605 -10838 -16054 -30414 -36990 -45073 -11862 12937 24933 26741
6794 26741 1955 -1814 -396 789 21401 4608 -6660 -25994 -25512 -1767 -26868 -42550 -8719
6781 -8719 -25791 -54981 -82679 -53891 -31251 -1437 29843 13599 -22376 -49972 -42608 -16055
6769 -16055 4342 17675 8960 -8877 -14206 9769 -1027 1585 8285 5711 -8081 13659 7605
6756 7605 13220 36576 30803 6525 14592 -10931 -61527 -82182 -62887 -46576 -33893 1656 5922
6743 5922 -4499 -1829 -6526 4298 12956 -4016 -14209 2549 1597 -13199 15064 14484 17191 53662
6729 53662 52544 15525 18200 3905 -1625 8320 -2078 -35506 -24657 -11828 5906 28449 31685
6716 31685 5689 11034 24754 19325 -6021 -30596 -23531 -29808 4088 12543 41349 80280 143861
6703A43861K1550l9602l6497n1901j3333J3369k4549R096K6646j3983l8820l5518
6691c9681r747K5429N019J2391L3619J6567l4501l4352J806J2126O552J1418K6248
6678C2894m877m0720m10L739j1499K5370J9888m240k3461J6542M540j3946k628
6665A192O070k4424j7011P307L2818l256k917k068p032O378O484N041K9437k7048
6651A0971n522O672O261l172P160k42j4929j7202O517L1804K6208j965j0245k6562
6637A5754l7717K3081J6111J5164K0911k2987R149K962j4151n782M950m748p277
6624A5420k4616L0569J6107Q279K1413L2982K4100N077J2753L4182N7152N2041
6612B85459J16287K72131J83206k8637k24725j31485p5627k3158L8061K5484L6726
$$ plain form
6703 143861 165411 125809 89312 37411 24078 37447 12898 21994 48640 34657 -4163 -39681
6691 -39681 -49428 -23999 -18980 -6589 27030 43597 9096 -25256 -23450 -11324 -4772 6646 32894
6678 32894 28017 -12703 -13113 -9374 -20873 4497 24385 20145 -3316 13226 17766 3820 1192
6665 1192 7262 -17162 -34173 -26866 5952 2696 -221 -2289 -9321 -2943 3541 8582 38019 10971
6651 10971 5449 12121 18382 15210 22370 22128 7199 -10003 -3486 28318 54526 52561 42316 15754
6637 15754 -21963 1118 17229 32393 53304 30317 39466 42428 28277 22495 27445 22697 15420
6624 15420 -9196 21373 37480 45759 67172 100154 124254 129331 142084 176266 233418 285459
6612 285459 401746 673877 857083 828446 603721 472236 396609 373451 411512 436996 473722
6601D73722J04095J35017J62225K76065L30772M35669N34682Q34744J569345L218878
6591H075214O528436J0167881N147458n554274r779227n779522k814044j501518
6583D490404q90918o18161n36519m69386l30683k40596j76251j70645j60668j18431
6573G78146o5979r996M9228J19352K19114Q5548j87930k58724j63680j12247q9158
6562C63674l0649k7369j3762L92j117k2937l9673l0375k6373k5644J2369l643
6550A54893j7173l689j3146p497l628O501Q5l0029k2807j0448J2525K5994k5583
6537F5998l1802j1986j0553K2426o12j9479J6553K9620K1874J1128q410j6117
6525F8640j7272J8135j0027q475N848j0913L618r452j6514J2616J8843J7343J4438
$$ plain form
6601 473722 577817 712834 875059 1151124 1481896 1917565 2452247 3286991 4856336 8075214
6591 8075214 14603650 24771531 29918989 24364715 14585488 8805966 5991922 4490404
6583 4490404 3599486 2981325 2444806 1975420 1644737 1404141 1227890 1057245 896577 778146
6573 778146 712167 702171 751399 870751 1089865 1175413 987483 728759 565079 452832 363674
6562 363674 333025 305656 291894 292286 291169 268232 228559 198184 171811 146167 158536 154893
6550 154893 137720 134031 120885 113388 109760 116261 116346 86317 63510 53062 65587 91581 65998
6537 65998 34196 22210 11657 34083 33471 13992 30545 60165 82039 93167 84757 68640
6525 68640 51368 69503 59476 51001 56849 45936 49554 40102 23588 36204 55047 72390 86828
6512H6828R882k5775j8451J418o770j6133l4346j2529L401J4518p421J957m799
6499h220n447K0953J415o992j6029j7027j1618J9194J1185L958J5709K1990R71
6486C0042k1193J6085P160r260j4702l0103j6603M4845p558p816J6907J6922j3764
6473A0962l5641K2758J2905j4450L952J657K043M004J5736J9495l1303l4707J0703
6460a1886q39K979J6620j935J7745J2497K1647j7232j7343j5635r649p359P602
6447b788K4825K1323O901k3161j9332q560r013k3758M635O706K3890J4232K702
6434A8602K017l517J3768k9683J1043K7613K3800n310k7321k4527o065J4890l319
6421A1991N472P943j7437K2675K7467M521l2343J5125j1058k0796M303p138O988
$$ plain form
6512 86828 96710 70935 52484 53902 47132 30999 -3347 -15876 -12475 2043 -5378 -3421 -8220
6499 -8220 -13667 7286 8701 1709 -14320 -31347 -42965 -23771 -12586 -8628 7081 29071 30042
6486 30042 8849 24934 32094 22834 8132 -21971 -38574 6271 -1287 -9103 7804 24726 10962
6473 10962 -24679 -1921 10984 -3466 486 2143 4186 8190 23926 43421 12118 -22589 -11886
6460 -11886 -12725 -9746 6874 4939 22684 35181 56828 39596 22253 6618 -3031 -10390 -2788
6447 -2788 22037 43360 50261 27100 7768 -792 -9805 -33563 -28928 -22222 1668 15900 18602
6434 18602 20619 17102 30870 1187 12230 39843 63643 58333 31012 6485 420 15310 11991
6421 11991 17463 25406 7969 30644 58111 62632 30289 45414 34356 13560 17863 10725 17713
6408A7713k5093k0797j5710j1994J1676L7404J4891o968K7101J8112j4118k414
6396B9803j5063K0754J1433o87p931n0800j1548J4225L1180J9253k3259l0642
6384a3282q613o772K4708J543J225L1741k9506L419J9563K4294l0498k2926j5469
6371b0573j9958j1244J393M7198J3683l928n126l98p734j3595M663l270R656J9938
6357A0705K0420j2928l1205q02L7632J0327M821M604j8404n497r634j9212K5886
6344A6713L5409k1743l1199j6187j4935j8326M337J5611p784j0519Q571J5311
6332b4741J8509L4322k1592j9573j7913k7673K834Q391K5838L5740K7561j54J5817
6319E7366l4012l7213k8009J641q792J797o44j1600K911K6597N996J9390Q560
$$ plain form
6408 17713 -7380 -28177 -43887 -55881 -44205 -6801 8090 1122 28223 46335 32217 29803
6396 29803 14740 35494 46927 46240 38309 -12491 -24039 -9814 21366 40619 17360 -13282
6384 -13282 -21895 -28667 -3959 -2416 -1191 30550 1044 4463 24026 48320 17822 -5104 -20573
6371 -20573 -40531 -51775 -50382 -3184 10499 6571 1445 1047 -6687 -20282 -15619 -18889 -9233 10705
6357 10705 31125 18197 -13008 -13810 23822 34149 38970 43574 25170 19673 10039 -9173 16713
6344 16713 52122 30379 -820 -17007 -31942 -50268 -45931 -30320 -38104 -48623 -40052 -24741
6332 -24741 -6232 28090 6498 -13075 -30988 -58661 -55827 -47436 -21598 14142 41703 41549 57366
6319 57366 23354 -13859 -41868 -40227 -49019 -47222 -47866 -59466 -56555 -29958 -23962 -4572 3988
6306C988J9692j5924j1219M2733l968L786J4795k5374l927j1384k546j1793K7909
6293B6768J3898j8252k6170j0347N114k168l050J7316J2961Q118M0071K5608m6434
6280D3433m8636j1448O341K0163K2210k8793k8301N66R845K0790Q10j1636k26
6267d882j9577J439p583p902K7279n221K5252J1425l9517l622J4097j3601L5940
6254A3527L360j925r566k4067j2652j7549K9212L490J9164K9015j1695l092m986
6241A2236o877M421l227k6917k2000J7981P951J7486L7775j2559j5410k566N025
6228A3319L009M257k7902J222L0875K0103l51k9964r963p935j7019J7040K081
6215a228L4769N7966M9499M932m8204n3761m1269K3933K1353l417o115m947L152
$$ plain form
6306 3988 23680 7756 -3463 39270 35302 39088 53883 28509 24582 13198 10652 -1141 26768
6293 26768 40666 22414 -3756 -14103 -8989 -11157 -14207 3109 16070 24188 64259 89867 43433
6280 43433 -5203 -16651 -10310 9853 32063 3270 -25031 -24465 -14620 6170 6980 -4656 -4882
6267 -4882 -24459 -23020 -30603 -38505 -11226 -16447 8805 20230 -19287 -22909 -8812 -22413 13527
6254 13527 16887 14962 5396 -18671 -31323 -48872 -19660 -16170 2994 32009 20314 17222 12236
6241 12236 5359 9780 6553 -20364 -42364 -24383 -16432 1054 38829 26270 10860 8294 13319
6228 13319 16328 20585 -7317 -6095 24780 44883 44532 14568 4605 -3330 -20349 -3309 -1228
6215 -1228 33541 91507 141006 145938 97734 43973 2704 26637 47990 44573 38458 33511 36663
6202C6663O313j9370k8233J2565J2768J043J6316J9337p444j1708k0851m529q41
6189A2029k3577N448J6797K293n993k4652k0883j1035J3819J0699L4488K2345
6177C1778j3774j468p436m2480m9036J3078L9258K8709M4592J3233j5566k7025
6165A3863n2321J0112J7617J0931Q895O754J0310r015k6720R327K2628l1013k0266
6152b8898Q597K5582K6224l562j548l2631N119L4380j8831l3251r425L0879r582
6139f947j5269J5529K2225k7408P49N119M674j3488J2518Q580p617j2709J0973
6126c071J5637k6788l865R055J3394K4944P40k6948j4828j3486L0260j3551k0570
6113b9077K990j3801J6706L5478J0957k0675l4847K3746r583j9750k328n493r314
$$ plain form
6202 36663 42976 23606 -4627 7938 20706 21749 38065 57402 49958 38250 17399 12870 12029
6189 12029 -11548 -6100 10697 12990 6997 -17655 -38538 -49573 -35754 -25055 9433 31778
6177 31778 18004 16536 9100 -33380 -82416 -69338 -30080 -1371 43221 56454 40888 13863
6165 13863 -38458 -28346 -10729 202 9097 15851 26161 17146 -9574 -247 22381 -8632 -28898
6152 -28898 -20301 5281 31505 27943 26395 -6236 -1117 33263 14432 -18819 -28244 2635 -6947
6139 -6947 -22216 -6687 15538 -11870 -11121 -6002 -1328 -14816 -2298 6282 -1335 -14044 -3071
6126 -3071 12566 -14222 -18087 -9032 4362 29306 30046 3098 -11730 -25216 5044 -8507 -29077
6113 -29077 -26087 -39888 -23182 12296 23253 2578 -32269 -8523 -18106 -37856 -40184 -45677 -54991
6100e4991J2265K4444K3063K8065N30k4899J6966Q55l1997p095q146J8986q353
6087a0307Q813J240j655j8032J5766O345j7300o049J394K0482L0352k5821k4298
6074a9070J9183J6907O655j2000j9181k3157K5723Q213j9376j1843J2111J1063
6062d772J7299j548k3031N162L056m728j7301K862K0306Q419m933j5782r143M342
6048a9792J9313K6777J1550k8935r972M013J8475k971j5184j4244j0933M023K9992
6035A2112R89P274o490l5620J0349J2982K839p549n068J2537R597L285n97j4525
6021B115k9228k0975L322K5905N67J0180r609k2630k457j3503Q042K0834J203
6008b6234j6914o080r354L6731J7168O469K1758M17l9403k5221j959L394J2404
$$ plain form
6100 -54991 -42726 -18282 4781 32846 33376 8477 25443 26298 -5699 -12794 -20940 -1954 -10307
6087 -10307 -1494 -254 -1909 -19941 -4175 2170 -15130 -21179 -19785 697 31049 5228 -19070
6074 -19070 113 17020 23675 11675 -7506 -30663 -4940 3273 -16103 -27946 -15835 -4772
6062 -4772 12527 10979 -12052 -6890 -3834 -8562 -25863 -23001 -2695 5724 791 -14991 -24134 -19792
6048 -19792 -479 26298 37848 8913 -1059 2954 21429 18458 3274 -10970 -21903 -17880 12112
6035 12112 13101 20375 13885 -21735 -11386 1596 4435 -3114 -8182 4355 13952 17237 16640 2115
6021 2115 -27113 -48088 -44766 -18861 -18294 -8114 -17723 -40353 -42810 -56313 -48271 -27437 -26234
6008 -26234 -43148 -49228 -58582 -21851 -4683 1786 23544 23961 -15442 -40663 -42622 -39228 -26824
5995b6824M440l320k462N591J3853L593R633j2442J1200r837L8480M0177m4146
5982B7936k3692n638J3429L1493J8445J8467j1386k1862j9231j4322k3259M57
5970i163J5769m459j8066K2384K424j4895q308j4358j8445J9267K941L8907Q185
5957B2183J353k1591R667m361l3099j6982q826K0892J5136K4982j5998l4046k6373
5944f7063j1130N4847J0716r508q071K1041O638j8633j5857M6037K3531m329o93
5931B7526j5745k0190j3487r69k7639O556L7730O278M74L5221J9777j8521k7286
5918I725m810j079m5174m617N957l907k4151K8853K1059J815P010K1112j1397
5905C96P071P747K945j1246p665p739K7348J7410j0634J135j0011j4165k1416
$$ plain form
5995 -26824 -22384 -25704 -28166 -22575 -8722 -5129 4504 -7938 3262 -6575 31905 72082 27936
5982 27936 4244 -1394 12035 43528 61973 80440 69054 47192 27961 13639 -9620 -9163
5970 -9163 6606 2147 -15919 6465 8889 -6006 -14314 -28672 -47117 -27850 -24909 13998 22183
5957 22183 23536 1945 11612 7251 -25848 -42830 -51656 -30764 -15628 9354 -6644 -40690 -67063
5944 -67063 -78193 -23346 -12630 -22138 -30209 -9168 -2530 -21163 -37020 9017 32548 28219 27526
5931 27526 11781 -8409 -21896 -22865 -50504 -43948 -6218 60 534 35755 55532 37011 9725
5918 9725 4915 3836 -41338 -45955 -39998 -43905 -68056 -39203 -18144 -16329 -9319 11793 396
5905 396 7467 15214 18159 6913 -752 -8491 18857 36267 25633 26768 16757 2592 -18824
5892a8824j5564K5023M1655Q590J9620l2798q781l2183l0175L0730M3769m518
5880B6544L240K3675k0320j1501J855r063p552N658R436k4612k2135n892Q920
5867b1747L0948K8818j2444l9107l671N40L5003m869l1845q525K2115J9429j428
5854A3217k0310q606j055l585l304k5772O608J9395J7332j9321k7095J2163J9417
5841b0916k088J433J8680M7680j6440k3776O645K1589K5148l799k6401O002K1713
5828E5470L782k4824j0828j1562J3738n16l725j1117J6807j5890l0477K8316j3218
5815d044l3399k842R907r4q049J7690K2841J0766K103O035K4931p536k784j5055
5801B0470N887k0934k0585J9563q599p790L816L2303Q917k3788k7941k6667l726
$$ plain form
5892 -18824 -34388 -9365 32290 40880 60500 27702 18921 -13262 -43437 -12707 31062 26544
5880 26544 29784 53459 33139 21638 23493 14430 6878 12536 21972 -2640 -24775 -30667 -21747
5867 -21747 9201 38019 25575 -13532 -17203 -16663 18340 13471 -18374 -26899 -4784 14645 13217
5854 13217 -7093 -15699 -16754 -20339 -23643 -49415 -42807 -23412 -6080 -25401 -52496 -40333 -20916
5841 -20916 -23004 -21571 -2891 44789 28349 4573 11218 32807 57955 54156 27755 33757 55470
5828 55470 59252 34428 23600 12038 25776 25260 21535 10418 27225 11335 -19142 9174 -4044
5815 -4044 -37443 -40285 -30378 -30472 -38521 -20831 2010 12776 14879 20914 45845 38309 35525 20470
5801 20470 26357 5423 -15162 4401 -4198 -11988 -8172 24131 33048 9260 -18681 -45348 -49074
5788d9074Q977p795K4935J1329J3861K4874Q845k8126l8256j5072L76N994O807
5775c2325J0233O040j6544j2115P628J3033L813P043j5909o649J9774m73k6051
5762d2502k877q508L9619L7149k4602N667K272k7747p843M0788L696j1480O166
5749I798P649l246l461P691j1188M786j9584n174J6248L9902r723m7628j8883
5736c2813J5837K5661Q991j7847j3717K7869o659r235k166L4534P759j3740j7180
5723G294k3361j0575P184J7718N221M1295K2321n372q787j2246j2371j6926m840
5710F555j9399J0820J6446K8501K405j4415j4715m850M205L160K5027L931l6638
5697A1033n0935K425L2146M2727J8097l132k3979k5470j1413K639l616J064K1322
$$ plain form
5788 -49074 -40097 -47892 -22957 -11628 2233 27107 35952 7826 -30430 -45502 -45126 -39132 -32325
5775 -32325 -22092 -16052 -32596 -44711 -37083 -24050 -20237 -13194 -29103 -35752 -15978 -16451 -42502
5762 -42502 -45379 -53887 -14268 22881 -1721 3946 6218 -21529 -29372 11416 15112 3632 9798
5749 9798 17447 14201 10740 18431 7243 12029 -7555 -12729 3519 43421 33698 -13930 -32813
5736 -32813 -16976 8685 17676 -171 -13888 13981 7322 -1913 -4079 30455 38214 24474 7294
5723 7294 -16067 -26642 -19458 -1740 3481 44776 67097 61725 52938 40692 28321 11395 6555
5710 6555 -12844 -2024 14422 42923 45328 30913 16198 11348 15553 18713 43740 47671 11033
5697 11033 -39902 -37477 -5331 37396 55493 52361 28382 2912 -8501 -5862 -9478 -8414 12908
5684A2908l534j7539j2897Q004O488j090j1928j5748R583j5984q9k779J3382K9497
5670a726K6391j7185k5450J6661J9859J9019k5449j1864J1839O51K3020k0320
5658A5446j8392K8121l032k9944M554J0659K0682j6471j09l00j8418p128O714
5645g618J4197J5317j3369j1645p336Q025J1543J7487j6899l8996N115Q996J0867
5632d316j976r659K867M876R906O982J486j4990L230O305p986L1137K2226Q86
5618E0974k5399k6699k5081k840q053O69K4345J6759k3437k1670K3154J1717R833
5605D272K6446q611k0126j8302K6576N509j4820o265p792J1252O820k5018p831
5592b7890M4766K1027J2086j4747j2529K6597L10j2966k4251k4014M0938K1545
$$ plain form
5684 12908 9374 -8165 -21062 -13058 -6570 -7660 -19588 -35336 -25753 -41737 -41826 -44605 -31223 -1726
5670 -1726 24665 7480 -17970 -1309 18550 37569 12120 256 12095 12746 35766 15446
5658 15446 -2946 25175 22143 -7801 -3247 7412 28094 11623 11514 11214 -7204 -14332 -7618
5645 -7618 6579 21896 8527 -3118 -10454 -2429 9114 26601 9702 -29294 -24179 -15183 -4316
5632 -4316 -6292 -15951 -13084 -8208 1698 8680 10166 -4824 -1594 4711 -3275 27862 50088 50974
5618 50974 25575 -1124 -26205 -29045 -37098 -36429 -12084 4675 -18762 -40432 -17278 -5561 4272
5605 4272 30718 22107 1981 -16321 10255 15764 944 -5321 -13113 -1861 4959 -20059 -27890
5592 -27890 16876 37903 49989 35242 22713 49310 49620 36654 12403 -11611 29327 50872
5580E0872j8819J0946J546q790J7554k6765k2433P779N146J2341k1241o423Q553
5567A0266j7235n802K6188k422k222j3487p704k2298L917J1791M1549m1714Q19
5554a8354M6188l6791k3846j7505K3024p374j3951J0195L5071K8436J5952r168
5542C1877m6733k1759M6703R465j8885k0333M45j5329K1511j2399k597O513l6432
5529e7953l3262M919K1290L5025P164J4570j2725r158K7789m3645j6203M1916
5517b0273J3283K9821j7340k7322m004L2693M664l4495j2668j7910j7902k340
5505g3793p83J4747J3695k6412j416K5437L588K0861J5853K8396J3078K4936J21
5492E8308m0560m2939Q844l871L428M9528j1860k4607j3151K0132q414m7079j3984
$$ plain form
5580 50872 32053 42999 44545 35755 53309 26544 4111 11890 17036 29377 8136 1713 10266
5567 10266 -6969 -12771 13417 10995 8773 -4714 -12418 -34716 -30799 -19008 22541 -19173 -18354
5554 -18354 27834 -8957 -32803 -50308 -27284 -34658 -48609 -38414 -3343 25093 41045 31877
5542 31877 -14856 -36615 10088 19553 668 -19665 -19220 -34549 -13038 -25437 -28034 -21521 -57953
5529 -57953 -91215 -86296 -65006 -29981 -22817 -8247 -20972 -30130 -2341 -45986 -62189 -20273
5517 -20273 -6990 22831 5491 -21831 -25835 6858 11522 -22973 -35641 -53551 -71453 -73793
5505 -73793 -74576 -59829 -46134 -72546 -73962 -48525 -44937 -24076 -8223 20173 33251 58187 58308
5492 58308 17748 -25191 -16347 -20218 -16790 32738 20878 -3729 -16880 3252 -5162 -52241 -66225
5479f6225K1542O613M535p498l947K1837L3507M322j8492M117q80n771k877J431
5465g786j5899R771J76r73J0996J7771k4422J2708J7156j8217K0360j6100j5590
5452a0049o840j6369p628J4348J1140J6524M0777R119k8118l127q572N1Q182L4225
5438E3663R406j4499l6835k4645k0392n325j3278J8836M8751L6085k240l1109
5426A8418l8696j585M5236K4908J013n4121j1688k188Q118J4616Q25k3851j705
5413b0700o765K1999q12l002J1644O64j4955P579K482L090N841K1790j0233j8126
5399D96j8841Q729K8673J795R831n074l8836j831j5915R127K8928J3145k3823
5386c596k5986j2731K7842J7633q402J5532L411J0202L381j364M025R552n556
$$ plain form
5479 -66225 -44683 -38070 -33535 -41033 -44980 -23143 10364 14686 -3806 311 -569 -6340 -9217 -7786
5465 -7786 -23685 -13914 -13738 -14711 -3715 14056 -10366 2342 19498 1281 21641 5541 -10049
5452 -10049 -16889 -33258 -40886 -26538 -15398 1126 41903 51022 22904 19777 11205 11256 19438 53663
5438 53663 63069 48570 11735 -12910 -33302 -38627 -51905 -33069 15682 51767 49527 18418
5426 18418 -20278 -21863 23373 48281 49294 -4827 -16515 -18703 -10585 4031 4856 -18995 -20700
5413 -20700 -27465 -5466 -6278 -9280 2364 3028 -11927 -4348 -1866 1224 7065 28855 18622 496
5399 496 -18345 -9616 19057 20852 30683 25609 -13227 -15058 -30973 -21846 7082 20227 -3596
5386 -3596 -29582 -42313 -14471 3162 -5240 10292 13703 23905 27286 25922 29947 39499 33943
5373C3943l4803o207N804O962R204j5185O956p268k0100J7166K0130J220r903
5360G919k1157l808k6430J4864J0567R924K1727J1358j0546l0972K371j7798K4694
5347g287K603m1274q566K461m116k3K5329L3239L0493j7520k3336l0299J0800
5334b7496Q166n23j4110j1674K449J9321K5381J0079j5589l0994k0449l874K7963
5321c1350m458j1278J734J1295L345J1624J3475o202J328q812K6485j3550K122
5308d242K7980k9374l4632K7727L1120k3597j9570N416k102l8439j458J6195J7082
5295b7894J2834k0124q157j6545j1823N142n996k239J7065J4401J1391K2672J5103
5282E830p338m001n472J4683K0105q111j1154l6494l1963L6415J0095p008j2070
$$ plain form
5373 33943 -860 -7067 -1263 5699 14903 -282 6674 -594 -20694 -3528 16602 17822 7919
5360 7919 -13238 -17046 -43476 -28612 -18045 -8121 13606 24964 14418 -16554 -14183 -31981 -7287
5347 -7287 -4684 -45958 -54524 -52063 -56179 -56202 -30873 2366 32859 15339 -7997 -38296 -27496
5334 -27496 -19330 -19853 -33963 -45637 -43188 -23867 1514 11593 -3996 -34990 -55439 -59313 -31350
5321 -31350 -35808 -47086 -45352 -34057 -30712 -19088 -5613 -11815 -10487 -19299 7186 -6364 -4242
5308 -4242 23738 -5636 -40268 -12541 18579 -5018 -24588 -19172 -21274 -59713 -61171 -44976 -27894
5295 -27894 -15060 -35184 -43341 -59886 -71709 -66567 -72563 -74802 -57737 -43336 -31945 -9273 5830
5282 5830 -1508 -5509 -10981 3702 23807 15696 4542 -31952 -63915 -27500 -17405 -24413 -36483
5269c6483M2936K5315q126K3435m736j2908K0809Q516j6420r928l658P121k1155
5256A4718k7806J4737l110k5846l471J0069j616O38J699J208J2296L9138K6406
5243E9060K0256j6504k1403k0632m1466J0476J6691l9535j6765L2532K9803N41
5231A3054R045L2207m4734m3651O831J5413J457J3716j7056j2487q550j7704j2248
5218f4707j322J2580J583j5372M6141J8039L388L1852k06m4411j0780J0932r381
5205b1664K366J6811k3506J5072j2947P706K3623K5674l152k4151k4319k2269
5193d0756R693K489l637L4484j2516k716j1139L253K6794J150o418p579K2158
5180A5260K1904k1900n285j1864j539m1230N263N1073K7959q770k6266k5748k4838
$$ plain form
5269 -36483 6453 31768 23642 47077 42341 29433 50242 58758 42338 32410 28752 35873 14718
5256 14718 -13088 1649 -1461 -27307 -30778 -20709 -22325 -21687 -19988 -18780 -6484 32654 59060
5243 59060 79316 62812 41409 20777 -20689 -10213 6478 -33057 -49822 -17290 12513 13054
5231 13054 22099 54306 9572 -34079 -27248 -11835 -10378 3338 -13718 -26205 -34755 -52459 -64707
5218 -64707 -66029 -53449 -51866 -67238 -21097 -3058 330 32182 31976 -12435 -23215 -12283 -21664
5205 -21664 -19298 -2487 -25993 -10921 -23868 -16162 7461 33135 29983 5832 -18487 -40756
5193 -40756 -31063 -28574 -32211 2273 -10243 -12959 -24098 -20845 5949 7099 681 -6898 15260
5180 15260 37164 15264 9979 -1885 -3424 -44654 -39391 11682 39641 30871 4605 -21143 -45981
5167d5981K6743J9253N192j2174P076j0241k6736L3958L6981k1048j4617k5714
5155b7308k2729m258l629M8911L3973j3984k5681j225Q026o140J2984K825j1667
5142i902L87r496J3921Q38j8807k4080P695J3383j5535J6140l23M062K4364J8394
5128B1041k4516k6761r141k0977k108M3410J6925J599R767k0035j2405J5845o259
5115a3615M779L7410j774j73l205R557k184k502R331K962j6052K939Q612j2078
5101B4007q681l4643j5163L9000N0607l4481k9175M263n355k5855K385K8340K5143
5088B0392r654r083J7026l942j1617O209J8044K3012J2695j047L413k5360l5568
5075D520K712k896o913P097j0418L2941p339q993Q722r227m0066L2618K6800m402
$$ plain form
5167 -45981 -19238 15 5207 -6967 109 -10132 -36868 -2910 34071 13023 -1594 -27308
5155 -27308 -50037 -54295 -57924 -9013 24960 10976 -14705 -15930 -7904 -14044 -1060 1765 -9902
5142 -9902 -9515 -19011 -5090 -4252 -23059 -47139 -39444 -26061 -41596 -25456 -25779 -21717 2647 21041
5128 21041 -3475 -30236 -39377 -60354 -62462 -19052 -2127 -528 9239 -10796 -23201 -7356 -13615
5115 -13615 -8836 28574 26800 26627 23422 32979 30795 28293 37624 40586 24534 27473 36085 24007
5101 24007 15326 -19317 -34480 4520 55127 20646 -8529 -4266 -9621 -35476 -33091 -4751 20392
5088 20392 10738 1655 18681 14739 3122 9331 27375 50387 63082 62035 65448 40088 4520
5075 4520 7232 4336 -2577 4520 -5898 27043 19704 10711 19433 10206 -29860 2758 29558 25156
5061B5156p779k6585j8018J8423R810J5097q231j9786K4847J8826P39m202N790
5048C4087j3102N876J2667N91j0269P26J0652o949M08n800k0372o388K02J9057
5034B1386j1739j6743j5778J1349k711k052R804K2907q681p854J0482P762o561
5021A1571k2889r888j2825K8903J6240j3210l012p392K524j8854l33K22K4314
5008d629L606k2988J767Q790L5254p231j7800j5497J547j2891R53J0728K0676
4995B285l8992m723K084K0712L2646J8225J5109j050j9744j0822o022J503l3206
4982b1995j9377K9362L950q269K4919K2935j5405j1833n755Q880r088k0851m635
4969b7162K7356M390J6852J4796j2755k1475N862J8678k9038j2868J5537K5661
$$ plain form
5061 25156 17377 -9208 -27226 -8803 1007 16104 7873 -11913 12934 31760 32499 28297 34087
5048 34087 20985 26861 39528 40119 29850 30576 41228 34279 34687 28887 8515 2127 2329 21386
5034 21386 9647 -7096 -22874 -11525 -14236 -16288 -6484 16423 7742 -112 10370 18132 11571
5021 11571 -11318 -21206 -34031 -5128 11112 -2098 -5110 -12502 -9978 -28832 -29165 -28943 -4629
5008 -4629 -1023 -24011 -22244 -13454 21800 14569 -3231 -18728 -17181 -30072 -29119 -18391 2285
4995 2285 -36707 -41430 -39346 -18634 14012 32237 47346 46296 26552 15730 9708 11211 -21995
4982 -21995 -41372 -12010 -8060 -16329 8590 31525 16120 4287 -1468 7412 -1676 -22527 -27162
4969 -27162 194 4584 21436 36232 23477 2002 7864 26542 -2496 -15364 173 25834
4957B5834J5454m901j8053q3J114P593k2648k2929k0200R461j4711o017K536q005
4943e5555J9716K8177j483J4485j4235J6927K993l2868K917m693k0274L4243J0451
4930H01N491j2875L5637K0684k2020j2749k5958j2174n907J165j829l115K8239
4917d610J5039N2875J7574m3255l4043r075k764p210k4826J3973j9563J1815K7563
4904f507R262J594o548m715j4968k9530K566J147J1970K0530L6011l2176k5879
4891c7243j021J8654J2048j1500J9968K93p404M048O000M04j8207K208L3j2328
4877b4047P042K3165Q975q322k3263j377J9631J022N734q150k5258J461j5506
4864c8893J6863J0249R71K0629l658K756l6698j4994K7796K3091K9963p931l7037
$$ plain form
4957 25834 41288 36387 18334 18251 19365 26958 4310 -18619 -38819 -29358 -44069 -50086 -47550 -55555
4943 -55555 -35839 -7662 -9145 5340 -8895 8032 11025 -21843 -18926 -23619 -43893 -9650 801
4930 801 6292 -6583 29054 49738 27718 14969 -10989 -23163 -29070 -27905 -29734 -32849 -4610
4917 -4610 10429 63304 80878 37623 3580 -5495 -8259 -15469 -40295 -26322 -45885 -34070 -6507
4904 -6507 2755 4349 -2199 -6914 -21882 -51412 -48846 -47699 -35729 -15199 20812 -11364 -37243
4891 -37243 -38264 -19610 -7562 -19062 906 1199 -6205 -2157 3843 4247 -13960 -11752 -11719 -24047
4877 -24047 -17005 6160 15135 6813 -16450 -17827 1804 2826 8560 410 -24848 -23387 -38893
4864 -38893 -22030 -11781 -10810 9819 6161 8917 -27781 -42775 -14979 8112 38075 30144 -6893
4851f893j0375L0821L2919K9887j9567l1833m0975l6834J4645O183m377K82o764
4838d2881R811J3683Q279J7860j969R395N943L434N693j5157l2148L325K1449
4825F717k9289N248K2231J5276j8532j2229q358o354k3686j3027r004K6476J3175
4812c1356M4633k4242k7080J6909J3239N86l853J4500J9038K6617L186j9801r922
4799B2454J6505m313j3228k7764J1243R016O9J4235J456r068j9713l0217j9946
$$ plain form
4851 -6893 -17268 13553 46472 76359 56792 24959 -16016 -52850 -38205 -32022 -36399 -36117 -42881
4838 -42881 -33070 -19387 -11108 6752 4783 14178 20121 23555 29248 14091 -18057 -14732 6717
4825 6717 -22572 -17324 4907 20183 1651 -10578 -18936 -25290 -48976 -62003 -71007 -44531 -31356
4812 -31356 13277 -10965 -38045 -21136 -7897 -7311 -11164 3336 22374 48991 52177 32376 22454
4799 22454 38959 34646 21418 -6346 4897 13913 13982 28217 29673 20605 892 -29325 -49271
$$ [...]
##END NTUPLES=NMR SPECTRUM
##END=
