##TITLE=Analysis number 325816
Compound Code tl 00321
Project Code adrs
Chemist Name aci
##JCAMPDX= 6.0         $$ Bruker NMR JCAMP-DX V2.0
##DATA TYPE= NMR SPECTRUM
##DATA CLASS= NTUPLES
##ORIGIN= Bruker BioSpin GmbH
##OWNER= nmr
$$ XWIN-NMR		Version 3.5
$$ Mon Jan 15 15:19:41 2007 GMT Standard Time (UT+0h)  MAYBRIDGE\nmr@NMR_250MHZ
##.OBSERVE FREQUENCY= 250.131544655141
##.OBSERVE NUCLEUS= ^1H
##.ACQUISITION MODE= SIMULTANEOUS (DQD)
##.ACQUISITION SCHEME= undefined
##.AVERAGES= 16
##.DIGITISER RES= 18
##SPECTROMETER/DATA SYSTEM= dpx250
##.PULSE SEQUENCE= zg30
##.SOLVENT NAME= CDCl3
##.SHIFT REFERENCE= (INTERNAL, CDCl3, 0, 16.522)
##AUDIT TRAIL= $$ (NUMBER, WHEN, WHO, WHERE, WHAT)
$$ ##TITLE= Audit trail, XWIN-NMR		Version 3.5
$$ ##JCAMPDX= 5.01
$$ ##ORIGIN= Bruker BioSpin GmbH
$$ ##OWNER= nmr
$$ C:\u/data/dgb/nmr/ADRS/1100/pdata/1/auditp.txt
$$ ##AUDIT TRAIL=  $$ (NUMBER, WHEN, WHO, WHERE, WHAT)
(   1,<2007-01-15 15:19:15.56 +000>,<MAYBRIDGE\nmr>,<NMR_250MHZ>,
      <created by zg, POWCHK disabled, PULCHK disabled
       configuration hash MD5:
       49 4B E0 1D 92 C2 6B 37 9F E6 65 BC 52 41 86 1D
       data hash MD5: 64K
       5B BA DE 5B 2A A7 AD 9D 9D B9 DC 14 35 E8 CB 75>)
(   2,<2007-01-15 15:19:32.56 +000>,<MAYBRIDGE\nmr>,<NMR_250MHZ>,
      <Start of raw data processing
       ef LB = 0.3 FT_mod = 6 PKNL = 1 SI = 32K 
       data hash MD5: 32K
       2A D9 23 F5 98 20 66 6A A4 CC F6 B7 29 83 C2 44>)
(   3,<2007-01-15 15:19:34.25 +000>,<MAYBRIDGE\nmr>,<NMR_250MHZ>,
      <apk 
       data hash MD5: 32K
       69 7B 8D C8 65 46 BB CB 7B 0A C0 D3 32 2E 87 CF>)
(   4,<2007-01-15 15:19:35.01 +000>,<MAYBRIDGE\nmr>,<NMR_250MHZ>,
      <abs ABSG = 5 
       data hash MD5: 32K
       A3 5D 4F 4A 6B 5F 97 2C 4D 8E 79 D0 7B 9B AA E6>)
$$ ##END=
$$ 
$$ hash MD5
$$ 4B D6 EA 32 2A C1 D4 38 D6 85 2D 6F 50 43 20 25
##$RELAX= 
##$RELAX= 
##$RELAX= 
##$RELAX= 
##$RELAX= 
##$RELAX= 
##$RELAX= 
$$ Bruker specific parameters
$$ --------------------------
##$DU= <C:\u>
##$EXPNO= 1100
##$NAME= <ADRS>
##$PROCNO= 1
##$TYPE= <nmr>
##$USER= <dgb>
##$AMP= (0..31)
100 100 100 100 100 100 100 100 100 100 100 100 100 100 100 100 100 100 
100 100 100 100 100 100 100 100 100 100 100 100 100 100 
##$AQSEQ= 0
##$AQ_mod= 3
##$AUNM= <au_zg>
##$AUTOPOS= <40 >
##$BF1= 250.13
##$BF2= 250.13
##$BF3= 250.13
##$BF4= 250.13
##$BF5= 500.13
##$BF6= 500.13
##$BF7= 500.13
##$BF8= 500.13
##$BYTORDA= 1
##$CFDGTYP= 0
##$CFRGTYP= 5
##$CHEMSTR= <none>
##$CNST= (0..31)
1 1 145 1 1 1 1 1 1 1 1 1 1 1 1 1 1 1 1 1 1 1 1 1 1 1 1 1 1 1 1 1 
##$CPDPRG= <>
##$CPDPRG1= <>
##$CPDPRG2= <>
##$CPDPRG3= <>
##$CPDPRG4= <mlev>
##$CPDPRG5= <mlev>
##$CPDPRG6= <mlev>
##$CPDPRG7= <mlev>
##$CPDPRG8= <mlev>
##$CPDPRGB= <>
##$CPDPRGT= <>
##$D= (0..31)
0 1 0 0 0 0 0 0 0 0.06 0 0 0 0 0 0 0.0002 0 0 0 0 0 0 0 0 0 0 0 0 0 0 
0 
##$DATE= 1168874354
##$DBL= (0..7)
120 120 120 120 120 120 120 120 
##$DBP= (0..7)
150 150 150 150 150 150 150 150 
##$DBP07= 0
##$DBPNAM0= <>
##$DBPNAM1= <>
##$DBPNAM2= <>
##$DBPNAM3= <>
$$ [...]
##$SUBNAM7= <"">
##$SUBNAM8= <"">
##$SUBNAM9= <"">
##$SW= 20.6930455092707
##$SWIBOX= (0..15)
0 0 3 0 0 0 0 0 0 0 0 0 0 0 0 0 
##$SW_h= 5175.983436853
##$TD= 65536
##$TD0= 1
##$TE= 294.16
##$TE2= 300
##$TE3= 300
##$TEG= 300
##$TL= (0..7)
0 120 120 120 120 120 120 120 
##$TP= (0..7)
150 150 150 150 150 150 150 150 
##$TP07= 0
##$TPNAME0= <>
##$TPNAME1= <>
##$TPNAME2= <>
##$TPNAME3= <>
##$TPNAME4= <>
##$TPNAME5= <>
##$TPNAME6= <>
##$TPNAME7= <>
##$TPOAL= (0..7)
0.5 0.5 0.5 0.5 0.5 0.5 0.5 0.5 
##$TPOFFS= (0..7)
0 0 0 0 0 0 0 0 
##$TUNHIN= 0
##$TUNHOUT= 0
##$TUNXOUT= 0
##$USERA1= <user>
##$USERA2= <user>
##$USERA3= <user>
##$USERA4= <user>
##$USERA5= <user>
##$V9= 5
##$VALIST= <valist>
##$VCLIST= <CCCCCCCCCCCCCCC>
##$VD= 0
##$VDLIST= <DDDDDDDDDDDDDDD>
##$VPLIST= <PPPPPPPPPPPPPPP>
##$VTLIST= <TTTTTTTTTTTTTTT>
##$WBST= 1024
##$WBSW= 4
##$XGAIN= (0..3)
0 0 0 0 
##$XL= 0
##$YL= 0
##$YMAX_a= 708251
##$YMIN_a= -695235
##$ZGOPTNS= <>
##$ZL1= 120
##$ZL2= 120
##$ZL3= 120
##$ZL4= 120
##$ABSF1= 16.522
##$ABSF2= -4.171173
##$ABSG= 5
##$ABSL= 3
##$ALPHA= 0
##$AQORDER= 0
##$ASSFAC= 0
##$ASSFACI= 0
##$ASSFACX= 0
##$ASSWID= 0
##$AUNMP= <proc_1d>
##$AZFE= 0.1
##$AZFW= 0.1
##$BCFW= 0
##$BC_mod= 0
##$BYTORDP= 0
##$COROFFS= 0
##$CY= 12.5
##$DATMOD= 1
##$DC= 0
##$DFILT= <>
##$DTYPP= 0
##$F1P= 14.0000005364418
##$F2P= -0.99999901652339
##$FCOR= 0.5
##$FTSIZE= 32768
##$FT_mod= 6
##$GAMMA= 0
##$GB= 0
##$INTBC= 1
##$INTSCL= 1
##$ISEN= 128
##$LB= 0.3
##$LEV0= 0
##$LPBIN= 0
##$MAXI= 10000
##$MC2= 0
##$MEAN= 0
##$ME_mod= 0
##$MI= 0
##$NCOEF= 0
##$NC_proc= -3
##$NLEV= 6
##$NOISF1= 0
##$NOISF2= 0
##$NSP= 0
##$NTH_PI= 0
##$NZP= 0
##$OFFSET= 16.522
##$PC= 1
##$PHC0= 227.5739
##$PHC1= 5.873865
##$PH_mod= 1
##$PKNL= yes
##$PPARMOD= 0
##$PSCAL= 4
##$PSIGN= 0
##$REVERSE= no
##$SF= 250.13
##$SI= 32768
##$SIGF1= 0
##$SIGF2= 0
##$SINO= 400
##$SIOLD= 32768
##$SREGLST= <1H.CDCl3>
##$SSB= 0
##$STSI= 32768
##$STSR= 0
##$SW_p= 5175.98343685301
##$SYMM= 0
##$S_DEV= 0
##$TDeff= 65536
##$TDoff= 0
##$TI= <Analysis number 999999
Compound Code 99
Book Reference 9
Project Code 9>
##$TILT= no
##$TM1= 0
##$TM2= 0
##$TOPLEV= 0
##$USERP1= <user>
##$USERP2= <user>
##$USERP3= <user>
##$USERP4= <user>
##$USERP5= <user>
##$WDW= 1
##$XDIM= 32768
##$YMAX_p= 473690951
##$YMIN_p= -51873
$$ End of Bruker specific parameters
$$ ---------------------------------
##NTUPLES= NMR SPECTRUM
##VAR_NAME=  FREQUENCY,     SPECTRUM/REAL,   SPECTRUM/IMAG
##SYMBOL=    X,             R,               I
##VAR_TYPE=  INDEPENDENT,   DEPENDENT,       DEPENDENT
##VAR_FORM=  AFFN,          ASDF,            ASDF
##VAR_DIM=   32768,         32768,           32768
##UNITS=     HZ,            ARBITRARY UNITS, ARBITRARY UNITS
##FACTOR=    0.157963299565203, 1,           1
##FIRST=     4132.6476996994, 0,             0
##LAST=      -1043.33573715361, 0,           0
##MIN=       -1043.33573715361, -51873,      0
##MAX=       4132.6476996994, 473690951,     0
$$ Real data points
##PAGE= N=1
##DATA TABLE= (X++(R..R)), XYDATA
$$ [...]
21015 31817 39029 17052 795 -4972 -11499 -16402 -7445 8112 12268 8682 13816 14618 13309 2946
21001 2946 -4023 -2014 -114 6608 7435 -5026 -12377 -3644 -7121 -12395 -2677 12358 22620 3866
20987 3866 -1560 -908 6934 11063 5076 -3957 -10703 -12581 -10164 -10625 -9002 -3554 -3734 -15658 -14080
20972 -14080 -7669 2157 6742 5014 12054 -2569 -11122 -945 -6059 -7142 -12217 -13085 -15478 -11677
20958 -11677 -15108 -22652 -26491 -25944 -24297 -23820 -12363 -13679 -15784 -6121 -12269 -26003 -25687 -31881 -33643
20943 -33643 -21944 -4678 -4917 -6671 3596 2127 2376 12706 9293 5880 -5213 -7022 -18409
20930 -18409 -21705 -11858 8837 12388 4595 9585 12450 5595 -885 -5462 -17543 -15809 -18077 -12919
20916 -12919 975 7615 -1691 -9355 -4242 -2372 -2644 -3307 -9776 11677 16212 13763 10312 3738
20902 3738 -5236 4588 1199 -14950 -13650 -6982 -5584 780 12952 15139 3394 6134 10987 13195
20888 13195 18928 14257 1085 3466 495 3213 6262 11494 1515 11728 23337 34058 30509
20875 30509 15454 160 -15535 -26221 -26974 -17685 -9810 2627 -2542 -9067 2132 -5703 843
20862 843 8983 -6617 -10222 -1611 -6389 -6411 1066 7980 1792 2094 -3200 -4039 -4099 1902 -7914 -5860
20846 -5860 -6217 -17872 -11292 1982 -6966 -9161 -11597 -11619 -6631 -9659 -18442 -13876 -18511 -34988 -30078
20831 -30078 -13569 -6323 1677 -1331 -8055 -15436 -8816 -14854 -16581 3857 15141 11106 -3751
20818 -3751 -17063 -15760 -12787 -13349 -6684 -7101 -13148 -6681 -3953 -11287 595 3732 -8784 -7376
20804 -7376 -3589 -1083 -3380 -12606 -26254 -20351 -16694 -18260 -4762 9561 7499 747 3721 -6687
20790 -6687 5568 19868 15348 -41 -5579 -6810 -19671 -21179 -15216 -20256 -39430 -39420 -34533 -23809
20776 -23809 -9234 -6626 -1916 -2151 -1085 -14201 -9020 10724 15826 25303 24677 5676 -102 11918
20762 11918 8608 -1488 10616 10044 5996 2822 -8638 -13382 -14229 -15664 -10105 -4286 157 -3438
20748 -3438 -12900 -17367 -15295 -18633 -14927 -17042 -24007 -24906 -20629 -3504 -1880 4298 10276 16611 11083
20733 11083 -5099 -12998 -1982 -1821 -968 3908 6719 8068 5406 556 4020 -609 -20975 -23387
20719 -23387 -6816 1584 9180 -4891 -21708 -14337 1960 2684 -962 -4854 738 -6769 -15519 -7133
20705 -7133 4592 4689 4564 9594 -4931 -13110 -16867 -19611 -23410 -23211 -9256 -4144 1809 1850 1946 8005
20689 8005 -5956 -21500 -23040 -17253 -14371 -13712 -9500 125 -1718 -6683 -759 3473 -5489 -1636
20675 -1636 7354 14504 11757 15132 17573 4374 -6119 -1602 -2146 4393 -5136 -9998 -19140 -20130 -4250
20660 -4250 -10626 -15785 -15409 289 27477 27774 25914 22341 24767 17238 4909 1232 191 3237
20646 3237 -1369 5588 13742 8859 5523 3720 2785 -3691 -7676 -11002 -15994 -3276 870 -1662 -14559
20631 -14559 -13472 -12767 -23271 -17507 -21713 -8148 -1772 -1463 1777 5308 1184 -767 3135 3430 1697
20616 1697 -2347 -15164 -14686 -4464 5765 1772 -2927 -11369 -2569 8497 13073 26021 14081
20603 14081 4691 20301 14048 13414 -1537 -11205 1446 -16349 -25772 -16669 -16436 -23576 -32372 -27635
20589 -27635 -22859 -15305 -16268 -15599 -11720 -11670 -16901 -10914 -15426 -9750 2082 10958 13887 12016 8596
20574 8596 -11978 -19182 -15219 -325 -345 -12924 -15829 -8880 2836 -9479 -4843 -2814 -5741 -9021
20560 -9021 -6519 -2812 2430 7326 7543 10143 10932 -619 -528 1082 -4283 -15706 -16023 207 -203
20545 -203 -10323 -15855 -9480 -11250 -22988 -16603 -7571 -8318 -5311 6029 -1707 -9563 -17651 -14636
20531 -14636 6516 9482 14355 12716 3192 -11905 -20167 -24722 -10468 152 9882 15453 11608
20518 11608 14234 17597 16757 18329 11332 15740 3100 -13323 -13832 -17133 -6818 179 -3913 -413
20504 -413 3273 -3247 -3370 -3582 -256 -3306 1215 3205 8401 20834 29605 29070 35407 30392 20962
20489 20962 18741 15873 10391 2848 2304 15056 26528 27260 26577 15829 6786 58 -5639 -3424
20475 -3424 -6601 -3177 1437 -9990 -9947 -12700 -8523 -7216 -501 -1116 392 11209 13442 1303 -10554
20460 -10554 -12540 -12025 -1916 13963 14797 779 8416 -1128 6069 19699 21310 11323 5672 6584
20446 6584 6960 2297 5365 -395 6811 5386 496 3256 6299 4044 -9557 -15710 -256 842
20432 842 -6017 -5522 1204 689 0 -3954 -6118 -4336 -10715 -17921 -16559 -13388 -11277 -17303 -3232
20417 -3232 14539 475 -16154 -25175 -22984 -21819 -5102 10486 4195 1566 -4424 -3756 12520
20404 12520 14518 18595 12108 20529 22717 8992 -1353 2775 -85 -4236 -12249 -10641 -4092 -8729
20390 -8729 -9400 -5370 -4213 -362 6277 9246 6296 -2742 -8407 -9598 -12168 757 13556 11170
20376 11170 6053 4484 -1930 -2632 -2055 -4700 -5714 -5347 -2274 -4208 -18295 -21424 -21102 -31225 -31706
20361 -31706 -9984 11640 16136 8305 -3992 -13362 -13860 -19115 -9532 7519 22942 30578 32555
20348 32555 29753 21952 25116 26630 22412 9729 25074 19743 3826 10962 19095 18367 20646 11912
20334 11912 -4669 1094 10627 25126 28704 26532 18794 738 6115 15184 16002 11244 -3253 -81
20320 -81 -2443 -22589 -14206 -5787 4470 2654 -1073 -12125 -10401 -8202 -6047 3141 8811 6631
20306 6631 -6169 -3670 13157 12002 15180 21852 9154 2479 11550 26463 16219 -2907 -10916
20293 -10916 -108 3123 -4303 -407 -2770 -9621 -6484 -10546 -8770 -5033 -526 3157 6976 7151
20279 7151 9395 17757 24541 9502 1132 -1130 -7694 -8208 -3580 -4137 -4158 7215 18999 19495 17856
20264 17856 16303 19418 14595 -1969 -21735 -18934 -11717 -13658 -5181 3089 8003 16018 23240 13197
20250 13197 21451 22570 7537 -1097 -325 7024 7128 -14032 -29907 -15735 8679 22353 16129
20237 16129 3877 -16950 -17935 -13168 -2418 -5207 -9193 -2360 12425 7793 -8663 -9964 -11921
20224 -11921 -23138 -24391 -5968 -8259 -13369 -13738 -16009 -14135 -6909 14126 4505 -8460 -14472 -9705
20210 -9705 -7880 2251 3364 -1190 -2236 -156 2276 14734 26563 21999 21988 23705 22583 23566 22311
20195 22311 25781 27815 23735 25673 11696 13825 12804 3621 2894 5463 11004 2771 -6898 -6274 -1530
20180 -1530 -2690 -2182 -10823 -7939 10008 16995 20999 8998 15552 20822 17705 4174 -33 11718
20166 11718 11315 2986 -1663 9288 10313 -6504 -6486 -9376 -2907 9953 5262 1803 -4390 -13699
20152 -13699 -19393 -13881 -4804 -6910 -751 -2279 -2640 7583 8286 11395 13478 21099 21434 15386 15743
20137 15743 19216 27856 40069 41105 20413 13536 16991 26654 18590 6083 -3693 -5589 -6729 -7425
20123 -7425 -10001 -15422 -21897 -18729 -14157 -17362 -5190 7456 13680 13884 7469 14369 11803 12782 21645
20108 21645 29659 32135 24036 17777 20517 14831 12241 6513 9519 13158 5729 -4674 5560 18539
20094 18539 24292 24555 10847 1307 3756 3922 12369 25336 21031 15273 5706 6220 2287 9217 7340
20079 7340 6756 18719 19505 22457 16908 15255 8660 9724 4759 810 6956 13092 9129 1605 -8051
20064 -8051 -789 13026 19959 23219 25497 15439 24697 16594 19204 9731 -3871 -5190 21922 35783
20050 35783 25371 19862 8195 1993 8039 19685 25796 13600 3118 -8377 -31523 -33122 -22006
20037 -22006 -17425 -9673 5328 10130 8448 10209 649 -1357 22887 26833 -5784 -25724 -17589
20024 -17589 -17010 -20176 -14658 -496 1139 -5140 5832 1161 -3703 4066 10580 13453 14735 16715
20010 16715 15141 6691 9637 17963 17204 12360 5606 9882 10125 2947 -13833 -23128 -3259 2736
19996 2736 -8804 -911 10651 13734 5146 5830 4988 12241 26850 13714 3463 -1407 7974 9864
19982 9864 541 -9839 -15200 -11648 -8458 -6720 10816 12630 8378 10010 6327 10328 13274 14779
19968 14779 10860 4765 -6298 -291 12988 6500 -5196 -320 12243 17872 13355 6440 5126
19955 5126 12406 23113 24705 30068 31675 14312 4088 7004 1289 1188 4289 5527 -1115 408
19941 408 -1396 469 8118 4451 244 6007 8841 10349 10850 11955 14281 -665 -1924 12570 32744
19926 32744 28144 10146 -7875 -22494 -24401 -31937 -20488 -12659 -7905 -15799 -19632 -13284 -15212
19913 -15212 -7442 1300 -251 9315 14157 11824 5135 7564 9831 11202 5657 7746 423 11281
19899 11281 23042 28426 24181 23696 20785 9526 2906 4936 10830 9128 5558 5526 11168 16123 14090
19884 14090 5763 -699 -1923 -5552 -5769 -5728 11485 16123 8738 8564 4034 7179 12928 21335 9962
19869 9962 15340 25618 27575 17676 19793 3264 -17122 -5520 11445 23503 33825 27195 22884
19856 22884 29006 17478 16491 24191 23005 19105 20887 14491 19524 18838 24132 666 -16814 -18306
19842 -18306 -11234 1116 4791 15027 31561 27990 28405 28341 32042 36603 19991 9223 3118 888
19828 888 6047 10955 13271 16077 17371 14324 12812 17075 10892 2537 16940 31208 30695 21807 18749
19813 18749 22724 24510 14300 10778 25142 34704 32008 30809 18996 18114 6536 -4241 14343
19800 14343 22784 16875 9037 4339 18211 25737 26813 25084 25651 12582 934 -11665 -8589 11729
19786 11729 14826 -6640 -6845 1179 11629 16866 15757 1494 -2023 5341 17328 11028 9789 17769
19772 17769 16313 -3607 -4957 6044 19707 18135 14827 12682 16453 14236 6461 20696 30248
19759 30248 19843 8014 358 1237 11748 598 -8187 5474 15989 6636 12425 29695 27710
19746 27710 29720 19627 2869 -2658 -266 17461 18329 2811 -4926 7309 21196 12648 14091
19733 14091 16354 18137 14019 8857 16195 15460 7727 2689 -5908 -3541 7353 26559 22649 6578
19719 6578 -3920 4863 12112 21778 27759 24507 21203 18536 8644 19332 32002 28302 19818 28911
19705 28911 18979 12370 26261 31112 30814 14264 14884 17231 24106 19375 18469 11693 5800 16894
19691 16894 27808 28783 29759 31986 34864 18486 3600 4848 14914 29499 35974 15680 3663
19678 3663 19148 22815 30543 27958 37533 48770 36860 20828 24032 29743 35256 20306 18696
19665 18696 25155 12151 11125 21093 33107 51094 54764 51392 59264 53258 46464 48856 47894 37294
19651 37294 31683 37362 39841 33497 34606 33464 32537 30638 34639 30402 28265 19749 30290 32711
19637 32711 39366 41047 39250 42814 43362 45478 48654 38422 26286 30253 45192 36662 34933 31564
19623 31564 32261 37559 36136 30658 32092 23704 18036 25642 29624 26303 22341 28306 34248 41930 31381
19608 31381 27605 44244 55903 59347 63554 55644 64944 76640 90280 105888 129314 147670 172316
19595 172316 197985 225396 247480 260693 265243 263454 267282 269219 272573 285574 287284 299248 323620
19582 323620 376439 433102 490046 538696 577852 612536 647178 658995 656853 643599 605667 558486
19570 558486 533538 513909 496639 489423 514082 520376 530116 548231 550964 544608 537934 513530 476906
19557 476906 443012 409680 355606 313774 292515 259271 225989 207385 201567 194076 190685 201285
19545 201285 207937 234144 258770 276223 293241 310492 318615 309293 296421 278335 269717 264467
19533 264467 261075 261930 266667 274159 297886 306485 309426 304962 287871 272877 247767 234561 230309
19520 230309 226008 227445 219782 202691 189070 173197 167124 160991 131110 104040 88175 82261 80390
19507 80390 86994 82636 77126 78570 82833 68144 48546 38629 41162 43943 39089 42046 30376 38210
19493 38210 53325 54086 42875 39341 46635 45210 53365 48392 34717 31341 38303 37736 28515 28790
19479 28790 26226 32509 39305 29088 26496 37481 51653 49274 52315 68911 82220 92263 103932
19466 103932 120563 121596 129184 127532 120009 103548 95116 98225 91493 81630 74415 71786 61019
19453 61019 56997 57608 51161 53230 73374 80714 71821 51306 48829 51219 57560 57827 56331 46402
19439 46402 42243 48464 45580 44950 37110 31153 27599 33689 40973 42177 42086 32539 24172 24665 27706
19424 27706 16743 15812 19220 25569 40299 35047 28879 24165 27591 31741 29809 28339 38372 35031
19410 35031 25296 32636 28970 21260 11531 14910 6874 25994 37525 25619 28307 45976 49837
19397 49837 54001 52193 42687 40376 56518 71431 74750 48057 30694 26415 21527 9872 17018
19384 17018 23242 12062 10402 10018 4502 10425 16575 18828 18953 14060 32771 36280 32135 31571 25865
19369 25865 20920 35217 25397 14710 10344 7000 21106 35180 27799 25476 11957 3943 17117
19356 17117 24674 40919 48217 38938 37588 42550 38393 43807 45925 54797 62966 59630 52635 55879
19342 55879 53007 73811 70884 55092 63077 63411 59610 50956 50867 46436 59532 77740 86384 90470
19328 90470 97165 101669 111350 119456 127578 131051 145356 160551 162431 171230 184047 190084 184199 180469
19314 180469 177525 185354 201433 200064 180733 165055 150644 146260 154575 156174 150852 141810 140382
19301 140382 134319 130001 131074 139593 152121 137986 116360 133999 133558 133636 145965 139671 139758 132572
19287 132572 119327 132424 142997 140159 135758 135357 136926 128731 135752 130421 121690 116738 112406 109387
19273 109387 107406 108713 123312 106970 89600 98845 102647 115941 113460 110666 104484 105575 116642
19260 116642 126558 128280 115690 107278 110629 98643 107469 114634 108411 104425 105153 77870 70666 73512
19246 73512 65083 81980 90994 92955 104513 114301 121689 130247 132118 132927 131090 122283 119788 126628
19232 126628 138440 154192 165437 172537 167282 160754 173029 171309 169943 182607 194720 187717 164518
19219 164518 147308 137749 128980 141059 150994 135301 105034 104759 99506 87817 91129 97484 95527
19206 95527 92118 89545 84354 84938 85547 79557 84133 103073 114834 128326 139750 151836 165234
19193 165234 171244 198427 209932 196472 201275 211629 231933 243737 249836 236187 236905 254944
19181 254944 275581 294406 291828 281947 281847 289481 296171 294412 284728 287950 288789 278383 269228 267997
19167 267997 259507 246984 240483 247103 245482 234015 229128 228328 238786 252135 266233 274010 287843
19154 287843 297101 285336 291598 302271 325187 340031 377369 408966 436572 465236 492769 524542
19142 524542 549839 588988 605699 620123 641928 651851 684116 713579 728144 755464 772047 799505
19130 799505 808361 818747 847992 869468 887564 903258 920855 916236 906080 899156 897122 894048
19118 894048 884901 870703 853307 846731 866845 889010 923576 967009 1017902 1089617 1142910 1207099
19106 1207099 1277853 1329229 1380637 1442374 1509144 1584279 1672665 1784881 1925199 2108601 2318131
19095 2318131 2575461 2879178 3203994 3533794 3914407 4343449 4803496 5310076 5864152
19086 5864152 6462764 7109819 7845812 8719248 9737927 10971194 12514847 14496727 17144624
19077 17144624 20850538 25912251 32798845 42122009 53778254 67933434 84137197 101754708
19069 101754708 119689605 135951306 151075266 161913325 168515685 171591542 169592304
19062 169592304 164072396 155493801 145206797 134236805 123031821 113014625 104388279
19055 104388279 96423338 89865379 83968144 78298313 73173761 67340150 61869480 56069184
19047 56069184 50015825 44474145 39172718 34512983 30374184 26829014 23937215 21582234
19039 21582234 19724709 18281234 17196048 16427025 16013785 16022288 16572059 17848646 20037037
19030 20037037 23235399 27454385 32727637 38762708 44768596 50603116 55714136 58909770
19022 58909770 60529125 60586134 58581417 55180213 51568976 47552832 43993031 41601202
19014 41601202 40298055 39765266 39965600 40543258 40654166 40223755 39168572 37070538 34028042
19005 34028042 30723578 27001447 23207095 19791333 16810664 14260590 12228636 10630088
18997 10630088 9383238 8441006 7681023 7041587 6492241 6013882 5589184 5206292 4871972
18988 4871972 4556684 4273075 4036372 3801406 3582517 3385534 3206388 3056746 2898754
18979 2898754 2749788 2611072 2484008 2377313 2269838 2157366 2057650 1968097 1893883 1823327
18969 1823327 1754371 1683257 1626726 1564128 1509619 1465971 1418498 1364754 1322346 1279753 1240724
18958 1240724 1194482 1143777 1103893 1073304 1027210 991003 969247 948588 927227 892380 847329
18947 847329 827009 803756 781162 773626 756945 737757 721333 708127 673301 663522 657824 653718
18935 653718 653887 639456 637382 636962 620720 623082 612042 609198 584717 554359 536424 528682 543098
18922 543098 553719 540202 523048 519756 498871 478265 458415 444736 439424 429425 426162 419927
18910 419927 404394 394139 373117 346605 337111 333507 317174 304026 286952 270394 261854 253266
18898 253266 256741 253716 258447 254552 237971 248046 252235 258037 256779 250051 246970 249896 260220
18885 260220 274206 286310 286563 279860 292900 303222 297791 281825 261040 251995 244227 246367 234742
18872 234742 236486 228979 215040 193430 172204 168535 190000 203447 204359 199095 193435 190552 197829
18859 197829 197299 196907 195293 196485 186805 181289 169146 159358 153075 135252 119714 112515 101223 106342
18845 106342 101779 94027 99193 107093 106352 90261 76520 62821 74958 77704 74429 62006 71517
18832 71517 77914 74882 82691 77596 70572 71280 64374 46192 49205 56098 67334 84528 81746 78048
18818 78048 85611 85990 85573 88655 93764 90675 84470 85202 100699 90780 77428 75051 77514 68262 54504
18803 54504 41841 34350 31259 27207 37339 31496 24782 31871 21528 15593 21489 20781 9090 2329
18789 2329 9339 36710 43900 24948 12115 27210 36595 32239 24231 33035 34605 31247 24577 31672
18775 31672 50751 52821 61711 77776 93499 100364 118278 141789 157729 181084 173218 123027
18763 123027 89091 80795 87668 81710 69167 75545 80321 61065 36636 46556 67647 74740 69250
18750 69250 67939 66669 71005 85372 70715 52240 43790 32823 32318 30552 38546 44228 36510 44982
18736 44982 43976 32992 29084 28029 38405 36151 25444 21560 21731 32039 32050 34243 24575 19675
18722 19675 19168 26331 31731 36964 40810 43074 49049 53129 44960 36591 34525 37068 42576 43800 41140
18707 41140 37960 45688 60896 53248 35378 20494 17944 14610 20256 32050 31328 25471 24040 31408
18693 31408 24994 25603 26072 18978 26350 22228 18336 21257 25326 29154 42718 46089 30060 27676
18679 27676 29847 33840 18623 5053 16190 9944 21977 37443 43300 38377 35805 27466 14382
18666 14382 23030 31669 22492 26828 29281 13957 16335 33190 30159 31453 36443 50732 41986 36898
18652 36898 36673 26251 21205 36668 41711 32258 25517 21893 39595 62867 73823 79186 92942
18639 92942 125229 141126 166395 196971 228563 251924 297499 353150 383384 396145 404479 399142
18627 399142 379244 356995 335868 317753 280190 241639 221361 206985 201099 185125 165636 158231
18615 158231 156661 153714 151625 153518 153464 146480 137362 125354 108900 109823 95204 77667 66377 56777
18601 56777 66180 79085 87923 91916 93848 99384 105592 111006 125148 122118 109199 118955 134057
18588 134057 143151 138489 135896 152769 167437 173678 189721 197727 204270 213698 231104 262744 306680
18575 306680 343855 345663 336948 328155 315223 278025 253216 252593 239134 213516 213224 222169 241601
18562 241601 273631 310635 352118 403767 461274 522462 583984 625140 651706 676597 688158
18551 688158 687840 679239 663575 652288 640971 627999 623010 637686 647263 652948 670361 670912 645363
18538 645363 626057 594062 545997 499681 453237 378310 320734 286611 247273 216933 198162
18527 198162 169463 146976 125423 119572 109982 104734 106326 83192 78471 81961 92062 91946 77098
18514 77098 88001 88429 89877 103001 101053 120039 142943 163663 172278 190786 223699 259427 278495
18501 278495 291310 298300 300452 298999 273504 240646 229558 216747 216963 238126 261142 285118
18489 285118 293316 294161 283020 283378 273790 244896 225992 191517 154069 131478 110841 93972 97779
18476 97779 88798 80239 63905 58930 71230 57982 51401 42957 44960 38120 34850 42553 49929 49728
18462 49728 48012 49147 49247 40800 33269 23370 19348 22594 24773 18840 25486 27894 14035 10372
18448 10372 15192 9467 3689 2191 -3297 -8471 -13624 2829 3280 6889 -21 -14081 -10514 11725
18434 11725 33249 35216 5740 -3401 2213 180 -5317 12301 20534 9084 1339 2981 1624
18421 1624 3879 22333 12075 15467 19877 23840 17251 19908 6048 16718 27920 18086 21604
18408 21604 29220 23224 24025 17471 11919 11789 7236 2161 8899 23662 26646 29593 36006 32693 29024
18393 29024 35989 32089 28726 23720 12710 13155 22916 42778 61209 63615 48543 43444 51605 65556
18379 65556 71734 63225 59162 57958 72780 80336 79583 77024 56863 56694 46119 39074 37317 47834
18365 47834 67741 59110 63263 71094 69056 70734 51452 34556 36763 42653 45176 55383 60407
18352 60407 57083 66783 79493 68393 68147 65069 62792 60976 68422 68080 70166 77045 64633 69575
18338 69575 79626 79779 73623 72637 61635 54850 69669 79931 90011 83281 74502 73268 78641 77764
18324 77764 86207 92623 85762 90302 97052 92472 92879 73788 51336 42733 52312 72520 91253 84229
18310 84229 54694 58462 65950 71731 81073 87345 94759 92750 99579 100606 107871 113782 119543 114682
18296 114682 100199 103566 120583 120154 113190 113122 110608 116375 111590 110224 105329 90673 79900 86689
18282 86689 90394 84335 97201 97333 82751 78676 85700 80116 71126 63523 78607 82724 82458 90629
18268 90629 99190 91836 75810 70774 63146 37008 32673 47237 55537 54428 44963 54683 77312
18255 77312 75855 69190 76418 75238 86681 99476 116329 117877 110045 104995 90741 83917 88187
18242 88187 104164 116598 120353 130760 133885 118070 109359 120040 132099 136441 129839 130068 137608
18229 137608 151220 132424 129633 133428 122377 130388 138016 128431 131298 117350 98344 99306 94786
18216 94786 107604 120388 141508 152363 166614 169507 178716 177774 164289 163811 180949 190974 192866
18203 192866 210654 228304 232344 223532 228706 231057 236650 239651 229772 229221 237620 248532 237685
18190 237685 246418 245826 243027 243615 243664 237346 254244 268479 265970 276018 284184 290448 292123 300492
18176 300492 307638 315550 339972 358524 365917 383273 401656 398167 424262 469642 500938 547528
18164 547528 584809 615187 666937 738231 813772 893649 995646 1104885 1218321 1338278 1461370
18153 1461370 1587523 1721024 1874194 2025213 2177127 2341883 2512320 2710893 2964722
18144 2964722 3288522 3705492 4301609 5161483 6386573 8122831 10462658 13492310 17413227
18135 17413227 22060835 27508895 33468858 39635765 45796788 50891461 55592391 58626545
18127 58626545 60368921 60802358 59518818 57499172 54063550 50545765 46868061 43246001
18119 43246001 40305844 37796848 35849155 34129498 32712161 31580115 30838869 30853195
18111 30853195 32655090 37292875 39925922 39777667 37187700 28394749 21037352 16794389
18103 16794389 14125133 12320306 11059213 10182510 9608363 9276717 9155591 9247108 9567347
18094 9567347 10082728 10812392 11761277 12916574 14257939 15629302 17079504 18619929 20083402
18085 20083402 21643469 23357829 25234365 27359891 29739131 32735788 36098953 39838709
18077 39838709 43661394 47553044 51252611 53741939 55884494 56568394 56158124 54524532
18069 54524532 51449043 47787657 42926318 37947739 32986623 28093680 23709627 19893774
18061 19893774 16739781 14155067 12102789 10500969 9221539 8206130 7414590 6762203
18053 6762203 6217145 5757140 5367335 5015225 4677481 4361746 4082674 3822207 3584450
18044 3584450 3371246 3165201 2963653 2778212 2608893 2449111 2299187 2159135 2024334
18035 2024334 1908867 1805264 1712827 1609457 1527954 1446210 1385292 1331957 1282369 1252019 1198710
18024 1198710 1145646 1100951 1086046 1051706 1019095 979984 928211 878061 844022 817882 810405
18013 810405 797560 778261 747003 726354 695498 674182 651475 637346 617037 591881 592306 583608
18001 583608 572823 570227 573107 571651 564014 564392 565938 584424 607287 610498 613195 597715 596124
17988 596124 601620 602006 586980 566575 535775 517752 486285 452812 419309 395821 386477 378562
17976 378562 358610 345361 340207 322888 309934 294909 290348 294356 296696 288272 282839 270976 270940
17963 270940 274755 277056 279089 279031 267825 284408 301490 300234 296439 287070 283830 293439 292289 285242
17949 285242 296819 304524 304112 307591 313625 311298 311879 308559 310716 302071 296724 289672 280380 264829
17935 264829 247071 240138 229828 218968 197434 182624 170514 160716 149660 157857 162203 147767
17923 147767 148241 145411 146648 144275 144149 143175 152766 151650 147332 131312 127498 134848 130533 140383 139918
17908 139918 128691 133168 134261 130558 130510 140077 144512 137833 129434 135960 153343 147509 139106 129619
17894 129619 127717 121207 124104 126441 117452 109137 104393 102187 94152 88855 71993 62522 58605 54102
17880 54102 57618 51225 46201 30911 27735 36405 42084 31849 23209 27755 42165 55032 68617
17867 68617 64464 56033 49065 59454 57150 55488 60746 57804 59308 53577 49726 59242 67841 77393
17853 77393 83691 81500 80983 83292 87707 89454 85944 86842 87620 90593 84655 81675 83529 76872 67334
17838 67334 49212 50474 67917 76231 77100 83267 75990 61827 54542 43300 44894 53086 64960
17825 64960 59383 55074 49505 44969 33904 44754 47896 30744 21624 15992 19643 21382 25697 13138
17811 13138 12795 26445 18416 11930 6932 5530 4721 3601 6837 13392 17760 14812 10223 18688 31672
17796 31672 29785 11529 7369 4257 11490 25203 31944 29489 37236 20916 12374 19839 24444 14888
17782 14888 14388 13368 21899 34135 25835 24238 21346 20855 31016 34381 34492 42076 45720 38774 21246
17767 21246 23071 31206 31401 34006 34261 19416 20136 32008 26964 20700 14561 15242 15654 23821 22467
17752 22467 22971 19521 10395 -4747 549 5916 2090 -16505 -16980 -24097 -23662 -9074 -5580 4518
17738 4518 13266 9194 2875 2432 18129 11843 -8410 -15694 -3823 1108 -9013 -16688 -18276 -11619
17724 -11619 4294 11784 11821 9337 22857 33884 38244 33335 35044 37835 25149 16954 21274 22794
17710 22794 25747 21023 25143 36182 50989 45224 46390 47867 51331 33345 23483 14482 7676 6976
17696 6976 9107 7448 4201 13217 19797 19418 22853 25926 31207 16572 18504 3733 -3128 -10342
17682 -10342 -15561 -7700 -2194 -1919 -2943 9433 22065 18494 3798 -9155 -10713 6486 13251
17669 13251 10189 -2919 -1416 6343 -1018 5318 18129 17676 3033 -401 -15320 -11698 -13192 -5133
17655 -5133 5495 14778 26162 29307 15548 7104 -460 -6173 -3233 -5268 -13601 -29660 -32486 -11556
17641 -11556 -6173 6184 9031 18906 20350 12764 1003 6898 20646 17261 29889 45043 59503
17628 59503 64543 88561 116573 140650 163038 193706 216978 247394 280339 296025 295553 292800
17616 292800 286933 292034 293072 286736 271089 258200 255380 242202 213685 190962 169304 141451
17604 141451 118346 112545 96632 89115 83158 66932 50915 44709 46657 40024 30312 19086 26207
17591 26207 41010 28744 15601 22378 26598 22035 34543 35480 38060 39954 39418 55862 71877
17578 71877 82557 93924 110178 134913 147024 160446 186839 213441 221098 221222 232501 256369
17566 256369 274938 282306 296611 299606 282519 253207 227088 221207 202267 171651 143501 121990
17554 121990 107600 83482 77993 66267 55006 48386 45066 35552 28984 28493 28503 26150 20249 2725
17540 2725 -934 -1976 -2969 3515 1842 6266 11190 5282 -16571 -16945 -11984 -19634 -13495 -8147 -10704
17525 -10704 982 17246 16835 9198 5828 12905 10246 2575 15630 12739 17136 15591 13089 20371
17511 20371 33416 30595 13486 -8722 -15376 -10470 -2637 6407 7003 16415 20785 4359 -11435
17498 -11435 -4293 4415 -1428 3669 368 1082 4379 -8695 -12737 -12057 -18 -2326 -9797 -18054
17484 -18054 -1488 13275 10031 -12455 -13932 -13457 -21261 -29073 -37594 -34351 -26207 -26133 -30698 -21296
17470 -21296 -18146 -30323 -23068 -9338 -750 5681 13779 9810 -384 -5723 -21373 -18063 -13167
17457 -13167 -4710 -12445 -14454 2971 13400 4418 -709 8022 8749 16194 7856 8098 24934 63082
17443 63082 101894 122960 123141 97944 56752 23400 5448 3048 -836 -5880 -16209 -8017 -7411
17430 -7411 -17110 -13665 -2565 -1818 2029 14504 18740 10447 15956 4031 -1975 1779 5488 -6075
17416 -6075 -20954 -19990 -9159 9604 8455 1306 -7915 -8268 -2967 7699 4593 -14546 -7765 -5486
17402 -5486 -6511 -3273 -11007 -6654 -21596 -13074 -2563 -13507 -10708 -13601 -6560 -3393 16232 27786
17388 27786 15905 11905 1976 -4846 -7461 -14345 -6512 -11504 -5562 -6493 -8832 -18755 -21765 -17804
17374 -17804 -5279 4221 -3623 -13352 -16648 -10248 -761 -3286 -11014 -11058 -20303 -20272 -21021 -6206 5181
17359 5181 10910 16607 12068 5946 -881 244 4029 -4941 7977 10436 12142 6683 -3674 -18874
17345 -18874 -28360 -19159 -7399 3208 18178 18340 5947 5733 14763 17647 20011 12048 12226 6943
17331 6943 4589 5345 9042 -10272 -13098 -2035 4422 6837 8704 21993 23339 21879 23475 19750
17317 19750 18303 -4499 -12373 -23946 -32106 -22018 -25133 -39802 -41237 -29829 -10416 14714 16235
17304 16235 -7147 -19416 -26496 -28577 -8670 10100 6415 -897 365 1844 -6569 -17715 -23257
17291 -23257 -21791 -11376 -7260 5481 1024 -17851 -27002 -17675 -6648 5281 10601 1015 4410
17278 4410 7118 -981 5228 -351 425 326 -11032 -16997 609 11173 8786 14423 649 -17163
17264 -17163 -12683 -13431 -18564 -14095 -19749 -17814 -23062 -29032 -30081 -23933 -20692 -24235 -13931 -11471
17250 -11471 -21035 -16069 -8085 -3721 6252 668 -7911 -6761 -9685 -4756 7980 11133 7235 800
17236 800 11978 10926 -2586 -15333 -16203 -12466 -3043 2620 -5823 -5156 -12176 -24770 -28040 -17822
17222 -17822 -10279 -11639 -9259 -11630 -32467 -41147 -39358 -28016 -20017 -24501 -16274 -7086 9641 13772
17208 13772 11833 5807 4156 8092 8201 4684 -8803 -16743 -6098 -10265 -13126 -3358 14148 25245
17194 25245 32731 32931 26023 14589 11108 11992 -4367 -17949 -25689 -28137 -26936 -14681 -11857 -13272
17180 -13272 -13884 -877 11528 8100 -4452 -21597 -39668 -41023 -33407 -9249 -25314 -29929 -19619
17167 -19619 -17999 -15021 -15066 -9029 309 3352 -2308 -12476 -26504 -32523 -28814 -21956 -10758 -2023
17153 -2023 -6662 -27857 -37837 -27812 -22458 -23975 -24886 -21828 -13737 -5445 4283 -16996 -32786 -17624
17139 -17624 -3314 -1515 -8474 -17655 -8948 4251 13381 1580 -12351 -10778 9910 9903 2208 -2872
17125 -2872 -22925 -23403 -9225 2090 10083 8462 845 -8943 -18424 -15417 -21402 -19885 -14479 -17434
17111 -17434 -14465 -9813 -1410 -2235 -12683 -23970 -44916 -42952 -25992 -31219 -35693 -40204 -32673 -10708
17097 -10708 9714 19183 14274 3201 501 -8671 -27017 -28847 -18779 -15041 -20882 -34625 -39819
17084 -39819 -27760 -19778 -678 -4610 -7091 -9024 -2168 3761 16053 14499 12013 -7026 -18202
17071 -18202 -5078 9693 19924 6972 -14364 -32389 -43487 -44492 -44724 -40089 -13492 1986
17059 1986 203 4904 8969 -1678 -8477 3363 6540 -2828 -7937 -8952 -6785 -21202 -20864 -11265
17045 -11265 -7432 -14020 -38682 -32041 -20218 -16653 -23002 -27140 -19271 -1810 -4590 -10387 -11296 2805
17031 2805 17666 15670 -2874 -9416 -27592 -28388 -21482 -10266 -12291 -569 2980 1073 3830 10707
17017 10707 20016 23460 20829 21459 -7004 -14353 -14178 -7557 -13834 -16241 -13211 -14512 -21105 -28914 -21143
17002 -21143 -11019 -1405 -3285 -13283 -8691 -6010 -5233 -7345 -5623 -11393 -28569 -35988 -24923 -20114
16988 -20114 -31867 -39845 -19119 5922 7388 6311 -7920 -8332 -2139 -11849 -16971 -18657 -15304 -5301
16974 -5301 -14468 -13195 -8518 -7175 -5003 -6181 -15619 -13610 -3444 8469 4124 2330 -3677 -12707
16960 -12707 -17586 -16891 -11747 -10220 -27480 -35508 -16170 -5336 -6057 -6684 -5633 -2978 4825 21751
16946 21751 26242 21233 12790 -6029 -12407 -12064 -7052 -7021 -13071 -21311 -29443 -18543 -8767 -9465 -11078
16931 -11078 150 -5587 -9037 -2793 3904 5185 -3182 -22076 -24839 -29019 -18520 -14147 -21281 -12213
16917 -12213 -4835 -7041 -5166 -6815 -11773 -8405 -5899 -11117 -6999 -15681 -10202 -12448 -6249 9696
16903 9696 2703 -3204 -16313 -23078 -26717 -24661 -19004 -14063 -17493 -19283 -17467 -21636 -25297 -15341
16889 -15341 -24531 -24711 -13208 -7403 -10398 -17420 -4488 9339 6871 -5452 -16861 -18360 -23832
16876 -23832 -29065 -30981 -24922 -15829 -18019 -29418 -20307 -22585 -38274 -19504 367 -16643 -27677
16863 -27677 -16167 -10813 -18468 -23503 -11953 140 -3058 -12207 -20433 -12461 -10634 -5495 -5548 -7436
16849 -7436 1461 1317 -6875 -8883 -14213 -11184 -10533 -22328 -25214 -21010 -11881 -12037 -27713 -28445 -37970
16834 -37970 -43616 -25803 -17860 -26724 -31207 -20699 -9858 -13416 -9570 -22490 -21860 -10511 -14774
16821 -14774 -25751 -16218 3511 -2261 -8863 -3376 6060 3753 -10217 -16457 -13425 -7573 -7460 -1443
16807 -1443 11594 26544 26217 13895 5555 -7861 -11051 -12026 -12309 -5737 -6401 -6686 -6934 4408 2358
16792 2358 -4424 -3683 -12033 -26047 -29683 -14761 -6547 -13747 -16475 -14368 -21248 -31052 -39588 -26256
16778 -26256 -25589 -19831 -20042 -27398 -26471 -11767 -6668 -8348 2438 16499 6886 -10438 -13240 -1502
16764 -1502 -1737 -21566 -30403 -25146 -21932 -18295 -15977 -8148 2132 -4228 -4962 -3523 -2114 857 2365
16749 2365 -260 -6265 -19623 -14580 2544 7333 221 1434 10261 10856 -3604 -3141 7671 -3982
16735 -3982 -12155 -5176 4553 16511 12203 8871 5826 10871 654 -10535 -8149 -563 -12576 -17444
16721 -17444 -21064 -20890 -10707 -1228 -5000 -9044 -346 2445 11085 5973 18314 11403 -2111 -15062
16707 -15062 -20128 -27005 -14564 -10239 -12431 -7048 126 1585 3313 -1014 -7872 3920 8383 -2456
16693 -2456 -18187 -29856 -36436 -35854 -30225 -35324 -30678 -13970 -6350 -7761 -13130 -6861 -746 4614
16679 4614 -5217 -4053 -15402 -25944 -21496 -20504 -9737 1877 4411 -396 -3895 -12275 -10463 -11219
16665 -11219 -4074 -7783 -9314 -12553 -13416 -6118 1494 12385 16313 8279 -4918 -9141 -11732 -12694
16651 -12694 -21546 -20511 -30440 -22475 2923 6015 801 -9855 -14711 -11621 -24127 -14087 -2737
16638 -2737 1646 -20818 -30745 -32374 -8803 -2446 -16615 -24184 -26079 -33323 -27728 -20284 -13648 -7212
16624 -7212 -11171 -15720 -7285 -421 -10626 -19718 -28638 -14282 -12492 -9931 -4761 -9643 -12738 -19504
16610 -19504 -9423 7857 9574 4232 5650 4381 2148 -7636 -7816 1254 -1715 2896 -3510 -13955
16596 -13955 -17026 -9924 -12630 -20480 -8805 6175 9953 182 -9094 -19122 -21814 -12233 -13965 -10534
16582 -10534 -6350 -1686 4212 -638 -870 -126 -2168 515 -3533 -9937 -24644 -35715 -25445 9816
16568 9816 17265 4021 3247 4728 -12454 -25333 -26825 -23559 -16056 -6842 -9788 -11181 -12704 -18050
16554 -18050 -9926 -8141 -24068 -37263 -25681 -6067 -2905 -4995 -9857 -16973 -38536 -51873 -40427
16541 -40427 -32396 -24628 -16069 -14621 -4224 -9821 -15188 1025 6856 5026 -17398 -24532 -20959 -10366
16527 -10366 -5500 -7215 1623 -4923 528 2040 9868 6481 -1638 12030 8097 -5352 -9543 -8863
16513 -8863 6510 3757 -14881 -15736 3079 7969 -3414 614 -1882 -20713 -30515 -24475 -16216 -18940
16499 -18940 -27633 -20916 -14404 -13828 -14721 -14052 -22103 -23427 -16696 -15513 -33946 -40710 -46528 -24201 -8978
16484 -8978 -5493 -2489 -9276 -12834 -14619 -19951 -20946 -10279 -2773 2231 14570 16262 5029 7515
16470 7515 -5452 -15796 -8134 1946 -7760 -21688 -10526 -9261 -15400 -12543 -7010 711 -1921
16457 -1921 -4759 5700 11615 7426 -14119 -33480 -30440 -25864 -23355 -18494 -22446 -28060 -18060 -18515
16443 -18515 -38390 -32900 -25916 -22767 -16674 -30138 -20822 -19523 -14562 -6985 -6186 -10767 -17043 -14398
16429 -14398 -19626 -19352 -3719 889 -7462 -7072 -228 -2945 -5283 2242 10036 11904 -3487 -25359
16415 -25359 -27811 -16128 -3087 -6185 -9561 -350 2229 -1638 -641 -6539 -11292 -26262 -19068 -7859
16401 -7859 17341 10511 247 -7445 1262 7937 -14044 -33883 -25597 -14697 -10398 -5917 -4784
16388 -4784 -8277 -17763 -16255 -13607 -9937 -13372 -10093 -20417 -17987 -7423 -4804 -5954 -2449 1168
16374 1168 -2637 -7764 -1031 7985 7405 14305 15446 764 -7079 -9187 -1188 4305 -4036 -8085 -3074
16359 -3074 -9938 -11707 -16569 -12072 -16865 -18915 -9560 -13956 -13785 -12178 -9012 -417 2229 -7033 -19959
16344 -19959 -23194 -25015 -20359 -14581 -16856 -18635 -5034 -325 -7922 -10630 -10367 -15895 -21915 -25887
16330 -25887 -17708 -23678 -17696 -23354 -19460 -9657 -17699 -28842 -17084 -3642 -2097 -562 1190 1772
16316 1772 9627 -2344 -575 -4609 -2111 -6675 478 4441 -6547 -15963 -34388 -37484 -22992 -8042
16302 -8042 -7013 -12760 -592 8534 21446 11825 1555 7441 13242 13954 11722 4002 5119 1711
16288 1711 -5393 -14795 -20567 -18519 -15852 -20980 -26418 -23977 -5307 9002 13825 -492 -1611 -1301
16274 -1301 2854 -12109 -5639 7820 14501 10711 7282 8483 7311 -5254 -12734 -23737 -26141 -11949
16260 -11949 5745 1634 -1804 -249 -1711 -14669 -15997 -19888 -14843 -14083 -14626 -13231 809 6730
16246 6730 -6292 -17950 -23222 -11039 -470 -3282 -6659 -8687 -8164 -7526 -13741 -18096 -2537 -9438
16232 -9438 -18916 -9073 -3698 -6588 -12652 -6356 5294 17176 13792 2572 13604 -7116 -11766
16219 -11766 -5824 -12650 -12857 -5456 -4292 -501 5217 4711 2375 -12129 -15997 -17416 -27035 -27494 -39704
16204 -39704 -31011 -17390 -27156 -31126 -24539 -13673 12249 8885 -6131 -6377 -1041 187 10831
16191 10831 7647 -8864 -11576 -13030 -15414 -16902 -21704 -16584 -14120 -18807 -23789 -19874 -9626 -8061
16177 -8061 396 7682 3709 -1857 -6456 -6466 323 8904 6594 991 -7808 -8090 -13759 -18432 -18815 -20630
16161 -20630 -5476 14898 8065 5403 -3998 -15733 -11980 -445 18551 14789 926 -7323 -632
16148 -632 3170 -7278 -17207 -27991 -24818 -14912 7072 14787 5263 5303 -2065 604 -693 -6193 -15663
16133 -15663 -18681 -15680 -21689 -21194 -12750 -9789 -1182 -2157 3381 15060 22106 11715 7581 8354 16672
16118 16672 10302 1609 1516 -14152 -36179 -15454 21136 34044 23047 9462 8469 -2255 -5955
16105 -5955 -844 6076 -4224 -12692 -5782 -5028 -19177 -20593 -25182 -30675 -29241 -27692 -14330 -5617
16091 -5617 -7320 -13646 -10322 -5715 -7991 -20763 -20172 -6410 -12621 -2180 -4462 -13030 -10756 -9128
16077 -9128 -5642 8753 15889 7615 -1796 -935 -1136 -4162 3740 9810 -80 -20870 -9663 -9478 -17764
16062 -17764 -14338 -11725 71 -16894 -19224 -7351 2163 11502 14181 15805 19892 15610 13035 20489
16048 20489 20167 14568 -7522 -16470 -19916 -22576 -20442 -15506 -15025 2817 13677 5959 -11349 -13640
16034 -13640 -6008 -9983 -14592 -18841 -3567 7063 22682 24035 7420 -3629 -9348 -12758 -6297
16021 -6297 -11327 -16935 -16485 -10989 8179 13357 -321 -3538 -2154 -8148 -9826 -5374 -5060 -13494 -15565
16006 -15565 -15010 -34211 -43607 -38509 -34798 -38252 -32779 -19842 -4813 3366 8712 -9698 -13884 -6282
15992 -6282 -12276 1320 14488 3476 8153 2265 -12258 -8418 -3160 -2184 -5319 -6527 2967 -9431
15978 -9431 -14001 -10726 -2222 -493 -7582 -16488 -9460 -17198 -8421 -11658 -10203 -3375 2523 -11189
15964 -11189 -17627 -3476 25163 35194 21009 1297 -14932 -12006 -1675 11238 24321 21729
15952 21729 14806 9251 5341 -3496 -16409 -22936 -15073 -17170 -28220 -22190 -17208 -15423 -13612 -14854
15938 -14854 -12009 -15059 -20960 -9600 -5154 -21091 -9341 -3064 -3292 6158 3209 15063 23097 13602
15924 13602 12978 21885 9078 -842 -2327 -11071 -9652 6777 2191 -3432 -4402 -4659 -12480 -12200 -19428
15909 -19428 472 -172 -7776 1426 10401 10001 4155 -6203 -19582 -7515 10386 16154 5535
15896 5535 -5661 -23654 -29242 -16001 -8103 -11233 -9771 -6192 -21646 -13914 -466 -1981 -6800
15883 -6800 1599 9152 -1490 -12251 -2220 283 8116 10309 -5360 -10550 -3896 -9837 -11297 -25072
15869 -25072 -24271 -21135 -24119 -20339 -5168 4343 -2217 -3019 -11126 -12817 -11515 -6658 -6046 -5431 -6623
15854 -6623 -4453 -9427 -14924 -12660 -3031 -8352 -13582 -10251 -4592 14571 26296 23725 5460 -43
15840 -43 -3037 -7937 -21734 -22114 -23753 -20862 -12697 -12113 4050 11772 10147 7095 -1308 -3019 -6910
15825 -6910 -9935 -1508 6584 8289 11038 54 -4704 -14517 -18929 -6298 -7559 -5294 -1095 3177
15811 3177 3544 -5217 -501 4742 4358 -12659 -22905 -31517 -32399 -16441 -1879 -3994 525 1608
15797 1608 7960 9211 6161 -6756 -16510 -27166 -38823 -31710 -43511 -34476 -16769 -22219 -20461
15784 -20461 -11777 -19671 -20037 -5232 4846 -3503 -17944 -16609 -20620 -22175 -21985 -20729 -33439 -33377
15770 -33377 -15646 -4789 -13979 -26327 -28506 -25256 -13640 -6392 3170 4321 -4803 -14806 -7833
15757 -7833 6064 9265 -1445 -5259 -14250 -16745 -19405 -16026 -8301 -8907 -20028 -17031 -17730 -7702
15743 -7702 2363 -1858 -3822 1791 12189 -7533 -26489 -34953 -17083 -6347 -5972 2503 4719
15730 4719 2462 4966 -9498 -14865 -17255 -8773 -3112 17451 18273 17459 4819 -6073 722 -3628
15716 -3628 -7622 -2439 -11935 -11773 -6505 -5005 4115 13246 3817 12379 4045 224 -750 3063 4626
15701 4626 909 -3725 -18602 -19139 -9791 -11648 -20486 -27346 -33303 -29025 -29095 -18058 -79 -12060
15687 -12060 -9718 -1783 -8900 -12183 -8465 -21021 -15709 -9435 4829 14626 17281 6939 -14496
15674 -14496 -28457 -25982 -6630 6279 8453 14746 18591 666 -17370 -21008 -22071 -19303 -18806
15661 -18806 -13153 1212 1831 14468 10521 -1924 -4122 17969 16151 -2458 -9590 -6575 4446
15648 4446 11261 13756 6616 405 1938 8778 12211 9893 5091 3102 705 5633 1113 -12055
15634 -12055 -10894 -7170 -6682 -22588 -29560 -16801 -6205 -8502 -9852 -1397 7365 -2688 -14524
15621 -14524 -20797 -18753 -16688 -16576 -18853 -24309 -17309 -8708 7853 1484 -20914 -21968 -21786 -25593
15607 -25593 -18696 -22638 -38735 -28250 -2301 4247 -14653 -28699 -29974 -28332 -25246 -23988 -10671
15594 -10671 2517 18164 7198 10328 4470 4642 -2433 -13485 -15611 -5887 -14026 -26323 -16298
15581 -16298 -14321 -22129 -22110 -10565 -9596 -11968 5232 24618 36749 31878 15312 15103 19023 22477
15567 22477 26023 25788 30336 36674 55069 108268 205282 310820 373308 411664 374575 234288
15555 234288 142590 99437 86425 60276 33276 30415 19804 20417 27295 17827 -777 -210 -2854
15542 -2854 39 11071 7507 14963 35538 34286 17306 4349 7815 9426 8968 6053 -11345 -6984
15528 -6984 -5779 -9189 -6478 973 -1139 -1511 -3535 1745 -1495 -4821 -1624 -863 -7639 -12710 -12032
15513 -12032 -21163 -18397 4048 11290 9935 -3034 -21356 -26659 -13204 887 1911 -6485 4043
15500 4043 1550 -8619 -21876 -10958 9114 15345 9665 7788 7640 2035 12847 22111 25608 10181
15486 10181 5722 -2837 -1484 -4274 -836 -8796 -20193 -12615 -18914 -5338 13147 14356 14181 10751
15472 10751 8263 7855 -6784 -12292 -17301 -7405 7137 7475 3984 1566 -4730 -3161 -9903 -22074
15458 -22074 -26994 -23546 -6503 -9900 -13386 -11102 2945 6009 18666 20520 25743 12114 -1805
15445 -1805 -7611 7197 7192 3040 -1323 1627 263 5409 -4959 -3303 -4650 -18841 -22488 -24256 -24476
15430 -24476 -22997 -12766 -7829 -7741 -15208 -24728 -25728 -13339 -7186 6715 -5547 -9723 -260 2752
15416 2752 6725 -6682 -14685 -15038 -10735 5742 8642 7186 5512 813 16945 13266 -4355 -12823
15402 -12823 -3174 -3811 -8441 2000 11020 581 -16648 -20363 -19871 -12019 1725 -3042 1755 8079
15388 8079 21615 23936 -4117 -14878 -5894 -17313 -25892 -19309 -16119 -6633 -2936 -4248 7337
15375 7337 -2612 -16833 -4650 -4721 -3652 -9103 -10367 -14014 -10367 -829 12935 13302 13285 2515 -7539
15360 -7539 -3425 8266 -3083 -7106 -4287 -1927 6391 3540 3776 4045 -3401 16605 27482 21806
15346 21806 18226 20637 6753 921 2300 7225 2586 -5451 -6761 -16478 -15661 -5556 9388 20335
15332 20335 20883 6590 8747 855 3409 10774 11431 15344 13781 -2306 -4593 -4597 -26879 -39087 -29958
15317 -29958 -9359 -10511 -23753 -21749 -8218 -2853 -8251 -6702 -7799 -5829 -8307 1087 8510 17367
15303 17367 10974 11677 9438 11754 5147 8595 5943 2042 -160 11262 16935 11026 506 10497
15289 10497 29569 26158 2842 -8919 -18758 -19075 -17363 -13823 -18363 -27561 -29499 -6876 565 -12910
15275 -12910 -4982 4486 15562 20701 19596 742 -12031 -2590 13416 13130 38839 40287 37023
15262 37023 25952 25660 19749 14245 34968 49808 48078 45234 45453 42455 18475 26502 25905 34886
15248 34886 44572 57772 44910 25913 26785 32209 29089 27917 19736 8592 389 4377 2634 2786
15234 2786 -2947 -3429 27354 27537 21536 11746 6770 4752 4084 13060 19740 14859 10081 15304 15839
15219 15839 17132 11178 -9142 -20282 -22277 -25571 -16340 -4842 -2739 -6833 3004 7740 -2416
15206 -2416 -3648 874 2142 2798 5896 8911 12480 26030 22648 24275 17672 7748 14523 12917 5974
15191 5974 5368 1758 -798 13023 14704 16265 6450 7822 10351 15081 19757 20788 21839 11098
15177 11098 12948 11207 7405 11981 5507 17331 24960 7490 5890 24752 39039 42195 42183 36019
15163 36019 30101 17443 14259 32236 35781 33289 41309 35309 39863 34025 28486 12796 -4408
15150 -4408 -10591 2752 11168 8231 -42 -6670 -4848 -1539 -2289 -319 9652 15071 13673 16818 12236
15135 12236 8959 9484 14965 17935 24592 32738 41918 43793 46979 50629 50772 53715 52233 47853 44824
15120 44824 41848 29442 28501 27674 34146 53037 50313 44383 19541 24234 36345 40271 40763 47383
15106 47383 50632 54451 35639 26942 25190 28904 21831 24582 28864 31362 24961 17106 -548 15874
15092 15874 31006 34407 39969 46691 46074 29987 32222 54417 57253 61305 70633 66795 63158 60222
15078 60222 68861 78004 73871 70558 58361 61111 73297 71163 64705 68930 71786 63645 69290 69759
15064 69759 66938 70826 81892 84000 73321 78435 79228 78201 71379 70307 66380 65538 77842 86911
15050 86911 95072 99339 104697 121538 123337 107381 116050 138723 143099 148679 147520 139619 147771 167282
15036 167282 175217 180839 190528 209993 234509 259335 276892 294971 313995 317542 335390 378670
15024 378670 442331 494645 561979 630316 688974 786111 881878 961722 1036707 1134601 1282853
15013 1282853 1491439 1768679 2159740 2701576 3483426 4658603 6506528 9613587 15516429
15004 15516429 27916455 49956253 66294431 73038208 72697873 51244716 31870441
14997 31870441 21849824 16152957 12592823 10185011 8440968 7132765 6134061 5351802
14989 5351802 4724976 4222467 3761500 3344892 2992672 2709012 2475170 2275440 2092502
14980 2092502 1926110 1776752 1654327 1566915 1499445 1422566 1322650 1241644 1164263 1085379 1026721
14969 1026721 953854 884848 851694 800729 745750 694990 665138 634453 584691 552198 523888
14958 523888 507796 506921 495206 465772 448726 435800 421879 404258 378598 366265 341704 316761
14946 316761 309404 287130 279378 289097 281113 258959 254013 250122 232159 230808 216100 207317 210004
14933 210004 196349 172860 160193 163441 151157 150911 146418 139000 126473 112366 104607 107236 103209
14920 103209 95326 92833 100173 110431 118453 123449 113514 119825 120709 118504 112101 122358 128415 114492
14906 114492 101244 98881 104029 96269 81893 58446 45587 33461 44957 47937 59004 66471
14894 66471 58124 61106 55344 35444 25666 19929 28172 33745 48156 57681 65561 67264 60673 55365
14880 55365 67347 72173 70396 53870 45476 42785 35004 31299 19430 16853 15485 33376 34107 36253
14866 36253 34701 51314 53890 40471 37663 47409 54265 52320 48013 48745 38975 37177 45532 47588
14852 47588 40231 37718 34285 17231 -3679 195 15680 35027 43992 30612 10615 15644 17180
14839 17180 24631 26620 21936 15174 -6655 -16848 -16229 -3492 4228 -9752 -10268 -3264 1686 8434
14825 8434 17132 27771 25548 10755 10684 23490 17673 6811 10825 11317 11850 26758 39333 25532
14811 25532 6681 11595 7533 3358 10617 19639 11357 3446 3996 9742 15679 29185 38431 41539
14797 41539 42578 29065 17759 18058 22357 14350 17872 12141 6017 17768 20845 5546 -801 -7836
14783 -7836 -15112 -1504 -10751 -11037 2316 5638 148 4282 3164 675 1682 4738 7591 13085
14769 13085 11986 9903 -2350 -3592 -12173 -9272 -5071 -12731 -17145 -10910 9987 22757 12827 9036
14755 9036 1730 4458 -14270 -11660 -10120 -4032 5719 2810 675 -858 954 5875 975 3760
14741 3760 -9465 -18109 -12103 -16266 -16048 -15996 -1164 -420 -13733 -23299 -28333 -18230 -4486 -7259
14727 -7259 -7725 -3858 5899 13215 10860 529 -9629 -9708 -26320 -29711 -24186 -11550 -21334 -16328
14713 -16328 -3131 -2771 -7838 -16651 -6477 13065 14970 -4142 -4038 -3563 -5801 1038 1491 -1314
14699 -1314 -3390 -496 14266 13717 16910 17738 15377 14910 11236 10804 12051 21238 17552 10711 11617 14617
14683 14617 19917 4135 3708 14970 757 -20395 -31157 -21486 -17223 -10009 -1980 -985 -2478 -1538
14669 -1538 -8328 -12061 -11345 -15584 -24487 -20156 -20427 -11942 9845 7608 -2474 -12979 -25863 -11626
14655 -11626 4526 -10335 -14215 -8311 -8390 -20902 -22693 -27520 -25403 -17655 -11670 -13401 -17927 -16029
14641 -16029 -17286 -24554 -11330 -3954 -9538 -3487 1605 5927 10380 12369 4840 7561 20868 29593
14627 29593 13291 -3793 -901 -5891 -23595 -27567 -35918 -26391 -4945 12166 -1977 51 7844
14614 7844 2035 -9749 -26502 -30242 -33153 -39537 -33015 -8293 -16540 -20499 -25852 -30627 -19902 -8791
14600 -8791 3191 16936 9095 -2371 -13000 -31665 -37269 -31388 -22244 -3533 -2548 -11383 -18554
14587 -18554 -22783 -23612 -21840 -20572 -18384 -7898 811 9678 2900 -10008 -6600 -4434 -14250 -13268
14573 -13268 -7516 -1905 1136 5296 -6802 -12511 -11615 -2398 2758 5431 -3164 -2083 -847 -10723
14559 -10723 -18151 -18594 -11050 1673 5914 -4157 -9092 -14823 -22107 -18573 -12717 -26 -2065 -20496
14545 -20496 -17115 930 2974 8675 11691 14536 18271 12334 4561 5011 -2213 -1118 6203 6299 378
14530 378 7783 6059 -3133 -3956 -13808 -20649 -18661 -14006 -5685 926 -1385 5743 -878 -7957 -10856
14515 -10856 -16807 -19934 -15712 2204 7906 2300 -2715 3645 9761 11780 -14368 -26879 -29932 -24541
14501 -24541 -25340 -25714 -19109 -20572 -29582 -29449 -3534 13013 9778 4667 -1159 -8635 -22719 -33357
14487 -33357 -16216 -9104 -19450 -15643 -20676 -8668 1545 -9259 -3024 -7807 -18436 -15669 -15624
14474 -15624 -9163 -6776 -2113 -2258 -7514 -12227 -11231 -8874 -2343 -2237 -4762 -7739 -4768 -3021 9734
14459 9734 7706 -3887 7260 11480 -4398 -14126 -4306 -12604 -8527 -1706 -418 -9449 -2741 1326
14445 1326 -4117 -3786 9657 16244 25626 36200 57977 117211 234343 341743 382507 385823 282156
14432 282156 162114 112834 89446 69297 59254 49168 39197 24326 24135 17308 10408 6274
14420 6274 -2643 6798 2976 -4750 -9907 -20258 -22326 -24662 -27107 -21265 -15849 -11945 -1185 -4390
14406 -4390 -13558 -16762 -17357 -5364 -9499 -15341 -21033 -14166 -4968 -1957 -9140 -22403 -28656 -21401
14392 -21401 -7746 -1851 -6567 -18779 -5538 -121 -17932 -15951 -1849 2851 6908 2238 -4630
14379 -4630 849 4663 135 3755 -2458 -8679 -7958 -10268 -7958 1183 1496 -1223 -724 -7497 -361
14364 -361 6434 17127 22159 8114 -8285 -19059 -20194 -15853 -9491 -6403 -2849 1577 4373 -2454
14350 -2454 -11717 -17871 -14738 -878 -5246 -9478 -8404 -9337 -12686 -9401 -9421 -2206 -1250 -2111 -3738 -18579
14334 -18579 -26820 -27453 -19787 -17863 -10409 1576 8381 11757 18635 30676 33535 21861 8466 4564
14320 4564 -982 2979 2406 -4461 11257 15333 9421 2839 -1784 -10483 -15271 2935 12606 -1459
14306 -1459 -9526 -20668 -18404 -4738 2217 4385 9571 19019 16505 27117 14354 -5436 -7359
14293 -7359 357 21558 25857 16235 6704 7849 1357 -3292 -1760 2678 3356 3600 -2124 -12067 -11681
14278 -11681 -11606 -139 13351 18886 11301 13821 21520 20266 30238 26603 23912 13591 1394 -2796
14264 -2796 106 -7178 -3528 -5193 -413 12275 12001 1845 -3605 -5843 -6059 -5727 -6914 -14023 -20944
14249 -20944 -9958 2026 6273 -13862 -11736 563 -1682 -6817 1449 11462 18489 13762 10639
14236 10639 -2504 -7139 -5371 -3607 -4675 -7096 -17268 -18505 -17981 -18396 -11769 -15998 -18533 -26457
14222 -26457 -22457 -15430 -10899 -5985 3150 19173 16120 10651 16091 24432 10743 -7506 -9999 14033
14208 14033 16621 -2445 -15767 -15778 -11607 -27061 -37976 -32847 -21170 -8174 654 432 3768 585
14194 585 -3055 -11174 -5034 6986 6010 4588 72 -10313 -15096 -18572 -8507 2321 -5196 -18045
14180 -18045 -4137 11468 271 -10911 -10424 -8369 3981 -4048 -13973 -7389 3176 -8208 -20520
14167 -20520 -15129 -11267 2270 -9878 -15752 -14473 -16855 -22238 -12905 -771 4228 6701 -384 -5154
14153 -5154 -1333 -11584 -21076 -18328 -20239 -22351 -14098 4458 12013 470 3898 5494 8971 14362
14139 14362 21033 16866 11048 -3033 -16116 -22427 -19647 -21070 -16615 -17200 -7201 -5262 -9048 -10808
14125 -10808 -3054 -8327 -20303 -30407 -28666 -29961 -19315 -15941 -21562 -11595 -2166 7985 3197
14112 3197 -16747 -23421 -14950 -16081 -14631 817 9639 15505 10020 -8297 -21551 -6231 1559
14099 1559 -421 -8231 -1644 -353 -3301 7820 12554 9236 1982 -5466 -3322 -7910 -20604 -18614
14085 -18614 -15730 -11304 -11050 -12004 -2197 5670 -9299 -17768 -5964 -869 4032 3897 -11318 -16979
14071 -16979 -9462 -11198 -4376 -913 5807 4752 -980 5827 16561 7094 11024 5756 -2594 -17855
14057 -17855 -11964 6768 -1782 -16322 -23262 -21082 -5093 8540 9207 15308 13350 2294 -470
14044 -470 9040 17553 10029 -1061 -4178 7668 10355 9123 11321 15773 26539 11319 -2848 -4520
14030 -4520 -10788 -5141 -5067 -11812 -5642 -13064 -11601 -18828 -9925 17 4002 -229 3873 8040 6914
14015 6914 7840 14872 22569 7581 14442 16135 18972 13043 18157 11921 -8190 645 8276 10895
14001 10895 -4939 -12109 -23731 -19644 -15170 -9036 9357 6224 -6612 -8885 -8032 9287 24545
13988 24545 34118 20572 3945 -501 2806 -6111 -11055 -7183 -6251 -18615 -11335 -9582 -11117 -11061
13974 -11061 -10994 -14075 -8433 -5225 -9391 -10871 -18735 -13029 -10640 -8697 -8018 -994 6143 2301 -2629
13959 -2629 -5871 18984 21901 12517 23165 31395 22819 17398 7284 10218 13711 5986 -3410 -8211
13945 -8211 -11074 -504 29 -20179 -15568 -15695 -29335 -34973 -35006 -18751 -1499 -3244 -12570 -25847
13931 -25847 -24930 -15413 -2252 1772 -3248 1768 2476 -2358 -5514 -6092 -3906 -6549 -11207 -17452 -24547
13916 -24547 -31530 -31202 -17607 -6234 -5206 539 -3525 -12276 -3759 3801 2165 -5847 -114 -511
13902 -511 -8938 -14117 -14039 -4587 5232 13567 14397 15330 -6963 -14316 13096 38898 60259 82679 90409
13887 90409 82813 73870 66282 57669 22741 15707 17223 8909 -1495 -5519 6846 5186 -8189
13874 -8189 -12297 -11269 -2358 -329 -5007 -13755 -9224 -20105 -24554 -4214 7798 8553 5234 5136 -238
13859 -238 -7678 -4126 15819 17078 14570 10127 976 -8553 -11632 -14899 -21505 -24150 -18230 -21521 -24529
13844 -24529 -21256 -22933 -21877 -14689 -17151 -7591 -4297 -5903 -5036 -5431 -5352 -11075 -5171 1707 8366
13829 8366 11371 929 -1063 2580 6034 5475 -6319 -22444 -26236 -23261 -11904 -2685 -7165 2806
13815 2806 11870 4973 -1569 -12338 -7118 -934 -1553 6868 2608 -656 -4875 -7948 2990 -2954
13801 -2954 -15488 -18635 -14373 -14764 -6887 4357 -2065 2546 3082 -7636 -13470 -18946 -29439 -17410
13787 -17410 -4904 -9838 -10401 -3231 -3100 -13268 -14107 -8318 -6520 -4180 2444 9556 15691 22966 23504
13772 23504 4460 6191 5044 6809 -848 -7445 184 -9404 -15380 -17334 -9894 -1203 -4573 -18932
13758 -18932 -15777 3897 14329 14208 17318 -4681 -15562 -23537 -31943 -29164 -19416 -25531 -20930 -20652
13744 -20652 -17232 -6605 -8512 -3234 6191 14401 22318 16042 719 4133 16391 12865 9176 -1708
13730 -1708 -14179 -15266 -5568 6416 7498 18780 24601 14310 16388 17889 6420 -4880 -3725
13717 -3725 9348 9510 2460 -9526 -14820 -8010 -5189 -15976 -6938 -4456 5725 4498 437 3009
13703 3009 -647 -4340 3306 4769 -7735 -17738 -22586 -18546 261 12408 18390 34978 30287
13690 30287 7963 -4226 -8371 7096 17202 21714 11008 -2498 -12028 493 10402 19492 13222
13677 13222 3205 -3862 -7170 -15798 -17466 -2765 5565 16675 17767 4846 -11702 -25908 -22409
13664 -22409 -23109 -22238 -16305 -23694 -3456 -3093 -11327 813 1152 -4055 -5623 -13580 -14366 -7271 -12226
13649 -12226 -3261 4060 -10578 -19861 -14479 -6419 8778 18693 10464 -2908 10454 22416 15331
13636 15331 25828 22958 27098 23884 6774 -6625 -6849 -85 8987 8572 16601 12122 3418 -7449
13622 -7449 -13632 -15612 -19710 -22917 -16419 -16380 -19043 -22220 -14750 -13228 -13088 -10433 -4258 -1148 -13429
13607 -13429 -20258 -6364 -13193 -10347 -2985 -12164 -22194 -17330 -3283 -6480 -5157 -4835 -381 353
13593 353 -179 -807 7247 5831 -9213 -17583 -19885 -13814 -16568 -11214 -2109 5168 -2154 -19008 -15198
13578 -15198 -3568 1857 9527 12844 -1182 -13332 -15769 -13842 -7212 -3534 -3807 212 4359 4383
13564 4383 -8429 -4608 -1380 -4340 -12944 -15758 -30775 -34132 -15182 -3048 12370 29336 22903
13551 22903 6534 622 -4522 -10063 -4724 -11591 -22592 -22394 -9953 -12014 -22171 -27468 -22479 -17999
13537 -17999 -4763 -3985 -18613 -38312 -31082 -12642 -988 12636 12724 15897 1133 -1748 410
13524 410 -3981 -6907 -18991 -8782 -4383 -9030 -5596 212 13700 21261 17885 13429 2139 -8529
13510 -8529 -9232 -20854 -27831 -17695 -2169 -10732 -19320 -19001 -13911 -15917 -16288 -12223 -8033 -3078 2212
13495 2212 834 15175 19103 23132 18430 2457 8920 23238 26623 11169 2984 7611 14070 20585
13481 20585 23173 15871 10052 9875 7382 -4768 -9796 2336 5658 5667 -1688 -12124 -8013 6579
13467 6579 1454 -11889 -11747 -7112 4540 -5287 -19463 -19002 -10731 -13444 -11352 -1716 8383 17388
13453 17388 16513 4418 -11311 -21010 -27022 -29766 -30481 -25345 -16861 -8558 -8559 -841 16788 24320 -1446
13438 -1446 -3219 3567 -2425 -6135 -8837 -2623 6910 19304 11811 -9035 -9208 9807 14669 -5925
13424 -5925 -13262 -8176 -5377 -7413 -7063 -8772 -15743 -9837 -4365 1251 5746 6420 1061 4806 -7476
13409 -7476 -27702 -19701 -2996 4184 1344 2134 834 -13549 -7558 -6537 12764 10319 -2453 -12592
13395 -12592 -26770 -12934 -7110 -11139 -5631 8163 12861 24514 24315 17376 16642 9711 20931 33114
13381 33114 24108 -8697 -13823 -240 -3814 -936 -4708 -14082 -19288 -10303 -3141 -2865 4247 5595
13367 5595 -2225 9733 19745 13261 8323 9214 6299 329 -13758 -26071 -23134 -19454 -27572 -16392
13353 -16392 -594 -419 2024 4873 2071 4467 2419 12024 9649 9458 16352 21135 9710 -3875
13339 -3875 -3071 -1900 1329 -1711 841 6594 -2651 -4692 8332 16388 6375 -6287 -4840 -4231
13325 -4231 -14692 -23214 -30340 -35358 -39426 -36443 -20964 5975 8920 15893 16891 12978 8188 8445
13311 8445 13609 11901 2457 3963 -11626 -13239 -15442 -4445 5331 13564 16003 10286 -2792 -8445
13297 -8445 104 9876 5438 -7794 -15815 -25030 -24196 -17036 -13408 -10122 -4181 -18098 -26694 -23831
13283 -23831 -25703 -32733 -36923 -26073 -25228 -14056 -22935 -23637 -13575 -21346 -11349 -127 5306 7070
13269 7070 -5375 -23836 -23770 -1212 26044 3957 -13462 -10517 -17663 -18361 -6723 5109 -4087
13256 -4087 -18061 -20476 -18064 4224 31100 31531 21894 8863 1074 -4615 -13250 -11155 -402 3840
13242 3840 301 -3697 -7993 -8583 -1187 13493 16041 35620 25263 11513 6011 429 -774 5575
13228 5575 3599 6425 14371 8368 3343 -4084 -3630 -1756 -444 1195 -6512 -13015 -25653 -25999 -20161
13213 -20161 -7092 -7183 -3459 6546 -2749 7810 8173 9939 13557 15548 9479 -5580 2602 13895
13199 13895 8953 16601 18457 3697 -16089 -18080 -3294 -1846 -14002 -17335 -14100 -15297 -1392
13186 -1392 9160 17260 22016 13885 5630 10765 14972 8318 4555 1818 -15116 -28857 -25105 -19080
13172 -19080 -22554 -21514 -21491 -10622 -2688 -9588 11307 13725 14550 2347 -6744 -3463 -6794 -4105
13158 -4105 3339 -2990 -3459 3509 -7358 -19781 -4769 -3678 -11218 -5808 -15109 -14481 -11033 -10206 1384
13143 1384 -4335 -2456 6309 -5879 2375 11941 8169 7667 -6989 -10552 -7406 -9993 -11031 -1956
13129 -1956 431 -2673 -2882 11867 17979 16425 -504 -2615 7469 1797 -2530 10952 13643 823
13115 823 -95 -3759 2341 15782 -915 -5523 -6395 -4606 -8681 -13135 -15930 -14727 -28318 -25771 -7444
13100 -7444 -4478 -9517 -20134 -15725 -436 -6575 -15311 -20212 -25259 -30989 -26004 -15944 -13977 -2041
13086 -2041 3739 -2831 -14414 -12585 -12952 -7389 -10889 -7394 -9175 2842 3407 14023 8650 10519
13072 10519 2074 -1216 -4792 -6386 -15329 -14305 -8768 -9180 5064 2417 10012 -2770 -1923 7043
13058 7043 5130 7351 13206 9099 3112 467 2552 -10227 -15527 -10359 -5570 -9193 -9950 -17204 -26666
13043 -26666 -18484 -18631 -20130 -18291 -12651 5834 12864 32195 21413 5646 4521 -559 218 -1691
13029 -1691 2196 10400 6788 -375 7011 6660 -6213 3232 11696 9430 15344 24223 19431 3815
13015 3815 -1096 622 7128 5522 -9993 -3750 -401 -6202 -20775 -35452 -29225 -22664 -10364 -11325
13001 -11325 -14756 -11405 -6642 -18133 -12020 1053 3219 -4710 -22717 -14215 -8104 253 1647 5373
12987 5373 -5946 -5073 13085 19846 4538 -17029 -8221 8174 12012 7954 4686 12118 5230 -9787
12973 -9787 -9979 -11785 368 3123 11867 -2607 -10395 -8221 2174 -862 5249 2735 4263 853
12959 853 -8029 -19804 -10437 -19624 -26129 -14540 -13820 -8882 -2796 5069 12457 4789 -4845 -10764 -10627
12944 -10627 -7528 4240 -3108 -8469 -6893 -11260 -17587 -26429 -23904 -14736 -15889 -20740 -2264 10357
12930 10357 9013 72 -6100 -9857 -13892 -3095 4379 14357 14335 8909 4345 6413 -1545 -5834 6131
12915 6131 16886 21860 13240 20031 18795 -1274 -18747 -10036 1223 5621 2461 -7537 -18669
12902 -18669 -14497 -3457 -4781 -2059 -11031 -18251 -18306 -12470 -5508 -2120 10332 12210 747 -8221
12888 -8221 -21504 -21229 -17606 -15148 -11917 -10840 2126 -232 -1247 -3251 3865 4248 -1897 -3943 2837
12873 2837 -12098 -19276 -13579 -6304 -7780 -16373 -14477 -6243 2063 5704 6986 -11955 -24980 -19182
12859 -19182 -24389 -15517 -3345 -4898 -6363 -3887 5115 24030 19516 2889 -12611 -21474 -20806 -8398
12845 -8398 3391 4291 5342 -8458 -16497 -16004 -1616 -3947 -13198 -16860 -14058 -12905 -11526 -17027
12831 -17027 -8078 -6463 -12510 -18139 -3755 7133 15116 12627 -2626 -14416 -4399 6729 8176
12818 8176 -11442 -4520 4119 -2463 -7486 4562 2859 5071 -7013 -23357 -22268 -9411 -4734
12805 -4734 -2991 -3591 11513 32473 15823 12994 15640 13163 6043 -8051 -2432 -13016 -7859 -697
12791 -697 1789 2645 -125 261 -1082 -11625 -12478 -3080 812 12052 30533 39517 63139 95882
12777 95882 95594 78820 57442 44059 25333 8605 -7915 -10168 -744 12394 19965 24653 21455
12764 21455 19914 8887 576 -541 4758 1453 2135 -8630 -10087 2076 -9162 -8583 -9702 -7577
12750 -7577 1178 6705 -852 4479 15700 24737 13060 7199 10444 17109 12045 6838 2578 -9174
12736 -9174 -3294 -4128 513 15798 15110 15207 10636 4435 -14601 -16819 -14483 -8513 -4167 -4613 -5460 -678
12720 -678 839 -5030 2295 19686 15805 4289 5776 6098 -2871 -10695 -16454 -13956 -2559 2763
12706 2763 -132 -8820 -6353 -9623 -21826 -15804 -1227 -2714 -5401 -5281 -15166 -20915 -17057 -10838
12692 -10838 2575 15931 3992 -13555 -3033 11210 9525 -201 8188 7789 -9469 -18795 -13526
12679 -13526 3260 11207 804 6251 20517 7332 -7697 -4295 819 -3160 -1499 -8883 -17379
12666 -17379 -20324 -12610 2333 10772 6295 527 -3407 -2725 -13935 -4135 4740 1443 2009 -5927
12652 -5927 -7534 -2726 -4035 -6535 -16372 -28650 -26992 -14165 10623 14678 5607 -1323 -5214 -16891
12638 -16891 -6102 -11917 -20274 -17318 1551 6804 -5518 -13402 -16016 -6960 -7100 2231 7749 9972
12624 9972 10802 16565 15494 10983 12168 9734 4880 2113 -11956 -18240 -7673 11480 32015 30469
12610 30469 17284 5245 4027 669 179 682 -4515 -10158 -16345 -11524 -1081 8124 19082 17207
12596 17207 1637 -5857 -13491 -7291 -763 -6917 -11560 -13205 -9943 -3579 -10232 -24096 -29596 -29905
12582 -29905 -18621 -552 452 -4462 -14266 -17829 -24569 -15497 -6527 -2841 -4085 -15055 -15545 -20143
12568 -20143 -10896 5355 4317 2353 8886 7950 8219 13266 11069 -604 -11389 -9198 5182 9402
12554 9402 -3873 2400 -4439 -3921 3566 16397 27695 29479 22941 10895 4818 -478 -1101 11700
12540 11700 19743 24982 20406 5355 2044 -12 7569 18502 11665 -369 -13609 -15864 -4639
12527 -4639 -8709 6232 9441 3624 90 -8267 -3756 5725 1041 -2492 6641 21463 13440 -6565
12513 -6565 -17501 -22347 -15568 1829 511 -7239 -12811 -18663 -17014 -12479 -13208 -19833 -25654 -12612
12499 -12612 3936 4635 10296 14128 -8354 -15574 -9496 -6416 -5856 773 7195 494 -13356 -10159
12485 -10159 11367 9866 17157 28869 6318 -18096 -6157 -295 3508 21577 28968 20852 9466
12472 9466 -14547 -13585 -5621 -3221 -7167 -6387 5531 1833 -4204 -25 -1479 1424 3379 8131 23938
12457 23938 21651 7105 -13233 -1877 1016 2069 5812 14358 9259 -3242 -5631 -17805 -10069
12444 -10069 3236 5630 16222 26867 17799 421 5699 12251 17117 13039 -1758 -9253 -11979
12431 -11979 -8358 -17489 -24520 -15395 -14940 -813 -4673 -17149 -17294 -3506 -3091 -7488 -4767 -146
12417 -146 1024 1112 2975 -5160 9262 14191 4091 214 6737 4600 5675 1289 -886 1890 -5637
12402 -5637 -24092 -25025 -11680 1382 11121 13687 7883 12984 2690 -10386 -9285 -9827 -2819 6202
12388 6202 1044 5731 5592 20505 23385 16453 1597 -2505 3573 11263 -917 -11199 -3162 626
12374 626 5542 -8523 -14735 -4019 7509 -40 -923 4896 9593 -7825 -4935 6898 21576 16006
12360 16006 10157 8404 12250 12731 9478 938 13241 18568 21565 14710 14602 18681 4799 -2110
12346 -2110 3591 -5335 -8127 7414 14201 11433 15539 22218 27766 20777 25193 18276 10960 16739
12332 16739 22323 12267 20084 20086 32665 37283 10770 -8212 -7329 -5403 -15828 -25772 -29847 -15493
12318 -15493 -3044 10611 20176 25243 26039 21080 25788 19868 4163 11487 17996 13637 18171 25558
12304 25558 27864 14324 10022 7667 11363 544 -11065 -8082 -3398 -2453 -10929 -14432 -13306 -11746
12290 -11746 -14563 -8076 -5563 -6141 -18745 -24582 -19560 -11787 -4436 4292 2591 -1757 -20604 -15303
12276 -15303 -4177 286 3355 6563 8001 17337 19764 12967 14202 16229 7261 3847 -6161 11056
12262 11056 14872 9373 -6496 -21098 -10609 9015 20618 13422 12339 13881 4213 9505 634
12249 634 -16879 -14301 -17631 -20562 -15335 4727 296 -17622 -7383 1556 8933 10207 -4014 -9740
12235 -9740 -6253 -11205 -9279 -6859 -1993 -750 8235 16897 17840 11444 7025 1038 6410 8955 12203
12220 12203 16229 18875 7776 9844 21757 22899 12943 9155 -9678 -16090 -3175 18072 24098
12207 24098 11434 13697 5221 3980 9624 -874 4231 679 -13721 7687 12138 6847 -7340
12194 -7340 -2373 3191 14801 15059 -181 -13368 -15759 -15873 -11250 -3847 -8098 -16997 -9368 -6559
12180 -6559 -4099 -3590 -193 5494 8317 9156 5064 17315 26868 14513 8499 1842 -13268 -16145
12166 -16145 -8359 1794 11104 12174 27974 34574 19690 8597 7200 21722 35432 43827 21008
12153 21008 3700 -4146 -12970 -13911 -599 -4382 -849 16629 17874 6353 6874 20408 13725 11724
12139 11724 13015 6417 -1370 -7777 2389 9177 11028 14344 19366 18487 15523 14299 31277 28201
12125 28201 20567 20575 24188 26198 7508 8078 12777 16865 4447 -2782 7846 6499 -5544 -1627
12111 -1627 -5495 -14046 -14660 -13133 -6965 -2958 738 13936 5796 19267 28701 14507 4535 -269
12097 -269 1540 9697 13522 14198 7654 17518 8720 5227 18924 23244 15019 17631 23718 42347 35458
12082 35458 14082 16356 16212 20841 23106 7381 1529 5677 3702 -10657 -9698 -4514 -4346 -14958
12068 -14958 -7179 562 1158 12972 20336 22404 22182 420 -7196 -774 13737 13440 16617 18529
12054 18529 19906 29515 27830 18600 24640 26074 18310 21263 29215 26232 19859 13477 11293 15560
12040 15560 24608 11963 9273 18961 13822 11696 13495 8261 -2679 -5337 6731 13730 13718 12451
12026 12451 8597 -5097 -213 14376 11717 6179 626 11983 10213 10281 9561 2780 4523 1922
12012 1922 1058 3839 13875 9067 -9603 -3409 10188 13859 17143 20983 12399 15197 14961 9719
11998 9719 13074 2897 -4907 -682 -3726 -6685 997 10997 11113 -4898 -15544 -18046 -15809 -18485
11984 -18485 -11992 650 2214 -5588 -7473 -9658 -2614 9805 18291 34582 28764 21583 5833
11971 5833 -3934 -11443 -3211 3208 3431 -3746 7938 11189 -5928 -4888 5298 2818 -733 -2464
11957 -2464 10361 16393 13870 6152 -5237 16121 15016 16631 16522 528 -8143 -5988 8670 2710
11943 2710 -11693 -6354 2590 9117 13710 2337 -338 7572 10731 9867 1847 -7779 -6056 2419
11929 2419 9751 1428 -3337 -9324 -19412 -9172 -3497 3314 28260 27841 18245 13032 5263 -11527
11915 -11527 -17345 -10368 -12489 2600 9826 6434 13184 18705 13570 23221 30085 29866 30555 32209 24819
11900 24819 28511 43401 53360 41670 24126 -4542 -6255 -1987 11531 9511 8067 8734 4943
11887 4943 -1482 -7886 -21138 -17148 -8574 -7560 -3440 -4998 -11077 -11951 -14624 -12221 -19408 -86
11873 -86 15374 25335 13332 9361 7930 6450 10377 -1907 -3935 4603 2825 2278 11558 14341 15796
11858 15796 25540 13022 -13031 -10789 -7582 -11030 -6473 622 5612 10209 17 -9096 -4449 7814
11844 7814 6567 -2306 -1852 -2607 3765 7168 919 -17073 -21433 -16780 -12173 -8280 -22083 -32069 -22699
11829 -22699 -8896 706 2291 7098 30109 35567 20933 8364 15651 17006 -3861 -20050 -23476
11816 -23476 -8433 3006 9331 15769 12256 1862 314 -3056 -5517 -15686 -18743 -20137 -19650 -20295
11802 -20295 -27543 -23533 -18595 -6885 -1725 4925 24145 27462 17292 17923 19863 19060 20321 11407
11788 11407 -8480 -4779 5413 15182 18516 22201 16054 8433 12078 9932 274 -5357 -7450 -7784
11774 -7784 -1477 -1429 4944 11925 16626 14561 6791 3118 -9390 -14518 -2901 2517 -1618 9794
11760 9794 16800 17847 27407 33133 22338 8154 -1679 836 5465 4612 10948 19623 16246 6827
11746 6827 -5113 -19543 -5111 14260 22511 19594 22828 32715 36615 37003 32794 20362 13779 13839
11732 13839 10071 7888 6578 15021 24088 15622 14124 14922 13833 11795 17836 19087 14094 11549 17177
11717 17177 12824 29455 37354 16926 9955 12174 10655 8405 13057 15265 21494 3031 -7784
11704 -7784 2079 14210 23722 23493 13096 -485 -1595 14887 33258 29764 18264 26520 35301
11691 35301 33882 24376 23966 23945 22272 19956 9840 9214 22365 30682 18794 -7958 -10583 -7285
11677 -7285 5964 13710 -3203 -7775 9814 14023 23770 31074 36570 35340 26816 27700 31500 43315
11663 43315 42728 35042 32945 24435 18805 21284 17187 8864 8917 20621 19076 17148 7557 -2752 9000
11648 9000 1470 8165 23255 23084 18574 18242 22258 20133 34048 29704 12391 9972 34664 55547
11634 55547 55788 44797 26062 25556 30608 52592 72577 74063 77240 90056 118475 153918 163847
11621 163847 171467 207607 255141 310698 397810 536236 748226 1041370 1390903 1746252 1987049
11610 1987049 2044177 1882845 1569368 1264266 1006857 804910 641922 538441 461418 407158
11600 407158 360282 320605 299857 278764 256821 219867 191280 162555 161358 159486 155577 149095
11588 149095 144332 136839 138927 127197 106656 106161 102546 98072 83607 78438 86404 93527 84868 83435
11574 83435 70314 57612 51010 56407 69508 74370 76017 75785 75512 75035 65114 48112 44178 42015
11560 42015 56182 59584 42038 41176 56659 65785 50624 42515 32492 18329 30317 46389 49969
11547 49969 54959 57719 53852 36751 18512 26036 31084 30482 26106 34261 21943 7267 2619 18697
11533 18697 28813 18831 25018 28608 29150 37202 36540 32095 26513 27138 22663 30473 30313 35730 25981
11518 25981 9965 25475 34963 39064 50141 54650 50782 37228 36998 32915 25948 28664 29168 16907
11504 16907 8944 19416 34614 35053 39016 34455 34129 30989 32310 33228 44440 74171 93689 91294
11490 91294 83637 81712 73609 85392 99189 92591 91350 77556 70420 97593 121412 131631 141607
11477 141607 158665 184916 220657 258751 300741 364251 461113 594433 788902 1063678 1420150
11466 1420150 1777699 2017661 2054347 1895516 1580375 1236882 969083 773998 629101 519884
11456 519884 456708 400309 348765 307637 274777 255134 223708 209960 186830 165163 135591
11445 135591 137459 133029 118274 114842 99129 84614 68226 78133 83808 80699 69599 61533 65991
11432 65991 56350 56723 66572 48536 42132 53247 62816 63645 59664 61969 50200 35948 35951 43981 43092
11417 43092 41998 41108 37129 36106 33205 38573 40415 39805 38443 43201 52116 27084 14685 28052
11403 28052 28746 32035 32800 19854 16586 14451 17090 13574 17264 10348 3059 9245 15720 17396 17968
11388 17968 14131 25555 33989 29155 22676 21468 31290 44500 32409 11655 10841 11025 25117 34610
11374 34610 46793 30190 12783 6879 14117 12329 17610 23395 14103 24423 37931 40061 28001
11361 28001 31727 34622 36650 21101 18988 20305 15557 -214 -15342 -6668 1908 10766 14438 4689
11347 4689 3483 12087 25335 17294 2872 -4665 -10545 -9226 925 8883 22252 22051 21593 13232
11333 13232 23121 23711 20915 18803 16255 29228 36541 45014 52130 48495 48185 44211 40486 33109 32195
11318 32195 45138 49760 44805 50205 55767 49563 44769 48776 48993 32434 29557 40808 32896 32077
11304 32077 27713 5855 12712 20104 26724 34755 40330 32715 25312 9437 13034 16499 23196 12715
11290 12715 2561 5479 9738 15578 12540 15835 19581 20325 19673 17011 33061 47835 38148 18969
11276 18969 28816 43212 34652 46602 57733 50726 35239 48413 56255 58260 69892 58522 48853
11263 48853 40864 38771 35296 16947 9599 15022 23714 30314 17265 15259 6907 -4248 1822 16252
11249 16252 35769 51252 41220 48627 57124 59498 60805 52735 49599 32564 31892 29848 31940 40396
11235 40396 32817 26004 28123 32041 32740 47460 49213 45741 47463 59195 52691 44782 44374 21222
11221 21222 23218 24260 31174 33829 20675 18641 21819 19399 21075 25377 12892 11930 13076 27162
11207 27162 38223 42473 29719 20036 25509 33704 46776 53887 64496 65174 60503 52464 45942 34421
11193 34421 21880 23223 18110 12159 24496 40555 33421 35342 36705 34923 28997 18583 9366
11180 9366 13906 23155 17792 15723 10943 12948 17834 28332 23170 36841 45239 48777 50434 49888
11166 49888 56062 52375 42018 50690 49610 34782 34918 35756 40481 49745 53493 35660 36556 33849
11152 33849 42728 46304 48965 47547 51986 43525 56538 60731 48638 37181 55331 50640 41322
11139 41322 38250 40963 44026 54552 56210 61911 49106 50861 54543 54174 41954 34944 31587 30628
11125 30628 38966 41633 40959 39574 31279 24401 45468 46589 34402 28012 26242 25635 17984 33992
11111 33992 29234 14454 20072 24064 27176 23746 28521 28541 43511 43681 30708 34213 47577 39311
11097 39311 35616 46208 45660 41941 35193 22595 13964 15187 23208 29309 28298 33964 37291 35145
11083 35145 41416 39650 41861 37699 29475 23565 36116 51402 41328 37489 52677 61136 65451
11070 65451 57853 47336 40422 36305 39359 39218 34343 33626 43558 42635 47112 46762 50750 54306 60758
11055 60758 53252 39115 45064 54795 58511 53189 45447 33710 38681 50078 66880 73141 71337
11042 71337 56501 35987 22718 23427 25459 37169 38532 58891 64071 47651 44495 43489 51317
11029 51317 59503 61337 51081 42400 39997 55867 61213 74000 67753 55792 51784 54364 53540 62050
11015 62050 63538 46495 40640 47129 51130 51953 57155 58092 79462 81258 52886 37276 31885 42152
11001 42152 55972 61614 62735 59350 60803 60965 52337 48742 54463 58211 44925 28727 23320 32609
10987 32609 49490 64860 67247 59737 55787 54964 62344 64589 62059 70620 72735 65941 64385 56316
10973 56316 58475 64757 71919 68445 59926 61269 58719 54440 44978 50184 59694 67562 68581 67668 73962
10958 73962 67531 73867 88688 85834 71593 62055 57804 57796 50820 46553 51985 56789 68454 66318
10944 66318 58925 66640 69962 72135 77934 75374 70518 72761 61234 55968 60439 65009 57896 53816
10930 53816 52441 49988 60001 71091 57500 38243 45414 45077 45131 56507 66026 60094 46130 57250
10916 57250 61488 57898 57429 59077 62915 79291 77937 62313 58612 59177 57661 64924 77417 85921
10902 85921 81307 79720 80208 76251 73763 67688 77286 78990 77713 78659 87210 92992 92997 95348 93018 72206
10886 72206 72257 93358 88267 86057 82808 84816 84076 106844 101171 96189 98932 94719 98712 103957 95477
10871 95477 99781 98127 92754 83668 88371 91759 101549 94559 95212 89886 83042 77759 82506 97954
10857 97954 122389 105179 70583 70957 87789 92683 91818 81734 74420 77289 100109 104084 115610
10844 115610 112072 112422 112780 104031 110433 115357 120017 122272 138238 128652 120506 110219 113380 122319
10830 122319 126099 123913 118566 113233 103394 100154 113870 128098 127541 123663 129226 125851 136648 148488
10816 148488 148624 151157 152745 143385 137708 160652 162724 159013 142912 132769 125079 125272 124979 108093
10802 108093 90869 86751 105141 125679 133869 123349 111063 95755 89661 112561 118344 108815
10790 108815 99044 91532 92258 99957 99578 89037 91731 89808 78201 95989 109127 105237 91540
10777 91540 87305 94771 99110 109048 114788 118402 105321 105863 106432 113531 116478 97678 95331 98669
10763 98669 90473 97585 106062 104377 103652 120647 133088 140123 127602 144595 164471 163085 172271
10750 172271 188738 207017 211145 224132 230114 246102 268746 300547 353321 424028 513452 623119
10738 623119 796815 1005123 1236500 1510606 1797979 2066265 2336842 2560110 2712938 2799307
10728 2799307 2769158 2654377 2465511 2230948 1988649 1714750 1455797 1235055 1046441 899601
10718 899601 799354 723426 672296 660255 657778 655840 707302 800549 925379 1077453 1273661
10707 1273661 1505966 1761744 2020155 2267291 2472157 2611274 2692234 2716640 2625029 2462809
10697 2462809 2244815 2005579 1758117 1523036 1304436 1097076 922511 785499 677581
10688 677581 601116 551058 499987 459438 425477 381356 344761 336219 334666 334879 317634 287745
10676 287745 270062 267215 255953 250920 248178 236064 236099 223768 221998 220612 213258 207577 190475
10663 190475 196636 198848 187873 191562 186116 197008 204366 189491 167049 175176 188913 174329 165144
10650 165144 160884 148537 134992 123881 107860 105004 98765 104424 122809 131906 128768 122074 118239
10637 118239 141593 153953 154085 163243 178079 200753 216183 240325 281623 327014 378338 435397
10625 435397 478987 516134 564814 591834 587373 559346 501063 442803 394367 335285 274967 240360
10613 240360 221720 221299 227256 209235 210204 222789 224312 218673 228423 244601 249040 245847 242217 240301
10599 240301 243840 252375 266549 270559 282339 285092 307025 332339 359190 394219 414884 449310
10587 449310 477586 515666 557426 572595 583686 592069 598540 580780 565064 563215 538511 515285
10575 515285 500422 476557 479498 491293 498883 489935 477990 483737 506169 517215 527660 542471
10563 542471 556340 590391 614571 638043 652087 676128 704289 722833 722560 717784 711300 707263
10551 707263 682627 648486 601222 556337 519166 497738 468737 458881 439941 410132 379852 359749
10539 359749 327450 303914 285294 277744 276015 268950 276804 290790 306275 325153 350501 365910
10527 365910 386989 392898 394270 400713 400198 384810 359745 345212 338932 308264 288211 249829 232924
10514 232924 228217 224285 232470 249285 269426 311270 354640 383467 408981 435781 458190 482929
10502 482929 514393 524236 530976 537031 532927 531635 543764 553161 553128 546842 544840 532508 522726 507031
10488 507031 490813 476842 453166 439544 427912 406986 392277 389894 398736 401112 405751 402183
10476 402183 396776 391641 394912 404217 414129 429723 442451 456998 482984 494321 512016 537778
10464 537778 560860 587840 605479 633221 655262 699311 724947 726924 739450 758117 763296 752950
10452 752950 739009 718748 711329 698907 681856 660270 635566 616208 616774 619721 630737 664836
10440 664836 671952 682269 695016 712071 749841 774087 806450 847789 889669 930583 961334 1005356
10428 1005356 1023467 1042488 1050764 1051017 1059510 1063675 1049483 1059353 1074899 1078819 1083237 1092528 1131591
10415 1131591 1176694 1223695 1287602 1356556 1411904 1461189 1536818 1612011 1675698 1753480 1823244
10404 1823244 1879977 1951835 2038587 2095484 2111987 2125768 2123052 2107814 2070468 2038295 1989488
10393 1989488 1954230 1925911 1921564 1930857 1941696 1977971 2026762 2078022 2155515 2227837 2308199 2377559
10381 2377559 2480885 2587305 2684029 2786807 2899487 3003453 3107093 3219906 3340944 3473890
10371 3473890 3613172 3747508 3881605 4018276 4165885 4338434 4537177 4765938 5032784
10362 5032784 5343073 5695538 6077149 6551810 7131724 7808357 8617845 9608405 10814744
10353 10814744 12210970 13816420 15642731 17637906 19848657 22244708 24777294 27619652
10345 27619652 30846011 34821921 40096353 47532858 58438562 74008951 96361267 127009107
10337 127009107 164605870 210950970 263682670 315285228 368161377 413759960 446482038
10330 446482038 469122575 473690951 465216115 441307004 405434303 364892867 316012154
10323 316012154 269312291 226673454 188165156 158337223 135950247 119867182 109139373
10316 109139373 102926035 101202264 104368382 113096877 127978498 150577493 180979656
10309 180979656 216817034 259951260 306088372 350970499 393443042 428816382 454034182
10302 454034182 465327536 464458293 451275782 425154974 388796212 348488615 304684352
10295 304684352 258456960 217865367 181802999 150050097 125390563 106364248 91571269
10288 91571269 80383294 71766609 64861630 59101190 54155414 49781253 45842528 42280776
10280 42280776 39037349 36028683 33320896 30883602 28646959 26660195 24892663 23294702
10272 23294702 21851178 20552055 19367458 18303196 17322925 16396821 15528830 14725687 13979355
10263 13979355 13290951 12640090 12029342 11469380 10947115 10470069 10016095 9588547 9185105
10254 9185105 8810905 8476662 8157485 7857567 7591448 7343114 7094537 6860689 6637841
10245 6637841 6434329 6237244 6046182 5845638 5670337 5507004 5337514 5170337 4998327
10236 4998327 4825577 4656126 4482598 4300514 4135246 3980722 3819618 3664363 3539271
10227 3539271 3428715 3330660 3233415 3159203 3093994 3030812 2986598 2941939 2897085 2861686 2823240
10216 2823240 2783865 2753742 2716708 2672862 2628699 2557517 2474693 2400978 2327973 2263060 2206101
10205 2206101 2159788 2111811 2068280 2022472 1969255 1917958 1886899 1876929 1834852 1803518 1799475 1780356
10193 1780356 1758591 1737645 1714694 1700843 1683155 1669369 1650985 1613537 1571633 1530807 1495152
10182 1495152 1459527 1409162 1362772 1313617 1276551 1230074 1190796 1181558 1154163 1122901 1093127
10171 1093127 1080866 1072437 1074016 1077605 1070520 1040474 1028959 1038154 1041016 1047950 1044060 1031171 1005281
10158 1005281 994333 984295 970895 962285 961353 946762 930345 917664 904893 870356 837536 819998
10146 819998 811117 792990 754944 735574 719560 690528 667068 634075 603259 592464 575945 564588
10134 564588 557120 559795 569498 578990 584285 601109 627452 640770 651802 675569 692708 708178
10122 708178 706019 698734 675912 651171 635839 623937 603795 568526 532287 501512 471174 431900
10110 431900 394747 353991 320988 306545 305236 305663 317578 341087 338289 340010 360260 367639 357871
10097 357871 361989 361898 358831 345130 326075 316210 298245 272825 255474 241511 240754 232989 219971
10084 219971 211152 192653 173916 156353 154710 170465 175300 166358 174909 169976 169872 177992 168036
10071 168036 169995 179784 172445 150326 134407 111471 107703 126734 134527 148581 186879 255387
10059 255387 404928 718678 1028164 1144653 1206127 938262 632366 480741 420011 377896
10049 377896 341397 294846 273660 268751 258060 236509 215221 188905 177816 171733 170064 174743
10037 174743 187490 168297 161108 154897 167202 159347 168459 166693 175283 181543 183664 174541 182880
10024 182880 188951 203917 217022 224067 230436 247333 264867 263385 260815 263095 260733 246516 239991
10011 239991 227857 223210 219425 204145 192821 193646 181937 175591 184481 183832 178272 167925 165216
9998 165216 165749 164326 167503 170319 191863 207983 210757 206716 214791 229092 214975 200934 198519
9985 198519 196872 184438 168245 147681 142547 150565 148080 131961 115030 117593 110142 107329 113358
9972 113358 127022 131806 134542 118474 113568 112186 99825 101023 95714 97351 99482 100003 91143 106649
9958 106649 87098 89513 105326 124161 138892 132822 142073 166854 168198 163603 165615 177930 186349
9945 186349 192904 200032 216045 216341 230178 243115 256007 301984 349355 407676 491676 621852
9933 621852 815944 1043243 1299514 1599045 1900971 2188097 2429505 2598370 2699145 2694054
9923 2694054 2611078 2440968 2223851 1958515 1679362 1422291 1201137 1005325 857782 754261
9913 754261 675081 636190 622673 610341 626767 671512 754268 893385 1061760 1271356 1513837
9902 1513837 1762491 2024982 2268809 2462092 2600849 2673439 2673139 2578333 2416995 2194070
9892 2194070 1947770 1677987 1423873 1212495 1016224 843714 723186 624380 542666 480912
9882 480912 434998 383905 359800 337589 307103 279296 270275 271055 261932 234575 219073 226633 212821
9869 212821 195325 186913 180671 159858 151259 152318 149441 155513 159201 143647 133142 132450 125245 109373
9855 109373 108073 105751 103704 106359 102697 88822 95225 105924 105159 95977 94107 92682 80888 70154
9841 70154 70062 69476 69847 68296 66438 51259 38372 37393 38854 46050 47999 45218 47988 64312 55862
9826 55862 53773 44363 35839 41186 42626 31218 22866 18657 8633 4116 -3759 -8690 -3108 670
9812 670 13721 13645 9142 11137 12457 30226 43029 35127 19171 19807 23149 11873 12977 22401 22347
9797 22347 43379 58607 41480 35513 34532 24720 28502 33234 28889 26316 12723 27202 26004 15952
9783 15952 27523 23838 26796 35511 29924 23996 26052 31075 34448 40705 22318 -6652 -1774 15532
9769 15532 21364 19093 14876 4272 -4352 1997 960 1164 5718 16079 21849 10759 -18056 -6491
9755 -6491 6974 5970 20697 25007 16720 10542 12179 11313 12433 9794 15176 11985 5458 -18333
9741 -18333 -32788 -19452 -28934 -28718 -33207 -26513 -20714 -17246 -22011 -23390 -19555 -12732 -5430 -9180
9727 -9180 -17468 -29846 -28679 -19342 -14554 -16248 -27953 -31567 -21830 -6213 -1663 7024 12732 1886
9713 1886 -8722 -2778 3950 -2374 -7504 2399 -9919 -15647 -7817 -6414 -12364 -31040 -25390 -16976
9699 -16976 -7709 16269 30670 18818 4553 714 2559 -12569 -14849 -16039 -15381 -13185 -12084 -21665
9685 -21665 -14838 -6796 -5721 -6040 -1930 12153 22714 26946 17853 -2342 6413 9575 16805 20582
9671 20582 22043 25306 13506 -470 -10350 4400 9019 875 -5059 9425 17073 19478 10911 12909
9657 12909 4391 1739 -4805 -6464 -6151 -1432 668 -6470 -12473 -15406 -8170 7590 26101 35759
9643 35759 26173 9940 6867 20102 21941 12835 9338 6912 10593 6253 -1784 1696 9684 9991
9629 9991 -823 -1382 7342 18911 34669 38086 21527 13091 10466 18387 10228 16564 38186 39728
9615 39728 29914 33370 31087 17496 14721 10264 5299 1094 6312 13659 21029 28529 25476 23692
9601 23692 13442 19343 15174 -5562 -6420 726 8238 -4911 -8928 8526 15686 14097 2444 123
9587 123 -9596 -6843 4223 2255 -2718 -3014 -7908 -18831 -13008 -12090 -11410 -7014 2936 14 -17822
9572 -17822 -11704 -1514 -4487 -16291 -4029 4736 706 6053 14873 18569 14830 6642 4180 3696
9558 3696 -4105 -1166 -14432 3123 12801 11599 8237 9359 -691 -9623 -5182 5263 1473 -3724
9544 -3724 -628 10927 16104 15662 17401 23290 18694 19581 21400 15933 8010 5982 -451 -2821 4911
9529 4911 16930 24953 24227 16764 2572 -11627 -11528 -2087 -948 11751 16839 23149 10577 -6671
9515 -6671 -5107 -6663 -1822 4372 -7517 -6244 -8121 -9012 -6288 2973 16613 18327 2922 9376
9501 9376 22033 27035 24297 7689 1351 7119 11707 -2114 -17282 -25332 -18936 2828 20375
9488 20375 18704 7868 4716 3438 3717 -194 -2689 -794 3933 -10357 -15931 -25742 -11600 -7051
9474 -7051 -10381 6398 20765 8733 4569 15318 16286 18421 25827 18676 15272 7146 8216 14409
9460 14409 11313 1048 -5057 477 11922 17667 11947 -1012 8227 26730 27693 9196 2961 11493
9446 11493 12017 17073 14355 15046 21885 12910 4612 7329 12923 262 2062 5869 8101 9041 911
9431 911 -12374 -7336 516 7095 7492 -2763 -19941 -21869 -7052 2504 261 -5346 -13021 -23627
9417 -23627 -25296 -16865 4388 8194 2565 10513 11933 10606 11094 9303 5067 -1 -239 1527 23053
9402 23053 25398 23639 20476 13420 -5917 -4989 -1773 -7521 -8845 5171 14391 32172 42268 43176
9388 43176 25517 161 -4409 -4047 -8347 -3386 9458 32575 22114 7662 7806 6337 1681 9120
9374 9120 12092 17574 24607 21146 9616 10120 3791 7607 2522 12763 12677 4243 -211 -5440 -7899
9359 -7899 -18465 -5880 -5777 -14048 -13939 -8847 636 4053 4802 -599 -6160 -7959 4990 21470 25386
9344 25386 24057 18905 20025 17798 4839 -7417 3799 19298 30084 34002 21844 10098 8496
9331 8496 8453 -1524 11038 30342 28595 29139 20745 22666 22039 10752 3320 -2260 -2129 11964 29989
9316 29989 37351 47743 45842 34762 41911 46755 42497 48734 48299 59393 53017 31048 31217 30072
9302 30072 26786 21355 21132 24181 15711 -30 8962 17559 16194 21960 11821 -331 21392 35790
9288 35790 42762 42737 30885 34089 32522 30711 32411 16944 15740 17872 14033 14560 9629 16507 30316
9273 30316 29947 30168 35130 43338 46766 43835 41309 37819 37340 21940 15893 16006 23236 31515 18955
9258 18955 20858 27040 18904 32292 41285 54378 51629 50400 42712 37685 35108 59981 64006 52526
9244 52526 51568 47636 48723 51913 45283 41638 46691 39308 30777 37448 41487 48370 38193 39704 47891
9229 47891 65089 63061 57044 66352 71961 71362 75283 71473 64181 61842 73178 82020 80844 74566
9215 74566 69425 75251 76698 67971 57622 58449 57854 53483 49508 60270 84685 89481 92641 98548
9201 98548 88556 75334 74046 82977 87498 97984 106378 115789 115658 106418 108754 113746 118278 122835
9187 122835 130087 130001 127279 129182 133645 134688 120304 110511 111902 119351 135849 161845 162675 159522
9173 159522 176113 197663 197360 173275 170844 185865 199795 211514 208050 203608 216326 224499 240157
9160 240157 266183 278761 294729 309754 321690 325881 345600 369514 369536 372454 391951 421022 435228
9147 435228 431932 429910 445283 472395 493839 517684 529487 533649 540807 554998 573068 597040
9135 597040 618213 625222 617749 624563 643166 658699 668250 669474 671750 671245 665976 678104 682166 680255
9121 680255 671572 652724 639302 636304 630601 629826 609026 600244 595703 581153 567081 539857 526916
9108 526916 528910 517107 501575 504811 490265 478958 470195 457549 425953 411410 407958 396492
9096 396492 393572 385742 371186 348397 324570 301905 282347 284739 288422 279060 264109 251797 227622
9083 227622 215590 213469 216343 215930 219158 212303 199875 195179 177882 182721 172129 161667 154711
9070 154711 157124 154571 147379 144361 139667 128001 125197 129731 120430 114117 116068 118371 118540 110466
9056 110466 103600 104572 112790 106461 104480 101505 96600 81223 74137 80561 91631 93263 84154 72793
9042 72793 69895 73897 72024 66270 65648 67546 70569 62128 59956 61776 68784 70912 64079 66826 52450
9027 52450 53165 46074 41711 48835 48640 45779 43184 37104 34114 32867 31068 24043 27415 27192 41228
9012 41228 61826 68712 74166 78098 72437 55323 52147 46801 50160 61528 66071 52706 36770
8999 36770 35530 44304 42216 43591 19388 12064 10303 8928 16630 26020 29168 40110 37825 28222
8985 28222 31144 33064 38679 38586 26723 34927 49865 45853 32902 30607 31753 21910 13631 24685
8971 24685 24147 29918 26321 20129 23837 28647 24471 32688 44371 46024 36411 23578 18090 11944
8957 11944 14545 23197 20658 9597 2925 4990 9854 20096 24498 24231 30648 23263 22617 28744 26949
8942 26949 20038 20602 19183 18042 10677 -2535 -11491 -11412 -10982 -18432 -20433 -18436 -10037 -15349 -11251
8927 -11251 -1119 12473 15085 19292 9743 2281 16810 17842 3378 10088 16789 20966 34573
8914 34573 38608 42231 44657 45019 36391 30536 27256 23081 20602 17637 21164 28594 30303 22998 39977
8899 39977 48213 37952 47041 36227 31849 34328 28017 22309 29619 37166 36276 33620 16554 9918
8885 9918 8621 2193 1577 -2987 3133 12655 22122 19009 12139 12499 2374 3707 17398 16571 22346
8870 22346 35713 45608 55722 56376 54613 57309 53409 44826 47130 51749 38461 40790 42671 19589
8856 19589 8496 12257 12931 9802 7869 12439 18607 12083 9025 8972 26287 24851 14675 -14656
8842 -14656 -29918 -25940 -15174 -738 23 -19456 -22765 -9819 -4832 8307 16676 13341 8331
8829 8331 11949 13239 13977 15073 18152 16060 13734 17545 15244 27862 37322 25171 22655 23576 27771
8814 27771 31028 22764 13844 -2118 -15818 -4425 12057 17757 7634 -1710 7469 3474 8458
8801 8458 7998 5758 8476 11797 23342 9234 -10087 4693 3471 11434 24417 24999 15048 10403
8787 10403 5084 -7356 -1326 -10152 -20421 -523 23791 20814 18849 33907 20372 15538 11160
8774 11160 8873 -1035 -5929 -16106 -15316 -10075 -3648 -4880 -4960 3666 2196 1707 68 8526 10018
8759 10018 16709 10181 148 17133 28044 14685 9519 11581 4381 5659 19004 31614 34979
8746 34979 35809 18234 9930 12270 3159 10609 17924 20514 10642 4909 -3472 -2036 11175 11244 11039
8731 11039 14293 11195 8049 13931 20466 6739 14582 24818 6995 -8793 -8566 -10225 -21674 -16015
8717 -16015 6115 15997 3461 -9202 -8695 10543 12486 1299 -6871 -3803 -2702 -2591 -2209 9845
8703 9845 3068 -8283 3746 9919 9391 6548 6968 9207 11751 1286 -3753 -1568 12169 10411
8689 10411 12651 8161 -8522 -19013 -9451 -1121 -5122 -15786 -22469 4656 20716 26338 19431
8676 19431 12330 18744 17861 6949 -3687 -4355 -12511 -22578 -12576 -10184 -14576 -662 3886 4667
8662 4667 15852 4950 2934 14908 21763 24355 15530 11533 1701 12643 22807 14056 10884 22107
8648 22107 32245 28562 17420 7030 13244 20564 10065 4187 -9708 -8330 9815 12377 10465
8635 10465 -7258 -1706 13091 19361 17631 20010 14214 -4470 -9300 -6455 -2164 2957 10825 13371
8621 13371 9952 -2331 1631 4728 -2178 7 1406 5667 -1939 -14194 -2742 6335 13582 6563
8607 6563 4765 19936 15371 13299 25472 20888 19881 16041 23610 18291 18167 27718 29368 35588 21384
8592 21384 12170 7959 6499 14981 18762 9882 9305 19210 9986 20166 29419 23621 19240 11093 10175
8577 10175 19447 17474 8426 5053 -2938 5488 8912 21733 17542 16617 25801 20029 509 1583
8563 1583 -1412 11940 14504 4739 12121 11951 13363 9778 5437 12371 14504 1843 7302 22574
8549 22574 11655 -16413 -25204 -7797 366 -2397 3650 9931 7950 7987 -2381 -2765 11404 15935
8535 15935 3314 -11109 -17039 -18153 -14200 -12487 482 10456 13854 15334 5696 -3033 -5994 10860
8521 10860 22755 22559 18646 21712 28173 16861 10472 4795 13360 15214 18741 3429 -11622 -6095
8507 -6095 7734 12950 4610 -5887 3681 4752 -7081 -4491 12217 4047 -8832 4696 11694
8494 11694 17834 10559 9770 19317 18441 17391 31721 14601 3681 -4142 -2575 4849 9609 9460 2638
8479 2638 2683 17643 17464 17433 8749 -29 -9838 -9857 -14162 -3482 -2849 -8093 776 -5934 -15566 -9033
8463 -9033 -2355 7194 -1595 -4360 5568 -12848 -12730 -9941 7956 19610 17037 10574 3934 4878 2200
8448 2200 -13004 -4662 -2562 197 -20 -5925 -6973 -3374 -359 5008 -14152 -31300 -17865 -8415
8434 -8415 -14638 -16885 -9101 -13193 -20230 -28709 -26964 -27040 -22608 -23740 -15500 -16044 -15203 -7422 4897 11123
8418 11123 3370 -7263 3316 -5522 -15114 -7398 -1692 -7150 1085 3893 8446 -1966 -7038 539
8404 539 3850 1227 7481 -4129 -6646 -14984 -15122 -10777 -15594 -11759 -10521 -16811 -7393 -2253 -8890
8389 -8890 -7470 -2417 -2095 2021 2384 -5000 -10300 -22226 -26786 -22528 -6080 6096 17859 26225
8375 26225 19083 -1726 -10560 -14457 2378 1209 6999 10555 10191 12887 2640 5621 9882 27191
8361 27191 39698 27138 12138 5034 -10099 -13549 -4513 -621 -8295 -3114 -4500 -11019 -6653 -10922
8347 -10922 -11560 1316 -8352 -11428 -3820 -5670 4394 10949 -9129 -7232 14939 24177 26801 11915
8333 11915 1363 -8517 842 -8917 -8225 -5245 -10537 -11072 672 11766 17937 11255 9357 3377
8319 3377 6365 -9364 -31050 -32668 -29397 -17392 -2236 -1074 6566 -11146 -15360 -23099 -17214 752
8305 752 -1877 -2747 -5786 -21001 -19158 -2527 5661 -127 -5574 3176 -4151 -5054 -5027 -17205 -24014
8290 -24014 -8948 -6462 -12955 -12664 1222 -10255 -17137 -10053 -10701 -11382 -15152 -12270 -23293 -24017 -1743
8275 -1743 -4624 -13535 -2197 -13305 -15683 472 1897 -4984 -18228 -19758 -24724 -13797 -8789 -3727
8261 -3727 10035 24716 23295 26424 25828 18727 10121 -3371 -10224 -6049 4786 7483 7268 -5950
8247 -5950 -498 -5570 -22342 -15800 -2072 5576 4605 -9603 -19245 -16067 -24454 -26264 -25004 -13789
8233 -13789 -9794 -10121 -13383 -10672 -5781 345 7127 9454 12159 8227 -7675 -12954 -7620 -7376 1100
8218 1100 12477 -6634 -19515 -17087 -10965 -7074 -20378 -17498 -14834 -8617 -5122 -581 8844 9474
8204 9474 7403 16691 6433 -15047 -32318 -30762 -25730 -6894 1356 132 -2270 -158 169 15590
8190 15590 21052 17364 22333 12922 5142 3535 2288 1534 -492 2552 7750 -338 -7358 -5264 4275
8175 4275 18432 15992 2757 -1336 2690 4221 813 -9351 -23361 -14010 -3608 -2973 -6736 -5503
8161 -5503 4180 10282 10310 6536 45 -2167 9466 -484 -5289 -1574 7057 6286 -5685 -5318 6494
8146 6494 19063 20472 7374 -13794 -26656 -23423 -16626 -16475 -18461 -14350 -17461 -11662 -2000 -9155
8132 -9155 -3542 6721 -2199 -10043 -5089 -2081 1034 618 3071 -1840 -677 1179 2297 4859 14296
8117 14296 4470 -19341 -40915 -51609 -49262 -28059 -29580 -36089 -28901 -17543 -18577 -17820 -7783
8104 -7783 631 16886 19801 5487 -6678 -5722 2027 1055 -1913 6860 14209 4219 -16091 -13054
8090 -13054 -4623 1392 3546 13780 15314 18187 6574 699 -5671 -157 4502 5466 15538 11733
8076 11733 8395 2200 -1896 -7998 7368 11491 3341 -10305 -16259 -8576 -6591 -13969 -26602 -15173
8062 -15173 -8420 -149 9236 12844 -6715 -24214 -27054 -15006 -3726 1974 5717 798 6781 5207
8048 5207 1998 -1651 307 7284 15651 9065 10437 8884 2703 2211 930 -2185 -6835 -3558 11022
8033 11022 13552 14049 7821 12075 11944 -1573 -22103 -28924 -11134 13338 923 -3664 6776 21107
8019 21107 24591 18119 26044 14150 21410 28438 30248 16237 3776 -2220 4181 17406 27189 22802
8005 22802 17317 7633 2738 3253 19660 24373 24935 17039 9603 9068 22129 25459 26044 8860 -3296
7990 -3296 -152 2464 14816 2408 -5162 -3884 -812 -12298 -8686 -6847 -1183 9056 7066 17983
7976 17983 27618 25125 2853 -3871 -6941 -9875 -9037 -10592 -6784 -4625 16664 25675 16229 13035
7962 13035 23763 29819 20984 8686 2727 -6544 -10509 6950 1878 1389 21526 28069 40108 26724
7948 26724 26719 25573 -4140 -9582 -868 10066 2680 -6777 -14656 -16162 -12435 -18748 -14188 -10470 -11284
7933 -11284 -7434 2890 7760 29391 34672 12639 -2348 -13890 -6193 -10733 -1951 -10343 -10191 8348
7919 8348 678 -15226 -15866 -2884 1234 -2254 -2923 8777 20356 26706 17343 23194 31163 9957
7905 9957 1951 2989 7439 18100 31069 34163 28005 27973 19616 21488 16584 15741 15180 28224 15910
7890 15910 13343 20715 29686 16445 -209 1208 316 -2676 3705 1422 7215 18907 19270 16160
7876 16160 17466 1558 -11627 -17557 -10329 -8005 -1510 -7322 -11965 -16022 -16572 -9045 -20355 -17449
7862 -17449 -16015 -21109 -36682 -43832 -28483 -13350 2351 10154 4840 11972 29399 10467 -40
7849 -40 725 3750 2336 10383 10662 9908 11668 14299 5737 -12266 -13591 -20328 -20730 -19951 -15170 -2946
7833 -2946 737 3457 -3739 -14095 -9704 -3805 -7522 -4298 -22147 -27698 -9879 -3818 -3829 -1932 4245
7818 4245 9160 9291 2368 995 -911 -7811 -9170 -9167 -8778 -5788 -18046 -14058 -24007 -30701 -22345 -23132
7802 -23132 -21611 -21273 -15923 -8778 1544 -10469 -24939 -33310 -23779 -16970 -10341 -14377 -170 6075
7788 6075 2595 3657 2244 -11274 -1539 -265 -627 4959 15980 10768 -467 -365 4135 5971 6769
7773 6769 -4018 -12387 -22421 -16262 -7163 -11463 -16012 -23108 -22320 -4056 9130 11426 15011 17444
7759 17444 4953 -3131 3137 -3020 3227 65 4203 6790 7944 1507 -3887 -8532 -3301 -9119
7745 -9119 -7702 -5155 -2581 -4773 394 -2593 -8012 4200 6572 4600 6067 456 -13010 -21275
7731 -21275 -3041 8058 4715 -3373 -29254 -25494 -20385 -25192 -41318 -46549 -41684 -35276 -35634 -30566
7717 -30566 -23523 -10931 -5416 -3834 -4133 -124 8902 12049 7658 -8800 -6677 -814 -3973 2936
7703 2936 7734 6667 -1027 -10883 -6055 954 6809 920 3507 -2154 -12058 -19396 -22630 -23661 -17578
7688 -17578 -17697 -24976 -17363 -20385 -15823 -19828 -25942 -13516 -15259 -17572 -15818 4869 7019 10366
7674 10366 7617 1491 11045 8280 -143 659 11714 12550 4481 2325 -3894 -4401 -5663 -10296 -5528
7659 -5528 -3241 373 -1224 1070 -3419 7481 -4429 -24086 -2588 -4696 11137 20987 23460 14576
7645 14576 5495 654 -5602 -1319 -2036 -8772 -13224 -7671 -11081 -6183 -7623 -6443 11793 6542 -8276
7630 -8276 -10066 3885 807 -3816 317 5336 6388 -1346 -5534 -3723 -7286 -20033 -21370 -31444
7616 -31444 -26989 -837 2882 -203 4029 13035 9241 -1553 -3666 -3682 -987 -8532 -19222 -31642
7602 -31642 -20244 -16489 -6613 5411 5033 3762 469 -4338 3482 10648 15703 17381 13487 14192 5880
7587 5880 1241 -2758 -14677 -13704 -1210 -5366 -8470 -6454 1658 -5034 -11695 -12381 -11101 -11610 -23162
7572 -23162 -23372 -15573 -12985 -5260 -4285 -2733 -9343 315 4298 -5183 -5221 -10887 -569 -703 -1414 7089
7556 7089 1774 -8068 4246 5358 -2303 -5011 -4881 -9648 -15378 -19734 -14654 -8257 3731 3892 -16712
7541 -16712 -29807 -17907 -3275 -7369 -4014 732 5888 5581 -6050 -17179 -19167 -17675 -15613 -2332
7527 -2332 7375 16477 8636 -5802 -8514 -5190 -1925 -1512 -10950 -12049 -3008 73 -19662 -30734
7513 -30734 -24049 -25615 -27221 -20938 -16406 -12388 -11551 -18528 -16797 -8956 -5160 -11891 -9936 -7603 -13428
7498 -13428 -20722 -22247 -14890 -16618 -26163 -23183 -17731 -11845 9218 8364 -9170 -21465 -27175 -23655
7484 -23655 -31817 -33775 -15776 -6288 -852 18889 18389 19540 11993 3589 -4819 -7945 -5194 -5019 -11107
7469 -11107 -11856 -30342 -34022 -37790 -33510 -24873 -25636 -20737 -15646 -3729 19345 19320 615 -4520 -1526
7454 -1526 13215 16277 9942 -733 -10514 -4603 2251 -1377 -3692 4478 15701 10646 -3595 -16804
7440 -16804 -18693 -3766 -1684 12313 15093 11006 -9715 -16542 -22406 -31052 -36125 -34223 -16532 263
7426 263 -8688 -14994 -8682 -4398 15977 21337 4633 4810 8036 5588 -6962 -17570 -20191 -10548
7412 -10548 -7593 -12458 -7784 -8910 -18375 -15347 -11468 -7583 -6667 -12425 1444 3950 -278 -3645 -12329
7397 -12329 -5677 2546 -20433 -29617 -10407 6851 -207 -10936 -15447 -17297 -4614 -6835 -14396
7384 -14396 -13437 -13534 -18148 -7939 -10349 -22531 -19098 -8885 6541 9540 -3067 -15970 -17215 -26842
7370 -26842 -24443 -21300 -19042 -8757 -2240 268 -2362 -6395 -5004 -10737 -12802 -19372 -13571 7977
7356 7977 8465 -332 -1861 -13876 -9513 -2095 218 362 -6492 -8945 -17989 -16777 -11058 -10360 -3984
7341 -3984 -7452 1464 7714 -6673 -2255 18834 17793 13458 14850 13341 12958 12310 21459 13847 13626
7326 13626 4810 5701 7975 1325 -2724 -11953 -20221 -5105 2441 1392 -6920 767 8068 9599 9874
7311 9874 17840 12898 5557 9783 15171 11659 11224 12948 -2514 -3742 6241 5581 4414 10360 10024
7296 10024 2304 -7508 3755 -2059 -20383 -16772 11835 12124 1079 -683 -25942 -24072 -18668 -13107
7282 -13107 -6946 -5018 -8725 -17987 -6058 -5747 -100 4750 -7568 -21734 -11802 -4904 -3302 -1064
7268 -1064 -535 5911 4083 12423 24356 10516 8058 696 -10549 -1561 6290 3514 3215 -4427 -21468
7253 -21468 -34560 -33430 -14235 690 -15039 -25332 -17510 2302 -1975 -2868 -13690 -18575 -19583
7240 -19583 -27610 -28681 -31277 -37893 -21067 -10258 -13142 -7342 -4675 -12966 -14683 -3890 8478 -5015
7226 -5015 -12234 -3505 6762 -3316 -2714 -6785 -15240 -12530 -6251 -4655 -9784 -3501 -4572 8214
7212 8214 5702 -13081 -18965 -15377 -23745 -29960 -36164 -28756 -18097 -8730 -3277 -4709 -10573 -9626 -3012
7197 -3012 4064 13783 19557 11779 6883 -161 4927 5846 1098 -1601 -5644 -6932 -19010 -36141 -40405
7182 -40405 -37906 -31404 -18907 -18244 -14751 -13945 -9135 -19870 -8796 1937 8141 5118 -3596 -1848
7168 -1848 -855 -3520 -8609 -7089 -1645 -7984 -1767 -3240 -9770 -2366 5954 3421 -12160 -23203 -22344
7153 -22344 -21984 -23149 -14579 -4475 -2904 -23303 -37287 -28856 -23413 -28493 -21544 -10587 -5063 4306
7139 4306 4490 -596 -4026 -11524 -7428 1678 -7080 -5534 -14001 -38792 -21979 2255 8809 11446
7125 11446 4088 4686 12712 11723 4803 -13160 -25800 -33740 -29884 -14489 -28850 -24616 -21460 -27089
7111 -27089 -21133 -8274 -3285 -3378 1955 -905 -10487 -11552 -10057 -9826 -18654 -24852 -28746 -25669 -34015
7096 -34015 -26141 -18919 -18060 -16749 -15051 -25996 -23097 4000 3979 10911 15304 7745 12925 16374 18498
7081 18498 4836 -1883 1794 15063 11370 -4172 -4746 6343 5831 -3710 -9574 -20301 -23726 -21528
7067 -21528 -20451 -10608 -3575 -5806 1848 8532 -4318 -16744 -10130 -14518 -16943 -11722 4786 345
7053 345 -4690 -8463 -705 14604 9273 5082 8174 -1321 -7535 -6229 -5891 -543 -1539 -3026 -10235
7038 -10235 -18130 -22471 -17250 8565 9996 -197 -6980 -6138 -9168 -8293 -2305 7080 6076 3322 7834
7023 7834 1730 -13510 -18487 -22614 -16704 -18385 -9457 -12091 -13451 -1637 7523 15071 926 -20943
7009 -20943 -17757 -8318 -9890 -8725 -9861 -19732 -34424 -26202 -11049 -14992 -19253 -7557 2627 -5059
6995 -5059 -5353 -3275 -15697 -5910 -7804 -7665 3971 6793 -979 -4934 334 8680 1351 -5380 -2631
6980 -2631 3506 5289 -863 -12161 -18824 -23800 -13024 -10391 -11041 -15515 -15352 -6271 -9057 -9169 1498
6965 1498 1404 -138 -7856 -1776 -3621 -16416 4431 21220 6480 -6814 -6273 -1145 -6529 5724
6951 5724 15119 6173 5494 -2220 -7515 -13036 -6439 -15462 -441 17424 9352 11103 18038 17338 17883
6936 17883 24214 19617 12945 1432 -3166 -10362 -4075 -8051 -17167 -11804 -2875 -5259 -6637 -3364
6922 -3364 -802 -10611 -27697 -20469 -30141 -25890 -16648 -7690 5992 16016 2590 -15094 -6349 8520
6908 8520 -8581 -30301 -26870 -16522 -8197 -3852 -17388 -12702 -5406 829 -1635 -11586 -11697 -8385
6894 -8385 882 8760 -3639 -8433 -1777 11073 666 -7663 -590 3321 6603 12641 12410 1058
6880 1058 2913 2525 1672 -4675 3536 9998 6890 -3852 -15779 -6549 -3562 -6942 -12698 -7961 2047
6865 2047 12009 23758 15990 -6028 -4863 -7626 -15171 -26084 -26288 -12617 478 4177 -157 1280
6851 1280 -2067 -2288 -3007 3259 15823 14074 -9177 -19296 -18456 -22316 -16866 -6845 -3520 -3733 231
6836 231 -15271 -27203 -14857 -10244 -20335 -20869 -4465 23462 24912 -284 -15066 -22220 -22449 -18203
6822 -18203 925 7703 4363 -267 -735 4373 7082 18749 23997 11261 7137 3554 -6237 -7472
6808 -7472 -15306 -7817 3660 -1076 1135 9550 3125 -1303 -8846 -8001 -13029 -13574 -7046 -22681 -32460
6793 -32460 -15651 2462 -5929 -5142 -6788 -21577 -35655 -27254 -16486 -6293 794 9757 5534
6780 5534 -2509 -4437 -5676 3119 -343 -4914 -1163 8172 8624 -9302 -10516 -5800 -341 416 1503
6765 1503 5986 7908 7788 7231 5302 812 2129 4939 9359 -115 223 2168 -16187 -15398 -339
6750 -339 11780 20484 16502 17272 30723 21200 7743 6775 5562 -5655 -14780 -10146 1863 1217 3565
6735 3565 4060 5614 2727 -6482 2121 8443 7828 8433 9967 -5710 -22273 -24406 -18135 -5880 -7320
6720 -7320 -13402 -25420 -28361 -17876 -4178 -3606 325 -11989 -24330 -14620 -10909 -14432 -10858 -8345
6706 -8345 -4974 6637 7423 4673 3183 7382 6320 3315 11563 20713 20628 26836 23368 11600 1788
6691 1788 2245 8664 5476 1243 9820 18321 1036 -9410 -9883 -14001 -10541 -25238 -35848 -21029
6677 -21029 607 -6355 -12142 -2231 -16008 -32375 -38749 -43333 -39501 -24738 -25045 -24711 -23421 -10852
6663 -10852 -10560 -12274 -24130 -34010 -23253 -13527 -15246 -19548 -21510 -4038 3626 -1248 1236 13692
6649 13692 15963 26366 20196 11896 2049 -14385 -18074 -5037 10086 3958 -4107 -7390 6074
6636 6074 -1168 -1671 1824 1718 -3347 -11518 -7508 -2743 4718 -15043 -27035 -11422 -4288 -11577 -21044
6621 -21044 -15855 -13295 -13893 -13090 -12878 717 -1051 -8991 -14049 -6794 1057 10769 11952 6659 8090
6606 8090 6811 -3038 -10249 -21988 -23730 -40157 -43120 -32635 -128 13571 9978 6578 17627
6593 17627 28848 29211 22010 11712 845 -12462 -19367 -14897 -14962 -26731 -22204 -15763 -9971 -3478
6579 -3478 4680 476 18363 24000 27280 25583 19541 10665 11674 -1507 -3694 -1595 -2592 -8997 -3611
6564 -3611 -638 8574 21158 18715 1080 6331 29009 27637 20891 14401 -7439 -21803 -6657
6551 -6657 9665 4781 -6390 -464 8754 11475 7315 6623 -3289 -7059 -5987 -7998 -6405 -1410 2224
6536 2224 7627 5718 -332 -39 15583 28590 27413 17822 11712 10895 8333 -4030 -24285 -31633
6522 -31633 -32027 -25063 -29349 -21213 -4445 -5375 -8295 -12414 -6017 -10492 -26502 -8838 19800 15481
6508 15481 -4923 -27936 -32514 -22025 -26370 -14903 7568 13110 7982 2942 -371 -9403 -7345
6495 -7345 -21411 -20526 -9294 -768 15064 1653 -5858 -7942 -8093 2962 -13338 -22241 -27617 -28523
6481 -28523 -13234 -8749 -16620 -9445 -3057 -5385 -7097 -15467 -3505 -12744 -7167 -4434 -8444 -14086
6467 -14086 -23716 -21953 -16698 -22276 -23187 -25153 -15482 -13008 -5676 806 -7116 -24201 -24892 -28500 -29018
6452 -29018 -16142 1817 11862 14262 11866 5498 -7962 -5381 14612 12141 7307 12326 -1157
6439 -1157 2893 3096 -9657 -24127 -8767 4791 3976 12080 12728 -5937 -3002 -7460 -9861 -7983
6425 -7983 -4790 -16553 -19624 -23243 -14341 -9935 -7826 13081 18448 1631 -11115 -964 4800 10685
6411 10685 10123 5492 14029 17851 12204 7237 -3087 1044 -4696 -9113 -9948 -4131 -5791 -17220 -28137
6396 -28137 -32749 -30860 -34206 -31936 -19265 -4538 -5255 -2859 -6976 -14907 -8427 -15012 -9083 4172
6382 4172 619 -11977 -3854 8655 5450 8978 9545 13074 16388 16348 8843 -102 -2784 -5896 -3736
6367 -3736 -830 -9965 -29696 -30360 -27504 -26413 -8704 -1217 -5796 -1118 2281 -1811 6001 10079 6893
6352 6893 3878 1953 -4028 -9160 7571 12812 8879 -6611 -12180 -8102 -131 -6777 -25326 -25095
6338 -25095 -16729 -29378 -48153 -38998 -7096 -86 -6771 -5215 -9062 -24234 -18692 -16237 -20020 -5962
6324 -5962 1447 -3497 3904 299 -6959 -2085 -5615 -7604 1689 -4536 -9812 -2350 5541 3524 -2771
6309 -2771 -1610 6750 15206 6547 1038 6668 726 6680 14384 15874 7390 3788 9186 -11710 -31898
6294 -31898 -24581 -11662 -500 -1093 -623 -2345 -10064 -14672 -22846 -14015 -16816 -17580 -18598 -15703 -9798
6279 -9798 -6683 -21467 -25473 -19210 -9792 5492 8913 6265 5436 1783 16197 18995 10024 8622
6265 8622 14335 17917 20780 -623 -12772 -9958 -31254 -17142 -5869 -8716 -8385 -3498 9090 234
6251 234 -8793 1178 14890 29286 26691 16698 18411 29699 27935 18149 17503 22293 18432 6609
6237 6609 -4155 7598 -1808 -3483 -2489 -8290 -10886 -1416 -3232 -8497 -8979 -3486 9180 17614 13766
6222 13766 14581 4737 -8283 -21278 -11114 11705 13523 3132 -3344 -5353 4347 19888 7625
6209 7625 -2701 -7109 -4655 6868 5271 10390 2924 3726 2897 10185 8991 5170 -2058 -5126 -665
6194 -665 -6633 12265 13098 17817 6049 -12045 -12203 -14447 -17865 -11740 1008 -10378 -14646 -25823
6180 -25823 -28183 -31996 -33208 -10802 -6508 -17860 -18523 -14185 -7306 -14060 4855 -1242 -10978 2604
6166 2604 5529 6914 7704 8537 1775 -16102 -11301 6848 16139 23978 23882 19142 7166 266 -5290
6151 -5290 -19452 -15460 -5474 -6228 -3475 3398 5981 -12935 -17144 -13698 -367 -6741 -11672 -14999
6137 -14999 -22385 -16738 -11689 -6139 -1286 1565 8899 -1232 -5796 -7345 -11382 -3307 -9809 -9917 -12975
6122 -12975 -12103 -1999 -4982 -9787 -13038 -11549 -19677 -18822 -4384 -8800 -9634 -10585 -13364 -2573 -6975
6107 -6975 -4951 697 -8295 4714 12490 6776 520 4540 5914 -1661 868 16213 -8568 -15358
6093 -15358 4938 5931 206 -2178 -10083 -18526 -11816 -6989 -3000 -13330 -24739 -17420 -18397 -13320
6079 -13320 -4643 248 -3994 3718 -1491 -10064 -12840 -8896 -13734 -10785 -11560 -9534 -4309 -3381 -1245
6064 -1245 -21966 -30922 -23393 -10851 -12093 -15502 -19997 -23069 -13736 -3833 4813 10704 22287 23201
6050 23201 8613 11331 17147 3418 -2227 -5563 8590 14717 9995 7440 7434 15272 9734 -4943
6036 -4943 -25044 -19824 -407 1738 -747 -3244 -10737 -6298 7 706 2623 16347 16777 6461
6022 6461 4975 18964 20351 -3643 -1653 3807 -6342 -1639 3002 3304 7126 1525 -4668 11984
6008 11984 19502 10605 -2194 -6037 -12989 -8056 -6887 -424 -3752 -14452 -8659 -46 -4059 -2916
5994 -2916 8526 19470 18688 10569 -5413 -1010 319 -215 5121 11784 10660 3073 -6938 -8195
5980 -8195 -19320 -24199 -11893 2842 1723 10165 3785 -16270 -21096 -23684 -14348 -17446 -17945 -11926
5966 -11926 1288 13336 9998 10837 9366 10749 866 -16486 -8160 -1660 -7962 -11509 -10928 -6742
5952 -6742 -5428 9091 10089 9205 -2008 -2584 6036 8867 3153 -4830 -21571 -22468 -7979 -5190 4173
5937 4173 18638 14682 8622 3148 4661 3970 -8785 -1363 830 2986 11769 19567 20695 8214
5923 8214 2415 7157 -1149 -10046 -12961 -14411 -18743 -25309 -32750 -23119 -16498 -4389 -6613 -17377
5909 -17377 -21606 -22439 -9514 -8505 -10595 4999 9817 1634 13692 6386 -5258 3762 3830 -13704
5895 -13704 -10368 619 6766 2328 10469 20531 13690 11877 15791 10482 13643 25120 30772 20502
5881 20502 22697 17649 10261 5424 9765 498 -10212 -10766 -16583 -19052 -11102 642 -5310 -6541
5867 -6541 -10862 -10417 -10183 -8295 -3363 -3408 -16171 -19831 -5645 10467 9278 8048 -752 -7191 12080
5852 12080 12161 -6481 -3928 8787 19394 4257 2268 25197 14922 1178 304 -1513 -2222 -4069
5838 -4069 -1523 13820 11121 5727 2993 -4457 -12548 -21931 -24533 -22257 -18640 -5773 14417 9792
5824 9792 -5749 -15580 -16205 -11379 -14191 -20832 -9728 -7634 -10111 4097 8597 241 -4179 -6430
5810 -6430 -7405 -4878 -17179 -25872 -22869 -11271 -11073 -6747 8947 72 -21532 -21589 -16913 -10282 2473
5795 2473 19309 10011 10023 7358 5109 11723 7553 8494 11968 14920 5149 -5230 -20124 -27857 -26126
5780 -26126 -27668 -22864 -3734 3459 -5911 -9677 -11511 -6079 8740 7591 15025 20223 25565 15828
5766 15828 4211 2003 5818 8350 -13893 -8062 -6556 597 -5061 -660 13172 10685 -6647 -16110
5752 -16110 -25430 -23725 -19497 -2871 -6727 -4225 -15388 -18454 -19342 -19920 -16726 -5778 -2485 -2385 1127
5737 1127 1118 -6781 7417 21621 22314 4804 -10714 -14616 -16090 -13778 -10004 -2900 -3362 -11013 -17734
5722 -17734 -8615 -6324 -8255 -2677 3453 -11879 -12628 3253 11831 -4969 -3278 -3816 -6861 -11964
5708 -11964 -14945 -16956 -16686 -11834 -14784 -20744 -16512 -6449 -1256 -2877 9158 20543 17289 -9208
5694 -9208 -13573 -20708 -19825 -23397 -16490 -10402 -10154 -2976 -3792 -12643 -11220 -11733 -6041 -4478 -9415 -9632
5678 -9632 -12147 -3770 -4271 -10059 -417 3650 -14848 -17882 -16072 -3402 -5604 -8102 -12724 -17971 -16148
5663 -16148 -15490 -1497 12004 8799 12243 13756 14635 -374 -9623 -14356 -22432 127 14320 7887
5649 7887 9262 7675 1159 334 -3057 8768 17581 13699 -8328 -17747 -33260 -35240 -24820 -25821
5635 -25821 -21236 -6898 -1210 13636 15669 17870 17260 2681 -1184 -12625 -27892 -31409 -26685 -28998
5621 -28998 -38253 -42810 -29749 -19594 -13968 -8175 -1852 -11519 -12144 -915 1148 3135 3724 -2181
5607 -2181 2428 7787 18293 14152 3798 -12582 -27747 -23685 -9142 -7742 -6927 5092 7587 5919
5593 5919 4313 8656 7352 11024 13135 8403 8174 1259 174 -2433 9930 15139 5208 -3003 -16571
5578 -16571 -15145 -6595 3549 5431 3787 14549 3108 -15721 -10872 1249 -4359 -3299 -3343 -3140
5564 -3140 -12400 -24637 -15683 -5000 6403 10672 28532 21597 -2023 1346 2327 780 1777 1683 -17425
5549 -17425 -10791 -696 4125 -3903 -2120 4869 14167 4766 -8759 -11375 -346 6105 10969 4676
5535 4676 2760 5346 -3266 -5550 7647 3378 895 3262 18528 24525 20877 -5053 -12958 -1220
5521 -1220 15289 30586 33652 26680 14276 15815 10576 -1229 -6210 -2311 8857 -263 3386 -6046
5507 -6046 -15928 -25957 -14638 -1829 -446 3826 4044 7176 13272 11352 729 -2537 -7071 -7228
5493 -7228 -15927 -22823 -25414 -6580 12676 2372 -10879 -7684 -1005 -1758 -4863 2721 17976 22603
5479 22603 16376 8719 3183 589 -9976 -14437 -7073 3394 12964 14510 12884 12128 8952 3406
5465 3406 1250 3306 880 329 707 -2723 -8525 -3263 -3325 -15109 -20999 652 21381 12404 -3261
5450 -3261 -3398 -1590 -11862 -25514 -20748 -18503 -11990 3487 1828 -6904 -20734 -30585 -25972 -14394
5436 -14394 -4227 -12058 -7451 -7327 -2637 -6176 -9255 -11241 -13603 -6364 -4575 -8067 -4560 -5397 -2764
5421 -2764 15059 14311 1985 -666 2810 -2261 3489 -9277 -22870 -25224 -11606 5823 12643 9374
5407 9374 13896 20139 15262 6595 -6845 -5924 -1352 -333 -6005 -7257 -10223 -110 1681 -9955
5393 -9955 -21486 -20672 -14563 -20876 -34185 -34372 -22893 -11116 -11892 -18327 -19402 -11935 4020 3701 -4302
5378 -4302 805 -7490 -4707 -5940 -9016 -3636 -63 6404 5073 1621 6720 -7384 -11151 -3114 2930
5363 2930 -1459 2445 7689 -1815 -8775 -13894 -15025 -24234 -22162 -20302 -2619 8866 25066 17481
5349 17481 -10994 -10975 928 -14501 -13630 -15062 -22303 -8728 497 4707 12497 10184 7967 -1313
5335 -1313 -3506 -15728 -25271 -18924 -14505 -25062 -18951 -13389 -9458 4090 -3307 -5452 5107 10991
5321 10991 7142 -1540 -1496 2007 -3676 -4069 529 1671 -3450 -8407 -13239 -9703 -1704 -2584 -6592 -7054
5305 -7054 -577 -22738 -38939 -24810 -15582 -3389 -1809 187 2750 2844 -320 -3992 5330 8628
5291 8628 2376 -392 1455 -756 8412 3380 -27371 -32389 -23533 -20600 -18074 -17611 -22002 -27957 -12949
5276 -12949 -4347 -16030 -8260 -1308 7533 8693 19887 14257 3772 75 -6481 -14597 -19116 -17455
5262 -17455 -1462 13814 23318 12199 1552 8090 -6957 -27421 -26364 -17562 1467 13560 11258
5249 11258 5943 -3663 -12026 -11404 -13025 -16483 -620 241 3784 -10128 -15622 -571 5422 7202
5235 7202 3334 8051 22708 22950 20752 15943 14396 27152 18714 12275 13978 9505 2830 2828 14212
5220 14212 15796 9692 2536 5836 19411 12583 735 -4565 -21136 -25455 -16415 -7508 -2635 8236
5206 8236 7940 5557 3749 2704 -5721 -5353 -196 3924 1093 -1610 3012 6433 -1709 -1111 -10110 -25178
5190 -25178 -24600 -32109 -22537 -13435 -2195 6070 867 -13346 -18753 -25621 -11071 -6157 499 5284
5176 5284 7633 1762 -15926 -24223 -24217 -20877 -7767 3355 1257 2939 -2411 3876 14089 10896 1032
5161 1032 1407 -4745 -11837 -9276 -2902 -7699 -3374 -11763 -2816 9246 14604 1692 -10462 -7556
5147 -7556 -2873 1613 7881 18327 12211 -7142 228 13944 23005 18133 14613 2530 3722 9019
5133 9019 -4031 -16091 -16061 -2844 -5911 -13222 -15362 -13306 -13526 -11260 -4451 -587 -1367 15058 19229
5118 19229 15332 12887 25342 32660 20679 9157 -13304 -8080 5245 12221 5020 -2008 -3311
5105 -3311 -4815 -757 10328 -2485 -7408 -2811 -669 10406 406 921 -5246 -3106 -12394 -19294
5091 -19294 -13994 -5998 -6477 -17005 -19029 -15918 -18766 -15705 -18012 -24412 -19369 -20180 -14650 -2622 -7067
5076 -7067 -3316 7950 1434 -1961 -6531 -8567 -6470 -19481 -25056 -24232 -21942 -23131 -24207 -17324 -7067
5061 -7067 -9489 -5927 -1416 8313 1851 2697 3943 12908 6766 1243 264 6647 14341 18903 23986
5046 23986 22756 26046 15985 11822 9336 -1086 1379 3260 -6062 -13964 -12391 1824 12721 12906
5032 12906 4249 -657 -6569 -14285 -8891 -20820 -28864 -31995 -29323 -11577 129 7687 -1410 -12870
5018 -12870 -19113 -21521 -13674 814 -465 -5598 -5739 -5687 -3937 -5163 -5208 -7214 -5957 779 7743 6760
5002 6760 19611 25164 32835 39407 22070 19241 17101 20152 14953 8543 11197 14491 19563 28806
4988 28806 35810 20061 10677 15257 9800 6439 9078 4783 -867 -6732 -4478 -3975 3047 12474 8995
4973 8995 -8398 -14548 -10417 -3019 -7925 -17820 -8245 -3068 -4153 12396 18029 14897 13394 11835
4959 11835 7007 9264 20925 9834 6262 -7683 -10435 -10129 8001 17122 15946 17986 5491 4639
4945 4639 12466 10934 -9304 -32491 -33879 -10394 -12334 -16556 -19560 -13836 -13168 -12718 -19528 -25076 -19972
4930 -19972 -2810 -5719 954 8372 -1376 -16200 -14561 -16399 -23592 -37531 -28281 -24858 -11130 883
4916 883 3418 -11990 -10025 5233 14164 11666 13873 1759 6078 10520 958 -218 -17680 -17455
4902 -17455 -16180 -18661 -8180 -13370 -6720 -6569 -6251 -19018 -22472 -25922 -21023 -10066 -9406 -7712 -8756
4887 -8756 -7770 -22450 -15773 -589 2414 12103 18937 22452 15029 23408 29622 19595 -5278 -8674
4873 -8674 -4429 6543 16576 14615 8811 2267 5880 13277 18948 15221 449 9640 18862 15256
4859 15256 3437 2829 964 3758 1658 4284 -6589 -14794 -5505 1629 -459 2071 -1403 -8918
4845 -8918 -13525 -17665 -20025 -31549 -30689 -20882 -5982 -13055 -13871 -8411 -2554 1117 4540 1772 4138
4830 4138 -924 800 1480 8152 9270 -389 -6055 5982 972 -7694 -15681 -32091 -18936 -21837
4816 -21837 -6016 -603 896 1062 -5832 -7065 345 10352 20170 10696 9362 10343 6990 6690 -968
4801 -968 2734 -11599 -13280 -17527 -14814 -5426 5052 4953 5420 -2873 -22355 -21872 -16378 -28541 -35914
4786 -35914 -27842 -19565 -9393 -10047 -11246 -14721 -7543 -3729 -5832 4255 9904 4698 -6485 -10160
4772 -10160 -9707 -17062 -21506 -18221 -5040 2889 18738 22644 10941 2189 -4190 -6416 -8998 -13304
4758 -13304 -4687 -11432 -8470 -1166 8050 7309 -4000 7155 5347 -918 -746 -4840 -13544 -10587 -10807
4743 -10807 -15395 -14299 -10752 -14756 -17032 -26841 -27102 -22383 -17086 934 6663 7731 -9811 -17719
4729 -17719 1140 2305 -7766 7895 14706 8134 -5985 -5334 430 4271 7446 5236 11180 7632
4715 7632 5489 12902 9651 -8149 -14509 -7036 -6090 -5611 38 3952 -588 -7774 -11443 -18498 -20940
4700 -20940 -30632 -15995 -8120 -6392 -16143 -4400 7928 49 -9375 -7117 -973 -84 14301 10986
4686 10986 -9122 -5875 6493 7518 13831 17409 22567 11692 5844 16742 18871 17607 20466 19755
4672 19755 18020 19525 8126 -12002 -17201 -14022 -8777 -7920 3180 6280 -573 1670 -3033 -11884
4658 -11884 -13008 -5015 -8331 -15536 -21555 -24628 -19865 -11655 -6945 2664 732 -1623 -3038 -4184 3825
4643 3825 19230 24998 13017 -594 -10353 -12800 -11595 -11205 -5021 4486 14912 13798 5149 -1839
4629 -1839 -9803 -15686 -11638 10668 18027 -1744 -457 -1075 1224 578 -1537 10620 15389 11928 -7302
4614 -7302 -8364 1870 6434 6396 5755 14744 7424 -13205 -16679 4274 4501 1196 -3090 -8563 -12802
4599 -12802 -15280 -14718 -2452 -6571 -45 10705 9954 14113 9081 7737 -1463 -3547 7027 11007
4585 11007 11764 908 -12617 -10675 -3660 577 -3213 -19310 -18420 -6878 3529 -6738 -10057 -20871
4571 -20871 -15123 -12950 -12013 1592 10079 11815 13866 19217 11184 4139 1593 9269 7609 3574 -3918
4556 -3918 -11599 -553 5111 9356 14480 21254 20304 14382 -762 1093 1079 7206 8057 4668 10479
4541 10479 -3294 -17906 -23005 -20937 -16190 -1282 3091 -4302 -4769 -3352 4247 -10310 -19012 -17273
4527 -17273 -15041 -12402 -20487 -13809 -1377 11121 6199 16332 -3119 -21250 -19654 -10317 -757
4514 -757 1311 4293 8366 1722 -2905 -1784 -1734 -7520 -8575 -13072 -10180 -14727 -15800 -12755 -604
4499 -604 -6621 6516 11298 17050 19421 14879 4101 -3808 -1179 3165 4608 4583 2517 6002 -5564
4484 -5564 -11393 4516 13279 33207 31225 21392 14242 12265 2263 -3603 -8393 -12554 -19023 -24934
4470 -24934 -29495 -33467 -29268 -21475 -7488 -6118 1612 7921 28992 30560 24116 18554 13318 -155
4456 -155 1939 14183 -667 -1623 8721 11272 16352 15145 9460 13426 18651 26773 22470 13163 2002
4441 2002 -10347 6658 9202 -594 9895 8615 2457 -2483 -6618 -13158 -17254 -10037 1354 -1774
4427 -1774 -3087 -1089 -10794 -15260 -21100 -6008 12083 -392 -12436 -14864 -10435 -117 3908 14398
4413 14398 12269 14932 10548 4375 -15531 -9538 2696 -2159 -10620 -12864 -17263 -12776 -5166 7336
4399 7336 10781 6733 10866 7943 6693 8363 13488 14803 20982 19519 9578 22200 28635 25904 3098
4384 3098 -18439 -21813 -8601 10468 22134 27833 15075 106 -3254 -14949 -12646 -20222 -25293
4371 -25293 -27759 -5036 6867 7998 16272 12660 10409 8434 8058 7032 18201 17306 -29 1597
4357 1597 13099 11145 5273 7399 1257 -8721 -7420 -2993 -8406 -9398 800 10606 14446 7223 8556
4342 8556 7796 4052 2146 -9484 -18934 -5580 3791 14989 11301 2173 4253 -5225 -10769 -7467
4328 -7467 -6397 -15301 -8875 -14294 -9345 2528 7428 8270 8487 14054 14798 -4387 -16573 -7036 4775
4313 4775 543 -279 -13775 -10200 -498 -7800 -22595 -22406 1763 21622 16114 10141 5917 -2693
4299 -2693 -8824 -3734 -6774 -13547 -19098 -13906 7391 12699 4161 4878 -12966 -10030 -2032 -6809 -11132
4284 -11132 -12112 -16784 1902 15551 19477 18290 15626 17119 24757 19167 14033 12463 9923 12425
4270 12425 9081 4148 14864 19959 7888 107 2813 10306 16054 18944 14200 19706 9191 -8835
4256 -8835 -12195 -21822 -27569 -16874 -14633 -21132 -29712 -20045 198 5223 2703 -5723 -13005 -14004 -14157
4241 -14157 -12755 -12542 -18142 -15585 3093 5485 3482 -4672 -14781 -26199 -26842 -26280 -36954 -19937
4227 -19937 -10385 -7658 -5630 -3653 -3705 1819 3723 -2664 6006 17919 28754 30377 26103 21548 25137
4212 25137 12422 -1445 -10551 -16745 -21434 -12474 -6277 -3167 -7823 -11229 5776 6180 6736 8091
4198 8091 1195 -8398 -3670 1518 -2767 -8359 -10777 712 13164 11841 -12481 -11924 10377 15543
4184 15543 13021 2458 -4087 1939 7091 2126 -4022 5066 4936 11557 4102 2620 9332 12054 2586
4169 2586 -8617 -12838 -11996 -1326 4467 -1867 -6313 2146 -5180 -3153 -4004 -6802 -11205 -2524 7021
4154 7021 1948 2282 18344 24634 5234 -7391 -11624 -15716 -9384 -15280 -8387 4890 19528 6061
4140 6061 -8412 -2108 -14129 -13801 -3329 15198 7876 -1828 -5107 -16300 -14531 -4861 12920 29761
4126 29761 28456 29291 33382 29871 27797 20163 8276 11509 13501 13213 3024 4646 8767 3229 1529
4111 1529 -7559 -5972 3859 -7622 -16226 -9667 -13536 -23282 -21754 -24709 -37276 -34294 -32597 -24301
4097 -24301 -24831 -25168 -26026 -28182 -17537 -1988 3611 6492 4028 -10466 -20854 -16908 -1111 -8761
4083 -8761 2476 13394 7723 10289 21021 28589 13522 -302 8261 1651 -12691 -19651 -18101
4070 -18101 -22317 -23702 -22150 -26981 -16562 -2789 10502 18433 18794 15617 7183 -246 -180 2570 -13961
4055 -13961 -19671 -9262 -2118 6296 8957 2711 -17206 -25794 -15757 -2100 -3947 332 3318 -7848
4041 -7848 -8404 2034 5 -7751 -10160 -6007 3819 14777 20466 11954 397 4764 16980 13207
4027 13207 179 8057 13186 8205 -2461 -1918 2045 9711 26939 14168 1529 -12231 -7684
4014 -7684 -10717 -250 7420 5106 3710 20806 16781 4927 1997 -2691 -10319 -5719 -6960 -6387
4000 -6387 -11890 -8243 -1977 -1360 4390 -3147 -2513 4338 -6680 -15068 -19862 -23254 -27274 -11473 6511
3985 6511 3634 637 -104 11882 4287 7055 3778 6949 4578 12387 2107 -12082 -19281 -13497
3971 -13497 -4163 -6420 -15014 -27021 -28668 -17829 -8924 -264 -6114 -11587 -18437 -11123 -13879 -14774
3957 -14774 944 2409 7827 -1875 -4504 -8493 -3393 3320 18609 23 -13810 -20219 -21513 -15256
3943 -15256 -10468 1700 -3592 -6401 -6534 -5530 -10592 -11348 -20585 -16787 -3166 1501 -3699 -7708 -18771
3928 -18771 -34315 -41651 -22272 -5960 -11462 -8085 -5738 -3283 5140 6797 -6546 -8087 8282
3915 8282 -1777 1243 2123 5513 9293 19792 33295 17696 -7448 -18664 -16488 -14251 -17469 -21459
3901 -21459 -33933 -21112 -10569 -13416 -17089 -12322 1071 9729 9579 -12036 -9939 -1108 -8460 -15875
3887 -15875 -17108 -20572 -18362 -16098 1438 6015 1312 -2552 10184 12501 68 -3036 -7522 -8140
3873 -8140 -13924 -19414 -10478 344 -2030 -7919 -11470 -705 9599 14116 22228 14338 23180 25759
3859 25759 21182 21751 16614 19812 14274 7647 174 3817 2348 -3017 -7493 -43 12910 20028 1602
3844 1602 -17406 -19835 -30414 -31216 -20665 -14385 -3654 14519 14959 701 -2982 -12273 -11221 -6406
3830 -6406 6393 16235 18887 19076 31631 21451 9440 6399 12580 24978 41617 17913 6566
3817 6566 3288 1549 2684 -920 10284 10693 3001 -20689 -22192 -2256 7959 4355 1352 5935
3803 5935 1372 5979 7428 4333 -2763 2536 16615 9157 11779 16445 15874 19643 12722 5940 -4844
3788 -4844 -5805 5572 14020 9917 -10061 -14233 -13339 -2411 -6544 -12900 -9186 -2809 -4977 -2579 2339
3773 2339 1156 -7331 3313 4338 9467 -6905 -3903 8296 15823 12807 8269 -6834 7761 10043
3759 10043 2304 3913 19959 33151 32458 30874 15261 8699 4937 27026 28805 19092 17901 10362
3745 10362 10271 -1735 -9025 455 -5917 -13409 -2432 12222 15041 25195 16196 16833 14270 24221
3731 24221 25828 24047 12066 2365 -11092 -15619 -10643 -10078 -16445 -7291 4110 5386 1204 10905
3717 10905 5904 -5062 -9435 -7537 5691 13619 15620 5459 -8050 267 -7466 -4831 5373
3704 5373 17314 19619 9598 5017 -3612 5425 423 1310 3097 9727 8339 6070 -7 -8434 -3179
3689 -3179 3418 -827 3745 15239 10786 7505 1258 -3765 1507 -414 -51 -10676 -5545 1158 -204
3674 -204 11507 16960 29502 22981 17925 14759 11875 1825 5440 11609 19247 27200 19983 17541
3660 17541 3742 -2033 -15245 -11177 2563 13319 702 -925 1186 2645 2450 8672 13818 10778
3646 10778 7193 2206 -6611 -10872 -4442 6831 8171 566 -4231 -6102 3229 12848 5573 5397 17572
3631 17572 10561 -9874 -17535 -12499 -11342 -14101 -6111 -385 -12782 -6603 319 -13733 -20355 -13850
3617 -13850 -13091 -4583 -7892 -12441 -4724 5890 11150 4090 4536 1882 13806 21549 4233 3636 3964
3602 3964 5121 7597 6837 -4245 -4102 -16051 -17084 -13848 -11630 -6165 2214 6088 1754 2544 12652
3587 12652 238 -4866 -1175 -9939 -6674 -11775 -18153 -23180 -15215 1781 3782 6386 3660 2644
3573 2644 -7684 -12227 -8075 866 4558 523 -6423 2519 4185 20930 25154 7204 -1112 -9323
3559 -9323 -3230 -7125 -2850 6577 11706 9094 15858 6196 -10682 1237 -5566 -12469 9026 24914
3545 24914 7351 -11366 -13957 -43 11049 15608 26388 26520 1341 2083 1296 -3005 -6169 -6983
3531 -6983 -9684 -6397 -11151 -20429 -30922 -30135 -7513 -1457 -13231 -22243 -21064 -10205 -5165 7057
3517 7057 22403 26487 24060 14583 21801 26609 33449 35317 31304 28477 13616 12892 16442 15601 15547
3502 15547 12472 10191 3277 1109 -862 4819 11416 6252 -2657 -9406 12115 16467 835 -8626
3488 -8626 1101 6345 -5869 -3218 1000 1975 842 -3164 4824 9852 -2091 -10747 3314 6574
3474 6574 1374 -9168 -18468 -10078 1258 11814 13429 12848 -1332 -10709 -8955 6496 7168 13086
3460 13086 15557 -1913 -17976 -9097 3579 15327 28090 37980 25926 14404 -1538 -4179 1226
3447 1226 -1988 -10819 -10983 -4973 -1348 -9249 -14431 -8141 -12554 -9205 8991 24335 19847 17985 9774
3432 9774 5503 5861 -4411 -7280 2416 3624 5000 -7226 -7358 19165 18435 21010 32412 15850
3418 15850 -1752 7886 -44 -5827 3711 13461 12597 -8173 -10344 2009 10227 597 294 24122
3404 24122 27727 29967 27161 13404 11732 -1618 -13693 -16324 -8477 -6883 -9374 -7860 -3959 -8289
3390 -8289 -18148 -9288 -8676 -14845 -12266 4298 7280 2038 -12354 -29117 -14920 -12473 -7344 15542
3376 15542 24721 34594 37165 18415 9704 20255 10510 -6331 -15665 -15056 38 16581 21044 24056
3362 24056 27195 29403 11119 11694 12121 12855 381 -11698 -6025 -9971 -1479 -6021 -8444 5494
3348 5494 4978 2225 3324 -9694 -6048 670 -5588 -15532 -22220 -15175 -11086 13882 18074 7616
3334 7616 16966 19232 4668 4161 3152 -3719 -11976 -11695 -3146 5873 -3152 -9762 -5149 -7020 -2678
3319 -2678 -6013 -24069 -27780 -20398 2817 5189 -9809 -8604 -274 4165 -1755 -2551 -658 -14888
3305 -14888 -10191 -5992 -6616 -633 -12690 -5382 549 -442 -9295 -16883 -19655 -15149 -6127 -5182 -3213
3290 -3213 -14994 -20509 -27713 -20933 -1489 -1031 -2943 -10929 -9888 -7760 -17733 -8433 1154 4228 9404
3275 9404 10283 11833 10309 5167 -8648 -14157 -6359 -1099 9342 -2508 -12637 4200 25570 17959
3261 17959 2803 -6077 3189 3575 -1390 -965 -6283 -347 530 -4796 8836 11871 9588 5155 10429
3246 10429 8731 3092 -4889 -5644 -7808 -22455 -10369 -6999 -8910 -21756 -19180 -890 3861 2655
3232 2655 8437 13871 26733 24151 10367 14833 -3209 -9122 -15567 -21741 -26826 -29051 -8748 13462
3218 13462 13277 8058 17885 28030 14055 -623 -10446 -18402 -25805 -19555 -10322 -2735 -2725 -19143
3204 -19143 -18961 -17641 -1900 -616 -5058 6382 8969 6006 17944 19093 12070 613 -14868 -16427
3190 -16427 -2909 8028 10290 -1142 -6337 177 -5676 -9570 776 9985 13656 16669 12656 11320
3176 11320 12498 1295 1169 7580 -3317 -17833 -16841 -2524 -14151 -22350 -13554 -4727 -6127 -12097
3162 -12097 -8773 -2705 2521 -18069 -11606 -476 1178 -5071 -8098 -7619 -7768 -8772 -10755 -4839 -4241
3147 -4241 -11971 -17902 -11941 896 8449 4729 -9987 -17828 -18656 -10548 -5264 -829 -15606 -18872
3133 -18872 -16812 -17619 -22667 -13514 -12056 -6025 -3465 -12657 -15119 -6551 -8075 -3611 1843 -1230 2312
3118 2312 15049 19774 9114 14287 21250 4301 -4877 11045 1002 5429 4198 -5257 10546
3105 10546 17821 16628 19193 24631 30444 23638 18672 11128 -2121 183 -475 -10527 -3047 10103
3091 10103 6584 11324 57 -5630 -6177 -3129 1795 -2572 -6282 -2989 10855 13777 2164 1492
3077 1492 8979 15305 17450 6889 3642 5273 6240 9363 5102 3587 8473 18295 15055 16480 15493
3062 15493 9069 21340 24951 25388 16190 8045 10683 1159 -10230 -12305 -12919 -12483 -9799 1753 319
3047 319 1438 6087 7038 8088 17356 8240 -3528 -8593 392 4904 7988 1063 5927 12128 10265
3032 10265 4638 -4603 1685 13062 13001 6098 -13196 -8706 -20541 -30644 -28752 -16273 -6666 -9133
3018 -9133 -1280 2715 5186 12618 21103 18488 6137 3559 4112 -7837 -6199 -480 -776 -7536 1129
3003 1129 -2398 -7370 -6962 -4440 -89 -4891 -3800 6051 9289 13379 7574 3865 36 -10549 -19036
2988 -19036 -19698 -11816 11242 4762 -4669 -6992 -13401 -23422 -11420 -6044 2378 12657 2503 -3186
2974 -3186 1027 -5954 -9799 -10040 -20222 -11212 3879 7684 -4427 -3809 -8997 -21520 -13980 1763
2960 1763 -268 -13095 -7500 -3813 -10032 -12553 2832 9366 592 -1571 7926 6301 -427 -9626
2946 -9626 -15166 -8837 -7878 -15107 -21360 -19280 565 7879 1945 -4153 -2215 -7670 -10375 -8278 -1987
2931 -1987 -1155 -16321 -17799 -17185 -11805 -7743 2130 -8190 -6348 -4035 -12752 4494 18350 4406
2917 4406 10725 19315 26026 30954 23072 17618 30469 17414 107 3 -1126 1190 -2974 2707
2903 2707 17263 8969 12212 11929 19856 17912 7554 4361 5923 8312 7294 3396 8272 11846 -11383
2888 -11383 -12961 3128 14571 11380 22806 24307 16367 5386 -10918 -6770 10974 21875 6193
2875 6193 7295 -8158 -19877 -15864 -27380 -29477 -20072 -14415 -20687 -24018 -9081 -1268 -4509 -6600
2861 -6600 2004 3022 -12961 -14535 -14067 -7109 -2601 6944 19352 19528 15068 4946 8869 9307 9517
2846 9517 3830 1753 -9480 -29996 -46319 -35128 -18477 -2399 -5706 -5864 -12121 -19936 -22661 -14526
2832 -14526 -4075 -5288 298 -3690 -3014 14258 9070 -451 -2137 806 2682 -7322 -8670 -5065
2818 -5065 3443 8392 7828 11616 8410 7004 14253 16462 14566 26152 23021 5370 -17013 -22013
2804 -22013 -22229 -13616 -14007 -10616 10290 15593 5065 -7769 -12539 -20691 -11207 -5805 -8473 -9862
2790 -9862 5935 -82 -6873 932 4179 13914 27175 21344 15402 9003 -6421 -21357 -22597 -1376
2776 -1376 22064 26767 13177 3960 1768 18003 25820 15857 2705 5529 8100 9505 2299 596
2762 596 -423 -175 9160 -2603 5176 7716 15234 18982 -1271 -17127 -19032 2073 9893 21941
2748 21941 16926 4541 4963 -1850 10922 13562 396 4626 7700 3754 -2755 -15347 -21783 -15734
2734 -15734 -11059 610 13084 11410 6843 16427 29249 34379 37751 42099 34914 36403 29557 29459
2720 29459 28698 20525 22824 21957 13660 9337 2508 2244 7433 9068 -2768 -4437 5569 4890 -6743
2705 -6743 -7646 11080 23874 20750 12087 1672 6698 14072 4718 -4166 -9363 -9503 -19614 -10423
2691 -10423 -10823 -12169 495 -9713 -29805 -24262 -13346 -18922 -18765 -23769 -30279 -32820 -3599 18642
2677 18642 6817 -21377 -12533 -6012 -8979 -6623 -11697 -6502 -4727 -15524 -16972 -16255 -12300 -4984
2663 -4984 -3310 3489 62 5338 18534 16489 2909 -556 13269 -6154 -14375 -9993 -11970 -8586
2649 -8586 -5652 2025 3652 2764 11562 17507 24805 14623 3330 5269 3015 1916 4697 2849 799
2634 799 5790 13426 19019 22466 18715 4275 -815 1873 14878 19255 23154 12835 8125 17282
2620 17282 13845 5472 -16034 -16780 -5924 -10576 -9068 -3042 3633 9717 555 -9515 -6551 12138
2606 12138 26748 17470 5710 -1214 -16775 -2991 -653 -12809 -10552 273 -4871 -16195 -12984
2593 -12984 -15705 -23973 -17883 -18205 -12651 -17278 -13795 -269 5216 8410 1549 -10006 -8640 255
2579 255 11604 11316 -6111 -15366 -9264 -2650 3298 -109 -1324 805 -2202 -1384 3491 -5193 -9777
2564 -9777 -12142 -20819 -16873 1923 17 -7607 -3565 -3841 -7259 -16970 -16297 -2965 12001 15848 18541
2549 18541 6177 4575 12016 11627 1297 3645 14765 25970 34109 34761 22271 14694 13069 23886
2535 23886 6746 1142 11041 -2151 -4765 -5563 -10126 -25391 -24191 -25771 -23491 -13890 -11783 -2662
2521 -2662 2503 10314 27760 19392 7963 -10227 -21545 -10961 1532 11409 18156 26455 24058
2508 24058 21091 19919 23965 27855 24824 31325 22580 14315 12200 -10352 -9829 2693 5892 5964 7571
2493 7571 25573 24069 13962 11813 6699 -8772 -27375 -22896 -14272 -10433 -16882 -15701 1794 20655
2479 20655 16281 377 -5707 -2262 -9035 -6259 -5082 16210 31327 30100 23646 33581 40221 25368
2465 25368 17432 18034 2319 -7646 -8750 8413 25031 21370 27965 23301 6854 -5940 -7654 -8330
2451 -8330 -19904 -10128 -6535 -3807 -4331 -19111 -17751 -13569 -16441 -24711 -10210 4302 5148 -10399
2437 -10399 -23680 -17709 -13935 2017 2691 -10338 -11925 -1366 6666 2133 -12540 -10112 -9800 -6228
2423 -6228 -6848 -9062 -14098 -373 5296 -2880 3272 -788 -9145 -10541 4328 18849 24607 21075
2409 21075 12389 5417 -2627 -4365 4876 9084 7214 2578 5139 10294 2571 5278 10974 10013 -2021
2394 -2021 -5499 -5910 -7374 849 -2878 -4267 -11222 -2817 8274 26009 11366 3528 -400 2448
2380 2448 -11003 -10931 -254 -3264 2891 11515 22058 32545 27095 17955 7822 -8001 -15468 -3744
2366 -3744 294 -2553 -13398 -24502 -13346 -13860 -27516 -47206 -49654 -50410 -36998 -3806 5002 -4506
2352 -4506 -4259 4920 9510 19400 22526 6178 2 -9960 -11080 -17933 -17093 -5978 -6343 -11949 -19501
2337 -19501 1242 25259 11833 -4746 -4975 6676 11621 11539 8789 9178 1505 -8022 -7052 -14760 -18080
2322 -18080 -8362 2614 6381 7012 6314 8108 4944 9304 15015 14513 22877 14335 -5943 -13068 -1088
2307 -1088 4362 3018 -10145 -3495 1293 -2904 -14263 -12526 239 7021 6622 304 14368 24610
2293 24610 16372 16487 11106 13588 19845 18143 15598 3731 -6152 -5955 4417 9452 21352 20938 3964
2278 3964 509 22092 18116 4259 -483 -12091 -7828 -1095 328 1722 8120 12431 11941 6824
2264 6824 2209 8420 6401 13165 16899 17192 18353 9075 9191 12231 -1817 -18287 -33325 -19771
2250 -19771 2403 11363 10573 17277 18101 9259 9135 8767 3312 -13148 -16798 -9693 -27803 -32013 -15052
2235 -15052 -4728 2930 5111 -4970 8814 954 -2858 2786 40 -11825 -5595 11877 3102
2222 3102 -4543 -17579 -29872 -25924 -15372 -9545 -8463 -11283 -14921 -10628 -2567 2290 9336 7035
2208 7035 -1627 2209 6629 589 -15762 -15555 1557 1204 796 -7271 -4287 6197 2024 3652 1822
2193 1822 2332 5239 5434 -2341 -13439 -17109 -10804 -10748 -13385 -13814 -4726 -5626 5951 3983 -1491 15556
2177 15556 11613 12661 12232 9768 8578 4779 2567 -4980 -10493 -12579 -2728 -13131 -23639 -27955
2163 -27955 -22083 -21375 -15045 -3798 9880 -3175 -13211 -6145 -5376 -10457 -10390 598 3699 -4865
2149 -4865 -10658 -26082 -31719 -17566 421 8230 1583 -14607 -18922 -24747 -16995 -12243 -12163 -56
2135 -56 11121 16390 865 -5171 -2464 -13585 -13618 553 -5965 -18761 -22762 -17231 -16151 -17800 -5555
2120 -5555 9458 -6235 -12830 -9277 -12974 -9301 19226 19602 13015 4235 -11728 -29178 -30122 -11944
2106 -11944 3820 7906 4841 7292 4489 -322 -1618 8583 12571 2629 -2075 -7467 -7035 -8904
2092 -8904 5560 17712 17955 15881 13752 19804 18649 21391 20011 20128 10640 1179 8374 5587 11786
2077 11786 26382 30571 19726 18100 17200 22532 12576 1867 -9328 -3852 -5012 -9369 -1371 5079
2063 5079 -1283 3025 9305 12802 5331 7267 7427 3574 5299 12624 7511 17771 21911 33828 39225
2048 39225 33521 30586 22614 12000 4388 -2215 -13950 -12455 -7119 -23273 -35139 -33062 -27532 -24207
2034 -24207 -20111 -16068 -10097 -9327 -3756 -19136 -27802 -16389 -22884 -18509 -8437 5470 10918 -5988
2020 -5988 -12480 -22904 -17080 -11489 -2364 -10299 -14815 -8858 -10774 -25805 -31878 -27361 -16203 -18721
2006 -18721 -8152 -2099 375 -1970 -2687 2190 2395 -5090 -10544 -4108 7436 18439 6801 -10640
1992 -10640 -5153 2078 4360 8979 6351 3645 2383 16817 17932 9464 3205 1351 -5861 -9655
1978 -9655 -12659 -12979 -22098 -24574 -11971 3734 -152 7587 2751 -562 9009 7943 -28 -2379 -3063
1963 -3063 1800 123 3041 8215 9419 -1881 4082 217 -11010 -14081 -17309 -28040 -32128 -19325
1949 -19325 2625 2558 202 -4398 -11022 -21526 -25356 -24257 -22590 -14171 -5833 -370 4947 16477
1935 16477 31426 28659 21938 11311 7959 12412 22366 22213 20628 3363 -4217 -11033 -10459 -1254
1921 -1254 -18670 -30487 -23851 -18819 -7303 20725 21888 7261 2559 -14678 -23981 -20338 -6584
1908 -6584 103 11719 24272 19015 11965 26625 27525 22059 -149 -8479 -3850 -14398 -15589 -15028
1894 -15028 -17381 -10419 -1450 -3516 -9329 -949 9973 11812 10328 4041 18709 11387 -12257 -10543
1880 -10543 -18277 -7100 2430 10034 6796 -6854 -15954 -1812 10068 9691 3906 8463 9866 2860
1866 2860 8029 23109 25099 26699 23862 11302 8163 -290 931 -2929 1306 8295 14709 6789
1852 6789 -10032 -19655 -17624 -22274 -24252 -27621 -25565 709 6067 -1550 7096 15919 14341 2697
1838 2697 -13536 -20439 -14547 2491 10037 12326 6512 14390 24480 13890 16228 15888 25628 40921
1824 40921 31880 19519 15696 29218 10546 -13417 -10839 -8438 -8775 -13568 596 -2883 -17355
1811 -17355 -29820 -21884 -6429 -8601 -3481 4056 11218 1962 -8531 -18296 -9320 -2265 -4521 -13828
1797 -13828 -23298 -23741 -24803 -20073 -29491 -14565 -5252 -6479 -5989 -12799 -10697 3774 11126 15827 6949
1782 6949 -3090 -7502 -14754 -15101 -9649 -14538 -5978 6065 6667 2889 1793 6499 14995 11447 15433
1767 15433 18707 -801 18236 9493 5203 25366 28525 24333 21834 17297 17907 21181 5146 -7136
1753 -7136 -10900 -18678 -11474 5804 20725 24953 21984 16254 29031 27435 23540 2789 2498 4161
1739 4161 2250 3004 3303 4866 5774 3924 -177 -102 5095 15153 20524 18480 12413 10006 3373 4133
1723 4133 -4627 -15643 -7738 -18509 -24182 -16329 -14883 -9002 29 10389 3095 9187 9424 -13124
1709 -13124 -25364 -7538 7930 18613 19098 12096 13893 14853 17724 4634 7358 -5539 -8140 11862
1695 11862 8389 7115 7345 12985 15337 2599 -4991 -7891 -2992 11329 14865 10397 -295 -7708
1681 -7708 -18398 -21715 -15932 -9102 6324 14660 -1663 -7439 -6649 -10941 -12325 -15598 -488 20612
1667 20612 17704 -221 -17444 -25510 -23310 -4607 3785 5595 8216 -7722 -17446 -19941 -8473
1654 -8473 1149 22355 24486 18094 2909 -5973 1745 9003 8630 6016 14658 20678 10980 5401 10995
1639 10995 14600 18179 21867 18716 894 5178 643 854 -1003 -5105 -16318 -4995 1043 -6951
1625 -6951 -6361 -7014 -6529 -14282 -11647 -5115 12078 10040 -13719 -20381 -23192 -16522 -11579 -1780 2066
1610 2066 6745 23552 26025 19536 11530 19045 14480 4643 4303 1868 8462 -996 -7455 -4977 -9074
1595 -9074 -18367 -15660 -10686 -6348 -5064 -12049 -14549 -20160 -14083 -6561 -4226 -3501 -3288 -14420 -15810
1580 -15810 -13588 -11291 -11723 -18211 -11948 -3708 3863 13223 21422 27364 40316 42190 33631 27298 24025
1565 24025 31382 35421 38503 35537 14838 8 611 -1207 -1576 -1543 4782 16071 14081 11816 12444
1550 12444 8052 1522 5733 8931 3132 11203 13251 17983 15787 11458 20294 34892 25243 14609
1536 14609 14210 25296 14458 3969 -1287 4018 8900 7782 10775 -2077 -4026 5671 9593 14987
1522 14987 3377 -216 2984 7971 11589 11526 10039 15251 18355 15597 94 383 8871 11708 4782
1507 4782 -2830 -2502 19230 13152 3758 11273 -266 -3505 4291 6797 15635 8604 3422 -469 -8952
1492 -8952 -13976 -3481 14761 11799 7553 8131 4031 2735 9004 10272 21299 23823 10657 8932
1478 8932 5833 -3572 -1348 -8715 -19101 -15440 -18631 -25300 -24913 -24265 -15130 5489 -6978 79 9639
1463 9639 -7072 1167 -7061 -29544 -27332 -23137 -16301 -2861 -3594 -5592 -8175 -4382 -4996 -4394 -8689
1448 -8689 -12659 -7089 -12369 -633 -843 -1193 633 6905 15927 9528 2873 11384 798 -4455 15030
1433 15030 19969 13486 11208 -970 -14508 -5659 2882 -2942 -46 10266 12706 -2841 -10285 -4692
1419 -4692 -684 8231 5265 2236 -7371 -28477 -26642 -8615 -15127 -7210 127 142 3347 6117 9169
1404 9169 8539 6648 13910 6885 -5251 -1662 -6165 -5601 12179 12106 462 -1629 -4479 5569 23792
1389 23792 4741 -10724 -10740 -15200 1064 8061 6339 2138 -10144 -19428 -1901 5313 -1926 -8127
1375 -8127 -8907 -2974 970 376 6466 5443 18077 23834 18132 11765 -2498 -4645 6550 -2731 -3920
1360 -3920 -9967 -13223 -3125 4243 -33 329 13248 11056 3840 865 9445 8639 -5682 -6054 94
1345 94 2767 13562 12227 8716 1485 -11375 -14528 -10395 -11033 -2556 10315 8762 1837 8347 5008
1330 5008 776 8298 8997 3393 -3629 -5308 -7978 -1746 8795 11664 7701 -1064 -3303 -4728 -9760
1315 -9760 -10063 8119 10692 9862 15810 -718 -9298 -15086 -23951 -16650 -7156 -3753 95 10005 12171
1300 12171 11699 9415 8155 11000 1407 -5376 -3633 10132 -2287 -15494 -16192 -4391 1437 -9970
1286 -9970 -5926 -1048 8084 12408 9448 22080 13849 -2486 1702 18136 19704 4451 5050 21416
1272 21416 27348 18307 13916 18301 14044 4632 4274 777 5154 2919 8713 11126 -8641 -10251 -1322
1257 -1322 -3473 15761 18414 11630 4001 -3437 1026 11597 22222 12287 1954 6438 15229 10960
1243 10960 11195 10677 21745 31943 30628 12173 -1504 -10385 -11301 -17372 -8326 -11403 -4218 3150
1229 3150 2845 2248 7080 7257 -257 -18582 -19341 -14136 -12672 -23528 -18239 -22276 -21234 -13280 -6390
1214 -6390 4470 11009 18281 16208 13197 119 -17313 -13326 -2649 1416 -3167 -15469 -17389 -409
1200 -409 13064 22876 21836 42110 52428 45470 34124 26280 15252 5048 6217 3982 7052 6761
1186 6761 2856 9957 7278 -2647 840 13437 13406 -7645 -20042 -15772 -16743 -4496 3890 9083 8955
1171 8955 8687 17781 19265 25813 25994 21463 9504 -6533 -10471 -7649 -8346 11904 10597 10300 20379
1156 20379 22545 5567 1365 10889 14195 10826 2541 6277 -11698 -23393 -16884 -6638 4398
1143 4398 -2089 -5391 -1196 7162 3823 6519 1849 -10784 -24298 -24491 -10835 -2326 185 -7312
1129 -7312 -8663 -4781 3175 5947 485 -1004 9839 4787 -3034 2536 -255 -7552 -326 9 -17383
1114 -17383 -24688 -27691 -14204 -5828 -4750 11685 18367 24098 14737 2930 238 5374 -1084 -7398
1100 -7398 -14449 -26492 -25649 -21301 -18735 -4299 9646 15297 19473 15644 18411 11916 3237 3471 943
1085 943 -9191 -1946 2728 -11303 -920 9778 11082 6241 -2899 -14603 -12933 -18356 -16810 -6924
1071 -6924 9522 10234 8729 19584 38813 14659 -16032 -35721 -24982 -19939 -17499 -7107 13460
1058 13460 11535 12133 5557 -4121 -3764 -12336 -13614 -8395 569 9624 9327 9778 15013 25536 23691
1043 23691 25183 9958 -5648 4045 17298 10310 -3611 -6182 221 15891 21889 11326 2184
1030 2184 11153 -816 4208 9956 12468 8096 22873 37806 33136 16447 441 -4899 2064 -5505
1016 -5505 840 7172 11254 5657 -3303 -12063 -8129 -5869 591 -1004 -2967 5637 8253 1118 -4831
1001 -4831 5107 19860 29382 31931 33692 28185 15078 4718 511 2752 -1264 -14767 -14023 -9108
987 -9108 -730 8651 11294 29450 32822 25395 11376 12728 12524 15432 18992 7605 -1248 13440
973 13440 20607 21147 15048 14451 13439 19250 23296 15722 13053 4318 -10483 -13005 -7483 -7122 -5210
958 -5210 5888 18741 18444 17324 29253 22573 17183 7762 3800 11132 1126 -6965 -13396 -5932
944 -5932 -4688 2056 2912 14973 8823 -7085 -6754 -7249 91 2367 315 -3309 9366 7149 -503
929 -503 3920 -4465 -2192 -8518 -6585 412 3887 7994 12654 -2982 6897 16026 16365 25690 34542
914 34542 30042 11382 9124 6879 -5065 -12901 -7837 -3976 -6666 -14838 -17304 -12727 -2072 -11976
900 -11976 -17404 -11743 -14101 -27418 -21880 -19877 -15129 -7486 -7561 -4091 3386 -4816 -9825 -14065 6205
885 6205 27951 13638 -4731 -11144 -13892 -8833 6405 12467 3639 2204 353 -5823 -7349 10330
871 10330 11622 2624 -3401 -3468 -14771 -16232 -9069 4613 10297 5646 -5064 -16881 -22882 -24892
857 -24892 -28499 -16421 -1618 7000 7468 6885 -1002 -5833 -8315 -4516 959 2426 95 -11241 -12828
842 -12828 -11637 -4215 4796 12832 11720 10991 3448 -18776 -20532 -10400 -9460 -5497 6650 3391 589
827 589 -3121 -4366 -1557 -11580 -15914 -770 -1739 -9114 -15041 -8811 -4169 -1879 169 3344 9748
812 9748 4117 55 11395 -3645 -25336 -14186 -5079 3162 10275 6343 19031 20326 20231 7194
798 7194 -7801 -3845 -2196 -8406 -13639 5479 19063 33466 22381 8434 10654 5824 7291 6386
784 6386 3669 -4009 1243 -4019 -3592 -3130 841 -3903 -815 -6152 -2095 2311 1808 23828 16244 5491
768 5491 -1427 -6578 -20501 -10415 -2566 7580 12623 16257 27647 15459 10165 10185 2840 -3494
754 -3494 1490 1647 6497 4802 12588 4464 4288 5601 12400 11563 5205 7645 12076 1522 -1554 -826
738 -826 3356 9234 4732 -3504 8574 16174 23389 22429 8083 8738 16954 10845 7535 1061 -16164
723 -16164 -21988 -18790 -11683 -1667 1972 5674 8470 9571 11997 21861 22159 2361 -22934 -24184
709 -24184 3557 8005 14785 3469 -5451 -4513 -8089 -12690 -11094 -7311 -6937 -2411 95 -4965 -5997
694 -5997 -459 4743 -520 -7368 3256 10106 4465 10822 20298 20242 2702 2087 7235 7201 12792 25579
678 25579 26320 33754 29458 11896 983 5347 12015 9324 -3472 -8932 -2999 -1786 -1490 5106 4609
663 4609 -5875 -200 -122 -4714 -13601 -24849 -9679 3976 20817 22693 26648 13850 19658 16976
649 16976 1981 6130 8133 -3061 -9028 5885 9894 -4535 -694 -3843 -13410 -21457 -24281 -31375
635 -31375 -33904 -23452 -2171 15725 14834 4835 -6723 10017 9248 -3285 -15657 -11166 2149
622 2149 9099 1469 3370 -2443 1187 7598 936 1433 7142 -3516 -15545 -25535 -32134 -19642 4428
607 4428 4815 -11881 -10558 -6871 -5380 -3116 -2041 7673 43 -3619 7065 3363 4542 148 -1944
592 -1944 -5414 -2291 11839 26847 19429 8017 -932 11924 7864 558 1443 -5133 3888 3192 1599
577 1599 -312 11347 23310 11655 1230 2897 -6869 -6237 6059 6274 4448 -2534 -14410 -13911
563 -13911 -9599 -1272 8491 15040 8428 6881 5417 9674 9114 5263 -2180 3589 16344 16135 3973
548 3973 -774 -9192 8124 25400 10960 7312 19207 10348 12085 13108 13883 14009 430 -3014
534 -3014 -19461 -15348 2400 9505 7836 336 4238 -7163 2290 18245 17972 14105 15021 7130 135
519 135 22517 32593 30342 25078 18950 18041 11432 -3548 -6544 -2283 13805 13542 -3279 -7705 67
504 67 1507 -12347 -24581 -13478 2335 11925 5732 -501 -11100 -18434 -2816 5299 3174 -914
490 -914 -1261 9081 17227 14505 6284 3756 12569 19761 10046 4145 15622 15807 -888 -14967 -10258
475 -10258 -4740 -3072 4204 6064 19629 14033 1342 -12000 -6495 -8393 -6801 -15275 -5719 1420
461 1420 -3275 2923 6975 5621 -7546 -8368 4447 8075 5043 -6586 2919 4245 -76 11027
447 11027 12317 16948 17776 -2792 -23618 -18077 -4234 3510 7840 203 -6897 -11985 -17426 -19805
433 -19805 -19479 -18457 -28235 -31415 -28039 -25214 -14443 -7190 -7470 -9366 -7066 6966 10167 2227 808
418 808 -599 5837 13029 12661 17801 14029 -167 -1808 8520 2160 -3244 6711 4516 -2388 12221
403 12221 11558 -197 -1783 -3689 -2794 -1138 6397 11461 9587 6705 9074 -6698 -19027 -16478 -11567
388 -11567 -12734 -4089 5981 15020 25387 23381 20440 23500 27502 33834 33729 33674 26971 12241 3450
373 3450 910 6009 2848 -4191 3152 5860 1570 -11766 -7574 485 13440 20288 9921 -3919
359 -3919 -4188 -10982 -4519 9848 20874 13267 862 1381 5237 12246 14990 8005 2566 5033 10253
344 10253 19962 20433 14103 877 -8726 -4880 4803 1399 5279 -3954 -396 10334 20741 13060
330 13060 11271 3562 -4711 -7529 -8272 -2901 1736 -8162 -15564 -11012 -8916 -7643 -2322 5143 -395
315 -395 4110 5128 5025 16281 31767 39037 28196 20781 21970 7867 -1383 4297 10246 17685 10958
300 10958 -10800 -7366 -2341 5846 5942 -1110 -2071 -10534 -7245 2450 4771 -4744 590 1591 -8657
285 -8657 -20123 -22633 -13752 -10275 -12944 -6342 5518 12868 13862 7853 -8932 -11022 -2093 233 -10255
270 -10255 -7808 -12091 -12328 -582 1571 -5815 -6615 -7434 -501 -521 -8850 -15758 -12714 -12922 -8765 -17013
254 -17013 -20030 -20136 -15479 -4041 12081 8320 1162 -3260 -11451 -1009 7042 7105 7873 3537 1895
239 1895 1973 -3156 -1561 -1990 4503 8815 5780 22336 19944 7803 11047 8909 7703 17343 8443
224 8443 3924 4448 -6123 -8562 7255 9474 16650 12477 9248 10429 12264 11605 3987 6806 12102
209 12102 6269 2746 -1130 11019 8945 6129 5971 2590 2502 4246 14207 5867 6562 10239 7216 6274
193 6274 15528 18041 22180 13945 2342 10955 11442 3693 2553 665 2994 4861 -10836 -11482 -3868
178 -3868 -14724 -8848 -1329 1804 12204 13574 14385 8454 10882 13211 1310 -2783 -6883 -7403 -14953
163 -14953 -13536 -13340 -16583 -19750 -15813 -2077 -1932 -375 1834 1583 -3801 -3251 3068 6183 2234 -6143
147 -6143 2791 9163 4283 -4589 -5188 -6207 -9855 -3160 2300 860 -2712 3069 2929 815 6868 7979
131 7979 2133 2371 642 -786 -843 5663 813 -2201 -5878 -10739 -19110 -13106 -4208 -767 6185 6640
115 6640 3524 2656 -7668 2710 10889 -389 -3946 13528 17943 11686 9692 11233 15473 16816
101 16816 16515 8527 3345 5132 1947 1638 4665 1855 3218 6971 -143 -7225 -6956 -508 4083 -9994
85 -9994 -19772 -14892 -3560 1064 -2331 647 9676 6690 5383 1698 2104 2684 7751 8488 10321 15911
69 15911 13690 -108 -5957 243 13135 4574 2117 -627 -4203 -2768 210 1486 3745 4667 2320
54 2320 -3058 -11663 -4867 388 -915 10921 20485 22996 13078 5794 -5581 -16629 -14132 -7585 -6824
39 -6824 -8702 1478 7246 15718 14232 1202 -9254 -21705 -20602 169 9589 10082 3503 6414
25 6414 14637 6456 5299 -5460 -11181 -3100 -2136 -8941 -10702 -1667 7183 7981 5878 -311 -4357 -3624
9 -3624 5533 10966 11121 6803 -2192 -5193 695 10556 7361
0 7361
$$ Imaginary data points
##PAGE= N=2
##DATA TABLE= (X++(I..I)), XYDATA
32767 94843 90823 90005 94858 96628 104611 119090 131041 129168 117379 111013 111600 110629 117334 120106
32753 120106 114361 114220 115507 124400 128289 135271 136345 130485 130209 127239 128467 139825 142850 137951
32739 137951 128331 134843 135231 130168 127822 131206 135890 135049 139538 142933 139960 139369 139659 147443 153611
32724 153611 152462 148301 142737 146416 144984 147983 144123 136936 140005 154835 153867 138322 135802 146292
32710 146292 150897 158952 156709 167042 176092 173957 174430 172833 164246 162654 169893 182290 187317 190673
32696 190673 185124 174094 170889 180031 186818 180682 186207 187899 182490 179523 191181 198480 195209 201075
32682 201075 202942 188011 185942 189650 185604 178502 178741 191204 194378 200818 209475 207490 211743 214095
32668 214095 218158 224941 226243 225836 221373 227280 233460 238240 238220 229402 220818 220579 223275 230670 236975
32653 236975 238261 228442 220097 221481 222134 226140 221240 224161 235048 238647 239059 236489 234234 229749
32639 229749 235293 235162 241767 248688 245801 256899 267072 263994 260157 260430 263341 254960 241476 238166
32625 238166 242834 249174 259953 262120 264844 265477 271137 272560 274890 262030 257195 268876 268789 262958
32611 262958 252096 251586 255279 267572 269435 266917 269514 277600 276523 277920 267782 265128 265335 261976
32597 261976 258821 273782 292776 297405 291819 286003 292505 289211 276562 281415 291137 291123 299031 297636
32583 297636 290111 289347 291721 290527 290770 290994 295148 298274 295612 285289 273164 279415 291255 304349
32569 304349 302682 297380 299324 304753 302791 309377 313108 305559 305929 310109 304416 310515 310012 304789 307671
32554 307671 320405 332129 340019 339964 338043 329135 329419 335404 333841 332742 345111 347596 337341 330836
32540 330836 342007 355177 352925 344011 334370 333492 342752 347739 352550 341661 334575 341438 347890 341294
32526 341294 342903 334987 315190 305807 306688 316505 330912 347333 351641 337121 319040 326051 332372
32513 332372 341158 346297 348794 353914 348363 340211 337664 341540 347529 352050 348160 353150 368504 367825
32499 367825 361106 358856 363073 368295 366178 366199 364167 355297 354407 355620 362383 367663 362414 357998 357876
32484 357876 363860 372303 372645 374371 365022 359219 379721 382328 369174 367431 374299 365146 363927 384805
32470 384805 394934 390842 396518 396115 400139 398398 400897 397801 394804 393373 381455 382046 393682 392923
32456 392923 389720 398008 408073 403836 407127 403441 404861 409199 402443 398840 391029 393929 390757 393861
32442 393861 384678 391472 407165 420978 423050 420270 412298 412225 416485 417740 421135 418969 404571 414931
32428 414931 417471 415635 411646 401301 407784 405325 397638 414184 420750 415216 414307 411088 394642 390158
32414 390158 395158 403934 406545 410493 408529 399063 394496 396937 400921 412243 418233 410230 421512 423293
32400 423293 419365 409180 407468 419081 418275 423046 422128 420074 419882 409231 405333 393446 392474 402329
32386 402329 400681 391745 393575 397340 412802 421604 433942 432378 433197 429081 419900 421425 425329 412926
32372 412926 402538 414090 412090 418186 419653 433345 441962 430269 428037 431733 432363 420240 429141
32359 429141 432099 418473 423282 440496 436173 438577 425794 407897 402877 404739 397878 400722 400591
32346 400591 411357 424044 435249 435730 436957 446400 443656 444216 434290 428639 429035 436063 445591 438780
32332 438780 429342 441371 450013 458284 451799 434423 419210 424555 438919 435911 442715 436391 428948
32319 428948 425623 440582 444448 439030 441899 452146 451569 450653 443790 434848 437452 443780 439535 442471
32305 442471 452831 453600 442414 433057 425041 436911 455248 462555 453135 447966 449733 447027 439495
32292 439495 444111 450416 454175 454894 448801 454984 455479 445514 426956 413684 421571 433220 442612 441854
32278 441854 440141 445494 442002 439065 437849 444561 451093 447070 449178 457621 467906 458090 453184 458067
32264 458067 472775 469944 457426 453611 456805 448482 450272 451990 438482 441673 461171 453108 448792
32251 448792 439429 435956 442066 441234 431567 432983 438962 430891 421871 430180 447591 455774 448321 439046
32237 439046 434098 425933 448559 464714 452256 450585 452767 457540 463681 465302 470058 472409 474774
32224 474774 471162 467941 451063 446431 457284 456797 447403 440777 445270 461376 462302 446456 440962 437369
32210 437369 426641 427169 439900 454397 459704 452881 443691 443442 451381 449687 456792 457159 451728 450123
32196 450123 441491 441686 453935 448171 448998 463219 469179 466982 474146 472410 471911 476991 475576 475175 465673
32181 465673 459954 455070 464541 465031 441126 440964 458050 451148 455014 458698 463997 460655 454704 457351
32167 457351 450778 451912 466552 475365 479475 476257 463609 463165 464541 463822 461690 468798 474378 467297
32153 467297 463254 467201 459304 451080 449156 454397 461073 462197 460335 459533 465709 452333 452721 460180
32139 460180 462290 464182 460787 460266 469420 464857 453726 457281 480581 477448 470821 457076 464319 466813
32125 466813 482153 479731 477455 471483 479618 492305 492943 482274 472879 472602 466733 455014 461719 466996
32111 466996 456280 459035 478659 485054 478964 472518 480141 482521 472474 456609 462778 476528 473618
32098 473618 468840 469587 474953 474784 479721 487847 476046 462348 454122 466607 471305 463443 462604 475257
32084 475257 487697 469259 451263 444923 462097 470108 465940 455693 453493 468135 471151 479284 479405
32071 479405 467619 465272 473561 480467 482610 495210 485707 480156 475265 470613 462304 452691 463133
32058 463133 472612 469169 474029 478156 466942 466413 475503 484773 481405 472759 463992 468269 479166 477966
32044 477966 478516 468764 461522 471008 478946 477770 483799 476982 484414 481829 478358 475536 477876 485252
32030 485252 475594 474160 476485 469930 468884 475464 475205 459995 447504 449494 464254 467497 465432 469453
32016 469453 461274 463679 465125 460952 450844 450063 461728 479391 490270 493050 486947 473008 466765
32003 466765 478596 482506 478291 470324 472598 477868 482377 490611 485174 482330 483206 489911 489509 481334
31989 481334 480639 475521 473294 470572 469263 468232 462823 468092 468266 475093 477528 471769 480813 475078 467404
31974 467404 479136 490176 483133 483558 489485 488405 493465 486084 484521 488985 490565 496856 504398 496816
31960 496816 483266 485920 476297 489922 487286 473846 460998 460915 460206 461298 462225 457969 455851 451539
31946 451539 455795 470113 473264 479454 494516 489446 486735 481296 463851 459612 479386 480317 464285
31933 464285 460134 464316 474019 483623 474749 468345 466963 466885 461051 475161 477317 463608 462056 461926
31919 461926 461677 472052 482558 486693 473896 472177 476734 481884 487619 481671 478498 483586 479282 486712
31905 486712 492928 499578 482385 468214 468962 474540 472357 480278 482147 465500 459371 456442 458322 454119
31891 454119 470779 485703 494501 486840 471147 474599 470442 471534 487108 482555 478892 475177 480163
31878 480163 487838 489972 496429 499058 489939 481465 473167 462689 465614 479960 489522 482698 478032 463940
31864 463940 461691 473680 485044 483785 479636 476000 475530 472419 479760 482335 473721 471193 484101 486103
31850 486103 481710 486833 491908 479082 469102 455630 455651 463056 480586 478156 476059 464506 471572 466975
31836 466975 470200 485105 489443 483934 473776 474290 486851 491818 474538 464401 477615 488785 468919
31823 468919 453851 459407 460224 469056 472812 473567 465040 455922 455024 445327 451447 477019 489849 498967
$$ [...]
##END NTUPLES=NMR SPECTRUM
##END=
