##TITLE=Analysis number 325720
Compound Code tl 00534
Book Reference a
Project Code adrs
Chemist Name flurochem
##JCAMPDX= 6.0         $$ Bruker NMR JCAMP-DX V2.0
##DATA TYPE= NMR SPECTRUM
##DATA CLASS= NTUPLES
##ORIGIN= Bruker BioSpin GmbH
##OWNER= nmr
$$ XWIN-NMR		Version 3.5
$$ Thu Jan 11 09:06:13 2007 GMT Standard Time (UT+0h)  MAYBRIDGE\nmr@NMR_250MHZ
##.OBSERVE FREQUENCY= 250.131544655141
##.OBSERVE NUCLEUS= ^1H
##.ACQUISITION MODE= SIMULTANEOUS (DQD)
##.ACQUISITION SCHEME= undefined
##.AVERAGES= 16
##.DIGITISER RES= 18
##SPECTROMETER/DATA SYSTEM= dpx250
##.PULSE SEQUENCE= zg30
##.SOLVENT NAME= CDCl3
##.SHIFT REFERENCE= (INTERNAL, CDCl3, 0, 16.4509)
##AUDIT TRAIL= $$ (NUMBER, WHEN, WHO, WHERE, WHAT)
$$ ##TITLE= Audit trail, XWIN-NMR		Version 3.5
$$ ##JCAMPDX= 5.01
$$ ##ORIGIN= Bruker BioSpin GmbH
$$ ##OWNER= nmr
$$ C:\u/data/dgb/nmr/ADRS/840/pdata/1/auditp.txt
$$ ##AUDIT TRAIL=  $$ (NUMBER, WHEN, WHO, WHERE, WHAT)
(   1,<2007-01-11 09:05:48.22 +000>,<MAYBRIDGE\nmr>,<NMR_250MHZ>,
      <created by zg, POWCHK disabled, PULCHK disabled
       configuration hash MD5:
       49 4B E0 1D 92 C2 6B 37 9F E6 65 BC 52 41 86 1D
       data hash MD5: 64K
       19 CA 0F 7E 60 00 3E 50 30 EA 46 05 11 1B 7A C1>)
(   2,<2007-01-11 09:06:03.33 +000>,<MAYBRIDGE\nmr>,<NMR_250MHZ>,
      <Start of raw data processing
       ef LB = 0.3 FT_mod = 6 PKNL = 1 SI = 32K 
       data hash MD5: 32K
       E0 85 11 67 C2 E5 1D B7 0E F7 27 EF FD 5B DE F9>)
(   3,<2007-01-11 09:06:05.17 +000>,<MAYBRIDGE\nmr>,<NMR_250MHZ>,
      <apk 
       data hash MD5: 32K
       B8 1D D0 DF 4F E5 93 07 25 71 B5 7C 37 BA D7 66>)
(   4,<2007-01-11 09:06:06.17 +000>,<MAYBRIDGE\nmr>,<NMR_250MHZ>,
      <abs ABSG = 5 
       data hash MD5: 32K
       F4 1C A4 F4 91 2B AD 02 58 65 F0 E0 0F D6 44 0B>)
$$ ##END=
$$ 
$$ hash MD5
$$ 0F 7F D7 76 EB 87 CA F2 F5 B9 C5 3B E4 48 C1 D4
##$RELAX= 
##$RELAX= 
##$RELAX= 
##$RELAX= 
##$RELAX= 
##$RELAX= 
##$RELAX= 
$$ Bruker specific parameters
$$ --------------------------
##$DU= <C:\u>
##$EXPNO= 840
##$NAME= <ADRS>
##$PROCNO= 1
##$TYPE= <nmr>
##$USER= <dgb>
##$AMP= (0..31)
100 100 100 100 100 100 100 100 100 100 100 100 100 100 100 100 100 100 
100 100 100 100 100 100 100 100 100 100 100 100 100 100 
##$AQSEQ= 0
##$AQ_mod= 3
##$AUNM= <au_zg>
##$AUTOPOS= <44 >
##$BF1= 250.13
##$BF2= 250.13
##$BF3= 250.13
##$BF4= 250.13
##$BF5= 500.13
##$BF6= 500.13
##$BF7= 500.13
##$BF8= 500.13
##$BYTORDA= 1
##$CFDGTYP= 0
##$CFRGTYP= 5
##$CHEMSTR= <none>
##$CNST= (0..31)
1 1 145 1 1 1 1 1 1 1 1 1 1 1 1 1 1 1 1 1 1 1 1 1 1 1 1 1 1 1 1 1 
##$CPDPRG= <>
##$CPDPRG1= <>
##$CPDPRG2= <>
##$CPDPRG3= <>
##$CPDPRG4= <mlev>
##$CPDPRG5= <mlev>
##$CPDPRG6= <mlev>
##$CPDPRG7= <mlev>
##$CPDPRG8= <mlev>
##$CPDPRGB= <>
##$CPDPRGT= <>
##$D= (0..31)
0 1 0 0 0 0 0 0 0 0.06 0 0 0 0 0 0 0.0002 0 0 0 0 0 0 0 0 0 0 0 0 0 0 
0 
##$DATE= 1168506347
##$DBL= (0..7)
120 120 120 120 120 120 120 120 
##$DBP= (0..7)
150 150 150 150 150 150 150 150 
##$DBP07= 0
##$DBPNAM0= <>
##$DBPNAM1= <>
$$ [...]
##$SUBNAM7= <"">
##$SUBNAM8= <"">
##$SUBNAM9= <"">
##$SW= 20.6930455092707
##$SWIBOX= (0..15)
0 0 3 0 0 0 0 0 0 0 0 0 0 0 0 0 
##$SW_h= 5175.983436853
##$TD= 65536
##$TD0= 1
##$TE= 294.16
##$TE2= 300
##$TE3= 300
##$TEG= 300
##$TL= (0..7)
0 120 120 120 120 120 120 120 
##$TP= (0..7)
150 150 150 150 150 150 150 150 
##$TP07= 0
##$TPNAME0= <>
##$TPNAME1= <>
##$TPNAME2= <>
##$TPNAME3= <>
##$TPNAME4= <>
##$TPNAME5= <>
##$TPNAME6= <>
##$TPNAME7= <>
##$TPOAL= (0..7)
0.5 0.5 0.5 0.5 0.5 0.5 0.5 0.5 
##$TPOFFS= (0..7)
0 0 0 0 0 0 0 0 
##$TUNHIN= 0
##$TUNHOUT= 0
##$TUNXOUT= 0
##$USERA1= <user>
##$USERA2= <user>
##$USERA3= <user>
##$USERA4= <user>
##$USERA5= <user>
##$V9= 5
##$VALIST= <valist>
##$VCLIST= <CCCCCCCCCCCCCCC>
##$VD= 0
##$VDLIST= <DDDDDDDDDDDDDDD>
##$VPLIST= <PPPPPPPPPPPPPPP>
##$VTLIST= <TTTTTTTTTTTTTTT>
##$WBST= 1024
##$WBSW= 4
##$XGAIN= (0..3)
0 0 0 0 
##$XL= 0
##$YL= 0
##$YMAX_a= 403939
##$YMIN_a= -455254
##$ZGOPTNS= <>
##$ZL1= 120
##$ZL2= 120
##$ZL3= 120
##$ZL4= 120
##$ABSF1= 16.45094
##$ABSF2= -4.242233
##$ABSG= 5
##$ABSL= 3
##$ALPHA= 0
##$AQORDER= 0
##$ASSFAC= 0
##$ASSFACI= 0
##$ASSFACX= 0
##$ASSWID= 0
##$AUNMP= <proc_1d>
##$AZFE= 0.1
##$AZFW= 0.1
##$BCFW= 0
##$BC_mod= 0
##$BYTORDP= 0
##$COROFFS= 0
##$CY= 12.5
##$DATMOD= 1
##$DC= 0
##$DFILT= <>
##$DTYPP= 0
##$F1P= 14.0000005364418
##$F2P= -0.99999901652339
##$FCOR= 0.5
##$FTSIZE= 32768
##$FT_mod= 6
##$GAMMA= 0
##$GB= 0
##$INTBC= 1
##$INTSCL= 1
##$ISEN= 128
##$LB= 0.3
##$LEV0= 0
##$LPBIN= 0
##$MAXI= 10000
##$MC2= 0
##$MEAN= 0
##$ME_mod= 0
##$MI= 0
##$NCOEF= 0
##$NC_proc= -4
##$NLEV= 6
##$NOISF1= 0
##$NOISF2= 0
##$NSP= 0
##$NTH_PI= 0
##$NZP= 0
##$OFFSET= 16.45094
##$PC= 1
##$PHC0= 230.2604
##$PHC1= 2.550102
##$PH_mod= 1
##$PKNL= yes
##$PPARMOD= 0
##$PSCAL= 4
##$PSIGN= 0
##$REVERSE= no
##$SF= 250.130017774072
##$SI= 32768
##$SIGF1= 0
##$SIGF2= 0
##$SINO= 400
##$SIOLD= 32768
##$SREGLST= <1H.CDCl3>
##$SSB= 0
##$STSI= 32768
##$STSR= 0
##$SW_p= 5175.98343685301
##$SYMM= 0
##$S_DEV= 0
##$TDeff= 65536
##$TDoff= 0
##$TI= <Analysis number 999999
Compound Code 99
Book Reference 9
Project Code 9>
##$TILT= no
##$TM1= 0
##$TM2= 0
##$TOPLEV= 0
##$USERP1= <user>
##$USERP2= <user>
##$USERP3= <user>
##$USERP4= <user>
##$USERP5= <user>
##$WDW= 1
##$XDIM= 32768
##$YMAX_p= 348513269
##$YMIN_p= -271081
$$ End of Bruker specific parameters
$$ ---------------------------------
##NTUPLES= NMR SPECTRUM
##VAR_NAME=  FREQUENCY,     SPECTRUM/REAL,   SPECTRUM/IMAG
##SYMBOL=    X,             R,               I
##VAR_TYPE=  INDEPENDENT,   DEPENDENT,       DEPENDENT
##VAR_FORM=  AFFN,          ASDF,            ASDF
##VAR_DIM=   32768,         32768,           32768
##UNITS=     HZ,            ARBITRARY UNITS, ARBITRARY UNITS
##FACTOR=    0.157963299565203, 1,           1
##FIRST=     4114.87370911008, 0,            0
##LAST=      -1061.10972774293, 0,           0
##MIN=       -1061.10972774293, -271081,     0
##MAX=       4114.87370911008, 348513269,    0
$$ Real data points
##PAGE= N=1
##DATA TABLE= (X++(R..R)), XYDATA
$$ [...]
$$ plain form
24213 21648 71578 80294 -1716 -61336 -26497 -31284 -39218 -38152 -42561 -17154 -1043 -47157 -72342
24200 -72342 -108008 -108029 -71851 -45697 -35636 -26328 -46912 -105348 -86054 2995 -1238 3267 60020
24187 60020 92052 102807 32632 4051 -42692 -60651 -15356 13157 79154 103965 18390 -27088
24175 -27088 -14475 -50472 -55517 -63278 -93028 -50789 8390 -24372 -44885 10337 54673 61106
24163 61106 40467 15997 3855 29125 47811 35007 18362 22948 11477 -64509 -77961 -62366
24151 -62366 -27933 -50138 -53513 -25933 6898 59361 30598 -16068 -36581 -74238 -24773 24713
24139 24713 92011 69227 6215 -1684 -10688 -27104 -37962 -32768 -2784 -36344 -81621 -100695
24127 -100695 -115446 -53030 -41564 -22174 16366 -12198 -36128 -892 40811 42027 60297 41085
$$ packed form
24213B1648M9930Q716q2010n9620L4839m787p934J066m409K5407J6111m6114k5185
24200g2342l5666k1L6178K6154J0061R308k0584n8436J9294Q9049m233M505N6753
24187F0020L2032J0755p0175k8581m6743j7959M5295K8513O5997K4811q5575m5478
24175b7088J2613l5997n045p761k9750M2239N9179l2762k0513N5222M4336O433
24163F1106k0639k4470j2142K5270J8686j2804j6645M586j1471p5986j3452J5595
24151f2366L4433k2205l375K7580L2831N2463k8763m6666k0513l7657M9465M9486
24139B4713O7298k2784o3012p899r004j6416j0858N194K9984l3560m5277j9074
24127a00695j4751O2416J1466J9390L8540k8564k3930L5236M1703J216J8270j9212
$$ plain form
24115 41085 -31505 -62439 -25667 -44992 -78492 -52659 138 48328 11306 -58478 -3512 29199
24103 29199 39056 -127 -40615 -36262 32407 23367 -35758 -24850 11612 24217 14143 30847
24091 30847 46093 37694 54473 29095 -17775 8714 9585 -16484 -33011 340 80062 104443
24079 104443 82654 68099 125939 96211 52773 -9337 1483 56184 71036 11098 35269
24068 35269 70273 59038 56767 90236 67414 -20365 -52433 -6289 48503 8992 -19890 -13614
24056 -13614 -17697 -59564 -52577 -65158 -47146 -8084 14141 -4094 41950 24135 -65529 -94072
24044 -94072 -88031 -52112 -24797 -43319 -95472 -99034 -50653 -14217 4732 -29176 -94292 -96394
24032 -96394 -56177 -58639 -62303 -49558 -25793 38888 98982 97624 68817 17930 24892 575
$$ packed form
24115D1085p2590l0934L6772j9325l3500K5833N2797M8190l7022o9784N4966L2711
24103B9199R857l9183m0488M353O8669r040n9125J0908L6462J2605j0074J6704
24091C0847J5246q399J6779k5378m6870K6489Q71k6069j6527L3351P9722K4381
24079A04443k1789j4555N7840k9728m3438o2110J0820N4701J4852n9938K4171
24068C5269L5004j1235k271L3469k2822q7779l2068M6144N4792l9511k8882O276
24056a3614m083m1867O987j2581J8012L9062K2225j8235M6044j7815q9664k8543
24044i4072O041L5919K7315j8522n2153l562M8381L6436J8949l3908o5116k102
24032i6394M0217k462l664J2745K3765O4681O0094j358k8807n0887O962k4317
$$ plain form
24020 575 -960 -30915 -74015 -95677 -92904 -104387 -91950 -12562 35544 21798 6374 -31808
24008 -31808 -29463 -18874 36755 37706 58367 91780 1931 -22697 29733 21351 -38717 -73549
23996 -73549 -43607 -5798 -14291 38779 63735 -29580 -63126 -47380 -17452 -19079 6335 1339
23984 1339 -23840 -27697 -29666 -26466 -49222 -49940 40295 35206 74978 80487 19153 -43885 -64470
23971 -64470 -53545 29312 54909 57121 22255 41918 96129 66128 60909 89710 81810 63327
23959 63327 29287 -10661 -10723 30194 24504 4735 -28498 -19695 -34183 -10478 23432 20666 11256
23946 11256 -20201 -62182 -66689 -48174 -38364 29040 40859 -6661 -64555 -107577 -86646 -48599
23934 -48599 -12066 5969 -29474 -87112 -84954 -18540 57204 35341 -857 39794 -15538 -28170
$$ packed form
24020E75j535k9955m3100k1662K773j1483J2437P9388M8106j3746j5424l8182
24008c1808K345J0589N5629R51K0661L3413q9849k4628N2430q382o0068l4832
23996g3549K9942L7809q493N3070K4956r3315l3546J5746K9928j627K5414m996
23984A339k5179l857j969L200k2756p18R0235n089L9772N509o1334o3038k0585
23971f4470J0925Q2857K5597K212l4866J9663N4211l0001n219K8801p900j8483
23959F3327l4040l9948o2M0917n690j9769l3233Q803j4488K3705L3910k766r410
23946A1256l1457m1981m507J8515R810O7404J1819m7520n7894m3022K0931L8047
23934d8599L6533J8035l5443n7638K158O6414P5744k1863l6198M0651n5332j2632
$$ plain form
23922 -28170 7018 9194 14335 32145 77947 43291 46970 -11088 -38036 4695 68790 92858
23910 92858 37604 -22527 -49795 -59138 -8516 9384 10638 17074 37878 65351 68426 47405
23898 47405 26421 53734 17446 31892 66002 60413 13452 4266 5134 -11292 12501 -16379
23886 -16379 -8048 -68547 -93532 -64941 -88384 -15697 112452 111084 58605 25185 25601 10536
23874 10536 29887 88429 49898 -758 14622 -29547 -54090 -54182 10134 25267 -2756 -18284
23862 -18284 -10226 4840 688 14300 74539 8695 -50517 -39499 -76325 -63045 12140 85067
23850 85067 90674 45460 17530 15355 -6607 24230 59305 30274 -32086 14536 26034 51013
23838 51013 -20249 -4629 29635 88038 67293 -2724 2825 -14608 -9940 -44251 -26575 34822
$$ packed form
23922b8170L5188K176N141J7810M5802l4656L679n8058k6948M2731O4095K4068
23910I2858n5254o0131k7268r343N0622J7900J254O436K0804K7473L075k1021
23898D7405k0984K7313l6288J4446L4110n589m6961r186Q68j6426K3793k8880
23886a6379Q331o0499k4985K8591k3443P2687J28149j368n2479l3420M16j5065
23874A0536J9351N8542l8531n0656J5380m4169k4543r2O4316J5133k8023j5528
23862a8284Q058J5066m152J3612O0239o5844n9212J1018l6826J3280P5185P2927
23850H5067N607m5214k7930k175k1962L0837L5075k9031o2360M6622J1498K4979
23838E1013p1262J5620L4264N8403k0745p0017N549j7433M668l4311J7676O1397
$$ plain form
23826 34822 -12047 -40958 -20790 -4873 -24219 27322 82836 126293 62294 11528 42057 -11768
23814 -11768 -41665 -14600 34449 110070 140549 88817 61649 49699 20485 -8620 -40408 -48027
23802 -48027 -49792 53574 134099 105460 94251 70101 47067 91396 97487 68337 43329 22587
23790 22587 -3199 -4830 -9066 -11399 -19901 -6304 -12539 55386 68297 63036 53458 69830 50678
23777 50678 12047 22040 69908 87292 68215 -6401 6212 25969 48634 58180 37418 70607
23765 70607 61570 53106 1302 -28778 -15103 -35426 11903 31593 11396 2434 -24339 -34551
23753 -34551 -32925 -25048 -4910 -849 -34157 -7338 48171 50298 17686 -20428 -38479 -46991 -91535
23740 -91535 -110429 -94901 -39687 -3843 -42222 -32388 -17641 -4736 42430 66447 50251 15418
$$ packed form
23826C4822m6869k8911K0168J5917j9346N1541N5514M3457o3999n0766L0529n3825
23814a1768k9897K7065M9049P5621L0479n1732k7168j1950k9214k9105l1788p619
23802d8027j765J03366Q0525k8639j1209k4150k3034M4329O091k9150k5008k0742
23790B2587k5786j631m236k333q502J3597o235O7925J2911n261r578J6372j9152
23777E0678l8631R993M7868J7384j9077p4616J2613J9757K2665R546k0762L3189
23765G0607r037q464n1804l0080J3675k0323M7329J9690k0197q962k6773j0212
23753c4551J626P877K0138M061l3308K6819N5509K127l2612l8114j8051q512m4544
23740i1535j8894J5528N5214L5844l8379R834J4747J2905M7166K4017j6196l4833
$$ plain form
23728 15418 14290 10139 21616 21317 9089 44023 29728 -62330 -74826 -73419 -98780 -94702 -98409
23715 -98409 -96467 -60974 -46192 -57636 -21158 -17550 11105 51435 60043 89288 8387 -12073
23703 -12073 26997 76760 6558 -31391 -51556 -24102 27279 64631 61776 45258 25129 48020
23691 48020 102415 92547 41017 14625 61387 74864 39360 7877 -11843 -24203 -55987 -45634
23679 -45634 -34140 -27807 -26591 -54758 -51701 -64667 -91713 5261 42581 -10592 -75002 -109979
23667 -109979 -80559 8098 22346 -14540 -17754 -2016 -789 -18460 -16392 832 -27224 -17545
23655 -17545 -83044 -74865 -20566 -5121 -42222 -19907 -8139 -28233 -57626 -35631 -17757 -22537
23643 -22537 -36453 13904 37744 54141 27302 4886 -17809 4481 24232 45195 -23328 -71864
$$ packed form
23728A5418j128m151J1477k99j2228L4934j4295r2058j2496J407k5361M078l707
23715i8409J942L5493J4782j1444L6478L608K8655M0330Q608K9245q0901k0460
23703a2073L9070M9763p0202l7949k0165K7454N1381L7352k855j6518k0129K2891
23691D8020N4395r868n1530k6392M6762J3477l5504l1483j9720j2360l1784J0353
23679d5634J1494O333J216k8167L057j2966k7046R6974L7320n3173o4410l4977
23667a09979K9420Q8657J4248l6886l214J5738J227j7671K068J7224k8056R679
23655a7545o5499Q179N4299J5445l7101K2315J1768k0094k9393K1995J7874m780
23643b2537j3916N0357K3840J6397k6839k2416k2695K2290J9751K0963o8523m8536
$$ plain form
23631 -71864 -72527 -39613 -15009 -26281 -4213 -3447 28281 57182 40661 1709 49967 63887
23619 63887 93748 98110 75197 135521 152133 121472 52017 49728 87833 101225 89811 22374
23607 22374 -13706 -4613 -22263 -29647 -50433 -63171 -53245 -21100 3214 -26882 -51632 -40412
23595 -40412 -2004 8823 -5529 -15286 -10396 -24675 -39989 -46915 -7716 36478 24830 14078
23583 14078 -6275 -7517 -53115 -2622 -7914 -43571 23046 65753 67273 77925 -10522 -11592
23571 -11592 17901 71556 52213 32021 42701 30252 -10458 -38028 -52589 -12244 55846 35882
23559 35882 13227 44429 24069 -10054 -15095 -61171 -96508 -112946 -125897 -103652 -71858 -74163
23547 -74163 -86618 -164733 -100046 -39305 -31423 -22168 -54519 -118508 -54809 -29601 -52867 -69236
$$ packed form
23631g1864o63L2914K4604j1272K2068P66L1728K8901j6521l8952M8258J3920
23619F3887K9861M362k2913O0324J6612l0661o9455k289L8105J3392j1414o7437
23607B2374l6080R093j7650p384k0786j2738R926L2145K4314l0096k4750J1220
23595d0412L8408J0827j4352r757M890j4279j5314o926L9199M4194j1648j0752
23583A4078k0353j242m5598N0493n292l5657O6617M2707J520J0652q8447j070
23571a1592K9493N3655j9343k0192J0680j2449m0710k7570j4561M0345O8090j9964
23559C5882k2655L1202k0360l4123n041m6076l5337j6438j2951K2245L1794k305
23547g4163j2455p8115O4687O0741P882R255l2351o3989O3699K5208k3266j6369
$$ plain form
23535 -69236 -71863 -64293 -93981 -108032 -83525 -66491 -120479 -130713 -89172 -155391 -125722 -96175
23523 -96175 -18979 39742 37147 9464 -46133 -55458 -25466 60237 -13245 -51414 -73474 -91101
23511 -91101 -73822 -30517 -54613 -70696 -56328 -19973 13917 -7108 -16118 2412 -24619 4853
23499 4853 -488 -4809 16080 25666 44751 84900 49885 -23947 -9387 -56722 34633 35350 -24320
23486 -24320 -47568 -83123 -69049 48125 66543 24569 -11161 -28040 -38222 -57170 -75636
23475 -75636 -121598 -30314 18439 90595 99478 56136 13044 -21393 -1907 7354 -5093 57993
23463 57993 97809 17971 -17077 -18167 18782 -19368 -9506 2639 28583 34690 2279 -25481
23451 -25481 -34163 -73178 -89118 -83555 -70132 20862 42272 6651 9522 -9901 10801 -39834
$$ packed form
23535f9236k627P570k9688j4051K4507J7034n3988j0234M1541o6219K9669K9547
23523i6175P7196N8721k595k7683n5597r325K9992Q5703p3482l8169k2060j7627
23511i1101J7279M3305k4096j6083J4368L6355L3890k1025r010J8530k7031K9472
23499D853n341m321K0889R586J9085M0149l5015p3832J4560m7335R1355P17n9670
23486b4320k3248l5555J4074J17174J8418m1974l5730j6879j0182j8948j8466
23475g5636m5962R1284M8753P2156Q883m3342m3092l4437J9486R261j2447O3086
23463E7993L9816p9838l5048j090L6949l8150R862J2145K5944O107l2411k7760
23451b5481q682l9015j5940N563J3423R0994K1410l5621K871j9423K0702n0635
$$ plain form
23439 -39834 -65928 -34770 25303 -17107 14754 54357 63388 54303 18182 -10506 -25355 -59443
23427 -59443 -86809 -96296 -40773 -11626 -42750 -60267 -67267 -8979 -10742 -6490 -2488 48699 54467
23414 54467 36901 60523 41857 26461 9308 -20975 -51755 -90787 -67280 -16103 -11720 803
23402 803 51481 34290 -17312 -84019 -104571 -84465 -107832 -146393 -130584 -113355 -102154 -87739
23390 -87739 -112779 -54474 -23685 -68270 -126866 -69940 -59920 -83665 -115847 -73632 -33804 -56439
23378 -56439 -126571 -144617 -109755 -55691 -8489 21626 -13472 -225 -7471 -35899 -39204 -36679
23366 -36679 3337 64516 2539 -9708 -9436 -33028 -8778 -13139 39912 92449 55028 1795
23354 1795 31313 27864 -241 -32434 -41601 2735 -14336 -56756 -125579 -133736 -139521 -119033 -52828
$$ packed form
23439c9834k6094L1158O0073m2410L1861L9603R031r085l6121k8688j4849l4088
23427e9443k7366r487N5523K9147l1124j7517p000N8288j763M252M002N1187N768
23414E4467j7566K3622j8666j5396j7153l0283l0780l9032K3507N1177M383J2523
23402H03N0678j7191n1602o6707k0552K0106k3367l8561J5809J7229J1201J4415
23390h7739k5040N8305L0789m4585n8596N6926J0020k3745l2182M2215L9828k2635
23378e6439p0132j8046L4862N4064M7202L0115l5098J3247p246k8428l305K525
23366c6679M0016O1179o1977j2247K72k3592K4250m361N3051N2537l7421n3233
23354A795K9518l449k8105l2193r167M4336j7071m2420o8823q157n785K0488O6205
$$ plain form
23341 -52828 -77838 -57287 -46066 3881 -26064 -37450 -9318 -7251 -1645 1353 -64417 -84238
23329 -84238 -17169 19844 31975 11007 -10030 -11584 17111 92175 141076 134479 3374 -107966
23317 -107966 -124594 -94686 -86843 -39819 -44661 -76570 -70964 -74934 -62117 -61325 -69745 -51361 28490
23304 28490 77756 76535 94259 34255 -55766 -118280 -132761 -204005 -141583 -139311 -76527 -37837
23292 -37837 -68984 -61267 -102254 -74940 -64082 -49868 -42746 -59869 -70263 -19648 -85909 -141931
23280 -141931 -124037 -110260 -180683 -164961 -63933 -63734 -40083 59324 54849 76719 92291 -13238
23268 -13238 -41146 -8053 -35017 -88709 -63537 -20192 30234 1784 -79009 -74750 -81461 -69573
23256 -69573 -98884 -121791 -129220 -108652 -86841 -58421 -64371 -93422 -110893 -83888 -74664 -81714
$$ packed form
23341e2828k5010K0551J1221M9947k9945j1386K8132K067N606K998o5770j9821
23329h4238O7069L7013J2131k0968k1037j554K8695P5064M8901o597j31105j11340
23317a07966j6628K9908P843M7024m842l1909N606l970J2817P92q420J8384P9851
23304B8490M9266j221J7724o0004r0021o2514j4481p1244O2422K272O2784L8690
23292c7837l1147P717m0987K7314J0858J4214P122j7123j0394N0615o6261n6022
23280a41931J7894J3777p0423J5722J01028J99K3651R9407m475K1870J5572j05529
23268a3238k7908L3093k6964n3692K5172M3345N0426k8450q0793M259o711J1888
23256f9573k9311k2907p429K0568K1811K8420n950k9051j7471K7005R224p050
$$ plain form
23244 -81714 -45567 -28833 -72229 -17012 43230 85133 92372 32576 -30237 -42513 -25435 -41172
23232 -41172 -30118 -7432 -15548 19495 86110 70663 53179 4963 -52973 -113186 -73399 -78988
23220 -78988 -86148 -3237 -21421 -48770 -13498 13796 -61380 -83327 -76660 -59699 -44091 -93372
23208 -93372 -100441 -44523 8045 -44459 -39103 14282 88002 123484 100288 54815 58330 59135 44574
23195 44574 35989 68345 71428 20865 38470 44425 -15363 -83442 -84482 8246 47172 73049
23183 73049 55864 71714 95369 2654 -16000 -19583 -38190 -66471 -125715 -102243 -33599 -11453
23171 -11453 -15713 -10206 12594 -44887 -93653 -89285 -29752 -28818 -28518 -41222 2594 -3501 4191
23158 4191 24674 58758 14851 -55193 -45966 -16877 -39291 -41537 -47852 -27775 -2173 -38577
$$ packed form
23244h1714L6147J6734m3396N5217O0242M1903P239n9796o2813j2276J7078j5737
23232d1172J1054K2686q116L5043O6615j5447j7484m8216n7936o0213L9787n589
23220g8988p160Q2911j8184k7349L5272K7294p5176k1947O667J6961J5608m9281
23208i3372p069N5918N2568n2504N356N3385P3720L5482k3196m5473L515Q05j4561
23195D4574q585L2356L083n0563J7605N955n9788o8079j040R2728L8926K5877
23183G3049j7185J5850K3655r2715j8654l583j8607k8281n9244K3472O8644K2146
23171a1453m260N507K2800n7481m8766M368N9533R34L00j2704M3816o095P692
23158D191K0483L4084m3907p0044R227K9089k2414k246o315K0077K5602l6404
$$ plain form
23146 -38577 -63122 -59538 -129922 -94270 -53318 -59567 -49451 -47930 -87843 -55781 -37629 -75812
23134 -75812 -69706 19256 70816 50568 101687 92148 52216 13402 -28730 -55456 -25494 -7887
23122 -7887 -32670 -22207 21739 58020 42065 -10804 -39205 -64692 -109334 -63163 -57205 -96732
23110 -96732 -104020 -87510 -99169 -22112 11176 -118456 -162319 -102412 1799 23161 -12796
23099 -12796 -9078 9699 56943 32823 67481 81555 41137 -47622 -39507 -20398 -27442 -37576
23087 -37576 -9299 -19385 -53169 -35289 -54961 -11885 24904 85269 74097 12115 10815 40399
23075 40399 20539 -1181 19936 -4954 36937 15374 -17642 -30086 -59522 -74461 -29557 -29267
23063 -29267 -46192 -37399 -43977 -30318 -21953 34245 68634 28830 42677 26051 29157 28391 24026
$$ packed form
23146c8577k4545L584p0384L5652M0952o249J0116J521l9913L2062J8152l8183
23134g5812O106Q8962N1560k0248N1119r539l9932l8814m2132k6726K9962J7607
23122g887k4783J0463M3946L6281j5955n2869k8401k5487m4642M6171N958l9527
23110i6732p288J6510j1659P7057L3288j29632m3863N9907J04211K1362l5957
23099a2796L718J8777M7244k4120L4658J4074m0418q8759Q115J9109p044j0134
23087c7576K8277j0086l3784J7880j9672M3076L6789O0365j1172o1982j300K9584
23075D0399j9860k1720K1117k4890M1891k1563l3016j2444k9436j4939M4904K90
23063b9267j6925Q793o578J3659Q365N6198L4389l9804J3847j6626L106p66m365
$$ plain form
23050 24026 27263 -29054 -13567 -4587 -23245 -27350 -14507 -7684 3030 63508 92853 48150
23038 48150 19403 10756 9163 40786 15758 7267 -9727 -73129 -51914 -55782 -54632 11191 59641
23025 59641 42295 45927 69788 7927 -50293 -49012 -10871 -3089 -10689 -17741 41752 85013 80163
23012 80163 -14562 -34045 -49756 -38796 14266 59388 60283 50932 17962 9216 18882 -1988 -1517
22999 -1517 8478 -5560 15454 22414 93439 86932 38000 6263 -20930 -18854 31609 20210 -34551
22986 -34551 -71745 -70875 -13563 18776 -34707 -66564 -118378 -102476 7115 37361 96582 40388
22974 40388 -12050 -15247 -23112 -45035 4542 69341 27642 35516 52490 13436 8850 27580
22962 27580 -2747 51100 72339 73165 45415 5336 10647 672 -38933 8198 33307 31796 9006
$$ packed form
23050B4026L237n6317J5487Q980j8658m105J2843O823J0714O0478K9345m4703
23038D8150k8747q647j593L1623k5028q491j6994o3402K1215l868J150O5823M8450
23025E9641j7346L632K3861o1861n8220J281L8141P782p600p052N9493M3261m850
23012H0163r4725j9483j5711J0960N3062M5122Q95r351l2970q746R666k0870M71
22999a517R995j4038K1014O960P1025o507m8932l1737k7193K076N0463j1399n4761
22986c4551l7194Q70N7312L2339n3483l1857n1814J5902J09591L0246N9221n6194
22974D0388n2438l197p865k1923M9577O4799m1699P874J6974l9054m586J8730
22962B7580l0327N3847K1239Q26k7750m0079N311r975l9605M7131K5109j511k2790
$$ plain form
22949 9006 -71165 -61722 -22140 -14823 -34125 -60214 -48581 -125836 -121336 -103355 -129099 -106933
22937 -106933 -81502 -15436 956 23577 -32756 -118402 -121334 -124128 -120859 -136356 -123104 -102105
22925 -102105 -74462 -64348 -1163 -22212 -627 -12976 -21484 -28185 -28016 33372 90546 30608
22913 30608 23317 34578 23236 -5360 -42763 -57669 -51489 -36034 -28357 -36392 -13134 -10282 3061
22900 3061 15511 19540 -5558 2410 72431 57091 61230 84164 106393 96339 72500 -1127
22888 -1127 -15651 -5451 -65840 -67241 -13724 -33611 -75988 -51708 -42402 -26062 18034 -10718
22876 -10718 -75800 -31798 -17179 -8173 29554 17270 14044 -32149 -86557 -46639 -24586 -35062
22864 -35062 -11956 -8220 -10751 8340 85243 106148 72875 54236 68461 50844 -10461 -19700
$$ packed form
22949I006q0171R443L9582P317j9302k6089J1633p7255M500J7981k5744K2166
22937a06933K5431O6066J6392K2621n6333q5646k932k794L269j5497J3252K0999
22925a02105K7643J0114O3185k1049K1585j2349q508o701J69O1388N7174n9938
22913C0608p291J1261j1342k8596l7403j4906O180J5455P677q035K3258K852J3343
22900C061J2450M029k5098P968P0021j5340M139K2934K2229j0054k3839p3627
22888a127j4524J0200o0389j401N3517j9887m2377K4280R306J6340M4096k8752
22876a0718o5082M4002J4619R006L7727j2284l226m6193n4408L9918K2053j0476
22864c5062K3106L736k531J9091P6903K0905l3273j8639J4225j7617o1305r239
$$ plain form
22852 -19700 31391 7090 -45870 15519 13135 -54240 -34017 49923 64199 62391 69913 118753
22840 118753 107718 64279 32956 -1940 31330 133540 123274 105929 77697 34444 10822
22829 10822 12624 28510 -16774 -71739 -45547 -25484 -101893 -75523 -32781 -41272 -73632 -109455
22817 -109455 -54721 11087 21861 -1415 -35399 -22738 33727 20001 32901 15479 52656
22806 52656 39516 12689 21355 -3615 26522 66261 48946 55131 39654 18426 -19405 -6231
22794 -6231 13423 36425 8969 4701 -10977 -65384 -113572 -107503 -62131 -26422 -9965 39969
22782 39969 34667 34753 24421 11303 -19504 -35703 -24304 -73522 -63126 14374 37239 39611 27418
22769 27418 -9207 -53792 -86514 -175856 -160101 -138662 -120070 -105718 -107030 -74847 -64541 -104895
$$ packed form
22852a9700N1091k4301n2960O1389k384o7375K0223Q3940J4276j808P522M8840
22840A18753j1035m3439l1323l4896L3270J02210j0266j7345k8232m3253k3622
22829A0822J802J5886m5284n4965K6192K0063p6409K6370M2742q491l2360l5823
22817a09455N4734O5808J0774k3276l3984J2661N6465j3726J2900j7422L7177
22806E2656j3140k6827Q666k4970L0137L9739j7315O185j5477k1228l7831J3174
22794f231J9654K3002k7456m268j5678n4407m8188O069M5372L5709J6457M9934
22782C9969n302Q6j0332j3118l0807j6199J1399m9218J0396P7500K2865K372j2193
22769B7418l6625m4585l2722q9342J5755K1439J8592J4352j312L2183J0306m0354
$$ plain form
22757 -104895 -103421 -91492 -88177 -79107 -22337 -37571 -24814 -7895 -9191 46186 65922 53091
22745 53091 79700 35550 32831 67219 93423 74845 4718 -49507 -40330 -70084 -25706 30229
22733 30229 -6925 33027 36947 14919 -31452 -6165 6304 18821 -6762 -51701 -39762 -92337
22721 -92337 -158183 -111582 -39078 7964 25565 6078 8571 3705 -31718 -8243 6501 4020
22709 4020 -19906 -30986 -31266 -31993 -57685 -66415 -60154 -46655 -48212 -10519 27802 65378 1283
22696 1283 -61933 -70659 -95216 -55306 -16909 63032 -1743 -64322 -9443 -19972 -6615 -25906
22684 -25906 -11948 30461 36769 104952 123939 66287 29122 -13177 -68065 -38169 -19581 -12705
22672 -12705 -20324 -41487 -69820 -61627 -44873 -41507 -70713 -66845 -63773 -82663 -100393 -53601 -52907
$$ packed form
22757a04895J474J1929L315R070N6770j5234J2757J6919j296N5377J9736j2831
22745E3091K6609m4150k719L4388K6204j8578p0127n4225R177k9754M4378N5935
22733C0229l7154L9952L920k2028m6371K5287J2469J2517k5583m4939J1939n2575
22721i2337o5846M6601P2504M7042J7601j9487K493m866l5423K3475J4744k481
22709D020k3926j1080k80p27k5692q730O261J3499j557L7693L8321L7576o4095
22696A283o3216q726k4557L9910L8397P9941o4775o2579N4879j0529J3357j9291
22684b5906J3958M2409O308O8183J8987n7652l7165m2299n4888K9896J8588O876
22672a2705p619k1163k8333Q193J6754L366k9206L868L072j8890j7730M6792O94
$$ plain form
22659 -52907 -58104 -27801 -56621 -49060 -9557 -27729 -103641 -109314 -104427 -37626 -41866 -79362 -52337
22646 -52337 -9517 -16459 -15480 59537 87682 70152 41239 11212 -13343 -23881 -12522 -36056
22634 -36056 -50827 -68760 -94915 -29745 1070 -14749 -31740 -31176 -47120 -37799 -36242 -35033 -40758
22621 -40758 -68657 -50537 48232 77856 52119 60993 42035 21328 -30175 -74542 -51404 -69139
22609 -69139 -104749 -88995 -53171 -2729 14948 27843 39325 10107 -12290 -22593 -42844 -75423
22597 -75423 -58604 -97573 -113791 -50898 12743 6248 -45972 -17179 25379 26331 -31408 -110454
22585 -110454 -87683 -10354 46920 70959 40171 31103 57336 56908 57160 40317 -17321 -79104
22573 -79104 -43647 -30584 -72096 -36048 -30848 -87451 -60410 24999 7446 -42348 -44635 -48915
$$ packed form
22659e2907n197L0303k8820P561L9503j8172p5912n673M887O6801m240l7496K7025
22646e2337M2820o942R79P5017K8145j7530k8913l0027k4555j0538J1359k3534
22634c6056j4771j7933k6155O5170L0815j5819j6991N64j5944R321J557J209n725
22621d0758k7899J8120R8769K9624k5737Q874j8958k0707n1503m4367K3138j7735
22609f9139l5610J5754L5824N0442J7677J2895J1482k9218k2397j0303k0251l2579
22597g5423J6819l8969j6218O2893O3641o495n2220K8793M2558R52n7739p9046
22585a10454K2771P7329N7274K4039l0788r068K6233m28K52j6843n7638o1783
22573g9104L5457J3063m1512L6048N200n6603K7041Q5409j7553m9794k287m280
$$ plain form
22561 -48915 -146991 -113428 -160677 -136374 -57163 -88522 -62005 15631 108945 112644 20402 76062
22549 76062 91643 52440 18633 -15283 -27682 -3834 10334 20125 -17291 -40639 -63431 -46965
22537 -46965 -2156 -61974 -113887 -79761 -18444 68251 93994 119418 85502 111500 97665 77625
22525 77625 46037 12910 -6000 -16075 680 -1712 -98590 -110052 -126577 -109465 -25535 8411
22513 8411 49553 -14886 -51866 -53362 -92555 -57578 -24582 -16411 -27976 -64811 -98930 -65743
22501 -65743 -15485 60691 77068 72541 71030 50482 36554 -16033 -40250 -35078 -29843 -34122 -13020
22488 -13020 33438 52730 3406 -7361 -1585 -25611 12602 90831 86216 6955 -8634 -36299
22476 -36299 -53627 -24704 -24448 -58301 -22853 -18508 -539 56078 45900 69183 34573 -16337
$$ packed form
22561d8915r8076L3563m7249K4303P9211l1359K6517P7636R3314L699r2242N5660
22549G6062J5581l9203l3807l3916j2399K3848J4168R791l7416k3348k2792J6466
22537d6965M4809n9818n1913L4126O1317Q6695K5743K5424l3916K5998j3835k0040
22525G7625l1588l3127j8910j0075J6755k392r6878j1462j6525J7112Q3930L3946
22513H411M1142o4439l6980j496l9193L4977L2996Q171j1565l6835l4119L3187
22501f5743N0258P6176J6377m527j511k0548j3928n2587k4217N172N235m279K1102
22488a3020M6458J9292m9324j0767N776k4026L8213P8229m615p9261j5589k7665
22476c6299j7328K8923K56l3853L5448M345J7969N6617j0178K3283l4610n0910
$$ plain form
22464 -16337 -23868 9423 47597 51073 53524 43128 41864 73450 60529 -2140 -9817 60864 57705
22451 57705 15921 -8441 7117 24619 43639 43668 17351 -29058 -39878 -61232 -33328 -53483
22439 -53483 -43061 -6845 63086 48388 67657 69470 24041 -9975 -27628 -52496 -15530 -33611
22427 -33611 -60446 -47267 -29036 -45130 -13937 63918 100039 64293 814 2959 -7181 47344
22415 47344 22759 -30845 -1794 -1287 -51830 -17757 52157 92418 54601 -17181 -6831 -27768
22403 -27768 -49073 16282 24918 -795 -46265 -105730 -146063 -76193 -17315 1814 -10779 -4121
22391 -4121 15520 50698 75810 50921 94469 108015 134990 107913 64787 79205 26916 29116
22379 29116 10549 -24094 26669 66353 77009 80726 94881 92114 829 -40152 -6287 2054
$$ packed form
22464a6337p531L3291L8174L476K451j0396j264L1586j2921o2669p677P0681l159
22451E7705m1784k4362J5558J7502J9020K9k6317m6409j0820k1354K7904k0155
22439e3483J0422L6216O9931j4698J9269J813m5429l4016j7653k4868L6966j8081
22427c3611k6835J3179J8231j6094L1193P7855L6121l5746o3479K145j0140N4525
22415D7344k4585n3604K9051N07n0543L4073O9914M0261l7817p1782J0350k0937
22403b7768k1305O5355Q636k5713m5470n9465m0333O9870N8878J9129j2593O658
22391d121J9641L5178K5112k4889M3548J3546K6975k7077m3126J4418n2289K200
22379B9116j8567l4643N0763L9684J0656L717J4155k767r1285m0981L3865Q341
$$ plain form
22367 2054 -40693 -19064 62515 72720 63025 72663 98080 115944 78453 -5894 -75414 -70670
22355 -70670 -47274 -20683 -31769 -21031 -33609 -39496 -3626 39032 -8515 -42252 -44752 -74875
22343 -74875 -72576 -40142 -87382 -132880 -76102 -13529 21456 45036 76968 15642 -70249 1812
22331 1812 48861 32388 36524 43107 18347 27851 20180 -10209 4809 1779 -18543 -48018 -92869
22318 -92869 -13231 22474 74358 19062 -6155 -207 20908 -15715 -50207 -73950 -18314 26362
22306 26362 -13353 22701 2677 -38168 -12347 -26825 -26069 -51572 -68105 -70699 -100831 -100327 -50060
22293 -50060 -19366 34273 86899 101614 79577 -3716 -99390 -80080 -59725 -40696 -18209 -53914
22281 -53914 -84090 -90085 -43377 -49039 -30585 8280 13253 2458 17855 19982 -32044 -6960
$$ packed form
22367B054m2747K1629Q1579J0205r695R638K5417J7864l7491q4347o9520M744
22355g0670K3396K6591j1086J0738j2578n887L5870M2658m7547l3737k500l0123
22343g4875K299L2434m7240m5498N6778O2573L4985K3580L1932o1326q5891P2061
22331A812M7049j6473M136O583k4760R504p671l0389J5018l030k0322k9475m4851
22318i2869P9638L5705N1884n5296k5217N948K1115l6623l4492k3743N5636M4676
22306B6362l9715L6054k0024m0845K5821j4478P56k5503j6533k594l0132N04N0267
22293e0060L0694N3639N2626J4715k2037q3293r5674J9310K0355J9029K2487l5705
22281e3914l0176n995M6708n662J8454L8865M973j0795J5397K127n2026K5084
$$ plain form
22269 -6960 34758 39790 -8150 -28969 5988 -56939 -12348 -3233 -25464 -24381 -30772 -70606 -45521
22256 -45521 54168 82618 33648 -64960 -125299 -64038 -18544 -41489 -84026 -29282 -13733 39572
22244 39572 17631 20731 -57956 -74617 -16248 19665 3865 -25133 -22021 -45415 -13214 28989
22232 28989 70702 26151 11781 40223 32407 4701 -60094 -48758 8386 32917 -20530 -67716
22220 -67716 -65659 -73839 -27456 -40127 -41693 41179 131571 84620 55718 50317 61515 61224 68563
22207 68563 45724 26151 28762 67532 -9478 -87712 -78922 -50535 -44709 -7583 17050 11796
22195 11796 35003 61874 38491 48434 34416 11096 -32508 -7641 -5605 -34912 -35333 -54
22183 -54 -36582 -38850 43330 80382 43693 69829 41760 -11489 19275 46604 26633 -16008
$$ packed form
22269f960M1718N032m7940k0819L4957o2927M4591R115k2231J083o391l9834K5085
22256d5521R9689K8450m8970r8608o0339O1261M5494k2945m2537N4744J5549N3305
22244C9572k1941L100p8687j6661N8369L5913j5800k8998L112k3394L2201M2203
22232B8989M1713m4551j4370K8442p816k7706o4795J1336N7144K4531n3447m7186
22220f7716K057q180M6383j2671j566Q2872R0392m6951k8902n401J1198k91P339
22207F8563k2839j9573K611L8770p7010p8234Q790K8387N826L7126K4633n254
22195A1796K3207K6871k3383R943j4018k3320m3604K4867K036k9307m21L5279
22183e4l6528k268Q2180L7052l6689K6136k8069n3249L0764K7329j9971m2641
$$ plain form
22171 -16008 6934 21376 36995 41735 -7492 -103669 -95976 -71228 -38467 -45878 -56254 -4997
22159 -4997 -11658 -17900 -70160 -117073 -94067 5113 90753 29083 7170 -30020 -58715 -39039
22147 -39039 17492 6153 17577 -27406 -52094 8504 -15506 -54073 -73882 -107859 -116785 -109082
22135 -109082 -73632 -10524 13363 -28597 -36833 -12785 25346 44967 43890 20358 -59164 -36958
22123 -36958 -72027 -96729 -38450 -3325 -16219 -34388 -90457 -24545 -21214 -49919 -51526 -20260
22111 -20260 11595 49473 91152 32280 -16993 -114990 -105533 -89016 -37848 9157 -19262 -19848
22099 -19848 -8999 -13040 23879 21074 56451 36905 21007 111 915 10212 65423 41611 -27847
22086 -27847 -37604 -7094 9298 76933 156094 110172 71957 71413 103785 92390 71445 81647
$$ packed form
22171a6008K2942J4442J5619M740m9227r6177P693K4748L2761p411j0376N1257
22159d997o661o242n2260m6913K3006R9180Q5640o1670k1913l7190k8695J9676
22147c9039N6531j1339J1424m4983k4688O0598k4010l8567j9809l3977q926P703
22135a09082L5450O3108K3887m1960q236K4048L8131J9621j077k3532p9522K2206
22123c6958l5069k4702N8279L5125j2894j8169n6069O5912L331k8705j607L1266
22111b0260L1855L7878M1679n8872m9273r7997R457J6517N1168M7005k8419n86
22099a9848J0849m041L6919k805L5377j9546j5898k0896Q04R297N5211k3812o9458
22086b7847r757L0510J6392O7635P9161m5922l8215n44L2372j1395k0945J0202
$$ plain form
22074 81647 62414 52426 78506 95901 126863 121601 88449 -3988 -80069 -28940 1046 -12513
22062 -12513 -11886 14747 -29030 8695 25659 21392 -34017 -40585 -40155 -76148 -54541 -39089 -56601
22049 -56601 -127498 -156030 -76244 -37875 -45500 -29797 -5139 -4281 20771 31258 25755 -16669
22037 -16669 -34675 -28428 -43927 -57691 -68984 -53978 -14547 -2147 -36739 14741 28745 47528
22025 47528 17152 -36669 -54340 -24990 48980 92418 45991 26539 38589 78909 86810 124310
22013 124310 90453 19115 -6927 36704 73835 140467 91887 37224 79955 91041 87177 108818
22001 108818 153632 105417 1393 -35036 3425 63067 66724 69786 73445 903 -71556 -107510
21989 -107510 -41001 -54194 -59923 -56768 -65431 -106988 -80213 -48686 -46009 -20162 -38070 -62420
$$ packed form
22074H1647j9233r988K6080J7395L0962n262l3152r2437p6081N1129K9986j3559
22062a2513O27K6633m3777L7725J6964m267n5409o568M30l5993K1607J5452j7512
22049e6601p0897k8532P9786L8369p625J5703K4658Q58K5052J0487n503m2424
22037a6669j8006O247j5499j3764j1293J5006L9431J2400l4592N1480J4004J8783
22025D7528l0376n3821j7671K9350P3970M3438m6427j9452J2050M0320P901L7500
22013A24310l3857p1338k6042M3631L7131O6632m8580n4663M2731J1086l864K1641
22001A08818M4814m8215j04024l6429L8461N9642L657L062L659p2542p2459l5954
21989a07510O6509j3193n729L155q663m1557K6775L1527K677K5847j7908k4350
$$ plain form
21977 -62420 -51671 -52961 -31570 -48131 -18483 -35390 -45785 5440 63645 18941 6857 27663
21965 27663 39599 73829 53058 84292 61996 -6539 -28737 -62824 -20126 25609 -36403 -28485
21953 -28485 -39204 7006 -14153 -37106 -35172 -74701 -83315 -142545 -217672 -217558 -124961 -89389
21941 -89389 -62597 -48265 -12432 30394 17798 -28345 -27664 -19604 -9829 -49098 -63536 -22755
21929 -22755 -93137 -155519 -146222 -93973 -104137 -100331 -68908 -38647 -74020 -49271 4962 -489
21917 -489 -60772 -72142 -93118 -120244 -95351 -54727 -31273 -7442 -14361 -17990 3108 48178
21905 48178 28955 4529 -15421 -51901 -41943 -29519 -10735 15119 11887 99334 115647 35415
21893 35415 -16960 222 22413 22246 55505 29254 -34669 -37109 7501 69195 44321 38620
$$ packed form
21977f2420J0749j290K1391j6561K9648j6907j0395N1225N8205m4704j2084K0806
21965B7663J1936L4230k0771L1234k2296o8535k2198l4087M2698M5735o2012P918
21953b8485j0719M6210k1159k2953J934l9529q614n9230p5127J14R2597L5572
21941h9389K6792J4332L5833M2826j2596m6143O81Q060R775l9269j4438M0781
21929b2755p0382o2382R297N2249j0164L806L1423L0261l5373K4749N4233n451
21917d89o0283j1370k0976k7126K4893M0624K3454K3831o919l629K1098M5070
21905D8178j9223k4426j9950l6480R958J2424J8784K5854l232Q7447J6313q0232
21893C5415n2375J7182K2191j67L3259k6251o3923k440M4610O1694k4874n701
$$ plain form
21881 38620 9049 -29154 30001 -12629 -67062 -66595 -45204 -29838 -2896 -15589 -13468 -28076
21869 -28076 -25448 -49729 -44384 -3213 28213 56595 86548 27661 9214 27941 55987 74195
21857 74195 31064 -51004 -39623 -35660 -51148 -9417 -3559 -4715 34008 34613 17440 -1433 -39059
21844 -39059 -47326 26186 65432 11581 -17603 -47225 4274 -26937 -9872 5273 -13193 -58837
21832 -58837 -123858 -57724 -17067 22927 28915 56855 62560 51464 43929 35592 -19322 -47454
21820 -47454 -70467 -59446 -10131 -58131 -154190 -115437 -77183 -30658 -47637 -31994 -45855 -5691
21808 -5691 10965 36537 32516 34481 52270 24142 -41363 -101142 -117884 -107819 -100999 -82065
21796 -82065 -15147 16875 20052 -13810 -56500 -30808 -42258 10248 48717 57567 29934 -26807
$$ packed form
21881C8620k9571l8203N9155m2630n4433M67K1391J5366K6942j2693K121j4608
21869b8076K628k4281N345M1171L1426K8382K9953n8887j8447J8727K8046J8208
21857G4195m3131q2068J1381L963j5488M1731N858j156L8723O05j7173j8873l7626
21844c9059q267P3512L9246n3851k9184k9622N1499l1211J7065J5145j8466m5644
21832e8837o5021O6134M0657L9994N988K7940N705j1096p535q337n4914k8132
21820d7454k3013J1021M9315m8000r6059L8753L8254M6525j6979J5643j3861M0164
21808e691J6656K5572m021J965J7789k8128o5505n9779j6742J0065O820J8934
21796h2065O6918L2022L177l3862m2690K5692j1450N2506L8469Q850k7633n6741
$$ plain form
21784 -26807 10979 44634 36815 46999 76623 91132 8435 -19170 7682 16009 19390 26333
21772 26333 46901 37431 30659 36918 45329 60216 78048 39399 -194 -583 -44954 -95297 -26326
21759 -26326 39087 83355 81036 50208 28909 -51892 -108162 -68249 -39024 -9296 -29228 -4311
21747 -4311 36713 38569 20481 9944 -9053 2109 -18202 -43779 -26253 75266 102214 61091
21735 61091 -11597 -58808 -92397 -25321 18901 12674 65225 147492 149779 85284 45644 62627
21723 62627 56273 59673 32399 37700 64796 22484 -2983 -5065 8053 -8958 -46799 -13880
21711 -13880 42784 91699 55162 11220 -33971 -37650 10507 50492 -727 31381 -11335 -57202
21699 -57202 -37057 14925 24516 15103 18257 71096 20526 -29663 -102844 -101304 -90778 -117701
$$ packed form
21784b6807L7786L3655p819J0184K9624J4509q2697k7605K6852Q327L381O943
21772B6333K0568r470o772O259Q411J4887J7832l8649l9593l89m4371n0343O8971
21759b6326O5413M4268k319l0828k1299q0801n6270L9913K9225K9728j9932K4917
21747d311M1024J856j8088j0537j8997J1162k0311k5577J7526J01519K6948m1123
21735F1091p2688m7211l3589O7076M4222o227N2551Q2267K287o4495l9640J6983
21723F2627o354L400k7274N301K7096m2312k5467k082J3118j7011l7841L2919
21711a3880N6664M8915l6537m3942m5191l679M8157L9985n1219L2108m2716m5867
21699e7202K0145N1982R591r413L154N2839n0570n0189p3181J540J0526k6923
$$ plain form
21687 -117701 -112960 -35742 43936 77303 -25978 -52063 -10452 -51819 -97480 -110299 -87130
21676 -87130 -53703 -53149 -40382 -35095 -30768 -26460 -6260 43938 26254 2885 -21373 -62422 -52621
21663 -52621 -9679 4690 -52801 -78606 -1549 75779 17085 -32345 -28365 -61394 -35356 3255
21651 3255 -3923 1646 -32203 3145 1076 -22077 -75507 -67677 -30182 -34122 26289 90997 81871
21638 81871 39912 -3860 -5186 -9271 -12148 -77027 -54681 -27886 -39907 11924 -23830 -79292
21626 -79292 -90354 -76733 -73677 -41321 -19744 2365 58912 46054 39776 23716 -14756 -17236
21614 -17236 -39682 -67634 -111968 -78498 -79486 -92357 -30502 44590 60224 32294 38790 -4768
21602 -4768 -23849 24442 46322 42852 -12702 -60519 -43073 -23147 -38454 -35071 -57923 -104128
$$ packed form
21687a17701M741P7218P9678L3367j03281k6085M1611m1367m5661j2819K3169
21676h7130L3427N54J2767N287M327M308K0200N0198j7684k3369k4258m1049R801
21663e2621M2942J4369n7491k5805P7057P7328n8694m9430L980l3029K6038L8611
21651C255p178N569l3849L5348k069k3153n3430P830L7495l940O0411O4708r126
21638H1871m1959m3772j326m085k877o4879K2346K6795j2021N1831l5754n5462
21626g9292j1062J3621L056L2356K1577K2109N6547j2858o278j6060l8472k480
21614a7236k2446k7952m4334L3470r88j2871O1855P5092J5634k7930O496m3558
21602d768j9081M8291K1880l470n5554m7817J7446J9926j5307L383k2852m6205
$$ plain form
21590 -104128 -59808 -64381 -32513 5606 56469 83346 75647 86813 69843 -26037 -16589 -21416
21578 -21416 14916 47730 71542 12998 -13380 31265 50347 35411 30999 62815 56512 64268
21566 64268 61490 134062 96293 -1626 -8660 -45001 -68084 -106999 -93371 -68587 -71823 -72519 -33651
21553 -33651 53608 58850 63234 44170 -9204 7725 37129 9376 -56021 -134969 -99386 -69701
21541 -69701 -18914 89912 100098 119137 116474 67696 -26435 -11641 12824 38577 68654 36764
21529 36764 -1701 28601 78004 91669 108810 114105 61327 95510 106761 81484 90817 44276
21517 44276 -39223 -102293 -98875 -84449 -59525 -26951 -80336 -49888 4780 39811 80573 19183
21505 19183 6075 48685 104532 167371 67954 26355 62108 52293 19946 20204 -26338 -46684
$$ packed form
21590a04128M4320m573L1868L8119N0863K6877p699J1166j6970r5880R448m827
21578b1416L6332L2814K3812n8544k6378M4645J9082j4936m412L1816o303P756
21566F4268k778P2572l7769r7919p034l6341k3083l8915J3628K4784l236o96L8868
21553c3651Q7259N242M384j9064n3374J6929K9404k7753o5397p8948L5583K9685
21541f9701N0787J08826J0186J9039k663m8778r4131J4794K4465K5753L0077l1890
21529C6764l8465L0302M9403J3665J7141N295n2778L4183J1251k5277R333m6541
21517D4276q3499o3070L418J4426K4924L2574n3385L0448N4668L5031M0762o1390
21505A9183j3108M2610N5847O2839r9417m1599L5753r815l2347K58m6542k0346
$$ plain form
21493 -46684 -78258 -102885 -35692 3406 67294 94794 112811 111423 39612 -8896 -28889 -20530
21481 -20530 -37503 -73692 -50041 1736 -2174 3965 60271 64664 30893 5406 -16475 -22643
21469 -22643 -46515 -78728 -25351 47404 48056 52414 63098 35172 11756 2969 -20144 -46530
21457 -46530 -91542 -84789 -92437 -86774 -77576 -87971 -60831 -22662 -34415 -33865 10293 26706 30890
21444 30890 53079 62450 101964 93480 49886 62567 68286 112549 128476 75614 85884 117456
21432 117456 83604 18898 15139 -7596 -4367 20462 56344 78752 32343 -35722 -54438 -19771
21420 -19771 2455 -23760 -14855 -13321 27327 77245 82420 29441 193 11583 13313 47427
21408 47427 25182 -7122 15149 41033 16543 33794 16134 -39294 19155 50319 49444 10790
$$ packed form
21493d6684l1574k4627O7193L9098O3888K7500J8017j388p1811m8508j9993Q359
21481b0530j6973l6189K3651N1777l910O139N6306M393l3771k5487k1881o168
21469b2643k3872l2213N3377P2755O52M358J0684k7926k3416q787k3113k6386
21457d6530m5012O753p648N663R198j0395K7140L8169j1753N50M4158J6413M184
21444C0890K2189R371L9514q484m3594J2681N719M4263J5927n2862J0270L1572
21432A17456l3852o4706l759k2735L229K4829L5882K2408m6409o8065j8716L4667
21420a9771K2226k6215Q905J534M0648M9918N175n2979k9248J1390J730L4114
21408D7427k2245l2304K2271K5884k4490J7251j7660n5428N8449L1164q75l8654
$$ plain form
21396 10790 -15558 23114 17533 -22909 -47824 -34471 -12420 24426 57890 42769 -7153 -5130
21384 -5130 83723 28846 -5746 53241 130356 154246 35595 939 -1906 14916 -24782 -31145
21372 -31145 -13578 2896 -26416 -64543 -84232 -40680 -5356 28720 37461 50996 55700 72373
21360 72373 33743 33661 46967 21397 37454 110136 98431 48020 25996 17717 40598 47177 48070
21347 48070 80569 71008 42362 37125 -3062 -9693 1343 -34431 -11644 43776 104747 115603
21335 115603 98904 49147 11254 34720 14813 7610 -31848 -71441 -39661 47025 66610 30309
21323 30309 -18732 -16335 -8428 47448 72562 25857 8442 22322 18164 -18766 29660 47279
21311 47279 34178 -33238 -15096 1931 16883 9580 32571 45076 3325 -54326 -117799 -88808
$$ packed form
21396A0790k6348L8672n581m0442k4915J3353K2051L6846L3464j5121m9922K023
21384e130Q8853n4877l4592N8987P7115K3890j18651l4656k845J6822l9698o363
21372c1145J7567J6474k9312l8127j9689M3552L5324L4076Q741J3535M704J6673
21360G2373l8630q2J3306k5570J6057P2682j1705n0411k2024q279K2881O579Q93
21347D8070L2499r561k8646n237m0187o631J1036l5774K2787N5420O0971J0856
21335A15603j6699m9757l7893K3466j9907p203l9458l9593L1780Q6686J9585l6301
21323C0309m9041K397P907N5876K5114m6705j7415J3880m158l6930M8426J7619
21311D7279j3101o7416J8142J7027J4952p303K2991J2505m1751n7651o3473K8991
$$ plain form
21299 -88808 -39204 -13186 -8127 -379 -19379 -55464 -35706 -6430 -3561 35106 92729 80213
21287 80213 61745 34360 48978 16913 9615 -37961 -61042 -55528 -59322 -86363 -13734 40327
21275 40327 91253 76657 1818 -55198 -70766 -14871 -13102 -50822 -30825 -2700 34144 43197
21263 43197 6552 -40799 -34067 -27327 -10391 -32232 -43211 -74792 -59178 -57508 -40608 -27904
21251 -27904 -81745 -111317 -56289 -16508 -29638 -21144 -27969 -59008 -47496 -18695 62021 53042
21239 53042 15139 10969 32050 48436 10251 -50707 -140896 -189160 -162004 -164293 -109831 -79905
21227 -79905 -42720 -29212 -41062 -87935 -70975 -38524 -21474 -91084 -83696 -32461 -53824 -69698
21215 -69698 -72692 -72819 -48065 -27069 -52530 -58288 -55309 -18208 -9531 -23650 -56113 -83349 -126397
$$ packed form
21299h8808M9604K6018N059P748j9000l6085J9758K9276K869L8667N7623j2516
21287H0213j8468k7385J4618l2065p298m7576k3081N514l794k7041P2629N4061
21275D0327N0926j4596p4839n7016j5568N5895J769l7720J9997K8125L6844R053
21263D3197l6645m7351O732O740J6936k1841j0979l1581J5614J670J6900J2704
21251b7904n3841k9572N5028L9781j3130Q494o825l1039J1512K8801Q0716q979
21239E3042l7903m170K1081J6386l8185o0958r0189m8264K7156k289N4462K9926
21227g9905L7185J3508j1850m6873J6960L2451J7050o9610P388N1235k1363j5874
21215f9698k994j27K4754K0996k5461n758K979L7101Q677j4119l2463k7236m3048
$$ plain form
21202 -126397 -121034 -97065 -43271 -43185 -46291 -55466 -32411 -3948 33730 8546 63498 137143 47011
21189 47011 -52275 -4547 87269 147320 140399 119364 52305 5490 28704 23059 78467 48473
21177 48473 -11240 -29692 -69165 -55309 -40048 -27333 -4933 23207 25162 35291 20258 2117
21165 2117 -23041 -18090 -64396 -32176 -25642 -24106 -52618 -22587 -3518 36552 3242 -48953
21153 -48953 -72627 -49038 26893 81481 82184 49682 71137 80555 71435 48194 1670 -13747
21141 -13747 -46477 -74261 -90954 -92620 -55580 -47252 -32474 865 84720 81514 66019 25470
21129 25470 83070 84812 47359 -3523 -121 22851 104098 71165 17679 1723 -88536 -104877
21117 -104877 -103358 -125365 -87425 4964 -33891 -85779 -105188 -103734 -65968 -46179 -70233 -63549
$$ packed form
21202a26397N363K3969N3794Q6l106r175K3055K8463L7678k5184N4952P3645r0132
21189D7011r9286M7728R1816O0051o921k1035o7059m6815K3214n645N5408k9994
21177D8473n9713j8452l9473J3856J5261J2715K2400K8140J955J0129j5033j8141
21165B117k5158M951m6306L2220O534J536k8512L0031J9069M0070l3310n2195
21153d8953k3674K3589P5931N4588P03l2502K1455R418r120k3241m6524j5417
21141a3747l2730k7784j6693j666L7040Q328J4778L3339Q3855l206j5495m0549
21129B5470N7600J742l7453n0882L402K2972Q1247l2933n3486j5956r0259j6341
21117a04877J519k2007L7940R2389l8855n1888j9409J454L7766J9789k4054O684
$$ plain form
21105 -63549 -12719 49710 35784 -6779 -35503 -12184 7601 7513 35514 29859 68772 75472 32604
21092 32604 -20435 -50239 11097 35341 7949 19171 -1045 16371 35916 230 -41876 -18615
21080 -18615 14765 13300 -29651 -58340 -77251 -18558 1298 -1644 6046 -26528 -34811 -54258
21068 -54258 -76018 -64030 -83037 -55501 -73319 -72831 -44109 -4448 -15030 -25701 -6260 -56034
21056 -56034 -22364 37461 45234 12725 -7383 3263 -42704 -27789 10779 -46012 -31504 -2044
21044 -2044 -7567 -22080 6745 7863 24829 30279 8947 -36421 -11239 44222 76172 -14078
21032 -14078 -77135 -103742 -41513 18638 10682 -42162 -52514 -1350 60806 74866 46791 -17472
21020 -17472 7992 -4007 33631 39169 21958 11495 9000 -15801 -393 -15310 -55927 -44428
$$ packed form
21105f3549N0830O2429j3926m2563k8724K3319J9785q8K8001n655L8913O700m2868
21092C2604n3039k9804O1336K4244k7392J1222k0216J7416J9545l5686m2106K3261
21080a8615L3380j465m2951k8689j8911N8693J9856k942P690l2574q283j9447
21068e4258k1760J1988j9007K7536j7818M88K8722L9661j0582j0671J9441m9774
21056e6034L3670N9825P773l2509k0108J0646m5967J4915L8568n6791J4508K9460
21044b044n523j4513K8825J118J6966N450k1332m5368K5182N5461L1950r0250
21032a4078o3057k6607O2229O0151p956n2844j0352N1164O2156J4060k8075o4263
21020a7472K5464j1999L7638N538j7211j0463k495k4801J5408j4917m0617J1499
$$ plain form
21008 -44428 -22925 -39654 -7264 -17170 4851 519 -30235 -19556 -43922 49659 99941 86404
20996 86404 65478 43836 29317 22909 90543 67264 1545 -40949 3660 40758 38007 -16423
20984 -16423 -56979 -31008 -66892 -125049 -82263 6294 11404 -36224 -30287 30633 39840 -26935
20972 -26935 -51454 -69477 -19199 50385 88706 86952 28302 -27622 1113 59658 64768 84869
20960 84869 37623 -25385 -42940 -37362 -25851 -18387 14600 35521 62939 77940 38261 -6099
20948 -6099 -30390 -15952 34595 25433 18651 47123 49850 -17042 -37691 -20889 -30519 -57945 18896
20935 18896 -13036 -21154 -11688 11141 37291 38696 61261 86446 63137 67852 12647 -23600
20923 -23600 5693 25143 40962 53600 37174 27253 -39668 -64323 -36737 8048 8958 43196
$$ packed form
21008d4428K1503j6729L2390r906K2021m332l0754J0679k4366R3581N0282j3537
20996H6404k0926k1642j4519o408O7634k3279o5719m2494M4609L7098k751n4430
20984a6423m0556K5971l5884n8157M2786Q8557N110m7628N937O0920R207o6775
20972b6935k4519j8023N0278O9584L8321j754n8650n5924K8735N8545N110K0101
20960H4869m7246o3008j7555N578J1511P464L2987K0921K7418J5001l9679m4360
20948f099k4291J4438N0547r162o782K8472K727o6892k0649J6802r630k7426P6841
20935A8896l1932q118R466K2829K6150J405K2565K5185k3309M715n5205l6247
20923b3600K9293J9450J5819J2638j6426r921o6921k4655K7586M4785R10L4238
$$ plain form
20911 43196 14555 -85342 -51673 -4669 -48601 -45414 -1363 12034 4960 846 -20678 -29608
20899 -29608 -14432 59683 92017 104375 91062 15307 44377 30776 20322 2638 -8388 -1977
20887 -1977 15710 16958 -28279 -50912 -30769 -20264 -16950 29392 73587 67258 26490 13486
20875 13486 -25619 -41309 -53626 -63841 -118627 -80686 3293 13205 -31009 -96790 -84787 -36681
20863 -36681 -49704 -28726 -19790 -8824 33638 783 -54157 -62111 -50692 -62240 25723 37802
20851 37802 35841 21224 35643 40263 45576 81945 113401 97818 101981 54887 -81153 -89434
20839 -89434 -38098 -47543 -64476 -45000 -52940 -56401 -28136 -11161 29032 -20324 -64863 -60630
20827 -60630 -18702 30972 29249 67455 91577 69203 56622 50847 21230 83380 116874 124554
$$ packed form
20911D3196k8641r9897L3669M7004m3932L187M4051J3397p074m114k1524q930
20899b9608J5176P4115L2334J2358j3313p5755K9070j3601j0454j7684j1026O411
20887a977J7687J248m5237k2633K0143J0505L314M6342M4195o329m0768j3004
20875A3486l9105j5690j2317j0215n4786L7941Q3979R912m4214o5781J2003M8106
20863c6681j3023K0978Q936J0966M2462l2855n4940p954J1419j1548Q7963J2079
20851C7802j961j4617J4419M620N313L6369L1456j5583M163m7094j36040q281
20839h9434N1336r445j6933J9476p940l461K8265J6975M0193m9356m4539M233
20827f0630M1928M9674j723L8206K4122k2374j2581n775k9617O2150L3494P680
$$ plain form
20815 124554 99100 50861 36653 26931 49090 93136 93724 84425 34708 58532 33389 23584
20803 23584 44949 36070 42883 44348 45156 12525 -69953 -82499 26525 134731 154129 122831
20791 122831 46084 11164 -30866 -23454 -27236 -22218 -9544 -18539 -5286 -45519 -63211 -96005
20779 -96005 -115744 -80714 -90453 -52284 -39182 -28385 24347 52830 52480 53653 27700 8261
20767 8261 -46 14656 17763 -17507 -13198 -9934 -21539 -3665 44448 22079 -6108 53096 75982
20754 75982 73533 41031 -24791 -46360 54410 101236 114810 122445 87413 10033 25930 48397
20742 48397 90964 101115 56663 75326 -4267 -14933 24996 -20979 -25263 -38323 2717 67637
20730 67637 89058 75995 34958 28693 5311 -13474 59754 18228 26963 50860 17528 28142
$$ packed form
20815A24554k5454m8239j4208r722K2159M4046N88r299m9717K3824k5143r805
20803B3584K1365q879O813J465Q08l2631q2478j2546J09024J08206J9398l1298
20791A22831p6747l4920m2030P412l782N018J2674q995J3253m0233j7692l2794
20779i6005j9739L5030r739L8169J3102J0797N2732K8483l50J173k5953j9439
20767H261q307J4702L107l5270M309L264j1605J7874M8113k2369k8187N9204K2886
20754G5982k449l2502o5822k1569J00770M6826J3574P635l5032p7380J5897K2467
20742D8397M2567J0151m4452J8663p9593j0666L9929m5975m284j3060M1040O4920
20730F7637K1421j3063m1037o265k3382j8785P3228m1526Q735K3897l3332J0614
$$ plain form
20718 28142 71283 19369 -13138 45486 84783 97162 86369 56049 12895 211 63395 103998
20706 103998 144958 121690 101983 41570 24295 -22543 -97963 -64045 -2823 -24701 6673
20695 6673 35781 54420 99514 127174 107955 66674 -9489 -25073 -9268 -27363 -48960 -15610
20683 -15610 20248 44266 86540 86587 43682 49435 46146 45691 33091 -8403 8062 7124 30297
20670 30297 113694 104053 14661 7581 -14386 -20792 -31866 -62559 -71839 -47050 -5187 15852
20658 15852 32207 29338 25794 26567 10408 -33191 -33441 1903 42103 34247 8069 -35690 -79084
20645 -79084 -88097 -47094 51630 80627 112364 64649 68049 25797 -39650 -39939 -78787 -99852
20633 -99852 -88762 -54957 -801 6426 22076 50142 30194 87535 122510 44021 25840 37030
$$ packed form
20718B8142M3141n1914l2507N8624L9297J2379j0793l0320m3154j2684O3184M0603
20706A03998M0960k3268j9707o0413j7275m6838p5420L3918O1222k1878L1374
20695F673K9108J8639M5094K7660j9219m1281p6163j5584J5805j8095k1597L3350
20683a5610L5858K4018M2274M7m2905N753l289m55j2600m1494J6465r38K3173
20670C0297Q3397r641q9392p080k1967o406j1074l0693r280K4789M1863K1039
20658A5852J6355k869l544P73j6159m3599k50L5344M0200p856k6178m3759m3394
20645g9084r013M1003R8724K8997L1737m7715L400m2252o5447k89l8848k1065
20633i9852J1090L3805N4156P227J5650K8066j9948N7341L4975p8489j8181J1190
$$ plain form
20621 37030 55024 29689 51707 5561 -20512 12504 45475 56055 71532 51460 50466 56964
20609 56964 74435 68913 73552 33993 39706 34633 3756 10013 29040 3974 26867 31577 54875
20596 54875 39366 4618 61137 70448 24410 6925 24059 14588 40140 32029 10926 3068
20584 3068 -6775 30181 102571 144961 104670 93710 132595 143878 88937 37898 118953 118328
20572 118328 44099 43928 67238 36409 31853 97822 133663 78288 8769 -75473 -104334 -106129
20560 -106129 -83261 -77047 -1992 25 -32505 -88495 -37226 44895 54439 72652 46805 47534
20548 47534 79251 78496 42336 12544 -9275 -12000 -4745 2891 7233 1004 31343 79824 70072
20535 70072 72651 57112 83073 68209 16338 18998 -25451 -35498 20344 2087 -35363 19474
$$ packed form
20621C7030J7994k5335K2018m6146k6073L3016L2971J0580J5477k0072r94O498
20609E6964J7471n522M639l9559N713n073l0877O257J9027k5066K2893M710K3298
20596E4875j5509l4748N6519R311m6038j7485J7134r471K5552q111k1103p858
20584C068r843L6956P2390M2390m0291j0960L8885J1283n4941n1039Q1055o25
20572A18328p4229j71K3310l0829m556O5969L5841n5375o9519q4242k8861j795
20560a06129K2868O214P5055K017l2530n5990N1269Q2121R544J8213k5847P29
20548D7534L1717p55l6160k9792k1819k725P255P636M342o229L0339M8481r752
20535G0072K579j5539K5961j4864n1871K660m4449j0047N5842j8257l7450N4837
$$ plain form
20523 19474 32997 63576 96550 75808 62121 63669 52148 -4725 -36236 -21582 50881 94554
20511 94554 121912 110310 46784 22804 -11727 -12657 -13423 77009 59263 23686 17948 5640 41546
20498 41546 49666 40753 74157 82638 25468 -4285 48171 97301 101695 82840 59126 30104
20486 30104 45069 49701 28214 75383 87240 38884 41160 118160 143874 79862 94377 109073
20474 109073 85275 48945 81472 83480 -16448 -26441 8552 -17975 19001 43910 58433 43304
20462 43304 8393 9903 55755 77406 71275 53573 17970 4967 18909 -34128 -46973 51033
20450 51033 134982 109053 117888 133011 78405 45559 27359 20432 72312 83574 62594 71520
20438 71520 106941 177313 207647 149468 44306 30632 53092 45655 77662 39093 34245 12695
$$ packed form
20523A9474J3523L0579L2974k0742j3687J548j1521n6873l1511J4654P2463M3673
20511I4554K7358j1602o3526k3980l4531r30p66R0432j7746l5577n738j2308L5906
20498D1546Q120q913L3404Q481n7170k9753N2456M9130M394j8855k3714k9022
20486C0104J4965M632k1487M7169J1857m8356K276P7000K5714o4012J4515J4696
20474A09073k3798l6330L2527K008r9928r993L4993k6527L6976K4909J4523j5129
20462D3304l4911J510M5852K1651o131j7702l5603j3003J3942n3037j2845R8006
20450E1033Q3949k5929Q835J5123n4606l2846j8200o927N1880J1262k0980Q926
20438G1520L5421P0372L0334n8179j05162j3674K2460p437L2007l8569m848k1550
$$ plain form
20426 12695 -20112 5316 31043 59835 35780 4423 -11835 24266 44371 76021 69449 74921
20414 74921 61750 55018 31195 -20727 -51298 55360 87185 44917 52606 22740 -21009 -13164
20402 -13164 41584 127751 122494 97575 69917 51855 63406 80747 137183 151041 96811 63634
20390 63634 28145 70678 100590 37270 5863 -35044 -29407 -7463 45431 71260 114450 120084
20378 120084 136192 66217 26797 39108 95934 154293 173700 226111 225007 200478 156792 137503
20366 137503 168418 185671 161675 141888 196622 174260 110715 69279 20880 25517 19816 69135
20354 69135 96424 130074 146304 126352 79662 78329 97419 69411 87170 113464 88080 73749
20342 73749 40840 39830 71787 -24123 -39425 -1939 58567 50524 19393 29457 93434 134883
$$ packed form
20426A2695l2807K5428K5727K8792k4055l1357j6258L6101K0105L1650o572N472
20414G4921j3171o732k3823n1922l0571J06658L1825m2268P689k9866m3749P845
20402a3164N4748Q6167n257k4919k7658j8062J1551J7341N6436J3858n4230l3177
20390F3634l5489M2533K9912o3320l1407m0907N637K1944N2894K5829M3190N634
20378A20084J6108o9975l9420J2311N6826N8359J9407N2411j104k4529m3686j9289
20366A37503L0915J7253k3996j9787N4734k2362o3545m1436m8399M637n701M9319
20354F9135K7289L3650J6230j9952m6690j333J9090k8008J7759K6294k5384j4331
20342G3749l2909j010L1957r5910j5302L7486O0506q043l1131J0064O3977M1449
$$ plain form
20330 134883 66246 -34304 -87890 -51434 57306 104301 67528 85540 78572 75337 68228 73278
20318 73278 46492 55834 56767 77761 116620 115203 48362 32470 19865 -42429 27984 95682
20306 95682 59239 45403 91222 126843 86716 63441 90760 113933 68028 49831 85634 92623
20294 92623 53880 30019 54705 90396 108512 73450 52509 35296 -375 -4006 22091 67566
20282 67566 104175 117427 77301 71353 -19471 -38614 -15443 132272 187318 148687 108476 64016
20270 64016 38195 31167 -40182 -67721 -44430 -19854 15570 7240 13400 -13657 -59844 -80130
20258 -80130 -57564 -12281 -1539 -42798 -6267 31285 13774 31103 55426 15405 63325 71057
20246 71057 58858 94030 74116 115362 162833 143427 108010 115579 103600 86011 48513 51906
$$ packed form
20330A34883o8637j00550n3586L6456J08740M6995l6773J8012o968l235p109N050
20318G3278k6786R342R33K0994L8859j417o6841j5892j2605o2294P0413O7698
20306I5682l6443j3836M5819L5621m0127k3275K7319K3173m5905j8197L5803O989
20294I2623l8743k3861K4686L5691J8116l5062k0941j7213l5671l631K6097M5475
20282F7566L6609J3252m0126n948r0824j9143K3171J47715N5046l8631m0211m4460
20270F4016k5821p028p1349k7539K3291K4576L5424q330O160k7057m6187k0286
20258h0130K2566M5283J0742m1259L6531L7552j7511J7329K4323m0021M7920P732
20246G1057j2199L5172j9914M1246M7471j9406l5417P569j1979j7589l7498L393
$$ plain form
20234 51906 138027 112771 99210 116912 102450 102586 94920 62302 86003 111801 133371 56098
20222 56098 -14741 -25311 889 57518 64030 31470 33140 45273 21411 53749 98045 116935
20210 116935 115499 71228 105780 136130 149437 132514 164988 155452 148156 237220 205020 165897
20198 165897 165417 203423 227677 176792 149241 95834 91717 59625 -5375 12865 118727 168654
20186 168654 128321 171965 186235 168508 208619 320471 322955 271119 280403 278097 265393 202701
20174 202701 177463 172402 176133 86459 30811 138978 224262 384804 462969 503009 628852
20163 628852 765152 877558 934536 858558 776067 638625 469082 278968 233467 245070
20153 245070 245775 305647 297130 323986 373272 401433 510310 591674 609290 591792 461500 369289
$$ packed form
20234E1906Q6121k5256j3561J7702j4462J36p666l2618K3701K5798K1570p7273
20222E6098p0839j0570K6200N6629O512l2560J670J2133k3862L2338M4296J8890
20210A16935j436m4271L4552L0350J3307j6923L2474r536p296Q9064l2200l9123
20198A65897m80L8006K4254n0885k7551n3407m117l2092o5000J8240J05862M9927
20186A68654m0333M3644J4270j7727M0111J11852K484n1836R284k306j2704o2692
20174B02701k5238n061L731q9674n5648J08167Q5284J60542P8165M0040J25843
20163F28852J36300J12406N6978p5978q2491j37442j69543j90114m5501J1603
20153B45070P05N9872q517K6856M9286K8161J08877Q1364J7616j7498j30292r2211
$$ plain form
20141 369289 330781 310258 255155 273738 266943 301815 383691 475305 509004 519778 660568
20130 660568 744135 747410 658934 586891 504080 451391 435750 344465 325007 427382 505732
20119 505732 562849 602995 608451 520556 411670 305950 296145 331646 315098 269172 222753
20108 222753 238155 333402 309466 335493 448206 558073 648038 753210 886324 896483 819549
20097 819549 712112 527748 379867 281314 218413 211300 204937 181172 214377 216502 240210
20086 240210 235740 225138 193991 150727 148712 152662 126694 201790 204824 234377 215242 202266
20074 202266 146609 118381 123295 129718 209284 251795 212256 111957 66850 66288 50945 28624
20062 28624 84160 79566 91598 93826 109980 165926 192662 192284 146912 146051 143059 125312 182079
$$ packed form
20141C69289l8508k0523n5103J8583o795L4872Q1876R1614L3699J0774J40790
20130F60568Q3567L275q8476p2043q2811n2689j5641r1285j9458J02375P8350
20119E05732N7117M0146N456q7895j08886j05720r805L5501j6548m5926m6419
20108B22753J5402R5247k3936K6027J12713J09867Q9965J05172J33114J0159p6934
20097H19549j07437j84364j47881r8553o2901p113o363k3765L3205K125K3708
20086B40210m470j0602l1147m3264k015L950k5968P5096L034K9553j9135j2976
20074B02266n5657k8228M914O423P9566M2511l9539j00299m5107n62j5343k2321
20062B8624N5536m594J2032K228J6154N5946K6736l78m5372q61k992j7747N6767
$$ plain form
20049 182079 146250 55801 11579 3208 12363 706 -5493 25988 108535 175779 170148 141860
20037 141860 129192 154686 166917 133804 61933 79478 88155 106214 94080 127488 153371 125351
20025 125351 161906 183335 183208 76631 31404 92661 105321 116057 125206 96574 39177 71822
20013 71822 116750 121895 121000 111592 143205 109764 133950 142300 104429 80811 118882 93701 142963
20000 142963 137835 112372 160742 194032 170223 212745 183161 167993 117092 97292 174009 191255
19988 191255 147955 137679 112004 86792 112639 128356 109552 46939 22262 -8913 28931
19977 28931 71509 51538 41952 45912 45148 149069 192333 197904 214433 186244 157961 180220
19965 180220 205206 145533 91869 133443 101852 62561 69098 104592 152233 146379 170167 159223
$$ packed form
20049A82079l5829r0449m4222q371R155j1657o199L1481Q2547O7244n631k8288
20037A41860j2668K5494J2231l3113p1871J7545Q677J8059j2134L3408K5883k8020
20025A25351L6555K1429j27j06577m5227O1257J2660J0736R149k8632n7397L2645
20013G1822M4928N145q95r408L1613l3441K4186Q350l7871k3618L8071k5181M9262
20000A42963n128k5463M8370L3290k3809M2522k9584j5168n0901j9800P6717J7246
19988A91255m3300j0276k5675k5212K5847J5717j8804o2613k4677l1175L7844
19977B8931M2578j9971r586L960p64J03921M3264N571J6529k8189k8283K2259
19965A80220K4986n9673n3664M1574l1591l9291O537L5494M7641n854K3788j0944
$$ plain form
19953 159223 97026 51353 91976 218337 281195 153480 87993 110034 154776 138571 144686
19942 144686 163547 124281 162137 202193 232025 232561 223379 232571 211606 201389 233269 225670
19930 225670 172016 113483 81104 125258 148205 128633 128852 154747 194135 162071 203740 168177
19918 168177 168808 188547 125007 91737 93009 156967 124811 102975 110657 134651 140773 80022
19906 80022 121738 154786 140203 120735 134842 140557 200596 199283 133559 122820 107641 99591
19894 99591 93658 118948 134738 117029 129989 157573 111823 106321 98039 119614 137966 167798
19882 167798 125947 85413 89391 91181 102014 74783 61259 84374 97441 58174 107032 161600
19870 161600 193303 131105 86236 113908 165805 174735 191358 170400 169408 169947 171392 207275 218281
$$ packed form
19953A59223o2197m5673M0623J26361O2858j27715o5487K2041M4742j6205O115
19942A44686J8861l9266L7856M0056K9832N36r182R192k0965j0217L1880p599
19930B25670n3654n8533l2379M4154K2947j9572K19K5895L9388l2064M1669l5563
19918A68177O31J9739o3540l3270J272O3958l2156k1836P682K3994O122o0751
19906H0022M1716L3048j4583j9468J4107N715O0039j313o5724j0739j5179q050
19894I9591n933K5290J5790j7709J2960K7584m5750n502q282K1575J8352K9832
19882A67798m1851m0534L978J790J0833k7231j3524K3115J3067l9267M8858N4568
19870A61600L1703o2198m4869K7672N1897Q930J6623k0958r92N39J445L5883J1006
$$ plain form
19857 218281 248273 284507 249415 224959 222630 228515 195910 177410 228613 292443 300671 289517
19845 289517 286370 270482 271789 247092 272050 305109 306129 302382 326817 283338 228857 229324 271595
19832 271595 265714 275544 309855 314735 295901 269126 269795 315057 392841 433257 414017 394395
19820 394395 412268 382979 327191 298062 269066 252659 247349 254667 229848 261033 299505 315517
19808 315517 279910 281063 281868 280368 275215 283025 318636 298705 296884 318176 343869 264119 240975
19795 240975 307113 321308 349479 398637 418537 329821 257752 332390 328503 356305 364774 381608
19783 381608 369274 319824 431645 451107 386359 364796 403965 472729 517568 529223 513039
19772 513039 500454 517797 558232 569712 593380 590581 639969 687797 707697 636583 617017 583981
$$ packed form
19857B18281K9992L6234l5092k4456k329N885l2605j8500N1203O3830Q228j1154
19845B89517l147j5888J307k4697K4958L3059J020l747K4435m3479n4481M67M2271
19832B71595n881R830L4311M880j8834k6775O69M5262P7784M0416j9240j9622
19820C94395J7873k9289n5788k9129k8996j6407n310P318k4819L1185L8472J6012
19808C15517l5607J153Q05j500n153P810L5611j9931j821K1292K5693p9750k3144
19795B40975O6138J4195K8171M9158J9900q8716p2069P4638l887K7802Q469J6834
19783C81608j2334m9450J11821J9462o4748k1563L9169O8764M4839J1655j6184
19772E13039j2585J7343M0435J1480K3668k799M9388M7828J9900p1114j9566l3036
$$ plain form
19760 583981 521549 568420 577481 533259 455585 419454 452851 466766 475332 556354 569291 572863
19748 572863 593304 534534 423996 386467 397381 416579 383632 386687 422651 442318 471036
19737 471036 508290 559063 564414 577437 566857 526557 485581 516426 573634 523553 462906 523051
19725 523051 548778 571512 585035 598592 551609 550037 511848 478475 499834 576482 585202 661539
19713 661539 688442 657002 654625 693106 748278 762183 783043 819095 840682 847517 874405 840482
19701 840482 855333 930697 962440 943222 920580 888408 880872 865067 928351 916002 921368 975876
19689 975876 1018854 1037674 1089530 1181204 1250112 1300767 1281337 1275794 1336277 1444732 1448571 1482776
19677 1482776 1541509 1546124 1548405 1596272 1627079 1674357 1749005 1870087 1965874 2021811 2112311
$$ packed form
19760E83981o2432M6871R061m4222p7674l6131L3397J3915Q566Q1022J2937L572
19748E72863K0441n8770j10538l7529J0914J9198l2947L055L5964J9667K8718
19737D71036L7254N0773N351J3023j0580m0300m0976L0845N7208n0081o0647O0145
19725E23051K5727K2734J3523J3557m6983j572l8189l3373K1359P6648Q720P6337
19713F61539K6903l1440k377L8481N5172J3905K0860L6052K1587O835K6888l3923
19701H40482J4851P5364L1743j9218k2642l2172p536j5805O3284j2349N366N4508
19689I75876M2978J8820N1856R1674O8908N0655j9430n543O0483J08455L839L4205
19677A482776N8733M615K281M7867L0807M7278P4648J21082R5787N5937R0500
$$ plain form
19666 2112311 2208376 2398562 2622242 2834257 3104243 3517109 4063538 4818869 5827731
19657 5827731 7073095 8379811 9831057 11448159 12354958 11959813 11236794 11174878 11841260
19648 11841260 12830002 14118102 15712391 16303876 14827010 12518760 10925527 10278936
19640 10278936 10225152 10535967 11116395 11973869 13294897 15250091 18045667 22042022 28058989
19631 28058989 37166697 50295884 67119631 86785655 108410833 130923687 145296502
19624 145296502 143321133 125857006 96016775 67264750 47799133 36495868 29840258
19617 29840258 25913146 23688178 22851130 22931153 23697004 25580990 29217592 35480900 44481392
19608 44481392 55255433 66857069 80066398 94608494 99214266 89921975 80168299
$$ packed form
19666B112311R6065J90186K23680K12015K69986M12866N46429P55331J008862
19657E827731J245364J306716J451246J617102R06799l95145p23019o1916O66382
19648A1841260R88742J288100J594289N91485j476866k308250j593233o46591
19640A0278936n3784L10815N80428Q57474J321028J955194K795576L996355O016967
19631B8058989R107708J3129187J6823747J9666024K1625178K2512854J4372815
19624A45296502j975369j7464127k9840231k8752025j9465617j1303265o655610
19617B9840258l927112k224968q37048Q0023P65851J883986L636602O263308R000492
19608D4481392J0774041J1601636J3209329J4542096M605772r292291r753676
$$ plain form
19601 80168299 77216861 79877850 86034067 89622563 81982204 67261610 55548191 50512254
19593 50512254 51785705 58694947 70238450 85088365 102548252 122380225 137306679
19586 137306679 135756995 123417984 104219968 79479101 57484824 42613746 33637322
19579 33637322 28325326 25255124 23507227 22761862 22884453 23839382 25701960 28747645
19571 28747645 33380063 40601261 51863543 67693341 87436205 109955125 134607541
19564 134607541 156962857 164238766 153041775 125119568 89352234 60339277 41954976
19557 41954976 30921932 24120863 19745917 16808585 14737863 13319328 12411848 11757278
19549 11757278 11301033 10945908 10738433 10981433 11746158 12974750 14662132 16722354 19326136
$$ packed form
19601H0168299k951438K660989O156217L588496p640359j4720594j1713419n035937
19593E0512254J273451O909242J1543503J4849915J7459887J9831973J4926454
19586A37306679j549684j2339011j9198016k4740867k1994277j4871078q976424
19579C3637322n311996l070202j747897p45365J22591R54929J862578L045685
19571B8747645M632418P221198J1262282J5829798J9742864K2518920K4652416
19564A34607541K2355316P275909j1196991k7922207l5767334k9012957j8384301
19557D1954976j1033044o801069m374946k937332k070722j418535r07480o54570
19549A1757278m56245l55125k07475K43000P64725J228592J687382K060222K603782
$$ plain form
19540 19326136 21873283 22116766 20190911 18342179 17027600 14786063 11578205 8756172
19532 8756172 6959525 5897981 5292652 4878382 4456769 3941472 3510497 3338469 3238188
19523 3238188 3076559 2897783 2662897 2389814 2214627 2171825 2168703 2227375 2305144 2416845
19513 2416845 2471418 2562181 2600075 2495632 2308078 2132655 1945317 1737930 1651956 1618203
19503 1618203 1582760 1577724 1580494 1553453 1457827 1406906 1325242 1329732 1471919 1586421 1630817
19492 1630817 1709580 1846525 1991620 2154126 2254951 2151284 1951681 1634099 1389262 1176881
19482 1176881 1084284 1025274 963735 924798 890292 774932 693079 704216 831351 776546 730632
19471 730632 766454 836960 777060 665578 652440 696348 764494 807746 747875 717896 734035
$$ packed form
19540A9326136K547147K43483j925855j848732j314579k241537l207858k822033
19532H756172j796647j061544o05329m14270m21613n15297m30975j72028j00281
19523C238188j61629j78776k34886k73083j75187m2802l122N8672P7769J11701
19513B416845N4573R0763L7894j04443j87554j75423j87338k07387q5974l3753
19503A618203l5443n036K770k7041r5626n0921q1664M490J42187J14502M4396
19492A630817P8763J36945J45095J62506J00825j03667j99603l17582k44837k12381
19482A176881r2597n9010o1539l8937l4506j15360q1853J1137J27135n4805m5914
19471G30632L5822P0506n9900j11482j3138M3908O8146M3252n9871k9979J6139
$$ plain form
19460 734035 792276 807805 800967 756360 682796 643333 658004 662777 702006 681402 680427 642778
19448 642778 639220 565592 541369 550395 579579 619531 611951 597217 624969 646649 675425 659232
19436 659232 597457 555453 594638 552914 549548 521025 464636 453366 441766 455345 502599 491712
19424 491712 464147 459587 429566 395419 435561 461106 421872 408848 405038 443766 453508 475900
19412 475900 473526 488105 592885 553333 512466 488829 464991 437669 491491 498803 464223 379830
19400 379830 368522 388697 396120 424238 398745 348634 307588 302292 311584 363541 388307 340066
19388 340066 321383 350918 349649 335487 346801 353935 406075 399636 405414 360417 391114 418620
19376 418620 393243 367393 377515 360987 301878 272183 300128 279210 269769 247450 265619 332334
$$ packed form
19460G34035N8241J5529o838m4607p3564l9463J4671M773L9229k0604r75l7649
19448F42778l558p3628k4223R026K9184L9952p580j4734K7752K1680K8776j6193
19436F59232o1775m2004L9185m1724l366k8523n6389j1270j1600J3579M7254j0887
19424D91712k7565m560l0021l4147M0142K5545l9234j3024l810L8728R742K2392
19412D75900k374J4579J04780l9552m0867k3637k3838k7322N3822P312l4580q4393
19400C79830j1308K0175P423K8118k5493n0111m1046n296R292N1957K4766m8241
19388C40066j8683K9535j269j4162J1314P134N2140o439N778m4997L0697K7506
19376D18620k5377k5850J0122j6528n9109k9695K7945k0918r441k2319J8169O6715
$$ plain form
19364 332334 322365 258795 273917 341750 335204 272100 277168 302970 333925 379830 395415 356309
19352 356309 300848 289343 282573 304762 366697 403488 336955 382228 330627 328271 290552 261505
19340 261505 244957 237951 263372 332410 339839 287399 272119 263239 295190 372076 377516 402219
19328 402219 431613 485421 505850 488536 454695 454160 464178 443236 418593 416383 364850 379368
19316 379368 385191 377526 408600 440719 502479 533364 568478 567785 509893 454182 467821 503103
19304 503103 538664 531204 538859 550824 485981 500038 538046 537246 498684 524796 471095 537577
19292 537577 525035 523727 543169 525935 489455 524097 552845 561600 524351 461751 414698 397876
19280 397876 439616 517892 518188 514637 468510 373501 364799 375936 377666 371611 418187 436081 428058
$$ packed form
19364C32334r969o3570J5122O7833o546o3104N068K5802L0955M5905J5585l9106
19352C56309n5461j1505o770K2189O1935L6791o6533M5273n1601k356l7719k9047
19340B61505j6548p006K5421O9038P429n2440j5280q880L1951P6886N440K4703
19328D02219K9394N3808K0429j7314l3841n35J0018k0942k4643k210n1533J4518
19316C79368N823p665L1074L2119O1760L0885L5114o93n7892n5711J3639L5282
19304E03103L5561p460P655J1965o4843J4057L8008q00l8562K6112n3701O6482
19292E37577j2542j308J9442j7234l6480L4642K8748Q755l7249o2600m7053j6822
19280C97876M1740P8276K96l551m6127r5009q702J1137J730o055M6576J7894q023
$$ plain form
19267 428058 451064 474187 538892 455656 377827 378605 437382 482567 496727 492864 451022 444061
19255 444061 436846 385525 417226 457813 483223 540479 619226 615902 663102 674673 616498 560884
19243 560884 528822 541367 562855 593240 643394 652301 617029 647452 636695 620406 574588 546423
19231 546423 543177 523445 499853 435695 410301 428493 493019 525639 508451 532894 543334 542206
19219 542206 561138 610782 601066 524433 442740 479915 545361 603631 668005 666034 639089 657950
19207 657950 698354 646025 596608 622414 698708 724228 753355 730890 676392 686141 730026 719555
19195 719555 704547 656252 690431 693383 675662 664489 724634 825831 807437 732845 749806
19184 749806 809163 827041 826978 829886 862608 873110 907572 991824 1088638 1129999 1159391 1188145
$$ packed form
19267D28058K3006K3123O4705q3236p7829P78N8777M5185J4160l863m1842o961
19255D44061p215n1321L1701M0587K5410N7256P8747l324M7200J1571n8175n5614
19243E60884l2062J2545K1488L0385N0154Q907l5272L0423j0757j6289m5818k8165
19231E46423l246j9732k3592o4158k5394J8192O4526L2620j7188K4443J0440j128
19219E42206J8932M9644r716p6633q1693L7175O5446N8270O4374j971k6945J8861
19207F57950M0404n2329m9417K5806P6294K5520K9127k2465n4498R749M3885j0471
19195G19555j5008m8295L4179K952j7721j1173O0145J01197j8394p4592J6961
19184G49806N9357J7878o3K908L2722J0502L4462Q4252R6814M1361K9392K8754
$$ plain form
19172 1188145 1207465 1258847 1301788 1328595 1345228 1306294 1325603 1366756 1456700 1578254 1646021
19161 1646021 1754752 1882406 1893618 1861383 1869983 1952985 2008184 2041074 2140338 2236356 2308999
19150 2308999 2288773 2201237 2117884 2146928 2175565 2247091 2349692 2470522 2646403 2805309
19140 2805309 2980491 3161775 3397546 3774089 4279249 5048506 6103619 7526735 9464216
19131 9464216 11782477 14426664 17071580 18739629 19198509 18421763 15880146 12800338
19123 12800338 10610809 9422378 8842526 8698175 8780869 8810932 8923729 9289092 10047407
19114 10047407 11148170 12658323 14661390 17393699 20952359 25748885 32831650 43238026
19106 43238026 57329967 74616863 94072684 115274695 133284208 137735160 127407911
$$ packed form
19172A188145J9320N1382M2941K6807J6633l8934J9309M1153Q9944J21554O7767
19161A646021J08731J27654J1212l2235Q600Q3002N5199L2890R9264R6018P2643
19150B308999k0226q7536q3353K9044K8637P1526J02601J20830J75881J58906
19140B805309J75182J81284K35771L76543N05160P69257J055113J423116J937481
19131I464216K318261K644187K644916J668049M58880p76746k541617l079808
19123A2800338k189529j188431n79852j44351Q2694L0063J12797L65363P58315
19114A0047407J100763J510153K003067K732309L558660M796526P082765J0406376
19106D3238026J4091941J7286896J9455821K1202011J8009513M450952j0327249
$$ plain form
19099 127407911 103433962 74925396 53133072 39825897 32078297 27713636 25531034
19092 25531034 24713605 24891433 25891831 28030971 31766225 37818608 46702269 57867843
19084 57867843 70801164 86014928 103111592 113958088 112503691 107494910 107463986 104670023
19076 104670023 89421345 71767838 61619476 59798951 63424809 69828138 77666660
19069 77666660 86927642 92852749 87417161 75486234 67662492 67020737 71098073 77710521
19061 77710521 87069915 94612473 86413490 65710252 47517984 36707818 31346787 29220944
19053 29220944 29349104 31331015 35138086 41454077 51473857 66189724 85317525 107829515
19045 107829515 132615005 158263845 173861496 169447573 146959415 110910472 76239878
$$ packed form
19099A27407911k3973949k8508566k1792324j3307175p747600m364661k182602
19092B5531034q17429J77828J000398K139140L735254O052383Q883661J1165574
19084E7867843J2933321J5213764J7096664J0846496j454397n008781l0924k793963
19076A04670023j5248678j7653507j0148362j820525L625858O403329P838522
19069G7666660R260982N925107n435588j1930927p823742o41755M077336O612448
19061G7710521R359394P542558q198983k0703238j8192268j0810166n361031k125843
19053B9220944J28160J981911L807071O315991J0019780J4715867J9127801K2511990
19045A07829515K4785490K5648840J5597651m413923k2488158l6048943l4670594
$$ plain form
19038 76239878 52281816 37823320 29045087 23354118 19520490 16888246 15024223 13618947
19030 13618947 12561866 11894648 11459613 11350073 11709619 12591230 14052153 15947335 18015986
19021 18015986 20320320 22859823 24279749 22737574 19744228 17493064 16492705 16537994
19013 16537994 17043852 16048316 13073207 9913559 7573023 5953076 4863393 4123471
19005 4123471 3604421 3253840 2917927 2633624 2538169 2454734 2319326 2218852 2150849 2020684
18995 2020684 1882453 1816676 1832546 1740072 1642337 1608116 1667891 1728937 1623361 1543225 1487256
18984 1487256 1398685 1375686 1421320 1384411 1340379 1292737 1294758 1253903 1264022 1241895 1112749
18973 1112749 1019727 1037682 1074156 1063490 1017560 932848 900479 911389 869811 864823 910125
$$ packed form
19038G6239878k3958062j4458496q778233n690969l833628k632244j864023j405276
19030A3618947j057081o67218m35035j09540L59546Q81611J460923J895182K068651
19021A8015986K304334K539503J419926j542175k993346k251164j000359M5289
19013A6537994N05858r95536k975109l159648k340536j619947j089683p39922
19005D123471n19050l50581l35913k84303r5455q3435j35408j00474o8003j30165
18995B020684j38231o5777J5870r2474r7735l4221N9775O1046j05576q0136n5969
18984A487256q8571k2999M5634l6909m4032m7642K021m0855J0119k2127j29146
18973A112749r3022J7955L6474j0666m5930q4712l2369J0910m1578m988M5302
$$ plain form
18962 910125 994819 1060966 984375 964646 966473 916134 883229 818827 851739 855522 860755 830837
18950 830837 790560 756797 748767 696567 702899 751069 791785 756472 717025 767930 814846 786117
18938 786117 773741 781473 784452 718768 695524 751956 719555 738433 758855 730532 686613 651555
18926 651555 645281 712068 766901 738041 710235 670798 637571 609543 599177 626166 627806 645041
18914 645041 673481 612947 548062 577362 642755 657310 674294 695780 674191 583205 584548 617336
18902 617336 641941 597963 573050 514479 485760 500583 552828 559520 550392 543596 547017 580617
18890 580617 535593 526195 580356 573954 532993 592465 658172 625795 495119 452892 467151 443444
18878 443444 413908 462400 489624 512966 542342 536762 521017 572903 535101 513089 524700 477180
$$ packed form
18962I10125Q4694O6147p6591j9729J827n0339l2905o4402L2912L783N233k9918
18950H30837m0277l3763q030n2200O332M8170M0716l5313l9447N0905M6916k8729
18938G86117j2376P732K979o5684k3244N6432l2401J8878K0422k8323m3919l5058
18926F51555o274O6787N4833k8860k7806l9437l3227k8028j0366K6989J640J7235
18914F45041K8440o0534o4885K9300O5393J4555J6984K1486k1589r0986J343L2788
18902F17336K4605m3978k4913n8571k8719J4823N2245O692r128o796L421L3600
18890E80617m5024r398N4161o402m0961N9472O5707l2377j30676m2227J4259k3707
18878D43444k9536M8492K7224K3342K9376n580j5745N1886l7802k2012J1611m7520
$$ plain form
18866 477180 398173 366585 369813 387890 461196 507275 476575 435756 424837 473055 546672 609986
18854 609986 597015 605807 599814 598870 557221 503684 524771 543069 567842 565073 544109 574506
18842 574506 598456 544749 409633 370041 362232 412453 477556 516288 584072 623029 650794
18831 650794 706265 729040 743205 692106 742458 810575 792319 743545 793962 835788 887145
18820 887145 913315 1027005 1038180 944843 919879 874748 774406 727167 701690 728329 766678
18809 766678 778659 794663 751613 730198 729434 729999 754942 692875 626027 626543 698670 698059 661109
18796 661109 646397 632948 673619 736054 810424 832320 870568 877277 857716 837419 840423 895066
18784 895066 921956 934553 937205 856605 843440 795556 797256 836067 823896 868723 896966 944925
$$ packed form
18866D77180p9007l1588L228J8077P3306M6079l0700m0819j0919M8218P3617O3314
18854F09986j2971Q792n993r44m1649n3537K1087J8298K4773k769k0964L0397
18842E74506K3950n3707j35116l9592p809N0221O5103L8732O7784L8957K7765
18831F50794N5471K2775J4165n1099N0352O8117j8256m8774N0417M1826N1357
18820H87145K6170J13690J1175r3337k4964m5131j00342m7239k5477K6639L8349
18809G66678J1981J6004m3050k1415p64N65K4943o2067o6848N16P2127o11l6950
18796F61109j4712j3449M0671O2435P4370K1896L8248O709j9561k0297L004N4643
18784H95066K6890J2597K652q0600j3165m7884J700L8811j2171M4827K8243M7959
$$ plain form
18772 944925 1039604 1167018 1236313 1295315 1274587 1356552 1411751 1392640 1260515 1160054 1160389
18761 1160389 1128062 1029220 954265 950512 969335 936932 904904 974868 1005959 1056991 1070192
18750 1070192 1131497 1135506 1037843 1078526 1111844 1057796 903842 889743 917115 910955 876438
18739 876438 908326 996543 1094413 1219850 1350555 1491369 1568647 1604313 1593044 1579251 1620181
18728 1620181 1710944 1805256 1822124 1619415 1415273 1289925 1187316 1190139 1179474 1116173 1110109
18717 1110109 1143787 1200289 1262113 1261977 1293705 1278647 1287695 1253209 1274398 1251192 1259230 1284758
18705 1284758 1322904 1358836 1375767 1421139 1434821 1493680 1550949 1535348 1502814 1542631 1629936
18694 1629936 1670491 1755834 1763998 1822583 1943046 2064203 2160672 2229872 2208174 2177244 2171330
$$ packed form
18772I44925R4679J27414O9295N9002k0728Q1965N5199j9111j32125j00461L35
18761A160389l2327r8842p4955l753J8823l2403l2028O9964L1091N1032J3201
18750A070192O1305M009r7663M0683L3318n4048j53954j4099K7372o160l4517
18739H76438L1888Q8217R7870J25437J30705J40814P7278L5666j1269j3793M0930
18728A620181R0763R4312J6868k02709k04142j25348j02609K823j0665o3301o064
18717A110109L3678N6502O1824j36L1728j5058R048l4486K1189k3206Q038K5528
18705A284758L8146L5932J6931M5372J3682N8859N7269j5601l2534L9817Q7305
18694A629936M0555Q5343Q164N8585J20463J21157R6469O9200k1698l0930n914
$$ plain form
18683 2171330 2209285 2212268 2227063 2322627 2384630 2501533 2650884 2761876 2869855 3036671
18673 3036671 3181189 3283041 3262491 3277512 3385746 3591335 3928934 4326597 4742059 5083706
18663 5083706 5529589 6062836 6239425 5923998 5546438 5314079 5304956 5478434 5707815 6052596
18653 6052596 6543923 7060239 7643413 8427664 9483207 10994400 13227401 16504700 21014940
18644 21014940 26368495 32303663 39072654 46389089 49753247 46552448 42084199 39550136
18636 39550136 36104748 30630426 25691375 22729599 21497797 21339311 21941945 22961558
18628 22961558 24227390 25663152 27588413 30276598 34295808 40408393 49289004 62118628
18620 62118628 81153848 109159581 147317961 192790584 241780387 293742979 339536967
$$ packed form
18683B171330L7955K983J4795R5564O2003J16903J49351J10992J07979J66816
18673C036671J44518J01852k0550J5021J08234K05589L37599L97663M15462L41647
18663E083706M45883N33247J76589l15427l77560k32359r123J73478K29381L44781
18653F052596M91327N16316N83174P84251J055543J511193K233001L277299M510240
18644B1014940N353555N935168O768991P316435L364158l200799m468249k534063
18636C9550136l445388n474322m939051k961776j231802j58486O02634J019613
18628B2961558J265832J435762J925261K688185M019210O112585Q880611J2829624
18620F2118628J9035220K8005733L8158380M5472623M8989803N1962592M5793988
$$ plain form
18613 339536967 348513269 302516533 223763279 153314401 107313821 80488354 64956513
18606 64956513 56010386 51329117 49578330 50068392 52651175 57601201 65778641 78533295
18598 78533295 96875544 120583597 148452837 180674185 217873295 245753796 244550615
18591 244550615 228815987 220059828 207093588 173262132 134637333 108655023 97653003
18584 97653003 98572098 108525517 123930648 141981738 163021487 185332900 191492650 174674601
18576 174674601 156471289 150315659 154612773 166226045 177517141 166911218 133422949
18569 133422949 99682509 76612349 62321677 53724509 49118956 47530858 48773520
18562 48773520 53101748 61083375 74186010 95253838 126331468 164499433 204745880
$$ packed form
18613C39536967Q976302m5996736p8753254p0448878m6000580k6825467j5531841
18606F4956513q946127m681269j750787M90062K582783M950026Q177440J2754654
18598G8533295J8342249K3708053K7869240L2221348L7199110K7880501j203181
18591B44550615j5734628q756159j2966240l3831456l8624799k5982310j1002020
18584I7653003R19095R953419J5405131J8051090K1039749K2311413O159750j6818049
18576A74674601j8203312o155630M297114J1613272J1291096j0605923l3488269
18569A33422949l3740440k3070160j4290672q597168m605553j588098J242662
18562D8773520M328228P981627J3102635K1067828L1077630L8167965M0246447
$$ plain form
18555 204745880 246087490 292294205 315096234 268749599 187711875 123215163 84542827
18548 84542827 62167443 48395345 39484139 33509712 29329089 26106858 23609616 21785303
18540 21785303 20505761 19754502 19421452 19724809 20820443 22592115 24577380 26489371
18532 26489371 28099258 28571947 26961139 25084551 24609423 25444552 27193136 29631242
18524 29631242 29471087 24538393 18282125 13613463 10705400 8937352 7775276 6934595
18516 6934595 6430632 6087907 5713596 5348777 5073752 4866707 4707829 4595888 4614510 4634112
18506 4634112 4618088 4403628 4071968 3741205 3467351 3252838 3022368 2853998 2735393 2591758
18496 2591758 2441607 2325279 2315070 2292009 2204839 2180826 2177201 2187829 2216611 2231506 2187188
$$ packed form
18555B04745880M1341610M6206715K2802029m6346635q1037724o4496712l8672336
18548H4542827k2375384j3772098q911206n974427m180623l222231k497242j824313
18540B1785303j279542p51259l33050L03357J095634J771672J985265J911991
18532B6489371J609887M72689j610808j876588m75128Q35129J748584K438106
18524B9631242j60155m932694o256268m668662k908063j768048j162076q40681
18516F934595n03963l42725l74311l64819k75025k07045j58878j11941J8622J9602
18506D634112j6024k14460l31660l30763k73854k14513k30470j68370j18605j43635
18496B591758j50151j16328j0209k3061q7170k4013l625J0628K8782J4895m4318
$$ plain form
18485 2187188 2083433 2031887 1968752 1931773 1815662 1700588 1586879 1558626 1503531 1447638
18475 1447638 1366164 1325238 1316928 1320130 1377120 1467788 1535103 1554613 1473616 1341790 1213118
18464 1213118 1208178 1182227 1177754 1135781 1147688 1142208 1097866 1114720 1133975 1068892 965771 1017218
18452 1017218 1119392 1154790 1143732 1168052 1236707 1234305 1172246 1087861 1037601 979881 933365
18441 933365 886910 814763 776057 751150 782814 760656 825224 876936 916942 926149 905521 903914
18429 903914 933676 880542 801209 791658 901188 869448 863678 897454 811648 745214 738319 678147
18417 678147 613628 546324 556668 594665 622265 553453 510300 536980 557912 564556 590640 643689
18405 643689 677736 658474 685183 641851 573272 572330 593345 572105 541407 495210 443148 434820
$$ packed form
18485B187188j03755n1546o3135l6979j16111j15074j13709k8253n5095n5893
18475A447638q1474m0926q310L202N6990R0668O7315J9510q0997j31826j28672
18464A213118m940k5951m473m1973J1907n480m4342J6854J9255o5083j03121N1447
18452A017218J02174L5398j1058K4320O8655k402o2059q4385n0260n7720m6516
18441I33365m6455p2147l8706k4907L1664k2158O4568N1712M0006R207k0628j607
18429I03914K9762n3134p9333r551J09530l1740n770L3776q5806o6434o895o0172
18417F78147o4519o7304J0344L7997K7600o8812m3153K6680K0932O644K6084N3049
18405F43689L4047j9262K6709m3332o8579r42K1015k1240l0698m6197n2062q328
$$ plain form
18393 434820 492244 521972 457658 452810 416278 402457 464300 454844 451060 448855 476891 509955
18381 509955 591753 626302 589046 516276 449311 356189 315790 339781 341727 330686 335698 329938
18369 329938 307125 397557 440786 459662 413080 436252 459649 412812 370279 332162 345402
18358 345402 322758 286107 272991 239787 268928 241490 243551 185201 192685 218011 277771 295500
18346 295500 307918 297374 319760 356313 349353 320949 318049 309714 251421 156373 208845 265269
18334 265269 237938 263149 330591 298360 320288 403835 408097 398288 350673 336781 345762 322497
18322 322497 318044 319197 349189 357749 303890 293171 360056 363208 321788 274981 260037 312017
18310 312017 266928 243538 245057 309436 342317 352330 324117 299183 290848 335048 306291 272731
$$ packed form
18393D34820N7424K9728o4314m848l6532j3821O1843r456l784k205K8036L3064
18381E09955Q1798L4549l7256p2770o6965r3122m0399K3991J946j1041N012n760
18369C29938k2813R0432M3229J8876m6582K3172K3397m6837m2533l8117J3240
18358C45402k2644l6651j3116l3204K9141k7438K061n8350P484K5326N9760J7729
18346B95500J2418j0544K2386L6553o960k8404k900q335n8293r5048N2472N6424
18334B65269k7331K5211O7442l2231K1928Q3547M262r809m7615j3892Q981k3265
18322C22497m453J153K9992Q560n3859j0719O6885L152m1420m6807j4944N1980
18310C12017m5089k3390J519O4379L2881J0013k8213k4934q335M4200k8757l3560
$$ plain form
18298 272731 259544 215988 226429 247759 287315 254032 302500 371870 326538 240944 209874
18287 209874 176981 122111 175761 236819 208828 162099 182201 184183 164982 133568 188632 249989
18275 249989 279163 246453 206581 166085 134320 162073 187347 248126 269354 183140 119674
18264 119674 118870 146153 208389 220229 180803 158799 149542 154996 132938 137107 146014 162209 174715
18251 174715 110601 120566 161366 168075 165354 216110 238639 213133 212123 148692 149337 166943 127341
18238 127341 170543 196558 169398 164231 159274 165998 117039 123416 119497 138390 176349 211574
18226 211574 201596 182393 224474 230948 161043 90917 116047 150295 190930 200316 167540 170875
18214 170875 154615 138965 102790 133955 175681 153543 168691 172167 192355 219068 234925 264317
$$ packed form
18298B72731j3187m3556J0441K1330L9556l3283M8468O9370m5332q5594l1070
18287B09874l2893n4870N3650O1058k7991m6729K0102J982j9201l1414N5064O1357
18275B49989K9174l2710l9872m0496l1765K7753K5274O0779K1228q6214o3466
18264A19674q04K7283O2236J1840l9426k2004r257N454k2058M169Q907J6195J2506
18251A74715o4114R965M0800O709k721N0756K2529k5506j010o3431O45J7606l9602
18238A27341M3202K6015k7160n167m957O724m8959O377l919J8893L7959L5225
18226B11574r978j9203M2081O474o9905p0126K5130L4248M0635R386l2776L335
18214A70875j6260j5650l6175L1165M1726k2138J5148L476K0188K6713J5857K9392
$$ plain form
18202 264317 233219 222265 166969 141507 93808 154787 181880 161275 233796 238258 268420 225213
18190 225213 219140 181624 234499 241146 233751 236235 281529 342541 354590 336272 268769 197821
18178 197821 185861 164347 182327 187861 237653 252061 271912 274648 288607 307782 354049 346020
18166 346020 331230 372981 408423 420341 383711 405876 434605 413004 363503 328641 347307
18155 347307 364816 400458 441337 467232 490431 513947 495373 561726 627156 615158 615953 603253
18143 603253 654022 692945 692708 747502 715286 714780 845697 1000609 1053719 1100730 1121510 1215801
18131 1215801 1260543 1306110 1460422 1638879 1805873 1992826 2178648 2395917 2662736 3001602
18121 3001602 3483191 4166913 4992319 5968538 7290315 9131956 11797055 15798342 22123862
$$ packed form
18202B64317l1098j0954n5296k5462m7699O0979K7093k0605P2521M462L0162m3207
18190B25213o073l7516N2875O647p395K484M5294O1012J2049j8318o7503p0948
18178A97821j1960k1514J7980N534M9792J4408J9851K736J3959J9175M6267q029
18166C46020j4790M1751L5442J1918l6630K2165K8729k1601m9501l4862J8666
18155C47307J7509L5642M0879K5895K3199K3516j8574O6353O5430j1998P95j2700
18143F03253N0769L8923k37N4794l2216n06J30917J54912N3110M7011K0780R4291
18131A215801M4742M5567J54312J78457J66994J86953J85822K17269K66819L38866
18121C001602M81589O83722Q25406R76219J321777J841641K665099M001287O325520
$$ plain form
18112 22123862 31619919 43505686 56038771 68888801 84058722 92778697 78164466
18105 78164466 52139890 32274960 20967715 14712842 10985415 8615973 7021923 5845404
18097 5845404 4901398 4256418 3726227 3334777 3063888 2810006 2568898 2277300 1953602
18088 1953602 1683029 1509111 1407367 1298624 1183574 1099064 1009466 922266 899817 826915
18078 826915 765913 791631 850021 921798 947415 963090 996500 1079994 1206972 1284135 1324062
18067 1324062 1341991 1326613 1185599 1048782 988714 953980 993950 1086456 1194822 1284933 1294441
18056 1294441 1324145 1337789 1241497 1206725 1235045 1235027 1249207 1208625 1209067 1095985 1065969 1074121
18044 1074121 1055343 1000208 932848 863662 806581 689121 559301 455392 379226 340625 303438
$$ packed form
18112B2123862R496057J1885767J2533085J2850030J5169921Q719975j4614231
18105G8164466k6024576j9864930j1307245o254873l727427k369442j594050j176519
18097E845404r44006o44980n30191l91450k70889k53882k41108k91598l23698
18088A953602k70573j73918j01744j08743j15050q4510q9598q7200k2449p2902
18078H26915o1002K5718N8390P1777K5617J5675L3410Q3494J26978P7163L9927
18067A324062J7929j5378j41014j36817o0068l4734L9970R2506J08366R0111R508
18056A294441K9704J3644r6292l4772K8320j8J4180m0582M42j13082l0016Q152
18044A074121j8778n5135o7360o9186n7081j17460j29820j03909p6166l8601l7187
$$ plain form
18033 303438 280776 240036 161067 142322 219157 275487 248037 280570 252498 292750 446127
18022 446127 536812 561743 554638 601565 555365 481841 377065 351757 317355 346592 397996
18011 397996 469738 557424 590235 597201 568441 517969 478044 454950 493328 578471 611262 624982
17999 624982 625900 536468 459123 462170 484250 570920 553336 441304 386113 271458 216746 198593
17987 198593 174864 227699 256788 173534 126690 140182 122667 135431 111022 118337 156433 96877
17975 96877 72283 81438 75240 60956 51260 69315 70796 36716 29773 29360 48146 102040 100991
17962 100991 106336 158473 174383 159879 117038 142193 116708 121504 117674 97564 112481 82414
17950 82414 53911 14352 -9154 24344 20172 9174 -22543 1182 43791 50589 103965 89107
$$ packed form
18033C03438k2662m0740p8969j8745P6835N6330k7450L2533k8072M0252J53377
18022D46127R0685K4931p105M6927m6200p3524j04776k5308l4402K9237N1404
18011C97996P1742Q7686L2811O966k8760n0472l9925k3094L8378Q5143L2791J3720
17999F24982R18q9432p7345L047K2080Q6670j7584j12032n5191j14655n4712j8153
17987A98593k3729N2835K9089q3254m6844J3492j7515J2764k4409P315L8096n9556
17975I6877k4594R155o198j4284r696J8055J481l4080o943m13J8786N3894j049
17962A00991N345N2137J5910j4504m2841K5155k5485M796l830k0110J4917l0067
17950H2414k8503l9559k3506L3498m172j0998l1717K3725M2609O798N3376j4858
$$ plain form
17938 89107 58122 39346 3510 -35423 24527 50600 37296 32627 5435 6515 47204 63600
17926 63600 99967 89106 32371 38392 47486 48275 29151 75722 122128 84886 52281 -13009
17914 -13009 3960 42350 88190 52256 31827 18804 3401 -27232 -54856 -83037 -34870 -15794
17902 -15794 9211 27412 -14055 -59623 1153 56287 48437 57255 59247 48621 61499 97121
17890 97121 79574 27074 13498 -10710 -60193 -58525 -54506 -45344 -51358 -51322 66496 107283 136559
17877 136559 107042 99805 97796 66654 29455 6938 -41545 -34009 11949 32845 -43755 -6182
17865 -6182 31358 -18494 -41133 -64067 -59657 -16534 4467 15363 33945 19175 49072 29208
17853 29208 -5450 16826 -50106 -55513 13617 73766 57784 60461 59075 66652 89361 43090
$$ packed form
17938H9107l0985j8776l5836l8933N9950K6073j3304m669k7192J080M0689J6396
17926F3600L6367j0861n6735O021R094P89j9124M6571M6406l7242l2605o5290
17914a3009J6969L8390M5840l5934k0429j3023j5403l0633k7624k8181M8167J9076
17902a5794K5005J8201m1467m5568O0776N5134p850Q818J992j0626J2878L5622
17890I7121j7547n2500j3576k4208m9483J668M019R162o014L6J17818M0787K9276
17877A36559k9517p237k009l1142l7199k2517m8483P536M5958K0896p6600L7573
17865f182L7540m9852k2639k2934M410M3123K1001J0896J8582j4770K9897j9864
17853B9208l4658K2276o6932n407O9130O0149j5982K677j386P577K2709m6271
$$ plain form
17841 43090 73834 126383 51819 -6101 44115 67418 46008 -15698 -23612 15070 63552 48469
17829 48469 34090 50653 34160 -42333 -4588 61620 -2245 -41616 18181 61419 979 -15259
17817 -15259 25090 64831 90332 20002 4994 19990 43162 95045 101705 53761 15545 -28473
17805 -28473 -69392 -13033 2048 23799 1381 7871 -45465 -23441 -43708 -66330 8423 36339
17793 36339 14390 5551 -10091 -1402 -3553 -41702 -12224 9699 -3406 9232 56916 54933
17781 54933 2380 -12774 60668 75499 95522 90250 96562 50154 66030 117544 126228 148199
17769 148199 143169 110857 69660 42071 -12883 19778 32180 -5690 6011 17193 -59988 -137429
17757 -137429 -96229 -114913 -65068 -1519 -31183 -38473 -41931 -103331 -94410 -56649 -52662 -22155
$$ packed form
17841D3090L0744N2549p4564n7920N0216K3303k1410o1706p914L8682M8482j5083
17829D8469j4379J6563j6493p6493L7745O6208o3865l9371N9797M3238o0440j6238
17817a5259M0349L9741K5501p0330j5008J4996K3172N1883O660m7944l8216m4018
17805b8473m0919N6359J5081K1751k2418O490n3336K2024k0267k2622P4753K7916
17793C6339k1949q839j5642Q689k151l8149K9478K1923j3105J2638M7684j983
17781E4933n2553j5154P3442J4831K0023n272O312m6408J5876N1514Q684K1971
17769A48199n030l2312m1197k7589n4954L2661J2402l7870J1701J1182p7181p7441
17757a37429M1200j8684M9845O3549k9664p290l458o1400Q921L7761L987L0507
$$ plain form
17745 -22155 -24449 4974 1558 -29557 -6828 55115 37306 33931 28984 11913 35298 99056
17733 99056 69692 26420 14433 -28391 -69723 2327 56031 69853 128559 139965 131912 120022
17721 120022 15422 15250 15261 -20582 -12311 -8026 11141 58259 102574 98372 67105 111930 58565
17708 58565 34554 19844 -29221 13419 71504 90043 44514 35638 19620 12945 32015 -1072
17696 -1072 -9444 48161 57499 53509 16932 -31542 -11908 -71288 -10352 -11016 23123 37109 -5763
17683 -5763 -9184 -4063 35215 52323 122701 112162 87078 46220 88930 88362 66853 28210 -41923
17670 -41923 -73005 -73749 -50800 25538 29678 25598 9724 10711 -16055 -63003 -91810 -60916 -26215
17657 -26215 -15211 -54076 -32542 5219 2374 -20904 39418 37843 14268 37705 65497 49384
$$ packed form
17745b2155k294K9423l416l1115K2729O1943j7809l375m947j7071K3385O3758
17733I9056k9364m3272j1987m2824m1332P2050N3704J3822N8706J1406q053j1890
17721A20022j04600j72J1l5843Q271M285J9167M7118M4315m202l1267M4825n3365
17708E8565k4011j4710m9065M2640N8085J8539m5529q876j6018o675J9070l3087
17696a072q372N7605R338l990l6577m8474J9634n9380O0936o64L4139J3986m2872
17683e763l421N121L9278J7108P0378j0539k5084m0858M2710n68k1509l8643p0133
17670d1923l1082p44K2949P6338M140m080j5874R87k6766m6948k8807L0894L4701
17657b6215J1004l8865K1534L7761k845k3278O0322j575k3575K3437K7792j6113
$$ plain form
17645 49384 39058 33977 -25790 -76825 -77768 -75115 -54163 -77018 -105857 -94731 8543 10364
17633 10364 2059 -16724 835 70606 62989 46916 56036 109 -29144 -42075 16449 111246
17621 111246 94049 -9529 -28602 -5491 -20235 3615 33699 -2941 -52370 -46114 -10301
17610 -10301 49198 53021 55952 28395 19845 57723 41274 -4873 -10253 -28091 -102290 -126285
17598 -126285 -73496 -26350 -55504 -81073 -30060 46185 -9047 -68302 -41301 11349 -54767
17587 -54767 -70201 -650 24693 33093 7365 61652 125137 144665 153290 93362 9371 -54493
17575 -54493 -117515 -60982 2794 50326 97147 95852 75507 33151 -43384 -64651 -35908 -1377
17563 -1377 43682 94961 144015 154090 92686 48230 87803 14455 25677 56704 8748 64536
$$ packed form
17645D9384j0326n081n9767n1035r43K653K0952k2855k8839J1126J03274J821
17633A0364q305j8783J7559O9771p617j6073R120n5927k9253j2931N8524R4797
17621A11246j7197j03578j9073K3111j4744K3850L0084l6640m9429O256L5813
17610a0301N9499L823K931k7557q550L7878j6449m6147n380j7838p4199k3995
17598a26285N2789M7146k9154k5569N1013P6245n5232n9255K7001N2650o6116
17587e4767j5434O9551K5343Q400k5728N4287O3485J9528Q625n9928q3991o3864
17575e4493o3022N6533O3776M7532M6821j295k0345m2356p6535k1267K8743L4531
17563a377M5059N1279M9054J0075o1404m4456L9573p3348J1222L1027m7956N5788
$$ plain form
17551 64536 74365 4795 -28517 14693 91394 119947 91154 75133 62804 68492 67650 56706
17539 56706 96892 53500 184 -12402 -25923 -37133 -23526 -34371 48737 97655 86459 57994
17527 57994 75096 73415 73603 76517 70977 35281 29337 -8775 -19972 25779 5593 40867 71920
17514 71920 64538 44571 60261 11936 -28105 19169 71927 86789 109427 75384 38450 31351
17502 31351 3473 -19340 8234 46087 37846 2438 7242 25976 49534 73607 77980 38486
17490 38486 18575 37666 27730 2711 44110 108753 111183 83791 79464 55380 -17964 43228
17478 43228 33312 -42135 -19984 57933 70377 64484 82192 82663 95315 75793 48589 55758 107286
17465 107286 126868 49637 72171 69127 88216 90446 9113 21927 50457 95593 17062 18793
$$ packed form
17551F4536R829o9570l3312M3210P6701K8553k8793j6021j2329N688q42j0944
17539E6706M0186m3392n3316j2586j3521j1210J3607j0845Q3108M8918j1196k8465
17527E7994J7102j681J88K914n540l5696n944l8112j1197M5751k0186L5274L1053
17514G1920p382j9967J5690m8325m0041M7274N2758J4862K2638l4043l6934p099
17502C1351k7878k2813K7574L7853q241l5408M804J8734K3558K4073M373l9494
17490C8486j9911J9091r936k5019M1399O4643K430k7392m327k4084p3344O1192
17478D3228r916p5447K2151P7917J2444n893J7708M71J2652j9522k7204P169N1528
17465A07286J9582p7231K2534l044J9089K230q1333J2814K8530M5136p8531J731
$$ plain form
17453 18793 13919 27741 34698 -15462 25184 49458 82394 105228 175544 256209 341812 367012
17441 367012 475215 552098 396129 198117 120326 91313 59135 92715 98454 46642 27862
17430 27862 55727 61519 51436 102713 83068 76052 141949 170032 97369 49126 87004 103169
17418 103169 64097 31797 18210 23466 -63858 -68530 -20920 -137144 -143765 -117529 -92807 -34749
17406 -34749 -59998 -97687 -80460 -68055 -66931 -46651 -42242 -30793 -44475 -32982 34672 -674
17394 -674 -21107 -36557 -37947 43232 72797 76232 61810 57916 113160 145347 139908 83414 26936
17381 26936 -7839 30628 54551 -12157 -41850 -85794 -67487 -83598 -151235 -118152 -123215 -74481
17369 -74481 51619 88277 100781 72966 65082 45306 9854 15871 40490 76676 64361 57044
$$ packed form
17453A8793m874J3822O957n0160M0646K4274L2936K2834P0316Q0665Q5603K5200
17441C67012J08203P6883j55969j98012p7791k9013l2178L3580N739n1812j8780
17430B7862K7865N792j0083N1277j9645p016O5897K8083p2663m8243L7878J6165
17418A03169l9072l2300j3587N256q7324m672M7610j16224o621K6236K4722N8058
17406c4749k5249l7689J7227J2405J124K0280M409J1449j3682J1493O7654l5346
17394f74k0433j5450j390Q1179K9565L435j4422l894N5244L2187n439n6494n6478
17381B6936l4775L8467K3923o6708k9693m3944J8307j6111o7637L3083n063M8734
17369g4481J26100L6658J2504k7815p884j9776l5452O017K4619L6186j2315p317
$$ plain form
17357 57044 26879 -71584 -112173 -33757 57091 88806 32385 4781 35209 49679 34230 -20855
17345 -20855 -18403 -40920 -13595 9239 4630 16328 23281 -6628 -23232 -49896 -78805 -104533
17333 -104533 -91712 -126872 -62751 8887 75495 33499 -9897 35234 -19125 -87232 -79173 -54383
17321 -54383 1112 44944 44565 45056 4993 10688 11098 -19297 -46680 -66571 -43230 -44348 -25549
17308 -25549 3994 -11646 -63155 -100379 -98925 -34265 6393 -8538 -33851 -26830 41577 55520
17296 55520 -6064 -60448 -48766 -48182 -57909 -32544 13756 18131 -38405 -84735 -71987 -10859
17284 -10859 20397 53917 107085 88683 58840 35809 19662 26478 20292 -30733 -26070 -53576
17272 -53576 -101863 -49339 -11760 16079 -5752 3154 18770 -41330 -113510 -97350 -82436 -49365
$$ packed form
17357E7044l0165r8463m0589P8416R0848L1715n6421k7604L0428J4470j5449n5085
17345b0855K452k2517K7325K2834m609J1698O953k9909j6604k6664k8909k5728
17333a04533J2821l5160O4121P1638O6608m1996m3396M5131n4359o8107Q059K4790
17321e4383N5495M3832l79M91m0063N695M10l0395k7383j9891K3341j118J8799
17308b5549K9543j5640n1509l7224J454O4660M0658j4931k5313P021O8407J3943
17296E5520o1584n4384J1682N84r727K5365M6300M375n6536m6330J2748O1128
17284a0859L1256L3520N3168j8402k9843k3031j6147O816o186n1025M663k7506
17272e3576m8287N2524L7579K7839k1831Q906J5616o0100p2180J6160J4914L3071
$$ plain form
17260 -49365 -5282 89841 154493 63212 -9577 -43446 750 12576 57433 64811 1330 -8643
17248 -8643 -14830 -47166 -34822 42723 471 -88365 -90453 -27026 11988 -10651 15366 -31220
17236 -31220 -52608 -48128 -30681 -84807 -106834 -83982 -39985 -92485 -93523 -20677 47170 21640
17224 21640 -13751 -23778 5000 23832 8519 14814 -8553 6667 13451 -22610 -57499 -85435
17212 -85435 -102932 -51491 -16995 8117 26211 46533 38465 -41025 -43434 -39658 -83303 -109476
17200 -109476 -63890 -67581 -32371 -52278 -42735 -14071 3294 -40478 -18822 19460 30983 24848
17188 24848 26234 -14483 -24529 -60663 -35520 -40939 -43279 -23620 11421 3814 -22117 -70945
17176 -70945 -55570 -38348 -25343 -9788 30663 54691 87409 83993 88208 63668 57908 33026
$$ packed form
17260d9365M4083R5123O4652r1281p2789l3869M4196J1826M4857P378o3481r973
17248h643o187l2336J2344P7545m2252q8836k088O3427L9014k2639K6017m6586
17236c1220k1388M480J7447n4126k2027K2852M3997n2500j038P2846O7847k5530
17224B1640l5391j0027K8778J8832j5313O295k3367J5220O784l6061l4889k7936
17212h5435j7497N1441L4496K5112J8094K0322q068p9490k409L776m3645k6173
17200a09476M5586l691L5210j9907R543K8664J7365m3772K1656L8282J1523o135
17188B4848J386m0717j0046l6134K5143n419k340J9659L5041p607k5931m8828
17176g0945J5375J7222J3005J5555M0451K4028L2718l416M215k4540n760k4882
$$ plain form
17164 33026 73464 93283 95177 117197 102099 73510 27747 6100 -30077 18170 71566 65181
17152 65181 79727 99705 56618 5395 -30744 -39324 -11327 -51054 -44464 24506 43721 94751
17140 94751 75283 44645 54262 32075 14782 15883 20985 -42645 -45546 -115632 -161925 -166307 -73039
17127 -73039 -51209 -4877 9156 28497 58145 48080 -7573 19073 6413 -34216 -74299 -45160
17115 -45160 -34516 -62235 -11324 19166 -9872 -23451 19696 32470 38929 46575 -4064 -48804
17103 -48804 18709 31485 -9092 4152 -2804 36116 61629 27526 -40927 -64250 -31870 -1969
17091 -1969 -8603 -70296 -45327 -2148 19086 -33220 -79069 -65525 -41705 -46599 -68169 -71334
17079 -71334 -31161 -23913 -29905 -18195 8018 -13600 -30526 -44543 6267 56446 -5412 -54928
$$ packed form
17164C3026M0438J9819J894K2020j5098k8589m5763k1647l6177M8247N3396o385
17152F5181J4546J9978m3087n1223l6139q580K7997l9727O590O8970J9215N1030
17140I4751j9468l0638R617k2187j7293J101N102o3630k901p0086m6293m382R3268
17127g3039K1830M6332J4033J9341K9648j0065n5653K6646j2660m0629m0083K9139
17115d5160J0644k7719N0911L0490k9038j3579M3147J2774O459P646n0639m4740
17103d8804O7513J2776m0577J3244o956L8920K5513l4103o8453k3323L2380K9901
17091a969o634o1693K4969M3179K1234n2306m5849J3544K3820m894k1570l165
17079g1334M0173P248n992J1710K6213k1618j6926j4017N0810N0179o1858m9516
$$ plain form
17067 -54928 -52268 -47644 -61754 -44997 -62508 -85380 -107961 -132581 -148907 -136318 -144218 -149289
17055 -149289 -94935 -97904 -143189 -138833 -90267 -61486 -55588 -95374 -40004 -12496 16795 60987
17043 60987 32376 -36233 -89711 -33428 33751 34037 -2400 -29247 -51394 -58743 -141371 -173838
17031 -173838 -57013 -36688 -55567 15653 17184 -3846 -8495 -26458 -31649 -4778 33895 55314
17019 55314 80805 48400 64793 63579 30676 20552 32879 41652 38197 26989 -6405 -54204
17007 -54204 -46010 -15641 14544 -24588 -54435 -34245 -63037 -2886 -32619 -49223 -15634 22435
16995 22435 -15953 20263 92919 78407 79913 41468 -12913 -28277 18306 37739 -15333 -22206
16983 -22206 22428 41414 17613 38199 65391 60009 32458 -40735 -79393 -35018 -2774 -12497
$$ packed form
17067e4928K660M624j4110J6757j7511k2872k2581k4620j6326J2589p900n071
17055a49289N4354k969m5285M356M8566K8781N898l9786N5370K7508K9291M4192
17043F0987k8611o8609n3478N6283O7179K86l6437k6847k2147p349q2628l2467
17031a73838J16825K0325j8879P1220J531k1030m649j7963n191K6871L8673K1419
17019E5314K5491l2405J6393j214l2903j0124J2327Q773l455j1208l3394m7799
17007e4204Q194L0369L0185l9132k9847K0190k8792O0151k9733j6604L3589L8069
16995B2435l8388L6216P2656j4512J506l8445n4381j5364M6583J9433n3072o873
16983b2206M4634J8986k3801K0586K7192n382k7551p3193l8658M4375L2244r723
$$ plain form
16971 -12497 -24099 2999 -19956 -14546 -52504 -98217 -105700 -76016 -11270 -8813 -20663 -26687
16959 -26687 14944 46707 60253 28765 43153 38206 39516 -50780 -110484 -112069 -72131 -102115
16947 -102115 -87704 -54737 -44832 -28751 -41833 -23660 -31335 -31480 38682 113150 80974 25638
16935 25638 -16167 -18566 28477 38788 54754 80570 76742 52297 105780 74572 39927 49012
16923 49012 38302 85532 96227 55306 14865 29909 17307 -34841 -23128 34475 21359 30280
16911 30280 -18158 -51417 -65054 -78343 -92880 -120882 -150356 -140863 -110728 -83708 -47368 55294
16899 55294 43597 53030 27535 -14033 3715 44212 42189 7320 51554 12317 -44744 -65013
16887 -65013 -53952 -63712 -71631 -55490 -776 47902 66941 54114 27443 29149 -2512 -15156
$$ packed form
16971a2497j1602K7098k2955N410l7958m5713p483K9684O4746K457j1850o024
16959b6687M1631L1763J3546l1488J4388m947J310r0296n9704j585L9938k9984
16947a02115J4411L2967R905J6081j3082J8173p675j45P0162P4468l2176n5336
16935B5638m1805k399M7043J0311J5966K5816l828k4445N3483l1208l4645R085
16923D9012j0710M7230J0695m0921m0441J5044j2602n2148J1713N7603j3116Q921
16911C0280m8438l3259j3637j3289j4537k8002k9474R493L0135K7020L6340J02662
16899E5294j1697R433k5495m1568J7748M0497k023l4869M4234l9237n7061k0269
16887f5013J1061r760p919J6141N4714M8678J9039j2827k6671J706l1661j2644
$$ plain form
16875 -15156 -31260 -57183 -30508 -29376 37300 27631 -901 -5408 -55295 -61166 -50300 -40429 -15855
16862 -15855 21729 7336 -49176 -41768 -31492 -15265 44957 72680 57183 28526 70834 84972
16850 84972 74471 -13600 5432 24336 31362 59959 128364 149489 133019 125833 98330 -13594
16838 -13594 -36592 8468 1422 -22474 5888 27755 35148 8831 -6948 -31708 -79589 -106831
16826 -106831 -73895 -76748 -44417 36441 7517 12926 27316 63719 103604 157919 125394 65157
16814 65157 7886 -7772 -41856 -13700 49344 80231 62195 -11145 -78673 -78925 -103220 -90475
16802 -90475 -56988 -53987 -35852 -8002 15126 85359 129045 172697 157766 52515 5545 19037
16790 19037 31615 43985 -30275 -98014 -63127 1384 44742 36191 9433 -1479 19619 7500
$$ packed form
16875a5156j6104k5923K6675J132O6676r669k8532m507m9887n871J0866R871K4574
16862a5855L7584j4393n6512P408J0276J6227O0222K7723j5497k8657M2308J4138
16850H4972j0501q8071J9032J8904P026K8597O8405K1125j6470p186k7503j11924
16838a3594k2998M5060p046k3896K8362K1867P393k6317j5779k4760m7881k7242
16826a06831L2936k853L2331Q0858k8924N409J4390L6403L9885N4315l2525o0237
16814F5157n7271j5658l4084K8156O3044L0887j8036p3340o7528k52k4295J2745
16802i0475L3487L001J8135K7850K3128P0233M3686M3652j4931j05251m6970J3492
16790A9037J2578J2370p4260o7739L4887O4511M3358q551k6758j0912K1098j2119
$$ plain form
16778 7500 -8658 -66250 -86769 -85159 -47023 -106550 -82863 -23574 -1524 77904 78766 39828
16766 39828 -6909 -31457 -17831 12643 23855 19345 21375 62425 80943 91966 75727 14641
16754 14641 -24922 -28512 29635 -10553 -68597 -35835 63381 101635 9673 -41628 -11516 30913
16742 30913 46393 28268 9051 5708 -13673 50098 44179 74141 78978 55024 79688 46033
16730 46033 -3360 -79164 -108619 -61885 -9577 -21599 -28835 -37329 -54886 -21424 -47668 -104667
16718 -104667 -73451 -67950 -56280 8248 21963 -22263 -1624 65879 2191 -24221 -36117 -26926
16706 -26926 -66571 -85282 -58328 -75 46834 18198 34683 56995 -653 9584 -468 -53260
16694 -53260 -26714 42031 -4572 -35632 240 3114 -59833 -6159 41160 79195 68451 -14235
$$ packed form
16778G500j6158n7592k0519J610L8136n9527K3687N9289K2050P9428Q62l8938
16766C9828m6737k4548J3626L0474J1212m510K030M1050J8518J1023j6239o1086
16754A4641l9563l590N8147m0188n8044L2762R9216L8254r1962n1301L0112M2429
16742C0913J5480j8125j9217l343j9381O3771n919K9962M837k3954K4664l3655
16730D6033m9393p5804k9455M6734N2308j2022p236q494j7557L3462k6244n6999
16718a04667L1216N501J1670O4528J3715m4226K0639O7503o3688k6412j1896R191
16706b6926l9645j8711K6954N8253M6909k8636J6485K2312n7648J0237j0052n2792
16694e3260K6546O8745m6603l1060L5872K874o2947N3674M7319L8035j0744q2686
$$ plain form
16682 -14235 -38839 -55758 -46832 -22398 -29238 -109640 -158580 -120087 -49765 -10034 17858 14
16670 14 -145872 -131665 -96593 -118920 -80285 -70258 -98912 -27697 -582 -5062 -20867 -36363
16658 -36363 11494 -24143 -53936 -15110 4698 -5854 -11108 -15682 -17407 -40769 -20764 2651
16646 2651 8194 -36473 -49618 -94033 -72998 -62058 -49952 -46945 -41015 -43441 -38922 31707 1566
16633 1566 -8597 -11348 22544 31893 -25351 -71295 -38846 -26385 -77635 -17659 51164 62789
16621 62789 22691 -28671 -65048 -113185 -111438 -68078 -59135 6757 58829 -10767 -84811 -31778
16609 -31778 51008 -4728 11917 31400 25496 62540 87313 98928 91344 58399 34243 -16841
16597 -16841 2802 12043 -28355 -70529 -106803 -125417 -77360 -63636 -116440 -55381 -23330 -16558
$$ packed form
16682a4235k4604j6919Q926K4434o840q0402m8940L8493P0322L9731K7892j7844
16670A4j45886J4207L5072k2327L8635J0027k8654P1215K7115m480j5805j5496
16658c6363M7857l5637k9793L8826J9808j0552n254m574j725k3362K0005K3415
16646B651N543m4667j3145m4415K1035J0940J2106L007N930k426M519P0629l0141
16633A566j0163k751L3892R349n7244m5944L2449J2461n1250N9976O8823J1625
16621F2789m0098n1362l6377m8137J747M3360Q943O5892N2072o9596p4044N3033
16609c1778Q2786n5736J6645J9483n904L7044K4773J1615p584l2945k4156n1084
16597a6841J9643R241m0398m2174l6274j8614M8057J3724n2804O1059L2051O772
$$ plain form
16585 -16558 -7551 -8401 54972 14828 -64604 -44426 -9342 -62176 -95182 -93820 -15562 -41664
16573 -41664 -89346 -78836 -61667 -64789 -26134 -55928 -71964 -40005 -34215 9521 10524 -21719
16561 -21719 -85540 -107118 -58922 -21865 4440 -18206 -91919 -148534 -95474 -87119 -69469 -53683
16549 -53683 -71782 -86170 -111088 -112024 -111548 -83193 -102412 -137701 -119868 -81938 -36882 -21420
16537 -21420 -51750 -147276 -133327 -112155 -16021 90491 95380 38570 5696 -7756 4008 -26545
16525 -26545 -10079 -6212 -7148 11196 -57733 -57013 -16216 -6580 -26885 21537 9287 51676 55140
16512 55140 33256 46464 76791 32755 -10148 -64009 -65892 -95994 -87324 -98627 -75004 -35074
16500 -35074 -30612 -40247 32383 67549 27508 -8772 -29352 8431 -38585 -98525 -74828 -29033
$$ packed form
16585a6558R007q50O3373m0144p9432K0178L5084n2834l3006J362P8258k6102
16573d1664m7682J0510J7169l122L8655k9794j6036L1959N790M3736J003l2243
16561b1719o3821k1578M8196L7057K6305k2646p3713n6615N3060Q355J7650J5786
16549e3683j8099j4388k4918r36M76K8355j9219l5289J7833L7930M5056J5462
16537b1420l0330r5526J3949K1172R6134J06512M889n6810l2874j3452J1764l0553
16525b6545J6466L867r36J8344o8929P20M0797R636k0305M8422j2250M2389L464
16512E5140k1884J3208L0327m4036m2903n3861j883l0102Q670j1303K3623L9930
16500c5074M462r635P2630L5166m0041l6280k0580L7783m7016n9940K3697M5795
$$ plain form
16488 -29033 18205 46049 -8801 -26017 -22837 -6859 29009 69790 71604 62294 23372 -5977
16476 -5977 -73410 -97243 -59215 -14722 14127 15098 -11355 -24330 59216 73677 31093 3155
16464 3155 45830 82386 105084 73287 49201 -7336 -32505 -28345 45563 -14223 4969 19520
16452 19520 -3677 5106 -14739 -34404 -24906 3623 -13964 -64405 -82235 -65288 -59851 -48918
16440 -48918 -17446 -17950 5275 12421 8608 2792 -30120 -25666 -49 -1701 -25697 -48151 -12002
16427 -12002 28558 50883 47303 111266 120538 90184 24393 65460 43203 38159 37315 35480 62760
16414 62760 9130 -43936 -31278 12708 2697 17421 16247 -9830 -17049 8532 -38141 5286
16402 5286 46781 43113 36337 3621 -876 271 -1293 5304 -16067 -38870 -31841 32815 56798
$$ packed form
16488b9033M7238K7844n4850j7216L180J5978L5868M0781J814r310l8922k9349
16476e977o7433k3833L8028M4493K8849R71k6453j2975Q3546J4461m2584k7938
16464C155M2675L6556K2698l1797k4086n6537k5169M160P3908n9786J9192J4551
16452A9520k3197Q783j9845j9665R498K8529j7587n0441j7830J6947N437J0933
16440d8918L1472n04K3225P146l813n816l2912M454K5617j652k3996k2454L6149
16427a2002M0560K2325l580O3963R272l0354o5791M1067k2257n044q44j835K7280
16414F2760n3630n3066J2658M3986j0011J4724j174k6077p219K5581m6673M3427
16402E286M1495l668o776l2716m497J147j564O597k1371k2803P029O4656K3983
$$ plain form
16389 56798 11468 -6813 51364 66667 44171 1598 -26597 -53364 -104655 -95097 -75677 -53778
16377 -53778 -80251 -129628 -112631 -146031 -197761 -171993 -154168 -39989 25674 71732 23760
16366 23760 14382 36866 103596 75615 32546 -28359 3660 -234 24565 80677 101022 115139
16354 115139 114247 9880 -46162 -69639 -30883 -27516 -69718 -55784 -63993 -113434 -50190 34084
16342 34084 39318 14396 -27224 -6889 -51866 -49430 -37790 -45689 16859 56487 68483 78451
16330 78451 38787 37228 33518 52127 31785 52275 40181 39242 113951 92178 66331 91854
16318 91854 56496 4986 -34626 -62317 -41831 -20300 -25709 -22255 -37409 -29732 19763 24560
16306 24560 24609 29430 19243 -8370 -3627 27874 75022 78765 70581 26564 10242 -18047 -56362
$$ packed form
16389E6798m5330j8281N8177J5303k2496m2573k8195k6767n1291R558J9420K1899
16377e3778k6473m9377J6997l3400n1730K5768J7825J14179O5663M6058m7972
16366B3760r378K2484O6730k7981m3069o0905L2019l894K4799N6112K0345J4117
16354A15139q92j04367n6042k3477L8756L367m2202J3934q209m9441O3244Q4274
16342C4084N234k4922m1620K0335m4977K436J1640p899O2548L9628J1996R968
16330G8451l9664j559l710J8609k0342K0490j2094r39P4709k1773k5847K5523
16318I1854l5358n1510l9612k7691K0486K1531n409L454j5154P677M9495M797
16306B4560M9M821j0187k7613M743L1501M7148L743q184m4017j6322k8289l8315
$$ plain form
16293 -56362 -61732 -51818 -54799 -9919 68110 88952 73797 36828 94823 82258 66397 46750
16281 46750 52074 91041 153228 82698 1469 19914 28206 61196 28414 22260 60069 55120
16269 55120 28597 -18658 -41105 -46116 -89759 -99763 -19925 20575 57429 26681 52853 72688
16257 72688 33082 -19214 -9553 -17070 -1586 25787 9695 -32134 -57595 10048 35223 -2609
16245 -2609 -13807 -15021 -35824 2343 35112 31560 -9878 -3582 -8891 -6080 -52554 -19386 29160
16232 29160 36475 44484 72127 -6617 -46841 -39388 -19044 -40860 10451 36699 25970 47736
16220 47736 54501 50598 75020 103228 99443 48856 12686 33915 64054 98903 100304 61087
16208 61087 53278 62356 65423 84870 108289 113185 108965 67881 82289 118662 76669 14682 -16533
$$ packed form
16293e6362n370R914k981M4880P8029K0842j5155l6969N7995j2565j5861j9647
16281D6750N324L8967O2187p0530q1229J8445Q292L2990l2782o154L7809m949
16269E5120k6523m7255k2447n011m3643j0004P9838M0500L6854l0748K6172J9835
16257G2688l9606n2296R661p517J5484K7373j6092m1829k5461O7643K5175l7832
16245b609j1198j214k0803L8167L2769l552m1438O296n309K811m6474L3168M8546
16232B9160P315Q009K7643p8744m0224P453K0344k1816N1311K6248j0729K1766
16220D7736O765l903K4422K8208l785n0587l6170K1229L0139L4849J401l9217
16208F1087p809R078L067J9447K3419M896m220m1084J4408L6373m1993o1987l1215
$$ plain form
16195 -16533 51971 120308 90794 44610 14477 -16938 -60805 -66029 -61996 -93801 -49528 3949
16183 3949 38105 -8405 -48237 -25717 -42866 -73184 -43573 -57955 -77059 -61425 -56040 -75734
16171 -75734 14492 32516 59474 71153 958 -55840 -120487 -126488 -107779 -87477 -61108 57560
16159 57560 76872 67215 65481 46660 45414 44536 21700 46011 34182 45422 73937 119968 132728
16146 132728 97935 45652 -47530 -103791 -59868 -82576 -92674 -44828 -32203 16793 22650 -56824
16134 -56824 -95139 -96602 -39457 -3657 -47733 -89081 -63542 -17667 11784 -28651 -42283 -17858
16122 -17858 -41472 -55893 -2376 -35156 -63954 -85920 -52052 -30332 47595 89142 123821 128169
16110 128169 90261 86530 51558 -19439 -8146 26776 34817 79368 84746 14726 37131 45299
$$ packed form
16195a6533O8504O8337k9514m6184l0133l1415m3867n224M033l1805M4273N3477
16183C949L4156m6510l9832K2520j7149l0318K9611j4382j9104J5634N385j9694
16171g5734R0226J8024K6958J1679p0195n6798o4647o001J8709K0302K6369J18668
16159E7560J9312r657j734j8821j246q78k2836K4311j1829J1240K8515M6031J2760
16146A32728l4793n2283r3182n6261M3923k2708j0098M7846J2625M8996N857p9474
16134e6824l8315j463N7145L5800m4076m1348K5539M5875K9451m0435j3632K4425
16122a7858k3614j4421N3517l2780k8798k1966L3868K1720P7927M1547L4679M348
16110A28169l7908l731l4972p0997J1293L4922Q041M4551N378p0020K2405Q168
$$ plain form
16098 45299 15134 10218 -27623 -25372 10842 19091 -26354 -55545 -18789 -82804 -95478 -21860
16086 -21860 -69698 -111158 -52054 42000 51859 46371 58044 88700 36150 19408 49584 35102
16074 35102 18222 24997 35436 37770 18297 -18683 -40631 -55824 -63487 -9841 25653 -44725
16062 -44725 -89607 -72612 -51696 -9523 13260 -21654 -42361 -60061 -5085 30845 10410 15672
16050 15672 34965 101422 80704 75886 48334 26948 13213 -9289 27744 50127 -6723 -27050
16038 -27050 5073 28988 21454 -10532 -41613 -73429 -91188 -89768 -79842 -22638 6197 17214
16026 17214 28770 30100 -17609 -5406 45195 20368 -43169 -12204 -18381 -3089 76006 3972
16014 3972 -2154 58980 64920 36673 -9230 -35465 3876 26521 17772 54098 96886 130953
$$ packed form
16098D5299l0165m916l7841K251L6214Q249m5445k9191L6756o4015j2674P3618
16086b1860m7838m1460N9104R4054R859n488J1673L0656n2550j6742L0176j4482
16074C5102j6880O775J0439K334j9473l6980k1948j5193p663N3646L5494p0378
16062d4725m4882J6995K0916M2173K2783l4914k0707j7700N4976L5930k0435N262
16050A5672J9293O6457k0718m818k7552k1386j3735k2502L7033K2383n6850k0327
16038b7050L2123K3915p534l1986l1081l1816j7759J420R926N7204K8835J1017
16026A7214J1556J330m7709J2203N0601k4827o3537L0965o177J5292P9095p2034
16014C972o126O1134N940k8247m5903k6235L9341K2645q749L6326M2788L4067
$$ plain form
16002 130953 36503 -44653 3461 7748 -1587 38507 65586 6740 -16789 -51246 -62300 -13672
15990 -13672 3548 -2869 48130 68846 76768 87413 81011 126921 175591 177019 139852 99262
15978 99262 124683 101972 70192 66838 11428 4761 9374 29904 34510 50298 37194 33181 14721
15965 14721 -15432 -24038 -5830 -46304 -32611 62104 72478 81123 101287 48432 23566 64991
15953 64991 117281 125152 134261 105288 25040 -6095 6507 -992 -5059 16936 42483 31646
15941 31646 38760 14570 47175 84568 71554 -5841 -30839 -25988 -48359 -39290 -4104 -16581
15929 -16581 -1795 2897 65316 -9524 -67714 -6761 17109 19029 -4686 8731 -55395 -31524
15917 -31524 -35360 -50252 -67317 -34470 -19232 -5501 37156 39360 36944 86789 76040 44785
$$ packed form
16002A30953r4450q1156M8114M287r335M0094K7079n8846k3529l4457j1054M8628
15990a3672J7220o417N0999K0716P922J0645o402M5910M8670J428l7167m0590
15978I9262K5421k2711l1780l354n5410o667M613K0530M606J5788j3104m013j8460
15965A4721l0153q606J8208m0474J3693R4715J0374Q645K0164n2855k4866M1425
15953F4991N2290P871R109k8973q0248l1135J2602p499m067K1995K5547j0837
15941C1646P114k4190L2605L7393j3014p7395k4998M851k2371R069L5186j2477
15929a6581J4786M692O2419p4840n8190O0953K3870J920k3715J3417o4126K3871
15917c1524l836j4892j7065L2847J5238J3731M2657K204k416M9845j0749l1255
$$ plain form
15905 44785 -27487 -110427 -117502 -84006 -66937 -107962 -88372 -11676 -65947 -45818 -2836 36256
15893 36256 9847 25411 49140 38936 76799 88551 62601 21014 27467 -16169 -51213 -87047
15881 -87047 -13276 20391 -68505 -48172 -4802 12928 -22800 -120461 -170176 -97342 -27897 34725
15869 34725 63331 124103 205423 165863 26471 11898 -21251 -62466 -39298 31172 81699
15858 81699 93957 73689 66887 72386 74283 88033 84912 22047 955 -16387 -11668 -73684 -86595
15845 -86595 -91600 -64399 2499 34225 17498 26731 70101 96415 160152 165428 158055 100860
15833 100860 73532 -5308 -58070 -26567 -24154 6793 19994 -10676 -45650 -60853 -45390 6579
15821 6579 23165 8168 -2099 -32949 -4508 -4525 -3944 10793 -19896 -37498 28677 14767 20868
$$ packed form
15905D4785p2272q2940p075L3496J7069m1025J9590P6696n4271K0129M2982L9092
15893C6256k6409J5564K3729j0204L7863J1752k5950m1587O453m3636l5044l5834
15881h7047P3771L3667q8896K0333M3370J7730l5728r7661m9715P2834O9445O2622
15869C4725K8606O0772Q1320l9560j39392j4573l3149m1215K3168P0470N0527
15858H1699J2258k0268o802N499J897J3750l121o2865k1092j7342M719o2016j2911
15845h6595n005K7201O6898L1726j6727R233M3370K6314O3737N276p373n7195
15833A00860k7328p8840n2762L1503K413L0947J3201l0670l4974j5203J5463N1969
15821F579J6586j4997j0267l0850K8441j7N81J4737l0689j7602O6175j3910O101
$$ plain form
15808 20868 -30068 -23654 -973 36888 119366 134383 78219 26301 20345 45234 13227 40854
15796 40854 93986 49147 12204 19007 27415 9163 -30750 -145264 -152641 -62965 23297 8540
15784 8540 -42385 1844 17883 38291 46079 49107 48440 47238 -14894 -50137 -7778 65710 62444
15771 62444 8822 -43647 -71028 -60034 -50999 -38295 -7984 -24400 -34360 -20607 41513 62895
15759 62895 34679 -26106 -2127 11702 -18263 46669 91131 31446 6403 -62185 -44903 -42827
15747 -42827 -75487 -49359 -50189 -34431 -17136 -26078 -20255 -43815 -70435 -76973 -25042 -83883 -92019
15734 -92019 -100171 -109778 -85832 -69000 -44073 -46810 -46234 -35195 12290 58704 86976 77006 113824
15721 113824 185903 136279 53419 10279 -41541 -46427 -88119 -132344 -104731 -82822 -68643 -4504
$$ packed form
15808B0868n0936O414K2681L7861Q2478J5017n6164n1918n956K4889l2007K7627
15796D0854N3132m4839l6943O803Q408j8252l9913j14514p377Q9676Q6262j4757
15784H540n0925M4229J6039K0408P788L028o67j202o2132l5243M2359P3488l266
15771F2444n3622n2469k7381J0994R035J2704L0311j6416r960J3753O2120K1382
15759F2895k8216o0785K3979J3829k9965O4932M4462n9685k5043o8588J7282K076
15747d2827l2660K6128q30J5758J7295q942N823k3560k6620o538N1931n8841q136
15734i2019q152r607K3946J6832K4927k737N76J1039M7485M6414K8272r970L6818
15721A13824P2079m9624q2860m3140n1820m886m1692m4225K7613K1909J4179O4139
$$ plain form
15709 -4504 49354 6010 -92390 -67668 -16474 -7246 72084 80328 -3754 15090 127505 136228
15697 136228 80746 80019 76586 66528 36339 120921 188801 166219 116274 36847 43972 -6397
15685 -6397 -63222 -109257 -127023 -143692 -66875 -6617 -73527 -107906 -131983 -148692 -98104 -20341
15673 -20341 26878 37359 -24228 -19656 -3214 13833 -16920 -64731 -63291 -38279 -46570 -23226
15661 -23226 44357 73726 65395 48833 -408 -82293 -95068 -66432 -41270 -52968 -61512 -51573
15649 -51573 -52285 -16634 -38407 -30394 16593 60196 36012 1562 -38160 -100695 -119096 -107561
15637 -107561 -38845 -23505 -9521 1794 -7322 -26629 -91376 -92926 -52776 -32227 -22699 -36932
15625 -36932 -4930 30636 38761 15212 -808 19001 45325 67795 26301 -11152 -29194 -849
$$ packed form
15709d504N3858m3344r8400K4722N1194R228P9330Q244q4082J8844J12415Q723
15697A36228n5482p27l433j0058l0189Q4582O7880k2582m9945p9427P125n0369
15685f397n6825m6035j7766j6669P6817O0258o6910l4379k4077j6709N0588P7763
15673b0341M7219J0481o1587M572J6442J7047l0753m7811J440K5012q291K3344
15661b3226O7583K9369q331j6562m9241q1885j2775K8636K5162j1698q544R939
15649e1573p12L5651k1773Q013M6987M3603k4184l4450l9722o2535j8401J1535
15637a07561O8716J5340J3984J1315r116j9307o4747j550M0150K0549R528j4233
15625c6932L2002L5566Q125k3549j6020J9809K6324K2470m1494l7453j8042K8345
$$ plain form
15613 -849 -6569 -16024 -5037 21312 4599 -547 -48327 -43923 11754 45638 42706 1809 -81860
15600 -81860 -80059 -41189 6830 57743 76628 52994 9373 -6782 -5304 1374 43795 78543
15588 78543 112549 93957 43050 35671 50593 31619 18570 52155 65289 73737 53584 60790
15576 60790 17127 45070 79559 113867 80692 50439 61370 -16095 -8161 51495 6300 15699
15564 15699 33515 -15771 -37889 2322 2801 -24411 1010 -4817 -62720 -62036 -43109 -56077 -101692
15551 -101692 -140879 -112709 -66592 -39229 -17446 23276 2834 -10768 -26450 -35707 -13222 -13981
15539 -13981 -13707 7061 -7204 -13799 -6075 -7146 -13888 -3618 42015 21533 69712 62283 97083
15526 97083 100055 73365 30713 51052 13445 3063 85664 72693 37382 64662 38043 30139
$$ packed form
15613h49n720r455J0987K6349j6713n146m7780M404N5677L3884k932m0897q3669
15600h1860J801L8870M8019N0913J8885k3634m3621j6155J478O678M2421L4748
15588G8543L4006j8592n0907p379J4922j8974j3049L3585J3134Q448k0153P206
15576F0790m3663K7943L4489L4308l3175l0253J0931p7465P934N9656m5195R399
15564A5699J7816m9286k2118M0211M79k7212K5421n827n7903O84J8927j2968m5615
15551a01692l9187K8170M6117K7363K1783M0722k0442j3602j5682r257K2485p59
15539a3981K74K0768j4265o595P724j071o742J0270M5633k0482M8179p429L4800
15526I7083K972k6690m2652K0339l7607j0382Q2601j2971l5311K7280k6619p904
$$ plain form
15514 30139 9217 6005 -23207 9246 -2144 -15006 -20293 -7886 30550 50670 12847 31601
15502 31601 68450 26655 21093 159 26577 -1563 -28102 -52561 -67707 -27095 -53322 -17549
15490 -17549 -53574 -35788 34670 -7441 -48143 -61134 -31762 -52987 -85948 -75988 -34928 -62351
15478 -62351 -78112 -50514 -29797 -37657 -92079 -85566 31859 42438 -17636 -33915 25022 25321
15466 25321 -78357 -156554 -140141 -47637 20337 -675 -25953 -33406 -30835 21596 38270 40479
15454 40479 25902 13610 48580 106904 97453 31700 46239 37965 13793 -5908 -5983 44681 70170
15441 70170 75818 65436 140140 140685 81671 57211 20047 12510 37900 58983 -3818 5852 32212
15428 32212 -3130 -5447 -1531 -3109 4597 -15676 -26069 -11349 -2521 23213 51463 69994 34137
$$ packed form
15514C0139k0922l212k9212L2453j1390j2862n287J2407L8436K0120l7823J8754
15502C1601L6849m1795n562k0934K6418k8140k6539k4459j5146M0612k6227L5773
15490a7549l6025J7786P0458m2111m0702j2991K9372k1225l2961R960M1060k7423
15478f2351j5761K7598K0717p860n4422O513J17425J0579o0074j6279N8937K99
15466B5321j03678p8197J6413R2504O7974k1012k5278p453K571N2431J6674K209
15454D0479j4577j2292L4970N8324r451o5753J4539q274k4172j9701p5N0664K5489
15441G0170N648j0382P4704N45n9014k4460l7164p537K5390K1083o2801R670K6360
15428C2212l5342k317L916j578P706k0273j0393J4720Q828K5734K8250J8531l5857
$$ plain form
15415 34137 58985 52224 36701 2359 38490 89028 102545 114135 82294 81734 27730 -48685
15403 -48685 -80872 -37521 -28426 -29378 -73744 -77712 -106329 -109922 -90896 -70430 -37011 -36362 -4311
15390 -4311 -2380 -32911 -32806 -1384 -12147 -86868 -91540 -49979 -21676 -37375 -26403 20018 73800
15377 73800 96582 37374 28373 51697 22831 -35330 -72790 -48949 -13947 -31292 -71258 -52540
15365 -52540 2494 -34558 -48626 -17924 -623 -64392 -91541 -20397 64596 66058 13325 -34698
15353 -34698 283 -8285 -52846 -7592 -34425 -22219 -111390 -105798 -52205 -13705 -6566 -31789
15341 -31789 -44089 -11196 59118 37528 -28189 -13509 69440 93589 132199 104780 43372 -50728
15329 -50728 -106868 -19476 41598 31770 20006 13015 -18631 -79412 -74171 -70586 -100134 -73698
$$ packed form
15415C4137K4848o761j5523l4342L6131N0538J3517J1590l1841n60n4004p6415
15403d8685l2187M3351R095r52m4366l968k8617l593J9026K0466L3419O49L2051
15390d311J931l0531J05L1422j0763p4721m672M1561K8303j5699J0972M6421N3782
15377G3800K2782n9208r001K3324k8866n8161l7460K3841L5002j7345l9966J8718
15365e2540N5034l7052j4068L0702J7301o3769k7149P1144Q4993J462n2733m8023
15353c4698L4981q568m4561M5254k6833J2206q9171N592N3593L8500P139k5223
15341c1789j2300L2893P0314k1590o5717J4680Q2949K4149L8610k7419o1408r4100
15329e0728n6140Q7392O1074r828j1764o991l1646o0781N241L585k9548K6436
$$ plain form
15317 -73698 -30616 15456 -12813 -23554 -1258 -50705 -2534 20347 -16754 -6033 15430 -60520
15305 -60520 -156397 -150625 -85498 -111965 -153578 -168649 -158500 -136132 -148669 -100676 -81390 -53377
15293 -53377 -62384 25954 58089 -26324 -69560 -67725 -66283 -50829 -51248 -75888 -20343 -19025 -44258
15280 -44258 -116028 -106136 -91315 -49063 -26946 -21036 -35168 -21456 -35793 -28678 -24912 -79737
15268 -79737 -34970 -831 3634 -25776 -85813 -106161 -76810 -6349 -58104 -68066 -94399 6425
15256 6425 71759 67092 5001 -19623 -6914 40438 67008 45580 41066 23052 -1049 -20295
15244 -20295 -24346 -12308 28355 28595 25523 22968 14877 51087 49500 33366 22945 12034 7894
15231 7894 -21387 -36467 -37032 -49550 14045 28082 -55717 -93290 -78274 22565 60518 65655
$$ packed form
15317g3698M3082M6072k8269j0741K2296m9447M8171K2881l7101J0721K1463p5950
15305f0520r5877N772O5127k6467m1613j5071J0149K2368j2537M7993J9286K8013
15293e3377r007Q8338L2135q4413m3236J835J442J5454m19k4640N5545J318k5233
15280d4258p1770R892J4821M2252K2117N910j4132J3712j4337P115L766n4825
15268g9737M4767L4139M465k9410o0037k0348K9351P0461n1755r962k6333J00824
15256F425O5334m667o2091k4624J2709M7352K6570k1428m514j8014k4101j9246
15244b0295m051J2038M0663K40l072k555q091L6210j587j6134j0421j0911m140
15231G894k9281j5080n65j2518O3595J4037q3799l7573J5016J00839L7953N137
$$ plain form
15219 65655 95328 72318 30624 -17784 -44891 -35420 -9980 67 -33377 -39675 -30178 -26993
15207 -26993 -48462 -39639 -28620 35788 3118 -55903 -14037 -19204 -32045 -41581 -5127 -28179
15195 -28179 -42169 -69849 -87204 -51783 -24568 -24660 -59871 -20520 -30457 -78592 -65575 -3283
15183 -3283 41956 32970 -78152 -91087 -19913 51746 60985 24340 18625 32136 42928 6463
15171 6463 1717 -75265 -41113 -77271 -106197 -65249 -11266 52593 77030 104954 24897 -62296
15159 -62296 -127280 -106097 -36317 -4553 36215 54043 66559 12325 -73681 -70182 -44023 -43474
15147 -43474 -18873 -38515 -7678 -7475 -11504 -19938 -10232 42768 71514 24944 -29916 -33745 -28826
15134 -28826 -25227 -71239 -84187 -22096 -7311 18094 -12039 -28898 -11334 3150 26422 50033
$$ packed form
15219F5655K9673k3010m1694m8408k7107R471K5440J0047l3444o298R497L185
15207b6993k1469Q823J1019O4408l2670n9021M1866n167j2841r536L6454k3052
15195b8179j3990k7680j7355L5421K7215r2l5211L9351r937m8135J3017O2292
15183c283M5239q986j11122j2935P1174P1659R239l6645n715J3511J0792l6465
15171F463m746p6982L4152l6158k8926M0948N3983O3859K4437K7924q0057q7193
15159f2296o4984K1183O9780L1764M0768J7828J2516n4234q6006L499K6159N49
15147d3474K4601j9642L0837K03m029q434R706N3000K8746m6570n4860l829M919
15134b8826L599m6012j2948O2091J4785K5405l0133j6859J7564J4484K3272K3611
$$ plain form
15122 50033 12478 -22079 -27818 55861 57967 22142 -34589 -19550 20108 -2779 29396 21294
15110 21294 5101 11134 22633 -159 17866 -32407 -5907 31953 28119 7224 -22198 -16131
15098 -16131 -3158 24388 43349 121518 114105 70944 8964 32666 86181 58373 32769 61064
15086 61064 -3324 -1889 -6038 21506 18549 62907 94949 109175 131875 99550 84821 67202
15074 67202 15148 44615 41991 20500 -670 -69679 -60527 -13646 -20123 -7597 -30960 -36207
15062 -36207 -45449 -25295 6887 28369 12214 22862 34584 26505 50642 82768 21824 23943
15050 23943 -5111 -2502 6904 28746 3411 -14736 -30570 -4703 30236 55607 71661 50863
15038 50863 7859 -38580 -27761 -30018 -50193 -33556 4401 36707 128857 98521 1459 14195
$$ packed form
15122E0033l7555l4557n739Q3679K106l5825n6731J5039L9658k2887L2175q102
15110B1294j6193O033J1499k2792J8025n0273K6500L7860l834k0895k9422O067
15098a6131J2973K7546J8961P8169p413m3161o1980K3702N3515k7808k5604K8295
15086F1064o4388J435m149K7544k957M4358L2042J4226K2700l2325j4729j7619
15074F7202n2054K9467k624k1491k1170o9009R152M6881o477J2526k3363n247
15062c6207r242K0154L2182K1482j6155J0648J1722q079K4137L2126o0944K119
15050B3943k9054K609R406K1842k5335j8147j5834K5867L4939K5371J6054k0798
15038E0863m3004m6439J0819k257k0175J6637L7957L2306R2150l0336r7062J2736
$$ plain form
15026 14195 -72956 -86545 -48146 -25304 10853 14742 -27663 -38547 -71895 -48424 -16243 -65906
15014 -65906 -66797 -41205 -48666 -38490 -8343 -52550 -31043 28277 112367 111919 74804 69441 69439 30515
15000 30515 18920 54013 69137 50395 4565 -5896 -2192 -5090 8064 -11440 -50613 33606
14988 33606 22206 -26325 -37641 21962 41213 32384 -35324 -65058 -8326 44487 -8256 -31945
14976 -31945 4955 29089 -24190 -60147 -26931 -71963 -113155 -53211 -86521 -71528 -38194 -37753
14964 -37753 23892 -13685 -53679 -39139 -21526 -44163 2459 33190 81524 63421 -289 39247
14952 39247 62355 35503 -3796 -9624 39166 46125 23710 17823 7071 -11593 -35203 -29887
14940 -29887 -69783 26461 82281 38972 3845 -37060 -37978 3955 -28419 -26779 -2644 -618
$$ packed form
15026A4195q7151j3589L8399K2842L6157L889m2405j0884l3348K3471L2181m9663
15014f5906q91K5592p461J0176L0147m4207K1507N9320Q4090m48l7115n363kl8924
15000C0515j1595L5093J5124j8742m5830j0461L704k898J3154j9504l9173Q4219
14988C3606j1400m8531j1316N9603J9251q829o7708k9734N6732N2813n2743k3689
14976c1945L6900K4134n3279l5957L3216m5032m1192N9944l3310J4993L3334M41
14964c7753O1645l7577l9994J4540J7613k2637M6622L0731M8334j8103o3710L9536
14952C9247K3108k6852l9299n828M8790O959k2415n887j0752j8664k3610N316
14940b9887l9896R6244N5820m3309l5127m0905r18M1933l2374J640K4135K026
$$ plain form
14928 -618 -10336 -7559 16679 -13546 -16862 17650 79665 52977 26758 6443 -1311 32101 32598
14915 32598 -4531 -17940 -11664 -15224 17741 -9931 -56814 -43649 -22584 -74511 -118530 -107549
14903 -107549 -69287 -56540 -89339 -112070 -61386 -2220 44062 63538 27866 748 23386
14892 23386 75186 62875 17284 3982 67580 43803 -12062 6415 79883 88489 15646 8271
14880 8271 3384 -36278 -31675 -37668 -45749 -121939 -34624 44262 63408 42630 61475 109744 28725
14867 28725 1242 -3300 12173 60916 -22414 -55267 -6547 33866 -30408 -84090 -44264 4418
14855 4418 16820 41859 24416 2652 -10028 7938 -18673 -38599 -15676 -50884 -41043 6643
14843 6643 78707 50459 2631 -62191 -102197 -64985 12631 66147 41172 43761 55855 85725
$$ packed form
14928f18r718K777K4238l0225l316L4512O2015k6688k6219k0315p754L3412M97
14915C2598l7129j3409O276l560L2965k7672m6883J3165K1065n1927m4019J0981
14903a07549L8262J2747l2799k2731N0684N9166M6282J9476l5672k7118K2638
14892B3386N1800j2311m5591j3302O3598k3777n5865J8477P3468Q606p2843p375
14880H271m887l9662M603n993q081p6190Q7315P8886J9146k0778J8845M8269q1019
14867B8725k7483m542J5473M8743q3330l2853M8720M0413o4274n3682L9826M8682
14855D418J2402K5039j7443k1764j2680J7966k6611j9926K2923l5208R841M7686
14843F643P2064k8248m7828o4822m0006L7212P7616N3516k4975K589J2094K9870
$$ plain form
14831 85725 121972 109176 71663 67093 54013 66252 68510 75795 83489 109664 109792 40534 27747
14818 27747 38681 22683 30569 55414 38243 23570 -23185 -39528 -65469 -1213 -9999 30490
14806 30490 38292 -35497 -79164 -71560 -101833 -118255 -105889 -107746 -157976 -193503 -54891 5758
14794 5758 22134 20350 -42 32429 59576 46914 53303 63295 -16926 -40706 -159 930 -9281
14781 -9281 -2668 31308 24358 17113 69743 44739 -27387 -54137 -78123 -92608 -30985 39220
14769 39220 48487 37640 -27740 -68713 -29125 36716 46380 106830 97894 58548 48778 60491
14757 60491 -1808 -19732 -43022 -86300 -93396 -53802 -114181 -116760 -11848 -21552 -67165 -90862
14745 -90862 -58731 7172 38541 49520 62540 -188 -36727 -24519 -15924 -19402 -3060 42577
$$ packed form
14831H5725L6247j2796l7513m570j3080J2239K258P285P694K6175J28o9258j2787
14818B7747J0934j5998P886K4845j7171j4673m6755j6343k5941O4256q786M0489
14806C0490P802p3789m3667P604l0273j6422J2366j857n0230l5527J38612O0649
14794E758J6376j784k0392L2471K7147j2662O389R992q0221k3780M0547J089j0211
14781i281O613L3976o950p245N2630k5004p2126k6750k3986j4485O1623P0205
14769C9220R267j0847o5380m0973L9588O5841R664O0450q936l9346r770J1713
14757F0491o2299j7924k3290m3278p096L9594o0379k579J04912r704m5613k3697
14745i0862L2131O5903L1369J0979J3020o2728l6539J2208Q595l478J6342M5637
$$ plain form
14733 42577 42085 34741 39090 63120 37026 -49003 -9336 32914 -19839 -38322 -51863 -65792
14721 -65792 -3572 67490 30744 -39973 859 -13907 -40929 -48577 -56500 -17022 -51688 -120338
14709 -120338 -108870 -46779 -42910 -24073 -52 60860 98095 91547 48103 22625 39480 63461
14697 63461 64479 74390 5357 -1207 3422 51233 31202 -4513 -57056 -55635 8867 70306 71923
14684 71923 27842 15995 58528 76769 99761 106410 104332 116105 3183 -15428 16275 21809
14672 21809 21170 51479 86884 52717 15546 -2102 7901 9889 24287 17075 -23662 -33959
14660 -33959 -24788 -96100 -108433 -57027 -21655 38318 81849 61478 -9705 -28867 -3547 -26161
14648 -26161 -9250 -4965 -48117 -77899 -104981 -93084 -60616 -12171 8787 13500 39509 56502
$$ packed form
14733D2577m92p344M349K4030k6094q6029L9667M2250n2753j8483j3541j3929
14721f5792O2220P1062l6746p0717M0832j4766k7022p648p923L9478l4666o8650
14709a20338J1468O2091L869J8837K4021O0912L7235o548m3444k5478J6855K3981
14697F3461J018R911o9033o564M629M7811k0031l5715n2543J421O4502O1439J617
14684G1923m4081j1847M2533J8241K2992O649k078J1773j12922j8611L1703N534
14672B1809o39L0309L5405l4167l7171j7648J0003J988J4398p212m0737j0297
14660c3959R171p1312j2333N1406L5372N9973M3531k0371p1183j9162K5320k2614
14648b6161J6911M285m3152k9782k7082J1897L2468M8445K0958M713K6009J6993
$$ plain form
14636 56502 109822 86542 60983 73718 33546 5209 61120 75820 82601 105502 46780 -65386
14624 -65386 -85706 -63766 -43362 -53053 -64578 -96403 -99102 -106980 -80792 -37082 -19114 -38016
14612 -38016 20473 50176 105528 90846 -6719 -42322 12614 48183 41352 26209 -26079 -21787
14600 -21787 -177 28958 46771 48365 -40639 -20884 50699 29203 -5997 -53963 -1472 11899
14588 11899 7119 -7897 12979 30174 10747 -39842 -107149 -89400 -15104 -58788 -38786 -66996
14576 -66996 -54977 -53961 -59743 -77175 -90618 -74467 -76888 -58972 -74304 -32829 2487 -21143
14564 -21143 -19335 6485 32575 114659 117067 85367 -1444 -7664 2837 -34673 -55719 -65959
14552 -65959 -77311 -1464 39023 -9348 -17895 -26559 -94665 -76913 -94419 -92775 -27116 48193
$$ packed form
14636E6502N3320k3280k5559J2735m0172k8337N5911J4700O781K2901n8722j12166
14624f5386k0320K1940K0404r691j1525l1825k699p878K6188M3710J7968j8902
14612c8016N8489K9703N5352j4682r7565l5603N4936L5569o831j5143n2288M292
14600b1787K1610K9135J7813J594q9004J9755P1583k1496l5200m7966N2491J3371
14588A1899m780j5016K0876J7195j9427n0589o7307J7749P4296m3684K0002k8210
14576f6996J2019J016n782j7432j3443J6151k421J7916j5332M1475L5316k3630
14564b1143J808K5820K6090Q2084K408l1700q6811o220J0501l7510k1046j0240
14552f5959j1352P5847M0487m8371q547q664o8106J7752j7506J644O5659P5309
$$ plain form
14540 48193 42054 39653 6768 -64741 -84508 -33687 6131 34814 51403 -3489 -20670 22784
14528 22784 44879 63174 -34960 -55627 4911 75397 17298 -20265 -37338 -27875 -39579 -64960
14516 -64960 -55043 10705 19976 -8695 -1667 -27335 -13959 -19012 -18055 8358 -15248 2918 26551
14503 26551 63313 103841 60816 -20999 -30711 7425 -8344 -25860 -50311 -46521 701 -28134
14491 -28134 -98563 -160032 -106220 -16741 -41011 -32160 -66486 -86780 -78503 -53401 -9370 8217
14479 8217 15030 3828 -49258 -59884 -40051 -25305 -22583 4884 48067 112478 112679 114499 101616
14466 101616 45812 65292 67976 73806 64841 12184 -25892 -50372 -79786 -60347 45910 106027
14454 106027 124413 135959 130821 61500 -9403 2442 10458 -20977 -20334 -36247 -28832 52065
$$ packed form
14540D8193o139k401l2885p1509j9767N0821L9818K8683J6589n4892j7181M3454
14528B2784K2095J8295r8134k0667O0538P0486n8099l7563j7073R463j1704k5381
14516f4960R917O5748R271k8671P028k5668J3376n053R57K6413k3606J8166K3633
14503B6551L6762M0528m3025q1815r712L8136j5769j7516k4451L790M7222k8835
14491b8134p0429o1469N3812Q9479k4270Q851l4326k0294Q277K5102M4031J7587
14479H217O813j1202n3086j0626J9833J4746K722K7467M3183O4411K01J820j2883
14466A01616n5804J9480K684N830q965n2657l8076k4480k9414J9439J06257O0117
14454A06027J8386J1546n138o9321p0903J1845Q016l1435O43j5913P415Q0897
$$ plain form
14442 52065 94226 125560 107782 41993 -71666 -96287 -91688 -83940 -19226 16414 -55676 -101560
14430 -101560 -72995 14691 12460 20051 102863 43082 -61714 -53540 15657 81536 113854 93841
14418 93841 28974 72152 53154 -7378 -37520 2144 44933 13182 -33616 -15152 -15122 -48962
14406 -48962 -34865 4591 -7956 -35016 -24373 41789 85067 38432 -37196 -38308 -21335 -31504
14394 -31504 -9319 -4539 46577 49995 39086 121814 140064 84348 73184 21657 21713 43402 -640
14381 -640 -24096 407 68819 70316 64568 45933 24652 9381 3019 20884 -1525 -7122 -9667
14368 -9667 -54895 -71776 -21955 -52367 -67531 -86315 -98312 -135561 -107587 -64693 -46840 -70999
14356 -70999 -62651 -31012 -18394 -19400 -22130 -21985 42858 57764 25898 39026 57613 -2057 -6256
$$ packed form
14442E2065M2161L1334j7778o5789j13659k4621M599P748O4714L5640p2090m5884
14430a01560K8565Q7686k231P591Q2812n9781j04796Q174O9197O5879L2318k0013
14418I3841o4867M3178j8998o0532l0142L9664M2789l1751m6798J8464L0l3840
14406d8962J4097L9456j2547k7060J0643O6162M3278m6635p5628j112J6973j0169
14394c1504K2185M780N1116L418j0909Q2728J8250n5716j1164n1527N6K1689m4042
14381f40k3456K4503O8412J497n748j8635k1281j5271o362J7865k2409n597k545
14368i667m5228j6881M9821l0412j5164j8784j1997l7249K7974M2894J7853k4159
14356g0999Q348L1639J2618j006k730J45O4843J4906l1866J3128J8587n9670m199
$$ plain form
14343 -6256 -1544 15481 46893 13108 3815 -7527 -9124 -44735 -90683 -73800 -33352 -35456 14054
14330 14054 39110 37615 61020 82911 120206 111571 53643 51496 87431 33766 1960 -10486
14318 -10486 44323 65973 45218 30485 -28633 -49836 -73236 -68184 -33992 24482 21742 -34188
14306 -34188 15740 17263 -30622 -41513 -19159 -20823 -22000 -58438 -64274 8743 26459 44548
14294 44548 37905 -34 -38932 -17001 -15195 -22383 -4103 -23840 -14349 -10841 28154 65094 63264
14281 63264 4526 3022 -51795 -96558 -47476 27960 34963 -3987 -90845 -66405 -38082 -16788
14269 -16788 -10341 -14810 53524 76206 21316 2157 -14689 -53013 -57023 -68745 -49276 -7716
14257 -7716 -16181 -2708 -64058 -63702 -50430 -69990 -157150 -109683 -39132 -97762 -88519 -10773 22432
$$ packed form
14343f256M712J7025L1412l3785r293j1342j597l5611m5948J6883M0448k104M9510
14330A4054K5056j495K3405K1891L7295q635n7928k147L5935n3665l1806j2446
14318a0486N4809K1650k0755j4733n9118k1203k3400N052L4192N8474k740n5930
14306c4188M9928J523m7885j0891K2354j664j177l6438n836P3017J7716J8089
14294D4548o643l7939l8898K1931J806p188J8280j9737R491L508L8995L6940j830
14281F3264n8738j504n4817m4763M9082P5436P003l8950q6858K4440K8323K1294
14269a6788O447m469O8334K2682n4890j9159j6846l8324m010j1722J9469M1560
14257g716q465J3473o1350L56J3272j9560q7160M7467P0551n8630R243P7746L3205
$$ plain form
14244 22432 26875 33139 44546 26868 22706 32640 18857 -84898 -126553 -80577 -69780 -68749
14232 -68749 -86732 -111387 -117092 -47664 -38208 -70397 -72599 -70153 -60115 -51007 624 -30431 -21211
14219 -21211 587 -12872 -74153 -66079 -21349 4057 -577 -10642 -19325 -63907 -106458 -82809
14207 -82809 -16540 -19864 -56291 -27506 1069 6315 24929 36308 -8909 2178 -19491 -7610
14195 -7610 -60050 -29192 -17625 -21577 -15791 -12838 -20109 31871 59460 86706 84449 48506 -51579
14182 -51579 -52290 -64090 -61034 -58886 -1488 -8200 -5873 -19627 -57138 -85407 -55753 -1967 83866
14169 83866 53783 -12852 -27740 -13917 33373 -8532 -23551 1915 46533 45110 -1660 -38046
14157 -38046 -20706 -41176 -64072 -84435 -62969 -11223 -5810 3376 -14028 -77009 -24781 30729
$$ packed form
14244B2432M443O264J1407j7678m162R934j3783j03755m1655M5976J0797J031
14232f8749j7983k4655n705O9428R456l2189k202K446J0038R108N1631l1055R220
14219b1211K1798j3459o1281Q074M4730K5406m634j0065q683m4582m2551K3649
14207h2809O6269l324l6427K8785K8575N246J8614J1379m5217J1087k1669J1881
14195g610n2440L0858J1567l952N786K953p271N1980K7589K7246k257l5943j00085
14182e1579p11j1800L056K148N7398o712K327j3754l7511k8269K9654N3786Q5833
14169H3866l0083o6635j4888J3823M7290m1905j5019K5466M4618j423m6770l6386
14157c8046J7340k0470k2896k0363K1466N1746N413R186j7404o2981N2228N5510
$$ plain form
14145 30729 43395 20462 47251 26703 13285 -10839 14334 -27883 -44 17072 17603 37611
14133 37611 56905 65553 29113 36882 48993 28410 47545 81347 37771 7315 -17563 -1255
14121 -1255 -13353 -11362 -43496 -54663 -68978 -66782 -60926 -90283 -19445 11026 6966 35360 105752
14108 105752 127822 26351 -49121 -84687 -106927 -119199 -75908 -54941 -1361 -5051 -41124
14097 -41124 -94806 -142568 -107796 -51257 -2279 10871 -11844 -37421 -23729 23693 79338 88508
14085 88508 77810 44522 -8702 -14036 -44352 -49467 -27111 -29067 -61215 -59116 -46939 -1090
14073 -1090 102094 76764 15381 4280 8832 -6902 3797 25792 -5384 6050 -13698 -48565
14061 -48565 -85121 -69230 -29303 26134 35997 27508 -18935 -67917 -58259 -50000 -84209 -84965 -113126
$$ packed form
14145C0729J2666k2933K6789k0548j3418k4124K5173m2217K7839J7116N31K0008
14133C7611J9294Q648l6440P769J2111k0583J9135L3802m3576l0456k4878J6308
14121a255j2098J991l2134j1167j4315K196N856k9357P0838L0471m060K8394P0392
14108A05752K2070j01471p5472l5566k2240j2272M3291K0967N3580l690l6073
14097d1124n3682m7762L4772N6539M8978J3150k2715k5577J3692M7422N5645R170
14085H8508j0698l3288n3224n334l0316n115K2356j956l2148K099J2177M5849
14073a090J03184k5330o1383j1101M552j5734J0699K1995l1176J1434j9748l4867
14061d8565l6556J5891L9927N5437R863q489m6443m8982R658Q259l4209p56k8161
$$ plain form
14048 -113126 -159419 -146359 -118987 -85826 -34111 -44109 -98489 -14659 54883 40394 -7169 -36104
14036 -36104 -44918 -38335 -85403 -66535 -48066 -47361 -32639 -18832 55045 76506 26908 -4087
14024 -4087 -19959 32711 52275 138042 123515 11257 -17843 26020 15361 -22630 -43920 -20326
14012 -20326 -6885 47063 44784 -6392 -46995 -43927 -55748 -90880 -34028 38359 20082 38950
14000 38950 37993 47127 43261 64911 19172 41934 14439 35180 3935 -37765 11656 86737
13988 86737 76138 22033 6035 -12960 -37807 -40976 15817 -4503 -71648 -26656 17053 74094
13976 74094 67491 113853 127058 127507 158181 111099 60678 29875 44803 -15413 -48574 -53652
13964 -53652 -90447 -61953 -50527 -25080 -8188 -76805 -123004 -41309 -4158 26611 64655 85323
$$ packed form
14048a13126m6293J3060K7372L3161N1715r998n4380Q3830O9542j4489m7563k8935
14036c6104q814O583m7068J8868J8469P05J4722J3807P3877K1461m9598l0995
14024d087j5872N2670J9564Q5767j4527j12258k9100M3863j0659l7991k1290K3594
14012b0326J3441N3948k279n1176m0603L068j1821l5132N6852P2387j8277J8868
14000C8950r57R134l866K1650m5739K2762k7495K0741l1245m1700M9421P5081
13988H6737j0599n4105j5998j8995k4847l169N6793k0320o7145M4992M3709N7041
13976G4094o603M6362J3205M49L0674m7082n0421l0803J4928o0216l3161n078
13964e3652l6795K8494J1426K5447J6892o8617m6199Q1695L7151L0769L8044K0668
$$ plain form
13952 85323 34242 166 -2642 -16759 18361 -49075 -166697 -145743 -124537 -38721 15257 -34366
13940 -34366 -106041 -87294 -76861 -81344 -80949 -22546 -17693 24249 9520 -3749 15251 52023
13928 52023 54200 37777 60278 26313 -30741 -49686 -35846 -8485 47214 44236 47414 -17350
13916 -17350 -15909 38260 25028 13218 -3067 -29244 -44347 -15711 26744 51061 41567 7822
13904 7822 21962 25033 17180 -28455 -11325 11692 15304 30976 24399 -3605 46658 78460 87868
13891 87868 46744 9051 42869 8683 -78089 -109244 -29564 23567 -38740 -66077 -22481 51543
13879 51543 74740 109535 66401 111297 130753 121369 75696 52337 -19056 -9756 -68025 -74864
13867 -74864 -50508 -71906 -52494 -23261 7483 44780 42518 -14797 -10797 79669 63778 -13445
$$ packed form
13952H5323n1081l4076k808j4117L5120o7436j17622K0954K1206Q5816N3978m9623
13940c4366p1675J8747J0433m483L95N8403M853M1942j4729j3269J9000L6772
13928E2023K177j6423K2501l3965n7054j8945J3840K7361N5699k978L178o4764
13916a7350J441N4169j3232j1810j6285k6177j5103K8636M2455K4317r494l3745
13904G822J4140L071p853m5635J7130K3017L612J5672o577k8004N0263L1802R408
13891H7868m1124l7693L3818l4186q6772l1155P9680N3131o2307k7337M3596P4024
13879E1543K3197L4795m3134M4896J9456r384m5673k3359p1393R300n8269o839
13867g4864K4356k1398J9412K9233L0744L7297k262n7315M000R0466j5891p7223
$$ plain form
13855 -13445 -54910 -14079 13888 -41070 -123025 -115944 -55077 -7193 -23126 -50187 -74550 -48200
13843 -48200 -53333 -16065 -6233 29651 48715 32479 48653 92607 95612 42870 64373 55107
13831 55107 43359 12554 -25229 -51773 -87384 -20648 46904 58077 76605 61787 -25376 -38256
13819 -38256 -73162 -53578 -13944 -34948 -67246 -99790 -74649 -72932 -73967 -84176 -49134 196
13807 196 66863 47131 32061 56250 74510 53230 52274 38853 36742 3895 28555 40645 -501
13794 -501 -27531 -51707 -74271 -101636 -52552 -30391 3792 59008 29454 43073 82379 44847
13782 44847 42409 2696 -42621 -57982 68309 93605 10872 -49652 -54752 15345 87253 99615
13770 99615 89838 69299 53347 72554 82903 115629 75092 72320 73522 74647 49669 -695
$$ packed form
13855a3445m1465M0831K7967n4958q1955P081O0867M7884j5933k7061k4363K6350
13843d8200n133L7268R832L5884J9064j6236J6174M3954L005n2742K1503r266
13831E5107j1748l0805l7783k6544l5611O6736O7552J1173J8528j4818q7163j2880
13819c8256l4906J9584L9634k1004l2298l2544K5141J717j035j0209L5042M9330
13807A96O6667j9732j5070K4189J8260k1280r56j3421k111l2847K4660J2090m1146
13794e01k7030k4176k2564k7365M9084K2161L4183N5216k9554J3619L9306l7532
13782D4847k438l9713m5317j5361J26291K5296q2733o0524n100P0097P1908J2362
13770I9615r777k0539j5952J9207J0349L2726m0537k772J202J125k4978n0364
$$ plain form
13758 -695 -15654 27756 106036 80975 34828 2648 -11191 -53056 -23039 22610 27393 -25353
13746 -25353 -28527 -37684 -56727 -64486 -41478 -30665 -86035 -69096 -19976 -6901 39871 95794
13734 95794 51942 34603 1652 -60901 -64161 -96615 -29089 25787 -24459 -86181 -40411 70962
13722 70962 38150 76221 86294 39624 8516 5606 25451 8443 829 75412 72633 67268
13710 67268 43706 -8044 2675 71911 72859 137242 88577 14711 33246 83438 59097 40603
13698 40603 26787 45899 43913 36399 10771 -16131 24487 81715 -21300 -96566 -75713 -38914
13686 -38914 -65158 -44696 -41264 11801 42248 22597 39311 25844 -4610 2898 17934 18842
13674 18842 50549 97625 51144 62106 29041 -4530 -35951 -97384 -116670 -71824 -37708 -10980
$$ packed form
13758f95j4959M3410P8280k5061m6147l2180j3839m1865L0017M5649M783n2746
13746b5353l174r157j9043p759K3008J0813n5370J6939M9120J3075M6772N5923
13734I5794m3852j7339l2951o2553l260l2454O7526N4876n0246o1722M5770J11373
13722G0962l2812L8071J0073m6670l1108k910J9845j7008p614P4583k779n365
13710F7268k3562n1750J0719O9236R48O4383m8665p3866J8535N0192k4341j8494
13698D0603j3816J9112j986p514k5628k6902M0618N7228j03015p5266K0853L6799
13686c8914k6244K0462L432N3065L0447j9651J6714j3467l0454P508J5036R08
13674A8842L1707M7076m6481J0962l3065l3571l1421o1433j9286M4846L4116K6728
$$ plain form
13662 -10980 27455 65149 105999 56332 47952 31989 -8495 -17042 8899 775 46877 67123
13650 67123 23092 -24674 -64678 -47775 -7152 67524 77911 26600 9507 -13410 -64102 -68423
13638 -68423 -30386 6615 25429 4060 -2789 42521 15105 -3176 4752 32024 39895 -7048
13626 -7048 -13651 -61018 -85604 -73612 -35248 -10760 -33446 -3944 -69817 -123287 -74817 -51318
13614 -51318 -591 60593 42923 57098 37189 -36733 -46319 8802 -69870 -98555 36277 59803
13602 59803 83464 73871 73296 49972 48246 47395 58555 49199 57558 46561 12486 1043 24172
13589 24172 55783 68543 34299 1988 26086 26323 29008 36911 -11768 -42454 -72350 -130099
13577 -130099 -93677 -42999 24775 34804 -22752 -30599 -23428 -59944 -89260 -49986 -30222 16335
$$ packed form
13662a0980L8435L7694M0850m9667q380j5963m0484q547K5941q124M6102K0246
13650F7123m4031m7766m0004J6903M0623P4676J0387n1311j7093k2917n0692m321
13638f8423L8037L7001J8814k1369o849M5310k7416j8281P928K7272P871m6943
13626g048o603m7367k4586J1992L8364K4488k2686K9502o5873n3470M8470K3499
13614e1318N0727O1184j7670J4175j9909p3922r586N5121p8672k8685J34832K3526
13602E9803K3661r593n75k3324j726q51J1160r356Q359j0997l4075j1443K3129
13589B4172L1611J2760l4244l2311K4098K37K685P903m8679l0686k9896n7749
13577a30099L6422N0678O7774J0029n7556p847P171l6516k9316L9274J9764M6557
$$ plain form
13565 16335 -207 -59447 -54067 -43414 -11504 26699 -15742 -59127 -119416 -121086 -106633 -55491
13553 -55491 -74159 -71869 -58373 -2242 -3320 34710 17416 25680 19409 -28732 -81723 -123934
13541 -123934 -39333 24122 4971 -21974 -48655 3876 -1607 -52824 -115819 -183638 -128313 -54992
13529 -54992 -52509 -71793 -58203 -4768 16686 -1788 -20992 46807 60526 5124 -76725 -127516
13517 -127516 -138087 -17614 33875 8925 68599 56710 19755 37164 38920 41418 -42455 -52602
13505 -52602 -45782 -14516 52473 16024 33031 34617 -23766 -22530 -48903 -55640 -51035 -23332 -80208
13492 -80208 -51752 4387 8491 -25699 -38227 -27939 32680 103628 103452 41062 30869 71549
13480 71549 64157 26234 40510 17707 23397 27358 -27587 -71052 -38881 -1483 40079 53344
$$ packed form
13565A6335j6542n9240N380J0653L1910L8203m2441m3385o0289j670J4453N1142
13553e5491j8668K290J3496N6131j078L8030j7294Q264o271m8141n2991m2211
13541a23934Q4601O3455j9151k6945k6681N2531n483n1217o2995o7819N5325P3321
13529e4992K483j9284J3590N3435K1454j8474j9204O7799J3719n5402q1849n0791
13517a27516j0571J20473N1489k4950N9674j1889l6955J7409J756K498q3873j0147
13505e2602O820L1266O6989l6449J7007J586n8383J236k6373o737M605K7703n6876
13492h0208K8456N6139M104l4190j2528J0288O0619P0948j76o2390j0193M0680
13480G1549p392l7923J4276k2803N690L961n4945m3465L2171L7398M1562J3265
$$ plain form
13468 53344 27918 8605 48080 71600 77298 65574 33840 418 -32978 -16077 -54639 -59661
13456 -59661 -119817 -142477 -90226 -43504 -41286 -97697 -138823 -97745 -58955 -11977 -6612 -22534
13444 -22534 -39314 34079 77133 42758 -837 -14891 54211 26282 -51257 -50752 -30656 225
13432 225 28437 9130 17849 41024 63044 56901 38991 1585 -10342 -5409 1932 -13656 -10703
13419 -10703 -37411 32639 79974 76413 76254 59072 -25788 -17648 13117 20299 5936 7874 -9737
13406 -9737 -9847 -4168 -100898 -98929 -80355 -105249 -129768 -52667 -14150 -27013 -68212 -91622 16345
13393 16345 50600 43375 40888 12247 -31698 -18227 -30536 24004 55425 91398 53542 32759
13381 32759 28311 -20547 -20394 -5977 69397 94669 86982 94092 71561 51056 14251 -15015 -35484
$$ packed form
13468E3344k5426j9313L9475K3520N698j1724l1734l3422l3396J6901l8562n022
13456e9661o0156k2660N2251M6722K218n6411m1126M1078L8790M6978N365j5922
13444b2534j6780P3393M3054l4375m3595j4054O9102k7929p7539N05K0096L0881
13432B25K8212j9307Q719K3175K2020o143j7910l7406j1927M933P341j5588K953
13419a0703k6708P0050M7335l561j59j7182q4860Q140L0765P182j4363J938j7611
13406i737j10N679r6730J969J8574k4894k4519P7101L8517j2863m1199k3410J07967
13393A6345L4255p225k487k8641m3945J3471j2309N4540L1421L5973l7856k0783
13381C2759m448m8858J53J4417P5374K5272p687P110k2531k0505l6805k9266k0469
$$ plain form
13368 -35484 13489 8756 -65005 -90557 -77995 -45572 -84882 -92446 -88481 -70365 -61702 -4646
13356 -4646 29587 99255 147008 145641 126825 69891 -28123 -109777 -41600 77449 77203 120788
13344 120788 99646 37760 57958 94033 75440 73431 56189 39648 43736 31642 26699 33980
13332 33980 -22104 -81986 -98712 -142774 -152994 -132012 -96215 -68083 -66156 -67763 -51391 -78326
13320 -78326 -66092 -51795 -1230 29632 38301 30337 13615 -44209 -25947 3375 66346 125911
13308 125911 85869 81649 150312 118023 93574 104967 91763 65929 48763 38083 -105113
13297 -105113 -61605 22800 26413 -5797 -20643 -82207 -78716 -77719 -29113 19314 18921 16900 31933
13284 31933 56198 74115 97780 26266 -23113 11298 2576 -21749 6766 -4145 -46307 -16299
$$ packed form
13368c5484M8973m733p3761k5552J2562L2423l9310p564L965J8116Q663N7056
13356d646L4233O9668M7753j367j8816n6934r8014q1654O8177J19049k46M3585
13344A20788k1142o1886K0198L6075j8593k009j7242j6541M088j2094m943P281
13332C3980n6084n9882j6726m4062j0220K0982L5797K8132J927j607J6372k6935
13320g8326J2234J4297N0565L0862Q669p964j6722n7824J8262K9322O2971N9565
13308A25911m0042m220O8663l2289k4449J1393j3204k5834j7166j0680j43196
13297a05113M3508Q4405L613l2210j4846o1564L491R97M8606M8427l93k021J5033
13284C1933K4265J7917K3665p1514m9379L4411q722k4325K8515j0911m2162L0008
$$ plain form
13272 -16299 57613 62772 8175 18236 50331 22000 73139 71719 101604 117530 79019 41934
13260 41934 31878 66308 73678 37866 3428 -669 10342 39575 18284 -5257 -56461 -91708
13248 -91708 -49955 -24439 -18555 -83284 -120339 -141443 -109349 -106832 -53352 -52398 -39654 -9262
13236 -9262 -30585 17428 60830 72642 -24897 -95667 -47893 -20767 -18179 -93252 -125857 -110381
13224 -110381 -90280 -16969 86167 70724 5836 -53234 -75895 -104788 -70023 -14496 -7165
13213 -7165 6986 3877 50221 63853 37886 91014 94173 42255 75437 26927 36598 57263
13201 57263 13671 -42123 -24617 7475 -48803 -28578 22484 8864 -4255 620 14208 33233
13189 33233 19727 3262 -10541 63910 79159 24854 22186 -18788 3420 48029 52456 10117
$$ packed form
13272a6299P3912N159n4597J0061L2095k8331N1139j420K9885J5926l8511l7085
13260D1934j0056L4430P370l5812l4438m097J1011K9233k1291k3541n1204l5247
13248i1708M1753K5516N884o4729l7055k1104L2094K517N3480R54J2744L0392
13236i262k1323M8013M3402J1812r7539p0770M7774K7126K588p5073l2605J5476
13224a10381K0101P3311J03136j5443o4888n9070k2661k8893L4765N5527P331
13213g165J4151l109M6344J3632k5967N3128L159n1918L3182m8510R671K0665
13201E7263m3592n5794J7506L2092n6278K0225N1062j3620j3119M875J3588J9025
13189C3233j3506j6465j3803P4451J5249n4305k668m0974K2208M4609M427m2339
$$ plain form
13177 10117 -34447 -44798 -24520 5527 11732 39454 35982 37845 52834 40349 27118 18127
13165 18127 85176 41355 46761 37249 20565 -26238 -5302 636 29850 38217 4098 -32148
13153 -32148 -58908 -10625 18178 -14821 1062 46971 16518 -16876 -33772 -66579 -70482 885
13141 885 9226 18025 -2050 -73126 -125482 -138260 -89094 -17041 -13911 -26035 -61617 -42147 -37111
13128 -37111 -12431 -27313 -40868 -10008 -14031 -50829 -14645 53831 76608 46815 81320 17367
13116 17367 -9738 -18976 -34881 -55504 -38053 -15008 -20225 -32492 -47588 -81721 -93718 -31377
13104 -31377 -15074 -24653 -6564 -36239 -76224 -70434 -2224 44066 27738 -28430 -44125 -86400
13092 -86400 -53699 -29328 -22752 -70395 -59739 -31042 -48381 -81993 -7551 54318 89878 71853
$$ packed form
13177A0117m4564j0351K0278L0047O205K7722l472J863J4989j2485j3231q991
13165A8127O7049m3821N406r512j6684m6803K0936N938K9214Q367l4119l6246
13153c2148k6760M8283K8803l2999J5883M5909l0453l3394j6896l2807l903P1367
13141H85Q341Q799k0075p1076n2356j2778M9166P2053L130j2124l5582J9470N036
13128c7111K4680j4882j3555L0860m023l6798L6184O8476K2777k9793L4505o3953
13116A7367k7105r238j5905k0623J7451K3045n217j2267j5096l4133j1997O2341
13104c1377J6303r579J8089k9675l9985N790O8210M6290j6328n6168j5695m2275
13092h6400L2701K4371O576m7643J0656K8697j7339l3612P4442O1869L5560j8025
$$ plain form
13080 71853 -6158 -51577 -456 69765 110982 70505 52591 23329 -21942 10734 40495 7909
13068 7909 3008 -14456 29242 -468 -47499 -1471 -59040 -74144 -44766 3484 30681 88541
13056 88541 130089 123594 51953 7546 11251 -40210 -87308 -71721 -69813 -981 3106 -6441 14588
13043 14588 58960 131073 145073 114498 135805 125751 95141 33240 45333 5081 13701 38092
13031 38092 82414 22837 -20654 -67370 -36581 -13485 -10054 -55322 12701 93193 52619 29106
13019 29106 -519 628 27919 23422 43075 -39592 -92530 -102130 -69464 -55607 -47527 -70548
13007 -70548 -62812 20096 69883 69253 82933 51258 8035 43661 16146 -2186 -24043 -46038
12995 -46038 -39501 32778 71280 50963 -31763 -102169 -74931 -74453 -76361 -86497 -58684 -16494
$$ packed form
13080G1853p8011m5419N1121P0221M1217m0477j7914k9262m5271L2676K9761l2586
13068G909m901j7464M3698k9710m7031M6028n7569j5104K9378M8250K7197N7860
13056H8541M1548o495p1641m4407L705n1461m7098J5587J908O8832M087r547K1029
13043A4588M4372P2113J4000l0575K1307j0054l0610o1901J2093m0252Q620K4391
13031C8092M4322n9577m3491m6716L0789K3096L431m5268O8023Q0492m0574k3513
13019B9106k9625J147K7291m497J9653q2667n2938r600L2666J3857Q080k3021
13007g0548P736Q2908M9787o30J3680l1675m3223L5626k7515j8332k1857k1995
12995d6038O537P2279L8502k0317q2726p0406K7238M78j908j0136K7813M2190
$$ plain form
12983 -16494 17287 33799 38878 28410 19077 23111 92146 76805 68735 70655 26734 -12468 -12797
12970 -12797 -9396 -6519 49096 57843 14495 48769 56700 98825 155947 152933 124771 97109 27910
12957 27910 22720 76414 122879 91445 39939 20838 7064 8066 13580 -4409 2379 20195
12945 20195 -33900 -77826 -46200 -48306 -71054 -88105 -97355 24210 77047 63667 8334 -46434
12933 -46434 -28033 -33688 -17997 -19868 -38631 -93176 -53274 -64718 -98332 -105755 -47227 -17027
12921 -17027 -19345 -40404 -91364 -41776 -37461 -37612 -25366 -2736 -13956 -56220 -41031 740
12909 740 84 48665 16169 -20156 3867 32099 31997 4913 -8062 -10790 3630 35311 -2809
12896 -2809 17613 12919 -36763 -59806 -12305 31220 -2726 5067 10291 -9856 5647 38282
$$ packed form
12983a6494L3781J6512N079j0468r333M034O9035j5341q070J920m3921l9202l29
12970a2797L401K877N5615Q747m3348L4274P931M2125N7122l014k8162k7662o9199
12957B7910n190N3694M6465l1434n1506j9101j3774J002N514j7989O788J7816
12945B0195n4095m3926L1626k106k2748j7051r250J21565N2837j3380n5333n4768
12933d6434J8401n655J5691j871j8763n4545L9902j1444l3614p423N8528L0200
12921a7027k318k1059n0960M9588M315j51J2246K2630j1220m2264J5189M1771
12909G40o56M8581l2496l6325K4023K8232j02k7084j2975k728J4420L1681l8120
12896b809K0422m694m9682k3043M7501M3525l3946P793N224k0147J5503L2635
$$ plain form
12884 38282 51095 9978 -41592 -62391 -27648 -18064 11755 -499 8921 45627 74211 113971
$$ packed form
12884C8282J2813m1117n1570k0799L4743R584K9819j2254R420L6706K8584L9760
$$ [...]
##END NTUPLES=NMR SPECTRUM
##END=
