##TITLE=Analysis number 325643
Compound Code tl 00700
Book Reference 105539
Project Code adrs fraglib
Chemist Name jom
##JCAMPDX= 6.0         $$ Bruker NMR JCAMP-DX V2.0
##DATA TYPE= NMR SPECTRUM
##DATA CLASS= NTUPLES
##ORIGIN= Bruker BioSpin GmbH
##OWNER= nmr
$$ XWIN-NMR		Version 3.5
$$ Fri Jan  5 15:02:16 2007 GMT Standard Time (UT+0h)  MAYBRIDGE\nmr@NMR_250MHZ
##.OBSERVE FREQUENCY= 250.131544655141
##.OBSERVE NUCLEUS= ^1H
##.ACQUISITION MODE= SIMULTANEOUS (DQD)
##.ACQUISITION SCHEME= undefined
##.AVERAGES= 16
##.DIGITISER RES= 18
##SPECTROMETER/DATA SYSTEM= dpx250
##.PULSE SEQUENCE= zg30
##.SOLVENT NAME= CDCl3
##.SHIFT REFERENCE= (INTERNAL, CDCl3, 0, 16.5135)
##AUDIT TRAIL= $$ (NUMBER, WHEN, WHO, WHERE, WHAT)
$$ ##TITLE= Audit trail, XWIN-NMR		Version 3.5
$$ ##JCAMPDX= 5.01
$$ ##ORIGIN= Bruker BioSpin GmbH
$$ ##OWNER= nmr
$$ C:\u/data/dgb/nmr/ADRS/590/pdata/1/auditp.txt
$$ ##AUDIT TRAIL=  $$ (NUMBER, WHEN, WHO, WHERE, WHAT)
(   1,<2007-01-05 15:01:46.70 +000>,<MAYBRIDGE\nmr>,<NMR_250MHZ>,
      <created by zg, POWCHK disabled, PULCHK disabled
       configuration hash MD5:
       49 4B E0 1D 92 C2 6B 37 9F E6 65 BC 52 41 86 1D
       data hash MD5: 64K
       FE 80 A2 2B A6 C1 1A A0 C2 FD A2 10 A2 61 A5 E1>)
(   2,<2007-01-05 15:02:04.86 +000>,<MAYBRIDGE\nmr>,<NMR_250MHZ>,
      <Start of raw data processing
       ef LB = 0.3 FT_mod = 6 PKNL = 1 SI = 32K 
       data hash MD5: 32K
       3D 77 96 7F 8A 43 29 86 DD 9B AA 5E CE E5 E9 48>)
(   3,<2007-01-05 15:02:06.55 +000>,<MAYBRIDGE\nmr>,<NMR_250MHZ>,
      <apk 
       data hash MD5: 32K
       B1 5E 7D 64 66 B7 42 B1 51 21 B9 8F 63 FE 47 12>)
(   4,<2007-01-05 15:02:07.30 +000>,<MAYBRIDGE\nmr>,<NMR_250MHZ>,
      <abs ABSG = 5 
       data hash MD5: 32K
       44 AF 02 7F 9E 2A E0 37 64 58 FA 09 17 1D F3 65>)
$$ ##END=
$$ 
$$ hash MD5
$$ 18 B6 4E 7D E9 4F 4D 20 7A E1 B7 86 5E 45 44 53
##$RELAX= 
##$RELAX= 
##$RELAX= 
##$RELAX= 
##$RELAX= 
##$RELAX= 
##$RELAX= 
$$ Bruker specific parameters
$$ --------------------------
##$DU= <C:\u>
##$EXPNO= 590
##$NAME= <ADRS>
##$PROCNO= 1
##$TYPE= <nmr>
##$USER= <dgb>
##$AMP= (0..31)
100 100 100 100 100 100 100 100 100 100 100 100 100 100 100 100 100 100 
100 100 100 100 100 100 100 100 100 100 100 100 100 100 
##$AQSEQ= 0
##$AQ_mod= 3
##$AUNM= <au_zg>
##$AUTOPOS= <60 >
##$BF1= 250.13
##$BF2= 250.13
##$BF3= 250.13
##$BF4= 250.13
##$BF5= 500.13
##$BF6= 500.13
##$BF7= 500.13
##$BF8= 500.13
##$BYTORDA= 1
##$CFDGTYP= 0
##$CFRGTYP= 5
##$CHEMSTR= <none>
##$CNST= (0..31)
1 1 145 1 1 1 1 1 1 1 1 1 1 1 1 1 1 1 1 1 1 1 1 1 1 1 1 1 1 1 1 1 
##$CPDPRG= <>
##$CPDPRG1= <>
##$CPDPRG2= <>
##$CPDPRG3= <>
##$CPDPRG4= <mlev>
##$CPDPRG5= <mlev>
##$CPDPRG6= <mlev>
##$CPDPRG7= <mlev>
##$CPDPRG8= <mlev>
##$CPDPRGB= <>
##$CPDPRGT= <>
##$D= (0..31)
0 1 0 0 0 0 0 0 0 0.06 0 0 0 0 0 0 0.0002 0 0 0 0 0 0 0 0 0 0 0 0 0 0 
0 
##$DATE= 1168009304
##$DBL= (0..7)
120 120 120 120 120 120 120 120 
##$DBP= (0..7)
150 150 150 150 150 150 150 150 
##$DBP07= 0
##$DBPNAM0= <>
##$DBPNAM1= <>
$$ [...]
##$SUBNAM7= <"">
##$SUBNAM8= <"">
##$SUBNAM9= <"">
##$SW= 20.6930455092707
##$SWIBOX= (0..15)
0 0 3 0 0 0 0 0 0 0 0 0 0 0 0 0 
##$SW_h= 5175.983436853
##$TD= 65536
##$TD0= 1
##$TE= 294.16
##$TE2= 300
##$TE3= 300
##$TEG= 300
##$TL= (0..7)
0 120 120 120 120 120 120 120 
##$TP= (0..7)
150 150 150 150 150 150 150 150 
##$TP07= 0
##$TPNAME0= <>
##$TPNAME1= <>
##$TPNAME2= <>
##$TPNAME3= <>
##$TPNAME4= <>
##$TPNAME5= <>
##$TPNAME6= <>
##$TPNAME7= <>
##$TPOAL= (0..7)
0.5 0.5 0.5 0.5 0.5 0.5 0.5 0.5 
##$TPOFFS= (0..7)
0 0 0 0 0 0 0 0 
##$TUNHIN= 0
##$TUNHOUT= 0
##$TUNXOUT= 0
##$USERA1= <user>
##$USERA2= <user>
##$USERA3= <user>
##$USERA4= <user>
##$USERA5= <user>
##$V9= 5
##$VALIST= <valist>
##$VCLIST= <CCCCCCCCCCCCCCC>
##$VD= 0
##$VDLIST= <DDDDDDDDDDDDDDD>
##$VPLIST= <PPPPPPPPPPPPPPP>
##$VTLIST= <TTTTTTTTTTTTTTT>
##$WBST= 1024
##$WBSW= 4
##$XGAIN= (0..3)
0 0 0 0 
##$XL= 0
##$YL= 0
##$YMAX_a= 611305
##$YMIN_a= -688952
##$ZGOPTNS= <>
##$ZL1= 120
##$ZL2= 120
##$ZL3= 120
##$ZL4= 120
##$ABSF1= 16.51348
##$ABSF2= -4.179693
##$ABSG= 5
##$ABSL= 3
##$ALPHA= 0
##$AQORDER= 0
##$ASSFAC= 0
##$ASSFACI= 0
##$ASSFACX= 0
##$ASSWID= 0
##$AUNMP= <proc_1d>
##$AZFE= 0.1
##$AZFW= 0.1
##$BCFW= 0
##$BC_mod= 0
##$BYTORDP= 0
##$COROFFS= 0
##$CY= 12.5
##$DATMOD= 1
##$DC= 0
##$DFILT= <>
##$DTYPP= 0
##$F1P= 14.0000005364418
##$F2P= -0.99999901652339
##$FCOR= 0.5
##$FTSIZE= 32768
##$FT_mod= 6
##$GAMMA= 0
##$GB= 0
##$INTBC= 1
##$INTSCL= 1
##$ISEN= 128
##$LB= 0.3
##$LEV0= 0
##$LPBIN= 0
##$MAXI= 10000
##$MC2= 0
##$MEAN= 0
##$ME_mod= 0
##$MI= 0
##$NCOEF= 0
##$NC_proc= -1
##$NLEV= 6
##$NOISF1= 0
##$NOISF2= 0
##$NSP= 0
##$NTH_PI= 0
##$NZP= 0
##$OFFSET= 16.51348
##$PC= 1
##$PHC0= 224.9269
##$PHC1= 4.054756
##$PH_mod= 1
##$PKNL= yes
##$PPARMOD= 0
##$PSCAL= 4
##$PSIGN= 0
##$REVERSE= no
##$SF= 250.130002128778
##$SI= 32768
##$SIGF1= 0
##$SIGF2= 0
##$SINO= 400
##$SIOLD= 32768
##$SREGLST= <1H.CDCl3>
##$SSB= 0
##$STSI= 32768
##$STSR= 0
##$SW_p= 5175.98343685301
##$SYMM= 0
##$S_DEV= 0
##$TDeff= 65536
##$TDoff= 0
##$TI= <Analysis number 999999
Compound Code 99
Book Reference 9
Project Code 9>
##$TILT= no
##$TM1= 0
##$TM2= 0
##$TOPLEV= 0
##$USERP1= <user>
##$USERP2= <user>
##$USERP3= <user>
##$USERP4= <user>
##$USERP5= <user>
##$WDW= 1
##$XDIM= 32768
##$YMAX_p= 304337089
##$YMIN_p= -40528
$$ End of Bruker specific parameters
$$ ---------------------------------
##NTUPLES= NMR SPECTRUM
##VAR_NAME=  FREQUENCY,     SPECTRUM/REAL,   SPECTRUM/IMAG
##SYMBOL=    X,             R,               I
##VAR_TYPE=  INDEPENDENT,   DEPENDENT,       DEPENDENT
##VAR_FORM=  AFFN,          ASDF,            ASDF
##VAR_DIM=   32768,         32768,           32768
##UNITS=     HZ,            ARBITRARY UNITS, ARBITRARY UNITS
##FACTOR=    0.157963299565203, 1,           1
##FIRST=     4130.51659565082, 0,            0
##LAST=      -1045.46684120219, 0,           0
##MIN=       -1045.46684120219, -40528,      0
##MAX=       4130.51659565082, 304337089,    0
$$ Real data points
##PAGE= N=1
##DATA TABLE= (X++(R..R)), XYDATA
$$ [...]
19698b288M38L101J315l065J90K649Q52J686J909j848j079M495J0092J0170J2675
$$ -2288 -1850 1251 2566 -499 -309 2340 3192 4878 6787 4939 3860 8355 18447 28617 41292
19683D1292J4188J4960Q510L413j63j1900j0166n490j060J081M807R696J2132
$$ 41292 55480 70440 78950 82363 82200 70300 60134 54644 53584 54665 59472 69168 81300
19670H1300M685K92n587r487j0248j2397j0849r941o144p2k987J488O2j984j77
$$ 81300 85985 86277 80690 71203 60955 48558 37709 27768 21624 21552 18565 20053 20115 18131 17954
19655A7954j32K040L80R03j242o77l652k193j737J370l631o86J181L69m43k915
$$ 17954 17822 19862 20242 21145 19903 19226 15574 13381 11644 13014 9383 8697 9878 10247 9804 6889
19639F889j583J138K810K209K849M707O457R500J2749J3670J3478J2121L394j186
$$ 6889 5306 6444 9254 11463 14312 19019 25476 34976 47725 61395 74873 86994 90388 89202
19625H9202m372O14j69r5J686M358j551q810j4240j1957j2611q001r876r156l671
$$ 89202 84830 85444 85275 85180 86866 91224 89673 80863 66623 54666 42055 34054 24178 15022 11351
19610A1351j78Q10m279j259j461j424l24K832K94l444j963J317l82M12O29j34
$$ 11351 11173 11983 7704 6445 4984 3560 3236 6068 6362 2918 955 2272 1890 2302 2931 2797
19594B797m890k67L953j573j773R68P24L148M696j516k030l968l391K566K288
$$ 2797 -2093 -2360 1593 20 -1753 -785 -61 3087 7783 6267 4237 269 -3122 -556 1732
19579A732k663k297L354J664o73L49j035J774O98L88k919j034P18J187j906m03
$$ 1732 -931 -3228 126 1790 1117 1466 431 2205 2903 3291 372 -662 56 1243 -663 -1066
19563a066j073j464l676J239M441M731j028m03J282j305o41J347J520P38n507
$$ -1066 -2139 -3603 -7279 -6040 -1599 3132 2104 1701 2983 1678 1037 2384 3904 4642 -865
19548h65l505j327L505K213l41K457K735j06m61l746l661K18K581R23j300k048
$$ -865 -4370 -5697 -2192 21 -320 2137 4872 4766 4305 559 -3102 -2884 -303 620 -680 -2728
19532b728L68J971j097n73M979J426R1n80k06J096J2l361k643j614o79K975M817
$$ -2728 -2360 -389 -1486 -2059 2920 4346 4437 3857 3651 4747 4759 1398 -1245 -2859 -3538 -563 4254
19515D254K559m123l382J749k735j984J372j314j11R47L033L711K99k568N9j776
$$ 4254 6813 2690 -692 1057 -1678 -3662 -2290 -3604 -3715 -2768 265 3976 4275 1707 1766 -10
19499a0k321K778P33J389J169j614j498o19J06j514K025M713L287J49k299m228
$$ -10 -2331 447 1180 2569 3738 2124 626 7 113 -1401 624 5337 8624 8773 6474 2246
19483B246K215O5p18m77k147P09j192k684J617K517k027j794n5r35j273l87M71
$$ 2246 4461 4526 3808 3331 1184 1893 701 -1983 -366 2151 124 -1670 -1725 -2660 -3933 -4320 -3849
19466c849j468q56K173L967K192J130j460j169K878J283j273J340j857j201m020
$$ -3849 -5317 -6173 -4000 -33 2159 3289 1829 660 3538 4821 3548 4888 3031 1830 -2190
19451b190K515J638J989P04j303J96R18L062O01n30k409k69L978j12J910J674
$$ -2190 325 1963 3952 4656 3353 3549 4467 7529 8130 7600 5191 4922 8900 8788 10698 12372
19435A2372j068K529L319N410K237j203R46M169M015J281j654k604J40j961l309
$$ 12372 11304 13833 17152 22562 24799 23596 24542 28711 32726 34007 32353 29749 29889 27928 24619
19420B4619J297K902k548n148n697M63J240Jj185k303l09J840J455k137k347k442
$$ 24619 25916 28818 26270 21122 15425 15888 17128 17129 15944 13641 13332 15172 16627 14490 12143 9701
19404I701p05J797L908j90j487L042K002k845n239k198K655L062L211R98J484
$$ 9701 8996 10793 14701 14511 13024 16066 18068 15223 9984 7786 10441 13503 16714 17712 19196
19389A9196P113Q638J1564J9850O169q635q430M193Q992J1987J7286K2605K5827
$$ 19196 26309 34947 46511 66361 72530 63895 55465 59658 68650 80637 97923 120528 146355
19376A46355K3702J7829J8630J0704k964j7451k6932j5802m416K505O695J3929
$$ 146355 170057 187886 206516 217220 214256 196805 169873 154071 149655 152160 158855 172784
19364A72784J4845J1616P659r838j6104j9632k5937k4570k0259j4520j1539p861
$$ 172784 187629 199245 206904 197066 180962 161330 135393 110823 90564 76044 64505 56644
19352E6644j622j151j545l474O112J2219M973l57p91l294m442r900m117L69N880
$$ 56644 55022 53871 52326 48852 54964 67183 72156 71799 71008 67714 63272 53372 49255 49624 55504
19337E5504P581Q428R869J7843J7955j607k0031j9170r041n69O639J8076L2643
$$ 55504 63085 71513 81382 99225 117180 115573 95542 76372 67331 66762 73401 91477 124120
19324A24120M6394L9431K3979J2010K252r342j8391j7193n840L598Q632N494n65
$$ 124120 170514 209945 233924 245934 248186 238844 220453 203260 197420 201018 209650 215144 214579
19311B14579r056k1102k3356k8831k8329k1468j7204j0576r865r857n246K101
$$ 214579 205523 184421 161065 132234 103905 82437 65233 54657 44792 34935 29689 31790
19299C1790K480K79n45j333o3j001k823j249Q72j608O54r63J801J245J98j784
$$ 31790 34270 34549 34004 32671 32608 31607 28784 27535 28407 26799 27453 26490 28291 29536 29734 27950
19283B7950L294K421l535n575j140k37K03l338j910J512m04j277l147j77J92Q57
$$ 27950 31244 33665 30130 24555 23415 23178 23381 20043 18133 19645 19241 17964 14817 14640 14832 15689
19267A5689m91p93j150K983%l161k24L113j004m0J835L565L320p26j115K044l229
$$ 15689 15198 14405 13255 16238 16238 13077 12853 15966 14962 14922 16757 20322 23642 22916 21801 23845 20616
19250B0616p37K301J486J721N521R521M051J768K408j816K164J768k243k72J597
$$ 20616 19879 22180 23666 25387 30908 40429 44480 46248 48656 46840 49004 50772 48529 48257 49854
19235D9854M813K143P88m79j203L14r33P80j079n859j44K80K861N332K554K575
$$ 49854 54667 56810 57598 57119 55916 56230 55297 56077 54998 49139 48995 49275 52136 57468 60022 62597
19219F2597j7k159K650M021L287M918K346L905L52L973L042M613P843Q442J1627
$$ 62597 62580 60421 63071 67092 70379 75297 77643 81548 81900 85873 88915 93528 101371 109813 121440
19204A21440P241J1111J4053K0521K3204K4659K5053K3667J9151J5493J9002K5642
$$ 121440 128681 139792 153845 174366 197570 222229 247282 270949 290100 305593 324595 350237
19192C50237L0982K9713L3740L6780M2489N2282N5818N6244O6350Q4568J10991
$$ 350237 381219 410932 444672 481452 523941 576223 632041 688285 754635 839203 950194
19181I50194J55040K22433L37070N30328Q67034J407948K065587K561325K766915
$$ 950194 1105234 1327667 1664737 2195065 3062099 4470047 6535634 9096959 11863874
19172A1863874K108876P10895m42559j702811k186249j651021p61694L15420J233251
$$ 11863874 13972750 14683645 14241086 12538275 10352026 8701005 7939311 8254731 9487982
19163I487982J856088J791907J313532P83930l93955j377014j763662k168689
$$ 9487982 11344070 13135977 14449509 15233439 14839484 13462470 11698808 9530119
19155I530119k076224j529310r80209m37702j23539j49888l72462n51365n40044
$$ 9530119 7453895 5924585 4944376 4506674 4383135 4233247 3860785 3309420 2769376
19146B769376l59330j44699J8815J27749K14817K21771J03507N727o7834k16980
$$ 2769376 2410046 2265347 2284162 2411911 2626728 2848499 2952006 2957733 2889899 2672919
19136B672919k79487k35774j99669j54423r4661l8023J8923P5608J38260K35798
$$ 2672919 2393432 2157658 1957989 1803566 1708905 1670882 1689805 1765413 1903673 2139471
19126B139471L96319O66708J107995J767616K447554K895477K980581K040342
$$ 2139471 2535790 3202498 4310493 6078109 8525663 11421140 14401721 16442063
19118A6442063P79335q2634r86488q64337m0550O71526Q43090O93707j3585j303791
$$ 16442063 17221398 17138764 16152276 15287939 15247389 15918915 16762005 17455712 17442127 16138336
19108A6138336j993934k445081k713970k328162j812548j307857q54207n47103
$$ 16138336 14144402 11699321 8985351 6657189 4844641 3536784 2682577 2135474
19100B135474l62251k56912j88597j43551j17895j00778q5084p6986p2276o4872
$$ 2135474 1773223 1516311 1327714 1184163 1066268 965490 880406 803420 731144 666272
19090F66272o5900o4714n3265l8902l1982k3883j9546j2809j6752k4095k4794
$$ 666272 600372 535658 482393 443491 411509 387626 368080 355271 338519 314424 289630
19079B89630k4793k0594j4628j5894j6531j4388p632m470k242q759o909k196P43
$$ 289630 264837 244243 229615 213721 197190 182802 175170 170700 168458 159699 152790 150594 151337
19066A51337n132n913n227m871l014l740j713j61o033o467j091k052k680m870
$$ 151337 146205 140292 135065 130194 127180 123440 121727 121566 115533 109066 107975 105923 103243 98373
19052I8373o163k730O47m136l616l584n130j803k97j938J36o60o132n626n675
$$ 98373 92210 89480 90127 85991 82375 78791 73661 71858 71561 69623 69759 69099 62967 57341 51666
19037E1666k768P06J144L305o09L017L583j516n188k1R39k818l579M636L194K301
$$ 51666 48898 49604 50748 54053 53444 56461 60044 58528 53340 53319 54258 51440 47861 52497 55691 57992
19021E7992k502j6m55l262m72k443l138j765j684J14K979J195L103M22q68o23
$$ 57992 55490 55474 55019 51757 51285 48842 45704 43939 42255 42369 45348 46543 49646 50068 49200 48577
19005D8577m553l699l882m838M321M73j99j720j377m541j183L995K874P21M228
$$ 48577 44024 40325 36443 31605 35926 36399 36200 34480 33103 28562 27379 31374 34248 34969 39197
18990C9197j701l348q93l584P44j55Q20L17P34N35J286K270l767m582l006l831
$$ 39197 37496 34148 33255 29671 30415 30260 31080 31397 32131 32666 33952 36222 32455 27873 24867 21036
18974B1036m583k355O97R32J721m13K098M349N196m08m225k587j018J880M775
$$ 21036 16453 14098 14795 15727 17448 17035 19133 23482 28678 28270 24045 21458 20440 22320 27095
18959B7095j611n008m475p95Q46L118J166o39m53k633k238k57J742K916K964j954
$$ 27095 25484 20476 16001 15206 16052 19170 20336 19697 19244 16611 14373 14116 15858 18774 21738 19784
18943A9784m508j28J507R66ql396p34j786j37l45j885p84p63N55L926j351n697
$$ 19784 15276 15148 16655 17621 17613 14217 13483 11697 11560 11215 9330 8546 7783 8338 12264 10913 5216
18926E216k139L065N54m18K964K848P37p23M10K243k24j752Q9L294K575J165J271
$$ 5216 3077 6142 6696 6278 9242 12090 12827 12104 12514 14757 14533 12781 12870 16164 18739 19904 21175
18909B1175K63J662M63k080k448m404J010N884p13j469k893k01J413l08j73m16
$$ 21175 21438 23100 23563 21483 19035 14631 15641 21525 20812 19343 16450 16249 17662 17354 17181 16765
18893A6765R74p01K030k508J457J824J565l104k525K302p14j282K075N284J0088
$$ 16765 17739 17038 19068 16560 18017 19841 21406 18302 15777 18079 17365 16083 18158 23442 33530
18878C3530R464O624N188M456N76p043p300M02J87K394o03N047N909K720p056
$$ 33530 42994 49618 54806 59262 59838 52795 45495 45897 46084 48478 47875 52922 58831 61551 54495
18863E4495r157m703m861j956m500Q23l094k458j257q93j573j649j929k354L86
$$ 54495 45338 40635 35774 33818 29318 30141 27047 24589 23332 22439 20866 19217 17288 14934 15320
18848A5320K216O130J745l66j721j524k704l22j185l823J739N679Q52K564N893
$$ 15320 17536 23666 25411 25045 23324 21800 19096 18774 17589 13766 15505 21184 22036 24600 30493
18833C0493P021R563J3298J7666J7778J2191M291o593q877o146r233k233O161
$$ 30493 37514 47077 60375 78041 95819 108010 112301 105708 96831 90685 81452 79219 85380
18820H5380R636P827P10k907n397j0852j5904j3615j0732j1325r252m605N37j253
$$ 85380 95016 102843 103553 100646 95249 84397 68493 54878 44146 32821 23569 18964 19501 18248
18806A8248j617L191j92l604J371K138O39k990m164p53Q76M481L78m118m522Q29
$$ 18248 16631 19822 19630 16026 17397 19535 20174 17184 13020 12267 13143 17624 18002 13884 9362 10191
18790A0191L302O92M857K691K614J765P065P117J0042J1400N788J358n076p037
$$ 10191 13493 14185 19042 21733 24347 26112 33177 40294 50336 61736 67524 68882 63806 56769
18776E6769o604k465K084N219N872N676M465J668j221K783K925j2649j9340j0880
$$ 56769 50165 47700 49784 55003 60875 66551 71016 72684 71463 74246 77171 64522 45182 34302
18762C4302o576j678l364j169l554l090j33N581j293k433k581j478J670j684l36
$$ 34302 27726 26048 22684 21515 17961 14871 14738 20319 19026 16593 14012 12534 14204 12520 12184
18747A2184j971j311J64J802q84l502K371J584l363r98n11j923J36L161K009k903
$$ 12184 10213 8902 9066 10868 9984 6482 8853 10437 7074 6076 5565 3642 3778 6939 8948 6045
18731F045N52M281K602J369K49j649k963l252l884J992L476J364j540K053j530
$$ 6045 6597 10878 13480 14849 15098 13449 10486 7234 3350 5342 8818 10182 8642 10695 9165
18716I165n06j801n89N18K161j275K772M234L154k441k685j855j961m51l81j24
$$ 9165 8659 6858 6269 6787 8948 7673 10445 14679 17833 15392 12707 10852 8891 8440 8059 7935
18700G935J963J096j061o81K306q19m88q34K56k721l732L95L735J738p24L34n1
$$ 7935 9898 10994 9933 9252 11558 10739 10251 9417 9673 6952 3220 3615 7350 9088 8364 8698 8647
18683H647m16m49K752m69K482J939l060k011j217k149r5M13K314K501k53N54L244
$$ 8647 8231 7782 10534 10065 12547 14486 11426 9415 8198 6049 5954 6367 8681 11182 10929 11483 14727
18666A4727L395K37K276M362N792R883J1112O566O548K260J505n221n791l850
$$ 14727 18122 18359 20635 24997 30789 40672 51784 58350 64898 67158 68663 63442 57651 53801
18652E3801m949O79N696R110J2915J6069J4764J2868M314n014j1576q566r216
$$ 53801 48852 49531 55227 64337 77252 93321 108085 120953 125267 120253 108677 100111 90895
18639I0895o667j25j750q847o123k135L10L045J581K20K494k004j3075j1842l732
$$ 90895 84228 84103 82353 73506 67383 65248 65558 68603 70184 70404 72898 70894 57819 45977 42245
18624D2245M26k336L294O077N991N392N718N415R774P136L882L061Q282L175j529
$$ 42245 42671 40335 43629 49706 55697 61089 66807 72222 81996 89132 93014 96075 104357 107532 106003
18609A06003J950J2859J6387J1259R088P500O977K5n117M635P674R280K240j807
$$ 106003 107953 120812 137199 148458 157546 165046 172023 172048 166931 171566 179240 188520 190760 188953
18595A88953L439l962j5120j6735r598q211l818n17Q224Q827N683N801N038n731
$$ 188953 192392 188430 173310 156575 146977 138766 134948 134431 142655 151482 157165 162966 168004 162273
18581A62273j3723j3200j4971j8012j4481r125p412m077Q0r8j825O938J0777J2812
$$ 162273 148550 135350 120379 102367 87886 78761 71349 67272 67352 67254 65429 72367 83144 95956
18567I5956O048J52M517R813J1033M30O16J2480J4674J2636J1386K661j1579j6466
$$ 95956 102004 102156 106673 116486 127519 127949 128565 141045 155719 168355 179741 182402 170823 154357
18553A54357j0557n865j579J263K973o73l906m673j297r199j3771o603m717k111
$$ 154357 143800 137935 136356 137619 140592 139919 136013 131340 130043 120844 107073 100470 95753 93642
18539I3642K48M682J0902J1013k351j4865j0755j2065j1275o138q91R67j28n816
$$ 93642 93890 98572 109474 120487 118136 103271 92516 80451 69176 63038 62147 63114 62986 57170
18525E7170j1001p995l121q47j034n170m122m13Q97o94j096j396j687J841M2k708
$$ 57170 46169 38174 35053 34206 33172 28002 23880 23467 24364 23670 22574 21178 19491 21332 21374 18666
18509A8666k167j625K829L557L865K333K230o7j914r75k46k517k61O49J943N202
$$ 18666 16499 14874 17703 21260 25125 27458 29688 29621 27707 26732 26486 23969 23708 24357 26300 31502
18493C1502J695L860J369j07m538l359j583j534m917l209L67o39K722j575K71
$$ 31502 33197 37057 38426 38319 33781 30422 28839 27305 22388 19179 19546 18907 21629 20054 20325
18478B0325P81n37j107J155k569J171k23k714M518J423K279j050J043l613j680
$$ 20325 21106 20569 19462 20617 18048 19219 18996 16282 20800 22223 24502 23452 24495 20882 19202
18463A9202L173K607R02L085N216M909N097M168L057O479O012O246P425J2107
$$ 19202 22375 24982 25884 28969 34185 39094 44191 48359 51416 57895 63907 70153 77578 89685
18449H9685J4542J2446Q093M444k566m374M567J2493J2833M035O882J1756O500
$$ 89685 104227 116673 124766 129210 126644 122270 126837 139330 152163 156198 163080 174836 181336
18436A81336m393k1341k7662k3031j8198r257k383M52J236l47o331o096l238n
$$ 181336 176943 155602 127940 104909 86711 77454 75071 75523 76759 76412 70081 63985 60747 60742
18422F0742J251m160J55k020J189K249L037J388K914O158M221N456P257Q574J3826
$$ 60742 61993 57833 57988 55968 57157 59406 62443 63831 66745 72903 77124 82580 89837 98411 112237
18407A12237J3329J4066K3641L9121M9235N3822N7081M0133J6042P12j0612j9184
$$ 112237 125566 139632 163273 202394 251629 305451 362532 402665 418707 419419 408807 389623
18395C89623j0370J2725K9990L5674L5749L8691L7777L1506K8950L3455O8011
$$ 389623 379253 391978 421968 457642 493391 532082 569859 601365 630315 663770 731781
18384G31781J23903K08559L62467O13894R11079J133110J169843Q00345J97476
$$ 731781 855684 1064243 1426710 2040604 2951683 4084793 5254636 6054981 6252457
18375F252457l76163q34534q26509m76099N1834N64198Q83288Q74902M06373j95860
$$ 6252457 5876294 5041760 4215251 3739152 3790986 4355184 5238472 6113374 6519747 6323887
18365F323887p77226j173695j126786q92614o02804l67306k19303j30583o5463
$$ 6323887 5546661 4372966 3246180 2353566 1750762 1383456 1164153 1033570 968107
18356I68107p220L5238O0867O4788O0435M9662K1455j0077k4739l5068k7818N765
$$ 968107 960887 996125 1056992 1121780 1182215 1231877 1253332 1243255 1218516 1183448 1155630 1161395
18344A161395L2790L7697L6266M5433P5599J33195K30937L88471O40770J029175
$$ 1161395 1194185 1231882 1268148 1313581 1389180 1522375 1753312 2141783 2782553 3811728
18334C811728J584413K205229K668245K564894J901003Q40206m51122j090552
$$ 3811728 5396141 7601370 10269615 12834509 14735512 15575718 15124596 14034044
18326A4034044j275411r44033j70174M78849P21017O58626M03979l5090n40950
$$ 14034044 12758633 11814600 11644426 12123275 12844292 13502918 13906897 13871807 13330857
18317A3330857j155915j646855k060371j989542j585912j087919o33164l61924
$$ 13330857 12174942 10528087 8467716 6478174 4892262 3804343 3171179 2809255
18309B809255k77451k93014l06482k73442k11033j54237j18968q3076n0238j7016
$$ 2809255 2531804 2238790 1932308 1658866 1447833 1293596 1174628 1091552 1041314 1024298
18299A024298M380K3350L8719M1881M6370N6068P8864J16241J63674K42694L82761
$$ 1024298 1028678 1052028 1090747 1132628 1178998 1235066 1313930 1430171 1593845 1836539 2219300
18288B219300O27355J028983J635067K260293K615697K300942J107126k69196
$$ 2219300 2846655 3875638 5510705 7770998 10386695 12687637 13794763 13525567
18280A3525567j517972k077154j637059o96153M74114J425323J890397J523793
$$ 13525567 12007595 9930441 8293382 7597229 8071343 9496666 11387063 12910856
18272A2910856L61829q92022k039459k491939k200222j655372j083142o84424
$$ 12910856 13272685 12380663 10341204 7849265 5649043 3993671 2910529 2226105
18264B226105m51353l13042k19722j56267j10359q9460q1701p8714p9441p1685
$$ 2226105 1774752 1461710 1241988 1085721 975362 885902 804201 725487 646046 574361
18254E74361o0773l9679j7321p619L178J223j2814k8298m0317m1987k3413j5702
$$ 574361 513588 473909 456588 448969 452147 453370 440556 412258 371941 329954 306541 290839
18242B90839k0318k1693j7025j6555j7176j3267n474o023k330j868n913m246n592
$$ 290839 270521 248828 231803 215248 198072 184805 179331 173308 170978 169110 163197 158951 153359
18229A53359o656q122j420L283j362m495k083n19l256l856m664m78l188m528N15
$$ 153359 146703 138581 137161 140444 139082 134587 132504 131985 128729 124873 120209 119731 116543 112015 112530
18214A12530J09m518m568j990m215m101J892M945M103N390J0601P610J260K502
$$ 112530 112639 108121 103553 101563 97348 93247 95139 100084 104187 109577 120178 127788 129048 131550
18200A31550N436J643o383j0085J028L337R24k67m535L103N874O46L678M943J522
$$ 131550 136986 138629 132246 122161 123189 126526 127450 127183 122648 125751 131625 132271 135949 140892 142414
18185A42414N368P495P011O907R374J1766Q645O890J3901J0114P465P645J4596
$$ 142414 147782 155277 162288 169195 178569 190335 198980 205870 219771 229885 237350 244995 259591
18172B59591K0395J4081J928m771N918R68j4979j8502j2233n938o544k297P053
$$ 259591 279986 294067 295995 291224 297142 298110 283131 264629 252396 246458 239914 237617 244670
18159B44670J4874J9554K9035L5064L2652L7131M2507M8413M4684J8370K2496
$$ 244670 259544 279098 308133 343197 375849 412980 455487 503900 548584 566954 589450
18148E89450M6953N2903L2278K1418L6892O0130N9977L8087M4699Q8264J28975
$$ 589450 636403 689306 721584 743002 779894 840024 900001 938088 982787 1071051 1200026
18137A200026J64500K33301L47646M26997M40173N37683P45982P03986M03733
$$ 1200026 1364526 1597827 1945473 2372470 2812643 3350326 4096308 4800294 5204027
18128E204027M97584R77254J156732J018206R50017J150327J762072J855499N26469
$$ 5204027 5701611 6678865 7835597 8853803 9803820 10954147 12716219 14571718 15098187
18119A5098187l66617M44397O70832n30081p84627J40516K28863J02884J445193
$$ 15098187 14731570 15175967 15846799 15316718 14532091 14672607 14901470 15004354 16449547
18110A6449547L427309L676861K217406K44766j046156n99813j804461k887450
$$ 16449547 19876856 23553717 25771123 26015889 24969733 24369920 22565459 19678009
18102A9678009j110194R92227N22030j913904k376634n74695L70591j100097k639980
$$ 19678009 18567815 19560042 20082072 18168168 15791534 15216839 15587430 14487333 11847353
18093A1847353k089579j054495q74522j176817j054302n53500o7185L23362N63671
$$ 11847353 9757774 8703279 7828757 6651940 5597638 5044138 4976953 5300315 5863986
18084E863986P84019J288530J782805J494801R93632J538584K242197J324293
$$ 5863986 6648005 7936535 9719340 11214141 12207773 13746357 15988554 17312847
18076A7312847j54388N9109R53982N30511p42990j162416m37297L07093j89696
$$ 17312847 17158459 17217568 18171550 18702061 17959071 16796655 16359358 16666451 16476755
18067A6476755j206192r04961K42237M46195m33719r45294k52004N34891K51778
$$ 16476755 15270563 14365602 14607839 15054034 14620315 13675021 13423017 13957908 14209686
18058A4209686n99426p09600J22235L76089k91647q02321m50863J26026k61794
$$ 14209686 13610260 12900660 13022895 13398984 13107337 12305016 11854153 11980179 11718385
18049A1718385j034163j083279n49722n71817j202211j320212r17976o25474o11133
$$ 11718385 10684222 9600943 9051221 8479404 7277193 5956981 5039005 4413531 3802398
18040C802398n52427k95785J2475L07444M93686N01059N98997R54750Q94789J42877
$$ 3802398 3249971 2954186 2966661 3274105 3767791 4268850 4867847 5822597 6717386 6860263
18030F860263q7224M09453K90956m28375n68594k20668M7439J3610l87540n55885
$$ 6860263 6773039 7182492 7473448 7045073 6476479 6255811 6303250 6316860 5929320 5373435
18020E373435j87659j57611o83940q64687n94488m88701n22777m48103l00642
$$ 5373435 5185776 5028165 4344225 3479538 2885050 2396349 1873572 1425469 1124827
18011A124827j99560j37274r2380p1584n3801m6018l3996k7629l0050l0684k4697
$$ 1124827 925267 787993 695613 624029 570228 524210 490214 462585 432535 401851 377154
18000C77154j3951j4461k3346k1054j5056j3405j3835j5581j3969j0888j1667
$$ 377154 363203 348742 325396 304342 289286 275881 262046 246465 232496 221608 209941
17989B09941j4234j3008j0402o120k647m991o967l090N22J98J509n866p140l416
$$ 209941 195707 182699 172297 166177 163530 158539 151572 148482 149004 149202 150711 144845 137705 134289
17975A34289m684m088K148J414j831l733n16l059n976m482l761k342j044k502
$$ 134289 129605 125517 127665 129079 127248 123515 122999 119940 113964 109482 105721 103379 102335 99833
17961I9833m01l690q333m320l87k026j131r51k030l399j92L103K871K622M32q737
$$ 99833 99432 95742 87409 83089 82702 80676 79545 78594 76564 73165 72973 76076 78947 81569 82001 73264
17945G3264n937J944K051r83k728k148l215l739k12k008J573P92J90j525k247
$$ 73264 67327 69271 71322 70339 67611 65463 62248 58509 58297 56289 57862 58654 58844 57319 55072
17930E5072j489L73K064J390J265J106k419l054j494m94r18K59L53l128j12K166
$$ 55072 53583 53956 56020 57410 58675 59781 57362 54308 52814 52320 51402 51661 52014 48886 48774 50940
17914E0940Q56k364p72j731l405N40o99j180J370j909m626P45M375l88l018n88
$$ 50940 51796 49432 48660 46929 43524 44064 43365 42185 43555 41646 37020 37765 42140 41752 38734 38146
17898C8146O4n25L581J69K230j159r28J246k849j259K23k609l320K252J343k434
$$ 38146 38210 37685 41266 41435 43665 42506 41578 42824 39975 38716 38939 36330 33010 35262 36605 34171
17882C4171l048j686j644q09P68K084K430Q50j719l026L779J090P39r31J160J129
$$ 34171 31123 29437 27793 26984 27752 29836 32266 33116 31397 28371 32150 33240 33979 33048 34208 35337
17866C5337M793O699P469Q726J1922J2015R971M231j372r338q333o685k29L277
$$ 35337 40130 46829 54298 63024 74946 86961 96932 101163 99791 90453 82120 75435 75206 78483
17852G8483O925Q752N502J341p013j2160j2440q336o837q627n832O8J35k973j480
$$ 78483 85408 94160 99662 101003 93990 81830 69390 61054 54217 45590 39758 39826 39961 36988 35508
17837C5508k051K634L338M222Q17m432m35j259j527K14K492J163l089O7M746N76
$$ 35508 33457 36091 39429 43651 44468 40036 39601 38342 36815 37029 39521 40684 37595 37662 42408 42984
17821D2984K09M626L531N010P981Q986Q246Q664P171K57r06l381o005n69J803
$$ 42984 43193 47819 51350 56360 64341 73327 81573 90237 97408 97665 96759 93378 87373 86804 88607
17806H8607J799R627J1783J0420J447q886j6988j5814j6468j1868n995m732o573
$$ 88607 90406 100033 111816 122236 123683 114797 97809 81995 65527 53659 47664 42932 36359
17793C6359l210K48n236k386K763J321j37j240k833q34j188P53M762j473l296
$$ 36359 33149 33397 28161 25775 28538 29859 29722 28482 25649 24815 23627 24380 29142 27669 24373
17778B4373M260J176J611L84o49l97N59k669k44K705P948Q255K981J630k201n79
$$ 24373 28633 29809 31420 31804 31155 30758 31317 28648 28404 31109 39057 47312 50293 51923 49722 49143
17762D9143m211o120j997j203Q27L985K123M936K633o557q717n384o542l092k130
$$ 49143 44932 38812 36815 35612 36439 40424 42547 47483 50116 43559 34842 29458 22916 19824 17694
17747A7694K81m77p67j560l219K069J243p22k033M46o03N26L07J319K534K882
$$ 17694 17975 17498 16731 15171 11952 14021 15264 14542 12509 12955 12352 12878 13185 14504 17038 19920
17731A9920O47r47j765k566o94o95k78K319k244k883j152l672J493L090k227q0
$$ 19920 20567 19620 17855 15289 14595 13900 13622 15941 13697 10814 9662 5990 7483 10573 8346 8266
17715H266l94J489L332J360j737k619J441M399k4j323j876l89l702Q00K238q45
$$ 8266 7872 9361 12693 14053 12316 9697 11138 15537 15513 14190 12314 11925 8223 9023 11261 10416
17699A0416L307J823j445j552n051k012l665o12j23m83J281J36R25j012J544J122
$$ 10416 13723 15546 14101 12549 7498 5486 1821 1209 1086 603 1884 2020 2945 1933 3477 4599
17683D599J769K021m331j499L169M747N262n52k27l194o86Q62j502k642M9J714
$$ 4599 6368 8389 4058 2559 5728 10475 15737 15185 14958 11764 11078 11940 10438 7796 7845 9559
17667I559j138K477N445L588k142n178j85K2L435n18J172K477m325k203P9k135
$$ 9559 8421 10898 16343 19931 17789 12611 12426 12448 15883 15365 16537 19014 14689 12486 12565 10430
17651A0430j103l021l484j80J666k912k430P22J849P90N0J691J448K005J081k828
$$ 10430 9327 6306 2822 2642 4308 1396 -1034 -312 1537 2327 2377 4068 5516 7521 8602 5774
17635E774L60L680l92K19J735N84L93J275r05j064PP5L806L508k330K66N651O991
$$ 5774 6134 9814 9422 9641 11376 11960 12353 13628 12723 11659 11666 11741 15547 19055 16725 16991 22642 29633
17617B9633N545P853N264P935P689M439P288R415Q869R698O473O949Q329L149
$$ 29633 35178 43031 48295 56230 63919 68358 75646 85061 93930 103628 110101 117050 125379 128528
17603A28528j823m738J672L529p333r765q257l720j432p364p368m127m064j0548
$$ 128528 126705 121967 123639 127168 119835 110070 101813 98093 96661 89297 81929 77802 73738 63190
17589F3190j3402q273n572m987m825m032p12N120K066p04q78l455M86J065l55
$$ 63190 49788 41515 35943 30956 26131 22099 21387 26507 28573 27869 26991 23536 24022 25087 24732
17574B4732J043L71L722P445R341J0459Q771N363J2166J5365R222K397L891J1092
$$ 24732 25775 26146 29868 37313 46654 57113 65884 71247 83413 98778 108000 110397 114288 125380
17560A25380J1803O509k85J395O329L616p151p657J623n699j2893j2765j1129
$$ 125380 137183 143692 143407 144802 151131 154747 147596 139939 141562 135863 122970 110205 99076
17547I9076m501p786j3015q735o124j0013r124q734n294q52n012l069j15l29p78
$$ 99076 94575 86789 73774 65039 58915 48902 39778 31044 25750 24898 19886 16817 16702 16373 15595
17532A5595n30j424j7n09k667L02O15K124J368M725K871q24M037M789M861j981
$$ 15595 15065 13641 13624 13115 10448 10750 11365 13489 14857 19582 22453 21629 25666 30455 35316 33335
17516C3335o07P270L350k083k947J973M095p12j303l934j074Pj574p038n523j207
$$ 33335 32728 39998 43348 41265 38318 40291 44386 43674 42371 38437 37363 37370 35796 28758 23235 22028
17500B2028l776m650k913P45Kp70j444q32j710o82o85L74j251M08M772o30l881
$$ 22028 18252 13602 10689 11434 11436 10666 9222 8390 6680 5998 5313 5687 4436 4844 9616 8986 5105
17483E105p78K666j823k877K085J782q60J33n50r24k9R43k516k924j259j552K19
$$ 5105 4327 6993 5170 2293 4378 6160 5300 5433 4883 3959 3930 4873 2357 -567 -1826 -3378 -3159
17466c159M754K884l72m19l84K11J712J377j082M85N64j279j502p21J23J104k876
$$ -3159 1595 4479 4107 3688 3304 3515 5227 6604 5522 6007 6571 5292 3790 3069 3192 4296 1420
17449A420M30L668L11n69M625L851L194J2077J2202l70j3846j4151m242j824j548
$$ 1420 1850 5518 5829 5260 9885 13736 16930 29007 41209 40839 26993 12842 8600 6776 5228
17434E228l70K458K269k846j213J621p04m924J288p58m066j790P97K635J919J421
$$ 5228 4858 7316 9585 6739 5526 7147 6443 1519 2807 2049 -2017 -3807 -3010 -375 1544 2965
17418B965J89m744o310j69N366O020J819r98l7o55r23k432L14K043q0K49R03L67
$$ 2965 3154 -1590 -7900 -8069 -2703 3317 5136 4138 4101 3446 2523 91 405 2448 2368 2617 3520 3887
17400C887J421j103k620j535j710K282l54O02p91l31K640K137j68m526o9L958
$$ 3887 5308 4205 1585 50 -1660 622 268 870 79 -252 2388 4525 4357 -169 -238 3720
17384C720l44k178p83K664M49j687M189J49l856m33j106k591j487R30J946J309
$$ 3720 3376 1198 415 3079 3528 1841 6030 6179 2323 1890 784 -1807 -3294 -2364 -418 891
17368H91J477r41m714J107K539P07J658j226j226J370J842J378j147R86j412j776
$$ 891 2368 1427 -3287 -2180 359 1066 2724 1498 272 1642 3484 4862 3715 4701 3289 1513
17352A513j868m30K228K453k311j92k179J191P49K700k554j311n95l76p67r36
$$ 1513 -355 -785 1443 3896 1585 1393 -786 405 1154 3854 1300 -11 -606 -982 -1749 -2685
17336b685J385j663M298o95j171L50J972L72J077j424k498K714K252J534mj111
$$ -2685 -1300 -2963 1335 640 -531 -181 1791 2163 3240 1816 -682 2032 4284 5818 5814 4703
17320D703l43j290n412k695N77L45k14j738J019N865M57j762Q29K507Q90L26R55
$$ 4703 4360 3070 -2342 -5037 -4460 -4115 -4329 -6067 -5048 817 1274 -488 341 2848 3738 4064 5019
17303E019N364k383m391j751l973l546r76M431K344j671m65l975n78L420K127
$$ 5019 10383 8000 3609 1858 -2115 -5661 -6637 -2206 138 -1533 -1998 -5973 -6551 -3131 -1004
17288a004J91o18m410P44M298k127M42J478Q38j66j868p1J301K043L229K58l392
$$ -1004 -813 -1431 -5841 -5097 -799 -2926 -2484 -1006 -168 -334 -2202 -2273 -972 1071 4300 4558 1166
17271A166l594l754m76J515K320J22P93K887j88j286m60J724J65j120m258k24
$$ 1166 -2428 -6182 -6658 -5143 -2823 -2701 -1908 979 791 -495 -955 769 934 -186 -4444 -4668
17255d668O309K072m988o70N185L150j775n322q09M009m95K46m8j331k491r5m043
$$ -4668 1641 3713 -1275 -1945 3240 6390 4615 -707 -1516 2493 1998 2244 2196 865 -1626 -1721 -5764
17238e764k741L640L424R09R26j818K568K661J854J210k046l383l247j760K13
$$ -5764 -8505 -4865 -1441 -532 394 -1424 1144 3805 5659 6869 4823 1440 -1807 -3567 -3354
17223c354J840K49p7j251k086K398J11L322J35k99j210l82m386q95N103J817k768
$$ -3354 -1514 -1265 -1342 -2593 -4679 -2281 -2170 1152 1287 988 -222 -604 -4990 -5885 -782 1035 -1733
17206a733q33K825l306j737L538J301m627L585L554l81r75k65m176j544J792N12
$$ -1733 -2566 259 -3047 -4784 -1246 55 -4572 -987 2567 2186 1211 946 -3230 -4774 -2982 -2470
17190b470J609j257K358l164n40K017k490k530N138J988J95p65l845j318L002
$$ -2470 -861 -2118 240 -2924 -3464 -1447 -3937 -6467 -1329 659 854 89 -3756 -5074 -2072
17175b072L231J813n18j326O26Q45m295N50N9j587N2K857n31j992J187k086J00
$$ -2072 1159 2972 2454 1128 1754 2599 -1696 -1146 -1087 -2674 -2622 235 -296 -2288 -1101 -3187 -3087
17158c087O33o93K3L3J402q45q66k543N48L461N170q73j202J635K088k239K308
$$ -3087 -2454 -3147 -3124 -3091 -1689 -2534 -3400 -5943 -5395 -1934 3236 2363 1161 2796 4884 2645 4953
17141D953J526k670j123l330l075m77L15j203k073L116q09J600J064J959R36n35
$$ 4953 6479 3809 2686 -644 -3719 -4196 -3881 -5084 -7157 -4041 -4850 -3250 -2186 -227 709 174
17125A74k56r79j813K827r79j813o13j32J101J306Q1j459J234J504j794j706j169
$$ 174 -82 -1061 -2874 -47 -1026 -2839 -3452 -3584 -2483 -1177 -1096 -2555 -1321 183 -1611 -3317 -4486
17108d486M72M88k46L832K681J92K54m90k229J918J610J669l104M9L258n05j278
$$ -4486 -4014 -3526 -3772 60 2741 2933 3187 2697 468 2386 3996 5665 2561 2610 5868 5363 4085
17091D085l224l472J563Q69l905j309K115L381R90O10k810m900k91K119M22J101
$$ 4085 861 -2611 -1048 -179 -4084 -5393 -3278 103 1093 1703 -1107 -6007 -6298 -4179 -3757 -2656
17075b656M749l320k041L066j78J799P4k085j001l61j866P6K633N10P53k003k651
$$ -2656 2093 -1227 -3268 -202 -380 1419 1493 -592 -1593 -1954 -3820 -3744 -1111 -601 152 -1851 -4502
17058d502J195L328M14l46l022k53R46O47K397l183j946M505R74l934K241k84
$$ -4502 -3307 21 435 89 -2933 -3186 -2240 -1593 804 -2379 -4325 180 1154 -2780 -539 -823
17042h23l217l379K105L697J313R34K562J8n75K51m252m495K294L348L177K414
$$ -823 -4040 -7419 -5314 -1617 -304 630 3192 3210 2635 2886 -1366 -5861 -3567 -219 2958 5372
17026E372m314q29K656m568l016J198M164J05k569m95l475j122K656L068j336
$$ 5372 1058 229 2885 -1683 -4699 -3501 663 768 -1801 -2296 -5771 -6893 -4237 -1169 -2505
17011b505k334J278L62L42l200k342J074n08J88L141K450l837k275L010J005j688
$$ -2505 -4839 -3561 -3199 -2857 -6057 -8399 -7325 -7833 -7645 -4504 -2054 -5891 -8166 -5156 -4151 -5839
16995e839j016n12M679J763j604L37M353L335j977l143N16K907o53o02j14k822
$$ -5839 -6855 -7367 -2688 -925 -2529 -2192 2161 5496 3519 376 892 3799 3146 2544 2430 -392
16979c92m87o79O50K576j479l344j376J947K559M64L80J649J318o50l329m189
$$ -392 -879 -1558 -908 1668 189 -3155 -4531 -2584 -25 439 819 2468 3786 3136 -193 -4382
16963d382J281M836j852J282K29o82J46l931j121K128Q46P66j804k663K207M671
$$ -4382 -3101 1735 -117 1165 1394 712 858 -3073 -4194 -2066 -1220 -454 -2258 -4921 -2714 1957
16947A957k09O37Q72j249l072L588q55o7k230k570K283P96j708J956L326l48k089
$$ 1957 1748 2385 3257 2008 -1064 2524 1669 1602 -628 -3198 -915 -119 -1827 129 3455 3107 1018
16930A018P69L56r1k701l636J690L463J048m023J459M53Q13p27m72R46K643N048
$$ 1018 1787 2143 2052 -649 -4285 -2595 868 1916 -2107 -648 -195 618 -109 -581 365 3008 8056
16913H056k327L03j219J477J055l889k851K902l19o94R25L359j576k975j725m65
$$ 8056 5729 6032 4813 6290 7345 3456 605 3507 3188 2494 3419 6778 5202 2227 502 37
16897C7l58j411M24L178j621O95Q24K60j802j761J529L784o20o91r8o71K124K492
$$ 37 -321 -1732 -1308 1870 249 944 1768 2028 226 -1535 -6 3778 3158 2467 2369 1698 3822 6314
16879F314m481l37K273o22j394j55j656q73J09L85J634J572m736q05j964j479
$$ 6314 1833 1496 3769 3147 1753 1598 -58 -931 -822 -437 1197 2769 -1967 -2772 -4736 -6215
16863f215M459J690m9l310m219O33K11q32k51J953K214m582J057j292k076O25
$$ -6215 -1756 -66 -115 -3425 -7644 -7011 -6800 -7632 -7883 -5930 -3716 -8298 -7241 -8533 -10609 -9984
16847i984J561q40K003L22J6J286L927J697p84J188j979l561l210J625j74j176
$$ -9984 -8423 -9263 -7260 -6938 -6922 -5636 -1709 -12 -796 392 -1587 -5148 -8358 -6733 -6907 -8083
16831h083L648M527K743l505j163j949j645r32k047J309j085N29L707K653J367
$$ -8083 -4435 92 2835 -670 -1833 -3782 -5427 -6359 -8406 -7097 -8182 -7653 -3946 -1293 74
16816G4j8l516Q11K892K241K258k801l056K39K533j899n925J928K159k712r52
$$ 74 56 -3460 -2649 243 2484 4742 1941 -1115 -876 1657 -242 -6167 -4239 -2080 -4792 -5744
16800e744J095o46l580Q30J246R68L874N828j573k836k360M32J222K697q94J877
$$ -5744 -4649 -5295 -8875 -8045 -6799 -5831 -1957 3871 2298 -538 -2898 -2466 -1244 1453 559 2436
16784B436K60k893J850R72K73P46k392k619j52L51J161K11j026J31J687J511J356
$$ 2436 2696 -197 1653 2625 2898 3644 1252 -1367 -1519 -1168 -7 204 -822 -691 996 2507 3863
16767C863l097l393j037J81l28r03j076L459O074R15m6l936j280R8j950j927Q1
$$ 3863 766 -2627 -3664 -3483 -3811 -4714 -5790 -2331 3743 4658 4612 676 -604 -506 -2456 -4383 -4302
16750d302J739r32j48j110k112J277M013K623J073m388n056K939j195m67n03r24
$$ -4302 -2563 -3495 -3643 -4753 -6865 -5588 -1575 1048 2121 -2267 -7323 -4384 -5579 -6046 -6549 -7473
16734g473M84K988Q60m187K469K391k027l190R26P16J828L04J467j208J226J294
$$ -7473 -6989 -4001 -3141 -7328 -4859 -2468 -4495 -7685 -6759 -6043 -4215 -3911 -2444 -3652 -2426 -1132
16718a132K854l655M37J583k264k433N332J002J095k72j775J13J764q4p97k329
$$ -1132 1722 -1933 -1496 87 -2177 -4610 722 1724 2819 2547 772 885 2649 2565 1768 -561
16702e61j679r12O97J023k362k119J94n66m83L35L230l3o37L23J449J120j11k522
$$ -561 -2240 -3152 -2455 -1432 -3794 -5913 -5719 -6285 -6768 -6433 -3203 -3236 -3873 -3550 -2101 -981 -1092 -3614
16684c614P0J558l615q35K462K163j203p64j827n64m09P17K520R70K56J175J848
$$ -3614 -3544 -1986 -5601 -6436 -3974 -1811 -3014 -3778 -5605 -6169 -6578 -5861 -3341 -2371 -2115 -940 908
16667I08j55J217k541K05n56l655j425q94J634p13j017J254M03K383L680k020
$$ 908 753 1970 -571 -366 -922 -4577 -6002 -6896 -5262 -5975 -6992 -5738 -5335 -2952 728 -1292
16651a292J566j089J492R54j457q13J008M13K964k107j683oN91j637k16K6O41
$$ -1292 274 -815 677 1631 174 -639 369 782 3746 1639 -44 -50 541 -1096 -1312 -1286 -645
16634f45k682j604J562J789L271j702k277j66L33l48K084J159O45J657l18j050
$$ -645 -3327 -4931 -3369 -1580 1691 -11 -2288 -2454 -2121 -2469 -385 774 1419 3076 2758 1708
16618A708k442k232j679n73K277L819K998Q91k161k073k108l92j879j87N52r74
$$ 1708 -734 -2966 -4645 -5218 -2941 878 3876 4767 2606 533 -1575 -1967 -3846 -4033 -3481 -4455
16602d455q94j092J880L332K298L640J78K39P40o0k744o10J830r11J081J096P17
$$ -4455 -5349 -6441 -4561 -1229 1069 4709 4887 5126 5866 5806 3062 2452 4282 3371 4452 5548 6265
16585F265j992l229m316k566L049J111l100j525K371p74P82J556j207J58L003
$$ 6265 4273 1044 -3272 -5838 -2789 -1678 -4778 -6303 -3932 -4706 -3924 -2368 -3575 -3417 -414
16570d14J800K789l82K197j832j797k46r44Q47k78l229J515K439K081k89n153
$$ -414 1386 4175 3793 5990 4158 2361 2115 1171 2018 1740 -1489 26 2465 4546 4257 -896
16554h96j819m238l38M809O00r16O1J441l418r50M222J878k606N52O07l6J106
$$ -896 -2715 -6953 -7291 -2482 -1882 -2798 -2737 -1296 -4714 -5664 -1442 436 -2170 -1618 -1011 -1047 59
16537E9K809j78O88j017j226K388m1j342l132q41j353M68K73q40j712L608N09
$$ 59 2868 2690 3378 2361 1135 3523 3482 2140 -992 -1833 -3186 -2718 -2445 -3285 -4997 -1389 -880
16520h80l765q4k954K696N313M95q13K528l447m002k344M613K830j372N72j280
$$ -880 -4645 -4729 -7683 -4987 326 821 8 2536 -911 -4913 -7257 -2644 186 -1186 -614 -1894
16504a894j822K186J349L79j143l331K77L024j594j539o25L45R75M32O97R50O97
$$ -1894 -3716 -1530 -181 198 -945 -4276 -3999 -975 -2569 -4108 -4733 -4388 -3413 -2981 -2284 -1334 -637
16487f37m096j035J442N32J142K62K210j732o36m4O02O53j435l04m39K387J638
$$ -637 -4733 -5768 -4326 -3794 -2652 -2390 -180 -1912 -2548 -2592 -1990 -1337 -2772 -3076 -3515 -1128 510
16470E10l204L002k212r37k90j678Q94MJ965J231j19M43o73j142R9O43K609j550
$$ 510 -2694 308 -1904 -2841 -3131 -4809 -3915 -3911 -1946 -715 -834 -391 -1064 -2206 -2107 -1464 1145 -405
16452d05l035j252K685n78j691l25J308m45j921j066L157M466j386n878J67M901
$$ -405 -3440 -4692 -2007 -2585 -4276 -4601 -3293 -3738 -5659 -6725 -3568 898 -488 -6366 -6199 -1298
16436a298L940R18l268k934J726O85l162p22K098M004k15l695j389r11l3O31L530
$$ -1298 2642 3560 292 -2642 -916 -231 -3393 -4115 -2017 1987 1772 -1923 -3312 -4223 -4256 -3625 -95
16419i5K207k257j602q59M675R58m115j597L011j205m45L215P84j214k957o39
$$ -95 2112 -145 -1747 -2606 2069 3027 -1088 -2685 326 -879 -1324 1891 2675 1461 -1496 -2135
16403b135N91m25J51K062j060k62J890M26n991l35J53J214J169P67Q78J045r24
$$ -2135 -1544 -1969 -1818 244 -816 -1078 812 1238 -4753 -5088 -4935 -3721 -2552 -1785 -907 138 -786
16386g86J24M64J653P34j343l30N29R73K4j373k301j601J637k512O32j547K741
$$ -786 -662 -198 1455 2189 846 516 1045 2018 2042 669 -1632 -3233 -1596 -4108 -3476 -5023 -2282
16369b282O36k852J012Q9L682J321k76N28K149m94l27j834m18J562j009l946j351
$$ -2282 -1646 -4498 -3486 -3397 285 1606 1330 1858 4007 3513 3186 1352 934 2496 1487 -2459 -3810
16352c810J053J675m9j304J248j52l314l033J264L547J031j094k056j557K394
$$ -3810 -2757 -1082 -1131 -2435 -1187 -1339 -4653 -7686 -6422 -2875 -1844 -2938 -4994 -6551 -4157
16337d157J990j613K43Q64j571k438p58O54j54Q3O03M420n19K689r3j353K482
$$ -4157 -2167 -3780 -3537 -2673 -4244 -6682 -7440 -6786 -6940 -6857 -6254 -1834 -2353 336 243 -1110 1372
16320A372J691p54k401J232l87N07m157k202J540R74J823J448p35L61l995m130
$$ 1372 3063 2309 -92 1140 753 1260 -2897 -5099 -3559 -2585 -762 686 -49 312 -3683 -7813
16304g813L458K78P8J57J162k403j284L229J194J871J010j672K799j678j241k67
$$ -7813 -4355 -4077 -3999 -3842 -2680 -5083 -6367 -3138 -1944 -73 937 -735 2064 386 -855 -1122
16288a122P58J563J204k116k368j055M187M143j172j907k393q33j043J597k427
$$ -1122 -364 1199 2403 287 -2081 -3136 1051 5194 4022 2115 -278 -1111 -2154 -557 -2984
16273b984J584K151J510r57N39k042J38k669n31o08J075j213l798j906m18M686
$$ -2984 -1400 751 2261 1304 1843 -199 -61 -2730 -3261 -3869 -2794 -4007 -7805 -9711 -10129 -5443
16257e443O143J040m362P95m38j309L773l327k5O250K843K758j151m322m694j177
$$ -5443 700 1740 -2622 -1827 -2265 -3574 199 -3128 -3153 3097 5940 8698 7547 3225 -1469 -2646
16241b646K775M085l96j127j958k339j659j753J499m4L027m08K07j289k617J900
$$ -2646 129 4214 3818 2691 733 -1606 -3265 -5018 -3519 -3563 -536 -944 -737 -2026 -4643 -2743
16225b743j371K977L022n84J6J228j40k455l556q52j828K447K578o14k433j058
$$ -2743 -4114 -1137 1885 1301 1317 2545 2405 -50 -3606 -4458 -6286 -3839 -1261 -1875 -4308 -5366
16209e366K965L527J358r20J300r18o343l541P56j143K808M815k84M59J81j484
$$ -5366 -2401 1126 2484 1564 2864 1946 -4397 -7938 -7182 -8325 -5517 -702 -986 -527 -346 -1830
16193a830j113k613k190J460O75j045j932L066K043k984j580j195J113L689q97
$$ -1830 -2943 -5556 -7746 -6286 -5611 -6656 -8588 -5522 -3479 -6463 -8043 -9238 -8125 -4436 -5333
16178e333J68L490L056J120m068L41k330n831k2K507k005P5K084R0j776K599K603
$$ -5333 -5165 -1675 1381 2501 -1567 -1226 -3556 -9387 -9409 -6902 -8907 -8832 -6748 -6658 -8434 -5835 -3232
16161c232L85k11N60O13m41k967j606J145K378l487O65L392J663o89M08k611m522
$$ -3232 -2847 -3058 -2498 -1885 -2326 -5293 -6899 -5754 -3376 -6863 -6198 -2806 -1143 -1832 -1424 -4035 -8557
16144h557K101M614K52p94M14o00k798k327J569R61L651j4J152K424J105l337
$$ -8557 -6456 -1842 -1590 -2384 -1970 -2570 -5368 -7695 -6126 -5165 -1514 -1528 -376 2048 3153 -184
16128a84l235L422j89k139l937j701J291O84J702M87j702O7Q36J251K361o44J261
$$ -184 -3419 3 -186 -2325 -6262 -7963 -6672 -5988 -4286 -3799 -5501 -5434 -4598 -3347 -986 -1630 -369
16111c69K476q39k149o47k064J550L078R4j946l021K279o30Q26K796n61k928Q2
$$ -369 2107 1268 -881 -1528 -3592 -2042 1036 1130 -816 -3837 -1558 -2188 -1362 1434 873 -2055 -1973
16094a973J201r69k924k775m96K819L130O98K173K053j92j419l802J50l877k028
$$ -1973 -772 -1741 -4665 -7440 -7936 -5117 -1987 -1289 884 2937 2745 1326 -2476 -2326 -6203 -8231
16078h231L426J686L098j629k686j785q1K80j206J045K601J229J97k107j398K493
$$ -8231 -4805 -3119 -21 -1650 -4336 -6121 -6202 -5922 -7128 -6083 -3482 -2253 -2056 -4163 -5561 -3068
16062c068L591j137O67K461P99K267k904n789K8q94j560j602k05R15J508R98M24
$$ -3068 523 -614 53 2514 3313 5580 2676 -3113 -3085 -3979 -5539 -7141 -7346 -6431 -4923 -3925 -3501
16045c501j445O01k12P27k87Q40K111j803O78o53J547J641j64l1Q70M44k19j996
$$ -3501 -4946 -4345 -4557 -3830 -4117 -3277 -1166 -2969 -2291 -2944 -1397 244 80 49 919 1363 1144 -852
16027h52J53j96J037J213J522L81J99n97j470O51k14P26p44K031j453L449j156
$$ -852 -699 -895 142 1355 2877 3258 3457 2860 1390 2041 1827 2553 1809 3840 2387 5836 4680
16010D680p140m360n19N039J530j503J515K714j842J00l496K456L314M89l331
$$ 4680 -2460 -6820 -7339 -2300 -770 -2273 -758 1956 114 214 -3282 -826 2488 2977 -354
15995c54o15M094K274k910n064K882J008k49P04j048j546k208k007k057m111J074
$$ -354 -969 3125 5399 2489 -2575 307 1315 1066 1770 722 -824 -3032 -5039 -7096 -11207 -10133
15979a0133J126p41j040L089L345k196j74J013N43M46K910L36N8L166J079l540
$$ -10133 -9007 -9748 -10788 -7699 -4354 -6550 -6724 -5711 -5168 -4722 -1812 -1476 -1418 1748 2827 -713
15963g13M94j248k397l92P6m594M079K593k599M645N182k658k131l403m013j569
$$ -713 -219 -1467 -3864 -4256 -4180 -8774 -4695 -2102 -4701 -56 5126 2468 337 -3066 -7079 -8648
15947h648M524K39k072L35O88j736O91R48K941j081j014J691N00l50L39l48o1
$$ -8648 -4124 -3885 -5957 -5622 -4934 -6670 -5979 -5031 -2090 -3171 -4185 -2494 -1994 -2344 -2005 -2353 -2414
15930b414l388N40M499j512n91M85L88J293J126K818L590l707k811j210K329J152
$$ -2414 -5802 -5262 -763 -2275 -2866 -2381 -1993 -700 426 3244 6834 3127 316 -894 1435 2587
15914B587j366j924J612J041J28p10m512J732M598J906m056l895J521J141l367
$$ 2587 1221 -703 909 1950 2078 1368 -3144 -1412 3186 5092 1036 -2859 -1338 -197 -3564
15899c564J623J934L83J579j052L4L094m3k153k828Q22k694j008K968L801J709
$$ -3564 -1941 -7 376 1955 903 937 4031 3988 1835 -993 -171 -2865 -3873 -905 2896 4605
15883D605o73l149L3J314k447L25j649J089J316R16O37P80l158p33j04n22J54
$$ 4605 3932 783 816 2130 -317 8 -1641 -552 764 1680 2317 3097 -61 -794 -898 -1420 -1266
15866a266K782j439o429K149K285j668O87L65l895j197L061L331K623n32P35J503
$$ -1266 1516 77 -6352 -4203 -1918 -3586 -2899 -2534 -6429 -7626 -4565 -1234 1389 857 1592 3095
15850C095l534p02j988L018oN88J641J039j855q077j885L026N358n96k87K601
$$ 3095 -439 -1141 -3129 -111 -117 471 2112 3151 1296 -6781 -8666 -5640 -282 -878 -1165 1436
15834A436M123j620l821o62K233j109j16m07P96j456q20k5N22j057P84J227P58
$$ 1436 5559 3939 118 -544 1689 580 464 57 853 -603 -1423 -1448 -926 -1983 -1199 28 786
15817G86k204l030J982L328j691k565p92J933M039p19k863k115o62P62j163l03
$$ 786 -1418 -4448 -2466 862 -829 -3394 -4186 -2253 1786 1067 -1796 -3911 -4573 -3811 -4974 -5277
15801e277L888o85m20O44J167L395O6k99m525K834r85j876P68O05J511j153m86
$$ -5277 -1389 -2074 -2494 -1850 -683 2712 2778 2479 -2046 788 -197 -2073 -1305 -700 811 -342 -828
15784h28o26j118K133J107j855j134j151J354M85m65j456K102J862k79P6k00q4
$$ -828 -1454 -2572 -439 668 -1187 -2321 -3472 -2118 -1633 -2098 -3554 -1452 410 131 207 7 -77
15767g7j749J3k373k08K21p38n42K282K893L299j60k54L781k105m730k622K089
$$ -77 -1826 -1813 -4186 -4394 -4173 -4911 -5453 -3171 -278 3021 2861 2607 6388 4283 -447 -3069 -980
15750i80L006l181j454r98J147J698l635J997n02j003K708j138M667j107Q18J856
$$ -980 2026 -1155 -2609 -3607 -2460 -762 -4397 -2400 -2902 -3905 -1197 -2335 2332 1225 2043 3899
15734C899j636k876m734j647K555L051J771Q60j860j161j550L170J899l80r9p53
$$ 3899 2263 -613 -5347 -6994 -4439 -1388 383 1243 -617 -1778 -3328 -158 1741 1361 1262 509
15718E09j292k745j414j07J599L920k343k564J344L514l295k461O48j975O57K887
$$ 509 -783 -3528 -4942 -5049 -3450 470 -1873 -4437 -3093 421 -2874 -5335 -4687 -6662 -6005 -3118
15702c118K043K87J397k445M08L071o07o402M11J359K658L927j990k011l541R4
$$ -3118 -1075 -788 609 -1836 -1428 1643 1036 -5366 -4955 -3596 -938 2989 999 -1012 -4553 -4459
15686d459K711J197Q01K014O24k613j589J134J342j157J505k648m856j136N80
$$ -4459 -1748 -551 250 2264 2888 275 -1314 -180 1162 5 1510 -1138 -5994 -7130 -6550
15671f550M796K744j531l4j2J560r15k910j745k333J093L657J724r26l86k713
$$ -6550 -1754 990 -541 -575 -587 973 58 -2852 -4597 -6930 -5837 -2180 -456 -1382 -1768 -4481
15655d481J949M71k97Q13R72j026P98l635j130O77J136K927O96j191O64L641R79
$$ -4481 -2532 -2061 -2358 -1545 -573 -1599 -801 -4436 -5566 -4889 -3753 -826 -130 -1321 -657 2984 3963
15638C963k645j220j368J930r12k989O04K769j905k972j927J204K262J809J113
$$ 3963 1318 98 -1270 660 -252 -3241 -2637 132 -1773 -4745 -6672 -5468 -3206 -1397 -284
15623b84J115J881j761j946Q81J577P34L12k758j595M78K260k223k323p47N38
$$ -284 831 2712 951 -995 -114 1463 2197 2509 -249 -1844 -1366 894 -1329 -3652 -4399 -3861
15607c861R72R48l44k102O28M44j288j02j665K975J205r6L897J270l103k968P42
$$ -3861 -2889 -1941 -2285 -4387 -3759 -3315 -4603 -4705 -6370 -3395 -2190 -2286 1611 2881 -222 -3190 -2448
15590b448M034m70q187j602J749J717M06j939M72K393K999l628M99J659q47J086
$$ -2448 1586 1116 -7071 -8673 -6924 -5207 -4801 -6740 -6268 -3875 -876 -4504 -4005 -2346 -3193 -2107
15574b107l406j017L745J520r53l195P53M359j162k322R52J298j488k48K609K676
$$ -2107 -5513 -6530 -2785 -1265 -2218 -5413 -4660 -301 -1463 -3785 -2833 -1535 -3023 -3271 -662 2014
15558B014j41n51l46L85j661j883n413p23L181M719p65l173J516J609m99L80j96
$$ 2014 1873 1322 976 1361 -300 -2183 -7596 -8319 -5138 -419 -1184 -4357 -2841 -1232 -1731 -1351 -1547
15541a547j624K70J175L136J084N17j922j437j578r38L887K448k160k119k990
$$ -1547 -3171 -2901 -1726 1410 2494 3011 1089 -348 -1926 -2864 1023 3471 1311 -808 -3798
15526c798j303L533J173L10J919J321k16r04l38l407j646L469k839j948o39K148
$$ -3798 -5101 -1568 -395 -85 1834 3155 2939 2035 1697 -1710 -3356 113 -2726 -4674 -5313 -3165
15510c165R64K887J625J358j178n09Q77l23J111l492L45j73Q06J075j304k330
$$ -3165 -2201 686 2311 3669 2491 1982 2859 2536 3647 155 500 327 1133 2208 904 -1426
15494a426k55J287K982K96j123p93k110m074l565n35M765P34K478j734l537N08
$$ -1426 -1681 -394 2588 2884 1761 968 -1142 -5216 -8781 -9316 -4551 -3817 -1339 -3073 -6610 -6102
15478f102R65J596K596j170o76p37N23K295j84n90r95J200J497k08m437m071J818
$$ -6102 -5137 -3541 -945 -2115 -2791 -3528 -3005 -710 -894 -1484 -2479 -1279 218 10 -4427 -8498 -6680
15461f680K299p38J501o74J442J210J261J364r85l294R08R27n43j38K05j682P85
$$ -6680 -4381 -5119 -3618 -4292 -2850 -1640 -379 985 0 -3294 -2386 -1459 -2002 -2140 -1935 -3617 -2832
15444b832l287P39l60N80n47j595j932M944N033L015j008j919J829m228k874K713
$$ -2832 -6119 -5380 -5740 -5160 -5707 -7302 -9234 -4290 743 3758 2750 831 2660 -1568 -4442 -1729
15428a729K466J789j07j966N92n062m252K81L518K786j25l837j326O59M43O96
$$ -1729 737 2526 2419 453 1045 -4017 -8269 -7988 -4470 -1684 -1809 -5646 -6972 -6313 -5870 -5174
15412e174L124J139J627Q95j31N08j950j572K616J863j230j386k287P04K780J040
$$ -5174 -2050 -911 716 1611 1480 1988 38 -1534 1082 2945 1715 329 -1958 -1254 1526 2566
15396B566l402n79l68k363K56l71P35K735j228Q20j441J038l050j186j539j005
$$ 2566 -836 -1415 -1783 -4146 -3890 -4261 -3526 -791 -2019 -1199 -2640 -1602 -4652 -5838 -7377 -8382
15380h382K190R76J959J006P49J448N8j059N047J333j811k117J938j330J838n09
$$ -8382 -6192 -5216 -3257 -2251 -1502 -54 4 -1055 3992 5325 3514 1397 3335 2005 3843 3334
15364C334l852J222K907m32p04j94P9l369k236J166J576R28K159k14m31J103L597
$$ 3334 -518 704 3611 3179 2475 2281 2360 -1009 -3245 -2079 -503 425 2584 2370 1939 3042 6639
15347F639q34k989k396j90m174l812K8M149K610j750l582l00N43J137J802k190
$$ 6639 5805 2816 420 230 -3944 -7756 -7728 -3579 -969 -2719 -6301 -6601 -6058 -4921 -3119 -5309
15331e309j044j383L89L273o71K253J893J781j30P93j507k153k344l84j791j45
$$ -5309 -6353 -7736 -7347 -4074 -4745 -2492 -599 1182 1052 1845 338 -1815 -4159 -4543 -6334 -6479
15315f479J880L493m18m69M723L246n667n307K22j152O31L357M97J051K522m408
$$ -6479 -4599 -1106 -1524 -1993 2730 5976 309 -4998 -4776 -5928 -5297 -1940 -1443 -392 2130 -2278
15299b278j086J665j361K07j002m222L88M546J411k63r71m355j676j211N590L904
$$ -2278 -3364 -1699 -3060 -2853 -3855 -8077 -7689 -3143 -1732 -1995 -2966 -7321 -8997 -10208 -4618 -714
15283g14J651j953j245L992M34j550j368l22j688l003l764J446J494M379J400
$$ -714 937 -1016 -2261 1731 2165 615 -753 -1075 -2763 -5766 -9530 -8084 -6590 -2211 -811
15268h11j415j817k985J700J505k897K91J521l776p15L075L209N18N46J433m75
$$ -811 -2226 -4043 -7028 -5328 -3823 -6720 -6429 -4908 -8684 -9399 -6324 -3115 -2597 -2051 -618 -1093
15252a093n157J431K370J357M9r66K46m47J08j92k202j276n85k38K182K652l79
$$ -1093 -6250 -4819 -2449 -1092 -1043 -2009 -1763 -2210 -2102 -2294 -4496 -5772 -6357 -6595 -4413 -1761 -2140
15235b140l58O22j368M88j755r46L96M48o55J768J952k334l156j418M687K664
$$ -2140 -2498 -1876 -3244 -2756 -4511 -5457 -5061 -4613 -5268 -3500 -1548 -3882 -7038 -8456 -3769 -1105
15219a105r02o94j737J354N2K565o71l002l296J573O23j295M310J152J581J086
$$ -1105 -2007 -2701 -4438 -3084 -3032 -467 -1138 -4140 -7436 -5863 -5240 -6535 -2225 -1073 508 1594
15203A594J106k591k592r7p02J75K419J151p55N269q81k670l034J9K855M145j752
$$ 1594 2700 109 -2483 -2580 -3282 -3107 -688 463 -292 4977 4096 1426 -1608 -1589 1266 5411 3659
15186C659l569j50M05k071o017k567K196J901K460n12j690l31j375j67j25L028
$$ 3659 90 -60 345 -1726 -7743 -10310 -8114 -6213 -3753 -4265 -5955 -6286 -7661 -7828 -7953 -4925
15170d925J937J462O80k165k021K548R52r58L147k770m054k306L194J971p25J719
$$ -4925 -2988 -1526 -846 -3011 -5032 -2484 -1532 -2490 657 -2113 -6167 -8473 -5279 -3308 -4033 -2314
15154b314l050Q25J331j948j60J352J738N99j371j799j07K506K550kl467j129
$$ -2314 -5364 -4539 -3208 -5156 -5316 -3964 -2226 -1627 -2998 -4797 -4904 -2398 152 150 -3317 -4446
15138d446P79K990j406m96j883K814k57r17P54L599p4J23j989K879R3j372k2j028
$$ -4446 -3667 -677 -2083 -2579 -4462 -1648 -1905 -2822 -2068 1531 1457 1580 -409 2470 2563 1191 1169 141
15120A41k689l950j913K582L190k022k69j28K488M951n247r70L270p01j267L697
$$ 141 -2548 -6498 -8411 -5829 -2639 -4661 -4930 -5058 -2570 2381 -2866 -3836 -566 -1267 -2534 1163
15104A163K652l310M42P42J905l38l260j982kL451M60n24L551j777k274K82N9
$$ 1163 3815 505 947 1689 3594 3256 -4 -1986 -1988 1463 1923 1399 4950 3173 899 1181 1240
15087A240L10J9j648k421J714j631l906K013M487Q03L71k216K78K165O32k411
$$ 1240 1550 1569 -79 -2500 -786 -2417 -6323 -4310 177 980 1351 -865 -587 1578 2210 -201
15071b01L35j054k445N93J286K960J196r87J489N71k469r36M43j057j483K760
$$ -201 134 -920 -3365 -2772 -1486 1474 2670 1683 3172 3743 1274 338 781 -276 -1759 1001
15055A001j732j032K421n229l289M301M835K198N53l68j611J385n11K81k27K211
$$ 1001 -731 -1763 658 -4571 -7860 -3559 1276 3474 4027 3659 2048 3433 2922 3203 2976 5187
15039E187M69j500L926L742n24N47j377j86N0l416J021O08n73l855n189j507o46
$$ 5187 5656 4156 8082 11824 11300 11847 10470 10284 10334 6918 7939 8547 7974 4119 -1070 -2577 -3223
15022c223P01Q41K97L505k40k455j632l0J659j07J286k710K822j816n890J309
$$ -3223 -2522 -1681 -1384 2121 1881 -574 -2206 -2236 -577 -684 602 -2108 714 -1102 -6992 -5683
15006e683M125p33j153M467M442m58L93r62K33j456J782L754M581L496J3335K0638
$$ -5683 -1558 -2291 -3444 1023 5465 5007 5400 4438 4671 3215 4997 8751 13332 16828 30163 50801
14990E0801L2450N3276L2854l2254n6927l5181j5995p723n787m432l223l870j911
$$ 50801 83251 136527 169381 137127 80200 45019 29024 21301 15514 11082 7859 3989 2078
14977B078K209J598l322j809J584k626l285J006J26k367Q71N18J087j011l071
$$ 2078 4287 5885 2563 754 2338 -288 -3573 -2567 -2441 -4808 -3937 -3419 -2332 -3343 -6414
14962f414o33M02j66k019P36M790O06j201q50J204M16L569j541J59l316k576P51
$$ -6414 -7047 -6645 -6811 -8830 -8094 -3304 -2698 -3899 -4749 -3545 -3129 440 -1101 -942 -4258 -6834 -6083
14945f083J635R18N77M704L085p12k390j033j177j04K325N3k779L21m6P34J281
$$ -6083 -4448 -3530 -2953 1751 4836 4124 1734 701 -476 -580 1745 1798 -981 -660 -706 28 1309
14928A309J710j166j799l025j49L36J691J208j69J257k128k95J372J463k79k61
$$ 1309 3019 1853 54 -2971 -3120 -2784 -1093 115 -54 1203 -925 -1220 152 1615 1336 1075
14912A075P3j678m86o55J966l94k901N52K188R42o42J442m002r81J123J786L479
$$ 1075 1148 -530 -1016 -1671 295 -99 -3000 -2448 -260 682 40 1482 -2520 -3501 -2378 -592 2887
14895B887k596q22j489m120J09K873J880r58R93O10j591l695k373K730K722L581
$$ 2887 291 -531 -2020 -6140 -6031 -3158 -1278 -2236 -1243 -633 -2224 -5919 -8292 -5562 -2840 741
14879G41M485k437j753m09k053o60k181J230m374k072M778K430J849l424Q27J612
$$ 741 5226 2789 1036 627 -1426 -2086 -4267 -3037 -7411 -9483 -4705 -2275 -426 -3850 -3023 -1411
14863a411r66L73o92j298j875l83M155J374j623N18L11M072Rj497m66k658J243
$$ -1411 -2377 -2004 -2696 -3994 -5869 -6252 -2097 -723 -2346 -1828 -1517 2555 2564 1067 601 -2057 -814
14846h14J087R5N75j712Q60j018J627o5k356n08K729K189L4j362o80L01L82j45
$$ -814 273 368 943 -769 91 -927 700 635 -1721 -2229 500 2689 2723 1361 681 982 1364 1219
14828A219k987Q3j080K160M344Q34J65k436L84L04K844K841J238r52L600J202
$$ 1219 -1768 -1685 -2765 -605 3739 4573 4738 2302 2686 2990 5834 8675 9913 8961 12561 13763
14812A3763j325p82l607l425l084k418n923j459J39K258N5k766M222M294J357
$$ 13763 12438 11656 8049 4624 1540 -878 -6801 -8260 -8121 -5863 -5808 -8574 -4352 -58 1299
14797A299R72j507J057K48k492K479M070n61m112l415k406j478J973M576m47l456
$$ 1299 2271 764 1821 2069 -423 2056 6126 5565 1453 -1962 -4368 -5846 -3873 703 256 -3200
14781c200Q14J829m37j027l876J229p91j793J780K122j264J040q46P89K269J292
$$ -3200 -2386 -557 -994 -2021 -5897 -4668 -5459 -7252 -5472 -3350 -4614 -3574 -4420 -3631 -1362 -70
14765g0j539R01O69J915j573j510j647k608N79r64l16m34K77K919L523J301R34
$$ -70 -1609 -708 -39 1876 303 -1207 -2854 -5462 -4883 -5847 -6163 -6597 -6320 -3401 122 1423 2357
14748B357Q81j985j918L192j412k604j622M628J696J096p5j838k344j766k99j327
$$ 2357 3238 1253 -665 2527 1115 -1489 -3111 1517 3213 4309 4234 2396 52 -1714 -2013 -3340
14732c340j61J381R53J660M309K094k518j869P91p52j613J585P05N54r30j318
$$ -3340 -3501 -2120 -1167 493 4802 6896 4378 2509 3300 2548 935 2520 3225 3779 2849 1531
14716A531p35L315J564l269p644j396L484j094L59J407K948j575K185k203j793
$$ 1531 796 4111 5675 2406 -5238 -6634 -3150 -4244 -3885 -2478 470 -1105 1080 -1123 -2916
14701b916K139l189j373P14J641J16j178L468j353k540r09K277K335m61j466k148
$$ -2916 -777 -3966 -5339 -4625 -2984 -2868 -4046 -578 -1931 -4471 -5380 -3103 -768 -1229 -2695 -4843
14685d843J566K787k252j209L017K899r29m745P01K474l048K166J203K24L09n25
$$ -4843 -3277 -490 -2742 -3951 -934 1965 1036 -3709 -3008 -534 -3582 -1416 -213 11 320 -205
14669b05k677j925J533N91j119k100J436j260p81J871o8K283K692L040L38m112
$$ -205 -2882 -4807 -3274 -2683 -3802 -5902 -4466 -5726 -6507 -4636 -4704 -2421 271 3311 3649 -463
14653d63k175p65j995Q6J213K812K602k7k550j247j284r05J668J51n48K624K019
$$ -463 -2638 -3403 -5398 -5312 -4099 -1287 1315 1288 -1262 -2509 -3793 -4698 -3030 -2879 -3427 -803 1216
14636A216k939N14J422n419q68j097j235K869M813K275N90k628k841k366K205
$$ 1216 -1723 -1209 213 -5206 -6074 -7171 -8406 -5537 -724 1551 2141 -487 -3328 -5694 -3489
14621c489K674j24J016K72K488K345k364m140p42J114O41L13k00J021j257K265
$$ -3489 -815 -939 77 349 2837 5182 2818 -1322 -2064 -950 -309 4 -196 825 -432 1833
14605A833l902j475r37J525J989J653L7Q86R14o94j205j798J773J332j4O79l437
$$ 1833 -2069 -3544 -4481 -2956 -967 686 723 1609 2523 1829 624 -1174 599 1931 1917 2596 -841
14588h41j706r74J8K717J002j935j553J155j32Q86L634j484o31K189J245k655
$$ -841 -2547 -3521 -3503 -786 216 -1719 -3272 -2117 -2249 -1363 2271 787 156 2345 3590 935
14572I35Q05p44k792K064N95J959N67l78l77j138R7K204j526r96k150J969R9J724
$$ 935 1740 996 -1796 268 863 2822 3389 3011 2634 1496 1593 3797 2271 1275 -875 1094 1193 2917
14554B917J020Q66l515p8p17J429n74J319j979k028j926p68j084J59j45k035L659
$$ 2917 3937 4803 1288 1210 493 1922 1348 2667 688 -1340 -3266 -4034 -5118 -4959 -5104 -7139 -3480
14537c480L019N73J166J24J49k03m94k167j715J31N70K400K074Q70m02l218j762
$$ -3480 -461 112 1278 1402 1551 1348 854 -1313 -3028 -2897 -2327 73 2147 3017 2615 -603 -2365
14520b365J889k4k598J015j45M90p21K542J690k145j777L90n42Q95J055L74r4
$$ -2365 -476 -500 -3098 -2083 -2228 -1738 -2459 83 1773 -372 -2149 -1759 -2301 -1406 -351 23 -71
14503g1K864j696K772O03k720m325k201L305L73j658K707l114j915p85j283P2
$$ -71 2793 1097 3869 4472 1752 -2573 -4774 -1469 -1096 -2754 -47 -3161 -5076 -5861 -7144 -7072
14487g072J90l221K951L983J631p94j785k249K035J736K98r42Q16R81n21K338
$$ -7072 -6882 -10103 -7152 -3169 -1538 -2332 -4117 -6366 -4331 -2595 -2297 -3239 -2423 -1442 -1963 375
14471C75K547j507Nk78L23l356j235L221nK227K505j869j028j372r8J838k18j497
$$ 375 2922 1415 1420 1142 1465 -1891 -3126 95 90 2317 4822 2953 1925 553 455 2293 2075 578
14453E78l360j222j094J080L847L53j29j571l204O468K893n58k917r92M01l087
$$ 578 -2782 -4004 -5098 -4018 -171 182 53 -1518 -4722 1746 4639 4081 1164 172 573 -2514
14437b514j662L97J367q26j1K158K577j213L92M76K06p17N21J179Q39j595j074
$$ -2514 -4176 -3779 -2412 -3238 -3249 -1091 1486 273 665 1141 1347 630 1151 2330 3169 1574 500
14420E00j687L409k200q36J08O53K273m72m4k294J350k874K461K204k512j888
$$ 500 -1187 2222 22 -814 -706 -53 2220 1748 1704 -590 760 -2114 347 2551 39 -1849
14404a849l53L03Q48j19n98J864j235J449k066k732N14K207l62M697o47M85k950
$$ -1849 -2202 -1899 -1051 -1170 -1768 96 -1139 310 -1756 -4488 -3974 -1767 -2129 2568 1921 2406 -544
14387e44j196M63k890o75K075K0j069J241K378j488j804M368Q34k417P61L095
$$ -544 -1740 -1277 -4167 -4842 -2767 -2747 -3816 -2575 -197 -1685 -3489 879 1713 -704 57 3152
14371C152j853Q9K799k320P61L721j554k175l719r5j585O5P71j15L232J219J473
$$ 3152 1299 1388 4187 1867 2628 6349 4795 2620 -1099 -1194 -2779 -2714 -1943 -2058 1174 2393 3866
14354C866j180m636j768j712j794j634Q45J407J27M34K160L009J324J272n23k561
$$ 3866 2686 -1950 -3718 -5430 -7224 -8858 -8013 -6606 -6479 -6045 -3885 -876 448 1720 1197 -1364
14338a364r73K692J722k54J19o87j15K426r1j203m68k401M43j809k876L554J631
$$ -1364 -2337 355 2077 1823 1942 1255 1140 3566 3475 2272 1804 -597 -154 -1963 -4839 -1285 346
14321C46J161j598k412j665l125o5L73k98L199J429q73L434K640R71k211M44N89
$$ 346 1507 -91 -2503 -4168 -7293 -7358 -6985 -7283 -4084 -2655 -3528 -94 2546 3517 1306 1750 2339
14304B339j901j16K97k452p24J771K840j70r03K01n4l33n86J566j882r88L149
$$ 2339 438 322 619 -1833 -2557 -786 2054 1884 981 1182 1128 795 209 1775 -107 -1095 2054
14287B054k779m642J412J263N2O05L243K971L20P53j129J25P00K251q66k794N46
$$ 2054 -725 -5367 -3955 -2692 -2640 -2035 1208 4179 4499 5252 4123 4248 4948 7199 6333 3539 4085
14270D085P73q62r80p50l003j378j304L034j250j013n7J995r28J260J677R15q03
$$ 4085 4858 3996 3016 2266 -737 -2115 -3419 -385 -1635 -2648 -2705 -710 -1638 -378 1299 2214 1411
14253A411L341j446j971m129k250K114J88k66P31r33K55n35N2R47J78J401k46
$$ 1411 4752 3306 1335 -2794 -5044 -2930 -2742 -3008 -2277 -3210 -2955 -3490 -3438 -2491 -2313 -912 -1158
14236a158J380P51K96P61p5K35R5j471k618n70m08k875K24L921K272J717k134
$$ -1158 222 973 1269 2030 1955 2190 2285 814 -1804 -2374 -2782 -5657 -5433 -1512 760 2477 343
14219C43l773n64j123L541J626k306N16Q06K022J608j713k866K61J376m67j944
$$ 343 -3430 -3994 -5117 -1576 50 -2256 -1740 -934 1088 2696 983 -1883 -1622 -246 -713 -2657
14203b657j253L36K532M82k57N06P39K328P24j959J028j233j649J505o08o26j100
$$ -2657 -3910 -3574 -1042 -560 -817 -311 428 2756 3480 1521 2549 1316 -333 1172 564 -62 -1162
14186a162M728L04l739O02K665k408n377K189L763K117m08m215k121J238J408
$$ -1162 3566 3870 131 733 3398 990 -4387 -2198 1565 3682 3274 -941 -3062 -1824 -416
14171d16l731m497J05L029r68k969L800J689J101K846J575O8j447L90J810l928
$$ -416 -4147 -8644 -8539 -5510 -6478 -9447 -5647 -3958 -2857 -11 1564 1632 185 575 2385 -1543
14155a543o168K518N235J621l906k975P00J834L459j707p22K75O07m0O22P4l958
$$ -1543 -7711 -5193 42 1663 -2243 -5218 -4518 -2684 775 -932 -1654 -1379 -772 -812 -190 -116 -4074
14138d074K146P85k439j872K529K660k54J939J735K082o66j846p17k207j952j993
$$ -4074 -1928 -1143 -3582 -5454 -2925 -265 -519 1420 3155 5237 4571 2725 2008 -199 -2151 -4144
14122d144O38J468J620r90l606L799K430j917j622M99P60M76R7J169J327l147
$$ -4144 -3506 -2038 -418 -1408 -5014 -1215 1215 -702 -2324 -1825 -1065 -589 -492 677 2004 -1143
14106a143j404k438L23J766K588Q7m2N511J893m62o51o36j966l348K031L607j585
$$ -1143 -2547 -4985 -4662 -2896 -308 -221 -263 5248 7141 6679 6028 5392 3426 78 2109 5716 4131
14089D131l459k466o74k309K524J963O40o80L56L269K11l407n38J950J934P74
$$ 4131 672 -1794 -2468 -4777 -2253 -290 350 -330 26 3295 3506 99 -439 1511 3445 4219
14073D219M792L034O481O148N330N948N518N28j918j885m421o397n002q896o572
$$ 4219 9011 12045 18526 24674 30004 35952 41470 41998 40080 38195 33774 27377 22375 13479 6907
14058F907N85j47j898l153l12k062j288K110R2j274j137J191Q68M99M047J415
$$ 6907 7492 7345 5447 2294 1982 -80 -1368 742 834 -440 -1577 -386 482 981 5028 6443
14042F443K142J542j235k659j307k231J24M25L57N92j185m491k335K903J58L389
$$ 6443 8585 10127 8892 6233 4926 2695 2819 3244 3601 4193 3008 -1483 -3818 -915 -757 2632
14026B632J261l055j860R47k51O0m08m65K760j48j261j138J613J250k527J122
$$ 2632 3893 838 -1022 -75 -326 -266 -674 -1139 1621 1473 212 -926 687 1937 -590 532
14010E32J033P44J87k474j929L740K590j818j987k19J588K359J089j462m0K45
$$ 532 1565 2309 2496 22 -1907 1833 4423 2605 618 399 1987 4346 5435 3973 3933 4178
13994D178j077J579L000l12J136j626o138p29o24n41K380R52J825N82N99J002
$$ 4178 3101 4680 7680 7368 8504 6878 740 11 -613 -1154 1226 2178 4003 4585 5184 6186
13978F186N56J302n32l219l124j046Q79j042l59L597L015K283p2n495k880J100
$$ 6186 6742 8044 7512 4293 1169 123 1002 -40 -399 3198 6213 8496 8424 2929 49 1149
13962A149K549m66k328k368L359O198p64k753m885M10K137r39j519O49K415l418
$$ 1149 3698 3232 904 -1464 1895 8093 7329 4576 -309 101 2238 1299 -220 429 2844 -574
13946e74J308J095j439K303J173L48Q6k143l140J616j055K45L570L401O06k689
$$ -574 734 1829 390 2693 3866 4214 4300 2157 -983 633 -422 -177 3393 6794 7400 4711
13930D711n23J441N53J57O57Q88k53k365k252k21J136m16k847j319L547K315p10
$$ 4711 4188 5629 6182 6339 6996 7884 7631 5266 3014 2793 3929 3513 666 -653 2894 5209 4499
13913D499j355q2L27j571Q88l48R0j667o93L221J614k377l201N2P66J183k337
$$ 4499 3144 3062 3389 1818 2706 2358 2448 781 88 3309 4923 2546 -655 -603 163 1346 -991
13896i91k379J08M30L782j34k387Q47J043K715k311k068j979P32K377j50K877
$$ -991 -3370 -3262 -2832 950 816 -1571 -724 319 3034 723 -1345 -3324 -2592 -215 -365 2512
13880B512L464k749k330n89l03K95j325J583K601O62J320j251l299m521k44K391
$$ 2512 5976 3227 897 308 5 300 -1025 558 3159 3821 5141 3890 591 -3930 -4174 -1783
13864a783K468L284j914k831K48M306J936k037k35J804j016L52j409K31l50j548
$$ -1783 685 3969 2055 -776 -528 3778 5714 3677 3442 5246 4230 4582 3173 3404 3054 1506
13848A506k815L56M664l17p37r36m10l053L112L031n29K960J402l07q22k059k21
$$ 1506 -1309 -953 3711 3394 2657 1721 1311 -1742 1370 4401 3872 6832 8234 7927 7105 5046 4825
13831D825j679k243J89N63j788J622j538M24j875J946N182K446j359k047k372
$$ 4825 3146 903 1092 1655 -133 1489 -49 375 -1500 446 5628 8074 6715 4668 2296
13816B296J788P0L309j634j356l643O82k59k151K212j119N72L218p0n09j20k49
$$ 2296 4084 4154 7463 5829 4473 830 1512 1253 -898 1314 195 767 3985 3915 3406 3286 3037
13799C037k875j228K316J923J148j212j550p7j169K24K796K504j79k415K64O56
$$ 3037 162 -1066 1250 3173 4321 3109 1559 1482 313 537 3333 5837 5658 3243 3507 4163
13783D163J566K498L01l027n203J571M643o75q25o409K89O596J263j937j473k293
$$ 4163 5729 8227 8528 5501 298 1869 6512 5837 5012 -1397 -1108 5488 6751 4814 3341 1048
13767A048K29j040J517J390J460j847k767P4K347J316K412k738n183l782J807
$$ 1048 1277 237 1754 3144 4604 2757 -10 64 2411 3727 6139 3401 -1782 -5564 -3757
13752c757J866K492p9J236J065l11j334M06n03k65J98J421J352k48l400P78m65
$$ -3757 -1891 601 522 1758 2823 2512 1178 1584 1081 816 1014 2435 3787 3539 139 917 452
13735D52J342K102q25j681M86J159K168K63r35M200K255o238k846J263J504l395
$$ 452 1794 3896 3071 1390 1876 3035 5203 5466 4531 8731 10986 4748 1902 3165 4669 1274
13719A274l844L030P12j470O63R95M363O6k126l237k331J341M981J945J209j685
$$ 1274 -2570 460 1172 -298 365 1360 5723 5789 3663 426 -1905 -564 4417 6362 7571 5886
13703E886R70r45l95j46lO7m157l373K405J974l634J477L452K169n96K542L32
$$ 5886 6856 5911 5516 5370 5367 5434 1277 -2096 309 2283 -1351 126 3578 5747 5151 7693 8025
13686H025k926n0M449L26p52j413q66J198N58j685q71m64K144n10J345M079M353
$$ 8025 5099 5049 9498 9824 9072 7659 6793 7991 8549 6864 5993 5529 7673 7163 8508 12587 16940
13669A6940q88j775j426j01P89k390k989N56M0j35n55m185o50J571O60O57q77
$$ 16940 16052 14277 12851 12750 13539 11149 8160 8716 8756 8621 8066 3881 3231 4802 5462 6119 5242
13652E242O57J909j770j36J083q38k749j562j223k46o88M655M381j090J319Q59
$$ 5242 5899 7808 6038 5902 6985 6147 3398 1836 613 367 -321 4334 8715 7625 8944 9803
13636I803j010j338O7m2k233j10R91K299J402j73j446l346j135R52P74r00J36
$$ 9803 8793 7455 7522 7480 5247 5137 6128 8427 9829 9656 8210 4864 3729 4681 5455 4555 4691
13619D691l133K06j084k53j190K589K313J138j01n45j792J805n6O1j490j091o23
$$ 4691 1558 1764 680 427 -763 1826 4139 5277 5176 4631 2839 4644 4588 4649 3159 2068 1445
13602A445l908j79K836L098P15j69r62l22o25p30L464m79R92K383l477j425J750
$$ 1445 -2463 -2642 194 3292 4007 3838 2876 2554 1929 1199 4663 4184 5176 7559 4082 2657 4407
13585D407M499l157M84J977k410j257j713j060l314j570K513J548K480J876M23
$$ 4407 8906 5749 6233 8210 5800 4543 2830 1770 -1544 -3114 -601 947 3427 5303 5726
13570E726N17n27k70L422j107j330j487n98K434N352k685O04k146K01J515j673
$$ 5726 6243 5716 5446 8868 7761 6431 4944 4346 6780 12132 9447 10051 7905 8106 9621 7948
13554G948k017J910j0m07K656j0k199l604j130M84j334j354j264K939K564J504
$$ 7948 5931 7841 7831 7424 10080 10070 7871 4267 3137 3621 2287 933 -331 2608 5172 6676
13538F676o32j354L73m68l082Q81m83J471L159N91l360k693R05K907k96m71j32
$$ 6676 6044 4690 5063 4595 1513 2394 1911 3382 6541 7132 3772 1079 1984 4891 4595 4124 3992
13521C992K93l789j996P88L459p89J746K483j737K88n83m20M89L05k667k408k230
$$ 3992 4285 496 -1500 -712 2747 1958 3704 6187 4450 4738 4155 3735 4224 4529 1862 -546 -2776
13504b776Q14J864K488J892K661o12j119l652r12k514J298M146J690M679Q71o19
$$ -2776 -1962 -98 2390 4282 6943 6331 5212 1560 648 -1866 -568 3578 5268 9947 10818 10199
13488A0199P96N00m475j561J767P29O62j40J022K527m451j436K427k238l990J579
$$ 10199 10995 11495 7020 5459 7226 7955 8617 8477 9499 12026 7575 6139 8566 6328 2338 3917
13472C917J026R83p49j863K000M266M578k487j731q18k723O14P49k081j247l222
$$ 3917 4943 5926 5177 3314 5314 9580 14158 11671 9940 9122 6399 7013 7762 5681 4434 1212
13456A212J543M435M146p2J259l434m752k204j133N33K958J29J283p62k301j980
$$ 1212 2755 7190 11336 11264 12523 9089 4337 2133 1000 1533 4491 4620 5903 5141 2840 860
13440H60J401l487o05J781J77R25K723L986J351l9l018k49r52K199L771M04O42
$$ 860 2261 -1226 -1831 -50 127 1052 3775 7761 9112 9073 6055 5806 4854 7053 10824 11228 11870
13423A1870k192N7l926l955J017L98J871l63j59K33J918K571J898J100J451j917
$$ 11870 9678 9735 5809 1854 2871 3269 5140 4777 4618 4851 6769 9340 11238 12338 13789 11872
13407A1872j556l100j901j47m13Q20K491j145k069J265K2o69M107J650O91l896
$$ 11872 10316 7216 5315 5168 4755 5575 8066 6921 4852 6117 6139 5470 9577 11227 11918 8022
13391H022p262j092J497J568l01L10K150J703P04n143j585J061K007K64j659k713
$$ 8022 760 -332 1165 2733 2432 2742 4892 6595 7299 2156 571 1632 3639 3903 2244 -469
13375d69j945J140J789L135m24n20L266K023N016K914l61j336k783j739k455j470
$$ -469 -2414 -1274 515 3650 3226 2706 5972 7995 13011 15925 15564 14228 11445 9706 7251 5781
13359E781N52M73J11j989q61qK788O05j466j127M252L340K61m322j922j001K58
$$ 5781 6333 6806 6917 4928 4067 4059 6847 7452 5986 4859 9111 12451 12712 8390 6468 5467 5725
13342E725L43N250l979j977n9k206J975J059K116O14R28J22k832k169j996N02
$$ 5725 6068 11318 7339 5362 5303 3097 5072 6131 8247 8861 9789 9911 7079 4910 2914 3416
13326C416M99J682J608M80j47n22j988k875J323K281N382L031j624k302J169J023
$$ 3416 3915 5597 7205 7685 7538 7016 5028 2153 3476 5757 11139 14170 12546 10244 11413 12436
13310A2436K76j622k643j873K521k87j040Q09K813q59L21J531j911j155j794n11
$$ 12436 12712 11090 8447 6574 9095 8808 7768 8577 11390 10531 10852 12383 10472 9317 7523 7012
13294G012R25K240l138K42J960k286o24n23J142M160N557P11j613n87K187j106
$$ 7012 7937 10177 7039 7281 9241 6955 6331 5808 6950 11110 16667 17378 15765 15178 17365 16259
13278A6259J85J987K87K22Q89J278r47l076Q10j942l40L935j994r14K056k298
$$ 16259 16444 18431 18718 18940 19829 21107 20160 17084 17894 15952 15612 19547 17553 16639 18695 16397
13262A6397j218l729j80M596K877Q78M225J927j65j201J292K439N748Q310O864
$$ 16397 15179 11450 11270 15866 18743 19621 23846 25773 25608 24407 25699 28138 33886 42196 49060
13247D9060Q943R654O993J0066K1467K3676L3325N1599R0754J74308L15486N00028
$$ 49060 58003 67657 74650 84716 106183 129859 163184 214783 305537 479845 795331 1295359
13235A295359M00221j74842n33080l90863k14509j26560p4787m4534l4202k6571
$$ 1295359 1695580 1520738 987658 596795 382286 255726 180939 136405 102203 75632
13225G5632j6436j3466p977m150l441l977k081o45q78J963R13N60m95J990J20
$$ 75632 59196 45730 37753 33603 30162 26185 24104 23459 22581 24544 25457 26017 25522 27512 27632
13210B7632m915l986J341M239o11k923j934j681L13j937J200k354k600j429l850
$$ 27632 22717 18731 20072 24311 23700 20777 18843 17162 17475 15538 16738 14384 11784 10355 6505
13195F505J021M595M939N752n44l088m166j924k523l140l58M41n65P02L52P52
$$ 6505 7526 12121 17060 22812 22268 19180 15014 13090 10567 7427 7069 7510 6945 7647 7999 8751
13179H751J030K153J892l222k833k209j694M448J203R54M25j491o58P72O777L608
$$ 8751 9781 11934 13826 10604 7771 5562 3868 8316 9519 10473 10898 9407 8749 9521 16298 19906
13163A9906J532K626M35k610K295j007m954J889J513J236j75j392N63j737p4j02
$$ 19906 21438 24064 24499 21889 24184 23177 18223 20112 21625 22861 22686 21294 21857 20120 20046 19944
13147A9944L986O695r85o073p306j687m24Q86j097Q68K430J346m144p01O71J848
$$ 19944 23930 30625 29640 23567 16261 14574 14150 15036 13939 14807 17237 18583 14439 13738 14409 16257
13131A6257O36L566j391m143k6R13J135j5M95O58K301k500k882O37k943L60L075
$$ 16257 16893 20459 19068 14925 14899 15812 16947 16932 17427 18085 20386 17886 15004 15641 12698 13058 16133
13114A6133K910J718q86k466j085j972R40K346K089j604l602J93K777K074J107
$$ 16133 19043 20761 19875 17409 16324 14352 15292 17638 19727 18123 14521 14714 17491 19565 20672
13099B0672Q17J501K518N225J973m024k264o1j169m7J187Q171J2347M954m548
$$ 20672 21489 22990 25508 30733 32706 28682 26418 26357 25188 25141 26328 34499 46846 51800 47252
13084D7252j4645j3965j4460j5318o727p598o575k086M189J2132J1148O784K171
$$ 47252 32607 18642 4182 -11136 -17863 -25461 -32036 -34122 -29933 -17801 -6653 131 2302
13071B302J143k741l755j22M692L918N962J769o16K283M590L719n8O9L489M055
$$ 2302 3445 704 -3051 -3173 1519 5437 11399 13168 12552 14835 19425 23144 23086 23155 26644 30699
13055C0699J757j532k163j248p468p396m028k359K444L925Q7l761J671P582N570
$$ 30699 32456 30924 28761 27513 20045 12649 8621 6262 8706 12631 12718 8957 10628 18210 23780
13040B3780L252m08j280o20O26p7K444J2696K0649K4921L9733M3453J7859k1127
$$ 23780 27032 26624 25344 24724 25350 25273 27717 40413 61062 85983 125716 169169 187028 165901
13026A65901k7458m5680p238O358j0445j4356j1932q747n567l278j777L117N801
$$ 165901 138443 92763 85525 91883 81438 67082 55150 46403 40836 37558 35781 38898 44699
13013D4699K252j72n145j1102q89L650O300J577l86R8j930K635O461L320j447
$$ 44699 46951 46779 41634 30532 29643 33293 39593 41170 40784 40882 38952 41587 48048 51368 49921
12998D9921K30M789P897N749k53n862o237o321o389q288n878O58L078n550J779
$$ 49921 50151 54940 62837 68586 68333 62471 56234 49913 43524 35236 29358 30016 33094 27544 29323
12983B9323M181J922N291M358R75O29p32N816O123K902N861J3280Q511o29n628
$$ 29323 33504 35426 40717 45075 46050 46679 45947 51763 57886 60788 66649 79929 88440 87811 82183
12968H2183q414j2795j1436p422J4764L3669K5754O726o588j5830j4268r703n951
$$ 82183 73769 60974 49538 42116 56880 90549 116303 123029 116441 100611 86343 76640 70689
12955G0689m325k860r28k368J656l836l782k4k685R06r4J128j634l178l889j843
$$ 70689 66364 63504 62576 60208 61864 58028 54246 54222 51537 52443 52349 53477 51843 48665 44776 42933
12939D2933n765J12J2253J3683P738j13n208m563m044J709j1774k0282j7405p475
$$ 42933 37168 37280 49533 63216 70954 70841 65633 61070 57026 58735 46961 26679 9274 1799
12925A799L035J5049J1011K846K161L212O849R041M415J377M338J0124O085o84
$$ 1799 4834 19883 30894 33740 35901 39113 45962 55003 59418 60795 65133 75257 81342 80658
12911H0658o513q849n972l132m074p161k971q521l5129j2989J53899K35903P6046
$$ 80658 74145 65296 59324 56192 52118 44957 41986 33465 -1664 -14653 139246 375149 451195
12898D51195n8269p8944n9813l4871j9173j6853j8133j6369j1289n379J035N964
$$ 451195 392926 313982 254169 219298 200125 183272 165139 148770 137481 132102 133137 139101
12886A39101J175l101m581o170k439k308l095k811m008n808k802K314R724Q698
$$ 139101 140276 137175 132594 126424 123985 121677 118582 115771 111763 105955 103153 105467 115191 123889
12872A23889K395j680k639P77L928J571q38L770R118J5615Q567M208P034P971
$$ 123889 126284 124604 121965 122742 126670 128241 127403 131173 140291 155906 164473 168681 175715 183686
12858A83686J1092J4830R171J946J478r9l393n050k652p18J0725J0447J1617N997
$$ 183686 194778 209608 218779 220725 222203 222104 218711 213661 211009 210291 221016 231463 243080 249077
12844B49077J336k461L323J3527J5117L326K989Q230P203K754R356J6245K2362
$$ 249077 250413 247952 251275 264802 279919 283245 286234 294464 301667 304421 313777 330022 352384
12831C52384L2688L8542L6686L2499K4695K2053J6855K9991Q6114J59843K34700
$$ 352384 385072 423614 460300 492799 517494 539547 556402 586393 672507 832350 1067050
12820A067050J88771p4602k36863j55343n4811o45K4980K2063J1653K6059M4822
$$ 1067050 1255821 1181219 944356 789013 734202 733557 758537 780600 792253 818312 863134
12809H63134O8208Q2651P6337P0887Q7466J14112J60503K31054K37129J20433
$$ 863134 931342 1013993 1090330 1161217 1248683 1362795 1523298 1754352 1991481 2111914
12799B111914K9636N2955R1321J33425J91710K64403L30115L58620M03954N31745
$$ 2111914 2141550 2194505 2285826 2419251 2610961 2875364 3205479 3564099 3968053 4499798
12789D499798P63022J025678J320164J487032J246585J237998K023987L050007
$$ 4499798 5262820 6288498 7608662 9095694 10342279 11580277 13604264 16654271
12781A6654271M409802O775671J1079991J9088905L3890266N9507380Q8193955
$$ 16654271 21064073 27839744 38919735 58008640 91898906 151406286 239600241
12774B39600241O4736848k9466296r2950681p2538712l9646334k1702455j2931774
$$ 239600241 304337089 274870793 181920112 109381400 69735066 48032611 35100837
12767C5100837q405212n780387m003300k744929j823486j248819j262980j615629
$$ 35100837 26695625 20915238 16911938 14167009 12343523 11094704 9831724 8216095
12759H216095j426327j006241p89782o67022n23816l98265l32760l11228k96047
$$ 8216095 6789768 5783527 4993745 4326723 3802907 3404642 3071882 2760654 2464607
12750B464607k64629k07300j52103j04371r7557j01713r5272r9895r6043q0768
$$ 2464607 2199978 1992678 1840575 1736204 1638647 1536934 1441662 1341767 1245724 1164956
12740A164956n4994l8328l4365m9563o7980p1348o1119l8280k3484k9863m2544
$$ 1164956 1109962 1071634 1037269 987706 919726 848378 787259 748979 725495 695632 653088
12729F53088n4967n7528m3270k2230n969j2826l4276l7692k8913k0520j0429K362
$$ 653088 598121 540593 497323 475093 469124 456298 422022 384330 355417 334897 324468 326830
12717C26830J0861Q062K498m892j3480j9323j7105q193j3103j5349r255j56l684
$$ 326830 337691 345753 348251 343359 329879 310556 293451 285258 272155 256806 247551 247395 243711
12704B43711j3427j0833l536K741K79m385j2200j5306k0887j4849q021m596o113
$$ 243711 230284 219451 215915 218656 218935 214550 202350 187044 166157 151308 143287 138691 132578
12691A32578l921R52O025L621K833k182k780L039R416L794q323o756j646j055
$$ 132578 128657 129609 135634 139255 142088 139906 137126 140165 149581 153375 145052 138296 136650 135595
12677A35595m636m851j057N633K80k647o938p626m769L750l412o418r065o912
$$ 135595 130959 126108 125051 130684 130964 128317 121379 113753 108984 112734 109322 102904 93839 86927
12663H6927n174n328m322L6N437q833j2003j1513j6653j0837o239o583j3371j3906
$$ 86927 81753 76425 72103 72139 77576 68743 56740 45227 28574 17737 11498 4915 -8456 -22362
12649b2362J8150N3659Q5271Q8092J8592l3354k6275j9348j7601j7110j2363j4265
$$ -22362 -4212 49447 134718 222810 241402 208048 181773 162425 144824 127714 115351 101086
12637A01086j7180j1942m508L91N394M133m172k099O861R067O391K176k75j714
$$ 101086 83906 71964 67456 67847 73241 77374 73202 71103 77964 87031 93422 95598 95323 93609
12623I3609O020J0865j08j6727k1804j9088o840R021o99o771j567K659P979K492
$$ 93609 99629 110494 110386 93659 71855 52767 45927 54948 54249 47478 45911 48570 56549 59041
12609E9041L208k600o321k962n436o102J398M594J499j064n340l557q460n369
$$ 59041 62249 59649 53328 50366 44930 38828 40226 44820 46319 45255 39915 36358 27898 22529
12595B2529K34J274m492n232o568o631j5495j8214p933P457J7891K4314J9672
$$ 22529 22763 24037 19545 14313 7745 1114 -14381 -32595 -40528 -33071 -15180 9134 28806
12582B8806K312p472j6381j3503p650m349O636J3405J1206k209r46M239J167L454
$$ 28806 31118 23646 7265 -6238 -13888 -18237 -11601 1804 13010 10801 9855 14094 15261 18715
12568A8715J588J096O535M235K589N090J000k133p60m741n985n682q505o729n999
$$ 18715 20303 21399 27934 32169 34758 39848 40848 38715 37955 33214 27229 21547 13042 6313 314
12553C14j162O14L393K504M429k493j706M777J0425O123k788Qk372k024K860K664
$$ 314 -848 -234 3159 5663 10092 7599 5893 10670 21095 27218 24430 24438 22066 20042 22902 25566
12537B5566l754r427q830L48O031M264Q169O768K069m2P26K068Q629J3633P500
$$ 25566 21812 12385 3555 3903 9934 14198 22367 29135 31204 31162 31888 33956 42585 56218 63718
12522F3718l598p762j2904m047J208J64M94J542N82j603l815o000k541R82K500
$$ 63718 60120 52358 39454 35407 36615 36779 37273 38815 39397 37794 33979 27979 25438 26420 28920
12507B8920j606k226L191O67K860M769M101K39n994p094o830l550n03n502k664
$$ 28920 27314 25088 28279 28946 31806 36575 40676 40915 34921 27827 20997 17447 16944 11442 8778
12492H778Q35N79n18j60P54R568Q270J37m005m55L493O533K033N64k275j889l015
$$ 8778 9613 10192 9674 9514 10268 19836 28106 28243 24238 23783 27276 33809 35842 36406 34131 32242 29227
12475B9227P39M79Q533J3375J2721j026j0310p064n222j2531j6028j2481j0700
$$ 29227 29966 30445 38978 52353 65074 64048 53738 46674 41452 28921 12893 412 -10288
12462a0288j3229M577J0216P925O368l177j79J390j808k813N77L173J626K74J343
$$ -10288 -23517 -18940 -8724 -799 5569 2392 2213 3603 1795 -1018 -441 2732 4358 4632 5975
12447E975N830M72l699o49P23L08K236J430j910j391l499L29k94j159k030j546
$$ 5975 11805 12277 8578 7929 8652 8960 11196 12626 10716 9325 5826 6155 5861 4702 2672 1126
12431A126L980r9l271m02L331L48j127J522L353J188j09m80L69Q05J08L36k802
$$ 1126 5106 5007 1736 1334 4665 5013 3886 5408 8761 9949 9840 9360 9729 10534 10642 10978 8176
12414H176j218l877J855P55N251K471L301K074n365k976p17p551q567k180L030
$$ 8176 6958 3081 4936 5691 10942 13413 16714 18788 13423 10447 9730 2179 -6388 -8568 -5538
12399e538M268L803J629L11j948k683K328J394j285K174J462l202j296J77J864
$$ -5538 -1270 2533 4162 4473 2525 -158 2170 3564 2279 4453 5915 2713 1417 1594 3458
12384C458K644P13L012J512j155q8j312k386n3L816K823O058L899J021j549o087
$$ 3458 6102 6815 9827 11339 10184 10096 8784 6398 6345 10161 12984 19042 22941 23962 22413 16326
12368A6326p350L724K801m77K36k482j501k859l581K96q4k437m71M356K747M043
$$ 16326 8976 12700 15501 15024 15260 12778 11277 8418 4837 5133 5049 2612 2141 6497 9244 13287
12352A3287K361P8l371n660n068j682k247K721N340P442k826n704N56p90J513
$$ 13287 15648 15726 12355 6695 1627 -55 -2302 419 5759 13201 10375 4671 5227 4437 5950
12337E950J402J1K327K657J252M276P222L596j387L561L908K049N429J303K421
$$ 5950 7352 7363 9690 12347 13599 17875 25097 28693 27306 30867 34775 36824 42253 43556 45977
12322D5977j118j679k88j803j539K17k185Q544K3822K9730K6636L5447N8035R8713
$$ 45977 44859 43180 42892 41089 39550 39767 37582 46126 69948 99678 126314 161761 219796 318509
12308C18509J82423L35823N09558L51398k44331n42098l72311j92869j06516o2420
$$ 318509 500932 836755 1346313 1697711 1453380 911282 538971 346102 239586 177166
12298A77166l9848k7972j6657j5026j1417j0384p458r120n744l030l225m098o026
$$ 177166 137318 109346 92689 77663 66246 55862 48404 39284 33540 30510 27285 23187 17161
12285A7161j498j823J96k241m75o44k595J467p91Q49j769j08p84j712k333o09
$$ 17161 15663 13840 14036 11795 11320 10676 8081 9548 8757 9606 7837 7729 6945 5233 2900 2291
12269B291R70J928L44L77o21J058J312L512L3k871k827j908m22q62K193L777P23
$$ 2291 3261 5189 5533 5910 5289 6347 7659 11171 11204 8333 5506 3598 3176 2314 4507 8284 9007
12252I007k866k041M55j64l294j794k894p51L658J887J586j908l555m555p0M249
$$ 9007 6141 4100 4555 4391 1097 -697 -3591 -4342 -684 1203 2789 881 -2674 -7229 -7299 -3050
12236c050N732j963j670R62j446n89j844l206J548O066K668k188j563k348l713
$$ -3050 2682 719 -951 11 -1435 -2024 -3868 -7074 -5526 540 3208 1020 -543 -2891 -6604
12221f604N49N358J803j661L30k163l132j243J346K290R46o33O254J437N7j525
$$ -6604 -6055 -697 1106 -555 -225 -2388 -5520 -6763 -5417 -3127 -2181 -2814 3440 4877 4934 3409
12205C409o25n04k199m53l430n16r7j338l61K188J450K313J837K134k474r02m609
$$ 3409 2784 2280 81 -372 -3802 -4318 -4415 -5753 -6114 -3926 -2476 -163 1674 3808 1334 432 -4177
12188d177l633J566O84J358K677K143j657j512j620K105K426k255o89k016Q24
$$ -4177 -7810 -6244 -5560 -4202 -1525 618 -1039 -2551 -4171 -2066 360 -1895 -2584 -4600 -3776
12173c776K077M414K325K882R69p74k495j713j685N47J42M026K404k081l311l508
$$ -3776 -1699 2715 5040 7922 8891 8117 5622 3909 2224 2771 2913 6939 9343 7262 3951 443
12157D43l132M146K749K118L760K15o545k994l70K339J691J785K000m996p627
$$ 443 -2689 1457 4206 6324 10084 10299 3754 760 390 2729 4420 6205 8205 3209 -4418
12142d418J059M698K067K940k233J309k32L116K095M004N125J3067K1646J5396
$$ -4418 -3359 1339 3406 6346 4113 5422 5190 8306 10401 14405 19530 32597 54243 69639
12128F9639r584k3672j6861j0347n084j583j211L75n45K933o52M34Q66j987l0
$$ 69639 60055 36383 19522 9175 4091 2508 1297 1672 1127 4060 3408 3842 4708 2721 2691
12113B691j372j506J074N00j488J44L575j570l800m11K759L642L377K02l220o743
$$ 2691 1319 -187 887 1387 -101 43 3618 2048 -1752 -2163 596 4238 7615 7817 4597 -2146
12097b146j205R41L617J647j062j485p52j478k038l01L54j676j72j406J074j736
$$ -2146 -3351 -2410 1207 2854 1792 307 -445 -1923 -3961 -4262 -3908 -5584 -5756 -7162 -6088 -7824
12081g824J216k24k08K144L328O830L028l675m724k461K263K338J372J504O11
$$ -7824 -6608 -6832 -7040 -4896 -1568 5262 8290 4615 -109 -2570 -307 2031 3403 4907 5518
12066E518o31k628p70K256q6J775k076j0L605Q46j793j446j833N887K914j136
$$ 5518 4887 2259 1489 3745 3659 5434 3358 3348 6953 7799 6006 4560 2727 8614 11528 10392
12050A0392k107j347j407j218k669l084o29J249j130j728O58J586p04k280j08
$$ 10392 8285 6938 5531 4313 1644 -1440 -2069 -820 -1950 -3678 -3020 -1434 -2138 -4418 -4526
12035d526Q74K56m01M187M443K564k349p68O10l26k408j895n52L156K156M12j038
$$ -4526 -3652 -3396 -3797 390 4833 7397 5048 4280 4890 4564 2156 261 -291 2865 5021 5433 4395
12018D395p76k383k312q11k100P94J845L030j157j109j188K430K705L554Q258
$$ 4395 3619 1236 -1076 -1887 -3987 -3193 -1348 1682 525 -584 -1772 658 3363 6917 15175
12003A5175r77p552m581L2l5o31j71M497K980L31l068m439K155N69k241r7M313
$$ 15175 14198 6646 2065 2097 2062 1431 1260 5757 8737 9068 6000 1561 3716 4285 2044 1947 6260
11986F260J396k491O91J988K985L22p03j342n06l013l589p38L279K004J55k789
$$ 6260 7656 5165 5856 7844 10829 11151 10448 9106 8600 5587 1998 1260 4539 6543 6698 3909
11970C909l497j666K619j141k939N03R23K648K543j167j905p64K571L925k207
$$ 3909 412 -1254 1365 224 -2715 -2212 -1289 1359 3902 2735 830 66 2637 6562 4355
11955D355k299j876j886j73K451r85j145K333L447l146L8J237k050J537N958j45
$$ 4355 2056 180 -1706 -1879 572 -413 -1558 775 4222 1076 1114 2351 301 1838 7796 7651
11939G651k077r33j767j893N16K225j988k42j096j465J320J08l4j686q0K432l575
$$ 7651 5574 4641 2874 981 1497 3722 1734 1492 396 -1069 251 359 325 -1361 -1441 991 -2584
11922b584l654M88m59M73J154J733n5k258q53L975O084R73k658k795K449J045
$$ -2584 -6238 -5750 -6209 -5736 -4582 -2849 -2904 -5162 -6015 -2040 4044 5017 2359 -436 2013 3058
11906C058l94j363k432j264J319K462L30J477J798N34k598j979k041N074M3j964
$$ 3058 2664 1301 -1131 -2395 -1076 1386 1716 3193 4991 5525 2927 948 -1093 3981 4024 2060
11890B060l056k929K172K769m07p73k129N057L022j123j00o51k215k130m78l860
$$ 2060 -996 -3925 -1753 1016 609 -164 -2293 2764 5786 4663 4563 3912 1697 -433 -911 -4771
11874d771o39L854O087L303j710k693J858k27K258J90j834j790j201J83n39N37
$$ -4771 -5410 -1556 4531 7834 6124 3431 5289 5062 7320 7510 5676 3886 2685 2868 2329 2866
11858B866j639j903J006Q71j165K710K302J048k793k983j681P50k123j995K30
$$ 2866 1227 -676 330 1201 36 2746 5048 6096 3303 320 -1361 -611 -2734 -4729 -4499
11843d499P91J848N69M433L563l675j636j067O6O12K263j23l120q98j199k170
$$ -4499 -3708 -1860 -1291 3142 6705 3030 1394 327 393 1005 3268 3145 25 -873 -2072 -4242
11827d242N450J574k903l563J025R18K617p21k725J795K629K396K885J429j258
$$ -4242 1208 2782 -121 -3684 -2659 -1741 876 155 -2570 -775 1854 4250 7135 8564 7306
11812G306k125k187Q31J93J860K16R09N92R08O81k190J215m02k793m72J596K44
$$ 7306 5181 2994 3825 4018 5878 6094 7003 7595 8503 9184 6994 8209 7807 5014 4542 6138 6382
11795F382k051k676J952J421j964k432j59k226p3j883k120J643M9L830M211K840
$$ 6382 4331 1655 3607 5028 3064 632 473 -1753 -1826 -3709 -5829 -4186 -4137 -307 3904 6744
11779F744k046l429k180J083L449J527j258J368n07n07N45j879k751k6K855K787
$$ 6744 4698 1269 -911 172 3621 5148 3890 5258 4751 4244 4789 2910 159 133 2988 5775
11763E775P40p62K12K61m15P97R83n208P77J6K94k570J200j635j92L081q25k7
$$ 5775 6515 5753 5965 6226 5811 6608 7591 2383 3160 3176 3470 900 2100 465 273 3354 2529 2502
11745B502l4J46j190k955K259k376p27L411M650L9k636j228N8J431J74ol499k578
$$ 2502 2468 2614 1424 -1531 728 -1648 -2375 1036 5686 5725 3089 1861 1919 3350 3524 3518 19 -2559
11727b559L653J586p18j947J454k64M61l49K7L38J833J699n032K378L082j526
$$ -2559 1094 2680 1962 15 1469 1205 1666 1317 1344 1682 3515 5214 182 2560 5642 4116
11711D116j098O82l266m256J514J956P92J548K81J00R51K047Q11K479j219k268
$$ 4116 3018 3700 434 -3822 -2308 -352 440 1988 2269 2369 3320 5367 6178 8657 7438 5170
11695E170o46J927o37j21O8j324j009L985K980K73k175l278Q11J01k619k13m62
$$ 5170 4524 6451 5814 5693 5761 4437 3428 7413 10393 10666 8491 5213 6024 6125 3506 3293 2831
11678B831j172J240k006j85L170L790m82K369l345q34K376k311k119k608J910
$$ 2831 1659 2899 893 708 3878 7668 7186 9555 6210 5376 7752 5441 3322 714 2624
11663B624j759m225K316K051k987K00J302p07K723K711J499k360r46N75J009J144
$$ 2624 865 -3360 -1044 1007 -1980 -1780 -478 -1185 1538 4249 5748 3388 2442 3017 4026 5170
11647E170j642j048j20j446k116O08R08m765l37J500K097K826J214L60k59J27
$$ 5170 3528 2480 2360 914 -1202 -594 314 -4451 -4788 -3288 -1191 1635 2849 3209 2950 3077
11631C077K211M095k698l608o84J52n55j761L740O599p8m453J03J876l891k539
$$ 3077 5288 9383 6685 3077 2393 2545 1990 229 3969 10568 10490 6037 6140 8016 4125 1586
11615A586K743K458N16M76m32k790K108l065j745J131K914J17r82K588J541J415
$$ 1586 4329 6787 7303 7779 7347 4557 6665 3600 1855 2986 5900 6017 5035 7623 9164 10579
11599A0579k19k742m795J5R24J074J152K438j298P57M7k942k645J75o77J698J075
$$ 10579 10360 7618 2823 2838 3762 4836 5988 8426 7128 7885 7932 4990 2345 2520 1843 3541 4616
11582D616K005O55n582k61L922R25r42R12J270p43j790j164K443P32k47j589k707
$$ 4616 6621 7276 1694 1433 5355 6280 5338 6250 7520 6777 4987 3823 6266 6998 6751 5162 2455
11565B455K596P51K376J070n309n248J924M457M084N485J048O8j301m510j432
$$ 2455 5051 5802 8178 9248 3939 -1309 615 5072 9156 14641 15689 15757 14456 9946 8514
11550H514K03M5j853j590r40m70K02J782m10k829k841L167M115p80o069l692o76
$$ 8514 8717 8762 6909 5319 4379 3909 4111 5893 5483 2654 -187 2980 7095 6315 246 -3446 -4122
11533d122J402K174P47K011K728J215k231m85M49J447J674j69K59n35n25N87J176
$$ -4122 -2720 -546 201 2212 4940 6155 3924 3439 3888 5335 7009 6840 7099 6564 6039 6626 7802
11516G802k072k178j503K012K18p97N33j636l82O70j491K971J224J095J648O63
$$ 7802 5730 3552 2049 4061 4279 3482 4015 2379 1997 2667 1176 4147 5371 6466 8114 8777
11500H777q90j242k60n14j592k113k259O59K626L97r50K339j63J010l483k598
$$ 8777 7887 6645 6385 5871 4279 2166 -93 566 3192 3589 2639 4978 4815 5825 2342 -256
11484b56K588M532K917K25l848l071R78L946m525l083K561J376j201Q85J269J015
$$ -256 2332 6864 9781 10006 6158 3087 4065 8011 3486 403 2964 4340 3139 4024 5293 6308
11468F308j960K428j059k262K707N034k197k42J785L366j019l080l034k49P63
$$ 6308 4348 6776 5717 3455 6162 11196 8999 8757 10542 13908 12889 9809 6775 6526 7289
11453G289j893k905n64L366K394K236K853k718j638j250L3R11j754k187P0p60
$$ 7289 5396 2491 1927 5293 7687 9923 12776 10058 8420 7170 7203 8114 6360 4173 4243 3483
11437C483J51K800L592K342j723R75K556l943l718j079O64o02R14K721K230L44
$$ 3483 3634 6434 10026 12368 10645 11620 14176 10233 6515 5436 6100 5498 6412 9133 11363 11707
11421A1707j320j144j213M87k30m914P32j653k88J229M10J565O85j506J331J524
$$ 11707 10387 9243 8030 8517 8287 3373 4105 2452 2164 3393 3803 5368 6053 4547 5878 7402
11405G402Q18p98r54k15J03N707J856j800j736j599j344J311j484p25j926K199
$$ 7402 8220 7422 6468 6253 6356 12063 13919 12119 10383 8784 7440 8751 7267 6542 4616 6815
11389F815K636P94K483J293q99K015k903l747L0J710j305k21p46o23k82j186m049
$$ 6815 9451 10245 12728 14021 13122 15137 12234 8487 8517 10227 8922 8701 7955 7332 7050 5864 1815
11372A815J360K366M412K90k869p95J863J4J53j999k021J606K604j759k380K036
$$ 1815 3175 5541 9953 10243 7374 6579 8442 8456 8609 6610 4589 6195 8799 7040 4660 6696
11356F696M377J562j409P96P6l366Q13M435K599k620q48l184l580j070j005p55
$$ 6696 11073 12635 11226 12022 12098 8732 9545 13980 16579 13959 13111 9927 6347 5277 4272 3517
11340C517Q56K366j570l53K376J509k647j192N131L954O5k975k30M19M050M49
$$ 3517 4373 6739 5169 4816 7192 8701 6054 4862 9993 13947 14012 11037 10807 11226 15276 15725
11324A5725k29j722n837k059K417J330M54l02J639j674K383J134R75j007N50M76
$$ 15725 15496 13774 7937 5878 8295 9625 10079 9777 11416 9742 12125 13259 14234 13227 13777 14253
11308A4253m218l629m763O66N922L70K04n44j787J527M291K64l850l60J740P4
$$ 14253 10035 6406 1643 2309 8231 8601 8805 8261 6474 8001 12292 12556 8706 8346 10086 10160
11292A0160j240J177L56O88K007k000j151M837K568J672m167j543Q44Q28J117
$$ 10160 8920 10097 10453 11141 13148 11148 9997 14834 17402 19074 14907 13364 14208 15036 16153
11277A6153k200j191k080j699J795m34L044O71J797r5k079J9J262R89J271J143
$$ 16153 13953 12762 10682 8983 10778 10344 13388 14059 15856 15761 13682 13701 14963 15952 17223 18366
11261A8366j245q22n04l694j102K951K935l190j580l491M094L469J00J756k476
$$ 18366 17121 16299 15795 12101 10999 13950 16885 13695 12115 8624 12718 16187 16287 18043 15567
11246A5567J108K028p76J859K42j587j469M492m1l119j009j193k56J4J298k106
$$ 15567 16675 18703 17927 19786 20028 18441 16972 21464 21423 18304 17295 16102 15846 15860 17158 15052
11230A5052q21J97J778K905k283k889o91N23l8P66K275l4Q6K361M575P127K475
$$ 15052 14231 14428 16206 19111 16828 13939 13248 13771 13733 14499 16774 16740 16826 19187 23762 30889 33364
11213C3364l596m717l234k104j60K91j698J145j915r06K371m784J251N787p39
$$ 33364 29768 25051 21817 19713 19553 19844 18146 19291 17376 16470 18841 14057 15308 21095 20356
11198B0356l750r15N06L537J493K462K179r32l641k060n560m449j816O26P6l051
$$ 20356 16606 15691 16197 19734 21227 23689 25868 24936 21295 19235 13675 9226 7410 8036 8112 5061
11182E061j932K251N935M605K555L132O92j246L536J038j373K349P82J82J125
$$ 5061 3129 5380 11315 15920 18475 21607 22299 21053 24589 25627 24254 26603 27385 27567 28692
11167B8692j432N14j441K41L188j714n30L72M504N516N125K195P20M644N602L487
$$ 28692 27260 27774 26333 26574 29762 28048 27518 27890 32394 37910 43035 45230 45950 50594 56196 59683
11151E9683M503O238J0990J1917K2933L2049N6136Q5770J02164J05704J09584
$$ 59683 64186 70424 81414 93331 116264 148313 204449 290219 392383 498087 607671
11140F07671J02202Q1579M3471L272l5890o6465r0091j01653j07200r6650q4734
$$ 607671 709873 791452 834923 838195 802305 735840 645749 544096 436896 340246 255512
11129B55512p1171m2504k8187j9622j1744o008k599l635m833o601k619o807n153
$$ 255512 184341 141837 113650 94028 82284 76276 73677 70042 65209 58608 55989 49182 44029
11116D4029l087n574l752K33j166j122j336N15J01q76K32k322l919k627l07K94
$$ 44029 40942 35368 31616 31849 30683 29561 28225 28740 28841 27965 28197 25875 21956 19329 19022 19316
11100A9316N72J080n88J160J964l757P42j27j350J842J876J168m24p2J742q88
$$ 19316 19888 20968 20380 21540 23504 19747 20489 20362 19012 20854 22730 23898 23474 23402 25144 24256
11084B4256j880k51Q20K070K253Q29j191q47l29q80l28n75J430N48L496J693J106
$$ 24256 22376 22125 22945 25015 27268 28097 26906 26059 25730 24850 24522 23947 25377 25925 29421 31114 32220
11067C2220J576j79j788q01k717j281J262M608L906K314l780P38N50J064M200
$$ 32220 33796 33617 31829 31028 28311 27030 28292 32900 36806 39120 35340 36078 36628 37692 41892
11052D1892J526k392j366l284m924j603R97m571n502l762l897q332p039l100m474
$$ 41892 43418 41026 39660 36376 31452 29849 30846 26275 20773 17011 13114 4782 -2257 -5357 -9831
11037i831q06L273J814L538K441K267L033J290m08K026K685l36P05L505N357L956
$$ -9831 -10637 -7364 -5550 -2012 429 2696 5729 7019 6611 8637 11322 10986 11691 15196 20553 24509
11021B4509N08O84N01L686R04L11k27J764r49m462O97k089r62J283q72nj92j013
$$ 24509 25017 25701 26202 29888 30792 31103 30876 32640 31691 27229 27926 25837 24875 26158 25286 25281 25089 24076
11003B4076K137l15L57O075O44P990P263N462R335J3683J2423J2756J0845P404
$$ 24076 26213 25898 26255 32330 32974 40964 48227 53689 63024 76707 89130 101886 112731 120135
10989A20135L344J851K749o07m536j0373j2188j1915j2322j0540j0182k159l522
$$ 120135 123479 125330 128079 127472 122936 112563 100375 88460 76138 65598 55416 53257 49735
10976D9735k28Rj329M066M227k961m688k382k512j987M966L862N558J47j206J89
$$ 49735 49507 49516 48187 52253 56480 53519 48831 46449 43937 41950 46916 50778 56336 56483 55277 55466
10960E5466L859J83k314O94J791j493j114J425m481o383n66j060k059K730L81
$$ 55466 59325 59508 57194 57888 59679 58186 57072 58497 54016 47633 47067 46007 43948 46678 47059
10945D7059J88j910J090J977K873L490N667O635L780L219O003K574R66k679k372
$$ 47059 47247 45337 46427 48404 51277 54767 60434 67069 70849 74068 80071 82645 83611 80932 78560
10930G8560K143L612L293J739l043j941L601L332K761J474n06L603N121m731j2579
$$ 78560 80703 84315 87608 89347 86304 84363 87964 91296 94057 95531 95025 98628 103749 99018 86439
10915H6439o801m479m145l900j210J488k417l431k04J954j850k524j252J576q58
$$ 86439 79638 75159 71014 67114 65904 67392 64975 61544 61340 63294 61444 58920 57668 59244 58386
10900E8386O388L907l207m208J874J837k776j072j817l962n457o754o123K217
$$ 58386 64774 68681 65474 61266 63140 64977 62201 61129 59312 55350 49893 43139 37016 39233
10886C9233J137l84J811K739j464J301N070Q192Q519P141K804j858O65r74j767
$$ 39233 40370 39986 41797 44536 43072 44373 49443 57635 66154 73295 76099 74241 74906 73932 72165
10871G2165j861l990l047J628P585J1935J8347K3354K9135L2703L2124K4456J8195
$$ 72165 70304 66314 63267 64895 72480 84415 102762 126116 155251 187954 220078 244534 262729
10858B62729P112K089p786q381j1191j3602o054o861j2802o656k815q846q276
$$ 262729 269841 271930 264144 255763 244572 230970 224916 218055 205253 198597 195782 186936 178660
10845A78660o419m225m447n939o286l118k22l675n4J416L675O427N689R165N649
$$ 178660 172241 168016 163569 157630 151344 148226 148004 144329 144275 145691 149366 155793 161482 170647 176296
10830A76296J0325R421M964P795Q130J4764J7107J4707J4289J7856K0981L0881
$$ 176296 186621 196042 201006 208801 216931 231695 248802 263509 277798 295654 316635 347516
10818C47516M0939N7547R6861J41416J85296K13048K28256K24744K01935J63953
$$ 347516 388455 446002 542863 684279 869575 1082623 1310879 1535623 1737558 1901511
10808A901511R3581Q39q7870j51507j88072k08959k16530j94697j72470j30174
$$ 1901511 1995092 1995931 1908061 1756554 1568482 1359523 1142993 948296 775826 645652
10798F45652q3683m7912k3311j2710k997K170O934R806J2084R495J1571J2617
$$ 645652 561969 514057 490746 478036 475039 477209 484143 493949 506033 515528 527099 539716
10786E39716P413Q347J1905J3098J3297J1168J2632J6487J9027K6376L1546L1642
$$ 539716 547129 555476 567381 580479 593776 604944 617576 634063 653090 679466 711012 742654
10774G42654L8990M0820M6202N3813N6338O3588P7763Q8550R7125J12333J28886
$$ 742654 781644 822464 868666 922479 978817 1042405 1120168 1208718 1305843 1418176 1547062
10763A547062J46722J76797K24546K79988L33735L86419M31147M66495M97712
$$ 1547062 1693784 1870581 2095127 2375115 2708850 3095269 3526416 3992911 4490623
10754D490623N23084N44163N63405O04225O82542Q25046J058622J431822K051023
$$ 4490623 5013707 5557870 6121275 6725500 7408042 8233088 9291710 10723532 12774555
10745A2774555L125402M967172Q045948J2490486J6556467J8594007J9528427
$$ 12774555 15899957 20867129 28913077 41403563 57960030 76554037 96082464
10738I6082464J8572453J6097389J1946699N889163j238196q038369j2929454
$$ 96082464 114654917 130752306 142699005 148588168 147349972 139311603 126382149
10731A26382149j6304604j8198247j8601791j7016195j5444131j1769224p480351
$$ 126382149 110077545 91879298 73277507 56261312 40817181 29047957 21567606
10724B1567606m686985l089877k141081j558240j179884r30235p71979o73371
$$ 21567606 16880621 13790744 11649663 10091423 8911539 7981304 7209325 6535954
10716F535954o13433n82431n55665n28973m95734m54441m13365l61849l02965
$$ 6535954 5922521 5340090 4784425 4255452 3759718 3305277 2891912 2530063 2227098
10707B227098k51997k03928j60446j30389j10567r6629q2410p0772o2920n7862
$$ 2227098 1975101 1771173 1610727 1480338 1369771 1273142 1190732 1119960 1057040 999178
10697I99178n4548n3589m9074m6111m5277m0637m3273m3295l9006l6908l1076
$$ 999178 944630 891041 841967 795856 750579 709942 666669 623374 584368 547460 516384
10686E16384l1673k9342k8501k1156k0419j9032j4055q152o998q852m879m277
$$ 516384 484711 455369 426868 405712 385293 366261 352206 344054 337056 328204 323325 319048
10674C19048r373r928q064q865j0460r688q367q598p795j1256p677p636p732n166
$$ 319048 309675 299747 291683 282818 272358 262670 254303 245705 237910 226654 218977 211341 203609 198443
10660A98443n334q337j1041q294q406o505l070p443l601l334j02j261J415K766
$$ 198443 193109 184772 173731 165437 157031 150526 147456 140013 136412 133078 132976 131715 133130 135896
10646A35896o69j280P77K419K623o97k446k934j733j971q2j020l866o846j894
$$ 135896 135227 133947 134724 137143 139766 139069 136623 133689 131956 129985 129903 128883 125017 118171 116277
10631A16277k174m618o618n757n529n561m005k823M92l087r798r310n712o100
$$ 116277 114103 109485 102867 97110 91581 86020 82015 79192 79684 76597 66799 57489 51777 45677
10617D5677p047q076l693J558K524M328R619J7255J9354J8751J9320J7784P840
$$ 45677 38630 30554 26861 28419 30943 35271 44890 62145 81499 100250 119570 137354 145194
10604A45194J989m5p229j0461j1561j2939j1115p985k938J372M10r26k926j291
$$ 145194 147183 147138 139909 129448 117887 104948 93833 85848 82910 84282 84692 83766 80840 79549
10590G9549Q30K711K292P44R61k669l291J312N46o900p771m865l382j183q89j425
$$ 79549 80379 83090 85382 86126 87087 84418 81127 82439 82985 76085 68314 63449 60067 58884 57995 56570
10574E6570m472k742N26J701P27k458m655k101k417k473K285L33k951j091k773
$$ 56570 52098 49356 49882 51583 52310 49852 45197 43096 40679 38206 40491 40824 37873 36782 34009
10559C4009j086m17r88m782k408k848n889o580m529q525j149k70J097J938K841
$$ 34009 32923 32506 31518 26736 24328 21480 15591 9011 4482 -4043 -5192 -5462 -4365 -2427 414
10544D14K986L334k35m32k212k376K684K862j891j217M391M111K298K246N508
$$ 414 3400 6734 6499 6067 3855 1479 4163 7025 5134 3917 8308 12419 14717 16963 22471
10529B2471J756O21j463J555L842m80j321J231n65R49k700m291p064r24j870l219
$$ 22471 24227 24848 23385 24940 28782 28302 26981 28212 27647 28596 25896 21605 14541 13617 11747 8528
10513H528j406R77m022M262N367K856J832j451J055N975J255m67L653Q41l198
$$ 8528 7122 8099 4077 8339 13706 16562 18394 16943 17998 23973 25228 24761 28414 29255 26057
10498B6057j460M49j016K264J400J847J873N52O50L171K634N053O389j690j831
$$ 26057 24597 25046 24030 26294 27694 29541 31414 31966 32616 35787 38421 43474 49863 48173 46342
10483D6342o90J762j433k835l53l99l598J676O23m42J883J527l680l133r18J164
$$ 46342 45652 47414 45981 43146 42793 42394 38796 40472 41095 40653 42536 44063 40383 37250 36332 37496
10467C7496k378k910o03J242J304k012J674l726j20K661q11l555m650k454j582
$$ 37496 35118 32208 31605 32847 34151 32139 33813 30087 29967 32628 31817 28262 23612 21158 19576
10452A9576j800Q49M057r65J592J046J229N59M92K672K996M563M695N696K46j507
$$ 19576 17776 18625 22682 21717 23309 24355 25584 26143 26635 29307 32303 36866 41561 47257 47503 45996
10436D5996K741L277j23J777J805L49r65l884n976p700k127J577k206k715K755
$$ 45996 48737 52014 51891 53668 55473 55822 54857 50973 44997 37297 35170 36747 34541 31826 34581
10421C4581Q774J1572J3627J4161J5332J3782J9499K5117J5363J983l551K181
$$ 34581 43355 54927 68554 82715 98047 111829 131328 156445 171808 173791 170240 172421
10409A72421l083j7131k2633j7647j2984j8202j7568j2141m093k770n284l425
$$ 172421 169338 152207 129574 111927 98943 80741 63173 51032 46939 44169 38885 35460
10397C5460n523l675J86j83m806l211l881q8J344n57L106k878j819N068o48o992
$$ 35460 29937 26262 26448 26265 21459 18248 14367 14279 15623 15066 18172 15294 13475 18543 17895 10903
10381A0903j116K281K160k01L212j850k002N85J246o8R64J896J447k8J539P7k392
$$ 10903 9787 12068 14228 14027 17239 15389 13387 13972 15218 15150 16114 18010 19457 19429 20968 21045 18653
10364A8653k817j978R20Q22n43L025Q41K676L861O714O066M927R645J5728J3061
$$ 18653 15836 13858 14778 15600 15057 18082 18923 21599 25460 32174 38240 43167 52812 68540 81601
10349H1601P813L041l27j650k783o202k516k710q25J24N772Q306J5920K2765L7743
$$ 81601 89414 92455 92128 90478 87695 81493 78977 76267 75442 75566 81338 89644 105564 128329 166072
10334A66072O0914P9694R9474J08147J06360J01378Q2224M3851K877l7958p3363
$$ 166072 226986 306680 406154 514301 620661 722039 804263 848114 850991 813033 739670
10323G39670r4654j08166j06449r7553q9572o6810m2130k4869j3034j0840r825
$$ 739670 645016 536850 430401 332848 243276 176466 134336 109467 96433 85593 75768
10312G5768o523J78n696q605j1860p260l349k724J399n32n094l464r98J096K364
$$ 75768 69245 69423 63727 55122 43262 36002 32653 29929 31328 30796 25702 22238 21240 22336 24700
10297B4700K457q20J260o01k062J23N481L518k170j878J0L989K252P02J24k503
$$ 24700 27157 26337 27597 26996 24934 25057 30538 34056 31886 30008 30018 34007 36259 36961 37085 34582
10281C4582m361k879l274n297R31J550J67m512J451j283j655o41k269n6J995O01
$$ 34582 30221 27342 24068 18771 19702 21252 21419 16907 18358 17075 15420 14779 12510 12454 14449 15050
10265A5050Qn89l605J867M269N43P8N92L34l198j974K155J221k612j801P43m77
$$ 15050 15058 14469 10864 12731 17000 17543 17621 18213 18547 15349 13375 15530 16751 14139 12338 13081 12604
10248A2604l69R35o79q19j97l207K53J870K63o30j260l023L147L008O8j347O40
$$ 12604 12235 13170 12491 11672 11475 8268 8521 10391 10654 10024 8764 5741 8888 11896 11964 10617 11257
10231A1257L08j07j895k766R88o95k307J131J864L086L726O10j960k449j365J303
$$ 11257 11565 11458 9563 6797 7785 7090 4783 5914 7778 10864 14590 15200 13240 10791 9426 10729
10215A0729J096P29k943m29J291r38Q88O89j185j03m481J692K542j211J772k664
$$ 10729 11825 12554 9611 9182 10473 9535 10423 11112 9927 9824 5343 7035 9577 8366 10138 7474
10199G474j088r49J315n84P17L514j90k242n19K238J047j11L30P38k376K042k60
$$ 7474 6386 5437 6752 6168 6885 10399 10209 7967 7448 9686 10733 10622 10952 11690 9314 11356 11096
10182A1096L253K391l797j219j89J474k760k061Q44K175J209j944r47K234k737
$$ 11096 14349 16740 12943 11724 11535 13009 10249 8188 9032 11207 12416 10472 9525 11759 9022
10167I022j677J141p96j770k513R95J393j792K169J738K863J50j777K354J200
$$ 9022 7345 8486 7690 5920 3407 4402 5795 4003 6172 7910 10773 10923 9146 11500 12700
10152A2700p165k888L469q58J884L434P50k187n493O77M290J485j685j931K953
$$ 12700 5535 2647 6116 5258 7142 10576 11326 9139 3646 4323 8613 10098 8413 6482 9435
10137I435M86j702K796M51J735J168j96l724m005R9L599m817M43p63n41K89K131
$$ 9435 9921 8219 11015 11466 13201 14369 14173 10449 6444 6543 10142 5325 5768 5005 4464 4753 6884
10120F884L036J884J026n274p77L283N15j848j131j159J819j10J028l387k486
$$ 6884 9920 11804 12830 7556 6779 10062 10577 8729 7598 6439 8258 8148 9176 5789 3303
10105C303K066R07K345J416J931q83l163p77P55k517J323L704J184M80m02M51
$$ 3303 5369 6276 8621 10037 11968 11085 7922 7145 7900 5383 6706 10410 11594 12074 11672 12123
10089A2123k119J729J767K300K009k11o19l913l232j254J905J917r03J025P08
$$ 12123 10004 11733 13500 15800 17809 17598 16979 13066 9834 8580 10485 12402 11499 12524 13232
10074A3232P90k46L207L30j614N08r20J317k195k367L74j820j302l14k778K089
$$ 13232 14022 13776 16983 17313 15699 16207 15287 16604 14409 12042 12416 10596 9294 8980 6202 8291
10058H291J127r87p42L881J419M10M37J820j378q91j624L872N566K092J617n238
$$ 8291 9418 8431 7689 11570 12989 13399 13836 15656 14278 13387 11763 15635 21201 23293 24910 19672
10042A9672n041l260m300j332J368J185J023N18o03m890J380K531L461k42j706
$$ 19672 14631 11371 7071 5739 7107 8292 9315 9833 9230 4340 5720 8251 11712 11470 9764
10027I764N425l158j629J060J114O22J200R80j976l688r52n14r63N85J811J190
$$ 9764 15189 12031 10402 11462 12576 13198 14398 15378 13402 9714 8762 8248 7285 7870 9681 10871
10011A0871p50R07J92Q2O61L545L199o57j672j303r85M38j039k24j284k712r29
$$ 10871 10121 11028 11220 11302 11963 15508 18707 18050 16378 15075 14090 14528 13489 13265 11981 9269 8340
9994H340M91m80J484J812j031j497j780k672R62K894O743L30l013K606J859j865
$$ 8340 8831 8351 9835 11647 10616 9119 7339 4667 5629 8523 15266 15596 12583 15189 17048 15183
9978A5183j344j007j12l124n52J493l661k235K27L859L525J925l820o519N11L725
$$ 15183 13839 12832 12720 9596 9044 10537 6876 4641 4868 8727 12252 14177 10357 3838 4349 8074
9962H074J437p98J388J727m120j267K534M818L884j528k070J199o28m173j442
$$ 8074 9511 8713 10101 11828 7708 6441 8975 13793 17677 16149 14079 15278 14650 10477 9035
9947I035p93J035Q364K925l014m540l56o19K534L575j587l218k559j080M70j710
$$ 9035 8242 9277 17641 20566 17552 13012 12656 12037 14571 18146 16559 13341 10782 9702 10172 8462
9931H462J300l378J112K569J47J341q10J798L37R7r95o03P55Q66N33k129l50j88
$$ 8462 9762 6384 7496 10065 10212 11553 10743 12541 12878 12975 11980 11377 12132 12998 13531 11402 11052 10864
9913A0864R29j026J745r23j123J593j805K97J992k531K055L693l738j779P1K470
$$ 10864 11793 10767 12512 11589 10466 12059 10254 10551 12543 10012 12067 15760 12022 10243 10314 12784
9897A2784J915k92l981m794J55K684J300L159J030k816k474N31j705O0M586J165
$$ 12784 14699 14407 10426 5632 5787 8471 9771 12930 13960 11144 8670 9201 7496 7556 12142 13307
9881A3307l448r71N15J955J922j847m166R34N91J486P96J009K771m689j175L291
$$ 13307 9859 8888 9403 11358 13280 11433 7267 8201 8792 10278 11074 12083 14854 10165 8990 12281
9865A2281K630J414k258q25j01o50j81j483K043J887k377j390L050o91k521l013
$$ 12281 14911 16325 14067 13242 13141 12491 12310 10827 12870 14757 12380 10990 14040 13349 10828 7815
9849G815p02J643L963l126o28L936L420K09J499j211k915m709J748O04m27m589
$$ 7815 7113 8756 12719 9593 8965 12901 16321 16530 18029 16818 13903 9194 10942 11546 11119 6530
9833F530j146O6k501J650L68j154j587L242L114P17J357K333k087j470L475j666
$$ 6530 5384 5450 2949 4599 4967 3813 2226 5468 8582 9299 10656 12989 10902 9432 12907 11241
9817A1241j52j414j93K863N04k32j752K023j330J690P10J080j158p13j225k131
$$ 11241 11089 9675 9482 12345 12849 12617 10865 12888 11558 13248 13958 15038 13880 13167 11942 9811
9801I811J104o3r44j696J796K221j634j681o59k328j837K93O153L053K212k047
$$ 9811 10915 10852 9908 8212 10008 12229 10595 8914 8255 5927 4090 4383 10536 13589 15801 13754
9785A3754q43j185N84J56j470k754r89j9l59L811J609j128j834M282K646K624
$$ 13754 12911 11726 12310 12466 10996 8242 7253 7234 6875 10686 12295 11167 9333 13615 16261 18885
9769A8885L264L124k866J147N1k022j787j989r08q68j8J616L554L7l985P48o80
$$ 18885 22149 25273 22407 23554 23605 21583 19796 17807 16899 16031 16013 17629 21183 21220 17235 17983 17303
9752A7303j953q53J979J545j652j314j328o278j622K492K617J88j971m1J227L138
$$ 17303 15350 14497 16476 18021 16369 15055 13727 7449 5827 8319 10936 11124 9153 9112 10339 13477
9736A3477j51J173M68k873m27K499N62k799m59l37q8r40L314J542l187k514r90
$$ 13477 13326 14499 14967 12094 11667 14166 14728 11929 11470 11133 11045 10105 13419 14961 11774 9260 8270
9719H270j41l504R76J778L239K616k840K97L254j734l111j322L906L489K92m62
$$ 8270 8129 4625 5601 7379 10618 13234 10394 10691 13945 12211 9100 7778 11684 15173 15465 15003
9703A5003K45j865k383L106M437M27r30k485j15R19k693k631o55J147Q90R18j489
$$ 15003 15248 13383 11000 14106 18543 18970 18040 15555 15440 16359 13666 11035 10380 11527 12417 13335 11846
9686A1846n21K022j155L26J370K210l433l755L017K077J678J311l38n1k374k677
$$ 11846 11325 13347 12192 12518 13888 16098 12665 8910 11927 14004 15682 16993 16655 16604 14230 11553
9670A1553n6j703m3J388J282n71r23l66L56p49o31k710R53K306M528J692J637
$$ 11553 11497 9794 9751 11139 12421 11850 10927 10561 10917 10168 9537 6827 7780 10086 14614 16306 17943
9653A7943K231j781m660k726J686P24j846j200Q45j736l22P32L520L902J886j620
$$ 17943 20174 18393 13733 11007 12693 13417 11571 10371 11216 9480 9158 9890 13410 17312 19198 17578
9637A7578k877j067j401j19k184L594L090M59l156j498r9K717L646k96J268j065
$$ 17578 14701 13634 12233 12114 9930 13524 16614 17073 13917 12419 12320 15037 18683 18387 19655 18590
9621A8590k774J408p13o201K849L257K71k307J73k67J066J756k946m185J740L381
$$ 18590 15816 17224 16511 10310 13159 16416 16687 14380 14553 14286 15352 17108 14162 9977 11717 15098
9605A5098%m82j394j824N09K720J118K293j306m319k487K66L367L13K979L329
$$ 15098 15098 14616 13222 11398 11907 14627 15745 18038 16732 12413 9926 10192 13559 13872 16851 20180
9589B0180j266J916o09l958l915j582k492k249j04K671O130q6k910j573O12j120
$$ 20180 18914 20830 20221 16263 12348 10766 8274 6025 5921 8592 14722 14636 11726 10153 10765 9645
9573I645j357R58J616Q7J431K16K93m23j259j538r5L423O26j562R94O65k729k598
$$ 9645 8288 9246 10862 10949 12380 12596 12889 12466 11207 9669 9574 12997 13623 12061 13055 13720 10991 8393
9555H393L009L102P5k455j503J806K741R3n47j363j74o28j850N89R76P02l738
$$ 8393 11402 14504 14579 12124 10621 12427 15168 15261 14714 13351 13177 12549 10699 11288 12264 12966 9228
9538I228j737R95o55K903r03r61o1L027K406m468J82K814K180m83o477q00K295
$$ 9228 7491 8486 7831 10734 9831 8870 8809 11836 14242 9774 9956 12770 14950 14467 7990 7190 9485
9521I485L326J516k112p111l28J468J559K562k108k598n89K547j133K319J785
$$ 9485 12811 14327 12215 5104 4776 6244 7803 10365 8257 5659 5070 7617 6484 8803 10588
9506A0588r90j744L031N1J203L292J399K276l830n43L48j255l036J038J393j667
$$ 10588 9598 7854 10885 10936 12139 15431 16830 19106 15276 14733 15081 13826 10790 11828 13221 11554
9490A1554l522q13l75K773K248K544j113l043j178j779M564M534J89j929j655
$$ 11554 8032 7219 6844 9617 11865 14409 13296 10253 9075 7296 11860 16394 16583 14654 12999
9475A2999l019j728M576J476m69O55j308o34q01J589j632j08n14Q02n80R40l4
$$ 12999 9980 8252 12828 14304 13835 14490 13182 12548 11747 13336 11704 11596 11082 11884 11304 12244 12210
9458A2210k58O08j317O66J487K6n428M485L84j151J363J533j55J265J04j190P96
$$ 12210 11952 12560 11243 11909 13396 13422 7994 12479 12863 11712 13075 14608 14453 15718 15822 14632 15428
9441A5428J366k408l655Q41l02K069k872k485J459M462j060l538M753K761k272
$$ 15428 16794 14386 10731 11572 11270 13339 10467 7982 9441 13903 12843 9305 14058 16819 14547
9426A4547j637l749j946J643L732J925j418L983k299k367j902o68K485l357j100
$$ 14547 12910 9161 7215 8858 12590 14515 13097 17080 14781 12414 10512 9844 12329 8972 7872
9411G872l06j575K135Q24j167n43q06P61J709o12k061o52J544K679J704j043K208
$$ 7872 7566 5991 8126 8950 7783 7240 6434 7195 8904 8292 6231 5579 7123 9802 11506 10463 12671
9394A2671L01j225M59j689l371j592K669O54M22O94R91K094k135j817l518M76
$$ 12671 12972 11747 12206 10517 7146 5554 8223 8877 9299 9993 10984 13078 10943 9126 5608 6084
9378F084J909K784k35K88J872o14M99k731j686J76l38J758J293j539N87L567O99
$$ 6084 7993 10777 10542 10830 12702 12088 12587 9856 8170 8346 8008 9766 11059 9520 10107 13674 14373
9361A4373k298k740j985R36j271J070M682R52q83l577j854J951P27o40M00J690
$$ 14373 12075 9335 7350 8286 7015 8085 12767 13719 12836 9259 7405 9356 10083 9443 9843 11533
9345A1533O05J931j58n336l894K503M289K025j709o87M469L477j285j862j872
$$ 11533 12138 14069 13911 8575 4681 7184 11473 13498 11789 11102 15571 19048 17763 15901 14029
9330A4029J726k706l427l70L336J053K15l216N81J602k777m37m99J397R02J772
$$ 14029 15755 13049 9622 9252 12588 13641 13856 10640 11221 12823 10046 9609 9110 10507 11409 13181
9314A3181m47k304k751r73J611m73j079j007j602l80L782P89J143M44J810r25
$$ 13181 12734 10430 7679 6706 8317 7844 6765 5758 4156 3776 7558 8347 9490 9934 11744 10819
9298A0819M3r88R45J491j720j274k072j755K894K556k106l50j336l147L9M388
$$ 10819 10862 9874 10819 12310 10590 9316 7244 5489 8383 10939 8833 8483 7147 4000 4039 8427
9282H427P42k122k775J927K019K904J378J700j636j233J991R72J84k352P11N92
$$ 8427 9169 7047 4272 6199 8218 11122 12500 14200 12564 11331 13322 14294 14478 12126 12837 13429
9266A3429J256m443j659m04J326m789K487K351l74k344J094k410k94J192L391
$$ 13429 14685 10242 8583 8179 9505 4716 7203 9554 9180 6836 7930 5520 5226 6418 9809
9251I809l952K870j359j270j853J292Q18K70K977K261J813j153k305j403k469
$$ 9809 5857 8727 7368 6098 4245 5537 6355 6625 9602 11863 13676 12523 10218 8815 6346
9236F346j619N6M128K673O66j337k723K44K530O55J484M00K594l94k285j151j969
$$ 6346 4727 4783 8911 11584 12250 10913 8190 8434 10964 11619 13103 13503 16097 15703 13418 12267 10298
9219A0298p34j094m66o15K017k164m99J435k86K981j358l273P20K099k052N48
$$ 10298 9564 8470 8004 7389 9406 7242 6743 8178 7892 10873 9515 6242 6962 9061 7009 7557
9203G557K664J516j181j745k113N98J639J311n12l03q37p276j61K984L150l129
$$ 7557 10221 11737 10556 8811 6698 7296 8935 10246 9734 9431 8594 1318 1157 4141 7291 4162
9187D162O13J268N0Q28J347k527j158J449k47l107O65q35M927K526l703m335K405
$$ 4162 4775 6043 6093 6921 8268 5741 4583 6032 5785 2678 3343 2508 7435 9961 6258 1923 4328
9170D328J834o4r45K062K542k148k797l149L090M052k242J528R49j345j325m400
$$ 4328 6162 6098 5153 7215 9757 7609 4812 1663 4753 8805 6563 8091 9040 7695 6370 1970
9154A970K377J44j696J686K413l296J335K2o32J463L266K007N86q11l2k063j774
$$ 1970 4347 4491 2795 4481 6894 3598 4933 4955 4323 5786 9052 11059 11645 10834 10802 8739 6965
9137F965J291Q02J278J468j024n69K366M40j970O72l503J878L694j050j878n49
$$ 6965 8256 9058 10336 11804 10780 10211 12577 13017 11047 11719 8216 10094 13788 12738 10860 10311
9121A0311K348j805k160J598M087k833k634k384j301rL341j338o06l105j130N00
$$ 10311 12659 10854 8694 10292 14379 11546 8912 6528 5227 5218 8559 7221 6615 3510 2380 2880
9105B880L542K77P61l72l290j290p69J913o64J324J287L51j33r70k013q06K4j112
$$ 2880 6422 6699 7460 7088 3798 2508 1739 3652 2988 4312 5599 5950 5817 4847 2834 2028 2052 940
9087I40K546K156L48l32J35l04r65K260R81l619M68j563k794J232l37K575J601
$$ 940 3486 5642 5990 5658 5793 5489 4524 6784 7765 4146 4614 3051 257 1489 1152 3727 5328
9070E328o58K235j87P22J097P99l041l513K475J937j017P02K086R15j53Q55j734
$$ 5328 4670 6905 6718 7440 8537 9336 6295 2782 5257 7194 6177 6879 8965 9880 9727 10582 8848
9053H848j937k237j350J272k159j831J502L330J431L163L65J169n122k766r55
$$ 8848 6911 4674 3324 4596 2437 606 2108 5438 6869 10032 10397 11566 6444 3678 2723
9038B723k771L093K527K589N58n75j440l079J361M263J980j880j252j933r39Q26
$$ 2723 -48 3045 5572 8161 8719 8144 6704 3625 4986 9249 11229 9349 8097 6164 5225 6051
9022F051J774N13R51k583j157p48q63J123k403k987K284N563j634k346n53j463
$$ 6051 7825 8338 9289 6706 5549 4801 3938 5061 2658 -329 1955 7518 5884 3538 2985 1522
9006A522J00n93K235K122j259K446L629K58j654l157j053j833n16m36L925J021
$$ 1522 1622 1029 3264 5386 4127 6573 10202 10460 8806 5649 4596 2763 2247 1811 5736 6757
8990F757k267J315k436k02J871L883M7q41L013k157j095J384k143N00R54n76j462
$$ 6757 4490 5805 3369 3167 5038 8921 8968 8127 11140 8983 7888 9272 7129 7629 8583 8007 6545
8973F545O31k509l013K273m49J601K541J009j919k634l78J33l947J811K750L91
$$ 6545 7176 4667 1654 3927 3478 5079 7620 8629 6710 4076 3698 3831 -116 1695 4445 4836
8957D836J929p03k195J079L221o66j988j839N68QL15k125J039K522k464j321p63
$$ 4836 6765 6062 3867 4946 8167 7501 5513 3674 4242 4250 4565 2440 3479 6001 3537 2216 1453
8940A453m32M575LJ395K634l420q18K966l64k289k136k055K512K830K74l80J995
$$ 1453 1021 5596 5599 6994 9628 6208 5390 8356 7992 5703 3567 1512 4024 6854 7128 6748 8743
8923H743q24O25m64n07k314j842J243M79r09k767L590k151m882L681L795J084
$$ 8743 7919 8544 8080 7573 5259 3417 4660 5139 4230 1463 5053 2902 -1980 1701 5496 6580
8907F580J618q18k139K003J809J101o43m864k1l314l720K800J058n88J659L127
$$ 6580 8198 7380 5241 7244 9053 10154 9511 4647 4626 1312 -2408 392 1450 862 2521 5648
8891E648j649P32j210J915O61p8j93L55k1q94k88O41O76j47J291M846M735O502
$$ 5648 3999 4731 3521 5436 6097 6019 5826 6181 6160 5266 4978 5619 6295 6148 7439 12285 17020 23522
8873B3522k455n077o399j808j831k321j206j039M423K675k505Q8l225M91K491
$$ 23522 21067 15990 9591 7783 5952 3631 2425 1386 5809 8484 5979 6067 2842 3333 5824
8858E824m525N59L638j649l416K763O86l45J265R91j24R33j08p41m448l155j206
$$ 5824 1299 1858 5496 3847 431 3194 3880 3535 4800 5791 5667 6600 6492 5751 1303 -1852 -3058
8841c058L484L538j073j540r2K997K287j163j811O37J445K01J750J646j191Q53
$$ -3058 426 3964 2891 1351 1259 4256 6543 5380 3569 4206 5651 5852 7602 9248 8057 8910
8825H910j916p30Q25k012j356J633K110J739j926m157j568P99O21r96l023l859
$$ 8910 6994 6264 7089 5077 3721 5354 7464 9203 7277 3120 1552 2351 2972 1976 -1047 -4906
8809d906M22K745L691K882k458j258M86k285l155R95r48L635O39J009K457K14
$$ -4906 -4484 -1739 1952 4834 2376 1118 1604 -681 -3836 -2841 -3789 -154 485 1494 3951 4165
8793D165m250j408L247j578k249M46m81L713J735k11l520k418J139n30K079J970
$$ 4165 -85 -1493 1754 176 -2073 -1627 -2108 1605 3340 3129 -391 -2809 -1670 -2200 -121 1849
8777A849o79J016K979j738k728k778j618O1J989L363L170m233k327L250K193O18
$$ 1849 1170 2186 5165 3427 699 -2079 -3697 -3636 -1647 1716 4886 653 -1674 1576 3769 4387
8761D387K725j220j490J79J173l646k349J569M302K495j546k78P36j341l337k345
$$ 4387 7112 5892 4402 4581 5754 2108 -241 1328 5630 8125 6579 6301 7037 5696 2359 14
8745A4L664K473k56n10R26K095l498k885n74J16M116M14k458l271p17K122L897
$$ 14 3678 6151 5895 5385 6311 8406 4908 2023 1449 1565 5681 6095 3637 366 -351 1771 5668
8728E668r80k393r82j055K230K205k397n12L113m74m567J586J435O3L880K046
$$ 5668 4688 2295 1313 258 2488 4693 2296 1784 4897 4423 -144 1442 2877 2940 6820 8866
8712H866K070O30j463m310k064K23j338k120j546l36m93j04J395J931j122Q97
$$ 8866 10936 11566 10103 5793 3729 3952 2614 494 -1052 -1388 -1881 -1985 -590 1341 219 1116
8696A116K836J387o73l544K0Q21K86O4j827J072q87J420O72K122Q57k255J228
$$ 1116 3952 5339 4666 1122 1142 1963 2249 2313 486 1558 671 2091 2763 4885 5742 3487 4715
8679D715M35k197k430j467J105K996N1l929j879j302L120J500l87K144J361K98
$$ 4715 5150 2953 523 -944 161 3157 3208 -721 -2600 -3902 -782 718 331 2475 3836 4134
8663D134j394M14J723J298l646j800M492M936j557m086J215M638J528K15k039
$$ 4134 2740 3154 4877 6175 2529 729 5221 10157 8600 4514 5729 10367 11895 12110 10071
8648A0071j945o8K589J922j661m354k357p4k801k036j016M396L567k134k895K679
$$ 10071 8126 8058 10647 12569 10908 6554 4197 4123 1322 -714 -1730 2666 6233 4099 1204 3883
8632C883M445K52k028J665J380P38k168j743m56j468j378O87Q50J51j661q09K265
$$ 3883 8328 8580 6552 8217 9597 10335 8167 6424 5968 4500 3122 3809 4659 4810 3149 2340 4605
8615D605J232M478K111j181j296j76j747J953L264L315j424p03j759l215k295
$$ 4605 5837 10315 12426 11245 9949 9773 8026 9979 13243 16558 15134 14431 12672 9457 7162
8600G162m08k005k514k483K913K676R33j080J246k00q53j89n66M151L798n644
$$ 7162 6754 4749 2235 -248 2665 5341 6274 5194 6440 6240 5387 5198 4632 8783 12581 6937
8584F937k962j496L09M91k190L178L298J935M82k445j121k380j313m368J721K965
$$ 6937 3975 2479 2788 3279 1089 4267 7565 9500 9982 7537 6416 4036 2723 -1645 76 3041
8568C041n73l622L263J691r98L36m24j729m363R4L337K492j699j774K092K203
$$ 3041 2468 -1154 2109 3800 2802 3138 2714 985 -3378 -3284 53 2545 846 -928 1164 3367
8552C367P42J600j236k406L025O95J12j986l151O07Q47O71M227P08O68J593J50
$$ 3367 4109 5709 4473 2067 5092 5787 5899 3913 762 1369 2216 2887 7114 7822 8490 10083 10233
8535A0233J20k541J293M966L97o179l453j515k789R01O98J010J74j074k71M45
$$ 10233 10353 7812 9105 14071 14468 8289 4836 3321 532 1433 2131 3141 3315 2241 1970 2415
8519B415l79L1j069N18R43k05m554o59J567K63K691Q66q66K153o81m106K55j839
$$ 2415 2036 2067 998 1516 2459 2254 -2300 -2959 -1392 -1129 1562 2428 1562 3715 3034 -1072 -817 -2656
8501b656K408J098O2J381n08j409m099K090m26J143O30L953J443N05p70R5j697
$$ -2656 -248 850 912 2293 1785 376 -3723 -1633 -2059 -916 -286 3667 5110 5615 4845 4940 3243
8484C243j595R75p02J647j47j291J988M52k861m908L64M418J165P75N68K041m11
$$ 3243 1648 2623 1921 3568 3421 2130 4118 4570 1709 -3199 -2835 1583 2748 3523 4091 6132 5721
8467E721n745k909J631j799j447O2R14J804K799l43m582J410L959j894n15L202
$$ 5721 -24 -2933 -1302 -3101 -4548 -4486 -3572 -1768 1031 688 -3894 -2484 1475 -419 -934 2268
8451B268k74j224L096q4j287k458l36j601j125j91l57q2O149J161n739l58J202
$$ 2268 1994 770 3866 3782 2495 37 -299 -1900 -3025 -3216 -3573 -3655 2494 3655 -2084 -2442 -1240
8434a240K173j531n49J335K278L188k464n00o22j518J748j017n403p49K932L199
$$ -1240 933 -598 -1147 188 2466 5654 3190 2690 2068 550 2298 1281 -4122 -4871 -1939 1260
8418A260j289J682L66j422n19j401L224J385j329m80q66k257n04k02L395J642
$$ 1260 -29 1653 2019 597 78 -1323 1901 3286 1957 1477 611 -1646 -2150 -2352 1043 2685
8402B685k066N14m43n21j357r48K7Q62Q27J859k92n498q75K451K804j695m749
$$ 2685 619 1133 690 169 -1188 -2136 -2109 -1247 -420 1439 1147 -4351 -5226 -2775 29 -1666 -6415
8385f415o0L176L936q73m80K259L3r18P72j679j675K758J021K521q37j979j983
$$ -6415 -6475 -3299 637 -236 -716 1543 1576 658 1430 -249 -1924 834 1855 4376 3539 1560 -423
8368d23p4l6l167l04R59k199p3n2J808j160m43J566K344k057N47K809J140J469
$$ -423 -497 -533 -3700 -4004 -3045 -5244 -5317 -5369 -3561 -4721 -5164 -3598 -1254 -3311 -2764 45 1185 2654
8350B654l384j313o42K00J352J505Q31l217k334J845K298j71N81J049O60j793
$$ 2654 -730 -2043 -2685 -2485 -1133 372 1203 -2014 -4348 -2503 -205 -376 205 1254 1914 121
8334A21P84O73j48N73P01M12l987m280K89l89J319k147J397j257l75L721L804
$$ 121 905 1578 1430 2003 2704 3116 -871 -5151 -4862 -5251 -3932 -6079 -4682 -5939 -6314 -2593 1211
8317A211L526j100p933K32J636L27q80K245K237k013m306K503J335k692k854j131
$$ 1211 4737 3637 -4296 -4064 -2428 -2101 -2981 -736 1501 -512 -4818 -2315 -980 -3672 -6526 -7657
8301g657j039L875M64M95J564L857q16l846l304M38K058j108Q059J095m402m250
$$ -7657 -8696 -4821 -4357 -3862 -2298 1559 743 -3103 -6407 -5969 -3911 -5019 3040 4135 -267 -4517
8285d517N65o02p06l148q0K749J142K020L22J134J914J347j01j935J68K78m34
$$ -4517 -3952 -4554 -5260 -8408 -8488 -5739 -4597 -2577 -2255 -1121 793 2140 2039 104 272 550 116
8268A16j974K137K745l0j437j084l344j973M53k46n1O16j554P59K761Q68L27K048
$$ 116 -1858 279 3024 2994 1557 473 -2871 -4844 -4391 -4637 -4688 -4072 -5626 -4867 -2106 -1238 -911 1137
8250A137j501R62N54n36Q66r40J156J045m044Q75l77P89m91j855J247k107J089
$$ 1137 -364 598 1152 616 1482 542 1698 2743 -1301 -426 -803 -14 -505 -2360 -1113 -3220 -2131
8233b131J273N4K409P11q53j795L09j37q91K963k538K81m59r06J529k534q36j319
$$ -2131 -858 -804 1605 2316 1463 -332 -23 -160 -1051 1912 -626 -345 -804 -1710 -181 -2715 -3551 -4870
8215d870L42K709J825L07k142k501P30J042J107K247L65j12r10k777K756J361
$$ -4870 -4528 -1819 6 313 -1829 -4330 -3600 -2558 -1451 796 1161 1049 139 -2638 118 1479
8199A479j837q31M36J615P75j010K848J456L89k03j182k697l310j064j15L1p41
$$ 1479 -358 -1189 -753 862 1637 627 3475 4931 5320 5117 3935 1238 -2072 -3136 -3251 -3220 -3961
8182c961L848n45j911l91O12M265J190l064K242j036k485P67q61J565k504k17
$$ -3961 -113 -658 -2569 -2960 -2348 1917 3107 43 2285 1249 -1236 -469 -1330 235 -2269 -2486
8166b486M49r91K141jJ557l947j449L32J570L986K502l95l425L055m110m730l455
$$ -2486 -2037 -3028 -887 -888 669 -3278 -4727 -4395 -2825 1161 3663 3268 -157 2898 -1212 -5942 -9397
8149i397j362N105O481Q62n318m42L45K02J674q45r28O57J339J717J628M59k687
$$ -9397 -10759 -5654 827 1689 -3629 -4071 -3726 -3524 -1850 -2695 -3623 -2966 -1627 90 1718 2177 -510
8132e10j774Q05r83k28K425l84k077j368l251m34N63K574k836n59j97o60K759
$$ -510 -2284 -1479 -2462 -2690 -265 -649 -2726 -4094 -7345 -7779 -7216 -4642 -7478 -8037 -8234 -8894 -6135
8115f135J230o77Q00O196R66k380j953k281m70q71L277M245Q03m39j137K91l191
$$ -6135 -4905 -5582 -4782 1414 2380 0 -1953 -4234 -4704 -5575 -2298 1947 2750 2311 1174 1465 -1726
8098a726r48K57j770j983J205k83O23j270P78j169p9K965K585j207L448k46m319
$$ -1726 -2674 -2417 -4187 -6170 -4965 -5248 -4625 -5895 -5117 -6286 -6365 -3400 -815 -2022 1426 1180 -3139
8081c139k488O54M00R81Q64J802q57j239L022o46J272j100j305j33J076K112K223
$$ -3139 -5627 -4973 -4573 -3592 -2728 -926 -1783 -3022 0 -646 626 -474 -1779 -1912 -836 1276 3499
8064C499K621k277k040k345J899J388k74l218l532l64J147J950o04q4j546K222
$$ 3499 6120 3843 1803 -542 1357 2745 2471 -747 -4279 -4643 -3496 -1546 -2150 -2234 -3780 -1558
8048a558m43J203n43N82J857j885l144j96J599J468r75k170K07P10J46L160L835
$$ -1558 -2001 -798 -1341 -759 1098 -787 -3931 -4127 -2528 -1060 -2035 -4205 -3998 -3288 -3142 18 3853
8031C853j697l086j751M92L889P15J012J04j018p30k254k586K567m21J098N27
$$ 3853 2156 -930 -2681 -2189 1700 2415 3427 3531 2513 1783 -471 -3057 -490 -911 187 714
8015G14M20J175j660J668L160J584k570j242k045j028L326Q04J441k516m664k455
$$ 714 1134 2309 649 2317 5477 7061 4491 3249 1204 176 3502 4306 5747 3231 -1433 -3888
7999c888Q34L213l2r47Q5Q10J000J461j614l184J177M179n79J89J654j390j410
$$ -3888 -3054 159 127 -820 -735 75 1075 2536 922 -2262 -1085 3094 2515 2704 4358 2968 1558
7982A558k901K600J992L380K821L035j593k630j289j008j791l200k220r94O05
$$ 1558 -1343 1257 3249 6629 9450 12485 10892 8262 6973 5965 4174 974 -1246 -2240 -1635
7967a635R00K38N42o78P7J628k010L47K899L989O1k558r26k050n156k386L659
$$ -1635 -735 -497 45 -633 -556 1072 -938 -591 2308 6297 6358 3800 2874 824 -4332 -6718 -3059
7950c059M568K681k865n674o43j26l313J135M71L345M039N84j667p03p84J731
$$ -3059 1509 4190 1325 -4349 -4992 -5118 -8431 -7296 -6825 -3480 559 1143 -524 -1227 -2011 -280
7934b80N41k182M44L124j725K32L631J947j038J662j703l582l947o62J438p66
$$ -280 261 -1921 -1477 1647 -78 154 3785 5732 4694 6356 4653 1071 -2876 -3538 -2100 -2866
7918b866N69L458M87N96J02J79p96l01k063M32k99j713L108Q35j324J772N351
$$ -2866 -2297 1161 1648 2244 2346 2525 1729 1428 -635 -203 -502 -2215 893 1728 404 2176 7527
7901G527m15j953m571m682j322K136R88j509J542L612K637m45m168r44m069r96
$$ 7527 7112 5159 588 -4094 -5416 -3280 -2292 -3801 -2259 1353 3990 3545 -623 -1567 -5636 -6632
7885f632k008M956L074O9P34J16J98K883K890k732l648l24J592J473j460j569
$$ -6632 -8640 -3684 -610 -541 193 309 507 3390 6280 3548 -100 -424 1168 2641 1181 -388
7869c88L150n68m758l638J181J793K107M235K180q67j540k013K045n52J071j249
$$ -388 2762 2194 -2564 -6202 -5021 -3228 -1121 3114 5294 4427 2887 874 2919 2367 3438 2189
7853B189K924O62k504P94j623l376j062j551k03j433k786k421K96Q15K552K826
$$ 2189 5113 5775 3271 4065 2442 -934 -1996 -3547 -3750 -5183 -7969 -10390 -10094 -9279 -6727 -3901
7837c901O6j379J022l326R06j980J893J515n4j940l327J806j1K031L608k161k111
$$ -3901 -3835 -5214 -4192 -7518 -6612 -8592 -6699 -5184 -5238 -7178 -10505 -8699 -8710 -6679 -3071 -5232 -7343
7820g343K395L435j880Q20J167n3j274j4K16L15j257o08q27K326J587j61j787
$$ -7343 -4948 -1513 -3393 -2573 -1406 -1459 -2733 -2747 -2531 -2216 -3473 -4081 -4908 -2582 -995 -1156 -2943
7803b943l61N540j012l301q84j479K24J361M227L416l808j694l103l968J125L108
$$ -2943 -3304 2236 1224 -2077 -2961 -4440 -4216 -2855 1372 4788 980 -714 -3817 -7785 -6660 -3552
7787c552J192L171J818l927l841r73q0K181J74j873r79K828P01r89L453p62k791
$$ -3552 -2360 811 2629 -1298 -5139 -6112 -6192 -4011 -3837 -5710 -6689 -3861 -3160 -4149 -696 -1458 -4249
7770d249P67j535j846K588J107n69Q5M064J199l685k124J130j707k364K681K550
$$ -4249 -3482 -5017 -6863 -4275 -3168 -3737 -3652 412 1611 -2074 -4198 -3068 -4775 -7139 -4458 -1908
7754a908J558l502O86K997J33k128k85J132k304k260J562K310J081j590L77k324
$$ -1908 -350 -3852 -3166 -169 -36 -2164 -2449 -1317 -3621 -5881 -4319 -2009 -928 -2518 -2141 -4465
7738d465J112N88k01J360J055j895K44K310l678m624j653q30J706J843J444K783
$$ -4465 -3353 -2765 -2966 -1606 -551 -2446 -2202 108 -3570 -8194 -9847 -10677 -8971 -7128 -5684 -2901
7722b901j289J149P61l49j928J67k449P8K539J394j58j170j68k878K082K101J881
$$ -2901 -4190 -3041 -2280 -2629 -4557 -4390 -6839 -6761 -4222 -2828 -2986 -4156 -4324 -7202 -5120 -3019 -1138
7705a138k651j537J249o01j50L026P90R38q16j201L8q73j557L176q28J04k090
$$ -1138 -3789 -5326 -4077 -4678 -4828 -1802 -1012 -74 -890 -2091 -2053 -2926 -4483 -1307 -2135 -2031 -4121
7688d121RJ238l41n49M87L71j009K51K239J198o34K234l26K356J17l018k756k287
$$ -4121 -4112 -2874 -3215 -3764 -3277 -2906 -3915 -3664 -1425 -227 -861 1373 1047 3403 3520 502 -2254 -4541
7670d541k685k85N72M594K228o59j799k813j039K184K046p19M046O78j531k444
$$ -4541 -7226 -7511 -6939 -2345 -117 -776 -2575 -5388 -6427 -4243 -2197 -2916 1130 1808 277 -2167
7654b167p46K363J184n28j963k725L398K16J930n17l497J609K025K764J509j08
$$ -2167 -2913 -550 634 106 -1857 -4582 -1184 -968 962 445 -3052 -1443 582 3346 4855 4747
7638D747l188l250j275M31O28n08o66j489l168n10j026K276L719L673l78Q90J792
$$ 4747 1559 -1691 -2966 -2535 -1907 -2415 -3081 -4570 -7738 -8248 -9274 -6998 -3279 394 16 906 2698
7621B698j466j752m523o69J30K103M15q89j637K12K023l37K081O63k456j351K228
$$ 2698 1232 -520 -5043 -5712 -5582 -3479 -3064 -3953 -5590 -5378 -3355 -3692 -1611 -948 -3404 -4755 -2527
7604b527J979j318k657M179J743q26j79j094J561l99j121k41K789R44m547l501
$$ -2527 -548 -1866 -4523 -344 1399 573 394 -700 861 462 -659 -900 1889 2833 -1714 -5215
7588e215N8r8M483K906j011p89k461K21j270R64J350J034J4l472k415N94L349
$$ -5215 -5157 -5255 -772 2134 1123 334 -2127 -1906 -3176 -2212 -862 172 186 -3286 -5701 -5107 -1758
7571a758j02J145j634P63J171J034l374k686K744J490k569l73M990l38j056l094
$$ -1758 -1860 -715 -2349 -1586 -415 619 -2755 -5441 -2697 -1207 -3776 -4149 841 503 -553 -3647
7555c647m236k827L002K413M282J785L53k180r39j363l88R80j420j564J688L374
$$ -3647 -7883 -10710 -7708 -5295 -1013 772 1125 -1055 -1994 -3357 -3745 -2765 -4185 -5749 -4061 -687
7539f87K254m824l687K632K419L945k966k451j577m208K926J387Q51j336r61l498
$$ -687 1567 -3257 -6944 -4312 -1893 2052 -914 -3365 -4942 -9150 -6224 -4837 -3986 -5322 -6283 -9781
7523i781k147R57M935K080P74J056K202J671K92j061K786J030k520l958l684l735
$$ -9781 -11928 -10971 -6036 -3956 -3182 -2126 76 1747 2039 978 3764 4794 2274 -1684 -5368 -9103
7507i103J880K854J30l88J299l73O4j660j223L005K470l265O97L341n95m832l170
$$ -9103 -7223 -4369 -4239 -4627 -3328 -3701 -3637 -5297 -6520 -3515 -1045 -4310 -3613 -272 -867 -5699 -8869
7490h869r26K920J795j16J919L448l034r05K341M40m59P9l7k705K300K341m5k527
$$ -8869 -9795 -6875 -5080 -5196 -3277 171 -2863 -3768 -1427 -987 -1446 -1367 -1404 -4109 -1809 532 487 -2040
7472b040r8m33k45K46K152O32k953l281r6N086J109k742l781k472K931L461r71
$$ -2040 -2138 -2571 -2816 -2570 -418 214 -2739 -6020 -6116 -1030 79 -2663 -6444 -8916 -5985 -2524 -3495
7455c495l297q00N620M151k489j476K611j393k571m525k635L675K370l35J753
$$ -3495 -6792 -7592 -1972 2179 -310 -1786 825 -568 -3139 -7664 -10299 -6624 -4254 -4589 -2836
7440b836J965k445j330N118j435O42l35k891k888J76J87O836M399J735k595m361
$$ -2836 -871 -3316 -4646 472 -963 -321 -656 -3547 -6435 -6259 -6072 764 5163 6898 4303 -58
7424e8l405j278m48K540l96p80M97j42j4J879Rj055K697K374k238m815l161J267
$$ -58 -3463 -4741 -5189 -2649 -3045 -3825 -3328 -3470 -3484 -1605 -1596 -2651 46 2420 182 -4633 -7794 -6527
7406f527j651n02M189L185K203J709M57k352l229rJ335R32k155k744K63Q61j15
$$ -6527 -8178 -8680 -4491 -1306 897 2606 3063 711 -2518 -2527 -1192 -260 -2415 -5159 -4896 -4035 -4150
7389d150L17j637k769k33L146M447K074j514l733J426L276Q18k989o30j619j598
$$ -4150 -3833 -5470 -8239 -8472 -5326 -879 1195 -319 -4052 -2626 650 1468 -1521 -2151 -3770 -5368
7373e368K87j100q77Q17K885K164J669L436j595m916Q3J516J226r13k18J466l309
$$ -5368 -5081 -6181 -7058 -6241 -3356 -1192 477 3913 2318 -2598 -2515 -999 227 -686 -904 562 -2747
7356b747n35n01r26m91q72K613K665O61Q29j10p2M62J853l218m537o78J028J961
$$ -2747 -3282 -3783 -4709 -5200 -6072 -3459 -794 -133 696 586 514 976 2829 -389 -4926 -5604 -4576 -2615
7338b615R03J527P53l776l209j972j165k540J973L581L784J894j071m674k655
$$ -2615 -1712 -185 568 -3208 -6417 -8389 -9554 -12094 -10121 -6540 -2756 -862 -1933 -6607 -9262
7323i262K807J924K059K602K346k564l124K714L065q05j766k202j232L112k509
$$ -9262 -6455 -4531 -2472 130 2476 -88 -3212 -498 2567 1762 -4 -2206 -3438 -326 -2835
7308b835j939K36P04J191j81m17n92m167l583R19J924L655J550r11L39J337l061
$$ -2835 -4774 -4538 -3834 -2643 -2824 -3241 -3833 -8000 -11583 -10664 -8740 -5085 -3535 -4446 -4107 -2770 -5831
7291e831j637N209K729P55k412l696K205L95j348m71k25l23k284J756J295J186
$$ -5831 -7468 -2259 470 1225 -1187 -4883 -2678 -2283 -3631 -4102 -4327 -4650 -6934 -5178 -3883 -2697
7275b697J287o17K95k718R45M602j52j081j586k240M32J181R54J05J184LJ879
$$ -2697 -1410 -2027 -1732 -4450 -3505 1097 945 -136 -1722 -3962 -3530 -2349 -1395 -1290 -106 -103 1776
7258A776l42J52p89Mj690j966M4N3j943J155m94J902j552l208K98k54L044O14
$$ 1776 1434 1586 797 801 -889 -2855 -2811 -2758 -4701 -3546 -4040 -2138 -3690 -6898 -6600 -6854 -3810 -3196
7240c196L315M73m375n237J79M157L94J731R23j639K666K987J089k581j517J419
$$ -3196 119 592 -3783 -9020 -8841 -4684 -4290 -2559 -1636 -3275 -609 2378 3467 886 -631 788
7224G88j016k006r88K858K055J609j634j269p91q83j164P83j945J59k206j842
$$ 788 -228 -2234 -3222 -364 1691 3300 1666 397 -394 -1277 -2441 -1658 -3603 -3444 -5650 -7492
7208g492J067L604J965L135j126n62J39P60k822k535r8m86J611L524k49l831k218
$$ -7492 -6425 -2821 -856 2279 1153 591 730 1490 -1332 -3867 -3965 -4451 -2840 684 435 -3396 -5614
7191e614L356L047N55m842n99M305k493j290K131J891m72l33l141O34P99k235
$$ -5614 -2258 789 1344 -3498 -4097 208 -2285 -3575 -1444 447 -25 -358 -3499 -2865 -2066 -4301
7175d301j000L896L695r55n304p11K146J389J09k410j574J221K927K900J085Q45
$$ -4301 -5301 -1405 2290 1335 -3969 -4680 -2534 -1145 -1036 -3446 -5020 -3799 -872 2028 3113 3958
7159C958l554l848K22J074j581P97J978L556k35l410j875l241K123j158j927K659
$$ 3958 404 -3444 -3222 -2148 -3729 -2932 -954 2602 2367 -1043 -2918 -6159 -4036 -5194 -7121 -4462
7143d462k66k97J154J319p20l03J301K753p55j129k368J55r57J885j139j534Q14
$$ -4462 -4728 -5025 -3871 -2552 -3272 -3575 -2274 479 -276 -1405 -3773 -3618 -4575 -2690 -3829 -5363 -4549
7126d549P33J581M64k909j721J954R42M090L047j337k2n49J98L52n53l941k087
$$ -4549 -3816 -2235 -1771 -4680 -6401 -4447 -3505 585 3632 2295 2273 1724 1922 2274 1721 -2220 -4307
7109d307P9L90L473J335k403j214M92j31q75R55J076j955L319M32m968j79J368
$$ -4307 -4228 -3838 -365 970 -1433 -2647 -2155 -2286 -3161 -2206 -1130 -3085 234 666 -4302 -4481 -3113
7092c113j863l367M21J918N53r7M37J633M403J453j032m95k26l414p15j069q75
$$ -3113 -4976 -8343 -7922 -6004 -5451 -5548 -5111 -3478 925 2378 1346 851 625 -2789 -3504 -4573 -5448
7075e448L143r30K415j015k093k423M066K096M62J506j619j372m93K347M63j207
$$ -5448 -2305 -3235 -820 -1835 -3928 -6351 -2285 -189 273 1779 160 -1212 -1705 642 1105 -102
7059a02o53j362j556j325K705k391k098n5k51J532K502M291J153l793l984j133
$$ -102 -755 -2117 -3673 -4998 -2293 -4684 -6782 -6837 -7088 -5556 -3054 1237 2390 -1403 -5387 -6520
7043f520k175L471J323O86l956m90K942M141j330k946J534J823O58M39l592L30
$$ -6520 -8695 -5224 -3901 -3215 -7171 -7661 -4719 -578 -1908 -4854 -3320 -1497 -839 -400 -3992 -3662
7027c662m1j21J730J318K206L178k022l631m8k787l96J983k718j456O61j43q65
$$ -3662 -3703 -3824 -2094 -776 1430 4608 2586 -1045 -1093 -3880 -4276 -2293 -5011 -6467 -5806 -5949 -6814
7010f814J686O92p12m65K137P58j207l975J834N87K056J89j756n09K304K124K967
$$ -6814 -5128 -4436 -5148 -5613 -3476 -2718 -3925 -7900 -6066 -5479 -3423 -3234 -4990 -5499 -3195 -1071 1896
6993A896J209k338r52j749j84J528M6L253M67r14j135J945j77k038q45J918m218
$$ 1896 3105 767 -185 -1934 -2118 -590 -544 2709 3176 2262 1127 3072 2895 857 12 1930 -2288
6976b288m5P15L192K126J171j910m036P60O27L0J86q12l164q23m76j684K075L888
$$ -2288 -2333 -1618 1574 3700 4871 2961 -1075 -315 312 342 528 -284 -3448 -4271 -4747 -6431 -4356 -468
6958d68L335J226n899k902j340q71J367r69K5J342J964k15p80M34Q36J740L105
$$ -468 2867 4093 -1806 -4708 -6048 -6919 -5552 -6521 -6496 -5154 -3190 -3405 -4185 -3751 -2915 -1175 1930
6941A930J136j567o14n72K639J68k825l490j512M42O6K415K05k982k534R13L680
$$ 1930 3066 1499 885 313 2952 3120 295 -3195 -4707 -4265 -4199 -1784 -1579 -4561 -7095 -6182 -2502
6924b502J932j593j390k266N68K16J434L009M08k607j593L456O06k84L313L13
$$ -2502 -570 -2163 -3553 -5819 -5251 -5035 -3601 -592 -184 -2791 -4384 -928 -322 -606 2707 3020
6908C020l943j51j906l478r10J51J599J435L02j359k136J227K930N680j124m524
$$ 3020 -923 -1074 -2980 -6458 -7368 -7217 -5618 -4183 -3881 -5240 -7376 -6149 -3219 2461 1337 -3187
6892c187K05M937j86m863l544j031J226K104L497K037O20j549j08J066k434q71
$$ -3187 -2982 1955 1769 -3094 -6638 -7669 -6443 -4339 -842 1195 1815 266 158 1224 -1210 -2081
6876b081J362n336j90L06k733J069L294J875k120j4J150j678j940K548L233k169
$$ -2081 -719 -6055 -6245 -5939 -8672 -7603 -4309 -2434 -4554 -4568 -3418 -5096 -7036 -4488 -1255 -3424
6860c424j480m00j096r78K302L217J054k779n06l44Q62k66k122q61J544O91K40
$$ -3424 -4904 -5304 -6400 -7378 -5076 -1859 -805 -3584 -4090 -4434 -3572 -3838 -5960 -6821 -5277 -4586 -4346
6843d346K844J601Q27m394l95l31k30N19m241k843q43K738O823K320J5J16m613
$$ -4346 -1502 99 926 -3468 -3863 -4194 -4424 -3905 -8146 -10989 -11832 -9094 -2271 49 64 180 -4433
6826d433o64j750r63L83j014m7k007j217N885K304J188j219o31J877J283k98k451
$$ -4433 -5097 -6847 -7810 -7427 -8441 -8488 -10495 -11712 -5827 -3523 -2335 -3554 -4185 -2308 -1025 -1323 -3774
6809c774K68P98Pj799o92J895J906k777p38k397O15L025l44o42Q16o21K040K257
$$ -3774 -3506 -2708 -2701 -4500 -5192 -3297 -1391 -4168 -4906 -7303 -6688 -3663 -4007 -4649 -3833 -4454 -2414 -157
6791a57p96m797k575K132j322K509P01p95L290J094Q93n72J394J319k779l85L790
$$ -157 -953 -5750 -8325 -6193 -7515 -5006 -4305 -5100 -1810 -716 177 -395 999 2318 -461 -846 2944
6774B944o23l926m14m772l544J709M75M98L157K621j08K628M702J606j744K165
$$ 2944 2321 -1605 -2019 -6791 -10335 -8626 -8151 -7653 -4496 -1875 -1983 645 5347 6953 5209 7374
6758G374m342m847l37K220J057k337k511K073K99m094J239K166L537l297j912
$$ 7374 3032 -1815 -2152 68 1125 -1212 -3723 -1650 -1351 -5445 -4206 -2040 1497 -1800 -3712
6743c712j62r45j72J004N81P99j981k241J343k437o53L963N94m59k65J581K791
$$ -3712 -3874 -4819 -4991 -3987 -3406 -2607 -4588 -6829 -5486 -7923 -8576 -4613 -4019 -4478 -4743 -3162 -371
6726c71P14k786q49J305N67K961r60l43J432k456j098n07j261j751j074J082p90
$$ -371 343 -2443 -3292 -1987 -1420 1541 581 238 1670 -786 -1884 -2391 -3652 -5403 -6477 -5395 -6185
6709f185J497M628J095j564j282J329j041j76j589j094n39J163l281j449N525
$$ -6185 -4688 -60 1035 -529 -1811 -482 -1523 -1699 -3288 -4382 -4921 -3758 -7039 -8488 -2963
6694b963L843P33k063J569M86m187l925q88K04J722L648M1R54J790K599k525o08
$$ -2963 880 1613 -450 1119 1605 -2582 -6507 -7395 -7191 -5469 -1821 -1780 -826 964 3563 1038 430
6677D30K417K6n058j866J194L09O47J24J465l228L473M129K45p72j543k308j140
$$ 430 2847 2873 -2185 -4051 -2857 -2548 -1901 -1777 -312 -3540 -67 4062 4307 3535 1992 -316 -1456
6660a456k655M111P83p98j532J184m73j747K510k73k045J090J299M09L228q95
$$ -1456 -4111 0 783 -15 -1547 -363 -836 -2583 -73 -346 -2391 -1301 -2 407 3635 2740
6644B740k656J231J559l01M223M318J063n406m131J039N65j805p9J252J892o91
$$ 2740 84 1315 2874 2573 6796 11114 12177 6771 2640 3679 4244 2439 2360 3612 5504 4813
6628D813R69Q553Q431N688P038J6751L4134N9995J04865J19138j4615j35314j00167
$$ 4813 5782 14335 22766 28454 35492 52243 86377 146372 251237 370375 355760 220446 120279
6615A20279n0046k2482j2801o635m220k055p494o649n420j513j933j267K097M390
$$ 120279 70233 47751 34950 28315 24095 22040 14546 7897 2477 964 -969 -2236 -139 4251
6601D251J059K986L371K67l135k941l278k699P10K000r37k299k56Ml662q42Q72
$$ 4251 5310 8296 11667 11934 8799 5858 2580 -119 591 2591 1654 -645 -901 -897 -4559 -5401 -4529
6584d529Q39L2j80K236J913k383l217n70N90J954R64j469J092K698L594j655k039
$$ -4529 -3690 -3658 -3838 -1602 311 -2072 -5289 -5859 -5269 -3315 -2351 -3820 -2728 -30 3564 1909 -130
6567a30j828J333j484n59J70l44J578j835l536J973K136l06L160J18j508j305
$$ -130 -1958 -625 -2109 -2668 -2498 -2842 -1264 -3099 -6635 -4662 -2526 -2832 328 446 -1062 -2367
6551b367l554N90q18J283K169N49J63K618M86j556j783l82j378L92P35j364j553
$$ -2367 -5921 -5331 -6149 -4866 -2697 -2148 -1985 633 1119 -437 -2220 -2602 -3980 -3588 -2853 -4217 -5770
6534e770O16K350J321O83j658M43p73k831k8J832J253J31L6J966K56m155l98O74
$$ -5770 -5154 -2804 -1483 -800 -2458 -2015 -2788 -5619 -5647 -3815 -2562 -2431 -2395 -429 -173 -4328 -4726 -4052
6516d052j394k714K351L161J043j727l470J043J199N69j100K958L21l388J732
$$ -4052 -5446 -8160 -5809 -2648 -1605 -3332 -6802 -5759 -4560 -3991 -5091 -2133 -1812 -5200 -3468
6501c468L934j19m465O58J277J303m737k179M207J643J211J192m335n60J179J862
$$ -3468 466 347 -4118 -3460 -2183 -880 -5617 -7796 -3589 -1946 -735 457 -3878 -4438 -3259 -1397
6485a397N81m204J048Q13K632K507k880n711k232L255M008M916M63k582k160j484
$$ -1397 -816 -5020 -3972 -3159 -527 1980 -900 -6611 -8843 -5588 -1580 3336 3799 1217 -943 -2427
6469b427Q46R1k689l124R01J448k493o46K135K378j704J766L624l95q15q01j729
$$ -2427 -1581 -1490 -4179 -7303 -6402 -4954 -7447 -8093 -5958 -3580 -5284 -3518 106 -289 -1104 -1905 -3634
6452c634J773J615j463q2N26n67P57K20O38j684l28J819N208j078m023J04k262
$$ -3634 -1861 -246 -1709 -1791 -1265 -1832 -1075 -855 -217 -1901 -2229 -410 4798 3720 -303 -199 -2461
6435b461j559J978k698m9M361M50m529j131J630J343K229l348j341L46L892p91
$$ -2461 -4020 -2042 -4740 -4789 -428 22 -4507 -5638 -4008 -2665 -436 -3784 -5125 -4779 -887 -1678
6419a678k810N73K349J310k036J065J766K014J311n30J253J276j852k695k766
$$ -1678 -4488 -3915 -1566 -256 -2292 -1227 539 2553 3864 3334 4587 5863 4011 1316 -1450
6404a450j249Q34L40k6j015l749j314k064o67L538O36k369L890N101o85M74K809
$$ -1450 -2699 -1865 -1525 -1551 -2566 -6315 -7629 -9693 -10360 -6822 -6186 -8555 -4665 436 -249 225 3034
6387C034j771J516P42m26j395l957k244K907J370j783k019L885K11m813j869J706
$$ 3034 1263 2779 3521 3095 1700 -2257 -4501 -1594 -224 -2007 -4026 -141 70 -4743 -6612 -4906
6371d906M368K449j735J75o11k523j691q36J621j04J138J454l264K16J9L177j827
$$ -4906 -538 1911 176 351 -260 -2783 -4474 -5310 -3689 -3793 -2655 -1201 -4465 -4249 -4230 -1053 -2880
6354b880j301l743l45O170J326O22j315J401J436K238k631p01j282k284k922N4
$$ -2880 -4181 -7924 -8269 -2099 -773 -151 -1466 -65 1371 3609 978 277 -1005 -3289 -6211 -6157
6338f157m93k2K866L793K11j797J907n50l257r45j193m51k546j315r0L087K692
$$ -6157 -6650 -6672 -3806 -13 198 -1599 308 -242 -3499 -4444 -5637 -6088 -8634 -9949 -10039 -6952 -4260
6321d260O69m98n130M23J600K350J629L529k67M84j611p72N48j992k941k85j389
$$ -4260 -3591 -4089 -9219 -8796 -7196 -4846 -3217 312 45 529 -1082 -1854 -1306 -3298 -6239 -6524 -7913
6304g913J628L581k508j527L477P29J819j306o11j630K460k218l26L37k3k949
$$ -7913 -6285 -2704 -5212 -6739 -3262 -2533 -714 -2020 -2631 -4261 -1801 -4019 -4345 -4008 -4031 -6980
6288f980L318M370K150P9o77j780L14N1m74l201n9J617L041r29j686P29K659J778
$$ -6980 -3662 708 2858 2937 2260 480 794 845 371 -2830 -2889 -1272 1769 840 -846 -117 2542 4320
6270D320M69P5j294j959k777j472K158J32k926K032L783J587l404j084J670k129
$$ 4320 4789 4864 3570 1611 -1166 -2638 -480 -348 -3274 -1242 2541 4128 724 -360 1310 -819
6254h19j442J478J755j899R03j613r77R06p88n88L49J172l5j412o0J625L35K113
$$ -819 -2261 -783 972 -927 -24 -1637 -2614 -1708 -2496 -3084 -2735 -1563 -1598 -3010 -3070 -1445 -1110 1003
6236A003M37M40l170n764o42L545K574J096j165r34j868OO45o66P6q89K014m47
$$ 1003 1440 1880 -1290 -7054 -7696 -4151 -1577 -481 -1646 -2580 -4448 -4442 -3797 -4463 -4387 -5276 -3262 -3709
6218c709j449j990M38l53j346K518J102k480J471n8K61J52j81k431J172M260K266
$$ -3709 -5158 -7148 -6710 -7063 -8409 -5891 -4789 -7269 -5798 -5856 -5595 -5443 -5624 -8055 -6883 -2623 -357
6201c57l271j847M962j238l123K653M144J894j574n473p04J075J071j995j54J91
$$ -357 -3628 -5475 -513 -1751 -4874 -2221 1923 3817 2243 -3230 -3934 -2859 -1788 -3783 -3937 -3746
6185c746l40j853K839K690R32n57L818j331l289k86j942l65J555K089k45l514
$$ -3746 -4086 -5939 -3100 -410 522 -35 3783 2452 -837 -1123 -3065 -3430 -1875 214 -31 -3545
6169c545Q86M062M36J363k852l115j453L038j120j528rj057j723K390J22j464
$$ -3545 -2659 1403 1839 3202 350 -2765 -4218 -1180 -2300 -3828 -3837 -4894 -6617 -4227 -4105 -5569
6153e569r74J351R98q27j625J063J943L75K242J465k183k883n041j97J383N838
$$ -5569 -6543 -5192 -4194 -5021 -6646 -5583 -3640 -3265 -1023 442 -1741 -4624 -9665 -9862 -8479 -2641
6137b641J249k137K052R33L062P86p55j069o80j141j16J538k271j946r55r2P7
$$ -2641 -1392 -3529 -1477 -544 2518 3304 2549 1480 800 -341 -457 1081 -1190 -3136 -4091 -4183 -4106
6120d106P63K17m82m4K880o03l003l164K324K217j374k039r64K040J862J55L01
$$ -4106 -3343 -3126 -3608 -3652 -772 -1375 -4378 -7542 -5218 -3001 -4375 -6414 -7378 -5338 -3476 -3321 -3020
6103c020P77K327J484m380l72J562K829J95m78j998J136J851j675n405m73K035
$$ -3020 -2243 84 1568 -2812 -3184 -1622 1207 1402 924 -1074 62 1913 238 -5167 -5640 -3605
6087c605J136R00j254l42M010P64l592L32q48k723L862J983l95j348j831j46L641
$$ -3605 -2469 -1569 -2823 -3165 845 1609 -1983 -1651 -2499 -5222 -1360 623 228 -1120 -2951 -3097 544
6070E44J873l38l644j293K355k248l81K126O79r99r50J568k99l548o09O06p82
$$ 544 2417 2079 -1565 -2858 -503 -2751 -3132 -1006 -327 -1326 -2276 -708 -1007 -4555 -5164 -4558 -5340
6053e340j65p19j153p08M70K226K019J495J204j340j421n70k751q22K71J68K388
$$ -5340 -5505 -6224 -7377 -8085 -7615 -5389 -3370 -1875 -671 -2011 -3432 -4002 -6753 -7575 -7304 -7136 -4748
6036d748k386L85L936L084l59k678J368P50j910J016K02J159L262N88n147m527
$$ -4748 -7134 -6749 -2813 271 -88 -2766 -1398 -648 -2558 -1542 -1340 -181 3081 3669 -1478 -6005
6020f005K418P72J953P70k612j548j244K477K806k11n57k718O91j131j535j539
$$ -6005 -3587 -2815 -862 -92 -2704 -4252 -5496 -3019 -213 -424 -981 -3699 -3008 -4139 -5674 -7213
6004g213J084K811j46N73M119j602k247J027j924j941l19j722J538M847k138k504
$$ -7213 -6129 -3318 -3464 -2891 1228 -374 -2621 -1594 -3518 -5459 -5778 -7500 -5962 -1115 -3253 -5757
5988e757r39K34J731L399J895L89l212k508Q46K413l70j856k184J575K404j512
$$ -5757 -6696 -6462 -4731 -1332 563 952 -2260 -4768 -3922 -1509 -1879 -3735 -5919 -4344 -1940 -3452
5972c452N4J740J273O09L32m50k573Q14p56k156l62M20R11J335J268O47O42J517
$$ -3452 -3398 -1658 -385 224 556 106 -2467 -1653 -2409 -4565 -4927 -4507 -3596 -2261 -993 -346 296 1813
5954A813J56j27m93l714r91J713j862l824K618L453K942J956j569m569k389N92
$$ 1813 1969 1842 1349 -2365 -3356 -1643 -3505 -7329 -4711 -1258 1684 3640 2071 -2498 -4887 -4295
5938d295K68QJ039J205j12L69L600L225k518k31l418o873M5M140Q01o06L185P9
$$ -4295 -4027 -4019 -2980 -1775 -1887 -1518 2082 5307 2789 2558 -860 -7733 -7688 -3548 -2747 -3353 -168 -89
5920h9J104j085J98l188M95K50K107M794j444k143q14J270M22j491m28m21L08
$$ -89 1015 -70 128 -3060 -2565 -2315 -208 4586 3142 999 185 1455 1877 386 -42 -463 -155
5903a55q56j597J647P60R61n713l395J789j236J390N055J796k919O63k070P71
$$ -155 -1011 -2608 -961 -201 760 -4953 -8348 -6559 -7795 -6405 -1350 446 -2473 -1810 -3880 -3109
5887c109J869r89K969l53l221j115J054L835j379P22J148j847j975k09J378j83
$$ -3109 -1240 -2229 740 387 -2834 -3949 -2895 940 -439 283 1431 -416 -2391 -2600 -1222 -1405
5871a405k800J981O48J26m1p64L618M67l165l261j449M21o45J381Q76j021Q97
$$ -1405 -4205 -2224 -1576 -1450 -1491 -2255 1363 1830 -1335 -4596 -6045 -5624 -6269 -4888 -4012 -5033 -4136
5854d136k62l093n2L193L884L056O4j025j602q79n771P49K155j220Q41r2J294
$$ -4136 -4398 -7491 -7543 -4350 -466 2590 2654 1629 27 -852 -6623 -5874 -3719 -4939 -4098 -4190 -2896
5837b896J505l631j158o46J170L75K733J169j191J693j919k170J249K308q8J739
$$ -2896 -1391 -5022 -6180 -6826 -5656 -5281 -2548 -1379 -2570 -877 -2796 -4966 -3717 -1409 -1497 242
5821B42O23j918J250L071N37J247J157o63r92n538j588l089J132k60o14L771M74
$$ 242 865 -1053 197 3268 3805 5052 6209 5546 4554 -984 -2572 -5661 -4529 -4789 -5403 -1632 -1158
5804a158l119k012k409l63j920J694N751J802k30j119k588j564L001o69j470j643
$$ -1158 -4277 -6289 -8698 -9061 -10981 -9287 -3536 -1734 -1964 -3083 -5671 -7235 -4234 -4903 -6373 -8016
5788h016R04J220J227M78J561r83Q29Q56l235Q7R09J312K110l90n85J078J104
$$ -8016 -7112 -5892 -4665 -4187 -2626 -3609 -2780 -1924 -5159 -5072 -4163 -2851 -741 -1131 -1716 -638 466
5771D66K305L96O74o3m001k344j516j020R73K653N84j542j66o13k943j922K077
$$ 466 2771 3167 3841 3778 -223 -2567 -4083 -5103 -4130 -1477 -893 -2435 -2601 -3214 -6157 -8079 -6002
5754f002J467O085J396l212j828k215j269J655K117j570K805J650p25l330O18
$$ -6002 -4535 1550 2946 -266 -2094 -4309 -5578 -3923 -1806 -3376 -571 1079 354 -2976 -2358
5739b358j13K710O5l256j082J539l18Q86K517k25k561n17Q29R23j145L7j21J487
$$ -2358 -2471 239 304 -2952 -4034 -2495 -2813 -1927 590 365 -2196 -2713 -1884 -961 -2106 -2069 -2190 -703
5721g03k241j368j307L62J250M141K910l31l251n756J869J750k87J841j996J830
$$ -703 -2944 -4312 -5619 -5257 -4007 134 3044 2713 -538 -6294 -4425 -2675 -2962 -1121 -3117 -1287
5705a287J940j218M74j800m14L462j499r57j781O07k019j441L834k432M11J607
$$ -1287 653 -565 -91 -1891 -2305 1157 -342 -1299 -3080 -2473 -4492 -5933 -2099 -4531 -4120 -2513
5689b513J289K126K356k96J221j259j546l055j836Q63j84J422Q22k294R94J002
$$ -2513 -1224 902 3258 2962 4183 2924 1378 -1677 -3513 -2650 -2834 -1412 -590 -2884 -1890 -888
5673h88L01p6M02k294q74R32K367j802k584m053L79p36J242M425L637L428j986
$$ -888 -587 -663 -261 -2555 -3429 -2497 -130 -1932 -4516 -8569 -8190 -8926 -7684 -3259 378 3806 1820
5656A820k952K475l547j683J565N70r82j341p99J189J319K544M44o62j399p59
$$ 1820 -1132 1343 -2204 -3887 -2322 -1752 -2734 -4075 -4874 -3685 -2366 178 622 -40 -1439 -2198
5640b198m67L286K73j496k17k728j241M293O266K18k661l339j255k831m621j86
$$ -2198 -2665 621 894 -602 -819 -3547 -4788 -495 5771 5989 3328 -11 -1266 -4097 -8718 -8904
5624h904J915N260J976K463k467m821j385J356m21J007K163L082l357k577o19
$$ -8904 -6989 -1729 247 2710 243 -4578 -5963 -4607 -5028 -4021 -1858 1224 -2133 -4710 -5329
5609e329J72K235j775M49M556J128j518r96J076L25k360k274J354K123R39P16
$$ -5329 -5157 -2922 -4697 -4248 308 1436 -82 -1078 -2 323 -2037 -4311 -2957 -834 105 821
5593H21j567r93J879L142l197p31J263Q46j575k952J849L455M34l073j247J953
$$ 821 -746 -1739 140 3282 85 -646 617 1463 -112 -3064 -1215 2240 2674 -399 -1646 307
5577C07K205k93n813J5P54L93L704j796l179J62j063K033J065r72J733L615n576
$$ 307 2512 2219 -3594 -3579 -2825 -2432 1272 -524 -3703 -3541 -4604 -2571 -1506 -2478 -745 2870 -2706
5560b706j153l50o67n06l885P30N75J195K435N94j769K452k064j755j40J724O79
$$ -2706 -3859 -4209 -4876 -5382 -9267 -8537 -7962 -6767 -4332 -3738 -5507 -3055 -5119 -6874 -7014 -5290 -4611
$$ [...]
##END NTUPLES=NMR SPECTRUM
##END=
