##TITLE=Analysis number 325551
Compound Code tl 00805
Project Code adrs
Chemist Name new century
##JCAMPDX= 6.0         $$ Bruker NMR JCAMP-DX V2.0
##DATA TYPE= NMR SPECTRUM
##DATA CLASS= NTUPLES
##ORIGIN= Bruker BioSpin GmbH
##OWNER= nmr
$$ XWIN-NMR		Version 3.5
$$ Thu Jan  4 09:18:10 2007 GMT Standard Time (UT+0h)  MAYBRIDGE\nmr@NMR_250MHZ
##.OBSERVE FREQUENCY= 250.131544655141
##.OBSERVE NUCLEUS= ^1H
##.ACQUISITION MODE= SIMULTANEOUS (DQD)
##.ACQUISITION SCHEME= undefined
##.AVERAGES= 16
##.DIGITISER RES= 18
##SPECTROMETER/DATA SYSTEM= dpx250
##.PULSE SEQUENCE= zg30
##.SOLVENT NAME= DMSO
##.SHIFT REFERENCE= (INTERNAL, DMSO, 0, 16.522)
##AUDIT TRAIL= $$ (NUMBER, WHEN, WHO, WHERE, WHAT)
$$ ##TITLE= Audit trail, XWIN-NMR		Version 3.5
$$ ##JCAMPDX= 5.01
$$ ##ORIGIN= Bruker BioSpin GmbH
$$ ##OWNER= nmr
$$ C:\u/data/dgb/nmr/ADRS/270/pdata/1/auditp.txt
$$ ##AUDIT TRAIL=  $$ (NUMBER, WHEN, WHO, WHERE, WHAT)
(   1,<2007-01-04 09:17:47.55 +000>,<MAYBRIDGE\nmr>,<NMR_250MHZ>,
      <created by zg, POWCHK disabled, PULCHK disabled
       configuration hash MD5:
       49 4B E0 1D 92 C2 6B 37 9F E6 65 BC 52 41 86 1D
       data hash MD5: 64K
       19 9D 80 07 4B 98 39 78 45 D8 99 2C 59 AD 86 88>)
(   2,<2007-01-04 09:18:00.83 +000>,<MAYBRIDGE\nmr>,<NMR_250MHZ>,
      <Start of raw data processing
       ef LB = 0.3 FT_mod = 6 PKNL = 1 SI = 32K 
       data hash MD5: 32K
       F1 7F 22 7E CA BF 03 2D 23 32 D0 12 6E ED B1 E3>)
(   3,<2007-01-04 09:18:02.47 +000>,<MAYBRIDGE\nmr>,<NMR_250MHZ>,
      <apk 
       data hash MD5: 32K
       8F E7 6A D7 93 15 0D 28 13 9D A4 FE 47 86 1E D2>)
(   4,<2007-01-04 09:18:03.17 +000>,<MAYBRIDGE\nmr>,<NMR_250MHZ>,
      <abs ABSG = 5 
       data hash MD5: 32K
       3E FF 3F 6B 94 6D A8 A4 34 50 A2 51 61 B4 35 D2>)
$$ ##END=
$$ 
$$ hash MD5
$$ 76 56 B4 2C AD 05 B5 D3 06 67 E5 9F 21 CF E1 AB
##$RELAX= 
##$RELAX= 
##$RELAX= 
##$RELAX= 
##$RELAX= 
##$RELAX= 
##$RELAX= 
$$ Bruker specific parameters
$$ --------------------------
##$DU= <C:\u>
##$EXPNO= 270
##$NAME= <ADRS>
##$PROCNO= 1
##$TYPE= <nmr>
##$USER= <dgb>
##$AMP= (0..31)
100 100 100 100 100 100 100 100 100 100 100 100 100 100 100 100 100 100 
100 100 100 100 100 100 100 100 100 100 100 100 100 100 
##$AQSEQ= 0
##$AQ_mod= 3
##$AUNM= <au_zg>
##$AUTOPOS= <9 >
##$BF1= 250.13
##$BF2= 250.13
##$BF3= 250.13
##$BF4= 250.13
##$BF5= 500.13
##$BF6= 500.13
##$BF7= 500.13
##$BF8= 500.13
##$BYTORDA= 1
##$CFDGTYP= 0
##$CFRGTYP= 5
##$CHEMSTR= <none>
##$CNST= (0..31)
1 1 145 1 1 1 1 1 1 1 1 1 1 1 1 1 1 1 1 1 1 1 1 1 1 1 1 1 1 1 1 1 
##$CPDPRG= <>
##$CPDPRG1= <>
##$CPDPRG2= <>
##$CPDPRG3= <>
##$CPDPRG4= <mlev>
##$CPDPRG5= <mlev>
##$CPDPRG6= <mlev>
##$CPDPRG7= <mlev>
##$CPDPRG8= <mlev>
##$CPDPRGB= <>
##$CPDPRGT= <>
##$D= (0..31)
0 1 0 0 0 0 0 0 0 0.06 0 0 0 0 0 0 0.0002 0 0 0 0 0 0 0 0 0 0 0 0 0 0 
0 
##$DATE= 1167902266
##$DBL= (0..7)
120 120 120 120 120 120 120 120 
##$DBP= (0..7)
150 150 150 150 150 150 150 150 
##$DBP07= 0
##$DBPNAM0= <>
##$DBPNAM1= <>
##$DBPNAM2= <>
$$ [...]
##$SUBNAM7= <"">
##$SUBNAM8= <"">
##$SUBNAM9= <"">
##$SW= 20.6930455092707
##$SWIBOX= (0..15)
0 0 3 0 0 0 0 0 0 0 0 0 0 0 0 0 
##$SW_h= 5175.983436853
##$TD= 65536
##$TD0= 1
##$TE= 294.16
##$TE2= 300
##$TE3= 300
##$TEG= 300
##$TL= (0..7)
0 120 120 120 120 120 120 120 
##$TP= (0..7)
150 150 150 150 150 150 150 150 
##$TP07= 0
##$TPNAME0= <>
##$TPNAME1= <>
##$TPNAME2= <>
##$TPNAME3= <>
##$TPNAME4= <>
##$TPNAME5= <>
##$TPNAME6= <>
##$TPNAME7= <>
##$TPOAL= (0..7)
0.5 0.5 0.5 0.5 0.5 0.5 0.5 0.5 
##$TPOFFS= (0..7)
0 0 0 0 0 0 0 0 
##$TUNHIN= 0
##$TUNHOUT= 0
##$TUNXOUT= 0
##$USERA1= <user>
##$USERA2= <user>
##$USERA3= <user>
##$USERA4= <user>
##$USERA5= <user>
##$V9= 5
##$VALIST= <valist>
##$VCLIST= <CCCCCCCCCCCCCCC>
##$VD= 0
##$VDLIST= <DDDDDDDDDDDDDDD>
##$VPLIST= <PPPPPPPPPPPPPPP>
##$VTLIST= <TTTTTTTTTTTTTTT>
##$WBST= 1024
##$WBSW= 4
##$XGAIN= (0..3)
0 0 0 0 
##$XL= 0
##$YL= 0
##$YMAX_a= 325480
##$YMIN_a= -366388
##$ZGOPTNS= <>
##$ZL1= 120
##$ZL2= 120
##$ZL3= 120
##$ZL4= 120
##$ABSF1= 16.522
##$ABSF2= -4.171173
##$ABSG= 5
##$ABSL= 3
##$ALPHA= 0
##$AQORDER= 0
##$ASSFAC= 0
##$ASSFACI= 0
##$ASSFACX= 0
##$ASSWID= 0
##$AUNMP= <proc_1d>
##$AZFE= 0.1
##$AZFW= 0.1
##$BCFW= 0
##$BC_mod= 0
##$BYTORDP= 0
##$COROFFS= 0
##$CY= 12.5
##$DATMOD= 1
##$DC= 0
##$DFILT= <>
##$DTYPP= 0
##$F1P= 14.0000005364418
##$F2P= -0.99999901652339
##$FCOR= 0.5
##$FTSIZE= 32768
##$FT_mod= 6
##$GAMMA= 0
##$GB= 0
##$INTBC= 1
##$INTSCL= 1
##$ISEN= 128
##$LB= 0.3
##$LEV0= 0
##$LPBIN= 0
##$MAXI= 10000
##$MC2= 0
##$MEAN= 0
##$ME_mod= 0
##$MI= 0
##$NCOEF= 0
##$NC_proc= -4
##$NLEV= 6
##$NOISF1= 0
##$NOISF2= 0
##$NSP= 0
##$NTH_PI= 0
##$NZP= 0
##$OFFSET= 16.522
##$PC= 1
##$PHC0= 213.4848
##$PHC1= 7.445316
##$PH_mod= 1
##$PKNL= yes
##$PPARMOD= 0
##$PSCAL= 4
##$PSIGN= 0
##$REVERSE= no
##$SF= 250.13
##$SI= 32768
##$SIGF1= 0
##$SIGF2= 0
##$SINO= 400
##$SIOLD= 32768
##$SREGLST= <1H.DMSO>
##$SSB= 0
##$STSI= 32768
##$STSR= 0
##$SW_p= 5175.98343685301
##$SYMM= 0
##$S_DEV= 0
##$TDeff= 65536
##$TDoff= 0
##$TI= <Analysis number 999999
Compound Code 99
Book Reference 9
Project Code 9>
##$TILT= no
##$TM1= 0
##$TM2= 0
##$TOPLEV= 0
##$USERP1= <user>
##$USERP2= <user>
##$USERP3= <user>
##$USERP4= <user>
##$USERP5= <user>
##$WDW= 1
##$XDIM= 32768
##$YMAX_p= 333785512
##$YMIN_p= -213886
$$ End of Bruker specific parameters
$$ ---------------------------------
##NTUPLES= NMR SPECTRUM
##VAR_NAME=  FREQUENCY,     SPECTRUM/REAL,   SPECTRUM/IMAG
##SYMBOL=    X,             R,               I
##VAR_TYPE=  INDEPENDENT,   DEPENDENT,       DEPENDENT
##VAR_FORM=  AFFN,          ASDF,            ASDF
##VAR_DIM=   32768,         32768,           32768
##UNITS=     HZ,            ARBITRARY UNITS, ARBITRARY UNITS
##FACTOR=    0.157963299565203, 1,           1
##FIRST=     4132.6476996994, 0,             0
##LAST=      -1043.33573715361, 0,           0
##MIN=       -1043.33573715361, -213886,     0
##MAX=       4132.6476996994, 333785512,     0
$$ Real data points
##PAGE= N=1
##DATA TABLE= (X++(R..R)), XYDATA
$$ [...]
22283 -10785 -5177 -24248 12986 40465 32589 27935 23012 -5509 -14718 -8632 17768 39461 83970
22270 83970 56992 38867 -9281 -16199 15185 22055 7854 22181 12842 2644 25774 43840
22258 43840 45644 32123 6868 -5185 2199 19478 11182 7584 26309 44608 41585 34014 -1701
22245 -1701 -78 67047 104584 70667 35389 4880 -22656 -17493 16471 38631 72387 59810
22233 59810 45873 58768 47382 40868 66663 42237 14117 -18581 9251 8697 22970 37563
22221 37563 44282 41573 74096 52862 30728 38879 22584 -15637 -17912 -5945 15063 27570
22209 27570 15070 -1745 35418 69400 85796 46866 53805 65819 64871 82500 52538 6097
22197 6097 -9840 -4644 -48080 -56044 -15208 27007 -1036 -33365 -48518 -27877 10373 22214
22185 22214 42167 51432 75561 70201 49556 41411 -6221 5348 14556 -6532 -4618 3183 14960
22172 14960 22240 17527 13630 -50276 -89379 -85085 -47887 17807 35609 31956 47249 60988 46431
22159 46431 44514 49025 73064 49027 33008 20458 -42173 -33254 -59229 -93242 -53999 39609
22147 39609 57226 3209 -11915 -10644 -18955 -19664 -21849 -15639 17738 40064 45824 18229 5843
22134 5843 12 -19831 -50342 -33283 -53114 -61736 -29736 12293 43246 36774 49359 44962 43326
22121 43326 40140 35484 -5864 -30593 -31112 -4560 47210 27423 5165 6388 21132 34143 -3803
22108 -3803 -28468 -11741 534 -24511 -4869 -13325 -22123 -424 50225 75703 50979 34311
22096 34311 41014 36633 26681 15335 13631 -8012 -22400 -32872 -49268 -26025 -7830 27461
22084 27461 34831 48938 78406 89419 82835 59035 80994 91437 46595 -9760 -22453 -16516
22072 -16516 21818 21715 7756 10362 35637 30615 1067 15314 41531 -4845 15123 22981 -13199
22059 -13199 -10563 11990 5212 -5634 -10420 -29178 7744 25743 -5845 -5655 39581 13653 -16253
22046 -16253 12308 37558 24587 2430 6722 4437 38357 12583 -31463 -8544 2648 1943
22034 1943 38790 31705 20978 27681 11880 2873 -3002 -2570 -2312 3463 14027 11960 -8459 -10665
22020 -10665 40860 1495 -17689 -23979 22175 61199 81412 100759 71650 62627 68404 42550
22008 42550 50359 32207 39513 4966 6382 -10273 -17278 14233 45652 48165 37700 43264 76332
21995 76332 12840 -13635 -4266 -18339 -31222 -7122 -1246 1919 -24115 -41307 -24929 12098
21983 12098 17004 -15902 -38517 -44116 -58760 -80560 -83540 -63304 -16388 -16135 -68984 -47330 -39084
21970 -39084 -26743 8790 -319 -15355 9395 19485 71013 69636 7514 -10169 31962 27729
21958 27729 76 3722 24330 30244 42309 8540 6122 -778 25571 60140 64446 11513 -13378
21945 -13378 -16096 -27287 -28018 -27496 -12365 9202 37103 41919 68202 97577 94650 62088 23246
21932 23246 30072 25022 37303 62648 32549 7262 -13560 -34269 17602 48291 72949 88043
21920 88043 43716 43634 71362 57580 36674 9539 30744 55765 61815 41637 -2465 1805 17069
21907 17069 2453 21498 2167 6216 18455 27855 -13836 10323 2082 5904 -22529 -33784
21895 -33784 -49473 -7256 21483 6006 -32966 -36417 4639 46730 27979 21986 33037 31047
21883 31047 10294 21428 23755 15400 4000 11982 -4628 -18417 1242 -5522 -41371 -43564 692
21870 692 -15511 -25741 4041 11905 29222 35533 23131 42931 40479 21499 -2547 17508 46983
21857 46983 50202 70566 79213 44420 11928 -1254 -17704 8062 143 -26670 3830 3379 -908
21844 -908 26228 23532 12359 3728 -2675 -2111 -28022 -27743 -30752 -30372 -28999 3879 -950 -21590
21830 -21590 -29430 -43279 -56530 -85781 -55444 -15536 -3508 -30940 -52376 -88020 -86368 -40065
21818 -40065 -10552 7173 -18115 -36562 -20651 -5601 25723 6674 -24300 -38253 -49426 -13087
21806 -13087 -38190 -58370 -36672 -40391 -49363 -39438 -4446 38029 12273 -25997 -36777 -6904
21794 -6904 14424 9823 -31587 -24768 -48695 -57239 -40337 -29574 -38988 -27604 -3927 -28894 -20717
21781 -20717 8223 28536 18899 41923 36541 48849 74712 62739 15368 39181 49880 55672
21769 55672 30716 28417 8627 -32051 -23100 3753 -3721 -21079 -13498 12346 21962 11221 392
21756 392 -36426 -60320 -70489 -57182 -13850 -14527 -41768 -48869 -31455 -21254 -29810 -13705 -27697
21743 -27697 -32149 -13436 -11106 41058 82213 95872 96082 82573 21889 26693 25897 27156 -12173
21730 -12173 1303 6579 3778 -41538 -41786 -5465 29375 6472 -31847 14344 -4509 10158
21718 10158 9028 -22440 10983 8519 -7637 4418 9853 3945 9245 -10285 -4419 2497 -9032
21705 -9032 -37600 -31482 -40669 -40219 -14402 -36459 -22122 -9309 -31662 -47513 -55185 -6501 3555
21692 3555 -18113 -38591 -71796 -59297 -29020 -9205 -8135 -6549 -4617 -38415 -79570 -95014
21680 -95014 -65351 -28738 -15869 -8640 -19116 -36382 -27117 -3196 7278 -5441 -35995 -36580
21668 -36580 -24883 -21695 13213 24929 44515 18564 10423 1951 1852 1430 16597 37376 4825
21655 4825 -5443 27230 29670 14870 -22687 -32002 -18086 -26894 -39744 -43970 -38221 -41085 -40797
21642 -40797 -37833 -8846 17425 11885 9242 -11274 -64856 -65811 -26102 -6147 3375 -2670 -23383
21629 -23383 14095 18977 24782 1895 -7588 -9913 -8903 -9197 21245 5023 -62566 -68156 -12825
21616 -12825 4276 -33112 -60323 -27772 3676 12681 -7748 -32559 -6079 -43425 -48180 -8145
21604 -8145 22387 71268 59500 43800 41729 14893 41480 29610 6896 10166 15049 4769
21592 4769 3222 -17964 -29146 -21525 -11836 -243 30682 23295 16784 7384 -12092 -35829 -22325
21579 -22325 -22918 -49878 -62028 -69871 -88572 -106468 -101322 -64166 -49716 -42970 -48157 -67233 -35993
21566 -35993 -22523 25914 38810 -1661 -36276 -38845 -4296 6049 32712 41350 31522 19910
21554 19910 -9328 5582 31510 8239 -47846 -26675 -35945 -21346 -38759 -50181 -27057 -6492
21542 -6492 8582 4059 461 -30236 -59266 -15103 5814 27463 31841 78160 52978 13367
21530 13367 -2935 -19104 -30388 -39314 -24921 -10012 -13619 538 96 2611 3315 -10008 -6989
21517 -6989 28203 33662 -15412 -44918 -63638 -53327 -39450 -39571 -65316 -57352 -32575 -6610 19445
21504 19445 14501 9345 -13431 -14243 15389 28505 -7804 -10141 -33707 -42993 -24560 -30703 2389
21491 2389 25978 9118 22934 27506 2556 -23269 38168 50197 37162 15419 -23154 -31407
21479 -31407 -15070 7495 1813 -28297 -51561 -23991 7867 16094 -3113 -43657 -45609 -58018
21467 -58018 -93165 -52576 995 4895 22729 14681 13244 -23515 -57771 -58235 -6391 -2640 -56990
21454 -56990 -71350 -69286 -38264 -22546 -30001 -43376 -50468 -52633 -33766 -38990 -38583 -36042 -61481
21441 -61481 -48985 -41537 -50313 -56034 -18446 28668 34943 12042 -18769 -32952 9146 -17778
21429 -17778 -27932 -23309 21623 43970 12749 -469 -5211 7719 -687 -4172 11748 251
21417 251 -11414 7401 -13809 -59870 -62843 -25266 3823 8880 25384 -6990 -51197 -52975 -50153
21404 -50153 -65625 -79929 -42565 -34207 -40375 -53594 -77881 -97055 -79728 -115135 -94904 -93977
21392 -93977 -86722 -67202 -20318 -6680 -28764 -5360 -5191 -10671 -3595 -1975 -11810 -32544 -22615
21379 -22615 -25263 -52542 -39678 -22906 -33884 -25191 -19629 -14273 -2006 -17912 -29910 -33582 -37476
21366 -37476 -14944 6453 2968 14314 5737 -5022 -18850 -48334 -58764 -68404 -79958 -99096
21354 -99096 -116531 -130776 -123758 -90100 -92212 -80187 -74049 -51597 -41771 -19353 -27509 -38956 -4124
21341 -4124 10930 -62369 -72066 -25485 -5112 -2682 -20191 -24250 -31381 -28956 -21518 -39272 -32736
21328 -32736 -39494 -63026 -70792 -69997 -55913 -30725 -53072 -44474 -11608 14274 37293 7204 -13322
21315 -13322 -51727 -48998 -6292 -9564 -54509 -43517 -51454 -55301 -52560 -61489 -93076 -84620 -93649
21302 -93649 -75970 -23600 -10013 -3284 13305 12314 9901 -6727 -30993 -49734 -19877 -12736 -35327
21289 -35327 -47126 -35552 -31534 -19433 1473 18701 -16264 -39155 -22764 -15685 8995 50305
21277 50305 15354 -11243 -16360 -41692 -67330 -92690 -45240 -16933 -44956 -40748 -14860 15254
21265 15254 26169 52590 24107 18882 44827 61398 34204 13214 -7764 -38751 -51101 -32375
21253 -32375 -58961 -58799 -13829 3580 1057 12193 -19571 -39885 -46638 -29888 -14271 17356
21241 17356 3198 1139 7386 -4865 4853 6265 -30147 -54157 -76055 -40519 -15431 -16487 -4496
21228 -4496 -2430 29453 -7990 -18270 7397 3022 -28032 -46332 -32753 -9161 16147 1390
21216 1390 -1600 -27074 -22077 -31930 -49182 -60072 -47151 -56691 -29165 -32197 -47056 -41348 -43990
21203 -43990 -25160 3486 10775 38675 39247 19997 7379 -33385 -54603 -52287 -27529 -2063
21191 -2063 -22756 -50238 -58614 -45844 -13433 37707 10823 -20393 -29466 11209 30975 13115
21179 13115 -18556 -54375 -71007 -83009 -66382 -39519 -36598 5709 13665 -14816 -12589 9703
21167 9703 6556 -13103 -34127 -29535 -35870 -52469 -71198 -72620 -98577 -77917 -46192 -28380 -39397
21154 -39397 -28421 -5238 10907 40072 12771 8837 2164 6931 32056 24795 -6924 4015
21142 4015 -10121 -41795 -47795 22588 53646 17331 5464 18585 28321 10302 -1836 24692
21130 24692 -3323 -44785 -12695 20542 30396 57962 34187 11747 16770 4136 12319 5530
21118 5530 -13354 18825 24591 10357 -38648 -65820 -31414 -31191 -58780 -8839 6309 31833
21106 31833 36525 61300 48706 27238 -3341 -69354 -63028 -34724 -43346 -72258 -97331 -85330
21094 -85330 -43581 -38645 -38247 -34864 -37967 -45381 -37052 -41997 -34506 -29884 -25831 1640 9495 -12889
21080 -12889 -25572 -32042 -69916 -52300 -23115 3332 7395 -2645 7878 -13438 15376 35332
21068 35332 6058 -19852 17624 12669 -9607 -20685 -27691 -11757 8780 25927 -52 -1126
21056 -1126 4590 44147 35256 -31986 -17922 -6264 -12284 -23370 -9933 -26778 -39072 -45495 -29321
21043 -29321 -4266 7228 3555 11491 -4858 -13379 -16349 -23036 -16276 -6769 -40632 -62452 -39478
21030 -39478 -35204 -37232 -30308 -27673 -29754 -14709 9133 4981 15457 42485 31985 16304 -13393
21017 -13393 -26961 -11199 -8983 -5842 -13322 10548 -13660 -36430 -18168 -7422 22530 50445
21005 50445 86262 54910 40468 43731 43870 33686 53323 35930 -8147 9150 -935 -5793
20993 -5793 -13707 -329 7131 8775 9656 8045 34351 58716 57298 46386 -2050 -41939 -64617
20980 -64617 -30349 607 35043 9228 2870 -161 12762 32530 38806 -34580 -33247 11116
20968 11116 26540 27147 30645 47842 70982 48626 24067 48647 24687 -10547 5036 523
20956 523 -21443 -67043 -40481 -43553 -54028 -64520 -36220 -23270 11257 13990 -22185 -24372 -50176
20943 -50176 -39866 -35288 -70800 -29334 6368 -25687 -916 -19012 -85295 -76444 -74009 -95411
20931 -95411 -95933 -100523 -82092 -36160 -47923 -19358 -2264 4519 18452 20527 -13128 -31099 -18851
20918 -18851 -34275 -94598 -86913 -50867 -28987 -24933 18848 28440 21902 -13270 -14989 -8763 -14388
20905 -14388 -58914 -56126 -8202 18517 6445 -756 -38538 -53917 -24902 19808 16425 -11973
20893 -11973 -26230 -42433 -27160 -33537 -57224 -68142 -72898 -45408 -10927 -40132 -96729 -110500
20881 -110500 -92041 -75328 -35075 -11048 -34626 -61151 -46447 -21879 -12396 -29220 -51760 -41141
20869 -41141 -60961 -69603 -50778 -64775 -52722 -8042 -7437 -24800 -43039 -39009 -12587 9966
20857 9966 10353 3715 -22169 -42271 -26951 3652 -3889 -49389 -80635 -43401 -16363 -23995 -54827
20844 -54827 -69372 -81910 -98640 -85282 -31243 -23538 -68208 -98813 -62073 -47915 -54254 -54658
20832 -54658 -61563 -77062 -94506 -81370 -58713 -74649 -76087 -79399 -69691 -51959 -33513 -49207
20820 -49207 -48995 -48141 -56204 -61169 -53866 -17975 -9007 13967 -10380 -38026 -19989 -9369 -1139
20807 -1139 -9079 -13224 8473 29319 32655 40758 23068 -16807 -22369 -18295 -51415 -32682 6394
20794 6394 19714 4108 -29679 -24846 -31143 -12426 4568 17272 -166 -9128 -2792 -11859 -6859
20781 -6859 14098 5817 -2262 -27474 -41222 3948 11272 7717 17668 30113 55112 18821 -2659
20768 -2659 -6606 2449 -2404 -17204 -45320 -22941 -4566 -28531 -71332 -65292 -73177 -97818 -91340
20755 -91340 -63667 -65588 -71638 -73269 -43037 8480 30399 27410 23470 -16204 -42569 -42006 -34230
20742 -34230 1358 29697 5471 3323 7413 -931 3060 -4664 -6865 -2348 -12950 -21597 -34736
20729 -34736 -35491 -3305 11955 25468 20948 15276 19956 50693 35537 11340 18143 22728 1236
20716 1236 15547 21297 14137 23439 27153 38705 26827 -3657 -45041 -31457 -44367 -42812 -50935
20703 -50935 -61576 -42429 -632 40257 23893 15191 25168 28468 25185 29503 2982 4815 13555
20690 13555 -14238 -33411 -17766 -5373 13555 -3427 -16606 -16178 -22591 -42949 -78305 -85945
20678 -85945 -71600 -48286 -22861 -13278 -25807 -47601 -4325 20213 8065 1546 -2491 -16116
20666 -16116 -31274 -41816 -29305 25334 49720 52247 44820 38048 27590 15438 -5150 23983
20654 23983 8385 -25381 -34334 -37721 -34011 -584 26988 6379 6351 -4504 26853 22478 -12033
20641 -12033 -4417 -30611 -22092 -21573 -25488 -17319 -1300 210 -6527 9879 3218 8292 2071 -2336
20627 -2336 -3170 18662 19694 9368 -3525 -19286 -26256 18890 32161 29656 4574 6764 14738
20614 14738 8811 -7656 1248 5111 -8207 -23910 -24330 -40743 -80531 -72206 13512 32631 -45068
20601 -45068 -67890 -51244 -52738 -39550 -33137 -37433 -35666 -35400 -31492 -25939 17075 23531 -20053
20588 -20053 -46724 -51262 -16658 -21530 -31139 -20319 -3088 -7474 11293 337 -19992 -12619 -15594
20575 -15594 -15482 -13232 31938 81648 37537 18987 32231 22417 10076 10607 37834 14793 22019
20562 22019 6633 25985 26540 -7547 -3453 4482 5375 3532 4339 -21151 -34264 -25622 -7635 914
20548 914 -8145 -26608 -34120 -35541 -55095 -54381 -36403 1820 37295 22430 16504 -11929 -27787
20535 -27787 -48633 -68080 -51405 -21887 5106 -2176 -17669 -8753 1983 -31139 -43285 -56261
20523 -56261 -19982 434 3520 7602 3508 911 2921 4187 2128 7596 -8061 -12858 4190
20510 4190 18132 3710 28157 3181 -11703 -7994 8500 -749 -14636 -16089 1533 25888
20498 25888 10652 20501 23219 22162 -21663 -27004 5130 -28910 -28470 -18896 9120 -14437 -20846
20485 -20846 -28498 -22009 -21387 -32196 -11141 4844 -285 -31125 -38696 -53238 -16813 -23547 -51496
20472 -51496 -38073 -35707 -21882 -37260 -48259 -34507 -5742 -14962 -27871 -47055 -62490 -61588
20460 -61588 -55629 -51026 -8427 8337 15609 41686 51742 41639 23396 26662 47327 -2017
20448 -2017 -31404 -96268 -101286 -89417 -110385 -96058 -82976 -79288 -69269 -45411 -56697 -64532
20436 -64532 -58190 -44818 -15507 -36235 -53256 -74769 -78111 -58018 -28487 -4837 -2618 22062
20424 22062 34969 16645 -6239 -10998 13124 27329 3433 -12637 -38998 -45863 -48751 -28516
20412 -28516 -11382 -14761 1250 -7160 -3013 5406 -591 -28647 -39303 -48231 -49149 -38275 -45873
20399 -45873 -51952 -77554 -84030 -108077 -86503 -72770 -106292 -84164 -60081 -39132 -44410 -46148
20387 -46148 -53467 -53196 -71141 -102315 -105602 -59863 -33663 -35564 -40523 -15214 17740 9614 -34105
20374 -34105 -56977 -56929 -7450 -8315 -33266 -22402 -7622 -17806 -20674 14730 11285 -31182 -96431
20361 -96431 -85154 -65310 -75955 -74903 -41120 -64535 -86614 -89237 -69168 -74464 -56393 -58476
20349 -58476 -86428 -62427 -12193 9303 -2583 -8638 -33345 -30180 -6804 -39313 -70301 -63791
20337 -63791 -60682 -34776 -26439 -20055 -13548 -29422 -18371 -46084 -77519 -96992 -92543 -43067 -47369
20324 -47369 -31430 -23694 -43551 -12934 18260 1751 -6930 -61343 -88982 -105316 -83615 -54362
20312 -54362 -31225 -53132 -85822 -74486 -56425 -46491 -46439 -66746 -61834 -64780 -12957 2840 -14006
20299 -14006 225 15891 9507 12401 7755 15149 3420 -19891 -3962 43419 23972 11766
20287 11766 -3429 -8842 -22567 -34724 -8115 704 -25319 -41916 -36716 12107 24970 4656
20275 4656 -32949 -21363 1350 2489 -21942 -49441 -76108 -63272 -25552 -19347 2343 6062
20263 6062 24482 45159 61979 61349 65925 51069 44208 21811 -2021 -8233 -17014 -16249 -33918
20250 -33918 -46633 -24636 -179 25703 191 -3447 29220 45823 29691 -3335 -41413 -68151
20238 -68151 -13558 5294 -16727 -7373 -9948 -37290 -25468 -36867 -29212 -27838 -23227 -59455 -50285
20225 -50285 -41047 -57543 -67016 -44299 -16484 9446 -6619 2668 15015 221 -25610 -31201
20213 -31201 -35146 -28417 -39406 -50960 -51283 -62757 -64696 -11658 -6295 -10296 -28653 -48110 -26373
20200 -26373 -10693 -28326 -56225 -46282 -46471 -44992 -50331 -52201 -44640 -3106 20974 58578 41642
20187 41642 9980 7365 13780 -11008 -8043 -2437 -3123 -21732 8461 20444 7801 -19588 -42651
20174 -42651 -26075 -1495 5548 2649 28990 27133 8892 12333 -27545 -45614 -10211 -19548 4840
20161 4840 -14485 -40407 -35145 -43401 -24393 -24257 21424 54142 60180 32455 5964 -13298 -16465
20148 -16465 -12746 -11157 -16153 -46353 -60455 -22298 -9831 6143 84920 127561 67030 24565
20136 24565 26944 33185 43303 59098 71179 92230 75204 80009 155932 268012 337820 354451
20124 354451 358412 351897 344031 329057 323589 259537 171743 144674 134283 109021 99009 80166
20112 80166 71586 71612 66673 35985 -4153 -8013 -18051 -38988 -68230 -31639 -10296 -40661 -38900
20099 -38900 -22118 -17701 -17470 194 30497 9087 -7102 9347 8689 -9989 10032 5991 -20034
20086 -20034 -24751 147 16583 -27751 -40910 -9610 -16463 -47358 -41047 -48599 -81849 -83886 -81238
20073 -81238 -39267 -29208 -45564 -17176 -16669 12867 -9204 -54344 -68659 -59762 -59648 -29123 -398
20060 -398 -13673 -55915 -38683 -44104 -54792 -18716 -9962 -45629 -72139 -82805 -58205 -50117 -64817
20047 -64817 -39440 -42121 -65900 -58997 -16518 21275 -10576 -33618 -55181 -35713 -10514 6104
20035 6104 -4397 -6536 16186 24002 -26252 -76314 -63738 -45510 -39903 -24792 18108 26378 41871
20022 41871 3326 -32041 -33654 -5987 3572 950 -22238 -54730 -44419 -35945 -27916 -13093 998
20009 998 9817 31328 23815 28067 43144 66823 67609 72185 18160 -40175 -50911 -9117 64326
19996 64326 95020 53221 35556 23006 -21405 -16584 794 2395 28994 59636 47611 31189
19984 31189 8900 -20451 -3950 42189 82223 81257 52016 41452 -21594 -58339 -22366 8493
19972 8493 17811 -4450 -10287 -20077 -44539 -75326 -54544 -53333 -35170 -10607 1702 8119 -2783
19959 -2783 -25442 -39321 -21961 2720 9871 -16638 -22737 -37980 -42785 -15798 5682 -19009
19947 -19009 -36368 -66281 -69569 -17768 35714 26365 20720 23031 21907 19444 1195 19941 88059
19934 88059 82185 73947 120444 140437 266670 382656 500490 628344 698019 666931 576800
19923 576800 436991 307908 187788 115717 84309 73210 93439 119267 104930 71291 32821
19912 32821 8384 45619 39836 -1801 -23183 -16672 -49694 -61552 -79900 -37141 -10638 -48051
19900 -48051 -49591 -23823 -15664 -22143 -39896 -45111 -50626 -30757 -62632 -78933 -58887 -45952 -50357
19887 -50357 -61854 -33812 -27525 -32094 -16716 -17247 -12164 18924 22880 15681 11738 15611 3504
19874 3504 -11740 -11157 -20005 -1987 -24860 -36380 -37542 -35089 27420 -6747 -67934 -104805 -95623
19861 -95623 -54034 -36448 4224 -10432 -45060 -56532 -67951 -89857 -79105 -44421 -46332 -51241
19849 -51241 -37427 -1775 -1710 23233 38944 34411 12269 -16405 -9693 -5865 -40195 -22671 -11152
19836 -11152 -16780 -31007 -41677 -42597 -4585 -12643 4758 -41884 -61298 -81220 -112415 -109046 -85744
19823 -85744 -45543 -24371 -54696 -17693 -30573 -34526 -18295 -20284 -4812 -10133 -30247 -25261
19811 -25261 19736 20547 -17100 -55513 -69031 -64397 -46155 -23614 -26902 -75027 -105660 -84203
19799 -84203 -37243 -10653 6781 -5183 -16413 7383 -39836 -67827 -35893 -35112 29046 71825
19787 71825 26575 -4292 -21466 -37368 -24087 -10971 -16658 -21218 -57949 -26458 -7199 -22659
19775 -22659 -50435 -66722 -45415 -27110 -11847 -19595 -44496 -56450 -60970 -25500 26737 16382
19763 16382 -3125 -10377 -3050 -24927 -46169 -45882 -4411 -23719 -31359 -11525 -11918 -17149 -26699
19750 -26699 -43274 -41362 -65333 -49579 -22175 -5634 -12274 -28023 -48005 -21362 21285 3512
19738 3512 2819 31919 19413 -8181 -23477 -22799 -35004 -25694 -31210 -39190 -57552 -56585 -31146 -23183
19724 -23183 5340 -13123 7865 20038 21265 42765 60751 106668 93275 67128 19696 -25819
19712 -25819 -34362 -23210 -11401 -5077 -25790 -57508 -57690 -69304 -46790 -9586 2468 17226
19700 17226 49966 79937 57842 -13363 -23286 -13263 -45515 -84479 -45817 9121 -22581 -41355
19688 -41355 -61042 -46871 -57818 -75076 -63150 -48532 -17234 1019 8388 -14041 8028 14014
19676 14014 -549 -57482 -47595 -2374 264 15225 12726 -9128 -16540 569 -25939 -80621
19664 -80621 -62650 -14927 -20891 -21886 -20115 13091 23044 38630 50157 36259 19721 22210 758
19651 758 8296 4013 -48579 -23468 18004 32014 30771 23679 2034 3938 -9245 -46865 -66426
19638 -66426 -59034 -19954 -33362 -38633 -31173 1411 36923 40863 -3392 -16564 3070 -16734
19626 -16734 -51761 -80477 -75945 -68329 -63668 -39108 -2487 1507 -3766 -1296 -23065 -23239 -28490
19613 -28490 -43276 -78423 -49722 -8011 3776 -25801 -6827 -5110 -16840 -9195 -7971 -38297
19601 -38297 -15415 -6056 9042 -10535 -22672 -57335 -57287 -41162 -35760 -41600 -9661 -18091 4880
19588 4880 -3200 -25082 -14512 -31669 -33254 -61970 -56653 -15900 -13628 -10219 -1016 -9306 -8638 -20882
19574 -20882 -37689 -20744 828 13747 -3332 14760 20243 19065 -8724 -30363 -30111 -72764
19562 -72764 -67355 -45170 -26575 -3144 -8873 40654 57324 37648 24520 28229 18681 -15194
19550 -15194 -12559 4191 27466 24786 21422 15825 19305 7636 5678 13413 54646 95550 105597
19537 105597 113375 113829 88746 55252 57319 97416 64078 37967 34622 -3941 1514 4935 -2331
19524 -2331 -21382 -18443 18475 24044 9680 6564 12993 20980 11965 -24903 -16468 2318 8955
19511 8955 4875 32 17506 22590 8812 -26640 -46329 -69335 -35615 -21433 -16319 -15745 -25693
19498 -25693 1384 4919 1509 41956 33752 25759 26294 10554 -6516 29011 13032 21515 7071
19485 7071 -14434 -25712 -34196 -16740 -42279 -62794 -25386 -35999 -37479 7734 26795 34428
19473 34428 20385 54554 50865 47353 52152 65890 9822 -26087 -27893 12571 59467 63997 29038
19460 29038 10531 -27156 -3304 12539 -13791 -19158 -5717 18836 21280 -21151 -26131 -12900
19448 -12900 -22625 -50909 -58356 -35200 2111 61636 68397 27067 38069 4980 -37288 -42919
19436 -42919 -59455 -34209 -23628 -8866 -32669 -35726 -9040 51317 85261 80436 18737 -4464
19424 -4464 7012 31697 13895 -2760 -3906 -7958 -27205 -21325 -53310 -61418 -54343 -41830 -43740
19411 -43740 -28036 -29646 -45854 -40008 -37626 3204 -1123 -31659 -20703 -14856 5313 32520 19247
19398 19247 -24916 -28270 -51063 -41548 -53517 -63382 -59580 -47396 -54331 -44108 -66445 -97787 -124197
19385 -124197 -118941 -115231 -92949 -79968 -74766 -80212 -65380 -49271 -34874 -32244 -17540 -19960 -24097
19372 -24097 -55179 -29270 38106 18690 -15542 -319 -9607 -11544 15862 20237 -26729 -47573
19360 -47573 -8150 2297 -11696 -23147 -10011 13383 29836 20656 400 -13590 -40098 -61465
19348 -61465 -50769 -58680 -54393 -34148 8891 -12361 -51856 -51453 -61769 -59634 -50299 -81046 -62076
19335 -62076 -69995 -67506 -18826 15621 41136 47729 43002 61625 85312 107624 112786 164327 243997
19322 243997 297988 384122 460295 499870 425245 329413 253749 200275 145200 108993 105232 96418
19310 96418 88942 96364 80589 35563 29320 21282 -10506 -24676 -26001 -34038 -22735 -6886 -4799
19297 -4799 45769 57110 32214 9840 29550 25246 -7635 -32225 -52949 -43406 -25047 -51134
19285 -51134 -52288 -22491 -6482 -4652 -17015 212 22018 45625 57360 46945 22380 15136
19273 15136 36101 34917 15542 791 -11143 -11011 -10984 15503 54432 67864 60838 41500 35526
19260 35526 23711 53755 79542 83397 87179 57270 37649 -4778 -9217 1332 4234 24903
19248 24903 18423 55526 70743 49746 -2771 -11192 32122 45557 53608 38371 86712 120660
19236 120660 109344 138765 167450 154230 134321 146770 170178 219067 287626 329493 423129
19225 423129 468393 509981 520785 544401 608177 654784 663386 648582 624161 576206 490080 419193
19213 419193 352824 311923 232544 183773 199558 179634 171603 137893 125249 132125 92027 78041
19201 78041 51060 25848 74846 107041 72141 57402 75107 82851 78220 42485 33127 44012
19189 44012 59138 84256 88538 57923 27286 28627 53772 96408 118498 157042 153802 137444
19177 137444 140242 140269 151249 154923 147725 141983 165750 132631 130437 144616 122574 90140 83048
19164 83048 81569 96677 123960 170076 186773 160120 140565 151070 161439 133791 105398 86029
19152 86029 51042 21608 -9909 -32197 -28391 2480 -42381 -55605 -42983 -26311 8438 34401
19140 34401 43670 -36541 -49655 -30876 -21095 -1097 17214 -42409 -56618 -76262 -70200 -3188
19128 -3188 54933 65517 57676 9290 4360 17091 20195 -11640 -63798 -76606 -97134 -46045
19116 -46045 7454 31070 2483 1514 -6853 -28639 -29212 -21418 -10382 -42551 -43816 -15488 -4756
19103 -4756 27771 71162 49159 16372 35635 10899 -30702 -54148 -50525 -53503 -35793 -6349
19091 -6349 13877 5628 -17722 319 4825 21692 11446 -2747 -3922 -11889 -59301 -61676 -29885
19078 -29885 -2394 15064 31041 36850 25498 28615 28672 13799 -3919 7227 23812 -4918 -43919
19065 -43919 -79784 -101926 -62697 -23651 -27050 -2701 13821 1341 12182 24539 -15741 -54278
19053 -54278 -56702 -8194 32193 31192 62894 82721 56553 17160 -24298 -66536 -57103 -25210
19041 -25210 14115 18093 -8902 428 67872 90988 100584 70548 53754 34491 4556 9968
19029 9968 18694 -19643 -19932 -28735 -51466 -12605 -4723 -15395 -15100 17215 36816 44548 30473
19016 30473 43236 44188 70292 75494 107046 99599 85682 47107 57652 98073 112027 86059
19004 86059 73585 58076 5822 -26966 27554 30949 45774 41957 26135 47026 61561 67664
18992 67664 21210 16249 46549 33212 12958 -29995 -55509 -47932 -20421 -27844 -51934 18271
18980 18271 44527 26401 27096 32071 21948 23961 48307 22723 31942 58723 36290 32941 38026
18967 38026 24056 19671 7033 48258 83107 51170 11455 49560 81692 121923 109692 112899
18955 112899 130007 127627 83823 37551 11761 -6652 -16545 -29365 -5507 23764 14106 23808
18943 23808 36195 60780 72664 76538 66089 47270 -2799 -33051 -35642 -26961 -22668 11850
18931 11850 10678 9325 25718 19281 16146 -15991 -14545 -8679 6715 34269 37102 30164 22245
18918 22245 63471 84452 47696 17606 15965 17466 53589 47804 35281 50461 19321 -18653
18906 -18653 -17949 -39433 -40433 -39705 -36252 -37378 -2866 -11528 -17218 7486 9810 19572 62187 48406
18892 48406 -1940 -32239 2161 -19839 -46081 -17813 20539 37698 22531 -12656 -7316 24897
18880 24897 51464 46394 38535 45277 42127 55400 51940 21123 35635 31314 16797 43960 82665
18867 82665 84560 78400 65284 32060 38790 56115 55376 54278 23556 36064 -1947 5496 -16088
18854 -16088 321 28891 21989 539 12477 19303 16024 -3067 -1332 35923 31460 38323 30755
18841 30755 13472 33143 28992 18117 17370 29011 29787 15871 40511 25096 -17100 8964 22843
18828 22843 18598 25038 44395 28357 15734 15203 -497 -9246 -7391 -913 -1641 -12917 19820
18815 19820 15454 9263 8043 29523 24036 19635 19109 19236 44560 -2434 14065 29827 4773
18802 4773 9264 64008 63161 47424 30379 -11307 -67887 -89004 -39989 -58227 -51019 -27401 19936
18789 19936 47114 77334 78439 34444 14344 -5206 17711 24225 46845 97597 120212 99996
18777 99996 77327 62906 61371 90197 93296 92819 89001 75082 81296 92217 100003 36249 -13154
18764 -13154 -22186 -24539 -23815 41357 63525 28055 21153 56031 63035 9896 -5781 11990 5718
18751 5718 -11651 -31289 -10626 72847 115537 103975 68552 43621 51620 38921 29341 46374
18739 46374 45343 33695 36511 51745 99272 131199 113607 58170 42700 12585 -20038 -3429
18727 -3429 13436 13700 -10964 -25718 -27302 14188 42886 40886 59914 97587 97766 79296 62991
18714 62991 12528 -20019 -20711 30182 86225 118347 113031 92778 106368 50750 22070 25682
18702 25682 31182 56249 97050 96547 74778 76855 84361 70013 106187 101744 99391 88793 74242
18689 74242 53619 62456 86335 54093 42293 18012 1331 48429 103120 125995 131801 104982
18677 104982 59701 36762 65477 84216 71580 67103 71901 83671 73100 48995 28072 86404
18665 86404 97177 91031 65233 63916 115472 117618 83557 64362 28048 17437 42113 99813
18653 99813 94548 85266 117427 119870 109857 92126 70995 76385 86013 64477 51597 54160 32597
18640 32597 26571 16609 -17197 -18125 14944 47086 67273 56712 47999 64542 62973 54880 83263
18627 83263 66770 63032 42932 13179 3901 39478 78401 95009 40343 -18080 -13073 10221
18615 10221 5156 9865 -9824 21836 8546 53816 81428 75321 66401 32007 -13524 16611
18603 16611 55862 69450 81260 69620 71235 111992 123814 136534 142052 78971 63094 58105
18591 58105 34129 43027 86007 77610 41448 63665 39080 23633 8803 2224 2808 8136 14627
18578 14627 55107 25891 11831 25286 45033 69570 45521 65257 88875 68433 61325 43290
18566 43290 52409 61936 84319 76521 46275 45590 94868 124164 176306 209550 206024 258861 295711
18553 295711 302516 264628 227793 258427 335036 392833 449597 453150 413213 380962 397823 413480
18541 413480 446129 424932 403889 424310 434102 421971 403615 406061 400891 361697 320716 310834
18529 310834 319798 312371 266332 244898 199769 191053 216970 262722 299271 278360 273486 290309
18517 290309 316871 359831 352662 362047 399941 448974 458060 442127 439628 446109 438177 487897 507547
18504 507547 527632 552805 574789 627578 618838 590519 593646 590099 549443 534167 517453 539245
18492 539245 530832 529324 505208 465071 460401 429007 362662 345697 313021 256994 219071 214195
18480 214195 166119 186878 197923 197268 202764 192876 216720 273005 293634 289190 284810 300154 372713
18467 372713 447612 510059 538545 516727 523895 564181 513127 509019 541348 525458 525356 486557
18455 486557 437935 441254 441342 373226 315348 290774 258226 241781 220035 175098 175468 163486 138206
18442 138206 136461 155379 144175 127403 90457 94009 150591 165327 158155 137475 140231 187411
18430 187411 202690 158932 110520 104056 127450 163427 173461 205327 228464 212531 215335 215215
18418 215215 255010 283146 300489 273281 244840 281023 327818 339713 337716 314506 322701 383811
18406 383811 362220 286580 228160 203882 207380 219494 218672 192656 182872 163403 141353 127691
18394 127691 128780 143969 117354 108272 121730 100019 51568 22007 2695 48465 115742 113516
18382 113516 87850 72552 35702 23953 68000 104842 92242 101490 144719 149373 167525 167969
18370 167969 143350 144306 151786 133001 70310 84709 103921 102495 109539 102777 99817 132365 127661
18357 127661 128592 88210 74901 118001 156061 155551 142279 97158 96633 95293 89186 64980 99766
18344 99766 132856 132009 127591 108211 112331 109899 93475 91403 125081 164801 173206 146501 136177
18331 136177 110985 139563 130570 118893 148670 164024 151287 141475 133392 109400 100318 98600
18319 98600 111789 142876 135296 142679 140877 144379 129979 156466 138230 112134 101645 116082
18307 116082 145608 130956 110719 131418 172846 193076 190417 219589 181635 148275 153470 141419
18295 141419 152413 161333 218154 255290 256618 290046 273822 251162 220040 223049 220363 210185
18283 210185 232078 216426 228977 263186 247627 240877 200877 217534 301766 347939 297321 267691
18271 267691 294787 249512 233040 232233 264135 254091 241824 248765 257401 236518 235143 242743 241348
18258 241348 215615 209065 218710 238340 250787 270354 339994 388007 346756 293218 249446 213657
18246 213657 187978 183980 195848 211350 260760 263675 275294 261760 249065 243032 270191 287711
18234 287711 311169 305074 321695 320678 276081 280893 284687 261143 278122 309668 313119 337566
18222 337566 350979 362975 318166 273706 258505 255071 288019 301552 298078 331495 334030 301806
18210 301806 257286 232087 226488 235819 292999 304900 314397 305092 310715 276364 240699 222489
18198 222489 194740 227044 240073 204919 173608 195982 235024 249618 239137 215467 218018 230891
18186 230891 250426 264917 232098 222927 269959 278000 280885 262965 272866 321940 357138 379060
18174 379060 365582 362592 401438 405146 440074 430967 409802 431487 467809 482912 473419 438015
18162 438015 431244 403173 378139 369182 388631 383850 376687 375246 385719 348735 313352 330850
18150 330850 360201 326084 338436 378302 373305 355318 334017 343322 360141 386594 404846 399925
18138 399925 374392 337025 329229 360527 340799 303985 335558 346999 382707 404423 462596 509908
18126 509908 483135 496502 486174 473747 474493 461790 514739 504314 477748 502166 508984 480336
18114 480336 473979 482682 491074 448371 425194 454789 485694 481407 533659 562021 581094 584930
18102 584930 598029 651299 726991 747727 749451 815683 835256 857503 849292 770771 682788 670722
18090 670722 671837 686849 700676 721492 744726 785987 824968 859040 912110 947080 1031886 1127053
18078 1127053 1207348 1277703 1355220 1467623 1576063 1710843 1826186 1962021 2076296 2203264
18068 2203264 2400557 2624123 2865162 3132341 3493169 3942606 4498746 5271813 6319185
18059 6319185 7725066 9518927 11704901 14248054 16950250 19708404 22750617 26295239
18051 26295239 30500525 35316125 40521427 45662438 50109109 53679153 56634854 59222713
18043 59222713 61283548 62760047 63877274 64604189 64411104 63085912 61064094 58557205
18035 58557205 55187189 50725756 45641233 40698816 36362722 32636528 29451704 26545845
18027 26545845 23738465 21037526 18769181 17319539 16877466 17466852 19120327 21609678
18019 21609678 24062028 25827165 27538294 30695423 35926104 41950482 45453487 45581257
18011 45581257 45794794 47580599 50298203 53478236 57030491 61379099 65660026 67847916
18003 67847916 69194277 71785051 75252378 78448061 80679628 82055058 83116145 84050323
17995 84050323 84863897 85085898 84064324 81778990 78910208 75869278 72106546 66913439
17987 66913439 60600326 54029698 47924032 42631501 38187437 34230294 30414017 26720539
17979 26720539 23478754 21014727 19536072 19140980 19925370 22134924 26095895 31980434
17971 31980434 39163798 45570108 49623024 53573280 61132740 73123993 85354566 89097526
17963 89097526 83819093 78214854 75600863 74798034 74608067 74403158 74405883 71622999 62319060
17954 62319060 51078128 43306105 39213212 36163732 31764208 25924323 20498738 16468518
17946 16468518 13697909 11748914 10333997 9300420 8502191 7867561 7377796 7027063 6800606
17937 6800606 6686519 6641417 6639064 6624464 6603820 6669181 6819875 7087210 7480712 8053397
17927 8053397 9000971 10496683 12767918 16095358 20462492 25089983 28557881 30819436
17919 30819436 34026701 39964651 48046241 54034545 53499240 49793648 47508112 46735901
17911 46735901 46553239 46477578 46599859 46667868 43609186 36783108 30323514 26390045 24184963
17902 24184963 21901059 18534323 14724479 11500355 9170514 7557337 6395819 5583873
17894 5583873 4994204 4504886 4070240 3660900 3349047 3149716 2990330 2868191 2784002 2649177
17884 2649177 2508017 2373991 2267995 2170831 2095984 2047102 1952942 1813102 1678608 1593118
17874 1593118 1501607 1434191 1357118 1293130 1247071 1203508 1146209 1102173 1089227 1040767 1003239
17863 1003239 972468 933122 893825 914282 921502 928170 945630 923747 859834 844464 868489 840942
17851 840942 787188 767691 735213 738608 748416 708703 718547 727588 711491 680567 668945 671880
17839 671880 668386 699373 704803 688305 673354 594245 567233 561601 565095 554246 553194 552555 535776
17826 535776 578348 565152 551456 563239 566354 574282 571383 561562 570185 595682 591234 596819 606588
17813 606588 572124 588925 581257 555436 529630 501286 513313 553603 561950 539641 494664 447132
17801 447132 464006 491457 522897 516387 510590 516139 519132 537863 546872 556215 542511 518554 494576
17788 494576 469979 476384 487361 451281 439719 493884 540304 501378 429014 451856 510703 543654
17776 543654 523649 487480 493693 506035 492703 524949 543071 578653 576137 557077 521550 521982
17764 521982 538829 578727 569763 547300 553025 550043 533369 532742 563288 587900 563215 511886
17752 511886 469672 424354 359454 355828 403629 399784 411259 405847 413710 418285 426134 439198 451486
17739 451486 475056 450278 414002 379056 367430 386925 411676 435714 438634 488919 489930 463248
17727 463248 452904 470928 474244 480891 496652 458099 454498 466504 475136 504058 546857 571316
17715 571316 558978 568760 602365 594817 604249 587783 560408 553961 566224 562287 544221 500896
17703 500896 425333 397896 429614 433092 422516 432150 417016 374899 389984 462242 450664 450112
17691 450112 492183 505423 490856 501943 518715 530594 516517 495301 479497 488617 476685 493895
17679 493895 505785 515355 581598 660104 673820 677601 725163 732821 747261 743462 780376 850949
17667 850949 890441 918167 938066 939394 988722 1055843 1079464 1147761 1268085 1451545 1586327
17656 1586327 1615667 1642923 1626071 1653821 1716399 1767227 1825762 1898875 1956327 2055247 2250594
17645 2250594 2488161 2788862 3145371 3598186 4185625 4994840 6207912 7939522 10490687
17636 10490687 14343792 20141650 28538570 39420472 51057086 60084201 62246872 58157517
17628 58157517 53559820 52818935 57068343 64044954 69185502 66664446 55842736 42449358
17620 42449358 30882585 22547238 17107964 13610784 11255611 9552643 8313617 7464644
17612 7464644 6832222 6365103 5941618 5604134 5345396 5195954 5165629 5157790 5107333 5052308
17602 5052308 5040696 5058924 5133636 5270136 5502851 5800603 6160523 6658137 7427235 8600459
17592 8600459 10390913 13112615 17169251 23273233 32124002 43774296 57283783 70393521
17584 70393521 80087081 86134660 90042098 91110819 90944355 92938477 96857519 98627653
17576 98627653 94676650 85700139 71840261 55814307 41522224 30682072 23166094
17569 23166094 18170542 14785664 12380544 10609765 9323279 8322835 7520631 6882356
17561 6882356 6400995 6038589 5789340 5628798 5473037 5315935 5130527 4925642 4764987
17552 4764987 4628575 4544617 4490521 4499090 4532087 4596307 4803690 5180294 5865099 6954646
17542 6954646 8666696 11238348 15170158 20845398 28246653 36099263 41871206 42438243
17534 42438243 38925510 35517552 34743189 37108786 41120041 43601218 40928673 33719042
17526 33719042 25563322 18695265 13721705 10453593 8346455 6928031 5927639 5181833
17518 5181833 4602968 4177405 3813983 3516003 3276055 3103242 2962706 2838024 2759243 2664099
17508 2664099 2465718 2301725 2183009 2076921 2029444 1925566 1840438 1694988 1522878 1389995
17498 1389995 1332467 1343339 1294548 1241525 1220599 1158658 1086467 1042729 1038597 1083473 1095945
17487 1095945 1073918 1099982 1136102 1156893 1166905 1146231 1124255 1151614 1183654 1192824 1179671
17476 1179671 1169479 1183012 1174893 1166928 1192849 1219658 1238509 1263011 1300855 1368107 1487929
17465 1487929 1576091 1667492 1771822 1871825 1972939 2113016 2239367 2375612 2499711 2623083
17455 2623083 2687103 2794572 2915758 3056522 3231985 3459759 3756085 3987240 4237694 4557593
17445 4557593 4948894 5385758 5982421 6889799 8131593 9949864 12692857 16659824 22224378
17436 22224378 29539060 38235788 48018498 59458318 71419939 80318965 86225610 92443730
17428 92443730 98323674 100032898 98828377 98115360 95179397 88661043 81980744 76224070
17420 76224070 68465638 57639387 47070029 38496887 31041462 24573984 19598416 16142593
17412 16142593 13742338 12099303 10906489 10006456 9271062 8679830 8170651 7751537 7414004
17403 7414004 7083391 6774766 6517080 6282400 6121047 6035693 6058789 6177906 6392342 6795998
17393 6795998 7448576 8443609 9986929 12362823 15843687 20815487 27266961 34791652
17385 34791652 43422910 53701474 63878232 70747751 75698190 81485849 86156740 86539705
17377 86539705 85076126 83331601 78858072 72686507 67281648 61688514 53395530 43818424
17369 43818424 35705764 28948056 22870311 17893622 14298088 11777645 10011211 8718964
17361 8718964 7750169 6945945 6276978 5679676 5186235 4770219 4393160 4071468 3739231
17352 3739231 3448789 3186656 2985939 2787439 2574697 2369330 2212979 2086302 1970826
17343 1970826 1841658 1744800 1712075 1658305 1573110 1514587 1470788 1408053 1313376 1270084 1239037
17332 1239037 1203465 1207738 1203373 1167432 1108219 1076812 1060643 1016741 1001347 1024915 1058605 1020370
17320 1020370 953943 929185 918859 885770 942765 988999 954462 904740 861681 846265 861511
17309 861511 837386 782014 777829 751338 742778 731447 749646 789851 795910 792096 775509 781697
17297 781697 761766 772450 775246 730546 712273 721741 696992 734209 770840 760669 770619 763222
17285 763222 753621 720213 680758 661282 695226 689344 700497 655993 631076 654156 666617 666890
17273 666890 628490 600094 581797 569872 562281 570267 522650 501612 485528 495135 479008 465492
17261 465492 470557 467220 448278 460913 478184 497501 486596 439385 430420 421456 428190 425725 441355
17248 441355 439783 406183 330040 310434 303812 328253 366727 380678 406662 386641 331661 304394
17236 304394 306175 312308 320417 309852 293244 293615 302468 290861 289525 286664 240275 200498 187840
17223 187840 213671 247825 244036 223157 230471 253923 229692 195449 178027 180025 228817 267662
17211 267662 284620 311445 307276 273520 247872 218155 247402 242302 240701 260931 277895 286920
17199 286920 291772 289469 277654 260200 248431 280027 326291 323402 291194 231805 230702 241899
17187 241899 216002 257829 291310 307507 270918 220620 179089 181528 178360 189212 188742 156410
17175 156410 153459 204212 181441 139728 149347 209870 232633 190166 182688 226307 236467 234378
17163 234378 237271 244337 238753 252221 255375 232226 206156 232450 279375 281692 268453 279445
17151 279445 287251 253584 235325 237812 263849 286708 287577 282562 279923 279503 265121 256287 246297
17138 246297 237596 221235 209265 204475 191578 214388 242470 248617 229596 219552 208011 220161
17126 220161 258167 291871 330926 377213 420714 432559 438200 418568 387216 355451 342297 339024
17114 339024 310656 308231 285151 258877 244616 213364 189497 182120 173149 217200 257359 256791
17102 256791 220823 196054 206210 221047 224564 230091 234408 234997 251432 248435 188446 178032 202625
17089 202625 205938 180267 158560 178624 161727 123902 138998 168164 171772 216118 247819 311615
17077 311615 380820 451290 548778 578291 589493 571111 590227 639075 648133 658936 600259 548434
17065 548434 512896 449084 385252 307556 254708 191339 191867 213092 223605 238598 250397 204834
17053 204834 185278 172959 170896 156990 174021 163678 125594 107427 111619 121008 127738 114379
17041 114379 143485 142155 123192 119843 102157 89141 111637 130365 139677 145505 174735 235743
17029 235743 299358 378187 430594 441364 464360 485006 465791 443210 392570 373598 370364 304068
17017 304068 257248 208586 153561 111672 110433 93216 86967 76059 47545 56258 63578 93471
17005 93471 143275 165441 134079 114901 83849 89196 118985 111851 117064 91053 81321 74296 65291
16992 65291 63676 79993 87586 78024 79656 100420 85617 91597 118960 128095 101716 77162 59964
16979 59964 20070 10914 48411 58558 80272 117153 141010 95487 59618 51443 26899 -12085
16967 -12085 -7610 -4179 31149 79677 88431 86470 116178 119151 108072 67572 44223 44328 44226
16954 44226 26814 17583 21463 31488 2470 -30682 -8548 20520 52525 60937 60844 60937 85373
16941 85373 123831 113848 90309 89062 94135 102482 95949 116299 129569 108120 57778 9984 -500
16928 -500 26232 97402 154119 200549 240464 255735 262015 310071 359546 409225 438533 457228
16916 457228 472247 525748 603860 617014 572483 570303 563267 531649 500926 466650 377390 303639
16904 303639 282341 261682 226676 188689 160564 117929 108520 123401 169926 135546 93302 111699
16892 111699 146129 151690 151072 177275 150390 151439 149583 137626 160244 179528 199856 213958
16880 213958 173485 178165 215246 251137 264656 282327 289991 301637 326788 395816 472995 520888
16868 520888 507996 553317 595573 583805 548069 526966 543213 492683 462974 449072 397209
16857 397209 365502 294940 235671 194900 167807 124871 67116 55795 38597 41274 69024 63289
16845 63289 121034 111677 91092 83160 100111 101356 111275 100402 54205 43961 30167 53407
16833 53407 70549 48067 53023 89363 123868 89410 104065 110196 131320 94476 119934 168373
16821 168373 198039 186421 146815 99564 41767 -5011 4943 53095 105752 109453 73920 73347
16809 73347 85231 78863 73287 78837 75868 54729 47584 27626 39932 68861 79921 61294 43950
16796 43950 15258 10959 25117 58057 32030 31205 56915 30763 -574 -13076 19426 66828
16784 66828 49187 42012 -11448 -2742 6916 19699 17189 5482 -20401 -21728 -17444 -31416 -10664
16771 -10664 17376 12860 16394 16300 7524 -17460 -9292 21771 9709 2230 5951 28730 42309
16758 42309 38136 42925 -7453 -14487 -10086 -1801 7676 37896 42501 18507 -11397 -13629 22863
16745 22863 67455 16898 -15852 -7081 36825 59959 73288 104094 97047 80390 42901 23149
16733 23149 13278 34740 54725 21139 15435 -1330 6712 13470 24812 53795 50073 50079 36797
16720 36797 13696 14624 -356 -2629 34634 60399 20660 -28321 -8220 -9032 -31526 16744 40052
16707 40052 26980 56042 59194 40151 20816 13351 23234 16242 18349 46053 103007 96176 61102
16694 61102 31761 -15693 -11205 14913 -15509 -2675 -295 -3409 -8717 -44887 -56416 10563
16682 10563 58357 46031 58396 43018 23278 -6941 16140 -7040 -18732 -41840 -15928 29907
16670 29907 81225 93770 79700 93304 80442 53060 65486 37285 26248 7023 50921 97042
16658 97042 79329 73986 20658 -2452 4485 23393 30543 40742 7546 15231 27547 11263
16646 11263 36674 26155 17905 31467 54199 66659 32522 27027 19794 -2248 -21355 -29258
16634 -29258 -11063 12417 26467 47593 51023 35098 31052 76486 70559 39659 28271 -11997
16622 -11997 -34761 -30180 49733 85359 41369 15150 -20622 -26555 -46688 -20589 -25658 3525
16610 3525 32679 -4449 8425 30292 13900 -12907 -39256 2122 31223 74756 57883 -1658
16598 -1658 -25845 -4083 15746 49858 42087 35278 31177 31751 45354 67123 76750 34560 22958
16585 22958 29825 19443 48171 98101 80636 57358 56434 69365 63915 79082 92135 59482
16573 59482 48584 30574 12775 5487 12030 18840 24072 19230 26711 53893 71520 24366 13871
16560 13871 32174 28111 28614 -1828 35107 67103 71153 46078 22306 25135 40464 40945 30319
16547 30319 29276 20787 14484 17830 38584 13704 23488 48714 66670 81379 64183 26394 51798
16534 51798 60433 35399 39363 47423 67295 65082 24297 11204 20978 303 8172 48034 37866
16521 37866 18825 12938 -24330 22276 22314 25211 41085 54695 58247 59384 11781 -24299 -15756
16508 -15756 30622 19033 5430 12747 16091 19662 12651 -4294 -30100 6710 23356 16069 42985
16495 42985 35815 -13505 -9028 12545 -25089 -34583 7947 55186 48918 36665 18617 29171
16483 29171 53899 66258 72398 56428 72166 105154 129189 128841 136229 143272 167957 212027 237322
16470 237322 265705 271366 269950 268027 277145 274503 241048 196981 187877 192978 176901 193712 174664
16457 174664 142747 126019 109922 116685 143534 138588 124463 122880 96162 79429 77918 51198
16445 51198 36875 -6183 -45185 -36751 5679 29582 57800 14587 -3236 12018 42310 43236
16433 43236 51483 37018 27515 15014 37101 69825 76337 82327 68221 89387 98353 81915 68276
16420 68276 62047 74870 93954 78378 82633 111772 116274 111377 111803 104519 61890 50827 56515
16407 56515 47021 74965 119008 120656 112762 93415 68837 44572 23264 -4229 1241 32776
16395 32776 58255 74218 76295 103388 88746 49023 27415 12725 -6144 -19689 -11967 19845
16383 19845 24608 49413 27735 10904 -33820 -14331 -7247 16808 17711 2537 46075 114759
16371 114759 108501 89567 91831 89062 114312 111750 79066 63530 66117 92707 136255 156237
16359 156237 168566 143866 106901 79346 88361 83206 77854 52369 27822 42854 46454 28807
16347 28807 45947 57555 27685 83 -13139 -64 -26467 -38971 -45297 -33968 -4752 8397
16335 8397 9576 -12242 -11016 -31384 -1055 -371 -11647 8713 -2563 5647 18158 35392 64101
16322 64101 43422 -8253 -3731 -19523 -44725 -62558 -32353 -40808 -49759 -13459 -5444 1462 -34851
16309 -34851 -35353 -24958 14482 13449 -6385 -23942 -37059 -70679 -78537 -30816 -18818 -28711 -33532
16296 -33532 -51607 -63557 -35897 -2635 13195 20909 -24581 -54604 -43004 -25526 -20553 39575
16284 39575 68023 22782 13834 -36360 -69559 -65363 -68753 -100642 -127334 -87864 -69226 -44804
16272 -44804 -23915 -1178 -11463 -13115 -16126 -23823 -44988 -37800 -23123 -15503 -7786 8847 12517
16259 12517 5361 -5289 -29411 -58711 -33080 24478 8025 -25575 -58811 -20177 -30339 -49724
16247 -49724 -18647 9220 10824 -8396 28961 23803 7827 -12632 -21887 -11072 -26175 -7639
16235 -7639 12998 51229 35134 6531 -110 1079 13999 56290 20923 -6245 -37344 -39125
16223 -39125 -22933 -39562 -53626 -29186 -32212 28691 58073 28799 34819 58496 78540 64412
16211 64412 50034 21644 17964 30538 29168 5465 -5618 -18335 -29441 -23310 16461 26600
16199 26600 34391 62231 57759 -2882 -87229 -127576 -91844 -28963 23309 8917 -29900 -29822 -35706
16186 -35706 -6275 7514 -17017 -47089 -6850 29497 32431 6763 -1465 10301 -11895 3707
16174 3707 762 5846 16618 11154 -17634 -13425 -18136 -36353 -29588 -28168 -26877 -39189 -10364
16161 -10364 15007 -1347 4971 21636 -9203 -30357 -35240 -33838 -51594 -71315 -65364 -39119
16149 -39119 -25402 -12745 20813 26154 -2704 -31151 -17804 25954 16307 -26525 -40768 -53931
16137 -53931 -38661 -6510 -12253 -35078 -30231 901 17828 32209 20932 9057 -4079 2250
16125 2250 27912 49513 52088 34348 15820 14576 10138 6933 -11151 -2147 16532 18453 -6214
16112 -6214 -10290 953 -16058 -17986 10713 37759 65625 33801 3104 -35455 -65649 -34847
16100 -34847 -43705 -41495 -14090 28937 28567 -13939 21316 62346 45428 -18060 -42480 -43745 -18755
16087 -18755 -18351 -8453 3688 -52288 -43589 -24365 -8867 18102 7128 -51277 -58920 -22414 -16290
16074 -16290 -30524 -45793 -14778 22193 -8986 -17347 3652 20918 53688 24737 -12406 2568
16062 2568 24586 -11626 -32194 -36373 -66293 -99507 -99551 -69610 -66345 -53550 -23979 -12964 -26348
16049 -26348 -64110 -89672 -72821 -81678 -63692 -33772 -58321 -63242 -60976 -57302 -41488 -32513 -134
16036 -134 2982 1049 25857 42102 37121 40991 33712 -7125 8751 -3515 1540 -1971 9771
16023 9771 45764 56497 29459 22750 33452 40283 42780 53992 29808 2895 8530 60291 79410
16010 79410 78665 52267 32576 17016 15182 -2085 -10725 -19176 -18148 -2143 -45213 -72985 -60274
15997 -60274 -70439 -56919 -30412 -23352 -15756 -17145 -22258 -28351 -38786 -37467 7759 16311 2747
15984 2747 15775 22201 4717 -4187 8782 -27630 -13182 3112 -30768 -34192 -33793 -69767 -57514
15971 -57514 -59267 -38913 3022 10058 8325 38368 33478 29676 39703 57964 31121 10300 -7185
15958 -7185 -35094 -38411 -18660 -5836 -24708 -36027 -56203 -57362 -10123 35763 62174 37128
15946 37128 7931 -10099 26586 49115 24715 -8154 -25474 -24963 -23021 -9042 -27431 -25199
15934 -25199 -20721 620 6369 -28951 -28257 -41873 -25139 -20971 -13657 8791 46997 39601 6721
15921 6721 -36811 1783 -234 -49651 -48200 -24342 -39486 -44194 -7135 43167 53798 37064
15909 37064 -8052 -23993 -4532 12951 688 6248 26051 -3821 -4935 -25301 -54776 -79578
15897 -79578 -85381 -32065 6773 -11678 -46232 -36676 -38477 -17676 -10043 746 -15231 -62472
15885 -62472 -62485 -37762 -44595 -79596 -54580 -4779 21294 42075 20292 23810 50315 77560 45509
15872 45509 1783 -31442 -32893 -20387 -711 -8412 -3372 15242 14579 29710 32340 24837 -900
15859 -900 -35791 -54350 -10635 17382 27416 33389 33638 31437 63726 58023 58006 43659 -5499 -11321
15845 -11321 -26581 -17117 11369 16399 2607 16197 25749 29730 4460 -12809 11628 24446
15833 24446 27338 46031 40939 6932 -5690 18461 20570 24886 29643 -16974 -39728 -22408 -14661
15820 -14661 -2769 -1379 12833 18372 -516 -1511 -3953 -4060 -3323 7100 59299 80369 25996
15807 25996 4268 20043 13593 6710 24961 72864 50884 41503 47910 21667 2329 5212 -14445
15794 -14445 -13146 33846 73 -34822 -53702 -16752 5813 12171 -15263 -38587 -32181 -19302
15782 -19302 -11176 10775 11127 7047 -18921 -32205 -37991 -10488 -31707 -45570 2653 14809 17359
15769 17359 44208 52209 31733 29002 308 -13391 -33201 -20968 -18297 -63900 -80437 -97146
15757 -97146 -98305 -71644 -58903 -47407 -57536 -55943 -20471 -23222 -66824 -71477 -78868 -55375 -43379
15744 -43379 -22758 -7369 -11107 4732 14590 -6336 -22474 -11571 9193 70799 44377 -12977
15732 -12977 -4926 -4298 35857 36824 20054 18270 279 -22816 -30196 -26642 -17081 -11073 -24156 2515
15718 2515 3757 39315 39890 1033 -13261 -3216 -12614 -17456 -44861 -43594 -54488 -68593 -56601
15705 -56601 -58990 -52339 -44102 -33030 -29138 -76280 -93127 -88450 -53742 -57232 -42532 -75093 -97999
15692 -97999 -100583 -81768 -28503 -19443 -48339 -10367 47262 30622 -47726 -56884 -47387 -36796
15680 -36796 -29446 -65115 -57626 -41747 -42908 -46719 -33803 -26550 -4215 -24115 -26758 -32271 -15374
15667 -15374 -12379 -29501 3162 17939 22532 4072 1190 -15935 -27488 -13191 -20575 17017
15655 17017 41916 5521 -9275 33260 34981 -7663 -22610 -21439 -7417 -21358 -50240 -33807
15643 -33807 11638 17794 15067 9860 31410 7870 -31942 -60053 -68699 -35385 -49996 -60225
15631 -60225 -66067 -57215 -20552 26578 14477 -4899 -26748 -30271 1192 -15372 -41467 -5199
15619 -5199 10815 26477 11821 -15214 17859 23947 17328 560 -24701 -20642 -14673 -19774 -15381
15606 -15381 -34509 -45680 -8717 2880 -2405 7247 -7668 -38066 -74297 -47329 -47454 -56110 -48661
15593 -48661 -31884 -36161 -17415 -4442 22970 39817 7950 -41213 -41100 -21593 8311 16204
15581 16204 5508 -3752 -3767 -7314 -22950 -52191 -65535 -75400 -52582 7659 3945 10353 14870
15568 14870 -7970 -29153 -44947 -31192 -19257 -62314 -65499 -72658 -86980 -81031 -76073 -53353
15556 -53353 -48286 -58376 -34220 2346 3516 29621 35808 28016 1823 6515 -14029 1954 -17156
15543 -17156 -23056 -1383 11320 -14205 -13811 -27176 -47072 -22676 1078 -20311 -37039 -37198 -39554
15530 -39554 -42953 -12160 -45140 -60104 -93510 -83002 -71111 -51579 380 23023 2458 -44502
15518 -44502 -66887 -73487 -48374 -31485 7909 5265 -7022 2711 41962 42735 7332 -42941 -68635
15505 -68635 -72390 -39974 33294 48004 21595 -7082 -24540 -40061 -30936 -12932 13520 39696
15493 39696 46175 49657 60210 68013 45939 8852 -2420 13366 12851 -2568 -7224 -66074 -77489
15480 -77489 -23792 36944 31043 15078 8905 10399 49457 39998 30561 15536 23421 18056 5907
15467 5907 -37122 -32385 -35805 -46959 -66595 -83095 -81637 -90716 -57665 7707 11551 -48570 -62271
15454 -62271 -48047 -47045 -28944 -16174 -20536 897 17783 33565 36142 67944 62700 48942
15442 48942 19622 -2993 -43481 -67662 -45209 -32999 346 -25815 -66769 -120694 -116411 -92167
15430 -92167 -15995 -10414 -7419 33298 -15959 -39646 -16675 2223 15822 971 -3739 -15830
15418 -15830 -45288 -45162 -18974 -1391 -15665 -20674 9492 11967 40157 42643 18019 -8405 -44183
15405 -44183 -51711 -65240 -43809 -35212 -451 39286 53229 21321 -21816 -31452 -25455 2079
15393 2079 37007 -10792 -24683 -1614 -25665 -33092 -44994 -36524 -66636 -73571 -53562 -39639
15381 -39639 -30646 -4236 2066 -15116 -30598 -61047 -22471 30518 48748 30196 13929 14113
15369 14113 18080 33980 17240 -3589 -49086 -50297 -5652 10045 26189 26124 -29204 -20418 -25513
15356 -25513 -5761 28576 29947 -17288 -43635 -29311 -17594 -29950 -60228 -40688 -44403 -33982
15344 -33982 -30956 649 -1923 -10763 -1067 14903 51515 28018 -18001 -56930 -56484 -18805 7779
15331 7779 23586 27582 -30630 -56560 -23341 -43063 -29875 -76920 -108248 -81064 -37506 -18083
15319 -18083 -26433 -30244 -40051 -45249 -40104 -38894 -40226 -58309 -61929 -33266 -5451 -22841 -28182
15306 -28182 -28362 -12676 5360 -3803 26406 38138 28172 -2496 5700 29212 38686 23264 24301
15293 24301 23746 2086 -36826 -44015 5022 -6115 -38861 -71640 -89584 -109442 -79088 -64929
15281 -64929 -48453 -64135 -63963 -73412 -62169 -52734 -43699 -11490 17894 11641 -12841 -13502 725
15268 725 29846 20069 24044 -12288 -51278 -68588 -48579 -42434 -51178 -45115 8240 7256 -12515
15255 -12515 -31738 -49803 5121 21107 10743 -4631 35610 23708 -6848 14861 -3145 39912
15243 39912 37890 1850 4178 17795 15729 15376 -5572 10411 12109 -14808 -47072 -26262 -7325
15230 -7325 -21111 11099 47401 45449 47745 31524 20175 26787 24351 15567 2690 -2666 4459
15217 4459 -45804 -83614 -64197 -39920 -16604 -44389 -47483 -65792 -94029 -53285 -6936 -13713
15205 -13713 -51806 -36920 -14579 -10587 -5505 1381 35233 49359 26595 -11683 -37587 -34879
15193 -34879 11871 22680 -9132 -8993 652 18426 -17059 -9215 4924 -8018 1686 16463 24889
15180 24889 11837 5231 14900 9901 18590 37497 42886 46909 40677 38065 71622 51909 1729
15167 1729 -51613 -68628 -56835 -40217 -22775 -26007 -15761 36465 30161 10571 15092 16463 12426
15154 12426 20428 41900 20883 26462 18392 13856 14346 32392 26715 15019 22207 21882 -9325 -15351
15140 -15351 10171 32805 48147 44631 28472 47771 9278 29643 45348 33704 24901 41893
15128 41893 61357 37602 3665 4705 21876 30973 44310 32377 57616 68121 44198 45511
15116 45511 41956 27940 35130 25659 32156 33721 5770 29777 44273 27329 24288 12112 42203
15103 42203 53458 67888 42509 36958 26689 -3237 -23812 -5667 40107 33236 -8253 -14418
15091 -14418 2461 27777 42156 26978 -16048 -34852 24567 44688 50231 54575 93164 117880
15079 117880 81442 37018 15179 13737 -2527 -17324 -13390 13384 34745 31839 16096 36759
15067 36759 28713 37368 21740 4508 -16949 -33274 -18207 -18748 11633 21908 21240 42 -10029
15054 -10029 -26519 6535 -5934 -36692 -22618 18906 32332 -666 74 3245 -218 5076 -25350
15041 -25350 -18220 -17674 -6838 -29404 -25004 -29212 -9769 -18967 -17314 -45435 -43309 -8391 -8850 -20358
15027 -20358 20768 9242 -45819 -49900 -26807 -38404 -56586 -68869 -46407 -46223 1452 27422
15015 27422 9906 -4727 -44319 -37244 -25784 -14927 -10402 -33247 -16324 -10126 -24701 -31167
15003 -31167 -12515 -24132 10463 29053 -4738 -13656 -20987 -12182 1113 12516 -11404 -36944
14991 -36944 -27226 9292 -19907 -54389 -71931 -67536 -41476 334 -13297 -36369 -31401 -36733
14979 -36733 4542 37901 54486 78839 53189 33303 24457 18111 37072 33779 7084 23540
14967 23540 17324 12448 27521 2310 8912 -18937 -63060 -54576 -58869 -32797 -25790 4213 33642
14954 33642 43806 51592 40103 20143 -559 -28865 -30151 -23852 -30928 6829 39570 23952
14942 23952 19419 -8153 -3837 36193 49201 27392 52701 91613 95597 127569 103851 97530
14930 97530 107926 88644 66126 68826 43973 -43753 -49288 -59103 -56087 -63264 -55769 -32393 -20810
14917 -20810 -49236 -62495 -50939 -18904 -6638 -35055 -19328 -34632 -57592 -50770 -46693 -38448
14905 -38448 -28637 -38941 -15059 -6870 -33789 -25389 -16608 -5365 -39965 -67768 -45585 -32931
14893 -32931 -74805 -90972 -18002 38550 37997 8433 -2870 14530 -9378 15272 45098 49549
14881 49549 26315 13105 45932 48261 29508 9454 18764 11568 20009 26389 20077 25687 11750
14868 11750 8101 2111 21197 29187 22803 20070 2385 30057 47444 34353 19633 13291 14062
14855 14062 26953 28684 11434 19743 7928 -9380 -37706 -25019 1528 2086 -3631 5989 25662
14842 25662 25342 23908 12747 -28271 -23497 -31454 -22764 -6157 -8089 -8975 -2582 -4470 -18066 -51726
14828 -51726 -42670 -3929 22268 8476 28697 19391 4437 -10799 -25459 -21159 11543 25667
14816 25667 -542 -19549 -13711 -24529 -45846 -43959 -29179 -29156 -37847 -20407 -181 -19298 -43157
14803 -43157 -91862 -91948 -64051 -40913 -44112 -51123 -38628 -13782 -37527 -27507 -63534 -59959 -20079
14790 -20079 -45603 -33873 -826 -7201 5585 6547 894 31954 58355 59910 21752 12090 14473
14777 14473 16587 4110 4267 27007 19590 -5651 -20785 10936 8658 -21763 -3500 4179 -37081
14764 -37081 -79994 -56001 -67267 -54574 -59402 -29107 -18961 -33996 6043 27539 30855 24693
14752 24693 13190 34719 43537 2399 -38559 -47886 -34722 -44632 -23040 -23108 -53168 -42209 -46494
14739 -46494 -34752 -20342 -25034 -4235 6477 14783 1417 12803 28017 25963 -2581 -30815
14727 -30815 -17783 -8111 -50682 -71350 -41816 -21208 -41174 -14679 -16432 -37023 -67047 -73637
14715 -73637 -29157 1836 365 -31752 -65012 -58234 -40245 -22692 -16192 8316 21720 -39845
14703 -39845 -63154 -37186 -45606 -41064 -32878 -35215 -45696 -31483 8302 4687 -31658 9294 30434
14690 30434 10928 6582 18258 28432 15927 52603 62861 43927 26358 -4457 -22974 -60853
14678 -60853 -91254 -53114 -25330 -18055 -44838 -37962 -53495 -67745 -17620 22850 27072 22959
14666 22959 -3452 -36958 -53597 -39820 -24941 -31400 -8797 -14379 -26892 -7099 2300 24268
14654 24268 27373 14512 33854 33727 -5261 -5361 14845 48325 53549 36913 28566 8356 7753
14641 7753 29997 25952 45064 20731 11116 -24785 5566 -492 -14912 -66557 -81676 -61701
14629 -61701 -28046 -27426 -58981 -46934 -40100 -33231 -11248 4367 32858 45839 39588 9060 -28930
14616 -28930 -6441 1116 1501 21751 11352 -18493 -31905 -42170 -64092 -61437 -62149 -48887 -52964
14603 -52964 -48138 -4512 -6021 -18009 -21695 -31309 -55906 -59309 -45853 -3597 18926 39945 25456
14590 25456 26131 -19285 -22671 -7013 9364 -1271 4795 34800 38888 5041 -1656 -19512 -53332
14577 -53332 -1914 56484 52021 2667 -29978 -39609 -18662 20255 51576 26945 34639 10838
14565 10838 -22503 -31118 -16276 1211 -19537 -23015 -19386 -36726 -45846 -69941 -53598 -56095 -51865
14552 -51865 -46209 -41338 -54990 -52368 -2999 31340 -11582 -35163 -36384 -32084 -48856 -52157 -78535
14539 -78535 -81284 -64279 -69379 -28978 -45042 -38744 -8649 -14495 -1461 35780 50489 51957 59923
14526 59923 85372 75197 77101 115708 111342 80993 47572 25922 48317 87991 40631 32135
14514 32135 30968 14412 39811 60742 64225 37062 38753 57203 8863 -30128 -22404 -35584
14502 -35584 -54594 -37089 -23279 1584 2809 -38643 -58160 -23613 -1475 29537 40919 -4057
14490 -4057 -20118 -20878 -29451 -52406 -48927 -11917 4737 18794 18536 10740 31068 -11685 -23136
14477 -23136 -48255 -30065 -38482 -42352 -21926 -14727 -750 -32125 -45251 -35464 -21411 -8941
14465 -8941 -6681 -37425 -32079 -26389 -31912 2394 21933 26646 1265 -38140 -46965 -49419 -37769
14452 -37769 6881 6801 -45629 -42193 -36321 -35393 -31677 -18263 -40600 -28326 1239 41359 40833 29420
14438 29420 4971 -48396 -84473 -71429 -57056 -21218 -4836 15258 18965 8009 -32010 -34579
14426 -34579 -46745 -44037 -37579 -36041 -47407 -4446 16227 47423 34060 17028 5600 -20831
14414 -20831 -14489 2671 14354 5778 874 -8972 -29083 -1350 1934 -545 12048 -3770 -59228
14401 -59228 -86855 -60550 -58840 -42632 5100 34191 56873 44310 26180 20802 874 -40250
14389 -40250 -14669 -2232 2440 -4714 3588 16074 42871 59739 93159 89692 53526 58148 51528
14376 51528 16721 14212 19019 17261 34000 27747 18770 -13499 -12183 -23213 -41624 -53163 -60008
14363 -60008 -56469 -72867 -78657 -38328 -13693 -9481 -10016 12317 49078 67215 47346 54865 54494
14350 54494 31236 14958 2175 -19416 -30449 -53852 -23530 -3254 -30030 -22064 11679 27111
14338 27111 43374 9537 -4593 -43 37674 44795 51973 39115 19556 21755 42908 49201 45561
14325 45561 11545 -21848 -40941 -54086 -58600 -16758 49110 45224 -3798 -7607 -24276 -47998
14313 -47998 -23022 12179 -18076 -10148 5725 18247 51224 19977 -10934 -5490 358 -611 -4419
14300 -4419 -2632 18426 1457 11050 -21602 -58586 -84930 -90015 -44260 4761 28537 12090
14288 12090 5223 11228 22630 33431 53385 46559 30928 28616 -3806 -41966 -49640 -4424 -20835
14275 -20835 -52811 -64904 -27134 -20051 2329 22073 59843 93855 102480 96252 81889 65888
14263 65888 61439 98298 94747 124436 144843 136987 125534 139908 142805 97147 66438 18668
14251 18668 -48089 -68063 -74986 -60363 -67715 -82332 -37835 -41797 -35271 -43789 -22368 -26200 -7923
14238 -7923 19664 28523 30493 730 2933 20809 76244 65947 46394 30333 1346 -815 -17609
14225 -17609 -31338 -27448 -40827 -55914 -50550 -29300 -8210 -3989 -46556 -82746 -76665 -47355
14213 -47355 -14528 15329 -4615 -10386 -45410 -76548 -69152 -52218 -47776 -62920 -42496 -23639
14201 -23639 2471 29551 12614 -5695 -16376 -18854 -5671 -5972 -29460 -27685 -33661 -34254 -14303
14188 -14303 -6326 -17246 -27823 8577 35269 54193 52929 2898 -47849 -36165 -44570 -30210
14176 -30210 -13589 -3742 9811 12440 20632 -30134 -40049 -29258 -20525 21181 83748 121731 97933
14163 97933 34048 -50123 -49039 -35624 -88745 -124969 -139219 -117817 -92092 -57896 -34277 -45098
14151 -45098 -97317 -89517 -73607 -75314 -82830 -86040 -44083 807 24421 39550 58003 37605
14139 37605 958 10473 4605 643 17629 3892 -18173 -65841 -77345 -72145 -45330 -27850
14127 -27850 -7881 7562 1430 -61362 -90540 -71375 -69049 -64355 -70532 -53277 -50313 -31925 -29044
14114 -29044 -37281 -17913 -21963 1564 -3908 21141 44297 35165 23899 1148 15314 22853 -12889
14101 -12889 -38185 -51619 -56643 -2875 29831 4686 -16795 -14621 -32325 -61953 -55466 -21745
14089 -21745 4989 30758 20605 9251 13015 8898 -24017 -65369 -102109 -104027 -91557 -51149
14077 -51149 -21484 -11477 -19024 8798 36436 38666 14895 -16989 -26607 -5344 -29174 -25849
14065 -25849 9903 30125 23798 14398 4910 -25745 -35097 -27580 -59032 -52828 -18925 -10318 -11578
14052 -11578 -34141 -24844 5699 21068 9303 11520 -13138 -26152 -6350 -2200 -37041 -36882 679
14039 679 12056 2724 -2230 -12874 -34537 -55486 -61253 -62083 -54595 12833 4585 -13901 -4411 3354
14025 3354 -37101 -62670 -62657 -50336 -66620 -59850 -55394 -95611 -86027 -76163 -63621 -53770 -22993
14012 -22993 -42351 -36606 -39256 -33649 -49611 -30390 10944 6765 -13285 -4618 30968 14720 7141
13999 7141 13219 37837 -4576 -5746 -11776 -4797 -4017 -9357 13557 23998 14207 -10535 -15044 -47752
13985 -47752 -45607 8164 5046 -6776 -29713 -3989 16501 34991 21969 19829 16828 15658 -8820
13972 -8820 -15277 11744 3766 -6826 -9563 -49653 -47400 -24381 18593 6456 -22306 -52638 -41249
13959 -41249 -31442 -22408 -9765 -23085 -34394 -34163 4303 37555 32836 12820 -730 -19344 -48839
13946 -48839 -76816 -102303 -92001 -72617 -69661 -24022 5820 -25357 -40557 -46141 -22656 -8591
13934 -8591 -32400 -50375 -29353 -30894 -84307 -61630 -65826 -72323 -79167 -53736 -19992 -24738 -12373
13921 -12373 -34830 -23017 -3641 1629 -27578 -31135 -35060 -59505 -50668 -70810 -67447 -22561 -9448
13908 -9448 -38460 -57860 -45969 -51974 -42863 -25135 -41177 -79892 -50671 -33348 -90591 -112259
13896 -112259 -73043 -34646 -11681 24232 37336 11441 -31746 -46051 -27739 -17188 -23970 -48087
13884 -48087 -44588 -24132 -27399 -17650 -24781 6843 32942 31950 26491 -12667 -38137 -3224 18060
13871 18060 1898 -19687 -24812 -42167 -36706 -44771 -10445 -12428 -42818 -35147 -10548 11873 5103
13858 5103 -6839 -31084 -59447 -26702 -2814 8389 -37411 -52399 -66095 -26488 -10406 -31219
13846 -31219 -32935 384 20083 6535 -22651 -45568 -22881 17968 21887 967 -18438 -24686
13834 -24686 -23881 -3493 -3004 -163 20990 38032 62833 47512 21944 2955 -2976 -21217 -34960
13821 -34960 7036 15326 15975 -16223 -55588 -55050 -56052 -44326 -18612 -14764 -16502 -24691 -55587
13808 -55587 -24423 -11296 -42875 -53967 -44019 -31692 -33976 -34127 -73515 -122117 -106295 -59129
13796 -59129 -61706 -75347 -46673 -10478 -12418 -6650 -19508 -45225 -77033 -57072 -66439 -89472
13784 -89472 -113942 -90324 -85843 -88087 -98256 -65905 -63815 -28536 -2356 -41291 -75268 -56901
13772 -56901 -26865 -37710 -17036 547 16929 7413 9121 -11911 -16352 -44027 -34190 -58041
13760 -58041 -54822 -60626 -57264 -48012 -29959 -7791 -16315 -13904 -20156 13905 7085 -7146 -8932
13747 -8932 -2997 -29365 -52977 -49196 -60985 -62746 -40790 -5511 17143 16601 -23010 -56529 -55106
13734 -55106 -41279 -22648 -22197 -13567 -470 26120 27561 4775 -25627 -49982 -46793 -68311 -61679
13721 -61679 -35443 -15264 -8276 -6836 -6726 -1887 -17340 -43926 -56988 -53336 -22627 -16497 -28018
13708 -28018 -63833 -60871 -57632 -45545 -65306 -95966 -51802 -37611 -28653 -31750 654 -17932
13696 -17932 -5250 -32971 -65809 -66157 -35340 -29783 -50839 -14682 16119 11589 34536 22613
13684 22613 6102 1809 -16527 -27100 -28213 -11231 -28536 17853 11544 -15799 -8348 25383
13672 25383 -25179 -37453 18829 15410 41930 27754 22800 51246 55721 53877 29224 9888
13660 9888 30024 55591 12433 -5478 20683 11309 -9090 -33570 -47418 -79643 -84318 -78298
13648 -78298 -76173 -71609 -21722 -11845 -37155 -45868 -42803 -50773 -70272 -92846 -91830 -82369 -47171
13635 -47171 7891 -364 -35861 -62863 -65653 -35717 -68079 -31269 23068 42885 60732 52009
13623 52009 34535 -16187 -50763 -7324 22797 17031 3694 -5225 16577 29099 3031 -686
13611 -686 -18521 -482 30595 25282 -660 -40976 -56369 -77848 -69044 -4326 28677 12629
13599 12629 5667 -5140 18941 22366 9699 10178 37426 41228 38142 -5520 -42809 -51566 -43887
13586 -43887 -8723 -4098 -43195 -51864 -19797 394 -23384 -13357 -12379 -21310 -31198 -563 18186
13573 18186 6452 -3379 -4773 -9826 45453 34945 32755 10175 -20483 -45732 -46408 -23251 -33941
13560 -33941 -21883 -57001 -104842 -96976 -73353 -27370 -7067 -7733 -7367 15037 -16538 -25451 -19116
13547 -19116 -38338 -69241 -113128 -100101 -63131 -63343 -38217 -4172 26250 11126 -6411 11872
13535 11872 14083 16579 23439 -456 -24138 -9753 24590 67470 85628 27315 -53752 -102395
13523 -102395 -76752 -49221 -28766 -16953 -34218 -55062 -29576 9948 2558 7575 -45474 -44302
13511 -44302 -32837 -67818 -43207 -45604 -23058 -25441 -50529 -31565 -48077 -12778 18589 -11297
13499 -11297 -21550 -45327 -14615 9127 6764 -1024 -9636 5473 12833 33065 1475 -24530
13487 -24530 -29867 -31563 -23337 4346 32427 11141 -7420 -14804 -25007 -17792 -30629 -8028 24748
13474 24748 41676 18181 -5832 3019 -14435 -24202 -50830 -55233 -9543 19758 30015 44437
13462 44437 27173 -347 11451 -14456 -2762 -1295 -10543 7293 -2955 -20593 -7535 11691
13450 11691 16723 -10662 3848 17484 3042 -11830 32 5991 18498 23318 38676 31142
13438 31142 15977 41662 21180 -14363 4476 41119 79374 35950 -2892 -37985 -42787 -19442
13426 -19442 -12291 -19912 -18429 -23852 -35060 -21646 -34517 -47725 -12821 -37489 -53566 -36844
13414 -36844 -40508 -11623 -11205 -29589 -14427 13983 9377 -27775 3174 24443 20874 10198 -18823
13401 -18823 -9672 22703 30417 3207 -17498 5060 -29480 -79046 -68317 -10975 6225 7200
13389 7200 -52817 -64449 -18164 -20469 -26540 -37146 -15325 -6662 17840 22057 -17657 -37044 -34466
13376 -34466 -1450 -7973 -102 9200 -17517 -42217 -27006 -9602 -48457 -61586 -41404 -18069
13364 -18069 -22328 -13882 -54355 -38543 6384 -14686 -52182 -38745 -24480 421 11285 45200
13352 45200 16493 -29641 -17625 9864 72382 43126 -4230 -21108 -7670 550 8282 -7003
13340 -7003 4003 16520 20130 56881 52415 18924 13545 19880 21725 34417 -7750 34285 78256
13327 78256 63636 44329 7888 -5198 -410 -17245 -13944 -18124 -12260 14078 26248 33869 33696
13314 33696 15548 26797 26419 33291 47373 23133 -8471 28807 56329 54075 2496 -14360
13302 -14360 6236 56345 89339 99460 66900 36501 44935 99404 115844 115376 147665 174346
13290 174346 144531 108622 100103 104206 109821 96093 44921 40886 39677 -6614 -64252 -79502
13278 -79502 -24238 18295 27206 11891 -12205 -36253 -33525 -45661 -7786 17220 -5561 -13390
13266 -13390 10159 494 17817 40256 38204 18247 -9241 -21291 4345 39155 -20295 -36551
13254 -36551 -18543 -23312 -6452 19072 -10047 -38527 -54354 -5412 3758 -15393 -24815 -36277
13242 -36277 -75403 -52721 -9899 -29968 -20558 -6773 18 -10275 -2177 15239 49977 73630
13230 73630 81378 106997 73048 37610 29677 45769 41418 20263 -601 -18425 -8340 12455
13218 12455 17136 17182 20119 -21707 -44189 -38039 -66589 -35548 36077 22514 -6855 -33216 -24531
13205 -24531 9388 7678 -18281 -17123 -22850 -36050 -13219 -14793 3874 9638 17741 -4693 -5720
13192 -5720 5666 30482 81309 88739 73110 28534 3345 25916 54216 56453 7869 3872
13180 3872 -36218 -77324 -76231 -63863 -36882 -25543 16605 33017 25901 348 12044 40751
13168 40751 22387 19022 -5175 -18132 2415 1447 1602 -13636 -40185 -13727 16816 -2825 -811
13155 -811 -2898 16241 21829 -24048 -40284 -51449 -54490 -28827 -4448 2532 -25881 -32518 -16161
13142 -16161 -21603 17143 39605 -2467 -32421 -31345 -6988 6842 29409 42306 41900 29408
13130 29408 42489 61789 59898 38387 68040 97608 93477 86912 81716 72291 38999 4675 48176
13117 48176 46459 33429 -13737 -7801 45789 47960 24109 19132 24024 275 -31382 15249 -4221
13104 -4221 -18043 -20669 -38955 5696 6394 -32739 -41405 -26639 -54383 -66688 -61611 -32437 -19001
13091 -19001 -25265 -14686 -8483 -12345 -44121 -56057 -9487 12684 12565 -4535 -2453 34921 15976
13078 15976 3177 32724 52467 73152 47132 33890 -25135 -41086 -19970 11048 21685 20024
13066 20024 1645 -62758 -62896 -19458 -14107 -31073 -50003 -46088 15883 29180 -6826 -41720
13054 -41720 -59678 -66469 -86455 -89225 -70763 -64182 -60122 -77885 -76669 -105549 -85974 -61971 -66521
13041 -66521 -54126 -12409 845 2782 -8726 -27076 -28832 -36657 -34258 -34412 -36195 -43946 -46241
13028 -46241 -25727 -2414 -6494 -27143 -7299 6253 42263 28677 17333 -8627 -32668 -11391
13016 -11391 -8233 -10346 -23518 -15418 11289 18586 29012 5560 6760 -29499 -45962 -32481 -21002
13003 -21002 -22236 -15928 -26957 -29917 -23668 -30660 -15613 -16606 -53824 -49634 -17224 462 -31048
12990 -31048 -59559 -75434 -91599 -66226 -21755 -27938 -33302 31653 15023 7238 -16228 -35150
12978 -35150 -21188 11240 31721 37735 49765 89251 104120 104443 87215 92288 117860 97408
12966 97408 52368 23782 41022 47228 57374 60373 65883 95675 96944 78548 81480 90308 107521
12953 107521 99525 66320 47960 40934 28626 25510 21047 22451 26811 25747 29145 34273 44539
12940 44539 68698 17758 -43957 -45233 -24094 -27967 9590 20727 43795 29954 -8284 -9154
12928 -9154 -27268 -50368 -56193 -24694 -39354 -38202 -13052 28803 44357 10197 -16928 -26931
12916 -26931 -16980 -38957 -32028 -9724 16530 16406 28890 24822 60364 70167 36367 -9782 1144
12903 1144 24946 33226 20167 3883 15075 -1625 28980 80466 79029 50226 1484 -11542
12891 -11542 -25650 107 3145 -16667 22815 12879 6289 -21799 -37085 -33167 -5333 28664
12879 28664 16228 -35507 -15158 -5185 10660 28730 13653 -486 -18752 -6182 28046 53770
12867 53770 67605 33453 -9187 -29982 -38915 -9302 7387 26613 27099 11284 47373 65004
12855 65004 91851 116988 142782 127672 102272 85800 140822 114475 96860 76735 69067 35986
12843 35986 8045 25417 63977 85088 68648 40294 34690 48198 23506 10059 -11719 -42747
12831 -42747 -14170 -1301 -18624 -51136 -24013 -22868 -51458 -76757 -49863 -8792 17606 32797
12819 32797 28905 34632 1436 -14669 26898 19133 -28473 -33896 9241 37376 52740 69489
12807 69489 47136 76077 99472 71506 42816 57671 76700 90440 82583 89945 94084 112777
12795 112777 127056 76571 44045 23830 -223 -21915 -4609 9082 2999 -16020 10066 23837
12783 23837 50442 70904 30256 2246 962 18577 28722 59100 45398 -8664 1700 37568
12771 37568 28314 36803 15878 7360 -8977 -31345 -17499 55811 77394 35465 -629 25278
12759 25278 65623 80457 67702 10018 -4409 6507 35791 59314 72835 91128 76148 40742
12747 40742 33925 45873 58760 57015 61734 77687 99562 104569 54371 7314 -10046 -14266 -20817
12734 -20817 -17386 9646 32020 29798 37788 30787 -10277 -18913 12025 54247 53349 42348 41325
12721 41325 24850 -4250 -24497 -34879 25103 41176 43745 50192 66056 49277 46961 24252
12709 24252 19803 -12833 -17741 -12952 10835 19578 22841 13271 30882 35350 28071 37352 51721
12696 51721 49519 27881 2787 41015 102934 95234 59295 46439 52956 103012 142359 111848
12684 111848 74701 37525 13218 6965 10986 11073 41351 28954 -23727 -31539 5735 40914 11055
12671 11055 15225 18502 15504 -10043 -40534 -12016 -8519 12258 14667 15992 22039 6918 -8340
12658 -8340 -26764 -14933 -45280 -89045 -113680 -117366 -120192 -75490 -49023 -89101 -82170 -57479
12646 -57479 -25777 -47408 -54940 -57892 -41757 -24904 -30991 -37337 -41271 -26661 855 -8752 -15083
12633 -15083 -24411 -19035 8031 1196 -24972 -65041 -48518 2495 29489 38028 -4201 8258
12621 8258 6326 -5241 54090 82017 66683 73995 76422 43581 20434 22481 46133 56292 27574
12608 27574 13135 2009 14531 7042 41606 70997 70999 22229 -12838 31653 18774 -7894 -22157
12595 -22157 -20682 -32108 -38226 1515 -2727 -22771 1986 209 -21805 -14464 -16847 -12713 1949
12582 1949 23722 30231 22846 8611 33069 52476 47269 20769 -2621 903 2722 15824 -774
12569 -774 -22280 -4565 2160 10990 6904 -17169 -48441 -21968 16231 8057 -14809 -9271 18908
12556 18908 50938 70540 54877 54601 34370 53125 50565 45776 48760 97109 127071 130319 133894
12543 133894 175636 172302 151468 147531 171972 197976 268844 343803 414750 486671 597579 729619
12531 729619 885392 985601 1061794 1182192 1346688 1427264 1498417 1578456 1649174 1702116 1711989
12520 1711989 1702862 1617839 1473550 1345357 1271315 1164106 1049214 940715 792741 651747
12510 651747 531974 451620 375634 288903 233369 224069 205122 173826 181176 123094 122988 119879
12498 119879 110963 109714 118759 126632 90657 95676 101480 66653 48791 55636 43964 51574 103354
12485 103354 133665 129798 94239 77942 63750 62503 61274 30238 712 17108 7617 20382
12473 20382 60120 69240 49226 32477 53034 94334 96063 44989 40537 56644 74561 76049
12461 76049 41523 81703 103483 62212 69677 120794 127520 116973 104601 109287 126121 97912
12449 97912 65357 34377 52624 62629 14074 -18827 -12829 30694 65476 65416 100418 100613 58722
12436 58722 55591 67076 99399 113961 98488 66451 64044 77687 70046 93193 87024 91420 90789
12423 90789 41898 20923 10051 22759 30957 9543 -1580 -15547 -83771 -160334 -172678 -169685
12411 -169685 -206007 -213886 -190564 -171194 -194301 -188985 -171632 -174750 -177939 -117798 -92145 -89690
12399 -89690 -83268 -35743 -17044 -11575 -10863 22616 3665 -28894 -31729 -55075 -59861 -52859 -36910
12386 -36910 -15909 10627 -1879 11093 16916 48681 78204 62227 86213 119734 96954 63245
12374 63245 73630 73303 51880 53080 103217 96859 81081 96066 123643 154117 189773 215532
12362 215532 206724 210820 213881 255454 280774 267971 280568 315466 322586 298338 234707 200905
12350 200905 153634 160033 189568 158264 82056 60743 27422 29653 39102 33615 28482 31097 7596
12337 7596 20186 36305 30392 15141 -14609 -22135 -3466 3302 31789 65745 46506 65517
12325 65517 29281 29852 56767 68999 56483 16560 4646 46072 57120 47541 40942 84418
12313 84418 97516 88545 81406 73459 69820 75109 101077 93144 79119 113319 124604 117974 114471
12300 114471 93605 99182 92909 76084 61224 48230 66450 80548 93398 92877 117624 126943
12288 126943 148120 131610 95169 84097 66018 90994 81527 38285 42952 25985 38472 85106
12276 85106 118592 119253 99588 86620 101253 159019 212389 232780 203340 215286 206513 224702
12264 224702 244800 252705 250312 293762 319083 324722 275804 247936 224068 225226 219246 214903 225146
12251 225146 219593 167375 144847 134241 127533 130959 179745 193230 237014 296448 316997 320748
12239 320748 363464 358743 325852 330975 326923 324634 334798 321480 338292 319480 252863 228597
12227 228597 288181 282156 201480 182092 195691 185676 167669 124544 144352 175561 199842 219427
12215 219427 245974 222381 226969 242870 231605 234722 245566 231756 219223 208107 220196 243269
12203 243269 302737 332732 335835 302224 311701 311263 297632 311190 319442 323953 336645 364152 347673
12190 347673 305476 335551 350730 385204 398135 423117 421896 413791 399723 446979 488554 509753
12178 509753 518314 530647 563967 602009 616343 620588 631442 643690 644471 669683 693526 748858
12166 748858 790877 790058 809855 851115 936685 983995 1000005 1075449 1192633 1231212 1272129 1334676
12154 1334676 1417607 1513684 1634650 1736383 1856203 1948840 2053614 2186897 2316963 2458096
12144 2458096 2571976 2667558 2834488 3025046 3208243 3442094 3699546 3984806 4301187 4649692
12134 4649692 5043287 5484371 6027211 6685448 7464118 8360276 9349929 10502998 11802279
12125 11802279 13268266 14913968 16834111 19145366 21872265 25134507 29127532 34312340
12117 34312340 41186556 50487347 63360494 80907452 103709652 130472103 158270604
12110 158270604 185349895 211838739 237728786 263079259 287332578 308314777 323877937
12103 323877937 332530536 333785512 327900878 315639503 298051981 276433754 252671026
12096 252671026 227985761 202302540 175518970 147903299 120734372 96828091 78145151
12089 78145151 64345765 54250041 46637593 40689060 35888091 31918887 28586662 25714397
12081 25714397 23187338 20944427 18957095 17153467 15516012 14051571 12699371 11492159
12073 11492159 10464286 9550789 8784939 8121787 7560290 7069232 6608780 6161848 5809649
12064 5809649 5482735 5186241 4981561 4774940 4585080 4404143 4236963 4076223 3924944
12055 3924944 3835504 3764961 3649355 3542286 3451769 3337249 3233466 3126184 3037070 2990870
12045 2990870 2939268 2808207 2744955 2748211 2679172 2624460 2539122 2476898 2466658 2406814 2341422
12034 2341422 2301296 2328893 2332051 2312697 2283268 2276627 2281578 2246121 2212708 2188521 2164798 2153725
12022 2153725 2149661 2125273 2117565 2118872 2121081 2153553 2189516 2187293 2204874 2238698 2226783 2248968
12010 2248968 2262450 2266487 2279487 2288483 2331261 2399808 2447593 2449027 2477995 2530637 2564066 2641358
11998 2641358 2739029 2770351 2837964 2903355 2978170 3095264 3201272 3292058 3407710 3555948
11988 3555948 3725860 3868658 4005636 4171132 4362005 4516126 4708629 4961408 5184857
11979 5184857 5390236 5654405 5979685 6345031 6730669 7153722 7613394 8128415 8672788
11970 8672788 9292723 10022628 10873429 11863010 12962112 14196863 15687399 17436426 19513734
11961 19513734 21935321 24798717 28240709 32366079 37301615 43305652 50567130 59272562
11953 59272562 69594535 81442714 94499589 107807452 119783904 128398881 131837762
11946 131837762 129344327 121619083 110424527 97755342 85220747 73728248 63688221
11939 63688221 55104195 47907574 41900114 36876540 32595063 28944586 25854614 23202022
11931 23202022 20944458 19024026 17342378 15812396 14424730 13195848 12092282 11125612
11923 11125612 10357377 9669284 9001644 8391380 7822951 7307588 6866741 6455467 6076534
11914 6076534 5735013 5426264 5169724 4910387 4641518 4404390 4196814 4010864 3842314
11905 3842314 3690908 3533899 3456236 3318505 3179671 3098301 2993896 2872467 2793691 2686112
11895 2686112 2573546 2480199 2396470 2311275 2265343 2213341 2159604 2078878 1995071 1884412 1850764
11884 1850764 1856846 1881307 1829616 1749340 1681215 1662952 1658705 1656523 1623508 1594462 1561991 1511843
11872 1511843 1498536 1459657 1405566 1390008 1401367 1367888 1342401 1304556 1262387 1256947 1304726
11861 1304726 1281023 1250973 1225441 1203921 1225481 1200556 1182797 1122535 1066624 1033949 989719
11850 989719 965048 915523 924001 893949 888709 943245 944070 896603 897909 880889 861190 833854
11838 833854 835563 870601 886198 850014 786285 756607 771797 796621 844468 837558 832353 774858
11826 774858 732054 702492 675973 679485 706879 745417 730250 704371 689829 670604 674843 645505
11814 645505 656526 637962 600955 595295 616044 623048 617425 635626 661684 691635 719021 735229
11802 735229 725282 671309 635050 644491 642652 642448 633109 585810 556403 514777 504549 497776 454765
11789 454765 440076 409983 372379 383143 354054 319448 337016 295126 264209 256912 285387 325209
11777 325209 332892 377476 393903 354402 330205 324571 316665 290690 288344 285593 302829 291285
11765 291285 277008 277545 287115 300171 310216 261781 239538 282354 263349 243633 260118 258952
11753 258952 243564 283248 312589 309262 274670 271806 279957 253513 253398 240304 249263 241336 212170
11740 212170 180052 208035 261195 289271 261344 202761 200061 217220 216320 250265 257000 235491
11728 235491 263270 307830 329005 331989 301850 289917 286144 283698 310373 327082 358701 375073
11716 375073 333319 297171 299737 294846 310109 299161 274953 289132 320485 286862 271927 288666
11704 288666 300547 307004 312607 287700 305489 326015 352921 391019 379194 382500 397391 437497
11692 437497 510998 614107 683138 755108 891374 1002283 1097074 1216493 1324820 1457137
11682 1457137 1570201 1690242 1761407 1824322 1837537 1823115 1785081 1718497 1631758 1513024 1369159
11671 1369159 1228388 1138603 1014183 886944 814033 763049 664530 575319 520307 525435 479058
11660 479058 379446 371945 390484 357445 297375 299745 311137 315140 307384 292562 260410 279841
11648 279841 270092 278116 291674 261194 230575 223465 221828 233402 216159 201185 198664 203242 201993
11635 201993 186291 186993 190779 214751 198235 172054 195262 177087 154590 169570 181255 159665
11623 159665 142398 141554 141331 166996 180916 169396 135345 98344 113120 156941 190259 161827
11611 161827 163591 191527 192795 209191 227871 215738 196410 210155 164853 164500 165888 137327
11599 137327 147543 160674 156789 148091 120281 100825 109150 115307 156332 148588 136765 152269
11587 152269 161912 128901 116764 102934 89117 133094 167779 153457 157760 156089 139176 156518
11575 156518 140027 115280 139358 183609 165181 128299 122078 155113 170459 176661 198182 203376
11563 203376 174023 135405 109055 140892 194122 180355 114385 91018 74143 14921 9091 37448
11551 37448 52750 49257 54806 96302 99604 58609 4885 2238 42559 41997 64509 87349 101104
11538 101104 136297 138276 118479 91726 88463 83649 43463 31598 62680 84863 141467 133250
11526 133250 114306 91983 85258 83620 72032 67872 104354 127803 78155 44727 63062 78040
11514 78040 80686 75564 53681 54104 30949 41628 73520 81572 81128 102109 68070 59344 28457
11501 28457 1149 19402 39280 24117 39584 30238 33391 52221 62909 89998 99228 96062
11489 96062 51868 85096 113781 100835 93396 79698 89667 119407 131521 122651 110228 87995
11477 87995 40865 31230 7858 -11830 1110 41688 39259 21376 25985 59384 70299 73700
11465 73700 104168 84842 79143 76002 31270 34246 46743 56127 51948 62974 104210 114932 105807
11452 105807 91696 78367 87220 70073 30823 33184 75303 88008 72574 39057 -15545 -17700
11440 -17700 16808 49418 65397 54165 79020 115572 129614 101943 95132 57946 63383 83945
11428 83945 91377 92936 125336 74226 54052 77003 60257 24460 29628 71950 66619 39296
11416 39296 26537 44731 68636 61387 88841 112884 102371 77260 83267 58885 21602 3892
11404 3892 -11078 5805 27548 51474 84382 103975 99575 104677 90749 105240 81351 55519
11392 55519 52774 87565 74563 92899 90548 56444 46601 90206 102318 102808 96486 100179 107315
11379 107315 119304 91641 61760 46503 66045 65067 37024 48492 71665 50633 52956 76176
11367 76176 86563 98865 83146 94299 75607 70784 63879 68451 84343 58537 70 -31043
11355 -31043 -11942 -301 12785 9393 26255 16804 21358 40672 62316 46198 57808 78262
11343 78262 62406 38680 58536 105139 138418 142397 96241 71758 96447 101609 105576 126890
11331 126890 123701 78182 27888 -8301 2947 47150 70000 73756 92856 47357 13383 11910
11319 11910 12007 22043 15159 19077 17911 32021 65303 44469 28413 8732 -5561 10006 42516
11306 42516 71325 52388 -6761 -3256 19893 32109 33297 33676 32738 61958 79548 32188 11974
11293 11974 44985 78339 90953 85868 62526 91528 110080 87251 86717 93024 56838 66711 72550
11280 72550 99845 127249 109989 103473 74995 46755 49880 79568 109367 95979 56585 37120
11268 37120 45692 52347 19344 34871 86243 109395 98370 39662 23835 39019 60882 51477
11256 51477 48202 17222 -2315 -10972 2712 -10852 13018 6723 10609 16562 17124 8281 31550
11243 31550 45783 27559 46779 30106 17915 30997 19354 60124 116957 122731 114253 111899
11231 111899 80467 38787 -27320 -69685 -41845 23267 50968 62974 66449 52989 51194 27501
11219 27501 36524 47300 39245 74857 102606 121445 131712 99167 137576 176943 250035 289708
11207 289708 326747 403501 582796 903543 1399872 2099578 2966502 3668306 3906828 3849841
11197 3849841 3536904 2798400 1926860 1271908 849890 656394 529868 429885 377218 334975
11187 334975 291756 222268 197217 165574 165197 167203 180934 163780 120390 84660 67577 86376
11175 86376 85391 118934 117497 75084 49787 48378 65738 39281 19764 39992 33703 7084 35423
11162 35423 47993 22382 24689 59833 82513 99274 109367 83228 24748 17380 23099 38953
11150 38953 53214 37826 17552 44786 81663 78475 72179 38348 43018 40690 31029 21089 29616
11137 29616 26013 -384 26959 53747 55125 20573 26 10985 21713 36119 42736 21232
11125 21232 49459 94110 87393 29017 2638 19292 9013 -16074 -20239 4868 19617 29768
11113 29768 53428 76891 76259 70636 24121 21919 26220 10236 20655 47185 57263 61704 83775
11100 83775 77888 87999 102923 83102 75338 66843 27012 45243 86871 83729 88208 89673 65420
11087 65420 50744 11771 2421 24136 33708 62758 68967 46740 17404 -28394 -48400 -4961
11075 -4961 39763 29412 -1934 4077 3247 19841 34545 31787 23932 1824 -12626 28731 23140
11062 23140 -4699 -12709 2024 4153 9907 -7969 -37347 -39747 -21088 -17373 20740 65225 91176
11049 91176 79138 101944 151205 172837 187663 179954 183557 218564 226231 211609 215410 210563 234772
11036 234772 265939 271725 289816 329195 363378 353990 297993 236334 226149 250721 252547 258761
11024 258761 284840 327634 416051 479245 466009 408434 343067 328849 327011 320761 320321 314283
11012 314283 327589 363208 400380 382737 362773 324014 279190 211518 150882 130322 142650
11001 142650 158876 169765 165428 170939 154608 127309 120299 101310 93117 74896 43093 33830
10989 33830 37552 32241 50453 50485 27401 22739 49604 83208 90910 106036 75910 47569 58400
10976 58400 33896 34544 57759 67286 47834 51472 67150 36758 37440 86123 104541 105246 121021
10963 121021 134472 162637 181410 213552 233907 324808 395198 512992 758011 1208347 1900044
10952 1900044 2704377 3268950 3264520 3079503 3120127 3147294 2699175 1916995 1259165 856254
10942 856254 631432 497977 410608 360995 326485 320383 272895 209345 152462 138007 130525
10931 130525 88385 99426 127335 107013 129700 116812 83243 66821 54221 79697 60027
10920 60027 3372 -9755 -33381 -52592 -22613 -29837 -51252 -69544 -47519 -40470 -78792 -85470
10908 -85470 -54970 -7102 7565 -37473 -79700 -58162 -74513 -83770 -66426 -77413 -84151 -84588
10896 -84588 -81952 -71528 -54177 -18497 -12290 -39573 -31059 2796 16230 15346 30606 6799 -42815
10883 -42815 -46228 -31753 -16729 23813 60066 61023 57227 13010 11889 15845 11228 31603 7784
10870 7784 28532 18190 -20534 -22429 -29849 25390 60019 70246 80499 73684 42845 35219 75879
10857 75879 85622 50943 62417 73872 73576 65423 59060 79722 64352 52236 49731 42329 -929
10844 -929 11449 48828 52989 61207 87567 76486 28542 10940 22236 30982 25876 18106 47835
10831 47835 72619 82844 69829 76132 92405 78841 45581 3174 -11509 13270 62851 77921
10819 77921 64039 18587 47772 65775 77291 67417 38414 66326 50330 44477 42681 25865
10807 25865 -13266 -50258 -49309 -43343 1497 11475 13283 31238 45752 29674 -3093 28379 33278
10794 33278 18449 9748 8381 20001 3071 4680 7803 23592 2115 -10270 8654 61742
10782 61742 51525 57644 33043 24489 -4268 -3214 56376 54078 17357 3071 8261 51144 82300
10769 82300 92654 65718 59320 45697 35972 94228 107701 96049 85070 93777 104709 102250
10757 102250 79941 71077 83527 100312 76502 49290 76707 105828 81489 54793 40334 5654
10745 5654 26865 64924 108064 116595 63840 61484 41664 37279 62851 74490 60912 38764
10733 38764 46571 34347 21507 27202 718 6912 26651 21608 29644 42875 46860 48467 57052
10720 57052 51565 65307 67682 69515 47118 22773 30678 29848 24559 57529 56876 40448 -6687
10707 -6687 13341 25627 -3460 -11479 -3728 -9315 -985 43660 57119 38205 40265 31259 8542
10694 8542 -9205 -39242 -53007 -85437 -108246 -82414 -28642 4430 -29873 -82111 -59307 -33128
10682 -33128 -56689 -36565 -53207 -56810 -34164 16269 29606 19062 -10470 -11705 31516 34392
10670 34392 19105 -3367 -17706 17380 82700 78120 57770 58108 82164 65176 48586 64109
10658 64109 81115 108266 132395 147198 213785 292518 377452 439313 529590 565977 603686 584424
10646 584424 498583 415771 370615 369481 387853 405595 433603 460008 478683 558316 660097
10635 660097 769924 942954 1086016 1250605 1415010 1516842 1584593 1689158 1823642 2056017
10625 2056017 2387350 2774360 3381614 4212855 5304511 6802148 8814255 11402836 14623244
10616 14623244 18194690 21338106 23106937 23194655 22228232 21100174 20519251 20913633 22502336
10607 22502336 25628291 30489974 36940360 44125675 50064089 52283933 50081870 45467303
10599 45467303 40932145 37992879 37110851 38477340 42305643 48695191 57139864 66103420
10591 66103420 72458275 72810683 66810280 57853160 49442018 43242727 39584129 38333879
10583 38333879 39373969 42415662 46829396 51317310 53644982 51800350 46024427 38676867
10575 38676867 32099639 27312566 24317985 22781676 22449579 23043659 24095392 24996115
10567 24996115 24885819 23140896 19960371 16319411 12999052 10338869 8330639 6831057
10559 6831057 5684563 4832196 4212877 3702081 3272494 2961766 2682008 2444699 2241124
10550 2241124 2057144 1903396 1748245 1611669 1466575 1315512 1190749 1134140 1094595 1099335
10540 1099335 1074966 1032900 938774 861356 789618 767550 717550 711982 709555 690675 666690 609961
10528 609961 555070 532473 560675 559152 545044 563886 540540 505682 488773 495998 505150 523316
10516 523316 526132 480706 456258 441347 449969 425588 401483 419409 447691 438934 421136 410266
10504 410266 388486 376946 367100 388996 398097 356248 309042 343178 399086 401880 376492 342627
10492 342627 325473 322943 294504 301819 314954 289711 256753 233764 240677 281406 293019 309693
10480 309693 289210 276742 265830 265250 268384 256858 259453 253817 272654 281228 309510 296166 271643
10467 271643 248735 238455 237341 251953 222368 229052 221441 222232 200506 175291 141719 136555 142082
10454 142082 178480 218666 231407 216859 205524 202561 185043 187195 180165 171725 186447 199869
10442 199869 227796 225554 186185 150158 106245 95370 102285 124845 133943 111115 120136 153882
10430 153882 152144 136191 147413 156300 146338 117286 90470 90875 68075 48111 59866 112371
10418 112371 132149 122295 110114 75866 76981 108022 121576 80888 60448 61435 98318 129402
10406 129402 118424 72225 108284 120312 88325 68581 58042 57717 102512 122704 96384 62560
10394 62560 51620 53388 34954 58739 105401 137472 151001 141150 148454 103029 74090 39792
10382 39792 62772 122932 146855 123474 118121 123232 125497 113625 125345 137967 147674 119804
10370 119804 84183 66023 75906 74272 77890 105234 108704 105194 68823 23840 31278 89382 116289
10357 116289 107852 75935 63340 77873 59368 -2064 -21465 8380 45251 102945 132443 136730
10345 136730 88750 88521 78582 55454 62399 62861 68143 47632 26430 52111 55880 65492 52102
10332 52102 44054 62564 80780 63312 14465 13491 38590 36151 10517 -19544 -12837 23764 73244
10319 73244 72482 41921 44651 66718 67491 82628 76679 44901 53175 64056 64045 71300 101817 71125
10305 71125 81779 108094 119340 112372 80290 65823 40425 40327 39471 61413 60175 70943 97710
10292 97710 101648 117115 110322 81798 70505 75311 64557 58815 33586 39762 78095 56752 39253
10279 39253 31942 50407 56793 79112 98130 77192 76523 97567 79577 76249 62678 43164 44369
10266 44369 45122 58723 44029 19250 12358 65474 61039 17919 -24198 -13255 23181 23557 2612
10253 2612 18549 32858 22915 38184 29298 21039 24605 38242 25020 28383 52718 9457 -33524
10240 -33524 -50527 -32246 26920 8741 -11511 -26821 -46504 -46773 -20347 1624 15043 -6958
10228 -6958 -9824 -13075 -31937 -43053 -46446 -33483 21741 32205 31702 34932 21227 -11382 -19120
10215 -19120 -26351 5758 35857 47375 20342 7891 30294 43291 39540 58174 73858 83377
10203 83377 60150 43709 -4359 -36445 -35825 -14784 11214 19459 34329 75970 60245 55492
10191 55492 57648 24915 26970 24540 80997 95396 114523 89088 55177 75913 109506 164203
10179 164203 199405 204769 180864 162596 169958 143629 126322 124925 149787 194883 203574 184203
10167 184203 241736 299110 281018 277566 269102 273108 246465 224687 243303 268042 303646 350655
10155 350655 431024 484060 463873 385817 322982 259174 236491 219965 219297 207838 246108 294867
10143 294867 366421 373470 326646 277942 220106 166255 153690 176336 165817 147606 139754 129898
10131 129898 144124 152707 153388 149099 155876 124471 110529 124464 95007 63097 37053 32496 -6380
10118 -6380 37415 62209 74626 55786 37215 53801 80874 103615 60721 47295 62011 79702
10106 79702 69868 69363 98161 98752 48374 25056 22111 46499 75370 76139 64738 89965 67560
10093 67560 73464 50718 51064 53272 34599 34097 53135 88191 82688 51152 50764 85427 91043 78704
10079 78704 76381 71864 52338 22052 39505 31898 20513 -15567 30278 62937 71590 90963
10067 90963 104719 96947 91622 59642 106890 162813 179986 215619 174415 118643 119284 105871
10055 105871 105226 93889 70076 85362 114296 130278 160257 140261 92064 107849 118738 106109
10043 106109 113582 105982 76667 60601 32054 29226 42130 44858 30849 42318 56575 96723
10031 96723 68485 60622 81276 54545 22698 86148 79219 32933 22349 52329 92603 110974
10019 110974 132899 152133 182405 190129 128895 146327 153824 99736 103474 103125 80592 71768 103485
10006 103485 119095 104522 102487 60502 42485 76960 60533 66508 88395 107816 102143 114184
9994 114184 125167 99525 93594 56344 51231 52118 35549 -4025 39445 64968 74057 75267 42556
9981 42556 -17250 -26761 23488 89713 102768 99434 110019 104510 110124 141774 134265 88978 49657
9968 49657 55454 92218 87369 77858 94031 123701 122348 102747 71835 71596 101431 128456 131889
9955 131889 111793 82104 58465 57160 35864 -9719 -34230 6924 16220 50113 78696 95460
9943 95460 79942 29759 48827 84627 77055 28265 16679 38117 41287 27626 528 31124
9931 31124 80172 31554 -4548 33343 44787 20956 22653 33487 69191 82582 108849 93936
9919 93936 59387 49747 65588 48829 15423 9565 10051 11617 10127 -3971 -12415 -28441 2069
9906 2069 28658 -16728 -50750 -53912 -48398 -12800 -19270 -38627 -18493 -18898 -21169 -19215 -6301
9893 -6301 6825 38732 45164 23694 36191 59149 69265 66233 59846 56128 60781 94157 95295
9880 95295 91509 73825 44248 50413 63453 46454 67260 66056 51760 -624 -4315 16937 18007
9867 18007 27503 -4049 -21530 12553 49652 64382 49289 36169 19064 9131 15847 29109
9855 29109 42717 53891 33316 23416 62082 69854 38749 -2313 19 -2275 20722 19094 38473
9842 38473 73183 67935 26861 3800 34651 26440 19835 36074 7153 16356 5108 4347 25762
9829 25762 42191 38487 43875 41593 24143 835 -5432 5929 17167 -4967 2742 17467 -8217
9816 -8217 -11760 -18986 29187 62239 48307 9407 27686 64232 48546 -2955 -10597 40514 72310
9803 72310 75044 57917 58333 64559 17311 -17231 -54687 -48926 10705 30222 23028 -3760 -20629
9790 -20629 36471 70988 58181 33389 44674 55833 51385 6688 5664 9164 21905 21946 10332
9777 10332 -3513 21761 33818 49083 73368 63424 74886 55687 32391 -902 38980 28870
9765 28870 30661 17436 9175 4444 -17995 -105 4104 19265 22378 24187 30035 38952 38970 18709
9751 18709 -19299 -43859 -34297 -7254 16391 23799 -3791 -1195 -10800 1471 -9815 -17452 25724
9738 25724 68819 47581 -11631 -15939 11300 18102 -1070 -41931 -31562 -1251 10434 -6120
9726 -6120 -77204 -89619 -44837 33627 82162 62027 31735 4175 -10549 -3349 5295 37492
9714 37492 -1405 -14271 29749 28208 22124 12661 8282 1168 -3001 2212 -15770 -13311 5653
9701 5653 65496 64021 57258 43263 15295 12817 31833 34333 17145 1385 21116 4421 23023
9688 23023 16749 -15476 6652 54088 50098 8947 5021 48293 25141 27061 50395 73875 40516
9675 40516 -2492 -42948 -24224 38338 74808 76938 66484 81846 105862 93373 86539 40949
9663 40949 -2319 35093 49503 44893 34596 64669 69935 38588 23045 7593 55304 44084
9651 44084 3160 -19504 -17397 4919 -11500 -17053 -9296 10789 8772 63508 98794 70257 77458
9638 77458 83742 117727 122062 133212 156889 154393 196935 238339 258399 307915 391263 542774
9626 542774 793637 1109459 1514563 2000392 2450426 2560437 2225020 1684708 1188220 866027
9616 866027 677574 559518 476823 404607 314291 280600 269693 212594 192659 171752 109512
9605 109512 73326 106091 135888 141443 120320 111753 121859 82355 49439 97741 109108 96926
9593 96926 86382 92339 101309 87773 105744 61838 18649 27747 39445 3594 -22751 -24197 -22118
9580 -22118 -10013 11515 14717 -7307 5662 27801 22573 15316 47658 90653 140272 168890
9568 168890 216379 246269 238052 198277 116178 109052 102589 119631 124536 99325 51912 80627
9556 80627 77151 45086 -9919 -48630 -46141 -15709 -15776 -12845 -50532 -42276 7194 -14845 -719
9543 -719 14610 24713 -5780 -12998 -3941 21110 14000 -24813 2479 8055 3637 24150 961
9530 961 -20443 -50093 -9385 32507 1516 6523 16 -5980 5688 17266 35303 1508 -14900
9517 -14900 -17250 -57538 -53285 -2948 34690 88963 113581 74932 40165 4832 -6874 -7002 -976
9504 -976 -8172 -5769 -9259 -13561 -21296 -30178 -21524 3452 -15261 -16159 33136 21720 1993 -11013
9490 -11013 -10344 27979 3528 -7749 -3685 -9609 -14883 -35250 -9443 10410 34060 32425 27117
9477 27117 21160 45027 37476 49066 41222 10537 3623 25197 21309 34420 62084 63814 43663
9464 43663 18722 -12930 -11932 9215 17062 -15694 -21115 3613 25156 61474 34219 25798 26977
9451 26977 49265 32275 8407 23454 27451 24079 43475 46313 12095 19769 50472 52248 34481
9438 34481 23525 42406 74459 91997 26094 -19402 -13387 22213 60297 39365 14086 36907
9426 36907 48633 52724 54452 38270 23724 -9580 -32012 -8979 25771 6566 -9086 -35976
9414 -35976 -40123 -9709 4403 29719 13830 1910 26146 54692 44342 51934 71416 66371
9402 66371 45554 25620 43221 76480 49681 38937 19384 27602 28732 12951 37215 36997 36072
9389 36072 32141 -13933 -42340 -49426 -49274 -31437 -16201 -10738 7014 30554 52301 56637 11056
9376 11056 -28963 -18635 -14872 -20023 10024 16628 9891 845 10900 43197 57364 42781 59149
9363 59149 67957 48235 1995 -7637 -33895 -69690 -45906 -28046 -11147 26921 41123 33888
9351 33888 22730 20541 -8902 -7838 22087 27206 27508 65577 39416 10676 -15655 -16622 -11539
9338 -11539 -41639 -17237 4831 -13565 11184 31466 56733 44834 59560 34445 2146 14646
9326 14646 23818 45965 28051 41849 41781 10332 -29466 -20353 16162 -25904 -1852 26252 31513
9313 31513 21003 -8944 -27308 -31807 -48935 -50508 -65497 -58397 -41983 -66449 -42353 -14950
9301 -14950 -9677 -2860 5616 -5763 -23215 -1784 8922 7039 -53446 -62039 -49471 -10825 34075
9288 34075 44064 15523 -18851 -14051 -24812 -27483 -12078 33930 50137 34783 46016 43057 19378
9275 19378 7114 -12755 -23240 -22757 5150 53274 84839 76833 75460 30921 29912 43126 46693
9262 46693 45112 30909 17183 -4240 -21914 -38938 -28070 10724 40763 71866 21021 -5463
9250 -5463 -31768 -51864 -27821 -29625 -40069 -56242 -18549 14013 25896 25201 39589 28499 24476
9237 24476 -11519 -44375 -25256 -10615 7666 24010 41666 41999 33678 15935 37588 40765 6141
9224 6141 18178 7376 -2614 -34986 -40584 -16285 13108 23664 45152 44679 53171 29888 12716
9211 12716 -11606 -32120 -36476 -17170 26991 79229 105692 111586 121467 126899 111904 77542 47090
9198 47090 43991 55385 67041 44083 15525 4501 -23088 -53692 -79859 -71049 -27369 -35
9186 -35 -2527 18275 -7219 -3461 5009 -14284 -18574 -10617 -17086 5764 4375 -42033 -35377 -36471
9172 -36471 -46623 -76060 -46522 -16166 -10943 -2546 9688 63372 47249 37428 57443 59948 39356
9159 39356 -2718 -123 70910 84458 44668 28849 7977 -12639 -2782 -11998 -6159 -6552 -28577
9146 -28577 -13177 -27245 -50686 -39989 -16794 -21903 -11080 -28599 -28138 -55616 -9670 25445
9134 25445 35593 36299 29431 23973 -12329 -29989 -7733 1785 1421 1275 -2423 -1991 -11812 -43907
9120 -43907 -32825 -53659 -30950 6112 9240 -2209 18844 27287 -877 -7678 17524 15126 6687
9107 6687 -16819 -6900 5816 29304 40289 76401 38516 2118 7065 -12539 13939 56189
9095 56189 46011 15571 -25103 -32887 -19755 -41653 -40078 -21731 -45161 -46522 -51093 -43416 -19938
9082 -19938 13661 4325 -32894 -40862 -42399 -52472 -33445 -20922 -21401 -23030 -27639 2384 -20757
9069 -20757 -65321 -2333 2769 -12720 -24054 11216 47192 33477 20369 12187 -21826 -12077
9057 -12077 26345 40983 27867 1013 -21065 -24241 -24147 -15026 -41251 -23933 30307 43288 38645
9044 38645 65297 48825 26991 6956 -35249 -74316 -89053 -73496 -52184 -40813 -11230 19914
9032 19914 -2424 -29812 -28790 -5531 -34582 -22260 5861 -6272 -5975 41866 87743 117465
9020 117465 98525 81574 55853 27484 17915 11079 41960 49075 68121 61754 15224 -16850
9008 -16850 -53807 -24246 22143 13840 -956 -3044 40542 60403 40557 -9185 -20234 -5051
8996 -5051 54561 72249 61860 39780 8095 2056 -6809 -41845 -51973 -39501 -10152 -20057 -61912
8983 -61912 -62618 -58927 -63177 -93697 -89823 -17795 -263 25067 14526 -2152 -28983 -47715 -20764
8970 -20764 22851 23485 -440 24069 13271 14389 42635 48577 50374 17486 -18074 -15981 -5397
8957 -5397 -15945 -12839 22557 19235 -13516 -18959 -22290 -17096 5012 23087 8388 -3411 -22265
8944 -22265 -19989 -45212 -46454 -51655 -42444 -25598 -1735 -9300 10871 -17539 12271 1498 21337
8931 21337 -1076 -8037 4487 -4511 -23765 -33529 -54892 -44617 -9067 144 -36854 -32481 -38010
8918 -38010 -55432 -70322 -50763 -65173 -56922 -38408 -36070 -7748 5212 13900 18922 5556 -11541
8905 -11541 -10091 -23925 -56526 -44087 27131 70410 35996 19936 2434 -24657 -16832 -10160
8893 -10160 -11791 -47127 -41107 -47586 -46690 -40560 -21398 -15583 -16632 -15279 -40337 -20841 6838 -1484
8879 -1484 -16625 -1535 7610 35146 24889 -937 13632 40246 27430 13110 1627 13389
8867 13389 -1761 -38083 -59796 -50026 -45212 -13362 -12336 -32471 -21482 -3258 -13650 628
8855 628 21289 41099 44992 34339 20777 3860 7230 146 38738 70547 67346 46928 36848
8842 36848 40399 44697 10605 -24477 -46448 -53138 -54276 -23052 -27045 -13213 -25422 -47109 -42943
8829 -42943 -27087 9052 9559 -7991 -4444 17243 8156 6185 14508 22563 47240 52619 65449
8816 65449 57090 5924 -6278 -6013 -9660 13432 -2745 -3799 -21209 -21855 -58244 -53243 12951
8803 12951 13918 -21957 -39017 -36789 29471 39520 19376 -6490 -24246 11739 33369 47999
8791 47999 28375 -894 -24889 -25935 11236 39474 30047 20251 50226 23940 -21247 -65467
8779 -65467 -54519 -36888 -56811 -29505 7771 5247 12612 -31794 -35247 -65978 -36789 -9245
8767 -9245 15472 16856 7417 10131 47295 48438 58360 24367 -1991 3151 22045 -9720 -38669
8754 -38669 -29117 -45718 -39142 -25039 -16281 -13361 30616 40508 32410 24992 8237 43532 73304
8741 73304 45330 -24708 -40264 -2252 -30989 -41345 -19165 2832 7317 -8661 3534 17374
8729 17374 1326 -50610 -61028 6081 43820 44959 41234 66562 52268 21414 -1662 -13020
8717 -13020 -17186 -29242 -42419 -55183 -76834 -56418 -26926 -22612 -35187 943 1384 22956 -8657
8704 -8657 -13755 -19253 -64073 -45181 -34526 -37846 -61128 -27860 -12294 -1596 -16766 -2843 -1849
8691 -1849 5815 18709 1560 20607 19103 15773 47412 47917 34564 16968 37591 62295 40923
8678 40923 8116 3473 -12928 -43092 -27889 -31250 -57931 -54575 -54513 -33632 13455 -10922 -34450
8665 -34450 -9832 12222 28728 32031 -33749 -49019 -44412 -27898 -24573 -22224 -18514 -3389 5379
8652 5379 32790 52862 62097 20347 -26135 -20515 -47099 -62312 -20067 4051 5237 34082 41161
8639 41161 34945 -1503 -53436 -43320 -3476 60287 63210 45661 20070 -30469 -48366 -2894
8627 -2894 24713 30586 -448 16993 38436 63219 65146 103290 72951 6976 -5038 3498 16934
8614 16934 30844 13113 -23366 15959 35610 77361 64859 25727 39733 56379 16970 -18944
8602 -18944 -65154 -68618 -16917 16884 21782 6305 -19097 -12535 10402 31455 22358 15679 -8361
8589 -8361 5587 -2612 -18397 31022 47343 68763 91301 83106 56727 36330 29727 49998 5616
8576 5616 5789 22308 29130 -3791 -19574 -23571 -21939 -10464 -4732 -31656 -56840 -33731 -5461
8563 -5461 12041 -20118 -30329 -3779 2514 -15701 833 29867 -271 -30094 -69440 -102808
8551 -102808 -92729 -42085 -42846 -54355 -42929 -16000 41522 82114 21620 5346 9391 3131
8539 3131 41421 56951 52628 73759 55651 -3481 -12726 39447 26923 11562 14354 27455 31757
8526 31757 10472 21279 47523 3151 -37253 -64971 -62433 -45540 -33022 -50551 -26780 5632
8514 5632 -4700 -67204 -74142 -26692 -34261 -7786 15922 -5656 -7171 -15589 -39559 -50970 -38734
8501 -38734 -23872 -6448 -9380 1417 -8366 37855 14236 1481 -46251 -79402 -62754 -56718
8489 -56718 -36132 -25632 8548 20321 39803 44367 52655 38146 2059 -10844 14514 -19296
8477 -19296 -42227 -30310 -12634 33166 25472 -9456 -28049 -69179 -71070 -17816 -7128 -9052
8465 -9052 7057 -13966 -15704 20662 -4503 -31594 -23212 -18822 -14465 -2632 -28649 -12502 23465
8452 23465 23909 -245 -5385 -23598 -1948 28337 37000 35712 42996 42208 41273 50352 57220 55786
8438 55786 62202 8252 12213 66827 76877 18184 13428 39668 42249 -20864 -39302 -1514 13042
8425 13042 -3201 -30054 -18980 -38354 -48925 -15295 11534 62723 53253 19046 8962 -7033
8413 -7033 -6435 -36420 -24552 -31104 -27869 -22382 -19953 -1383 47676 62641 33419 -21350 -9122
8400 -9122 -6729 -14406 -1788 13832 -29402 -37042 -15919 -45329 -42346 -8344 -3897 -6096 -11803
8387 -11803 -28850 -22267 -24357 -31280 -5629 3365 -29957 -79034 -64395 -36298 -14947 5175 -8296
8374 -8296 -1122 -5 -20940 -39038 -44922 -43983 -44233 -55250 -16025 -4035 -8144 6292 8020 -6480
8360 -6480 -26414 -28126 18918 39319 659 -5250 26804 13407 -967 18456 -11739 -53636
8348 -53636 -47949 -42554 -44344 -49855 -39578 -33144 -65372 -72691 -21884 -7459 -677 13220 38141
8335 38141 -9311 1392 11450 20354 -13823 -50136 -49403 -10809 -8507 -15658 19758 33698 18066
8322 18066 -7938 5749 44115 45969 73740 76916 40675 40685 34326 45296 50043 56940 22030
8309 22030 -1729 46467 56904 11336 4873 -20699 -13251 -29218 -82195 -86814 -65295 -23992
8297 -23992 4720 -19559 2411 33946 23995 -23386 -63397 -39015 -32194 -26047 -48469 -33408
8285 -33408 -619 2342 23937 60505 74440 63475 59038 53291 32445 32245 29433 74928 112319
8272 112319 70485 26245 10874 -30476 -52179 -10543 21718 -16225 -59366 -29030 6575 8719
8260 8719 -20979 -33248 -21777 -22156 -3661 10421 12782 12760 29668 42905 50723 42900 -7204 38260
8246 38260 67148 55702 43904 33560 17919 -16896 16110 21529 40213 56591 5535 -32094
8234 -32094 -13217 8431 -8262 -5282 11263 7622 -30597 -57936 -37660 -34299 -41836 -11762 -55658
8221 -55658 -97644 -61786 -23988 7687 40028 27084 -15242 -2954 -1819 -3190 -3868 -21709 -41850
8208 -41850 -6543 -17609 -35748 -33527 14018 38389 -188 -41058 -19515 10413 402 11443
8196 11443 15350 9070 -18633 -35386 -34886 -28593 -36980 5980 30216 22245 59145 65012 40252
8183 40252 26410 32229 19534 29392 26857 -15924 -24908 -33843 -44720 -49486 -5488 13701 19731
8170 19731 7162 -21140 -4327 17959 54871 38518 3223 -28108 -91269 -56377 -7665 -26340
8158 -26340 -26024 22815 22162 30084 67847 60749 48894 26034 15024 26754 577 10151 -12702
8145 -12702 -37908 -50488 -51941 -31309 -13059 -19346 -21461 -43099 -43161 -39144 -2768 3539 -22596
8132 -22596 -59523 -58216 -54936 -54760 -58801 -91307 -85208 -101379 -69892 -45504 -56983 -39050 -28898
8119 -28898 -68568 -123494 -108306 -62799 -18037 4991 15772 51109 71179 66819 48474 6284
8107 6284 -20794 -28678 -62714 -56155 -59568 -50569 -41885 -39201 -2458 28294 25601 11420 40276
8094 40276 20974 23010 32302 21899 -19040 -43131 -14765 -7751 -1772 24963 3112 -611 -3554
8081 -3554 13277 -11332 -6722 3404 -950 20017 55476 75987 51383 43961 19739 4491 39869
8068 39869 58345 54255 250 -64221 -89416 -77393 -34630 -43109 -10787 -21168 -32330 -60014
8056 -60014 -62970 -51990 -49480 -63621 -67129 -47724 -18339 -20745 -8665 -27846 -42659 -53054 -41394
8043 -41394 -32281 -31253 -11815 -35372 -35328 9056 24942 55371 72671 83178 55440 25672 13000
8030 13000 33298 14198 2752 20180 48709 62373 44464 34785 839 -5534 -22148 7862
8018 7862 32975 4494 -1100 11462 13823 8178 18126 -3985 -6175 38873 48953 46457 22239
8005 22239 23928 34583 19290 -2921 6494 8919 14229 -18107 -51540 -8069 27892 1085 -27133
7992 -27133 -27860 -49398 -38781 -36605 -20958 -30110 -13748 598 4094 31873 17077 -43527 -75185
7979 -75185 -34938 -24100 -20373 -20004 -32969 -41731 -47039 -33638 9038 12689 24064 7619 25242
7966 25242 9577 -36567 -49479 -60200 -50610 -11471 18666 69288 36450 35033 12036 -19826
7954 -19826 -30123 -23011 17600 25830 -5371 -8590 -10565 -18212 -37683 -7571 19166 23855 11215
7941 11215 -18696 -35954 -67350 -58878 -30123 -26930 -358 13485 25895 61968 62942 93811 104804
7928 104804 73792 7196 -13287 15738 82331 85571 45501 40210 27038 21396 6003 17972
7916 17972 39537 21437 15646 6681 115 30516 51932 32079 20371 6474 15626 30576 40201
7903 40201 71603 38615 -8824 -25601 -24142 44792 32199 -3704 -10078 12844 47154 31055
7891 31055 4273 -6461 -9625 -14431 -3033 -11675 -1867 -10355 -16610 -9833 -6470 -28216 -48796
7878 -48796 -48777 16471 41808 1301 -38398 -23651 876 10021 21242 43136 81127 102879 82312
7865 82312 81717 87178 75645 81414 87490 59963 21899 23983 39974 53820 47660 32156 4340
7852 4340 -20051 -13097 -1948 16680 24639 44239 33055 15035 -10430 -13811 3943 12777 -1515
7839 -1515 1401 395 12406 -20745 -19715 -4964 21531 38694 36828 6685 -34418 1292 4990
7826 4990 5628 19951 2636 40150 28737 -2089 -20005 -16468 11159 10629 -2892 -703 21098
7813 21098 16397 3683 -15157 -4468 -30497 -5477 1869 -19273 -3871 21643 21962 -38720 -50485
7800 -50485 -55255 -30421 20124 14432 17504 13344 -6306 -17615 -38499 -26898 18541 29473 35199
7787 35199 41938 33513 -5176 -42924 -37774 -11389 3053 16905 12531 16716 28511 24285 -1365
7774 -1365 -26666 -16481 3798 24509 14647 1568 -5617 -20249 20441 34841 9757 -38 -1885
7761 -1885 -12811 -19805 -52768 -72200 -36950 -3856 33903 30651 27546 17153 -7446 1870 279
7748 279 -21649 -15529 -2436 -32800 -76142 -24754 23216 12692 27349 33669 20961 25317 38605
7735 38605 20786 -6959 6709 -1531 -40069 -62401 -43310 -40470 -10937 21958 46318 50383
7723 50383 72263 82346 59983 65054 31822 -10859 346 33275 52729 46524 29891 -14249
7711 -14249 -16664 -26032 -44124 -29045 -15301 3152 5206 35405 31605 7170 -5365 22222 24557
7698 24557 9171 21872 8713 2616 4393 -17913 -2077 -20034 -49328 -58808 -68636 -77551 -65383
7685 -65383 -35314 -23691 6033 3615 36705 69323 67362 20144 -1942 -442 -46419 -40101 -11181
7672 -11181 17873 -16596 -40598 -35886 -1564 208 -297 5434 -9952 -25359 -27022 -41756 -6105
7659 -6105 -6515 -56348 -74448 -66713 -60036 -39010 3149 -9213 -38592 -57580 -35413 -10391 -16092
7646 -16092 -17223 -15095 -20121 -36124 -40929 -12699 -5949 180 -19223 -16003 27110 29319 32715 4617
7632 4617 14036 22152 37306 -729 -37688 -52111 -28552 -27414 -57501 -52950 11049 45769 46977
7619 46977 25958 10371 -27709 -26599 -17616 4625 -161 -41486 -74061 -73333 -48112 -18001 11887
7606 11887 11976 -3388 -10330 12520 13088 32279 22582 18328 -25198 -47942 -50459 -34652 2459 -30610
7592 -30610 -80301 -41326 -43333 -9239 -4600 -15285 -5249 11536 16289 -7285 -46679 -39765 -46242
7579 -46242 -81267 -74051 -18424 -7862 -36948 -838 11055 4143 1186 16163 30899 -12390
7567 -12390 -43034 -15419 56089 72922 16335 22039 47423 70799 112510 89692 12726 -26794
7555 -26794 -6389 2956 28164 -1302 -25161 16257 4514 -23878 -9488 -7807 -10568 7939
7543 7939 17558 26427 26443 -11412 -79119 -132763 -79165 -19242 20948 26508 3669 16625 46778
7530 46778 77658 61603 57885 56735 29965 16483 12788 8101 14871 44812 21381 -2890 -8067
7517 -8067 7134 19275 19765 -11317 -19414 -17041 -37719 -31898 -24930 -19489 -12220 -8374 -37174 -54162
7503 -54162 -50422 -29800 -41763 -33175 -16584 -19711 -14249 -16581 -7666 -16290 -64529 -81260 -67212
7490 -67212 -30907 -10685 -17278 -41423 -50550 -55199 -69601 -50633 -60600 -63527 -99530 -90315 -29816
7477 -29816 5330 13499 -11948 -16904 -24106 -36822 -60936 -23036 4020 25066 6295 -6909
7465 -6909 20195 21089 562 -161 18869 10336 -13095 -21452 10954 15576 14155 15948 801 -15546
7451 -15546 -31018 -41510 -30500 -29390 -33660 -30758 -45699 -27031 -6765 -7869 -35849 -59697 -53396
7438 -53396 -32974 -22428 -11720 -15373 -40549 -42970 -31092 -2084 -16644 -20511 -15440 1734 -15585
7425 -15585 -28013 -3009 934 -19244 -17178 -23838 5107 28015 37355 11845 -37387 -61160 -57291
7412 -57291 -74487 -50729 -14807 -41757 -29649 17113 17892 -2917 -2347 19857 1080 -28854 -38613
7399 -38613 -12981 -10995 -31428 -36860 -47894 -36224 -28190 -3829 -1988 17788 41863 41674 39184
7386 39184 22359 -4597 -42323 -42277 7622 1024 -20821 -1303 27182 -27317 -49996 -33856 -31461
7373 -31461 -5474 -28125 -22438 -5313 8876 10052 -13275 -41062 -32087 -25085 -31109 -28969 -14831
7360 -14831 -13142 -8139 -15702 -34510 -57679 -36806 -4021 20776 7521 -20596 -5386 16323
7348 16323 22077 -20869 -40123 -62278 -40717 -47623 -47877 -32858 -24945 -34188 -17904 -24857 -1460
7335 -1460 13872 16776 24458 13285 7609 12769 1475 -21504 7790 29488 13755 29838 -13049
7322 -13049 -33361 -74426 -76899 -43876 -28818 -39556 -62405 -3168 38855 52812 14013 -24163
7310 -24163 -3727 -9307 32753 51307 43339 19157 7700 7055 5115 35189 31244 34464 40340
7297 40340 21181 11350 -353 1851 -24039 -28567 6867 2745 -37747 -19323 -23487 5853 18612
7284 18612 -2030 -10189 -36678 -19653 2902 8771 -31427 -51965 -4180 5363 3676 -18102 -38610
7271 -38610 -58638 -25896 1437 9773 27876 34495 25461 19955 2848 -34253 -12154 -9423 13324
7258 13324 3622 -34931 -63002 -61094 -27778 -4169 16616 16302 -24162 -27219 -30835 -7309 -1935
7245 -1935 -11348 -43957 -52967 -41878 -27058 11366 22843 22156 -10272 -4728 31981 46935 22578
7232 22578 8716 -5923 -48703 -34054 -51572 -11912 23281 5460 -36396 -71664 -72546 -44226
7220 -44226 -3984 2802 28196 27749 6199 4120 -2950 -3213 -45721 -54264 -23232 5026 21282
7207 21282 50805 27277 19475 6415 21064 23045 -202 -44818 -37834 751 39492 38243 43985
7194 43985 47572 13500 26738 29592 16900 25991 32039 45833 50317 29957 -8017 -16820 31309
7181 31309 9995 -33007 -32781 -10973 2381 -18492 -11992 -39629 -14773 -6153 -52622 -68770 -63927
7168 -63927 -47049 -60436 -44676 -44945 -25823 -14496 -32994 -24355 -181 -27939 -26386 -4810 -12573
7155 -12573 -30004 -32597 -32406 -9742 19154 26578 40856 33655 36202 42561 43218 60852 54656 -9605
7141 -9605 -40947 -10959 6689 49076 44533 34234 10771 -15130 20235 69587 75083 48771
7129 48771 23693 36154 59306 60223 31886 46639 36498 13773 -6269 -36412 -56272 -55789 -14592
7116 -14592 2175 -57300 -10133 -7208 -37909 -51818 -46142 -19345 10230 42383 36860 3986
7104 3986 8522 -6288 -22805 4676 20690 13221 2521 11094 7544 -18625 -33191 -46172 -49983
7091 -49983 -44942 -26796 -28891 -71189 -65420 -28497 -26330 -7352 2370 -33608 -5137 8006 -26727
7078 -26727 -44175 -3161 17316 -3441 -33281 -46305 -38015 -54914 -58993 -77723 -39742 -19192
7066 -19192 -43047 -15286 1625 25893 57875 65650 47812 -3393 -19147 -19088 -20427 -38333 -18032
7053 -18032 23894 35522 51496 18658 -32029 -38796 -37899 -48126 -15328 249 286 33898 31316
7040 31316 32773 40200 52644 80914 91721 33953 -3248 -27933 -26549 -13663 -1686 33452
7028 33452 30444 26337 11131 -7951 -9075 -1378 -16045 1662 45740 54808 12359 1787 1875
7015 1875 26182 31513 16334 8227 -37424 -49376 -39827 -7799 21618 18099 -3989 -6172 34007
7002 34007 48526 53482 -2695 -43848 -30209 -25887 -35756 -51013 -60180 -63177 -52620 -72021 -36382
6989 -36382 -587 10032 11247 2731 -48945 -47975 -5553 27690 6962 -3631 24473 27446 22018
6976 22018 -7376 -35183 -26027 -30182 -22963 -10441 19527 7256 -3542 -3949 -11372 -8856 30426
6963 30426 38798 16936 -1416 -14256 -29375 -22761 -7475 -15190 17546 10523 -790 -6445 9092
6950 9092 34787 -36673 -71439 -18839 -8476 -51243 -36551 -4932 -7762 -47658 -50682 -54644 -33085
6937 -33085 4141 20994 13809 7583 -20691 -48934 -58650 -58431 -56658 -64153 -50608 -31049 -23397
6924 -23397 1289 -41156 -5272 -24130 -59731 -22583 -4319 -25360 1473 -6834 -30770 -28623
6912 -28623 -8906 9190 43067 67978 27597 41772 58037 31135 1372 -38820 -44798 -14253
6900 -14253 4145 -17613 -10700 -26926 -69089 -48646 -10336 4794 -2959 -59412 -73267 -54720
6888 -54720 -56079 -55205 -42616 -23214 -16991 -24196 -44983 -24421 -567 -32208 -14592 23118 20070
6875 20070 5566 -1497 -26037 -77429 -92244 -87437 -51183 -53699 -35798 -37619 -55977 -80862 -89001
6862 -89001 -65311 -67486 -33703 18826 30976 -38919 -86974 -62929 -4720 26553 14509 9140
6850 9140 2467 9019 13978 24713 32184 7876 -5001 -69647 -104310 -77297 -84502 -82091 -46065
6837 -46065 -4366 24233 4998 16315 21745 -5581 -25387 -33279 1828 20533 14602 51995
6825 51995 59725 35600 46979 -889 -8540 7324 12299 9943 -5091 -35954 -31623 -17206 -4850
6812 -4850 27953 36515 65906 43766 10190 -24797 -25432 -31847 -38166 -31662 -42742 -25872 -20372
6799 -20372 -20742 -47101 -18722 -10928 -27980 -47665 -37765 -45900 -79751 -74823 -71687 -75937 -70514 -61473
6785 -61473 -19854 -13252 -21984 -19893 -9269 1193 -4284 55488 75005 42808 50007 65814 59781
6772 59781 2771 -13038 -9374 -16113 -18020 13366 6255 7202 8981 25546 16873 -22620 -52753
6759 -52753 -57086 -37126 4376 -20902 -44692 -57775 -22383 10336 47473 23957 -25576 -50186
6747 -50186 -47776 -11215 18778 -3125 -56631 -48306 -36531 -45805 -10474 -14326 -7643 -21147 -34533
6734 -34533 -61600 -71720 -111728 -114225 -87191 -65173 -29917 -40474 -46316 -21084 -7629 2906
6722 2906 28907 22240 -12002 -27248 -32330 4875 16106 -3734 -8142 -16963 -49158 -77100 -55106
6709 -55106 -41776 -33021 -36972 -43462 -28229 -35016 -80728 -76659 -41076 8357 45301 14972 27242
6696 27242 37381 17677 51450 91888 103286 42370 -24543 -46173 -30653 -40134 -24582 -15165
6684 -15165 -9946 -37915 -62841 -70779 -2544 15638 34624 37613 45794 30327 58578 61099 14964
6671 14964 -42449 -64448 -59527 -38039 -33819 -24841 -908 10295 -18183 -24922 -29903 -43307 -64751
6658 -64751 -55352 -41886 -12871 13883 40812 47308 51903 14441 483 1589 -52265 -57408 -42010
6645 -42010 -26591 -14549 -14578 -5583 -7996 -29242 9244 -4083 -38286 -18996 -2075 -25051 9327
6632 9327 27621 22483 -1311 17256 8434 -22344 -11368 22873 37328 14297 -25833 -62540
6620 -62540 -38392 -16866 -763 18611 16612 37178 42738 32778 47335 38152 -20416 -42306 -46712
6607 -46712 -30073 -53640 -11965 4405 12364 9654 29889 31578 -25635 -30628 7335 34408 44658
6594 44658 29035 3225 -29391 -8350 -22444 -14321 -7853 -4320 6791 35796 17754 -23033
6582 -23033 -48814 -35823 -40397 -22718 -30089 -53825 -82341 -54616 -44389 -57493 -31913 1034
6570 1034 15380 2629 -1424 -52953 -93208 -69449 -31580 23464 54154 48242 26937 24544 46269
6557 46269 52202 47158 10372 4061 10932 14808 -34420 -18000 4235 -27545 -40132 -41331 8885
6544 8885 8137 -9345 -26511 -37031 -35090 -28873 -15882 18424 22081 23623 4501 -2915 -17263
6531 -17263 -31518 -24696 -34004 -33021 -24662 -16123 -9346 -22898 -12040 -9219 -41396 -62213 -55789 -57871
6517 -57871 -18066 -5621 -33899 -42501 -67386 -41244 21658 16990 3934 -54966 -92853 -65890
6505 -65890 -46430 -47341 -88323 -98544 -39027 14751 4131 -18713 -11891 -4999 -36310 -41138 -38676
6492 -38676 -33556 -39383 -53184 -35744 -21042 -19790 -16487 -22860 -15827 -13715 14879 21354 22159 3251
6478 3251 -27530 -46008 -33728 -36702 -27972 5821 15667 9888 -14385 -11975 22290 22778 -5867
6465 -5867 1094 -3517 -7362 -22879 -25566 -26559 -19941 -51590 -57027 -62439 -57680 -14784 30346 3518
6451 3518 -9632 13556 -22219 -18919 2317 -627 23794 54729 66137 31344 -31059 -41143
6439 -41143 -36637 -20538 -28950 6768 3665 6960 30333 33203 34280 51217 5914 8327 30034
6426 30034 31230 8493 -21063 -45285 -60116 -9401 33035 44574 34901 43805 48957 39301 34081
6413 34081 16435 14705 21116 21231 457 704 -5174 -14549 -6201 -18134 13455 17406 -19901 -44851
6399 -44851 -60103 -89127 -70808 -61616 -56907 -38431 -1272 5299 -27348 -61968 -85668 -59353
6387 -59353 -39620 -53518 -56465 -26167 -12586 9726 -5950 -11037 -12534 -27302 -31321 -23397 -3987
6374 -3987 -9357 -38672 -60125 -64283 -68592 -57931 -6269 789 22803 1802 -17307 -35501 -28112
6361 -28112 -37757 -8347 -12273 17416 75296 44863 7549 1020 -2145 30545 50660 58999 80824
6348 80824 64496 42590 22181 26063 34008 -9914 -7849 -3379 -12358 -1351 870 5709 9225
6335 9225 -22421 -60890 -23349 7336 -991 -21975 -3350 -38115 -42228 -18847 -21999 -30895 -32741
6322 -32741 -40545 -29908 -22968 -2929 3059 -3610 -1523 25026 -6881 -38589 -51942 -67135 -59794
6309 -59794 -49430 -52671 -52252 -25944 -6890 -13873 -15752 -12623 -309 5989 -3831 -126 -8275 -53593
6295 -53593 -40892 -26807 -19181 -13886 -5116 -5003 -27543 -14689 -4779 3801 11218 5193 -18542 -28726
6281 -28726 -8890 -460 13326 544 7779 27002 18731 1938 14385 28966 30767 37472 17290
6268 17290 -2712 -20191 -54767 -52911 -51002 -27195 18807 29104 2360 -18860 -22855 -25657 -2649
6255 -2649 18929 37067 27175 50144 50691 26181 28530 6230 8859 10157 17564 37562 68192
6242 68192 66441 74927 116452 89158 51432 8648 -5271 -17444 -69797 -66943 -54245 -81369
6230 -81369 -38153 5824 40998 16138 -2332 -11604 -44412 -77710 -24345 23500 17181 12894
6218 12894 26340 22418 40949 53433 32770 26510 21951 16019 -16927 -18866 36944 49609 168
6205 168 -14580 -9603 17712 5581 -2323 -15973 -27150 -22186 -1004 7837 33358 43451 60899
6192 60899 30637 -20077 -59691 -77038 -45590 -59340 -43919 -18977 6575 5602 -38573 -42055
6180 -42055 2633 10316 -22532 -10567 -3918 -32454 -19672 -11456 -16411 -1576 21060 44480 69631
6167 69631 66826 74387 42915 11226 6643 16692 21169 19876 -19263 -22902 -4877 14536 2856
6154 2856 -3780 8900 -8951 -53095 -49184 -42532 -5142 -5146 -33832 -23084 -27706 -40388 -54301 -59541
6140 -59541 -71671 -47554 -4332 56200 46047 -7916 -920 -11426 19908 72967 72206 15199
6128 15199 -41459 -66130 -73111 -21409 15613 14760 2352 17146 -19764 -56897 -37094 -22746
6116 -22746 -11255 -20836 -10309 -763 8110 4642 13330 6006 -13432 -12820 11348 56014 40524
6103 40524 43372 27989 32666 31092 29190 -10603 -47495 -74281 -81208 -80360 -54912 -33818 -29966
6090 -29966 -42909 -14070 6818 9572 5965 -5669 -13279 39873 42107 25116 63634 70491 62164
6077 62164 76594 52080 47458 51991 67051 28208 -22771 -50914 -28733 -23608 -13444 -8292 -12366
6064 -12366 -26025 -33012 -21470 -18597 -15391 -28552 -46976 -64988 -60788 -71027 -74741 -39110 -35380
6051 -35380 -32855 2001 15350 -29113 -44927 -31976 -24236 -3661 5328 -7217 -4167 -17792 -25239
6038 -25239 -10289 -18139 7048 14732 1054 -19318 -14899 -30208 -25978 -9381 -7827 -6557 16069
6025 16069 25545 -5176 -46744 -76725 -91574 -62894 -24141 -11938 36766 5484 -36467 -28766
6013 -28766 -26545 -34263 -51153 -32378 -28901 -36516 -23568 -30188 -32949 -15723 -23631 -6808 24331
6000 24331 34677 17538 -16702 -15959 -23192 4875 18057 25008 28464 -6397 -24029 9622 23711
5987 23711 1054 -26554 -26414 -10780 -17942 -47055 -29363 -20985 -16033 -19724 -30761 -65582 -57522
5974 -57522 -56910 -16893 20239 71466 52751 47915 51119 22724 34400 16767 -5672 -41455 -21008
5961 -21008 31830 28488 -10150 -52659 -61140 -48712 -56461 -70718 -57754 -55676 -39774 -50577 -57993
5948 -57993 -51557 -75739 -73796 -76403 -81993 -36844 -4449 9280 6628 25046 32137 15762 -15274
5935 -15274 -31887 -6218 2292 22843 39418 -5905 -29426 -14776 -2458 5541 37813 54331
5923 54331 48696 41931 27007 13573 1380 -19251 -49425 -55572 -27927 28950 61008 56117 28304
5910 28304 7930 -14106 -31184 -20869 -12904 -24062 -11048 -14253 -31949 -54311 -28986 10713
5898 10713 23616 8008 13911 -9746 -39188 -28567 40001 97400 46494 908 10350 16895
5886 16895 -758 -1094 34472 35826 43755 39620 -4501 -20152 -39329 -68664 -89168 -94151 -92199
5873 -92199 -64190 -51126 -38734 -14453 -36942 -39945 -82165 -103020 -37943 18882 41665 45515
5861 45515 -10908 -33154 -11689 10647 29489 24697 5376 -7962 -9064 -6948 19355 23780 27739
5848 27739 51642 73709 71310 21222 -9996 15643 17134 28027 -15897 -26562 -29152 -25907 -14803
5835 -14803 -14709 -21142 -33766 -54706 -44287 -59679 -52046 -46295 -33342 -10283 -9954 -20293 -25979 -8660
5821 -8660 2675 -8241 -3198 8466 -5575 -10537 4003 12431 14369 -22314 -59700 -25508 10291
5808 10291 -17428 -27491 -24545 -3886 6012 -10170 -19859 -26500 336 19026 17122 -15342 -23156
5795 -23156 -6891 -27019 -36116 -20362 -38928 -44375 -29173 -25505 -23758 13992 23573 12958 -2459
5782 -2459 -13050 -22403 -32269 -32650 -49802 -49125 -34968 -42659 -58019 -77744 -62815 -18390 11439
5769 11439 -6127 -12148 -79 4736 -9639 -14339 -6498 -25159 -48389 -71985 -96837 -52960 -22085
5756 -22085 -9540 -36649 -40124 -4389 -16871 -7285 -12386 -28997 -44038 -42790 -41302 38 17624
5743 17624 -6156 -20258 -17183 3797 30197 14890 4379 -963 -17563 -8214 951 39007 1202
5730 1202 -9009 -15572 7593 18367 17822 17532 -14121 18 9566 20771 50674 71987 33824
5717 33824 -25352 -21530 13284 -15537 1832 17758 -14410 -17520 -37697 -62697 -97013 -71790
5705 -71790 -68527 -44619 28139 41748 41412 8292 -6299 -14487 6734 21383 -711 -13194 -9989
5692 -9989 6376 -7164 5401 36652 40570 16225 20108 11901 16194 40914 67176 53757 -20637
5679 -20637 -21611 1936 -16616 -10392 -9283 1931 42269 35512 38078 -4568 -7475 -12553 -38461
5666 -38461 -59554 -35489 10362 38130 73287 44395 14753 -10849 -39523 -35403 -21285 -13802
5654 -13802 -26421 -55569 -64159 -37489 -36602 -46512 -30590 -52367 -91020 -57761 -41278 -36754 -17350
5641 -17350 -16217 -31527 -1793 34684 57979 55322 55770 24588 41620 32061 16698 5023 10013
5628 10013 -14747 -30194 -38588 -3544 -59 -1656 71 10037 -6341 -50550 -35025 -31599 -44688
5615 -44688 -39937 -21949 -16599 -17890 -48780 -53904 -53949 -49910 -37838 5859 -12952 -73186 -94968
5602 -94968 -72070 -66411 -37620 -53088 -57379 -26053 -30309 -16775 -32010 -61204 -68350 -19314 -9167
5589 -9167 761 26879 15764 -35584 -59133 -45240 -27894 21301 45658 26520 2808 -44297
5577 -44297 -10042 42181 34514 -22090 -51194 -48481 -4642 1641 -17227 -19659 2484 22612 34136
5564 34136 23675 24194 16927 56220 52889 24813 -4939 -2246 19265 42350 47406 64063 63166
5551 63166 64763 66734 40910 7927 -30367 -7828 4295 27384 41429 61031 80507 77084
5539 77084 72848 45137 4697 -9649 14591 27204 37779 38610 23984 -7764 14679 -10457
5527 -10457 -28381 -12567 16567 31093 13274 -6277 7095 24954 -13933 -25530 -6581 6042
5515 6042 22288 -15576 -4679 28335 32040 12549 1621 -27240 -68088 -72505 -86487 -106202
5503 -106202 -94011 -54516 -3106 15153 28822 18706 -11589 -20803 32522 61981 19720 -30763
5491 -30763 -24459 -27418 -9512 -22574 -31968 -40924 -36030 -36694 -29938 -7573 -16473 -4319 42777 40262
5477 40262 41295 75321 69814 84073 46548 -8985 2993 8348 49103 45260 32026 50873 32967
5464 32967 -17614 -25764 -22229 -28143 -25887 -11037 -15074 -4002 -15711 -24501 -16641 -10866 2650
5451 2650 -12877 -17681 -37179 -70626 -60544 -12654 -9228 -4927 14624 25352 34061 25565 -29595
5438 -29595 -29984 1915 44408 24952 -2555 576 13980 -20495 -38943 -18600 10526 6152 4981
5425 4981 -30551 -53789 -58907 -81300 -65747 -24192 14203 31402 28257 22334 18673 3584 -39028
5412 -39028 -82848 -100572 -85630 -26139 -23441 -20767 -59034 -72830 -50198 -17264 17774 37012
5400 37012 -8901 -20240 -822 -2311 30039 22005 5299 3029 -33023 -15319 -28411 -64637
5388 -64637 -53830 -24202 -26499 -16691 -23864 -15144 -6841 -3093 -37212 -33162 -32968 -1186 -12032 -7126
5374 -7126 -5749 -4226 12153 3614 -17253 -17892 -41210 -17719 26102 22141 29399 34257 52143 36019
5360 36019 24227 37663 56735 68164 64106 7477 -24665 -26749 -25378 16278 34622 9003
5348 9003 992 -12495 -24838 -15149 -35290 -38780 -55508 -33604 11881 14726 32047 47154 15410
5335 15410 6076 5461 14159 -2354 -23526 5178 35960 50971 -1426 -44163 -28600 -16946 -18670
5322 -18670 19294 15657 -10310 -7210 -31943 -28549 -50152 -59230 -17174 4299 15442 12425 -3491
5309 -3491 -13928 -19782 -9209 1605 17559 -3223 -23600 6517 12700 -26599 396 14027
5297 14027 -7413 -11225 -11093 18720 7693 -8075 -45853 -46593 -31864 -48134 -79016 -65548 -49187
5284 -49187 -80977 -71927 -42604 -19018 -24854 -42921 -8063 -17333 -32664 -13643 20850 53181
5272 53181 48092 52756 39750 33299 -3337 9468 46082 38864 73474 59708 19629 4732 -8815
5259 -8815 -21242 -28991 -27894 -15205 -18186 -14248 -46018 -60674 -50396 -39375 -57214 -60227 -54001
5246 -54001 -61705 -86959 -49014 -21837 -7700 4389 -20711 -36394 -66809 -57534 -6790 -7641 -21821
5233 -21821 1778 14672 41900 34199 -27665 9828 27306 17418 18070 -8929 127 -6979 -35455
5220 -35455 -12336 -3540 10764 8425 -8682 20902 48944 48934 43895 38580 43658 51820 44083 18679
5206 18679 -3882 -9723 -21604 -2384 36865 68857 102461 84280 76914 83330 29629 33133 48529
5193 48529 47409 15020 -43891 -21490 -8596 -18548 -4653 -610 -16126 -42668 -43845 -9715 19455
5180 19455 30488 31759 52882 65955 24557 8550 20669 17624 51782 47637 26373 5569
5168 5569 412 12880 15315 36585 64645 60892 44486 -16456 -32126 -28241 -28551 -54834 -11620
5155 -11620 33569 13019 11231 -7646 -27257 28225 62003 24718 2487 -3730 -11543 -35434
5143 -35434 25783 12125 -28433 -15421 -7320 -6955 -12777 31658 43158 -6166 -2768 2378 14690
5130 14690 20867 9143 -15521 -58014 -72032 -27359 3557 -4640 -44382 -45267 -13426 -54927 -88041
5117 -88041 -74934 -33186 5504 -5246 14466 44233 58137 48358 28713 25063 2067 -14812
5105 -14812 25239 22154 16380 18462 4373 6699 17441 -3864 -1987 4160 10063 -7697 -5827
5092 -5827 -15558 -8852 26462 47420 52849 53675 25790 23766 -3780 46688 77157 50391 19493
5079 19493 10600 15900 36199 47579 47059 30663 33677 47244 37331 24005 34359 41254 43180
5066 43180 10053 -31548 -11172 45763 31167 -27153 -28236 22617 27654 7438 26767 13359
5054 13359 8860 34786 34338 31154 48049 38388 -19713 -50226 -46719 -36933 -37119 -47800 -3452 -24645
5040 -24645 -36631 509 -17755 -74705 -93522 -78882 -19335 11353 -45226 -102244 -96530 -75446
5028 -75446 -24475 17528 17332 -10773 -13251 58 -10311 -7401 27765 47085 49485 26964 28404
5015 28404 25985 -525 -3151 501 14847 19097 24990 -9699 -43584 -40964 -67624 -41925 986
5002 986 6412 -1249 22623 -30006 -37363 -12983 3680 10406 -9352 -22249 -22330 -35067 -55768 -63443
4988 -63443 -48570 -30622 13671 1843 10808 6945 7635 17157 15509 -11127 -12424 19314 35406
4975 35406 17761 -35008 -62622 -54275 -35876 -1381 33962 36579 7730 -6157 -38127 -29533
4963 -29533 -23768 -51322 -30170 -25804 -16204 -32714 -14921 31624 36739 30373 16149 17751 45709
4950 45709 72251 79440 40057 32408 12818 -14328 3118 6068 -17070 44260 56508 399
4938 399 -24854 -30116 -12156 -12027 -7881 6533 29534 -145 -13414 -10020 -16906 -34605 -17780
4925 -17780 7757 58651 45285 61609 25294 26731 42315 1666 -48559 -38406 7774 14521
4913 14521 44569 62420 15028 8049 15438 -21511 -61661 -61084 -28415 -25389 -53136 -42232 -28100
4900 -28100 -48333 -49439 6565 -18547 -42995 6641 18870 -35936 -55884 -23425 -15036 -12460
4888 -12460 -16003 -17267 -40184 -37688 -41511 4486 59605 30275 31352 41347 52685 35017 9087
4875 9087 -26425 -31047 -23145 578 23835 28894 5590 -24527 -71731 -110195 -95172 -82210 -47537
4862 -47537 -36597 -33014 -47899 -37404 -8288 -1065 12650 2813 -9105 -17019 -25361 -27987 -31768
4849 -31768 -48232 -46414 -17811 -18200 -22625 -21822 -22806 -2605 16402 1378 -28004 -70890 -56275
4836 -56275 15995 38119 42366 31273 10929 15552 -10463 -2283 -6851 -14667 -20790 -33389 -22272
4823 -22272 -146 -4465 -15867 -33437 -43196 -16780 -24040 -65346 -46030 -41355 -75655 -89426 -47163
4810 -47163 -30293 -31083 7468 -822 -16216 -20761 -26114 -29331 -14664 -510 30809 45684 -477
4797 -477 3710 752 -16029 953 -11541 -10361 -3187 19682 36219 36753 -177 -48428 -13363
4784 -13363 39718 49051 16568 16414 23976 -1196 -58382 -55552 -42116 -37088 -28577 -13542 13338
4771 13338 17507 7882 -1032 5783 46024 79292 79078 43435 19768 22435 15187 -11731 -5526 6539
4757 6539 -14498 -7615 302 7320 13397 4280 750 -18942 -18634 -7575 -15640 -6305 8289 31349
4743 31349 13521 1185 -45740 -49067 -22315 17690 46053 20777 22663 35482 37978 10940
4731 10940 -10845 -12530 -14061 -14266 21136 -6766 -12114 -29505 -21341 -15721 3803 2440 -25245
4718 -25245 -8382 -19505 -21171 -24789 -49558 -44362 -13504 -10466 -5594 28762 8314 -25663 -13397
4705 -13397 -7954 25406 19298 4632 13812 19712 16085 -15166 -14914 -12424 -14846 15374 -13345 21785
4691 21785 29398 18454 17775 29508 5584 -10183 -13998 -32747 -19853 -8664 -11841 -11532 -19375
4678 -19375 -38892 -43331 -7411 -24685 -15927 -36534 -55005 -44545 -39199 -34672 -50462 -70274 -91744
4665 -91744 -94723 -81970 -60347 -66418 -52956 -14633 -21852 -10434 22100 74455 97690 87812 30971
4652 30971 6395 7106 11476 -19847 -48203 -30632 -5920 -3203 1531 -19123 -21404 6203 2379
4639 2379 -13152 14452 61043 49288 43769 -537 -20210 -33718 -62293 -36536 -18102 1663
4627 1663 185 11627 -12233 -14714 3940 20491 13090 -4077 -26487 -31521 -32974 -44704 -6739
4614 -6739 21075 56305 51893 31906 40299 15196 -1943 -16255 -25030 -5917 5938 4434 -17952
4601 -17952 -38041 -46425 -39292 -2091 7427 29888 31706 52819 62490 62638 27866 900 40620
4588 40620 51837 4278 -43331 -12875 -8415 13341 31537 5586 -10583 -16634 13443 -27211
4576 -27211 -40037 -26155 -19631 -3434 -8589 14148 23277 33100 -4967 -78595 -87979 -93672 -69631
4563 -69631 -39833 -28365 -34589 -30400 -27525 -8552 -43141 -103792 -82601 -50907 -22958 -3427
4551 -3427 512 -19892 -4744 -15015 13369 5513 5402 -14200 -26022 -6906 -22019 -51076 -79523
4538 -79523 -43374 -6856 -22047 -42936 -42035 13333 51740 71050 78163 78460 66356 18322 -17148
4525 -17148 -46054 -68943 -65024 -69276 -65739 5269 44035 19039 9859 37148 39901 26473 -10971
4512 -10971 -49348 -52889 -43007 -38562 -58417 -25878 -2802 5847 -16234 -4426 -909 -33466 -23797
4499 -23797 -16678 17417 23970 -27882 -38717 -22689 -12051 8961 -11739 -11068 5582 6311 22166
4486 22166 28381 -4452 12874 9684 3478 14951 19449 20535 33139 25211 10011 745 -16607
4473 -16607 -9221 3488 4901 -8559 -16290 22659 13985 3332 1438 -986 -19190 -17124 -38998
4460 -38998 -45132 -36997 -78797 -77701 -47995 14576 22559 45536 50129 15390 11516 2629 10563
4447 10563 22265 3155 -48730 -40896 7676 56382 44941 46512 37496 11190 -8897 16510
4435 16510 23532 -2004 -13522 31207 44136 51198 11154 12287 9434 -14131 -19896 -4727 -11968
4422 -11968 15474 35857 -6537 -10978 -9786 -37641 13874 22069 3822 -4425 23465 21569 -13702
4409 -13702 868 48016 43454 22703 62405 69247 44905 29550 7220 15089 1954 -41903
4397 -41903 -52701 -2947 57434 55246 59519 50260 38932 31247 14672 9713 -5737 -11940 -5194
4384 -5194 -25035 -30594 -9768 39104 38581 19081 43471 82876 53016 9405 -17658 -6537 -7247
4371 -7247 23524 32132 46960 64408 45455 19511 -6161 -15074 3067 1925 -6380 -13243 -28252
4358 -28252 -36689 -16583 -1013 11395 11922 -8932 -16858 -2814 -8468 -47400 -42071 -65058 -95338
4345 -95338 -63513 -5968 -12657 -29038 -14044 8461 18964 10905 7658 -19449 3494 36988
4333 36988 47331 60863 38896 -7054 -225 4981 -27272 -22365 -27127 -33318 -9548 10611 -28068
4320 -28068 -31490 -12270 -36921 -37765 -12979 -2113 -1439 -8421 -7436 -17507 -46617 -58646 -35234
4307 -35234 3349 1365 -48167 -35999 -16953 -31003 -65700 -65984 -49736 -44311 -49794 -52887 -31422
4294 -31422 -47290 -17297 -10734 -861 -1037 -5998 -13879 -3244 11808 18293 -1062 -29100 -27746
4281 -27746 -2620 28251 27783 -7053 -52030 -18138 -31569 12677 14926 38329 50495 13044
4269 13044 -742 -20400 -16747 -8231 20614 38250 30953 20948 15286 -20359 -43878 -44564 -28361
4256 -28361 -13768 1980 -39087 -75203 -44785 -16745 -28382 -16117 -38908 -49397 -54577 -46797
4244 -46797 -19737 -15244 -65849 -82973 -21516 28081 -5548 -11775 19979 52185 42890 6231
4232 6231 -44078 -29942 7113 35393 57154 34590 -13618 -40141 -50765 -40169 -43503 -22333
4220 -22333 -11582 -19282 -16264 -1965 -4799 22714 32167 -300 -21935 -21527 -9582 -32694 -16437
4207 -16437 -2562 1516 -19044 -48761 -46107 -40697 -17131 26688 56643 61819 29142 8226 -8648
4194 -8648 -24748 -10539 -33813 -42367 -16496 -6612 -28784 -31572 -31809 -44603 -24146 -18257 -33753
4181 -33753 -59667 -47166 -41746 -49353 -27528 -42110 -63380 -34439 -34976 -30028 -22028 1835 1822 24229
4167 24229 -11143 -52537 -60547 -56795 -64191 -64877 -72424 -45199 -4995 18713 28863 4837 -6689
4154 -6689 -20448 -59145 -37638 -7264 2053 36256 68078 40975 -19635 -21044 25770 53453
4142 53453 34355 27559 26593 33063 4036 5658 33648 37711 31660 44874 59701 40597 4448
4129 4448 -15122 -1629 -238 19103 29835 13778 -32665 -36668 -27674 -29654 -27224 -15467 2903
4116 2903 9869 22927 -19714 -16847 9991 4685 45775 74329 77590 56614 25037 8904 -28158
4103 -28158 -15094 -2258 -13968 -14995 -8293 -35096 -60270 -34878 -36332 -4494 27889 23638 25628
4090 25628 18508 2179 8872 19935 57106 66734 28787 -19712 -24331 -9564 -18671 -2993 38269
4077 38269 38818 70325 94809 71782 -3121 -21937 -15695 -14998 -5190 -7166 -31649 -16320 -11716
4064 -11716 -2299 178 -11238 3080 -8896 -14334 2268 5413 35660 74728 84367 43362 -2071
4051 -2071 14160 31406 7041 10411 -9986 -34151 1268 14793 11920 35025 40368 21585 -6003
4038 -6003 17672 20305 -34278 -20780 -40854 -26423 -12296 -27947 -31453 -58385 -42887 -8982
4026 -8982 -4082 -17437 -34819 2246 52340 38944 -12091 -60286 -55506 -65171 -64954 -69617 -61739
4013 -61739 -34778 -6036 -6979 -17898 -1866 -26560 -69639 -79973 -49100 13641 37398 23306
4001 23306 -881 -43907 -61020 -40400 -15355 -59603 -28201 -5207 9424 9874 309 -26711
3989 -26711 -7376 14109 -1557 -1640 -6306 18061 -1900 4291 -1241 -35289 -67967 -53361 -23628
3976 -23628 -7074 -49515 -81950 -72353 -52430 -40495 -56289 -97260 -84559 -29192 -25801 -19488
3964 -19488 -38245 -26174 -49967 -30690 -20712 -3290 -33273 -44324 -9784 15463 17095 8592
3952 8592 25109 19752 18553 25101 5061 -8157 -20950 -4503 15478 27688 37952 33648 84805
3939 84805 59855 47396 73565 73482 9199 27100 72159 59277 61642 69538 25529 32959 36728
3926 36728 66116 78869 44828 37933 19986 16971 -3723 -42896 -25268 7437 40177 33718
3914 33718 -19378 -44439 -34180 11296 58972 23142 -6401 1574 6441 -13964 -39454 -71071
3902 -71071 -38956 -13286 -10004 -5337 8201 -616 -17963 -1555 -863 -3883 49270 49132 31897
3889 31897 16694 -18174 -12305 -21269 4303 -6701 -33614 -30101 -22776 -6820 46425 68340 55722
3876 55722 33259 21452 33755 33291 26684 31379 24741 28631 16083 -9696 3693 -18187 -57543
3863 -57543 -45074 -30908 3794 25886 9360 -30684 -31222 -14938 -4965 -15586 -16126 -13080 9038
3850 9038 17135 24422 59936 45775 20862 25642 27814 -4715 -5329 -9722 -23194 5625 30214
3837 30214 21021 4796 41690 47253 28435 -4710 -13872 -21155 -15081 -9985 1108 -14987 -29232
3824 -29232 -8749 -16837 -32735 -38305 -19657 -21537 -21374 6149 21742 27611 4238 14390 29946
3811 29946 -3385 8431 43332 54384 29703 -6701 1437 -27650 -457 24291 36841 27500
3799 27500 31969 25276 15337 11788 18418 37936 42712 29716 57423 61616 14883 -26329 8152
3786 8152 23784 -1259 -407 23326 -21409 -22680 -745 22019 22730 -7969 -29230 -19801 2540
3773 2540 28259 -3977 -8697 9138 20937 21535 11710 2644 -4168 -38414 -54008 -65602 -42321
3760 -42321 -46445 -43395 -47687 -50001 -26922 -11310 -8138 11117 17478 33964 20552 13072 26524
3747 26524 15893 -3774 -42438 -65815 -53242 -42694 -21752 28597 63303 75700 66572 29636
3735 29636 23548 45787 57198 31819 27166 14332 18066 61495 73579 19957 31355 32311 24006
3722 24006 14596 -2046 4645 -21317 -23832 -41425 -25876 6547 35408 8785 -15210 -17147 7395
3709 7395 25877 30289 -949 -19967 27791 36772 4149 -12479 2182 -19930 -19410 -6277 9799
3696 9799 38049 50850 34619 -5048 -25488 -169 -9322 -6241 -14876 -49114 -69944 -70069 -28194
3683 -28194 -10201 -10329 -9148 -18078 -24031 -13445 -5416 -13115 -14822 -22618 3910 31552 46640 76781
3669 76781 72740 52307 27955 27623 50957 64867 36651 -2290 -20786 4310 59622 67003 26467
3656 26467 2141 6244 4607 36056 48307 62833 42381 12858 -8401 5787 17349 43398
3644 43398 40088 24491 11995 17335 28600 -12574 -53020 -59607 -75522 -56529 -35390 -7809
3632 -7809 22108 4770 -15869 -3268 26239 8380 -26467 -43790 -64572 -122274 -93452 -61825
3620 -61825 -77517 -89896 -96070 -104664 -95510 -22799 12017 16802 -3280 -8670 -27376 -28371 -25545
3607 -25545 -35417 -1034 23 9827 18352 24331 -2009 -5328 -17005 -27725 12639 57790 41412
3594 41412 -12750 -17846 894 27158 14723 23795 -8466 11983 35023 47005 70580 62206
3582 62206 63652 45225 44462 4558 -22108 -53782 -52113 -13606 -8572 -33102 -84969 -77110 -65537
3569 -65537 -17816 -13470 -38823 -19531 3196 13811 -9053 -3415 1430 -22339 -29989 948 -12653
3556 -12653 -7082 4820 -11004 14901 2885 8491 -5527 -1769 25979 46473 81172 50087
3544 50087 3832 38127 74197 109659 129281 86539 32459 -1671 -14045 7203 17197 2630
3532 2630 -8804 -14105 23404 42239 21152 -28106 -21578 -4522 10747 14577 36024 9936 687
3519 687 2992 27306 23206 -18167 -34520 16839 20204 17644 -4480 -5316 12376 18281 21305 39287
3505 39287 29194 27337 51477 23481 -2557 -14236 -35301 -29784 -23481 -26992 -33186 -39157 -49241
3492 -49241 -45188 -16745 -15607 -23275 -32842 -30196 -12588 -1898 38084 57622 51604 67682 41764
3479 41764 4000 -35406 -29262 18210 11304 17466 50043 53193 35381 -15077 -33395 6229 42802
3466 42802 84622 88703 29077 2796 -5390 -10616 -7505 22 32691 70512 58326 64822 77101
3453 77101 54824 17619 -22989 -52577 -17948 -15046 -16288 -17989 -8107 13803 12203 25683 6251
3440 6251 -328 -16203 -9568 -15319 -16662 -36008 -56166 -20266 12274 -14026 22226 -3073 -45786
3427 -45786 -22302 15941 1330 -83 -9618 -7157 16625 -5845 -35487 -36830 -19055 -11647 15739
3414 15739 42355 25631 12618 9895 8900 9754 -23165 -24279 -33477 -7020 -5048 -6504 9007 -7128
3400 -7128 -17336 134 6427 -18263 -22826 -4732 -40679 -88241 -107299 -100151 -74186 -33707 14314
3387 14314 -1258 -43966 -83544 -42691 -887 12506 -9456 -417 -3606 -42855 -49824 -34273
3375 -34273 -24688 -40800 -47181 -47702 -69576 -65937 -37474 -43089 -78825 -69977 -31098 -35762 -34631 -49191
3361 -49191 -60608 -81727 -52647 -58510 -51598 -41222 -25097 -8898 -622 -41576 -52999 -38706
3349 -38706 -54168 -48041 -85859 -124362 -121935 -107844 -74737 -35691 -43168 -57000 -1673 -5381 -39400
3336 -39400 -62072 -76481 -56570 -958 68090 41834 20784 15059 5674 -14513 -33924 -71887
3324 -71887 -89627 -56263 23455 37507 61816 75979 77853 84286 39929 30091 32101 23930 -6901
3311 -6901 -10520 -9058 44384 82504 46025 -8588 -1619 -20135 -15077 15968 50448 63500 56675
3298 56675 24915 -26239 -95988 -72627 -26246 -2395 -24323 -2956 6470 30918 37762 25454
3286 25454 30803 12842 -19841 -29865 -43670 -53553 -40973 -33035 -20559 -21077 -32438 -15472 -13850
3273 -13850 -36171 -69432 -44232 -37140 -26350 28852 58868 28719 22748 7190 -953 35612
3261 35612 44450 68252 84402 69049 53242 17103 4816 16160 29668 60176 52708 -11849
3249 -11849 -8963 -42542 -42813 -9293 -7729 -17497 -45718 -75007 -59615 -40016 2041 -16113 -58244
3236 -58244 -65270 -13125 -34516 -60467 -48392 -35847 -33727 -36962 -46868 -63075 -37116 -2556 729
3223 729 19776 69000 75242 42145 20667 -11986 -11134 32826 40829 28236 14280 9059 -3064
3210 -3064 2954 -6349 2219 -18853 -25565 -15015 733 10570 -8304 -13966 -16279 -24832 -38815 -27039
3196 -27039 -7184 -15761 -9989 14521 20029 1602 31533 63259 45111 19759 11341 11460 7792
3183 7792 -12167 -47024 -43556 -32229 -2862 11622 65058 39532 39665 76875 51335 39783 45969
3170 45969 30419 23786 16482 28046 26538 10922 -33603 -47742 -15040 -9237 -30853 -37102 -16060
3157 -16060 -21522 -2037 22144 -5426 -7228 -25852 -33740 -31325 -22391 -11184 -1485 -17248 -2133
3144 -2133 6684 393 2700 -504 23471 -28380 -69970 -43181 -58759 -60458 -27396 -14310 -181
3131 -181 -5781 -11499 -21279 -26509 -53832 -40286 2412 20371 38882 79098 66401 53570 36335
3118 36335 34430 37489 36539 25159 12080 14834 9752 28445 -12808 -20396 -17328 -19315 -16028 -8947
3104 -8947 7187 38467 69964 49121 77459 101054 89937 33568 8477 31695 7831 12705
3092 12705 16636 1746 5083 -11953 -37565 -26886 -6083 6352 43617 75085 79312 78579 54966
3079 54966 8235 -31895 -61071 -47127 -13301 -11558 11838 42503 22213 -1344 7963 5583
3067 5583 14986 33126 50943 44504 31816 2151 -16711 -2859 -8705 -22065 -15272 2667 28589
3054 28589 55477 70648 50625 25462 12952 917 550 2684 17116 -12356 -9873 -18709 -60761
3041 -60761 -38762 -54087 -41783 -21456 -27336 -22340 -6616 9541 -25837 -47091 -47352 -42599 -47622
3028 -47622 -62199 -25343 8760 -10715 -17370 -17465 -20280 -23813 10112 -25459 -58826 -30900 -4553
3015 -4553 -3250 11215 18528 18275 -20026 -24028 -5383 -251 4311 11302 13573 -6714 17154 -2804
3001 -2804 -30044 -27677 -20703 -701 -4420 12705 8221 -13994 2325 33338 53700 25159 31229
2988 31229 56179 36528 43193 41849 32794 20251 16754 25644 6408 11146 7099 11100 3242 -24748
2974 -24748 -76315 -64957 -53106 -52373 -35134 -7048 10471 28505 57509 37226 13953 17949
2962 17949 24943 35374 29285 -10949 -26630 -24860 -26229 -25677 -31141 -47263 -20629 -25744 -39773
2949 -39773 -22976 -44271 -12351 49965 68641 57581 54172 55129 37359 22966 11593 13787 25745
2936 25745 21339 34041 22020 41357 33846 23503 5050 4337 62171 80287 53955 68984 72753
2923 72753 61282 47143 4144 -30034 -25022 -5524 -6257 -24901 -45130 -63730 -68512 -50316 -27856
2910 -27856 -25556 -5732 30265 42906 52321 70813 67202 43470 15900 -30824 -21370 39974 54523
2897 54523 31293 20304 -5882 -60937 -54230 -30222 -65576 -56334 -23210 35938 -1603 -17801
2885 -17801 -4397 -8686 -7392 29266 20424 24880 52879 33761 23952 60339 48931 39566 24900
2872 24900 19509 47056 72716 87843 76247 44154 44298 41953 16391 16266 -11692 -30890 -24177
2859 -24177 21611 8042 6189 -24016 -50956 -9466 2496 8152 38165 29910 30686 50977 36361
2846 36361 -6016 -1709 17798 4154 2420 18589 -943 -18081 -1151 -6322 -35842 -31234 21929
2833 21929 1900 -33687 -91578 -71044 -18033 -526 23760 25888 8648 -17274 -34382 -32036
2821 -32036 21037 53978 22841 -6140 -11331 2397 -9196 20618 70025 54112 -8779 -27908
2809 -27908 -25279 3604 48387 54417 -4149 -28979 -34556 -41932 -15358 16011 -3308 -18229 -3097
2796 -3097 7670 -7694 11163 50346 2840 3711 7071 20935 40566 51096 65614 45952 45131
2783 45131 15225 -19570 10906 21934 32083 7909 -9864 5319 11614 21812 34412 24729
2771 24729 36239 35194 7793 -1637 -17717 -24750 -10625 -20178 -25773 7834 24175 10482 -7651
2758 -7651 9452 2449 17037 48221 51024 17589 22997 19664 38164 58090 64952 59741 19073
2745 19073 -14910 -35032 1987 32396 31084 12716 9573 -1771 -21835 -38211 -26043 16926
2733 16926 39462 61201 44846 55503 79833 40132 39788 52219 28929 -28524 -38700 -9253
2721 -9253 41448 38832 17905 10443 -14500 -5429 -12427 23957 48278 73238 99170 79914 56068
2708 56068 45172 41465 39760 12951 9777 18293 21789 47792 19938 -20823 -14627 6747 13806
2695 13806 15555 8770 -6631 -28420 -34623 -19035 -12204 -18778 1969 -6563 -15089 -40601 -32441
2682 -32441 -41610 -73454 -73076 -92746 -96504 -40251 -25559 -14114 -11127 6726 28420 -11758 -21804
2669 -21804 -2339 11524 13386 -22739 -33708 -31395 -6014 -12736 -15167 32558 -3201 -11370 22074
2656 22074 -3156 -15135 67 13766 38046 28299 19829 10649 5336 15096 26369 31368 -3432
2643 -3432 -12952 -32249 -43628 -12387 5915 31813 7818 -13127 -7746 10945 14781 7497 358
2630 358 -2974 1713 -28306 -27559 -19122 23599 -2606 -17600 -13587 8473 47901 38019 -8527 -11917
2616 -11917 11273 3547 23176 44740 49326 39116 3112 -48140 -47178 -38158 -23110 24669 53204
2603 53204 14430 -16989 -53854 -35247 -36905 -52803 -37279 -4938 19720 46269 60776 40699
2591 40699 485 -40696 -43353 -39136 -25646 9209 21797 -29013 -61323 -39416 -32879 -28477 -24453
2578 -24453 -27453 -51405 -40375 -28049 -49868 -75574 -72578 -53463 -59508 -91190 -122559 -105062
2566 -105062 -90247 -34933 -31694 -49004 -40140 -23045 -33557 -28426 10329 31663 -20411 -33404
2554 -33404 -50501 -63037 -4688 26277 17482 41594 39831 15003 -6552 9897 -17569 -44862
2542 -44862 -51309 -43658 -41163 -74970 -30680 -32689 -31677 -24663 -11236 -6428 30126 57126 60046
2529 60046 42389 15545 -815 -13040 -9828 30470 13421 -12483 36915 54174 -2491 -6230
2517 -6230 35039 48399 55567 31309 -4911 -24602 -65438 -86158 -67675 -42648 -31662 -36854
2505 -36854 -56961 -32059 -4219 29318 45970 32610 -473 2126 26768 45307 44519 7447
2493 7447 -4068 28511 24104 2836 22377 25647 13107 16443 14228 17059 425 -6672 3486
2480 3486 50980 42948 27027 22279 31463 17832 20653 -472 -30042 -43201 -14382 10358 23111
2467 23111 20944 30572 1331 -25672 -4005 42362 8834 991 23634 36081 24702 12676
2455 12676 6022 28055 25444 16612 -13883 -8592 -27929 19751 43466 37183 25769 9967 -3438
2442 -3438 222 4035 -144 17110 50058 33672 9674 22475 -2638 1340 -18177 -2195 3623
2429 3623 22114 4564 -17876 -17055 -12769 -3244 15817 -6896 -26704 -33661 -33617 -12474 -2184 6128
2415 6128 -9909 32723 16816 11400 44602 30790 52119 55155 18499 30335 23159 -32006 -18187
2402 -18187 5348 12089 43815 14468 202 19432 21071 40252 -8135 -38539 -32387 -30364 -14156
2389 -14156 3097 56617 56774 41655 18653 17962 31349 14327 -3258 -50113 -86513 -82798 -45756
2376 -45756 -51942 -16864 -4391 -7589 24170 23593 4005 -1132 88 -27124 -76438 -55331 -8602
2363 -8602 -9377 -14521 -29470 -9486 21681 43611 31636 28230 67733 71559 56627 4603 -15890
2350 -15890 2179 12601 -20730 -27080 9873 7536 -9170 5124 3273 378 -16193 -4052 -631
2337 -631 12578 49663 32539 14063 14539 27812 41016 52275 45629 4343 -9752 62 11630
2324 11630 3795 35070 32016 18150 8344 -4922 -39855 -30680 -41237 -45741 -20049 5426 13550
2311 13550 13511 -34893 -73991 -50418 -50305 -16444 18707 40979 82215 97434 91839 64623 9575
2298 9575 -8915 -18449 -13594 -29287 -21900 -14340 -11999 -32631 -28059 -41009 -54840 -43315 -17124
2285 -17124 7077 -35754 -15413 35621 49010 53387 51007 29603 -38630 -62983 -9098 -21690
2273 -21690 -47912 -38701 -23587 -31072 -47653 -62311 -66137 -72381 -45380 -13654 2597 -496 7349
2260 7349 7055 12515 61616 69178 4725 11090 95508 103194 111078 110217 105592 54922 19093 7131
2246 7131 15565 -2722 50 -9555 4475 12617 -7452 -12101 3989 15594 4623 -2826 13033
2233 13033 4577 -1138 -15555 -17462 7852 32993 50575 18570 8002 -8433 -17256 -21408 -19290
2220 -19290 12401 38490 -7063 -8772 12353 -26077 -13317 22099 -5288 -15968 11711 47729
2208 47729 12782 33004 10994 -32294 -18203 -38635 -34646 -15389 -864 35535 46828 4339
2196 4339 14594 49228 29760 -22087 -65022 -98136 -82958 -25471 -23503 -44915 -67189 -72137
2184 -72137 -57727 -17118 3095 -27862 -39659 -37469 -15459 -7828 -5519 -17603 -5573 -1076 28237
2171 28237 15726 1571 -18904 -4050 26896 24857 11185 19857 48303 27447 43327 49399
2159 49399 13559 34071 50358 44271 67704 51570 33957 23696 10602 10327 -5419 -29561
2147 -29561 1372 26987 17261 38653 26908 -5082 8354 7761 14952 16613 11783 22607 -9127
2134 -9127 -38616 -50379 -11945 6913 35759 40301 -1970 7070 5778 39912 87536 87036 84871
2121 84871 94909 41723 9492 18832 16277 12568 11008 16088 10961 21840 43531 36272 26553
2108 26553 5857 -8874 -2339 11125 11669 -11513 7427 28099 32281 14961 -11513 -24598 5027
2095 5027 20041 72449 96186 73534 50043 43043 42086 22312 36996 69276 73874 88777 85908
2082 85908 53371 27790 -10474 -16097 3456 7897 19977 21675 21466 4678 -19060 -10274 13990
2069 13990 29842 31597 33728 -1708 -2156 25566 29142 4430 18475 17008 3394 29903 34765
2056 34765 -25833 -30426 -16343 372 7937 -11677 3535 -7359 -7865 -14883 -41165 -36139 -29665
2043 -29665 -18283 -10993 837 -6336 -12026 -4713 30722 80042 86749 54706 36392 15222 -3800
2030 -3800 8394 19183 -4494 16170 22828 -2184 -29037 -50131 -28650 16993 26927 11633
2018 11633 -20452 -32950 -9385 5355 -4601 -43132 -26511 23233 -17366 -16865 18332 6123
2006 6123 30034 13469 23646 21511 4519 13452 23157 6671 15411 38238 -13993 -57780 -37599
1993 -37599 -41819 12834 72682 50451 22507 20369 13993 38978 19498 3542 20562 27929 13659
1980 13659 17977 13653 -5627 -31433 -42678 9251 31589 58965 53830 9914 -16140 -17083 -17996
1967 -17996 -6995 26702 13501 15243 62957 83312 33626 -7451 2374 -24332 -50795 -10525
1955 -10525 3153 -23627 486 -33105 -38088 -31788 -29985 9328 47214 56734 33194 -3167 2177
1942 2177 23279 61500 67185 -13003 -42823 -10682 51559 41665 41966 41748 15138 -3624 13071
1929 13071 -20371 -9500 3435 -30870 -38326 -39484 -37656 -1049 43968 49514 50661 52292 51591
1916 51591 57440 44056 27260 28407 11786 5861 6642 12851 8323 -1401 -787 -4741 -15215 -7475
1902 -7475 28862 64285 56776 6328 -20552 -10387 -21198 -48442 -26258 5446 -21481 -41850
1890 -41850 -16125 -1530 1296 -23683 -33473 751 34831 35767 47166 19079 -12510 -41385 -24673
1877 -24673 10043 31260 21989 5240 -20532 -55516 -3810 37684 49704 58500 39629 9526
1865 9526 -20186 -38945 1414 17373 17340 26051 16977 37740 61207 46173 37534 27419 -3460
1852 -3460 -37814 -51063 -21687 2193 5845 -1710 -24819 -17299 -5445 2844 -851 -10192 -45466
1839 -45466 -35227 -10195 14081 46029 19476 -4123 18237 32744 34583 43181 31726 42724
1827 42724 30608 18169 -2360 -6410 -11126 -58030 -60499 -4479 8461 -19533 -55641 -35545
1815 -35545 4434 39892 36725 26845 41188 13042 -28395 -13541 -41595 -19324 -14184 -30773
1803 -30773 -45946 -33906 -37159 -64157 -32276 -28937 6762 7548 38942 17947 18359 8649 -1075
1790 -1075 9899 -7671 17875 54449 34690 -6845 -15517 -289 45778 36269 790 3103 -10562
1777 -10562 -30879 -45855 -65789 -68753 -55916 -43838 -68998 -56463 -56170 -30558 -10890 -17184 -13293
1764 -13293 1126 -8598 -27154 9803 8758 -28358 3254 39356 13181 -5021 -23358 -52915
1752 -52915 -84895 -58109 -96121 -92032 -27978 16421 -8542 -34970 -47271 -35911 -9421 -3601
1740 -3601 -1987 13608 14568 -4777 -16707 -948 -25514 9878 17400 -3862 14496 -21805 -25484
1727 -25484 -11992 21633 22588 23916 -14401 -23825 -22664 -53364 -61601 -19608 -6747 3429 25184
1714 25184 23353 23983 22410 5372 -10859 -6609 7371 13417 -8992 -16651 13035 -8667 -22669
1701 -22669 1546 2023 -10282 -26853 -24267 -1426 -712 3306 -1659 11004 17078 19907 -13013 -11515
1687 -11515 -2791 -5008 19067 56516 78428 39372 5772 -27665 -12511 26560 19700 2860
1675 2860 510 36305 43703 67538 63211 16183 -5764 18463 -9236 -28486 -24454 -15439 22139
1662 22139 24831 18238 -3977 -13924 -8766 25220 29271 20490 35867 38926 19078 2075 17488
1649 17488 30949 -24741 -49789 -24198 -28070 6833 21774 9248 4394 6139 23288 10544
1637 10544 16695 9404 28483 38505 30323 34871 18851 -35323 -32719 -26412 -24332 -19140 -13729 -15246
1623 -15246 -8708 -17680 -29257 -44498 -37579 -31071 216 -6675 -43676 -62250 -4892 15899 -9677
$$ [...]
##END NTUPLES=NMR SPECTRUM
##END=
