##TITLE=Analysis number 325521
Compound Code tl 00912
Project Code adrs
Chemist Name endeavour
##JCAMPDX= 6.0         $$ Bruker NMR JCAMP-DX V2.0
##DATA TYPE= NMR SPECTRUM
##DATA CLASS= NTUPLES
##ORIGIN= Bruker BioSpin GmbH
##OWNER= nmr
$$ XWIN-NMR		Version 3.5
$$ Wed Jan  3 10:56:46 2007 GMT Standard Time (UT+0h)  MAYBRIDGE\nmr@NMR_250MHZ
##.OBSERVE FREQUENCY= 250.131544655141
##.OBSERVE NUCLEUS= ^1H
##.ACQUISITION MODE= SIMULTANEOUS (DQD)
##.ACQUISITION SCHEME= undefined
##.AVERAGES= 16
##.DIGITISER RES= 18
##SPECTROMETER/DATA SYSTEM= dpx250
##.PULSE SEQUENCE= zg30
##.SOLVENT NAME= CDCl3
##.SHIFT REFERENCE= (INTERNAL, CDCl3, 0, 16.5055)
##AUDIT TRAIL= $$ (NUMBER, WHEN, WHO, WHERE, WHAT)
$$ ##TITLE= Audit trail, XWIN-NMR		Version 3.5
$$ ##JCAMPDX= 5.01
$$ ##ORIGIN= Bruker BioSpin GmbH
$$ ##OWNER= nmr
$$ C:\u/data/dgb/nmr/ADRS/170/pdata/1/auditp.txt
$$ ##AUDIT TRAIL=  $$ (NUMBER, WHEN, WHO, WHERE, WHAT)
(   1,<2007-01-03 10:56:23.15 +000>,<MAYBRIDGE\nmr>,<NMR_250MHZ>,
      <created by zg, POWCHK disabled, PULCHK disabled
       configuration hash MD5:
       49 4B E0 1D 92 C2 6B 37 9F E6 65 BC 52 41 86 1D
       data hash MD5: 64K
       21 DD E6 69 C7 0F 66 E4 62 BD BA 26 01 40 81 F6>)
(   2,<2007-01-03 10:56:35.72 +000>,<MAYBRIDGE\nmr>,<NMR_250MHZ>,
      <Start of raw data processing
       ef LB = 0.3 FT_mod = 6 PKNL = 1 SI = 32K 
       data hash MD5: 32K
       C6 28 FA A4 B5 52 04 4B 70 DC 43 B9 7D E6 B7 CF>)
(   3,<2007-01-03 10:56:37.58 +000>,<MAYBRIDGE\nmr>,<NMR_250MHZ>,
      <apk 
       data hash MD5: 32K
       E7 AF 2F 25 F6 08 44 F3 4F 9E 56 61 D7 D6 06 D2>)
(   4,<2007-01-03 10:56:38.43 +000>,<MAYBRIDGE\nmr>,<NMR_250MHZ>,
      <abs ABSG = 5 
       data hash MD5: 32K
       6B 4C 3E AB 53 01 8F 2A 59 18 7B 6B 05 5A F3 9B>)
$$ ##END=
$$ 
$$ hash MD5
$$ 3C 2B 1E C7 91 BE 6B 2D B5 02 AE 13 2F 1D 5C 94
##$RELAX= 
##$RELAX= 
##$RELAX= 
##$RELAX= 
##$RELAX= 
##$RELAX= 
##$RELAX= 
$$ Bruker specific parameters
$$ --------------------------
##$DU= <C:\u>
##$EXPNO= 170
##$NAME= <ADRS>
##$PROCNO= 1
##$TYPE= <nmr>
##$USER= <dgb>
##$AMP= (0..31)
100 100 100 100 100 100 100 100 100 100 100 100 100 100 100 100 100 100 
100 100 100 100 100 100 100 100 100 100 100 100 100 100 
##$AQSEQ= 0
##$AQ_mod= 3
##$AUNM= <au_zg>
##$AUTOPOS= <14 >
##$BF1= 250.13
##$BF2= 250.13
##$BF3= 250.13
##$BF4= 250.13
##$BF5= 500.13
##$BF6= 500.13
##$BF7= 500.13
##$BF8= 500.13
##$BYTORDA= 1
##$CFDGTYP= 0
##$CFRGTYP= 5
##$CHEMSTR= <none>
##$CNST= (0..31)
1 1 145 1 1 1 1 1 1 1 1 1 1 1 1 1 1 1 1 1 1 1 1 1 1 1 1 1 1 1 1 1 
##$CPDPRG= <>
##$CPDPRG1= <>
##$CPDPRG2= <>
##$CPDPRG3= <>
##$CPDPRG4= <mlev>
##$CPDPRG5= <mlev>
##$CPDPRG6= <mlev>
##$CPDPRG7= <mlev>
##$CPDPRG8= <mlev>
##$CPDPRGB= <>
##$CPDPRGT= <>
##$D= (0..31)
0 1 0 0 0 0 0 0 0 0.06 0 0 0 0 0 0 0.0002 0 0 0 0 0 0 0 0 0 0 0 0 0 0 
0 
##$DATE= 1167821782
##$DBL= (0..7)
120 120 120 120 120 120 120 120 
##$DBP= (0..7)
150 150 150 150 150 150 150 150 
##$DBP07= 0
##$DBPNAM0= <>
##$DBPNAM1= <>
##$DBPNAM2= <>
$$ [...]
##$SUBNAM7= <"">
##$SUBNAM8= <"">
##$SUBNAM9= <"">
##$SW= 20.6930455092707
##$SWIBOX= (0..15)
0 0 3 0 0 0 0 0 0 0 0 0 0 0 0 0 
##$SW_h= 5175.983436853
##$TD= 65536
##$TD0= 1
##$TE= 294.16
##$TE2= 300
##$TE3= 300
##$TEG= 300
##$TL= (0..7)
0 120 120 120 120 120 120 120 
##$TP= (0..7)
150 150 150 150 150 150 150 150 
##$TP07= 0
##$TPNAME0= <>
##$TPNAME1= <>
##$TPNAME2= <>
##$TPNAME3= <>
##$TPNAME4= <>
##$TPNAME5= <>
##$TPNAME6= <>
##$TPNAME7= <>
##$TPOAL= (0..7)
0.5 0.5 0.5 0.5 0.5 0.5 0.5 0.5 
##$TPOFFS= (0..7)
0 0 0 0 0 0 0 0 
##$TUNHIN= 0
##$TUNHOUT= 0
##$TUNXOUT= 0
##$USERA1= <user>
##$USERA2= <user>
##$USERA3= <user>
##$USERA4= <user>
##$USERA5= <user>
##$V9= 5
##$VALIST= <valist>
##$VCLIST= <CCCCCCCCCCCCCCC>
##$VD= 0
##$VDLIST= <DDDDDDDDDDDDDDD>
##$VPLIST= <PPPPPPPPPPPPPPP>
##$VTLIST= <TTTTTTTTTTTTTTT>
##$WBST= 1024
##$WBSW= 4
##$XGAIN= (0..3)
0 0 0 0 
##$XL= 0
##$YL= 0
##$YMAX_a= 604904
##$YMIN_a= -695580
##$ZGOPTNS= <>
##$ZL1= 120
##$ZL2= 120
##$ZL3= 120
##$ZL4= 120
##$ABSF1= 16.5055
##$ABSF2= -4.187672
##$ABSG= 5
##$ABSL= 3
##$ALPHA= 0
##$AQORDER= 0
##$ASSFAC= 0
##$ASSFACI= 0
##$ASSFACX= 0
##$ASSWID= 0
##$AUNMP= <proc_1d>
##$AZFE= 0.1
##$AZFW= 0.1
##$BCFW= 0
##$BC_mod= 0
##$BYTORDP= 0
##$COROFFS= 0
##$CY= 12.5
##$DATMOD= 1
##$DC= 0
##$DFILT= <>
##$DTYPP= 0
##$F1P= 14.0000005364418
##$F2P= -0.99999901652339
##$FCOR= 0.5
##$FTSIZE= 32768
##$FT_mod= 6
##$GAMMA= 0
##$GB= 0
##$INTBC= 1
##$INTSCL= 1
##$ISEN= 128
##$LB= 0.3
##$LEV0= 0
##$LPBIN= 0
##$MAXI= 10000
##$MC2= 0
##$MEAN= 0
##$ME_mod= 0
##$MI= 0
##$NCOEF= 0
##$NC_proc= -2
##$NLEV= 6
##$NOISF1= 0
##$NOISF2= 0
##$NSP= 0
##$NTH_PI= 0
##$NZP= 0
##$OFFSET= 16.5055
##$PC= 1
##$PHC0= 227.2586
##$PHC1= 5.749208
##$PH_mod= 1
##$PKNL= yes
##$PPARMOD= 0
##$PSCAL= 4
##$PSIGN= 0
##$REVERSE= no
##$SF= 250.130004126706
##$SI= 32768
##$SIGF1= 0
##$SIGF2= 0
##$SINO= 400
##$SIOLD= 32768
##$SREGLST= <1H.CDCl3>
##$SSB= 0
##$STSI= 32768
##$STSR= 0
##$SW_p= 5175.98343685301
##$SYMM= 0
##$S_DEV= 0
##$TDeff= 65536
##$TDoff= 0
##$TI= <Analysis number 999999
Compound Code 99
Book Reference 9
Project Code 9>
##$TILT= no
##$TM1= 0
##$TM2= 0
##$TOPLEV= 0
##$USERP1= <user>
##$USERP2= <user>
##$USERP3= <user>
##$USERP4= <user>
##$USERP5= <user>
##$WDW= 1
##$XDIM= 32768
##$YMAX_p= 371885131
##$YMIN_p= -59860
$$ End of Bruker specific parameters
$$ ---------------------------------
##NTUPLES= NMR SPECTRUM
##VAR_NAME=  FREQUENCY,     SPECTRUM/REAL,   SPECTRUM/IMAG
##SYMBOL=    X,             R,               I
##VAR_TYPE=  INDEPENDENT,   DEPENDENT,       DEPENDENT
##VAR_FORM=  AFFN,          ASDF,            ASDF
##VAR_DIM=   32768,         32768,           32768
##UNITS=     HZ,            ARBITRARY UNITS, ARBITRARY UNITS
##FACTOR=    0.157963299565203, 1,           1
##FIRST=     4128.52098158076, 0,            0
##LAST=      -1047.46245527225, 0,           0
##MIN=       -1047.46245527225, -59860,      0
##MAX=       4128.52098158076, 371885131,    0
$$ Real data points
##PAGE= N=1
##DATA TABLE= (X++(R..R)), XYDATA
$$ [...]
##PAGE= N=2
##DATA TABLE= (X++(I..I)), XYDATA
17263 -183586 -182274 -173449 -160977 -148900 -149537 -154879 -174899 -193705 -214130 -230568 -234392 -229211 -218024
17250 -218024 -212431 -213052 -208175 -204100 -198052 -190867 -193763 -201393 -205306 -195906 -183134 -175546 -175866 -179911
17236 -179911 -181836 -191052 -189334 -178731 -174608 -174713 -172208 -162657 -153071 -154331 -154851 -157781 -160716 -156099
17222 -156099 -152607 -147492 -144151 -148042 -146959 -143720 -145040 -142419 -138869 -126348 -118085 -124294 -124727 -123914
17208 -123914 -119795 -121265 -127781 -133659 -137565 -137246 -138199 -137827 -138411 -131530 -128756 -127713 -122029 -121032 -117983
17193 -117983 -112583 -104786 -104215 -110191 -110811 -104928 -100617 -98258 -93108 -87813 -85017 -81498 -80345 -76149 -76672
17178 -76672 -78760 -77131 -70310 -64004 -63090 -54983 -51336 -52596 -47275 -46524 -45678 -45541 -46905 -44609 -44112 -39961
17162 -39961 -23646 -16055 -19136 -17534 -4865 5931 13720 22303 34195 32212 39369 54959 67932
17149 67932 78911 86078 99067 113831 128893 147096 159251 168995 188847 220299 255958 300845
17137 300845 351134 412960 488792 575918 678326 779488 831538 764256 533407 135861 -329119
17126 -329119 -734086 -992505 -1068889 -1023677 -918572 -814280 -725990 -660696 -605773 -560705 -520873
17115 -520873 -495970 -471545 -445812 -424005 -404698 -397744 -387939 -366776 -353442 -340373 -325437 -311717
17103 -311717 -297774 -296653 -297504 -286877 -271095 -259605 -256010 -261295 -258952 -245108 -241251 -243884 -243336
17090 -243336 -240111 -231060 -217044 -216721 -218564 -213416 -207853 -210083 -212509 -217271 -213479 -199255 -190402 -190221
17076 -190221 -181867 -177758 -176733 -174959 -179417 -169035 -172104 -171892 -170105 -169249 -157395 -153169 -154011 -151773
17062 -151773 -152794 -147157 -144756 -149276 -158534 -161794 -160101 -150700 -145228 -139287 -135290 -139284 -139120 -137164
17048 -137164 -133531 -134901 -133321 -135921 -136321 -129976 -128145 -125111 -127082 -127880 -121589 -115520 -119147 -117733 -113075
17033 -113075 -113392 -111115 -112617 -118040 -117138 -112524 -108309 -105783 -110413 -106996 -98833 -90211 -98873 -96681 -90173
17018 -90173 -91652 -99250 -98560 -101030 -99014 -86553 -89731 -86706 -82236 -83642 -87036 -87060 -85553 -87805 -89844
17003 -89844 -89011 -86023 -86785 -88327 -88710 -86567 -88358 -88441 -78773 -70688 -65079 -62440 -71323 -80588 -80276 -73393
16987 -73393 -62427 -61720 -68383 -71726 -75082 -66962 -60182 -62353 -59907 -57318 -53082 -54671 -59763 -62904
16973 -62904 -61875 -62934 -65255 -61410 -55722 -52778 -51375 -50016 -49735 -55605 -52934 -52502 -51906 -56567 -55553
16958 -55553 -49787 -45929 -43001 -40007 -40437 -43761 -38033 -35131 -33638 -29230 -31067 -30903 -28730 -26048 -29475
16943 -29475 -34914 -39899 -38942 -34299 -30950 -30162 -27709 -26697 -29720 -24755 -20819 -21562 -21925 -18056 -15145
16928 -15145 -18821 -18196 -16338 -15445 -15364 -17344 -13287 -6513 -5931 -2003 -8513 -15073 -10672 -10750 -9860 -7802
16912 -7802 -10640 -15947 -9254 -10183 -8990 -1954 -2374 -5932 -894 3741 2560 -1578 569 7090 4568
16897 4568 -3728 -3249 1263 3517 2546 2074 283 -1798 4596 5794 5622 5588 7786 -2315 -9787 -10368
16881 -10368 -12427 -5965 3471 2839 704 2887 3102 4321 9352 14713 19318 17149 12459 10431 11228
16866 11228 11152 7113 6756 11126 14086 17696 17852 21400 24812 20525 20917 23955 19866 11462 7868 13028
16850 13028 14747 18938 23163 30091 30320 27592 26286 31485 37779 32664 25950 23480 25270 27282 31679
16835 31679 28212 31086 31461 26591 27229 31296 30648 30996 30400 37239 39788 35777 36955 37073 40475 43852
16819 43852 33690 32994 35116 37563 37341 39099 45140 38479 34154 31369 34980 44013 45257 48014 45085
16804 45085 38817 29289 30508 32069 29162 39504 49056 55420 60664 59378 57061 57608 56756 57094 55794
16789 55794 55966 54933 56116 61496 58207 55593 56509 58962 61990 58281 64933 71557 70448 67922 63188
16774 63188 62308 55864 51106 64020 69420 69860 65356 58870 60657 68894 65051 59009 59028 63813 68496
16759 68496 71001 68790 70762 70996 73067 79750 80174 71012 74491 86148 86877 82109 81208 85197 89131
16744 89131 86232 81681 78516 75121 75544 73131 76073 75598 73693 73919 71516 82797 92501 90004 83942
16729 83942 84996 91728 89197 81221 72601 72436 81304 87415 83892 83815 83849 73582 71479 79475 85967
16714 85967 90098 95808 94747 90120 90076 97064 95478 94440 94315 92305 93988 96359 91304 87713 90001
16699 90001 97875 107920 107752 100278 100242 102316 104058 99617 95706 101208 100993 97596 101761 102812 100044
16684 100044 102134 96691 94593 97989 104551 106182 108718 104971 99672 94857 94245 96615 100824 100438 100111
16669 100111 96336 95440 101400 98694 102325 100510 101884 101925 105310 106699 109403 111364 105021 100954 103408
16654 103408 103088 104174 116603 119018 121808 125061 124345 128431 130224 125379 117405 117876 115641 115168 116136
16639 116136 121082 126040 121077 118681 121414 121811 125311 124995 127315 131198 137182 129935 127588 121952 117359
16624 117359 119351 123984 121340 122058 126806 125586 122699 128056 134282 138674 134579 136472 134645 135038 140723
16609 140723 140151 140911 134286 129388 129931 131415 125495 127281 126502 128136 130250 132852 126682 127701 131653
16594 131653 136902 134636 131705 135025 144639 151593 151143 147053 147109 153486 151566 144774 136392 139887 140550
16579 140550 138196 141511 144956 142753 139438 138448 138493 142691 145511 143749 147307 141045 145913 156540 156412
16564 156412 153385 156404 157312 153265 149719 148846 152814 147135 147986 144437 142335 142256 140396 144884 156382
16549 156382 156229 154517 157098 164098 163207 157580 156307 160392 168591 169880 166017 161001 160782 159166 162050
16534 162050 162302 165848 170858 169495 167181 160665 157616 157468 152906 148913 154100 154160 161171 162626 163314
16519 163314 161911 161620 163148 165094 159204 154905 155717 156197 159985 168081 169933 165368 163506 166846 171530
16504 171530 177978 174753 174563 178400 178580 183428 178724 179907 179964 185789 183334 179202 172863 169632 172676
16489 172676 182337 188101 183073 177205 175355 176602 181317 182587 183408 187660 188308 178705 174920 174896 174093
16474 174093 171041 173901 183485 188837 178535 171341 177647 183645 192026 193222 184054 186451 187738 185957
16460 185957 180094 182241 184638 177609 182230 180801 179095 182314 184655 190546 192883 195804 197507 195518
16446 195518 189550 180728 178255 188370 193180 193913 197096 196850 197014 199116 204258 205893 205820 197875 192341
16431 192341 186486 192496 196193 199002 199708 192713 200333 198827 193356 198866 199862 200348 197689 199806 198739
16416 198739 196844 195423 193404 198944 208330 207463 211307 213514 208953 211547 205000 195634 195818 199240 202001
16401 202001 204766 204821 205860 212581 211672 207254 206035 202034 202541 205239 216250 219011 217260 214197 210510
16386 210510 211644 217284 213509 209734 215215 223864 223265 218069 220837 223967 227028 236252 234971 228919
16372 228919 227275 224527 224895 223783 226710 222462 219200 223573 220902 218191 218300 218597 226638 226728 229468
16357 229468 230242 235181 230757 218550 209157 209500 211648 218877 215290 221860 226915 219821 224647 233292
16343 233292 236485 228719 221166 219188 222285 225937 222115 221409 227068 218481 219891 219870 218819 220641 215260
16328 215260 220783 220727 218329 227014 230115 231773 227705 223575 227943 227760 224910 223833 233711 241419 237277
16313 237277 229197 223051 226315 234769 244547 248435 245267 246708 248889 251466 247458 241325 235676 232035
16299 232035 227173 233972 236226 237917 242848 241357 236811 230635 231899 237997 238310 247184 243451 238805
16285 238805 234409 232155 237617 242150 238702 240250 245411 248049 245263 240040 238490 245392 251065 245154
16271 245154 239578 238819 243162 246279 242829 240715 249005 257563 256315 247986 248754 254396 257755 250684 250682
16256 250682 251252 250622 242396 236499 241772 249492 250195 255120 255338 252769 250770 253071 245948 248558 259640
16241 259640 258223 256092 254066 249816 248692 252403 251709 246222 246528 256066 260871 257437 252438 251487 259637
16226 259637 266693 268357 269922 272150 266338 266601 265687 257428 258228 263579 261310 263768 264066 259489 243922
16211 243922 241439 252701 250992 248069 249510 258877 267890 265025 257586 255746 251325 256816 256305 252933
16197 252933 256131 259958 260759 265140 269491 270813 269641 274042 274945 278054 277254 275925 275493 276036 275062 274067
16181 274067 265363 261366 255502 260647 269734 272470 270734 265605 272727 277492 271442 265476 262933 263503
16167 263503 266410 267420 266707 267359 274589 278633 279615 279378 279924 274993 273233 271162 276084 274821 270327
16152 270327 270970 283079 290865 288565 283973 280038 274680 283183 291982 289049 287653 292815 290617 283103
16138 283103 272382 275279 282455 282141 284356 284844 280600 281910 288030 292873 289932 284681 279048 275688
16124 275688 281959 292861 298167 296060 291707 287357 287818 284322 279230 283096 280250 281435 289148 294756
16110 294756 298529 298928 301606 300159 297874 295515 294841 298162 304948 307891 306336 304173 302872 296910 297722
16095 297722 303331 298963 291421 290178 292624 295998 293343 293048 296454 307958 304818 298079 298757 302933
16081 302933 300386 299876 301571 303428 307338 307444 303498 300304 300867 302337 304350 307358 309846 314472 313911
16066 313911 313253 311116 313062 309397 304878 306229 304749 305043 305862 298961 299778 313458 315961 318671 317731
16051 317731 315606 315406 317907 315796 318238 323717 319756 314609 313793 312028 311573 313012 314499 313278 311967
16036 311967 308583 303698 299505 304696 315227 321755 322512 320529 322598 319167 313315 314875 323141 319764
16022 319764 315875 312423 307264 311070 320593 324097 324628 325534 325240 324418 325112 325762 321318 320434 325302 322758
16006 322758 324543 328916 324956 317395 325453 333449 332937 334573 339731 343662 340756 333663 327171 326692 331155
15991 331155 335822 338819 345138 341612 340279 331575 326992 328987 327959 324029 330384 326448 326158 323870
15977 323870 329564 330473 328027 332189 334898 332553 328639 327865 335781 334476 339357 342733 332770 325874 326117
15962 326117 328802 330582 336568 339054 337737 337004 336186 332761 331317 334997 332966 334023 333715 334186 338367
15947 338367 333759 334984 338944 341501 339980 339360 343311 345241 347186 349779 344324 337868 344704 355895
15933 355895 353248 342252 336071 333821 337867 345149 345323 342790 342355 344612 345043 347351 349831 345123 342127
15918 342127 338615 343682 345150 343712 343339 345069 342824 341134 346932 346085 345580 352446 353214 354321 353522
15903 353522 353657 347035 345168 351123 353474 350657 351531 346015 339869 337967 341112 343573 344899 350197 350506
15888 350506 351668 354808 353974 349821 344933 349674 355695 356217 349966 350007 350651 352173 350797 351928 357656
15873 357656 362943 367573 370583 365439 351829 345027 354235 364956 367298 362089 362878 364669 366144 365231
15859 365231 367357 362166 358797 361744 367684 367875 364949 363548 366094 374594 375480 370295 363104 362292 367042
15844 367042 365459 365135 362400 363241 363295 364896 365994 368539 369194 375586 378027 367444 364800 367960 368717
15829 368717 364025 366442 368266 370644 370596 368341 371197 371933 369812 370044 371114 376590 380434 378931 369992
15814 369992 370055 377765 389587 393158 382359 373895 375237 378242 375326 378275 377208 381282 382635 383599
15800 383599 390407 390460 387124 387770 387273 391908 398966 394635 383125 375990 375600 382462 385074 382513 382969
15785 382969 385198 385607 381336 381406 386914 381784 387533 392418 392645 388957 382311 382601 384697 385704 386991
15770 386991 387958 387549 389325 386267 388490 390333 391883 398751 401655 401207 391241 383540 377276 380611 385782
15755 385782 383412 383510 388621 390416 384344 386972 383488 382650 386572 387713 391585 391986 389613 390996 393612
15740 393612 401021 397108 391117 379212 377985 383841 385024 384820 388536 396203 401116 398232 394040 398014
15726 398014 394943 398976 391840 389201 392741 400112 396273 388333 388892 392665 389089 392796 397223 396963 393894
15711 393894 389264 383462 393902 400540 399866 396217 397586 401140 405208 410660 416562 409024 405407 401553
15697 401553 409389 414939 416454 413517 409514 407972 415280 411719 401868 399414 403554 411543 414359 419261
15683 419261 418504 412114 414154 421667 423226 420416 418530 409964 412651 413312 411585 407806 405665 401249 400822
15668 400822 407142 407997 408634 407558 405585 399859 400716 405934 406941 409426 416581 417378 417170 415469 415684 413875
15652 413875 416198 411895 416396 417252 417212 415340 418737 418967 421934 422430 412670 412572 420350 423334 423652 419141
15636 419141 423482 428436 432813 434332 426817 417955 414989 424804 421849 421680 425346 427623 434855 431905
15622 431905 427595 432282 437337 432195 422734 419391 425433 422100 420302 418904 421996 426105 433427 435478
15608 435478 437168 437381 434150 428866 429198 430474 431627 427733 423227 422674 427426 431885 436994 442875 447423
15593 447423 444727 441187 439438 431719 432549 441636 444310 444987 447593 443937 439925 442463 444599 442432 440309
15578 440309 440983 443143 446490 446136 443475 437073 436513 433346 434284 436655 435616 432911 435756 440430 444579
15563 444579 450224 445367 443148 438785 439580 432227 429611 435407 441673 440811 446324 445296 436230 427756 433286
15548 433286 439242 444172 444562 448685 449185 446204 444322 449986 451512 450322 451182 457639 456676 450257 450959
15533 450959 458016 461000 454803 452616 454327 455565 457605 460208 465796 456692 449935 455822 458504 461646
15519 461646 460131 456076 450846 451344 457683 462178 464077 462783 465658 464478 459475 454908 462613 465494
15505 465494 471394 466083 464441 471613 474426 475717 468976 466277 467883 468474 464097 470812 476463 473603
15491 473603 472862 472696 470912 467212 467159 468624 471077 467779 465220 468130 468711 467127 463917 461719 464281
15476 464281 468538 470659 470790 472909 470205 476387 475925 467960 468503 471277 472194 470140 471303 467075 471064
15461 471064 466796 470925 474151 475764 471998 469631 468659 473382 474318 473252 473254 473692 475906 475138 466648 463109
15445 463109 465838 474494 475379 478002 478343 471386 472006 477297 485707 484508 483529 483929 495451 490162 484739
15430 484739 481865 478054 478921 471955 472433 476085 488729 494983 486749 487999 484520 483516 482983 485006 486446
15415 486446 484747 484494 485518 483684 483454 480716 481187 482816 485871 485678 485686 486153 485332 485329 488935 486624 483752
15398 483752 486595 487943 482786 476546 479877 479433 472809 477736 482951 491711 494899 497621 500586 491741
15384 491741 484710 490162 492258 496707 497813 493825 485816 477934 476194 478777 477148 480248 494898 506816
15370 506816 510274 503816 501449 495077 491514 496269 492159 493358 492759 499752 502367 498988 494930 493684
15356 493684 493060 495022 493266 495959 498207 497463 497561 500160 504354 501579 510500 515338 509770 502396 500212
15341 500212 507853 515232 510765 509158 508797 509149 505909 504683 504799 503560 498286 498845 502205 511947 513579
15326 513579 506778 507217 500987 495465 497243 499183 498235 501624 506109 506532 509170 513120 513038 506516 506755 511685
15310 511685 513312 507928 505069 511396 510277 507579 511060 514080 514361 523994 524530 524160 523079 521118 525899
15295 525899 520622 515933 520750 528711 530019 529360 530897 532877 534485 535999 535264 532492 532170 532773 536320
15280 536320 535604 522979 523555 533329 538469 531004 529816 522788 521053 520999 518848 520255 516619 525183 531891
15265 531891 528874 526168 517317 520027 530023 533342 537202 533585 534933 540972 535371 532740 539196 537884
15251 537884 532308 528759 525623 525240 535299 543696 542076 546413 546539 542687 538607 542501 542349 538399 534139
15236 534139 531579 535263 535989 539840 540874 538046 538134 542099 539996 541584 539479 543535 542834 539440 540529
15221 540529 540096 545012 547183 549057 551056 547708 552952 552904 543044 541585 548362 550825 549821 547146 546773
15206 546773 545447 540627 545101 547649 545677 551722 547983 546560 547907 551434 549562 550311 554557 558244
15192 558244 554350 553418 550071 546756 548317 553754 557165 560868 564674 559721 566620 572990 561558 551763
15178 551763 550751 555118 550145 546253 545186 545764 542260 548434 556255 563385 562996 557801 550629 552728 553488
15163 553488 559369 565115 569744 568263 563462 556632 553640 559890 571866 573449 577727 570938 561956 565371
15149 565371 564373 566143 562649 560665 556856 559086 555171 555742 562598 564552 566381 569952 571576 574485 576966
15134 576966 581190 578381 571106 572195 574497 569275 567742 574449 569502 568469 572266 571309 564821 569698
15120 569698 570337 573478 578446 578983 576390 569468 571039 576772 572450 575038 584111 583240 581327 583377 584236
15105 584236 578117 574603 577307 582593 581767 584951 588721 585447 578482 580731 579579 581150 583357 583520 582583
15090 582583 579331 582163 582225 583351 587071 586131 584872 577301 573574 572716 578091 580127 580693 584030 584050 586206
15074 586206 590732 593301 594145 598644 597165 593172 592907 592148 585557 587046 596481 594086 597497 593698 591741
15059 591741 591079 593528 596755 594628 596804 595494 597331 600028 602393 600149 600983 603866 596988 592303 598956
15044 598956 601949 607955 604828 610552 610508 609493 610366 614120 615295 614464 606522 601113 601172 604648 608438 611772
15028 611772 602411 596577 596027 589855 586934 590262 589802 587074 595839 603219 612992 619403 618998 615631 609930
15013 609930 599076 596920 600028 602715 612724 617966 615091 608813 607469 610096 605373 606750 616256 616440
14999 616440 613592 621585 624485 617818 618428 619146 616470 610776 612065 615096 621241 620799 621785 622359 623494
14984 623494 628200 626983 624327 618839 615014 619115 626936 635283 633511 627773 624433 629261 638417 643040
14970 643040 639939 628582 627691 634078 639782 640349 640037 638951 632854 627329 624203 628831 636258 636784 636577
14955 636577 637917 642924 654295 649935 638657 631806 632834 639506 638563 638535 638522 642107 645611 641565 639065
14940 639065 634591 629922 633356 630923 631510 634657 638779 641041 639294 647389 652975 648028 646693 649733
14926 649733 652891 654853 653145 659828 658608 657664 656338 654438 652467 653592 652859 652923 652714 654921 652444
14911 652444 647402 655012 653946 651004 648750 649206 645239 639977 638775 641767 646620 648999 649315 654481 658211
14896 658211 652615 654944 657807 662695 666403 664630 658074 658875 662051 665098 667979 668233 668974 672675 671555
14881 671555 666114 665123 666543 674199 676611 674948 675207 673481 676522 679288 679438 675301 676822 673732 673352
14866 673352 667936 668537 673014 681729 678380 671800 677622 680611 672560 671365 669157 674311 676743 673330
14852 673330 671123 668775 668211 667898 664759 668064 674657 675822 671693 670701 677217 681948 677433 677430 678225 681277
14836 681277 682544 687471 684076 681153 681194 682291 687663 685811 687095 690402 689827 696067 698675 689526 679107
14821 679107 679858 687812 692448 692859 693550 700605 701486 707645 707207 705147 703278 697241 688861 695815 697875
14806 697875 699776 697287 698901 703647 704146 701857 697218 695899 700164 700349 704422 703113 704163 700657 701892
14791 701892 703189 701917 703450 710011 711206 709668 712544 702822 695895 695224 701518 707950 713762 715760
14777 715760 717301 714931 705736 704372 711299 716391 712496 712364 717136 725604 720499 715608 711673 709466
14763 709466 713234 716441 716676 713995 713589 720851 732037 736337 735565 739181 738833 740555 736799 729209 727404
14748 727404 726303 734512 729196 726089 732472 733670 732898 725444 722613 726544 729405 724871 729118 729209 729250
14733 729250 730463 729907 729838 729313 732263 727825 729687 730258 732771 739138 736012 731764 727376 728989 731169
14718 731169 734148 742188 744971 743807 746097 751481 746760 746634 748611 743061 742819 748346 749035 751065 751134
14703 751134 751613 754293 754703 757603 756018 750096 750158 760679 758636 755353 758804 756168 757309 760227 762392
14688 762392 768830 769067 764292 763143 757821 755325 758919 761002 765766 769577 772245 770966 769846 775888
14674 775888 777241 778328 771578 771276 772806 769868 766450 766558 766945 766173 769957 770873 773066 772975 772592 778494
14658 778494 780407 775717 771790 766623 765615 771664 778651 786756 780923 772784 770859 768840 773075 779043
14644 779043 777061 779072 780360 782850 784591 788410 789577 792456 793239 788774 788039 789148 781046 778100 784693
14629 784693 789431 794247 794968 795404 795074 791805 793134 792445 792415 796983 796775 799065 799707 795492 793743 793734 800442
14612 800442 795512 795031 800129 801134 798907 794672 797534 804852 807326 813522 811586 809789 807174 807590 816848
14597 816848 813912 811890 811765 808542 811943 818436 821707 812529 810071 810428 818638 817931 814837 814094 818917
14582 818917 814495 810584 807100 814823 824269 819661 813741 814320 815987 815708 821897 831781 834227 837194 832541
14567 832541 824677 830795 830553 823676 823833 830491 833659 831144 824192 824622 827916 833930 835433 840189 843927
14552 843927 842799 843907 835973 830011 834118 843586 844563 839949 835312 840364 843049 845419 846620 852347
14538 852347 856576 858419 864160 870801 864629 858229 854231 858140 864918 862065 862290 866550 862099 856093
14524 856093 855677 859657 858235 858348 867153 865207 863187 863907 862639 867237 867323 860116 859127 856941 856031 865340
14508 865340 871909 874261 872939 877279 883743 882114 879800 882786 882822 874954 869574 871124 873686 877753 879804
14493 879804 884368 886555 887367 884581 883976 889167 894382 893013 887376 884085 882897 885923 895649 900402 898740
14478 898740 894146 890684 891073 891793 899014 906936 910470 904528 895568 904320 911281 911328 909705 906878 906557
14463 906557 908612 908651 907421 900085 902300 907280 913465 912373 910276 918062 912136 912085 912908 913613 919681 916749
14447 916749 914953 911778 916779 916362 915187 915941 911386 908598 911646 913471 911477 912331 921845 933232 931582
14432 931582 935920 941597 937526 931531 929957 934496 935215 939468 939735 945267 949351 954818 967663 970221
14418 970221 969103 969924 968858 963309 959849 960572 959278 954010 957652 961564 955075 951265 954890 954962 954392
14403 954392 955383 960648 962644 968259 962248 958447 956699 961963 967252 964635 952247 955622 966908 971060
14389 971060 966655 962751 968961 970517 974265 977265 979048 987330 991485 993418 994216 991674 989968 992474
14375 992474 998822 996864 988800 984679 988057 997791 1002717 1002579 999396 997073 994675 997277 1005403 1010506
14361 1010506 1010350 1008186 1007365 1008519 1005896 1011261 1008943 1006810 1008334 1014706 1010183 1009062 1010950 1004666
14347 1004666 1007125 1013414 1015204 1025793 1027940 1029011 1027891 1025696 1029118 1036932 1034898 1036419 1039355 1041675
14333 1041675 1042233 1036394 1041947 1042331 1043503 1040955 1036876 1039489 1041693 1042892 1049348 1053150 1061548 1065316
14319 1065316 1069833 1063487 1060960 1063580 1066417 1070679 1066951 1060975 1061364 1068870 1062512 1064952 1070923 1066610
14305 1066610 1066247 1069251 1077211 1078079 1077650 1076670 1081044 1088357 1090054 1087497 1087861 1090353 1094017 1095725 1097524
14290 1097524 1098507 1099568 1097578 1098562 1104268 1106347 1102721 1106343 1107545 1111336 1112873 1118225 1118659 1121623 1126428
14275 1126428 1130866 1130873 1126191 1127240 1124172 1122992 1120393 1122473 1123469 1125232 1129646 1137448 1143107 1143403 1132200
14260 1132200 1130729 1141572 1145303 1152091 1156415 1152102 1150774 1151702 1153270 1157079 1164813 1167333 1168552 1176856
14246 1176856 1181391 1176503 1179809 1180111 1186331 1195446 1197001 1191615 1189927 1188226 1193757 1207879 1217805 1212871
14232 1212871 1206823 1213881 1218010 1221531 1223803 1225906 1225453 1223013 1227708 1240764 1254304 1258186 1262725 1263115
14218 1263115 1265260 1271077 1277288 1283559 1292972 1303942 1316412 1329816 1348297 1366740 1380344 1400355
14206 1400355 1426688 1454305 1481891 1509026 1517348 1496931 1432809 1336834 1218861 1092545 990461
14195 990461 929258 904991 911945 942076 975389 1006412 1027162 1043419 1059400 1071572 1087264 1098693
14183 1098693 1108427 1117280 1121142 1139020 1149630 1154261 1156948 1162663 1165864 1170382 1176577 1178044 1180216
14170 1180216 1188968 1189237 1196057 1206798 1213006 1216966 1222035 1224959 1228508 1236994 1237267 1240669 1248738 1251547
14156 1251547 1254125 1257241 1266475 1274466 1273898 1270963 1274031 1270208 1265690 1270354 1275461 1273712 1273136 1275995
14142 1275995 1278570 1280878 1283326 1294771 1298525 1294638 1300715 1309645 1309451 1307165 1305887 1315096 1320019 1319356
14128 1319356 1324268 1332730 1333793 1333835 1338088 1344262 1343096 1345261 1351255 1355786 1355646 1352048 1357274 1358979 1362324
14113 1362324 1369523 1370274 1360508 1358608 1367997 1370554 1375804 1388183 1391954 1398857 1396332 1400439 1404653 1399562
14099 1399562 1404307 1412544 1415406 1416186 1419994 1415759 1422067 1432400 1437148 1438728 1445853 1445201 1447383 1458874
14085 1458874 1461886 1468178 1472410 1469902 1469339 1472012 1470445 1475420 1484304 1485920 1483837 1488822 1487320 1490632
14071 1490632 1497525 1503284 1508258 1507479 1516441 1517386 1513939 1516526 1521606 1519946 1510600 1509271 1518387 1525049
14057 1525049 1537547 1540730 1538379 1543194 1548449 1556404 1558674 1560904 1566302 1571184 1577700 1576785 1572026 1573113
14043 1573113 1574414 1582947 1589605 1589096 1586906 1594270 1605094 1610557 1605595 1604769 1606687 1602818 1594010 1594552
14029 1594552 1595830 1598281 1607942 1620774 1636935 1651177 1666789 1670383 1678558 1684579 1688542 1698747 1704562
14016 1704562 1704244 1702765 1713821 1720159 1715472 1717711 1727545 1736144 1746679 1751843 1752904 1756638 1759310 1763825
14002 1763825 1773670 1782127 1784280 1786524 1792836 1797245 1799763 1804302 1816476 1830057 1838626 1839166 1841008 1837472
13988 1837472 1839765 1854052 1864934 1879992 1884159 1889857 1902143 1916354 1932368 1943531 1942250 1940020
13976 1940020 1939928 1930550 1918170 1918045 1914848 1916475 1916553 1910268 1901792 1899841 1905654 1915643 1920461 1929366 1940305
13961 1940305 1953194 1964392 1978766 1982987 1986052 1989545 1999617 2012634 2021741 2030614 2036962 2047249
13949 2047249 2060123 2064550 2067362 2069123 2077275 2083662 2085857 2092538 2097190 2102248 2119028 2129698 2140305
13936 2140305 2147714 2156724 2173871 2183326 2194463 2205347 2221285 2234028 2240815 2242681 2248092 2253989 2262106
13923 2262106 2267918 2272416 2282027 2293578 2302530 2309486 2318298 2320572 2332659 2348119 2356465 2364877 2375169
13910 2375169 2385396 2396250 2408922 2422601 2431665 2440444 2450452 2463362 2476640 2494547 2508244 2522231
13898 2522231 2538194 2559620 2569594 2580443 2586964 2596545 2607209 2619644 2636045 2657777 2677833 2686406
13886 2686406 2702582 2712147 2718112 2736891 2760021 2774290 2797780 2816722 2838717 2856392 2867080 2886807
13874 2886807 2903320 2919306 2939321 2958979 2979267 2995804 3002307 3013156 3025272 3032384 3054066 3074262
13862 3074262 3099072 3117653 3141142 3173864 3203654 3237792 3274836 3318109 3364560 3394342 3406594
13851 3406594 3391108 3344404 3267214 3167893 3077104 3024193 3004858 3025220 3081050 3146383 3209421
13840 3209421 3270996 3321802 3368954 3409795 3450667 3491479 3527576 3561663 3598601 3629231 3660334
13829 3660334 3690459 3724249 3759815 3800638 3838033 3867768 3899673 3927595 3963546 4007901 4048961
13818 4048961 4093341 4136766 4175255 4226230 4275708 4315865 4351743 4388248 4431205 4475413 4533166
13807 4533166 4583242 4620782 4667404 4719086 4772622 4827470 4880805 4938680 4987640 5041856 5096928
13796 5096928 5151454 5212289 5277682 5345429 5415636 5487238 5558671 5628585 5701451 5777572 5857400
13785 5857400 5942096 6023741 6105171 6200412 6298882 6407452 6507743 6611696 6721182 6844127
13775 6844127 6964494 7081302 7202684 7329210 7456035 7583065 7709923 7849647 7999995
13766 7999995 8156842 8323269 8503552 8693038 8889183 9100246 9321350 9540167 9756806
13757 9756806 9972592 10189062 10412987 10663505 10941171 11247435 11588562 11955950 12345526
13748 12345526 12762955 13212285 13697243 14231645 14809728 15421671 16095081 16824029 17612752
13739 17612752 18449312 19314357 20200026 21122186 22123181 23286655 24674356 26339046 28349470
13730 28349470 30755613 33652953 37188511 41532241 46823785 53002903 59430679 64190395
13722 64190395 63845809 55658730 38916834 15058450 -11685632 -36010193 -53009714
13715 -53009714 -61159112 -61846571 -57239695 -50733785 -44688517 -39662600 -35580109 -32254502
13707 -32254502 -29526259 -27276441 -25410436 -23844787 -22528096 -21417729 -20444145 -19541335
13699 -19541335 -18658909 -17776754 -16914675 -16097045 -15337838 -14644805 -14010354 -13421195 -12891666
13690 -12891666 -12412559 -11965255 -11555538 -11168828 -10804938 -10465930 -10144529 -9839215 -9543891
13681 -9543891 -9260363 -8986784 -8728001 -8491936 -8265152 -8050805 -7853635 -7674058 -7499364
13672 -7499364 -7330475 -7172397 -7019632 -6870706 -6722253 -6578281 -6439798 -6302316 -6173225
13663 -6173225 -6054555 -5940526 -5823937 -5709107 -5598558 -5502327 -5407011 -5314895 -5225868 -5130027
13653 -5130027 -5036282 -4956428 -4875259 -4792875 -4711832 -4631891 -4559495 -4491306 -4428018 -4363207 -4294637
13642 -4294637 -4226246 -4161667 -4103534 -4050800 -3995269 -3938343 -3877754 -3825300 -3770499 -3718195 -3663843
13631 -3663843 -3612140 -3566911 -3528401 -3478425 -3429136 -3385975 -3345462 -3299252 -3258829 -3222605 -3178911
13620 -3178911 -3144977 -3111223 -3078932 -3044424 -3003418 -2963878 -2925680 -2894343 -2856412 -2816596 -2783954
13609 -2783954 -2759187 -2727254 -2697049 -2664798 -2637468 -2609005 -2576386 -2546353 -2530738 -2517428 -2516899 -2505046
13597 -2505046 -2486143 -2478999 -2480321 -2482967 -2484853 -2478871 -2467828 -2446286 -2411343 -2358413 -2296142 -2242199
13585 -2242199 -2200904 -2173485 -2152527 -2132229 -2107356 -2086237 -2062050 -2032386 -2015345 -1998048 -1973006
13574 -1973006 -1949452 -1935494 -1917927 -1900874 -1878247 -1857179 -1834793 -1812357 -1789893 -1763958 -1744935
13563 -1744935 -1729101 -1709193 -1685451 -1660301 -1637918 -1620053 -1614065 -1631644 -1675042 -1707603 -1718201
13552 -1718201 -1704628 -1680927 -1661615 -1639745 -1619475 -1597413 -1577839 -1555651 -1551112 -1545010 -1532080 -1515033
13540 -1515033 -1500919 -1486505 -1474354 -1463394 -1447744 -1432113 -1423426 -1420658 -1418080 -1398438 -1378097 -1356504
13528 -1356504 -1344382 -1334955 -1324963 -1311939 -1295266 -1286257 -1273367 -1265080 -1258345 -1246830 -1230552 -1216546
13516 -1216546 -1195886 -1177051 -1154407 -1145210 -1140616 -1155980 -1191432 -1235038 -1259300 -1249560 -1224634 -1206236
13504 -1206236 -1202436 -1199529 -1187384 -1173406 -1158760 -1147935 -1129675 -1118585 -1111293 -1099809 -1085523 -1084336
13492 -1084336 -1077373 -1057047 -1044409 -1034217 -1031560 -1022491 -1016700 -1012039 -1009811 -1003487 -996590 -989693 -978142
13479 -978142 -972532 -961656 -945304 -937999 -932385 -926783 -920346 -909013 -899344 -888044 -868320 -861225 -857223
13466 -857223 -858680 -870093 -888383 -892909 -883915 -874966 -872692 -863443 -854549 -846352 -840673 -832422 -821483
13453 -821483 -817154 -810103 -800396 -795016 -792465 -795159 -784681 -777184 -774630 -769702 -762085 -756151 -760605 -749840
13439 -749840 -736743 -733374 -727104 -719266 -711285 -703523 -696047 -697156 -705150 -706002 -699695 -696840 -682850 -670668
13425 -670668 -659439 -656088 -650961 -646203 -644130 -644186 -644900 -639574 -637028 -642508 -643667 -646549 -652819 -655062 -650509
13410 -650509 -647948 -647451 -650062 -646708 -630322 -615395 -606562 -601913 -591925 -580812 -577712 -576220 -571068 -562897
13396 -562897 -555788 -550851 -546949 -539312 -539618 -537668 -531706 -530423 -532125 -530838 -532848 -522604 -518214 -518584
13382 -518584 -515790 -511227 -502472 -498786 -496374 -488599 -476769 -480356 -481879 -480233 -476223 -467169 -464815 -462013
13368 -462013 -452737 -444668 -446623 -442041 -439421 -436884 -428336 -421380 -416561 -414371 -418405 -418961 -415350 -410285
13354 -410285 -404445 -399659 -397859 -400510 -400773 -399751 -392055 -384550 -376649 -378825 -375381 -367961 -368437 -377816 -380767
13339 -380767 -375707 -367039 -353719 -346761 -340484 -334180 -344914 -353081 -344753 -339324 -338477 -340211 -339110 -338731
13325 -338731 -332306 -321143 -309780 -308619 -302919 -306176 -310548 -305570 -298516 -297220 -301170 -292948 -279927
13312 -279927 -277091 -281296 -286292 -285507 -274572 -271186 -270367 -266507 -267793 -270589 -268331 -263125 -249454 -241121
13298 -241121 -238274 -247879 -243579 -236188 -233537 -230445 -230569 -222240 -216170 -219042 -216420 -219271 -222565 -212960
13284 -212960 -205469 -204138 -206350 -206963 -199179 -189121 -186600 -192147 -199705 -197583 -192669 -194803 -189416 -180156
13270 -180156 -175949 -169062 -163953 -158889 -162608 -160900 -159455 -153480 -143904 -136854 -129186 -127106 -120689 -118057
13256 -118057 -110326 -107135 -101242 -91200 -86220 -81359 -78026 -70202 -63495 -54078 -43412 -35296 -27485 -10952
13242 -10952 13534 32425 56035 86386 122714 151901 164183 154582 109888 21581 -99489 -234131
13230 -234131 -354461 -430055 -464117 -468296 -446993 -413432 -379627 -349948 -327269 -311484 -298505
13219 -298505 -284104 -270105 -251909 -238307 -233178 -225182 -219130 -214365 -214574 -209740 -205371 -202892 -197837
13206 -197837 -187832 -183147 -176237 -172582 -174114 -174282 -169877 -161036 -155187 -157647 -158619 -157244 -153724 -147498
13192 -147498 -145002 -140827 -133941 -122963 -121747 -127348 -126730 -122690 -124572 -120336 -114757 -110858 -113218 -110021
13178 -110021 -105232 -108089 -102641 -94656 -89140 -96042 -99610 -101654 -96090 -90808 -82218 -79210 -76092 -75610
13164 -75610 -80659 -81791 -74446 -75021 -73912 -66900 -57535 -49475 -43529 -42160 -47633 -49979 -46248 -45470 -48920
13149 -48920 -46987 -44240 -39445 -32368 -27077 -33828 -45273 -41922 -34818 -30134 -34924 -34305 -39729 -43376
13135 -43376 -39464 -33391 -34884 -43327 -44805 -37940 -31576 -24975 -21247 -17037 -12275 -12913 -14665 -14224 -16190
13120 -16190 -20501 -20754 -20764 -8192 10855 15708 16405 8631 8813 5307 3627 9092 4860 2781 1595
13105 1595 548 -5742 -7954 -3567 3062 12440 17513 18260 23121 24569 26851 19919 17072 18121 20141
13090 20141 25471 26595 21915 26313 28892 31539 29223 27836 29564 30774 35545 42034 42508 38659 31850
13075 31850 35650 41659 45771 53190 53714 51819 51045 55062 58965 53666 49140 51299 57168 62140 64210
13060 64210 66555 75649 78908 71951 70652 72664 66339 62019 58971 62310 66118 72058 72660 74615 75676
13045 75676 78477 75091 74372 80337 87078 85685 85992 86645 89399 92524 94959 93856 98357 104232 113083
13030 113083 112853 113560 116049 116374 107330 102349 99497 104252 102536 105798 107617 103257 100190 95260 98467
13015 98467 105830 111851 111648 110270 111875 113288 115364 112643 108770 114621 117247 122797 137342 136105
13001 136105 128607 132337 134115 131586 131722 134604 135594 134309 136712 137092 141403 144332 146778 150754 154897
12986 154897 150351 146526 148875 151119 150370 148116 151838 146771 143245 137792 139228 145352 147339 147356 150270
12971 150270 150337 154788 162790 157141 154821 145457 151194 155997 160801 164452 168127 168427 170177 172934 173944
12956 173944 176057 178864 175833 173024 170314 173064 177841 173425 173599 181585 189186 194386 193695 189598 191076
12941 191076 186385 182181 188553 196311 205186 200744 194160 191887 196011 197085 194585 188038 188815 191764
12927 191764 195307 203287 210528 208927 209622 205232 200690 194378 195238 196899 206060 211089 214102 219537 210883
12912 210883 202192 203145 204731 209857 214153 211636 201020 197648 195101 194428 201196 207234 208938 209692 212982
12897 212982 215434 219192 216724 218247 218234 210952 211215 213274 213429 213661 221183 221836 215722 216166 218596 223170
12881 223170 222114 224014 227547 230411 231523 227170 227222 231461 228157 228548 235361 232112 233592 236634 237540
12866 237540 237803 242060 246615 249322 244581 242167 243373 244212 244736 252402 252765 253515 257793 255710 253198
12851 253198 256872 258547 263728 266261 262010 258337 260347 258906 258558 258705 258443 260963 267223 276053 280198
12836 280198 275678 276338 269612 268001 272675 272271 269418 272265 282597 285701 276951 279731 288699 291258
12822 291258 284900 279684 276061 278182 276966 274458 273254 275124 279076 282486 282585 288551 287979 285535 283178
12807 283178 274030 266614 263676 263988 267571 270525 281182 284046 275147 266786 269217 275522 278814 283397
12793 283397 290699 291091 287889 289463 299961 301664 291194 290234 292612 287609 286494 293117 296042 295569
12779 295569 293020 288397 289205 292756 288672 294808 300159 297087 302210 310364 310011 314324 312092 312388 310279
12764 310279 302506 302283 302992 305552 299888 291802 292282 298839 303973 310312 312468 311066 311484 317983 326640
12749 326640 332161 329621 322923 327094 328896 325618 311669 309714 310182 313458 318265 318088 318913 319165 325730
12734 325730 331324 337979 348185 345171 337254 329579 331538 338126 332232 328598 333352 336981 337474 330771
12720 330771 325502 314669 315374 325818 334124 330544 331227 330882 326285 324561 332555 340157 336732 335608
12706 335608 340780 343849 342272 345187 350170 351539 354744 351995 346279 349709 349878 344542 342649 337986
12692 337986 338338 343559 349660 351441 351631 349957 345933 345983 346388 350327 358923 364279 355568 353017 359787
12677 359787 349764 348563 352299 363944 367089 365929 360364 359509 359699 367242 375720 375822 367928 373104
12663 373104 376873 367530 361750 363599 369617 375631 375718 375222 377111 379306 376725 374647 369009 361526 363001
12648 363001 368558 376179 376736 374811 371225 374532 381514 381929 377643 369905 366174 378095 382185 383225
12634 383225 385033 394836 391530 386637 387908 392388 386252 384714 383776 386595 390330 391900 390295 388756
12620 388756 394376 389482 387096 392937 394657 399039 397013 395956 401058 403374 395527 393475 390316 388646
12606 388646 393866 401416 409433 413427 412493 407409 395383 393439 399872 402872 402134 399161 397252 402287
12592 402287 399714 404090 407713 418476 421671 417475 414701 410726 414622 412817 413783 419028 421681 418277
12578 418277 419229 431203 432787 434192 428157 418672 415558 417366 421743 427345 419363 417637 424870 432041
12564 432041 432944 436337 441210 446708 448463 447085 443782 435860 432077 434456 432487 427683 429874 429516 426747
12549 426747 420367 426926 434441 434193 431330 428479 422654 424211 428290 432869 436122 442043 442659 442594 447997
12534 447997 449802 452184 453616 449021 447377 449382 449189 445496 443646 444186 445054 440054 441014 438637 440550
12519 440550 435641 435885 442029 446118 448033 454813 454874 455177 455064 461972 461552 460529 463934 461231 459729 462557
12503 462557 463611 464756 461388 462166 460938 454544 453834 461611 465503 461590 469376 474031 475645 474014 468432
12488 468432 467182 471677 470648 471132 467951 466128 469671 475211 477824 483883 485870 482674 479263 475540
12474 475540 478114 482323 479145 477499 476062 472561 471422 466368 466705 472358 467381 471392 482134 488599
12460 488599 483149 472587 468099 468994 473198 476814 484798 488339 482878 478367 479073 479277 483071 485531 489017
12445 489017 499374 503468 504861 503186 501122 495595 495997 499022 500142 501417 504818 502038 498745 503405
12431 503405 501058 503032 505363 506582 498058 499581 499595 497440 494779 498752 494888 495178 499430 499912 499572
12416 499572 507221 509721 505493 509755 510700 513413 511204 508358 509831 508545 506073 509623 510178 507084 505582
12401 505582 502944 500364 503472 506291 509223 511117 514507 521906 518682 511926 514834 513800 511239 505019
12387 505019 498946 504053 511730 519864 520800 520700 528036 531606 531292 525040 521113 525379 528099 532726 530364
12372 530364 522641 519882 522126 525906 528584 523302 523090 523742 526485 524363 529168 534332 532620 534287 529642
12357 529642 527730 526583 527857 531963 529598 524618 528081 535952 538673 542333 537143 536404 538769 545749
12343 545749 543965 539961 539874 537916 534940 533521 523884 527271 537543 538922 541874 541306 541130 544637 549641
12328 549641 551951 551492 558221 561255 556532 556104 545618 542948 548223 552010 551866 551152 544390 542107 546202
12313 546202 555570 555140 553866 556261 561836 558088 548295 543413 549060 556215 563710 556172 550887 553260
12299 553260 555513 552865 553641 559873 559316 550078 549194 544253 547852 554344 553749 552898 552164 555776 559780 561586
12283 561586 567558 574124 580529 575389 575740 577074 578549 579201 582510 574750 576528 582210 583118 585705 590399
12268 590399 586526 588019 603846 605314 605680 590943 565982 548874 552206 552615 554830 553376 553088 557928
12254 557928 569071 573866 578194 582039 580396 577502 579362 579510 585856 587482 583347 581825 581659 580079
12240 580079 582654 586931 583557 580743 588564 597171 596312 599137 596267 591582 591143 599008 606593 605827 607956
12225 607956 604645 612569 615461 614777 614191 614042 610067 600365 576511 564209 571130 571042 574118 580230 581211
12210 581211 580958 584239 583832 587221 588148 586735 594745 589096 595809 601245 597926 599609 595112 599779 606422
12195 606422 605424 598037 594842 594727 595909 601056 610526 612633 611571 606528 603799 606641 606244 603606 609342
12180 609342 610933 609571 610488 616490 616603 615340 608091 600238 600873 610436 609609 605854 603215 602255 602160 604823
12164 604823 607409 607910 616224 619784 619909 615143 615977 625167 620038 615342 613021 616946 625490 627715 624299
12149 624299 626550 627484 626131 621134 611591 615584 623165 633268 637196 631675 618918 614271 614631 609765
12135 609765 607085 608799 610650 618200 622444 627113 630485 634867 636868 635939 638908 639828 637448 645400 645384
12120 645384 644574 641504 629826 627248 635835 638890 651071 654614 649884 644289 643952 643364 652522 656338
12106 656338 648031 642009 644924 644441 639648 639352 642470 642896 637657 639914 642183 638829 640980 639583 643247
12091 643247 643692 640180 647244 652065 651489 648635 650732 650845 647463 646511 653781 665871 671129 670385 666546
12076 666546 668842 664967 662881 661738 652807 648241 649423 647005 650088 650505 651583 655577 662278 669249
12062 669249 670797 666211 661979 657131 655629 658227 664214 663006 663010 668606 670067 665097 660568 671233 679926
12047 679926 681397 670859 668651 673131 667137 665374 665366 665032 674312 674081 672581 674250 673667 681859 685504
12032 685504 679071 673705 678430 683905 685403 683205 681008 687184 690090 687966 692345 691791 692724 690285 685642
12017 685642 683028 675249 678148 675689 673217 674515 677928 677740 678508 680598 682842 683504 685337 684484 689172
12002 689172 697780 696227 683655 677601 667947 669547 676736 682619 686690 695722 696702 692429 691522 689398
11988 689398 690075 692387 690129 698339 707287 701907 695674 691919 694699 688532 689106 697391 704912 706533 699013
11973 699013 695201 702263 702512 705336 707415 702393 710445 711906 709053 705499 700635 698112 702134 707093
11959 707093 709987 711409 709831 711693 717679 723265 722631 721536 719691 715861 713578 712634 719135 726505 723091
11944 723091 722634 726028 727030 724115 719870 718339 715585 713894 712910 717959 725200 727866 722154 723324 723862
11929 723862 734082 735690 734946 739351 735804 736643 736300 735420 720314 714397 714545 716527 727099 724947 728735
11914 728735 736093 741609 739956 741406 737735 730451 726820 728683 731199 734359 730730 730831 735307 739009
11900 739009 739365 748629 751398 745759 739127 741079 748259 749878 748547 750815 750987 744435 741501 743556 740314
11885 740314 739845 740454 743577 743360 740698 736292 740162 740504 744348 747428 741975 747202 744200 743681 739636
11870 739636 739232 742215 745607 750387 747863 747944 756633 759416 761482 762697 758757 759638 762968 765044 761272
11855 761272 757253 756587 756639 762077 758082 750807 747471 753760 762920 758629 758411 762650 767186 776070 769923
11840 769923 764447 760389 758427 769920 773129 771535 772605 779199 777414 775330 777872 781340 781744 781407
11826 781407 783760 778899 776500 778253 771788 770173 763942 767321 774539 778198 779279 779853 782756 780434
11812 780434 782490 786511 788607 793894 791722 785280 785978 785004 787251 788744 787999 780434 784117 783059 780968
11797 780968 783610 790085 790379 785100 788451 794461 797497 799393 796320 794683 793973 798934 805982 805158 799544
11782 799544 802419 802555 804397 810894 812541 807007 805428 804168 806650 806628 805007 810502 809709 805486 805359
11767 805359 800529 800573 804311 807626 809118 808338 810911 801413 799110 799301 801512 800492 800212 806925 806731 807813
11751 807813 809569 809946 814128 820426 807416 801634 809462 810250 805429 804546 811442 808568 800338 808835 822774
11736 822774 820821 814827 810751 809648 810882 817505 821879 825231 825325 831624 834858 831707 833185 832134 828562
11721 828562 822927 825137 826077 825864 822896 826175 837156 840047 835923 830642 829203 828518 831630 841205 842642
11706 842642 835665 830030 823477 825009 828010 830223 831030 829845 831330 836431 839649 839289 842414 840529 838262
11691 838262 836825 838384 838416 839716 840063 842260 847572 860994 863581 863535 867856 864783 852354 849976 853018
11676 853018 853677 850881 850669 854895 859472 860381 858519 858048 861501 862343 859338 865312 861245 857705 857044 856105
11660 856105 861863 863944 864077 863233 867498 869880 866986 865715 863682 863319 872089 869907 870588 866553 865908
11645 865908 869454 866878 869704 867996 867458 872136 873578 875906 868226 876191 881604 878080 873957 874298 872548
11630 872548 873667 879094 882609 883461 880440 883335 886464 881832 885193 883327 880959 876215 869874 875381
11616 875381 879968 877784 879676 884287 885960 884264 889641 894364 892924 890707 886328 879739 882823 882432
11602 882432 882395 881021 881359 890948 889512 881747 887271 892434 893678 898611 900669 896501 897581 900676 894621
11587 894621 898474 901529 898050 899364 902363 904138 908495 907670 908253 909349 903277 898764 905436 914441 917669
11572 917669 911887 915692 914571 907344 909333 920445 920385 916696 923682 927470 920910 902535 892252 894436
11558 894436 894962 900730 908706 914761 909607 911446 912652 909067 916703 917396 927093 930254 926507 925043 923510
11543 923510 926999 931892 933672 933508 931061 921669 913056 903259 902517 909522 910197 910319 909467 910733 911943
11528 911943 917588 924432 925990 926884 920613 920479 931911 933205 931191 935365 936490 936068 932544 930094 934964
11513 934964 937505 937692 938201 938113 936651 933445 939510 942160 940256 944927 940968 941824 945114 944852 946145 946012
11497 946012 944554 938459 936603 937136 941210 950095 948323 948532 956140 956493 953073 952872 950051 948542 943697
11482 943697 947531 951888 948149 948941 947647 948573 947471 957943 963280 957797 950731 954347 962982 959613
11468 959613 958130 966411 963686 957105 950200 952830 955981 962648 964706 970196 972091 970900 966437 958672
11454 958672 956166 960743 968932 971677 968699 972031 971120 970244 970639 970366 973568 979199 979238 980896 983311 978436
11438 978436 967743 965337 957204 957087 959634 961300 965859 971218 974536 978239 984114 988074 993697 996646
11424 996646 997658 995080 1000227 1002915 998330 994049 990962 988715 979293 973638 973526 981876 985611 989743
11410 989743 994450 990160 989492 986529 982194 985889 985090 981033 983040 987574 989731 985857 985127 985492 988111
11395 988111 985105 988784 990814 997332 999901 997414 998983 1002515 999623 997509 1000157 999675 1002346 1003912
11381 1003912 1003407 1010364 1015231 1013328 1012827 1014024 1010701 1006840 1007598 1016600 1019274 1014490 1015230 1010321 1009990
11366 1009990 1011016 1010181 1013031 1015581 1013779 1017275 1022575 1021057 1016164 1017075 1021716 1021725 1024699 1022704 1017972
11351 1017972 1014356 1020505 1018678 1011895 1013166 1014845 1025002 1026973 1026434 1022548 1019682 1021450 1026458 1019771
11337 1019771 1020567 1023600 1024266 1033558 1040257 1043541 1042360 1043884 1041490 1037393 1035168 1038461 1039431 1035902 1036616
11322 1036616 1040630 1040885 1038846 1037216 1035995 1037446 1036413 1038063 1036054 1039070 1042723 1039146 1040919 1046010
11308 1046010 1043907 1047261 1050198 1050819 1048879 1045576 1045456 1049726 1052245 1050270 1059566 1058457 1051825 1056584
11294 1056584 1061584 1061803 1062043 1063472 1063168 1068748 1068692 1061360 1052609 1053883 1061218 1068462 1067381 1066953 1068234
11279 1068234 1069681 1074593 1077280 1079275 1078487 1073760 1070956 1068553 1068751 1068379 1057811 1063038 1075311 1080630
11265 1080630 1075527 1080088 1081957 1085000 1087502 1091286 1100302 1106717 1106069 1105122 1097558 1088561 1086640 1086418 1090786
11250 1090786 1092587 1088606 1083543 1082556 1084142 1084906 1091362 1098552 1094697 1091640 1096211 1094584 1090308 1089198
11236 1089198 1089023 1096870 1105905 1110788 1103199 1098320 1099494 1092737 1096310 1102630 1097911 1089094 1092048 1095265
11222 1095265 1099898 1102702 1108413 1103027 1103115 1105387 1098989 1099020 1100302 1105105 1111486 1111300 1107274 1106838 1113636
11207 1113636 1121946 1125554 1119474 1117153 1115946 1116424 1121575 1125041 1122947 1123891 1121626 1120450 1119051 1114451
11193 1114451 1117057 1117993 1112811 1114261 1119251 1121192 1127900 1126307 1121016 1123555 1126768 1139444 1137913 1134563
11179 1134563 1134405 1133243 1139213 1136881 1139288 1144806 1144542 1143053 1141933 1148439 1150993 1155004 1148482 1142406
11165 1142406 1140353 1146870 1147293 1148180 1155935 1155461 1147237 1146889 1153515 1156556 1149574 1143286 1148645 1154964 1156402
11150 1156402 1155941 1158369 1159259 1164393 1171997 1174384 1170676 1169425 1165190 1163565 1159959 1155746 1151328 1152812
11136 1152812 1162218 1168985 1171996 1176985 1184807 1182445 1178124 1176335 1172772 1175560 1178530 1174118 1173908 1174419
11122 1174419 1172924 1177805 1176311 1172282 1179354 1178850 1185555 1189274 1186408 1184884 1190682 1187538 1184631 1187394
11108 1187394 1184518 1183479 1186547 1190036 1191359 1194525 1198052 1190848 1181713 1180805 1180890 1185097 1191620 1197753 1200583
11093 1200583 1202885 1202533 1199568 1201254 1202155 1201429 1196419 1197351 1206898 1212867 1208842 1206278 1210587 1218426 1216486
11078 1216486 1213542 1214933 1214259 1213176 1214395 1214667 1219481 1221172 1218683 1218219 1221073 1219844 1217157 1219076 1215698
11063 1215698 1217605 1219564 1225361 1222860 1223052 1226950 1227350 1223618 1229389 1237139 1235563 1236780 1234594 1227147
11049 1227147 1225732 1231186 1230012 1231461 1237942 1239752 1243295 1249695 1253613 1253796 1251942 1248476 1243890 1241493
11035 1241493 1241443 1237374 1238851 1244722 1241008 1239525 1245950 1245653 1238151 1240619 1245029 1244720 1247017 1247404 1255359
11020 1255359 1262827 1262431 1261313 1259235 1260063 1266368 1269303 1265046 1260738 1264507 1263477 1262841 1266264 1269248 1264631
11005 1264631 1266178 1261293 1260037 1265529 1270959 1269225 1266904 1260424 1257426 1261311 1263775 1263558 1262319 1260342
10991 1260342 1260995 1267759 1269210 1263679 1267033 1269600 1259986 1258499 1266353 1273210 1279596 1279779 1280446 1289357 1292989
10976 1292989 1287708 1287501 1292748 1292090 1290209 1293860 1292212 1293508 1299412 1301877 1301731 1296345 1296256 1303782 1310354
10961 1310354 1316594 1317829 1315703 1312813 1310205 1310782 1316963 1316574 1318279 1316845 1315426 1311534 1305750 1309577
10947 1309577 1311657 1314832 1318967 1319459 1317878 1323198 1326921 1324165 1320516 1316220 1313554 1315247 1317111 1317937
10933 1317937 1313618 1312592 1311577 1320839 1327204 1328690 1333444 1341176 1342382 1340796 1340517 1342458 1347572 1351222
10919 1351222 1354076 1352377 1345381 1347360 1351896 1353382 1352934 1354228 1357147 1355409 1344140 1338061 1327318 1325066
10905 1325066 1329925 1330644 1333403 1330586 1334459 1336241 1333440 1332682 1334904 1340592 1342057 1345103 1348934 1347796
10891 1347796 1352891 1357404 1357698 1355488 1361419 1364130 1368005 1364716 1364781 1364954 1367746 1374500 1379057 1378284 1376987
10876 1376987 1373366 1372074 1375422 1380307 1378761 1375416 1375684 1376552 1374298 1375040 1378263 1384413 1387155 1385557 1387855
10861 1387855 1384582 1385002 1385528 1385808 1390365 1393561 1395871 1392773 1387797 1392144 1398903 1399407 1393754 1393106 1394231
10846 1394231 1392946 1391304 1396453 1393987 1395131 1395922 1399894 1399286 1401723 1405405 1405993 1402913 1400524 1397293 1393644
10831 1393644 1393996 1398985 1404358 1409091 1408931 1402200 1395002 1396743 1405552 1413892 1419447 1421946 1416667 1414063
10817 1414063 1415887 1411708 1412854 1408999 1403168 1404971 1413495 1424056 1426036 1423256 1417846 1422833 1435692
10804 1435692 1444572 1442817 1442578 1444482 1443227 1439773 1443326 1441981 1437182 1439425 1436107 1435694 1435033 1441732 1448639
10789 1448639 1454544 1450671 1448883 1450898 1447156 1441356 1443759 1445658 1446984 1452682 1454324 1448959 1447308 1451692
10775 1451692 1455578 1454688 1457054 1456618 1462379 1465150 1464519 1457098 1455530 1461058 1462177 1453429 1449778 1452565 1458356
10760 1458356 1463763 1461669 1462233 1468926 1476869 1481727 1487392 1486543 1480828 1485597 1490035 1490538 1488745 1492825 1495414
10745 1495414 1492361 1495537 1501455 1500756 1496092 1496312 1500305 1501617 1501489 1504035 1511029 1512502 1516499 1516243 1508511
10730 1508511 1504700 1506411 1505961 1502085 1506223 1505277 1500389 1498068 1502796 1503640 1503452 1510527 1514320 1517839 1521944
10715 1521944 1519205 1514228 1510767 1515995 1518951 1524564 1520339 1519707 1518844 1520774 1516365 1515117 1521894 1529844
10701 1529844 1528000 1521820 1524631 1535717 1539353 1543110 1543796 1549782 1557579 1556318 1555508 1555983 1547365 1546137
10687 1546137 1548844 1552836 1555721 1558875 1556514 1557372 1561990 1566097 1564806 1565766 1563868 1563315 1565977 1564912 1566077
10672 1566077 1566902 1567082 1568914 1566652 1568549 1578548 1583598 1580948 1585358 1585660 1585144 1584728 1579333 1582460 1587729
10657 1587729 1584379 1584267 1590169 1585032 1581636 1579154 1582943 1582806 1585080 1594961 1600139 1597091 1593626 1589204
10643 1589204 1589203 1594590 1602603 1603569 1605444 1604010 1604124 1605631 1611177 1613026 1617968 1622865 1622535 1626656 1623060
10628 1623060 1620639 1617362 1617053 1626280 1627463 1629483 1624279 1621779 1631102 1636190 1634872 1629873 1633036 1639854
10614 1639854 1641521 1636423 1639264 1639963 1641541 1646221 1648954 1647521 1646362 1642942 1643526 1649994 1653961 1653894 1648866
10599 1648866 1644678 1645228 1647725 1653249 1653876 1647659 1651092 1661998 1671707 1673573 1674104 1670591 1671331 1674430 1673066
10584 1673066 1672978 1681495 1680864 1671215 1671301 1675098 1676799 1667680 1671613 1679968 1677148 1679684 1688378 1685402 1682085
10569 1682085 1676884 1678697 1685553 1686745 1690167 1689995 1693383 1699509 1702280 1701882 1707434 1704503 1703430 1704344 1706934
10554 1706934 1716948 1724619 1722776 1724093 1725678 1726698 1726563 1727859 1733550 1729369 1729406 1730599 1723596 1721523
10540 1721523 1722581 1725551 1726640 1728906 1731735 1735566 1740359 1748614 1747167 1744686 1740860 1742491 1744456 1745887
10526 1745887 1747171 1756047 1760921 1756162 1756725 1756312 1758705 1755856 1760971 1768026 1772931 1773785 1781219 1783740 1786839
10511 1786839 1792914 1792827 1788824 1791922 1792252 1785308 1786962 1791385 1804260 1810242 1807520 1806162 1812375 1812256 1803346
10496 1803346 1803036 1799788 1797465 1804047 1804895 1813315 1815158 1810518 1812834 1818580 1826866 1830762 1827860 1825422
10482 1825422 1830630 1833217 1826484 1828592 1835980 1842308 1846299 1846793 1851355 1858259 1863724 1872589 1877441 1873922
10468 1873922 1874487 1875029 1874926 1864894 1854243 1850244 1859838 1857076 1854187 1853290 1856233 1864928 1863280 1859700
10454 1859700 1856410 1856403 1855396 1856659 1863337 1868580 1872285 1881048 1890573 1894172 1894170 1887547 1889984 1892782 1890315
10439 1890315 1895067 1898020 1905943 1916304 1912108 1911673 1909155 1910122 1914644 1921254 1921614 1923717 1927247 1930461
10425 1930461 1939141 1946153 1948572 1941219 1936962 1942004 1945754 1950066 1949851 1946952 1956018 1960221 1966229 1967213
10411 1967213 1968886 1961048 1958765 1963355 1963681 1954125 1951062 1960223 1962161 1966988 1976158 1979386 1981281 1980777
10397 1980777 1987324 1992294 1995994 2006568 2011855 2008248 2009759 2010211 2014395 2021037 2020937 2023919 2032244 2039770
10383 2039770 2041569 2045005 2047426 2051234 2059772 2065388 2070116 2073067 2079723 2086347 2087182 2095345 2106589 2107343
10369 2107343 2110219 2113356 2118070 2131266 2142915 2145642 2153187 2167185 2185380 2190886 2194218 2203531 2218561
10356 2218561 2226823 2232933 2248034 2259506 2268799 2284827 2306233 2323518 2334909 2345729 2362466 2387308
10344 2387308 2420211 2453587 2485276 2520547 2563607 2618439 2689625 2768976 2867750 2980350 3091128
10333 3091128 3159543 3110136 2899482 2599387 2307673 2051049 1787416 1495988 1218661 1016987
10323 1016987 958253 1035735 1153324 1266586 1355073 1434420 1504744 1551796 1593144 1630278 1663294
10312 1663294 1694276 1719385 1742963 1760334 1773501 1792983 1808546 1824513 1837892 1859587 1880237
10301 1880237 1893550 1904201 1914556 1934592 1947902 1957511 1976877 1998895 2013058 2019392 2029660 2043662
10289 2043662 2054295 2059326 2066205 2076787 2098219 2124134 2149501 2182821 2214835 2245512 2301776 2359554
10277 2359554 2407307 2425602 2401238 2344629 2278034 2199404 2090435 1938482 1783804 1661649
10267 1661649 1584434 1534267 1481398 1457808 1472522 1512402 1564214 1611132 1650430 1685438 1717909
10256 1717909 1747841 1767825 1779933 1789015 1804963 1820339 1835547 1848134 1855064 1857622 1863114 1879976
10244 1879976 1890015 1892260 1896875 1906698 1913489 1927727 1938611 1935855 1943184 1949629 1958889 1966710 1966061
10231 1966061 1965829 1977139 1987142 1994008 1996165 1997659 2001743 2006154 2009919 2012535 2018998 2027085 2028833 2035238
10217 2035238 2027038 2022687 2031587 2037452 2038538 2045851 2049279 2049685 2058288 2066968 2066982 2069627 2074447 2080817 2080826
10202 2080826 2077958 2076591 2077651 2074654 2074081 2076988 2082044 2090443 2094476 2092928 2092250 2104874 2109220 2111801
10188 2111801 2118870 2122667 2126517 2132837 2134760 2134393 2134828 2146135 2149235 2154148 2157963 2154294 2152732 2152459
10174 2152459 2156572 2161413 2167891 2167822 2168185 2167991 2167868 2163431 2159342 2160178 2167354 2178489 2190899 2201497 2202483
10159 2202483 2206953 2218533 2220963 2221943 2222588 2226867 2233059 2232917 2229186 2230092 2238984 2239751 2240551 2244388 2244615
10144 2244615 2251895 2256323 2259150 2258312 2252226 2250289 2254396 2260803 2263715 2270799 2272923 2276792 2278725 2280465
10130 2280465 2287586 2287887 2293683 2292817 2291339 2291968 2292349 2290620 2295828 2300411 2303992 2306707 2313554 2316140 2310910
10115 2310910 2309470 2313869 2317718 2321176 2324076 2327122 2331719 2329295 2333203 2335199 2338779 2341654 2355483 2363358
10101 2363358 2361311 2362842 2369119 2373359 2370755 2367078 2370928 2377306 2377106 2375456 2370262 2376317 2384524 2387385
10087 2387385 2393672 2398504 2404320 2407825 2406609 2413178 2419536 2422719 2421873 2423226 2424390 2427664 2425571 2430631
10073 2430631 2436487 2434716 2432232 2431993 2437907 2446866 2453670 2453414 2454102 2458836 2465435 2470904 2467990 2471385 2470546
10058 2470546 2472149 2471688 2477112 2479847 2483361 2484849 2482725 2481824 2488054 2496246 2499043 2509083 2513303 2514462
10044 2514462 2519326 2520307 2519557 2517404 2515766 2519370 2527346 2524697 2528511 2528474 2532639 2540709 2547555 2544534 2540356
10029 2540356 2547541 2549004 2553447 2556957 2557995 2560793 2562431 2569642 2575662 2580643 2582447 2580145 2586533 2592944
10015 2592944 2602293 2608040 2605094 2600527 2599323 2604661 2615935 2619317 2616386 2615417 2616130 2617921 2619928 2619163
10001 2619163 2626632 2631600 2637260 2646636 2645932 2645843 2650342 2660874 2668147 2670504 2671088 2670317 2671313 2670226 2670846
9986 2670846 2680239 2685651 2692088 2699806 2704662 2708036 2705510 2706603 2707011 2705504 2709170 2711627 2712037 2709682 2705628
9971 2705628 2708121 2715824 2716983 2721674 2724950 2726322 2731070 2736613 2738616 2743669 2760517 2772571 2780196 2781861
9957 2781861 2782296 2780917 2771163 2769293 2770419 2778432 2788271 2796652 2801956 2801708 2796499 2796064 2805881 2816966 2818411
9942 2818411 2827167 2826454 2827121 2835016 2842360 2844877 2843431 2845710 2835604 2841958 2857953 2867366 2870218 2863470
9928 2863470 2865241 2865983 2869496 2879524 2887791 2891671 2892216 2889675 2888112 2889894 2890605 2893573 2895968 2898268 2904443
9913 2904443 2908244 2913001 2921012 2932607 2940258 2944592 2946648 2943714 2943823 2946397 2952096 2956789 2954795 2961997
9899 2961997 2969757 2975345 2983102 2988754 2994930 2993216 2998702 3000633 3001804 3012745 3021784 3023743 3018373 3017051
9885 3017051 3017871 3029800 3034718 3037022 3046489 3050705 3050651 3054841 3064711 3070767 3069506 3063640 3063645 3071526 3076507
9870 3076507 3082508 3086710 3093889 3102489 3101992 3103096 3110105 3116604 3119075 3122580 3122404 3126448 3127847 3135608 3139506
9855 3139506 3134204 3140621 3146246 3156269 3160193 3155573 3160158 3162835 3170822 3176501 3175886 3180423 3187039 3189459
9841 3189459 3192689 3201209 3213515 3217996 3222661 3227102 3233951 3244408 3252300 3253407 3251115 3253409 3253241 3252665
9827 3252665 3264036 3273095 3278308 3284779 3287955 3286520 3283847 3294106 3298644 3300936 3303565 3308435 3311629 3319487
9813 3319487 3325115 3328450 3334417 3339706 3342989 3347308 3351831 3358792 3364113 3364293 3371317 3383508 3390849 3393665
9799 3393665 3399385 3407221 3413101 3417109 3425436 3436191 3436048 3439240 3443408 3449369 3452015 3456266 3459294 3465108
9785 3465108 3468912 3481473 3494810 3499035 3497402 3501196 3504468 3508198 3512953 3521547 3535145 3537086 3535709
9772 3535709 3536292 3541938 3548424 3551041 3556217 3569713 3577385 3592385 3603593 3610246 3620069 3622737 3626443 3634143
9758 3634143 3637434 3639669 3638206 3649601 3653944 3663550 3670797 3672845 3676674 3681599 3689232 3697398 3711180 3718671
9744 3718671 3735880 3748425 3751544 3755481 3762191 3769818 3776124 3780954 3782894 3792471 3805642 3818442 3822448
9731 3822448 3828909 3837867 3856861 3874776 3892415 3906484 3919044 3923591 3917628 3911889 3909160 3893266 3877403
9718 3877403 3857700 3845188 3834311 3820480 3822298 3833268 3855438 3874077 3879166 3887326 3904680 3921840
9706 3921840 3942597 3964627 3978781 3986377 3977931 3975111 3968759 3970003 3968976 3965853 3958303 3960933 3974032
9693 3974032 3989920 4007231 4028007 4045768 4064911 4080552 4084239 4082584 4078269 4068736 4061147 4052778 4040205
9680 4040205 4025860 4024266 4029369 4026079 4019462 4016862 4036024 4057021 4073358 4093265 4118302 4145057
9668 4145057 4166393 4178808 4188851 4203712 4209922 4218028 4216793 4205234 4199528 4201358 4203210 4202913 4196414
9655 4196414 4202060 4222856 4245003 4263948 4282665 4312027 4344040 4363801 4374189 4377524 4364109 4336540
9643 4336540 4313039 4281296 4250140 4224253 4205675 4195997 4198504 4209312 4226798 4246140 4262722 4280805
9631 4280805 4295770 4310562 4327944 4345861 4358291 4375871 4388468 4398597 4412150 4427968 4444371
9620 4444371 4453479 4460618 4468623 4472299 4491423 4507084 4515034 4524337 4526039 4534645 4553258 4566946 4576838
9607 4576838 4582268 4586408 4591334 4607239 4622016 4630689 4637921 4646476 4662652 4670977 4671682 4678326 4676682 4675075
9593 4675075 4673243 4662755 4657577 4675976 4711510 4750073 4780355 4816760 4842026 4864748 4884311 4904776
9581 4904776 4916281 4927594 4940805 4951944 4959649 4973669 4994594 5005606 5012454 5028110 5041722 5059743
9569 5059743 5070422 5083762 5098052 5111833 5124503 5134443 5147113 5161646 5171764 5183480 5200118 5211256
9557 5211256 5227434 5250900 5266382 5287778 5308986 5327283 5343356 5357951 5371990 5394500 5410832
9546 5410832 5427017 5446351 5476024 5507290 5526327 5530649 5533955 5516280 5492075 5475965 5472207 5475814
9534 5475814 5475515 5481631 5491950 5508808 5524088 5538888 5555657 5576379 5598224 5623049 5648142 5674415
9522 5674415 5693537 5704318 5712508 5734733 5754270 5771251 5793676 5812986 5836747 5860314 5885369 5903001
9510 5903001 5909983 5916999 5935156 5954216 5966020 5986208 6013383 6035020 6053046 6076386 6096802 6115165
9498 6115165 6133972 6151775 6175928 6205731 6228442 6247278 6272623 6293245 6309479 6324466 6335761
9487 6335761 6353701 6376174 6403496 6428898 6450525 6468297 6489908 6512373 6539547 6559585 6580105
9476 6580105 6607663 6640515 6674407 6711633 6742266 6756397 6762225 6781514 6810369 6843875 6880965 6918166
9464 6918166 6957418 6979405 7002606 7032842 7064456 7098819 7128031 7155146 7195198 7231365 7267585
9453 7267585 7296219 7321896 7349271 7369657 7396885 7433437 7465104 7504631 7550711 7593535 7633027
9442 7633027 7674090 7715966 7756159 7792205 7822189 7849121 7872272 7900756 7941313 7979048 8016081
9431 8016081 8050622 8084174 8115818 8154726 8200654 8240517 8281294 8328546 8377589 8426209 8464880
9420 8464880 8512396 8555067 8599099 8653304 8708381 8769332 8808434 8801333 8737710 8626909 8525815
9409 8525815 8499401 8577802 8707753 8824855 8920388 9006882 9106190 9201793 9283387 9362097 9430598
9398 9430598 9493136 9560585 9622452 9686704 9758423 9834761 9913703 9982481 10051903 10126117 10190953
9387 10190953 10255152 10335059 10418284 10501483 10583052 10671348 10765306 10859639 10954832 11050384 11135069
9376 11135069 11217113 11302679 11391896 11484756 11590279 11707997 11820905 11933897 12045934 12160736
9366 12160736 12267200 12381607 12496405 12618851 12752675 12883540 13012535 13144769 13280982
9357 13280982 13418187 13563776 13723848 13899103 14087301 14272379 14446907 14618662 14771018
9348 14771018 14861246 14891157 14937144 15083427 15299665 15535391 15784962 16044596 16311255 16573695
9338 16573695 16839907 17103252 17358919 17610072 17869892 18146158 18432653 18722460 19028778
9329 19028778 19363151 19717422 20091043 20485688 20900467 21328928 21779249 22251344 22734773
9320 22734773 23194049 23591707 23930389 24315181 24839623 25493903 26228586 27024893 27874594
9311 27874594 28781877 29730938 30730690 31797474 32944627 34159044 35435456 36821404 38340460
9302 38340460 40039606 41947097 44054403 46386853 49026861 52040235 55432662 59244199
9294 59244199 63587196 68560257 74105001 79968961 85798929 91727128 98860314 108210018
9286 108210018 119111776 128042942 126553155 99949957 35851649 -47887994 -107444709
9279 -107444709 -125313196 -119577284 -107998899 -97242182 -88435224 -81105427 -74569741 -68423752
9271 -68423752 -62712235 -57591537 -53118819 -49224625 -45807783 -42780432 -40063380 -37600373
9263 -37600373 -35363209 -33334614 -31503895 -29830263 -28293452 -26901938 -25632096 -24430371
9255 -24430371 -23276087 -22166389 -21118187 -20121684 -19165616 -18271145 -17477622 -16928100 -16867426
9246 -16867426 -17320198 -17764513 -17685806 -17168024 -16523549 -15916261 -15371316 -14870918 -14396919 -13918097
9236 -13918097 -13450989 -12999418 -12567784 -12171825 -11804568 -11461770 -11144524 -10848326 -10582753
9227 -10582753 -10331993 -10073256 -9830975 -9587208 -9348576 -9108909 -8874367 -8642173 -8411596
9218 -8411596 -8186754 -7972433 -7769513 -7580710 -7396458 -7216676 -7039340 -6864601 -6689658 -6526422
9208 -6526422 -6370761 -6219678 -6069601 -5927199 -5794609 -5666233 -5541865 -5415139 -5285641 -5162008
9198 -5162008 -5031140 -4898930 -4765069 -4641841 -4538344 -4440812 -4344554 -4244031 -4143664 -4037707
9188 -4037707 -3927111 -3820457 -3714255 -3624227 -3545401 -3468434 -3389614 -3305670 -3216128 -3132131 -3043542
9177 -3043542 -2955882 -2869832 -2782501 -2696899 -2620153 -2547538 -2473644 -2405847 -2334915 -2264360 -2195321
9166 -2195321 -2135914 -2066884 -1997194 -1936688 -1883813 -1845681 -1820735 -1807209 -1762687 -1727010 -1724848 -1735896
9154 -1735896 -1722412 -1650192 -1524030 -1379329 -1258239 -1161524 -1087099 -1023103 -961095 -898312 -846554
9143 -846554 -798544 -743820 -688330 -629239 -574058 -513147 -458877 -411645 -360704 -300394 -242026 -186900
9131 -186900 -139715 -98848 -51254 5000 55476 106081 158287 205995 243414 278092 316212 353444
9119 353444 383274 420298 469604 524096 571232 611189 657761 690125 729325 781112 829318 875980
9107 875980 927400 975812 1013577 1044965 1093953 1139684 1178475 1222019 1268942 1315061 1353083 1394243
9095 1394243 1437435 1497065 1565168 1630169 1673336 1715136 1754459 1791642 1831712 1878107 1929526
9084 1929526 1993070 2048595 2102231 2163808 2234829 2303782 2373182 2444131 2531874 2627814 2725849
9073 2725849 2828897 2932556 3036607 3149391 3274103 3408249 3550407 3715532 3927947 4177849
9063 4177849 4460191 4752618 4969206 4963304 4480438 3336153 1954440 1093470 839256 808120
9053 808120 777195 704489 630348 612954 681648 812969 966968 1133493 1299248 1461652 1613898
9042 1613898 1758549 1900873 2030167 2158961 2283362 2407515 2539876 2664780 2750146 2766684
9032 2766684 2693955 2515498 2270116 2014063 1802775 1664945 1613405 1643509 1721859 1823289
9022 1823289 1934964 2041415 2132340 2211994 2286494 2354088 2413487 2474833 2528091 2584126 2634372
9011 2634372 2680962 2727338 2774869 2818650 2865558 2908629 2956859 3001360 3047771 3088130 3125862
9000 3125862 3169976 3207999 3246941 3293378 3330785 3371029 3403426 3440052 3480226 3518753 3557610
8989 3557610 3599985 3639112 3668764 3698780 3729360 3762548 3801949 3841231 3872268 3894078 3922043
8978 3922043 3945075 3965176 3979788 3992248 4004483 4011121 4024575 4051495 4082206 4109497 4130969 4153616
8966 4153616 4189203 4261351 4351136 4437420 4500256 4551093 4593827 4630312 4670321 4718038 4761315
8955 4761315 4797169 4827286 4858941 4891353 4911014 4933723 4961511 4987771 5008560 5020597 5037314
8944 5037314 5063029 5114552 5192157 5268851 5335967 5398648 5465755 5528463 5575268 5617637 5650235
8933 5650235 5689421 5734134 5778335 5819269 5867808 5915188 5960600 6012229 6065940 6124222 6185492
8922 6185492 6244506 6301953 6362311 6419720 6459020 6471157 6456106 6417969 6366198 6316675 6288510
8911 6288510 6292100 6319446 6358561 6408204 6463784 6524587 6591124 6655085 6715387 6767451 6815326 6865827
8899 6865827 6909210 6956041 6995637 7034981 7091647 7145933 7190291 7211562 7216981 7228615 7249174 7272541
8887 7272541 7307863 7342173 7387420 7442014 7494862 7540580 7581905 7632711 7675100 7705333 7749425
8876 7749425 7801885 7852098 7893803 7934975 7978835 8031755 8092706 8156283 8234933 8307762 8374418
8865 8374418 8443383 8508249 8562648 8613535 8666618 8698174 8710983 8708341 8695143 8709235 8764587 8840835
8853 8840835 8923138 9007197 9099254 9191938 9283986 9364536 9428490 9491910 9559663 9628042 9698791
8842 9698791 9764697 9831820 9892525 9941708 9980075 10021857 10081381 10145476 10213975 10284041 10360711
8831 10360711 10448810 10536067 10620008 10703662 10786997 10873212 10953284 11028014 11111358 11193492 11294990
8820 11294990 11414727 11547756 11688714 11815995 11923968 12011769 12061477 12041567 12002640 12031612
8810 12031612 12128331 12242099 12363237 12483855 12598586 12692567 12784071 12877576 12964082 13055284
8800 13055284 13166632 13289980 13416985 13550991 13684689 13821446 13962007 14096519 14224234
8791 14224234 14353042 14466939 14531595 14521187 14429634 14320467 14290386 14389235 14594605 14831428
8781 14831428 15055635 15257052 15453456 15662075 15847263 16013603 16172548 16328202 16488504
8772 16488504 16656195 16825296 17003950 17187021 17341253 17465608 17545690 17556614 17512147 17464904
8762 17464904 17505166 17685037 17971721 18278927 18569389 18842339 19125910 19409903 19667790 19896766
8752 19896766 20108649 20316137 20533733 20761455 21005296 21259292 21527420 21798153 22070879
8743 22070879 22353233 22626430 22896768 23176010 23468585 23770283 24087750 24422340 24773548
8734 24773548 25128056 25471055 25777510 25983550 26099665 26243313 26513574 26886632 27303593
8725 27303593 27738994 28197088 28672039 29151518 29634982 30118389 30606604 31106875 31631329
8716 31631329 32185755 32768884 33372839 34001777 34651586 35313215 35970267 36595616 37133615
8707 37133615 37566085 37988062 38509293 39107737 39694907 40294581 41011918 41909195 42923415
8698 42923415 43990522 45084545 46196425 47348827 48548566 49823337 51169277 52588480
8690 52588480 54092498 55689983 57386959 59180526 61072285 63065291 65185636 67494760
8682 67494760 70004994 72700541 75602138 78753701 82199920 85934681 89752842 93256411
8674 93256411 95946593 97516139 98712676 101072787 105343960 111237255 118609300 127874972
8666 127874972 139374843 153051656 168850618 186799225 205990380 222574461 227316739
8659 227316739 203832203 133947567 23931359 -78446206 -129367731 -132976580 -115802902
8652 -115802902 -93988597 -72924350 -53854804 -36993499 -22316858 -9440937 2288126
8645 2288126 13512607 24836118 36602527 49481551 65249048 84981839 106798638
8638 106798638 125110663 128833313 99826087 21333637 -91913076 -187431363 -229438719
8631 -229438719 -229873198 -213945912 -194993036 -177260059 -161648514 -148195954 -136715566
8624 -136715566 -127043739 -119187279 -113041978 -108005696 -103398778 -98930407 -94485433 -90029412
8616 -90029412 -85701722 -81783373 -78715007 -77040744 -76853034 -77058014 -76263354 -74290051 -71804764
8607 -71804764 -69290603 -66926673 -64760884 -62771849 -60942485 -59256146 -57679389 -56217067
8599 -56217067 -54871724 -53594348 -52358550 -51162250 -50017218 -48927829 -47888021 -46907262
8591 -46907262 -45972534 -45051268 -44162365 -43307183 -42477238 -41685519 -40934318 -40220446 -39529305
8582 -39529305 -38873002 -38241109 -37627557 -37044329 -36480144 -35925656 -35387453 -34872255 -34372751
8573 -34372751 -33879992 -33403801 -32940925 -32498775 -32081173 -31678597 -31279491 -30884734 -30484621
8564 -30484621 -30092453 -29711388 -29333589 -28981493 -28642639 -28310291 -27996270 -27690464 -27394707
8555 -27394707 -27099404 -26815667 -26536421 -26248996 -25954977 -25673156 -25407657 -25153455 -24911711
8546 -24911711 -24673907 -24449269 -24225984 -23993917 -23752206 -23508619 -23271499 -23044363 -22832166
8537 -22832166 -22648386 -22502966 -22377688 -22244557 -22103031 -21994801 -21921772 -21813286 -21629279 -21369656
8527 -21369656 -21076257 -20803282 -20576131 -20387150 -20221957 -20062600 -19899608 -19738481 -19583677
8518 -19583677 -19426107 -19276980 -19132889 -18988591 -18862524 -18747981 -18657184 -18566868 -18476541 -18423487
8508 -18423487 -18405329 -18357817 -18225710 -18022580 -17785903 -17556931 -17361049 -17201857 -17062886 -16938335
8498 -16938335 -16821958 -16718691 -16617454 -16514576 -16416428 -16320945 -16224180 -16124922 -16018435 -15908646
8488 -15908646 -15786424 -15667695 -15565648 -15470991 -15382608 -15296354 -15210259 -15118660 -15030735 -14935459 -14843597
8477 -14843597 -14748169 -14655385 -14582812 -14513982 -14456514 -14402012 -14338501 -14272324 -14200376 -14114526 -14025949
8466 -14025949 -13939487 -13860879 -13786515 -13716753 -13650631 -13586318 -13516207 -13449632 -13391204 -13327101 -13258479
8455 -13258479 -13188114 -13118800 -13062793 -13011211 -12959817 -12915485 -12878657 -12826615 -12759536 -12689815 -12612171
8444 -12612171 -12540826 -12487286 -12441614 -12399302 -12349246 -12300206 -12247393 -12189941 -12135458 -12087865 -12034479
8433 -12034479 -11962348 -11903965 -11845632 -11785992 -11717529 -11648163 -11580081 -11521267 -11473005 -11421796 -11387040
8422 -11387040 -11354433 -11317734 -11271954 -11225358 -11184859 -11139524 -11088374 -11050041 -11007216 -10962625 -10914348
8411 -10914348 -10865435 -10813479 -10769956 -10722745 -10673473 -10618622 -10559289 -10519941 -10485557 -10449027 -10415390
8400 -10415390 -10382018 -10344454 -10299483 -10253511 -10202627 -10164138 -10130413 -10097868 -10064687 -10025736 -9988568
8389 -9988568 -9952534 -9915231 -9874906 -9829023 -9795923 -9763531 -9726908 -9691883 -9661226 -9625707 -9591221
8378 -9591221 -9560974 -9537402 -9503822 -9460337 -9415828 -9374879 -9342813 -9319740 -9290271 -9249213 -9212417
8367 -9212417 -9187884 -9168274 -9142267 -9119486 -9092553 -9050489 -9019433 -8997705 -8973701 -8936617 -8900177
8356 -8900177 -8878227 -8858857 -8836715 -8818958 -8813505 -8815025 -8815965 -8808712 -8793839 -8764641 -8730585 -8682917
8344 -8682917 -8633113 -8588442 -8540353 -8494492 -8452764 -8415042 -8387042 -8369536 -8350142 -8317998 -8289795
8333 -8289795 -8260615 -8239123 -8220359 -8214418 -8218813 -8223657 -8222253 -8218284 -8204048 -8173403 -8129035 -8082580
8321 -8082580 -8038976 -7999091 -7957838 -7918183 -7879354 -7843203 -7817123 -7794943 -7768544 -7738153 -7709167
8310 -7709167 -7683363 -7660220 -7638108 -7615920 -7589548 -7562084 -7536342 -7507969 -7473145 -7438938 -7411073
8299 -7411073 -7383720 -7366977 -7341046 -7307263 -7285169 -7262273 -7240270 -7218229 -7194810 -7168771 -7136807
8288 -7136807 -7101001 -7075521 -7053437 -7025080 -6999920 -6974847 -6937767 -6910055 -6872948 -6831921 -6796370
8277 -6796370 -6764276 -6727293 -6681078 -6644738 -6605845 -6572811 -6542368 -6502499 -6458290 -6416045 -6365471
8266 -6365471 -6300357 -6225354 -6146268 -6065186 -5989649 -5927508 -5902506 -5944288 -6079608 -6307088 -6587832
8255 -6587832 -6867417 -7084352 -7199932 -7216731 -7170011 -7098040 -7011464 -6912242 -6821147 -6740686 -6665460
8244 -6665460 -6589907 -6512587 -6434840 -6350180 -6254305 -6168433 -6110331 -6091001 -6145191 -6296796 -6541906
8233 -6541906 -6836014 -7116185 -7320324 -7420266 -7438978 -7409056 -7346408 -7272809 -7192821 -7115354 -7048873
8222 -7048873 -6994860 -6944582 -6895695 -6850948 -6809979 -6772078 -6735531 -6698108 -6676310 -6650108 -6626456
8211 -6626456 -6613358 -6593180 -6576884 -6560667 -6541839 -6513470 -6486798 -6459891 -6434015 -6403757 -6375861
8200 -6375861 -6350463 -6332797 -6318052 -6306137 -6289493 -6271899 -6250556 -6229864 -6212501 -6198712 -6181912
8189 -6181912 -6164040 -6145800 -6129192 -6121419 -6107434 -6099033 -6090488 -6077210 -6052906 -6031172 -6004139 -5969048
8177 -5969048 -5944329 -5934417 -5924920 -5915825 -5902268 -5888481 -5887153 -5889924 -5879281 -5860214 -5842780 -5826960
8165 -5826960 -5818767 -5806533 -5793047 -5775648 -5760693 -5748212 -5730497 -5715808 -5704796 -5694094 -5679833 -5670796
8153 -5670796 -5653156 -5634902 -5633756 -5629794 -5615443 -5602562 -5595180 -5581642 -5563330 -5548861 -5544599 -5543681 -5529591
8140 -5529591 -5513648 -5496045 -5479841 -5461773 -5454605 -5449465 -5444287 -5439191 -5428972 -5418864 -5405443 -5389518
8128 -5389518 -5382809 -5376412 -5362315 -5347702 -5332390 -5321055 -5316172 -5315925 -5317819 -5317655 -5316303 -5314248 -5313831 -5308959
8114 -5308959 -5304284 -5305167 -5293101 -5281178 -5269246 -5260237 -5246181 -5232367 -5219663 -5201377 -5194720 -5194752 -5178360
8101 -5178360 -5165295 -5151655 -5142092 -5136340 -5128400 -5120539 -5109730 -5097670 -5091583 -5081678 -5072698 -5069800 -5068517
8088 -5068517 -5058749 -5043942 -5025388 -5002712 -4990795 -4982047 -4974476 -4967100 -4958770 -4954387 -4948387 -4945523 -4947638
8075 -4947638 -4937486 -4924780 -4912799 -4899011 -4885412 -4874552 -4865785 -4854686 -4846500 -4844081 -4828876 -4825054
8063 -4825054 -4828113 -4826084 -4822901 -4822684 -4816988 -4816312 -4810015 -4791387 -4780181 -4766478 -4752503 -4742927 -4739056 -4729168
8049 -4729168 -4720782 -4718304 -4710346 -4703940 -4698971 -4701948 -4693580 -4675400 -4664519 -4660072 -4653458 -4649066 -4641850 -4629539
8035 -4629539 -4616313 -4606989 -4607752 -4601006 -4592514 -4582515 -4572136 -4567131 -4562882 -4553885 -4541096 -4528629 -4527384
8022 -4527384 -4518235 -4519096 -4519599 -4518758 -4505910 -4492837 -4489307 -4489949 -4478474 -4458270 -4447230 -4449201 -4461401 -4473998
8008 -4473998 -4479293 -4466318 -4438076 -4417181 -4414261 -4416793 -4404300 -4392605 -4387961 -4369285 -4360949 -4354624 -4359285
7995 -4359285 -4353460 -4342798 -4332697 -4326524 -4324486 -4314997 -4301854 -4294523 -4292564 -4292542 -4290527 -4275289 -4260563
7982 -4260563 -4253196 -4248699 -4241006 -4239944 -4237434 -4233810 -4223268 -4211239 -4212118 -4206608 -4205652 -4201238 -4188346 -4183815
7968 -4183815 -4176365 -4172469 -4168751 -4161569 -4150319 -4139669 -4127674 -4119734 -4117910 -4113424 -4109127 -4104377 -4095889
7955 -4095889 -4089482 -4071557 -4061174 -4053321 -4036784 -4036483 -4039392 -4031765 -4021673 -4012458 -4008106 -4002211 -3993548
7942 -3993548 -3986622 -3970852 -3948954 -3934024 -3912334 -3890192 -3879077 -3884551 -3910261 -3964197 -4037600 -4096018
7930 -4096018 -4123946 -4119358 -4107168 -4087346 -4064474 -4050655 -4036567 -4028814 -4019610 -4012239 -3993030 -3974542
7918 -3974542 -3960733 -3952422 -3951059 -3948552 -3938910 -3936931 -3930287 -3913284 -3905578 -3892220 -3875690 -3861386 -3857602
7905 -3857602 -3852388 -3851129 -3847595 -3842888 -3833989 -3815155 -3796681 -3786484 -3766143 -3749662 -3744389 -3737389 -3744048
7892 -3744048 -3766452 -3817591 -3886502 -3938177 -3956310 -3952029 -3937052 -3916379 -3893393 -3880431 -3865023 -3852572
7880 -3852572 -3839327 -3827760 -3818334 -3810190 -3800607 -3789568 -3784904 -3776184 -3771160 -3766540 -3759768 -3751593 -3750296
7867 -3750296 -3751288 -3743627 -3736191 -3733905 -3730095 -3720416 -3718621 -3713426 -3703130 -3697262 -3700276 -3697871 -3695280 -3697024
7853 -3697024 -3693892 -3678984 -3660238 -3656086 -3654907 -3650391 -3651798 -3647678 -3638791 -3633759 -3626043 -3616323 -3606770 -3600979
7839 -3600979 -3593785 -3582629 -3588444 -3589972 -3584650 -3581190 -3580648 -3581051 -3578581 -3573547 -3569257 -3561669 -3552013 -3543646
7825 -3543646 -3536274 -3534877 -3528627 -3526570 -3524635 -3515901 -3509230 -3502898 -3499834 -3505299 -3502948 -3500912 -3502078 -3499211
7811 -3499211 -3496113 -3490310 -3482015 -3481461 -3480822 -3477471 -3474172 -3466368 -3457286 -3463220 -3465162 -3459054 -3452993 -3446447 -3439450
7796 -3439450 -3435831 -3432901 -3432344 -3432183 -3426753 -3415780 -3409014 -3404001 -3401278 -3396590 -3393287 -3390528 -3389452 -3383944
7782 -3383944 -3373636 -3371517 -3375266 -3372207 -3362216 -3356722 -3358103 -3356909 -3351993 -3353506 -3347274 -3337321 -3335235 -3334274
7768 -3334274 -3331713 -3323847 -3319859 -3323099 -3320062 -3323019 -3321153 -3316835 -3316694 -3308205 -3302323 -3302056 -3297879 -3293571 -3292111
7753 -3292111 -3286062 -3276161 -3265763 -3264601 -3262582 -3258287 -3253694 -3253739 -3254915 -3262328 -3267412 -3261133 -3251506 -3250343
7739 -3250343 -3251465 -3243379 -3233877 -3235151 -3237011 -3234841 -3226021 -3220105 -3221298 -3215450 -3213372 -3210026 -3209998 -3201554 -3194878
7724 -3194878 -3190352 -3187633 -3181621 -3181943 -3179386 -3168485 -3164012 -3158120 -3154387 -3151411 -3145291 -3142062 -3144242 -3146369
7710 -3146369 -3138658 -3132813 -3125715 -3118925 -3113094 -3107108 -3107149 -3103534 -3101828 -3097945 -3097017 -3101910 -3114138 -3123825 -3125745
7695 -3125745 -3129017 -3120794 -3107766 -3098745 -3096384 -3094516 -3093664 -3087556 -3078546 -3070758 -3068255 -3070207 -3067432 -3062111
7681 -3062111 -3060068 -3057063 -3053649 -3045810 -3035750 -3032121 -3024269 -3017512 -3016998 -3016326 -3017750 -3020461 -3023004 -3019689
7667 -3019689 -3020808 -3018599 -3016614 -3012620 -3005983 -2998155 -2997362 -2991934 -2984067 -2981324 -2976711 -2978262 -2980878 -2978286
7653 -2978286 -2976439 -2970729 -2973600 -2971990 -2970367 -2966847 -2964221 -2958121 -2957713 -2961844 -2957501 -2949596 -2940869 -2941213 -2941635
7638 -2941635 -2942621 -2945738 -2939533 -2944618 -2937985 -2926781 -2919483 -2913234 -2912366 -2916800 -2915477 -2906336 -2898385 -2898770 -2896883
7623 -2896883 -2897840 -2894747 -2887511 -2886683 -2884533 -2878043 -2875630 -2875822 -2875415 -2872236 -2870233 -2863028 -2856891 -2855184 -2861515
7608 -2861515 -2869193 -2870835 -2863695 -2850634 -2845576 -2843560 -2838905 -2836135 -2837122 -2836262 -2838380 -2836524 -2835247 -2830291
7594 -2830291 -2818084 -2820437 -2818605 -2816139 -2813719 -2812477 -2804347 -2801856 -2801841 -2797186 -2787348 -2782095 -2784424 -2787801
7580 -2787801 -2788588 -2788873 -2784916 -2784078 -2784749 -2783410 -2785357 -2777827 -2773236 -2774733 -2773132 -2772679 -2771765 -2773295 -2773752 -2768553
7564 -2768553 -2762656 -2755863 -2743656 -2744825 -2744680 -2740138 -2729521 -2730148 -2732964 -2737224 -2729695 -2724229 -2728316 -2732537
7550 -2732537 -2726699 -2717861 -2710377 -2710207 -2712159 -2714845 -2711735 -2704194 -2697459 -2699643 -2697258 -2696953 -2692068 -2693307 -2693495
7535 -2693495 -2691572 -2690369 -2685239 -2678815 -2678007 -2684202 -2677131 -2669923 -2666532 -2666408 -2667141 -2662540 -2663480 -2664645 -2662796
7520 -2662796 -2667098 -2660132 -2650183 -2644721 -2644658 -2650378 -2652171 -2648840 -2645434 -2640886 -2637420 -2634668 -2631674 -2626619 -2622129
7505 -2622129 -2623720 -2619771 -2613624 -2611866 -2605680 -2603040 -2606250 -2608917 -2600303 -2597409 -2599847 -2603908 -2600515 -2594721
7491 -2594721 -2588679 -2592004 -2589198 -2585904 -2583689 -2585890 -2590993 -2581330 -2581865 -2581178 -2579580 -2576226 -2565929 -2556957
7477 -2556957 -2562930 -2561328 -2558443 -2561288 -2561550 -2562627 -2565117 -2563950 -2553058 -2549127 -2546514 -2542287 -2544505 -2550698
7463 -2550698 -2550546 -2548584 -2543702 -2534336 -2529670 -2536155 -2535858 -2534366 -2528859 -2522630 -2516699 -2511427 -2510411 -2512190 -2507052
7448 -2507052 -2504729 -2502736 -2497745 -2501453 -2509799 -2505112 -2495386 -2493104 -2495518 -2489984 -2494871 -2500001 -2500991 -2491295
7434 -2491295 -2483662 -2475966 -2475372 -2475564 -2475213 -2473423 -2468508 -2469141 -2465638 -2463801 -2459352 -2451366 -2451978 -2451775 -2447493 -2447741
7418 -2447741 -2448176 -2445362 -2447403 -2447823 -2437464 -2429588 -2430209 -2421973 -2424446 -2430260 -2435999 -2439481 -2434977 -2427832 -2423645
7403 -2423645 -2417262 -2424500 -2434170 -2433407 -2424087 -2417055 -2413742 -2407320 -2400314 -2401663 -2395398 -2394930 -2398868 -2396681 -2400919
7388 -2400919 -2402879 -2402414 -2394125 -2387724 -2389501 -2392176 -2399418 -2395475 -2385947 -2385293 -2386126 -2388877 -2388149 -2386489 -2385739
7373 -2385739 -2383824 -2379108 -2376642 -2370821 -2361374 -2355005 -2356571 -2368061 -2373801 -2372810 -2370853 -2358807 -2342573 -2338017
7359 -2338017 -2344652 -2355500 -2352893 -2346045 -2344071 -2348847 -2345120 -2336434 -2331924 -2331459 -2337283 -2337702 -2338523 -2333591 -2329258
7344 -2329258 -2329525 -2327805 -2321245 -2318079 -2315160 -2303301 -2302096 -2307875 -2308500 -2304691 -2303707 -2304024 -2300408 -2296560 -2297067
7329 -2297067 -2292015 -2294406 -2293157 -2288577 -2285053 -2283637 -2285292 -2279402 -2280770 -2276690 -2277758 -2280642 -2279594 -2271889
7315 -2271889 -2268855 -2273754 -2274702 -2277726 -2280593 -2281099 -2275807 -2263912 -2260140 -2254694 -2257092 -2264420 -2262554 -2259212
7301 -2259212 -2257335 -2259348 -2256567 -2251805 -2252445 -2252484 -2243617 -2241757 -2241818 -2241462 -2244522 -2241969 -2234482 -2236402 -2242659 -2238257
7285 -2238257 -2233776 -2236606 -2238337 -2235429 -2229853 -2227125 -2229208 -2230641 -2231628 -2229876 -2231968 -2237855 -2231331 -2220136
7271 -2220136 -2214052 -2210675 -2215632 -2214949 -2213555 -2212558 -2208839 -2210040 -2204879 -2200341 -2192913 -2194669 -2195160 -2189224 -2187980
7256 -2187980 -2185626 -2183629 -2177924 -2172501 -2166983 -2164885 -2164807 -2163735 -2172272 -2176731 -2177496 -2180014 -2183326 -2176372 -2172630
7241 -2172630 -2164993 -2162325 -2157471 -2152605 -2152339 -2158356 -2159202 -2161498 -2154848 -2154931 -2155632 -2152152 -2148632 -2152426 -2148404
7226 -2148404 -2148873 -2151755 -2147559 -2145689 -2149866 -2143953 -2139433 -2135232 -2141703 -2146109 -2149014 -2144335 -2143396 -2144916 -2137920
7211 -2137920 -2132289 -2131009 -2130059 -2129670 -2126930 -2120973 -2122159 -2123941 -2121552 -2124488 -2125229 -2125430 -2122359 -2116815 -2111594
7196 -2111594 -2106895 -2108074 -2105810 -2104722 -2101996 -2109845 -2105485 -2097421 -2096486 -2100785 -2096659 -2093982 -2092202 -2090805
7182 -2090805 -2094310 -2098860 -2090114 -2085622 -2090063 -2090538 -2084510 -2085317 -2082957 -2075749 -2062492 -2060457 -2072546 -2072567 -2064554
7167 -2064554 -2052760 -2051638 -2047375 -2045136 -2044925 -2057913 -2072889 -2074272 -2069354 -2061113 -2055600 -2056876 -2052320 -2039646
7153 -2039646 -2034465 -2034381 -2036349 -2037855 -2036708 -2032122 -2034828 -2042680 -2045227 -2044402 -2041519 -2043497 -2047298 -2044595 -2044838
7138 -2044838 -2041415 -2040325 -2031520 -2032677 -2036409 -2036279 -2032812 -2030928 -2031135 -2030139 -2024081 -2022726 -2022304 -2019501 -2020428
7123 -2020428 -2018512 -2017015 -2013638 -2014886 -2012668 -2014121 -2014461 -2015015 -2013400 -2014798 -2011275 -2007737 -2000289 -1993562 -1984820
7108 -1984820 -1983334 -1983551 -1982140 -1982990 -1976564 -1976490 -1977008 -1973970 -1972387 -1971955 -1968328 -1969852 -1974408 -1973123 -1966097 -1970161
7092 -1970161 -1977241 -1978657 -1971834 -1960848 -1964877 -1968478 -1973146 -1969935 -1956722 -1954840 -1958091 -1962195 -1964901 -1963358
7078 -1963358 -1959864 -1959023 -1953586 -1953908 -1950143 -1949369 -1949332 -1949998 -1950389 -1955475 -1952844 -1944293 -1939067 -1942767 -1945456 -1941710
7062 -1941710 -1940325 -1945172 -1944943 -1947551 -1948822 -1941013 -1930419 -1925490 -1922497 -1920693 -1924448 -1927812 -1928122 -1923878
7048 -1923878 -1921840 -1920248 -1924528 -1930899 -1930067 -1926129 -1919638 -1911938 -1920751 -1924113 -1921935 -1912489 -1909432 -1913403
7034 -1913403 -1920232 -1923511 -1922449 -1923349 -1926003 -1920691 -1914487 -1905831 -1899450 -1894212 -1895346 -1895263 -1897735 -1894435 -1887398
7019 -1887398 -1880456 -1886480 -1885462 -1883539 -1883558 -1883806 -1881402 -1886686 -1888455 -1884263 -1873587 -1872698 -1874336 -1872646 -1873215
7004 -1873215 -1873391 -1876179 -1868988 -1871253 -1876484 -1872096 -1875034 -1881432 -1871698 -1873891 -1881147 -1886651 -1885858 -1880491 -1871429
6989 -1871429 -1864340 -1865019 -1869674 -1869808 -1858202 -1850460 -1847027 -1848651 -1853081 -1862352 -1865343 -1856905 -1849873 -1844539
6975 -1844539 -1841065 -1842208 -1841201 -1838691 -1836193 -1841128 -1840321 -1840939 -1853745 -1853374 -1849045 -1848213 -1843281 -1838409 -1832383
6960 -1832383 -1830634 -1833469 -1836194 -1834156 -1838851 -1846330 -1846356 -1844319 -1836801 -1834187 -1839991 -1843289 -1837597 -1833688 -1833186
6945 -1833186 -1829786 -1826900 -1823710 -1822365 -1822901 -1824655 -1826152 -1824282 -1819854 -1814078 -1811822 -1809420 -1808515 -1804151 -1799608
6930 -1799608 -1798700 -1800877 -1799103 -1798559 -1799363 -1798588 -1796300 -1793779 -1789528 -1783776 -1784938 -1785204 -1789366 -1783148 -1784329
6915 -1784329 -1785638 -1783385 -1781900 -1780038 -1780079 -1782650 -1781127 -1774902 -1772724 -1773866 -1774195 -1777850 -1776873 -1781074 -1783248
6900 -1783248 -1781509 -1778934 -1780136 -1772011 -1768926 -1772169 -1775830 -1772507 -1766791 -1765372 -1761992 -1760018 -1764465 -1767460
6886 -1767460 -1764804 -1757894 -1760476 -1764038 -1767866 -1755268 -1746647 -1757378 -1769551 -1777084 -1769856 -1767279 -1761884
6873 -1761884 -1754728 -1754257 -1749236 -1746321 -1749956 -1747575 -1746409 -1744883 -1742484 -1748294 -1747367 -1741641 -1730400 -1725378
6859 -1725378 -1726060 -1732822 -1737152 -1739525 -1737340 -1741812 -1743664 -1744866 -1745811 -1742674 -1734042 -1724879 -1720129 -1717799 -1716983
6844 -1716983 -1718523 -1724288 -1727297 -1728186 -1727512 -1724602 -1720426 -1715619 -1708790 -1709568 -1716617 -1720028 -1714367 -1702019 -1701902
6829 -1701902 -1705413 -1710362 -1710970 -1712552 -1713757 -1711605 -1711203 -1696617 -1695608 -1694560 -1691551 -1688216 -1688551 -1686331 -1691261
6814 -1691261 -1692074 -1685931 -1687539 -1688460 -1687366 -1692748 -1691022 -1691724 -1691049 -1690155 -1692116 -1694320 -1698587 -1694568 -1686894
6799 -1686894 -1678911 -1671008 -1670223 -1673918 -1678032 -1677654 -1672250 -1675777 -1677658 -1681381 -1681127 -1674447 -1672324 -1669042 -1666760
6784 -1666760 -1673998 -1679031 -1672043 -1670148 -1670246 -1672060 -1667848 -1665922 -1665988 -1663463 -1663960 -1659345 -1651504 -1648071 -1647679 -1644565
6768 -1644565 -1643362 -1646929 -1646966 -1643008 -1643270 -1646452 -1654403 -1654813 -1658636 -1655958 -1650534 -1652771 -1654570 -1656908 -1661445
6753 -1661445 -1657498 -1656095 -1649094 -1646528 -1645625 -1639911 -1637847 -1644162 -1652232 -1659210 -1664202 -1648739 -1631754 -1629687
6739 -1629687 -1638506 -1641304 -1639760 -1641211 -1646365 -1645352 -1635473 -1637393 -1633730 -1625570 -1625604 -1628242 -1614494 -1617861
6725 -1617861 -1624820 -1622000 -1611103 -1607044 -1615514 -1616674 -1611538 -1614675 -1615194 -1616645 -1614974 -1614228 -1612851 -1605433
6711 -1605433 -1606717 -1606966 -1605441 -1612420 -1616651 -1619432 -1613375 -1603366 -1598558 -1600116 -1605708 -1606555 -1602778 -1595952
6697 -1595952 -1589981 -1587852 -1589608 -1590672 -1595014 -1596822 -1592264 -1588008 -1581651 -1577399 -1574154 -1572750 -1572734 -1567778 -1564061
6682 -1564061 -1562547 -1563957 -1561711 -1556198 -1558525 -1559921 -1559603 -1564554 -1563810 -1559311 -1560504 -1561839 -1558376 -1557165 -1556749
6667 -1556749 -1553839 -1551533 -1544289 -1532890 -1530372 -1531490 -1531300 -1529889 -1522026 -1515112 -1507409 -1502802 -1502387 -1500655
6653 -1500655 -1498142 -1497587 -1500651 -1496866 -1495059 -1489988 -1474117 -1461459 -1449722 -1440556 -1438171 -1426596 -1417501
6640 -1417501 -1397322 -1375322 -1349477 -1309969 -1265192 -1217947 -1168915 -1156819 -1314339 -1700014 -1994745
6629 -1994745 -2008216 -1937244 -1873531 -1826288 -1787749 -1758468 -1743478 -1722516 -1708763 -1695643 -1687496 -1675849
6617 -1675849 -1665464 -1652485 -1648033 -1641398 -1635901 -1631571 -1627216 -1633232 -1642639 -1645392 -1641921 -1630397 -1617020
6604 -1617020 -1609202 -1609862 -1613743 -1613539 -1613721 -1608109 -1598410 -1594192 -1597360 -1597036 -1590903 -1589852 -1586985 -1580150 -1579471
6589 -1579471 -1577349 -1576676 -1569473 -1568009 -1569796 -1565851 -1560560 -1560682 -1564450 -1564363 -1559812 -1562125 -1565295 -1556981 -1552069
6574 -1552069 -1554846 -1548782 -1546327 -1548520 -1554585 -1555136 -1547352 -1540770 -1543420 -1543451 -1538421 -1540745 -1547744 -1550989 -1547793
6559 -1547793 -1544009 -1541066 -1540562 -1537006 -1533885 -1537866 -1534496 -1528432 -1527242 -1518338 -1520126 -1520597 -1522291 -1525469 -1526740
6544 -1526740 -1520536 -1522167 -1526049 -1534848 -1530203 -1516654 -1520128 -1526492 -1519744 -1515520 -1519118 -1513823 -1509486 -1512373
6530 -1512373 -1511011 -1507342 -1509375 -1509807 -1507581 -1508661 -1511972 -1513975 -1509945 -1509007 -1514191 -1513675 -1512246 -1513548 -1507782
6515 -1507782 -1502388 -1504975 -1507995 -1501681 -1504927 -1508804 -1505638 -1501646 -1505967 -1512636 -1509105 -1502942 -1496076 -1497120
6501 -1497120 -1497139 -1495040 -1499357 -1499825 -1498004 -1491806 -1486327 -1482709 -1478814 -1478227 -1477607 -1477166 -1478089 -1481117 -1484012 -1476434
6485 -1476434 -1475349 -1477342 -1475068 -1474057 -1476118 -1479175 -1488716 -1488893 -1484780 -1484534 -1483894 -1480512 -1479036 -1479345 -1477212
6470 -1477212 -1464511 -1460710 -1467625 -1472769 -1479305 -1474232 -1461177 -1464549 -1470465 -1465885 -1461318 -1461988 -1462613 -1464996
6456 -1464996 -1469740 -1469890 -1467145 -1464002 -1460473 -1458226 -1458337 -1459802 -1457689 -1455222 -1453627 -1456209 -1462949 -1460553 -1459874
6441 -1459874 -1457435 -1453517 -1449126 -1445586 -1445394 -1449867 -1450592 -1449866 -1445634 -1437046 -1448496 -1454100 -1447707 -1440324 -1436704
6426 -1436704 -1439536 -1437140 -1428977 -1428774 -1435561 -1436695 -1442844 -1446301 -1451968 -1451193 -1447793 -1436239 -1428033 -1432968
6412 -1432968 -1439104 -1440564 -1436164 -1432489 -1440190 -1438113 -1429193 -1426129 -1432622 -1438103 -1438647 -1443169 -1450254 -1441784
6398 -1441784 -1436187 -1432575 -1421350 -1416809 -1416867 -1418210 -1418873 -1417532 -1420713 -1418833 -1416531 -1414394 -1421309 -1420534 -1418659
6383 -1418659 -1421867 -1417907 -1414550 -1416812 -1412055 -1407790 -1405632 -1401730 -1407280 -1409953 -1407131 -1414128 -1414737 -1410335
6369 -1410335 -1406834 -1409764 -1414901 -1410834 -1408281 -1402450 -1394679 -1394299 -1393571 -1395265 -1406906 -1410313 -1412545 -1410782
6355 -1410782 -1407415 -1405561 -1414096 -1411093 -1409405 -1408719 -1404783 -1399631 -1396719 -1397978 -1399737 -1395564 -1388005 -1384247
6341 -1384247 -1381229 -1382098 -1390261 -1389068 -1387902 -1384294 -1384691 -1388207 -1385808 -1383991 -1389569 -1394517 -1395944 -1393345 -1393895
6326 -1393895 -1393044 -1392486 -1394893 -1388094 -1380816 -1383693 -1384710 -1376054 -1375654 -1378101 -1379944 -1379937 -1377938 -1381009 -1376881 -1376969
6310 -1376969 -1378680 -1375153 -1371780 -1371125 -1367585 -1365889 -1368915 -1374931 -1371166 -1370728 -1369723 -1374892 -1378236 -1370726 -1369157
6295 -1369157 -1367765 -1364032 -1360202 -1358333 -1356486 -1359108 -1368168 -1372319 -1368287 -1373052 -1376750 -1374477 -1377193 -1381550
6281 -1381550 -1379865 -1370098 -1363284 -1359653 -1355925 -1348187 -1342701 -1346730 -1347989 -1352346 -1353395 -1349677 -1349848 -1348971 -1344314
6266 -1344314 -1345757 -1349752 -1353434 -1352791 -1349625 -1346902 -1346238 -1343055 -1344128 -1356038 -1353445 -1348828 -1346907 -1342380
6252 -1342380 -1343790 -1349663 -1347452 -1352004 -1348806 -1342893 -1336624 -1335777 -1338374 -1339156 -1338569 -1337143 -1341296 -1348153 -1343889
6237 -1343889 -1333769 -1331538 -1336150 -1338652 -1338763 -1340447 -1338437 -1336369 -1330012 -1327641 -1327848 -1330487 -1330503 -1323709 -1326780
6222 -1326780 -1328296 -1328156 -1326098 -1323816 -1322801 -1325751 -1327712 -1326405 -1329048 -1328001 -1329668 -1329532 -1323131 -1321926 -1318015
6207 -1318015 -1317014 -1320233 -1317430 -1318205 -1314046 -1312747 -1316885 -1320964 -1319205 -1319631 -1310449 -1302803 -1300484 -1306442 -1313983
6192 -1313983 -1308796 -1308352 -1305453 -1304775 -1311185 -1306119 -1305561 -1305907 -1308205 -1308696 -1305632 -1310465 -1309460 -1304192 -1302492
6177 -1302492 -1309298 -1317806 -1313794 -1308816 -1306596 -1309480 -1314686 -1310069 -1306569 -1308330 -1303631 -1302209 -1297348 -1291933
6163 -1291933 -1297015 -1299402 -1297897 -1301762 -1307366 -1305624 -1300423 -1302235 -1303252 -1310868 -1310202 -1311270 -1310470 -1304868 -1291731
6148 -1291731 -1282652 -1279213 -1285153 -1288602 -1291455 -1292048 -1288098 -1280124 -1280659 -1280300 -1285745 -1289849 -1293845 -1292156 -1288256
6133 -1288256 -1283952 -1282524 -1292786 -1295041 -1288447 -1279360 -1278168 -1280872 -1278899 -1277861 -1277300 -1280912 -1292784 -1288513
6119 -1288513 -1285059 -1280067 -1277268 -1278960 -1281525 -1280130 -1279845 -1275466 -1274537 -1278694 -1279593 -1278082 -1278396 -1274164 -1274593
6104 -1274593 -1271313 -1270452 -1273046 -1272686 -1272963 -1275835 -1273744 -1270859 -1276082 -1282096 -1281008 -1281671 -1278198 -1269322 -1266667
6089 -1266667 -1262461 -1257392 -1259250 -1255499 -1259147 -1257619 -1255118 -1259158 -1256722 -1261334 -1256877 -1252240 -1256884 -1256107
6075 -1256107 -1259325 -1266834 -1264109 -1262062 -1255953 -1253975 -1256239 -1259130 -1266337 -1260373 -1253991 -1251716 -1257233 -1255038
6061 -1255038 -1242231 -1245377 -1253401 -1249370 -1252086 -1252342 -1254631 -1248647 -1250079 -1247979 -1250425 -1258810 -1253471 -1259813
6047 -1259813 -1261461 -1260732 -1261267 -1256420 -1249512 -1245214 -1250762 -1254162 -1256567 -1255731 -1250218 -1250645 -1244926 -1242438 -1246538
6032 -1246538 -1248965 -1247501 -1247344 -1248703 -1244125 -1238165 -1234224 -1235056 -1237376 -1235276 -1232729 -1235070 -1233315 -1228192 -1228564
6017 -1228564 -1223863 -1224075 -1228147 -1221899 -1224863 -1229501 -1232693 -1234398 -1235573 -1228977 -1223144 -1225565 -1228236 -1233816
6003 -1233816 -1236208 -1228421 -1226868 -1225958 -1225021 -1225413 -1220578 -1217989 -1217879 -1216781 -1212535 -1213361 -1218315 -1219518 -1228233
5988 -1228233 -1228816 -1229609 -1229744 -1228424 -1226139 -1221204 -1219250 -1218225 -1216666 -1215446 -1209809 -1209258 -1215706 -1214821 -1211324
5973 -1211324 -1216362 -1211459 -1199316 -1197040 -1208452 -1212605 -1216778 -1219817 -1215134 -1213161 -1213268 -1214632 -1220669 -1218519
5959 -1218519 -1213735 -1211320 -1206068 -1208724 -1209245 -1208807 -1206770 -1197459 -1192175 -1187265 -1186271 -1186938 -1185209 -1193666 -1201014
5944 -1201014 -1201020 -1202474 -1202067 -1204942 -1207802 -1201468 -1195242 -1209334 -1213164 -1206692 -1203664 -1204100 -1206161 -1203129 -1197017
5929 -1197017 -1198449 -1203979 -1199913 -1203467 -1203578 -1200685 -1195851 -1192452 -1189006 -1189379 -1191186 -1192782 -1193061 -1197353 -1193835
5914 -1193835 -1191803 -1187447 -1190112 -1187393 -1188641 -1181212 -1180100 -1180416 -1182309 -1182554 -1187074 -1187099 -1181504 -1184990 -1184582
5899 -1184582 -1182590 -1181888 -1173695 -1169372 -1173439 -1179321 -1175196 -1174497 -1178040 -1182793 -1183638 -1182654 -1186558 -1186533 -1182509 -1180427
5883 -1180427 -1178921 -1180651 -1189101 -1188267 -1177739 -1178921 -1170751 -1169967 -1171765 -1174466 -1180874 -1177788 -1164921 -1157147
5869 -1157147 -1158905 -1167826 -1171082 -1170606 -1171021 -1170446 -1170698 -1170729 -1179224 -1178675 -1171140 -1169643 -1163335 -1163315 -1163715 -1164425 -1160354
5852 -1160354 -1154447 -1146172 -1144894 -1150635 -1152986 -1151815 -1152735 -1155572 -1162074 -1157185 -1158631 -1157155 -1158040 -1158834 -1156984
5837 -1156984 -1146843 -1144436 -1143236 -1142521 -1146149 -1145527 -1148128 -1157408 -1157113 -1155422 -1153347 -1157168 -1164554 -1162298 -1155939
5822 -1155939 -1153750 -1155793 -1161796 -1158121 -1156754 -1161081 -1157008 -1149475 -1142613 -1142555 -1147933 -1150616 -1148179 -1143150 -1132183
5807 -1132183 -1135587 -1135649 -1134572 -1137686 -1144730 -1152385 -1150054 -1145311 -1139523 -1144387 -1148286 -1149136 -1142816 -1142773 -1153963
5792 -1153963 -1149811 -1141567 -1142786 -1142187 -1139467 -1139318 -1142559 -1143826 -1140002 -1141476 -1145636 -1148195 -1155402 -1149176 -1141632
5777 -1141632 -1137522 -1138578 -1134950 -1132043 -1132279 -1136395 -1144054 -1145539 -1147647 -1141675 -1145423 -1152789 -1141869 -1135466
5763 -1135466 -1133086 -1133383 -1137568 -1134850 -1136227 -1135303 -1131889 -1132295 -1139650 -1145998 -1136610 -1128825 -1130825 -1131198 -1126748
5748 -1126748 -1125883 -1123830 -1117931 -1116377 -1122042 -1126606 -1123929 -1128959 -1131320 -1125433 -1125731 -1132095 -1128935 -1123695 -1120249
5733 -1120249 -1118681 -1125500 -1132277 -1135171 -1130661 -1119081 -1112761 -1112981 -1115280 -1123093 -1130910 -1130445 -1126548 -1125799 -1123352
5718 -1123352 -1126870 -1119514 -1121507 -1122981 -1118099 -1121402 -1116320 -1112831 -1116734 -1116457 -1111357 -1106101 -1109490 -1111920
5704 -1111920 -1112810 -1120397 -1114685 -1115794 -1121252 -1119661 -1120609 -1127834 -1126346 -1114526 -1113763 -1112312 -1108891 -1113493 -1116460
5689 -1116460 -1108506 -1109999 -1106122 -1101707 -1095191 -1093031 -1101527 -1106699 -1101385 -1098178 -1100028 -1101880 -1104292 -1102229
5675 -1102229 -1107689 -1108551 -1106552 -1107297 -1108527 -1104061 -1101233 -1099955 -1102221 -1098078 -1099986 -1099491 -1095045 -1105135 -1106272
5660 -1106272 -1098255 -1094076 -1098876 -1091002 -1082571 -1089046 -1098503 -1098311 -1095593 -1096253 -1096903 -1102840 -1097546 -1095374 -1096194
5645 -1096194 -1098774 -1096930 -1090150 -1089945 -1090327 -1092203 -1089753 -1088412 -1092746 -1093117 -1089940 -1090646 -1097343 -1095258 -1088428
5630 -1088428 -1078430 -1080815 -1081220 -1080436 -1082835 -1090704 -1085352 -1077515 -1070225 -1076043 -1084932 -1085228 -1082674 -1084462 -1094935
5615 -1094935 -1097342 -1092838 -1089692 -1087343 -1091546 -1098130 -1090421 -1088099 -1090858 -1093125 -1098892 -1093225 -1085513 -1085744
5601 -1085744 -1083193 -1076450 -1071769 -1074246 -1080410 -1081707 -1081855 -1083088 -1078859 -1070955 -1068967 -1073436 -1072532 -1075549 -1074676
5586 -1074676 -1070889 -1072384 -1070071 -1071375 -1074102 -1067730 -1067090 -1064688 -1070165 -1067477 -1067715 -1075652 -1079850 -1077973 -1065432
5571 -1065432 -1057340 -1057217 -1059452 -1063049 -1057745 -1059482 -1071862 -1076781 -1077549 -1072236 -1070901 -1073433 -1078381 -1080533
5557 -1080533 -1078944 -1077995 -1078991 -1075041 -1071155 -1072825 -1065270 -1063482 -1061147 -1057240 -1056529 -1054094 -1055201 -1057839 -1050543
5542 -1050543 -1042524 -1048649 -1052072 -1057651 -1061876 -1065058 -1062245 -1057075 -1050652 -1048149 -1054857 -1053016 -1045105 -1040824
5528 -1040824 -1037764 -1038647 -1046577 -1046734 -1050031 -1050250 -1054744 -1054396 -1055596 -1051389 -1052978 -1057786 -1062042 -1058534 -1055640
5513 -1055640 -1058700 -1058071 -1047488 -1047349 -1045742 -1046410 -1041204 -1038764 -1039682 -1039338 -1036796 -1030350 -1036541 -1044943 -1046280
5498 -1046280 -1045545 -1050892 -1048377 -1048652 -1050051 -1048831 -1051008 -1056059 -1054673 -1051047 -1046899 -1041373 -1043672 -1049997 -1049247
5483 -1049247 -1040557 -1039244 -1038224 -1033392 -1035034 -1038094 -1039036 -1037714 -1033016 -1030569 -1029443 -1037484 -1038155 -1039619 -1036245
5468 -1036245 -1037479 -1044406 -1047338 -1044863 -1041500 -1042263 -1045072 -1043684 -1035178 -1034657 -1037882 -1044658 -1042113 -1038643 -1036889
5453 -1036889 -1034625 -1039075 -1035241 -1031392 -1038137 -1039265 -1035000 -1030795 -1033953 -1040901 -1037792 -1033136 -1033225 -1028734 -1021793
5438 -1021793 -1017890 -1024090 -1030385 -1025223 -1020666 -1032937 -1035402 -1028467 -1023531 -1024595 -1022303 -1022513 -1028668 -1030327
5424 -1030327 -1022603 -1019242 -1017843 -1011839 -1015702 -1018413 -1014782 -1017261 -1018624 -1016852 -1015764 -1015465 -1018707 -1020682
5410 -1020682 -1025768 -1029294 -1027278 -1017188 -1014365 -1014700 -1012509 -1014264 -1024553 -1027699 -1028559 -1025178 -1017639 -1014719
5396 -1014719 -1010476 -1011816 -1013365 -1007691 -1009461 -1013156 -1019070 -1016805 -1013703 -1010530 -1004886 -1011751 -1012893 -1009193
5382 -1009193 -1007233 -1007995 -1015339 -1019353 -1011768 -1010930 -1014004 -1014207 -1010062 -1006006 -1011585 -1016638 -1015805 -1009334 -1006274
5367 -1006274 -1009403 -1011199 -1013911 -1014698 -1012931 -1012688 -1008448 -1005815 -1002830 -1005612 -1003813 -997516 -1001582 -1008615 -1011229
5352 -1011229 -1016491 -1018705 -1015162 -1007496 -1006592 -1006246 -1004345 -1002941 -1002184 -999197 -999408 -999988 -994991 -999761 -1005250
5337 -1005250 -1009903 -1004482 -1003221 -1005574 -1007261 -1010131 -1003929 -996239 -996951 -996753 -989895 -987836 -992436 -994130 -995710
5322 -995710 -1002010 -1001262 -1004280 -1012618 -1006965 -995410 -996558 -995694 -992980 -994475 -998015 -998133 -991500 -992802 -997371
5307 -997371 -998780 -995144 -989259 -994805 -1003230 -997398 -991857 -996583 -995186 -991039 -989780 -991910 -987666 -986816 -987841
5292 -987841 -987619 -992396 -990217 -991061 -990634 -990569 -992453 -985796 -982906 -975935 -976544 -982932 -985634 -983137 -985914 -990851
5276 -990851 -988586 -985245 -986729 -981279 -977387 -978974 -985115 -988980 -995164 -997437 -989744 -985343 -985869 -982301 -983024
5261 -983024 -976088 -972844 -981124 -981839 -977763 -976655 -976655 -974413 -974001 -979575 -984918 -986048 -983682 -986902 -984685 -983585
5245 -983585 -984833 -989326 -990247 -989956 -989124 -986455 -985169 -988500 -988414 -978640 -969992 -969090 -969659 -964146 -966808 -972993
5229 -972993 -973486 -972652 -978256 -980717 -976213 -970738 -973754 -975351 -967189 -969988 -961515 -961221 -969042 -967720 -967027
5214 -967027 -974536 -973090 -965669 -966440 -972696 -969810 -970259 -971905 -964920 -964424 -965483 -962469 -960255 -957713 -962860
5199 -962860 -967711 -969393 -966911 -966946 -968569 -968420 -969721 -960839 -960906 -971371 -976102 -973275 -971532 -964674 -959074
5184 -959074 -957200 -955796 -956269 -966482 -963859 -952468 -948622 -950502 -954395 -958465 -953549 -955064 -954134 -955683
5170 -955683 -958808 -954676 -955362 -955955 -951369 -951593 -951679 -948267 -949850 -950611 -955304 -953628 -948500 -948127 -952290 -950638
5154 -950638 -951743 -950444 -946451 -945790 -952335 -949524 -946331 -949591 -951121 -950037 -956282 -955461 -945654 -944208 -948095
5139 -948095 -947581 -949172 -948655 -950398 -955385 -950045 -948405 -949921 -952487 -951276 -949054 -947962 -947024 -949407 -957231
5124 -957231 -956557 -952762 -954136 -947765 -945337 -952213 -953584 -952668 -947355 -944755 -941736 -941396 -943276 -948399 -947410
5109 -947410 -949719 -950114 -949086 -948450 -947590 -941300 -934836 -938333 -940266 -940568 -944173 -946680 -951467 -949580 -941642
5094 -941642 -941172 -943100 -938544 -934678 -926046 -926325 -931276 -929129 -925574 -928506 -931614 -932462 -929501 -926884 -927541
5079 -927541 -929547 -931714 -930071 -929175 -928867 -928542 -930941 -925905 -919611 -925069 -930622 -927456 -933636 -933992 -935676
5064 -935676 -933986 -937356 -942017 -938081 -933033 -930149 -928311 -931346 -928007 -926124 -927483 -932835 -930276 -927499
5050 -927499 -925736 -922144 -922769 -925358 -927013 -926799 -922636 -921588 -928663 -928765 -927900 -927557 -923202 -921279 -918996 -918288
5034 -918288 -917215 -913282 -909599 -906597 -910765 -915796 -914377 -910897 -907339 -907298 -916251 -918009 -915257 -916659 -912191
5019 -912191 -919105 -920317 -917163 -919774 -921849 -914540 -912059 -920993 -925197 -928101 -924725 -919762 -920041 -910007
5005 -910007 -910094 -914187 -920305 -921817 -923653 -928189 -925311 -915866 -915599 -916351 -917183 -912888 -907680 -905044 -909286 -905486
4989 -905486 -899500 -902026 -905793 -906686 -913254 -912651 -904911 -905285 -913794 -920025 -919231 -921252 -917835 -915028 -907766
4974 -907766 -901516 -903623 -901460 -909855 -917856 -922241 -913070 -912162 -919662 -920634 -919158 -915582 -912804 -912898 -911006
4959 -911006 -912139 -907353 -899856 -899273 -905083 -910623 -912953 -922199 -923115 -922362 -917781 -911228 -911950 -915382 -912699
4944 -912699 -907117 -902447 -894238 -889081 -899682 -910592 -910541 -906869 -905753 -907421 -906070 -900930 -898961 -896481
4930 -896481 -895059 -892413 -892193 -893491 -893259 -895712 -895069 -897021 -904107 -903252 -902114 -899547 -894283 -894717 -897901 -903633
4914 -903633 -912911 -913386 -910956 -903749 -895886 -901315 -903008 -902906 -900291 -895239 -896554 -899899 -893302 -895979 -899012
4899 -899012 -899077 -901222 -889582 -881339 -881654 -884018 -881162 -888237 -895512 -894379 -892356 -887565 -879850 -887481 -883473
4884 -883473 -883806 -888428 -889472 -888773 -888724 -890610 -891679 -889361 -886219 -891214 -893116 -890650 -885323 -887308 -889550
4869 -889550 -890031 -884801 -875385 -877157 -875604 -873981 -883637 -888114 -882231 -876566 -875415 -875322 -879576 -871226 -871611
4854 -871611 -873299 -878447 -883680 -884156 -878674 -873126 -873014 -875130 -884284 -887016 -881701 -878832 -876679 -871754 -876449
4839 -876449 -878336 -877761 -874054 -873079 -871786 -871683 -878369 -886432 -883943 -883641 -884384 -890717 -891373 -894706 -890368 -875950
4823 -875950 -873371 -873573 -871243 -867954 -865714 -866264 -870297 -868614 -867435 -871404 -877608 -880384 -871556 -866091 -869405
4808 -869405 -867103 -867507 -863771 -866216 -869034 -866703 -863411 -864724 -865785 -860741 -861062 -868038 -872666 -873032 -871157
4793 -871157 -870007 -873402 -876751 -875756 -876185 -879073 -873646 -871660 -872115 -871408 -871796 -872067 -870517 -868663 -870646 -870600
4777 -870600 -867675 -859695 -860480 -857786 -856734 -865907 -864196 -863723 -873080 -877728 -874390 -877148 -877154 -873974 -869077 -867447
4761 -867447 -867141 -860332 -858113 -858062 -860116 -860420 -869317 -872452 -866534 -866444 -859428 -859402 -857546 -852837 -855935 -855067 -859121
4744 -859121 -859140 -861840 -861440 -863348 -862698 -860805 -861146 -860220 -862059 -862132 -863207 -858988 -858126 -861961 -856991 -856719 -852652
4727 -852652 -861676 -867158 -871657 -876309 -872225 -870025 -870692 -867125 -859934 -853073 -852561 -855108 -859029 -859160 -862886
4712 -862886 -860109 -856769 -857089 -857722 -855056 -848492 -853550 -856689 -847994 -842963 -844503 -852001 -852810 -851811 -852788 -846773
4696 -846773 -845583 -849209 -854463 -853751 -847352 -843942 -840221 -834285 -832602 -833942 -839160 -844941 -851566 -856666 -847105
4681 -847105 -846402 -851908 -862495 -859587 -849234 -846134 -843371 -845993 -846202 -844028 -839574 -838222 -839529 -838116
4667 -838116 -844316 -850483 -853572 -854146 -850645 -852629 -841346 -833516 -832704 -838931 -842191 -843152 -845068 -847963 -843439
4652 -843439 -840453 -844418 -846480 -840899 -834025 -840321 -846735 -840304 -838212 -841901 -839615 -836510 -832924 -835866
4638 -835866 -837078 -827616 -826349 -830251 -831727 -839658 -844375 -840049 -838922 -834065 -839255 -846295 -838749 -827947
4624 -827947 -827709 -834941 -841372 -839761 -836353 -836104 -838687 -849021 -852076 -845805 -838010 -837433 -840583 -837080 -835210
4609 -835210 -837704 -839670 -838151 -843673 -838570 -832758 -827710 -817539 -814657 -821906 -830574 -831115 -826670 -825763 -829830
4594 -829830 -835226 -831386 -828109 -829878 -825278 -815011 -817109 -822618 -819181 -819759 -822248 -822523 -826553 -830954 -829728
4579 -829728 -830198 -824000 -824805 -829886 -832888 -833032 -834511 -833159 -833901 -835222 -840660 -842426 -837957 -826820 -826933
4564 -826933 -828872 -829771 -829012 -828555 -831109 -833629 -829409 -827883 -825313 -826146 -830720 -839756 -833484 -828303 -825039
4549 -825039 -823275 -826885 -824419 -818790 -814117 -817697 -822049 -822374 -820365 -823054 -826976 -836006 -838488 -828919 -822577
4534 -822577 -823964 -822914 -826577 -827687 -821766 -818495 -820091 -826032 -828981 -827084 -818692 -813376 -811907 -813627
4520 -813627 -813092 -813295 -813892 -816549 -816892 -815703 -818428 -823188 -818321 -815504 -814878 -812004 -813717 -811176 -804990 -805549
4504 -805549 -811291 -817476 -822344 -824288 -819525 -816201 -822754 -825006 -818689 -814309 -815106 -814180 -815585 -811496 -808971
4489 -808971 -812009 -811789 -811832 -813941 -815151 -810567 -814298 -816971 -821155 -824420 -823048 -818720 -810122 -807780 -811131
4474 -811131 -804032 -800121 -799570 -800190 -801143 -801535 -799925 -807893 -813003 -815298 -814544 -809398 -807164 -808547 -805789 -808190
4458 -808190 -812864 -816238 -818644 -812838 -814241 -815919 -809547 -813210 -813890 -808169 -805376 -801790 -807463 -814579 -816234
4443 -816234 -812526 -811899 -811262 -814850 -809197 -806572 -801993 -797460 -803236 -803845 -799489 -801941 -799236 -803769 -801442
4428 -801442 -800983 -809727 -805047 -800968 -798299 -802173 -796547 -795899 -796746 -802195 -806764 -808265 -807031 -805853 -800827
4413 -800827 -800282 -799626 -796530 -800384 -796870 -795784 -795623 -797670 -803531 -805203 -806302 -806526 -806887 -807250 -804130 -800198
4397 -800198 -795070 -798380 -803375 -800992 -802297 -799566 -792239 -796493 -803696 -802347 -797870 -791721 -793446 -799358
4383 -799358 -806586 -801407 -797591 -799133 -797588 -800957 -793820 -783798 -788684 -795665 -790320 -780356 -778797 -780034
4369 -780034 -787581 -799481 -800665 -799006 -792778 -792411 -793612 -795432 -796874 -799556 -792760 -789815 -796950 -794069
4355 -794069 -793794 -788803 -783226 -781930 -785469 -787645 -785764 -782036 -775720 -778619 -777060 -777649 -778233 -779596 -778912
4340 -778912 -779651 -780883 -777127 -777018 -777415 -784745 -787334 -784934 -786889 -792220 -791457 -798935 -796287 -792444 -790830
4325 -790830 -785963 -783754 -785629 -788718 -785771 -779075 -774149 -780625 -787349 -787405 -780770 -778494 -776928 -776181 -784271
4310 -784271 -790359 -780342 -778480 -775499 -776298 -781460 -779290 -778398 -779905 -780108 -784371 -787259 -787278 -777393 -778068 -772585
4294 -772585 -771982 -777206 -785014 -794255 -789237 -783473 -781051 -780555 -781170 -784083 -785739 -783663 -778968 -776614 -772598
4279 -772598 -766745 -772967 -772028 -766428 -771343 -774742 -775602 -776061 -774834 -770223 -762411 -765570 -770349 -774478 -784938
4264 -784938 -791432 -788647 -786475 -777007 -773571 -775843 -777342 -772402 -767395 -775949 -779353 -776104 -782349 -784727
4250 -784727 -775577 -775084 -774793 -774952 -778009 -773948 -777335 -778808 -777077 -773861 -774841 -773834 -773042 -772751 -768984 -769197
4234 -769197 -772327 -780706 -785065 -777063 -771865 -768479 -768622 -765655 -754848 -751289 -762888 -769365 -762671 -760554
4220 -760554 -762705 -767416 -771618 -773251 -769252 -766532 -763691 -764824 -769455 -773354 -772403 -774046 -774184 -771375 -764690
4205 -764690 -762791 -770731 -776091 -772910 -764727 -765307 -763993 -756479 -749467 -753459 -755590 -757245 -764345 -770902 -770494
4190 -770494 -766890 -761790 -760740 -762652 -764627 -763366 -756776 -752057 -754464 -759411 -767750 -766466 -763156 -763180 -758531
4175 -758531 -754585 -752894 -757686 -755662 -756607 -753531 -752245 -754132 -753883 -745480 -745623 -754954 -758606 -759485 -757470
4160 -757470 -763820 -767359 -766183 -762522 -756460 -759134 -760894 -762631 -766218 -769564 -766720 -756944 -760598 -767671
4146 -767671 -759026 -760782 -766050 -770995 -769010 -769761 -761241 -759430 -757552 -752972 -753219 -756019 -754363 -759439 -761468
4131 -761468 -767653 -763808 -757952 -759062 -761263 -760407 -753508 -750594 -745897 -745781 -748994 -750698 -752094 -755255 -753104
4116 -753104 -749720 -751746 -750851 -748976 -747896 -742564 -746962 -754960 -753819 -754525 -750300 -748745 -748764 -749628 -747522 -750111
4100 -750111 -757484 -767413 -770955 -766514 -764289 -761014 -754724 -753289 -756384 -757225 -756543 -757074 -758163 -756489 -753449
4085 -753449 -750548 -752894 -751552 -757017 -756170 -747437 -748577 -747243 -746864 -744492 -742837 -751967 -762320 -759876 -757825
4070 -757825 -756213 -753645 -750307 -750413 -745602 -739907 -739567 -742848 -742001 -744164 -743062 -745457 -749187 -743910 -737076
4055 -737076 -738824 -736456 -741785 -745778 -738047 -732497 -738510 -740942 -741229 -745081 -738290 -736621 -734344 -738648 -739628
4040 -739628 -743552 -743313 -745576 -748238 -747676 -746229 -741953 -741907 -736414 -736127 -743474 -749155 -749452 -750409 -743427 -740865
4024 -740865 -745936 -747072 -741250 -738400 -734150 -734668 -737598 -738416 -733679 -733140 -728216 -735722 -738202 -740307 -740598
4009 -740598 -745169 -743491 -739085 -736359 -733702 -740152 -746031 -743958 -747532 -752899 -752312 -743056 -735394 -737765 -737892
3994 -737892 -743293 -741015 -733954 -728311 -726430 -725377 -730909 -731306 -730356 -730232 -734125 -730871 -733926 -740799 -733664
3979 -733664 -729592 -729434 -729493 -731635 -734808 -734673 -733550 -737106 -744775 -746209 -743320 -731633 -724810 -725000 -725072 -722834
3963 -722834 -720279 -714645 -713305 -719117 -715171 -714587 -716982 -724110 -726643 -724365 -723390 -723562 -724863 -727546 -727160
3948 -727160 -733217 -732643 -730039 -728938 -732464 -734694 -736625 -722080 -710573 -721449 -729917 -722296 -712483 -716143
3934 -716143 -723860 -726882 -728106 -725452 -722447 -724135 -733156 -730533 -732976 -735135 -733171 -733571 -740001 -735450 -728589
3919 -728589 -727574 -725467 -720783 -725176 -723544 -720725 -722672 -724897 -723205 -722906 -725779 -726321 -724192 -721551 -723444
3904 -723444 -725183 -721374 -722962 -726992 -725884 -726536 -723333 -722673 -716934 -714143 -714241 -720529 -718082 -713014 -704248
3889 -704248 -705632 -704739 -706082 -713401 -720260 -722462 -723898 -724788 -722419 -719229 -725046 -730273 -730357 -724194 -724903 -731943
3873 -731943 -729189 -725959 -717063 -715989 -721000 -725367 -721260 -716934 -716275 -716075 -710268 -706429 -711499 -714175 -716403
3858 -716403 -722369 -728628 -724976 -721050 -727231 -724591 -718183 -710104 -711965 -715878 -717491 -718799 -720961 -724245
3844 -724245 -725374 -717843 -714443 -718429 -718142 -713824 -710593 -709791 -713019 -712028 -714829 -715679 -714866 -709763 -711052 -706499
3828 -706499 -703012 -707614 -707757 -708502 -704108 -707457 -714978 -712578 -705108 -698656 -695180 -698549 -705228 -708747 -712574
3813 -712574 -710116 -710904 -714252 -712882 -712996 -712619 -712540 -712148 -711063 -713547 -717640 -718756 -711378 -709918 -719712 -718536
3797 -718536 -719302 -724487 -718170 -708160 -698484 -695778 -695541 -702892 -698727 -692959 -688157 -683962 -689708 -703072
3783 -703072 -710362 -705844 -698854 -700446 -703880 -709869 -716422 -712471 -704737 -707825 -711084 -707023 -702510 -700685
3769 -700685 -701125 -702103 -707958 -704673 -699092 -691249 -690129 -696289 -700693 -704143 -702360 -704487 -706546 -706989 -706248
3754 -706248 -702405 -696397 -695543 -701642 -704924 -703971 -705359 -696327 -688726 -692372 -695753 -692944 -694799 -693562 -694743
3739 -694743 -698405 -700241 -700822 -701266 -698346 -695073 -699238 -700172 -691295 -693243 -697026 -699841 -694742 -694360 -697810
3724 -697810 -697481 -692513 -695483 -698148 -696027 -689426 -689699 -692007 -691067 -694947 -696071 -692194 -688975 -689872 -696132
3709 -696132 -696029 -696941 -699090 -691541 -692892 -695238 -697701 -703784 -698006 -695738 -695364 -695361 -693285 -696511 -696076 -694267
3693 -694267 -695684 -695199 -693891 -689912 -687956 -690166 -687057 -689876 -687813 -684673 -686789 -689155 -690206 -690646 -691612
3678 -691612 -694452 -688026 -689411 -690389 -692580 -693993 -691620 -694802 -701819 -703753 -700687 -698494 -698071 -701260 -695391
3663 -695391 -694552 -694948 -694908 -697147 -700221 -701651 -701040 -701745 -703912 -699940 -695921 -692446 -687741 -686305 -679862 -670093
3647 -670093 -670755 -679131 -679184 -684472 -692327 -698630 -694761 -687534 -687601 -689454 -685107 -683020 -686608 -691227 -687620 -681318
3631 -681318 -679916 -686067 -684865 -682971 -681391 -677997 -671148 -671593 -683831 -688696 -689783 -680550 -679596 -685726 -682119
3616 -682119 -679967 -679521 -679508 -678971 -677099 -678610 -683812 -686585 -684477 -685996 -684779 -683188 -684099 -682356 -681317 -684781
3600 -684781 -682695 -676089 -672003 -675368 -688568 -694230 -695368 -691436 -685670 -680004 -674648 -677029 -681401 -684938
3586 -684938 -691626 -694140 -692506 -685022 -677166 -678486 -680165 -672728 -670802 -670241 -672614 -675055 -682504 -685667 -690401
3571 -690401 -688881 -682949 -687190 -692758 -692304 -683629 -676267 -676263 -683065 -685869 -685231 -686192 -678705 -677346 -679934 -677418
3555 -677418 -673643 -675708 -675642 -676240 -675080 -674968 -676911 -685272 -684675 -683133 -679333 -679047 -686947 -684329 -677478 -679533
3539 -679533 -673918 -676633 -682367 -682310 -676002 -679253 -679693 -671207 -675263 -675072 -675019 -668833 -663959 -665771 -665219 -667610
3523 -667610 -675220 -677074 -678901 -674461 -672547 -671867 -673108 -672206 -667654 -667880 -673455 -672142 -667284 -661278 -656825
3508 -656825 -662307 -664808 -664593 -666321 -664460 -671168 -675151 -679255 -675492 -670645 -668243 -672369 -669393 -665473 -665952
3493 -665952 -665654 -669782 -670249 -667339 -667805 -665460 -669155 -671628 -667748 -665744 -668595 -671301 -671229 -672782 -676470 -677342
3477 -677342 -675560 -668060 -665633 -667013 -663185 -661520 -669419 -666977 -660548 -655027 -652131 -655665 -660640 -663504
3463 -663504 -673777 -676377 -673321 -666055 -663629 -658597 -658668 -655714 -664968 -668209 -665557 -660631 -664668 -664796 -663620
3448 -663620 -662069 -659882 -669491 -672391 -675071 -668180 -657811 -658257 -658954 -654394 -662936 -668315 -672635 -676005 -670161
3433 -670161 -667050 -665401 -668037 -668651 -658749 -655190 -650721 -652548 -659337 -664517 -669036 -671765 -671156 -669545 -666899
3418 -666899 -668683 -668729 -668679 -669295 -661521 -658594 -659752 -661791 -659462 -663387 -669914 -668977 -666814 -659613 -656717 -653300
3402 -653300 -653288 -654749 -655111 -653438 -649131 -652696 -652506 -659980 -661835 -659597 -658573 -652534 -650985 -658378 -658151 -649605
3386 -649605 -649927 -661309 -654810 -657844 -668454 -671460 -669763 -665660 -659348 -656147 -657586 -647771 -646402 -654290
3372 -654290 -655991 -656602 -654021 -656091 -652330 -654650 -654644 -654718 -657467 -656880 -651838 -648466 -653985 -658127 -655541 -656612
3356 -656612 -653279 -653061 -657333 -658344 -657419 -653927 -658908 -655010 -648203 -647253 -650942 -651429 -643659 -644952 -647374
3341 -647374 -647008 -645201 -646877 -653061 -653533 -661329 -669914 -663730 -664289 -656721 -643921 -642628 -643113 -642951 -645896
3326 -645896 -652738 -653420 -649976 -643551 -641445 -643221 -643585 -648294 -643175 -643808 -649151 -647499 -658512 -656286 -651262
3311 -651262 -656607 -657107 -654527 -653581 -647635 -643162 -648433 -645137 -642072 -636009 -636664 -643176 -642950 -647268 -648332
3296 -648332 -648029 -641903 -644678 -643819 -637240 -633212 -632619 -634751 -645776 -651508 -645129 -637429 -642065 -645680 -645767
3281 -645767 -642890 -641382 -643134 -641152 -637782 -641466 -638473 -637425 -645754 -647471 -651717 -654967 -654599 -655370 -657641
3266 -657641 -653435 -650646 -646553 -646449 -646041 -647920 -644724 -643437 -644968 -647604 -645722 -639090 -635048 -640741 -644771
3251 -644771 -642416 -642515 -646992 -651394 -650512 -632813 -629446 -632640 -635456 -633640 -634777 -633118 -628664 -625491 -625996
3236 -625996 -632660 -638545 -645397 -645104 -647112 -646197 -640501 -633502 -633860 -635386 -633661 -633779 -632179 -637589 -645802
3221 -645802 -645635 -648452 -654533 -654253 -648288 -640496 -631010 -625463 -629925 -629895 -637453 -639380 -641588 -643698 -639689
3206 -639689 -642170 -642454 -641336 -639297 -636490 -638032 -636002 -638344 -638128 -639662 -640397 -640822 -646893 -654365 -655346 -651020
3190 -651020 -638908 -632706 -638593 -645554 -648064 -639673 -631138 -624744 -627381 -627432 -626741 -629879 -638896 -637189 -634985
3175 -634985 -634357 -630430 -630748 -633602 -632842 -633338 -630853 -631496 -630469 -627622 -620358 -619251 -618934 -622511 -625564 -628171
3159 -628171 -629647 -632992 -629381 -630861 -635962 -634887 -634789 -633609 -638324 -640627 -640336 -638928 -637557 -640952 -645908
3144 -645908 -647736 -643939 -638889 -637459 -637154 -633887 -628028 -623805 -626494 -630563 -640067 -639210 -637350 -634763 -632798
3129 -632798 -630268 -635994 -633989 -631437 -630753 -627477 -629612 -629531 -629598 -631169 -632160 -638467 -637892 -637903 -631484 -634911 -632989
3112 -632989 -626878 -627419 -634250 -632671 -628875 -628175 -622369 -616285 -618269 -616102 -616021 -619043 -620905 -628033 -627498 -628276
3096 -628276 -621078 -615223 -618343 -618833 -624432 -625197 -626626 -630292 -625137 -617761 -616289 -622599 -627030 -628949 -625813
3081 -625813 -620245 -620327 -626333 -626458 -625731 -619485 -620796 -625004 -626634 -626910 -624913 -623468 -622951 -619888 -617564 -615690
3065 -615690 -616502 -623242 -626426 -626141 -624143 -627944 -621951 -619779 -619621 -617063 -615543 -622308 -620939 -617558 -619182
3050 -619182 -620647 -624800 -624022 -618055 -618187 -623643 -624339 -620209 -627323 -631481 -628337 -631349 -633974 -632724 -634894
3035 -634894 -630632 -626637 -626458 -630134 -628925 -626290 -624409 -630701 -629695 -621784 -617934 -614957 -616607 -618384 -618575
3020 -618575 -616168 -611769 -611271 -615986 -618185 -613342 -618312 -628590 -626895 -621065 -614554 -611851 -615013 -616242
3006 -616242 -617100 -621517 -623291 -621241 -618762 -617764 -617445 -617923 -611495 -606902 -608040 -618985 -628101 -635690 -625043
2991 -625043 -617326 -615853 -620256 -622815 -620257 -618426 -613858 -611777 -606731 -601509 -599295 -597185 -599686 -604485
2977 -604485 -612891 -614251 -609950 -615168 -616414 -617370 -616873 -617259 -625395 -630789 -625364 -624591 -623790 -619081 -615906 -613161
2961 -613161 -604503 -598101 -601506 -606470 -616454 -624307 -619711 -613550 -609264 -610514 -620117 -619081 -612117 -609519
2947 -609519 -613743 -627845 -629847 -621489 -615743 -607222 -609045 -614228 -616746 -613115 -602277 -597269 -603541 -607814
2933 -607814 -616318 -618736 -619584 -613832 -611881 -614504 -617173 -614982 -610117 -601825 -599308 -602579 -603810 -601697 -604897
2918 -604897 -605089 -598512 -597648 -594895 -594258 -599100 -600247 -606169 -604789 -597750 -596183 -600507 -595570 -584059 -587747
2903 -587747 -591610 -594656 -593736 -599903 -601297 -601439 -600418 -603959 -611218 -609469 -605308 -601883 -604334 -608055 -608443
2888 -608443 -604172 -603019 -606823 -612469 -616632 -613705 -605518 -597207 -602135 -605215 -605846 -602807 -606294 -603230 -601573
2873 -601573 -598858 -599371 -606291 -605362 -606566 -616335 -609198 -602704 -597652 -600186 -596996 -593527 -594812 -592489 -586707
2858 -586707 -587086 -591917 -596856 -602365 -599372 -590363 -588000 -589588 -594008 -597468 -603305 -600595 -597610 -606410 -608322
2843 -608322 -602895 -595270 -595865 -603253 -603984 -604477 -600216 -598511 -593925 -592239 -601142 -601569 -601854 -604667 -610289 -609248
2827 -609248 -613800 -619394 -616484 -609295 -607837 -611575 -613326 -613980 -616201 -614507 -608484 -608754 -616130 -617593 -607613
2812 -607613 -601015 -596274 -594287 -604094 -608547 -606272 -599050 -596128 -591706 -593458 -603841 -605956 -609716 -610486
2798 -610486 -607062 -606101 -604338 -597424 -602153 -605723 -607245 -605062 -602657 -601999 -601434 -601271 -602406 -600929 -597265
2783 -597265 -598729 -596778 -599714 -603874 -602940 -595894 -594350 -597159 -596472 -594703 -590410 -587974 -582551 -584197 -591084
2768 -591084 -596796 -599687 -596796 -602699 -603254 -600938 -600127 -589971 -584844 -585059 -589973 -592576 -593733 -591325 -590403
2753 -590403 -589461 -580882 -584090 -584884 -585094 -589578 -591326 -594269 -589447 -590555 -595359 -597622 -593930 -597949 -597687
2738 -597687 -594273 -597930 -591950 -597041 -600765 -599655 -596267 -596216 -590431 -590137 -589504 -586155 -584027 -582931 -582008 -578695
2722 -578695 -578781 -586108 -588998 -595006 -592994 -588060 -586497 -592692 -592612 -590158 -592338 -596354 -596488 -593359 -586407 -589925
2706 -589925 -593327 -600665 -598068 -588666 -585505 -594949 -598041 -599777 -593845 -587886 -582070 -577759 -577108 -578009 -581017
2691 -581017 -585469 -582265 -582811 -576338 -573129 -582031 -582722 -583487 -593338 -589863 -586266 -587078 -588743 -589582 -582367 -582168
2675 -582168 -584305 -588977 -594401 -595066 -588728 -590768 -594256 -598091 -600795 -593744 -587524 -581630 -578138 -582369 -584246
2660 -584246 -589268 -589592 -583859 -582407 -584907 -585575 -587984 -582025 -578118 -576250 -576077 -579982 -577743 -581456 -586937
2645 -586937 -587618 -584144 -580218 -581809 -583060 -583995 -581070 -578084 -582466 -582485 -581411 -584389 -586499 -591608 -583009
2630 -583009 -577752 -576062 -576817 -579272 -580023 -580264 -577173 -575167 -577539 -578995 -581797 -580865 -575900 -574500 -573121
2615 -573121 -576086 -583156 -583426 -582078 -584585 -580618 -573410 -575178 -579624 -578423 -573072 -572951 -576681 -571973 -574843
2600 -574843 -576492 -579516 -583805 -583008 -582926 -584169 -577423 -569359 -569650 -570021 -566287 -573506 -581410 -585344 -580882 -578362
2584 -578362 -575205 -571408 -576830 -577529 -577661 -578721 -579592 -580414 -581155 -588989 -589917 -583336 -581020 -576894 -571648 -573375
2568 -573375 -580037 -582465 -584418 -582492 -582029 -578706 -581680 -578057 -571860 -577585 -574582 -569836 -568188 -570621 -570143
2553 -570143 -572081 -573271 -569741 -571489 -570086 -574724 -582428 -583826 -577000 -573175 -572558 -571550 -576556 -574525 -577852
2538 -577852 -578646 -580114 -577945 -578590 -575119 -569295 -570721 -572704 -575095 -573932 -571842 -582607 -583025 -575464 -574486
2523 -574486 -570015 -563521 -562151 -558642 -556938 -564595 -572785 -573808 -569394 -562898 -566547 -565049 -561999 -562317 -560105
2508 -560105 -563080 -565929 -568950 -567691 -564824 -565073 -564739 -570488 -574145 -570127 -569968 -570857 -573842 -579847 -583120
2493 -583120 -580653 -577427 -577076 -575962 -574877 -575292 -571535 -568218 -568471 -574733 -586036 -584409 -575680 -574590 -570094
2478 -570094 -562688 -563798 -565464 -566777 -573171 -573341 -569125 -560832 -557135 -560004 -566438 -568571 -570570 -562923 -553729
2463 -553729 -558211 -563084 -563483 -569849 -567565 -561484 -557763 -554776 -559450 -561691 -561489 -564394 -566524 -564343 -564212
2448 -564212 -566260 -565369 -564908 -565106 -566639 -564792 -560672 -558551 -563972 -568872 -564062 -557623 -555199 -558100 -564554
2433 -564554 -558561 -558335 -562703 -562562 -564524 -566104 -563171 -561705 -567559 -567359 -570397 -570820 -563741 -554686 -559640
2418 -559640 -569101 -574212 -574706 -572483 -568410 -560650 -562925 -560384 -559305 -568245 -567020 -557997 -559161 -562607 -568909
2403 -568909 -572413 -567893 -558551 -560187 -561300 -566694 -562499 -563870 -564750 -562131 -560798 -563751 -564358 -562864 -554487
2388 -554487 -550097 -556826 -573997 -579379 -567113 -562418 -564217 -564392 -561531 -552433 -549961 -556111 -555360 -557327
2374 -557327 -554172 -546162 -542974 -541746 -545458 -548168 -552168 -558247 -559267 -560852 -557399 -560784 -556144 -550104
2360 -550104 -553287 -553149 -553724 -555868 -556738 -556276 -555368 -556415 -552031 -548083 -556945 -559229 -555626 -555094 -549278 -553959
2344 -553959 -555963 -554549 -554565 -557295 -560910 -565364 -570567 -570632 -563795 -558557 -553177 -548132 -550847 -547992 -548107 -552815
2328 -552815 -555602 -561478 -566868 -561132 -558066 -559012 -553981 -552020 -557423 -557511 -553560 -560198 -562379 -550531 -543242
2313 -543242 -549983 -553975 -555155 -558643 -557170 -554232 -552489 -549738 -552764 -550465 -546283 -553703 -563415 -563248 -559810
2298 -559810 -558683 -556869 -550300 -546405 -550826 -553320 -554651 -557873 -559996 -557886 -552616 -545401 -537767 -538631 -544903
2283 -544903 -553488 -557260 -556388 -565834 -560386 -555142 -552169 -549314 -549500 -549250 -552245 -559464 -558356 -548718 -546968
2268 -546968 -547733 -547474 -552308 -549717 -547439 -553127 -550239 -552068 -554880 -551128 -550972 -550857 -554072 -554560 -556546 -558449
2252 -558449 -555888 -558349 -551437 -539108 -537424 -544237 -549006 -552579 -549149 -547484 -549383 -548724 -551747 -550124
2238 -550124 -546914 -541298 -538721 -541969 -547968 -546054 -552248 -549618 -550371 -550431 -554975 -556269 -560286 -561941 -559203
2223 -559203 -554169 -552285 -548762 -548317 -553135 -553707 -549532 -551475 -552318 -549049 -547259 -544094 -545213 -536156 -531792
2208 -531792 -536798 -544299 -542661 -543371 -549810 -550076 -550713 -548222 -543782 -541273 -543579 -548889 -548163 -543035 -544161
2193 -544161 -545210 -546867 -553258 -551423 -547294 -543002 -542332 -537236 -536573 -537206 -541712 -543009 -542364 -541166 -544640
2178 -544640 -543449 -547857 -549318 -546152 -546431 -547741 -544272 -541418 -546751 -546698 -543821 -541134 -542021 -536801 -539436
2163 -539436 -545089 -544181 -544375 -547693 -540922 -542553 -543684 -537643 -534217 -535804 -534595 -537378 -537520 -541431 -546737
2148 -546737 -546430 -539910 -533664 -538121 -540236 -540725 -540774 -539532 -536762 -534700 -537729 -551783 -558019 -555391 -554137
2133 -554137 -556483 -553857 -552880 -549215 -543076 -542480 -539395 -537987 -537293 -543501 -549861 -553797 -558244 -559169 -561294
2118 -561294 -555810 -543229 -534658 -537624 -535696 -532606 -530187 -527479 -528457 -531327 -531750 -531003 -539918 -540453 -541781
2103 -541781 -547761 -544467 -538256 -536114 -535733 -546451 -550392 -550577 -548811 -550459 -541913 -537077 -540143 -539174 -538542
2088 -538542 -545457 -544417 -542463 -536134 -533818 -537314 -537417 -529622 -529933 -535080 -533129 -532645 -531602 -532323 -532977 -532689
2072 -532689 -525916 -525452 -526902 -529496 -538026 -541849 -540668 -540225 -536974 -534145 -541629 -535347 -529188 -531778 -525587
2057 -525587 -523426 -528058 -530394 -530247 -526102 -530351 -527035 -528533 -530280 -531444 -540206 -538982 -538728 -543963 -539828
2042 -539828 -535765 -540221 -539519 -537367 -542449 -543830 -539590 -533160 -536143 -538161 -533231 -531168 -534968 -539255 -539319
2027 -539319 -533779 -524415 -525055 -522494 -530302 -531708 -529070 -524940 -525419 -526209 -525696 -520202 -525806 -531733 -532412 -526198
2011 -526198 -529621 -533644 -535340 -534750 -536249 -535276 -532662 -529190 -530509 -529524 -532249 -532014 -524899 -524051 -532558 -538373
1995 -538373 -535244 -535061 -527960 -528171 -529029 -524320 -521737 -521043 -530221 -529859 -526777 -521986 -521916 -533333 -542182 -543073
1979 -543073 -537733 -534147 -526954 -526598 -518040 -520372 -533802 -534503 -530006 -524508 -520892 -511784 -515785 -526093
1965 -526093 -529550 -528381 -531178 -540013 -541146 -535227 -531380 -530624 -531002 -535814 -539443 -534421 -525060 -524031 -532544
1950 -532544 -531308 -523984 -520531 -519378 -525227 -530401 -530602 -533214 -535015 -532138 -533634 -530977 -531255 -532724 -530968
1935 -530968 -531545 -527224 -522467 -526454 -521611 -522407 -522684 -515923 -510650 -513344 -513494 -511960 -520876 -522085 -524220
1920 -524220 -523274 -518960 -519749 -522165 -522795 -525136 -525362 -528419 -520178 -520013 -516563 -510040 -507643 -506810 -513958 -521674
1904 -521674 -523639 -527155 -528633 -526706 -523328 -518679 -524786 -529853 -528035 -517042 -513914 -516944 -514594 -515845
1890 -515845 -521182 -521093 -522139 -523724 -522098 -525363 -529163 -537515 -533422 -527184 -526828 -524968 -532672 -530274 -523341
1875 -523341 -520743 -525719 -522917 -515514 -513223 -515264 -522878 -528707 -533433 -531472 -533506 -535805 -531193 -531670 -522331
1860 -522331 -514440 -521689 -526699 -518607 -512495 -513675 -518339 -524204 -525302 -532530 -535028 -530200 -528207 -523670
1846 -523670 -519657 -517812 -514034 -513162 -517067 -513452 -510309 -510375 -519151 -518963 -516964 -516873 -512471 -513379 -525876 -524718
1830 -524718 -523928 -520073 -521909 -525787 -529012 -527818 -523962 -525385 -531277 -525625 -515692 -508587 -510583 -511224 -508170
1815 -508170 -510457 -518678 -517194 -514530 -513776 -510675 -508206 -513253 -514936 -516159 -527702 -526537 -519606 -516650
1801 -516650 -527216 -529168 -518730 -513267 -512260 -512310 -512135 -517873 -518088 -512966 -519033 -520887 -523677 -522310 -517100
1786 -517100 -513723 -517819 -520365 -515106 -513427 -512165 -508207 -509958 -510067 -510219 -517663 -518119 -508846 -506437 -514149
1771 -514149 -509197 -508140 -520826 -529122 -522786 -518625 -521646 -521352 -523596 -521302 -507386 -502117 -502252 -507123
1757 -507123 -513694 -522782 -519656 -514433 -506610 -508167 -511046 -511330 -512315 -511364 -502389 -503781 -506596 -506844 -500325
1742 -500325 -496668 -496016 -500487 -506869 -511536 -513321 -508929 -501490 -501868 -502302 -501297 -502474 -500869 -504456 -505884
1727 -505884 -509526 -512139 -510133 -508540 -501780 -492555 -489005 -492697 -501141 -501593 -500184 -497873 -504877 -505749 -503609
1712 -503609 -504612 -501713 -499932 -499909 -502480 -502685 -503458 -509127 -516145 -512826 -517017 -519940 -520646 -519966 -518264 -521395
1696 -521395 -524730 -523057 -524772 -530499 -521952 -516125 -508455 -505896 -508985 -510431 -511863 -509785 -512005 -514302
1682 -514302 -506861 -505410 -513720 -512659 -510184 -510890 -509578 -504422 -502040 -499993 -506022 -512183 -512424 -508485 -510012
1667 -510012 -511886 -512760 -513691 -518725 -518004 -511869 -515616 -514489 -512627 -514683 -514824 -509233 -512925 -510089 -508771
1652 -508771 -510510 -508676 -507308 -503508 -507908 -511549 -501225 -488631 -489599 -486285 -485806 -487651 -494907 -504429
1638 -504429 -508254 -504743 -503821 -498144 -501245 -506160 -510948 -508572 -503925 -504960 -508528 -511818 -514468 -509548 -504845
1623 -504845 -498877 -499257 -503964 -505029 -505712 -510424 -511267 -507075 -513084 -510214 -500121 -496212 -500366 -502554 -505299
1608 -505299 -504158 -506117 -500389 -499375 -502125 -501557 -505667 -506464 -510151 -508098 -505325 -505665 -504100 -510048 -509916
1593 -509916 -506648 -502085 -506407 -508023 -509551 -507056 -509557 -507765 -506513 -504906 -502091 -505854 -505315 -504918 -503618
1578 -503618 -508305 -502057 -491039 -495180 -503326 -502112 -494825 -493369 -497072 -495963 -490590 -490762 -495936 -503747
1564 -503747 -502196 -506883 -507298 -504627 -500819 -500756 -509826 -514209 -519214 -517532 -514727 -513874 -506743 -508779 -507091
1549 -507091 -496662 -493140 -493602 -494917 -497416 -502593 -502063 -502348 -501843 -500112 -499081 -499941 -503117 -496805 -495312
1534 -495312 -496438 -494612 -498263 -493797 -499234 -505566 -500927 -498770 -501649 -505928 -504020 -498395 -501716 -499791
1520 -499791 -499951 -500918 -502597 -500615 -504718 -501682 -505238 -505500 -503587 -497894 -495716 -502955 -503947 -504471 -502542 -499926
1504 -499926 -503370 -503143 -499143 -490662 -490090 -491670 -491882 -495165 -499582 -497657 -495585 -502413 -493781 -492432 -494071
1489 -494071 -498628 -501828 -500835 -497390 -499796 -501029 -501116 -502591 -499010 -497623 -497420 -498211 -499834 -495934 -499624 -502865
1473 -502865 -504033 -497007 -494629 -496799 -499273 -501704 -497549 -497187 -504595 -506303 -502941 -497298 -492997 -488673 -489447
1458 -489447 -489676 -494534 -496836 -487046 -486767 -486992 -483420 -486149 -491995 -497468 -498308 -499004 -495855 -493588 -495672 -494934
1442 -494934 -496144 -497599 -492804 -487538 -491576 -496514 -495584 -498197 -497888 -501668 -498906 -497772 -496270 -495521 -494752
1427 -494752 -499288 -493357 -487314 -490211 -491023 -489640 -480041 -473825 -479664 -485478 -478408 -483129 -491939 -495894 -501264
1412 -501264 -500271 -499086 -501204 -500850 -498866 -493512 -499311 -504744 -500095 -496562 -493923 -493393 -497653 -499875 -501304
1397 -501304 -498729 -500734 -499050 -494398 -493510 -496434 -494410 -492320 -491535 -496666 -503418 -502822 -505111 -501776 -501162
1382 -501162 -499147 -491534 -492312 -494466 -490067 -482779 -482072 -492313 -494123 -487165 -483843 -482659 -482472 -482623 -479821
1367 -479821 -477926 -482226 -496062 -501495 -496565 -492268 -495129 -494140 -485475 -489006 -493124 -487978 -487155 -483546 -477718
1352 -477718 -481842 -481846 -475667 -478161 -477064 -480134 -484373 -481014 -485299 -496271 -504493 -508753 -502618 -498303 -494789
1337 -494789 -485976 -489965 -487677 -486778 -489099 -493838 -493318 -490475 -491722 -493283 -486672 -485481 -480945 -477455 -482233
1322 -482233 -491316 -492461 -496589 -504319 -502833 -496306 -490620 -492871 -497481 -496536 -489203 -486774 -485018 -487831 -487737
1307 -487737 -490763 -490356 -496384 -488112 -482386 -487795 -486059 -485427 -486023 -488550 -490513 -489893 -486546 -486095 -481522 -484403
1291 -484403 -485223 -481695 -482467 -486171 -487524 -485840 -487438 -490355 -490303 -490675 -487512 -486063 -487597 -486793 -486656 -482213
1275 -482213 -478985 -476509 -480893 -483166 -485162 -488730 -488970 -486080 -485287 -488148 -490291 -490280 -488369 -485637 -478436
1260 -478436 -471271 -473331 -479136 -481463 -484070 -489284 -487468 -477526 -474146 -474500 -475126 -475161 -475109 -478799 -480195 -482492
1244 -482492 -480486 -480350 -483337 -481869 -480576 -479278 -478912 -486090 -491631 -486253 -482342 -482560 -488605 -495578 -494783
1229 -494783 -493489 -487367 -480897 -482910 -490025 -492255 -490738 -492593 -485755 -484851 -489426 -493909 -491557 -487337 -482466
1214 -482466 -476184 -478643 -484083 -478335 -477706 -481796 -486075 -485967 -483119 -479129 -479691 -480590 -485907 -487850 -483172
1199 -483172 -477536 -480314 -486153 -483288 -486444 -489193 -486923 -480834 -483534 -486823 -485488 -479981 -471786 -473608
1185 -473608 -482096 -477890 -472045 -472632 -470827 -475112 -479135 -475610 -470702 -476253 -476697 -468444 -462322 -465150 -474158
1170 -474158 -471824 -473259 -475826 -476157 -478095 -483148 -482930 -479032 -473027 -465867 -466635 -475101 -472616 -469835 -473173
1155 -473173 -473924 -472302 -471837 -475079 -486965 -492840 -490195 -485321 -483614 -483115 -476487 -466374 -473290 -475073 -471305
1140 -471305 -467224 -471084 -472133 -471353 -473279 -477486 -478862 -476442 -472251 -473313 -469577 -469781 -469694 -469893 -467148 -469404
1124 -469404 -473353 -470535 -472330 -476438 -474398 -471637 -474724 -472898 -475598 -476678 -477214 -476616 -478997 -479071 -477075
1109 -477075 -481582 -476008 -473009 -472399 -470882 -473418 -471582 -470111 -476583 -478755 -475295 -470506 -466013 -474927 -479975
1094 -479975 -475481 -474521 -479670 -485157 -492618 -490598 -478109 -470480 -471315 -473457 -468630 -468548 -470166 -466707 -459116
1079 -459116 -463944 -467164 -464538 -464951 -469446 -472469 -470216 -471046 -476440 -475664 -473379 -475428 -481362 -486748 -485196
1064 -485196 -481912 -478055 -472432 -472404 -471299 -467391 -466312 -469905 -464706 -463974 -470489 -477768 -475554 -476608 -470925
1049 -470925 -470758 -469024 -466573 -464508 -460968 -466821 -470378 -469283 -474319 -474594 -473439 -473318 -469545 -468328 -472400
1034 -472400 -471010 -474312 -468042 -468214 -472091 -476080 -472555 -466203 -461739 -468156 -467641 -469192 -479756 -485925 -487193
1019 -487193 -484845 -479007 -472995 -469041 -465965 -462795 -458289 -457428 -457202 -463773 -471085 -469201 -474516 -472671 -468650
1004 -468650 -471409 -473836 -474056 -478253 -482225 -472145 -467228 -468900 -464660 -464440 -470729 -464469 -462420 -460377 -460382
989 -460382 -468309 -475345 -468875 -470187 -477189 -473819 -464492 -459120 -460293 -464442 -459697 -466306 -469483 -467592 -465109
974 -465109 -470450 -474720 -476996 -473980 -474070 -470221 -472571 -468082 -459282 -456007 -463056 -466238 -463918 -461899 -462954
959 -462954 -459707 -462113 -457818 -451487 -446851 -444915 -446330 -460945 -462662 -461281 -460556 -466275 -470847 -477070 -469972
944 -469972 -462719 -464362 -465268 -460740 -458952 -453051 -443958 -452268 -467000 -468849 -467369 -467470 -460437 -464630 -467222
929 -467222 -457854 -458340 -465822 -464124 -462477 -461148 -466045 -464592 -468652 -469812 -465771 -464093 -460988 -465306 -464957
914 -464957 -455004 -453679 -463007 -469010 -470840 -469821 -468982 -467620 -461137 -456748 -450407 -451555 -459885 -466907 -464694
899 -464694 -467806 -471701 -475063 -467286 -463147 -460016 -463973 -473391 -471975 -463668 -457019 -455664 -456786 -454007 -448445
884 -448445 -451123 -455571 -458828 -458459 -459003 -460546 -461535 -456110 -454427 -450787 -453607 -456028 -460443 -461030 -466568 -463425
868 -463425 -455766 -457729 -456391 -462156 -472993 -473102 -464179 -461488 -464520 -459358 -452731 -448871 -455393 -463911 -459639
853 -459639 -460490 -463460 -470630 -461615 -456027 -454422 -451569 -447313 -456889 -460834 -459374 -458831 -460627 -461328 -457474
838 -457474 -454000 -451754 -455363 -458558 -465017 -473024 -465088 -460336 -461640 -462812 -463280 -454578 -455081 -449549 -451789
823 -451789 -462718 -463418 -464457 -465601 -462319 -455797 -450353 -449517 -446180 -446741 -458871 -461516 -458859 -463338 -462130
808 -462130 -458743 -456812 -458411 -455076 -452882 -452407 -452794 -449821 -446252 -449697 -458524 -453527 -454303 -457776 -464188
793 -464188 -456027 -449278 -445662 -446444 -453994 -462735 -463853 -453649 -453933 -455419 -455181 -456870 -456641 -465377 -464627 -454961
777 -454961 -448012 -446358 -449744 -453322 -447533 -436929 -436888 -437606 -445187 -455379 -461816 -466122 -460655 -457067 -454557
762 -454557 -455616 -455343 -448343 -446543 -445023 -451613 -459544 -465435 -462587 -457196 -455385 -451426 -448721 -443148 -441506
747 -441506 -440641 -444067 -446785 -453396 -454381 -450868 -448924 -453464 -453337 -450008 -448782 -452722 -462833 -465730 -455995
732 -455995 -447869 -447901 -444617 -438510 -434756 -444724 -450631 -446769 -443073 -445481 -445003 -450527 -455332 -457076 -457112 -462381
716 -462381 -455099 -447332 -444221 -447182 -445431 -450667 -448537 -446472 -445810 -441738 -448772 -453380 -457894 -454522 -454706
701 -454706 -452567 -449570 -449172 -449310 -456987 -456394 -453837 -454389 -454712 -456816 -453239 -450607 -446497 -447090 -450340 -454406
685 -454406 -454744 -451690 -449446 -446704 -443994 -450779 -447136 -438510 -435733 -444103 -445079 -443450 -451129 -457976 -455763
670 -455763 -449015 -438429 -445731 -447303 -449089 -455395 -452350 -444027 -443235 -438994 -440246 -442143 -445454 -445324 -441780
655 -441780 -444674 -451724 -453642 -453705 -450819 -447423 -448141 -445216 -448419 -445908 -447458 -452112 -453354 -451414 -443048
640 -443048 -440333 -440382 -444397 -444760 -443430 -447997 -447689 -445651 -438780 -436849 -439595 -442525 -440374 -438587 -438327 -440951
624 -440951 -442470 -437103 -439969 -444036 -446820 -446888 -439342 -438133 -434752 -431870 -431767 -440170 -443767 -444660 -442020 -437618
608 -437618 -436826 -443114 -444191 -440524 -441385 -440890 -442213 -441825 -447534 -454601 -456557 -454177 -449117 -444902 -444891 -449519
592 -449519 -445235 -443124 -438573 -441808 -441505 -437818 -428919 -429646 -429810 -429977 -436713 -436332 -435530 -438324 -434940 -438853
576 -438853 -442483 -442400 -437310 -433691 -430474 -436163 -445934 -445703 -443660 -448129 -443589 -438653 -443741 -447989 -445883
561 -445883 -437886 -434703 -436172 -433986 -439912 -443753 -444795 -444625 -438047 -436257 -438199 -434369 -434459 -436469 -438078
546 -438078 -436522 -429769 -425985 -429876 -430424 -430089 -432075 -429536 -426579 -429695 -432220 -435381 -441261 -442930 -446405
531 -446405 -444308 -435456 -429436 -435523 -441888 -434338 -431957 -430708 -434009 -433084 -428087 -434908 -432923 -425608 -420232
516 -420232 -421568 -423149 -426914 -428885 -425274 -417865 -414376 -417043 -423259 -427703 -427664 -424079 -423457 -428313 -434254
501 -434254 -435952 -430720 -429624 -420914 -417120 -420128 -427308 -434398 -433732 -431526 -431317 -424645 -415459 -413403 -417278
486 -417278 -426268 -434088 -435561 -432264 -429302 -426151 -427846 -426537 -423612 -422684 -435630 -437205 -432006 -430485 -425336
471 -425336 -422834 -421917 -417284 -411991 -411038 -413342 -417023 -427588 -433946 -428492 -426788 -423128 -417898 -422758 -429682
456 -429682 -429996 -429589 -430952 -423923 -422732 -423733 -417521 -415106 -413321 -416894 -425865 -427468 -423738 -427762 -427434
441 -427434 -417322 -415480 -415347 -414709 -415980 -409745 -401578 -403368 -410186 -414189 -415342 -413957 -412238 -412695 -414884
426 -414884 -416872 -422267 -420842 -418667 -415385 -412809 -408712 -413765 -413308 -410712 -410893 -410409 -408861 -408937 -417020 -418507
410 -418507 -417681 -410013 -403915 -404101 -404916 -404527 -405146 -407760 -410333 -405446 -404865 -404769 -408573 -406921 -401715 -401297 -407953
393 -407953 -409469 -412107 -410701 -399642 -395842 -396693 -392689 -393851 -399297 -397905 -390444 -396149 -396114 -390713 -393278
378 -393278 -394432 -391866 -391631 -394416 -393541 -396687 -400258 -393549 -395232 -395696 -397682 -396656 -401383 -404854 -407850
363 -407850 -405584 -404499 -402509 -401513 -403173 -400536 -400874 -398494 -397341 -396159 -394771 -402263 -407499 -405224 -405083
348 -405083 -398956 -389665 -384078 -379108 -381108 -383339 -381727 -380315 -380183 -379732 -382483 -381332 -382211 -383324 -383254 -382589
332 -382589 -383461 -382138 -380630 -384428 -389883 -396296 -394056 -391252 -385875 -381155 -381280 -380886 -379410 -379378 -384619 -384210
316 -384210 -383335 -383154 -382213 -383301 -383136 -382925 -384898 -381251 -378985 -377453 -375240 -383594 -387852 -385034 -379772 -376566
300 -376566 -375628 -376488 -373455 -372101 -364876 -367370 -371390 -367021 -367749 -366372 -370708 -367367 -365039 -365321 -362388 -363964
284 -363964 -360546 -363351 -369357 -368436 -371505 -374328 -378932 -372691 -371595 -367703 -372531 -371294 -361242 -358804 -357079
269 -357079 -359193 -359010 -356568 -353514 -348605 -354535 -356212 -358520 -353138 -352674 -350912 -353417 -353374 -353275 -353693 -358565
253 -358565 -360944 -362407 -360003 -360098 -354390 -351133 -351229 -349961 -343762 -339341 -332759 -332273 -334651 -339445 -340684 -341206
237 -341206 -344246 -339546 -338923 -338949 -338462 -346342 -348119 -342558 -339387 -340073 -339060 -335842 -338582 -343158 -347199 -339620
221 -339620 -338073 -333377 -329836 -326205 -322618 -318321 -322360 -328684 -327228 -321232 -323722 -322646 -327808 -331240 -328361
206 -328361 -325468 -324147 -320702 -322805 -322147 -324345 -321880 -318189 -317085 -314685 -312892 -313064 -314769 -321616 -322088
191 -322088 -314746 -310885 -310296 -310170 -314040 -317482 -307176 -300420 -300118 -304049 -307013 -308320 -309811 -314007 -311894
176 -311894 -302169 -301589 -305276 -301045 -302221 -306034 -303336 -304870 -300118 -299527 -302831 -300500 -292502 -290198 -290750
161 -290750 -288989 -287595 -286987 -290418 -293272 -298092 -301519 -301029 -302723 -299761 -295486 -294818 -294692 -298491 -299595 -297114
145 -297114 -288428 -283277 -283674 -287649 -287170 -289546 -287319 -285933 -287054 -281625 -278888 -273936 -272067 -274395 -274199
130 -274199 -272414 -270949 -272636 -274371 -272175 -271228 -268220 -272743 -272625 -271206 -269175 -263718 -263581 -265444 -266973
115 -266973 -266625 -263718 -260103 -258893 -262525 -261747 -263411 -258944 -255177 -255715 -259522 -263283 -267180 -264924 -259742
100 -259742 -261959 -260505 -254881 -253821 -252015 -248894 -246848 -248729 -252568 -255251 -251360 -245499 -245708 -245591 -243186
85 -243186 -241596 -242371 -241367 -240234 -243939 -242572 -243027 -242069 -237645 -235862 -230750 -229561 -226248 -224761 -219988 -221833
69 -221833 -225400 -227701 -228423 -224377 -216996 -218336 -221647 -220433 -220358 -221810 -222213 -220854 -218870 -217677 -219203 -221717
53 -221717 -219493 -212666 -211156 -213925 -211506 -212864 -212637 -213944 -213119 -213437 -211394 -205345 -202680 -198971 -198665 -201678
37 -201678 -197859 -202648 -204911 -195348 -199804 -204655 -201755 -196364 -188695 -187043 -192782 -197169 -194676 -193339 -196447
22 -196447 -194758 -194102 -189281 -183496 -186919 -189203 -191742 -192116 -184175 -184015 -183968 -181628 -176829 -173604 -175501 -179710
6 -179710 -178723 -176734 -180535 -181168 -178966 -178618
0 -178618
##END NTUPLES=NMR SPECTRUM
##END=
