##TITLE=Analysis number 326484
Compound Code AC 10728
Book Reference c
Project Code adrs
Chemist Name stores
##JCAMPDX= 6.0         $$ Bruker NMR JCAMP-DX V2.0
##DATA TYPE= NMR SPECTRUM
##DATA CLASS= NTUPLES
##ORIGIN= Bruker BioSpin GmbH
##OWNER= nmr
$$ XWIN-NMR		Version 3.5
$$ Thu Feb  8 09:07:02 2007 GMT Standard Time (UT+0h)  MAYBRIDGE\nmr@NMR_250MHZ
##.OBSERVE FREQUENCY= 250.131544655141
##.OBSERVE NUCLEUS= ^1H
##.ACQUISITION MODE= SIMULTANEOUS (DQD)
##.ACQUISITION SCHEME= undefined
##.AVERAGES= 16
##.DIGITISER RES= 18
##SPECTROMETER/DATA SYSTEM= dpx250
##.PULSE SEQUENCE= zg30
##.SOLVENT NAME= DMSO
##.SHIFT REFERENCE= (INTERNAL, DMSO, 0, 16.522)
##AUDIT TRAIL= $$ (NUMBER, WHEN, WHO, WHERE, WHAT)
$$ ##TITLE= Audit trail, XWIN-NMR		Version 3.5
$$ ##JCAMPDX= 5.01
$$ ##ORIGIN= Bruker BioSpin GmbH
$$ ##OWNER= nmr
$$ C:\u/data/dgb/nmr/ADRS/480/pdata/1/auditp.txt
$$ ##AUDIT TRAIL=  $$ (NUMBER, WHEN, WHO, WHERE, WHAT)
(   1,<2007-02-08 09:06:34.12 +000>,<MAYBRIDGE\nmr>,<NMR_250MHZ>,
      <created by zg, POWCHK disabled, PULCHK disabled
       configuration hash MD5:
       49 4B E0 1D 92 C2 6B 37 9F E6 65 BC 52 41 86 1D
       data hash MD5: 64K
       E4 56 9F 3F 77 B1 37 9D AF 4B D3 07 92 1D D8 14>)
(   2,<2007-02-08 09:06:51.31 +000>,<MAYBRIDGE\nmr>,<NMR_250MHZ>,
      <Start of raw data processing
       ef LB = 0.3 FT_mod = 6 PKNL = 1 SI = 32K 
       data hash MD5: 32K
       1A DA 68 5D 60 74 5F 41 C1 01 E1 5A 8B AA B3 C6>)
(   3,<2007-02-08 09:06:52.93 +000>,<MAYBRIDGE\nmr>,<NMR_250MHZ>,
      <apk 
       data hash MD5: 32K
       0B A4 B2 C9 05 0F DE 58 7D 98 F5 52 27 AB 38 BA>)
(   4,<2007-02-08 09:06:53.62 +000>,<MAYBRIDGE\nmr>,<NMR_250MHZ>,
      <abs ABSG = 5 
       data hash MD5: 32K
       E0 C5 38 54 B8 07 77 91 0E 6D AB 94 95 63 AD CA>)
$$ ##END=
$$ 
$$ hash MD5
$$ FE 60 76 E5 2B 4D A0 4E 86 7D 5B A3 52 DE C4 DF
##$RELAX= 
##$RELAX= 
##$RELAX= 
##$RELAX= 
##$RELAX= 
##$RELAX= 
##$RELAX= 
$$ Bruker specific parameters
$$ --------------------------
##$DU= <C:\u>
##$EXPNO= 480
##$NAME= <ADRS>
##$PROCNO= 1
##$TYPE= <nmr>
##$USER= <dgb>
##$AMP= (0..31)
100 100 100 100 100 100 100 100 100 100 100 100 100 100 100 100 100 100 
100 100 100 100 100 100 100 100 100 100 100 100 100 100 
##$AQSEQ= 0
##$AQ_mod= 3
##$AUNM= <au_zg>
##$AUTOPOS= <34 >
##$BF1= 250.13
##$BF2= 250.13
##$BF3= 250.13
##$BF4= 250.13
##$BF5= 500.13
##$BF6= 500.13
##$BF7= 500.13
##$BF8= 500.13
##$BYTORDA= 1
##$CFDGTYP= 0
##$CFRGTYP= 5
##$CHEMSTR= <none>
##$CNST= (0..31)
1 1 145 1 1 1 1 1 1 1 1 1 1 1 1 1 1 1 1 1 1 1 1 1 1 1 1 1 1 1 1 1 
##$CPDPRG= <>
##$CPDPRG1= <>
##$CPDPRG2= <>
##$CPDPRG3= <>
##$CPDPRG4= <mlev>
##$CPDPRG5= <mlev>
##$CPDPRG6= <mlev>
##$CPDPRG7= <mlev>
##$CPDPRG8= <mlev>
##$CPDPRGB= <>
##$CPDPRGT= <>
##$D= (0..31)
0 1 0 0 0 0 0 0 0 0.06 0 0 0 0 0 0 0.0002 0 0 0 0 0 0 0 0 0 0 0 0 0 0 
0 
##$DATE= 1170925592
##$DBL= (0..7)
120 120 120 120 120 120 120 120 
##$DBP= (0..7)
150 150 150 150 150 150 150 150 
##$DBP07= 0
##$DBPNAM0= <>
##$DBPNAM1= <>
##$DBPNAM2= <>
$$ [...]
##$SUBNAM7= <"">
##$SUBNAM8= <"">
##$SUBNAM9= <"">
##$SW= 20.6930455092707
##$SWIBOX= (0..15)
0 0 3 0 0 0 0 0 0 0 0 0 0 0 0 0 
##$SW_h= 5175.983436853
##$TD= 65536
##$TD0= 1
##$TE= 294.16
##$TE2= 300
##$TE3= 300
##$TEG= 300
##$TL= (0..7)
0 120 120 120 120 120 120 120 
##$TP= (0..7)
150 150 150 150 150 150 150 150 
##$TP07= 0
##$TPNAME0= <>
##$TPNAME1= <>
##$TPNAME2= <>
##$TPNAME3= <>
##$TPNAME4= <>
##$TPNAME5= <>
##$TPNAME6= <>
##$TPNAME7= <>
##$TPOAL= (0..7)
0.5 0.5 0.5 0.5 0.5 0.5 0.5 0.5 
##$TPOFFS= (0..7)
0 0 0 0 0 0 0 0 
##$TUNHIN= 0
##$TUNHOUT= 0
##$TUNXOUT= 0
##$USERA1= <user>
##$USERA2= <user>
##$USERA3= <user>
##$USERA4= <user>
##$USERA5= <user>
##$V9= 5
##$VALIST= <valist>
##$VCLIST= <CCCCCCCCCCCCCCC>
##$VD= 0
##$VDLIST= <DDDDDDDDDDDDDDD>
##$VPLIST= <PPPPPPPPPPPPPPP>
##$VTLIST= <TTTTTTTTTTTTTTT>
##$WBST= 1024
##$WBSW= 4
##$XGAIN= (0..3)
0 0 0 0 
##$XL= 0
##$YL= 0
##$YMAX_a= 346183
##$YMIN_a= -345681
##$ZGOPTNS= <>
##$ZL1= 120
##$ZL2= 120
##$ZL3= 120
##$ZL4= 120
##$ABSF1= 16.522
##$ABSF2= -4.171173
##$ABSG= 5
##$ABSL= 3
##$ALPHA= 0
##$AQORDER= 0
##$ASSFAC= 0
##$ASSFACI= 0
##$ASSFACX= 0
##$ASSWID= 0
##$AUNMP= <proc_1d>
##$AZFE= 0.1
##$AZFW= 0.1
##$BCFW= 0
##$BC_mod= 0
##$BYTORDP= 0
##$COROFFS= 0
##$CY= 12.5
##$DATMOD= 1
##$DC= 0
##$DFILT= <>
##$DTYPP= 0
##$F1P= 14.0000005364418
##$F2P= -0.99999901652339
##$FCOR= 0.5
##$FTSIZE= 32768
##$FT_mod= 6
##$GAMMA= 0
##$GB= 0
##$INTBC= 1
##$INTSCL= 1
##$ISEN= 128
##$LB= 0.3
##$LEV0= 0
##$LPBIN= 0
##$MAXI= 10000
##$MC2= 0
##$MEAN= 0
##$ME_mod= 0
##$MI= 0
##$NCOEF= 0
##$NC_proc= -5
##$NLEV= 6
##$NOISF1= 0
##$NOISF2= 0
##$NSP= 0
##$NTH_PI= 0
##$NZP= 0
##$OFFSET= 16.522
##$PC= 1
##$PHC0= 219.2214
##$PHC1= 10.03179
##$PH_mod= 1
##$PKNL= yes
##$PPARMOD= 0
##$PSCAL= 4
##$PSIGN= 0
##$REVERSE= no
##$SF= 250.13
##$SI= 32768
##$SIGF1= 0
##$SIGF2= 0
##$SINO= 400
##$SIOLD= 32768
##$SREGLST= <1H.DMSO>
##$SSB= 0
##$STSI= 32768
##$STSR= 0
##$SW_p= 5175.98343685301
##$SYMM= 0
##$S_DEV= 0
##$TDeff= 65536
##$TDoff= 0
##$TI= <Analysis number 999999
Compound Code 99
Book Reference 9
Project Code 9>
##$TILT= no
##$TM1= 0
##$TM2= 0
##$TOPLEV= 0
##$USERP1= <user>
##$USERP2= <user>
##$USERP3= <user>
##$USERP4= <user>
##$USERP5= <user>
##$WDW= 1
##$XDIM= 32768
##$YMAX_p= 444757799
##$YMIN_p= -642153
$$ End of Bruker specific parameters
$$ ---------------------------------
##NTUPLES= NMR SPECTRUM
##VAR_NAME=  FREQUENCY,     SPECTRUM/REAL,   SPECTRUM/IMAG
##SYMBOL=    X,             R,               I
##VAR_TYPE=  INDEPENDENT,   DEPENDENT,       DEPENDENT
##VAR_FORM=  AFFN,          ASDF,            ASDF
##VAR_DIM=   32768,         32768,           32768
##UNITS=     HZ,            ARBITRARY UNITS, ARBITRARY UNITS
##FACTOR=    0.157963299565203, 1,           1
##FIRST=     4132.6476996994, 0,             0
##LAST=      -1043.33573715361, 0,           0
##MIN=       -1043.33573715361, -642153,     0
##MAX=       4132.6476996994, 444757799,     0
$$ Real data points
##PAGE= N=1
##DATA TABLE= (X++(R..R)), XYDATA
$$ [...]
$$ plain form
23769 -76631 -87103 -38853 -33236 -27780 -40427 3027 -100710 -181551 -183983 -137400 -243372 -335544
23757 -335544 -229544 -154961 -226465 -141913 -108969 -141893 -123856 -83308 -46716 78687 149517
23746 149517 18756 -118141 -79203 -15423 12138 -81464 17073 29709 -55458 -39526 65164
23735 65164 -3768 -83896 -56549 3668 -28976 -15827 25000 -31472 -129246 -211389 -261940 -207314
23723 -207314 -98978 8328 28963 64306 92360 75748 61693 -2192 -128733 -139210 -116359
23712 -116359 -37207 7916 -67200 -127650 -201169 -167670 -81002 -66299 -88286 21708 45203
23701 45203 28922 60752 114120 -30596 -107742 -147168 -38675 -15915 -11635 -9752 -105803 -126200
23689 -126200 -164770 -216745 -126021 -68741 -137630 -153421 -43384 -28540 -80967 -162155 -39108
$$ packed form
23769g6631j0472M8250N617N456j2647M3454j03737q0841k432M6583j05972r2172
23757c35544J06000P4583p1504Q4552L2944l2924J8037M0548L6592J25403P0830
23746A49517j30761j36897L8938O3780K7561r3602R8537J2636q5167J5932J04690
23735F5164o8932q0128K7347O0217l2644J3149M0827n6472r7774q2143n0551N4626
23723b07314J08336J07306K0635L5343K8054j6612j4055o3885j26541j0477K2851
23712a16359P9152M5123p5116o0450p3519L3499Q6668J4703k1987J09994K3495
23701D5203j6281L1830N3368j44716p7146l9426J08493K2760M280J883r6051k0397
23689a26200l8570n1975R0724N7280o8889j5791J10037J4844n2427q1188J23047
$$ plain form
23678 -39108 -44200 -56007 -22201 -40370 74876 166991 99076 38431 105648 218428 347191
23667 347191 311133 163719 138192 28313 84093 118911 258933 189121 58301 161668
23657 161668 108418 90051 51798 25149 -117700 -85530 -78985 -59185 -14801 59988 82645
23646 82645 1259 44345 -28844 -68094 -52292 17963 14426 -48672 14795 -14672 -43292 69103
23634 69103 149974 93251 110031 126167 87699 11189 -89158 -104820 -55576 170268 150030
23623 150030 113442 5981 -32172 61948 -45352 -133325 16051 228675 376467 368697 240153
23612 240153 214344 260105 212957 176055 124902 -962 5178 107015 117484 112305 197628
23601 197628 154364 93578 15152 -96127 -155071 -16556 83481 -61204 -90064 89230
$$ packed form
23678c9108n092j1807L3806j8169J15246R2115o7915o0645O7217J12780J28763
23667C47191l6058j47414k5527j09879N5780L4818J40022o9812j30820J03367
23657A61668n3250j8367l8253k6649j42849L2170O545J9800M4384P4789K2657
23646H2645q1386M3086p3189l9250J5802P0255l537o3098O3467k9467k8620J12395
23634F9103Q0871n6723J6780J6136l8468p6510j00347j5662M9244K25844k0238
23623A50030l6588j07461l8153R4120j07300q7973J49376K12624J47792p770j28544
23612B40153k5809M5761m7148l6902n1153j25864O140J01837J0469n179Q5323
23601A97628m3264o0786p8426j11279n8944J38515J00037j44685k8860J79294
$$ plain form
23591 89230 129832 97010 -21064 -88188 103415 194790 270563 191518 -126043 -317772 -305627
23580 -305627 -198247 1436 116805 47841 -31741 19893 -25573 -3557 102129 114742 145448
23569 145448 74746 29362 33978 215877 355521 377282 265681 50014 -111809 -87729 -76133
23558 -76133 3722 102633 43407 -101693 26626 -55898 -95688 -25987 -109755 -49702 141360
23547 141360 216385 223279 285601 200827 63386 -100908 -111368 -4513 87280 180219 272252
23536 272252 271421 218344 62084 108007 144382 239174 247509 125972 -54911 -102093 -92544 -56347
23524 -56347 -21925 50063 128770 125882 31260 -17903 -14220 42617 -24739 84367 152265 185098
23512 185098 140727 37846 -6336 -84321 -161010 -171231 -136639 -121789 -164379 -157757 -63856
$$ packed form
23591H9230M0602l2822j18074o7124J91603R1375P5773p9045l17561j91729J2145
23580c05627J07380J99683J15369o8964p9582N1634m5466K2016J05686J2613L0706
23569A45448p0702m5384M616J81899J39644K1761j11601k15667j61823K4080J1596
23558g6133P9855R8911n9226j45100J28319q2524l9790O9701q3768O0053J91062
23547A41360P5025O894O2322q4774j37441j64294j0460J06855R1793R2939R2033
23536B72252q31n3077j56260M5923L6375R4792Q335j21537j80883m7182R549L6197
23524e6347L4422P1988P8707k888r4622m9163L683N6837o7356J09106O7898L2833
23512A85098m4371j02881m4182p7985p6689j0221L4592J4850m2590O622R3901
$$ plain form
23501 -63856 -8489 -78440 -33367 55505 108615 61407 37962 -7028 -85284 -162062 -156676 -136908
23489 -136908 7388 -4218 -74342 36545 -4314 1019 1738 -189222 -231070 -24926 -113455
23478 -113455 -199936 -67595 -11705 -2434 -97647 -158477 -76100 16708 6720 23069 55698 49192
23466 49192 40037 -22078 -66820 62230 51606 -106898 -334380 -302543 -163515 -91512 43787
23455 43787 194016 240534 109286 50724 84814 220581 248767 132005 -2733 41711 124226
23444 124226 122310 45574 -190766 -229312 -132143 -256755 -273988 -166591 -98046 -212056 -241549
23433 -241549 -252798 -223220 -100632 -45981 -122207 -112483 46752 93940 -87426 -79823 -54355
23422 -54355 -15528 -14629 -122915 -193657 -97213 -96909 -200252 -210729 -92367 -18986 -80492 -162684
$$ packed form
23501f3856N5367o9951M5073Q8872N3110m7208k3445m4990p8256p6778N386J9768
23489a36908J44296j1606p0124J10887m0859N333P19j90960m1848K06144q8529
23478a13455q6481J32341N5890R271r5213o0830Q2377R2808r988J6349L2629o506
23466D9192r155o2115m4742J29050j0624j58504k27482L1837J39028P2003J35299
23455D3787J50229M6518j31248n8562L4090J35767K8186j16762j34738M4444Q2515
23444A24226j916p6736k36340l8546R7169j24612j7233J07397O8545j14010k9493
23433b41549j1249K9578J22588N4651p6226R724J59235M7188j81366P603K5468
23422e4355L8827Q99j08286p0742R6444L04j03343j0477J18362P3381o1506q2192
$$ plain form
23410 -162684 -18555 59688 26320 17884 5186 -63304 -38011 -33833 -139574 -78181 51767
23399 51767 160622 98557 -3331 86168 103484 182092 92106 -137477 -127488 -33183 -168938
23388 -168938 -168312 -167665 -283166 -234111 -199288 -145115 -67487 -126767 -146378 -50414 52673 149309
23376 149309 120238 85701 35347 43136 -67540 -211209 -164255 13175 48652 -1892 -153437
23365 -153437 -97202 145749 153481 156493 80262 599 114776 158887 143416 68095 83208
23354 83208 -18597 30076 223925 157711 -32 -117872 -179515 -79234 -68444 -37943 137805
23343 137805 32857 20864 99798 127289 122607 155288 120036 47804 81371 170538 16108
23332 16108 -74252 -145037 -26146 -3727 -24131 -89174 -133008 -61164 -86490 -149986 -140383 -57154
$$ packed form
23410a62684J44129P8243l3368q436j2698o8490K5293M178j05741O1393J29948
23399E1767J08855o2065j01888Q9499J7316P8608q9986k29583R989R4305j35755
23388a68938O26O47j15501M9055L4823N4173P7628n9280j9611R5964J03087R6636
23376A49309k9071l4537n0354P789j10676j43669M6954J77430L5477n0544j51545
23365a53437N6235K42951P732L012p6231p9663J14177M4111j5471p5321J5113
23354H3208j01805M8673J93849o6214j57743j17840o1643J00281J0790L0501J75748
23343A37805j04948j1993P8934K7491m682L2681l5252p2232L3567Q9167j54430
23332A6108r0360p0785J18891K2419k0404o5043m3834P1844k5326o3496R603Q3229
$$ plain form
23320 -57154 25624 148359 169988 100101 53950 133411 104932 -53727 -142180 -57111 -60568
23309 -60568 -66198 85885 254436 306760 285903 137119 58679 46427 -41113 -42444 -34776 79947
23297 79947 126185 -9813 -23367 41282 111490 -49295 -20229 18594 -86168 -188041 -221575
23286 -221575 -137975 -57228 1953 209173 206047 114216 149658 125684 12672 102695 166736
23275 166736 197713 67240 25546 74208 119228 111351 192564 260027 166364 148372 1394
23264 1394 -135869 -142461 -51199 36228 55395 121873 108365 89987 -38250 -15655 -21069 -45545
23252 -45545 -40991 -74515 -153707 -76716 -127609 -164948 -52232 6834 57959 130367 19378
23241 19378 50441 118315 95797 81960 -100322 -182981 -199425 -203747 -114216 -72693 -51565 -66817
$$ packed form
23320e7154Q2778J22735K1629o9887m6151P9461k8479j58659q8453Q5069l457
23309f0568n630J52083J68551N2324k0857j48784p8440j2252q7540j331P668J14723
23297G9947M6238j35998j3554O4649P0208j60785K9066L8823j04762j01873l3534
23286b21575Q3600Q0747N9181K07220l126r1831L5442k3974j13012R0023O4041
23275A66736L0977j30473m1694M8662M5020p877Q1213O7463r3663j7992j46978
23264A394j37263o592R1262Q7427J9167O6478j3508j8378j28237K2595n414k4476
23252d5545M554l3524p9192P6991n0893l7339J12716N9066N1125P2408j10989
23241A9378L1063O7874k2518j3837j82282q2659j6444m322Q9531M1523K1128j5252
$$ plain form
23229 -66817 -77833 -191512 -370888 -394347 -294382 -76293 57453 -1682 92997 139233 126053
23218 126053 -13165 34348 63433 -3838 -133667 -217357 -149352 -171645 -146866 -118500 -194900
23207 -194900 -209004 -114793 -110751 -215900 -244519 -213841 -176462 -105914 5119 11680 -6523
23196 -6523 -13124 64440 32092 73340 81952 -7517 64464 31593 -24495 73581 4912 -10643
23184 -10643 60560 106484 61682 36489 6956 142448 111488 126241 166132 172971 127249 133691
23172 133691 110444 -2447 -125127 -112818 -51504 -74182 -109656 -97301 -109812 -76053 28973
23161 28973 112617 88716 44593 -142004 -244758 -104267 99776 243381 200445 107617 -80762
23150 -80762 22200 164567 123568 36194 -69187 -75732 -55641 -19351 -85117 -13712 22982
$$ packed form
23229f6817j1016j13679j79376k3459R9965K18089J33746n9135R4679M6236j3180
23218A26053j39218M7513K9085o7271j29829q3690O8005k2293K4779K8366p6400
23207a94900j4104R4211M042j05149k8619L0678L7379P0548J11033O561j8203
23196f523o601P7564l2348M1248Q612q9469P1981l2871n6088R8076o8669j5555
23184a0643P1203M5924m4802k5193k9533J35492l0960J4753L9891O839m5722O442
23172A33691k3247j12891j22680J2309O1314k2678l5474J2355j2511L3759J05026
23161B8973Q3644k3901m4123j86597j02754J40491K04043J43605m2936r2828j88379
23150h0762J02962J42367m0999q7374j05381o545K0091L6290o5766P1405L6694
$$ plain form
23139 22982 22023 -29687 -18345 -42508 -92551 1576 64289 91399 144671 -60441 -73693 43640
23127 43640 -4547 -78368 -99529 -92395 -205986 -198390 -127642 -68328 -78443 -50365 -31443 73873
23115 73873 59627 -97279 -121457 -89417 -36535 -35869 -12541 -44260 -33437 -87437 -60525 119417
23103 119417 131054 125868 28656 -3992 8189 -26527 -85678 -97703 -88829 -52886 -72735 -115982
23091 -115982 19481 46657 136407 132806 199460 170002 142823 154953 146944 216619 141599 41530
23079 41530 26496 -79620 -153201 -161843 -188014 -119998 -107603 -13906 82745 -9868 -105100 -195204
23067 -195204 -224358 -236904 -374069 -327535 -208168 -121351 -6588 50245 45697 -40582 -105684
23056 -105684 -175620 -259914 -267234 -143475 -192409 -168905 -158290 -177521 -187260 -206433 -226918 -148693
$$ packed form
23139B2982r59n1710J1342k4163n0043R4127O2713K7110N3272k05112j3252J17333
23127D3640m8187p3821k1161P134j13591P596P0748N9314j0115K8078J8922J05316
23115G3873j4246j56906k4178L2040N2882O66K3328l1719J0823n4000K6912J79942
23103A19417J1637n186r7212l2648J2181l4716n9151j2025Q874L5943j9849m3247
23091a15982J35463K7176Q9750l601O6654k9458k7179J2130q009O9675p5020j00069
23079D1530j5034j06116p3581q642k6171O8016J2395R3697R6651r2613r5232r0104
23067a95204k9154j2546j37165M6534J19367Q6817J14763N6833m548q6279o5102
23056a05684o9936q4294p320J23759m8934K3504J0615j9231r739j9173k0485P8225
$$ plain form
23044 -148693 -140633 -155448 -127607 -55558 -6436 7958 210123 307795 103128 23870 81206
23033 81206 5660 26614 -44232 -54293 -93781 -214452 -120105 -71886 -8780 93985 77520
23022 77520 44470 -2285 -23220 -101424 -6929 29799 6721 -168486 -200277 -177359 -105394
23011 -105394 -71123 1420 -53163 -72955 -126649 -174078 -79855 2538 99399 81682 -74096
23000 -74096 -19655 31648 54170 49023 -45575 -108183 -102934 -141537 -258285 -160201 18901 64925
22988 64925 15675 -197561 -318070 -276564 -145406 -69373 -58368 -37259 86325 152790 -36619
22977 -36619 -55432 97100 257366 267252 232534 182627 220533 284573 158596 195417 125391
22966 125391 95440 135555 355108 408899 288916 144933 115284 25051 -71157 -226616 -233519
$$ packed form
23044a48693Q060j4815K7841P2049M9122J4394K02165R7672k04667p9258N7336
23033H1206p5546K0954p0846j0061l9488j20671R4347M8219O3106J02765j6465
23022G7520l3050m6755k0935p8204R4495L6728k3078j75207l1791K2918P1965
23011a05394L4271P2543n4583j9792n3694m7429R4223Q2393R6861j7717j55778
23000g4096N4441N1303K2522n147r4598o2608N249l8603j16748R8084J79102M6024
22988F4925m9250k13236j20509M1506J31158P6033J1005K1109J23584O6465j89409
22977c6619j8813J52532J60266R886l4718m9907L7906O4040j25977L6821p0026
22966A25391k9951M0115K19553N3791j19983j43983k9649r0233r6208j55459o903
$$ plain form
22955 -233519 -280371 -213526 -143491 -257942 -296316 -155234 -68461 -22369 -134667 -129798 -118079
22944 -118079 -79318 -79687 -15861 -82702 -131372 -139186 -294907 -181659 -231354 -69083 -15280
22933 -15280 -151773 -49778 -46011 -19334 27605 -57851 -125994 -108115 -68514 -247465 -395799
22922 -395799 -334770 -345536 -320884 -122787 99283 92365 -65232 -168669 -157418 5163 47917
22911 47917 -62188 -105650 -105833 -205330 -284791 -324444 -77495 33242 -30302 -11065 43542
22900 43542 51899 115561 168523 104599 211198 326457 258543 154449 64229 -113585 -106750
22889 -106750 -1053 48370 -34519 -229273 -69585 -9086 -96058 -236159 -208004 -154795 -112832
22878 -112832 -71262 -102773 -164350 -151501 -71795 -89414 -160163 -344988 -324020 -156607 -53390
$$ packed form
22955b33519m6852O6845P0035j14451l8374J41082Q6773M6092j12298M869J1719
22944a18079L8761l69O3826o6841m8670p814j55721J13248m9695J62271N3803
22933a5280j36493J01995L767K6677M6939q5456o8143J7879L9601j78951j48334
22922c95799O1029j0766K4652J98097K22070o918j57597j03437J1251J62581M2754
22911D7917j10105m3462j83r9497p9461l9653K46949J10737o3544J9237N4607
22900D3542Q357O3662N2962o3924J06599J15259o7914j04094r0220j77814O835
22889a06750J05697M9423q2889j94754J59688O0499q6972j40101K8155N3209M1963
22878a12832M1570l1511o1577J2849P9706j7619p0749j84825K0968J67413J03217
$$ plain form
22867 -53390 -94645 -97521 -65123 37201 23922 -154937 -101121 -149449 -145619 -161217 -38357
22856 -38357 -18193 -155938 -207070 -184481 -216094 -190416 -190090 -193454 -296044 -259398 -80264 22394
22844 22394 -62450 -198634 -175003 -217103 -314682 -259289 -23458 67552 172306 129522 11140
22833 11140 -6609 -18289 131505 255559 186367 24281 3950 31271 -96468 -130692 -79349
22822 -79349 -143276 -73857 -82513 -105239 -66662 8361 -63426 -7329 -38994 -52082 6008 -21189
22810 -21189 -82976 -96473 31680 70640 124831 225782 367199 378584 315311 201636 231961
22799 231961 150706 55838 10679 53996 80515 115938 -2960 -38251 -175431 -183299 -183567 -122715
22787 -122715 -116265 -147116 -253737 -84992 -69044 -104779 -148451 -165125 -39782 -150372 -203569
$$ packed form
22867e3390m1255k876L2398J02324j3279j78859N3816m8328L830j5598J22860
22856c8357K0164j37745n1132K2589l1613K5678L26l364j02590L6646J79134J02658
22844B2394q4844j36184K3631m2100r7579N5393K35831R1010J04754m2784j18382
22833A1140j7749j1680J49794J24054o9192j62086k0331K7321j27739l4224N1343
22822g9349o3927O9419q656k2726L8577P5023p1787N6097l1665j3088N8090k7197
22810b1189o1787j3497J28153L8960N4191J00951J41417J1385o3273j13675L0325
22799B31961q1255r4868m5159M3317K6519L5423j18898l5291j37180p868k68O0852
22787a22715O450l0851j06621J68745J5948l5735m3672j6674J25343j10590n3197
$$ plain form
22776 -203569 -225793 -113242 -4472 -45390 -20310 -29783 -94549 -59317 -74117 -160865 -143956
22765 -143956 -37589 145680 155220 88291 59209 43489 -66031 -24996 -130836 -258834 -282033
22754 -282033 -168975 -121083 -160725 -118506 -101010 -122327 -71287 -98608 -163544 -199157 -144626
22743 -144626 -245245 -97662 -81463 -39436 7786 -51415 -114200 -119426 -80216 88324 125929
22732 125929 16888 -50579 -72887 -134638 -206114 -201754 -92429 -3713 -19788 -67811 -123715
22721 -123715 -113447 -122996 -56614 2434 51823 -21924 -6553 78499 21096 -21984 20388 -23080
22709 -23080 -38160 -55318 -62379 -87176 37084 19610 15125 35547 71003 94263 25627 12326
22697 12326 -58065 -130420 -218980 -258715 -346764 -268800 -173948 -76003 -109899 -223636 -221880 -179868
$$ packed form
22776b03569k2224J12551J08770m0918K5080r473o4766L5232j4800q6748J6909
22765a43956J06367J83269R540o6929k9082j5720j09520M1035j05840j27998k3199
22754b82033J13058M7892l9642M2219J7496k1317N1040k7321o4936l5613N4531
22743a44626j00619J47583J6199M2027M7222n9201o2785n226L9210J68540L7605
22732A25929j09041o7467k2308o1751p1476M360J09325Q8716j6075m8023n5904
22721a23715J0268r549O6382N9048M9389p3747J5371Q5052n7403m3080M2372m3468
22709b3080j5080j7158p061k4797J24260j7474m485K0422L5456K3260o8636j3301
22697A2326p0391p2355q8560l9735q8049P7964R4852R7945l3896j13737J756M2012
$$ plain form
22685 -179868 -181493 -197858 -204967 -130756 -171164 -181930 -168933 -187464 -130488 160292 323512
22674 323512 262896 77214 63406 1093 33044 143235 104038 106642 182688 182456 87127 34055
22662 34055 11463 82651 44262 26478 -16433 -43104 38820 -8039 -95397 -41966 -15204 27860
22650 27860 65889 52310 129749 146360 24554 9666 85402 -60628 -187494 -333463 -279490
22639 -279490 -237946 -140516 87942 223905 283762 140915 124687 61004 -137935 -158274 -70839
22628 -70839 -21713 -40425 -54966 -118287 -134681 -179384 -118812 -93298 -65628 -115615 -45808 -131151
22616 -131151 -211352 -270889 -236182 -166606 -237402 -224544 -96460 52415 96966 134770 116749
22605 116749 135281 149319 10330 -48569 28520 5515 -86592 -52714 -47061 4634 -107789
$$ packed form
22685a79868j625j6365p109P4211m0408j0766J2997j8531N6976K90780J63220
22674C23512o0616j85682j3808o2313L1951J10191l9197K604P6046k32r5329n3072
22662C4055k2592P1188l8389j7784m2911k6671Q1924m6859q7358N3431K6762M3064
22650B7860L8029j3579P7439J6611j21806j4888P5736j46030j26866j45969N3973
22639b79490M1544R7430K28458J35963N9857j42847j6228o3683j98939k0339Q7435
22628g0839M9126j8712j4541o3321j6394m4703O0572K5514K7670m9987O9807q5343
22616a31151q0201n9537L4707O9576p0796J2858J28084J48875M4551L7804j8021
22605A16749J8532J4038j38989n8899P7089k3005r2107L3878N653N1695j12423
$$ plain form
22594 -107789 -193102 -128967 -32678 -5793 107796 -1556 50263 112549 150406 54876 31584
22583 31584 49442 49020 34627 -70777 -29175 53089 38871 -26803 -28501 34041 94905 105606
22571 105606 178887 210436 85220 65217 167530 113708 9423 -14306 -49757 -27627 -93752
22560 -93752 -253581 -191550 -189230 -185967 -67375 -21095 -50456 -95663 -92799 -86322 -218734 -271486
22548 -271486 -191381 -105120 -214409 -206321 -90809 -159219 -182962 -217193 -161465 -138311 -30574
22537 -30574 20392 -29315 -110038 -93297 -151073 -130874 -68697 -20598 -24308 -31188 -72736 3515
22525 3515 -28581 13863 90520 76602 59202 99880 3253 -142231 -58126 50258 165748
22514 165748 349436 374711 280135 131715 28976 -48801 -28830 -28396 -135067 -171461 -227180
$$ packed form
22594a07789q5313O4135R6289K6885J13589j09352N1819O2286L7857r5530k3292
22583C1584J7858m22j4393j05404M1602Q2264j4218o5674j698O2542O0864J0701
22571A05606P3281L1549j25216k0003J02313n3822j04285k3729l5451K2130o6125
22560i3752j59829O2031K320L263J18592M6280k9361m5207K864O477j32412n2752
22548b71486Q0105Q6261j09289Q088J15512o8410k3743l4231N5728K3154J07737
22537c0574N0966m9707q0723J6741n7776K0199O2177M8099l710o880m1548P6251
22525C515l2096M2444P6657j3918j7400M0678r6627j45484Q4105J08384J15490
22514A65748J83688K5275r4576j48420j02739p7777J9971M34j06671l6394n5719
$$ plain form
22503 -227180 -123393 -181999 -259852 -326993 -209909 -152583 -150858 -52538 -1717 33144 -57764
22492 -57764 -4825 -38606 -126191 -55920 -8450 -104917 -278345 -354151 -192891 -6590 -15236
22481 -15236 -64065 -56822 -44297 -57855 -123166 -90951 64030 80667 118035 110369 113108 -143214
22469 -143214 -222404 -165687 -135878 -121746 -68224 -85557 -172018 -78455 30567 -4451 5345
22458 5345 -28202 1168 90317 28165 17473 31036 94715 176038 162080 145615 75919 -75545
22446 -75545 -111882 -156160 -61400 -11819 -47936 -35616 55918 18686 -30374 -29440 -27199 55990
22434 55990 -53351 -163223 -129316 -125725 -80108 50534 1137 70824 188403 171451 110863
22423 110863 6479 -131913 -149483 47968 100459 142252 98085 20043 -28039 -9351 -186941
$$ packed form
22503b27180J03787n8606p7853o7141J17084N7326J725R8320N0821L4861r0908
22492e7764N2939l3781q7585P0271M7470r6467j73428p5806J61260J86301q646
22481a5236m8829P243J2525j3558o5311L2215J54981J6637L7368p666K739k56322
22469a43214p9190N6717K9809J4132N3522j7333q6461R3563J09022l5018R796
22458E345l3547K9370Q9149o2152j0692J3563O3679Q1323j3958j6465o9696j51464
22446g5545l6337m4278R4760M9581l6117J2320R1534l7232m9060R34K241Q3189
22434E5990j09341j09872L3907L591M5617J30642m9397O9687J17579j6952o0588
22423A10863j04384j38392j7570J97451N2491M1793m4167p8042m8082J8688j77590
$$ plain form
22412 -186941 -217411 -49377 -32458 -10910 -9183 -44955 -104782 -223249 -220253 -127998 -4429
22401 -4429 -70882 -161926 -183191 -114745 -45629 -20931 -54060 -72744 -92954 -134502 -40156 1473
22389 1473 -15781 -74463 -122529 -126249 70580 6914 -44474 36222 107377 304143 357634 397732
22377 397732 408802 292330 65000 -121588 -296622 -153160 -50023 -86591 -65196 -6514
22367 -6514 -8944 -79956 -68462 -29291 3490 12028 -17406 -39790 -39287 2042 65936 81577 -26002
22354 -26002 6063 -28078 -54457 81749 99674 -15479 124277 34190 7898 -59866 6443
22343 6443 66653 105870 171734 76115 -41966 -27079 -20840 5866 7642 -116482 -111821 -148837
22331 -148837 -100597 -38029 -21712 -70287 -79984 -48005 -63425 -43121 -191539 -155693 -103656
$$ packed form
22412a86941l0470J68034J6919K1548J727l5772n9827j18467K996R2255J23569
22401d429o6453r1044k1265O8446O9116K4698l3129j8684k0210m1548R4346M1629
22389A473j7254n8682m8066l720J96829o3666n1388Q0696P1155J96766N3491M0098
22377C97732J1070j16472k27330j86588j75034J43462J03137l6568K1395N8682
22367f514k430p1012J1494L9171L2781Q538k9434k2384N03M1329O3894J5641j07579
22354b6002L2065l4141k6379J36206J7925j15153J39756r0087k6292o7764O6309
22343F443O0210L9217O5864r5619j18081J4887O239K6706J776j24124M661l7016
22331a48837M8240O2568J6317m8575r697L1979j5420K0304j48418L5846N2037
$$ plain form
22320 -103656 -107068 -64284 26615 -13377 -118793 -169902 -141640 2437 -36606 -98237 25977
22309 25977 73243 -24345 -80909 15036 -14474 76084 117564 84983 -25147 -111077 -141660
22298 -141660 -12216 -71481 -108820 -146281 -49317 -77678 -201354 -207178 -171551 -155666 -180900
22287 -180900 -200222 -65492 -8789 64446 -31338 -175504 25153 152458 158820 110057 105159
22276 105159 88983 120062 70495 108520 139048 36976 -35416 17827 111985 27812 -20819
22265 -20819 -72818 -158799 -73801 56564 -64457 -78626 -75221 -238772 -311139 -277010 -38066
22254 -38066 18751 23167 18255 19184 106334 189534 178294 41389 -20950 -208412 -223592 -236938
22242 -236938 -321855 -243864 -266175 -211165 -107477 -43394 46817 70369 -97859 -181217 -82868
$$ packed form
22320a03656l412M2784R0899l9992j05416n1109K8262J44077l9043o1631J24214
22309B5977M7266r7588n6564R5945k9510R0558M1480l2581j10130q5930l0583
22298a41660J29444n9265l7339l7461R6964k8361j23676n824L5627J5885k5234
22287a80900j9322J34730N6703P3235r5784j44166K00657J27305O362m8763m898
22276A05159j6176L1079m9567L8025L0528j02072p2392N3243R4158q4173m8631
22265b0819n1999q5981Q4998J30365j21021j4169L405j63551p2367L4129K38944
22254c8066N6817M416m912R29Q7150Q3200j1240j36905o2339j87462j5180j3346
22242b36938q4917P7991k2311N5010J03688O4083R0211K3552j68228q3358R8349
$$ plain form
22231 -82868 67246 100405 103056 29523 -68447 -157599 -195432 -207733 -252839 -85971 22751
22220 22751 -88506 -174125 -84241 -32345 -71837 -146373 -20151 -15426 -57943 -140085 -227594
22209 -227594 -266487 -223744 -29398 230314 268265 234587 132092 119609 54201 65505 -22571
22198 -22571 -142825 -168293 -167466 -215266 -183113 18185 115523 224835 213286 167955 148707
22187 148707 61203 -94290 -184865 -215850 -122835 -183448 -186733 -252373 -204894 7410 180856
22176 180856 218585 79550 13507 71801 104738 107971 -33064 -4347 -74972 -77176 -145306
22165 -145306 -209740 -271044 -137663 -54774 -8041 -103941 -132243 -164110 -123115 -132556 -120793
22154 -120793 -112079 -112610 -214726 -120329 -122365 -78531 117851 202207 111133 -45963 -224977
$$ packed form
22231h2868J50114L3159K651p3533r7970q9152l7833j2301m5106J66868J08722
22220B2751j11257q5619Q9884N1896l9492p4536J26222M725m2517q2142q7509
22209b27594l8893M2743J94346K59712L7951l3678j02495j2483o5408J1304q8076
22198b2571j20254k5468Q27m7800L2153K01298R7338J09312j1549m5331j9248
22187A48707q7504j55493r0575l0985R3015o0613l285o5640M7479K12304J73446
22176A80856L7729j39035o6043N8294L2937L233j41035K8717p0625k204o8130
22165a45306o4434o1304J33381Q2889M6733r5900k8302l1867M0995r441J1763
22154a20793Q714n31j02116R4397k036M3834J96382Q4356r1074j57096j79014
$$ plain form
22143 -224977 -202693 -130485 -133865 -166399 -35268 38783 10138 -18990 -7449 -58939 -132665
22132 -132665 -73865 31005 -39067 1598 97568 204304 290662 350083 277782 184287 183036
22121 183036 267269 201517 206605 208329 252833 297097 163231 142682 239507 159502 -28749
22110 -28749 -167888 -151760 -177724 -164752 -84239 -119480 -193732 -218200 -199526 -195415 -345946
22099 -345946 -285185 -258689 -268644 -99695 -67224 -58481 -14752 -67292 -168499 -128512 -73084
22088 -73084 -31457 -62263 -17715 -123611 -129030 -100122 -146646 -160097 -96931 -65942 20572 48481
22076 48481 -38550 -69697 -81016 -101912 -84860 -173214 -335792 -276729 -12538 84243 32498
22065 32498 2289 -145155 -210954 -91461 61759 195542 279684 262721 166485 220160 179798
$$ packed form
22143b24977K2284P2208l380l2534J31131P4051k8645k9128J1541n1490p3726
22132a32665N8800J04870p0072M0665R5970J06736Q6358N9421p2301r3495j251
22121A83036Q4233o5752N088J724M4504M4264j33866k0549R6825q0005j88251
22110b8749j39139J6128k5964J2972Q0513l5241p4252k4468J8674M111j50531
22099c45946O0761K6496r955J68949L2471Q743M3729n2540j01207L9987N5428
22088g3084M1627l0806M4548j05896n419K8908m6524j3451O3166L0989Q6514K7909
22076D8481q7031l1147j1319k0896J7052q8354j62578N9063K64191R6781n1745
22065C2498l0209j47444o5799J19493J53220J33783Q4142j6963r6236N3675m0362
$$ plain form
22054 179798 127300 132567 115463 241570 230450 249481 228461 369285 358408 340198 333202
22043 333202 396862 484304 520957 543587 499566 469195 515551 525864 561418 583697 626241
22032 626241 535492 537450 435382 218089 187214 291341 330746 368286 503288 226533 -8518
22021 -8518 33759 81842 130908 206889 194430 70743 75841 124739 117506 50052 17992 165150
22009 165150 241354 200887 98091 36225 23610 164442 364713 179941 -25717 -25303 -6289
21998 -6289 12259 -6245 -10474 74054 136026 90117 91790 45271 9223 -55407 -88619 -103098
21986 -103098 -143285 -104018 44016 111523 121995 83506 81832 -8970 -57229 -19022 80235
21975 80235 131532 130826 124118 68043 77456 16123 -7081 146936 103244 150942 221679 54040
$$ packed form
22054A79798n2498N267j7104J26107j1120J9031k1020J40824j0877j8210o996
22043C33202O3660Q7442L6653K2630m4021l0371M6356J0313L5554K2279M2544
22032F26241r0749J958j02068k17293l0875J04127L9405L7540J35002k76755k35051
22021h518M2277M8083M9066P5981j2459j23687N098M8898p233o7454l2060J47158
22009A65150P6204m0467j02796o1866j2615J40832K00271j84772k05658M14J9014
21998f289J8548j8504m229Q4528O1972m5909J673m6519l6048o4630l3212j4479
21986a03098m0187L9267J48034O7507J0472l8489j674r0802m8259L8207R9257
21975H0235N1297p06o708n6075R413o1333k3204J54017m3692M7698P0737j67639
$$ plain form
21963 54040 96229 94726 43792 22353 8780 22332 141230 165023 181429 120686 -98015
21952 -98015 -237185 -145831 -43765 -38637 -81232 -132857 -167519 -86429 -194589 -213317 -60961
21941 -60961 -39655 -177760 -209897 -231980 -286303 -238563 -195587 -63528 -38397 -20560 -2625
21930 -2625 6695 28444 -44130 -48462 -64134 -128014 -160846 -54807 10036 -87546 5482 137567
21918 137567 220934 231835 113157 -44889 -251021 -281940 -170969 34054 228100 321407
21908 321407 168827 34781 -83440 -90305 -76491 -147148 -75617 -186796 -259980 -272493 -97263
21897 -97263 71521 13828 121743 113209 -80764 -153095 -174539 -188700 -246716 -63878 48368
21886 48368 208201 149779 751 -25078 -43670 19353 73475 65363 54777 -29924 -127033
$$ packed form
21963E4040M2189j503n0934k1439j3573J3552J18898K3793J6406o0743k18701
21952i8015j39170R1354J02066N128m2595n1625l4662Q1090j08160j8728J52356
21941f0961K1306j38105l2137k2083n4323M7740M2976J32059K5131J7837J7935
21930b625R320K1749p2574m332j5672o3880l2832J06039O4843r7582R3028J32085
21918A37567Q3367J0901j18678j58046k06132l0919J10971K05023J94046R3307
21908C21407j52580j34046j18221o865J3814p0657P1531j11179p3184j2513J75230
21897i7263J68784n7693J07915q534j93973p2331k1444j4161n8016J82838J12246
21886D8368J59833n8422j49028k5829j8592O3023N4122q112j0586q4701r7109
$$ plain form
21875 -127033 -82710 -47176 -32422 42128 28111 48604 156365 184081 225113 315170 259136
21864 259136 230668 125998 146924 113840 68906 -24602 -192065 -93815 -64809 -10714 -14511
21853 -14511 -27633 -81277 -15715 -78039 -5034 -75260 110872 153660 140655 35497 80408
21842 80408 236142 227358 154731 44351 6300 64875 101887 -52675 2253 98324 32928
21831 32928 -4907 -12179 162374 -37743 -346844 -274912 -156895 -159292 -139593 50173 123988
21820 123988 116508 9163 86754 107678 135852 141376 184772 50419 -125067 -82398 37525
21809 37525 111993 42787 -131845 -238419 -228346 -213387 -134762 -33305 -15355 -47566 29969
21798 29969 -21952 -153053 -108440 -102502 -136911 -161750 -246205 -325930 -293649 -395412 -345724
$$ packed form
21875a27033M4323L5534J4754P4550j4017K0493J07761K7716M1032R0057n6034
21864B59136k8468j04670K0926l3084m4934r3508j67463R8250K9006N4095l797
21853a4511j3122n3644O5562o2324P3005p0226J86132M2788j3005j05158M4911
21842H0408J55734q784p2627j10380l8051N8575L7012j54562N4928R6071o5396
21831C2928l7835p272J74553k00117l09101P1932J18017k397J9699J89766P3815
21820A23988p480j07345P7591K0924K8174N524M3396j34353j75486M2669J19923
21809C7525P4468o9206j74632j06574J0073J4959P8625J01457J7950l2211P7535
21798B9969n1921j31101M4613N938l4409k4839q4455p9725L2281j01763M9688
$$ plain form
21787 -345724 -298841 -222936 -29274 -65587 -108848 -88640 -5868 -62 -37274 -164968 -279281
21776 -279281 -317910 -355090 -446748 -459041 -414454 -287952 -159642 -179674 -195694 -110627 -112448
21765 -112448 63164 155999 161160 62877 -57659 8091 30347 -56111 -15695 -21332 -6870
21754 -6870 -128854 -159060 -73818 23707 69482 -12426 -55843 -147457 -54290 -160829 -184407
21743 -184407 -6792 112899 266820 244756 124594 -68002 -120207 -27598 -137765 -194662
21733 -194662 -183412 -65236 -122914 -219702 -211713 -9970 112493 123419 179108 93638 43950
21722 43950 -114665 -253047 -140678 -155043 -167248 -218084 -204112 -138555 -157854 -54448 14773
21711 14773 -328395 -425771 -305091 -158667 -119707 -46304 -15479 127849 -48678 -7295 125154
$$ packed form
21787c45724M6883P5905J93662l6313m3261K0208Q2772N806l7212j27694j14313
21776b79281l8629l7180r1658j2293M4587J26502J28310k0032j6020Q5067j821
21765a12448J75612R2835N161r8283j20536O5750K2256q6458M0416n637J4462
21754f870j21984l0206Q5242R7525M5775q1908m3417r1614R3167j06539k3578
21743a84407J77615J19691J53921k2064j20162j92596n2205R2609j10167n6897
21733a94662J1250J18176n7678r6788P989K01743J22463J0926N5689q5470m9688
21722D3950j58615j38382J12369j4365j2205n0836J3972O5557j9299J03406O9221
21711A4773l43168r7376J20680J46424L8960P3403L0825J43328j76527M1383J32449
$$ plain form
21700 125154 192490 103284 39969 -31997 -160778 -144936 -102827 -99290 -170906 -303074 -269403
21689 -269403 -203904 -220095 -88677 26871 141709 89190 -18903 -2104 54266 94166 -26494
21678 -26494 -43988 -97145 60533 191526 41707 -115705 -157271 -149332 16546 54616 170997
21667 170997 107566 46829 -16430 -122503 -234167 -262507 -214940 -130465 -135169 -223932 -243111
21656 -243111 -151154 -14000 107103 209881 137003 74587 -74587 -138922 -119004 -62575 32428
21645 32428 29175 18310 90171 -34640 -93810 -80887 -67749 -82987 -10104 -13792 -32295 -122678
21633 -122678 -207390 -117577 1058 36254 70169 76501 100348 171328 69939 82609 61942
21622 61942 37601 -31170 44032 96131 59900 144298 188635 223805 179694 181523 196312 124573
$$ packed form
21700A25154O7336q9206o3315p1966j28781J5842M2109L537p1616j32168L3671
21689b69403O5499j6191J31418J15548J14838n2519j08093J6799N6370L9900j20660
21678b6494j7494n3157J57678J30993j49819j57412m1566P939J65878L8070J16381
21667A70997o3431o0737o3259j06073j11664k8340M7567Q4475m704q8763j9179
21656b43111R1957J37154J21103J02778p2878o2416j49174o4335J9918N6429R5003
21645C2428l253j0865P1861j24811n9170J2923J3138j5238P2883l688j8503r0383
21633a22678q4712Q9813J18635L5196L3915O332K3847P0980j01389J2670k0667
21622F1942k4341o8771P5202N2099l6231Q4398M4337L5170m4111J829J4789p1739
$$ plain form
21610 124573 96636 -28327 -140926 -49225 -52561 -161669 -92559 -58183 -108177 -107732 -107870 -23240
21598 -23240 38525 7274 -93795 11687 -49046 -13259 -7562 -52435 -87586 -165464 -39033
21587 -39033 12296 -76074 -215614 -246602 -168370 -156813 -161304 -136033 -151096 -215250 -164195 -76417
21575 -76417 -153086 -278167 -261602 -124861 -51983 -51652 19115 -13210 -44757 -83617 -178962 -219673
21563 -219673 -120322 -6137 -35456 -112614 -127630 -11953 83710 79725 7622 27665 8969
21552 8969 -102948 -24332 49983 67091 69908 -42344 -36016 -70269 -163894 -235247 -226509 -173975
21540 -173975 -74209 -17720 15474 40249 63425 62168 97425 66725 -65779 -162704 -99373
21529 -99373 -13128 69168 -51360 -81927 48911 105843 228107 214648 97498 115080 -15705
$$ packed form
21610A24573k7937j24963j12599R1701l336j09108O9110L4376m9994M45j38Q4630
21598b3240O1765l1251j01069J05482o0733L5787N697m4873l5151p7878J26431
21587c9033N1329q8370j39540l0988P8232J1557m491K5271j5063o4154N1055Q7778
21575g6417p6669j25081J6565J36741P2878L31P0767l2325l1547l8860r5345m0711
21563b19673R9351J14185k9319p7158j5016J15677R5663l985p2103K0043j8696
21552H969j11917P8616P4315J7108K817j12252O328l4253r3625p1353Q738N2534
21540a73975R9766N6489L3194K4775K3176j257L5257l0700j32504r6925O3331
21529i9373Q6245Q2296j20528l0567J30838N6932J22264j3459j17150J7582j30785
$$ plain form
21518 -15705 -58168 -14504 5165 68174 146554 127571 87296 84217 59976 7571 -28680 -57793
21506 -57793 56782 162170 187047 151102 10853 -70786 -78151 -76716 -40164 -205781 -213804
21495 -213804 -125760 -103719 -172637 -173215 -73690 -22657 -56202 -72692 -74814 80150 166419 201590
21483 201590 268282 222228 196211 112437 141045 7322 -13278 79674 40810 -45785 70488
21472 70488 102275 -79269 -85202 4753 77590 81820 -1846 -17788 -103352 -54853 -1171 -161538
21460 -161538 -176698 -33294 -15746 5451 127527 233806 175554 211356 165875 85558 95001
21449 95001 -8182 -140465 -218241 -166347 -118510 -95807 -61648 8402 -94111 -139037 -145045
21438 -145045 -159209 -106823 -40238 81931 -19496 -79915 -31435 -40897 -47057 -44984 7108 -25787
$$ packed form
21518a5705m2463M3664J9669O3009P8380j8983m0275l079k4241n2405l6251k9113
21506e7793J14575J05388K4877l5945j40249q1639p365J435L6552j65617q023
21495b13804Q8044K2041o8918n78R9525N1033l3545j6490k122J54964Q6269L5171
21483B01590O6692m6054k6017q3774K8608j33723k0600R2952l8864q6595J16273
21472G0488L1787j81544n933Q9955P2837M230q3666j5942q5564M8499N3682j60367
21460a61538j5160J43404J7548K1197J22076J06279n8252L5802m5481q0317R443
21449I5001j03183j32283p7776N1894M7837K2703L4159P0050j02513m4926o008
21438a45045j4164N2386O6585J22169j01427o0419M8480r462o160K073N2092l2895
$$ plain form
21426 -25787 -10706 -58877 -71278 -109280 -135814 -211244 -151685 -251200 -192611 -164634 -194364 -5133
21414 -5133 72707 171508 143402 80464 -84202 -222218 -223927 -201145 -124930 -34306 41076 34592
21402 34592 121066 154031 136085 105506 16942 77208 147262 201102 344786 312552 152059
21391 152059 -63653 -184575 -207452 -103484 -35547 -146367 -69818 -11270 -142582 -87622
21381 -87622 -43620 35462 74209 38730 7807 -69022 38429 46550 -13190 -59881 -16716 -27130
21369 -27130 -226033 -277787 -344775 -308849 -386440 -288325 -132538 -35678 -18739 -91923 -183808
21358 -183808 -230322 -115376 -16920 -25869 -29818 -134266 -148620 -153345 -176471 -225444 -191678 -178131
21346 -178131 -212193 -88569 -37067 57959 52548 2868 -28056 13816 -28415 60595 80564
$$ packed form
21426b5787J5081m8171j2401l8002k6534p5430N9559r9515N8589K7977k9730J89231
21414e133P7840R8801k8106o2938j64666j38016j709K2782P6215R0624P5382o484
21402C4592Q6474L2965j7946l0579q8564O0266P0054N3840J43684l2234j60493
21391A52059k15712j20922k2877J03968O7937j10820P6549N8548j31312N4960
21381h7622M4002P9082L8747l5479l0923p6829J07451Q121n9740m6691M3165j0414
21369b7130j98903n1754o6988L5926p7591R8115J55787R6860J6939p3184r1885
21358a83808m6514J14946R8456q949l949j04448j4354m725k3126m8973L3766J3547
21346a78131l4062J23624N1502R5026n411m9680l0924M1872m2231Q9010J9969
$$ plain form
21335 80564 18387 -28574 -171233 -328651 -197646 -9506 -35039 -84862 -100876 -89665 -127331
21324 -127331 -184430 -143067 -56932 91931 136914 39759 -50553 -185650 -127176 -106800 -128377
21313 -128377 -230564 -230225 -193827 -208486 -187336 -144209 -63723 49193 -26611 -124012 -80444
21302 -80444 1710 -16158 -125388 -30058 49121 -27448 -76107 6072 -73924 -149498 -199601
21291 -199601 -204746 -314183 -343373 -141878 48351 14273 -22044 100202 88750 -82558 -65376
21280 -65376 13549 114728 9778 -28517 -60679 -15485 13658 71299 -29149 -52910 -6489
21269 -6489 -8608 -34349 7903 -81973 -122426 -222573 -190435 -212814 -274133 -155025 -77824 -178852
21257 -178852 -273229 -254815 -219050 -228404 -99155 28929 23989 212305 92457 -84617 19344
$$ packed form
21335H0564o2177m6961j42659j57418J31005J88140k5533m9823j6014J1211l7666
21324a27331n7099M1363Q6135J48863M4983r7155r0312j35097N8474K0376k1577
21313a28377j02187L39L6398j4659K1150M3127Q0486J12916p5804r7401M3568
21302h0444Q2154j7868j09230R5330P9179p6569m8659Q2179p9996p5574n0103
21291a99601n145j09437k9190K01495J90229l4078l6317J22246j1452j71308J7182
21280f5376P8925J01179j04950l8295l2162M5194K9143N7641j00448k3761M6421
21269f489k119k5741M2252q9876m0453j00147L2138k2379o1319J19108P7201j01028
21257a78852r4377J8414L5765r354J29249J28084m940J88316j19848j77074J03961
$$ plain form
21246 19344 105327 26427 62358 -102938 -189115 -121010 -35299 -36564 -64742 22956 -8804 -111505
21234 -111505 -57198 88199 104237 33144 92704 -14608 3250 32817 107645 23442 -164533
21223 -164533 -259010 -176535 -201910 -226961 -257142 -97384 -51313 -45800 56496 59652 55353 -24583
21211 -24583 -166820 -271457 -139688 -58409 -86012 -83537 -112991 -195089 -202201 -143002 -60060
21200 -60060 -2413 31237 79500 142443 185288 97029 175180 131181 140254 21936 -74188 -40540
21188 -40540 29197 54979 85344 48107 -3434 -80724 -26100 18835 79480 16303 -131806
21177 -131806 -135866 -16610 -41455 -72789 -136093 -62889 4898 23590 -63173 -169785 -186883
21166 -186883 -111940 -94088 -132744 -133803 -125136 -59420 24668 -1595 -88861 -44023 -73530 -2661
$$ packed form
21246A9344Q5983p8900L5931j65296q6177O8105Q5711j265k8178Q7698l1760j02701
21234a11505N4307J45397J6038p1093N9560j07312J7858K9567P4828q4203j87975
21223a64533r4477Q2475k5375k5051l0181J59758M6071N513J02296L156m299p9936
21211b4583j42237j04637J31769Q1279k7603K475k9454q2098p112N9199Q2942
21200f0060N7647L3650M8263O2943M2845q8259P8151m3999R073j18318r6124L3648
21188d0540O9737K5782L0365l7237n1541p7290N4624M4935O0645o3177j48109
21177a31806m060J19256k4845l1334o3304P3204O7787J8692q6763j06612j7098
21166a86883P4943J7852l8656j059Q667O5716Q4088k6263q7266M4838k9507P0869
$$ plain form
21154 -2661 -34472 -151363 -166512 -156785 -211146 -184607 -133437 21433 139171 242484 155065
21143 155065 -16436 -103316 -131890 -56649 -23101 67741 -30076 -22956 90366 104382 101391
21132 101391 135262 149103 221740 271273 133805 112332 117795 167951 76208 134443 125098 92685
21120 92685 -42823 -2179 175505 352691 360214 285579 279488 247082 217313 160016 96628
21109 96628 -16407 -121506 -7147 102019 109921 201482 259989 185298 73676 119406 151881
21098 151881 216631 377506 287523 136873 32252 -45656 -124697 -95213 9030 -37021 -53664
21087 -53664 8155 119271 6746 72228 161083 203634 -13919 -110777 112676 330121 320569
21076 320569 282355 152243 123242 219582 205571 258651 262478 223035 299452 297591 149791
$$ packed form
21154b661l1811j16891j5149R727n4361K6539N1170J54870J17738J03313q7419
21143A55065j71501q6880k8574P5241L3548R0842r7817P120J13322J4016k991
21132A01391L3871J3841P2637M9533j37468k1473N463N0156r1743N8235r345l2413
21120I2685j35508M0644J77684J77186P523p4635o091l2406k9769n7297o3388
21109I6628j13035j05099J14359J09166P902R1561N8507p4691j11622M5730L2475
21098A51881O4750J60875q9983j50650j04621p7908p9041K9484J04243m6051j6643
21087e3664O1819J11116j12525O5482Q8855M2551k17553r6858K23453K17445r552
21076C20569l8214j30112k9001R6340j4011N3080L827l9443P6417j861j47800
$$ plain form
21065 149791 -106402 -93116 -101065 -50847 45760 41516 -103364 -283979 -131470 -10840 45164
21054 45164 118585 69634 -105302 -250239 -174347 -151125 -65040 146625 284938 166340 -6733
21043 -6733 104323 124595 90562 139509 192053 154205 75938 -55153 -130518 -13122 84275
21032 84275 185077 62151 -3991 126338 108660 88067 -9921 16982 -32048 -24983 13954
21021 13954 10595 -45950 -228645 -271969 -294497 -268782 -423873 -370258 -174471 -214509 -163421
21010 -163421 -104333 -185960 -79404 11619 14611 -2316 -3496 -97346 -275907 -222162 -170314
20999 -170314 -64228 63735 -57129 -156723 -92185 -114713 -62267 -75585 -105940 -50542 -19843
20988 -19843 186787 261620 199382 94396 24070 84544 247611 304461 261066 182021 154416
$$ packed form
21065A49791k56193J3286p949N0218R6607m244j44880j80615J52509J20630N6004
21054D5164P3421m8951j74936j44937P5892K3222Q6085K11665J38313j18598j73073
21043f733J11056K0272l4033M8947N2544l7848p8267j31091p5365J17396R7397
21032H4275J00802j22926o6142J30329j7678k0593r7988K6903m9030P065L8937
21021A3954l359n6545j82695m3324k2528K5715j55091N3615J95787m0038N1088
21010a63421N9088q1627J06556R1023K992j6927j180r3850j78561N3745N1848
20999a70314J06086J27963j20864r9594O4538k2528N2446j3318l0355N5398L0699
20988a9843K06630P4833o2238j04986p0326O0474J63067N6850m3395p9045k7605
$$ plain form
20977 154416 156497 96594 24760 90970 22572 37671 76966 -23715 -120972 -90416 -25457
20966 -25457 -55979 10369 62049 161663 145220 24696 60300 209860 235960 275505 291647
20955 291647 104784 51045 18707 -63659 -10369 19739 50801 -71340 -22150 66088 -21395
20944 -21395 -46954 13652 20970 -22678 40402 -32797 -75335 -2457 -20383 -68853 52074 165768
20932 165768 144829 110852 -17635 -63794 -122837 -170125 -213242 -160858 -135527 -163005 -58172
20921 -58172 -69507 -145692 -72920 1772 43284 90183 -27525 -45709 9678 37163 128558
20910 128558 135847 142234 269511 197740 130129 56292 117850 129323 85462 -104590 -163553
20899 -163553 -115435 -44079 -37044 -127465 -147305 -197472 -206340 -258658 -261086 -235653 -181400 -67663
$$ packed form
20977A54416K081n9903p1834O6210o8398J5099L9295j00681r7257L0556O4959
20966b5457l0522O6348N1680R9614j6443j20524L5604J49560K6100L9545J6142
20955B91647j86863n3739l2338q2366N3290L0108L1062j22141M9190Q8238q7483
20944b1395k5559O0606P318m3648O3080p3199m2538P2878j7926m8470J20927J13694
20932A65768k0939l3977j28487m6159n9043m7288m3117N2384K5331k7478J04833
20921e8172j1335p6185P2772P4692M1512M6899j17708j8184N5387K7485R1395
20910A28558P289O387J27277p1771o7611p3837O1558J1473m3861j90052n8963
20899a63553M8118P1356P035r0421j9840n0167q868n2318k428K5433N4253J13737
$$ plain form
20887 -67663 10544 4830 -140389 -129564 -51699 -76228 -8287 -92270 -162833 -137379 -50175 -75956
20875 -75956 -72630 -91292 -100650 -6889 98456 127073 37334 20129 -90200 -168428 -70320 60099
20863 60099 70118 66012 -864 -78050 -46865 -34621 -113585 -152810 -126248 -191496 -108367 -100538
20851 -100538 2140 116432 64200 -135439 -345152 -383030 -269844 -252227 -292032 -283654 -201369
20840 -201369 -255044 -311957 -329867 -140152 -39010 -26787 -30666 -61831 -180169 -134057 83635
20829 83635 173099 72045 -53864 -110429 -195916 -270199 -180717 -100887 -18287 -101266 -123977
20818 -123977 -95293 -21 -62866 -80596 76854 116549 62687 40181 56943 -148183 -181865
20807 -181865 -77991 87358 59593 -52574 -131528 -221723 -163288 -80841 -7364 3080 -109504
$$ packed form
20887f7663P8207n714j45219J0825P7865k4529O7941q3983p0563K5454Q7204k5781
20875g5956L326j8662r358R3761J05345K8617q9739j7205j10329p8228R8108J30419
20863F0099J0019m106o6876p7186L1185J2244p8964l9225K6562o5248Q3129P829
20851a00538J02678J14292n2232j99639k09713l7878J13186J7617l9805Q378Q2285
20840b01369n3675n6913j7910J89715J01142J2223l879l1165j18338M6112K17692
20829H3635Q9464j01054j25909n6565q5487p4283Q9482P9830Q2600q2979k2711
20818a23977K8684R5272o2845j7730J57450L9695n3862k2506J6762k05126l3682
20807a81865J03874J65349k7765j12167p8954r0195N8435Q2447P3477J0444j12584
$$ plain form
20796 -109504 -92363 -59055 33404 56306 81526 62155 47454 -1954 -42860 -34625 -8003 -5973
20784 -5973 -28007 -49965 -144200 -283446 -208111 -117449 -79464 5854 206004 202479 112642 29750
20772 29750 -41708 22676 -34492 -111905 -56742 -65063 -53052 -86832 -114924 -142293 -6184 51983
20760 51983 9783 -80779 -199778 -32535 36786 -79074 -1979 118200 42892 -84918 -138150
20749 -138150 -73989 -130490 -108736 -18079 1059 64834 157786 156306 22353 58610 213795
20738 213795 332642 393409 278481 164385 189932 117077 232690 227486 208978 253164 233549
20727 233549 113826 30835 50639 -12878 -74250 -88453 -143559 -175707 -196701 -310298 -315326
20716 -315326 -205496 -127159 -69309 -174283 -161748 -2535 44662 17300 123156 27052 -92858
$$ packed form
20796a09504J7141L3308R2459K2902K5220j9371j4701m9408m0906Q235K6622K030
20784e973k2034k1958r4235j39246P5335R0662L7985Q5318K00150l525q9837q2892
20772B9750p1458O4384n7168p7413N5163q321J2011l3780k8092k7369J36109N8167
20760E1983m2200r0562j18999J67243O9321j15860P7095J20179p5308j27810n3232
20749a38150O4161n6501K1754R0657J9138O3775R2952j480j33953L6257J55185
20738B13795J18847O0767j14928j14096K5547p2855J15613n204j8508M4186j9615
20727B33549j19723q2991J9804o3517o1372j4203n5106l2148k0994j13597n028
20716c15326J09830P8337N7850j04974J2535J59213M7197k7362J05856r6104j19910
$$ plain form
20705 -92858 -86395 -39941 89551 146194 -11725 -50116 33146 71014 -16502 -3069 115453
20694 115453 121244 103356 9183 12000 -957 49209 5812 5739 17271 -39419 -118535 -68121
20682 -68121 14074 -27929 -50477 34767 99848 -28643 -118380 -73069 -24977 -80854 -62074
20671 -62074 65763 136945 161134 143550 159266 214428 272870 233804 120921 56399 38666
20660 38666 -52483 -5530 -23143 -18583 19512 -2490 66432 95656 63487 84753 195625 133513
20648 133513 48274 47793 200371 282833 57239 -180401 -128117 -6440 78199 98820 99226
20637 99226 155268 163279 13473 60946 44538 -39255 -148597 -145379 -167562 -85570 -43250 35521
20625 35521 -34696 -46224 -170148 -160105 -121807 -13570 126165 146134 92055 -89734 -163935
$$ packed form
20705i2858O463M6454J29492N6643j57919l8391Q3262L7868q7516J3433J18522
20694A15453N791j7888r4173K817j2957N0166m3397p3J1532n6690p9116N0414
20682f8121Q2195m2003k2548Q5244O5081j28491q9737M5311M8092n5877J8780
20671f2074J27837P1182K4189j7584J5716N5162N8442l9066j12883o4522j7733
20660C8666r1149M6953j7613M560L8095k2002O8922K9224l2169K1266J10872o2112
20648A33513q5239m81J52578Q2462k25594k37640N2284J21677Q4639K0621M06
20637I9226N6042Q011j49806M7473j6408q3793j09342L218k2183Q1992M2320P8771
20625C5521p0217j1528j23924J0043L8298J08237J39735J9969n4079j81789p4201
$$ plain form
20614 -163935 -149919 -54701 -55075 -54916 49109 -11101 -35736 -56958 63261 -29293 -165255 -117103
20602 -117103 97991 2929 -35167 -13921 26662 76863 54404 73094 73995 131047 148623 137371
20590 137371 133900 30092 73180 45322 18006 29526 162 -106404 -164175 -91073 -107576
20579 -107576 -132631 -177748 -159921 -113146 -84468 113348 98834 -20088 78378 69915 -54276
20568 -54276 -119528 8147 -15072 -22202 -35273 -26784 -45808 -67160 -3563 60864 -18791 -50528
20556 -50528 -88133 -29251 159997 313423 317006 134079 -92405 -144530 29165 197893 137154
20545 137154 -17069 -103807 -164996 -146588 -52901 4737 -12653 -77579 -57888 -50167 -130874
20534 -130874 -125775 -134043 -178668 -46989 6471 -62510 -208696 -203460 -144527 -39354 147174
$$ packed form
20614a63935J4016R5218l74J59J04025o0210k4635k1222J20219r2554j35962M8152
20602a17103K15094r5062l8096K1246M0583N0201k2459J8690R01N7052J7576j1252
20590A37371l471j03808M3088k7858k7316J1520k9364j06566n7771P3102j6503
20579a07576k5055m5117J7827M6775K8678J97816j4514j18922R8466q463j24191
20568e4276o5252J27675k3219p130j3071Q489j9024k1352O3597O4427p9655l1737
20556e0528l7605N8882J89248J53426L583j82927k26484n2125J73695J68728o0739
20545A37154j54223q6738o1189J8408R3687N7638j7390o4926J9691P721q0707
20534a30874N099q268m4625J31679N3460o8981j46186N236N8933J05173J86528
$$ plain form
20523 147174 169927 32552 26219 211492 242708 129514 73777 -25948 -181563 -234631 -129709
20512 -129709 -155508 -40081 97540 24529 32430 -5407 19972 59629 119281 226808 300327
20501 300327 336551 283030 167548 115715 49689 125364 202621 258197 106221 -11813 90076
20490 90076 131547 98203 -13868 -108959 -71700 -93514 9511 -16996 24580 133829 99526
20479 99526 89350 265838 253464 213344 101539 135458 236182 287162 319964 349808 275883
20468 275883 190385 187774 142256 125234 42340 64554 231063 273278 277314 167996 215529
20457 215529 170222 170264 79086 -122959 -184652 -123542 26266 80441 100502 136964 249394
20446 249394 270220 128889 88558 171975 134671 52274 137939 188199 67033 96451 175190
$$ packed form
20523A47174K2753j37375o333J85273L1216j13194n5737r9725j55615n3068J04922
20512a29709k5799J15427J37621p3011P901l7837K5379L9657N9652J07527P3519
20501C00327L6224n3521j15482n1833o6026P5675P7257N5576j51976j18034J01889
20490I0076M1471l3344j12071r5091L7259k1814J03025k6507M1576J09249l4303
20479I9526j0176J76488j2374m0120j11805L3919J00724N0980L2802K9844p3925
20468B75883q5498k611m5518j7022q2894K2214J66509M2215M036j09318M7533
20457B15529m5307M2r1178k02045o1693O1110J49808N4175K0061L6462J12430
20446B49394K0826j41331m0331Q3417l7304q2397Q5665N0260j21166K9418P8739
$$ plain form
20435 175190 139619 96254 155763 174677 -16431 -31514 -11659 44970 119891 105545 44598
20424 44598 134496 243245 179256 19940 1845 93898 122742 136366 158333 48569 -341
20413 -341 95034 -16983 -18119 -15798 -27005 -32238 -65898 -12155 45759 -73498 -216349 -197058
20401 -197058 -101324 -74590 -22384 -70742 -141695 -42668 -112209 -170000 -122859 -161405 -124545
20390 -124545 -72496 -160681 -218447 -118377 9129 15051 -36233 -67125 -100733 -29076 -28429 -81132
20378 -81132 -193798 -187327 -77576 37618 14057 75714 89305 22667 6802 7882 -15011
20367 -15011 -95031 -26926 89375 22012 -26338 59911 -19020 -75373 7457 -7372 -86294
20356 -86294 -13936 62643 158637 140493 52843 -82991 -119791 -55266 69610 118650 116317
$$ packed form
20435A75190l5571m3365N9509J8914j91108j5083J9855N6629P4921j4346o0947
20424D4598Q9898J08749o3989j59316j8095R2053K8844J3624K1967j09764m8910
20413c41R5375j12017j136K321j1207n233l3660N3743N7914j19257j42851J9291
20401a97058R5734K6734N2206m8358p0953R9027o9541n7791M7141l8546L6860
20390a24545N2049q8185n7766J00070J27506N922n1284l0892l3608P1657O47n2703
20378h1132j12666O471J09751J15194k3561O1657J3591o6638j5865J080k2893
20367a5011q0020O8105J16301o7363m8350Q6249p8931n6353Q2830j4829p8922
20356h6294P2358P6579R5994j8144q7650j35834l6800O4525J24876M9040k333
$$ plain form
20345 116317 186751 247199 181250 167956 290385 205083 140733 462 -193995 -143556 -141248
20334 -141248 34979 144740 169452 233746 126443 -9880 -7423 74952 93847 66645 31062
20323 31062 60672 70192 14356 114756 148490 140934 189159 166302 -28615 -188654 -50223
20312 -50223 127809 178792 128965 238415 271308 250002 69280 -60523 -48013 -44440 43643
20301 43643 181541 166510 131830 100204 57174 2887 107813 217067 194682 119000 36804
20290 36804 224780 274236 168419 127759 151387 196336 180711 162317 56193 -41121 93022
20279 93022 168510 -797 -34614 19772 24811 -34958 12493 163539 266656 375089 323244
20268 323244 297969 275990 239574 105008 124416 258706 347817 201598 102634 165248 281963
$$ packed form
20345A16317P0434O0448o5949j3294J22429q5302o4350j40271j94457N0439K308
20334a41248J76227J09761K4712O4294j07303j36323K457Q2375J8895k7202l5583
20323C1062K9610R520n5836J00400L3734p556M8225k2857j94917j60039J38431
20312e0223J78032N0983m9827J09450L2893k1306j80722j29803J2510L573Q8083
20301D3643J37898j5031l4680l1626m3030n4287J04926J09254k2385p5682q2196
20290C6804J87976M9456j05817m0660K3628M4949j5625j8394j06124r7314J34143
20279I3022P5488j69307l3817N4386N039n9769M7451J51046J03117J08433n1845
20268C23244k5275k1979l6416j34566J9408J34290Q9111j46219r8964O2614J16715
$$ plain form
20257 281963 261050 85091 155333 162350 36603 -59515 -216949 -152841 -173075 -87739 31546
20246 31546 72231 45840 50614 80027 -1524 -81774 -51778 22338 14221 81939 111281 218483
20234 218483 284162 257777 219537 170261 179056 156821 168612 158060 154890 114140 -3090 41685
20222 41685 58752 40139 -13770 -50431 -77915 -107324 136127 179504 240890 332209 298522
20211 298522 238149 -6054 -89024 70917 76819 -51545 5086 51066 62405 118087 155231
20200 155231 138232 267708 369132 246379 107927 32362 40747 118574 223608 241994 12046
20189 12046 -61361 23731 4615 -66739 -118546 -35202 66349 111835 99893 55520 18885
20178 18885 -53478 -122456 -201910 -162989 -67976 -27712 74736 1135 -21643 92279 166953
$$ packed form
20257B81963k0913j75959P0242P017j25747r6118j57434O4108k0234Q5336J19285
20246C1546M0685k6391M774K9413q1551q0250K9996P4116q117O7718K9342J07202
20234B18483O5679k6385l8240m9276Q795k2235J1791j0552l170m0750j17230M4775
20222D1685J7067j8613n3909l6661k7484k9409K43451M3377O1386R1319l3687
20211B98522o0373k44203q2970J59941N902j28364N6631M5980J1339N5682L7144
20200A55231j6999J29476J01424j22753j38452p5565Q385P7827J05034J8386k29948
20189A2046p3407Q5092j9116p1354n1807Q3344J01551M5486j1942m4373l6635
20178A8885p2363o8978p9454L8921R5013M0264J02448p3601k2778J13922P4674
$$ plain form
20167 166953 350417 329694 154498 -1772 135783 281160 177275 126632 258018 435476
20157 435476 448686 287771 216573 231198 228684 182119 191206 170607 127669 181053 202436 246598
20145 246598 249119 301282 267599 148594 20989 -43440 -194206 -167942 -147471 -168975 -154651
20134 -154651 -76434 39192 80025 42408 46787 146942 195430 177543 310472 410563 411513
20123 411513 368865 260856 132846 -26168 143258 173706 195373 206999 146620 128667 12082
20112 12082 53183 129925 77544 165278 247818 205261 97860 122352 219437 174199 109669
20101 109669 98712 181835 188529 141921 97223 33510 47183 32566 88495 288909 269669
20090 269669 238643 163555 76213 72280 54928 64078 142920 170950 200314 252705 314678 385640
$$ packed form
20167A66953J83464k0723j75196j56270J37555J45377j03885n0643J31386J77458
20157D35476J3210j60915p1198J4625k514m6565R087k0599m2938N3384K1383M4162
20145B46598K521N2163l3683j19005j27605o4429j50766K6264K0471k1504J4324
20134a54651P8217J15626M0833l7617M379J00155M8488j7887J32929J00091R50
20123D11513m2648j08009j28010j59014J69426L0448K1667J1626o0379j7953j16585
20112A2082M1101P6742n2381Q7734Q2540m2557j07401K4492R7085m5238o4530
20101A09669j0957Q3123O694m6608m4698o3713J3673j4617N5929K00414j9240
20090B69669l1026p5088q7342l933j7352R150P8842K8030K9364N2391O1973P0962
$$ plain form
20078 385640 326061 300788 355330 60727 29853 48519 177302 251502 159616 80404 -13428
20067 -13428 -97198 124098 195193 220941 176127 7639 7279 119349 198191 314386 239939
20056 239939 187313 143134 111108 199298 162917 194775 242188 180261 177038 230074 245169 221443
20044 221443 295463 257262 168545 149148 204115 204853 334704 336884 160171 159308 104070 58185
20032 58185 188907 228156 165287 220045 251830 347771 352508 436693 464981 371089 303830 227268
20020 227268 164245 212493 167847 218755 297790 164853 101332 79049 48956 44625 33473
20009 33473 8685 69342 112264 101513 -41611 28787 150984 111255 102716 229030 235012
19998 235012 186748 175643 323873 437370 331748 171415 135670 124133 213347 239771 182822
$$ packed form
20078C85640n9579k5273N4542k94603l0874J8666J28783P4200r1886p9212r3832
20067a3428q3770K21296P1095K5748m4814j68488l60J12070P8842J16195p4447
20056B39939n2626m4179l2026Q8190l6381L1858M7413o1927l223N3036J5095k3726
20044B21443P4020l8201q8717j9397N4967P38J29851K180j76713q63n5238m5885
20032E8185J30722L9249o2869N4758L1785R5941M737Q4185K8288r3892o7259p6562
20020B27268o3023M8248m4646N0908P9035j32937o3521k2283l0093m331j1152
20009C3473k4788O0657M2922j0751j43124P0398J22197l9729q539J26314N982
19998B35012m8264j1105J48230J13497j05622j60333l5745j1537Q9214K6424n6949
$$ plain form
19987 182822 193610 201997 256310 263894 201484 134272 210385 317641 375927 357494 288809 252645
19975 252645 252792 270499 294155 217649 190285 87379 184691 324236 311677 228096 356919
19964 356919 390407 287847 267880 256110 324601 327050 253228 107477 159452 285566 364419
19953 364419 350704 206530 213103 349792 513343 605614 502983 405107 392874 294334 240564
19942 240564 210135 115122 203781 359595 519245 509068 515533 550147 582073 615535 516871
19931 516871 490449 438500 349759 310956 439233 558026 647638 588509 459128 253313 215158
19920 215158 433134 537232 587043 568903 511716 398047 392396 380399 346340 442118 445356
19909 445356 360779 404247 353857 335077 205289 197084 224653 340630 495020 590252 489739
$$ packed form
19987A82822J0788Q387N4313P584o2410o7212P6113J07256N8286j8433o8685l6164
19975B52645J47J7707K3656p6506k7364j02906R7312J39545j2559q3581J28823
19964C56919L3488j02560j9967j1770O8491K449p3822j45751N1975J26114P8853
19953C64419j3715j44174O573J36689J63551R2271j02631r7876j2233r8540n3770
19942B40564l0429r5013Q8659J55814J59650j0177O465L4614L1926L3462r8664
19931E16871k6422n1949q8741l8803J28277J18793Q9612n9129j29381k05815l8155
19920B15158K17976J04098M9811j8140n7187j13669n651j1997l4059R5778L238
19909D45356q4577M3468n0390j8780j29788q205K7569J15977J54390R5232j00513
$$ plain form
19898 489739 537981 514317 422852 440977 497515 476697 548058 501455 514470 617626 700389
19887 700389 761061 586299 487793 530671 494447 570478 606968 660080 742235 628643 587622
19876 587622 617555 641061 659187 683230 818904 876601 764072 622210 635583 674837 608521
19865 608521 454527 384011 510324 613599 524280 665687 685453 589858 662496 735420 732390
19854 732390 613615 784044 865894 1019126 921350 750443 715666 733216 689799 740697 747292
19843 747292 892504 996859 915234 701769 809610 1030557 982509 910234 939401 963594
19833 963594 887432 809127 767797 692394 760400 938675 1030051 1071208 1115427 1050723 970430
19822 970430 1002096 979492 958810 923276 984943 930732 973072 1038691 994744 873028 913604
$$ packed form
19898D89739M8242k3664r1465J8125N6538k0818P1361m6603J3015J03156Q2763
19887G00389O0672j74762r8506M2878l6224P6031L6490N3112Q2155j13592m1021
19876E87622K9933K3506J8126K4043J35674N7697j12529j41862J3373L9254o6316
19865F08521j53994p0516J26313J03275q9319J41407J9766r5595P2638P2924l030
19854G32390j18775J70429Q1850J53232r7776j70907l4777J7550m3417N0898O595
19843G47292J45212J04355q1625k13465J07841K20947m8048p2275K9167K4193
19833I63594p6162p8305m1330p5403O8006J78275R1376M1157M4219o4704q0293
19822I70430L1666k2604k0682l5534O1667n4211M2340O5619m3947j21716M0576
$$ plain form
19811 913604 1029679 928938 894330 976277 997448 1111769 1222069 1212202 1233557 1265854 1328234
19800 1328234 1268202 1206672 1196090 1304776 1339362 1420094 1378420 1250788 1212327 1275942 1303221
19789 1303221 1334423 1297246 1192304 1278673 1446701 1416178 1372537 1430013 1520052 1556344 1494104
19778 1494104 1427875 1508394 1621825 1513373 1511125 1560292 1543907 1585715 1612678 1700425 1700280
19767 1700280 1621808 1589807 1629071 1655706 1835835 1966766 1973408 1783715 1682059 1722357 1764106
19756 1764106 1830368 1781410 1783526 1744612 1833468 2078635 2156833 2191608 2310223 2348271 2319011
19745 2319011 2285277 2266801 2308001 2257481 2309718 2431274 2520052 2482901 2449521 2532839 2543309
19734 2543309 2574712 2612379 2761229 2778561 2681418 2678544 2737361 2723699 2863682 2911205 2917765
$$ packed form
19811I13604J16075j00741l4608Q1947K1171J14321J10300r867K1355L2297O2380
19800A328234o0032o1530j0582J08686L4586Q0732m1674j27632l8461O3615K7279
19789A303221L1202l7177j04942Q6369J68028l0523m3641N7476R0039L6292o2240
19778A494104o6229Q0519J13431j08452k248M9167j6385M1808K6963Q7747j45
19767A700280p8472l2001L9264K6635J80129J30931O642j89693j01656M0298M1749
19756A764106O6262m8958K116l8914Q8856K45167P8198L4775J18615L8048k9260
19745B319011l3734j8476M1200n0520N2237J21556Q8778l7151l3380Q3318J0470
19734B543309L1403L7667J48850J7332r7143k874N8817j3662J39983M7523O560
$$ plain form
19723 2917765 2909019 2939743 2958703 2994322 3128303 3293752 3363825 3507710 3547346 3510809 3314816
19712 3314816 3276972 3359222 3438928 3603345 3670329 3597069 3539361 3599392 3775801 3987617 4245058
19701 4245058 4270105 4287425 4446491 4543842 4552003 4593752 4657584 4814320 4914924 5087793 5123374
19690 5123374 5137335 5267547 5469812 5523681 5562623 5739204 5786565 5822633 6023931 6175267
19680 6175267 6385449 6527341 6609575 6771144 6730793 6899370 7138800 7363648 7453423 7512058
19670 7512058 7622184 7740559 7871360 8103327 8496830 8818314 8981204 9164493 9428567
19661 9428567 9604980 9835004 10089452 10428140 10724853 10879415 11146350 11453702 11717911
19652 11717911 12050435 12446192 12803911 13239434 13724924 14055008 14373462 14809556 15313316
$$ packed form
19723B917765q746L0724J8960L5619J33981J65449P0073J43885L9636l6537j95993
19712C314816l7844Q2250P9706J64417O6984p3260n7708O0031J76409K11816K57441
19701D245058K5047J7320J59066R7351Q161M1749O3832J56736J00604J72869L5581
19690E123374J3961J30212K02265N3869L8942J76581M7361L6068K01298J51336
19680F175267K10182J41892Q2234J61569m0351J68577K39430K24848Q9775N8635
19670G512058J10126J18375J30801K31967L93503L21484J62890J83289K64074
19661I428567J76413K30024K54448L38688K96713J54562K66935L07352K64209
19652A1717911L32524L95757L57719M35523M85490L30084L18454M36094N03760
$$ plain form
19643 15313316 15635473 15993890 16507169 16962294 17518794 18080476 18681513 19289120 19740820
19634 19740820 20210338 20794784 21313013 21784273 22419693 23166418 23743640 24429051 25238623
19625 25238623 26054721 26920839 27596641 28430575 29254935 29946691 30744831 31506963 32111130
19616 32111130 32812739 33705729 34395517 35049764 35777488 36488785 37089668 37534591 38044313
19607 38044313 38687446 39307277 39793534 40276824 40451465 40638864 40869096 41025737 40963628
19598 40963628 41028071 40944655 40902149 40739582 40456440 40181432 39890951 39563211 39070026 38615613
19588 38615613 38027914 37426090 36839792 36193519 35550581 34863804 34059261 33366412 32669910
19579 32669910 31819060 31088577 30415605 29594286 28887460 28142562 27436548 26808034 26217528
$$ packed form
19643A5313316L22157L58417N13279M55125N56500N61682O01037O07607M51700
19634A9740820M69518N84446N18229M71260O35420P46725N77222O85411Q09572
19625B5238623Q16098Q66118O75802Q33934Q24360O91756P98140P62132O04167
19616C2111130P01609Q92990O89788O54247P27724P11297O00883M44923N09722
19607C8044313O43133O19831M86257M83290J74641J87399K30232J56641o2109
19598D0963628O4443q3416m2506j62567k83142k75008k90481l27740m93185m54413
19588C8615613n87699o01824n86298o46273o42938o86777q04543o92849o96502
19579C2669910q50850p30483o72972q21319p06826p44898p06014o28514n90506
$$ plain form
19570 26217528 25599367 24895571 24048500 23310311 22833814 22164943 21390421 20783960 20296908
19561 20296908 19823837 19287649 18769073 18330292 17776083 17227543 16888124 16434249 15956273
19552 15956273 15520322 15083533 14634495 14312835 13909217 13410012 13034462 12812725 12589258
19543 12589258 12119176 11725912 11509280 11263007 11041525 10716429 10403940 10365929 10213459
19534 10213459 9822312 9469960 9290581 9074986 8883917 8723208 8435774 8242003 8120268
19525 8120268 7924434 7744268 7580725 7470927 7394140 7318806 7187217 6872175 6640193 6620315
19515 6620315 6580885 6466213 6369597 6402114 6375147 6273767 6326364 6204095 6085653 5955266
19505 5955266 5909688 5822082 5760881 5744769 5753244 5765434 5710144 5572864 5493918 5459289 5361848
$$ packed form
19570B6217528o18161p03796q47071p38189m76497o68871p74522o06461m87052
19561B0296908m73071n36188n18576m38781n54209n48540l39419m53875m77976
19552A5956273m35951m36789m49038l21660m03618m99205l75550k21737k23467
19543A2589258m70082l93264k16632k46273k21482l25096l12489l8011j52470
19534A0213459l91147l52352j79379k15595j91069j60709k87434j93771j21735
19525H120268j95834j80166j63543j09798p6787p5334j31589l15042k31982j9878
19515F620315l9430j14672r6616L2517k6967j01380N2597j22269j18442j30387
19505E955266m5578q7606o1201j6112Q475J2190n5290j37280p8946l4629r7441
$$ plain form
19494 5361848 5127962 5085835 5161880 5081154 4944747 4915667 4867078 4987264 4882376 4513174
19484 4513174 4311916 4302628 4236448 4123319 4017491 3995840 4108471 4003454 3818325 3733049
19474 3733049 3708008 3610278 3580138 3398673 3378974 3326548 3226070 3214173 3317170 3313674 3068841
19463 3068841 2968003 3019745 3006957 2988317 3052177 3198344 3266726 3216710 3130434 2985656 3006873
19452 3006873 2998816 3071776 3220193 3341155 3354574 3289065 3206530 3101309 3019867 2979018 3001756
19441 3001756 2927679 2883361 2841484 2963874 2964739 2875731 2757831 2732958 2592454 2362536 2286318
19430 2286318 2354656 2310990 2158213 2142923 2005966 1950865 1918224 1999519 2153164 2118564 1954351
19419 1954351 1891115 1682117 1532812 1462716 1491216 1575933 1491542 1488004 1537337 1441355 1485774
$$ packed form
19494E361848k33886m2127P6045q0726j36407k9080m8589J20186j04888l69202
19484D513174k01258r288o6180j13129j05828k1651J12631j05017j85129q5276
19474C733049k5041r7730l0140j81465j9699n2426j00478j1897J02997l496k44833
19463C068841j00838N1742j2788j8640O3860J46167O8382n0016q6276j44778K1217
19452C006873q057P2960J48417J20962J3419o5509q2535j05221q1442m0849K2738
19441C001756p4077m4318m1877J22390Q65q9008j17900k4873j40504k29918p6218
19430B286318O8338m3666j52777j5290j36957n5101l2641Q1295J53645l4600j64213
19419A954351o3236k08998j49305p0096K8500Q4717q4391l538M9333r5982M4419
$$ plain form
19408 1485774 1511988 1426309 1512554 1547862 1481233 1624488 1637907 1601758 1452510 1322151 1318884
19397 1318884 1214882 1189811 1508993 1706396 1639406 1642178 1438150 1356880 1409243 1429854 1504870
19386 1504870 1466722 1583902 1682696 1737741 1678656 1754965 1837195 1934252 1746525 1513139 1380253
19375 1380253 1407041 1481402 1488623 1503128 1408040 1395565 1379977 1301121 1320758 1338914 1101687
19364 1101687 1174358 1265922 1271434 1236515 1153362 1080273 1084097 1089984 1174992 1235872 1088523 1096739
19352 1096739 1165869 1258800 1332575 1460719 1425106 1232282 1212120 1200677 1045472 1165362
19342 1165362 1322162 1499471 1459612 1390466 1245613 1230347 1300382 1413747 1374258 1280899
19332 1280899 1288463 1292777 1318720 1459011 1535408 1451852 1417299 1343892 1128447 1106214 1198862
$$ packed form
19408A485774K6214q5679Q6245L5308o6629J43255J3419l6149j49248j30359l267
19397A318884j04002k5071L19182J97403o6990K772k04028q1270N2363K0611P5016
19386A504870l8148J17180R8794N5045n9085P6309Q2230R7057j87727k33386j32886
19375A380253K6788P4361P221J4505r5088j2475j5588p8856J9637J8156k37227
19364A101687P2671R1564N512l4919q3153p3089L824N887Q5008O0880j47349Q216
19352A096739O9130R2931P3775J28144l5613j92824k0162j1443j55205J19890
19342A165362J56800J77309l9859o9146j44853j5266P0035J13365l9489r3359
19332A280899P564M314K5943J40291P6397q3556l4553p3407k15445k2233R2648
$$ plain form
19321 1198862 1265922 1276345 1152024 1083418 975160 937516 913540 867006 857788 919408 901304
19310 901304 780128 676692 731235 738465 687427 685561 788366 893124 832656 704153 759640
19299 759640 788255 792338 714833 620353 701603 750874 730497 778053 788449 803544 804474 850028
19287 850028 815297 688823 765599 770619 664426 603883 727359 717317 593469 634059 785861
19276 785861 783334 716484 654099 684467 501551 553420 686175 676246 675310 637255 841345 914277
19264 914277 766887 521806 504792 580466 618121 578863 551621 584006 559285 562967 702079
19253 702079 799201 770614 708639 753621 836015 972741 1048296 1129417 1181353 1118437 1123201
19242 1123201 1108158 1135080 1129275 1046811 905182 899282 973904 908580 757536 763801 826968
$$ packed form
19321A198862O7060J0423j24321o8606j08258l7644k3976m6534r218O1620j8104
19310I01304j21176j03436N4543P230n1038j866J02805J04758o0468j28503N5487
19299G59640K8615M083p7505r4480Q1250M9271k0377M7556J0396J5095R30M5554
19287H50028l4731j26474P6776N020j06193o0543J23476j0042j23848M0590J51802
19276G85861k527o6850o2385L0368j82916N1869J32755r929r36l8055K04090P2932
19264I14277j47390k45081j7014P5674L7655l9258k7242L2385k4721L682J39112
19253G02079R7122k8587o1975M4982Q2394J36726P5555Q1121N1936o2916M764
19242A123201j5043K6922n805q2464j41629n900P4622o5324j51044O265O3167
$$ plain form
19231 826968 749117 667430 613124 714874 871351 865760 784279 805398 905075 874092 1016363
19220 1016363 1225560 1098392 1030462 953460 911026 901679 748901 662074 669871 700257 774866
19209 774866 668006 699135 751099 815672 904274 978723 926304 936692 970084 966916 958877 1076924
19197 1076924 1123156 1008318 1025668 993403 968793 1084527 1188450 1169555 1243465 1292707 1160762
19186 1160762 1022795 1130054 1214486 1128156 1092081 1190045 1245236 1231448 1170967 1221040 1451104
19175 1451104 1554621 1466594 1445172 1255393 1107869 1275582 1384007 1276420 1185132 1136768
19165 1136768 1181477 1161169 1222363 1331386 1306803 1420734 1472934 1477517 1402319 1362615 1241110
19154 1241110 1235530 1189826 1208631 1246115 1199187 1128641 1113527 1101244 1104665 970852 929114
$$ packed form
19231H26968p7851q1687n4306J01750J56477n591q1481K1119R9677l0983J42271
19220A016363K09197j27168o7930p7002m2434r347j52778q6827P797L0386P4609
19209G74866j06860L1129N1964O4573Q8602P4449n2419J0388L3392l168q039J18047
19197A076924M6232j14838J7350l2265k4610J15734J03923j8895P3910M9242j31945
19186A160762j37967J07259Q4432q6330l6075R7964N5191j3788o0481N0073K30064
19175A451104J03517q8027k1422j89779j47524J67713J08425j07587r1288m8364
19165A136768M4709k0308O1194J09023k4583J13931N2200M583p5198l9704j21505
19154A241110n580m5704J8805L7484m6928p0546j5114j2283L421j33813m1738
$$ plain form
19143 929114 1091762 1127024 1131433 1212826 1161599 1163314 1135602 1063869 1046817 1265411 1347641
19132 1347641 1310024 1500893 1714008 1680422 1726093 1936764 2115164 2258767 2525581 2786990
19122 2786990 3019849 3264568 3456141 3583333 3650513 3675042 3533975 3448511 3370992 3252248
19112 3252248 3273335 3120350 2942496 2965047 2996635 2878363 2727765 2631657 2391652 2159689
19102 2159689 2097419 1961170 1913228 1995199 2015598 1918376 1897163 1940087 1859688 1826823 1874576
19091 1874576 2022732 1959204 1790002 1649460 1621563 1638591 1725554 1845417 1891831 2094779
19081 2094779 2196955 2136823 2191756 2189250 2081270 2070934 2242907 2351234 2510552 2684193
19071 2684193 2870478 3223759 3431096 3380637 3358100 3335574 3316599 3267090 2976442 2770654
$$ packed form
19143I29114J62648L5262M409Q1393n1227J715k7712p1733j7052K18594Q2230
19132A347641l7617J90869K13115l3586M5671K10671J78400J43603K66814K61409
19122B786990K32859K44719J91573J27192O7180K4529j41067q5464p7519j18744
19112C252248K1087j52985j77854K2551L1588j18272j50598r6108k40005k31963
19102B159689o2270j36249m7942Q1971K0399r7222k1213M2924q0399l2865M7753
19091A874576J48156o3528j69202j40542k7897J7028Q6963J19863M6414K02948
19081B094779J02176o0132N4933k506j07980j0336J71973J08327J59318J73641
19071B684193J86285L53281K07337n0459k2537k2526j8975m9509k90648k05788
$$ plain form
19061 2770654 2761639 2699734 2656716 2531266 2434374 2325300 2194749 2184594 2209738 2298843 2302264
19050 2302264 2288968 2286760 2213078 2256147 2224791 2222022 2321274 2565363 2689567 2935652 3079548
19039 3079548 3097532 3315476 3413498 3355493 3373847 3401455 3496806 3793218 4113584 4345308
19029 4345308 4645147 4893368 5129450 5431689 5676568 5944430 6177939 6444441 6580942
19020 6580942 6610304 6755445 7285568 7843690 8349148 8868780 9529144 10224298 10801351 11546243
19010 11546243 12899748 14558595 16607738 19159484 22459307 26368096 30748454 35085208
19002 35085208 39096402 42586977 45744316 49457176 54420920 61621682 71833715 86259929
18994 86259929 106209006 132201408 162840123 193997677 219433286 233239513 233474454
$$ packed form
19061B770654r015o1905m3018j25450r6892j09074j30551j0155K5144Q9105L421
19050B302264j3296k208p3682M3069l1356k769R9252K44089J24204K46085J43896
19039C079548J7984K17944R8022n8005J8354K7608R5351K96412L20366K31724
19029D345308K99839K48221K36082L02239K44879K67862K33509K66502J36501
19020F580942K9362J45141N30123N58122N05458N19632O60364O95154N77053P44892
19010A1546243J353505J658847K049143K551746L299823L908789M380358M336754
19002C5085208M011194L490575L157339L712860M963744P200762J0212033J4426214
18994H6259929J9949077K5992402L0638715L1157554K5435609J3806227K34941
$$ plain form
18987 233474454 223762687 208305771 188388924 166471601 146865300 131549205 120668430
18980 120668430 112992705 107090618 101066282 93554397 84577641 75207987 66006650 57462128
18972 57462128 49929276 43637619 38604275 34720169 31769457 29427670 27723910 26470265
18964 26470265 25644841 25423834 25466314 25901240 26740570 28140365 30189328 33116072 37000219
18955 37000219 42025052 48449071 56695080 66810647 78179940 89639338 99570488 107345744
18947 107345744 113258209 119073650 127189541 139544314 158009123 183618078 215667500
18940 215667500 251265641 285202352 311185837 322876407 315531036 289443099 252731076
18933 252731076 215156479 180641052 150455595 125649658 107270811 94673530 86366499
$$ packed form
18987B33474454r711767j5456916j9916847k1917323j9606301j5316095j0880775
18980A20668430p675725n902087o024336p511885q976756r369654r201337q544522
18972E7462128p532852o291657n033344l884106k950712k341787j703760j253645
18964B6470265q25424k21007M2480M34926Q39330J399795K048963K926744L884147
18955C7000219N024833O424019Q246009J0115567J1369293J1459398R931150P775256
18947A07345744N912465N815441Q115891J2354773J8464809K5608955L2049422
18940B15667500L5598141L3936711K5983485J1690570p345371k6087937l6712023
18933B52731076l7574597l4515427l0185457k4805937j8378847j2597281q307031
$$ plain form
18926 86366499 80280870 74675861 68518213 61785717 54750367 48074553 42036652 36892505
18918 36892505 32658307 29357456 26820900 25027424 23618153 22191212 20728554 19451247
18910 19451247 18283460 17197303 16384165 15778092 15300012 14988615 14797278 14664789 14697335
18901 14697335 14688415 14584515 14640826 14999006 15597436 16700087 18378703 20596108 23036356
18892 23036356 24591140 24838476 24361078 24415223 25592124 28043225 32157510 38553326 48284455
18883 48284455 62336309 81511740 104443910 123972211 128914782 120437307 108110651
18876 108110651 94783067 80269807 66669749 56560178 50677271 48223221 48632945
18869 48632945 50341259 51079452 48404037 42521070 36094792 30679143 26669897 23746226
$$ packed form
18926H6366499o085629n605009o157648o732496p035350o675814o037901n144147
18918C6892505m234198l300851k536556j793476j409271j426941j462658j277307
18910A9451247j167787j086157q13138o06073m78080l11397j91337j32489L2546
18901A4697335q920j03900N6311L58180N98430J102651J678616K217405K440248
18892B3036356J554784K47336m77398N4145J176901K451101M114285O395816R731129
18883D8284455J4051854J9175431K2932170J9528301M942571q477475j2326656
18876A08110651j3327584j4513260j3600058j0109571n882907k454050M09724
18869D8632945J708314P38193k675415n882967o426278n415649m009246k923671
$$ plain form
18861 23746226 21395698 19549849 17860606 16356672 15099149 13946618 13148957 12744065
18853 12744065 12567240 12477681 12669643 13041333 13657942 14374086 15505322 17114075 19418372
18844 19418372 22468134 26477228 32006010 39101037 47047667 53779059 56574600 55363263
18836 55363263 53238307 53050315 56454502 63905343 76745526 95624711 119448952 144250919
18828 144250919 165937632 181617923 182235113 159755010 125073035 94030426 71758610
18821 71758610 56714410 46946045 40682124 37062550 35481780 35422694 35561408 34218708
18813 34218708 30248130 25020038 20468037 16963342 14221217 12236711 10843650 9931744
18805 9931744 9099505 8326694 7632826 7093860 6623691 6303153 6006178 5765423 5532875
$$ packed form
18861B3746226k350528j845849j689243j503934j257523j152531p97661m04892
18853A2744065j76825q9559J91962L71690O16609P16144J131236J608753K304297
18844A9418372L049762M009094N528782P095027P946630O731392K795541j211337
18836E5363263k124956j87992L404187P450841J2840183J8879185K3824241K4801967
18828A44250919K1686713J5680291O17190k2480103l4681975l1042609k2271816
18821G1758610j5044200r768365o263921l619574j580770n9086J38714j342700
18813C4218708l970578n228092m552001l504695k742125j984506j393061r11906
18805I931744q32239p72811o93868n38966m70169l20538k96975k40755k32548
$$ plain form
18796 5532875 5543033 5535313 5617248 5679627 5631454 5440395 5321686 5033739 4657088 4388323
18786 4388323 4051781 3966231 3916591 3884057 3962153 3996985 4105941 4102740 3978335 3954717 3962259
18775 3962259 3799447 3413546 3130088 2908169 2738920 2726824 2731003 2584438 2518887 2420420
18765 2420420 2418539 2290837 2186595 2165985 2006384 1898674 1901204 1951970 1985092 1979573 2004803
18754 2004803 1916350 1926486 1843053 1725204 1650053 1584585 1573405 1702031 1816667 1709687
18744 1709687 1657127 1566691 1475768 1502509 1656340 1722622 1838292 1867781 1709941 1608298
18734 1608298 1458189 1582231 1585446 1515902 1562558 1737048 1843159 1820341 1818780 1763292 1764847
18723 1764847 1805137 1706450 1695757 1820892 1835477 1878143 1978775 2087030 2136896 2282414
$$ packed form
18796E532875J0158p720Q1935O2379m8173j91059j18709k87947l76651k68765
18786D388323l36542q5550m9640l2534P8096L4832J08956l201j24405k3618P542
18775C962259j62812l85901k83458k21919j69249j2096M179j46565o5551r8467
18765B420420j881j27702j04242k0610j59601j07710K530N0766L3122n519K5230
18754B004803q8453J0136q3433j17849p5151o5468j1180J28626J14636j06980
18744A709687n2560r0436r0923K6741J53831O6282J15670K9489j57840j01643
18734A608298j50109J24042L215o9544M6656J74490J06111k2818j561n5488J555
18723A764847M0290r8687j0693J25135J4585M2666J00632J08255M9866J45518
$$ plain form
18713 2282414 2372326 2193610 2082077 2042668 1936264 1747166 1689615 1737696 1951115 2052201
18703 2052201 1955738 1932856 1865819 1847612 1904676 2024037 2157440 2274911 2375139 2486585
18693 2486585 2547160 2742921 2742232 2703379 2886578 3020402 3045336 3114175 3329856 3434075 3526074
18682 3526074 3580145 3617798 3787657 4052918 4291595 4626207 4853492 5033803 5239196 5494601
18672 5494601 5986600 6382372 6867313 7286860 7918029 8534356 9316825 10351043 11526066
18663 11526066 13018293 14545281 16133918 18070968 20272927 22852780 26206929 30607073
18655 30607073 36132699 42984092 50531403 57746216 63477075 67544660 71043236 75744385
18647 75744385 83214329 95198736 113571067 140549471 178526986 227294968 281533847
$$ packed form
18713B282414Q9912j78716j11533l9409j06404j89098n7551M8081K13419J01086
18703B052201r6463k2882o7037j8207N7064J19361J33403J17471J00228J11446
18693B486585O0575J95761o89l8853J83199J33824K4934O8839K15681J04219R1999
18682C526074N4071L7653J69859K65261K38677L34612K27285J80311K05393K55405
18672E494601M91999L95772M84941M19547O31169O16327P82469J034218J175023
18663A1526066J492227J526988J588637J937050K201959K579853L354149M400144
18655C0607073N525626O851393P547311P214813N730859M067585L498576M701149
18647G5744385P469944J1984407J8372331K6978404L7977515M8767982N4238879
$$ plain form
18640 281533847 328064622 351086449 344738183 316041516 276364694 235353877 199096481
18633 199096481 170626388 150804806 138470028 131914167 128265494 124009409 116496501
18626 116496501 105332539 91904919 78504901 66681585 57210618 49954655 44122930
18619 44122930 39728758 36371143 33804643 31811597 30516412 29708841 28979425 28927533 29488168
18610 29488168 30386456 31594245 33255603 35705046 38999632 43252143 48846468 56471297
18602 56471297 66746918 80000608 95944330 112251955 125666362 133181563 136117067
18595 136117067 139431120 147702743 163752491 188888996 223487498 266634799 317039438
18588 317039438 371336142 420201695 444757799 425947283 371554758 306764113 247509959
$$ packed form
18640B81533847M6530775K3021827o348266k8696667l9676822m1010817l6257396
18633A99096481k8470093j9821582j2334778o555861l648673m256085p512908
18626A16496501j1163962j3427620j3400018j1823316r470967p255963n831725
18619D4122930m394172l357615k566500j993046j295185q07571p29416n1892N60635
18610B9488168Q98288J207789J661358K449443L294586M252511N594325P624829
18602E6471297J0275621J3253690J5943722J6307625J3414407P515201K935504
18595A36117067L314053Q271623J6049748K5136505L4598502M3147301N0404639
18588C17039438N4296704M8865553K4556104j8810516n4392525o4790645n9254154
$$ plain form
18581 247509959 198901472 162469147 137390868 121651789 113087811 109719601 108920672
18574 108920672 107380480 101285595 89255457 74689187 61647808 51481685 43964933
18567 43964933 38274259 33929930 30435182 27527370 25068516 23023537 21396432 20141184
18559 20141184 19109412 18157646 17614260 17255174 17171583 17326597 17829636 18505958 19593613
18550 19593613 21144017 23420240 26998618 32127849 38956461 46420513 51773119 52801367
18542 52801367 51069096 49803165 50921787 55263417 63709004 76519758 92393754 108735496
18534 108735496 124073935 136423307 138040286 120192198 92231765 67940787 51237295
18527 51237295 40471584 33393884 28851489 25938993 24403373 23865043 24089435 23917770
$$ packed form
18581B47509959m8608487l6432325k5078279j5739079q563978l368210p98929
18574A08920672j540192o094885j2030138j4566270j3041379j0166123p516752
18567D3964933n690674m344329l494748k907812k458854k044979j627105j255248
18559B0141184j031772r51766n43386l59086q3591J55014N03039O76322J087655
18550A9593613J550404K276223L578378N129231O828612P464052N352606J028248
18542E2801367j732271j265931J118622M341630Q445587J2810754J5873996J6341742
18534A08735496J5338439J2349372J616979j7848088k7960433k4290978j6703492
18527E1237295j0765711p077700m542395k912496j535620n38330K24392j71665
$$ plain form
18519 23917770 22318410 19231510 16152182 13747996 12010440 10705173 9692003 8862198
18511 8862198 8180579 7499350 6840769 6367785 5873663 5412804 5045503 4765134 4572400
18502 4572400 4442068 4134349 3810896 3536666 3456525 3448981 3427777 3453633 3241258 3016657
18492 3016657 2857680 2739251 2791048 2812414 2756620 2851942 2750179 2775057 2798285 2908987
18482 2908987 3007258 3104176 3089907 3010716 2947053 2981752 2907399 3008633 3002239 2782070 2636663
18471 2636663 2619301 2695291 2789143 2908944 2931442 2937347 2814499 2778462 2704335 2648766 2546233
18460 2546233 2427422 2327660 2225413 1971248 1640711 1446549 1587045 1752792 1922971 1945991
18450 1945991 1827184 1709621 1511338 1556780 1685610 1705222 1593860 1556959 1567789 1667656
$$ packed form
18519B3917770j599360l086900l079328k404186j737556j305267j013170q29805
18511H862198o81619o81229o58581m72984m94122m60859l67301k80369j92734
18502D572400j30332l07719l23453k74230q0141p544k1204K5856k12375k24601
18492C016657j58977j18429N1797K1366n5794R5322j01763K4878K3228J10702
18482B908987R8271R6918j4269p9191o3663L4699p4353J01234o394k20169j45407
18471B636663j7362P5990R3852J19801K2498N905j22848l6037p4127n5569j02533
18460B546233j18811r9762j02247k54165l30537j94162J40496J65747J70179K3020
18450A945991j18807j17563j98283M5442J28830J9612j11362l6901J0830R9867
$$ plain form
18440 1667656 1542383 1370100 1273150 1472572 1590589 1593787 1432610 1257673 1240833 1423967
18430 1423967 1530692 1456010 1484882 1558363 1687359 1642461 1666770 1773062 1799735 1809814 1761110
18419 1761110 1619984 1474571 1614993 1678070 1629764 1523509 1547371 1695998 1630231 1519945
18409 1519945 1375061 1241969 1236108 1206720 1115833 1240023 1147092 1142147 1276353 1311387 1268831
18398 1268831 1370278 1322226 1309582 1288345 1285898 1347937 1387220 1318291 1026443 891673 1035890
18387 1035890 1157490 1128901 1142725 1145795 1048204 939732 902974 949334 1048737 1041704 942281
18376 942281 1127655 1260637 1274938 1312317 1293253 1128562 1205454 1284126 1228938 1088549 1043620
18365 1043620 1081720 1307152 1476948 1363975 1160016 1207744 1342738 1415403 1396297 1370302
$$ packed form
18440A667656j25273j72283r6950J99422J18017L198j61177j74937j6840J83134
18430A423967J06725p4682K8872P3481J28996m4898K4309J06292K6673J0079m8704
18419A761110j41126j45413J40422O3077m8306j06255K3862J48627o5767j10286
18409A519945j44884j33092n861k9388r0887J24190r2931m945J34206L5034m2556
18398A268831J01447m8052j2644k1237k447O2039L9283o8929k91848j34770J44217
18387A035890J21600k8589J3824L070r7591j08472l6758M6360R9403p033r9423
18376I42281J85374J32982J4301L7379j9064j64691P6892P8672n5188j40389m4929
18365A043620L8100K25432J69796j12973k03959M7728J34994P2665j9106k5995
$$ plain form
18355 1370302 1400945 1282959 1169989 1189445 1265064 1226256 1185248 1142365 1201648 1117290 1098940
18344 1098940 1037376 1044756 985781 945033 914384 955900 831944 613018 548312 707402 901544
18333 901544 916960 878548 791525 800480 728198 700031 694411 614506 617974 798903 1013851 1159810
18321 1159810 1078406 1020160 982531 944762 1017855 895589 763805 954851 1161876 1120562
18311 1120562 1016353 1090976 1192685 953391 813665 861796 859406 864611 853078 987435 985533
18300 985533 823536 718080 668705 587216 559363 736199 776308 691636 653896 592931 545851
18289 545851 623815 582253 579451 682307 624020 558217 511246 365256 364701 415588 425009 451790
18277 451790 521315 667191 631191 532681 472325 344839 425181 432399 428486 387957 406568
$$ packed form
18355A370302L0643j17986j12970J9456P5619l8808m1008m2883N9283q4358j8350
18344A098940o1564P380n8975m0748l0649M1516j23956k18926o4706J59090J94142
18333I01544J5416l8412q7023Q955p2282k8167n620p9905L468J80929K14948J45959
18321A159810q1404n8246l7629l7769P3093j22266j31784J91046K07025m1314
18311A120562j04209P4623J01709k39294j39726M8131k390N205j1533J34357j902
18300I85533j61997j05456m9375q1489k7853J76836M0109q4672l7740o0965m7080
18289E45851P7964m1562k802J02856n8287o5803m6971j45990n55N0887R421K6781
18277D51790O9525J45876l6000r8510o0356j27486Q0342P218l913m0529J8611
$$ plain form
18266 406568 303248 246809 278304 254339 260552 230941 271163 420143 469509 511143 475252
18255 475252 592392 676960 511686 402754 321089 319982 233141 209683 293933 341597 350713
18244 350713 365179 430213 280583 302813 327197 308383 336105 399558 430291 540841 696685
18233 696685 734901 661779 777834 783673 1091749 1418065 1578578 1627203 1466648 1212250
18223 1212250 1032461 950019 851335 763801 825903 652369 672648 788369 760189 787753 777105
18212 777105 652008 495941 424160 311917 157630 142217 217396 299744 486308 488646 407099
18201 407099 421139 241072 131080 103459 70061 91523 78103 118640 374802 445802 367657
18190 367657 310938 405988 527263 613096 690255 812206 705732 536827 604768 654087 648380
$$ packed form
18266D06568j03320n6439L1495k3965O213k9611M0222J48980M9366M1634l5891
18255D75252J17140Q4568j65274j08932q1665j107q6841k3458Q4250M7664R116
18244C50713J4466O5034j49630K2230K4384j8814K7722O3453L0733J10550J55844
18233F96685L8216p3122J16055N839L08076L26316J60513M8625j60555k54398
18223A212250j79789q2442r8684q7534O2102j73534K0279J15721k8180K7564j0648
18212G77105j25097j56067p1781j12243j54287j5413P5179Q2348J86564K338q1547
18201D07099J4040j80067j09992k7621l3398K1462j3420M0537K56162P1000p8145
18190C67657n6719R5050J21275Q5833P7159J21951j06474j68905O7941M9319n707
$$ plain form
18179 648380 646844 595076 771081 978791 1060377 1202680 1367915 1526576 1780607 1691680
18169 1691680 1378274 1089848 868475 638216 301920 318583 378646 364778 259189 223774
18159 223774 330308 352557 370154 475179 562299 605375 612107 591167 582615 603847 636494
18148 636494 603029 455238 328108 307925 372840 405366 318062 244014 329184 357818 314754
18137 314754 357732 455365 484113 527312 557775 481266 580994 546738 569859 599489 653493
18126 653493 758733 956220 1006524 1034461 1367665 1599431 1621952 1553763 1557851 1792929 2043842
18115 2043842 2158285 2317144 2429840 2548221 2597758 2598335 2511356 2377042 2153230 1967869
18105 1967869 1795463 1609174 1541589 1456112 1316493 1191425 936764 831807 709623 477914
$$ packed form
18179F48380j536n1768J76005K07710Q1586J42303J65235J58661K54031q8927
18169A691680l13406k88426k21373k30259l36296J6663O0063j3868j05589l5415
18159B23774J06534K2249J7597J05025Q7120M3076O732k0940q552K1232L2647
18148F36494l3465j47791j27130k0183O4915L2526q7304p4048Q5170K8634m3064
18137C14754M2978R7633K8748M3199L0463p6509R9728l4256K3121K9630N4004
18126F53493J05240J97487N0304K7937L33204K31766K2521o8189M088K35078K50913
18115B043842J14443J58859J12696J18381M9537N77q6979j34314k23812j85361
18105A967869j72406j86289o7585q5477j39619j25068k54661j04957j22184k31709
$$ plain form
18095 477914 535088 580135 460345 524718 647688 724024 712469 743043 681354 627627 681048
18084 681048 664181 655118 649340 760656 957753 996839 950949 972878 1073684 1041151 1098182
18073 1098182 1199740 1351165 1485119 1670816 1978121 2212590 2340785 2426285 2432308 2328055
18063 2328055 2375213 2449624 2502746 2466708 2365676 2322186 2309377 2138035 1885964 1765173
18053 1765173 1821534 1816424 1664447 1453904 1274006 1128825 900416 808973 750134 607575
18043 607575 515312 533515 514421 336494 257975 304719 470308 553581 536705 465781 378495
18032 378495 396748 480727 518633 403235 270858 350894 378618 446525 330657 360090 481522
18021 481522 468203 566928 608845 699982 709908 803059 747887 653355 600171 621592 501089
$$ packed form
18095D77914N7174M5047j19790O4373J22970P6336j1555L0574o1689n3727N3421
18084F81048j6867r063n778J11316J97097L9086m5890K1929J00806l2533N7031
18073A098182J01558J51425J33954J85697L07305K34469J28195Q5500O023j04253
18063B328055M7158P4411N3122l6038j01032m3490j2809j71342k52071j20791
18053A765173N6361n110j51977k10543j79898j45181k28409r1443n8839j42559
18043F07575r2263J8203j9094j77927p8519M6744J65589Q3273j6876p0924q7286
18032C78495J8253Q3979L7906j15398j32377Q0036K7724O7907j15868K9433J21432
18021D81522j3319R8725M1917R1137R926R3151n5172r4532n3184K1421j20503
$$ plain form
18010 501089 470039 479562 412120 268180 190816 198439 342174 226982 204237 472026 570456
17999 570456 516168 655138 613087 455282 322887 289595 387848 345654 260776 326505 415286
17988 415286 530097 434477 178189 115922 121849 44754 -35370 32630 255466 442576 410149
17977 410149 258531 282875 279885 161561 190165 171559 209605 187673 267314 416857 486807
17966 486807 556933 628464 712208 893735 971220 965530 925814 831891 833600 716894 589324
17955 589324 472068 349901 316509 281578 234490 300037 254479 211631 169257 158110 40116
17944 40116 -131942 -159482 -56921 33538 7618 -75134 136085 183457 72869 29200 -26601
17933 -26601 41854 253926 267627 298999 346908 192843 187501 358534 617634 605397 491329
$$ packed form
18010E01089l1050R523o7442j43940p7364P623J43735j15192k2745K67789R8430
17999E70456n4288J38970m2051j57805j32395l3292R8253m2194q4878O5729Q8781
17988D15286J14811r5620k56288o2267N927p7095q0124O8000K22836J87110l2427
17977D10149j51618K4344k990j18324K8604j8606L8046k1932P9641J49543O9950
17966D86807P0126P1531Q3744J81527P7485n690l9716r3923J709j16706j27570
17955E89324j17256j22167l3392l4931m7088O5547m5558m2848m2374j1147j17994
17944D0116j72058k7540J02561R0459k5920q2752K11219M7372j10588m3669n5801
17933b6601O8455K12072J3701L1372M7909j54065n342J71033K59100j2237j14068
$$ plain form
17922 491329 593716 511467 507758 435854 386354 406934 529156 732394 832983 853520 728562
17911 728562 703132 658363 694444 713274 629732 467655 461635 597295 529079 491663 516084
17900 516084 483901 441890 394781 201061 81784 82229 98072 44192 124286 22915 33759
17889 33759 1833 -33838 14986 125154 72608 29572 197468 229930 229875 284785 351317 388257
17877 388257 180315 49029 33172 -6285 32690 -47380 -67514 -98994 -173502 -209776 -82024
17866 -82024 -34685 19987 42916 101489 30604 44944 71105 182002 145148 189574 220204
17855 220204 150771 160158 134357 211483 240534 251619 205869 194522 128872 40832 -322 26081
17843 26081 43601 60465 35494 41118 127478 265921 281594 84555 -14870 -94322 -24327
$$ packed form
17922D91329J02387q2249l709p1904m9500K0580J22222K03238J00589K0537j24958
17911G28562k5430m4769L6081J8830q3542j62077o020J35660o8216l7416K4421
17900E16084l2183m2011m7109j93720j19277M45J5843n3880Q0094j01371J0844
17889C3759l1926l5671M8824J10168n2546m3036J67896L2462n5N4910O6532L6940
17877C88257k07942j31286j5857l9457L8975q0070k0134l1480p4508l6274J27752
17866h2024M7339N4672K2929N8573p0885J4340K6161J10897l6854M4426L0630
17855B20204o9433R387k5801P7126K9051J1085m5750j1347o5650q8040m1154K6403
17843B6081J7520J6864k4971N624Q6360J38443J5673j97039r9425p9452O9995
$$ plain form
17832 -24327 118510 147140 97178 51608 79982 62204 28045 92203 180821 242365 168585
17821 168585 166972 111693 107456 17193 74162 128261 145880 90924 112527 193934 288753 145155
17809 145155 134032 261414 226883 136749 42598 98930 139231 35750 -32239 -73061 -87811
17798 -87811 -144743 -180118 -252392 -257036 -99590 16516 86775 9298 -75434 -55334 46463
17787 46463 30400 63250 217448 269383 196386 206390 187199 173870 149673 124813 207473
17776 207473 180426 198727 205503 74237 75480 56779 45648 72799 28945 -46679 -51607 -139759
17764 -139759 -146907 -113430 -54367 -57068 -43832 -42655 63874 159136 252699 219552 165575 166600
17752 166600 224063 205224 107935 81517 125103 117927 186165 182525 114786 -89046 -150341 -41125
$$ packed form
17832b4327J42837K8630m9962m5570K8374j7778l4159O4158Q8618O1544p3780
17821A68585j613n5279m237r0263N6969N4099J7619n4956K1603Q1407R4819j43598
17809A45155j1123J27382l4531r0134r4151N6332M0301j03481o7989m0822j4750
17798h7811n6932l5375p2274m644J57446J16106P0259p7477q4732K0100J01797
17787D6463j6063L2850J54198N1935p2997J0004j9191j3329k4197k4860Q2660
17776B07473k7047J8301O776j31266J243j8701j1131K7151m3854p5624m928q8152
17764a39759p148L3477N9063k701J3236J177J06529R5262R3563l3147n3977J025
17752A66600N7463j8839r7289k6418M3586p176O8238l640o7739k03832o1295J09216
$$ plain form
17740 -41125 -8543 58533 84146 -20094 -150003 -31929 76999 -66621 -146256 84735
17730 84735 83776 22124 188115 201429 246921 396811 402232 160055 -123164 -265050 -127526
17719 -127526 -93116 3607 64383 38052 87559 101290 45274 40333 -82326 -69487 8694
17708 8694 62582 38159 -34442 -127618 -109186 -97251 18907 60959 35097 142895 139304 144145
17696 144145 279815 221353 225365 154389 48231 13297 40895 -156823 -54642 64841 203231
17685 203231 231781 237054 221579 182325 145804 184453 128623 82308 74036 28280 76924 149971
17673 149971 165402 213112 272879 227126 149805 -14792 -107894 -101465 20234 102851 216792
17662 216792 64126 -54594 51610 113251 30904 -5405 -122295 -45337 -73480 -141600 -176761
$$ packed form
17740d1125L2582O7076K5613j04240j29909J18074J08928j43620p9635K30991
17730H4735r59o1652J65991J3314M5492J49890N421k42177k83219j41886J37524
17719a27526L4410R6723O0776k6331M9507J3731n6016m941j22659J2839P8181
17708H694N3888k4423p2601r3176J8432J1935J16158M2052k5862J07798l591M841
17696A44145J35670n8462M012p0976j06158l4934K7598j97718J02181J19483J38390
17685B03231K8550N273j5475l9254l6521L8649n5830m6315q272m5756M8644P3047
17673A49971J5431M7710N9767m5753p7321j64597r3102O429J21699Q2617J13941
17662B16792j52666j18720J06204O1641q2347l6309j16890P6958k8143o8120l5161
$$ plain form
17651 -176761 -16173 2193 -5260 5817 5782 -13272 -8027 -45015 57101 130180 153780 176012
17639 176012 33036 -43066 -19028 -38160 -144403 -328395 -364653 -361025 -299347 -227429 -87950
17628 -87950 -60602 -100437 -127033 -39852 87238 117317 38196 -8511 -91343 -128355 -78822
17617 -78822 187570 400072 423372 515386 491710 454971 370515 402901 301027 126809 123468
17606 123468 185338 133656 157758 140499 167891 157091 127847 180150 269495 332735 197861
17595 197861 119995 143963 147903 25569 -31144 -43570 -116153 -64883 95475 62186 -40486
17584 -40486 -34380 -78607 -196575 -247258 -157755 -141248 -16178 122152 67332 109455 18776
17573 18776 -130563 -51077 -98543 -114254 -86979 -18024 107311 170815 195554 145977 260661
$$ packed form
17651a76761J60588J8366p453J1077l5j9054N245l6988J02116P3079K3600K2232
17639A76012j42976p6102K4038j9132j06243j83992l6258L628O1678P1918J39479
17628h7950K7348l9835k6596Q7181J27090L0079p9121m6707q2832l7012M9533
17617g8822K66392K12502K3300R2014k3676l6739q4456L2386j01874j74218l341
17606A23468O1870n1682K4102j7259K7392j0800k9244N2303Q9345O3240j34874
17595A97861p7866K3968L940j22334n6713j2426p2583N1270J60358l3289j02672
17584d0486O106m4227j17968n0683Q9503J6507J25070J38330n4820M2123r0679
17573A8776j49339P9486m7466j5711K7275O8955J25335O3504K4739m9577J14684
$$ plain form
17562 260661 349166 396853 403875 345400 191481 91627 -25524 -758 13401 -55247 8690
17551 8690 171061 110879 48671 115997 184911 32110 -18517 -114890 -86051 -109765 26941
17540 26941 135962 143147 72045 -62008 -60622 -42046 24389 146212 235319 100255 144611
17529 144611 211288 192190 10169 -38866 -57989 -109597 20430 119920 36255 -38415 -4604
17518 -4604 88476 141876 -17270 -62802 -142165 -91754 2908 -1356 79248 176881 136622 109802
17506 109802 4608 -26747 -30552 117150 213064 117482 28800 66087 -35450 -205542 -195241
17495 -195241 -99267 20647 231439 256933 121629 74844 69559 -3296 -201975 -177616 -61614
17484 -61614 13589 108887 208819 248910 61114 -563 -141605 -47017 80293 37496 18950
$$ packed form
17562B60661Q8505M7687P022n8475j53919r9854j17151K4766J4159o8648O3937
17551H690J62371o0182o2208O7326O8914j52801n0627r6373K8839k3714J36706
17540B6941J09021P185p1102j34053J386J8576O6435J21823Q9107j35064M4356
17529A44611O6677j9098j82021m9035j9123n1608J30027R9490q3665p4670L3811
17518d604R3080N3400j59146m5532p9363N0411R4662m264Q0604R7633m0259k6820
17506A09802j05194l1355l805J47702R5914r5582q8682L7287j01537j70092J0301
17495a95241R5974J19914K10792K5494j35304m6785n285p2855j98679K4359J16002
17484f1614P5203R5298R9932M0091j87796o1677j41042R4588J27310m2797j8546
$$ plain form
17473 18950 77212 124918 -76 -35289 35911 -34605 -35304 -76375 29183 146223 166933
17462 166933 34564 -83695 8660 132352 212248 207734 141483 209427 168042 33216 45395
17451 45395 78071 59758 103581 148895 105504 20151 -20013 -20770 -45284 -112060 -179759 19063
17439 19063 145014 -36644 -26567 93947 50344 154936 149323 232314 216475 58231 -67679
17428 -67679 -68906 -96388 -58507 -35978 -38622 -60963 -55332 -43668 -70610 -60593 -3351 -90642
17416 -90642 -71204 -151797 -100371 -11651 104084 77171 13147 -35191 -84622 -12096 62714
17405 62714 89392 73613 59828 100044 217589 217373 150550 55765 -22377 -16095 -70779 -235438
17393 -235438 -264157 -185639 -93428 -63922 -21438 22525 80417 95086 223184 100716 -20094
$$ packed form
17473A8950N8262M7706j24994l5213P1200p0516o99m1071J05558J17040K0710
17462A66933j32369j18259R2355J23692P9896m514o6251O7944m1385j34826J2179
17451D5395L2676j8313M3823M5314m3391q5353m0164p57k4514o6776o7699J98822
17439A9063J25951j81658J0077J20514m3603J04592n613Q2991j5839j58244j25910
17428f7679j227k7482L7881K2529k644k2341N631J1664k6942J0017N7242q7291
17416i0642J9438q0593N1426Q8720J15735k6913o4024m8338m9431P2526P4810
17405F2714K6678j5779j3785M0216J17545k16o6823r4785p8142O282n4684j64659
17393b35438k8719P8518R2211K9506M2484M3963N7892J4669J28098j22468j20810
$$ plain form
17382 -20094 46574 -12284 -21126 29239 -15831 -25630 -52360 -19531 76865 -4848 48392 116814
17370 116814 128741 88996 41514 -23966 -51287 76940 84360 -67665 13406 59852 67403
17359 67403 27820 34516 42120 -11872 -81303 -98649 -40057 73581 137158 89456 -8312 45306
17347 45306 8445 -142085 -172946 -86264 27257 211669 229865 217536 145419 45561 115976
17336 115976 137773 100103 103277 -11285 120422 86858 -25188 8235 -37445 -11503 129085
17325 129085 258202 229029 128836 151156 93175 57408 89949 100558 104794 67238 181881
17314 181881 317515 262386 377380 559193 926682 1365465 1721531 1752306 1479721 996100
17304 996100 662848 569379 344140 247727 305982 185803 119987 215488 211133 324238 418519
$$ packed form
17382b0094O6668n8858q842N0365m5070r799k6730L2829R6396q1713N3240O8422
17370A16814J1927l9745m7482o5480k7321J28227P420j52025Q1071M6446P551
17359F7403l9583O696P604n3992o9431j7346N8592J13638O3577m7702r7768N3618
17347D5306l6861j50530l0861Q6682J13521J84412J8196j2329p2117r9858P0415
17336A15976K1797l7670L174j14562J31707l3564j12046L3423m5680K5942J40588
17325A29085J29117k9173j00193K2320n7981l5767L2541J0609M236l7556J14643
17314A81881J35634n5129J14994J81813L67489M38783L56066L0775k72585m83621
17304I96100l33252r3469k25239r6413N8255j20179o5816R5501m355J13105R4281
$$ plain form
17293 418519 430647 371842 305214 230226 180565 72580 35280 18083 52471 73839 167379
17282 167379 206745 213753 101921 19002 -49348 74097 99412 -52767 -200262 -92528 4044
17271 4044 42238 13461 81479 351927 353672 254771 409198 413554 307271 243109 187532 151999
17259 151999 133103 61503 159314 309426 511844 887019 1233346 1620990 1925136 1560207
17249 1560207 1048430 882993 681412 476507 332779 251033 391471 405314 335874 221880
17239 221880 174515 34733 -25234 39516 99519 120793 61838 66945 24830 48012 248429
17228 248429 267035 167037 50149 94347 122572 210938 163410 91620 104519 79342 161382
17217 161382 303887 250384 69902 2661 39067 2827 -20954 144425 216200 351964 425406
$$ packed form
17293D18519J2128n8805o6628p4988m9661j07985l7300j7197L4388K1368R3540
17282A67379L9366P008j11832q2919o8350J23445K5315j52179j47495J07734R6572
17271D044L8194k8777O8018K70448J745r8901J54427M356j06283o4162n5577l5533
17259A51999j8896p1600R7811J50112K02418L75175L46327L87644L04146l64929
17249A560207n11777j65437k01581k04905j43728q1746J40438J3843o9440j13994
17239B21880m7365j39782n9967O4750O0003K1274n8955N107m2115K3182K00417
17228B48429J8606r9998j16888M4198K8225Q8366m7528p1790J2899k5177Q2040
17217A61382J42505n3503j80482o7241L6406l6240k3781J65379P1775J35764P3442
$$ plain form
17206 425406 350392 281670 195989 180049 151656 125321 178584 49897 56955 101960 83396
17195 83396 42975 -71612 -97868 -93879 -107374 -133178 -178915 -76547 -53820 26129 134560
17184 134560 170564 100614 40272 -1650 30250 -101436 -226512 -162549 -100564 -123913 -97354
17173 -97354 -70305 68507 121639 48188 -32804 -52282 -95303 -15698 107512 111486 32856
17162 32856 49416 -27200 -202453 -131225 -13546 203656 234373 241108 158558 -6917 -94563
17151 -94563 -98314 -48543 -27966 -125844 -153373 -49765 74578 -1734 -158310 -229251 -102711
17140 -102711 -78102 -36249 170503 286601 209492 18628 61266 47060 97588 215113 133769
17129 133769 -29973 -50413 -86997 -144810 -131127 40143 71372 13817 24370 70827 72968
$$ packed form
17206D25406p5014o8722q5681j5940k8393k6335N3263j28687P058M5005j8564
17195H3396m0421j14587k6256L989j3495k5804m5737J02368K2727P9949J08431
17184A34560L6004o9950o0342m1922L1900j31686j25076O3963O1985k3349K6559
17173i7354K7049J38812N3132p3451q0992j9478m3021P9605J23210L974p8630
17162C2856J6560p6616j75253P1228J17679K17202L0717O735q2550j65475q7646
17151i4563l751M9771K0577r7878k7529J03608J24343p6312j56576p0941J26540
17140a02711K4609M1853K06752J16098p7109j90864M2638j4206N0528J17525q1344
17129A33769j63742k0440l6584n7813J3683J71270L1229n7555J0553M6457K141
$$ plain form
17118 72968 86920 54465 -92045 -131092 1345 -7253 -36204 -93594 -66994 67580 192191
17107 192191 123693 -145 -58382 -83171 -150967 -93521 6824 50805 -50935 -110694 -98058
17096 -98058 46998 150732 211058 138478 10029 -168689 -80839 48668 152921 188246
17086 188246 131871 614 95243 189119 134550 161533 114229 130583 46448 47229 42020 56715
17074 56715 23340 24047 28807 -22105 34313 65372 113744 86048 89880 -4631 36663 40182 101309
17061 101309 85713 -4858 13224 26303 -80000 -168847 -137417 -174692 -167418 -41123 57946
17050 57946 18900 -88478 17353 -54969 -63195 47687 185009 199493 213548 267185 255667
17039 255667 76096 39852 142992 209948 180949 173646 236257 109161 113167 137821 126172
$$ packed form
17118G2968J3952l2455j46510l9047J32437q598k8951n7390K6600J34574J24611
17107A92191o8498j23838n8237k4789o7796N7446J00345M3981j01740n9759J2636
17096i8058J45056J03734O0326p2580j28449j78718Q7850J29507J04253L5325
17086A88246n6375j31257R4629R3876n4569K6983m7304J6354q4135P81n209J4695
17074E6715l3375P07M760n0912N6418L1059M8372k7696L832r4511M1294L519O1127
17061A01309j5596r0571J8082J3079j06303q8847L1430l7275P274J26295R9069
17050E7946l9046j07378J05831p2322q226J10882J37322J4484J4055N3637j1518
17039B55667j79571l6244J03140O6956k8999p303O2611j27096M006K4654j1649
$$ plain form
17028 126172 83224 95544 133265 129871 99392 -16044 -2547 23236 64643 -62528 -172698
17017 -172698 -155043 -56544 73393 -4650 -78195 -51243 -4016 19788 -185872 -289096 -187464
17006 -187464 -143139 -231142 -318735 -314313 -222901 -169977 -122504 -17274 -22029 -57357 -162444
16995 -162444 -231892 -227540 -335129 -218191 -81670 -66767 -76572 -212518 -153518 -51509 2771
16984 2771 -7882 -75550 -109877 -49195 -137495 6791 165962 24739 -171226 -303092 -262603
16973 -262603 -249639 -260433 -165515 -39262 -10988 113119 119224 96093 69197 270018 199357
16962 199357 181809 79296 53334 144907 98474 47230 -99844 -152911 -28326 -119629 -122436
16951 -122436 -77807 -18255 49242 81542 -19304 -93612 -169474 -205013 -26855 45484 35726
$$ packed form
17028A26172m2948J2320L7721l394l0479j15436J3497K5783M1407j27171j10170
17017a72698J7655R8499J29937p8043p3545K6952M7227K3804k05660j03224J01632
17006a87464M4325q8003q7593M422R1412N2924M7473J05230m755l5328j05087
16995a62444o9448M352j07589J16938J36521J4903r805j35946N9000J02009N4280
16984B771j0653o7668l4327O0682q8300J44286J59171j41223j95965j31866M0489
16973b62603J2964j0794R4918J26253K8274J24107O105k3131k6896K00821p0661
16962A99357j7548j02513k5962R1573m6433n1244j47074n3067J24585r1303k807
16951a22436M4629N9552O7497L2300j00846p4308p5862l5539J78158P2339r758
$$ plain form
16940 35726 30189 -17670 14215 29752 -67762 7214 -53809 -72073 -45165 -3122 -26430 18406
16928 18406 92617 88814 -7188 -87999 -184641 -80915 -23376 -37210 41955 6046 2128 -114466
16916 -114466 -195789 -178128 -240770 -139152 -18873 -887 -54715 -121089 -226419 -215032 -174694
16905 -174694 -178167 -188078 -97473 -31255 57070 93194 -108020 -106621 -73317 44443 62497 -43274
16893 -43274 -156751 -134571 -132435 13808 40964 -45930 -53555 -122512 -187268 -236059 -109140
16882 -109140 -90681 -42956 -52536 -55233 -149576 -237822 -171864 -64480 -114849 -95827 -32741 33557
16870 33557 -127698 -92680 -52247 -118769 -46957 -73876 -107838 -222190 -225170 -141205 -132299 -167295
16858 -167295 -117079 -148360 -96215 142961 112543 161193 147369 10608 -33452 -104959 -163697
$$ packed form
16940C5726n537m7859L1885J5537r7514P4976o1023j8264K6908M2043k3308M4836
16928A8406P4211l803r6002q0811r6642J03726N7539j3834P9165l5909l918j16594
16916a14466q1323J7661o2642J01618J20279J7986n3828o6374j05330J1387M0338
16905a74694l473r911R0605O6218Q8325L6124k01214J399L3304J17760J8054j05771
16893d3274j13477K2180K136J46243K7156q6894p625o8957o4756m8791J26919
16882a09140J8459M7725r580k697r4343q8246O5958J07384n0369J9022O3086O6298
16870C3557j61255L5018M0433o6522P1812k6919l3962j14352k980Q3965Q906l4996
16858a67295N0216l1281N2145K39176l0418M8650j3824j36761m4060p1507n8738
$$ plain form
16847 -163697 -28575 2962 -58203 -22094 -54702 -69745 73651 42854 -67379 -88395 24095
16836 24095 73944 185775 149400 197030 99498 12999 -63622 -120266 -42341 -35350 8074 13278
16824 13278 -59337 -27701 99634 46262 -96605 -72752 -96172 -122200 -76145 -107691 -103642
16813 -103642 -43778 68656 -33770 -97202 -37173 -93639 -78127 88027 121422 149952 26435
16802 26435 75160 92478 89774 8989 -100136 -69013 -141344 -199505 -216792 -173168 -77821 -122760
16790 -122760 -78082 -74305 -125390 -28180 109628 119215 29402 -141184 -263168 -250583 -101872
16779 -101872 -71377 -242360 -243623 -147526 -67265 36106 -109963 -130567 -36584 -144678 -142340
16768 -142340 -186906 -159540 -49587 17313 -5335 -29840 74785 26214 94088 123305 62685
$$ packed form
16847a63697J35122L1537o1165L6109l2608j5043J43396l0797j10233k1016J12490
16836B4095M9849J11831l6375M7630r7532q6499p6621n6644P7925O991M3424N204
16824A3278p2615L1636J27335n3372j42867K3853k3420k6028M6055l1546M049
16813a03642N9864J12434j02426o3432O0029n6466J5512J66154L3395K8530j23517
16802B6435M8725J7318k704q0785j09125L1123p2331n8161j7287M3624R5347m4939
16790a22760M4678L777n1085R7210J37808R587q9813j70586j21984J2585J48711
16779a01872L0495j70983j263R6097Q0261J03371j46069k0604R3983j08094K338
16768a42340m4566K7366J09953O6900k2648k4505J04625m8571O7874K9217o0620
$$ plain form
16757 62685 -25112 -64523 -18892 46295 96450 204757 250415 289511 170450 64067 109943
16746 109943 15209 -20676 66262 67803 -55475 -160463 -225076 -249687 -185217 -23556 -7535
16735 -7535 -60850 -160639 -265735 -303591 -237016 -156229 -118588 -34496 -40366 -189185 -291939
16724 -291939 -243104 -167598 -7098 -58801 -85879 5169 -130421 -163926 -215286 -157748 61276
16713 61276 82038 38167 20615 131603 66307 -53392 -16036 72360 96161 64614 152979
16702 152979 115089 4729 -18196 -123210 -189979 -312339 -158558 -62310 8673 149494
16692 149494 130314 167615 173286 141707 156726 41209 61686 90612 187923 151794 11050
16681 11050 -17611 7818 -47796 -36790 69119 -2651 -106574 -180487 -175933 -211332 -121406
$$ packed form
16757F2685q7797l9411M5631O5187N0155J08307M5658L9096j19061j06383M5876
16746A09943r4734l5885Q6938J541j23278j04988o4613k4611O4470J61661J6021
16735g535n3315r9789j05096l7856O6575Q0787L7641Q4092n870j48819j02754
16724b91939M8835P5506J60500n1703k7078R1048j35590l3505n1360N7538K19024
16713F1276K0762m3871j7552J10988o5296j19699L7356Q8396K3801l1547Q8365
16702A52979l7890j10360k2925j05014o6769j22360J53781R6248P0983J40821
16692A49494j9180L7301N671l1579J5019j15517K0477K8926R7311l6129j40744
16681A1050k8661K5429n5614J1006J05909p1770j03923p3913M554l5399Q9926
$$ plain form
16670 -121406 106687 212959 95070 -100365 -46686 -7489 24842 -95309 -134576 -3046
16660 -3046 967 -121170 -152721 -115260 -79967 40626 101851 -15253 -104188 -35769 11878
16649 11878 109481 66411 -57004 -102956 -129118 42717 42092 83425 -111586 -170494 -34482
16638 -34482 -44095 -49328 -80046 -48979 88504 101782 121191 111415 137144 203939 93304 -1774
16626 -1774 -138176 -80113 -34226 -45521 65841 222710 319904 224609 124837 61724 83677
16615 83677 51789 35132 55284 -19773 55976 198702 44892 -68684 -72192 -112636 -149530
16604 -149530 -72447 -14295 68184 33062 -46862 -93881 -118256 -151671 -68211 -172631 -281810
16593 -281810 -325172 -278288 -45669 51084 87440 110372 102083 -55866 -170847 51549 80002
$$ packed form
16670a21406K28093J06272j17889j95435N3679L9197L2331j20151l9267J31530
16660c046M013j22137l1551L7461L5293J20593O1225j17104q8935O8419M7647
16649A1878R7603m3070j23415m5952k6162J71835o25M1333j95011n8908J36012
16638c4482r613n233l0718L1067J37483J3278J9409r776K5729O6795j10635r5078
16626a774j36402N8063M5887j1295J11362J56869R7194r5295r9772o3113K1953
16615H3677l1888j6657K0152p5057P5749J42726j53810j13576l508m0444l6894
16604a49530P7083N8152Q2479l5122p9924m7019k4375l3415Q3460j04420j09179
16593b81810m3362M6884K32619R6753L6356K2932q289j57949j14981K22396K8453
$$ plain form
16582 80002 78932 95407 171322 235542 210110 164070 93825 75132 140076 86677 42829 163831
16570 163831 203774 263995 172022 42116 24276 28313 13134 -95887 -122385 -75238 -18498
16559 -18498 -35944 56948 27711 -137841 -107512 34609 -8948 26554 71158 145881 25310
16548 25310 -173067 -115396 -22896 6518 -86165 48637 123783 58183 110850 98745 136941
16537 136941 177863 243322 -63458 -109700 -109572 -87187 37588 144782 166991 94343 78683
16526 78683 -46517 -115480 -137778 3542 25506 58210 38246 21823 -48938 -20292 65291
16515 65291 -15284 -143232 -163599 -100212 -12427 23713 44726 22045 16652 142145 205203
16504 205203 60198 41287 53250 115177 122798 71811 29429 41895 -52278 10640 -15356
$$ packed form
16582H0002j070J6475P5915O4220k5432m6040p0245j8693O4944n3399m3848J21002
16570A63831L9943O0221r1973j29906j7840M037j5179j09021k6498M7147N6740
16559a8498j7446R2892k9237j65552L0329J42121m3557L5502M4604P4723j20571
16548B5310j98377N7671R2500K9414r2683J34802P5146o5600N2667j2105L8196
16537A36941M0922O5459l06780m6242J28K2385J24775J07194K2209p2648j5660
16526G8683j25200o8963k2298J41320K1964L2704j9964j6423p0761K8646Q5583
16515F5291q0575j27948k0367O3387Q7785L6140K1013k2681n393J25493O3058
16504B05203j45005j8911J1963O1927P621n0987m2382J2466r4173O2918k5996
$$ plain form
16493 -15356 115259 167367 165453 98655 -38621 -58499 -88642 -126824 -62608 7738 40000
16482 40000 39326 79157 42033 4978 -140875 -101129 6651 53276 23079 6134 -1149 -19290
16470 -19290 109706 256356 174494 108705 117582 44055 67967 120042 57208 119526 236890
16459 236890 19891 -135522 -156038 -169155 -120796 -229999 -282208 -142797 -130184 -173893 -84190
16448 -84190 -34491 -27422 12048 -62318 -213016 -163076 -184796 -69646 -45302 -54799 -91623 -69327
16436 -69327 -58287 -132615 -94396 -103874 -213766 -56571 22232 -162072 -264861 -257815 -276005
16425 -276005 -243878 -135754 -218434 -83328 -53650 -80984 -102794 -48816 -131800 -227585 -210136
16414 -210136 -254737 -237299 -247516 -276823 -104311 -114347 -180517 -214648 -165407 -173073 -202816
$$ packed form
16493a5356J30615N2108j914o6798j37276j9878l0143l8182O4216P0346L2262
16482D0000o74L9831l7124l7055j45853L9746J07780M6625l0197j6945p283j8141
16470a9290J28996J46650q1862o5789Q877p3527K3912N2075o2834O2318J17364
16459B36890k16999j55413k0516j3117M8359j09203n2209J39411J2613m3709Q9703
16448h4190M9699P069L9470p4366j50698M9940k1720J15150K4344r497l6824K2296
16436f9327J1040p4328L8219r478j09892J57195P8803j84304j02789P046j8190
16425b76005L2127J08124q2680J35106K9678k7334k1810N3978q2984r5785J7449
16414b10136m4601J7438j0217k9307J72512j0036o6170l4131M9241p666k9743
$$ plain form
16403 -202816 -242492 -203332 -177523 -187436 -165624 -2890 33 -68231 44724 114472 -8435
16392 -8435 7395 9910 61168 -136093 -159454 -9277 -16852 59752 78198 151599 113691 47393
16380 47393 13129 -29062 71209 213325 167102 66202 -38904 -54939 31993 59854 80968
16369 80968 108050 97759 131827 92503 -13963 -130244 -105505 -104275 -29514 53429 70642
16358 70642 23866 19164 -28084 -54637 -117362 -178012 -108682 -55637 -104477 -121051 -210013 -235046
16346 -235046 -51171 -69405 -175047 -184811 -156261 -83702 -984 26886 -3168 -126410 -116027
16335 -116027 -141732 -125642 -41315 97851 37028 -3558 -44709 -84824 -90070 -108864 -133752
16324 -133752 -24979 87573 32239 -128644 -231907 -196019 -214956 -198258 -104340 -86586 -75028
$$ packed form
16403b02816l9676L9160K5809r913K1812J62734K923o8264J12955O9748j22907
16392h435J5830K515N1258j97261k3361J50177p575P6604J8446P3401l7908o6298
16380D7393l4264m2191J00271J42116m6223j00900j05106j6035Q6932K7861K1114
16369H0968K7082j0291L4068l9324j06466j16281K4739J230P4761Q2943J7213
16358G0642m6776m702m7248k6553o2725o0650O9330N3045m8840j6574q8962k5033
16346b35046J83875j8234j05642r764K8550P2559Q2718K7870l0054j23242J0383
16335a16027k5705J6090Q4327J39166o0823m0586m1151m0115n246j8794k4888
16324a33752J08773J12552n5334j60883j03263L5888j8937J6698R3918J7754J1558
$$ plain form
16313 -75028 -36432 -25226 44147 146409 72513 24578 -133608 -234264 -89352 62768 188069
16302 188069 69456 -214842 -146618 -73394 -141301 -176329 -145376 -145532 27259 209972 107238
16291 107238 11400 51426 69325 145047 109649 -43127 -31508 66475 14969 128524 17396
16280 17396 -18107 110523 131823 102549 -35589 -89439 -89706 17652 15013 17005 -34917 -162846
16268 -162846 -79281 103125 93749 70587 -23134 -189142 -175582 -89898 26402 -470 -61303
16257 -61303 -118355 -53872 -25654 24165 84648 166132 151490 151176 220282 48962 -116479 -174250
16245 -174250 -174960 -84374 43571 -11087 82209 93742 19579 77745 150354 30318 4819
16234 4819 63491 -124591 -247383 -191810 -118609 32998 64145 70212 33319 21885 -124864
$$ packed form
16313g5028L8596J1206O9373J02262p3896m7935j58186j00656J44912J52120J25301
16302A88069j18613k84298O8224P3224o7907l5028L0953j56J72791J82713j02734
16291A07238r5838M0026J7899P5722l5398j52776J1619R7983n1506J13555j11128
16280A7396l5503J28630K1300k9274j38138n3850k67J07358k639J992n1922j27929
16268a62846Q3565J82406r376k3162r3721j66008J3560Q5684J16300k6872o0833
16257f1303n7052O4483K8218M9819O0483Q1484j4642l14O9106j71320j65441n7771
16245a74250p10R0586J27945n4658R3296J1533p4163N8166P2609j20036k5499
16234D819N8672j88082j22792N5573P3201J51607L1147O067l6893j1434j46749
$$ plain form
16223 -124864 -193087 -222500 -254420 -248166 -212782 -118192 -42533 -12234 -174249 -159881 -181547
16212 -181547 -257373 -202116 -106644 -41164 14642 -8633 -102215 -196319 -114732 -33011 -34711 -29411
16200 -29411 699 -135698 -202198 -144763 -114163 -80169 -13263 -60595 -38774 -21212 -193171
16189 -193171 -291254 -328581 -164593 -49116 160333 308537 243224 120355 -70588 -232644
16179 -232644 -170222 -88159 -87924 -101841 -74905 -42838 -4999 -50621 -246971 -236788 -65303
16168 -65303 -65508 -146685 -97127 -187883 -155692 -160959 -126580 -296223 -250722 -136520 -72073 13224
16156 13224 24914 -46951 -237737 -398643 -326593 -77724 117831 -35811 -242902 -141932
16146 -141932 14514 112547 31020 53895 49551 -14779 -23072 64915 -126 -37907 -24939 51573
$$ packed form
16223a24864o8223k9413l1920O254L5384R4590P5659L0299j62015J4368k1666
16212a81547p5826N5257R5472O5480N5806k3275r3582r4104Q1587Q1721j700N300
16200b9411L0110j36397o6500N7435L0600L3994O6906m7332K1821J7562j71959
16189a93171r8083l7327J63988J15477K09449J48204o5313j22869j90943j62056
16179b32644O2422Q2063K35j3917K6936L2067L7839m5622j96350J0183J71485
16168f5303k05q1177M9558r0756L2191n267L4379j69643M5501J14202O4447Q5297
16156A3224J1690p1865j90786j60906P2050K48869J95555j53642k07091J00970
16146a41932J56446R8033q1527K2875m344o4330q293Q7987o5041l7781J2968P6512
$$ plain form
16134 51573 102873 90903 -8743 -154476 -245893 -164843 -45835 -40779 62904 -2762 -10694
16123 -10694 78611 143125 159700 107766 118298 74743 -36520 -121308 -107922 -30455 79876
16112 79876 112100 149738 60710 17679 -39796 -237325 -322177 -205309 -165537 -69973 140066
16101 140066 238544 219461 265892 206336 256541 304147 228470 109996 23267 -117931 -101481
16090 -101481 18425 38736 19004 -166310 -175482 -205030 -402769 -309049 -89906 19868 -67206
16079 -67206 -209455 -177518 -152641 -269644 -217564 -218044 -126569 -71067 -45872 24255 100092 -79507
16067 -79507 -134299 103124 -3715 -149970 -184246 -161124 25934 32889 14172 33981 113235
16056 113235 109894 -6401 -33598 -77367 -196708 -215340 -234189 -248240 -324571 -388853 -182192
$$ packed form
16134E1573N1300j1970r9646j45733r1417Q1050J19008N056J03683o5666p932
16123a0694Q9305O4514J6575n1934J0532m3555j11263q4788J3386P7467J10331
16112G9876L2224L7638q9028m3031n7475j97529q4852J16868L9772R5564K10039
16101A40066R8478j9083M6431n9556N0205M7606p5677j18474q6729j41198J6450
16090a01481J19906K0311j9732j85314r172k9548j97739R3720K19143J09774q7074
16079f7206j42249L1937K4877j17003N2080m80R1475N5502K5195P0127P5837j79599
16067g9507n4792K37423j06839j46255l4276K3122J87058O955j8717J9809P9254
16056A13235l341j16295k7197m3769j19341j8632j8849j4051p6331o4282K06661
$$ plain form
16045 -182192 -136425 -73332 -53106 -36880 -125473 -140651 -116796 -83521 -114154 -167372 -121801
16034 -121801 30874 214049 86702 39247 58767 -57537 -3521 71687 92333 77702 -102240
16023 -102240 -190137 -171996 -52451 51051 82627 -16927 -190623 -320077 -180090 34670
16013 34670 6411 -6138 -78717 -123910 -164718 -190303 -154097 -147920 -43945 12397 10051 -17517
16001 -17517 40751 82215 23383 55774 125372 263565 213160 187022 94773 24396 -45349
15990 -45349 17258 107122 61201 105434 79909 -61402 -195268 -154804 -60094 118361 268156
15979 268156 184938 97 -143183 -289313 -318140 -180625 -210627 -158254 4913 -53627
15969 -53627 -150299 -200309 -159064 -110795 -101381 -110413 -300903 -407567 -396652 -164481 -55022
$$ packed form
16045a82192M5767O3093K0226J6226q8593j5178K3855L3275l0633n3218M5571
16034a21801J52675J83175j27347m7455J9520j16304N4016P5208K0646j4631j79942
16023a02240q7897J8141J19545J03502L1576r9554j73696j29454J39987K14760
16013C4670k8259j2549p2579m5193m0808k5585L6206O177J03975N6342k346k7568
16001a7517N8268M1464n8832L2391O9598J38193n0405k6138r2249p0377o9745
15990d5349O2607Q9864m5921M4233k5525j41311j33866M0464R4710J78455J49795
15979B68156q3218j84841j43280j46130k8827J37515l0002N2373J63167n8540
15969e3627r6672n0010M1245M8269R414r032j90490j06664J0915K32171J09459
$$ plain form
15958 -55022 -157696 -173654 -153762 -151241 -82234 -9536 -54189 -66696 9856 67351 8102 -142275
15946 -142275 -141025 -7094 56623 18351 30119 56811 -35032 -5216 -70178 -151140 -138608
15935 -138608 -181591 -256278 -170380 -134016 -120643 -64094 -25818 9060 -61677 -95422 -212464
15924 -212464 -152348 -130151 817 80699 -17161 -266595 -181760 -95692 -138380 -122537 -8132
15913 -8132 50120 -43757 -122425 -711 -144176 -75280 84009 96814 -94135 -163872 -143433
15902 -143433 -42943 -42496 -265823 -307805 -213965 -62341 8459 -21127 -110779 -245518 -391926
15891 -391926 -445012 -322179 -206576 -159717 -154546 -165113 -200350 -104490 19877 -66665 -45061
15880 -45061 45525 41341 52294 81447 43269 -56223 34123 55871 99002 71118 28755 8729
$$ packed form
15958e5022j02674j5958J9892K521O9007P2698m4653j2507P6552N7495n9249j50377
15946a42275J250J33931O3717l8272J1768K6692r1843K9816o4962q0962J2532
15935a38608m2983p4687Q5898L6364J3373N6549L8276L4878p0737l3745j17042
15924b12464O0116K2197J30968P9882r7860k49434Q4835Q6068m2688J5843J14405
15913h132N8252r3877p8668J21714j43465O8896J59289J2805j90949o9737K0439
15902a43433J00490M47k23327m1982R3840J51624P0800k9586q9652j34739j46408
15891c91926n3086J22833J15603M6859N171j0567l5237R5860J24367q6542K1604
15880d5061R0586m184J0953K9153l8178r9492R0346K1748M3131k7884m2363k0026
$$ plain form
15868 8729 41946 161529 157795 59119 -19216 42494 101769 26871 16804 58313 -63220 -74538
15856 -74538 -133163 -89692 74476 147489 100271 165695 203406 254703 129341 82392 60270
15845 60270 108876 168239 267735 215582 21291 -108072 -107649 33050 -7999 -105213 -83943
15834 -83943 -107835 -128245 -59411 -58006 20679 104546 126033 113146 167885 123347 -15856 32989
15822 32989 38907 -66127 -31686 14075 40707 104327 64957 -53846 -189136 -144648 -34233
15811 -34233 40077 60584 52344 45237 -50387 -125426 -128159 -203367 -307941 -236978 -258386 -210289
15799 -210289 -102464 9180 -55165 -129419 -106394 -152814 -188909 -142674 -225773 -239085 -179025
15788 -179025 -59489 -84827 -165086 -135477 -66474 72062 227769 347170 337734 134078 -25768
$$ packed form
15868H729L3217J19583l734r8676p8335O1710N9275p4898j0067M1509j21533j1318
15856g4538n8625M3471J64168P3013m7218O5424L7711N1297j25362m6949k2122
15845F0270M8606N9363R9496n2153j94291j29363M23J40699m1049r7214K1270
15834h3943k3892k0410O8834J405P8685Q3867K1487j2887N4739m4538j39203M8845
15822C2989N918j05034L4441M5761K6632O3620l9370j18803j35290M4488J10415
15811c4233P4310K0507q240p107r5624p5039k733p5208j04574P0963k1408M8097
15799b10289J07825J11644o4345p4254K3025m6420l6095M6235q3099j3312O0060
15788a79025J19536k5338q0259K9609O9003J38536J55707J19401r436k03656j59846
$$ plain form
15777 -25768 -85417 -96219 -159027 -198144 -115749 22628 88592 122282 95433 80974 65687
15766 65687 68233 -34930 -70106 -26386 -34186 49352 14048 -214307 -92866 158641 252563
15755 252563 191510 168897 155558 64108 196815 274779 213788 17051 18030 -77002 -111362
15744 -111362 -16987 41921 12596 -12630 2013 -40509 -186058 -185773 -160896 -116650 -272086
15733 -272086 -223909 -40107 14780 197789 134542 -65898 -105340 -93597 -116387 -129682 -97745
15722 -97745 -127355 -191288 -151822 -109756 -30771 -178913 -128332 -15915 -127719 -205000 -185748
15711 -185748 -150828 -261046 -245496 -131507 -10592 59237 -61251 -171499 -274431 -257055
15701 -257055 -201220 -186346 -115028 -143338 -108357 -14737 -60356 -117082 -139749 -130694 -79372 -95473
$$ packed form
15777b5768n9649j0802o2808l9117Q2395J38377O5964L3690k6849j4459j5287
15766F5687K546j03163l5176M3720p800Q3538l5304k28355J21441K51507R3922
15755B52563o1053k2613j3339r1450J32707P7964o0991j96737R79r5032l4360
15744a11362R4375N8908k9325k5226J4643m2522j45549K85K4877M4246j55436
15733b72086M8177J83802N4887J83009o3247k00440l9442J1743k2790j3295L1937
15722i7745k9610o3933L9466M2066P8985j48142N0581J12417j11804p7281J9252
15711a85748L4920j10218J5550J13989J20915O9829j20488j10248j02932J7376
15701b57055N5835J4874P1318k8310L4981R3620m5619n6726k2667R055N1322j6101
$$ plain form
15689 -95473 -36777 -57512 -196150 -206667 -88523 -8225 -88147 -87609 -108684 -141913 -194610 -150326
15677 -150326 -224329 -181170 -116577 84270 93908 -18083 79022 108550 73828 -67056 -233872
15666 -233872 -417100 -328566 -230479 -158023 -18576 27220 -37801 -83917 -70610 130591 173716
15655 173716 140341 154818 177414 127763 75438 121556 105626 123779 142816 66038 42
15644 42 -37386 -99653 -86455 -29469 8365 -4496 71338 48316 109457 231143 409900 418669
15632 418669 207653 179575 6681 -273595 -168795 94133 271012 200288 193531 125223
15622 125223 65707 115489 181297 168049 6615 -60587 -31019 -110933 -91512 -44639 -9991
15611 -9991 -16843 -56058 9359 41478 -21967 58976 46091 76944 10621 56588 99584 34608
$$ packed form
15689i5473N8696k0735j38638j0517J18144Q0298p9922N38k1075l3229n2697M4284
15677a50326p4003M3159O4593K00847R638j11991R7105K9528l4722j40884j66816
15666b33872j83228Q8534R8087P2456J39447M5796o5021m6116J3307K01201M3125
15655A73716l3375J4477K2596m9651n2325M6118j5930J8153J9037p6778o5996
15644D2l7428o2267J3198N6986L7834j2861P5834k3022O1141J21686J78757Q769
15632D18669k11016k8078j72894k80276J04800K62928J76879p0724o757o8308
15622A25223n9516M9782O5808j3248j61434o7202K9568p9914J9421M6873L4648
15611i991o852l9215O5417L2119o3445Q0943j2885L0853o6323M5967M2996o4976
$$ plain form
15599 34608 -86010 -109811 -14708 45185 10929 -112080 -265463 -227534 -77007 5046 193973
15588 193973 214636 56251 37959 154971 218303 213561 155381 208205 220574 150078 -10607
15577 -10607 -64655 -24783 -116430 -144422 -8574 104774 150143 114054 36684 6382 -2777
15566 -2777 -115502 -70091 -79614 -151598 -181589 -195839 -130489 -85061 -110456 -27502 -7969 -30306
15554 -30306 -167946 -166966 -132234 -236982 -255556 -139366 -64298 -55506 26106 41484 -40501 -187519
15542 -187519 -340922 -248118 -189734 -95023 13164 9120 -22462 -5829 -46172 -163589 -47008
15531 -47008 -46153 -75664 -96501 -142323 -77748 -69070 18953 67065 -65351 -31135 -19273 -173408
15519 -173408 -224050 -164825 -42322 15920 100015 76914 35979 -24596 -141015 -141683 -79822
$$ packed form
15599C4608j20618k3801R5103N9893l4256j23009j53383L7929J50527Q2053J88927
15588A93973K0663j58385j8292J17012O3332m742n8180N2824J2369p0496j60685
15577a0607n4048L9872r1647k7992J35848J13348M5369l6089p7370l0302r159
15566b777j12725M5411r523p1984k9991j4250O5350M5428k5395Q2954J9533k2337
15554c0306j37640R80L4732j04748j8574J16190P5068Q792Q1612J5378q1985j47018
15542a87519j53403R2804N8384R4711J08187m044l1582J6633m0343j17417J16581
15531d7008Q55k9511k0837m5822O4575Q678Q8023M8112j32416L4216J1862j54135
15519a73408n0642N9225J22503N8242Q4095k3101m0935o0575j16419o68O1861
$$ plain form
15508 -79822 -106753 -36081 40787 31110 -62358 -57836 -9926 -82233 -60597 -60668 -148243 -66524 116358
15495 116358 134766 194032 90341 28536 -26651 -102916 -158931 -101850 -124435 -65612 24204
15484 24204 -121247 -52116 -13628 93288 36457 15814 23772 13202 -62678 -95779 -146352
15473 -146352 -108924 13119 -61340 -158232 -245323 -98711 -85464 -102602 -49833 17989 21043
15462 21043 104215 189890 217802 57685 806 -56067 -196262 -125620 -142883 -135207 -64233
15451 -64233 -30053 -59307 55584 83396 33060 -87652 -124724 -91571 107949 84425 34336
15440 34336 -12788 -175953 4534 122483 213862 163886 103570 -35413 -60717 -43603 -80982
15429 -80982 -34349 29339 -32009 47957 104463 -21871 -13466 -76850 -130227 -38638 -79398 -57618
$$ packed form
15508g9822k6931P0672P6868r677r3468M522M7910p2307K1636p1q7575Q1719J82882
15495A16358J8408N9266j03691o1805n5187p6265n6015N7081k2585N8823Q9816
15484B4204j45451O9131L8488J06916n6831k0643P958j0570p5880l3101n0573
15473a46352L7428J22043p4459r6892q7091J46612J3247j7138N2769O7822L054
15462B1043Q3172Q5675K7912j60117n6879n6873j40195P0642j7263P676P0974
15451f4233L4180k9254J14891K7812n0336j20712l7072L3153J99520k3524n0089
15440C4336m7124j63165J80487J17949R1379m9976o0316j38983k5304J7114l7379
15429h0982M6633O3688o1348P9966N6506j26334Q405o3384n3377R1589m0760K1780
$$ plain form
15417 -57618 44203 9476 -54690 -237200 -174954 12566 59913 -19060 38758 96358 131716
15406 131716 147750 71493 -14202 -64404 -94034 12650 68864 114091 1468 -44899 -102422
15395 -102422 -143899 -126610 -89368 -89365 -163890 -167046 -66271 58585 108824 -13525 5066 84486
15383 84486 42966 -19100 -42606 -159193 -222711 -178824 -127668 -58020 -62140 -34687 -86208 -118065
15371 -118065 -85788 29041 18491 -103313 -118243 50426 153166 156419 145320 113946 -24152
15360 -24152 -83010 -65702 -54752 -137414 -263486 -176449 92865 132582 60915 195120 252338
15349 252338 144012 -24194 -236968 -240866 -185180 -206646 -176765 -122473 -109082 -115770 -95367
15338 -95367 -143101 -49593 33087 25213 72766 87223 107937 -77648 -249688 -197732 -118890
$$ packed form
15417e7618J01821l4727o4166j82510O2246J87520M7347p8973N7818N7600L5358
15406A31716J6034p6257q5695n0202k9630J06684N6214M5227j12623m6367n7523
15395a02422m1477J7289L7242Lp4525l156J00775J24856N0239j22349J8591P9420
15383H4486m1520o2066k3506j16587o3518M3887N1156O9648m120K7453n1521l1857
15371a18065L2277J14829j0550j21804j4930J68669J02740L253j1099l1374j38098
15360b4152n8858J7308J0950q2662j26072Q7037K69314L9717p1667J34205N7218
15349B52338j08326j68206k12774l898N5686k1466K9881N4292J3391o688K0403
15338i5367m7734R3508Q2680p874M7553J4457K0714j85585j72040N1956P8842
$$ plain form
15327 -118890 -103501 -40423 143923 183191 141489 37402 -91771 -215590 -206572 -206162 -170548
15316 -170548 -194169 -69362 90932 -5763 -137985 -161698 -198521 -206076 -119623 50076 55344
15305 55344 -22379 -54653 -45343 -92554 -77649 -117959 -56157 -3187 9067 -3800 -17496 2502
15293 2502 144567 56477 26487 -101281 -104220 10215 8350 12116 60300 24200 -15318 -9132
15281 -9132 -26610 74356 255729 63050 -85081 -112764 -15409 29989 6406 -46473 -132350
15270 -132350 -234967 -145940 -52649 -10500 89954 93242 64229 114417 120300 69715 155328
15259 155328 259998 220793 80913 -124130 -159670 -95151 -45894 56824 -3909 -91088 -122347
15248 -122347 -166374 -70232 14365 -15605 9914 -28137 85005 121671 50237 62077 -94522
$$ packed form
15327a18890J5389O3078J84346L9268m1702j04087j29173j23819R018M10L5614
15316a70548k3621J24807J60294r6695j32222k3713l6823p555Q6453J69699N268
15305E5344p7723l2274R310m7211J4905m0310O1802N2970J2254j2867j3696J9998
15293B502J42065q8090k9990j27768k939J14435j865L766M8184l6100l9518O186
15281i132j7478J00966J81373j92679j48131k7683R7355M5398k3583n2879q5877
15270a32350j02617Q9027R3291M2149J00454L288k9013N0188N883n0585Q5613
15259A55328J04670l9205j39880k05043l5540O4519M9257J02718o0733q7179l1259
15248a22347m4027R6142Q4597k9970K5519l8051J13142L6666p1434J1840j56599
$$ plain form
15237 -94522 -302553 -318789 -194796 -122879 93875 110924 -69741 -120969 -176330 -145552 -43375
15226 -43375 68710 -23587 55170 73401 -8997 -83248 -48716 128082 230025 151093 126664
15215 126664 142720 28432 7710 73255 -9949 28724 24945 -41198 -5816 83879 217305
15204 217305 227582 166195 38965 26621 57824 -81012 -93653 -31069 -90987 -167154 -136890
15193 -136890 -81628 -103870 -99423 -14626 149641 131203 7646 -67552 -48351 -69381 -81414
15182 -81414 -120024 -96415 -55055 -22586 308 168738 -6539 -55005 -21470 -30748 -147040
15171 -147040 -238440 -126920 79898 17138 -67331 -248804 -366047 -307427 4671 43386
15161 43386 -8253 -61150 -147709 -97437 -5285 6727 -83683 -54402 66588 -40874 -282914
$$ packed form
15237i4522k08031j6236J23993P1917K16754J7049j80665n1228n5361L0778J02177
15226d3375J12085r2297P8757J8231q2398p4251L4532J76798J01943p8932k4429
15215A26664J6056j14288k0722O5545q3204L8673l779o6143L5382Q9695J33426
15204B17305J0277o1387j27230j2344L1203j38836j2641O2584n9918p6167L0264
15193a36890N5262k2242M447Q4797J64267j8438j23557p5198J9201k1030j2033
15182h1414l8610K3609M1360L2469K2894J68430j75277m8466L3535r278j16292
15171a47040r1400J11520K06818o2760q4469j81473j17243N8620L12098L8715
15161D3386n1639n2897q6559N0272R2152J2012r0410K9281J20990j07462k42040
$$ plain form
15150 -282914 -391188 -193417 33347 -32702 -24515 -78386 -45418 62155 86326 43098 -72920
15139 -72920 -101624 -152042 -103092 -252880 -299686 -175930 -156949 -99443 -105760 -105222 -8478 73525
15127 73525 127323 90766 -97347 -148908 3984 32021 -25818 31689 57138 54061 -64009
15116 -64009 -165919 -140456 -56025 109816 77879 -1788 -42374 -43114 -151578 -143242 -59166 -116619
15104 -116619 -48201 -9436 -30220 15624 77754 85347 -2734 47877 29405 -98185 -57613
15093 -57613 -5890 -93220 -174733 -208470 -12486 -19496 -9367 -3694 -7655 92652 104367 70805
15081 70805 86444 48156 39759 221807 277508 259003 147812 41085 37825 129051 33659
15070 33659 -136018 -103985 -179488 -184852 -60976 -140419 -64758 -123860 -262608 -305518 -271770
$$ packed form
15150b82914j08274J97771K26764o6049Q187n3871L2968J07573K4171m3228j16018
15139g2920k8704n0418M8950j49788m6806J23756J8981N7506o317N38R6744Q2003
15127G3525N3798l6557j88113n1561J52892K8037n7839N7507K5449l077j18070
15116f4009j01910K5463Q4431J65841l1937p9667m0586p40j08464Q336Q4076n7453
15104a16619O8418L8765k0784M5844O2130P593q8081N0611j8472j27590M0572
15093e7613N1723q7330q1513l3737J95984p010J0129N673l961J00307J1715l3562
15081G0805J5639l8288q397J82048N5701j8505j11191j06727l260R1226r5392
15070C3659j69677L2033p5503n364J23876p9443P5661n9102j38748m2910L3748
$$ plain form
15059 -271770 -213745 -56067 56354 64728 5394 34839 82734 18406 -127050 -94825 -85392
15048 -85392 -155821 -121247 -100341 -32991 -30125 -123886 -146456 -178980 -8305 9849 23571 159480
15036 159480 175553 36675 110017 157415 86961 102504 157098 119997 130474 134110 114487
15025 114487 171694 156396 137655 135783 228108 243735 11260 -18565 120913 129296 85089
15014 85089 84681 -38168 -159879 -120878 -145197 -192964 -165377 -258299 -257645 -193930 -55322 -34708
15002 -34708 -135035 -181105 -169489 -60558 -56339 -87118 -372 -34290 34753 1523 -22251
14991 -22251 14872 7345 -13603 -91451 -72379 20521 150760 138697 -18508 -31123 -26368 -74107
14979 -74107 -16963 42920 -58515 -61263 -11674 -50157 11185 70518 37685 37292 21443 111399
$$ packed form
15059b71770N8025J57678J12421Q374n9334K9445M7895o4328j45456L2225R433
15048h5392p0429L4574K0906O7350K866r3761k2570l2524J70675J8154J3722J35909
15036A59480J6073j38878P3342M7398p0454J5543N4594l7101J0477L636j9623
15025A14487N7207j5298j8741j872R2325J5627k32475k9825J39478Q383m4207
15014H5089m08j22849j21711L9001k4319m7767K7587r2922O54O3715J38608K0614
15002c4708j00327m6070J1616J08931M219l0779Q6746l3918O9043l3230k3774
14991b2251L7123p527k0948p7848J9072R2900J30239j2063j57205j2615M755m7739
14979g4107N7144N9883j01435k748M9589l8483O1342N9333l2833l93j5849Q9956
$$ plain form
14967 111399 150992 97860 -177302 -364926 -244547 -92200 17188 48828 -32003 84514
14957 84514 37171 36719 -12813 -36822 -104217 -134535 -35489 -7222 24968 7078 12891 -55140
14945 -55140 -23502 -33460 -3638 -124071 -129891 -44287 -10675 -85805 -70573 -71795 -3792 -105224
14933 -105224 -181221 -61438 -64700 -129572 -129050 -121324 -120663 -401 14285 -48205 -189581 -136091
14921 -136091 43251 23395 39184 -8084 -164961 -140480 -154713 -115183 -135350 -94998 82054
14910 82054 5306 -89309 69886 69029 -95205 -57369 -156791 -160653 -105306 -70394 11936 114295
14898 114295 -7809 -137513 -156559 -204827 -60091 126878 193214 78263 131489 117569
14888 117569 27455 -32009 -204281 -135151 -10948 -83439 -223190 -243650 -206733 -47163 -8314
$$ packed form
14967A11399L9593n3132k75162j87624J20379J52347J09388L1640q0831J16517
14957H4514m7343m52m9532k4009o7395l0318R9046K8267L2190j7890N813o8031
14945e5140L1638r958K9822j20433n820Q5604L3612p5130J5232j222O8003j01432
14933a05224p5997J19783l262o4872N22P726O61J20262J4686o2490j41376N3490
14921a36091J79342j9856J5789m7268j56877K4481j4233L9530k0167M0352J77052
14910H2054p6748r4615J59195q57j64234L7836r9422l862N5347L4912Q2330J02359
14898A14295j22104j29704j9046m8268J44736J86969O6336j14951N3226j3920
14888A17569r0114n9464j72272O9130J24203p2491j39751k0460L6917J59570L8849
$$ plain form
14877 -8314 -61355 -40651 -159507 -118310 -12817 51504 147165 271381 196848 -26759 -103668
14866 -103668 -179462 -284718 -260253 -164570 -113084 -42911 52553 121514 88143 4843 -155949
14855 -155949 -121648 -37126 -7724 -2067 -9963 -12866 118594 127716 10437 -29512 -56995 -105254
14843 -105254 -197059 -125623 31516 57727 52424 -76837 -234936 -73786 -166863 -219742 -225923
14832 -225923 -193245 -107701 4248 -71269 -48112 -28431 44394 4632 -124841 -54163 -24990
14821 -24990 -33510 -137413 -108102 -158517 -169780 11317 68092 -91368 -50852 72169 4680
14810 4680 -121972 -70879 -174407 -186421 40201 11116 -30547 -204869 -211046 -157791 -163871
14799 -163871 -197657 -285217 -218324 -2004 2490 -86291 -214613 -138869 4523 6529 46841
$$ packed form
14877h314n3041K0704j18856M1197J05493O4321R5661J24216p4533k23607p6909
14866a03668p5794j05256K4465R5683N1486P0173R5464O8961l3371q3300j60792
14855a55949L4301Q4522K9402N657p896k903J31460R122j17279l9949k7483m8259
14843a05254r1805P1436J57139K6211n303j29261j58099J61150r3077n2879o181
14832b25923L2678Q5544J11949p5517K3157J9681P2825l9762j29473P0678K9173
14821b4990q520j03903K9311n0415j1263J81097N6775j59460M0516J23021o7489
14810D680j26652N1093j03528j2014K26622k9085m1663j74322o177N3255o080
14799a63871l3786q7560O6893K16320M494q8781j28322P5744J43392K006M0312
$$ plain form
14788 46841 129535 134670 185007 249337 275860 117280 1447 17280 57527 28165 -29531
14777 -29531 -17263 -22651 67258 63941 -41559 -96205 -100029 -15269 28928 -16702 -5051 37821
14765 37821 -23317 -119423 -100566 -92449 6435 42095 -36880 -53557 103452 103944 -7089 69089
14753 69089 133420 230708 186849 218500 355949 235259 127984 -73676 -216254 -150975 -62869
14742 -62869 42080 -17057 -85305 -150239 -141997 -92559 -169462 -78095 2071 -47051 -46178 48156
14730 48156 17652 -19916 39231 60037 147174 92020 67739 101694 -21027 44129 49413 -43460
14718 -43460 30803 224473 219501 287017 356562 253635 233655 130616 44963 148768 152982
14707 152982 137234 3908 51021 85218 142151 64377 -106706 -90635 -77197 -111111 -76564
$$ packed form
14788D6841Q2694N135N0337O4330K6523j58580j15833J5833M0247k9362n7696
14777b9531J2268n388Q9909l317j05500n4646l824Q4760M4197m5630J1651M2872
14765C7821o1138r6106J8857Q117R8884L5660p8975j6677J57009M92j11033P6178
14753F9089O4331R7288m3859L1651J37449j20690j07275k01660j42578O5279Q8106
14742f2869J04949n9137o8248o4934Q242M9438p6903R1367Q0166m9122Q73R4334
14730D8156l0504l7568N9147K0806Q7137n5154k4281L3955j22721O5156N284r2873
14718d3460P4263J93670m972O7516O9545j02927j9980j03039q5653J03805M214
14707A52982j5748j33326M7113L4197N6933p7774j71083J6071J3438l3914L4547
$$ plain form
14696 -76564 6067 -80759 -44083 29240 197440 304687 327046 237487 -9186 33440 154668
14685 154668 169362 105304 49824 29997 -47183 1624 93144 123850 188075 163991 83713
14674 83713 168199 171104 29766 -109462 -195018 -127308 -67700 35737 115737 106972 33556
14663 33556 24504 -38863 42048 9035 102745 147448 38030 128110 246420 309092 257514
14652 257514 60061 -145404 -259005 -186979 -150554 -68930 -79555 -54184 -134519 -135222 -118703
14641 -118703 39327 51330 3133 9169 -6096 37344 111536 190036 130043 177175 138072
14630 138072 -100651 -13530 -15305 -137367 -152289 -97385 -139967 -31043 -607 -83704 -217191
14619 -217191 -159380 -54510 36302 52931 28342 -69889 -63353 -26868 -90959 7821 97761
$$ packed form
14696g6564Q2631q6826L6676P3323J68200J07247K2359q9559k46673M2626J21228
14685A54668J4694o4058n5480j9827p7180M8807R1520L0706O4225k4084q0278
14674H3713Q4486K905j41338j39228q5556O7710N9608J03437Q0000q765p3416
14663C3556r052o3367Q0911l3013R3710M4703j09418R0080J18310O2672n1578
14652B57514j97453k05465j13601P2026L6425Q1624j0625K5371q0335p03J6519
14641a18703J58030J2003m8197O036j5265M3440P4192P8500n9993M7132l9103
14630A38072k38723Q7121j775j22062j4922N4904m2582J08924L0436q3097j33487
14619b17191N7811J04870R0812J6629k4589r8231O536L6485o4091R8780Q9940
$$ plain form
14608 97761 72313 143105 174181 91767 104340 218853 190815 195356 124938 41489 -34604 -99747
14596 -99747 -77592 21006 28095 39663 46289 292926 436140 322043 100746 35703 -72815
14585 -72815 -45249 39618 124236 -75069 -114016 -96945 -236117 -101226 42914 15637 63993
14574 63993 -35878 -157034 -235629 -239141 -247498 -56432 80422 68078 25355 25062 6217 -127348
14562 -127348 -191304 -71885 -199972 -201670 -177776 -149702 -109723 -208604 -288684 -241363 -208159
14551 -208159 -201437 -274681 -288020 -176142 22590 6491 -160114 -180573 -242591 -217692 -187465
14540 -187465 -113132 -130455 -64581 -121370 -148115 26440 108112 140230 88175 -37292 -89274
14529 -89274 -29835 -55128 -118434 -121415 -60559 -118397 -192983 -164919 -54174 -108694 -70482 13214
$$ packed form
14608I7761k5448P0792L1076q2414J2573J14513k8038M541p0418q3449p6093o5143
14596i9747K2155R8598P089J1568O626K46637J43214j14097k21297o5043j08518
14585g2815K7566Q4867Q4618j99305l8947J7071j39172J34891J44140k7277M8356
14574F3993r9871j21156p8595l512q357J91066J36854j2344m2723k93j8845j33565
14562a27348o3956J19419j28087j698K3894K8074L9979r8881q0080M7321L3204
14551b08159O722p3244j3339J11878J98732j6099j66605k0459o2018K4899L0227
14540a87465P4333j7323O5874n6789k6745J74555Q1672L2118n2055j25467n1982
14529h9274N9439k5293o3306k981O0856n7838p4586K8064J10745n4520L8212Q3696
$$ plain form
14517 13214 30961 70269 16507 -80771 -159030 -113319 108667 171364 126770 126561 144150 71581
14505 71581 48381 97015 -28722 -129180 -198694 -120176 -13144 -63321 -140623 -135519 -247784
14494 -247784 -214632 -161534 -227785 -155061 -131460 7399 -3854 -52368 -49180 -98762 -203701
14483 -203701 -250099 -281577 -252706 -216427 -128732 -137034 -173912 -209760 -139310 -66933 68700
14472 68700 62852 67006 4330 -105647 -356157 -372654 -295432 -92155 -119504 -124465 -108390 -126140
14460 -126140 13947 -115405 -119295 -56194 3556 -14573 -37477 -63187 -163284 -279225 -118728
14449 -118728 74453 31108 -58530 -150746 -187553 -152378 -205861 -246464 -153458 -94999 -126524
14438 -126524 -126307 1189 1545 130737 60478 129880 241084 116675 96312 80646 12807
$$ packed form
14517A3214J7747L9308n3762r7278p8259M5711K21986O2697m4594k09J7589p2569
14505G1581k3200M8634j25737j00458o9514P8518J07032n0177p7302N104j12265
14494b47784L3152N3098o6251P2724K3601J38859j1253m8514L188m9582j04939
14483b03701m6398l1478K8871L6279Q7695q302l6878l5848P0450P2377J35633
14472F8700n848M154o2676j09977k50510j6497P7222K03277k7349m961J6075j7750
14460a26140J40087j29352l890O3101N9750j8129k2904k5710j00097j15941J60497
14449a18728J93181m3345q9638r2216l6807L5175n3483m0603R3006N8459l1525
14438a26524K17J27496L56J29192p0259O9402J11204j24409k0363j5666o7839
$$ plain form
14427 12807 -24142 -109779 -117653 -66992 -202860 -175387 -122195 -55107 13517 -14768 -30769 71358
14415 71358 69420 114414 103645 64896 81040 174706 172601 127251 155278 63907 81642 139729
14403 139729 249154 175575 43114 17345 -56620 -79924 -70679 22452 51199 101120 65892
14392 65892 26221 -27020 -50801 88671 120076 60402 -172968 -189565 -107768 -115584 -114874 -102859
14380 -102859 -95111 -55311 -4271 39002 -11489 102313 52873 -54849 -188404 -195800 -186600
14369 -186600 -163588 -58251 17963 70631 -35631 39760 -5590 -76758 15415 26512 -72230
14358 -72230 -62493 -126132 -120298 -129926 -25240 138843 183790 209543 179771 82882 16248 -2991
14346 -2991 70524 60943 -111946 -158142 -41607 88190 65656 -129181 -128795 -81504 -99563 -30895
$$ packed form
14427A2807l6949q5637p874N0661j35868K7473N3192O7088O8624k8285j6001J02127
14415G1358j938M4994j0769l8749J6144R3666k105m5350K8027r1371J7735N8087
14403A39729J09425p3579j32461k5769p3965k3304R245R3131K8747M9921l5228
14392F5892l9671n3241k3781J39472L1405n9674k33370j6597Q1797p816P10J2015
14380a02859P748L9800N1040M3273n0491J13802m9440j07722j33555p396R200
14369a86600K3012J05337P6214N2668j06262P5391m5350p1168R2173J1097r8742
14358g2230R737o3639N834r628J04686J64083M4947K5753k9772r6889o6634j9239
14346b991P3515r581j72889m6196J16535J29797k2534j94837L86M7291j8059O8668
$$ plain form
14334 -30895 -41055 -45794 -5137 -3782 -28667 -101522 -210798 -168496 -31220 129833 191371
14323 191371 188861 239206 342837 309873 231394 168775 90840 165353 119984 -15885 -85891
14312 -85891 -89363 -37736 66654 127012 160130 166274 50620 11556 2146 34658 34993 -163
14300 -163 -5454 41564 122031 109393 66591 82175 45250 100895 258373 179428 111502 -22287
14288 -22287 -83888 -120184 -136410 -55697 94276 154463 129800 -50338 -203956 -227531 -264277
14277 -264277 -144436 -53021 53634 132365 205480 79209 6235 -19579 129989 165278 163279
14266 163279 115705 111266 152329 21269 -80634 -60795 38279 59760 -5956 -145009 -221114
14255 -221114 -273115 -223751 -195758 -144935 -80764 -23890 -4768 108392 -21158 -77179 -42729
$$ packed form
14334c0895j0160m739M0657J355k4885p2855j09276M2302J37276J61053O1538
14323A91371k510N0345J03631l2964p8479o2619p7935P4513m5369j35869p0006
14312h5891l472N1627J04390O0358L3118O144j15654l9064r410L2512L35l5156
14300a63n291M7018Q0467j2638m2802J5584l6925N5645J57478p8945o7926j33789
14288b2287o1601l6296j6226Q0713J49973O0187k4663j80138j53618k3575l6746
14277b64277J19841R1415J06655P8731P3115j26271p2974k5814J49568L5289j999
14266A63279m7574m439M1063j31060j01903J9839R9074K1481o5716j39053p6105
14255b21114n2001M9364K7993N0823O4171N6874J9122J13160j29550n6021L4450
$$ plain form
14244 -42729 60221 47423 46112 131291 155837 51532 41018 14390 12546 -115551 -164895
14233 -164895 -21721 -2734 -72312 -91617 -169683 -136820 -41781 -184582 -167418 -38350 -20951
14222 -20951 -28616 -29721 -78516 25170 17268 -80981 4152 80258 44772 -908 62291 34350
14210 34350 -25777 -99302 -48212 -42687 -29194 81897 193004 296633 84140 -76364 -197417
14199 -197417 -246283 -210559 -213915 -289364 -221682 -82233 -2091 -68196 -66074 58738 -20750
14188 -20750 -76443 27984 128523 51829 33863 26855 -62979 -101595 -100027 -10893 -46549 -127381
14176 -127381 -37033 17886 -112885 -95109 -75964 23857 9798 31042 82348 59159 -30758
14165 -30758 -149319 -54680 -108976 -141835 -234088 -307973 -217970 -134039 -195109 -133463 -159571
$$ packed form
14244d2729J02950j2798j311Q5179K4546j04305j0514k6628j844j28097m9344
14233a64895J43174J8987o9578j9305p8066L2863R5039j42801J7164J29068J7399
14222b0951p665j105m8795J03686p902r8249Q5133P6106l5486m5680O3199k7941
14210C4350o0127p3525N1090N525J3493J11091J11107J03629k12493j60504j21053
14199a97417m8866L5724l356p5449O7682J39449Q0142o6105K122J24812p9488
14188b0750n5693J04427J00539p6694j7966p008q9834l8616J568Q9134l5656q0832
14176a27381R0348N4919j30771J7776J9145R9821j4059K1244N1306k3189q9917
14165c0758j18561R4639n4296l2859r2253p3885R0003Q3931o1070O1646k6108
$$ plain form
14154 -159571 -77583 -64497 -171309 -105095 43559 -8870 -178042 -136048 -78768 -70493 -46954
14143 -46954 27599 -75547 -99770 -135845 -89729 7661 -8337 -78808 -33637 7587 -109758
14132 -109758 -85634 -23961 -43114 -51918 -38644 -93441 -84903 -126699 -53059 62077 -18140 -157972
14120 -157972 -209032 -75680 40044 26437 74454 14574 -76336 -174853 -57399 13428 -19251
14109 -19251 -121297 -120448 -50135 -61844 11352 75063 71276 4575 -28674 43151 47534 22805
14097 22805 -66608 -43285 -72116 -18898 -80846 -204983 -194394 -147905 -109880 -21187 72272
14086 72272 111686 3354 82761 139688 134660 185416 275158 120639 157996 54216 60827
14075 60827 78232 -8145 -93046 -72008 -2912 98791 -70996 -30477 -16788 -25829 94220
$$ packed form
14154a59571Q1988J3086j06812O6214J48654n2429j69172M1994N7280Q275K3539
14143d6954P4553j03146k4223l6075M6116R7390j5998p0471M5171M1224j17345
14132a09758K4124O1673j9153q804J3274n4797Q538m1796P3640J15136q0217j39832
14120a57972n1060J33352J15724j3607M8017n9880r0910r8517J17454P0827l2679
14109a9251j02046Q49P0313j1709P3196O3711l787o6701l3249P1825M383k4729
14097B2805q9413K3323k8831N3218o1948j24137J0589M6489L8025Q8693R3459
14086G2272L9414j08332P9407N6927n028N0756Q9742j54519L7357j03780O611
14075F0827J7405q6377q4901K1038O9096J01703j69787M0519J3689r041J20049
$$ plain form
14064 94220 46575 -98173 -94222 12329 16822 -92230 -135352 -110397 27736 -56318 -59853
14053 -59853 -13133 2290 -19034 -12763 -48128 -117626 -59591 -60917 4115 187137 194146 -61153
14041 -61153 -118145 14207 -139433 -63030 124468 131871 129375 94656 155202 116490 79209
14030 79209 6093 -49487 14695 -55378 -3097 94990 114103 248905 288990 232090 113441
14019 113441 49059 -75324 -109837 -88004 -154634 -117137 95370 12850 -172843 -131781 -42644
14008 -42644 20584 -40762 -102259 -59492 43260 -34268 -191021 -211966 -102196 -82572 -10974
13997 -10974 119145 -21110 -93112 -124319 27255 56908 125466 95417 -95189 -232840 -35647
13986 -35647 32420 30887 88650 68683 135062 122013 65326 35527 142991 186192 175381 120721
$$ packed form
14064I4220m7645j44748L951J06551M493j09052m3122K4955J38133q4054l535
14053e9853M6720J5423k1324O271l5365o9498N8035j326O5032J83022P009k55299
14041f1153n6992J32352j53640P6403J87498P403k496l4719O0546l8712l7281
14030G9209p3116n5580O4182p0073N2281R8087J9113J34802M0085n6900j18649
14019A13441o4382j24383l4513K1833o6630L7497K12507q2520j85693M1062Q9137
14008d2644O3228o1346o1497M2767J02752p7528j56753k0945J09770J9624P1598
13997a0974J30119j40255p2002l1207J51574K9653O8558l0049j90606j37651J97193
13986c5647O8067j533N7763j9967O6379j3049n6687k9799J07464M3201j0811n4660
$$ plain form
13974 120721 218113 212060 93550 36631 210 14258 -82004 1677 63112 111441 37609
13963 37609 -61599 -151460 -162195 -102276 -43650 66715 59615 81025 100625 86801 67712 27064
13951 27064 70951 46591 -106836 -162143 -94872 -106283 -130094 -177589 -131812 9681 -44051
13940 -44051 -111919 -25957 156133 204681 85908 106017 108894 7458 -129380 -129677 -223241
13929 -223241 -238286 -70522 -26994 -20466 25964 -39498 -131359 -59978 111590 185100 227080
13918 227080 265 -79360 -84228 -174725 -211389 -335066 -407223 -136592 119199 161349 125606
13907 125606 214060 170879 68278 -22062 45074 128619 222692 267531 193684 160039 260272
13896 260272 209564 58741 -64186 -12882 25693 161898 200650 1073 -168241 -289952
$$ packed form
13974A20721R7392o053j18510n6919l6421J4048r6262Q3681O1435M8329p3832
13963C7609r9208q9861j0735N9919N8626J10365p100K1410J9600j3824j9089m0648
13951B7064M3887k4360j53427n5307O7271j1411k3811m7495M5777J41493n3732
13940d4051o7868Q5962J82090M8548j18773K0109K877j01436j36838k97r3564
13929b23241j5045J67764M3528O528M6430o5462r1861P1381J71568P3510M1980
13918B27080k26815p9625m868r0497l6664j23677p2157K70631K55791M2150l5743
13907A25606Q8454m3181j02601r0340O7136Q3545R4073M4839p3847l3645J00233
13896B60272n0708j50823j22927N1304L8575J36205L8752j99577j69314j21711
$$ plain form
13886 -289952 -206067 -58536 8702 47092 127614 24704 160501 174554 64695 24985 -92071
13875 -92071 -57730 -199157 -220031 -213432 -135451 -78778 -73831 -17856 -14616 38665 81240 15700
13863 15700 185583 248102 234517 122265 39651 -24867 -68835 -5199 181127 259386 156184
13852 156184 143370 195400 45591 -4945 93633 179261 216041 99925 41793 43681 -32774
13841 -32774 -76786 21069 84295 51176 -10474 -52249 -187373 -53058 -25655 -4322 52406
13830 52406 83419 51299 63387 122646 125048 159520 191568 88443 61917 119107 96454 153585
13818 153585 126398 35718 89737 85235 3093 -22379 -13113 -40827 -71603 -90480 -15978 -55647
13806 -55647 -48428 -68552 -91338 -74082 -183085 -199831 -138289 -164190 -115405 -26918 14712 5845
$$ packed form
13886b89952Q3885J47531O7238L8390Q0522j02910J35797J4053j09859l9710j17056
13875i2071L4341j41427k0874O599P7981N6673M947N5975L240N3281M2575o5540
13863A5700J69883O2519j3585j12252q2614o4518m3968O3636J86326P8259j03202
13852A56184j2814N2030j49809n0536R8578Q5628L6780j16116n8132J888p6455
13841c2774m4012R7855O3226l3119o1650m1775j35124J34315K7403K1333N6728
13830E2406L1013l2120J2088N9259K402L4472L2048j03125k6526N7190k2653N7131
13818A53585k7187r0680N4019m502q2142k5472R266k7714l0776j8877P4502l9669
13806e5647P219k0124k2786J7256j09003j6746O1542k5901M8785Q8487M1630q867
$$ plain form
13794 5845 -28142 -6044 6888 -44122 -122675 -52057 15489 -50084 -38477 -63015 -6043 -73538
13782 -73538 114619 206172 95359 228391 313490 299543 81708 20841 122553 88138 -106942
13771 -106942 -167520 -44835 -120242 -242372 -104813 49250 -55398 -66876 -12007 -38154
13761 -38154 18930 106170 116512 32877 -85041 -105709 -97355 -48874 18651 61923 188744
13750 188744 264894 185876 197054 190400 109893 95566 31804 31246 119932 54185 -5099 25918
13738 25918 113896 126256 98321 14918 83079 204550 103587 33338 155711 191396 77588
13727 77588 -7537 72129 22604 38796 145987 180295 117873 13059 201503 176433 -39890
13716 -39890 -84791 -146700 -114592 -63005 -73163 12371 91524 97539 50634 47068 -136807 -246912
$$ packed form
13794E845l3987K2098J2932n1010p8553P0618O7546o5573J1607k4538N6972o7495
13782g3538J88157R1553j10813J33032Q5099j3947k17835o0867J01712l4415j95080
13771a06942o0578J22685p5407j22130J37559J54063j04648j1478N4869k6147
13761c8154N7084Q7240J0342q3635j17918k0668Q354M8481O7525M3272J26821
13750A88744P6150p9018J1178o654q0507j4327o3762n58Q8686o5747n9284L1017
13738B5918Q7978J2360k7935q3403O8161J21471j00963p0249J22373L5685j13808
13727G7588q5125P9666m9525J6192J07191L4308o2422j04814J88444k5070k16323
13716c9890m4901o1909L2108N1587j0158Q5534P9153O015m6905l566j83875j10105
$$ plain form
13704 -246912 -213216 -271553 -259926 -185882 -91981 -69874 -78447 63443 122650 -22493 -65424
13693 -65424 -139152 -227947 -253340 -160290 -81297 -49682 -148492 -295195 -292986 -88113 61918
13682 61918 -46462 -11103 66616 -133627 -105461 -25931 51246 -40424 37465 63501 54941
13671 54941 94738 219405 290541 206050 158141 73697 16107 -21742 -14261 35 -29029 20419
13659 20419 232157 147639 -65006 -187478 -161695 -46137 -177425 -191096 -131123 -5640
13649 -5640 86065 -110725 -204393 -167181 5809 196929 3145 -143682 -65960 13570 144160
13638 144160 124577 -14143 -166222 -220352 -109571 -105156 -124050 19386 8679 -12488 -52331
13627 -52331 -143547 -50879 -48635 -130688 -2279 237539 203366 84781 151841 27566 74122
$$ packed form
13704b46912L3696n8337J1627P4044R3901K2107q573J41890N9207j45143m2931
13693f5424p3728q8795k5393R3050P8993L1615r8810j46703K209K04873J50031
13682F1918j08380L5359P7719k00243K8166P9530P7177r1670P7889K6036q560
13671E4941L9797J24667P1136q4491m7909q4444n7590l7849P481J4296k9064M9448
13659B0419K11738q4518k12645j22472K5783J15558j31288j3671N9973J25483
13649e640R1705j96790r3668L7212J72990J91120j93784j46827P7722P9530J30590
13638A44160j9583j38720j52079n4130J10781M415j8894J43436j0707k1167l9843
13627e2331r1216R2668K244q2053J28409K39818l4173j18585O7060j24275M6556
$$ plain form
13616 74122 114653 -28478 -79056 -123621 -212397 -218380 -56541 50880 -13350 78763 103736
13605 103736 -63478 -100177 -205524 -125505 -15573 -59589 -107228 -84392 11649 -4514 -2432
13594 -2432 47316 76130 65613 68300 -57636 -15183 -28980 -55560 -56969 -132849 9097 130811
13582 130811 164526 110328 35935 -14849 -84517 -115542 -98935 -84813 62021 70672 -162392
13571 -162392 -235931 -162816 -156985 -177689 -141899 15586 111184 58002 -21405 -18129 6729 -11244
13559 -11244 -98707 -163183 -211392 -196688 -197544 -197833 -187626 -241366 -328765 -406084 -219385 52395
13547 52395 30430 -129173 -142663 -108894 -67967 -90629 -199649 -141918 -154646 -257789 -134904
13536 -134904 -152793 -196032 -172072 -114073 -11823 -92195 -133991 -43234 29565 24039 15689 15491
$$ packed form
13616G4122M0531j43131n0578m4565q8776n983J61839J07421o4230R2113K4973
13605A03736j67214l6699j05347Q0019J09932m4016m7639K2836R6041j6163K082
13594b432M9748K8814j0517K687j25936M2453j3797k6580j409p5880J41946J21714
13582A30811L3715n4198p4393n0784o9668l1025J6607J4122J46834Q651k33064
13571a62392p3539P3115N831k0704L5790J57485R5598n3182p9407L276K4858j7973
13559a1244q7463o4476m8209J4704q56k89J0207n3740q7399p7319J86699K71780
13547E2395k1965j59603j3490L3769M0927k2662j09020N7731j2728j03143J22885
13536a34904j7889m3239K3960N7999J02250q0372m1796R0757P2799n526q350j98
$$ plain form
13524 15491 39845 83769 193265 273855 322656 282369 118369 21427 68404 -91509 -189635
13513 -189635 -71714 27154 32684 77174 103347 67828 50809 101971 -17970 -169579 -79995
13502 -79995 97743 219419 183609 68010 44354 128118 336604 402970 333814 115947 117452
13491 117452 128047 59735 72922 221381 259281 169882 -43127 -134345 -204156 -253236 -196311
13480 -196311 -102948 -25844 -6531 34081 143595 167088 240436 172717 152263 82167 123754
13469 123754 157106 -51599 -205228 -196501 -99123 -70044 -146706 -149557 -67500 -53597 -18115
13458 -18115 -45115 115142 123366 7488 82487 123289 14017 -85982 -54918 -126294 -193729
13447 -193729 -350492 -201229 40874 237978 168468 55382 84753 99786 126370 76227
$$ packed form
13524A5491K4354M3924J09496Q0590M8801m0287j64000r6942M6977j59913r8126
13513a89635J17921R8868N530M4490K6173l5519j7019N1162j19941j51609Q9584
13502g9995J77738J21676l5810j15599k3656Q3764K08486O6366o9156k17867J505
13491A17452J0595o8312J3187J48459L7900q9399k13009r1218o9811m9080N6925
13480a96311R3363P7104J9313M0612J09514K3493P3348o7719k0454p0096M1587
13469A23754L3352k08705j53629Q727R7378K9079p6662k851Q2057J3903L5482
13458a8115k7000J60257Q224j15878P4999M0802j09272r9999L1064p1376o7435
13447a93729j56763J49263K42103J97104o9510j13086K9371J5033K6584n0143
$$ plain form
13437 76227 111149 122719 125756 97701 49478 26272 144020 103354 68006 -53429 -55528 -43280
13425 -43280 69694 77314 24728 46022 -77249 -102894 -52602 -74592 -159837 -144429 -118866
13414 -118866 -30416 96309 19765 -80499 -114977 -103455 -141208 -189705 -196774 -110477 -35149
13403 -35149 -139091 -131055 -37689 -33728 -100849 -88927 -101074 -165584 -200110 -235419 -30908 73753
13391 73753 230792 236063 74332 32002 20927 10132 -17076 35802 -16098 -11280 -664 67898
13379 67898 -78604 -188738 -170062 -80880 -62039 -114656 51286 40037 -96596 -163286 -162081
13368 -162081 2762 28781 -12236 19304 88974 116520 27888 -164851 -277665 -221860 -132862
13357 -132862 -110709 -201010 -239337 -213861 -153368 -5439 179656 168342 140452 2408 -13691
$$ packed form
13437G6227L4922J1570L037k8055m8223k3206J17748m0666l5348j21435k099J2248
13425d3280J12974P620n2586K1294j23271k5645N0292k1990q5245J5408K5563
13414a18866Q8450J26725p6544j00264l4478J1522l7753m8497p069Q6297P5328
13403c5149j03942Q036R3366L961o7121J1922j2147o4510l4526l5309K04511J04661
13391G3753J57039N271j61731m2330j1075j0795k7208N2878n1900M818J0616O8562
13379F7898j46502j10134J8676Q9182J8841n2617J65942j1249j36633o6690J205
13368a62081J64843K6019m1017L1540O9670K7546q8632j92739j12814N5805Q8998
13357a32862K2153r0301l8327K5476O0493J47929J85095j1314k7890j38044j6099
$$ plain form
13346 -13691 -61421 -61501 30463 32085 99603 161021 165712 219900 212472 114754 68889 -10025 -9513
13333 -9513 -102759 -262164 -285016 -80552 -26519 71708 26855 -30407 -143553 -114459 64405
13322 64405 140766 119630 63003 6261 -86552 -159741 -141951 19076 96086 193565 142002
13311 142002 62548 26684 26488 100492 -29548 -135942 -143922 -147099 -92129 -126815 37494 184084
13299 184084 160674 148667 68224 5927 137045 292700 363193 203225 -16516 41143 66690
13288 66690 -13019 -46629 15132 165589 268610 238766 186348 183098 182540 -4898 -66434 -119186
13276 -119186 -183212 -5468 70994 -65707 -201627 -106700 74922 38458 83556 218131
13266 218131 213344 262232 305699 316423 252604 241799 248655 169292 51395 61009 62087 91903
$$ packed form
13346a3691m7730q0R1964J622O7518O1418M691N4188p428r7718m5865p8914N12
13333i513r3246j59405k2852K04464N4033R8227m4853n7262j13146K9094J78864
13322F4405P6361k1136n6627n6742r2813p3189J7790J61027P7010R7479n1563
13311A42002p9454l5864j96P4004j30040j06394p980l177N4970l4686J64309J46590
13299A84084k3410j2007q0443o2297J31118J55655P0493j59968k19741N7659K5547
13288F6690p9709l3610O1761J50457J03021k9844n2418l250n58j87438o1536n2752
13276a19186o4026J77744P6462j36701j35920R4927J81622l6464M5098J34575
13266B18131m787M8888M3467J0724o3819j0805O856p9363j17897R614J078K9816
$$ [...]
##END NTUPLES=NMR SPECTRUM
##END=
