##TITLE=Analysis number 326310
Compound Code btb 01378
Project Code adrs
Chemist Name aci
##JCAMPDX= 6.0         $$ Bruker NMR JCAMP-DX V2.0
##DATA TYPE= NMR SPECTRUM
##DATA CLASS= NTUPLES
##ORIGIN= Bruker BioSpin GmbH
##OWNER= nmr
$$ XWIN-NMR		Version 3.5
$$ Thu Feb  1 11:13:00 2007 GMT Standard Time (UT+0h)  MAYBRIDGE\nmr@NMR_250MHZ
##.OBSERVE FREQUENCY= 250.131544655141
##.OBSERVE NUCLEUS= ^1H
##.ACQUISITION MODE= SIMULTANEOUS (DQD)
##.ACQUISITION SCHEME= undefined
##.AVERAGES= 16
##.DIGITISER RES= 18
##SPECTROMETER/DATA SYSTEM= dpx250
##.PULSE SEQUENCE= zg30
##.SOLVENT NAME= DMSO
##.SHIFT REFERENCE= (INTERNAL, DMSO, 0, 16.522)
##AUDIT TRAIL= $$ (NUMBER, WHEN, WHO, WHERE, WHAT)
$$ ##TITLE= Audit trail, XWIN-NMR		Version 3.5
$$ ##JCAMPDX= 5.01
$$ ##ORIGIN= Bruker BioSpin GmbH
$$ ##OWNER= nmr
$$ C:\u/data/dgb/nmr/ADRS/60/pdata/1/auditp.txt
$$ ##AUDIT TRAIL=  $$ (NUMBER, WHEN, WHO, WHERE, WHAT)
(   1,<2007-02-01 11:12:35.11 +000>,<MAYBRIDGE\nmr>,<NMR_250MHZ>,
      <created by zg, POWCHK disabled, PULCHK disabled
       configuration hash MD5:
       49 4B E0 1D 92 C2 6B 37 9F E6 65 BC 52 41 86 1D
       data hash MD5: 64K
       5E 34 EC FD 03 14 4F 0C F2 EA D7 E9 99 2F 9D 44>)
(   2,<2007-02-01 11:12:49.92 +000>,<MAYBRIDGE\nmr>,<NMR_250MHZ>,
      <Start of raw data processing
       ef LB = 0.3 FT_mod = 6 PKNL = 1 SI = 32K 
       data hash MD5: 32K
       35 BB 26 5B 3C 01 DC FD 9B E2 52 39 73 21 70 36>)
(   3,<2007-02-01 11:12:51.58 +000>,<MAYBRIDGE\nmr>,<NMR_250MHZ>,
      <apk 
       data hash MD5: 32K
       9F B8 57 AF 7E 0F A4 36 FE 54 C1 79 75 28 AC BE>)
(   4,<2007-02-01 11:12:52.33 +000>,<MAYBRIDGE\nmr>,<NMR_250MHZ>,
      <abs ABSG = 5 
       data hash MD5: 32K
       8A 4F 0A A1 E7 E3 40 F1 25 5B 4E 73 E3 AC DE 88>)
$$ ##END=
$$ 
$$ hash MD5
$$ D2 28 65 21 07 8A DF 61 B5 E3 FD 6E 12 AD D6 00
##$RELAX= 
##$RELAX= 
##$RELAX= 
##$RELAX= 
##$RELAX= 
##$RELAX= 
##$RELAX= 
$$ Bruker specific parameters
$$ --------------------------
##$DU= <C:\u>
##$EXPNO= 60
##$NAME= <ADRS>
##$PROCNO= 1
##$TYPE= <nmr>
##$USER= <dgb>
##$AMP= (0..31)
100 100 100 100 100 100 100 100 100 100 100 100 100 100 100 100 100 100 
100 100 100 100 100 100 100 100 100 100 100 100 100 100 
##$AQSEQ= 0
##$AQ_mod= 3
##$AUNM= <au_zg>
##$AUTOPOS= <48 >
##$BF1= 250.13
##$BF2= 250.13
##$BF3= 250.13
##$BF4= 250.13
##$BF5= 500.13
##$BF6= 500.13
##$BF7= 500.13
##$BF8= 500.13
##$BYTORDA= 1
##$CFDGTYP= 0
##$CFRGTYP= 5
##$CHEMSTR= <none>
##$CNST= (0..31)
1 1 145 1 1 1 1 1 1 1 1 1 1 1 1 1 1 1 1 1 1 1 1 1 1 1 1 1 1 1 1 1 
##$CPDPRG= <>
##$CPDPRG1= <>
##$CPDPRG2= <>
##$CPDPRG3= <>
##$CPDPRG4= <mlev>
##$CPDPRG5= <mlev>
##$CPDPRG6= <mlev>
##$CPDPRG7= <mlev>
##$CPDPRG8= <mlev>
##$CPDPRGB= <>
##$CPDPRGT= <>
##$D= (0..31)
0 1 0 0 0 0 0 0 0 0.06 0 0 0 0 0 0 0.0002 0 0 0 0 0 0 0 0 0 0 0 0 0 0 
0 
##$DATE= 1170328353
##$DBL= (0..7)
120 120 120 120 120 120 120 120 
##$DBP= (0..7)
150 150 150 150 150 150 150 150 
##$DBP07= 0
##$DBPNAM0= <>
##$DBPNAM1= <>
##$DBPNAM2= <>
##$DBPNAM3= <>
$$ [...]
##$SUBNAM6= <"">
##$SUBNAM7= <"">
##$SUBNAM8= <"">
##$SUBNAM9= <"">
##$SW= 20.6930455092707
##$SWIBOX= (0..15)
0 0 3 0 0 0 0 0 0 0 0 0 0 0 0 0 
##$SW_h= 5175.983436853
##$TD= 65536
##$TD0= 1
##$TE= 294.16
##$TE2= 300
##$TE3= 300
##$TEG= 300
##$TL= (0..7)
0 120 120 120 120 120 120 120 
##$TP= (0..7)
150 150 150 150 150 150 150 150 
##$TP07= 0
##$TPNAME0= <>
##$TPNAME1= <>
##$TPNAME2= <>
##$TPNAME3= <>
##$TPNAME4= <>
##$TPNAME5= <>
##$TPNAME6= <>
##$TPNAME7= <>
##$TPOAL= (0..7)
0.5 0.5 0.5 0.5 0.5 0.5 0.5 0.5 
##$TPOFFS= (0..7)
0 0 0 0 0 0 0 0 
##$TUNHIN= 0
##$TUNHOUT= 0
##$TUNXOUT= 0
##$USERA1= <user>
##$USERA2= <user>
##$USERA3= <user>
##$USERA4= <user>
##$USERA5= <user>
##$V9= 5
##$VALIST= <valist>
##$VCLIST= <CCCCCCCCCCCCCCC>
##$VD= 0
##$VDLIST= <DDDDDDDDDDDDDDD>
##$VPLIST= <PPPPPPPPPPPPPPP>
##$VTLIST= <TTTTTTTTTTTTTTT>
##$WBST= 1024
##$WBSW= 4
##$XGAIN= (0..3)
0 0 0 0 
##$XL= 0
##$YL= 0
##$YMAX_a= 282130
##$YMIN_a= -357012
##$ZGOPTNS= <>
##$ZL1= 120
##$ZL2= 120
##$ZL3= 120
##$ZL4= 120
##$ABSF1= 16.522
##$ABSF2= -4.171173
##$ABSG= 5
##$ABSL= 3
##$ALPHA= 0
##$AQORDER= 0
##$ASSFAC= 0
##$ASSFACI= 0
##$ASSFACX= 0
##$ASSWID= 0
##$AUNMP= <proc_1d>
##$AZFE= 0.1
##$AZFW= 0.1
##$BCFW= 0
##$BC_mod= 0
##$BYTORDP= 0
##$COROFFS= 0
##$CY= 12.5
##$DATMOD= 1
##$DC= 0
##$DFILT= <>
##$DTYPP= 0
##$F1P= 14.0000005364418
##$F2P= -0.99999901652339
##$FCOR= 0.5
##$FTSIZE= 32768
##$FT_mod= 6
##$GAMMA= 0
##$GB= 0
##$INTBC= 1
##$INTSCL= 1
##$ISEN= 128
##$LB= 0.3
##$LEV0= 0
##$LPBIN= 0
##$MAXI= 10000
##$MC2= 0
##$MEAN= 0
##$ME_mod= 0
##$MI= 0
##$NCOEF= 0
##$NC_proc= -3
##$NLEV= 6
##$NOISF1= 0
##$NOISF2= 0
##$NSP= 0
##$NTH_PI= 0
##$NZP= 0
##$OFFSET= 16.522
##$PC= 1
##$PHC0= 213.7996
##$PHC1= 8.923635
##$PH_mod= 1
##$PKNL= yes
##$PPARMOD= 0
##$PSCAL= 4
##$PSIGN= 0
##$REVERSE= no
##$SF= 250.13
##$SI= 32768
##$SIGF1= 0
##$SIGF2= 0
##$SINO= 400
##$SIOLD= 32768
##$SREGLST= <1H.DMSO>
##$SSB= 0
##$STSI= 32768
##$STSR= 0
##$SW_p= 5175.98343685301
##$SYMM= 0
##$S_DEV= 0
##$TDeff= 65536
##$TDoff= 0
##$TI= <Analysis number 999999
Compound Code 99
Book Reference 9
Project Code 9>
##$TILT= no
##$TM1= 0
##$TM2= 0
##$TOPLEV= 0
##$USERP1= <user>
##$USERP2= <user>
##$USERP3= <user>
##$USERP4= <user>
##$USERP5= <user>
##$WDW= 1
##$XDIM= 32768
##$YMAX_p= 314073652
##$YMIN_p= -97406
$$ End of Bruker specific parameters
$$ ---------------------------------
##NTUPLES= NMR SPECTRUM
##VAR_NAME=  FREQUENCY,     SPECTRUM/REAL,   SPECTRUM/IMAG
##SYMBOL=    X,             R,               I
##VAR_TYPE=  INDEPENDENT,   DEPENDENT,       DEPENDENT
##VAR_FORM=  AFFN,          ASDF,            ASDF
##VAR_DIM=   32768,         32768,           32768
##UNITS=     HZ,            ARBITRARY UNITS, ARBITRARY UNITS
##FACTOR=    0.157963299565203, 1,           1
##FIRST=     4132.6476996994, 0,             0
##LAST=      -1043.33573715361, 0,           0
##MIN=       -1043.33573715361, -97406,      0
##MAX=       4132.6476996994, 314073652,     0
$$ Real data points
##PAGE= N=1
##DATA TABLE= (X++(R..R)), XYDATA
$$ [...]
17124B03758P375L2769j8613n5778m7277k3596j6779l711l416l431K772m96J6873
17111I0450J8600K826L683L506l557l0211m830j869l6790o502J3760J1648J1540
17098G2254k2639j8822j5600L204L3792P352j5067J700M935M220J4707K0652l352
17085H7336k2522j2393M217K2980J3785J3587j6929o354L9526o281M432J0920
17073A32304J6095O672J7905k5830k1540j225N449R775J1048q709J613J9431j4444
17060A48544j866M7240J2244m15k6104p390k6217o426J4382K3405N7810K9007
17048B64214J0141J0940N531n018j47n877J422J613N936J309J563K3666L3864
17035C49157K3315J3780K1637L8593J7115p462K1607J6115L2097L1719N5858L0527
$$ y = [203758, 211133, 243902, 225289, 169511, 122234, 98638, 81859, 78148, 74732, 71301, 74073, 73577, 90450, 109050, 111876, 115559, 119065, 115508, 85297, 80467, 78598, 41808, 35306, 49066, 60714, 72254, 49615, 30793, 15193, 18397, 52189, 59541, 44474, 46174, 51109, 55329, 70036, 90688, 87336, 64814, 52421, 56638, 79618, 93403, 106990, 90061, 83707, 123233, 116952, 121384, 132304, 148399, 155071, 172976, 147146, 125606, 124381, 129830, 139605, 150653, 141944, 143557, 162988, 148544, 146678, 193918, 206162, 205747, 179643, 172253, 146036, 139610, 153992, 177397, 235207, 264214, 274355, 285295, 290826, 285808, 285661, 279784, 281206, 282819, 288755, 290064, 291627, 315293, 349157, 372472, 386252, 407889, 446482, 463597, 456135, 477742, 493857, 525954, 557673, 613531, 644058]
17023F44058M0441L8851P2191Q7246Q2016J08828J38013J27962J61549J96271
17013A697426J59390J80332J81234K55264L26007M06816N87645P75467J036898
17004E606479J443451K012149K846516L940298N285472O548467O957801N948703
16996D0589336L622469j04454l480490n345223o023600n128104l446686j718094
16988A8965154j10385J455455L148660M898115O400922O760507N407239K755820
16980D9681487j324677n208378p176071p691956o750737n189403l735984k624051
16972I980230j906651j368609j026088q09015o44082m68521l66636l25870k93690
16963B771068k34897k36356k13708j89353j70998j49857j10131q9910r7192j02471
$$ y = [644058, 684499, 723350, 795541, 882787, 964803, 1073631, 1211644, 1339606, 1501155, 1697426, 1856816, 2037148, 2218382, 2473646, 2799653, 3206469, 3794114, 4569581, 5606479, 7049930, 9062079, 11908595, 15848893, 21134365, 27682832, 34640633, 40589336, 44211805, 44107351, 40626861, 35281638, 29258038, 24129934, 20683248, 18965154, 18854769, 20310224, 23458884, 28356999, 34757921, 41518428, 46925667, 49681487, 48356810, 43148432, 35972361, 28280405, 21529668, 16340265, 12604281, 9980230, 8073579, 6704970, 5678882, 4869867, 4225785, 3757264, 3390628, 3064758, 2771068, 2536171, 2299815, 2086107, 1896754, 1725756, 1575899, 1465768, 1375858, 1278666, 1176195]
16953A176195o9089o5396o5592o9084o5550p7279q7003m4960l2744j8816o1342
16942E19340l5746l2725j4395j5249k840J4542N286k0676n0387m7912l2528j5702
16930B71008J0215J6098o165j6175M294P19J92k9057k7204q845j9220o765j437
16917A87658r193k439p149j486j5287k4026q069j192J0175M40r355J5192N432
16904A40701r792j0589r247j5025J3896J2725L429L0j3237J652K0365J4215K824
16891A51947J7751m564o415p938k945J6285M2457K969k1258k818j4294r796J4296
16878A75677q951j0799o895q137J4318N602j0050k1580M022o250Q552j9914o632
16865A08963K2050O609j0589k2858J6662r337J4544l702m326j493O280l814k7867
$$ y = [1176195, 1107106, 1041710, 976118, 907034, 841484, 764205, 677202, 632242, 599498, 580682, 519340, 483594, 450869, 436474, 421225, 418385, 432927, 438213, 417537, 367150, 319238, 286710, 271008, 281223, 297321, 291156, 274981, 279275, 279994, 280186, 251129, 223925, 215080, 195860, 189095, 187658, 178465, 176026, 168877, 167391, 152104, 128078, 120009, 118817, 128992, 129432, 120077, 135269, 140701, 130909, 120320, 111073, 96048, 109944, 122669, 126098, 126128, 112891, 114543, 134908, 149123, 151947, 169698, 165134, 158719, 150781, 147836, 164121, 206578, 209547, 188289, 185471, 171177, 161381, 175677, 166726, 155927, 149032, 140895, 155213, 160815, 150765, 129185, 133207, 126957, 135509, 115595, 108963, 131013, 137622, 127033, 104175, 120837, 111500, 126044, 122342, 118016, 116523, 122803, 118989, 91122]
16852I1122k0279k780J1122J8515j314K0374J6327j6987K467J1174L258R989M471
16839A47459k0350j0084j2122P157m237m0867j6506k764Q309k712l0635J1157
16827C3805K5603M3876J9878j1908M330r946j1418Q268K1540J1663k0587l2649
16815H2455J8864j6841r623K2534L1874R661J8506o028p003j9977k7318N453R916
16802A12473N404k189K005J322p778K806K5167K4174Q449r073J177k491P596l147
16788A65895o377J476j9111J667J8259L1676k2221j2782j8213K1352K2429N708
16776A89758J3539K8016k54L853K0979K0401j4409K0432k822J8706M1074K2736
16764C62009M113K4441K7072L4166L1644Q4152O0936L9171L8346K9271L7736N4994
$$ y = [91122, 70843, 68063, 79185, 97700, 96386, 116760, 133087, 116100, 118567, 129741, 132999, 142988, 147459, 127109, 117025, 104903, 112060, 107823, 66956, 50450, 47686, 55995, 53283, 22648, 33805, 59408, 103284, 123162, 111254, 115584, 105638, 94220, 102488, 124028, 135691, 115104, 82455, 101319, 84478, 74855, 97389, 129263, 138924, 157430, 151402, 144399, 124422, 97104, 102557, 112473, 117877, 115688, 117693, 119015, 111237, 114043, 139210, 163384, 171833, 162760, 163937, 161446, 169042, 165895, 159518, 160994, 141883, 143550, 161809, 193485, 171264, 158482, 140269, 161621, 184050, 189758, 203297, 231313, 231059, 234912, 255891, 276292, 261883, 282315, 279493, 298199, 339273, 362009, 366122, 390563, 417635, 451801, 483445, 567597, 628533, 667704, 706050, 735321, 773057, 828051]
16752H28051Q2112Q9282J13170J44466J49708J91066K45729L43669M37383N67766
16742C192402P67479J098946J581905K262256L118874M108595M726443M213743
16734B5070643K253108j22488k615718m279129m123777l102637k032749j099160
16726I948093k81475N11234J329078K191802L083682L675289L200578J470137
16718B5128418o23478k807903m225065m102057l229447k312616j606925j142472
16710E078455q17553n75115m04154l53768k64505j84040j63913j48721r9919n1352
16700B015415l8421j8986L7127O9073J14956J49960K31700K89263L66081N74376
16690C790544Q50993J216881J780753K523554L460494M156828L958064K270187
$$ y = [828051, 910163, 999445, 1112615, 1257081, 1406789, 1597855, 1843584, 2187253, 2624636, 3192402, 3959881, 5058827, 6640732, 8902988, 12021862, 16130457, 20856900, 25070643, 27323751, 27201263, 24585545, 20306416, 16182639, 13080002, 11047253, 9948093, 9666618, 10177852, 11506930, 13698732, 16782414, 20457703, 23658281, 25128418, 24504940, 21697037, 17471972, 13369915, 10140468, 7827852, 6220927, 5078455, 4260902, 3685787, 3281633, 2927865, 2663360, 2479320, 2315407, 2166686, 2066767, 2015415, 1976994, 1958008, 1995135, 2064208, 2179164, 2329124, 2560824, 2850087, 3216168, 3790544, 4641537, 5858418, 7639171, 10162725, 13623219, 17780047, 21738111, 24008298]
16682B4008298j8121k058775l564068l646727k882442j942952j105500l87372
16674H402341L01744J011422J814249K719291L428640L231024J622156m91711
16666B2039156k355396l717235l760414l043560k199283j531771j102096p87351
16658C542050n88554m34631l35244k80887k41360j63225j44560j43435j04810
16649A105344q9091q5634o0359q1218l8346r539n1245n5999l8481n6557m7969
16638D90906m2300j2753m8517l7019k7989j6034k8031j7270J0215k1321k7155
16627B22732k0113l967k4439l0729M475R077J1133J2671j0869j2472r317P655
16615A55837L750L296j6236M098J2811j2764k6303j9805j0801J5696m434R234
$$ y = [24008298, 23990177, 21931402, 18367334, 14720607, 11838165, 9895213, 8789713, 8402341, 8704085, 9715507, 11529756, 14249047, 17677687, 20908711, 22530867, 22039156, 19683760, 15966525, 12206111, 9162551, 6963268, 5431497, 4329401, 3542050, 2953496, 2518865, 2183621, 1902734, 1661374, 1498149, 1353589, 1210154, 1105344, 1016253, 930619, 870260, 789042, 750696, 741157, 689912, 633913, 595432, 538875, 490906, 448606, 435853, 387336, 350317, 322328, 306294, 278263, 260993, 271208, 249887, 222732, 202619, 198652, 174213, 143484, 147959, 157036, 168169, 180840, 169971, 157499, 148182, 155837, 159587, 162883, 146647, 150745, 163556, 150792, 124489, 104684, 93883, 109579, 105145, 114379]
16603A14379J0674Q050k5493j3141Q579r07k4090j3126J6813M849r638j157J2315
16590H8107J154k6387K6048J4556k04m423r795r275j4356n900J3301K5811p278
16577I1359j5692P437k290k5569o334R919N041K7794K7682j2628k5655R884L7040
16564A27988O464k2696k5523k0692l632k8483j7879m88j1097l529J4648K2030
16552C7111p642K470J1496o885l7039K31J1511q239K3980J7007L2795j3172k0079
16539D3545m4275M572K346K577l619Q063J4147j2348j5826r163O675J2726J6613
16526B6033M860j1073M953p631j4964N366r221M440L990O717k8788J3184L4308
16513C2174J7731p981P717Q176j1548L073J755J833m813J5227J0349J9345K5390
$$ y = [114379, 125053, 133103, 107610, 94469, 103048, 102141, 78051, 64925, 81738, 86587, 76949, 75792, 88107, 89261, 62874, 88922, 103478, 103274, 98851, 89056, 79781, 65425, 59525, 72826, 98637, 91359, 75667, 83104, 80814, 55245, 48911, 58830, 63871, 91665, 119347, 106719, 81064, 90948, 127988, 134452, 111756, 86233, 65541, 61909, 33426, 15547, 15059, 3962, 433, 15081, 37111, 29469, 31939, 43435, 36550, -489, -258, 11253, 3014, 26994, 44001, 76796, 63624, 43545, -730, 3842, 6188, 8765, 5146, 13209, 27356, 15008, -818, -9981, -3306, 9420, 26033, 30893, 19820, 24773, 17142, 2178, 7544, -1677, 2763, 6753, 13470, -15318, -2134, 32174, 49905, 41924, 49641, 57817, 46269, 49342, 51097, 52930, 48117, 63344, 73693, 93038, 118428]
16500A18428L699J5794J5903K371K4408O856K1742k1843l3675r519l044k245k1055
16487A17820k852Q323K2061K9344L3398p531R350k621j2617J842r576j7472m3353
16474A26116n8755j8969M395P328J6977n972k3473k6039l967j6650n792N048j3261
16461a3014M502j3425J6833J3449O657p133J2471j3452l1738J5134l643l607J5038
16448a928L361J759J5676M481j9712k0380j4745j0671L871J6259k2384j4078J018
16435e7473L1289L2456J5388R521k3314K606J9003j1052O872j8345J438m885k4300
16422b0796k1061J7382K6014k7455j4495K5170M649j2044j7547k4031P110M7272
16410i832K5213j5276r393J6897M492P397M3277j3912j9793q722j354m489J2891
$$ y = [118428, 122127, 137921, 153824, 156195, 180603, 187459, 209201, 187358, 153683, 144164, 141120, 138875, 117820, 114968, 123291, 145352, 174696, 208094, 200563, 209913, 207292, 194675, 196517, 186941, 169469, 126116, 67361, 48392, 52787, 60115, 77092, 71120, 47647, 21608, 17641, 991, -4801, 247, -13014, -8512, -21937, -5104, 8345, 15002, 7869, 20340, 6888, -24850, -9716, -13359, -16966, -1928, 1433, 3192, 18868, 23349, 3637, -16743, -31488, -42159, -38288, -22029, -44413, -58491, -57473, -26184, 6272, 21660, 31181, 7867, 10473, 29476, 18424, 25296, 6951, 8389, 3504, -20796, -41857, -24475, 1539, -25916, -40411, -15241, -10592, -22636, -40183, -64214, -57104, -9832, 15381, 105, -9288, 7609, 12101, 19498, 62775, 48863, 29070, 20348, 18994, 14505, 27396]
16397B7396j8723l2652K504J1827L292j10Q778R009j4641k1778K3223k346j717
16384e938p415q850n844M029Q765l772J1960j3518p738L0616j2994q807l403N796
16370a7113k5638r464K4016L4355L0940J2891j0306q287j4814j9397q98N269q756
16357g202M412K7446L5923k0415l0062j1331j0300K032k1324q452J6821J9531
16345b921K2243J617j93O874J1151k7676k2179l6634k709O853L3131K9046K207
16332B0810j5272j8281J933L4356R859j2896o156k6937K612M2200p079j1730j7879
16319d460k1643Q441r485j1596K3955J886J79O669l279J2851K9897j0480l5254
16306a2319k1323j4518M0130K5433j9397j3157R402p523k7534j1330J4275J5468
$$ y = [27396, 8673, -23979, -21475, -9648, -6356, -6466, 2312, 11321, -3320, -25098, -1875, -4221, -5938, -13353, -22203, -28047, -24018, -15253, -19025, -7065, -20583, -28321, 2295, -10699, -19506, -22909, -17113, -42751, -52215, -28199, 6156, 37096, 49987, 39681, 31394, 16580, -2817, -3715, 1554, -7202, -2790, 24656, 60579, 40164, 10102, -1229, -11529, -9497, -30821, -39273, -22452, -2921, 19322, 20939, 20746, 27620, 38771, 11095, -11084, -47718, -50427, -43574, -10443, 18603, 20810, 5538, -12743, -10810, 23546, 33405, 20509, 14353, -12584, -9972, 32228, 25149, 13419, -4460, -26103, -17662, -27147, -38743, -14788, -12902, -12723, -6054, -9333, 3518, 33415, 22935, -12319, -33642, -48160, -8030, 17403, -1994, -15151, -5749, -13272, -40806, -52136, -37861, -22393]
16294b2393J3544n660J5192K1284r24K512K916N019m725j046j1441j240K074m4767
16280b9655k9604K1707J6931k456M3082K8304J1909r915j5127L276o207k270k0289
16267I686r955L945R58K353p070k4322Q685L1695N767J4063p833j7232l3963k6910
16253e0133K3096J1952K6145j7624p675R662p500J7442J6357k3088k455K7487
16241B3666L1661J5333L590J0018N979j4104P011J8447J4116j6741l2788l6131
16229C0057j073Q702j9744j974L0663J8588r751r00o524J8663J661p341p900j1354
16215D1773p677J4043J2179j0832j69j2962k3115N607j0761M001k1459j1779K4804
16202C653K7514q242j9554j6098O415p107k664k1196J597R088J29J987L1574L4182
$$ y = [-22393, -8849, -14509, 683, 21967, 21043, 23555, 26471, 31490, 26765, 25719, 14278, 13038, 15112, -29655, -59259, -37552, -20621, -23077, 20005, 48309, 60218, 50303, 35176, 38452, 32245, 29975, 9686, -269, 3676, 4634, 6987, -83, -24405, -15720, 15975, 21742, 35805, 27972, 10740, -23223, -50133, -27037, -15085, 11060, -6564, -14239, -4577, -12077, 5365, 21722, -1366, -3821, 23666, 55327, 70660, 74250, 84268, 90247, 76143, 83154, 101601, 115717, 98976, 66188, 30057, 28984, 37686, 17942, 15968, 46631, 65219, 55468, 54568, 48044, 66707, 68368, 61027, 53127, 41773, 34096, 48139, 60318, 49486, 49317, 36355, 13240, 18847, 8086, 12087, -9372, -21151, 3653, 31167, 22925, 3371, -12727, -6312, -13419, -16083, -37279, -35682, -26594, -26465, -24478, 7096, 41278]
16188D1278M0775Q158j3264Q189K575M125M064l3684j8318M6708J7837j7183m553
16175H6707m251q100l010Q681L223J9780N071J741K1766j3179l8784j9628j6205
16162D3812L646J5334p225n304r932k8534k004j8470j9797p452o89K3230J1961
16149a424p058j1370J9439J7561p642j2285J2965J6523j0721j1791k6912J4754
16137g961j9081r144J1110Q8j9766K3127Q678o361o321Q41R21K0691Q971Q52j5612
16122h967J791m51k212M595m653Q193L147J6916O41o143k6459k1185J2428J6567
16108e792n509m989J1931J7663O179j0662J8542J0651k5366j6988L6277K347J650
16095C5934L5890k7979o5276k6092O577J0281L5837K3017K6407Q462J3179m7619
$$ y = [41278, 82053, 90211, 76947, 85136, 87711, 91836, 95900, 62216, 43898, 90606, 108443, 91260, 86707, 82456, 74356, 71346, 80027, 83250, 103030, 108101, 109842, 131608, 118429, 79645, 60017, 43812, 47458, 62792, 55567, 50263, 40331, 11797, 9793, -8677, -28474, -35926, -36615, -13385, -1424, -8482, -19852, -413, 17148, 9506, -2779, 10186, 26709, 15988, 4197, -22715, -7961, -27042, -36186, -25076, -24988, -44754, -21627, -12949, -19310, -25631, -24790, -23869, -3178, 5793, 6645, -8967, -7176, -7627, -9839, -5244, -9897, -1704, 1443, 18359, 19000, 12857, -13602, -34787, -22359, -5792, -11301, -16290, -4359, 13304, 19483, 8821, 27363, 38014, 12648, -4340, 31937, 34284, 35934, 71824, 43845, -21431, -47523, -40946, -30665, 5172, 28189, 54596, 63058, 76237, 28618]
16083B8618j1446j4595j3978K7772J7656M849j4124j1166j4117l686Q943L3279
16071C8005L792n766k7956j9579J2044J0199K4109j0454l0769J0908j195k9589
16059b6251J6178J5950J7349J3589k7935k0631j9820J3022o066Q905J3826m580
16047f464n553o598j3129l0073n617K2438R627K2092J4095r644K1377K8594j87
16034D0958K281m221j1993L753K292j8697P198K7910j2088k0789j1352R032r218
16021E066j7044k0920K0885K4796P101k339j1564j4731J9725j7965j458k921L0572
16008A9203J4807j5625j3146J3869j7174l2601k6241O199j0361J9394L6392j2502
15996a7786l800J0711K2653q21j9124R356L279J0553J5201J1858k6974j5881K3112
$$ y = [28618, 17172, 2577, -11401, 16371, 34027, 38876, 24752, 13586, -531, -4217, 4726, 38005, 41797, 36031, 8075, -11504, 540, 10739, 34848, 24394, -6375, 4533, 3338, -26251, -10073, 5877, 23226, 36815, 8880, -11751, -31571, -18549, -24615, -15710, -1884, -6464, -12017, -18615, -31744, -61817, -67434, -44996, -35369, -13277, 818, -8826, 12551, 41145, 40958, 43239, 39018, 27025, 30778, 33070, 14373, 21571, 49481, 37393, 16604, 5252, 14284, 5066, -11978, -32898, -12013, 12783, 19884, 17545, 5981, -8750, 10975, -6990, -8448, -11369, 19203, 34010, 18385, 5239, 19108, 1934, -30667, -56908, -50709, -61070, -41676, -5284, -17786, -21586, -10875, 11778, 10957, -8167, 1189, 4468, 15021, 30222, 42080, 15106, -775, 22337]
15983B2337j7619j1111k5334l8227Q512K0607R570Q590k1105Q171J1486j8159
15971d2282k744L8280J5540J9117L718j7723l8942q715K900Q181j1453J7976K9422
15958A3275j4899K455m343m187M629k570J029J6696k0826j7862J0759R686j578
15945g736k502J1894Q341K423j2565j9088k0858j2192J972L1643J3457l4815j2113
15932e2139O667J8176M671J6424Q847n637l5475k8061L538K7559L3791O148j5293
15919a0784j3958n264j4833K279n551O924J2279K0450J5816l5308k6000K4151
15907b9799J7197R85p035o099J3597j756r373P46j0456q556J1219P723K2958Q17
15893B168j3348Q41j7997k3518q143r442J8385j238J0372K8112N375k1167j567
$$ y = [22337, 4718, -6393, -31727, -69954, -61442, -40835, -31265, -22675, -43780, -35609, -24123, -42282, -45026, -6746, 8794, 27911, 31629, 13906, -25036, -33751, -30851, -22670, -34123, -16147, 13275, -1624, 831, -3512, -7699, -3070, -5640, -4611, 12085, -8741, -26603, -15844, -6158, -7736, -10238, 1656, 9997, 12420, -145, -19233, -40091, -52283, -50311, -18668, -5211, -40026, -52139, -45472, -27296, -22625, -6201, 2646, -2991, -38466, -66527, -62989, -35430, -1639, 4509, -10784, -24742, -30006, -44839, -42560, -48111, -41187, -28908, -8458, 7358, -27950, -53950, -29799, -12602, -11617, -18652, -24751, -11154, -12910, -22283, -21537, -31993, -40549, -29330, -21607, 1351, 2168, -11180, -10339, -28336, -51854, -59997, -69439, -51054, -52292, -41920, -13808, -8433, -29600, -31167]
15880c1167J755K6643J2681j0817j4187Q239j7658k6652K896K9318M510J477J0249
15867b713o097n940K377m524P285K7514K6254J2597k5947j3114j7373j510j9996
15854b1187j1383k161N51J7939m603j0090K0816P240K742K2101j2960M450j5184
15841a729j4702K6530q879j4400K289K1789M994N960O474J7371p389j1475j331
15828B5502k6455k1814l053o266K454K4605J8069q572k161r028r840R052j2466
15815a9973j1998k2483J486r008L622J8479j7884O468K0541K0449J0632l6105
15803c5774R627J3004n464J499L287p787K2921J350j6807L072j9757n449j8808
15790e5086j0518J4709L4772J9535j7617j0377M23k309N232M1448n24O48l65Q097
$$ y = [-31167, -29412, -2769, 9912, -905, -15092, -6853, -24511, -51163, -48267, -18949, -14439, -12962, -2713, -8810, -14750, -12373, -16897, -9612, 17902, 44156, 56753, 30806, 17692, 319, -1191, -21187, -32570, -34731, -34180, -16241, -20844, -30934, -10118, -2878, -136, 21965, 9005, 13455, -1729, -16431, 10099, 1220, -13180, -10891, 10898, 15892, 21852, 28326, 45697, 38308, 26833, 25502, -953, -22767, -25820, -32086, -29632, -5027, 13042, 4470, 2309, -6719, -16559, -7507, -19973, -31971, -54454, -52968, -61976, -58354, -39875, -57759, -51291, -30750, -10301, 331, -35774, -26147, -13143, -18607, -17108, -13821, -21608, 1313, 2663, -14144, -11072, -30829, -36278, -55086, -65604, -50895, -16123, 3412, -14205, -24582, -24159, -26468, -21236, 20212, 19688, 20336, 19971, 28068]
15776B8068l688j2353P04K1903q485l1020p603K3229J2574k6099j8677k664J4236
15763i875Q970k723j6242k1508M594l596j7009O64R463R457P504J5920j6065k245
15749c2691N292K8917K8894k5206k4228p606k1110m311M138J3713j666P148K0398
15736h318K5869L75j6678k3346p104K04K8846j1092j1158J218J0703J1555p782
15723f708j7476o407r923j7825K0584J50m68K5578p340k4978K0709K5870J7875
15710A9641N065j4488j3718J3625P505L742j5738k6837q305n044q090L672K5876
15697a3094K900N662R131j5693n899J0490O94O389J2183j842r942k990j1119j5601
15683b8731J4285N190K0404l297o268j2903l523M311J2584j877k2995l38Q580
$$ y = [28068, 24380, 12027, 12731, 34634, 26149, -4871, -12474, 10755, 23329, -2770, -21447, -24111, -9875, -905, -3628, -19870, -41378, -36784, -40380, -57389, -56725, -47262, -37805, -30301, -14381, -30446, -32691, -27399, 1518, 30412, 5206, -19022, -26628, -47738, -52049, -47911, -34198, -35864, -28716, -8318, 17551, 17926, 1248, -22098, -29202, -28998, -152, -11244, -22402, -21184, -10481, 1074, -6708, -24184, -30591, -40514, -58339, -37755, -37605, -38073, -12495, -19835, -44813, -24104, 1766, 19641, 24706, 10218, -3500, 10125, 17630, 21372, 5634, -21203, -29508, -34552, -42642, -38970, -13094, -10194, -4532, 4599, -11094, -16993, -6503, -5809, 580, 12763, 10921, 979, -2011, -13130, -28731, -14446, -9256, 11148, 7851, 1583, -11320, -14843, -10532, 2052, 175, -22820, -23158, -14578]
15670a4578K3189p239j4939j4001P829P580j7100Q352J9211L871j9796p704J3759
15657a1566j6569m6567N210J3572L770J5024l797K3971K8025j847o867l2621o015
15644c6277J1193J7833J1860J0815o204l5602J3688J4226j1173k5J2873k145l92
15631F70l184k6521p608K0524j0643J177l788k374j2652q445j0500j4077J3721
15618f3700K3141k867J9484K930o880l196N801N768L175K503k1721m233m898k3546
15604f8239r081k015J1054l897r964K2161J2796k5945Q226J2549M5712M0026L528
15591C6911l2613j3769n417k2240J5954K753m303p538k4046R676L3516j4495N343
15578b0268R991l782J5153J6561J7869J970k4315l7605J343j1865K3541R673Q20
$$ y = [-14578, 8611, 1372, -13567, -27568, -19739, -12159, -29259, -20907, -1696, 2175, -17621, -25325, -11566, -28135, -74702, -69492, -55920, -52150, -37126, -40923, -16952, 11073, 9226, 2359, -30262, -36277, -25084, -7251, 4609, 15424, 9220, -26382, -12694, 1532, -9641, -9666, 3207, 1062, 670, -2514, -29035, -36643, -16119, -26762, -25585, -29373, -31747, -44399, -52844, -63344, -77421, -63700, -40559, -43426, -23942, -21012, -27892, -31088, -25287, -19519, -16344, -13841, -35562, -39795, -44693, -68239, -77320, -79335, -68281, -72178, -82142, -59981, -47185, -73130, -64904, -52355, -6643, 33383, 36911, 4298, -9471, -14888, -37128, -21174, -18421, -22724, -30262, -54308, -44632, -11116, -25611, -20268, -10277, -14059, 1094, 17655, 35524, 37494, 13179, -24426, -23083, -34948, -11407, -1734, -914]
15565i14R534L6992j6818l5653j8098J6701J0381r900N127J437o652m348q945
15552b1156l072L688l5932L05K5074R619J6756L0147l889M35J1920j2593Q360
15539B9662M351p48j8701n120Q196J1967M7k5336k6395p433K869q956j3969P197
15525d2369J6165q157M732J9958r102J0845J156q188J067R406J980j8687k0108
15512d1302J3874O083M923J2498O203r799l9057k9566J7208J9043J8878p288j8274
15499d6576j1834J991n250K0517J6774k1355J0349K5964p178k680n202J366p099
15486c0213j6517q71P337R110o051l96J7121J9568j6185j768k816J2145K756r262
15472a6042k555j5756l6510O39K8363m606R109N343j361J1301r934K3209j1512
$$ y = [-914, 8620, 45612, 28794, -6859, -24957, -8256, 2125, -7775, -2648, -1211, -7863, -12211, -21156, -24228, -20540, -56472, -56167, -31093, -21474, -4718, 25429, 21540, 21975, 33895, 21302, 29662, 34013, 33265, 14564, 9444, 17640, 29607, 29654, 4318, -22077, -29510, -26641, -35597, -49566, -42369, -26204, -34361, -29629, -9671, -18773, -7928, -6772, -14960, -13893, -4487, -2507, -21194, -41302, -27428, -21345, -16422, -3924, 2279, -7520, -46577, -76143, -58935, -39892, -21014, -28302, -46576, -58410, -56419, -61669, -41152, -24378, -45733, -35384, -9420, -16598, -19278, -24480, -23114, -30213, -46730, -47601, -40264, -31154, -37205, -37601, -20480, -912, -17097, -18865, -21681, -9536, -6780, -16042, -18597, -34353, -70863, -70224, -41861, -46467, -37358, -32015, -33376, -22075, -32009, -8800, -20312]
15459b0312j410K9481J7322j8269J4401j274k4299k1346J8344M372K0541J6334
15447C3885k4369j7296Q524j0252j562n756J4239R452j0025J563J6466M610q504
15434A0975k3843l414L493N652J7016j126j7428j8395p779Q817q051K3104P400
15421c579k5343o632J9465M744J711J0997p839j2268J678J66K90L356N0295O180
15407D3221j7170k5435j4149J8885J3389k7296p443o570J840k97q930k236J5707
15394a6484K661k307L1646M676j9209j4583j4735j4790R096J2527j3185o755n443
15381d6885M283K8852J2245K443j6177r744L1297K4820l4375k023M053j4200n706
15368b1117O104J857n874k4086K2564o073R138J2616P625p352o1q502m111r250
$$ y = [-20312, -21722, 7759, 25081, 6812, 21213, 19939, -4360, -25706, -7362, -2990, 17551, 33885, 9516, -7780, 744, -9508, -11070, -16826, -2587, 6865, -3160, -1597, 14869, 19479, 10975, -12868, -16282, -12789, -7137, 9879, 8753, -8675, -27070, -34849, -26032, -34083, -10979, -3579, -28922, -35554, -16089, -11345, -9634, 1363, -6476, -18744, -17066, -16900, -16610, -13254, 37041, 43221, 26051, 616, -13533, 5352, 18741, -8555, -15998, -22568, -20728, -21025, -29955, -32191, -16484, -13823, -16130, 15516, 20192, 983, -13600, -28335, -43125, -34029, -21502, -34687, -41442, -46885, -42602, -13750, -1505, 938, -15239, -24983, 6314, 31134, -3241, -5264, -1211, -15411, -21117, -15013, -13156, -19030, -43116, -20552, -26625, -17487, -4871, 2754, -4598, -4659, -13161, -17272, -26522]
15354b6522j0742j3770J5496L5349R321j3023l556m820o919m728K77j1633m07
15341c5677k259J3415j5404j4593L728J5769J3790j0017J7845K1124j738o859
15329h76j362O528J936j0272M326J4303K642M757R20J013o617k1270m416q11k1487
15314c0686m337j3842O544K138l12J0827K7786K3869K8564m5946k4953M5251j6167
15301H736k382o579j8950M964J4848j7987k9041J0947L035J673K0039O908Q674
15288D885K1416r166j6649p67r268m2379O572J9011M265K7560K7410l3315q271
15275h696n827j9n040K562j4541k7983L78J3498N609J6010J826J0613J8220j4164
15261g554j5646R189L148k2263J947j012K6122Q551p870m637j5918j330J9613
$$ y = [-26522, -37264, -51034, -35538, -189, 9132, -3891, -7447, -12267, -19186, -23914, -23637, -35270, -35677, -37936, -24521, -39925, -54518, -50790, -35021, -21231, -31248, -13403, 7721, 5983, -876, -2238, 4290, 6226, -4046, 280, 14583, 17225, 21982, 22902, 23915, 17298, -3972, -8388, -9199, -30686, -35023, -48865, -42321, -40183, -40495, -29668, -1882, 21987, 50551, 4605, -20348, 24903, 8736, 6354, -225, -19175, -14211, 637, -17350, -46391, -35444, -32409, -30736, -10697, -3789, 4885, 26301, 17135, 486, -281, -9549, -51928, -45356, -26345, -22080, 5480, 32890, -425, -8696, -14523, -14542, -19582, -17020, -31561, -59544, -59166, -45668, -40059, -24049, -22223, -11610, 6610, -7554, -23200, -14011, -10863, -33126, -31179, -32191, -6069, 2482, -5388, -10025, -25943, -27273, -7660]
15248g660J9551j1905o471n173L379r618J4364J5497j7646l284P371Q969J6565
15235B3939O139j7951m879K436j3703N636n231J3036R10p574k5792r363j9530
15222e1927j760R182L0336J76R202K7518K5389j8645m0896k88L0281Q852r327
15209A8093Q41j5186O684l861J8696J430q447k1546l2977m171L1530K5536K3623
15196D0245Q625K573j8819l4670j7666P678n780K0037J4394o032J8827J6657k2471
15183B3598K508j8069k568J3504R023j1053j2499k1210O074L0667M177m500k0573
15170i21m865L1452K0969J294j9626k1434p275q768K875j6762k1919O987L0206
15157g787R225M755j6256j3459Q81k5981k0149J4403o325J5823K4523j389l8234
$$ y = [-7660, 11891, -14, -6485, -11658, -8279, -17897, -3533, 11964, -5682, -8966, -1595, 7374, 23939, 30078, 12127, 7248, 9684, -4019, 1617, -3614, 9422, 10332, 2758, -23034, -32397, -51927, -53687, -44505, -14169, -13993, -4791, 22727, 48116, 29471, -11425, -11713, 18568, 27420, 18093, 18934, 3748, 10432, 6571, 25267, 26697, 18250, -3296, -36273, -40444, -8914, 16622, 40245, 48870, 51443, 32624, -2046, -19712, -12034, -17814, 2223, 16617, 10585, 29412, 46069, 23598, 26106, 8037, 5469, 18973, 27996, 16943, 4444, -16766, -10692, 19975, 24152, 19652, -921, -5786, 25666, 46635, 47929, 28303, 6869, -406, -9174, -6299, -23061, -44980, -37993, -7787, 1438, 6193, -10063, -23522, -22641, -48622, -68771, -54368, -60693, -44870, -20347, -21736, -59970]
15144e9970p134L0931o18J4595K2210K5690P639j1306r978q98R725k7382K0133
15131A3637K1903j493l5182j2768L020J2067L3644P590K076o829j7555r246j6248
15118e384l295J6186q711O644J0945N331j5261k9467R852j6557O343P381J5212
15105g81J3571k9795Q4J4861j7463k9199J705K0652K4873p195K7289J6188p724
15092B7066k7931n603j4414K0920j2137J9345j9261K4317J0770k0659m785O972
15080D600q873J0044o894l8118M995L5663K2559Q593j3001j5110l31j902k786
15067e61k3037l402J9894N612j2621J3864K2512q865j6847j0260j1289m827M284
15054b5543K3204m314n27Q266P834J2967n127J9643j6608k4321M231n141K504
$$ y = [-59970, -67104, -36173, -36791, -22196, 14, 25704, 33343, 22037, 12059, 11161, 20886, -6496, 13637, 35540, 34047, -1135, -13903, -10883, 1184, 34828, 42418, 44494, 37665, 20110, 10864, -5384, -8679, 7507, -1204, 5440, 16385, 21716, 6455, -23012, -13160, -29717, -23374, -15993, -781, 12790, -17005, -16921, -2060, -19523, -48722, -47017, -26365, -1492, -8687, 18602, 34790, 27066, -865, -6468, -20882, 38, -12099, 7246, -12015, 12302, 23072, 2413, -2372, 4600, -4273, 5771, -1123, -39241, -34246, 1417, 23976, 32569, 19568, 4458, 4127, 2225, -561, -23598, -27000, -7106, -1494, -14115, -251, 22261, 13396, -3451, -13711, -25000, -29827, -25543, -2339, -6653, -7180, 1086, 8920, 21887, 16760, 36403, 19795, -4526, -295, -5436, -2932]
15041b932j4292j4688j8610K8319n721l476J1353j438J053R155J3176k8954q994
15028c6049J4412J0846J1375j4013j7410R749J3319m1806K956N854J6745J97J5939
15015g886K9384P975o967k4494K46J9960J9233K4822q457j6376k6387j7856k291
15002i094k1605L0376o168j1669o801J8207K2062J0225O326O25q500l182J8590
14989C9392r265k1201j8103J4215J2357K3321p465J6636k769k7922P242n266q332
14976A2840m7551j0937J6768Q470J7098j0023k8582J6L0483N545J797K907o482
14963g651O160R605l119J327J9208L0798k9356k4541P610K454R930L7878R682
14950F9985k8681P502N216o457J6856k3932j5843J0547J4363J4034j2087j2176
$$ y = [-2932, -17224, -31912, -50522, -22203, -27924, -31400, -20047, -21485, -20432, -11277, 1899, -27055, -36049, -21637, -10791, 584, -13429, -30839, -21090, -7771, -49577, -46621, -40767, -24022, -23825, -7886, 21498, 29473, 22506, -1988, -1742, 18218, 37451, 62273, 53816, 37440, 11053, -6803, -9094, -30699, -323, -6491, -18160, -24961, -6754, 15308, 25533, 31859, 32484, 23984, 20802, 39392, 30127, 8926, -9177, 5038, 17395, 40716, 33251, 49887, 47118, 19196, 26438, 21172, 12840, -34711, -45648, -28880, -20410, -3312, -13335, -41917, -41901, -11418, -5873, -4076, -1169, -7651, -1491, 8114, 4995, 6322, 25530, 56328, 26972, 2431, 10041, 12495, 22425, 60303, 69985, 41304, 48806, 54022, 47565, 64421, 40489, 24646, 35193, 49556, 63590, 51503, 39327]
14938C9327K1312j5138J6070R366k833k2577k6011O313K461J3464K3977K0903
14926H6634n655r113k0333N437K1637K1662M7642m045k5037R973K4643r811L267
14913A46901J8922K5094K1777L2135J9713M2867K7220k8424j7917J310L847p285
14901B86160m31j3912N03j6837l8308n3049P759N8l0319m345j025n686j6372l0962
14887H3234l4207l363J4816P122j3181l295l909N760N931q296P046k938q858K4308
14873G0170J7516j5801k0020k3579m71k0832j3588J9746q9l2935j1881K1460N188
14860e116P218N053j548K0958L1207J4553K912J3399P062l4946k207p339j6489
14847C4717J006K6j5569m141J1004j1511P147l331J2779K5427M700J0585L1679
$$ y = [39327, 60639, 45501, 61571, 70937, 68104, 45527, 19516, 25829, 28290, 41754, 65731, 86634, 80979, 71866, 51533, 56970, 78607, 100269, 147911, 143866, 118829, 128802, 153445, 143634, 146901, 165823, 190917, 212694, 244829, 264542, 307409, 334629, 306205, 288288, 289598, 293445, 286160, 285729, 271817, 272320, 255483, 217175, 164126, 171885, 171943, 141624, 137279, 136254, 130568, 114196, 83234, 49027, 45664, 60480, 67602, 54421, 51126, 47217, 52977, 58908, 50612, 57658, 54720, 45862, 70170, 87686, 71885, 51865, 28286, 27815, 6983, -6605, 13141, 13052, -19883, -31764, -10304, -5116, 2102, 7155, 5607, 26565, 57772, 72325, 75237, 88636, 95698, 60752, 58545, 51206, 34717, 35723, 35749, 20180, 16039, 27043, 15532, 22679, 19348, 32127, 57554, 62254, 72839, 104518]
14834A04518k3562k0273n72j7907j0897N962L7739J1715J6942j8296N629r387
14822H1611j374l9290J972J8993N055j7714m911l367k1043o173J4552K9235M078
14809F1624j6871r701L608K4080K3949k392p885r575L464n782J6876J0348j1582
14796H0161O223L075r927J6455J3148J4129m442j9977k4730k4799o631K0826L5339
14783I8850p346k4056J5339K0384K3775p955j1540l192J6085P569j0191p843P923
14770A17802J674j6532j1863J7883K889j0000j9018Q943K4107P332L524P017k851
14757A30907O852N334j9354J0137J800j3654K4525J6526Q088J3956M744J9641
14745B09502K8490l713j3642k3033l5443j3778J0484L6862K6706l387j9005l1851
$$ y = [104518, 80956, 60683, 60111, 42204, 31307, 37269, 75008, 86723, 103665, 85369, 90998, 81611, 80237, 40947, 42919, 61912, 66967, 49253, 44342, 40975, 19932, 13759, 28311, 57546, 61624, 44753, 35052, 38660, 62740, 86689, 84297, 76412, 66837, 70301, 64519, 81395, 91743, 80161, 86384, 89459, 79532, 95987, 109135, 123264, 118822, 98845, 74115, 49316, 42685, 63511, 98850, 91504, 67448, 82787, 103171, 126946, 118991, 107451, 104259, 120344, 127913, 117722, 109879, 117802, 119476, 102944, 91081, 108964, 111853, 101853, 82835, 91778, 115885, 123217, 126741, 133758, 130907, 137759, 143093, 123739, 133876, 135676, 122022, 146547, 163073, 171161, 185117, 189861, 209502, 237992, 234279, 220637, 197604, 162161, 148383, 158867, 195729, 222435, 219048, 200043, 168192]
14733A68192J5848j2909O182J9310k0735J7602N363k3375j7788k3000K8627J4235
14721A77552j8013j1240J494k897q42J4478k875k2671J6530L0259j183N95j8882
14708A62305l6280j561J5915Q432Q875J0962r532r084k9335j094J2285L2561j7759
14695A46690j7769L0554J9604k931k0090n106K2114m748J2891k0244k6740P811
14683A42036k859j5382J8991L3260K573l1252n861o481j0090L7815l872j2020
14671A46858J4703J5359N437K2345k763l583K7594j761n954j901J0622J8041l906
14658B41091r868J2399j9537j8931n476K2339L1885J6363o216j2726j4976J883
14646B38230L4266Q529n409J212K8972Q011j3630J0803L7758R518m765q848J5852
$$ y = [168192, 184040, 171131, 177313, 196623, 175888, 193490, 198853, 175478, 157690, 134690, 163317, 177552, 159539, 148299, 149793, 146896, 146054, 160532, 157657, 134986, 151516, 181775, 180592, 181187, 162305, 126025, 124464, 140379, 148811, 157686, 168648, 159116, 150032, 120697, 119603, 131888, 164449, 146690, 128921, 159475, 179079, 176148, 156058, 150952, 173066, 168318, 181209, 160965, 134225, 142036, 139177, 123795, 142786, 176046, 178619, 147367, 141506, 135025, 124935, 162750, 158878, 146858, 161561, 176920, 182357, 204702, 201939, 198356, 225950, 224189, 218235, 216334, 226956, 244997, 241091, 231223, 243622, 224085, 205154, 199678, 222017, 253902, 270265, 264049, 251323, 236347, 238230, 272496, 281025, 275616, 276828, 305800, 313811, 300181, 310984, 348742, 358260, 353495, 344647, 360499]
14633C60499R755J2811R328l597J6608L6123M680l184J6405n803J4808K3575N523
14620D97531j7675P105m757j2960J4516J1018K4018K0558m22k0611p983O149k3312
14607D93175L417K4870K5737L454J7118L251l362j3491J4089j1287K7350K5626
14595F09947J1817j5900q693j5778Q400j684J5300L8652K3582K5267m039j4143
14583F72728R796J8418L8275K7061J3042L4402K5562K0182L1470J5449K9372R708
14571I45465L034J5006N803K0491N5413L4593L4402K6071L6310K923N232M0906
14559A225649K7956P273K4831N7003P1401N3822M0663L7014N1889M5129M2085
14548A684715N4163O9117Q7650M8934N1623P6900P4359N9619Q5877J10795R8727
$$ y = [360499, 370254, 383065, 392393, 388796, 405404, 441527, 446207, 443023, 459428, 453625, 468433, 492008, 497531, 479856, 486961, 482204, 469244, 483760, 494778, 518796, 539354, 538932, 518321, 510338, 516487, 493175, 496592, 521462, 547199, 550653, 567771, 571022, 567660, 554169, 568258, 556971, 584321, 609947, 621764, 605864, 597171, 581393, 589793, 588109, 603409, 642061, 665643, 690910, 686871, 672728, 682524, 700942, 739217, 766278, 779320, 813722, 839284, 859466, 890936, 906385, 935757, 945465, 948499, 963505, 969308, 989799, 1045212, 1079805, 1114207, 1140278, 1176588, 1179511, 1184743, 1225649, 1253605, 1260878, 1285709, 1342712, 1414113, 1467935, 1508598, 1545612, 1597501, 1642630, 1684715, 1738878, 1807995, 1895645, 1944579, 1996202, 2073102, 2147461, 2207080, 2292957, 2403752, 2502479]
14537B502479R1994J16498J31528J36221J17871J17940J44766J57631J38431J89549
14527C844908K06556J79657K05400K32211K73974K66161K81549L43515L24472
14518F158403L53293M20050M65179M61355N11565N94344O24844O58379P50687
14509A0998099Q71645R29703J042663J150200J283002J425853J614081J779084
14501B1094330J968893K155521K405161K647387K931354L140064L354250L519740
14493D3216700L593872L500562L253325K818394K161364J346481M37664n21529
14485E9806833j449737k218361k798042l181130l379615l449817l362745l219854
14477C6747532l023752k770069k543859k348243k131307j907126j753606j588958
$$ y = [2502479, 2594473, 2710971, 2842499, 2978720, 3096591, 3214531, 3359297, 3516928, 3655359, 3844908, 4051464, 4231121, 4436521, 4668732, 4942706, 5208867, 5490416, 5833931, 6158403, 6511696, 6931746, 7396925, 7858280, 8369845, 8964189, 9589033, 10247412, 10998099, 11869744, 12799447, 13842110, 14992310, 16275312, 17701165, 19315246, 21094330, 23063223, 25218744, 27623905, 30271292, 33202646, 36342710, 39696960, 43216700, 46810572, 50311134, 53564459, 56382853, 58544217, 59890698, 60328362, 59806833, 58357096, 56138735, 53340693, 50159563, 46779948, 43330131, 39967386, 36747532, 33723780, 30953711, 28409852, 26061609, 23930302, 22023176, 20269570, 18680612]
14469A8680612j430633j300396j182548j090858r55558q75542p80418p25185o52636
14460I686838n82260n43618n26389m56031m12138m24529l80645l06788l29620
14451E724820l13215k71870k36820k17081k12224k25480j72664j73895j78908
14442C722663j59283j58926j62248j22954r8906j24880j14774p2614q2869q3705
14432B541504q9167r9250r1019o6198o8660j03298o9916k8913o2322p3718o4342
14421A724701m8361m3250k6691j9821n7778n5211m7964m6945l3993j3947l82l9029
14409A291329m8334l2536l4795n0915l8852j7390k2795l6085j1267k2399j2748
14398I63213j4942j1507P889k6562n9684m0147k7958M824K6737m307k8505j2456
$$ y = [18680612, 17249979, 15949583, 14767035, 13676177, 12720619, 11845077, 11064659, 10339474, 9686838, 9104578, 8560960, 8034571, 7578540, 7166402, 6741873, 6361228, 6054440, 5724820, 5411605, 5139735, 4902915, 4685834, 4473610, 4248130, 4075466, 3901571, 3722663, 3563380, 3404454, 3242206, 3119252, 3020346, 2895466, 2780692, 2708078, 2625209, 2541504, 2452337, 2353087, 2262068, 2195870, 2127210, 2023912, 1953996, 1925083, 1862761, 1789043, 1724701, 1676340, 1633090, 1606399, 1586578, 1528800, 1473589, 1425625, 1378680, 1344687, 1330740, 1330358, 1291329, 1242995, 1210459, 1175664, 1124749, 1085897, 1068507, 1045712, 1009627, 998360, 975961, 963213, 948271, 936764, 944653, 918091, 858407, 818260, 790302, 795126, 821863, 817556, 789051, 776595]
14386G76595R113o604p727l2927m3677k2407k0285O267o719j3897n284J0992J492
14373F44932M044l379n0045j5250K536j6158M758k2955k2071p893l68K170j1430
14360E08891l4379j6271k672K294k2018k6438j2450J2144J7161j9482K806N696
14348D15282J4771J7492k8859j8825r156k1075k638K3943r824j1467j9188k5328
14336C25128P013j993j927l730J0102K1998k581r004N555K837j2643r134k003
14323C29618j101j3446m212j3376p559J1303l6837k0794J1679j0412P505K2113
14311B74481M8315L4730J231k4265l4309k3756j048P429j9122l619k29j1858l733
14298B44247k8154J2425L1508k0233J656j0455L137J3530J7062l1102O8J2310
$$ y = [776595, 785708, 779104, 771377, 738450, 694773, 672366, 652081, 658348, 651629, 637732, 632448, 643440, 644932, 648976, 645597, 595552, 580302, 582838, 566680, 571438, 548483, 526412, 518519, 518151, 520321, 508891, 474512, 458241, 455569, 457863, 435845, 409407, 396957, 409101, 426262, 406780, 409586, 415282, 430053, 447545, 418686, 399861, 390705, 369630, 366992, 390935, 381111, 369644, 350456, 325128, 332141, 330148, 328221, 324491, 334593, 356591, 354010, 345006, 350561, 353398, 340755, 331621, 329618, 328517, 315071, 310859, 297483, 289924, 301227, 264390, 243596, 255275, 244863, 252368, 274481, 322796, 357526, 358757, 334492, 300183, 276427, 275379, 282808, 263686, 260067, 259838, 247980, 244247, 216093, 228518, 260026, 239793, 241449, 230994, 234131, 247661, 264723, 233621, 233689, 245999]
14286B45999j5063k9028J0593R893k2646k2260q768P042J0162K8802K2609j2049
14274B25286k1540r341p891j5081k5560r376J2213J9135q4J4762L3274K1604o006
14261B31395n015n502l7759l1392j0261K8592J6157n676K0263k4972j5989q538
14249A51303J9893L927j3734J5994J7510q858R004O637K461j0772j5716m709k0431
14236A52509L2N3963J0782k406L6167l833k313k2208k0713J3272K0820r575j5842
14223B10655J5601J1520l9634l3443l0485o901k23J4721J6651m169L131O539m413
14210A59550j0818k664l532R885m171j6709P634L3011J2263j1329k4875k3563
14198A24682K836k42o559J7218r295m665l54j2762l2459m765k488k906k0496m302
$$ y = [245999, 230936, 201908, 212501, 222394, 199748, 177488, 168720, 175762, 185924, 214726, 237335, 225286, 203746, 194405, 186514, 171433, 145873, 136497, 148710, 167845, 167761, 182523, 215797, 237401, 231395, 226380, 220878, 183119, 151727, 141466, 170058, 186215, 180539, 200802, 175830, 159841, 151303, 171196, 175123, 161389, 177383, 194893, 186035, 195039, 201676, 204137, 193365, 177649, 172940, 152509, 152541, 206504, 217286, 214880, 251047, 247214, 244901, 222693, 201980, 215252, 236072, 226497, 210655, 226256, 237776, 198142, 164699, 134214, 127313, 127090, 141811, 158462, 154293, 157424, 163963, 159550, 148732, 146068, 142536, 152421, 148250, 131541, 139175, 172186, 184449, 173120, 148245, 124682, 127518, 127276, 120717, 137935, 128640, 123975, 123621, 110859, 78400, 73635, 71147, 68241, 47745, 43443]
14184D3443K7172K9121l432M36P136j4659Q839q059k8008L492K1516j4290j1638
14171F1069J200K736q612k4599k8082P394k955J2104L3753M740p309K110K5583
14158G9132P957j2669O806J2062N991j1115L0949L622o1145j8010O945o491L164
14145D7198K0441j5227L3747j0780j4769J2869l324L863M083K1538p49j7042j712
14132H0136j1658M090J3134p470j9052q23R166j096j8114Q47J5089o183j4727
14119D3339o817K408J0230j009Q858M163M997r32J1624K3614p611Q09j9126j4162
14105F0385L773j3077J1126P75k9426m51K1693J6907j5008j9645R634K3264j2959
14092E6991k511N943L466j3430j302J1923L774k3846L2284J9098j1254j1984j8227
$$ y = [43443, 70615, 99736, 96304, 96740, 103876, 89217, 98056, 89997, 61989, 65481, 86997, 72707, 61069, 62269, 65005, 56393, 31794, 3712, 11106, 8151, 20255, 54008, 58748, 51439, 53549, 79132, 87089, 74420, 81226, 93288, 99279, 88164, 119113, 122735, 61590, 43580, 50525, 44034, 47198, 67639, 52412, 86159, 75379, 60610, 73479, 70155, 74018, 78101, 99639, 98890, 81848, 80136, 68478, 72568, 85702, 78232, 59180, 58357, 67523, 66427, 48313, 49160, 64249, 58066, 43339, 36522, 38930, 49160, 48151, 57009, 61172, 66169, 65237, 76861, 100475, 92864, 93673, 74547, 60385, 64158, 51081, 62207, 62982, 33556, 33105, 54798, 71705, 56697, 37052, 46686, 69950, 56991, 54480, 60423, 63889, 50459, 49157, 61080, 64854, 41008, 73292, 92390, 81136, 69152, 50925]
14079E0925J6764Q372k947k1783j593P974k0202j9380O721K6137M890J2561j5505
14066E2934p892j0195j5717k106j8661l566L4576M919l672J3957J009J274j1439
14053C5421j3145J5753K7202j2737k4749J8199O606K7508J4096R788j2187L99
14041I2154K1533o419Q848j6786m937l90n836o136M371J1362p971o617j9709m3189
14027B0278j2884L0339j05Q7J4073O090n913J1480k1667q236j7401R900M2724
14014F8765K2427L335q431l5705k9401j2625K1295J3696j1273k7026j660J4194
14002A7591J1405J8783j829k0609O780m695j3384k5308N629J1050r325j7674M2333
13989B0747O186q277k339o376J3985J526L089j352N726J7424M004Q08L2958j3140
$$ y = [50925, 67689, 76061, 73114, 51331, 49738, 57712, 37510, 18130, 24851, 50988, 55878, 68439, 52934, 45042, 34847, 19130, 17024, -1637, -5203, 29373, 34292, 30620, 44577, 45586, 46860, 35421, 22276, 38029, 65231, 52494, 27745, 45944, 52550, 80058, 94154, 103942, 91755, 92154, 113687, 107268, 116116, 99330, 94393, 94003, 88167, 82031, 86402, 97764, 89793, 83176, 63467, 20278, 7394, 37733, 37628, 37715, 51788, 57878, 51965, 63445, 41778, 33542, 16141, 26041, 68765, 91192, 94527, 86096, 50391, 20990, 8365, 29660, 43356, 32083, 5057, 3397, 17591, 28996, 47779, 45950, 25341, 32121, 27426, 14042, -11266, -5637, 5413, -3912, -21586, 20747, 26933, 18656, 16317, 9941, 23926, 25452, 28541, 27189, 32915, 50339, 54343, 55151, 88109, 74969]
13975G4969k6014L363J0583k2702r696R962L4629j6877k3237k3411J3421j6933
13963H057k948K1358K134l076n609R06j2020o464m002K4237m173j2770j4240J109
13949g501P564K000K495q914k2196J3375m035J7780J4589L643l082j6483q128
13936h893R008K5069o930k5701M003J2649J9729q898j2571J3614K1517p743j6578
13923A8275k4919n277J6724J1365J9667R587J3767L859j9833J7822r145o617m815
13910D0460o012J606L479j7696k619N14J0322P385N482j4809R120j2522L845K3364
13896E1919J7054k0575p630Q598j4068j3012R052n173Q340j5654J943k298K0354
13883C8850M4216J6258m3764j4372J4402K423k8990J1484p488j7834k4045J9203
$$ y = [74969, 48955, 52318, 62901, 40199, 30503, 40465, 75094, 58217, 34980, 11569, 24990, 8057, 5109, 26467, 28601, 25525, 19916, 20822, 8802, 2338, -1664, 22573, 18400, 5630, -8610, -7501, 63, 2063, 4558, -4356, -26552, -13177, -17212, 568, 15157, 18800, 15718, -765, -8893, 115, 25184, 18254, -7447, -3444, 9205, 28934, 20036, 7465, 21079, 42596, 34853, 18275, -6644, -11921, 4803, 16168, 35835, 45422, 59189, 63048, 43215, 61037, 51892, 45275, 40460, 34448, 36054, 39533, 21837, 19218, 19732, 30054, 37439, 42921, 28112, 37232, 24710, 28555, 51919, 68973, 48398, 40768, 49366, 35298, 22286, 31338, 26165, 34505, 18851, 20794, 18496, 38850, 83066, 99324, 55560, 41188, 55590, 58013, 29023, 40507, 33019, 15185, -8860, 10343]
13871A0343J9213J330j4703j8581m27o083N745L1843L9541P857L730k4447n850
13858D9511j3452j4091N521l2360J5831J364P542P302R763j383j0539j536n910
13845A7563q831q606N66L210K8206m116j4131l1634o260k492J6448k1951l4230
13832f6258M201Q257K9574K7909J6920q390o270J2802J5505J3247N269k224j8373
13819C2169k1671K2307p057j7324J3770K235j0572O529j3823j809J0754K9491
13807D4999q455k6428M071J330N040k6370J6584K4763J0437j4692l2687k0655
13795b2063L0717J3560j6356j3794J1850r614P240M216J961j7293n385R577m004
13782i388j1602O829K6839J999J5263n965k5877K2941K3340J9550l9770m0920
$$ y = [10343, 29556, 30886, 16183, -2398, -2825, -8908, -3163, 28680, 68221, 76078, 79808, 55361, 49511, 36059, 21968, 27489, -4871, 10960, 12324, 19866, 27168, 36931, 35548, 25009, 23473, 17563, 8732, 126, 692, 3902, 32108, 27992, 13861, -17773, -24033, -26525, -10077, -32028, -66258, -62057, -53800, -24226, 3683, 20603, 12213, 5943, 18745, 34250, 47497, 52766, 50542, 32169, 10498, 32805, 25748, 8424, 22194, 24429, 13857, 20386, 6563, 4754, 15508, 44999, 36544, 10116, 14187, 15517, 20557, -5813, 10771, 35534, 45971, 31279, -1408, -22063, 8654, 22214, 5858, -7936, 3914, -5700, 1540, 5756, 7717, -9576, -14961, -5384, -9388, -20990, -14161, 12678, 14677, 29940, 23975, -1902, 21039, 44379, 63929, 24159, -16761]
13770a6761n297q948M8541j5570j1834J2987O378J0606k7868n684Q596K8738L1490
13757E5374l8265m1354O045l301J6688R49J7089k1482j0780L3767J1613J3254
13745C9597J2360R138j0246k0745j3065j4127l0580q80K8501J089k3676k2294
13733d4928J4913K7102L4539N295l1377J99M0452P785l2318j6810K2825R475j3365
13720B3787j301R743J7081j8651k2083J3428K683r394k2834k3622j3025O522K2730
13707a4936K3513Lq419N630k844R31j8250Q797J1547j4658M029M00j342l030J4008
13692E379P492k485o31j3136M565j2759n19r447M089R824J5402q745K0178J3428
13678C2635n056L927K1832J2870O830k1463k5448j347k826k7039j0111J8678J1767
$$ y = [-16761, -22058, -31006, 17535, 1965, -9869, 3118, 9496, 20102, -7766, -13450, -4854, 23884, 55374, 17109, -24245, -18200, -21501, -4813, -3864, 13225, -8257, -19037, 14730, 26343, 39597, 51957, 61095, 50849, 30104, 17039, 2912, -27668, -28548, -47, 1042, -22634, -44928, -30015, -2913, 31626, 36921, 5544, 5743, 46195, 53980, 21662, 4852, 27677, 37152, 23787, 22486, 32229, 49310, 30659, 8576, 22004, 24687, 15293, -7541, -31163, -44188, -37666, -14936, 8577, 8580, 161, 5791, 2947, 3878, -14372, -5575, 5972, -8686, -4657, -4257, -5599, -8629, 5379, 12871, 10386, 9755, -3381, 1184, -11575, -12094, -21541, -17452, -7628, 7774, -971, 19207, 32635, 27579, 31506, 53338, 66208, 73038, 51575, 26127, 24780, 21954, -5085, -15196, 3482, 15249]
13665A5249k7248j08k422J6692J7374M418o613j7214N774K8985j3017j2933j8645
13652i708Q835K0321O601O094k358L763l4327j5685k712q450o645k462l682K7279
13638a3136q407K6384k1271P143j7687O505r732o538L0459J2970j637j559J1641
13625A5135l539r179o662j1825k1759o386K2742O482K1217K1606J761j0960R771
13612B8404J6337O343J5808k2220m2579J0969r365J1725O523p74k2831r218J3820
13599B942J025R583L361R518p15J0674l5624n158k0985J6804K3227J6524M005
13586C5181j7425j6990j0950l771j268j1559O255J3999J4191K884J8115k4950
13574C712k1455J6463K0223P064J5619r528n41q860K934q401N946j7784k4705
$$ y = [15249, -11999, -12107, -14529, 2163, 19537, 23955, 17342, 128, 5902, 34887, 21870, 8937, -9708, -873, 19448, 26049, 32143, 29785, 33548, -779, -16464, -19176, -27626, -34271, -36733, -40415, -13136, -21543, 4841, -16430, -9287, -26974, -20469, -30201, -36739, -6280, 6690, 5053, 3494, 15135, 11596, 2417, -4245, -16070, -37829, -44215, -21473, -14991, 6226, 27832, 29593, 18633, 28404, 44741, 51084, 66892, 44672, 2093, 13062, 3697, 15422, 21945, 21171, -1660, -10878, 2942, 3967, 13550, 16911, 26429, 25714, 36388, 764, -4394, -25379, -8575, 14652, 31176, 35181, 17756, 766, -10184, -13955, -15223, -26782, -20527, -6528, 7663, 10547, 28662, 3712, -17743, -1280, 18943, 26007, 41626, 32098, 31557, 22697, 25631, 17230, 23176, 5392, -19313]
13561a9313J3994K0229L204L164J7262j5044k1852j2827l165J0055J0531L20k986
13548C572l263J4412j7725q160M050J5887l257J5710J4444n597q460l8439j3037
13535b9863J3702M549l322J4364Q953j7323K1515Q04l3619j1727J7426L6023L0353
13522E1835j4701j5996j0432j8768l0023K770P915K3426J3538K6536k1709L464
13510A7855N586j839J0379m643k816j0836k626J2862Q371k1173k429p109J9681
13497B1263K0690P736j5525j5807j822K389j6617l1625j4549J7265K1658K1441
13485A6497k51j4594k4039j8137k9464J4400K0621j3726R740J7034P326m12j2480
13472b7485j931l4522R876L0828N2626P402j3911k8422J1892n16j0006L0585K935
$$ y = [-19313, -5319, 14910, 18114, 21278, 38540, 23496, 1644, -11183, -14348, -4293, 6238, 6558, 3572, 309, 14721, -3004, -11164, -7114, 8773, 5516, 21226, 35670, 30073, 21613, -16826, -29863, -16161, -11612, -14934, -570, 8383, -8940, 12575, 13379, -20240, -31967, -14541, 21482, 51835, 37134, 21138, 10706, -8062, -38085, -35315, -27400, -3974, 9564, 36100, 14391, 17855, 23441, 21602, 31981, 27338, 24522, 13686, 11060, 23922, 32293, 11120, 8691, 1582, 21263, 41953, 49689, 34164, 18357, 16535, 18924, 2307, -29318, -43867, -26602, -4944, 16497, 16246, 1652, -22387, -40524, -69988, -55588, -34967, -48693, -38953, -21919, -14593, -15005, -27485, -29416, -63938, -54062, -23234, 29392, 36794, 22883, -5539, 6353, 5837, -4169, 26416, 29351]
13459B9351k0880J7320n083j8010k7515j8359n096r865J6709l50K763O343O53
13446c2019K966k3461P091j9031L0028L8995p445R200K1628j2478J1632J6123
13434D3229l4401m1907p842O853J6161N0603O004k7855o539j168k2323k1726J3420
13421b7491M573l831L0680K5954J3546K5665j8283k774J6674l6867k7468N233
13409E611J0636Q347K400j2736j9870j0962J5513P587r833O633l198r033l0130
13396c9035P362J6529k4641j2257L0373K3513P370M445Q26k924K3614M058j2898
13383B6335J818P769k3734j7384k080j9565J0870K2583r022j9111j2250j8401
13371e2172P474l563L6285J1850k0086J82J3971j2421n346k2329k2958p15K4811
$$ y = [29351, 8471, 25791, 20708, 2698, -24817, -43176, -48272, -58137, -41428, -41778, -39015, -32672, -32019, -29053, -52514, -45423, -64454, -34426, 4569, -2876, 6324, 27952, 15474, 27106, 43229, 8828, -33079, -40921, -34068, -17907, 32696, 38700, 10845, 4306, 3138, -19185, -40911, -27491, -22918, -26749, 3931, 29885, 43431, 69096, 50813, 48039, 64713, 27846, 378, 5611, 16247, 24594, 26994, 14258, -5612, -16574, -1061, 6526, -3307, 3326, 128, -8905, -39035, -31673, -15144, -39785, -52042, -21669, 1844, 9214, 13659, 14485, 11561, 35175, 39233, 26335, 28153, 35922, 12188, -5196, -7276, -26841, -15971, 6612, -2410, -21521, -33771, -52172, -44698, -48261, -11976, -126, -20212, -20030, -6059, -18480, -23826, -46155, -69113, -69828, -45017]
13358d5017J9142O65N724K0118P714R264K674M36q389J5573l618J644k2266l9235
13344c5571K1453J150j6288j2618K3805j3698j1807M1074P832L282m648K3765
13332B7731K4874l2633J675j1280j7402l0036J2594K6291k4442j3549l770O827
13320c3120M289N330R182K454k4480J568J4268j0649j1573m811j8978J4533L8382
13307a3605L2387r923k2072j2888L578P478j4261p828Q995K2496n779M047Q14
13294f561j9007j933J9968K148J0271N284K9415r403p795o73L7376j3474j3386
13281C2230j3897m136q967O755l8442j6821L7322K3300R305J6352j7760q354j2167
13268D720O970M902J049l623k0455k5246j3091p882k433N689O331R058J3535Q37
$$ y = [-45017, -25875, -25210, -19486, 632, 8346, 17610, 20284, 20720, 12331, 27904, 24286, 25930, 3664, -35571, -14118, -12968, -29256, -41874, -18069, -31767, -43574, -2500, 5332, 8614, 3966, 27731, 52605, 19972, 21647, 10367, -7035, -37071, -24477, 1814, -22628, -36177, -39947, -33120, -28831, -23501, -14319, -11865, -36345, -34777, -20509, -31158, -42731, -47542, -66520, -51987, -13605, 18782, 8859, -13213, -26101, -22523, -15045, -29306, -37134, -28139, -5643, -11422, -7375, -6561, -25568, -27501, -7533, -5385, 4886, 10170, 39585, 30182, 22387, 21714, 59090, 45616, 32230, 18333, 14197, 5230, 11985, -26457, -43278, -5956, 17344, 26649, 43001, 25241, 16887, 4720, 11690, 16592, 17641, 14018, -6437, -31683, -44774, -52656, -55089, -49400, -43069, -34011, -20476, -19639]
13254a9639j3121J1677K7518M43P339J3756m426J9672K5439l5456l3409P06K0883
13241B1382j3010j3256J3961n194n553J9070L7920R063k8443j4367k7419j5833
13229b1679J9334M575L989J7485O320k9123k6360P034K0833P87l01N382j1465
13216c189P085J6996M322p336k1595j171O756j6611j1186K058M0073J7089j9720
13203A3571j9886j2797J7862r314J486K7279L1114K7102L7410K0877M5519P8445
13191B58668R4383L3936l2037q7952o6741l4547l6220m0376l8830j5943k1475
13180A2866j2866J525O509k3361N858Q631K3723Q694p442m329K2278J1750j3647
13167D0189J5783J6512J5047K6873L3825N7380J00684J52313K37917K84555K05478
$$ y = [-19639, -32760, -21083, 6435, 6878, 14217, 27973, 23547, 43219, 68658, 33202, -207, 499, 21382, 8372, -4884, 9077, 3883, -1670, 17400, 55320, 64383, 35940, 21573, -5846, -21679, -2345, 2230, 6219, 23704, 30024, 901, -25459, -18425, 2408, 3195, 2894, 8276, -3189, 3896, 20892, 25214, 17878, -3717, -4888, 1868, -14743, -25929, -23871, 16202, 33291, 13571, -6315, -19112, -1250, -10564, -9078, 18201, 49315, 76417, 113827, 134704, 180223, 258668, 353051, 386987, 354950, 266998, 200257, 165710, 129490, 89114, 50284, 34341, 12866, 0, 1525, 8034, -15327, -9469, -838, 22885, 31579, 24137, 19808, 42086, 53836, 40189, 55972, 72484, 87531, 114404, 148229, 205609, 306293, 458606, 696523, 981078, 1186556]
13156A186556r1672l01853k52045j74347j37906r9853o1883J841m551M898K584
13145G1769k0144j797M458Q31q850j2356K633J0184J5409M551p16K6935K031j8781
13131G6157J6120K8468O6629R5782J45434K33819K88520K44609p091k52924k74457
13120F61066j96270j27831q5550r1220q0292k2078L0069j7155N880J2434l2843
13109E6210m660k7320m5678j0810J3148K4230J5640K3726r395L120r126k2819
13097F266L32M8303L7181L8572N6252J08250J24750N3069q1085j25870j06198
13086A59822o1559l9305k2898k0054j2628j1280M412q153J5075q70K5242K2328
13074E0132L554l1277j4905J0398O611O276K3851j8436k2596q139N412L4312j7358
$$ y = [1186556, 1094884, 793031, 540986, 366639, 228733, 128880, 66997, 68838, 64287, 69185, 71769, 51625, 49828, 54286, 55117, 46267, 33911, 36544, 46728, 62137, 66688, 65972, 92907, 94938, 76157, 92277, 120745, 187374, 283156, 428590, 662409, 950929, 1195538, 1188447, 935523, 661066, 464796, 336965, 251415, 160195, 79903, 57825, 87894, 70739, 76619, 89053, 56210, 51550, 24230, -21448, -32258, -19110, 5120, 20760, 44486, 35091, 38211, 29085, 6266, 6598, 54901, 92082, 130654, 186906, 295156, 419906, 472975, 391890, 266020, 159822, 98263, 58958, 36060, 16006, 3378, -7902, -3490, -11643, 3432, 2562, 27804, 50132, 53686, 22409, 7504, 17902, 24513, 30789, 54640, 36204, 13608, 5469, 10881, 45193, 27835]
13061B7835j879k2215q11J0626N410k506j8608L023o164j875J6929J873l3200
13048b1562K249J2763k512j7181r47n302P92j2127p39J0581N036J9670K5633j1286
13034E068k0656O6J8189K1130j8038l52J074M561J3166K6447K0160j9998O446
13021E7263k862K754n361j9962J458M646l2712j5952J3934K3336k3115r01k0089
13008a7563l0753K05K0686k570m50O614K3808l918O718J0028Q862l6633P51j0447
12994b4662J0062m992J11J9468J5378J0748L884j2682j380J6717j4980j9997J5238
12981A2913J4623k3104j5796j5158P028J0976K9751J0583k0716j1450l9830k0796
12969f0976K106K317L2448J6582o616K042J3886K0085j0166M142l908j7178l5769
$$ y = [27835, 25956, 3741, 2930, 13556, 18966, 16460, -2148, 875, -5289, -7164, 9765, 11638, -21562, -19313, -6550, -9062, -26243, -27190, -32492, -31700, -43827, -44566, -33985, -28949, -9279, 16354, 5068, -15588, -15522, 2667, 23797, 5759, 5407, 6481, 11042, 24208, 50655, 70815, 50817, 57263, 54401, 57155, 51794, 31832, 33290, 37936, 5224, -10728, 3206, 26542, 3427, 2526, -17563, -48316, -48111, -27425, -29995, -30445, -23831, -23, -3941, 2777, 12805, 21667, -14966, -14215, -24662, -14600, -19592, -19481, -13, 15365, 26113, 29997, 17315, 15935, 32652, 17672, -2325, 12913, 27536, 4432, -11364, -26522, -19494, -8518, 21233, 31816, 11100, -350, -40180, -60976, -58870, -56553, -24105, -7523, -14139, -12097, 1789, 21874, 11708, 15850, 11942, -5236, -41005]
12956d1005J0156K2760L0731N95n468j0633j4117J3062J1974l3858p533j408m950
12943b9694J9395K1349L6537k1404l1614L8741J2732l1653k1303o901J4965J4805
12931A5955L1002r176r215r387j7458N289L3969j4720j1486j953P235J4198m324
12918B9929k4149P121J0695Q020Q34K2244J7812k0181m862R338l2404r627l0613
12905a5843j4274K4018j2584p120J7967K4089n813M512o465q968p360Q713k35
12892F37j4442k2338K7641m488j6915J2446J1030J4397K0416P252P043k3532Q826
12879B7973J458l0263k0986J3977j9848l7986q826K2258K9226j2278J8902k1133
12867c7526j4444L2438J7397Q090L800J2428j7211p236j4259l970K7546L737m629
$$ y = [-41005, -30849, -8089, 22642, 23237, 17769, 7136, -6981, 6081, 18055, -15803, -23336, -24744, -29694, -10299, 11050, 47587, 26183, -5431, 33310, 46042, 14389, -6914, -13815, 1150, 15955, 46957, 37781, 28566, 19179, 1721, 7010, 40979, 26259, 14773, 12820, 20055, 34253, 29929, 5780, 12901, 23596, 31616, 32450, 54694, 72506, 52325, 47463, 56801, 24397, 14770, -15843, -30117, -6099, -18683, -25803, -7836, 16253, 10440, 14952, 8487, -481, -7841, 872, 637, -13805, -36143, -8502, -12990, -29905, -17459, -6429, 7968, 28384, 35636, 42679, 19147, 27973, 29431, -832, -21818, -7841, -27689, -65675, -74501, -52243, -23017, -35295, -16393, -37526, -51970, -19532, -2135, 5955, 9755, 22183, 4972, -2264, -16523, -20493, 7053, 10790, 6161]
12854F161K079J625j3813N614l6043j5768L6688J5716k0829J0826K3629m624l2230
12841b0969j7033J0211r28P097J0132J7814j9948o857j3147N055o505K1084J4697
12828G03L7187R794k9980o930L465j9006P215M316k0310l036L1365R300q194j0368
12814E521m4507O880K7182r46j2053k0358N438j7717J1266l881R717j6257J0649
12801c9066k48K4219J9030k600p088K0589m329l6602l8209r113J569j029K1428
12788e1449K1842K4138L5065L52j2699O88j0898j5510j6347J6263L1398k4421
12776a578k393J5263q216o149J2001l8442j7549Q936J7283L6305r595j6313L294
12763g153j4337J0097m878J040o839k5495L1744J0922j4905k0677j452K1595J3514
$$ y = [6161, 8240, 9865, -3948, 1666, -34377, -50145, -13457, 2259, -18570, -7744, 15885, 11261, -20969, -38002, -27791, -28719, -21622, -11490, 6324, -13624, -20481, -33628, -28573, -35078, -13994, 703, 37890, 47684, 17704, 10774, 14239, -4767, 2448, 6764, -13546, -16582, 14783, 24083, 15889, 5521, -38986, -32106, -4924, -5870, -17923, -38281, -32843, -50560, -39294, -43175, -33458, -49715, -39066, -39314, -15095, 3935, 1335, -5753, 14836, 10507, -26095, -64304, -73417, -71848, -72877, -51449, -29607, -5469, 29596, 29948, 17249, 17937, 7039, -8471, -24818, -8555, 22843, -1578, -3971, 11292, 3076, -3073, 8928, -29514, -47063, -38127, -20844, 15461, 5866, -10447, -7153, -21490, -11393, -16271, -15231, -22070, -47565, -15821, -4899, -19804, -40481, -41933, -20338, -6824]
12750f824j0678k851k0488k1455J2476J1093K0833L274J2013l840N786o71o263
12737g595j6499k1176o080K1840O637J2116n32p235j1307K3636n408M759j5734
12724b2578J3840M4531J1330j8800N941k7101j8090p851J1401L5444j0654k331
12712A5082j7057J066O627L5835l308k5467l0674j8507j2581M218j365L2237j4770
12699b8664Q936J8572r764j7361J7821J1793k2013l0673O617N0611K1443Q923
12687C6241k754m867J6817j3054l0528l1984j4096j0492k1869n095K2946L1736
12675b6999j6424m081n442j3787J1659L8935L644M997M166j5226K250J9644j4095
12662a0759r436K704O35M457j7815N193J1893J9730l028j8320l773m768j0052
$$ y = [-6824, -17502, -20353, -40841, -62296, -49820, -38727, -17894, -14620, -2607, -6447, -661, -1332, -7595, -24094, -45270, -51350, -29510, -22873, -10757, -11289, -18524, -29831, -6195, -11603, -6844, -22578, -8738, 35793, 47123, 28323, 34264, 7163, -10927, -18778, -7377, 28067, 17413, 15082, -1975, -909, 5718, 41553, 38245, 12778, -17896, -36403, -48984, -44766, -46131, -13894, -28664, -19728, -1156, -10920, -28281, -10460, 1333, -20680, -51353, -44736, 5875, 27318, 36241, 33487, 28620, 45437, 32383, 1855, -30129, -44225, -54717, -76586, -81681, -58735, -26999, -43423, -47504, -52946, -66733, -55074, -16139, -12495, -7498, -3332, -18558, -16308, 3336, -10759, -20195, -17491, -16856, -12399, -30214, -25021, -13128, 6602, 3574, -14746, -18519, -23287, -33339]
12649c3339l2080K1328K1778j0207r922O148Q96K2521K1357r87j0096J3719N535
12636A6651k2887k842j7390r889J3808j3681L110o965n278K5201K8206L0203j953
12623C6294l6512r501m504o381j6766L627J3151m595k231K3j9046m221K1174q38
12609c0326R03J8487K3483P147j9992m6630o13J0383K55K4135q668k3542J7434
12596b7544K1135m702l76P55k2799M442J6419r473O954n880n873K4044R808k2047
12582a5137K035p280j1941j9487K3983K7164J6294k1157j3825J758p195l775O944
12569b1619M017n369j8642J8561k382k1063k633L641k277R908J6615J3531J234
12556f478n702o486l8150k5849J0303Q61L633P41M0574M7146J1299L231k1336
$$ y = [-33339, -65419, -44091, -22313, -32520, -42442, -36294, -35398, -12877, 8480, 7493, -2603, 11116, 16651, -6236, -9078, -26468, -36357, -22549, -36230, -33120, -40085, -45363, -20162, 8044, 38247, 36294, -218, -9719, -14223, -20604, -37370, -33743, -20592, -25187, -27418, -27395, -46441, -50662, -29488, -30326, -29423, -10936, 12547, 19694, -298, -46928, -47541, -37158, -36903, -12768, -21436, -44978, -27544, -6409, -11111, -11487, -10732, -33531, -29089, -12670, -22143, -15189, -21069, -26942, -2898, 6910, -15137, -13102, -20382, -32323, -51810, -27827, -663, 15631, -5526, -19351, -17593, -24788, -28563, -21619, -17602, -22971, -41613, -23052, -25434, -46497, -49130, -45489, -47766, -37858, -21243, -7712, -6478, -12180, -18666, -56816, -82665, -72362, -71501, -67868, -67127, -26553, 20593, 31892, 35123, 13787]
12543A3787l6736j0358K2172P086j466q443m5984r298J4733J5650L500k4171j1453
12530g0981n87l83j0800P701J3352k543L625j221K7194R193j4148p348J3457M16
12516c3073K2410j6478j8988J2676J6165J3467j049m192o468m654j687l687j2645
12503c8203m190j2422M869P522K3539J0418k236j595k042R102L412j8232j1926
12490c1984J5470O124M144p617J221l1823j151O711L0456J437j6490k1792j3075
12477e8369J3008k6347j107K5406K1852M1831n743k8516j4191k0313M086O347
12465d2056L449J3986P644J5242o419M287J6586J1079r057l2048K8533J0914M260
12452B6400m603j2035R309K074K04j0O133j3158o803k7449J1471R015m167J847
$$ y = [13787, -22949, -33307, -11135, -4049, -5515, -13958, -59942, -69240, -54507, -38857, -35357, -59528, -70981, -71568, -71951, -82751, -75050, -61698, -64241, -60616, -61837, -34643, -25450, -39598, -46946, -33489, -33073, -10663, -27141, -46129, -33453, -17288, -3821, -4870, -9062, -15530, -20184, -21871, -25558, -38203, -42393, -54815, -49946, -42424, -18885, -8467, -10703, -12298, -14340, -5238, -1826, -20058, -31984, -16514, -10390, -6246, -13863, -12642, -44465, -45616, -38905, -8449, -7012, -23502, -45294, -58369, -45361, -71708, -72815, -47409, -25557, 16274, 10531, -17985, -32176, -52489, -48403, -42056, -38607, -24621, -16977, -1735, -8154, -3867, 12719, 23798, 14741, -17307, 11226, 22140, 26400, 21797, 9762, 19071, 21145, 21349, 21339, 27472, 14314, 7511, -19938, -8467, 548, -3619, -1772]
12438a772j9167j232J1668J4403O931j8497j2535K041j955l2869J1403K0427K54
12425b0900J381K7840l0120j0198J3160J2439K522n131k4335l351J4411J5729
12413f553N106K1859J281j69K151j1168K2430j0531k737k8404j0027J3084J9229
12400A5551J1150l788j8378J14Q800J8303J1125r280O607J55M0301M310k4276
12387F0694k7841O70K3381R273l456K1314k2488k0520K9600j5830k1264r472l097
12374B0964Q668J0554J864j9802l934J1022j8969P663j2735j9694k769K5789K053
12361A0674j5314j9222J84J0373p777j7776l518K1760K5321J062j4447J0339j916
12348b57M396P515j6968k9813n207L2082J4012L571Q126j2409j7774k1213r133
$$ y = [-1772, -20939, -22171, -10503, 3900, 10831, -7666, -20201, -18160, -20115, -52984, -41581, -21154, -20900, -19519, 8321, -21799, -31997, -18837, -6398, -3876, -9007, -33342, -36693, -22282, -6553, -1447, 20412, 21693, 21524, 23675, 12507, 34937, 24406, 21669, -6735, -16762, -3678, 15551, 26701, 22913, 4535, 4649, 13449, 31752, 42877, 33597, 40204, 40359, 80660, 84970, 60694, 32853, 33523, 56904, 66177, 62721, 84035, 61547, 41027, 70627, 54797, 33533, 24061, 20964, 29632, 40186, 42050, 22248, 18314, 29336, 10367, 18030, 5295, -14399, -17168, 8621, 10674, -4640, -23862, -23678, -13305, -21082, -38858, -42376, -20616, 4705, 5767, -8680, 1659, -257, 4139, 11654, -5314, -35127, -40334, -8252, 5760, 9331, 17457, 5048, -12726, -33939, -43072]
12335d3072k4677K1928N671k561J4193J732J0622r420k2444K5008K3332J4825
12323A5137r500j2550R01O120J0066j4743j3077O618P805l8340j0059M4232P546
12310A56l2134j0654J6437J2583J1038K4852N353l1207j2430q265P985M6740K4127
12297E4581m973k9035k4996J2303L435k8015o278L6422N574L647N438j1949j4275
12284A879j6092o795L186k3051k7185n261J5347M2818M208O099Q673k134j0163
12271h471l860P901k2324j4991n781J7896J5941L992k974k3345j6436J1665p115
12258d7902J5062J5768O861j4361j941J0393k864j0625n940J0154K3643p07Q089
12245E630R1o418q389j3692o084n06j2267J7432j7891l492P946O076L4677P013
$$ y = [-43072, -67749, -45821, -40150, -42711, -28518, -26786, -16164, -25584, -48028, -23020, 312, 15137, 5637, -6913, -6012, 108, 10174, -4569, -17646, -11028, -3223, -41563, -51622, -7390, 156, -31978, -42632, -26195, -13612, -2574, 22278, 27631, -3576, -16006, -24271, -16286, 30454, 54581, 49608, 20573, -4423, 7880, 11315, -16700, -22978, 13444, 19018, 22665, 28103, 16154, 1879, -14213, -21008, -17822, -40873, -68058, -73319, -57972, -15154, -10946, -4847, 3826, 1692, -8471, -12331, -4430, -26754, -41745, -47526, -29630, -13689, -9697, -12671, -36016, -52452, -40787, -47902, -32840, -17072, -10211, -24572, -26513, -16120, -18984, -29609, -35549, -25395, -1752, -2459, 5630, 5721, -697, -9086, -22778, -28862, -29368, -41635, -24203, -42094, -45586, -37640, -31564, 3113, 10126]
12231A0126N790j798L97J9673J330m532j3335j8961j8133j3196K3143p969j7096
12218c4561L962L480L0420n776j1771R070q396P421J2646j4405k4235J0023J127
12205b0995n469R094J7656J6512l249r724j0534J318j4519k3344K2875K9623J4476
12192B3720k0338L955R993k6660k8930N060L6927m928k7975j1461K4620j3049
12180b9066j4779J0874L9203L4703R510l1491k8307J1780R203j3532j6262l6743
12168e4907J9209J0707k0819O136j2181J5157K0973O095k1922q750r795J0492
12156c9605R372J2615K3641K9202Q59j5567j3151r093j063m139o03j0305R348
12143h489J6374P904j1016r011K1544R441Q991k322k5341l1545R017J685k5448
$$ y = [10126, 15916, 14118, 14515, 34188, 35518, 30986, 17651, -1310, -19443, -32639, -9496, -17465, -34561, -30599, -27119, 3301, -2475, -14246, -5176, -13572, -6151, 6495, -7910, -32145, -22122, -20995, -26464, -17370, 286, 16798, 13549, 3825, -6709, -5391, -19910, -43254, -20379, 9244, 23720, 3382, 7337, 17330, -9330, -38260, -33200, 3727, -1201, -29176, -40637, -16017, -29066, -43845, -32971, 6232, 40935, 50445, 18954, -9353, 2427, 11630, -1902, -18164, -54907, -35698, -24991, -45810, -39674, -51855, -36698, -15725, -9630, -31552, -40302, -50097, -39605, -30233, -17618, 6023, 35225, 36084, 20517, 7366, -1727, -2790, -6929, -7532, -17837, -8489, 7885, 15789, 4773, -4238, 17306, 26747, 35738, 33416, 8075, -23470, -14453, -12768, -38216]
12130c8216k1864K693J8239J3564J3205J8330n468j0968j7930q892k0653k557
12118f0517J3247m545J4918K3672P888K4210J7105j6306j1206k8357k0438j6990
12106e7319J814L811K5980M1782J2336M391L2608L221l5877l6493M13j8478j5467
12093c7278Q96j1016k2557p005J9008K9334K7591k0351J2970k049J0204J6493
12081A6240j8783j9353k547M593J7987q359j691L2557L1000l477j9472k2262R737
12068A6170K3876J5251R14o460K137J4262j2333k8894O17j3024O843j5172j3711
12055i524K3015K9000J3504K1402K8183k4412m9377j1260m511l2105m558j1060
12043c1703l122K962o865P804K8657K5811l535K2750M518k9738m232j777j8608
$$ y = [-38216, -60080, -57387, -39148, -25584, -12379, 5951, 483, -10485, -28415, -37307, -57960, -60517, -47270, -51815, -36897, -13225, -5337, 18873, 35978, 19672, 8466, -19891, -40329, -57319, -55505, -51694, -25714, 16068, 28404, 32795, 65403, 68624, 32747, -3746, -3333, -21811, -37278, -36382, -47398, -69955, -76960, -57952, -28618, -1027, -21378, -8408, -10457, -253, 16240, -2543, -21896, -24443, -19850, -1863, -10222, -11913, 20644, 51644, 48167, 28695, 6433, 16170, 40046, 55297, 56211, 49751, 51888, 66150, 53817, 24923, 25540, 12516, 19359, 4187, -9524, 13491, 42491, 55995, 77397, 105580, 81168, 31791, 20531, 16020, -16085, -20643, -31703, -34825, -31863, -38728, -30924, -2267, 23544, 20009, 42759, 47277, 17539, 13307, 11530, -7078]
12030g078k6684j2899L409o645J2034o052N650L832L692K1064J4070K179j4544
12017g972j6374K1869M908l947j9795j2552K8240K2285r240J9950Q904J7597K4736
12004G8609l99k6731j1823j3807N640J9236L70j192r68m613M936J5782O892L120
11990G5052M3988k0934m1652J1131L3268l1126K076K5211j8574K3312L1920m385
11978A29287K0265K546j5095K527J0475J3098J0879P601j6404O732J9582M290
11966A95783J9691L0763N5075L4799K7191J3718L836L8731N6594M0654M437J0142
11954E31414P2187P6202O7141L6072N0918L5308N7850P2475P8218J16064J45116
11943A338965J55503J83660K47668K62391K91129L91207M98327N70512P12669
$$ y = [-7078, -33762, -46661, -43252, -49897, -37863, -43915, -38265, -34433, -30741, -9677, 4393, 6572, -7972, -24346, -2477, 2431, -1516, -21311, -33863, -5623, 16662, 7422, 27372, 36276, 53873, 78609, 78210, 51479, 39656, 25849, 31489, 50725, 51095, 49903, 48935, 44322, 49258, 65040, 71932, 75052, 119040, 98106, 56454, 67585, 100853, 69727, 71803, 97014, 78440, 101752, 133672, 129287, 149552, 152098, 137003, 139530, 150005, 163103, 173982, 181583, 165179, 171911, 191493, 195783, 215474, 246237, 301312, 336111, 363302, 377020, 380856, 419587, 476181, 516835, 521272, 531414, 603601, 679803, 746944, 783016, 833934, 869242, 927092, 999567, 1077785, 1193849, 1338965, 1494468, 1678128, 1925796, 2188187, 2479316, 2870523, 3368850, 3939362, 4652031]
11934D652031R26790J252187J724638K374477L326926M923134P521201J1740538
11926C8441922J8119265K5519028K6126791O532348k1490652k8340734k0773894
11919D4134074j3118222q279775n384796l632825k559350j894361j416193j115539
11911F733013r13113p86634o30204m96419m19247l92771l16289k89836k35643
11902B252857j94500j90176j85933j27415j06586j10030j28638r0413n6821q5821
11892I76524j00214o3662l4023p7416k7608n59k2981l5302j5566l5998k7492m8854
11880D86849n997l752l9382n0944k9335j5890L7469M18J376k1888n7009m8576
11868B53339o798k516k957j8419J820J0086k5890o968M378J2697P407k9242l4937
$$ y = [4652031, 5578821, 6831008, 8555646, 10930123, 14257049, 19180183, 26701384, 38441922, 56561187, 82080215, 108207006, 114739354, 93248702, 64907968, 44134074, 31015852, 22736077, 17351281, 13718456, 11159106, 9264745, 7848552, 6733013, 5819900, 5033266, 4403062, 3906643, 3487396, 3094625, 2778336, 2488500, 2252857, 2058357, 1868181, 1682248, 1554833, 1448247, 1338217, 1209579, 1119166, 1062345, 976524, 876310, 812648, 778625, 701209, 673601, 673042, 650061, 614759, 599193, 563195, 535703, 486849, 480852, 477100, 437718, 386774, 357439, 341549, 379018, 379436, 380812, 358924, 301915, 253339, 246541, 244025, 241068, 222649, 224469, 234555, 208665, 201697, 206075, 218772, 226179, 196937, 162000]
11855A62000j1665R350n290J0718j4395L61j9783l410L0206q423k2749N876j779
11842A31017k0321J2739r140L471J3463J4503m271k4135j2035J2040J2481l5925
11830I3887l356J5503K3242Q476r653j8406l2788J3970K3535k7793l0497P73L4028
11817I0921J4692M670j9510l3207k7068L528K7628K6945k3600l5012j4638J1361
11805B6710J230J7916J1777K1625J642K76J5620K4294j802n7191n4111Q849j2092
11792D743j2736R542K0321K5085L7602L007j9718k7909j2853R70J628k2398N375
11779A2659j8108J4210K4072p704j589Q210k3697r518K4198K0765N035k9931k2321
11766c719J7867j4261K0435L9330Nk2271k0607j9519K1096L8289j666p421o077
$$ y = [162000, 150335, 159685, 154395, 165113, 150718, 151079, 131296, 127886, 158092, 149669, 126920, 132796, 131017, 110696, 123435, 114295, 117766, 131229, 145732, 141461, 117326, 105291, 117331, 129812, 93887, 90531, 106034, 129276, 137752, 128099, 109693, 76905, 90875, 114410, 86617, 56120, 56893, 90921, 105613, 110283, 90773, 57566, 30498, 34026, 61654, 88599, 64999, 29987, 15349, 26710, 27940, 45856, 57633, 79258, 80900, 81176, 96796, 121090, 119288, 62097, 7986, 16835, 4743, -7993, 1549, 21870, 46955, 84557, 87564, 67846, 39937, 27084, 28054, 29682, 7284, 12659, -5449, 8761, 32833, 25129, 23540, 31750, 8053, -1465, 22733, 43498, 48533, 18602, -3719, 14148, -113, 20322, 59652, 59657, 37386, 16779, -2740, 18356, 56645, 54979, 47558, 41481]
11753D1481k303J6099k805j3951J9350P668n721j6830O593j1826k4638N803J1826
11740C0746q943M597o559l9890j3104K2186j3153k2871M1839L7613Q236k1483
11728A9214l2881j2254J0268N455J2183K4490J9437k023l3640J1791M2312L8381
11716A02733J2561J887J9552Q72l1498k0870k3718l3715m38L3566K2190K452K437
11703H8011P873m311L8524K1188n766J6677L4804M4514L5465O3097O2311J03435
11691E05822J33025J49776J90462K02042J37687j0264j78934k09530j80577j49960
11681E89549j32021p3380o467l8456l2462l1514n22j751J8480j5047K7581P7267
11669C81257Q6879J38923K06411L40558N74591R68044J468216J314389m53978
$$ y = [41481, 39178, 55277, 52472, 38521, 57871, 65539, 59818, 42988, 49581, 37755, 13117, 18920, 30746, 21803, 26400, 19841, -20049, -33153, -10967, -24120, -46991, -5152, 32461, 40697, 19214, -13667, -25921, -15653, -10198, 1985, 26475, 45912, 43889, 10249, 22040, 64352, 102733, 115294, 117181, 136733, 137605, 106107, 85237, 61519, 27804, 27366, 60932, 83122, 85574, 88011, 95884, 91573, 130097, 151285, 145519, 162196, 197000, 241514, 276979, 340076, 402387, 505822, 638847, 788623, 979085, 1181127, 1318814, 1308550, 1129616, 920086, 739509, 589549, 457528, 384148, 377681, 339225, 306763, 275249, 274727, 272976, 291456, 276409, 303990, 381257, 468136, 607059, 813470, 1154028, 1728619, 2696663, 4164879, 5479268, 5025290]
11660E025290j627170j256072p11364m11105k35906j45528j03589q4692n9552
11651C90312l0159k2796m476j8503k1529k1381o651k0310k0274L248M882L2234
11639B64597M5911L9997Q6270Q7541J06557J55396K85010N01902Q15090J291923
11629C680194J396697n6463j575461j351480p67633m28502k56387j51571q1461
11620D07933p1554o6516o0466k4175l2706j1284J1753J3964k8266l1574m418J8581
11608A21272K0771n757k0128l4241k753m675k230M789p448L023n867q692k4948
11595C3116m4301k6863P542J2335R724J6255M564m29j6909o456J610j607N122
11582f297j492q37J3497L605l520k0364j3256K3600L5265N279J0138L477j3405
$$ y = [5025290, 3398120, 2142048, 1430684, 1019579, 783673, 638145, 534556, 449864, 390312, 360153, 337357, 332881, 314378, 292849, 271468, 264817, 244507, 224233, 227481, 232363, 264597, 310508, 350505, 436775, 524316, 630873, 786269, 1071279, 1573181, 2388271, 3680194, 5076891, 5020428, 3444967, 2093487, 1325854, 897352, 640965, 489394, 407933, 336379, 269863, 209397, 185222, 152516, 141232, 152985, 166949, 138683, 107109, 102691, 121272, 142043, 136286, 116158, 81917, 79164, 74489, 72259, 77048, 69600, 72623, 66756, 58064, 33116, -11185, -38048, -30506, -18171, -8447, 7808, 12372, 11943, -4966, -11422, -9812, -11419, -6297, -7789, -8626, 4871, 8476, 4956, -15408, -28664, -5064, 30201, 35480, 45618, 49095, 35690]
11569C5690l926K417J4838j1856K7240L6116L6464J0502k9765k6476l5204k5819
11557C0221L1480L5279l466Q924k440l3648m0800j7845O775j388j1981n278K1812
11544A7645J2850J6331p39j2129o430j5546k1706m576J6155k5014p080J7440J1728
11531a071p883k178J0672K2723j9623l0381n674J2204K6497L664l587L4236R581
11518D9180k0385J2868K9488M7431K1620j2731K7444O4145R746L131J3745j6929
11506B28753n1279n5960j5743k0477k6073k8201k8969N7J2639j7229R638J1991
11494A9147J5065k686Q212J6383l1871l387J4536Q714j0165K4355k1885m1350
11482d932k0691J8449K0419K4643j3129j8178p332L806K4477j5114j033m559M6732
$$ y = [35690, 31764, 34181, 49019, 37163, 64403, 100519, 136983, 147485, 117720, 91244, 56040, 30221, 61701, 96980, 93514, 102438, 99998, 66350, 25550, 7705, 14480, 13092, 1111, -4167, 17645, 30495, 46826, 46087, 33958, 27528, 11982, -9724, -14300, 1855, -23159, -30239, -12799, -1071, -8954, -11132, -460, 22263, 2640, -27741, -33415, -21211, 5286, 8950, 5363, 39599, 49180, 28795, 41663, 71151, 118582, 140202, 127471, 154915, 219060, 228806, 231937, 245682, 228753, 177474, 121514, 105771, 85294, 59221, 31020, 2051, 2108, 14747, -2482, 7156, 19147, 34212, 31526, 39738, 56121, 24250, 20863, 35399, 44113, 33948, 58303, 36418, -4932, -25623, -7174, 13245, 37888, 24759, 6581, -751, 3055, 27532, 12418, 11385, 6826, 53558]
11469E3558K6867R214p728l7466k8642j1701K8756J620K1632j4152Q526Q012n462
11456E3034j6811p288J8903O351J5278L087j0824j5517q398P475M7198J6212k7482
11443H1218k8827j6287J3836K8015R24j4100l3770j2361J3146L5582K3973M508
11431I5857j5581l054k049J3587n902j9009M415k942m717J08j1160j7216j0091
11418B2246K2331L6578J5946K5416Q327l0849m2236k8926k6578J26K5567M0141
11406F8089L4838J0870O089L5556J5819M105o857J3452M734J309R399l293L086
11393A97196j1735p592R082o601Q608K6377N9300L1433l426M5291N9270L5049
11381D42252m9380p6422q1343m7306J3966j6833l9400j9067K7726L1299K6248
$$ y = [53558, 80425, 89639, 81911, 44445, 15803, 4102, 32858, 34478, 56110, 41958, 50484, 58496, 53034, 36223, 28935, 47838, 54189, 69467, 72554, 61730, 46213, 37815, 45290, 92488, 108700, 81218, 52391, 36104, 49940, 77955, 78879, 64779, 31009, 18648, 31794, 67376, 91349, 95857, 80276, 77222, 75173, 88760, 82858, 63849, 68264, 65322, 60605, 60713, 49553, 32337, 22246, 44577, 81155, 97101, 122517, 130844, 99995, 57759, 28833, 2255, 2381, 27948, 68089, 102927, 113797, 119886, 155442, 171261, 175366, 168509, 181961, 186695, 188004, 197403, 194110, 197196, 185461, 177869, 186951, 180350, 188958, 215335, 274635, 306068, 302642, 347933, 407203, 442252, 392872, 316450, 235107, 187801, 201767, 184934, 145534, 126467, 154193, 185492, 211740]
11370B11740k958k7423N562L972J9987L694j8156N286J8574M088J2564J8476r565
11357B45841m30J0453N0923K5546K709m0640n3742j5014j345K8742J0145j466
11345B61722K908J1411L33k821l84J8356J8366L0835M7066M7784N941j0890n770
11332D24857p116R62J6692N2509L5459K1672N5093O4272L8495M882K3317J6219
11320G47313M678O633j9283l1234k4372K2973K0603J0890J6569J4955N6565M6597
11308H72887n691m220M2819N9058O9550M5360N4349P1156Q9412J16171J31504
11297A542355J47319J45575J60036J67882K33938K79652L07171K80746J31793
11288C396467q9522j24155o1531K826P2791Q6616J35103K10341K53477K98487
$$ y = [211740, 208782, 181359, 186921, 190893, 210880, 214574, 196418, 201704, 220278, 224366, 236930, 255406, 245841, 245411, 255864, 306787, 332333, 335042, 294402, 240660, 225646, 224301, 253043, 263188, 261722, 264630, 276041, 276374, 273553, 273169, 291525, 309891, 340726, 387792, 435576, 441517, 430627, 424857, 417741, 418703, 435395, 487904, 523363, 545035, 600128, 664400, 702895, 707777, 731094, 747313, 751991, 758624, 739341, 708107, 683735, 706708, 727311, 738201, 754770, 769725, 826290, 872887, 867196, 862976, 905795, 964853, 1034403, 1079763, 1134112, 1205268, 1294680, 1410851, 1542355, 1689674, 1835249, 1995285, 2163167, 2397105, 2676757, 2983928, 3264674, 3396467, 3306945, 3182790, 3121259, 3124085, 3196876, 3283492, 3418595, 3628936, 3882413, 4180900]
11278D180900L46697L92584M80341N43334O04122P28838R08707J096887J277134
11269A0559544J483663J824760K251274K808071L629539M769344O380537Q644710
11261D2351442J1923895J6818238K4237481L5006896M9013168O1469333N6752160
11254B97572613J6501039l9397450o3839673n6279696m0651781k7909589j9234020
11247F6761443j3492462r701463p201073n505514m312491l472326k830958k316064
11239A7929092j948762j633023j441972j303883j152142j011063q82761q19003
11231G736483p23134o16340n17300m50170m28832l86377l26422k90179k78912
11222C718817k31117j74022j81098j82572j85434j56850j18972q0459r0880j03950
$$ y = [4180900, 4527597, 4920181, 5400522, 5943856, 6547978, 7276816, 8185523, 9282410, 10559544, 12043207, 13867967, 16119241, 18927312, 22556851, 27326195, 33706732, 42351442, 54275337, 71093575, 95331056, 130337952, 179351120, 240820453, 297572613, 314073652, 274676202, 210836529, 154556833, 113905052, 85995463, 66761443, 53268981, 43567518, 36366445, 30860931, 26548440, 23076114, 20245156, 17929092, 15980330, 14347307, 12905335, 11601452, 10449310, 9438247, 8555486, 7736483, 7013349, 6397009, 5879709, 5429539, 5000707, 4614330, 4287908, 3997729, 3718817, 3487700, 3313678, 3132580, 2950008, 2764574, 2607724, 2488752, 2408293, 2317413, 2213463]
11212B213463j18276q9232p3269n9392k5734j5266j4953j495k5632k3732o1040
11201A705442j11796q8463o6885m0322o1402m2347o8300n3781l4766k3387k9798
11190A084195l0845j3680j6880l8745m2262k8514m5557k0686k8288l838j4281
11179H00619m6939l3874j1017o338J3277j8518j8281j9316q685l448J0347J4382
11167F72209k501l4043j6104j151o207j9154m463R771l256k548J3313K1765J2691
11154F40322M3865N7594R5939R4290P7439O8252P8445K5463k2016q9398j17834
11143I52361j06857j04527q0501p2974m7860j8933r395k7524m933R652K0096J040
11131E09645j2774J1000k6344m7223j05019l8545k3514j5479J4046J3975J6893
$$ y = [2213463, 2095187, 2005955, 1932686, 1873294, 1847560, 1832294, 1817341, 1815846, 1790214, 1766482, 1705442, 1593646, 1505183, 1438298, 1397976, 1336574, 1294227, 1225927, 1172146, 1137380, 1113993, 1084195, 1053350, 1039670, 1022790, 984045, 941783, 913269, 867712, 847026, 818738, 814900, 800619, 753680, 719806, 708789, 702451, 715728, 697210, 678929, 659613, 650928, 647480, 657827, 672209, 669708, 635665, 619561, 618410, 612203, 593049, 588586, 598357, 595101, 592553, 605866, 627631, 640322, 684187, 741781, 837720, 932010, 1009449, 1077701, 1156146, 1181609, 1159593, 1070195, 952361, 845504, 740977, 660476, 587502, 539642, 520709, 511314, 483790, 478857, 488509, 508605, 509645, 496871, 507871, 481527, 434304, 329285, 290740, 267226, 251747, 265793, 279768, 296661]
11120B96661J6103M264k3861j1149O042j1638J6002k8604j7244J3065j4943j1424
11108B33274N590j9230j2364j9326j1626m269K5845N4649O1238J5371n519p359
11096C16274j1924l4374r765j2033m0520r036K0894L0026J6297J7236l2243n0249
11084B00583k221k1099m1107j6241L8234K7514q222k5326l240K866J9237j5205
11072A55773R907J4323L0152J7497l5664l7758k8814R71K4398k434J6595K3985
11060A88931J1284l4588n370K5424j958j5637J2889Q742j3664j5693q119R657
11048A61898J1717M7801K3940K2400l940R410o533n573j3135N788L5540L866q704
11035B84475J6709M3073L1279L3337k3162k2733j0350k9961O444N2045K8949L7648
$$ y = [296661, 312764, 317028, 293167, 282018, 288060, 276422, 292424, 263820, 246576, 259641, 244698, 233274, 238864, 219634, 207270, 187944, 176318, 172049, 197894, 252543, 313781, 329152, 323633, 316274, 304350, 269976, 260211, 248178, 207658, 198622, 219516, 249542, 265839, 283075, 250832, 200583, 198362, 177263, 136156, 119915, 158149, 185663, 177441, 152115, 148875, 151741, 170978, 155773, 165680, 180003, 210155, 227652, 191988, 154230, 125416, 126387, 150785, 148351, 164946, 188931, 200215, 165627, 160257, 185681, 183723, 168086, 180975, 189717, 176053, 160360, 152241, 161898, 173615, 221416, 245356, 267756, 263816, 273226, 266693, 261120, 247985, 253773, 289313, 293179, 284475, 301184, 344257, 375536, 408873, 385711, 362978, 352628, 322667, 329111, 381156, 410105, 447753]
11023D47753J8241M2082K7602o050m6175n7390n7949m3829j7220j271m623O774
11011C07945J9122L1041K3565k2041p409k6413l2427k0400o010j4913j1312P330
10999B48078N669J3834j1116r313j9728m5103l9489J614J0443j0837j220k2795
10987A20037K3538J0570k4367k4670k017j249j2904j674L305J6513K5696j9582
10975A13196j8738j5727j1089n478J0323K5700o030j6474j7676K223p554n24J9543
10962G1695K5697p964k6774j4239p410J5752j2165R7M649l04j5288k9153p895
10949c302Q752l4027j7949K5200J8034J1323M3486M972P037o644K854P132Q67
10936F7735J0893Q759m629j6392J1922J2201m906j5848o591j9072n634p355o308
$$ y = [447753, 465994, 508076, 535678, 529628, 483453, 426063, 368114, 324285, 307065, 305794, 301171, 307945, 327067, 358108, 381673, 359632, 352223, 325810, 293383, 272983, 266973, 252060, 240748, 248078, 253747, 267581, 256465, 247152, 227424, 182321, 142832, 144446, 154889, 144052, 142832, 120037, 143575, 154145, 129778, 105108, 103091, 101842, 88938, 87264, 90569, 107082, 132778, 113196, 94458, 78731, 67642, 62164, 72487, 98187, 92157, 75683, 58007, 60230, 52676, 52152, 71695, 97392, 89428, 62654, 48415, 41005, 56757, 44592, 44689, 49338, 49034, 33746, 4593, -3302, 5450, -28577, -46526, -21326, -3292, 8031, 51517, 56489, 63526, 56882, 59736, 66868, 67735, 78628, 87387, 82758, 66366, 78288, 90489, 85583, 69735, 63144, 44072, 38438, 31083, 24775]
10923B4775m569L4447J0287J0462P57K017K351q125m486j9550J590j9987J224
10910C1193p625q425O665J524J381J5753j6287o308K4691m730n220k794k200P799
10896C5417J1689K0005N505j4634K0506J5655j4616K9444J4161k345k2984k0943
10884G6860J3028j6526l7772j2198k302J1305N010K7515J2127m042k5443J433
10872D8995J8409K812j4609j9916K849J7726K7080j9604R190N106j1096l1058
10860C5884j0514m094K1320j1627p045K1861P574p71J1667L572k3278J8933J0165
10847G3647q901j6256j8174K7196Q749J8071j7756K736n725j7888m432O841M1420
10834H9528M6705j3982k844j3699O00K2884J1517J9414K3882J7853Q2015P9412
$$ y = [24775, 20206, 54653, 64940, 75402, 76159, 78176, 80527, 72402, 67916, 48366, 49956, 29969, 31193, 23568, 15143, 21808, 23332, 24713, 40466, 24179, 17871, 42562, 37832, 32612, 29818, 27618, 35417, 47106, 67111, 72616, 57982, 78488, 94143, 79527, 108971, 123132, 120787, 97803, 76860, 89888, 73362, 35590, 23392, 21090, 32395, 37405, 64920, 77047, 73005, 47562, 48995, 67404, 70216, 55607, 35691, 38540, 56266, 83346, 63742, 72932, 78038, 66942, 35884, 25370, 21276, 42596, 30969, 23924, 45785, 53359, 52588, 64255, 67827, 44549, 63482, 73647, 64746, 48490, 30316, 57512, 66261, 84332, 66576, 69312, 63587, 45699, 41267, 48108, 89528, 136233, 122251, 119407, 105708, 106308, 129192, 140709, 160123, 184005, 201858, 283873, 363285]
10822C63285P5351J23732J33628J60159J93523J79442J00898l6785j86089k48008
10812H59136k14348j61667j08174p3054o2791k8323l7543L27j7613l1411q832
10801A15707J5511j6441l9186m1323k704j5598j1836k1195L243J337K8867J6494
10789C2876j4199l124Q945K5876K6434J427r018k3518q761J1736q817j3902R547
10776C5502J900l1123k7176K5587Q184p57q121k940j9332P691L5051Q34n144R986
10762C0142J4856J4216K6431l176k9196j3171j3383o519L5976j8797j1540k2645
10750C194j1687K5326M09P236j7265p415N0147L4113O830n5226k6469o79j2447
10737c933M854j6184o556L3428J8547o75K1482K0663n088k7226o346K757p738
$$ y = [363285, 438636, 562368, 695996, 856155, 1049678, 1229120, 1330018, 1293233, 1107144, 859136, 644788, 483121, 374947, 301893, 239102, 210779, 173236, 173563, 155950, 124539, 115707, 131218, 114777, 75591, 34268, 31564, 15966, 4130, -17065, -13822, -12485, 16382, 32876, 18677, 15553, 24498, 50374, 76808, 78235, 69217, 45699, 36938, 48674, 39857, 25955, 35502, 37402, 6279, -20897, 4690, 12874, 12117, 3996, 1056, -18276, -10585, 24466, 25300, 20156, 30142, 44998, 59214, 85645, 82469, 53273, 40102, 26719, 20200, 56176, 37379, 25839, 3194, -8493, 16833, 17242, 24478, 7213, -202, 49945, 84058, 90888, 35662, 9193, 8514, -3933, 921, -15263, -21819, 11609, 30156, 29481, 50963, 71626, 66538, 39312, 32966, 35723, 27985]
10724B7985l9488k755L9318k918K1994J8301O507P039m004k8856j7507K881K875
10711C1372K8153J4946L4796J2450j7050j5575k9640k803L883o248K9468j4509
10699F9243k0500j0492J0387J868J4726K3126j3490q394p286j2011l787N234R272
10686E7896q662K6487K2883j3186j8596m8410p207L1898J5718l3970L192Q240
10674C6283k912k2776J1580J3403K0841J6335j8257o289J6089K9481J5905p605
10662A02078O660J3719R621o822k7723j20J7595P625O143R413K0579K8990L3166
10649B20924Q549J2330K2957N064K2414J4075K4118K0340k883K1065L0945O0285
10637D60183P4868R1759O5236J16728J69228J43044J50113J36714R5187J03210
$$ y = [27985, -11503, -14258, 25060, 22142, 44136, 62437, 68944, 75983, 71979, 43123, 25616, 28497, 31372, 59525, 74471, 109267, 121717, 104667, 89092, 59452, 56649, 60532, 54284, 83752, 69243, 48743, 38251, 48638, 50506, 65232, 88358, 74868, 66474, 59188, 47177, 43390, 48624, 57896, 49234, 75721, 98604, 85418, 66822, 18412, 11205, 43103, 58821, 24851, 28043, 36283, 33371, 10595, 22175, 35578, 56419, 72754, 54497, 48208, 64297, 93778, 109683, 102078, 108738, 122457, 132078, 125256, 97533, 97413, 115008, 122633, 128776, 138189, 158768, 187758, 220924, 229473, 241803, 264760, 269824, 292238, 306313, 330431, 350771, 347888, 368953, 399898, 460183, 535051, 626810, 692046, 808774, 978002, 1121046, 1271159, 1407873, 1503060, 1606270]
10627A606270J37833J82136K78783L74347N20379P18508R60548J348654J761911
10618G889369K271205K920999L420257L261211K046406L13277r63509j264369
10610A9894846p86330J67970J275275K590780M154894N849379P098978O482847
10602D6728639L051538j691907m590509m665385l230125j239224Q41916L057837
10594C8262780N453603P748667R042025P423919J727578n247051q877376q490315
10586D7043830o292980l842647j581664M92266K471837M180291M846106L301252
10578E0618291q41973n298452p246020o601286m884367l128120j682562m64644
10570B0470867M60657J085604J127164L31865j311740k912481l579808l276247
$$ y = [1606270, 1744103, 1926239, 2205022, 2579369, 3099748, 3818256, 4778804, 6127458, 7889369, 10160574, 13081573, 16501830, 19763041, 21809447, 22122724, 21159215, 19894846, 19108516, 19276486, 20551761, 23142541, 27297435, 33146814, 40245792, 46728639, 49780177, 48088270, 43497761, 38832376, 35602251, 34363027, 35204943, 38262780, 43716383, 51465050, 60507075, 67930994, 69658572, 64411521, 55534145, 47043830, 40750850, 36908203, 35326539, 35818805, 38290642, 42470933, 47317039, 50618291, 49776318, 44477866, 37231846, 30630560, 25746193, 22618073, 20935511, 20470867, 20931524, 22017128, 23144292, 23476157, 22164417, 19251936, 15672128, 12395881]
10562A2395881k640728j979332j451244j087478q16860o06671m67185l54764k99465
10553B692154k63875k36150k30951j97819j68499j16729j11878r9090q4197j11541
10543A071425r7135m9797m9742n5426m0969n0094n6599l4710j0006K930j6699
10532F13178n8193k7097j1021j1915q44q163j6940j5823l1150k7410q388K4413
10520D20647r379m790j6575k7467n768N232j7229j0493j5205O764j9097j0690
10508B95950o301k1492J0260L109j8111q600J1770Q625q197j0807k5694k9854
10496B00658k281m037K6465L6591K5153r321q861K1511j4782m6561n3750P323
10484A78108l819P514P366P387l89p778L9205L1972p993j0996j4736j2682J3039
$$ y = [12395881, 9755153, 7775821, 6324577, 5237099, 4420239, 3813568, 3346383, 2991619, 2692154, 2428279, 2192129, 1961178, 1763359, 1594860, 1478131, 1366253, 1267163, 1182966, 1071425, 974290, 924493, 874751, 819325, 778356, 728262, 671663, 636953, 626947, 629877, 613178, 554985, 527888, 516867, 504952, 504108, 495945, 479005, 463182, 432032, 404622, 396234, 420647, 411268, 406478, 389903, 362436, 356668, 361900, 344671, 334178, 318973, 325737, 306640, 295950, 289649, 268157, 278417, 281526, 263415, 254815, 266585, 275210, 267013, 256206, 230512, 200658, 198377, 194340, 220805, 257396, 282549, 273228, 264367, 285878, 271096, 224535, 170785, 178108, 174289, 181803, 189169, 196556, 196167, 188389, 227594, 259566, 251573, 240577, 225841, 213159, 226198]
10471B26198L0972K3826K005k5676l9780l5366J8560q66j8678j5178J0290K518
10459A78825k5520r24J2771K2894K124l716k1840j7840J9025n66k8725J7460J5362
10446A69330j5429k4196m596j6461q694N332J4766L1636n055n1138j7431J479
10434G9543K6204L632J7694p826o278n687k711L3820L6801J5534j8604j7508Q172
10421A62786j0164J0540l261m0302j2210L5485J0497J1432p083j3409k5183q488
10409A10640K9416K6947j0637j4044k9813N907j0392k7785J9017J0266J1173Q256
10397A28951J2425J5214J2612j2286m3140j0626J8536K5457k3426J0249K3627
10386A57593l2201J0343K0885j3336o877K1644K0937J8771k6634j1595Q437L1715
$$ y = [226198, 257170, 280996, 283001, 257325, 217545, 182179, 200739, 199873, 181195, 166017, 176307, 178825, 153305, 152381, 165152, 188046, 190170, 186454, 164614, 146774, 165799, 165233, 136508, 153968, 169330, 153901, 129705, 125109, 108648, 99954, 105286, 120052, 151688, 146633, 95495, 78064, 79543, 105747, 109379, 127073, 119247, 112969, 107282, 104571, 138391, 175192, 190726, 172122, 154614, 162786, 152622, 163162, 159901, 119599, 107389, 142874, 153371, 164803, 157720, 144311, 119128, 110640, 140056, 167003, 156366, 142322, 112509, 118416, 108024, 80239, 99256, 109522, 120695, 128951, 141376, 156590, 169202, 156916, 113776, 103150, 121686, 147143, 123717, 133966, 157593, 125392, 135735, 156620, 143284, 136407, 158051, 178988, 197759, 171125, 159530, 167967, 199682]
10374A99682R861J7598M6186M9339N0891O5554Q4942J15206J62102J56527J24517
10363A082405J06175N6117m0655p5070r6838j17533j24436j13635j10311j05946
10353D60273p6130m0081m7640j7757j9939k9083l7793k9354p155L321P920R449
10341A76031J1570j3972l557j540J65j5159j8875j7496k6027q493k902K089j007
10328H0827k3719l504J0190J8942r446k9154m81O197k2732Q655J2710J0515Q677
10315F7677n289j0343J8795J6165K2758J5098j6779k2697k4942r550K023q90J308
10302E3334o658r330m699m03J4453N026J5629K4177k4088m341K6080k4713m573
10289E9894K5964j7751n702j519l561j0258j5478K3054J1265j5926K2710L7078
$$ y = [199682, 209543, 227141, 273327, 322666, 373557, 439111, 524053, 639259, 801361, 957888, 1082405, 1188580, 1244697, 1204042, 1128972, 1032134, 914601, 790165, 676530, 566219, 460273, 384143, 344062, 296422, 278665, 258726, 229643, 191850, 162496, 155341, 158662, 166582, 176031, 187601, 173629, 170072, 168532, 168697, 153538, 134663, 117167, 91140, 82647, 79745, 81834, 80827, 57108, 53604, 63794, 82736, 73290, 44136, 43655, 49852, 27120, 35775, 48485, 59000, 67677, 62388, 52045, 70840, 87005, 109763, 124861, 108082, 85385, 60443, 50893, 52916, 52026, 53334, 46676, 37346, 32647, 32244, 46697, 51723, 67352, 91529, 67441, 63100, 89180, 64467, 59894, 85858, 68107, 62405, 60886, 57325, 47067, 31589, 54643, 65908, 49982, 72692, 109770]
10277A09770Q696m055j6461N303J5032K8182J6656k4423k3460Q68J9613m041k5263
10264A06417k37K8373L032k1634r911o402K605J0036L024l110r823J5979Q701
10251A27050j6697l3903m703R7K5148L39j630n063J0913j7548j2313J6923q036
10238H0577J5651Q540J1520k6395p039R375L972N947O435K642k2125J52k033l47
10224H6872J4604K2626K6162K4132L1688N910J2008j1318m4505R038r37k4712
10212A51568l2367j0890O493K210l402q136j0606n109k3960m719j4413n054K1643
10199F3258J2291Q671O358r117o477J7399O58j3277k7842k2905l293O623K6610
10186E8957M050j9251j4062K0193K5466K0904J4036J8087M2588L3999p134k4161
$$ y = [109770, 118466, 114411, 97950, 103253, 118285, 146467, 163123, 138700, 115240, 116108, 135721, 131680, 106417, 106180, 134553, 137585, 115951, 106040, 99638, 102243, 112279, 115303, 112193, 102370, 118349, 127050, 110353, 76450, 71747, 71844, 96992, 97331, 95701, 90638, 101551, 84003, 71690, 88613, 80577, 96228, 104768, 116288, 89893, 82854, 92229, 96201, 102148, 108583, 111225, 89100, 89252, 87219, 86872, 101476, 124102, 150264, 174396, 206084, 211994, 224002, 212684, 168179, 177217, 176280, 151568, 119201, 108311, 114804, 117014, 113612, 105476, 94870, 89761, 65801, 61082, 46669, 41615, 63258, 75549, 84220, 90578, 81461, 74984, 92383, 93041, 79764, 51922, 29017, 25724, 32347, 58957, 63007, 43756, 29694, 49887, 75353, 96257, 110293, 128380, 170968, 204967, 197833, 173672]
10174A73672j0603j1476l313P052J4221J9720L5866M1699L9462K1688k9195k1150
10162B77643k1374j2148Q21L0903N1756K7097O0151P0256J4164k3590m7500m1370
10150C86809l9391l3828p426k6185j3862m955J4101M3001j2703m9054j2354j8427
10138B25726j6038j8459j8454k0216Q187L1567R074K7967j302k4813r796N873
10126A99316L553l399k5077p037l2283k6151J7453N4010L1910M725k2000k2592
10114A72428j2648O22L0389J1351o412j9952k9842O06K0266R877k934j3823K2133
10101A82061L6777J6040J559p384K2432J5244K6578K3759M787r631j0113k0310
10089B81799k913o341j8740l2726Q186K173j6404n009J3218j0891J9167K9344
$$ y = [173672, 163069, 151593, 148280, 155332, 169553, 189273, 225139, 266838, 306300, 327988, 298793, 277643, 256269, 244121, 244942, 275845, 327601, 354698, 414849, 485105, 499269, 475679, 428179, 386809, 347418, 313590, 306164, 279979, 266117, 261162, 275263, 318264, 305561, 256507, 244153, 225726, 209688, 191229, 172775, 152559, 160746, 192313, 201387, 229354, 228052, 203239, 193443, 199316, 202869, 199470, 174393, 167356, 135073, 108922, 126375, 180385, 212295, 217020, 195020, 172428, 159780, 160402, 190791, 202142, 195730, 175778, 145936, 146542, 166808, 176685, 173751, 159928, 182061, 218838, 234878, 236437, 229053, 251485, 266729, 293307, 317066, 321853, 312222, 302109, 281799, 278886, 272545, 253805, 221079, 229265, 231438, 215034, 210025, 223243, 212352, 231519, 260863]
10077B60863k2816N538J4542j4108O929M3061J813p615L864M4616J3633j1170
10065C39150J5966Q267K7421N485l3189k2129M91k730q128J2746m655k7303J1516
10052C22908K1915M9042J6048o681J438l5222j5503M560J3772N748J513O023L5332
10039D20893N4746J1547k1878Q324l622j85L5796M3754N388n37K6351q724K8071
10026E99924N2229J3856k1122J0884M6686L4563J2433R10K9905J0836K5164L1127
10014H47395M9624M3392K5907O2917O2207N6470Q6212Q9930R0368M5758P6517
10003A536697J07570J21086J00346J32749J22406J73573J94805J78182K01796
9994B869210K34023K84193L09193L70999M69227N79835O81110P53630Q60177R34080
$$ y = [260863, 238047, 243585, 258127, 244019, 250948, 294009, 295822, 288207, 292071, 336687, 350320, 339150, 355116, 363383, 390804, 396289, 363100, 340971, 341462, 338732, 330604, 343350, 338695, 311392, 322908, 344823, 393865, 409913, 403232, 404670, 369448, 353945, 358505, 372277, 378025, 379538, 385561, 420893, 475639, 487186, 465308, 473632, 470010, 469825, 505621, 549375, 554763, 554226, 580577, 571853, 599924, 652153, 666009, 644887, 655771, 702457, 737020, 749453, 750363, 780268, 791104, 816268, 847395, 897019, 940411, 966318, 1029235, 1091442, 1147912, 1234124, 1324054, 1414422, 1460180, 1536697, 1644267, 1765353, 1865699, 1998448, 2120854, 2294427, 2489232, 2667414, 2869210, 3103233, 3387426, 3696619, 4067618, 4536845, 5116680, 5797790, 6551420, 7411597, 8345677]
9984H345677R64194J069483J126821J218571J306695J468845J737272K266330
9976A9503888L030825M067963N564953P744553J0932190J5364689K0916711K6553678
9968A13679450K9509773K7913158K2317530J3540164M789574l982228j2531905
9961A95235516k0970814k7022238k8709032k6302951k0769867j5134626j0808551
9954D5517437p735162n691988m279091l319393k623510k179474j878103j644612
9946A6166104j490773j392294j301189j196464j081526r59370q54677p69951o62494
9937F457366n53689m82817m09037l58108k81994k21860j99090k31450k26221j90840
9927C302260k13716j36664j31601j41539j27657q0351p5133p8081p5160p6103
$$ y = [8345677, 9309871, 10379354, 11506175, 12724746, 14031441, 15500286, 17237558, 19503888, 22534713, 26602676, 32167629, 39912182, 50844372, 66209061, 87125772, 113679450, 143189223, 171102381, 193419911, 206960075, 211749649, 207767421, 195235516, 174264702, 147242464, 118533432, 92230481, 71460614, 56325988, 45517437, 37782275, 32090287, 27811196, 24491803, 21868293, 19688819, 17810716, 16166104, 14675331, 13283037, 11981848, 10785384, 9703858, 8744488, 7889811, 7119860, 6457366, 5903677, 5420860, 5011823, 4653715, 4371721, 4149861, 3950771, 3719321, 3493100, 3302260, 3088544, 2951880, 2820279, 2678740, 2551083, 2470732, 2395599, 2317518, 2242358, 2166255]
9917B166255j06217q9569q6615j12877j10718o9893l1670k3055l6975p4552r4679
9906A329435o7207m1656m7608l8096m2454l6466l2209k0905l4153j6092M808m230
9894I53167m9484m9480k9613L49l319k3725k8582l5438l8142n428j5724l1919
9882F42662k1847J301n998K8894j3769l7245k3062l0140j3816O960J4101N532
9870E53573l8315r087M68j8799R966K1313O138j9345j5694l387L7225J010l2676
9857D92390k9190j1328M382m617j1240P515l676k851l000k2284k3614j2019j082
9844C79386J3445N744K6171Q946k7452l0284M656J1544r772k5670l7752m337L2799
9831C47424j243j6001k5576r392J7882m518j3001j0788L5680K0422j3337j5096
$$ y = [2166255, 2060038, 1970469, 1883854, 1770977, 1660259, 1590366, 1558696, 1535641, 1498666, 1424114, 1329435, 1262228, 1220572, 1172964, 1134868, 1092414, 1055948, 1023739, 1002834, 968681, 952589, 957397, 953167, 903683, 854203, 824590, 824939, 821620, 797895, 769313, 733875, 695733, 690305, 674581, 642662, 620815, 622116, 616118, 645012, 631243, 593998, 570936, 540796, 526980, 533940, 548041, 553573, 515258, 506171, 506639, 487840, 497806, 519119, 525257, 505912, 490218, 486831, 524056, 525066, 492390, 463200, 451872, 456254, 451637, 440397, 447912, 444236, 441385, 438385, 416101, 392487, 380468, 379386, 392831, 398575, 424746, 433692, 406240, 375956, 380612, 392156, 382384, 356714, 318962, 314625, 347424, 346181, 330180, 304604, 295212, 313094, 308576, 295575, 284787, 320467, 340889, 327552, 312456]
9819C12456r763j3198k3045J6532K7462M1355J2144J5821L2161m432M07r634m292
9806C93974r200l9189l7868O990l5531l0518n140o95j577J8881k2250k8479j397
9793B08001K2154M569k6609j1567J5924R880N648r617k5330j839R940L7728J7706
9780B56588Q383j9099k2347j849q198P484k0709l2800O182Q486K7274J5862q099
9767B17158j125O859K452l707K7358j9030p338O611r693k0612o460j2891O860
9754A86442j1461j9020p460J2381J7649q932j709k71M392o455j2549P847l0414
9741A30440k0717k39J9063L0140K4450Q71k0716K791q179M033J5340J2926p812
9728A82391k0364j7762J6926K5933r720j884J2277Q788m469j3810j5960k5287
$$ y = [312456, 302693, 289495, 266450, 282982, 310444, 351799, 363943, 379764, 411925, 407493, 407900, 398266, 393974, 384774, 345585, 307717, 314707, 279176, 248658, 243518, 242823, 241246, 260127, 237877, 209398, 208001, 230155, 234724, 208115, 196548, 212472, 222352, 228000, 218383, 193053, 191214, 201154, 238882, 256588, 264971, 245872, 223525, 221676, 213478, 220962, 200253, 167453, 173635, 182121, 209395, 225257, 217158, 216033, 222892, 225344, 221637, 248995, 229965, 222627, 229238, 219545, 198933, 192473, 179582, 186442, 174981, 155961, 148501, 160882, 178531, 169599, 167890, 167619, 172011, 165556, 153007, 160854, 130440, 109723, 109484, 128547, 158687, 183137, 184008, 163292, 166083, 157904, 161937, 177277, 190203, 182391, 162027, 144265, 161191, 187124, 177404, 175520, 187797, 196585, 192116, 178306, 162346, 137059]
9716A37059k4342M21J3531j3837k8810J9279J1908j37Q794q571j1398o007o957
9703I0933J6892J0775M977M164K0732l600l5886l2584J6811Q479j3242K0726K3207
9690A32384j3838n676M76j0111o641j4187n902k32k563M875K3568J2016J7282
9677A31451n122m0086j4417n654q568N291K3306J8753j0837k9540k7081r832L889
9664C1553L384P024q987O088K546K605o433j0788K7347J3064J470K7004J50j390
9650I4637j242N706l871j2640k1005J2753K8698J4485J3954m362r065q28q780
9637A08440m4181k3660O986M3626M2392M689j5204j4829l6659j4827J8892J0700
9625H6365o150j0514P985j7430J31R726K5309j8058O90J5320K990K1608Q460P564
$$ y = [137059, 112717, 113138, 126669, 112832, 84022, 103301, 115209, 115072, 123866, 115295, 103897, 97890, 90933, 107825, 118600, 123577, 127741, 148473, 144873, 108987, 76403, 93214, 101693, 88451, 109177, 132384, 118546, 112870, 113346, 103235, 96594, 82407, 76505, 76273, 73710, 78585, 102153, 114169, 131451, 126329, 86243, 71826, 66172, 57604, 62895, 86201, 104954, 94117, 64577, 37496, 27664, 31553, 34937, 41961, 32974, 39062, 41608, 44213, 37780, 26992, 54339, 67403, 68873, 95877, 96027, 94637, 93395, 99101, 95230, 82590, 61585, 74338, 103036, 117521, 131475, 127113, 118048, 117220, 108440, 64259, 40599, 47585, 91211, 133603, 138292, 123088, 108259, 71600, 56773, 75665, 86365, 80215, 69701, 77686, 60256, 60387, 70113, 95422, 77364, 78054, 93374, 96364, 117972, 126432, 133996]
9611A33996K0325l7653r660L3497k0962j1464j5957k2776N121Q866J4346j479
9599I6200N797K201q994l4182K0995P072K6058j4189j7401k7574J9216J0011K7247
9586A12457K8826L5613O930k2508k0238k3146j3342R001K5833O95l703N6867L7456
9573B30741L5627J0729k903J3902O3536P7108R1460R4329J18633J42495J38474
9562A014131J01580K7056j1445o3943j01494j36270j30534j22334r4934p1977
9552D09836q2310n4009l7719j2157k8727m1628l8000O096J516o085j6578j2769
9540H7466j1088q571k8451Q20j5761K7157J4774J775J0608j2497k2199k700J5550
9527E6883j059J7866k7739l1442J4706n413J4679R038K8493M516n955r041k690
$$ y = [133996, 154321, 116668, 107008, 140505, 119543, 108079, 92122, 69346, 74467, 83333, 97679, 96200, 101997, 104198, 95204, 61022, 82017, 89089, 115147, 100958, 83557, 55983, 75199, 85210, 112457, 141283, 176896, 183826, 161318, 141080, 117934, 104592, 113593, 139426, 140121, 136418, 193285, 230741, 266368, 277097, 274194, 288096, 351632, 428740, 520200, 614529, 733162, 875657, 1014131, 1115711, 1142767, 1131322, 1067379, 965885, 829615, 699081, 576747, 481813, 409836, 327526, 273517, 235798, 223641, 194914, 153286, 115286, 121382, 122898, 116813, 100235, 87466, 76378, 67807, 39356, 40176, 24415, 51572, 66346, 68121, 78729, 66232, 44033, 41333, 56883, 55824, 73690, 45951, 14509, 29215, 23802, 38481, 47519, 76012, 80528, 74573, 65532, 62842]
9514F2842j3726j2708P457J6152p206k3009p147P260J8040j7929j7496j0807J5763
9501A7486K9378J0814l580K161K4781J0405l2662l2308k540J0789L3809P742k8297
9488D7978N960J9100p789o00L109q300r794M024K8405j669j2594j7397l630j0632
9474C6171J9237J9995O785J1753l448p239l3861k3856J3279J1087J3041K3080
9462H6024l596j4111j3617P45M842j7252K2313J4211R485k4842J888Q293L089
9449G7472n675j8453k8242J8131L3597J1021J1170j1107k5717k2004k263N456
9437D3386j418l191l1671k6807K1913j47J2497L0139n321p459K6548J2340j6324
9424E4485j6628L8322Q464l1097j9839j238j749J1102K2290k4468j5538K8846
$$ y = [62842, 49116, 36408, 43865, 60017, 52811, 29802, 22655, 29915, 47955, 30026, 12530, 1723, 17486, 46864, 57678, 54098, 56259, 81040, 91445, 58783, 26475, 23935, 34724, 68533, 76275, 47978, 53938, 73038, 65249, 64649, 67758, 59458, 49664, 53688, 82093, 80424, 67830, 50433, 46803, 36171, 55408, 75403, 82188, 93941, 90493, 83254, 49393, 25537, 38816, 49903, 62944, 86024, 82428, 68317, 54700, 55445, 60287, 43035, 65348, 79559, 89044, 64202, 66090, 74383, 77472, 71797, 53344, 25102, 43233, 76830, 87851, 99021, 87914, 62197, 40193, 37930, 43386, 41968, 38777, 7106, -19701, 2212, 2065, 14562, 44701, 39380, 31921, 58469, 70809, 54485, 37857, 76179, 84643, 53546, 33707, 32469, 30720, 41822, 64112, 39644, 24106, 52952]
9412E2952J453k6957q720J1159J3403O971r406j4710l93l991Q885j765R250J4068
9398E2199K947p116m4323j6266J3122M71J2138J0683J2942J6381L752k0821k3260
9385A2849j5276J4894L7253L6891K3956o52k1727j0587J3481m5224m0554L449
9373H753J0156O579K3035Q724j6164K4219Q296j1561n047j4602m5495J2918K029
9360A1840Q733J6411o502K919k8691M95Q894j3133Q918L0789P306J5811o043J9776
9346G7523J6622j2710l0039q675L1418N72j8310j8923n283j2298n965K2073K9686
9333F5691l975j0539J9799l463j3278j0028j0372J3957J6269l907k058n023N663
9320E8736l6671J2075K179K9810j2980j5987k7402j9224M197M5396K863j6272
$$ y = [52952, 54405, 27448, 18728, 29887, 43290, 50261, 40855, 26145, 25752, 21761, 30646, 28881, 38131, 52199, 55146, 48030, 3707, -12559, 563, 1034, 13172, 23855, 36797, 53178, 56930, 36109, 12849, -2427, 12467, 49720, 86611, 110567, 109915, 88188, 77601, 91082, 45858, 5304, 8753, 18909, 25488, 48523, 57247, 41083, 65302, 73598, 62037, 56990, 42388, -3107, 9811, 11840, 20573, 36984, 30482, 33401, 4710, 5205, 14099, 966, 9884, 40673, 47979, 63790, 57747, 77523, 94145, 81435, 51396, 42721, 74139, 74711, 56401, 37478, 32195, 19897, 13932, 36005, 65691, 61716, 51177, 70976, 67513, 54235, 44207, 33835, 47792, 64061, 60154, 58096, 53073, 58736, 22065, 34140, 36319, 66129, 53149, 37162, 9760, -9464, -5267, 40129, 42992, 26720]
9308B6720N47k517L920K4126J2685J268J1356j6995j5789K6360J2211j5475O698
9295G5115q640L468J7732k7838j4960K3735o787l4698k1190J3590K5580j2357
9283C2750k8730j4250J2701K2549q256o354N668K1842r273m429J531j78J7985
9270D3556j1932l3367k610K3525J6187m483k446j8544r531J0871j442N329M2087
9257E7200N732r325k4328M340J0907m734J1569l134P16j3112o643J5902K8395
9244G3485J4677k42k0974k2766j756j3114q376Q971K1321o886m1827k2845P035
9231a3297J7652J5152J6652J511k1119j6684L838J509n731Q456K3398M722k1577
9218A4482j2454R498l264k283o7l030Q566r765k7845r236K9767J9975j4700o515
$$ y = [26720, 27267, 24750, 28670, 52796, 65481, 66749, 78105, 61110, 45321, 71681, 83892, 68417, 75115, 66475, 69943, 87675, 59837, 44877, 68612, 61825, 27127, 5937, 19527, 45107, 32750, 4020, -10230, 2471, 25020, 16764, 10410, 16078, 37920, 28647, 24218, 25749, 25571, 43556, 31624, -1743, -4353, 19172, 35359, 30876, 28430, 9886, 355, 11226, 9784, 15113, 57200, 62932, 53607, 29279, 33619, 44526, 39792, 51361, 48227, 48943, 35831, 29188, 45090, 73485, 88162, 87920, 66946, 44180, 42424, 29310, 20934, 29905, 51226, 44340, 2513, -20332, -13297, 4355, 19507, 36159, 37670, 16551, -133, 3705, 5214, -517, 7939, 31337, 36059, 14482, 2028, 11526, 8262, 5979, 5912, 2882, 11448, 1683, -26162, -35398, -5631, 14344, -356, -6871]
9204f871l649O001J6367J7088K748N72n225P824r99j3805j4187L684l553m405
9190A590K7273K2931J3065j1614j0185Q483j2956k0289K51J1527Q737N264k1951
9177B2126P59J013K210J184l035j8777q027L5763m779j2115J1226r42p350k9082
9163i826k375K8602L4234Q11l5677k8275m30L1253L9850j8805p352L37L748l1305
9149D790j5841J9556J9216j2306L718J673J0183K090k2631j0768j6935J7913K6634
9136B7292K914j4229R493k7541j9005J4256o136q853O801R085K1596J2835j1330
9123A7178j0564L3122N413r763m658l058P690L461M443L219j5078L632r231j1898
9109A3908j629J3068p411l723L116J3161j5628R443P771N03K1081l397j126j7162
$$ y = [-6871, -10520, -4519, 11848, 28936, 31684, 32256, 27031, 34855, 33856, 20051, 5864, 9548, 5995, 1590, 28863, 51794, 64859, 53245, 43060, 51543, 38587, 18298, 18549, 30076, 38813, 44077, 22126, 22885, 23898, 26108, 27292, 24257, 5480, -2547, 33216, 28437, 16322, 27548, 26606, 19256, -9826, -12201, 16401, 50635, 51446, 15769, -12506, -12936, 18317, 58167, 39362, 32010, 32347, 36095, 4790, -11051, 8505, 27721, 15415, 19133, 20806, 30989, 33079, 10448, -320, -17255, 658, 27292, 30206, 15977, 25470, -2071, -21076, -6820, -12956, -21809, -15008, -5923, 15673, 28508, 17178, 6614, 39736, 45149, 35386, 30728, 27670, 35360, 38821, 43264, 46483, 31405, 35037, 25806, 13908, 12279, 25347, 17936, 14213, 17329, 30490, 14862, 24305, 32076, 32579, 53660, 50263, 49137, 31975]
9095C1975q377k2507J2270K1392J7190j5458p972J2429j5223J3902J8722j4142
9083D4201k0490k0444O889M223j4600R523n913L111j2641N948J6294J4312N134
9070C5547p327L2605k7949k9248J9040K2942K4827J744k3343l453o438l4301k212
9057B434L8195J5183j0315k7702j3205k97J6483L798R918Q153K66K083r107J1639
9043D7526J3745n042j857K0491n166k9829m26m84J327n056L164n323j1662j3367
9029H041j9897K8673M368k5951K0880j4518j319L6933J287j1040j0348L302O043
9016B6454n470J3166J3223j6351j6104o300M506J3855L8408l71l1921l1508q636
9003g049L159J6126j0849O989J6279J9445J7223j4304j3459j319l7066j4051J4792
$$ y = [31975, 23598, 1091, 13361, 34753, 51943, 36485, 28513, 40942, 25719, 39621, 58343, 44201, 23711, 3267, 10156, 14379, -221, 9302, 3389, 6500, -6141, -193, 16101, 30413, 35547, 28220, 60825, 32876, 3628, 22668, 45610, 70437, 72181, 48838, 45385, 38947, 4646, 2434, 40629, 55812, 45497, 17795, 4590, 4293, 20776, 24574, 34492, 42645, 42911, 44994, 35887, 47526, 61271, 56229, 54372, 74863, 69697, 39868, 39442, 38958, 40285, 35229, 38393, 33070, 21408, 8041, -11856, 16817, 21185, -4766, 16114, 1596, 277, 37210, 38497, 27457, 17109, 20411, 26454, 20984, 34150, 47373, 31022, 14918, 8618, 13124, 26979, 65387, 65016, 33095, 1587, -7049, -3890, 12236, 1387, 8376, 24655, 44100, 61323, 47019, 33560, 32241, -4825, -18876, -4084]
8990d084K6426k8180k0P744m751J8526j3997K766o250l285j362j4014K5457J7310
8976B2286P787j8858M495K1815O76J726k255K7884n64k0981k6565l5470K4806
8963F782P579j5677n507p884o095J9837k0141p453L5432K4426L1523j3600l2907
8950A6315k2461K1022j5702j9412j5100J6294J1105J8843k3872k6002J1622R33
8938b6415L2826M739m7711l886L1972o894n375O920L305l2634Q066K3591j4850
8925b6346j6145L7559L2950J2776J7951J3410k2124k9308k9389q696Q580P111
8913a671k049o175l3799N469R060K543J1767O993L809K0001J4396k9417O286J5013
8899B2226Q849J9631p56j9793l5702K5809K3621j0448J7197n733k0630j6163j0404
$$ y = [-4084, 22342, -5838, -5858, 1886, -2865, 15661, 1664, 4430, -1820, -5105, -6467, -20481, 4976, 22286, 30073, 11215, 15710, 37525, 38201, 39927, 37672, 65556, 64992, 44011, 17446, -18024, 6782, 14361, -1316, -6823, -14707, -20802, -965, -21106, -28559, 6873, 31299, 62822, 49222, 16315, -6146, 14876, -826, -20238, -35338, -19044, -7939, 10904, -12968, -38970, -27348, -26415, 6411, 11150, -36561, -40447, -8475, -15369, -20744, -13824, -10519, -43153, -35087, -11496, -26346, -42491, -4932, 28018, 40794, 58745, 72155, 50031, 20723, -8666, -17362, -8782, -1671, -3720, -9895, -43694, -38225, -29165, -26622, -14855, -7862, -4053, 15948, 30344, 927, 7213, 22226, 31075, 50706, 49950, 30157, -5545, 20264, 43885, 33437, 50634, 44901, 24271, 8108, -2296]
8886b296J5550L589Q770P202J060P001J6158j0036P343J5850Q992k82j7624o435
8872E4842k3379j2084j4721m05k110O160O994j2639p890N271J776l5670j5258
8859d9113M187j5978K2893Q142J8254j156j1075j768J2179K5952k8504k6305K6761
8846a5531J8301j4493l6414N647K0008j5714L5938j2745q816K2245J4306L64R66
8833A4062o42K2817J4472Q057L677n974l3182j1007q52J0142J0146l6700j3520
8820a8504L646J4511J3853o046k616P820l69p22J69J5356O23k1499L447Q689K4060
8805D2418p055q793k1050l597J9895j2019j3119k1815j7015m455L2892M909j2178
8792b0982J0890L055J5288l744k8431j0885J0528q439L2508k7900m740L7567j2552
$$ y = [-2296, 13254, 16843, 25613, 32815, 33875, 40876, 57034, 46998, 54341, 70191, 79183, 78901, 61277, 54842, 31463, 19379, 4658, 4253, 2143, 8303, 15297, 2658, -5232, 39, 1815, -33855, -49113, -44926, -60904, -38011, -29869, -11615, -12771, -23846, -25614, -13435, 12517, -15987, -42292, -15531, 2770, -11723, -48137, -42490, -22482, -38196, -2258, -15003, -23819, -1574, 12732, 13096, 14062, 13420, 36237, 50709, 58766, 62443, 56469, 23287, 12280, 11428, 21570, 31716, -4984, -18504, -14858, -347, 13506, 7460, 4844, 12664, 12295, 11573, 11742, 27098, 27721, 6222, 9669, 18358, 42418, 35363, 26570, 5520, 1923, 21818, 9799, -3320, -25135, -42150, -46605, -13713, -8804, -20982, -10092, -7037, 8251, 4507, -23924, -34809, -24281, -32720, -212, -28112, -32852, 4715, -7837]
8779g837j8569J2590J7761j1302R314R991K9437M5025n828m2500j3103J1599j1632
8766B4946q616q705N380j2677K353J573m891J5546P369O108J5554j3129l667K341
8752B9485j6174O273K4785L2709J735p334k0046r041O447j8029k3059K5093J4003
8739D6847R201n285m2079j783j795J4903M91m430K7977J1630o020j7164j6613
8726A5880O381L926j2080q430J5154K6821N3066j3259m321K36j1403q460q393
8713E5118J976J2082J3476r125p394k9056Q596J8536o86j5117n978J4416j0087
8700D6757M881K2080J8162l840k8401k984j7010k9560J788j1397m589l04k271
8687f688m269K4777n897j5118j0989K0367J2431M733J2608K0887O844L1666o292
$$ y = [-7837, -26406, -13816, 3945, -7357, 1957, 11948, 41385, 86410, 80582, 38082, 24979, 36578, 24946, 16330, 7625, 13005, 328, 2681, 4254, -637, 14909, 22278, 28386, 43940, 30811, 27144, 29485, 13311, 19584, 44369, 77078, 78813, 71479, 51433, 42392, 48839, 30810, 7751, 32844, 46847, 56048, 50763, 8684, 6901, 5106, 20009, 20500, 16070, 44047, 55677, 49657, 32493, 15880, 22261, 26187, 14107, 5677, 20831, 47652, 100718, 87459, 83138, 83374, 71971, 63511, 55118, 57094, 69176, 82652, 73527, 66133, 37077, 45673, 64209, 63523, 48406, 42428, 56844, 46757, 51638, 73718, 91880, 88040, 59639, 56655, 39645, 10085, 11873, 476, -4113, -4417, -6688, -10957, 13820, 7923, -7195, -18184, 2183, 14614, 19347, 31955, 52842, 59686, 91352, 85060]
8674H5060j5530o35q381k2706n431J2976j6068M633L556l797j8454j1576J083
8661D730j635K036M1810O082j6244j7670q207J5859J3365j6865j7968j4257K6585
8648A7621K4901J2965k7920l3412l284J845k4756k903L0290N367j0750k3577k0570
8635e4183o068K4307K2642J3501J1691J505K6175J818p85q042q127j4953o212
8622C269j257j0430k0054j0616J5118K2573J9667R856j9812M170K3741r301P122
8609C4046j3325k1240q684K9862J028q829K685O434q259j4932N593o159j7298
8596a9078K4544O006o675O715P04K4843K2408k8293l1351n540l590P439j007J8365
8582A5490Q17L85p117P265O586n861n598j915k9462J189J0202k4839j0606N259
$$ y = [85060, 69530, 68895, 60514, 37808, 32377, 45353, 29285, 33918, 37474, 33677, 15223, 3647, 4730, 3095, 5131, 46941, 53023, 36779, 19109, 10902, 26761, 40126, 23261, 5293, -8964, 17621, 42522, 55487, 27567, -5845, -9129, -7284, -32040, -34943, -4653, 714, -10036, -33613, -54183, -60251, -35944, -13302, 199, 11890, 13395, 39570, 41388, 40603, 32561, 24434, 9481, 3269, 2012, -8418, -28472, -39088, -23970, -1397, 18270, 28126, 8314, 12484, 36225, 26924, 34046, 20721, -519, -9203, 20659, 21687, 12858, 15543, 21977, 13718, -1214, 4379, -1780, -19078, 5466, 11472, 4797, 11512, 12216, 37059, 59467, 31174, -177, -5717, -9307, -1868, -2875, 15490, 16307, 16692, 9575, 16840, 23426, 17565, 11967, 10052, -19410, -18221, -8019, -32858, -43464, -38205]
8568c8205L2421K0094Q418J0866K419j0407j0285M105J6736J3252k2223n7065
8556b9874M134J2532l2687J4545M2288L1473k1307j7743k0006J4091L2546J9374
8544D9366j0205O078M764Q726q810j8118J4271l3052k6465l9549P201N9054M1848
8531E5109l0217o541k7651j8499K0657J9596j340J0336L4445O544j1159L8N116
8518E6434l5870j5752J7792R219j6230k6495j8703j0976J4291j2383j7524q408
8506f4605J9993K1704K3906j9886r79K9077K1958N611M631j7188J167J935k583
8493B4741L020j3914M56q70k5464N202J7961K6322j5039q44m175r838k1732k6386
8479d0560j5480M903M4516L9177q560k1678k201N535J2869j889k8090j6363J8364
$$ y = [-38205, -5784, 14310, 22728, 33594, 36013, 25606, 15321, 19426, 36162, 49414, 27191, -29874, -25740, -13208, -45895, -31350, 10938, 42411, 21104, 3361, -16645, -2554, 29992, 49366, 39161, 45239, 50003, 58729, 49919, 31801, 46072, 13020, -13445, -52994, -45793, 13261, 55109, 24892, 18351, -9300, -27799, -7142, 12454, 11114, 21450, 55895, 62439, 51280, 51318, 56434, 20564, 4812, 22604, 31823, 15593, -10902, -29605, -40581, -26290, -38673, -56197, -64605, -44612, -22908, 998, -18888, -19867, 9210, 31168, 36779, 41410, 24222, 25389, 27324, 24741, 27761, 13847, 14303, 13433, -12031, -6829, 11132, 37454, 22415, 21571, 17396, 7558, -14174, -40560, -56040, -51137, -6621, 32556, 23996, 2318, 117, 5652, 18521, 16632, -11458, -27821, -9457]
8466i457J070K0846j3268j0221Q32L1613M205R981m169j1195j2108o368r828L071
8452d996Q19j2047j0287K6770K0206K4152K0761O249Q313j0100m2607k7441K9570
8439B9362K4529o824p051l574L691O94j8658n672P986K764j8313m1963p829L0396
8425a0462L4846J4603k9336o490j2247J9852P270j7607J9748K5227P408k394l3473
8412A6945j9489K1022L4838q951k7072j5933k8102M091J1555L62M883p781J6595
8399B963K9346L789J1209l5448k2837K0200J1168P552J3955j7239M967K459j6938
8386A5146k4931q653J0182J1947j6942R304L4203J803j0787J4391j8134j7754
8374b25k469P75j7505p036J1909Q820j5734j0023j5111L0302R762n499j6671r806
$$ y = [-9457, -8387, 12459, -809, -11030, -10198, 21415, 25620, 35601, 31432, 20237, 8129, 1761, -8067, -4996, -4177, -16224, -26511, 259, 20465, 44617, 65378, 71627, 79940, 69840, 27233, -208, 29362, 53891, 47067, 40016, 36442, 40133, 40827, 22169, 16497, 24483, 27247, 8934, -33029, -40858, -10462, 24384, 38987, 9651, 3161, -9086, 10766, 18036, 429, 20177, 45404, 52812, 50418, 16945, -2544, 18478, 53316, 44365, 17293, 1360, -26742, -22651, -11096, -10734, -5851, -13632, 2963, 32309, 36098, 47307, 11859, -10978, 9222, 20390, 27942, 41897, 24658, 29625, 32084, 15146, -9785, -18438, -8256, 3691, -13251, -3947, 30256, 32059, 21272, 35663, 17529, -225, -2694, -1919, -19424, -26460, -14551, -5731, -21465, -31488, -46599, -16297, -6535, -12034, -28705, -38511]
8360c8511L2399K613k81J0659j2426J2919r303k5144J1033K9644J87K43J1175
8347B5207k3726N025N81K2893m651o349r285q401J268k269j7137K206J8229M001
8333G592k5951K370O479J9100Q944M218J5377l0729j2969j547K9441O026j0665
8320A7686j7164m228n90J7403J7275J0367r628q592j1028q84q689k505K1397m805
8306A6015r932l316m348J3537K5100L7391Q185l089m3068l5996K337J1246k8461
8293a4399r366K1069r123J838O748J288j334K0208O396p301o595N878J6844n643
8279B6508K5513J9359l0843j206n495j2605j0823k0982K7122L7555J9618L038
8267G6759k2876k9109k1896j6342J222L5282j6724J2879L441K187k6702L696K6239
$$ y = [-38511, -6112, -3499, -3780, 6879, -5547, 7372, -1931, -27075, -16042, 13602, 13789, 14032, 25207, 1481, 6506, 7087, 29980, 25329, 18980, 9695, 1294, 2562, 293, -16844, -14638, 3591, 7592, -18359, -15989, -9510, 9590, 18534, 22752, 38129, 7400, -5569, -7116, 22325, 28351, 17686, 522, -3706, -4296, 13107, 30382, 40749, 31121, 22529, 11501, 10617, 1928, -577, 20820, 16015, 6083, 2767, -1581, 11956, 37056, 74447, 82632, 79543, 36475, 479, 2816, 14062, -14399, -23765, -2696, -11819, -9981, -3233, -1945, -3279, 16929, 23325, 16024, 9429, 15307, 32151, 26508, 52021, 71380, 40537, 39331, 33836, 21231, 10408, -10574, 16548, 54103, 73721, 76759, 53883, 24774, 2878, -13464, -12242, 23040, 6316, 19195, 22636, 24823, -1879, 1817, 28056]
8254B8056J587l369j9166k6259M16R346N466K0351j7802k2140o95j0954J6014
8241a9149j647K345M433J4946J2411j034j5508R96J6436k4360l3468j6279j204
8228f1082K5796L2258K1927M089j6053j4757o656j6166K4627K2937K920j1289
8216H551k9718j2428K5099Q039N069M8514J0512j6640k8594o957o837j3719q300
8203a7409J8317J3566K4393O180j4021K27j5377q763R576J8214r235l4066j5103
8190b3501K1585K1658r100j0411R362j0253j5691J1395J6434j655J5871L230O336
8177C5260r591J1459j5599k1223r241L6369J719o880L388m121R280j3114j8860
8164a154J5738K7699k230j2589R387o476j1904j3036K3509l551j7928m164P889
$$ y = [28056, 29643, 26274, 7108, -19151, -18735, -9389, -3923, 16428, -1374, -23514, -24209, -35163, -19149, -20796, -18451, -14018, 928, 13339, 12305, -3203, -2207, 14229, -10131, -43599, -59878, -61082, -35286, -3028, 18899, 22988, 6935, -7822, -14478, -30644, -6017, 16920, 19840, 8551, -21167, -33595, -8496, -457, 4612, 53126, 63638, 46998, 18404, 11447, 4610, -9109, -17409, 908, 14474, 38867, 45047, 31026, 31253, 15876, 7113, 16689, 34903, 25668, -8398, -23501, -1916, 19742, 10642, 231, 9593, -660, -16351, -4956, 11478, 9823, 25694, 28924, 35260, 25669, 37128, 21529, 306, -8935, 27434, 29153, 22273, 25661, 21540, 30820, 17706, -1154, 14584, 42283, 40053, 27464, 36851, 30375, 18471, 5435, 28944, 25393, 7465, 3301, 11190]
8151A1190Q480K2859J7475k1791j5877k3070J93j6926K574J364j6148O471J9775
8138c431L0349M239n635j3645j1981L044l09R299J1583P302o046l693r435J2209
8124B3850J6451r053j1466k1759J2689J9268J301k5202j5519M449J354Q826k450
8111B739j274j0250j6113l575J825J3264O717q038r751L441L9314J6504J16o916
8097B8003j7066m960M305L4413j8098k3449j2544Q332n074Q819p633K0971J3125
8084B9144l3905j6313Q355J8144Q057k905l2093M130l627K772K6319Q141j1107
8071E112M051L963J744k1993j97m12j2733N287J1154k075j5612J312J0323K64
8057i812k9495r743L1108L2259Q41k6182j1399j3666M21L2692K2812j2958j607
$$ y = [11190, 19670, 42529, 60004, 38213, 22336, -734, -541, -17467, -14893, -13529, -29677, -23206, -3431, 26918, 31157, 25522, 11877, -104, 2940, 2631, 11930, 23513, 30815, 24769, 21076, 11641, 23850, 40301, 31248, 19782, -1977, 10712, 29980, 31281, 6079, -9440, -4991, -3637, 5189, 2739, 1465, -8785, -24898, -28473, -26648, -13384, -6667, -14705, -24456, -21015, 18299, 34803, 34919, 28003, 10937, 5977, 10282, 44695, 26597, 3148, -9396, -1064, -6138, 2681, -4952, 16019, 29144, -4761, -21074, -12719, 5425, 13482, 10577, -21516, -17386, -21013, -18241, 8078, 16219, 5112, 9163, 13126, 14870, -7123, -7320, -7732, -20465, -15178, -4024, -6099, -21711, -20399, -10076, -9812, -39307, -49050, -17942, 14317, 15158, -11024, -22423, -36089, -35668, -2976, 19836, 6878, 5271]
8044E271m484l4791k8410k0597M1900M4969L5811j2235j0385k3277j1786P880
8032a0134J3537K296K1640O434j3378j0067K1733l690O15r700j7640j0612K3561
8019A4595R155M195o825L750l1498k0607k2919N462K837L725L6832M086Q462J5087
8005B6337j2726K0728J0671o188j4757K3199j5401j8978J6238P391L027q469k962
7992B8110j7813r552J4211L198P55q459n009m478k5904M310K5969J0781k7768
7979a1649j0283J769O683m922j2224n11p049K2439K3386O196J846o765J8407J345
7965B8668n0902k534M042J6407L9464J1346k656J790j7353l0132k2883n082O628
7952b3197p114J1256R335P768O74K1141J3359k9998n405k3356K693J3322J1754
$$ y = [5271, 787, -34004, -62414, -83011, -41111, 3858, 39669, 27434, 17049, -6228, -18014, -10134, 3403, 5699, 27339, 33773, 20395, 10328, 32061, 28371, 28986, 19286, 1646, -8966, 14595, 23750, 27945, 21120, 24870, -6628, -27235, -50154, -44692, -41855, -38130, -1298, 2788, 11250, 26337, 13611, 34339, 45010, 38822, 24065, 47264, 31863, 12885, 29123, 36514, 39541, 31072, 28110, 10297, 745, 14956, 18154, 18909, 10450, 5441, 963, -24941, -20631, 5338, 16119, -11649, -21932, -20163, -13480, -18402, -30626, -31137, -38186, -15747, 7639, 13835, 15681, 8916, 27323, 28668, -22234, -24768, -20726, -4319, 35145, 46491, 43835, 45625, 28272, -1860, -24743, -29825, -23197, -30311, -19055, -9720, -1952, -1278, 19863, 33222, 3224, -2181, -25537, -22844, -9522, 2232]
7939B232J5852j9912r087J6306M462q495k7939k9560J4127K5248J3826J8783J2993
7926B8836j6146k1546R805J0285P205j9560m578J0639r346j2616k0681O591K6734
7913d378L7265J7602K760m4807l3121j228J5311J3394p396k3313Q216J2153m627
7900a2169m863L0698J5083p302m6549l5318J3983J3843n798L457J542K6947J0524
7887D078R573J6283r689K338Q161o845r85j1777n93R477K809K697k6267J744J1759
7872A2763N523m751O411K1434l3175l7081j7126j6770K1477K3631N980N935Q938
7859C189Q474j0225j5715L022J4980Q95K4151J6653j3569k1318k0092j2164l882
7846b5601M054j2716L0402L7648M900k5423k8369k5260K0908J0923N075J3940
$$ y = [2232, 18084, -1828, -10915, 5391, 9853, 1358, -26581, -56141, -42014, -16766, -2940, 15843, 28836, 12690, -8856, 949, 11234, 18439, -1121, -5699, 4940, -4406, -17022, -37703, -31112, -4378, 32887, 50489, 53249, 8442, -24679, -25907, -10596, 2798, -4598, -27911, -19695, -7542, -12169, -17032, 13666, 28749, 21447, -25102, -60420, -46437, -32594, -38392, -34935, -33393, -6446, 4078, 13651, 29934, 20245, 22583, 30744, 23899, 22914, 11137, 10544, 20021, 22830, 25527, -740, 1004, 12763, 18286, 13535, 19946, 41380, 8205, -28876, -46002, -62772, -41295, -17664, -11684, -5749, 3189, 11663, 1438, -14277, -11255, 3725, 4620, 28771, 45424, 31855, 10537, -9555, -21719, -25601, -21547, -34263, -3861, 33787, 38687, 13264, -15105, -40365, -19457, -8534, -3459, 10481]
7834A0481l218k9671J2527J0616j4093J33J0195o309Q82K5390L349j3449j5883
7821i050K908R718j2849j3021K1463L199M878J287k6885Q735K5715K0357N818
7808D2273k7023j6245l460j4666K4948K0618m612N018m171k0535j0972R310J2359
7795A2842l9130p010j4892N868K2730J5367J7278L85m171k7919Q952K1646p866
7782D080O959P359k0095j685J6277j6644k2646j5744K0785L9447Q458j0054J0880
7769B7377N714l063r199l374n52l313l2539j2997k099J2826L0459j1447p506r498
7755a9211L648J4328N080m783q708q585o011m100r268j636k2128J3917J1450n66
7741c6573j3921J5564K3249J7741K6559Q241q84n862J2843K1705p02k4784j9083
$$ y = [10481, 7263, -22408, -9881, 735, -13358, -13225, -3030, -9339, -8457, 16933, 20282, 6833, -9050, -6142, 3576, -9273, -22294, -831, 2368, 7246, 8533, -18352, -9617, 16098, 36455, 42273, 15250, -995, -4455, -19121, 5827, 26445, 21833, 26851, 22680, 2145, -8827, 483, 12842, -26288, -33298, -48190, -42322, -19592, -4225, 13053, 13438, 9267, -18652, -9700, 11946, 4080, 11039, 18398, -1697, -3382, 12895, -3749, -26395, -42139, -21354, 18093, 26551, 16497, 27377, 33091, 30028, 20829, 17455, 16903, 13590, -18949, -31946, -34045, -21219, 9240, -2207, -9713, -19211, -15563, -1235, 3845, -938, -9646, -18231, -24242, -28342, -37610, -39246, -61374, -47457, -36007, -36573, -50494, -34930, -11681, 6060, 32619, 40860, 39976, 34114, 46957, 68662, 67960, 43176, 24093]
7728B4093k1048m156K1581k3187k4222p838J737K908J5101K1269K9969J250k3070
7715A4387l2134q461O28K6095L4419J5354Q363k9916o149n103K2328j2833l6143
7702i165R590L932j046k58J0275L831j6735p666j6959J4374K4812J1356l0383
7689d042j1907p245N569K7519l432p447j3618L737m18L505J8417N302j264j558
7675A3118j7002l398K7979K4143l0j4874k4671k0668k5377J2501J0891j685o079
7662b5152J6295j2770j1562M903K0060J5439k6166j3110n137J7968J856Q912L0253
7649B1789J5343k0290k6632n602K1271O204n062m646j5494J0590K0385P383j7217
7636H022j0109n595j9380M841J2024K7222P845J4651O824j1473j6077k1488K1405
$$ y = [24093, 3045, -1111, 20470, -2717, -26939, -34777, -33040, -30132, -15031, 6238, 36207, 37457, 14387, -17747, -26208, -25580, 515, 34934, 50288, 58651, 28735, 22586, 17483, 39811, 26978, -9165, 425, 4357, 3311, 3053, 13328, 17159, 424, -7242, -24201, -9827, 14985, 26341, -4042, -15949, -23194, -17625, 9894, 6462, -985, -14603, -10866, -11284, -7779, 10638, 15940, 14676, 13118, -3884, -7282, 20697, 44840, 44810, 29936, 5265, -15403, -40780, -28279, -17388, -19073, -25152, -8857, -21627, -33189, -28286, -8226, 7213, -18953, -32063, -37200, -19232, -17376, -8464, 21789, 37132, 16842, -9790, -15392, 5879, 12083, 7021, 2375, -13119, -2529, 17856, 25239, 8022, -2087, -7682, -27062, -22221, -10197, 17025, 24870, 39521, 46345, 34872, 18795, -2693, 18712]
7623A8712L1961k40n1993l2258k8885j1121L0533J3001j3866N610K8971R764j962
7610a773J5806k7026k2990K7895K6988J7266K712n644p233J2323o172k0741r123
7597B288k992K6542L691j5686j6575J0621K4440M583j2019M364L910j2447j2284
7584H436j4724j8406j5947K3383J4850J5714N120j8228L82n405K5087J85n540
7571A4907j813J121k2974l809L2248j8072J2687J0038J4752p160j7672l8090n080
7558b8917m201J4709L8785K742l0430j0215j7774j1360O806J5710K2416q798k6011
7545c6538J9881K3324j9078k3323m525L0054j2862q555j9505l8392m689N1196
7533d3012L5399j1094j2852o731j0611J4977J1466l936j1991R424J4836M6618
$$ y = [18712, 50673, 50433, -1560, -33818, -62703, -73824, -43291, -30290, -44156, -38546, -9575, 189, -1773, 14033, -12993, -35983, -8088, 18900, 36166, 38878, 33234, 26001, 38324, 32152, 11411, 2288, -704, 25838, 29529, 13843, -2732, 7889, 32329, 36912, 24893, 29257, 33167, 20720, 8436, -6288, -24694, -40641, -17258, -2408, 13306, 18426, 198, 580, -4825, 20262, 20447, 14907, 13094, 14215, -8759, -12568, 19680, 1608, 14295, 24333, 39085, 31925, 14253, -23837, -28917, -33118, -18409, 20376, 23118, -7312, -17527, -35301, -46661, -39855, -24145, -1729, -10527, -36538, -16657, 6667, -12411, -35734, -40259, -10205, -23067, -31622, -51127, -89519, -94208, -43012, -7613, -18707, -31559, -38290, -48901, -33924, -22458, -26394, -38385, -28961, -14125, 32493]
7521C2493P391j9686j9346j2496j2284j7102N007J7462J8054Q045O624K917k635
7508A4444o247m4891J3969K1106j1476m318r871J3553J1825m912o268P8K5697
7495A2689M006j9386P870P807o174k3738k682K2424K4657m979l516K3682K4679
7482F7339l0129j4507J6718k9489l4406J1590j3479J7591K1536j1032j6527J3268
7470a527k868K393p459J2145p936m642j1039k9424o456J8898K5420J9769Q046
7457A5320R071J52m269q792j7582j6828L644j0197K3755J8576k6407r940Q151
7444a5346J3284n080J3171l497m147j075Q101Q21Q002o918k0738r492J0496m178
7430a6596N164L833n316p342P420K6062Q083M512j9479o901o747l132j290L85
$$ y = [32493, 39884, 20198, 852, -11644, -23928, -41030, -36023, -18561, -507, 7538, 14162, 17079, 14444, 8197, -36694, -22725, -1619, -13095, -17413, -27284, -13731, -1906, -6818, -13086, -13008, 12689, 16695, -2691, 5179, 12986, 6812, -16926, -19608, 2816, 27473, 22494, 18978, 42660, 67339, 37210, 22703, 39421, 9932, -24474, -12884, -26363, -8772, 12764, 1732, -14795, -1527, -4395, -2002, -9461, 2684, -5252, -9894, -20933, -50357, -56813, -37915, -12495, 7274, 15320, 24391, 24543, 20274, 11482, -6100, -22928, -19284, -29481, -5726, 12850, -13557, -23497, -15346, -2062, -7142, 6029, 2532, -1615, -2690, 5411, 6232, 14234, 7316, -13422, -22914, -12418, -16596, -11432, -7599, -12915, -20257, -12837, 13225, 21308, 25820, 6341, -560, -7307, -10439, -11729, -11344]
7416a1344K9162n755l0817R789J1735j1541P980K004J1098j702K053J4812q291
7403A9183k3735j9966J3548K0042K5031K4973J881q890n2432n2136L294J2533
7391c6674J1164K6140R25k5723l2465m953O589K3459J9555J2028J2257R875K715
7378B4892j0387l4907j9536P609J5958j1L281p168j775J7291K1980n929j2005
7365g07j3143M659J1159J7459j4352k3109k8838J068J2514K406J4312K8098J2233
7352B3759J156k641j9259J0300J3008j6123l94J3109P172p259j167P41j8532k2599
7338a8729p467N879J2469J219L434K728P965J1459O58k4216k0684k2456J7246
7325c0495N612J9571K735j9329P069K810P736J8330J8247P406p322k0860K200
$$ y = [-11344, 17818, 12063, -18754, -8965, 2770, -8771, -791, 1213, 12311, 10609, 12662, 27474, 19183, -4552, -24518, -10970, 9072, 34103, 59076, 60957, 52067, -365, -52501, -49207, -36674, -25510, 630, 1555, -24168, -56633, -61586, -54997, -31538, -11983, 45, 12302, 22177, 24892, 14505, -20402, -39938, -32329, -16371, -16382, -13101, -20269, -22044, -4753, 17227, 11298, -707, -13850, -9191, 1968, 19427, 5075, -18034, -46872, -45804, -33290, -30884, -16572, 11526, 23759, 24915, 22274, 3015, 13315, 26323, 10200, 9806, 22915, 30087, 22828, 21661, 22402, 3870, -18729, -26196, -20317, -7848, -6629, -3195, -467, 7498, 18957, 19615, -4601, -25285, -47741, -30495, -24883, -5312, -2577, -21906, -14837, -12027, -4291, 14039, 32286, 39692, 32370, 11510, 13710]
7312A3710j1078R523j5956r334p526J5337n375j5410k2014J0863J0127K0232K495
7299d406r639o286k0422j4012L658K2636M0177j5275J3020O405L172j0714p673
7286F41k3514j6302J9764K7332J559n229L240k1091j0061j1103l074K150j5911
7273e1599n375L3803J1096n067j0630J7709p489r994L6672M9750J2580l2051k3386
7260A6019k5114r035K091J7588O765N147K0722j499o17P704J11j9792J3871N660
7246C9621R308N039j1340J1002j6436l489K314q055j718o151J8963K1487j9903
7233D0642k5223k2063o79m408p756n524l8M47K592Q394k007q58j0518J4449J0357
7218b193j5517J4203K3562j4885j2115n907R654j1770L436K1778j7009q144J5573
$$ y = [13710, 2632, 12155, -3801, -13135, -20661, -5324, -10699, -26109, -48123, -37260, -27133, -6901, -4406, -14045, -20331, -40753, -54765, -51107, -28471, 11706, -3569, 9451, 15856, 19028, 8314, 641, -22873, -39175, -19411, 7921, 9480, 4251, 7491, -13600, -23661, -34764, -37838, -35688, -51599, -56974, -23171, -12075, -17142, -27772, -10063, -17552, -27546, 9126, 58876, 71456, 39405, 16019, -9095, -18130, -16039, 1549, 8314, 13461, 34183, 32684, 32067, 39771, 39882, 20090, 33961, 39621, 48929, 53968, 42628, 53630, 37194, 33705, 36019, 27964, 26246, 20095, 39058, 60545, 40642, 15419, -6644, -7323, -11731, -19487, -25011, -25049, -24602, -22010, -13616, -15623, -16481, -26999, -12550, -2193, -17710, -3507, 20055, 5170, -6945, -12852, -3198, -14968, -11532, 10246, -6763, -14907, 666]
7205F66l368K918L5672N125j7299k1758o070n777Q812J5316j4797k4520R776J1739
7191c565q454k4882n570K0778K9797j2093o119r592j0329k4374Q404L3456K0217
7178G674j109j0182j7040N703L5971k1474k8050n192O46J124J3925L61j3748k916
7164c4307L0424J6559P250P137j993M2725R47n0781j7496J5304j7916p390j9957
7151b9494K175K0755P585p359j0584R944J6280P841K8833J583j3962J49J2005
7138D5751j9792j5116N915m001l604k096M106l269K882L608J893j6574o890k1106
7124b8293j3503L726J2164J8281k8365k3309J3382L6681K7550K8080j1785k5515
7112I094k1525k126q986m530j025K1379k111Q63m319J0846o205j2808O598R539
$$ y = [666, -2702, 216, 35888, 41013, 23714, 1956, -4114, -9891, -1079, 14237, -560, -25080, -15304, -3565, -12019, -36901, -42471, -21693, 8104, -3989, -10108, -19700, -30029, -54403, -45999, -12543, 7674, 6565, -3617, -20657, -14954, 21017, -457, -28507, -33699, -33053, -31929, -18004, -17643, -31391, -34307, -3883, 12676, 19926, 27063, 25070, 67795, 68742, 17961, 465, 15769, -2147, -9537, -29494, -27319, -6564, 1021, -6338, -16922, -6978, 9302, 17143, 45976, 47559, 33597, 33746, 45751, 25959, 10843, 16758, 12757, 9153, 7057, 11163, 7894, 10776, 14384, 16277, -297, -7187, -28293, -41796, -38070, -25906, -7625, -35990, -59299, -45917, -9236, 18314, 46394, 34609, 9094, -12431, -14557, -23543, -28073, -29098, -7719, -9830, -8967, -13286, -2440, -8645, -21453, -14855, -5316]
7098e316n596R652K6354j6045k0080K8552L0507k673j1826o211j565k4949O031
7085F835j6803j2401l0644J6553K7694Q616j0496J6063O957J1312L194k5093k0761
7072a8974l3275o645O048J1281K3676J3593j245p365j3076J4197J3683N799q730
7059a033N185Q704o899Q488J4220j559k2290k2295J3304L1239j6987k7205o648
7046b3776q694n725J8941Q564r009K008j339Q233M529j245J3063K3017m027k6220
7032a680l174J7725J9406n884J9606O133j4404J4983k8431l6057j5970L998K717
7019b1032K2406L8713o486k5894J055j1851j6841J0505J4137q804k1249j66L196
7006b2311J8288M0841r128j7270l146j0206o504l681l6900j0830K9933P837P161
$$ y = [-5316, -10912, -1260, 25094, 9049, -11031, 17521, 48028, 45355, 33529, 27318, 25753, 804, 6835, -9968, -22369, -53013, -36460, -8766, -150, -10646, 5417, 12374, 23686, 26880, 1787, -18974, -52249, -58894, -52846, -41565, -17889, -4296, -5541, -12906, -25982, -11785, 1898, 7697, -1033, 4152, 12856, 5957, 14445, 28665, 27106, 4816, -17479, -4175, 27064, 10077, -17128, -23776, -32470, -38195, -19254, -10690, -19699, -17691, -19030, -10797, -6268, -7513, 5550, 28567, 24540, -1680, -4854, 12871, 32277, 26393, 45999, 52132, 37728, 52711, 24280, -11777, -27747, -23749, -21032, 1374, 40087, 33601, 7707, 8762, -3089, -19930, -9425, 4712, -4092, -25341, -25507, -22311, -4023, 36818, 27690, 10420, 7274, -2932, -9436, -13117, -50017, -60847, -30914, -23077, -15916]
6993a5916j5396n154J4778p933J3726m404r140R946k910K4684J3405j7123R455
6980H018q9j8658n882J0688o683l5737j0712m997J8323K9020J2860q937o445j8546
6966c7777o216J5175K3392K3598K297L561j8541j2446L892K27J1487J1454L773
6953B3876j5084l619P775r155l1477J1410K2839P935k6325L740j896r682L160
6940a6503M773j7921J2435J5282J8028j606k0784k2975N69L370J6958J537j0337
6927a7174J7176J4555k2201k351J8307M4038N131m0804j2046P526L805J010R425
6914B6397J104J7171J4549j8932j367n753j9702j7418l755j7357j1799j3642j0871
6901f1375K133K8935J0783K2650j554R26K907J776o340Q382O83q724K0260J4715
$$ y = [-15916, -31312, -36466, -21688, -29621, -15895, -20299, -29439, -19493, -22403, 2281, 15686, -1437, 8018, 7929, -10729, -16611, -5923, -12606, -48343, -59055, -64052, -45729, -16709, -3849, -12786, -19231, -37777, -43993, -28818, -5426, 18172, 20469, 24030, 5489, -6957, -3065, -2838, 8649, 20103, 23876, 8792, 5173, 12948, 3793, -27684, -16274, 6565, 14500, -11825, -8085, -9981, -19663, -16503, -11730, -29651, -17216, -1934, 16094, 14488, -6296, -29271, -28702, -25332, -8374, -6837, -17174, 2, 14557, -7644, -9995, 8312, 52350, 57481, 16677, 4631, 12157, 15962, 16972, 26397, 27501, 44672, 59221, 40289, 38922, 33169, 13467, -3951, -7706, -25063, -36862, -50504, -61375, -59242, -30307, -19524, 3126, 1572, 2498, 5405, 7181, 841, 9223, 9906, 1182, 21442, 36157]
6887C6157Q69o466k7295J556J1751J3538P060o923K0036K0643k1712n1015l26
6874b127k1559K592J0971R238M9112j2245j8486J6309j8844p001K357r430j7745
6861a6858J3165n624M677K733j1606j1460l795M4404j2149j6242k1666K994K8497
6848b930k171j3078J299K7793L815N244k3543n526O071p716M663o924m778K395
6834a5386j0010o81J2665j0224K152J411l107J8549Q359L27J9216J3849m743j9000
6820A3377K194j6128m4156o58n571p537K0100p205J4835k6553k0768J3260N2805
6807a2005L8583R83r751K1775r521J410J2331j815j1192m286J4670j0104k0976
6794A0102j374N263L906j6869j4339N174J778J9519N404j3729k4899k3189J2127
$$ y = [36157, 37026, 30560, 3265, 4821, 16572, 30110, 37170, 30247, 50283, 70926, 49214, -1801, -2127, -23686, -21094, -10123, -885, 48227, 35982, 17496, 33805, 14961, 7960, 10317, 887, -16858, -3693, -9317, -4640, -1907, -13513, -24973, -28768, 15636, 3487, -12755, -34421, -31427, -2930, -5101, -18179, -16880, 10913, 14728, 19972, -3571, -9097, -3026, -10742, -6079, -13003, -17781, -15386, -25396, -26077, -13412, -23636, -21484, -20073, -23180, -4631, 3728, 4055, 23271, 37120, 32377, 13377, 15571, -557, -44713, -45371, -50942, -58479, -38379, -45584, -30749, -57302, -78070, -64810, -12005, 26578, 27561, 17810, 39585, 30064, 31474, 43805, 41990, 30798, 26512, 41182, 31078, 10102, 8728, 13991, 17897, 1028, -13311, -8137, -6359, 13160, 18564, 4835, -20064, -43253, -31126]
6781c1126J5710J3174Q138l4319k5655J2292J3780K297k54L0064K0484j9578j0294
6768e287k101j1037m825K981Q905J8402k4891j5849k2966q32J8571R735J2682
6755a6512L368k0581q406j4145J7126J2362J0807J6560O130j811J1884j1873k5875
6742b0966J2295L1875K4275l528M167k8609j9513J7361K5571K3784j1114N826
6730F1424K513k559r160j0419N287l3266j8342P242l034R698r15k2M782J401j6825
6715b195j5156J3761j4100Q040J7578l524j7722n661K253J4793J9231k8296J755
6702i243L0077Q328l5625L045L6896P618k3814o906j6872J7954K304l0404p07
6689a7349J5450q974m889o928j8136k4933k1328n491L8975M3901J1572n329n128
$$ y = [-31126, -15416, -2242, 5896, -28423, -54078, -41786, -28006, -25709, -25963, 4101, 24585, 5007, -5287, -7388, -18425, -23250, -20269, -11364, 7038, -17853, -33702, -56668, -57500, -38929, -29194, -16512, -13144, -33725, -42131, -56276, -39150, -26788, -15981, 579, 6709, 4898, 16782, 4909, -20966, -8671, 23204, 47479, 43951, 48118, 19509, -4, 17357, 42928, 66712, 55598, 61424, 63937, 61378, 52218, 41799, 47086, 13820, -4522, 2720, -314, 9384, 8469, 8447, 13229, 14630, -2195, -17351, -3590, -17690, -9650, 7928, 4404, -13318, -18979, -16726, -1933, 17298, -10998, -9243, 20834, 29162, -6463, -3418, 33478, 41096, 17282, 10376, -6496, 11458, 13762, -16642, -17349, -1899, -10873, -15762, -22690, -40826, -65759, -87087, -92578, -53603, -9702, 1870, -3459, -8587]
6676h587n654m819N827k98l1710k0637K0965J3907o641J877r336n344l425Q48
6662e3027J1008K6216P229j5306J6814J6439j519k4663j536r80j3930K4778l098
6649a1575P999J27p01N663j246N240j4654m94l426m397J4005K536k1440K2414
6635E1K4151j2706k4728j374K2627J7396j2685k8551n753n095J8939O882k5127
6622b5973k6848Q817J6099J2595L1383J4310q820j2226r257l254L91P400k0990
6609a6373j7523m939K306k54K9027K4474k4377j0745M695J0961K8325R285N926
6596D0788j4074p537r304M608k9984m3989p850K3720M3049J4535j5227n665L5970
6583B9040j89m5601j8219K0133K3729P704j5887j0410P384R508q226J3478J3368
$$ y = [-8587, -14241, -19060, -13233, -13531, -45241, -65878, -44913, -31006, -37647, -35770, -45106, -50450, -53875, -53027, -42019, -15803, -8574, -23880, -7066, 9373, 7854, -16809, -18345, -19325, -33255, -8477, -11575, -3576, -3449, -4150, 1513, 267, 5507, -9147, -9641, -13067, -17464, -3459, -923, -22363, 51, 24202, 11496, -13232, -14606, 8021, 25417, 12732, -15819, -21572, -26667, -7728, -846, -25973, -52821, -44004, -27905, -15310, 16073, 30383, 21563, 9337, 80, -3174, -2783, 4617, -16373, -33896, -38835, -36529, -36783, -7756, 16718, -7659, -18404, -13709, -2748, 25577, 34862, 40788, 26714, 19177, 9873, 14481, -15503, -59492, -67342, -43622, -573, 13962, -1265, -6930, 29040, 28851, -16750, -34969, -14836, 8893, 16597, 710, -9700, -2316, 7192, -1034, 12444, 25812]
6570B5812o707l9015O330K5608p288r961L2299j619j2348P25l9239J984J9369
6557d050r045p340J3186K519J2497O238j3109j0887r351o719J9485K0564Q327
6544B2315j4624R717J2513J2926k4266l64j7673j0487q149j1077P306j3170n092
6531d0125J015q373K8266N812L675K181j0471N888J494j5949J2483R302j1544
6518a6346K016K323K5143J5618r123Q059j779j4886j7412q079j3547j5279K1455
6505b1837R696J6068J6084J9225k8050m7657N627L4794J5331O558K3173m742l5883
6492H387m542M251o720j0583J9490K1931J2684j7234j049l3230m0397L422r51
6479d4541k3601Q6Q424J7041J5449L3378J6277j460M491j1128k7159j3413J8944
$$ y = [25812, 19105, -19910, -13580, 12028, 4740, -5221, 27078, 25459, 13111, 13836, -25403, -23419, -4050, -13095, -20435, -7249, -4730, 7767, 14005, 896, -9991, -19342, -26061, -6576, 13988, 22315, 7691, 17408, 29921, 42847, 18581, 18217, 544, -9943, -18092, -29169, -21863, -35033, -40125, -39110, -47483, -19217, -13405, -9730, -7549, -18020, -12132, -10638, -26587, -14104, -4802, -16346, -14330, -12007, 13136, 28754, 19631, 27690, 25911, 11025, -6387, -14466, -28013, -43292, -21837, -12141, 3927, 20011, 39236, 11186, -36471, -30844, 3950, 19281, 25839, 49012, 44270, 8387, 3845, 8096, 1376, -9207, 10283, 32214, 44898, 27664, 26615, -6615, -47012, -43590, -44541, -68142, -68056, -59632, -42591, -27142, 6236, 22513, 21053, 25544, 14416, -12743, -26156, -7212]
6466g212o82j2649q705j6160p474K0087j21l282L8426Q516j2352j4215j1917k540
6452c0280J601j5326k8691J2589J8322m718J8163N3553l1333o115P939J9538K749
6439A7991l1743k4208j1327N463r96J6926n704J412J0084m513M390O447K656o781
6425a9903j9869J0870l815J5640J5042r459J3636J2150m654k1524r709j9951k0702
6412f2248K5047K372K3220N778K2402j421k6888k1403j3545j7581N682Q018o433
6399e7000n242J3688J3977O261J8427K0427r474k999R444p868j4238J3458J3674
6386A2535k5083k0717L4967K6328j202k9219j2577J5415k2789j0928M5733k3499
6374a1036J7634j23r764k5919q347Q611j1160J5591J4731Q348J860j9146q496
$$ y = [-7212, -7894, -20543, -29248, -45408, -52882, -32795, -32916, -36198, 2228, 10744, -1608, -15823, -27740, -30280, -28679, -44005, -72696, -60107, -41785, -46503, -28340, 25213, -6120, -12235, -4296, 15242, 17991, -13752, -37960, -49287, -43824, -44820, -27894, -33598, -32186, -22102, -26615, -22225, -15778, -13122, -19903, -39772, -28902, -32717, -17077, -2035, -11494, 2142, 14292, 9638, -11886, -21595, -41546, -62248, -37201, -34829, -11609, -5831, 16571, 15150, -11738, -33141, -46686, -64267, -58585, -50567, -57000, -62242, -48554, -34577, -28316, -9889, 10538, 1064, -1935, 7509, -359, -14597, -1139, 12535, -12548, -33265, 1702, 28030, 26828, -2391, -14968, 447, -22342, -33270, 12463, -11036, 6598, 6475, -3289, -29208, -37555, -28944, -40104, -24513, -9782, -1434, 426, -18720, -27216]
6361b7216m168k123j672P548L3959j7250j8582J8192J4541m974l4215j0682K5749
6348b0893K0202k0278J2340J5718j3795J0637K3093K3054P080k0041m647l1987
6336D83k6309K6595J1822j8916Q541J2118K7156m570k8816k5086l632q056K0774
6323g896J5584k422K7739J5251k1361k4262j6406L9977j1044k0840Q089O087L291
6310A1787m4431j9512J9606K0008J4444j5556J1919n012J208l5292j3950L5238
6298a9543j4106J4752Q782o254J512J5968L664k1015l451L2977M57r455l650j907
6284a269K2690m424j0693j1852J1399J6189L4302K8393M438k5035k9593R170J2810
6271E6525o474j2486k8303j711o807P678J3254k1064m055r320l748n821Q201J7362
$$ y = [-27216, -31384, -33507, -35179, -27631, 6328, -10922, -29504, -11312, 3229, -1745, -35960, -46642, -20893, -691, -20969, -8629, 7089, -6706, 3931, 27024, 50078, 57158, 37117, 32470, 483, -25826, 769, 12591, -6325, 2216, 14334, 41490, 36920, 8104, -16982, -20614, -28670, -7896, 7688, 5266, 33005, 48256, 26895, 2633, -13773, 26204, 15160, -5680, 2409, 8496, 11787, -32644, -52156, -32550, -12542, 1902, -13654, -1735, -6747, -5539, -40831, -54781, -19543, -33649, -18897, -10115, -16369, -14857, 1111, 4775, -16240, -19691, 13286, 13743, 4288, 638, -1269, 21421, 16997, 6304, -5548, 5851, 22040, 56342, 84735, 89173, 64138, 34545, 43715, 56525, 50051, 37565, 9262, 7551, 744, 8422, 21676, 612, -3443, -12763, -16511, -22332, -14131, 3231]
6257C231j342J5663j9367k9214P86K0389j0539o300k684J0157P459j1430j734
6244b4925O212N469J0699J2484m05p769J672j4982k9365J2039n312J8240J988
6231a3955l702n619L97K6529m730j9413L277J0151j5608k923K25j4593J3868j441
6217b7537J265R768j7887R182K7903r07J0061K323k3741q057p66J5036R265r389
6203c481k1161j0308j017L2058J5874k4246j0025m750P819J2954O582Q181K141
6190A0621J577k1019j8371N453J1382k2822J6478K9776K3855k1099l6245j0957
6178c1371L5286R432J084O690p965J0572K2960l083o9832j4539J5393q571l626
6165c7570K039L3049k69k5805Q591K4574J1706j4978j9190o783K8012J1258J1448
$$ y = [3231, 1889, 17552, -1815, -31029, -30243, -9854, -20393, -26693, -29377, -19220, -11761, -23191, -24925, -18713, -13244, -2545, 9939, 9534, 1765, 3437, -11545, -40910, -28871, -34183, -15943, -13955, -17657, -23276, -22879, 3650, -1080, -20493, -17216, -7065, -22673, -25596, -25371, -39964, -26096, -27537, -26272, -16504, -34391, -25209, 2694, 1787, 11848, 14171, -9570, -17627, -18393, -3357, 5908, -3481, -24642, -34950, -35967, -3909, 11965, -12281, -22306, -27056, -19237, -6283, 299, 8480, 10621, 12198, -8821, -27192, -21739, -10357, -33179, -16701, 13075, 36930, 15831, -20414, -31371, 3915, 13347, 14431, 21121, 13156, 23728, 46688, 43605, -26227, -40766, -25373, -33944, -37570, -35531, -2482, -2751, -28556, -19965, 4609, 16315, 1337, -17853, -24636, 3376, 14634, 26082]
6152B6082J7449P892k2101j9117K625q719j3737q283K7192K0262j7558m2766j5787
6139d6566J1535J3395k675J7702P050J6245J5209K3923J3585k6855k8928k0737
6127g117l908Q311J1916K0998j050j7856j1924j267O314j4717l463J6600N551
6114H388n905q93j4683k5280j5365L0236M8125L1401J1298j91n46m0701j9814
6101F070N28j796k8883k114Q597p516P978o052l1753J3105N862L996O528M43j5969
6086d0976k0834O368R569j779J2104j516L4633K5432J400m90k1316j1371R450
6073F74j2588k6158N733j502J0341Q444K629o590m458q473m660Q878K1078J4696
6059H044j1962j307J2989J2337j0148n968Q742p52j8309O53M228J3616l794k1332
$$ y = [26082, 43531, 51423, 29322, 10205, 12830, 4111, -9626, -17909, 9283, 29545, 11987, -30779, -46566, -35031, -21636, -24311, -6609, 441, 16686, 31895, 55818, 69403, 42548, 13620, -7117, -11025, -2714, 9202, 30200, 29150, 11294, -630, -1897, 4417, -10300, -13763, 2837, 8388, 2483, 1590, -13093, -38373, -53738, -23502, 24623, 56024, 67322, 67131, 66585, 25884, 6070, 6598, 4802, -24081, -26195, -17598, -25114, -17136, -23188, -54941, -41836, -35974, -31978, -25450, -25007, -40976, -61810, -55442, -45873, -47652, -35548, -37064, -2431, 23001, 24401, 23911, 2595, -8776, 674, -11914, -38072, -32339, -33841, -23500, -15056, -12427, -19017, -23475, -31948, -36608, -27730, -6652, 8044, -3918, -5225, 7764, 20101, 9953, 3985, 12727, 11975, -6334, -5681, -1453, 12163, 8369, -12963]
6045a2963j9157k842L05J281o743K581k980k058J118J0273j745m808r058j7275
6031f4071L0146J3463j694q769j7568J6424P38J2349J1342L0903j0944m0321K0454
6018g548O091J8590M009p224n111k2320N479o338m0095K1224L4615O719k1047
6005a2956q668J3778k8684j1667J7348p717M23K5390P334k884l9195l5293J0419
5992g2372K8713K2806O170k867m666j585K3043M883O551K99r528q594J7360J3097
5978B3310o268r669o824j862j2587J061k231J0861K1031m6165k8133K0348K4893
5965a2235J6417j1900k7561P877K5543p567k797j0155r338J4339j5576K2398l318
5952a3873j0378N442N161j0347q774J7229J1961J1388J2820M853p02k2571j5415
$$ y = [-12963, -32120, -34962, -34657, -33376, -40119, -37538, -40518, -42576, -41458, -31185, -32930, -37738, -46796, -64071, -33925, -20462, -22156, -30925, -48493, -32069, -31331, -18982, -7640, 23263, 12319, -28002, -7548, -1457, 17133, 21142, 13918, 8807, -13513, -8034, -14372, -54467, -33243, 1372, 8091, -12956, -21624, -7846, -36530, -48197, -30849, -38566, -38143, -12753, -5419, -8303, -47498, -82791, -72372, -43659, -20853, -14683, -17550, -22216, -23801, -758, 4125, 10676, 10975, 1447, -7147, 10213, 23310, 17042, 7373, 549, -1313, -13900, -12839, -15070, -4209, 16822, -29343, -57476, -37128, -12235, 4182, -7718, -35279, -27402, -1859, -9426, -12223, -22378, -31716, -17377, -32953, -10555, -13873, -24251, -18809, -13648, -23995, -32769, -15540, -3579, 7809, 20629, 25482, 24780, 2209, -13206]
5939a3206M943q811j9416J9978N890O251L560k2582J761K0549K4288J4958k8800
5926I363j4582n708O489l798J8330N40J9012J6809o380k3180N86R299L115n568
5912B4327j1087J5702K4594q699l178L080p219J417K0458k2240m3002o018J982
5899i883j637l186J0371K6404j0982k4240o435M2675L2528j8372m2010q966J9456
5886E723l273N656J3145j2027j7583O046r664p683J5088Q653j2350J3963J1543
5873A7237j2193l1392p816j1257J4076J9097k2748q452K236K2165K896M599J920
5860i632J7728m361O638L055K3862k2134j9074N331K3224k022r416j6889k3108
5847b6798J1377K2288J2578j6967J0583K1751M074k6929j2305j2678K589o159
$$ y = [-13206, -8263, -17074, -36490, -16512, -10622, -4371, -811, -23393, -21632, -1083, 23205, 38163, 9363, -5219, -10927, -4438, -8236, 10094, 10634, 29646, 46455, 40075, 16895, 17481, 26780, 29895, 24327, 13240, 28942, 53536, 44837, 41659, 44739, 37520, 38937, 59395, 37155, -5847, -11865, -9883, -11520, -14706, -4335, 22069, 11087, -13153, -19588, 23087, 55615, 37243, -4767, -13733, 5723, 2450, 8106, 21251, 9224, -8359, -2313, -11977, -19660, -4572, 4081, -8269, 5694, 17237, 5044, -26348, -34164, -45421, -31345, -12248, -34996, -43448, -41212, -19047, -16151, -11552, -9632, 8096, 3735, 10373, 13428, 37290, 15156, -3918, 1413, 24637, 22615, 13199, -3690, -26798, -15421, 6867, 19445, 2478, 13061, 34812, 38886, 11957, -348, -13026, -10437, -16596]
5835a6596K2832J1811o865p770J427p690J6328K5069o97J9671p663k3819k6697
5822f59M476J3369N3200p994n0094k2334m146L4283p122j5413l664l3516p198
5809d6812J861m054M288j58M20m147K7721M1709N392q929o120j0856J8983L705
5795B3003k3200R630j1550J7514q486l6933j5047j5138J332L920K2337L0851o620
5782h387l079L882j552Q272n325p487J0305J8817L24k7300n839M664k395J7106
5768B006K9303J3714p273m6256k4044J0936k0016J2448k48l234J2532K1869J1867
5755A3604j0581n550o355J9798j590p809o766K1359l761r488j6250j9882J0834
5742b2437K2327k3351j5808j8875p230K0700L6302K5300N418k2256j2983k6705
$$ y = [-16596, 6236, 18047, 11182, 3412, 4839, -2851, 13477, 38546, 37849, 57520, 49857, 26038, -659, 3817, 17186, 70386, 62392, 12298, -10036, -14182, 20101, 12979, -2434, -6098, -39614, -46812, -44951, -49005, -44717, -44875, -44455, -48602, -20881, 20828, 26220, 17291, 11171, 315, 19298, 23003, -197, 9433, -2117, 15397, 6911, -30022, -45069, -60207, -58875, -54955, -32618, -1767, -8387, -11466, -7584, -9136, -864, -6189, -13676, -3371, 15446, 15770, -11530, -17369, -12705, -15100, 2006, 31309, 45023, 37750, -8506, -32550, -21614, -41630, -29182, -29430, -32664, -20132, 1737, 13604, 3023, -2527, -8882, 10916, 9326, 1517, -5249, 16110, 12349, 2861, -13389, -33271, -22437, -110, -23461, -39269, -58144, -65374, -44674, -8372, 16928, 22346, 90, -12893, -39598]
5730c9598j7807k61J2029M7885J5667m5204l4486K2882J8208J0740q530K407P365
5717h703m994m152r39j0950L839J5378J9482K5072r655N335o696m0335J3750J4098
5703A0530j371j2790k0071J5584k332J5450j246J1250K4395L158m611Q851j2195
5690C4602M536k7999l0744R5J3802P550M804j5743L436K8543j2908l1516k616
5677b4158j0234n417K0810K8043k826j2763N553j0141j069J937J2265l3362m422
5664c5784N501L1291q650l4757M205J0851q049J8015J1360J7606J595p201j0832
5651d849j7702k874J6184L1530k0638k8718j1058L1505J422J0147K1675P574k3368
5638A0830k8858j737J2858o159J3732N863j2666m954Q08M016P449Q239r63k5585
$$ y = [-39598, -57405, -57666, -45637, 2248, 17915, -27289, -61775, -38893, -20685, -9945, -18475, -16068, -8703, -13697, -17849, -18788, -29738, -25899, -10521, 8961, 34033, 24378, 29713, 23017, -17318, -3568, 10530, 9159, -3631, -23702, -8118, -10450, 5000, 3754, 15004, 39399, 42557, 37946, 46797, 34602, 39138, 11139, -19605, -19510, -5708, 1842, 6646, -9097, -5661, 22882, 9974, -21542, -24158, -34392, -39809, -18999, 9044, 6218, -6545, -992, -11133, -12202, -10265, 2000, -31362, -35784, -30283, 1008, -7642, -42399, -38194, -27343, -35392, -17377, -6017, 11589, 13184, 5983, -4849, -22551, -25425, -9241, 22289, 1651, -27067, -38125, -6620, -5198, 4949, 26624, 34198, 10830, -18028, -19765, -6907, -13066, 666, 6529, -6137, -11091, -10283, -6267, 1182, 9421, 8458, -17127]
5624a7127q084J3286Q72L03K192o470Q761J4410j1440o651R743O334j670N568
5610A0027m290r31k7820l3064k1935K8116L8178K3630k1995j896Q625j1058n356
5597a9769O453j2520K089J4367j7241n690K8618J0318l111k5513j2339M586J3938
5584a5814J0110J2054J424J906j9892j6255J1173J5795L848J9102J1933l0066
5572E318j0546k0710k462K687o952q238j4889J3935K0272Q208o178N443J2889
5559a223J7978J2256L986l026m0385j1772J088K1710P226L8410K735o988k8507
5546A3488J1177n32J6978j1333O620q367p111J7301k275k1623k1654j128n75O581
5532b453m642j5915j2672L2754N067j6882J2261m34k3149Q57j2029L18K3501j554
$$ y = [-17127, -25211, -11925, -11053, -10750, -8558, -15028, -6267, 8143, -3297, -9948, -205, 6129, 4459, 10027, 5737, 4806, -23014, -56078, -78013, -49897, -11719, 11911, -10084, -11980, -3355, -14413, -19769, -13316, -25836, -23747, -9380, -26621, -32311, -3693, 6625, 3514, -21999, -34338, -29752, -15814, -5704, 6350, 7774, 9680, -10212, -26467, -15294, 501, 4349, 23451, 35384, 5318, -5228, -25938, -28400, -25713, -32665, -40903, -55792, -41857, -21585, -13377, -19555, -14112, -1223, 16755, 29011, 32997, 29971, -10414, -22186, -21098, 612, 7838, 46248, 48983, 41995, 13488, 24665, 24133, 41111, 29778, 36398, 28031, 20920, 38221, 35946, 14323, -7331, -8459, -9034, -2453, -7095, -23010, -35682, -2928, 2139, -14743, -2482, -2916, -26065, -25208, -37237, -36919, -13418, -14972]
5518a4972K418k337R445L307J9254m30k4570j6239j3348J0942j7173J3504j3233
5505d3432K4630K1469K6678J4220k0227l2584R032Q778O641j192j0261L905J0811
5492A8468j5758o526m870j3510O982r626j4718l17N96K8965K6310j3153m822R869
5478G890k3870Q719J9930N663l205p515j9642j0302j6551K6333K4867o19k1096
5465i398K2155L2884j2269M574j895j3710j2674l1143R574J3008K47j035l406
5452c088J9369j9489j9977K2870P420k92J340L270q292K1736P76k2377K9134l067
5438B9333q466O227J642M330J8083k177j4207n2268k7592K6019J7430l503J1370
5425F221R157j2422j1536J0205j0455J0076J9j0250J8943q597K0500K547k5993
$$ y = [-14972, -12554, -14891, -5446, -2139, 17115, 16685, -7885, -24124, -37472, -26530, -43703, -30199, -43432, -18802, 2667, 29345, 43565, 23338, -9246, -214, 8564, 15205, 14013, 3752, 7657, 18468, 2710, -3816, -8686, -22196, -15214, -24840, -39558, -39875, -39279, -10314, 15996, 2843, -1979, 7890, -15980, -7261, 12669, 18332, 15127, 7612, -12030, -22332, -38883, -12550, 12317, 11698, -9398, 12757, 45641, 33372, 37946, 36051, 22341, 9667, -21476, -11902, 1106, 1353, 318, -3088, 16281, -3208, -23185, -315, 7105, 6813, 8153, 11423, 3131, 24867, 25643, 3266, 32400, 29333, 20867, 27094, 28736, 33066, 51149, 48972, 34765, -17503, -45095, -19076, -1646, -5149, 6221, 15378, 2956, -8580, 1625, -8830, 1246, 1265, -8985, 9958, 1361, 21861, 24408, -1585]
5412a585M208K0611J6278l1340l8827J0199J9701l291k3985K19O444J4957R816
5399C405k4777O542J9235J4961n751q258L083l544j2370m4402K010K0807J8108
5386a0951J6605j2754m143k2359J3584L5292p142k2001K926L423L443Q576K576
5373G075r142k0614j7612K0385J5777Q19L3538k262k2829p352q456j8712K087
5360b7298r19O013K2543K1513j8042l443M9259q136k9397j0996J3883J213j9273
5347c080R285J1105j2307j290L053R234m392l3075p621L1793j9619j3654J1067
5334a9501P486O48J7617K6753j60M824j2809j3334j2102J1576p810m147K1204
5321B0245j083l6921Q628M4286L891j3997l2019k1538K057Q732J812p507j895
$$ y = [-1585, 2623, 23234, 39512, 8172, -30655, -20456, -755, -4046, -28031, -27812, -21368, -6411, 3405, -21372, -14830, 4405, 19366, 13615, 5357, 8440, 4896, -7474, -51876, -49866, -29059, -10951, 5654, -7100, -11243, -33602, -20018, 15274, 8132, -13869, -10943, -7520, -4077, 4499, 7075, -2067, -22681, -40293, -19908, -4131, -3312, 30226, 27964, 5135, -2217, -10673, -29385, -27298, -28217, -22204, 339, 21852, 3810, 367, 49626, 41490, 12093, 1097, 14980, 16193, -3080, 6205, 17310, 5003, 3713, 6766, 16000, 11608, -21467, -29088, 2705, -16914, -30568, -19501, -12015, -11367, 6250, 33003, 32843, 37667, 24858, 11524, -578, 10998, 3188, -959, 20245, 19162, -17759, -9131, 35155, 39046, 25049, -6970, -28508, -26451, -17719, -15907, -23414, -25309]
5308b5309K611P624k4306j657O308j6377Q485J3486J7971k581l8049J5488K7309
5295h997J7381J8708N194r678J2829k005j9364P562j5017q561o32l998L2339j3645
5281A2116k4233M614L552n083J0379j7200r225K791J0787J8853J110l580k991
5268A890n245q099k24J0104m418P711J2744j2082k2999l340K0916j1974J1633
5255c383l057o958q867j3403J4808J6131P507J0452p693k2404P913j7317m398
5242c0669J6097K7225K755k9904k1412l90k269m494J654p831R906M7393K362j3706
5228c283k1437r800k0857M683K6458J3640m115r307j820J0372K6584k7893k0349
5215c7124K299J3142n613M526r691l5704K557L0401J9271j086r791L3651J8107
$$ y = [-25309, -22698, -15074, -39380, -41037, -34729, -51106, -42621, -29135, -11164, -13745, -51794, -36306, -8997, 8384, 27092, 32286, 22608, 35437, 33432, 14068, 21630, 6613, -1948, -2580, -6578, 25761, 12116, -12117, -7503, -3951, -9034, 1345, -15855, -25080, -22289, -11502, 7351, 8461, 4881, 1890, -3355, -11454, -11678, -1574, -5992, 1719, 14463, 2381, -20618, -23958, -3042, -15016, -3383, -6440, -13398, -22265, -35668, -20860, -4729, 2778, 13230, 5537, -16867, -8954, -26271, -30669, -14572, 12653, 15408, -14496, -35908, -36298, -38567, -43061, -41407, -49238, -39332, 8061, 10423, -3283, -24720, -34520, -55377, -50694, -24236, -10596, -14711, -24018, -25838, -15466, 11118, -16775, -37124, -34825, -21683, -27296, -22770, -32461, -68165, -65608, -35207, -15936, -17022, -26813, 6838, 24945]
$$ [...]
##END NTUPLES=NMR SPECTRUM
##END=
