##TITLE=Analysis number 326341
Compound Code cc 01413
Project Code adrs
Chemist Name creative chem
##JCAMPDX= 6.0         $$ Bruker NMR JCAMP-DX V2.0
##DATA TYPE= NMR SPECTRUM
##DATA CLASS= NTUPLES
##ORIGIN= Bruker BioSpin GmbH
##OWNER= nmr
$$ XWIN-NMR		Version 3.5
$$ Fri Feb  2 11:51:57 2007 GMT Standard Time (UT+0h)  MAYBRIDGE\nmr@NMR_250MHZ
##.OBSERVE FREQUENCY= 250.131544655141
##.OBSERVE NUCLEUS= ^1H
##.ACQUISITION MODE= SIMULTANEOUS (DQD)
##.ACQUISITION SCHEME= undefined
##.AVERAGES= 16
##.DIGITISER RES= 18
##SPECTROMETER/DATA SYSTEM= dpx250
##.PULSE SEQUENCE= zg30
##.SOLVENT NAME= DMSO
##.SHIFT REFERENCE= (INTERNAL, DMSO, 0, 16.522)
##AUDIT TRAIL= $$ (NUMBER, WHEN, WHO, WHERE, WHAT)
$$ ##TITLE= Audit trail, XWIN-NMR		Version 3.5
$$ ##JCAMPDX= 5.01
$$ ##ORIGIN= Bruker BioSpin GmbH
$$ ##OWNER= nmr
$$ C:\u/data/dgb/nmr/ADRS/180/pdata/1/auditp.txt
$$ ##AUDIT TRAIL=  $$ (NUMBER, WHEN, WHO, WHERE, WHAT)
(   1,<2007-02-02 11:51:32.98 +000>,<MAYBRIDGE\nmr>,<NMR_250MHZ>,
      <created by zg, POWCHK disabled, PULCHK disabled
       configuration hash MD5:
       49 4B E0 1D 92 C2 6B 37 9F E6 65 BC 52 41 86 1D
       data hash MD5: 64K
       9B 54 C8 8D E1 A1 5A 8E 58 F4 17 D3 B5 A4 54 E6>)
(   2,<2007-02-02 11:51:46.04 +000>,<MAYBRIDGE\nmr>,<NMR_250MHZ>,
      <Start of raw data processing
       ef LB = 0.3 FT_mod = 6 PKNL = 1 SI = 32K 
       data hash MD5: 32K
       C7 1F 97 DF BE 21 93 64 F3 DD F0 EB BA 0C 1B F2>)
(   3,<2007-02-02 11:51:47.68 +000>,<MAYBRIDGE\nmr>,<NMR_250MHZ>,
      <apk 
       data hash MD5: 32K
       B2 89 DB E6 E2 89 34 18 0E 5D 7E 68 23 E8 E1 37>)
(   4,<2007-02-02 11:51:48.38 +000>,<MAYBRIDGE\nmr>,<NMR_250MHZ>,
      <abs ABSG = 5 
       data hash MD5: 32K
       47 18 69 73 B6 16 7C 82 3E 75 64 22 97 11 F2 09>)
$$ ##END=
$$ 
$$ hash MD5
$$ EC A9 6A 95 A3 C0 E1 D6 7E 7A F1 4B 37 6C A4 20
##$RELAX= 
##$RELAX= 
##$RELAX= 
##$RELAX= 
##$RELAX= 
##$RELAX= 
##$RELAX= 
$$ Bruker specific parameters
$$ --------------------------
##$DU= <C:\u>
##$EXPNO= 180
##$NAME= <ADRS>
##$PROCNO= 1
##$TYPE= <nmr>
##$USER= <dgb>
##$AMP= (0..31)
100 100 100 100 100 100 100 100 100 100 100 100 100 100 100 100 100 100 
100 100 100 100 100 100 100 100 100 100 100 100 100 100 
##$AQSEQ= 0
##$AQ_mod= 3
##$AUNM= <au_zg>
##$AUTOPOS= <52 >
##$BF1= 250.13
##$BF2= 250.13
##$BF3= 250.13
##$BF4= 250.13
##$BF5= 500.13
##$BF6= 500.13
##$BF7= 500.13
##$BF8= 500.13
##$BYTORDA= 1
##$CFDGTYP= 0
##$CFRGTYP= 5
##$CHEMSTR= <none>
##$CNST= (0..31)
1 1 145 1 1 1 1 1 1 1 1 1 1 1 1 1 1 1 1 1 1 1 1 1 1 1 1 1 1 1 1 1 
##$CPDPRG= <>
##$CPDPRG1= <>
##$CPDPRG2= <>
##$CPDPRG3= <>
##$CPDPRG4= <mlev>
##$CPDPRG5= <mlev>
##$CPDPRG6= <mlev>
##$CPDPRG7= <mlev>
##$CPDPRG8= <mlev>
##$CPDPRGB= <>
##$CPDPRGT= <>
##$D= (0..31)
0 1 0 0 0 0 0 0 0 0.06 0 0 0 0 0 0 0.0002 0 0 0 0 0 0 0 0 0 0 0 0 0 0 
0 
##$DATE= 1170417091
##$DBL= (0..7)
120 120 120 120 120 120 120 120 
##$DBP= (0..7)
150 150 150 150 150 150 150 150 
##$DBP07= 0
##$DBPNAM0= <>
##$DBPNAM1= <>
##$DBPNAM2= <>
$$ [...]
##$SUBNAM6= <"">
##$SUBNAM7= <"">
##$SUBNAM8= <"">
##$SUBNAM9= <"">
##$SW= 20.6930455092707
##$SWIBOX= (0..15)
0 0 3 0 0 0 0 0 0 0 0 0 0 0 0 0 
##$SW_h= 5175.983436853
##$TD= 65536
##$TD0= 1
##$TE= 294.16
##$TE2= 300
##$TE3= 300
##$TEG= 300
##$TL= (0..7)
0 120 120 120 120 120 120 120 
##$TP= (0..7)
150 150 150 150 150 150 150 150 
##$TP07= 0
##$TPNAME0= <>
##$TPNAME1= <>
##$TPNAME2= <>
##$TPNAME3= <>
##$TPNAME4= <>
##$TPNAME5= <>
##$TPNAME6= <>
##$TPNAME7= <>
##$TPOAL= (0..7)
0.5 0.5 0.5 0.5 0.5 0.5 0.5 0.5 
##$TPOFFS= (0..7)
0 0 0 0 0 0 0 0 
##$TUNHIN= 0
##$TUNHOUT= 0
##$TUNXOUT= 0
##$USERA1= <user>
##$USERA2= <user>
##$USERA3= <user>
##$USERA4= <user>
##$USERA5= <user>
##$V9= 5
##$VALIST= <valist>
##$VCLIST= <CCCCCCCCCCCCCCC>
##$VD= 0
##$VDLIST= <DDDDDDDDDDDDDDD>
##$VPLIST= <PPPPPPPPPPPPPPP>
##$VTLIST= <TTTTTTTTTTTTTTT>
##$WBST= 1024
##$WBSW= 4
##$XGAIN= (0..3)
0 0 0 0 
##$XL= 0
##$YL= 0
##$YMAX_a= 351650
##$YMIN_a= -443606
##$ZGOPTNS= <>
##$ZL1= 120
##$ZL2= 120
##$ZL3= 120
##$ZL4= 120
##$ABSF1= 16.522
##$ABSF2= -4.171173
##$ABSG= 5
##$ABSL= 3
##$ALPHA= 0
##$AQORDER= 0
##$ASSFAC= 0
##$ASSFACI= 0
##$ASSFACX= 0
##$ASSWID= 0
##$AUNMP= <proc_1d>
##$AZFE= 0.1
##$AZFW= 0.1
##$BCFW= 0
##$BC_mod= 0
##$BYTORDP= 0
##$COROFFS= 0
##$CY= 12.5
##$DATMOD= 1
##$DC= 0
##$DFILT= <>
##$DTYPP= 0
##$F1P= 14.0000005364418
##$F2P= -0.99999901652339
##$FCOR= 0.5
##$FTSIZE= 32768
##$FT_mod= 6
##$GAMMA= 0
##$GB= 0
##$INTBC= 1
##$INTSCL= 1
##$ISEN= 128
##$LB= 0.3
##$LEV0= 0
##$LPBIN= 0
##$MAXI= 10000
##$MC2= 0
##$MEAN= 0
##$ME_mod= 0
##$MI= 0
##$NCOEF= 0
##$NC_proc= -5
##$NLEV= 6
##$NOISF1= 0
##$NOISF2= 0
##$NSP= 0
##$NTH_PI= 0
##$NZP= 0
##$OFFSET= 16.522
##$PC= 1
##$PHC0= 220
##$PHC1= 0
##$PH_mod= 1
##$PKNL= yes
##$PPARMOD= 0
##$PSCAL= 4
##$PSIGN= 0
##$REVERSE= no
##$SF= 250.13
##$SI= 32768
##$SIGF1= 0
##$SIGF2= 0
##$SINO= 400
##$SIOLD= 32768
##$SREGLST= <1H.DMSO>
##$SSB= 0
##$STSI= 32768
##$STSR= 0
##$SW_p= 5175.98343685301
##$SYMM= 0
##$S_DEV= 0
##$TDeff= 65536
##$TDoff= 0
##$TI= <Analysis number 999999
Compound Code 99
Book Reference 9
Project Code 9>
##$TILT= no
##$TM1= 0
##$TM2= 0
##$TOPLEV= 0
##$USERP1= <user>
##$USERP2= <user>
##$USERP3= <user>
##$USERP4= <user>
##$USERP5= <user>
##$WDW= 1
##$XDIM= 32768
##$YMAX_p= 310092472
##$YMIN_p= -360842
$$ End of Bruker specific parameters
$$ ---------------------------------
##NTUPLES= NMR SPECTRUM
##VAR_NAME=  FREQUENCY,     SPECTRUM/REAL,   SPECTRUM/IMAG
##SYMBOL=    X,             R,               I
##VAR_TYPE=  INDEPENDENT,   DEPENDENT,       DEPENDENT
##VAR_FORM=  AFFN,          ASDF,            ASDF
##VAR_DIM=   32768,         32768,           32768
##UNITS=     HZ,            ARBITRARY UNITS, ARBITRARY UNITS
##FACTOR=    0.157963299565203, 1,           1
##FIRST=     4132.6476996994, 0,             0
##LAST=      -1043.33573715361, 0,           0
##MIN=       -1043.33573715361, -360842,     0
##MAX=       4132.6476996994, 310092472,     0
$$ Real data points
##PAGE= N=1
##DATA TABLE= (X++(R..R)), XYDATA
$$ [...]
22795C9176j9056O653k9639p442n2952n6981m3337j8174l7505M1618l2304n2591
$$ 39176 20120 26773 -2866 -10308 -63260 -120241 -163578 -181752 -219257 -177639 -209943 -262534
22783b62534R1327J39830l2906k1471l7810n6600O076l0363Q991L5147K9423K158
$$ -262534 -171207 -31377 -64283 -85754 -123564 -180164 -174088 -204451 -195460 -160313 -130890 -128732
22771a28732J5004n1838Q6029Q5577O6963m5576j26480J7796O6729O5408K4470
$$ -128732 -113728 -165566 -79537 6040 73003 27427 -99053 -81257 -14528 50880 75350
22760G5350p3822m3580p8408m3822K6267n0304o597n4447J32154R0354Q7067k5244
$$ 75350 1528 -42052 -120460 -164282 -138015 -188319 -194916 -249363 -117209 -26855 60212 34968
22748C4968j07931p7052j9674J4531J42152J930p536p6553K3862M4153P3121O4507
$$ 34968 -72963 -150015 -169689 -155158 -13006 -11076 -18612 -95165 -71303 -27150 45971 110478
22736A10478n5627q1568Q6109L6633k6709K8700r8554m1997P904K0913j093l7770
$$ 110478 54851 -26717 59392 96025 69316 98016 -538 -42535 -34631 -13718 -14811 -52581
22724e2581k9293m7660p857K6242m8213P1942N1456k6245n6874q4419L6793N8277
$$ -52581 -81874 -129534 -137391 -111149 -159362 -87420 -35964 -62209 -119083 -203502 -166709 -108432
22712a08432N1531L1117L0985O0939J9690q1324p8395L4897L3828J41J0568q6770
$$ -108432 -56901 -25784 5201 66140 85830 4506 -73889 -38992 -5164 -5023 5545 -81225
22700h1225p3995J2720L6609l8362M8288R940J3987k6503M7288j6751M2052O9352
$$ -81225 -155220 -142500 -105891 -144253 -95965 -86025 -72038 -98541 -51253 -68004 -25952 43400
22688D3400m9354p9873j5088o7087K2751J68663M4721k9381m4208r369K5610q6063
$$ 43400 -5954 -85827 -100915 -168002 -145251 23412 68133 38752 -5456 -14825 10785 -75278
22676g5278M67K0018K2627o4399l0877L832j520L0031P3420M4212o3361k0943
$$ -75278 -74811 -54793 -32166 -96565 -127442 -123610 -125130 -95099 -21679 22533 -40828 -61771
22664f1771k3065R3715M9691j7253k3532J2873K292M1476p2979r3877N7979m4449
$$ -61771 -84836 8879 58570 41317 17785 30658 32950 74426 1447 -92430 -34451 -78900
22652g8900J7203L678n2364l4078Q4336o8966n2178M8509Q4800R2772o1563r5322
$$ -78900 -61697 -58019 -110383 -144461 -60125 -129091 -181269 -132760 -47960 44812 -16751 -112073
22640a12073O602P3269P9380l3596j52173J5407N2122N6858J00172l9118q2934
$$ -112073 -105471 -32202 47178 13582 -138591 -123184 -71062 -14204 85968 46850 -36084
22629c6084q6548j6700L0853R2768M1774O1235K086j05809j59697l488J48009
$$ -36084 -122632 -139332 -108479 -15711 26063 87298 89384 -16425 -176122 -179610 -31601
22618c1601O3308q4492j1484n9553N0448L6109k8077L413J9595K082k196L518
$$ -31601 31707 -52785 -64269 -123822 -73374 -37265 -65342 -61929 -42334 -40252 -42448 -38930
22606c8930K2898o536l9175p9004L0100N9601R657j12849L0210P2025P3778K0019
$$ -38930 -16032 -22568 -61743 -140747 -110647 -51046 -41389 -154238 -124028 -52003 21775 41794
22594D1794j6612O2790N8366q0216j10010q5201P6996n5650P392L4062P890K5258
$$ 41794 25182 87972 146338 66122 -43888 -129089 -52093 -107743 -100351 -66289 -58399 -33141
22582c3141J4551J8889j22896K6133N8024J00929r366j34057m3251P3215N6122
$$ -33141 -18590 299 -122597 -96464 -38440 62489 53123 -80934 -124185 -50970 5152
22571E152J9755n5697q5767j3899Q910N1396J10841M8185n3359j66795j01240
$$ 5152 24907 -30790 -116557 -130456 -121546 -70150 40691 88876 35517 -131278 -232518
22560b32518O9035J07568r334l776M2736J7671P9457L282n5554l7561m3953M4169
$$ -232518 -163483 -55915 -65249 -69025 -26289 -8618 70839 74121 18567 -18994 -62947 -18778
22548a8778J3056m9309m4683l9507J9202n2728Q4762J62820n3338j54354K7533
$$ -18778 -5722 -55031 -99714 -139221 -120019 -172747 -87985 74835 21497 -132857 -105324
22537a05324m3303n8147J02952J05919k314l4528r855l3077j1428M034n4270o3308
$$ -105324 -148627 -206774 -103822 2097 -217 -34745 -44600 -77677 -89105 -85071 -139341 -202649
22525b02649N0798R415R319J8189n868J0N0128l4913n4779L023J7596j7815j2347
$$ -202649 -151851 -142436 -133117 -114928 -120796 -120786 -70658 -105571 -160350 -157327 -139731 -157546 -169893
22512a69893J1627k5178O0894O0868r0379R3691l2370L8020j1743n114P853k5478
$$ -169893 -158266 -183444 -122550 -61682 -152061 -58370 -90740 -52720 -64463 -69577 -61724 -87202
22500h7202K5437J0414o561j0335Q150K9141J5945K8455o7458K1654M2686j30013
$$ -87202 -61765 -51351 -57912 -68247 -60097 -30956 -15011 13444 -54014 -32360 10326 -119687
22488a19687n6480J04561M6179k2803p7816r1877N7811Q3146M3598n0827k2445
$$ -119687 -176167 -71606 -25427 -48230 -126046 -217923 -160112 -76966 -33368 -84195 -106640
22477a06640P338N3222M2906p159q2375n1827Q1747o1746k6657P3995K3298n2403
$$ -106640 -99302 -46080 -3174 -10333 -92708 -144535 -62788 -124534 -151191 -77196 -53898 -106301
22465a06301n2827N1086j2240k3863K9351L8960P1404q8529J5443J26378j4140
$$ -106301 -159128 -108042 -120282 -144145 -114794 -75834 -4430 -92959 -77516 48862 34722
22454C4722j58441r2851L1894K1462N0302J05315K7733r9664j16580j04283Q4822
$$ 34722 -123719 -216570 -184676 -163214 -112912 -7597 20136 -79528 -196108 -300391 -215569
22443b15569R1415L4914J08393M758l8821n9465M8939k5114j80576j03496Q8868
$$ -215569 -124154 -89240 19153 23911 -14910 -74375 -25436 -50550 -231126 -334622 -245754
22432b45754R148L1497J40608N6869k5638n9505j13593j1454N3014R1925Q8830
$$ -245754 -236606 -205109 -64501 -7632 -33270 -92775 -206368 -217822 -164808 -72883 15947
22421A5947l2327O056K152J587O034J0260O1888j25403j7714P7681j6229k0111
$$ 15947 -16380 -10324 -8172 -6585 -551 9709 71597 -53806 -71520 6161 -10068 -30179
22409c0179k0112p1359O326L0184M2306j3175j0729j9865l7587R6271J5301n8563
$$ -30179 -50291 -121650 -115324 -85140 -42834 -56009 -66738 -86603 -124190 -27919 -12618 -71181
22397g1181r8504j5545L46K5794M1014L8187O1278j2884m3898j16822J61112J02546
$$ -71181 -169685 -185230 -184884 -159090 -118076 -79889 -18611 -31495 -75393 -192215 -31103 71443
22385G1443N4382l2454J4540O3500M8070j91764k4051K1434q8806J6730R5642
$$ 71443 125825 93371 107911 171411 219481 27717 3666 25100 -63706 -46976 48666
22374D8666M9425p2680r5525N274J9886J0454l292k3950O6238r3149p6200K5437
$$ 48666 98091 25411 -70114 -64840 -44954 -34500 -37792 -61742 4496 -88653 -164853 -139416
22362a39416M9058J03320j06762j34235k4703R7595J49442R6006P16j09371j07737
$$ -139416 -90358 12962 -93800 -228035 -252738 -155143 -5701 90305 91021 -18350 -126087
22351a26087l4005l364Q986m652J39658P3666L9067n3205j15684Q3011M1627j03556
$$ -126087 -160092 -163456 -154470 -159122 -19464 54202 93269 40064 -75620 7391 49018 -54538
22339e4538L5156R936n0573p7623N0228k379q5999M3327L0672l7207r878K0665
$$ -54538 -19382 -9446 -60019 -137642 -87414 -89793 -175792 -132465 -101793 -139000 -148878 -128213
22327a28213J11526N8116n7045j13059j7854l2303J07909N3955L7482o2867M4490
$$ -128213 -16687 41429 -15616 -128675 -146529 -178832 -70923 -16968 20514 -42353 2137
22316B137J9514m5385M0906k3770o1205q55K3958M007M862m592n1675q644j2094
$$ 2137 21651 -23734 17172 -6598 -67803 -68658 -44700 -40693 -35831 -40423 -92098 -100742 -112836
22303a12836J22791J9795o7544l1292l6190k1523o5288l2937n532N3406Q8132
$$ -112836 9955 29750 -37794 -69086 -105276 -126799 -192087 -225024 -230556 -177150 -89018
22292h9018O1653K0570N369j06211r2407O7156J23317p8504M2583n0577j1524
$$ -89018 -27365 -6795 -1426 -107637 -200044 -132888 -9571 -88075 -45492 -96069 -107593
22281a07593M14K0429P8657Q569n9048o8503q1846j04554K3764J12154J23453
$$ -107593 -107179 -86750 -8093 476 -58572 -127075 -208921 -313475 -289711 -177557 -54104
22270e4104p7235q4894N8073O3680K5420l2453k6891R8169K4790N0104m1271r0055
$$ -54104 -131339 -216233 -158160 -94480 -69060 -101513 -128404 -30235 -5445 44659 3388 -86667
22258h6667K5536l1107k2185J5987p0325L5654J5903j08635K6887M1799O2476
$$ -86667 -61131 -92238 -114423 -98436 -168761 -133107 -117204 -225839 -198952 -157153 -94677
22247i4677M9840k9938k3829r2354m5105J00602K8671Q3414m1366q8591o2239
$$ -94677 -44837 -74775 -98604 -190958 -236063 -135461 -106790 -23376 -64742 -153333 -215572
22236b15572P4213j7287N0324l0198K8214P6222P5546r2957j9848P5798o4626
$$ -215572 -141359 -158646 -108322 -138520 -110306 -34084 41462 -51495 -71343 4455 -60171
22225f0171o7974j8557k6395L3344Q4660N5857M0807j9090q3110j0376M9264m2441
$$ -60171 -128145 -146702 -173097 -139753 -55093 764 41571 22481 -60629 -71005 -21741 -64182
22213f4182J4061N2288Q2703J4096k0310r9699j7787n2774k9435P3471k4376k500
$$ -64182 -50121 2167 84870 98966 78656 -21043 -38830 -91604 -121039 -47568 -71944 -74444
22201g4444n003O2000R2837P7972K9819j51958j01677j1028p012k7160M0904k3815
$$ -74444 -79447 -17447 75390 153362 183181 31223 -70454 -81482 -88494 -115654 -74750 -98565
22189i8565r9m14J2685R9322k7814l846M4886J5507L5098j40613r2652J8513K6715
$$ -98565 -98664 -99078 -86393 12929 -14885 -18731 26155 41662 76760 -63853 -156505 -137992 -111277
22176a11277n1248M1719M7345Q5800j7028m7650L9428P0923K631j40771n6407
$$ -111277 -162525 -120806 -73461 12339 -4689 -52339 -12911 58012 60643 -80128 -136535
22165a36535M1178M7145k4549q4981P6685M6416m5110m2147N5651J740k5412j18647
$$ -136535 -95357 -48212 -72761 -157742 -81057 -34641 -79751 -121898 -66247 -64507 -89919 -208566
22153b08566n182N4959k9793J9158K6579K1975K9067L2559K4621r7233j02609
$$ -208566 -213748 -158789 -188582 -169424 -142845 -120870 -91803 -59244 -34623 -131856 -234465
22142b34465p3500J47958M5770R084k9840k6308J1870P496J7496R224p720l0939
$$ -234465 -307965 -160007 -114237 -105153 -134993 -161301 -149431 -141935 -124439 -115215 -122935 -153874
22130a53874J4542K1797n6608r2700q8711L9373J62220J25570L1661m4255O660
$$ -153874 -139332 -117535 -174143 -266843 -355554 -316181 -153961 -28391 3270 -40985 -34325
22119c4325N9840j7095m2764K1133j11422j29159M081M6424P1285l0468j3147
$$ -34325 25515 8420 -34344 -13211 -124633 -253792 -249711 -203287 -132002 -162470 -175617
22108a75617M457L01m0572O6863J30589k4070N523P6495L6085J6067j02655k237
$$ -175617 -171160 -170859 -211431 -144568 -13979 -38049 -32526 43969 80054 96121 -6534 -8771
22096h771M1162Q86m7521R239J1114q7929J1272J03170J19804j0840p0193l0606
$$ -8771 32391 33277 -14244 -5005 6109 -81820 -70548 32622 152426 141586 71393 40787
22084D0787o4235J2169o7870r4835M5159M3812m7486n9993j3003L6514L3001k9607
$$ 40787 -23448 -11279 -79149 -173984 -128825 -85013 -132499 -192492 -205495 -168981 -135980 -165587
22072a65587N225K8670J1885M3013N254q1141j14816Q0732J49803m300j8497m9637
$$ -165587 -160362 -131692 -119807 -76794 -71540 -152681 -267497 -186765 -36962 -41262 -59759 -109396
22060a09396j46061K745L4717K9080k5508M0323N9944M4733j8640m9480o4971
$$ -109396 -255457 -252712 -217995 -188915 -214423 -174100 -114156 -69423 -88063 -137543 -202514
22049b02514J2879Q1062O7695P1627l4224M3937N1999l0142o153j1303j5225R347
$$ -202514 -189635 -108573 -40878 30749 -3475 40462 92461 62319 56166 44863 29638 38985
22037C8985m7150N2795l8542n8983J2937Q690J3478K3321n1863o5338L0871Q6278
$$ 38985 -8165 44630 6088 -52895 -39958 -31268 -17790 5531 -46332 -111670 -80799 5479
22025E479J03894k1597q8957J2480J05481M8071j6557l3771l2276m3830o3662
$$ 5479 109373 87776 -1181 11299 116780 164851 148294 114523 82247 38417 -25245
22014b5245k00363j7667J36095J23419n7820n9588J468M4426j5770m928L6985
$$ -25245 -225608 -243275 -107180 16239 -41581 -101169 -99701 -55275 -71045 -75973 -38988
22003c8988m0916l5792N0463M8834l908n0984l1844m0797M4180M6839Q4149L3579
$$ -38988 -79904 -115696 -65233 -16399 -20307 -71291 -103135 -143932 -99752 -52913 31236 64815
21991F4815j45087k5244n992r2145K4901R5273k9895n2417k9015P5901P2825P090
$$ 64815 -80272 -105516 -111508 -203653 -178752 -83479 -113374 -165791 -194806 -118905 -46080 -38990
21979c8990p8312r6932q3952o502J29418K8923P8398j00785O9235J03350R83J1686
$$ -38990 -117302 -214234 -298186 -304688 -175270 -146347 -67949 -168734 -99499 3851 4834 16520
21967A6520J991j1829j63517K7229Q8735l4233j04402L6350N7522j2346n473j6506
$$ 16520 18511 6682 -156835 -129606 -40871 -75104 -179506 -143156 -85634 -97980 -103453 -119959
21955a19959N6784k3246Q8615P7271P3601j57011j17823J4666M3928R2579j0089
$$ -119959 -63175 -86421 2194 79465 153066 -3945 -121768 -107102 -63174 29405 19316
21944A9316o633n7985r4465p801P8913r4586n0582L7009M3565J25961J2085J934
$$ 19316 12683 -45302 -139767 -147568 -68655 -163241 -213823 -176814 -133249 -7288 4797 6731
21932F731J5704p9188J488j2772p7761L8272N5783j9437J6644J8036L0146J4424
$$ 6731 22435 -56753 -55265 -68037 -145798 -107526 -51743 -71180 -54536 -36500 -6354 8070
21920H070j13314r3523K9305j1569Q0717M4228M2541K6803m2381k3321Q868l9515
$$ 8070 -105244 -198767 -169462 -181031 -100314 -56086 -13545 13258 -29123 -52444 -43576 -83091
21908h3091K8585L7479l0641l4386Q4788N3177k384m3116k7k2962K892j7206m8863
$$ -83091 -54506 -17027 -47668 -82054 2734 55911 53527 10411 10384 -12578 -9686 -26892 -75755
21895g5755o3400M5604Q506k838P621j404j00854j9415n5483N1405K8004K633
$$ -75755 -139155 -93551 -85045 -87883 -80262 -81666 -182520 -201935 -257418 -206013 -178009 -175376
21883a75376J5679K7897L2402M4630K5278j2989m8887n2529o7469l7054R8k5056
$$ -175376 -159697 -131800 -99398 -54768 -29490 -42479 -91366 -143895 -211364 -248418 -248320 -273376
21871b73376J13040J05084n3011r1823N1294Q7068m0651k7000K9295K1302Q861
$$ -273376 -160336 -55252 -108263 -200086 -148792 -61724 -102375 -129375 -100080 -78778 -69917
21860f9917j5115n5555Q0610j4216n5374m3189J7603P7887N3714l7639L1000J1555
$$ -69917 -85032 -140587 -59977 -74193 -129567 -172756 -155153 -77266 -23552 -61191 -30191 -18636
21848a8636N0496k8566O999l4815r7305j04531P1589J13489J04756P663r8937
$$ -18636 31860 3294 10293 -24522 -121827 -226358 -154769 -41280 63476 71139 -27798
21837b7798p903K5111O9360o6100j25601l1549r868j01640k1295L4165N1513J020
$$ -27798 -35701 -10590 58770 -7330 -132931 -164480 -174348 -275988 -297283 -263118 -211605 -210585
21825b10585J79874P2570k6925n0991m8412M869M5097l2406J1215Q4004K0086
$$ -210585 -30711 41859 14934 -36057 -84469 -79600 -34503 -66909 -55694 28310 48396
21814D8396n7918K1286j3324o9964L2950O2837L2210M6258o9405j23580K5800
$$ 48396 -9522 11764 -1560 -71524 -38574 24263 56473 102731 33326 -90254 -64454
21803f4454N1791K6187j01073K9790P352r7256m3548L0700Q0070M2905r532q4225
$$ -64454 -12663 13524 -87549 -57759 -50407 -147663 -191211 -160511 -80441 -37536 -47068 -131293
21791a31293K3091q0626M3252R2656p8869P7654K5516m2985l985J52L92p4674
$$ -131293 -108202 -188828 -145576 -52920 -131789 -54135 -28619 -71604 -75589 -75437 -75045 -149719
21779a49719l5511M4762J36944J1155p7788q9429J7244N0170L2783j770n1503
$$ -149719 -185230 -140468 -3524 7631 -70157 -159586 -142342 -92172 -59389 -61159 -112662
21768a12662O6345L4554J2915M6855k5496r7275p5991l1141n540J23947J25048
$$ -112662 -46317 -11763 1152 48007 22511 -74764 -150755 -181896 -187436 -63489 61559
21757F1559n6906q8197j1832M7813l5194n9798k972K0964O9507m1137K4099p8352
$$ 61559 4653 -83544 -95376 -47563 -82757 -142555 -145527 -124563 -55056 -96193 -72094 -150446
21745a50446n4761J3988N7696K7658J2894N9204l2540J2716J0947L3439k567l5675
$$ -150446 -205207 -191219 -133523 -105865 -92971 -33767 -66307 -53591 -42644 -9205 -11772 -47447
21733d7447m5151m2634P3874P4025Q5279M4833o3839o4168L5664K666j13569p219
$$ -47447 -92598 -135232 -61358 12667 97946 142779 78940 14772 50436 53102 -60467 -67686
21721f7686l6270K4843P7353Q3326Q2087o9816k861m2573o2960J7408J3480j7647
$$ -67686 -103956 -79113 -1760 81566 163653 93837 90976 48403 -14557 2851 16331 -1316
21709a316n5277j46293p9133K2798N8279K8577j8270l4553K6595N6206N3067L0133
$$ -1316 -56593 -202886 -282019 -259221 -200942 -172365 -190635 -225188 -198593 -142387 -89320 -59187
21697e9187q6747p6291J1709J7301M7887J2350n6880o25J8205Q8489l9737j9046
$$ -59187 -145934 -222225 -210516 -193215 -145328 -132978 -189858 -190483 -172278 -83789 -123526 -142572
21685a42572K7295P7334J1879j41244m7903L4842l3045K2859J37513k6764O001
$$ -142572 -115277 -37943 -26064 -167308 -215211 -180369 -213414 -190555 -53042 -79806 -73805
21674g3805M7144n6026N29K2347n627P920N596n460j5308R5939P4535k0683j2869
$$ -73805 -26661 -82687 -82158 -59811 -65438 -57518 -51922 -57382 -72690 23249 97784 77101 64232
21661F4232l2951j17155l7819J7317p5605m0946P10N932K2269J34598Q350l5724
$$ 64232 31281 -85874 -123693 -106376 -181981 -222927 -222217 -216285 -194016 -59418 -51068 -86792
21649h6792j5161L8293P599r2681N6810J3775l0748m2997M6957l234m6403O7155
$$ -86792 -101953 -63660 -56061 -148742 -91932 -78157 -108905 -151902 -104945 -108179 -154582 -87427
21637h7427J17576m1515q4372q0898K9106j5494K1129l1516J3453l5777o5684
$$ -87427 30149 -11366 -95738 -176636 -147530 -163024 -141895 -173411 -159958 -195735 -261419
21626b61419K4870k6822Q559M5967j8792L6207J4493k0781m0408O6266R4169J2983
$$ -261419 -236549 -263371 -254812 -208845 -227637 -191430 -176937 -197718 -238126 -171860 -77691 -64708
21614f4708j38448M267l7460J3833J854j084R577N5219O9562J0789o070l8673
$$ -64708 -203156 -198889 -236349 -222516 -220662 -221746 -212169 -156950 -87388 -76599 -82669 -121342
21602a21342n5888L4180m5528L8760m2173J6030n824M4807r671M6188o152p1745
$$ -121342 -177230 -143050 -188578 -149818 -191991 -175961 -181785 -136978 -146649 -100461 -106613 -178358
21590a78358J3810N4897L0413k0469J27169N2967q4531L4324j03703j8268J7141
$$ -178358 -164548 -109651 -79238 -99707 27462 80429 -4102 30222 -73481 -91749 -74608
21579g4608o1035q5751J6847J56298L6448n6075l1545N4526K1312N0873q8507
$$ -74608 -135643 -221394 -204547 -48249 -11801 -67876 -99421 -44895 -23583 27290 -61217
21568f1217K0554J8929P993n4138r0874n1346K0271K5601M8171P7914J8037j7695
$$ -61217 -40663 -21734 -13741 -67879 -158753 -210099 -189828 -164227 -116056 -38142 -20105 -37800
21556c7800r1836l3033M1637j8627j3205N6914L9446l1961N0415l1701o7140j7338
$$ -37800 -129636 -162669 -121032 -139659 -152864 -95950 -56504 -88465 -38050 -69751 -136891 -154229
21544a54229L4110l3022j2451M2429M7687J18645P0196q2986m9248L4956j9405
$$ -154229 -120119 -153141 -165592 -123163 -75476 43169 113365 30379 -18869 16087 -3318
21533c318n3755k6907k8708L9396n6556N4283l5168L163K3529Q816p0938j00668
$$ -3318 -57073 -83980 -112688 -73292 -129848 -75565 -110733 -107570 -84041 -75225 -146163 -246831
21521b46831M5347L5915N9582P8156q7263K6402O2360N564o3170j8647l4847m0649
$$ -246831 -201484 -165569 -105987 -27831 -115094 -88692 -26332 -20768 -83938 -102585 -137432 -178081
21509a78081P7260J11355n5665M2112J6517q4657J7573L846o1653n2664N767K723
$$ -178081 -100821 10534 -45131 -3019 13498 -71159 -53586 -49740 -111393 -164057 -158290 -155567
21497a55567K4755j9350n5652j1687j1909J9993J8043L689r3389M541K7367J32122
$$ -155567 -130812 -150162 -205814 -217501 -229410 -209417 -191374 -187685 -281074 -276533 -249166 -117044
21485a17044L5870j5286K5866M0041j9987l3435m8721M6424n4741M9242N020q6715
$$ -117044 -81174 -96460 -70594 -30553 -50540 -83975 -132696 -86272 -141013 -91771 -86751 -173466
21473a73466o0088M3488J2207n744m11r744o600K0395P8347p4017J1038P4757
$$ -173466 -233554 -190066 -177859 -183603 -184014 -193758 -200358 -179963 -101616 -175633 -164595 -89838
21461h9838j5310O3283k0413K4767l1452l5853l4970m914O6839r532l7454N6933
$$ -89838 -105148 -41865 -62278 -37511 -68963 -104816 -139786 -144700 -77861 -87393 -124847 -67914
21449f7914R2464l0729L1789L6431r9923o2821M9805O1084n2625M4723K4751r7107
$$ -67914 24550 -6179 25610 62041 -37882 -100703 -50898 10186 -42439 2284 27035 -70072
21437g0072J1644J7817k771l8529j12974J6820L0718J6201K576q1629N722K7201
$$ -70072 -58428 -40611 -43382 -81911 -194885 -178065 -147347 -131146 -128570 -210199 -204477 -177276
21425a77276m8720Q2936J27071r2557k385J22340L9809q554q5238m5709o2819
$$ -177276 -225996 -143060 -15989 -108546 -110931 11409 51218 42664 -42574 -88283 -151102
21414a51102j3230R390M0732L2746J7374k3549p3892J06253O2766p2174j31126
$$ -151102 -164332 -154942 -114210 -81464 -64090 -87639 -161531 -55278 7488 -64686 -195812
21403a95812K455K3898K9329O0590M2657M436l6876J3158q785j1429L8094j1l2950
$$ -195812 -193357 -169459 -140130 -79540 -36883 -32447 -69323 -56165 -64950 -76379 -38285 -38296 -71246
21390g1246L5098J6894p1234K5457j3342l0471J09507m41n718o6533m7447L1470
$$ -71246 -36148 -19254 -90488 -65031 -78373 -108844 663 222 -5496 -72029 -119476 -88006
21378h8006J2291M8923J8647Q820m3415J2664l710k7233Q8320n9696R588J2172
$$ -88006 -75715 -26792 -8145 675 -42740 -30076 -33786 -61019 27301 -32395 -22807 -10635
21366a0635n0749J17837J950L5969l4361n6118q4189P3549N3961q182o2466m9259
$$ -10635 -61384 56453 58403 94372 60011 3893 -80296 -6747 47214 39032 -23434 -72693
21354g2693N6725j6263n4270l331q430m4122n9915P8941J18844P8966m6169n0213
$$ -72693 -15968 -32231 -86501 -89832 -98262 -142384 -202299 -123358 -4514 74452 28283 -21930
21342b1930j0954j6266K5896O4044O7233r2996j05659r1198L3079J1234j2462
$$ -21930 -32884 -49150 -23254 40790 108023 15027 -90632 -181830 -148751 -137517 -149979
21331a49979M9850K574p3926P4810N3194k3984o7656R395L8820P4136L1456j2969
$$ -149979 -100129 -97555 -171481 -96671 -43477 -67461 -135117 -125722 -86902 -12766 18690 5721
21319E721K6764l7855l6687n9476k4038n4795j453N6831J27308j2235l2414k002
$$ 5721 32485 -5370 -42057 -101533 -125571 -180366 -181819 -124988 2320 -9915 -42329 -44331
21307d4331N541p7637N0293P3566p1933m871J5140l4170M0456k4773K5953L5727
$$ -44331 -38790 -116427 -66134 7432 -64501 -69372 -54232 -88402 -47946 -72719 -46766 -11039
21295a1039L269J9704q157l4181L7625m2427n505j8909k4482o3234m963O791Q4086
$$ -11039 -7770 11934 3777 -30404 7221 -35206 -40711 -59620 -84102 -147336 -152299 -145508 -61422
21282f1422O0699l6769K8213R9865R0q623M4071m0699q5000J410m2375L621N707
$$ -61422 -723 -37492 -9279 90586 90676 82053 126124 85425 425 1835 -40540 -36919 -31212
21269c1212n9135j7928r340K8329J0118M9669O0882k1236o2700m8118m5745o3105
$$ -31212 -90347 -108275 -117615 -89286 -79168 -29499 31383 10147 -52553 -100671 -146416 -209521
21257b09521J8603J06338O0908M4951o6002k8716q018n6619J9716j6291M3492
$$ -209521 -190918 -84580 -23672 21279 -44723 -73439 -81457 -138076 -118360 -134651 -91159
21246i1159N0338J00980J140n6357K0204j0457n726l6191J0879k6455J7866P3934
$$ -91159 -40821 60159 61299 4942 25146 14689 8963 -27228 -16349 -42804 -24938 48996
21234D8996j11608o4168M8090K0247j2615J5729O5550L8374o7339j4960k6962
$$ 48996 -62612 -126780 -78690 -58443 -71058 -55329 10221 48595 -18744 -33704 -60666
21223f0666J7663R339L2645k0272j18835Q5867J9785l2995K8813N1659K3760o0211
$$ -60666 -43003 -33664 -1019 -21291 -140126 -54259 -34474 -67469 -38656 13003 36763 -23448
21211b3448N944m8654o2530j9037l8126j25241O7874J06536l6674n924N3235J27875
$$ -23448 -17504 -66158 -128688 -147725 -185851 -311092 -243218 -136682 -173356 -179280 -126045 1830
21199A830j5063j2659L7244k9495o5287p0530L2141j6751k8195m4178p5142N5977
$$ 1830 -13233 -25892 11352 -18143 -83430 -153960 -121819 -138570 -166765 -210943 -286085 -230108
21187b30108N0326o9262M6031j529p053K2405P6450j5945l263Q382k9511K7524
$$ -230108 -179782 -249044 -203013 -204542 -211595 -189190 -112740 -128685 -131948 -123566 -153077 -125553
21175a25553J1528M6691J01013j2462r8213p7424M618J168J7775K7943q380J0857
$$ -125553 -114025 -67334 33679 21217 -76996 -154420 -149802 -148634 -130859 -102916 -111296 -100439
21163a00439N2437j3648n4158l0583M5435J08455J09546K4691o3818l2473k5578
$$ -100439 -48002 -61650 -115808 -146391 -100956 7499 117045 141736 77918 45445 19867
21152A9867o5749O846P4552Q6968k2106j11799n1765k319l6752q9119K7101P173
$$ 19867 -45882 -39036 35516 122484 100378 -11421 -63186 -65505 -102257 -191376 -164275 -157102
21140a57102j4394R4269Q3880M9715K2272m9464P055j5665k265p2285p3968J4621
$$ -157102 -171496 -77227 6653 56368 78640 29176 36231 20566 18301 -53984 -127952 -113331
21128a13331n4469p861J79905J16356K3559k0754q5942j04900k2692K3874K013
$$ -113331 -167800 -175661 4244 120600 144159 123405 37463 -67437 -90129 -66255 -64242
21117f4242M8274j05282q751R365P7056L1608k0521Q8060J0056m6453p3957j11473
$$ -64242 -15968 -121250 -130001 -120636 -43580 -11972 -32493 55567 65623 19170 -54787 -166260
21105a66260k3033m5228K7251P118p284N279O6465N2308P6684j2245m1331n1218
$$ -166260 -189293 -234521 -207270 -200152 -207436 -202157 -135692 -83384 -6700 -18945 -60276 -111494
21093a11494k1481J18532j0691K3884n508R208K5229r7794r9918M5806J9125l3972
$$ -111494 -132975 -14443 -25134 -1250 -6758 2450 27679 -70115 -170033 -124227 -105102 -139074
21081a39074J2249M0464P7015k3026P9315M9165n1434K1180p9236p5715q4283
$$ -139074 -126825 -86361 -9346 -32372 46943 96108 44674 65854 -13382 -89097 -173380
21070a73380l1200l1660J74220J22228k3529o0782m4267Q536K8180k0197j1851
$$ -173380 -204580 -236240 -62020 60208 36679 -24103 -68370 -59834 -31654 -51851 -63702
21059f3702N0049l2909j5664k9275J8019j693J5239J01288J17330j08922j53372
$$ -63702 -13653 -46562 -62226 -91501 -73482 -75175 -59936 41352 158682 49760 -103612
21048a03612L7343K874J8505j04947n0376J457J336K7716n534N6909P1857J9980
$$ -103612 -66269 -63395 -44890 -149837 -200213 -198756 -197420 -169704 -175238 -118329 -46472 -26492
21036b6492N2271k0180L6957o5723r8383j6952R4974J11761P645o7523l950M3959
$$ -26492 25779 5599 42556 -23167 -121550 -138502 -43528 68233 75878 8355 4405 48364
21024D8364N0360N607J588k0857m2615j19027o9926M2786J37796L1891j3192m5355
$$ 48364 98724 104331 105919 85062 42447 -76580 -146506 -103720 34076 65967 52775 7420
21012G420n6224j08720l8701R3090J03740j3036o8125l6315m8344N0884N2856
$$ 7420 -48804 -157524 -196225 -103135 605 -12431 -80556 -116871 -165215 -114331 -61475
21001f1475M563L1813Q298Q113L6052p0136n6159K7260k2416m138K554R1042j03340
$$ -61475 -56912 -25099 -16801 -8688 27364 -42772 -98931 -71671 -94087 -98225 -95671 -4629 -107969
20988a07969L2675M0965K266P3654o0981j24392Q8507L1868l7374k2954j6078
$$ -107969 -75294 -34329 -32063 41591 -19390 -143782 -55275 -23407 -60781 -83735 -99813
20977i9813J00249J6166P3273K5987J12791n6981j01388j06221p2143r628P7420
$$ -99813 436 16602 89875 115862 228653 171672 70284 -35937 -108080 -117708 -40288
20966d0288K4029p3854n2538R725L6651L1254N3241n940L7069M3359j3984j697
$$ -40288 -16259 -90113 -142651 -132926 -96275 -65021 -11780 -17720 19349 62708 48724 47027
20954D7027q834o4948j0095K1154n3856k5455k7362J4500P1732J08336L8427q7260
$$ 47027 38193 -26755 -36850 -15696 -69552 -95007 -122369 -107869 -36137 72199 110626 23366
20942B3366o8694K2078o5022J1539J07041m1154j56299o0501K4876K0953J14378
$$ 23366 -45328 -23250 -88272 -76733 30308 -10846 -167145 -227646 -202770 -181817 -67439
20931f7439P6848J8060j6445o7713L5109J42435L2143q4583l3642j03586n1192
$$ -67439 9409 27469 11024 -56689 -21580 120855 152998 68415 34773 -68813 -120005
20920a20005J146K3353l5327j9237M0945p63J2013J5914M0888L9494K9522j0893
$$ -120005 -118859 -95506 -130833 -150070 -109125 -109888 -97875 -81961 -41073 -1579 27943 17050
20908A7050K710K1577J1614n5172j35835q8372R5202N8051J9346n4138N0057P5435
$$ 17050 19760 41337 52951 -2221 -138056 -226428 -131226 -73175 -53829 -107967 -57910 17525
20896A7525K5547n4833j804o906M1100n4942j7901q7134n2907L6249j2328O2740
$$ 17525 43072 -11761 -13565 -20471 20629 -34313 -52214 -139348 -192255 -156006 -168334 -105594
20884a05594n569K608Q8162P6999L4902l4912m8086k4043j384k4285n3102n1938
$$ -105594 -111163 -108555 -20393 56606 91508 56596 8510 -15533 -16917 -41202 -94304 -146242
20872a46242J2325P2433j2456m744M9801k2676R89J41074O7612J1433M5021j59121
$$ -146242 -133917 -61484 -73940 -78684 -28883 -51559 -50570 90504 158116 169549 214570 55449
20860E5449j21836O6356K5254r2256L8103N7399N5462K5291p9645j600M5614k4490
$$ 55449 -66387 -31 25223 -67033 -28930 28469 83931 109222 29577 27977 73591 49101
20848D9101n8563p6985k6982J6876O1214l7757J232n8221N6023J50420n6784j20994
$$ 49101 -9462 -86447 -113429 -96553 -35339 -73096 -71864 -130085 -74062 76358 19574 -101420
20836a01420m0284J09630M7651N0802Q969k7501p9813P143M9813O182n7318j9283
$$ -101420 -141704 -32074 15577 66379 75348 47847 -31966 -24823 24990 31172 -26146 -45429
20824d5429L2792K622o9506M080J19317j4076j7787M7902n2048P3935n8135k1563
$$ -45429 -12637 -10015 -79521 -75441 43876 29800 12013 59915 7867 81802 23667 2104
20812B104J6186l343j8196r7171m5032J00523L4581k8729m7096P391K4395R5155
$$ 2104 18290 14947 -3249 -100420 -145452 -44929 -10348 -39077 -86173 -78782 -54387 40768
20800D0768O2848K3428m0096o3778q5060j6403j0624P1918M1073J05140j5843
$$ 40768 103616 127044 86948 23170 -61890 -78293 -88917 -16999 24074 129214 113371
20789A13371O4932j7187m1980l8927r027L9947l4369K4302k1656k1232J298N5272
$$ 113371 178303 161116 119136 80209 71182 111129 76760 101062 79406 58174 59472 114744
20777A14744l3492L8863N1786l9860m8448J1870j5341j9701l8483n0930L3463
$$ 114744 81252 120115 171901 132041 83593 95463 80122 60421 21938 -28992 4471
20766D471l3914N8989J3759o0646L4551M0292O8290L1134o5821n8882J27418O9330
$$ 4471 -29443 29546 43305 -17341 17210 57502 125792 156926 91105 32223 159641 228971
20754B28971n9305j42923j41485R8k3403n2893Q0372J53086L9312k5026j44548
$$ 228971 169666 26743 -114742 -114644 -138047 -190940 -110568 42518 81830 56804 -87744
20743h7744m0646R4275O1757O6366J2964N842k6411p4428L1185R132n5275J6561
$$ -87744 -128390 -34115 27642 94008 106972 112814 86403 11975 43160 52292 -2983 13578
20731A3578j2227q8770l0135M6162J7696q014J6238J14501Q6863J2412m9040p4937
$$ 13578 1351 -87419 -117554 -71392 -53696 -61710 -45472 69029 155892 168304 119264 44327
20719D4327J4637j3365M6309M1627J2687r1741k2519J5518M0084L7404o340j02329
$$ 44327 58964 45599 91908 133535 146222 54481 31962 47480 87564 124968 118628 16299
20707A6299q5565J7286Q6020N8164n7799k5101M9199j9854J0445p7805J1253N4298
$$ 16299 -69266 -51980 34040 92204 34405 9304 58503 38649 49094 -28711 -17458 36840
20695C6840J4037p2596p9772N9397N7516N0385K95r1351K1571J32153l2845j13484
$$ 36840 50877 -21719 -101491 -42094 15422 65807 66102 -25249 -3678 128475 95630 -17854
20683a7854r230J07810k1153p6236k5276R2520J46656n7073j6381J4304p4765
$$ -17854 -27084 80726 59573 -16663 -41939 50581 197237 140164 123783 138087 63322
20672F3322J8612k3274p8734j0439R2954l3014n7543L8063O4230N7585l7284K7703
$$ 63322 81934 58660 -20074 -30513 62441 29427 -28116 9947 74177 131762 94478 122181
20660A22181N2531R6763m8377j15573o886n5984k1287R5756j3552p8355l5498
$$ 122181 174712 271475 223098 107525 100639 44655 23368 119124 105572 27217 -8281
20649h281P7703J19996P5685J5070o0883P6272q581j1341O807p7703j2758M3034
$$ -8281 69422 189418 265103 280173 219290 295562 286981 275640 282447 204744 191986 235020
20637B35020j3784m1840K1402Q1169j8771o116m1406q5654k5865P2291J04917
$$ 235020 221236 179396 200798 281967 263196 257080 215674 130020 104155 176446 281363
20626B81363l0995o2974p9360K6118r2817L3951P3984R709J3484j4816k345n5061
$$ 281363 250368 187394 108034 134152 41335 75286 149270 158979 172463 157647 155302 100241
20614A00241J8264L9679r9227R0605j780j489o114n02k5614m0843m8967P7987
$$ 100241 118505 158184 58957 149562 147782 146293 140179 139677 114063 73220 24253 102240
20602A02240N0501O1993n6257m9626M7191n555P5612L8957o4739O4635J9351n014
$$ 102240 152741 214734 158477 108851 156042 150487 226099 265056 200317 264952 284303 279289
20590B79289l8731r9136M3990L6385j8747M4793J25384j7099o2550q4238N4482
$$ 279289 240558 141422 185412 221797 203050 247843 373227 356128 293578 209340 263822
20579B63822L0479m5563M8674P6626l8546r1460k3730q791j312k967p0442m2525
$$ 263822 294301 248738 297412 374038 335492 244032 220302 211511 210199 207232 136790 94265
20567I4265m0630l9357L5011N9937k4018N7073M3558K9819O8970L2850N8715k6559
$$ 94265 53635 14278 49289 109226 85208 142281 185839 215658 284628 317478 376193 349634
20555C49634q7841K4083P7566M4813l1679j00510r1008k6597j15136M3714N3678
$$ 349634 261793 285876 363442 408255 376576 276066 185058 158461 43325 87039 140717
20544A40717J9824P440O7565M4760K9625j6448l0974K1995M0674m2678m508m3746
$$ 140717 160541 167981 235546 280306 309931 293483 262509 284504 325178 282500 277992 234246
20532B34246k5644J217k508l7678r4509K3729J20768L4028Q74J0033K7285m7643
$$ 234246 208602 209819 207311 169633 75124 98853 219621 253649 254523 264556 291841 244198
20520B44198L2515m7182J0332O322k4888K1271Q4061m902P68j6407M7554o3356
$$ 244198 276713 229531 239863 246185 221297 242568 326629 321727 322495 306088 353642 290286
20508B90286P8208N1822m6490q4603o5533p6665j9625L5436J52440j8920q4686
$$ 290286 368494 420316 373826 289223 223690 147025 127400 162836 315276 296356 211670
20497B11670o954j3605o2284l2443O0252M8661p2563l644J4461O9633Q2410K7310
$$ 211670 204716 191111 128827 96384 156636 205297 132734 129090 143551 213184 295594 322904
20485C22904R294r6187n6977J0347K275K7314q296K6504R962K0498J45923L9407
$$ 322904 332198 236011 179034 189381 191656 218970 210674 237178 247140 267638 413561 452968
20473D52968l20p7874Q30J4489q2715J7882P7604N2430j7823l3869L0992l0344
$$ 452968 452648 374774 375604 390093 307378 325260 402864 455294 437471 403602 434594 404250
20461D04250k0863M7821O734j4339j1858m7341k5261K900M5246j3628O19L3104
$$ 404250 383387 431208 437942 423603 411745 364404 339143 342043 387289 373661 374280 407384
20449D07384M3732n2163m8654J4077j6195J854J1975o3621j11804k0269J34582
$$ 407384 451116 398953 350299 364376 348181 350035 362010 298389 186585 166316 300898
20438C00898J19390r1249n8535l646J12519O9773n8714m9689J00779N5610j9576
$$ 300898 420288 329039 270504 266858 379377 449150 390436 340747 441526 497136 477560
20427D77560P262Q8195j10539p9788J1854M9752L5626K6844M7246p0935K2956
$$ 477560 484822 573017 462478 382690 394544 444296 479922 506766 554012 483077 506033
20416E06033P4489j19442K1404M2990l7795Q6490M8361l2084r1274m6492m6054
$$ 506033 580522 461080 482484 525474 487679 574169 622530 590446 499172 452680 406626
20405D06626r9366o2166J09218K12653N128p6189J9414m6259j4561M5633P9919
$$ 406626 307260 245094 354312 566965 572093 495904 515318 469059 454498 500131 580050
20394E80050r751m3730J5306J07124K333P3982P7208J9079n1229m5177R483m7208
$$ 580050 570299 526569 541875 648999 651332 725314 802522 821601 770372 725195 734678 687470
20382F87470q4157j0569O5792P1253l4531J3842o538j31685p1676M5023k8473
$$ 687470 603313 592744 658536 729789 695258 709100 702562 570877 499201 544224 515751
20371E15751n893R5256O4488O5968K9905M6204J7888M1908o7369n7971P709L9825
$$ 515751 509858 605114 669602 735570 765475 811679 829567 871475 804106 746135 753844 793669
20359G93669l2953k2256O4916L2129m8928m1484l9783l3816k3199L3953P0452
$$ 793669 760716 738460 803376 835505 786577 745093 705310 671494 648295 682248 752700
20348G52700k3224L3049K7071M6346L8528k4495O5796P909m0606l1269J0113m1363
$$ 752700 729476 762525 789596 835942 874470 849975 915771 923680 883074 851805 861918 820555
20336H20555J3824M3657P983l033L5532n4903J20076J14619M1462k8335k3513
$$ 820555 834379 878036 886019 882986 918518 863615 983691 1098310 1139772 1111437 1087924
20325A087924n9125r9651o2942l2880K4057M2241P7195L4866m9839o340M7061
$$ 1087924 1028799 929148 866206 833326 857383 899624 976819 1011685 961846 955506 1002567
20314A002567n1540M0791J14047N3704N4491j15484n9167Q2335L4263o6901o0114
$$ 1002567 951027 991818 1105865 1159569 1214060 1098576 1039409 1121744 1156007 1089106 1028992
20303A028992N6610N5685P1509N5152N2167L8218j27390k5677p404l9184M8053
$$ 1028992 1085602 1141287 1212796 1267948 1320115 1358333 1230943 1205266 1197862 1158678 1206731
20292A206731Q1654p2418m1570K6218J8264M6252J32157L1177M9558K352K6058
$$ 1206731 1288385 1215967 1174397 1200615 1218879 1265131 1397288 1428465 1478023 1480375 1506433
20281A506433n4884k8618j1726N5274J1394r5258r3945L8346J23933N6140N9343
$$ 1506433 1451549 1422931 1411205 1466479 1477873 1382615 1288670 1327016 1450949 1507089 1566432
20270A566432K0799p9396K83Q3942m4112k2731n2784j5181M7340m4330P764N4200
$$ 1566432 1587231 1507835 1508118 1592060 1547948 1525217 1472433 1457252 1504592 1460262 1468026 1522226
20258A522226q6189j8545Q6945J25917O7202k2812J01729O0241k9139j21960r366
$$ 1522226 1436037 1417492 1504437 1630354 1697556 1674744 1776473 1836714 1807575 1685615 1676249
20247A676249J17406O8942P083L071L5652j2303m6663n7952L8414N4875K6111
$$ 1676249 1793655 1862597 1869680 1872751 1908403 1896100 1849437 1791485 1829899 1884774 1910885
20236A910885L9205n2977j397O1840l2131O4573n1877j39800N7498J32867O7560
$$ 1910885 1950090 1897113 1895716 1957556 1925425 1989998 1938121 1798321 1855819 1988686 2056246
20225B056246J19074O5899N5920m7132J9728N0940O3834J6232K0577L4932K2801
$$ 2056246 2175320 2241219 2297139 2250007 2269735 2320675 2384509 2400741 2421318 2456250 2479051
20214B479051P1087J7517j9517P6860P3562Q6405L4891j4937J5836k0300r5222
$$ 2479051 2550138 2567655 2548138 2624998 2698560 2784965 2819856 2804919 2820755 2800455 2705233
20203B705233R4733P272J155Q22Q8885L43q7104L4329N1467o1087M8382O0768
$$ 2705233 2799966 2807238 2808393 2809215 2898100 2898443 2811339 2845668 2897135 2836048 2884430 2945198
20191B945198N1436p0598Q387Q1758O8326L8803n5620J38937J08001M3313J77542
$$ 2945198 2996634 2926036 2934423 3016181 3084507 3123310 3067690 3206627 3314628 3357941 3535483
20180C535483J47937l1178o0395J11355R6678k6653J2871P9156J13032l2004m6596
$$ 3535483 3683420 3652242 3591847 3703202 3799880 3773227 3786098 3865254 3978286 3946282 3899686
20169C899686j8101p9287p2141R2018O4244n3212O4965J33905J1401r3150m3903
$$ 3899686 3881585 3802298 3730157 3822175 3886419 3833207 3898172 4032077 4043478 3950328 3906425
20158C906425Q4375R3911J02787p9725j8135O3165K9780J36422J8808o6263P706
$$ 3906425 3990800 4084711 4187498 4107773 4089638 4152803 4182583 4319005 4337813 4271550 4279256
20147D279256J91962N1874j7683P4408K27015j0299L4225J02743Q4958J1231j2141
$$ 4279256 4471218 4523092 4505409 4579817 4806832 4796533 4830758 4933501 5018459 5029690 5017549
20136E017549J17985J36643K5635O7121N9726N8931O9569J2105N5981n1200l4286
$$ 5017549 5135534 5272177 5297812 5364933 5424659 5483590 5553159 5565264 5621245 5570045 5535759
20125E535759M1665R5735M0646K9032J0627N9323M6847J24339J90623J22610R4510
$$ 5535759 5577424 5673159 5713805 5742837 5753464 5812787 5859634 5983973 6174596 6297206 6391716
20114F391716K7749M0624Q9414J90286M3423P9564J03296L8750J12244J52382
$$ 6391716 6419465 6460089 6549503 6739789 6783212 6862776 6966072 7004822 7117066 7269448
20104G269448J51293k6905K2187L4576L1791J24900K21061J8012J83209J68398
$$ 7269448 7420741 7393836 7416023 7450599 7482390 7607290 7828351 7846363 8029572 8197970
20094H197970K9403P0586J22313J20146O3749J60002J51762O8218J51002Q7245
$$ 8197970 8227373 8297959 8420272 8540418 8604167 8764169 8915931 8984149 9135151 9222396
20084I222396Q2186K07985K26853J78194K18072N7830O3704J59715K25188J05064
$$ 9222396 9304582 9512567 9739420 9917614 10135686 10193516 10257220 10416935 10642123 10747187
20074A0747187J76146J94314J35342K18232K13653K48498J17689J11813P5596
$$ 10747187 10923333 11117647 11252989 11471221 11684874 11933372 12051061 12162874 12238470
20065A2238470K29384L22219K75498J60093J90170K32769R6812K79872K78102
$$ 12238470 12467854 12790073 13065571 13225664 13415834 13648603 13745415 14025287 14303389
20056A4303389J91426K68776L06618L43534L11580K56152K64727K63581L19501
$$ 14303389 14494815 14763591 15070209 15413743 15725323 15981475 16246202 16509783 16829284
20047A6829284L21270L52531K70114J99964K98250L72520L93436L98199L40225
$$ 16829284 17150554 17503085 17773199 17973163 18271413 18643933 19037369 19435568 19775793
20038A9775793M15300M73964L97124L82364M66971N06179M58156L20822M60963
$$ 19775793 20191093 20665057 21062181 21444545 21911516 22417695 22875851 23196673 23657636
20029B3657636N75993N20027M16518M03298N12353O28176O46132N86515N29791
$$ 23657636 24233629 24753656 25170174 25573472 26085825 26714001 27360133 27946648 28476439
20020B8476439N47621N55650O07023O62121O87839O23852N39573O36771P56781
$$ 28476439 29024060 29579710 30186733 30848854 31536693 32160545 32700118 33336889 34093670
20011C4093670P58361P48496O00826N85582Q00130Q39119P98923P46622Q74822
$$ 34093670 34852031 35600527 36201353 36786935 37587065 38426184 39225107 39971729 40846551
20002D0846551Q35491Q33203Q32043P41439P86082Q28290Q97963P26447P41977
$$ 40846551 41682042 42515245 43347288 44088727 44874809 45703099 46601062 47327509 48069486
19993D8069486P65274P92755P68730Q32725Q47414Q53311P78060Q38697P41685
$$ 48069486 48834760 49627515 50396245 51228970 52076384 52929695 53707755 54546452 55288137
19984E5288137P99636Q17205P47317O96026Q09218P98562P64509P55104O88338
$$ 55288137 56087773 56904978 57652295 58348321 59157539 59956101 60720610 61475714 62164052
19975F2164052O21304N95083P54542Q12720O00650O08938O55562O77356O45867
$$ 62164052 62785356 63380439 64134981 64947701 65548351 66157289 66812851 67490207 68136074
19966F8136074N45314O04066O70642N35343M12000M87420N09607M99205N06256
$$ 68136074 68681388 69285454 69956096 70491439 70903439 71390859 71900466 72399671 72905927
19957G2905927N11514M36333L75033L48587K98275K89926J93302O7345J45696
$$ 72905927 73417441 73853774 74228807 74577394 74875669 75165595 75358897 75426242 75571938
19948G5571938J62358J24965O2264J3824O2807J16923j16088j11937n9545l5836
$$ 75571938 75734296 75859261 75921525 75935349 75998156 76115079 75998991 75887054 75827509 75791673
19938G5791673l02047l04976k61396k56793k93223m43019m81604l89113l31765
$$ 75791673 75489626 75184650 74923254 74666461 74373238 73930219 73448615 73059502 72727737
19929G2727737l84385m51789l67891m88611o32118m93059n35515n61383n57389
$$ 72727737 72343352 71891563 71523672 71035061 70402943 69909884 69374369 68812986 68255597
19920F8255597o14709n63849o29875o60009o71958o29981o72244n65037o08422
$$ 68255597 67640888 67077039 66447164 65787155 65115197 64485216 63812972 63247935 62639513
19911F2639513q25331o61583p12075q22655p81592p04230p73688q35098p24116
$$ 62639513 61814182 61152599 60440524 59617869 58836277 58132047 57358359 56523261 55799145
19902E5799145o89289q13517q30881p92647o92711p51017q82398q08107p73805
$$ 55799145 55109856 54296339 53465458 52672811 51980100 51229083 50346685 49538578 48764773
19893D8764773r14018p24597o52226q25980q52483q70935p08487o83238p81628
$$ 48764773 47850755 47126158 46473932 45647952 44795469 43924534 43216047 42532809 41751181
19884D1751181p77007q01773q61974p23181o91398p00928p02874o85807o83611
$$ 41751181 40974174 40172401 39310427 38587246 37895848 37194920 36492046 35806239 35122628
19875C5122628o84740n90421o49605o35535o63944o65714n70501n34161n51297
$$ 35122628 34437888 33847467 33197862 32562327 31898383 31232669 30662168 30128007 29576710
19866B9576710n26606o26991o09969n66624n37142m18636m36574m61640m99692
$$ 29576710 29050104 28423113 27813144 27246520 26709378 26290742 25854168 25392528 24892836
19857B4892836n31826m89993m12411l20682k80200l64623l91885m10299m29622
$$ 24892836 24361010 23871017 23458606 23137924 22857724 22493101 22101216 21690917 21261295
19848B1261295m47089l28075l17315k55111m46987l82578k47707l30851m22322
$$ 21261295 20814206 20486131 20168816 19913705 19466718 19084140 18836433 18505582 18083260
19839A8083260l44916k46129j75473l61392l09871k64507k34912k20802l49530
$$ 18083260 17738344 17492215 17316742 16955350 16645479 16380972 16146060 15925258 15575728
19830A5575728j64324j96002k54230k96964k39439j49198j70377j61277k75821
$$ 15575728 15411404 15215402 14961172 14664208 14424769 14275571 14105194 13943917 13668096
19821A3668096k82959k14920r4370j66114j89073k24082j87511j27863j53023
$$ 13668096 13385137 13170217 13075847 12909733 12720660 12496578 12309067 12181204 12028181
19812A2028181j84223k19423k49062j52279k06377r4525o7558o8119j12322p5060
$$ 12028181 11843958 11624535 11375473 11223194 11016817 10922292 10854734 10786615 10674293 10599233
19802A0599233k48515k71040j28467q8505j14064j6614j00500k16145k60927j58103
$$ 10599233 10350718 10079678 9951211 9862706 9748642 9732028 9631528 9415383 9154456 8996353
19792H996353o5504j3127j22436p0490j313j53089j63847m1471l6834n7529j86519
$$ 8996353 8930849 8917722 8795286 8724796 8723483 8570394 8406547 8365076 8328242 8270713 8084194
19781H084194j12223m0486k8661j27452o7262n9937p2080l2566j11727o9898r0229
$$ 8084194 7971971 7931485 7902824 7775372 7708110 7648173 7576093 7543527 7431800 7361902 7271673
19770G271673m4430n0837k11231j37234J2053o0085r7756o9855r7014n5148n0758
$$ 7271673 7227243 7176406 6965175 6827941 6839994 6779909 6682153 6612298 6515284 6460136 6409378
19759F409378o3219j15934K6864L2934p0787J824m6180r1504n3345l4258q3p9548
$$ 6409378 6346159 6230225 6257089 6290023 6219236 6221060 6174880 6083376 6030031 5995773 5995690 5916142
19747E916142j02327o3738j68949Q582L5340l2107j16714j05913p3891j15406
$$ 5916142 5813815 5750077 5581128 5589710 5625050 5592943 5476229 5370316 5296425 5181019
19737E181019p0296N9951r3948j2303p341j5960l1475n0338o2127k271j5601r6118
$$ 5181019 5110723 5170674 5076726 5064423 5057082 5041122 5009647 4959309 4897182 4894911 4879310 4783192
19725D783192J1573N9239o054M6973l088p970j4054j39094q7317n801p1008k5659
$$ 4783192 4794765 4854004 4847950 4894923 4891835 4883865 4869811 4730717 4643400 4637599 4566591 4540932
19713D540932K6254k5697L4638j4581j08781q9978m7423k6593j13375r4954q3766
$$ 4540932 4567186 4541489 4576127 4561546 4452765 4362787 4315364 4288771 4175396 4080442 3996676
19702C996676l1127p7655p7492j1429n2971N9650j3571n0344p7352j21186n4006
$$ 3996676 3965549 3887894 3810402 3798973 3746002 3805652 3792081 3741737 3664385 3543199 3489193
19691C489193p9772K1672Q8140K343p1849q9285m1183l0113N3395J14392O2701
$$ 3489193 3409421 3431093 3519233 3521576 3449727 3360442 3319259 3289146 3342541 3456933 3519634
19680C519634j9175j31899m1483P3530O7358j01777p4024p2204r5207M9326j1703
$$ 3519634 3500459 3368560 3327077 3400607 3467965 3366188 3292164 3219960 3124753 3174079 3162376
19669C162376M858p0570l2850o5719m0236J0999M826q9696R778r2869o1310n3639
$$ 3162376 3167234 3096664 3063814 2998095 2957859 2968858 2973684 2883988 2893766 2800897 2739587 2685948
19657B685948o9216n9772Q2652M2746m5368j7243O9410R169l0941L1775l363J0023
$$ 2685948 2616732 2556960 2639612 2682358 2636990 2619747 2689157 2698326 2667385 2699160 2695797 2705820
19645B705820o1451L1508o708o7562o8760r685n8134j59224j9877J03124K8980
$$ 2705820 2644369 2675877 2669169 2601607 2532847 2523162 2465028 2305804 2285927 2389051 2418031
19634B418031K5663j1549p6602l8254m7010p0032R0524M8605L4107R688q6672
$$ 2418031 2443694 2432145 2355543 2317289 2270279 2200247 2290771 2339376 2373483 2383171 2296499
19623B296499p4200p6684P894O1162N5376K1072r3849m5361n6769O6463n2374
$$ 2296499 2222299 2145615 2153509 2214671 2270047 2291119 2197270 2151909 2095140 2161603 2109229
19612B109229p5668k1460l2230k6482R77L1199k3674j5005n3639N40J19931P5671
$$ 2109229 2033561 2012101 1979871 1953389 1954366 1985565 1961891 1946886 1893247 1893787 2013718 2089389
19600B089389K9136K7559o6466n0025o2003k6225k1559P040j22626n9797m3122
$$ 2089389 2118525 2146084 2079618 2029593 1967590 1941365 1919806 1926846 1804220 1744423 1701301
19589A701301N296M4498P1173K5756n5507l9221m6609j5149P8425O182J6453J46
$$ 1701301 1706597 1751095 1822268 1848024 1792517 1753296 1706687 1691538 1769963 1776145 1792598 1792744
19577A792744n8905q8578k0379J5925k9845k3649n6506n8789r613P550m856J21987
$$ 1792744 1733839 1645261 1624882 1640807 1610962 1587313 1530807 1472018 1462405 1469955 1465099 1587086
19565A587086Q9568k1892j8331m094n7710M5211M6356p880q0083j15861o213K683
$$ 1587086 1676654 1654762 1636431 1632337 1574627 1619838 1666194 1658314 1578231 1462370 1456157 1458840
19553A458840P0754L0572J8926n9007J1282M2548n3270p8466n9194n1890R482
$$ 1458840 1529594 1560166 1579092 1520085 1531367 1573915 1520645 1442179 1382985 1331095 1340577
19542A340577j5403k8596J7691j9381N7884j6658M7330j4424m5234L3235l110
$$ 1340577 1325174 1296578 1314269 1294888 1352772 1336114 1383444 1369020 1323786 1357021 1353911
19531A353911p3827p6544M9077O5361P4035J9293q2174j4710j42634k0693J81056
$$ 1353911 1280084 1203540 1252617 1317978 1392013 1411306 1329132 1314422 1171788 1151095 1332151
19520A332151M588o9684p0287r1644J8909Q0912l6178m3767j7936j35235k2745
$$ 1332151 1336739 1267055 1196768 1105124 1124033 1204945 1168767 1125000 1107064 971829 949084
19509I49084J52248P4204j7035J2877Q2199M41Q472l304J334o5874p5655j10206
$$ 949084 1101332 1175536 1158501 1171378 1253577 1254018 1262490 1259186 1260520 1194646 1118991 1008785
19497A008785J05261J99080j1116p1793n6243Q774M0483l9062J5990m4855N7995
$$ 1008785 1114046 1313126 1302010 1230217 1173974 1182748 1223231 1184169 1200159 1155304 1213299
19486A213299J8037l3417j3569p2687k5261J6379q120j0118l7314P6594K8538
$$ 1213299 1231336 1197919 1184350 1111663 1086402 1102781 1094661 1084543 1047229 1123823 1152361
19475A152361m286j05325p8722l7343j477J29558N4539q4485j34812K7294L6522
$$ 1152361 1148075 1042750 964028 926685 925208 1054766 1109305 1024820 890008 917302 953824
19464I53824l4648m5647p9145K9918K0393l4361P281L4931P7483O5644N3993n0086
$$ 953824 919176 873529 794384 824302 844695 810334 817615 852546 930029 995673 1049666 999580
19452I99580Q0559j5041k4813j46255m2779j1071K6734k8723m0431J01080K6567
$$ 999580 1080139 1065098 1040285 894030 851251 840180 866914 838191 797760 898840 925407
19441I25407l1392j09923q9370N2238M7197O5741P8811m3792q8338L1179n8074
$$ 925407 894015 784092 694722 746960 794157 859898 938709 894917 806579 837758 779684
19430G79684n6398r204K7824q146m0740M5539J7290J22100P7585K1371l5144j05568
$$ 779684 723286 714082 741906 733760 693020 738559 755849 877949 955534 976905 941761 836193
19418H36193L5754J7042p953n617j222P7031l0904l7086k9114l6741p421o4653
$$ 836193 871947 888989 881036 875419 874197 951228 920324 883238 854124 817383 809962 745309
19406G45309k0567N9614q8947N190M3380K0405l0522K4746k2100L4106L74k2691
$$ 745309 724742 784356 695409 700599 743979 764384 733862 758608 736508 770614 770988 748297
19394G48297J14660J09607n5920l9158j9053j13536j0474P5796L8172n4488K1699
$$ 748297 862957 972564 916644 877486 858433 744897 734423 810219 848391 793903 815602
19383H15602m3877p8021n5909O7542M3837l6829M1348J5737k1006n2570J09086
$$ 815602 771725 693704 637795 705337 749174 712345 753693 769430 748424 695854 804940
19372H04940K6530j07762k1891K2616n232l7095k7158K7396Q2032M5960p0505
$$ 804940 831470 723708 701817 724433 719201 682106 654948 682344 764376 810336 739831
19361G39831j00968j33425N6433J00680L2757N9788k5144L0930P978j5863j7529
$$ 739831 638863 505438 561871 662551 695308 755096 729952 760882 768860 752997 735468
19350G35468p3119j7260r7209L68r463J2817n696M0743n567N8159K8969m8333
$$ 735468 662349 645089 547880 548248 538785 551602 545906 586649 581082 639241 668210 619877
19338F19877J9342J1552Q98m5092n7563o7715m8260J2080m6705K1828L3536J5995
$$ 619877 639219 650771 651669 606577 549014 481299 433039 445119 398414 420242 453778 469773
19326D69773p7834j1094M334N7641J18675p9557n887m7975l4855k1843p899R2300
$$ 469773 391939 380845 385179 442820 561495 481938 476051 428076 393221 371378 363479 455779
19314D55779R1715l0223K5139J5648K1285j8192q2620J4912j3182k9203M8936
$$ 455779 547494 517271 542410 558058 579343 561151 478531 493443 480261 451058 499994
19303D99994L339l957j12201r1036k4360o888J3607O7049N5220L2088q404m5113
$$ 499994 503333 499376 387175 296139 271779 264891 278498 345547 400767 432855 424451 379338
19291C79338L5282J1100L9455j3909L5444n3472k7079Q3286K9366k7573j804o1452
$$ 379338 414620 425720 465175 451266 486710 433238 406159 489445 518811 491238 489434 427982
19279D27982m1512J283J58819K300m7679n3733M5125P4213k275r9122j47953p7252
$$ 427982 386470 387753 546572 548872 501193 447460 492585 566798 564523 465401 317448 240196
19267B40196O0928j7156P8477L7552k3635j7359l8021o2097Q2719Q9380N6280
$$ 240196 301124 283968 362445 399997 376362 359003 320982 258885 341604 430984 487264
19256D87264k2600j05409n3437K9353P0798K878O9662o7682n1242N7171p0637
$$ 487264 464664 359255 305818 335171 405969 408847 478509 410827 359585 416756 346119
19245C46119K9664m4284j6095l6783J1467J47175J15075q5945r0755n064J10634
$$ 346119 375783 331499 315404 278621 290088 437263 552338 466393 375638 370574 481208
19234D81208P4446m2371L6370n9852j21797M701P4517N761j64576k5285J74080
$$ 481208 555654 513283 549653 489801 368004 372705 447222 452983 288407 263122 437202
19223D37202R3250L857k8947J4020P8353o5117L4071j4744r0387o3718M9899O9736
$$ 437202 530452 534309 505362 519382 597735 532618 566689 551945 461558 397840 447739 517475
19211E17475k8200j64791j11894L5045L3426O8195r673m9166Q2276o7373O7424
$$ 517475 489275 324484 212590 247635 281061 349256 339583 290417 372693 305320 372744
19200C72744M5976j863n5047k8449M8425L3773p6335P7525L7277j34090l8279
$$ 372744 418720 416857 361810 333361 381786 415559 339224 416749 454026 319936 281657
19189B81657r747L5786L9107J666K8786K7470K8365k32919j12111K482L6541J05352
$$ 281657 271910 307696 346803 348469 377255 404725 433090 200171 88060 90542 127083 232435
19177B32435Q3459k1609K4060o9141M1159J01K6983j0756J6459j0277o508j17968
$$ 232435 315894 294285 318345 249204 290363 290464 317447 306691 323150 312873 306365 188397
19165A88397J5377P6018J6899O2240J2226q1723q5324l1461j0157R1256n139L3045
$$ 188397 203774 279792 296691 358931 371157 289434 204110 172649 162492 253748 248609 281654
19153B81654M4051j3311j19593J5894N4847q694L9618o788k9834m4435L0750J04570
$$ 281654 325705 312394 192801 208695 263542 254848 294466 287678 257844 213409 244159 348729
19141C48729m2469j0486m7161J658J43577l6949j60597j43540L9468M9692N8676
$$ 348729 306260 295774 248613 250271 393848 356899 196302 52762 92230 141922 200598
19130B00598n5199k6955R5678N7857l1844J7101m5923M2562J4893M2304P4930
$$ 200598 145399 118444 214122 271979 240135 257236 211313 253875 268768 311072 386002
19119C86002j12961R348P5734l998j45668o1693N9522m46l9506j4355J35676Q6196
$$ 386002 273041 282389 358123 354125 208457 146764 206286 205840 166334 151979 287655 373851
19107C73851K7122k2356j09769p6695M8330o5463r1769Q547P6453K1190Q2856
$$ 373851 400973 378617 268848 192153 240483 175020 83251 91798 168251 189441 272297
19096B72297M9170k6532j6742o7137p3561J8845k5705K6051O251M086j1726L0743
$$ 272297 321467 294935 278193 211056 137495 156340 130635 156686 162937 167023 155297 186040
19084A86040L4950N0779N199m6096o3105K0712J9188k0894j09340J0816L7501
$$ 186040 220990 271769 276968 230872 167767 188479 207667 186773 77433 88249 125750
19073A25750P3516Q6595M273l4354j03610k6016m8308P9275N1597J8161n9514
$$ 125750 199266 285861 290134 255780 152170 126154 77846 157121 208718 226879 167365
19062A67365N600m7135L309K3090m1811q446K3701Q8386m146n4013L2228R2849
$$ 167365 172965 125830 129139 152229 110418 101972 125673 214059 209913 155900 188128 280977
19050B80977n4000q5204N5784k8368j2703O3068L9664J5395K4597M1695m0898
$$ 280977 226977 141773 197557 169189 156486 219554 259218 274613 299210 340905 300007
19039C00007k6497k6422q6350Q0030J18218M444m4300L6050j4364L3960K7086
$$ 300007 273510 247088 160738 240768 358986 363430 319130 355180 340816 374776 401862
19028D01862M26l9131L1005o8817l6678K4989J3090o9978q8962J9004l3477j0741
$$ 401862 402288 363157 394162 325345 288667 313656 326746 256768 167806 186810 153333 142592
19016A42592k5189K8353j3478J6923R90K0402N9966P4369l6454o1061n1955p5230
$$ 142592 117403 145756 132278 149201 150191 170593 230559 304928 268474 207413 155458 80228
19004H0228Q336L8202P6828q1336K7137j5444o4282l1683R6057Q8941M0577k184
$$ 80228 88564 126766 203594 122258 149395 133951 69669 37986 134043 222984 263561 261377
18992B61377J1948l8157n5252m3843J2012K8617k7892J4503k1338J7462l9768
$$ 261377 273325 235168 179916 136073 148085 176702 148810 163313 141975 159437 119669
18981A19669k3461j0758m4882P7011J61352N0674K8929n6681q9291r2336j37684
$$ 119669 96208 85450 40568 117579 278931 329605 358534 301853 212562 120226 -17458
18970a7458m7991P0128P8967l92n9603n9505l7887J1225o657R6593J33255Q9667
$$ -17458 -65449 4679 83646 83254 23651 -35854 -73741 -62516 -69173 27420 160675 250342
18958B50342j2806P4397m6669N2825l4907p3493j01907L54J12211l7504o9601
$$ 250342 237536 311933 265264 318089 283182 209689 107782 108136 220347 182843 113242
18947A13242N1208n2151j09877p0044K8938j7905N5880J1938O5489k1546m0597
$$ 113242 164450 112299 2422 -67622 -38684 -56589 -709 11229 76718 55172 14575
18936A4575l8078J6J63886J14342j32982L4619m2550o524l5064J20656k3214K711
$$ 14575 -23503 -23487 140399 254741 121759 156378 113828 107304 72240 192896 169682 172393
18924A72393l1053M2942j7553p480j20003n4462J19809J72970j447m6410M412
$$ 172393 141340 184282 166729 159249 39246 -15216 104593 277563 276116 229706 234118
18913B34118n4384o7082R512N4489r1892J2256M9355J7448M5842k6262O589j17884
$$ 234118 179734 112652 122164 176653 84761 97017 146372 163820 209662 183400 189989 72105
18901G2105n1360K2200J2587J6551J8482o6212J1174l2114O4402N0967N3472K264
$$ 72105 20745 42945 55532 72083 90565 24353 35527 3413 67815 118782 172254 174518
18889A74518j6936l7314k131j20800k8743N6646M019m0668R54j04046O4978m3558
$$ 174518 157582 120268 118137 -2663 -31406 25240 29259 -11409 -10455 -114501 -49523 -93081
18877i3081L8801K9491K0948M4341K563J43068L808o1546r8593J0573K4466k4158
$$ -93081 -54280 -24789 -3841 40500 43063 186131 189939 128393 29800 40373 64839 40681
18865D0681j7243L3778L7223K6745M7925o0323J400J4045K4855Q3734l269l9635
$$ 40681 23438 57216 94439 121184 169109 108786 110186 124231 149086 232820 229551 189916
18853A89916M4156O494r2789j43143j04835Q6705Q2492j6580r571K4565p715K2748
$$ 189916 234072 240566 147777 4634 -100201 -13496 68996 52416 42845 67410 59695 82443
18841H2443J4750K9140k5547K207Q4078J0166m9749l2061L072P744l2281P0678
$$ 82443 97193 126333 100786 102993 187071 197237 147488 115427 118499 126243 93962 164640
18829A64640l1275M2111j4535m6245L633M898L1279L427l2749q8164n5228K1753
$$ 164640 133365 175476 160941 114696 118329 123227 154506 157933 125184 37020 -18208 3545
18817C545K3977N2267Q207P3944K4764O4607n2609m5637o6510O4094J05393l9929
$$ 3545 27522 79789 87996 161940 186704 251311 198702 153065 86555 150649 256042 216113
18805B16113k8246j4344j16407r4029N9688M9623m1875K2325k5653J2986L8832
$$ 216113 187867 173523 57116 -36913 22775 72398 30523 52848 27195 40181 79013
18794G9013O6619o7342q0575J9850j6427j943O5167l3128J1475q2163K9968K3136
$$ 79013 145632 78290 -2285 17565 1138 -805 64362 31234 42709 -39454 -9486 13650
18782A3650k5437K7460K4750m7366p427K9728p44J6236R5567J9764o139M1917
$$ 13650 -11787 15673 40423 -6943 -14370 15358 14614 30850 126417 146181 140042 181959
18770A81959L5041M0300p9540k0925m5780q5097l0466K2261J0220m3065j08454
$$ 181959 217000 257300 177760 156835 111055 25958 -4508 17753 27973 -15092 -123546
18759a23546j1789R5938P0147k4094l6790q0399j338J2173L8214N7106n7623Q202
$$ -123546 -135335 -39397 30750 6656 -30134 -110533 -111871 -99698 -61484 -4378 -62001 -53799
18747e3799o9684j3731J5215L4076P7341Q1668L2094l2575q2865J5093N8041l5307
$$ -53799 -123483 -137214 -121999 -87923 -10582 71086 103180 70605 -12260 2833 60874 25567
18735B5567n4396q4822k4576J12881J28428Q1898M7095j15077j9972j8348p3815
$$ 25567 -28829 -113651 -138227 -25346 103082 184980 232075 116998 97026 78678 4863
18724D863k7587J9680J1458L8301m5007l6510j222R3702m4991o0921M2524k5045
$$ 4863 -22724 -3044 8414 46715 1708 -34802 -36024 57678 12687 -48234 -5710 -30755
18712c0755q145J9707Q289j18684l4151P6320J17287P5405j2301p4236m4285J8662
$$ -30755 -38900 -19193 -10904 -129588 -163739 -87419 29868 105273 92972 18736 -25549 -6887
18700f887J13793N7476p2372p3731m2077j02539K5271Q9828J8059j6493K1157
$$ -6887 106906 164382 92010 18279 -23798 -126337 -101066 -11238 6821 -9672 11485
18689A1485l55l9056J10171J1151r5854k8139J3434Q8689m431k2445K6856m4798
$$ 11485 11130 -27926 82245 93396 -2458 -30597 -17163 71526 67095 44650 71506 26708
18677B6708l7638m0626j2606N1442K6456l9201r2571K5315P5481P8202q3946L9897
$$ 26708 -10930 -51556 -64162 -12720 13736 -25465 -118036 -92721 -17240 60962 -22984 16913
18665A6913r667k7911M8557R2130k0653n9634p3774j9854M2898j1063n8569r313
$$ 16913 7246 -20665 27892 120022 99369 39735 -34039 -53893 -10995 -22058 -80627 -89940
18653h9940O5337L7146M2692N1034j7295J07608M4023j02347r3934k1493K9311
$$ -89940 -24603 12543 55235 106269 88974 196582 240605 138258 44324 22831 52142
18642E2142j6931L2156M7935J11949K337o4054n4035L0822J6512K3955l8644k1310
$$ 52142 35211 67367 115302 227251 229588 165534 111499 142321 158833 182788 144144 122834
18630A22834k8528K9083j04442m5649O1321K1580M4539J6340l7287K0283j2503
$$ 122834 94306 123389 18947 -26702 34619 56199 100738 117078 79791 100074 87571
18619H7571o6420r0361L3139O0970j214J5253J7598j25957M5291l6246n9870p308
$$ 87571 21151 -69210 -36071 24899 23685 38938 56536 -69421 -24130 -60376 -120246 -127554
18607a27554M2243Q1873N797J7144Q4216j04112p0547K3356J44438n322k0085
$$ -127554 -85311 -3438 2359 19503 103719 -393 -70940 -47584 96854 91532 71447
18596G1447l992k8816p8341K8708M6539Q2267p207p1746j44066J6733J25624J16588
$$ 71447 67455 38639 -39702 -10994 35545 117812 110605 38859 -105207 -88474 37150 153738
18584A53738N462j08558r882r3695l2806l6757O2447N7478N347k0423j9023n1149
$$ 153738 159200 50642 40760 -52935 -85741 -122498 -60051 -2573 2774 -17649 -36672 -87821
18572h7821n104L9122l2935K894k3131K7126p550p2697K5577P7414P2516J29935
$$ -87821 -92925 -53803 -86738 -83844 -106975 -79849 -87399 -160096 -134519 -57105 15411 145346
18560A45346p7348j59267r0866J10135J43634J60649p2389q0292J8214O573l1822
$$ 145346 67998 -91269 -182135 -72000 71634 232283 159894 79602 97816 104389 72567
18549G2567l6859j7918L127k5500l7153N903Q5498j2235K021l9624J1517k0930
$$ 72567 35708 17790 20917 -4583 -41736 -35833 49665 37430 39451 -173 11344 -9586
18537i586q3288N7282N9662m6230o6494J4472J77938j2745J2532k2465k9818k6806
$$ -9586 -92874 -35592 24070 -22160 -88654 -74182 103756 91011 103543 81078 51260 24454
18525B4454K0800J6051k6473k1423Q268M5563K690J1891q159L737q5900j49808
$$ 24454 45254 61305 34832 13409 21677 67240 69930 81821 73662 77399 -8501 -158309
18513a58309P3251L3000R84L0502M3283L2581l8420k2930j8382M3404J08462L2904
$$ -158309 -85058 -52058 -51074 -20572 22711 55292 16872 -6058 -24440 18964 127426 160330
18501A60330p3678o2032M0926l0359r392L4528k9821o7268m3226q5675M675L9579
$$ 160330 86652 24620 65546 35187 25795 60323 30502 -36766 -79992 -165667 -160992 -121413
18489a21413L7636N0007P5381N6396L9791l4107l7764r4549m4128k1424N0884
$$ -121413 -83777 -33770 41611 98007 137798 103691 65927 -28622 -72750 -94174 -43290
18478d3290Q092O3218M6130q717n4992j03033M8290L9682L9694m507O9005J6658
$$ -43290 -35198 28020 74150 65433 10441 -92592 -44302 -4620 35074 30567 99572 116230
18466A16230l6129l7367j03614j01281J2463l3810q105M3746M6560P9283N1137
$$ 116230 80101 42734 -60880 -162161 -149698 -183508 -191613 -147867 -101307 -22024 29113
18455B9113R259k1616n3050k697R238N8734M4152M419m4898N830L7531N2639Q449
$$ 29113 38372 16756 -36294 -38991 -29753 28981 73133 77552 32654 38484 76015 128654 137103
18442A37103j504l7260m9307o4902O4954j3750l3989l6468Q6228m0264j99927
$$ 137103 135599 98339 49032 -15870 49084 35334 1345 -35123 51105 10841 -189086
18431a89086R122J28941L8125J4856q9068j22913p200L9156Q1050P8978K4867
$$ -189086 -179964 -51023 -12898 1958 -87110 -210023 -217223 -178067 -97017 -18039 6828
18420F828k3294L0696m237l2990L071Q7783k9211m6694r458j44089r2427R6362
$$ 6828 -16466 14230 9993 -22997 -19926 67857 38646 -8048 -17506 -161595 -254022 -157660
18408a57660J21415K0001O9973p8457m2745r260j4758N4026j3054k7959j8466
$$ -157660 -36245 -16244 53729 -24728 -67473 -76733 -91491 -37465 -50519 -78478 -96944
18397i6944N8190L4009j36949L3071K9094p8427m3960R7675O7154P867R316m128
$$ -96944 -38754 -4745 -141694 -108623 -79529 -157956 -201916 -104241 -37087 -29220 -19904 -24032
18385b4032m9076O925N7977O3565J10730r5406j50907O5657J0774q8569m2652
$$ -24032 -73108 -66183 -8206 55359 166089 70683 -80224 -14567 -3793 -92362 -135014
18374a35014j34639O4909M9440L7669R7132J17257m3837m1045k6731o8469l5024
$$ -135014 -269653 -204744 -155304 -117635 -20503 96754 52917 11872 -14859 -83328 -118352
18363a18352l5118m0566K4025j5867M5002m70O8742J21208j5801m4550j8686n0113
$$ -118352 -153470 -194036 -170011 -185878 -140876 -141346 -72604 48604 32803 -11747 -30433 -80546
18351h0546M7766P3665J16053j9416l9754o0061l2589o2677q8209j3970M1245
$$ -80546 -32780 40885 156938 137522 97768 37707 5118 -57559 -145768 -159738 -118493
18340a18493j9420K4916K8946j5709m2014l059J2248L2645K0514o7433M3026L8842
$$ -118493 -137913 -112997 -84051 -99760 -141774 -144833 -132585 -99940 -79426 -146859 -103833 -64991
18328f4991k2021Q6259Q4004l5139n5523K6592O7661L0674o7648r5976K964j1448
$$ -64991 -87012 -753 83251 48112 -7411 19181 86842 117516 49868 -46108 -43144 -54592
18316e4592Q1238Q4815j00737j3274k1414J0109l9635k8120P0517J17038Q9051
$$ -54592 26646 111461 10724 -2550 -23964 -13855 -53490 -81610 -11093 105945 194996
18305A94996O1942p5753q5857m7560o8033J6503P3708p4002q0855O1252q310o377
$$ 194996 256938 181185 95328 47768 -20265 -3762 69946 -4056 -84911 -23659 -31969 -38346
18293c8346p940R26M4579p8601J1548q4532K1912Q2270o877O3575J0118K2672
$$ -38346 -46286 -45360 -781 -79382 -67834 -152366 -130454 -48184 -55061 8514 18632 41304
18281D1304p8825j23527m292K6717L0726K94k128l398R9659j9119j24748M218
$$ 41304 -37521 -161048 -165340 -138623 -107897 -107603 -109731 -113129 -13470 -32589 -157337 -153119
18269a53119R9713O1039J2308J9558q5358L1544O9292j09885N75K3386P2990K821
$$ -153119 -53406 7633 19941 39499 -45859 -14315 54977 -54908 -54333 -30947 42043 44864
18257D4864J6036j78029n7709O1001O1844J13314k5014r8792n8012p0483n0830
$$ 44864 60900 -117129 -174838 -113837 -51993 61321 36307 -62485 -120497 -190980 -241810
18246b41810L9478K5568N6271P2280K5798J5248o861K311R8791l043j52523p0892
$$ -241810 -202332 -176764 -120493 -48213 -22415 -7167 -14028 -11717 87074 84031 -68492 -139384
18234a39384J17407L9730k0995l804L3152L2267Q993o452q8252o1097N2607J07899
$$ -139384 -21977 17753 -3242 -7046 26106 58373 67366 60914 -27338 -88435 -35828 72071
18222G2071J6547N2313P285o5443q6072M9568J56492R1130M191J0863n4348Q1680
$$ 72071 88618 140931 148216 82773 -3299 46269 202761 293891 298082 308945 254597 336277
18210C36277L5217n2112r7493l4600J18981m8211o9009J9437M1068P0252L373
$$ 336277 371494 319382 221889 187289 306270 258059 189050 208487 249555 319807 323180
18199C23180l5872j9752N8464P8743k2853q1989n3246o3264n2029m1885l3605
$$ 323180 287308 267556 326020 404763 381910 299921 246675 183411 131382 89497 55892
18188E5892k9769j7530j31709n4362L4508O2825Q9776K2309o6848m0486j287j0766
$$ 55892 26123 8593 -123116 -177478 -142970 -80145 9631 31940 -34908 -75394 -76681 -87447
18176h7447R8630P7233n4297O0139j4426q779O8707N6302M106j8599R92M7836
$$ -87447 11183 88416 34119 94258 79832 71053 139760 196062 200168 181569 182561 230397
18164B30397L3769R1843J6164p9926J5995J9476r891l4645K6938L0938p0114M858
$$ 230397 264166 356009 372173 292247 308242 327718 317827 283182 310120 341058 270944 275802
18152B75802o5526K6297K2529k6673n2704k5088r9715L76O1866M2344j8483q3265
$$ 275802 210276 236573 259102 232429 179725 154637 54922 55298 117164 159508 141025 57760
18140E7760n0489j9123l8882J9211m3335q227k5813k4378l0068k1073n8102L1678
$$ 57760 7271 -11852 -50734 -31523 -74858 -83085 -108898 -133276 -163344 -184417 -242519 -210841
18128b10841J18256L4151j13136M3991J32251L3091J4544R606l6840j29688j0032
$$ -210841 -92585 -58434 -171570 -127579 4672 37763 52307 61913 25073 -104615 -114647
18117a14647N2528O5127M0301p5840p2682o0834N4229R6131k4840q6362L0021
$$ -114647 -62119 3008 43309 -32531 -105213 -166047 -111818 -15687 -40527 -126889 -96868
18106i6868l1422l7162N5836N7221l9796l5260k6697K7224Q5719n228L53q7174
$$ -96868 -128290 -165452 -109616 -52395 -92191 -127451 -154148 -126924 -41205 -46433 -46080 -133254
18094a33254p659J89K7486L7434j5245o4362K3275M2991o430k9850P6746k9132
$$ -133254 -140913 -140724 -113238 -75804 -91049 -155411 -132136 -89145 -95575 -125425 -48679 -77811
18082g7811P6828k8509o2075n7185P9289J04622J1937N1401q388J47066J34792
$$ -77811 -983 -29492 -91567 -148752 -69463 35159 47096 98497 90109 237175 371967
18071C71967n4181r0701K5411M8477p9739K2621J2799o7193J6305J21330J63708
$$ 371967 317786 227085 252496 300973 221234 243855 256654 189461 205766 327096 490804
18060D90804N3490j47785j43687k14444k5631O550o8738j6151N7350r59K8683
$$ 490804 544294 396509 252822 38378 12747 19297 -49441 -65592 -8242 -9201 19482
18049A9482K2575K2338j2035J32062P1810k8246k4385M4675L366m2063m7388J01709
$$ 19482 42057 64395 52360 184422 256232 227986 203601 248276 251642 209579 162191 263900
18037B63900J8090N9018J46043J22362k9326k0618r5810j02090j06701j2712J24135
$$ 263900 281990 341008 487051 609413 580087 559469 463659 361569 254868 242156 366291
18026C66291P6811L6259m1L3507P2485k4364r4435j09680p1032N1891N8014L9215
$$ 366291 443102 479361 479320 512827 585312 560948 466513 356833 285801 337692 395706 434921
18014D34921m7819K2158P4363K2165J20707N9539j51713o5099j36720j47383j08461
$$ 434921 387102 409260 483623 505788 626495 686034 534321 469222 332502 185119 76658
18003G6658J5750M9879J31299L1100j4185M9073L325m9624n843j10177j2395J46347
$$ 76658 92408 142287 273586 304686 290501 339574 342899 293275 287432 177255 164860 311207
17991C11207Q5766N179J60775J97928J17348J71623J14395j5493p8449j81633
$$ 311207 396973 402152 562927 760855 878203 1049826 1164221 1148728 1070279 888646
17981H88646j74188j47075j75009j03947k509K0801K752k8222o92j63656m1672
$$ 888646 714458 567383 392374 288427 285918 306719 309471 281249 280557 116901 75229
17970G5229r53l3454K5724j493M2125K4291k338o3497J5401Q5744J4985k0869
$$ 75229 74276 40822 66546 65053 107178 131469 129131 65634 81035 166779 181764 160895
17958A60895m2230o7378k6208K6084R7497j9563N7514J12750K2335j06385n6498
$$ 160895 118665 51287 25079 51163 148660 129097 186611 299361 321696 215311 158813
17947A58813l8753J913M0141j03514L6154M4205J0694R4212J29606Q6033J17240
$$ 158813 120060 121973 162114 58600 94754 138959 149653 243865 373471 459504 576744
17936E76744P9574K0514K6884J5939j11445j17114j24124j32631k1228M7826O3069
$$ 576744 656318 676832 703716 719655 608210 491096 366972 234341 213113 260939 324008
17925C24008N087j0798L6378k1475l5510q7937k8001Q944R9747Q4989Q8231M8652
$$ 324008 329095 318297 354675 333200 297690 209753 181752 190696 290443 375432 463663 512315
17913E12315k1642l2686K969L2694j0002q8606m4101K5763o3554p6285Q2902J26508
$$ 512315 490673 457987 460956 493650 483648 395042 350941 376704 313150 236865 319767 446275
17901D46275J1600m9298q4582r7400j3218l4283N449J18008Q6677O8322k5805
$$ 446275 457875 408577 323995 226595 213377 179094 184543 302551 389228 457550 431745
17890D31745p6240M213K0951M95K570k3358o0600M5500k475o7393l6212q759J20805
$$ 431745 355505 359718 380669 381164 383734 360376 299776 345276 342801 275408 239196 230437 351242
17877C51242P6986k4130R1908O7227K4015j8018n4815r7777q1267K4327o4071
$$ 351242 428228 404098 496006 563233 587248 569230 514415 416638 335371 359698 295627
17866B95627K5397J7512m8954n7667J716N2067L879K6835L4983l5832L7711L6709
$$ 295627 321024 338536 289582 231915 233631 285698 289577 316412 351395 315563 353274 389983
17854C89983o3207l9805N4407L6376N9719n4761q0622L6355L840j00569P6371
$$ 389983 326776 286971 341378 377754 437473 382712 302090 338445 342285 241716 318087
17843C18087M8231o4484p0052L0986O699M933L748p374P557K1591r6715k8091
$$ 318087 366318 301834 231782 262768 269467 274400 278148 270774 278331 299922 203207 175116
17831A75116l3916n0260n6766K6789N3884P6916n05K3596L1812L8140l5932P0642
$$ 175116 141200 90940 34174 60963 114847 191763 191258 214854 246666 284806 248874 319516
17819C19516N5850N32k9128m7764j27937J932l8713j06711j8669M3592P2512O6157
$$ 319516 375366 375898 346770 299006 171069 173001 134288 27577 8908 52500 125012 191169
17807A91169P089O0650m9996k3232m4262r7328o0017M9751N4056K8945M389K1912
$$ 191169 198258 258908 208912 185680 141418 44090 -15927 33824 87880 116825 121214 143126
17795A43126J33125r81k6900L8559l9676M8863K9783l4699L2782k9223j43499
$$ 143126 276251 275270 248370 286929 247253 296116 325899 291200 323982 294759 151260
17784A51260l6019L0083R8881M4181J5925J22257J26629R3564J06699J57388J66777
$$ 151260 115241 145324 244205 288386 304311 426568 553197 646761 753460 910848 1077625
17773A077625K05512K26527L49166L12092K08412k0030k23381j69242r2019O2009
$$ 1077625 1283137 1509664 1858830 2170922 2379334 2359304 2135923 1966681 1874662 1936671
17763A936671L7439j2482L3847L04294K87602K49504J53827j33948l05925m93783
$$ 1936671 1974110 1961628 1995475 2299769 2587371 2836875 2990702 2856754 2550829 2057046
17753B057046m37098l55488k86844k20402p5005L7627n9588n4210K5079J09808
$$ 2057046 1619948 1264460 977616 757214 682209 719836 660248 606038 631117 740925
17743G40925K4831L2859J04366O6018J43425J83099J33093Q7079N9752r389k881
$$ 740925 765756 798615 902981 968999 1112424 1295523 1428616 1515695 1575447 1566058 1563177
17732A563177J43856J30851K21433K27256M10280N95812N14313P64954Q53521
$$ 1563177 1707033 1837884 2059317 2286573 2696853 3292665 3806978 4571932 5425453
17723E425453N97557K47747j7893n5348K91663N58455Q68600J614839K416568
$$ 5425453 6023010 6270757 6252864 6197516 6489179 7047634 7916234 9531073 11947641
17714A1947641L586507N072273O710829Q515863R779215J0104664R425792P081462
$$ 11947641 15534148 20606421 27317250 35833113 45612328 55716992 65142784 72224246
17706G2224246J111166o576875r625787q856845p544089n850858l504520o94794
$$ 72224246 73335412 66758537 57132750 48275905 40731816 34880958 31376438 30681644
17698C0681644K435419N479222P848770R222331R636051R851333Q172714R72763
$$ 30681644 33117063 38596285 46445055 55667386 65303437 75154770 83327484 84300247
17690H4300247r158085j2162051j0476653r569258q869159p240226n260786l687944
$$ 84300247 75142162 62980111 52503458 42934200 34065041 26824815 21564029 17876085
17682A7876085k339002j293844p01498n08185k18567O4678K36218L52963P69325
$$ 17876085 15537083 14243239 13541741 13033556 12814989 12879667 13115885 13468848 14238173
17673A4238173J392175K252563L527289N349223P890788J0963035J3918090J6072481
$$ 14238173 15630348 17882911 21410200 26759423 34650211 45613246 59531336 75603817
17665G5603817J6161898J2955816M497360p726722j4476346j4411737j2362488
$$ 75603817 91765715 104721531 109218891 101492169 87015823 72604086 60241598
17658F0241598r026138m810763n95885L508498P722614J1592790J4574954J6129523
$$ 60241598 51215460 46404697 45808812 49317310 57039924 68632714 83207668 99337191
17650I9337191J6074243J2855816L197436j0899230j8162941j8115432j6839074
$$ 99337191 115411434 128267250 131464686 120565456 102402515 84287083 67448009
17643F7448009j4993010j2106003q867938o238990m336917l267915k549829j915273
$$ 67448009 52454999 40348996 31481058 25242068 20905151 17637236 15087407 13172134
17635A3172134j508316j090095q98649p84982p77731q23397o91993n31452m17588
$$ 13172134 11663818 10573723 9675074 8890092 8112361 7288964 6596971 6065519 5647931
17626E647931k88714k48692q9457j50025j79059L407m6344N974j2439L1337K26885
$$ 5647931 5359217 5110525 5021068 4871043 4691984 4695391 4649047 4655021 4642582 4673919 4900804
17615D900804M5089k78836o26144m96368k16433j50186m1160J6122J36842K65199
$$ 4900804 4945893 4667057 4040913 3544545 3328112 3177926 3136766 3152888 3289730 3554929
17605C554929L83310M76769L04422p4438m98475k78666j43829p936L64612O62944
$$ 3554929 3938239 4415008 4719430 4644992 4146517 3867851 3724022 3716086 4080698 4743642
17595D743642J059683J513489J695660J445841p554j702643j692868j094633o20808
$$ 4743642 5803325 7316814 9012474 10458315 10450761 8748118 7055250 5960617 5339809
17586E339809p9809K57889N03339R54889J517414K314303L584168N312855O580881
$$ 5339809 5260000 5517889 6021228 6976117 8493531 10807834 14392002 19704857 26285738
17577B6285738N539522P36075n120483o544656m571228k487095j026259M8684
$$ 26285738 31825260 32561335 27440852 20896196 16324968 13837873 12811614 12860298
17569A2860298J034276K125020L828849O258805R549944J3188382J4675266J0797642
$$ 12860298 13894574 16019594 19848443 26107248 35657192 48845574 63520840 74318482
17561G4318482K6691j3137122j6754561j2896295q260266m751710k700467j415559
$$ 74318482 74345173 61208051 44453490 31557195 23296929 18545219 15844752 14429193
17553A4429193p09926m90209o13789j084110j243212r80254n78367j26368J33912
$$ 14429193 13719267 13229058 12615269 11531159 10287947 9307693 8729326 8602958 8736870
17544H736870K92645L48068K08569L26473O99685Q86891J213053J465087J840045
$$ 8736870 9029515 9377583 9586152 9912625 10612310 11499201 12712254 14177341 16017386
17535A6017386K268395L185319M777764P273334J1058173J7184266K6585502L9901834
$$ 16017386 18285781 21471100 26248864 33522198 44580371 61764637 88350139 128251973
17527A28251973N3017519N3913903K8146178k2264722n5687643n1116321l4230877
$$ 128251973 181269492 235183395 263329573 241064851 185377208 134260887 100030010
17520A00030010k0569779j1427863n152057l42089M292620J0115971J7759304
$$ 100030010 79460231 68032368 62880311 62538222 66830842 76946813 94706117
17513I4706117K7042054L5433151L7840010K8495661J0245588M106283J8841848
$$ 94706117 121748171 157181322 195021332 223516993 233762581 237868864 256710712
17506B56710712L2724334K0657426k6251117o7235627o4299320m4098261k7871020
$$ 256710712 289435046 310092472 283841355 216605728 152306408 108208147 80337127
17499H0337127j8031638j2237481q795585o561015m841804l575066k684574j935308
$$ 80337127 62305489 50068008 41272423 34711408 29869604 26294538 23609964 21674656
17491B1674656j421186j153368j111168j014507r74013r13302r72800q23455m39924
$$ 21674656 20253470 19100102 17988934 16974427 16000414 15087112 14114312 13290857 12850933
17482A2850933k34501k16446j54943k09365j85484j00906o7129J51023M32449
$$ 12850933 12616432 12399986 12245043 12035678 11850194 11749288 11682159 11833182 12265631
17473A2265631P64066J222594J860723K562644L796769N548966Q624409J3699857
$$ 12265631 13029697 14252291 16113014 18675658 22472427 28021393 36645802 50345659
17465E0345659K1273866K9951058L4219975K4561094l691414l0783131l2624686
$$ 50345659 71619525 101570583 135790558 160351652 156660238 125877107 93252421
17458I3252421k1675173j1184884k736111L679008N528151k52522j1074167j4769293
$$ 93252421 71577248 60392364 57656253 61335261 66863412 66610890 55536723 40767430
17450D0767430j1014032o983577m500970l062193k156518j584025j257516r10468
$$ 40767430 29753398 22769821 18268851 15206658 13050140 11466115 10208599 9298131
17442I298131p17288n25499k77147k73081j52040r0558k96183k88326l64618l02914
$$ 9298131 8580843 8055344 7778197 7505116 7353076 7262518 6966335 6678009 6313391 6010477
17432F010477j46577n8113j09166k14253j80696j55306k7430n9846m9990P9380
$$ 6010477 5863900 5805787 5696621 5482368 5301672 5146366 5118936 5059090 5009100 5088480
17422E088480J19283K90613M03204N98953Q28652J367272K076381L313840N329510
$$ 5088480 5207763 5498376 5901580 6500533 7329185 8696457 10772838 14086678 19416188
17413A9416188Q262666J0925457J0551599L896497p419139j2103221r651046o401798
$$ 19416188 27678854 38604311 49155910 53052407 45633268 33530047 23879001 17477203
17405A7477203m316264k895838j914043j316758r90426p25630o96284n45242l18399
$$ 17477203 13160939 10265101 8351058 7034300 6043874 5318244 4621960 4076718 3758319
17396C758319l95514l19272j13971k6241j93411j38769M7109j35759m2605K6490
$$ 3758319 3362805 3043533 2929562 2903321 2709910 2571141 2618250 2482491 2439886 2466376
17386B466376L8404R0581m9135n3425O8959o2499l687k20807l35677j89753j19002
$$ 2466376 2504780 2595361 2546226 2492801 2561760 2499261 2495574 2274767 1939090 1749337 1630335
17375A630335M468L8065k4472M7641J7178L4908J4645r6077o9413Q55n0730J9316
$$ 1630335 1634803 1672868 1648396 1696037 1713215 1748123 1762768 1666691 1597278 1598133 1547403 1566719
17363A566719m5788j67450j45966K8969l228l7530K812o586q8093j3045L8794
$$ 1566719 1520931 1353481 1207515 1236484 1233256 1195726 1198538 1191952 1103859 1090814 1129608
17352A129608N5896O1311J8892q0660j14431j077k8851k7720P3401q090K015M0114
$$ 1129608 1185504 1246815 1265707 1185047 1070616 1069539 1040688 1012968 1086369 1078279 1080294 1120408
17340A120408k9316O9829J20807J9671r8250j20633o679L7332O484J069M4735
$$ 1120408 1091092 1160921 1281728 1301399 1203149 1082516 1075837 1113169 1119653 1120722 1165457
17329A165457J8093R4806M6785Q8958k6999k3686P7416O0873m0356n6949l9108
$$ 1165457 1183550 1278356 1325141 1414099 1387100 1363414 1440830 1501703 1461347 1404398 1365290
17318A365290k88q9755r4496j8007K2142o2960n4505m7867k355q9134p4033R4411
$$ 1365290 1365002 1275247 1180751 1162744 1184886 1121926 1067421 1019554 1017199 928065 854032 948443
17306I48443O82q0489q7354q0319j4961j0966j824J3417R9247Q0195j04856J2266
$$ 948443 949125 868636 781282 700963 686002 675036 673212 686629 785876 866071 761215 773481
17294G73481p649m7999j788O306J2391k3525k9996j787l4097N5838j9258P407
$$ 773481 765832 717833 716045 722351 734742 711217 681221 679434 645337 701175 681917 689324
17282F89324K9534n9736j4619L641N5743O2492r652N1288R2057j822J04458J35769
$$ 689324 718858 659122 644503 648144 703887 766379 756727 808015 900072 898250 1002708 1138477
17270A138477m6622m7299j4801P879K9279m5649j02495j44155p7626q583l0606
$$ 1138477 1091855 1044556 1029755 1037634 1066913 1021264 918769 774614 696988 688405 657799
17259F57799O9132L9119o1244p7012J1166L9182n1855j39701p1389P6294J07118
$$ 657799 726931 766050 704806 627794 638960 678142 626287 486586 415197 491491 598609
17248E98609k4352o5358r0777L6868J36642L7092m1513n4022L620J1441r997j3373
$$ 598609 574257 508899 418122 454990 591632 628724 587211 533189 536809 548250 538253 524880
17236E24880n7282J9063p2107J3523J46343K9116n6137r4446L1887j3812k8175
$$ 524880 467598 486661 414554 428077 574420 603536 547399 452953 484840 471028 442853
17225D42853l771N6766Q011o3611l8591o2002Q924J10477K5384J6287P686P1029
$$ 442853 439082 495848 503859 440248 401657 339655 348579 459056 484440 500727 508413 579442
17213E79442p9212j1464J12727M0152M1553p5024j35755r5590m599Q0136O6533
$$ 579442 500230 488766 601493 641645 683198 608174 472419 376829 372230 452366 518899
17202E18899P1252N7279L833n1135n9622j1538o940O9838J06813N6320j8176R0269
$$ 518899 590151 647430 651263 600128 540506 528968 522028 591866 698679 754999 736823 827092
17190H27092J88534J40762j8112k84995j64459O158l3016q5957J3763l5163K6237
$$ 827092 1015626 1156388 1138276 853281 688822 694980 661964 576007 589770 554607 580844
17179E80844L0499n7077r9863J27070L3849K6123P5640J1213Q5263m5002j9884
$$ 580844 611343 554266 454403 581473 615322 641445 717085 728298 813561 768559 748675
17168G48675j10612j72191j11997m1447O4836J71049P8058O467q537k0562M3837
$$ 748675 638063 465872 353875 312428 377264 548313 626371 632838 624301 603739 647576
17157F47576r4268J0091Q6356k2793m0048L359L567L1334R1433O5837o0869m6926
$$ 647576 553308 563399 649755 626962 586914 590273 593840 625174 716607 782444 721575 674649
17145F74649K8202J8842q0711r4398j7980L2392O1127j9371l2040J1156K5267
$$ 674649 702851 721693 640982 546584 528604 560996 622123 602752 570712 581868 607135
17134F07135k4590J14281J8306n093K7358r4184p9676J496p0205p6235M0272l2639
$$ 607135 582545 696826 715132 710039 737397 643213 563537 565033 494828 418593 458865 426226
17122D26226p4286N9280J5351n6104o696O0483o9020k7907j3643l3490l347K0462
$$ 426226 351940 411220 426571 370467 363771 424254 355234 327327 313684 280194 276847 297309
17110B97309p60P1130L6833Q084Q470n6651O987l5662m4418K6545K3436M7345
$$ 297309 296549 367679 404512 412596 421066 364415 371402 335740 291322 317867 341303 388648
17098C88648j00831m1098m773Q3988m3539M1415k9877j00808j7941J43739N0472
$$ 388648 287817 246719 241946 325934 282395 323810 293933 193125 175184 318923 369395
17087C69395M1505J62K5121Q035R5775j3623p0222j20593L1659J34909q7818j47646
$$ 369395 410900 411062 436183 444218 539993 526370 456148 335555 367214 502123 414305 266659
17075B66659l4892O1362J06479m5519j4131K9107k9991l8003L6249l8311j3197
$$ 266659 231767 293129 399608 354089 339958 369065 339074 301071 337320 299009 285812
17064B85812K6686N7309M9438K8601M253L2005N345J08140Q2396P2002N0555L0156
$$ 285812 312498 369807 419245 447846 452099 484104 489449 597589 679985 751987 802542 832698
17052H32698J33781n3452j17385q8518l4973R1056R1313m2093j00508j0071j3168
$$ 832698 966479 913027 795642 707124 672151 763207 854520 812427 711919 701848 688680
17041F88680p581o170r3678j21313J2365J1154j42117r217Q7805R8641k6708p6435
$$ 688680 681099 674929 581251 459938 472303 483457 341340 332123 419928 518569 491861 415426
17029D15426j8353M2172L5354l2594m7886n5627j19125m7055J12821J18531o611
$$ 415426 397073 439245 474599 442005 394119 338492 219367 172312 285133 403664 397053
17018C97053M339m6149q8636K3346J09274j160r36M9678O3144L0788l8224L9539
$$ 397053 401392 355243 266607 289953 399227 398067 397131 446809 509953 540741 502517 542056
17006E42056J95053K25746K23459J14382k2871n5145q5535j59812J9886k0522
$$ 542056 737109 962855 1186314 1300696 1277825 1222680 1137145 977333 997219 976697
16996I76697j53436L286k4042j9714J34542o922o4018l3000q0461m4745m9945
$$ 976697 823261 826547 802505 782791 917333 910411 846393 813393 732932 688187 638242
16985F38242n9617p6232l4546O739k585j30765m6959K8417Q8610j25234r1578
$$ 638242 578625 502393 467847 474586 472001 341236 294277 322694 411304 286070 194492
16974A94492M8397l3687K3064K1322N6143L2136k0959K2169J17540J6826N0727
$$ 194492 242889 209202 232266 253588 309731 341867 320908 343077 460617 477443 528170
16963E28170J244q3906m1782J24149O2316k8527P3747J01202J80121P5194R0422
$$ 528170 529414 445508 403726 527875 590191 561664 635411 736613 916734 991928 1082350
16952A082350L7015n082o8968o5550m3690k8486n4964j43201j45894o4230N469
$$ 1082350 1119365 1114283 1045315 979765 936075 907589 852625 709424 563530 499300 504769
16941E04769K3280m6308o7448o7938O216J4200p136K9060R9368K0734J6767r488
$$ 504769 528049 481741 414293 346355 352571 366771 359635 388695 488063 508797 525564 516076
16929E16076k5907q7384J4191N8684k1492r9094m7053j780J62J14949L3006k6724
$$ 516076 490169 402785 416976 475660 454168 355074 308021 306241 306403 421352 454358 427634
16917D27634R585K3344n1739M9422k0934m8529o9110m1630k092K6590J23933N2670
$$ 427634 437219 460563 408824 458246 437312 388783 319673 278043 275951 302541 426474 479144
16905D79144N8416J78459m653j8040n204k228l6788j30160r4711l2807r5057J4529
$$ 479144 537560 716019 711366 693326 688122 685894 649106 518946 424235 391428 296371 310900
16893C10900L1673o9567m5116k2258M206R3366R2688k6581l3316L4440M1853J108
$$ 310900 342573 273006 227890 205632 209838 303204 395892 369311 335995 370435 412288 413396
16881D13396J7119k2244m5724l9324J2971L1300M3831k9218m2639p9540j255O0968
$$ 413396 430515 408271 362547 323223 336194 367494 411325 382107 339468 259928 258673 319641
16869C19641m5913M4921m4560M4049N7364L0360M6026m7415J7470N0894J580l7233
$$ 319641 273728 318649 274089 318138 375502 405862 451888 404473 421943 472837 474417 437184
16857D37184o1220L124L7454o3665j15525m3852N5886K7383J5620N6494l1506
$$ 437184 375964 379088 416542 352877 237352 193500 249386 276769 292389 348883 317377
16846C17377p4746m296O7496m2315K9392r5587j31680P6475N7795J75968J52664
$$ 317377 242631 238335 305831 263516 292908 197321 65641 142116 199911 375879 528543
16835E28543l4396j35380L7607j2597m5529q4061P1958N966P709r2942q0471P2360
$$ 528543 494147 358767 396374 383777 338248 254187 326145 332111 339820 246878 166407 238767
16823B38767m6283j22078k1948K3951O2980l6592k1650n0858l3352N8785R020
$$ 238767 192484 70406 48458 72409 135389 98797 77147 26289 -7063 51722 60742
16812F0742M723L8116m4037j9313j3256J5153P0691k4475K5860J9400M1036n9623
$$ 60742 65465 103581 59544 40231 26975 42128 112819 88344 114204 133604 174640 115017
16800A15017O212J579l8184N308P2942J5926j16028p5072J32773J05665O0974
$$ 115017 121229 122808 84624 89932 162874 178800 62772 -12300 120473 226138 287112
16789B87112o9690o0435M2838P5376p0080j95854K208N7969L2797k962k5189k2451
$$ 287112 217422 156987 199825 275201 205121 9267 11475 69444 102241 99279 74090 51639
16777E1639p616J8012N5730L6574R890O403n0903L7877Q1430j22m895n1754n9736
$$ 51639 44023 62035 117765 154339 164229 170632 119729 157606 239036 238914 234019 182265 122529
16764A22529l6416L3890m3655k890l6870l507M1869J3794J8057o083M619R4395
$$ 122529 86113 120003 76348 73458 36588 33081 74950 88744 106801 100718 105337 199732
16752A99732J083o6979J0277o902m7406m4315j243P248p5382P6431N0255M9715
$$ 199732 200815 133836 144113 137211 89805 45490 44247 51495 -23887 52544 102799 152514
16740A52514M0498k5028q373L6911K1334k4516l0872k507P442m0085l3831J01287
$$ 152514 193012 167984 159611 196522 217856 193340 162468 159961 167403 127318 93487 194774
16728A94774j0107m794j34594j9066J2900P5478j6220m102j7964p1785l8033J2385
$$ 194774 184667 179873 45279 26213 39113 114591 98371 94269 76305 4520 -33513 -21128
16716b1128L1066q4442m9829Q1952R5379N8587j7649j40371j5323O5208M7367
$$ -21128 9938 -74504 -124333 -42381 52998 111585 93936 -46435 -61758 3450 50817
16705E0817P7744m5060l0573M9738K6698q0000j8849K9715j1133n6068o7285Q9881
$$ 50817 128561 83501 52928 102666 129364 49364 30515 60230 49097 -6971 -74256 15625
16693A5625Q9783L7528l2538K3401j8381m7072O6P2025l6402o5961p7075J00292
$$ 15625 105408 142936 110398 133799 115418 68346 68412 140437 104035 38074 -39001 61291
16681F1291N1199j22959P8997L0076J8465l2744M383J8101R7219l1012j46556
$$ 61291 112490 -10469 68528 98604 117069 84325 88708 106809 204028 173016 26460
16670B6460r8418O9407M6354o539J4205o8982K0257R3840N685k9256j115K0407
$$ 26460 -71958 -2551 43803 37264 51469 -17513 2744 96584 102269 73013 71898 92305
16658I2305K0310j8649j2956m5819l1143n1704l384l0660j0935Q7016k9500R2895
$$ 92305 112615 93966 81010 35191 4048 -47656 -51040 -81700 -92635 -5619 -35119 57776
16646E7776K6525j3856J0476R717q9479q843J05917k44l9299R3809R5269o8599
$$ 57776 84301 70445 80921 90638 1159 -7684 98233 97989 58690 152499 247768 179169
16634A79169j94021O466K7817K7352L6229j20149k4938l4770N0689J09111K230
$$ 179169 -14852 -8386 19431 46783 83012 -37137 -62075 -96845 -46156 62955 65185
16623F5185K5495j9158K266m0173R961Q0628o355J6120J0281k1272m4044o8574
$$ 65185 90680 71522 73788 33615 43576 124204 117849 133969 144250 122978 78934 10360
16611A0360j5131L6470K6743O5444M8258q8931j01112k0856N9546j046K6160N07
$$ 10360 -4771 31699 58442 123886 172144 83213 -17899 -38755 20791 19745 45905 46412
16599D6412N6596R735k9476p1565K7518Q1335O1929r9711n9418M2648J5297M828
$$ 46412 103008 112743 83267 11702 39220 120555 182484 82773 23355 66003 81300 86128
16587H6128L4993j6887j5101K1752K0863l0670p1630j5909J8831N9373M7146n5784
$$ 86128 121121 104234 89133 110885 131748 101078 29448 13539 32370 91743 138889 83105
16575H3105L6849j1794j10197P8487J9943p3531K4141J1009j3013l7507m5804
$$ 83105 119954 108160 -2037 76450 96393 22862 47003 58012 44999 7492 -38312
16564c8312M7701l3427Q3863O9344N571q0903k1261o9156o3711N3768J466m2990
$$ -38312 9389 -24038 59825 129169 134740 53837 32576 -36580 -100291 -46523 -45057 -88047
16552h8047M2031K0777O8841P2310N7479l8379n7885K2054K4694K343k418k9173
$$ -88047 -46016 -25239 43602 115912 173391 135012 77127 99181 123875 126218 123800 94627
16540I4627j2362k3688N6717n860j6623q3831r4231N3936M2494m696L6737o7379
$$ 94627 82265 58577 115294 109434 92811 8980 -85251 -31315 11179 6483 43220 -24159
16528b4159n1963L8718J05028M9175K1344L5418n0348P1718J23025j42003r6464
$$ -24159 -76122 -37404 67624 116799 138143 173561 123213 194931 317956 175953 79489
16517G9489L5204J29201M1218n5642p5377K9407M974j0359n7796M9054k5041j08011
$$ 79489 114693 243894 285112 229470 154093 183500 188474 178115 120319 169373 144332 36321
16505C6321n3043J9729M0972M6247l6908k9515K9435q5160k8416M05P8079j1285
$$ 36321 -16722 3007 43979 90226 53318 23803 53238 -31922 -60338 -59933 18146 6861
16493F861k4165l2791l5330k7712O7611P1744K809l5932q4166k1263M5036L3291
$$ 6861 -17304 -50095 -85425 -113137 -45526 26218 29027 -6905 -91071 -112334 -67298 -34007
16481c4007P7865J5974m001q8502m1963J5009J1486j580J48879N0555m3498p1379
$$ -34007 43858 59832 55831 -32671 -74634 -59625 -48139 -49719 99160 149715 106217 34838
16469C4838L9230R4728K1250o4792p9505j15923J513P7393J0147N5390j7466L703
$$ 34838 74068 168796 190046 125254 45749 -70174 -68661 8732 18879 74269 56803 60506
16457F0506j753n7233n60O5887J2121M5275K4641l5459m5690p9127m0407J16366
$$ 60506 58753 1520 960 66847 78968 124243 148884 113425 67735 -11392 -51799 64567
16445F4567K5953q5182o7379j4496R9500N0585J1048J8300j7055j2059R225K9300
$$ 64567 90520 5338 -62041 -76537 22963 73548 84596 102896 85841 73782 83007 112307
16433A12307n2894j17482j09490L1682O6723P3374J52371J1375q2024l9981o895
$$ 112307 59413 -58069 -167559 -135877 -69154 4220 156591 167966 85942 45961 39066
16422C9066n6840q4725j7463K5016M6704P3279m3347Q0182J12577k3020o9261
$$ 39066 -17774 -102499 -119962 -94946 -48242 25037 -18310 61872 174449 151429 82168
16411H2168M3354N4686J631k6657M1529P8031k57j39020j64745l9459Q5893L5562
$$ 82168 125522 180208 181839 155182 196711 274742 274485 135465 -29280 -68739 17154 52716
16399E2716J4143o733j01366O8262k2934K641O6776P1505k3649r5020m8708L2781
$$ 52716 66859 60126 -41240 27022 4088 6729 73505 145010 121361 26341 -22367 10414
16387A0414O5695r332N1890q0220o3587O1738k1765K6405O7309n1404j05947K1712
$$ 10414 76109 66777 118667 38447 -25140 36598 14833 41238 108547 57143 -48804 -27092
16375b7092K6793M3433j2415K0547n4069n5710N4238J06929J05373j5907q2660
$$ -27092 -299 43134 30719 51266 -2803 -58513 -4275 102654 208027 192120 109460
16364A09460l3449l2323j5394q898r0681J4865N4051J0400N7078J24048N3669
$$ 109460 76011 43688 28294 19396 -71285 -56420 -2369 8031 65109 189157 242826
16353B42826J2910q7856p8362o7171l5670M0583M4474l8858p882J1551L0301P6567
$$ 242826 255736 167880 89518 22347 -13323 27260 71734 32876 24994 36545 66846 143413
16341A43413r632j00937j18119J5875P60k628m986M4958N7041J9078l5709o7656
$$ 143413 133781 32844 -85275 -69400 -68640 -71268 -76254 -31296 25745 44823 9114 -58542
16329e8542N6576p139L4398M3459j7060R4110m9762p3143J2161j5019K9263P6979
$$ -58542 -1966 -9105 25293 68752 51692 145802 96040 22897 35058 20039 49302 126281
16317A26281l272L7703j8974o1877l7051l4581r6334k1862J2912K8317j2805k4692
$$ 126281 123009 160712 141738 79861 42810 8229 -88105 -109967 -97055 -68738 -81543 -106235
16305a06235j6373N7077N0126O010j7319L1982J4288m6868o007L967p8277K8453
$$ -106235 -122608 -65531 -15405 -9395 -26714 5268 19556 -27312 -33319 -29352 -107629 -79176
16293g9176N1647N6502j40107J0529m2081J3631J58774J07141j310M2160L8384
$$ -79176 -27529 28973 -111134 -100605 -142686 -129055 29719 136860 135550 177710 216094
16282B16094m6306j56269j40454n5674R6620m494m2951N7280J607l2272J157k0096
$$ 216094 169788 13519 -126935 -182609 -85989 -90483 -133434 -76154 -74547 -106819 -105662 -125758
16270a25758O5244P2740k2096L4018M0372k7160q7760p1666k2942M7111O1914
$$ -125758 -60514 12226 -9870 24148 64520 37360 -50400 -122066 -145008 -97897 -35983
16259c5983O9805n334o5639Q3146K7255j9422k3519o0509M7096k320j9908N4647
$$ -35983 33822 28488 -37151 45995 73250 53828 30309 -30200 16896 14576 -5332 49315
16247D9315M0697N1117q631m9581m6411m1401r9484q4321J03843P8042L5878J8941
$$ 49315 90012 141129 132498 82917 36506 -4895 -104379 -188700 -84857 -6815 29063 48004
16235D8004L1636l6060j11465r6922O0044R1743M2305q398N2197K4270p4267k1575
$$ 48004 79640 43580 -67885 -164807 -104763 -13020 29285 20887 73084 97354 23087 1512
16223A512m4511m0621J03238k4149o2582P5107M2839J897K7704o2460n7242l2966
$$ 1512 -42999 -83620 19618 -4531 -67113 7994 50833 52730 80434 17974 -39268 -72234
16211g2234K0631N143M0635p851k3711O1441L0323K5424n5192j03811K238J20349
$$ -72234 -51603 -46460 -5825 -13676 -37387 24054 54377 79801 24609 -79202 -76964 43385
16199D3385M9410p2005q0707m7249M4231l6242q477J1158P1591K6385O9015n2100
$$ 43385 92795 20790 -59917 -107166 -62935 -99177 -107654 -96496 -24905 1480 70495 18395
16187A8395m8509r0241M838M5570k1760K2791M5596R643K1352m1666n9052P2025
$$ 18395 -30114 -120355 -115517 -69947 -91707 -68916 -23320 -13677 7675 -33991 -93043 -21018
16175b1018N6777L7418N2899L8874o336k5688j0165p4011q9302n0534j3180L3794
$$ -21018 35759 73177 126076 164950 158614 132926 122761 48750 -40552 -91086 -104266 -70472
16163g0472o235J03794Q8602q869j27638j23836P0295o3m6513P3628N0734O562
$$ -70472 -76707 27087 115689 106820 -20818 -144654 -74359 -74422 -120935 -47307 3427 9989
16151I989k7256p2602p0411O6587O7997n0244p5926j876J4919J00411J5827O9409
$$ 9989 -17267 -89869 -160280 -93693 -25696 -75940 -151866 -153742 -138823 -38412 -22585 46824
16139D6824O8721j1014p1185Q5039L1669k8131R267o0188p1367n284m0466K7211
$$ 46824 115545 104531 33346 118385 150054 121923 131190 71002 -365 -5649 -46115 -18904
16127a8904O870M792k1838j4038O5574O5860k6377j6286J5129l6998o1147K5579
$$ -18904 -12034 -7242 -29080 -43118 22456 88316 61939 45653 60782 23784 -37363 -11784
16115a1784q730p1050m4978O9008L0166n402L6507k9151m0075q474J8178N5936
$$ -11784 -20514 -91564 -136542 -67534 -37368 -42770 -6263 -35414 -75489 -83963 -65785 -9849
16103i849K495o8182N6299R923j085N8137L5943k6468o3963j33430J6535M3043
$$ -9849 -7354 -75536 -19237 -9314 -10399 47738 83681 57213 -6750 -140180 -123645 -80602
16091h0602J732N5346j04140q6312J06775P7802j17123q04P5238K0640n357j1531
$$ -80602 -78870 -23524 -127664 -213976 -107201 -29399 -146522 -147326 -72088 -51448 -56805 -68336
16079f8336L2187j0618l6198m593M9507J4423K0601m3225o9886N1025J28796j9377
$$ -68336 -36149 -46767 -82965 -87558 -38051 -23628 -3027 -46252 -116138 -65113 63683 44306
16067D4306p0143O6544N5370m1405m6071j7693J17963n0906j06001n203l4597
$$ 44306 -25837 40707 96077 54672 8601 -9092 108871 57965 -48036 -53239 -87836
16056h7836n8217k2287N2422Q9581K53n4382L502P6160L6182N5693l9489L7870
$$ -87836 -146053 -168340 -115918 -26337 -26084 -80466 -76964 -804 35378 91071 51582 89452
16044H9452M0725p0538P694q1229p0232M574R1887k5538m3562J18k6583Q737r448
$$ 89452 130177 59639 67333 -13896 -84128 -79554 12333 -13205 -56767 -56649 -83232 -74495 -83943
16031h3943q4555j3043L7901R0494K4110q713p9529r7263O5211n7544K1091J10314
$$ -83943 -168498 -181541 -143640 -53146 -29036 -37749 -117278 -214541 -149330 -206874 -185783 -75469
16019g5469M5431m045P1598j0471L4581r065j31463p9658L7641N3925L8899J25788
$$ -75469 -30038 -34083 37515 27044 61625 52560 -78903 -158561 -120920 -66995 -28096 97692
16007I7692Q6315k9568p8695r3688K381P5876p8354L7060r5764n7816r992J03327
$$ 97692 184007 154439 75744 -17944 -15563 60313 -18041 19019 -76745 -134561 -144553 -41226
15995d1226l1877n3151Q4988N6625k4857p7302o7891N1850O7423l5874l5142l2043
$$ -41226 -73103 -126254 -41266 15359 -9498 -86800 -154691 -102841 -35418 -71292 -106434 -138477
15983a38477M1852Q4897j9914P9J36852P3202M0149m5187j22301p6018o501P1115
$$ -138477 -96625 -11728 -31642 -31563 105289 178491 218640 173453 51152 -24866 -31367 39748
15971C9748P6477J1214K7456l4508n4017j38964J17268K687m6383o3644O7192
$$ 39748 116225 127439 154895 120387 66370 -72594 44674 47361 978 -62666 4526
15960D526J66761o7010q5160n0195Q227m0120J8810J15230R8765k6576k9475K4267
$$ 4526 171287 104277 19117 -31078 -22851 -62971 -44161 71069 169834 143258 113783 138050
15948A38050j03637m2855n1946O946P6945k8471M0061Q9794n468m2290l628n6403
$$ 138050 34413 -8442 -60388 -53442 23503 -4968 35093 124887 119419 77129 73501 17098
15936A7098l3437Q8783M6928k2605r8932j13890n804r576l6905k2545L3202J20907
$$ 17098 -16339 72444 119372 96767 -2165 -116055 -121859 -131435 -168340 -190885 -157683 -36776
15924c6776K8111K7202M0668k0820L6775O4524K1759K210M8986o581q0227j25375
$$ -36776 -8665 18537 59205 38385 75160 139684 161443 163653 212639 206058 125831 456
15912D56o5448P6605M5047L1782j07673j05497Q449L7395N3602K8620j4030l512
$$ 456 -64992 11613 56660 88442 -19231 -124728 -116279 -78884 -25282 3338 -10692 -14204
15900a4204M7174M7610m3412j42593k4819K9794Q1661N5731M2558J23737M4678
$$ -14204 32970 80580 37168 -105425 -130244 -100450 -18789 36942 79500 203237 247915
15889B47915m8802j34189q4629m619m4517M2861O6278j0176J3402j6220L3274
$$ 247915 199113 64924 -19705 -24324 -68841 -25980 40298 30122 43524 27304 60578
15878F0578L8357p4397j9252q8790N1798Q7198N3839m7691k0267O530n2264n6270
$$ 60578 98935 24538 5286 -83504 -31706 55492 109331 61640 41373 47903 -4361 -60631
15866f0631J9146j1655O4881J11490L4549p2857o4611o6517J5318m3740k6069
$$ -60631 -41485 -53140 11741 123231 157780 84923 20312 -46205 -30887 -74627 -100696
15855a00696l5723j3991O5J34252P4168K8706j01641m4712j6950m2857o6506Q7860
$$ -100696 -136419 -150410 -150345 -16093 58075 86781 -14860 -59572 -76522 -119379 -185885 -98025
15843i8025R5512o9461n0040J5560n2544O9622J29749M9713j7670o1899j7947
$$ -98025 -2513 -71974 -122014 -106454 -158998 -89376 40373 90086 72416 10517 -7430
15832g430l2633N712l4719m1124J14689L8122Q63Q0145N9008q2591m8959q5912
$$ -7430 -40063 -34351 -69070 -110194 4495 42617 43480 123625 182633 100042 51083 -34829
15820c4829m7929k4654o551J00272J7704n8843j11134k6131L8897M0458P8743
$$ -34829 -82758 -107412 -113963 -13691 4013 -54830 -165964 -192095 -153198 -112740 -33997
15809c3997K8129m6038n377N700K6222j6860L4414K9222M422m7998P3308K1267
$$ -33997 -5868 -51906 -57283 -51583 -25361 -42221 -7807 21415 25837 -22161 51147 72414
15797G2414m136k6253k6880l0611K5236M2654m823m9321m9911L4466L8988L1359
$$ 72414 68278 42025 15145 -15466 9770 52424 47601 -1720 -51631 -17165 21823 53182
15785E3182m7532p6629j21120j06032P2474P5088o3300n506Q8584J9690P6597
$$ 53182 5650 -70979 -192099 -298131 -225657 -150569 -213869 -219375 -130791 -111101 -34504
15774c4504l4218o2251k9117K6051K2517j5429J0766M9361L5106O4720j4377j42262
$$ -34504 -68722 -130973 -160090 -134039 -111522 -126951 -116185 -66824 -31718 33002 18625 -123637
15762a23637j01402Q8329N9257K8791m254p0442m577l9658j0546J2056k2397k105
$$ -123637 -225039 -136710 -77453 -48662 -52916 -123358 -127935 -167593 -178139 -166083 -188480 -190585
15750a90585Q0172N8734N6224m0469o7661k3630L9410O4592K3915M3443J938k115
$$ -190585 -110413 -51679 4545 -35924 -103585 -127215 -87805 -23213 702 44145 46083 43968
15738D3968R2173j17735p4991k1058L8288L7435K0767n1317J2564j8213K8290
$$ 43968 136141 18406 -56585 -77643 -39355 -1920 18847 -32470 -19906 -38119 -9829
15727i829k8755l0543q6262p0668L5056P7956j3508o8199P9795J30262L7604r6697
$$ -9829 -38584 -69127 -155389 -226057 -191001 -113045 -126553 -194752 -114957 15305 52909 -43788
15715d3788L9606O6894L7183N7030P804q122n3902k7598K5053o5451j00108j702
$$ -43788 -4182 62712 99895 156925 164729 156607 102705 75107 100160 34709 -65399 -67101
15703f7101Q6924m0114o5796Q9304M1678p8710n0795J6273J11868J08210j2452
$$ -67101 19823 -20291 -86087 3217 44895 -33815 -84610 -68337 43531 151741 139289
15692A39289j08567O6664M1909q7016K3531k4760K018q3893j03471N071l419n7400
$$ 139289 30722 97386 139295 52279 75810 51050 53068 -30825 -134296 -129225 -132644 -190044
15680a90044J0608M8469K5076L4039M7100m2383n0480K9213J4909N0944P9413
$$ -190044 -179436 -130967 -105891 -71852 -24752 -67135 -117615 -88402 -73493 -22549 56864
15669E6864J1786L383n5086l6741m195q605o432j0316m1783K7013m1209N01k912
$$ 56864 68650 72033 16947 -19794 -23989 -32594 -39026 -49342 -91125 -64112 -105321 -104820 -107732
15656a07732n3291j1197Q735O455j03476P2562J50898k4284M7156r112m7177k6992
$$ -107732 -161023 -172220 -163485 -157030 -260506 -187944 -37046 -61330 -14174 -23286 -70463 -97455
15644i7455p89K4531O5589n8414j0618L2679k8019N1700R4748k044q3630l8613
$$ -97455 -98244 -73713 -8124 -66538 -77156 -44477 -72496 -20796 73952 71908 -11722 -50335
15632e0335L3382K1061k4487l0404k2175J4272M8016N9662m1261m4651P0463J28733
$$ -50335 -16953 4108 -20379 -50783 -72958 -58686 -10670 48992 7731 -36920 33543 162276
15620A62276P0343r7576j20092n0463O8692l6746R490M4483k2197q393J6315o669
$$ 162276 232619 135043 14951 -35512 33180 -3566 5924 50407 28210 19817 36132 29463
15608B9463q0009K7015L5806K2581r0886j2908Q7976O7466l5628r5362N5610r823
$$ 29463 -50546 -23531 12275 34856 -56030 -68938 19038 86504 50876 -44486 11124 1301
15596A301Q206K6668l0425r927J8340Q1671N5089o3220o4569q68p4212J5441J3790
$$ 1301 9507 36175 5750 -4177 14163 95834 150923 87703 23134 22266 -51946 -36505 -22715
15583b2715L4301J6519j2265N3751j8344q6859p4966L886l2301q5715R6323K909
$$ -22715 11586 28105 15840 69591 51247 -35612 -110578 -106692 -138993 -224708 -128385 -125476
15571a25476k1389P5566J38017R725p9949k072L5738L8617K9082p1230r0254m7846
$$ -125476 -146865 -71299 66718 76443 -3506 -5578 30160 68777 97859 26629 -63625 -111471
15559a11471R5322K6743k5451j41862n4581J09936J25036l9288L0228M9578n7463
$$ -111471 -16149 10594 -14857 -156719 -211300 -101364 23672 -15616 14612 64190 6727
15548F727p0731j2725M8605R5207k8073j00204o2054L0774O9751k7369p4375j9145
$$ 6727 -64004 -76729 -28124 67083 39010 -61194 -123248 -92474 -22723 -50092 -124467 -143612
15536a43612M3421M1713P8978L0169R3844r4922j17697M4309J30676N7376l2170
$$ -143612 -100191 -58478 20500 50669 144513 49591 -68106 -23797 106879 164255 132085
15525A32085j3126l7920p6637j6745l1244L0732J2105l738l6193r453J2150K2054
$$ 132085 118959 81039 4402 -12343 -43587 -12855 -750 -4488 -40681 -50134 -37984 -15930
15513a5930N2625L3570q506l986o4696j4673R0725j0032q7374k7118Q8107Q1906
$$ -15930 36695 70265 61759 57773 -6923 -21596 69129 59097 -28277 -55395 32712 114618
15501A14618M2133j11995o1353p6729O8067J26993k6559P2218p9402q3163J4274
$$ 114618 156751 44756 -16597 -93326 -25259 101734 75175 147393 67991 -15172 -898
15490h98M9682j5064j0991n9916M3331m7128j2508J937l8583l4762o7819K6514
$$ -898 48784 33720 22729 -37187 6144 -40984 -53492 -51555 -90138 -124900 -192719 -166205
15478a66205K3632M4352R928N5140P22k3611L1084m952n4477m021k4866l634L9361
$$ -166205 -142573 -98221 -88293 -33153 -32431 -56042 -24958 -29910 -84387 -88408 -113274 -116908 -77547
15465g7547N5093R7112n8444q3674O6265J5413n6084r1162j6246J0892N7753p623
$$ -77547 -22454 74658 16214 -67460 -1195 14218 -41866 -133028 -149274 -138382 -80629 -88252
15453h8252l0021R0411J09654J9960M3244m3668l7094o0788j01015m3049l6730
$$ -88252 -118273 -27862 81792 101752 144996 101328 64234 3446 -97569 -140618 -177348
15442a77348K3053P420M6529l2668j3542J2011R5458L1709L2449P7241j3768j32319
$$ -177348 -154295 -146875 -100346 -133014 -146556 -134545 -39087 -7378 25071 102312 88544 -43775
15430d3775N7630Q8116m5063q4287J977k3336j7162k5085r3359j01761J11284
$$ -43775 13855 101971 56908 -27379 -25402 -48738 -65900 -90985 -184344 -286105 -174821
15419a74821J40270P9478k0546J8728R6208J07226M32r8325n6316j12898l0232
$$ -174821 -34551 44927 24381 43109 139317 246543 246975 148650 92334 -20564 -50796
15408e0796J1374M6500L9710k7998p5355n0081J2628K5765K9093k2967j0170N2502
$$ -50796 -39422 7078 46788 18790 -56565 -106646 -94018 -68253 -39160 -62127 -72297 -19795
15396a9795m9305j13018O8327M0138P2055N4310L3086k1442j0864l0173J13m2290
$$ -19795 -69100 -182118 -113791 -73653 -1598 52712 85798 64356 53492 23319 23432 -18858
15384a8858p7870J0003M045N0627P8008K6479k8587r2139M9705M925j01437k0837
$$ -18858 -96728 -86725 -82680 -32053 45955 72434 43847 -48292 1413 6338 -95099 -115936
15372a15936L4177N9061O7730r3685q2453K7571O4586l8778k114K3371J8212j01223
$$ -115936 -81759 -22698 45032 -48653 -131106 -103535 -38949 -77727 -79841 -56470 -38258 -139481
15360a39481K4823Q8786q3897L907p218J6400l6963o6118O7320L7873p8156j8534
$$ -139481 -114658 -25872 -109769 -105862 -113080 -96680 -133643 -199761 -132441 -94568 -172724 -191258
15348a91258J8925k5981L6525j49684O5648J73573J9310q2077j6592K9435L6483
$$ -191258 -172333 -198314 -161789 -311473 -245825 -72252 -52942 -135019 -151611 -122176 -85693
15337h5693j2035p8923M4689k4725l1499q454L1972J08672J671m7143k0299Q0479
$$ -85693 -97728 -176651 -131962 -156687 -188186 -196640 -164668 -55996 -54325 -101468 -121767 -41288
15325d1288k3199n0526L9799N3762l5689j9622k1410q407Q7949L559k8391J3392
$$ -41288 -64487 -115013 -75214 -21452 -57141 -76763 -98173 -106580 -18631 -15072 -43463 -30071
15313c0071k4119j7497o284k1455L2430k6592l3482M0403P915o1871J9328l2153
$$ -30071 -54190 -71687 -77971 -99426 -66996 -93588 -127070 -86667 -78752 -140623 -121295 -153448
15301a53448p8650K8510N2305L0726K2921k124P3739M1155l687n4709k1700q5391
$$ -153448 -232098 -203588 -151283 -120557 -97636 -99760 -26021 15134 11447 -43262 -64962 -150353
15289a50353m6269j5776J08139L2266J5846q113P364K300l3341R0374N3079L8541
$$ -150353 -196622 -212398 -104259 -71993 -56147 -64260 -56896 -54596 -87937 2437 55516 94057
15277I4057M7248r4658q7247Q5216J3920m5590j52575n3218P4282M4317L7978
$$ 94057 141305 46647 -40600 44616 58536 12946 -139629 -192847 -118565 -74248 -36270
15266c6270n2715l8687q6608r324K15956m1670p8272j3762O3679M6651K3488K1535
$$ -36270 -88985 -127672 -214280 -223604 -7648 -49318 -127590 -141352 -77673 -31022 -7534 14001
15254A4001J3679m4090j0813M9386M5002P021N7622m1492n367L2899M3347j13136
$$ 14001 27680 -16410 -27223 22163 67165 74186 131808 90316 84949 117848 161195 48059
15242D8059n5956L4626n2024J19894J0002o5227m9937r2716P7429j2136r4209
$$ 48059 -7897 26729 -25295 94599 104601 39374 -10563 -103279 -25850 -37986 -132195
15231a32195N635L7316Q0105J7578p2719k9305k6634O208j8311K7047j1232j00634
$$ -132195 -126560 -89244 -9139 8439 -64280 -93585 -120219 -114011 -132322 -105275 -116507 -217141
15219b17141j9753N1743Q632L4433N1630J04126l4373j38096J39136k0513J7357
$$ -217141 -236894 -185151 -176519 -142086 -90456 13670 -20703 -158799 -19663 -40176 -22819
15208b2819R4307K5099k1391o9092R7178O8231l8518r2689q883K2625R43j644
$$ -22819 71488 96587 75196 6104 103282 171513 132995 40306 31423 54048 54991 53347
15196E3347q4136o3870K9063q3510n7397K8616K4421L8521O3009L4090R269n1214
$$ 53347 -30789 -94659 -65596 -149106 -206503 -177887 -153466 -114945 -51936 -17846 -8577 -59791
15184e9791L2876M8992l9447n4753m4176J4674K4554M4141O0771k8291J1083M2125
$$ -59791 -26915 22077 -17370 -72123 -116299 -101625 -77071 -32930 27841 -450 10633 52758
15172E2758m1021m421k2745o7095q3087J05677N8734R0733L3782n5178l8764k4276
$$ 52758 11737 7316 -15429 -82524 -165611 -59934 -1200 89533 123315 68137 29373 5097
15160E097m6562k5905L8424M0492j28j9571j4685K0524K863K4628p693l2699M7271
$$ 5097 -41465 -67370 -28946 11546 11418 -8153 -22838 -2314 549 25177 17484 -15215 32056
15147C2056O2375l8653m3522p2844j6093N0523r2597K3348J7978K5560K7493k7754
$$ 32056 94431 55778 12256 -60588 -76681 -26158 -118755 -95407 -77429 -51869 -24376 -52130
15135e2130M670r43L2711N8689k2513j47365l2243N9109O9200k1636M1431l0376
$$ -52130 -47460 -48403 -15692 42997 20484 -126881 -159124 -100015 -30815 -52451 -11020 -41396
15123d1396K5324l157M0357m2853p530P054K1590Q6447N2471l3893k06302j31115
$$ -41396 -16072 -19229 21128 -21725 -29255 -22201 -611 85836 138307 104414 -101888 -233003
15111b33003j6750K9819M6947k2721q3180k1759J06766J60274Q9164o3486j20896
$$ -233003 -249753 -219934 -172987 -195708 -278888 -300647 -193881 -33607 55557 -7929 -128825
15100a28825m0076J06819N3722j38260M9126L9287L9694o6915M41P3371J1628
$$ -128825 -168901 -62082 -8360 -146620 -97494 -58207 -18513 -85428 -84987 -11616 12
15089A2j01186k9314L2996N671M7263j1069Q356K7016K3476L6282p1894j5605
$$ 12 -101174 -130488 -97492 -91821 -44558 -55627 -47271 -20255 3221 39503 -32391 -47996
15077d7996P290o9552j1270N9379l1977K6681J1955N2999N0970J761r2668J3681
$$ -47996 -40706 -110258 -121528 -62149 -94126 -67445 -55490 -2491 48479 50240 -42428 -28747
15065b8747M8109K0966J11528o8983j14341q52m3620j8252M4181O9646P0523k0709
$$ -28747 19362 40328 151856 82873 -31468 -32320 -75940 -94192 -50011 19635 90158 69449
15053F9449m5340j1126r2538l4787M9375p616J8739m5718M1606J05255O9887R189
$$ 69449 24109 12983 -79555 -114342 -64967 -72583 -53844 -99562 -57956 47299 117186 126375
15041A26375m4525n3073k1938P590L945k3029m4306Q8813j9689n8843j14810k7940
$$ 126375 81850 28777 6839 14429 18374 -4655 -48961 39852 20163 -38680 -153490 -181430
15029a81430Q6958J05160k0636N886m1103J5411O2750l8734q9453J29184L7761
$$ -181430 -94472 10688 -9948 -4062 -45165 -29754 32996 -5738 -95191 33993 71754
15018G1754N7808n252l4645M0755R496j35414j9711l1787j10972Q396L3383N7377
$$ 71754 129562 124310 89665 130420 139916 4502 -15209 -46996 -157968 -149572 -116189 -58812
15006e8812N5696j6238l1177j23093o0556J22996j0826L2894J1586m4502j8959
$$ -58812 -3116 -19354 -50531 -173624 -234180 -111184 -122010 -89116 -77530 -122032 -140991
14995a40991M6929J2618L1139K4415N9697j6019j0587K9975O7767o44q5614P5105
$$ -140991 -94062 -81444 -50305 -25890 33807 17788 7201 37176 104943 104299 18685 93790
14983I3790J50024Q1029K6314o8131j8553p2154o4465n6517P043N2143l7840L4276
$$ 93790 243814 324843 351157 283026 264473 192319 127854 71337 78380 130523 92683 126959
14971A26959j8265L8034q2912o63k0742m8910l4561r444Q5335J64637j1375j20168
$$ 126959 108694 146728 63816 63153 42411 -6499 -41060 -50504 34831 199468 188093 67925
14959F7925m5684j5922j1121j620M1708j09469j7063n2814m6515n8772K0275J68807
$$ 67925 22241 6319 -4802 -6422 35286 -74183 -91246 -144060 -190575 -249347 -229072 -60265
14947f0265J17243l4773L5081K3188q5138o9345Q7880J06637K3881o9189q3838
$$ -60265 56978 22205 57286 80474 -4664 -74009 13871 120508 144389 75200 -8638
14936h638k1553o9975o6350M0131o3126r7273J03571J58777Q4674K8362o0343
$$ -8638 -30191 -100166 -166516 -126385 -189511 -286784 -183213 -24436 60238 88600 28257
14925B8257n1052j6532J02064Q3525p5930q0859p0177n3518n123q1402O6786J08225
$$ 28257 -22795 -39327 62737 146262 70332 -10527 -80704 -134222 -139345 -220747 -153961 -45736
14913d5736K5366O0524k020n2596p6748l6950L4854N543k9839K7022K8126q287
$$ -45736 -20370 40154 38134 -14462 -91210 -128160 -93306 -87763 -117602 -90580 -62454 -70741
14901g0741n6292k9956P2487k402j0411l1323q028J2616P157k1617j6938N5242
$$ -70741 -127033 -156989 -84502 -86904 -97315 -128638 -136666 -124050 -116893 -138510 -155448 -100206
14889a00206Q3370k8923j03101K5872k602j1254L4120m66N9943Q3617r0982j259
$$ -100206 -16836 -45759 -148860 -122988 -125590 -136844 -102724 -103190 -43247 40370 -50612 -51871
14877e1871Q5875K5870p2433j02617m9799R1407R0419q3652j7402J01048r591
$$ -51871 34004 59874 -12559 -115176 -164975 -73568 16851 -66801 -84203 16845 7254
14866G254J0999M1350r7153m4151R0571K4695k832n7539P8688j9847n8422l1863
$$ 7254 18253 59603 -37550 -81701 8870 33565 30733 -26806 51882 32035 -26387 -58250
14854e8250k6257l3887J28902R7924o0520r6029j4633N3176q3458k9284L9345
$$ -58250 -84507 -118394 10508 108432 47912 -48117 -62750 -9574 -93032 -122316 -82971
14843h2971N0931o0684j11828K1582k1888p9016M7564O6669J3555R7800l207o4574
$$ -82971 -32040 -92724 -204552 -182970 -204858 -283874 -236310 -169641 -156086 -58286 -61493 -126067
14831a26067L0378L6470R449k8364M8354k2277m6076J00110l0115l20N2625j43621
$$ -126067 -95689 -59219 -49770 -78134 -29780 -52057 -98133 1977 -28138 -28458 24167 -119454
14819a19454p5635O0519O4224K5182k0990n6009N1593M5897J6743N8655j7774
$$ -119454 -195089 -134570 -70346 -45164 -66154 -122163 -70570 -24673 -7930 50725 32951
14808C2951L4822j6712n4276r1557R011P3522m5300N598M0206J6199L4439j39289
$$ 32951 67773 51061 -3215 -94772 -85761 -12239 -57539 -51941 -11735 4464 38903 -100386
14796a00386k6804J6496M2023l2995r1436l5121J77475M0789j7140k4035M227
$$ -100386 -127190 -110694 -68671 -101666 -193102 -228223 -50748 -9959 -27099 -51134 -46907
14785d6907L2365M8970P0911P3626K3870l890j62136j14714O8516N6094n1839
$$ -46907 -14542 34428 105339 178965 202835 198945 36809 -77905 -9389 46705 -5134
14774e134j4625L2198m4582K7855O7954K2890N774o2593j8364o6289o5510J11103
$$ -5134 -19759 12439 -32143 -4288 63666 86556 92330 29737 11373 -54916 -120426 -9323
14762i323K6561p9875K8508K9258l5832J5259J5378M929O4208j12772j04930M8830
$$ -9323 17238 -62637 -34129 -4871 -40703 -25444 -10066 -5137 59071 -53701 -158631 -109801
14750a09801M0282K2507N002j9335Q3392P9019K2189k9380o9024l2466J23338
$$ -109801 -69519 -47012 -42010 -61345 22047 101066 123255 93875 24851 -7615 115723
14739A15723j03060j55062K1812J9784K3544p3877O5639P1681m0862k1529N623
$$ 115723 12663 -142399 -120587 -100803 -77259 -151136 -85497 -13816 -54678 -76207 -70584
14728g0584O0808k574O2248P8580j21417k0287N5905k6243J2993Q688p2691k1227
$$ -70584 -9776 -12350 49898 128478 7061 -13226 42679 16436 29429 38117 -34574 -55801
14716e5801L4071o7141K0820m811J6197n3396L591M798p0394m5269N9813J71813
$$ -55801 -21730 -88871 -68051 -72862 -56665 -110061 -106470 -101672 -172066 -217335 -157522 14291
14704A4291l4169M6557k2937j17792O6942K7564n8092p4288M9291M1402q00R64
$$ 14291 -19878 26679 3742 -114050 -47108 -19544 -77636 -151924 -102633 -61231 -62031 -61067
14692f1067j6121J9861l1351J0467p5022q0218L2952R701m1228N7552P4340R0046
$$ -61067 -77188 -57327 -88678 -78211 -153233 -233451 -200499 -190798 -232026 -174474 -100134 -10088
14680a0088l222l7430n0169J4241N468j7958m770L0149n671o6779m1676Q9521
$$ -10088 -13310 -50740 -100909 -86668 -81200 -99158 -103928 -73779 -79450 -146229 -187905 -98384
14668i8384J7351J6716o0252K2401N7543O2597M4523j4878o5179M217K4792m564
$$ -98384 -81033 -64317 -124569 -102168 -44625 17972 62495 47617 -17562 -13345 11447 6883
14656F883j223O0981l464n2290k4784m2027n0407k0266m6210R8215N4786K3820
$$ 6883 5660 66641 63177 10887 -13897 -55924 -106331 -126597 -172807 -74592 -19806 4014
14644D014j9344q2651m6066k6155R2977j951p3220K8948P8166N6725M4849J9551
$$ 4014 -15330 -97981 -144047 -170202 -77225 -79176 -152396 -123448 -45282 11443 56292 75843
14632G5843P0172K3902j6862r916k4517n268k6080j3436j18791k3725L4943J00902
$$ 75843 146015 169917 153055 143139 118622 113354 87274 73838 -44953 -68678 -33735 67167
14620F7167n0434J9722K1354m4761q3977p3646n1739P7516N1253p2045O6070p381
$$ 67167 16733 36455 57809 13048 -70929 -144575 -196314 -118798 -67545 -139590 -73520 -80901
14608h0901k2943M8568l4128o7379K8882O2500L6203L897R4158J9972q9105l8470
$$ -80901 -103844 -55276 -89404 -156783 -127901 -65401 -29198 -25301 68857 88829 -276 -38746
14596c8746n712j6370j5309J16489o3559l2491P9119r4984k514L7862j3119K251
$$ -38746 -44458 -60828 -76137 40352 -23207 -55698 23421 -71563 -74077 -36215 -49334 -47083
14584d7083M4843K6170O1918O0062j1362o5559k0429M8127r034n6298j03588K6689
$$ -47083 -2240 23930 85848 145910 134548 68989 48560 96687 87653 31355 -72233 -45544
14572d5544j0533p7950j7649R0971J2431N0695P9144m4578j01073j06417l9309
$$ -45544 -56077 -134027 -151676 -60705 -48274 2421 81565 36987 -64086 -170503 -209812
14561b09812Q0103R6184L5574R259k1113m4358j1923L4440j8628j5004p04Q6118
$$ -209812 -129709 -33525 2049 11308 -9805 -54163 -66086 -31646 -50274 -65278 -65982 20136
14549B0136J13442l1738l5161j0493K3731J6875J6939r9688k6297j7403p0447
$$ 20136 133578 101840 66679 56186 79917 96792 113731 14043 -12254 -29657 -100104
14538a00104l3123l0035M198J39351o488l8295o5573k7545m5804L3466Q3301R3638
$$ -100104 -133227 -163262 -159064 -19713 -26201 -64496 -130069 -157614 -203418 -169952 -86651 6987
14526F987N51O2020K8831k0897J979k2296p1583J9645O6320j9745k7251p7451
$$ 6987 7538 69558 98389 77492 79471 57175 -14408 5237 71557 51812 24561 -52890
14514e2890n7841m991K1958q0831n8294O4006J21048Q1876o9604m0771l8064L1230
$$ -52890 -110731 -115722 -93764 -174595 -232889 -168883 -47835 34041 -35563 -76334 -114398 -83168
14502h3168O8845O5690j10292q8315R5673J02830J10794L6797j11036j22360n6412
$$ -83168 -14323 51367 -58925 -147240 -51567 51263 162057 198854 87818 -34542 -90954
14491i0954M4309M2435J4140j8381j62386R308O253j4634O7864L0939R791N0902
$$ -90954 -46645 -4210 9930 -8451 -170837 -161529 -155276 -169910 -102046 -71107 -61316 -10414
14479a0414l6071o451J3868p9023M1299P7366j7025m9741M9125J01226m7750k3171
$$ -10414 -46485 -52936 -39068 -118091 -76792 574 -16451 -66192 -17067 84159 36409 13238
14467A3238L092N9007p5508l3798M1596P815J611K0803k01424L9451J00320K5571
$$ 13238 16330 75337 -171 -33969 7627 15442 17053 37856 -163568 -124117 -23797 1774
14455A774L2432M6550j4425k4585m9731P7135n0330n6658n2969m1575O4564l6071
$$ 1774 34206 80756 66331 41746 -7985 69150 18820 -37838 -90807 -132382 -67818 -103889
14443a03889K2188N4695L9638l4950j8689r872k2883j3292Q3846J34161j5794
$$ -103889 -81701 -27006 12632 -22318 -41007 -50879 -73762 -87054 -3208 130953 115159
14432A15159m8965q5121J01698L1173m8467M2107K1790N9208l2857r9738r2335
$$ 115159 66194 -18927 82771 113944 65477 107584 129374 188582 155725 55987 -36348
14421c6348m819N6360P7753j03411J8635K9040l2576o4080l9712m7161O77Q0270
$$ -36348 -41167 15193 92946 -10465 8170 37210 4634 -59446 -99158 -146319 -145642 -65372
14409f5372R4892K4192j542k0240Q653m0071J8246n0996O7377o9895l1142Q2151
$$ -65372 29520 53712 52170 31930 40583 512 18758 -32238 35139 -34756 -65898 16253
14397A6253m4456k9719M2570N5461N3311p5955k8577J0647J256N923J9954P0843
$$ 16253 -28203 -57922 -15352 40109 93420 17465 -11112 -465 791 6714 26668 97511
14385I7511Q241p0874p2870o0779j5966J16407L5437l3747j23768p6479J9623
$$ 97511 105752 34878 -37992 -98771 -114737 1670 37107 3360 -120408 -196887 -177264
14374a77264M5867l3740O7491K2719M9045J20037m2598j9645l6057j12648o2656
$$ -177264 -131397 -165137 -97646 -74927 -25882 94155 51557 31912 -4145 -116793 -179449
14363a79449k0304l4439m3292R4487Q8928J69110N3367p6793o7684k3684m4871
$$ -179449 -199753 -234192 -277484 -182997 -94069 75041 128408 51615 -16069 -39753 -84624
14352h4624P8310N0992j0431K9482N568l2593m8896m5006N107O8461k3491o0019
$$ -84624 -6314 44678 34247 63729 69297 36704 -12192 -57198 -52091 16370 -7121 -67140
14340f7140L5504k2566l1972Q556O8869j4641M769L5548L1802j3606j32819j24697
$$ -67140 -31636 -54202 -86174 -77618 -8749 -23390 -18621 16927 48729 35123 -97696 -222393
14328b22393O1774J1405M6158M1450l7938o1377q1970O3480K66Q7613M6169q734
$$ -222393 -160619 -149214 -103056 -61606 -99544 -160921 -242891 -179411 -179145 -91532 -45363 -54097
14316e4097K4477L0686k0496j7801n0681o7150k8160J8113J28096P6390K5473
$$ -54097 -29620 1066 -19430 -37231 -87912 -155062 -183222 -165109 -37013 39377 64850
14305F4850p3999m989l478l9644L012j5558m1008K9797j0385M9621J47093r5245
$$ 64850 -9149 -14138 -17616 -57260 -54248 -69806 -110814 -81017 -91402 -41781 105312 10067
14293A0067r8921r943L2390k8170J8375L9506N4062l231K7197K8725j4324n4844
$$ 10067 -88854 -98797 -66407 -94577 -76202 -36696 17366 14135 41332 70057 55733 889
14281H89L0162q6765m8288K3910J5952M4982O7669J11840M144m6212P275N7971
$$ 889 31051 -55714 -104002 -80092 -64140 -19158 48511 160351 164495 118283 125558 183529
14269A83529p6719o9414j7556J35936Q4070j4764r1720N8672K8054j02953Q593
$$ 183529 106810 37396 19840 155776 239846 225082 133362 192034 220088 117135 125728
14258A25728l3157j6517J21170J3630n8221J5622P2254R059j03874l7092L592
$$ 125728 92571 76054 197224 210854 152633 168255 240509 249568 145694 108602 112194
14247A12194P761n6625j28310K5039Q7178O5864M1707k837J8336j1348j2942k4672
$$ 112194 119955 63330 -64980 -39941 47237 113101 154808 151971 170307 158959 146017 121345
14235A21345N7217J49707r7161J4749P9821j08301j65502k3141O6304J4298N0712
$$ 121345 178562 328269 231108 245857 325678 217377 51875 28734 95038 109336 160048
14224A60048J0277L1274n9450r6796o5273j36555p0183R6579O8581J0721L6221
$$ 160048 170325 201599 142149 45353 -19920 -156475 -226658 -130079 -61498 -50777 -14556
14213a4556m9180j30754J16919J21528m8446p9818L8360J02507L7260M2126L7919
$$ -14556 -63736 -194490 -77571 43957 -4489 -84307 -45947 56560 93820 135946 173865
14202A73865J0287q354j8313k9539L3357k1300j07556N136N5323L1260R5777K3520
$$ 173865 184152 175798 157485 127946 161303 140003 32447 37583 92906 124166 219943 243463
14190B43463J3750q1487m6383O7173j4380o9741n3554j25499l278O4218r43L1174
$$ 243463 257213 175726 129343 196516 182136 112395 58841 -66658 -69936 -5718 -6661 24513
14178B4513R0458L4254n2283j13178o7984P5835M5156p144m2752J04274J04797
$$ 24513 114971 149225 96942 -16236 -84220 -8385 36771 29627 -13125 91149 195946
14167A95946m4634p067j08959j1406o7748R5155M0952L2806J5438j3758O64l709
$$ 195946 151312 144245 35286 23880 -43868 51287 92239 125045 140483 126725 127389 123680
14155A23680L5703K0695k5601r118O3580r2439m9235m0988j7780o261N6781K5731
$$ 123680 159383 180078 154477 145359 208939 116500 67265 26277 8497 2236 59017 84748
14143H4748K6103m3515k5683n0510o9474N1891K7049l4411O4105K7982j00278
$$ 84748 110851 67336 41653 -8857 -78331 -26440 609 -33802 30303 58285 -41993
14132d1993J305m3067L117L6703j6350L4590M4294k0096K460j840Q964M4393k7815
$$ -41993 -40688 -83755 -80638 -43935 -60285 -25695 18599 -1497 963 -877 8087 52480 24665
14119B4665j5756m9319k1581K6937N3428m2020k1165J4183m9638j04379r272n8498
$$ 24665 8909 -40410 -61991 -35054 18374 -23646 -44811 -30628 -80266 -184645 -193917 -252415
14107b52415m9701M9611J65972P8808P567m8091k7268J5249j2706J8686K7186
$$ -252415 -302116 -252505 -86533 -7725 -158 -48249 -75517 -60268 -72974 -54288 -27102
14096b7102K1043O8709q5809l7242j30954m2554Q7936P0862O4396j3280J18432
$$ -27102 -6059 62650 -23159 -60401 -191355 -233909 -145973 -75111 -10715 -23995 94437
14085I4437l787k355K2970K7175p5792m1680J0230l8288K3540k3584j4577o2044
$$ 94437 90650 88295 111265 138440 62648 20968 31198 -7090 16450 -7134 -21711 -83755
14073h3755L8231O1242K4567L8256k8798j65j05428o8869M1275N5490j1532j5873
$$ -83755 -45524 15718 40285 78541 49743 49578 -55850 -124719 -83444 -27954 -39486 -55359
14061e5359L5966K1710j395k6178K6964O5223k0112j23712n2411K4871J13703
$$ -55359 -19393 2317 922 -25256 1708 66931 46819 -76893 -129304 -104433 9270
14050I270K9421p8612n096Q9370N1153l929K7064j01542m9600L4045N3621q571
$$ 9270 38691 -39921 -45017 44353 95506 91577 118641 17099 -32501 1544 55165 46594
14038D6594J0222m9382K6785K8831r6584k2270j0181q2054L9740Q1169J55367
$$ 46594 56816 7434 34219 63050 -33534 -55804 -65985 -148039 -108299 -27130 128237
14027A28237K4838j00807n6694K4203o8548j01209K3946J06499L4568k7218O700
$$ 128237 153075 52268 -4426 19777 -48771 -149980 -126034 -19535 15033 -12185 -5485
14016e485M6897P4729L9919r218j44040q2935J9978R764j4600L1170P4907L42
$$ -5485 41412 116141 156060 146842 2802 -80133 -60155 -50391 -64991 -33821 41086 41428
14004D1428p4681o5038O6094N6267Q5856j949K7782P911l1628j586L9754J5232
$$ 41428 -33253 -98291 -32197 24070 109926 107977 135759 143670 112042 110456 150210 165442
13992A65442q9127j33190o3002k92L022l2573L9038L1607Q0520Q3909N2112O6734
$$ 165442 76315 -56875 -119877 -120169 -117147 -149720 -110682 -79075 1445 85354 137466 204200
13980B04200p8583j22504j373P220K8243Q1048j8079L3862L4235n3510J0470k3463
$$ 204200 125617 3113 1740 8960 37203 118251 100172 134034 168269 114759 125229 101766
13968A01766J6787P3628m106j7421N0872j6859r2444k1878N4180R4209n1293q0652
$$ 101766 118553 192181 188075 170654 221526 204667 112223 90345 144525 238734 187441 106789
13956A06789K7231J11904J93140J31449j4537l6574P588P100M7646l6441J3740
$$ 106789 134020 245924 439064 570513 555976 519402 526990 534090 581736 545295 559035
13945E59035o2937n3786J0871l7074p7520M2451J28939J09865M9486J1782l7110
$$ 559035 496098 442312 453183 416109 338589 381040 509979 619844 669330 681112 644002
13934F44002j6476L0884j3551J8545P4609O1434k1791o4215J22293L2105r6897
$$ 644002 627526 658410 644859 663404 738013 799447 777656 713441 835734 867839 770942
13923G70942k4572p220L0067m151p1733r8437N1379L9722P806m3743j392l6957
$$ 770942 746370 739150 769217 765066 693333 594896 646275 685997 693803 650060 648668 611711
13911F11711p325R5555K436p5960n793o0629j04587O9215N9288M0636K3685L1360
$$ 611711 604386 699941 702377 626417 620624 559995 455408 524623 583911 624547 648232 679592
13899F79592J1094K9348J10772N176l2889M565n1235j04930J0136m7324k2456
$$ 679592 690686 720034 830806 835982 803093 807658 756423 651493 661629 614305 591849
13888E91849j33392q0627L161j42738n4878O4539l006o0321l861k1840M1640n663
$$ 591849 458457 377830 380991 238253 183375 247914 244908 184587 180726 158886 200526 194863
13876A94863j18995j33J04986k3933k2975J9546j2991O064Q1689J34416L1571
$$ 194863 75868 75735 180721 156788 133813 153359 140368 146432 228121 362537 394108
13865C94108L7299M2013j365P3733R1998j9257l3001L3101J8669R28P4946J8274
$$ 394108 431407 473420 472055 545788 637786 618529 585528 618629 637298 638226 713172 731446
13853G31446r9164Q079p4033j31921l3919P3900N5520L7169R4808O2000P0556
$$ 731446 632282 640361 566328 434407 400488 474388 529908 567077 661885 723885 794441
13842G94441q352j824P2822o614r0744j9310n6748L6517J12522J31711N9531n2888
$$ 794441 786089 784265 857087 850473 759729 740419 683671 720188 832710 964421 1023952 971064
13830I71064n6165p2770k1086o5666m6113j3013K0649j3864l5537N6375j2139
$$ 971064 914899 842129 821043 755377 709264 696251 716900 703036 667499 723874 711735
13819G11735j11407K6330J42879M8650j17771j18718o099K3970N2374L7368J20237
$$ 711735 600328 626658 769537 818187 700416 581698 575599 599569 651943 689311 809548
13808H09548O5596N4007l9898n1773l0577j36514k1491m314p4052m6889j07659
$$ 809548 875144 929151 889253 837480 806903 670389 648898 644584 570532 523643 415984
13797D15984K6073j15518n194m5860m6153k503O4142p7805j07568M2039k0100
$$ 415984 442057 326539 321345 275485 229332 226829 290971 213166 105598 147637 127537
13786A27537J8176O967J848K09815K3741l5307j40844M7207K2440j44372n9598
$$ 127537 145713 152680 154528 364343 388084 352777 211933 259140 281580 137208 77610
13775G7610O7535k5667r5264L8755R2648k735J605J0660l5800m0031m1028J768
$$ 77610 145145 119478 24214 62969 155617 152882 154487 165147 129347 89316 48288 50056
13763E0056l5386m4875L6855J04965k0044j6766J51m9085L5315J6182p8076q271
$$ 50056 14670 -30205 6650 111615 91571 74805 74956 25871 61186 77368 -708 -8979
13751h979J10666J8063k0417N2573N0528K6538O6462m6725l4473n7762L6540q012
$$ -8979 101687 119750 99333 151906 202434 228972 295434 248709 214236 156474 193014 185002
13739A85002k5326o6060L3677N4827K1790o7995n4018r58K0395r4251J3563J04091
$$ 185002 159676 93616 127293 182120 203910 135915 81897 80939 101334 7083 20646 124737
13727A24737R818J8349k2843j6282Q9533P6998J2243k5515M3998N3687j11203
$$ 124737 134555 152904 130061 113779 203312 280310 292553 267038 311036 364723 253520
13716B53520n1959j3807K4032K9438L8347M2289M9273j05785l8815n721M6362
$$ 253520 201561 187754 211786 241224 279571 321860 371133 265348 226533 220812 267174
13705B67174P0561j8409p4014m3330p369J1961J7477L8000j9008j7064j9225p785
$$ 267174 337735 319326 245312 201982 194613 206574 224051 262051 243043 225979 206754 198969
13693A98969J76023J10417L2368o2438k5258P1800r089O062q1853r0042K8099
$$ 198969 374992 485409 517777 455339 430081 501881 492792 498854 417001 326959 355058
13682C55058M9627O2529k0707o1628m297Q590q1099l5028N7155O5910N6216o6755
$$ 355058 404685 467214 446507 384879 380582 389172 308073 273045 330200 396110 452326 385571
13670C85571j28117L1354M2150J2819j0682m4354J04028R1809l7420j27085m7729
$$ 385571 257454 288808 330958 343777 333095 288741 392769 484578 447158 320073 272344
13659B72344R3194K7987M5588N7958M975p751o7265j8575q8173j30033k8175M6793
$$ 272344 365538 393525 439113 497071 502046 494295 427030 408455 320282 190249 162074 208867
13647B08867O724J68413N5661p6547j06519R8794J26284J9211n2547m766O8073
$$ 208867 215591 384004 439665 363118 256599 355393 481677 500888 448341 443575 511648
13636E11648Q9949o2037L0579p8543j19320j5091K5411j4077N1399J3452M1446
$$ 511648 601597 539560 570139 491596 372276 357185 382596 368519 419918 433370 474816
13625D74816N4198M6166j5566m4481o2860N1724r832r4624K0152M8338M2575O8849
$$ 474816 529014 575180 559614 515133 452273 503997 494165 399541 419693 468031 510606 579455
13613E79455K6559N2864r3441n6254J6560j203J23776J31842O8376L0041L5411
$$ 579455 606014 658878 565437 509183 525743 524540 648316 780158 848534 878575 913986
13602I13986n560l1389l3555M799r762M6877n0296K3511R1216r9630k1383J5447
$$ 913986 908426 877037 843482 848281 838519 885396 835100 858611 949827 850197 828814 844261
13590H44261N0102m4636m7373J1246M1273L2157R0039O3364L4204L9346j2473
$$ 844261 894363 849727 802354 813600 854873 887030 977069 1040433 1074637 1113983 1101510
13579A101510k487P759j26527p1182j6282l5197K1859Q033P0044J30319P4467
$$ 1101510 1099023 1106782 980255 909073 892791 857594 879453 887486 957530 1087849 1162316
13568A162316k0543q338L4803j2718Q971K8731O5288L944Q898M8718j8487N1853
$$ 1162316 1141773 1133435 1168238 1155520 1164491 1193222 1258510 1262454 1271352 1320070 1301583 1353436
13556A353436o6885o113M6965k0146o6623m2038R7270J41502N5505k5926r0898
$$ 1353436 1286551 1280438 1327403 1307257 1240634 1198596 1295866 1437368 1492873 1466947 1376049
13545A376049o8396j3318J08913J0364N5943L9233Q2235N8402L9452P3974J33951
$$ 1376049 1307653 1294335 1403248 1413612 1469555 1508788 1591023 1649425 1688877 1762851 1896802
13534A896802J20863l7287O7501L7955M1663O2041J31263Q1024O1170J12596R835
$$ 1896802 2017665 1980378 2047879 2085834 2127497 2189538 2320801 2401825 2462995 2575591 2585426
13523B585426K2702O7974Q843J25797J47353J45336J70008J91784J68232J41034
$$ 2585426 2608128 2676102 2684945 2810742 2958095 3103431 3273439 3465223 3633455 3774489
13513C774489J46362P9916K12831K11485K07374L74048L01938L29344K98553K91419
$$ 3774489 3920851 4000767 4213598 4425083 4632457 5006505 5308443 5637787 5936340 6227759
13503F227759L09682K90410L20883M46845N81345P18311P44528Q75302J099752
$$ 6227759 6537441 6827851 7148734 7595579 8176924 8895235 9639763 10515065 11614817
13494A1614817J435480J623311J935656K474533L064112M029573N071093O062593
$$ 11614817 13050297 14673608 16609264 19083797 22147909 26177482 31248575 37311168
13486C7311168O758564O691771N196331K761490N23136k27902M26981J741591
$$ 37311168 44069732 50761503 55957834 58719324 59242460 59014558 59441539 61183130
13478F1183130K772960K830679J772249O9566j385571j980978j441572k8907J944352
$$ 61183130 63956090 66786769 68559018 68628584 67243013 65262035 63820463 63791556 65735908
13469F5735908M589382P965974J1966155J6245185J9223534J8387494J1008422
$$ 65735908 70325290 78291264 90257419 106502604 125726138 144113632 155122054
13462A55122054j943064j3281791j6320837j3252810q117512l058751J043572
$$ 155122054 153178990 139897199 123576362 110323552 102206040 99147289 100190861
13455A00190861L710533M311014K410659j279487m965469o542554n851137l216365
$$ 100190861 103901394 108212408 110623067 109343580 104378111 97835557 91984420 88768055
13447H8768055M09638M814526J0045336J5835224K0866165K1962858J5817594
$$ 88768055 89177693 93992219 104037555 119872779 140738944 162701802 178519396
13440A78519396K325931j0513447j3352787p543064O68229Q433406J4447117J7587216
$$ 178519396 180845327 170331880 156979093 149436029 150104258 158537664 172984781 190571997
13432A90571997J6304462J0893857M141162q30542l665061p237500j3126397j9312102
$$ 190571997 206876459 217770316 221911478 221080936 217415875 210178375 197051978 177739876
13424A77739876k2840280k2487367j9579925j6197003j2917373j0308409q269518
$$ 177739876 154899596 132412229 112832304 96635301 83717928 73409519 65140001
13417F5140001o751111n448172m697658m050415l412275k755334k234351j774652
$$ 65140001 58388890 52940718 48243060 44192645 40780370 38025036 35790685 34016033
13409C4016033j427808j057006o68131k64802J72683K97611O23781J020188J416580
$$ 34016033 32588225 31531219 30863088 30598286 30770969 31068580 31692361 32712549 34129129
13400C4129129J849993K317505K952998L814554M807908N922696P477476R549152
$$ 34129129 35979122 38296627 41249625 45064179 49872087 55794783 63272259 72821411
13392G2821411J2071101J5265466J8720536K1674437K3001897K1279295J6346317
$$ 72821411 84892512 100157978 118878514 140552951 163554848 184834143 201180460
13385B01180460R870730N062998K636067K26542m947390j1968914j6448144j5893678
$$ 201180460 211051190 216114188 218750255 218976797 214029407 202060493 185612349 169718671
13377A69718671j1061846l823471M012882J0462119J2089279N529318q281026
$$ 169718671 158656825 154833354 158846236 169308355 181397634 186926952 178645926
13370A78645926k0366802k2797394j8203371j2123405o696734k121874J537230
$$ 178645926 158279124 135481730 117278359 105154954 98458220 96336346 97873576
13363I7873576M504508N904273N254990K413107j464058m140411m301861j987955
$$ 97873576 102378084 108282357 113537347 115950454 114486396 110345985 106044124 104056169
13355A04056169J743499O529448J1511643J5231269J5267091Q688359l823398
$$ 104056169 105799668 112329116 123840759 139072028 154339119 163027478 159204080
13348A59204080j5569820j9915869j7830424j3346707r167534n870498l079030
$$ 159204080 143634260 123718391 105887967 92541260 83373726 77503228 74424198
13341G4424198r80244O60948J466265J259230K1433j476453k760909l161867k308279
$$ 74424198 73443954 74104902 75571167 76830397 76851830 75375377 72614468 69452601 67144322
13332F7144322j013202n2690R6108j068097l379405n756480o871180o659400n822064
$$ 67144322 66131120 66078430 66174538 65106441 61727036 55970556 49099376 42439976 36617912
13323C6617912m797375l830053l076981k533849k139359j739918j463481j347136
$$ 36617912 31820537 27990484 24913503 22379654 20240295 18500377 17036896 15689760
13315A5689760j126616q59409p54546o87912p06902m17434m14828m87904l96312
$$ 15689760 14563144 13703735 12949189 12261277 11554375 11136941 10722113 10234209 9837897
13306I837897l99698l80484l90382m34916k50105k48553l63905k56773j79920
$$ 9837897 9438199 9057715 8667333 8232417 7982312 7733759 7369854 7113081 6933161
13297F933161k47814k72854k60796k00091k58296l01000k58650n1102j45885r8938
$$ 6933161 6685347 6412493 6151697 5951606 5693310 5392310 5133660 5082558 4936673 4837735
13287D837735k5112l1159o6338p9856j62380j13117j72018j17892p8108k6746
$$ 4837735 4812623 4781464 4715126 4635270 4472890 4359773 4187755 4069863 3991755 3965009
13277C965009j9105q6017l5184m5855q0233j3647P0439k7712j23460J0062o1691
$$ 3965009 3945904 3859887 3824703 3778848 3698615 3684968 3755407 3727695 3604235 3614297 3552606
13266C552606r531L3625j1039p9092j71486m6014k1891k04410j70722N75p339
$$ 3552606 3543075 3576700 3565661 3486569 3315083 3269069 3247178 3042768 2872046 2872621 2865282
13255B865282p2483r7709j2233o4683p5084l7346J10815o9438n973j319m5051
$$ 2865282 2792799 2695090 2682857 2618174 2543090 2505744 2616559 2547121 2541148 2539829 2494778
13244B494778n4164j97P570m6969j0548L490L0363J8687p0937j00452j40774o3716
$$ 2494778 2440614 2440417 2447987 2401018 2390470 2393960 2424323 2443010 2372073 2271621 2130847 2067131
13232B067131m1603L2128K6831K0362k1415l451j41248k2804K8392j20386k1529
$$ 2067131 2025528 2057656 2084487 2104849 2083434 2079983 1938735 1915931 1944323 1823937 1802408
13221A802408l9507m7516j0419Q4827j16258j66489m8630L8865k5370K0517j1237
$$ 1802408 1762901 1715385 1704966 1789793 1673535 1507046 1458416 1497281 1471911 1492428 1481191
13210A481191K1281m0549j2671L4866J4462M8895Q3844J457j06889n6440l2523
$$ 1481191 1502472 1461923 1449252 1484118 1498580 1547475 1631319 1632776 1525887 1469447 1436924
13199A436924P8377N1695j0882P2822j5421j75919k8751R0822j3620l694p0605
$$ 1436924 1515301 1566996 1556114 1628936 1613515 1437596 1408845 1499667 1486047 1482353 1411748
13188A411748j1033r925J923M3457k9826p9439m3571n0046J1516k358N0246m8374
$$ 1411748 1400715 1390790 1392713 1436170 1406344 1326905 1283334 1233288 1244804 1242446 1292692 1244318
13176A244318m5709N2928n3874P4803J6997q4718k6797P943o85k2641L0778L2953
$$ 1244318 1198609 1251537 1197663 1272466 1289463 1204745 1177948 1185891 1185206 1162565 1193343 1226296
13164A226296q543o5088M1809K5860q1027r9511j01716K6209J23505M3656M668
$$ 1226296 1217753 1152665 1194474 1220334 1139307 1039796 938080 964289 1087794 1131450 1136118
13153A136118O5777K1119K2970j6182k1863j9538n2609k6571P2605n7519N9148
$$ 1136118 1201895 1223014 1245984 1229802 1207939 1188401 1135792 1109221 1181826 1124307 1183455
13142A183455R9978J9346p8478l2760O3289O6219o2695j19480M8895P4725N315
$$ 1183455 1283433 1302779 1224301 1191541 1254830 1321049 1258354 1138874 1187769 1262494 1267809
13131A267809p8062n5755j03938k5625O541M5543N8652M9099J51504r4012p4391
$$ 1267809 1189747 1133992 1030054 1004429 1010970 1056513 1115165 1164264 1315768 1221756 1147365
13120A147365n1392p260j9964q8947l0024O1037Q1466N077m8232l2925o2237L1469
$$ 1147365 1095973 1088713 1068749 979802 949778 1010815 1092281 1097358 1049126 1016201 953964 985433
13108I85433J58169Q8391l5234m3349N2226K1444L5070Q6855L4568j78964j48492
$$ 985433 1143602 1231993 1196759 1153410 1205636 1227080 1262150 1349005 1383573 1204609 1056117
13097A056117L578Q8237J00025k7374j08643r5350J2599J5322l7243j1909l3884
$$ 1056117 1059695 1147932 1247957 1220583 1111940 1016590 1029189 1044511 1007268 995359 961475
13086I61475k6340J2875q5088k0228R3428J8833N3914q091r849N5185N1841j741
$$ 961475 935135 948010 862922 842694 936122 954955 1008869 1000778 990929 1046114 1097955 1096214
13074A096214p8340K9893M6973m5344p0880K214M1179M3028k6126n976l8637R692
$$ 1096214 1017874 1047767 1094740 1049396 978516 980730 1021909 1064937 1038811 1032835 994198 1003890
13062A003890m947l3552q144M9032R6455M4646p277l6226k7033j23613r5365j1597
$$ 1003890 998943 965391 957247 1006279 1102734 1147380 1140103 1103877 1076844 953231 857866 846269
13050H46269N7618P3392O1444M948O2922n7100m3528j06119P5609J9123q2900
$$ 846269 903887 977279 1038723 1043671 1106593 1049493 1005965 899846 975455 994578 911678
13039I11678l4440j8656K3323L9101m5326M0318j809M0029J02667N2207p3084
$$ 911678 877238 858582 881905 921006 875680 915998 914189 954218 1056885 1109092 1036008
13028A036008m0869L3355M0536j0364Q2884M8351K3899P7007r5760p6466L6169
$$ 1036008 995139 1028494 1069030 1058666 1141550 1189901 1213800 1290807 1195047 1118581 1154750
13017A154750p7865N5286J08834K2444q63J1745O3702N5330k1417j02610O614
$$ 1154750 1076885 1132171 1241005 1263449 1262586 1274331 1338033 1393363 1371946 1269336 1275950
13006A275950M7501N9838J9967n943P4720O3303J09330J36535Q7508m422k437
$$ 1275950 1323451 1383289 1403256 1397313 1472033 1535336 1644666 1781201 1868709 1864287 1861850
12995A861850Q3568n4584K4636J3766L5611J4451L8541O1690P1794J30628J23445
$$ 1861850 1945418 1890834 1915470 1929236 1964847 1979298 2017839 2079529 2151323 2281951 2405396
12984B405396o0633n4077q2303j4346M1415O602r2217j1253L0645P897R90J3408
$$ 2405396 2344763 2290686 2208383 2194037 2235452 2242054 2149837 2138584 2169229 2177126 2178116 2191524
12972B191524m893J069j1228j17205j12981j17052j8024J22011Q1427M9829M5940
$$ 2191524 2186631 2187700 2176472 2059267 1946286 1829234 1811210 1933221 2014648 2064477 2110417
12961B110417m426J6545j31603n8925M0553L6670K1148p0517L7074K5976L6203
$$ 2110417 2105991 2122536 1990933 1932008 1972561 2009231 2030379 1959862 1996936 2022912 2059115
12950B059115m336J05248R9628J22147J05808n7220o8942R6708K2142p1497k9825
$$ 2059115 2054779 2160027 2259655 2381802 2487610 2430390 2361448 2458156 2480298 2408801 2378976
12939B378976Q3690k1087o6290O1162o4444J1251k4134N5362M9633J1027Q7057
$$ 2378976 2462666 2441579 2375289 2436451 2372007 2383258 2359124 2414486 2464119 2475146 2562203
12928B562203P6097Q2717L0400K7459J27458K06749O1397J58712K17968J47364
$$ 2562203 2638300 2721017 2751417 2778876 2906334 3113083 3174480 3333192 3551160 3698524
12918C698524K39487K49040K63884K72030K39659K88970L23115L97268M50623
$$ 3698524 3938011 4187051 4450935 4722965 4962624 5251594 5574709 5971977 6422600
12909F422600L60301L41662M92658O01042O85371P12991Q71636J013246J197171
$$ 6422600 6782901 7124563 7617221 8218263 8903634 9616625 10488261 11501507 12698678
12900A2698678J318020J446717J752008K042269K264970K624577K815329K988287
$$ 12698678 14016698 15463415 17215423 19257692 21522662 24147239 26962568 29950855
12892B9950855L258943L315907L099432K653713K095757J339790M79929k73783
$$ 29950855 33209798 36525705 39625137 42278850 44374607 45714397 46194326 45920543
12884D5920543r86822j568112j860919k061319j989583j960534j614244j336042
$$ 45920543 44933721 43365609 41504690 39443371 37453788 35493254 33879010 32542968
12876C2542968j044408p90751n44799l54204r889K37706N20828Q07900J072100
$$ 32542968 31498560 30707809 30163010 29808806 29798917 30036623 30557451 31365351 32437451
12867C2437451J429311J854609K267932K793808L472506M139909M928076N926851
$$ 32437451 33866762 35721371 37989303 40783111 44255617 48395526 53323602 59250453
12859E9250453P182083Q663173J0083704J1507968J2576034J2874891J2097423
$$ 59250453 66432536 75095709 85179413 96687381 109263415 122138306 134235729
12852A34235729J0356506P453681L713042n50891m510829p988043j0434097j1576337
$$ 134235729 144592235 152045916 155758958 155208067 150697238 142709195 132275098 120698761
12844A20698761j1637871j0821330r474328q282556p034832n747675m642704l733994
$$ 120698761 109060890 98239560 88765232 80482676 73447844 67700169 63057465 59323471
12836E9323471k852411k314652j627715j037432o50822j96846M15472O48215J259209
$$ 59323471 56471060 54156408 52528693 51491261 50840439 50643593 51059065 51707280 52966489
12827E2966489J924132K516998L290647M142191N203112O577120P946869R486574
$$ 52966489 54890621 57407619 60698266 64840457 70043569 76620689 84567558 94054132
12819I4054132J0726892J1692065J1959286J1309256R385978O251096K210320
$$ 94054132 104781024 116473089 128432375 139741631 149127609 155378705 157589025
12812A57589025k161033o346238r849711j2154379j3149934j3060708j2057583
$$ 157589025 155427992 149081754 139232043 127077664 113927730 100867022 88809439
12805H8809439j0672582r023034p511672o273222n213812m269592l537104k900168
$$ 88809439 78136857 69113823 61602151 55328929 50115117 45845525 42308421 39408253
12797C9408253k357755j952017j629407j423594j209927q51222m27949k62450
$$ 39408253 37050498 35098481 33469074 32045480 30835553 29984331 29556382 29293932
12789B9293932O022L50335N33443R90349J284751J566407J889285K062527K153539
$$ 29293932 29299954 29650289 30183732 31174081 32458832 34025239 35914524 37977051 40130590
12780D0130590K141779J984682J463111R14448R2631o85090j552427k539750k954380
$$ 40130590 42272369 44257051 45720162 46634610 46727241 46042151 44489724 41949974 38995594
12771C8995594l175729l309563l177727k924698k807545k470307k154123j921082
$$ 38995594 35819865 32510302 29332575 26407877 23600332 21130025 18975902 17054820
12763A7054820j631990j494242j198358j153040r61201q06007o93061o54339n52476
$$ 17054820 15422830 13928588 12730230 11577190 10615989 9809982 9116921 8462582 7910106
12754G910106m38633m18386m10508m26619l14447k54170l23125k96146j80581
$$ 7910106 7471473 7053087 6642579 6215960 5901513 5647343 5324218 5028072 4847491
12745D847491j16021j52431j80114j62015j42894k10866j60973j26162q0353O0907
$$ 4847491 4731470 4579039 4398925 4236910 4094016 3883150 3722177 3596015 3515662 3576569
12735C576569N356k42377j01538n3661r747j47270q9570n4372n9179M0132p0696
$$ 3576569 3581925 3339548 3238010 3184349 3174602 3027332 2937762 2883390 2824211 2864343 2793647
12724B793647k07837r5428k5143o1371m7701J321J5520k5000r3701j442O4435
$$ 2793647 2585810 2490382 2465239 2403868 2356167 2357488 2373008 2348008 2254307 2252865 2317300
12713B317300o4456P737L9281k3945k5374j33266l7320Q5101K094p9206N13O9006
$$ 2317300 2252844 2260581 2299862 2275917 2250543 2117277 2079957 2165058 2167152 2087946 2088459 2157465
12701B157465k0609k8486M5573k8381l3049p822p3549M485k5215m3274K4659Q1284
$$ 2157465 2136856 2108370 2153943 2125562 2092513 2084691 2011142 2015627 1990412 1947138 1971797 2053081
12689B053081L8931O5655r1855j40412r7087o8226o6905Q6501K14412P5277j01429
$$ 2053081 2092012 2157667 2065812 1925400 1828313 1760087 1693182 1779683 1994095 2069372 1967943
12678A967943q3470Q6445J23105J11989k725j637O8686q2717j44693q1203L580
$$ 1967943 1884473 1970918 2094023 2206012 2203287 2201650 2270336 2187619 2042926 1961723 1965303
12667A965303J4780O8133P3021k5453P0381k7009N9760O3188K7524N462M4230
$$ 1965303 1980083 2048216 2121237 2095784 2166165 2139156 2198916 2262104 2289628 2295090 2339320
12656B339320j11006n9314j00403q6809p3292p3225K0054r1149r9515M514l3490
$$ 2339320 2228314 2169000 2068597 1981788 1908496 1835271 1855325 1764176 1664661 1669175 1635685
12645A635685k1360K3367K4992K0482L0533K9809J01128J288j3302n2037J1197
$$ 1635685 1614325 1637692 1662684 1683166 1713699 1743508 1844636 1845924 1832622 1780585 1791782
12634A791782k3695M6876k2221M002q636J0115M3762P343K494L1593Q0974L5252
$$ 1791782 1768087 1814963 1792742 1796744 1788108 1798223 1841985 1849328 1851822 1883415 1964389 1999641
12622A999641p0361q9769j1891Q0319O3180L5605M6986r0682L9223o9566q0287
$$ 1999641 1929280 1839511 1827620 1907939 1971119 2006724 2053710 1963028 2002251 1932685 1852398
12611A852398Q390O5389L8001j19863r8992p6556J22120J24282J38112j9700l3676
$$ 1852398 1860788 1926177 1964178 1844315 1745323 1668767 1790887 1915169 2053281 2033581 1999905
12600A999905K6382l5496n9342o4309J34271J36370Q0618M4373O2089N1068j4631
$$ 1999905 2026287 1990791 1931449 1867140 2001411 2137781 2218399 2262772 2324861 2375929 2361298
12589B361298k7990k7860j05510l3886o1642o9561l4818P9354K2608j39717l6473
$$ 2361298 2333308 2305448 2199938 2166052 2104410 2034849 2000031 2079385 2101993 1962276 1925803
12578A925803J23940L5464k2103L4997O5715N3590J2546p8382K4399M3012j001
$$ 1925803 2049743 2085207 2063104 2098101 2163816 2217406 2229952 2151570 2175969 2218981 2217980
12567B217980N5381j2526J6927j3965o7716l6121Q5884J23814J7600n3060j7890
$$ 2217980 2273361 2260835 2277762 2263797 2196081 2159960 2245844 2369658 2387258 2334198 2316308
12556B316308K1474j2790k9247n8028L802M4971J7980N5589J7652M9807O1360
$$ 2316308 2337782 2324992 2295745 2237717 2241519 2286490 2304470 2360059 2377711 2427518 2488878
12545B488878j1430J18366J27405n1129L751r5959j7115P473m956R903N142n7429
$$ 2488878 2477448 2595814 2723219 2672090 2675841 2579882 2562767 2570240 2565284 2575187 2580329 2522900
12533B522900L0003k4163J23379K7193j11461r675J9569k6010P1681J38200O8882
$$ 2522900 2552903 2528740 2652119 2679312 2567851 2558176 2577745 2551735 2623416 2761616 2830498
12522B830498o957l5696k5007L2272R0965R1541k4129k4522m7132J25072O1030
$$ 2830498 2823541 2787845 2762838 2795110 2886075 2977616 2953487 2928965 2881833 3006905 3067935
12511C067935L2452l8997J1991J05776K5548M5518R1605N6482O3099N0283K3870
$$ 3067935 3100387 3061390 3073381 3179157 3204705 3250223 3341828 3398310 3461409 3511692 3535562
12500C535562k7958m7678m384L6936K0472K0255J19040P3070J0733l5246m4130
$$ 3535562 3507604 3459926 3455542 3492478 3512950 3533205 3652245 3725315 3736048 3700802 3656672
12489C656672J973Q8933R5730O3376o698M8074P9502J06494P6214o1334L3225
$$ 3656672 3658645 3747578 3843308 3906684 3899986 3948060 4027562 4134056 4210270 4148936 4182161
12478D182161J46446J3346j7080J09898Q1634P4883J13153K5628J2482K5239M2268
$$ 4182161 4328607 4341953 4324873 4434771 4516405 4591288 4704441 4730069 4742551 4767790 4810058
12467D810058K2981J8548l0358J68676J25614q689O2861O8289J24005O2550j0519
$$ 4810058 4833039 4851587 4821229 4989905 5115519 5106830 5169691 5237980 5361985 5424535 5414016
12456E414016J32430J33884L4694Q0506J30132J4345P3894J16124M3300J34060
$$ 5414016 5546446 5680330 5715024 5795530 5925662 5940007 6013901 6130025 6173325 6307385
12446F307385J83181R9240J13562P924J39691N5672N5443J34679J48729J37762
$$ 6307385 6490566 6589806 6703368 6711292 6850983 6906655 6962098 7096777 7245506 7383268
12436G383268J56330J54053J99038J30995J52348j8871K115J17198K17995J93323
$$ 7383268 7539598 7693651 7892689 8023684 8176032 8157161 8159276 8276474 8494469 8687792
12426H687792O8536K26341J31569P6614J40441J32041J23487J14678J62632J97653
$$ 8687792 8756328 8982669 9114238 9190852 9331293 9463334 9586821 9701499 9864131 10061784
12416A0061784L30607K48017K23677R6014K65559L37529K14882J80271J95336
$$ 10061784 10392391 10640408 10864085 10960099 11225658 11563187 11778069 11958340 12153676
12407A2153676K75308K19631K14130K20210K44766K17368L20742L64252L88947
$$ 12153676 12428984 12648615 12862745 13082955 13327721 13545089 13865831 14230083 14619030
12398A4619030L42585M30332L94757L05040L37819L20744L60744L57275K98760
$$ 14619030 14961615 15391947 15786704 16091744 16429563 16750307 17111051 17468326 17767086
12389A7767086L14822L54870L61722L70784L50714L62456M93282N16624N10119
$$ 17767086 18081908 18436778 18798500 19169284 19519998 19882454 20375736 20892360 21402479
12380B1402479M83012N16953N05644N98718O31849N99147O39728O20584O00802
$$ 21402479 21885491 22402444 22908088 23506806 24138655 24737802 25377530 25998114 26598916
12371B6598916P47593P67251O75336O07465Q00801Q28145P67529Q55678R92631
$$ 26598916 27346509 28113760 28789096 29396561 30197362 31025507 31793036 32648714 33641345
12362C3641345R52634J000613R44763R46767J147541R46292Q48425R24065J034059
$$ 33641345 34593979 35594592 36539355 37486122 38633663 39579955 40428380 41352445 42386504
12353D2386504J172145J014845J090431J028849J071746J163145J191925J166201
$$ 42386504 43558649 44573494 45663925 46692774 47764520 48927665 50119590 51285791
12345E1285791J223848J273564J225821J118269J070485J050161J085185J159186
$$ 51285791 52509639 53783203 55009024 56127293 57197778 58247939 59333124 60492310
12337F0492310J107346J008348J039180R16646Q66290Q58471P88886N68167N34556
$$ 60492310 61599656 62608004 63647184 64563830 65430120 66288591 67077477 67645644 68180200
12328F8180200N65252L88315L90869L52698J31896N9504L1029n1236j45049l46495
$$ 68180200 68745452 69133767 69524636 69877334 70009230 70068734 70099763 70048527 69903478 69556983
12318F9556983l25577m76309n58272o67252q15655q30128r72540q45270r05667
$$ 69556983 69231406 68755097 68196825 67529573 66713918 65883790 64911250 64065980 63160313
12309F3160313r94928j074613j066211j106633j169167j119938j140166j186879
$$ 63160313 62165385 61090772 60024561 58917928 57748761 56628823 55488657 54301778
12301E4301778j177350j145970j240134j239233j140148j087609j141535j156700
$$ 54301778 53124428 51978458 50738324 49499091 48358943 47271334 46129799 44973099
$$ [...]
##END NTUPLES=NMR SPECTRUM
##END=
