##TITLE=Analysis number 326727
Compound Code cc 04226
Book Reference 449/196
Project Code adrs
Chemist Name davee
##JCAMPDX= 6.0         $$ Bruker NMR JCAMP-DX V2.0
##DATA TYPE= NMR SPECTRUM
##DATA CLASS= NTUPLES
##ORIGIN= Bruker BioSpin GmbH
##OWNER= nmr
$$ XWIN-NMR		Version 3.5
$$ Tue Feb 20 12:13:22 2007 GMT Standard Time (UT+0h)  MAYBRIDGE\nmr@NMR_250MHZ
##.OBSERVE FREQUENCY= 250.131544655141
##.OBSERVE NUCLEUS= ^1H
##.ACQUISITION MODE= SIMULTANEOUS (DQD)
##.ACQUISITION SCHEME= undefined
##.AVERAGES= 16
##.DIGITISER RES= 18
##SPECTROMETER/DATA SYSTEM= dpx250
##.PULSE SEQUENCE= zg30
##.SOLVENT NAME= CDCl3
##.SHIFT REFERENCE= (INTERNAL, CDCl3, 0, 16.4514)
##AUDIT TRAIL= $$ (NUMBER, WHEN, WHO, WHERE, WHAT)
$$ ##TITLE= Audit trail, XWIN-NMR		Version 3.5
$$ ##JCAMPDX= 5.01
$$ ##ORIGIN= Bruker BioSpin GmbH
$$ ##OWNER= nmr
$$ C:\u/data/dgb/nmr/ADRS/1310/pdata/1/auditp.txt
$$ ##AUDIT TRAIL=  $$ (NUMBER, WHEN, WHO, WHERE, WHAT)
(   1,<2007-02-20 12:12:57.93 +000>,<MAYBRIDGE\nmr>,<NMR_250MHZ>,
      <created by zg, POWCHK disabled, PULCHK disabled
       configuration hash MD5:
       49 4B E0 1D 92 C2 6B 37 9F E6 65 BC 52 41 86 1D
       data hash MD5: 64K
       7C D8 69 E4 13 F7 1C 89 76 00 4E 7C 9D C2 28 31>)
(   2,<2007-02-20 12:13:11.89 +000>,<MAYBRIDGE\nmr>,<NMR_250MHZ>,
      <Start of raw data processing
       ef LB = 0.3 FT_mod = 6 PKNL = 1 SI = 32K 
       data hash MD5: 32K
       24 D6 5E 87 45 7C 44 26 65 C0 3A C4 21 F3 43 E3>)
(   3,<2007-02-20 12:13:13.57 +000>,<MAYBRIDGE\nmr>,<NMR_250MHZ>,
      <apk 
       data hash MD5: 32K
       A6 89 87 7B A1 BC 03 0D 04 BD 0C 67 D9 CF B4 DE>)
(   4,<2007-02-20 12:13:14.26 +000>,<MAYBRIDGE\nmr>,<NMR_250MHZ>,
      <abs ABSG = 5 
       data hash MD5: 32K
       57 90 EF 52 DA 14 7C ED 5D A4 A2 0E 7D 0E 5B 77>)
$$ ##END=
$$ 
$$ hash MD5
$$ 4C 62 56 23 0B 25 D8 27 9F 93 67 ED 9A 27 C5 99
##$RELAX= 
##$RELAX= 
##$RELAX= 
##$RELAX= 
##$RELAX= 
##$RELAX= 
##$RELAX= 
$$ Bruker specific parameters
$$ --------------------------
##$DU= <C:\u>
##$EXPNO= 1310
##$NAME= <ADRS>
##$PROCNO= 1
##$TYPE= <nmr>
##$USER= <dgb>
##$AMP= (0..31)
100 100 100 100 100 100 100 100 100 100 100 100 100 100 100 100 100 100 
100 100 100 100 100 100 100 100 100 100 100 100 100 100 
##$AQSEQ= 0
##$AQ_mod= 3
##$AUNM= <au_zg>
##$AUTOPOS= <45 >
##$BF1= 250.13
##$BF2= 250.13
##$BF3= 250.13
##$BF4= 250.13
##$BF5= 500.13
##$BF6= 500.13
##$BF7= 500.13
##$BF8= 500.13
##$BYTORDA= 1
##$CFDGTYP= 0
##$CFRGTYP= 5
##$CHEMSTR= <none>
##$CNST= (0..31)
1 1 145 1 1 1 1 1 1 1 1 1 1 1 1 1 1 1 1 1 1 1 1 1 1 1 1 1 1 1 1 1 
##$CPDPRG= <>
##$CPDPRG1= <>
##$CPDPRG2= <>
##$CPDPRG3= <>
##$CPDPRG4= <mlev>
##$CPDPRG5= <mlev>
##$CPDPRG6= <mlev>
##$CPDPRG7= <mlev>
##$CPDPRG8= <mlev>
##$CPDPRGB= <>
##$CPDPRGT= <>
##$D= (0..31)
0 1 0 0 0 0 0 0 0 0.06 0 0 0 0 0 0 0.0002 0 0 0 0 0 0 0 0 0 0 0 0 0 0 
0 
##$DATE= 1171973576
##$DBL= (0..7)
120 120 120 120 120 120 120 120 
##$DBP= (0..7)
150 150 150 150 150 150 150 150 
##$DBP07= 0
##$DBPNAM0= <>
##$DBPNAM1= <>
$$ [...]
##$SUBNAM7= <"">
##$SUBNAM8= <"">
##$SUBNAM9= <"">
##$SW= 20.6930455092707
##$SWIBOX= (0..15)
0 0 3 0 0 0 0 0 0 0 0 0 0 0 0 0 
##$SW_h= 5175.983436853
##$TD= 65536
##$TD0= 1
##$TE= 295.16
##$TE2= 300
##$TE3= 300
##$TEG= 300
##$TL= (0..7)
0 120 120 120 120 120 120 120 
##$TP= (0..7)
150 150 150 150 150 150 150 150 
##$TP07= 0
##$TPNAME0= <>
##$TPNAME1= <>
##$TPNAME2= <>
##$TPNAME3= <>
##$TPNAME4= <>
##$TPNAME5= <>
##$TPNAME6= <>
##$TPNAME7= <>
##$TPOAL= (0..7)
0.5 0.5 0.5 0.5 0.5 0.5 0.5 0.5 
##$TPOFFS= (0..7)
0 0 0 0 0 0 0 0 
##$TUNHIN= 0
##$TUNHOUT= 0
##$TUNXOUT= 0
##$USERA1= <user>
##$USERA2= <user>
##$USERA3= <user>
##$USERA4= <user>
##$USERA5= <user>
##$V9= 5
##$VALIST= <valist>
##$VCLIST= <CCCCCCCCCCCCCCC>
##$VD= 0
##$VDLIST= <DDDDDDDDDDDDDDD>
##$VPLIST= <PPPPPPPPPPPPPPP>
##$VTLIST= <TTTTTTTTTTTTTTT>
##$WBST= 1024
##$WBSW= 4
##$XGAIN= (0..3)
0 0 0 0 
##$XL= 0
##$YL= 0
##$YMAX_a= 361394
##$YMIN_a= -411866
##$ZGOPTNS= <>
##$ZL1= 120
##$ZL2= 120
##$ZL3= 120
##$ZL4= 120
##$ABSF1= 16.45139
##$ABSF2= -4.241783
##$ABSG= 5
##$ABSL= 3
##$ALPHA= 0
##$AQORDER= 0
##$ASSFAC= 0
##$ASSFACI= 0
##$ASSFACX= 0
##$ASSWID= 0
##$AUNMP= <proc_1d>
##$AZFE= 0.1
##$AZFW= 0.1
##$BCFW= 0
##$BC_mod= 0
##$BYTORDP= 0
##$COROFFS= 0
##$CY= 12.5
##$DATMOD= 1
##$DC= 0
##$DFILT= <>
##$DTYPP= 0
##$F1P= 14.0000005364418
##$F2P= -0.99999901652339
##$FCOR= 0.5
##$FTSIZE= 32768
##$FT_mod= 6
##$GAMMA= 0
##$GB= 0
##$INTBC= 1
##$INTSCL= 1
##$ISEN= 128
##$LB= 0.3
##$LEV0= 0
##$LPBIN= 0
##$MAXI= 10000
##$MC2= 0
##$MEAN= 0
##$ME_mod= 0
##$MI= 0
##$NCOEF= 0
##$NC_proc= -4
##$NLEV= 6
##$NOISF1= 0
##$NOISF2= 0
##$NSP= 0
##$NTH_PI= 0
##$NZP= 0
##$OFFSET= 16.45139
##$PC= 1
##$PHC0= 234.6883
##$PHC1= -2.775147
##$PH_mod= 1
##$PKNL= yes
##$PPARMOD= 0
##$PSCAL= 4
##$PSIGN= 0
##$REVERSE= no
##$SF= 250.130017660539
##$SI= 32768
##$SIGF1= 0
##$SIGF2= 0
##$SINO= 400
##$SIOLD= 32768
##$SREGLST= <1H.CDCl3>
##$SSB= 0
##$STSI= 32768
##$STSR= 0
##$SW_p= 5175.98343685301
##$SYMM= 0
##$S_DEV= 0
##$TDeff= 65536
##$TDoff= 0
##$TI= <Analysis number 999999
Compound Code 99
Book Reference 9
Project Code 9>
##$TILT= no
##$TM1= 0
##$TM2= 0
##$TOPLEV= 0
##$USERP1= <user>
##$USERP2= <user>
##$USERP3= <user>
##$USERP4= <user>
##$USERP5= <user>
##$WDW= 1
##$XDIM= 32768
##$YMAX_p= 406333323
##$YMIN_p= -325393
$$ End of Bruker specific parameters
$$ ---------------------------------
##NTUPLES= NMR SPECTRUM
##VAR_NAME=  FREQUENCY,     SPECTRUM/REAL,   SPECTRUM/IMAG
##SYMBOL=    X,             R,               I
##VAR_TYPE=  INDEPENDENT,   DEPENDENT,       DEPENDENT
##VAR_FORM=  AFFN,          ASDF,            ASDF
##VAR_DIM=   32768,         32768,           32768
##UNITS=     HZ,            ARBITRARY UNITS, ARBITRARY UNITS
##FACTOR=    0.157963299565203, 1,           1
##FIRST=     4114.98629933709, 0,            0
##LAST=      -1060.99713751592, 0,           0
##MIN=       -1060.99713751592, -325393,     0
##MAX=       4114.98629933709, 406333323,    0
$$ Real data points
##PAGE= N=1
##DATA TABLE= (X++(R..R)), XYDATA
$$ [...]
24844f5243k1481n785K2741k2581l8234N5638L4691J29321J30437p1483m7178
24833A00843l9290m1406J3245K0077l3136n2204M8120R1360l7505p4801J3366
24822H669O7778K6007k201Q634K6429J3422J2519j6266q889j1234j715m4748l4837
24809D3568K1607M3125N3838p4858l9900p8823p0423N5119P2372P4814m030q0534
24797A5875j8612P2131J9279m7920j13991N1467P0028O4287O238L6342L0592n2285
24785A33431k0908o826J6852m6713k1816n1588K4554j0667k9974n8614L5861P8723
24773D2315L1466K1289M202o0833M293R784l9077J4267k4936k5937J03870J2849
24761I3552n6249o348n8576L0099J3436J7686n016R477L6996l0402m1513k0800
$$ y = [-65243, -86724, -92509, -69768, -92349, -130583, -74945, -40254, 89067, 219504, 148021, 100843, 61553, 20147, 33392, 53469, 20333, -31871, 16249, 107609, 70104, -4697, 8669, 76447, 102454, 100253, 108887, 135316, 148738, 161257, 144991, 136102, 124868, 123153, 78405, 43568, 65175, 108300, 162138, 87280, 47380, -31443, -101866, -46747, 25625, 100439, 96409, 15875, -2737, 69394, 88673, 40753, -73238, -21771, 48257, 112544, 118782, 155124, 185716, 133431, 112523, 105697, 122549, 75836, 54020, 2432, 26986, 16319, -13655, -72269, -36408, 42315, 73781, 95070, 99272, 38439, 42732, 52516, 13439, 27706, 2770, -23167, 80703, 93552, 37303, 30955, -27621, 2478, 15914, 33600, 28584, 38061, 75057, 44655, 3142, -17658]
24749a7658K3070m5543K5870K9304M5411o596J4630k3038l5381k8395k4191k7772
24737g0289j05678N6794O6985p6081k589J1719L8074J100K7675P732m9068J8345
24725g5281m3976k9637O8647N9457O3839K3093k9282n7660j687o995M4113J4503
24713B9134k7996o231J9697k1712j8592k076N9415L3203J5861j2095n7279r0337
24701g9008q831k4177k5120J3896K7959j2500L9546O5973N736k2381N8989l3276
24689F806p1408L652N5079j7175R289k7474k6987K0300k7319j4438N8560M2727
24677A1612K4573J8458q0133L7162M8008N5945L508m1282n3327p1715M0939J27653
24665A21401P749R234L7760l6397l8o5963J427o92k162J7974k8758o06L5588J18658
$$ y = [-17658, 5412, -40131, -14261, 15043, 60454, 53858, 68488, 45450, 10069, -18326, -42517, -70289, -175967, -119173, -52188, -128269, -130858, -119139, -81065, -79965, -52290, -44558, -93626, -75281, -119257, -148894, -80247, -20790, 43049, 66142, 36860, -20800, -22487, -29482, 14631, 29134, 1138, -5093, 14604, -7108, -25700, -27776, 31639, 64842, 80703, 68608, 11329, -79008, -87839, -112016, -137136, -123240, -95281, -107781, -68235, -2262, 3474, -18907, 40082, 6806, -64602, -60950, -5871, -23046, -13757, -41231, -68218, -47918, -75237, -89675, -31115, 11612, 36185, 54643, -25490, 11672, 59680, 115625, 119133, 77851, 24524, -47191, -6252, 121401, 129150, 138384, 176144, 139747, 139709, 73746, 75173, 74481, 72319, 90293, 61535, 60929, 96517, 215175]
24651B15175k8270o0630n7515j123J1623j2163K8561J5518l477o7859k7086n8939
24639d6185L8853L7745M3522n0725J3485n798q499R7871o0744j03740j9795J02295
24627C8285O3892l3592J8070N4821J418m882l9959J580k3247J7946N9010m4469
24615A08873q5681n601K2079n8585L7678J7026k748L3830j8783o754l0169m248
24603F917k6231L909J8707M3061p058k7682P4599j6853k7683J47334Q399j77503
24591A9916N515O8032n5962j1329k3550o1957r5869M6754L8741L4552J0655r373
24579c3875J47402J0490j6938R5879l6976r4943j7291N2293P8543M341m3778L201
24567A48348j4386n3559j40778m7304m685O7604L2761j2917N0132L7880L338k8874
$$ y = [215175, 186905, 126275, 68760, 67637, 79260, 67097, 95658, 111176, 107699, 39840, 12754, -46185, -7332, 30413, 73935, 23210, 36695, 30897, 22398, 120269, 59525, -44215, -64010, 38285, 102177, 68585, 86655, 141476, 142894, 138012, 98053, 99633, 76386, 94332, 153342, 108873, 23192, 17591, 39670, -18915, 18763, 35789, 33041, 66871, 48088, 41334, 11165, 6917, -19314, -15405, 3302, 46363, 39305, 11623, 86222, 69369, 41686, 189020, 197419, 19916, 25431, 93463, 37501, 26172, 2622, -59335, -155204, -108450, -69709, -35157, -24502, -33875, 113527, 124017, 107079, 202958, 165982, 71039, 53748, 106041, 184584, 188925, 145147, 148348, 133962, 80403, -60375, -107679, -112364, -44760, -11999, -24916, 25216, 63096, 66434, 37560]
24555C7560Q002l0676m6373P533N8702N7248J97K4595o8298r8678m3719n78O8543
24542b5942K6819m199L1868k0485p8695L3816P3300J6123p1155R500l905l5050
24530d8005m7099K952L2668P2426P9191j7137j06175m3041m6747p128O3925J3067
24518e1103O184j2402J14687J14844k1807j01348n9341P4728O5152n8717p6509
24507e632R3403K1487p4600n1164J4352J03497K5717K1132k5847o2045q6578q2917
24495a09195P004J22975j4870O8612o022n7849j3553j4821j4202J6267M905j8556
24483b9305K7135n8212n556L0754K4069j5219m7130J2759j5134P1094P3599N4429
24471A23283J3545N5761M0334n2056j31532o0088P9418O4319o6195L9213k8213
$$ y = [37560, 45562, 14886, -31487, -23954, 34748, 91996, 92193, 116788, 48490, -50188, -93907, -94485, -25942, 877, -3322, 28546, 8061, -70634, -36818, 36482, 52605, -18550, -9050, -12955, -48005, -95104, -92152, -59484, 12942, 92133, 74996, -31179, -74220, -120967, -128095, -64170, -51103, -44919, -57321, 57366, 172210, 150403, 49055, -10286, 64442, 129594, 70877, -5632, 87771, 109258, 34658, -16506, -2154, 101343, 127060, 148192, 122345, 60300, -26278, -109195, -102191, 20784, 5914, 74526, 68504, 10655, -2898, -17719, -31921, -15654, -10749, -29305, -2170, -60382, -65938, -35184, -11115, -26334, -73464, -60705, -75839, -4745, 68854, 123283, 136828, 192589, 232923, 180867, 49335, -10753, 68665, 132984, 66789, 106002, 77789]
24460G7789k0400n779n0097j0886K2296n4627j7839n6787r060R4383O8868M6663
24448H4524m9985K5673L8916R7k1318J5136O3612J9465m5978m0468o6079J967
24436B5562J2329p4663R572L7630L0837N4560k4374m6366Q9461r00L0675M5804
24424A90127M0936L8923k4645m6070l2333j56205n2717J14227M6226J7917l7099
24413I9287j6539l9466o9352m4796l2887k2813L378M2099J7092L8934M0538O0181
24401G5656j1319k5323l8461k7218O623j4777n891K7414j2973J285L1266J4837
24389B1119M7245j1721j619L0388R2503L1471j07805o3316J2967K3930K1935r4197
24377B900l5141j9027j1626k5255m222O2908J09485j9023r5804m6575P3332m255
$$ y = [77789, 57389, 51610, 1513, -9373, 12923, -41704, -59543, -116330, -125390, -31007, 37861, 84524, 34539, 60212, 99128, 99225, 77907, 93043, 156655, 176120, 130142, 89674, 23595, 25562, 37891, -36772, -27200, 10430, 41267, 95827, 71453, 25087, 114548, 113648, 144323, 190127, 231063, 269986, 245341, 199271, 166938, 10733, -41984, 72243, 118469, 136386, 99287, 82748, 43282, -26070, -70866, -103753, -126566, -123188, -81089, -63997, -25063, 15475, 75656, 64337, 39014, 553, -26665, -20042, -34819, -40710, -13296, -26269, -24984, 6282, 21119, 68364, 56643, 55024, 85412, 177915, 209386, 101581, 38265, 51232, 75162, 97097, 2900, -32241, -51268, -62894, -88149, -92371, -29463, 80022, 60999, -34805, -81380, -8048, -12303]
24365a2303Q8561K5326J09605j8449p6010j02519l4023J8815l2598K7677P550
24354A632k8257l2331O1294k5935K4790m493l7073O680j80k5715K6912l4719K5031
24341d2364j1507K0845N7924m706K562l5409k3066N6678j622K2726P5273m4547
24329G2787q6813O9516J05877n4572j40203L0377N8942n28N5868q5329o5989l4705
24317g4772L9033K9976m7012P3539R6547K4263m6084k1189N829r16J3685k1977
24305G0922J5221Q3167K4045m8871j20649k8215l0669N5737P1192L4384j24110
24294B154j18283m054P0906K2417p432k361N0465O706r5289p5422l9967O9453
24282a20707M0995K3068k6971J363Q8090j0475j07762j8671N5957j9510L2459
$$ y = [-12303, 76258, 101584, 211189, 192740, 116730, 14211, -19812, -997, -33595, -5918, 1632, -26625, -58956, 2338, -23597, 1193, -3300, -40373, -33693, -33873, -59588, -32676, -67395, -42364, -53871, -33026, 24898, 20192, 22754, -12655, -35721, 20957, 19335, 42061, 117334, 72787, -14026, 55490, 161367, 106795, -33408, -3031, 55911, 55383, 111251, 25922, -40067, -74772, -35739, -5763, -52775, 20764, 117311, 141574, 95490, 74301, 80130, 79214, 92899, 70922, 86143, 169310, 193355, 144484, 23835, -4380, -35049, 20688, 91880, 126264, 2154, -116129, -120183, -49277, -26860, -34292, -36653, 13812, 20518, -74771, -150193, -190160, -120707, -79712, -56644, -83615, -82252, 5838, -4637, -112399, -131070, -75113, -94623, -62164]
24271f2164Q6153L9570M7199L8487j04688k2635j8616q5489j085q455j193J04026
24259A1110N4762m868n5920q490n9360k3816K2640R5394L4450j846n7834j3408
24247g186k7984N85M1508k0111l8678n461o13q3250R5328M4789k2491q670K6101
24234f133Q9342K3583q6117m5545l5500r7960J2969j602J15651K2361k1552n4278
24222h4781q499L4160l0128l6450O795M1042R207n8219m1026k0052Q0780o801
24210a13972P291J7249n864P5591P1473o7369n6600k6135Q721M4162Q5734p3577
24198c3296m297M3343L9980L7036k8988j424m1861L0059J1031N80Q0046r874j05311
24185A7024l6193n7258k9400L8246M1968J21379k3916r945j4808k8862N7975O2658
$$ y = [-62164, 23989, 63559, 110758, 149245, 44557, 21922, 3306, -82183, -83268, -91723, -92916, 11110, 65872, 61004, 5084, -3406, -62766, -86582, -63942, 31452, 65902, 64056, 6222, -7186, -35170, -34585, 6923, -13188, -51866, -57327, -57940, -141190, -45862, -1073, -23564, -32234, -6133, 83209, 106792, 20675, -24870, -60370, -158330, -145361, -146963, -31312, -8951, -30503, -84781, -93280, -59120, -89248, -125698, -118903, -77861, -68654, -126873, -167899, -187951, -107171, -113972, -106681, -89432, -95296, -19705, 51768, -15601, -72201, -98336, -89615, -45453, 40281, -33296, -37593, 5750, 45730, 82766, 53778, 52354, 10493, 40552, 51583, 52163, 132209, 122335, 17024, -19169, -76427, -105827, -67581, -25613, 95766, 71850, 61905, 47097, 18235, 76210, 138868]
24173A38868j28898K8603o5639n178K0989m5793Q3534J20897O5484l5562M032
24162A81337p4684k8321m9146o3283p7815J974P1271K6203o4053l0248O2078N3088
24150H401p9329j36876M2158O1694N2055n562J6108l8299j3045J3517Q8632K8403
24138C7857m8439j0197R785K6863P9527L2300n261j993P8959j7553r3615j6922
24126G1311R849J1344j3953M703l3079n1512q0581N0917J2954l5734l6286O6744
24114b3323R0248P2773o1836l0025N532l5609K484k548n0397L2046m4086J6367
24102b8374M2529K2242J4256J3497m0064l302L1533P3239l8789q7644m5512k2534
24090f8923K0505O8920k4694j11292n02M4665N0869L6858M5230m3390j10907j0062
$$ y = [138868, 9970, 38573, -27066, -32244, -11255, -57048, 26486, 147383, 212867, 177305, 181337, 106653, 78332, 29186, -34097, -111912, -109938, -38667, -12464, -76517, -106765, -44687, 8401, -70928, -207804, -165646, -103952, -51897, -57459, -41351, -79650, -92695, -79178, 9454, 37857, -10582, -20779, -10994, 15869, 95396, 127696, 122435, 120442, 199401, 181848, 88233, 71311, 81160, 92504, 78551, 83254, 50175, -1337, -81918, -31001, -18047, -53781, -90067, -23323, 66925, 139698, 77862, 47837, 53369, 17760, 20244, 17696, -32701, -655, -44741, -28374, 14155, 36397, 50653, 64150, 24086, 20784, 52317, 125556, 86767, -877, -46389, -68923, -48418, 20502, -4192, -115484, -115986, -71321, -20452, 16406, 61636, 18246, -92661, -102723]
24078a02723Q7596J1449J7567M2826L176K081Q9K0789q3805q538j471k8511Q0543
24065D1068M673N7274K1706n7901j2484n6910J8482k8572j7034N9037O5446l0360
24053F4425j5893P031L4512N283n2645O028O8632m7345o6758q0691n1148l423
24041a31992K6316K5307l3153m2583P1072J01301O8847n8771Q792P990l0346M8610
24029F1390l4390r6030L5005L4937m5910n236Q2440K2247R621k5304j14177p456
24017h2863K5874P7511N8128p4919p9478K74R3878J27759j595o2839j5966K7920
24005I3684J13786p331j54790O875m2220k8163o7284j8860j8573j3182L8370l5693
23993a33381l294M1380P9592j344K7488J1998l3737m080j396m1882L848j1578
$$ y = [-102723, -15127, -3678, 13889, 56715, 59891, 61972, 62061, 82850, -955, -9493, -10964, -39475, 41068, 45741, 103015, 124721, 66820, 54336, -2574, 15908, -12664, -29698, 29339, 94785, 64425, 48532, 55563, 90075, 95358, 42713, 48741, 117373, 70028, 3270, -77421, -128569, -131992, -105676, -80369, -113522, -156105, -85033, 16268, 85115, 26344, 35136, 43126, 12780, 61390, 27000, -69030, -34025, 912, -44998, -50234, 32206, 54453, 64074, 38770, -75407, -82863, -56989, 20522, 78650, 3731, -75747, -75473, 18405, 146164, 144569, 81730, 65764, 93684, 207470, 200139, 45349, 52224, 10004, -18159, -85443, -104303, -122876, -136058, -97688, -133381, -136675, -95295, -15703, -17047, 10441, 22439, -11298, -15378, -16774, -58656, -54808, -66386]
23981f6386J8912J28961q096l3631K5542O6561n2707j23367k5300L3926M8768
23970A3183j888N3496k3375K5376L718K5428j31257L0612O1718o311j749K9376
23958G8327o8291j6105n099k2346K6567l7810n8898m6891N5585N900J3824R76
23946g4261J7973N5453J4590K2456o6490q9904k8383P4587Q0052J4486n7252m77
23934c7170K3994N446k6637Q1802M2679o8293l78L5857J0002L0708J12975J5211
23922B26196K632r1171q8902n1568r4852P6369m6573J7479J64930L607p9594K1111
23910E9664j4114n5571q3347M7496M8369N7046K655M3536N118j7544R1278J8956
23898B03542m8411m2750m0260J091K6807J0202j5469K7487k2484m9627O104K5567
$$ y = [-66386, -47474, 81487, 73391, 39760, 65302, 131863, 79156, -44211, -69511, -35585, 13183, 11295, 64791, 41416, 66792, 70510, 95938, -35319, -4707, 57011, 50700, 48951, 78327, 10036, -6069, -11168, -33514, -6947, -44757, -103655, -150546, -94961, -89061, -75237, -74261, -56288, -835, 13755, 36211, -30279, -120183, -148566, -73979, 6073, 20559, -36693, -37170, -13176, -7730, -34367, 47435, 90114, 21821, 21443, 57300, 67302, 98010, 210985, 226196, 228828, 137657, 48755, -2813, -97665, -21296, -67869, -50390, 114540, 118147, 38553, 59664, 45550, -10021, -93368, -45872, 2497, 59543, 62198, 105734, 110852, 93308, 184586, 203542, 155131, 112381, 72121, 73212, 100019, 110221, 94752, 122239, 99755, 50128, 56232, 81799]
23886H1799q0742n7080P6127K6186M3205o9379n6399J2712M337n2721n088N4121
23874b2922J9710n4064l628M4683P6924K9259n1442k3781l4182j01371O3745Q023
23862d9046K4979l4371j00502N2415N9975k3821Q1380R1008R0738j24927l2608
23851C5220k1613l5545k9971n407k3219P7915N5455j26771k1773k3235n7390j1899
23839a88233m6642N4154j2647K7188n7081r794L9202J3858P6375M7803J12201
23828E6384L4185j5777l9873q849O186n5236j4720j0355J1678j5482l8045L8829
23816e1075M6075O2022K6136j6561J3436R169L4374M6203k6007p4547l8894l561
23804B6770O752M3417j7354k5218j5813n3623J2277M2055q396m1622p9116p1921
$$ y = [81799, 1057, -56023, 20104, 46290, 89495, 20116, -36283, -23571, -19234, -71955, -77043, -22922, -3212, -57276, -60904, -16221, 60703, 89962, 38520, 14739, -19443, -120814, -57069, -49046, -24067, -58438, -158940, -106525, -46550, -70371, 11009, 102017, 192755, 67828, 35220, 13607, -21938, -51909, -57316, -80535, -2620, 52835, -73936, -95709, -118944, -176334, -188233, -234875, -180721, -193368, -166180, -223261, -233055, -193853, -179995, -103620, -55817, 56384, 90569, 74792, 34919, 26070, 32256, -22980, -37700, -48055, -36377, -51859, -89904, -51075, -5000, 57022, 83158, 66597, 80033, 89202, 123576, 169779, 143772, 69225, 30331, 26770, 33522, 76939, 59585, 34367, 18554, -35069, -22792, 19263, 10867, -30755, -109871, -181792]
23792a81792R0899K2202l2958N703J0667P5656N2233l8993M2722p856j8893L3451
23780E3041l3318J0228J3271o5320m5135K2676J35867N0098N383k5217M6064L0684
23768A98322k7740m4462j8888j5911J2667N2165j16q867p8828o6432q9565l5117
23756a22772L968M561J08509L8611M1092J4815L4409J360o8688o1529k166m3536
23744e1366o6666M3543J19007M2911P102l870j8637J8703n8008k3036j619o071
23732A993m2590l0178M2906N5207j33825r6758N8349O6278P3104o992n5147O1270
23720f383J15569k0472J7835o0564l5530r851l4101J23679L2806r8916p7252O822
23708d6358J320M5187M0220M0152q4459l2000K3767N3460J1711q6527k7675J5742
$$ y = [-181792, -90893, -68691, -101649, -95946, -85279, -9623, 42610, 3617, 46339, 38483, 19590, 53041, 19723, 29951, 43222, -22098, -67233, -44557, 91310, 141408, 146791, 121574, 167638, 198322, 170582, 126120, 107232, 91321, 103988, 156153, 156037, 147170, 68342, 1910, -87655, -122772, -118804, -114243, -5734, 32877, 73969, 88784, 123193, 124553, 55865, -5664, -7830, -51366, -118032, -74489, 44518, 87429, 94531, 90661, 72024, 90727, 32719, 9683, 8064, 1993, -40597, -70775, -27869, 27338, -106487, -203245, -144896, -78618, -5514, -12506, -67653, -6383, 109186, 88714, 106549, 45985, 10455, 604, -33497, 90182, 122988, 24072, -53180, -46358, -45038, 149, 40369, 80521, -3938, -35938, -12171, 41289, 53000, -33527, -61202, -45460]
23696d5460J0898O2898N2200r7382j12304P6422R3687m2413n9046N3011J5361
23685G872P8664M7876J7902o8486k5234k8392k4177L5352j9570K3829J06558q090
23673A44104p7812n6223J2991q8097K1585P5671l1595o1956p4451j132K7232J37867
23661B8184L007J9890M8485O5304n7644j4463j2338o7200k897J01616O511j11910
23649F545n3020M2546j5914l2843J30451K8720j2147j06546o3687K6160O7202
23638A7467L065q7213l8753N9291O5630L498j0639j4728l5180N796Q3668K7528
23626G9430L0022m1142j09331K4544Q6701L692J2800j8424j1593m9225p2525L3869
23614c1182L7992l0569O644J4228r077J9274Q6194j252n2311p9529k6993L4431
$$ y = [-45460, -34562, 28336, 80536, -16846, -129150, -52728, 40959, -1454, -60500, -7489, 7872, 86536, 134412, 152314, 83828, 58594, 30202, 6025, 41377, 21807, 45636, 152194, 144104, 66292, 10069, 23060, -65037, -43452, 32219, 624, -61332, -135783, -136915, -109683, 28184, 31191, 51081, 99566, 164870, 107226, 92763, 80425, 13225, 10328, 111944, 118455, 6545, -46475, -3929, -19843, -52686, 77765, 106485, 94338, -12208, -75895, -49735, 17467, 20532, -66681, -105434, -46143, 19487, 22985, 12346, -2382, -37562, -31766, 51902, 79430, 109452, 68310, -41021, -16477, 70224, 73916, 86716, 68292, 56699, 7474, -65051, -31182, 6810, -23759, -17115, -2887, -11964, 7310, 93504, 92252, 39941, -39588, -66581, -32150]
23602c2150q470o5696K7625L8501M0137l2724J9773J18070k2471q517q1556l3291
23590d0769J2007O0711l1541J505K1899j05m2598n1917n753M7408Q9174O7285
23578A27306k7796o9198n99M4104l9165o8327J7615M9498j0503K374m803J1247
23566C1753K2878J25561j9415r8696n992k2638J3467j1933L1101n961j1817j02064
23554e3756o0713L3955R6919P2781l4019n9963k2840j4766m7223m5440R5415J11099
23542G1449j6313n8558m5016k3851j1911k0304K5824J9836k4676J4357n8060j01936
23530b29159N2053J12585R877m4718J9526O6571K4746O3703j4880o522l4340o50
23518A8792j2720k5372k1883L2947m1542l0524n1038O9423N0724Q5773J85r8578
$$ y = [-32150, -40620, -106316, -78691, -40190, -53, -32777, -13004, 105066, 82595, 74078, -7478, -40769, -28762, 31949, 408, 1913, 23812, 23707, -18891, -70808, -76561, -29153, 60021, 127306, 99510, 30312, 29713, 73817, 34652, -33675, -16060, 33438, 22935, 25309, 20506, 31753, 54631, 180192, 160777, 62081, 56089, 33451, 46918, 34985, 66086, 60125, 48308, -53756, -114469, -80514, 16405, 89186, 55167, -4796, -27636, -42402, -89625, -135065, -39650, 71449, 55136, -3422, -48438, -72289, -84200, -104504, -78680, -58844, -83520, -69163, -127223, -229159, -177106, -64521, -54644, -99362, -79836, -13265, 11481, 75184, 60304, 53782, 19442, 18792, 6072, -19300, -41183, -8236, -49778, -80302, -131340, -61917, -11193, 74580, 74765, -23813]
23506b3813j5743j8154K6511l0619J5372P9634k1402q669k5397M2387n6303q5930
23494a22126J5849O3802Q1098J1292j3375k4447R104l3697n9966K2917o4352j5085
23482a28986j3283L1278O1390k9943J975K3968n3521j491K8042O1503K0146o578
23470e500M4753o8994L2433J07195M9506p2250m6377j5411J27566J6991r0751
23459G9161o8524r437Q8068l2535j17191k7946N0140O0040o753l84o5877J6151
23447c5087k7578l2591L0314l9670k4031O0890N9050K8438J5802j159j10014n2184
23435a27820L8840M9035j082K3400K2963M3169J3972m3270k0907o1307J8018J09038
23423F4049M926n7259p8486K1913Q6495K5994j0961j3907j02131M748Q7759j3439
$$ y = [-23813, -39556, -57710, -31199, -61818, -46446, 33188, 11786, 3117, -22280, 20107, -36196, -122126, -106277, -42475, 38623, 49915, 36540, 12093, 21197, -12500, -72466, -49549, -113901, -128986, -142269, -110991, -49601, -79544, -77569, -53601, -107122, -108613, -80571, -19068, 1078, -5500, 39253, -29741, 2692, 109887, 159393, 87143, 40766, 25355, 152921, 169912, 79161, 10637, 1200, 89268, 56733, -60458, -88404, -38264, 21776, 15023, 14639, -51238, -35087, -62665, -95256, -64942, -104612, -128643, -67753, -8703, 19735, 35537, 34378, -75636, -127820, -88980, -39945, -41027, -17627, 5336, 48505, 62477, 19207, -1700, -63007, -44989, 64049, 68975, 11716, -66770, -44857, 41638, 67632, 56671, 42764, -59367, -54619, 33140, 19701]
23411A9701K5236J2878l7879k043m9021r2660O6264O5570K2969n365R3570q221
23399A10999r5769J365K8795j8422L1287k3089q431m2426k0798j7099k7323N2030
23387b8881K954L9286J2667k8104L2003j8855L8800M6453k9493J9718j5074j1518
23375E9956l9923k783m5019o9268o9630O5407Q637m902p3913j9194Q1333J31777
23363B2478j14542q7884Q0753L3963N3392K7476k5466o3515j945K7382M0318M7850
23351D0260n8407P638q472m7483R1234K8935j4490p7038j3287L1317J8017N5150
23339E3374p7733J7139L832o5516l3112O1477M0949o4954m0911R0050J0979j7866
23327b2292L091p7743K3008L1449J1085J2313K5560p8108J6066M2927P7671p301
$$ y = [19701, 44937, 57815, 19936, 17893, -31128, -123788, -57524, 8046, 31015, 25650, 119220, 110999, 15230, 16595, 45390, 26968, 58255, 35166, 26735, -15691, -36489, -53588, -80911, -28881, -25927, 13359, 26026, -2078, 29925, 11070, 49870, 96323, 66830, 86548, 71474, 59956, 20033, 17250, -27769, -97037, -166667, -101260, -92623, -97525, -171438, -190632, -109299, 22478, -92064, -179948, -99195, -65232, -11840, 15636, -9830, -73345, -75290, -47908, -7590, 40260, -18147, -10509, -18981, -66464, 24770, 53705, 39215, -37823, -51110, -19793, -1776, 53374, -24359, -7220, -3388, -68904, -102016, -40539, 410, -64544, -105455, -15405, -4426, -22292, -19201, -96944, -73936, -42487, -31402, -19089, 6471, -71637, -55571, -12644, 65027, 57726]
23315E7726n6984n872n9715j8020m5599L8984L3418M2501j1843o0891j5120R2563
23303h852J02975l9409n7601m1268l4366R65J7947n7780K4460J1185p3256j6814
23291a71814O4884P8273P9882R6877k6616j87315r9042M4285j7587M7912P6797
23280a3464K7684R9075p6370n7002J9116l6217m277n4714K0829R4318M7261k0890
23268D5349R7066J9481l0944l2428m179q6493m4150j8379j179O5930L5559j468
23256D4165l6564o9719m6015N723J02988L1017M1539J4444l3448J7494k9858J03111
23244A44877L160p7574n3948K2392J2357o4487O4732n8435k5579J2228M7396p8697
23232e1578J2456l9551j3201K8224Q088M1770J034k1354K9488L2555q8875l9458
$$ y = [57726, 742, -5130, -64845, -82865, -128464, -89480, -56062, -13561, -25404, -86295, -101415, -8852, 94123, 54714, -2887, -44155, -78521, -77556, -59609, -117389, -92929, -81744, -155000, -171814, -106930, -28657, 51225, 148102, 121486, -65829, -164871, -120586, -138173, -90261, -13464, 14220, 113295, 36925, -20077, -961, -37178, -41455, -96169, -75340, 18978, 66239, 45349, 142415, 161896, 130952, 98524, 94345, 7852, -36298, -54677, -55856, 10074, 45633, 44165, 7601, -62118, -108133, -102410, 578, 31595, 73134, 87578, 54130, 71624, 41766, 144877, 148037, 70463, 16515, 38907, 51264, -13223, 51509, -6926, -32505, -20277, 27119, -51578, -39122, -78673, -91874, -63650, -55562, -13792, -12758, -34112, -4624, 27931, -60944, -100402]
23220a00402L1750K1947k3315O3898k4809m7778M4639M8522O8268j0339n3358
23209A9023j7202J6590L5270n9866L646O8820J2717J6683O8781J4296l4327j42586
23197A845p3289J3361J42878R5362o4746m9796p1116J3271p920K704J24539R9450
23185B26543l8768l1258m0983o3794k8939m973m1230J669L5652k4107l651O1577
23173D7738m6560j25408l6790L5810N2494o2055K0355O4553N7364J5117p284K1418
23161C6752p2865l6456P0142J3893n824j3423n3872N7064K6078M6529l6592J6203
23149D7629J7194j20032n0951L187O2259P9190l5205p4798n465P3707J334l793
23137e744m4668k1240M4036K194L8635K0956j00768q3029Q9408N8803m8234J4416
$$ y = [-100402, -68652, -46705, -70020, -6122, -30931, -78709, -34070, 14452, 82720, 72381, 19023, 1821, 18411, 53681, -6185, -2539, 66281, 78998, 95681, 164462, 178758, 144431, 1845, -71444, -58083, 84795, 180157, 115411, 65615, -5501, 7770, -150, 2554, 127093, 226543, 187775, 156517, 115534, 51740, 22801, 17828, -23402, -21733, 13919, -10188, -13839, 47738, 1178, -124230, -161020, -125210, -72716, -134771, -114416, -49863, 7501, 22618, 15334, 36752, -36113, -72569, -2427, 11466, 5642, -7781, -61653, -4589, 21489, 68018, 31426, 47629, 64823, -55209, -106160, -102973, -40714, 38476, 3271, -71527, -76992, -3285, -1951, -5744, -50412, -71652, -27616, -25422, 13213, 34169, -66599, -149628, -60220, -1417, -49651, -35235]
23125c5235P120r9097k0120N432O0468J1210M4557J7737N284j5035j7608o303
23113d1590k8708o3027N9622R3212n978o4258O1194R854K3182j31747p3049P595
23101a53698R5947J22980j4347n8003j1533j0152N2634K8117p428j1198J02865
23090A36184m8099o6026R0140J9833p7298j05706L319N9222L433j1673L405J6562
23078B3296k9541Q800K7091R2289L2262j25826q3493O6295P475J7854m796k2614
23066I092J5843L506m1493q9779l527N5111L9922P5189J08933M0952J1664m8197
23054A77216m8522j36391m3132L6141N4473l2551K4641l1848k3061J44938J15823
23043B37727k8178j56708j4635j0802m8268q5049N7209O6287R517p0568n1397
$$ y = [-35235, -28115, -127212, -147332, -141900, -81432, -70222, -25665, -7928, -2644, -17679, -35287, -41590, -70298, -133325, -73703, 19509, 13531, -50727, 10467, 20321, 43503, -88244, -161293, -153698, -57751, 65229, 50882, -7121, -18654, -28806, 23828, 51945, 44517, 33319, 136184, 88085, 22059, 112199, 132032, 54734, -50972, -47653, 11569, 15002, 3329, 6734, 23296, -6245, 2555, 29646, 121935, 154197, 28371, -55122, 11173, 18648, 36502, 31706, 9092, 24935, 28441, -13052, -102831, -106358, -51247, -11325, 63864, 172797, 213749, 225413, 177216, 128694, -7697, -50829, -14688, 39785, 7234, 31875, 27, -23034, 121904, 237727, 209549, 52841, 38206, 27404, -20864, -105913, -48704, 17583, 27100, -43468, -94865]
23032i4865J02778Q0374L8421Q205J9133k2109p4755l2236Q8295J8908n9592k941
23020F9616j3985j6063M3236K3349k8654l025k9307k2327J0303m5698j14297K9172
23008i7680M3119M7500m770P0713M7403j07873l2979R680R1027M0570j12106q6424
22996i1820k8349n621N3584j1694n0549K9691O2048P4143o6561k5234r092o842
22984g6296j6072j5739J2405O6603j8084m0461Q3304O3573o4757o036k064L3553
22972A9929o7991L045J1968j5652J6462J042N4238L1457K5662k2222j5212j9504
22960B3222j43479p9864N730M2149q388O9443r408J0277P2063K4415J0416l7639
22948b1063n8169K0450J49996n5743l8580k7119q7916N0553Q8065J7596n4038
$$ y = [-94865, 7913, 88287, 126708, 134913, 154046, 131937, 57182, 24946, 113241, 132149, 72557, 69616, 55631, 39568, 82804, 106153, 77499, 74474, 45167, 22840, 33143, -12555, -126852, -97680, -54561, -7061, -11831, 58882, 106285, -1588, -34567, -24887, 66140, 106710, -5396, -91820, -120169, -125790, -72206, -83900, -134449, -104758, -42710, 31433, -35128, -60362, -69454, -76296, -92368, -108107, -95702, -29099, -47183, -87644, -4340, 59233, -5524, -11560, -13624, 19929, -48062, -45017, -33049, -48701, -32239, -31197, 23041, 54498, 80160, 57938, 42726, 23222, -120257, -200121, -194391, -152242, -160630, -91187, -100595, -90318, -18255, 6160, 16576, -21063, -79232, -58782, 91214, 35471, -3109, -30228, -118144, -67591, 20474, 38070, -15968]
22937a5968l9723M0481N3883m6252L6866p737m6916L1063j7137o0494K6296n20
22925d6158m4435l6982j4253Q0171L039J8567l829K9070J5444J4364j5155K7228
22913B7071k965m6347K0251n6556j1287L6087n0046L0107O7774p2875o0490K6244
22901i3032M5108N9709P1361M8782p5424l06k7360k7305l1148K7034K3480k1382
22889d83K642l2618k4945J8172L8685m6246N1864L9238L2456q575J5060J6993
22877A02243l9562m7458K0793J7954q4512q5347N3347O9769k1743k1186n0334
22866h6036m9632L5000K7727K3124K3613N2650m2825n5254m4883l9518M3987M7544
22854f4503o5693j9554K1214J20510J0816n4784p5780n4279M6824M0292O9017
$$ y = [-15968, -55691, -15210, 38673, -7579, 29287, 21550, -25366, 5697, -11440, -71934, -45638, -46158, -90593, -127575, -141828, -61657, -58618, -40051, -43880, -14810, 634, 14998, -157, 27071, 24106, -22241, -1990, -58546, -69833, -33746, -83792, -53685, 14089, -58786, -119276, -93032, -47924, 11785, 83146, 131928, 56504, 56198, 28838, 1533, -29615, -2581, 20899, -483, 2159, -30459, -55404, -37232, 1453, -44793, 7071, 46309, 78765, 70190, 85250, 102243, 62681, 15223, 36016, 53970, -30542, -115889, -62542, 7227, -14516, -35702, -86036, -135668, -100668, -72941, -49817, -26204, 26446, -16379, -71633, -116516, -156034, -112047, -64503, -130196, -149750, -128536, -8026, 2790, -51994, -127774, -182053, -135229, -94937, -25920]
22843b5920K93R463p487m4003J3642j6281M5506j2118M6563K712O3258m0133l1453
22830D042M3027l0742j36182J1736O803o2280J142m5882L8576L9559m138N1237
22818h3102M7191l018N1238l4890n6652J3480p008o244n0672m9694k8597O1833
22806a46135J13879m7473j6801J23763K3702j01477j6601L0821r2083m6423N2504
22795a22324J38101J07151M1978l2998r4429p0272n2680L7473J15676M6342r376
22784A04642O145K9216l4880p0170p2552j18455k7858J63337K8196M2945m5465
22773E101p1877N145K9640O3678k5505p2559n5568K3224R4355L0983o2605n6231
22761i2219J4599k1411N588J13971P1794o3424o2429k761o745q8251l758J13221
$$ y = [-25920, -25627, -16164, -23651, -67654, -54012, -70293, -24787, -36905, 9658, 12370, 75628, 35495, 4042, 47069, 16327, -119855, -108119, -101316, -163596, -162454, -208336, -169760, -130201, -134339, -83102, -35911, -38929, 12309, -22581, -79233, -65753, -72761, -79005, -129677, -179371, -207968, -146135, -32256, -79729, -96530, 27233, 50935, -50542, -67143, -36322, -128405, -174828, -122324, 15777, 122928, 164906, 131908, 37479, -32793, -85473, -48000, 67676, 114018, 104642, 110787, 140003, 105123, 34953, -37599, -156054, -183912, -20575, 7621, 50566, 5101, -66776, -61631, -31991, 31687, 6182, -66377, -121945, -98721, -4366, 26617, -35988, -92219, -77620, -99031, -93443, 20528, 92322, 28898, -33531, -36292, -43037, -131288, -135046, -21825]
22749b1825K6128p026j0481J7139N5408J5256q1133M0669M4749J7164q5327o9688
22737e8967m2598m7063M4049j5812k2530N6939O5377O2933o4513r1973J9737R2750
22725a671O708K631m4573l1884J7574K7473Q071M7795m6277n4884L8628P927O0704
22712C8222L2903m9450q7324j6639L4762N1431n6322k3098M7888l8568m780M1059
22700b9916Q3335N2438m9338k2630m8844o12o3151N9142K705q368n8730j04341
22688a88310o0455p149P9781J25990P5501L2910K802J19162m8574m6781R54J3740
22676I9571o7475M805Q3710m4612r842Q3045k3030p0720n2190L0180k369L714
22664C4787J8779p6779J2042l335o2679N7049L0174n5815j5430N443m6011p4047
$$ y = [-21825, 4303, -2723, -13204, 3935, 59343, 74599, -6534, 34135, 78884, 96048, 10721, -58967, -101565, -148628, -104579, -120391, -142921, -85982, -20605, 42328, -22185, -114158, -94421, -1671, 5037, 7668, -36905, -68789, -51215, -23742, -15671, 32124, -14153, -69037, -30409, -22482, 38222, 71125, 21675, -65649, -82288, -47526, 3905, -52417, -75515, -27627, -66195, -70975, -29916, 53419, 105857, 56519, 33889, -14955, -15567, -78718, -19576, -16871, -25239, -83969, -188310, -248765, -255914, -176133, -50143, 25358, 58268, 61070, 180232, 131658, 84877, 85831, 99571, 32096, 36901, 120611, 75999, 66157, 149202, 126172, 55452, 3262, 33442, 31073, 34787, 53566, -23213, -11171, -14506, -77185, -20136, 10038, -45777, -61207, -55764, -101775, -175822]
22652a75822k3691N0778N1795K2807J7869m3310k3931Q6260J01048J547m8682
22641A6668K6371r2338j32025N7250J01526q757O2202k7386j5171K1104P0562
22630H0006L990j9624k6095k4137l2501j6141n1345k731O5134M1212n1634l4161
22618f8027L1896l4602M3327Q947m517m5864N5240r465q6005j2706j1800R8820
22606c4756M7148K0379K1935o6921p487J02883l051r1927o1470R5490J5843k1508
22594A6558R1003l1752j03014J0634k6388j861J1285k1495k0862N4868M1857J169
22582B2002k8528K6697L5420L1181J6316K865j8123j3728l4343Q531q177L2314
22570G2427M7405M6776L5957m9787r2030K6047k9398k591l2213R40O5904M7986
$$ y = [-175822, -199513, -148735, -96940, -74133, -56264, -99574, -123505, -37245, 63803, 65350, 16668, 43039, -49299, -181324, -124074, -22548, -31305, 30897, 3511, -11660, 9444, 80006, 83996, 64372, 38277, 14140, -18361, -34502, -85847, -88578, -23444, 17768, -33866, -68027, -36131, -70733, -27406, -18459, -22976, -68840, -13600, -23065, -109070, -121776, -133576, -34756, 12392, 32771, 54706, -12215, -19702, 83181, 80130, -11797, -73267, 22223, 38066, 16558, 107561, 75809, -27205, -16571, -42959, -44820, -33535, -55030, -75892, -21024, 20833, 22002, -6526, 20171, 55591, 86772, 103088, 105953, 87830, 74102, 39759, 48290, 40113, 72427, 119832, 166608, 202565, 152778, 60748, 86795, 57397, 54806, 22593, 23533, 89437, 137423]
22558A37423m2036m1630k9529j14986q0249R1497J66547M8263j3535n3365r1124
22547b2724J9895j3194m0478l9641l118O6457K3598L7960L3564Q248o3105p576
22535a14k0551m4117R937L6201M7505M5726L7083q0236q6494j8622R7944N3012
22523G7274L4230O8238J5440k6032l9772j7346q0565j8254K693p9696k3728O3990
22511b3528M2805k4820J2290k4464M2757J5138Q581J5523k2774K478q7604P363
22499c6255o280m3299J1099Q4878k4709j6596L0516M8125q9082m8188Q3292N9975
22487E3476m2253M5630O6653p9986q6564O4052j9153m064P0309P3475J06066r3289
22475A54352q221j0586k7988n6350K0137M7680n6875j44717o5087L4232J10677
$$ y = [137423, 95387, 53757, 24228, -90758, -171007, -79510, 87037, 135300, 121765, 68400, -22724, -2829, -16023, -56501, -96142, -99260, -32803, -9205, 28755, 62319, 70567, 7462, -114, -20665, -64782, -54845, -18644, 28861, 74587, 111670, 31434, -55060, -73682, 24262, 77274, 111504, 179742, 195182, 169150, 129378, 112032, 31467, 13213, 15906, -63790, -87518, -23528, 19277, -5543, 6747, -17717, 25040, 40178, 48759, 64282, 41508, 43986, -43618, -36255, -42535, -85834, -74735, 10143, -14566, -31162, -646, 47479, -41603, -89791, -6499, 53476, 11223, 56853, 123506, 43520, -43044, 21008, 1855, -2209, 68100, 141575, 247641, 154352, 146131, 135545, 107557, 51207, 71344, 119024, 62149, -82568, -147655, -113423, -2746]
22464b746n3297n6185N7593n3090k7289L3798J7301M5223q200m0002L870m5825
22452a28849K3205K4181p0379L9022J13080N3865O039N640n3958o9729R8390o652
22440C3855l0146j5935M8226L7319j098l2465M2570l8950k0005m1983j05257O2562
22428f1307k1783k6452l5181k9590k3631j8044O0011J16809K4918J008j1752o0829
22416h5823L9514J4181O0267K7975K0997m8486l712N0751j5691p4165j156o2858
22404g8206J9975k923N1050J6772J5420l5822l6236k2611L6719L2359M2138L0282
22392F8917n7385r5428O4200m5447L7600L2636l0535p7230Q720J49766R8819j18218
22380C6415j14076J1623J09821M1141p5663k388O198P1513L8819j15170m0727
$$ y = [-2746, -56043, -112228, -54635, -107725, -135014, -101216, -83915, -38692, -46892, -86894, -83024, -128849, -105644, -81463, -151842, -112820, 260, 54125, 60164, 65804, 11846, -57883, 40507, 33855, 3709, -12226, 36000, 73319, 72221, 39756, 82326, 43376, 23371, -18612, -123869, -61307, -83090, -109542, -144723, -174313, -197944, -215988, -155977, -39168, -14250, -13242, -24994, -85823, -46309, -32128, 28139, 56114, 77111, 28625, 24913, 75664, 59973, -14192, -15348, -78206, -58231, -61154, -10104, 6668, 22088, -13734, -49970, -72581, -35862, -3503, 38635, 68917, 11532, -83896, -19696, -65143, -27543, 5093, -25442, -102672, -93952, 55814, 154633, 36415, -77661, -66038, 43783, 84924, 9261, 6873, 13071, 84584, 123403, 8233, -32494]
22369c2494m0792J4636m1471M5306N2494j3280K3309j3386O6808N6120l1356j6686
22357F9208q3141J7881l0993R2898K3665j40462r8714k5900K8814Q052M8073J746
22345h8873L7893J02746L6245o1404o6305j8930o6279P6776R8079p3963k3236
22334d7251O0938O7550O0331N579q4883m545p5997k9486K590L8456l4847O3123
22322B1558j5636p2714M8140N808N935O4861l0530k9768J7407j5561N0057Q0641
22310A30198J8897k8689k6139j6299J7211p7940j42954N4571J07238r2544L2312
22299b4138j79O3006k1437K2491p8821p0502k9491J07748O3180p582O5556O167
22287I5998p3932j3419n5859l1289j8078k3662J5172O39P9529L3540k2465j5715
$$ y = [-32494, -73286, -58650, -100121, -54815, -2321, -15601, 7708, -5678, 61130, 117250, 85894, 69208, -13933, 3948, -27045, 65853, 89518, -50944, -149658, -175558, -146744, -138692, -90619, -88873, -50980, 51766, 88011, 26607, -39698, -58628, -124907, -48131, 49948, -24015, -47251, 13687, 81237, 141568, 147147, 62264, 57719, -18278, -47764, -45174, -6718, -41565, 21558, 5922, -66792, -18652, -12844, -6909, 57952, 27422, -2346, 15061, -500, 49557, 130198, 149095, 120406, 94267, 77968, 95179, 17239, -125715, -71144, 36094, -56450, -24138, -24317, 38689, 17252, 39743, -39078, -109580, -139071, -31323, 31857, 24275, 89831, 95998, 22066, 8647, -47212, -78501, -96579, -120241, -105069, -104430, -24901, 8639, -13826, -29541]
22275b9541O3398l4331k4032K7759N9413k5996r4254Q373M37P5387M115r482N9061
22262H0307N9316k8860m4334K0189l8884r0822L4699J05014K5996j04257r4943
22251g6579K9529J6496o6406r028O9347L7030Q5442n813j24013j15836M4297J23924
22239H390k299o0940K3255k2597j8453M8370M0870j1781L2325j2722l3593P069
22227b106K4086j2479j6000N7076j3247n4085M8596l0656o8470k020J7666j4184
22215f5823k2924m0034m935P0193J5369P5142m5325j21538J6141P4260K5297o1624
22203h5801Q8187K946j815K7740m3428Q0032K8542K2305L999J3005j4447l3367
22191H7898l8091m7499O0668J1538J0726q1578M983l0896k324K6207p8840l1351
$$ y = [-29541, 33857, -474, -24506, 3253, 62666, 36670, -57584, -49211, -48774, 26613, 30728, 21246, 80307, 139623, 110763, 66429, 86618, 47734, -43088, -8389, 96625, 122621, 18364, -76579, -47050, -30554, -96960, -105988, -36641, 389, 85831, 80018, -43995, -159831, -115534, 8390, 6091, -54849, -31594, -54191, -72644, -24274, 16596, 4815, 37140, 24418, -9175, -2106, 21980, 9501, -6499, 50577, 37330, -16755, 31841, 1185, -67285, -69305, -51639, -65823, -88747, -128781, -133716, -63523, -48154, 26988, -18337, -139875, -123734, -49474, -24177, -85801, 2386, 5332, 3517, 31257, -12171, 67861, 96403, 118708, 122707, 135712, 121265, 87898, 49807, 2308, 62976, 74514, 85240, 3662, 8645, -22251, -24575, 1632, -77208, -108559]
22179a08559R8619R7485J16158l3424j5979m2943l3724K112l3441N918p5264j2150
22167c5192J01510K4765l1571M332Q0570O257N5830r222p1839q2730j0687l7532
22155e509o3652k3849P9647N6785N0068r7962k9745k6905L44m245M1845N9863
22143C6685J709J1929k4815l4737p2952M4958J0395j2295J0583n771m0047K1169
22131e3189M3093k7180n2438N788K7503N034l2702r875P9574R1277o7908J8543
22119B7520k3550p3052j9706j08232J080J17310J30898O842J8327J7733p3171
22108B1999p9989l2200k3852r4767M360N3333q480m502N4774P9185M01J0851q3839
22095a02726K25M9328m387n5940l162R6828O7013q7340j33O6319k7214k6587N0459
$$ y = [-108559, -9940, 87545, 203703, 170279, 154300, 111357, 77633, 79745, 46304, 52222, -23042, -35192, 66318, 91083, 59512, 63844, 144414, 150671, 206501, 197279, 125440, 42710, 32023, -5509, -69161, -93010, -13363, 43422, 93490, -4472, -34217, -61122, -60778, -65023, -23178, 36685, 38394, 50323, 25508, -9229, -82181, -37223, -26828, -39123, -28540, -34311, -74358, -53189, -10096, -37276, -89714, -83926, -56423, -51389, -84091, -93966, -14392, 76885, 8977, 27520, 3970, -69082, -88788, -197020, -195940, -78630, 52268, 59110, 77437, 95170, 21999, -57990, -90190, -114042, -208809, -204449, -151116, -159596, -164098, -109324, -30139, -29738, -18887, -102726, -102501, -53173, -57560, -113500, -116662, -19834, 47179, -40161, -40294, 26025, -1189, -27776, 22683]
22082B2683M0752J5791j5894p6274m8837N8012l140k2140l2872p6755K3701N6587
22070e8386J4915n2079O833J37480n005n8674j4519m551m6078m5267L6475P2791
22058a6065j9738m8117j0223l1939J7571K5787p6089p9456M5635J07265L9304
22047d6065j0527j7473o9506l449l5789N5469O3306P1448M5880j6085o2738k6086
22035e1615P6147J02548n3771m0991m0967j001L2794j5394l8800O8395L1653j4420
22023E4578n9978l465J10720O8677m7581p6453J3476p1504l8323l0023K4407K6160
22011b9309p427m6459j14320k2832L1918J9584J29206J34873K3006j11984n4178
22000d7922M3811M9008K6238o1428o319j755O0700K1979N8206n6170l4901J2747
$$ y = [22683, 63435, 79226, 63332, -12942, -61779, -3767, -6907, -29047, -61919, -138674, -114973, -58386, -43471, -95550, -88717, 48763, 43758, -14916, -29435, -33986, -80064, -125331, -88856, -16065, -35803, -83920, -94143, -126082, -108511, -82724, -158813, -238269, -192634, -85369, -46065, -56592, -74065, -143571, -147020, -182809, -127340, -64034, 7414, 53294, 37209, -25529, -51615, 24532, 127080, 73309, 32318, -8649, -9650, 23144, 7750, -31050, 37345, 68998, 54578, -5400, -8865, 101855, 170532, 122951, 46498, 59974, -11530, -49853, -79876, -55469, -29309, -36736, -83195, -197515, -220347, -188429, -168845, -39639, 95234, 118240, 6256, -47922, -4111, 44897, 71135, 9707, 3388, 1633, 62333, 84312, 142518, 86348, 51447, 64194]
21988F4194L1771J6929m4694j07714l9691K4520P8490R2906r7549j6250O3389
21977F6301K0240l1084p1789K0454J7244l2759j36666J7700P8304Q1023k1841
21966G127l3689n8457m0154P5652J22454O3048l9638K5675q2422j19276q2791
21955a62471o7376Q9344M5359j1283K8871K233o506R5592J6179n0905J1460N3243
21943D3740k11j15599j10019N8802J04664P247M2390m9170m7836N0448k1429J0607
21931b6366J5983M5095k2524l8312L6872R656J8693P1509n5024j2432J13500J23424
21919B80074j882l5932o4543r7226q9369p97L0431J284J5914O0552J0760j05106
21907D160l8905k8973L1736J0179o7218K3365M3719K9750O9098o5599l1191l57
$$ y = [64194, 95965, 112894, 68200, -39514, -79205, -54685, 23805, 116711, 19162, 2912, 66301, 86541, 55457, -16332, 4122, 21366, -11393, -148059, -130359, -52055, 28968, 7127, -26562, -85019, -125173, -49521, 72933, 135981, 96343, 122018, 39596, -79680, -162471, -229847, -140503, -95144, -106427, -77556, -75323, -81829, 13763, 29942, -20963, -9503, 43740, 43529, -72070, -182089, -123287, -18623, -11376, 31014, -18156, -65992, -15544, -36973, -26366, -10383, 34712, 12188, -26124, 10748, 20404, 39097, 110606, 55582, 43150, 156650, 280074, 278192, 242260, 177717, 80491, -8878, -9675, 20756, 22040, 37954, 98506, 109266, 4160, -34745, -63718, -31982, -21803, -89021, -65656, -21937, 7813, 76911, 11312, -19879, -20236]
21895b0236p043N9192q9316q9520N3124M0672L9681P2560o343j24262n8839K5707
21883a04623O432k9211J7690N94K8137N8073o016n2254q0319m0594K6326J16418
21871e9347K0371o674m0081L7273J31975L7572j00507j18086L168M1347O3154
21860A0165J5019K2451N098p9939j04707k6173J5943L0665j22J11862O8834o5075
21848D021l7004N8999m5765r4652r9513R1811J31781k1189l8304N7388K0345m0047
21836a2129k2929N1899m3887L4114l2919n2980Q9654O6819j5418k646p3584l1113
21824d5119q1531k7897K7237J7521J04093J16789L6606m5664n8538l4537q9694
21813h0734L4584R2575M3174n1663Q842m3768k6j9993p5381K9942O0856R037l3528
$$ y = [-20236, -27279, 31913, -57403, -146923, -93799, -53127, -13446, 59114, 52771, -71491, -130330, -104623, -98191, -127402, -109712, -109118, -80981, -22908, -28924, -81178, -161497, -202091, -175765, -59347, -38976, -45650, -85731, -48458, 83517, 121089, 20582, -97504, -94336, -52989, 10165, 25184, 47635, 52733, -27206, -131913, -158086, -142143, -111478, -111600, 262, 69096, 4021, -32983, 26016, -19749, -114401, -213914, -122103, 9678, -11511, -49815, 7573, 27918, -12129, -35058, 16841, -27046, 7068, -25851, -78831, 10823, 77642, 62224, 59578, -14006, -45119, -126650, -154547, -127310, -109789, -5696, 111093, 147699, 102035, 43497, 8960, -80734, -46150, 46425, 89599, 37936, 46778, 3010, 2984, -17009, -92390, -62448, -1592, 7445, -26083]
21800b6083n2739m7N482J01762J6977l9560o0934l2778K9195M3025K5092M6651
21788E6043o3025r9514K765M7984L4555M4776m1742j9289k1427P7395N4396p4494
21776a577J938J8659r1099n6666l1519P8541L0860L0501R168p22L2868l831Q5678
21763A02799N3654q4018j06400j5721N2441M0993K0015p9119j35341n6364P5704
21752a31357O4983J3968O3536P9443p8401q6168O4410M5508l6683j26759m099
21741a31619O9019O7725K627l7880m6086K0189r6884j1975Q8702j4907l2475j2567
21729a36131J14k6280L4378q7285R9014R0516p1197P202M2321r369J9398J3319
21717b4000M9875M7580L5757k7885q5650j2349n662J4866o169k1987L3469M0590
$$ y = [-26083, -78822, -78869, -73387, 28375, 45352, 5792, -55142, -87920, -58725, -15700, 9392, 56043, -6982, -106496, -103731, -55747, -21192, 23584, -18158, -37447, -58874, 18521, 72917, -1577, 361, 19020, -72079, -128745, -160264, -81723, -50863, -20362, -11194, -11916, 20952, 17121, 102799, 156453, 72435, -33965, -49686, 2755, 43748, 63763, -15356, -150697, -207061, -131357, -66374, -52406, 11130, 90573, 12172, -73996, -9586, 35922, -761, -127520, -131619, -62600, 5125, 7752, -30128, -76214, -56025, -152909, -164884, -76182, -91089, -123564, -136131, -136017, -162297, -127919, -215204, -116190, -25674, -96871, -89669, -47348, -56717, -37319, -24000, 25875, 73455, 109212, 81327, -4323, -16672, -22334, -7468, -13637, -35624, -2155, 38435]
21705C8435l3502M5780K42J3808O3113j5217j07042j3671j9591k9073q9854k9442
21693a76014O7153K0216K9232N3272K0830k6839j5596N5835R0445M8367J4667
21682A81568l8387n58j38691o6499n799R5401J3533j10971j2289M5539l3820Q88
21670g0085M6901L4871q0833m538Q3934p1584m4440j3720R3133P4061j6832k0894
21658I974k7237K2726L4377l2949m5957P4847P6643J5372j7528n701O3577J8491
21646A86635o7409m2847q1498j00926N480N3336J2379K9984J30107j5017o7296
21635D2928n0004Q0481J9204j3300J2685k3996j8114o311m8388j19951J08123
21624a6643M9889k3416r0295K5074L6415L7417O4365l94p5307q1850j27m5003
$$ y = [38435, 4933, 50713, 50955, 64763, 127876, 112659, 5617, -8054, -27645, -56718, -146572, -176014, -108861, -88645, -59413, -6141, 14689, -12150, -27746, 28089, 118534, 166901, 181568, 143181, 142623, 3932, -62567, -68366, 27035, 40568, -70403, -82692, -37153, -70973, -70085, -23184, 11687, -69146, -73684, 10250, -61334, -105774, -119494, -26361, 47700, 30868, 9974, -17263, 5463, 39840, 6891, -39066, 35781, 112424, 127796, 110268, 104567, 168144, 186635, 119226, 76379, -5119, -106045, -100565, -47229, -34850, -4866, 125241, 110224, 42928, -7076, 73405, 92609, 79309, 91994, 67998, 49884, 43573, -4815, -124766, -16643, 33246, 9830, -80465, -55391, -18976, 18441, 82806, 82412, 7105, -74745, -74872, -119875]
21612a19875J2569N2994J23339j878k0416m6198N923M093L0543j6167j3690K5546
21600C6783m4147N0147j1422k0102R598L2595P8992M5365k3939q5401p1760o1138
21588f4429L7694n4888M8157L1684j7952n492L7317n2597K5843J7830n0978r816
21576e7627J2122K8978N4226P8716k4448O2071L3184k6910j7888o1307k4540k151
21564E4426J2186l9218m3382r849o0456q338k7585R9783L8820k4469N5808R178
21552E6904p3610j4240m2075O6470k977K9964M8918J3094j09416M00j9546L3884
21540a2230O096K5290K6519L1150p031j24169m6000M8278O1435j2684m4244k1492
21528f9082J9716Q919N5635P8777l9398K361M6187l8667J2634l8979m7936l4509
$$ y = [-119875, -107306, -54312, 69027, 67149, 46733, 535, 6458, 10551, 41094, 24927, 11237, 36783, -7364, 42783, 31361, 11259, 20857, 53452, 132444, 177809, 153870, 68469, -3291, -64429, -26735, -81623, -33466, -1782, -19734, -25226, 12091, -40506, -14663, 3167, -47811, -57627, -45505, -16527, 37699, 116415, 91967, 154038, 187222, 160312, 142424, 81117, 56577, 54426, 66612, 27394, -15988, -25837, -86293, -94631, -122216, -22433, 16387, -8082, 47726, 56904, -16706, -30946, -73021, -6551, -9528, 20436, 69354, 82448, -26968, -26568, -46114, -12230, -6134, 19156, 45675, 76825, 69794, -54375, -100375, -52097, 9338, -3346, -47590, -69082, -49366, -40447, 15188, 93965, 54567, 56928, 103115, 64448, 77082, 38103, -9833, -44342]
21516d4342K3169M0945R2173K9396r6177K844O7825L6684j20558m8692k7978J7333
21504b7378L8483N9970l0503n5025J5142K4942p9863M9438p2616q8576J3788K1326
21492a30872J03202K8180k591k8238j538l2475J11647M7996K2828M0365q6637
21481G1867l3735J2476M9574J8473J15575k2079r6330O91N5530m4211j03345l2972
21469h486j4979J5381j8820j9896N7515M2008n7130p224Q4156J13884N1697l7127
21457B00979o9421j3875k6570l3800m9238k386l7926K8717k7270J3773O5649j9108
21445B9524k446J7907L5287N5767k4114p2690l8831l3476n1937q299J9243J206
21433g2859n5123l3422R028R0065J21853p5667j08943M4286L9630O1477K9121
$$ y = [-44342, -21173, 19772, 111945, 141341, 45164, 48008, 115833, 152517, 31959, -16733, -44711, -27378, 11105, 71075, 40572, -14453, 689, 25631, -54232, -4794, -77410, -165986, -152198, -130872, -27670, 510, -2081, -30319, -31857, -64332, 47315, 95311, 118139, 158504, 71867, 38132, 50608, 100182, 118655, 234230, 212151, 115821, 116512, 172042, 127831, 24486, -8486, -23465, -8084, -26904, -46800, 10715, 52723, -4407, -11631, 72525, 186409, 238106, 200979, 131558, 117683, 91113, 57313, 8075, 5689, -32237, -3520, -30790, -17017, 48632, 29524, 27078, 44985, 80272, 136039, 111925, 39235, 404, -33072, -85009, -93308, -74065, -72859, -127982, -161404, -152376, -62311, 59542, -16125, -125068, -80782, -41152, 20325, 49446]
21422D9446l1137l0497k2066J20430M9822p2354M3189J6669o5033n8886k2548
21411b2965o8437k0587J19678O5298k7833o0235J2965M2014k344J8365K60Q973
21399F5152M8530k7724n5079P6240J4516j04204l8433m7066J9149J65136O7166
21388A83383n3400n5298k9793k5309j4454N7823R9850l1637M902n5577r298P4860
21376A46052k0896k5032M6710k575O100m8530m8927R3792j8958L0551L4738n1318
21364A41707k2702n8689k4962J6153o3930M4250Q8231L3214k6888K0505q116m3598
21352I5175L9L3940q0006J8916M3563N1462Q4587k9495l351q5137N5281L9967
21340B24941L1585O4816M5954P0345k2470k1511R1188J86228Q3855J13544K33314
$$ y = [49446, 18309, -12188, -34254, 86176, 135998, 63644, 106833, 123502, 58469, -417, -22965, -91402, -111989, 7689, 72987, 45154, -15081, -2116, 39898, 37554, 55919, 56179, 65152, 113682, 85958, 30879, 107119, 121635, 17431, -21002, -68068, -48919, 116217, 183383, 129983, 74685, 44892, 19583, 5129, 62952, 162802, 131165, 136067, 80490, 71192, 146052, 125156, 100124, 146834, 144259, 150359, 101829, 52902, 146694, 127736, 158287, 193025, 141707, 119005, 60316, 35354, 51507, -12423, 31827, 120058, 153272, 126384, 146889, 138773, 95175, 95214, 129154, 49148, 68064, 111627, 163089, 247676, 218181, 214830, 129693, 184974, 224941, 256526, 321342, 367296, 437641, 415171, 393660, 484848, 671076, 754931, 868475, 1101789]
21329A101789J28413O7540Q6573K6317m8474M910j3904j19783J5351J7151j04869
21318A161014l7084l6270j28443j92716o0273k9525M2214N6167N7731K3138p6546
21307G79407k6177j3985J1096R927K5419R2P9583L7155M6184Q8842M1321l285
21295A075579P6450Q5741O6414Q4172P4483Q4195M8462q1134o8644j25773j57854
21284A162091k21239j25016L181o6804j83137p5385k7381r351j7847q6246m5908
21273C06958q4993j25303k8711m017o0597Q0235O3575q242P732J6103K0050J566
21261A84356l1097o2718N4889Q7848l6939p2828p653L7918m7148n1487q1229m8840
21249g4928O9941R613M315R0419L2713L5959k0865K30m9130l1875K27k828J8282
$$ y = [1101789, 1230202, 1297742, 1384315, 1410632, 1362158, 1367068, 1353164, 1233381, 1248732, 1265883, 1161014, 1123930, 1087660, 959217, 766501, 706228, 676703, 718917, 775084, 832815, 855953, 779407, 753230, 739245, 750341, 760268, 785687, 785779, 865362, 902517, 948701, 1037543, 1078864, 1075579, 1152029, 1237770, 1304184, 1388356, 1462839, 1547034, 1595496, 1514362, 1445718, 1319945, 1162091, 940852, 815836, 819017, 752213, 569076, 493691, 466310, 456959, 439112, 352866, 306958, 221965, 96662, 67951, 63934, 3337, 83572, 147147, 138905, 146637, 162740, 182790, 184356, 153259, 90541, 145430, 233278, 196339, 123511, 115858, 153776, 106628, 55141, -26088, -74928, -4987, 4626, 8941, 99360, 132073, 168032, 147167, 147397, 98267, 66392, 66619, 63791, 82073]
21236H2073o0792n9774m0244m1847R397n0944J4851P4978O3573o5932M3070L8647
21224G056J3291J3590N4587l0830l4550j03325N0340r258L434k5232J49409J15215
21212B03727m8439q6083o381P1757K8885n8207k9860M5122M943l3575R673K958
21200A04520j3967P5735j3241r9006j4964L4946O8315k9965K9006Q0377Q969l7822
21188A92903o6348l6069M163L7335j0361m0933K0154K5403L589K054m7013o90
21176H4187o674J63K688k3519k6513r949m0969K8647R8338P0564P707j8834p022
21163A58814J4458k5042o7562N2318J3550J780m1455L8977Q9746J6129r0206m345
21151A57162L874m3699j31639q6222M7595O2521l3463O8912p6376k8251N6731
$$ y = [82073, 21281, -38493, -78737, -120584, -111187, -162131, -147280, -72302, -8729, -74661, -31591, 7056, 20347, 33937, 88524, 57694, 23144, -80181, -29841, -39099, -35665, -60897, 88512, 203727, 155288, 69205, 62824, 134581, 163466, 105259, 75399, 120521, 125464, 91889, 101562, 104520, 90553, 166288, 153047, 54041, 39077, 74023, 142338, 112373, 141379, 221756, 230725, 192903, 126555, 90486, 94649, 131984, 121623, 80690, 100844, 126247, 129836, 131890, 84877, 84187, 77513, 77676, 80364, 56845, 30332, 20383, -20586, 8061, 106399, 176963, 184670, 165836, 158814, 173272, 148230, 80668, 132986, 146536, 148316, 106861, 145838, 235584, 251713, 161507, 157162, 161036, 117337, -14302, -100524, -52929, 9592, -23871, 45041, -31335, -59586, -2855]
21140b855N632J875J82085L4043n2373k2659n1883r2100m9150o583L5442J17606
21128I9080O5049L8531o0648j24389o4973J05695Q9767P6136j6161o5826m6148
21117I6113M3479N3961M4525o9350n9331M804j8996n6350m0538J10150M3006n4478
21105I6995j06438m0414J11653O0929L8181m6078r0046l3594Q1887P8480o0974
21094I0581M1075O1761o2258k2533N860l8449p728K654J694M4421j7006m3327
21082E6745k2872J7411J32445N5147J4629M7318l0957n6621Q772n1737j4545p2120
21070H3615l8033M3758J2878m7946j5404P9070k464M4690o625j9363K6609j7773
21058A43012J7606M3503J27063l6253l4331o0135o8620j40o24O4947j6447r068
$$ y = [-2855, 2777, 4652, 186737, 220780, 168407, 145748, 93865, 1765, -47385, -53968, -18526, 99080, 164129, 202660, 142012, 17623, -47350, 58345, 148112, 224248, 208087, 142261, 96113, 139592, 193553, 238078, 168728, 109397, 114201, 95205, 38855, -1683, 108467, 151473, 96995, -9443, -49857, 61796, 122725, 160906, 114828, 24782, -8812, 73075, 151555, 90581, 131656, 193417, 131159, 108626, 114486, 76037, 68309, 70963, 72657, 117078, 100072, 56745, 33873, 51284, 183729, 238876, 253505, 300823, 269866, 213245, 222017, 170280, 155735, 83615, 45582, 89340, 102218, 54272, 38868, 117938, 115474, 160164, 153539, 134176, 160785, 143012, 160618, 204121, 331184, 294931, 260600, 200465, 131845, 131705, 131081, 196028, 179581, 170513]
21046A70513k8173M6118Q996l8476k8645P5664M2843K4295o4722j7551J0281l8561
21034A62582p014J8054l4707j7073j4839N5256j199m1931M7511O0441k5271O66
21022B02476k1768o3507M6269L7320p4709J17921J08871r0321q2546M9876P8058
21011C07940N2386P0560o6063J1438p61l1546Q6815k9508o1335k3587N8107l2167
20999C42279P1248J18798l4368o9517N7571M5484k2115o0034k1404L2020j5463
20988D44499p9942P613k2111M4465M1524K2388j1858R0634M5653m1195J3650k4713
20976E30607N8816K5085O2480n3541k2263J24671R2245K525j38109m5619m919
20965F31978p2206q1522K5158P2877o4454l1416Q4746J4997j10765o1827M4099
$$ y = [170513, 142340, 188458, 197454, 158978, 130333, 205997, 248840, 273135, 208413, 190862, 201143, 162582, 155568, 173622, 138915, 121842, 107003, 162259, 161060, 119129, 166640, 227081, 201810, 202476, 180708, 117201, 163470, 200790, 126081, 244002, 352873, 262552, 180006, 229882, 307940, 360326, 430886, 364823, 376261, 375500, 343954, 430769, 401261, 339926, 316339, 374446, 342279, 413527, 532325, 497957, 428440, 486011, 531495, 509380, 449346, 427942, 459962, 444499, 364557, 372170, 350059, 394524, 436048, 458436, 446578, 537212, 582865, 541670, 555320, 530607, 589423, 614508, 676988, 623447, 601184, 725855, 818100, 820625, 682516, 636897, 631978, 559772, 478250, 503408, 576285, 511831, 480415, 565161, 580158, 469393, 407566, 451665]
20954D51665N6583J1441J8436k3787M7815P2956j0247j4066J570m4984r2324K7169
20942E02227Q8350k8143J1844M1179n4602j09702M6980O253L2719L8274l2056
20931E43323p5567K2269p8593N3329Q2351q658q0045j780r180O5152L5899R666
20919E58166N6040N0868K7176l3317n0450o3263k914j2521Q0927P065j4678L4254
20907F37353J1223o3628L8017M2093L0035p8856k7318l2102l9515p2632J1169
20896D55839O1595K531M9712N8145R875k4912J9253J37471O2786j05407q6201
20885F40687J4983P4838J96188Q6781J1705m5080q7275J7873O310J8551J46568
20874A082129J51395L6808n8144p6663O5249N3339N9218j37780m3752L8722m690
$$ y = [451665, 508248, 519689, 538125, 514338, 562153, 635109, 624862, 610796, 612366, 567382, 475058, 502227, 590577, 562434, 574278, 615457, 560855, 451153, 498133, 504386, 537105, 575379, 543323, 467756, 490025, 411432, 464761, 547112, 538454, 458409, 456629, 447449, 512601, 548500, 558166, 614206, 665074, 692250, 658933, 608483, 545220, 542306, 529785, 610712, 617777, 603099, 637353, 648576, 584948, 622965, 665058, 695093, 616237, 588919, 556817, 517302, 444670, 455839, 517434, 519965, 569677, 627822, 637697, 612785, 632038, 769509, 832295, 726888, 640687, 655670, 730508, 926696, 1013477, 1025182, 980102, 892827, 910700, 917010, 935561, 1082129, 1233524, 1270332, 1212188, 1135525, 1200774, 1254113, 1313331, 1175551, 1131799, 1170521, 1165831]
20863A165831r525o3021l4833k4057r824m0587K7521J17437P4137R7321P8790
20852A379190k5351l0117O7546Q5386O6212J1274O614O2467M8363J7334o3824
20841A625094l5593L0170J5284M3252Q2859M9119L8128N000M3196K1362J09812
20830B027683P0066O5555o8372m4738r883J60914J36948N2131m3968J098l5701
20819B311733N7587Q0306J00203R5161J83019O3662L4471Q4820N7584J14031L0661
20808C213238M4664J23596P2584J71307J88779J38701R5204J50079K17404J98436
20798D613992J30620K97251L25806L20424L12579L67607N05660N59680N11181
20789G944800N12228M90148N02488M16421M36636M94062N91840O52990O29578
$$ y = [1165831, 1156306, 1093285, 1058452, 1034395, 1024571, 983984, 1011505, 1128942, 1203079, 1300400, 1379190, 1353839, 1323722, 1391268, 1476654, 1542866, 1554140, 1560754, 1623221, 1671584, 1688918, 1625094, 1589501, 1619671, 1634955, 1678207, 1761066, 1810185, 1848313, 1853313, 1896509, 1917871, 2027683, 2097749, 2163304, 2094932, 2050194, 2040311, 2201225, 2338173, 2390304, 2346336, 2347434, 2311733, 2369320, 2449626, 2549829, 2644990, 2828009, 2891671, 2926142, 3010962, 3068546, 3182577, 3213238, 3257902, 3381498, 3454082, 3625389, 3814168, 3952869, 4048073, 4198152, 4415556, 4613992, 4744612, 5041863, 5367669, 5688093, 6000672, 6368279, 6873939, 7433619, 7944800, 8457028, 8947176, 9449664, 9866085, 10302721, 10796783, 11388623, 12041613, 12671191]
20780A2671191P10048Q27006Q49418J017339J032557J036509J045862J074020
20772B0263950J302238J512679J768323K090027K651114L283258L943882M829590
20764D1645061O084434P470992R451632J2030887J5326239J9379759K4042281
20757A35431285K8869180L2667375L2661576K6276710J3146912k653599j4744568
20750B51654871j9802390j8644743j3861120p750172k206184J953168L132844
20743A94476274M00448n414915j1680490j5827426j6759653j5175366j2393242
20736A17625630r240715o043826l017188J8586L163748O723555J0205266J3751512
20728A33186568J6613611J7544431J5046938R211193K638212j797389k411606
$$ y = [12671191, 13381239, 14208245, 15057663, 16075002, 17107559, 18144068, 19189930, 20263950, 21566188, 23078867, 24847190, 26937217, 29588331, 32871589, 36815471, 41645061, 47729495, 55200487, 64652119, 76683006, 92009245, 111389004, 135431285, 164300465, 196967840, 229629416, 255906126, 269053038, 266399439, 251654871, 231852481, 213207738, 199346618, 191596446, 189390262, 191343430, 194476274, 194876722, 189461807, 177781317, 161953891, 145194238, 130018872, 117625630, 108384915, 102341089, 99323901, 99342487, 102506235, 109229790, 119435056, 133186568, 149800179, 167344610, 182391548, 191602741, 194240953, 192443564, 190031958]
20721A90031958Q30070O595235J3320579J9770198K3665748K1965722J2265612
20714B88445122l565517j9295014k9452155l2888921l1123537k7141549k2899439
20707A22078990j8867667j5397576j2534486j0054154q254142o932976n746122
20700D4291867m772820m008340l428444k901966k358434j899964j542952j355604
20692B2023343j353505j164389j065637j056730j015159p98101p42133p13162
20684A4114527o65837n78276n37689n40859n95912n78329n33433o68728n40495
20675H874969n61431n22207m58261m00460m01865l69893l31112l17124k58817
20666E253799k37586j78660k72326k24245j35136k9205j56385j96084r3514j03856
$$ y = [190031958, 190862028, 197457263, 210777842, 230548040, 254213788, 276179510, 288445122, 284879605, 265584591, 236132436, 203243515, 172119978, 144978429, 122078990, 103211323, 87813747, 75279261, 65225107, 56970965, 50037989, 44291867, 39519047, 35510707, 32082263, 29180297, 26821863, 24921899, 23378947, 22023343, 20669838, 19505449, 18439812, 17383082, 16367923, 15569822, 14827689, 14114527, 13448690, 12870414, 12332725, 11791866, 11195954, 10617625, 10084192, 9415464, 8874969, 8313538, 7791331, 7333070, 6932610, 6530745, 6160852, 5829740, 5512616, 5253799, 5016213, 4837553, 4565227, 4340982, 4205846, 4176641, 4020256, 3824172, 3730658, 3626802]
20656C626802j51243j17943o8667k9769j40298j37404o6874n8976l1820r2528
20646B731280j37550n8233k5084m9447O535r0836L6164l5018j02708p5151o5403
20635B134549n6670j59239m4823N8636n1896p1891k7093L0829N3216P8762k6808
20624A917572l9318n6255m2172k0544k6668j38407q3357n6058n4665k1349P2191
20613A450970O4610J06820k7382j00561p7595l2779J9153k9481j8536j0327L9033
20602A383925q9112N474k6498k3024l0749k3832N8527j9175K0796L9912J0376
20591A306620M6249o2445K1484K3594N1567K6362o8208K4366O6482j2383j2331
20580A411357O1916l4534n0668j5558N4505O9756m0050n8338N1708L7760o3166
$$ y = [3626802, 3475559, 3357616, 3288949, 3259180, 3118882, 2981478, 2914604, 2855628, 2823808, 2731280, 2593730, 2535497, 2510413, 2460966, 2467501, 2376665, 2412829, 2377811, 2275103, 2199952, 2134549, 2077879, 1918640, 1873817, 1932453, 1880557, 1808666, 1781573, 1812402, 1865618, 1944380, 1917572, 1878254, 1821999, 1779827, 1759283, 1732615, 1594208, 1510851, 1454793, 1400128, 1378779, 1450970, 1515580, 1622400, 1595018, 1494457, 1416862, 1384083, 1403236, 1373755, 1355219, 1344892, 1383925, 1294813, 1300287, 1273789, 1250765, 1220016, 1196184, 1254711, 1235536, 1256332, 1296244, 1306620, 1352869, 1290424, 1311908, 1335502, 1387069, 1413431, 1345223, 1369589, 1436071, 1423688, 1411357, 1473273, 1438739, 1388071, 1372513, 1427018, 1496774, 1456724, 1398386, 1450094, 1487854, 1424688]
20569A424688L2698N4993o3238l9818K3548j2917k0376m6189m4582j16348n1555
20558A140904L7072n3470L3162n4396J6724J04087r613l8551K891r5919p0811
20547A012080K1361O9706j2588j9020L2487N1032o091m6471k2968K709Q566J17897
20535A208700l2695m9439m9356k4129o241N0915K3912P592J8172n1494o1034q655
20523A026248n1387j43162j11180J2238m011L8784j5604n7803j09300l193l008
20512E78622j15869q5634l1416N8131R8076M1583j2438p6392l2138M1263j0839
20501D52949n376M2200k2154J0526j01170L927Q6707N1937l5071q7552l7665n5683
20489C03575l5306M5812K2723J9258j763n985O0517j6067o1218n3578M0574J23741
$$ y = [1424688, 1457386, 1512379, 1449141, 1409323, 1432871, 1419954, 1399578, 1353389, 1308807, 1192459, 1140904, 1177976, 1124506, 1157668, 1103272, 1119996, 1224083, 1214470, 1175919, 1178810, 1082891, 1012080, 1033441, 1103147, 1090559, 1071539, 1104026, 1155058, 1148967, 1102496, 1079528, 1082237, 1090803, 1208700, 1176005, 1126566, 1077210, 1053081, 1046840, 1097755, 1121667, 1129259, 1147431, 1095937, 1034903, 1026248, 974861, 831699, 720519, 732757, 728746, 767530, 751926, 694123, 584823, 581630, 578622, 462753, 377119, 345703, 403834, 501910, 543493, 531055, 454663, 422525, 463788, 452949, 447573, 489773, 467619, 478145, 376975, 380902, 467609, 519546, 484475, 396923, 359258, 303575, 268269, 314081, 336804, 356062, 354299, 348314, 408831, 392764, 331546, 277968, 318542, 442283]
20477D42283j9876j11862p5293p9290p1353J04319K4759l3565M5361J47999J16494
20466D89976o0920j82484j19931K8299Q4387P0973N7905r2669j299o0112j5136
20455A98989p1140j29K9181R2597M5630M6460Q699O546j02334k8802L2243l4701
20443B23239j1847K01J1086M4495Q813j5473k0841M4824k635Q8766J2076l4579
20431C48125o3381k0239N8390P4571M0138k5865l4850n8824m0002l5841K179N4547
20419B98948l7164n6497o3549Q1315L2417Q6477J785p0985L2561L7565L254m856
20407C41271J8425n9284m5155j3225N7197N4530M912o300n7338m9347J1747l0244
20395B27189j9289K1575N0235K8493j0238r00K4328o4338n0418K2303M3594K587
$$ y = [442283, 422407, 310545, 235252, 155962, 84609, 188928, 213687, 180122, 225483, 373482, 489976, 429056, 246572, 126641, 154940, 239327, 310300, 368205, 275536, 274237, 214125, 198989, 127849, 127720, 156901, 249498, 295128, 341588, 350287, 356833, 254499, 225697, 257940, 223239, 211392, 211593, 222679, 267174, 275987, 260514, 239673, 284497, 281862, 370628, 382704, 348125, 284744, 264505, 322895, 397466, 437604, 411739, 376889, 318065, 278063, 242222, 244401, 298948, 261784, 205287, 141738, 223053, 255470, 341947, 343732, 272747, 305308, 342873, 346127, 341271, 359696, 300412, 255257, 242032, 299229, 353759, 358671, 352371, 295033, 245686, 257433, 227189, 207900, 229475, 279710, 308203, 297965, 297065, 321393, 257055, 206637, 228940, 272534, 275121]
20383B75121J9204m6435o8814k6638j599K3896L9038n7591l735l28m8227k0395
20371H3497K9676R984M3837P9390P2518K4800J9871q7720J6921L6977O3177J3107
20359D06035J8481n1911K0148o9101p2503K3394k2994q105O2707j7561M9761K0979
20347C59330j4574p7616n5369M6674J14734m1036l3021N301l1027L9492N1409
20336C64297n7924N3255Q1509n2319j2187J7950K2631N5616J5445q4599M3590
20325D47264J06208O2104o6753m8866L1648P9179J147j00320N058n0206j8920
20314D47543J01405R8985N343m8960j1653p4358k238R6923J41064k5807q8566
20303F39681j8292R801J5370J3954L2425O0851M1349o9164k6472J18294J29448
$$ y = [275121, 294325, 247890, 179076, 152438, 150839, 174735, 213773, 156182, 152447, 152119, 103892, 83497, 113173, 123157, 166994, 246384, 318902, 343702, 363573, 275853, 292774, 329751, 392928, 406035, 424516, 372605, 392753, 323652, 251149, 274543, 251549, 243444, 306151, 288590, 338351, 359330, 344756, 267140, 211771, 258445, 373179, 332143, 299122, 304423, 273396, 312888, 364297, 306373, 359628, 441137, 388818, 376631, 394581, 417212, 472828, 488273, 403674, 447264, 553472, 615576, 548823, 499957, 531605, 610784, 611931, 511611, 516669, 466463, 447543, 548948, 647933, 653276, 604316, 592663, 518305, 516067, 612990, 754054, 728247, 639681, 621389, 631190, 646560, 660514, 692939, 753790, 795139, 725975, 699503, 817797, 947245]
20292I47245n7798N3564R0916m5156p5742j4819Q947r104l67k9422J743P44J1611
20279H82362l3676r468K7123k2391j7188Q64l6402J15480q1425j52264k5434N9414
20267G06995N0683n6593p3645q6732K7145M5725O2727k8236j1546O6409M4706
20256G47638o6406M7085l590j11431n4635M3123M2465K071q7080l5032p287M2685
20244E59606N628m7283l3216j2150l8197m4304o368K8915P9199n0607o4814l8057
20232C38352q349N6798m2218J9967r9952k3755J19002K1609K4498K4371J1515
20221D41838m3966J3967k1601q6659p1172m2614J0368P4317J5186K0313l9403
20210B70574n4373j955P0153L9006n5453J4974K9441J8885j2674J3183P6996Q9218
$$ y = [947245, 889447, 943011, 1033927, 988771, 913029, 898210, 907157, 898053, 897686, 868264, 870007, 870751, 882362, 848686, 839218, 866341, 843950, 826762, 827626, 791224, 906704, 825279, 673015, 647581, 706995, 757678, 701085, 627440, 540708, 567853, 613578, 676305, 648069, 636523, 702932, 747638, 681232, 728317, 724727, 613296, 558661, 601784, 644249, 646320, 559240, 524208, 516921, 559606, 565234, 517951, 484735, 472585, 434388, 390084, 383716, 412631, 491830, 441223, 376409, 338352, 330003, 386801, 344583, 364550, 264598, 240843, 359845, 381454, 405952, 430323, 441838, 397872, 411839, 390238, 303579, 232407, 189793, 200161, 274478, 289664, 309977, 270574, 216201, 214246, 284399, 323405, 267952, 282926, 312367, 331252, 318578, 331761, 408757, 497975]
20198D97975j01046j19072k7568P4216O528q0738P3926N4749k3767o199J5676
20187C64680J1531k2107L9611P0858P9856M4622k3468K9173N0737L6987Q5677
20176G68157J42904J81398J16874J60385J49452P4462o4739j02324j09091J9924
20166A337402j4743n1249j08135j00943j50863n3750o9970K7703k5723K4219N8094
20155H72042K5693j8546m9784M3900k4429L8575l0869j01104k8101o016j7243
20144G04118J04222J45170O4173P4249R7270J49646J04722R1591m204l565M4957
20133A572349o8272j25325j45197j21504r0205j54303j78521m4678j9298p1437
20123E53609q6116m4487k4023K3911K1130k9775k8318n4811k7497j2111M4417
$$ y = [497975, 396929, 277857, 250289, 324505, 331033, 250295, 324221, 378970, 355203, 349004, 364680, 376211, 354104, 393715, 464573, 544429, 589051, 565583, 594756, 645493, 682480, 768157, 911061, 1092459, 1209333, 1369718, 1519170, 1593632, 1528893, 1426569, 1317478, 1337402, 1322659, 1271410, 1163275, 1062332, 911469, 857719, 787749, 815452, 789729, 813948, 872042, 897735, 879189, 829405, 873305, 848876, 887451, 856582, 755478, 727377, 721361, 704118, 808340, 953510, 1017683, 1091932, 1189202, 1338848, 1443570, 1535161, 1530957, 1527392, 1572349, 1504077, 1378752, 1233555, 1112051, 1021846, 867543, 689022, 644344, 625046, 553609, 467493, 423006, 398983, 422894, 444024, 414249, 385931, 331120, 303623, 291512, 335929]
20112C35929l2445n5640j08825o1184n9244q683J2457L3242O9106P9836m6225
20101A58324p6464L8923K4055O7868O6534K6233k2790q579j20354j11837m019
20090C7894P9438L1160m6457j1269L4649j4001J5236o3266o1518J6584J07053
20079A25503p956J132j5849Q542j25497j0203M8672O8520Q1832J0892p7708l7314
20067G0566M2841k0594M023l4396P283q497j02095J1785K2037n9802N0914J1970
20055c965l0569m0377L8411o960n0040J20111R4696k6227J0958J14678J6811p7807
20043A59720n6315K6951j21111r7483j4780O9861R8009J2963j3476q99M6834K1630
20031A31904m3899j18293O2958J21167n1744j04738K6870N6167K0266m9298N8806
$$ y = [335929, 303484, 247844, 139019, 77835, 18591, 9908, 22365, 55607, 124713, 204549, 158324, 81860, 120783, 144838, 212706, 279240, 305473, 282683, 274104, 153750, 41913, 37894, 117332, 148492, 102035, 90766, 125415, 111414, 126650, 63384, 1866, 18450, 125503, 117547, 118679, 102830, 111372, -14125, -24328, 24344, 92864, 174696, 185588, 107880, 70566, 113407, 92813, 96836, 62440, 69723, 61226, -40869, -29084, -7047, -66849, -15935, -3965, -34534, -74911, -36500, -43460, -93500, 26611, 121307, 95080, 106038, 220716, 237527, 159720, 103405, 130356, 9245, -88238, -103018, -33157, 64852, 77815, 64339, 63440, 110274, 131904, 88005, -30288, 32670, 153837, 102093, -2645, 24225, 80392, 100658, 51360, 110166]
20020A10166M6414K7369j2708J01768l0406p3589M657k4655N4797j8243o4201
20009A21369k7295j0097l9472N2519n292n3700P3704l9300k7542N4862J3742k7299
19997H6199o6585m3293k8261L214N5460J8005N7971l1913M8725M6580K7662j7315
19985A56449K472o8622j2645J6962N8669J09283p1761q0397o3978j7312M3613
19974G2733Q325O35j18151O3235P7189K883j5491R4115m1790o5425L1193Q6446
19962A95897K3547r4710k3965j7087n6814K2120L3395M152m3371J5327j3190L9529
19950H4830J6040n8640k9511K9905P3677j32839j3248N3008L9390l0066J215R181
19938D2942L4936M5858l7957K3354K702j9772R557R5640r3582k3794q6652k870
$$ y = [110166, 156580, 183949, 171241, 273009, 242603, 169014, 173671, 149016, 203813, 185570, 121369, 94074, 83977, 44505, 97024, 91732, 38032, 111736, 72436, 44894, 99756, 113498, 86199, 19614, -23679, -51940, -48726, 6734, 24739, 82710, 50797, 99522, 146102, 173764, 156449, 158921, 90299, 77654, 94616, 153285, 262568, 190807, 110410, 46432, 29120, 72733, 81058, 81693, -36458, 26777, 103966, 106849, 91358, 185473, 143683, 78258, 109451, 195897, 219444, 124734, 100769, 83682, 26868, 48988, 82383, 86535, 43164, 58491, 45301, 84830, 100870, 42230, 12719, 42624, 116301, -16538, -29786, 23222, 62612, 32546, 33761, 42942, 77878, 123736, 85779, 109133, 111835, 92063, 101620, 197260, 103678, 79884, -6768, -9638]
19926i638L6202l9349K7799j1745j7531K3872J02358M3834q287K6345o7781p9137
19914B6942M9321L7690j20971l589k5721K7177l5310k3581O7591Q9686Q4183j3431
19902A59987k823m5332j75K9133P4353m7347k2692o2494m4113K6153k5173K0495
19890E9972N2445J6711N5223K2833r5771M2372n4135j1571l476L3048N0674M878
19878A73203j09348p2171L2828N0640q853O697K810N9267K6475j0236l1541J4274
19866A34045k5812j22722n3464J17331Q2381M8299L4641k8383Q9284N2431k6585
19855C01446J5798O9926Q002O5052J78930J30890O3904J05857O9790K9428J18622
19844A157645P2956O9556O6717O2491K246p5176k1081N8902J05979J82j16339
$$ y = [-9638, 26564, -12785, 15014, 3269, -14262, 9610, 111968, 155802, 147515, 173860, 106079, 26942, 76263, 113953, -7018, -10607, -36328, -9151, -44461, -68042, -451, 89235, 173418, 159987, 157164, 111832, 111657, 140790, 215143, 167796, 145104, 82610, 38497, 64650, 39477, 59972, 112417, 129128, 184351, 207184, 111413, 153785, 99650, 88079, 84603, 117651, 168325, 173203, 63855, -8316, 24512, 75152, 66299, 72996, 75806, 135073, 161548, 151312, 119771, 134045, 108233, -14489, -67953, 49378, 131759, 180058, 214699, 186316, 275600, 328031, 301446, 317244, 387170, 395172, 460224, 639154, 770044, 833948, 939805, 1009595, 1039023, 1157645, 1230601, 1300157, 1366874, 1429365, 1431611, 1356435, 1335354, 1394256, 1500235, 1500417, 1384078]
19833A384078j00527o3676L4877k3689n2415j30241j75417o7682j3912j10672
19823F80724r5378q2295l8130P0826K00058J67373J07551J07802J70308M0198
19813A329037o0547j3024N367M6586K6721o2620J1098o8321R0290J53186K385
19802A460158r0417m4775j04544n5624n0569o2779j04369j39954k13206r1196
19792E02725j13570j9720p9232N1347N7665n9068m0188l1299k2481j2942L9765
19781B73002J2038n6888k36o4663l6504O9423K5954O527o8323P376l7184L783
19769A34305L8033O8391q1716J2839k8148o9848K744l414j7959K0280N2081P917
19757A35505o171r4684k8386O1670j6640l2078m9784q7893L7002J7921R5109L9789
$$ y = [1384078, 1283551, 1219875, 1254752, 1231063, 1178648, 1048407, 872990, 805308, 791396, 680724, 585346, 503051, 464921, 535747, 735805, 903178, 1010729, 1118531, 1288839, 1329037, 1268490, 1255466, 1260833, 1307419, 1334140, 1271520, 1282618, 1214297, 1304587, 1457773, 1460158, 1369741, 1324966, 1220422, 1164798, 1114229, 1051450, 947081, 807127, 593921, 502725, 389155, 369435, 290203, 341550, 399215, 340147, 299959, 268660, 246179, 233237, 273002, 285040, 228152, 227916, 163253, 126749, 196172, 222126, 228653, 160330, 167706, 130522, 134305, 172338, 240729, 159013, 171852, 143704, 73856, 76600, 73186, 55227, 75507, 127588, 135505, 129334, 34650, 6264, 67934, 51294, 19216, -30568, -118461, -81459, -63538, 31571, 71360]
19745G1360o37L1544k1569o9799k6180K7981R7880j210L2974J3260K9825M4005
19733B29434k3138j26830o2583J24391K6147q0592n0809l3758k8215J0575o470
19722b1848O5620L4191m790J4790J9044m0877J6473j9399M1081r96m8445n5049
19710b05O5906K1908o1236Q4517P9714m7784l2653l1857n2631P117M704J9132
19698E6632K8048j1665J3139o056Q6208O3901k4081j16318m4258p2285L3287O3698
19686G0250J12145O1049k605p0646r068K5293K4821j5817n256M1117k2589j6163
19674A92531j7235l0039k4635l2010J19267K2608k4819N317L7585j1447n372l0989
19662B00762j3340j3985O263l0877l1145l4450J06658J1178j7147L2130j04418
$$ y = [71360, 70723, 102267, 80698, 10899, -15281, 12700, 110580, 109370, 142344, 155604, 185429, 229434, 206296, 79466, 16883, 141274, 167421, 86829, 36020, 2262, -25953, -15378, -21848, 43772, 77963, 73173, 87963, 107007, 66130, 82603, 63204, 104285, 103289, 54844, -205, 65701, 87609, 26373, 110890, 190604, 142820, 110167, 78310, 25679, 32796, 37500, 56632, 84680, 73015, 86154, 80098, 166306, 230207, 206126, 89808, 45550, -26735, 6552, 70250, 182395, 243444, 240839, 170193, 161125, 186418, 211239, 195422, 190166, 231283, 208694, 192531, 175296, 145257, 120622, 88612, 207879, 230487, 205668, 210985, 248570, 237123, 231751, 200762, 187422, 173437, 179700, 148823, 117678, 83228, 189886, 201064, 183917, 216047, 111629]
19651A11629M568n0001k2548M1168O0397k0362K5265O0026l0213J0784L4213J6709
19639B41635M4662K9073q5150m0482K5265l76r309K1582N9293j5891m4044j2924
19627B13334L1886n4973O7940K5384J5038o6501r1380n812M2628O5333J5383p3585
19615A84675q0685l7370N7234K821P4934Q3205q7291q0675l2589O0174P2268J8218
19603B34919k9239q7046M3217k2059l5807M2312K4988M2519J5982P250r507J8770
19591B46299J0763P3300j4087n4746j43530k8848O3320l0751L0271k3586O3597
19580A92002J4676k6120j9022J8661N0160j7999L8899K5965j89K7094k986l0086
19568B71055L5568Q0574L9070Q4044J3395j4859k425j75l1162Q139N9040J061
$$ y = [111629, 116197, 66196, 43648, 84816, 145213, 124851, 150116, 210142, 179929, 190713, 224926, 241635, 286297, 315370, 230220, 189738, 215003, 214627, 205318, 226900, 286193, 270302, 226258, 213334, 245220, 190247, 258187, 283571, 298609, 232108, 140728, 134916, 177544, 242877, 258260, 184675, 103990, 66620, 123854, 126675, 201609, 284814, 197523, 116848, 84259, 144433, 216701, 234919, 205680, 118634, 161851, 139792, 103985, 146297, 171285, 213804, 229786, 237036, 227529, 246299, 257062, 330362, 316275, 261529, 117999, 89151, 152471, 121720, 151991, 128405, 192002, 206678, 180558, 161536, 180197, 230357, 212358, 251257, 277222, 277033, 304127, 301141, 271055, 306623, 387197, 426267, 510311, 523706, 508847, 506422, 506247, 475085, 483224, 542264, 543325]
19556E43325o2k2780l873J0271Q4523n66o6287p9046o6655j45347R072R4285l6323
19543C20537n8281l0186J07780Q0716p526K9068l737n2877Q4721P2811n4750m5878
19531D42398R886M4641J0467J3136l9992p1352K0344R0706O1950l1118m8686r1650
19519D10730j098K0673K2636k1419j05076p633m9881L1217L5591M1962K0018Q584
19507D06304n5328N2697R2643M9422n1835q4522Q4782j2466O190k8723K4798J11043
19495E95005R107n5173j0935R5882k0394r3096L9265O6359M8796n0191l1326n568
19483E87731r4200k4518n6684L8519N4120l8416n129m7398m3275M4676l9618L8780
19471D14588P2999J18521l689j9701k3009o3337M659j6690j395K2395m6995m3878
$$ y = [543325, 543263, 520483, 516610, 526881, 611404, 610838, 544551, 465505, 398850, 253503, 262575, 356860, 320537, 262256, 232070, 339850, 420566, 413040, 442108, 438371, 385494, 470215, 543026, 488276, 442398, 452284, 496925, 507392, 520528, 480536, 409184, 429528, 520234, 582184, 551066, 502380, 410730, 409632, 430305, 452941, 431522, 326446, 318813, 268932, 300149, 335740, 377702, 397720, 406304, 350976, 403673, 496316, 545738, 493903, 409381, 494163, 481697, 487887, 459164, 483962, 595005, 604112, 548939, 538004, 633886, 613492, 520396, 559661, 626020, 674816, 624625, 593299, 587731, 493531, 469013, 412329, 450848, 504968, 466552, 461423, 414025, 370750, 415426, 375808, 414588, 487587, 606108, 602419, 582718, 559709, 496372, 501031, 484341, 482946, 505341, 458346, 414468]
19459D14468l375K8412N9308k8586M791j2476k6520J2227J1766n1988k0451J10075
19447D97651M8849O4665K620m9502p7220O2919M5932O2299K5394j7531P3029M4057
19435G83162j2279J7798J34k2700P0661M626N0086J8486J4151O510L4537L2952
19423I98124K7381m1270o9172j0661O784J1106N312m1083k8368l8335N8209R6322
19411I74349N3244Q9752M4535K9646L3222j7320q8562n9062J15950N6915j23009
19400A109660M0076J76215J36951O7657j0366q5682q1812L0094l1141n1078J4554
19389A315128J01198P9141k6127l8700p367O8908m4846l6964O623L7074M4715
19378A498783N5809P0516O0112n8741Q176J05137L8375j6420J1753P3485J24355
$$ y = [414468, 411093, 439505, 498813, 470227, 475018, 462542, 436022, 448249, 460015, 408027, 387576, 497651, 546500, 611165, 613785, 564283, 487063, 549982, 595914, 658213, 683607, 666076, 739105, 783162, 770883, 788681, 788815, 766115, 836776, 841402, 891488, 909974, 924125, 930635, 965172, 998124, 1025505, 984235, 915063, 904402, 911186, 922292, 927604, 886521, 858153, 819818, 878027, 974349, 1027593, 1117345, 1161880, 1191526, 1224748, 1207428, 1118866, 1059804, 1175754, 1232669, 1109660, 1149736, 1325951, 1462902, 1530559, 1520193, 1434511, 1352699, 1382793, 1351652, 1300574, 1315128, 1416326, 1495467, 1469340, 1430640, 1423273, 1492181, 1447335, 1410371, 1416994, 1454068, 1498783, 1554592, 1625108, 1685220, 1626479, 1634655, 1739792, 1778167, 1761747, 1773500, 1846985, 1971340]
19367A971340J26827O7959O0107L3448Q0310O2495M9054J01458K6913L998J14979
19356B698888L0459O9660J44314J10340J58003J59135K92206K51721K00463J89819
19346D305008K05588K70139L05352K38604K99564M84430N05594M73904M63288
19337G551471N37648P69089R92513J050373J154551J374376J318385J398914J523055
19328A7670375J619195J943916K119904K510907L186297M197538N528475P527431
19320D6304038J0262216J4510600K0955512L0219297M3001487N8854474P3491214
19313B97598838P3715091L5019394k2970113n7057652o3468613m6376194k6330475
19306A90130276j0383382L636489J6920619K6659432K1498046l293327k7063876
$$ y = [1971340, 2098167, 2166126, 2226233, 2259681, 2339991, 2402486, 2451540, 2552998, 2579911, 2583909, 2698888, 2729347, 2799007, 2943321, 3053661, 3211664, 3370799, 3663005, 3914726, 4115189, 4305008, 4510596, 4780735, 5086087, 5324691, 5624255, 6108685, 6614279, 7088183, 7551471, 8089119, 8858208, 9850721, 10901094, 12055645, 13430021, 14748406, 16147320, 17670375, 19289570, 21233486, 23353390, 25864297, 29050594, 33248132, 38776607, 46304038, 56566254, 71076854, 92032366, 122251663, 165253150, 224107624, 297598838, 371313929, 406333323, 383363210, 326305558, 262836945, 216460751, 190130276, 179746894, 183383383, 200304002, 226963434, 248461480, 245168153, 218104277]
19299B18104277l7868324l5402544k6193264j8307645j2652163q086337m099056
19292G5494944n51215K933747P015448J2501957J9449323K7903910L6399001L5794960
19284B16942075J6585455q523524k3420028k3716689j2892370J199711J6101663
19277A82276293L2687524N1808282O6892626N1708874J47907m5620915o8687131
19270B71213460o4356861m8533331l5094708k5881184j9265671j4243463j0593633
19263E3244609q184715o460236m991396l911732l270525k976791k884173k539436
19255A8025605k092845j756819j414081j113344j043420r40323q66031p68060
19247H030682o29468o23908m94110l61048l92331l02316l23072l87339k68003
$$ y = [218104277, 180235953, 144833409, 118640145, 100332500, 87680337, 79594000, 75494944, 74943729, 77877476, 84892924, 97394881, 116844204, 144748114, 181147115, 216942075, 233527530, 225004006, 201583978, 177867289, 164974919, 166174630, 182276293, 214963817, 266772099, 333664725, 385373599, 385521506, 339900591, 271213460, 206856599, 158323268, 123228560, 97347376, 78081705, 63838242, 53244609, 45059894, 38599658, 33608262, 29696530, 26426005, 23449214, 20565041, 18025605, 15932760, 14175941, 12761860, 11648516, 10605096, 9664773, 8798742, 8030682, 7401214, 6777306, 6283196, 5922148, 5529817, 5227501, 4904429, 4517090, 4249087]
19238D249087j32316j28635j35255k22019k01125j19749j31249j61396j18087
19229B899256j58468k11885j91602r4847k6718M8929p9917m9483n397m2177m2669
19218B045022m843J2717J3684J77760K03827J64963J01939L1318j24357j59164
19208B462866j54698j45889r1122l4330P354O835m9437j53469j41736n6716l2345
19197A617313r1309j68919j4908M751m7407j30634L0652M8601l9470J2772R056
19186A230498K0447K41855P8381p51m9016k3901J12483J12389K387o6371m558
19175A653843J59131J68910P7574j05066j56811j83454j61568j22901p9347q8001
19165A162310j22190o2884n7346o7921r4144m9574l0742K3221n2713j6882p6348
$$ y = [4249087, 4116771, 3988136, 3852881, 3630862, 3429737, 3309988, 3178739, 3017343, 2899256, 2740788, 2528903, 2337301, 2242454, 2215736, 2264665, 2184748, 2135265, 2129868, 2087691, 2045022, 2040179, 2052896, 2066580, 2244340, 2448167, 2613130, 2715069, 2746387, 2622030, 2462866, 2308168, 2162279, 2071157, 2036827, 2044181, 2051016, 2001579, 1848110, 1706374, 1649658, 1617313, 1526004, 1357085, 1342177, 1346928, 1299521, 1168887, 1199539, 1248140, 1208670, 1221442, 1230498, 1250945, 1492800, 1571181, 1570430, 1521414, 1497513, 1609996, 1722385, 1724772, 1658401, 1653843, 1812974, 1981884, 2059458, 1954392, 1797581, 1614127, 1452559, 1329658, 1250311, 1162310, 1040120, 977236, 919890, 851969, 757825, 708251, 677509, 700730, 648017, 631135, 554787]
19154E54787o5684L2159K8743N5848n5301n1652Q665J62001J50086R380r8392
19143G30640j7263L2104l5611m4045j7566N93L721j33222p5885m1309l3246J39230
19131E08141O4892j01546r8393Q77m0086o6501L9339k0117L1896m0799n8135l8802
19119A80766n1203L5843k658l2760L0687O4772K1373m0070l5324q7493k3628L2537
19107I2842N0137K9900O2298L4728o1152M2629J0378j01296q5585r5954q1865
19096a02940L1615P7033m562n0391k0205J6815J1385P6659Q7831M2287j0093k0913
19084A34521p6835q650M4236L1209R67o3339J058n927P429Q0395M4894k7880l8655
19071A23423n0067k6329j61M5026L3413k6557k0959o4742J5386O6638n2102K0543
$$ y = [554787, 489103, 521262, 550005, 605853, 550552, 498900, 507565, 669566, 819652, 829032, 730640, 713377, 745481, 709870, 665825, 648259, 648852, 652573, 519351, 443466, 402157, 368911, 508141, 573033, 471487, 373094, 373971, 333885, 267384, 306723, 286606, 318502, 277703, 219568, 180766, 129563, 165406, 162748, 129988, 160675, 225447, 246820, 206750, 171426, 83933, 60305, 92842, 142979, 172879, 235177, 269905, 208753, 251382, 261760, 160464, 74879, -21075, -102940, -71325, 5708, 1146, -49245, -69450, -52635, -41250, 35409, 123240, 165527, 155434, 134521, 57686, 49036, 93272, 124481, 125448, 62109, 63167, 57240, 64669, 145064, 189958, 162078, 123423, 73356, 47027, 46866, 91892, 125305, 98748, 77789, 13047, 28433, 95071, 42969, 63512]
19059F3512L2582r158p9569k9570k7273N3312O6510K0595n9l9565J8550l5156
19047C4711l1696J54719M064r9209m1428k6024k633K7710m3443l7662L3725J08973
19035H1807j7370j4179J03973k1189o7054M2193P6790J0011l8477J9371n4059
19024A21817N7253J5606j19700K5078M2497K923J4734r2694n932K5858K0365k0810
19012H6995J4721K375o6143m7329k8207Q3307L9039p6363r2370P9845M5411Q438
19000D9719J4769J8488j0141N6889l9597p4139J07529L6177j9108O4270J03020
18989C07876o1011o0337o6510m3831o5214k3567J7281J13923J18752R986p6781
18978A70567m8364m9567N3419j8670K2262k2656j09464j1864Q0080o993k4082
$$ y = [63512, 96094, 86936, 7367, -22203, -49476, 3836, 70346, 90941, 90882, 51317, 69867, 34711, 3015, 157734, 161798, 62589, 21161, -4863, -7496, 20214, -23229, -60891, -27166, 81807, 64437, 50258, 154231, 133042, 65988, 108181, 184971, 194982, 156505, 175876, 121817, 179070, 194676, 74976, 100054, 142551, 145474, 160208, 67514, 61582, 87440, 107805, 86995, 101716, 104091, 37948, -9381, -37588, 45719, 84758, 8395, -83975, -4130, 41281, 49719, 64488, 82976, 72835, 129724, 90127, 15988, 123517, 159694, 140586, 204856, 307876, 246865, 186528, 120018, 76187, 10973, -12594, 4687, 118610, 237362, 247348, 170567, 122203, 72636, 126055, 107385, 129647, 106991, -2473, -14337, 65743, 58750, 34668]
18967C4668N711k4735K2500K9308j0625k549P3623J1459n3536m4967J23840L5731
18955B00428m7568k3980o8264P0847j3870J8947Q1451n3056Q9966Q4543K2577
18944C62021N5917r9294k8654j00238k7074L8258o2560L047J18102P6138L2602
18933C68265k0964j29176N4909J30261K1766o692q411p0556M207p1269k2294Q6894
18921C36940K7190k5833m5266p3940j95766o4725M3691n517n6987O191J6718K4506
18909a2798P2498Q9529p6194L8662J06275Q3437l1761L6733N6535P9838P6504
18898E19258O3176L2700r0n5011n3727m0715M746R09L2245N0337O7723J23955
18886G45506k4055m2848q4427r8663j1881K8488L3845k3258l558N1893J0520j12693
$$ y = [34668, 40379, 15644, 38144, 67452, 56827, 54278, 127901, 139360, 85824, 40857, 164697, 200428, 152860, 128880, 60616, 131463, 117593, 136540, 217991, 164935, 254901, 339444, 362021, 417938, 318644, 289990, 189752, 162678, 200936, 138376, 141423, 259525, 335663, 368265, 347301, 218125, 273034, 403295, 425061, 418369, 409958, 339402, 343609, 272340, 250046, 336940, 364130, 338297, 293031, 219091, 23325, -41400, 2291, -3226, -60213, -54022, -37304, -12798, 59700, 149229, 73035, 111697, 217972, 301409, 269648, 306381, 362916, 442754, 519258, 582434, 615134, 615044, 560033, 506306, 465591, 470337, 471246, 503491, 553828, 621551, 745506, 721451, 678603, 594176, 495513, 483632, 512120, 545965, 522707, 519149, 571042, 581562, 468869]
18874D68869n3757l4975R384j00619j10452L415J2416j4666n1126n3405J9709
18863I4793M9075m2173n0199L526M0596M1083K8568r881J279n2737k3686P0594
18851A50838N5402R9859P890o0654j8526k753k123j3555L2832J57560Q2522J6895
18839E06187l3155k7716J2780K5903l2101m0534M722n2441J9987K8767K7898n515
18827D34782m7901K6298p2948j30705q153m4447M0819L1390M0755N049l9320j18147
18815A17472q5353N462l7268q020O8272n6193j2027O6635j9070L415M3206J33279
18803B19810j0772k9805n3717n4796L0755Q2110o2088j1382n2250k8221P2448
18792A02092O9708N1637p5628J2414j5888P2138J23079J61082K20132J67496J10891
$$ y = [468869, 415112, 380137, 389521, 288902, 178450, 181865, 194281, 179615, 128489, 75084, 94793, 143868, 101695, 51496, 55022, 95618, 136701, 165269, 155388, 156667, 103930, 80244, 150838, 206240, 306099, 313989, 253335, 234809, 232056, 229933, 216378, 249210, 406770, 489292, 506187, 473032, 445316, 458096, 483999, 451898, 411364, 416086, 363645, 383632, 412399, 440297, 434782, 386881, 413179, 340231, 209526, 201373, 156926, 197745, 229135, 269890, 274939, 235619, 117472, 32119, 37581, 313, -7707, 60565, 4372, -7655, 58980, 39910, 43325, 86531, 219810, 209038, 179233, 125516, 70720, 101475, 183585, 121497, 110115, 57865, 29644, 102092, 171800, 223437, 147809, 160223, 144335, 216473, 339552, 500634, 720766, 888262, 999153]
18781I99153m586K910K6417J21965J95239L5329j57212o2563J67347J60087O1524
18770A545610L5641R4307J96858K20060K5795r7312k77487m06974k33227j95585
18760I07686j40342m3565j12410l6832k7401K1629m475J15749J40790J90217O0243
18749A071289l8961R3326L8462P0007P2514O1268n77r5734r8023J8697O1098j1754
18737A241612J0101k1878m8193m6150n5306j25483q3180j39575q0816j27017j04213
18726D19902q3063j21020j6337M021n0710o3010m405Q6331N1611L8346o8736p2662
18714A20268n1189n9923m0270m7042K5725Q804N4962Q1587j0317J05906J922j16297
18702G4136j70870j9820Q7388M7457J17662q0337n4233k9632Q226K0983L7872
$$ y = [999153, 994567, 997477, 1023894, 1145859, 1341098, 1376427, 1219215, 1156652, 1323999, 1484086, 1545610, 1581251, 1675558, 1872416, 2092476, 2118271, 2020959, 1743472, 1336498, 1103271, 907686, 767344, 723779, 611369, 574537, 547136, 568765, 564290, 680039, 820829, 1011046, 1071289, 1032328, 1125654, 1164116, 1234123, 1306637, 1367905, 1367328, 1271594, 1173571, 1192268, 1253366, 1241612, 1251713, 1229835, 1181642, 1135492, 1080186, 954703, 871523, 731948, 651132, 524115, 419902, 336839, 215819, 199482, 203503, 152793, 89783, 85378, 171709, 223320, 261666, 192930, 120268, 69079, 9156, -31114, -78156, -52431, -43627, 11335, 92922, 82605, 188511, 190433, 74136, -96734, -116554, -29166, 18291, 135953, 55616, 1383, -28249, -20023, 960, 38832]
18691C8832K0763k4800j61731k3245j5599J8452O6578O7741K9185m9975n5029
18680h8828R854K4705k1789j8242L7096O8930n4461j14916J5152N9090l6822p7706
18668a97937j0543J20711K8161J1623N9924l6003m9262L049n3794J7431Q7673
18657a8967k4723J7992K8829k1704m1326Q3088L7978q4398L5733M459Q722k9542
18645c859M1830j4528k866L2288k0479L7486j8458l9284M101m6627m1680q4245
18633a56321k0074P1029J062r920N3243N8127J7673l9267n121n5480K3383L546
18621e8120N496N5540j964n1589k8577j2762k9689M6752P2033N1411J1472p0202
18609a0199n2726N4661N6114J3457N8935J2667k61o758q7201o5348l6146l3457
$$ y = [38832, 59595, 34795, -126936, -150181, -165780, -147328, -80750, -13009, 16176, -33799, -88828, -78974, -54269, -76058, -94300, -57204, 11726, -42735, -157651, -142499, -83409, -120231, -197937, -208480, -87769, -59608, -47985, 11939, -24064, -73326, -70277, -124071, -106640, -18967, -43690, -25698, 3131, -18573, -59899, 23189, 61167, -23231, 12502, 16961, 25683, -3859, 37971, 23443, 20577, 52865, 32386, 69872, 51414, 12130, 16231, -30396, -72076, -156321, -176395, -105366, -104304, -114224, -60981, -2854, 14819, -24448, -29569, -85049, -61666, -58120, -52624, 2916, 952, -50637, -79214, -91976, -121665, -74913, -2880, 48531, 60003, -10199, -62925, -8264, 47850, 61307, 120242, 132909, 132648, 125890, 38689, -26659, -62805, -96262]
18597i6262j133K4780K7206P2818J34534k0964j54669N41J9797K4088O1885l0971
18585F1650j8674o3091K5602O6403J2431n8165l3864J2668j5785Q557O8525Q149
18573G4406l0942j6141l3712J6603L6402n5908K8054r838L0471M1632l6925J5944
18561F0046J5124j16309n7678J01759J27010k7606l2567k4175r157N1473m422
18550H3498n3612m6255r2084j6762N1011l7704p446J74053m0032k4094L0951P9296
18538A00820L4887k0504j3396k036q1617j43696J6309K5610L8449J02217L8602
18527I5645m9279j07832p1775m780K85L2185J25987O2134P0569M7945j9572r4851
18515H6661j7352l0297j3414P4967l3024p7960p7289m712K3855P4414J3962M5992
$$ y = [-96262, -97395, -72615, -45409, 27409, 161943, 140979, -13690, -13149, 6648, 30736, 92621, 61650, 42976, -20115, 5487, 71890, 84321, 26156, -7708, 4960, -10825, -2268, 66257, 74406, 43464, 27323, -6389, 10214, 46616, -9292, 18762, 8924, 39395, 81027, 44102, 60046, 75170, -41139, -98817, 2942, 129952, 102346, 69779, 45604, 36447, 87920, 83498, 29886, -16369, -108453, -125215, -74204, -111908, -119354, 54699, 14667, -9427, 21524, 100820, 135707, 115203, 101807, 99771, 18154, -125542, -109233, -83623, -45174, 57043, 95645, 46366, -61466, -133241, -138021, -137736, -105551, 20436, 82570, 153139, 201084, 181512, 86661, 69309, 39012, 25598, 100565, 67541, -10419, -87708, -92420, -68565, 5849, 19811, 65803]
18503F5803L8969n1930J7179o0619n1318O2970M1693l8942l033l6522N1855m6608
18491a0503n8298q277O790l6127q98L8565R1276L9702L620j3796m7399m9062l8438
18478h2845j01325o69Q2781N8634N6144j00466n4599K9577L5490O9514M0995k7555
18466E676q723q4893O884J03006P4276n5191q0372K932j30O8871R039m2270P0583
18453F9688k910j31099m6197O2150L6183N5377q7446j02166Q0709J00124L2361
18442F6774m1504M3335L7108m487m5096K7297L7326m7566k5597J9866k5998K7101
18430F8559n1413N788l5203K3006L5947k126q2123L6418N1690m573o0117K6276
18418A2129L4153N3491O0370k0356k9288n5271j8555m6953n3993J43180Q2274
$$ y = [65803, 104772, 52842, 70021, 9402, -41916, 21054, 62747, 23805, 20772, -15750, 36105, -10503, -68801, -77078, -70288, -106415, -107313, -68748, 22528, 62230, 65850, 52054, 4655, -44407, -82845, -184170, -184839, -102058, -43424, 12720, -87746, -142345, -112768, -77278, -7764, 33231, 5676, -3047, -87940, -81056, 21950, 96226, 41035, -39337, -36405, -36535, 32336, 41375, -895, 69688, 66778, -64321, -110518, -48368, -12185, 43192, -44254, -146420, -65711, 34413, 66774, 25270, 68605, 105713, 101226, 56130, 83427, 120753, 73187, 47590, 67456, 41458, 68559, 17146, 22934, -12269, 10737, 46684, 44558, -37565, -1147, 50543, 45970, -14147, 12129, 46282, 99773, 160143, 139787, 110499, 55228, 36673, -10280, -64273, 78907, 161181]
18407A61181o5271p3519n5480J9097L0765M4081j2051j767M3464m986k4213M3696
18395A04997L6573j6949p6881J036m6772j0734l950L175k5080J7403j7936k6373
18383f1491k749K4369n8733j9133R7799P7585N9744J277o1222o3756m8644K3943
18371c1011L4649Q6608n1273j6685j6605j6517O8306Q3587K2211J6956L9118M3333
18359B62677j19314j02098o0798O0041l2867o4645Q4834M3390l1696l138Q0203
18348A16589l6545J8299n2632J038m9338n656L0728J7865N2616L0944l5641l3151
18336E5116j0857R619M3724k8428O637J6730L0186P4813Q282O3523K3924j07767
18324A85502o938p852l8798L4521j3921P700l0276O419J18674L9969p5221j26358
$$ y = [161181, 95910, 22391, -33089, -13992, 16773, 60854, 48803, 47036, 90500, 85514, 61301, 104997, 141570, 124621, 47740, 48776, 2004, -8730, -12680, -9505, -34585, -17182, -35118, -61491, -64240, -39871, -98604, -117737, -19938, 57647, 117391, 118668, 57446, -6310, -54954, -31011, 3638, 90246, 38973, 22288, 5683, -10834, 57472, 141059, 163270, 180226, 219344, 262677, 143363, 41265, -19533, 40508, 7641, -57004, 27830, 71220, 39524, 36386, 116589, 80044, 98343, 45711, 46749, -2589, -8245, 22483, 40348, 92964, 123908, 88267, 55116, 44259, 53878, 97602, 69174, 75811, 92541, 122727, 197540, 205822, 269345, 293269, 185502, 178564, 170712, 131914, 166435, 152514, 160214, 129938, 136357, 255031, 295000, 219779, 93421]
18312I3421Q2011L7905M5512L7160L8331N0896K2066O941J6477J5993R3086P1901
18300F11700M6803R7043R0033N5146m5914M8979j2955m0126p4861o2893j4921
18289F98034R7740j9615r2054n4401k614k1522r7327n8948l8111k0429J11593
18278E02346J15958k4007q8430k8249P9379J00024O4468m7806N1044K7052n6374
18267F95405K1466Q1747N6029K0004K4274P7246J1643l6492J6788L5453L4623
18256A038186m1520j05941j8454m275J3431j8806j361O3967o7m5953k7340l5990
18244H15877n5063M7939J7848j44844k5070J7125j5576P5800O2544l5570m2945
18233G18065k109o3165j64561n2332J06401N9376L9843O168k8592O2360K8037
$$ y = [93421, 175432, 213337, 258849, 296009, 334340, 385236, 407302, 414243, 430720, 446713, 539799, 611700, 658503, 755546, 845579, 900725, 854811, 903790, 890835, 850709, 775848, 712955, 698034, 795774, 776159, 684105, 629704, 627090, 605568, 508241, 449293, 411182, 390753, 502346, 618304, 594297, 505867, 477618, 556997, 657021, 721489, 673683, 724727, 751779, 695405, 716871, 798618, 854647, 874651, 898925, 976171, 987814, 951322, 968110, 1003563, 1038186, 996666, 890725, 872271, 867996, 881427, 862621, 861260, 925227, 925160, 879207, 851867, 815877, 760814, 808753, 826601, 681757, 656687, 673812, 658236, 734036, 796580, 761010, 718065, 715956, 652791, 488230, 435898, 542299, 601675, 641518, 647686, 619094, 681454, 709491]
18222G09491q1592k6734p720M2917N6789L4154J60152k4520j05712J9596k6415
18211G50406j0889L535o6795K276p2026q4096J974J5377q1887K0096n6610q1234
18199C40127k072k202n2362J6018P8945l392j41710O315L0741m1268q2036K1986
18187A69090J2479j9035m381R758k2656O388j2031J0349M8193K4866R4505q4219
18175B33306k6493L0100K8638O8836N6218K4427M7624m7119n6924N6852P6638
18164D92103l4512l7919j5431k7923O129r9055p4053j9434J31152J00560Q1616
18153E03233N7690J1997m8402O271R4223L8615K2620K269N1032Q7598K7250J7003
18141H71399m91R9584N5595j2581J1985J04094N3744R0264L2940N0136J16582
$$ y = [709491, 627899, 601165, 593445, 636362, 693151, 727305, 887457, 862937, 757225, 776821, 750406, 739517, 743052, 676257, 678533, 606507, 522411, 524385, 539762, 457875, 477971, 421361, 340127, 338055, 335853, 283491, 299509, 378454, 375062, 233352, 239667, 270408, 229140, 147104, 169090, 181569, 162534, 158153, 167911, 145255, 151643, 139612, 149961, 198154, 223020, 317525, 233306, 206813, 236913, 265551, 334387, 390605, 415032, 462656, 415537, 358613, 415465, 492103, 457591, 419672, 404241, 376318, 382447, 283392, 209339, 189905, 321057, 421617, 503233, 560923, 572920, 524518, 530789, 625012, 663627, 686247, 688516, 739548, 827146, 854396, 871399, 870908, 970492, 1026087, 1013506, 1025491, 1129585, 1183329, 1273593, 1306533, 1356669, 1473251]
18130A473251J36570K28216K47910K29248L15328L21618K57697M28778N25136
18121D163752O43010Q01573R43959J300223J887323K672193L832405N937216R138688
18112C1320342J4062064K1186833L2179815M2493164K1258894j5551049l2218683
18105A14731380l5992259k3631141j4477370r844472p138887n198018l690441
18098A4758792k732467k137639j776726j339095j007053q79970p43357o16411
18090C526074n57011m55977l31723j87644j58209q2323j64531j77918j43731j69882
18080A097125q5108L1654r4899j42378q6251o5292q3746q9427m4669P820l6032
18069D08797M956K1482L91l3061r2527q8390p0610q595j5485M5838N7305q365
$$ y = [1473251, 1609821, 1838037, 2085947, 2315195, 2630523, 2952141, 3209838, 3638616, 4163752, 4806762, 5608335, 6552294, 7852517, 9739840, 12412033, 16244438, 22181654, 31320342, 45382406, 66569239, 98749054, 141242218, 162501112, 146950063, 114731380, 78739121, 55107980, 40630610, 30786138, 23647251, 18449233, 14758792, 12026325, 9888686, 8111960, 6772865, 5765812, 4885842, 4142485, 3526074, 2969063, 2513086, 2181363, 1993719, 1835510, 1753187, 1588656, 1410738, 1267007, 1097125, 1012017, 1043671, 948772, 806394, 720143, 654851, 571105, 481678, 437009, 444829, 408797, 413753, 435235, 435626, 402565, 310038, 221648, 151038, 142443, 126958, 172796, 230101, 221736]
18057B21736M9089N1271P2045p7094j53390k2863m83O462M893l3568K77J6219
18045A34594m8903K8846N5868p9521k8274m3168J12526J53832K544L312o1137
18034B30519q3803J6610o7994L340j7521j2987l5642k7186k291M9315k2916K1762
18022E1206j2376j2248K253K5527n658L68K74k7439Q1900K8461j00203j1571r5978
18009g5484o1579p796P6503L1097N0258q3204K799J58789J15104l6380k5484j05382
17997C9241n4197J7236j4853K9957l2717n9177O7354N5985j9761j6500k8426o3408
17985g9266L4636j2761n6360R1995J01845N39M6844R6243K8131j6396p8030j19051
17973C8369m3470K0892M3661q627k4387q519o4923n9982l2600r666j200M794L0837
$$ y = [221736, 270825, 322096, 394141, 317047, 163657, 140794, 140311, 146773, 151666, 118098, 118375, 134594, 85691, 114537, 170405, 90884, 62610, 19442, 131968, 285800, 288344, 291656, 230519, 146716, 163326, 95332, 98672, 81151, 68164, 32522, 5336, 3045, 52360, 29444, 51206, 38830, 26582, 28835, 54362, 48704, 49072, 49346, 21907, 103807, 132268, 32065, 20494, -75484, -137063, -144859, -68356, -37259, 12999, -70205, -67406, 91383, 206487, 170107, 144623, 39241, -14956, 2280, -12573, 17384, -15333, -74510, -7156, 48829, 29068, 12568, -15858, -79266, -44630, -57391, -113751, -21756, 80089, 80628, 127472, 223715, 251846, 235450, 157420, 38369, -5101, 15791, 59452, 50825, 26438, 17919, -47004, -106986, -139586, -149252, -150452, -145658, -114821]
17960a14821P0663K244L7004R6448K9488j10603n3740O3067K8754K5242P35k3739
17948E0742r6893n8213P7649R4070Q846r026m894p3582l8734J0916L5422J8362
17936A4665M5978o637k8266L9525m6216j0020N061o8540l8891m5291l5958k5889
17924b00479R5228P8747P2126l259J4114r6101P597O5922O7620J4184l0495j43383
17912e8179q791J61015L2513o7544j3731O7614k271N9185P564r698O1244Q6716
17900C15637M4024o6359P654Q542m6909j22631o2147J7389q9422J6697N1983K6000
17888A00458L6273L408P0166l9138K2044M0421n5916q9554P538k708r3716m3204
17876d3928P1190O2198N507N1926J00013j33n3371j39883j1522j4295n5979j5473
$$ y = [-114821, -44158, -41914, -4910, 91538, 121026, 10423, -43317, 19750, 48504, 73746, 74481, 50742, -46151, -104364, -26715, 67355, 76201, 67175, 62281, -11301, -50035, -39119, -3697, 14665, 60643, 54006, 25740, 65265, 19049, 9029, 14090, -54450, -93341, -138632, -174590, -200479, -105251, -26504, 45622, 42363, 56477, -39624, -32027, 33895, 101515, 115699, 85204, -58179, -66970, 94045, 126558, 59014, 45283, 112897, 110626, 169811, 177375, 167677, 228921, 315637, 359661, 293302, 300956, 309498, 262589, 139958, 77811, 95200, 5778, 22475, 74458, 100458, 136731, 140139, 210305, 171167, 193211, 233632, 177716, 88162, 95700, 92992, -724, -43928, 27262, 89460, 94967, 146893, 246906, 246773, 193402, 53519, 41997, 27702, -28277, -43750]
17864d3750N7803L0752j2712M9342J21578n438J2890O9468k7291j17570n5882
17853G9190j21068p6712O1981P5050j1286L5025n899k9241k2009R0406J53579
17842B29016P8119O6648O3535M6329L1625N3657o9741j46686r7532j8145j6531
17831B20294m9942k4969L0897l7644j09152r6617q598j7292O9498J36255N3433
17820A66163K3919j3783p7088r0005p5210L1367L9432k5091Q0790O3944J469L0397
17808A56304k1008J3767J182p6208m7801J4416o728m5559k5447Q1466R8327R7439
17796B40150P430o2759P7368Q8087n5189r0773l218k8448k8630m1159M117j8860
17784H8116m4384l6694M4082J07597J0471l6066L3559P6891P4902K3996n1473
$$ y = [-43750, 14053, 44805, 32093, 81435, 203013, 197575, 210465, 279933, 252642, 135072, 79190, -41878, -118590, -56609, 18441, 7155, 42180, 36281, 7040, -14969, 75437, 229016, 307135, 373783, 437318, 483647, 515272, 568929, 499188, 352502, 254970, 236825, 220294, 170352, 145383, 176280, 138636, 29484, -67133, -75731, -93023, -23525, 112730, 166163, 190082, 176299, 99211, 9206, -66004, -34637, 4795, -20296, 60494, 124438, 125907, 156304, 135296, 149063, 150245, 74037, 26236, 40652, 33924, -11635, -37082, 44384, 142711, 240150, 247580, 184821, 262189, 350276, 295087, 204314, 201096, 172648, 144018, 102859, 106976, 88116, 43732, 7038, 51120, 158717, 169188, 133122, 166681, 243572, 318474, 342470, 290997]
17773B90997q2910j78180p3904L1529L1321N3311K825K7573j9941p2554N437J7936
17761C3440k8450j00433m843J7248j0995J9219M7476n7949M5142k2632q969k1313
17749i3059J4315M0059l946M9545K6357L5215j9253J0403N9452J3666j8472Q882
17737A23164q105k1287o1626l8469L5063O7929P2664N6340M8980j25081j39733
17726I839o0305R8684j5428m884J3077m6687l675l5666M831k7300J8024n9123
17714a08613l2208N49Q8827M5024N9206L687j775n251N5660l0172j2019J3134
17702G6049n0514n5750n803M1560j1721n8909O3181j156K863j0721J6959l5795
17690b9757o7604l6185J11925J1363O3660L1172j10519n5438J7960J62991R7294
$$ y = [290997, 208087, 29907, -43997, -12468, 18853, 72164, 74989, 102562, 82621, 10067, 15504, 33440, 4990, -95443, -100286, -83038, -94033, -74814, -27338, -85287, -40145, -62777, -71746, -93059, -78744, -38685, -42631, 6914, 33271, 68486, 49233, 59636, 119088, 132754, 114282, 123164, 115059, 93772, 32146, -6323, 28740, 96669, 169333, 225673, 274653, 149572, 9839, -50466, 48218, 32790, 27906, 40983, -5704, -9379, -45045, -40214, -67514, -49490, -108613, -140821, -140272, -51445, -6421, 52785, 56472, 54697, 49446, 105106, 74934, 62915, 76049, 25535, -30215, -36018, 5542, -6179, -65088, -1907, -3063, -200, -10921, 6038, -29757, -97361, -133546, -21621, -10258, 53402, 84574, -25945, -81383, -63423, 99568, 196862]
17679A96862k3677k4743n5128o0558K4703n2203j1266k9463K13O5622n2268m0811
17667f2717o4489K5232N7451M3882m2285l0130K9725Q5163n0076o4107K4555P1041
17655B3245p513n2319m1282M6850R011N8751L7743m5050k5010j2260M5056J5723
17643E2945O9498O991q6764q4386m2930K1520n5478P936j2661M8476N0902l9811
17631f3762k879J2428k4816K9251l3377k6212J345m7893m1443P6822O9207m6080
17619i7409k9839L4889K0131O5755L3548r5469j2129M2893J13578k7445o7881
17608a9378n8147o8103M1606J28106M6620q4580m6439m9070J425k8587O9036J01935
17596C4424n8299j619M5574J316l5375Q734j9335K9210j0215r162l0096o8390
$$ y = [196862, 173185, 148442, 93314, 32756, 57459, 5256, -6010, -35473, -35260, 30362, -21906, -62717, -127206, -101974, -44523, -641, -42926, -73056, -43331, 41832, -8244, -72351, -47796, 23245, 15732, -36587, -77869, -31019, -22008, 36743, 74486, 29436, 4426, -7834, 37222, 52945, 122443, 129434, 42670, -41716, -84646, -63126, -118604, -110668, -123329, -74853, -23951, -63762, -66641, -54213, -79029, -49778, -83155, -109367, -108022, -155915, -197358, -120536, -51329, -97409, -127248, -92359, -72228, -6473, 27075, -68394, -80523, -37630, 75948, 48503, -19378, -77525, -145628, -104022, 24084, 70704, -13876, -60315, -109385, -107960, -136547, -67511, 34424, -23875, -25494, 20080, 21396, -13979, -5245, -24580, 4630, -5585, -14747, -44843, -113233]
17584a13233m1057M9233n272n307o2615J1181M3290K6324j1180l1553O5858J00005
17572B5674O0920m1305o7683k5334J8899O9111k6985m2930K1557p9598R885Q0080
17560B291j3252k1161M8534k1463L590l7098l14j6205R1992N1707o6688J1519
17548C3452M5534k3309j2030m6465n3976n0812L0487L3287k3542j4182p7081M67
17536a58170L8458L6000J16463M0187L9248j2829p142j7552r5224l8459J9368
17525c9652K3742j2863O1512K1922m2423p521p4927k8113J84302P3066j5024r1417
17513E2604o7421k7385P303l2915k674J8685N8861K2133o5210l8755P8926k815
17501A337j19N4024k3469L2979k7332l6241p8316K8648K023n3028k4648K1328
$$ y = [-113233, -154290, -105057, -110329, -115636, -178251, -167070, -123780, -97456, -108636, -140189, -74331, 25674, 86594, 45289, -22394, -47728, -28829, 40282, 13297, -29633, -8076, -87674, -77789, 2291, -10961, -32122, 16412, -5051, -1461, -38559, -38873, -55078, 36914, 88621, 21933, 33452, 78986, 55677, 43647, -2818, -56794, -107606, -77119, -43832, -67374, -81556, -158637, -158170, -119712, -83712, 32751, 72938, 112186, 99357, 92215, 74663, -20561, -59020, -39652, -15910, -28773, 32739, 54661, 12238, 4717, -70210, -98323, 85979, 159045, 144021, 52604, -14817, -42202, -34899, -67814, -70488, -51803, 7058, 29191, -36019, -74774, 4152, 1337, 1218, 55242, 31773, 64752, 37420, 1179, -77137, -48489, -46466, -99494, -124142, -102814]
17489a02814N6531Q7983M6733J1471q435J5508K047p1608o5641P7638O6757o6248
17477D9922r4189k0935m3234j0338Q3142R5759q1661p7355N3294Q0955l7884j6493
17465a9017J5621l2169J5823Q0660k1748L0805k0703n9286M7868O2198m1905r0528
17453c2381J0502O0298J3221L5460N6863M7474m0801P2218J49622O4176K16522
17442F53174J72572k0421j82612j66210j94675q5448m0920j1776j28644j33916
17432a38876p7797N6470J0721O8535M7339q655M8106O807K4471J3362l3061p0562
17420e3140p5508J1494j3800N1442N9467K4715O8700k0326k0905N9979O4837q7146
17408F9809p8922j0012j7890Q0208k4172N107P6141N9257o9196m0786q737L5145
$$ y = [-102814, -46283, 41700, 88433, 99904, 91469, 106977, 109024, 37416, -28225, 49413, 116170, 49922, -44267, -65202, -108436, -118774, -35632, 60127, -21534, -98889, -45595, 35360, -2524, -19017, -3396, -35565, -19742, 60918, 39170, 69975, 49272, -10014, 37854, 100052, 58147, -32381, -21879, 38419, 51640, 87100, 143963, 191437, 150636, 222854, 372476, 436652, 653174, 825746, 805325, 622713, 456503, 261828, 176380, 135460, 123684, -4960, -138876, -216673, -160203, -149482, -80947, -33608, -42263, 5843, 12650, 37121, 50483, 17422, -53140, -128648, -117154, -130954, -79512, -20045, 4670, 73370, 53044, 32139, 92118, 156955, 69809, -9113, -19125, -37015, 43193, 19021, 24128, 100269, 159526, 90330, 49544, 40807, 75952]
17396G5952l2464r1593p6715N2794K733J0641K4575p5123O889j8782j0019m6747
17384a77859K1389l411J8647J7503R2461R873r4943Q116K7465K2493m544K6980
17372c5830M6414L5244K2308l2100K9410N7998N3672m9137o9445j29930k2986
17361i4382L5878M3480L4713j0832l1782K8526n566n9855N067J7025L4196m056
17349g588j7524l1424o6905l8648j1157k7519J5849R9603O1406l4246o1720J5928
17337a03945J3341j3167k9544L8759J11646M6197k4767n0813l0088j12559o1176
17326b16116R1021N0893n2181l9730L8889m9655j2307Q6915j1082j4897L1343
17315i6907Q7678n804m2502p1508N6823K1921j7715P3211O493m5756k8835N354
$$ y = [75952, 43488, -48105, -124820, -72026, -69293, -58652, -34077, -109200, -102311, -121093, -131112, -177859, -156470, -159881, -141234, -123731, -31270, -21397, -116340, -108224, -80759, -58266, -62810, -35830, 10584, 45828, 68136, 36036, 65446, 123444, 177116, 127979, 58534, -71396, -94382, -58504, -15024, 19689, 8857, -22925, 5601, 35, -59820, -54753, -37728, -3532, -7588, -25112, -56536, -123441, -162089, -173246, -200765, -184916, -85313, -23907, -58153, -119873, -103945, -90604, -103771, -133315, -94556, 17090, 63287, 38520, -12293, -42381, -154940, -216116, -125095, -74202, -126383, -166113, -127224, -176879, -189186, -102271, -113353, -128250, -96907, -9229, -15033, -57535, -129043, -72220, -50299, -68014, 5197, 11690, -34066, -62901, -57547]
17303e7547P9009l2192L0035M2688K2000p1700l4335O7045m702k5433p2820m9255
17291a07207K0483m4555J1236n6752k0348K1765M5135k0699l4941K3878Q3982
17280g8023J03722p0084j43923n8495N9489L9373K9299O2651J5398n3452J7717
17269g6328N965n280l58p9377n0706Q3109N5683Q928j04003J1802J31356J10783
17257I1574Q0633k2395o0418n783m3273K4149m5131n6921o0494j2819o0821Q934
17245a62765M042J05105J44325k9555j0331k7452q4347p5685K3890N1380O7822
17234F429M5220J9021k6410M6340k5196l9853O0890J9124p4324K972k970l4055
17222b812O6405M5590p3295q4130p6772L0300J5021J1376P763j7223l0422R221
$$ y = [-57547, 21462, -10730, 19305, 61993, 83993, 12293, -22042, 45003, 40301, 14868, -57952, -107207, -86724, -131279, -120043, -176795, -197143, -175378, -130243, -150942, -185883, -162005, -78023, 25699, -44385, -188308, -246803, -187314, -147941, -118642, -55991, -40593, -94045, -76328, -70363, -75643, -76001, -155378, -206084, -122975, -67292, -58364, -162367, -150565, -19209, 91574, 172207, 149812, 89394, 83611, 40338, 64487, 19356, -37565, -98059, -110878, -171699, -162765, -158723, -53618, 90707, 61152, 50821, 23369, -60978, -136663, -112773, -61393, 6429, 51649, 70670, 44260, 90600, 65404, 25551, 86441, 105565, 31241, 34213, 31243, -2812, 63593, 109183, 35888, -48242, -125014, -94714, -79693, -68317, -60554, -77777, -108199, -98978]
17210i8978o3324K3899J09523P0746M7422j2707k4516n9688r0507N024K4582J2430
17198e6094N7171k1340q0667l173M8077J03517j2993j04040J9166J1597M4495
17187E716J5504k0211k1602q1394N5604N6343k5304Q409M0608j05061j7738P2874
17175a6252j2330n0544L4252P423k4976K6584M1266K0041l5817j5864o978j8514
17163e1709Q331K170r4735m3104j4694J00349m969k2825K5836P2556P5912R05
17151E4023n6749m5331N7812K7777j2302j0256m7105J5038N8894l738p9014R3849
17139E2898O3278q6152l2761l8582J6373J637n6584q1735O2763N8373N599L5518
17127F25m612l0299k0182j4342N1911L1753l09l2669q3879N5460P3037m7152o3982
$$ y = [-98978, -162302, -138403, -28880, 41866, 89288, 76581, 52065, -7623, -98130, -93106, -68524, -56094, 1077, -20263, -100930, -104103, -56026, 47491, 34498, -69542, -50376, -38779, 5716, 21220, 1009, -20593, -101987, -46383, 9960, -15344, -6935, 33673, -71388, -89126, -16252, -28582, -79126, -44874, -37451, -62427, -35843, 5423, 25464, -10353, -26217, -33195, -51709, -43378, -41208, -135943, -179047, -193741, -93392, -98361, -121186, -95350, -22794, 53118, 54023, -2726, -48057, 9755, 37532, 25230, 14974, -32131, -17093, 41801, 38063, -40951, 52898, 116176, 30024, -2737, -41319, -24946, -23309, -79893, -161628, -98865, -40492, -34893, 625, -3987, -34286, -54468, -68810, -16899, 14854, 14545, -18124, -102003, -46543, 26494, -20658, -84640]
17114h4640L1712M6531k4326O8137N8288j5086l7728k0539K9116k6009j0240N5983
17102G1199M3352j25618L2685k9757o0867m9427N5125J4980J4794n0959J8945
17091f5548P8718j421k2179k5914M8777Q2750o7588k9202R045q7906m1185M9097
17079g2556R5076M8076J9379l0686o6202r3986K188j3332k1120M9426K9423l3389
17067h7703L7078k0535j973l9676j1929K1265L6054J1527K0998O4905O922n3994
17055a7061k1780j2371m7983n7555O6737J7207O7031J284k1905M4574J4358m1428
17043h892j2172J6363M0974r7834O217J0373n7533R167L1839M4410o2875O6984
17031a2979L0392o0893k9388K1439j03262k9589J7648L7167K2286P2332K4866
$$ y = [-84640, -52928, -6397, -30723, 37414, 95702, 80616, 42888, 22349, 51465, 25456, 15216, 71199, 114551, -11067, 21618, -8139, -69006, -118433, -63308, -48328, -33534, -84493, -65548, 13170, 11749, -10430, -36344, 12433, 95183, 27595, -1607, 7438, -80468, -121653, -72556, 22520, 70596, 89975, 59289, -6913, -100899, -98711, -112043, -133163, -83737, -54314, -87703, -50625, -71160, -73133, -112809, -124738, -103473, -67419, -55892, -34894, 30011, 36933, -17061, -38841, -51212, -99195, -156750, -90013, -72806, -5775, -4491, -26396, 18178, 32536, -8892, -21064, -4701, 36273, -61561, -55344, -44971, -102504, -93337, -61498, -17088, -79963, -12979, 17413, -43480, -72868, -51429, -154691, -184280, -166632, -129465, -107179, -34847, -9981]
17020i981l1351l592L6903J22478L171o9169m6444p8704q5129N9787Q0835O3485
17008D2289J3595j927K116m3959k3369l3447L6254J12840o053l021k3595m9768
16996B1955m3552P436J2731K9882K1282q1790M3104L8681p0887m2349Q7002j4374
16984I121n3045N0710L9887j6810j7529k5359l7414N6869l2844n829l9017l3539
16972a04799k2984k9610l4415k3578N9302P6047L9052L8843p231p0035N2017p6150
16960a03541l3901Q286j3293M4168R0100Q6675O6024l1784q4780j13066o112Q0681
16948a0543M8182q3659J9990R4410j7207j26328j9263N323J03592m7681n3642
16937h6826n5803k9685L2061K0057Q7060P266r0755M4365J18735J07770j8863
$$ y = [-9981, -41332, -44924, -8021, 114457, 117628, 48459, 2015, -76689, -161818, -102031, -21196, 42289, 55884, 53957, 56073, 12114, -11255, -44702, -8448, 104392, 98339, 95318, 71723, 21955, -21597, -14161, -1430, 28452, 49734, -32056, 11048, 49729, -21158, -63507, 23495, 9121, -43924, 6786, 46673, 29863, 12334, -13025, -50439, 6430, -26414, -32243, -71260, -104799, -127783, -157393, -191808, -215386, -156084, -80037, -40985, -2142, -9373, -79408, -27391, -103541, -137442, -129156, -142449, -98281, -8181, 78494, 144518, 112734, 27954, -85112, -91224, -10543, 37639, -46020, -26030, 68380, 51173, -75155, -94418, -89095, 14497, -33184, -86826, -142629, -172314, -140253, -120196, -33136, -25870, -116625, -72260, 46475, 154245, 135382]
16926A35382o3533j1468o4085j14674K6212L2763L2888N0710L7785l5020p740
16915A9220K2347o9748k4205p067M222j1774l9368k7730J34171L8876k7642m4377
16903c3075p1481o6403p057J0534R6107o016L1649J8683k2007j7546n321K2317
16891d9616j301Q936p7874Q6744L3977p5239k7757O4595M91j8263k3498M4437
16879c4368l6229m2907N0944J07152L1970j29906l4252M1675M3089J4645k4065
16868a2252J4414n7054J0858o7598P7396N1102m0784k6352J8386n4609k0038n616
16856a12147L0390M7433O759m1754o4690K6364R0511K2310j2218m7949p918J8649
16844d4260N390J2065L6320Q1662J3197J1224L277o3081n1781j4115n3538l6439
$$ y = [135382, 71849, 60381, -3704, -118378, -92166, -59403, -26515, 24195, 61980, 26960, 19220, 41567, -28181, -52386, -59453, -55231, -67005, -106373, -134103, 68, 38944, 11302, -33075, -104556, -170959, -178016, -167482, -71375, -77391, -45742, -27059, -49066, -66612, -71933, -49616, -50917, -41981, -119855, -33111, 866, -74373, -102130, -37535, -37044, -55307, -78805, -34368, -70597, -113504, -62560, 44592, 76562, -53344, -87596, -45921, -2832, 11813, -12252, 2162, -54892, -44034, -111632, -34236, 16866, -23918, -50270, -31884, -86493, -106531, -112147, -81757, -34324, -27565, -69319, -134009, -107645, -17134, 5176, -7042, -54991, -62909, -44260, -38870, -26805, 9515, 91177, 104374, 115598, 118875, 55794, 4013, -10102, -63640, -100079]
16832a00079j6665j2819J56428K4784o1037q9094J15547P1737K4077j15066l1227
16821c3414l9202N3959P1478n8817J3741L03r455n6434j22442M166l3429j1618
16809b21164L9162N2739N2626Q8741O2611n9580o0784n4381J8520J1321m1375
16798a11564j8783j1600N258N5070R7508k0476j03558o86N0836Q5423O7392n934
16786H8886p1436J8559k4970r2292r1696r62O4149J37102J14141P047j41897R685
16774A6316J0698K4494J638j10506K7157M4282M9674j9433n5187l2790n8847K9305
16762g3199Q0041K1775n2313q9728k9117j9144p438O8824j4081k086O5153L5065
16750a6248j1744l1838J0688r1065K787J00210m2326r7975J677P858P8789N5429
$$ y = [-100079, -116744, -129563, 26865, 51649, -9388, -98482, 17065, 88802, 112879, -2187, -33414, -72616, -18657, 52821, -5996, 7745, 8048, -1407, -57841, -180283, -176117, -209546, -221164, -182002, -129263, -76637, 12104, 74715, 15135, -45649, -100030, -81510, -70189, -111564, -130347, -141947, -136689, -81619, 15889, -4587, -108145, -108831, -57995, 27428, 94820, 88886, 17450, 36009, 11039, -81253, -172949, -173911, -109762, 27340, 141481, 148528, 6631, 16316, 27014, 51508, 53146, -57360, -30203, 14079, 63753, 44320, -10867, -43657, -102504, -73199, 6842, 28617, -23696, -113424, -142541, -161685, -169123, -100299, -114380, -116466, -51313, -16248, -27992, -59830, -49142, -140207, -137420, -37210, -79536, -177511, -175834, -167976, -89187, -33758]
16738c3758L2899M5904j9782l3626M2147L0505j2156n9256M4398K0551l0705j4927
16726A2194o5864j1851L556L7653P8493L2143m306q503o6854j38496N59o222J7360
16713a20138p34Q9385N4355r2305m4054n1366L104J03237O699o0810M4157n4762
16701a23232j09978j1711N9866Q3988J19127O5467M5767L4946J593m9449L143
16690A19527o1701m1175K0238L9354k2633k9586q2282R06K5044m873J44601J64950
16678B72370m1114q5719j24226l2323P968p7405M573p2725N5739K2149P0163R8749
16666I8199m1255l0368r379k8451o8807l0392P8870O3570n8825q491l6424l084
16654g4837M4042n794m557J13488J00783j66229j13232J9422o8101k1838M9594
$$ y = [-33758, -859, 45045, 25263, -8363, 33784, 64289, 52133, -7123, 37275, 57826, 27121, 12194, -53670, -65521, -61965, -24312, 54181, 86324, 82018, 73515, 6661, -131835, -131276, -137498, -120138, -120872, -31487, 22868, -69437, -113491, -164857, -161753, -58516, -51817, -112627, -68470, -123232, -233210, -244921, -185055, -101067, 18060, 83527, 129294, 164240, 165833, 116384, 119527, 57826, 16651, 36889, 76243, 53610, 24024, -58258, -57352, -32308, -37181, 107420, 272370, 231256, 145537, 21311, -11012, -3044, -80449, -75876, -148601, -92862, -70713, -550, 98199, 56944, 26576, 17197, -11254, -80061, -110453, -31583, 31987, -26838, -35329, -71753, -74837, -30795, -36589, -41146, 72342, 173125, 6896, -106336, -86914, -155015, -176853, -127259]
16643a27259q919m490l538j9112j1975J7653J8993N9024J02015J9572n9375n4984
16631g2395P524M39j5907J3146P376R6937J8579k9278j5868q1028Q189O3385k7989
16618b6890k3003l4607l9968L0903K2500K6868L397o0005L8517O62j878K9203
16606c4301p819J1696P812m7440j599K5179M3272P3816K9522N0315M1242N631
16594A97326j1354l2413r6032J383k047l8306p2903K869M9544J0166l7844P247
16582b2364l9597O3964O9825N5228p6526j5544k5898J0167j06654j6465k4905
16571a28769R2303M7522m5267n6475L7547j4735m1600R1193N922R048J382J5152
16559A3223l6898M3936j00514k939o818M9024M2787R0157m3469j9937p7598p785
$$ y = [-127259, -136178, -140668, -144206, -163318, -175293, -157640, -138647, -79623, 22392, 41964, -17411, -72395, -64871, -64432, -80339, -67193, -59817, 37120, 55699, 26421, 10553, -70475, -62286, 1099, -26890, -49893, -84500, -124468, -93565, -71065, -44197, -40800, -100805, -62288, -61626, -63504, -34301, -42120, -30424, -22612, -70052, -71651, -46472, -3200, 70616, 100138, 150453, 191695, 197326, 185972, 153559, 57527, 58910, 56863, 18557, -54346, -51477, -1933, 8233, -29611, -22364, -61961, 2003, 71828, 127056, 50530, 34986, 9088, 19255, -87399, -103864, -128769, -36466, 11056, -34211, -90686, -53139, -67874, -109474, -18281, -12359, -3311, -1929, 13223, -23675, 20261, -80253, -83192, -90010, -40986, 1801, 91958, 48489, 28552, -49046, -56831]
16547e6831k151N3332O4903L1074L6078p8846p1638l2810l7959l0826m9015K8754
16535a45935N9388K6899N796M9328L633L9345R4453j69430r4631K5961j5270l6933
16523a57396J12876R2169k5678l7818m0744l0176L2404Q592N1042m2288n3963
16512i0980K8056l4412k0679O1936J8792N6272O1892L9758p0482l835N0719N1994
16500A49031m8362n0759M697l1617j33166r2901Q598L3309L7576N3470N4385O506
16488i233K2218k6692m4377j0511L0240M5111j0145l4058P6036O7240Q1935J2149
16476A99913k08809j25048o2448Q4748K1906Q9167K0407p7199l2804N4031N0511
16465A4375J41L5714k3816k2437j8340k1136O5424j3010n5984L3804L2734j3427
$$ y = [-56831, -58982, -5650, 59253, 90327, 126405, 47559, -24079, -56889, -94848, -125674, -174689, -145935, -86547, -59648, -53852, -4524, -891, 38454, 132907, -36523, -131154, -105193, -120463, -157396, -44520, 47649, 21971, -15847, -56591, -86767, -54363, -45771, 5271, -37017, -90980, -62924, -97336, -118015, -56079, -37287, 18985, 80877, 120635, 50153, 46318, 97037, 149031, 100669, 49910, 54607, 22990, -110176, -203077, -194479, -161170, -123594, -70124, -15739, -9233, 12985, -13707, -58084, -68595, -38355, 6756, -3389, -37447, 38589, 105829, 187764, 199913, -8896, -133944, -196392, -111644, -89738, -571, 19836, -57363, -90167, -36136, 14375, 14516, 50230, 26414, 3977, -14363, -35499, 29925, 16915, -39069, -5265, 27469, 14042]
16453A4042r837M53P6974k4183k5552q2006j3744k7025m1877O990j0725O5059
16441g1431K2889P0808J2997p133r1742m3069L1285m4524q600m1908K5656N3245
16429i1527J4807m5923J2853R5405o0123j6576Q498n368J21705K5724q6584n8201
16417h5310q1880k1923J39341K5465J3146j8141j8793k2522n9414j08599p437
16406b46067M8932K2858k2688M9807O6464N0517N861K7197L0000q9444K8217J02942
16394G4596n6861l8016M7344m9596q7438j6190N3133J0032M2330P9065P7732o2143
16382G3988j10400n5676Q1319K0170n7827M895j3056q1213l3209J6901L3178O0731
16370f0199j5649m9792m662P6987j0507k4828J12421M8139j607L0098M8981n3379
$$ y = [14042, 4205, 4658, 81632, 57449, 31897, -50109, -63853, -90878, -132755, -125765, -136490, -71431, -48542, 22266, 35263, 28130, -63612, -106681, -75396, -119920, -128520, -170428, -144772, -91527, -76720, -122643, -109790, -14385, -74508, -91084, -82586, -87954, 33751, 59475, -27109, -85310, -167190, -189113, -49772, -24307, -11161, -29302, -48095, -70617, -130031, -238630, -246067, -197135, -174277, -196965, -147158, -80694, -30177, -24316, 2881, 32881, -56563, -28346, 74596, 17735, -20281, 27063, -22533, -109971, -126161, -73028, -62996, -20666, 58399, 136131, 73988, -36412, -92088, -10769, 9401, -48426, -43531, -56587, -137800, -171009, -154108, -120930, -60199, -75848, -125640, -130302, -53315, -63822, -88650, 23771, 71910, 70303, 100401, 149382, 96003]
16358I6003j01032o4136L0797J6236J438P9820J7393j8895r2986o3652M9654R1698
16346D2338j4869q2575n1348J4837O4765K8489n0690J4330L8755K6587N0479J7734
16334I8832K5899k9223p5383k8421M9431j29628k1676J6934L849R2566K8296O1494
16322I2970m1922j8435K2739p5115k9314l5662l07o398n6331K9592J80j9199j5217
16309a52419R0185N5756m5944N5107O6246n8003m085M0085p9748m7154m0628J6897
16297a03705N4993M6182K563K6395J3933J7579m7573j1495J6910k0732K1220P5772
16285I2042l2892R949o9369m3230n514q948K6388n0595P2255m8330l3485O8853
16273b2876M0328n1064j0878M7692O3029J12042j5098l2277j10037j2935L4854
$$ y = [96003, -5029, -69165, -38368, -22132, -20694, 59126, 76519, 57624, -35362, -99014, -49360, 42338, 27469, -55106, -106454, -91617, -26852, 1637, -49053, -34723, 4032, 30619, 81098, 98832, 124731, 95508, 20125, -8296, 41135, -88493, -110169, -93235, -89386, 3180, 31476, 92970, 51048, 32613, 55352, -19763, -49077, -84739, -85046, -91444, -147775, -118183, -118003, -137202, -152419, -62234, -6478, -52422, 2685, 68931, 10928, 6843, 46928, -32820, -79974, -120602, -103705, -48712, -2530, 33, 26428, 40361, 57940, 10367, -1128, 15782, -4950, 16270, 92042, 59150, 69099, -270, -43500, -49014, -57962, -31574, -82169, -9914, -58244, -91729, -22876, 17452, -33612, -44490, 3202, 66231, 178273, 163175, 130898, 20861, 7926, 42780]
16262D2780M9357l5264j14616q3876j1592L5881P5253N222n1865m3220L8087K5272
16250f8581N230J2531m7716n3763O6710P2986l4560l0568O2018P4178m6528J3641
16238B5578k9439j2805M1168j4718p1215n9962P0586M9887k4341J9193K6353L4124
16226E4409K111j18258k9728J005O4862n3870o8746J3935L7664O2177Q0510j6734
16214B9337K465R603l1148p0308o0183K8773J3031m6873M3700O2612J1422K1860
16202A4291l4616n9279J1424k6737n830r6962M3108Q2933K4742q3686M513J5000
16190a11099Q6629p156P888J08663m9081k7927r994l9826l4853M0242N2488Q8198
16178A04172J8868o6873l5925o4576J4991m613J3364k2875o2878J4495P2659M8058
$$ y = [42780, 92137, 56873, -57743, -141619, -153211, -117330, -42077, -36855, -88720, -131940, -93853, -68581, -63351, -50820, -98536, -152299, -85589, -12603, -47163, -77731, -15713, 58465, 11937, 25578, -3861, -16666, 24502, 9784, -61431, -121393, -50807, -920, -25261, -6068, 20285, 54409, 56520, -61738, -91466, -90461, -25599, -79469, -148215, -134280, -96616, -34439, 46071, 29337, 31802, 41405, 10257, -60051, -120234, -91461, -78430, -125303, -81603, -18991, -7569, 14291, -20325, -79604, -68180, -94917, -100747, -197709, -154601, -71668, -46926, -130612, -126099, -111099, -24470, -31626, -23738, 84925, 35844, 7917, -2077, -41903, -76756, -36514, 15974, 104172, 123040, 56167, 20242, -44334, -29343, -33956, -20592, -43467, -106345, -91850, -19191, 28867]
16166B8867L3941Q4413k6580j40140n5263j4575J8354J3664j0460K9045J6439
16155b2295O2108K0690j9952L6109r3349p8882O7862J312l1704l4992K8124K7589
16143c7380K0577K1475O7689l8135J2963n1061m7231Q4314K818p127l8119o4647
16131g3864J1046J5566j6548l1896O0535J2265K0230r217k6598k8406M0523M7494
16119B1130k045J00776k2948n3291j0893p0734j3295r076M5376J10463j4083l5869
16107D5511j9629o2813l345Q783o1928P910L9071m1365L4873J9627j3429R5051
16095D8317l4182q2847m221m0704n0933L8381Q7479n1278l420Q779q657J4781
16083g8505p9129o198P7443Q8750J4190K6248Q2095q3430j32167k6989L9262k9195
$$ y = [28867, 62808, 147221, 120641, -19499, -74762, -89337, -70983, -57319, -67779, -38734, -22295, 39813, 60503, 40551, 76660, -16689, -95571, -27709, -26397, -58101, -93093, -64969, -37380, -16803, 4672, 72361, 34226, 47189, -3872, -51103, 33211, 36029, 28902, -9217, -73864, -62818, -47252, -63800, -95696, -35161, -22896, -2666, -11883, -38481, -66887, -26364, 21130, 19085, 119861, 96913, 43622, 32729, -38005, -51300, -60376, -15000, 95463, 81380, 45511, 25882, -36931, -40276, -31493, -93421, -85511, -46440, -87805, -52932, -33305, -46734, 48317, 14135, -68712, -72933, -113637, -164570, -126189, -38710, -89988, -93408, -84629, -93286, -78505, -157634, -163832, -86389, 2361, 16551, 42799, 124894, 41464, -90703, -117692, -78430, -107625]
16071a07625l2648N0457O7144N9398l4914O550k0541q4224O3286L4546J05484
16060A06913O8321j41968q3126j4389L4182Q417m5070l1344K9671N9731m5188
16049e3850R3866l604J2400O0445p0633m8542L8208l3051L1889N2273M9750j2376
16037A16775j09987n5306m5195Q18Q7060J5108q0057M4718M7421n0065l0246j1675
16025g0631J7900j30l0009k8105N6609P7494M4016L4678J0572r5197K7593J23135
16013A67925J1947k3967m9542p746o0318q188n7584R605o0588q2983k541Q7094
16001g6886J5535N6556R3040k8526m1611m043q0125L324K7624K0295k795p455
15989b5067l7263N6959m209l4470p2963O4526P2014J5641p312l3792M5155K1922
$$ y = [-107625, -140273, -89816, -22672, 36726, 1812, 8362, -12179, -96403, -33117, 1429, 106913, 175234, 33266, -49860, -64249, -30067, -21650, -66720, -98064, -68393, -8662, -53850, 40016, 36412, 48812, 109257, 38624, -9918, 28290, -4761, 27128, 79401, 129151, 116775, 6788, -48518, -93713, -92895, -5835, 9273, -70784, -26066, 21355, -28710, -58956, -70631, -52731, -52861, -82870, -110975, -54366, 23128, 67144, 101822, 112394, 17197, 44790, 167925, 179872, 155905, 106363, 98617, 38299, 30111, -27473, -17868, -78456, -161439, -163980, -76886, -61351, -4795, 88245, 59719, 18108, 14065, -66060, -62736, -35112, -14817, -17612, -25067, -62330, -5371, -9580, -44050, -117013, -52487, 19527, 35168, 27856, -5936, 39219, 61141]
15977F1141k8652m7325l5556L2111L0064n3672q6143Q2680K28l1022J02095R225
15965C5174N4845K5692l1340j2895j4500m6898Q4395N0987K3968o6652l3423n8842
15953A0511n7299O8612N4223J8547N4192R138n2523m8447N472n9735o5612Q2805
15941A9884J23959K9995j02571l1912m599k2116O4090L3622n4480p4404n7807
15930g6339N535p861m3310J1560O509q354P0482l009n8387J3940N9091o1815j4646
15917a06604N8489j0870k8649J7575l3787r094M1094m1106L3427O3599j6651p981
15905d0558M8953n501l1358J6456R6283o8886o0094L8182q6519l1186O1601L6721
15893b5906m6426L4081J18432N5200l2422m0132M933J13584J1828o5826l1222
$$ y = [61141, 32489, -14836, -50392, -18281, 11783, -41889, -128032, -45352, -45124, -76146, 25949, 35174, 90019, 115711, 84371, 71476, 56976, 10078, 94473, 145460, 169428, 102776, 69353, 10511, -46788, 21824, 76047, 94594, 148786, 157924, 105401, 56954, 62426, 2691, -62921, 19884, 143843, 173838, 71267, 39355, 34756, 12640, 76730, 110352, 55872, -18532, -76339, -70804, -78665, -121975, -110415, -103906, -112260, -41778, -44787, -103174, -89234, -30143, -91958, -106604, -48115, -58985, -87634, -70059, -103846, -112940, -71846, -112952, -79525, -15926, -32577, -40558, 8395, 2894, -28464, -12008, 84275, 15389, -44705, -6523, -93042, -124228, -62627, -25906, -72332, -38251, 80181, 135381, 102959, 62827, 67760, 181344, 193172, 127346, 96124]
15882I6124o0908J6689n8075r6669L2427n3137J1361R6333K515m5588m3217N635
15870i6510J8257L0724J4854N6050J6297p1454q1791J023l1497k2387R634J34982
15858b1818J37478r487j11828q7640K4903J14190L5496K6222l2022l3756m3173
15847a435L5407m7011k9067k6890L3896O862J5221R1911o785j0911k3185j3131
15835B4882m8880p1273N1348Q0625J8461L7651l0369j12311P232N0050P609K0629
15823C5654j973m7095m3318l1270j1574j4666L0347n353o1213P3167O3504Q9661
15811G5871O0400j1963p6377n9096l3531L0060J3418J5245m1140M3769J00025
15800A16681N0079j35p610n4900k1245m0937j5154m0250l0051O5923M5294K2590
$$ y = [96124, 35216, 51905, -6170, -102839, -70412, -123549, -112188, -15855, -13340, -58928, -102145, -96510, -78253, -47529, -32675, 23375, 39672, -31782, -113573, -112550, -144047, -166434, -156800, -21818, 115660, 106173, -5655, -93295, -68392, 45798, 81294, 107516, 75494, 41738, -1435, 33972, -13039, -42106, -68996, -35100, -28238, -13017, 78894, 72109, 61198, 38013, 24882, -23998, -95271, -43923, 36702, 55163, 92814, 62445, -49866, -42634, 7416, 15025, 35654, 33681, -13414, -56732, -88002, -99576, -114242, -83895, -89248, -150461, -77294, -13790, 75871, 136271, 124308, 47931, -11165, -44696, -14636, -1218, 14027, -27113, 16656, 116681, 166760, 166625, 159015, 104115, 82870, 41933, 26779, -13471, -43522, 22401, 67695, 90285]
15788I0285n4748r9755p4660O361N8436J9443R08R2500J5443L8365J3546m9241
15776E6883N889p9882J6407P1962O915o6782j6772n0168k7242r825Q0667M2727
15764C0779j00858n8264K0745J1394l3178R5273J06800L050n9612l8915O2649
15753C9863m2758n7350J0036J6248l8727P0853k0770J1487J292o8350L1512l444
15741e0108J4116P823j0402N8163l2241o6994J4513J7244J4076p570K7388K4947
15729A0955l0931Q9391M7570M260o3896j5193k6735L9384k2771n3570l0922L0813
15717b1645k0212m3165k1938k4679n9736n0220M3859Q838M8791J14675L9001o9897
15705e6328N379k524j8489J3614j7302K4357Q2343M3827M1792m0871j61422j6074
$$ y = [90285, 35537, -64218, -138878, -132517, -74081, -54638, -53730, 38770, 54213, 92578, 106124, 56883, 62772, -17110, -703, 71259, 78174, 11392, -5380, -55548, -82790, -92615, -11948, 30779, -70079, -128343, -107598, -96204, -129382, -34109, 72691, 75741, 16129, -22786, 39863, -2895, -60245, -50209, -33961, -72688, -1835, -22605, -11118, -9826, -78176, -46664, -50108, -35992, -28169, -38571, 19592, -12649, -79643, -65130, -47886, -33810, -41380, -13992, 10955, -19976, 69415, 116985, 121245, 57349, 42156, 15421, 54805, 32034, -21536, -52458, -21645, -41857, -85022, -106960, -131639, -191375, -241595, -197736, -188898, -140107, -25432, 13569, -56328, -50949, -53473, -71962, -58348, -75650, -51293, 31050, 74877, 116669, 75798, -85624, -101698]
15693a01698J01331Q778r232K7314m3651k769L5288j50J4373L2079N4925m7539
15681F9049r9477o7822R0222P8964l1034j31553j7587N5287N3669k6793J8242
15670h833Q3190J1780l7046r575M5489j7594n9667k1215Q5355O9497q6658j03696
15658d8973K6099j052k5556L8980k5136N256j3182L6497o9062L7795j1086k3768
15646g3188L4835j4962r807N9674K4144l9678m0021L704j2919j3696J05584Q0745
15634A04415o4881l3690J739l8329l8044N797P3249j4311j19430M7817L14N7263
15622a8091R0357J2753J1915P0350K2596j04738o3313r7089j08513L5829Q1464
15611f6480O2060M1036l7746m4068k657l8953k2420M7032r132N9325M5325m6704
$$ y = [-101698, -367, 8411, -821, 26493, -17158, -19927, 15361, 15211, 29584, 61663, 116588, 69049, -30428, -98250, -8028, 70936, 39902, -91651, -109238, -53951, -282, -27075, -8833, 74357, 86137, 49091, 39516, 85005, 67411, 7744, -13471, 71884, 141381, 54723, -48973, -22874, -23926, -49482, -10502, -35638, -30382, -43564, -7067, -76129, -38334, -49420, -73188, -38353, -53315, -63122, -3448, 20696, -18982, -59003, -55299, -68218, -81914, 23670, 104415, 39534, 5844, 7583, -30746, -68790, -62993, 10256, -4055, -123485, -75668, -75354, -18091, 72266, 85019, 96934, 167284, 189880, 85142, 21829, -75260, -183773, -147944, -66480, -4420, 36616, -1130, -45198, -47855, -86808, -109228, -62196, -71328, -12003, 33322, -13382]
15599a3382K4115O9942j0410l427R260l3118k6161J4065K6826Q565O553m2056
15587C0772j5865J8100K4681o9526l5070l3011Q135J6027Q7096P5777p850r3j04803
15574e630m3171j3270j7287N8415o0047j6180L6541P4020Q231k9522N9992l3343
15562A8749o5161q7856J8591J23211O2917K7834J5445j15232l9285o7685K9586
15551g8886L2210k4537J03014P0151m5807l3370m3660M8087n278j16563m9975
15540a44614R3247K9667M739M6454O4129K3432M436q1654l0478N9416p1411p1268
15528g3905K0273K4173R0033J1978j50837k1104j9651L1458l0999N1734L4335
15517c2512j2378k4480L5012J0131K3921Q8219k2803r6733o6445J9423o191k2714
$$ y = [-13382, 10733, 80675, 70265, 66838, 76098, 42980, 16819, 30884, 57710, 66275, 72828, 30772, 14907, 33007, 57688, -11838, -46908, -79919, -71784, -55757, 31339, 107116, 99266, 99173, -5630, -48801, -62071, -79358, -20943, -80990, -97170, -60629, 13391, 21622, -7900, 52092, 18749, -46412, -134268, -115677, 7534, 70451, 98285, 113730, -1502, -40787, -108472, -78886, -46676, -71213, 31801, 101952, 56145, 22775, -20885, 27202, 21924, -94639, -144614, -51367, -21700, -16961, 29493, 93622, 117054, 121490, 39836, 9358, 68774, -2637, -73905, -53632, -29459, 60574, 72552, -78285, -99389, -119040, -87582, -118581, -66847, -32512, -44890, -69370, -34358, -24227, -306, 87913, 65110, -31623, -98068, -78645, -84836, -107550]
15505a07550K4884n9511n3641K2826M9608N7638l8249O2762Q6376o184O1581N397
15493A05937j32048n5063L9156Q294m4463O928m821q8239J4701J25210M6138m7879
15481b6149K3167Q854R2057n6554q2937q1588l835J4219K628l133R040J01045
15469c186k6588j5107L8222p2003m6737n6352L6593J24598K8654k3242p8365n0948
15457a44461L4030l9337m030N7880K075p563P4232j1959M8829n7787r0117r3588
15445b31796l931J01981J33527M0379J2487r403j530N501l8955p619J1159o4954
15433e3154j04411L6213L7404n2106j4675N6375N5893k1452K888L0029N0348q7352
15421f4000l7385j2404O1325M4158K7483J0351j06992j4398J9109j9702R009O2705
$$ y = [-107550, -82666, -142177, -195818, -172992, -123384, -65746, -103995, -41233, 45143, 38959, 100540, 105937, -26111, -81174, -42018, -33724, -78187, -71259, -76080, -164319, -149618, -24408, 21730, -26149, -2982, 5872, 97929, 41375, -41562, -123150, -126985, -112766, -110138, -113271, -104231, -3186, -29774, -44881, -6659, -78662, -125399, -181751, -145158, -20560, 8094, -15148, -93513, -144461, -110431, -149768, -153798, -95918, -93843, -101406, -27174, -39133, 9696, -48091, -138208, -231796, -235727, -133746, -219, 40160, 52647, 43244, 41714, 47215, 8260, 641, 11800, -53154, -157565, -121352, -83948, -136054, -150729, -94354, -38461, -59913, -57025, -26996, 23352, -64000, -101385, -113789, -52464, -8306, 19177, 29528, -77464, -91862, -72753, -92455, -83446, -20741]
15409b0741P5919M9335K3154P286m6244n9999j03494q7804j0651M5583j3796K149
15397a39303O6368q3334L4253L1219J5171j2260Q186J1748r266m5370M8160J3117
15385f1311k0941P7582m6456l7684Q1242L7440P6283J2793l6917j58789J4796
15374f1962J08813M214m1907N7271j8996n5491m5720j5036N1349R2396K0126O446
15362A01503j2532m3635j3702m1517M9714R6474n8614r7457p9181j7016J01645
15351a4318N7523J6275n0896M7122K8520m871n2779o6923j01141M0120O071O8461
15339b6836k5560K6594q231q5832m4394N5077L7322O0347K9234l8971K4565k1026
15327a7711p3723K7780J2590n1287j4717k3966M4419N3468J1390K2223J9114N3409
$$ y = [-20741, 55178, 104513, 127667, 134953, 88709, 28710, -74784, -162588, -173239, -127656, -141452, -139303, -72935, -156269, -122016, -90797, -75626, -87886, -79700, -67952, -77218, -122588, -74428, -61311, -82252, -4670, -51126, -88810, -7568, 29872, 106155, 118948, 82031, -76758, -61962, 46851, 51065, 9158, 66429, 47433, -8058, -53778, -68814, -17465, 74931, 95057, 101503, 88971, 45336, 31634, -9883, 39831, 136305, 77691, -19766, -98947, -115963, -14318, 43205, 59480, 8584, 55706, 84226, 79355, 26576, -40347, -141488, -101368, -95297, -26836, -52396, -25802, -34033, -119865, -164259, -109182, -71860, -11513, 17721, -21250, 3315, -17711, -91434, -63654, -51064, -102351, -117068, -141034, -96615, -43147, -31757, -9534, 9580, 62989]
15315F2989m2747m3243P3478J8102K1162q1J751n3009k1317R843N2140M6773k0906
15302A04935m1058l8623j09375l7916P2276l0625j8260N4823j0151m2525K0762
15291g5737J4189K697N8944Q8873j4618m2684O4583M8330j3443J6923m2671m7951
15279E7435o1390l8971l6811K6145M65k3263o6462J4530J8236P8824R293k0539
15267d2508o0205r399k5009k692R1544O3618P5970n7814q924m868R74l8393J3782
15254c924N2818O6960m7256q4448p2705p357K7162Q275j7358k0752p3N4448n246
15241d9456R7050J2538l0858M2827M3870k8454j8172p3540l0627p8901L4047K0203
15229e9473l932J7463j6527l284l3930l4537O9164R898J2558O815L0301r040O372
$$ y = [62989, 20242, -23001, 50477, 68579, 89741, 89660, 91411, 38402, 17085, 26928, 79068, 125841, 104935, 63877, 25254, -84121, -122037, -49761, -80386, -98646, -43823, -53974, -96499, -75737, -61548, -58851, 93, 88966, 74348, 31664, 96247, 144577, 131134, 148057, 105386, 57435, -3955, -42926, -79737, -53592, -53127, -76390, -142852, -128322, -110086, -31262, -21969, -42508, -102713, -112112, -137121, -139813, -48269, 15349, 91319, 33505, 24581, 19713, 20687, -17706, -3924, 48894, 115854, 68598, -15850, -88555, -95912, -68750, -60475, -77833, -98585, -98658, -44210, -49456, 47594, 60132, 29274, 72101, 115971, 87517, 69345, -4195, -34822, -113723, -79676, -59473, -63405, -45942, -62469, -65753, -99683, -134220, -65056, -55158, -42600, -35785, -5484, -14524, -8152]
15216h152K4839j87o294Q0224q6028q3335l7905J7639Q4233Q7621k0320M2998
15204I5333M1274p3907r9610o3231o471J60488O7863N7351l2518k7088K1302l3271
15192A07515o1508J7015l9228o89J2856j68J1944n4222L4278J4946o3305m6829
15180f7395l9108j1533j0234R7534K5615K2385R7512m0300q234l294j8485m4453
15168A0m6894N6125l5449n7316p2897O2590M837M0935l6085L2512j7817J356M3464
15155b4629O2319M0819L3583j8905m8248l7567l0903l7933L4676J30545L1639
15144A35396q8383o6055l4989J16118K5586k7723K0501J0543p1055l4042q048
15133b2151R0777R012m8763k4502K8369L9169m1913m7335p4911K4065l755K5779
$$ y = [-8152, 16687, 16500, 10206, 90430, 4402, -78933, -116838, -99199, -14966, 72655, 52335, 95333, 136607, 62700, -36910, -100141, -106612, 53876, 121739, 179090, 146572, 119484, 140786, 107515, 46007, 63022, 23794, 23105, 35961, 35793, 47737, -6485, 27793, 42739, -20566, -67395, -106503, -118036, -128270, -30736, -5121, 17264, 114776, 74476, 66242, 62948, 44463, 10, -46884, 9241, -26208, -83524, -156421, -93831, -88994, -48059, -84144, -51632, -69449, -68093, -24629, 37690, 78509, 112092, 93187, 44939, 7372, -23531, -61464, -26788, 103757, 135396, 47013, -19042, -54031, 62087, 87673, 59950, 80451, 90994, 19939, -14103, -22151, 68626, 77638, 28875, 4373, 32742, 71911, 29998, -17337, -92248, -68183, -71938, -46159]
15121d6159j4465p9308k7528R2915P4169o607k0409l3049l4609r005J7177j0259
15109i7137R591l1605O2795L4715l1353k8642K1829K5988L9576Q6252K1967n8641
15097E5335r8533o0760l6585Q3950P5671R6902K7579L6424K0569m6507l1335o1947
15085F0763j9720O818p631r0861n193o6048L854N9508j4419P254M0956m0924j5214
15072h0857O351M0976J2628Q7505J8888l301k0850p0522J8783R900o3082j1840
15060e5421L1496K8767K0200j0010O3556K8723o2326j5761N3066L8538l5284k2799
15048F2745j9697o48k0305j5396m6043J3434q0493k3664L9255j9998J7686K8462
15036f4662L9166O4223K164o6115J09710L1456m0529m0794P2717l7102l185O284
$$ y = [-46159, -60624, -139932, -167460, -74545, -376, -6983, -27392, -60441, -95050, -104055, -86878, -97137, -87546, -119151, -56356, -21641, -52994, -81636, -59807, -33819, 5757, 92009, 113976, 55335, -43198, -103958, -140543, -56593, 19078, 115980, 143559, 179983, 200552, 154045, 122710, 60763, 41043, 47861, 40230, -50631, -55824, -121872, -118018, -58510, -72929, -65675, -24719, -65643, -80857, -74506, -33530, -20902, 66603, 85491, 82190, 61340, -9182, 9601, 19501, -43581, -55421, -23925, 4842, 25042, 15032, 78588, 107311, 44985, 29224, 82290, 120828, 85544, 62745, 43048, 42400, 22095, 6699, -39344, -25910, -106403, -130067, -90812, -110810, -93124, -64662, -25496, 38727, 40891, -25224, 84486, 115942, 75413, 34619, 107336, 70234, 67049, 73333]
15024G3333j4920r039J4192m3757m7109N873N96n5975q9551N1948L7969K9591
15012d6849K0694J9466j3666R8487l9105l1632r246q630N9231K6192r5114K689
15000a7483L5304L4064J04038l0500r1682k4524O1973J2688q3992P3638m3932
14989B9592k8927N4270J3866n9892j5823m3339k0564O6967O4006K1177J0087l7164
14977E4256l5505J024J664l1646l783Q2764o0286j05043j7201m5910O8713O4412
14965b6541N7953J765m0142j22305Q815M8686J7445M7273M3151n2891J629P067
14953h095K8049K5059J1508J3578l0861n7335q0396K5547K0912m2948N6311L5778
14941b893K5247O721p5912K7448J5107p822m2967r5491J1314N2518L3172q275
$$ y = [73333, 58413, 49374, 63566, 19809, -27300, -21427, -20831, -76806, -166357, -114409, -76440, -46849, -26155, -6689, -20355, 78132, 39027, 7395, -1851, -10481, 48750, 74942, -20172, -17483, 17821, 51885, 155923, 125423, 33741, 9217, 71190, 83878, -114, 73524, 29592, 665, 54935, 68801, 8909, -6914, -50253, -70817, -3850, 60156, 81333, 91420, 54256, 18751, 19775, 21439, -10207, -13990, 68774, 8488, -96555, -113756, -159666, -90953, -26541, 31412, 33177, -6965, -129270, -120455, -71769, -54324, -7051, 36100, -16791, -15162, -8095, 19954, 45013, 56521, 70099, 39238, -18097, -98493, -72946, -52034, -94982, -38671, -2893, 22354, 29075, -46837, -19389, -4282, -12104, -55071, -150562, -139248, -86730, -53558, -61833]
14929f1833K8930M8661k1639k8507K1427n5641J9705l4707N2180Q0846Q1497n2643
14917G8276o7399m1012J2543Q6822P3762J3958j00789q8596j7927J3587L0699
14906f076n7054j0891K9445k8518J09702O2623K2297r0667m1722J5779j00887
14895i5969J3583L5239r441O7234P1702l1454r4216Q133M5587j1420o87q7678
14883h9387j8123Q069J691J8684N4463Q5964k1394k0444J5215K0881M3866m1775
14871E7710r0492K4725J31156K2112r5388j10406J9899J17489j2315o1593o532
14860c635k5029N1279J9367k1976n690M1437j8349p1872j7824N4495j4494n944
14848a8235j0252M4399L079J7861k7738o0563m0147J1634K9661l2688j8635K6190
$$ y = [-61833, -32903, 15758, -5881, -34388, -12961, -68602, -48897, -83604, -31424, 49422, 130919, 78276, 10877, -30135, -17592, 69230, 142992, 156950, 56161, -32435, -50362, -36775, -6076, -63130, -74021, -44576, -73094, 36608, 99231, 121528, 30861, -10861, 4918, -95969, -82386, -47147, -56588, 10646, 82348, 50894, -43322, -35189, 10398, -1022, -1709, -89387, -107510, -99441, -97750, -79066, -24603, 61361, 39967, 19523, 34738, 55619, 99485, 57710, -32782, -8057, 123099, 145211, 49823, -60583, -40684, 76805, 64490, 2897, -3635, -28664, 22615, 41982, 20006, 14316, 55753, 37404, -34468, -52292, 2203, -12291, -18235, -28487, 15912, 18991, 36852, 9114, -51449, -91596, -79962, -50301, -82989, -101624, -75434]
14836g5434K0607O2740O4583P020L857O6324O5475m7852j1684j0232m2348l541
14824I9515o9187r926P512m7022O9239M2248r2999k4259q179J3299k8368j17858
14812a65985q2212O6116N1779N8707j4500M2715M8618n689J1689o2060n2563k7507
14800a30892o337O6177P4192j6523J9758j6085n6880j9864K7781M4858P1390m2478
14788A5097m0052N8635K0158q9530N1480P7757R084j18370j1427r876Q2646K4637
14776G0239j053p3256m8467J884k6443K3505m2837P1798M3407p1232r7559J9518
14764a30496N0250M8192k3123M4467O9633P919o4238k5264N6195P5089J3335k9219
14752I2740M9237o9113j00953L1675j1582k971N950o9345n200J04253K7642k3512
$$ y = [-75434, -54827, 7913, 72496, 79516, 83373, 149697, 215172, 167320, 155636, 145404, 103056, 99515, 30328, 20402, 27914, -19108, 50131, 92379, -620, -24879, -33058, -19759, -48127, -165985, -248197, -182081, -130302, -71595, -86095, -43380, 5238, -451, 11238, -50822, -103385, -130892, -137229, -71052, 3140, -13383, 6375, -9710, -66590, -86454, -58673, -13815, 57575, 15097, -24955, 33680, 53838, -35692, 15788, 93545, 102629, -15741, -27168, -37044, 45602, 70239, 69186, -4070, -52537, -50653, -77096, -53591, -96428, -24630, 18777, -52455, -150014, -130496, -80246, -32054, -55177, -10710, 58923, 66842, 2604, -22660, 33535, 108624, 121959, 92740, 141977, 72864, -28089, 3586, -7996, -10967, -5017, -74362, -79562, 24691, 52333, 28821]
14740B8821J09526N6004q2156j4932R570R942J3996k0004q7148n9640n074j2753
14728e3848Q3992m382l8935m3138k1665N6259Q1042l8090q6374n5387l1470Q7481
14716f4515J9573M1195J11290n4244j65502o230Q2718N0619L2088K6529m6116
14705B7405p9640J3778J5751o880N940L98k1463p030m787O1550J13003R5229k6105
14692A87149o5054K6949l791j13578m2667M2809k7285l9667L7132p0444l4116
14681a02563O8982N1659Q876m1161p6385K1887l5947N4612P0246L1153k1561j4152
14669A5646L2797n0101r3107J1393l3680K5342M127j9082q9398N8280J82891M9206
14657I4314J0953o2631k2647m6349M704K3764Q893J031j9810K7419J9752l8278
$$ y = [28821, 138347, 194351, 112195, 97263, 106833, 116775, 130771, 110767, 23619, -36021, -41095, -53848, 30144, 25762, -13173, -56311, -77976, -21717, 59325, 21235, -65139, -120526, -151996, -64515, -44942, -3747, 107543, 53299, -112203, -118433, -35715, 14904, 46992, 73521, 27405, -52235, -38457, -22706, -29586, -23646, -23248, -44711, -51741, -56528, 5022, 118025, 213254, 187149, 122095, 149044, 145253, 31675, -10992, 31817, 4532, -35135, 1997, -68447, -102563, -33581, 18078, 26954, -14207, -90592, -68705, -104652, -50040, 20206, 51359, 29798, 15646, 48443, -1658, -94765, -83372, -117052, -91710, -87583, -106665, -196063, -137783, 45108, 94314, 105267, 42636, 19989, -26360, -21656, 2108, 11001, 12032, -7778, 19641, 39393, 1115]
14645A115l0573K9250l0615o8849o2260J30962j1937p4762o0586j7788k852P2197
14633a26698J97279m0323n0495j2164L1822l940K0756m323n6591K6696P0459L7480
14621H9958K2041P2707j8641o0583j26258l3118J28716K0687k88l4030l1966j5492
14609A3733j9897r5280p7084O379m284J3106L1033P5660M9457k7687j9284j3655
14597f7803P1730N733n3310q2865n9196L4890P8221j5072j6610M4802J8394P1723
14585C0637m3883j15042O1001N0516j864K0939J7962R6728q554j08816P065j6314
14573i625m675j4962j724l396N2672N9652K7107j16268n1315L5750l6746k4669
14561h8199J8099K1235O4985P9214j1598l9422p753l4694o6030q2823k2544O9545
$$ y = [1115, -29458, -208, -30823, -99672, -161932, -30970, -42907, -117669, -178255, -196043, -198895, -126698, 70581, 30258, -20237, -32401, -579, -4519, 16237, 11914, -44677, -17981, 52478, 89958, 111999, 184706, 166065, 105482, -20776, -53894, 74822, 95509, 95221, 61191, 29225, 13733, -6164, -101444, -178528, -172149, -176433, -163327, -132294, -56634, -7177, -34864, -54148, -67803, 3927, 9660, -43650, -126515, -185711, -150821, -72600, -87672, -104282, -59480, -41086, 30637, -13246, -128288, -67287, -16771, -18635, 2304, 20266, 116994, 108440, -376, 6689, -9625, -14300, -29262, -30986, -34382, 18290, 77942, 105049, -11219, -62534, -26784, -63530, -88199, -70100, -48865, 16120, 95334, 83736, 44314, 36561, 1867, -64163, -146986, -169530, -99985]
14549i9985M8208Q521q480j6747N5055N6768j4893j10462l8592Q1825R3040R886
14537F4144p0613M1423N8962K5205N5037j08170n9052n0943k2257k3812K1386
14526f8690O6772L0438O7924l1291j5894n25l2379m6402L7191L1919l6030M6632
14514D9665O9212q744r9914M5313N2260L8264j00122o9284Q242Q8824M9602n1552
14502G1766n8180K5545j1687J9430P969l5061O6754N3110n8346K5076l4809j00744
14490b9177o0183L3337M7882o6515j579M1923L7998l1636r1388P2307l2360l182
14478h2573m5754r481P0859Q9158K1375l0765M4632l2860l7306O0610j2293n436
14466C0166k5865j7827j1702P1956o6689n4892J7828K603k0233k7860l5067j5426
$$ y = [-99985, -51777, -43256, -51736, -68483, -13428, 43340, 28447, -82015, -120607, -38782, 54258, 64144, -6469, 34954, 93916, 119121, 174158, 65988, 6936, -44007, -66264, -90076, -68690, -1918, 28520, 96444, 65153, 49259, 48734, 16355, -30047, 7144, 39063, 3033, 49665, 118877, 110133, 10219, 55532, 107792, 146056, 45934, -23350, -15108, 73716, 123318, 71766, 13586, 39131, 27444, 46874, 54843, 19782, 86536, 139646, 81300, 106376, 71567, -29177, -89360, -56023, -8141, -74656, -76235, -34312, 3686, -27950, -119338, -47031, -79391, -82573, -128327, -137808, -66949, 22209, 43584, 12819, 57451, 24591, -12715, 47895, 35602, 30166, 4301, -13526, -25228, 46728, -19961, -74853, -57025, -54422, -74655, -102515, -137582, -153008]
14454a53008N818M7057M3499P7724J576l1419p8143k080O4924J33492l9279r2685
14442b2524j45717J480R7721m8517K1849Q8242j5555j16642K5524O249J0791N4076
14430d3023M110O7573m7526p0698O892J2513O6820K2995r4770n9398J7220J5645
14418a01647o5640L9333j8223r6650r95J22942J34633j3058k7349Q5546Q478j46793
14406g9423o8397l0991L8573O2049j6774O990M767M2880L0937P8979P0153k7655
14394A12088o1677J0382k2659m9933k435J1470N412j624L814j6155J4658J4384
14382A7725k3934j3568K4911M0570K5708J0324k4279j04358M3487O8762P20q5194
14370a9126K202K8962M9310l0656N1437J3479m5025q9309M9179j273m0327p244
$$ y = [-153008, -147190, -100133, -56634, 21090, 22666, -8753, -86896, -88976, -24052, 109440, 70161, -22524, -168241, -166761, -69040, -117557, -95708, -7466, -23021, -139663, -114139, -107890, -97099, -43023, -38913, 28660, -18866, -89564, -82672, -70159, -3339, 19656, -75114, -134512, -117292, -101647, -167287, -127954, -146177, -242827, -243822, -120880, 13753, 695, -26654, 58892, 67370, -79423, -147820, -178811, -140238, -78189, -94963, -87973, -83206, -40326, -9389, 69590, 139743, 112088, 50411, 60793, 38134, -11799, -14234, -2764, 2648, 1024, 4838, -11317, 3341, 17725, -6209, -19777, 5134, 45704, 71412, 81736, 57457, -46901, -3414, 65348, 66068, -19126, -16924, 12038, 61348, 30692, 82129, 95608, 50583, -38726, 10453, 9180, -31147, -38391]
14358c8391N2292M2649L2050p5990o0990p5903L877O1825K7997j5176j0418R7468
14346D1290m0339k9733L1669K7981L7252N433N6643l7076P562n5579o1822L6484
14334A9765l2055n4706O3811N4241J2392k556p609k0825k6005M2588N6241m3070
14322F2212o262J5341K9328m9857m9948O4485o807L1497P0068K1919j36266j31263
14310h5553O7383N2565K9703M271q7846N490L9797j8184m0741N8368O4194N465
14298I4912l6663k2218r093K1047L5425j0184r530J2953M3591O385O85k5254j15391
14285a3335J8772M3486k2456K1065M193r4314J5370J00510j7053j08953j3017
14274f5732o141o8832J2175O6114o3983L4503P1568J14801n560l0825P609l9924
$$ y = [-38391, 13901, 56550, 88600, 12610, -48380, -124283, -120406, -58581, -30584, -45760, -56178, 41290, 951, -28782, 2887, 30868, 68120, 73553, 130196, 93120, 100682, 45103, -16719, 19765, -12290, -66996, -3185, 51056, 63448, 60892, 53283, 32458, 6453, 49041, 105282, 62212, 55950, 71291, 100619, 50762, 814, 65299, 58492, 89989, 160057, 181976, 45710, -85553, -18170, 34395, 64098, 68369, -19477, -13987, 25810, 7626, -33115, 25253, 89447, 94912, 58249, 36031, 26938, 47985, 83410, 73226, 63696, 76649, 120240, 126625, 127310, 102056, -13335, 5437, 48923, 26467, 47532, 51725, -42589, -27219, 73291, 56238, -52715, -65732, -71873, -140705, -128530, -62416, -126399, -91896, -20328, 94473, 88913, 58088, 65697, 25773]
14262B5773p4127Q5508k0908n0293N6879J3037o3897k0459R7236L5638n1668L2019
14250F4738J5181j02097k2077M2382M4081P2071J1782n2646k1094m0911K563K3267
14238C7240K0869l4303j06215q647R786O593O4063Q0464l4089n4279p1374j2970
14226a02862k2119J744O1987j4700p954J2787Q4009j6194m925J3606R471O8265
14214H3115L1125J6476k9245J3846m4136N345q1690m3904O104R922J08062k7776
14202D7244M4839R6496k8517r3545p3076q4720j48153j0855J28957R1271M4633
14191A4574m2722o2123k4410K3958j9909O3518o2572J2541m9785J3515m793L0496
14179a07712L6519O7552K7756J9190J2296l3595j8230m566J6167j5463J1401J1882
$$ y = [25773, -48354, 37154, 16246, -34047, 22832, 35869, -28028, -48487, 48749, 84387, 32719, 64738, 79919, -22178, -44255, -1873, 42208, 114279, 126061, 73415, 52321, 11410, 13973, 37240, 58109, 23806, -82409, -91056, -81270, -74677, -10614, 69850, 35761, -18518, -89892, -102862, -124981, -123237, -61250, -75950, -83904, -71117, 12892, -3302, -8227, 5379, 14850, 83115, 114240, 130716, 101471, 115317, 71181, 76526, -5164, -49068, -42964, -33042, 75020, 47244, 92083, 188579, 160062, 66517, -6559, -91279, -239432, -250287, -121330, -30059, 14574, -28148, -90271, -114681, -90723, -110632, -47114, -109686, -97145, -146930, -133415, -138208, -107712, -71193, -3641, 24115, 43305, 55601, 22006, 3776, -790, 15377, -86, 11315, 23197]
14167B3197L4961M1008m3703Q846p364k8251k5848J782L6197j8749O4290J1412
14155I7778Q595m8804j00412J704J21927R5757m8330q4932k238l5154N2132K0129
14143G8152j20562p4682l6803J13953M955l2152P997M8359Q8453K0101l9896j9883
14131C7992o8484j10956K1811N2359P5428P4591M6515L9868q89r9324o0029k5533
14119a6651k7622Q9155N7530o6169j09043J0940J01064n0342n0828O1169k510
14108c307n9252j4746K0856K9113K9925L0699J3783n1422J0500K0360m2919o3936
14096h0346o1377P7039R8195o704p9596o2207p843K3631J0317P3958K4964j02024
14084i1993N3236J28958L0310J6045j3345m9731p308K32J286P64o526J1346j980
$$ y = [23197, 58158, 99166, 55463, 64309, 56945, 28694, 2846, 4628, 40825, 22076, 86366, 97778, 106373, 57569, -42843, -41139, 80788, 176545, 128215, 43283, 41045, 5891, 58023, 78152, -42410, -117092, -153895, -39942, -34987, -67139, -59142, -10783, 77670, 97771, 57875, 37992, -30492, -141448, -119637, -67278, 8150, 82741, 129256, 169124, 168235, 68911, 8882, -16651, -44273, 44882, 102412, 36243, -72800, -61860, 39204, -11138, -61966, -797, -3307, -62559, -77305, -56449, -27336, 2589, 33288, 47071, -4351, 6149, 26509, -16410, -80346, -141723, -64684, 33511, 26807, -52789, -114996, -122839, -99208, -88891, -14933, 10031, -91993, -38757, 90201, 120511, 136556, 123211, 73480, 66172, 66404, 67690, 68454, 61928, 73274, 71294]
14071G1294l2913k5330o7795L5909M9172p8753p827l9035J3212Q2663O5628k3021
14059D3204n1598p1869k4183j670L6579L8843k7845J1271O2355k7949j7318K3074
14047g106j9514J2206m0677l5512M1277J3129R8233P8325j0544M180n3739n5194
14035B5064k6077L0768R6141q2355p6260j5573k09J0729r0015J663J03024L5727
14023A2627N2660J9785o7020j6492M6356j2107k5553k8895l1193l6071K4217N5612
14011f074O8909k0940j7498j7901j4657O4303K0674j8120L3004l2136k3996J0927
13999D6495O306n8169j9540M0688l6048K7048n2085P206j8727j7130O2984N2696
13987D1724K2045K053K899J7616K5708j3110o6259j34592o1244J1949L3527L7394
$$ y = [71294, 38381, 13051, -54744, -18835, 30337, -48416, -56243, -95278, -82066, 597, 66225, 43204, -8394, -80263, -104446, -106116, -69537, -30694, -58539, -47268, 15087, -12862, -30180, -7106, -26620, -14414, -55091, -90603, -49326, -36197, 62036, 140361, 129817, 133997, 80258, 25064, -1013, 29755, 125896, 43541, -32719, -48292, -48501, -37772, -127787, -126124, -23100, 12627, 65287, 85072, 18052, 1560, 47916, 35809, 10256, -18639, -49832, -85903, -61686, -6074, 62835, 41895, 24397, 6496, -8161, 56142, 76816, 58696, 91700, 59564, 35568, 46495, 52801, -5368, -24908, 15780, -20268, 6780, -45305, -38099, -56826, -73956, -10972, 41724, 63769, 65822, 68721, 86337, 112045, 98935, 32676, -101916, -163160, -151211, -117684, -80290]
13975h0290K2182O6998k1449P4090l2628k8098l3881J1308M3517J8062k1187k3461
13963d837o0584K4698o2468L7396R4283L1178L5311M9440P185q7727J1479k8794
13951D6560k116n5441l092P0472J5886q3130n4027n8053J8095M0786L650m8816
13939a09226K4946O9725Q8991K8459k0790P1670P7710k6637m3442o8383j0478
13928H2545o38l0620O6463m4038k6120k7004j7780p593L7533J5033P05K5247l1835
13915D1898n8662l9593R6174K8386j9386J2339k2073k3477K0619J0918k1552k9005
13903c414j3325K373n688M1061o498o4982p0053J19P5769Q730O4336O1049L2216
13890A21693n2149l6656r5371l2416R7921k1742j7382P6668M5596k0038K5698
$$ y = [-80290, -58108, 8890, -12559, 61531, 28903, 805, -33076, -21768, 21749, 39811, 18624, -4837, -65421, -40723, -103191, -65795, 28488, 59666, 94977, 144417, 151602, 63875, 75354, 46560, 44444, -10997, -14089, 56383, 72269, -10861, -64888, -122941, -104846, -64060, -60410, -109226, -84280, -14555, 74436, 102895, 82105, 153775, 231485, 204848, 161406, 93023, 82545, 81907, 51287, 117750, 73712, 47592, 20588, 2808, -4785, 32748, 47781, 48486, 73733, 41898, -16764, -56357, 39817, 68203, 48817, 61156, 39083, 15606, 36225, 47143, 25591, -3414, -16739, -14366, -20054, 21007, 14509, -50473, -120526, -120407, -44638, -35908, 28428, 89477, 121693, 69544, 32888, -62483, -94899, 3022, -18720, -36102, 40566, 86162, 66124, 91822]
13879I1822j6066J702K3469m3416m5685m1297q085j5964j18733O4492R7517L4895
13867B4651L2258K5761n9410l1758J1151j7523L0711Q1093n2151J979R2956r058
13855A30660j7642o0183l0892K4243O5244J6747k7830q2094L9251j963p4111j483
13843b0053M2837n805J0597m2999l9546P2649K8815j16923Q8004Q7714p2945r021
13831B3324l3709m1666L1705L3778n7040r5185M2378O7617n64P1516m1107L870
13819D917M1436n1433M0114R606K2045o9933O9318J9697Q721p3426L0186P7439
13807A28687M9634j9795r9729p3556n7920L8016j2188k2379L9511j6136M5556
13796b99Q6570o2002k2121N2492N5945l0528Q235o011p2740q1278Q6276J2380
$$ y = [91822, 75756, 77458, 100927, 57511, 11826, -29471, -37556, -53520, -172253, -107761, -10244, 24651, 56909, 82670, 23260, -8498, 2653, -14870, 15841, 96934, 44783, 46762, 139718, 130660, 113018, 52835, 21943, 46186, 111430, 128177, 100347, 18253, 57504, 55541, -18570, -20053, 22784, 16979, 27576, -15423, -54969, 17680, 46495, -70428, 17576, 105290, 32345, 23324, -10385, -52051, -20346, 13432, -43608, -138793, -96415, -28798, -29362, 42154, 1047, 4917, 46353, -5080, 35034, 44640, 66685, -3248, 66070, 85767, 94488, 21062, 51248, 128687, 178321, 158526, 58797, -14759, -72679, -34663, -46851, -69230, -29719, -45855, -299, 86271, 24269, 2148, 54640, 110585, 80057, 88292, 82281, 9541, -71737, 14539, 26919]
13784B6919J6344k6855n6653m6943N0204J22305N4880r2243n2465O0787L0867
13773H7147q2458j9328R9966J7418m3789o072l6076k4851P9646L3744j4676Q225
13761I8896J1476K9337j2007n9099q31l380j8106Q592K3488l2020q8914l3390
13749g5958K9127L7961J9263L3873P2585p2618n8430L5085N1589J2213n0179P6134
13737A10645P1363n5444p6190j3442K3810n1760o1837N1467p5640M1326Q8529
$$ y = [26919, 43263, 16408, -40245, -87188, -36984, 85321, 140201, 47958, -4507, 56280, 87147, 4689, -14639, 85327, 102745, 58956, 52884, 16808, -8043, 71603, 105347, 90671, 98896, 110372, 139709, 127702, 68603, 67772, 64392, 46286, 54878, 78366, 46346, -42568, -75958, -46831, -8870, 10393, 44266, 116851, 44233, -14197, 20888, 72477, 84690, 34511, 110645, 182008, 126564, 50374, 36932, 60742, 8982, -52855, -1388, -77028, -35702, 52827]
$$ [...]
##END NTUPLES=NMR SPECTRUM
##END=
