##TITLE=Analysis number 326127
Compound Code cc 05713
Book Reference 518/57
Project Code adrs
Chemist Name colinb
##JCAMPDX= 6.0         $$ Bruker NMR JCAMP-DX V2.0
##DATA TYPE= NMR SPECTRUM
##DATA CLASS= NTUPLES
##ORIGIN= Bruker BioSpin GmbH
##OWNER= nmr
$$ XWIN-NMR		Version 3.5
$$ Thu Jan 25 08:59:24 2007 GMT Standard Time (UT+0h)  MAYBRIDGE\nmr@NMR_250MHZ
##.OBSERVE FREQUENCY= 250.131544655141
##.OBSERVE NUCLEUS= ^1H
##.ACQUISITION MODE= SIMULTANEOUS (DQD)
##.ACQUISITION SCHEME= undefined
##.AVERAGES= 16
##.DIGITISER RES= 18
##SPECTROMETER/DATA SYSTEM= dpx250
##.PULSE SEQUENCE= zg30
##.SOLVENT NAME= CDCl3
##.SHIFT REFERENCE= (INTERNAL, CDCl3, 0, 16.4905)
##AUDIT TRAIL= $$ (NUMBER, WHEN, WHO, WHERE, WHAT)
$$ ##TITLE= Audit trail, XWIN-NMR		Version 3.5
$$ ##JCAMPDX= 5.01
$$ ##ORIGIN= Bruker BioSpin GmbH
$$ ##OWNER= nmr
$$ C:\u/data/dgb/nmr/ADRS/1820/pdata/1/auditp.txt
$$ ##AUDIT TRAIL=  $$ (NUMBER, WHEN, WHO, WHERE, WHAT)
(   1,<2007-01-25 08:59:03.52 +000>,<MAYBRIDGE\nmr>,<NMR_250MHZ>,
      <created by zg, POWCHK disabled, PULCHK disabled
       configuration hash MD5:
       49 4B E0 1D 92 C2 6B 37 9F E6 65 BC 52 41 86 1D
       data hash MD5: 64K
       63 79 16 78 98 2C 74 28 B2 80 FC 22 41 CC A3 20>)
(   2,<2007-01-25 08:59:15.77 +000>,<MAYBRIDGE\nmr>,<NMR_250MHZ>,
      <Start of raw data processing
       ef LB = 0.3 FT_mod = 6 PKNL = 1 SI = 32K 
       data hash MD5: 32K
       9F 14 50 27 12 8A 09 D6 12 57 BA B6 DD 1D 59 1E>)
(   3,<2007-01-25 08:59:17.52 +000>,<MAYBRIDGE\nmr>,<NMR_250MHZ>,
      <apk 
       data hash MD5: 32K
       BA F5 55 FB 67 18 D5 FA 8A 5A C7 7B 98 26 58 C4>)
(   4,<2007-01-25 08:59:18.19 +000>,<MAYBRIDGE\nmr>,<NMR_250MHZ>,
      <abs ABSG = 5 
       data hash MD5: 32K
       5D 2A 3B 68 8E 57 6C A4 8D 4E 30 5C 2A 46 09 04>)
$$ ##END=
$$ 
$$ hash MD5
$$ AE 88 CB 56 15 22 61 4D 94 72 91 AE 19 B2 11 DD
##$RELAX= 
##$RELAX= 
##$RELAX= 
##$RELAX= 
##$RELAX= 
##$RELAX= 
##$RELAX= 
$$ Bruker specific parameters
$$ --------------------------
##$DU= <C:\u>
##$EXPNO= 1820
##$NAME= <ADRS>
##$PROCNO= 1
##$TYPE= <nmr>
##$USER= <dgb>
##$AMP= (0..31)
100 100 100 100 100 100 100 100 100 100 100 100 100 100 100 100 100 100 
100 100 100 100 100 100 100 100 100 100 100 100 100 100 
##$AQSEQ= 0
##$AQ_mod= 3
##$AUNM= <au_zg>
##$AUTOPOS= <4 >
##$BF1= 250.13
##$BF2= 250.13
##$BF3= 250.13
##$BF4= 250.13
##$BF5= 500.13
##$BF6= 500.13
##$BF7= 500.13
##$BF8= 500.13
##$BYTORDA= 1
##$CFDGTYP= 0
##$CFRGTYP= 5
##$CHEMSTR= <none>
##$CNST= (0..31)
1 1 145 1 1 1 1 1 1 1 1 1 1 1 1 1 1 1 1 1 1 1 1 1 1 1 1 1 1 1 1 1 
##$CPDPRG= <>
##$CPDPRG1= <>
##$CPDPRG2= <>
##$CPDPRG3= <>
##$CPDPRG4= <mlev>
##$CPDPRG5= <mlev>
##$CPDPRG6= <mlev>
##$CPDPRG7= <mlev>
##$CPDPRG8= <mlev>
##$CPDPRGB= <>
##$CPDPRGT= <>
##$D= (0..31)
0 1 0 0 0 0 0 0 0 0.06 0 0 0 0 0 0 0.0002 0 0 0 0 0 0 0 0 0 0 0 0 0 0 
0 
##$DATE= 1169715542
##$DBL= (0..7)
120 120 120 120 120 120 120 120 
##$DBP= (0..7)
150 150 150 150 150 150 150 150 
##$DBP07= 0
##$DBPNAM0= <>
##$DBPNAM1= <>
$$ [...]
##$SUBNAM7= <"">
##$SUBNAM8= <"">
##$SUBNAM9= <"">
##$SW= 20.6930455092707
##$SWIBOX= (0..15)
0 0 3 0 0 0 0 0 0 0 0 0 0 0 0 0 
##$SW_h= 5175.983436853
##$TD= 65536
##$TD0= 1
##$TE= 293.16
##$TE2= 300
##$TE3= 300
##$TEG= 300
##$TL= (0..7)
0 120 120 120 120 120 120 120 
##$TP= (0..7)
150 150 150 150 150 150 150 150 
##$TP07= 0
##$TPNAME0= <>
##$TPNAME1= <>
##$TPNAME2= <>
##$TPNAME3= <>
##$TPNAME4= <>
##$TPNAME5= <>
##$TPNAME6= <>
##$TPNAME7= <>
##$TPOAL= (0..7)
0.5 0.5 0.5 0.5 0.5 0.5 0.5 0.5 
##$TPOFFS= (0..7)
0 0 0 0 0 0 0 0 
##$TUNHIN= 0
##$TUNHOUT= 0
##$TUNXOUT= 0
##$USERA1= <user>
##$USERA2= <user>
##$USERA3= <user>
##$USERA4= <user>
##$USERA5= <user>
##$V9= 5
##$VALIST= <valist>
##$VCLIST= <CCCCCCCCCCCCCCC>
##$VD= 0
##$VDLIST= <DDDDDDDDDDDDDDD>
##$VPLIST= <PPPPPPPPPPPPPPP>
##$VTLIST= <TTTTTTTTTTTTTTT>
##$WBST= 1024
##$WBSW= 4
##$XGAIN= (0..3)
0 0 0 0 
##$XL= 0
##$YL= 0
##$YMAX_a= 669073
##$YMIN_a= -640471
##$ZGOPTNS= <>
##$ZL1= 120
##$ZL2= 120
##$ZL3= 120
##$ZL4= 120
##$ABSF1= 16.49051
##$ABSF2= -4.202662
##$ABSG= 5
##$ABSL= 3
##$ALPHA= 0
##$AQORDER= 0
##$ASSFAC= 0
##$ASSFACI= 0
##$ASSFACX= 0
##$ASSWID= 0
##$AUNMP= <proc_1d>
##$AZFE= 0.1
##$AZFW= 0.1
##$BCFW= 0
##$BC_mod= 0
##$BYTORDP= 0
##$COROFFS= 0
##$CY= 12.5
##$DATMOD= 1
##$DC= 0
##$DFILT= <>
##$DTYPP= 0
##$F1P= 14.0000005364418
##$F2P= -0.99999901652339
##$FCOR= 0.5
##$FTSIZE= 32768
##$FT_mod= 6
##$GAMMA= 0
##$GB= 0
##$INTBC= 1
##$INTSCL= 1
##$ISEN= 128
##$LB= 0.3
##$LEV0= 0
##$LPBIN= 0
##$MAXI= 10000
##$MC2= 0
##$MEAN= 0
##$ME_mod= 0
##$MI= 0
##$NCOEF= 0
##$NC_proc= -1
##$NLEV= 6
##$NOISF1= 0
##$NOISF2= 0
##$NSP= 0
##$NTH_PI= 0
##$NZP= 0
##$OFFSET= 16.49051
##$PC= 1
##$PHC0= 231.1186
##$PHC1= 5.427892
##$PH_mod= 1
##$PKNL= yes
##$PPARMOD= 0
##$PSCAL= 4
##$PSIGN= 0
##$REVERSE= no
##$SF= 250.130007874826
##$SI= 32768
##$SIGF1= 0
##$SIGF2= 0
##$SINO= 400
##$SIOLD= 32768
##$SREGLST= <1H.CDCl3>
##$SSB= 0
##$STSI= 32768
##$STSR= 0
##$SW_p= 5175.98343685301
##$SYMM= 0
##$S_DEV= 0
##$TDeff= 65536
##$TDoff= 0
##$TI= <Analysis number 999999
Compound Code 99
Book Reference 9
Project Code 9>
##$TILT= no
##$TM1= 0
##$TM2= 0
##$TOPLEV= 0
##$USERP1= <user>
##$USERP2= <user>
##$USERP3= <user>
##$USERP4= <user>
##$USERP5= <user>
##$WDW= 1
##$XDIM= 32768
##$YMAX_p= 317107454
##$YMIN_p= -37961
$$ End of Bruker specific parameters
$$ ---------------------------------
##NTUPLES= NMR SPECTRUM
##VAR_NAME=  FREQUENCY,     SPECTRUM/REAL,   SPECTRUM/IMAG
##SYMBOL=    X,             R,               I
##VAR_TYPE=  INDEPENDENT,   DEPENDENT,       DEPENDENT
##VAR_FORM=  AFFN,          ASDF,            ASDF
##VAR_DIM=   32768,         32768,           32768
##UNITS=     HZ,            ARBITRARY UNITS, ARBITRARY UNITS
##FACTOR=    0.157963299565203, 1,           1
##FIRST=     4124.77163142012, 0,            0
##LAST=      -1051.21180543289, 0,           0
##MIN=       -1051.21180543289, -37961,      0
##MAX=       4124.77163142012, 317107454,    0
$$ Real data points
##PAGE= N=1
##DATA TABLE= (X++(R..R)), XYDATA
$$ [...]
17842C315k541k84J849L483K025k565m169M37J170M55m18j637r84j289j61o22
17826a936L720L519j792k87j902k19j968k585J175J139J617N28j611J790J506
17811B694O8j470j720M633L964R0j002L216k483n564q76k951q30J629K44J788
17795A430P50k965j669L236N16k524k499j552K223O97j01l75P89M58rj385Q19
17778b161j059M2k64J767j416r15J725Q58J825J399l551j966n88j619j093j007
17762h023j66l480o00L618K566J393K009K82k992K984O840K529j90k420j18L149
17746G381j16L99K63o73l54R15J390k202J207J258L023M309l703n358l284o57
17730C798m88j12K929K609l124o033L30Q82k679K416J722K275k621L794Q392M66
$$ plain form
17842 3315 774 490 2339 5822 7847 5282 1113 1550 2720 3175 2757 1120 136 -1153 -1314 -1936
17826 -1936 1784 5303 3511 3224 1322 1103 -865 -3450 -2275 -1136 481 1009 -602 1188 2694
17811 2694 2762 1292 -428 4205 8169 8259 7257 10473 7990 2426 1550 -1401 -2231 -602 -358 1430
17795 1430 2180 -785 -2454 782 1298 -1226 -3725 -5277 -3054 -2357 -2458 -2833 -2044 -1586 -1595 -2980 -2161
17778 -2161 -3220 -3178 -3442 -1675 -3091 -4006 -2281 -1423 402 1801 -1750 -3716 -4304 -5923 -7016 -8023
17762 -8023 -8189 -11669 -12269 -8651 -6085 -4692 -2683 -2401 -5393 -2409 4431 6960 6770 4350 4232 7381
17746 7381 7265 7664 7927 7254 6900 7815 9205 7003 8210 9468 12491 16800 13097 7739 4455 3798
17730 3798 3310 3198 6127 8736 5612 -421 -91 791 -1888 528 2250 4525 1904 5698 14090 14556
17714A4556j067k613M31j69M156O808O019O265O03L512L333l083l841N830M504
17699D5244m707n915k299m094l397l633l416m979n243l853j202l615m893k882
17685h884L55P012J180j874j224O49J770O17K86k140M050L483M47m231P19J100
17669C315j169m101j742J900L180N62j291J967K296r64J245q57Q7j339p73L612
17653E928M351M212L455N458J3114R891l419o237K392J3210K1081J8751m157k5050
17639F2980j0243N715O649O720j657j5256q934k082n14L095m762j0852p288m92
17625B3079L464J354k003n969n073m341j19J857k20j362j667m415L229J643j674
17610G783N63J201m101l678j125k429J836N266k349J058K136p7K869O184J370
$$ plain form
17714 14556 13489 10876 11307 11138 15294 22102 28121 34386 34989 38501 41834 38751 34910 40740 45244
17699 45244 40537 34622 32323 28229 24832 21199 17783 12804 7561 3708 2506 -1109 -6002 -8884
17685 -8884 -8529 -1517 -337 -2211 -3435 -2786 -1016 -399 -113 -2253 1797 5280 5727 1496 2215 3315
17669 3315 2146 -1955 -3697 -1797 1383 1945 654 2621 4917 3953 5198 4341 4428 3089 2316 5928
17653 5928 10279 14491 17946 23404 36518 46409 42990 36753 39145 52355 73436 92187 88030 62980
17639 62980 52737 58452 65101 71821 70164 54908 45974 43892 43378 46473 41711 30859 23571 23079
17625 23079 26543 27897 25894 19925 14852 10511 10392 12249 12029 10667 9000 4585 7814 9457 7783
17610 7783 8346 9547 5446 1768 643 -1786 50 5316 2967 4025 6161 6084 8953 15137 16507
17595A6507J800j290k144r49K343M468M077J645J218K102J436M048N240M435L489
17580D8425M227M265N00M30L650l916l253l293l567k786K911j989l568l297p878
17565C0861m485l65J554j695m383j069k494J985J388n60j608j47J843J431J201
17550B3457K562m229k053K500j779O95J166j03J080q82r83L97J969j520J714N001
17534B8992K615J877l91l287K347M264N627L249K751L910q6N489P209K843m108
17519F3301N724J0426P344J915m80o718l615J23k67J905J480J850P40J030L42
17504H5100N2K658L280L714P740O246L272M519P964R711J0378J0602J1121J1145
17490A77502Q810O480J1591J4202J7099K2885K2245J5849K2124L4011L7395M9408
$$ plain form
17595 16507 18307 17017 14873 13924 16267 20735 24812 26457 27675 29777 31213 35261 40501 44936 48425
17580 48425 52652 56917 57417 57847 61497 57581 54328 51035 47468 44682 47593 45604 42036 38739 30861
17565 30861 26376 26011 27565 25870 21487 20418 17924 19909 21297 20737 19129 18982 20825 22256 23457
17550 23457 26019 21790 19737 22237 20458 21153 22319 22216 23296 22414 21431 21828 23797 22277 23991 28992
17534 28992 31607 33484 33093 29806 32153 36417 42044 45293 48044 51954 51868 57357 64566 67409 63301
17519 63301 69025 79451 86795 88710 88230 81512 77897 78020 77753 79658 81138 82988 83728 84758 85100
17504 85100 85152 87810 91090 94804 102544 108790 112062 116581 124545 134256 144634 155236 166357 177502
17490 177502 186312 192792 204383 218585 235684 258569 280814 296663 318787 352798 390193 439601
17478D39601O5807P4550Q4064P9694N6277O3424J22748J82179J94483J35027L6844
17467A534698O0084J88684L14617L79501L46180M09666O80768J144269J829965
17458F888432K966208M832405P117826Q495748N286997k069848k174099L977761
17450C5321430J0168152J3071343N360265j2707971j4237518n785475N06838K901400
17442C4598464q08779q447698r118036n585690l037563j763753j160195q38418
17434C838332o36358m51729l05165k17934j52506j38164j87672j42594j17120
17425A489090j53580j24356r8586j13080r5462r1823j08724q5226o0327m4642
17415E13284l8362l5164l2736k5287j6714j2489j2519k0203j6077j6259j1706
$$ plain form
17478 439601 505408 579958 664022 743716 799993 863417 986165 1168344 1362827 1497854 1534698
17467 1534698 1594782 1783466 2098083 2477584 2823764 3233430 3914198 5058467 6888432
17458 6888432 9854640 14687045 21804871 30300619 35587616 33517768 31343669 35321430
17450 35321430 45489582 58560925 63921190 51213219 36975701 31190226 31697064 34598464
17442 34598464 33789685 25341987 16223951 10638261 7600698 5836945 4676750 3838332
17434 3838332 3201974 2750245 2445080 2227146 2074640 1936476 1748804 1606210 1489090
17425 1489090 1335510 1211154 1112568 999488 904026 812203 703479 618253 557926 513284
17415 513284 474922 439758 407022 381735 365021 352532 340013 319810 303733 287474 275768
17404B75768p262r144j0020j2086j2077q634p825r447j0543m257j929q700j1571
17391A62273j0068p867l265m626n112n327o672p506o051q152n079l623k150O40
17377H7415l770n592j908j389k31J872L818J646J560K060j958k843l05K936L29
17362H3640r58J580k110o047l014k085k379j845k193k998p42m039k763j934q75
17347E1238l18j052L437J424k721o036k218J652m6J576j589l797J599P66m79j150
17331D2286K491o01k237J924J294K906P52m279l899K162J669j325j016k52l640
17316C8235k822j113J461l43m215j769J749L005K018l936l680L400N694K737o218
17301C4203o274P16K975K307L861n105l288k565P23N906P991k393l765l267n792
$$ plain form
17404 275768 268506 259362 249342 237256 225179 216545 208720 199273 188730 184473 182544 173844 162273
17391 162273 152205 144338 141073 136447 131335 126008 119336 111830 105779 97627 92548 88925 86775 87415
17377 87415 83645 78053 76145 74756 74525 76397 80215 81861 83421 85481 83523 80680 80375 83311 83640
17362 83640 82682 84262 82152 76105 73091 71006 68627 66782 64589 61591 60849 56810 54047 52113 51238
17347 51238 50920 49868 53305 54729 52008 45972 43754 45406 45360 46936 45347 41550 43149 43915 43436 42286
17331 42286 44777 44176 41939 43863 45157 48063 48815 44536 40637 42799 44468 43143 42127 41875 38235
17316 38235 35413 34300 35761 35418 31203 29434 31183 34188 36206 32270 28590 31990 37684 40421 34203
17301 34203 27929 28645 31620 33927 37788 32683 29395 26830 27553 33459 41450 39057 35292 32025 26233
17286B6233j505j361K449Q37O69J61l256K36l76j734K312J86j735l573P60j03
17270B0200j081k524j184k936k441K06M758J896K187L003J000j281J710L683N876
17255C3072j212o425l499L106O435L95k839k844j12l345o884q43O519K332k217
17240B1639J758j115j61j430J57J002m13L98J702J097n852p40O42K092p87q81
17224A9108j880n49k178r64K626J888N24K667J552j786n269j683J241M429Q6r24
17208A8888L55n295n65M156J733n7j132k022o322q81M625N781Q22p602l341J448
17192A0591L619P82p84k906j947J717J349M382J355P04q96L44P76k389m386k657
17176I654L028j399j946k448j24L62O13Q3n168j094J43o55L552J27L83J871k511
$$ plain form
17286 26233 24728 23367 25816 26653 27322 27483 24227 24463 24087 22353 24665 24851 23116 19543 20303 20200
17270 20200 19119 16595 15411 12475 10034 10240 14998 16894 19081 22084 23084 21803 23513 27196 33072
17255 33072 31860 25435 21936 25042 31477 31872 29033 26189 26077 22732 15848 15005 21524 23856 21639
17240 21639 23397 22282 22121 20691 20848 21850 21437 21835 23537 24634 18782 18042 18684 20776 19989 19108
17224 19108 17228 16679 14501 13537 16163 18051 18575 21242 22794 21008 15739 14056 15297 19726 19812 18888
17208 18888 19243 13948 13383 17539 19272 19215 18083 16061 9739 8858 13483 19264 20086 12484 9143 10591
17192 10591 14210 14992 14208 11302 9355 11072 12421 16803 18158 18862 17966 18310 19086 16697 12311 9654
17176 9654 12682 11283 9337 6889 6765 7127 7740 7823 2655 1561 1704 1049 4601 4728 5111 6982 4471
17159D471l343R14L74K598j066J35m16M43K861M3j745j508K351K511K117K115
17143A2855K857k846L66m8k600M742k18j164j715k590J817K573L44k735k129O87
17127A0196L16K972n21Q28k767k285M04K767J01o1k613j129j933K948R46k79n52
17110I338J223J027M75N90J095p43k094J036l1k001k1k984J15M36l336r5L307
17093G337l85N08J681J886m552m772j821l274N26M293K957J773l69K42J292p30
17077F592j468j9n30L472J05j921J498R55P8k335K665J165j331J518M36o514L174
17060G540L086k735k366r50j280J109L321k068K232J119L56l697K470O87j977
17045F847l228j916J934l1J326R16k563k723k273J105K087N341j393j25L191J65
$$ plain form
17159 4471 1128 2042 2416 5014 3948 4083 3667 4110 6971 7014 5269 3761 6112 8623 10740 12855
17143 12855 15712 12866 13232 13184 10584 15326 15108 13944 12229 9639 11456 14029 14373 11638 9509 10196
17127 10196 10512 13484 12963 13791 11024 8739 9143 11910 12011 11950 9337 8208 6275 9223 10169 9890 9338
17110 9338 10561 11588 12063 12653 13748 13005 10911 11947 11916 9915 9894 6910 7025 7461 4125 4030 7337
17093 7337 6952 7460 9141 11027 6475 1703 -118 -3392 -2866 1427 4384 6157 5788 6030 7322 6592
17077 6592 5124 5105 4575 8047 8152 6231 7729 8684 8762 6427 9092 10257 8926 10444 10880 4366 7540
17060 7540 10626 7891 5525 4575 3295 4404 7725 5657 7889 9008 9364 5667 8137 8824 6847
17045 6847 3619 1703 3637 3606 4932 5848 3285 562 -1711 -606 1481 6822 5429 5304 8495 8660
17029H660j571p08k52k018n12J529Q34o40r38L176M023j966j645l247Q85k296
17013C314k564m24K461J872K55K464P56M007j124n307j642j33j727j113k107J957
16997I45M37l044j680N198M238R22n45P08K731P87M12n244m376p29o27j53L115
16980C095R41q58K65J574o79j937J496k029Q90k290J42Q40m6j123J244L568L547
16963H640k783m023l395m40k637K42K731J834j428K305K112J484l050k18j720
16948c46J538m409k111L442K342K250k272q67j738l63O27j572n55j002N53J978
16932b505O5K227O066J060k143l384k47R92K010n23J99q55J75m595j897J148K452
16915B45K824j669j477J144Q99n60k159N2N058R82j291J806r38l186J027N04j178
$$ plain form
17029 8660 7089 6381 6129 4111 3599 5128 5962 5322 4384 7560 11583 9617 7972 4725 5610 3314
17013 3314 750 326 2787 4659 4914 7378 8134 12141 11017 5710 4068 3935 2208 1095 -1012 945
16997 945 1382 -1662 -3342 1856 6094 7016 6471 7179 9910 10697 11109 5865 1489 760 133 -20 3095
16980 3095 4036 3178 3443 5017 4338 2401 3897 1868 2758 468 610 1450 1404 281 1525 5093 8640
16963 8640 5857 1834 -1561 -2001 -4638 -4396 -1665 169 -1259 1046 3158 4642 1592 1374 -346
16948 -346 1192 -3217 -5328 -1886 456 2706 434 -433 -2171 -2534 -1907 -3479 -4034 -5036 -4483 -2505
16932 -2505 -2440 -213 5853 6913 4770 1386 1139 2131 4141 3618 3817 2962 3137 -1458 -3355 -2207 245
16915 245 3069 1400 -77 1067 1966 1406 -753 -701 4357 5339 4048 5854 4916 1730 2757 3261 2083
16898B083J608P1l898P64j165K98L829L38R68J525r78n186o13L947j419l85K430
16881D217J88K463J959q59R54r23j50M9L279O52P04N97o05J269N13N27L708J0614
16863B9156J1993J7102K8779M0141M3538J9991j3154k579L1637N5581O3817N275
16851C31277p3159o1897k0228M253R874j4867m6689m1897k7053j4679r201n187
16839C0547m095m880m351l339l175p20k632j127O37q02n2j696Q56p06j258P36
16823C943n92p95l8M44Q84K52k095o672N575K800k4M99l332k366J109K061J305
16806B958j418o93o54k852p9K305J313n959Q22K98p60j437K247Q004L679k451
16790E323k489k532j395j1J364j427j831l25m58M313j644p52P99J690P01J062
$$ plain form
16898 2083 3691 3762 -136 628 -537 -239 3590 3928 4896 6421 5443 257 -356 3591 2172 1787 4217
16881 4217 4405 6868 8827 7968 8922 7999 7849 7898 11177 11829 12533 13130 12525 13794 14307 14834 18542 29156
16863 29156 41149 58251 87030 127171 170709 190700 177546 174967 206604 262185 326002 331277
16851 331277 258118 196221 175993 180246 190120 175253 128564 86667 59614 44935 35734 30547
16839 30547 26452 21572 17221 13882 10707 9987 7355 6228 6865 6063 6011 4315 5171 4465 3207 3943
16823 3943 3351 2556 2518 2962 3846 4098 2003 -4669 906 3706 3682 4181 849 -1517 -408 1653 2958
16806 2958 1540 847 193 -2659 -2738 -433 880 -5079 -4257 -3959 -4719 -6156 -3909 4095 7774 5323
16790 5323 2834 302 -1093 -1104 260 -1167 -2998 -3323 -3781 532 -1112 -1864 -1065 625 1326 2388
16774B388p32n35J124j496M092K044j078p62j473K54J262k488j948j86J342L227
16758E035k19k324l449J10j078L025L606m05k786n52j261k600K039j712m836p78
16742h185O73K411L204J338k452r47P56J503K816r12j821j187P72J428k141J440
16726a304O03n46P94j2m50J269j835N35J758o97l494N36K864j136k1j941K584
16709d93P84l41k233j859l02K820L153r97o011J233K94P69j745Q08J389Q04j901
16692c828j253j091L160m72P76J045j715r78j282j531N241J879k759M001j844
16677f51R22R2j068k579m696k303J571Q64M193m14m107j158L080N339k28n02n50
16660b195j656k475O0m77K595M929J78k939n77k605Q80N644j804k638P2L148k329
$$ plain form
16774 2388 1656 1121 2245 749 4841 6885 5807 5045 3572 3826 5088 2600 652 466 1808 5035
16758 5035 4816 2492 -957 -847 -1925 1100 4706 4301 1515 963 -298 -2898 -859 -2571 -7407 -8185
16742 -8185 -7512 -5101 -1897 -559 -3011 -3958 -3202 -1699 1117 205 -1616 -2803 -2031 -603 -2744 -1304
16726 -1304 -701 -1247 -453 -465 -915 354 -1481 -946 812 115 -3379 -2843 21 -1115 -1136 -3077 -493
16709 -493 291 -50 -2283 -4142 -4444 -1624 1529 532 -5479 -4246 -3952 -3183 -4928 -4120 -2731 -1927 -3828
16692 -3828 -5081 -6172 -3012 -3484 -2708 -1663 -3378 -4356 -5638 -7169 -1928 -49 -2808 1193 -651
16677 -651 271 363 -705 -3284 -7980 -10283 -8712 -7848 -3655 -4069 -8176 -9334 -6254 -915 -1143 -1645 -2195
16660 -2195 -3851 -6326 -6266 -6743 -4148 781 959 -1980 -2557 -5162 -4282 1362 -442 -3080 -3008 140 -2189
16643b189J659Q32k282l158J72R47J223L414K922j293J737o82J060m194L75k61
16627B82J062J280j263j220R72l65K316Q19o47j193J368k72k619K6L171j850l280
16610a413L17J761k270k3J794O68m04j64J918J094o34l355n07J733l79J62L601
16593C899R26k444l167r95o51K027J081J01j646k2K722R79j321j961j449K682
16577G61J444p50k876r56K965L340k009l271n08r73K76M470J713k53R99K219l088
16560C503k480o353j383J721O15j736O9K188K129o39J692J359r4k859l11p84J202
16543b161N74P19j78j332j758R89R67M8L26k24o52j22j192k088K433o03k66N739
16525A219M086k309k897j118j088J877J034l77l11J880l51q8l721J263J850J572
$$ plain form
16643 -2189 -530 302 -1980 -5138 -4966 -4019 -2796 618 3540 2247 3984 3302 4362 168 543 282
16627 282 1344 2624 1361 141 1113 748 3064 3883 3236 2043 3411 3139 520 546 3717 1867 -1413
16610 -1413 -1096 665 -1605 -1628 166 834 430 266 2184 3278 2644 -711 -1218 515 136 298 3899
16593 3899 4825 2381 -786 -1781 -2432 -405 676 777 -869 -891 1831 2810 1489 -472 -1921 761
16577 761 2205 1455 -1421 -2377 588 3928 1919 -1352 -1860 -2833 -2557 1913 3626 3373 4372 6591 3503
16560 3503 1023 -5330 -6713 -4992 -4377 -6113 -6044 -3856 -1727 -2366 -674 685 591 -2268 -2579 -3363 -2161
16543 -2161 -1587 -868 -1046 -2378 -4136 -3147 -2180 -2132 -1806 -2030 -2682 -2804 -3996 -6084 -3651 -4254 -4520 1219
16525 1219 5305 2996 99 -1019 -2107 -230 804 427 116 1996 1645 1557 -2164 -901 949 2521
16509B521O58j328j598Q55J340J18N50K429o87n162m99k004m8q1O33K331o00N63
16491iJ097k74j102P20J439J047P55l50k010J733j560J218r64R26j270j484l733
16474c821k594J591q83j151Q73K316j830j738K582L391k358l477Q51M03J528K80
16458d037K186M20L46J042J238k303k453J492L033J218j478m377j467K88K155
16443b697J82J260j8r18m11K276J357m98n256q98K589L6L050k585k921M54J432
16426c566J84O52r76j640k3J644J513L198K506L5l82k335L20p43L169K331m462
16409A425j396K212j940K222J000j737m023j871k9J851k065q46l526K105K292
16394d326K473J030l991j443N38k929J2J038K805P04q16l14O79N61J339K255K389
$$ plain form
16509 2521 3179 1851 253 1108 2448 2566 3116 5545 4858 -304 -803 -2807 -2855 -2936 -2303 28 -572 -9
16491 -9 1088 814 -288 432 1871 2918 3673 3323 1313 3046 1486 2704 1740 2666 1396 -88 -3821
16474 -3821 -6415 -4824 -5707 -6858 -5985 -3669 -5499 -7237 -4655 -1264 -3622 -7099 -6248 -5845 -4317 -4037
16458 -4037 -1851 -1431 -1085 -43 1195 -1108 -3561 -2069 964 2182 704 -3673 -5140 -4852 -2697
16443 -2697 -2515 -1255 -1273 -2191 -2602 -326 1031 533 -4723 -5621 -3032 -2996 54 -2531 -5452 -4998 -3566
16426 -3566 -3382 -2730 -3706 -5346 -5369 -3725 -2212 986 3492 3527 3145 810 1130 387 3556 5887 1425
16409 1425 29 2241 301 2523 3523 1786 -2237 -4108 -4137 -2286 -4351 -5197 -8723 -6618 -4326
16394 -4326 -1853 -823 -4814 -6257 -5719 -8648 -8636 -7598 -4793 -4089 -4905 -5219 -4540 -3979 -2640 -385 2004
16377B004j251j146L580k166M5J283j120o77j591K185K761j258k091p49J37N01
16361D47J888K3k843j539m23O35j95J687j767K843J063R95j034n44k34J483j154
16344A331L30K146k478j566K090l83o12j43J269j195K26L91O4M26O68k558p92
16327g86O2j135M111J652k630k563k988n60Q50J323K321K546lk462j887J190J981
16310A022J282l17k186p30m63j503l159ll4N032K494j062j652j011k223K426K136
16293D9k796l05l23n43K948L104L133k03j739K14j169m58n78M98m99k867k9J042
16275e21J087O83r52j963k042J994n1J21j066N13j010J756J607j951m67o56j817
16258d735P13k433K859K613m444l046J26J6J614K873K944L93J946J069O51k72
$$ plain form
16377 2004 753 -393 3187 1021 1066 2349 1229 552 -1039 1146 3907 2649 558 -191 -54 447
16361 447 2335 2358 -485 -2024 -2447 -1812 -2007 -320 -2087 756 1819 2814 1780 1236 1002 2485 1331
16344 1331 1661 3807 1329 -237 1853 1470 858 715 1984 789 1015 1406 1470 1896 2564 6 -786
16327 -786 -724 -1859 2252 3904 1274 -1289 -4277 -4837 -3987 -2664 -343 2203 2200 -262 -2149 -959 1022
16310 1022 2304 1987 -199 -929 -1392 -2895 -6054 -6057 -6091 -1059 1435 373 -1279 -2290 -4513 -2087 49
16293 49 -2747 -3052 -3375 -3918 -970 2134 5267 5064 3325 3539 2370 1912 1334 1832 1333 -1534 -1563 -521
16275 -521 566 1249 297 -1666 -3708 -1714 -1765 -1644 -2710 -2197 -3207 -1451 156 -1795 -2262 -2918 -4735
16258 -4735 -4022 -6455 -3596 -983 -5427 -8473 -8347 -8331 -6717 -3844 -900 -507 1439 2508 3159 2887
16242B887P25j511l735J42K093l775N33J642n29K165J812k447m92J680l006r27
16226b743K858M136k362j914m321J69M037j788j654J428l38J90L297L059L921
16211G975k133m179l629j695J196k29m28L72m107j60k199l793L17R81K862K589
16195f260q3j84M328K614j886K336l17L311k370j290Nj543kJ458O38J327p07k370
16177i95k439N98l680M80J924L69N31k43l372l26k622j74L715J763k326J292N1
16160e454j21n74R46P35L013j4l229k091J848J235n55l13K197j360k989j087j595
16143i408m40N640N051J660k002m024K371O38k234K774N434o90n62L873n2k743
16127E286l924k231J061k750K500L915k83j226j804m90K448j478k377k234P96
$$ plain form
16242 2887 3612 2101 -1634 -1492 601 -3174 -2641 -999 -1528 637 2449 2 -490 1190 -1816 -2743
16226 -2743 115 4251 1889 -25 -4346 -4177 -140 -1928 -3582 -2154 -2492 -2302 995 4054 7975
16211 7975 5842 1663 -1966 -3661 -2465 -2694 -3122 -2750 -6857 -7017 -9216 -13009 -12692 -11711 -8849 -6260
16195 -6260 -6343 -6527 -2199 415 -1471 865 548 3859 1489 199 204 -1339 -1341 117 755 2082 1375 -995
16177 -995 -3434 -2836 -6516 -6036 -4112 -3743 -3212 -3455 -6827 -7153 -9775 -9949 -6234 -4471 -6797 -5505 -5454
16160 -5454 -5575 -6149 -5203 -4468 -1455 -1469 -4698 -6789 -4941 -3706 -4261 -4574 -2377 -3737 -6726 -7813 -9408
16143 -9408 -9848 -4208 843 2503 501 -3523 -1152 -514 -2748 26 5460 4770 4208 8081 8029 5286
16127 5286 1362 -869 192 -2558 -58 3857 3574 2348 544 54 2502 1024 -1353 -3587 -2791
16112b791J713k56l592j005J189M209K227k490o52k778M39k815o02L2K019N46
16096d607l41l78j259j833J559J494J495J348j214q71k65M4j147O6J261R73q01
16079d476k534j821J747m64L512K068J658j232N64j609k027J817q62m656r17K271
16063f961N812K640l540P76k870k467J152O03j5J634K658Q3K17j746m327l328
16047i679P32K399K775J813M832K593k421k806j303k728j10K106K956q21l713
16032c375k359K080J991l780m722J639J441K453j649m41K197J167M048P62j129
16017C23k94j044J561J166l118k584M600p8j248Jk870p44r88K031j516j175j075
16000g052K073N122Q98q58j272j907j016K797K096J958M09r55m29k608O79N16
$$ plain form
16112 -2791 -1078 -1334 -4926 -5931 -4742 -533 1694 -796 -1448 -4226 -3787 -6602 -7204 -7172 -5153 -4607
16096 -4607 -4948 -5326 -6585 -8418 -6859 -5365 -3870 -2522 -3736 -4607 -4872 -4828 -5975 -5909 -4648 -3675 -4476
16079 -4476 -7010 -8831 -7084 -7548 -4036 -1968 -310 -1542 -978 -2587 -4614 -2797 -3659 -8315 -9232 -6961
16063 -6961 -1149 1491 -2049 -1273 -4143 -6610 -5458 -4855 -4870 -3236 -578 -495 -278 -2024 -6351 -9679
16047 -9679 -8947 -6548 -3773 -1960 2872 5465 3044 238 -1065 -3793 -3903 -1797 1159 338 -3375
16032 -3375 -5734 -3654 -1663 -5443 -10165 -8526 -7085 -4632 -6281 -6722 -4525 -3358 690 1452 323
16017 323 29 -1015 546 1712 -1406 -3990 610 532 -716 -715 -3585 -4329 -5317 -3286 -4802 -5977 -7052
16000 -7052 -4979 143 1041 183 -1089 -2996 -4012 -1215 881 2839 3248 2293 1864 -744 -65 451
15984D51j349k527N817K154m625l665Q74L336O6m156l27J129L85J752L7j386j924
15967c958R45j143j3j961J259L19M18K883M03K607r52j828M12K824J163K92k019
15950A651j479j872j792J711j214R65K137j168q00J70L297K593N70j890m889k917
15934d927j446j342K303N76L00J63P12k167o33k205L007K971j759j519P1P34J407
15917c754K880K229Q81k908J42J420J316j701P95L34r01O17j912J174K557k044
15901A125r06J669J860J174m146j709J069J251q86Q38L142l121k664J1j340m71
15885c104m05N52J50K83R04j695l979J810K916l47j308n95O1Q55k76M51J385K022
15867c20j20j826L62n99p80Q2l526j717M876M523j443L47j808k20j915M00k0L297
$$ plain form
15984 451 -898 -3425 2392 4546 -79 -3744 -2870 466 532 -3624 -3951 -2822 -2437 -685 -648 -2034 -3958
15967 -3958 -3013 -4156 -4169 -6130 -4871 -4552 -4134 -1251 -848 1759 807 -1021 -609 2215 3378 3670 1651
15950 1651 172 -1700 -3492 -1781 -2995 -2030 107 -1061 -1861 -1691 1606 4199 4769 2879 -2010 -4927
15934 -4927 -6373 -7715 -5412 -4836 -4536 -4373 -3661 -5828 -6461 -8666 -5659 -2688 -4447 -5966 -5895 -5161 -3754
15917 -3754 -874 1355 2236 -672 -530 890 2206 505 1300 1634 733 1350 -562 612 3169 1125
15901 1125 219 1888 3748 4922 776 -933 136 1387 501 1339 4481 1360 -1304 -1293 -2633 -3104
15885 -3104 -3509 -2957 -2807 -2524 -1620 -3315 -7294 -5484 -2568 -2915 -4223 -4818 -4757 -3902 -4178 -3727 -2342 -320
15867 -320 -440 -2266 -1904 -2503 -3283 -3201 -6727 -8444 -3568 955 -488 -141 -1949 -2169 -4084 -3684 -3704 -407
15849d07M56K376J727K31j022P42n343k924J509M373J56k222k143O16L294K811
15833D230L51j793J02j578j799J568j938k54J306M388m098m346M83o94K489l21
15817a904m711k133p99K707K987N212M28j382k738k487K139J643k41k733j988
15802f000P36J294K192L60j543k297K466R06j50P66J904J561j161k120k446N99
15786b933l29n29L806O33p05K98j134K11J180K069J594k961j836l60j045m65O45
15769a861q16P70j553j762O65j584L596j155k978J04J722K076o75k090k098K092
15753e547M722J670J46J54j455L3j152l50J999K95O09m690o32J929J899J696P53
15736B079J75r70j30J410l558l629L43J832O09Q1k268k184j907J308J337J063
$$ plain form
15849 -407 49 2425 4152 4383 3361 4103 -1240 -4164 -2655 1718 1874 -348 -2491 -1875 1419 4230
15833 4230 4581 2788 2890 1312 -487 1081 -857 -1111 195 4583 485 -3861 -3378 -4072 -1583 -1904
15817 -1904 -6615 -8748 -9547 -6840 -3853 1359 1787 405 -2333 -4820 -2681 -1038 -1279 -4012 -6000
15802 -6000 -5264 -3970 -1778 -1418 -2961 -5258 -2792 -1886 -2036 -1270 634 2195 1034 -1086 -3532 -2933
15786 -2933 -3262 -3791 15 648 -57 241 -893 -682 498 2567 4161 1200 -636 -996 -2041 -2506 -1861
15769 -1861 -2677 -1907 -3460 -5222 -4557 -6141 -2545 -3700 -6678 -6574 -4852 -2776 -3451 -5541 -7639 -5547
15753 -5547 -825 845 991 1145 -310 -277 -1429 -1779 220 515 1124 -3566 -4198 -2269 -370 1326 2079
15736 2079 2254 1284 1154 2564 -994 -4623 -4280 -2448 -1839 -1758 -4026 -6210 -8117 -6809 -5472 -4409
15720d409L511q28k264L046J225j869j402J704J243l02l807R92M06l296J709M359
15704A8j086j903k601J026K357l80j072K407J407K250k27l137o86j239k358j121
15688f345L547J238P05j803P30Q95l91j718K94o80J474L454M80j815K503L05k955
15671h2k632K41J114N24l803PJ058R16P16K942J308N83N31M00Q30p45j396K444
15653D956Q1k468k450m169j649K305j680k629J080K942m43k423p65m17M32L786
15637c511M959Q50j537j963j835k145K478j974L15k09K702N05M17m56o075j572
15621i051J518o04N70K024O13L239K364J722k101r77Q18J63J113j725k436o62
15605c412K815K534j031j605j577R12N78J323K839p42k137k103J02j203k192l044
$$ plain form
15720 -4409 -898 -1726 -3990 -944 281 -1588 -2990 -1286 -43 -345 -4152 -3160 -2754 -6050 -4341 18
15704 18 -1068 -2971 -5572 -4546 -2189 -2569 -3641 -1234 173 2423 2196 -941 -1627 -2866 -5224 -6345
15688 -6345 -2798 -1560 -855 -2658 -1928 -1033 -1424 -3142 -2848 -3528 -2054 1400 1880 65 2568 2873 -82
15671 -82 -2714 -2473 -1359 -835 -4638 -4631 -3573 -2657 -1941 1001 2309 2892 3423 3823 4653 3908 2512 4956
15653 4956 5037 2569 119 -4050 -5699 -3394 -5074 -7703 -6623 -3681 -4124 -6547 -7312 -7729 -7297 -3511
15637 -3511 1448 2298 761 -1202 -3037 -5182 -2704 -4678 -4363 -4572 -1870 -1365 -948 -1404 -7479 -9051
15621 -9051 -7533 -8137 -7567 -5543 -4930 -1691 673 2395 294 -683 135 298 1411 -314 -2750 -3412
15605 -3412 -597 1937 906 -699 -2276 -1364 -786 537 3376 2634 497 -1606 -1504 -2707 -4899 -7943
15589g943L977J621m47j206J339L33K53q50J769n72K826O71j152n583r40L233
15573b671K350P35M177j941m63R11r3n11P53j183j665K593J455j848j464J412
15557B547N78j153j264l263p56l627k728J305J49M09Q9L163M10j891j286k688
15541a0006K358J150j857j194M357L980J356m566j741K467M770J014j957m113
15527c982l028m19KJ606K965j469O70K418K715L049O28k362j204k877j578j66
15511c032J997L45O33L94m243j436M576K671l449l003K411P187k18k947K19j349
15495G56M864M009j64m350l902k568K715j631m108J313K603L548M042K038j588
15480G577l015l601j557K157k558O45L767O67m074k003K892j160o9kj163j702
$$ plain form
15589 -7943 -3966 -2345 -2792 -3998 -2659 -2326 -2073 -2923 -1154 -1726 1100 1771 619 -4964 -5904 -2671
15573 -2671 -321 414 4591 2650 2187 3098 3005 2494 3247 2064 399 2992 4447 2599 1135 2547
15557 2547 3125 1972 708 -2555 -3311 -6938 -9666 -8361 -8212 -7803 -7714 -4551 -4141 -6032 -7318 -10006
15541 -10006 -7648 -6498 -8355 -9549 -5192 -1212 144 -4422 -6163 -3696 1074 2088 131 -3982
15527 -3982 -7010 -7429 -7427 -5821 -2856 -4325 -3655 -1237 1478 4527 5155 2793 1589 -1288 -2866 -3032
15511 -3032 -1035 -690 -57 337 -3906 -5342 -766 1905 -1544 -4547 -2136 5051 4833 1886 2105 756
15495 756 5620 9629 9465 5115 1213 -1355 1360 -271 -4379 -3066 -463 3085 7127 9165 7577
15480 7577 4562 961 -596 1561 -997 -352 3415 4082 8 -1995 897 -263 -332 -334 -1497 -3199
15464c199k818R45L980m121j127j252M012J008O38K885M690r65l450l093k109
15449c976o21r69j814K778M051p31q11N97j856m36m38J855j266Q28n97Q76J304
15432a226J918J955r16R50j359j20K190j691n187k80M204O46k786q10K91p87M55
15415b553M279J059m33j119j922l341k692J68J373K397r32O97o90J369J150k826
15399d016l657M69m56J535R06K001J842j568m57K207L852j151j576j415l460j868
15383f812J532O69o93L515q48l50K831k396j792K847J707m43O39Q1P50L89j058
15366E68k222l01Q51K70k480Q68L936R0K101O39j192l569J034J743M03k420j379
15349a060j672j724J604J376j854j382M13K394k896j89Q5J880r80K86Q23L76K53
$$ plain form
15464 -3199 -6017 -5072 -1092 -5213 -6340 -7592 -3580 -2572 -1934 951 5641 4676 1226 -1867 -3976
15449 -3976 -4597 -5566 -7380 -4602 -551 -1282 -2093 -1496 -3352 -3788 -4226 -2371 -3637 -2809 -3406 -2530 -1226
15432 -1226 692 2647 1731 2681 1322 1202 3392 1701 -3486 -3766 438 1084 -1702 -2512 -2221 -3008 -2553
15415 -2553 1726 2785 2352 1233 -689 -4030 -6722 -6554 -5181 -2784 -3716 -3019 -3709 -2340 -1190 -4016
15399 -4016 -7673 -7204 -7660 -6125 -5219 -3218 -1376 -2944 -3401 -1194 2658 1507 -69 -1484 -4944 -6812
15383 -6812 -5280 -4611 -5304 -1789 -2637 -2987 -156 -2552 -4344 -1497 210 -233 406 487 1237 1626 568
15366 568 -1654 -1955 -1104 -834 -3314 -2446 1490 1580 3681 4320 3128 -441 593 2336 2739 319 -1060
15349 -1060 -2732 -4456 -2852 -1476 -3330 -4712 -4299 -1905 -4801 -4990 -4905 -3025 -4005 -3719 -2896 -2520 -2267
15332b267q65l35l07j30N41o45j729o13k076K833L986Q23m17l65K407k722k408
15315d289k42Q90R06j366j722J445K443J275j418J644r72l227r47L22L564J587
15299a07j118k989n80Q62l743J766O10J533j063k423m400j968K746J767N500N727
15283B120M47q74k661j651n14k808R53L733K527J85n466l01R19J044J460K191
15267A304O908p30n809k844J92o40l7J184j528k523k864k70K630P7K913N45k369
15250c861j677L883K990m416j718kk02j307J987K821K341j097L385L702m619o708
15234d498j490O76j193M20K359M037K443m446k612j430p29j818J282K068L272
15219a659K37M33k00l711n051J40L541L519K907l796j455K201J574r08rj99j90
$$ plain form
15332 -2267 -3132 -3467 -3774 -3904 -3363 -4008 -5737 -6350 -8426 -5593 -1607 -784 -1201 -1566 841 -1881 -4289
15315 -4289 -4531 -3641 -2735 -4101 -5823 -4378 -1935 -660 -2078 -434 -1406 -4633 -5580 -5258 -1694 -107
15299 -107 -1225 -4214 -4794 -3932 -7675 -5909 -5299 -3766 -4829 -7252 -11652 -13620 -10874 -9107 -3607 2120
15283 2120 2567 1693 -968 -2619 -3133 -5941 -4988 -1255 1272 1457 -4009 -4310 -3391 -2347 -887 1304
15267 1304 8212 7482 1673 -1171 -979 -1619 -1656 -472 -2000 -4523 -7387 -7657 -5027 -4950 -2037 -1492 -3861
15250 -3861 -5538 -1655 1335 -3081 -4799 -4801 -5003 -6310 -4323 -1502 839 -258 3127 6829 2210 -4498
15234 -4498 -5988 -5312 -6505 -6085 -3726 311 2754 -1692 -4304 -5734 -6463 -8281 -6999 -4931 -1659
15219 -1659 -1422 -989 -1189 -4900 -9951 -9811 -6270 -2751 156 -3640 -5095 -2894 -1320 -2228 -2237 -2436 -2626
15202b626K568J639P49j123k340k605J136K080J179P28p79J519j3J76p03n38Q54
15185A901K244O11j658l510P31K474k32k53J330N88J276L69k628n275o81J182
15169a531k518J207J39L665j594l69m50J355Q53l90m79Q29j605l7K301J12j837
15152c49Q85M51K086j8L23k457K24J887O96j735p18K571n67l640k596j978k010
15135f945q69K254J794J103K960l36k88k399J37J185o78p44J450Q65k296l401
15119f208k587J079N417L407L08j092l664J168J005O31k381Q96J403o28Q32K483
15103B069l77l544o3J928K73j961R50p58k42K726N50l820m484N327L509j667k082
15086a666J87N31J537L151j989j03q52n42LJ654J320K84l456j067o52J28j878
$$ plain form
15202 -2626 -58 1581 2330 1207 -1133 -3738 -2602 -522 657 1385 606 2125 2112 2288 1585 1047 1901
15185 1901 4145 4756 3098 -412 319 2793 2561 2308 3638 4226 5502 5871 3243 -2032 -2713 -1531
15169 -1531 -4049 -2842 -2703 962 -632 -1001 -1451 -96 757 367 -112 717 -888 -925 1376 1488 -349
15152 -349 536 987 3073 3055 3378 921 1145 3032 3728 1993 1275 3846 3279 -361 -2957 -4935 -6945
15135 -6945 -7814 -5560 -3766 -2663 297 -39 -327 -2726 -2589 -1404 -2082 -2826 -1376 -511 -2807 -6208
15119 -6208 -8795 -7716 -2299 1108 1416 324 -3340 -2172 -1167 -536 -2917 -2021 -618 -1246 -414 2069
15103 2069 1692 -1852 -1915 13 286 -1675 -725 -1483 -1725 1001 1551 -2269 -6753 -1426 2083 416 -1666
15086 -1666 -1479 -948 589 3740 1751 1648 796 254 257 1911 3231 3515 59 -1008 -1660 -1532 -3410
15069c410j681J374L251M06K447O24L122K59o273q49l83K91K341P68k177k102
15053a992Q71k228j128r05l1k012M317K974L609k240m417J541L796J912O19j355
15037C331R89k31Q9J503m27k95k533m568m80J387o40J119J964O75j394q47o33
15020i91Q08J691p83J073l008o14J1J247n7j734L112L259k905k213m37L81N406
15003D246l062m753l052P48J849K92N46M090J223K174q69k061m82j348k15o8l837
14986d579j694m58K392L587J690j836j324j851P46J447N31K970J55l278q68L317
14970I47J105L839j268k472n04k336j759k774n35J605L182K691L31Q68p66j810
14954C44l058N09K367M623m6o827M6K203l835j664n47N73J662j18Q26L31j736
$$ plain form
15069 -3410 -5091 -3717 -466 -60 2387 3011 6133 6392 119 -730 -1113 -822 1519 2287 110 -1992
15053 -1992 -1121 -3349 -4477 -5382 -5413 -7425 -3108 -134 3475 1235 -3182 -1641 2155 4067 4686 3331
15037 3331 4320 4089 4178 5681 5254 4959 2426 -2142 -2622 -1235 -1875 -756 1208 1883 489 -358 -991
15020 -991 -183 1508 725 1798 -1210 -1824 -1813 -566 -623 -2357 755 4014 1109 -1104 -1541 -1160 4246
15003 4246 1184 -3569 -6621 -5873 -4024 -3732 -3186 904 2127 4301 3432 1371 889 -459 -674 -742 -4579
14986 -4579 -6273 -6731 -4339 -752 938 -898 -2222 -4073 -3327 -1880 -1349 1621 1776 -1502 -2370 947
14970 947 2052 5891 4623 2151 1647 -689 -2448 -5222 -5757 -4152 -970 1721 2052 2920 2154 344
14954 344 -2714 -2205 162 4785 4739 -2088 -2042 161 -3674 -5338 -5885 -5312 -3650 -3768 -2942 -2611 -4347
14937d347M27J334l92N66l244k077r03j068J669J281O36K820J5q47J894J397Q36
14920cM05o61q65M42J401j82J063j480m052j302J780Q54Q69L887K862j340l34
14903C344K603J286m793l394j918L03J866Q82j710J233J160j447o99k085K931
14888d38K333L48k494j901p12j927J412J204N14L01l873j564J301K796L292J953
14872B545J682k908n644j412K08L845K208p13k436l342o42R14k627L228L003j657
14856c748j039L400j099j722K339M56K094j397j176j575l66K096l21k568j385
14841f011k86J836M418N95j859l033L00J615L798L568j12l462l46P7O27n15J573
14824B783j635K124K955P59j741l510k248j803p58j521J961K117K415j834j149
$$ plain form
14937 -4347 -3920 -2586 -2978 -2412 -5656 -7733 -8636 -9704 -8035 -6754 -6118 -3298 -3283 -4130 -2236 -839 -3
14920 -3 402 -259 -1124 -682 719 537 1600 120 -3932 -5234 -3454 -2600 -1731 2156 5018 3678 3344
14903 3344 5947 7233 2440 -954 -2872 -2569 -703 179 -1531 -298 862 -585 -1284 -3369 -438
14888 -438 1895 2243 -251 -2152 -2864 -4791 -3379 -2175 -1661 -1360 -5233 -6797 -5496 -2700 592 2545
14872 2545 4227 1319 -4325 -5737 -5529 -1684 524 -189 -2625 -5967 -6609 -5695 -8322 -5094 -2091 -3748
14856 -3748 -4787 -1387 -2486 -4208 -1869 -1413 681 -716 -1892 -3467 -3833 -1737 -2058 -4626 -6011
14841 -6011 -6297 -4461 -43 552 -1307 -4340 -4040 -2425 1373 4941 4829 1367 1021 1098 1725 1210 2783
14824 2783 1148 3272 6227 6986 5245 1735 -513 -2316 -3074 -4595 -2634 -517 1898 64 -1085
14809a085M59N0q20J692j197o07j748q91J169J14J543M086K005j479j380R04k39
14792B576n62K318l74l606J266J587J89M57J052l245p90m80q8o75m47J410J260
14775A848j416J059J22L45o28R51K957k620q97j13j044J871L178n31l875l679
14759b472p09m12K432Q38p99k7N91K153J567q79j447j646k820k329M91M750k89
14742a007k324P46R93K372O24l713k060J385m97J422K543M519o00j207Q45J551
14726E592k266j183j802j343k456l010J083J630L081Q28j051j455L076L461k48
14711C937K33J792p04K491j524m591M26K076J723j176l214j334k31N47j555j042
14695b146k470j240o26M501l48j811k8j642j584j273K384N567L216l407n91K486
$$ plain form
14809 -1085 -626 -576 -1396 296 -901 -1508 -3256 -4147 -2978 -2864 -1321 2765 4770 3291 1911 2815 2576
14792 2576 2014 4332 3958 352 1618 3205 3394 3851 4903 1658 868 388 300 -375 -822 588 1848
14775 1848 432 1491 1613 1958 1330 2281 5238 2618 1721 1608 564 2435 5613 5082 1207 -2472
14759 -2472 -3181 -3593 -1161 -323 -1122 -1149 -558 1595 3162 2283 836 -810 -3630 -5959 -5468 -718 -1007
14742 -1007 -3331 -2585 -1592 780 1404 -2309 -4369 -2984 -3481 -2059 484 5003 4403 3196 4041 5592
14726 5592 3326 2143 341 -1002 -3458 -6468 -5385 -3755 -674 154 -897 -2352 724 4185 3937
14711 3937 4170 5962 5258 7749 6225 1634 2060 4136 5859 4683 1469 135 -96 451 -1104 -2146
14695 -2146 -4616 -5856 -6482 -1981 -2329 -4140 -4168 -5810 -7394 -8667 -6283 -716 2500 -907 -1498 988
14679I88L86j760j546K660Q7L672J261k803k660J362L69k327k550J920K291j59
14663A191L05L187q63J023L148M00o337n717q33k42J544L090j010j003M06L558
14647A847J570k024k932j800K16j268r54R3L529P73j328N1J112l674K511j78K099
14630c57J070q77j942j565o5MJ037r13P58K495L483m264J726k594k905P91o72
14613d790J151L541R00O7J310k057l94n58K843j003k902L88L597J914j33k709
14597A165j702M21m351K887K842r20j720K137L695l42O00O06o31m39j862j908
14581D78J061p98k134O60l5j41N18r76q54k36j799L601M581j192m192q32K927
14564F37J959m23m387J544K588O83j191P89J849j958l356j196L879M02J366n34
$$ plain form
14679 988 1374 -386 -1932 728 815 4487 5748 2945 285 1647 2016 -311 -2861 -941 1350 1191
14663 1191 1496 4683 3820 4843 7991 8391 2054 -3663 -4496 -4738 -3194 -104 -1114 -2117 -1711 1847
14647 1847 3417 1393 -1539 -3339 -3123 -4391 -5345 -5252 -1723 -950 -2278 -2227 -1115 -4789 -2278 -2456 -357
14630 -357 713 -164 -2106 -3671 -3736 -3732 -2695 -3608 -2850 -355 3128 -1136 590 -2004 -4909 -4118 -4790
14613 -4790 -3639 -98 802 869 2179 122 -272 -830 2013 1010 -1892 -1504 2093 4007 3874 1165
14597 1165 -537 -116 -4467 -1580 1262 342 -1378 759 4454 4112 4712 5318 4687 4248 2386 478
14581 478 1539 741 -1393 -733 -768 -909 -391 -1367 -2221 -2457 -4256 -655 3926 2734 -1458 -2290 637
14564 637 2596 2173 -2214 -670 1918 2601 1410 2199 4048 2090 -1266 -2462 1417 1819 3185 2651
14548B651k977j806M16Q95N2J336k021p58N00K593j989j362R13k617R58j83P88
14531b611J596J059K198j801m649Q42J854L38K998J64j96J935L96j878J530j316
14515B459k213M05N574O110M725L005l811l117r89l758k248j420l753m49J791
14500B311k513m205j288j617L061M190n79k450J967l70r19N43K568L34J37k068
14484h98n56j598J726j034j40L129k243j52K968L897l126r49n22m133K02o72J202
14467b899k301q65K469K569J426p88J037L41m17L694R35J812p45k929k890K62
14451G11j872j983J123L54l998q77L789j148j490L903J150j799r18o24O57O73
14435b349q36j909J408R00K713l275l817l897N321L878K064J00n088l083O00M93
$$ plain form
14548 2651 -326 -2132 -1716 -821 -769 567 -1454 -2212 -1712 881 -1108 -2470 -1557 -4174 -3216 -3399 -2611
14531 -2611 -1015 44 2242 441 -4208 -3366 -1512 -1174 1824 1988 1792 3727 4123 2245 3775 2459
14515 2459 246 651 6225 12335 17060 20065 16254 13137 12148 8390 6142 4722 969 520 2311
14500 2311 -202 -4407 -5695 -7312 -4251 -61 -640 -3090 -1123 -1493 -2412 -1869 699 1033 1170 -898
14484 -898 -1454 -3052 -1326 -2360 -2500 629 -1614 -1766 1202 5099 1973 1024 502 -3631 -3429 -4101 -2899
14467 -2899 -5200 -6065 -3596 -1027 399 -389 648 989 572 4266 5201 7013 6268 3339 449 711
14451 711 -1161 -3144 -2021 -1667 -5665 -6542 -2753 -3901 -5391 -1488 -338 -2137 -3055 -3679 -3022 -2349
14435 -2349 -3185 -5094 -3686 -2786 -73 -3348 -7165 -11062 -5741 -1863 201 301 -4787 -7870 -7270 -6777
14419f777q74k180J066L164K318j117p90K462M510k865p01n81r60k681K505j617
14403e118J211J977k751j802J709o53J057n89p28J331M46K40K148l16n89L569
14387A142L601q7l825l063j534L487J384k272j652J040K353J866l398j137r68
14372c063K45L12j583k806r35K533K328k423M72N016j142k134k809L104K493r19
14356a311k799k397L410J440P21K016k99j733J352k384r97k598J873J590L282
14341A166P42n80r72P40l39K079k367j502ok006j538J319rJ39O15J282m91k92
14323b020j106J079J62O87M779L401n00l133j158l99j207j550L393O98j600M122
14307E648O66K368O37j508M325O120N414M962L671J999R54j618J360L804m30k266
$$ plain form
14419 -6777 -7651 -9831 -8765 -5601 -3283 -4400 -5190 -2728 1782 -1083 -1784 -2365 -3325 -6006 -3501 -5118
14403 -5118 -3907 -1930 -4681 -6483 -4774 -5427 -4370 -4959 -5687 -4356 -3910 -3670 -1522 -1838 -2427 1142
14387 1142 4743 4656 831 -2232 -3766 -279 1105 -1167 -2819 -1779 574 2440 -958 -2095 -3063
14372 -3063 -2818 -2506 -4089 -6895 -7830 -5297 -2969 -5392 -4920 96 -1046 -3180 -5989 -2885 -392 -1311
14356 -1311 -4110 -6507 -3097 -1657 -936 1080 781 -952 400 -1984 -2981 -5579 -3706 -2116 1166
14341 1166 1908 1328 356 1096 757 2836 469 -1033 -1039 -3045 -4583 -3264 -3273 -3134 -2519 -1237 -1728 -2020
14323 -2020 -3126 -2047 -1885 -1198 3581 6982 6482 3349 2191 1792 585 -965 2428 3126 1526 5648
14307 5648 6314 8682 9319 7811 12136 18256 23670 28632 32303 34302 35256 33638 34998 38802 38372 36106
14291C6106l34m867k939k425L011J351n156m297n395m094m00R80J087n77k038
14276A0013l173k732l493j81j604O80n10k404l256k93L224J384j379n20L235K110
14260A101K758L887O553O542q16j705m944k048l959m549k846p19k45M57j602M88
14244a647o47J996J542K353k682M88l0k932J381j49k403K03k066j256M710M249
14228C110l77j493Q18Q63k605j864j273P344J750l476l384j478J180K004J757
14213B876q92k823q48O16J38r59J081n54K863j044l282m35j145o48J651P59o04
14196c250k031j469J361N881J31l470p55K916J785K077m382l558m62J61K386J723
14180i56r87k058K42k578J671L025l50L504j657j224J948j854n322J950N140L070
$$ plain form
14291 36106 35772 30905 27966 25541 28552 29903 24747 20450 15055 10961 10561 11541 12628 12051 10013
14276 10013 6840 4108 615 434 -1170 -490 -1000 -3404 -6660 -6953 -3729 -2345 -3724 -4244 -1009 1101
14260 1101 3859 7746 14299 20841 20025 18320 13376 11328 7369 2820 -26 -745 -990 -533 -2135 -1647
14244 -1647 -2294 -298 1244 3597 915 1403 1373 -1559 -178 -327 -2730 -2527 -4593 -5849 -1139 3110
14228 3110 2733 1240 2058 2921 316 -1548 -2821 4523 6273 2797 -587 -2065 -885 1119 2876
14213 2876 1984 -839 -1687 -1071 -933 -1892 -811 -1365 1498 454 -2828 -3263 -4408 -5056 -3405 -2646 -3250
14196 -3250 -5281 -6750 -5389 492 623 -2847 -3602 -686 1099 3176 -1206 -4764 -5226 -5065 -2679 -956
14180 -956 -1943 -4001 -3759 -6337 -4666 -1641 -1991 1513 -144 -1368 580 -1274 -6596 -4646 494 3564
14164C564J276j98J89J276O374K610L129M484N114O282K045l325q427r488o580
14149H325m006k955l336l830K371M642M055m94j552p12k697j850k834J851K509
14134e13J052j428J139o94m46K370K399J260j982k799j666P00j220j956j9M907
14118A104l21j62k955k790K962J402r97j438j02K40K454J058L03J696k160J825
14102B119m311L89L246q07j352k805p35j169J343q49K034L091J006j687r86N00
14086i73J730J997j209K096j059n422j976N6K320o67k40J298M39M085J757j927
14070B305J755j976k152j731J054L656k978k839O12p79l392N243j040j42q31J019
14054b216k541q42K09k448J339M574J468J392k083n830j070R08J374J155j92j530
$$ plain form
14164 3564 4840 4642 4831 6107 12481 15091 18220 22704 27818 34100 36145 32820 24393 14905 8325
14149 8325 4319 1364 -1972 -5802 -3431 1211 5266 4772 3220 2508 -189 -2039 -4873 -3022 -513
14134 -513 539 -889 250 -444 -890 1480 3879 5139 3157 358 -1308 -608 -1828 -3784 -3803 1104
14118 1104 783 621 -2334 -5124 -2162 -760 -1757 -3195 -3297 -3057 -603 455 758 2454 294 2119
14102 2119 -2192 -1803 1443 636 -716 -3521 -4256 -5425 -4082 -4931 -2897 194 1200 -487 -1473 -973
14086 -973 757 2754 1545 3641 2582 -2840 -4816 -4760 -2440 -3107 -3347 -2049 -1610 2475 4232 2305
14070 2305 4060 2084 -68 -1799 -745 2911 -67 -2906 -2294 -3073 -6465 -1222 -2262 -2404 -3235 -2216
14054 -2216 -4757 -5599 -5390 -7838 -6499 -1925 -457 935 -1148 -6978 -8048 -7140 -5766 -4611 -4803 -6333
14038f333l85j057K69L179N062M733J23k463l232J152K773m121j220J109M833
14023D422N118j671K41k209j319L40K075M001Q215K246P761J7181K9166M2816
14009A18383M0406J5333j4399k8973j2309J5644K6674Q931k2646m0103l6612k5803
13997D4526j7652q930l921j845j609P9k605J359N43j457m008j159n069p7J416
13982d09J211J178j768r16J687k482k253J500L08m44J805J077J092K586r19o53
13966B600k076M82P34R41l958j06L41k13m05M25K403J251J148j247J170R75J736
13949F201R69l288k635k124l315L756K70n32L9k482j189M74k338K76L219O42j191
13932c248k73q36J756J310K342m55j160O6J590N2k734M50L200O54l285k856j834
$$ plain form
14038 -6333 -6718 -7775 -7506 -4327 735 5468 5591 3128 -104 1048 3821 -300 -1520 -411 4422
14023 4422 9540 7869 8110 5901 4582 4922 6997 10998 19213 21459 29220 46401 75567 118383
14009 118383 158789 174122 159723 130750 118441 134085 160759 169690 147044 106941 70329 44526
13997 44526 26874 17944 14023 12178 10569 10648 8043 9402 9945 8488 4480 3321 -1748 -1825 -409
13982 -409 802 1980 212 -704 983 -1499 -3752 -2252 -1944 -2388 -583 494 1586 4172 3253 2600
13966 2600 524 1006 1740 2681 -1277 -1383 -1042 -1255 -1660 -1235 1168 2419 3567 2320 3490 4465 6201
13949 6201 7170 3882 1247 -877 -4192 -436 -166 -698 -659 -3141 -4330 -3856 -6194 -5918 -2699 -2057 -3248
13932 -3248 -3521 -4357 -2601 -1291 1051 596 -564 -498 1092 1144 -1590 -1140 2060 2714 -571 -3427 -5261
13915e261L28N009O50j905m021L299J749K36q90k53J532L593N71k790j466l041
13899b660J003j402j643J58L987o61n231j255M063N500J37k278p6O8k495j884
13883d669L593K589k838j528J963j062k124k1j581k724P72M049K924J82j499k950
13867d924j53L9L340L373J040K38l253k078k11M02M69L39q71l198l50K252ok714
13849f266L45L515k030j00j55K213o13l26M32j35O71k013p91M72q50j011K73j352
13831g721J046j40j549K212K975r22J922L771j869q203m945L665K214j748l27
13816i619L921J141J17j360K780j139r86K627m17j201Q2j286k314j05p10j430
13800i899j310K638k4J80K34O33R05n93r1L761L230k571q15Q40M60K181J553l511
$$ plain form
13915 -5261 -4933 76 726 -1179 -5200 -1901 -152 84 -806 -1059 473 4066 4637 1847 381 -2660
13899 -2660 -1657 -3059 -4702 -4544 -557 -1218 -6449 -7704 -3641 1859 1996 -282 -358 -290 -2785 -4669
13883 -4669 -1076 1513 -1325 -2853 -890 -1952 -4076 -4097 -5678 -8402 -7630 -3581 -657 -475 -1974 -4924
13867 -4924 -5077 -5038 -1698 1675 2715 2953 -300 -2378 -2589 -2187 -1718 -1379 -2250 -5448 -5798 -3546 -3552 -6266
13849 -6266 -5921 -2406 -4436 -4536 -4691 -2478 -3091 -3417 -2985 -3120 -2449 -4462 -5253 -4781 -5631 -6642 -6369 -7721
13831 -7721 -6675 -6815 -8364 -6152 -3177 -4099 -2177 1594 -275 -8478 -13423 -9758 -7544 -9292 -9619
13816 -9619 -5698 -4557 -4440 -5800 -3020 -4159 -5145 -2518 -2935 -4136 -4054 -5340 -7654 -7759 -8469 -9899
13800 -9899 -11209 -8571 -8595 -8415 -8181 -7548 -6643 -7236 -7327 -3566 -336 -2907 -3722 -2882 -2422 -241 1312 -2199
13782b199k119k490K918R10K021K875K08Q88o85k761l661k542k549m61J815L214
13766d618K349Q28m0N28j231O50k745r66o3l640K413L963K253p67j482j314l396
13749g278j755N69k14L447K333k36L401o55l404k433k155o81M375J897n02j001
13733d292l246J040L458O73k12K94q66J904N615Q99l160L89j373K350O297j277
13717H493m115j089j58j287k07j571l843k021L033J514q25J527J213K337o11J754
13701D144q34m999j808J361o91Q10J78R54J63k89j48J708k637j573L231J411r4
13684H87j653J064Q41L34k60m151l318n1L225j830r03M49K654M391J771k370J85
13667A265J470L177k829j427J227j651l860l550K62K353L080Q36j7q6Q18m203
$$ plain form
13782 -2199 -4318 -6808 -3890 -2980 -959 1916 2124 3012 2327 -434 -4095 -6637 -9186 -9647 -7832 -4618
13766 -4618 -2269 -1441 -1481 -953 -2184 -1534 -4279 -5245 -5308 -8948 -6535 -2572 -319 -1086 -2568 -3882 -7278
13749 -7278 -9033 -8464 -8678 -5231 -2898 -3134 267 -388 -3792 -6225 -8380 -9061 -4686 -2789 -3291 -4292
13733 -4292 -7538 -6498 -3040 -2367 -2579 -2285 -3151 -1247 4368 5267 2107 2496 1123 3473 9770 8493
13717 8493 4378 3289 3131 1844 1637 66 -3777 -5798 -2765 -1251 -2076 -549 664 3001 2390 4144
13701 4144 3310 -1689 -3497 -2136 -2827 -2017 -1839 -885 -722 -1011 -1159 549 -2088 -3661 -430 981 887
13684 887 -766 298 1139 1473 1213 -2938 -6256 -6307 -3082 -4912 -5815 -5366 -2712 1679 3450 1080 1265
13667 1265 2735 5912 3083 1656 2883 1232 -2628 -6178 -5916 -3563 -483 353 336 250 1068 -3135
13651c135p102J79N632M706j449k731m558o75M43l5K880J09k128J120J698o28
13635e674J154n2L297L281m58J177p82k293k510J144K115j138Q55k861o58K31
13619c172J672J657K383n372k420m03L644j946j108P02j24j306k382K870J324
13604c981j550P37J191j238N58p18k084L101nm63j354p99L186M285Q03k324l439
13587d094n07J111o73l953J558J232J815O065Q2k785l746n97j77J451N34M33L58
13570a893J406J246j147l058m215R09L049J99j149k04O81L320L322k814k839q6
13554c273j233J892L061k24m214K098K794q3L043l543m253k271K087o16J007Q04
13538b924p34l1k108n3N86J953K071l5q30L533M85l747k195K955Q51j106k696
$$ plain form
13651 -3135 -10237 -10058 -4426 280 -1169 -3900 -8458 -9133 -8690 -8725 -5845 -5736 -7864 -6744 -5046 -5674
13635 -5674 -4520 -4572 -1275 2006 1548 2725 1943 -350 -2860 -1716 399 -739 116 -2745 -3403 -3172
13619 -3172 -1500 157 2540 -2832 -5252 -5655 -2011 -3957 -5065 -4363 -4487 -5793 -8175 -5305 -3981
13604 -3981 -5531 -4794 -3603 -4841 -4283 -5001 -7085 -3984 -3989 -4452 -5806 -6605 -3419 866 1669 -655 -4094
13587 -4094 -4601 -3490 -4163 -8116 -6558 -5326 -3511 2554 2636 -149 -3895 -4492 -4669 -3218 -2684 -2251 -1893
13570 -1893 -487 759 -388 -3446 -7661 -6752 -3703 -3504 -4653 -4857 -4176 -856 2466 -348 -3187 -3273
13554 -3273 -4506 -2614 447 223 -3991 -1893 901 818 3861 318 -3935 -6206 -4119 -4735 -3728 -2924
13538 -2924 -3658 -3689 -5797 -5850 -5264 -3311 -1240 -1275 -2105 1428 1913 -1834 -4029 -1074 -223 -1329 -4025
13521d025j41R07L42j936k227J838j349L027J522K007J554J329l657k092K531
13506c70K574k740k273k154J765L940n63M08J245k297p44O29O04r85K057m97j905
13489a306o84J082K199o77j838k384L206L741L87L172l151k265J804Q05m928l263
13473d100L482K245P91m26m244l204K796N046M957l30m329m990J35L81l986K24
13457e552p60j5J999K382P56m768j065M727N86J733q12j942O41K757j028k82n03
13440a146j341J833J330l344p30J009J867L195j163p63J469L072R96l427k254
13425F03k375k366o26Q48j299j54k813o87M297M165k619j591m63N67J490L481
13409D58K610l460K442K00j337P79n44J166n17m10p69P11L83m118l547Q52M100
$$ plain form
13521 -4025 -4166 -3259 -2917 -4853 -7080 -5242 -6591 -3564 -2042 -35 1519 2848 -809 -2901 -370
13506 -370 2204 -536 -2809 -4963 -3198 742 179 587 1832 -465 -1209 -580 24 -961 1096 599 -1306
13489 -1306 -1990 -908 1291 614 -1224 -3608 -402 3339 3726 6898 3747 1482 3286 4091 -837 -4100
13473 -4100 -618 1627 2418 1992 -2252 -5456 -2660 2386 7343 7013 2684 -2306 -2171 -1790 -5776 -5552
13457 -5552 -6312 -6327 -4328 -1946 -1190 -5958 -7023 -2296 -1710 23 -789 -2731 -2090 667 -361 -643 -1146
13440 -1146 -2487 -654 676 -2668 -3398 -2389 -522 2673 1510 747 2216 5288 6284 2857 603
13425 603 -1772 -4138 -4764 -3916 -5215 -5369 -8182 -8869 -4572 -407 -3026 -4617 -5080 -4513 -3023 458
13409 458 3068 -392 2050 2250 913 1692 1148 2314 1797 1387 618 1329 1712 -2406 -5953 -5101 -1001
13392a001J186r00J411R35R66K373j808M64k495l995k366K044P85K850J232k006
13376c25r33p0Q82j105k444M040N323J207k618l505l59K871J60n47j177j816Q98
13359D82J672Q44k782j940L324j025k186J18j253J73o54J08j406j378K163l13
13343d053j110PL625L623n92j03k730j018L920M01J138j847k362n85J277L605
13327C196j749j34P67j386j018nJ733J955Q46k004j960J532K469J055J092J984
13311H373j768k921R75j172j006K565O06k219l839M29J63k098n88J409k172K563
13295g00j10r91J364K681N59j054N58r92j814K564Q28j348M90k511j266j550L254
13278c8K546l453j476j233k279k27L364n42j89j572J499N94K465L047l94J061
$$ plain form
13392 -1001 185 -715 696 1631 2597 4970 3162 3626 1131 -2864 -5230 -3186 -2401 449 1681 -325
13376 -325 -1258 -1328 -446 -1551 -3995 45 5368 6575 3957 452 93 2964 3124 2577 1400 -416 482
13359 482 2154 2998 216 -1724 1600 575 -1611 -1493 -2746 -2573 -3227 -3119 -4525 -5903 -3740 -4053
13343 -4053 -5163 -5156 -1531 2092 1500 1397 -1333 -2351 1569 1970 3108 1261 -1101 -1686 -409 3196
13327 3196 1447 1313 2080 694 -324 -329 1404 3359 4205 2201 241 1773 4242 5297 6389 8373
13311 8373 6605 3684 4659 3487 2481 5046 5652 3433 -406 23 186 -1912 -2500 -1091 -3263 -700
13295 -700 -810 -1801 -437 2244 2803 1749 2307 1315 -499 2065 2893 1545 2035 -476 -1742 -3292 -38
13278 -38 2508 -945 -2421 -3654 -5933 -6160 -2796 -3338 -3527 -5099 -3600 -3006 -541 2506 2112 3173
13262C173k176L367J274N91l447r95r77J531K067K820r92k000J666m802m26L219
13246C893J597J002K20o49j450l524J581q4j585l001k64L681K422L80m57K524
13230F286l85j222j947j98K498P64J268n67k615j853j279M740k83K698P46j780
13214F871p54o03p26l701m477j327K588L550R116L255j050j868o43J514M063K278
13198A8086J259l54J612L896L627P88j567P399J0062P839J0292J3873K3753L8203
13184A38768N8311R2090J26322J36641Q3428j5464p0742m0239L2232P0961L2807
13173F45115p8667j52239j38402q8965m6145k8770k3591j6892j0860r726p844
13162D3014p893l902k800k599l866k3j010m498j677j452j698l94K789k209l369
$$ plain form
13262 3173 997 4364 5638 6229 2782 1787 810 2341 4408 7228 6236 4236 5902 1100 674 3893
13246 3893 5490 6492 6712 6063 4613 1089 2670 2586 1001 -2000 -2264 1417 3839 4219 3762 6286
13230 6286 5901 4679 2732 2534 5032 5796 7064 6497 3882 2029 750 5490 5207 7905 8651 6871
13214 6871 6117 5514 4788 1087 -3390 -4717 -2129 1421 10537 13792 12742 10874 10231 11745 15808 18086
13198 18086 19345 18991 20603 24499 28126 28914 27347 34746 44808 52647 62939 76812 100565 138768
13184 138768 197079 289169 415491 552132 635560 620096 549354 509115 541347 612308 645115
13173 645115 566448 414209 275807 186842 140697 111927 88336 71444 60584 50858 43014
13162 43014 35121 31219 28419 25820 21954 21931 20921 16423 14746 13294 11596 11202 13991 11782 8413
13147H413n35J617j081K182j035l29o90k66n563j506J589L392L513l179k287j740
13131B495J088j903K40j292l575k152N406L808j807k717j117L866L245J233k208
13116D610j621r99o82r28j492K274K308J113J799N28l75J622Q43l150J474K75
13100G599k338l634j069k19k871j673r73K223k9R14K287L010l15k614q9l066p61
13083c618K894K538N11k96q21l19K076L343j977k294j955l458k623l01j37K311
13067d126L135l346k154m145K749Q840P69o345o743M04L375N704M936K145m39
13052D759K75j109n73J667K243L645O77J121P291k252k613l189Q84J929L100K000
13036A9855k281l32k605m870Q81L511L109K256j53k77m781m213L221L535M44J09
$$ plain form
13147 8413 7878 9495 8414 10596 9561 9232 8542 8276 2713 1207 2796 6188 9701 6522 4235 2495
13131 2495 3583 1680 1920 628 -2947 -5099 307 4115 2308 -409 -1526 2340 5585 6818 4610
13116 4610 2989 1990 1308 380 -1112 1162 3470 4583 6382 6910 6535 8157 9000 5850 7324 7599
13100 7599 5261 1627 558 339 -2532 -4205 -5178 -2955 -2984 -2070 217 3227 2912 298 209 -2857 -3618
13083 -3618 -724 1814 2325 2029 1208 889 2965 6308 4331 2037 82 -3376 -5999 -6300 -6437 -4126
13067 -4126 -991 -4337 -6491 -10636 -7887 953 1722 -4623 -11366 -10962 -7587 -1883 3053 5198 4759
13052 4759 5034 3925 3352 5019 7262 10907 11584 12705 19996 17744 15131 11942 12826 14755 17855 19855
13036 19855 17574 17242 14637 9767 10648 14159 17268 19524 19371 19094 14313 10100 13321 16856 17300 17409
13020A7409J10j762k976k740R68K686J746Q146M589L711J1297J3108J1431Q345
13006G6068J2228R903M805n13n620p466m448O42q280j8124j5608j5804q005n043
12992A4735j588j902j557j192j377j978J857J76k781J219Q89o6L66O3k30j511
12976E123Q10J592R9l217m241l339l44L963L946J684J894n73l680p44o14k377
12960a8K511j73r95N406K889R41J662k973o340o104m889k453l462l100j305j306
12944a9709P604J2958N413P24J416L403N921Q180n70l509J084L686L673k845K978
12929C0407K700l269k197j683k779L485N761J692m364m816Q12J896k48L73k86
12914B7484l317m632p62J711J317O17L66l919p319l410L634L249L045M629K092
$$ plain form
13020 17409 17519 15757 12781 10041 11009 13695 15441 23587 28176 31887 43184 56292 67723 76068
13006 76068 88296 98199 103004 102491 96871 89405 84957 85599 77319 59195 43587 27783 19778 14735
12992 14735 13147 11245 9688 8496 7119 5141 6998 7174 4393 5612 6501 6435 6801 6864 6634 5123
12976 5123 5933 7525 7624 4407 166 -3173 -3517 446 4392 6076 7970 7397 3717 2973 2359 -18
12960 -18 2493 2320 1325 6731 9620 10561 12223 9250 2910 -3194 -8083 -10536 -13998 -17098 -18403 -19709
12944 -19709 -12105 853 6266 6990 8406 11809 17730 25910 25340 21831 22915 26601 30274 27429 30407
12929 30407 33107 29838 27641 25958 23179 26664 32425 34117 29753 24937 25749 27645 27397 27770 27484
12914 27484 24167 19535 18773 20484 21801 22418 22784 18865 11546 8136 11770 15019 18064 22693 24785
12899B4785k219k764N57Q964J0068K709J724R11K206O821N05j634J315N141P863
12884F6952Q670Q845J3949J4597Q650M214k480K647M568P364o36r606j0283q977
12870A08474j0243r914m632l512l622m801j795o55k652L886M035N436r24j290
12856G7791P41L338J848K714n79J555J319K34k586k351m515M23k632q78j40J437
12840G7719K304L970M791L220L801L108K262P191K518M755P119Q618Q889O808
12826A47073N567O576J1446Q974J0702J6545Q230j008j646m52K056M317P826L190
12812B29396l996k250P07m59N017J0629J1659J2039R283M155L624O139J5499K1243
12798C22685J7314J8714K4076K2017K1302K0417K1314K5811L3677L5062L8170
$$ plain form
12899 24785 22566 19802 20359 29323 39391 42100 43824 44735 46941 53762 54267 52633 53948 59089 66952
12884 66952 75622 84467 98416 113013 121663 125877 123397 126044 130612 137976 137340 127734 117451 108474
12870 108474 98231 88317 83685 80173 76551 71750 69955 69300 66648 70534 74569 80005 79081 77791
12856 77791 78532 81870 83718 86432 85853 87408 88727 88961 86375 84024 79509 79932 77300 76422 76282 77719
12840 77719 80023 83993 88784 92004 95805 98913 101175 108366 110884 115639 122758 131376 140265 147073
12826 147073 152640 159216 170662 179636 190338 206883 215113 214105 212459 212007 214063 218380 226206 229396
12812 229396 225400 223150 223857 223398 228415 239044 250703 262742 272025 276180 279804 285943 301442 322685
12798 322685 339999 358713 382789 404806 426108 446525 467839 493650 527327 562389 600559
12787F00559M0012M8449N4589O0735O5993O0534O3105P3883Q9021J08738J28327
12776A393945J45120J50842J60104J94286K55910L43706M38609M83814M55281
12767D021617M46900N33500O61719Q13590J038844J331082J778544K572960L891113
12758A7089869O108681R910180J5657065K2140840K5032217J7155994j295313
12751A11799533j4233922r619222M159894J3214985Q439879r701141k5259677
12744G8800329k5699938j7504894j0341868o201753m021664k843744k074451j468218
12736H643799j029199q15615p63213p35546o42903m84650l76980l81799m25202
12727B988692m05669l33521k57915j93263j37047j03043r9999j02020r4440q6063
$$ plain form
12787 600559 640571 689020 743609 804344 870337 930871 993976 1067859 1156880 1265618 1393945
12776 1393945 1539065 1689907 1850011 2044297 2300207 2643913 3082522 3566336 4021617
12767 4021617 4468517 5002017 5663736 6477326 7516170 8847252 10625796 13198756 17089869
12758 17089869 23198550 33108730 48765795 70906635 95938852 113094846 111799533
12751 111799533 97565611 87946389 92106283 105321268 113761147 104060006 78800329
12744 78800329 53100391 35595497 25253629 19051876 15030212 12186468 10112017 8643799
12736 8643799 7614600 6798985 6035772 5300226 4657323 4172673 3795693 3413894 2988692
12727 2988692 2583023 2249502 1991587 1798324 1661277 1558234 1458235 1356215 1261775 1175712
12717A175712p4820n7880m5653m2714m3598m5475m5010l9130l2790l7365l4590
12706F76687l0245k5532j9574j5777k2231k0830k1871k2966j9461k2437k2985
12695D32778j7977j5177q403j1722j7709j7825j8504k3511j6294j0964j2057j2694
12683B49941j2331j5287j6444j1368p362K287O066L821L42k718m672K535L084
12670A97894m53k589r00k041j106q5k82m757o297k061m74j136j828m143q137p140
12654A54465p579m588n586r212n702J246J928n239m345k252j783J409L565l554
12640A12773o080j515O697L14k885m315p398k503J438J940M486jj933N30LK901
12624A04452O352N932n042r237k699k653k245j791l207n471p247j322k991j079
$$ plain form
12717 1175712 1100892 1043012 997359 954645 911047 865572 820562 781432 748642 711277 676687
12706 676687 646442 620910 601336 585559 563328 542498 520627 497661 478200 455763 432778
12695 432778 414801 399624 391221 379499 361790 343965 325461 301950 285656 274692 262635 249941
12683 249941 237610 222323 205879 194511 187149 189436 195502 199323 199665 196947 192275 194810 197894
12670 197894 197441 194852 193952 191911 190805 190720 190438 185681 179384 177323 176849 175713 173885 169742 161605 154465
12654 154465 146886 142298 136712 127500 121798 123044 124972 119733 115388 113136 111353 112762 116327 112773
12640 112773 106693 105178 111875 112189 109304 104989 97591 95088 96526 98466 102952 102951 101018 101548 101551 104452
12624 104452 110804 116736 111694 102457 99758 97105 94860 93069 89862 84391 77144 75822 72831 71752
12610G1752J568j330n245l969k629K640L685N239O284M229l754o829K770Q586
12596H2997L153L052j165o555o895m720J014K936k827k394m976l222j229l809
12582E5360j675q41j008j588j542M94o55L35j657Q62O56j108L889J483n081k875
12566D5049k129l64l61K711N671L387L109j207k45M636O013N505Q96k207m162
12551F6302j608l205k241p544n297k220J700K093n64k640k59O63r72o17o36M150
12535D7105K526k058j270J687l68j20j989q13O90j824n683M554K597J629l830
12520D2833n541L19L103J033J429p10J146N313K427J143j298m773k416M81k378
12505D2111l44L733M772M174l288m135o301k451L379N93l372k345l887J437K980
$$ plain form
12610 71752 73320 71990 66745 62776 60147 62787 66472 71711 77995 82224 78470 71641 74411 82997
12596 82997 86150 89202 88037 81482 74587 69867 70881 73817 70990 68596 63620 60398 59169 55360
12582 55360 53685 52844 51836 50248 48706 49200 48545 48880 47223 48085 48741 47633 51522 53005 47924 45049
12566 45049 42920 42556 42195 44906 50577 53964 57073 55866 55621 60257 66270 71775 72671 70464 66302
12551 66302 64694 61489 59248 51704 46407 44187 45887 47980 47416 44776 44517 45180 44208 43591 42955 47105
12535 47105 49631 47573 46303 47990 47622 47502 45513 44700 45390 43566 37883 42437 45034 46663 42833
12520 42833 37292 37611 40714 41747 43176 42466 43612 48925 51352 52495 51197 46424 44008 44489 42111
12505 42111 41767 45500 50272 54446 51158 47023 40722 38271 41650 42243 38871 36526 32639 34076 37056
12490C7056j569q27R02k211l235j07J5K864r10o941p05J621L285k262l550m59
12474B2967L541N25J022p75j117k347j608K614J701k304q52J90r09k059j975n42
12458A8072j278l754j966J997N869P128L179j181k399k193j567R32p40R57N693
12443B8749M205K949J314M41o007k225j034J123L823P46j499J081Q05j61l887
12428C0423J270j056k437j767L37P00j508k033j445n108k182K027N673L343r00
12413B5337k48K133p25k089j201k957N64L478K032k44l29L438l02k93p31j894
12397B5969j542l380p17Q27j149n26K123L513K794k852k323L16m86k531j292j970
12381A6774k54k726j378R39N449K536j016m394m028J402K24K33L854O720j48m26
$$ plain form
12490 37056 35487 34660 35562 33351 30116 30009 30024 32888 31978 25037 24332 25953 29238 26976 23426 22967
12474 22967 26508 27033 28055 27280 26163 23816 22208 24822 26523 24219 23367 23557 22648 20589 18614 18072
12458 18072 16794 13040 11074 13071 18940 26068 29247 28066 25667 23474 21907 22839 22099 23056 28749
12443 28749 32954 35903 37217 37658 31651 29426 28392 29515 33338 34084 32585 33666 34471 34310 30423
12428 30423 31693 30637 28200 26433 26770 27470 25962 23929 22484 17376 15194 17221 22894 26237 25337
12413 25337 25089 27222 26497 24408 23207 20250 20814 24292 26324 26080 25751 29189 28887 28594 27863 25969
12397 25969 24427 21047 20330 21157 20008 19482 21605 25118 27912 25060 22737 23053 22567 20036 18744 16774
12381 16774 16520 13794 12416 13355 18804 21340 20324 15930 11902 13304 13528 13761 17615 24335 24187 23761
12365B3761l003j744L018R61M762J0811J5101J5499J2179j3943k0254q843k912
12352C5393P03k312o15P22M14r56L779Q15l73m11m608j222k853l251n11J553R82
12335B7249M015L837L872L733N369Q416O208Q500R671J5499K8719M4485P1429
12322B41002J08247J40826J29018M7730n0703p1961j2013N3733O1552r018j16340
12311E22073j51275j20150p3628m0790k7456k0005j5387j0447o033m852o751j476
12299D3823j37l125N77n336q671o458P79K457K307L89k818k73j41j331J830L092
12283B6964L67J924K38o334n287k372K32P6r37K530m947m288l629j310M48j514
12267B161K244K967J074k79K7k40j424n08J605K127Q05j61J038n63K109M63j468
$$ plain form
12365 23761 20758 19014 22032 22993 27755 38566 53667 69166 81345 67402 47148 38305 35393
12352 35393 36096 33784 33169 33891 34305 33349 37128 37943 37570 37159 32551 31329 28476 25225 24714 26267 27249
12335 27249 31264 35101 38973 42706 48075 56491 62699 71199 80870 96369 125088 169573 241002
12322 241002 349249 490075 619093 666823 616120 544159 532146 585879 647431 638413 522073
12311 522073 370798 250648 177020 136230 108774 88769 73382 62935 56902 52050 45299 43823
12299 43823 43686 40561 41138 35802 27131 20673 21452 23909 26216 26605 23787 23514 23373 22042 23872 26964
12283 26964 27331 29255 29493 23159 17872 15500 15732 15808 14871 17401 12454 8166 4537 3227 3675 2161
12267 2161 4405 7372 8446 8167 8194 7954 6530 6022 7627 9754 10559 10398 11436 10873 12982 13445 11977
12250A1977J727K766j657n450p46p47j505k163K536J174N86j641j603p08p73J918
12234E691M466p62m90m65l634L56P98j142R77M220K351l938k534j950k504K054
12218C494J860j066M177K413m392J560K570k553j541q85L357P08n025k661J40
12203B156j343M51L607j078J222k658j146J655K936J377o149m895q71L003L778
12188B045K685o35O12N00J355m35K223O00j191Q14l854N01j523Q11l94P60j623
12171C251R66k60K886J220j519Q89O49j413m67L03R40K62j406k139O73J534L673
12154A0042J922j949l654k47j238R63j147l31M064K173j29K323m54l697m296l55
12138C990N22l884j980K620j33k729R05K604L487K313j533k173M23R02k075o828
$$ plain form
12250 11977 13704 16470 14813 9363 8617 7870 6365 4202 6738 7912 8498 6857 5254 4546 3773 5691
12234 5691 10157 9395 8905 8440 4806 5162 5960 4818 5795 10015 12366 8428 5894 3944 1440 3494
12218 3494 5354 4288 8465 10878 6486 8046 10616 8063 6522 5637 8994 9702 4677 2016 2156
12203 2156 813 1264 4871 3793 5015 2357 1211 2866 5802 7179 1030 -3865 -4736 -1733 2045
12188 2045 4730 4095 4707 5207 6562 6127 8350 8950 7759 8573 4719 5220 3697 4508 4114 4874 3251
12171 3251 4217 3957 6843 8063 6544 7433 8082 6669 6202 6505 7445 7707 6301 4162 4835 6369 10042
12154 10042 11964 10015 6361 6114 4876 5839 4692 4361 8425 10598 10469 12792 12338 8641 4345 3990
12138 3990 4512 628 -1352 1268 1135 -1594 -689 1915 5402 7715 6182 4009 4432 5334 3259 -3569
12122c569J371M184L321J332l729p31L644J99o62O278l33L124J404j482m790j710
12106G851J969K586k176m222k361J646K14J753L501O5j26P8p78J576l081l908
12090D587j481J403N14o63k698k349K454M049q33J972M14k701m638J035K018J521
12074D604j580N29l96M46J267j615K143K998j560j632L831k021l303j639o4k622
12058f14j059K397L190J237k755J285K660j136k955N54m98J324K75l846P44Q32
12042A635J427K135j037K738L560p20k164n32J178j814p90P80P94N29l55K082
12026I446n66N40J417l46j897l785j87j867j951o48k86k184l68J768L566J978
12010D630j019j999K773J171l60J188m07m933J23L612M472N7j797l205M23P22
$$ plain form
12122 -3569 -2198 1986 5307 6639 2910 2179 5823 6022 5360 11638 11305 14429 15833 14351 9561 7851
12106 7851 9820 12406 10230 6008 3647 5293 5507 7260 10761 10826 10700 10778 10000 11576 8495 4587
12090 4587 3106 4509 5023 4360 1662 -687 1767 5816 4983 6955 7369 4668 30 1065 3083 4604
12074 4604 3024 3553 3157 3603 4870 3255 5398 8396 6836 5204 9035 7014 3711 2072 2008 -614
12058 -614 -1673 724 3914 5151 2396 3681 6341 5205 2250 2804 2306 3630 3905 59 803 1635
12042 1635 3062 5197 4160 6898 10458 9738 7574 7042 8220 6406 5616 6396 7190 7719 7364 9446
12026 9446 8880 9420 10837 10491 8594 4809 4622 2755 804 156 -130 -2314 -2682 -914 2652 4630
12010 4630 3611 1612 4385 5556 5196 6384 5977 1044 1167 4779 9251 9308 7511 4306 4729 5451
11994E451k062P84o82k916Q21L58L430J494J370M89j299J470K47l391j106K521
11978F979L952O22k982k784m45j937j897j289P58j076j015R09J801K38l941o77
11962b784M462J280p67k330j389J658j390J223j155M32K290q26k634J653L772
11947C495j099j414K070L468l452k502K90k385j452J341J607K53k521l844J006
11932e139K511J823K732j081m937R40K969L913K631r18q91K391l660j633J05K903
11916D659R95p61p034r92m43J352M597L37J288J83k53j213J772k666J617L914
11900G352k324j484k754J4J734p79k214K56M082M540j388l005Q19O63J588J173
11884H273m717k545O80r37O06j46M53K697j597k471J669q17q52l34N09K51p23
$$ plain form
11994 5451 3389 4173 3491 575 1396 1754 5184 6678 8048 8537 7238 8708 8955 5564 4458 6979
11978 6979 10931 11553 8571 5787 5342 3405 1508 219 977 -99 -1114 -205 1596 1834 -2107 -2784
11962 -2784 1678 2958 2191 -139 -1528 130 -1260 -37 -1192 -760 1530 704 -1930 -277 3495
11947 3495 2396 982 3052 6520 3068 566 856 -1529 -2981 -1640 -33 220 -2301 -6145 -5139
11932 -5139 -2628 -805 1927 846 -4091 -3151 -182 3731 6362 5444 4553 6944 3284 1651 1756 4659
11916 4659 5654 4893 -2141 -3133 -3576 -2224 2373 2710 3998 4181 3928 2715 4487 1821 3438 7352
11900 7352 5028 3544 790 804 2538 1759 -455 -199 3883 8423 7035 4030 4849 5512 7100 8273
11884 8273 3556 1011 1691 754 1360 1214 1667 4364 2767 296 1965 1148 296 -38 471 722 -1
11867ak397M2J841J088R10M73K403L728J452l110j422L078j697j671j202l60K549
11850E704J249j166J533m444k398K837J866J567J218J71l97q66J280K683j123
11835I714k147l395k862K987L295N31R50J875Q695J1554J0757m303j1407j1811
11821A4433p526m184j178K559R86o06K636R08k582j266L293L968O318J6002J7744
11806E1505K6868J1672k6119k7655j5483p880j595O1q39K444j372j505j660K32
11792H674j545k912j356J564r56j390J948J595J240p24j94L937k78L20j450l871
11776D602j951l92J569o8J166J186k12K65N14p86m054L14q38M81J397R18j586
11759B525J741k729k147J124K005M702J987j313J182m094m131j183L564K363o59
$$ plain form
11867 -1 -2398 -2356 -515 573 1483 1956 4359 8087 9539 6429 5007 8085 6388 4717 3515 3155 5704
11850 5704 6953 5787 7320 2876 478 3315 5181 6748 7966 8137 7740 6874 8154 10837 9714
11835 9714 7567 4172 1310 4297 7592 8123 9073 10948 19643 31197 41954 37651 26244 14433
11821 14433 6907 2723 1545 4104 5090 4484 7120 8028 5446 4180 7473 11441 17759 33761 51505
11806 51505 78373 90045 63926 36271 20788 12908 11313 11374 10535 12979 11607 10102 8442 8674
11792 8674 7129 4217 2861 4425 3469 2079 4027 5622 6862 6138 5944 9881 9603 9923 8473 4602
11776 4602 2651 2259 3828 3760 4926 6112 5900 6165 6679 5893 1839 2153 1315 1796 3193 4111 2525
11759 2525 4266 1537 -610 514 2519 7221 9208 7895 9077 4983 852 -331 3233 5596 4937
11744D937p77j678m142j475J752q03Q86Q57j562K56M186J009l106k022J892Q91
11728A101j367J053J928Q11l081m817J279J996O18J534l35j529o57Q29p45j012
11712b394l3K142K130J122J497L00j308k11m72m688k865J339Q07K598K033Q68
11696B865j271j201J064K113K469j623n071J085J950R93k644j371o03J34J782
11681F71P1M87n00k386N61J538j142K074q8j060M368q20n668n430O82K945j295
11664d992J710L943j551k009J707L052j372k578L268K569k240k910l38L070K503
11649C832O16k074J057J707J717J74k726P91O56r18k749j177n01M115j880R67
11633C607Q54p64l213j116L80K723m1j079m150J696J089L42L254J790K178m460
$$ plain form
11744 4937 4160 2482 -1660 -3135 -1383 -2186 -1300 -443 -2005 -1749 2437 3446 340 -1682 210 1101
11728 1101 -266 787 2715 3526 445 -4372 -3093 -1097 -479 1055 720 -809 -1466 -637 -1382 -2394
11712 -2394 -2427 -285 1845 2967 4464 4764 3456 3245 2773 -1915 -4780 -3441 -2634 -36 1997 2865
11696 2865 1594 393 1457 3570 6039 4416 -655 430 2380 3373 729 -642 -1245 -1111 671
11681 671 742 1229 729 -1657 -1096 442 -700 1374 1286 226 4594 3774 -1894 -7324 -6642 -3697 -4992
11664 -4992 -3282 661 -890 -2899 -1192 1860 488 -2090 1178 3747 1507 -1403 -1741 1329 3832
11649 3832 4448 2374 3431 5138 6855 7029 4303 5094 5750 4832 2083 906 405 4520 2640 3607
11633 3607 4461 3697 484 -632 -252 2471 2430 1351 -2799 -1103 -14 328 3582 5372 7550 3090
11617C090q08n89k399O10K137m91q59l038J69J614J070N10n10J693j59Q32K315
11600E187m220k30m98n78J991K898j907j416J786J479O00k715k084j287j266K464
11584B04K529J646l899m027P67Q00j520J917K316K661k337N95K167m539n461k46
11568f427o98J26M022K019M15J751j718j320p17J509K101j493k253m752l766K863
11552h338K018K140L947L35k338j113j968M521K034r38L80J01k483n43L577K269
11536C601r21l456R8K920K478k332k396j714l27L182l611J015J377J132k764J674
11520d4L942p62n12k21J763K999j289o55j131P33l37l385l19L073j878m65k693
11503a181N24j29M099K745m03j282j174j155j227j398K32Q22J451l096k653L712
$$ plain form
11617 3090 2282 1693 -706 -96 2041 1550 691 -2347 -2178 -564 506 1016 506 2199 2040 2872 5187
11600 5187 967 737 239 -339 1652 4550 2643 1227 3013 4492 5092 2377 293 -994 -2260 204
11584 204 2733 4379 480 -3547 -2780 -1980 -3500 -1583 733 3394 1057 1652 3819 -720 -6181 -6427
11568 -6427 -7125 -6999 -2977 -958 -543 1208 -510 -1830 -2547 -1038 1063 -430 -2683 -7435 -11201 -8338
11552 -8338 -6320 -4180 -233 102 -2236 -3349 -5317 -796 1238 300 680 781 -1702 -2245 1332 3601
11536 3601 2680 -776 -678 2242 4720 2388 -8 -1722 -2049 1133 -2478 -1463 -86 1046 -1718 -44
11520 -44 3898 3136 2624 2403 4166 7165 5876 5221 4090 4823 4486 1101 782 3855 1977 1512 -1181
11503 -1181 -657 -786 3313 6058 5655 4373 3199 2044 817 -581 -349 473 1924 -1172 -3825 -113
11487a13J39j097J42R41j601L991K578k318k295K139j152o8J826r1J692r82k599
11470A132K38K291N48J935k628l409Q71j130l740J833K594P51J163M231J654l701
11454D633m792k464K003K276N01K008M01l843J333L75J220K170P35j096M30k210
11438C680l207j042L296L040K329K657n78k012j637j416p10m06q55j772J687L201
11422F255K044n144l658M081L35J315J027p050l788K808n85P88L259J409j190
11407A906j591o17O34K028j764j05p35j425j649m383J844R95P06m34N072L847
11391D329k757j756R70O5J687K456J309m93j211K168L230m69k010J155o30m606
11375C437m111P36J070l10j995k405Q13K302J416K805K986M27J163L087M332j158
$$ plain form
11487 -113 26 -1071 -929 12 -1589 2402 4980 2662 367 2506 1354 1286 3112 3021 4713 3731 1132
11470 1132 1370 3661 4209 6144 3516 107 978 -152 -3892 -2059 535 1286 2449 6680 8334 4633
11454 4633 -159 -2623 -620 1656 2157 4165 4566 723 2056 2431 3651 5821 6556 5460 5890 3680
11438 3680 473 -569 2727 5767 8096 10753 10175 8163 6526 5110 4400 3994 3139 1367 3054 6255
11422 6255 8299 3155 -503 3578 3913 5228 6255 -795 -4583 -1775 -2360 -1572 1687 3096 1906
11407 1906 315 -302 332 2360 596 491 -244 -1669 -3318 -7701 -5857 -4862 -4156 -4590 482 4329
11391 4329 1572 -184 786 851 2538 4994 6303 5810 4599 6767 9997 9528 7518 8673 8043 3437
11375 3437 -674 62 1132 822 -1173 -3578 -2765 -463 953 3758 6744 7171 8334 11421 15753 14595
11359A4595n460n747l229j961M48Q55L01l231J530J223J154L133m83o18j857j426
11343g73R33J143K394K002m06j010K5j110l624j228K941k75j24J566J299j919
11327A834j465J17K486M653j292j324j228P08M651p2j523p36J231j032k177M754
11311I585K795L053K080k600k953k505K762m68n794k556K058R48R26k42P62n25
11295G326L26l068N96J017o05K495j291J036J398K021k867j50K698n35J158M93
11279A2048m423l042K037M39K132R21l664J990m36P13k925o552m885J838k936
11264f745l67M302L08m098j011m071L674R253P915K794K569j595n006j486m27
11249F009L020L356N377K306m169l489r53J753j707n595J327K534j64O45K995
$$ plain form
11359 14595 9135 3388 159 -1802 -1354 -499 -198 -3429 -1899 -676 478 3611 3128 2510 653 -773
11343 -773 160 1303 3697 5699 5293 4283 4308 3198 -426 -1654 1287 1012 888 2454 3753 1834
11327 1834 369 486 2972 7625 6333 5009 3781 4489 9140 9068 7545 6809 8040 7008 4831 9585
11311 9585 12380 15433 17513 14913 11960 9455 12217 11749 5955 3399 5457 6405 7331 7089 7851 7326
11295 7326 7652 4584 5180 6197 5592 8087 6796 7832 9230 11251 8384 8234 10932 10397 11555 12048
11279 12048 7625 4583 6620 7059 9191 10112 6448 8438 8002 8715 5790 -762 -5647 -3809 -6745
11264 -6745 -7112 -2810 -2502 -6600 -7611 -11682 -8008 1245 9160 11954 14523 12928 7922 6436 6009
11249 6009 9029 12385 17762 20068 15899 12410 11457 13210 11503 5908 7235 9769 9605 10250 13245
11234A3245N570O730J628P96k902j499K672M061N489Q563N705R567Q612J2788
11220H1025K0605L1378L9433O2170J03679J75162K80543M03355M60223K74456
11210A932029k21545n37778m47147k62416j42716q8470n6086l6801k8630k2537
11200H7903j7421p158r354r383o864m008n909o082l735m15L722j63J116L835L289
11185B9373l682o465n649j0k228m51K977Q42o72k374K386L1n252l746p88j01m8
11168D143P23N831J166k0l329M92M775J851n352m136k078q90j413J251L382K295
11152H691j238m68j125n172k937k137k588k026J032r63j183P615P696J726j008
11137E915j995m75K10K299J007N680J913m006p233m638l16N218p98m156n046l518
$$ plain form
11234 13245 18815 25545 27173 27969 25067 23568 26240 30301 35790 44353 50058 59625 68237 81025
11220 81025 101630 133008 172441 234611 338290 513452 793995 1197350 1657573 1932029
11210 1932029 1710484 1172706 725559 463143 320427 231957 175871 139070 110440 87903
11200 87903 70482 63324 53970 44587 37723 33715 27806 21724 17989 17574 21296 21133 22249 26084 29373
11185 29373 25691 19226 13577 13567 11339 10888 13865 14707 14035 11661 14047 14078 8826 5080 4292 4191 4143
11168 4143 4866 10697 11863 11843 8514 9006 13781 15632 10280 6144 4066 3176 1763 3014 6396 8691
11152 8691 7453 6985 5860 688 -2249 -4386 -6974 -9000 -7968 -8931 -10114 -2499 5197 6923 5915
11137 5915 3920 3445 3655 5954 6961 12641 14554 10548 3315 -1323 -1639 3579 2781 -1375 -6421 -9939
11121i939k406j20M769L149J283m835J009R307P890N398k149o518q587m353j52
11106f254O793R644N744P508Q312Q880R381J2670J3832J3772L736k143K857n83
11092I4149o929j9524j6426j1690l188P88l066j870k56j223k90J014O09j144j370
11077B9584K13n813o123o922l717k048j223Q962K680r75m41O181R376J1689J3720
11062E5143J7836J9026L1938L9880K5241J1511K5628R038l8400n5444m3548k7218
11050G0631j6817j4869j3275r737p755m262l814k203K838P050L246J418j43j570
11036A0738m626k374N126K059K44K692J662o50j480j890m372m684j495k568j247
11021b865k743M218K880L505L604M32K659K056m042j132r96L971Q428J487K07
$$ plain form
11121 -9939 -12345 -12465 -7696 -4547 -3264 -8099 -7090 2217 10107 15505 13356 6838 -1749 -6102 -6254
11106 -6254 539 10183 15927 23435 31747 40627 50008 62678 76510 90282 94018 91875 94732 94149
11092 94149 87220 67696 51270 39580 36392 37180 34114 32244 31988 30765 30475 31489 32098 30954 29584
11077 29584 29797 23984 17861 10939 7222 5174 3951 12913 15593 14618 14177 20358 29734 41423 55143
11062 55143 72979 92005 123943 163823 189064 200575 226203 235241 196841 141397 97849 70631
11050 70631 53814 38945 25670 15933 8178 3916 102 -2101 737 7787 11033 12451 12308 10738
11036 10738 6112 3738 8864 10923 11167 13859 15521 14871 13391 11501 7129 2445 950 -1618 -2865
11021 -2865 -5608 -1390 1490 4995 8599 9031 11690 13746 9704 8572 7576 11547 19975 21462 21669
11006B1669j016m679n999o996r570r327j0134m647n421j841M810K1458L2385L4228
10992E4920J2939j505n335n074o804l830p137n008m456l255J017N148N581Q313
10978D5514M892l4J247m430k973n497l491j017j675l472M470M650L6M53o240q684
10962B3749o554r8M599P902O257o027j4312j1671L342J5709J8179J3016M782J019
10948E9892m6N706J1761R726N831L728j998p506o865m726k594M519J1407K1158
10934A09993L4702M2943M4934L6667Q803j3395l2658l1970k4571k0992j3525r941
10922A30990j1128l543o744j062L03j211n400n748o836l151Q061J1264R951Q746
10908A24492R253M402J717n630n170q366n560j509L422L055q36j946J049l191
$$ plain form
11006 21669 20653 15974 9975 2979 -6591 -15918 -26052 -30699 -36120 -37961 -33151 -11693 20692 54920
10992 54920 67859 66354 61019 55945 49141 45311 38174 33166 28710 25455 26472 31620 37201 45514
10978 45514 50406 50372 51619 47189 44216 38719 35228 34211 32536 29064 33534 38184 38220 38673 32433 23749
10962 23749 17195 17097 21696 29598 35855 29828 15516 3845 7187 22896 41075 54091 58873 59892
10948 59892 59846 65552 77313 87039 92870 96598 94600 87094 80229 75503 72909 77428 88835 109993
10934 109993 144695 187638 232572 269239 278042 264647 231989 200019 175448 154456 140931 130990
10922 130990 119862 116319 109575 108513 108816 107605 102205 96457 89621 86470 94531 105795 115746 124492
10908 124492 133745 138147 139864 134234 129064 120698 115138 113629 117051 120106 119270 117324 118373 115182
10894A15182q94K249J4447J8581J6724J5475K2385K2762K6009L7578L8832O770
10882C36100m4896m2920j1251P702J8567K2271K3044J2269L424J0623J6261R171
10870C60365n843k2476k5504j9374q179N940K8207L0952J8054N38q494j1872q866
10857C33448J1312K7213L6460L1460K0623J7269J9585K1877K7301M0189N5522
10846F42259O8742N6441K1949J5534L0895L6239N2230N7268N7565Q1624J11847
10835A232593J32415J46945J50008J56769J64137K21120L36529N03945O81083
10826C725544P07521L31109j97348k72412k2703K22276M32819O05234P45771R17723
10816G195534J192664J594520K130188K812118L699201N015955P421051J1889982
$$ plain form
10894 115182 114288 116537 130984 149565 166289 181764 204149 226911 252920 290498 329330 336100
10882 336100 291204 248284 237033 244735 263302 285573 308617 320886 324310 334933 351194 360365
10870 360365 354522 332046 306542 287168 278989 284929 313136 344088 362142 362680 354186 342314 333448
10857 333448 344760 371973 408433 439893 460516 477785 497370 519247 546548 586737 642259
10846 642259 711001 767442 789391 804925 835820 872059 924289 981557 1039122 1120746 1232593
10835 1232593 1365008 1511953 1661961 1818730 1982867 2203987 2540516 3044461 3725544
10826 3725544 4433065 4764174 4566826 4294414 4271711 4493987 4926806 5532040 6277811 7195534
10816 7195534 8388198 9982718 12112906 14925024 18624225 23640180 31061231 42951213
10808D2951213J9716953L2851157N1552561O9501432P0830250K9703888m6402271
10801B70705183q5942175o8339143m0389222k3373781j4184969r090629o180140
10794B3205124m440407l354958k560478j940984j523562j248739j021440q08934
10786F305622o43816n50397m64882l25737j35601O7600K31757J13748m01926p41545
10776C454823o37394m32496k87883j87995j23876q2787p7352q2122r0680r2378
10766A359860p8236o0626n6291n4083n3926m7334l8266k8773l2136m1328m5927
10755H22934m2920l5032k7329j9446j1955j2558k0565l2138l9331m0313l1445
10744E09902k2636q230N395m781k0703l6209m9375m7155l8105j7236j211L589
$$ plain form
10808 42951213 62668166 95519323 147071884 216573316 287403566 317107454 270705183
10801 270705183 184763008 116423865 76034643 52660862 38475893 29385264 23205124
10794 23205124 18764717 15409759 12849281 10908297 9384735 8135996 7114556 6305622
10786 6305622 5661806 5111409 4646527 4320790 4185189 4252789 4484546 4598294 4196368 3454823
10776 3454823 2817429 2384933 2097050 1909055 1785179 1702392 1625040 1542918 1452238 1359860
10766 1359860 1281624 1220998 1164707 1110624 1056698 1009364 971098 942325 910189 868861 822934
10755 822934 780014 744982 717653 698207 686252 673694 653129 620991 581660 541347 509902
10744 509902 487266 479036 484431 479650 458947 422738 373363 326208 288103 270867 269656 273245
10732B73245K74o517j283J0422J4542R976Q463R551m539j2439j2855j5036j5477
10719B58327o366K055O663J1252R636J062n625j1682r620j0918j1474p124p816
10706B18370o279j785l627j4568j5521j5012q634k102N521P230K049P024N650
10693A78316K263o142r732m551k482j155m77J158k600k953J537L326J1355J5346
10679A83209N094k6385k0248N183J0276L578o075r61K385l793m093j1610j5078
10666A21482j4093j6703q864j578N543R836P672p63k554k505j513O551J2685J7285
10652A32481J2739k008j7169j4596j84J1003J3943L588j0072j7878j3962r835
10640H8050j554J895P384l13o829n776m27j945l118n971r106n339L97P542J0385
$$ plain form
10732 273245 273519 267002 265719 276141 290683 300659 309122 318673 314134 301695 288840 273804 258327
10719 258327 251961 254016 260679 271931 281567 282629 277004 265322 255702 244784 233310 226186 218370
10706 218370 212091 210306 206679 192111 176590 161578 152944 150842 156363 163593 165642 172666 178316
10693 178316 180579 174437 164705 160154 157672 156517 156040 157198 154598 151645 153182 156508 167863 183209
10679 183209 188303 161918 141670 146853 157129 160707 154632 153671 156056 152263 148170 136560 121482
10666 121482 107389 90686 81822 80244 85787 95623 103295 102532 99978 97473 95960 102511 115196 132481
10652 132481 145220 143212 126043 111447 111263 122266 136209 139797 129725 111847 97885 88050
10640 88050 86496 88391 95775 95462 88633 82857 82430 80485 77367 71396 62290 56951 57348 64890 75275
10625G5275O682K27R16Q23l017q269r694q523k470j690o793n7J7700K7821L1288
10610A20219J8257Q4n420r620q617p816r941j2721m626j391l317p37j713j119
10596G1522K494j721o320m127M541O639L163K143n8O010O398k628o547n606l297
10581G2606n302p056n035k089l10J502J431M254L121M145M454p61l676n98J684
10566F8370j092L923M504N403J98j0257r604k966n442n721k764J931J0478J8011
10552G4972Q847j0918k1424j4803p905L07J986L370O227L212M804K425M98J164
10538E2762l797J545L589K453k322m725r61o134r117k340j194j008k432J409L149
10523C0877K515j32k310m159k284J363J156l08n193k066m75j188L257M823M652
$$ plain form
10625 75275 81957 82184 83100 83923 80906 72637 62943 54420 51950 50260 43467 43410 61110 88931 120219
10610 120219 138476 138560 133140 123520 114903 107087 97146 84425 79799 78408 75091 74354 72641 71522
10596 71522 74016 72295 65975 61848 66389 73028 76191 78334 78276 84286 90684 88056 81509 75903 72606
10581 72606 67304 60248 55213 53124 52814 54316 55747 60001 63122 67267 71721 70960 67284 66686 68370
10566 68370 67278 71201 75705 81108 81306 71049 61445 58479 53037 47316 44552 46483 56961 74972
10552 74972 83819 72901 51477 36674 28769 29076 31062 34432 40659 43871 48675 51100 51598 52762
10538 52762 48965 50510 54099 56552 54230 49505 48544 42410 33293 30953 29759 28751 26319 27728 30877
10523 30877 33392 33260 30950 26791 24507 25870 27026 26718 21525 19459 18984 17796 21053 25876 30528
10508C0528K298pl147l157K99N692P690Q766N041j532n563j0284o203J292M561
10493C6274O452O046N097J748m565M29O40k429r55l933k473n506j856J721l6O53
10477C7307m68j515j387k62L063L032M092n366j225j072l696J553J519M17M902
10462D0894K599L28K597j89j86k519q408o363J433K614j209K177l68k734n77m754
10446B5335j628PJ673j131J12J51J995j191K096k233K380J459K742O06J773M816
10430C8962p69J486m895l184m76L549P30n185m436k066N193M097J754J866L250
10415C9876M595L752M836J747k321n194l058j623R42O66k013J573P309J0445J4234
10400G5766J7349J6901K2101L5184M9575P7364J37309K28412L51828M57929L66406
$$ plain form
10508 30528 32826 32819 29672 26515 26814 32506 40196 48962 54003 52471 46908 36624 30421 31713 36274
10493 36274 42726 48772 53869 55617 51052 51481 52121 49692 48737 44804 42331 36825 34969 36690 36654 37307
10477 37307 36839 35324 33937 33675 36738 39770 43862 38496 37271 36199 32503 34056 35575 35992 40894
10462 40894 43493 43821 46418 46229 46043 43524 35116 28753 30186 32800 31591 33768 33400 30666 30089 25335
10446 25335 23707 23714 25387 24256 24368 24519 26514 25323 27419 25186 27566 29025 31767 32373 34146 38962
10430 38962 38193 39679 34784 31600 31124 34673 35403 30218 25782 23716 28909 33006 34760 36626 39876
10415 39876 44471 48223 53059 54806 52485 47291 44233 42610 43552 44218 42205 43778 51087 61532 75766
10400 75766 93115 110016 132117 167301 216876 294240 431549 659961 1011789 1469718 1836124
10389A836124p8822m91599m73433k90135j62231r2701o2603l8941k1216j3344
10379A11099j4821j1733j2791p398m689n78j303M63k970p49m680l841o33p83K0
10364D4613j163k104n121o195m191k212j338M674K659J230r50l348k323J114N129
10349C0474K559M998J14o277j920K736J603k985k258Q18L3l508l729J69j938j862
10333A9027o38r03K135p68N06l128k353N30J522P96M083j150J134J19p129k178
10317A1605O628L150Q80R99J670K806l925k80Q74j547Q11K264o30k937l596Q48
10301A9620J662J105J098k018Q38K595L91k206k417K513J492m708k858R57K836
10286B0900q22M73M583P313O469K649J498j203m203j688j527k420o30K390m989
$$ plain form
10389 1836124 1757302 1265703 792270 502135 339904 247203 184600 145659 124443 111099
10379 111099 96278 84545 71754 64356 59667 59089 57786 58249 55279 54530 49850 46009 45376 44593 44613
10364 44613 43450 41346 36225 30030 25839 23627 22289 26963 29622 30852 29902 26554 24231 25345 30474
10349 30474 33033 38031 38145 31868 29948 32684 34287 31302 29044 29862 29895 26387 22658 22827 20889 19027
10333 19027 18389 17486 19621 18853 19359 16231 13878 14408 15930 16726 20809 19659 20793 20912 13783 11605
10317 11605 18233 21383 22263 23262 24932 27738 23813 23533 24407 22860 23671 25935 25305 22368 18772 19620
10301 19620 21282 22387 23485 21467 22305 24900 25291 23085 20668 23181 24673 19965 17107 18064 20900
10286 20900 20078 20551 25134 32447 38916 41565 43063 41860 37657 35969 34442 32022 31392 33782 28793
10271B8793m752o06K203J79k190j660m88l73K64K63L377r74O7j112n987k664M030
10254A8370j170o02J097J0J288j091j724k542J563K970K28k367K886p58o53O203
10238B3708n56m378m365J367L342K734M99K040j20l273J508j514l729p4J413J265
10222A9867j271j168k935o36j101k63N79J494K495j610K444N37M785L835L777
10207C0829K434N702R267O969K794J493O822j89r275p177k986n301q070r239l933
10192B0140k009l87k42j073J221Q65N46j633l42J375o18k835j78n08k208J764
10176A3878K333O34l607j41L022j07K39O590J228l094k405j170k610k098j795
10161A0897M857j043j717M949L837j457l518l204q67j103N92K460J397j426M257
$$ plain form
10271 28793 24041 23435 25638 25817 23627 21967 21479 21106 21370 21633 25010 24036 24103 22991 17004 14340 18370
10254 18370 17200 16598 17695 17705 18993 17902 16178 13636 15199 18169 18397 16030 18916 18158 17505 23708
10238 23708 23152 18774 14409 15776 19118 21852 22351 24391 24271 20998 22506 20992 17263 17189 18602 19867
10222 19867 18596 17428 14493 13857 12756 12493 13072 14566 17061 15451 17895 18432 23217 27052 30829
10207 30829 33263 38965 48232 55201 57995 59488 66310 66121 56846 49669 46683 41382 33312 24073 20140
10192 20140 18131 17744 17502 16429 17650 18515 19061 17428 17086 18461 17843 15008 14830 14322 12114 13878
10176 13878 16211 16845 13238 13097 16119 16012 16251 22841 24069 20975 18570 17400 14790 12692 10897
10161 10897 15754 14711 12994 17943 21780 20323 16805 13601 12734 11631 12223 14683 16080 14654 18911
10146A8911J201o31J844k364k298J230l171K311K264N58L23O48K435K049K478
10131B7788J421j566l668L407J663j531k232k051k791k366l230J096K237J99j740
10116A6636K340K165R50n878l298j54K507J564j069Q08J208J201L098o36K64M19
10100B2125J266m198n623j445q2L326O29l529r55j350J082L648R69j897q16m93
10084A2657R95k316Q92k34J054j519J725m42j856m254k462L79K278J901J490P13
10068A1001K225k628j042r72J888P45k476K416K495L141k20n327J245M880R61
10053A8332J800m14m314n564j208J973K909J669J404J153J059j212l139n53p35
10038A3160K817J225J012l220k529K84j86L146P82j33j775k428K498N60j871l283
$$ plain form
10146 18911 20112 19481 21325 18961 16663 17893 14722 17033 19297 19855 20178 20826 23261 25310 27788
10131 27788 29209 27643 23975 27382 29045 27514 25282 23231 20440 18074 14844 15940 18177 18376 16636
10116 16636 18976 21141 22091 16213 12915 12761 15268 16832 15763 16571 17779 18980 22078 21442 21706 22125
10100 22125 23391 19193 13570 12125 12043 15369 15998 12469 11514 10164 11246 14894 15863 13966 13150 12657
10084 12657 13652 11336 12228 11994 13048 11529 13254 12812 10956 6702 4240 4619 6897 8798 10288 11001
10068 11001 13226 10598 9556 8584 10472 11217 8741 11157 13652 16793 16573 11246 12491 17371 18332
10053 18332 20132 19718 15404 9840 8632 10605 13514 15183 16587 17740 18799 17587 14448 13895 13160
10038 13160 15977 17202 18214 14994 12465 12749 12563 15709 16491 16358 14583 12155 14653 15213 13342 10059
10022A0059L89K380M74m41J097R94p15j669J23q18L88O96M18Q53m67j198J582
10005A4145M57k071K811K119J207O8Q77J146P63K90k593j611j275K124j175j450
9989A5832J892k143j156M050J754q37n91l121l260K14N456L776k454M590r13K114
9973B5203K962J0211J5985K5747K9857K3789k6168m4090k1362n080k622k343l046
9960B9043l630n904K76K286l679J43J252K773J970j389o147n13K452k014m542
9945A2377l158j627L551J411k212o69j131J194L604p35M497K929l380n400K72
9930A1523j068L253R18K656j378n964J692R85l233N84O07L205P42K078L389k724
9914A7265J491l63l39J578k412k119j287J241J755j671k37J256P89l341j625J122
$$ plain form
10022 10059 10448 12828 13302 12861 13958 14952 14237 12568 12691 11873 12261 12957 13375 14228 13761 12563 14145
10005 14145 14602 12531 15342 17461 18668 18736 19613 20759 21522 21812 19219 17608 16333 18457 17282 15832
9989 15832 17724 15581 14425 18475 20229 19392 18801 15680 12420 12634 18090 21866 19412 24002 23089 25203
9973 25203 28165 38376 54361 80108 109965 133754 107586 63496 42134 37054 34432 32089 29043
9960 29043 25413 19509 19785 22071 18392 18535 19787 22560 24530 23141 16994 16481 18933 16919 12377
9945 12377 9219 7592 11143 12554 10342 9673 8542 9736 13340 12605 17102 20031 16651 11251 11523
9930 11523 10455 13708 14626 17282 15904 9940 11632 12617 9384 9968 10575 13780 14522 16600 19989 17265
9914 17265 18756 18393 18054 19632 17220 15101 13814 15055 16810 15139 14902 16158 16947 13606 11981 13103
9898A3103J540j621j883J08l97L715J717L049K169l441L250L433l491j599k475
9883A7177j147J852m29J527l834J017j862j700L960J680P23J170p82r05K641j029
9867B0059m967j600j870R12J575m09J229K08N79K850J948k260n166J87J217j416
9851A3076k864M084N03j151l80L163K986J593j184j757k291Q39K234O8k67L415
9835B2067J646k562l687j385J245p78l461O75M929N109j54l221N01K023j264l395
9819A8288j183M06j385J143L115N37k271L171L600l848l573j85K449M844o13L87
9803B4882O58j09k438j032R71J786j512m842p65M354L304j415k148j071K254L65
9787B3242l579j176M669L736j206k023l307j470M03J199k407J428O324l942n374
$$ plain form
9898 13103 14643 13022 11139 11247 10850 14565 16282 19331 21500 18059 21309 24742 21251 19652 17177
9883 17177 16030 17882 17453 18980 15146 16163 14301 12601 16561 18241 18964 20134 19352 18447 21088 20059
9867 20059 15092 13492 11622 12534 14109 13700 14929 15137 15716 18566 20514 18254 13088 13275 14492 13076
9851 13076 10212 14296 14799 13648 13268 16431 19417 21010 19826 18069 15778 16617 18851 18919 18652 22067
9835 22067 23713 21151 17464 16079 17324 16546 13085 13760 18689 23798 23644 20423 20924 22947 21683 18288
9819 18288 17105 17511 16126 17269 20384 20921 18650 21821 25421 21573 18000 17815 20264 25108 24495 24882
9803 24882 25540 25431 22993 21961 22932 24718 23206 18364 17599 21953 25257 23842 21694 20623 22877 23242
9787 23242 19663 18487 23156 26892 25686 23663 20356 18886 19289 20488 18081 19509 25833 21891 16517
9772A6517P56L062p78j776J654L69J240l50k84j199R51J659L905j890j571J91
9756B2456k096J895R96K33K605P76k395J475k17j027Q53k430r76M97J040J410
9740B5095n57l175k394l669J8K992M219Q89j376K016q22j691K481J793j56l556
9724B2107m40L972K687k283j719J071J061K082Q90n38K215N218p09k177k003j041
9708C0393M7J024P35n64R8k111o85p07m099n10l906J499J482J22L494j893j290
9691B3129K20K513P02k636j935K530K134L93j625k598J152J088j215J165M053
9676B9070J466m00j231n13k715j023O82R56L227j850j049r40K047j773j982L36
9660B4308L750L25l059l641k5J392L462J850k363k69J414K19j58N12k313J17k413
$$ plain form
9772 16517 17273 20335 19557 17781 19435 19804 21044 20694 20410 19211 20162 21821 25726 23836 22265 22456
9756 22456 20360 22255 23251 23484 26089 26865 24470 25945 25728 24701 25554 23124 22148 22645 23685 25095
9740 25095 24538 21363 18969 15300 15318 18310 22529 23418 22042 24058 23236 21545 24026 25819 25663 22107
9724 22107 21667 25639 28326 26043 24324 25395 26456 28538 29428 28890 31105 36323 35614 33437 31434 30393
9708 30393 30440 31464 32199 31635 31733 29622 28937 28230 24131 23621 19715 21214 22696 22818 26312 24419 23129
9691 23129 23349 25862 26564 23928 21993 24523 26657 27050 25425 22827 23979 25067 23852 25017 29070
9676 29070 30536 30136 28905 28392 25677 24654 25336 26292 29519 27669 26620 25680 27727 25954 23972 24308
9660 24308 28058 28383 25324 21683 21658 23050 26512 28362 25999 25730 27144 27363 27205 27717 25404 25521 23108
9643B3108J681J344Q29J771K196K966j331J834N037M784Q103J6609K0604J8982
9629A08517K747k2475k3975j3589o786l647m400j801K101N364Q031J6192K4353
9616I0632L3086L0363p745l8355l8131k1561o202L039J70m025k320l370M61J119
9602C7161k745l242m0J451K343R63l444k034L308K275J433j773j442J069L195
9587C8478L346M651o4m084k135m671j763L064L768J743P477J2726J4916J4126
9573I1578R132m23j0998j2683j2362r289p161m578k293p68J80k847j400K91Q71
9558C7250J364Q58j203j114l249l04O82j891j693J929p04j773O79n28J250n2l918
9541B7583O65O94L513L361L186O09m027J44j971P96R79J342O23J756K369l853
$$ plain form
9643 23108 24789 26133 26962 28733 30929 33895 32564 34398 39435 44219 52322 68931 89535 108517
9629 108517 111264 88789 64814 51225 44439 40792 36392 34591 36692 42056 50087 66279 90632
9616 90632 123718 154081 146336 107981 69850 48289 42087 45126 45296 41271 38951 35581 36042 37161
9602 37161 34416 31174 31134 32585 34928 35891 32447 30413 33721 35996 37429 35656 34214 35283 38478
9587 38478 41824 46475 46411 42327 40192 35521 33758 36822 40590 42333 49810 62536 77452 91578
9573 91578 100710 100287 89289 76606 64244 54955 47794 43216 40923 40155 40335 37488 36088 36379 37250
9558 37250 38614 39472 38269 37155 33906 33602 34284 32393 30700 32629 31925 30152 30831 30303 31553 31501 27583
9541 27583 28248 28942 32455 35816 39002 39611 35584 35728 33757 34553 35532 36874 37497 39253 41622 37769
9525C7769P77M97K357J288r90p99j851O78K403j808K466K111k485k735L42K317
9509D2337r45p71j041j19J993L910K927k244l361k689q76r96J595K071M18l28
9493D1881L859J079j360k347j375K325P9o95r47p30O867N045M61l043j692k351
9477D7056N90P46j072J823k097k115j474o14R09j024P21k484J796Q46K178n12
9461D5273l50K07l53J900J492J736m20j012j590n97K606N58q45L33K603M593n78
9444E5556j945k877o05J01lJ821M45j021k280j999J07J040K243O37j76J854Q88
9427E3786q99O62l068l909K718K689l34n01J877O229J928j259l714k636n8P73
9411E4284k378K902L448l24k460o56K478M91L839M423K24l446j147k436J097k402
$$ plain form
9525 37769 38546 39043 41400 42688 41698 40899 39048 39726 42129 40321 42787 44898 42413 39678 40020 42337
9509 42337 41392 40621 39580 39461 41454 45364 48291 46047 42686 39997 39121 38125 39720 41791 42209 41881
9493 41881 45740 46819 45459 43112 41737 44062 44141 43446 42499 41769 48636 53681 54142 51099 49407 47056
9477 47056 47646 48392 47320 49143 47046 44931 43457 42843 43752 42728 43449 40965 42761 43607 45785 45273
9461 45273 44923 45130 44777 46677 48169 49905 49485 48473 46883 46286 48892 49450 48605 48938 51541 56134 55556
9444 55556 53611 50734 50129 50230 50227 52048 52493 51472 49192 47193 47300 48340 50583 51220 51044 52898 53786
9427 53786 52887 53549 50481 46572 49290 51979 51645 51144 53021 59250 61178 59919 56205 53569 53511 54284
9411 54284 51906 54808 58256 57932 55472 54816 57294 57785 61624 66047 66271 62825 61678 59242 60339 57937
9395E7937Q4K062J679n06j352K637J034J849j040k239Q00J455k172k058O9j082
9379E9157P56R50K740J865j617j77J959k353L538K827j56k564m591P48K823P46
9363F6651M42L07J78R10J385j585m93L922K225K95r93K61m55n19K061r60Q18J568
9345G6018m36J706L488r49J057p7m7q01j186J843M119K840O265J3126J2610J2549
9329A32125J1666J0113M8q181j0571j1253j4950j0105l007j786l373j440j744
9316H7542J627K936j268n67j49K305M548J806l55K557J622M969J178K414L364
9301A14529l35j376j060m383l581n72L603r67j666N51K593n3j814J61J879K353
9285A09862m93j311j932J38K260J1K409K868o92j697q39Q62J047N76j281J95r51
$$ plain form
9395 57937 58021 60083 61762 61256 59904 62541 63575 65424 64384 62145 62945 64400 62228 60170 60239 59157
9379 59157 59913 60863 63603 65468 63851 63674 65633 63280 66818 69645 69489 66925 62334 63082 65905 66651
9363 66651 67093 67400 67578 68488 69873 68288 67795 71717 73942 74237 73244 73505 73050 72531 74592 73632 74450 76018
9345 76018 75582 77288 80776 79827 80884 80807 80760 79959 78773 80616 84735 87575 93840 106966 119576 132125
9329 132125 143791 153904 153952 145771 135200 123947 108997 98892 95885 94099 90726 89286 87542
9316 87542 89169 92105 90837 90270 90121 92426 96974 98780 98425 100982 102604 107573 108751 111165 114529
9301 114529 114194 112818 111758 107375 103794 103222 106825 105858 104192 104743 107336 107283 105469 105630 107509 109862
9285 109862 109369 108058 106126 106264 108524 108535 110944 113812 113120 111423 110584 111446 112493 113069 111788 111983 111032
9268A11032P16p10K281N653L981K836K741M03o60l29j555l910L893M526L979N755
9252A40632M71l331p13P21M038J868M582J950k4j711l0r18j002K692K055M370
9236A55650J915j351J288K739J844K919P3K021J650J195n15m49j50J318q3K971
9220A73035J365O109M427l52L12N04N51L382P83J489j091J754O12j067O86M269
9204A96768K590J985L167J374K805K90J420K223o34m531j74J840J05m11j617M128
9188B11328L346M645Q54k892K568K705J045K446l658j236P01K261M762L884L081
9173B35840L445J418K638J687n56K926O960J449j648K18K892O874M076R41N243
9158B74403N420j286l098L02O286L834P766P642p41n47L289L515K888O766K563
$$ plain form
9268 111032 111748 111038 113319 118972 122953 125789 128530 128933 128273 127944 126389 122479 126372 130898 134877 140632
9252 140632 141103 137772 137059 137780 141818 143686 148268 150218 150194 148483 148453 147535 146533 149225 151280 155650
9236 155650 157565 156214 157502 160241 162085 165004 165077 167098 168748 169943 169428 168979 168829 170147 170064 173035
9220 173035 174400 180509 184936 184584 184896 185400 185951 189333 190116 191605 190514 192268 192880 191813 192499 196768
9204 196768 199358 201343 204510 205884 208689 208979 210399 212622 211988 207457 207283 209123 209228 208817 207200 211328
9188 211328 214674 219319 220173 217281 219849 222554 223599 226045 222387 221151 221852 224113 228875 232759 235840
9173 235840 239285 240703 243341 245028 244472 247398 254358 255807 254159 254377 257269 264143 268219 269160 274403
9158 274403 279823 278537 275439 275741 282027 285861 293627 301269 300528 299981 303270 306785 309673 316439 319002
9143C19002K083K602L510M806K261P79L097M321O282M932P190N015M036N837M367
9128C80120M240N578j624K038M061N128O774P795Q135N191M438N875N702N092
9114D48543N564M634L539O190P618O085O695P844R316O838P311P143Q318Q088
9100E43726P441P808N140Q161J0422P889R469J1483Q544J0608J0996R177Q588
9087F59452J0286J0784J1186Q943Q351R765J2090J2389J2643R391R980Q757J0333
9074G94350J3958J6113J3065R943J3974J4916J5740J8420J6677J5711J6194J7711
9062I76772J6758J2290J7055J9483J9120J8766K3002K1146K3158K5115K6003K1411
9050A220079K3642K8153K9867K5740K4168K6534K9043K9693L1205L3483L7205
$$ plain form
9143 319002 321085 323687 327197 332003 334264 335043 338140 342461 348743 353675 360865 365880 369916 375753 380120
9128 380120 384360 389938 388314 390352 394413 399541 406315 414110 422245 427436 431874 437749 443451 448543
9114 448543 454107 458741 462280 468470 476088 482173 488868 496712 506028 512866 520177 527320 535638 543726
9100 543726 551167 558975 564115 572276 582698 590587 600056 611539 620083 630691 641687 650864 659452
9087 659452 669738 680522 691708 700651 709002 718767 730857 743246 755889 765280 775260 784017 794350
9074 794350 808308 824421 837486 847429 861403 876319 892059 910479 927156 942867 959061 976772
9062 976772 993530 1005820 1022875 1042358 1061478 1080244 1103246 1124392 1147550 1172665 1198668 1220079
9050 1220079 1243721 1271874 1301741 1327481 1351649 1378183 1407226 1436919 1468124 1501607 1538812
9039A538812L6489L5402L5773L4239L9341M1079M3438M6769M8341N4140N1369
9028B005192N1479N1197N5912N6198N9668O2044O8038P0426P0414O9433P7918
9017B697919Q3159Q3346Q7786R1922R7346R8659J02355J10799J14549J22003J28044
9006C817887J34190J37276J46562J51731J61544J66931J76406J89539J98024K07047
8996E487137K18558K29001K43290K57920K72762K85767K99837L19085L38821L56504
8986H308682L75633L96940M18014M38991M61929M88490N13932N37240N62989N85085
8976A3087925O09143O32439O56956O76456O87167O99066P11866P10347P03821
8967A9175186O88264O62138O25733N87187N34122M70320L94145L07969K17793
$$ plain form
9039 1538812 1575301 1610703 1646476 1680715 1720056 1761135 1804573 1851342 1899683 1953823 2005192
9028 2005192 2056671 2107868 2163780 2219978 2279646 2341690 2409728 2480154 2550568 2620001 2697919
9017 2697919 2781078 2864424 2952210 3044132 3141478 3240137 3342492 3453291 3567840 3689843 3817887
9006 3817887 3952077 4089353 4235915 4387646 4549190 4716121 4892527 5082066 5280090 5487137
8996 5487137 5705695 5934696 6177986 6435906 6708668 6994435 7294272 7613357 7952178 8308682
8986 8308682 8684315 9081255 9499269 9938260 10400189 10888679 11402611 11939851 12502840 13087925
8976 13087925 13697068 14329507 14986463 15662919 16350086 17049152 17761018 18471365 19175186
8967 19175186 19863450 20525588 21151321 21738508 22272630 22742950 23137095 23445064 23662857
8958B3662857J25126K8063p2239j70703k62713l54924m28608n00174n57802o04209
8948B0864674o40401o71052o91491p00184p05811p01738o91602o79180o61181
8939A4722034o41787o18091n98745n70330n44168n24531m96212m71927m48015
8930I808228m25960m07369l88694l64709l46799l28364l07866k88331k77330k63372
8920F409434k50043k42028k29194k12264j99508j93968j85707j71572j66708j57917
8910D400525j50110j43596j41592j34167j22463j18620j14268j12070j07326r8524
8900C157789r7846r1516q6116p9578p6839p8345p5424p2140o8299o4204o2537
8889B304945n9054n7038n5765n3152n2058n4448m8947m3727m4415m4141m0793
$$ plain form
8958 23662857 23787983 23816046 23743807 23573104 23310391 22955467 22526859 22026685 21468883 20864674
8948 20864674 20224273 19553221 18861730 18161546 17455735 16753997 16062395 15383215 14722034
8939 14722034 14080247 13462156 12863411 12293081 11748913 11224382 10728170 10256243 9808228
8930 9808228 9382268 8974899 8586205 8221496 7874697 7546333 7238467 6950136 6672806 6409434
8920 6409434 6159391 5917363 5688169 5475905 5276397 5082429 4896722 4725150 4558442 4400525
8910 4400525 4250415 4106819 3965227 3831060 3708597 3589977 3475709 3363639 3256313 3157789
8900 3157789 3059943 2968427 2882311 2802733 2725894 2647549 2572125 2499985 2431686 2367482 2304945
8889 2304945 2245891 2188853 2133088 2079936 2027878 1973430 1924483 1880756 1836341 1792200 1751407
8878A751407m1770l8427l7746l3430l6021l3380l0714l5245l5185k6438k6239
8867A376812k9218k9740k5853k7426k7109j7863j4149j4717k1610l3174l2154
8856A103799j6898q739j2855k1186k6099k6331k0348k0630j8482j2200j4635j1468
8844H93928j2045j7020j3057j5329j3447r356j7062j9026j2529n531j0053j4086
8832G35387j0041q799r171j3100j1748n989p428r315p304p170r210r260j0518
8819F16334r389r728r075q474m624l803o086r118p554q557p495p438j0534m713
8805E09746l473j927m554m733R3k355J026N461J3502K0577K1976M244k7396l5904
8791D96283l0838j8266p907p704o495q522j0898p984n080j141p475n461n392m926
$$ plain form
8878 1751407 1709637 1671210 1633464 1600034 1564013 1530633 1499919 1464674 1429489 1403051 1376812
8867 1376812 1347594 1317854 1292001 1264575 1237466 1219603 1205454 1190737 1169127 1135953 1103799
8856 1103799 1086901 1078162 1065307 1044121 1018022 991691 971343 950713 932231 920031 905396 893928
8844 893928 881883 864863 851806 836477 823030 813674 796612 777586 765057 759526 749473 735387
8832 735387 725346 716547 707376 694276 682528 676539 669111 659796 652492 645322 636112 626852 616334
8819 616334 606945 597217 588142 579668 575044 571241 565155 556037 548483 539926 532431 524993 514459 509746
8805 509746 506273 504346 499792 495059 495152 492797 493823 499284 512786 533363 555339 559583 532187 496283
8791 496283 465445 447179 439272 431568 425073 416551 405653 397669 392589 391448 383973 378512 373120 368194
8777C68194k032k298l127n453m778l886m532k067r62j608j978m132m852j767k394
8762C22328o009n925k73m704n650l077m471m253o71L352j460m309k846m506l001
8747B74525n41N01p291n310M47l298l636j825J10m43r98k297l775m93Q38l336
8731B43178n380l823J606P30q54m272l497k246l782j889R13j060l596k013j427
8716B12588n704N4j302k630j492q61l863j515P75k909q12p7n61k451l02k285n05
8699A86148o91n068j696J481m87l532m891K343k993m90l170k579K032K077o156
8684A62328j542j377k809j419j298J83J392k588J023K49k209m970m646Q72J87
8669A43376K238J301M37j616p09k707k900j033k382k4N00P64k056K081m829n952
$$ plain form
8777 368194 366162 363864 360737 355284 350506 346620 342088 340021 339059 337451 335473 331341 326489 324722 322328
8762 322328 316319 310394 310121 305417 299767 296690 292219 287966 287295 290647 289187 284878 282032 277526 274525
8747 274525 273984 274485 267194 261884 262331 259033 255397 253572 253682 253239 252241 249944 246169 245676 246514 243178
8731 243178 237798 233975 235581 236311 235457 231185 227688 225442 221660 219771 220684 219624 216028 214015 212588
8716 212588 206884 206938 205636 203006 201514 200653 196790 195275 196050 193141 192329 192252 191691 189240 188938 186653 186148
8699 186148 185457 180389 178693 180174 179687 176155 171264 173607 170614 170124 166954 164375 166407 168484 162328
8684 162328 160786 159409 156600 155181 153883 154066 155458 152870 153893 154142 151933 146963 142317 143189 143376
8669 143376 145614 146915 147352 145736 145027 142320 139420 138387 136005 135981 136481 137245 135189 137270 132441 126489
8653A26489j521L394L033J189k013j074M74j346l517M43r61j303K263p11l167
8638A21672J805n37j403k577j844J59L05j749J25J525j544J169J00j00k611o339
8622A08156N97K073K05J896K74l939o23J771k696j160m678k850M363L028j429
8607A04988J868k05m298k240L363m4J68L455j524n922l169P87k68j541k232M21
8591I3607l43K938N81j99K085J76l071l025l099l888k33j445Q26J226J266J999
8575H9401j529n05n53k281O61J819n70k966K520N12j710p60j69l454q46J24J855
8558H1549K103k311m509L084M653k026j662k482k360j402r64j85J637J864J77
8543G7166j509k745j017m790K046K382J097r34o83K084K829K99k130l461k547
$$ plain form
8653 126489 124968 128362 131395 132584 130571 129497 129971 128625 125108 125551 124590 123287 125550 124839 121672
8638 121672 123477 122940 121537 118960 117116 117275 117580 115831 115956 117481 115937 117106 117206 117106 114495 108156
8622 108156 108753 110826 111031 112927 113201 109262 108639 110410 107714 106554 101876 99026 103389 106417 104988
8607 104988 106856 106651 102353 100113 103476 103432 103600 107055 105531 99609 96440 97227 96959 95418 93186 93607
8591 93607 93264 96202 96783 96584 98669 98845 95774 92749 89650 85762 85529 84084 84910 86136 87402 89401
8575 89401 87872 87367 86814 84533 85194 87013 86443 83477 85997 86509 84799 84039 83870 80416 79570 79694 81549
8558 81549 83652 81341 76832 79916 84569 82543 80881 78399 76039 74637 73673 73488 75125 76989 77166
8543 77166 75657 72912 71895 67105 69151 71533 72630 71696 71013 73097 75926 76225 74095 70634 68087
8528F8087Q74K9k233j938l59N50J644l17j05m76j808L39L690K96J953J774K065
8511G4065J905n366j677k58l278K90L168o300l036L939M782p15m609m098k688
8496E6124L400P211N747N111J145m344k387l548k745k665l412j878q31j653j707
8481E3568j651J637K616l97p86j25L92K591j478J384J413j524K436N831P818M275
8465G8000k533o795o440l435k411l445j995p58P078J0518K973M314J793j698l929
8450G1237n632o686k567J641J0o10j356l368l47L514k133m595j475j383L758L878
8434E3886j14j447L837M48J284m623n184L808K603J252J191Q719J0633N461Q73
8419H2627M229o25r055r069m433m408J967j433N53m375p558l532m0m12k377M86
$$ plain form
8528 68087 68961 68990 66757 64819 64460 65010 66654 66337 66232 65756 63948 64287 67977 68273 70226 72000 74065
8511 74065 75970 70604 68927 68669 65391 65681 68849 62549 59513 63452 68234 67519 62910 58812 56124
8496 56124 59524 66735 72482 77593 78738 74394 72007 68459 65714 63049 59637 57759 56928 55275 53568
8481 53568 51917 53554 56170 55773 54987 54862 55254 57845 56367 57751 59164 57640 60076 65907 73725 78000
8465 78000 75467 68672 62232 58797 56386 52941 50946 50188 57266 67784 70757 75071 76864 75166 71237
8450 71237 65605 58919 56352 57993 58003 57393 56037 52669 52322 55836 53703 49108 47633 46250 50008 53886
8434 53886 53772 52325 56162 56610 57894 53271 48087 51895 54498 55750 56941 65660 76293 81754 82627
8419 82627 86856 86231 77176 68107 63674 59266 61233 59800 60353 55978 48420 44888 44848 44436 42059 42545
8403D2545k7J165P45K272K28N33J10j725k263L99l76j877l016K733K921J98K936
8386D7501L181J401N886Q799O082N654N684K91o965j0749q401q202j183l082l583
8371D2314m05o0K418L925M411J115m830j260j411k021k748m373k772n0L986K858
8355D1097L279o71l253k781k20j7K385K034j998n829n211J742L858J547K705j105
8339C7562j855l584l538R24K580K485M046L032k831l590l494L6P16J985J893j644
8323C4723N74K647o36k298M86K41K214K362k41O14o81j978l140j909l172J23r62
8306B8967m12J300K786J53k190k9O86R99J625j212j698J669L329j38l09m03k789
8289C2334k805m87l13k633j295l58K067L124j149k045J9r27n271Q99M563K230
$$ plain form
8403 42545 42518 43683 44428 46700 46928 47461 47571 45846 43583 43982 43606 41729 38713 41446 44367 44565 47501
8386 47501 50682 52083 57969 66768 72850 78504 84188 84479 77514 66765 58364 50162 48979 45897 42314
8371 42314 41909 41849 44267 48192 52603 53718 48888 47628 46217 44196 41448 37075 34303 34253 38239 41097
8355 41097 44376 43705 40452 37671 37451 37434 39819 41853 39855 34026 28815 30557 34415 35962 38667 37562
8339 37562 35707 32123 28585 29509 32089 34574 38620 41652 38821 35231 31737 31773 32489 34474 36367 34723
8323 34723 35297 37944 37308 35010 35496 35737 37951 40313 40072 40686 40005 38027 34887 32978 29806 29929 28967
8306 28967 28555 29855 32641 32794 30604 30575 31261 32260 33885 32673 30975 32644 35973 35835 35526 35123 32334
8289 32334 29529 29042 28729 26096 24801 24443 26510 29634 28485 26440 26459 25532 20261 21160 25723 27953
8273B7953K974p36k986j260J049J036r10j118N06R76R17J08J713k721n037K698
8257B5162J056J483K848k922m370j035M070k068k147R4p05J605p63J74L725J11
8241B6318j111k556j824m21J442K88j132k364L8L751R02K406j721J735k984j89
8225B2578J550k315RK092J008O36K40m58n14j42L27P78l35j296k570J438L20j590
8207B1756j965m3o99j999J443m95K6J296l6L56P68j399j209l81J087Q54J039j344
8189A9055K192O98k412m117Q02K877P87J108n66K96p72j659J296k044J402K576
8173B1519k11k155K897K877J057m538l588p14j227M074L004o76J659j037p75J9
8157B2185L69M66k174M69J719k427j679k409r78M89K448j383k229J167k888J310
$$ plain form
8273 27953 30927 30191 27205 25945 26994 28030 27120 26002 26508 27484 28401 28509 30222 27501 22464 25162
8257 25162 26218 27701 30549 27627 23257 22222 26292 24224 22077 22171 21466 23071 22308 22482 26207 26318
8241 26318 25207 22651 20827 20406 21848 22136 21004 18640 18678 22429 23331 25737 24016 25751 22767 22578
8225 22578 24128 21813 21822 23914 24922 25558 25798 25340 24826 24684 25011 25789 25454 24158 21588 23026 23346 21756
8207 21756 19791 19748 19049 17050 18493 17998 18024 19320 19284 19640 20408 19009 17800 17419 18506 19360 20399 19055
8189 19055 21247 21945 19533 15416 16218 19095 19882 20990 20424 20720 19948 18289 19585 17541 18943 21519
8173 21519 21308 19153 22050 24927 25984 21446 17858 17144 15917 19991 22995 22319 23978 22941 22166 22185
8157 22185 22554 23020 20846 21315 23034 20607 18928 16519 15541 16030 18478 17095 14866 16033 13145 14455
8141A4455J710j455j720p88p48J810j229l30P23L589L408j653j417j253J161K940
8125A9203K494K38L94j899m448M16L476J735l244j926J922K55j912j169L609J586
8109B0730k145J387L46n59k27J495j82j778k053j711k80J980n52j876j104l015
8093A0456K405J213r09j27j211K115o2L402L497J35m34j833m214l56K391j808
8077A4660KO1o49L636P01J95j977J539n13P78j773J647r42N79K732J805j423m557
8059A6501k476J861L046r04j208L01l10N43n67J735K580k116k00j768m204k073
8043A0741L308K836k260o39M54O58J129j150q50r29J272j47q55j012j674m387
8027F495K078J786l18N05k184j692K900N936L270l217j514l93K829p63q51j759
$$ plain form
8141 14455 16165 14710 12990 12202 11454 13264 12035 11705 12428 16017 19425 17772 16355 15102 16263 19203
8125 19203 21697 21935 22329 20430 15982 16398 19874 21609 18365 16439 18361 18616 16704 15535 19144 20730
8109 20730 18585 19972 20318 19759 19532 21027 20845 19067 17014 15303 15023 17003 16451 14575 13471 10456
8093 10456 12861 14074 13165 13038 11827 13942 13880 17282 20779 20914 20480 18647 14433 14077 16468 14660
8077 14660 14662 14723 14074 17710 18411 18606 16629 18168 17655 18433 16660 18307 17365 17944 20676 22481 21058 16501
8059 16501 14025 15886 18932 18028 16820 17121 16811 17354 16787 18522 21102 18986 18786 17018 12814 10741
8043 10741 14049 16885 14625 13986 14440 15098 16227 15077 14227 13298 14570 14423 13568 12556 10882 6495
8027 6495 8573 10359 10041 10546 8362 6670 9570 15506 18776 15559 14045 13652 16481 15718 14867 13108
8011A3108l834p50J021K934L673NK115M35k633o50j954J77j898q93j17j006J36
7994I869n94J893K717R87J970k599k338j240j562P77n8k379k38J32K836L539j135
7977A2577K406k63j311J377j787N05R92k529n70K110k300K756o22j965k494J320
7961A0202K69M10N93o51j463j053O54J589K87J032j885K578J815J18K98K558j528
7944A5823J75k971o226J749K024J73K827K825j908l020p43P47M00k589R20L128
7928A3334K811J452J273k734k175m47j607j312L48J074K948N41l015J416J384
7913A5291n97P45k020m922L389K466j835K74j102k375J464J956r82j095J328L77
7897A2362l40j330M546J511m349j592R61J885Q64n67k423J384p73j239j182k9
$$ plain form
8011 13108 9274 8524 9545 12479 16152 16157 18272 18707 16074 15424 13470 13647 11749 10856 10739 9733 9869
7994 9869 9275 11168 13885 14872 16842 14243 11905 10665 9103 9880 9822 7443 7205 7337 10173 13712 12577
7977 12577 14983 14720 13409 14786 12999 13504 14496 11967 11397 13507 11207 13963 13341 11376 8882 10202
7961 10202 10471 10881 11474 10823 9360 8307 8961 10550 10837 11869 9984 12562 14377 14495 14793 17351 15823
7944 15823 15998 13027 6801 8550 10574 10747 13574 16399 14491 11471 10728 11475 11875 9286 10206 13334
7928 13334 16145 17597 18870 16136 13961 13514 11907 10595 10943 12017 14965 15506 12491 13907 15291
7913 15291 14694 15439 13419 8497 11886 14352 12517 12791 11689 9314 10778 12734 11752 10657 11985 12362
7897 12362 12022 10692 15238 16749 12400 10808 11769 13654 14518 13951 11528 12912 12139 10900 9718 9689
7881I689n71Q29K050M65k182j060N69J089p93m21L833j489J258L069o93J075K88
7864A7005K004m145j449J029j696l605k253K543R52r62j020K891m76k255o98K040
7848I905P508l861k689R3j058j514J426K261N4l117J412O45M09J364L91K430J142
7831A6801k175l642K726L91m068k763J296K049j411k012n97J138k21K41Q94J945
7815A0592L22J489m506K33o20L309k89j261J240l364n24J662j950n32L001K408
7799A1210k501k006k234J341PJ826j511L702R54j206o10o93P08p19m92Q81J50
7782H807L76l601p69P72L2M89J297o03k994l666q92K189M074K068k374j849J798
7765E154L03K185K6l202J001J369J743l172K14K380J073l519j502M018L369J118
$$ plain form
7881 9689 9118 9947 11997 12462 10280 9220 9789 10878 10085 9664 13497 12008 13266 16335 15642 16717 17005
7864 17005 19009 14864 13415 14444 12748 9143 6890 9433 10385 9423 8403 11294 10818 8563 7865 9905
7848 9905 17413 13552 10863 10956 9898 8384 9810 12071 12125 9008 10420 11065 11474 12838 13229 15659 16801
7831 16801 14626 10984 13710 14101 10033 7270 8566 10615 9204 7192 6595 7733 7512 7753 8647 10592
7815 10592 10914 12403 7897 8130 7510 10819 10530 9269 10509 7145 6621 8283 6333 5801 8802 11210
7799 11210 8709 6703 4469 5810 5817 7643 6132 9834 10788 9582 8972 8279 8987 8268 7776 8657 8807
7782 8807 9183 5582 4813 5585 5617 6106 7403 6800 3806 140 -752 1437 5511 7579 5205 3356 5154
7765 5154 5457 7642 7668 4466 5467 6836 8579 5407 5621 8001 9074 5555 4053 8071 11440 12558
7749A2558j2l987o148l062O10L608K21L212J670j18R9k077M24j530Q84q31n03
7732E018j05n33J194L018l591k043Q32J856L63K006J291k39J339J359l431m924
7716C410o31K756j841k29K355J427j537p81j126R03J162Q26k44p93k09q25m537
7699H6p6N665L113j554O18k84J450j193K56o07m43o42J621J260J866k32j504m025
7681E375k817R20L953j351K255j302n84J594R86j91J312k328l146j602K96O7l49
7664C088j988K94J885K320K592L644k949m544n42j043k584l02K72j30P33L121
7648C867l70O11P21P6J640q80j110O16j258k576j98L886M064k442j563K140R51
7631H175k096J540N24l855k219J774p87J29k50j642J688J158K324L883m967k606
$$ plain form
7749 12558 12546 8559 2411 -651 -41 3567 3788 7000 8670 8552 8651 6574 6998 5468 6352 5521 5018
7732 5018 4913 4380 5574 8592 5001 2958 3790 5646 6009 8015 9306 9067 10406 11765 8334 3410
7716 3410 2779 5535 3694 3465 5820 7247 5710 4929 3803 4706 5868 6694 6450 5657 5448 4623 86
7699 86 10 5675 8788 7234 7852 7568 9018 7825 8081 7474 7031 6389 8010 9270 11136 10904 9400 5375
7681 5375 2558 3478 7431 6080 8335 7033 6449 8043 9029 8838 10150 7822 4676 3074 3370 3437 3088
7664 3088 1100 1394 3279 5599 8191 11835 8886 4342 3800 2757 173 -129 143 13 746 3867
7648 3867 3497 4108 4829 4905 6545 5665 4555 5171 3913 1337 1139 5025 9089 6647 5084 7224 8175
7631 8175 6079 7619 8143 4288 2069 3843 3056 3185 2935 1293 2981 4139 6463 10346 5379 2773
7615B773J626L626m26M82J559J846k485j873m09N83m824j357K094O90o9j924N76
7598B488j208n8K189J662L03k948J205l08M67J269j479K105J537J232q6j867J493
7581G996j491k140N39L909o55l08j724k081k399j963j011j409k601m85O88K104
7565c031k9j084K202K435j561l219J28N446M184O41k45J206j125k806M95n60J942
7548E019j962l915k58R35L100L446K119M10k649l509J212K813J882K20k591k082
7532D190j383K443L44J680P67l94m042k437J304L161L8l038L179J059k069k841
7516A961J662J034L16M63o35l283r2J076K921j394j626M40k614J863J433K219
7500E744j607k06n77R01J190k82Q18L76j810j836m09k57k36K603K776L55r14k10
$$ plain form
7615 2773 4399 8025 7599 8081 9640 11486 9001 7128 6719 7302 2478 1121 3215 3905 3836 1912 2488
7598 2488 1280 1222 3411 5073 5376 2428 3633 3325 3792 5061 3582 5687 7224 8456 8370 6503 7996
7581 7996 6505 4365 4904 8813 8158 7850 6126 4045 1646 -317 -1328 -2737 -5338 -5823 -5135 -3031
7565 -3031 -3060 -4144 -1942 493 -1068 -4287 -4159 1287 5471 6112 5867 7073 5948 3142 3637 3077 5019
7548 5019 3057 -858 -1116 -181 2919 6365 8484 8894 6245 2736 3948 6761 8643 8863 6272 4190
7532 4190 2807 5250 5594 7274 8041 7647 3605 1168 2472 5633 5671 2633 5812 6871 4802 1961
7516 1961 3623 4657 4973 5436 4801 1518 1426 2502 5423 4029 2403 2843 229 2092 3525 5744
7500 5744 4137 3931 3354 4255 5445 5163 5981 6357 4547 2711 2302 2045 1809 4412 7188 7543 6629 6419
7482F419j290r14J621J522L281J31k262j942m563k493P91k670J657O945j36n35
7466E562j893l269J530Q54M004K51j879j572j095N183M433j737k327k231n639
7451A75o245Q75Q89p36J843N696K663k573j7N32N60l133j631L537P96j842j968
7434e79J786J645K341l56j176j681R87M763N80j714j886l010m86O08M147K1k616
7417C374j986k447k11j167j485L018P47M82O80N80n20P46J961K623j495j306l774
7400a80Q47L777j091j111j590j046L233J362j8K283n1j40J475J869j947j399N29
7383F802l441k306j542R50k40J645L498j56R3Q50j131m35p74K42M369J79l336
7366E267k384j137K597j847N49k503m917Q88L739M58K08L526K227l075k377j066
$$ plain form
7482 6419 5129 4215 5836 7358 10639 10770 8508 6566 2003 -490 301 -2369 -712 6233 6097 5562
7466 5562 3669 400 1930 2784 6788 7039 5160 3588 2493 7676 12109 10372 8045 5814 175
7451 175 -6070 -5195 -4306 -5042 -3199 2497 5160 2587 2570 3102 3662 529 -1102 2435 3231 1389 -579
7434 -579 1207 2852 5193 4837 3661 1980 2967 7730 8310 6596 4710 1700 1214 1822 5969 5990 3374
7417 3374 1388 -1059 -1270 -2437 -3922 -904 -157 325 1005 1585 1065 1811 3772 6395 4900 3594 -180
7400 -180 667 4444 3353 2242 652 -394 2839 4201 4183 6466 6415 6275 7750 9619 7672 6273 6802
7383 6802 3361 1055 -487 463 223 1868 5366 5210 5303 6153 5022 4587 3813 4055 8424 8603 5267
7366 5267 2883 1746 4343 2496 3045 542 -4375 -3487 252 710 918 4444 6671 3596 1219 153
7350A53Q2j584o69Q7k8N00L972K787J626k443j635q17R91R20J282k730l87J599
7332C706r64k23J879j971K85K108K350k74m06j682m052l797J4J658K687J901J309
7315D528r30j485L573M553l167l455q69m048l227J545M279P77j52M56R76K402
7299E756j199o95Q16l631j6Q29l3q34L178O89q38o13J745j656j113N57L014n79
7281E377k616j826j035l023Q4J21l362K281j162J806L644K589J465j034m48l721
7265h60m056K144L500K291M571Q46r67m464k100k778K278L688J639r16l956k184
7249a324j04L716L069K752k83j178l88J854k5l264k299k603J74R29k74O123j843
7232E032j588K612o56k739l914p67P64L16O94j61M64j75k305j99j851L7l21N92
$$ plain form
7350 153 235 -1349 -2018 -1931 -1959 -1459 2513 5300 6926 4483 2848 2031 3022 3942 5224 2494 2107 3706
7332 3706 2742 2519 4398 2427 2712 4820 7170 6896 6490 4808 756 -3041 -3027 -1369 1318 3219 4528
7315 4528 3598 2113 5686 10239 7072 3617 2748 -1300 -4527 -2982 1297 2074 1922 2378 3354 5756
7299 5756 4557 3862 4678 1047 1031 1860 1827 993 4171 4860 4022 3409 5154 3498 2385 2942 5956 5377
7281 5377 2761 935 -100 -3123 -3039 -2918 -6280 -3999 -5161 -3355 289 2878 4343 3309 2861 -860
7265 -860 -4916 -2772 728 3019 7590 8436 7469 3005 905 -1873 405 4093 5732 4816 860 -1324
7249 -1324 -1428 2288 5357 8109 7826 6648 6260 8114 8089 4825 2526 -77 97 1026 752 6875 5032
7232 5032 3444 6056 5400 2661 -1253 -2020 -1256 -940 -246 -407 57 -118 -2423 -2622 -4473 -4436 -4757 -4165
7214d165M763L151J067k769l338J392K804O00O14l044m334L627L849l80j654J345
7198C528K270M66k163j853L292N7p88l6P30l263j839J730K056q28o126m759L014
7181d512K178q38p04J979k984P02N025K541k426J225K532k359k833K168J012k530
7165A76j79r82l26q26M415K205n06j73J178j542k298J262K494J822l603l073J595
7148A639N00J076K45j154J461K355L084l399n501J251p33j863k117J451M042l07
7132B030m626L219L982k95l778j603k740J920R95k47q99N06K563L01k239K614
7116A703M106p77j896K428O75J014m179K614K360%n099l025L244K934j803j972
7100B327l935R50m27J371K199l137J371M266K048n46P44p14j14k381j103j046
$$ plain form
7214 -4165 598 3749 4816 2047 -1291 101 2905 3505 4119 1075 -3259 368 4217 3837 2183 3528
7198 3528 5798 6264 4101 2248 5540 5597 4809 4773 5503 2240 401 2131 4187 3359 -2767 -7526 -4512
7181 -4512 -2334 -3172 -3876 -1897 -4881 -4179 846 3387 961 2186 4718 2359 -474 1694 2706 176
7165 176 -3 -985 -1311 -2137 2278 4483 3977 3804 4982 3440 1142 2404 4898 6720 3117 44 1639
7148 1639 2139 3215 3460 2306 3767 6122 9206 5807 306 1557 824 -1039 -3156 -1705 2337 2030
7132 2030 -2596 623 4605 4310 532 -1071 -3811 -1891 -896 -1143 -2042 -1536 1027 1328 -911 1703
7116 1703 5809 5032 3136 5564 6239 7253 3074 5688 8048 8048 2949 -76 3168 6102 4299 2327
7100 2327 -1608 -658 -1085 286 2485 -652 719 4985 7033 6487 7231 6517 6403 4022 2919 1873
7084A873J702K420l923k16o15J291K482j415J991k988l355M19K168j310l007L017
7068E34L277M064L214j459m712n129j493K961j303m67Q72K299j24O92k022K987
7052D191M400k508j259j39j133J665K523k958k755l63j945J029J21j19j529k248
7036c027O59K091L499L73m00p87Q33n98p48J785K02k943J034Q97j421l118j708
7019c377K874K109r85j028r54J347r43l755O23M323K995r32Q86K041j211k067
7003A946J38m91j23m57L939N0k19j379O64J008q73o95K308Q33j865M32p43l761
6985G12j132L076n74r49J734J235o58p29l85r24p07m05K636J68M46j074p25J789
6967C534p82j237P22R20q84J465r20l028j066L184Q29N768M93n68K255o250l473
$$ plain form
7084 1873 3575 5995 2072 1856 1241 2532 5014 3599 5590 2602 -753 -334 1834 524 -2483 534
7068 534 3811 7875 11089 9630 4918 -211 -1704 1257 -46 -513 359 2658 2534 3226 1204 4191
7052 4191 8591 6083 4824 4685 3552 5217 7740 4782 2027 1664 -281 748 869 750 -779 -3027
7036 -3027 -2368 -277 3222 3595 3195 2408 3241 2643 1895 3680 3882 939 1973 2870 1449 -1669 -3377
7019 -3377 -503 1606 621 -407 -1361 -14 -957 -4712 -4089 234 3229 2297 3183 5224 4013 1946
7003 1946 2084 1593 1470 1013 4952 5002 4783 3404 4068 5076 4203 3508 5816 6649 4784 5216 4473 712
6985 712 -420 2656 2082 1133 2867 4102 3444 2715 2330 1406 699 294 2930 3098 3544 2470 1745 3534
6967 3534 2752 1515 2237 3157 2273 3738 2818 -210 -1276 1908 2737 8505 8998 8430 10685 4435 962
6950I62k932k640L368K03N72L67J85k652m209J779O972O564K129l006k207k873
6934B582l308j938M69j876j986L629J321K175o63k98j84J40O73K623J473J10m045
6917H97j531k200k563J976L011j511l925q11N445L498M477j460k679p93k136j398
6901a703M30O43L104J14j887j575K280r07J529p58k198m097n90M32J450J186L986
6884A439K827j204k054j795o58K289K688q20J13K313m4j402k140O66O54j705q62
6867C05N73o1M42k20n373j399M638J834J597p68j325N09J720n43o06j039J3K176
6849B473l129j558j043k434m08j064J463K727n17m25K49L045o28nJ027J187O67
6832A627P31j059l440j479M193p73k673j229J201J141k371j577K003o79J362k587
$$ plain form
6950 962 -1970 -4610 -1242 -1039 -467 -100 85 -2567 -6776 -4997 1975 8539 10668 7662 5455 2582
6934 2582 -726 -2664 -2195 -4071 -6057 -2428 -1107 1068 405 107 -77 63 736 3359 4832 4942 897
6917 897 -634 -2834 -5397 -3421 -410 -1921 -5846 -6657 -1212 2286 6763 5303 2624 1831 -305 -1703
6901 -1703 -1273 -630 2474 2588 701 -874 1406 499 2028 1270 -928 -5025 -5615 -5183 -3733 -2547 1439
6884 1439 4266 3062 1008 -787 -1445 844 3532 2712 2825 5138 5094 3692 1552 2218 2872 1167 305
6867 305 878 817 1259 1039 -4334 -5733 -1095 739 2336 1568 243 752 2472 1929 1323 284 297 2473
6849 2473 -656 -2214 -3257 -5691 -6099 -7163 -5700 -2973 -3490 -3915 -3666 -621 -1249 -1254 -227 960 1627
6832 1627 2358 1299 -2141 -3620 573 -200 -2873 -4102 -2901 -1760 -4131 -5708 -3705 -4384 -3022 -5609
6816e609m97J974L749j084j823L509M123J108k574p283l913J718L721J221K167
6801E07J21n91l22j628L036K673l223k567j723L561J376k568o78K773K164J008
6785C919j101l687j205q73k86L221L616j837J202K819j16J234k882l187R84N86
6769B407q45J136o73l88J479j714P14M5J885j607j027j39J371L185L70j724k255
6752B220n19j55M026M925N984Q423L066p122q916n876j654L036L81n107j857L062
6736C917J433m957k885M57l53K13j205R25R63j162M095J681j411K098K829R89
6720G627l826l343K892L8j471L170M376L276l824k479k161k143q81K079L542K945
6704I817o25m802j365o2J780j842Q26l114k626K399l57j086J555j676J031j434
$$ plain form
6816 -5609 -6106 -4132 -383 -1467 -3290 219 4342 5450 2876 -4407 -8320 -6602 -2881 -1660 507
6801 507 628 37 -285 -1913 1123 3796 573 -1994 -3717 -156 1220 -1348 -2026 747 2911 3919
6785 3919 2818 -869 -2074 -2947 -3233 -12 3604 1767 2969 5788 5672 6906 4024 837 1821 2407
6769 2407 1562 2698 2025 1637 3116 1402 2116 2161 4046 2439 1412 1273 2644 5829 6199 4475 2220
6752 2220 1701 1546 5572 10497 16481 24904 27970 20848 11932 6056 4402 7438 7819 2712 855 3917
6736 3917 5350 393 -2492 -2035 -2388 -2175 -3380 -2455 -1492 -2654 1441 3122 1711 3809 6638 7627
6720 7627 3801 458 3350 3388 1917 5087 9463 12739 8915 6436 4275 2132 1251 3330 6872 9817
6704 9817 9192 4390 3025 2963 4743 2901 3727 613 -2013 386 29 -1057 498 -1178 -147 -1581
6688a581Q02K038k790k262L795j292j640j119K251J742n17J717R52K463m58P85
6672D886j377pK080M335p65k364l084k68K938k965J08M424N437N015N791R278
6656C3462J2655R780r250j5421j0328p542n188l2j237k002k255j263K972K904
6642G255R63J733m004k562K88j421m424j951q86K595M113J327j111K462j903l071
6626e97j219K101j808k992J761N49r06l040M849L723l370L200J915J55j38l573
6610F10k886J044J219j88K607P38k728J26p57N2k78l27J294K022j525k102k107
6593c186K626P61J060j459j644j676j305k706O87M509k165j323J755J462m87k247
6577e338m17J115J324K33j22j686K54J56m81K85J470k530j952L750M64J269J849
$$ plain form
6688 -1581 -779 1259 -1531 -3793 2 -1290 -2930 -4049 -1798 -56 -573 1144 2096 4559 4101 4886
6672 4886 3509 3502 5582 9917 9152 6788 3704 3436 6374 3409 3517 7941 13378 18393 24184 33462
6656 33462 46117 55897 46647 31226 20898 13356 8168 8136 6899 4897 2642 1379 4351 7255
6642 7255 8218 9951 5947 3385 3673 2252 -2172 -4123 -5009 -2414 1699 3026 1915 4377 2474 -597
6626 -597 -1816 285 -1523 -4515 -2754 -2205 -3111 -6151 -1302 2421 -949 2251 4166 4321 4183 610
6610 610 -2276 -1232 -13 -201 2406 3144 416 542 -215 -163 -441 -768 526 2548 1023 -1079 -3186
6593 -3186 -560 201 1261 -198 -1842 -3518 -4823 -7529 -6842 -2333 -4498 -5821 -4066 -2604 -3091 -5338
6577 -5338 -5755 -4640 -3316 -3083 -3205 -4891 -4637 -4481 -4962 -4677 -3207 -5737 -7689 -3939 -3475 -2206 -357
6560c57J302J108J499j164k316j843R90j59j473m35J305q40j865J200P22M590
6544B264K079m91n62l027j246J230N45L40L192M577J022k675j583o08P73p23k772
6527B335k467m98j210l634j016M343J073J413L677j286m653k392J990L962P06
6512B343j759k801m04J309L112K73l298J650q98n99j811q47n56P05P1o45J69J395
6494b591L741N626K99J772k399p132j648K444l036j613J101LM2J057L779K109
6478C554q40k725Q33k418l392r89J276K301K529K206J152j588k398m329k832L944
6462c716M767j201l113p41K811m63j439l26J975J020J163n44N49j235L34l38O37
6445A40J375N14l837k738p11L03K758O38K260R25P42K44n08j136K9j850j198m134
$$ plain form
6560 -357 945 2053 3552 2388 72 -1771 -781 -940 -2413 -2848 -1543 -2383 -4248 -3048 -2326 2264
6544 2264 4343 3852 3290 263 -983 247 792 1132 4324 8901 9923 7248 5665 5057 5830 5107 2335
6527 2335 -132 -630 -1840 -5474 -6490 -2147 -1074 339 4016 2730 -1923 -4315 -2325 1637 2343
6512 2343 584 -2217 -2621 -1312 1800 2073 -1225 425 -473 -1072 -2883 -3730 -4286 -3581 -3510 -4155 -3986 -2591
6494 -2591 1150 6776 7075 8847 6448 -684 -2332 112 -2924 -4537 -3436 -3433 -3391 -2334 1445 3554
6478 3554 2714 -11 822 -1596 -4988 -5977 -4701 -2400 129 2335 3487 1899 -499 -4828 -7660 -3716
6462 -3716 1051 -150 -3263 -4004 -1193 -1656 -3095 -3421 -1446 -426 737 193 742 -493 -159 -497 140
6445 140 1515 2029 -1808 -4546 -5257 -4954 -2196 -1558 702 1627 2369 2613 2105 969 998 -852 -2050 -6184
6427f184j490K060j764K478N359K760k024j222M604m58Q1k684j118m9j924n196
6411f771K14K440L952J494j088j479K41M87j140K683J132l644k740n32k577j306
6395h634K598K117L74J158j740p84j170n29j00M265p90J286K656k218k675p03
6379d889K303O44j028p75P33J094p311j574M613K598P30J293N19K08O47J036q85
6362d4j549j584P09L715m82l202Q64J858J424k993M904K55p43j260j781J583J439
6345C113k277k665K572o30p14N46j834k719K660M576K017L28r13l037j057k480
6329b514l85J278o27L332k01j061J324p89m142p38J392M596J555j126j00m091
6313b297l76L67M27J962P29p99n910l933o85K230L525L60n62p83K094n50k024
$$ plain form
6427 -6184 -7674 -5614 -7378 -4900 459 3219 1195 -27 4577 4119 4200 1516 398 349 -1575 -6771
6411 -6771 -6557 -4117 -165 1329 241 -1238 -997 -510 -1650 1033 2165 -1479 -4219 -4751 -7328 -8634
6395 -8634 -6036 -3919 -3545 -2387 -4127 -4911 -6081 -6610 -6710 -2445 -3235 -1949 707 -1511 -4186 -4889
6379 -4889 -2586 -1942 -2970 -3745 -3012 -1918 -9229 -10803 -6190 -3592 -2862 -1569 -1050 -842 -195 841 -44
6362 -44 -1593 -3177 -2468 1247 765 -2437 -1573 285 1709 -1284 3620 3875 3132 1872 91 1674 3113
6345 3113 836 -1829 743 113 -601 -55 -1889 -4608 -1948 2628 4645 4973 4060 1023 -34 -2514
6329 -2514 -2899 -1621 -2248 1084 883 -178 1146 357 -3785 -4523 -3131 1465 3020 1894 1794 -2297
6313 -2297 -2673 -2306 -1879 83 812 13 -5897 -9830 -10515 -8285 -4760 -4400 -4962 -5745 -3651 -4201 -6225
6296f225N185K037J620p85k270l448J186J06k671J908K98j285j480N513L793J87
6280C669m289l767P80R5q40J353J022k1O22l00j045j913j04R13O94M40K723j185
6262a153j980r5K506K217l520l914K818J765j461m26N93K33K633J260j538n913
6246e975l047K00N893K904J981Q72n5m65k901j891L46J196J448o12L60k264L48
6229a662L92k805k884m95K362K895j602Q53K408k787j044J61k627j440N490L391
6213F06k000l196K308j066L39j334n20M799J468l019k726k65L661O65j9J772l947
6196b474j909J657J42j688J529K315P72j121m643j903J358J087j790J165J865
6181c638L215K237M50j665k163j301k948k363K838L04r87L449J219O22m26n5j483
$$ plain form
6296 -6225 -1040 997 2617 1832 -438 -3886 -2700 -2594 -5265 -3357 -3059 -4344 -5824 -311 3482 3669
6280 3669 -620 -4387 -3607 -3512 -4352 -2999 -1977 -1998 -1376 -1676 -2721 -4634 -4738 -3825 -3131 -2691 32 -1153
6262 -1153 -3133 -3228 -722 1495 -2025 -5939 -3121 -1356 -2817 -3243 -2650 -2417 216 1476 -62 -5975
6246 -5975 -9022 -8822 -2929 -25 1956 2828 2773 2308 -593 -2484 -2138 -942 506 -106 254 -2010 -1662
6229 -1662 -1270 -4075 -6959 -7454 -5092 -2197 -3799 -2946 -538 -3325 -4369 -4208 -6835 -8275 -2785 606
6213 606 -1394 -4590 -2282 -3348 -3009 -4343 -4863 -64 1404 -1615 -4341 -4606 -945 -280 -299 1473 -2474
6196 -2474 -4383 -2726 -2584 -4272 -2743 -428 344 -777 -5420 -7323 -5965 -4878 -6668 -5503 -3638
6181 -3638 -423 1814 2264 599 -1564 -2865 -5813 -8176 -5338 -5034 -6021 -2572 -1353 -731 -1157 -1212 -2695
6164b695K250q60j124m265m1K319P51J488j6j377L72j112k030J58l64L752K906
6147A12r26m50j483j316J878L488l662o30M05j228N3P04l83J651J063K254R85
6130B515j156q42J689k128m732p21L045K301j712J065k55L0j870K105J372K226
6114B932k998k893N16M023J353K94L592j314p913m976K812L970L448k319m018
6099c491m511k187J073K735N125L187J661n082j469p28K380J888K61k738k525
6084d421O88R45l92j312m776j207J770L791M989O22m60K434P43k357o60J959m1
6067B315j348J962K600k030l503n621q82P10L01M182J482j524K450L981l38l868
6051H69j403k85l835m70J039L62j399J559M642M87k220J759Mj812j243K234K978
$$ plain form
6164 -2695 -445 -1305 -2429 -6694 -6735 -4416 -3665 -2177 -2193 -3570 -3198 -4310 -6340 -6182 -6546 -2794 112
6147 112 -814 -1264 -2747 -4063 -2185 1303 -2359 -2989 -2584 -3812 -3759 -3055 -3438 -1787 -724 1530 2515
6130 2515 1359 517 2206 78 -4654 -5375 -2330 -29 -1741 -676 -931 -901 -2771 -666 706 2932
6114 2932 -66 -2959 -2443 1580 2933 3227 6819 5505 -2408 -7384 -4572 -602 2846 527 -3491
6099 -3491 -8002 -10189 -9116 -6381 -1256 1931 3592 -1490 -2959 -3687 -1307 581 842 -1896 -4421
6084 -4421 -3733 -2788 -3180 -4492 -9268 -10475 -8705 -4914 75 697 237 2671 3414 1057 397 2356 2315
6067 2315 967 2929 5529 3499 -4 -5625 -6507 -5797 -5496 -1314 168 -1356 1094 5075 4737 869
6051 869 -534 -819 -4654 -5124 -4085 -3723 -5122 -3563 1079 1566 -654 1105 1109 -703 -1946 288 3266
6034C266L26l447j048O30J149Q87R99M092j954r24r78j919n87J229q77k447k624
6017d227J70K043k349l03K399P849L014l159p542j243q68j410L048K376p53j089
6001b044J478P30J003J131j271l503O41r43r09j550J509j311n1J720Q09N07J49
5984a905K241M281l77r10k468j472J057L62l440J646K425j458K113j025j063l716
5968c709j330J921K834K977M37k570P27J509J726k107N41o71O99l181l041k0O39
5951b619l70N2J187K747m116n388l52R02K021N612K176j543j790J505L561k04
5935C381p37j280j342o83P02K519J260J203j088L76J173k841m186j922J201q94
5919c158j449j059J127K594J446J270K083j510p48j57L386Q68l934K75j72k829
$$ plain form
6034 3266 3592 145 -903 -273 876 1763 2762 6854 4900 3976 2998 1079 492 1721 844 -1603 -4227
6017 -4227 -4057 -2014 -4363 -4666 -2267 5582 8596 5437 -2105 -3348 -4216 -5626 -2578 -202 -955 -2044
6001 -2044 -566 164 1167 2298 1027 -2476 -1835 -2778 -3687 -5237 -3728 -5039 -5090 -3370 -2561 -2054 -1905
5984 -1905 336 4617 4240 3330 862 -610 447 809 -2631 -985 1440 -18 2095 1070 7 -3709
5968 -3709 -5039 -3118 -284 2693 3130 560 1287 2796 4522 2415 2956 2285 2984 -197 -3238 -3258 -2619
5951 -2619 -2989 -2937 -1750 997 -3119 -8507 -8859 -7957 -5936 -324 1852 309 -1481 24 3585 3381
5935 3381 2644 1364 22 -661 41 2560 3820 5023 3935 4311 5484 2643 -1543 -3465 -2264 -3158
5919 -3158 -4607 -5666 -4539 -1945 -499 771 2854 1344 596 439 3825 4693 759 1034 862 -1967
5903a967n44k38j383q44m14n249l57N030J589n30K305L981O38k532j240K479k801
5886b077J489J949j461o50K8m027l49L143J007k462J540L3o87k82k038j218J278
5869d784K574n69R00R88j886j515k330J485R66K517r55J407M415j354n233j355
5853d729K826K194J807j683k224R29K445o07l58m69M30q30j172l463j780J553
5837e131J355J300L41k43k280P4K749K050k752L53N9K165J127J219k512l056o84
5820c866L159L581l198l784p29m35j44N46R55j249j397J035j250l743J365M661
5804d493M016K471j669J003o93K045J872m395k189l207j92L254K861J954l94j457
5788G87O43J773j277j348L081j8j295O25k347P11K16j50j632Q87L523k242k890
$$ plain form
5903 -1967 -2511 -2749 -4132 -4976 -5390 -10639 -10996 -5966 -4377 -4907 -2602 1379 2017 -515 -1755 724 -2077
5886 -2077 -588 1361 -100 -750 -722 -4749 -5098 -1955 -948 -3410 -1870 -1837 -2524 -2806 -4844 -6062 -4784
5869 -4784 -2210 -2779 -1879 -891 -2777 -4292 -6622 -5137 -4171 -1654 -2609 -1202 3213 1859 -3374 -4729
5853 -4729 -1903 291 2098 415 -1809 -880 1565 958 600 131 561 -269 -1441 -4904 -6684 -5131
5837 -5131 -3776 -2476 -2135 -2378 -4658 -4584 -1835 215 -2537 -2184 -2125 40 1167 2386 -126 -3182 -3866
5820 -3866 -707 2874 -324 -4108 -4837 -5272 -5416 -4870 -3915 -5164 -6561 -5526 -6776 -10519 -9154 -4493
5804 -4493 -477 1994 325 1328 635 2680 4552 157 -2032 -5239 -5431 -2177 684 2638 2244 787
5788 787 1430 3203 1926 578 3659 3641 2346 2971 624 1335 1551 1401 -231 656 4179 1937 -953
5771i53Q99Q30l236j56J251r47K198N06Q8m340k226j887Q68K717L413j819j079
5754c873l39J017l50K487L461j074j740j672l44L881k351m735N67M381k652k65
5738c601P75k867M919J609j958l224J640k970O43k40K116K874L586j350n44J085
5722B493k390l911p3P32J444n52K408J44k253j111l54L010M063j993j261J192
5706A588k058j302M555j174k571j460J027k260k330l131j729J027L010M539J307
5691i62n015m78q56J161J453j673K905K796k91J38J441O69K252J322j015k890
5675I57k591m01Q72k108k877N57n9o64P42L35L901L933j225R84k607j643k17K593
5657D82j460k579k534j405J252J491L094J577p19l679j066M555J486k646m46m66
$$ plain form
5771 -953 -54 776 -2460 -2616 -1365 -2312 -114 392 480 -3860 -6086 -7973 -7105 -4388 -975 -2794 -3873
5754 -3873 -4212 -3195 -3545 -1058 2403 1329 -411 -2083 -2427 1454 -897 -5632 -5065 -684 -3336 -3601
5738 -3601 -2826 -5693 -774 835 -1123 -4347 -2707 -5677 -5034 -5274 -3158 -284 3302 1952 1408 2493
5722 2493 103 -3808 -3881 -3149 -1705 -2257 151 295 -1958 -3069 -3423 -413 3650 1657 396 1588
5706 1588 -470 -1772 2783 1609 -962 -2422 -1395 -3655 -5985 -9116 -10845 -9818 -6808 -2269 -962
5691 -962 -5977 -6455 -7311 -6150 -4697 -6370 -3465 -669 -960 -822 619 1288 3540 4862 3847 957
5675 957 -1634 -2035 -1163 -3271 -6148 -5591 -5650 -6314 -5572 -5237 -1336 2597 1372 2356 -251 -1894 -2111 482
5657 482 -978 -3557 -6091 -7496 -6244 -4753 -1659 -82 -801 -4480 -5546 -991 495 -2151 -2597 -3063
5641c063J08l65k183R49J580M15Q75K078k556O57J256J408k324M01K21j000J969
5624D26r79k289M06K357J981p31p23k432K081m14k38k07l874K174N660M78l917
5607b41j566m400k35K757j70k331J373J778J355K262L151m82q55m404l153o00
5591e761K829N146J130m427l120L40J832M44m5O61L641L264N63l186m005k580
5575c274J282M02J80k224L72j896j540M710M649j167k671O25M12j453L45N93K01
5558d54r97j747L61L548Q60j174m555R84q70m21n79J605L496Q09M39R55k336q03
5540h79j983R83k699l861K393M943R49p03R07j500m109n49j74L856Q20k385j365
5523e356J268L921K565N76k153q01J401j510J500K663j272j679l92o56k822k454
$$ plain form
5641 -3063 -2955 -3320 -5503 -4554 -2974 -2559 -1684 394 -2162 -1505 -249 1159 -1165 -764 -543 -1543 426
5624 426 -553 -2842 -2436 -79 1902 1171 448 -1984 97 -317 -555 -762 -4636 -2462 3198 3676 -241
5607 -241 -1807 -6207 -6442 -3685 -3855 -6186 -4813 -3035 -1680 582 3733 3251 2396 -2008 -5161 -5761
5591 -5761 -2932 2214 3344 -1083 -4203 -3863 -2031 -1587 -1632 -971 2670 5934 6497 3311 -694 -3274
5575 -3274 -1992 -1590 -1410 -3634 -3262 -5158 -6698 -1988 2661 1494 -1177 -552 -140 -1593 -1248 -655 -454
5558 -454 -1451 -3198 -2837 711 1571 397 -4158 -3174 -4044 -4465 -5044 -3439 57 866 1305 2260 -76 -879
5540 -879 -2862 -1879 -4578 -8439 -6046 -1103 -154 -857 50 -1450 -5559 -6108 -6282 -2426 -1606 -3991 -5356
5523 -5356 -4088 -167 2398 2974 821 20 1421 -89 1411 4074 2802 1123 731 75 -2747 -5201
5507e201J577K514M190j822j949k482K831n19j386J082M5PK365k48j105J144O40
5490A683j545q68k216j165m76r19q10J011L605Q05k241j313L76L877K207k375
5474c64l018m344p70J660J684j316K115M583J507l451J117J01j909K713l702k110
5458e504J667j279j151K041M350J460k147l318j09K987L385K63j141k260K7l59
5442a088J144J071l949j516R20p47K746J063L071j655o181J73L28J708k136M82
5426d566K143J377j075L479J099k076j799j460k322J616K097j948o91r38M074
5411i90R00J958J315p03k878k21J143K429j333k227j788K25m00j061L86J703K65
5394a277j249n5J651m20K230N078j767k294j218K28O60j328j723N58J174l560
$$ plain form
5507 -5201 -3624 -1110 3080 1258 -691 -3173 -342 -861 -2247 -1165 -1120 -1113 1252 1004 -101 1043 1683
5490 1683 138 -730 -2946 -4111 -4587 -5506 -6316 -5305 -1700 -895 -3136 -4449 -4073 -196 2011 -364
5474 -364 -3382 -7726 -8496 -6836 -5152 -6468 -4353 230 1737 -1714 -597 -496 -2405 308 -3394 -5504
5458 -5504 -3837 -5116 -6267 -4226 124 1584 -563 -3881 -3990 -1003 2382 2645 1504 -756 -729 -1088
5442 -1088 56 1127 -2822 -4338 -3418 -4165 -1419 -356 2715 1060 -5121 -4948 -4620 -2912 -5048 -4566
5426 -4566 -2423 -1046 -2121 1358 2457 381 -1418 -2878 -5200 -3584 -1487 -3435 -4126 -5064 -990
5411 -990 -90 1868 3183 2480 -398 -619 524 2953 1620 -607 -2395 -2170 -2570 -3631 -3245 -1542 -1277
5394 -1277 -2526 -2581 -930 -1350 880 5958 4191 1897 679 907 1567 239 -1484 -926 248 -3312
5378c312j543J138o97K287K282L953n13J12j21j064l08P75k55j608j319J218j013
5361A2J9M48K003k02k278R05K021L65l75J242J584k208k473j731l420j916K324
5344c680K190j917L75L215q62J457k60j955k746K300N797L20n021m283j016L452
5328b634M322O02j917M92O10p01l826k848K558J84J152j283j107n63j267j112
5312g338K010L761N36k850j340j115P28L85M288K109j315j230l726J778K912K9
5296c78l634O52k023j027Q72qk76K67L806M143k4j957l314j904l65K623j612j211
5278e370j135k005M118L407l262q89j8O68O51K362o85O07M22j58J267j185J238
5261C3J746l20o44l08J114L384r46m202n664j332j674J872L104K492q91r99J435
$$ plain form
5378 -3312 -4855 -3717 -4414 -2127 155 4108 3595 3707 3586 2522 2214 2989 2734 1126 -193 1025 12
5361 12 31 479 2482 2280 2 907 2928 3293 2918 4160 5744 3536 1063 -668 -4088 -6004 -3680
5344 -3680 -1490 -3407 -3032 183 -679 778 518 -1437 -4183 -1883 3914 4234 -787 -5070 -6086 -2634
5328 -2634 1688 2290 373 865 1475 774 -3052 -5900 -3342 -3158 -2006 -3289 -4396 -4959 -6226 -7338
5312 -7338 -5328 -1567 -1031 -3881 -5221 -6336 -5608 -5223 -935 1174 -141 -1371 -5097 -3319 -407 -378
5296 -378 -4012 -3360 -5383 -6410 -5538 -5546 -5822 -5555 -1749 2394 2370 413 -2901 -4805 -5170 -2547 -4159 -5370
5278 -5370 -6505 -8510 -4392 -985 -4247 -5136 -5154 -4486 -3835 -1473 -2158 -1551 -1129 -1287 -20 -1205 33
5261 33 1779 1459 815 507 1621 5005 4059 -143 -5807 -7139 -8813 -6941 -3837 -1345 -2236 -3235 -1800
5244a800L726K893n60j687k101k151l853P68J786r11K106J011l60p00Q04Q5j984
5227b928Q0J153J808K341q85l708o82j898k965o08K082J664K401q0J92q71J415
5210a489K597J408k868j261M50k56O92J52k126M12J226J206J615J650q86K8K76
5193B826q60J291l085n83j273j62K845Q99l56j41J20k363k432k01J541J472J362
5176I00K325K066l245l229J56R35K02l869R56j808k148j646j547N423O437J81
5160B089j30K054k536j448K358P67j365l671j787J509K461r98j141j052K157K913
5144B180k054J201L56j280j764j149o68J030m24m63L506M742J792p60n826j878
5128a459K869L710J746k229j477j31j786L94J53q17j164j258j415j284K104M416
$$ plain form
5244 -1800 1926 4819 4259 2572 471 -1680 -5533 -4765 -2979 -3890 -1784 -773 -1133 -1833 -1029 -944 -2928
5227 -2928 -2848 -1695 113 2454 1569 -2139 -2821 -4719 -7684 -8292 -6210 -4546 -2145 -2225 -2033 -2904 -1489
5210 -1489 1108 2516 -352 -1613 -1163 -1419 -727 -575 -2701 -2289 -1063 143 1758 3408 2522 2550 2826
5193 2826 1966 3257 172 -411 -1684 -1846 999 1898 1542 1401 1521 -842 -3274 -3475 -1934 -462 900
5176 900 3225 5291 2046 -1183 -1027 -92 110 -3759 -2803 -4611 -6759 -8405 -9952 -4529 1908 2089
5160 2089 1959 4013 1477 29 2387 3154 1789 -1882 -3669 -2160 301 -697 -1838 -2890 -733 2180
5144 2180 126 1327 1683 403 -1361 -2510 -3178 -2148 -2572 -3035 471 5213 7005 6245 419 -1459
5128 -1459 1410 5120 6866 4637 3160 3029 1243 1637 1790 973 -191 -1449 -2864 -4148 -2044 2372
5112B372R68j14j983k202l75m23q28K90J284K143J196k679l026o55P2l87N91K28
5094c528J425L30l670P62J889J243K06L22l795J644M72K335o15k993j883r83L917
5077b922K459j988l939j82L032J095l15j244j360q46K386J06J36Q89J783l61L07
5060i64r38M59N100J993J235l81j629m814o67J33j314k359j988j224J84L518j064
5043d720K246K337J110K002Q37N96l096k567o2j183K534J523j380p80L482K992
5027E871k428k82k055m113J584K608p18k119O8N60L917j174k626K06K765M25J539
5010D028m480k895p31J529L72l292k933M921J334j064j900k823K645N385N376
4995E472N66n00j890k754j087j867l86L40l365n232k228M482N320L44q98j054
$$ plain form
5112 2372 3340 3226 1243 -959 -1334 -1757 -2585 -2295 -1011 1132 2328 -351 -3377 -4032 -3960 -4347 -3756 -3528
5094 -3528 -2103 -1773 -5443 -4681 -2792 -1549 -1343 -1021 -4816 -3172 -2700 -365 -980 -3973 -5856 -6839 -2922
5077 -2922 -463 -2451 -6390 -6572 -3540 -2445 -2760 -4004 -5364 -6210 -3824 -3718 -3582 -2693 -910 -1271 -964
5060 -964 -1902 -1443 3657 5650 6885 6504 4875 61 -606 -473 -1787 -4146 -6134 -7358 -7174 -3656 -4720
5043 -4720 -2474 -137 973 2975 3812 4408 1312 -1255 -1317 -2500 34 1557 177 -603 2879 5871
5027 5871 3443 3161 1106 -3007 -1423 1185 467 -1652 -1584 -1024 2893 1719 -907 -701 2064 2489 4028
5010 4028 -452 -3347 -4078 -2549 -2177 -5469 -8402 -3481 -2147 -3211 -5111 -7934 -5289 96 5472
4995 5472 6038 5538 3648 894 -193 -2060 -2446 -2106 -5471 -10703 -12931 -8449 -3129 -2785 -3683 -4737
4979d737K19k340K781O530J401J281j677J545K841m360n610K03N04M39k645j534
4963e159K468J059R34j278k36J092L72l30l171j304M47K982L864k441j546M85
4947a762K834n93k351k421O08N502K379k967n381l898j788K085L109L576R01m197
4931d364l143M033L599J317j728r33K43j752R93K294p54J008j77L36j012j146
4915a186j569k094j324L048K319k91K323j283J846p97j237o60j554J0j143O66
4899b926q50j588k101L012J551K930K356j301j808l043l619J201K572k301K280
4884c635N227p32j373J860pl137j097l33J162n7Q38M25k238m95OJ239R37r52j637
4865c999j139O94O43K833J865J491r50J341K134j1k90J927l160J603L287l167
$$ plain form
4979 -4737 -4518 -6858 -4077 2453 3854 5135 3458 5003 7844 3484 -2126 -1923 -1419 -980 -3625 -5159
4963 -5159 -2691 -1632 -698 -1976 -2212 -1120 -748 -1078 -4249 -5553 -5106 -2124 1740 -701 -2247 -1762
4947 -1762 1072 479 -1872 -4293 -3685 1817 4196 1229 -4152 -8050 -9838 -7753 -4644 -1068 -167 -4364
4931 -4364 -7507 -3474 125 1442 -286 -1219 -976 -2728 -1735 559 -195 813 636 972 -40 -1186
4915 -1186 -2755 -4849 -6173 -3125 -806 -1097 1226 -57 1789 992 -245 -905 -2459 -2449 -3592 -2926
4899 -2926 -3776 -5364 -7465 -4453 -2902 28 2384 1083 -725 -3768 -7387 -6186 -3614 -5915 -3635
4884 -3635 1592 860 -513 1347 1340 -1797 -2894 -3227 -2065 -2122 -1284 -859 -3097 -3592 -3586 -2347 -1410 -2362 -3999
4865 -3999 -5138 -4444 -3801 -968 897 2388 1438 2779 4913 4902 4612 6539 3379 4982 8269 5102
4849E102l512k106J016M30J638Q09K36m237J231K998j986l39J261r15l592j133
4833c099J302o56j443n33N6R15P75J84j636Q05j628o17k404K37L088L040L11K806
4815A503K585o90n88k857k847J186n41j51J133j706j430k44J646J184k129j539
4799e485j098J186M403K413P17o72O1k991j737k64j492J002J426k087l173K649
4783e142L68J336K581k740m122J672M41o22j753O82O105K642r58l25k15o62J531
4766H19M70j851k600j92q04k953j885lK238K343j393j741N16K40O65R4R92K48
4748d797J288M020J416K142j608l795L263J290l717j973j285j41j792m044j154
4733a0887J576N632J456j437q96L08j178K82K279j003r15L987L432l082j03K144
$$ plain form
4849 5102 1590 -516 500 930 2568 3377 3613 -624 607 3605 1619 1280 2541 1626 -1966 -3099
4833 -3099 -1797 -2453 -3896 -4429 -4373 -3458 -2683 -2499 -4135 -3330 -4958 -5575 -7979 -7742 -4654 -1614 -1303 1503
4815 1503 4088 3398 2810 -47 -2894 -1708 -2249 -2400 -1267 -2973 -4403 -4647 -3001 -1817 -3946 -5485
4799 -5485 -6583 -5397 -994 1419 2136 1464 1525 -1466 -3203 -3467 -4959 -3957 -2531 -4618 -7791 -5142
4783 -5142 -4774 -3438 -857 -3597 -7719 -6047 -5606 -6228 -7981 -7299 -1194 1448 490 165 -50 -712 819
4766 819 1289 -562 -3162 -3354 -4158 -7111 -8996 -8999 -6761 -4418 -5811 -7552 -7036 -6796 -6131 -6037 -5045 -4797
4748 -4797 -3509 511 1927 4069 2461 -1334 1929 3219 -498 -2471 -3756 -3897 -5689 -9733 -10887
4733 -10887 -9311 -3679 -2223 -3660 -4556 -4248 -5426 -5144 -2865 -3868 -4783 -796 2636 -446 -549 1595
4717A595k284O64J608k03l074j303J621m41J208J923J373L132l05m305r91j571
4701a353l005K94j04l482J046K384P80L083J332P85j672m898r41R35N80n23J145
4684c614J934m39K675j261J202j797J173o60J018R37j295N51N579j486j513j718
4668A286l208m42j44j223J616K818k214k075m279k267O89J248K88L371J809J7
4652b710J327Q57k337j741J622K410o7q15j624J24Q09n26m261j074l23K166L475
4635b688l45N39k692L88j092J556j19L2L324k002J572J625J336J44j731l42q97
4618a392R20M15k279K577k481l147q00K435J147q04o46l694j359J387N660o6j715
4601c842o23j838L21P13J459M248J77Q09m13p66m51K759K798R60j666l471j480
$$ plain form
4717 1595 -689 -25 1583 1380 -1694 -2997 -1376 -1817 -609 1314 2687 5819 5514 1209 218 -1353
4701 -1353 -4358 -4064 -4168 -7650 -6604 -4220 -3440 -357 975 1760 88 -4810 -5751 -4816 -4236 -4759 -3614
4684 -3614 -1680 -2119 556 -705 497 -1300 -127 -787 231 1168 -127 424 6003 4517 3004 1286
4668 1286 -1922 -2364 -2508 -3731 -2115 703 -1511 -3586 -7865 -10132 -9443 -8195 -7907 -4536 -2727 -2710
4652 -2710 -1383 -526 -2863 -4604 -2982 -572 -639 -1454 -3078 -2954 -2145 -2671 -6932 -8006 -8329 -6163 -2688
4635 -2688 -3033 -2494 -5186 -4798 -5890 -4334 -4453 -4421 -1097 -3099 -1527 98 1434 1578 -153 -495 -1392
4618 -1392 -472 -57 -2336 241 -2240 -5387 -6187 -3752 -2605 -3409 -4055 -7749 -9108 -7721 -2061 -2127 -3842
4601 -3842 -4465 -6303 -5982 -5269 -3810 438 615 1424 1011 245 -206 2553 5351 6311 4645 1174 -306
4584c06l160L61L72n23K971o16m481K075K617L321K868O45K90j772q46j641l410
4567a235n972j42Q91m73j985l3j760L619J122N08J678K233p86Q41J663J166j046
4550B89r49m525K050M248j936n92n1j65J511r85j250l124M238K509L02k617j376
4533b423K410J3m77J346l695l373j769M290L504O28k468j734L322J834k278O60
4517b10R63k036n043m584K516N550O094l202n785J28L466J631J457J13j26Q30
4501A762j448j427j046k007P42n15p4K445K395o15L13o61j146M50k41l859M94
4484d438J837J115K531J975J144q78r99N9j823j764Q07J525j145p18n20j226J132
4467a386J933L20j967r33k570L135K439k175j050M896M81j2j551k358O14J887
$$ plain form
4584 -306 -3466 -3105 -2733 -3256 -285 -901 -5382 -3307 -690 2631 5499 6144 6434 4662 3816 2175 -1235
4567 -1235 -7207 -7349 -6458 -6931 -8916 -8949 -10709 -7090 -5968 -5460 -3782 -1549 -2335 -1494 169 1335 289
4550 289 -660 -5185 -3135 1113 -823 -1415 -1466 -1631 -120 -1105 -2355 -5479 -1241 1268 1570 -1047 -2423
4533 -2423 -13 0 -477 869 -2826 -6199 -7968 -3678 -174 454 -2014 -3748 -426 1408 -870 -210
4517 -210 753 -1283 -6326 -10910 -8394 -2844 3250 48 -5737 -5609 -2143 -512 945 1058 932 1762
4501 1762 314 -1113 -2159 -4166 -3424 -3939 -4013 -1568 827 212 525 -136 -1282 -832 -1073 -4932 -4438
4484 -4438 -2601 -1486 1045 3020 4164 3286 2287 2346 523 -1241 -434 1091 -54 -772 -1292 -2518 -1386
4467 -1386 547 867 -1100 -2033 -4603 -1468 971 -1204 -2254 2642 3123 3111 1560 -798 -184 1703
4451A703j003k144j530q26J840j982k092K676L624J080J137J390M13j144k178
4436I64P91J046l903l638O58K125K418p88k579j588j518L110N44o06L96K112j315
4419a771r27j972k959o20L414L802J957K33J231k231N73P5k091J179l70k013o7
4402b557k18K397J555L97j037l153n82O90J503Q49K904j165k239j583J482K823
4386B066L20J000P14R63k103J42L63j000k759n145O30p58j24r3L507K939N51m04
4368H09r07P34L270J995J897k241m75j256k795j09J437J83J50l327k419J088M595
4351B629K00j873k704j188J675L798K421q63L65Q13l603m938M0k26k550k004Q15
4334g193L692J782j985p93J415k210k00O32K144J307j226L357L062K804k331k620
$$ plain form
4451 1703 700 -1444 -2974 -3800 -1960 -3942 -6034 -3358 266 1346 2483 3873 4286 3142 964
4436 964 1755 2801 -1102 -4740 -4082 -1957 461 -327 -2906 -4494 -6012 -2902 -2358 -2964 -2568 -456 -1771
4419 -1771 -2698 -4670 -7629 -8249 -4835 -1033 924 1157 2388 157 730 805 -1286 -107 -477 -2490 -2557
4402 -2557 -2775 -378 1177 1574 537 -2616 -3198 -2508 -1005 -156 2748 1583 -656 -2239 -757 2066
4386 2066 2386 3386 4100 5063 2960 3102 3465 2465 -294 -5439 -4809 -5567 -5691 -5784 -2277 662 1213 809
4368 809 -98 636 3906 5901 7798 5557 5082 3826 1031 922 2359 2542 2692 -635 -3054 -1966 2629
4351 2629 2829 956 -1748 -2936 -1261 2537 4958 4095 4460 5273 1670 -3268 -3228 -3454 -6004 -8008 -7193
4334 -7193 -3501 -1719 -3704 -4497 -3082 -5292 -5492 -4860 -2716 -1409 -2635 722 3784 6588 4257 1637
4318A637j262M50m70J384j730J000J160m51j793P4K776K86m30j913P42L748L781
4301H989o48l241j544k240l598K98M15J624R45j578j815j099k413J773O14m445
4285g963K521J776L39O63j205N28J245L96P0O80j836j490J48L459L05l493o32
4268d489k06j261K724K811j707j502l374L700O119P28Q2k952n485Q10L24j268
4252d946K71J232J658j477k481j351N726M698J060M59p89j139k080o13N66L56
4236A150J46R26n109m278N49l695K551J986K78J531K932M158K557l60m535n714
4220d927j219m62K202M544n34j199l41k50k077R49J441l54K222K257j563n70l256
4203c137L406L552n456n125M93K515j715J272q23L090K527J004j873r89r63L104
$$ plain form
4318 1637 375 825 355 1739 9 1009 2169 1718 -75 -1 2775 3061 2631 718 1460 5208 8989
4301 8989 8341 5100 3556 1316 -2282 -1984 -1569 55 1000 -578 -2393 -3492 -5905 -4132 -3518 -7963
4285 -7963 -5442 -3666 -3327 -2664 -3869 -3341 -2096 -1700 -1630 -950 -2786 -4276 -4128 -669 -364 -3857 -4489
4268 -4489 -4695 -5956 -3232 -421 -2128 -3630 -7004 -3304 2815 3543 3625 673 -4812 -4002 -3678 -4946
4252 -4946 -4675 -3443 -1785 -3262 -5743 -7094 -1368 3330 4390 4849 4060 2921 841 228 794 1150
4236 1150 1296 2222 -2887 -7165 -6616 -10311 -7760 -5774 -5496 -3965 -1033 3125 5682 5322 787 -4927
4220 -4927 -6146 -6608 -4406 138 -396 -1595 -1936 -2186 -4263 -3314 -1873 -2227 -5 2252 689 119 -3137
4203 -3137 269 3821 -1635 -6760 -6267 -3752 -5467 -4195 -5018 -1928 599 1603 -270 -1259 -2222 882
4187H82j8m203l840K080J448K175M32l608o68N70Q50p93m079K203N4j521J451
4170f585M183J59J285K127O71L91k135J815P43j244J09N015L022m320m314m032
4154c110M886l42l680L292Q93k086K875l321m965N80J3j565l190j899p9J756L908
4137f034N33N35K101O96n82j479k745J7l135K179N806L213L69N5j372q08j896
4120b547j435m86n53K681k49K64n27j320K835J581j399j633R08N95l798k436K418
4103e101J132J859K617L193m626n47K474O57J191K941j739l881l527j349L594
4088a112N319L254R71J182k544o069J50L03m380j031O41J203k698L714m36k43
4072a776M630l009O3l440k385K112R40K791R02j109L012N21m870o07k123k357
$$ plain form
4187 882 864 -3339 -7179 -5099 -3651 -1476 -1044 -4652 -5320 -4750 -3900 -4693 -8772 -6569 -6515 -8036 -6585
4170 -6585 -2402 -2243 -958 1169 1840 2231 96 1911 2654 1410 1519 6534 9556 5236 922 -3110
4154 -3110 1776 1434 -2246 1046 1939 -147 2728 -593 -5558 -4978 -4965 -6530 -9720 -11619 -11698 -9942 -6034
4137 -6034 -5501 -4966 -2865 -2169 -2751 -4230 -6975 -6958 -10093 -7914 -2108 1105 1474 1529 157 -651 -2547
4120 -2547 -3982 -4468 -5021 -2340 -2589 -2325 -2852 -4172 -1337 244 -1155 -2788 -1880 -1285 -5083 -7519 -5101
4103 -5101 -3969 -2110 507 3700 -926 -1473 1001 1658 2849 5790 4051 170 -3357 -4706 -1112
4088 -1112 4207 7461 8432 9614 7070 1001 1151 1454 -2926 -3957 -3316 -2113 -4811 -1097 -1533 -1776
4072 -1776 2854 -155 -92 -3532 -5917 -3805 -2865 -74 828 -281 2731 3252 -1618 -2225 -4348 -6705
4056f705K636J873r29K967K669j45l787K03k26q11l39l034K93Q23k71l03J535
4039c551K114k100J217J836K480j209l724K255J259K84J385J851r68j335R56m56
4023B294k081J039J975J063Q62k730j131J341M388k297l844m620O34n43Q16J809
4007a025j049L468M67q00J654M86k227l467j557j873P52J485j772P12J982j253
3991d017m00Q5J817K412k51l334p65j60N064N83j723j473j797j434o76L31J367
3974d371J725Q39j361J079l410k176L100L641J745k110l068J39J837J774J85L068
3958B636J252m727l401J939L196o65K14n81o85K693P53k169k187K01p49j496J64
3941c612N05M157N876j495l729j059L156J060l916k382k047l293P56L721L761
$$ plain form
4056 -6705 -4069 -2196 -3125 -158 2511 2366 -1421 -1218 -1444 -2255 -2594 -5628 -5335 -4512 -4783 -5086 -3551
4039 -3551 -1437 -3537 -2320 -484 1996 787 -2937 -682 577 861 2246 4097 3129 1794 2750 2294
4023 2294 213 1252 3227 4290 5152 2422 1291 2632 7020 4723 879 -3741 -3107 -3650 -2834 -1025
4007 -1025 -2074 1394 1861 1061 2715 3201 974 -2493 -4050 -5923 -5171 -3686 -5458 -4746 -2764 -4017
3991 -4017 -4417 -4332 -2515 -103 -354 -3688 -4453 -4613 451 1034 -689 -2162 -3959 -5393 -6069 -5738 -4371
3974 -4371 -2646 -1807 -3168 -2089 -5499 -7675 -4575 -934 811 -1299 -4367 -4228 -2391 -617 -432 2636
3958 2636 3888 -839 -4240 -2301 895 230 444 -137 -822 1871 2624 455 -1732 -1531 -2280 -3776 -3612
3941 -3612 -3107 1050 6926 5431 1702 643 3799 4859 943 -1439 -3486 -6779 -6023 -2302 1459
3926A459P69K694j454o464m751r35r33K212J257J775M750N48n6K91l939p20O36
3909b861l486L840J52K154J787n18k999O29j420n56L998k339n71p07J26L766J059
3892B054k15L10M09m157l572k092j514M215M178q49q76j097j037o12J09K502J114
3875a130L159N84M08L417m170l810j144M451j563j254J545k409k289J817R02j852
3859c338l020k483L9L004M08j32K472K956P64Q90K063n74l555K253L370m77k053
3842B587m260j190Q88J749J381n44l04J16j419j844J362O26m186L19J25lm55J204
3824c848M450K247J062m678l20J644j00J840K77k430l63K922J078j278J863o33
3808C733m475k563j621k979K43o59j513K053M675M40j315L549j01l98j638k856
$$ plain form
3926 1459 2228 4922 3468 -2996 -7747 -8682 -9615 -7403 -6146 -4371 379 927 871 1162 -2777 -3497 -2861
3909 -2861 -6347 -2507 -2355 -201 1586 1068 -1931 -1302 -2722 -3278 720 -1619 -2190 -2897 -2771 995 2054
3892 2054 1839 2149 2558 -1599 -5171 -7263 -8777 -4562 -384 -1233 -2109 -3206 -4243 -4855 -4746 -2244 -1130
3875 -1130 2029 2613 3021 6438 2268 -1542 -2686 1765 202 -1052 493 -1916 -4205 -2388 -1486 -3338
3859 -3338 -6358 -8841 -8802 -5798 -5390 -5522 -3050 -94 670 1560 3623 3049 -506 1747 5117 4640 2587
3842 2587 -1673 -2863 -1975 -226 1155 611 307 423 -996 -2840 -1478 -852 -5038 -4719 -4594 -4597 -5052 -3848
3824 -3848 602 2849 3911 -767 -1087 557 457 2297 2574 144 -219 2703 3781 2503 4366 3733
3808 3733 -742 -3305 -4926 -7905 -7662 -8321 -9834 -7781 -3106 -2666 -3981 -432 -533 -931 -2569 -5425
3792e425j938K564J618J743mj424K221q83p02j896j648K228J08J855O476N066
3776I959j545j937l063n121k045J507j336j705q0M132L246K06m854l1J039l74
3760b002R19J687k10k89l474n899k718J808L931J161J095K343j868k246N13M896
3744c53j690k632K626J527Q98L170j041m198j628J604J854K20n25J658K187L68
3728D045J939J466m312N36M334k23l220k421m544O75K286o34j367k314L29K851
3712e74J110m358q59J131p17j223l73J591N371j833q82K64P71k360p74J876j057
3695b896K42P90L91Q17M70M81K827k214l55j162r63q21j282Q04j1M37M165M18
3677B138k55J990J104J370j192k396m131k475l6P28R58K56N45J543j092O33L424
$$ plain form
3792 -5425 -7363 -4799 -3181 -1438 -1442 -2866 -645 -1528 -2230 -4126 -5774 -3546 -3438 -1583 4893 9959
3776 9959 8414 6477 3414 -1707 -3752 -2245 -3581 -5286 -5366 -1234 2012 2218 -2636 -2667 -1628 -2002
3760 -2002 -1083 604 394 105 -3369 -9268 -11986 -10178 -6247 -5086 -3991 -1648 -3516 -5762 -5249 -353
3744 -353 -2043 -4675 -2049 -522 376 3546 2505 -1693 -3321 -1717 137 357 -168 1490 3677 4045
3728 4045 5984 7450 3138 3674 8008 7785 4565 2144 -2400 -1725 561 -73 -1440 -3754 -3425 -574
3712 -574 536 -3822 -4681 -3550 -4267 -5490 -5863 -4272 1099 -734 -1616 -1352 -581 -2941 -3715 -1839 -2896
3695 -2896 -2654 -1864 -1473 -656 -186 295 3122 908 553 -609 -1572 -2393 -3675 -2871 -2882 -2445 1720 2138
3677 2138 1883 3873 4977 6347 5155 2759 -1372 -3847 -3883 -3155 -2197 -1941 -1396 147 -945 -312 3112
3660C112k720j961j79J251k480p46L007o36m600K55L831n496q54N944K585q3J04
3643C34o26K304J431o77j193j696Q57l264J365L25r84l619k076N87O34J743J624
3626b931J922J73J50K619K063k132j18j196k23j837m699k534K365l17J542j812
$$ plain form
3660 3112 392 -1569 -1748 -497 -2977 -3723 -716 -1352 -5952 -5697 -1866 -7362 -8216 -2272 313 230 334
3643 334 -292 2012 3443 2766 1573 -123 734 -2530 -1165 -840 -1824 -5443 -7519 -6932 -6298 -4555 -2931
3626 -2931 -1009 -836 -686 1933 3996 1864 1746 550 327 -1510 -6209 -8743 -6378 -6695 -5153 -6965
$$ [...]
##END NTUPLES=NMR SPECTRUM
##END=
