##TITLE=Analysis number 326799
Compound Code cc 06008
Project Code adrs
Chemist Name melford
##JCAMPDX= 6.0         $$ Bruker NMR JCAMP-DX V2.0
##DATA TYPE= NMR SPECTRUM
##DATA CLASS= NTUPLES
##ORIGIN= Bruker BioSpin GmbH
##OWNER= nmr
$$ XWIN-NMR		Version 3.5
$$ Thu Feb 22 12:10:49 2007 GMT Standard Time (UT+0h)  MAYBRIDGE\nmr@NMR_250MHZ
##.OBSERVE FREQUENCY= 250.131544655141
##.OBSERVE NUCLEUS= ^1H
##.ACQUISITION MODE= SIMULTANEOUS (DQD)
##.ACQUISITION SCHEME= undefined
##.AVERAGES= 16
##.DIGITISER RES= 18
##SPECTROMETER/DATA SYSTEM= dpx250
##.PULSE SEQUENCE= zg30
##.SOLVENT NAME= CDCl3
##.SHIFT REFERENCE= (INTERNAL, CDCl3, 0, 16.4485)
##AUDIT TRAIL= $$ (NUMBER, WHEN, WHO, WHERE, WHAT)
$$ ##TITLE= Audit trail, XWIN-NMR		Version 3.5
$$ ##JCAMPDX= 5.01
$$ ##ORIGIN= Bruker BioSpin GmbH
$$ ##OWNER= nmr
$$ C:\u/data/dgb/nmr/ADRS/1560/pdata/1/auditp.txt
$$ ##AUDIT TRAIL=  $$ (NUMBER, WHEN, WHO, WHERE, WHAT)
(   1,<2007-02-22 12:10:24.74 +000>,<MAYBRIDGE\nmr>,<NMR_250MHZ>,
      <created by zg, POWCHK disabled, PULCHK disabled
       configuration hash MD5:
       49 4B E0 1D 92 C2 6B 37 9F E6 65 BC 52 41 86 1D
       data hash MD5: 64K
       50 1A 85 C5 43 E8 DC 41 DB 79 8A BA 69 6A EC CD>)
(   2,<2007-02-22 12:10:38.91 +000>,<MAYBRIDGE\nmr>,<NMR_250MHZ>,
      <Start of raw data processing
       ef LB = 0.3 FT_mod = 6 PKNL = 1 SI = 32K 
       data hash MD5: 32K
       4A B5 88 E7 BF 88 27 A4 B4 06 B5 21 4D AA 62 11>)
(   3,<2007-02-22 12:10:40.64 +000>,<MAYBRIDGE\nmr>,<NMR_250MHZ>,
      <apk 
       data hash MD5: 32K
       5B D8 0B 2A F3 EF 00 8B 03 64 82 D7 12 EA A2 74>)
(   4,<2007-02-22 12:10:41.38 +000>,<MAYBRIDGE\nmr>,<NMR_250MHZ>,
      <abs ABSG = 5 
       data hash MD5: 32K
       14 54 2B E0 59 69 A4 B3 10 1A 66 C3 47 9E 8A 27>)
$$ ##END=
$$ 
$$ hash MD5
$$ AA A5 9B F8 C5 0B F5 CC D0 77 3C 18 52 8E 14 3D
##$RELAX= 
##$RELAX= 
##$RELAX= 
##$RELAX= 
##$RELAX= 
##$RELAX= 
##$RELAX= 
$$ Bruker specific parameters
$$ --------------------------
##$DU= <C:\u>
##$EXPNO= 1560
##$NAME= <ADRS>
##$PROCNO= 1
##$TYPE= <nmr>
##$USER= <dgb>
##$AMP= (0..31)
100 100 100 100 100 100 100 100 100 100 100 100 100 100 100 100 100 100 
100 100 100 100 100 100 100 100 100 100 100 100 100 100 
##$AQSEQ= 0
##$AQ_mod= 3
##$AUNM= <au_zg>
##$AUTOPOS= <7 >
##$BF1= 250.13
##$BF2= 250.13
##$BF3= 250.13
##$BF4= 250.13
##$BF5= 500.13
##$BF6= 500.13
##$BF7= 500.13
##$BF8= 500.13
##$BYTORDA= 1
##$CFDGTYP= 0
##$CFRGTYP= 5
##$CHEMSTR= <none>
##$CNST= (0..31)
1 1 145 1 1 1 1 1 1 1 1 1 1 1 1 1 1 1 1 1 1 1 1 1 1 1 1 1 1 1 1 1 
##$CPDPRG= <>
##$CPDPRG1= <>
##$CPDPRG2= <>
##$CPDPRG3= <>
##$CPDPRG4= <mlev>
##$CPDPRG5= <mlev>
##$CPDPRG6= <mlev>
##$CPDPRG7= <mlev>
##$CPDPRG8= <mlev>
##$CPDPRGB= <>
##$CPDPRGT= <>
##$D= (0..31)
0 1 0 0 0 0 0 0 0 0.06 0 0 0 0 0 0 0.0002 0 0 0 0 0 0 0 0 0 0 0 0 0 0 
0 
##$DATE= 1172146223
##$DBL= (0..7)
120 120 120 120 120 120 120 120 
##$DBP= (0..7)
150 150 150 150 150 150 150 150 
##$DBP07= 0
##$DBPNAM0= <>
##$DBPNAM1= <>
##$DBPNAM2= <>
$$ [...]
##$SUBNAM7= <"">
##$SUBNAM8= <"">
##$SUBNAM9= <"">
##$SW= 20.6930455092707
##$SWIBOX= (0..15)
0 0 3 0 0 0 0 0 0 0 0 0 0 0 0 0 
##$SW_h= 5175.983436853
##$TD= 65536
##$TD0= 1
##$TE= 295.16
##$TE2= 300
##$TE3= 300
##$TEG= 300
##$TL= (0..7)
0 120 120 120 120 120 120 120 
##$TP= (0..7)
150 150 150 150 150 150 150 150 
##$TP07= 0
##$TPNAME0= <>
##$TPNAME1= <>
##$TPNAME2= <>
##$TPNAME3= <>
##$TPNAME4= <>
##$TPNAME5= <>
##$TPNAME6= <>
##$TPNAME7= <>
##$TPOAL= (0..7)
0.5 0.5 0.5 0.5 0.5 0.5 0.5 0.5 
##$TPOFFS= (0..7)
0 0 0 0 0 0 0 0 
##$TUNHIN= 0
##$TUNHOUT= 0
##$TUNXOUT= 0
##$USERA1= <user>
##$USERA2= <user>
##$USERA3= <user>
##$USERA4= <user>
##$USERA5= <user>
##$V9= 5
##$VALIST= <valist>
##$VCLIST= <CCCCCCCCCCCCCCC>
##$VD= 0
##$VDLIST= <DDDDDDDDDDDDDDD>
##$VPLIST= <PPPPPPPPPPPPPPP>
##$VTLIST= <TTTTTTTTTTTTTTT>
##$WBST= 1024
##$WBSW= 4
##$XGAIN= (0..3)
0 0 0 0 
##$XL= 0
##$YL= 0
##$YMAX_a= 258979
##$YMIN_a= -324035
##$ZGOPTNS= <>
##$ZL1= 120
##$ZL2= 120
##$ZL3= 120
##$ZL4= 120
##$ABSF1= 16.44845
##$ABSF2= -4.244722
##$ABSG= 5
##$ABSL= 3
##$ALPHA= 0
##$AQORDER= 0
##$ASSFAC= 0
##$ASSFACI= 0
##$ASSFACX= 0
##$ASSWID= 0
##$AUNMP= <proc_1d>
##$AZFE= 0.1
##$AZFW= 0.1
##$BCFW= 0
##$BC_mod= 0
##$BYTORDP= 0
##$COROFFS= 0
##$CY= 12.5
##$DATMOD= 1
##$DC= 0
##$DFILT= <>
##$DTYPP= 0
##$F1P= 14.0000005364418
##$F2P= -0.99999901652339
##$FCOR= 0.5
##$FTSIZE= 32768
##$FT_mod= 6
##$GAMMA= 0
##$GB= 0
##$INTBC= 1
##$INTSCL= 1
##$ISEN= 128
##$LB= 0.3
##$LEV0= 0
##$LPBIN= 0
##$MAXI= 10000
##$MC2= 0
##$MEAN= 0
##$ME_mod= 0
##$MI= 0
##$NCOEF= 0
##$NC_proc= -3
##$NLEV= 6
##$NOISF1= 0
##$NOISF2= 0
##$NSP= 0
##$NTH_PI= 0
##$NZP= 0
##$OFFSET= 16.44845
##$PC= 1
##$PHC0= 231.3088
##$PHC1= 8.953765
##$PH_mod= 1
##$PKNL= yes
##$PPARMOD= 0
##$PSCAL= 4
##$PSIGN= 0
##$REVERSE= no
##$SF= 250.130018395416
##$SI= 32768
##$SIGF1= 0
##$SIGF2= 0
##$SINO= 400
##$SIOLD= 32768
##$SREGLST= <1H.CDCl3>
##$SSB= 0
##$STSI= 32768
##$STSR= 0
##$SW_p= 5175.98343685301
##$SYMM= 0
##$S_DEV= 0
##$TDeff= 65536
##$TDoff= 0
##$TI= <Analysis number 999999
Compound Code 99
Book Reference 9
Project Code 9>
##$TILT= no
##$TM1= 0
##$TM2= 0
##$TOPLEV= 0
##$USERP1= <user>
##$USERP2= <user>
##$USERP3= <user>
##$USERP4= <user>
##$USERP5= <user>
##$WDW= 1
##$XDIM= 32768
##$YMAX_p= 412537953
##$YMIN_p= -522262
$$ End of Bruker specific parameters
$$ ---------------------------------
##NTUPLES= NMR SPECTRUM
##VAR_NAME=  FREQUENCY,     SPECTRUM/REAL,   SPECTRUM/IMAG
##SYMBOL=    X,             R,               I
##VAR_TYPE=  INDEPENDENT,   DEPENDENT,       DEPENDENT
##VAR_FORM=  AFFN,          ASDF,            ASDF
##VAR_DIM=   32768,         32768,           32768
##UNITS=     HZ,            ARBITRARY UNITS, ARBITRARY UNITS
##FACTOR=    0.157963299565203, 1,           1
##FIRST=     4114.25112321283, 0,            0
##LAST=      -1061.73231364018, 0,           0
##MIN=       -1061.73231364018, -522262,     0
##MAX=       4114.25112321283, 412537953,    0
$$ Real data points
##PAGE= N=1
##DATA TABLE= (X++(R..R)), XYDATA
$$ [...]
19929C6616l9932P840K7002j0099J8469L4261l4025k1876l4895j6841K1589M2663
$$ 36616 -3316 4524 31526 21427 39896 74157 40132 18256 -16639 -33480 -11891 30772
19917C0772r713k0587k7236M377K9271N2474r856j4996J8914K907k311j6773k7473
$$ 30772 21059 472 -26764 -22387 6884 59358 49502 34506 53420 56327 54016 37243 9770
19904I770k8706o249P943K9508l247m727K273J0725J7057J4235L004l5086m653
$$ 9770 -18936 -25185 -17242 12266 9019 4292 6565 17290 34347 48582 51586 16500 11847
19891A1847K871K14N677j1136l3308l929l706K4705K5619p969l6699k2901J07
$$ 11847 14718 14932 20609 9473 -23835 -27764 -31470 -6765 18854 10885 -25814 -48715 -48608
19878d8608J4033N007K2298K1023N4759M0356J3130k9671k0203k6832J8928L1072
$$ -48608 -34575 -29568 -7270 13753 68512 108868 121998 92327 72124 45292 64220 95292
19866I5292j4257p026J7710Q6270K4567q2069l0774J470R178L1350L6484M0739
$$ 95292 81035 74009 91719 177989 202556 120487 89713 91183 100361 131711 168195 208934
19854B08934j5630J1092o914k6271l5568l9194l0280j8060J5567k0669J7058q917
$$ 208934 193304 204396 197482 171211 135643 96449 66169 48109 63676 43007 60065 51148
19842E1148j3018m9978l0591Q372k2618k3491N261k26M6424O584K2227j7997j1209
$$ 51148 38130 -11848 -42439 -34067 -56685 -80176 -74915 -75141 -28717 -22133 94 -17903 -29112
19829b9112J5002j4747K1088M0006j7880J2646K1169L7732O0073J3637l290J9326
$$ -29112 -14110 -28857 -7769 32237 14357 27003 48172 85904 145977 159614 156324 175650
19817A75650L8408k534o5496k1627N1568K3602M1361J6860n9338r359J7021O751
$$ 175650 214058 211524 146028 124401 175969 199571 240932 257792 198454 189095 206116 212867
19805B12867l151O674j4695k8495m2984j3893o395j5004k3119R393n604l346j1825
$$ 212867 209716 216390 201695 173200 130216 116323 109928 94924 71805 81198 75594 72248 60423
19792F0423j0468r160L1079o440k7203j0027K5177q117m9686k2389J4574J6020
$$ 60423 49955 40795 71874 65434 38231 28204 53381 45264 -4422 -26811 -12237 3783
19780C783k6994l2696j7631L6559K3074J670j9432L191M9800K6153J5965L0136
$$ 3783 -23211 -55907 -73538 -36979 -13905 -12235 -31667 -28476 21324 47477 63442 93578
19768I3578L401k9431J91k0286M7866J923l4737J8720L6666j9773j395j8327j9432
$$ 93578 96979 67548 67739 47453 95319 97242 62505 81225 117891 98118 96723 78396 58964
19755E8964m0521k6469K8531j6511k0152p619j4374N4632Q0067q723n7457j5005
$$ 58964 18443 -8026 20505 3994 -16158 -23777 -38151 16481 96548 87825 30368 15363
19743A5363j5610O447j807J9441J9251J5407j0633m8836j5345K8529J4094k7809
$$ 15363 -247 6200 4393 23834 43085 58492 47859 -977 -16322 12207 26301 -1508
19731a508m4730j0242K2530P1042L2835l1025m4689j930J0046J2678K7255j5233
$$ -1508 -46238 -56480 -33950 37092 69927 38902 -5787 -7717 2329 15007 42262 27029
19719B7029k7471j3902K799k0188K3844J2435R43J0465L7199j7825O97K1668L1821
$$ 27029 -442 -14344 -11545 -31733 -7889 4546 5489 15954 53153 35328 36025 57693 89514
19706H9514r298O329p4795o1354l6600l216M7888M1410j9891L3371J1626j4265
$$ 89514 80216 86545 11750 -49604 -86204 -89420 -41532 -122 -20013 13358 24984 10719
19694A0719M3772O1496k8428j5385p118R497o512P143m2432J1940j6867l4960
$$ 10719 54491 115987 87559 72174 65056 74553 68041 75184 32752 44692 27825 -7135
19682g135J8877L8027K3402J5603J8629l1520q425J0403K2586l0207q5961n1068
$$ -7135 11742 49769 73171 88774 107403 75883 67458 77861 100447 70240 -15721 -66789
19670f6789J6780j980j8049O715j7366j5787j4939n045K0980O3578J6248M1042
$$ -66789 -50009 -51989 -70038 -63323 -80689 -96476 -111415 -116460 -95480 -31902 -15654 25388
19658B5388k1439k1124K7725L3577q471j2445K4827N2490k9468n7256L9315L0685
$$ 25388 3949 -17175 10550 44127 35656 23211 48038 100528 71060 13804 53119 83804
19646H3804L2644K4151O0185N3172J4526p988J9959m0885l1586l804k601N920
$$ 83804 116448 140599 200784 253956 268482 260494 280453 239568 207982 204178 201577 207497
19634B07497j0064k5935J8391L9979P228q3897p0672l3776j1585M763L2961j2797
$$ 207497 197433 171498 189889 229868 237096 153199 82527 48751 37166 41929 74890 62093
19622F2093l9217k5150L789J2011K6147O0115J2185l2501n0743n642K2936n304
$$ 62093 22876 -2274 1515 13526 39673 99788 111973 79472 28729 23087 46023 40719
19610D0719k0079l0780j9375M2634L3854j3467j8498J1161M0643K8425m8218n82
$$ 40719 20640 -10140 -29515 13119 46973 33506 15008 26169 66812 95237 47019 46437
19598D6437M0882L5292N7770L1475K5195k0247m3364N6114M8593M480O07R991
$$ 46437 87319 122611 180381 211856 237051 216804 173440 229554 278147 282627 283234 293225
19586B93225K5381K9065O9238P9912P4348J84719J52233M1393n6547l1095N1544
$$ 293225 318606 347671 416909 496821 571169 755888 908121 949514 892967 861872 913416
19575I13416J8593j56319j02329N5551J46834J15525J7485l0541p6810j60407
$$ 913416 932009 775690 673361 728912 875746 991271 1008756 978215 901405 740998
19565G40998j64526j75999j33416o5936k5849j7912K0231N741k5130l4766j2505
$$ 740998 576472 400473 267057 201121 175272 157360 177591 183332 158202 123436 110931
19554A10931L0424l5238k2564K3033L7161K3930k9981k3593n02K6956k514k7000
$$ 110931 141355 106117 83553 106586 143747 167677 137696 114103 113601 140557 138043 111043
19542A11043o921q1965j8488M7834N8054J1905L0151J7662P1596O0484J00257
$$ 111043 104122 22157 3669 51503 109557 121462 151613 169275 240871 301355 401612
19531D01612J67146J27616K4670q1242k9998O8118J64919J13279l5871l4279N6913
$$ 401612 568758 696374 721044 639802 609804 677922 842841 956120 920249 885970 942883
19520I42883O3300m6649m6303j6840K9743j29158k21849j61584p8898m1560q1308
$$ 942883 1006183 959534 913231 896391 926134 796976 575127 413543 334645 293085 211777
19509B11777l2648q810k8362j1801K505k0853o2025k6004N4759k3184m8718P744
$$ 211777 179129 170319 141957 130156 132661 111808 49783 23779 78538 55354 6636 14380
19497A4380M7847p588L202j8901J9058K6010K1342Q980k0144m6225J341M2182
$$ 14380 62227 54639 57841 38940 57998 84008 105350 114330 94186 47961 49302 91484
19485I1484N4032k901p163K2865r264m5335J4656j1575K6401K6593N677q342m3330
$$ 91484 145516 142615 135452 158317 149053 103718 118374 106799 133200 159793 165470 157128 113798
19472A13798O350O449N362L4283m38l6944K261k4122K1205l0189m0665j1249k1032
$$ 113798 120148 126597 131959 166242 165804 128860 131121 106999 128204 98015 57350 46101 25069
19459B5069m2135q107O211M7308L9490J1585q504L4100M069K895k6338m739J9715
$$ 25069 -17066 -25173 -18962 28346 67836 79421 70917 105017 109086 111981 85643 80904 100619
19446A00619L5808M91j1974O963J498P21P536J7371J765M5233M0151J8908k1230
$$ 100619 136427 136918 124944 131907 133405 134126 141662 159033 160798 206031 246182 265090 243860
19433B43860J1933N570l3141r163J1743j6640J577j2943m0026M7041N3917k2653
$$ 243860 255793 261363 228222 219059 230802 214162 215739 202796 162770 209811 263728 241075
19421B41075m6218l1011j0112j7872Q752J2353o355J5329l3170k3906J7803l1411
$$ 241075 194857 163846 153734 135862 144614 156967 150612 165941 132771 108865 126668 95257
19409I5257J8359k3980j2896J2597K6706M4252L7349k0708n7908M341J6583j0772
$$ 95257 113616 89636 76740 89337 116043 160295 197644 176936 119028 123369 139952 129180
19397A29180k5771N351M2203J3881l2148k290k062K8136L9312J2411Q052J0098
$$ 129180 103409 108760 150963 164844 132696 130406 128344 156480 195792 208203 216255 226353
19385B26353n091J707L9860M1958N2509K8188L3339O9381M8247O7246P2499O7885
$$ 226353 221262 222969 262829 304787 357296 385484 418823 488204 536451 603697 676196 744081
19373G44081O6856O1662O0489P2522P2009L2666N0580O6869J20700J19024J66908
$$ 744081 810937 872599 933088 1005610 1077619 1110285 1160865 1227734 1348434 1467458 1634366
19362A634366K51544K93751L64529N46720P92491J268169K152874L576925N820895
$$ 1634366 1885910 2179661 2544190 3090910 3883401 5151570 7304444 10881369 16702264
19353A6702264P296040M639531K43653J18931K724007K066815k308191l513508
$$ 16702264 23998304 28637835 28881488 29000419 31724426 33791241 31483050 27969542
19345B7969542m63814L633107M342156J054700k76375p86811m677195p797447
$$ 27969542 27505728 31138835 35480991 36535691 36259316 35472505 30795310 22997863
19337B2997863p053425m913701l121513j954433j259684q14927n94748l99826
$$ 22997863 15944438 11030737 7909224 5954791 4695107 3880180 3285432 2885606
19329B885606k76711j34808k1592j27779r9218p3757k9669j1257R824j621j7565
$$ 2885606 2608895 2474087 2452495 2324716 2225498 2151741 2122072 2110815 2120639 2119018 2101453
19318B101453l5488o2873K5201Q5216J07464Q8921J14753K16595L77325N32044
$$ 2101453 2065965 2003092 2028293 2113509 2220973 2309894 2424647 2641242 3018567 3550611
19308C550611P42896J274563J969366L278387N570408P783500N915049K3671k381378
$$ 3550611 4293507 5568070 7537436 10815823 16386231 24169731 30084780 30108451 27727073
19299B7727073L95196M680965N420820N39869k128104O25743K698198n30950l107947
$$ 27727073 28122269 32803234 38224054 38763923 36635819 37261562 39959760 39428810 36320863
19290C6320863q54228J352915k156211p361170q001941n918630l777842k421819
$$ 36320863 35466635 36819550 34663339 27302169 19300228 13381598 9603756 7181937
19282G181937j679513j104785p73213n90867m98376l12098j76595j67398j59318
$$ 7181937 5502424 4397639 3624426 3033559 2535183 2223085 2046490 1879092 1719774
19273A719774j04644l7194m5893j09297q4365r5166r2110j22309j19702q4485
$$ 1719774 1615130 1577936 1532043 1422746 1338381 1243215 1151105 1028796 909094 824609
19263H24609n5860j882n1673o9027j1582k2633l4059J9424k4411L9174L8235N0478
$$ 824609 768749 766867 715194 646167 634585 611952 577893 597317 572906 612080 650315 700793
19251G00793N5923J16749K17784K49389J54430J0505m4820j42838j66272j48516
$$ 700793 756716 873465 1091249 1340638 1495068 1505573 1460753 1317915 1151643 1003127
19241A003127m3327J29914J42624J565p5500k9317K0439q7971k34598k28040r0997
$$ 1003127 959800 1089714 1232338 1233903 1158403 1129086 1149525 1061554 826956 598916 507919
19230E07919p3837r1948n5898m2329j3237k2925m8244P623J2510l3471l9106K6542
$$ 507919 434082 342134 286236 243907 230670 207745 159501 167124 179634 146163 107057 133599
19218A33599N1441N131l6200J7879J2520J410O6252M6473K1539K632m2376j7993
$$ 133599 185040 190171 153971 171850 184370 185780 252032 298505 320044 322676 280300 262307
19206B62307K4285k4824J2307P8747O7070k8447o6628L398Q933o3105l6680k582
$$ 262307 286592 261768 274075 352822 419892 391445 324817 328215 337148 274043 237363 234781
19194B34781n70M6478J8701j3666k2809L7454r933l1969O114j9101m7023j688
$$ 234781 234211 280689 299390 285724 262915 300369 290436 258467 264581 245480 198457 196769
19182A96769L6091J2963n4662k7424J0966j4050K2524k8900O486M4109m1118l6781
$$ 196769 232860 245823 191161 163737 174703 160653 183177 154277 160763 204872 163754 126973
19170A26973m3206N2243M1129M2632N7756j4404m965p05n3284o3665J7281O5448
$$ 126973 83767 136010 177139 219771 277527 263123 258158 257453 204169 140504 157785 223233
19158B23233O2563M9648M6211L6534m889j8132N4013N9156R4857Q8253N2234L9125
$$ 223233 285796 335444 381655 418189 413300 395168 449181 508337 603194 691447 743681 782806
19146G82806M4485O1153L6558L6052M0481N8464Q8699M6286Q0746J39387J74704
$$ 782806 827291 888444 925002 961054 1001535 1059999 1148698 1194984 1275730 1415117 1589821
19135A589821K31056K21335L16970M69518P35350J064633J665880K874258M957653
$$ 1589821 1820877 2042212 2359182 2828700 3564050 4628683 6294563 9168821 14126474
19126A4126474P483157O917442J165812j248423J445985L377174n09292l542207
$$ 14126474 21609631 28527073 29692885 28444462 29890447 33267621 32758329 29216122
19118B9216122j049259L290867K749782l333360m971358j908950K361677K969677
$$ 29216122 28166863 31457730 34207512 30874152 25902794 23993844 26355521 29325198
19110B9325198l036385o986238o177977m124497k429741j408792r26829p03340
$$ 29325198 26288813 19302575 13124598 9000101 6570360 5161568 4234739 3531399
19102C531399n19840k89851j61115j54826j69166j10203L0290J4801k6958n6124
$$ 3531399 3011559 2721708 2560593 2405767 2236601 2126398 2156688 2171489 2144531 2088407
19092B088407O6884O6201o945J4895J8293N9075J26485J46982J61904L07251N26893
$$ 2088407 2155291 2221492 2214547 2229442 2247735 2306810 2433295 2580277 2742181 3049432 3576325
19081C576325Q04100J150513J807762L094539N272521Q395772R460724M563916
$$ 3576325 4380425 5530938 7338700 10433239 15705760 24101532 33562256 38126172
19073C8126172J117741J737906j493770o030448m860368k72006M752866N485718
$$ 38126172 39243913 40981819 39488049 33457601 28597233 28325227 33078093 38563811
19065C8563811o31555l486498l68925J785147l037263q069221p771816n338727
$$ 38563811 37932256 34445758 34076833 35861980 32824717 24755496 16983680 11644953
19057A1644953l290910k048853j377706r52958p32177m79883l52183k40239j60620
$$ 11644953 8354043 6305190 4927484 3974526 3242349 2762466 2410283 2170044 2009424
19048B009424j65606j52783p5716q6182r6209j14575p6930j06927j25840p7427
$$ 2009424 1843818 1691035 1615319 1529137 1432928 1318353 1241423 1134496 1008656 931229
19038I31229p0049p3393j27256n5029l6225l4283l7139o8270l5933n7410j7941
$$ 931229 861180 787787 660531 605502 569277 534994 497855 429585 393652 336242 318301
19027C18301O832L3277J0916j5180l6200j3054K4105J3683m9048m7020k6726K1936
$$ 318301 325133 358410 369326 354146 317946 304892 328997 342680 293632 246612 219886 241822
19015B41822j367j5452N1121R8743M4859m487j894m014k2335K9398M358J3923
$$ 241822 240455 225003 276124 374867 419726 415239 413345 409331 386996 416394 420752 434675
19003D34675Q264o2689r3855l8369J1452l7879j3984m5118l6969m6735k8066K508
$$ 434675 442939 380250 286395 248026 259478 221599 207615 162497 125528 78793 50727 53235
18991E3235J1918K061k2466J0288M926l805p189M6003L0071M2405P4333M9963
$$ 53235 65153 67214 44748 55036 59962 56157 48968 94971 125042 167447 241780 291743
18979B91743r084n5137n2291j5747l0721j4364L029l3103N112L7614J5282L739
$$ 291743 282659 227522 175231 159484 128763 114399 117428 84325 89437 127051 142333 146072
18967A46072j6090k4908k8027k9276l332L1651K8932L4794M2145L0048l0575m7085
$$ 146072 129982 105074 77047 47771 44439 76090 105022 139816 181961 212009 181434 134349
18955A34349j6513j3864K8491j0696L179k2597j895k8397q251J7868l1342L7971
$$ 134349 117836 103972 132463 121767 124946 102349 100454 72057 63806 81674 50332 88303
18943H8303O7786l462p0104l1735K801j6804p512O8739O7623L1235k1007R291
$$ 88303 156089 152627 82523 50788 53589 36785 29273 98012 165635 196870 175863 185154
18931A85154k8179j1485Q252O936K6935j6605j8242p0077j1134j3151l1532j1290
$$ 185154 156975 145490 153742 160678 187613 171008 152766 82689 71555 58404 26872 15582
18919A5582J0260K6087J3900J7352L0993r411n0910l0172q165M8415L4695K3794
$$ 15582 25842 51929 65829 83181 114174 104763 53853 23681 15516 63931 98626 122420
18907A22420K7058j1198J0914j4257J9466J067k3910l5547l200Q695j3190k9746
$$ 122420 149478 138280 149194 134937 154403 155470 131560 96013 92813 101508 88318 58572
18895E8572j5237K3479J5028N0228M428K6804M4186M1359k4199j1643K212L1266
$$ 58572 43335 66814 81842 132070 136498 163302 207488 248847 224648 213005 215217 246483
18883B46483K1534K7759j9439m1406j4824l0316K512l4763j3012k1836j4159J90
$$ 246483 268017 295776 276337 234931 220107 189791 192303 157540 144528 122692 108533 108723
18871A08723k2251J5044j7619q008J325o816K5532Q543K642J1416m579k6563l287
$$ 108723 86472 101516 83897 75889 77214 70398 95930 104473 107115 118531 113952 87389 84102
18858H4102j7670j5073K5897o284j1237j5477O204j0918k3378K3878Q049J6613
$$ 84102 66432 51359 77256 70972 59735 44258 50462 39544 16166 40044 48093 64706
18846F4706m495M6930M216o0530l1052N0243K2371J6219Q435K6155J8587j1363
$$ 64706 60211 107141 111357 50827 19775 70018 92389 108608 117043 143198 161785 150422
18834A50422K6295K3934R515M0633j8190j3624l0091k6026M5713O625q46M284
$$ 150422 176717 200651 210166 250799 232609 218985 188894 162868 208581 215206 214360 218644
18822B18644K1343k8569j8533j6383j6335l2949l0744l8840K0777K4673J231N512
$$ 218644 239987 211418 192885 176502 160167 127218 96474 57634 78411 103084 104315 109827
18810A09827j6634l6047l9407O106j9190j6208R863L7074K5382k9685L304M2690
$$ 109827 93193 57146 17739 23845 4655 -11553 -1690 35384 60766 31081 34385 77075
18798G7075j8390m9402K954P1252J0836l8461L4441L0184l8621j870K0879J1530
$$ 77075 58685 9283 12237 83489 94325 55864 90305 120489 81868 79998 100877 112407
18786A12407N6133J091j4346l808m3164j4652J902J9349M2627N8045P9147K1304
$$ 112407 168540 169631 155285 151477 108313 93661 95563 114912 157539 215584 294731 316035
18774C16035j7190k8784j289K4697K1610O5770J00886J48950R0746j01934j93006
$$ 316035 298845 270061 268772 293469 315079 380849 481735 630685 721431 619497 426491
18763D26491j35515r2348k3384m8148l3634j9875r015l185Q515o963o972K4162
$$ 426491 290976 198628 175244 127096 93462 73587 64572 61387 69902 62939 55967 80129
18751H0129j3229j4619j5050K0153l572n486j4060N0205K0651n4173n4739J2525
$$ 80129 66900 52281 37231 57384 53812 48326 34266 84471 105122 50949 -3790 8735
18739H735J2782k675m1040L0782K9262j2607j7975L2233j6499p219K0658L5076
$$ 8735 21517 18842 -22198 8584 37846 25239 7264 39497 22998 15779 36437 71513
18727G1513m406N213L2891k0098k2700J7611K8063K668l4275m625J1915k0701
$$ 71513 67107 72320 105211 85113 62413 80024 108087 110755 76480 71855 83770 63069
18715F3069l1567K0642j4169l64j632p107j741K1360k1994k7850J4302M7832n495
$$ 63069 31502 52144 37975 37611 35979 28872 27131 48491 26497 -1353 12949 60781 55286
18702E5286m0360Q457j8457j9738j1350N7198L5143j5891k2650k437L4340J7990
$$ 55286 14926 23383 4926 -14812 -26162 31036 66179 50288 27638 25201 59541 77531
18690G7531J0473k2187j8949J7950J7944J8941k187K8538J7044l490j0093J1385
$$ 77531 88004 65817 46868 64818 82762 101703 99516 128054 145098 141608 131515 142900
18678A42900k0393l9733j087K5540n508l7703J8903K3397j5835J1901l5295q603
$$ 142900 122507 82774 81687 107227 101719 64016 82919 106316 90481 102382 67087 58484
18666E8484j0024M306k3245K0627J2147m5846Q671K8343L4091M290J2203j0401
$$ 58484 48460 52766 29521 50148 62295 16449 25120 53463 87554 91844 104047 93646
18654I3646R057K8613M5817L3781R4545Q1485P3922l001j00303o0410n00L6760
$$ 93646 102703 131316 177133 210914 305459 386944 460866 457865 357562 297152 296652 333412
18642C33412L9263Q0435J10955J8148j05396j02637J676K519m4931n9772o6270
$$ 333412 372675 453110 564065 582213 476817 374180 375856 378375 333444 273672 207402
18631B07402l3903p516L191L3113L5328j1700k7581j6201J1291K6412k508m8961
$$ 207402 173499 165983 169174 202287 237615 225915 198334 182133 193424 219836 217328 168367
18619A68367n263O3887J3045k1564L5012l7463R170P842O595M1273J1082J112
$$ 168367 163104 226991 240036 218472 253484 216021 225191 233033 239628 280901 291983 293095
18607B93095J07552J15189J58224K70472K16804K3924q4749j13321m6073L4050
$$ 293095 400647 515836 674060 944532 1161336 1185260 1100511 987190 941117 975167
18597I75167N496K8777R5942J27611n8462j87894j59606n0029N6297J5598K9369
$$ 975167 980663 1009440 1105382 1232993 1174531 986637 827031 777002 833299 848897 878266
18586H78266k9753o9666q0821n6319l5106k3494n2018l0165j5405N1449P5639
$$ 878266 848513 778847 698026 641707 606601 583107 531089 500924 485519 536968 612607
18575F12607q273J4499L6671j1913j6995Q462N881L8275O3543J43808J31348J52031
$$ 612607 604334 618833 655504 643591 626596 635058 640939 679214 742757 886565 1017913 1169944
18563A169944K20518L07653M94823P49394J233756K109560L523812N184731M095062
$$ 1169944 1390462 1698115 2192938 2942332 4176088 6285648 9809460 14994191 19089253
18554A9089253r29525l673391l330367j892146k45107J407802L424466N235360
$$ 19089253 18159728 14486337 11155970 9263824 9018717 10426519 13850985 19086345
18546A9086345K983878k907506n095741m146512k723054j698717j043005p50490
$$ 19086345 22070223 19162717 14066976 9920464 7197410 5498693 4455688 3705198
18538C705198o05584m36306l56777k62722j61248n8896M123M3928J33288K15725
$$ 3705198 3099614 2663308 2306531 2043809 1882561 1823665 1827788 1871716 2005004 2220729
18528B220729K49657J12224r8197k13170j75239m1988R3936J83050L53324N38674
$$ 2220729 2470386 2582610 2484413 2271243 2096004 2054016 2147952 2331002 2684326 3223000
18518C223000N95454N40871N25341Q23981J551634K714618M661371P950145J0743607
$$ 3223000 3818454 4359325 4884666 5708647 7260281 9974899 14636270 22586415 33330022
18509C3330022O868152k969293o297060l556359l14543k80290J94695L514048
$$ 33330022 40198174 37228881 30931821 27375462 27060919 26780629 26975324 30489372
18501C0489372O365380K236583n670013p189368m116489k12796Q15805k660010
$$ 30489372 36854752 39091335 33421322 26231954 22115465 21902669 22718474 20058464
18493B0058464m881625m355275l021687j905970j147584p21724n08049l26319
$$ 20058464 15176839 10821564 7799877 5893907 4746323 4024599 3516550 3190231
18485C190231j41096r2838m2301J1923m2780l9923k7790k2762k9218p2876j03815
$$ 3190231 3049135 2956297 2913996 2925919 2883139 2843216 2815426 2792664 2763446 2690570 2586755
18474B586755j9326R5382J33145J65454K39823L06618J40162J13917L37273P90931
$$ 2586755 2567429 2662811 2795956 2961410 3201233 3507851 3648013 3761930 4099203 4890134
18464D890134J379850K293706L882131O655043J0007030Q386208j769911q303000
$$ 4890134 6269984 8563690 12445821 19100864 29107894 37494102 35724191 27421191
18456B7421191p721715m804193k108039J41048K286731N128947P935599N182477
$$ 27421191 19699476 14895283 12787244 12928292 15215023 20343970 28279569 33462046
18448C3462046l777882p971288o883300m555745k725878j628085j095268q05396
$$ 33462046 29684164 21712876 14829576 10273831 7547953 5919868 4824600 4019204
18440D019204n09623l34021j83718j19926m7224O1693K11214L28103L61495K98790
$$ 4019204 3509581 3175560 2991842 2871916 2824692 2886385 3097599 3425702 3787197 4085987
18430D085987L53935O01910J182952K053021L516018O030685R223505R077741
$$ 4085987 4439922 5041832 6224784 8277805 11793823 17824508 27048013 36125754
18422C6125754J012077o786055p698768n172749k232147N69976L719621P638319
$$ 36125754 37137831 30351776 22653008 17480259 15248112 15818088 19537709 27176028
18414B7176028R692363L676824o416592r804580p984328n182398l141100j901612
$$ 27176028 36868391 40545215 34128623 24324043 16339715 11157317 8016217 6114605
18406F114605j181782p77610n98095l77995l34064k40627j87574j30251m6369
$$ 6114605 4932823 4155213 3557118 3179123 2845059 2604432 2416858 2286607 2240238
18397B240238k5195m9955j64488j42918k6078N3152J02922J84381J47087M2856
$$ 2240238 2215043 2165088 2000600 1857682 1831604 1884756 1987678 2172059 2319146 2362002
18387B362002L1076J03590K30690M02520O07324R39799J438504K298576L852295
$$ 2362002 2393078 2496668 2727358 3129878 3737202 4677001 6115505 8414081 12266376
18378A2266376N708657N591371K186769O12802L194011N510702J695320m152281
$$ 12266376 17975033 23566404 25753173 26365975 29559986 35070688 36766008 32613727
18370C2613727m796478j407909J818610K114957K053226L857782J735730n454611
$$ 32613727 27817249 26409340 28227950 30342907 32396133 36253915 37989645 32535034
18362C2535034q896285p502848n014939l146490j929838j226675q59405o20343
$$ 32535034 23638749 16135901 11120962 7974472 6044634 4817959 3958554 3338211
18354C338211m61096l27660k35611k29025j61326j03047j06687j17182q1175l7249
$$ 3338211 2877115 2549455 2313844 2084819 1923493 1820446 1713759 1596577 1515402 1478153
18344A478153m7097n1224j0463J7128O2666L4870k5110Q188Q6644J36748K63038
$$ 1478153 1431056 1379832 1369369 1386497 1449163 1484033 1458923 1467111 1553755 1690503 1953541
18333A953541L93795O42410R93304J521738K730197M288987M400943P62047l101852
$$ 1953541 2347336 2989746 3983050 5504788 8234985 12523972 16924915 17686962 14585110
18324A4585110l669403k374322p90767Q08474K533460L633753J528471k534126
$$ 14585110 10915707 8541385 7750618 8559092 11092552 14726305 16254776 13720650
18316A3720650l952145l245295k111231j312864q15497m89671k82033j84743j69050
$$ 13720650 9768505 6523210 4411979 3099115 2283618 1793947 1511914 1327171 1158121
18307A158121j45554p5867n0626j05958j16097p5655l4798r737n4446n2179l2836
$$ 1158121 1012567 936700 886074 780116 664019 588364 553566 543829 489383 437204 404368
18296D04368J5787l378j7099L1488J769o4138m9528n1883p6719l1594P2258N5019
$$ 404368 420155 416777 399678 431166 432935 368797 319269 267386 190667 159073 231331 286350
18284B86350k02o2144m0616K1864K0600j7725o161K6150k2273K8094K8959j8311
$$ 286350 286148 224004 183388 205252 225852 208127 201966 228116 205843 233937 262896 244585
18272B44585o0773m6634P855J7453k7681l9229k1941J0437J1051l6130K873P7531
$$ 244585 183812 137178 145033 162486 134805 95576 73635 84072 95123 58993 61866 139397
18260A39397M7546j9632k9110l0168l3610k3910L7745k655n0240m685K1696l3766
$$ 139397 186943 167311 138201 108033 74423 50513 88258 85603 35363 30678 52374 18608
18248A8608j2596P297J6017K7466L0714K5058j8717j1855j8156k0996J672N9133
$$ 18608 6012 13309 29326 56792 87506 112564 93847 81992 63836 42840 44512 103645
18236A03645Q3044J29453O7992n1092n6732j11725p9643P94J3844m314l3564k2135
$$ 103645 186689 316142 384134 333042 276310 164585 84942 85736 99580 95266 61702 39567
18224C9567J8083M022J6609N6385K3961k319j4992q042j7730p466l335J2028o035
$$ 39567 57650 61672 78281 134666 158627 156308 141316 133274 115544 108078 104743 116771 110736
18211A10736j6686L5807J4255k5378p646r501K402M274j1277k0892j5046K369
$$ 110736 94050 129857 144112 118734 111088 101587 103989 108263 96986 76094 61048 63417
18199F3417L927L888j7164j2815J7305j4694k1275o793J0703j9408k4829K0987
$$ 63417 67344 71232 54068 41253 58558 43864 22589 15796 26499 7091 -17738 3249
18187C249M3594L0683J2687m404j0417Q0292N8362q773N461l2781k3274N067j8459
$$ 3249 46843 77526 90213 85809 75392 155684 214046 205273 210734 177953 154679 159746 141287
18174A41287o624j1151J046J2310L4349K5746k651j9606n283K6567j0274l4057
$$ 141287 134663 123512 124558 136868 171217 196963 194312 174706 169423 195990 185716 151659
18162A51659k8567R05M0291K6891k5219n7814M011M9297m478J9614M2049J9011
$$ 151659 123092 123997 164288 191179 165960 108146 112157 161454 156976 176590 218639 237650
18150B37650n382K3911J0967j7681K4185N7273L509O980k8534k5932k886j7059
$$ 237650 232268 256179 267146 249465 273650 330923 334432 341412 312878 286946 284060 267001
18138B67001M2573L3221K6555N3351M6008L2729Q697M3140K1785P9523R6945J00160
$$ 267001 309574 342795 369350 422701 468709 501438 510135 553275 575060 654583 751528 851688
18126H51688P6512R5864J37155J80060K31679K56142L46678M26530N36672O47437
$$ 851688 928200 1024064 1161219 1341279 1572958 1829100 2175778 2602308 3138980 3786417
18116C786417R69501J456037K329061L880120O677220J2115008K2338263L4149364
$$ 3786417 4755918 6211955 8541016 12421136 19098356 31213364 53551627 87700991
18108H7700991K0906495j8290414l0238102k3071714j3805984p716861m427785
$$ 87700991 108607486 90317072 60078970 37007256 23201272 15484411 11056626
18101A1056626k828205j956840j385743j020360o83552m78885l66364l01658k51672
$$ 11056626 8228421 6271581 4885838 3865478 3181926 2703041 2336677 2035019 1783347
18092A783347k25174j53682j43223r4341j48464j40419j19177r6457j8882j9783
$$ 1783347 1558173 1404491 1261268 1166927 1018463 878044 758867 662410 643528 623745
18082F23745o238k2588q2855p3051k8532l0590j929K7788k1299n6935n121J0904
$$ 623745 617507 594919 512064 439013 410481 379891 377962 405750 384451 327516 322395 333299
18070C33299j8864k8999j8837M4668L2513m0242m1041J0132J2976K8659K1981
$$ 333299 314435 285436 266599 311267 343780 303538 262497 272629 285605 314264 336245
18059C36245n9885m6782j3826q240j3381k7271R05K2598L9433n6426p3634K4031
$$ 336245 276360 229578 215752 207512 194131 166860 167765 190363 229796 173370 99736 123767
18047A23767k6278j9757K6893M8252j6472l6209J6602L0176q155N8958J0296n2667
$$ 123767 97489 77732 104625 152877 136405 100196 116798 146974 138819 197777 208073 155406
18035A55406n007J3134P722k0808K3357J3736N64j6484o505o1810k862j556n1665
$$ 155406 150399 163533 171255 150447 173804 187540 188104 171620 165115 103305 100443 98887 47222
18022D7222k0068l0556J6446O3867L9325M2420j0609m2983j1111K388K5488J2672
$$ 47222 27154 -3402 13044 76911 116236 158656 148047 105064 93953 96341 121829 134501
18010A34501n4776k3354p876J2380k554m9231J0339N3920J5335M2211j9907k297
$$ 134501 79725 56371 48495 60875 58321 9090 19429 73349 88684 130895 110988 108691
17998A08691j8435j500O9116J4807K5648M9427N2908Q771l5293n178L5018J432
$$ 108691 90256 88756 157872 172679 198327 247754 300662 309433 274140 268962 303980 305412
17986C05412O052J6929j6316n8484q7021o2694m044N9590L3015J1247k7281l8478
$$ 305412 311464 328393 312077 253593 166572 103878 99834 159424 192439 203686 176405 137927
17974A37927o8444l7545K70K9285j7243j0240j3954j8151J7420N4764K9263j5255
$$ 137927 69483 31938 32208 61493 44250 34010 20056 1905 19325 74089 103352 88097
17962H8097m1342k7204k0007J3110L2157L1484M8612M652m841J6760K1415J861
$$ 88097 46755 19551 -456 12654 44811 76295 124907 129559 124718 141478 162893 164754
17950A64754j3833m4518m591k2518l7091n092M4461K9226K3368L1601J7482j5090
$$ 164754 150921 106403 101812 79294 42203 37111 81572 110798 134166 165767 183249 168159
17938A68159k2961K13l8007m7938j8953M1885M5460L7692k5712m5647q332J5890
$$ 168159 145198 145411 107404 59466 40513 82398 127858 165550 139838 94191 85859 101749
17926A01749m2324j3188J500N053N327r599M0925o919L6123J0845l354N2046O734
$$ 101749 59425 46237 47737 52790 58117 48518 89443 82524 118647 129492 126138 178184 184918
17913A84918M710j4253k0003j4031J5356J2017j8306j5083n0211K724L065N0401
$$ 184918 189628 175375 155372 141341 156697 168714 150408 135325 85114 87838 90903 141304
17901A41304m9956m2665k6000K1806n102j8367K3267k0115l8817k8510J8520J1502
$$ 141304 91348 48683 22683 44489 39387 21020 44287 24172 -14645 -43155 -24635 -13133
17889a3133J9585K2173J2368L932j1735l5682J6354M1583k1774k8416J0008M846
$$ -13133 6452 28625 40993 44925 33190 -2492 13862 55445 33671 5255 15263 20109
17877B0109Q635j6334l4762L9219P51j4370L2328j4548J7960L1042N5407M2483
$$ 20109 28744 12410 -22352 16867 17618 3248 35576 21028 38988 70030 125437 167920
17865A67920k1900j6201P848P2521M6071j2460N730J624l8212l0100p839k3962
$$ 167920 146020 129819 137667 210188 256259 243799 249529 251153 212941 182841 175002 151040
17853A51040l3136p589l3358L6697K3580k5389j4771k5977m0918l7035J2199K5232
$$ 151040 117904 110315 76957 113654 137234 111845 97074 71097 30179 -6856 5343 30575
17841C0575J3715L7392k1118n1749l2513J4548O3054L8043k4983k9105j0150j0441
$$ 30575 44290 81682 60564 8815 -23698 -9150 53904 91947 66964 37859 27709 17268
17829A7268l4466R126N1086j9011l7236l6669L2202M7023j2075J9821J3901j3766
$$ 17268 -17198 -8072 43014 24003 -13233 -49902 -17700 29323 17248 37069 50970 37204
17817C7204L7955P3854J5744n254O289R35l5814J8651j246q904m5512n7521j8804
$$ 37204 75159 149013 164757 159503 165792 166727 130913 149564 148318 139414 93902 36381 17577
17804A7577k0554j6685k7384Q869n369K3729J5482N1456K0574k1230p4020j1246
$$ 17577 -2977 -19662 -47046 -38177 -43546 -19817 -4335 47121 67695 46465 -27555 -38801
17792c8801L8683K8420J5325Q887l6917J3881k8521p3796J3979L1118J2797l5768
$$ -38801 -118 28302 43627 52514 15597 29478 957 -72839 -58860 -27742 -14945 -50713
17780e0713k527j454R857J9355J23j5521P619Q0543L1621j5625j439m7203n8761
$$ -50713 -53240 -54694 -44837 -25482 -25359 -40880 -33261 47282 78903 63278 61839 14636 -44125
17767d4125l5597N3698M5289k7786j8374L5876q645j5753N1870L5718k5957m0812
$$ -44125 -79722 -26024 19265 -8521 -26895 8981 336 -15417 36453 72171 46214 5402
17755E402j0388l4020j3731j076j0277k1499J5416L968M657N214n023J1994J0020
$$ 5402 -4986 -39006 -52737 -53813 -64090 -85589 -70173 -66205 -61548 -56334 -61357 -49363 -39343
17742c9343k2785K4620M7761l33j1771j2867m0984k9002J5289L1156N2065R641
$$ -39343 -62128 -37508 10253 9920 -1851 -14718 -55702 -84704 -69415 -38259 13806 23447
17730B3447j4464j993L110k8852o765l1941J0024M0703M0445r439K6922J7545
$$ 23447 8983 6990 10100 -18752 -25517 -57458 -47434 -6731 33714 24275 51197 68742
17718F8742J9139m3587j7464j6660k5154J5025L3817J2614n621m1931R9L7070
$$ 68742 87881 44294 26830 10170 -14984 41 33858 46472 40851 -1080 -981 36089
17706C6089k5508l323K8935P394K495k5187k5299K8120Q007l2123o9483j4537
$$ 36089 10581 7258 36193 43587 46082 20895 -4404 23716 31723 -400 -69883 -84420
17694h4420M7612J9132K7560L5175J1989R609n2898q1601J5110p502l581L7124
$$ -84420 -36808 -17676 9884 45059 57048 66657 13759 -67842 -52732 -60234 -63815 -26691
17682b6691J1397M6391J8933k3881n7802L0526Q031n1099l3369K9897L7755R473
$$ -26691 -15294 31097 50030 26149 -31653 -1127 6904 -44195 -77564 -47667 -9912 -439
17670d39j5400n7669o764K9440K6113J0281J4403L2651K5770l2317m6194Q601
$$ -439 -15839 -73508 -80272 -50832 -24719 -14438 -35 32616 58386 26069 -20125 -11524
17658a1524m364m5363j1246j5036J9796Q856L6765j1817l7151J4484N2683M5006
$$ -11524 -15888 -61251 -72497 -87533 -67737 -58881 -22116 -33933 -71084 -56600 -3917 41089
17646D1089j908n5988m5014j9761J1910K4906L5675N191Q865J1343N3250l4102
$$ 41089 39181 -16807 -61821 -81582 -69672 -44766 -9091 -3900 4965 16308 69558 35456
17634C5456l4341j9172R848Q651J0481N46n0330q835J3475k0903K5400k2935O160
$$ 35456 1115 -18057 -8209 442 10923 11469 -38861 -47696 -34221 -55124 -29724 -52659 -46499
17621d6499L7949M63k6848n7815N461L3222J4421M220K4824N3951r876l3804r639
$$ -46499 -8550 -8087 -34935 -92750 -87289 -54067 -39646 -35426 -10602 43349 33473 -331 -9970
17608i970r657N1058j1899l6312l850j1156O267J3874M8284j5435j3864J97p25
$$ -9970 -19627 31431 19532 -16780 -20630 -31786 -25519 -11645 36639 21204 7340 7537 6812
17595F812J4599q912L8733r610k1918l9345m9339r826J2451K639K7736L640k1355
$$ 6812 21411 12499 51232 41622 19704 -19641 -68980 -78806 -66355 -63716 -35980 -32340 -53695
17582e3695q140R955O611k4008l3498j7920M134M4471N6899L1636k8362k6053
$$ -53695 -61835 -51880 -45269 -69277 -102775 -120695 -116561 -72090 -15191 16445 -11917 -37970
17570c7970k1683l242Q357L3006K4072m449l6325L654O0537J619j6309n449K737
$$ -37970 -59653 -62895 -54538 -21532 2540 -1909 -38234 -34580 25957 27576 11267 5818 8555
17557H555o0512k4031K1844L7120L7002O309k6769l1272K8178J6480m068l116
$$ 8555 -51957 -75988 -54144 -17024 19978 26287 -482 -31754 -3576 12904 8836 5720
17545E720N6823J2931M564O363j0183M8639j9768l1741k2988M71M332m2129o605
$$ 5720 62543 75474 80038 86401 76218 124857 105089 73348 50360 50831 55163 13034 6429
17532F429l916l4997k4522j4580K3586K5069L2805Q480k1788p08j5550j982O003
$$ 6429 2513 -32484 -57006 -71586 -48000 -22931 9874 18354 -3434 -4142 -19692 -21674 -15671
17519a5671P550J4659n02O961l165l5910l6382p042M9605J6169l2058k2703O735
$$ -15671 -8121 6538 6036 12997 9832 -26078 -62460 -69502 -19897 -3728 -35786 -58489 -51754
17506e1754l1828M934L3193J7029L1180j37n667J7624L0195j5771k0764l1564
$$ -51754 -83582 -78648 -45455 -28426 2754 2617 -3050 14574 44769 28998 8234 -23330
17494b3330j950k5788j1765L196J6539M4360J8493L5758j6409n1081k4258R286
$$ -23330 -25280 -51068 -62833 -59637 -43098 1262 19755 55513 39104 -11977 -36235 -26949
17482b6949K2598R684Q121J8023j5197J864q498m3071r831L7572J8530P696l1310
$$ -26949 -4351 5333 13454 31477 16280 18144 9646 -33425 -43256 -5684 12846 20542 -10768
17469a0768r442k5307K0426L1662J6013k1559q291n71q039k313J3927q498k4674
$$ -10768 -20210 -45517 -25091 6571 22584 1025 -7266 -7837 -15876 -18189 -4262 -12760 -37434
17456c7434M0072K4053k585k6320l7830J4905N0851M1960m9740L191N8376R7355
$$ -37434 2638 26691 24106 -2214 -40044 -25139 25712 67672 17932 21123 79499 176854
17444A76854J00298J65981J32995m1891j72906j51860q8395l7871p1225q5404
$$ 176854 277152 443133 576128 534237 361331 209471 121076 83205 11980 -73424
17434g3424l7231M6934O7548N7190P602l2058K57l529m5897j8966O427o160k0437
$$ -73424 -110655 -63721 3827 61017 68619 36561 36818 33289 -12608 -31574 -25147 -31307 -51744
17421e1744j3187K9929L8357j5750l0860K4601J0984J683K2658M580j1747K492
$$ -51744 -64931 -35002 3355 -12395 -43255 -18654 -7670 -5987 16671 21251 9504 11996
17409A1996P157O935K177k235M99l8221k2959k0834j0180K6295k3851J0790K2322
$$ 11996 19153 26088 28265 26030 26529 -11692 -34651 -55485 -65665 -39370 -63221 -52431 -30109
17396c0109p288k0861p604L8447L5106l805o319O659J9937O1222k8090l8916k3382
$$ -30109 -37397 -58258 -65862 -27415 7691 3886 -2433 4226 24163 85385 57295 18379 -5003
17383e003l6924P223M6128M1836j1257j2240r266o987j5412R803L4236j1190k350
$$ -5003 -41927 -34704 11424 53260 42003 29763 20497 13510 -1902 7901 42137 30947 28597
17370B8597L1170l4694M882m693j6292j1128k485l623J7288j3884k1058J6064
$$ 28597 59767 25073 29955 25262 8970 -2158 -4643 -8266 9022 -4862 -25920 -9856
17358i856n329J3513M9397n00L501l4228k1859m3722J740J3958K3400O5459J3392
$$ -9856 -15185 -1672 47725 47225 50726 16498 -5361 -49083 -47343 -33385 -9985 55474 68866
17345F8866l3337Q232R822L2159K957k5622m712m0423j5972J5488J9829M9642
$$ 68866 35529 43761 53583 85742 88699 63077 58365 17942 1970 17458 37287 86929
17333H6929l6690l4772k1180n132R87L6795k1263n7409N631K7045Q780K8094J6763
$$ 86929 50239 15467 -5713 -10845 -9858 26937 5674 -51735 -46104 -19059 -10279 17815 34578
17320C4578J6666J5300k3448j6021j4295j5605l0021r249J8201n617o1563N055
$$ 34578 51244 66544 43096 27075 12780 -2825 -32846 -42095 -23894 -29511 -91074 -86019
17308h6019O2734M4230R369o633k784K0915M0784j7014n0281l1268K9583l1733
$$ -86019 -23285 20945 30314 23681 20897 41812 82596 65582 15301 -15967 13616 -18117
17296a8117j8091j0465L1997j4215Q765L576J0710M5221L3140j0140o1817p5567
$$ -18117 -36208 -46673 -14676 -28891 -20126 -16550 -5840 39381 72521 62381 564 -75003
17284g5003k9404m704J6672P874N852r504L3506K2843k0849j7586K2440J9443
$$ -75003 -104407 -109111 -92439 -84565 -78713 -88217 -54711 -31868 -52717 -70303 -47863 -28420
17272b8420l3695J324L3215M0103k6065l2162J1340m1633K0486N4012R603j8345
$$ -28420 -62115 -60791 -27576 12527 -13538 -45700 -34360 -75993 -55507 -1495 8108 -10237
17260a0237j9454q247M848P707N5807O800k9435n3954q255L0749p903j888P591
$$ -10237 -29691 -37938 -33090 -25383 30424 37224 7789 -46165 -54420 -23671 -31574 -33462 -25871
17247b5871N747L4058K9655j2793J1665m400m1577K242L3449k2338k5178j6452
$$ -25871 -20124 13934 43589 30796 42461 38061 -3516 -1274 32175 9837 -15341 -31793
17235c1793j507J2542J0214J7627K3749K1119M68l9617k3510j2833M8000o19l287
$$ -31793 -33300 -20758 -10544 7083 30832 51951 52419 12802 -10708 -23541 24459 23840 20553
17222B0553o300J5900J7513l0579k2411r002n323k2693j6881K0263K7051J5284
$$ 20553 14253 30153 47666 17087 -5324 -14326 -19649 -42342 -59223 -38960 -11909 3375
17210C375P34M7496K3351L591O262m066k7247o852Q582k7558j1444J7314j6281
$$ 3375 4109 51605 74956 78547 84809 80743 53496 46644 55226 27668 16224 33538 17257
17197A7257j3066L8706n602m0774q447n6622K4818K8090l4588J0516J3805L695
$$ 17257 4191 42897 37295 -3479 -11926 -68548 -43730 -15640 -50228 -39712 -25907 -22212
17185b2212R818j0374m550K7751M8610L8644k2967l1381l349J0680o360m9626
$$ -22212 -12394 -22768 -27318 433 49043 87687 64720 33339 29990 40670 34310 -15316
17173a5316q219J0023j516k039J6787k4502k8701k796J1521O6020L6351J144M439
$$ -15316 -23535 -13512 -15028 -17067 -280 -24782 -53483 -56279 -44758 21262 57613 58757 63196
17160F3196k132l6838k1368K7355J8167K622l365m4355j2184l2111k8951n064
$$ 63196 61064 24226 2858 30213 48380 51002 47637 3282 -8902 -41013 -69964 -75028
17148g5028J3448K7737M527l220j7152j3049K8466N3758l7878j9655K2442J7307
$$ -75028 -61580 -33843 -29316 -32536 -49688 -62737 -34271 19487 -18391 -38046 -15604 1703
17136A703P320N887J7372K4429J1087m0918l2831J2197L2n5397k4938M8911L8722
$$ 1703 9023 14910 32282 56711 67798 26880 -5951 6246 6278 -49119 -74057 -25146 13576
17123A3576N2035m7930m404L4795R889l8813p589P520J6062J1489o602l6776k8482
$$ 13576 65611 17681 13277 48072 57961 19148 11559 19079 35141 46630 40028 3252 -25230
17110b5230O832J2969j3365j0610p739j4696J9195O884J8659j5704L0037p329
$$ -25230 -18398 -5429 -18794 -29404 -37143 -51839 -32644 -25760 -7101 -22805 7232 -97
17098i7k6046K2239p488m4720J0831K2966K6119n322J3159Q086k660j5643P347
$$ -97 -26143 -3904 -11392 -56112 -45281 -22315 3804 -1518 11641 19727 17067 1424 8771
17085H771l8390j3919J8493j1151q588n6886L551M8530J7912L5606j6635M517
$$ 8771 -29619 -43538 -25045 -36196 -44784 -101670 -98119 -49589 -31677 3929 -12706 -8189
17073h189J2989k8360q848M240l474P793O971K771K8702M1957M8010k2401k3413
$$ -8189 4800 -23560 -32408 -28168 -31642 -23849 -16878 -14107 14595 56552 104562 82161 58748
17060E8748o1238j3991M2402L0387j5218l3182p414r903l0417M723N4665L5734
$$ 58748 -2490 -16481 25921 56308 41090 7908 494 -9409 -39826 -35103 19562 55296
17048E5296L05j1765l4930m2220m1840j1883J9082K7896J5165p76l5749j7205
$$ 55296 55601 43836 8906 -33314 -75154 -87037 -67955 -40059 -24894 -25670 -61419 -78624
17036g8624J5176L251k8805M3530L1998M1442L671l816P035j9721j6355l7880
$$ -78624 -63448 -60197 -89002 -45472 -13474 27968 31639 27823 34858 15137 -1218 -39098
17024c9098J1834M5766J2776l2320k6087r482j8198P138Q693J4786l0146r495
$$ -39098 -27264 18502 31278 -1042 -27129 -36611 -54809 -47671 -38978 -24192 -54338 -63833
17012f3833J2353K0138O709N176J7513j7821k3435L13K6533M12l770m4363l062
$$ -63833 -51480 -31342 -24633 -19457 -1944 -19765 -43200 -42887 -16354 -15942 -19712 -64075 -67137
16999f7137K9967J4445k0997j6178q190M1464J4982K5642L2419j9447L0310j6127
$$ -67137 -37170 -22725 -43722 -59900 -68090 -26626 -11644 13998 46417 26970 57280 41153
16987D1153p478p916j3767n033J0446L0331n634n0955j6485M819o392K0558K8401
$$ 41153 33675 25759 11992 6959 17405 47736 42102 -8853 -25338 -20519 -26911 -6353 22048
16974B2048n435J5330k5757L13K1252k4026L4406J3996o169l2396J358j4118m6853
$$ 22048 16613 31943 6186 6499 27751 3725 38131 52127 45958 13562 14920 802 -46051
16961d6051P251R723L0950O876j528J2852l6293q253j431K9676J744L685L0583
$$ -46051 -38800 -29077 1873 8749 7221 20073 -16220 -24473 -25904 3772 5516 9201 39784
16948C9784l908J0152k64l9957n7738j8473K6920Q218J95r850k6249J8757K0615
$$ 39784 35876 46028 45764 5807 -51931 -70404 -43484 -35266 -35071 -44921 -71170 -52413 -31798
16935c1798k1224J7630L9777p1133n8697Q9716N7325n581m6325l3217J9736L6601
$$ -31798 -53022 -35392 4385 -66748 -125445 -35729 21596 16015 -30310 -63527 -43791 -7190
16923g190M4795L6587p654l2659j5290K6090R776p334o762J2983k7506k0879j5253
$$ -7190 37605 74192 66538 33879 18589 44679 54455 47121 40359 53342 25836 4957 -10296
16910a0296o56P896K5336o568M729k4265r931J2807j411l7718K3421N883O380
$$ -10296 -10952 -3056 22280 15712 20441 -3824 -13755 -948 -2359 -40077 -16656 -10773 -4393
16897d393J4066k7505p569K849N2907m458o4300J409j9739J8466J5345J6373l674
$$ -4393 9673 -17832 -25401 -22552 30355 25897 -38403 -36994 -56733 -38267 -22922 -6549 -10223
16884a0223o86N620J0341J9138K1986j7396k6456K179K2236J3750J356l115l5840
$$ -10223 -10909 -5289 5052 24190 46176 28780 2324 4503 26739 40489 41845 38730 2890
16871B890l3281M7974J2531j1042j4304k1353k4570J7899k1807n836J6660M0311
$$ 2890 -30391 17583 30114 19072 4768 -16585 -41155 -23256 -45063 -50899 -34239 6072
16859F072J4602K9009m4201l0658K1108K1279J718n0340m537K3248k4760l7283
$$ 6072 20674 49683 5482 -25176 -4068 17211 18929 -31411 -35948 -12700 -37460 -74743
16847g4743k2939M3167J5456J2993M9490m612O69k0335j1120j5667n386j1853
$$ -74743 -97682 -54515 -39059 -26066 23424 18812 19481 -854 -11974 -27641 -33027 -44880
16835d4880o828j2495J2950O2580l75J3267l778l9897m249m110N888j1705j9741
$$ -44880 -51708 -64203 -51253 11327 10952 24219 20441 -19456 -23705 -27815 -21927 -33632 -53373
16822e3373l3218K8582N4114L1439L4276k4037o1145k6490J1984M9156l1749k999
$$ -53373 -86591 -58009 -3895 27544 61820 37783 -23362 -49852 -37868 11288 -20461 -23460
16810b3460J4730j8542l5640p418K4495J4908O5432M760j1853L7381L1736l5367
$$ -23460 -8730 -27272 -62912 -70330 -45835 -30927 34505 39265 27412 64793 96529 61162
16798F1162m8648k4856k7663j0107J7832j4776M731J2382M589K4854j085J8389
$$ 61162 12514 -12342 -40005 -50112 -32280 -47056 -42325 -29943 -25354 -500 -1585 16804
16786A6804l5510l9127j3094L5438N197k0352k67R920j6318J5526Q8892K3434
$$ 16804 -18706 -57833 -70927 -35489 -30292 -50644 -50911 -40991 -57309 -41783 47109 70543
16774G0543j867k1044j6308n0716l6820K1163M6480k0830m1130j1409M0729N6403
$$ 70543 68676 47632 31324 -19392 -56212 -35049 11431 -9399 -50529 -61938 -21209 35194
16762C5194j2240j3695n2731j4316l3253l1792j4625M2491O3989L0631K1122n538
$$ 35194 22954 9259 -43472 -57788 -91041 -122833 -137458 -94967 -30978 -347 20775 15237
16750A5237K3391J1727o2944j0038J861M7049j7863n7244K5860N2811Q046m7862
$$ 15237 38628 50355 -12589 -22627 -20766 26283 8420 -48824 -22964 29847 37893 -9969
16738i969k5697M4369L4527q865j7663M509j9222J5830j7942l8099p290L0644
$$ -9969 -35666 8703 43230 34365 16702 21211 1989 17819 -123 -38222 -45512 -14868
16726a4868M888J0717k2423n347o93j6698J4303O010K3902L2018K6899k3875l8462
$$ -14868 -9980 737 -21686 -27033 -27726 -44424 -30121 -24111 -209 31809 58708 34833 -3629
16713c629K2923L7989k7666n0793j1839K6709J9176k1735m4659N108M8899J2337
$$ -3629 19294 57283 29617 -21176 -33015 -6306 12870 -8865 -53524 -48416 483 12820
16701A2820m2475N3965O5582J5661j0233l0169l0235J8427K3231K358m6592K811
$$ 12820 -29655 24310 89892 105553 95320 65151 34916 53343 76574 78932 32340 35151
16689C5151k6728j1186K8976j2249J5855N116O656J9962O64j3090o980l1774j7649
$$ 35151 8423 -2763 26213 13964 29819 34935 41591 61553 62217 49127 42147 10373 -7276
16676g276J790Q148K1552l0881L3644J6519m8574o6021j2316K6867L7414K1031
$$ -7276 -5486 2662 24214 -6667 26977 43496 -5078 -71099 -83415 -56548 -19134 1897
16664A897J3068J2677K802m1293k8566K9906n696j9073l9918n54j2339L1069L6245
$$ 1897 14965 27642 30444 -10849 -39415 -9509 -15205 -34278 -74196 -74750 -87089 -56020 -19775
16651a9775J2618L098j2900k9152j5994N3090M4409L5915j5916l7603k399j9642
$$ -19775 -7157 -4059 -16959 -46111 -62105 -9015 35394 71309 55393 17790 15391 -4251
16639d251k6253l879L431j8878m1911R876O3521L8168l5668J445j1740J9757J1864
$$ -4251 -30504 -34383 -30952 -49830 -91741 -81865 -18344 19824 -15844 -14399 -26139 -6382 5482
16626E482j8737j2424j3786l243l9996P582j0640P635R153M5014M8363j2346j9247
$$ 5482 -13255 -25679 -39465 -42708 -82704 -75122 -85762 -78127 -68974 -23960 24403 12057 -7190
16613g190K6179M0524p329n5329k461K8358J9110j0168k880k5223r681J4252L9351
$$ -7190 18989 59513 52184 -3145 -5606 22752 41862 31694 28814 3591 -6090 8162 47513
16600D7513J3827J6256L389r649m1358j6355j9484j6435K5511K4512l3289k2496
$$ 47513 61340 77596 80985 71336 29978 13623 -5861 -22296 3215 27727 -5562 -28058
16588b8058K9702q164k0182j7555N157r312o365K4331M4377K6744J188j2089O483
$$ -28058 1644 -6520 -26702 -44257 -39100 -48412 -54777 -30446 13931 40675 41863 29774 36257
16575C6257r014Q634R108o2431o2463L4239O4381M798J0176k0765k5232j2735
$$ 36257 27243 35877 44985 -17446 -79909 -45670 18711 23509 33685 12920 -12312 -25047
16563b5047n412R496J118J1683k7875J0776o844j9916J2824j8390K6845J2235
$$ -25047 -30459 -20963 -19845 -8162 -36037 -25261 -32105 -52021 -39197 -57587 -30742 -18507
16551a8507P343K4812J4827k6571L0399J0550j8586j2238L4731p050m8106k0855
$$ -18507 -11164 13648 28475 1904 32303 42853 24267 12029 46760 39710 -8396 -29251
16539b9251J984j1004N349J5405J2149K7857L306k6636j8774K3480K3531l4991
$$ -29251 -27267 -38271 -32922 -17517 -5368 22489 25795 -841 -19615 3865 27396 -7595
16527g595n5871J745P8109J1223o3113l9812o423J8639K1294J5873j1939k8000
$$ -7595 -63466 -61721 16388 27611 -35502 -75314 -81737 -63098 -41804 -25931 -37870 -65870
16515f5870K9615M0299J1399L9594k9508l2224j0341l651o873J8606l165L795
$$ -65870 -36255 4044 15443 55037 25529 -6695 -17036 -20687 -27560 -8954 -12119 -8324
16503h324j7101J2553J4227K5504k1840j8196R991J131J6712q646O616Q215k4032
$$ -8324 -25425 -12872 1355 26859 5019 -13177 -3186 -2055 14657 6011 12627 20842 -3190
16490c190R882K69l7992l8434k6307P501N810L9096L6846J4582J0128k7065j1339
$$ -3190 6692 6961 -31031 -69465 -95772 -88271 -82461 -43365 -6519 8063 18191 -8874 -20213
16477b0213n620k472R437L0196J5240j5887M775j2385p753R682J8171r803P707
$$ -20213 -25833 -28305 -18868 11328 26568 10681 15456 3071 -4682 5000 23171 13368 21075
16464B1075M3831m2037m8564L3397K4121r514m120J3864J1303k166R328k4631
$$ 21075 64906 22869 -25695 7702 31823 22309 18189 32053 43356 41190 50518 25887
16452B5887o060K0909J4202k6487J8859J8831m5812m0477R617R220j8423l9521
$$ 25887 19827 40736 54938 28451 47310 66141 20329 -20148 -10531 -1311 -19734 -59255
16440e9255r766J4679K5174M4870j871j2121J2235j6852j0182n467n4484j6043
$$ -59255 -69021 -54342 -29168 15702 13831 1710 13945 -2907 -13089 -18556 -73040 -89083
16428h9083J5672J5395M9844p551k7167K55L0209J3595j9639j5863M76k0506j5928
$$ -89083 -73411 -58016 -8172 -15723 -42890 -42635 -12426 1169 -18470 -34333 -33857 -54363 -70291
16415g0291N2457K9077j4964j791K1170r669O758K9401J6492K823J2323J1256
$$ -70291 -17834 11243 -3721 -5512 15658 5989 12747 42148 58640 61463 73786 85042
16403H5042o3713j9067J1063O708j9594m3641m495K4399K6659m5824l6073O0261
$$ 85042 21329 2262 13325 20033 439 -43202 -47697 -23298 3361 -42463 -78536 -18275
16391a8275M6663j5949m8645J0096k011K201L2903P355j1422j1378k0057o601
$$ -18275 28388 12439 -36206 -26110 -28121 -25920 6983 14338 2916 -8462 -28519 -35120
16379c5120l4781m450K7619o94o175O282M5932l020J8229K1809K7435k3966M826
$$ -35120 -69901 -74351 -46732 -47426 -53601 -47319 -1387 -4407 13822 35631 63066 39100 43926
16366D3926l4777m515k6066k185K0255M7101n139l5649j4114k1107Q250J0893
$$ 43926 9149 4634 -21432 -23617 -3362 43739 38600 2951 -11163 -32270 -24020 -13127
16354a3127J2777l7358l361J8078j1048r177Q731L9533o890K2828J3215K4014
$$ -13127 -350 -37708 -41069 -22991 -34039 -43216 -34485 5048 -1842 20986 34201 58215
16342E8215K5271m4658l5294J0669l6628n1847J8508N5611K1296J8201m2848k3718
$$ 58215 83486 38828 3534 14203 -22425 -74272 -55764 -153 21143 39344 -3504 -27222
16330b7222J4504Q818k5277J2047o012l0252j0027L666R969O527L5345j598j1067
$$ -27222 -12718 -3900 -29177 -17130 -23142 -53394 -63421 -59755 -49786 -43259 -7914 -9512 -20579
16317b0579J5699J4203j7728P32l8592m9242L2727M8788L3200r47j2974j1140
$$ -20579 -4880 9323 -8405 -7673 -46265 -95507 -62780 -13992 19208 18261 5287 -5853
16305e853l9445J7430P4828J4569o7369l7598m9153p599J5620N1947L8412K2912
$$ -5853 -45298 -27868 46960 61529 -5840 -43438 -92591 -100190 -84570 -32623 5789 28701
16293B8701P439J5294j2004j3826k7879o472K278Q272J6980k2084r379L00n08
$$ 28701 36140 51434 39430 25604 -2275 -8747 -6469 1803 18783 -3301 -12680 -12380 -12888
16280a2888P107J4846m2681l1957M2636L150J2770K1774J4188K5030o6m8227k9242
$$ -12888 -5781 9065 -33616 -65573 -22937 -19787 -7017 14757 28945 53975 53909 5682 -23560
16267b3560N4628K1992j3456M693l4717J7712l2885J3157J9572m1313m957n585
$$ -23560 31068 53060 39604 44297 9580 27292 -5593 7564 27136 -14177 -19134 -24719
16255b4719J2415L4491q069k1278N9158l6787l7737j1537j4853K3095j124j6482
$$ -24719 -12304 22187 14118 -7160 51998 15211 -22526 -34063 -48916 -25821 -26945 -43427
16243d3427K3652q754l0596M1918O1192J7994R698J9782k0842l7039k8989O447
$$ -43427 -19775 -28529 -59125 -17207 43985 61979 71677 91459 70617 33578 4589 11036
16231A1036l1843p915J3429m59K9398K3639k9219L321j693P463P564J5176j0036
$$ 11036 -20807 -28722 -15293 -15752 13646 37285 8066 11387 9694 17157 24721 39897 29861
16218B9861k6767n419p96P422J3954J0900n4899l8351l61k6160k7619J9846j980
$$ 29861 3094 -2325 -3121 4301 18255 29155 -25744 -64095 -64456 -90616 -118235 -98389 -100369
16205a00369j938K7553J5479N6357M2867k3455k699n521N163K519o266p559k8925
$$ -100369 -102307 -74754 -59275 -2918 39949 16494 13795 8274 13437 15956 9690 2131 -26794
16192b6794n1410K7527N4962M1859r222j4970R295p490j2387Q953k3352j0536
$$ -26794 -78204 -50677 4285 46144 36922 21952 31247 23757 11370 20323 -3029 -13565
16180a3565J6686j2359O136k3056M3318N1470p922N769L8225K0960M932k6070
$$ -13565 3121 -9238 -3102 -26158 17160 68630 60708 66477 104702 125662 130594 104524
16168A04524l6360k7725l4635n1324R003N9604k1835j3978j0399k6537K2952N2402
$$ 104524 68164 40439 5804 -45520 -36517 23087 1252 -12726 -23125 -49662 -26710 25692
16156B5692J2560k3422l5381j8635j0473J657K0403o237l4664J0008K0195l3232
$$ 25692 38252 14830 -20551 -39186 -49659 -48002 -27599 -33836 -68500 -58492 -38297 -71529
16144g1529k0513L6622R188k3217O838J4334k9937l698N3948N2149l4996K8020
$$ -71529 -92042 -55420 -46232 -69449 -62611 -48277 -78214 -81912 -27964 24185 -10811 17209
16132A7209n432n1289l5161j9597K1287N3579K656J3440k300K6864L8303L1664
$$ 17209 11777 -39512 -74673 -94270 -72983 -19404 -16748 -3308 -5608 21256 59559 91223
16120I1223l5239n7912k6674j646o538o279J0741J7861p093j6420J8501K3796
$$ 91223 55984 -1928 -28602 -30248 -36786 -43065 -32324 -14463 -21556 -37976 -19475 4321
16108D321n4997q441L1628M1720J1535k5874Q281J6860J1910j3515n722m1351
$$ 4321 -50676 -59117 -27489 14231 25766 -108 8173 25033 36943 23428 17706 -23645
16096b3645k3742Q618K3732M93k5488L1742J1000J7898o4583K110R883j5256R872
$$ -23645 -47387 -38769 -15037 -14544 -40032 -8290 2710 20608 -43975 -41865 -31982 -47238 -37366
16083c7366n791N1694K0066j6342J9366L257K0799J1735k5549l7618j0285J1028
$$ -37366 -43157 8537 28603 12261 31627 34884 55683 67418 41869 4251 -6034 4994
16071D994l1505r756J9455k1646K6100K5423r884k2488P631M1597R851k9271j1193
$$ 4994 -26511 -36267 -16812 -38458 -12358 13065 3181 -19307 -11676 29921 39772 10501 -692
16058f92j94k1711J1630L8438J7483L03p957k6313j6362R6L3818n816n1189J683
$$ -692 -886 -22597 -10967 27471 44954 45257 37300 10987 -5375 -5279 28539 22723 -28466 -26783
16044b6783q193O604J6245J4702j4223j5675K9279K8410p016j8246J7418q469
$$ -26783 -34976 -28372 -12127 2575 -11648 -27323 1956 30366 23350 5104 22522 14053
16032A4053l5284k0989L8108J2464j521M068K9678o681k1396J2518p36R428l1452
$$ 14053 -21231 -42220 -4112 8352 6831 10899 40577 33896 12500 25018 24282 33710 2258
16019B258l1409j1008P521J9381K4229r774N135j6729k4049l5043K232k902j289
$$ 2258 -29151 -40159 -32638 -13257 10972 1198 6333 -10396 -34445 -69488 -67256 -70158 -71447
16006g1447L3101J9396J1190N641K5383K9726J2871K8378j7273o004m0428l5408
$$ -71447 -38346 -18950 -7760 -2119 23264 52990 65861 94239 76966 70962 30534 -4874
15994d874l3643M1987L3931k3908k1912K1489k7122j6323m957R060O44k6225M2583
$$ -4874 -38517 3470 37401 13493 -8419 13070 -14052 -30375 -35332 -26272 -25628 -51853 -9270
15981i270L1663j4227l1120J3253J9912j1552J5483k3233j0548k6801L7386L4360
$$ -9270 22393 8166 -22954 -9701 10211 -1341 14142 -9091 -19639 -46440 -9054 25306
15969B5306J696o601o304j1156J7386J7885J797k3421n2113J2998r743j6727R230
$$ 25306 27002 20401 14097 2941 20327 38212 40009 16588 -35525 -22527 -32270 -48997 -39767
15956c9767J4857K4689M005K135M6881K0770K950l4993l2476l0872N275K3656
$$ -39767 -24910 -221 3784 5919 52800 73570 76520 41527 9051 -21821 -16546 7110
15944G110p992j1422l9941m0890l0028J3973J9252N6184L5598k65L986o731k3523
$$ 7110 -882 -12304 -52245 -93135 -123163 -109190 -89938 -33754 1844 1579 5565 -1166 -24689
15931b4689p374J8022N274j4456j4582P202N0398L2908n369k4439j4419k5671
$$ -24689 -32063 -14041 -8767 -23223 -37805 -30603 19795 52703 47334 22895 8476 -17195
15919a7195L3260O464j5048p420J0134j3724l9432l9646J5994K8011l7480L2159
$$ -17195 16065 22529 7481 61 10195 -3529 -42961 -82607 -66613 -38602 -76082 -43923
15907d3923O7858K1898k5192n8496l8407p127J1130L9073k3617P994r772O767
$$ -43923 23935 45833 20641 -37855 -76262 -83389 -72259 -33186 -56803 -48809 -58581 -51814
15895e1814p637J8052J5577m4547K0391K7290J5764j3421k8622M6259J4962p025
$$ -51814 -59451 -41399 -25822 -70369 -49978 -22688 -6924 -20345 -48967 -2708 12254 5229
15883E229K1008K2270o542k5256j1894L7878l088m31J9938J0079l4448l670J6105
$$ 5229 26237 48507 41965 16709 4815 42693 39605 39174 59112 69191 34743 31073 47178
15870D7178o94O787J7952m3619m7939J2676j6242r739n808K580J8897l9475J7520
$$ 47178 46484 53271 71223 27604 -20335 -7659 -23901 -33640 -39448 -36868 -17971 -57446 -39926
15857c9926P405K2987k4835J3784r888k8449m51N2730j586J5372l7576k1600q049
$$ -39926 -32521 -9534 -34369 -20585 -30473 -58922 -59373 -6643 -8229 7143 -30433 -52033 -60082
15844f0082P897J1669L7548J9117L8166j4953o2638j5456L7147R320k7451K5965
$$ -60082 -52185 -40516 -2968 16149 54315 39362 -23276 -38732 -1585 7735 -19716 6249
15832F249m491j2980L8183Q933k6470l0522L651J3048J5518J4246j7543k9168
$$ 6249 1758 -11222 26961 35894 9424 -21098 -17447 -4399 11119 25365 7822 -21346
15820b1346K5376j1083n7495J3758K6479m768j2543J2910K9347N1274L6136k7364
$$ -21346 4030 -7053 -64548 -50790 -24311 -29079 -41622 -28712 635 51909 88045 60681
15808F0681l216j9285r179J7075k9973J6486j8526p254J4261K0231m5480K313
$$ 60681 57465 38180 29001 46076 16103 32589 14063 6809 21070 41301 -4179 -1866
15796a866J717p388j7892K256j8552L1098L7094Q473l4905m644k6294L695K4767
$$ -1866 -149 -7537 -25429 -23173 -41725 -10627 26467 34940 35 -4609 -30903 -27208 -2441
15783b441M1488L743p234j6993k4479k9227q660j1374k852q398O7529K0087j7827
$$ -2441 39047 42790 35556 18563 -5916 -35143 -43803 -55177 -58029 -66427 1102 21189 3362
15770C362j5776O646k33J9694P666j5459j7975q765J3302Q29N101K9113l4817
$$ 3362 -12414 -5768 -6001 13693 21359 5900 -12075 -20840 -7538 -6709 -1608 27505 -7312
15757g312j3215J6724j8988k2093J7988l174J2380k2899L786K721n816l6881L2534
$$ -7312 -20527 -3803 -22791 -44884 -26896 -30070 -17690 -40589 -36803 -34082 -39898 -76779 -44245
15744d4245J9641N827L252K6879K719J7090k5114n5770K3381J8471k7927m889
$$ -44245 -24604 -18777 -15525 11354 14073 31163 6049 -49721 -26340 -7869 -35796 -40685
15732d0685j1917p707K8483N4392K770r904N323K1484O409r006P283j0335j2803
$$ -40685 -52602 -60309 -31826 22566 25336 15432 20755 42239 48648 39642 46925 36590 23787
15719B3787j3409j2993j8687J4072l3146L576k637O1789l4118o4478R409N6946
$$ 23787 10378 -2615 -21302 -7230 -40376 -36800 -39437 22352 -11766 -76244 -66835 -9889
15707i889q988j4981L5300J0429l3724k9691r071J9123O6494Q249J6025o951q446
$$ -9889 -18877 -33858 1442 11871 -21853 -51544 -60615 -41492 25002 33251 49276 42325 33879
15694C3879l031j9803J7364n109k2602M0994J1526p15L148K4619L9069q555l0957
$$ 33879 30848 11045 28409 23300 698 41692 53218 52503 55651 80270 119339 110784 79827
15681G9827R616m8638p6622L7028K7848l7563n9267k3731r946R921J7415M5081
$$ 79827 89443 40805 -35817 1211 29059 -8504 -67771 -91502 -101448 -91527 -74112 -29031
15669b9031J9684K8693k603k3006n372J3717j4817m9531l1733M0253N2824J8786
$$ -29031 -9347 19346 16743 -6263 -11635 2082 -12735 -62266 -93999 -53746 -922 17864
15657A7864K7094K0592k0189l5648m2268L2897K5805j7413k3805k9128M7032K7910
$$ 17864 44958 65550 45361 9713 -32555 342 26147 8734 -15071 -44199 2833 30743
15645C0743J3095j4547J050o077p971q039k2435k936K254r569q336J8915L1026
$$ 30743 43838 29291 30341 24264 16293 8254 -14181 -17117 -14863 -24432 -32768 -13853 17173
15632A7173J457l1916P154j3231l0869K858K4980J0645K4049K1883k508J803j0055
$$ 17173 18630 -13286 -6132 -19363 -50232 -47374 -22394 -11749 12300 34183 31675 33478 23423
15619B3423k0688k228P310L3192l1901l1296J4872L4512m3649o107L2365J435
$$ 23423 2735 507 7817 41009 9108 -22188 -7316 27196 -16453 -22560 9805 11240
15607A1240J7814p067j5109J6559k7552j5736m873k051J7884J6637K4919J6980
$$ 11240 29054 21987 6878 23437 -4115 -19851 -24724 -26775 -8891 7746 32665 49645
15595D9645R153j0905p1902l4529L2548N4064Q577k1276j393J3991L9366J9187
$$ 49645 58798 47893 -24009 -58538 -25990 28074 36651 15375 13982 27973 67339 86526
15583H6526k9658k1902k3747q283o250K0172N0122p314p087n5101k2711m300K7420
$$ 86526 56868 34966 11219 2936 -3314 16858 66980 59666 52579 -2522 -25233 -29533 -2113
15570b113l0105m0616K7153L6287N3953k5201k0655k0921j0935K5019n441N992
$$ -2113 -32218 -72834 -45681 -9394 44559 19358 -1297 -22218 -33153 -8134 -13575 -7583
15558g583L4142k0984n2486K4985m385P944j2183j5027N0539J1392j239j8459
$$ -7583 26559 5575 -46911 -21926 -26311 -18367 -30550 -45577 4962 16354 15115 -3344
15546c344k4636L306N9224M7473K5510k7898j8917p410k301l8074l3900j711L5103
$$ -3344 -27980 -24674 34550 82023 107533 79635 60718 53308 51007 12933 -20967 -22678 12425
15533A2425K6953j617m3928j9839k4050r726L5949K4819K5286j5839l0805k4518
$$ 12425 39378 37761 -6167 -26006 -50056 -59782 -23833 986 26272 10433 -20372 -44890
15521d4890j2818J9890K2899j4327j2862J7832O949m7843k6124P647L5774J9350
$$ -44890 -57708 -37818 -14919 -29246 -42108 -24276 -17327 -65170 -91294 -83647 -47873 -28523
15509b8523m4435k9217J2280k550M8302L3227K6448J6125j5634j6439L4764j9881
$$ -28523 -72958 -102175 -89895 -92445 -44143 -10916 15532 31657 16023 -416 34348 14467
15497A4467j005j7471R18j1608K2254P659o66n609J677j1332N295L162l676J4593
$$ 14467 13462 -4009 -3091 -14699 7555 15214 14548 8939 10616 -716 4579 7741 4065 18658
15483A8658j2082J2470J0707n3428k0595j8587j0769j7814R430L0734K1013J339
$$ 18658 6576 19046 29753 -23675 -44270 -62857 -73626 -91440 -82010 -51276 -30263 -28924
15471b8924R99k0960K7437l210m753k723l6528R745L1341K5464j7628k4258k7976
$$ -28924 -27925 -48885 -21448 -24658 -29411 -32134 -68662 -58917 -27576 -2112 -19740 -43998 -71974
15458g1974L3299J0351J555J3907j7280J5602J371l266k620L3185l4762l3328
$$ -71974 -38675 -28324 -26769 -12862 -30142 -14540 -13169 -16435 -19055 14130 -20632 -53960
15446e3960k204l1421N065K4077n838M2785N649L8171k8542l1543J6128K5394
$$ -53960 -56164 -87585 -82520 -58443 -64281 -21496 -15847 22324 -6218 -37761 -21633 3761
15434C761K6842k9993m7744L7574L3847M3352j9754j4879J4625k7185k3287j5954
$$ 3761 30603 610 -47134 -9560 24287 67639 47885 33006 47631 20446 -2841 -18795
15422a8795J4616J1363l2252m696M8086k0446n679N763k4462J1084L6800l431
$$ -18795 -4179 7184 -25068 -29764 18322 -2124 -7803 -2040 -26502 -15418 21382 17951
15410A7951k5778Q251Q476m7570K326J0575j1302M1553N3942q191J7804M3468
$$ 17951 -7827 424 8900 -38670 -36344 -25769 -37071 4482 58424 50233 68037 111505
15398A11505J1019j6968l9709q5987m0545O473q104K1151R742M9955P655k5041
$$ 111505 122524 105556 65847 -20140 -60685 -54212 -62316 -41165 -31423 18532 26187 1146
15386A146L2035L4418j3089J7070K774j8102j1201k466K2911l2820m7022K164
$$ 1146 33181 67599 54510 71580 74354 56252 45051 42585 65496 32676 -14346 -12182
15374a2182j3058k2509J1455J4722K7315k9333k7762R483j8486K7934N0603L163
$$ -12182 -25240 -47749 -36294 -21572 5743 -23590 -51352 -41869 -60355 -32421 18182 21345
15362B1345j4463l1190j4498J0305k1962L0174Q344k4790J5987M181k4631J5540
$$ 21345 6882 -24308 -38806 -28501 -50463 -20289 -11945 -36735 -20748 -16567 -41198 -25658
15350b5658N8675L7856l2169k6371j6408o1483n927J5732J6761N2551Q141n0209
$$ -25658 33017 70873 38704 12333 -4075 -65558 -71485 -55753 -38992 13559 21700 -28509
15338b8509L8813K8280n6555l22L3257r262m7023M550L7893L8885M124R4J1651
$$ -28509 10304 38584 -17971 -18293 14964 5702 -41321 -36771 1122 40007 44131 44225 55876
15325E5876p28N180J8462L626k0639l2832K8844n2141l0984j2239M228K755N7586
$$ 55876 55148 60328 78790 82416 61777 28945 57789 5648 -25336 -37575 -33347 -30592 26994
15312B6994J3528j9292j6724R846M8666J1749k0588o715m7696k0813K4060N9180
$$ 26994 40522 21230 4506 14352 63018 74767 54179 47464 -232 -21045 3015 62195
15300F2195J8274k9697l328j4032K0329K1892L2222j5578n4906J282j1511n538
$$ 62195 80469 50772 47444 33412 53741 75633 107855 92277 37371 38653 27142 21604
15288B1604r910k7283j2277p401J942J9158L0983m0538j2524J1311j3995k1322
$$ 21604 11694 -15589 -27866 -35267 -33325 -14167 16816 -23722 -36246 -24935 -38930 -60252
15276f0252l4666K9439M1272n483M449K8252O5441M1936k5672n3286K6895j0619
$$ -60252 -94918 -65479 -24207 -29690 -25241 3011 68452 110388 84716 31430 58325 47706
15264D7706r064j8423N191k4462k2450K1067L344J0151k5689j4374k6262P587
$$ 47706 38642 20219 25410 948 -21502 -435 2909 13060 -12629 -27003 -53265 -45678
15252d5678N181k0293J2023N0325J0628M9455L787k771k8956m6269J382M2265
$$ -45678 -40497 -60790 -48767 1558 12186 61641 65428 62657 33701 -12568 -11186 31079
15240C1079L123n4828j6070N2421O5615K892m4187r393j5078n0097l1759k1301
$$ 31079 34202 -20626 -36696 15725 81340 84232 40045 30652 15574 -34523 -66282 -87583
15228h7583J7370N3323J1600k9308k5008M450M96K8290K4629L4963j8365k0977
$$ -87583 -70213 -16890 -5290 -34598 -59606 -55156 -54660 -26370 -1741 33222 14857 -6120
15216f120M1966J331k6255M298k1315L1864l3556m7883k3437K6168M8692L3096
$$ -6120 35846 37177 10922 15220 -6095 25769 -7787 -55670 -79107 -52939 -4247 28849
15204B8849l195n4042m0240J6676L4922M0131j0018j2644P164L0864K3591m3998
$$ 28849 25654 -28388 -68628 -51952 -17030 23101 13083 439 7603 38467 62058 18060
15192A8060k6983k5679r077K5663k5097l5400L2667M939R729L943j5311n575r767
$$ 18060 -8923 -34602 -43679 -18016 -43113 -78513 -45846 -40907 -31178 -27235 -42546 -48121 -57888
15179e7888j9612P337n555J4960l495j7713k9425j0332M9924N9467P0332L7550
$$ -57888 -77500 -70163 -75718 -60758 -64253 -81966 -111391 -121723 -71799 -12332 58000 95550
15167I5550l013l1025J724K5777K67o9750j9524l5124j8634o80J5101K5507M203
$$ 95550 92537 61512 63236 89013 89280 19530 6 -35118 -53752 -54432 -39331 -13824 -9621
15154i621L568J9422R898j4112j3301M8963J0368J7348J3355l7330n5049K3027
$$ -9621 -6053 13369 23267 9155 -4146 44817 55185 72533 85888 48558 -6491 16536
15142A6536N5783r765r952M5767k8497m6857l3243M4260k0309m1718j0341Q0139
$$ 16536 72319 62554 52602 98369 69872 23015 -10228 34032 13723 -27995 -38336 41803
15130D1803L8660j4912l2703o9763K0100K7878o943l4768k0438k159j3625J0701
$$ 41803 80463 65551 32848 -36915 -16815 11063 4120 -30648 -51086 -53245 -66870 -56169
15118e6169K9062M038l3959j012J9819o574l765L873M6156M5619J3017k8054j8332
$$ -56169 -27107 -23069 -57028 -58040 -38221 -44795 -48560 -44687 1469 47088 60105 32051 13719
15105A3719j2046L1720J3743k1546J1821J4181n2841O688R389K8962J6213M1187
$$ 13719 1673 33393 47136 25590 37411 51592 -1249 5439 14828 43790 60003 101190
15093A01190r200q4073k8716K583N645K7123M6271L8421P252k7067j5804n2567
$$ 101190 91990 7917 -20799 -18216 -12571 14552 60823 99244 106496 79429 63625 11058
15081A1058J1322q605R752K7446r203k7134J1127j8975m7309J3854L1448L5986
$$ 11058 22380 13775 23527 50973 41770 14636 25763 6788 -40521 -26667 4781 40767
15069D0767J0257j3784m680j3317o981L419P687n923L9032j2846l7165K3104l8285
$$ 40767 51024 37240 32560 19243 12262 15681 23368 17445 56477 43631 6466 29570 -8715
15056h715r850K7327K5949J1406J9986l8620k9489j5781J8218K6878k697Q225
$$ -8715 -18565 8762 34711 46117 66103 27483 -2006 -17787 431 27309 24612 32837
15044C2837k8791l3288K6542o757j5678J3119k6914K5461J5221j0320M813l442
$$ 32837 4046 -29242 -2700 -9457 -25135 -12016 -38930 -13469 1752 -8568 -3755 -7197
15032g197K665M0179K7983l3076k3410j1850j3119M421Q228K7656K0026k4769
$$ -7197 -4532 35647 63630 30554 7144 -4706 -17825 -13404 -5176 22480 42506 17737
15020A7737p380L3161M5558K9722p8440l7530p743L114K5132O213J4886l4841
$$ 17737 10357 43518 89076 118798 40358 2828 -4915 -1801 23331 29544 44430 9589
15008I589q079q878J8890Q760l4583N850p04J5783m1902J7631J5507L5764l856
$$ 9589 1510 -7368 11522 20282 -14301 -8451 -9155 6628 -35274 -17643 -2136 33628 29772
14995B9772n927O811K5741k5041k0067l2971k119O276J5227J4247O2593K6981
$$ 29772 23845 30656 56397 31356 11289 -21682 -23801 -17525 -2298 11949 74542 101523
14983A01523l9726o7507l7618k1160O74M6721N4725r521J240N674J1789j2979
$$ 101523 61797 -5710 -43328 -64488 -63814 -17093 37632 28111 29351 35025 46814 33835
14971C3835k4364p521J364l5423o1207j3097K6560j809j1344O405N5087K103k2937
$$ 33835 9471 1950 3314 -32109 -93316 -106413 -79853 -81662 -93006 -86601 -31514 -29411 -52348
14958e2348J7154J7314K1382J3128l3703j4073J5973K8968q826k5500j1821N841
$$ -52348 -35194 -17880 3502 16630 -17073 -31146 -15173 13795 4969 -20531 -32352 -26511
14946b6511K7479L8415k2173j6739m872q926k3399j1308L220K4912l4710k3142
$$ -26511 968 39383 17210 471 -4401 -13327 -36726 -48034 -44814 -19902 -54612 -77754
14934g7754M1938J5275L0888M7111K6621l9960o5279m4490j6432K4845N439K9007
$$ -77754 -35816 -20541 10347 57458 84079 44119 -21160 -65650 -82082 -57237 -51798 -22791
14922b2791J4350P008j0271R994k284J0189K721k7069r503K558j4246K1061M7624
$$ -22791 -8441 -1433 -11704 -1710 -3994 6195 8916 -18153 -27656 -25098 -39344 -18283 29341
14909B9341k9621j6581M7462O0884k7496n0293M852k270J4414K603j9473l4031
$$ 29341 -280 -16861 30601 91485 63989 13696 18548 16278 30692 33295 13822 -20209
14897b0209j0647j9591k7881L3713M3701K6271J9760J7145p523j1953k1295k950
$$ -20209 -30856 -50447 -78328 -44615 -914 25357 45117 62262 54739 42786 21491 18541
14885A8541K2160O362j4989O489L227l543J0522n478K2627J5159l6352j0675m132
$$ 18541 40701 47063 32074 38563 41790 38247 48769 43291 65918 81077 44725 34050 29918
14872B9918n1740j88K9978N1268J8022l6494Q919j2366j0747L5843k881k3288
$$ 29918 -21822 -22010 7968 59236 77258 40764 49683 37317 26570 62413 59532 36244
14860C6244K552O1801j520r1868m6333K6611j5716O5530M108j4011j0700l9030
$$ 36244 38796 100597 99077 7209 -39124 -12513 -28229 37301 41409 27398 16698 -22332
14848b2332P587p481J595L088O415K1613k5556J1345J7640p737P545J5150j9603
$$ -22332 -14745 -22226 -20631 -17543 -11128 10485 -15071 -3726 13914 6177 13722 28872 9269
14835I269j4251k3019K0936K6373j0300J5900M1545J8771j8619n1318O28O850
$$ 9269 -4982 -28001 -7065 19308 9008 24908 66453 85224 66605 15287 15915 22765
14823B2765j7227K2170K4470l5667m9544j720Q409j2231N299Q790M2947j0658
$$ 22765 5538 27708 52178 16511 -33033 -34753 -26344 -38575 -33276 -24486 18461 7803
14811G803k7292o87L7660m732l3738m5846l800J3832K5617N4310P720m5159M00
$$ 7803 -19489 -20176 17484 12752 -20986 -66832 -70632 -56800 -31183 23127 30847 -14312 -13912
14798a3912L4994L702l3963J6681K570k8931p544l879J0954L4141L351m7764k4195
$$ -13912 21082 24784 -9179 7502 10072 -18859 -26403 -30282 -19328 14813 18164 -29600 -53795
14785e3795K538J5123j3691j3457J6436Q310J7404J3058J815K0539O863L093L5900
$$ -53795 -51257 -36134 -49825 -63282 -46846 -38536 -21132 -8074 -6259 14280 21143 24236 60136
14772F0136J3748l7119m7185L9168m493k5494K1320R773M4603K9741k0147l2556
$$ 60136 73884 36765 -10420 28748 24255 -1239 20081 29854 74457 104198 84051 51495
14760E1495k1818j6471j8926K216j0897j3402K9093M1749J2664k3022k2504J7791
$$ 51495 29677 13206 -5720 -3504 -14401 -27803 1290 43039 55703 32681 10177 27968
14748B7968N579p42j398j5189K2690Q213J5803j4516L454N0931M6966O2593R4409
$$ 27968 33547 32805 31407 16218 38908 47121 62924 48408 51862 102793 149759 212352 306761
14735C06761J19090J81575K94832M73153N50930J24259l91154n00010l98705k39229
$$ 306761 425851 607426 902258 1375411 1926341 2050600 1659446 1159436 760731 521502
14725E21502j61993j13643o9682j3578J3083m9623q6916P856K9180n1980j2035
$$ 521502 359509 245866 176184 162606 175689 126066 39150 47006 76186 24206 12171
14714A2171j0258J1485l9200k4784M4165M698J3436j3729K19n060k1652j9868
$$ 12171 1913 13398 -25802 -50586 -6421 -1723 11713 -2016 -1797 -6857 -28509 -48377
14702d8377o38K7305k647K7235N7804k820J2473l7561j1562M0669j8227K655k330
$$ -48377 -49015 -21710 -24357 2878 60682 57862 70335 32774 21212 61881 43654 46309 43979
14689D3979j8997J8085P272j0320j9514m1612j9855K9629J2322q573K1777l999
$$ 43979 24982 43067 50339 40019 20505 -21107 -40962 -11333 989 -7584 14193 10194
14677A0194J9197J708p406J1512Q406J6823J0040J0633n34J0500P957o042k560
$$ 10194 29391 31099 23693 35205 43611 60434 70474 81107 80573 91073 99030 92988 90428
14664I0428K2543J3118j0938n2145j2833L2498j015p811l7591n56Q866l1580k4195
$$ 90428 112971 126089 115151 63006 50173 82671 81656 73845 36254 35698 44564 12984 -11211
14651a1211n1238J8166K8223L4383P916n1972l6160K4719K1202J979J1848K8194
$$ -11211 -62449 -44283 -16060 18323 26239 -25733 -61893 -37174 -15972 -13993 -2145 26049
14639B6049j4697J5252l7246j5020O464P7022K2298o4256l9871Q823K5698J5355
$$ 26049 11352 26604 -10642 -25662 -19198 57824 80122 15866 -24005 -15182 10516 25871
14627B5871M7012m2281o1614J1097q949m7977M438N0199L040j1404j8672K8550
$$ 25871 72883 30602 -31012 -19915 -28864 -76841 -72403 -22204 -19164 -30568 -49240 -20690
14615b0690K2288N1876L513J2599o7298k9498m430K0131J0894r325j3761K1337
$$ -20690 1598 53474 56987 69586 2288 -27210 -31640 -11509 -615 -9940 -23701 -2364
14603b364K9829k0719m3997K0221L0840K377m081k413l6935k601L1942L2629K3023
$$ -2364 27465 6746 -37251 -17030 13810 16187 12106 9693 -27242 -29843 2099 34728 57751
14590E7751o693k5096k9151j4010N8415N3161K5135m8621n4903l7285J4030K882
$$ 57751 51058 25962 -3189 -17199 41216 94377 119512 70891 15988 -21297 -7267 -4385
14578d385L278J7043k0023j0501J0492r783J6059k2358J4126N1330l462l3017
$$ -4385 -1107 15936 -4087 -14588 -4096 -13879 2180 -20178 -6052 45278 41816 8799
14566H799k7349M7390n301l4661j5338M6210K1776r569m9618j8668L204k2938
$$ 8799 -18550 28840 23539 -11122 -26460 19750 41526 31957 -17661 -36329 -33125 -56063
14554e6063j0211r148l1506O138j0998N026M7500M8008M2808K7582n5735n385
$$ -56063 -66274 -75422 -106928 -100790 -111788 -106762 -59262 -11254 31554 59136 3401 -1984
14542a984J2635P697J6709R861m178j6148k1663l5505r953M1965L6095n122K877
$$ -1984 10651 18348 35057 44918 40740 24592 2929 -32576 -42529 -564 35531 30409 33286
14529C3286J2665O62m2471k5404M629o08J3939M1836j212q988k650l1431k8150
$$ 33286 45951 46613 4142 -21262 -16633 -17241 -3302 38534 37322 28334 25684 -5747 -33897
14516c3897P765k7146L579L7752J2249J4152k6162k218l3613J1021M3670Q42N387
$$ -33897 -26132 -53278 -49699 -11947 302 14454 -11708 -13926 -47539 -36518 7152 7994 13381
14503A3381j1697J3241m535j0531K3389K7145Q0257N2549J1400n797m6358m7854
$$ 13381 1684 14925 10390 -141 23248 50393 130650 183199 194599 188802 142444 94590
14491I4590l2892k121k7263p136p931J4855L853j7747j2023n610q707L400m7712
$$ 94590 61698 59577 32314 25178 17247 32102 35955 18208 6185 575 -8132 -4732 -52444
14478e2444O339J6744K0894J8835J8275L6738J9343m7407m3797k0980O631L1846
$$ -52444 -46105 -29361 -8467 10368 28643 65381 84724 37317 -6480 -27460 -20829 11017
14466A1017P174K957K461j8921J752J077O893q804J3709J6415n387J3694k4336
$$ 11017 18191 21148 23609 4688 6440 7517 14410 5606 19315 35730 30343 44037 19701
14453A9701j5111j9140K5605K0616M721j3608k8163K1336n043m3259Q086j7151
$$ 19701 4590 -14550 11055 31671 36392 22784 -5379 15957 10914 -32345 -24259 -41410
14441d1410r484j4137L2575K0154k188R192k3514m9222o360K9405J0438K3205
$$ -41410 -50894 -65031 -32456 -12302 -14490 -5298 -28812 -78034 -84394 -54989 -44551 -21346
14429b1346j2331k4202K225M6509O5804j1721q318p203K5239j4618l0131J1120
$$ -21346 -33677 -57879 -55654 -9145 56659 44938 36620 29417 54656 40038 9907 21027
14417B1027J5210r994l4928M348l4396N1776J0197j4640p887J9825L6967J1703
$$ 21027 36237 26243 -8685 -4337 -38733 13043 23240 8600 713 20538 57505 69208
14405F9208q3046o0082J8890Q948P852j2556j1753p550k4565j6567J1219L9291
$$ 69208 -13838 -73920 -55030 -46082 -38230 -50786 -62539 -70089 -94654 -111221 -100002 -60711
14393f0711M8572K9791L7917K5350m590N800L2391j8066L852L7302M3734K497
$$ -60711 -12139 17652 55569 80919 76329 82129 114520 96454 100306 137608 181342 183839
14381A83839P488j0460l7274m873K4125P60M170M3009K8475J3688O7187K11574
$$ 183839 191327 180867 143593 138720 162845 163605 167775 210784 239259 252947 320134 531708
14369E31708M39727M17224O9960k90226l53642l10893j96786j00663n3971r3648
$$ 531708 971435 1388659 1458619 1168393 814751 503858 307072 206409 152438 58790
14359E8790o3648Q53m944r152k235N6817J2616R011j4623J449N1537J023p344
$$ 58790 -4858 -4005 -8949 -18101 -20336 36481 49097 58108 43485 44934 96471 97494 90150
14346I0150k672j1892j4446K8911L9191l0067l9321p24J00q652J6185j5291K6497
$$ 90150 87478 75586 61140 90051 129242 99175 59854 59130 59230 50578 66763 51472 77969
14333G7969P613k1441o246L637L0200J8071j6964J3217r618N833L5180K5866m5834
$$ 77969 85582 64141 57895 61532 91732 109803 92839 106056 96438 102271 137451 163317 117483
14320A17483j5216M6489J5931j221J5257m1154L596L5982K2909J0898J68m307
$$ 117483 102267 148756 164687 163466 178723 137569 141165 177147 200056 210954 211122 206815
14308B06815j0951o201M6070J397K2883N840k1495J3614O097p666L3201J0538
$$ 206815 195864 189663 235733 237130 260013 265853 244358 257972 264069 256403 289604 300142
14296C00142O4162N2308J7347O4847j192n3681l0000J5659K3584J2399p94K0905
$$ 300142 364304 416612 433959 498806 497614 443933 413933 429592 453176 465575 464781 485686
14284D85686k7686n823O3200J29497J02134O7295R1888O9927l9345J9774J25940
$$ 485686 458000 452177 515377 644874 747008 814303 906191 976118 936773 956547 1082487
14273A082487J09246N8054M7013O4398R9444J64325K18202K41258K46240J86530
$$ 1082487 1191733 1249787 1296800 1361198 1460642 1624967 1843169 2084427 2330667 2517197
14263B517197J55696K13914K60265L83404N34557P74111J131393J509710J367737
$$ 2517197 2672893 2886807 3147072 3530476 4065033 4839144 5970537 7480247 8847984
14254H847984R59948J100764J717264K506847L450886M647219O800207J0974153
$$ 8847984 9807932 10908696 12625960 15132807 18583693 23230912 30031119 41005272
14246D1005272J8585434L2210252N6980770R5170288J17196934N1389003o2772256
$$ 41005272 59590706 91800958 148781728 243952016 361148950 412537953 349765697
14239C49765697j05665345q6899430n5654441l2695845j9420623j2249347q184488
$$ 349765697 244100352 157200922 101546481 68850636 49430013 37180666 28996178
14232B8996178n875716m358765l143471k193992j420364p77749o29686j046925
$$ 28996178 23120462 18761697 15618226 13424234 12003870 11226121 10596435 9549510
14224I549510j302501j168325r66645p77265o08564n24775m38096l31403k39747
$$ 9549510 8247009 7078684 6112039 5334774 4726210 4201435 3763339 3431936 3192189
14215C192189j71608j91156k19649j95936j66193j74886j40032j27901j31784
$$ 3192189 3020581 2829425 2609776 2413840 2247647 2072761 1932729 1804828 1673044
14206A673044j47408o3613n2776l8445m2952j5791r205n7721k4219k5228p777
$$ 1673044 1525636 1462023 1409247 1370802 1327850 1312059 1302854 1245133 1220914 1195686 1187909
14195A187909p3143r9881p5139k0748q3136q7449l2300j7422J9755Q237l1833
$$ 1187909 1114766 1014885 939746 918998 835862 748413 716113 698691 718446 726683 694850
14184F94850P802K835k2651m820l9745n5687l4325o953L662k6728j0818p109J131
$$ 694850 702652 705487 682836 678016 638271 582584 548259 541306 544968 518240 507422 500313 501444
14171E01444l6864l8756l4644r496L3493k4816J4477K6136K3631Q867O16l2789
$$ 501444 464580 425824 391180 381684 415177 390361 404838 430974 454605 463472 464088 431299
14159D31299l1365m3420k8065M6792O7135p360l4104m5346m4187N6397O4260L2302
$$ 431299 399934 356514 328449 375241 442376 435016 400912 355566 311379 367776 432036 464338
14147D64338k1789m9543m3349o9735k3432J6719j0121k8984l3273J0472L1593
$$ 464338 442549 393006 349657 279922 256490 273209 263088 234104 200831 211303 242896
14136B42896K3219r922l3868K6881N3374J3511j6998m5779k9727j4127J9841N0962
$$ 242896 266115 256193 222325 249206 302580 316091 299093 253314 223587 209460 229301 280263
14124B80263n845n3880j0933j6571J0020n7596j68062k24630k22010n3018R3099
$$ 280263 274418 220538 209605 193034 203054 145458 -22604 -247234 -469244 -522262 -429163
14113d29163J31239J31338P9331J8330J8511N6412J9486L2829J9963l6802j4540
$$ -429163 -297924 -166586 -87255 -68925 -50414 5998 25484 58313 78276 41474 26934
14102B6934R650J5828J9928J1602J7676l544j2183q480k5787l5390J3362J0910
$$ 26934 36584 52412 72340 83942 101618 98074 85891 77411 51624 16234 29596 40506
14090D0506Q7548N6019M9064L5562L756j1126l0461o3966n0390N2401K5412K553
$$ 40506 128054 184073 233137 268699 272455 261329 230868 166902 116512 168913 194325 196878
14078A96878l3335j1613L556k1155J4718M0160q991m217M0256q351p5014j2206
$$ 196878 163543 151930 155486 134331 149049 189209 180218 176001 216257 207906 132892 120686
14066A20686J3183k2862k518j9267k2745K9448L9915l0804k4388m2788m5144K0804
$$ 120686 133869 111007 108489 89222 66477 95925 135840 105036 80648 37860 -7284 13520
14054A3520J00227M8631J3441J1822m2823j6078M104p947J8705j45j0529l4328
$$ 13520 113747 162378 175819 187641 144818 128740 132844 124897 143602 143457 132928 98600
14042I8600J7271N407l0296k8552O277L3668J3166j1115k8517N994K4384j8714
$$ 98600 115871 121278 90982 62430 68707 102375 115541 104426 75909 81903 106287 87573
14030H7573M3533K8228j2195o369k8836l7568r447L0332K2249N434m626k3890
$$ 87573 131106 159334 147139 140770 111934 74366 64919 95251 117500 122934 118308 94418
14018I4418r110M6838M0646K1558l1395l1546L2668J429k9168j3246L3724k3138
$$ 94418 85308 132146 172792 194350 162955 131409 164077 165506 136338 123092 156816 133678
14006A33678n0575q890L0553j1383k8108K7982q699J5278L471L7278K671m2296
$$ 133678 83103 74213 104766 93383 65275 93257 84558 99836 103307 140585 143256 100960
13994A00960R257O1924R68p774L098j6053l2062k2450k3190J4970K1799m486K230
$$ 100960 110217 172141 173109 165335 168433 152380 120318 97868 74678 89648 111447 106961 109191
13981A09191m8554l8689K7752n507K4574J3878j0295O634j844k1235j9532N4913
$$ 109191 60637 21948 49700 44193 68767 82645 72350 78984 77140 55905 36373 91286
13969I1286k214j4045J0851K8963K6359l1552k9597k0552N847j5975j2279L0322
$$ 91286 89072 75027 85878 114841 141200 109648 80051 59499 65346 49371 37092 67414
13957F7414k2006P4J2536n1044l204J4161K0811m3226P133L468o37Q992J2549
$$ 67414 45408 45482 58018 6974 3770 17931 38742 -4484 2649 6117 5480 14472 27021
13944B7021K5771N7517q043j171k7588j8581l85K7177p023K0227j3836J7320P950
$$ 27021 52792 110309 102266 101095 73507 54926 54541 81718 74695 94922 81086 98406 106356
13931A06356j0936j3721j4481J5477k7137j8159m679k8754K4448M7380K8973K8038
$$ 106356 95420 81699 67218 82695 55558 37399 32720 3966 28414 75794 104767 132805
13919A32805j8784k4780j800J0485J315m1863K5308N017j0140j7294P563p5118
$$ 132805 114021 89241 87441 97926 99241 57378 82686 87703 77563 60269 67832 -7286
13907g286K67L0729l083K4226M0170p805k2041J7570J1123L128k2110P759J0948
$$ -7286 -7019 23710 20627 44853 85023 77218 55177 72747 83870 86998 64888 72647 83595
13894H3595J1992m5539m3930Q374J9861R018K4604J445L1204M5896L2824l9253
$$ 83595 95587 50048 6118 14492 34353 43371 67975 69420 100624 146520 179344 140091
13882A40091l3267k3499K194l0195j4670j4999n62L2332L6607P130J3399P984
$$ 140091 106824 83325 85519 55324 40654 25655 25093 57425 94032 101162 114561 122545
13870A22545p0680o7845J1155K6608L1607M7098k649k7337O28l4182K2614J8841
$$ 122545 51865 -15980 -4825 21783 53390 100488 97839 70502 71130 36948 59562 78403
13858G8403l386J5735m190l2073K2275J3911k29j4231l2129m340J8343K2509k6043
$$ 78403 75017 90752 86562 54489 76764 90675 90446 76215 44086 39746 58089 80598 54555
13845E4555j2982j7677r550J3599J0737L5909k0381l1329k5385k344j1022K1601
$$ 54555 41573 23896 14346 27945 38682 74591 54210 22881 -2504 -4848 -15870 5731
13833E731j7879j2971k1834k3478J7138J9581N2847M9322J4347l848j6902k4367
$$ 5731 -12148 -25119 -46953 -70431 -53293 -33712 19135 68457 82804 78956 62054 37687
13821C7687k5274J3780K5421j5661j8683l0027L8050J6302j8047k7132J1270K2926
$$ 37687 12413 26193 51614 35953 17270 -12757 25293 41595 23548 -3584 7686 30612
13809C0612q792j8028J3906K9609m855k2969J4590K3960k3212l9594K2773M0476
$$ 30612 21820 3792 17698 47307 42452 19483 34073 58033 34821 -4773 18000 58476
13797E8476K0645J5761m1920l4067Q628K1961J4721J4906j589j0167l1553l3298
$$ 58476 79121 94882 52962 18895 27523 49484 64205 79111 77522 67355 35802 2504
13785B504J4075K3905m47K6706K4507l2805k0068M864N9697j62p609j0679m3304
$$ 2504 16579 40484 40037 66743 91250 58445 38377 43241 102938 102776 95167 84488 41184
13772D1184r385L246m0764O545L503j9469o587J2844N8448r962q231l1932j8084
$$ 41184 31799 35045 -5719 826 4329 -15140 -21727 -8883 49565 39603 31372 -560 -18644
13759a8644K6472N2396N1517n260j9005N1534L0514J3698N1979R8472J67118K77048
$$ -18644 7828 60224 111741 106481 87476 139010 169524 183222 235201 333673 500791 777839
13747G77839M41515N45903L55588k04300n07697m49788l12489j90422j33727j05251
$$ 777839 1219354 1765257 2120845 1916545 1408848 959060 646571 456149 322422 217171
13737B17171k5734k5262k9347k6762r820q567j1498j0353l1742l6290j6655O6287
$$ 217171 191437 166175 136828 110066 100246 91679 80181 69828 38086 1796 -14859 51428
13725E1428N6915n0136j7458k3354k1740Q850L6078k4090j0946J7108M5041j9064
$$ 51428 108343 58207 40749 17395 -4345 4505 40583 16493 5547 22655 67696 48632
13713D8632j8418q284J446K0783L1542J1501j1445k5191l706k8895k0764j465
$$ 48632 30214 21930 23376 44159 75701 87202 75757 50566 46860 17965 -2799 -4264
13701d264r535N855l1177k144q71J3194J8172K6241n980j5144L8341j5095n883
$$ -4264 -13799 -7944 -39121 -41265 -42136 -28942 -10770 15471 9491 -5653 32688 17593 11710
13688A1710M7507p509k3777L3078M4322n077k6453k908K1087j1278n2287q880
$$ 11710 59217 51708 27931 61009 105331 100254 73801 70893 91980 80702 28415 19535
13676A9535K4901J077M0650J4540n1704R344J3823l746J5883N815k5073n775P474
$$ 19535 44436 45513 86163 100703 48999 58343 72166 68420 84303 90118 65045 59270 66744
13663F6744p493j3417r117l514k3303k5859k8958M1811K04J5667o718j225J2640
$$ 66744 59251 45834 36717 33203 9900 -15959 -44917 -3106 -2902 12765 6047 4822 17462
13650A7462Q265p033j487m1657J9220M7179k3145M283M0628o385N864K4542n368
$$ 17462 25727 18694 17207 -24450 -5230 41949 18804 23087 63715 57330 63194 87736 82368
13637H2368n0361l743j706K0820k3738O123K9033K2052j8420l3134J4842j4779
$$ 82368 32007 28264 26558 47378 23640 29763 58796 80848 62428 29294 44136 29357
13625B9357k35J9626J2612j2769R249j8289l6144M224j9111J8601l2252J9485
$$ 29357 29122 48748 61360 48591 57840 39551 3407 7631 -11480 7121 -25131 -5646
13613e646L6868J836j6371l511j3514p858l650q413j0055J4289j0623N7650N4608
$$ -5646 31222 33058 16687 13176 -338 -8196 -11846 -20259 -30314 -16025 -26648 31002 85610
13600H5610L716m0445j2229j8413p746m8146J1473L8626L0651k2011l480o122
$$ 85610 89326 48881 36652 18239 10493 -37653 -26180 12446 43097 21086 17606 11484
13588A1484l429n025J9758o141m174l7061j5033m6945k4317K7072M8475N1257
$$ 11484 8055 3030 22788 16647 12473 -24588 -39621 -86566 -110883 -83811 -35336 15921
13576A5921K8881k532l8741n1252m998N696L8977n498M4533J3928p892J7219Q197
$$ 15921 44802 42270 3529 -47723 -52721 -47025 -8048 -13546 30987 44915 37023 54242 62439
13563F2439m0076P866Q2319K5643l9940o8069m1009M3030N4594J128j9533k1090
$$ 62439 22363 30229 112548 138191 98251 30182 -10827 32203 86797 87925 68392 47302
13551D7302J4869k4719l4697j0095K2143j3193L625K0069k2844J2414M3412N2662
$$ 47302 62171 37452 2755 -7340 14803 1610 5235 25304 2460 14874 58286 110948
13539A10948K1091m5643m4466l431M0790J7112P869k2788k3445l3761m927r110
$$ 110948 132039 86396 41930 38499 79289 96401 104270 81482 58037 24276 19349 10239
13527A0239J3529J8512j2142p166k5773l706J8361j0187j852J7711K2432P812
$$ 10239 23768 42280 30138 22972 -2801 -6507 11854 1667 -185 17526 39958 47770
13515D7770l1676L24j2864J5339M0300N794j8625l2855Q45m148J0147j2318k5550
$$ 47770 16094 16418 3554 18893 59193 64987 46362 13507 14352 10204 20351 8033 -17517
13502a7517m35l4486P379L7231M9147Q681m8839j2076L6883J6609J2414O937p782
$$ -17517 -17952 -52438 -45059 -7828 41319 50000 1161 -10915 25968 42577 54991 61928 54146
13489E4146M615j579k6032l0201Q474n519R883K5042Q495j7843N400o959j3838
$$ 54146 58761 57182 31150 949 9423 3904 13787 38829 47324 29481 34881 27922 14084
13476A4084j5308o048L583L985M477J094m8128l1217O387n094M2558J9009l1097
$$ 14084 -1224 -7272 -3689 296 4773 5867 -42261 -73478 -67091 -72185 -29627 -10618 -41715
13463d1715j9360R384J6757L4755J0115J1857l6338k800Q4324M7360n0890j769
$$ -41715 -61075 -51691 -34934 -179 9936 21793 -14545 -17345 66979 114339 63449 61680
13451F1680K9927K339k2185j3240n2222l2290l5271k8509K2245M1301R904l2157
$$ 61680 91607 93946 71761 58521 6299 -25991 -61262 -89771 -67526 -26225 -16321 -48478
13439d8478l4998K2899J3195J6213J504k8522J4412O4543M5168Q274l4742Q423
$$ -48478 -83476 -60577 -47382 -31169 -29665 -58187 -43775 20768 65936 74210 39468 47891
13427D7891j7092j5413l4753k3909L2080l065J5339O280Q608J5091J0077O436
$$ 47891 30799 15386 -19367 -43276 -11196 -14261 1078 7358 15966 31057 41134 47570
13415D7570j869q407Q404q846L227p98j4387k0025K4413N133j3608k0283J2308
$$ 47570 45701 37294 45698 36852 40079 39281 24894 4869 29282 34415 20807 524 12832
13402A2832p719P490K9086L6457N482l4145j9231l5387k5961j0342O608l3814
$$ 12832 5113 12603 41689 78146 83628 49483 30252 -5135 -31096 -41438 -34830 -68644
13390f8644m0854L1469L7423L2771M914K9202J1681r570L177l0563J7454m676
$$ -68644 -109498 -78029 -40606 -7835 -2921 26281 37962 28392 31569 1006 18460 13784
13378A3784k2327R081L7425k1037j1383K5033j9171k8650J2781J8749P222k1784
$$ 13784 -8543 538 37963 16926 5543 30576 11405 -17245 -4464 14285 21507 -277
13366b77p035K9615N1438M1763N457n1770p7204l7224J3449M7802m272J5639L9161
$$ -277 -7312 22303 73741 115504 120961 69191 -8013 -45237 -31788 16014 11742 27381 66542
13353F6542q898k136j982m1898j4336M1104R947k399J4300k535J8854k6837j5913
$$ 66542 57644 55508 53526 11628 -2708 38396 48343 45944 60244 57709 76563 49726 33813
13340C3813l190J1242J6705N988k2021m0271k6424M9978K346m2265p10k1603J3380
$$ 33813 30623 41865 58570 64558 42537 2266 -24158 25820 28166 -14099 -14809 -36412 -23032
13327b3032L7282j2590k2742j9989j3756p759M9324J1110K213j2j0652m474m925
$$ -23032 14250 1660 -21082 -41071 -54827 -62586 -13262 -2152 61 49 -10603 -15077 -20002
13314b0002Q634K0475k2765l5220m4393j4757J9293M8631K0509K2813M155k0881
$$ -20002 -11368 9107 -13658 -48878 -93271 -108028 -88735 -40104 -19595 3218 7373 -13508
13302a3508J148J1894j028K742m997k4995K0165P2627Q302k24l3084l406M8855
$$ -13508 -12360 -466 -1494 1248 -3749 -28744 -8579 64048 72350 72126 39042 35636 84491
13289H4491n156k8554k403m1378k1318k2507M2922M994L5013k3754J4245J5325
$$ 84491 79335 50781 48378 7000 -14318 -36825 6097 11091 46104 22350 36595 51920
13277E1920k0565l4673n480j4778K6929J8216p1098o669J6260j1921L9885J0352
$$ 51920 31355 -3318 -8798 -23576 3353 21569 -49529 -56198 -39938 -51859 -11974 -1622
13265a622k743L627K0540J4464k0160j3407K9209J3311j5324m2421J2273j9569
$$ -1622 -4365 -738 19802 34266 14106 699 29908 43219 27895 -14526 -2253 -21822
13253b1822K9423L6908l415k9841m8992j228j1016K8745J1817K1870Q347M677
$$ -21822 7601 44509 41094 11253 -37739 -38967 -49983 -21238 -9421 12449 20796 25473
13241B5473K3351j8956j9641q131N58M3752k377k8615j431j9768L3894J5886k9785
$$ 25473 48824 29868 10227 2096 2654 46406 44029 15414 13983 -5785 28109 43995 14210
13228A4210q359L4281L2441n8346l4298K500K3440N161k560k246k8784K5754O8245
$$ 14210 5851 40132 72573 14227 -20071 -17571 5869 11030 8470 6224 -22560 3194 71439
13215G1439O60o977q521K45j8184j7721l7245j2093L7685N2288J1565j3424j8767
$$ 71439 72099 65122 56601 56846 38662 20941 -16304 -28397 9288 61576 73141 59717 40950
13202D0950m1537k1238L2229L6437o938j2618n2357q127K6052N5932Q028R938
$$ 40950 -587 -21825 10404 46841 39903 27285 -25072 -33199 -7147 48785 56813 66751
13190F6751j6827k6136O82J8293m3888k7453K7346R637j0572J6205m1247n4656
$$ 66751 49924 23788 24470 42763 -1125 -28578 -1232 8405 -2167 14038 -27209 -81865
13178h1865l911J7846J7514M4185O5477L2951m2205l2028N158m114K0073M2941
$$ -81865 -85776 -67930 -50416 -6231 59246 92197 49992 17964 23122 19008 39081 82022
13166H2022k7999j4109j4697j2337k0209J2910J8964l1882k716m427j816J0280
$$ 82022 54023 39914 25217 12880 -7329 5581 24545 -7337 -10053 -14480 -16296 -6016
13154f016K5121L4211n778j6468m5575Mm331l114N225m924J1915Q663p970k2940
$$ -6016 19105 53316 47538 31070 -14505 -14501 -18832 -21946 -16721 -21645 -9730 -1067 -9037 -31977
13140c1977N102J0141M4709m5617j7497L9273K9832K056o1630o739K0091J3745
$$ -31977 -26875 -16734 27975 -17642 -35139 4134 33966 36022 -25608 -32347 -12256 1489
13128A489k2664k8472N4250L9928K0724l183j5225l3676J2023N6189J4836j5832
$$ 1489 -21175 -49647 4603 44531 65255 62072 46847 13171 25194 81383 96219 80387
13116H0387l8199O147l5271j6012K7985k5946l0412J9247j4907J5601K8221J1906
$$ 80387 42188 48335 13064 -2948 25037 -909 -31321 -12074 -26981 -11380 16841 28747
13104B8747N76k913l2557K834Q832j191N566P334N722m3348m7324L5478P6848
$$ 28747 29323 26410 -6147 -3313 5519 4328 9894 17228 22950 -20398 -67722 -32244 44604
13091D4604j9478m047o618K3449k1536K7505j3073j6232Q486Q680j3132L6181
$$ 44604 25126 21079 14461 37910 16374 43879 30806 14574 23060 31740 18608 54789
13079E4789k1297m6774j6478L147J2166j4047j6233J2879m683L3647k371Q788
$$ 54789 33492 -13282 -29760 -26613 -14447 -28494 -44727 -31848 -36531 -2884 -5255 3533
13067C533j2021L4819J5500L137k2598o80l3316l1662O173L1766L1024Q669J8387
$$ 3533 -8488 26331 41831 44968 22370 21690 -11626 -43288 -37115 -5349 25675 34344 52731
13054E2731M548q141j1874K028J8785k7299n5202l0858j8848M0069J7423q545
$$ 52731 57279 49138 37264 39292 58077 30778 -24424 -55282 -74130 -34061 -16638 -25183
13042b5183l270J2512K5565m600l945q118k7516q643J9287Q002N1863l3335l8730
$$ -25183 -28453 -15941 9624 5024 1079 -7039 -34555 -43198 -23911 -15909 35954 2619 -36111
13029c6111n553J4316K327K0191L450k1949j9463L4459J8667j202K063J6005K6693
$$ -36111 -41664 -27348 -25021 -4830 -1380 -23329 -42792 -8333 10334 9132 11195 27200 53893
13016E3893K7208l8746l3727j4515J0572j0911n6590M9540L8922J6210o343j2772
$$ 53893 81101 42355 8628 -5887 4685 -6226 -62816 -13276 25646 41856 35513 22741
13004B2741L358j944K7225K7564J4441P227l6034j8426K6991l521j1277N622J1549
$$ 22741 26099 24155 51380 78944 93385 100612 64578 46152 73143 69622 58345 63967 75516
12991G5516k1803k6415n1176j3344k3776n453k8023k9044j5004K0541M1976O4687
$$ 75516 53713 27298 -23878 -37222 -60998 -66451 -94474 -123518 -138522 -117981 -76005 -11318
12979a1318K9783k542j7947j0694l363N5309J3996l9375N261k6199K4400j2309
$$ -11318 18465 15923 -2024 -12718 -16081 39228 53224 13849 19110 -7089 17311 5002
12967E002J0865J6161J1886J8053l5320p327k0388L0250j7753j2807J9435J595
$$ 5002 15867 32028 43914 61967 26647 19320 -1068 29182 11429 -1378 18057 19652
12955A9652K4757n235n7178o174O7771j2749m7842Q161J5743M207k036J9640l1672
$$ 19652 44409 39174 -18004 -24178 43593 30844 -16998 -8837 6906 11113 9077 28717 -2955
12942b955j0799j4024l308J5828O629k2586K647N1948L7027k3245P239o418n1457
$$ -2955 -13754 -27778 -31086 -15258 -8629 -31215 -28568 23380 60407 37162 44401 37983 -13474
12929a3474j3738K4542N2002N6044l4628k1459o66k7205m29J6866J5885k3102
$$ -13474 -27212 -2670 49332 105376 70748 49289 48623 21418 20989 37855 53740 30638
12917C0638m3820K457l8358O388m888Q027j5839P0330k0235m5325R197l3707m636
$$ 30638 -13182 -10725 -49083 -42695 -47583 -39556 -55395 14935 -5300 -50625 -41428 -75135 -79771
12904g9771K7859L6066R710l5800k6557k75J203M3353L4542n913q487M7711K4968
$$ -79771 -51912 -15846 -6136 -41936 -68493 -68768 -67565 -24212 10330 4417 -4070 43641 68609
12891F8609J7114m698l4162n5342k6814L2625p016J0587j1367O942K9688M3939
$$ 68609 85723 81025 46863 -8479 -35293 -2668 -9684 903 -10464 -3522 26166 70105
12879G0105l5342m7739j3358K6594Q748K47J0477O130n7939M2060M9582k1330
$$ 70105 34763 -12976 -26334 260 9008 9255 19732 25862 -32077 9983 59565 38235
12867C8235j6338K38J0861j4513J0758P027m3238k0649N2882K2574j5426J1660
$$ 38235 21897 22135 32996 18483 29241 36268 -6970 -27619 25263 47837 32411 44071
12855D4071j1418J5112O574J4065k816J2864j1374j2470J9512p285N5819j3880
$$ 44071 32653 47765 54339 68404 65588 78452 67078 54608 74120 66835 122654 108774
12843A08774m2908l0976J9996o221j8199o800J2108j9900m0151k711K3880O45
$$ 108774 65866 34890 54886 48665 30466 23666 35774 15874 -24277 -26988 -3108 -2463
12831b463n3243l1902L2983K0353j3847K2590M4148O674N927j462K0444j9866
$$ -2463 -55706 -87608 -54625 -34272 -48119 -25529 18619 25293 31220 29758 50202 30336
12819C0336m0792J9115J5784M6555N26l5913Q95j9159m8118k5730J0064K6141
$$ 30336 -10456 8659 24443 70998 71524 35611 36506 17347 -30771 -56501 -46437 -20296
12807b0296N239J0241K2023o808K48k0706j3761l948J3242o247o501j1759q623
$$ -20296 -15057 -4816 17207 10399 10647 -10059 -23820 -27768 -14526 -20773 -27274 -39033 -47656
12794d7656N1740N1590N558j7244o17K0210j4416m7949l0016l75K4988o684P361
$$ -47656 4084 55674 61232 43988 43371 63581 49165 1216 -28800 -29175 -4187 -10871 -3510
12781c510J0414j9059j4556J6780J4701J8648j253Q360L124K039j6877m2198o765
$$ -3510 6904 -12155 -26711 -9931 4770 23418 22165 30525 33649 35688 18811 -23387 -30152
12768c0152k470K8665J1728k7706J8335J0958l3149j2812j6123N797O9991j3344
$$ -30152 -32622 -3957 7771 -19935 -1600 9358 -23791 -36603 -52726 -46929 23062 9718
12756I718o559K5422L7168m1396l3445J0601J6131q815l5329k8613K8334N1495
$$ 9718 3159 28581 65749 24353 -9092 1509 17640 8825 -26504 -55117 -26783 24712
12744B4712k5235k9527k3117J4049J711p891j4305K575K2122k4308L0523M7228
$$ 24712 -523 -30050 -53167 -39118 -37407 -45298 -59603 -57028 -34906 -59214 -28691 18537
12732A8537J2283J36J2203K9236j6281j7507j3002L8525k4358n5615K2314N7385
$$ 18537 30820 30956 43159 72395 56114 38607 25605 64130 39772 -15843 6471 63856
12720F3856J0035m1653m0819J8751l5343j4823N641n651L8856M2207R249n6507
$$ 63856 73891 32238 -8581 10170 -25173 -39996 -34355 -40006 -1150 41057 50306 -6201
12708f201n8431L3492Q887L588K8113q674J494M6250J7963m3969k1874J0908N9800
$$ -6201 -64632 -31140 -22253 -18665 9448 774 2268 48518 66481 22512 638 11546 71346
12695G1346j6394m1654j5166K8752K7031p989k4478q297r148K9729J7126j0312
$$ 71346 54952 13298 -1868 26884 53915 45926 21448 13151 4003 33732 50858 40546
12683D0546j8383o4858m3O35M5631J2359l331K3127k2899o6392J3384L9858j8861
$$ 40546 22163 -42695 -42738 -42103 3528 15887 12556 35683 12784 -53608 -40224 -366 -19227
12670a9227j3481l3873j252j5588N615K3300M7412K8398k2825L144j4908L0056
$$ -19227 -32708 -66581 -67833 -83421 -77806 -54506 -7094 21304 -1521 1623 -13285 16771
12658A6771J5016K8700M0206j2927j9824j8876j8420J1130j1123j8014m338m236
$$ 16771 31787 60487 100693 87766 67942 49066 30646 41776 30653 12639 8301 4065
12646D065L8224L9293M4927k8539n5429k5039l518l6904O040K7530K9050L6209
$$ 4065 42289 81582 126509 97970 42541 17502 13984 -22920 -16880 10650 39700 75909
12634G5909m3380o2183K8823R443J2918K6591q544k3209L2222l6806n9275J1606
$$ 75909 32529 -29654 -831 8612 21530 48121 39577 16368 48590 11784 -47491 -35885
12622c5885M5078m781J6529J7689r974J4315m26J7750l0140n1530o810J6524J6073
$$ -35885 9193 4412 20941 38630 28656 42971 42545 60295 30155 -21375 -28185 -11661 4412
12609D412j8360J8699K5300m5180j4747J8335q593P386K1561q858l831j987l3905
$$ 4412 -13948 4751 30051 -15129 -29876 -11541 -20134 -12748 8813 -45 -3876 -5863 -39768
12596c9768k672L513j3344J7915J8791j9555J3149l7546P493L1528l5065N467
$$ -39768 -42440 -38927 -52271 -34356 -15565 -35120 -21971 -59517 -52024 -20496 -55561 -50094
12584e0094J0234K0943P39J4275J8900K7697R586k6884j8501j4789J5321j1937
$$ -50094 -39860 -18917 -18178 -3903 14997 42694 52280 25396 6895 -7894 7427 -4510
12572d510n870N823J1243p543k6535K2472Q732k0130L8093P2950m2905l887j2792
$$ -4510 -10380 -4557 6686 -857 -27392 -4920 3812 -16318 21775 94725 51820 47933 35141
12559C5141n8347M195J200J386K943K158J1698j9378J3922r531l6k841j4484j2647
$$ 35141 -23206 -19011 -17811 -16425 -13482 -11324 374 -19004 -5082 -14613 -14649 -17490 -31974 -44621
12545d4621L8594K5725m938j9514q241J4283L8544k2099j2322q002P29J9059j6775
$$ -44621 -6027 19698 14760 -4754 -12995 1288 39832 17733 5411 -2591 -1862 17197 422
12532D22k6217K3953J7464k5395q762k9498j5846k301L3061J6086j903n2161j8095
$$ 422 -25795 -1842 15622 -9773 -18535 -48033 -63879 -66180 -33119 -17033 -18936 -71097 -89192
12519h9192L4675K6829n830m164J2475n6139j4204K2611p110J4702J0872Q594
$$ -89192 -54517 -27688 -33518 -37682 -25207 -81346 -95550 -72939 -80049 -65347 -54475 -45881
12507d5881K9826K6860O169k1142j3000M0742j5505k0677K643J7298M374K3371
$$ -45881 -16055 10805 16974 -4168 -17168 23574 8069 -12608 -9965 7333 11707 35078
12495C5078n352K599o355J1530j9447j0428l054k9696O4017J3512l7792k9045
$$ 35078 29726 32325 25970 37500 18053 7625 4571 -25125 38892 52404 14612 -14433
12483a4433L1773M6476J055o524p6636m2919R519K856k0073l858M9770K3719J383
$$ -14433 17340 63816 64871 58347 -18289 -61208 -51689 -48833 -68906 -72764 -22994 725 2108
12470B108L5685M0M3570K7523m4753m6625j3152j4919J4500K3815M346j3954p637
$$ 2108 37793 37833 81403 108926 64173 17548 4396 -10523 3977 27792 32138 18184 10547
12457A0547q095k9833L5905Q639n9491o343R146J6082K4066Q190m3430K185L7729
$$ 10547 2452 -27381 8524 17163 -42328 -48671 -39525 -23443 623 8813 -34617 -32432 5297
12444E297o815J958N102k4474j151n161K0333n2189l7112J6324j0678K313j3822
$$ 5297 -1518 440 5542 -18932 -20083 -25244 -4911 -57100 -94212 -77888 -88566 -86253 -100075
12431a00075N4128k0324K0785M3361k9682J3831j5226K070j8933J3564M4970K8475
$$ -100075 -45947 -66271 -45486 -2125 -31807 -17976 -33202 -31132 -50065 -36501 8469 36944
12419C6944J5096K4346J779l378J7066m7042l9585J3035K1809r840l9740l9374
$$ 36944 52040 76386 78165 74787 91853 44811 5226 18261 40070 30230 -9510 -48884
12407d8884o640K3179L0073j1830l9968J8294k4339K5519M3103J5069O747j0152
$$ -48884 -55524 -32345 -2272 -14102 -54070 -35776 -60115 -34596 8507 23576 30323 20171
12395B0171l0483n067J1133K2245N007j0994k0582k701L859J7003m035l5485L187
$$ 20171 -10312 -15379 -4246 17999 23006 12012 -8570 -11271 -7412 9591 5556 -29929 -26742
12382b6742J5579K6294j943j9647p272l715Q073L6914J4961k655k9968K4870J8259
$$ -26742 -11163 15131 13188 -6459 -13731 -17446 -9373 27541 42502 39847 9879 34749 53008
12369E3008k2478K3576K7065j7863q917k4572l8789j7932J1530q831N2945j283
$$ 53008 30530 54106 81171 63308 54391 29819 -8970 -26902 -15372 -24203 28742 27459
12357B7459o1717o0503R72O852K5824r189K5194K3376j3783o772K9398L0739k3702
$$ 27459 -34258 -94761 -93789 -86937 -61113 -70302 -45108 -21732 -35515 -42287 -12889 17850 -5852
12344e852j6141J0356L232p355l669Q115l1748k24k8582L931j4899j2893k2303
$$ -5852 -21993 -11637 -8405 -15760 -19429 -11314 -43062 -43286 -71868 -67937 -82836 -95729 -118032
12331a18032j1365L7104L0494M6760K6554j7360M4576R642k923k0524l4486p6688
$$ -118032 -129397 -92293 -61799 -15039 11515 -5845 38731 48373 45450 24926 -9560 -86248
12319h6248R317J3403l6201K1441K9294K8661k4729j6200M0723J655K3272l3799
$$ -86248 -76931 -63528 -99729 -78288 -48994 -20333 -45062 -61262 -20539 -18884 4388 -29411
12307b9411k8555K0687N6378K1458l0709o1037l6821k3405O19J9407K7007P831
$$ -29411 -57966 -37279 19099 40557 9848 -51189 -88010 -111415 -110796 -91389 -64382 -56551
12295e6551R051M2953j2165L580P674L9150M4959O692l5464j8533j0575j9232
$$ -56551 -47500 -4547 -16712 -13132 -5458 33692 78651 85343 49879 31346 20771 1539
12283A539R494l9701k2236k7930O0724M4197M6732p313m9234k4259J7579L5256
$$ 1539 11033 -28668 -50904 -78834 -18110 26087 72819 65506 16272 -7987 9592 44848
12271D4848k4411k5786L4620L646k038q650l498J2892k7819J4580L0927K816k6510
$$ 44848 20437 -5349 29271 32917 30879 22229 18731 31623 3804 18384 49311 52127 25617
12258B5617j4134k6604J2653L745R789K5804M367M643m8311K453r552k467m2850
$$ 25617 11483 -15121 -2468 1277 11066 36870 41237 45880 -2431 22 -9530 -11997 -54847
12245e4847L038L3317J3045K7703K2643n5M0994k132M5406l366n6386m4951j149
$$ -54847 -51809 -18492 -5447 22256 44899 44844 85838 83706 129112 125746 69360 24409 23260
12232B3260J9458k2364j9091Q384k3202n3534j5380L9545J5990k0833q140r678
$$ 23260 42718 20354 1263 9647 -13555 -67089 -82469 -42924 -26934 -47767 -55907 -65585
12220f5585L6929J8818N726r243m5048q803L217M3714J9020j0369N14m397j269
$$ -65585 -28656 -9838 -4112 -13355 -58403 -67206 -63989 -20275 -1255 -11624 -11110 -15507 -16776
12207a6776J5032K3853r873j914m5067J4076o90n169r897J1838n917Q812j8481
$$ -16776 -1744 22109 12236 10322 -34745 -20669 -21359 -26528 -36425 -24587 -30504 -21692 -40173
12194d0173K1416O537j8530m366L2838K6199K7290K175l1350n5483m4383K144
$$ -40173 -18757 -12220 -30750 -35116 -2278 23921 51211 53386 22036 -33447 -77830 -75686
12182g5686L8920Q280m992K4109K5361N816p150L8506L4563j6719r787J5748J7255
$$ -75686 -36766 -28486 -33478 -9369 15992 21808 14658 53164 87727 71008 61221 76969 94224
12169I4224l8019M974L4510L9552l0292l5672O614j1420l2459n7441k5152N291
$$ 94224 56205 61179 95689 135241 104949 69277 75891 64471 32012 -25429 -50581 -45290
12157d5290L403L0114K2175M3932J6298J5797J2179m0849k4648l0416r470Q754
$$ -45290 -41887 -11773 10402 54334 70632 86429 98608 57759 33111 2695 -6775 1979
12145A979k7279J8311j5327j6969p44R223O3342L9318m1859l0694l5108k7609
$$ 1979 -25300 -6989 -22316 -39285 -40029 -30806 32536 71854 29995 -699 -35807 -63416
12133f3416L1118L8000l923l3362N7751K4180m4395M42J6401j9349j6714K1875
$$ -63416 -32298 5702 1779 -31583 26168 50348 5953 6395 22796 3447 -13267 8608
12121H608k7451j9947P785j4233k432j7884k3175O6399L768j4740J6798K2570
$$ 8608 -18843 -38790 -31005 -45238 -47670 -65554 -88729 -22330 -18562 -33302 -16504 6066
12109F066M546J8739j338l0401K2678L018j4709j9790m533l1166k2701K3805K0797
$$ 6066 10612 29351 28013 -2388 20290 23308 8599 -11191 -15724 -46890 -69591 -45786 -24989
12096b4989J0926L637n4510j518J9584J5023J3084q208l392K8173O845k0128q937
$$ -24989 -14063 -10426 -64936 -66454 -46870 -31847 -18763 -26971 -30363 -2190 4655 -15473 -24410
12083b4410M814K1851J5934k566l0507J0378O6251J6794L7790l8025m2061l0586
$$ -24410 -19596 2255 18189 15623 -14884 -4506 61745 78539 116329 78304 36243 5657
12071E657j7550k1552j5421Q561K4930O251Q736l010N9968Q068k5317k8595K954
$$ 5657 -11893 -33445 -48866 -40305 -15375 -9124 -388 -3398 56570 64638 39321 10726 13680
12058A3680K2798j439J9100P766k2670j3539l9828r421K9764l275k3759j368J9004
$$ 13680 36478 35039 54139 61905 39235 25696 -14132 -23553 6211 2936 -20823 -22191 -3187
12045c187N140j4853O258K1069J8255J0843j6937m2033j731Q555n663N862J240
$$ -3187 1953 -12900 -6642 14427 32682 43525 26588 -15445 -17176 -8621 -14284 -8422 -7182
12032g182L6629M1784K0731m8802m188J0725l5115m3359K7947l013O165O509m3532
$$ -7182 29447 71231 91962 43160 38972 49697 14582 -28777 -830 -3843 2322 8831 -34701
12019c4701L7409K7759n042m926J5511k2194m592j8774L9431J3843q23q587l0940
$$ -34701 2708 30467 25425 20499 36010 13816 9224 -9550 29881 43724 42901 34314 3374
12006C374j5070M823k6009J6105K2853M810l0422M7148M2386J445j6039q223p68
$$ 3374 -11696 -6873 -32882 -16777 6076 10886 -19536 27612 69998 71443 55404 47181 46413
11993D6413l851J9432L5355k3657l8675k6015R667j4929L4604L9712n7382l5498
$$ 46413 42562 61994 97349 73692 35017 9002 18669 3740 38344 78056 20674 -14824
11981a4824k1291j6430l4970M216K3285R338O765K9757k164m597M0259j1068m3702
$$ -14824 -36115 -52545 -87515 -83299 -60014 -50676 -43911 -14154 -16318 -20915 19344 8276 -35426
11968c5426J3570M55j3685j6360L5667l0440l0769L4988J0435M246K3606Q37p2132
$$ -35426 -21856 -21401 -35086 -51446 -15779 -46219 -76988 -42000 -31565 -27319 -3713 -2876 -75008
11955g5008L1442O0724L744l8867K0683J1100J3455J4645J6513j2667J2894M2794
$$ -75008 -43566 17158 20902 -17965 2718 13818 27273 41918 58431 45764 58658 101452
11943A01452j7523n645k5421p3103p3295L3363M0337j1241J8745M798l0138K0629
$$ 101452 83929 78284 52863 -20240 -93535 -60172 -19835 -31076 -12331 -7533 -37671 -17042
11931a7042K7765j4090O230J8097j1356j5549l0163L5809O2368m2347m8061J8960
$$ -17042 10723 -3367 2863 20960 9604 -5945 -36108 -299 62069 19722 -28339 -9379
11919i379M2665J2720k3467m8011k0608N8823M3166L771j9897J2724j4744o41
$$ -9379 33286 46006 22539 -25472 -46080 12743 55909 59680 39783 52507 37763 37122
11907C7122m2078J5566L5821K7761p133n5359m3890J1897M080L84o387N391j2354
$$ 37122 -4956 10610 46431 74192 67059 11700 -32190 -20293 -16213 -15829 -22216 -16825 -29179
11894b9179K1229J9538J7827K559k1282J1198l2970j7681J961k0077j0306K747
$$ -29179 -7950 11588 29415 31974 10692 21890 -11080 -28761 -26800 -46877 -57183 -54436
11882e4436K6161L673l308N331k0155L0669L580o879J3470J1203k5857J0748o362
$$ -54436 -28275 -24602 -27910 -22579 -42734 -12065 -8485 -15364 -1894 9309 -16548 -5800 -12162
11869a2162j4406N448J7329R534J1136l9355K2078l0018J766L0704J2346L1718
$$ -12162 -26568 -21120 -3791 5743 16879 -22476 -398 -30416 -28650 2054 14400 46118
11857D6118m5806l7908L1691J9087K5445L468k1566m2334K1036M0441k0790k9772
$$ 46118 312 -37596 -5905 13182 38627 42095 20529 -21805 -769 39672 18882 -10890
11845a0890j4730J1395L5344n2510m7250K0027K5776j2954m649j1004J6416Q2307
$$ -10890 -25620 -14225 21119 -31391 -78641 -58614 -32838 -45792 -50441 -61445 -45029 37278
11833C7278L0990m3301k3712p91l3677J1493Q425l986o958l4539J0063l1370j5876
$$ 37278 68268 24967 1255 464 -33213 -21720 -13295 -17281 -24239 -58778 -48715 -80085 -95961
11820i5961K0486J6345N1515J1757K2488L2234L9251j011l2758j9766m2088l473
$$ -95961 -75475 -59130 -7615 4142 26630 58864 98115 97104 64346 44580 2492 -981
11808i81M563P8934L6921o8643k4905o285l7966j3079K0200K757K252k7314J0871
$$ -981 3582 82516 119437 50794 25889 19604 -18362 -31441 -11241 -8484 -6232 -33546 -22675
11795b2675j2506o452K6177J7631L883Q23n72R073O473l0725m4453l2822M9592
$$ -22675 -35181 -41633 -15456 2175 6058 6881 6309 15382 21855 -8870 -53323 -86145 -36553
11782c6553N2084K0853j3788m2485K0391K2588j3091k30k131L0519j8210J419
$$ -36553 15531 36384 22596 -19889 502 23090 9999 9769 7638 38157 19947 21366
11770B1366l9094m2604N667j3490k3087j1940M3841P21M6821N6658J5531l3801
$$ 21366 -17728 -60332 -54665 -68155 -91242 -103182 -59341 -58620 -11799 44859 60390 26589
11758B6589n2004j5305j6742m8694l3287N3047O6067M9088P243k7124M168k0275
$$ 26589 -25415 -40720 -57462 -106156 -139443 -86396 -20329 28759 36002 8878 13046 -7229
11746g229j6612R185L5308j4102j1372Q597j8197l745p015K056K728Q911N5164
$$ -7229 -23841 -14656 20652 6550 -4822 3775 -14422 -18167 -25182 -23126 -20398 -11487 43677
11733D3677J0022J605K6768k7627r9510k5196J7239J7160K8060R982n04l3481
$$ 43677 53699 55304 82072 54445 -45065 -70261 -53022 -35862 -7802 2180 1676 -31805
11721c1805J1467j1349j7585k1066Q243P60L787j6483J8764J8329R909J6591m210
$$ -31805 -20338 -31687 -49272 -70338 -62095 -61335 -57548 -74031 -55267 -36938 -27029 -10438 -14648
11708a4648L76m793K0658q775n0735k0975L4665M9838J1104l7534m3897j6003
$$ -14648 -14272 -19065 1593 -7182 -57917 -78892 -44227 5611 16715 -20819 -64716 -80719
11696h0719J3322J3262K888j0805K3284j6055K4552M1907J172J4152k0542j1903
$$ -80719 -67397 -54135 -51247 -62052 -38768 -54823 -30271 11636 12808 26960 6418 -5485
11684e485j6051j113L8681l0458l253N688K8717K1764K2699q231l4849k3751L7672
$$ -5485 -21536 -22649 16032 -14426 -17679 -11991 16726 38490 61189 52958 18109 -5642 32030
11671C2030L0385l2252k6024j2692M855J9728K9352P760l8652k1569K0421P171
$$ 32030 62415 30163 4139 -8553 -3698 16030 45382 53142 14490 -7079 13342 20513
11659B0513l7445R30k889j4630K6488L3788J9919J8384j2412l3563k4254K2029
$$ 20513 -16932 -16002 -18891 -33521 -7033 26755 46674 65058 52646 19083 -5171 16858
11647A6858j2242n635N640K178n4902k3833j532k609L9165R827K679k502j9010
$$ 16858 4616 -1019 4621 6799 -48103 -71936 -73468 -76077 -36912 -27085 -24406 -26908 -45918
11634d5918J021M2119r441N716J7216l7866j4766K2123J3030O248N720Q762l349
$$ -45918 -44897 -2778 -12219 -6503 10713 -27153 -41919 -19796 -6766 -518 5202 13964 10615
11621A0615k0190J4285j7715l0046K9529m83l5790L5783J6294R141J4916L1040
$$ 10615 -9575 4710 -13005 -43051 -13522 -14005 -49795 -14012 2282 11423 26339 57379
11609E7379r194j3355j1727M8623l2769r284l6274m9810J8771L3297L516j7895
$$ 57379 48185 34830 23103 71726 38957 29673 -6601 -56411 -37640 -4343 -827 -18722
11597a8722K405o66n906l7082L0322M0937j0253l7282j0930M3433L7918J0257
$$ -18722 -16317 -16983 -22889 -59971 -29649 11288 1035 -36247 -47177 -3744 34174 44431
11585D4431q397k3626l5158k9176J8572L473j2739j239L6291j1198n83L9747L5567
$$ 44431 36034 12408 -22750 -51926 -33354 -29881 -42620 -43859 -7568 -18766 -19349 20398 55965
11572E5965Q138o6401m4177L3728M7568k470k2099l863O7728L5903M3251P054
$$ 55965 64103 -2298 -46475 -12747 34821 32351 10252 6389 74117 110020 153271 160325
11560A60325l7451k9944o6654l6192L8823l678m8036m776L1681J4811Q922j0581
$$ 160325 122874 92930 26276 -9916 28907 25229 -22807 -27583 4098 18909 27831 17250
11548A7250J5995J6021j6522q2789l6871J0067K8897J7820N688l0098L5712M9600
$$ 17250 33245 49266 32744 -50045 -86916 -76849 -47952 -30132 -24444 -54542 -18830 30770
11536C0770k6790j861K3755m0996l4748j0336M6992M6992K7426k3430j5906j4523
$$ 30770 3980 2119 25874 -15122 -49870 -60206 -13214 33778 61204 37774 21868 7345
11524G345j2827O0444J6275l0607k6971o676j693J1095N378K9617k2406o7497
$$ 7345 -5482 54962 71237 40630 13659 6983 5290 16385 21763 51380 28974 -38523
11512c8523M58K9688J3475o168o263M249J409L0168J7477J4206M941K5713l891
$$ -38523 -38065 -8377 5098 -1070 -7333 -3084 -1675 28493 45970 60176 65117 90830 86939
11499H6939j4413j9296j9757j2980k0946J30k5567o324J6076K7319m8675l8593
$$ 86939 72526 53230 33473 20493 -453 -323 -25890 -32214 -16138 11181 -37494 -76087
11487g6087L2198O438K4433M2626K2251o028k6138l6690q610N613m00K1820R181
$$ -76087 -43889 -37451 -13018 29608 51859 45831 19693 -16997 -25607 -19994 -20394 1426 10607
11474A0607K7102l3967k6388J3363J4481j8581M836K8410J8690M649k06K8247
$$ 10607 37709 3742 -22646 -9283 5198 -13383 -8547 19863 38553 43202 42996 71243
11462G1243l3778j1331q482j551K0483J1670k5255L8247L2776n2691o6205r808
$$ 71243 37465 26134 17652 16101 36584 48254 22999 61246 94022 41331 -24874 -34682
11450c4682J0923j0201k6590J1306j1889M6740N1847L5634j2111m3612j5039K3968
$$ -34682 -23759 -33960 -60550 -49244 -61133 -14393 37454 73088 60977 17365 2326 26294
11438B6294k4794l8700l871r702p624N977M4464k999j3544K4133J3461l8474n0993
$$ 26294 1500 -37200 -41071 -50773 -58397 -52420 -7956 -10955 -24499 -366 13095 -25379 -76372
11425g6372K2918P427l3951j407M2377j1202L6552M1645K7406l4141m8991K7427
$$ -76372 -53454 -46027 -79978 -81385 -39008 -50210 -13658 27987 55393 21252 -27739 -312
11413c12K9221M053j3646j1271R541p635K4224O4777j2216j01433j7527J7636
$$ -312 28909 32962 19316 8045 17586 9951 34175 98952 86736 -14697 -32224 -14588
11401a4588k3085J5070K2231J8215k0837k9775j952J9025P762j5905n470J6314
$$ -14588 -37673 -22603 -372 17843 -2994 -32769 -34721 -15696 -7934 -23839 -29309 -12995
11389a2995N7407N2927k8344l0737j8378j8260k5921O707K1564L457l4624j0205
$$ -12995 44412 97339 68995 38258 19880 1620 -24301 -17594 3970 7427 -27197 -37402
11377c7402j4210k958j0247J5866K6060L1876k5622m2295P38R684J4550M0610
$$ -37402 -51612 -54570 -64817 -48951 -22891 8985 -16637 -58932 -58194 -48510 -33960 6650
11365F650J7329O848J7332k5669j9609k6422j7843L8085K2153L550O999n2132
$$ 6650 23979 30827 48159 22490 2881 -23541 -41384 -3299 18854 22404 29403 -22729
11353b2729m7709J3949M4401j9564k7901q121K2546K8429K666L4843P213K9866
$$ -22729 -70438 -56489 -12088 -31652 -59553 -67674 -45128 -16699 -14033 20810 28023 57889
11341E7889j2067l3143j0141K6343J2969o8442m2888K298M707m970K447J4732
$$ 57889 45822 12679 2538 28881 41850 -26592 -69480 -67182 -62475 -67445 -64998 -50266
11329e0266K5318m886j8152J5686J3539M8788j6938j2051N072r701k0539m0800
$$ -50266 -24948 -29834 -47986 -32300 -18761 30027 13089 1038 6110 -3591 -24130 -64930
11317f4930K1917L8871J8117K461m1993m0767j3220K144K9650K0731R497K8173
$$ -64930 -43013 -4142 13975 16436 -25557 -66324 -79544 -77400 -47750 -27019 -17522 10651
11305A0651L808L300Q56K3849K3335n4491k5226M7177N2387k9927k5183p642q870
$$ 10651 14459 17759 18615 42464 65799 11308 -13918 33259 85646 55719 30536 22894 14024
11292A4024j3425J2334n3612j3746K8737k0623J8883K130J6941K7193l9309j4352
$$ 14024 599 12933 -40679 -54425 -25688 -46311 -27428 -25298 -8357 18836 -20473 -34825
11280c4825j0579M0424k7176L2752J7949K513j0624j1325K4290J3557l8384j6116
$$ -34825 -45404 -4980 -32156 596 18545 21058 10434 -891 23399 36956 -1428 -17544
11268a7544K6286l723k0858J4355p799k9928R291r656L2776J5292n0991m1558
$$ -17544 8742 5019 -15839 -1484 -9283 -39211 -29920 -39576 -6800 8492 -42499 -84057
11256h4057q578M0005N4170l0732J867M1741K8675M2038l2496J0134j5456j9795
$$ -84057 -92635 -52630 1540 -29192 -27325 14416 43091 85129 52633 62767 47311 27516
11244B7516m872J8025k2975j9022M40P14R99m1555L6421n026j4326m7776j3145
$$ 27516 22644 40669 17694 -1328 -888 -174 825 -40730 -4309 -9335 -23661 -71437 -84582
11231h4582m554j0366K0095K6108j0093j0198J2108L2447L8348k4782o1534K1042
$$ -84582 -89136 -99502 -79407 -53299 -63392 -73590 -61482 -29035 9313 -15469 -77003 -55961
11219e5961M2755k11N595j2784K867L5099k227m5285l2428M1008J2445k3659k4322
$$ -55961 -13206 -13417 -7822 -20606 -17739 17360 15133 -30152 -62580 -21572 -9127 -32786 -57108
11206e7108M2140N3728J0626k4778K1039j945j8823l810k0758j707L017n260J2019
$$ -57108 -14968 38760 49386 24608 45647 43702 24879 21069 311 -1396 1621 -3639 8380
11193H380j8083J9793K9353l0128R977R659r015n781O1929O429k9813j9743j9167
$$ 8380 -9703 10090 39443 9315 19292 28951 19936 14155 76084 82513 52700 32957 13790
11180A3790j9167j3369K3816J8396O2702j9185j00220l0966L0886Q375J7258j5228
$$ 13790 -5377 -18746 5070 23466 86168 66983 -33237 -64203 -33317 -24942 -7684 -22912
11168b2912J5960K3300M7487o980q952K3688J7573p289K1640k2862q7236m7087
$$ -22912 -6952 16348 63835 56855 47903 71591 89164 81875 103515 80653 -6583 -53670
11156e3670K4963N9850k2316m1879n79k8427J1829K9946K1515L127Q45J3720n3619
$$ -53670 -28707 31143 8827 -33052 -33631 -62058 -50229 -20283 1232 4359 5204 18924 -34695
11143c4695j4042M0695M3072j683j2243k8935J1946P941l4681J9401m994j6593
$$ -34695 -48737 -8042 35030 33347 21104 -7831 4115 12056 -22625 -3224 -8218 -24811
11131b4811K4679Q77k2370o1966j9740j9495L9974J4056R773M8237L6483j3642
$$ -24811 -132 745 -21625 -83591 -103331 -122826 -82852 -68796 -59023 -10786 25697 12055
11119A2055j7162K4732k4106l6975N791K5649K3931M0461L486J7440P024k8075
$$ 12055 -5107 19625 -4481 -41456 -35665 -10016 13915 54376 57862 75302 82326 54251
11107E4251l7768j8468K6075P738q767j9796J9207K2362l3295k4362j7924k5716
$$ 54251 16483 -1985 24090 31828 23061 3265 22472 44834 11539 -12823 -30747 -56463
11095e6463L8046N0139p207m3443J3303M4114K8498j7375k0143k0039j7260l5775
$$ -56463 -18417 31722 24515 -18928 -5625 38489 66987 49612 29469 9430 -7830 -43605
11083d3605j7349j3581R64N0341K6046j4584j8819N3151J0684l2686k0716L5185
$$ -43605 -60954 -74535 -73571 -23230 2816 -11768 -30587 22564 33248 562 -20154 15031
11071A5031j2512m0701j397J3737j80O6102M9206J5128j2946j2303l7430m7700
$$ 15031 2519 -38182 -39579 -25842 -26022 40080 89286 104414 91468 79165 41735 -5965
11059e965k5958j5114K0429J4731m0463J0770P424L5471J3696J5860K0522l2274
$$ -5965 -31923 -47037 -26608 -11877 -52340 -41570 -34146 1325 15021 30881 51403 19129
11047A9129K1204k1424k740J9590J9644k6926p805j071P008K8620j4367m7564
$$ 19129 40333 18909 16169 35759 55403 28477 20672 19601 26609 55229 40862 -6702
11035f702m1013l732K8018j5430j3231K4847j2214J163J5035L6269l3582l2186
$$ -6702 -47715 -51447 -23429 -38859 -52090 -27243 -39457 -38294 -23259 13010 -20572 -52758
11023e2758J8424K7608K6837j2420N7617m19r2789n0618Q06M4234K1545L1335
$$ -52758 -34334 -6726 20111 7691 65308 64889 -27900 -78518 -77712 -33478 -11933 19402
11011A9402K6990n6951m5444l1933j1151M2843L8681J7049j4707L495l0776J2395
$$ 19402 46392 -10559 -56003 -87936 -99087 -56244 -17563 -514 -15221 -11726 -42502 -30107
10999c0107K8600J9908j6374m1803j3289O5626M3306J7498l5086n4021k9973N3637
$$ -30107 -1507 18401 2027 -39776 -53065 12561 55867 73365 38279 -15742 -45715 7922
10987G922J1498k046N7222K4156l9780l4362k1233j3494k9783M0074Q520j8463
$$ 7922 19420 17374 74596 98752 58972 24610 3377 -10117 -39900 174 8694 -9769
10975i769K1362J0770j0032J5002l5654J1341N6640J1264k5867j8743r21j1976
$$ -9769 11593 22363 12331 27333 -8321 3020 59660 70924 45057 26314 25393 13417
10963A3417k6406m2993K3688J0337P849N489L6525m190m9991l1203j1312q403
$$ 13417 -12989 -55982 -32294 -21957 -14108 -8619 27906 23716 -26275 -57478 -68790 -77193
10951g7193J9026J7151J1668M77P882K6866L4502K2511n881k3973l1334j2790
$$ -77193 -58167 -41016 -29348 -28871 -20989 5877 40379 62890 57009 33036 1702 -11088
10939a1088L4336j9099n1634J2671P7260P2616j6711o0634l6504o976K0056K6065
$$ -11088 23248 4149 -47485 -34814 42446 115062 98351 37717 1213 -5763 14293 40358
10927D0358J7535p368l3428l9511J7518L5867k1940L0390L4773o2845p0974L0221
$$ 40358 57893 50525 17097 -22414 -4896 30971 9031 39421 74194 11349 -59625 -29404
10915b9404J9331J4759K6142j0877o536j4204j061J7899j6751m235L162K1756
$$ -29404 -10073 4686 30828 19951 13415 -789 -1850 16049 -702 -4937 -1775 19981
10903A9981k2995q72o814n637J7995P332N169J6667M99m5791l5975N2085k2478
$$ 19981 -3014 -3886 -10700 -16337 1658 8990 14159 30826 31325 -14466 -50441 1644 -20834
10890b0834j9644J0437J5598l5998J726K9536L4762J559l1359n3181J1518L8669
$$ -20834 -40478 -30041 -14443 -50441 -48715 -19179 15583 17142 -14217 -67398 -55880 -17211
10878a7211Q651m8317n6590J358j4650N802L9623P257R476O8760O802K526M6187
$$ -17211 -8560 -56877 -113467 -112109 -126759 -120957 -81334 -74077 -64601 4159 10961 13487 59674
10865E9674r632j6064k6827m7405k5941L3991K712K045n562P414N6382n497K3118
$$ 59674 50042 33978 7151 -40254 -66195 -32204 -29492 -27447 -33009 -25595 30787 25290 48408
10852D8408j1543l0236R19M1163J9950R344j3871j9347q724k707p051K1552J775
$$ 48408 36865 6629 7548 48711 68661 78005 64134 44787 36063 33356 26305 47857 49632
10839D9632j4491j1016j7523k5656P173K51L4722K0646j0898r796l975l0453l078
$$ 49632 35141 24125 6602 -19054 -11881 -11630 23092 43738 32840 23044 19069 -11384 -14462
10826a4462M1713L557L796M4929j8809q898Q259o3702K799J7717j682M3395k5402
$$ -14462 27251 30808 34604 79533 60724 51826 60085 -3617 -818 16899 15217 58612 33210
10813C3210n6380J3695o10p545K2160j6158R317r290l5457l603L3114K3442o606
$$ 33210 -23170 -9475 -10085 -17630 4530 -11628 -2311 -11601 -47058 -50661 -17547 5895 -711
10800g11K240M1705k5087m2021K8787R023m945R713k0862m5461p908N6793j5013
$$ -711 1529 43234 18147 -23874 4913 13936 8991 18704 -2158 -47619 -55527 1266 -13747
10787a3747J618k594L4231n593m2290o595j2682J7303J9244o172L6872m1041n2158
$$ -13747 -12129 -14723 19508 13915 -28375 -34970 -47652 -30349 -11105 -17277 19595 -21446 -73604
10774g3604K9345k155k2656J4132M0033n689k9644J1978K5173o423j4629j3252
$$ -73604 -44259 -46414 -69070 -54938 -14905 -20594 -50238 -38260 -13087 -19510 -34139 -47391
10762d7391O167J6024M8044J4203n5628l7091J0493j3578Q620P1165J7218K7287
$$ -47391 -41224 -25200 22844 37047 -18581 -55672 -45179 -58757 -50137 21028 38246 65533
10750F5533j9932j6659k9109k0497j9706K3851J8824j9496J4968K4186K6770L7509
$$ 65533 45601 28942 -167 -20664 -40370 -16519 2305 -17191 -2223 21963 48733 86242
10738H6242k2444m9240n3489j4054J0730J9687j1268K8431J233l3265J068K9641
$$ 86242 63798 14558 -38931 -52985 -42255 -22568 -33836 -5405 -4172 -37437 -36369 -6728
10726f728j6225K0898J5099J8057l9161l5406k432L1263Q485J1214K3226j582
$$ -6728 -22953 -2055 13044 31101 -8060 -43466 -45898 -14635 -6150 5064 28290 26708
10714B6708l1652l3194K4976K2167L8955j9229j3942J0150r363k065k1070k2058
$$ 26708 -4944 -38138 -13162 9005 47960 28731 14789 24939 15576 13511 -7559 -29617
10702b9617J7048j1660R610K5139J4783k2417j6402j3482J2072M1486l3548m9141
$$ -29617 -12569 -24229 -14619 10520 25303 2886 -13516 -26998 -14926 26560 -6988 -56129
10690e6129J2619M9420J2207m5905Q43J7086o916L718j0474L3149K1736M667j5855
$$ -56129 -43510 5910 18117 -27788 -26945 -9859 -16775 -13057 -23531 9618 31354 36021 20166
10677B0166K172m2103k1122k1941L6364K7298n683K8040K6041j4743L8551K5801
$$ 20166 22338 -19765 -40887 -62828 -26464 834 -4849 23191 49232 34489 73040 98841
10665I8841k0003k6754j5125k3047m121O893J2094r908Q166L857j8180o618k7052
$$ 98841 78838 52084 36959 13912 9791 16684 28778 18870 27036 30893 12713 6095 -20957
10652b0957l1773k2296K2705K2891p722L0734j6278k9204M34J2115N0554J1565
$$ -20957 -52730 -75026 -52321 -29430 -37152 -6418 -22696 -51900 -51466 -39351 11203 22768
10640B2768K006M7624J0247j8871l8007n9084l6918K0103R654M435j7523L5313
$$ 22768 24774 72398 82645 63774 25767 -33317 -70235 -50132 -40478 -36043 -53566 -18253
10628a8253K8218l0893m5431K2995K8122J4919J8365p590n2026R64K3386M5313
$$ -18253 9965 -20928 -66359 -43364 -15242 -323 18042 10452 -41574 -40610 -17224 28089
10616B8089Q44m3220l8798j3074l474L3509M3123N0625m458k1963l9099L302j5822
$$ 28089 28933 -14287 -53085 -66159 -69633 -36124 6999 57624 53166 31203 -7896 -4594 -20416
10603b0416j2609k382K4031K4193j4547k3360k9659l0693k6703N43J9015j600
$$ -20416 -33025 -35407 -11376 12817 -1730 -25090 -54749 -85442 -112145 -111602 -92587 -94187
10591i4187N2340L2342j6522k4046k0694J7146K0328K9350K6772L799j0095j1253
$$ -94187 -41847 -9505 -26027 -50073 -70767 -53621 -33293 -3943 22829 26628 16533 5280
10579E280j4880Q230p500Q447k8703j7426n652K8618N841q382J3722m834R003
$$ 5280 -9600 -1370 -8870 -423 -29126 -46552 -52204 -23586 -17745 -26127 -12405 -17239 -8236
10566h236q80J7067O3086K0784j3986O007m1358j6503j7458q788j1491L4868M0300
$$ -8236 -9116 7951 71037 91821 77835 83842 42484 25981 8523 -265 -11756 23112 63412
10553F3412p73j748K9359m1194n3612K0794q693j3678l0496N4517J5607j3473
$$ 63412 62639 60891 90250 49056 -4556 16238 7545 -6133 -36629 17888 33495 20022
10541B0022j0789l762K1954J6741K9533l844k2927k5459j0049j264n867m0989
$$ 20022 9233 5471 27425 44166 73699 69855 46928 21469 11420 10156 4289 -36700
10529c6700M841J8526M2873J504k7610O835p223j4000j0391l44k0280K211L6977
$$ -36700 -31859 -13333 29540 31044 3434 10269 3046 -10954 -21345 -21689 -41969 -39758 -2781
10516b781J4617j3615K8473k7072o9507K7110M9631j0512O807Q875l2903m0637
$$ -2781 11836 -1779 26694 -378 -69885 -42775 6856 -3656 3151 12026 -20877 -61514
10504f1514j4736O53O3621j6929k3731O5248J2730J4101l0167q0336j3021L2037
$$ -61514 -76250 -75597 -11976 -28905 -52636 12612 25342 39443 9276 -71060 -84081 -52044
10492e2044j0579p6618L909K7383P3715L442k5128K3863M4068j7412l5221K850
$$ -52044 -62623 -139241 -135332 -107949 -34234 -30792 -55920 -32057 12011 -5401 -40622 -37772
10480c7772j8384J5559M5296J1212K6347l4501k3101J6946j761k2307l616q539
$$ -37772 -56156 -40597 4699 15911 42258 7757 -15344 1602 -159 -22466 -26082 -34621
10468c4621K4582J6826J5576R216n5971n1451L71N1784K9740K4128j2710J090
$$ -34621 -10039 6787 22363 31579 -24392 -75843 -75472 -23688 6052 30180 17470 18560
10456A8560M4069k3484J2890n436k4067K3809m0116o481J7990Q973k006k328k4031
$$ 18560 62629 39145 52035 46599 22532 46341 6225 -256 17734 26707 24701 22373 -1658
10443a658k0696l127K4429k7893j9148L8276K879L2210R540k9322m6007k5120
$$ -1658 -22354 -25481 -1052 -28945 -48093 -9817 -6938 25272 34812 5490 -40517 -65637
10431f5637J0990j70M4465K9138m6694l7051L1162J8590q687M428p246j7228J7658
$$ -65637 -54647 -54817 -10352 18786 -27908 -64959 -33797 -15207 -23894 -19466 -26712 -43940 -26282
10418b6282J4663J2930j8925K2403J9044J9572J1611l8849l1017K1666R950k8329
$$ -26282 -11619 1311 -17614 4789 23833 43405 55016 16167 -14850 6816 16766 -11563
10406a1563l589M907j7558L9223n074L2817K3649n416p802k8618k0097j0793J5680
$$ -11563 -15152 -10245 -27803 11420 6346 39163 62812 57396 49594 20976 879 -9914 5766
10393E766K118k7523m1642K2171j3191J7888O4175k0284P057K8581j6430j3950
$$ 5766 7884 -19639 -61281 -39110 -52301 -34413 29762 9478 16535 45116 28686 14736
10381A4736k9947k4333K3755O693m9994J7960N2142M6228K8940m7019p6530K0179
$$ 14736 -15211 -39544 -15789 -9096 -59090 -41130 11012 57240 86180 39161 -37369 -17190
10369a7190j0430p566K946K5901K2515p364j5255p004j5729k9935L085q089j9537
$$ -17190 -27620 -35186 -32240 -6339 16176 8812 -6443 -13447 -29176 -59111 -56026 -64115 -83652
10356h3652M8270L8603k5721Q521q504p7578p775M7233K8884K3695O5814n525
$$ -83652 -35382 3221 -22500 -13979 -22483 -100061 -107836 -60603 -31719 -8024 57790 52265
10344E2265J4404N0045M6177K5592J8729j3309J2287K1871n2107k9942k6135m3289
$$ 52265 66669 116714 162891 188483 207212 193903 206190 228061 175954 146012 119877 76588
10332G6588p888J0818j2187n1446k5499J3039l2236j389K4050J7120J6320M1888
$$ 76588 68700 79518 67331 15885 -9614 3425 -28811 -30200 -6150 10970 27290 69178
10320F9178j5898o1922M0227L6927N122k8007l5644R816k3579k2626j6187L866
$$ 69178 53280 -8642 31585 68512 73634 45627 9983 19799 -3780 -26406 -42593 -38727
10308c8727L1874J9024n0453q420J2072K911l2543k6733M1777L3472k1434l7612
$$ -38727 -6853 12171 -38282 -46702 -34630 -31719 -64262 -90995 -49218 -15746 -37180 -74792
10296g4792o504L1775J982k8591m033L786j2044k29J1354K8268K0275K3527k2302
$$ -74792 -81296 -49521 -47539 -76130 -80163 -76377 -88421 -88650 -77296 -49028 -28753 -5226 -27528
10283b7528R476N7105o019j1828m9251l8706j066K9866j803j1695K6253J7537
$$ -27528 -18052 39053 33034 21206 -28045 -66751 -67817 -37951 -39754 -51449 -25196 -7659
10271g659K2541o430p4518J2554O4200J3383j1676o064m2138J689j6585L661M8558
$$ -7659 14882 8452 -66066 -53512 10688 24071 12395 6331 -35807 -34118 -50703 -47042 1516
10258A516L2237j4780k2152L8944j4853l3643o199K290J4788o996k7596k3023
$$ 1516 33753 18973 -3179 35765 20912 -12731 -18930 -16640 -1852 -8848 -36444 -59467
10246e9467o141O098M2958M3449J0085j8483O387J4702Mk9076m4646l5449K8736
$$ -59467 -65608 -59510 -16552 26897 36982 18499 24886 39588 39592 10516 -34130 -69579 -40843
10233d0843K2992J0113l7354R673N9435j7208j8812Q368J6011K876k2232k6797
$$ -40843 -17851 -7738 -45092 -35419 24016 6808 -12004 -3636 12375 15251 -6981 -33778
10221c3778O839R622j9465o558m8961J8688K8989Nk0403j1616P674j5079R682
$$ -33778 -26939 -17317 -36782 -43340 -92301 -73613 -44624 -44619 -65022 -76638 -68964 -84043 -74361
10208g4361J8719l6081K0339M2579l7504P226O774j5799O0562o096j4031K3833
$$ -74361 -55642 -91723 -71384 -28805 -66309 -59083 -52309 -68108 -7546 -13642 -27673 -3840
10196c840k967n33j1954L8307k8324m0203K6366K5301O012k8088l4453M8172l1174
$$ -3840 -6807 -7340 -19294 19013 -9311 -49514 -23148 2153 8165 -19923 -54376 -6204 -37378
10183c7378l5869J1373J5864L2600J8650k063K7328L8045l5K00k0293j0339j6937
$$ -37378 -73247 -61874 -46010 -13410 5240 3177 30505 68550 68515 68715 48422 38083 21146
10170B1146l1693j7215k1927l724q39M8861L046k9149J1460K6550J4185L0537
$$ 21146 -10547 -27762 -49689 -53413 -54252 -5391 -2345 -31494 -20034 6516 20701 51238
10158E1238m4336m3479J5164J8630L7849j6332j5787K231j3261N389M2733K7573
$$ 51238 6902 -36577 -21413 -2783 35066 18734 2947 5178 -8083 -2694 40039 67612
10146F7612o2306j3213k8219R21L9075N3643m472n2832m148k0962K4548J7869
$$ 67612 5306 -7907 -36126 -35205 3870 57513 53041 209 -3939 -24901 -353 17516
10134A7516J8250j8529l4214m4713R384l2596K1472O0406K6200k4091J0429P013
$$ 17516 35766 17237 -16977 -61690 -52306 -84902 -63430 -3024 23176 -915 9514 16527
10122A6527j9967J7841J7861J0533j4579k239j2292j4523p269O498J6007L8960
$$ 16527 -3440 14401 32262 42795 28216 25977 13685 -838 -8107 -1609 14398 53358
10110E3358N823L719k6095j7970J517p533j9888K1883J9144R350L0431j5004j7047
$$ 53358 59181 62900 36805 18835 20352 12819 -7069 14814 33958 43308 73739 58735 41688
10097D1688l0547o216N529O368K2353K6728j0827K0353j5180k728N6525K0855
$$ 41688 11141 4925 10454 16822 39175 65903 55076 75429 60249 57521 114046 134901
10085A34901j4226j2450j5769j7781j3384j3282j46K1392k121J9604r724k5738
$$ 134901 120675 108225 92456 74675 61291 48009 47863 69255 67134 86738 77014 51276
10073E1276m121N875r44m452K4861M6577M3780j8783m4074L5558K8701N4894J19424
$$ 51276 47155 53030 52086 47634 72495 119072 162852 144069 99995 135553 164254 219148 338572
10060C38572J28118J47992J06621J76015L53043O32463R66507J691433L223779
$$ 338572 466690 614682 721303 897318 1250361 1882824 2849331 4540764 7764543
10051G764543N733819O130954q43750n591279m998921l102804j730899j035476
$$ 7764543 13498362 19629316 18785566 13194287 8195366 5092562 3361663 2326187
10043B326187o08046l75049k82800k53309j34571j01822p6641o7607l6121j1519
$$ 2326187 1718141 1343092 1060292 806983 672412 570590 493949 426342 390221 378702
10033C78702j1022p586L429m4927o1837l9716K690l3842j2687m537K4051l1116
$$ 378702 367680 360094 363523 318596 256759 217043 219733 185891 173204 168667 192718 161602
10021A61602l9412l9682k4142m7182j5991O604K0731K2958l9986l1456L8168O3657
$$ 161602 122190 82508 58366 11184 -4807 1797 22528 45486 5500 -25956 12212 75869
10009G5869k198K4688j9214k2741j2060N1794K1010r697m3880N752k0747k5961
$$ 75869 73671 98359 79145 56404 44344 96138 117148 107451 63571 69323 48576 22615
9997B2615k422k5374j2033R923K4160k762n7066K7689K9461j020j1805k0231K2702
$$ 22615 20193 -5181 -17214 -7291 16869 14107 -42959 -15270 14191 13171 1366 -18865 3837
9984C837P6227j9561K802j523k4400J1546N04j0937k9910L9144L2571j8190m6246
$$ 3837 80064 60503 63305 61782 37382 48928 49432 38495 8585 47729 80300 62110 15864
9971A5864j9346j5985Q936J1805j418j132r626L698J9921J249J3627o319J4568
$$ 15864 -3482 -19467 -10531 1274 -144 -1276 -10902 -7204 12717 13966 27593 21274 35842
9958C5842J5239R673j4433K0557k1143r863J1009O16n8353m452k3614j0610Q2963
$$ 35842 51081 60754 46321 66878 45735 35872 46881 47497 -10856 -15308 -38922 -49532 33431
9945C3431J0702o1058j3171j5264L4015J2411j8397j9654K7060J5208j0074n684
$$ 33431 44133 -16925 -30096 -45360 -11345 1066 -17331 -36985 -9925 5283 -4791 -10475
9933a0475O0855J7159k0333J4488k7514j9813n0526m2219k580K5780N2586K3176
$$ -10475 50380 67539 47206 61694 34180 14367 -36159 -78378 -80958 -55178 -2592 20584
9921B0584K0234J4777q010o4089m9760N5836M7823j4786m7265j2090j4922J10
$$ 20584 40818 55595 47585 -16504 -66264 -10428 37395 22609 -24656 -36746 -51668 -51558
9909e1558K1838K3814L4755r659L012j3523l4629m942R54M0364M934j1122J079
$$ -51558 -29720 -5906 28849 19190 22202 8679 -25950 -30892 -29938 10426 15360 4238 5317
9896E317l687K5947M6714K141p5252j0828J0366j4462Q086j1286J241L7377k6813
$$ 5317 1630 27577 74291 76432 1180 -9648 718 -13744 -5658 -16944 -15703 21674 -5139
9883e139l8653j0890m753K547J5641L0555J4543k1176J6693j5695J2641m958j9124
$$ -5139 -43792 -54682 -59435 -56888 -41247 -10692 3851 -17325 -632 -16327 -3686 -8644 -27768
9870b7768K1934K0480M718j4742m2865J714K3573j8627l2341L5603O9186M4364
$$ -27768 -5834 14646 19364 4622 -38243 -36529 -12956 -31583 -63924 -28321 40865 85229
9858H5229j3953J1906O875m2971n8813k6907L3761J2883l2104O562J7691j5132
$$ 85229 71276 83182 90057 47086 -11727 -38634 -4873 8010 -24094 -17532 159 -14973
9846a4973k1737k8390K0219j236J9122m662J2096J5066j2894l4401O06K2058K1685
$$ -14973 -36710 -65100 -44881 -46117 -26995 -31657 -19561 -4495 -17389 -51790 -51184 -29126 -7441
9833g441l6027J4475J0562K162K7439K9136l8441k4531L3615N4866j3945l807
$$ -7441 -43468 -28993 -18431 -16269 11170 40306 1865 -22666 10949 65815 51870 48063
9821D8063j1878O851k3078j8253Q722m901O776j748m5886k2603L4603J5019k0722
$$ 48063 36185 43036 19958 1705 10427 5526 12302 10554 -35332 -57935 -23332 -8313 -29035
9808b9035j8825M815J5987k228P401K5894J7459j3318l7523j860r339J360L5908
$$ -29035 -47860 -43045 -27058 -29286 -21885 4009 21468 8150 -29373 -31233 -40572 -39212 -3304
9795c304n417K9336k3037k1993r971q375J2220K8456l3639l773L5266J4958j5819
$$ -3304 -8721 20615 -2422 -24415 -34386 -42761 -30541 -2085 -35724 -39497 -4231 10727 -5092
9782e092j2155M4391L0742k3967l9097l0713j378N445J9058q748k2258K665K7894
$$ -5092 -17247 27144 57886 33919 -5178 -35891 -37269 -31824 -12766 -21514 -43772 -41107 -13213
9769a3213j578l0102J4673J1449K6963j7645k0723Q3735K469o7633J83K2310k4402
$$ -13213 -14791 -44893 -30220 -18771 8192 -9453 -30176 53559 56028 -11605 -11422 10888 -13514
9756a3514k982k162j401K0538L8955J4017l2957l6881K5305k2913n2113K9061
$$ -13514 -16496 -18658 -20059 479 39434 53451 20494 -16387 8918 -13995 -66108 -37047
9744c7047J9672l4086J2907j6727k2698j0120N917j4081K1608P0403L3588P185
$$ -37047 -17375 -51461 -38554 -55281 -77979 -88099 -82182 -96263 -74655 -4252 29336 36521
9732C6521l1742L4p206n4493O166O1757J2230j8291J1321l476j4899N673j5504
$$ 36521 4779 4813 -2393 -56886 -50720 11037 23267 4976 16297 12821 -2078 3595 -11909
9719a1909J401k4095k6667J0650J1247L8489K1199j9471l7310K764J5643K2214
$$ -11909 -10508 -34603 -61270 -50620 -39373 -884 20315 844 -36466 -33702 -18059 4155
9707D155K2946J2547j1339J740o4352j5697n077p453N7800N403l7486J8062k9692
$$ 4155 27101 39648 28309 30049 -34303 -50000 -55077 -62530 -4730 673 -36813 -18751 -48443
9694d8443j3801L5568K9850j1870k2085P591O3466P921m8780Q594o801l6047k0035
$$ -48443 -62244 -26676 3174 -8696 -30781 -23190 40276 48197 -583 8011 1210 -34837 -54872
9681e4872L2169K1209j7358j7665K1930l5805J3071K4311J1470j1446J6228n985
$$ -54872 -22703 -1494 -18852 -36517 -14587 -50392 -37321 -13010 -1540 -12986 3242 -2743
9669b743j9022j1406j2370j5492L5223L1079J958L0028j369n2721k8081k570L6136
$$ -2743 -21765 -33171 -45541 -61033 -25810 5269 7227 37255 35886 -16835 -44916 -47486 -11350
9656a1350j6091k343l5548K6454K6544J7375L7394k0170J6131J9421K3056l5915
$$ -11350 -27441 -29784 -65332 -38878 -12334 5041 42435 22265 38396 57817 80873 44958
9644D4958j4078j1821j8541P648j3793r705P958K5028Q208j2948j7503j2482j032
$$ 44958 30880 19059 518 8166 -5627 -15332 -7374 17654 25862 12914 -4589 -17071 -18103
9631a8103p144k9258L691L6670K2113J2098j9445J4965L4249j5604l2317m529
$$ -18103 -25247 -54505 -50814 -14144 7969 20067 622 15587 49836 34232 1915 -2614
9619b614L7719L4732l0316P414k1585l4416M3110k6111p2790k7481r717M9470
$$ -2614 35105 69837 39521 46935 25350 -9066 34044 7933 -64857 -92338 -102055 -52585
9607e2585J5735k7435j1724O0225N3639L277j8551o786k8545p477R312K2658J0833
$$ -52585 -36850 -64285 -76009 -15784 37855 41132 22581 15795 -12750 -20227 -10915 11743 22576
9594B2576j2170j6961M3411p868l2391m8969m502K1469L8205L1827K2877j7171
$$ 22576 10406 -6555 36856 28988 -3403 -52372 -56874 -35405 2800 34627 57504 40333
9582D0333j2519J1939o756K0258j9849M848j799l3341j4773J3069o272J8962L186
$$ 40333 27814 39753 32997 53255 33406 38254 36455 3114 -11659 1410 -4862 14100 17286
9569A7286o6335m0636L4005N4197J8486l8435n8621k3988P875K6330J7761j0273
$$ 17286 -49049 -89685 -55680 -1483 17003 -21432 -80053 -104041 -96166 -69836 -52075 -62348
9557f2348j310K1716J9630l1591j8284O872J4235M468j7357L2120L022K1695K007
$$ -62348 -63658 -41942 -22312 -53903 -72187 -65315 -51080 -46612 -63969 -31849 -28827 -7132 -5125
9544e125n5555J9530O6651j8836J4726K2763n6401l9282J9796K5384K1059r6k4394
$$ -5125 -60680 -41150 25501 6665 21391 44154 -12247 -51529 -31733 -6349 14710 14614 -9780
9531i780K827j0106P617K933J832o09R485M141o2259o214M6407L8936q74o165
$$ -9780 -6953 -17059 -9442 -6509 -4677 -5286 4199 8340 -53919 -60133 -13726 25210 24336 18171
9517A8171K2301J059n3778k8240Q966m0107j4421j1032N4983L4176J1948P210
$$ 18171 40472 41531 -12247 -40487 -31521 -71628 -86049 -97081 -42098 -7922 4026 11236
9505A1236k0218K132m053J1127J1340m6013m0132q046J5814J2123P348N8624N183
$$ 11236 -8982 -6850 -10903 224 11564 -34449 -74581 -82627 -66813 -54690 -47342 11282 16465
9492A6465q47k6941j8022O750R81r799k8717k4774J6120K9288o306R887J0943
$$ 16465 15618 -11323 -29345 -22595 -21614 -31413 -60130 -84904 -68784 -39496 -45802 -35915 -24972
9479b4972K3451L1532J5207n4907n887M0676J8002j9655J1497P643l55m4544k7150
$$ -24972 -1521 30011 45218 -9689 -15576 25100 43102 23447 34944 42587 42232 -2312 -29462
9466b9462m920L2041j0647J0432m0575o350R361J7122K0296J6293J9406J903n3
$$ -29462 -34382 -2341 -12988 -2556 -43131 -49481 -40120 -22998 -2702 13591 32997 34900 34847
9453C4847n794L009n003n1405j9140K7995Q53r583k718j0613p472k530J2618L4495
$$ 34847 29053 32062 27059 -24346 -43486 -15491 -14638 -24221 -26939 -37552 -45024 -47554 -34936 -441
9439d41L1015N862j4644m8301j7557l9427M1541K7801k899l9942J3730J0418l1663
$$ -441 30574 36436 21792 -26509 -44066 -83493 -41952 -14151 -17050 -56992 -43262 -32844 -64507
9426f4507m2426J2736J7143O162N5973L1679L2500K6024l1671j5273K0787j4450
$$ -64507 -106933 -94197 -77054 -70892 -14919 16760 49260 75284 43613 28340 49127 34677
9414C4677m7255o1463M8841L4327j3976R400L6722J0522l4739n5369J0802M487
$$ 34677 -12578 -74041 -25200 9127 -4849 4551 41273 51795 17056 -38313 -27511 -23024
9402b3024m1621L0516L3660J2031k6346L3791J561k3671o722j3639q779L6685
$$ -23024 -64645 -34129 -469 11562 -14784 19007 20568 -3103 -9825 -23464 -32243 4442
9390D442M5182M4124N140l5431m5040k1100J4007m0646p0529O822N5288n192J3776
$$ 4442 49624 93748 98888 63457 18417 -2683 11324 -29322 -99851 -93029 -37741 -42933 -29157
9377b9157k6490m8081L9072O0719Q0303m666m5476n2814k2534N864J0330J4856
$$ -29157 -55647 -103728 -64656 -3937 76366 71700 26224 -26590 -49124 -43260 -32930 -18074
9365a8074M2033K2077l595J2440l8147j2454k7517P297J8740m2877m989l38M912
$$ -18074 23959 46036 42441 54881 16734 4280 -23237 -15940 2800 -40077 -45066 -45404 -40492
9352d0492J8972L4082m531J1905K6099L235m3222k5070j717J5659k2839k2718
$$ -40492 -21520 12562 8031 19936 46035 49270 6048 -19022 -20739 -5080 -27919 -50637
9340e0637k0232k46J4789o649k7529l2174l830O0731K3813J5372K8913J1950J3892
$$ -50637 -70869 -71115 -56326 -62975 -90504 -122678 -126508 -65777 -41964 -26592 2321 14271 28163
9327B8163L8059l1199M655k8293k4319j079k6435q231J580M2481J2684n483L7168
$$ 28163 66222 35023 39678 11385 -12934 -14013 -40448 -48679 -47099 -4618 8066 2583 39751
9314C9751L7372o926l1072l4788R69K3186K1739k9278l7677K8054J6893l404J1948
$$ 39751 77123 70197 39125 4337 5306 28492 50231 20953 -16724 11330 28223 24819 36767
9301C6767L6552r845k2480j5117j4332p459J1334j5886J7551J6742P101K530j9076
$$ 36767 73319 63474 40994 25877 11545 4086 15420 -466 17085 33827 40928 43458 24382
9288B4382l9668j0756J2365q227Q786P667J109M077K1355J178n7504n823k1922
$$ 24382 -15286 -26042 -13677 -21904 -13118 -5451 -4342 -265 21090 22268 -35236 -41059 -62981
9275f2981O611N3583m078q734k3450J0368K8305N1947N6256K9955j6834o6200
$$ -62981 -56370 -2787 -6865 -15599 -39049 -28681 -376 51571 107827 137782 120948 54748
9263E4748k6930M055Q664J8643m3109j5254L0660L1896l4663m6988l0718M5274
$$ 54748 27818 31873 40537 59180 16071 817 31477 63373 28710 -18278 -48996 -3722
9251c722M2690m56r646l2430m9442j9078K3403J2118K0814K1184K7524j5363N840
$$ -3722 38968 38512 28866 -3564 -53006 -72084 -48681 -36563 -15749 5435 32959 17596 23436
9238B3436p69j2097k6308K6230P233M916q046k1854j7558L0946j8435J123N161
$$ 23436 22667 10570 -15738 10492 17725 22641 14595 -7259 -24817 6129 -12306 -11183 -6022
9225f022K7192J1150M101l2177J6797k334l0066M8087j4971M685J230k4625N675
$$ -6022 21170 32320 36421 4244 21041 18707 -11359 36728 21757 26442 27672 3047 8722
9212H722K5954j215j5361J5440j3643k3365L3602L8138l8525K743J7518p599k0106
$$ 8722 34676 33461 18100 33540 19897 -3468 30134 68272 29747 32490 50008 42409 22303
9199B2303R082J1837L204n557r7j8999l2906L3484L1210J5272J3460M932K6292
$$ 22303 31385 43222 46426 40869 40772 21773 -11133 22351 53561 68833 82293 87225 113517
9186A13517k4151n5346K232J0301J3610M5213M1826L9384k6113l4808p732O0373
$$ 113517 89366 34020 36252 46553 60163 105376 147202 186586 160473 125665 117933 178306
9174A78306M1839J259O952M3723j2711k4529L8436J4646r543r099M5922R6314
$$ 178306 220145 221404 228356 272079 259368 234839 273275 287921 278378 269279 315201 411515
9162D11515M1960K0307Q6427P0597P6206J21186J57020J38729K07630K79321L18024
$$ 411515 453475 473782 560209 630806 707012 828198 985218 1123947 1331577 1610898 1928922
9151A928922L48886M67837O57344R05327J345028K049707L162386M865437O944681
$$ 1928922 2277808 2745645 3402989 4308316 5653344 7703051 10865437 15730874 22675555
9142B2675555Q175998N571111j172539o356798p328812n993575m196353k833070
$$ 22675555 30851553 36422664 35250125 28893327 21564515 15570940 11374587 8541517
9134H541517k026035j382146j015441p94041o11597m05954k94520k18939k38426
$$ 8541517 6515482 5133336 4117895 3323854 2712257 2306303 2011783 1792844 1554418
9125A554418j79053j45772j30772j19435j24594p8459l9357p5690o8494k7691
$$ 1554418 1375365 1229593 1098821 979386 854792 776333 736976 661286 592792 565101
9115E65101n4132l1281j1912l5361J4260j0406k7456l8458l4645l4096o94j8090
$$ 565101 510969 479688 467776 432415 446675 436269 408813 370355 335710 301614 300920 282830
9103B82830k307J3539l0638o873J6468m8217m1586m136m4089j0809j2872k8285
$$ 282830 280523 294062 263424 256551 273019 224802 183216 179080 134991 124182 111310 83025
9091H3025K7461k600K2199M0409J236N2542L3005r128j9419k2129j0282J4150
$$ 83025 110486 107886 130085 170494 171730 224272 257277 248149 228730 206601 196319 210469
9079B10469l4661j7777J158j3378q362k6637k8093N59j219M190N44j2644j1643
$$ 210469 175808 158031 159189 145811 137449 110812 82719 83278 82059 86249 86793 74149 62506
9066F2506L7414K0214o592l4173j4999j6064R501K3018k1892J3453k2528j8201
$$ 62506 99920 120134 113542 79369 64370 48306 57807 80825 58933 72386 49858 31657
9054C1657J3155J27l7231J5875N3203J7837k7728q676k4805L5555J1106N508p725
$$ 31657 44812 44939 7708 23583 76786 94623 66895 58219 33414 68969 80075 85583 77858
9041G7858M34p858L107k5041l0941k9363M458J9339K5820K2571j7071k5265R762
$$ 77858 78292 70434 73541 48500 17559 -11804 -7346 11993 37813 60384 43313 18048 27810
9028B7810J612r694n65N654M7069P104k4960N461n1873k4754L9729J8197o6192
$$ 27810 29422 19728 19163 24817 71886 78990 54030 59491 7618 -17136 22593 40790 -25402
9015b5402P946L6031J6416J0483j4990l4066k7267J7545K8458l889l9585l574
$$ -25402 -17456 18575 34991 45474 30484 -3582 -30849 -13304 15154 11265 -28320 -31894
9003c1894L3144L9027j4079j5861k2253n689k5790o623K487J219J925J657K8741
$$ -31894 1250 40277 26198 10337 -11916 -17605 -43395 -50018 -47531 -46312 -44387 -42730 -13989
8990a3989M0000j8279L2895K8346k7822l702j3428k4612k6087j4710q155N039
$$ -13989 26011 7732 40627 68973 41151 37449 24021 -591 -26678 -41388 -49543 -44504
8978d4504K5102K3264J9170o289j7679m864J4009j4387j9858J9584J6935j6106
$$ -44504 -19402 3862 23032 16743 -936 -5800 8209 -6178 -26036 -6452 10483 -5623
8966e623M319j742j0679J1264k1710J3163J8032j866k2259j1897n044O687J0050
$$ -5623 -1304 -3046 -13725 -2461 -24171 -11008 7024 5158 -17101 -28998 -34042 -27355 -17305
8953a7305R641M5543J0903r146M124R362n321m4906p0932m993M999K7962J0481
$$ -17305 -7664 37879 48782 39636 43760 53122 47801 2895 -68037 -73030 -68031 -40069 -29588
8940b9588M7761J5445k5311j2462K7848n277o8708J523N8201J8486J5937J7958
$$ -29588 18173 33618 8307 -4155 23693 18416 -50292 -48769 9432 27918 43855 61813
8928F1813l4095k8604q526N2416J8794m6559k3880L1429R251j0169j0065K7689
$$ 61813 27718 -886 -9412 43004 61798 15239 -8641 22788 32039 21870 11805 39494
8916C9494O777N504L0096k0083n5318O972L2902l6222k4727M021J2653J6538J800
$$ 39494 46271 51775 81871 61788 6470 13442 46344 10122 -14605 -10584 2069 18607 20407
8903B0407j0254J2052J7724k0327P95L9897J325k6973k9665p637J6036R100J1973
$$ 20407 10153 22205 39929 19602 20397 60294 61619 34646 4981 -2656 13380 22480 34453
8890C4453k779l637p799o826j8353n926J8047L9349j7930n0001n607J8494L8348
$$ 34453 31674 28037 20238 13412 -4941 -10867 7180 46529 28599 -21402 -27009 -8515 29833
8877B9833K3368k3057p029k6426L29M4084k150j9909r216J4041J6889k7600k9255
$$ 29833 53201 30144 23115 -3311 -2982 41102 38952 19043 9827 23868 40757 13157 -16098
8864a6098L817J4142L513o64r268J7127K5129P667m3484k5115l8724r321M6421
$$ -16098 -12281 1861 5374 4710 -4558 12569 37698 45365 1881 -23234 -61958 -71279 -24858
8851b4858J8741J274k1324j4671j5545O0704P3539k1928m9804l8833m8795J9054
$$ -24858 -6117 -4843 -26167 -40838 -56383 4321 77860 55932 6128 -32705 -81500 -62446
8839f2446K2871k9928O20L137K7157J5493N8347K2502l1439k7671n191R050l1
$$ -62446 -39575 -69503 -68883 -65746 -38589 -23096 35251 57753 26314 -1357 -6548 2502 2471
8826B471J2162O221n740j5880N393J22J301J4481m1696j9748p58l799j6580J5134
$$ 2471 14633 20854 15114 -766 4627 4749 6050 20531 -21165 -40913 -41671 -45470 -62050 -46916
8812d6916K1276K9663M4195M0416o715k8047m3336j572j2387k1490K340K5505
$$ -46916 -25640 4023 48218 88634 81919 53872 10536 8964 -3423 -24913 -22573 2932
8800B932m216j2734J0822P546j9415k6581N895n909l2529J5147M936J7321L0195
$$ 2932 -1284 -14018 -3196 4350 -15065 -41646 -35751 -41660 -74189 -59042 -54106 -36785 -6590
8787f590J3230R229L0942K8398j6860k3604K628n3105q074J0391J4835K2104M978
$$ -6590 6640 15869 46811 75209 58349 34745 37373 -15732 -23806 -13415 1420 23524 28502
8774B8502j3981k2696l9963l2150q039O9021J2409K5045j2675Q90M010K730K826
$$ 28502 14521 -8175 -48138 -80288 -88327 -19306 -6897 18148 5473 6363 10373 13103 15929
8761A5929r541o635p458J3454K7316k02j1774l46K9919K0902J2728k5820o304
$$ 15929 6388 -247 -7705 5749 33065 32863 21089 20743 50662 71564 84292 58472 52168
8748E2168l446M992J4658K4086r351R231R384n782j4060l3286l4085j7542O705
$$ 52168 48722 53714 68372 92458 83107 92338 101722 95940 81880 48594 14509 -3033 3672
8735C672Q278k259O7444J7149k1391l5550m6177k5160Q816O5570J4610k2972K6563
$$ 3672 11950 9691 77135 94284 72893 37343 -8834 -33994 -25178 40392 55002 32030 58593
8722E8593N057K3529J5077l8001m3020m6090K9054R823k3197L9485M110M7689
$$ 58593 63650 87179 102256 64255 21235 -24855 4199 14022 -9175 30310 34420 82109
8710H2109L1219J4949l2126j6372m443n1365k8254L4721q104n518K630J4109k6983
$$ 82109 113328 128277 96151 79779 75336 23971 -4283 30438 22334 16816 19446 33555 6572
8697F572p052J4530L371j1954L5941M926K017o26l2444M817P054j5322k816L6058
$$ 6572 -480 14050 17421 5467 41408 46334 48351 47725 15281 20098 27152 11830 9014 45072
8683D5072N110m356J0216j5393M039P819r722R427R452J6238j2160k1907m846
$$ 45072 50182 45826 56042 40649 44688 52507 42785 52212 61664 77902 65742 43835 38989
8670C8989j9199o984J1045l703j1996L853L7627N4879k7393n0293j8158J0665
$$ 38989 19790 12806 23851 20148 8152 12005 49632 104511 77118 26825 8667 19332
8658A9332K8877K0637J3241L0252J0333Q833R029j0635m6791j5333Q739j9869
$$ 19332 48209 68846 82087 112339 122672 131505 140534 129899 83108 67775 76514 56645
8646E6645J1033L3942O5609J7006n8324m7986M676J6653l851N3939J8468k3139
$$ 56645 67678 101620 167229 184235 125911 77925 82601 99254 95403 149342 167810 144671
8634A44671k3195n0105j4085L7468J6617j5269L3994J1104j3605l9638k3390J3905
$$ 144671 121476 71371 57286 94754 111371 96102 130096 141200 127595 87957 64567 78472
8622G8472K0358O5575M4334J5839k0694P163j9238p4996o526K4621M2580N8950
$$ 78472 98830 164405 208739 224578 203884 211047 191809 116813 110287 134908 177488 236438
8610B36438l803m8503j309L8618j4036j2684M8871J904M542M121j6460K2389m940
$$ 236438 232635 184132 182823 221441 207405 194721 243592 245496 250038 254159 237699 260088 255148
8597B55148J6059P0393L4234J1575L9203k393j7729o9804p9402n6454l9532k3321
$$ 255148 271207 341600 375834 387409 426612 424219 406490 336686 257284 200830 161298 137977
8585A37977J6742j6368l6448j7197N593k6501k0098j5057R897M987k6714l1643
$$ 137977 154719 138351 101903 84706 90299 63798 43700 28643 38540 43527 16813 -14830
8573a4830j6608J4091J5139K1065k1455l4513j422L0922J5048q574J6437J8005
$$ -14830 -31438 -17347 -2208 18857 -2598 -37111 -38533 -7611 7437 -1137 15300 33305
8561C3305j4339N988J8284q0420k4555L0862L477L6864P379k0945j4149J9320
$$ 33305 18966 24954 43238 -37182 -61737 -30875 -27398 9466 16845 -4100 -18249 1071
8549A071j3742m48K0015N684k5522Q727k3943N864p374J4455R132k826j4898j732
$$ 1071 -12671 -13119 6896 12580 -12942 -4215 -28158 -22294 -29668 -15213 -6081 -8907 -23805 -25537
8535b5537K9384O1941J5270n8751l6660j1351L4053J6885k526K3301L3711k7327
$$ -25537 3847 65788 81058 22307 -14353 -25704 8349 25234 22708 46009 79720 52393
8523E2393k5292o698J0315k268J9630j0321N075l0341k1045J4938J7481K1927
$$ 52393 27101 20403 30718 28450 48080 37759 42834 12493 -8552 6386 23867 45794
8511D5794j1594k2319q245K3970N3309p197K2098N2220n5299j6317R50N0719J570
$$ 45794 34200 11881 3636 27606 80915 73718 95816 148036 92737 76420 77370 128089 129659
8498A29659j4056l3539m0571j5718m4312M5635L7983o2591m0748J8540K8923L5121
$$ 129659 115603 82064 41493 25775 -18537 27098 65081 2490 -38258 -19718 9205 44326
8486D4326j369j5691m3233o192J8282J67L3087K2537J5492J199L7783k81k6638
$$ 44326 42957 27266 -15967 -22159 -3877 -3710 29377 51914 67406 68605 106388 106107 79469
8473G9469l8564m4682K5088K7590j9010k0198J0498j4077J0944j3075J6187R671
$$ 79469 40905 -3777 21311 48901 29891 9693 20191 6114 17058 3983 20170 29841
8461B9841J8601L0278o0330n0574j4665R280M6023K1306k118m19k7730k9706k2334
$$ 29841 48442 78720 18390 -32184 -46849 -37569 8454 29760 27642 27223 -507 -30213 -52547
8448e2547K0567j2673R311L4219j3982K410O427q236k0405K1098J2503K0834J4357
$$ -52547 -31980 -44653 -35342 -1123 -15105 -12695 -6268 -14504 -34909 -13811 -1308 19526 33883
8435C3883k2610K0845L7589j2588l2888j6046J5805J4775O581M5860O302n059
$$ 33883 11273 32118 69707 57119 24231 8185 23990 38765 45346 91206 97508 92449
8423I2449J7139o2771J950K8373o0548p788J6230L2698k4381k3590r434J49k192
$$ 92449 109588 46817 48767 77140 16592 8804 25034 57732 33351 9761 327 476 -1716
8410a716q445j3423k895j3415J5799J566j26L2632M9988J0000p173J1885j6113
$$ -1716 -10161 -23584 -26479 -39894 -24095 -22529 -22655 9977 59965 69965 62792 74677 58564
8397E8564m2449J4424J9275j0376j9143l8249J9561K571K6072n786j5262k77j667
$$ 58564 16115 30539 49814 39438 20295 -17954 1607 4178 30250 24464 9202 8925 7258
8384G258L554j5303K536m517k263k1935r758P691K6238Q265K4335K6603K0666
$$ 7258 10812 -4491 -1955 -6472 -8735 -30670 -40428 -32737 -6499 1766 26101 52704 73370
8371G3370l2658o7156l5643M2834N8715M0887J0561L210p1199l8861k0969N13
$$ 73370 40712 -26444 -62087 -19253 39462 80349 90910 94120 22921 -15940 -36909 -36396
8359c6396O557M1798N753k6286J9171M842j6409p156j8672J3986J2021K6750J794
$$ -36396 -29839 11959 17712 -8574 10597 15439 -970 -8126 -26798 -12812 -791 25959 27753
8346B7753l396K474m1605J3220k0380J1737L1222P356m7077j2717J7977Q924k00
$$ 27753 24357 26831 -14774 -1554 -21934 -10197 21025 28381 -18696 -31413 -13436 -4512 -4712
8333d712j6992J2995K1063k3253l810M5308J4411l7101K7804L3935j4177k0026
$$ -4712 -21704 -8709 12354 -10899 -14709 30599 45010 7909 35713 69648 55471 35445
8321C5445k461k8969k4964K2697o638l091P47m406o698Q406j5720j6915R350j6858
$$ 35445 32984 4015 -20949 1748 -4890 -7981 -7234 -11640 -18338 -9932 -25652 -42567 -33217 -50075
8307e0075K6460L1101l0574j8040j449j2200m658K9190J2924M0137K8707p335
$$ -50075 -23615 7486 -23088 -41128 -42577 -54777 -59435 -30245 -17321 22816 51523 44188
8295D4188k9232P015o330l558k4588p611K7053j4959l1238k8769l2082K843K5666
$$ 44188 14956 21971 15641 12083 -12505 -20116 6937 -8022 -39260 -68029 -100111 -97268 -71602
8282g1602K6380M5790M0073J4705l2046j4294j0295J6494L3061J4061r249k0575
$$ -71602 -45222 568 40641 55346 23300 9006 -1289 15205 48266 62327 53078 32503
$$ [...]
##END NTUPLES=NMR SPECTRUM
##END=
