##TITLE=Analysis number 326588
Compound Code cc 07105
Project Code adrs
Chemist Name endeavour
##JCAMPDX= 6.0         $$ Bruker NMR JCAMP-DX V2.0
##DATA TYPE= NMR SPECTRUM
##DATA CLASS= NTUPLES
##ORIGIN= Bruker BioSpin GmbH
##OWNER= nmr
$$ XWIN-NMR		Version 3.5
$$ Wed Feb 14 10:02:00 2007 GMT Standard Time (UT+0h)  MAYBRIDGE\nmr@NMR_250MHZ
##.OBSERVE FREQUENCY= 250.131544655141
##.OBSERVE NUCLEUS= ^1H
##.ACQUISITION MODE= SIMULTANEOUS (DQD)
##.ACQUISITION SCHEME= undefined
##.AVERAGES= 16
##.DIGITISER RES= 18
##SPECTROMETER/DATA SYSTEM= dpx250
##.PULSE SEQUENCE= zg30
##.SOLVENT NAME= CDCl3
##.SHIFT REFERENCE= (INTERNAL, CDCl3, 0, 16.522)
##AUDIT TRAIL= $$ (NUMBER, WHEN, WHO, WHERE, WHAT)
$$ ##TITLE= Audit trail, XWIN-NMR		Version 3.5
$$ ##JCAMPDX= 5.01
$$ ##ORIGIN= Bruker BioSpin GmbH
$$ ##OWNER= nmr
$$ C:\u/data/dgb/nmr/ADRS/840/pdata/1/auditp.txt
$$ ##AUDIT TRAIL=  $$ (NUMBER, WHEN, WHO, WHERE, WHAT)
(   1,<2007-02-14 10:01:39.14 +000>,<MAYBRIDGE\nmr>,<NMR_250MHZ>,
      <created by zg, POWCHK disabled, PULCHK disabled
       configuration hash MD5:
       49 4B E0 1D 92 C2 6B 37 9F E6 65 BC 52 41 86 1D
       data hash MD5: 64K
       EF F7 67 C0 A9 50 EF 75 4C 03 EB CC 49 33 3B 41>)
(   2,<2007-02-14 10:01:52.20 +000>,<MAYBRIDGE\nmr>,<NMR_250MHZ>,
      <Start of raw data processing
       ef LB = 0.3 FT_mod = 6 PKNL = 1 SI = 32K 
       data hash MD5: 32K
       83 09 51 C7 FF 2C B0 59 67 2B E7 8D 59 A5 16 24>)
(   3,<2007-02-14 10:01:54.12 +000>,<MAYBRIDGE\nmr>,<NMR_250MHZ>,
      <apk 
       data hash MD5: 32K
       17 90 7B 7E 43 3C 05 43 6C C3 3C 62 22 98 2F E3>)
(   4,<2007-02-14 10:01:54.95 +000>,<MAYBRIDGE\nmr>,<NMR_250MHZ>,
      <abs ABSG = 5 
       data hash MD5: 32K
       4A 04 18 BE E6 06 DF 43 FE 03 8A AE 95 7E 8D F9>)
$$ ##END=
$$ 
$$ hash MD5
$$ 19 6C 3F FA CF 3E 7D 3A 4F 30 25 5F DA 32 88 14
##$RELAX= 
##$RELAX= 
##$RELAX= 
##$RELAX= 
##$RELAX= 
##$RELAX= 
##$RELAX= 
$$ Bruker specific parameters
$$ --------------------------
##$DU= <C:\u>
##$EXPNO= 840
##$NAME= <ADRS>
##$PROCNO= 1
##$TYPE= <nmr>
##$USER= <dgb>
##$AMP= (0..31)
100 100 100 100 100 100 100 100 100 100 100 100 100 100 100 100 100 100 
100 100 100 100 100 100 100 100 100 100 100 100 100 100 
##$AQSEQ= 0
##$AQ_mod= 3
##$AUNM= <au_zg>
##$AUTOPOS= <35 >
##$BF1= 250.13
##$BF2= 250.13
##$BF3= 250.13
##$BF4= 250.13
##$BF5= 500.13
##$BF6= 500.13
##$BF7= 500.13
##$BF8= 500.13
##$BYTORDA= 1
##$CFDGTYP= 0
##$CFRGTYP= 5
##$CHEMSTR= <none>
##$CNST= (0..31)
1 1 145 1 1 1 1 1 1 1 1 1 1 1 1 1 1 1 1 1 1 1 1 1 1 1 1 1 1 1 1 1 
##$CPDPRG= <>
##$CPDPRG1= <>
##$CPDPRG2= <>
##$CPDPRG3= <>
##$CPDPRG4= <mlev>
##$CPDPRG5= <mlev>
##$CPDPRG6= <mlev>
##$CPDPRG7= <mlev>
##$CPDPRG8= <mlev>
##$CPDPRGB= <>
##$CPDPRGT= <>
##$D= (0..31)
0 1 0 0 0 0 0 0 0 0.06 0 0 0 0 0 0 0.0002 0 0 0 0 0 0 0 0 0 0 0 0 0 0 
0 
##$DATE= 1171447298
##$DBL= (0..7)
120 120 120 120 120 120 120 120 
##$DBP= (0..7)
150 150 150 150 150 150 150 150 
##$DBP07= 0
##$DBPNAM0= <>
##$DBPNAM1= <>
##$DBPNAM2= <>
$$ [...]
##$SUBNAM7= <"">
##$SUBNAM8= <"">
##$SUBNAM9= <"">
##$SW= 20.6930455092707
##$SWIBOX= (0..15)
0 0 3 0 0 0 0 0 0 0 0 0 0 0 0 0 
##$SW_h= 5175.983436853
##$TD= 65536
##$TD0= 1
##$TE= 295.16
##$TE2= 300
##$TE3= 300
##$TEG= 300
##$TL= (0..7)
0 120 120 120 120 120 120 120 
##$TP= (0..7)
150 150 150 150 150 150 150 150 
##$TP07= 0
##$TPNAME0= <>
##$TPNAME1= <>
##$TPNAME2= <>
##$TPNAME3= <>
##$TPNAME4= <>
##$TPNAME5= <>
##$TPNAME6= <>
##$TPNAME7= <>
##$TPOAL= (0..7)
0.5 0.5 0.5 0.5 0.5 0.5 0.5 0.5 
##$TPOFFS= (0..7)
0 0 0 0 0 0 0 0 
##$TUNHIN= 0
##$TUNHOUT= 0
##$TUNXOUT= 0
##$USERA1= <user>
##$USERA2= <user>
##$USERA3= <user>
##$USERA4= <user>
##$USERA5= <user>
##$V9= 5
##$VALIST= <valist>
##$VCLIST= <CCCCCCCCCCCCCCC>
##$VD= 0
##$VDLIST= <DDDDDDDDDDDDDDD>
##$VPLIST= <PPPPPPPPPPPPPPP>
##$VTLIST= <TTTTTTTTTTTTTTT>
##$WBST= 1024
##$WBSW= 4
##$XGAIN= (0..3)
0 0 0 0 
##$XL= 0
##$YL= 0
##$YMAX_a= 212865
##$YMIN_a= -332071
##$ZGOPTNS= <>
##$ZL1= 120
##$ZL2= 120
##$ZL3= 120
##$ZL4= 120
##$ABSF1= 16.522
##$ABSF2= -4.171173
##$ABSG= 5
##$ABSL= 3
##$ALPHA= 0
##$AQORDER= 0
##$ASSFAC= 0
##$ASSFACI= 0
##$ASSFACX= 0
##$ASSWID= 0
##$AUNMP= <proc_1d>
##$AZFE= 0.1
##$AZFW= 0.1
##$BCFW= 0
##$BC_mod= 0
##$BYTORDP= 0
##$COROFFS= 0
##$CY= 12.5
##$DATMOD= 1
##$DC= 0
##$DFILT= <>
##$DTYPP= 0
##$F1P= 14.0000005364418
##$F2P= -0.99999901652339
##$FCOR= 0.5
##$FTSIZE= 32768
##$FT_mod= 6
##$GAMMA= 0
##$GB= 0
##$INTBC= 1
##$INTSCL= 1
##$ISEN= 128
##$LB= 0.3
##$LEV0= 0
##$LPBIN= 0
##$MAXI= 10000
##$MC2= 0
##$MEAN= 0
##$ME_mod= 0
##$MI= 0
##$NCOEF= 0
##$NC_proc= -3
##$NLEV= 6
##$NOISF1= 0
##$NOISF2= 0
##$NSP= 0
##$NTH_PI= 0
##$NZP= 0
##$OFFSET= 16.522
##$PC= 1
##$PHC0= 230.6838
##$PHC1= 11.41764
##$PH_mod= 1
##$PKNL= yes
##$PPARMOD= 0
##$PSCAL= 4
##$PSIGN= 0
##$REVERSE= no
##$SF= 250.13
##$SI= 32768
##$SIGF1= 0
##$SIGF2= 0
##$SINO= 400
##$SIOLD= 32768
##$SREGLST= <1H.CDCl3>
##$SSB= 0
##$STSI= 32768
##$STSR= 0
##$SW_p= 5175.98343685301
##$SYMM= 0
##$S_DEV= 0
##$TDeff= 65536
##$TDoff= 0
##$TI= <Analysis number 999999
Compound Code 99
Book Reference 9
Project Code 9>
##$TILT= no
##$TM1= 0
##$TM2= 0
##$TOPLEV= 0
##$USERP1= <user>
##$USERP2= <user>
##$USERP3= <user>
##$USERP4= <user>
##$USERP5= <user>
##$WDW= 1
##$XDIM= 32768
##$YMAX_p= 310352963
##$YMIN_p= -214957
$$ End of Bruker specific parameters
$$ ---------------------------------
##NTUPLES= NMR SPECTRUM
##VAR_NAME=  FREQUENCY,     SPECTRUM/REAL,   SPECTRUM/IMAG
##SYMBOL=    X,             R,               I
##VAR_TYPE=  INDEPENDENT,   DEPENDENT,       DEPENDENT
##VAR_FORM=  AFFN,          ASDF,            ASDF
##VAR_DIM=   32768,         32768,           32768
##UNITS=     HZ,            ARBITRARY UNITS, ARBITRARY UNITS
##FACTOR=    0.157963299565203, 1,           1
##FIRST=     4132.6476996994, 0,             0
##LAST=      -1043.33573715361, 0,           0
##MIN=       -1043.33573715361, -214957,     0
##MAX=       4132.6476996994, 310352963,     0
$$ Real data points
##PAGE= N=1
##DATA TABLE= (X++(R..R)), XYDATA
$$ [...]
23890 48405 5609 1849 21681 2114 -5437 12082 -5118 5252 46801 33635 -58001 -85221
23878 -85221 -64657 -51454 -40781 -24200 -13310 2924 5748 3124 -22075 -11715 32353 84078
23866 84078 83168 69066 57393 28146 -55979 -104350 -111182 -50160 1206 15811 32127 24162
23854 24162 13889 -39879 -67383 -6417 51838 45605 45 -41944 -60062 -34570 15289 23892
23842 23892 4706 49984 60523 42300 22420 -34258 -38133 -22727 -52515 -37610 -25106 -25837
23830 -25837 22909 51085 5862 12902 33686 21430 35210 16574 -32471 -28731 4457 6003
23818 6003 66113 121740 106621 48615 22499 11048 2443 22146 41762 51892 87137 44224
23806 44224 -14278 7572 -3796 -7061 -37015 -58608 31104 26570 -24564 -51350 -54369 -52198
23794 -52198 -38561 -7744 26366 27173 41101 23330 47114 60810 36314 42535 52565 14450
23782 14450 -16111 -42563 -11776 14946 26755 25259 10791 10746 -13855 -22596 -55291 -20343 -21678
23769 -21678 -22583 -13336 -3580 20743 58752 67666 27352 2302 -19099 -23856 -5761 79573 65394
23756 65394 -23169 -14630 8409 18100 -13513 -14508 3826 -36301 -55387 -53246 -19755 9058 11885
23743 11885 4703 -17896 -43227 -21889 15278 9966 -35103 -91078 -86541 -36450 -36089 -49870 -104443
23730 -104443 -106483 -3541 19968 17429 17353 22011 -3237 -23689 23404 -8931 -12377 1228 5446
23717 5446 48036 85699 26837 -12533 -44475 -37932 -27689 22933 16125 34592 47676 2019
23705 2019 -11505 4680 -22754 -67078 -64214 -32455 -85136 -106257 -98293 -66834 -16273 -38594
23693 -38594 -29182 -15998 18858 -1216 -39046 -35664 -1316 -79690 -115066 5281 120746 148543
23681 148543 141030 76651 -19577 -51603 -42807 -58208 -39083 -61647 -56910 -40207 -57047 -43806
23669 -43806 -70398 -92768 -83285 -41640 -51344 -44766 17893 24288 -19128 -86837 -56951 -41990
23657 -41990 -48641 -57739 -35404 -15355 23130 -20908 -62922 -53352 -82747 -98993 -88521 -69001
23645 -69001 -53863 -40191 -30020 -13536 -9434 -23949 -26970 -45538 -46048 -6605 23026 12313
23633 12313 9819 219 -4377 -26148 -436 9493 25540 -843 -17366 -19887 -15508 20954 28564
23620 28564 -17387 -60081 -77454 -95678 -23009 36613 83153 67185 46273 12623 49366 62823
23608 62823 53930 48790 34211 30677 47695 65566 44960 -22165 -32410 -6179 -7005 -33838 -57152
23595 -57152 -34206 -35315 -28730 -5080 -12639 16208 -13567 -78626 -93698 -47257 -15854 -20662
23583 -20662 -31407 -26701 10758 21924 50602 20319 17907 15721 30063 51338 38623 -7270
23571 -7270 24970 34004 36736 40059 -11021 -40596 -11872 -2351 19273 47886 61967 49696 34581
23558 34581 -12597 8544 53250 13885 -33240 -4589 12693 -64993 -56960 -48408 -21091 -62297
23546 -62297 -55424 -43145 -88436 -150568 -153909 -93206 -87941 -145216 -76726 -52144 -38921 -25458
23534 -25458 -46644 -38752 -19351 -14880 -33262 9540 49803 59705 -30096 -30444 -519 1810 -13567
23521 -13567 45763 59539 103179 128769 61830 8788 36339 43686 34326 76646 46786 -30391
23509 -30391 -41028 -32032 5916 24090 -5555 -32988 -45344 -58588 -80488 -49662 8030 -16468
23497 -16468 -47792 -67223 -49816 12895 -4930 -18441 7417 31399 45003 -30684 -89728 -71008
23485 -71008 -18503 -2402 -24402 24496 43130 27759 46149 42199 39687 -3111 1047 23558
23473 23558 5235 -8527 13963 32498 19381 4433 -28105 -32367 13331 7765 19229 -27276
23461 -27276 -83338 -57594 -6969 10507 42349 41227 -182 4077 -36639 -18656 2823 38055
23449 38055 108689 78813 34665 45983 52707 37285 -14453 -54834 -48527 -26156 -14159 16319
23437 16319 -29477 -50606 -54722 -33413 -4600 7505 -21186 -1305 28628 12715 -24018 -40643
23425 -40643 -13357 -26457 -38759 -35989 -13465 -33267 1940 90300 110712 106905 70500 -23521
23413 -23521 -14151 578 17095 -6611 -79416 -55022 -11487 -40085 -52351 -3536 10595 -36818
23401 -36818 -41593 5616 6724 19967 -832 -1586 -49048 12716 13540 30655 69505 67431 45283
23388 45283 7631 -17495 175 44909 62591 18894 19281 45305 74388 66642 45269 19260
23376 19260 6450 862 1922 52806 93868 90407 89978 23874 1797 46780 37607 -54975 -48862
23363 -48862 -2875 32506 28510 20199 -1374 62104 66967 78956 100148 83404 44490 30264
23351 30264 18031 14141 -2629 -27592 26527 53303 32520 68866 92735 76099 24076 -4512
23339 -4512 -17451 -36362 11636 20762 26364 -2008 23222 54921 72446 58263 30857 49554
23327 49554 35386 50581 56149 23255 29067 -19327 -58743 -86744 -94455 -65995 -5355 -45689
23315 -45689 -87955 -39146 -33683 -32348 -6865 30097 -38065 -35325 34607 -2189 -41393 -36544
23303 -36544 -54643 -57429 -24923 26068 53032 22367 -59723 -15574 -28633 -53872 -65025 -38608
23291 -38608 -10364 37681 -721 -33019 45935 91629 61085 -9823 -80284 -29094 21875 -56082
23279 -56082 -114277 -98282 -36325 29432 16691 -1399 -25188 -25338 -14266 -11553 -28451 -28396 -16005
23266 -16005 -67488 -48961 -44146 -75883 -26515 24802 57748 10899 30934 28502 44213 -1360
23254 -1360 -33824 -81608 -72316 -59667 -81095 -128973 -93070 -62603 -32118 -34944 -49877 -33073
23242 -33073 -17694 -31136 -9346 18309 53760 38067 24798 28382 34408 23083 -32670 3077
23230 3077 30660 19541 53143 65150 40598 40 -10233 -42805 -37835 -50649 -50552 -70063 -100775
23217 -100775 -57330 -22152 13071 9410 23118 67181 63219 61897 -127 -15306 -31992 -28766
23205 -28766 -4812 29226 8664 59987 116126 83229 53844 50265 13921 12726 26284 62204
23193 62204 95518 94379 32531 11803 -1731 -15848 -15003 -89468 -146627 -93878 -57687 -42735
23181 -42735 -11911 -21585 -42095 -36417 -70698 -68980 -60187 -45634 -44907 -61623 -32726 -30891 -30743
23168 -30743 -53076 -5995 8253 -13833 1759 -45916 -143553 -93053 -42246 -48425 -49877 -57138
23156 -57138 -82356 -28626 30975 28757 18567 44660 6159 -34152 -32306 -4728 -35407 -21685
23144 -21685 -10100 -27223 -49186 -27027 -45212 -53099 -68836 -81358 -38821 50370 74342 25551
23132 25551 42813 -4148 -26498 13122 43331 21325 -19032 5105 -58439 -54807 -22927 -57428
23120 -57428 -42465 -13848 -39097 -87380 -55948 -12283 46555 53562 53828 59024 58852 48102 -7312
23107 -7312 -44918 -38040 -59015 -65153 -17130 -3151 -16706 -30968 -35637 -80517 -51682 -31852
23095 -31852 -24370 -43350 695 32805 -4949 -22224 -72401 -84406 -68295 -30767 -37136 -34388
23083 -34388 -48511 -13422 -10539 12514 8745 -4442 -33907 -46127 -40929 -22065 -13679 -54686
23071 -54686 -86429 -100917 -83552 -28037 -34608 -74318 -74295 -11677 32539 31523 -10637 -42217 -48029
23058 -48029 -43458 1822 89252 124425 84046 19787 -47212 -57189 -51372 8803 67078 127902
23046 127902 104082 58905 55428 54469 52552 38430 7215 -10041 -12531 21194 34347 26863 2799
23033 2799 -11976 -9727 -6893 1125 -8336 9098 7471 -22128 7400 -15231 -14810 -2912 -4019
23020 -4019 -11911 -12699 -9857 -39562 -23475 -20653 -45919 -64372 -15631 36109 50996 29400 -25461
23007 -25461 -4162 20971 28269 31047 16811 20023 39865 -31 -18155 -5050 21407 69705
22995 69705 101557 72146 -16925 -4967 19132 -1312 5254 19855 28161 15042 17348 25606
22983 25606 -14819 -51157 -67760 -50111 -57797 -62602 -79167 -55495 -50451 -85924 -30710 42013
22971 42013 28570 -35780 -64828 -63536 -23554 -9949 1765 -5199 -21368 15501 -8029 -30429
22959 -30429 -31224 -21752 -26641 -45183 -53933 -84975 -68999 -23336 -3517 458 -4453 11482 31866
22946 31866 31236 22119 -2030 -41907 -40628 -91888 -59155 -34580 16843 11791 -43934 -52509 -28721
22933 -28721 -5384 -9914 -67284 -60900 -2463 60637 49869 15960 -24346 32626 68890 45197
22921 45197 67747 65877 39176 28532 12907 -11917 -88648 -139701 -148028 -153819 -142246 -85362
22909 -85362 -60568 -15476 -8594 -5698 -19903 -10907 26701 51725 28518 9735 -55169 -50502
22897 -50502 -29951 -18368 -42441 -56823 -5333 3736 4849 21110 22216 27653 7204 -12874
22885 -12874 -65775 -95256 -94552 -80019 -110935 -111931 -80493 -84734 -91578 -58712 -31532 -38910 -16548
22872 -16548 -21036 24760 23401 -2156 -36262 -92552 -67593 -66379 -48190 -90638 -85937 -67159
22860 -67159 -81318 -54836 -57324 -71364 -79801 -60522 -41381 -13810 8368 32175 83327 25802
22848 25802 -35633 -62037 -59700 -76477 -65416 -16517 -22289 -17084 -10879 -28128 -40863 -66349
22836 -66349 -37023 -48795 -112559 -117817 -115291 -69001 17925 -3414 -20351 -18185 -31671 -38516
22824 -38516 -41718 -9554 -4993 -11156 29271 8692 -13833 -22580 -30884 -70062 -20237 -15014 909
22811 909 -11791 38852 33824 42254 75092 43222 5780 16432 38916 82508 94437 89114 25750
22798 25750 -8375 -15030 -47730 -13759 -610 -18227 -20392 -20778 -7442 -2156 -72518 -85594 -57254
22785 -57254 -39598 -29112 -32439 -11135 22940 78212 100575 73167 53544 2827 -13295 7135
22773 7135 6641 16595 506 -2277 7110 -18618 -47175 -95885 -109560 -79644 -28233 -34953 -21940
22760 -21940 -43256 -68547 -76782 -21997 -34704 -32626 -7719 3928 12162 -3761 -73147 -77557
22748 -77557 -22265 45209 40580 55152 33564 11071 33209 43954 -8527 -44271 -77758 -53630
22736 -53630 -54061 -64625 -28359 8152 -85846 -112711 -22661 521 -20851 -73786 -100511 -43174
22724 -43174 16036 10207 -15631 -41431 -61158 -52535 -23971 -21817 -7314 -21322 10799 39868
22712 39868 56882 68189 3831 -53186 -69593 -64223 -55297 -80541 -44473 -36958 -31253 2142
22700 2142 -150 -26215 -1973 -1944 10249 19892 4819 -28656 -35389 -84511 -73247 26082 13985
22687 13985 -59037 -76600 -13882 36915 30078 11414 -41758 -72613 -40313 -8300 -17593 -37361
22675 -37361 37801 51898 44451 11386 -579 -49214 -55510 -39296 -57624 -80431 -80840 -28602
22663 -28602 -12507 -21447 -59437 -8805 988 -28754 -48582 -87068 -105137 -117261 -66620 -119235
22651 -119235 -131882 -157668 -117261 -44428 -19488 15989 -19824 -6437 38282 26740 66018
22640 66018 41637 -26294 -66943 -143828 -109492 -38628 -40957 -58011 -8686 4156 21747 3655
22628 3655 -11305 -25963 -14057 19055 20924 26156 23231 38531 95697 123409 57828 5384
22616 5384 9043 -30121 -56343 -13151 -29497 -28165 -41076 -36102 -57067 -32115 -7844 -14005 -52838
22603 -52838 -77048 -56366 -70423 -65648 -78354 -83719 -13823 31453 17499 55314 72183 58982
22591 58982 64412 19119 -5581 -11877 17418 30161 47447 88666 79695 84438 115414 100567
22579 100567 40669 15408 -20635 10779 84788 136941 132010 102856 110994 52892 31030 -13789
22567 -13789 -34393 -26878 -11176 -38153 -20386 -41173 -45583 -49565 -39897 -32308 -23223 -23033 -15142
22554 -15142 -24092 -28581 -13362 28553 51658 66912 53907 41231 23667 11045 -47 1453
22542 1453 13514 6476 -23566 10483 19438 23684 9217 59225 68633 10429 -12680 31124 32518
22529 32518 35618 31712 11551 18361 31873 3896 -4561 -51261 -79958 -81340 -103751 -125649 -122250
22516 -122250 -130665 -87236 -24785 -8593 -8357 -40565 -85149 -128259 -103184 -48484 -7010 -7483
22504 -7483 36867 24878 -2653 -5045 8928 26344 30232 41016 67069 78487 105740 119331
22492 119331 109207 122892 86842 15781 -12703 -54163 -53673 -26846 -31515 -40901 -41839 -64473 -95420
22479 -95420 -75406 -39285 -8185 -11404 6925 -32044 -46176 -72177 -89372 -60484 -47961 -54183
22467 -54183 -20449 47116 77983 57531 10436 7026 27943 8539 -39602 -79072 -23756 27633
22455 27633 27950 56234 68028 48867 84395 45331 -21 -57960 -40951 -27337 -34399 -58345
22443 -58345 -48576 -32024 -15849 -2000 7910 1185 50506 73863 82441 67945 10783 54306
22431 54306 64148 34526 23147 52830 80167 -31292 -69287 -76999 -35200 -52260 -61845 -57934
22419 -57934 -41922 26974 27179 -4686 -95309 -119803 -94792 -62810 -79481 -48504 -20971 -15552
22407 -15552 17893 -2830 19711 -13789 -30726 -39824 -75837 -83018 -51816 -45059 -46145 -8675
22395 -8675 30866 35701 9609 -38914 -97661 -109416 -81608 -13760 50195 53592 35088 66042
22383 66042 30244 7300 -42994 -18172 39224 5159 -49380 -19429 -36615 -29929 -3307 -7634
22371 -7634 -35964 -68182 -50527 -72959 -69646 -53151 5866 23696 7543 -38940 -71490 -56131
22359 -56131 -49228 26507 26067 3732 -23056 -44117 -51121 -66632 -31570 14494 48206 4250
22347 4250 -26673 2483 34397 13543 -21471 29545 57179 25377 -49492 -36712 3319 -18296
22335 -18296 -11802 24661 78947 47434 -11382 -23210 -68395 -40606 28096 46273 61779 54238
22323 54238 48436 7299 -39779 -55992 -51461 -68154 -33914 32943 23599 4811 36029 57421
22311 57421 -5527 -28524 7734 65630 55664 -9008 16092 63655 24456 11288 -51960 -127234
22299 -127234 -137221 -85208 -67916 -2933 21193 52481 48364 20370 13051 -10843 -48080 -61949
22287 -61949 -51804 -24498 -32226 -31456 -50982 -84300 10960 76690 78486 123027 98764 65072
22275 65072 90490 106739 62832 15812 -25613 -34097 -24197 -4321 -22358 2347 -17012 -50468
22263 -50468 -61562 -25246 -27973 -39976 -48919 -39441 -6071 22060 -4491 -52967 -125798 -158370
22251 -158370 -75346 -20979 -41531 -57962 -92830 -95493 -53750 -50452 -77641 -91945 -18431 21682
22239 21682 8550 9563 -21948 -30948 -499 14929 15780 48700 68595 68848 38151 52494 66533
22226 66533 85665 62249 10700 -28650 -16357 -17570 -9550 -32060 -5666 7901 -26184 -65194
22214 -65194 -61326 -38086 -49484 -55985 -13928 25125 35226 616 -30190 -22627 4123 -30055
22202 -30055 -34044 -47596 -25083 11043 16939 -14518 -36678 -27150 4192 33859 80142 59136
22190 59136 28182 -2981 -17691 3177 23517 55653 37443 -19393 -76774 -67173 -65122 -60790
22178 -60790 -40973 -6830 19447 21779 12491 -52491 -66297 -24969 11434 13690 -29237 -85222
22166 -85222 -85594 -63501 -24272 -10756 -49856 -104334 -74883 -36140 -13104 -6143 -10027 -37562
22154 -37562 -3396 40873 42773 40565 33909 9651 17114 -18196 -12307 -9053 -1213 40033 32621
22141 32621 32705 -6747 10265 45221 10847 -17798 -62095 -73496 -31246 15211 12210 30867
22129 30867 46558 27220 35466 66016 67875 12546 12316 43218 84517 83541 43012 37228 48091
22116 48091 65158 53797 -8433 -37374 -32546 -64917 -65440 -55359 -23034 34948 110484 103454
22104 103454 96877 54944 -16928 -36753 14968 92148 123921 95108 23757 8522 35419 31447
22092 31447 46187 23093 11928 -11055 -35859 23980 -13067 -25264 -7060 -8480 -9546 15522
22080 15522 1023 -29742 -87330 -116648 -117385 -96849 -76571 -111625 -81881 -61930 -39349 -55390
22068 -55390 -65640 -23376 -10853 -23382 -39949 -32372 -30677 -53715 -57192 -55233 -41807 -16404
22056 -16404 -17632 -18867 28840 55035 13525 -754 17786 13299 38944 11081 -8193 -30761
22044 -30761 -67582 -66250 -18525 -13303 558 25897 20207 -4004 5675 57267 -51365 -133015
22032 -133015 -134274 -164593 -147008 -82687 -51471 -23020 2696 20035 -17336 -49299 370 49972
22020 49972 42802 31774 50592 44825 -11797 -59151 -39950 -53918 -66337 -88722 -85025 -54067
22008 -54067 -49415 -22358 1986 -27870 12 2681 -18084 6338 35065 53491 29626 12650
21996 12650 20856 22500 15620 6440 -25157 -35863 -59830 -95559 -111539 -105392 -69834 -51849 -17920
21983 -17920 3700 14128 -23450 -51357 -56855 -60378 -25163 759 24348 -16577 -37202 -12661
21971 -12661 -24750 -53104 -35649 -197 -20282 -50540 -67229 -76421 -37189 -3280 -19036 -10941
21959 -10941 -8134 -14202 -24994 -12508 -32609 -64557 -57531 -24503 -91 32541 28101 -33798
21947 -33798 -71830 -68544 -47203 -44757 -37654 30707 50691 26223 -34462 8050 -1880 -25089
21935 -25089 -2757 13 17003 19806 -31669 -71085 -101552 -133775 -131923 -102267 -66363 -42474
21923 -42474 -39478 20244 76098 62926 32344 11373 -855 -18740 -1548 22003 33211 22060
21911 22060 20012 19550 24548 8652 -63756 -49488 -7909 -1203 4994 -21661 -11916 -28522 -20475
21898 -20475 -18528 14956 -4973 -60003 -68457 -55787 -58332 -39008 10572 55629 7912 -67626
21886 -67626 -52851 -37272 -25485 -13578 -18316 -13215 -6611 -11256 -15834 -15510 -5098 21738 32366
21873 32366 41581 36939 14826 -7813 -27977 -7345 -22322 -5624 32027 32414 29652 4459 -76785
21860 -76785 -22438 1595 -46777 -56648 -19356 -5603 -12722 -6965 50972 36135 -15103 -48264
21848 -48264 -64639 -70278 -45098 -46801 -18056 -49405 -56514 -29706 -39340 -60286 -23238 5044
21836 5044 17139 23831 10084 -16117 -12236 -33244 -22257 14657 18239 -15668 -34160 -21841
21824 -21841 -30519 -29450 33394 60822 38280 40717 -3823 -24642 -34046 -39139 -33613 -20534 -21214
21811 -21214 -34363 -11553 8896 -7889 -37164 -44832 29031 55563 -37202 -51294 -4906 -6997
21799 -6997 -64553 -71479 -57198 -30078 -18731 -21013 -46434 -59626 -24208 15607 32555 47382
21787 47382 8013 -31539 2267 33363 36645 9986 3657 -24717 -1323 54118 24203 -12401
21775 -12401 -6331 56052 48311 -27564 -59820 -61594 -42320 22996 39968 23194 -18912 -72298
21763 -72298 -94035 -97630 -69030 -81090 -36334 -21735 13006 44263 57325 54685 46873 -58103
21751 -58103 -54741 -7707 378 25254 19313 -5434 64343 69976 84845 111483 118866 67326 -17451
21738 -17451 -64220 -7033 33510 26786 57617 54074 6826 -29685 701 26498 -463 -30214
21726 -30214 -57392 -26633 -6588 -19015 -33812 -22232 -24158 -1183 10299 4922 16795 35385
21714 35385 73156 56971 79418 90858 40643 -5720 -66004 -71159 -37267 43745 50178 1656
21702 1656 4388 68611 60092 39018 67662 93065 93018 96966 65101 46139 58834 20150 5265
21689 5265 171 8650 -19767 8388 2073 -16079 13745 -30597 -76919 -44272 -22309 4614
21677 4614 36708 43285 52121 38066 -5063 -58354 -80264 -108982 -142122 -131424 -56452 20170
21665 20170 70608 64639 49966 41532 4673 -9368 -340 -9312 31133 -3785 3525 24041 10598
21652 10598 3008 25966 22099 10268 207 36301 -22408 -27558 -26352 45648 48686 18233 14235
21639 14235 43925 76190 39660 27287 21087 40583 26872 36216 47936 43970 31466 29717
21627 29717 14231 -68968 -108010 -80650 -42797 -39063 -15684 4060 2781 -49826 -37305 -41900
21615 -41900 -47281 -33452 1832 52403 32121 7876 5766 65776 80917 96899 91875 56767
21603 56767 21425 53223 55387 44829 25341 20282 -4389 -17077 7271 5336 510 21234
21591 21234 18750 18930 14830 11941 -4262 -8107 -28857 -44017 -65010 -21066 -7080 -5123 -45000
21578 -45000 -53583 -66587 1690 29958 47409 29180 -4986 -33655 -32031 -4942 13501 3769
21566 3769 28509 34293 440 11838 -44584 -94468 -87068 -55052 -45955 -34659 6614 24164
21554 24164 13048 -31846 -22092 -1799 -11528 11127 6544 -9045 -39825 -83830 -50832 -23061
21542 -23061 -3533 26285 72544 71411 74852 69279 17077 33137 22615 40620 36170 -742
21530 -742 -15263 -1726 -7119 -4258 -40664 -44219 -33245 -46685 -66942 -63343 -74923 -73215 -76912
21517 -76912 -78450 -255 -46310 -61909 -57408 -70416 -36943 -17306 -28485 -35855 -5268 1236
21505 1236 -15713 -10727 6814 20526 19103 33679 31429 29554 -7207 -20773 15356 57320 20533
21492 20533 36304 36376 23908 16522 -10319 -5313 16885 12537 36877 18531 -56412 -28863 20929
21479 20929 63831 53000 21896 5921 33117 43719 11977 8275 24069 -7423 -6727 -2736
21467 -2736 -25387 -1504 -15471 22665 41754 2809 -22648 -56792 -71553 -35298 -38582 -54295
21455 -54295 -28119 9163 47895 58740 35508 -6030 -9801 -4449 -68282 -81263 -47529 -27209
21443 -27209 -24065 -6828 -7425 -41951 -43776 44793 67519 13232 -35533 -18315 -18746 -50837 -39377
21430 -39377 -6940 19094 -18596 -54676 -61951 -41949 16808 92883 54469 59765 109027 74463
21418 74463 49243 46744 38254 38973 81693 103166 64021 52991 -2720 -31979 -73018 -95617
21406 -95617 -96427 -72292 -37558 19314 -4946 -26618 -32823 -81127 -98376 -95730 -66840 -47150
21394 -47150 6470 12420 -38660 -79952 -75014 -52274 -40261 -26080 -2056 12222 2940 -4922
21382 -4922 17148 28061 8620 -2345 2690 3511 -26261 -24233 -40023 -10558 -11806 -90285 -90150
21369 -90150 -88831 -67642 1745 57274 98656 109599 60643 34321 50547 74217 63736 62028
21357 62028 76011 69641 40352 15742 32207 36116 -966 -31334 -55964 -30644 -11222 6737
21345 6737 6855 -48593 -20678 14366 32641 82325 42728 992 10787 15487 5607 -50351 -146260
21332 -146260 -123616 -6006 -17229 -41212 -16735 -1697 19571 -10664 -40341 -50845 -22331
21321 -22331 34690 47217 22472 -26352 -10533 69194 74785 42878 6784 -8712 -57545 -54421
21309 -54421 41440 103174 53882 4500 36139 38011 54416 78657 68154 48676 23748 21645
21297 21645 46542 39799 14180 5901 6391 -35666 -65431 -54395 -26317 -12420 -39108 -14373
21285 -14373 42781 80364 92089 63985 36708 40033 35508 -25730 -37129 -40622 -44786 -28161
21273 -28161 -8551 31517 50390 44720 88346 80641 44627 8983 -32034 -52333 -50669 -47090
21261 -47090 816 7484 -2333 34806 82370 56002 35020 53867 41655 76008 93807 64855
21249 64855 91492 64275 33669 -8506 -31917 4941 19137 24982 39362 18240 59029 18639
21237 18639 -44881 26148 66474 85876 -3851 -21740 21986 81719 79478 55486 2524 42044
21225 42044 4464 7346 29478 48000 69687 72061 74352 68683 29953 53918 95720 73946
21213 73946 87414 71248 58713 80483 57233 6041 -38883 -59655 -91214 -100345 -78684 -57078
21201 -57078 -55035 -75275 -67422 -69791 -66300 -56178 -27801 -23515 -41849 -1194 48491 82742 46462
21188 46462 50944 36954 16205 -24902 -28491 -9757 -12930 9513 -13790 -20031 -29885 -4922 22747
21175 22747 1802 -18354 -44194 -42154 -9821 14071 -11656 3311 7914 15447 40166 59719
21163 59719 110454 85013 25295 -38290 -57482 -16039 -6905 -81163 -116148 -112572 -89822 4119
21151 4119 37666 -2623 5597 35026 14267 -4326 -13993 -49357 -119211 -124027 -80474 -104433
21139 -104433 -76109 -2181 -25210 -44665 -1213 24933 35361 33466 15318 6007 -40009 -40383
21127 -40383 -18139 -10424 -43357 -20307 -2519 10720 23760 6643 -23584 12487 22568 25494
21115 25494 93986 61330 52709 45634 4047 -6676 -40178 -94620 -25061 31970 27686 -21159
21103 -21159 -47149 -65951 -91511 -92966 -57544 -2517 52881 57393 14965 26280 25168 15721
21091 15721 43054 30522 15911 4599 27900 31883 4097 -25296 -15070 -30372 -36535 -39869
21079 -39869 -1031 7450 5312 23531 32051 91251 100285 102885 87913 30044 30521 12594 -22657
21066 -22657 4457 4979 -20900 -29002 -11714 -1865 4914 9381 13414 4387 -9033 -39637 -36212
21053 -36212 5900 -1577 -14290 -36727 -77128 -80771 -44561 -28025 -19090 1995 -659 10119
21041 10119 37783 22086 38070 26834 -5056 -44116 -50514 -34014 -16143 -55672 -67987 -90378
21029 -90378 -92789 -119363 -130759 -79330 -48193 -617 11199 3765 -26748 -16113 -10230 25815
21017 25815 2343 11545 38292 41637 13824 -4000 -28660 -1259 41681 59085 48464 -4808
21005 -4808 16915 28810 96296 84016 61935 2599 14591 48071 62992 76499 41718 -27003
20993 -27003 -75290 -26479 34060 65917 77445 25067 4529 -9557 -7264 40730 33580 66414
20981 66414 50520 -14876 -60884 -120588 -116799 -139465 -120466 -90195 -102328 -108525 -42079 -30331
20969 -30331 -39379 -16586 -39825 -59304 -52557 -27047 36928 51166 14926 -21829 -21471 -2118
20957 -2118 -16125 -51830 -53517 -36664 -41604 -54561 -92107 -81778 -33819 43106 43420 45965 88384
20944 88384 61562 44401 46179 68306 33915 7809 -13155 2063 -56490 -81461 -28248 32186
20932 32186 46720 42649 32965 16647 -26053 -41995 8933 571 -35061 -43672 35794 71676
20920 71676 110731 106906 83717 26083 -17417 -24914 19537 25559 -26691 -51986 -48083 -958
20908 -958 -9662 -34131 -43018 -46889 -39164 -21512 -14613 24375 11611 7808 -2813 -15351 -39776
20895 -39776 -37684 -20648 32190 64159 292 -30974 -85383 -92749 -32390 -6468 -14525 -24640
20883 -24640 1086 33035 21237 -11563 -7570 -35523 -69672 -70836 -17682 -9248 -43184 -34930
20871 -34930 -26696 -463 27700 21770 1118 4368 -37450 -44880 -4798 54116 44231 -6623 -46934
20858 -46934 -81699 -26396 5551 -18290 -40071 -26912 -41842 -74846 -54241 -5965 15000 516
20846 516 24463 36118 -30737 -29260 -39606 -57821 -69930 -51767 -54055 -69512 -59807 -41630 -10856
20833 -10856 33525 30241 3628 -31502 -5663 -397 -21392 -63854 -95207 -61455 -91842 -132224
20821 -132224 -43869 7476 26744 4575 14035 -24195 -21456 -20444 -73428 -53987 -33688 -25450
20809 -25450 -1697 35678 34803 11891 9085 7782 77851 105638 94674 57340 21636 56890
20797 56890 64034 40108 18258 -917 -15607 -42552 -67076 -81245 -31315 -5723 22490 38877
20785 38877 29903 5866 10191 20061 26718 -15052 -47901 -39566 -14386 -5534 -57382 -64988 -18724
20772 -18724 8598 -44890 -74138 -54500 -28312 -4410 3881 2122 -9549 -6375 -14844 -28844
20760 -28844 3550 12854 -17855 19838 32441 13972 -16618 -59518 -40608 -31382 7186 17548
20748 17548 17297 -530 5532 28823 64997 47010 -9108 17776 77778 78578 3425 18790 67867
20735 67867 63564 1504 24912 46526 -1318 -46857 -65642 -50437 -62182 -77425 -80140 -59659
20723 -59659 -58242 -49281 23140 105765 106352 64505 47865 97691 109549 82003 -28794 -76185
20711 -76185 -100227 -73624 -22930 36003 32287 -43441 -69670 -40865 -36859 -75546 -73423 -641
20699 -641 78233 23747 -10409 15963 32196 62519 70928 34315 24749 70845 76681 27234 12435
20686 12435 22059 3072 -789 -76746 -82882 -56446 -8186 -20485 26880 28105 31207 -1003 44803
20673 44803 75318 68192 17386 -147 19916 -3177 -17241 -637 -76865 -119280 -99349 -10201
20661 -10201 40830 30697 31841 36090 43347 25158 -58670 -71899 7478 51067 40816 -3581
20649 -3581 -63289 -84089 -66358 -60452 -55411 7580 57847 111791 82595 52712 -27248 -54714
20637 -54714 -4770 45965 28510 -38677 -54043 -56345 -56538 -52539 -32719 -1326 -5542 16828 35455
20624 35455 31066 3612 -38949 -33058 -7782 -26055 -54277 -43945 -35243 -47977 -49912 -86365
20612 -86365 -16425 19276 24860 86560 105518 65701 -15986 -26536 -14601 -7694 12432 10027
20600 10027 10874 31295 79027 67728 98867 96599 25613 56704 89697 48278 37884 46992
20588 46992 -859 23081 47163 37411 6220 -41927 -45597 -19658 -30813 30476 106161 122673
20576 122673 91685 82371 57521 26761 32508 25920 35720 27803 8037 -18843 -38248 -44537 -13017
20563 -13017 3803 42429 88414 41160 6972 -10342 -41399 -24942 30245 47520 32736 22342
20551 22342 43030 46195 18799 12311 1325 -26346 -35662 -24068 -37738 -46954 -37010 -16491 3109
20538 3109 -21262 -44842 -18288 15444 30821 50877 149682 120877 36354 -6180 3418 8601
20526 8601 23950 38954 29125 23442 67750 67520 43817 1432 -14969 25489 27643 28018 49274
20513 49274 88347 49258 63934 101216 73389 11290 -30527 -7264 16887 -2761 3426 9474
20501 9474 34445 76828 79142 60668 51533 56544 49223 45858 38966 50029 20721 -9068 -4978
20488 -4978 34239 -11318 -25032 -1493 46163 31976 -3324 30279 31447 53818 47368 46993 -7431
20475 -7431 -16729 5607 21772 -4448 1178 40258 89167 103092 124746 112385 41915 -27936
20463 -27936 -90037 -45265 -29049 -30645 -36687 -48720 -16694 -12076 -27073 -9712 -35538 -53398
20451 -53398 -33676 -2254 30711 65596 91468 84368 77971 29910 19117 25858 22017 25014 26582
20438 26582 37784 37774 18061 -1314 9898 10508 36161 3222 -27282 -39538 -21090 -15133 -27009
20425 -27009 -42674 -43114 19441 41194 27713 20268 30013 52357 11077 -75517 -97970 -92029 -75974
20412 -75974 -60417 -7804 36216 56288 -3947 -41190 -23327 -30549 -3735 11726 -11969 -4370
20400 -4370 -25939 52436 95358 68152 61809 17861 6053 -22655 -3551 -47966 -67226 -39208
20388 -39208 -16957 -657 -17778 16056 59021 58766 44639 71679 82727 44652 -19870 -20276
20376 -20276 29012 28208 36686 87045 88542 47776 -23184 -28432 -10873 -10468 2322 -30801 -58687
20363 -58687 -38172 -13810 29222 -4478 -60843 -78951 -70467 -90163 -108804 -114287 -58171 -20718
20351 -20718 -68381 -141881 -151654 -214957 -198206 -174126 -89868 -53606 -72422 -55511 -37170 1135
20339 1135 -27779 -23711 -10951 -36583 -7422 27961 63439 34822 12666 53263 47450 -3285
20327 -3285 -39279 -61492 -7832 46913 53580 28048 -17492 -10699 20339 -5775 23435 66269
20315 66269 57524 39027 57068 44454 72645 49848 31836 18885 27725 1637 -53199 -50370
20303 -50370 -36414 -4137 35186 10881 32421 29789 17870 -14490 -56178 -13122 -21170 6876
20291 6876 21457 5999 7072 23696 26177 94991 144554 150092 192820 238684 239765 236868 274742
20278 274742 323537 351646 349884 332601 304583 288764 276681 246648 260182 339226 364090 366039
20266 366039 342704 309287 308607 276026 230660 182975 154271 104690 73808 74479 17671 -35699
20254 -35699 -45135 -46267 -28734 32690 68187 60274 27549 41127 -13106 -26862 6020 -29150
20242 -29150 -33241 27624 47813 45797 30183 -9811 -17658 -13518 -32445 -20489 18334 1991
20230 1991 -9616 39567 38769 35041 24301 14751 52192 58355 36130 29151 44886 52067 45854
20217 45854 34385 5686 -485 32469 103867 115865 36738 -29398 -57369 -32349 -424 47918
20205 47918 82984 63443 10913 -3069 4619 -28998 -5734 -10750 -27069 -45093 -5065 -51016
20193 -51016 -60190 -58310 -99333 -147567 -88482 -79931 -66877 -2693 23572 10734 12979 16086 -4905
20180 -4905 -21798 -18022 -45325 -36398 -4285 25984 83856 81591 82706 152564 102201 62336 83617
20167 83617 68069 71447 96457 35548 -20879 -16525 42094 57468 24554 16405 28923 20541
20155 20541 19579 41307 2214 -17622 -10398 27920 31611 -24104 -18770 21305 33571 37135 15233
20142 15233 30405 64845 37679 3587 -55929 -32660 -15372 69887 53892 -5662 -29166 1185
20130 1185 10535 -9149 13902 12894 30742 3285 -31501 -58815 -63837 -65785 -8938 22411 43430
20117 43430 39938 46050 59000 54939 79772 51383 -36967 -28268 1210 -11814 24011 37389
20105 37389 1986 6433 -19205 -13568 34876 46387 47988 -41109 -86220 -41868 -26935 -23013
20093 -23013 30047 56660 34647 10488 -8744 -32490 -38895 -12667 7030 -278 6169 10569
20081 10569 7702 -11339 -4842 5180 2061 5947 -25772 -53274 -44554 -7051 30203 -23489 -76620
20068 -76620 -33962 -5698 33240 68380 81061 67340 90510 86780 52370 -29018 -59372 32200
20056 32200 117138 78615 86794 111982 102553 92872 116666 48987 -11366 -33344 -10096 34294
20044 34294 29571 -3384 6552 -26467 -51106 -18263 -5456 25718 41755 27144 -15167 18647
20032 18647 66267 70291 63617 46349 57950 39831 53159 93334 32877 41213 68707 103267
20020 103267 140559 133732 85335 65907 102838 119134 108509 101347 88591 110518 64129 90988
20008 90988 100273 106386 107176 103193 115061 84843 70905 62560 70777 121859 92328 114693 123462
19995 123462 96639 62724 -18145 -16837 28614 89827 23741 38654 75422 43942 12726 -18067
19983 -18067 -20714 15928 75100 72287 47504 33857 35600 55979 43642 40728 87096 90389 29090
19970 29090 -11647 36537 52341 32305 36223 76882 56656 7125 -8254 19662 48623 39686
19958 39686 77277 82574 52102 64755 77398 128432 125852 45406 46058 92970 161605 230569
19946 230569 185437 175460 163339 92702 83070 133821 201065 242982 164874 127729 153035 128704
19934 128704 144248 131947 93935 73660 86209 77518 127116 210630 233240 233098 214504 188479
19922 188479 149145 102029 76877 82458 102695 122367 87619 69202 90456 99621 140979 137657
19910 137657 74599 87237 156145 170949 140877 144298 160501 96963 53888 90072 62554 82799
19898 82799 174036 171191 143745 98254 94796 174399 187085 203756 254917 212891 199920 134355
19886 134355 93317 70692 91270 104525 161221 171616 114292 130620 141562 143242 134541 147117
19874 147117 179300 194705 193621 137251 86582 126192 183402 196066 168259 147962 125015 144097
19862 144097 138278 124910 119874 97994 119044 197720 239549 253989 263047 249617 236503 232765
19850 232765 206561 205545 213133 205310 178694 197391 240276 278985 289045 313790 375396 436840
19838 436840 527716 675321 812798 907609 1063187 1295727 1471707 1533490 1589460 1517573
19828 1517573 1432722 1315385 1181404 1080457 1085324 1166461 1288670 1463346 1595361 1648844
19818 1648844 1583453 1519681 1507898 1381086 1114840 882911 735291 682413 687968 693632 639821
19807 639821 562591 585386 683787 765503 848913 939164 1042525 1242653 1366021 1404815 1438103
19796 1438103 1515698 1601989 1645240 1691555 1655291 1582997 1651588 1772683 2020266 2237366 2334471
19785 2334471 2424285 2522398 2677119 2845162 3050069 3174890 3365306 3755654 4378882 5407533
19775 5407533 6991307 9086367 11487450 14248852 17882086 23364344 31017990 39425191
19767 39425191 45865133 49349695 50329485 50849682 50279195 47771096 42550638 36846612
19759 36846612 33576987 34554211 39667067 46375678 51153446 52900537 51993509 50310193
19751 50310193 47064600 41276029 32526432 23381815 15999315 10990922 8083661 6341156
19743 6341156 5233485 4529810 3958093 3476091 3048029 2655100 2365791 2167828 1963923
19734 1963923 1743470 1587235 1455255 1347100 1298842 1221609 1175004 1128049 992277 908746
19724 908746 938156 926140 849393 766195 650801 531753 491841 520755 500534 441437 471184
19713 471184 477413 440861 394852 414097 409992 365077 393245 385137 347098 315392 260383 190777
19701 190777 113044 63321 108628 132947 98298 117176 144415 157282 224096 259013 256949 229742
19689 229742 200238 136724 134962 158406 128337 63984 50063 60434 100434 97834 105004 136461
19677 136461 107563 63247 53244 71650 71220 52224 83843 52107 8535 56148 63516 90869
19665 90869 99792 40747 57918 88624 90253 86248 112660 72690 -30210 -47954 1670 -5842
19653 -5842 -931 -56310 -80660 -52548 -10454 14063 3014 48289 53737 59545 41134 53351
19641 53351 66228 120644 143228 110474 73089 54686 64356 56767 54822 73283 -21753 -56703
19629 -56703 8304 76263 77072 78117 40498 -7563 -24701 27638 40098 73747 93689 66485
19617 66485 18470 13858 -6926 -2178 17788 -15779 -38507 -2788 -11770 9602 9485 37981 69526
19604 69526 70453 105020 89239 74700 25517 15957 805 13624 21032 -17068 -47791 -65410
19592 -65410 -26484 28787 35335 -18070 29610 56205 44948 23099 15438 19563 41004 43822
19580 43822 55670 65068 14644 7232 31918 77314 58329 -7600 -3060 43386 54519 57557
19568 57557 34005 41623 74387 83704 94027 94992 35943 29411 46513 105723 122176 56648 -20311
19555 -20311 9233 35224 14990 13993 35691 24717 -56035 -42029 -7922 -417 37771 62983
19543 62983 72957 36452 -9232 -32985 -17102 40150 88982 134751 105744 37036 31584 57976
19531 57976 69778 55040 -4003 -81134 -67150 -10724 -1785 -23053 -21728 -61548 -45568 -29827
19519 -29827 8519 53475 27772 -40521 -86475 -87847 -31566 25101 68578 101870 132576 141542
19507 141542 137869 115656 73908 59057 57763 82814 79690 50618 66236 57411 24153 59659
19495 59659 59738 61659 80884 70916 75348 114294 166631 300483 368684 392336 392966 394992 368920
19482 368920 305493 226883 200725 160797 137316 146029 179608 223684 249620 260976 265246 322986
19470 322986 386516 310824 279804 254608 222319 162303 86441 5113 -7958 -17542 22136 71117
19458 71117 98235 21303 -3841 50957 76412 64908 72738 67556 68648 103274 110358 74901
19446 74901 26800 -23686 -5120 30737 26803 28470 14257 33087 37117 29396 34816 27800 73966
19433 73966 124882 132499 130903 139515 145371 95508 58809 79570 66858 54424 44145 50914 81825
19420 81825 112403 84735 78213 101812 68345 38410 83436 137679 96784 124980 134986 95885
19408 95885 35192 29192 59725 86059 89946 66349 15221 21388 80527 120207 170656 143680
19396 143680 70977 26343 41732 56020 113399 143102 137111 65279 80926 128517 178006 199778
19384 199778 203440 207834 227911 216833 245581 242065 226752 201608 149852 129813 136734 170634
19372 170634 223225 216143 188803 148811 164950 246207 242991 217878 224372 237094 246701 240063
19360 240063 232720 225067 187835 177666 153928 105798 136955 135182 135048 163493 182803 151831
19348 151831 129252 134271 168557 204244 162753 129412 147644 167608 216861 285524 339613 360158
19336 360158 388278 394592 402886 457072 474331 485527 503224 468248 468620 499712 493474 519526
19324 519526 616551 760456 920772 1045904 1174750 1267970 1423966 1619868 1692427 1657977
19314 1657977 1611450 1623270 1701703 1867003 2102533 2432503 2935550 3717345 4963665 6641714
19304 6641714 8328353 10231248 12574817 15783363 20674151 26424479 30043600 31143624
19296 31143624 29013486 23885685 18827166 15240085 13492686 13392686 14624438 17150179
19288 17150179 21438991 26286064 28833580 29009308 25880573 19964929 13974901 9209344
19280 9209344 6279465 4709688 3761584 3144967 2744718 2460937 2227857 2037853 1857984
19271 1857984 1727198 1651664 1631705 1713442 1866200 2016743 2176662 2302209 2378926 2470650
19261 2470650 2506926 2521022 2461068 2411067 2428933 2580245 2876776 3276407 3835503 4697183
19251 4697183 6022206 7926139 10045178 12258254 14970461 18470077 23662729 30306768
19243 30306768 35108211 36944719 35386743 29755260 23638705 18965949 16540376 16184708
19235 16184708 17431351 20038607 24565264 30323658 33903774 34567392 31644573 24915998
19227 24915998 17668789 11587006 7586673 5263448 3958052 3177252 2721449 2387345
19219 2387345 2155644 1934377 1644626 1396645 1156612 1031626 929458 888288 880235 822966
19209 822966 825793 820216 751412 730678 661860 631691 638658 674710 681234 660179 680945 622371
19197 622371 525356 470933 432983 449706 430579 398272 369064 363606 340700 335074 287231 233455
19185 233455 192340 169361 178972 201365 223741 192896 243507 228727 154067 142024 196987 249527
19173 249527 302855 349685 370596 374986 374947 388612 417141 457143 408641 344216 351020 353988 285372
19160 285372 247958 205607 140414 141351 138380 127563 70227 13981 8852 56950 75354 62561
19148 62561 97713 99080 80533 127135 103458 74466 67970 94465 93838 112920 78353 57861
19136 57861 61137 60829 53081 57526 18797 -4263 -14920 -6162 42937 68182 64820 76328 109042
19123 109042 119815 113253 88019 65540 54298 53216 32016 95483 174978 235302 233702 170687
19111 170687 127098 116468 88511 129901 142333 153316 110849 51063 76785 144453 102315
19100 102315 51354 65379 95025 89920 67353 52778 40839 55449 55957 47278 56266 41055
19088 41055 48000 71338 49723 35907 40537 82810 54771 29270 8537 14429 29201 72658
19076 72658 114597 124199 154944 175097 142879 71950 31154 -22190 -73919 -46581 -43940 71
19064 71 38764 35601 53486 32528 35678 37792 65096 98360 64541 10100 9719 23857 40929
19051 40929 14386 -2542 -14170 -4939 -27919 -18811 -4041 7653 17898 69870 54975 51490
19039 51490 97587 93883 82606 99979 31889 15553 12379 -33344 -30335 -32556 15042 64907
19027 64907 80115 75917 16986 -38078 -3179 43489 20736 -967 -13159 -22954 -24669 -56830
19015 -56830 -48120 -49289 -44550 1303 6549 -26543 -28554 53328 65552 68486 41897 -2990 -25366
19002 -25366 -54961 -30877 -14235 -32212 53825 82097 97439 73921 8143 -39720 -15078 47964
18990 47964 57676 75158 78151 135049 132287 97930 88587 98914 75931 80872 89619 86593 93423
18977 93423 83382 39605 60081 110777 94645 53329 80965 114883 183081 166698 119043 103112
18965 103112 42906 52187 66298 98953 42101 43469 89968 97200 62926 -29839 -28840 29709
18953 29709 79316 66811 83022 81817 93863 64034 22379 75989 128829 167256 146116 77136
18941 77136 60645 49832 65792 64599 65984 61011 96858 134204 151970 182294 115379 91759
18929 91759 90238 81894 141965 131908 150329 145878 152062 119068 76674 92557 89368 122253 111050
18916 111050 77542 99717 98648 124069 144800 159239 147056 159661 207646 219766 242799 226882
18904 226882 189316 189335 200972 239475 283253 276317 291479 308420 293256 276411 267972 217762
18892 217762 253145 317050 346452 358220 400102 438856 532517 628016 706974 725672 733192 730453
18880 730453 667584 582085 526187 543697 617398 718368 818296 945383 1136004 1280678 1405362
18869 1405362 1516915 1657479 1765912 1783755 1774151 1794152 1790502 1866159 2001283 2142138 2368896
18858 2368896 2691447 3229074 4040988 5262742 7195880 9973584 13155474 16966745 21263431
18849 21263431 27069719 35466538 45812309 55102839 61712544 60584907 53898903 42981140
18841 42981140 31818167 24029342 20196240 19650363 21283151 24287896 28766258 35900129
18833 35900129 45672935 55052288 62292235 62893914 56572817 45742588 32614114 21983163
18825 21983163 14470601 10065254 7557641 6094446 5075428 4321683 3782348 3382832
18817 3382832 3228495 3120202 3015274 2899000 2801397 2823160 2870390 3016061 3193548 3280762
18807 3280762 3180273 2937511 2561247 2133943 1783832 1578807 1488259 1407884 1372167 1348829
18797 1348829 1473090 1615585 1859216 2058902 2114781 2071151 1896271 1610879 1355750 1130554
18787 1130554 957052 796092 678462 553703 450761 391227 351642 337217 357429 358691
18777 358691 299377 285774 316309 348428 356330 392692 465456 501513 498998 541010 662694 789194
18765 789194 793472 650221 481241 333338 269084 246921 239266 228536 240221 273420 277909
18754 277909 307994 264948 219568 202412 197762 170929 143828 114412 98358 76083 89806 115132
18742 115132 121321 114190 144632 160080 169685 201267 197749 183266 168412 206580 321838 418153
18730 418153 391373 365071 365770 374763 398535 332969 312254 310308 259070 229324 275623 337582
18718 337582 369629 422983 392533 350121 288805 230233 208386 214546 228429 200617 188308 228935
18706 228935 266521 221542 211501 261696 218790 180563 155027 197677 197416 185062 225196 278395
18694 278395 283598 269150 269080 274515 319021 354421 358018 344778 369849 439474 469916 490037 511645
18681 511645 534422 599784 654371 703153 804888 922862 1052195 1228401 1326889 1399559 1541143
18670 1541143 1691932 1804835 1941404 2052717 2094232 2259521 2467927 2699752 3073682 3684491
18660 3684491 4642348 6102090 7726930 9290505 11637518 15512433 21204640 28090211
18652 28090211 33113161 34131998 35083555 38295657 42600550 44034206 42699644 37431066
18644 37431066 32808699 30337640 28919854 24460733 18560947 12786186 8682235 6236996
18636 6236996 4754684 3883470 3320152 2836230 2469147 2180310 1976852 1843605 1710257
18627 1710257 1596756 1544922 1492994 1440688 1413321 1444075 1518429 1624493 1676049 1680451 1714496
18616 1714496 1823527 1922896 2001354 2016810 2017583 2030320 2157844 2326059 2518624 2746521 3193690
18605 3193690 3930013 5050665 6409957 7726744 9462843 12415846 16923543 22597360
18597 22597360 27465152 28726744 29270741 31570974 35501613 37285094 36809637 32756262
18589 32756262 28580469 26263379 25434823 22319517 17341443 12347468 8687043 6487652
18581 6487652 5188745 4340131 3742300 3265481 2862187 2516011 2148517 1863819 1570577
18572 1570577 1335793 1188347 1094186 1019089 948304 864216 816911 745417 714117 634425 567337
18561 567337 496244 446024 387222 368286 353631 323192 268667 293705 310894 302041 255735 252938
18549 252938 196325 197870 251198 253941 191201 163908 167564 170891 160887 176418 205770 168357
18537 168357 226542 290760 333423 432629 553296 689373 785755 793899 830968 919351 1020754
18526 1020754 1044042 993167 877573 781750 689220 612258 522998 457147 346101 236347 198278
18515 198278 168759 136478 116375 129204 82443 108132 123153 144138 165713 106070 57060
18504 57060 12855 31934 31085 -1152 -7749 13968 26048 6877 -18630 -22388 -57391 -42949
18492 -42949 -81090 -96800 -64022 -48394 -12948 -16545 -20846 -51255 -82335 -104089 -86765 -30691
18480 -30691 33536 78655 50295 13008 20789 70269 71798 16272 7074 5865 -4348 24210
18468 24210 30657 16591 418 -50934 -32235 1948 10063 -981 13404 -21268 -61527 -30404
18456 -30404 25492 33539 -29087 -41351 -45138 -63611 -36674 -3182 -14583 -47567 -59091 -40781
18444 -40781 -19898 1727 13159 -47825 -44847 -21917 -27609 -28077 -33917 -25542 -17091 -32448 -48497
18431 -48497 -33950 -20968 11648 -5305 -36283 -33870 -7309 29997 2557 -6014 43682 27391
18419 27391 -25170 -70614 -51646 -93748 -135263 -87392 -71849 -42341 -48157 -41416 -2969 -19056
18407 -19056 -13750 457 18096 55657 50575 82704 44731 8375 27480 -6737 -13887 -14015 -14303
18394 -14303 -38489 -25461 -2294 -33663 -25337 -11885 -11766 5458 14103 6479 -22714 -67387 -10208
18381 -10208 4168 35372 30955 18143 17049 48522 72597 28965 -25791 -36249 -5850 25952
18369 25952 49314 60754 38598 -21504 -93099 -117790 -95970 -27356 15987 -14776 -45158 -40112
18357 -40112 -41355 -76160 -96579 -60415 -79452 -60396 -15881 -19965 -21895 -46018 -12456 38191
18345 38191 72747 97256 72318 -24727 -47682 -21116 13421 19384 45573 46047 -4768 -569
18333 -569 12600 84882 66837 37729 8279 9047 14209 1344 -15460 -10175 -24053 -8225 30978
18320 30978 31789 48920 67995 36007 42644 83878 56106 76709 56236 -6925 -41532 -9307
18308 -9307 -20787 -31013 -29852 2475 39093 13300 49662 104691 86695 32683 -13239 -1811
18296 -1811 6044 -23503 -64766 -75699 -92873 -118457 -67365 -21230 -25147 -6665 8519 21196
18284 21196 169 -8381 -19850 -71490 -66333 1600 35806 53637 11072 -78744 -112394 -102626
18272 -102626 -92765 -24698 16022 -9310 -32623 -19812 -11529 21300 31917 86643 71841 46236
18260 46236 38428 33138 9083 -21282 -56968 -1875 57901 60504 53647 22544 -6640 31270
18248 31270 54522 58597 56890 22690 30433 56932 74721 84326 37714 19826 64152 51004
18236 51004 43535 12482 -29423 -9980 -3212 -24309 -21249 -5348 36370 63510 51876 84654
18224 84654 83265 13942 -7448 20462 51864 44188 24478 9931 81631 118752 115081 139325
18212 139325 112380 89258 53522 94499 90244 73370 135133 176355 200228 206419 256080 236388
18200 236388 279756 342210 395635 436835 414848 403046 376535 294888 238238 190699 118112
18189 118112 107007 180312 220234 276512 352583 460497 437677 419422 379450 345438 285125
18178 285125 225312 221603 220919 230692 219396 176497 140890 159257 156856 105777 137746 176538
18166 176538 143744 110936 98321 113001 134118 163430 184582 185198 203122 183633 205275 175576
18154 175576 152834 129948 176801 272939 298676 239643 264677 313968 308747 288982 255195 227053
18142 227053 234908 261570 277881 293537 340805 445560 489378 526575 545643 624269 715752
18131 715752 724962 796081 925884 1010626 1132889 1273305 1499132 1761790 1976207 2179676
18121 2179676 2503326 3004419 3714860 4742376 6284518 9061251 13912515 21321553 27220710
18112 27220710 30452759 37279303 51212002 74866715 105672981 112033189 89245743
18105 89245743 59732924 34230787 20394391 13321553 9489268 7245922 5786265 4681727
18097 4681727 3842938 3159175 2670152 2306640 1976363 1761825 1550314 1452325 1385236 1253157
18087 1253157 1130665 1011335 929387 917740 923251 882178 800556 745285 668703 585210 606181
18076 606181 633016 617834 609196 622474 613549 581471 558729 539467 529210 486180 443757 393305
18064 393305 374434 400947 399212 324209 276474 276713 220673 178352 202752 192977 176440 144509
18052 144509 129790 137612 74216 76952 119968 124957 66219 95327 63130 35501 22848 29072
18040 29072 14637 70765 98059 118270 192716 177079 143869 166707 121284 85717 74184 76662
18028 76662 82144 23566 -6788 -31278 -32131 34867 93284 46596 40685 14846 19942 19429 54791
18015 54791 50109 25732 58785 61821 71083 87278 116655 108710 33589 19537 31028 24692 512
18002 512 -27115 -658 11978 6849 8912 -7715 -28726 -35612 -68146 -60623 -34401 -8962 -6868
17989 -6868 18692 56380 59840 31227 12848 14191 28714 72144 34751 8270 -15365 -54288
17977 -54288 -53740 -57358 -26840 44351 91817 82040 52260 54894 31837 60686 78313 98834 74966
17964 74966 63628 4401 -5209 6357 37480 19128 -32355 -23823 -23975 -26995 -37568 -10869 -3580
17951 -3580 -69956 -97766 -92025 -84522 -54189 -8137 38604 -6604 -36537 -69164 -82394 -52614
17939 -52614 -51955 -84554 -30153 -3935 -13154 -15122 -15428 8689 18369 7759 -4760 -9412 -49945
17926 -49945 -2788 69671 50379 19608 19627 -1631 -27147 -17525 15294 3129 5079 -14370 29866
17913 29866 48449 14929 3485 36074 29854 10994 34507 37784 31783 46123 43813 45627 25912
17900 25912 20846 1014 31375 63092 34543 -9694 -4543 -26351 -75171 -77101 -43589 -37975
17888 -37975 -44224 -5489 -4222 -30239 -15927 26054 53804 41694 49362 62625 30320 -3631
17876 -3631 -27796 -10349 -6397 4805 -14723 -44585 -53313 -23122 -29245 16518 73116 89270
17864 89270 89492 65349 50583 84815 49117 45211 47113 91393 60277 88395 81973 66696 32112
17851 32112 -2245 12642 106646 90151 18704 -47643 -49944 -39792 -26246 -84630 -74392 -12643
17839 -12643 3957 -44451 -56669 -91880 -64951 -13458 -33769 -48543 -9658 -26321 -24950 -3371
17827 -3371 21649 -1809 8537 -4954 -20987 -4707 19400 3274 5982 3517 8754 25853
17815 25853 -530 8986 -12321 8571 -10933 -37477 -58482 -72455 -69228 -46339 -6806 -3524
17803 -3524 -4964 -4232 -21498 21211 66032 66599 54619 68294 46649 2574 8284 63855 63213
17790 63213 31141 27170 13146 38957 48031 42455 38591 24152 -16312 -33821 7341 28334
17778 28334 -59718 -133651 -102632 -92870 -66942 -61036 -94687 -111869 -137627 -110868 -42048 -10542
17766 -10542 1715 37984 20026 -34419 -81912 -59759 -52860 -51293 -103378 -94307 -110197 -69070
17754 -69070 -45515 -14270 -34463 -42256 -18537 -23431 3251 47969 68451 85471 72189 63635
17742 63635 69273 62349 82939 53127 51856 19255 11615 45408 40723 71306 85893 86561 123876
17729 123876 90142 62811 47704 38689 50307 57723 94524 97921 32221 -6377 -27217 -38346
17717 -38346 -25510 2915 -1509 6986 -44500 -49357 -65628 -47476 -322 7330 -18270 -3847
17705 -3847 5111 37712 69830 50055 16545 -36961 -104609 -96137 -99748 -79797 -77217 -72298 -65054
17692 -65054 -12316 3529 13220 53254 46692 41101 24346 70493 73641 34891 42396 25092 -16855
17679 -16855 37582 68615 38975 33976 28485 28695 69158 74696 51628 -38018 -53552 -38669 8000
17666 8000 13473 9724 -9717 -19079 23182 35514 -34403 -32692 8481 35409 55982 74609 40361
17653 40361 2902 9103 44333 98626 173777 180419 140962 145997 194416 225290 232305 254590
17641 254590 237951 286337 346451 408092 504201 677259 896128 979908 932484 730736 547469
17630 547469 440470 365089 228339 142521 77339 49564 79323 52209 52128 135413 261766
17619 261766 234188 176529 144682 165439 169018 107732 122408 158379 178737 187544 131803 124014
17607 124014 138001 134039 181551 236532 244378 227474 159035 137388 113537 120684 175781 170930
17595 170930 162080 176694 177704 179008 213269 210959 165887 120033 107934 114617 101702 83992
17583 83992 114277 103563 124109 124732 116542 173798 213078 193349 189769 226345 214034 190745
17571 190745 215416 216921 217358 237544 240051 233352 312396 331973 331138 388257 461722 550532 641695
17558 641695 681255 658667 643009 661414 666933 772242 837683 804876 818934 903201 977344
17547 977344 1125322 1298163 1498202 1539675 1631140 1783124 2006510 2308015 2646576 2892451
17537 2892451 3257249 3894885 5055882 7054468 9715498 12054305 14178919 17698213
17529 17698213 23871712 33623321 44358789 48029535 43782343 37858778 35203415 38303180
17521 38303180 44762094 47110923 42652832 35376750 28683678 26064990 28143668 34792853
17513 34792853 44321915 49354624 45688224 38913237 34342132 35160122 40122693 42505981
17505 42505981 37036643 27689327 18461410 12141351 8601506 6485346 5141599 4232478
17497 4232478 3564510 3030512 2651514 2441724 2315876 2158993 2017052 1870878 1754421
17488 1754421 1637007 1528072 1439797 1412688 1404322 1425607 1416611 1428024 1546856 1798331 2000105
17477 2000105 1957517 1780381 1617278 1573385 1637269 1713824 1661506 1478896 1251382 1105443
17467 1105443 1085476 1156675 1322020 1437897 1375294 1270202 1179914 1131474 1197549 1259692 1165415
17456 1165415 897854 655253 530774 383191 266348 231030 246495 249286 268905 312531
17446 312531 309213 329678 406103 532227 696941 772456 654668 487696 356692 241071
17436 241071 200580 151964 167852 188526 123662 96657 151088 114666 98741 107255 79327 64097
17424 64097 54550 74036 75656 67355 67220 57681 54720 86006 61007 52363 63781 24239 15846
17411 15846 42234 15160 -4056 50621 66154 49414 55472 88161 33581 18694 -7853 -38742
17399 -38742 -10731 -2237 -11196 35810 45449 6911 -52091 -58686 -29992 -3147 -23323 -59551
17387 -59551 -75220 -33711 -5246 24025 10903 -15891 4594 43265 49317 12698 -22486 8212
17375 8212 -11921 -94907 -74805 -27208 10790 35677 12659 -5683 5735 28537 19767 29891
17363 29891 55457 38006 62692 90108 73518 109263 102099 71615 124285 222310 249101 260441
17351 260441 203356 86471 72172 120707 138898 100468 53850 -60177 -61860 -28380 28135
17340 28135 6429 -24591 -34180 -56915 -83443 -87159 -79905 -66354 -32831 8090 75312 35331
17328 35331 -8148 11153 64618 49969 10977 -28944 -29470 -54592 -38039 3937 -16640 3113
17316 3113 5199 22348 66690 67165 57917 13605 35184 108436 69623 5522 -57296 -103719 -79324
17303 -79324 -50173 -44213 -76896 -120321 -104682 -9093 29891 -19982 -31527 -28813 -38855 -32881
17291 -32881 -30093 -36491 -31361 -25907 -29326 -28129 -29186 -38487 -38230 -15124 -82249 -116542 -91562 -45886
17277 -45886 -50972 -65076 -37009 -62287 -86457 -32342 2845 -70768 -79518 -86568 -87178 -92583 -75021
17264 -75021 -107671 -104766 -56569 -31397 -10556 -26268 -16225 7350 34476 -4880 -28183 -59724
17252 -59724 -54155 -79441 -64178 -5911 -9261 -17851 -1362 -27476 -32224 -7442 8682 -18218
17240 -18218 2865 7731 -1026 4790 -2858 5581 -3671 68 93333 137252 64371 27136 50830
17227 50830 60427 15934 14583 -27545 -29286 -25536 -15254 -43137 -38612 -40270 -32464 -17567 9679
17214 9679 13109 -9978 -35299 -15373 -1764 43581 36437 -13491 -24906 -29383 -38747 -123759 -104240
17201 -104240 -22909 -21825 15383 68739 39614 -11945 -14809 -42960 -54537 -67979 -59410 -74460
17189 -74460 -51484 -18571 -20477 8709 27317 -1357 1871 16887 6158 4320 51100 42503
17177 42503 36136 35346 29239 61727 43681 49724 149102 241434 369930 395340 425671 551866
17165 551866 743979 1089486 1475415 1745013 1705419 1360634 941827 566284 355584 253380
17155 253380 179590 72574 5213 -59167 -66525 -33428 -20304 -11471 -3364 -41302 -66898 -82406
17143 -82406 -68215 -58546 -70258 -36881 -49514 -79675 -14484 -37943 -50691 -38920 -18439 -19606
17131 -19606 -16948 11847 39650 58386 49504 22368 -16082 -16993 -22547 -20428 38843 58174 67556
17118 67556 58344 39457 30239 16205 -4967 -24762 22981 -4282 -25282 -15632 197 25834
17106 25834 23931 15245 -42589 -82265 -91470 -63327 -23100 -13766 -11796 -5250 -15143 -37018 -18245
17093 -18245 -83084 -144376 -130794 -109648 -56645 -63113 -70991 -54666 -55048 -46761 -7964 53999 45272
17080 45272 10800 1632 -28442 -93737 -98170 10119 10349 -37673 -15247 -13889 -54970 -48592 11062
17067 11062 16296 -18396 -20011 1257 -2378 11166 -10152 -115318 -159645 -96197 -16694 -28991
17055 -28991 -67335 -125861 -152692 -169511 -121955 -49847 -25387 -12392 36797 48406 29347 -11705
17043 -11705 -22093 -11911 -147 -9489 -30685 -101137 -86430 -55610 -27478 -19186 -17586 -34406
17031 -34406 20104 37650 -51066 -78264 -28395 -42546 -80803 -79158 -17874 35970 36672 46484
17019 46484 -26523 -67385 -85152 -44667 -39015 -91925 -132618 -175821 -172576 -133897 -70722 -72477
17007 -72477 -77088 -94291 -89822 -97566 -62352 -37628 -82348 -99993 -98298 -133386 -122261 -83755
16995 -83755 -59434 -18860 7883 7861 -15906 14846 18700 11467 4557 12078 -28665 -15004 37342
16982 37342 10216 7124 700 44185 60884 15192 65525 90409 88447 116269 95099 63712
16970 63712 85509 61708 42236 20157 -5546 60928 136067 128037 91760 110861 136363 161781
16958 161781 233361 263235 240068 246125 205117 214752 235403 266624 274341 229866 185536 152282
16946 152282 133354 150687 167578 238463 262118 241186 224892 238499 286834 261252 224374
16935 224374 153868 60380 44776 58200 76311 95283 106382 84271 84921 90955 48747 14294
16923 14294 19676 55950 52990 33986 -1175 22279 64045 34467 -23287 -29608 -3197 -15165
16911 -15165 -17054 -47515 -78743 -95245 -123341 -147373 -93627 -150647 -151435 -98713 -29860 -19370
16899 -19370 -47440 36725 87274 32844 -48485 -113701 -144260 -148255 -128611 -54850 -41201 -25901
16887 -25901 10365 48018 22397 7512 30109 40820 27905 -11594 -56998 -29757 -424 18915
16875 18915 34249 41584 27522 13764 -8915 -9522 -7308 -9938 13178 34087 24578 60771 6758
16862 6758 18510 -21293 -43993 -41177 -39759 -44043 -434 -19662 -67144 -69720 -18699 15123 58868
16849 58868 24648 -6416 5427 2754 -30035 -40892 -26907 -68915 -67481 -82008 -71744 -67030
16837 -67030 -96737 -38462 16538 33699 49641 13553 -74145 -24155 25834 24332 51585 16278
16825 16278 -69270 -81801 -105050 -119760 -122700 -110660 -125000 -164021 -127647 -36954 -31296 -46000
16813 -46000 -60817 -56356 -61384 -91432 -76586 -3859 -14941 -23312 5367 43926 26437 -10484
16801 -10484 22637 48427 -31511 -79954 -63014 -65285 -62652 -38448 -40899 -14397 6202 9473
16789 9473 51584 38860 34439 35986 55830 7283 58273 90221 32169 26210 27899 25090 1555
16776 1555 -5701 4178 -12000 4431 -23162 -84807 -77451 -75920 -133779 -124474 -65540 -50300 -26221
16763 -26221 -7439 -5603 -26468 -52639 -74774 -36248 -21929 16896 65601 26563 18917 26021
16751 26021 24191 43474 25294 -14714 -2938 148 11016 -12557 -31442 -4654 -22655 -35514
16739 -35514 9391 2112 36133 52371 51273 -3246 -46518 -27348 -46903 -45965 -14549 -11940 -9816
16726 -9816 13000 4616 -15387 -63728 -111794 -59660 10235 -22461 -28166 -61248 -68023 -39215
16714 -39215 -32295 -60088 -35798 10092 23582 17881 42228 37009 13646 -17076 -1427 10045
16702 10045 24233 71142 77853 64971 73020 45705 -45877 -84207 -87623 -36824 19156 4185
16690 4185 40484 6554 -28677 -37506 -50989 -64509 -35363 -18771 -10160 -13414 30292 -27059
16678 -27059 -67190 -31674 -20053 11586 -1858 -39911 -59602 -100583 -156180 -121488 -52355 -67884
16666 -67884 -65064 -43959 -2736 -44702 -80923 -66034 -86165 -85128 -56092 -91496 -120565 -120238
16654 -120238 -109526 -107522 -140748 -80113 -55503 -65154 -50297 -39002 -52049 -55011 8699 28322
16642 28322 9549 7247 -48535 -61718 -78741 -72070 -37414 33693 49866 71101 93529 36572
16630 36572 3047 -20267 -16049 50948 -5870 -39268 -25365 41732 47920 46743 1316 -55222
16618 -55222 -31756 -34468 -42459 -62556 -56167 4251 -15738 -29339 -30866 -24351 -47978 -55231 -100724
16605 -100724 -77834 -38206 -28954 -17413 -49821 -18144 34447 14740 39530 39164 913 -9753
16593 -9753 -17586 -22932 -75705 -94845 -97569 -114117 -91110 -62405 -28538 -23988 -39250 -72575 -61331
16580 -61331 -81189 -85316 -79624 -45762 5198 6503 31559 66587 36973 19750 42543 29208
16568 29208 25210 34285 47839 34900 -13467 -8639 -17439 -73999 -58398 -22840 -54929 -109882
16556 -109882 -71204 -17408 -7289 -27769 -4203 -34100 -4994 40503 50999 99380 78626
16545 78626 29034 7577 30268 4474 12018 25474 -7075 22140 23148 -13188 42324 96758
16533 96758 40022 1121 31026 12370 -5354 30813 64340 54824 40894 27094 -14235 -23853
16521 -23853 -17022 -49882 -64683 -92562 -78352 -22071 14779 5109 24075 50163 41721 4452
16509 4452 -22821 -63215 -44455 -57287 -72108 -75339 -60060 -66271 -103819 -150657 -92234 -47934
16497 -47934 -59753 -9718 21328 35311 -7002 10922 -1528 20020 7322 -26471 -22947 -15432
16485 -15432 -25002 -29899 -10078 -911 -33493 -20439 -12317 24289 10228 -35046 -43192 -22043 14799
16472 14799 11895 22187 20708 20192 14698 32119 59288 -8282 -71511 -63116 -22050 -3080 2469
16459 2469 -26887 -34738 -21649 15797 -3120 -22748 -31241 -79376 -90191 -96719 -60468 -80676
16447 -80676 -89833 -115266 -141831 -96711 -39065 -17589 25316 34678 38400 51356 -8902 4206
16435 4206 38365 62363 62101 60281 34077 28818 28147 -13295 -24688 -39684 -86421 -138370 -123258
16422 -123258 -95085 -84819 -90042 -63774 -15954 -17469 -76017 -77394 -10628 3520 18100 45236
16410 45236 40496 9478 33787 69527 28506 -881 -63853 -34515 -52193 -47041 -14418 15433
16398 15433 22199 3110 -21675 -9419 447 18134 28034 10267 30667 13768 -30502 3064
16386 3064 34481 4117 -65031 -48330 -26874 -31179 -70848 -94165 -36260 35136 87566 106057
16374 106057 29237 -15936 11124 -63358 -65620 -35352 -6748 15918 -19907 -46922 -47584 -47812
16362 -47812 -82622 -87252 -107271 -82930 -61826 -45074 -42149 -20947 -53017 -106984 -130703 -128925
16350 -128925 -128301 -100824 -59728 -72576 -100252 -92402 -131665 -129760 -118984 -97699 -94610 -123706
16338 -123706 -116731 -55280 -23093 -80853 -116964 -49660 -23832 -59849 -52729 -65192 -88057 -86517
16326 -86517 -59543 -58295 -85292 -46110 3598 65913 77136 46074 -10247 -28657 -27439 -4167
16314 -4167 32955 24607 33295 49353 42394 -21270 -87996 -131277 -118460 -116690 -72531 -20092 -11351
16301 -11351 -48211 -73630 -61277 -14622 -6658 -24134 -44036 -57066 -16098 16608 -20303 -9234
16289 -9234 -51696 -66562 -40942 -42335 -38719 -97831 -96093 -65090 -44141 -73132 -102215 -51015
16277 -51015 -12630 -43384 -46653 -57930 -85518 -85201 -17143 -22205 -28869 32460 56175 -11450 -11897
16264 -11897 -17568 -3746 -10813 -24848 19358 23608 -4661 -32101 -36572 -27448 -23813 -37349 -30603
16251 -30603 11123 61087 87863 49832 -23398 -37697 27644 33863 898 -2479 -10578 269
16239 269 -9948 -37975 -76641 -42674 5384 26043 51285 11608 -37286 -49408 -83586 -83693
16227 -83693 -62016 -93340 -131532 -147723 -131736 -54442 -37283 -95303 -67755 -3905 24721 12740
16215 12740 22984 29362 11497 25887 27188 1042 46139 60648 23746 -24847 -2523 11553
16203 11553 79256 98213 66470 27980 -20550 -30551 1741 31120 -22179 -23504 66242 114429
16191 114429 41957 13741 22880 34380 30011 9837 -30798 -52499 9656 -9136 -55979 -51842
16179 -51842 -53063 -2802 3525 -6034 -24867 -33136 -45315 -99780 -122823 -71884 -39865 -23840
16167 -23840 -99394 -129642 -105200 -68413 -66970 -61682 -52043 -70564 -36191 3908 19882 -21595
16155 -21595 -24810 28677 35392 40339 10146 -5842 43741 1233 -32936 -5616 -42548 -34245
16143 -34245 -52069 -32416 -25826 -5557 -30360 -46259 31230 48018 22786 25605 47014 61725
16131 61725 29017 -18776 -17951 -5386 -9435 -9769 -13211 -3859 45497 15189 -42548 -72377 -55909
16118 -55909 -23438 -30398 -67230 -21722 50323 -16437 -44584 -12409 54072 53643 -7102 -46870
16106 -46870 -65943 -47189 4787 47954 49060 58760 20797 -29249 -37246 37117 71680 9475
16094 9475 9705 9409 -46751 -53907 41522 26614 -4365 -13070 291 11754 -9942 12958 -10443
16081 -10443 -3834 -6189 -27051 -15123 4171 -12670 -24092 -42437 -78711 -138785 -99757 -15355
16069 -15355 42789 32636 24751 45332 17640 4132 18170 37471 -33593 -57048 -42557 8583
16057 8583 49175 32569 25427 47832 36807 -3901 -17549 1243 27276 11604 808 28562
16045 28562 12637 7659 -23282 -51204 -56145 -37951 5539 25009 10030 1020 -47712 -46352
16033 -46352 -15421 6670 5381 -45370 -65559 -101404 -106552 -105479 -67268 -20251 24740 94746
16021 94746 117039 93146 89114 49316 -10788 -13905 -2242 -3149 27796 36153 82854 99310 105930
16008 105930 57589 20912 37417 75164 71157 33974 88005 86599 49134 31805 63963 75697
15996 75697 7366 -22816 -26480 -67165 -63949 -16409 -84445 -131543 -143234 -101597 -29160 5712
15984 5712 24661 11727 32186 13465 6745 29396 29776 23726 -38948 5989 9769 35373 25952
15971 25952 31320 28641 66339 58113 24616 41218 69505 58207 49120 75759 68057 31338 27256
15958 27256 3123 -7631 -23090 -57882 -74485 587 30416 26400 58653 33228 -13325 -37284
15946 -37284 23789 85700 78192 51219 48070 49800 73353 111775 93416 32260 22956 15891 -3420
15933 -3420 34627 15943 -14142 -18662 -7837 13266 19897 11154 8013 39311 37280 72860 66149
15920 66149 16500 24969 29978 17417 13116 -49997 -81349 -24664 -2470 12212 26924 35414
15908 35414 46228 94245 127151 94881 42811 40918 -16762 -38095 -3644 -4028 19368 61086
15896 61086 -11116 -14483 -3796 10623 -12051 -22961 -55451 -64022 -46102 -54661 -20564 -18464
15884 -18464 -2211 -906 -32860 -57087 -87438 -118514 -89123 -82190 -95771 -32836 48870 29734
15872 29734 -17954 -15557 -20347 -10929 -11170 12834 22591 29091 49681 38559 -33822 -1415 48468
15859 48468 27227 15151 26246 5018 -19886 10736 -8879 -8684 -279 -19800 -38985 -48073
15847 -48073 -18538 -32138 -76219 -81507 -75848 -64876 -60840 -23968 38917 25917 -3975 -21176
15835 -21176 -31666 -56147 -116258 -96343 -77449 -52097 -33467 -24057 -54015 -85871 -24075 -19085
15823 -19085 29790 85797 89478 61547 41703 34071 53543 53296 -13013 -53932 -64630 -90606
15811 -90606 -75136 -74673 -68865 -41707 -41131 -4603 13479 23392 -24903 -54573 -43950 -29714 18835
15798 18835 -19754 -42369 -5912 -23088 -51896 -39410 -78175 -84047 -77745 -95460 -85162 -27787
15786 -27787 11838 50365 58665 36947 -1005 20263 10377 29814 104658 74027 20236 9146
15774 9146 -25066 -89818 -75508 -25199 -31457 -22311 -75120 -92337 -88580 -87026 -94012 -74935 -31364
15761 -31364 -49942 -67684 -45043 -25050 -9432 37261 50081 51917 45516 42756 19342 -5520
15749 -5520 14430 55544 29552 19403 -263 16999 45077 67055 62458 44401 56156 36275
15737 36275 -35021 -44173 -6162 -4908 -12942 -23445 4183 -679 7247 -4783 -76063 -117983 -91035
15724 -91035 -40936 -35407 -76416 -84959 -64987 -27909 -566 21288 80310 91333 71551 62762
15712 62762 -1442 -65694 -74178 -29711 -19569 -11969 -20823 -51955 -41932 -55389 -31374 -29735
15700 -29735 -45758 -70578 -30976 -21754 71472 87063 100256 97509 64485 6372 22492 103889
15688 103889 122528 91751 75697 54080 8486 -39075 -97009 -92802 -52012 -24651 440 46588
15676 46588 19525 -1228 -19509 -13774 -59188 -22554 -19043 -100024 -108076 -38161 -12845 -72830
15664 -72830 -60216 -31460 -60013 -41457 -11338 -10570 -20259 12880 15985 -17624 -43712 -58025
15652 -58025 -36327 36041 36017 1937 -39330 -83769 -25744 -14786 -29543 -12488 -22931 17888
15640 17888 28936 47514 16617 -25193 -68126 -78007 -12662 -26908 7187 56874 64223 42371
15628 42371 10912 31780 33336 -23026 -70263 -45346 -27741 -30011 15050 34537 13456 16246
15616 16246 6762 -2500 -34952 -41220 -46266 -33755 -59154 -47653 -34885 -22918 -1423 -42057
15604 -42057 -58548 -47621 -61363 -76582 -74390 -76580 -38206 -22969 -16076 -1095 -967 -31567 -23723
15591 -23723 161 -2528 -49658 -108725 -101327 -102049 -89975 -54898 9907 51492 22778 442
15579 442 -43758 -24739 6003 11793 6864 30712 44814 42928 2554 -19496 -53670 -66934 -14414
15566 -14414 64932 104658 66676 24494 12114 -4590 -29290 -76394 -31260 -3279 -32248 -44467
15554 -44467 -37502 -39292 -11921 -34928 -54122 -60575 -14548 -11005 -21480 -13522 -22534 -53214 -45300
15541 -45300 -35039 -38563 -44232 -43731 -79015 -75264 -48080 -48465 -71092 -82621 -75825 -87876 -58969
15528 -58969 -75315 -45708 -12605 -49726 -74089 -81361 -71894 -69839 -35347 18988 39857 33369
15516 33369 39023 -2160 20963 46495 50591 44643 -10799 2392 45737 52668 60186 39417 24314
15503 24314 33440 22181 51224 56410 67333 81288 69477 56716 28270 -103 3290 -41519
15491 -41519 -24064 -13824 -39138 -51513 -30013 -23717 -272 -2946 -3624 18467 17113 12770 -10378
15478 -10378 -34901 -22723 -28972 9833 -4262 -46072 -4825 56198 60983 10818 42874 32479
15466 32479 60363 77013 28513 20056 42370 5011 -25067 -14601 7782 10073 2022 -7822
15454 -7822 19981 89467 93009 64682 85953 71085 26036 34651 788 -17905 -1183 33807
15442 33807 59121 50917 44183 62887 57810 35426 11285 945 -92454 -115591 -23108 34271
15430 34271 47909 38335 34098 57284 39745 10389 27662 17283 31948 50198 -919 -2070
15418 -2070 -40109 -52396 -67161 -63105 -19174 -21800 -17930 12597 29947 39887 38096 21370 45492
15405 45492 98950 110427 99307 76005 50990 25109 -16008 7924 -17775 -22735 19504 26895
15393 26895 56609 48311 -17850 -39023 -9612 -6402 -80182 -90855 -11108 59868 77412 4715
15381 4715 -29875 -41516 -31435 -53492 -51248 -40635 -16817 6207 30498 32112 27709 27639 -16143
15368 -16143 -59991 -56958 -7464 40424 75142 95134 96173 25820 -5913 36383 58034 -6265
15356 -6265 -36539 -32610 -29423 -23983 -13134 20618 -1709 34949 69435 62783 54324 45304 27317
15343 27317 -8225 -63474 -66388 -48701 15139 42020 -28066 -33537 -44448 -14741 38461 924
15331 924 -42369 -18550 -1382 9657 -684 -21004 -657 44648 32705 -11881 -31405 -10046
15319 -10046 -5474 11932 35766 6300 -1774 3976 9717 18120 38641 41625 59702 9580 -28177
15306 -28177 -93982 -91808 31521 65742 29835 -8906 -31876 -64241 -38772 41195 44836 29769
15294 29769 40141 46977 -1055 -42424 -95206 -76175 11910 29773 -8246 11725 -19191 -42743
15282 -42743 -3985 51341 48525 17808 -22161 -38201 -37450 -26181 9078 -22109 -57846 -97734
15270 -97734 -59489 -8714 15272 34262 42826 82624 81673 46142 -8317 -14922 1685 24658
15258 24658 48965 74485 57420 53803 -6321 150 -19853 -12933 16999 58764 57649 30115
15246 30115 22276 38106 29765 28263 990 16317 45485 33847 38587 11852 14274 17951 44545
15233 44545 48718 36720 22886 58368 32293 2963 2180 59280 74582 25610 20660 67957
15221 67957 22761 -27606 962 27052 46610 13918 -43139 -92933 -84187 -51422 -45422 -10584
15209 -10584 -10148 6190 6549 -37460 -65865 -54297 -38217 -43469 1954 40663 32703 19053 -2251
15196 -2251 -16089 -6524 286 -45808 -64865 -54774 -51596 -25901 1933 -40577 -74007 -82168 -95570
15183 -95570 -123678 -94564 -41222 -49363 -26459 -16141 -1024 -4890 48333 14992 -8613 -23192
15171 -23192 -20862 20376 39222 -1608 -55556 -48381 -3530 12604 37959 53238 25830 -10057
15159 -10057 -13870 -21355 -17017 -28642 -54681 -61194 -32603 -21692 -9564 -15132 -32260 -9901 46393
15146 46393 56745 44519 34734 -35362 -27514 5188 -7142 25852 57342 61870 74784 28750
15134 28750 -23349 -51591 -55924 -18304 -11392 -18624 -44354 -52554 -76084 -18577 28140 50715
15122 50715 75814 49988 -5908 24080 72939 70441 51352 24793 -440 23612 37761 22739
15110 22739 -3373 -29194 -30450 -35314 -61826 -91634 -64879 -45882 -30208 -17540 30093 53700
15098 53700 81679 101538 66835 -8539 -56594 -82339 -75740 -66151 -35557 -70071 -105182 -77305
15086 -77305 -64380 18032 48105 14632 -3313 18045 9168 -39248 -35044 -50438 -25544 -50409
15074 -50409 -57949 -51419 -14632 56183 47497 27417 -1237 20197 38638 -4336 -10155 6591
15062 6591 57740 73764 20891 10699 -4075 41204 80219 18907 -9903 29675 35612 -8532
15050 -8532 -43747 -45971 -59537 -49428 -41703 -19530 10463 26188 26569 22466 95762 138450 71776
15037 71776 33448 54893 76629 70692 97929 96912 91651 67768 41687 40265 18200 4752
15025 4752 5362 -26098 -55505 -41287 37961 -4610 -104968 -72479 -38085 1865 13390 -4154
15013 -4154 -24032 -25196 -4877 -2376 -29829 -24073 -38407 -51547 -68811 -104183 -77358 -40938
15001 -40938 -8051 -3487 13169 23028 5463 -2431 12232 37691 46573 40265 -23307 -20831 15252
14988 15252 52359 20011 8805 -31218 -35188 -88621 -138382 -133599 -139581 -100821 -90997 -49395
14976 -49395 -72218 -84102 -37412 8202 -40862 -41898 -52640 -65478 -35683 -41443 -87515 -85466
14964 -85466 -54593 -40575 -50090 -5489 -538 43788 124533 104608 16171 31591 26639 3602
14952 3602 -12869 -27010 -64606 -30186 -2473 23035 88767 85920 35025 24859 27940 20177
14940 20177 35706 32429 23434 4005 -40644 -29727 6899 -38665 -61749 -47071 -6651 21350
14928 21350 64881 114216 92684 71042 47570 -646 -51584 -49900 -21307 -58888 -70120 -63473
14916 -63473 -86417 -78486 -67777 -14023 -22038 1466 7931 53363 74962 6694 6304 69480 79132
14903 79132 19255 -12749 -23883 4888 86689 103894 59582 30485 47091 62404 50141 3529
14891 3529 22854 46032 27460 -16684 -5656 -50328 -82124 -80454 -50246 -31047 -57187 -58439
14879 -58439 -80454 -99228 -76646 -41946 28268 88643 92499 52654 11478 -18777 16669 36918
14867 36918 49779 29301 -212 3063 -32281 -19463 11899 6146 -35349 -85647 -86738 -46253
14855 -46253 -70494 -52423 -21790 -53660 -44202 -45670 -51619 -94798 -95117 -108177 -114109 -78225 -81650
14842 -81650 -80361 -24187 29076 39511 40420 63310 35348 28017 59493 25655 73980 63101
14830 63101 46878 -389 -4783 -6319 918 7822 48458 3649 497 -22635 -39578 -53135 -55651
14817 -55651 -62250 -89905 -57996 -35060 -66942 -37117 -32243 7221 -27869 -34803 3016 36997
14805 36997 31911 54229 68068 42861 -14144 -90920 -112132 -62223 29537 67478 98830 66675
14793 66675 36542 -29705 -15859 -25765 -40793 -17802 5970 66758 76713 21782 -19868 -46479
14781 -46479 -48726 -74433 -49467 -9011 22329 54545 46316 22084 -27133 -44243 -40039 -28359
14769 -28359 5133 24960 19414 46132 45909 -13349 10834 4302 7668 5531 2897 -3977 -40200
14756 -40200 -67748 -21944 20346 80523 70134 32685 37064 23534 23851 70186 48051 80020
14744 80020 66766 14358 -15698 -18534 28142 41760 46722 55386 35837 75402 89220 77175
14732 77175 -3019 -51439 -55717 -97711 -39974 -25606 -60216 -50695 14524 -37266 -70610 -44667
14720 -44667 -4892 3169 21695 -34391 -52736 -7963 -9086 -38950 -31584 -12896 7825 -7185
14708 -7185 26805 12642 17976 -4570 -9206 -78499 -75368 -51875 -35736 -58069 -76972 -77064 -57370
14695 -57370 -73083 -108281 -109042 -118136 -84546 -29092 -13764 -41711 -70076 -97166 -40285 -35480
14683 -35480 -14663 -35786 -46470 -56335 -57537 -51752 -74886 -84290 -67525 -27697 5673 11583 -15070
14670 -15070 550 -4382 1936 -1396 572 -26308 -49259 -9487 -8951 -30016 -45607 -36702 -37794
14657 -37794 -37815 -5995 36356 60359 64364 57740 -4840 -1681 -5245 3089 18141 35267 21460
14644 21460 11203 31520 56995 83277 137153 94481 25330 -22932 -29602 5146 45883 56073
14632 56073 50244 49702 11105 -13828 -36345 -48493 -54384 -60416 -51097 -4163 8378 19358 -3227
14619 -3227 47303 66662 63402 21008 3365 8224 60174 45690 14805 -4530 -24205 -14441
14607 -14441 -26050 -30549 -34061 -41737 -3795 18900 -38754 -49148 8027 23444 32166 63847
14595 63847 103252 96742 61243 62192 26621 5012 -29176 -19330 -28677 -367 7154 -1409 23966
14582 23966 9079 -26239 -18666 60056 138662 89022 26939 24416 18393 15011 7901 -9020 -941
14569 -941 2205 -18042 -27865 -18195 -13247 -13162 -20678 5103 20472 40095 32530 13970 52485 59037
14555 59037 99855 71177 38411 22905 44542 45775 38212 -10978 -19995 -7471 -32095 -21831
14543 -21831 -11644 -56665 -92946 -25076 -7038 -45396 -84441 -81176 -36838 -30593 -13991 -14960
14531 -14960 -9615 -6774 -7150 10730 -844 12079 41445 85193 98548 66920 50391 71482
14519 71482 104652 79491 -3610 -62371 -65669 7117 82024 70402 -9892 -55816 -17950 42618
14507 42618 89416 117752 87420 69813 39680 -15335 -29259 -33789 8076 15557 27905 68474
14495 68474 57485 -11558 1924 44426 33554 21581 3575 11222 -5867 -33337 -18766 2725
14483 2725 -11546 -41840 -43892 -12151 8373 -6978 -27842 -41670 -26280 -39300 -55041 -43755
14471 -43755 4604 -14417 -20304 -41410 -14545 -2979 2418 -7666 -41870 -57698 -44180 -19222
14459 -19222 -31312 -55713 -60707 -14629 18371 43780 41392 25181 16775 33624 12942 21149
14447 21149 68697 33897 -14044 -7647 22733 50714 22011 -14763 -27404 -16767 15388 -17792
14435 -17792 -27969 -20612 -25718 -19299 25982 66963 59288 47730 54120 56569 30564 4637 -15074
14422 -15074 635 27112 13878 -25113 -29722 -51190 -23431 14465 17348 10518 16432 27900
14410 27900 27550 75891 46281 24216 20695 -2533 -3511 -22561 -24704 3294 41551 6015 6090
14397 6090 61736 83213 74807 32211 -20635 17660 31897 2844 -26199 -3696 -16855 -12545
14385 -12545 -8502 6086 -25372 -21159 -21003 -32651 5791 43476 64715 7170 -48605 -59472
14373 -59472 -17112 42874 90383 20506 -43304 -94414 -80166 -36739 -3110 33013 20869 4572
14361 4572 -3871 -7660 -6853 36024 64522 36429 41491 38780 61051 74726 37896 -15064 -31856
14348 -31856 165 17491 -4643 -5169 -53702 -125896 -115491 -61457 -68635 -101129 -69972 -57251
14336 -57251 -38165 -5642 -46330 -34736 -56803 -37410 -11792 4861 14835 2757 -17761 -27299
14324 -27299 -41874 -21279 -56219 -28386 -17316 -22661 -6671 -12715 -38465 -41773 18939 42201
14312 42201 47925 51072 57080 68452 71278 34320 32367 -13783 -16185 30679 5326 -29434 19368
14299 19368 28382 32467 -572 -61041 -53699 -31505 -461 -39370 -90404 -75093 -64652 -40336
14287 -40336 -13076 -8980 -12000 -15558 -37827 -59726 -66057 24131 85586 62271 50604 76018
14275 76018 63987 56930 60958 16703 -26259 29745 49827 82755 107800 162803 165928 103524
14263 103524 47172 35653 24088 45154 68219 48704 57378 32607 -8461 41187 118898 109784
14251 109784 135371 70647 59432 97815 118784 195444 283714 370634 448721 563468 721819
14240 721819 892685 1234889 1498468 1391320 1096236 762196 510056 369645 286710 227787
14230 227787 184878 99039 108950 147127 179831 151529 149743 95830 46923 92040 135645 135780
14218 135780 96476 63419 70610 41942 -31958 -18927 13865 32320 29233 42312 22183 13144
14206 13144 8005 98 12543 -28284 -27982 -27262 -54020 -52456 -80471 -105897 -91134 -35012 -7346
14193 -7346 15112 66021 75513 92720 108542 129758 167736 192334 186842 145389 198023 277741
14181 277741 349351 364970 457339 646264 891031 1185802 1367552 1174102 850892 582291
14171 582291 396404 253888 177938 176452 149736 143773 196880 173912 122905 47766 50628 94308
14159 94308 140780 106497 54535 48753 106975 127194 60068 -15201 -9368 31283 72944 93077
14147 93077 80335 44645 48076 86121 127517 148349 91087 47261 25887 36097 44084 42999
14135 42999 48886 19892 -4165 52059 77027 69659 68717 39428 42730 38168 67304 128355 152973
14122 152973 139340 132873 137880 76904 24003 22980 45754 64650 49668 17583 -46117 -36945
14110 -36945 35444 17891 -261 12481 -14660 -6615 31760 77867 110660 79479 55151 16904
14098 16904 6664 14003 39301 -3368 10938 36315 48327 26250 -16737 -19955 33931 51444
14086 51444 24450 14045 -28724 -75548 -105638 -87921 -65710 -8490 31620 44745 95890 95573
14074 95573 61313 7830 3761 15628 -8327 9485 -6672 -34374 -31819 12923 31767 36824
14062 36824 -12441 -44823 -47784 13898 -19389 -48127 -60822 -35745 -955 -14139 1867 7165
14050 7165 5688 -6959 21091 41045 19079 6807 42808 31962 1928 29277 39583 -32726
14038 -32726 -66791 -42247 -22225 -60608 -42750 18691 22372 14502 36491 36941 36646 71446 31262
14025 31262 29144 40659 10097 82917 108656 127992 171805 240885 281633 274981 242727 215386
14013 215386 119332 75630 73987 54861 22765 23222 28263 53284 47029 58465 28307 20491 3364
14000 3364 -5519 29961 56347 61436 63040 74079 69373 150407 153275 134008 82691 27239 22827
13987 22827 63226 66219 66602 90117 69660 57793 93968 131406 135623 75959 25792 29619 6279
13974 6279 -290 -11467 -24590 -8526 -14017 -13897 -35256 -3347 17036 2654 -35690 -27973 -9167
13961 -9167 32776 62824 56251 43169 -15253 -55339 -70763 -21375 22075 28415 -6418 -8014
13949 -8014 -33651 -48057 -85768 -131066 -120414 -74420 -115753 -132013 -125070 -104586 -29971 17996
13937 17996 18174 -39608 -5110 2937 10989 37581 33495 4397 -520 17690 86929 77622 31919
13924 31919 57028 55480 46872 61304 67520 94215 71942 63563 72861 76622 90049 82107 52189
13911 52189 35035 48501 113535 82231 31051 38746 50894 79369 125153 64739 38640 52747
13899 52747 70261 110405 190879 212452 184003 136881 116864 170119 123875 97759 107363 129084
13887 129084 111574 105891 166106 209795 168529 104995 96689 60259 15277 16919 -15267 -63034
13875 -63034 -46896 9807 60789 47224 28744 21397 26782 44583 112076 134993 115857 99138
13863 99138 105304 61012 47300 24965 13348 29309 7106 -26858 4665 52148 122298 162400
13851 162400 127463 121232 73368 88967 107095 24773 30832 77563 95360 74135 67837 94833
13839 94833 116070 106620 115387 100206 69038 83168 118641 151043 153339 171920 179620 224007
13827 224007 327173 329240 316782 278784 252363 219180 249376 311125 332097 299272 248679
13816 248679 246964 285816 358310 384939 390576 364482 374191 401335 373401 373027 406010 479508
13804 479508 519918 576735 630917 658124 632543 612933 656786 677631 749846 849180 921784
13793 921784 1032161 1166679 1289083 1394892 1540862 1721345 1894860 2115461 2365063 2732218
13783 2732218 3079840 3536430 4131726 4838245 5585305 6403472 7531480 9080509 11274214
13774 11274214 14424660 18783540 25755099 37628802 55688437 73976382 86384847
13767 86384847 104499922 139065476 196509827 272057614 310352963 270435619 198354116
13760 198354116 125246742 77233918 50715445 35804891 27170172 21800054 18042909
13753 18042909 15334929 13260790 11402313 9662344 8096587 6826412 5862927 5174428
13745 5174428 4613288 4136746 3723209 3368081 3030314 2754999 2567809 2419950 2286132
13736 2286132 2128062 1965575 1830410 1734193 1605087 1493322 1478585 1449784 1372472 1269645
13726 1269645 1197292 1114064 1080449 1064286 1015676 1000608 1004618 977167 910763 844059 795566
13715 795566 744653 712763 726802 663775 646318 708760 697048 659666 608152 550616 527566
13704 527566 467117 409274 385795 364069 318334 329255 350412 373245 374901 395139 427337 422663
13692 422663 414696 437198 378328 335313 306124 248014 200796 190353 226762 249711 227358 231853
13680 231853 277983 268483 196629 170906 244080 249351 254584 297197 317341 311492 284275 290637
13668 290637 282647 201207 183172 175501 190618 211837 151953 160209 173205 153363 187271 238613
13656 238613 220675 208889 190759 208992 212676 223642 223905 174940 177798 205188 157462 172700
13644 172700 171299 208786 220000 191863 191642 221450 232447 256016 269110 246811 210959 180934
13632 180934 168204 153853 139304 114174 122053 136874 141732 169197 154862 176251 183615 179796
13620 179796 145792 144412 170392 176128 115210 115543 75490 15892 -25307 -70910 -25834 28169
13608 28169 73386 84777 61260 31584 86879 159496 127463 133446 54650 50317 110929 117525
13596 117525 124299 127556 139565 177081 170361 164523 193023 205948 246745 259957 240382 267795
13584 267795 281319 240387 269463 263587 237325 259616 254131 188698 164485 145568 186513 176984
13572 176984 179724 150388 129698 129864 121096 137303 83353 61412 75681 80065 74527 83091 63940
13559 63940 98091 118053 54061 -30405 -80384 -88496 -28404 31472 69363 63066 48527 62625
13547 62625 53024 32130 53737 23815 64135 52657 75953 93913 85128 101264 27442 -2147
13535 -2147 46010 31372 37423 55050 22037 3163 -29546 -47114 6375 37500 24442 33541
13523 33541 22525 -3181 -7105 -12006 -37463 -29604 -1657 -2295 38025 46193 32202 -20818 23687
13510 23687 7081 -23994 15884 53133 -4330 -30002 11883 -4122 17974 -25439 -83677 -45281
13498 -45281 34958 57674 25558 21872 17739 9507 31368 14628 -15760 -19819 -10505 -1645 -1626
13485 -1626 26040 7298 -11629 35746 66838 -1876 -24486 19563 30921 7690 17618 17583 12375
13472 12375 7451 5075 -10888 -3516 33342 51022 83678 38755 9642 154 -11760 5360
13460 5360 28524 91520 93849 67551 103228 86299 91819 76164 45439 26544 45337 68541
13448 68541 82823 85966 106489 162458 137696 63643 46770 32789 37068 54314 46142 62575
13436 62575 69075 10608 4015 -36832 -90445 -93150 -93214 -70896 12978 49190 75450 93431 68848
13423 68848 52767 45137 31651 -9077 920 20649 39332 58858 70572 50024 32118 -9497
13411 -9497 -15924 25059 31441 16904 -1475 -46775 17857 103757 128566 135040 130420 86817 46566
13398 46566 84311 74015 44651 94870 111588 95950 62212 17256 -22164 17185 20427 -20291
13386 -20291 -62209 -48721 -12487 54897 58396 3677 1452 8328 3712 6406 -4342 26340 2294
13373 2294 -2274 -8475 41663 44758 1978 -5660 -9197 24185 37261 33311 53207 55004 -8704
13360 -8704 -25502 -23175 49627 35167 5897 56150 94341 79069 93803 62400 24606 6810
13348 6810 29053 -3644 -9052 26422 61898 86115 51376 22071 26296 52613 82471 46107
13336 46107 -9806 7242 59805 113921 121059 127396 126387 67596 56321 36941 -17450 -29126
13324 -29126 9205 54523 37646 63572 91323 84799 34545 35754 1906 -52573 -55486 -23762
13312 -23762 -2399 -14412 -16533 13500 23944 5223 -5520 -53274 -22968 35981 44287 65854
13300 65854 92225 64087 -27015 -76200 -58751 -20871 3539 27941 39075 85293 181501 278629
13288 278629 399482 481283 593468 733796 978558 1253554 1510036 1469122 1189060 825193
13278 825193 541043 342890 246295 191301 184878 203064 225461 229932 235142 176742 133207 96496
13266 96496 92080 78655 28420 11478 40214 28606 43904 113536 164211 133988 129321 144390
13254 144390 99765 56945 12538 12074 36026 17548 -10193 9401 15422 14155 61572 34980
13242 34980 36405 80438 34135 16208 -4471 -21924 -4343 73659 45389 59391 72776 42846
13230 42846 78884 81898 65038 63670 93110 111678 108170 123128 99961 74673 40842 19708
13218 19708 12710 -20289 -41279 -45309 -24037 24017 14987 -14881 -1149 18904 61073 26582
13206 26582 23136 27315 39175 10956 -32037 -1574 8481 30381 -19576 -18349 -12010 -23751
13194 -23751 8308 57561 24483 33951 45759 51052 38519 34946 66547 27817 5636 7734
13182 7734 5201 4481 28192 61440 62540 -6014 -8766 -52715 -53054 15112 57153 79785 52990
13169 52990 52540 23090 4349 -34473 -66923 -23217 43042 54535 30992 12799 -356 -18968
13157 -18968 -34195 -15196 41148 40851 10409 -9333 -41861 -33810 -27649 -28071 -26711 -25735 16442
13144 16442 27885 18783 -4239 -13759 -4858 23450 -17682 -15043 18758 -13895 -25942 -12912
13132 -12912 4196 33532 52047 45277 10434 29176 90411 64852 22270 -10612 -4240 28801
13120 28801 58811 10114 -83770 -97404 -112168 -60524 -49217 -88391 -117974 -103341 -51063 16952
13108 16952 41900 -12495 -29649 -13274 -6815 -8173 17309 36052 10608 19628 11634 26061
13096 26061 54378 70209 42561 -11555 -51619 -45635 -19532 -28776 -5889 29186 11064 -4119
13084 -4119 46652 72314 32704 28568 106312 93554 81697 14734 -1831 22775 44952 99923
13072 99923 65693 60850 75039 72195 92241 72325 74863 48256 42368 1644 -52765 -12760
13060 -12760 78844 79928 -8858 -50597 -23665 -23173 1852 18060 26342 37353 16064 12399 54664
13047 54664 67724 71206 107308 101382 144859 130442 115521 113341 129112 112968 81866 80579
13035 80579 53093 -4996 6749 35783 48598 45205 47370 33337 44649 69862 61231 38108
13023 38108 7699 12390 18360 36430 31890 62776 93134 81936 91513 115782 113114 73256 65347
13010 65347 38446 27808 18394 44858 60997 60390 42193 35419 68584 44334 36189 -32168 -18952
12997 -18952 4186 -21073 -27238 -42352 -37251 -37102 -61423 -51768 -23225 40477 367 -12961 -61386
12984 -61386 -75944 -4061 -29354 -74623 -21855 32423 55102 68560 73146 60359 102976 114682
12972 114682 44139 3888 -27324 6393 38539 27859 8334 -11133 -32425 26364 14426
12961 14426 -10407 -15190 45075 34287 40536 41654 -7905 -14333 18431 17303 12612 -4271 -32245
12948 -32245 5764 35734 22594 -9995 15919 11490 15193 61168 57715 15482 -95973 -95603
12936 -95603 -27627 -13859 -57737 -68156 -85781 -88676 -36611 -47391 -42900 -7190 -3448 -28172
12924 -28172 -40809 -1125 29421 13931 -44 -14952 -37465 20886 89881 107210 100459 80668
12912 80668 75117 90245 34151 -17848 572 63256 28563 34767 29304 3944 32015 67589
12900 67589 66959 67189 39630 -1832 302 -30631 -1715 38859 57077 14609 -3415 35059 12591
12887 12591 11229 -5999 16573 22400 74847 95460 60953 24738 31367 16695 10278 35692
12875 35692 37420 42700 43386 56434 51564 12851 -16750 -49775 -34099 -83188 -84871 -117512 -134785
12862 -134785 -88283 -75950 -63547 -45180 -25901 13915 37882 52380 87910 104339 68426
12851 68426 23510 -16851 -16877 31560 41122 8520 27440 68649 93139 79117 42046 78220
12839 78220 70463 77377 70517 67576 74268 64719 38717 63504 50731 47444 63744 52567 41138
12826 41138 81323 103322 127359 121345 139879 145809 97763 14062 19576 9444 -12551 -12624 -6184
12813 -6184 -17012 -15680 -13685 -32565 3222 -12506 -30477 9128 8062 -3189 19716 8234
12801 8234 40525 36337 62766 60426 -15192 -48314 -83774 -54772 7473 37022 9552 -30203
12789 -30203 -34749 -12048 59642 129324 96659 81508 43289 8441 13212 27037 -6677 18606
12777 18606 26437 43038 29156 -6022 -51646 -39215 11223 80283 77816 96303 73655 59512
12765 59512 55512 31648 6523 1330 37723 82510 73053 29955 37561 73699 42657 5314
12753 5314 -5270 -36078 -10803 -22707 -44894 15236 58084 96732 99653 76525 49422 15906
12741 15906 3029 2513 -9864 -8027 -37758 -55956 -27925 -33872 14410 23483 -30376 -68982 -94901
12728 -94901 -85071 -87462 -91812 -70686 -32960 16039 77878 74312 49596 -9585 -28332 14483
12716 14483 -4693 -2784 9361 18283 22628 6948 2985 -45451 -38568 -37654 -14364 -16915 19716
12703 19716 12163 -11411 -26879 -43181 -48587 -27653 -13913 -34736 -774 42461 20482 -4482
12691 -4482 -36287 -100025 -165435 -154367 -107238 -86019 -53887 40741 60360 42958 34023 46495
12679 46495 4270 -5193 -7297 -30544 -8257 -46619 -21683 35143 75946 68171 72506 51527
12667 51527 37408 8279 19474 23325 1048 -8960 -36594 -45036 -63601 -41286 11356 57109
12655 57109 45544 49843 55261 35931 5941 50186 57163 72326 85642 31835 24912 25364 33814
12642 33814 43165 26691 -3409 13567 -158 -17088 1469 28156 26127 46353 90700 88924
12630 88924 57193 -16333 -36113 -20463 -20861 -42872 -86253 -43843 -1221 -60991 -52007 -50281
12618 -50281 -35993 890 46115 53695 79939 81552 84475 54396 74827 65145 61739 102454 44072
12605 44072 -5445 19044 -12110 -34433 -11654 23413 21318 -1580 15816 42471 36450 26900
12593 26900 1156 -12844 -22806 -6497 2131 -427 -34066 -24379 -21742 -15521 33814 -8493 -41873
12580 -41873 -20491 5543 59237 104313 72353 25158 76642 82953 66252 36215 75148 121884
12568 121884 90994 55432 44370 3633 -56400 -80788 -60321 -24175 -25365 -33839 22922 38741
12556 38741 14332 13170 15162 -35704 -71216 -61014 -46707 -38011 -40728 -9202 -10805 13225 25654
12543 25654 29095 9492 -19400 -29644 -34519 -4622 51666 92457 75317 43849 20968 3770
12531 3770 -1129 25240 50931 70944 62523 57396 26151 27001 17734 30355 27462 5018 13897
12518 13897 24993 21442 20035 37606 56627 69117 -784 -41374 -11840 36591 97569 135240
12506 135240 90673 48925 41914 67677 73078 90999 95721 59890 21566 -3543 6715 31525
12494 31525 47239 28076 -12274 -46270 -36848 -24685 -40460 -1956 -32987 -72865 7522 38259
12482 38259 55653 69278 88623 75738 62167 60520 27433 32142 27015 5642 -4825 2931
12470 2931 32921 32438 -22550 -60675 -56532 -26959 -49923 -67739 -78649 -45696 30136 55287
12458 55287 25818 3346 -4165 -9625 -32614 -115898 -81946 -49235 -40500 -63715 -74216 -14692
12446 -14692 10973 -43291 -50609 -35032 -11818 -6827 13884 39794 19445 1289 37155 -10242
12434 -10242 -27704 -49640 -34255 -58823 -115961 -138353 -149602 -80789 -58691 -26067 6944 20345
12422 20345 80505 118758 81200 60794 117095 134615 86693 21822 -2621 -32032 -36920 -11261
12410 -11261 12176 45835 61333 39963 34741 60631 38355 -26471 1804 -4457 2497 10371
12398 10371 13064 18774 -727 11765 21814 36663 22657 -10829 39916 60325 70641 46716
12386 46716 22570 19401 10067 -45087 -27592 -33455 -39467 -16927 7199 15895 14212 -4302 -19698
12373 -19698 -10355 48987 47785 46774 27331 24870 1022 -48947 -62434 -70484 -71092 -100924 -101830
12360 -101830 -84865 -53004 -15063 53688 28853 12153 2902 -38608 -33310 1854 31912 28977
12348 28977 25208 52827 74522 52156 19762 27774 49843 57655 35551 1647 -37997 -56105
12336 -56105 -41038 -52684 -36625 11101 6828 -21733 -24261 -22518 -4133 25053 37789 13580
12324 13580 30787 44148 47137 31825 72604 50039 13419 11238 6682 -21053 -37107 -44800
12312 -44800 -37320 -39968 -50288 -54770 -30001 -44601 -20282 -41073 -84179 -57349 -35420 -14226
12300 -14226 31802 48252 71105 78208 64429 20874 14416 24966 43622 73963 58536 37277
12288 37277 -14237 -43363 -77702 -56952 -51302 -19544 -643 -44851 9126 45635 48063 26491
12276 26491 29504 54788 55209 57458 33303 1957 -51302 -59466 -33368 599 25729 31064 1673
12263 1673 93 -14781 -74579 -86875 -41869 10820 -42751 -66114 -61386 -1110 15170 26637
12251 26637 32397 4113 20173 25752 31464 38228 20555 16917 17592 7313 14166 -28076 -26657
12238 -26657 -13548 -1177 -5319 -16971 18991 21087 20683 11576 40799 39961 48079 21248 33838
12225 33838 47569 27757 7286 69366 89550 105151 63866 -5370 -60179 -38418 -27107 -11552
12213 -11552 40829 71323 61134 75476 66079 61876 61717 78985 106473 131274 141356 124570
12201 124570 109358 96905 55998 -20636 -97934 -91093 -50063 -2692 11591 -17986 -50872 -81774
12189 -81774 -25285 15151 9536 27867 80304 72295 49678 17918 -31095 9223 24257 38976
12177 38976 3126 12316 47104 38444 2395 23612 67494 33155 30902 32538 26426 38668 31892
12164 31892 40280 17664 5561 7218 7117 15374 -27799 -16779 24257 72857 94984 49191 -5196
12151 -5196 -23768 -66627 -37301 25989 51410 16334 -6673 -15575 18335 68339 53811 19913
12139 19913 10570 -30604 -49625 -58181 93 42799 53494 68529 72775 43254 62506 104037
12127 104037 57763 -17196 -54499 -71524 -83982 -77822 -35506 35502 50775 63535 98716 109842
12115 109842 94182 64232 77851 87837 75707 57643 62230 44955 24262 27548 27655 5360
12103 5360 -2922 37047 35533 53466 62600 46868 41332 44826 32321 27057 10534 4963 -481
12090 -481 -12383 -37832 -58738 -72786 -101588 -95097 -66490 -10307 45117 58483 39391 79914
12078 79914 96846 98473 98518 119754 103836 116665 111369 52584 17113 -2998 -39693 2820 50752
12065 50752 94973 85691 15650 -8875 23617 59407 46234 101177 122318 78385 35258 35414
12053 35414 60045 -13565 -91710 -101585 -61537 -29002 -2256 35502 31081 86076 107554 81140
12041 81140 34327 52871 78878 -15894 -25164 22431 30485 -7794 22589 48362 -13534 -17049
12029 -17049 -20066 -31017 -13939 22412 49070 11967 -10300 -25384 -67752 7964 75508 59436
12017 59436 23537 -33857 -37644 -2339 -53146 -37541 20956 40943 31645 -5223 -39751 -89953
12005 -89953 -62043 -21735 -31483 -34550 -63580 -55908 -29989 -22496 -24882 1633 31011 9583 665
11992 665 10884 2808 -34030 -28765 -5650 -13325 -10414 21869 43976 33543 34765 7268 -70876
11979 -70876 -74772 -19531 -3934 -15588 -44866 -41998 -35799 721 -32287 -67906 -49519 -74292
11967 -74292 -45295 -38398 -17794 27129 64354 41747 -13169 -83573 -39718 -24866 -46310 -112511
11955 -112511 -130066 -120691 -67985 -75949 -118829 -58421 32255 17507 8662 62308 80107 19563
11943 19563 4656 -12838 -14690 1671 -76765 -90033 -86050 -108156 -122088 -142645 -129556 -118364
11931 -118364 -73366 -21167 3181 26347 26292 23907 18589 -14118 22381 31441 -25794 -33156 -11600
11918 -11600 8455 -5872 18609 -4709 11921 -8044 -19263 9859 72034 78216 23446 -43434
11906 -43434 -53872 -56340 -38985 -22950 -32064 -6357 -6598 -552 -2444 26754 47728 52086 54618
11893 54618 28011 -11805 -35328 395 -3361 -54789 -59073 -68215 -15969 37047 31054 28453 -24254
11880 -24254 -76621 -54253 -59051 -15169 -29033 -55315 -57555 -44206 -50465 -39174 -13283 -32126
11868 -32126 -65290 -18723 28517 17242 -3316 -26944 -54533 -44509 -11938 21822 20131 39069
11856 39069 65847 12180 -32199 -26467 24271 55483 51083 58533 28361 -6805 -1006 19644
11844 19644 -786 -32397 -26695 -75707 -33441 -1170 -2553 -3304 -38273 -47424 -63714 -64455 -49737
11831 -49737 -31066 -33327 -14281 -21543 -35379 -58468 -35810 28786 11058 11195 30833 40061 -9860
11818 -9860 -38880 -58631 -16099 -5141 23846 46896 35993 26768 15426 41746 67673 56496
11806 56496 67358 47637 32300 73706 67888 38223 -9003 -14134 -8258 -34223 -54155 -43432
11794 -43432 -2174 4236 31991 55659 42831 21860 41249 498 -46471 -73571 -9515 -29379
11782 -29379 -57609 -41093 -12238 3305 41017 11004 -62344 -91543 -59139 -20630 9766 -16545
11770 -16545 -7724 55638 58747 31956 -37548 -78638 -36659 3308 -36925 -17533 16678 14756
11758 14756 25893 13400 11497 41082 2994 13187 12993 3271 -45695 -43116 17012 1575 -28917
11745 -28917 3416 19001 84717 97567 51624 18770 49665 29035 31088 26522 19825 39258
11733 39258 63925 65282 54566 -16709 -2111 5383 17479 -27269 -47497 -42065 -49757 -81612
11721 -81612 -95076 -126812 -124526 -72023 -44028 -49550 -72894 -68372 -27473 -34242 -14914 -38328
11709 -38328 -33713 -51805 -65704 -21169 -8224 -15889 -3015 -17768 -20297 -738 -35367 -40259
11697 -40259 -89833 -31732 13975 -1622 -43254 -20665 -91 15181 29185 50739 68415 108983
11685 108983 124339 96348 83397 84300 68970 65411 7719 3939 -12071 -53890 -59138 -45953
11673 -45953 -53089 -43864 -43964 -26702 12840 -53467 -86770 -65670 -93769 -104804 -97110 -80919 -43889
11660 -43889 -18413 -5905 -912 -22258 13496 31186 -17683 10490 5078 28682 74165 77424
11648 77424 15327 -5576 -29985 -41938 -60796 -51999 -46046 -31874 -11703 34044 20972 -18914
11636 -18914 -51689 -102291 -59488 -52004 -67716 -105612 -56246 3328 -9830 9459 -35009 -57702
11624 -57702 -45303 -30629 -11547 11764 8339 -2980 -5308 31514 74637 64574 4549 -52733
11612 -52733 -70554 -73557 -30801 -22296 36396 61696 42742 36792 61436 89472 56318 -17380
11600 -17380 -68287 -52148 217 -6945 40768 68199 43817 7064 9940 54197 19744 -25235
11588 -25235 -4759 10297 40364 69831 93036 90819 85782 82377 72887 48871 -7788 -8143 -11512
11575 -11512 40045 69188 83435 99625 22449 569 2986 -29566 -71187 -56961 -71273 -47123
11563 -47123 -33102 -5458 -836 35177 74094 61080 66493 57705 -16599 -17760 15463 57811
11551 57811 36987 17559 9113 -63444 -84679 -62743 -25107 1187 16289 13236 14607 38618
11539 38618 36560 24780 40501 56479 14946 -27143 -104344 -106532 -61997 -28314 -10828 -3323
11527 -3323 -37129 -27708 -790 -23099 -5059 -4753 29213 46237 51678 43211 -16135 -70979 2940
11514 2940 57304 47330 -10919 -6410 19702 32441 32932 17680 36985 15203 -42482 -45762 -20511
11501 -20511 -8481 3568 29638 56346 90640 28804 -1420 -423 -34891 -31615 -43956 -19885
11489 -19885 6270 -26370 -31224 -29483 169 13856 -8651 -46120 -40886 -26393 -5349 -6501
11477 -6501 -18542 -29733 -10005 40718 44975 30663 36369 3549 -18176 16324 -5072 -26641
11465 -26641 -15766 -7403 -7656 -21642 25107 35267 33985 -3238 -18834 17131 -8029 -71787
11453 -71787 -107184 -71011 -10528 28807 35789 38917 -29223 -33342 -86981 -72813 -43111 -74886
11441 -74886 -42618 -54084 -36848 8145 3566 -42760 -59477 -51583 -37763 -57524 -35201 10535
11429 10535 -11109 -87820 -98687 -52281 -10429 31761 19556 -67165 -94287 -60712 -33944 -36997
11417 -36997 -81472 -57856 -11804 -30937 -18878 -25075 -42261 -86377 -104735 -131964 -137996 -116165
11405 -116165 -136422 -62546 -67566 -72267 -32011 13630 34082 18900 -888 2687 -51014 -117634
11393 -117634 -65678 -1526 -7992 -36101 -7974 -8780 -39627 -39526 -67692 -68704 -25681 -14072 -18129
11380 -18129 -17304 -5434 -6252 31952 34933 32856 27510 8543 -15358 13023 46145 -6426 -14764
11367 -14764 -9221 -21938 -17835 -32734 -29258 -6925 47174 16025 -16635 -38863 -9069 55683
11355 55683 20494 -42124 -46513 -30660 -45101 -55224 -48270 -32904 -26290 3994 48725 95478
11343 95478 70910 52511 41768 -2135 -22612 2587 13919 33430 62202 23647 16083 -15104
11331 -15104 -38758 -12377 6172 17636 14848 13001 -42320 -85178 -20486 -5474 -24298 -19612
11319 -19612 -35585 -13765 -34712 2623 7767 25522 27327 -57358 -83860 -23195 -13380 -44689
11307 -44689 -59557 -59945 -54652 -20398 17326 4290 20889 12553 12518 31382 39869 36418 13852
11294 13852 41847 51481 60810 42756 49109 65459 -11778 -2483 33366 76053 44903 10574
11282 10574 7747 -17864 -24815 -12259 18266 29324 -10189 -75913 -85977 12488 51160 59251
11270 59251 78136 49449 37137 -9334 -85073 -29420 7220 -10522 -22560 18176 89489 78540
11258 78540 67292 94717 83694 37655 37809 32995 20497 18986 51634 50920 36560 30487 -20491
11245 -20491 -25131 -32067 -12657 985 -8398 -13691 -55280 -31908 -19597 -63954 -100018 -78684
11233 -78684 -28190 42021 37040 26943 12273 -36381 -37586 -65753 -57828 -26223 -43339 -17595
11221 -17595 17655 35782 38721 50859 82890 72949 33876 28544 -11947 33934 94854 53546
11209 53546 -32210 -58051 -55217 -29988 7112 2771 23931 61357 34397 -23083 -38734 -27327
11197 -27327 25244 31384 -14915 20708 18537 -2285 13300 41619 21057 -39058 -16618 16920
11185 16920 40041 26532 48291 83015 31228 29148 84241 103149 82653 56789 66401 41188
11173 41188 38933 91333 38750 -5332 -52184 -50486 -38002 -21835 -13596 9699 -4950 -33487
11161 -33487 -62925 -70880 -60977 -36131 1904 -15434 -41099 -64487 -40652 -33256 -76033 -100193
11149 -100193 -66318 -21462 14196 3610 23829 -4856 -53855 -43279 -83820 -59552 -32081
11138 -32081 -45458 -94544 -90399 -42571 -23767 1745 41087 13277 44571 13091 23632 37493
11126 37493 8650 -49010 -50230 -34718 -49911 -58112 -28013 -7120 -21476 -57308 -109987 -85207
11114 -85207 -89216 -77026 -1814 48042 8063 11089 -21255 20786 8026 20823 39300 90219
11102 90219 57142 -14473 4085 -9978 -58497 -58411 -17183 51680 38190 7211 13959 -25791
11090 -25791 -9068 30761 96592 85076 5599 35326 26552 17148 48385 85979 109522 57351
11078 57351 55060 49732 16352 -17801 46273 91237 43051 319 38551 21377 -2217 -946
11066 -946 40023 85381 77737 54351 -1749 -18240 5916 21104 24766 26027 24608 3801 -5647
11053 -5647 -4433 27542 13847 25517 32344 14709 -12984 -20260 -47129 -44360 -2250 -12405 -54195
11040 -54195 -42408 -13869 -10847 -1657 -9646 -50665 -33494 -42350 -74453 -99798 -44057 -8514
11028 -8514 12624 7539 -6151 -38430 -53154 -93379 -85810 -76963 -49298 -27047 -31178 -39709 -18163
11015 -18163 21808 29279 -6099 -63337 -92028 -103007 -100268 -103807 -77030 -67276 -60232 -59464 -39686
11002 -39686 -14518 20902 43562 13162 15954 -13737 17271 41677 36428 299 -44686 -37571
10990 -37571 -20373 -25432 -25580 -16050 21799 7384 3890 -17926 52421 70398 22560 -10490 -17663
10977 -17663 -10725 -21724 -19008 -13873 29595 60755 29407 -21425 6971 -10704 -16553 27244
10965 27244 -17277 -53672 -28898 -38282 -82799 -128962 -86268 -88307 -68697 -102389 -89777 -82925
10953 -82925 -57494 -26256 -19734 -55825 -62898 -91635 -98523 -105917 -63260 -59568 -26897 -31867 -7184
10940 -7184 -2298 -7675 -26779 -8845 25634 27611 27230 -10233 -42574 -44841 -22229 -52702 -60402
10927 -60402 -68229 -14725 -18012 -50146 -55780 3489 1527 14479 219 3489 42903 13481 -34103
10914 -34103 -63751 -54910 -64345 -8768 28761 14276 531 -81611 -121670 -109776 -86621 -62813
10902 -62813 -73228 -98181 -73539 -40706 -68568 -56155 -6738 -11734 -3944 47776 84852 102283
10890 102283 -3754 -32762 8640 8705 -1591 -1358 -6857 -62167 -57802 -3682 6176 19218 3427
10877 3427 22340 9347 44263 100336 45911 -20440 -30935 -66109 -42414 -50988 -21093 34598
10865 34598 55029 36298 -1984 -18385 -37317 -23039 14536 -11379 -49166 -20428 44062 27054
10853 27054 23966 3305 -36499 -67638 -58893 -9937 19215 32769 39299 3840 28634 17813
10841 17813 71887 131485 105412 98685 53942 -200 -10899 42931 40073 31441 18317 -15016
10829 -15016 -27210 14718 -52498 -63597 -17270 2423 -24535 5502 -2053 -27830 -75659 -91881
10817 -91881 -30814 21876 68049 57294 17722 -4838 13281 64679 93084 33784 39739 35191
10805 35191 39734 -27885 -46818 -25740 -25425 -16982 6128 17431 8904 -14600 13320 36949 27472
10792 27472 -6997 -43821 -25140 -15005 14985 -13657 -46912 -40095 32510 66581 25182 -34841
10780 -34841 -17872 17449 63001 46076 13535 27272 21309 11259 10875 30420 22418 5090
10768 5090 -5184 -30806 -22945 -37204 -67790 -65249 -96360 -101891 -112401 -99744 -69137 -43787
10756 -43787 -11883 12440 3652 7759 21558 50902 56709 38141 -9533 -37637 -5284 -18107
10744 -18107 -2609 -26469 -24910 -21373 402 25156 2114 -28575 -5103 -16283 -1008 -4551
10732 -4551 31997 46358 32039 8175 -51799 -32567 -48014 -35358 11716 -14363 -9837 -6684
10720 -6684 -13236 -40140 -72631 -51334 -35127 -11682 35577 26607 -11212 -30860 -101367 -61992
10708 -61992 -20777 16714 16048 -46359 -89619 -82311 -20497 11186 37968 46450 43966 22287 37874
10695 37874 55135 58462 82896 42370 -11971 -41835 -50152 -17937 -3694 20762 36516 5869
10683 5869 -42031 -59161 -33498 -39145 -37388 -9682 -30841 -29328 -30976 -60477 -39212 8003 22300
10670 22300 6539 -50119 -83961 -108608 -130299 -36509 44382 56089 7385 -35363 -32695 13307
10658 13307 26089 4748 -20796 -29535 -33463 -18000 -59843 -91743 -35125 -3111 1104 -20601
10646 -20601 -8702 11467 -565 -26116 -30896 10430 42388 13417 7306 24224 -19550 -20988
10634 -20988 -43419 -102741 -138595 -96550 -23355 -17301 -5858 -13449 13299 11869 -46387 -40677
10622 -40677 -15591 20909 57759 93758 21474 -52405 -20106 -436 -35237 -52802 -63275 -78705
10610 -78705 -84890 -65320 -34311 4371 -16157 -36996 -21513 -10733 21239 40092 68843 100468
10598 100468 100065 53304 8110 -2305 -7797 -2968 53868 38887 -2840 -16685 -69588 -80836
10586 -80836 -40104 18899 34501 -64259 -89134 -40999 -39414 22564 40675 -10908 -25915 -38242
10574 -38242 -7027 5417 58564 39187 15781 14745 45029 68104 72145 62010 51451 48327
10562 48327 -4490 -16583 15592 82007 36569 -11951 -32971 -48455 -4869 15320 74993 83633
10550 83633 60883 77511 39316 -20540 -73664 -58871 -36602 -18700 -16266 -54594 -63089 -113828
10538 -113828 -156306 -123771 -104898 -65115 -29871 -74430 -70559 -59595 -13561 18827 -4417 -32860
10526 -32860 -56987 872 51719 24330 -28961 -40689 -46412 -41908 -108544 -148400 -96397 -68915
10514 -68915 -77849 -49904 -9593 1929 4709 7172 -514 39440 29008 -6114 -15827 -4105 16664
10501 16664 -8853 -42627 -3952 -11222 14302 16083 16711 4265 -18445 7716 15425 -20088 -52723
10488 -52723 -89830 -40200 37679 46811 -17144 -52416 -33622 -26786 -46991 -29210 -8869 -40900
10476 -40900 -82337 -74744 -33969 -47588 -21136 9140 25447 15851 -16743 -52005 -27845 2158
10464 2158 -19141 -32162 -15917 -54329 -53781 -57159 -87331 -71224 -62743 -43216 -18081 3777 -23827
10451 -23827 -11190 -21476 -33429 -13242 20672 3079 -39762 -65820 -74334 -24916 12342 6714
10439 6714 -82132 -77570 12347 27443 -10858 -504 2064 14047 9822 40356 57215 23236
10427 23236 8707 -13273 -33715 -15561 29492 68775 42696 6898 9232 16155 -11825 -16029
10415 -16029 -18431 -25267 631 39368 53123 44928 35925 22792 15594 28795 38876 18274 -23117
10402 -23117 -29114 -57893 -73723 -13949 1109 -26209 -52824 -70245 -36557 36854 33762 25455
10390 25455 -13309 -60861 -36618 13441 13862 -25808 -80620 -81125 -62182 -147 -6381 -27684 -29930
10377 -29930 16348 38916 34793 -4324 -81886 -143324 -181779 -160129 -85732 -21917 -18086 9080
10365 9080 -18058 -8738 3382 32535 32868 41642 71985 38543 -34005 -61035 -29738 -83082 -158325
10352 -158325 -61223 -28957 4022 15064 -62902 -95231 -59653 -11001 -34335 -66011 18864
10341 18864 62663 54558 23965 -28753 -4323 4617 -11369 25950 72830 114372 146870 84815
10329 84815 4427 -27717 -35693 27724 13603 18580 13605 -49214 -23254 625 24274 6331
10317 6331 19504 105627 66168 5139 -21622 -8118 1465 -42384 -86437 -77558 -31736 6531
10305 6531 47609 33686 5924 25870 29839 7091 -56277 -50921 -70599 -84773 -58758 -41137
10293 -41137 -23794 14177 37370 -25020 -44934 -84054 -50922 -59621 -25152 -3272 -12679 -20128
10281 -20128 -9848 -28064 -69286 -134887 -120022 -62114 -56076 -31190 -10796 -21282 -25580 -21242
10269 -21242 -54814 -55623 -14133 -33238 -39898 -43021 -62446 -55159 -50654 -45723 -32233 11363 25502
10256 25502 4786 -25309 10038 12928 9946 40643 32637 -17530 -33618 -3933 -53685 -66547
10244 -66547 -9490 -10539 -23685 11925 30267 19730 -28780 -50708 -36055 -42633 -64000 -73212
10232 -73212 -53571 -26480 -10556 18594 -1876 -83430 -77221 -30426 -12734 -4586 -14369 -13631 5770
10219 5770 -21488 -37349 -39126 -36490 -23914 -16648 11934 8760 44315 34754 7793 21014 8848
10206 8848 -21514 -53121 -34848 -37597 -36224 -58559 -65465 -71777 -59093 13187 35305 -12761 -73465
10193 -73465 -105478 -77424 -29576 -12775 -42484 -70543 -72967 -81400 -68687 -23350 506 -1599
10181 -1599 30850 56826 44062 -3584 -17180 21616 25717 14512 47492 -7337 -34483 -37642
10169 -37642 -73124 -72626 -26826 6633 34820 71997 122290 80093 47417 26974 -7743 -93090
10157 -93090 -108335 -43576 16954 -3165 -15657 19357 28873 20603 -26985 -32183 -5324 10550
10145 10550 33883 50228 24171 -14940 -31770 -60460 -22964 16112 29836 76607 76253 33695
10133 33695 -10390 2660 11979 62663 103055 36755 21576 41718 -23374 -54388 -45722 -58104
10121 -58104 -117443 -90757 294 49416 58846 42482 52871 58694 4898 16658 13905 23315
10109 23315 -26451 -37207 -5353 53470 51087 55435 48494 894 -19499 365 -15897 -27974
10097 -27974 -8369 9198 42896 50581 77692 98913 111731 106593 79945 56616 14944 -28772
10085 -28772 -56409 -20172 -27307 -48946 -38538 8752 50119 37401 28485 45890 2051 -11975
10073 -11975 -44096 -40897 3223 20917 -19922 -20549 -10393 -24131 15638 81727 80043 82333 104737
10060 104737 97061 95865 223341 450567 618532 671532 821743 1122472 1657136 2531031
10050 2531031 2900208 2367072 1626408 941232 542350 323394 252836 198661 157694 127727
10040 127727 62187 -16075 11283 17804 6842 -9918 53067 65187 3764 4105 56470 34994
10028 34994 -22840 -77179 -85352 -72964 -23249 -21495 -9477 14280 5241 -57050 -60123 -56405 -69960
10015 -69960 -104309 -63713 8571 44894 37564 12879 2652 11379 28715 11645 15315 -500
10003 -500 1792 209 15630 18373 32627 56519 69410 80108 55190 28383 -14306 -25484 -17720
9990 -17720 -18446 -50775 -41107 -51889 -52859 -32161 -65718 -64135 -20702 -29520 -36955 -40172 -35994 -33468
9976 -33468 -58919 -32531 -26519 -38157 1823 711 -56885 -48906 -213 16420 2774 16366
9964 16366 18789 -3347 -9548 7382 -7956 -23960 -68733 -75193 -40690 -19306 -698 34063
9952 34063 59552 70941 45252 39113 53025 46234 -18227 -47570 -8288 13040 18801 -11472
9940 -11472 -13610 -10875 125 -13335 -32217 -31009 23414 65797 39303 17759 -58438 -69777
9928 -69777 -53868 -1986 44304 34346 331 -25672 -13819 15565 22366 38540 45756 22410
9916 22410 29392 60495 53947 21371 12989 -3380 11375 28320 58080 46057 53451 34202 -20029
9903 -20029 -34009 -54106 -97550 -110258 -61204 1091 -45568 -66962 -81715 -24722 -20565 -50391
9891 -50391 -68446 -62626 -6435 6295 -43392 -48224 -7926 9979 33577 34828 41089 33015 -11769
9878 -11769 23819 30739 9399 -12741 -26339 -48464 -18855 -28541 -16578 -1809 25716 2923
9866 2923 3616 -4087 -4757 14941 34803 14 -15807 52715 86204 64428 65036 53288 -20441
9853 -20441 -44369 -27712 11524 47839 34346 38383 64284 149491 160439 144297 104968 61556
9841 61556 21877 13144 53317 94842 78961 70436 84663 112253 67541 36468 10097 -31189
9829 -31189 -44209 -21732 -45065 -23789 -44781 3143 36683 3192 -38603 -118601 -110089 -64109
9817 -64109 -12603 21392 72810 29552 -12732 -1082 -1441 12244 39030 23100 -14119 3432
9805 3432 23806 24767 -42283 -34425 18664 44468 54905 89511 44945 -12899 -35357 -10257 7924
9792 7924 14968 10115 -19677 -4099 -43618 -61402 -42854 14580 -8429 8336 -898 -3087 -42346
9779 -42346 -52025 -30451 -36719 -46899 -46275 -11732 -15649 11684 31220 52347 64400 31608 27767
9766 27767 -26841 4647 74501 60981 17360 -326 19016 10433 -43156 -64339 -36547 8446
9754 8446 46756 33440 24649 36510 29101 2331 -12346 4802 8991 -37155 -91062 -74369 -6366
9741 -6366 58116 53195 10325 -50966 -29849 -5148 3996 66000 110099 65502 -34023 -116321
9729 -116321 -71224 -41330 -82860 -10964 14644 50742 39821 6680 -9558 -2866 -69921 -84599
9717 -84599 -84065 5462 -187 43273 -10324 -41606 5162 41595 -21043 -6300 -25657 -23058 9502
9704 9502 19238 -8172 -48697 -79011 -61026 -73659 -68750 -21388 21174 12118 10479 -33025 -14752
9691 -14752 22081 -8728 -61786 -76951 -53620 -8117 -23118 -18462 4818 35344 31300 -18083
9679 -18083 -17679 -17846 -80524 -78944 -57220 -43855 -57263 -42645 -98977 -164664 -147400 -103428 -39545
9666 -39545 -25241 -42095 -4162 63023 70791 14046 36056 73218 119303 155950 101303 41009
9654 41009 -19756 -53400 4824 14491 14754 -18960 -73728 -90880 -107061 -104505 -86337 -114445 -72213
9641 -72213 -5533 5947 -19916 17119 31636 13368 72516 113521 58754 370 -34209 -25281
9629 -25281 -70300 -43702 7911 -3474 -30436 -60671 -19202 -71108 -41794 -9336 15755 28589
9617 28589 14680 -15989 -27805 -594 -15584 -24219 -50869 -72677 -26414 18842 53413 116212
9605 116212 93355 44728 47921 66246 18741 -32221 -49540 -49863 46237 94894 32667 31858 6122
9592 6122 -20676 -14494 27270 -4879 -77355 -89780 -82126 -98616 -83493 -42015 -14539 -54570
9580 -54570 -82369 -75333 -55481 -30207 -9597 28593 -6839 844 20984 29168 26368 26398 15858
9567 15858 -8115 7771 18050 1572 -41645 -66500 19272 63307 74790 47791 75416 61754
9555 61754 116130 126684 109004 118297 120845 63171 38180 8611 36847 81447 101101 65502
9543 65502 -31686 -54885 -55893 -54833 -59279 -5628 12700 49960 37274 2306 -44486 -51096 -64444
9530 -64444 -32654 -9068 -59595 -127959 -94763 -93671 -114240 -90789 -71035 -40191 -46391 -42407
9518 -42407 -37762 -31617 1100 52474 69229 77398 109843 111726 106641 67853 15918 10984 30410
9505 30410 46249 53820 -5358 31625 33312 -30453 -57317 -56510 -45016 7556 34120 24982 47145
9492 47145 68442 27859 -9893 5958 45721 8060 2346 38217 -19250 -19534 -15323 -25419 -14008
9479 -14008 -40474 -52405 -14361 -1957 -9279 6206 35666 5970 -17370 -11212 -1495 -14921
9467 -14921 -893 -14978 -20498 -60802 -88726 -73241 -75561 -62736 -48210 -4687 26886 -14777
9455 -14777 -26901 -30281 -22347 -37597 -78307 -93498 -76345 -83320 -27877 -31443 -33182 -46281 -49931
9442 -49931 -48766 -30426 -12833 10622 -20446 -47020 -33712 21750 67759 62598 15054 -31209
9430 -31209 -15969 -72884 -127008 -138949 -119467 -88021 -84833 -53997 4956 33439 36257 52288
9418 52288 25915 -2730 -4127 -12748 -10976 -48118 -68297 -37941 -2709 13164 -19674 -48656
9406 -48656 -95246 -92754 -59924 -48513 -50651 -18642 3314 52541 60207 17427 -25729 -13621
9394 -13621 -34140 -47888 -57264 -32903 -25131 -9770 -3588 3315 -18756 -53939 -72789 -41536 -34072
9381 -34072 -16900 -59308 -43400 -35351 -20803 16164 9277 -3067 -18195 -3443 37597 42534
9369 42534 -4864 37621 29328 -9479 -18927 -1743 27690 8046 2567 -5942 -43192 -27099 56340
9356 56340 40112 8513 71643 103222 76097 44233 627 -1546 19593 2555 -40518 -42105
9344 -42105 -7476 32080 52304 62144 260 -7654 -22350 -44747 -40527 -67629 -88599 -45315
9332 -45315 7911 -43396 -72830 -105788 -84285 -61689 -16730 -39260 -5615 26116 62943 36660
9320 36660 -16923 -8160 55091 91313 71102 62873 64146 31902 62051 -5129 -21792 18193
9308 18193 27115 39777 42242 -3084 -41202 -44326 4763 3925 5506 10613 -3698 -66710 -131721
9295 -131721 -149601 -106269 -56419 -40393 -47589 -13285 -20089 -31625 -30325 -50936 -53504 -15470
9283 -15470 -27417 -32937 -24526 -45117 -61855 -71837 -24868 6375 20364 4709 27133 26497 -12054
9270 -12054 13651 28470 25396 -38851 -27742 25084 55519 54162 14247 -6993 49 -14207
9258 -14207 -41749 -32943 -30686 -59335 -8797 49009 59838 77999 38407 -4014 -3379 -3963 21509
9245 21509 25076 1814 -6473 14999 4360 10885 18052 16890 2460 -15925 6342 -24873 -18688
9232 -18688 -11147 -5513 -13888 -33831 -25961 16132 42186 34373 46470 20718 -35948 -26818 1497
9219 1497 -14743 707 -2858 -479 -23435 -54002 -53407 -83320 -62563 4762 29435 37609 33452
9206 33452 70803 53165 -4970 -962 -18760 -1402 -65003 -69206 -59027 -34182 -32804 -68583
9194 -68583 -34552 -9065 24748 17584 24783 41055 43326 67152 100640 112908 93785 13206
9182 13206 -15780 -6461 40294 60803 62753 850 10930 26325 -47349 -11001 22622 15782
9170 15782 20142 41732 16741 66622 68975 64070 61948 58371 14520 31665 55590 65567 96962
9157 96962 110154 3099 -71713 -53669 -60471 -97977 -86503 15009 27582 11953 72146 50435
9145 50435 75668 113599 108403 100224 84546 60044 36533 30119 27554 24890 50003 98329 56181
9132 56181 41844 61222 76123 52365 36563 52737 47093 17220 7229 15619 5371 9860 8039
9119 8039 34782 57542 107099 164523 188533 123544 172477 248278 259390 254246 220614 220144 207374
9106 207374 253604 265470 301630 344474 403572 453701 525046 582190 664840 686527 757321 862619
9094 862619 1021924 1222260 1417458 1791205 2388699 3243844 4552683 6196574 7789891
9085 7789891 9351313 11534914 14969430 19575708 24182452 25592874 22591791 17449460
9077 17449460 12255335 8431512 5977641 4483681 3549125 2923057 2449957 2041015 1681566
9068 1681566 1448318 1258267 1069842 943122 839148 782090 776889 679800 582815 535226 540166
9057 540166 491334 452215 393037 376806 398776 381548 294475 259672 229157 226335 249081 226417
9045 226417 219896 255145 278253 289291 281548 238849 147855 150051 173565 171742 178280 195955 220322
9032 220322 176942 195326 202658 155604 124940 129087 143240 171217 168826 114057 61449 29849
9020 29849 39061 34734 43722 59644 82144 137706 107110 26487 -4541 21795 29896 47463 73738
9007 73738 92744 69469 94686 73881 34782 34259 14984 17192 48872 84177 121324 76802
8995 76802 49468 27814 -8413 7398 2838 31347 10712 -27432 -37932 -14022 21767 41941
8983 41941 76404 77452 84040 95769 65334 49944 89588 145172 156972 155627 104673 73875
8971 73875 55564 86656 108057 124905 99967 43275 68498 57277 21287 68774 70427 3194
8959 3194 42569 55477 66892 42790 29792 85846 132963 98147 42235 27191 59910 56875
8947 56875 66559 63245 7511 -13236 -25604 -43125 -25400 6390 -33565 -56789 -14657 5795
8935 5795 20864 46445 54869 77376 64799 17085 -8366 -18543 14197 38611 19016 -3143
8923 -3143 -4483 -11652 -20495 -19183 -5130 14799 13054 43046 -9973 -29263 -29898 -65393 -128629
8910 -128629 -122614 -95508 -107847 -127398 -107763 -97589 -85398 -77705 -54632 -29913 -17804 48473
8898 48473 99023 71268 2331 -49204 -26127 -51319 -52201 -59837 -72787 -63586 10438 68198 75779
8885 75779 67818 66221 48054 -1191 18657 53133 45952 -11992 -55168 -36983 21337 2161
8873 2161 57691 137533 161018 140902 164570 179368 229499 307040 325065 300058 200034 150523
8861 150523 128049 88975 73672 58232 -807 -49931 -83231 -39156 32392 77709 57655 74206
8849 74206 69002 51758 52927 45458 42269 64105 100616 89114 39639 -15170 -42380 -46336 13029
8836 13029 41729 32373 48965 33941 -34955 -67226 -45392 -33451 -13261 -66094 -58904 -48480
8824 -48480 -85581 -50836 -50071 -58200 -378 22964 41838 69360 72481 16839 -51459 -57814 -34196
8811 -34196 1882 39363 21033 6925 6470 21829 60877 45483 39961 25379 -17768 -9023 -33376
8798 -33376 -8932 -24330 14347 61917 27605 20423 27234 7614 -13085 14239 -10427 -59571
8786 -59571 -47379 -26904 -12500 -6282 -42996 -25167 -29299 -58886 -32506 -29704 -33827 -30097 17042
8773 17042 36892 60183 100067 97721 66963 71333 65645 49852 102842 124937 85834 78528 92226
8760 92226 80778 39605 18785 -3835 -6109 -16428 9458 24940 40185 48576 12566 -36163
8748 -36163 -32147 -29691 -18056 -19575 -52437 -63303 -61053 -63339 -77722 -56523 -11864 38716 80039
8735 80039 27517 63165 76041 -10015 -4364 83935 50903 24686 802 51014 69324 20270
8723 20270 -32319 -51161 -27440 -47813 -47033 -34611 -42183 -33546 -59980 -75407 -77727 -61556 -36555
8710 -36555 -4629 48189 81502 120018 95328 81193 76761 56442 111520 114156 113115 98891
8698 98891 89033 103919 70593 18615 21745 45659 63730 76446 61580 15779 -4015 -21495
8686 -21495 -10738 41508 57187 70492 80640 67823 42329 91826 151880 152051 125984 80549
8674 80549 73752 61074 77285 113011 143282 116146 67454 83699 108614 100686 49819 25343
8662 25343 42659 141431 169420 134825 100909 101043 117960 146349 155206 136040 129229 165568 144103
8649 144103 108600 127421 170336 185809 202681 174248 143951 171642 149574 141969 106856 115596
8637 115596 144954 187623 218237 195525 204878 238530 251540 348129 335501 328538 313549 338357
8625 338357 344658 306169 298243 340817 452103 521869 542816 522187 502555 467829 528104 573371
8613 573371 574959 562998 540149 504990 500185 462852 401165 381064 371900 384667 376501 405311
8601 405311 435220 404877 331207 264837 235408 254781 268958 301196 289606 334314 286823 237815
8589 237815 258815 219008 161505 137163 132075 169931 180556 188135 184143 154904 138310 180842
8577 180842 190136 141666 148703 186716 180168 149573 111985 62207 5833 -13586 35253 40510
8565 40510 -5885 -42759 -10166 49370 67099 76056 82204 109986 92299 25480 30338 34475 13888
8552 13888 50040 1817 -2141 -7977 -25042 -9399 57089 55740 58727 26884 -16956 -49396 -69903
8539 -69903 -39538 -15405 -16206 29043 55932 73948 95344 57139 28818 -15161 32199 89060
8527 89060 12567 -13704 -7299 8108 -22905 -43526 -10194 -8456 757 -23746 -80013 -87585 -40882
8514 -40882 -27921 14164 31415 -186 -13234 -51508 -75120 -86141 -101566 -34935 -32138 -19292
8502 -19292 12346 47263 28738 -20916 -8108 22001 -25603 -56404 -56276 -30085 -67695 -81823
8490 -81823 -60378 -97500 -102336 -67924 -79793 -82762 -39594 7997 28857 49658 57615 17902
8478 17902 -4830 -17474 18354 53086 636 -27038 21120 96727 39856 24624 36667 42076
8466 42076 32347 5683 23440 46007 42697 535 -18202 22405 19259 26600 28146 52193 42099
8453 42099 52152 67336 47731 32210 63319 72048 37175 37913 26985 46633 29572 -7193
8441 -7193 -1450 41188 96251 81948 53617 175 -9333 -4808 -513 26017 51666 48827 16376
8428 16376 -36253 -41210 1040 -15 26964 90082 80149 28260 -2009 452 20727 -8385 -34046
8415 -34046 -33829 12211 54524 17443 26504 22885 20205 27970 9626 12181 15921 25377 26170 10229
8401 10229 -13171 -27167 -27556 -74038 -67358 -77467 -21774 13352 -10418 -3463 5709 1707 31032
8388 31032 80234 65692 42593 -26214 -27160 -20192 -58765 -44147 -21661 -18053 12349 14372 -58362
8375 -58362 -82670 -46241 -10830 25016 30201 3734 -14525 7520 5809 -10331 -12967 -53757
8363 -53757 -66411 -58563 -71701 -93318 -58959 -47865 -41058 -21684 11506 59317 79494 74547
8351 74547 51997 41767 -4468 -9753 -30558 -63519 -62793 -64050 7386 28728 32604 48376 47162
8338 47162 62276 82733 68296 -8686 8596 -3861 -73540 -117932 -69313 4721 29907 16123
8326 16123 10717 13937 -10734 -35941 -48955 -33697 10838 35488 2518 -20230 -65757 -86118
8314 -86118 -44666 -10280 -8393 6880 -367 601 -49421 -42147 -22422 -5347 -1159 14575 25652
8301 25652 -3042 -33990 -26717 -12259 -1087 43879 50797 41134 10542 -27372 -28078 7259 -1247
8288 -1247 -207 27225 48416 102946 147721 111507 31907 10167 -8840 25315 36765 109903
8276 109903 108605 93955 61541 7344 31944 11979 -22116 -58849 -18026 6519 50163 55543
8264 55543 58342 37041 6624 -32706 -31686 -13324 -31399 -35580 -15741 -302 37735 73413
8252 73413 63305 46641 57552 39586 -25266 -34898 4579 29150 42173 36844 78990 54420
8240 54420 58086 40857 22130 7159 -2955 -10739 -7337 -19638 10464 40011 41892 3042 4516
8227 4516 37369 67316 94837 91622 36259 -5538 39253 28763 3692 3980 -39679 -44484 -19040
8214 -19040 31610 46384 34549 28117 2459 -28521 -6965 29681 42876 12968 -67714 -85894
8202 -85894 -55551 -4557 -30139 -34948 -53566 -11280 42660 1330 -21107 43352 38737 -11811
8190 -11811 -36284 -39133 -36489 -71660 -107506 -69657 -24821 -1115 8074 7138 70232 77289 99245
8177 99245 122771 98211 5918 32587 33655 29524 -24275 -37650 1557 9256 -19247 -65845
8165 -65845 -54810 -28052 20652 69773 94588 178111 246476 267367 227200 185427 143555 51944
8153 51944 -23176 -67681 -89638 -80849 -65947 -82183 -84196 -78543 -28637 -8632 16593 12726 54251
8140 54251 47401 45497 37192 34279 31630 53131 -19251 -80096 -62094 -28744 25680 53085 87230
8127 87230 93937 54820 62977 45483 60372 96570 128130 130708 177449 227112 280997 296589
8115 296589 260570 215781 182292 185458 185977 82878 30888 38030 -8017 -32112 -65024 -98262
8103 -98262 4145 62814 53932 54069 68728 63723 65288 27310 -10420 -24140 -49484 10061 68426
8090 68426 103956 92771 56935 47852 37053 39498 49964 9994 13106 -5824 19766 16298 47337
8077 47337 53856 67321 50707 -2278 13484 64788 97923 74037 87391 62480 25540 5527
8065 5527 9918 8415 11611 27977 15436 19881 48159 69930 76259 37589 85674 69364 34871
8052 34871 91749 149948 154230 78581 99282 122229 153388 146452 92011 133466 162839 149956
8040 149956 189560 159655 133724 159315 206714 246646 283711 227987 176271 185734 175678 123012
8028 123012 146523 153793 125360 119855 131105 123964 111786 144900 155059 97893 111111 138187
8016 138187 159350 151100 162638 260788 331601 354988 395520 416846 496370 605485 623431 635469
8004 635469 520054 428453 372034 339349 335398 269735 248957 267123 359344 487043 554916
7993 554916 526740 462521 371640 278043 222056 176846 170470 168325 130245 108791 98660 61290
7981 61290 38305 68540 95781 123597 93255 116976 163567 151571 131761 135314 102967 118198
7969 118198 149747 228782 266930 300443 322565 351791 405844 446430 456260 495240 516668 426783
7957 426783 384298 372187 381458 360986 376349 411307 402083 328933 274333 196647 103088 42530
7945 42530 13116 -28710 -13084 -28712 -4927 20445 14685 22467 41542 72841 43972 54628
7933 54628 28633 -9526 5365 50352 92070 83283 74648 76849 102928 132217 121748 85124
7921 85124 140351 203639 199645 189370 165939 152140 112589 73906 52362 71936 33503 9897
7909 9897 -55271 -88865 -33064 -16111 -5408 25900 26841 -8599 -12320 720 -7079 1223 -8584
7896 -8584 7447 -33799 -49316 -28207 -62671 -33139 -12620 10555 41065 15895 -10006 -24584
7884 -24584 9417 5868 25445 25832 16157 9563 75718 86902 69031 60968 54065 14458 52061
7871 52061 69040 72304 30487 -16770 -65667 -81619 -30421 -9644 16060 -5146 -57286 -78786
7859 -78786 -47682 -10118 8346 54580 108190 108743 90833 64882 60432 72350 116065 120079 103865
7846 103865 78761 22467 13991 33818 -28880 -57441 -78120 -58322 -51669 -64686 -39687 8696
7834 8696 14597 -4239 -63967 -78363 -61509 -75039 -34510 -12012 13383 2778 -1237 31092
7822 31092 35767 382 23766 717 -7004 -26090 -8352 24428 66028 51073 -15265 -77981
7810 -77981 -111143 -64517 -46644 -55481 -50375 -28936 -27827 -30195 -7532 -6235 19806 33910 32321
7797 32321 24321 14870 -55436 -60568 -19361 -19126 -47579 -72949 27945 46084 18416 28000 52591
7784 52591 24137 30974 25265 -22037 -26976 -31685 5322 36463 52617 8715 -7420 19123 11192
7771 11192 -25848 -75249 -108453 -55441 -20150 -8608 -28322 -12025 -14112 20112 3925 -33879
7759 -33879 -53202 -93677 -104475 -126795 -91037 -52006 -48850 -74995 -53289 13467 -44111 -55655
7747 -55655 -51980 -41864 -23702 -6191 -28804 -29713 -43867 -35451 -50226 -55170 -69626 -56070 3259
7734 3259 16859 11509 -14874 -109006 -124408 -90191 7570 59021 73611 14843 -23785 -14597
7722 -14597 -1180 15502 -10682 -12524 -18332 -29845 -52792 -74057 -87428 -85272 -52481 12884
7710 12884 61637 6498 -46647 -56316 -88590 -111903 -91509 -102244 -46192 -14719 -50201 -60466
7698 -60466 -28164 -42778 -77941 -71068 -66946 -32005 -2743 16550 23055 5755 22841 31874 71882
7685 71882 94331 46337 14905 -55214 -84222 -81690 -77423 -78502 -41032 42764 102036 63419
7673 63419 33697 -52432 -54002 4236 60394 147339 164728 102565 32588 -31050 -18652 12305
7661 12305 -1767 12025 56706 58553 -29257 -53396 -68765 -39942 21628 2153 -8307 -809
7649 -809 -25735 -62699 -40229 -68174 -63397 -50604 -89451 -72555 -26690 -16481 -18300 -9165 66
7636 66 419 3739 31267 16491 -39721 -40300 14305 35664 49672 36913 78809 108447 106251 87865
7622 87865 88598 15017 4822 1114 -4130 -43972 -3614 30978 4981 21297 -3767 1078 -29652
7609 -29652 -58675 -88316 -135516 -103402 -45838 16068 -8929 -20540 -53304 -92091 -93582 -49002
7597 -49002 -39601 -57316 -65873 -89511 -52723 -28430 -37803 -28586 -53723 -28681 -36542 -31003 -6297
7584 -6297 -3452 -4049 42051 43792 36449 9064 43978 31060 22949 40320 32706 -2949 15559
7571 15559 29366 22523 22473 52827 10311 16094 44523 85575 80503 36244 16641 39530 7366
7558 7366 -1708 9699 -12463 22001 -8213 -41929 -59319 -33068 -6056 964 2472 20671 -15355
7545 -15355 -360 36316 18787 -28465 -50127 -55773 10816 61942 51610 51016 37179 7976
7533 7976 24019 119464 106048 31672 6941 4402 -9600 1654 40763 18312 -9760 -12701
7521 -12701 -2471 9850 32421 44428 13017 15727 58692 60947 29742 -18152 -39598 -70611
7509 -70611 -79746 -49912 -4616 82343 75004 18120 10478 21441 -36576 -78850 -44319 -40173 -56554
7496 -56554 -65267 -41685 17149 65076 38505 25321 32142 41942 4932 10228 9260 -15589 -15995
7483 -15995 -25680 4300 -3259 -20109 -50186 -35826 1788 -27008 -23660 39442 70674 78246 32137
7470 32137 35623 13219 65735 131618 140875 96153 34341 -3037 -24417 -13760 -6015 -38376
7458 -38376 -15834 32935 40181 26406 32823 -16210 -26381 16323 30904 35021 50104 22518
7446 22518 22885 -12174 -93105 -114914 -118951 -118639 -75030 -43697 -30078 8286 7248 12930 35371
7433 35371 46458 72701 53681 12680 -13467 -13918 -61708 -89868 -87824 -69518 -88888 -61679
7421 -61679 4543 25932 -25485 -52798 -25439 10154 -5421 -8438 -59578 -53838 -39039 -57551
7409 -57551 -65008 -60693 -101725 -81018 -75680 -19716 46884 98189 80675 83075 115357 117398 39936
7396 39936 19275 17881 -3854 30416 -19959 -639 -1246 5456 -7024 -1824 -34688 -18074 43664
7383 43664 91792 70622 37201 44255 43165 43302 82750 143999 73085 -2083 -9994 -23619 -17932
7370 -17932 -31327 -38813 -28886 7578 -2619 -25920 -9255 51407 65059 74005 70878 44513 47238
7357 47238 21209 -46811 -52479 -36547 -8459 -2575 -5225 6425 -4746 -116 -3980 -33124 -2081
7344 -2081 2101 -4778 -63000 -78228 -21349 12962 29844 46523 32115 21794 443 -44560
7332 -44560 -99019 -59698 -35050 -74923 -27088 9709 -16883 -19914 92 58786 42197 -23759
7320 -23759 -3095 -7548 -26719 -11376 -23629 -35539 -30577 7972 17392 37142 80789 42765
7308 42765 3034 -5667 -51704 -95886 -81711 -77686 -41833 -34045 -16090 -38551 -34013 -727 47358
7295 47358 29248 -26641 -21691 -13792 -48413 -41703 -33185 -56439 -50690 -28981 14370 34121 49425
7282 49425 81813 60330 -2402 -26283 6299 11691 -8867 -470 7939 -21795 -13554 43678 73963
7269 73963 12768 21255 18729 24029 6643 63297 64779 -1509 -397 -23001 -24785 -27563 -24070
7256 -24070 -35710 -36517 -30326 -37740 -27085 -12302 -27568 -55537 -33134 -6857 -5694 -21986 -78088
7243 -78088 -58705 -64281 -79779 -95573 -96035 -69932 -50593 -84861 -98299 -112259 -92256 -52301
7231 -52301 -27266 -29798 19247 -13615 -20963 -27881 -33180 -30097 -49715 344 23687 32016 23343
7218 23343 13500 -44998 -18073 728 -8592 2922 -14330 -16485 -10391 -26142 -19911 11250 43272
7205 43272 24791 24421 29226 29001 41921 -5460 -55601 -25894 -41264 -29622 -10869 8448 84734
7192 84734 72933 50289 68012 37490 24113 -9619 -60021 -113881 -73533 -8184 -5902 -9207
7180 -9207 -56570 -59920 -38438 -16884 -34926 -51897 -33288 -3335 12815 -9893 29740 46366
7168 46366 26964 30398 35960 34926 -9277 -11667 -7904 14571 -2391 -47789 -45558 -39564 -31189
7155 -31189 -24108 -26965 2366 -3475 -1055 28534 30930 74188 77944 40723 25350 884 32796
7142 32796 37733 -14922 -38261 1618 1673 -44852 -100688 -126069 -95063 -43412 3731 -16730 29294
7129 29294 -12941 -54604 -21655 810 -60296 -148849 -128470 -43786 -13604 7505 22944 36143
7117 36143 49730 44169 1220 32617 80039 45002 -20173 -36875 4026 37094 51392 25765
7105 25765 39489 34182 24325 35059 29021 15394 16778 44044 20185 -21376 -4052 11812 23817
7092 23817 -4956 17986 58124 50919 50681 43271 39551 26683 87162 83506 11450 28698 64162
7079 64162 16450 -21247 14527 44097 63770 -36851 -62866 -67571 -92072 -88612 -65972 -81683
7067 -81683 -98950 -2870 -8796 -51564 -40729 -15016 -23152 -18541 -1800 -24666 -48740 -39884 -40301
7054 -40301 -25079 -20201 -26440 -53084 -29793 -17445 -61445 -74115 -27982 14369 38710 4778
7042 4778 -31109 -18406 24043 36495 47788 26323 10827 -45845 -44476 -29810 -21752 -33608
7030 -33608 -58915 -59033 -51617 -40671 -31938 -599 19128 933 -40388 -4566 16598 -11464 -37580
7017 -37580 -68270 -103483 -53825 -5846 4364 -4026 13910 -25423 -31894 -23487 -1652 -42354
7005 -42354 -94465 -117490 -80443 -67544 -88118 -95187 -69979 -52523 5688 27522 55725 64253
6993 64253 43052 20279 -26147 -62257 -99200 -39736 20068 12750 11145 10626 16753 42641 50220
6980 50220 64720 10944 -15091 41762 84957 47501 51086 36859 10043 -25425 1970 -2087
6968 -2087 -19697 -50820 -15672 -11046 -22713 -4373 -9582 21342 35826 -3827 -47949 -28374
6956 -28374 9809 34886 9165 -10165 -8412 33641 -20110 -92557 -104637 -53068 -32024 -9417
6944 -9417 -51254 -101074 -65560 -21713 -46970 -37056 -42458 -17462 -59728 -69049 -61754 -104691 -125826
6931 -125826 -122954 -73595 -54870 -54908 -61641 -114315 -92744 -49818 -36096 36203 76479 69034 65896
6918 65896 67240 47332 34805 25343 22881 1194 753 -12229 -29796 -21550 13185 -17761 -2854
6905 -2854 -22316 -74348 -80729 -65707 -46326 -16013 -67905 -84816 -74680 -51225 -12487 -16136
6893 -16136 -33843 -27406 -70962 -39631 -14176 -67650 -93245 -59320 -57633 -46537 7738 25429
6881 25429 -8764 -29422 -20601 -34785 -40744 -38407 40657 42428 27560 2045 24439 44151 25793
6868 25793 41336 -4914 2916 -1468 -48101 -41449 17609 6982 -24594 -24234 32699 -6685 17805
6855 17805 77221 7701 2286 25339 51708 50785 34230 33814 61783 37539 -18510 7540 9189
6842 9189 5503 20506 -3362 30948 54589 39369 23534 40669 29527 51522 51873 36209 50352
6829 50352 47006 56032 38653 35329 15309 5808 16884 -12041 -90622 -66761 -71960 -93078 -58842
6816 -58842 -50351 -46590 -18860 -39821 -33554 -59143 -73987 -90026 -52890 -25087 -979 -11878
6804 -11878 -55316 -98986 -65029 -25219 -16768 -41074 -35308 -18269 -33384 -59710 -63179 -56873 -29229
6791 -29229 -52595 -29862 -39691 -57114 -74551 -89158 -66662 -36755 -11040 10775 -32598 -44017
6779 -44017 1123 23040 -4625 -40188 -44698 -53980 -10279 -7391 -20992 -18143 -16874 -23813 -26927
6766 -26927 16691 54091 57455 42890 -24102 -6881 33950 52454 -42066 -77641 -6987 18718
6754 18718 69011 124398 47956 -4423 25707 -3966 -49267 -22951 10958 1691 -63516 -77562
6742 -77562 -51522 -15991 -30772 4062 12106 6186 1 -28838 -72020 -58272 -53779 -36367 -46813
6729 -46813 -74169 -58037 10749 10784 -11326 -36988 -23124 31601 -3497 -22750 -55829 -57583 -53509
6716 -53509 -38890 -42100 -28402 -51812 -92894 -55913 5519 92911 81308 37932 34030 53348
6704 53348 69413 42078 17274 -26990 -28096 59493 60278 37946 -11527 -4853 -5047 -24148 -75081
6691 -75081 -59117 -26013 -5264 45424 50768 46872 33783 6268 45364 37432 -11802 -9126 812
6678 812 8538 32475 29684 28520 61961 64861 52174 16735 36576 60411 49306 37292 39226
6665 39226 60018 53774 -27654 -55983 -49032 -45119 -31446 -35598 -41343 -77940 -87380 -57118 -34695
6652 -34695 15321 64981 90090 107950 147469 152816 108266 39159 -2478 7805 -45988 -76380
6640 -76380 -43734 -27235 -23595 -29430 -12344 -775 -19542 -31146 -58678 -78922 -48434 -49935
6628 -49935 -86101 -73574 -86405 -48933 -36999 -31 -22986 -70532 -50651 -3883 27774 4428
6616 4428 26434 52988 32237 28864 19026 25382 14239 36382 48673 46071 10377 8417 -10461
6603 -10461 -8987 -2046 -2566 -9506 17401 8359 -50845 -38797 10852 41537 24996 20389 4766
6590 4766 -34504 -9871 7555 18404 21653 22312 12793 17559 21713 33931 46595 -22 -13884
6577 -13884 -32929 -73856 -79417 -66253 -9111 -30669 27137 33458 1369 28767 4860 -34791
6565 -34791 -51084 -49095 -37085 -43755 -18421 22291 27802 77427 103503 68924 17443 -47556
6553 -47556 -63286 -60269 -56268 -20616 -30743 -46197 -52777 -59006 -59958 -45119 25202 43662 21071
6540 21071 -15197 -9012 24913 35436 23777 -16928 -52152 -44439 -31970 -28291 12290 15028 8801
6527 8801 40973 32804 22981 -6415 -5810 39375 25755 -9492 -20121 25271 43140 65903 37356
6514 37356 14984 3336 -4041 2614 -697 36045 80289 16212 -19208 -72510 -77029 -60239 -51320
6501 -51320 -7425 5069 31916 25326 -40950 -56822 -2032 44433 77870 129792 96775 45453
6489 45453 16955 -15116 43306 99137 59777 44440 33994 29409 26809 30762 43766 39558 39300
6476 39300 15918 -14997 -16565 -36661 -74528 -51616 3657 20519 -10447 -36149 -33801 23574
6464 23574 38570 -4792 8840 -5756 -22570 -35393 -35212 -20009 -31978 -51730 -2158 47109
6452 47109 28541 -22716 15412 49158 64308 38474 30195 18985 -16933 -78516 -75898 -43212
6440 -43212 -49402 -58960 -50233 -60296 -121675 -97694 -34266 -14929 -5553 -14000 -13714 2925 12112
6427 12112 -14917 -18830 -21034 -10452 -14559 12884 2351 18264 49064 38147 14444 65534
6415 65534 79737 4407 -11213 -10412 7464 15157 17425 2005 -4015 -42971 -28294 -21176 -8336
6402 -8336 7603 10159 21593 62682 43028 34142 20373 71240 103102 59500 40550 58883
6390 58883 46902 -26749 -78964 -43381 -64662 -62236 -32678 -23796 8345 -54048 -87626 -94490
6378 -94490 -64887 -87615 -94990 -63858 -36534 -78062 -107986 -97335 -37836 -25639 -54470 -87784
6366 -87784 -60894 -13907 13915 16735 7064 -29534 -33899 -85472 -58651 -49686 -43797 -17771 6256
6353 6256 22964 -28177 -31331 -27815 5409 22081 8481 -17599 -11182 52891 72214 22791 18783
6340 18783 64973 53131 31931 29486 66776 78134 79322 68549 -2920 -45847 -9398 22876
6328 22876 35309 52925 22436 37938 11719 24791 -2126 -2622 10246 65717 71331 56206
6316 56206 24391 10746 8635 43045 17519 25936 43981 57363 73176 48951 22434 55124
6304 55124 37469 -1100 -16414 22112 52081 74569 75618 20199 24184 24393 29291 22546 10198
6291 10198 -24050 -51424 -29239 -31753 -25788 -29050 9656 10768 13756 -7666 19705 72407 81994
6278 81994 59282 72331 84921 70977 24843 7365 -20442 -45610 -34194 -5288 29187 56672
6266 56672 62279 31433 30260 22467 -32647 -41701 -52026 -28665 -22285 -33212 -29760 -31831 -36526
6253 -36526 -28142 -30422 -50956 -6088 -18090 13419 43617 60913 70046 26485 -41275 -79044
6241 -79044 -24619 21012 83034 143859 82664 54303 31274 45644 89168 54117 19526 -52335
6229 -52335 -94781 -112661 -90607 -74607 -71323 -39798 16843 -25852 940 34547 76468 50072
6217 50072 39047 12642 -1103 -22331 18499 57594 32258 -581 19357 9103 4543 3012
6205 3012 18599 57066 45172 10383 14358 33397 78874 102131 88918 52467 32418 23403
6193 23403 46114 37879 18131 29799 42810 32068 26180 10517 21867 32732 50466 34990
6181 34990 34870 65776 83224 107722 42059 -15958 -42847 4167 1962 16553 60001 7791
6169 7791 -24795 9715 19530 40689 53193 63404 13542 10740 42992 31054 -10026 -24839
6157 -24839 -15557 40777 23751 39153 33234 -14691 2932 6854 -21259 11440 17631 46912 64418
6144 64418 -6397 -29837 -62893 -65706 -24527 -12773 -34166 -51649 -20981 9534 29724 -21427
6132 -21427 -77818 -46650 -6181 14987 10803 39391 5279 -24169 -41715 -64682 -42854 -44235
6120 -44235 -65824 -2847 25840 28008 -3599 -19946 7890 7037 -16072 -9105 23466 37570 -8970
6107 -8970 -38200 -52642 -13100 -10613 17867 24706 -14411 -67019 -88018 -47647 -43053 -107161 -57736
6094 -57736 -30266 -5947 -18895 -25532 -25561 -29853 -32230 19675 36831 41896 54397 -13230 -3099
6081 -3099 57252 82499 68262 33584 32743 37387 51994 68936 60381 54655 67015 14931 -20905
6068 -20905 -74712 -65099 -44669 -21886 11700 15269 41095 56642 73622 71880 47454 43945 25692
6055 25692 -135 -16075 -40516 -39291 -11770 -14058 -6312 -29122 86 44175 5202 -34233
6043 -34233 -109626 -119005 -121613 -124487 -82651 -64410 -32653 6168 45875 15369 58519 102000
6031 102000 106041 45413 -25044 -4767 47764 56372 -6766 -20030 49666 64893 37433 -371
6019 -371 9042 -4105 -37579 -8056 20577 18020 23141 26381 -21771 -55722 -42659 -1538 -5186
6006 -5186 2389 -39866 -86767 -97394 -53917 -20133 -52758 -64500 -54642 -27347 -12938 -99
5994 -99 395 -21119 -17876 22925 -23305 -80957 -21852 -18809 -33681 -10061 -13631 -12444 -3388 -4767
5980 -4767 -2025 3114 -30823 -70007 -91616 -30891 -27272 -22674 -50477 -31879 -1841 41 -33280
5967 -33280 -23676 -32971 -38390 -27207 -30444 7868 11255 38533 26624 -5275 -7807 -16627 -33089
5954 -33089 940 9822 -31520 -39148 -5314 10554 25542 23249 25849 6359 -40004 -60979 -53414
5941 -53414 -48520 -48369 -40316 -31650 23976 33182 -21646 -30928 46136 81588 56452 54551 86437
5928 86437 64421 2979 -8630 34108 -5848 -28321 -9549 -689 34544 70639 43610 21577
5916 21577 13322 6576 30734 758 -21 1560 -56179 -67097 -17494 -22751 -65427 -45349 -38878
5903 -38878 -15329 -18690 18614 23236 51563 72613 22262 -11628 -13341 -30506 -24201 -11519 -16244
5890 -16244 -18710 -14020 -16862 -10842 -31825 -37895 15338 -9034 -37653 -62408 -55578 -29222 -8646
5877 -8646 22786 63926 72787 94838 56258 26986 50158 71421 41382 -21303 -80411 -79703 -73299
5864 -73299 -56921 -8195 7210 4118 41873 44654 1822 9576 1929 32369 55008 89183 84113
5851 84113 43253 26343 -1977 -12356 -33072 -38666 -31921 -17737 68520 124469 62477 6865
5839 6865 -48863 -100441 -91805 -16682 20515 45742 19669 -30523 -14169 -8363 -32355 -12910
5827 -12910 -23803 -67572 -92087 -55036 -19061 -13651 -29884 -20699 18757 29247 76086 81700
5815 81700 97671 38477 -17228 -45947 -56487 -98544 -79590 -27325 5396 55053 70304 66234
5803 66234 12103 -16677 42209 38478 8005 989 -5487 -49660 -67558 -60677 -36518 -21217 -1429
5790 -1429 13214 -22116 -28165 -13125 -31372 -28598 -41781 -60374 -51557 -24345 20715 37996 -36561
5777 -36561 -50473 -34353 2530 49103 81804 111831 12641 -6526 719 11231 23680 -372
5765 -372 8011 -8693 6356 21683 41305 16961 22496 -13883 -86781 -74880 -3859 51137 50596
5752 50596 31155 12960 -5613 21907 20637 14665 -27867 10021 31888 -9387 -44410 -1597
5740 -1597 79931 79456 73293 39716 -6451 -19057 -47939 -82813 -103338 -74558 -6149 10202 72597
5727 72597 51736 20148 -26154 -34534 -57545 -20411 -8819 -30452 -31805 -48215 -60515 -33825
5715 -33825 25207 5985 23968 11139 12925 10674 10036 21973 16413 -9076 4940 40721 17320
5702 17320 -53820 -72076 -12306 7319 18406 -23081 -77908 -94000 -85991 -54226 -16478 -8867
5690 -8867 -30295 -57289 5997 18518 -11630 -57418 -53376 6234 45670 13429 22198 68603
5678 68603 109111 75160 28734 22990 72484 70270 76685 35392 53303 43062 35405 12993 8814
5665 8814 20480 28878 53572 19435 -37146 6033 46382 23902 17813 17412 -14474 -30730 36718
5652 36718 6077 -21636 -25900 -28705 -56599 -100707 -50438 8363 48158 53137 40945 2513
5640 2513 -52943 -56774 -8652 -25172 -16309 7738 -5877 -27505 -47488 -40760 -34956 -38834 -31529
5627 -31529 -32573 -48877 -29808 -4002 -10771 20257 26701 40111 19013 -11310 -3944 -4857 52065
5614 52065 55006 47357 14060 20583 21218 -4022 24782 84585 47834 -7404 -4620 55854 32627
5601 32627 12276 40940 1460 -49778 -10710 18604 44097 21782 -23109 -24711 17846 -7161
5589 -7161 -37715 -48153 -14265 21650 40798 58945 74114 81029 7089 2801 52937 47391 15699
5576 15699 17024 9150 49452 23229 -13255 -2562 4521 5364 41928 65501 92923 67230 44864
5563 44864 29630 34521 43889 -10217 -49286 -65901 -53687 -22298 -12780 -37891 2920 20009
5551 20009 -17065 -55452 -23482 36328 96847 89257 56452 -21285 -66854 -53973 -49108 -17084
5539 -17084 33253 20024 7458 -14287 -16994 -34708 5504 25485 11383 8887 48274 60677
5527 60677 -22211 -32781 22085 29022 20666 -154 -23186 -23639 -48190 -49462 -40041 -18823 1997
5514 1997 70846 34085 70751 92265 59897 32019 -3266 -8470 2542 41285 62330 88321
5502 88321 45660 29529 40308 36819 17105 -41078 -46841 -4695 240 -4336 -14547 -4921 15559
5489 15559 11255 -24527 -28238 -78689 -77342 -61315 -30525 11315 74037 72482 35017 -4874 16644
5476 16644 7563 11449 -16975 -38858 -10476 20374 17774 61073 66919 35091 24907 20811 16597
5463 16597 28612 -11752 -12262 -5895 15438 9959 -9554 -21612 -28665 -18585 -7744 -54159 -60580
5450 -60580 128 2780 -2349 -30415 -28684 -13906 22726 18393 -11361 -33829 -28758 -30370 -48586
5437 -48586 -80938 -68721 -41593 2968 -3866 -80031 -48215 -22962 -43016 -44990 -30256 27573
5425 27573 30965 -2757 -16098 -750 21118 -4715 5309 -5208 -74332 -83293 -89434 -88373 -55804
5412 -55804 -16335 -2981 -13672 -68014 -106675 -57671 -11503 -19922 -11309 -8050 31631 52830
5400 52830 14416 -4519 -184 -9464 -9960 -1775 -4348 51974 28837 8299 49752 56532 67328
5387 67328 15838 -44944 -60533 -7317 -16054 -38062 -17735 9938 25762 40841 66061 68299
5375 68299 72005 18016 -10131 -7538 35962 26043 30756 7986 45535 72450 30414 21534 -12408
5362 -12408 -13364 -36652 -60631 1584 36330 34702 16080 37658 49014 46506 13333 40184 51166
5349 51166 27582 -12929 -27711 -39423 -96976 -58837 -41973 -46752 -57649 -21032 19925 35344
5337 35344 89652 94737 94170 67672 48669 49933 -34216 -70214 -71274 -58393 -60527 -41259 1887
5324 1887 -23276 -13622 -5980 9012 -16671 -38915 -23132 27202 27436 41755 73249 56658 43648
5311 43648 88083 114770 103067 102859 62308 39627 73606 38672 -5642 -76825 -118745 -75310
5299 -75310 -26019 -2139 8575 -20576 -7811 34778 57606 35333 -10056 -29208 -11036 17031
5287 17031 11068 -72249 -104111 -96857 -33729 45532 44266 5636 -51649 -106585 -40101 -23718
5275 -23718 -34977 -57089 -54285 -7800 -1325 -18700 -13870 -427 -3690 -38604 -40745 -10840 -23086
5262 -23086 -49777 -73812 -25750 49316 21558 -7530 -32191 -91286 -177415 -133088 -53727 -45892
5250 -45892 -52655 -28245 -13956 8995 18072 19417 -32426 -79606 -51346 -48613 -56662 -25976 -40596
5237 -40596 -66313 -52554 -71482 -92216 -71350 -57365 -58929 -53332 -53870 -27053 -37117 -3098 40068
5224 40068 35964 -14614 -38551 -96707 -132988 -74255 -128503 -140065 -103135 -51438 -25392 -9160
5212 -9160 -20890 -27511 -6807 6207 -13364 10910 23972 -10347 -52685 -47489 -33297 -36816 -46225
5199 -46225 -71158 -69275 -16603 -1665 -11301 -22191 -30442 -16298 -31416 -61641 -63183 -69021 -17819
5186 -17819 28648 3905 -52010 -30178 -21419 3752 -10704 -34419 -49084 -59096 -14401 -15717
5174 -15717 -21182 -16661 3013 -6160 -14949 -31372 -25649 -1746 37680 -35511 -44029 26954 79989
5161 79989 66870 60349 44685 43715 41663 57905 62573 84659 106154 58752 32924 11529 6312
5148 6312 -34085 -21987 2512 21087 83722 50163 -21940 -14076 30114 53968 75337 48005
5136 48005 19596 -25648 -4394 43393 70383 7359 -30674 -27403 -37897 -42304 -47893 -13422
5124 -13422 33781 24811 44106 19383 -2180 15328 15411 -14012 -21604 -9538 -4771 39631 56519
5111 56519 53065 23106 -5689 4080 -58656 -123332 -87420 -21544 9442 -34754 -15617 -299
5099 -299 53816 85581 30907 2276 -1379 -33819 -40657 -51577 -2854 23975 8064 54232 74256
5086 74256 98736 129401 117811 92761 109973 134052 70672 -7580 -3672 28724 39894 36250
5074 36250 25590 51394 55446 -11847 -38534 -38155 -27278 7578 -3010 -31360 2345 54408
5062 54408 88382 104822 89086 27532 1065 -16336 -27481 -92315 -138604 -81215 -45190 -52254
5050 -52254 -37801 1163 36485 5625 -52909 -94737 -42962 -36203 -88774 -89876 -45967 -23628
5038 -23628 -31387 -95924 -142860 -88270 -9142 28254 19827 12346 -9358 -22519 -19533 26758 6236
5025 6236 -13768 -10658 -24158 -19210 -6722 -16134 59 7496 5627 6267 -10250 -6016 -29914 -3328
5011 -3328 11953 -289 2164 -27327 -10471 61812 113428 128516 134189 97664 62134 -11823
4999 -11823 -40124 19741 99964 82334 69928 27317 41218 85206 87390 63311 61178 74946
4987 74946 72051 33684 24639 62813 58076 67623 46734 337 -66081 -105761 -129769 -90176 -30020
4974 -30020 13806 -18758 -58964 -38672 -44327 -58836 -38985 -30715 33538 50973 27129 -21755
4962 -21755 -38400 -17808 -5212 -31607 -73485 -57808 -49588 -73605 -103839 -119865 -60280 30408
4950 30408 27779 -44381 -42766 -20302 -15187 6442 -11925 -2849 13307 15267 14860 3677 20649
4937 20649 -531 17083 7440 -25795 -67286 -109169 -115015 -135988 -111281 -118157 -116866 -34888 12127
4924 12127 43774 60668 73766 60813 41132 10543 9435 12106 -34292 -52674 -47059 -30255
4912 -30255 -21190 1338 32936 34861 16890 -152 -72255 -112557 -90407 -39480 -18201 -33608
4900 -33608 -30799 -11877 -3632 -9992 40635 64933 74558 65822 24513 2099 -23097 -34280 -12752
4887 -12752 10782 -10117 17499 3576 20008 34373 33801 29371 24656 11695 -38401 -35139 19843
4874 19843 56607 -4731 -74857 -99715 -78277 -3043 7910 -19253 9286 32562 5911 945
4862 945 40189 83902 70639 20563 -45426 -23794 -10989 5824 -49388 -72721 -43121 -49943
4850 -49943 15919 10004 -37423 -45772 -16696 -14913 52082 101032 67495 29110 -43136 -41041 -52958
4837 -52958 -91008 -109897 -88473 -75220 -69692 -63029 -48212 -23003 -13221 -48435 -83445 -118512
4825 -118512 -74097 -29738 -74552 -87274 -61813 -70696 -75825 -79645 -90296 -118548 -91491 -42396
4813 -42396 20219 -2004 -25671 -3971 16417 12259 -11439 20368 57286 19242 18569 21168 7728
4800 7728 34272 -11433 -7015 4706 -1782 18945 -15049 -10163 -44300 -76290 -63843 -33357 -30769
4787 -30769 -35522 -51288 -76012 -56328 -33087 -18523 -5428 -19077 -34112 -67793 -73386 -18646
4775 -18646 36220 63507 21912 -33999 -14479 27645 32444 -60777 -23071 -46883 -82411 -86127
4763 -86127 -29703 -8524 26002 38239 41396 60909 36958 52410 54760 59051 48065 60912
4751 60912 91910 25427 14999 13194 6982 36460 -359 -10031 -6237 39598 46556 8964 -11868
4738 -11868 -22936 -60971 -47518 -45250 -9093 31663 18639 -15418 -6003 -10071 -25596 -37239
4726 -37239 -68056 -18507 37633 65911 72783 19874 35372 69452 48046 18896 77644 159692
4714 159692 133659 99223 102870 68266 15007 8662 45294 27670 -3740 19762 38063 46190
4702 46190 1405 -34186 -55142 -33316 -29316 -76704 -108263 -89970 -9979 50080 58334 57275
4690 57275 106270 98664 78740 72477 59311 29159 -13553 16817 34972 46496 32912 49049
4678 49049 48843 25153 28693 41654 62443 84058 67835 72570 82617 106816 93758 52236 25841
4665 25841 -24318 -70861 -18114 51224 75117 91459 71520 58538 74324 19455 -22484 17406
4653 17406 25705 24252 -37065 -30930 -14730 -18302 20305 61031 37167 53382 68097 66501 64880
4640 64880 70886 83037 52799 20395 28888 12411 26161 -13423 -28959 -31235 -64697 -55310 -6642
4627 -6642 -7195 4707 50149 49713 31501 28044 27529 31262 45003 38733 44530 64685 87260 79798
4613 79798 57946 51871 57989 73633 37524 25668 43834 43745 26282 -7041 -2035 -7764 -45912
4600 -45912 -30907 -4920 47714 93683 37704 3234 478 -51139 -92645 -116503 -95378 -60683
4588 -60683 -10398 11409 14809 -22705 -94881 -141632 -113561 -74652 -10508 -6087 -35694 -25745
4576 -25745 -26399 -66471 -52064 -9383 37917 52843 31482 -28831 -60360 3487 17811 12218
4564 12218 -19874 -9183 1826 1930 -13954 -20980 -20867 -54733 -93718 -135373 -114423 -118931 -110329
4551 -110329 -70326 -62157 -94980 -50327 -92180 -111108 -75320 -104277 -102469 -73395 -57595 -52430
4539 -52430 -38271 -51785 -54454 -51125 -40020 -1890 9962 -31740 -21907 -15453 -55003 -31663 -39844
4526 -39844 -84635 -39409 56059 67762 50966 60194 33851 43541 1298 51420 23472 14279
4514 14279 -34942 -54019 -11079 37080 48694 48723 34744 53764 72251 48872 75995 93653
4502 93653 28093 -14133 808 9660 -1758 21819 53806 18792 -13556 26505 33048 40901
4490 40901 49571 97422 58967 3957 -22083 -38484 -37574 -2643 28338 86294 104178 39765
4478 39765 15912 9397 1708 10149 4739 51102 33931 -28557 -11812 -9210 -537 9217 -13030
4465 -13030 14616 54764 29530 -25372 -5632 39969 40795 38175 -6152 -54919 -51994 -21277 5090
4452 5090 -27150 -86910 -88376 -65906 -45695 -36029 -53308 8563 42665 37971 59086 43499 -37523
4439 -37523 -5586 58682 61729 120061 117118 72173 20416 13012 -1327 32416 36890 19274 44406
4426 44406 64743 28553 -10594 -45997 -19557 30799 42771 2222 2431 14398 7811 17987
4414 17987 2574 4751 44680 17869 7800 -1580 21473 60772 69781 35919 -21811 -5527
4402 -5527 5231 -24478 -4339 -80 -17577 -9139 13830 39999 37479 70752 121160 106226 100810
4389 100810 107875 78359 63501 65304 91700 96727 74527 15815 -45477 -49899 -32528 -2890
4377 -2890 -9861 10705 15916 57252 42770 -33367 -47836 -35747 -31124 -57691 -82247 -47212 -53422
4364 -53422 -34990 21768 26934 17012 4801 -20443 -61047 -102736 -71591 22931 70857 63578
4352 63578 60510 146084 179803 126234 77710 13913 28688 -8089 -37906 -27647 -75488 -100895
4340 -100895 -107460 -79985 -64595 -36070 -33723 -138755 -118910 -75091 -31991 -6487 9935 5695
4328 5695 22618 60847 41220 -3498 -34876 -24611 -28969 -40877 -48839 31831 924 -45540
4316 -45540 -38019 -32419 -1330 23187 25060 8330 -15351 -26909 -24107 -68793 -74735 -38139 -27918
4303 -27918 -34781 -29574 -41808 -12063 -2849 32640 68456 74143 68938 15416 -40380 -59328 -13123
4290 -13123 -6001 -25973 -79904 -124107 -82742 -90593 -60835 -35909 -66483 -67157 33627 56980
4278 56980 1282 -38793 -63060 -73609 -80788 -78011 -32600 -9963 24986 46597 -9767 -35091
4266 -35091 587 15099 -10792 -32258 -92807 -131027 -93938 -53957 18527 29795 37464 692
4254 692 -3743 -22051 21068 97798 71859 4143 -69455 -109414 -120629 -93838 -64633 -52750
4242 -52750 -41511 -34817 -47938 -29840 -45681 -62025 -12725 -3575 -25482 6701 -17506 -52307
4230 -52307 47951 55401 21984 11453 9579 -9932 -24411 -13414 9494 48590 16646 4454
4218 4454 -6926 -97246 -107864 -61122 -45005 -30078 19254 -1637 10803 19745 37872 37579 27777
4205 27777 42117 36044 20461 -1262 316 3396 44606 75720 86091 62288 79326 43674
4193 43674 26559 28136 32500 40744 38775 -27600 -15936 33444 5280 14922 36065 46553 55579
4180 55579 74083 68435 -9523 -73259 -57577 -9279 37058 65593 15771 -30947 -55640 -34857
4168 -34857 -37747 -25591 -17109 -21202 -15499 8013 26588 9002 -28806 -12575 15426 44829 62434
4155 62434 54134 13478 -11670 -26 43188 73206 72770 86381 136215 142345 92249 43579 11674
4142 11674 30571 -3591 -68451 -29436 10753 -1790 -4777 -12849 -26709 35235 81168 83371
4130 83371 85135 77739 30650 39591 40195 71446 88853 70376 43064 42329 30726 8882 -19582
4117 -19582 -45524 -96477 -95434 -69347 -25578 -31596 -76179 -92571 -46093 -64120 -44776 -22052
4105 -22052 -26784 -12394 15208 -631 -31712 -51334 -10757 -20492 -32163 -51816 -73274 -47932
4093 -47932 -43912 -71646 -48563 -24820 -33095 -43582 -16302 23041 677 -8303 8376 17971 5064
4080 5064 5315 17351 66448 86660 46756 15320 7087 -37957 -29699 -7466 -18550 16546 34863
4067 34863 32528 8325 44609 59710 -7149 -21787 -22549 -5159 30940 47425 57453 31195
4055 31195 -375 54312 101675 69687 5466 -2684 -30280 -2350 74886 68729 46982 44630
4043 44630 29482 87094 84551 56908 95286 75691 -17111 -50968 9491 29077 41582 44770
4031 44770 56761 48984 75541 112796 114880 110735 80167 28345 5993 -9513 -64997 -54439
4019 -54439 -13206 -11910 76175 102256 58218 -5055 -56466 -56164 -2124 -16681 -11974 7756 36735
4006 36735 494 -2641 -331 -12802 -22712 14790 -15165 -31489 -63235 -19805 33768 52411
3994 52411 -10543 4849 25400 100132 91664 27271 -3276 -17077 -22823 963 8677 3951 -7487
3981 -7487 21808 14767 -14325 -4510 36956 16226 -42207 -43049 4171 26943 18203 41397 53282
3968 53282 55243 57484 19194 33660 13955 69170 37621 7044 17312 68498 53804 30615
3956 30615 41919 8225 8922 -27831 -28042 42183 25236 -75586 -88772 -55589 5785 50533
3944 50533 54981 71041 37516 38445 87904 78583 73493 55737 52011 18723 -39044 -31443 -30379
3931 -30379 -18971 -9734 -9924 -37780 -19368 -6378 -6247 -47714 -88670 -95007 -53580 -25267 13417
3918 13417 18638 -18519 -41944 -7978 -29878 -18609 20849 -14509 -31191 -11347 27658 -8682
3906 -8682 -85807 -90965 -33534 -5138 30035 30712 47854 49100 61370 25769 -1885 35805 48718
3893 48718 26499 29380 42902 56010 53787 24605 -24474 -21798 -10487 39422 52770 33051
3881 33051 39765 39330 -180 -17036 31690 58907 53066 38049 35823 65632 48512 70222 81227
3868 81227 82860 22970 4254 42688 49215 8106 -35261 -26610 2013 17829 -24409 -28688 -12363
3855 -12363 17092 90063 153705 77915 4576 -9360 -28638 -52043 -60447 -47804 1893 51244
3843 51244 32289 24300 -34295 -57329 -37799 3072 49813 86772 55374 36002 -7973 674
3831 674 12439 -32354 -44301 -7176 10407 2491 283 -13222 10501 26696 7165 -36392 -57354
3818 -57354 -14236 -5585 32701 32543 57327 22750 13466 30169 87053 95400 60043 55678 58980
3805 58980 90656 84438 -30267 -40625 -41214 -35707 -38364 9039 13573 -4444 19052 -12384 -59039
3792 -59039 -72033 -62425 -74915 -79306 -21654 -10215 -12636 -7257 3764 -4994 -43324 -81328 -54224
3779 -54224 -51727 -43079 -21833 -53226 -85450 -54082 -42369 -33301 18715 59053 51502 61595 -7416
3766 -7416 -19022 21758 96680 81216 50347 34156 98025 143498 108505 73364 -18492 -43615
3754 -43615 -70898 -20433 28863 11475 10550 -8754 6543 21473 34349 28580 -3403 44687
3742 44687 25717 -13507 -32025 -27579 -31172 -13023 -559 -37752 -67018 -43869 -26874 18577
3730 18577 -2794 -39087 -63604 -41780 15360 37039 59653 70595 38990 -12142 1208 14323
3718 14323 -761 -30046 -25857 -20713 -37499 -33454 -34412 -41096 -30863 -24337 -46008 -32509 -8519
3705 -8519 -5091 22936 23279 -9233 -6625 12771 -28482 -29103 -57136 -77833 -53979 -16280 -50237
3692 -50237 -96914 -106217 -47659 -4255 43399 67266 56285 105520 145680 132589 85641 38826
3680 38826 23725 15385 10268 -10083 5507 17784 71227 76848 59025 46272 48072 41782 21278
3667 21278 -68112 -57907 -11417 18680 47584 44059 60088 41121 -7284 38224 39385 15140
3655 15140 -22228 -63569 -35822 -150 -37819 -122882 -79423 -31508 -29266 13097 46119 14583
3643 14583 1751 9730 -7288 -4902 865 34078 42358 52707 45952 -29292 -37630 -22642 -7687
3630 -7687 -6057 -69602 -77625 -57941 -46864 -13972 8690 -66464 -102948 -68383 8532 1365 12308
3617 12308 62849 135201 156776 128640 77756 47023 71271 56107 23272 -2250 -60013 -95569
3605 -95569 -56095 -46904 -55757 -27805 -1244 -31646 -34658 31209 52966 -2728 -36123 -7507
3593 -7507 11879 12155 -44823 -62902 -103668 -126578 -134325 -80801 -64129 -50434 -31074 -51886 31382
3580 31382 30248 43926 -12889 -8758 -1930 -17643 1866 5475 31231 5959 -36213 -2799 -14442
3567 -14442 6518 70167 57534 27438 6334 -7546 -28916 -6690 -38691 -38805 -18318 -24126
3555 -24126 8993 5815 15561 33873 10957 -51189 -77744 -45262 -13152 -26735 -32998 -23248 -80510
3542 -80510 -130767 -167969 -175320 -123223 -50758 -30514 -93391 -91573 -43661 10871 22081 2127
3530 2127 -31661 -25065 21417 11965 -6450 -30823 -25356 -136 29108 60789 73957 51139 23345
3517 23345 40630 69081 125373 152246 100148 80017 58281 10526 -69754 -92674 -29954 42314
3505 42314 60323 66490 73949 65499 70670 84678 47774 -7906 -40243 -12413 -3439 -13043 -53009
3492 -53009 -52748 -7599 8541 -28302 -48566 -28947 -38050 30492 63011 51938 41128 1601
3480 1601 -70957 -76099 -71358 -55194 -65705 -84961 -100589 -75615 -41591 -20931 -41705 -58597
3468 -58597 -26310 -21577 12552 27229 24148 14859 14102 -14509 -421 3706 19783 -8049 -26991
3455 -26991 -55535 -81746 -77333 -31699 -15240 32378 66859 53349 80106 101527 61991 62095
3443 62095 22515 16522 82429 70741 58576 67567 44648 70891 68292 29803 -6295 -37508
3431 -37508 -23143 -52051 -29848 -18891 13549 18323 -31591 -66684 -102165 -91296 -33515 -2326
3419 -2326 31238 47074 33740 37214 -17064 -82596 -90249 -105585 -80923 -68892 -55414 -38062
3407 -38062 -37127 -3983 -34572 -89725 -89264 -60331 -21786 -7159 -31205 -24048 18610 13179 1712
3394 1712 2443 -4049 29891 33647 12429 13570 -3731 -33446 -62870 -72590 -90273 -90805 -114427 -115906
3380 -115906 -88821 -75741 -75375 -53759 -41988 -35875 -6084 9601 7381 30133 80093 30100
3368 30100 61798 30277 39526 39191 68157 91269 89103 89611 86761 55346 90539 99326 34845
3355 34845 30821 23086 46390 58639 -23145 -69366 -71121 -74194 -60994 -49595 -27180 -7146 -21020
3342 -21020 -38440 -77648 -71005 -47750 -55289 -31783 60020 42666 64029 100461 66381 79971
3330 79971 79447 47338 7555 -6186 30958 -23581 -38102 -22968 -39857 -96483 -66699 -16745
3318 -16745 -31153 -34756 -5885 34700 31973 15803 46245 73847 83990 51256 44516 14698
3306 14698 10136 -19599 -16962 -46551 -40827 -55582 -68405 -55174 -51129 -13461 -48966 -35132 11977
$$ [...]
##END NTUPLES=NMR SPECTRUM
##END=
