##TITLE=Analysis number 326086
Compound Code cc 10416
Book Reference 513/36/24
Project Code adrs
Chemist Name ronp
##JCAMPDX= 6.0         $$ Bruker NMR JCAMP-DX V2.0
##DATA TYPE= NMR SPECTRUM
##DATA CLASS= NTUPLES
##ORIGIN= Bruker BioSpin GmbH
##OWNER= nmr
$$ XWIN-NMR		Version 3.5
$$ Wed Jan 24 12:37:58 2007 GMT Standard Time (UT+0h)  MAYBRIDGE\nmr@NMR_250MHZ
##.OBSERVE FREQUENCY= 250.131544655141
##.OBSERVE NUCLEUS= ^1H
##.ACQUISITION MODE= SIMULTANEOUS (DQD)
##.ACQUISITION SCHEME= undefined
##.AVERAGES= 16
##.DIGITISER RES= 18
##SPECTROMETER/DATA SYSTEM= dpx250
##.PULSE SEQUENCE= zg30
##.SOLVENT NAME= CDCl3
##.SHIFT REFERENCE= (INTERNAL, CDCl3, 0, 16.4433)
##AUDIT TRAIL= $$ (NUMBER, WHEN, WHO, WHERE, WHAT)
$$ ##TITLE= Audit trail, XWIN-NMR		Version 3.5
$$ ##JCAMPDX= 5.01
$$ ##ORIGIN= Bruker BioSpin GmbH
$$ ##OWNER= nmr
$$ C:\u/data/dgb/nmr/ADRS/1690/pdata/1/auditp.txt
$$ ##AUDIT TRAIL=  $$ (NUMBER, WHEN, WHO, WHERE, WHAT)
(   1,<2007-01-24 12:37:35.86 +000>,<MAYBRIDGE\nmr>,<NMR_250MHZ>,
      <created by zg, POWCHK disabled, PULCHK disabled
       configuration hash MD5:
       49 4B E0 1D 92 C2 6B 37 9F E6 65 BC 52 41 86 1D
       data hash MD5: 64K
       84 33 5F F1 FA 67 A6 59 9A A6 5C C0 F5 DE 26 9C>)
(   2,<2007-01-24 12:37:49.18 +000>,<MAYBRIDGE\nmr>,<NMR_250MHZ>,
      <Start of raw data processing
       ef LB = 0.3 FT_mod = 6 PKNL = 1 SI = 32K 
       data hash MD5: 32K
       C5 A9 5C 32 5E AA 11 7E 15 21 C8 62 C7 D1 F8 45>)
(   3,<2007-01-24 12:37:50.83 +000>,<MAYBRIDGE\nmr>,<NMR_250MHZ>,
      <apk 
       data hash MD5: 32K
       2A 83 7A 3B BD 3F B4 CB 27 1E CF 5A 42 3D E3 1C>)
(   4,<2007-01-24 12:37:51.51 +000>,<MAYBRIDGE\nmr>,<NMR_250MHZ>,
      <abs ABSG = 5 
       data hash MD5: 32K
       0B BA F2 E7 08 02 5A A2 F5 57 A1 C8 1A 71 FF BA>)
$$ ##END=
$$ 
$$ hash MD5
$$ 8E 3D E7 33 BF 70 08 3E 29 66 4E 3C 82 F2 53 4B
##$RELAX= 
##$RELAX= 
##$RELAX= 
##$RELAX= 
##$RELAX= 
##$RELAX= 
##$RELAX= 
$$ Bruker specific parameters
$$ --------------------------
##$DU= <C:\u>
##$EXPNO= 1690
##$NAME= <ADRS>
##$PROCNO= 1
##$TYPE= <nmr>
##$USER= <dgb>
##$AMP= (0..31)
100 100 100 100 100 100 100 100 100 100 100 100 100 100 100 100 100 100 
100 100 100 100 100 100 100 100 100 100 100 100 100 100 
##$AQSEQ= 0
##$AQ_mod= 3
##$AUNM= <au_zg>
##$AUTOPOS= <20 >
##$BF1= 250.13
##$BF2= 250.13
##$BF3= 250.13
##$BF4= 250.13
##$BF5= 500.13
##$BF6= 500.13
##$BF7= 500.13
##$BF8= 500.13
##$BYTORDA= 1
##$CFDGTYP= 0
##$CFRGTYP= 5
##$CHEMSTR= <none>
##$CNST= (0..31)
1 1 145 1 1 1 1 1 1 1 1 1 1 1 1 1 1 1 1 1 1 1 1 1 1 1 1 1 1 1 1 1 
##$CPDPRG= <>
##$CPDPRG1= <>
##$CPDPRG2= <>
##$CPDPRG3= <>
##$CPDPRG4= <mlev>
##$CPDPRG5= <mlev>
##$CPDPRG6= <mlev>
##$CPDPRG7= <mlev>
##$CPDPRG8= <mlev>
##$CPDPRGB= <>
##$CPDPRGT= <>
##$D= (0..31)
0 1 0 0 0 0 0 0 0 0.06 0 0 0 0 0 0 0.0002 0 0 0 0 0 0 0 0 0 0 0 0 0 0 
0 
##$DATE= 1169642253
##$DBL= (0..7)
120 120 120 120 120 120 120 120 
##$DBP= (0..7)
150 150 150 150 150 150 150 150 
##$DBP07= 0
##$DBPNAM0= <>
##$DBPNAM1= <>
$$ [...]
##$SUBNAM7= <"">
##$SUBNAM8= <"">
##$SUBNAM9= <"">
##$SW= 20.6930455092707
##$SWIBOX= (0..15)
0 0 3 0 0 0 0 0 0 0 0 0 0 0 0 0 
##$SW_h= 5175.983436853
##$TD= 65536
##$TD0= 1
##$TE= 294.16
##$TE2= 300
##$TE3= 300
##$TEG= 300
##$TL= (0..7)
0 120 120 120 120 120 120 120 
##$TP= (0..7)
150 150 150 150 150 150 150 150 
##$TP07= 0
##$TPNAME0= <>
##$TPNAME1= <>
##$TPNAME2= <>
##$TPNAME3= <>
##$TPNAME4= <>
##$TPNAME5= <>
##$TPNAME6= <>
##$TPNAME7= <>
##$TPOAL= (0..7)
0.5 0.5 0.5 0.5 0.5 0.5 0.5 0.5 
##$TPOFFS= (0..7)
0 0 0 0 0 0 0 0 
##$TUNHIN= 0
##$TUNHOUT= 0
##$TUNXOUT= 0
##$USERA1= <user>
##$USERA2= <user>
##$USERA3= <user>
##$USERA4= <user>
##$USERA5= <user>
##$V9= 5
##$VALIST= <valist>
##$VCLIST= <CCCCCCCCCCCCCCC>
##$VD= 0
##$VDLIST= <DDDDDDDDDDDDDDD>
##$VPLIST= <PPPPPPPPPPPPPPP>
##$VTLIST= <TTTTTTTTTTTTTTT>
##$WBST= 1024
##$WBSW= 4
##$XGAIN= (0..3)
0 0 0 0 
##$XL= 0
##$YL= 0
##$YMAX_a= 491050
##$YMIN_a= -474116
##$ZGOPTNS= <>
##$ZL1= 120
##$ZL2= 120
##$ZL3= 120
##$ZL4= 120
##$ABSF1= 16.44325
##$ABSF2= -4.249922
##$ABSG= 5
##$ABSL= 3
##$ALPHA= 0
##$AQORDER= 0
##$ASSFAC= 0
##$ASSFACI= 0
##$ASSFACX= 0
##$ASSWID= 0
##$AUNMP= <proc_1d>
##$AZFE= 0.1
##$AZFW= 0.1
##$BCFW= 0
##$BC_mod= 0
##$BYTORDP= 0
##$COROFFS= 0
##$CY= 12.5
##$DATMOD= 1
##$DC= 0
##$DFILT= <>
##$DTYPP= 0
##$F1P= 14.0000005364418
##$F2P= -0.99999901652339
##$FCOR= 0.5
##$FTSIZE= 32768
##$FT_mod= 6
##$GAMMA= 0
##$GB= 0
##$INTBC= 1
##$INTSCL= 1
##$ISEN= 128
##$LB= 0.3
##$LEV0= 0
##$LPBIN= 0
##$MAXI= 10000
##$MC2= 0
##$MEAN= 0
##$ME_mod= 0
##$MI= 0
##$NCOEF= 0
##$NC_proc= -2
##$NLEV= 6
##$NOISF1= 0
##$NOISF2= 0
##$NSP= 0
##$NTH_PI= 0
##$NZP= 0
##$OFFSET= 16.44325
##$PC= 1
##$PHC0= 228.3725
##$PHC1= 4.880935
##$PH_mod= 1
##$PKNL= yes
##$PPARMOD= 0
##$PSCAL= 4
##$PSIGN= 0
##$REVERSE= no
##$SF= 250.13001969518
##$SI= 32768
##$SIGF1= 0
##$SIGF2= 0
##$SINO= 400
##$SIOLD= 32768
##$SREGLST= <1H.CDCl3>
##$SSB= 0
##$STSI= 32768
##$STSR= 0
##$SW_p= 5175.98343685301
##$SYMM= 0
##$S_DEV= 0
##$TDeff= 65536
##$TDoff= 0
##$TI= <Analysis number 999999
Compound Code 99
Book Reference 9
Project Code 9>
##$TILT= no
##$TM1= 0
##$TM2= 0
##$TOPLEV= 0
##$USERP1= <user>
##$USERP2= <user>
##$USERP3= <user>
##$USERP4= <user>
##$USERP5= <user>
##$WDW= 1
##$XDIM= 32768
##$YMAX_p= 432762251
##$YMIN_p= -24180
$$ End of Bruker specific parameters
$$ ---------------------------------
##NTUPLES= NMR SPECTRUM
##VAR_NAME=  FREQUENCY,     SPECTRUM/REAL,   SPECTRUM/IMAG
##SYMBOL=    X,             R,               I
##VAR_TYPE=  INDEPENDENT,   DEPENDENT,       DEPENDENT
##VAR_FORM=  AFFN,          ASDF,            ASDF
##VAR_DIM=   32768,         32768,           32768
##UNITS=     HZ,            ARBITRARY UNITS, ARBITRARY UNITS
##FACTOR=    0.157963299565203, 1,           1
##FIRST=     4112.95061047006, 0,            0
##LAST=      -1063.03282638295, 0,           0
##MIN=       -1063.03282638295, -24180,      0
##MAX=       4112.95061047006, 432762251,    0
$$ Real data points
##PAGE= N=1
##DATA TABLE= (X++(R..R)), XYDATA
$$ [...]
17464A4217K521J379r885n867O971l716j525K314j733k258Q61K497K570N017N992
17449A9355K70n313J551J787R500Q883J1937K0817J0232n73j6277j8726r254j1655
17435B2534n871k387j152n342l508Q6n542j24K562J291J069L904k669K50K502
17420G603K08J351n273M456K810K65r498n871q52M74K223r16k670L03P884J253
17404C750Q11L66j992J747j041O06J54k629L103N092J730l024n48r35q99L023
17388I314J605p925o087N535N198Q74j069j488K120P221N011P357r09k882o736
17373A7139o477o051o326k426j484R056J341q98L969M088R01j102l372n00K151
17358A0009O974J851L0k420k83L638l833m075J438L720P728M473o437l575L353
$$ y = [14217, 16738, 18117, 8232, 2365, 9336, 5620, 4095, 6409, 4676, 2418, 3279, 5776, 8346, 13363, 19355, 19625, 14312, 15863, 17650, 27150, 36033, 47970, 68787, 79019, 78446, 62169, 43443, 34189, 22534, 16663, 14276, 13124, 7782, 4274, 4360, -1182, -1306, 1256, 2547, 3616, 7520, 4851, 5101, 7603, 7811, 9162, 3889, 8345, 11155, 11420, 1922, -3949, -4801, -4327, -2104, -3020, -5690, -5387, 2497, 3750, 4561, 4927, 2935, 4682, 3641, 4247, 4401, 1772, 4875, 9967, 11697, 8673, 8125, 7190, 6291, 9314, 10919, 2994, -3093, 2442, 7640, 8514, 7445, 5957, 8077, 15298, 20309, 27666, 26757, 23875, 17139, 10662, 4611, -1715, -4141, -5625, 3431, 4772, 3874, 7843, 11931, 12832, 11730, 8358, 7858, 10009, 16983, 18834, 18864, 16444, 16161, 19799, 15966, 11891, 13329, 17049, 24777, 29250, 22813, 19238, 22591]
17343B2591n97o231o649P37j432O548l274m319M292j620k893k895M82K363M977
17328A2080k7k671l097J333J778o116l159K427k989P86N07J692l372j725N211
17313B658M610L016l163M865J849K385K806k890j1934k677N909L632J042m51N205
17298A6862j097r554J142J2577P859m660p744j431J529M665N474O15L333J1355
17284D0925J3229M209Q794K9133L8558N1615N3192L7539K1878L3663P8676J25657
17272E37068P8652o395m9480m8999K7825P6572J1327o3443j07294j05264l9225
17261C11344q933l7692n2964m9095l8829k6693j6168j6027j0204j228n573l556
17249D4382r187n05O45q444j123J800j62k36L857k5o313l333k883j082N618j973
$$ y = [22591, 21994, 15763, 9114, 9851, 8419, 14967, 11693, 7374, 11666, 10046, 7153, 4258, 4740, 7103, 12080, 12053, 9382, 6285, 7618, 9396, 3280, 121, 2548, -441, 345, 852, 2544, -828, -2553, 2658, 7268, 10284, 7121, 11986, 13835, 16220, 19026, 16136, 4202, 1525, 7434, 11066, 12108, 11657, 16862, 15765, 6211, 7353, 19930, 27789, 23129, 15385, 13954, 15483, 20148, 25622, 26237, 29570, 40925, 54154, 58363, 67157, 96290, 134848, 186463, 239655, 277194, 299072, 332735, 411411, 537068, 615720, 609325, 559845, 510846, 538671, 615243, 626570, 563127, 455833, 350569, 311344, 302411, 264719, 211755, 162660, 123831, 97138, 80970, 64943, 54739, 53511, 47938, 44382, 35195, 34690, 35335, 26891, 25768, 27568, 27406, 27170, 31027, 31002, 24689, 21356, 18473, 17391, 23009, 21036]
17233B1036l489j849K42M081O678k587m302j164K752r27j620p306o88P62j539
17218A0080R78m455l93L099k697l868R71Q958Q83M44O10L676k284n155k484o40
17202G723M155K946J146m307l634j796q702n77L089M792M546k987k605j01l324
17187C64R0L909L022J302M112j291P512J92o420q865L53J0156P031P993L354l119
17171B9695m822m082K634K591j163J181j02m184o174j954L235J546l20o094j808
17156A0179L635M16L059J94l949J50K85k438k515K977k572M179r15k720J105o49
17140A0421j4219l02J0612Q939L46n604k299P180K081j431L402N386l003l505
17126A8004j950L56n380p63n25N939K130K940J983k682l892r62k516K041l427
$$ y = [21036, 17547, 15698, 15940, 20021, 26699, 24112, 19810, 18646, 21398, 20471, 18851, 11545, 10857, 11619, 10080, 11058, 6603, 6210, 9309, 6612, 2744, 3715, 12673, 13556, 14000, 14610, 18286, 16002, 10847, 8363, 7723, 11878, 14824, 15970, 11663, 8029, 6233, -2469, -3046, 43, 4835, 9381, 6394, 3789, 3688, 364, 454, 4363, 7385, 8687, 12799, 11508, 19020, 19212, 12792, 3927, 4280, 14436, 21467, 29460, 32814, 29695, 24873, 20791, 23425, 26016, 24853, 26034, 25932, 21748, 15574, 13620, 16855, 18401, 18081, 11987, 10179, 13814, 14230, 17289, 17483, 13534, 13684, 13969, 11531, 9016, 11993, 9421, 13600, 12685, 9965, 11070, 10421, -3798, -4100, 6512, 15451, 15797, 10193, 7894, 15074, 17155, 15724, 19126, 24512, 21509, 18004, 16054, 16410, 11030, 10267, 9742, 15681, 17811, 20751, 22734, 20052, 16160, 15198, 12682, 14723, 11296]
17111A1296K831O860j729P44N396l244j232M640n830n017N806J223K939K743k148
17096B5278k722j1464m306m536J863j118j235l284K358L976j65J325k612o136
17082b778o24O223M564J749m424n15J165K919N96p3K330r328J016K480k505j505
17066A290J124L154n332m284O780N396J175K307M715J423m046n633J10j044m981
17051B154j466P010N768N044l03k11j860k547j3178n549Q399P103k0J086O31m424
17035G637j452M465K385L288L270o116o097l149N400M820J635L83k92j860J6876
17020C1193J624R27J441j998p836J313o24k700J244K66n662l678J043J549j651
17005A6451l859K836M595j106j318n488p12Q259k72m524l123P751N343K526J1751
$$ y = [11296, 14127, 20987, 19258, 20002, 25398, 22154, 20922, 25562, 19732, 14715, 20521, 21744, 24683, 27426, 25278, 22556, 11092, 6786, 2250, 4113, 2995, 1760, -1524, 834, 4810, 4645, 5970, 3358, -2778, -3402, 2821, 7385, 9134, 4710, 4195, 5360, 8279, 8875, 8802, 11132, 1804, 2820, 5300, 2795, 1290, 2414, 5568, 236, -4048, 2732, 8128, 9303, 11610, 16325, 17748, 13702, 8069, 8179, 7135, 2154, 688, 7698, 13466, 18510, 18207, 17996, 16136, 13589, 411, -5138, 3261, 10364, 10344, 11430, 12061, 7637, 6185, 10650, 13035, 16323, 19593, 13477, 7380, 4231, 9631, 14451, 16086, 16469, 16177, 14317, 31193, 32817, 33744, 35185, 33187, 25351, 26664, 26040, 23340, 24584, 24850, 19188, 15510, 16553, 18102, 16451, 12592, 15428, 20023, 18917, 17599, 12111, 11399, 19658, 19386, 14862, 11739, 19490, 24833, 27359, 39110]
16990C9110L925o445k878k974L645J1487n3j1565j1618o092L8j897n889p115o085
16975d406j0981j690O820Q890L392k067k652l573M668P334k542o562p50L84J121
16960b614Q357N339O241M783m582p204j763M24N886m876j723J624P772m86k854
16945A4324k606K844k265O997J1563Q349K565n420J847O421R227J3014Q921N525
16931H1306N236j127n87l155P272n381j4618j3001j5759n839j325k175l548l463
16917B3836q0m549k454n848p503l598J188M680j447M911L410p55N662M965J89
16902B2607R28O350N008J2866k542p495n64L598J583Q8J603k040L900p47m739
16887D0404j120q810N841N107j0056r118o31N379j454L949L753J779q944l565
$$ y = [39110, 43035, 36590, 33712, 30738, 34383, 45870, 45817, 34252, 22634, 16542, 16580, 14683, 8794, 1679, -4406, -15387, -17077, -10257, -1367, 2025, -42, -2694, -6267, -1599, 5735, 3193, -3369, -4119, -3735, -2614, 5743, 11082, 17323, 22106, 17524, 10320, 8557, 8981, 14867, 9991, 8268, 9892, 17664, 17178, 14324, 11718, 14562, 12297, 19294, 30857, 39206, 41771, 36351, 38198, 44619, 53846, 66860, 75781, 81306, 86542, 85415, 84828, 81673, 88945, 83564, 68946, 55945, 40186, 34347, 33022, 30847, 27299, 23836, 23756, 19207, 16753, 10905, 3402, -196, 992, 5672, 4225, 9136, 12546, 11791, 17453, 22418, 22607, 23535, 29885, 34893, 47759, 45217, 37722, 37158, 40756, 42339, 42427, 44030, 41990, 45890, 45143, 40404, 39284, 30474, 36315, 41422, 31366, 22248, 21617, 26996, 25542, 29491, 33244, 35023, 26079, 22514]
16873B2514Q574O982m605n155j2804q866Q026L859r576p229o390R104R423l60
16859A3497K766p14k356L14L239l503j333J703L776M771J047J474k468r42j340
16844A9931j836J405J382m219q418L649J865O703J0879Q588M962L439k08j051
16830D7071O845J634l470K741J599P350R830L059m868l487K132k91J082k449k65
16815F8513k601l064m795n54k493l402M135m236j945N085J0464L549l252N67N493
16800G1464Q353J4969Q622M771q584k979O753Q245K743K537N169P177P603J8245
16786A55088K3367P687j0470j9415r104J6639J1471r23j1256j4488r755n30P559
16773A45870j631o437p115r852j30Q325L015K60M69M06M875K131N805j939o80
$$ y = [22514, 31088, 38070, 33465, 28310, 15506, 6640, 14666, 18525, 8949, 1720, -4670, 4434, 13857, 13497, 16263, 15549, 13193, 13507, 16746, 13243, 11910, 13613, 17389, 22160, 23207, 24681, 22213, 21271, 19931, 18095, 19500, 20882, 16663, 8245, 11894, 13759, 20462, 31341, 39929, 44891, 48330, 48122, 47071, 53916, 55550, 52080, 54821, 56420, 63770, 73600, 76659, 71791, 68304, 70436, 70145, 71227, 68778, 68513, 65912, 62848, 58053, 57499, 55006, 51604, 55739, 51503, 49558, 54643, 65107, 68656, 65404, 65971, 71464, 79817, 94786, 103408, 108179, 99595, 96616, 103369, 111614, 114357, 116894, 122063, 129240, 136843, 155088, 178455, 186142, 175672, 156257, 147153, 163792, 175263, 174340, 163084, 148596, 138841, 138311, 145870, 144239, 137802, 130687, 120835, 120705, 129030, 132045, 132305, 132774, 133180, 138055, 140186, 145991, 144052, 143372]
16758A43372M67Q463O543K988M307k142N156J3746Q988J206O549M282K077P397
16744B13399N472N506R807O349O331J2355J0751N240Q232J0180R162J1406J5183
16731C29373J4358R131K0659K8355J9568K1774J9953J5650K3568L9743L8861M2945
16719F23938M6796O7745R3502R0943O9188P1710P8315J37669J87978J29125N6432
16708A653341K8124M1087J45198K01831J32258J02182J10706J40037K10875K63322
16698C028961L18566M58650N79935O45495Q21968J113627J657635K618909M195490
16689A5439236O762064J0046922J0156261N658924L793018N561576J4516377K4581343
16681I6515721J5997267j859422r722392j0478350N729973J6224506K452051j1564136
$$ y = [143372, 143839, 152302, 158845, 161833, 166140, 163998, 169154, 182900, 191888, 193094, 199643, 203925, 206002, 213399, 218871, 224377, 234184, 240533, 246864, 259219, 269970, 275210, 283442, 293622, 302784, 314190, 329373, 343731, 352862, 373521, 401876, 421444, 443218, 463171, 478821, 502389, 542132, 580993, 623938, 670734, 738479, 831981, 922924, 992112, 1063822, 1142137, 1279806, 1467784, 1596909, 1653341, 1681465, 1722552, 1867750, 2069581, 2201839, 2304021, 2414727, 2554764, 2765639, 3028961, 3347527, 3806177, 4386112, 5031607, 5853575, 6967202, 8624837, 11243746, 15439236, 22201300, 32248222, 42404483, 48063407, 51856425, 57418001, 71934378, 96515721, 112512988, 110653566, 100931174, 90452824, 96182797, 112407303, 114859354, 103295218]
16673A03295218k0224069j8814728p400185k868751o009720q559997j0108597
16666B9309171q052901m968137l188532k202700j598762j167358q27189o48710
16658F654882o22483n88454n49130m11566l02238k81884k76594k51007j82330
16649C189196r0607j20614j76275k03353j73422p5298k9002j10565j63657k02297
16639A844106j65253j04224q1361j00641j04591j00502p1921n9216o3730o6385
16629I26282m5719l5357l0277l5875l7254k4521l2431l4049l2396k5575k5927
16618E66901k3019k1740j6384j6356k1312j2840j2437j9334j5748j3174j2279
16607C82278j4178j4933r024p127j5100p960n221j2704j3256k795P858j0243j3032
$$ y = [103295218, 83071149, 64256421, 56856236, 53987485, 47977765, 39417768, 29309171, 21256270, 16288133, 13099601, 10896901, 9298139, 8130781, 7303592, 6654882, 6032399, 5443945, 4894815, 4483249, 4181011, 3899127, 3622533, 3371526, 3189196, 3098589, 2977975, 2801700, 2598347, 2424925, 2349627, 2320625, 2210060, 2046403, 1844106, 1678853, 1574629, 1493268, 1392627, 1288036, 1187534, 1115613, 1056397, 992667, 926282, 880563, 845206, 814929, 779054, 741800, 717279, 684848, 650799, 618403, 592828, 566901, 543882, 522142, 505758, 489402, 468090, 455250, 442813, 423479, 407731, 394557, 382278, 368100, 353167, 344143, 337016, 321916, 313956, 308735, 296031, 282775, 279980, 287838, 277595, 264563]
16594B64563p717p785j3712j0969m495k119m087r577k019j680k813q068m193j309
16580A84020q93o598l981r75J207o789r958q739l929m380r138p943j147k680K429
16565A20506O96J206j244N588L890J011k523j204J4216J5252J1917n134n441k628
16551A56108P08J3196P330j0504p063j0158j6867n013j423j2480q116j022l529
16538A01167j0229m514j1982r302k235k345k376j185R070j967m325j651J79J222
16524E9527J2110J980k542l968R407J5290O556M04l385p545p157n403J823M311
16510H1408o233o795n343M123p87L536m163n104L325L43R25j32l133M01O764n462
16494F3673q59L683k58L97l24L677p35k669j5778q007o110k958K118Q78o88l770
$$ y = [264563, 256846, 249061, 235349, 224380, 219885, 217766, 213679, 204102, 202083, 200403, 197590, 189522, 185329, 184020, 183127, 176529, 172548, 171573, 172780, 165991, 156033, 147294, 143365, 138985, 129847, 121904, 120757, 118077, 120506, 121202, 122408, 121164, 126752, 130642, 131653, 129130, 127926, 142142, 157394, 169311, 164177, 158736, 156108, 156816, 170012, 177342, 166838, 159775, 149617, 132750, 127737, 126314, 113834, 105718, 104696, 101167, 90938, 86424, 74442, 65140, 62905, 60560, 58184, 56999, 66069, 64102, 59777, 58126, 58305, 59527, 71637, 73617, 71075, 67107, 76514, 91804, 98360, 98764, 95379, 87834, 80677, 75274, 77097, 81408, 75175, 68380, 63037, 67160, 66373, 69909, 65746, 60642, 63967, 64310, 65235, 65103, 61970, 62371, 69135, 63673, 62814, 66497, 66239, 66636, 66312, 69989, 69254, 66585, 50807, 42800, 36690, 33732, 35850, 36728, 36040, 32270]
16478C2270n912m943l84N657K673K909K150k410m369k407l534m666P68M856n09
16463B2149m737O681K671M475n59J279L611N382J19k263n955K269K243k876O987
16448D1476O66o660j098L851O766M552j105l329J069M04m325r326K07K743j535
16433C4356L484Q80k9O364O898j846p106m046R33m941l224P697L394n03m247O46
16417C8710k58R10k836k154k820n67Q93l442j4781P99Q164k419j902M290j882
16402B0705R53M431N293O02O773j114k232K118J246n590O02k811j070K035N108
16387C7049k218m182J622n645o214O275P44l637k729n335l384r20j511n065j1142
16372f292j1679M124P680o469n725P68P103N045N206j96j907P38M387P214l452
$$ y = [32270, 26358, 21415, 21031, 26688, 29361, 32270, 34420, 32010, 27641, 25234, 21700, 17034, 17802, 22658, 22149, 17412, 24093, 26764, 31239, 30680, 31959, 35570, 40952, 41071, 38808, 32853, 35122, 37365, 34489, 41476, 42142, 35482, 34384, 38235, 45001, 49553, 48448, 45119, 46188, 46592, 42267, 32941, 33148, 35891, 34356, 37840, 38720, 38691, 45055, 51953, 50107, 43001, 38955, 39888, 34947, 31723, 39420, 42814, 42311, 38064, 38710, 38452, 39362, 36526, 34372, 31552, 30985, 31878, 28436, 13655, 14454, 22618, 20199, 18297, 22587, 20705, 21658, 26089, 31382, 31984, 38757, 37643, 35411, 37529, 38775, 33185, 33787, 30976, 29906, 31941, 37049, 34831, 30649, 32271, 26626, 20412, 26687, 27431, 23794, 21065, 15730, 12346, 11426, 9915, 4850, -6292, -17971, -13847, -6167, -12636, -18361, -17593, -10490, -5445, -239, -435, -2342, -1604, 2783, 9997, 6545]
16357F545m379J086J074r51q765q77M005L612M971p799K542j884l423J136Q84
16342b223l570j340J392R117L770r23J416L6M159l041k167m722K529O618n196
16327E855j0646p828r2L527M287Q64Q630L365q733J607m4r324k172N340K091j957
16311e230J011M738K460N533J719l502p636m631L299K521N900p346j016k574k259
16296g013n12L465M907p73R96M020J719L029j649r36O359j055O2J662L94L2j571
16279A3136L521L085L508J329m370J17j334n512m335l738p20k204o33o479m565
16264i194N48P06N368N85O041m710m134o689J422K431R64j548n706l510k545R545
16248a0426L105o504j642L193O749O854n421k62j296K06n03L67J512J104k523
$$ y = [6545, 2166, 3252, 4326, 3375, -5390, -6267, -2262, 1350, 6321, -1478, 1064, -820, -4243, -3107, -2223, -5793, -7133, -5741, 3376, 7146, 6223, 7639, 7675, 11834, 8793, 6626, 1904, 4433, 11051, 5855, -4791, -12619, -12711, -9184, -4897, -4033, 4597, 7962, -771, 836, 792, -8532, -10704, -5364, -3273, -5230, -4219, 519, 2979, 8512, 10231, 6729, -907, -5538, -2239, 282, 6182, -1164, -2180, -4754, -7013, -7525, -4060, 847, 74, 1070, 5090, 6809, 9838, 8189, 7253, 13612, 12557, 12619, 14281, 14675, 14707, 13136, 16657, 19742, 23250, 24579, 20209, 20326, 18992, 13480, 9145, 5407, 4687, 2483, 1850, -4629, -9194, -8646, -7940, -2572, -1987, 4054, -656, -4790, -11479, -10057, -7626, -6662, -8210, -13916, -17426, -19971, -10426, -7321, -13825, -15467, -12274, -5525, 1329, -4092, -4354, -5650, -5444, -5947, -5580, -4068, -2964, -5487]
16233e487o320K536j907j830L497M049O39J450J882N55P675K884j479k293M392
16218A0243N903Q56l536p040j336O058l880l166J584m261j97L389L224K654M673
16203A5168m998k326j549n125L547M279N346j902n715l002K522n295Q59R01K47
16188B957L189q888q476l955R700P371r69j770J906K700l182L417k44o980j1059
16173a4283K308M879O270K450k83j998O86L573R60N94k702J039j63q53o230k826
16157f579M789O376l841o534l369R343M731K285k452O51m963m950l024m090P599
16142d028K892P11K086p13r12l479J178l333L556L564n00j833l833M011J183J964
16126B514p373J046M730m968K527M989N919j301m426J540j719n523n74M305K451
$$ y = [-5487, -11807, -9271, -11178, -13008, -9511, -5462, -4823, -3373, -1491, -936, 6739, 9623, 8144, 5851, 10243, 16146, 17002, 13466, 6426, 5090, 11148, 7268, 4102, 5686, 1425, 1228, 4617, 7841, 10495, 15168, 10170, 7844, 6295, 1170, 4717, 8996, 14342, 12440, 6725, 3723, 6245, 950, 1809, 2710, 2957, 6146, -2742, -11218, -15173, -5473, 1898, 929, -841, 1065, 3765, 583, 4000, 3756, -3224, -14283, -11975, -7096, -826, 1624, 1341, -657, 29, 3602, 4562, 5156, 2454, 3493, 3330, 2477, -3753, -6579, -1790, 4586, 745, -5789, -9158, 185, 4916, 7201, 4749, 5400, 437, -4513, -7537, -11627, -4028, -1136, -425, 1661, 948, 36, -3443, -2265, -5598, -2042, 1522, 1022, -811, -4644, -633, 550, 2514, -4859, -3813, 917, -4051, -1524, 3465, 9384, 8083, 3657, 5197, 3478, -2045, -2619, 1686, 4137]
16111D137J173L024L120j069J817n25K273O695J856J941Q65j1481M914J341l079
16096A7002R50N589J4157J5456K7886L8724M9232N2493L4387J9889L4285Q3914
16084C93964J33801Q1048j419n6125m8176M0610P4635L030o9342j11943r5753
16073C44330l5889j5974l9049m8286n3013n0522k8501j4979l261p584m948P051
16061D9375K412p934n780q542k298k236p748j0428K786L646j806n136Q760L9r916
16046E194m956o41O519O544J305k761j984Q06k734m412n139j440J786k690l233
16031g836K481L848Q69m204N90K254L451j159j081L305J35p22k069l993J441P883
16015E193J362k264M194N33j682n722m987L898N562l059k452J708l23K17l534
$$ y = [4137, 5310, 8334, 11454, 10385, 12202, 11677, 13950, 20645, 22501, 24442, 25307, 13826, 18740, 20081, 17002, 17952, 23541, 37698, 53154, 81040, 119764, 168996, 221489, 255876, 275765, 310050, 393964, 527765, 608813, 607394, 551269, 503093, 543703, 618338, 621368, 552026, 440083, 344330, 308441, 292467, 253418, 205132, 152119, 101597, 73096, 58117, 54856, 47272, 42324, 49375, 51787, 43853, 38073, 29531, 27233, 24997, 17249, 6821, 9607, 13253, 11447, 6311, 15071, 15110, 5194, 238, -403, 6116, 12660, 13965, 11204, 9220, 10026, 7292, 2880, -2259, -3699, -1913, -4603, -7836, -5355, -1507, -638, -4842, -4252, -1998, 1453, 294, -787, 2518, 2653, 1931, -138, -4131, -2690, 5193, 6555, 4291, 8485, 9018, 7336, 1614, -3373, 525, 6087, 3028, 576, 2284, 1961, 2178, -1356]
16000a356K702l484m380l968o851Q477n2l0K756l320m020K141Q64k595N622J0238
15984B744N860m653p400n591R25Q809l8N09o52k494M955N250m290j806l653o877
15968h402o115K363j44L497K242L084o3J256N459J082J593l728M054J856m839
15953C195N03J091l032L222J904J040n335l778l146O83q362j856ML024J481n341
15937a4703R90L31J516J939N861N469p59j396K220p704j081M064P856K881k943
15922D541l731O297l94m327m590j539J929J283K516J950L133l413m62Q88l986
15907I5j652j35j242k995N200K221j200J570l060J827L790n193j676R64m898K005
15891d379L978j883n548J920M431K536L930J562n98n512L108k526M816k97l194
$$ y = [-1356, 1346, -2138, -6518, -10486, -17337, -8860, -8912, -8942, -6186, -9506, -13526, -11385, -10521, -13116, -7494, 2744, 8604, 3951, -3449, -9040, -8115, 694, 656, 1165, 513, -1981, 2974, 8224, 3934, 2128, -1525, -8402, -14517, -12154, -12298, -8801, -6559, -3475, -3538, -2282, 3177, 4259, 5852, 2124, 6178, 8034, 3195, 3698, 4789, 1757, 4979, 6883, 7923, 2588, -1190, -4336, -3653, -12015, -13871, -13867, -10843, -9362, -14703, -13713, -13382, -11866, -9927, -4066, 1403, 644, -752, 1468, -6236, -7317, -3253, 4603, 7484, 4541, 810, 7107, 6713, 2386, -2204, -3743, -1814, -531, 1985, 3935, 7068, 3655, 3193, 4081, 95, -1557, -1692, -2934, -5929, -729, 1492, 292, 1862, -1198, 629, 4419, -774, -2450, -1486, -6384, -4379, -401, -2284, -7832, -5912, -1481, 1055, 4985, 6547, 5949, 437, 3545, 1019, 5835, 5538, 2344]
15876B344j504l525j750M996J0035m919p238l946K344K101k233m217J370M050
15862b092J708Q112J971j196n37n023k759m702M059j497J551j50J558l854Q96
15847a955K307k319n057k713k012j876M420r18p69K678L43N506N952n159m914
15832f486L966J558n825l955N34M798M497q31l92k591N969l393k170K340J449
15817e32q30j004O779J127m147p30J322K728k108J718K75K264l237k433L156k688
15801A660q58k774K562J465p092l951P193N730K038P15j1866n889L223m61J0510
15786B205m734R88P13L340N5q32j881r895O091M888l674L473L825R582N596r8
15770A9642n515l710l384q470m487L192L075o359k086K085J746j240m943L266
$$ y = [2344, 840, -2685, -4435, 561, 10596, 5677, -1561, -5507, -3163, -1062, -3295, -7512, -6142, -2092, -384, 7728, 9699, 8503, 7966, 2943, 184, -4518, -459, -1956, -405, -555, 1003, -2851, -1955, 352, -1967, -7024, -9737, -11749, -13625, -9205, -10123, -10892, -8214, -7871, -2365, 3587, -1572, -6486, -2520, -962, -6787, -10742, -10208, -5410, -913, -1744, -2136, -4727, 1242, -2151, -4321, -1981, -532, -1362, -2366, 4413, 5540, 1393, 663, 1985, 4713, 2605, 4323, 4598, 6862, 3625, 1192, 4348, 1660, 802, -1972, 590, 2055, -5037, -8988, -1795, 3935, 5973, 6688, -5178, -11067, -7844, -8305, 2205, -2529, -1541, -828, 2512, 2567, 1735, -146, -10041, -3950, 938, -2736, 737, 4562, 14144, 19740, 19642, 14127, 10417, 7033, -1437, -5924, -2732, 343, -6016, -8102, -6017, -4271, -5511, -10454, -7188]
15756g188N48N82K956J3M942j55K78o42k64L951R51k912r21p751M54R075p736
15739c819o422K912L702j127k520j627L668p91L912j001O140K949K132o684j924
15724e00j936Q73N851j291k398K818Q81L002L189m945q967O614L518k234q057
15709c582l081j58O1k062k697L816P870M316K995N53k90n574l313L939O802r123
15693D72M93m715J013L4M522P749K175n805q208J506r76m788p7M787J319L516
15677C017O01j238L690m669j46r17p818q856N061q22N73M856J540P14M041J877
15661A504n458m75K201J334j670m664p047N070K636P465N594j746Q28n24K226
15646G274K359j897m779k260m188o923m178J322J551k527M712M307Q65K960J345
$$ y = [-7188, -6640, -6058, -3102, -3089, 1853, 1698, 1976, 1334, 1070, 5021, 5972, 3060, 2139, -5612, -5158, 3917, -3819, -10241, -7329, -3627, -4754, -7274, -8901, -5233, -6024, -2112, -3113, 3027, 5976, 8108, 1424, -500, -2436, -1563, 4288, 2997, 599, 3417, 4298, 7300, 10489, 5544, -3423, 3191, 6709, 4475, -3582, -6663, -6821, -6760, -8822, -11519, -7703, 167, 4483, 7478, 8031, 7741, 2167, -1146, 2793, 9595, 472, 965, -3750, -2737, -2703, 1819, 9568, 11743, 5938, -2270, -764, -1740, -6528, -6605, -1818, -499, 3017, 3618, 2380, 6070, 1401, 1255, 338, -7480, -16336, -11275, -12097, -11524, -6668, -5128, -4414, -373, 1504, -3954, -4429, -2228, -894, -2564, -7228, -14275, -9205, -6569, 896, 6490, 4744, 5572, 5048, 7274, 9633, 7736, 2957, 697, -3491, -10414, -14592, -13270, -11719, -14246, -9534, -5227, -4362, -1402, -57]
15631e7O050N088r922q446K312L763N773j276k626r913k683l372R375Q824j757
15616A133o68j019J149L467R491q081r842j681j833Q238P931r29m039K227m170
15601A374o22K589l50O190o352j0654P479K494l256L192K838L189j071O4q761
15586a657L998R368L85k43J102l742K946k591l822k115m708l191P736L732J673
15571H871j885l716n87r75J672q334n770K647m52j248O075j498O598L461q195
15556c336o16k82J033N095J970J72L034J0009K18l274n853l65L478J857p511j119
15540D510L682Q51k231n106o066N279K737K820J698p173j046k427M51o028L578
15525d471O420Q277J890r15M184o081n397L248K268K041m469l622m514J140L678
$$ y = [-57, 5993, 11081, 1159, -7287, -4975, -1212, 4561, 3285, 659, -9254, -11937, -15309, -5934, 2890, 1133, 465, -554, 595, 4062, 13553, 5472, -4370, -6051, -7884, 354, 8285, 7356, 3317, 5544, 1374, 752, 3341, 2991, 9181, 2829, -7825, -346, 2148, -1108, 2084, 4922, 8111, 7040, 7104, -1657, 2341, 11709, 12094, 11851, 12953, 9211, 12157, 9566, 5744, 3629, -1079, -4270, 3466, 7198, 8871, 6986, 3270, 2683, 1708, 3380, -4954, -10724, -8077, -8529, -9777, -3702, -5200, 1398, 4859, -3336, -3952, -4234, -3201, 1894, 3864, 4036, 7070, 17079, 17297, 14023, 8170, 7805, 11283, 13140, 5629, 4510, 8192, 9043, 6812, 1706, -4360, 919, 3656, 6476, 8174, 1001, -45, -2472, -2021, -8049, -4471, 1949, 10226, 12116, 11201, 15385, 9304, 3907, 7155, 9423, 11464, 6995, 3373, -1141, -1, 3677]
15510C677j071j127J863J881k229p12j701o954k787Q922P707O041l891m437j225
15495C957q51P385M50k202j378K96O023o071r79j777k707k866k421Q381j141o140
15479b041M058N391J343k271k266r19K948K69M284J794p516j979q21P71Q50K107
15463F002o258n972K322L012J557q84K081P194K582p690q16M544o349O077j576
15448E826j420L215n595o515j898L632N157l30M808k839m286j879L670J190j913
15433H23J300M834m048m476K488K53K907L928j280O38l675k55L198J292M612M105
15417A6644k631q504O64j269K009N355M341l129m860k406M75l581j892K861j619
15402B458L728M537P084j314r278K170O214o442j807n801l675j781K138N505j528
$$ y = [3677, 2606, 1479, 3342, 5223, 2994, 2282, 581, -6373, -9160, -238, 7469, 13510, 9619, 5182, 3957, 3106, 10491, 10941, 8739, 7361, 7657, 13680, 7609, 6630, 4853, 2146, -720, -3141, 5240, 4099, -2041, 2017, 7408, 8751, 6480, 4214, 3295, 6243, 6512, 10796, 12590, 5074, 3095, 2274, 3045, 3895, 6002, -256, -6228, -3906, -894, 663, -221, 1860, 9054, 11636, 3946, 3130, 7674, 1325, 7402, 5826, 4406, 7621, 2026, -4489, -6387, -2755, 2402, 2072, 6880, 4041, -245, -2124, 1546, 2736, 823, 2123, 6957, 2909, -1567, 921, 1174, 4081, 8009, 6729, 7367, 3692, 3437, 6635, 7927, 12539, 16644, 14013, 5509, 6173, 4904, 6913, 12268, 16609, 13480, 8620, 6214, 6689, 3108, 1216, 4077, 2458, 6186, 10723, 17807, 16493, 7215, 9385, 15599, 9157, 7350, 1549, -2126, -3907, -1769, 3736, 2208]
15387B208r047j0222j801L376K155J224N676Q450J0201m72j203K281m413p002
15373A411l123N475P73q577m482L282J227P139P467j354o197l374n765L657K606
15358A65k40j601M53l557N89n803j66J550p24n92k822o000m20M63R086R963J947
15341B291L578q527O329O771K285q037k925L747k649J37M896n999n847m489P344
15326a095N141J01j530J725n721m840l239m325r75Q468K622N162Q119K353k342
15311I624o067m47n673L69r30k844j17L40j408l55m400L025N253L289l455k009
15295e805j187O301r390l231k59m007L04O692L195N807j405N483P68k008J869
15280C127j234j14J031J719L76K10p740n169J409l614L175J053M386O109M379
$$ y = [2208, -6839, -17061, -18862, -15486, -13331, -12107, -6431, 2019, 12220, 11748, 10545, 12826, 8413, 1411, -1712, 3763, 4536, -4041, -8523, -5241, -4014, 3125, 10592, 9238, 3041, -333, -6098, -2441, 165, -75, -1676, -1223, -4780, -4191, -9994, -10160, -8610, -9334, -9926, -12748, -18748, -19168, -18705, -9619, 344, 2291, 5869, -2658, 3671, 10442, 12727, 4690, 1765, 5512, 2863, 3000, 7896, 1897, -3950, -8439, -1095, 4046, 4147, 2617, 4342, -1379, -6219, -9458, -13783, -14758, -6290, -3668, 1494, 9613, 11966, 9624, 3557, 3110, -2563, -2194, -3124, -5968, -6085, -5745, -7153, -7508, -11908, -8883, -3630, -341, -3796, -5805, -6992, -691, -10081, -13312, -13571, -17578, -17274, -10582, -7387, -1580, -2985, 2498, 3266, 1258, 3127, 1893, 1779, 2810, 4529, 4905, 5115, -2625, -7794, -6385, -9999, -6824, -5771, -1385, 4724, 9103]
15265I103k714n483m222K932K085k001n494j03j339M564r15L950j662q070K720
15250f649j612J179J71L946o00k901L639M577j885n448J420l747k589N97J958
15235g944O386M362p759M985J179l984K33j26J208m021j033o408l337P197O649
15220b413N268L136m388m366J747M980N883n3l254r92l254o995k08J775j358l053
15204g545M193N650O83l711J940m572o174J153j212l35O215J92K494J011J353
15189A335M52j119l962JL579l006l203O359L083n664L08K097L260L559R38p151
15173H66m328O107J3508q57N49P248K983j1356m524M85j116o61k898l386L315
15158E935j563p078k901Q697Q62p0N589p15n017j475o99O44P32j365j015l312
$$ y = [9103, 6389, 906, -3316, -384, 1701, -300, -5794, -5897, -7236, -2672, -3587, 363, -1299, -9369, -6649, -8261, -7082, -6911, -2965, -3565, -6466, -2827, 1750, -135, -5583, -4163, -7910, -10499, -9902, -7944, -1558, 2804, -4955, 30, 1209, -2775, -2542, -2668, -1460, -5481, -6514, -12922, -16259, -9062, -2413, 2855, 5991, 1603, -2763, -1016, 3964, 9847, 9794, 6540, 5548, 2294, -4701, -4909, -3134, -4492, -7545, -3352, 2298, 2981, -730, 1210, -3362, -9536, -8383, -9595, -9930, -3715, -3523, -1029, -18, 1335, 1787, 668, -3294, -3293, 286, -2720, -5923, 436, 3519, -2145, -1837, 260, 3520, 7079, 8017, 866, -3462, 2645, 16153, 15296, 15845, 23093, 26076, 14720, 10196, 10681, 9565, 8904, 6006, 2620, 5935, 4372, -2706, -5607, 3090, 3952, 3882, 9471, 8756, 3739, 2264, 1565, 2209, 2941, 1576, 561, -2751]
15142b751J451K316j188j534K843J051j837l777k066k530K795q6n998j360K770
15127i901J2011n18j1288P552R036j857K934M284q784J701q10p33j055p386L117
15112a697N002k697J250O473N899m807n550l377L153L790m75r821m353K838j611
15097e983J214J409L491k163n726k527K246P84M848k181m217M04L560j072K110
15082c803j905O20M470M860J174k291k976O60N847j755j852q110M46j463P288
15067A210l87m407k215M371J228J535N757M27k293r400K099L654N00K304N09M184
15051I076r505l783k330K856J173m249N24K556K453L959M748P22m836k360k514
15036a510j526o45K558M167M476K16j819N274k816M19K86K291l25r047J328N117
$$ y = [-2751, -1300, 1016, -172, -1706, 1137, 2188, 351, -3426, -5492, -8022, -5227, -5313, -11311, -12671, -9901, 2110, 1592, -9696, -2144, 6892, 5035, 7969, 12253, 3469, 5170, 4360, 3627, 2572, -4814, -1697, 3305, 608, 1858, 8331, 14230, 9423, 3873, 496, 3649, 7439, 6964, -2857, -7210, -4372, -5983, -4769, -3360, 131, -2032, -7758, -10285, -8039, -7255, -2407, -4588, -8805, -8401, -4841, -5913, -3803, -5708, -5088, -618, 4242, 5416, 3125, 149, 809, 6656, 4901, 3049, -5061, -4615, -6078, 1210, 823, -3584, -5799, -1428, -200, 1335, 7092, 7519, 5226, -4174, -2075, 1579, 2079, 4383, 4892, 9076, -429, -4212, -6542, -3686, -2513, -6762, -6238, -3682, -1229, 2730, 7478, 8200, 3364, 1004, -1510, -3036, -3681, -1123, 3044, 7520, 7736, 5917, 11191, 8375, 8794, 9080, 11371, 11046, 1999, 3327, 8444]
15020H444k7J115M112M46M627M2j05N725j710m590l102J0333R777P006J969P864
15004E1926K168J082J4927K0477J8242K2802L5096N7559Q7386J48563K66876N03857
14992A230961Q50979Q11895l263m64221q39731o61123l39177j79517j01844o2579
14982B42380m1559l2425k9456k6546j8220r211j2726r736j49m075p283p508j383
14969D2103k056r47p254p424q146k345J877O765N160j900m503r444o048O534L432
14954A5804L662j751q160J811M522J892o307j95k24n692j475K288J131N331J684
14939A4321k875k388n104j853M943k800JJ838m095p575O700N642m365k046M40
14924G84M399K579m414K37O43N485O049m835o536o491k276j306N520Q223k779
$$ y = [8444, 8417, 9532, 13644, 14090, 18717, 18759, 18654, 24379, 22669, 18079, 14977, 25310, 35087, 42093, 44062, 51926, 54094, 55176, 70103, 90580, 108822, 131624, 166720, 224279, 311665, 460228, 727104, 1230961, 2081940, 2893835, 2890572, 2426351, 1586620, 925497, 586320, 406803, 304959, 242380, 200821, 168396, 138940, 112394, 94174, 84963, 72237, 62501, 62352, 58277, 50994, 43486, 42103, 40047, 39100, 31846, 24422, 16276, 13931, 15808, 22573, 27733, 25833, 21330, 11886, 5838, 12372, 15804, 19466, 17715, 9555, 11366, 15888, 17780, 11473, 11278, 11054, 5362, 3887, 6175, 7306, 12637, 14321, 11446, 9058, 3954, 2101, 7044, 4244, 4245, 6083, 1988, -5587, 1113, 6755, 2390, 344, 784, 5183, 7762, 3348, 3585, 4228, 9713, 15762, 10927, 4391, -2100, -4376, -5682, -162, 8061, 5282]
14909E282m704m371p90L551K689J199r72l722j184N287L165K370k193k576P034
14894A0065j012n28J113l009n741o782M961L713p953M520J450P18J321L837L162
14879I835O652p37j776K559l559m019q557k490P835l582k838k336l327P262R185
14864A0107l845l998J82P340Q29q21m154q054p098L104M076O220l071r006n551
14849a3740L912O607J917l090K895N053m817j183j505j973L835k186K510J458
14835c07j719r36J0125O869r453L95L798n895m305o293J131o45M414K256k829
14820c394l881L316L898L059K404Q579n858r271j923J405L446n40o562l722R591
14805E47J0386K905r024q573r09j3R032L560P2k775m565j0226J937k639j197J2366
$$ y = [5282, 578, -3793, -4583, -1032, 1657, 2856, 1884, -1838, -3022, 2265, 5430, 7800, 5607, 3031, 10065, 9053, 8525, 9638, 6629, 888, -5894, -933, 2780, -5173, -653, 797, 1515, 2836, 6673, 9835, 16487, 15750, 13974, 16533, 12974, 8955, 398, -2092, 5743, 2161, -677, -3013, -6340, 922, 10107, 6262, 2264, 2446, 9786, 10615, 9794, 5640, -2414, -9512, -6408, -2332, 3888, 817, -8189, -13740, -9828, -3221, -1304, -4394, -1499, 3554, -1263, -2446, -3951, -5924, -2089, -4275, -1765, -307, -2026, -2962, 7163, 14032, 4579, 4974, 8772, 2877, -1428, -7721, -6590, -7235, -2821, -565, -3394, -7275, -3959, -61, 2998, 5402, 13981, 8123, -1148, -3071, -1666, 1780, 1240, -5322, -9044, 547, 10933, 13838, 4814, -3759, -4668, -4681, 4351, 7911, 7983, 5208, 643, -9583, -7646, -10285, -11482, 884]
14789H84J0401n523r345j542O256J371O98j2694n732q77J4057l343p430K420N342
14774e057J160l716J15J426M181J359K453J354j90L473o459J361j1l003m316m03
14758f273P167q990m176k310n977K400K53M047P019M251j687M14Q51P360q075
14743c726l682K988L128P866p392k535L352j958j321l070j0111m171J0841P214
14729b577R38N019L403L817j880K089n686j0641j939Q297L608M54n442n038n66
14714f144m504M708O477J980L525l548q630j551k862J695J256O84O433k77J29
14699f29J071l966R66k208m984j684N128K043M940R754q77o933l538j898K92k254
14683d777L982K891j963L492O98o74K387K162j784l568j523l210m957n043N547
$$ y = [884, 11285, 5762, -3583, -5125, 1131, 2502, 3200, -9494, -15226, -16103, -2046, -5389, -12819, -10399, -5057, -3897, -7613, -7498, -6072, -1891, -532, 1921, 3275, 3085, 6558, 99, 1460, 1449, -1554, -5870, -6273, 894, -8096, -12272, -14582, -20559, -18159, -17906, -13859, -6840, -2589, -4276, -3862, -3011, 4349, -3726, -7408, -4420, -1292, 6574, -818, -3353, -1, -1959, -3280, -6350, -16461, -20632, -9791, -2577, -1639, 3380, 6783, 10600, 8720, 10809, 5123, -5518, -7457, 840, 4448, 4902, -540, -5578, -6144, -10648, -5940, 537, 2517, 6042, 2494, -6136, -7687, -10549, -8854, -7598, -6914, -481, -758, -629, 442, -3524, -2558, -4766, -9750, -11434, -6306, -4263, 677, 10431, 9554, 2621, -917, -2815, -2523, -4777, -795, 2096, 133, 3625, 4323, 3649, 6036, 8198, 6414, 2846, 1323, -1887, -6844, -11887, -6340]
14668f340O032o68J003O84o364l472K883P680l24j241o069j090K667M186J094
14653F61J388j967J056J777j149O166m256J47j653K050M078K392J035R72m082
14638H615j681o728Q53L82K085J506m184p59J0630K766m687m051n677q017J455
14623g492M837n63k994m755j990L028N047K055q455l775n472J123k28J2510n474
14608a2598l691K24L777P220L947l297j720J890J337M336N052m18j072L408o220
14593B175j18j798p076k200L401K75j174M935N895j214r94n767n380J17p048l612
14577a9583M513J0099M589Q12r82R31l48K391O60P393O7q041l083j724j314M810
14561A190K567K225M430m851p431l851K159K178J097o288l142L159M545M018J205
$$ y = [-6340, -308, -976, 27, 711, -5653, -9125, -6242, 1438, 1114, -127, -6196, -7286, -4619, -433, 661, 2049, 82, 1138, 2915, 1766, 7932, 3676, 3823, 2170, 4220, 8298, 10690, 11725, 12697, 8615, 6934, 206, 1059, 1441, 3526, 5032, 848, 89, 10719, 13485, 8798, 4747, -930, -8947, -7492, -2655, -3218, -6212, -10967, -12957, -9929, -4882, -2827, -11282, -15057, -20529, -19406, -19634, -7124, -12598, -16289, -16065, -12288, -5068, -1121, -4418, -6138, -4248, -2911, 1425, 6477, 6059, 4987, 8395, 2175, 2057, 259, -6817, -9017, -5616, -5341, -6515, -1580, 4315, 3101, 2107, -3660, -9040, -8923, -15971, -19583, -15070, -4971, -382, 430, -552, 379, 31, 2422, 3082, 10475, 10542, 2501, -582, -2306, -3620, 1190, 3757, 5982, 10412, 5561, -1870, -5721, -3562, -1384, -287, -6575, -9717, -6558, -2013, 2005, 3210]
14546C210p559R07L805j918k953k795j871K591O674k75n955N772L385k749j342
14531a073N098K944n578o330k301l96j371j591N278K661l48K899K310L106J663
14516F971K786l143J447j849m865j884k215q18M426J165l864m786O284N677L239
14501H571n57n29L572j966j09k915q361l024P738M204j729l178k708o787j269
14486i047J856j446k194j506R510K694K149l263j460n38N497J181k503O162l059
14471D033k195J130q41P83P62P3l798J426K303l235j754Q33J932M559L09k839
14455C481p76k539M25o53j47j633J50M809l374O75M575l836J462K770j396m943
14439i50j559k907m380N111k609L641L384J82P09n42K597J545l521P279J6247
$$ y = [3210, -4349, -3442, 363, -1555, -4508, -7303, -9174, -6583, 91, -184, -6139, -367, 3018, 269, -1073, 4025, 6969, 1391, -4939, -7240, -7636, -9007, -10598, -5320, -2659, -3007, -108, 2202, 5308, 6971, 9757, 6614, 8061, 6212, 1347, -537, -2752, -3570, 856, 2021, -1843, -6629, -345, 5332, 8571, 8014, 7485, 11057, 9091, 8982, 6067, -2294, -5318, 2420, 6624, 4895, 1717, -991, -7778, -9047, -7191, -8637, -10831, -12337, -2827, -133, 2016, -1247, -2707, -3245, 2252, 3433, 930, 7092, 4033, 1838, 2968, 2127, 2910, 3672, 3745, -53, 1373, 3676, 441, -1313, -480, 1452, 6011, 6320, 3481, 2705, 166, 591, -62, -209, -1842, -1692, 3117, -257, 418, 4993, 1157, 2619, 5389, 3993, -950, -2509, -5416, -9796, -4685, -7294, -3653, -269, -87, 622, 80, 2677, 4222, 701, 7980, 24227]
14424B4227O663P30r896j2817l827K20J438l458o021p790K19L74k489N066r77
14409h338k288j633m29J655k194K870M809m384j525J1025J047K851q31Q07l523
14394h1K592M250k926n031m302j830j47m516k295O643j304m631k427K788M436
14379h781O713L859n687j879K336O264L053K900j889k196n46o026L758P494K115
14364A1488m207n622o776J757N552l538J528l855q882K77M524k773k262j399K658
14349a1530J2153J1036J0193k969q191j262k520M151p050j2588k58P508J98n270
14335f399K161K41M545L919J88k61q20o190l0O389L537r417K834P454j629m902
14319A620r54R84j205q200k109Q474n19p367L783P376K909q085J212N529N24k356
$$ y = [24227, 30890, 31620, 21724, 8907, 5080, 5300, 6738, 3280, -2741, -10531, -10312, -9938, -12427, -7361, -8338, -10626, -12259, -12688, -11033, -13227, -10357, -5548, -9932, -11457, -432, 615, 3466, 2635, 3442, -81, 2511, 6761, 3835, -1196, -5498, -7328, -7475, -11991, -14286, -7643, -8947, -13578, -16005, -13217, -8781, -2068, 1791, -3896, -5775, -3439, 2825, 5878, 8778, 6889, 4693, 4147, -1879, 1879, 9373, 11488, 7281, 1659, -5117, -3360, 2192, -1346, 182, -3673, -12555, -12278, -7754, -10527, -12789, -14188, -11530, 623, 11659, 21852, 18883, 10692, 9430, 6910, 11061, 4011, -8577, -8835, -1327, -1129, -6399, -4238, -3997, 548, 4467, 4655, 4394, 3574, -2616, -2646, 3743, 7280, -2137, 697, 8151, 6522, 1620, 666, 1650, 445, -7755, -9864, -1390, -1909, -9276, -5493, 1883, 4792, -3293, -2081, 3448, 3972, 1616]
14303A616L031l080l20K146j86n568P519J996p239l29k977m467O526M837M611
14288H116k350J67l774j783O57L321j822m686J547l341P402k524m944p204m914
14273a6132L843o42O103N252k053O72L121j62m034L069N023R964O97n975O78r850
14257d26l985j9L071P447J182l642o528J525K74m07K182J136L148O389L741l537
14241A1551L342k927r392p666q375P440P229n198L92K453L126r7n216M324l277
14226b291j49L086j009J46K200J199k272N040O38Q59n439p243J555O595j926m402
14210c413l418L023n695o01M191M987P068K575l441K70p20P515J71o050J627l060
14194E029K90m928k666Q7j243J21j750q56N3M051Q378k841K019M515K311q923
$$ y = [1616, 4647, 1567, 1247, 3393, 3207, -2361, 5158, 7154, -85, -414, -3391, -7858, -1332, 3505, 8116, 5766, 5933, 2159, 376, 1033, 4354, 2532, -2154, -607, -3948, 3454, 930, -4014, -11218, -16132, -12289, -12931, -6828, -1576, -3629, -2957, 164, 2, -4032, -963, 4060, 14024, 14721, 8746, 9424, -426, -4411, -4430, -1359, 6088, 7270, 3628, -2900, -1375, -1101, -1508, 674, 1810, 4958, 11347, 15088, 11551, 14893, 11966, 2574, -5092, -13467, -6027, 1202, -3996, -3604, -1151, 1975, 1878, -3338, 986, -2291, -2440, 646, -363, -217, 1983, 3182, 910, 5950, 6588, 7447, 2008, -5235, -3680, 2915, 989, -3413, -6831, -3808, -9503, -10104, -5913, -926, 6142, 8717, 5276, 5546, 4826, 12341, 12512, 6462, 8089, 5029, 5319, 391, -2275, -2188, -3431, -3310, -5060, -5916, -5863, -1812, 6566, 3725, 5744, 10259, 12570, 3647]
14178C647r950m255J486O004J443J470N178K785p54o520K098j113n413l481K708
14163d667K155o029P82O648P787k715j401O925o008k025N644n658n682o439L601
14148g082M773Q25r81J999K605l998q840N121J172j960j274N36k669K392l234
14133a0615m180J395Q655M749q5J509k295n323k704R514N878o597m221l244N031
14118b533L859j081L42p09R50q76K440j474l483j574m941p2N781O370K223r340
14102d118j907M805j225P12l185l678J650Q368O598m204l018o216j995J153N728
14087e32J449K506J30q607l543Q26N889N286R68K44k065q196l126k153M272M784
14071a868N690L74m717j797l434K654O82O2n628n302L623N91L17P811m87j631
$$ y = [3647, -6303, -10558, -9072, -3068, -1625, -155, 5023, 7808, 7054, 534, 2632, 1519, -3894, -7375, -4667, -2512, -8541, -7759, -1111, 6676, 3961, 2560, 9485, 3477, 1452, 7096, 1438, -4244, -10683, -7082, -2309, -1484, -2465, -466, 2139, -1859, -10699, -5578, -4406, -6366, -7640, -7104, -9773, -7381, -10615, -14795, -13400, -4745, 4, -81, 1428, -867, -6190, -8894, 620, 6498, -99, -4320, -7564, -2533, 1326, 245, 587, -122, 828, -48, 2392, 918, -2565, -4139, -9080, -9152, -3371, 2999, 5222, -4118, -6025, -1220, -2445, -1733, -4918, -8596, -6946, 1422, 8020, 3816, 798, -5418, -7413, -6260, -532, 917, 3423, 3553, -5054, -8597, -7771, -1882, 3404, 4372, 4616, 2551, -5645, -8771, -10924, -6652, -1868, 3822, 4196, -521, -2318, -5752, -3098, -2416, -2354, -7982, -13284, -9661, -9070, -8753, -942, -1429, -3060]
14055c060M886J069n59M091j204L00R361n09J485M569l464p212m808K546l080
14040D411K257J506n733L196q51n276N086N841Q090K0224L5534L9147J9385j2707
14026A20110k6135l4886k1289j0593m145m401k147L989l761r795o508l711Q912
14013E640N964o49K092O6p839q567j43J344n367M839J0020n706o974k745j278
13998i303J346K800N275r75j511J690j042q9n99k667J630K326K188K720K388l962
13982B215j505k984j354L6k195m324n345M18Q770O199j552J077l317Q104R848
13967A4091J189m902q073n422K495M477k01p076k251j251K125K811O021N975n436
13952D572l949N149K406m764n517j517M910Q047k03l977L985r72q383k04K944
$$ y = [-3060, 1826, 2895, 2336, 6427, 5223, 5523, 14884, 14375, 15860, 20429, 16965, 9753, 4945, 7491, 4411, 6668, 8174, 2441, 5637, 4786, -490, 4596, 10437, 18527, 38751, 74285, 113432, 132817, 120110, 93975, 59089, 37800, 27207, 23062, 18661, 16514, 20503, 16742, 6947, 439, -3272, 5640, 11604, 10955, 13047, 13113, 5274, -3293, -3436, -2092, -7459, -2620, 7400, 1694, -5280, -8025, -9303, -7957, -5157, 118, -857, -2368, -678, -1720, -1809, -2408, -5075, -3445, -1119, 1069, 3789, 6177, 2215, 710, -2274, -3628, -3592, -5787, -10111, -15456, -15038, -6268, -69, -1621, -544, -3861, 4243, 14091, 15280, 10378, 2305, -3117, -622, 3855, 3654, -3422, -5673, -6924, -4799, -1988, 4033, 10008, 4572, 623, 5772, 8178, 3414, -2103, -3620, 1290, 9337, 9134, 5157, 9142, 8170, -213, -417, 2527]
13937B527k058l86K599P12n591m070J0319J0085J420p665p030m83L857L802o769
13922A269L943k695p244m876L224O98l720J484R142K748K101l323J571j075j053
13907B194M987q32k490k114K840K682M029n731j5462J363R58P551L446m348P55
13892a72l604j169R02K146J701p210M64L477J1577o002o41J912N491N102m151
13877I823k443L43l70k473J72O490O556J876o448r443K499M157n853K841n6r20
13861F751L074l656j59K571n914o05j425M613j949o624L675O500J047m574k679
13846F46K004l919J713k89M730L080j457m598n578J107K846l637J945O242r67
13831C868p054q82l555O949L432j422j988l90l590l760K714K051l782Q01M840
$$ y = [2527, 469, 83, 2682, 3394, -2197, -6267, 4052, 14137, 15557, 7892, 862, 379, 4236, 8038, 1269, 5212, 2517, -4727, -9603, -6379, -5681, -9401, -7917, 1225, 3973, 6074, 2751, 4322, 3247, 2194, 7181, 6349, 3859, 1745, 4585, 7267, 11296, 5565, -9897, -8534, -7576, -25, 3421, -927, -172, -3776, -4945, -4043, -1897, -196, -7406, -6942, -3465, 8112, 2110, 1469, 3381, 8872, 13974, 9823, 7380, 7723, 7353, 4880, 5052, 11542, 18098, 19974, 13526, 4083, 6582, 10739, 4886, 7727, 7671, 6751, 9825, 6169, 6010, 8581, 2667, 2062, 637, 5250, 3301, -3323, 352, 6852, 7899, 3325, 646, 2650, -1269, 444, 155, 4885, 7965, 6508, 1910, -3668, -2561, 285, -3352, -1407, 4835, 3868, -3186, -4068, -7623, -674, 2758, 1336, -652, -1042, -4632, -8392, -5678, -3627, -7409, -6608, -1768]
13816a768p826l518M479L201K633k887k509J243n03N945L635j688K085p92K672
13801D402m96p27O242n767p417p316L895K386k918k042L650J67J820l955k790
13786a0866L905N100Ml848L816K637o24k430q526O475Q352n129Q56P663j111m013
13770B261m626M959J790k678n505J342L365n545M28O189j968P820m14p75q41L314
13754I116M621J374p349R60L780m194l180j076m98O377N988j458l835m167n101
13739A358J535l485K103j253J637p54o723m016M156M551l716o1o25l440k63K821
13723f175J643L327j117J714m14P7L80r02m640o655J745Q734N276R57q06r50R98
13706C192l237J153j000K393j929m878j438O553M940K463m676r071l334K759j484
$$ y = [-1768, -9594, -13112, -8633, -5432, -2799, -5686, -8195, -6952, -7455, -1510, 2125, 437, 2522, 1730, 4402, 3906, 3179, 9421, 3654, -3763, -11079, -7184, -4798, -7716, -9758, -6108, -5941, -4121, -8076, -10866, -6961, -1861, -1857, -5705, -1889, 748, 124, -2306, -10832, -4357, 3995, -1134, -278, 7385, 6274, 2261, -2365, 2594, 4384, 1706, -3799, -2457, 908, -4637, -4209, 1980, 12, 7832, 7418, 6643, 5802, 9116, 13737, 15111, 7762, 8722, 12502, 8308, 5128, 4052, 3554, 9931, 15919, 14461, 10626, 6459, 1358, 2893, -592, 1511, 258, 1895, 1141, -5582, -9598, -5442, -891, -4607, -4668, -5293, -8733, -8996, -6175, -4532, -1205, -2322, -608, -1022, -945, -565, -1467, -6107, -12762, -11017, -2283, 2993, 3950, 3144, 2194, 3192, -45, 1108, 108, 2501, 572, -4306, -5744, 809, 5749, 8212, 3536, -5535, -8869, -6110, -7594]
13691g594l592k627N20K603N637N213p42K931k796m457K558l11k055m851k940
13676a2503m333L508Q640K372k057j0887j941k701M8J5169M808q104k195L795
13662f381M854N36n571K152J703O814j444N29n360l987N946L613n229N94M428
13647C197j932m260k507P199O771l987l463k85k661K664O736l813j2556M368J983
13632b546N85K094L253m863K05R159Q903N0m670m745o023M504J668j943K701L52
13616H684m403m98k143l591j358j007K838m340J072K715J454P841M279L148l337
13601A1354j419p603m66L124J019O963r26o688P03K450P110M09o431j677K103
13586A0025l86j297O035O59p581l42o950o049O043J697m60O663L47O792l236l571
$$ y = [-7594, -11186, -13813, -13293, -10690, -5053, 160, -582, 2349, -447, -4904, -2346, -2657, -4712, -9563, -12503, -16836, -13328, -4688, -2316, -4373, -15260, -17201, -19902, -19854, -4685, 123, -7981, -10176, -6381, -1527, -991, -6562, -4410, -2707, 4107, 2663, 3192, -2168, -6155, -209, 3404, -1825, -1231, 3197, 1265, -2995, -5502, 1697, 8468, 4481, 1018, 733, -1928, 736, 7472, 3659, -8897, -4529, -2546, -1961, 133, 3386, -1477, -1272, 7887, 16790, 16840, 12170, 7425, 1402, 5906, 7574, 5631, 8332, 8684, 4281, 3783, 1640, -1951, -3309, -4316, -1478, -5818, -4746, -2031, -577, 7264, 11543, 14691, 11354, 9935, 2332, 1866, 4990, 6009, 12972, 12046, 5358, 6061, 8511, 15621, 16030, 9599, 7922, 10025, 9639, 8342, 14377, 15036, 7455, 7113, 163, -5886, 157, 1854, 1394, 8057, 8404, 15196, 11960, 8389]
13570H389l437o513o74N349L325n949l291L325K793p227k224m11K194P499L258
13555F406n468k168l88M113k363j821J428j511P51L211K80q709l450Q812M618
13540C741L668K811Q322n33p153j055k273m104r08L27L608J018j460o966k499
13525c456R81j284N785M590j288q41l413n192J773J2403L636k804m827k27J483
13510G319n641m543J276p72O738K197k357N84n402o180L788o559l844J999k354
13495a3751j869O164M053r66j131L712N628M259L30n471l261j942J918J231K155
13480A059p30m605L2J332J57k226K633N989M51m72K016m556J497j637K737J467
13464E144l223n248k185k139J0777J4826J9108L832q965j5131o626p549p012J495
$$ y = [8389, 4952, -1561, -2235, 3114, 6439, 490, -2801, 524, 3317, -3910, -6134, -6545, -4351, 3148, 6406, 938, -1230, -1618, 2495, 132, -1689, -261, -1772, -1021, 2190, 2470, -6239, -9689, -877, 3741, 7409, 10220, 18542, 18009, 10856, 9801, 7528, 3424, 2516, 2843, 6451, 7469, 6009, -957, -3456, -2475, -3759, 2026, 6616, 5328, 4487, 1074, -4118, -2345, 10058, 13694, 10890, 6063, 5836, 7319, 1678, -2865, -1589, -2361, 4377, 6574, 4217, 4801, -601, -6781, -2993, -9552, -13396, -11397, -13751, -15620, -9456, -5403, -6369, -7500, -3788, 1840, 6099, 6429, 958, -2303, -4245, -2327, -1096, 1059, 329, -4276, -4244, -2912, -2755, -4981, -2348, 3641, 4092, 3620, 5636, 1080, 2577, 940, 3677, 5144, 1921, -3327, -5512, -7651, 3126, 17952, 37060, 40892, 31927, 16796, 10170, 2621, -4391, -2896]
13450b896Q68J088J988l243l871l353J369O583L789n84K385L990K450P38o204
13435E097J82j292j121l156n087j546K77O456l575K052P26N0L498m438k197M635
13419E61K182L210m966J591n457m642K415m45J301Q615L599n060P30M358n21l080
13403D391k369n103q234m781J903N103N957P737n79m901M831J751k135j030L418
13388E959m700j697k155P28n202l463K001M968n119n78K557k930L665L421j2052
13373a4597k523L546L17L636L66L257j40J73L033o25L5J407K445L240l988n610
13357f028Q009J592o201n42j490O408m440p805P843L235J573P186Q196l621k33
13342A3682q688q108n115m31M820m92J289K104J967K610k048k656m707J564j078
$$ y = [-2896, -2028, -940, 1048, -2195, -6066, -9419, -8050, -1467, 2322, 1738, 4123, 8113, 10563, 11301, 5097, 5279, 3987, 2866, -290, -5377, -6923, -6646, -190, -3765, -1713, -987, -937, 2561, -1877, -4074, 561, 2743, 5953, 987, 2578, -2879, -7521, -5106, -5551, -4250, 4365, 7964, 2904, 3634, 7992, 7471, 4391, 2022, -3081, -11315, -16096, -14193, -9090, -3133, 4604, 4025, -876, 3955, 5706, 3571, 2541, 5959, 1259, -438, -2593, -1865, -7067, -10530, -8529, -3561, -8680, -9258, -6701, -9631, -5966, -2545, -14597, -17120, -13574, -13257, -9621, -9255, -5998, -6138, -5965, -2932, -3557, -3522, -2115, 330, 3570, -418, -6028, 1981, 3573, -2628, -3170, -4660, 1748, -2692, -10497, -2654, 581, 2154, 9340, 17536, 13915, 13682, 4994, -3114, -8229, -8660, -3840, -4332, -3043, -939, 1028, 3638, 1590, -1066, -5773, -4209, -5287]
13327e287o517n77Q26M212O227J127p181j003L700p280o571M303K325K655L387
13312e654K904P211N69N547P86L114k604k460j368k151j674J342k320l323o041
13297f122J510R217O239J063l583o422m763K406p428m784J2136J1255o97n795
13283D232k935L805p739j1667J0800J2699P88j1171m80J760k876J63j76l535O983
13268F51J236j135o008j979J817j505k758m33K375L166M329r93l651k219k578
13253i685j573O870J1747l447L904K396L6n800j5544o613L596Q45Q154P587O90
13238C163k143l874k033N437K713K64l46o426l784k580L292J444Q10L771P99n995
13222e488j775J0957K282r8K223r62o73j161j051N725m517l124l498n730j349
$$ y = [-5287, -11804, -12381, -11555, -7343, -1116, 11, -7170, -8173, -4473, -11753, -18324, -14021, -11696, -9041, -5654, -2750, 4461, 5030, 10577, 11363, 14477, 11873, 9413, 8045, 5894, 4220, 5562, 3242, -81, -6122, -4612, 4605, 10844, 11907, 8324, 1902, -2861, -455, -7883, -12667, -531, 10724, 10027, 4232, 1297, 5102, -2637, -14304, -3504, 9195, 9983, -1188, -1668, 92, -2784, -2621, -2797, -6332, 651, 1887, 752, -5256, -7235, -5418, -6923, -9681, -10114, -7739, -4573, -244, -1237, -4888, -7107, -9685, -11258, -4388, 7359, 3912, 7816, 10212, 10248, 4448, -11096, -17709, -14113, -13268, -5114, 2473, 3163, 1020, -2854, -4887, 550, 3263, 3527, 3181, -3245, -7029, -9609, -6317, -4873, -4063, -292, 507, -5488, -7263, 3694, 5976, 5878, 8101, 7139, 6466, 5305, 4254, 9979, 5462, 2338, -1160, -6890, -8239]
13207h239M99J303L034L812m002o380k856O625O319L430p092j608P229J640K16
13192C930n216l732L975m862m126P747N758n6q64o811m06J727L439n357J970N746
13176B862m55p915N263N022M585k683n965n468j752O973P151J96q918R41J332
13161A169K742M367M036j398L233j552l363M84o73m970J958J726j795l905o252
13146d193l565Q124K069l834N350k81k718k795l492K655K735j564l690P661O933
13131I395L800l170k34L1J017O045l42l916j576k983j302m344n927M691L259R794
13115A4238O084q688r618n018N247J4511J7766o00j1510o206p810l421n78k193
13101B204j94L540q39L180J99n820m964k792K799M241j800j618q87j891p204L174
$$ y = [-8239, -7740, -6437, -3403, 409, -3593, -9973, -12829, -6204, 115, 3545, -3547, -5155, 2074, 3714, 3930, -1286, -5018, -1043, -5905, -10031, -2284, 3474, 3418, 2554, -4257, -4663, -2936, 503, -4854, -2884, 2862, 2407, -5508, -245, 4777, 9362, 6679, 714, -4754, -6506, 467, 7618, 7814, -1104, -163, 1169, 3911, 8278, 12314, 10916, 14149, 12597, 9234, 9718, 9045, 4075, 6033, 7759, 5964, 2059, -4193, -7758, 366, 2435, -1399, 3951, 3670, 952, -1843, -5335, -2680, 55, -1509, -5199, 2462, 9395, 13195, 10025, 9791, 9822, 10839, 16884, 16542, 12626, 11050, 8067, 6765, 2421, -3506, 1185, 4444, 14238, 20322, 11634, 2016, -3002, 2245, 16756, 34522, 33922, 22412, 16206, 8396, 4975, 4397, 2204, 2010, 5550, 4711, 7891, 8090, 2270, -2694, -5486, -2687, 1554, -246, -1864, -2751, -4642, -11846, -8672]
13085h672M979O554O103O014N350J51k287o827r091n308L871L195l822K99L000
13070C509j426L715m09n849J635J589R14j397l970l736j462L064j532K404O018
13055C067j040m140L404N739Q04O60l640l088l74K81l00k113Q661q74j3611l229
13039i793k059O096Q845L041n59o605j0575J545O118L776n525j515n53J266o88
13024g185R350N23k48j834L062j669K588P31m313l895p53n06k999l968l548N30
13008a4134P764N685j936M340J788K041M739n90j941K00L804K151j695n372m382
12993B462k191K356L509k744M630K867o239l166o035k378K803J45l519Q934L054
12978D488j49l480l579J085O954j36n365L545O41L77J512J223l324m324P54J0599
$$ y = [-8672, -3693, 2861, 8964, 14978, 20328, 20479, 18192, 11365, 2274, -3034, 837, 4032, 210, 509, 3509, 2083, 5798, 5389, -460, 1175, 2764, 3678, 2281, -1689, -5425, -6887, -3823, -5355, -2951, 3067, 2027, -2113, 1291, 7030, 7834, 8494, 4854, 1766, 1392, 1673, 1373, -740, 7921, 7047, -6564, -9793, -11852, -5756, 3089, 6130, 5571, -1034, -11609, -10064, -3946, -170, -5695, -7210, -7763, -6497, -7185, 2165, 2688, 2440, 606, 3668, 1999, 4587, 5318, 1005, -2890, -3643, -4149, -7148, -11116, -14664, -14134, -6370, -685, -2621, 1719, 3507, 5548, 10287, 9697, 7756, 7956, 11760, 13911, 12216, 6844, 2462, 271, 2627, 6136, 3392, 8022, 10889, 4650, 1484, -4551, -6929, -4126, -3981, -7500, 1434, 4488, 4339, 859, -2720, -1635, 5319, 5183, -182, 3363, 4004, 4381, 5893, 7116, 3792, -532, 222, 10821]
12962A0821K0644K4543K0307J2152P915j2450j7684k6610j4806q835n898p22L249
12949A2626j70k768m603J553K016m732j0988k710K335m368k768Q286O707n581
12935e165K512O304L19O48j306m643n929P61j861L693K439k7J997N21K033R782
12919A2078M425m150q75k357p159r285q6J191k379P81O859l557j424o005J907
12904a0036N323K061K467o55O398K176K785j602j273L430o271j0505k021k360
12890a0083R374O814n448p46J446q379k272M144K512J12q10j425N145J3341j992
12875A1733q083p747p099O341L525N458L233l358j820l279p85J1079L186L241
12861A5625O725k503n691m991K089j243l078n158J483J33J285m61J517k332J541
$$ y = [10821, 31465, 56008, 76315, 88467, 96382, 83932, 66248, 39638, 24832, 15997, 10099, 9377, 12626, 12456, 9688, 5085, 6638, 8654, 3922, -7066, -9776, -7441, -11809, -14577, -6291, 416, -5165, -2653, 3651, 3970, 4618, 3312, -1331, -7260, -6499, -8360, -4667, -2228, -2255, -258, 263, 2296, 12078, 16503, 12353, 11478, 9121, 1962, -7323, -7409, -6218, -8597, -7816, -957, -4514, -5938, -11943, -10036, -4713, -2652, -185, -840, 5558, 7734, 10519, 8917, 7644, 11074, 4803, -5702, -7723, -10083, -709, 6105, 657, -89, 1357, -7022, -9294, -5150, -2638, -2526, -3336, -4761, 384, 13725, 11733, 3650, -4097, -11196, -4855, -1330, 4128, 7361, 4003, 2183, -1096, -1881, 9198, 12384, 15625, 22350, 19847, 14156, 9165, 11254, 10011, 6933, 1775, 3258, 3391, 4676, 4215, 5732, 3400, 4941]
12846D941Q18k595L103Nn042j96j025m714k275M476L076n041k67o077j461O053
12830f221P173L18j25M506K944k21L679n617q507l16L422N664q2j0267j411L067
12814a994l263j210J461k629n411N676q08j765K23O427m84k61N249k04L04K38
12798A549m403K624K05r44k79K7M546l667l54k953l426K794M315l614K435L629
12782B484j815j419O477l746j158m34n992K10R98L607o439j125K46O079J365j40
12766h02p662n003N137M268K509J470L401m820o796j455L050J207L828L334P82
12751B448k768l004O9j317M740O592k066n226m025r175O793M013L361L405p54
12736C086Q278k706r08m957M322j956n630n358o56R430K899k94l753J297o72q722
$$ y = [4941, 5759, 3164, 6267, 6272, 1230, 1034, 9, -4705, -6980, -2504, 572, -4469, -4736, -10813, -12274, -6221, 952, 1270, 1145, 5651, 8595, 8374, 12053, 6436, -2071, -2387, 1035, 6699, 6617, -3650, -5061, -1994, -5257, -6467, -5006, -7635, -13046, -7370, -8178, -9943, -9720, -3293, -3777, -4038, 1211, 1007, 1311, 1549, -2854, -230, -25, -969, -1248, -1221, 3325, -342, -696, -3649, -7075, -4281, 34, -3580, -1145, 2484, 669, -750, 5727, 1981, 823, 389, -5603, -5393, -4395, -788, -7227, -8352, -8106, -2027, -662, -802, -8464, -13467, -8330, -4062, -1553, -83, 3318, -1502, -8298, -9753, -6703, -5496, -1668, 1666, 2448, -320, -3324, -3255, -4572, 168, 6760, 4694, -532, -4557, -13732, -6939, -2926, 435, 3840, 3086, 11364, 8658, 7750, 2793, 7115, 5159, -471, -5829, -6485, 2945, 5844, 5550, 1797, 3094, 2422, -6300]
12720f300n025J655P049N775n288n076O839J139k603N468K082p74m683j0196R04
12705i034P366M292m78L319q46k596K900j525Q23n818l558q303M908P603m694
12690e641L413K531o721m702r11J907n8M547J408K991O774k320N86j633p39K682
12674D114N534q79m661J564j528l16l716k359j344k647K833j761k516k023j235
12659a0940K954O96M92N024M933o66k93k162L318j47j337K788N012j69j680k833
12643D990n668p000o178M907R058N664J241o527o031R52j385q98j209M060N666
12628A642O075N0l678m047n126k030n091J853M3J371J191J1373O036o857o125
12613c320K683K04k348k796l106O012J909k764m814P790O675M370j937l431J327
$$ y = [-6300, -11325, -9670, -2621, 3154, -2134, -7210, -371, 768, -1835, 3633, 5715, 4941, 258, -9938, -9034, -1668, 2624, 2146, 5465, 4619, 2023, 4923, 3398, 4221, -1597, -5155, -13458, -8550, -947, -5641, -2228, 303, -6418, -11120, -12031, -10124, -10182, -5635, -4227, -1236, 5538, 3218, 3804, 2171, 1432, 4114, 9648, 8769, 4108, 5672, 4144, 3828, 112, -2247, -3591, -6238, -3405, -5166, -7682, -9705, -10940, -7986, -7290, -6798, -1774, 3159, 2493, 2200, 38, 3356, 3209, 1872, 4660, 9672, 9503, 7823, 4990, -678, -7678, -13856, -8949, 109, 5773, 7014, 487, -5544, -4592, -5977, -6875, -8084, -4024, 1642, 7717, 7767, 4089, 42, -5084, -7114, -12205, -10352, -10309, -8938, -7747, 3626, 9662, 2805, -3320, -637, -433, -2781, -5577, -8683, -2671, -762, -3526, -8340, -550, 6125, 10495, 8558, 5127, 6454]
12598F454K11o14p199m455J904N561J112j429R06M888k506r804l05N726m05j523
12582a478m605o06L425K509n237q97L586J652J060M293M95k183j447M152K733
12567G452M533j04n437o335N888O484k928p887p53o35K406m451o522K154N505
12552f30q252j0596k553M668J730N743P1P648l282m893M339J314M495K472k859
12537e85L79L40m324n234j696J183M133K272K682K801l425k322L3K544N003R211
12521A2995j620K62J019n120j801L207j0180m721N953Q342M150l586p585N841
12507G156n78k577o628L520k870n646Q127M922K476P453m11m503j922K056Q17
12492A1392K289k188p600p429R894L124n352j622N16J646p09j157l266l804P02
$$ y = [6454, 6665, 6051, -1148, -5603, -3699, 1862, 2974, 1545, 2451, 7339, 4833, -4971, -5276, 450, 45, -1478, -6083, -6689, -3264, -755, -5992, -6889, -3303, -1651, -591, 3702, 4197, 2014, 567, 4719, 7452, 11985, 11881, 6444, 109, 5997, 12481, 9553, 1666, 913, 278, 2684, -1767, -8289, -6135, -630, -8882, -19478, -22031, -17363, -15633, -9890, -9819, -2171, -5453, -10346, -6007, -4693, -198, 2274, -585, -206, 134, -4190, -9424, -11120, -9937, -5804, -3532, -850, 1951, -1474, -3796, -3763, -1219, 3784, 12995, 11375, 11637, 12656, 7536, 5735, 8942, -1238, -5959, -6, 8336, 12486, 8900, 1315, 7156, 6578, 4001, -2627, 893, -1977, -7623, 504, 5426, 7902, 15355, 14944, 10441, 8519, 10575, 11392, 13681, 11493, 3893, -3536, 6358, 9482, 4130, 2508, 3024, 4670, 3961, 2804, -462, -4266, -3564]
12477c564l58J636l929J346k225n633j477r27M429O603P515l43L863k294K820
12462G462L092o67j823L403j90n699n737l191j266N082M506j967j11o029l221
12447f356K966p111l801L276Q26k147l464J306l735K305N600R578R749l12j2782
12432d102M626K375r93K454O398K467p945l142Q40N504O483m504o773j745o19
12417A324J480k801o279j910K975j889L320N613j35l128m081O176L824n49P3q192
12401d179K044n196N44L086L079K813l270r87l216l254j546J30N035m36M901P04
12385B52k29K844j904K783n16k996k654M519K436K124o91n899l844l569J145J358
12369d841J0573K532l451j621J88L248k901o678n76m327L244N504k900j323P16
$$ y = [-3564, -3922, -2286, -6215, -4869, -7094, -12727, -14204, -15131, -10702, -4099, 3416, 3073, 6936, 4642, 7462, 10554, 9887, 8064, 11467, 11277, 5578, -159, -3350, -4616, 466, 4972, 3005, 2894, -3135, -6356, -3390, -10501, -14302, -11026, -10200, -12347, -15811, -14505, -18240, -15935, -10335, -757, 8992, 8680, -4102, 524, 2899, 1906, 4360, 10758, 13225, 5280, 2138, 2978, 8482, 14965, 10461, 3688, 1943, 1324, 2804, 3, -6276, -8186, -5211, -7100, -3780, 1833, 1698, -1430, -5511, 665, 4489, 3940, 4013, -4179, -2135, -7331, -6787, -3701, -622, 2191, -1079, -2066, -5282, -8536, -10082, -9952, -4917, -5353, -452, 252, 23, 2867, 963, 3746, 3230, 234, -2420, 2099, 4535, 6659, 5968, 69, -3775, -7344, -6199, -4841, 5732, 8264, 4813, 3192, 3380, 6628, 3727, -2951, -3527, -7854, -4610, 894, -2006, -3329, -2613]
12354b613P423M526k534m007m572K438l61p82J530N753N092n631m13l043k253
12339E53L968L098K5o662p10r26j696N095L944l511n314M361J470K297m187n19
12323A286N51J248J68J070o984n547J340N338Q939K297k511k154M6k297P11P665
12307A1166j82k303j646K027q340J618J0317j649j0048l318j031j579O355M286
12293E673n414k181M151K346N544l400J153j609r22k957n409j3084p961R498J0437
12278d135R6j679m325L108J510L730N740L98k972N143M949j803J997l785K21j1756
12262c563p710M186L044M123J0579J991j0244k119P644k368m047l261n219K339
12248d625n979P46k289J494M066K176L059r62l803l78K675K774K096J368j985
$$ y = [-2613, 4810, 9336, 6802, 2795, -1777, 661, 300, -482, 1048, 6801, 11893, 6262, 5849, 2806, 553, 4521, 7619, 7644, 982, 272, -654, -2350, 2745, 6689, 3178, -2136, 2225, 3695, 5992, 1805, 1286, 1837, 3085, 3253, 4323, -2661, -8208, -6868, -1530, 7409, 9706, 7195, 5041, 5087, 2790, 3501, 11166, 10984, 8681, 7035, 9062, 722, 2340, 12657, 11008, 960, -2358, -3389, -4968, 1387, 5673, 259, -1922, 2229, 4575, 10119, 6719, 7872, 6263, 5341, 2384, -3025, -16109, -24070, -14572, -4135, -4039, -5718, -10043, -6935, -5425, -1695, 4045, 4443, 1471, 6614, 11563, 9760, 11757, 7972, 8193, -3563, -11273, -7087, -4043, 80, 10659, 12650, 2406, 287, 7931, 5563, 1516, -1745, -6964, -4625, -10604, -9858, -12147, -10653, -6587, -4411, -1352, -2314, -6117, -6495, -3820, -1046, 1050, 2418, 433]
12233D33l738L100qJ032j264O709m219m430J30j946J963P731L155N884k04m352
12217I976l532m505l300k010k886J853Q071p0M135j703K837M050k484o347L368
12202G453J293j950j489k188l190L438N665L925K07k059l038n935K707R424j099
12187A3164r656m111O03n09m008m193p121K482O901P391j568P445N104o80p048
12172D196k869n249j575J599k875l839O6L847J759N972j062o967O0j181K83R833
12156A998k787K444K113R90q26j107J363M371J174j402QN002m548j799j381l719
12140A894K303m484L1N372M12m756j570j379K609n562m241M709L680k939m66L261
12124a126J24j426q87N80K192k741k630P451R043r91n211k01K40n77j059p74L970
$$ y = [433, -3305, -205, -213, 819, -445, 6264, 2045, -2385, -2255, -4201, -2238, 5493, 8648, 14532, 14328, 9976, 6444, 1939, -1361, -3371, -6257, -4404, 3667, 3597, 7732, 6029, 8866, 12916, 10432, 4085, 7453, 8746, 6796, 5307, 3119, -71, 3367, 9032, 12957, 13164, 11105, 8067, 2132, 4839, 14263, 13164, 3508, -603, 0, -509, -4517, -8710, -15831, -13349, -6448, 943, -625, 6820, 11924, 11244, 4196, 1327, -3922, -5497, -3898, -6773, -10612, -10546, -6699, -4940, 1032, -30, -6997, -6937, -8118, -7835, 1998, -789, 1655, 3768, 4758, 3932, 2825, 4188, 8559, 9733, 8331, 8339, 13341, 8793, 6994, 5613, 1894, 4197, -287, -256, 5116, 5528, 772, -798, -2177, 432, -5130, -9371, -4662, -982, -3921, -4387, -1126, -1002, -2428, -3315, -2735, -543, -3284, -5914, 1537, 10580, 9589, 4378, 4177, 4417, 3840, 2781, 2007, 5977]
12107E977N031P309R327J6571N805l714q782j2230m408l004k45j584j352n85p514
12092F602o041j931J445K982l280l736L504L556O274p598j193N823O329N64j1334
12077A966o493M241M603P12K66k017j132k7N947P921n717q559P390O490m562o567
12061D462M82Q534l180n601l333k50L006R20k206o696p15j387J401J264L917K131
12045B749k438p1Q158K899r489k915q278L006O992R93O06k298j825k05k70j07
12029b493n7J278R694r8L322m661j0358J254J0544l753j418l201l931j532N588
12014A78P455O937m75R3K68k416k609l826L30L559K363m472J23J556m044k583
11998B437K687M760k409L190O743l473n723j687J886Q491L514k62o389n424m152
$$ y = [5977, 11008, 18317, 27644, 44215, 50020, 46306, 37524, 25294, 20886, 17882, 17637, 16053, 14701, 14116, 6602, 561, -1370, 75, 3057, -223, -3959, -455, 3101, 9375, 1777, 584, 6407, 12736, 13300, 1966, -4527, -286, 4317, 5029, 5295, 3278, 2146, 2119, 8066, 15987, 10270, 1711, 9101, 15591, 11029, 4462, 4944, 13478, 10298, 4697, 1364, 1114, 4120, 5040, 2834, -3862, -4577, -5964, -4563, -3299, 618, 2749, 311, 240, 8398, 11297, 1808, -1107, -9385, -6379, 613, 1606, 2212, -86, -1911, -2116, -2386, -2493, -2550, -1272, 8422, 8324, 11646, 6985, -3373, -2119, 8425, 4672, 3254, 53, -3878, -5410, 178, 7633, 14570, 14095, 14188, 14456, 12040, 9431, 5605, 5935, 9494, 11857, 7385, 7508, 9064, 5020, 2437, 5124, 9884, 7475, 10665, 17408, 13935, 8212, 6525, 8411, 16902, 20416, 20154, 13765, 8341, 4189]
11983D189k490n159K335M360k454k106J609j286Q14L625N509r126n351N358M866
11968D693n599j689K417J609R075O753l954k223J481j718P352L84o583n320k465
11953D213J600k734j432l023M318J180M357M333k541Q28j692o136R97M967k970
11938F265l785m379J063q836q163j923J1240J0810M94L692J518O03l620J746n098
11923A627k716j650n40j283l311J2072M372k650J87O05J624P80l391k071K220
11908E875L33k115k496k286J124R47P876o62k46O48O113L740j813p658p228m24
11892A728M80n918P22M884K161O661K754k444o936n948n667k984O733R441k565
11877C102M433m53j566o32N106m733K407j109k407L53J438J187m728m915O729
$$ y = [4189, 1699, -3460, -1125, 3235, 781, -1325, 284, -1002, -188, 3437, 8946, -180, -5531, -173, 4693, -906, -2595, -178, 1431, 10506, 17259, 13305, 11082, 12563, 10845, 18197, 18581, 11998, 6678, 4213, 5813, 3079, 1647, -1376, 2942, 4122, 8479, 12812, 10271, 11099, 9407, 3271, 4268, 9235, 6265, 2480, -1899, -836, -9672, -17835, -19758, -8518, 2292, 2786, 6478, 7996, 8599, 4979, 6725, 1627, -1089, -2739, -3279, -4562, -7873, 4199, 8571, 5921, 6108, 6713, 8337, 9117, 5726, 3655, 5875, 6208, 4093, 1597, -689, 435, 1382, 9258, 8596, 8350, 8998, 15111, 18851, 17038, 9380, 2152, 1728, 2208, -3710, -2988, 1896, 4057, 10718, 13472, 11028, 4092, -1856, -7523, -10507, -3774, 5667, 3102, 7535, 7082, 5516, 4884, 9990, 5257, 7664, 6555, 4148, 4501, 5939, 7126, 2398, -2517, 4212]
11862D212l7n91q76j649O208P291N237K026o042l961l240M099M65k331l744P615
11846A4682K256m705n817l055j470k220q41M813O450n782p928M408M182r44n163
11831a134l630P073K273j906M362j05N24RL390M728j385k306k331o592l829N200
11815D341l105K340j278j536L918k97J399k516l960L549K905L348N917J773k763
11800A4035n379L79j22N304P77m115j753j229l862P52R155Q382N389o329n410
11785A5974l79r36j224l634O194M1O7n307j730R35K936L103q935k641L038M566
11769A2068p754j59P427j478K479L00k779J651K380l675j720l822M493L465j117
11754A1759m120k460J498j667K49k255Q71J566K213k032N44L33m697l489K166
$$ y = [4212, 4175, 3584, 2708, 1059, 7267, 14558, 19795, 21821, 15779, 11818, 8578, 12677, 13142, 10811, 7067, 14682, 16938, 12233, 6416, 3361, 1891, -329, -1170, 3643, 10093, 4311, -3617, 791, 4973, 4029, -1134, -4764, 2309, 4582, 2676, 7038, 6933, 7457, 7466, 10856, 15584, 14199, 11893, 9562, 2970, -859, 4341, 1236, 3576, 2298, 762, 4680, 4383, 5782, 3266, -694, 2855, 5760, 9108, 15025, 16798, 14035, 8656, 9035, 8913, 14217, 14994, 10879, 9126, 7897, 4035, 4787, 13942, 22324, 27713, 21384, 15974, 15595, 14659, 13435, 9801, 15995, 16036, 16103, 10796, 9066, 10001, 12937, 16040, 7105, 4464, 7502, 12068, 4314, 4155, 11582, 10104, 12583, 12883, 10104, 11755, 14135, 10460, 8740, 4918, 9411, 12876, 11759, 7639, 5179, 6677, 5010, 5259, 3004, 3875, 5441, 7654, 5622, 6166, 6499, 1802, -1687, 479]
11739D79M094P435L526K423j408j37L162l96o538r627N96J440m066j078J1820
11724A1725K675p854o108n502l083J318P317N403j235k69l046j267k95K522M357
11709F658m6O214L026m414m398Q95J617n946m815J616N059p56M388K533k358o911
11693B362l272K86k015N675Q31q473j627L599L318P933R15q56j607Q41M011K597
11677A4518N64N64N06m261p04o421L068P300m748o523L767P812J019l517p178
11662E766l119L176k846J217J476Q33J167j03P43k10K65L423j510o53j53L190
11646A2662L241j93p314M068M68k607J938J218j114k943j552K316K736l71q146
11631D407j0941l209K226N497R952M693p283m888j876P095J3533m525l456l98
$$ y = [479, 4573, 12008, 15534, 17957, 16549, 16412, 19574, 19178, 12640, 3013, 3609, 5049, 983, -95, 11725, 14400, 6546, 438, -5064, -8147, -6829, 488, 5891, 4656, 4387, 1341, 74, -221, 2301, 6658, 6612, 12826, 15852, 11438, 7040, 7935, 9552, 3606, -1209, 407, 5466, 4710, 9098, 11631, 9273, 2362, -910, -624, -2639, 3036, 3867, -4606, -6233, -2634, 684, 8617, 9532, 8676, 7069, 7910, 11921, 14518, 15082, 15646, 16152, 11891, 11187, 4766, 7834, 15134, 10386, 3863, 7630, 15442, 16461, 12944, 5766, 2647, 5823, 2977, 4194, 5670, 6503, 7670, 7567, 8310, 8100, 8365, 11788, 10278, 9625, 9472, 12662, 15903, 15710, 8396, 12464, 12932, 10325, 12263, 13481, 12367, 9424, 7872, 10188, 12924, 12553, 4407, -6534, -9743, -7517, -2020, 7932, 12625, 5342, 454, -1422, 5673, 19206, 14681, 11225, 10827]
11617A0827P682J27o788L26P166R43p281p218M362l296m20M076J889o757q437
11602b799j373M053L062L876L244o84O50o388j0594k753qO648K24K353J999N515
11586G025j037j950j882L125J1510K821j390l539r80m440m118k287Q30k33m16
11571C039O124K168m139j329m508k815O167O547K809j898J168k059M76Q23J813
11556A4386J385j652j82p67R16J564L735l376M217j041l633q701K275P473K411
11541A9010l909J506K28k354L019N162p02o628m71N635k059j1183j419M266L717
11526A3818N942M187J863o768o187J65L061N869m05m749j430l995n123L267P427
11511A6942j386o083K792l998j694O791o2O28L710p92k180m383k904q5R43J073
$$ y = [10827, 18509, 18636, 11848, 12174, 19340, 20283, 13002, 5784, 10146, 6850, 6430, 10506, 12395, 5638, -2799, -4172, -119, 2943, 6819, 10063, 9379, 10029, 3641, -6953, -9706, -9714, -3066, -2842, -489, 1510, 7025, 5988, 4038, 2156, 5281, 16791, 19612, 18222, 14683, 13703, 9263, 5145, 2858, 3688, 3455, 3039, 9163, 11331, 7192, 5863, 1355, -1460, 4707, 11254, 14063, 12165, 13333, 11274, 11750, 12573, 14386, 15771, 14119, 13937, 13170, 14086, 15650, 19385, 16009, 20226, 19185, 15552, 6851, 9126, 16599, 19010, 15101, 16607, 16835, 14481, 17500, 22662, 21960, 15332, 14861, 20496, 18437, 7254, 5835, 10101, 13818, 19760, 23947, 25810, 19042, 12855, 13020, 16081, 21950, 21545, 16796, 15366, 11371, 6248, 9515, 16942, 15556, 9473, 12265, 8267, 6573, 13364, 13302, 13930, 17640, 16848, 14668, 10285, 7381, 7296, 8239, 9312]
11495I312n636J888J5002O533L834K263k058J54q948l393k384r322k331P374P678
11480A9966j424j475r75k979L329j683m499M96J561j4m9K473n330q61M011J127
11464A3674M517J597K646k508l758P749K503n214m926j689k90K784j458l262j010
11449A1355L294K042P07M18N73L655Q39k503m43l013m305M513J125r376K107M216
11433A5204O369o32m298j660m456q238K668L770k436o0K036M417j474l04J096
11418A2002N21L42o02L75Q731L614m345l062K87N30J800n488J98M273O336l587
11402B1925m401j450R209K275k124M19j15j442o567n898j012L457M805J697p658
11387A3120m405M785J1345l082n852j097k831O09l79k650M887M722K708p748n349
$$ y = [9312, 3676, 5564, 20566, 27099, 30933, 33196, 31138, 31292, 22344, 18951, 16567, 7245, 4914, 12288, 19966, 18542, 17067, 16092, 13113, 16442, 14759, 10260, 10756, 12317, 12303, 12254, 14727, 9397, 8536, 12547, 13674, 18191, 19788, 22434, 19926, 16168, 23917, 26420, 21206, 16280, 14591, 14301, 17085, 15627, 12365, 11355, 14649, 16691, 17398, 17816, 18389, 22044, 22883, 20380, 19937, 16924, 12619, 17132, 18257, 8881, 10988, 15204, 21573, 20941, 16643, 14983, 10527, 2289, 4957, 8727, 6291, 6231, 8267, 12684, 11210, 10906, 12002, 12523, 12865, 12263, 12638, 21369, 24983, 20638, 17576, 17863, 18393, 20193, 14705, 14903, 19176, 25512, 21925, 17524, 16074, 25283, 27558, 25434, 25853, 25738, 24296, 17729, 11831, 10819, 14276, 19081, 20778, 13120, 8715, 13500, 24845, 21763, 15911, 14814, 11983, 12592, 12213, 9563, 14450, 19172, 21880, 14132, 8783]
11372H783L828N024Q160P788o57J579m2l483q354l349j1315n85O578m57J917r96
11356A4419J597J0703L450m414p46P52o429l468n332l161J844K805K810O790N35
11341B2155q098P331N117J251p346r561l045J545Q402J064M758m059k384k350
11327A4780M56k314P2M182O151M36o30o13M814N213j523r185l768k190O384J3486
11311C5751k378j1759r265j703O146N160o179j0666M670L426l703J741M196J697
11297A7134k052M23L250k756L852J0662M960R36L832R284J6536K3287R699j710
11283I7337p153o364j779r500j6690j5764n915l553M455j615m541j493o7j986
11269B5372r985l913P658K348n637K36O983J296l612o135l120O634O466n295k857
$$ y = [8783, 12611, 17635, 25795, 33583, 32926, 34505, 34463, 30980, 22626, 19277, 7962, 7377, 13955, 13498, 15415, 14419, 16016, 26719, 30169, 25755, 25009, 25761, 19332, 15864, 10532, 7371, 9215, 12020, 14830, 21620, 22155, 14057, 21388, 26505, 27756, 20410, 10849, 7804, 9349, 17751, 18815, 23573, 19514, 17130, 14780, 15236, 12922, 12994, 17176, 23327, 23763, 23133, 22520, 27334, 32547, 31024, 21839, 18071, 15881, 22265, 35751, 33373, 21614, 12349, 10646, 16792, 21952, 15773, 5107, 9777, 13203, 9500, 11241, 15437, 17134, 15082, 15505, 18755, 15999, 19851, 30513, 35473, 36409, 40241, 49525, 66061, 89348, 99047, 97337, 90184, 83820, 82041, 72541, 55851, 40087, 34172, 30619, 35074, 33459, 28918, 27425, 27358, 25372, 15387, 11474, 19132, 21480, 15843, 16079, 23062, 24358, 20746, 14611, 11491, 18125, 24591, 19296, 16439]
11254A6439Q484J047J724K527J151K386k224k654N219k912o009P27M504L570j712
11239C2267j509J304o316O13K911m005l06O890O830l659l547J687M028J791k879
11224C6100K408j854r061j730K648p90K61L064n926n107l2K197K173J042M659
11209C0052k006o858P185J22J820p697O34L799J233L20k238k471M594o339J906
11194B4056L823L351R70l519j695k542j927k416l959k002L218N163N441K999P929
11179C8890N960J539L754q270N1k548o63m18n129R60j240M98J299N696k994J772
11163C9157r91k110l230L495N445O333M540R861J7921P482O357K088L203O701
11149A06252r108k0616j6137p723q148m542o446J696K27P975Q696J328q516L097
$$ y = [16439, 24923, 25970, 27694, 30221, 31372, 33758, 31534, 28880, 34099, 31187, 25178, 25905, 30409, 33979, 32267, 30758, 32062, 25746, 26359, 29270, 25265, 24959, 31849, 38679, 35020, 31473, 33160, 37188, 38979, 36100, 38508, 36654, 27593, 25863, 28511, 27721, 27982, 31046, 25120, 20013, 19981, 22178, 24351, 25393, 30052, 28046, 21188, 28373, 28495, 30315, 22618, 23252, 27051, 28284, 28604, 26366, 23895, 28489, 22150, 24056, 27879, 31230, 32200, 28681, 26986, 24444, 22517, 20101, 16142, 14140, 17358, 22521, 27962, 30961, 38890, 44850, 46389, 50143, 41873, 41924, 39376, 38713, 38295, 33166, 34126, 32886, 33384, 34683, 40379, 37385, 39157, 38166, 36056, 32826, 36321, 41766, 48099, 52639, 62500, 80421, 87903, 94260, 96348, 99551, 106252, 97144, 76528, 60391, 52668, 44520, 39978, 33532, 35228, 35455, 43430, 52126, 53454, 44938, 48035]
11135D8035j596l167L966J700J811R37p833l200J694M695j38J834J90M607j501
11120E2034j082m43l67J58j550j170O50q42p757j675k083n52Q93l293K519l55
11104C5085j719q67m569k385R573O684l43m89K235Q352J131K213M94P449J4785
11089G7629L760P115k469q277j2010p558o293L94l369j5637M597P614J0598M792
11075F0886L930J0215J674J190j749m584j63R34M913N343J387j838p40l300L766
11060H1864J2293J7883M303N058L523K581O939J2460M520L246J931R199J9089
11047A84889J8218K0047K7175M4251N9940J04852J56985K63932M57144O36684
11037A974117M29706P111k06679k32670J25678L56139M0518l18706n42793n52042
$$ y = [48035, 46439, 43272, 47238, 48938, 50749, 51686, 43853, 40653, 42347, 47042, 46904, 48738, 48928, 53535, 52034, 50952, 50509, 50142, 50300, 48750, 47580, 48230, 47388, 39631, 37956, 35873, 35321, 36214, 32921, 35440, 35085, 33366, 32499, 27930, 25545, 35118, 41802, 41459, 40970, 43205, 51557, 52688, 54901, 55395, 62844, 77629, 81389, 88504, 86035, 77758, 65748, 58190, 51897, 52291, 48922, 33285, 37882, 45496, 56094, 60886, 64816, 75031, 76705, 77895, 76146, 71562, 71399, 72333, 77246, 82589, 83976, 82138, 81398, 78098, 81864, 94157, 112040, 116343, 121401, 124924, 127505, 134444, 146904, 151424, 154670, 156601, 165800, 184889, 203107, 223154, 250329, 294580, 354520, 459372, 616357, 880289, 1337433, 1974117, 2403823, 2410934, 2204255, 1971585, 2097263, 2453402, 2493920, 2175214, 1632421, 1080379]
11027A080379l42698j97679j15155p4676m6827l4625k6420r300j2073k1247j7467
11016A82212k3699k4115m412o210m473n13l259o816K683L131m021q346j076k815
11002I8271r520j3172j88J733M997L708J905r279r769J401K058J757P19j324l859
10987F9438o812M19O128K779R926R079o305R43R608R80K641M867J630r139k783
10972I3399o694k373m28o622j1041k594R275P376O074m9o098j023j624N996M362
10957H7936L695k48l107m101L413K832K668o430p839k747R58R399L767M82j1148
10942G9530j2542m546L511N849N950R997N919K589J3500J0044O346J1373P847
10929A45367J6071p593k2844j9245k7621k209P653j4372k0940k2479k1754j4682
$$ y = [1080379, 737681, 540002, 424847, 350171, 303344, 268719, 242299, 232999, 220926, 199679, 182212, 158513, 134398, 129986, 123776, 119303, 118790, 115531, 108715, 111398, 114529, 110508, 102162, 101086, 98271, 88751, 75579, 75391, 77124, 82121, 85829, 87734, 78455, 68686, 70087, 72145, 73902, 74621, 73297, 69438, 62626, 63045, 69173, 71952, 81878, 90957, 84652, 85595, 95203, 96183, 98824, 103691, 105321, 96182, 93399, 86705, 84332, 83904, 77282, 66241, 63647, 72922, 80298, 86372, 86323, 80225, 79202, 77578, 83574, 87936, 91631, 91383, 88276, 84175, 87588, 90420, 93088, 86658, 78819, 76072, 77030, 86429, 90196, 90678, 79530, 66988, 62442, 65953, 71802, 77752, 87749, 93668, 96257, 109757, 119801, 126147, 137520, 145367, 161438, 153845, 131001, 111756, 84135, 81926, 89579, 75207, 54267, 31788, 10034, -4648]
10917d648K691P404K878J971J630P771P510k96K898l403J1269R536L277M409k013
10902E2884L529M198L480M680N17l760L68j0P613J1900K817J941k279m61k473
10887H4944L946K680l054J0020J1755J7361L1697M2093O4873M3120L4428O074
10875C49937j9880l289J8673n631j815l2685n5103m8755m3014l5923j8818n701
10863I7996k664j0330j5577j7469l593L275L494P099P300J401M319J1615N473
10850I2339L714M02K568j563q723R954J5289J1911J0624N050O420J3547J7250
10837A78782P491k01j945k466k039j788j0983p120N185N113r273j7695r715J052
10823A34398N980J5558O649j586j0133j565J0788j370k2484k9749j9707j749K1795
$$ y = [-4648, -1957, 5447, 8325, 10296, 11926, 19697, 27207, 26911, 29809, 26406, 37675, 47211, 50488, 54897, 52884, 56413, 60611, 64091, 68771, 69288, 65528, 65896, 65886, 73499, 85399, 88216, 90157, 87878, 87417, 84944, 88890, 91570, 88516, 98536, 110291, 127652, 159349, 201442, 266315, 309435, 343863, 349937, 330057, 326768, 345441, 339810, 337995, 305310, 250207, 201452, 158438, 122515, 103697, 97996, 95332, 85002, 69425, 51956, 48363, 51638, 55132, 62231, 69531, 70932, 75251, 86866, 92339, 96053, 96455, 99023, 97460, 88737, 98691, 113980, 125891, 136515, 141565, 147985, 161532, 178782, 186273, 186072, 184127, 181661, 179622, 177834, 166851, 159731, 164916, 170029, 160756, 143061, 133346, 134398, 140378, 155936, 162585, 160999, 150866, 149301, 160089, 158719, 136235, 106486, 86779, 85030, 106825]
10810A06825M618k0865k9677k7443l346J8970J9731J9219J3238o01P50N013J4860
10797A21292J6223N258L061R878Q747o189j7616j8565m785K357n77q944k1127
10784H9013k1447j0100K436J8519L9338K3500q396Q729K0282L6355M1666K1124
10772B61019M632Q557J985J3542J4037n303l284k682l423m236j0530j0477j597
10759B62240j369p145j2324q622j0556L798J5142P441m157n663K5985K1701J0951
10746B97422K2324J3991J6025K6201J5173K966j5874r77R344P560R225L03j8793
10733C84890j2788l514k457J255M400J937r4N767M064J2051k272l115J0868K2903
10719D23895J8103J9974J6204J4262M155N994P927J2380J5066J2211J0179N641
$$ y = [106825, 111443, 90578, 60901, 33458, 30112, 49082, 68813, 88032, 101270, 100669, 101419, 106432, 121292, 137515, 142773, 145834, 155712, 164459, 158270, 140654, 122089, 117304, 119661, 119084, 110140, 89013, 67566, 57466, 59902, 78421, 117759, 141259, 132863, 141592, 161874, 198229, 239895, 261019, 265651, 274208, 276193, 289735, 303772, 298469, 295185, 292503, 289080, 284844, 274314, 263837, 262240, 260871, 253726, 241402, 232780, 222224, 226022, 241164, 248605, 244448, 238785, 264770, 286471, 297422, 319746, 333737, 349762, 375963, 391136, 394102, 378228, 377251, 386595, 394155, 403380, 403683, 384890, 372102, 368588, 366131, 367386, 371786, 373723, 373629, 379396, 383460, 395511, 393239, 390124, 400992, 423895, 441998, 461972, 478176, 492438, 496593, 502587, 510514, 522894, 537960, 550171, 560350, 565991]
10707E65991J6049M785q203J429R344J6406K5368L4254Q340q256Q565L4841M1600
10694G50513K7600L624n410J4501L7179L2075J6275J8514L6267L5336K9282L5465
10682A031221M1407M9189N3084L9624L4169L6090K9731M4313M3964N1594P4809
10671A529195P8167P6521O9399O6185R5681J09562R7042R4636Q0381Q3316J41978
10660B522063J56992J75910J92817J89226K11762J98810K09649K84698L32207
10651D474134L94569M80792O40139Q82707J115127Q71508N04007L75728N24384
10642A0263095J075923J488159J307012J361535J602645K242860L079441L664507
10634B6085177M433952O090178Q808784J3131052J9908659L1592430N3092431
$$ y = [565991, 582040, 586825, 578622, 580051, 589395, 605801, 631169, 665423, 673763, 665507, 674072, 708913, 750513, 778113, 781737, 776327, 790828, 828007, 860082, 876357, 894871, 931138, 966474, 995756, 1031221, 1072628, 1121817, 1174901, 1214525, 1248694, 1284784, 1314515, 1358828, 1402792, 1454386, 1529195, 1607362, 1683883, 1753282, 1819467, 1915148, 2024710, 2121752, 2216388, 2296769, 2380085, 2522063, 2679055, 2854965, 3047782, 3237008, 3448770, 3647580, 3857229, 4141927, 4474134, 4868703, 5349495, 5989634, 6872341, 7987468, 8858976, 9362983, 9738711, 10263095, 11339018, 12827177, 14134189, 15495724, 17098369, 19341229, 22420670, 26085177, 30519129, 36609307, 45418091, 58549143, 78457802, 110050232, 163142663]
10627A63142663Q6890329J12888892O5466853p955242m0061316m2681407K2838067
10620C60528839O3738564Q494848m9263653q9894198r7273845o1625032l5865183
10613I8840340k2383076j4756025j0034230o975274n228977m210321k922552j448836
10605C0881049q70644j913506k400253l044801k881037k337332j915718j283338
10597A4234420o79641o54267j032497j235949j256355r45203p08524o12756n26497
10588F582731m70362l92729l31692l12932k53718k25025k19079k03608k37912
10579C935674k23848j84151j73612j46528j51385j52636j30128r8457q7407q6237
10569B501285j04293j04780j06068r7333r5808r5168p2448m9419n3380n0410n1009
$$ y = [163142663, 250032992, 362921884, 428388737, 420433495, 380372179, 337690772, 360528839, 424267403, 432762251, 383498598, 293604400, 196330555, 134705523, 98840340, 76457264, 61701239, 51667009, 44691735, 39462758, 35252437, 32329885, 30881049, 30010405, 28096899, 25696646, 22651845, 19770808, 17433476, 15517758, 14234420, 13554779, 12900512, 11868015, 10632066, 9375711, 8430508, 7721984, 7109228, 6582731, 6112369, 5719640, 5387948, 5075016, 4821298, 4596273, 4377194, 4173586, 3935674, 3711826, 3527675, 3354063, 3207535, 3056150, 2903514, 2773386, 2674929, 2587522, 2501285, 2396992, 2292212, 2186144, 2088811, 1993003, 1897835, 1825387, 1775968, 1722588, 1672178, 1621169]
10558A621169o0499n0052n6268n5994m2666m1107m1573n5088o0100m0524j3423
10547A103875j4590k2016k5005j8111k5091q736j3133k8392k0788j2170J1750
10536I27593N8541N3131j3034m3365n3612j7950L1498J8254m0908p6271q0136
10525G63741o0840l2072k2860k4980k2814l0303l3189k1382j7570k161k5283l0441
10513D39846r865j4866j5633j4344k1195j1764m223J615L539M671q93O153M3414
10500D06455P7472P0273j3192l691R825J1285L5974J0417l9673k6218l9431l7259
10488D62237l7961m5601l6913k8631k9338q433k624j8365j7811q102n530k978
10476B19950k9j692mr587j9724j664O261L6619M2493M263j1778j2120J60L2691
$$ y = [1621169, 1560670, 1510618, 1454350, 1398356, 1355690, 1314583, 1273010, 1217922, 1157822, 1117298, 1103875, 1089285, 1067269, 1042264, 1024153, 999062, 990326, 977193, 948801, 928013, 915843, 927593, 986134, 1039265, 1026231, 982866, 929254, 911304, 942802, 961056, 920148, 843877, 763741, 702901, 670829, 647969, 622989, 600175, 569872, 536683, 515301, 497731, 495570, 470287, 439846, 429981, 415115, 399482, 385138, 363943, 352179, 347956, 349571, 353110, 357781, 356888, 363041, 406455, 483927, 554200, 541008, 537317, 547142, 558427, 594401, 604818, 565145, 538927, 499496, 462237, 424276, 378675, 341762, 313131, 283793, 275360, 272736, 254371, 236560, 228458, 222928, 219950, 219921, 218229, 218225, 208638, 188914, 187250, 193511, 230130, 272623, 276886, 265108, 252988, 253148, 285839]
10462B85839K4672N074p845k1275j9129j3048q759k915j8126k5166j4138j0364
10450A74820K462O824Q672K868N359J015j49k727J0783R010J1173J8768J4824
10437B63702J395k4548l3959r886l933j887p7k4660l7778k5008j6013J0697Q158
10424A06203o811l744l995J1258J3570J229j3819j7518j6712n413J4471Rr077
10411F9651r537o798k481l406k267J1685J0389J1308M746n65j002M362J4498O493
10397A07076q752O70K941J846L610L748N638O930M344m730J04N249R748L422j2695
10382A29149j3047l70J800l651q445p231j2409q050R396J2736J0871M316j1220
10369A03845n559R491J0626J9783K746j1271j0369p564k861l907k872j506j863
$$ y = [285839, 310511, 315585, 307740, 286465, 267336, 254288, 245529, 242614, 224488, 199322, 185184, 174820, 177282, 184106, 192778, 195646, 201005, 202020, 201871, 199144, 209927, 218937, 230110, 248878, 263702, 265097, 240549, 206590, 196704, 192771, 190884, 190807, 166147, 128369, 103361, 87348, 98045, 106203, 99392, 95648, 91653, 102911, 116481, 117710, 103891, 86373, 69661, 64248, 78719, 78728, 69651, 60114, 53316, 50835, 47429, 45162, 56847, 67236, 78544, 83290, 82725, 81723, 86085, 100583, 107076, 98324, 98994, 101935, 103781, 107391, 111139, 116777, 123707, 128051, 123321, 123425, 128674, 138422, 141844, 129149, 116102, 115732, 117532, 113881, 105436, 98205, 85796, 77746, 87142, 99878, 110749, 115065, 103845, 98286, 107777, 118403, 138186, 140932, 129661, 119292, 111728, 108867, 104960, 102088, 100582, 98719]
10356I8719r66k359r105j1653J010P430M971j299k500l663n681P417M224J420
10342H7965q07k100k118J866N560Q000K889l064j613K861N572O943j970O939M089
10327A21012J093L822j791j9313l3956j9698r479o313n477j3369k4978l170Q650
10314b967K5011L0387K4362J8356K6150K3002J3803Q661J412o535j1941j2870
10302A36831j6141k5049k1456j1330j4701n199k647r717k891K616K080K007M543
10289C8946j936j1337k849l444n649K12J0093j28l942L53K218M162P723m731p152
10274B2539l50n000m599j755l807K850K47O70L982J3015J3115J3724K1003L4040
10260A09674K7904L307j7221k1410k3793j2233q255l602l409l724q568l725m612
$$ y = [98719, 97753, 95394, 86289, 74636, 75646, 83076, 88047, 86748, 84248, 80585, 74904, 82321, 86545, 87965, 87158, 85058, 82940, 84806, 90366, 98366, 101255, 98191, 96578, 99439, 105011, 111954, 109984, 116923, 121012, 122105, 125927, 124136, 104823, 70867, 51169, 41690, 35377, 29900, 16531, -8447, -11617, -2967, 22044, 52431, 76793, 95149, 121299, 144301, 158104, 166765, 168177, 161642, 149701, 136831, 120690, 95641, 74185, 62855, 48154, 42955, 40308, 30591, 27700, 30316, 32396, 34403, 38946, 37010, 25673, 22824, 19380, 13731, 13943, 24036, 23908, 19966, 20319, 22537, 26699, 34422, 29691, 22539, 22189, 17189, 12590, 10835, 7028, 9878, 10125, 10795, 14777, 27792, 40907, 54631, 75634, 109674, 137578, 140885, 123664, 102254, 78461, 66228, 57973, 54371, 50962, 47238, 38670, 34945, 30333]
10247C0333j951M99O465N136L108p126m698m677o57L298P017l548p014K874J0519
10232C9578J2651O842R464Q570J067j059J370J0461Q525Q016L584K989Q696J2176
10218A32930J5056J5720J5404L1590N0174P4705J12974J90026L37304N45610O39650
10207B161143K75491q7406k70950j50965K35690L07593r3799l83641n93690m98909
10197I00557k87090j65406j09866o6888m8311m4012k6976k2776j4173r729L674
10186A09004J538k66J332n254j2770j5559j5223j0738r212n08l567k667l163p978
10172B4969o408n591p740L906Q015R690J0930o75m675o828J469O337P805j856
10158C9348j3897j0983k792J0899O475n108j0283k634P976M926N05l545j173p555
$$ y = [30333, 28382, 28881, 35346, 40482, 43590, 36464, 31766, 27089, 26432, 29730, 36747, 33199, 26185, 29059, 39578, 52229, 59071, 68535, 77105, 78172, 77113, 78483, 88944, 97469, 105485, 109069, 112058, 120754, 132930, 147986, 163706, 179110, 210700, 260874, 335579, 448553, 638579, 975883, 1521493, 2161143, 2436634, 2349228, 2078278, 1927313, 2163003, 2470596, 2376797, 1993156, 1399466, 900557, 613467, 448061, 338195, 271307, 222996, 178984, 152008, 129232, 115059, 105330, 109004, 110542, 110276, 111608, 106354, 93584, 78025, 62802, 52064, 42852, 42344, 38777, 36110, 32947, 24969, 18561, 12970, 5230, 9136, 17151, 26841, 37771, 37096, 32421, 25593, 27062, 33399, 41204, 39348, 25451, 14468, 11676, 22575, 29050, 23942, 13659, 11025, 19001, 23927, 24432, 20887, 19714, 12159]
10144A2159m109J2J959L828r167R35P704Q406K28n645q072o281m716M207P95l696
10128a453K606J903N56m00r123M471J2752N007J856L209o120p021L923j975m042
10113F149O93M15L40Q90Q393k818O4O044k933k262l14n248q90o666L10L950l363
10096B754m532o58O586K505k224L76J782p467K154K49L394l531q737j118R962
10081A495P830k030o736n481O597P124M790o59r698l436M135K130l104p449q008
10066a2500m053N257N886J1371R469L340K75l962l029m084m071l847l646R31R678
10051G015N479M415k189L715N652Q033R767R026M799k005o5N750L140P249J4293
10036H4074K2979M3913N3485P9881J38863K54804M71527P65504N30314j46861
$$ y = [12159, 8050, 8062, 10021, 13849, 4682, 5617, 13321, 21727, 21955, 16310, 8238, 1957, -2759, 1448, 2243, -1453, 1153, 3056, 3612, 3212, -5911, -1440, 11312, 16319, 18175, 21384, 15264, 8243, 12166, 10191, 6149, 6842, 7257, 7597, 8487, 16880, 14062, 14126, 20170, 17237, 14975, 14661, 9413, 8523, 1857, 2167, 6117, 2754, -1778, -2436, 4150, 6655, 4431, 4807, 6589, -878, 1276, 1525, 4919, 1388, -7349, -8467, 1495, 9325, 7295, 559, -4922, 1675, 8799, 13589, 12930, 3232, -204, 3931, 6061, 2957, -4492, -12500, -16553, -11296, -5410, 5961, 15430, 18770, 19045, 15083, 12054, 7970, 3899, 52, -3594, -2663, 7015, 12494, 16909, 14720, 18435, 24087, 32120, 41887, 50913, 55712, 53707, 53642, 59392, 62532, 69781, 84074, 107053, 150966, 204451, 284332, 423195, 677999, 1149526, 1915030, 2445344, 2298483]
10026B298483m54476p09151m54595k19034j28141q1369m8361l0780k9251k3362
10016A19963j6155j1038q595j0613n784j2777l660N463l721j2236j2076n924k295
10003B0552K526K216M516m135q05K91l126q180o60N972k72o513k487N670m931
9988A0634l767P19m745k41M394k88J045R99J608o84n975j521L092R292l784m093
9972F685K464l522p569j164O39M711M435K111R32J881n827p297M952Q587p36n788
9956E494n071M403q86O36L349l065m700K82k776n061J804O238Q39L634J104o88
9940E536M71l888q78m655m685n10M201J307N37J323P393O900L606l828o179k524
9924D127L525O62k147l181K545k286J1201L303j269j610O896N071M821J6500K5427
$$ y = [2298483, 1844007, 1134856, 680261, 461227, 333086, 251717, 203356, 172576, 143325, 119963, 103808, 92770, 84175, 73562, 67778, 55001, 51341, 56804, 53083, 40847, 28771, 22847, 20552, 23078, 25294, 29810, 25675, 24870, 25161, 22035, 13855, 13195, 19167, 18895, 12382, 9895, 15565, 10634, 6867, 7586, 2841, 2600, 6994, 6706, 7751, 8750, 10358, 9674, 3699, 2178, 5270, 14562, 10778, 6685, 9149, 5627, -1942, -3106, -2467, 2244, 6679, 8790, 9722, 11603, 5776, -1521, 3431, 12018, 11282, 5494, 423, 4826, 3940, 4576, 7925, 4860, 160, 442, -2334, -7395, -5591, 647, 1486, 5120, 6224, 5536, 6007, 2119, 1241, -3414, -8099, -8609, -4408, -3101, -2564, -1241, 6152, 13052, 16658, 12830, 6651, 4127, 7652, 8314, 6167, 2986, 5531, 3245, 14446, 17749, 16480, 14870, 21766, 26837, 31658, 48158, 73585]
9909G3585M8424J03137J24845L3353m9632j00687j04009m5982k4387j3197m110
9898D1340k527l159j0832j0881k657P773M351l922p923j334O336O329m888J099
9884A9105k231j14O61m931r203k471K393J56n365p303J643M422K964L001M060
9869F787M25p913m851k168q89k28K021m00N262r22o834Q98M312N398l200j221
9853c523m868J043M529K303M747K79k822L316M60r911Q69N76m548O491M461l64
9837C038K215l234J587j966p586n650J074L734M611J1277P202J2040J0722J9395
9823E8459K7093J7196o60k1125k5028k1867p706l769j0653m922J925o31m264k495
9809A553J403R98o251l920l052J685K650k544k705P463M556n89M20l834O096N438
$$ y = [73585, 122009, 225146, 349991, 383344, 333712, 233025, 129016, 83034, 58647, 45450, 41340, 38813, 35654, 24822, 13941, 11284, 19057, 23408, 19486, 11563, 10229, 16565, 22894, 18006, 19105, 16874, 16760, 17421, 12490, 3287, 816, 3209, 3365, -2000, -9303, -7660, -3238, -274, 2727, 6787, 7212, -701, -5552, -7720, -8609, -8837, -6816, -7216, -1954, -2876, -9710, -8812, -4500, 898, -2302, -3523, -8391, -7348, -2819, -516, 4231, 4510, 1688, 5004, 5464, -4447, -3578, -3002, -7550, -1059, 3402, 3038, 5253, 2019, 3606, 1640, -5946, -11596, -10522, -6788, -2177, 9100, 16302, 28342, 39064, 58459, 85552, 102748, 102088, 80963, 55935, 34068, 26362, 22593, 11940, 7018, 8943, 8312, 4048, 1553, 2956, 3954, -2297, -6217, -9269, -7584, -4934, -7478, -10183, -2720, 1836, 1247, 1667, -2167, 3929, 9367]
9793I367Q15J768j870r652j975P938j634l04k818n1J315l622n674K022L122N723
9777D470l636K406m204n726l774J291R104m986k154l77P234k485q683R254P797
9762E531k950L926j308o876N010M690n005K456m359o161J668p66l021l419k484
9747a3068J761N934m079k454l875L368O033M585K149k89k706J233n43J1164q11
9732H402k929m96l885q3L643N857o849k381K652L48O96m404j982j737K479K753
9716B084J060L762m25l376j339n359o391Q2J784K383O120K677M10O115j999l392
9700D196p492j817M334l077m864j947n043k92K759K970K307k276N608P431K006
9685D803l496q752J436O113m089n386l486O242O388m429q981m2O014L348N377
$$ y = [9367, 10182, 11950, 10080, 428, -1547, 6391, 4757, 4453, 1635, 1584, 2899, -723, -6397, -4375, -1253, 4470, 834, 3240, -964, -6690, -10464, -9173, -69, -5055, -7209, -7586, -352, -2837, -11520, -2266, 5531, 2581, 6507, 5199, -1677, 3333, 8023, 3018, 5474, 1115, -5046, -3378, -4144, -7165, -10584, -13068, -11307, -5373, -9452, -11906, -15781, -12413, -6380, -1795, 354, 65, -2641, -1408, -1951, 9213, 8402, 5473, 4977, 1092, 1009, 4652, 10509, 3660, 1279, 3931, 4279, 4975, 571, -1411, -3148, -669, 2084, 3144, 6906, 6481, 3105, 1766, -3593, -9984, -9902, -8118, -5735, 385, 3062, 3472, 9587, 7588, 4196, -3296, -5113, -779, -3856, -8720, -10667, -15710, -16002, -13243, -10273, -7966, -10242, -4634, 2797, 4803, 1307, -7445, -6009, 104, -3985, -9371, -12857, -6615, -227, -4656, -13637, -13679, -7665, -4317, 1060]
9670A060r04n677L037M476j290j8l974N176K620j0301J600M865J968J314k443
9655A509k374j673L718k53j104K022j214K953r72K121P40O251P347r06l617p94
9639A3754l288k213l7m32n407o097o783M565L273J044J324O318N77k073J143l224
9623B444L44k263j815K318j773j907m410J181J1510O263l145j940J213L414m139
9608G295k660l176k253j781p2n501l006j578L144k235P752J538M401Q612J521
9593A2001l398l756q501j525J287N916k97k326J727K161o743K345l857j537N068
9578a435M938N919R397k133j144k313j0006r754M051L384R87N393m953J731k857
9563A205m495l689K934p00J0940K382p217m489K148n810K281L705K738k015k796
$$ y = [1060, 156, -5521, -2484, 1992, 702, 684, -3290, 1886, 4506, -5795, -4195, 670, 2638, 3952, 1509, -865, -2538, 1180, 927, -177, 1845, 631, 3584, 2612, 4733, 5473, 11724, 19071, 18165, 14548, 13754, 10466, 8253, 8216, 7784, 2377, -3720, -10503, -5938, -2665, -1621, -297, 6021, 6598, 4525, 5668, 2444, 2788, 525, -1290, 1028, -745, -2652, -7062, -5881, 5629, 11892, 8747, 6807, 8020, 11434, 7295, 4635, 1459, -794, -2575, -2647, -8148, -11154, -12732, -9588, -11823, -4071, -2533, 1868, 10480, 12001, 8603, 4847, -3654, -5179, -3892, 2024, 1727, -599, 1128, 3289, -3454, -1109, -4966, -6503, -1435, 3503, 9422, 18819, 16686, 15542, 13229, 3223, -6531, -2480, 904, 1891, 7284, 2331, 4062, 1205, -3290, -6979, -4045, -4745, 6195, 8577, 1360, -3129, -981, -6791, -4510, -805, 1933, -82, -2878]
9548b878L608j01l752m777j188J057L305O834k801N142k488l135K319p68L996
9533D373J762O517M676l312r100M71n107n669k743J491j042j742K93M303m271
9518i100M263J0418L162j85k825m36o922m647M82J980L455O534k47J347k586O86
9502E379j169o832J365R014J7j326k713n099m379Q4k096k457M314m61m214N295
9486e278N905N997M558Q18n359o678j758M550Q196k48m662m957L628L995j500
9471G207l65N696L187l387q89j0003l170j690J63L218k873j690M645N666K078
9456G793l301M301o52J22l478m173k199K539L640L36k157O197m792k51p125n617
9440h817L01P697J0776J274m194k71M774k591j728O494m63o619L007J823m88J26
$$ y = [-2878, 730, 629, -3123, -7900, -9088, -8031, -4726, 2108, -693, 4449, 1961, -1174, 1145, 377, 4373, 6135, 12652, 17328, 14016, 4916, 5387, 280, -5389, -8132, -6641, -7683, -9425, -9132, -4829, -9100, -4837, 5581, 8743, 8558, 5733, 5297, -1625, -6272, -5790, -3810, -355, 6179, 5932, 7279, 4693, 5379, 4210, -2622, -1257, 7757, 7774, 6448, 3735, -1364, -5743, -5659, -7755, -10212, -5898, -6359, -10573, -5278, 627, 6624, 11182, 12000, 6641, -37, -1795, 2755, 10951, 10703, 6041, 1084, 4712, 8707, 7207, 6842, 12538, 15725, 12338, 11449, 1446, -1724, -3414, -3251, -33, -2906, -4596, 49, 5715, 7793, 4492, 8793, 8141, 8263, 4785, 612, -1587, 952, 4592, 4928, 2771, 8968, 4176, 3925, -3200, -8817, -8516, -819, 9957, 11231, 7037, 6766, 11540, 8949, 7221, 13715, 13252, 6633, 9640, 11463, 10975, 11101]
9424A1101k026J803K08o616o308J318O728n41k917J2044q37l178j021n49r356
9409a47K207N330P22k306m229n442K620J695k084m93N406O968k795m547k219L495
9393D181M358J237o165J431L055j161q69J087J79l34m96O831Q524o34L52J247
9377B2823l097l818j1340J02Q321l27L450q52k209L761j380P311M699K633N503
9362C5580l746j917O316p517l109j291j307m048K422l42K56l393l744m133J60
9347A0187n167Q6k507J302R329J304JK81L351M627n90P70M376j367K784M588P330
9330D0685K797l846K29n446P504N10l959j74m60M570J182m106l550q290k948J152
9314B5850N015j171M60L379O070O213J69J600L800M16j1290l121J676J360J246
$$ y = [11101, 9075, 10878, 11086, 4470, -1838, -520, 6208, 5667, 2750, 14794, 13957, 10779, 9758, 9209, -147, 2060, 7390, 8112, 5806, 1577, -3865, -1245, 450, -1634, -2127, 3279, 10247, 7452, 2905, 686, 4181, 8539, 9776, 3611, 5042, 8097, 6936, 6067, 7154, 7333, 6999, 6503, 13334, 21858, 21224, 21576, 22823, 19726, 15908, 4568, 4670, 12991, 12664, 16114, 15262, 13053, 16814, 15434, 22745, 27444, 30077, 35580, 31834, 29917, 36233, 28716, 25607, 24316, 23009, 18961, 21383, 21041, 21297, 17904, 14160, 10027, 10187, 5020, 5106, 2599, 3901, 13230, 14534, 14535, 14816, 18167, 22794, 22204, 22974, 27350, 25983, 28767, 33355, 40685, 43482, 39636, 39865, 34419, 41923, 42433, 38474, 38300, 37840, 42410, 43592, 39486, 35936, 27646, 24698, 25850, 30865, 29694, 30154, 33533, 39603, 45816, 45985, 47585, 51385, 51801, 40511, 37390, 39066, 40426, 41672]
9299D1672N60L065O116k063k120l99O263K050l576n727L073k47L24L274k651J595
9283E1209q24K295J611L422q59k16J810J2908N439l512k621j459J64k690o027
9268F0650L044K601N1J7169O502j318j518L364K961K198J012j730Q045L988m033
9253A02986k562J695K367P715P713P030N007j906o581l026j36O563Q493J200r259
9238A27299j4114l560N773Q437Q287L786L516j064m336L160k783J695R447l095
9224A42448K263K517M318K630L867L923m026R21K007k783L746M07l694k779L438
9209A59203K527k508m902n882M798O047K872M888M418K700o643j842l30r99m717
9194A59630K156o961l097R69L128M112p763k511l329K684o290j17K945k56l926
$$ y = [41672, 42232, 45297, 51413, 49350, 47230, 46831, 53094, 55144, 51568, 45841, 48914, 48667, 48991, 52265, 49614, 51209, 50385, 52680, 54291, 57713, 56854, 56638, 58448, 71356, 76795, 73283, 70662, 69203, 69367, 66677, 60650, 63694, 66295, 66346, 83515, 90017, 88699, 87181, 90545, 93506, 95704, 96716, 94986, 103031, 107019, 102986, 100424, 102119, 104486, 112201, 119914, 126944, 131951, 130045, 123464, 120438, 120302, 126865, 135358, 136558, 127299, 113185, 109625, 115398, 123835, 132122, 135908, 139424, 138360, 134024, 137184, 134401, 136096, 145543, 142448, 144711, 147228, 151546, 154176, 158043, 161966, 157940, 158861, 160868, 158085, 161831, 162238, 158544, 155765, 159203, 161730, 159222, 154320, 148438, 153236, 159283, 162155, 167043, 171461, 174161, 167518, 165676, 165346, 164347, 159630, 161786, 154825, 151728, 152697, 155825, 159937, 152174, 149663, 146334, 149018, 142728, 142611, 145556, 145300, 141374]
9179A41374M85J027l778m608o301q665l370N060J618M559j603o744l098k827p949
9164A05180j222K807O64k689r34n800M127L773r130o081k321L344J430n301k111
9149H5736M757J344n472n718K644j08n422l91L281n983o556l97L397J871n08K004
9133G4479J66r349n375o605j013L474M129q309o360l37M890k57Q686N118l988
9118E9349p187j234K407m637j130L374M632m522p268j318l445p224P215O141M157
9103D9310n192j719l990m575p680p54o39J685j802j600J990L634N043N239j08
9088C8842N090j2781o952P85O691L684k202r301l666j138L26j586N65k2n528l595
9072I212l125P984J275N705l886l284o56J894k641l344K021n030n57M053Q471
$$ y = [141374, 141859, 142886, 139108, 134500, 128199, 119534, 116164, 121224, 122842, 127401, 125798, 119054, 115956, 113129, 105180, 103958, 106765, 107429, 104740, 103806, 98006, 102133, 105906, 96776, 90695, 88374, 91718, 93148, 87847, 85736, 90493, 91837, 86365, 80647, 83291, 83183, 77761, 77370, 80651, 74668, 68112, 67715, 71112, 72983, 72475, 74479, 74645, 65296, 59921, 53316, 52303, 55777, 59906, 51597, 45237, 44900, 49790, 49533, 58219, 63337, 59349, 52162, 50928, 53335, 48698, 47568, 50942, 55574, 51052, 43784, 42466, 39021, 31797, 39012, 45153, 49310, 44118, 42399, 38409, 33834, 26154, 25400, 24761, 26446, 24644, 23044, 25034, 28668, 33711, 38950, 38842, 43932, 31151, 24199, 24984, 31675, 35359, 33157, 23856, 20190, 19052, 19378, 17792, 18357, 18335, 12807, 9212, 6087, 14071, 15346, 21051, 17165, 13881, 13225, 15119, 12478, 9134, 11155, 6125, 5568, 9621, 18092]
9057A8092M691P801J603l150l535o272N97J478j862o675o986o054k379P495R78
9042E822J969L98N174O815q577J266N398K262o707R6K197m253l401j045P23K996
9026A1133L902J3218k031k229j0395K927Q14L559j38o380J341l35J489N862m641
9011A8096L463k752l530L446P44n208m499M123M107n412k690L000M514l250m538
8996I614N320L143k223r878K476M081J189K492J78J382l733l955m123J910K156
8981A0029j666j354K053N819o25j897q314j900N929O397J734o049k956L99K11
8966G810Q56j539L397O28n485J561O9k699l738K730P310K55L140L127l978k117
8950A1327k619K735O58k210K478p55k916J90K8l201l480L790P106k625l269m762
$$ y = [18092, 22783, 30584, 32187, 29037, 25502, 19230, 19827, 21305, 19443, 12768, 5782, -272, -2651, 4844, 5822, 7791, 8189, 13363, 20178, 11601, 12867, 18265, 20527, 13820, 13916, 16113, 11860, 8459, 7414, 8137, 11133, 15035, 28253, 26222, 23993, 13598, 16525, 17339, 20898, 20760, 14380, 15721, 15386, 16875, 22737, 18096, 21559, 18807, 15277, 18723, 19467, 14259, 9760, 13883, 17990, 12578, 9888, 12888, 17402, 14152, 9614, 14934, 18077, 15854, 5976, 8452, 12533, 13722, 16214, 16392, 17774, 14041, 10086, 5963, 7873, 10029, 8363, 7009, 9062, 14881, 14256, 12359, 4045, 2145, 8074, 14471, 16205, 10156, 7200, 7599, 7810, 8666, 7127, 10524, 11152, 5667, 7228, 7297, 4598, 860, 3590, 10900, 11155, 14295, 17422, 13444, 11327, 8708, 11443, 12101, 9891, 12369, 11614, 8698, 8888, 8916, 5715, 2235, 6025, 13131, 10506, 7237, 2475]
8934B475n89n91N288O471O550p36p311k087j019j426J660P198M86r389m358k583
8918C9N834k900r91K954J183o762p65K566M14N081J471K32L46K430J706j588m918
8901F332j015p0M696J518J019O543k809o926q12L219K899n467j720k942j957j172
8885A336k63R646p69J519o41p05J018J456j712l756k930k501M014n639m795J902
8869b820j437J210L637M032M748M06n592r9Q365J142k365K478J910J399o203q456
8853B355M17M329k52l80K545K25k34J213k129N282n619p597m397K81M569J107
8837A715K231K527K145j778o97M488L657M214J892k042m330J550n70k272p418
8822E312n083Q299O804k60j833J684N033O92n976j741l219j267m374o127n40R92
$$ y = [2475, 1886, 1295, 6583, 13054, 19604, 18868, 11557, 9470, 8451, 7025, 8685, 15883, 16369, 6980, 2622, 39, 5873, 2973, 1982, 4936, 6119, -643, -1408, 1158, 1572, 6653, 8124, 8356, 8702, 11132, 12838, 11250, 6332, 5317, 5247, 9943, 11461, 12480, 19023, 16214, 9288, 8476, 11695, 14594, 9127, 7407, 4465, 2508, 1336, 1073, 10719, 9950, 11469, 10828, 10123, 11141, 12597, 10885, 7129, 4199, 1698, 5712, 73, -4722, -2820, -4257, -3047, 590, 4622, 9370, 9776, 4184, 4085, 12450, 13592, 11227, 13705, 15615, 17014, 10811, 2355, 2772, 7101, 6849, 6469, 9014, 9239, 9005, 10218, 8089, 13371, 7752, 155, -4242, -3961, 608, 1715, 3946, 6473, 8618, 6840, 6143, 10631, 14288, 18502, 20394, 18352, 14022, 15572, 15002, 12730, 5312, 229, 8528, 15332, 15072, 13239, 14923, 19956, 20648, 14672, 12931, 9712, 8445, 4071, -2056, -2596, -1604]
8806a604L176J960l198O282R533n16k118l340j377J582J380n391k493N322P720
8791A6918J120m489k000k682m077j188J095J913m301K551m571p29L449L66l504
8776a29L426Q135k689r789P901Q889m704m72L519k99L53K808L62n922N27j052
8760A0864m038k422n488k054n15R02Q44k949p91J713Q102J001j412K618J675K44
8744H294K6J097K00l779p283l128j970M489P796p031M41j40K612N680k860l244
8728A200L437N687N409J404n630k079j111J228K352j863r555q843O5j085K888
8713f496M376N833j196J913k920J449l322l977k886K038J804j707M265L143r28
8698A389M281L787K401K825J529p282j0135J678o156J569m7L196R557J428l249
$$ y = [-1604, 1572, 3532, 334, 6616, 16149, 15633, 13515, 10175, 8798, 10380, 11760, 6369, 3876, 9198, 16918, 18038, 13549, 11549, 8867, 4790, 3602, 4697, 6610, 2309, 4860, 289, -440, 3009, 3375, -129, 3297, 11432, 8743, -1046, 6855, 15744, 11040, 10568, 14087, 13788, 14141, 16949, 17311, 11389, 11916, 10864, 6826, 4404, -1084, -3138, -3653, -2751, -1907, -4856, -5647, -3934, 4168, 5169, 3757, 6375, 8050, 8294, 8320, 9417, 9617, 5838, -1445, -4573, -6543, -2054, 5742, -1289, -848, -988, 1624, 7304, 4444, 1200, 4637, 10324, 15733, 17137, 11507, 9428, 8317, 9545, 11897, 10034, 479, -8364, -8299, -9384, -6496, -2120, 3713, 2517, 4430, 1510, 2959, -363, -4340, -7226, -5188, -3384, -5091, -826, 2317, 1389, 5670, 9457, 11858, 14683, 16212, 8930, -1205, 473, -5683, -4114, -4161, -965, 8592, 10020, 6771]
8683F771m833l281K314L605L725J95k719l679o260R73j148p90j892Q116N999N34
8667G630j080L809n96m909K170L103K644p52o271K522J827l939o021ML266J746
8651E153J669j944m387P95l79k682M824N919K625K648j167K180l867J364K178
8636A4929L11k725R58M911J804n623m096K68L711M714q18J070J1881J3962J239
8621D6496m262r711p463J644m986o367o674L41j734k131l31j243m645J730O052
8606F716j57K265J113k344L002q1N53j092J231J620k381K506O653N21o71j541
8590A7913Q289r613r234N213O745n737L984O021K537J0603N669J5706J5828N333
8576G9257p68q880r091n447J54K050l145Q128L94m269j768J341p675j1309p297
$$ y = [6771, 1938, -1343, 971, 4576, 8301, 8496, 5777, 2098, -4162, -3189, -4337, -5127, -7019, 1097, 7096, 7630, 6550, 10359, 9763, 4854, 7024, 10127, 12771, 12019, 5748, 8270, 10097, 6158, 137, 141, 3407, 5153, 6822, 4878, 491, 1286, 907, -1775, 3049, 8968, 11593, 14241, 13074, 15254, 11387, 12751, 14929, 15240, 12515, 13473, 18384, 20188, 14565, 10469, 10737, 14448, 19162, 18344, 19414, 31295, 45257, 46496, 42234, 32523, 25060, 26704, 21718, 15351, 8677, 9018, 7284, 5153, 4822, 3579, -1066, 664, 6716, 6559, 8824, 9937, 7593, 10595, 10514, 11067, 9975, 11206, 12826, 10445, 12951, 19604, 20125, 19454, 17913, 26202, 16589, 7355, 12568, 19313, 13576, 17560, 23581, 26118, 36721, 42390, 58096, 73924, 79257, 78489, 69609, 60518, 55071, 55225, 57275, 54130, 62258, 62652, 58383, 56615, 57956, 50281, 38972, 31675]
8561C1675j346N483J923p309k821M279j668o723l612J305j166l401L050J890m135
8546A7424m850O856M750p077p930J979k49l373j757M796P486J753N347O317J3033
8531D4505M308j2336p962m238j0774p859m749k710N270j587l52K141l100j07M508
8516D958j181j169K645K393m021M42K799o486N560m94L708J978n398j311M140
8501H563k326p669P18N291K067p094j027J192o105J52Q167N972L071K81l601l247
8485D405L028j711J160k549n511m295L028R268J27J588l57l071J299j107J006
8470F308q247P185k371M851k009l298L370M4l628L487L212m71l675n404K836k078
8454A12o531J109K413M794J391n901p724K361L718m393k107j307r17N391L884
$$ y = [31675, 30329, 35812, 37735, 30426, 27605, 31884, 30216, 23493, 19881, 21186, 20020, 16619, 19669, 21559, 17424, 12574, 19430, 24180, 17103, 9173, 11152, 10903, 7530, 5773, 10569, 18055, 19808, 25155, 31472, 44505, 48813, 36477, 28515, 24277, 13503, 5644, 895, -1815, 3455, 1868, 1516, 3657, 557, 450, 4958, 3777, 2608, 5253, 7646, 3625, 4067, 6866, 380, 5940, 5446, 9154, 11132, 5734, 4423, 8563, 6237, -1432, -714, 4577, 6644, -450, -1477, -285, -6390, -6238, 1929, 7901, 10972, 11253, 7652, 4405, 7433, 5722, 6882, 4333, -1178, -5473, -2445, 6823, 6950, 8538, 8181, 5110, 6409, 5302, 6308, -1939, 5246, 2875, 7726, 5717, 2419, 5789, 5833, 2205, 5692, 8904, 8433, 4758, -646, 2190, 112, -6419, -5310, -2897, 1897, 3288, -2613, -10337, -7976, -4258, -8651, -10758, -12065, -12982, -7591, -3707]
8439c707K191M073K490N43o49j502k282l333J244L211n298j0068J710J0790N679
8424E092M11o688K685L533O794J711l206K982k83j177p812o805Q038Q81k615M340
8408G881m052j126j421nn195p955m270Q40k205K683P763P970k539k727r277J403
8392a2232Q003k349k393J685N85P630J949o949k327k678j866J383N902O038n948
8377c567k384L934k331P282k461l238j965K365K38q581l255L753K799K555q8L79
8361d565K077o70k889K748M410p46l625n324m852l036Q957N185n12K747J73o6
8345A2N375k104n047M117Q838r485k196J460j14n472m846K160L048O6L683m426
8329d931R186L922j023k485k322l904K446l480Q50M948q89k204L42l826M293L350
$$ y = [-3707, -1516, 2557, 5047, 5590, 4941, 3439, 1157, -2176, -932, 2279, -3019, -13087, -11377, -587, 5092, 5503, -1185, 1500, 5033, 11827, 13538, 10332, 13314, 13031, 11854, 4042, -2763, 5275, 6156, 3541, 7881, 3829, 2703, 1282, 1277, -3918, -11873, -16143, -15303, -17508, -14825, -7062, 908, -1631, -4358, -13635, -12232, -4229, -6578, -8971, -7286, -6701, 929, 2878, -4071, -6398, -9076, -10942, -9559, -3657, 2381, -3567, -5951, -2017, -4348, 2934, 473, -2765, -4730, -2365, -2127, -10708, -13963, -10210, -7411, -4856, -4944, -4565, -2488, -3158, -6047, -3299, 1111, 365, -3260, -8584, -13436, -16472, -7515, -2330, -2842, -95, 78, 12, 5387, 3283, -1764, 2353, 11191, 1706, -490, 970, 856, -4616, -9462, -7302, -4254, -4188, -505, -4931, 4255, 8177, 7154, 4669, 2347, -1557, 889, -2591, -1741, 3207, 2318, 114, 456, -3370, 923, 4273]
8313D273M30J036l902M220J821K669N96m870m30l282J167l00J177k94k294L468
8297E485J40j0481p047J705N402R597o582j2059J842O878N413L559r89J193m435
8282c79k044M544J476o123O41k209J463k970L044j456j644O979J555m281r07n438
8266g749L285j517n728L235L180L700L640l636L114J932j0565r086R302K101k758
8251g550M664N80L668M229l151l108O971O510k187n517q457l144J467M042L674
8236B691Q57j530K360m38l270k693L508R55l463M26L183M515m275J383j542L744
8220F411m70r02m721J704j570m739j178Q982j911r179j662K07L511M625M620M178
8204G906j336m877m189N613j845p543l286J860N414M939n114J2O142k587N098
$$ y = [4273, 4703, 5739, 1837, 6057, 7878, 10547, 11143, 6273, 5843, 2561, 3728, 3428, 4605, 4311, 2017, 5485, 5625, -4856, -11903, -10198, -4796, 4801, -1781, -13840, -11998, -5120, 293, 3852, 2863, 4056, -379, -2423, 2121, 3597, -2526, -1885, -4094, -2631, -5601, -2557, -4013, -5657, 1322, 2877, -1404, -2311, -7749, -4464, -5981, -11709, -8474, -5294, -1594, 2046, -1590, 1524, 3456, -7109, -16195, -6893, -4792, -7550, -2886, -2306, 1362, 5591, 2440, -668, 6303, 12813, 10626, 5109, -3348, -6492, -5025, -983, 2691, 3548, 2018, 4378, 3940, 670, -2023, 1485, 2440, -1023, -597, 2586, 7101, 2826, 4209, 2667, 6411, 5941, 5039, 318, 2022, 452, -4287, -5465, 3517, 1606, -7573, -9235, -9028, -5517, -892, 3728, 7906, 6570, 1693, -2496, 3117, 1272, -6271, -9557, -7697, -2283, 2656, -2458, -2446, 3696, 1109, 6207]
8189F207J710q140k754Q19J313m540m296O048K9j568M43m78P15L981k410l424
8173f345m138K270P90K466K637K101m791N203M523Q05l014J958k508p30J522J050
8157C799o647m261K426l79j46m252l626k48K674K499K101K618N494O405j4L34
8141H777P80n333j358M659j725j987j477P82p815n189n4M165J053J270Q99p07
8125c260M60N59j487R08M279l498l307P980j839L498M278J503J180m935K043J0728
8109A9090N732o698j5067o803L050k184M510L936j351r79Q43O811n347q326m102
8094f885M279j822p54J1943L097j660q497j761N039K841J418q057k433K007O1
8079a184J486k829M75J486j1511l083L232O524M452L606j051l302K28M2m941k406
$$ y = [6207, 7917, -223, -2977, -2158, -845, -5385, -9681, -3633, -3604, -5172, -4729, -5207, -4492, -511, -2921, -6345, -10483, -8213, -7423, -4957, -2320, -219, -5010, 193, 4716, 5521, 2507, 4465, 1957, 1227, 2749, 3799, -2848, -7109, -4683, -5062, -5208, -9460, -13086, -13334, -10660, -8161, -6060, -3442, 2052, 8457, 8443, 8777, 9557, 4224, 2866, 7525, 5800, 3813, 2336, 3118, -4697, -9886, -9940, -5775, -4722, -3452, -2553, -3260, -2800, -2241, -3728, -2820, 1459, -2039, -5346, 2634, 795, 4293, 8571, 10074, 11254, 6319, 8362, 19090, 24822, 18124, 3057, -3746, -696, -2880, 1630, 5566, 4215, 3236, 4079, 10890, 5543, -2783, -6885, -2606, -4428, -5182, 6761, 9858, 8198, -299, -2060, 2979, 5820, 7238, -819, -3252, -1245, -1184, 302, -2527, -2052, -566, -12077, -15160, -11928, -5404, -952, 2654, 1603, -1699, -1471, -1429, -6370, -8776]
8063h776L109L596q96k997J328R232j491j0756j702J432M097J596K357N17l490
8048b844n93J825K390R586K029q306m642l216n488O571O911L08k828p345l936
8033i578J1183P829L325m464j1303o845L318N630M705j271k104l01k350N805J1791
8018A5370l360r464l71P060r73K544K478o792p139L165l22L573l606j818N918
8003F263j132n359J597N406L201k331l132l825L297J610m236j098R90M368k14
7988E405j455Q387l983l910K307P485J166l668p058l387J787K341k833J207R045
7973A2836N688P271k033l24J515O792k29P6k19r263p992K2o962j648L623p9L76
7956I450m633L980J782O89J964o12n88k715L141J124m361m251M789O597K548N227
$$ y = [-8776, -5667, -2071, -2967, -5964, -4636, 4596, 3105, -7651, -9353, -7921, -3824, -2228, 129, 646, -2844, -3437, -1612, 778, 10364, 12393, 4087, -555, -3771, -9259, -2688, 4223, 4531, 1703, -5642, -9578, 1605, 9434, 12759, 8295, -3008, -9853, -6535, -905, 3800, 2529, 425, 124, -2226, 3579, 15370, 12010, 2546, 2175, 9235, 8262, 10806, 13284, 6492, -647, 2518, 2196, 5769, 2163, 345, 6263, 5131, -228, 1369, 6775, 9976, 7645, 4513, 688, 3985, 5595, 1359, 261, 1251, 5619, 5405, 3950, 12337, 8354, 4444, 6751, 14236, 15402, 11734, 4676, 1289, 3076, 5417, 2584, 3791, 12836, 18524, 25795, 23762, 23438, 24953, 31745, 31516, 31592, 31373, 22110, 14118, 14140, 7178, 5530, 9153, 9074, 9450, 4817, 8797, 10579, 11268, 13232, 12620, 12032, 9317, 12458, 13582, 9221, 4970, 9759, 16356, 18904, 24131]
7940B4131J082P3k499m07n946o145L470m995K815N040P92L348L271K182k618j705
7924B1889N057N879L42o174q932j260J257R97j467l607l870l677P577M641k375
7909A6277l668M879K181o785r281n399k582R342O644m408l483J555j816L959K10
7894G625k820J762k224m800O111L800R392J85k867k952o350L784J994m253k850
7879E537L77J799N649K309J345J007o963N49M300L710L244q201q283k409l40L491
7863G121Q812j326r086n885m156J122O153R858k707p662M321m31l976j854M22
7848G26N000J230J10k938J948j899L69k525j569k51O078k04L883l476j0881l285
7832g684M834M582l09o887l493J0094R141m390q05j586m996j839j691O684N044
$$ y = [24131, 25213, 25286, 22787, 22380, 16434, 10289, 13759, 8764, 11579, 16619, 17411, 20759, 24030, 26212, 23594, 21889, 26946, 32825, 33167, 26993, 18061, 16801, 18058, 19055, 17588, 13981, 10111, 6434, 14011, 18652, 16277, 12609, 17488, 19669, 12884, 3603, -1796, -4378, 4964, 11608, 7200, 3717, 5272, 3456, 7415, 7625, 4805, 6567, 4343, -457, 5654, 9454, 18846, 19031, 16164, 13212, 6862, 10646, 12640, 8387, 5537, 5914, 7713, 13362, 15671, 17016, 18023, 11060, 11609, 15909, 19619, 22863, 14662, 6379, 3970, 3630, 7121, 15933, 14607, 5521, -364, -4520, -3398, 2755, 12613, 9906, 2244, 6565, 6134, 2158, 304, 726, 5726, 6956, 7066, 4128, 6076, 4177, 4546, 2021, 452, 201, 6279, 6075, 9958, 6482, -4399, -7684, -2850, 1732, 1423, -5464, -8957, 1137, 10278, 5888, 5083, 3497, -1499, -3338, -5029, 1655, 6699]
7817F699l665L196J420q63p649L821N046n021j866n853l451Q18P892R69m094J260
7801a341L454k842r33j617k046j982j573M181K728r1L025J604l673j1467J750
7786a0823N416N41O846l986K024M993k293p207R090O478o774j074j337O794J812
7771A0500k37m888o066k428k694l957m938j159J377L983O783J112k331L676M309
7756C042k178k463L315o117o97P219Q45J59O562O188k560n728o895n264k801n573
7740a2946J999N752Q4j598N45L009P95j143k801J364j759M570M407L903K767l295
7724E653J720Q82o642l176k572o721k634M197K944K583m030K408M572n061j618
7709g495L389M707J171R39m336q96K145K344J676r911j0272l896J3208R010K003
$$ y = [6699, 3034, 6230, 7650, 6787, -862, 2959, 8005, 2984, 1118, -4735, -8186, -7368, 524, 1493, -2601, -1341, 2113, -729, -1662, -3279, -5325, -7307, -8880, -4699, -1971, -2062, 963, 2567, -1106, -12573, -10823, -5407, -4866, 1980, -2006, 18, 5011, 2718, -4489, 4601, 11079, 4305, 3231, 1894, 8688, 10500, 10263, 5375, -691, -3119, -5813, -9770, -14708, -15867, -14490, -10507, -3724, -2612, -4943, -1267, 3042, 864, -1599, 1716, -4401, -5098, 2121, 2966, 3125, 9687, 15875, 13315, 7587, 692, -4572, -7373, -12946, -10947, -5195, -5111, -6709, -6164, -3155, -2360, -3503, -6304, -4940, -6699, -2129, 2278, 6181, 8948, 5653, 7373, 8255, 1613, -1563, -4135, -10856, -13490, -9293, -6349, -3766, -7796, -5388, -816, -5877, -7495, -4106, 601, 1772, 2711, -1625, -2521, -376, 1968, 3644, -6267, -16539, -20435, -7227, 1783, 3786]
7694C786j843k164J935m330k525L227m89M423J712j863n302j462M49L066r41r34
7678c255l114J198K698N250o44J162n45l313k333j157J00j743l163k67J1485M39
7662B798p529n679O97Q531L978M376q20k311l074N029O069m788q565p702L682
7647e308N138k515p667L09J445P960k042n14K390k889K624Q896k965n978k937
7632d053j544m74j805P37L477N584J89O243J700j925R19l517n725m560j754J037
7616e471k472P26l592Q867J0226J140k347l213p037p825j347O720M920J849K077
7601C221m197j843M829M677p778k522j826K857j427j290j436l176N651N893o504
7586d871o730j198M509N255l49k439j558J340K551L470l991J428l911n811Q181
$$ y = [3786, 1943, -221, 1714, -2616, -5141, -1914, -2403, 2020, 3732, 1869, -3433, -4895, -4446, -1380, -2321, -3255, -6369, -5171, -2473, 2777, 2133, 3295, 2750, -563, -2896, -4053, -3953, -5696, -8859, -9126, 2359, 2798, -4731, -10410, -9713, -1182, 2796, 7172, 6352, 4041, 967, 5996, 12065, 7277, -1288, -8990, -5308, -170, -2685, -10352, -10043, -8598, -638, -2680, -3194, -804, -3693, -1069, 7827, 4862, -1116, -4053, -5597, -6071, -7876, -7139, -3662, 1922, 2111, 8354, 10054, 8129, 9048, 5531, -194, -4754, -6508, -5471, -7943, -7217, -10809, -1942, 8284, 9424, 7077, 3864, -3173, -10998, -12345, -5625, -705, 1144, 3221, -976, -2819, 2010, 6687, -1091, -3613, -5439, -2582, -4009, -5299, -6735, -9911, -4260, 1633, -4871, -11601, -12799, -8290, -3035, -3384, -5823, -7381, -6041, -3490, -20, -4011, -2583, -6494, -12305, -4124]
7571d124j16J086J317J012k290J358j331M299J888kl980N645j815l363J038N137
7555E759r23M16N864L946J935p223p611J918N709l117j141K487J298l517K535
7540H335k434k96K353j0856o940n370J793o07K263l799k171N473M572K333J58
7525e193M149L973m610j846l502o116l523K994j009J1594J377N535l99j808n433
7510c817k961O507k261J806P322k316J635n109k894k618O741m71J232n99o818
7495d621l977M422O715K581l37l087n678L161n300l537L803K689m499N762Q20
7480a083l870m457L760l838K370L277J332l490J693R699M896l282l694l269J550
7465A594K475m843k391K770l981m142L50M411L26m111N981k004m151k213J262
$$ y = [-4124, -4240, -3154, -1837, -825, -3115, -1757, -3088, 1211, 3099, 3097, -883, 4762, 2947, -416, 622, 5759, 4836, 5252, 11116, 15062, 16997, 9774, 2163, 4081, 9790, 6673, 5532, 8019, 9317, 5800, 8335, 5901, 5605, 7958, -2898, -9838, -15208, -13415, -14022, -11759, -15558, -17729, -12256, -7684, -5351, -5193, -1044, 2929, -1681, -3527, -7029, -13145, -16668, -13674, -14683, -3089, -1712, 3823, 3424, 1616, -3817, -6778, -271, -2532, -726, 6596, 4280, 5915, 806, -2088, -4706, 2035, 1564, 2796, 2197, -4621, -8598, -4176, 2539, 5120, 4783, 1696, -3982, -821, -6121, -9658, -5855, -3166, -7665, -1903, -1083, -4953, -9410, -5650, -9488, -7118, -3841, -2509, -5999, -4306, 5393, 10289, 7007, 3313, 44, 1594, 4069, -774, -3165, -395, -4376, -8518, -8168, -3757, -3431, -7542, -1561, -3565, -7716, -9929, -8667]
7450h667O23L840n290K436O359m160q320p611R01P881k250M969J996j459k369
7435a1121P868K478j296o2J874k734n710N427K291L532r91K846j087n546j791
7420d022n20M042P016j787m470q989j608N732Q848p01n053q1J481j036j405n825
7404h378K29N947O136k226j663m700n810n455N389K008n188J094M250k549j114
7389a2030n032O808R16j822J782k025L013M627p777m162R662K987M293k098P40
7374a18K998k32o815P66K17J936J252j09j853j515k006j661L355N972j253Q66
7358A800j736k741l401k707l064L331J1648J58k266J014L563L283l832p081J280
7343g51k651k979k067o7R101Q468n490p290L592j242n251k252p452J486Q683J07
$$ y = [-8667, -8044, -4204, -9494, -7058, -699, -4859, -13179, -20790, -19889, -12008, -14258, -9289, -7293, -8752, -11121, -3253, -775, -2071, -2133, -259, -2993, -8703, -3276, -985, 2547, 1556, 4402, 3315, -2231, -4022, -4542, -500, 6516, 4729, 259, -8730, -10338, -4606, 4242, 3541, -1512, -1593, -112, -1148, -2553, -8378, -8149, -2202, 3934, 1708, 45, -4655, -10465, -15920, -10531, -8523, -13711, -12617, -8367, -10916, -12030, -17062, -10254, -9338, -11160, -9378, -11403, -8390, -3763, -11540, -15702, -6040, -3053, 1240, -858, -118, 2880, 2648, -4167, -3401, -3184, -1248, 4, -105, -1958, -3473, -5479, -7140, -3785, 2187, 934, 1800, 64, -2677, -6078, -8785, -11849, -8518, 3130, 3288, 1022, 2036, 5599, 8882, 5050, -2031, -751, -3402, -6381, -8448, -8515, 586, 9054, 3564, -3726, -134, -1376, -6627, -8879, -16331, -14845, -6162, -6055]
7327f055J753M399q95j608m060J445P31l667K693l4m446l594L222M612O529j145
7311a20j905j357j555k747J201J55j349L831N551m12j671O005N848j987j729m786
7295B973l216n830L217l066O291J58m211o340l334K359P718N383J614o493r66
7280c743j98l946m513K44J162J025k026N60L217M999J401k136m73O2K813K59M908
7263C615P75l270o226q75N968K56J56L870n200n72n51l664j407j720p23J899M600
7246c069K246k835j697J612J749N436P264j36l937p172L569K517m439n677l988
7231h557j87R305N832n454o027l036j535p5J876J658J362K791K526j400k704m854
7215h479L5K104j027J708L139O271M859m263n460k659m147P065P284o644J130
$$ y = [-6055, -4302, 97, -798, -2406, -6466, -5021, -4290, -7957, -5264, -5298, -9744, -13338, -10116, -5504, 1025, -120, -2025, -3382, -4937, -7684, -6483, -6328, -7677, -3846, 1705, 1293, -378, 5627, 11475, 9488, 7759, 2973, -243, -6073, -2856, -5922, 369, 527, -3684, -10024, -13358, -10999, -3281, 2102, 3716, -2777, -3743, -3941, -7887, -12400, -12156, -10994, -9969, -11995, -11435, -8218, -3219, -1818, -3954, -4427, -4365, -1552, -1293, 3615, 4390, 1120, -5106, -5981, -13, 243, 399, 4269, -931, -1503, -2054, -5718, -7125, -8845, -9568, -7669, -3069, -823, -3658, -5355, -3743, -1994, 3442, 10706, 10570, 6633, -539, 3030, 5547, 1108, -4569, -8557, -8744, 561, 6393, 939, -5088, -8124, -9659, -9734, -7858, -6200, -4838, -2047, 479, -921, -3625, -8479, -8444, -6340, -7367, -5659, -2520, 3751, 8610, 4347, -1113, -3772, -7919, -854, 6430, -214, 916]
7200I16m930p001N50k878L28Q574J76Q34J32L329o74m747n24Q972l96r364j772
7183h475M664R15p948K898K231l541l10P841J0219j473l774J99k407k224l263
7168d448Lm513n15J233J403J805O303N760k721q305N139n88o787p221k339K069
7152a3722O356O684j17k668L69J367o481m535j155J024M116J534k611N33Q290
7137a016m53j40j104n419L111N350J660n089j495l200k907J2614j794m051K0q521
7121a2434j78m238l983R153M591K267q27j093M701N367K083o225q716L97n99L553
7105f181k1p025m691P101L923l829Q06M425o90k044k44j910J147J675L057J657
7089b844k474j95O747J173K745l632q27N183M568k173K00K326q984p940K082J236
$$ y = [916, -4014, -11015, -10465, -13343, -13015, -4441, -4265, -3431, -3299, 30, -644, -5391, -5915, 3057, 2661, -6703, -8475, -3811, -2896, -10844, -7946, -5715, -9256, -9566, -1725, 8494, 7021, 3247, 3446, 1039, -1185, -4448, -4445, -8958, -9473, -8240, -6837, -5032, 1271, 7031, 4310, -3995, 1144, 556, -6231, -13452, -15791, -13722, -7366, -682, -799, -3467, -3098, -1731, -8212, -12747, -13902, -12878, -8762, -7228, -9839, -9306, -1016, -1469, -1609, -2713, -8132, -5021, 329, 1989, -3100, -4595, -7795, -10702, 1912, 118, -3933, -3913, -12434, -12612, -16850, -20833, -11680, -7089, -4822, -5649, -6742, -2041, 3326, 5409, -816, -9532, -9135, -9734, -6181, -6202, -13227, -17918, -10817, -6894, -10723, -9917, -5492, -6182, -8226, -8470, -10380, -9233, -7558, -4501, -2844, -5318, -5513, 1234, 2407, 5152, 1520, 693, 5876, 10444, 8271, 8471, 10797, 1813, -6127, -4045, -2809]
7073b809k090j469O740k075k549M178K583k45o558j460k409k586L718M067j60
7058c124Q189J980p59q09L879J377K212N088j944n725j063N29m291j395p245o703
7042i804K045O03J586j657r52n71O377L974L116j36J923j272k313j0271j834m93
7026i679q53L386j159J4674J873l416K13N025j53j898l997j547p149j032j698
7011g410j32K611m502L939J949N839R016P74k099J944r100o835n722j630Q853
6996b505P416K570k139l995J516o136n579m710P750Q448r54R66K422K812l230
6981D652k60l375o684J403l544j065M945L576K603o821k240J744k291P592L575
6966C810n437l725O155J023m3l053R13K223m100m890m20N68J416P815P260l753
$$ y = [-2809, -4899, -6368, 372, -1703, -4252, -74, 2509, 2264, -4294, -5754, -8163, -10749, -7031, -2964, -3124, 5065, 7045, 6286, 5477, 9356, 10733, 12945, 18033, 16089, 10364, 9301, 9830, 5539, 4144, -3101, -9804, -7759, -7156, -5570, -7227, -8179, -8750, -2373, 1601, 4717, 4581, 6504, 5232, 2919, -7352, -9186, -9679, -10532, -7146, -8305, 6369, 8242, 4826, 5039, 10064, 9911, 8013, 4016, 2469, -4680, -5712, -7410, -7542, -4931, -9433, -5494, -3545, 2294, 11310, 12084, 9985, 11929, 2829, -4006, -9728, -11358, -2505, 4911, 7481, 5342, 1347, 2863, -3273, -8852, -13562, -5812, 2636, 1682, 2648, 5070, 7882, 4652, 4392, 1017, -5667, -4264, -7808, -8873, -3928, -352, 2251, -4570, -6810, -5066, -7357, 235, 3810, -1627, -5352, 803, 1826, 1783, -1270, -357, 1866, -2234, -7124, -7544, -6976, -5560, 2255, 9515, 5762]
6950E762j994o245J289Q845m821l633j113k747m607N16L957N410j448m735L638
6935a926J059m058J640O060Q378K852k401j741p460k969l67l418j058Q352L027
6920E970n960j439m53J278K339O365K559j0141l620j489Q709m88Q7L059K158k580
6904F354r148n596L03K931o548j697N697J0668Q373o320j1619K549R011l511l307
6889a860J954j464K413M115l621l265M36k582o689K399J958L296J056J236j650
6874b268K237R39R84o538l93k890m559m87Q591K954r98l004m083p17r16k320L051
6857a0417N737O822J0542J3025K488k148q50o110j1621k055q88k569l144K276
6843A088J436k606q079l914K789M610K683L171O676j796n600N26L207l69M917
$$ y = [5762, 3768, -2477, -1188, 7657, 2836, -797, -1910, -4657, -9264, -8748, -4791, 619, -829, -5564, -1926, -867, -4925, -3285, 2775, 11153, 14005, 11604, 9863, 2403, -566, -933, -4351, -5409, 2943, 5970, 10, -1429, -1882, -604, 1735, 8100, 10659, 518, -3102, -4591, 4118, 3630, 3717, 6776, 8934, 6354, -2794, -8390, -8087, -5156, -11704, -13401, -7704, 2964, 11337, 5017, -6602, -4053, 4958, 1447, -1860, 94, -1370, 1043, 5158, 1537, -1728, -1292, -3874, -10563, -8164, -6206, -2910, -1854, -618, -2268, -31, 908, 1892, -4646, -5039, -7929, -12488, -12975, -4384, -1430, -2428, -5432, -9515, -10232, -11148, -13468, -10417, -4680, 2142, 12684, 25709, 28197, 26049, 25199, 19089, 7468, 5413, 4525, 1956, -1188, 1088, 2524, -82, -8161, -12075, -9286, -4676, -1993, 1178, 7854, 6058, 458, 984, 4191, 3822, 8739]
6828H739J901j247l278m465j450M908r69o523l611j748j68N738J004N44j462P82
6812a305q74n234K233J842o778n800l642l185R870N621J966j2441J75P595P315
6797b642j001m19j84N180j230j573N535O6j891K570M049J12n678r954R216P356
6781I512n767L133q54O53j3478j2643KQ693M242K104K790J771M699q96L087n116
6765A932l138P143O789n347k252o679o551N011M570N806J2893Q310J022m816j0669
6750A4024l490M047O491R54L626Q379l138k834j203J68J242J1258K0366J7047
6736G6937K6263M1613O3240J17527K09348K84077J52464p1509k00073k51763j67393
6725B80731r1872m9384k7921j7686q878o867l707o431n763J627Q95P036J2832
$$ y = [8739, 10640, 9393, 6115, 1650, 200, 5108, 4139, -2384, -5995, -7743, -7911, -2173, -1169, -625, -2087, -1305, -2179, -7413, -5180, -3338, -10116, -15916, -19558, -22743, -12873, -7252, -5286, -17727, -17552, -9957, -2642, -3643, -4062, -4246, 934, -296, -1869, 3666, 3732, 1841, 4411, 8460, 8572, 2894, -7060, 2156, 9512, 3745, 6878, 6024, 6677, -6801, -19444, -19442, -10749, -6507, -4403, -1613, 158, 4857, 3961, 7048, 1932, -1206, 5937, 12726, 7379, 5127, -1552, -8103, -3092, 1478, 7284, 20177, 28487, 29509, 24693, 14024, 10534, 14581, 21072, 22026, 25652, 34031, 30893, 28059, 26856, 27024, 28266, 39524, 59890, 76937, 103200, 144813, 208053, 325580, 534928, 819005, 971469, 899960, 699887, 448124, 280731, 188859, 139475, 111554, 93868, 84990, 78123, 74416, 67985, 62222, 63849, 64744, 71780, 84612]
6712H4612J7770K7872N3622R5231J42241R7009q991o5766j13779r1402o8523n2214
6700A17682k8003j3225j3362j3750m181o060j1826j2186j2130K772O039k582j97
6687H991N321N804l542k189P157m740l750K254k042k159k532n986k739N820N033
6672A0701K194j199j060Q8l159l987o97l518j588N014J522l18J936m440p697r66
6656g174L227P16k244J755l736M705O443l585r592P27q200l676M284N469L488
6641g393j065m411O459j034j600L025R11O85J500L319n3j357O060j20L330k039
6625F217k41m144p72N298N101Q51o862j5199o290J139j069j561J12J4111O502
6610C193l823n769k873O81P597N779k941j271R21k007j360m436K907O046k489
$$ y = [84612, 102382, 130254, 183876, 279107, 421348, 518357, 509366, 443600, 329821, 238419, 169896, 117682, 89679, 76454, 63092, 49342, 45161, 39101, 27275, 15089, 2959, 5731, 11770, 9188, 8991, 14312, 20116, 16574, 14385, 21542, 16802, 13052, 15306, 13264, 11105, 8573, 2587, -152, 5668, 10701, 12895, 11696, 10636, 10724, 7565, 3578, 2881, -637, -2225, 2789, 4311, 3993, 5929, 1489, -6208, -7174, -3947, -3231, -5475, -3720, -7456, -2751, 3692, 107, -9485, -8758, -16958, -20634, -16350, -10881, -7393, -8458, -12869, -6410, -7444, -9044, -6019, -5108, -4423, -2923, 396, 343, -1014, 5046, 4926, 8256, 6217, 5976, 1832, 1060, 6358, 11459, 12310, 5448, -9751, -16041, -14902, -15971, -17532, -17420, -3309, 3193, -630, -6399, -9272, -8591, -994, 4785, 1844, 573, 1494, -513, -1873, -6309, -3402, 2644, 155]
6595A55L987n747r967j16L966J973L126k328l079K559J594l071k894P140j199
6580c901J899K870K002j138n978m550J864N503l105J066j937M82J775J66k910
6565e892j433L363R6m524J363O352K462k117K048l15k12N07k070j438M069o894
6549d635j777J788K246j231m188n036l66O65L384K072N343K183n75p585k319M190
6533e841J184k05l53P267m676j646J11m325N084L096m344r17q12j871l338K6K897
6516h663K958J807k646J603J209l443o62l84L664m31j090J456P83k124j356Q661
6500A342N76L279P764L727q192j1246J00j484m904n07O46R60n240K263L145L951
6484c820L060L323k604O388m373j66N177l43j289o649o400Q59m163K599J246K023
$$ y = [155, 4142, -1605, -11572, -11688, -7722, -5749, -2623, -4951, -8030, -5471, -3877, -6948, -9842, -2702, -3901, -2002, 868, 2870, 1732, -4246, -8796, -6932, -1429, -4534, -3468, -5405, -4923, -3148, -2982, -5892, -7325, -3962, -3866, -8390, -7027, -675, 1787, -330, 1718, 1403, 1191, 1698, -372, -1810, 2259, -4635, -6412, -4624, -2378, -3609, -7797, -12833, -13199, -12534, -9150, -7078, -1735, 448, -127, -7712, -10031, -5841, -4657, -4862, -5215, 2052, -2624, -4270, -4159, -8484, -3400, -304, -4648, -5565, -6377, -8248, -11586, -11560, -8663, -5705, -3898, -6544, -4941, -3732, -7175, -7837, -8221, -4557, -4988, -6078, -4622, -3839, -5963, -7319, 1342, 1918, 5197, 12961, 16688, 8496, -2750, -2650, -4134, -9038, -9545, -8899, -7939, -13179, -10916, -7771, -3820, -760, 2563, -41, 6347, 1974, 1808, 6985, 6642, 5353, -1296, -7696, -6837, -11000, -8401, -7155, -5132]
6468e132O340n432p281k184M69k872K337P6P542N850K207L605J37o169O23J456
6452A572m99K656m209m918n011M088L032M048K371K360j257j142l677r9M295j551
6436B059l695k080l323p30R934l129k372J341J525N432j161l230n593n37M845
6421g14j995m805n592l143P92Q158R671m99k178j130m68o630j296O160R24O039
6405C294K375q109k512L019k431k769M6l823L750J3240K119p140j49l932m527
6390g549k925M317J565j223K768L481o095j341m609j713R539R67j0577K269M834
6375f292j046J487j492o17L180L872P266O499M83J426j853k426j621j843l052
6360C971m027j201l44m836J616K801M208J909Q6q29m881k207p56N129O376m236
$$ y = [-5132, 1208, -4224, -11505, -13689, -13220, -16092, -13755, -13679, -6137, -287, 1920, 5525, 5662, -507, 116, 1572, 1073, 3729, -480, -5398, -10409, -6321, -3289, 759, 3130, 5490, 4233, 3091, -586, -685, 3610, 2059, -1636, -3716, -7039, -7769, 2165, -964, -3336, -1995, -470, 4962, 3801, 571, -5022, -5559, -714, -2709, -7514, -13106, -16249, -15457, -7299, 2372, 1873, -305, -1435, -1903, -8533, -9829, -3669, -2745, 3294, 5669, -2440, -4952, -1933, -4364, -7133, -7087, -10910, -7160, 6080, 8199, 1059, 910, -3022, -7549, -10474, -6157, -4592, -5815, -3047, 434, -5661, -7002, -11611, -13324, -3785, -2818, -13395, -11126, -6292, -7338, -5851, -7343, -7960, -4780, -908, 6358, 12857, 13340, 14766, 12913, 10487, 8866, 7023, 3971, -56, -1257, -1601, -6437, -4821, -2020, 2188, 4097, 4183, 3354, -1527, -3734, -4490, 639, 7015, 2779]
6344B779j676M212k740n028j796l76l760K375M33l88O0L947l383m003M080K789
6328b475K475k602N874L225n992k508n478m752O25j582j231O975J910k596L400
6313d732l12K542K935M954N080j472K043p791j0535l94O191K206K898l051R25
6298A487k256J043O549K166n983J23N891N313o798K74k82o685m228l724m6M286
6282b870l400j439N013K119p42J070R81o063M37J773k832j0287J771N619K912
6267e938K913l511k497k14j710Q483N286l936j982M96o68l955j82O645J474l762
6251c058m627K789L193K076j894j040j527N332l75k908l074L331K484j241K00
6236c39o209p466L946K977l554Q21j133K886N106n201L35M867l287p239K925J660
$$ y = [2779, 1103, 5315, 2575, -2453, -4249, -4625, -8385, -6010, -5577, -5965, -5905, -1958, -5341, -9344, -5264, -2475, 0, -2602, 3272, 6497, 505, -2003, -7481, -12233, -11608, -13190, -14421, -7446, -5536, -8132, -4732, -5044, -2502, 433, 5387, 10467, 8995, 11038, 3247, -7288, -7682, -1491, 715, 3613, 562, 1487, -769, 274, 6823, 8989, 3006, 3129, 9020, 14333, 7535, 7809, 7527, 842, -3386, -7110, -7156, -2870, -6270, -7709, -2696, -577, -1319, -249, 732, -5331, -4894, -3121, -5953, -16240, -14469, -8850, -5938, -3025, -6536, -9033, -9247, -10957, -2474, 2812, -1124, -3106, -2610, -3278, -7233, -7415, -770, 704, -3058, -7685, -4896, -1703, 373, -1521, -2561, -4088, 1244, 869, -2039, -5113, -1782, 702, -539, -339, -6548, -14014, -10068, -7091, -10645, -9824, -10957, -8071, -2965, -8166, -7831, -2964, -6251, -13490, -10565, -8905]
6220h905P06o03k489m568K498L855N028O52k669o206l101L609K249P318j834O98
6204c762M675L951m168J276p086j449J40Q12K515P041K453r614n315K86K40K165
6188e840O95k891P404J791Q75O865N47k131q472j474M507M315O179O85l111l749
6172F195m106q256k428J855K496K22m534L681K41N07l123M118M810J004l225k678
6156c221m375M721M332Rq95J433k098k598K578n647j958O386J2587p57p057L028
6140F468K072m616N91L37n934n872M285R519m414o054q953q151L785P014K613
6125g310N713j580n095L95l235Q112N117K499K062L910M810J107L432k585j0180
6110G172o521M937O634m038o926R65r26m383k536n270n023N986L647M493k155
$$ y = [-8905, -8199, -8802, -11291, -15859, -13361, -9506, -4478, -3826, -6495, -12701, -15802, -12193, -9944, -2626, -4460, -3762, 913, 4864, 696, 1972, -5114, -6563, -6423, -5611, -3096, 3945, 6398, -3216, -8531, -8245, -8005, -5840, -5145, -8036, -632, 1159, 2034, 8899, 9446, 7315, -1157, -2631, 1876, 6191, 12370, 13055, 9944, 6195, 2089, -6167, -8595, -6740, -4244, -4022, -8556, -4875, -4634, -4127, -7250, -3132, 1678, 2682, -543, -3221, -7596, -2875, 1457, 1466, 571, 2004, -94, -2692, -114, -5761, -7719, -1333, 11254, 10497, 3440, 6468, 8540, 3924, 4515, 4852, -1082, -6954, -2669, 6850, 2436, -3618, -12571, -20722, -16937, -9923, -7310, -1597, -3177, -8272, -7877, -11112, -3000, 2117, 4616, 6678, 10588, 15398, 16505, 19937, 17352, 7172, 651, 5588, 12222, 8184, 1258, 2223, 1297, -3086, -5622, -10892, -15915, -9929, -6282, -1789, -3944]
6095c944m613k363k639J698O400J218k359M207o904P12O199j502M34O932M151
6080G627o758r44K193l201j306m992O41l352r602R45P208R867j196L791l079N468
6064C310J450o00Q61j157J450J495n245q802m540K907N510M625j0520n370K219
6049a2407N180j805k536J907R515L715l226J72K721L93p105r073n374q96k873
6034b1692J387O054J959R340K885j840P66K005L623j945m960j771J491M381P628
6019I311o782p929K72p71p965m420k118Q35M438P472O857K150L523M868q337n042
6003c638j709k469k613M498J671k006K830J281N708p615k424M505L588j432J274
5988A449r175q023j074K635j021L699o837M465L741O855M852m283n0n005o725
$$ y = [-3944, -8557, -10920, -13559, -11861, -5461, -4243, -6602, -2395, -9299, -8587, -2388, -3890, -3456, 3476, 7627, 869, -75, 2118, -1083, -2389, -7381, -6740, -10092, -19694, -18749, -11541, -1674, -2870, 921, -2158, 3310, 4760, 4160, 5021, 3864, 5314, 6809, 1564, -7238, -11778, -8871, -3361, 1264, -9256, -14626, -12407, -7227, -9032, -11568, -9661, -146, 3569, 343, 515, 3236, 3629, -3476, -12549, -17923, -18819, -21692, -20305, -14251, -12292, -2952, -67, -1907, -1141, 864, 4487, 2542, -2418, -4189, -2698, 1683, 9311, 2529, -5400, -5128, -5899, -13864, -18284, -20402, -19567, -15129, -7657, -800, 1350, 4873, 9741, 1404, -3638, -5347, -7816, -10429, -5931, -4260, -6266, -3436, -2155, 3553, -4062, -6486, -1981, 1607, 175, 1449, -7726, -15749, -16823, -14188, -15209, -11510, -18347, -13882, -10141, -3286, 1566, -2717, -2767, -7772, -14497]
5973a4497M60M847O020L552r440j118N694K845k592K616k828l975J1m950J009
5958a2346M631J670m06L229K603l82n938J63M386j499J963P241K691K658n392
5943E272o699o97l478o364L725M578K463J815K186l237m465n43M25L515k709M732
5927E19N915J89K036J724n648o791k637J290l420Q60L026J959k896k308R84J114
5911d084J062N667l65p383O858O696j321l925N79p742j1270J057O439K846o46
5896e532o35L97m805o776Q77N2N139O469L708M71P37J478K48j924n679l028L303
5879e500Q036O199q901q199J540j551n419M051M209l290J141M058R822j688q606
5864d098q361P266M409L533k197m917n06L915R40L0K665n235L593N563j645n833
$$ y = [-14497, -14037, -9190, -3170, 382, -9058, -10176, -4482, -1637, -4229, -1613, -4441, -8416, -8405, -13355, -12346, -7715, -6045, -6451, -3222, -619, -1001, -6939, -6776, -2390, -3889, -1926, 5315, 8006, 10664, 5272, -1427, -2124, -5602, -11966, -8241, -3663, -1200, 615, 2801, -436, -4901, -5444, -5019, -1504, -4213, 519, 6434, 6623, 8659, 10383, 4735, -2056, -4693, -3403, -6823, -5963, -2937, -978, -3874, -6182, -5198, -4084, -3022, 2645, 2280, -5103, 1755, 8451, 7130, 3205, 3784, -3958, -15228, -14171, -7732, -4886, -5532, -6167, -5770, -10575, -17351, -16474, -16422, -11283, -4814, -1106, -635, 102, 1580, 1828, -96, -5775, -8803, -5500, 2536, 8735, -166, -8365, -6825, -8376, -13795, -9744, -5535, -8825, -7684, -3626, 6196, 4508, -4098, -12459, -5193, -784, 2749, 552, -4365, -4871, -956, -16, 14, 2679, -2556, 1037, 6600, 4955, -878]
5848h78l090n048j590o8k698Q03k286Q803J0303L476m519N75j05l399k189q1R15
5831a076J557N500K935J383M31r89n984j789L477j507l715J998M363m78l504m644
5815b042J874P9j843q115l81J797j309L396Q854j133k542k721J003J411K643m674
5799c703q028j167N661J176J0213O753j186r991J136r87k525k508n61k37J074
5784d880L472k376L354L586Q21k117n875k836J798O177J270N80j191o962L145
5769b034R049o794Q15N85l339p878j045K124P156O879m733K55n982J477K538n47
5753a474j528o89Q915m07o790m079j264K260k6l880J214L423k9k441J429N23j797
5736f640p302n64L65L519N160L697K890j861l960L56R042M05p173n896r15n102
$$ y = [-878, -3968, -9016, -10606, -10674, -13372, -12569, -14855, -6052, 4251, 7727, 3208, 3783, 3678, 279, -1910, -1991, -1076, 481, 5981, 8916, 10299, 10730, 9741, 3757, 1968, 5445, 3938, 223, 2221, 6584, 6106, 2602, -2042, -168, -89, -1932, -10047, -10428, -8631, -9940, -6544, 2310, 1177, -1365, -4086, -3083, -1672, 971, -3703, -11731, -12898, -7237, -6061, 4152, 10905, 9719, -272, 864, -123, -2648, -5156, -5717, -5954, -4880, -1408, -3784, -430, 3156, 3977, 1860, -4015, -6851, -5053, 1124, 2394, 2974, 1783, -5179, -2034, 7015, 221, 1036, 1621, -1718, -9596, -10641, -8517, -1361, 5518, 785, 1040, -4942, -3465, -927, -1474, -3002, -3691, 5224, 4817, -1973, -6052, -7316, -5056, -5082, -8962, -7748, -4325, -4354, -6795, -5366, -4843, -6640, -13942, -14506, -14141, -10622, -5462, -1765, 1125, -736, -4696, -4340, 4702, 5107, -2066, -7962, -8877, -13979]
5720a3979m65K734k513j463J718N605P534K413l542m155q995N564J560o094M074
5705a0004K439K824J700l258k555l780p620J136N067J0171N744M419m446o609
5691d772j23L856n243m525K357o637j676j412L444P323L881J110k035K817j131
5676b766J808K414M577k847K484l98K860J870o55J965N78P0n810m300r39J847
5660B758k747k358k082o46J1587L606l379l911J313n75n181P94n023p131L672
5645i303J793q65l085M356O404J081m943k25J270m023l365Q28Q758O765j62n260
5629B4M427N09m632q757l281J912k28o68r2M778Q370L747K089P541q867r232m734
5612g094R94J462j594k045M113K447k068N721q11k207l631O0j232J285J151j441
$$ y = [-13979, -14444, -11710, -14223, -15686, -13968, -8363, -829, 1584, -1958, -6113, -15108, -9544, -7984, -14078, -10004, -7565, -4741, -3041, -6299, -8854, -12634, -20254, -19118, -14051, -3880, 1864, 6283, 1837, -4772, -4895, -1039, -6282, -10807, -8450, -15087, -16763, -18175, -14731, -7408, -3527, -2417, -4452, -1635, -2766, -958, 1456, 6033, 3186, 5670, 5272, 8132, 10002, 9347, 11312, 11890, 11960, 6150, 1850, 911, 2758, 11, -2347, -4429, -5075, 6512, 10118, 6739, 2828, 4141, 3566, -1615, -821, -5844, -12975, -9303, -7510, -8375, -11460, -7104, -700, 381, -4562, -4787, -3517, -7540, -10905, -10077, -1319, 5446, 5284, 24, 4451, 4960, 328, -8429, -11710, -9798, -10026, -10694, -10786, -6008, 2362, 6109, 8198, 15739, 6872, -2360, -7094, -6100, -4638, -6232, -8277, -4164, -1717, -3785, 1936, 1125, -1082, -4713, -4653, -5885, -4600, -3449, -4890]
5596d890O09j288k426J104Q93O085K251j469k448k791N51P110R763n99l080j521
5580G854m309k636n666j814l503o138M254j213J835m242K781k05j820Q282O77
5565e863K254j209J094N591l874p808l482O920P197q7M487K223k665n02J706k277
5549C705N5K318j221n70L185L080J900n504o049L18j434r38K081n819l012p62
5533h667J0114L616q70M068k371j624k000P900K479j2879o283Q43Q106K969j652
5518C749j446n57k03M769M508j494n411K744J107J18M00l394q119K647J639K911
5502C968m457o751m140j669N169J0252N323r861m084n366m749N863O495l181P709
5487E21L631k95n01K024L913l972j038J513l520m663j043j840K463L588k283K79
$$ y = [-4890, -4281, -5569, -7995, -6891, -5998, 87, 2338, 869, -1579, -4370, -3819, 3291, 13054, 12455, 9375, 7854, 3545, 909, -4757, -6571, -10074, -16212, -11958, -13171, -11336, -15578, -12797, -13002, -14822, -6540, -5863, -3609, -4818, -3724, 1867, -2007, -9815, -13297, -6377, 820, 733, 5220, 7443, 4778, 4276, 5982, 3705, 3760, 6078, 4857, 4287, 7472, 10552, 12452, 6948, 899, 1217, -217, -1155, 926, -4893, -7905, -8667, 1447, 5063, 4193, 8261, 5890, 4266, 2266, 10166, 12645, -234, -6517, -5674, 2432, 5401, 3749, 2303, 1746, 1543, 6312, 10820, 9326, 3915, 6659, 7766, 7884, 8284, 4890, -3229, -582, 1057, 3968, -489, -7240, -11380, -13049, -7880, 2372, 7695, -2166, -6250, -11616, -16365, -10502, -4007, -7188, 521, 4152, 3857, 3356, 5380, 9293, 5321, 4283, 5796, 2276, -2387, -3430, -5270, -2807, 781, -1502, -1223]
5471a223M929l130P19O68J289j653p276l102M071k856L586O176l789l943k878
5456h412J538n68n14K025j061J804J796r18N179R24L858j127m928L876j283n367
5440c178n495O70M708K876P568M87o721Q81M553N839J202m114n584j694O160j429
5424F729j0082j471J575k284j147n21L305m98l283J354k923p663K080M944J0065
5409A80J303J164p618m532N06J046k744M744O230k110Q45r03Q181K739m336j2627
5393g932p455J911O020M002q356j840k451l214L813J0221P387K945J033J188l457
5378C815k325m691m0K392L983L983k764o748m90N415K36J994J051M131m572j2065
5362f695J639l53l923M348m647Q050O60l29q34m444l81n221L088K376K996J745
$$ y = [-1223, 3706, 576, 1295, 1963, 3252, 1599, -5677, -8779, -4708, -7564, -3978, 2198, -1591, -5534, -8412, -6874, -7442, -7956, -5931, -6992, -5188, -3392, -4310, 869, 1793, 5651, 4524, -404, 3472, 2189, -3178, -8673, -8003, -3295, -419, 7149, 7636, 915, 1796, 6349, 12188, 13390, 9276, 3692, 1998, 8158, 6729, -3353, -4824, -3249, -5533, -6680, -7201, -3896, -4394, -7677, -6323, -9246, -16909, -14829, -9885, 180, 1483, 2647, -4971, -9503, -8997, -7951, -10695, -5951, 279, -1831, -986, -1889, 6292, 9031, 4695, -7932, -15387, -13476, -7456, -3454, -11810, -13650, -16101, -19315, -15502, -5281, 2106, 5051, 6084, 7272, 3815, 1490, -3201, -3241, -849, 3134, 7117, 4353, -2395, -2885, 2530, 2766, 4760, 5811, 9942, 5370, -6695, -5056, -5409, -9332, -4984, -9631, -1581, -921, -1250, -2084, -6528, -6909, -12130, -9042, -6666, -3670, -1925]
5346a925o23J132L151J169l990M941M986j326j188r440k887M713k117m246k362
5331a0012k322j856M489Q285j159k66m410j1K509N16M601k677J452l676J390N824
5315B677R80l291k328J154k091r6n89j902K6M133M292O4o207L097l791k006P181
5298A303N185K08m713j2009o97j73l888N63M828R864Q796K976n402m602L936k424
5282C751J610p413o597l169r60j835k265r04K46J1872J4970Q00l596k987n161
5267a638J692N145r27o433K41K130J036O468P97R963m422r439n440m999k027J574
5251f279J013M82l111j188k376L549m65L062L609N576q27n272m092l566M926L513
5235a446r574k987O225Q4L144j757o645k619M229O018o23J707M317J472m442k077
$$ y = [-1925, -2548, -1416, 1735, 2904, -1086, 3855, 8841, 7515, 6327, -3113, -6000, -1287, -3404, -7650, -10012, -12334, -14190, -9701, -1416, -2575, -2841, -7251, -7262, -4753, -4237, 364, -2313, -861, -4537, -3147, 2677, 3657, 366, -1962, -808, -2899, -2995, -3584, -5486, -5460, -1327, 2965, 3029, -3178, -81, -3872, -5878, 1303, 6488, 6696, 1983, -10026, -10723, -10896, -14784, -14221, -9393, 471, 9267, 12243, 6841, 2239, 6175, 3751, 5361, -2052, -8649, -11818, -12778, -14613, -16878, -17782, -17536, -5664, 9306, 10106, 6510, 3523, -1638, 54, 5199, 4272, -2161, -1920, 210, 1246, 7714, 8511, 18474, 14052, 4613, -827, -5826, -7853, -6279, -5266, -4784, -7895, -9083, -11459, -7910, -8375, -5313, -1704, 3872, 3045, -2227, -6319, -9885, -4959, -1446, -11020, -14007, -7782, -7698, -4554, -6311, -12956, -15575, -11346, -5328, -5951, -4244, 73, 1545, -2897, -4974]
5219d974M256n96M86P514m686n150PP162N640m821m846k573K247J37J186L963
5203D952j482K144o798p413K178J350k974J888L146P40N170J864k944J837k573
5188A085o490k459N050L785K58L3p009m672N94N212J004k095J887M451K547n946
5172b765m119J634K666P463M236r35K57M163R46o448q169j153K048j014l105J356
5156b939L0L135R31q99K39L722O79r434k603N766N10j242r353k924k022J4k319
5139a8709M385M896M54K994Q493O577j280m027j091J144J073p095k666L929j52
5124a075J425j51l82J88l504k634J602M778n33m351j414P608P119l566M112k497
5108F725m028N750Q68m725m429m268K283m39p133m10Q17K6J629k9K180M035M087
$$ y = [-4974, -718, -1314, -828, 6686, 2000, -3150, -3143, 4019, 9659, 4838, -8, -2581, -334, -197, 989, 4952, 3470, 5614, -1184, -8597, -6419, -5069, -8043, -6155, -3009, -2269, 2901, 4765, 1821, 3658, 1085, -5405, -7864, -2814, 971, 1229, 1262, -5747, -10419, -9825, -4613, -3609, -5704, -3817, 634, 3181, -2765, -6884, -5250, -2584, 4879, 9115, 8180, 8437, 12600, 13546, 7098, -1071, -2224, -176, -1190, -4295, -2939, -2909, 226, 1157, 258, 497, 4219, 4898, -4536, -7139, -1373, -863, -2105, -11458, -14382, -16404, -16390, -18709, -14324, -9428, -8974, -5980, 2513, 9090, 7810, 3783, 2692, 3836, 4909, -2186, -4852, -923, -1075, 350, 199, -183, 5, -3499, -6133, -4531, 247, -286, -4637, -6051, 1557, 8676, 5110, 9222, 6725, 2697, 8447, 9315, 4590, 161, -4107, -1824, -2263, -9396, -9806, -8989, -8963, -7334, -7363, -5183, -1148, 2939]
5091B939o4k929k840K194n854q261k557J582O584j095j48P506J0541j601l383
5076B614n625K511L03o649R48N098K266k252l953O386L540j327k830k480J561
5061A11Q807P210l013m528k609o675p102k046k596p88M351L031k220K716R077
5046C726J229q76K28J988l306p368j2M714j929k588J958L104k952k976j328N504
5030h84m444N69L540L168K679L65o821k227j068O387p14n766K182L0m907k60J071
5013g100l309k89m002j911m093N412N378O568Q388J587l596L2o79n105k96k332
4997e347l226p379L638R935N822N654m885K625J697K991m215l259j878L445J668
4982G286K946L42n183m934J679k553K579J089j728p120K592j876q8j753P710N33
$$ y = [2939, 2875, -54, -2894, -700, -6554, -14815, -17372, -15790, -9206, -10301, -10449, -2943, 7598, 5997, 2614, -3011, -500, -197, -6846, -5898, -800, 1466, -786, -4739, 1647, 5187, 3860, 1030, -1450, 111, 8918, 16128, 13115, 8587, 5978, -697, -7799, -9845, -12441, -13229, -8878, -5847, -8067, -5351, 3726, 4955, 4079, 4307, 6295, 2989, -4379, -4391, 323, -1606, -4194, -2236, 868, -2084, -5060, -6388, -884, -5328, -4759, -1219, 1949, 4628, 4993, -1828, -4055, -5123, 1264, 550, -5216, -3034, -3004, -7911, -8171, -7100, -10409, -10698, -14700, -16611, -20704, -15292, -9914, -3346, 5042, 6629, 3033, 3065, 2386, -2719, -3015, -5347, -8573, -15952, -12314, -2379, 3443, 9097, 4212, 6837, 8534, 11525, 7310, 4051, 2173, 5618, 7286, 10232, 10574, 5391, 457, 2136, -417, 2162, 3251, 1523, -5597, -3005, -4881, -4969, -6722, 988, 1521]
4966A521K132k04j1653n718L698J0257K117o359j605J819n213L123p28L250L884
4951C21k903k895J37k431j268N89l538r6K663J398m82m43L405L99r64l749j134
4934a0991n4K161Q56N941L697q844q78K667J929J353J870j285k170j91J1026k676
4918D411j2401n36O367P313M990r476r135n253o317l325K801q83q22N618N450
4903a1198J313R686M668l606M486l376n159k601j273J156j763K154Q079l33J78
4888B411k538r351P4Q52K934j442p040L487J2657j841l256j0072O49R793M152
4873A469p787l734K905M754O493k500n391M284o237l865n079K4M222M907N683
4858A48j118j472L422r44o993l281K88L818M431J00k225K27L892O33p226j815
$$ y = [1521, 3653, 3449, -8204, -13922, -10224, 33, 2150, -4209, -5814, -3995, -9208, -6085, -6813, -3563, 321, -2582, -5477, -5340, -7771, -9039, -8450, -11988, -12084, -9421, -8023, -8505, -8948, -5543, -5144, -6108, -9857, -10991, -11045, -8884, -8028, -2087, 1610, -7234, -8112, -5445, -3516, -2163, -293, -1578, -3748, -3939, 7087, 4411, -7990, -8526, -2159, 5154, 10144, 668, -8467, -13720, -20037, -23362, -20561, -21444, -22266, -16648, -11198, -9885, -199, 4469, 863, 5349, 1973, -3186, -5787, -7060, -5904, -7667, -5513, 2566, 2233, 2411, -127, -9478, -9404, -8552, -5618, -7060, -14100, -10613, 2044, 203, -3053, -13125, -12476, -2683, 1469, -6318, -10052, -7147, -2393, 4100, 1600, -3791, 493, -5744, -9609, -14688, -14664, -10442, -5535, 148, -970, -2442, 980, 36, -6957, -10238, -9950, -6132, -1701, -1601, -3826, -3599, 293, 926, -6300, -8115]
4842h115p6L811j040N785P685j716j215l413m073M124M794j007j334r34q92O302
4826H686l512o085j027j912K860J944o688M031O161N099K612l332N47K808J085
4811A3277q253p020j378O01J193M030L06k614m645o991m975L821K446k05K417
4796g990K959M853o88M839R37o550o623k388l943K857N806Q39J219M889o462k394
4780g840L640O735K300k824l762o342o65L731J19J0291N057K858O742o884j0661
4765B495j49J603L37j358m235L925m706j1932o058Q381J655J160J0345P073k328
4750F208k998N333J932p583q022l426k170L901N27K8J308J065O612N44m045m051
4734d837j052l84m660O109N853P56K925K579m458q94N99k884q191o023N13P489
$$ y = [-8115, -8191, -4380, -5420, 365, 8050, 6334, 5119, 1706, -2367, 1757, 6551, 5544, 4210, 3276, 2384, 8686, 5174, -911, -1938, -3850, -990, 954, -5734, -1703, 4458, 9557, 12169, 8837, 9384, 12192, 13277, 5024, -1996, -3374, -2773, -1580, 2450, 2756, 142, -4503, -11494, -16469, -12648, -10202, -10407, -7990, -5031, -178, -866, 3973, 4910, -1640, -8263, -10651, -14594, -11737, -5931, -5092, -3873, 1016, -5446, -7840, -4200, 2535, 4835, 2011, -1751, -8093, -8758, -5027, -4908, 5383, 10440, 13298, 20040, 13156, 2495, 2346, 3949, 4286, 2928, -1307, 2618, -2088, -14020, -20078, -11697, -10042, -8882, 1463, 8536, 6208, 3210, 8543, 10475, 2892, -5130, -8556, -10726, -6825, -6298, -6270, -4962, -3897, 2715, 3259, -786, -4837, -5889, -6273, -10933, -4824, 1029, 1785, 4710, 7289, 2831, 1937, 2536, -348, -8539, -14562, -14049, -6560]
4718f560Q353J2997l89j0691m900l778r45O55q461k102J1892Q146p651k048n743
4703a1225K11P666O50n53M506m486l60k3j223n364M029J910q0M042Q02n502J440
4686c560N285K241k089J334j0900n922N456M581L544l398J154P907K826o056l16
4671B087k087M968Q04J219k06r842K131q38k049K929k709n805k957K315J0787
4656G47j57j025o31j782N79l739J902M628Q87k359k60m804n825q209N415K1O985
4639g627Q656J309J375N94m748k843j207k133R92J171K214k241J075r13n541o455
4623a6322R146R336l812j166p24q913O742P115M016n260j010k273m356l830l901
4608a5212N781N056N161o995p332N553M769J416K103M22k725M66M76K677J232
$$ y = [-6560, 1793, 14790, 14401, 3710, -1190, -4968, -5913, -5258, -13719, -15821, -3929, 4217, -3434, -5482, -11225, -11014, -3348, -2698, -3251, 1255, -3231, -3591, -3614, -4837, -10201, -6172, -4262, -4342, -300, 502, -5000, -3560, 1725, 3966, 1877, 3211, -7689, -13611, -8155, -3574, -30, -3428, -2274, 5633, 8459, 2403, 2087, 0, 4968, 5772, 6991, 6785, -3057, -926, -1764, -3813, -884, -3593, -9398, -12355, -10040, 747, 590, -435, -1066, -2848, -2269, -6008, -4106, 522, 1409, -950, -1210, -6014, -11839, -20048, -14633, -14612, -7627, 1029, 2338, 3713, 4307, -441, -3284, -4491, -6624, -5632, -4461, -2247, -4488, -3413, -4326, -9867, -16322, -7176, 2160, -1652, -2818, -3542, -12455, -5713, 1402, 5418, 158, -852, -3125, -7481, -11311, -15212, -9431, -4375, 786, -6209, -13541, -7988, -3219, -1803, 300, 722, -2003, -1537, -1061, 1616, 2848]
4593B848N304k481o392l718R44K336M350L890q042m890J5666M360o046l803q814
4578d488l207K405J801K056N525K603j1400k300J7674Q682N137n097j0068L145
4564A2468J2031R40r543j6233m070J1860n029j2591j087K865J498n24l207N077
4550e545J3861J440p622r333r56J895M12M414O232j760p175J695o8j139J934O443
4534D728O059j42j976m420p025o219l822n21K992K596j484N400P684O727l347
4519G230p930L152k507R51p248j991K817R037J486j1606m196L8O440R013K294
4504F980O323L883m742m595j178J181j056m091j447q01j73l61J546N340l705l44
4488B760N973k295o867K62j006J715J484K5M190K638p306n831P096Q841k842n03
$$ y = [2848, 8152, 5671, -721, -4439, -3495, -1159, 3191, 7081, -961, -5851, 9815, 14175, 8129, 4326, -4488, -7695, -5290, -3489, -1433, 4092, 6695, -4705, -7005, 10669, 19351, 24488, 19391, 9323, 12468, 24499, 25439, 15896, -337, -4407, 7453, 2424, -10167, -11254, -8389, -6891, -7415, -10622, -5545, 8316, 9756, 2134, -7199, -8155, -6260, -5848, -1434, 4798, 3038, -4137, -2442, -2510, -3649, -1715, 4728, 10787, 10645, 8669, 4249, -2776, -8995, -12817, -13338, -10346, -7750, -9234, -3834, 3850, 10577, 7230, -700, 2452, -55, 896, -6352, -8343, -5526, 3511, 4997, -6609, -10805, -10767, -4327, 4686, 6980, 13303, 17186, 12444, 7849, 6671, 7852, 6796, 2705, 1258, 457, 284, -77, 1469, 6809, 3104, 2760, 8733, 6438, -429, -167, -1173, 542, 2026, 2051, 6241, 8879, 1573, -4258, 2838, 11679, 8837, 8334]
4472H334j494m374o838k779K369M509o679m576M338L273L666K74k71J286k524
4457a486m952r4O250l515N764M011m478o16m511j88K218M204J43j947l659k588
4441e444k875j554N632M759j8J342l00l642l38K689m58K725K654j284n130K535
4425A293n409M694Q172n020m464M148M64o705j929M373N109K144k285k497j812
4410B76J378k251k045l95J270J095L479K701j220l203k530J947k470l21l263j977
4394g529o062p643J426M300P287J0694P535m929p067k871l515q82l753L637R031
4379c41r0k686L284m102K792n21k010K792K00l475j811j554K55K564N12N801L143
4362D753o50l886l531l28J638M236L235L47j68k750j543m26Q519N413J787m877
$$ y = [8334, 6840, 2466, -4372, -7151, -4782, -273, -6952, -11528, -7190, -3917, -251, 23, -248, 1038, -1486, -6438, -6532, -282, -3797, 1967, 5978, 1500, 884, -3627, -3815, -1597, 2607, 2750, 803, -2856, -5444, -8319, -9873, -4241, 518, 500, 1842, 1542, -2100, -2438, 251, -207, 2518, 5172, 3888, -1242, 1293, -4116, 578, 8750, 3730, -734, 3414, 3878, -2827, -4756, -383, 4726, 6870, 4585, 2088, 276, 1654, -597, -2642, -3037, -1767, -672, 2807, 5508, 4288, 1085, -1445, 502, -1968, -2289, -5552, -7529, -13591, -21234, -19808, -15508, -8221, 2473, 10008, 5079, -1988, -4859, -8374, -9256, -13009, -9372, -341, -431, -3117, 167, -3935, -1143, -1664, -3674, -882, -682, -4157, -5968, -7522, -7267, -4703, -4191, 1610, 4753, 4103, 217, -3314, -3642, -2004, 2232, 5467, 5814, 5646, 2896, 1353, 927, 9446, 14859, 16646, 11769]
4346A1769kL26n314k728L333m992n344L752J180M410J799K834J18j0498q32k669
4330b858k992l414m236M04J2793Q588k795K617j227q516q598Q13P204M041K009
4315C833n28K219n106k629Q11o181j457K885N942l35L03J771J223m326o637Q306
4299I4N503n338q41j157L51q18n805n801N393R018m557N99J394j814n855L98M74
4282h762L12Q816M00q197j445O986o522k352L820K61J892j497J363l707j200J030
4266h802o91m644m43N335j574J910N851L94l150J154j705l161K371M77k610m433
4250a3721P555L788J892M060N42k106N680p24R31m445m270r18m775o48Q701k141
4234e99n943l307J821K436K484L095M466k856j809K88l114j1082o719Q187P949
$$ y = [11769, 11767, 12093, 6779, 4051, 7384, 2392, -2952, 800, 1980, 6390, 8189, 11023, 11141, 643, -189, -2858, -5850, -9264, -13500, -13096, -303, 8285, 5490, 8107, 6880, -1636, -10234, -9421, -2217, 1824, 3833, 3305, 5524, 418, -2211, -1400, -7581, -9038, -6153, -211, -546, -243, 1528, 2751, -1575, -8212, 94, 5597, 259, -582, -1739, -1388, -2206, -8011, -13812, -8419, 599, -3958, -3359, -1965, -3779, -9634, -9236, -8762, -8450, 366, 766, -7431, -8876, -1890, -8412, -10764, -6944, -6683, -4791, -6288, -4925, -8632, -9832, -8802, -9493, -14137, -14580, -9245, -10819, -8909, -3058, -2664, -5814, -4660, -6365, -9526, -7155, -6678, -9288, -13721, -6166, -2378, -486, 3574, 4116, 2010, 7690, 6966, 7897, 3452, -818, -1736, -6511, -7159, 1542, -599, -6542, -9849, -8028, -5592, -3108, -13, 4453, 1597, -212, 76, -3038, -14120, -20839, -12652, -4703]
4219d703O8k942Q174n76M493j738l520K446l435n797J394J625K048M373L464l41
4203E033m712j424l023J220P345M519l526J023l926j038n837L16L826K94J188
4188A278j478J821l160l745j032j870J2117O390L606L425m008l706j2239J377
4174a224K179k701N099n888o920K633Q183L371k94l814m017j007M719M296k095
4159B520q73k865P79Q21k147K899J53N519p51o447q722K231J054j712k88L595
4143d234l50l784o007R59j040p67N414J322K386J76q46O767j733l999o377m411
4127a6524n76J1201j372n60j861j9J0369J026Q52L436m382k027O734J616l964
4112C949r467j939p95N8k36l111N042m725n434n33M610O807L95l685l4N182L656
$$ y = [-4703, -4635, -7577, 597, 21, 4514, 2776, -744, 1702, -1733, -7530, -6136, -4511, -2463, 1910, 5374, 5033, 321, -1103, -4126, -2906, 4439, 8958, 5432, 6455, 2529, 1491, -4346, -4030, -204, 90, 1278, -200, 1621, -1539, -5284, -6316, -8186, 3931, 10321, 13927, 17352, 13344, 9638, -2601, -1224, 955, -1746, 3353, -2535, -9455, -6822, 1361, 4732, 4438, 624, -3393, -4400, 319, 4615, 2520, 1647, -1218, -439, 382, -1765, 1134, 1287, 6806, 6055, -392, -9114, -6883, -5829, -7541, -7829, -4234, -4584, -8368, -14375, -13416, -14456, -15223, -9809, -8487, -6101, -5925, -6771, -4, -1737, -5736, -12113, -16524, -17100, -5899, -7271, -7831, -9692, -9711, 658, 1684, 2536, 5972, 1590, -437, 6297, 7913, 3949, -5518, -7457, -8252, -8194, -8430, -11541, -6499, -11224, -16658, -17191, -12581, -5774, -5379, -9064, -9098, -3916, -260]
4095b60K34K02o480q714J861K335K353K537j55k987n116L836P640K764m175q103
4079a2228L020L604j280M298l648M982O224J999q0k700l274j957O64m206l331
4064g913M671M361O411N402r98o904r743N539M538k658L4R94p291o486j399O060
4048e382L137N024M434L454J48k753j097p09K410m3o948k094O101r07l586k94
4032H95P76m090q15O152l113n327r705j141J6038J1236k465j0644o835L081l527
4017i484j589O837L275P11K164j578L09M676k640l155K94L073J854o298O89K382
4001A520k856M58k41p22K422L435L342j634p192k94O765n650r65K780j754o72
3985a258J516O446k697m289k935l377n44Q703m103N54L49K090P83N70L402r46
$$ y = [-260, -26, 176, -6304, -15018, -13157, -10822, -8469, -5932, -6087, -9074, -14190, -10354, -2714, 50, -4125, -12228, -9208, -5604, -6884, -2586, -6234, -1252, 4972, 6971, 6891, 4191, 917, -1040, -376, -4582, -7913, -3242, 1119, 7530, 12932, 11934, 5030, -4713, 826, 5364, 2706, 2740, 3734, -3557, -10043, -11442, -5382, -2245, 2779, 7213, 10667, 10815, 8062, 6965, 6256, 8666, 8623, 1675, -419, 5682, 4775, 1189, 895, 1671, -2419, -3234, 2918, -195, -5522, -15227, -16368, -330, 10906, 8441, -2203, -9038, -5957, -9484, -11073, -4236, -961, -250, 1914, 336, 645, 5321, 2681, -474, -180, 2893, 4747, -1551, -862, 1520, -1336, -878, -1119, -1841, 581, 4016, 7358, 5724, -1468, -1762, 5003, -647, -1612, 1168, -586, -1258, 258, 6704, 4007, -282, -3217, -6594, -7138, 1565, -2538, -1984, -1635, 455, 1238, 1808, 5210, 4264]
3969D264m178k852k793o54J225J259L652Q206J337m625n852J88K497K497l960
3954B11M260k744m453m370N054Q84q23J431L082m69O46j975m492j562Q041Q422
3938A1143m883O85k607J338j287J965J088k05l704j055J458j268m633k02Q06n731
3922g092O80J0830K568L828L893m14q365j878j574o4j099K215q70n90L440R69
3906F477k943j686j53J163m134j673L81k791K913K080J253P945O176M556K48L332
3890B3144j855j2837j1785N75O041k815m551M329Q68J184j850N26K840l907n253
3875e346k840L298M447O57l646q38K915n563K221J292j555P50L290j791o64m916
3859h289J174o95j255L233M495O222M780p976j215M426Q19p061p199M594N762
$$ y = [4264, 86, -2766, -5559, -6213, -4988, -3729, -77, 8129, 9466, 4841, -1011, -823, 1674, 4171, 211, 4471, 1727, -2726, -7096, -2042, -1158, -1981, -550, 2532, 2063, 2709, 734, -3758, -5320, 2721, 11143, 6260, 6945, 4338, 5676, 4389, 6354, 7442, 7237, 3533, 2478, 3936, 2668, -1965, -2167, -1361, -7092, -6412, 4418, 6986, 10814, 14707, 14293, 5928, 4050, 2476, 2412, 1313, 3528, 2658, 2068, 5508, 6477, 3534, 1848, 1695, 2858, -1276, -2949, -2568, -5359, -2446, -366, 887, 8832, 15008, 19564, 19812, 23144, 21289, 8452, -3333, -2758, 3283, 468, -4083, 246, 1114, 2298, 448, 974, 3814, -93, -5346, -8186, -4888, -441, 216, -3430, -4268, -1353, -6916, -4695, -3403, -4958, -4208, -918, -2709, -3373, -8289, -7115, -7810, -9065, -5832, -1337, 4885, 9665, 1689, 474, 4900, 5719, -1342, -8541, -3947, 1815]
3844A815p21k39k365J949K970k297o218N90k272k878P71N081P216J1461l994q439
3828B430m656K935n978j898J0062k983m255O239J771k9r356N90P193k670l671
3813d276p148k191m363l331j09J0064Q093K470J066l323n924l498J489O632N093
3798G44j0942M689N708O51M545K358k516K955K63k718K525K343r723r475p24o94
3782a0011k269O60j860K828R438J836P761J400k828l112J200k112Q64m3j83l222
3766C47k288k828P515M70m55m132r09K487O987O24K384P613k219o401l646n184
3750C65J936Q64J722o836r977J0556Q319o363Q69N040j615m070L051K678k610
3735C929M149K909n187p481N736J435k183K998M881n62j0986J621j486n86L768
$$ y = [1815, 1094, 855, -1510, 439, 3409, 1112, -5106, -4516, -6788, -9666, -8895, -3814, 3402, 14863, 10869, 2430, -2226, 709, -5269, -7167, 2895, -88, -4343, 1896, 3667, 3638, -5718, -5128, 2065, -605, -4276, -11424, -13615, -17978, -21309, -21418, -11354, -3261, -791, 275, -3048, -8972, -12470, -10981, -4349, 744, -10198, -5509, 199, 850, 5395, 7753, 5237, 8192, 8455, 5737, 8262, 10605, 882, -8593, -9317, -10011, -12280, -11620, -13480, -10652, -1214, 622, 8383, 9783, 6955, 3843, 5043, 2931, 3795, 3752, 3569, 347, -1941, -4769, 2746, 3216, 2761, -1371, -2280, 207, 7194, 7818, 10202, 17815, 15596, 9195, 5549, 365, 2301, 3165, 4887, -1949, -11926, -1370, 6949, 586, 1455, 6495, 4880, 810, 3861, 6539, 3929, 8078, 10987, 5800, -1681, 4055, 5490, 3307, 6305, 11186, 10624, -362, 1259, -227, -813, 2955]
3720B955M620j415N01p929j1954l301J342N327P364O225p954k642j59N193o39
3705b466p128k443L780r93K161O972M064J183p600j1655O068R958p44j570j634
3690b047k984j922J413l047K985j854O032L724q215m909R328M756k069k314q12
3675a935Q46M760l160K63j096N438J781K49l258m590m089m220j32M14O253Q061
3659E585m320m391O03J097J826N188l515P80J722k351O59R32m54l094l313O971
3643C925J055n722k929L623j310k321Q500N939mj856n674J5J860l790k178j094
3627a961Q54n382K105L034M055J281l42J710k993k141M688j87j486k149Q17L013
3611D916k176m177j041o293R02L685N687K336l882m538m120M839n77Q614J0535
$$ y = [2955, 7575, 6160, 6661, -1268, -13222, -16523, -15181, -9854, -2490, 3735, -4219, -6861, -7020, -1827, -2466, -9594, -12037, -8257, -9250, -7089, -117, 3947, 5130, -2470, -14125, -8057, 1901, 1157, -413, -2047, -5031, -6953, -5540, -8587, -5602, -7456, -1424, 2300, -5915, -10824, -1496, 3260, 1191, -1123, -1935, -1089, 3671, 511, 774, -322, 5116, 6897, 7146, 3888, -702, -4791, -9011, -9143, -8729, -2476, 5585, 1265, -3126, -2523, -1426, 400, 5588, 2073, 2853, 4575, 2224, 2883, 3815, 3361, 267, -3046, 3925, 4980, -742, -3671, -48, -1358, -3679, 4821, 10760, 10756, 8900, 3226, 3241, 5101, 1311, -867, -1961, -1107, -6489, -4384, -1350, 2705, 3986, 3644, 5354, 2361, 220, 4908, 4721, 3235, 1086, 1903, 4916, 2740, -1437, -2478, -8771, -7869, -4184, 1503, 3839, -43, -4581, -8701, -3862, -4439, 4175, 14710]
3596A4710k074l540n800K861k564M638l531j1155l201j903L584L879j480l910
3582i486K124Q432k05J99j281K30K560p57m683N058p28o743O371N066q7L896K780
3565A2746l651o166q273m566K579J498O913M230q97k6J198j580J275q6k973N361
$$ y = [14710, 12636, 9096, 3296, 6157, 3593, 8231, 4700, -6455, -9656, -11559, -7975, -4096, -5576, -9486, -7362, 1070, 865, 1064, -217, 13, 2573, 1816, -2867, 2191, 1463, -5280, 1091, 6157, 6070, 9966, 12746, 9095, 2929, -5344, -9910, -7331, -5833, 1080, 5310, 4413, 4387, 5585, 4005, 5280, 5194, 2221, 7582]
$$ [...]
##END NTUPLES=NMR SPECTRUM
##END=
