##TITLE=Analysis number 326764
Compound Code cc 13206
Book Reference 518/79
Project Code adrs
Chemist Name colinb
##JCAMPDX= 6.0         $$ Bruker NMR JCAMP-DX V2.0
##DATA TYPE= NMR SPECTRUM
##DATA CLASS= NTUPLES
##ORIGIN= Bruker BioSpin GmbH
##OWNER= nmr
$$ XWIN-NMR		Version 3.5
$$ Wed Feb 21 11:59:28 2007 GMT Standard Time (UT+0h)  MAYBRIDGE\nmr@NMR_250MHZ
##.OBSERVE FREQUENCY= 250.131544655141
##.OBSERVE NUCLEUS= ^1H
##.ACQUISITION MODE= SIMULTANEOUS (DQD)
##.ACQUISITION SCHEME= undefined
##.AVERAGES= 16
##.DIGITISER RES= 18
##SPECTROMETER/DATA SYSTEM= dpx250
##.PULSE SEQUENCE= zg30
##.SOLVENT NAME= CDCl3
##.SHIFT REFERENCE= (INTERNAL, CDCl3, 0, 16.522)
##AUDIT TRAIL= $$ (NUMBER, WHEN, WHO, WHERE, WHAT)
$$ ##TITLE= Audit trail, XWIN-NMR		Version 3.5
$$ ##JCAMPDX= 5.01
$$ ##ORIGIN= Bruker BioSpin GmbH
$$ ##OWNER= nmr
$$ C:\u/data/dgb/nmr/ADRS/1410/pdata/1/auditp.txt
$$ ##AUDIT TRAIL=  $$ (NUMBER, WHEN, WHO, WHERE, WHAT)
(   1,<2007-02-21 11:59:03.09 +000>,<MAYBRIDGE\nmr>,<NMR_250MHZ>,
      <created by zg, POWCHK disabled, PULCHK disabled
       configuration hash MD5:
       49 4B E0 1D 92 C2 6B 37 9F E6 65 BC 52 41 86 1D
       data hash MD5: 64K
       08 EB 4B B8 BC 20 85 A3 65 D0 B6 32 B5 9A 27 C9>)
(   2,<2007-02-21 11:59:18.59 +000>,<MAYBRIDGE\nmr>,<NMR_250MHZ>,
      <Start of raw data processing
       ef LB = 0.3 FT_mod = 6 PKNL = 1 SI = 32K 
       data hash MD5: 32K
       10 6C 88 23 A3 08 68 8A 7D 41 FF 50 10 9C 4A 5C>)
(   3,<2007-02-21 11:59:20.36 +000>,<MAYBRIDGE\nmr>,<NMR_250MHZ>,
      <apk 
       data hash MD5: 32K
       7B 99 5E FF 13 73 77 28 EF EA ED 84 3A 9B CF 08>)
(   4,<2007-02-21 11:59:21.12 +000>,<MAYBRIDGE\nmr>,<NMR_250MHZ>,
      <abs ABSG = 5 
       data hash MD5: 32K
       43 3D DA FD 36 94 AA AD 0B AB DB 3E 03 40 F5 E8>)
$$ ##END=
$$ 
$$ hash MD5
$$ B0 F8 82 2E B0 03 42 A5 FC 38 D6 F1 B0 A9 F1 26
##$RELAX= 
##$RELAX= 
##$RELAX= 
##$RELAX= 
##$RELAX= 
##$RELAX= 
##$RELAX= 
$$ Bruker specific parameters
$$ --------------------------
##$DU= <C:\u>
##$EXPNO= 1410
##$NAME= <ADRS>
##$PROCNO= 1
##$TYPE= <nmr>
##$USER= <dgb>
##$AMP= (0..31)
100 100 100 100 100 100 100 100 100 100 100 100 100 100 100 100 100 100 
100 100 100 100 100 100 100 100 100 100 100 100 100 100 
##$AQSEQ= 0
##$AQ_mod= 3
##$AUNM= <au_zg>
##$AUTOPOS= <22 >
##$BF1= 250.13
##$BF2= 250.13
##$BF3= 250.13
##$BF4= 250.13
##$BF5= 500.13
##$BF6= 500.13
##$BF7= 500.13
##$BF8= 500.13
##$BYTORDA= 1
##$CFDGTYP= 0
##$CFRGTYP= 5
##$CHEMSTR= <none>
##$CNST= (0..31)
1 1 145 1 1 1 1 1 1 1 1 1 1 1 1 1 1 1 1 1 1 1 1 1 1 1 1 1 1 1 1 1 
##$CPDPRG= <>
##$CPDPRG1= <>
##$CPDPRG2= <>
##$CPDPRG3= <>
##$CPDPRG4= <mlev>
##$CPDPRG5= <mlev>
##$CPDPRG6= <mlev>
##$CPDPRG7= <mlev>
##$CPDPRG8= <mlev>
##$CPDPRGB= <>
##$CPDPRGT= <>
##$D= (0..31)
0 1 0 0 0 0 0 0 0 0.06 0 0 0 0 0 0 0.0002 0 0 0 0 0 0 0 0 0 0 0 0 0 0 
0 
##$DATE= 1172059141
##$DBL= (0..7)
120 120 120 120 120 120 120 120 
##$DBP= (0..7)
150 150 150 150 150 150 150 150 
##$DBP07= 0
##$DBPNAM0= <>
##$DBPNAM1= <>
$$ [...]
##$SUBNAM7= <"">
##$SUBNAM8= <"">
##$SUBNAM9= <"">
##$SW= 20.6930455092707
##$SWIBOX= (0..15)
0 0 3 0 0 0 0 0 0 0 0 0 0 0 0 0 
##$SW_h= 5175.983436853
##$TD= 65536
##$TD0= 1
##$TE= 295.16
##$TE2= 300
##$TE3= 300
##$TEG= 300
##$TL= (0..7)
0 120 120 120 120 120 120 120 
##$TP= (0..7)
150 150 150 150 150 150 150 150 
##$TP07= 0
##$TPNAME0= <>
##$TPNAME1= <>
##$TPNAME2= <>
##$TPNAME3= <>
##$TPNAME4= <>
##$TPNAME5= <>
##$TPNAME6= <>
##$TPNAME7= <>
##$TPOAL= (0..7)
0.5 0.5 0.5 0.5 0.5 0.5 0.5 0.5 
##$TPOFFS= (0..7)
0 0 0 0 0 0 0 0 
##$TUNHIN= 0
##$TUNHOUT= 0
##$TUNXOUT= 0
##$USERA1= <user>
##$USERA2= <user>
##$USERA3= <user>
##$USERA4= <user>
##$USERA5= <user>
##$V9= 5
##$VALIST= <valist>
##$VCLIST= <CCCCCCCCCCCCCCC>
##$VD= 0
##$VDLIST= <DDDDDDDDDDDDDDD>
##$VPLIST= <PPPPPPPPPPPPPPP>
##$VTLIST= <TTTTTTTTTTTTTTT>
##$WBST= 1024
##$WBSW= 4
##$XGAIN= (0..3)
0 0 0 0 
##$XL= 0
##$YL= 0
##$YMAX_a= 426265
##$YMIN_a= -432091
##$ZGOPTNS= <>
##$ZL1= 120
##$ZL2= 120
##$ZL3= 120
##$ZL4= 120
##$ABSF1= 16.522
##$ABSF2= -4.171173
##$ABSG= 5
##$ABSL= 3
##$ALPHA= 0
##$AQORDER= 0
##$ASSFAC= 0
##$ASSFACI= 0
##$ASSFACX= 0
##$ASSWID= 0
##$AUNMP= <proc_1d>
##$AZFE= 0.1
##$AZFW= 0.1
##$BCFW= 0
##$BC_mod= 0
##$BYTORDP= 0
##$COROFFS= 0
##$CY= 12.5
##$DATMOD= 1
##$DC= 0
##$DFILT= <>
##$DTYPP= 0
##$F1P= 14.0000005364418
##$F2P= -0.99999901652339
##$FCOR= 0.5
##$FTSIZE= 32768
##$FT_mod= 6
##$GAMMA= 0
##$GB= 0
##$INTBC= 1
##$INTSCL= 1
##$ISEN= 128
##$LB= 0.3
##$LEV0= 0
##$LPBIN= 0
##$MAXI= 10000
##$MC2= 0
##$MEAN= 0
##$ME_mod= 0
##$MI= 0
##$NCOEF= 0
##$NC_proc= -4
##$NLEV= 6
##$NOISF1= 0
##$NOISF2= 0
##$NSP= 0
##$NTH_PI= 0
##$NZP= 0
##$OFFSET= 16.522
##$PC= 1
##$PHC0= 226.0912
##$PHC1= 7.771968
##$PH_mod= 1
##$PKNL= yes
##$PPARMOD= 0
##$PSCAL= 4
##$PSIGN= 0
##$REVERSE= no
##$SF= 250.13
##$SI= 32768
##$SIGF1= 0
##$SIGF2= 0
##$SINO= 400
##$SIOLD= 32768
##$SREGLST= <1H.CDCl3>
##$SSB= 0
##$STSI= 32768
##$STSR= 0
##$SW_p= 5175.98343685301
##$SYMM= 0
##$S_DEV= 0
##$TDeff= 65536
##$TDoff= 0
##$TI= <Analysis number 999999
Compound Code 99
Book Reference 9
Project Code 9>
##$TILT= no
##$TM1= 0
##$TM2= 0
##$TOPLEV= 0
##$USERP1= <user>
##$USERP2= <user>
##$USERP3= <user>
##$USERP4= <user>
##$USERP5= <user>
##$WDW= 1
##$XDIM= 32768
##$YMAX_p= 310089368
##$YMIN_p= -107556
$$ End of Bruker specific parameters
$$ ---------------------------------
##NTUPLES= NMR SPECTRUM
##VAR_NAME=  FREQUENCY,     SPECTRUM/REAL,   SPECTRUM/IMAG
##SYMBOL=    X,             R,               I
##VAR_TYPE=  INDEPENDENT,   DEPENDENT,       DEPENDENT
##VAR_FORM=  AFFN,          ASDF,            ASDF
##VAR_DIM=   32768,         32768,           32768
##UNITS=     HZ,            ARBITRARY UNITS, ARBITRARY UNITS
##FACTOR=    0.157963299565203, 1,           1
##FIRST=     4132.6476996994, 0,             0
##LAST=      -1043.33573715361, 0,           0
##MIN=       -1043.33573715361, -107556,     0
##MAX=       4132.6476996994, 310089368,     0
$$ Real data points
##PAGE= N=1
##DATA TABLE= (X++(R..R)), XYDATA
$$ [...]
18982A6845J4170j7112K0217j86l2246j2108j3599O317P798R131L540P867j6791
$$ 16845 31015 13903 34120 33934 1688 -10420 -24019 -17702 -9904 -773 2767 10634 -6157
18969f157q858k9229j0417J1614J2632K2225J6860o136o146j206J6721L2336l027
$$ -6157 -15015 -44244 -54661 -43047 -30415 -8190 8670 2534 -3612 -4818 11903 44239 41212
18956D1212k3920j5512P845N875Q89j1905j995k619J675j3980j6667J2908M1887
$$ 41212 17292 1780 9625 15500 16389 4484 2489 -130 1545 -12435 -29102 -16194 25693
18943B5693J3267k7997m7005L574K889K6305K0464L567K690k4252j3348J7072
$$ 25693 38960 10963 -36042 -32468 -29579 -3274 17190 20757 23447 -805 -14153 2919
18931B919R55k5635m655l960R529j7863P823K2824K8052K102J7654J7992k2237
$$ 2919 3874 -21761 -26416 -30376 -20847 -38710 -30887 -8063 19989 22091 39745 57737 35500
18918C5500m6536k6821L662J2943L2571K0112p496J211j0572p057j8435R95Q271
$$ 35500 -11036 -37857 -34195 -21252 11319 31431 23935 25146 14574 7517 -10918 -9923 -1652
18905a652n15q258j081j2982K5j055j1887K0580K5601J411J129j864p564K1491
$$ -1652 -2167 -10425 -11506 -24488 -24463 -25518 -37405 -16825 8776 10187 11316 9452 1888 23379
18891B3379M924m1825p413k3K1837J0446k2574j7478P432P599l076J5085J9445
$$ 23379 28303 -13522 -20935 -20958 879 11325 -11249 -28727 -21295 -13696 -16772 -1687 17758
18878A7758J1348J0275k0583j569n237k4335j084k0079k8537K5188K6596J3958
$$ 17758 29106 39381 18798 17229 11992 -12343 -13427 -33506 -62043 -36855 -10259 3699
18866C699o064j131J9587K3373j2838k6322j6141k1285J3223J2000r831N424J6212
$$ 3699 -2365 -3496 16091 39464 26626 304 -15837 -37122 -23899 -11899 -21730 -16306 -94
18853i4J6440J058j4370k1033J3914J1594Q049J8964j1061k7043M005J5624j5361
$$ -94 16346 17404 3034 -17999 -4085 7509 15558 34522 23461 -3582 423 16047 686
18840F86K0887j86j3340m186j5820O81J9087P921j2706K3735L0575k254o815q747
$$ 686 21573 21387 8047 3861 -11959 -11278 7809 15730 3024 26759 57334 55080 48265 39518
18826C9518l109m126N068N330J9626p403j6586k3876k1623J0717J8781J9080J366
$$ 39518 36409 32283 37351 42681 62307 54904 38318 14442 -7181 3536 22317 41397 42763
18813D2763L384l945k0976l2515J2103L7397O080j6174M662l069q551k31J2147
$$ 42763 46147 42202 21226 -11289 814 38211 44291 28117 32779 29710 21159 20928 33075
18800C3075j0659j2295L1305j2316l0818L8493J6970n001P274j4218j8784o724
$$ 33075 22416 10121 41426 29110 -1708 36785 53755 48754 56028 41810 23026 16302
18788A6302j4220Q756o195J1405L1426J8089p44K753K495J6121K2473j6130l9588
$$ 16302 2082 10838 4643 16048 47474 65563 64819 67572 70067 86188 108661 92531 52943
18775E2943l779P139l9J8970n288J1056J9960M8200P6927M4132n0147n5416l3117
$$ 52943 49164 56303 56264 75234 69946 81002 100962 149162 226089 270221 220074 164658 131541
18762A31541j2008m7379j5393K9492j011j8158j0700J6748J7337j3857J0335k3317
$$ 131541 119533 72154 56761 86253 85242 67084 56384 73132 90469 76612 86947 63630
18750F3630j9090j9901J7413n471k2869j2325K9171K0383p030p07m25l8612k4041
$$ 63630 44540 24639 42052 36581 13712 1387 30558 50941 43911 43204 42779 4167 -19874
18737a9874K0785J0681J9310K0725j6347l118K1418J990j5059J2417r049j866
$$ -19874 911 11592 30902 51627 35280 32162 53580 55570 40511 52928 43879 42013
18725D2013J7678j8180k3233j502N718L1648r779o126L214l0186k115L616R60
$$ 42013 59691 41511 18278 16776 22494 54142 44363 38237 41451 11265 9150 12766 13726
18712A3726L2241L1883o150l3297l7070k1979M77J2357K8528J7430p492K1268
$$ 13726 45967 77850 71700 38403 1333 -20646 -20169 -7812 20716 38146 30654 51922
18700E1922P793j9321J2094j1006j008p08J9395k7123Q618k923k9074j4376q783
$$ 51922 59715 40394 52488 41482 40474 39766 59161 32038 40656 37733 8659 -5717 -14500
18687a4500J6195l416K4033q733J0634k3704j9393J791J2306O63m179Q443J1743
$$ -14500 1695 -1721 22312 13579 24213 509 -18884 -17093 -4787 -4124 -8303 140 11883
18674A1883K5226p625R355J3042n248k0340n438j6340k71q809M772q915r606K1247
$$ 11883 37109 29484 38839 51881 46633 26293 20855 4515 4244 -4565 207 -8708 -18314 2933
18660B933K3166k6006l0460r646L9488L4980k740j1252J7682o831j0202m029k6929
$$ 2933 26099 93 -30367 -40013 -525 34455 31715 20463 38145 31314 21112 17083 -9846
18647i846M408J5330K6975j852K2733j9561p667j8671j3241n470m558J0811j1751
$$ -9846 -5438 9892 36867 35015 57748 38187 30520 11849 -1392 -6862 -11420 -609 -12360
18634a2360J6468J3683o327K088M099K0358j3854J7171K5768k0734l0917o865
$$ -12360 4108 17791 11464 13552 17651 38009 24155 41326 67094 46360 15443 8578
18622H578J4007m397J2579J3298k2637l2430m2985k8793L6001M3252R823o966
$$ 8578 22585 18188 30767 44065 21428 -11002 -53987 -82780 -46779 -3527 6296 -670
18610f70N4996J5986J698l6675l8938j1128J9535J6711L847K494J6843L2821j05
$$ -670 54326 70312 72010 35335 -3603 -14731 4804 21515 25362 27856 44699 77520 77415
18597G7415K530K1039r334k7728j847J3428j0357o126j9794j6312p180j7488J3682
$$ 77415 79945 100984 91650 63922 62075 75503 65146 59020 39226 22914 15734 -1754 11928
18584A1928K1787k6392j2278J1788R221M00J3950O376n965K0221J9394k3526r706
$$ 11928 33715 7323 -4955 6833 16054 16454 30404 36780 30815 51036 70430 46904 37198
18571C7198k3276j2253K9490o458o805J2428P324R033J5087O443J6673R416j9220
$$ 37198 13922 1669 31159 24701 17896 30324 37648 46681 61768 68211 84884 94300 75080
18558G5080K745O145J1116L914p751j1632j446j2366L417J4271j4189k0930j057
$$ 75080 77825 83970 95086 99000 91249 79617 78171 65805 69222 83493 69304 48374 47317
18545D7317J7595k7615j67n963J5320L4551k951j6564j2402j7621j824j4084j4780
$$ 47317 64912 37297 37130 31167 46487 81038 78087 61523 49121 31500 29676 15592 812
18532H12j6778J927j1390K3497J3591K1318o361j4839O869n325l2392k2599O420
$$ 812 -15966 -14039 -25429 -1932 11659 32977 26616 11777 18646 13321 -19071 -41670 -35250
18519c5250M3567J4796l908n064J7962J3818P0l091j081j1438o295j5835M1081
$$ -35250 8317 23113 19205 14141 32103 45921 45991 42900 41819 30381 24086 8251 49332
18506D9332K5493k8060j7557k1242K3490k951M026m851k6893K8923K8504n290
$$ 49332 74825 46765 29208 7966 31456 28505 32531 27680 787 29710 58214 52924
18494E2924m9041M261J4604K5729k725l0889j0274l0657J7497J4762O122J5570
$$ 52924 3883 8144 22748 48477 45752 14863 4589 -26068 -8571 6191 12313 27883
18482B7883J4999l2514P49n322j1650L227n611P681K7155o37J0102J0902p841
$$ 27883 42882 10368 11117 5795 -5855 -2628 -8239 -558 26597 25960 36062 46964 39123
18469C9123j6352j0226o405q702k205k8504Q273J0379J0327K5286k2473j1015
$$ 39123 22771 12545 6140 -2562 -4767 -33271 -24998 -14619 -4292 20994 -1479 -12494
18457a2494p14l441K6657Q410K4967Q084n514k6798j2678J4861r159j1259j1141
$$ -12494 -13208 -16649 10008 18418 43385 51469 45955 19157 6479 21340 12181 922 -10219
18444a0219n220N0554J8033l8014k8062K9181L0646j4316l5813m946K7068K7560
$$ -10219 -15439 35115 53148 15134 -12928 16253 46899 32583 -3230 -8176 18892 46452
18432D6452M458O996j9917R464J3643p721j8414J8259O038j5330j9291R603J8671
$$ 46452 50910 57906 37989 47453 61096 53375 34961 53220 59258 43928 24637 34240 52911
18419E2911P349N548k6451L017m374p305l0098n071L0896k0276j4874J4461j0154
$$ 52911 60260 65808 39357 42374 38000 30695 597 -4474 26422 6146 -8728 5733 -4421
18406d421L787J1033K626L05K5977L95k6060K0293k366r168q694j2715J2381K4290
$$ -4421 -634 10399 13025 13330 39307 39702 13642 33935 31569 22401 13707 992 13373 37663
18392C7663L127J1149M212Q903k3711p353j4915j7455Q540N3748J0588j3389J6071
$$ 37663 40790 51939 56151 65054 41343 33990 19075 1620 10160 63908 74496 61107 77178
18379G7178n484J6448J8063k8899k0471L2549J3460r231l495l1721L588K5467
$$ 77178 71694 88142 106205 77306 56835 89384 102844 93613 90118 58397 61985 87452
18367H7452K2812l2969R943J4323r255J3468j3771L739N325k8832l0445J2059
$$ 87452 110264 77295 87238 101561 92306 105774 92003 95742 101067 72235 41790 53849
18355E3849J3217r120N874J421j2894P161L748k7864j258L3026L6551J5847m2906
$$ 53849 67066 57946 63820 65241 52347 59508 63256 35392 34134 67160 103711 119558 76652
18342G6652k4000j3027m66k1827j6108R979K2067K7766P455N047n890K0330J4195
$$ 76652 52652 39625 39159 17332 1224 11203 33270 61036 68491 73538 67648 87978 102173
18329A02173j5313j0851n179J2836J3761K818L916J2368N060J0433J1824k582
$$ 102173 86860 76009 70830 83666 97427 100245 104161 116529 121589 132022 143846 141264
18317A41264j6509j8021L096M515l3634l0908Q18J0168j1241J4785K6143m701
$$ 141264 124755 106734 109830 114345 80711 49803 50621 60789 49548 64333 90476 85775
18305H5775k2128J756R054J859o973J8243K2630K659J7583p49K5263k1268n891
$$ 85775 63647 65403 74457 76316 69343 87586 110216 112875 130458 129709 154972 133704 127813
18292A27813q367N231l9590J6773J9956m0861n751K6607M3866L0737L574k5210
$$ 127813 119446 124677 85087 101860 121816 80955 75204 101811 145677 176414 179988 154778
18280A54778j9567P848O476R12k4355L490K9212o785R155n870n769j0745o843
$$ 154778 135211 143059 149535 150447 126092 129582 158794 152009 161164 155294 149525 138780 131937
18267A31937J8436J8308k0645j3478J1848J3470N569Q125l166p981j6791J872
$$ 131937 150373 168681 148036 134558 146406 159876 165445 173570 170404 162423 145632 147504
18255A47504J7507R996j4122J2486l029l968L788l475l1352l5261j0286M46R624
$$ 147504 165011 175007 160885 173371 170342 166374 170162 166687 135335 100074 89788 90234 99858
18242I9858K7932R932Q197J8953J9420Q798k9230O415Q733j6283j4061j1780j2980
$$ 99858 127790 137722 145919 164872 184292 193090 163860 170275 179008 162725 148664 136884 123904
18229A23904r898j865r083J4847O997L41K7485j3670j3713l878J3926L636r563
$$ 123904 114006 112141 103058 117905 124902 125243 152728 139058 125345 121467 135393 139029 129466
18216A29466R775L258k6657J5284K3J4090P475J1318j9417j8946L703l567k873
$$ 129466 139241 142499 115842 131126 131149 145239 152714 164032 144615 125669 129372 125805 122932
18203A22932K2666J3264L64k1440l440K1183J0213K5380M262J2507K5982P31J769
$$ 122932 145598 158862 159226 137786 134346 155529 165742 191122 195384 207891 233873 234604 236373
18190B36373m600n764n666j3819m527J0889o166j0673j2761k1062J7564J229N674
$$ 236373 231773 226009 220343 206524 201997 212886 206720 196047 183286 162224 179788 181017 186691
18177A86691k6752L2611K044m2335M094L3774o380L777N58j2755o35J1813K4416
$$ 186691 159939 192550 194594 152259 156353 190127 183747 187524 188082 175327 174692 186505 210921
18164B10921K9029l010k997j3764K7292L3293L9327K446o552K2193q145J4448
$$ 210921 239950 236940 233943 220179 247471 280764 320091 322537 315985 338178 330033 344481
18152C44481N5375M9379K2920J7561J2052J7233O403J6365K9083M1234K4365J9074
$$ 344481 399856 449235 472155 489716 501768 519001 525404 541769 570852 612086 636451 655525
18140F55525K6501L0002M0961M0988L5262K6108M0412N7288M1378N1470M4818
$$ 655525 682026 712028 752989 793977 829239 855347 895759 953047 994425 1045895 1090713
18129A090713L4969J00332R8950P6523J07836J37986J93928K37588K66289L40923
$$ 1090713 1125682 1226014 1324964 1401487 1509323 1647309 1841237 2078825 2345114 2686037
18119B686037M13381N34714P10272R48439J319579J758432K292195L013789L927735
$$ 2686037 3099418 3634132 4344404 5292843 6612422 8370854 10663049 13676838 17604573
18110A7604573N455354P868690P658633o86539p926783o628189m357812l394671
$$ 17604573 23059927 30928617 38587250 37900711 29973928 23345739 18987927 15593256
18102A5593256k846419k292080j798361j426054j132060q60672o67351n31518
$$ 15593256 12746837 10454757 8656396 7230342 6098282 5237610 4570259 4038741
18094D038741m89097m22199l36101k71633k52677k33365k13915j66881j28708
$$ 4038741 3549644 3127445 2791344 2519711 2267034 2033669 1819754 1652873 1524165
18085A524165j18425q3902p4585n2997o1861p2308n5340k0140k6189l8297q76
$$ 1524165 1405740 1321838 1247253 1194256 1132395 1060087 1004747 984607 958418 920121 919245
18074I19245l3587m3058m608m3781k4511n0472j7433p181l695L1820O5161P8154
$$ 919245 885658 842600 837992 794211 769700 719228 701795 694614 690919 722739 787900 866054
18062H66054R6798J11144J11163P9343R4642N3920j9494o1842j30118j47822r9716
$$ 866054 962852 1073996 1185159 1264502 1359144 1413064 1393570 1331728 1201610 1053788 954072
18051I54072p6192p9719m9567o0687p7800l3357k0602p4435m0510k5369j0960
$$ 954072 877880 798161 748594 687907 610107 576750 556148 481713 441203 415834 404874
18040D04874O553J1268k5983l1330j7136l1295K829j1919K0197K6917m282M654
$$ 404874 411427 422695 396712 365382 348246 316951 319780 307861 328058 354975 350693 355347
18028C55347J277r569J1420r19j4113m723N11o938L950K262j1094j0776l369p005
$$ 355347 356624 347055 358475 357556 343443 338720 339231 332293 336243 338505 327411 316635 313266 306261
18014C06261k7L0300M6236N3227M0469M2486O8172J16522J28628J34780J01852
$$ 306261 306234 336534 382770 435997 476466 518952 587124 703646 832274 967054 1068906
18003A068906O9198L2775j4742n1266l5830m1489k9997r542m746L2113J7961K060
$$ 1068906 1138104 1170879 1156137 1104871 1069041 1027552 997555 988013 983267 1015380 1033341 1035401
17991A035401l1959k3839m5701n7245n5069J7918l2351o3097q2206m0599m7771
$$ 1035401 1003442 979603 933902 876657 821588 839506 807155 744058 661852 621253 573482
17980E73482n5273k1002m6866k3679k5593l870k1267k1701j0923q366m917m723
$$ 573482 518209 497207 450341 426662 401069 397199 375932 354231 343308 334942 330025 325302
17968C25302l8378m9561n581J5172K0057K7191J3772N111N88Q594J1244J9148
$$ 325302 286924 237363 231782 246954 267011 294202 307974 313085 313673 322267 333511 352659
17956C52659K8281J8807P67k3560k960N3981M9752L981k5823N782K6121R759P77
$$ 352659 380940 399747 400514 376954 373994 427975 477727 481708 455885 461667 487788 497547 498324
17943D98324p956j063j6042k550J7737j9780m9843j36l6300l2677m9253m5978
$$ 498324 490368 489305 473263 470713 488450 468670 418827 418691 382391 349714 300461 254483
17931B54483k0921k488m1112k7469P170k6645j3785l385k967P381O463K675m808
$$ 254483 233562 231074 189962 162493 169663 143018 129233 125848 122881 130262 136725 139400 134592
17918A34592K7518J0065j5212M146K1706k1676j7745k4100J3680j0023j9534j8940
$$ 134592 162110 172175 156963 161109 182815 161139 143394 119294 132974 122951 103417 84477
17906H4477l076J0846J1945M608R925j4981k553L287L0799Q442J9113m106j1061
$$ 84477 81401 92247 104192 108800 118725 103744 101191 104478 135277 143719 162832 158726 147665
17893A47665J514J5354j0496M651k9054j7128j6459J6352N973J6561P611N186
$$ 147665 149179 164533 154037 158688 129634 112506 96047 112399 118372 134933 142544 147730
17881A47730j1355j6965m28L437k8488j0331J2442l895j519J0679m372o537M977
$$ 147730 136375 119410 118982 122419 93931 83600 96042 92147 90628 101307 96935 90398 95375
17868I5375j0503j2396J6664L9547L90J0271p833k3456m242m177k0982J2925L0209
$$ 95375 84872 72476 89140 128687 129077 139348 131515 108059 103817 99640 78658 91583 121792
17855A21792K94j5027m318j6854k7710r387o379P884J9552K7783j2675j7710J2830
$$ 121792 122086 107059 102741 85887 58177 48790 42411 50295 69847 97630 84955 67245 80075
17842H0075J1395j1248K969l88J4215j494l007J643P775r915k1027L203N693M265
$$ 80075 91470 80222 83191 82803 97018 95524 92517 94160 101935 92020 70993 74196 79889 84154
17828H4154k1314K4575j0792J1281J9268o033j6264r317J4245R918q109K4262
$$ 84154 62840 87415 76623 87904 107172 101139 84875 75558 89803 99721 91612 115874
17816A15874L8483j2977J2903J382N523k349p493r927J9846K5434R548K9983J212
$$ 115874 154357 141380 154283 155665 161188 158839 151346 141419 161265 186699 196247 226230 227442
17803B27442l1866j3335n703P17j0701j0501Q160Q327j7392l2019n098K8484J1574
$$ 227442 195576 182241 176538 177255 166554 156053 164213 172540 155148 123129 118031 146515 158089
17790A58089J543J968J4049K5212J8283j0427J3191R911k8302l6495j333K776
$$ 158089 159632 161600 175649 200861 219144 208717 221908 231819 203517 167022 165689 168465
17778A68465J4229L4742M1199K8684L2268L7623P2312Q8572Q7282J00019N2915
$$ 168465 182694 217436 258635 287319 319587 357210 429522 518094 605376 705395 758310
17767G58310L4193K5749m9203q8688q0383o0082k6212J2797k8385k7288M4373
$$ 758310 792503 818252 769049 680361 599978 539896 513684 526481 498096 470808 515181
17756E15181N4307N7614J19778J08453J38568M7961l0386q3568j30189r9822n5447
$$ 515181 569488 627102 746880 855333 993901 1041862 1011476 927908 797719 697897 642450
17745F42450o9160p0649o7893m4822k0189m0006j5898J6403m85N724l8079m5442
$$ 642450 573290 502641 434748 389926 369737 329731 313833 330236 329751 335475 297396 251954
17733B51954j2824P079K2110q13k0310l9669l2298J9202J9880j7405q839J5801
$$ 251954 239130 246209 268319 267506 247196 207527 175229 194431 214311 196906 188067 203868
17721B03868J7939k26o598n679n376O393j937N293J1572j429J7165M776P503K1490
$$ 203868 221807 221581 214983 209304 203928 210321 208384 213677 225249 223820 240985 245761 253264 274754
17707B74754J4071J029N0232K5840j7935J7791M6606N4330j5349n0512m4023j2474
$$ 274754 288825 289854 340086 365926 347991 365782 412388 466718 451369 400857 356834 344360
17695C44360Q259l989j0075n149K211J3623K8050K7326M8333O8238M8863M4519
$$ 344360 352619 348630 338555 333406 335617 349240 377290 404616 452949 521187 570050 614569
17683F14569j3170m9506m7227k2565o190P303J1741Q6L044k276l9058k3658j8282
$$ 614569 601399 551893 504666 482101 475911 483214 494955 495041 498085 495809 456751 433093 414811
17670D14811J533j6995j0768j1718j7841K683N788R095m822K4510K1829J1820
$$ 414811 416344 399349 388581 376863 359022 361705 367493 376588 371766 396276 418105 429925
17658D29925L487k432q263P822N3080K2033k12L7679J5799K0067J03323Q7757
$$ 429925 433412 430980 422717 430539 483619 505652 505440 543119 558918 578985 682308 770065
17646G70065J16794L3025o5762o7555q945n0924m1101j5770J0636L8455K8202
$$ 770065 886859 919884 854122 786567 777622 726698 685597 669827 680463 718918 747120
17635G47120J3447M7721P6788J02776J20075J15624J2852q8079j16954n6759l9179
$$ 747120 760567 808288 885076 987852 1107927 1223551 1236403 1148324 1031370 974611 935432
17624I35432j9111l8768L3743K7779l0484l6624l4359j0322L113k1760k0297N857
$$ 935432 916321 877553 911296 939075 908591 871967 837608 827286 830399 808639 788342 794199
17612G94199K3777J0552l64K0463K2972J7076K7320K6753P488K9125J4140l029
$$ 794199 817976 828528 828164 848627 871599 888675 915995 942748 950236 979361 993501 990472
17600I90472L0731O6245L5836L6841O2929P8887P1270J17923J36397J58381J75601
$$ 990472 1021203 1087448 1123284 1160125 1223054 1301941 1373211 1491134 1627531 1785912 1961513
17589A961513J66507J21099P7930J2342j2364M859J7267M4610R9836J61017J51838
$$ 1961513 2128020 2249119 2327049 2339391 2327027 2331886 2349153 2393763 2493599 2654616 2806454
17578B806454J61537K15632K08065K69854K80385K48443K53476K51345K02928
$$ 2806454 2967991 3183623 3391688 3661542 3941927 4190370 4443846 4695191 4898119
17569D898119K25977K98675M24774N30429O53048Q00124R77784J140419J371013
$$ 4898119 5124096 5422771 5847545 6377974 7031022 7831146 8808930 9949349 11320362
17560A1320362J761709K272995L010461M096292N520015P299406R539739J2789146
$$ 11320362 13082071 15355066 18365527 22461819 27981834 35281240 44820979 57610125
17552E7610125J7314098J9437616J1796158K616629j606237j2148714j8238538
$$ 57610125 74924223 94361839 106157997 108774626 107168389 95019675 76781137
17545G6781137j4629049j0891174q732341p093666n625478m440774l527427k748684
$$ 76781137 62152088 51260914 42528573 35434907 29809429 25368655 21841228 19092544
17537A9092544k099380j659137j393347j240571j080717r73946q66605o79681
$$ 19092544 16993164 15334027 13940680 12700109 11619392 10645446 9778841 9099160
17529I099160n05384l73558l34921k68262j81721j28256j01220j082R8558J45167
$$ 9099160 8593776 8220218 7885297 7617035 7435314 7307058 7205838 7204756 7303314 7448481
17519G448481J36853J72954K11127K20152L07838M51850N55841O74318Q18626
$$ 7448481 7585334 7758288 7969415 8189567 8497405 8949255 9505096 10179414 10998040
17510A0998040J048908J282004J479786J778101K365072L181368M320454N919777
$$ 10998040 12046948 13328952 14808738 16586839 18951911 22133279 26453733 32373510
17502C2373510P968971J0469492J3760243J8538363K4319149K3534581J0831320
$$ 32373510 40342481 50811973 64572216 83110579 107429728 130964309 141795629
17495A41795629J726722n996797k0525111k3347546j7588992j3534714j1068142
$$ 141795629 143522351 137525554 117000443 93652897 76063905 62529191 51461049
17488E1461049q982849p088471n575338m434887l474503k774115k298415j931265
$$ 51461049 42478200 35389729 29814391 25379504 21905001 19130886 16832471 14901206
17480A4901206j670963j515521j296386j045327q57265o83473n76186n38070m87400
$$ 14901206 13230243 11714722 10418336 9373009 8515744 7832271 7256085 6718015 6230615
17471F230615m88155m99136m25229l56193l23314k77589k42152k03948j11544
$$ 6230615 5742460 5243324 4818095 4461902 4138588 3860999 3618847 3414899 3303355
17462C303355q5329m0826J578J5036k6449p5105j06377j77722k06040j99638k28379
$$ 3303355 3218026 3177200 3178778 3193814 3167365 3092260 2985883 2808161 2602121 2402483 2174104
17451B174104j71394j08566q6787p8247n8444m2898k4405m673j417k446k5516
$$ 2174104 2002710 1894144 1807357 1729110 1670666 1627768 1603363 1598690 1597273 1594827 1569311
17440A569311m3493p3821o8391n5260p0650p1738l4163l2959k3167m2171N093
$$ 1569311 1525818 1451997 1383606 1328346 1257696 1185958 1151795 1118836 1095669 1053498 1058591
17429A058591K8629j21j9581m6232q359K0914P622j007k830l9174j5828K5321
$$ 1058591 1087220 1087099 1067518 1021286 1012927 1033841 1041463 1040456 1037626 998452 982624 1007945
17417A007945J4751L6766M5354j3919n7736l1710m6230n6136k4832r155m2092
$$ 1007945 1022696 1059462 1104816 1090897 1033161 1001451 955221 899085 874253 865098 823006
17406H23006m7741m1580n960J7176m966k4017m9501l9086q88K4642J2225J8001
$$ 823006 775265 733685 727725 744901 739935 715918 666417 627331 626443 651085 663310 681311
17394F81311J043l8769k7673J3710j882o99j295L0494K2151l762Q681J6696L3036
$$ 681311 682354 643585 615912 629622 627740 627041 625746 656240 678391 674629 683310 700006 733042
17381G33042J3697j6819J6608M258l703j0039J8856J4073J8369q432K945J7848
$$ 733042 746739 729920 746528 750786 747083 737044 755900 769973 788342 779910 782855 800703
17369H00703M8225N5868J0719n885l2908k9609j4190l8771k2912j3103J2012L5568
$$ 800703 848928 904796 915515 909630 876722 847113 832923 794152 771240 758137 770149 805717
17357H05717J0919n803l6010j9630K3085K7548K1590K8193j0104k5548j3121n911
$$ 805717 816636 810833 774823 755193 778278 805826 827416 855609 845505 819957 806836 800925
17345H00925J08L631J3460J3115p189k075K012j204K5311M951N272m142M8923
$$ 800925 801033 804664 818124 831239 824050 821975 823987 822783 848094 853045 858317 854175 903098
17332I03098N1840L992r427L5550N759J3996J4526L3399K3479Q904L4315K1074
$$ 903098 954938 958930 949503 985053 990812 1004808 1019334 1052733 1076212 1085116 1119431 1140505
17320A140505J8664J4652L4656q564J4942L2781O0856O1695N2032Q393r225K4127
$$ 1140505 1159169 1173821 1208477 1199913 1214855 1247636 1308492 1370187 1422219 1430612 1421387 1445514
17308A445514N0698J0416K7804P8147R0387R1979R1771J9009K7323P8074O8911
$$ 1445514 1496212 1506628 1534432 1612579 1702966 1794945 1886716 1905725 1933048 2011122 2080033
17297B080033N8297P6269J15601J62963J63762J20880R8060J20556J28733J89032
$$ 2080033 2138330 2214599 2330200 2493163 2656925 2777805 2875865 2996421 3125154 3314186
17287C314186K12499K14390K04047K07486K87453L47013M10053M98069N50984
$$ 3314186 3526685 3741075 3945122 4152608 4440061 4787074 5197127 5695196 6246180
17278F246180N64496N59805N12366M97543N22631O23675Q38613J026901J245017
$$ 6246180 6810676 7370481 7882847 8380390 8903021 9526696 10365309 11392210 12637227
17269A2637227J505648J783369K295440L081256M059490N371764P105212R186437
$$ 12637227 14142875 15926244 18221684 21302940 25362430 30734194 37839406 47025843
17261D7025843J2065897J6124176J8553644J2973901N050567Q40065r396575j6161628
$$ 47025843 59091740 75215916 93769560 106743461 111794028 112634093 103237518 87075890
17253H7075890j2741219q630558n896712l382881o96107K040688M997891Q431388
$$ 87075890 74334671 65704113 59807401 56424520 55728413 57769101 62766992 71198380
17245G1198380J2617982J8235995K3960218K0382191N761249k675155j0885305
$$ 71198380 83816362 102052357 126012575 146394766 152156015 149480860 138595555
17238A38595555k2472172k2344530j6882580j3256330j0803892q635702o795144
$$ 138595555 116123383 93778853 76896273 63639943 52836051 44200349 37405205
17231C7405205n310605m198280l343133k695146k158699j887654j657821j374213
$$ 37405205 32094600 27896320 24553187 21858041 19699342 17811688 16153867 14779654
17223A4779654j140209r78960r52501q97715q74249q21715p12583n82977m70282
$$ 14779654 13639445 12660485 11707984 10810269 9936020 9114305 8401722 7818745 7348463
17214G348463m16305k86414k24070k11074j55916k8236M9047L5305p0369j20210
$$ 7348463 6932158 6645744 6421674 6210600 6054684 6026448 6075495 6110800 6040431 5920221
17204E920221q1173n5652m5162K4595O3215J30629J76305K27487K67489K79757
$$ 5920221 5839048 5783396 5738234 5762829 5826044 5956673 6132978 6360465 6627954 6907711
17194F907711K61184L50376M57603N89320P15200Q15238R55116J263339J670364
$$ 6907711 7168895 7519271 7976874 8566194 9281394 10096632 11051748 12315087 13985451
17185A3985451K260716L126025M112645N232561O678301Q522380J1083320J5182744
$$ 13985451 16246167 19372192 23484837 28717398 35395699 43918079 55001399 70184143
17177G0184143J9360619J3515593o386975j7514215j3956437r787413p713938
$$ 70184143 89544762 103060355 96673380 79159165 65202728 55415315 47701377
17170D7701377o117833m376574k722762j177024K19278J617362L203446N065874
$$ 47701377 41583544 37206970 34484208 33307184 33526462 35143824 38347270 43413144
17162D3413144P691632J1124561J1319978Q14937j1440282j2010123q579201o650523
$$ 43413144 51104776 62229337 73549315 74364252 62923970 50913847 42334646 35684123
17154C5684123n506302m524238l635528k876635k316969j840931j403200j017225
$$ 35684123 30177821 25653583 22018055 19141420 16824451 14983520 13580320 12563095
17146A2563095p68101o31463n57524m19460k97928l17782l06094j70445l1952
$$ 12563095 11794994 11163531 10606007 10186547 9888619 9570837 9264743 9094298 9062346
17137I062346J30268K59307L98518N97408Q65254J218973J761892K421839L148152
$$ 9062346 9192614 9451921 9850439 10447847 11313101 12532074 14293966 16715805 19863957
17128A9863957L991940N135698O571380Q696866J1957131J3842382N649022q946308
$$ 19863957 23855897 28991595 35562975 44259841 56216972 70059354 75708376 66762068
17120F6762068j2527127q894765o454240n134973l912177k593858j397373k45902
$$ 66762068 54234941 45340176 38885936 33750963 29838786 27244928 25847555 25601653
17112B5601653P92767J902534L200225M781779P140973R799916P546125l395592
$$ 25601653 26394420 28296954 31497179 36278958 43419931 53219847 60765972 57370380
17104E7370380j0689050q958615o429188n210254m362527l496182k732157k207701
$$ 57370380 46681330 37722715 31293527 26083273 21720746 18224564 15492407 13284706
17096A3284706j789642j426190j127104q76480p14088o87535o19080n14077m67927
$$ 13284706 11495064 10068874 8941770 8065290 7351202 6663667 6044587 5530510 5062583
17087E062583m69625m11959l56500l14703k50390k03567k10920j68703j19419
$$ 5062583 4592958 4180999 3824499 3509796 3259406 3055839 2844919 2676216 2556797
17078B556797r8555p4772o7568o1594j15657j17384j33322j27607r6819p9513
$$ 2556797 2458242 2383470 2315902 2254308 2138651 2021267 1887945 1760338 1663519 1584006
17068A584006p4780l9976o0209l7159n2501n0678o4699m2745o1389o5139o0599
$$ 1584006 1509226 1469250 1409041 1371882 1319381 1268703 1204004 1161259 1099870 1034731 974132
17057I74132r259j3118o045k09j2126o716J6292k5175k0947j8401k5574k8396
$$ 974132 964873 951755 945710 945501 933375 926659 942951 917776 896829 878428 852854 824458
17045H24458j2941l2846j9008j7331L718J1756J2200j7599j3540J7747O7585P8896
$$ 824458 811517 778671 759663 742332 746050 757806 770006 752407 738867 756614 824199 903095
17033I03095N6723O5750J19493J20908J04499K9705p693n0759j21393j66223j51695
$$ 903095 959818 1025568 1145061 1265969 1370468 1400173 1392480 1341721 1220328 1054105 902410
17022I02410q9682m4478m5421n8311p7611m5462j2996r821m4387m492j173K718
$$ 902410 812728 768250 722829 664518 586907 541445 528449 518628 474241 469749 468576 471294
17010D71294p512p693J2996K1316P393k5703k1290J436m0371j7419p192L74j3043
$$ 471294 463782 456089 469085 490401 497794 472091 450801 452237 411866 394447 387255 387629 374586
16997C74586K1102K835J8962J6196p073j5863L125j4863j9051k1707j2442q976
$$ 374586 395688 398523 417485 433681 426608 410745 413870 399007 379956 358249 345807 336831
16985C36831k7786O727M4306N686P109K0627M6412N4307N2398P5914M3756J8059
$$ 336831 309045 315772 360078 365764 372873 393500 439912 494219 546617 622531 666287 684346
16973F84346k6743o3679m8882n1174r0770o6291j886k0971n2410m6900L20p572
$$ 684346 657603 593924 545042 493868 403098 336807 334921 313950 261540 214640 214960 207388
16961B07388n574k4812O107K6698K1836R974J4108l130j6800J3621n190j6849
$$ 207388 201814 177002 183109 209807 231643 241617 255725 252595 235795 249416 244226 227377
16949B27377m0056k0974K2324K109j0369k1944k0139n899j300Q730J8621K2384
$$ 227377 187321 166347 188671 190780 180411 158467 138328 132429 131129 139859 158480 180864
16937A80864n2q575o494P579J7240O882j3587j2341j0365j9759k9002k5158J1509
$$ 180864 180812 172237 165743 173322 190562 197444 183857 171516 161151 141392 112390 87232 98741
16924I8741M4517K1587j9297j8989k7263l0262K6688K2715Q652J5209k1705j8557
$$ 98741 143258 164845 145548 126559 99296 69034 95722 118437 127089 142298 120593 102036
16912A02036j4000q793J678N39k165l895Q91o924j5931P552P232o256j3520J0529
$$ 102036 88036 79243 80921 81460 79295 75400 76291 69367 53436 60988 68220 61964 48444 58973
16898E8973q380R660K4151m283J2645J0474l149j4300m86M890j7234K1380L1097
$$ 58973 50593 60253 84404 80121 92766 103240 100091 85791 85305 90195 72961 94341 125438
16885A25438P887J7924j3644J6373K745l4201M156K9829N364j8702j3963j3489
$$ 125438 133325 151249 137605 153978 156723 122522 126678 156507 161871 143169 129206 115717
16873A15717k4382R355M896Q160k6521O019m062k613j5321K340j706r766k3933
$$ 115717 91335 100690 105586 113746 87225 93244 89182 86569 71248 73588 71882 62116 38183
16860C8183K261K5235J5753n213K888j117j9682j6775J2831Q832J1233j6439k0315
$$ 38183 40444 65679 81432 76219 79107 77990 58308 41533 54364 63196 74429 57990 37675
16847C7675N469J9272j3973J4277j0647j1428j1839Q439L271J1280P585k5524
$$ 37675 43144 62416 48443 62720 52073 40645 28806 37245 40516 51796 59381 33857
16835C3857j5633Q863j5335K6980K730j4878J4731n688J6824m99k6122K6689L270
$$ 33857 18224 27087 11752 38732 41462 26584 41315 35627 52451 51952 25830 52519 55789
16822E5789J5323O829o555j4957j2494k7074k096J3072P166J1546m838J4348O892
$$ 55789 71112 77941 71386 56429 43935 16861 14765 27837 35003 46549 41711 56059 62951
16809F2951k6333K573K7232K0646j8587K744p281j1852m051P599L8943N5799m147
$$ 62951 36618 39191 66423 87069 68482 71226 63945 52093 48042 55641 94584 150383 146236
16796A46236k6972l4925q028P257j6106j4506K2968J2166J3480n370m541p359
$$ 146236 119264 84339 76311 83568 67462 52956 75924 88090 101570 96200 91659 84300
16784H4300j0844r346J8066n029k3304k497j7601M862j4055n541O325j5462p940
$$ 84300 73456 64110 82176 77147 53843 51346 33745 38607 24552 19011 25336 9874 1934
16771A934l134K8250j0728k8712J2468L2598K8892O823O445N051k7454k749N913
$$ 1934 -1200 27050 16322 -12390 78 32676 61568 68391 74836 79887 52433 49684 55597
16758E5597K5188j6441j4057K636q349L8497J1441m08l44L6544N5039O8627K958
$$ 55597 80785 64344 50287 52923 44574 83071 94512 94104 93760 130304 185343 253970 256928
16745B56928L8090J00344J21922J26455J23627M9051k7712q1976j00882q3413
$$ 256928 295018 395362 517284 643739 767366 816417 788705 706729 605847 522434
16735E22434o6134p2410n9176j4643L1528K5589K5983M7172M5124R8039R7891
$$ 522434 456300 383890 324714 310071 341599 367188 393171 440343 485467 583506 681397
16724F81397J2066k921m1343q0189r7447j03441p5651k6351k6074l1261m1184
$$ 681397 693463 690542 649199 569010 471563 368122 292471 266120 240046 208785 167601
16713A67601j0257k2396r932q486l959k6294l1330o334L5738Q817J0094k1317
$$ 167601 157344 134948 125016 116530 112571 86277 54947 48613 84351 93168 103262 81945
16701H1945j3760j9167k6924m5K2243J5008j1663m941J5933k1680l5592K4056
$$ 81945 68185 49018 22094 22049 44292 59300 47637 42696 58629 36949 1357 25413
16689B5413P453K1386l074k5653J159K3161q457O635QJ4862K25l6582k6638P809
$$ 25413 32866 54252 51178 25525 26684 49845 41388 48023 48031 62893 63118 26536 -102 7707
16675G707K0178n231j7753L8478L3130M0M958q269j9592l239O823K6465N8450
$$ 7707 27885 22654 4901 43379 76509 76549 81507 73238 53646 50407 57230 83695 142145
16662A42145L7255L7891N2796L6854K0053O8126O8641k7958m0607n2732o3994
$$ 142145 179400 217291 270087 306941 326994 395120 463761 435803 395196 342464 278470
16651B78470k4807j4228j1586o064J1192J6262R614J0214K8265N6880M6737O2364
$$ 278470 253663 239435 227849 221785 232977 249239 258853 269067 297332 354212 400949 463313
16639D63313L114o1335n5833l6653m6719n0330k9639m0437j3265m281j2657k265
$$ 463313 466427 405092 349259 312606 265887 215557 185918 145481 132216 127935 115278 113013
16627A13013r46k038R174O917l7610l7313j6635j9694l272O098j0485K1319J7815
$$ 113013 112067 110029 119203 126120 88510 51197 34562 14868 11596 17694 7209 28528 46343
16614D6343L1858K2716l4750k2643n765L1000N8410K3137L6242N2105M4581N6735
$$ 46343 78201 100917 66167 43524 37759 68759 127169 150306 186548 238653 283234 339969
16602C39969L5930l8237l1508l6796j2518l3921n4471l1565J091K0018o016J6224
$$ 339969 375899 337662 306154 269358 256840 222919 168448 136883 137974 157992 151976 168200
16590A68200N527L2794N3915M4400M6043k3348m3465l4673l9579l1018o246k5644
$$ 168200 173727 206521 260436 304836 350879 327531 284066 249393 209814 178796 172550 146906
16578A46906m2533k6264l4168l7161l651K6718j4976r151P255M152j1495n064
$$ 146906 104373 78109 43941 6780 3129 29847 14871 5720 12975 17127 5632 568
16566E68K6361j0574L728J7891k0212J9093L3476j9728k5081k7855r527J2742
$$ 568 26929 16355 20083 37974 17762 36855 70331 50603 25522 -2333 -11860 882
16554H82j7690r768J100J1602J8452j1287j0875q302l459L155J4768R417J557
$$ 882 -16808 -26576 -25476 -13874 4578 -6709 -17584 -25886 -29345 -26190 -11422 -2005 -448
16541d48J2032N458J3525K4004k6828k1963J9699j0216k5765k1498Q963L1357
$$ -448 11584 17042 30567 54571 27743 5780 25479 15263 -10502 -32000 -23037 8320
16529H320P044J6522j7040P574j4517P346K1314N705J7729J5789k045l106j8660
$$ 8320 15364 31886 14846 22420 7903 15249 36563 42268 59997 75786 73741 70635 51975
16516E1975k1769j100k7638m937K39K7391K1294k3107k5183r408M421j4440o135
$$ 51975 30206 29106 1468 -3469 -3230 24161 45455 22348 -2835 -12243 -7822 -22262 -28397
16503b8397K6019J9911l4700j5273J338J3020L2455n481l2606n403J8581J5926
$$ -28397 -2378 17533 -17167 -32440 -31102 -18082 14373 8892 -23714 -29117 -10536 5390
16491E390K0735l647l4887j6171J0507J8492P880Q762j2827n969K140p858l4172
$$ 5390 26125 22478 -12409 -28580 -18073 419 8299 17061 4234 -1735 405 -7453 -41625
16478d1625q600K4393k3051M276o415R528J0959J9726J0531M060r889J9000J8065
$$ -41625 -50225 -25832 -48883 -44607 -51022 -41494 -30535 -10809 -278 3782 -6107 12893 30958
16465C0958j0871k3473q387K3286j312J5621K091k9112k1392Q981P157N090p993
$$ 30958 20087 -3386 -11773 11513 10201 25822 27913 -1199 -22591 -13610 -6453 -1363 -9356
16452i356q109K9897K3365o055j2726l650j73J845J0294j3760J1880Q73m3212
$$ -9356 -17465 12432 35797 29742 17016 13366 13193 15038 25332 11572 23452 24325 -18887
16439a8887J0188J8032J1666O070J858k3032K434M2950M625j0353k9505k1303
$$ -18887 -8699 9333 20999 27069 28927 5895 8329 51279 55904 45551 16046 -5257
16427e257r37r906N518J2349k3565k3069J1831K5807J3313J1840j683J7447K468
$$ -5257 -6194 -16100 -10582 1767 -21798 -44867 -33036 -7229 6084 17924 16241 33688 36156
16414C6156j5176K84O675J4890j8040k6879o090O289n339J4720J4677l151L2706
$$ 36156 20980 21264 27939 42829 24789 -2090 -8180 -1891 -7230 7490 22167 19016 51722
16401E1722J6314k945j0876l612k566k4198k2757j8589R398J0687p354L611r673
$$ 51722 68036 65091 54215 50603 48037 23839 1082 -17507 -8109 2578 -4776 -1165 -10838
16388a0838k068R09N002j2747J3560K809J4289P00P793P280j0890J39m1581l5321
$$ -10838 -12906 -11997 -6995 -19742 -6182 -3373 10916 11616 19409 26689 15799 15938 -25643 -60964
16374f0964j0952M463M7363Q694j255M6437J2032o317l2117k5348p913J3347L6337
$$ -60964 -71916 -67453 -20090 -11396 -12651 33786 45818 39501 7384 -17964 -25877 -12530 23807
16361B3807J8392l592j9664j7276l3330o34K920J439n686J745J0688O286j4042
$$ 23807 42199 38607 18943 1667 -31663 -32297 -29377 -27938 -33624 -31879 -21191 -14905 -28947
16348b8947J9973l0731k4400K2430L4604k1888j4212J4619O965K1113N695k5736
$$ -28947 -8974 -39705 -64105 -41675 -7071 -28959 -43171 -28552 -21587 -474 5221 -20515
16336b0515o262K1599P924j4565j1410m160k8423K3678L6206k754k2327j2679
$$ -20515 -26777 -5178 2746 -11819 -23229 -27389 -55812 -32134 4072 1318 -21009 -33688
16324c3688j0897o612J0750j0144J6721J4657k3873K4209J0118n634n589K165
$$ -33688 -44585 -51197 -40447 -50591 -33870 -19213 -43086 -18877 -8759 -14393 -19982 -17817
16312a7817j38J7383m079j3695k966k5889k0927n894N6047J6460k2781j5125J7177
$$ -17817 -17955 -572 -4651 -18346 -21312 -47201 -68128 -74022 -17975 -1515 -24296 -39421 -22244
16299b2244P091R635J0142n347o646p20o44P600J7063O922J1954l1811m4707J2401
$$ -22244 -15153 -5518 4624 -723 -7369 -8089 -8733 -1133 15930 22852 34806 2995 -41712 -29311
16285b9311J2645j3087n672Q234j6383P71J1356Q467K4049N487l5977n069j619
$$ -29311 -16666 -29753 -35425 -27191 -43574 -42803 -31447 -22980 1069 6556 -29421 -34490 -36109
16272c6109M0858K7667O106k745j6767k2917r590m728p574j9489k2652M200N8734
$$ -36109 4749 32416 38522 35777 19010 -3907 -13497 -18225 -25799 -45288 -67940 -63740 -5006
16259e006J1505O681j1689K5o825J722N346j1736j8596j3638K9111l733j5934
$$ -5006 6499 13180 1491 1516 -5309 -3587 1759 -9977 -28573 -42211 -13100 -16833 -32767
16246c2767J5262k8853j5238J2525J3355Q744J5750K2779K1679J9708j6549m7446
$$ -32767 -17505 -46358 -61596 -49071 -35716 -26972 -11222 11557 33236 52944 36395 -11051
16234a1051p011n716J802K3330K9378j6201j4042L157j0844r523R367j4345k4249
$$ -11051 -18062 -23778 -21976 1354 30732 14531 489 3646 -7198 -16721 -7354 -21699 -45948
16221d5948J44L4546J906j4586J2255L6056L4448l6453l8571o543J5398R223j6617
$$ -45948 -45804 -11258 -9352 -23938 -11683 24373 58821 22368 -16203 -22746 -7348 1875 -14742
16208a4742Q645J5929O311k7570n472N822J262o121Q68j06m446k5090J5268K5755
$$ -14742 -6097 9832 16143 -11427 -16899 -11077 -9815 -15936 -15068 -15174 -19620 -44710 -29442 -3687
16194c687K3353K4638q792l3569q080R506K898M76J1541q132j8123p472P406j735
$$ -3687 19666 44304 35512 1943 -6137 3369 6267 6743 18284 10152 -7971 -15443 -8037 -9772
16180i772r571P598K3184r367j6762p293r016K78J7820R35P954J7043k7206r223
$$ -9772 -19343 -11745 11439 2072 -14690 -21983 -30999 -30721 -12901 -11966 -4012 13031 -14175 -23398
16166b3398j8122K7750Q366O675J048k382j140J9090K5091k5986k3777k235l2164
$$ -23398 -41520 -13770 -5404 1271 2319 -63 -1203 17887 42978 16992 -6785 -9020 -41184
16153d1184k151N418j3809L951j026M0345K0726J52j1717k0816r932P648J915
$$ -41184 -43335 -37917 -51726 -47775 -48801 -8456 12270 12422 705 -20111 -30043 -22395 -20480
16140b0480r868J746O343p81K1430K2615j5290j0283J5801Q885k4253p891J5933
$$ -20480 -30348 -28602 -22259 -23040 -1610 21005 5715 -4568 11233 20118 -4135 -12026 3907
16127C907K567l40m650o234j1421j7105K2361R807J7550R46j2395q672j2050K5169
$$ 3907 6474 6134 1484 -4750 -16171 -33276 -10915 -1108 16442 17388 4993 -3679 -15729 9440
16113I440K3959O128n498k7363j7756k192m667p04j9021p619m404J8900K0898
$$ 9440 33399 39527 34029 6666 -11090 -13282 -17949 -18653 -37674 -45293 -49697 -30797 -9899
16100i899k4913K7116L3449j6284k5816r663j0530K7589J6863J6246O651j4836
$$ -9899 -34812 -7696 25753 9469 -16347 -26010 -36540 -8951 7912 24158 30809 15973
16088A5973l4733q215k6528K9033K0868Q26j3024k105O123m0067j9904L7693L5243
$$ 15973 -18760 -26975 -53503 -24470 -3602 -2776 -15800 -17905 -11782 -51849 -71753 -34060 1183
16075A183m40m3808o154P545K3799k1298l3364J8377J7845n484M542k051k0620
$$ 1183 743 -43065 -49219 -41674 -17875 -39173 -72537 -54160 -36315 -41799 -37257 -39308 -59928
16062e9928q661m301M0555L376j2730M947P329J2416J8896K891k585l6486j3045
$$ -59928 -68589 -72890 -32335 -28959 -41689 -36742 -29413 -16997 1899 4790 2205 -34281 -47326
16049d7326j1312N807M700P452J6149j1111K1168N525O074K0494j3192j8681j5311
$$ -47326 -58638 -52831 -48131 -40679 -24530 -35641 -14473 -8948 -2874 17620 4428 -14253 -29564
16036b9564R854Q929k1485J6009m145r420R413O443M20k0795k5011j1689k2831
$$ -29564 -19710 -10781 -32266 -16257 -20402 -29822 -20409 -13966 -13546 -34341 -59352 -71041 -93872
16023i3872L3613J0942K015J3109j053K7353M486Q218p288k9251J16O934k253
$$ -93872 -60259 -49317 -47302 -34193 -35246 -7893 -3407 4811 -2477 -31728 -31612 -24678 -26931
16010b6931J1447j659K8877J5638K143k372q240k357k3547j4354o562l198j9926
$$ -26931 -15484 -17143 11734 27372 29515 27143 18903 16546 -7001 -21355 -27917 -31115 -51041
15997e1041j381j1423K5391j2486j8123j5338m397N663K2171K4565M6387J3183
$$ -51041 -52422 -63845 -38454 -50940 -69063 -84401 -88798 -83135 -60964 -36399 9988 23171
15985B3171l4339j6856J0998J039l0773j5967Q242J2526j6903n596K8773j684
$$ 23171 -11168 -28024 -17026 -15987 -46760 -62727 -54485 -41959 -58862 -64458 -35685 -37369
15973c7369J9827J4270P794p365J3766p256J0789J0869j0277j7814P792O225k1140
$$ -37369 -17542 -3272 4522 -2843 10923 3667 14456 25325 15048 -2766 5026 11251 -9889
15960i889K9392J7336l643l1862r013O984l7104j6830L3954J4373k058L298o61
$$ -9889 19503 36839 33196 1334 -7679 -695 -37799 -54629 -20675 -6302 -8360 -5062 -5723
15947e723J2064P521j523j2232K141K3j993j5621j0854J5445R431n159J4075L297
$$ -5723 6341 13862 12339 107 2248 2271 278 -15343 -26197 -10752 -1321 -6480 7595 10892
15933A0892m958j0375Q83O224l3423j1679Q635o744j5994J3644K3513q651N65
$$ 10892 5934 -4441 -3558 2666 -30757 -42436 -33801 -40545 -56539 -42895 -19382 -28033 -27468
15920b7468R867M746P954j0036l5188M772M411j731k5976k1174K2227P965q157
$$ -27468 -17601 -12855 -4901 -14937 -50125 -45353 -40942 -42673 -68649 -89823 -67596 -59631 -67788
15907f7788P898J1924j2453K8582M8625k6006n983K8710J6991j3833j3310j5353
$$ -67788 -59890 -47966 -60419 -31837 16788 -9218 -15201 13509 30500 16667 3357 -11996
15895a1996j7299j2704j5237j2966l970K5510L1445j4777k7581J6184L5066K2314
$$ -11996 -29295 -41999 -57236 -70202 -74172 -48662 -17217 -31994 -59575 -43391 -8325 13989
15883A3989q405J743q832p82p58j1662o288p456n325J5670M717j7657k6870P75
$$ 13989 5584 7327 -1505 -2287 -3045 -14707 -20995 -28451 -33776 -18106 -13389 -31046 -57916 -57141
15869e7141M920L7492R320P950l486J1028R185n69j6445k085j891j2418J014P585
$$ -57141 -52221 -14729 -5409 2541 -945 10083 19268 18699 2254 169 -1722 -14140 -13126 -5541
15855e541P718o614Q43J5230l662J8252k6829j7614L630L303k1260p764J5580
$$ -5541 2177 -4437 -3594 11636 7974 26226 -603 -18217 -14587 -11284 -32544 -40308 -24728
15842b4728j5677k8136L0701J0111j6945J0720K8140j33O647K3173K2860l2799
$$ -24728 -40405 -68541 -37840 -27729 -44674 -33954 -5814 -5947 700 23873 46733 13934
15830A3934l0076J9883j7669j7054K337j2091Q3j6664J249J6776N4422L491l0210
$$ 13934 -16142 3741 -13928 -30982 -28645 -40736 -40653 -57317 -56068 -39292 15130 18621 -11589
15817a1589j4731j0071L0566K1175j8540l8949l0469k6748K6520R201j4545K0286
$$ -11589 -26320 -36391 -5825 15350 -3190 -42139 -72608 -99356 -72836 -63635 -78180 -57894
15805e7894K8544K0933q723j2104j2267K859j655J0306K9703r955k6640j713M361
$$ -57894 -29350 -8417 -17140 -29244 -41511 -38652 -40307 -30001 -298 -10253 -36893 -38606 -34245
15792c4245J1364J572O698J539r770M693m245R07J2103q631j3672l0792m874K9311
$$ -34245 -22881 -21309 -14611 -13072 -22842 -18149 -22394 -21487 -9384 -18015 -31687 -62479 -67353 -38042
15778c8042L5988j0279k8752J708q609J141m842j6097Q759R408K4899q260O776
$$ -38042 -2054 -12333 -41085 -39377 -47986 -46845 -51687 -67784 -59025 -49617 -24718 -32978 -26202
15765b6202K3213r454r494L1802k297Q80k962R358j6552k4772q824p194K3762
$$ -26202 -2989 -12443 -21937 9865 7568 8448 5486 14844 -1708 -26480 -35304 -42498 -18736
15752a8736J9782k8602j1971o107l6262k237M176M1472L5552J2406j1358L363
$$ -18736 1046 -27556 -39527 -45634 -81896 -84133 -79957 -38485 -2933 9473 -1885 1478
15740A478J9396Q151o932K4802J378j4196j9508k3297j6797n593P309l248m778
$$ 1478 20874 29025 22093 46895 48273 34077 14569 -8728 -25525 -31118 -23809 -27057 -31835
15727c1835J7578J2588r131P692O413J9881k061j9736N678k1607k2403J30P703
$$ -31835 -14257 -1669 -10800 -3108 3305 23186 21125 1389 7067 -14540 -36943 -36813 -29110
15714b9110K3398R198k4789n182J3747K843O94N261Q925k437K4884m60k8105l9132
$$ -29110 -5712 3486 -21303 -26485 -12738 -9895 -9201 -3940 4985 2548 27432 26972 -1133 -40265
15700d0265n29L2302J8712j2048p446P571m208k0702k9826J2073K8153K1818k0748
$$ -40265 -40794 -8492 10220 -1828 -9274 -1703 -5911 -26613 -56439 -44366 -16213 5605 -15143
15687a5143j6572J024j7426L4585K0243l478o007j1699M50j8942K508K8186o950
$$ -15143 -31715 -30691 -48117 -13532 6711 3233 -2774 -14473 -14023 -32965 -30457 -2271 -9221
15674i221j3768m634N534P446m5109K0595J2425M7234J006j7816k9520J0573Q501
$$ -9221 -22989 -27623 -22089 -14643 -59752 -39157 -26732 20502 21508 3692 -25828 -15255 -6754
15661f754K2948J8248J927k0047k4034j9255k434R022K1192l843p452J0523J4815
$$ -6754 16194 34442 36369 16322 -7712 -26967 -29401 -20379 813 -3030 -10482 41 14856
15648A4856l010j7445J2982p708k5879J5238k6769k2293P307N272J7468J2803
$$ 14856 11846 -5599 7383 -325 -26204 -10966 -37735 -60028 -52721 -47449 -29981 -17178
15636a7178L305J186j2985k440K2028L3460q273j0266l4093k233L692o051q375
$$ -17178 -13873 -12687 -25672 -28112 -6084 27376 19103 8837 -25256 -27489 -23797 -29848 -38223
15623c8223J5533J0214L940Q869O10j5497J4625j9354j8259o912n542J1088N577
$$ -38223 -22690 -12476 -8536 333 943 -14554 71 -19283 -37542 -44454 -49996 -38908 -33331
15610c3331L239r80N578k2855m1032J4717j3119J7056O0544O958j1332O49J0864
$$ -33331 -30092 -31072 -25494 -48349 -89381 -74664 -87783 -70727 -10183 -3225 -14557 -13908 -3044
15597c044J1601k7939N631r502k1519J8023K1990m972K0717n158j6637J6j298
$$ -3044 8557 -19382 -13751 -23253 -44772 -26749 -4759 -9731 10986 5828 -10809 -10793 -12091
15584a2091L056j154j0546K6851j6247k5368R198L8012m053q212j6179J020K457
$$ -12091 -9035 -10189 -20735 6116 -10131 -35499 -26301 11711 7658 -554 -16733 -15713 -13256
15571a3256P17M0883J4454j9067k013K8152k7822j0307j3294n568j8200J3131
$$ -13256 -12539 28344 42798 23731 21718 49870 22048 11741 -1553 -7121 -25321 -12190
15559a2190J9598N585j4331r305N675N49L388J4396r65O6J46M654j5743j3333
$$ -12190 7408 12993 -1338 -10643 -4968 -4419 -1031 13365 12400 12466 12612 17266 1523 -11810
15545a1810J9056n245J1890m1672j1827J2301k344j1598N520K6086K9684l588
$$ -11810 7246 2001 13891 -27781 -39608 -27307 -29651 -41249 -35729 -9643 20041 16453
15533A6453M888j8170j6982l1203j466J0576r851j4872K6747K8940q063j021L413
$$ 16453 21341 3171 -13811 -45014 -46480 -35904 -45755 -60627 -33880 -4940 -13003 -14024 -10611
15520a0611l140j034m130j3042O276j482r626n720j1018L4145L8954J0732J3939
$$ -10611 -13751 -14785 -18915 -31957 -25681 -27163 -36789 -42509 -53527 -19382 19572 30304 44243
15507D4243k8089l921Q16j5763P971J2651R355J1529l7055k3660o798J5963M947
$$ 44243 16154 12233 13049 -2714 5257 17908 27263 38792 1737 -21923 -28721 -12758 -7811
15494g811P646q627k3187J4294K5065Q964r407J1597k0597J604j3321k1450J7431
$$ -7811 -165 -8792 -31979 -17685 7380 16344 6937 18534 -2063 -459 -13780 -35230 -17799
15481a7799J633n153m3478l732L6856r997K0998L0710o20l813J2342Q397j556
$$ -17799 -16166 -21319 -64797 -68529 -31673 -41670 -20672 10038 9418 5605 17947 26344 24788
15468B4788j7459m123k869J2491o511k8596j776L8369Q207n670j2772l4023m7621
$$ 24788 7329 3206 337 12828 6317 -22279 -24055 14314 22521 16851 4079 -29944 -77565
15455g7565P104K3291J4229J6797J0566K4938m1424k3299J1045q380P453L4242
$$ -77565 -70461 -47170 -32941 -16144 -5578 19360 -22064 -45363 -34318 -42698 -35245 -1003
15443a003m248j4706J5693j696n279j3479j1484J7150j5036K279K2187J0015k3917
$$ -1003 -5251 -19957 -4264 -5960 -11239 -24718 -36202 -19052 -34088 -31809 -9622 393 -23524
15430b3524p758K7560K0470J9897j6379r594j6588J8267j5155o56j4722k4468
$$ -23524 -31282 -3722 16748 36645 20266 10672 -5916 12351 -2804 -3460 -18182 -42650
15418d2650m806J3259K9498K2211M009k218J8715J3966n113l0058n599J3454R764
$$ -42650 -47456 -34197 -4699 17512 21521 19303 38018 51984 46871 16813 11214 24668 34432
15405C4432L031m0724q786q948N392J7024J5450j573j0800n046j1710k4882J3346
$$ 34432 37463 -3261 -12047 -20995 -15603 1421 16871 15298 4498 -548 -12258 -37140 -23794
15392b3794n020j5101k532j7783K4517M6637J7697k0957j9192n921O592k32n624
$$ -23794 -28814 -43915 -46447 -64230 -39713 6924 24621 3664 -15528 -21449 -14857 -15089 -20713
15379b0713o722j4027l103K3365J1353n263J6300j9384j4484q770R919j4505M765
$$ -20713 -27435 -41462 -44565 -21200 -9847 -15110 1190 -18194 -32678 -41448 -31529 -46034 -41269
15366d1269K5565J0917n732m281K2052j9951j7451L250l083L888L2412L0407O015
$$ -41269 -15704 -4787 -10519 -14800 7252 -12699 -30150 -26900 -29983 -26095 6317 36724 42739
15353D2739m958l75j9753N572R571j9194k6663M190j248k4640k4713K278L5593
$$ 42739 37781 37406 17653 23225 32796 13602 -13061 -8871 -10119 -34759 -59472 -57194 -21601
15340b1601K4495m000J4979M183j7086j2179L491p609m410O776K1885L252k69
$$ -21601 2894 -1106 13873 18056 970 -11209 -7718 -15327 -19737 -12961 8924 12176 11907
15327A1907K1890m913k1117J7196J1968j1649K838l5378j5667M302j2358j44O098
$$ 11907 33797 28884 7767 24963 36931 25282 28120 -7258 -22925 -18623 -30981 -31125 -25027
15314b5027J3705m659q551r883O089J8864P556p050q01L144N468k036J306P337
$$ -25027 -11322 -15981 -24532 -34415 -28326 -9462 -1906 -8956 -9757 -6613 -1145 -3181 -1875 5462
15300E462k2828Q858K3024l689j3940J013R447j4412j1258l1514N280K5555k694
$$ 5462 -17366 -8508 14516 10827 -3113 -2100 7347 -7065 -18323 -49837 -44557 -19002 -21696
15287b1696k4604k0046J0780J2567J9628K0672Q019j2206J079Q310j8316j394
$$ -21696 -46300 -66346 -55566 -42999 -23371 -2699 5320 -6886 -5807 2503 -15813 -17207
15275a7207N152j0220k5431k2073K1510L3756J1637M771m445l717l729M253K2731
$$ -17207 -12055 -22275 -47706 -69779 -48269 -14513 -2876 1895 -2550 -6267 -9996 -5743 16988
15262A6988L7573K4184Q778m4438k9311k8764N436R381J2098n562j5584N35l359
$$ 16988 54561 78745 87523 43085 13774 -14990 -9554 -173 11925 6363 -9221 -8686 -12045
15249a2045j2801J4019k8361j1759K5504J1904k2123O042K5J7504J9471N248j6887
$$ -12045 -24846 -10827 -39188 -50947 -25443 -13539 -35662 -29620 -29595 -12091 7380 12628 -4259
15236d259m073q806j5907K6177L6117j8413j0994n344J2666Q40k0328j6475N136
$$ -4259 -8332 -17138 -33045 -6868 29249 10836 -158 -5502 7164 8004 -12324 -28799 -23663
15223b3663j6216K1998K1843J6846j2109m7370L233K1323k1338K4184J0463J4745
$$ -23663 -39879 -17881 3962 20808 8699 -38671 -35438 -14115 -35453 -11269 -806 13939
15211A3939K033j3859J935K4947J9706k6329j4182K357j7547L891m446J2730n568
$$ 13939 15972 2113 4048 28995 48701 22372 8190 10547 -7000 -3109 -7555 5175 -393
15198c93J5636k4782J9224K2284j651M780o689n075j1931Q540P58k7258L184J9836
$$ -393 15243 -9539 9685 31969 30318 35098 28409 23334 11403 19943 20701 -6557 -3373 16463
15184A6463k3822l5352K169k108o671J4382J6764J6969J6123J4254N576j618j1821
$$ 16463 -7359 -42711 -40542 -42650 -49321 -34939 -18175 -1206 14917 29171 34747 33129 21308
15171B1308j1114j3578N400J8524O308q891k739k1148M977J4593k1480P004j0307
$$ 21308 10194 -3384 2016 20540 26848 17957 15218 -5930 -953 13640 -7840 -836 -11143
15158a1143N783K7410L619N972j3023k4130n990J0797J0977N532p265l378J0640
$$ -11143 -5360 22050 25669 31641 18618 -5512 -11502 -705 10272 15804 8539 5161 15801
15145A5801j5060l7864N731J2769J650j0853M195J7695P829r99j7464l057J1J5962
$$ 15801 741 -37123 -31392 -18623 -16973 -27826 -23631 -5936 1893 894 -16570 -19627 -19616 -3654
15131c654J0018K5572P227J3606k9137m0212L1482o032k9221k3807L171N134J5283
$$ -3654 6364 31936 39163 52769 23632 -16580 14902 8870 -20351 -44158 -40987 -35853 -20570
15118b0570K2046j9540j089K0902J3531L0481j7796j9592j7979p880P45K655K215
$$ -20570 1476 -18064 -19153 1749 15280 45761 27965 8373 -9606 -17486 -16741 -14086 -11871
15105a1871k57l200k801N870P322k7710J2414Q303J6477J4702m858m103j508r23
$$ -11871 -12128 -15328 -18129 -12259 -4937 -32647 -20233 -11930 4547 19249 14391 10288 8780 7857
15091G857k1122k6368n776l332N858J7939r297N615M4622j754j6481M46l771J5272
$$ 7857 -13265 -39633 -45409 -48741 -42883 -24944 -34241 -28626 15996 14242 -2239 -1793 -5564 9708
15077I708N238K789l653k620l1005k1525R939P782R988J22m490j2940J151J3o89
$$ 9708 14946 17735 14082 11462 -19543 -41068 -31129 -23347 -13359 -13237 -17727 -30667 -29516 -29503 -30192
15062c0192J6551M9182k5160l8328j55K3260J1738J4232q316k12J6238M481p976
$$ -30192 -13641 35541 10381 -27947 -28102 -4842 6896 21128 12812 12600 28838 33319 25343
15049B5343k3217K0336K974j4482k8886j9614J2684J3358J0644J626j6726j1499
$$ 25343 2126 22462 25436 10954 -17932 -37546 -24862 -11504 -860 766 -15960 -27459
15037b7459j946j7846j1995K9233M3580K1128m2384k4597J8630K8451j3793N143
$$ -27459 -29405 -47251 -59246 -30013 13567 34695 -7689 -32286 -13656 14795 1002 6145
15025F145r997j6760M182R677K927l903K7164J4596k0264M12n164j1456Q450j3273
$$ 6145 -3852 -20612 -16430 -6753 -3826 -7729 19435 34031 13767 14179 9015 -2441 6009 -7264
15011g264j9501j4471p718K2229J5729j734N880p665N928o674J8257k0239j1743
$$ -7264 -26765 -41236 -48954 -26725 -10996 -12730 -6850 -14515 -8587 -15261 2996 -17243 -28986
14998b8986J5535K3258R100K026K164P324j0668o798k0998j6867L955k2364m67
$$ -28986 -13451 9807 18907 20933 23097 30421 19753 12955 -8043 -24910 -20955 -43319 -43786
14985d3786J5902N14M357L084j6932J651J0263K2275J2470J3754k3361n05j8195
$$ -43786 -27884 -27370 -23013 -19929 -36861 -35210 -24947 -2672 9798 23552 191 -314 -18509
14972a8509j0663P525p266R202J9116J5309n964j534j9226p064Q463J5759R284
$$ -18509 -29172 -21647 -28913 -19711 -595 14714 8750 7216 -12010 -19074 -10611 5148 14432
14959A4432j1091j3409k291L711k3701K705K4075J842j0482P025R437J4696r395
$$ 14432 3341 -10068 -12359 -8648 -32349 -29644 -5569 -3727 -14209 -7184 2253 16949 7554
14946G554J681M798q522P417r273l5361k040K6375n752L755n308k8196J504J3692
$$ 7554 9235 14033 5511 12928 3655 -31706 -33746 -7371 -13123 -9368 -14676 -42872 -41368 -27676
14932b7676P056J7548J7332K3477k4594j0163J6391Q780o422R063k6237r236l13
$$ -27676 -20620 -3072 14260 37737 13143 2980 19371 28151 21729 30792 4555 -4681 -4994
14919d994k773J6999j252j1126K9186L1062j2459M827j0998k7946n396Q321j8144
$$ -4994 -7767 9232 7980 -3146 26040 57102 44643 49470 38472 10526 5130 13451 -4693
14906d693o261N891K2157p473l0967k0735l789L529N594J4211P160j0250o0J5737
$$ -4693 -10954 -5063 17094 9621 -21346 -42081 -45870 -42341 -36747 -22536 -15376 -25626 -25686 -9949
14892i949J2602K0418J6288j6149j1696j1370k620P785J0732O503Q123J1340m437
$$ -9949 2653 23071 39359 23210 11514 144 -2476 5309 16041 22544 30667 42007 37570
14879C7570m117k227N369Q572j6445k4566O338j2981n613q769K706R249j0510
$$ 37570 33453 31226 36595 45167 28722 4156 10494 -2487 -8100 -16869 -14163 -4914 -15424
14866a5424K5295L0628q498k7024k290J8147R366k781o212j0776j0276k91J7828
$$ -15424 9871 40499 32001 4977 2687 20834 30200 27419 21207 10431 155 -136 17692
14853A7692n275j7849k833j5024l780R588J6834J9830j0995k268L0867n426j8967
$$ 17692 12417 -5432 -8265 -23289 -27069 -17481 -647 19183 8188 5920 36787 31361 12394
14840A2394k6131n663J5004J1497k1682j1055J5065M8023J9430L435l5162k6262
$$ 12394 -13737 -19400 -4396 7101 -14581 -25636 -10571 37452 56882 60317 25155 -1107
14828a107k2024k7482J3792J8947j27q683r544J2172L1345j3002M737K0529o886
$$ -1107 -23131 -50613 -36821 -17874 -18001 -26684 -36228 -24056 7289 -5713 -976 19553 12667
14815A2667j0760r127L6693K9874j0641l0484l354J7005j751m3968k0725j088
$$ 12667 1907 -7220 29473 59347 48706 18222 14868 31873 30122 -13846 -34571 -35659
14803c5659K8411K1262r116j0049J9300j5325o225K1904K1428L330j7939j8845
$$ -35659 -7248 14014 4898 -5151 14149 -1176 -7401 14503 35931 39261 21322 2477
14791B477j9725J35J5900J7303n492L609j569j5598k0556K7544L8831J6243Q48
$$ 2477 -17248 -17113 -1213 16090 10598 14207 12638 -2960 -23516 4028 42859 59102 59950
14778E9950k1096k6217l7111J0787jo728K0086J9914j7670j6519N159K4781K49
$$ 59950 38854 12637 -24474 -13687 -13688 -20416 -330 19584 1914 -14605 -9446 15335 15584
14765A5584M056K1259J0383K1165R595j2899j5027j7427J8635q388o950k1710
$$ 15584 19640 40899 51282 72447 82042 69143 54116 36689 55324 46936 39986 18276
14753A8276O539k360j8696K824k436J467l335O851K5956R534j2646R991k6557
$$ 18276 24815 22455 3759 6583 4147 5614 2279 9130 35086 44620 31974 41965 15408
14740A5408k7557j065M006J1618L4346J9544q227N702k0092O4p797K8821M859
$$ 15408 -12149 -13214 -9208 2410 36756 56300 48073 53775 33683 33747 25950 54771 59630
14727E9630m233j1049l714j7346j3331m959J0089j8068q54r166l539K8414j0124
$$ 59630 55397 44348 40634 23288 9957 4998 15087 -2981 -3835 -13001 -16540 11874 1750
14714A750j5203P67j7329R622R424K6141K8638l6348m4404j262j2516k2720J5520
$$ 1750 -13453 -12686 -30015 -20393 -10969 15172 43810 7462 -36942 -38204 -50720 -73440 -57920
14701e7920L34K3996Q113q230K4465J4822L163J650j1086k4374J5923J4355l157
$$ -57920 -57586 -33590 -25477 -33707 -9242 5580 8743 10393 -693 -25067 -9144 5211 2054
14688B054J2119K3442J2007R888j8109l4045k8208j0786P922J5323M03j531j1932
$$ 2054 14173 37615 49622 59510 41401 7356 -20852 -31638 -23716 -8393 -7990 -9521 -21453
14675b1453J0719K477k933J3546J3689J0415m798k3478k9043M66K185K7486J1999
$$ -21453 -10734 -8257 -11190 2356 16045 26460 21662 -1816 -30859 -30393 -28208 -722 11277
14662A1277k1378k1652k1901j0991K0823L3290J4690q367K018j3329J5765J139
$$ 11277 -10101 -31753 -53654 -64645 -43822 -10532 4158 -4209 -2191 -15520 245 1384
14650A384n351K35P907J4963j4343p147m21K0853k0221p016Q743K649k357J2877
$$ 1384 -3967 -3732 4175 19138 4795 -2352 -2773 18080 -2141 -9157 -414 2235 -122 12755
14636A2755K3250k383j2264o763k9346j499J423L916L522J2741K2159J0794J384
$$ 12755 36005 33622 21358 14595 -14751 -16250 -14827 -10911 -7389 5352 27511 38305 39689
14623C9689q831m0910m534L950q060K2486K8923j7226O311J2617J0046O18J2613
$$ 39689 30858 -10052 -14586 -10636 -18696 3790 32713 15487 21798 34415 44461 45079 57692
14610E7692k079k1802m788j158j0825j5779r301k255K7652J1191Q463K5246j1824
$$ 57692 55613 33811 29023 27865 17040 1261 -8040 -10295 17357 28548 37011 62257 50433
14597E0433l4918k7582M52o455J3318j6872m242J7573K3565k6714p186Q741J7569
$$ 50433 15515 -12067 -11615 -18070 -4752 -21624 -25866 -8293 15272 -11442 -18628 -9887 7682
14584G682o531P090k8044j7698J8097N121j333K87J9494j1502n893m616J0417
$$ 7682 1151 8241 -19803 -37501 -19404 -14283 -15616 -15329 4165 -7337 -13230 -17846 -7429
14571g429J7033J6411N411K3086k9199l6155j2909J9348O844r183R640J126l4300
$$ -7429 9604 26015 31426 54512 25313 -10842 -23751 -4403 2441 -6742 2898 4024 -30276
14558c0276M2612J8596r768j4580J0353r093n574M738m22Q678l2751k3638J1188
$$ -30276 12336 30932 21164 6584 16937 7844 2270 7008 6586 15264 -17487 -41125 -29937
14545b9937K2758J9855J858l229j671J8929O614K3806O665j1170K1415P940l1811
$$ -29937 -7179 12676 14534 11305 9634 28563 35177 58983 65648 54478 75893 83833 52022
14532E2022j8011l979P501k4480j3327n997k585l952J0600j0546J8594L5498K320
$$ 52022 34011 30032 37533 13053 -274 -6271 -8856 -12808 -2208 -12754 5840 41338 43658
14519D3658J5750m2934k2843K1110J205k161M599m109k2777J914K2002k522O933
$$ 43658 59408 16474 -6369 14741 15946 13785 18384 14275 -8502 -6588 15414 12892 19825
14506A9825l4043K2172K416J6878Q860J2063r447l1076j5496K1493J285j1020
$$ 19825 -14218 7954 10370 27248 36108 48171 38724 7648 -7848 13645 14930 3910
14494C910K6916K2582k7356k9815j3099J558j0415K0291J2282K4079K0286r10
$$ 3910 30826 53408 26052 -3763 -16862 -15304 -25719 -5428 6854 30933 51219 50309
14482E0309M08o203k1229j6969P735Q924k530k1163j1495L348j0730J6396M1168
$$ 50309 50717 44514 23285 6316 14051 22975 20445 -718 -12213 -8865 -19595 -3199 37969
14469C7969K930L143k8522l747L5713l411k2505j2396J6855l365k0171j119m987
$$ 37969 40899 44042 15520 11773 47486 44075 21570 9174 26029 22664 2493 1374 -3613
14456c613l771k683J550J5262j316J6896J7433J8507k2565Q007Q895l9903l5194
$$ -3613 -7384 -10067 -8517 6745 5429 22325 39758 58265 35700 43707 52602 12699 -22495
14443b2495K2855J8842j3805P180m84J2035Q811j807K820J8330k913q495k4878
$$ -22495 360 19202 5397 12577 12093 24128 32939 31132 33952 52282 49369 40874 15996
14430A5996J5203J9543P542J91q355k4038k2751M732n13K559K7311J273k9210
$$ 15996 31199 50742 58284 58475 50120 26082 3331 8063 7550 10109 37420 38693 9483
14417I483k7349P305J2714L489M520j1426R805K371L07M953R678p281j9580M220
$$ 9483 -17866 -10561 2153 5642 10162 -1264 8541 10912 11219 16172 25850 18569 -1011 3209
14403C209N508P04J8966r097q831K7457M478j2704r039K853k2456j7901J6183
$$ 3209 8717 9421 28387 19290 10459 37916 42394 29690 20651 23504 1048 -16853 -670
14390f70K3075K1530K916N596l5801k0961M5771K0539p963l5050k5696K0586K2054
$$ -670 22405 43935 46851 52447 16646 -4315 41456 61995 54032 18982 -6714 13872 35926
14377C5926k2919j367J4645p878N730K2943j5247M988J3206J9669k441k4847j4916
$$ 35926 13007 11640 26285 18407 24137 47080 31833 36821 50027 69696 67255 42408 27492
14364B7492J0992j0058j3939J1272m522j2010J6460N161p79j3437J7356J0682
$$ 27492 38484 28426 14487 25759 21237 9227 25687 30848 30069 16632 33988 44670
14352D4670k0801k5109N505J0197Q815n458k5497j0878O68j2413L0399K8870M023
$$ 44670 23869 -1240 4265 14462 23277 17819 -7678 -18556 -17888 -30301 98 28968 32991
14339C2991k6036l2679J5203L028J3950J7078k559m126n379j1687R559J6510o048
$$ 32991 6955 -25724 -10521 -7493 6457 23535 20976 16850 11471 -216 9343 25853 19805
14326A9805J9673m76j1075L340K0564k337k1329k7886j7866O516K7474q65o762
$$ 19805 39478 39002 27927 31267 51831 49494 28165 279 -17587 -11071 16403 15538 8776
14313H776l523j6593m75L6128j4062j896K4810J3322o183k5842L3828L6677J09
$$ 8776 5253 -11340 -11815 24313 10251 8355 33165 46487 40304 14462 48290 84967 85076
14300H5076k1605m2960k0275K1071J4685l401k066K0396L114n5184j0606k20J4698
$$ 85076 63471 20511 236 21307 35992 32591 30525 50921 54035 -1149 -11755 -11975 2723
14287B723o554j9899J2950M365k0876j4622P943J4490J4645M224K9613k0531j1597
$$ 2723 -3831 -23730 -10780 -6415 -27291 -41913 -33970 -19480 -4835 -611 29002 8471 -3126
14274c126j6130j1637j1134J7602j3156O635L1196J7745P836n10p769M3471J4748
$$ -3126 -19256 -30893 -42027 -24425 -37581 -30946 250 17995 25831 25321 17552 61023 75771
14261G5771m720r018k3922j4343J1243J1495J9300l530j3191k2871M044j1580
$$ 75771 71051 62033 38111 23768 35011 46506 65806 62276 49085 26214 30258 18678
14249A8678r431r519J3761J3864K805N630J4982o239k643m833J2351L8700m864
$$ 18678 9247 -272 13489 27353 30158 35788 50770 44531 41888 37055 49406 88106 83242
14236H3242m1141k9368N986q36l2287K4355q576M020L0092K3769J228r357J8918
$$ 83242 42101 12733 18719 17883 -14404 9951 1375 5395 35487 59256 60484 51127 70045
14223G0045O9p331J0191j1726k876j211o491L436l1159K4541M42k1999j9618M451
$$ 70045 70114 62783 72974 61248 58372 57161 50670 54106 22947 47488 47930 25931 6313 10764
14209A0764j1903Q836M213K1473K6665r574K17J2208Q058J7230M023k7044J9799
$$ 10764 -1139 7697 11910 33383 60048 50474 50691 62899 70957 88187 92210 65166 84965
14196H4965P234j9362n5479k1661J7110L7879Q576j1904N781J976j8810k3586
$$ 84965 92199 72837 17358 -4303 12807 50686 59262 47358 53139 55115 36305 12719
14184A2719J2183J7481j4988R37J2434M715j0759N767p165P549l2969j6060n166
$$ 12719 24902 42383 27395 28332 40766 45481 34722 40489 33324 40873 7904 -8156 -13322
14171a3322k897K3077N086j4319M659J7883K7911J6283J7661N731l1179j9102
$$ -13322 -16219 6858 11944 -2375 2284 20167 48078 64361 82022 87753 56574 37472
14159C7472k3774J1145R241l2905J9851J5067j3289K2641J1719j9527j0376l544
$$ 37472 13698 24843 34084 1179 21030 36097 22808 45449 57168 37641 27265 23721
14147B3721J2080N183j7977j0808L4470l6957j7797r717J5148K4758j3034j8270
$$ 23721 35801 40984 23007 12199 46669 9712 -8085 -17802 -2654 22104 9070 -9200
14135i200N5435M552l0426k7736J2854J6506o245R156j0174L756j9028l2256M916
$$ -9200 46235 50787 20361 -7375 5479 21985 15740 24896 14722 18478 -550 -32806 -27890
14122b7890K2367j1253k3497J5744K8175Q406R088p209r44J3969J5872m543L624
$$ -27890 -5523 -16776 -40273 -24529 3646 12052 21140 13931 12987 26956 42828 38285 41909
14109D1909l4996p42M301j5889K0950J2120q055l755n913Q274k036L792J5835
$$ 41909 6913 6171 10472 -5417 15533 27653 19598 15843 9930 18204 16168 19960 35795
14096C5795J0186k5642j7258j3572n090m051j4826K2626K0986K0490j7332l663
$$ 35795 45981 20339 3081 -10491 -15581 -19632 -34458 -11832 9154 29644 12312 8649
14084H649P793L1439k838j7613m898j9869P153L9839L4907k8339k3921M907m515
$$ 8649 16442 47881 45043 27430 22532 2663 9816 49655 84562 56223 32302 37209 32694
14071C2694j0582j5680K8908J2127n841M80l750j7378K661N83R66o85j7199K1431
$$ 32694 22112 6432 35340 47467 41626 42106 38356 20978 23639 24222 25188 24503 7304 28735
14057B8735R38K2756l248m4323M750l265q965j614P076L3969J2727m490k515R799
$$ 28735 29673 52429 49181 4858 9608 6343 -2622 -4236 2840 36809 49536 45046 42531 52330
14043E2330k4044K901m02K2334K508j0412k038j8964l5603P345J7667J1900Q533
$$ 52330 28286 31187 30785 53119 55627 45215 43177 24213 -11390 -4045 13622 25522 34055
14030C4055J638n066k476m789j3442K8417N894k811O441n088Q487O613j3833k3968
$$ 34055 35693 30627 28151 23362 9920 38337 44231 41420 47861 42773 51260 57873 44040 20072
14016B0072q858k918j0874K8340L0491j3489k4485O75j3811J8012N096k9995J0928
$$ 20072 11214 8296 -2578 25762 56253 42764 18279 18954 5143 23155 28251 -1744 9184
14003I184O121R245k2439J3280p649r45M929J1854K2394O759r733k3084j9158
$$ 9184 15305 24550 2111 15391 7742 6797 11726 23580 45974 52733 43000 19916 758
13990G58j2102N612J3234L107L537L0083J3883o717j9549r01j1717J987J5424
$$ 758 -11344 -5732 7502 10609 14146 44229 58112 51395 31846 30945 19228 21215 36639
13977C6639j3812l1152j8701n83K9202k73R86J2391k9041L69K7099K2812K904
$$ 36639 22827 -8325 -27026 -27609 1593 1320 2306 14697 -14344 -13975 13124 35936 38840
13964C8840j404K8907M5094q93q306k6631R84J7346j8098j8637j3628J2908R166
$$ 38840 37436 66343 111437 110544 102238 75607 76591 93937 75839 57202 43574 56482 65648
13951F5648l1416j1210j145k1853j6646L9667M266K3277Q14K410N677K585j272
$$ 65648 34232 23022 21877 24 -16622 23045 27311 50588 51402 53812 59489 62074 60802
13938F0802Q497l6067M084P836k183N958J5241J244k2970j9765P634J7059N030
$$ 60802 69299 33232 37316 45152 42969 48927 64168 65412 42442 22677 30311 47370 52400
13925E2400J2463L047j3066j9211k09J4478L3902N261j490N62k0049P794R505
$$ 52400 64863 67910 54844 35633 35424 49902 83804 89065 87575 88137 68088 75882 85387
13912H5387j1712o49k8231k6026R636J4002j501l7670K661R455J18J7757j2638
$$ 85387 73675 73026 44795 18769 28405 42407 40906 3236 5897 15352 15470 33227 20589
13899B0589j3771J6168r572J0841K368k6043K032J8555j5559L305L4772M857j534
$$ 20589 6818 22986 13414 24255 26623 580 2612 21167 5608 8913 43685 48542 47008
13886D7008k5536J513P544L602q322j3327m222K1037P500p542k2442L472J2063
$$ 47008 21472 22985 30529 34131 25809 12482 8260 29297 36797 29255 6813 10285 22348
13873B2348L1047j0615J3426K4175N62j8661l6601Q493J6935J6953O120J6755
$$ 22348 53395 42780 56206 80381 80943 62282 25681 34174 51109 68062 74182 90937
13861I0937j0881N526M817k8940j5246J4394Q385p232j4169J7106J1383j6727
$$ 90937 80056 85582 90399 61459 46213 60607 68992 61760 47591 64697 76080 59353
13849E9353k9498N911K5134j0254m802J487j7632Q234j1172J2973K4974p938j8427
$$ 59353 29855 35766 60900 50646 45844 47331 29699 37933 26761 39734 64708 56770 38343
13836C8343Q130J0432L302J6849p55J05j3433r173K6529K0876o832k1512J3513
$$ 38343 46473 56905 60207 77056 76301 76406 62973 53800 80329 101205 94373 72861 86374
13823H6374L0010j8810j3511j5007j0033j3349J5472K6209j3897K879n527L273
$$ 86374 116384 97574 84063 69056 59023 45674 61146 87355 73458 76337 70810 74083
13811G4083K739r249j3882l382K153j6697J0842J966m910J1641Q204K2869O125
$$ 74083 76822 67573 53691 50309 52462 35765 46607 48573 43663 55304 63508 86377 92502
13798I2502k2440J2518J2135J0576j364O473j912L716j7926l4564J5521J3670
$$ 92502 70062 82580 94715 105291 103927 110400 108488 112204 94278 59714 75235 88905
13786H8905k3561k498J1779J4638r585j4750J4195Q267N0258J8026J8101L064
$$ 88905 65344 62846 74625 89263 79678 64928 79123 87390 137648 155674 173775 176839
13774A76839O18p830L1433O7100N3639J7984M1442N3198R3056J12772Q2603L8014
$$ 176839 177457 169627 201060 268160 321799 339783 381225 434423 527479 640251 722854 760868
13762G60868m1165q4263n2283o6616n4421n7065k9312l7938l4611J5092k8229
$$ 760868 719703 635440 583157 516541 462120 405055 375743 337805 303194 318286 290057
13751B90057p425J9328Q705j044k5571K492J2063J4296K3118N0517J9030L6343
$$ 290057 282632 301960 310665 309621 284050 286542 298605 312901 336019 386536 405566 441909
13739D41909L6393M9980O2151O5748P9778J26122J76056K03996J85124J50507
$$ 441909 478302 528282 590433 656181 735959 862081 1038137 1242133 1427257 1577764
13729A577764P6630L386q5109j12691j24735j15994j07491j11898j39813q5512
$$ 1577764 1654394 1657780 1572671 1459980 1335245 1219251 1111760 999862 860049 774537
13719G74537p8048q3335l3198o947l2882l2951m4931j4554J591j4783n759J4151
$$ 774537 696489 613154 579956 573009 540127 507176 462245 447691 449282 434499 428740 442891
13707D42891K159J8900J3954M0659N3517O4883O5420R7016J23193J38620J61540
$$ 442891 445050 463950 477904 518563 572080 636963 702383 799399 922592 1061212 1222752
13696A222752J41572J21694J51940R9150J470r4583j27707j78671j70232j51649
$$ 1222752 1364324 1486018 1637958 1737108 1738578 1643995 1516288 1337617 1167385 1015736
13686A015736j31678j07682j08690p6662p6622m6328k8417m9360k4494j9141n890
$$ 1015736 884058 776376 667686 591024 514402 468074 439657 390297 365803 346662 340772
13675C40772r99M916J2542o903M287j7996P763L9876J1035j5819j478L8363N9624
$$ 340772 339773 344689 357231 350328 354615 336619 344382 384258 395293 379474 377996 416359 475983
13662D75983O8677M6810M0489J02164R2557j5940r9156r9296p9580m9268l1516
$$ 475983 544660 591470 631959 734123 826680 810740 711584 612288 532708 483440 451924
13651D51924m369m8097n2523j5369k3065m3248j280J7008j2206m9777j9101n463
$$ 451924 447555 399458 346935 331566 308501 265253 263973 280981 268775 218998 199897 194434
13639A94434m8218J321J2637J0289j186J0578L529j3857L371J2632J9459J131
$$ 194434 146216 147537 160174 170463 169277 179855 183384 169527 172898 185530 204989 206120
13627B06120j2317l4674j2754J3225l078j2518p958r531L6373k036j870k0472
$$ 206120 193803 159129 146375 159600 156522 144004 136046 126515 162888 160852 158982 138510
13615A38510m508m63J1120l859L221J2799K2633K0044k3343M028j6142j881o686
$$ 138510 134002 133539 144659 140800 144021 156820 179453 199497 176154 180182 164040 162159 155473
13602A55473J0417J7614Q052l1251k0555P322R356K0843O947k1665q62O188j976
$$ 155473 165890 183504 191556 160305 139750 147072 156428 177271 184218 162553 161691 167879 165903
13589A65903J8241J393j5772K059n572l8831O60L0620k2065q393O915N747J9666
$$ 165903 184144 185537 169765 171824 166252 127421 128081 158701 136636 128243 135158 140905 160571
13576A60571K9064j722r666R34J7262L1208j1607l1899r596K7569J1009M0899
$$ 160571 189635 187913 178247 179181 196443 227651 216044 184145 174549 202118 213127 254026
13564B54026J1347J2418p578N3j0240J081J0674J0970J1072j3632l297j913N199
$$ 254026 265373 277791 270213 270266 260026 261107 271781 282751 293823 280191 276894 274981 280180
13551B80180k357k0885j8199n065j2032N427j4029j4165J5302M549O167Q23j009
$$ 280180 277823 256938 238739 233674 221642 227069 213040 198875 214177 218726 224893 225716 224707
13538B24707r879J6054k892K3872J274M0261O2692O1233O7816M8549l025j643
$$ 224707 214828 230882 227990 251862 253136 293397 356089 417322 485138 533687 530662 529019
13526E29019k1087J243k7790k3158m720Q267L1427j3569l1639p408q405k1472
$$ 529019 507932 509175 481385 458227 453507 461774 493201 479632 447993 440585 432180 410708
13514D10708k7821k2193l880k033k7488j1504M929j1880J8206L3856j9591l830
$$ 410708 382887 360694 356814 354781 327293 315789 320718 308838 327044 360900 341309 337479
13502C37479K5598M3657J9107K7690J5165P267M1680L7332J7797K4113L3947J0608
$$ 337479 363077 406734 425841 453531 468696 475963 517643 554975 572772 596885 630832 641440
13490F41440P3j7259r769M053J0313l3046k0958l252l0770k1404k7022k1097j3446
$$ 641440 641513 624254 614485 618538 628851 595805 574847 571595 540825 519421 492399 471302 457856
13477D57856J3147Q660K126j0270k3856M00K8133n404J9760O234J6083J0694L570
$$ 457856 471003 479663 481789 471519 447663 448063 476196 470792 490552 496786 512869 523563 527133
13464E27133K0892N074J7587O6241N985k896J2303r89j5654j1600o127J1777M238
$$ 527133 548025 553099 570686 636927 642912 640016 652319 651330 635676 624076 617949 629726 633964
13451F33964K1476l368R989J7132O059J9972j171m3876R41J1483j3107J3800K6973
$$ 633964 655440 652072 662061 679193 685252 705224 704053 660177 661118 672601 659494 673294 700267
13438G00267j2348l9378j547N092M6216L8624L8068L096J7451R883q501J9608
$$ 700267 687919 648541 646994 652086 698302 736926 774994 778090 795541 805424 796923 816531
13426H16531P61p538k0433L1443K7345j0244r165k3773j718K8047n497n402j8398
$$ 816531 817292 809754 789321 820764 848109 837865 828700 804927 803209 831256 825759 820357 801959
13413H01959L2008K6263K9128L9033J1026K3917M2435J6930Q018j0207k739L4039
$$ 801959 833967 860230 889358 928391 939417 963334 1005769 1022699 1030717 1020510 1017771 1051810
13401A051810L1372O2596P3468L4023l298p422J0829j6708K2855K4141M15J3521
$$ 1051810 1083182 1145778 1219246 1253269 1249971 1242549 1253378 1236670 1259525 1283666 1284081 1297602
13389A297602J5665K969R84M611J9771J8566J3231L8153N0348N2297o33K2038
$$ 1297602 1313267 1316236 1317220 1321831 1341602 1360168 1373399 1411552 1461900 1514197 1513564 1535602
13377A535602K76J0124M0309K2685M6128P0976L9046P802M2392N7829L0153P5140
$$ 1535602 1535878 1546002 1586311 1608996 1655124 1726100 1765146 1772948 1815340 1873169 1903322 1978462
13365A978462Q7958N7308N6686O2857Q9906K4374l7204M610Q3784J04020Q1178
$$ 1978462 2066420 2123728 2180414 2243271 2333177 2357551 2320347 2324957 2408741 2512761 2593939
13354B593939R3299R0572N2755N8104J06199R7475J01989J39033J38943J42245
$$ 2593939 2687238 2777810 2830565 2888669 2994868 3092343 3194332 3333365 3472308 3614553
13344C614553J51874J75306J37697J30454J48586J68380J90335K35808K25840
$$ 3614553 3766427 3941733 4079430 4209884 4358470 4526850 4717185 4952993 5178833
13335E178833K06164K56391K83009K71932L51276M60833N47691N84390N80228
$$ 5178833 5384997 5641388 5924397 6196329 6547605 7008438 7556129 8140519 8720747
13326H720747O78181P56380P00219P03118P67525R36161J134069J355972J727889
$$ 8720747 9398928 10155308 10855527 11558645 12326170 13262331 14396400 15752372 17480261
13317A7480261K212795K863674L734377M897418O358850Q196988J0435611J3167506
$$ 17480261 19693056 22556730 26291107 31188525 37547375 45744363 56179974 69347480
13309F9347480J6668069K0171282J9426474Q831820p303785j6522975j6297075
$$ 69347480 86015549 106186831 125613305 134445125 127141340 110618365 94321290
13302I4321290j3291972j0793488q714065o809718n151247l734168k496371j348949
$$ 94321290 81029318 70235830 61521765 54712047 49560800 45826632 43330261 41981312
13294D1981312l63526L37808P18641P76168K88042k31261n764O48938J430068
$$ 41981312 41617786 41955594 42674235 43450403 43738445 43507184 43501420 44150358 45580426
13285D5580426K357062L547201N100651P117714R710691J3039622J6753415K0477162
$$ 45580426 47937488 51484689 56585340 63703054 73413745 86453367 103206782 123683944
13277A23683944K5154534L1773000L8117692L8754819K8904503J1531185n231535
$$ 123683944 148838478 180611478 218729170 257483989 286388492 297919677 292688142
13270B92688142j6506004k1220203k1197288k0750892k2659525k3824996k1386977
$$ 292688142 276182138 254961935 233764647 213013755 190354230 166529234 145142257
13263A45142257j7196468j4069184j2032762r694439p281779n270560l904798
$$ 145142257 127945789 113876605 101843843 92149404 84867625 79597065 75692267
13256G5692267l283559k831337j955849q21131K07790J127535J846879K512791
$$ 75692267 72408708 69577371 67621522 66800391 67008181 68135716 69982595 72495386
13248G2495386L646652N499157P998392J0826941J3608916J7427673K2863961
$$ 72495386 76142038 81641195 89639587 100466528 114075444 131503117 154367078
13241A54367078K7679059K9202601K7917244K6545714K3833296J6880994L663382
$$ 154367078 182046137 211248738 239165982 265711696 289544992 306425986 310089368
13234C10089368j4984528l0648120l6485044l4130194k8632852k3494346k0023623
$$ 310089368 295104840 264456720 227971676 193841482 165208630 141714284 121690661
13227A21690661j7231662j4139751j1159445q755485o786061n204862l889922
$$ 121690661 104458999 90319248 79159803 70404318 63618257 58413395 54523473
13220E4523473k823328j926482j370403j271363j387912j578448j478969j164300
$$ 54523473 51700145 49773663 48403260 47131897 45743985 44165537 42686568 41522268
13212D1522268n95035L67777J569063K936891M610505O587192Q975908J1809165
$$ 41522268 40927233 41295010 42864073 45800964 50411469 56998661 65974569 77783734
13204G7783734J5274448J8874220J8741228R292989o681580j7365940j8338253
$$ 77783734 93058182 111932402 130673630 139966619 133285039 115919099 97580846
13197I7580846j5446876j2768495j0628781q835057p259585n933602m833121l918938
$$ 97580846 82133970 69365475 58736694 49901637 42642052 36708450 31875329 27956391
13189B7956391l156781k531366k057645j712968j428924j254695j136235j046467
$$ 27956391 24799610 22268244 20210599 18497631 17068707 15814012 14677777 13631310
13181A3631310j014765r64249r06788q40184p15754n92084n53185m79348m40374
$$ 13631310 12616545 11652296 10745508 9905324 9189570 8597486 8044301 7564953 7124579
13172G124579l69162l46682k90520k81989k65409k48554k35954k17670k16487
$$ 7124579 6755417 6408735 6118215 5836226 5570817 5322263 5086309 4868639 4652152
13163D652152j67864j81478j63667j18068j04263j06148j02298r4749p9337p7409
$$ 4652152 4484288 4302810 4139143 4021075 3916812 3810664 3708366 3613617 3534280 3456871
13153C456871o4287q9547q6352n3559n7158o0318m3051m6772m0544n4751o9911
$$ 3456871 3392584 3303037 3216685 3163126 3105968 3045650 3002599 2955827 2915283 2860532 2790621
13142B790621q2257o4162r6989q3870p6784p5140q1452m1554l655m1095n7280
$$ 2790621 2708364 2644202 2547213 2463343 2386559 2311419 2229967 2188413 2184758 2143663 2086383
13131B086383n0619m9884l5290j8990m6640m0168l4525J954l1230n0187m7454
$$ 2086383 2035764 1985880 1950590 1931600 1884960 1844792 1810267 1812221 1780991 1730804 1683350
13120A683350R94j4889m4684q473J2623J030N088j5116j4510J036j827K2388J278
$$ 1683350 1684344 1669455 1624771 1616298 1628921 1629951 1635039 1619923 1605413 1606449 1604622 1627010 1628288
13107A628288k6432k7110j3768n1475m8332n2295l1645k1534j0640j3313k5740
$$ 1628288 1601856 1574746 1560978 1509503 1461171 1408876 1377231 1355697 1345057 1331744 1306004
13096A306004j9139j4693k6304m0841m4086o7640k0079M907O762r08m5472m8432
$$ 1306004 1286865 1272172 1245868 1205027 1160941 1093301 1073222 1078129 1084891 1083983 1038511 990079
13084I90079j1311O891j4252k1314j5150P867M7953k1659l2623J8209K0120N469
$$ 990079 978768 985659 971407 950093 934943 942810 990763 969104 936481 954690 974810 980279
13072I80279Q79K0812q65l0020l8059j6890K312m912l9880j9234j7290m7516j8656
$$ 980279 981158 1001970 1001105 971085 933026 916136 918448 913536 873656 854422 837132 789616 770960
13059G70960j9620k8040R532J6821m4341n1822j5839k4861l6700k1092J6712k1385
$$ 770960 751340 723300 732832 749653 705312 653490 637651 612790 576090 554998 571710 550325
13047E50325k325n028L4974Q60L095R285q156j8661o434L282J7957j4372J068
$$ 550325 548000 542972 577946 578806 581901 591186 583030 564369 557935 561217 579174 564802 565870
13034E65870j7720j3768O270J8646J2738m3858k8967r361L300L7683o983k9485
$$ 565870 548150 534382 540652 559298 572036 528178 499211 489850 493150 530833 523850 494365
13022D94365l1278J6308l858j6848j6857j2534J9042l034J172p91J7764j9290
$$ 494365 463087 479395 475537 458689 441832 429298 448340 445306 446478 445687 463451 444161
13010D44161L37j196m3828k533Q651o00l626Q036J2646q13j1297j3232j1482N817
$$ 444161 444498 443302 399474 396941 405592 404992 401366 409402 422048 421235 409938 396706 385224 391041
12996C91041J4036R314R82l975j2359j1252m232k3988J4105K9122J7213k6420
$$ 391041 405077 414391 415373 411398 399039 387787 383555 359567 373672 402794 420007 393587
12984C93587j7908j476l447j0202q730j5391r758J827J055j0617K299n821o998
$$ 393587 375679 374203 370756 360554 351824 336433 326675 328502 329557 318940 321239 315418 308420
12971C08420j1266n679J0835L2961k51K0994l4746l4867l257J2081K0746N858
$$ 308420 297154 291475 302310 335271 335020 356014 321268 286401 283144 295225 315971 321829
12959C21829k0481J1383M2293J0019j6134l3568j5490l5089k4126q454L6385J0277
$$ 321829 301348 312731 355024 365043 348909 315341 299851 264762 240636 232182 268567 278844
12947B78844k2066J7512K2624j0983k4407p310P157j4107j8002j9895l0004n824
$$ 278844 256778 274290 296914 285931 261524 254214 261371 247264 229262 209367 179363 173539
12935A73539J4322J82K1391L3718K7452l488K66r246m2812k5608K7932L1103l487
$$ 173539 187861 188043 209434 243152 270604 267116 267382 258136 215324 189716 217648 248751 245264
12922B45264K3494K2631J5833m569m5189J332j6092k2318j5091j1082j3517J3169
$$ 245264 268758 291389 307222 302653 257464 258796 242704 220386 205295 194213 180696 193865
12910A93865J0356K5475j0912N125q427m311j2915j7066k3379L0851K4155N554
$$ 193865 204221 229696 218784 223909 215482 211171 198256 181190 157811 188662 212817 218371
12898B18371O218K0679L489k3768n8224j8809R947J7823N29L138K7610R593J041
$$ 218371 224589 245268 248757 224989 166765 147956 157903 175726 176255 179393 207003 216596 217637
12885B17637K038M427k997M156k5738J2784K5184p330q988K623j2918j1319k5383
$$ 217637 219675 224102 221105 225261 199523 212307 237491 230161 221173 223796 210878 199559 174176
12872A74176k809R77M90q21J5635Q021J3164j250R681K2299l8166j6628L4254
$$ 174176 171367 172344 172834 172013 187648 195669 208833 207583 217264 239563 201397 184769 219023
12859B19023Q810J663q938j4589j0520q780N459L2289L2867N9071M4075M2780
$$ 219023 227833 229496 220558 205969 195449 186669 192128 224417 257284 316355 360430 403210
12847D03210M0243K9427M7914O1690J15792R5517M9833k7073o5517j00524n8543
$$ 403210 443453 472880 520794 582484 698276 793793 843626 816553 751036 650512 591969
12836E91969l8761n8425l7262n3209m9970k99K5889K391j3790Q899J3794m216
$$ 591969 553208 494783 457521 404312 354342 354043 379932 382323 368533 377432 391226 387010
12824C87010k4526k3133J0110J8356L0426L3966R220O1654O0102O0943O5959R9063
$$ 387010 362484 339351 349461 367817 398243 432209 441429 503083 563185 624128 690087 789150
12812G89150J18939J72176K02640J85762J02139K2484j0112p5360q9216j23037
$$ 789150 908089 1080265 1282905 1468667 1570806 1593290 1583178 1507818 1418602 1295565
12802A295565r2431j15483j07344j08873j11206q3547l6012m2068o3789m9001
$$ 1295565 1203134 1087651 980307 871434 760228 676681 640669 598601 534812 485811
12792D85811N701j3978j4631J8102j350o762J0370K1130R34O984O7517O1507M9981
$$ 485811 491512 477534 462903 481005 479655 472893 483263 504393 505327 512311 579828 641335 691316
12779F91316N6337P5564J38070J52098J30392J30317J23838Q8354O4526j2106
$$ 691316 747653 823217 961287 1113385 1243777 1374094 1497932 1586286 1650812 1638706
12769A638706r4311j60142j45670j58519j46340j29451p2241p6606q9831p6999
$$ 1638706 1544395 1384253 1238583 1080064 933724 804273 732032 655426 565595 488596
12759D88596n5943m2358k4325k1955k3804j3109J1579K2166N662J8690n50k9838
$$ 488596 432653 390295 365970 344015 320211 307102 318681 340847 346509 365199 364649 334811
12747C34811j8666j802M492M6140M3202K4384P7346P1926N4486J04156P0069q534
$$ 334811 316145 314343 318835 364975 408177 432561 509907 581833 636319 740475 810544 802010
12735H02010r1068q0742o8750o6472p5135o4375n7985k2188m6117j9503J4529
$$ 802010 710942 630200 561450 494978 419843 355468 297483 275295 229178 209675 224204
12724B24204l7985j6714M3398p869l2566j4786R702K3340j6903o793l0969l366
$$ 224204 186219 169505 212903 205034 172468 157682 167384 190724 173821 167028 136059 132693
12712A32693J2008k9137L524o308k6054k4830j3542Q369J2835j049m114L2472
$$ 132693 144701 115564 119088 112780 86726 61896 48354 56723 69558 68509 64395 96867
12700I6867N147j8057Q757R61P692n357J219M326j007J8199q993P12p817j5480
$$ 96867 102014 83957 92714 93675 101367 96010 97229 101555 100548 118747 109754 110466 102649 87169
12686H7169N962M428k5922j954K5421J4477j8020L485j599l451j1058J121J2687
$$ 87169 93131 97559 71637 69683 95104 109581 91561 95046 93447 89996 78938 80059 92746
12673I2746O377m989j194J3560p715m95l2722o130J6103J7417K0503j0002l3374
$$ 92746 99123 94134 92940 106500 98785 98290 65568 59438 75541 92958 113461 103459 70085
12660G0085k6472J61J3796m082j52J6878L0917Lj2633j2832l3987p643J5792r546
$$ 70085 43613 43774 57570 53488 53336 70214 101131 101134 88501 75669 41682 34039 49831 40285
12646D0285k731K6817m691J7408J0241J861k3971N987J4032K5576l734k2586l237
$$ 40285 37554 64371 59680 77088 87329 89190 65219 71206 85238 110814 107080 84494 81257
12633H1257r212j7943p811K9170p105j0275k83J2225p857j4131j2710Q419j4104
$$ 81257 72045 54102 46291 75461 68356 58081 57798 70023 62166 48035 35325 43744 29640
12620B9640j3080J924P257K237R855J6844K1382k123k4840j3224j8025j6358j1742
$$ 29640 16560 18484 25741 27978 37833 54677 76059 73936 49096 35872 17847 1489 -10253
12607a0253J9452O061J6128n176J5347J4243K183J0018k9785k2649R993K6191
$$ -10253 9199 15260 31388 26212 41559 55802 57985 68003 38218 15569 25562 51753
12595E1753J3638R508L11k1846k8458N535K5349j779l2276j4360N759p000K329
$$ 51753 65391 74899 75210 53364 24906 30441 55790 54011 21735 7375 13134 6134 8463
12582H463K0233J5967j804l1557P682O474J9404J4380j0247j9622j3754p560J3508
$$ 8463 28696 44663 42859 11302 18984 25458 44862 59242 48995 29373 15619 8059 21567
12569B1567K8217m51k0906j3601J0114O928r426k6142l837K6293J5937o174o357
$$ 21567 49784 49333 28427 14826 24940 31868 22442 -3700 -7537 18756 34693 28519 22162
12556B2162K067M675J5379P462k712j0543l0598p30M559m839p359k0280j2988
$$ 22162 24229 28904 44283 51745 49033 38490 7892 7162 11721 6882 -477 -20757 -33745
12543c3745J9172K9635n333l866J0519k429j0905m082P221j982K3697J0944k09
$$ -33745 -14573 15062 9729 5863 16382 13953 3048 -1034 6187 4205 27902 38846 38637
12530C8637l0415j5285j5467J1826K6331j0148j3661o569m462K5426O897N832
$$ 38637 8222 -7063 -22530 -10704 15627 5479 -8182 -14751 -19213 6213 13110 18942
12518A8942K2052M487k0542Q342j0333p117L2848k3286j8226R768J878k181J4097
$$ 18942 40994 45481 24939 33281 22948 15831 48679 25393 7167 16935 18813 16632 30729
12505C0729j773N051j8629j7271J8879k9083k3520j3500K0218K4248k8186j7469
$$ 30729 28956 34007 15378 -1893 16986 -12097 -35617 -49117 -28899 -4651 -32837 -50306
12493e0306J9146O850Q662k5355j6061L7705L1745J6090P232p505K1034j4725
$$ -50306 -31160 -24310 -15648 -41003 -57064 -19359 12386 28476 35708 28203 49237 34512
12481C4512J3360r53j5496k0516j3134k663K7606k80q317K358m969j9141O44p661
$$ 34512 47872 46919 31423 10907 -2227 -4890 22716 22436 14119 16477 11508 -7633 -6989 -14650
12467a4650l4637k254L0930J7000k0038j2356M586J8358j2337J6756L375L364
$$ -14650 -49287 -51541 -20611 -3611 -23649 -36005 -31419 -13061 -25398 -8642 -5267 -1903
12455a903K3529M208l36K592j2663k3331K1136J3917m77R622j0226l1598o394
$$ -1903 21626 25834 25498 28090 15427 -7904 13232 27149 26672 36294 26068 -5530 -11924
12442a1924K729j0549K0828n945K2949J0362n274k7764M86J8819J399q541J250
$$ -11924 -9195 -19744 1084 -4861 18088 28450 23176 -4588 -4102 14717 16116 7575 8825
12429H825j96p605L2000k321l67n830j8319R363L89m2955k7778j741M354p46K7284
$$ 8825 8629 1024 33024 30703 30336 24506 6187 15550 15939 -27016 -54794 -56535 -52181 -52927 -25643
12414b5643N516K537K028K615J1902K14k0822o050J2390m069J5686M441K5609
$$ -25643 -20127 -17590 -15562 -12947 -1045 -831 -21653 -27703 -15313 -19382 -3696 745 26354
12401B6354J372l3443J7633Q598k3664m23P167Q739J0920o270J2507K1173J805
$$ 26354 27726 -5717 11916 20514 -3150 -3573 3594 12333 23253 16983 29490 50663 52468
12388E2468k0473j4611J4051l0761J9799L6271Q776k756j4051k9400p177N725
$$ 52468 31995 17384 31435 674 20473 56744 65520 62764 48713 19313 12136 17861
12376A7861k161j7458j7289J7281L2604J576o944M772n307J1760O96K614j6424
$$ 17861 15700 -1758 -19047 -1766 30838 32414 25470 30242 24935 36695 37391 40005 23581
12363B3581K0755M625p585j0100l9361L049J6212j0440j8851K7272J9395J0923
$$ 23581 44336 48961 41376 31276 -8085 -5036 11176 736 -18115 9157 28552 39475
12351C9475P417j607m229j0755k5266N613j1397R719R884L083l447L621k0076
$$ 39475 46892 45285 41056 30301 5035 10648 -749 8970 18854 21937 18490 22111 2035
12338B035j3918R623K0000K3699n582p550o400K909K3987j1502q662k6204j4214
$$ 2035 -11883 -2260 17740 41439 35857 28307 21907 24816 48803 37301 28639 2435 -11779
12325a1779P180j632J090J6306K629J5172j5389j8010K2414J4757P554M914p992
$$ -11779 -4599 -6231 -5141 11165 13794 28966 13577 -4433 17981 32738 40292 45206 37214
12312C7214k4908l9316k0180j3556j3877K5724N0634K7295L8824J5689j603k8019
$$ 37214 12306 -27010 -47190 -60746 -74623 -48899 1735 29030 67854 83543 81940 53921
12300E3921j4436j0521j084p084J999L735j652Q25J5364P929M91k2638j5758q156
$$ 53921 39485 28964 27880 20796 22795 26530 24878 25703 41067 48996 49487 26849 11091 2935
12286B935M152K6158J0897J1533L572j823J4531n1420k4624k295K7357L8506k8964
$$ 2935 7087 33245 44142 55675 59247 57424 71955 20535 -4089 -6384 20973 59479 30515
12273C0515m0770J9906k129q066J9861J9056M878k3723j3622k3842k2593L2009
$$ 30515 -10255 9651 7522 -544 19317 38373 43251 19528 5906 -17936 -40529 -8520
12261h520O544n479J2940P656k1748k1352M318K0496J5835J2834J0034k0901Q704
$$ -8520 -1976 -7455 5485 13141 -8607 -29959 -25641 -5145 10690 23524 33558 12657 21361
12248B1361L998M24O632j7459j8200n971l173K8368k556Q356o514J5857j5540
$$ 21361 25359 25783 32415 14956 -3244 -9215 -12388 15980 13424 21780 15266 31123 15583
12235A5583j3080J4131K0911O710j7360n400j9882q70l47J12J2888J6282J7885
$$ 15583 2503 16634 37545 44255 26895 21495 1613 743 396 508 13396 29678 47563
12222D7563M627k2499k5850q352l6020k831J0366J0269K0853N602J705l361p738
$$ 47563 52190 29691 3841 -4511 -40531 -43362 -32996 -22727 -1874 3728 5433 2072 -5666
12209e666j4552k293O89K1255R790k1881m262R306K0785p904J7641J8390p892
$$ -5666 -20218 -22511 -21822 -567 9223 -12658 -16920 -7614 13171 5267 22908 41298 33406
12196C3406k539J972j2678K603M305j4848j1341J1898K0552J0300k2938k9255
$$ 33406 30867 32839 20161 22764 27069 12221 880 12778 33330 43630 20692 -8563
12184h563j2961L486L5539J5418l571p86j7507j1106M029m615J6843J520j7717
$$ -8563 -21524 -18038 17501 32919 29348 28562 11055 -51 3978 -637 16206 17726 9
12171Ij203R601J6980l573p346k967J1702j4617J7735o279m126j6163j6685k2689
$$ 9 -1194 8407 25387 21814 14468 11501 23203 8586 26321 20042 15916 -247 -16932 -39621
12157c9621N162m884J2704K2540K5865p489L174o189o39j7641k498q841J5501
$$ -39621 -34459 -39343 -26639 -4099 21766 14277 17451 11262 10623 -7018 -9516 -18357 -2856
12144b856O746r912j0026O244R296R950L489Q919k1089k3682N851L0757q073j5030
$$ -2856 3890 -6022 -16048 -9804 -508 9442 12931 21850 761 -22921 -17070 13687 5614 -9416
12130i416m014R394J2299J088j0981J3290J3738l51j0725j3972j4636J5258J6229
$$ -9416 -13430 -4036 8263 9351 -1630 11660 25398 25047 14322 350 -14286 972 17201
12117A7201J34l0666p78j6887P52L9308J5765l491j3435M490j5648k3724p16J8902
$$ 17201 17335 -13331 -14109 -30996 -30244 9064 24829 21338 7903 12393 -3255 -26979 -27695 -8793
12103h793K1487k8623M530J9701J5690k6825k4735J6478J2816r445L0992J8505
$$ -8793 12694 -15929 -11399 8302 23992 -2833 -27568 -11090 1726 -7719 23273 41778
12091D1778k0748j4102J3066o00j583j1627J634K9075j3895l3350j3325O878K2060
$$ 41778 21030 6928 19994 19394 17811 6184 7818 36893 22998 -10352 -23677 -16799 5261
12078E261n34L317p352k1715k0708N2421K2720j3575k9782m420K3595q457k1819
$$ 5261 4727 8044 692 -21023 -41731 10690 33410 19835 -9947 -14367 9228 771 -21048
12065b1048Q015K7662j754k9293k666J9740N585o971K5564J1637l7298l6266K628
$$ -21048 -13033 14629 12875 -16418 -19084 656 6241 -730 24834 36471 -827 -37093 -34465
12052c4465J0096j998K4170O537J6886p012l8391M080j976o871K5798J452l657
$$ -34465 -24369 -26367 -2197 4340 21226 14214 -24177 -20097 -22073 -28944 -3146 -1694 -5351
12039e351p430N698R29M855n333J0310k381j1915L1981K3766m655k7455j7282
$$ -5351 -12781 -7083 -6154 -1299 -6632 3678 1297 -10618 21363 45129 40474 13019 -4263
12026d263j3903J3730K5945N360l7867j9243j0520K6565K414R46J452K5006J6735
$$ -4263 -18166 -4436 21509 26869 -10998 -30241 -40761 -14196 -11782 -10836 -9384 15622 32357
12013C2357j5142k9052j2848J7586K5686P829L02q551J0340k7672J1147J4486
$$ 32357 17215 -11837 -24685 -7099 18587 26416 26718 18167 28507 835 11982 26468
12001B6468m195p975M567P751j3889j1517L373m997M198J7025O38N9m134l1610
$$ 26468 22273 14298 18865 26616 12727 1210 4583 -414 3784 20809 21447 21506 17372 -14238
11987a4238m3445K333K3313L722l737j3187J7606J9035o117l4330J4448L9579
$$ -14238 -57683 -55350 -32037 -28315 -32052 -45239 -27633 -8598 -14715 -49045 -34597 4982
11975D982K6270k9837k4468j012N395R041P766K82p583Q605J9789R72j2303j5766
$$ 4982 31252 1415 -23053 -24065 -18670 -9629 -1863 -1581 -9164 -559 19230 20202 7899 -7867
11961g867j0383J6316L21j4069k759J5535J4824m878K2900k1379l7562j9392o65
$$ -7867 -18250 -1934 -1613 -15682 -18441 -2906 11918 7040 29940 8561 -29001 -48393 -49058
11948d9058l92L1768K853Q89K198K959j2810m340o098j2089k3199O4477N6235
$$ -49058 -49450 -17682 -14829 -13940 -11742 -8783 -21593 -25933 -32031 -44120 -67319 -2842 53393
11935E3393j9391j1760K9746j7113l9995j1321R950J4663J0743O804j8167k4294
$$ 53393 34002 22242 51988 34875 -5120 -16441 -6491 8172 18915 25719 7552 -16742
11923a6742r987J384L8859o95J1543j5294j2862J1952r668j3696k9594o975K835
$$ -16742 -26729 -25345 13514 12819 24362 9068 -3794 8158 -1510 -15206 -44800 -51775 -48940
11910d8940K4550K235K105K6736R445l5596k0365P566K5115j6065J0388j0959
$$ -48940 -24390 -22155 -20050 6686 16131 -19465 -39830 -32264 -7149 -23214 -12826 -23785
11898b3785j279O122J0864K5285j6988P020K1298J6511R341n961j5228K8854j0938
$$ -23785 -25064 -18942 -8078 17207 219 7239 28537 45048 54389 48428 33200 62054 51116
11885E1116k4911n222N507j1953k9056K2502P807j934K6460P867j8357m1010q985
$$ 51116 26205 20983 26490 14537 -14519 7983 15790 13856 40316 48183 29826 -11184 -20169
11872b0169r001j3830J2371K0336k169J9635J6664j0574l5675j3317M750o635
$$ -20169 -29170 -43000 -30629 -10293 -12462 7173 23837 13263 -22412 -35729 -30979 -37614
11860c7614L330J5427L0139J1367j366j974p737j0714l1269l7748R868L1607K7598
$$ -37614 -34284 -18857 11282 22649 21283 19309 11572 858 -30411 -68159 -58291 -26684 914
11847I14J1696j3306k3028n182Q729j2884j3410J3844J7764O641j7495J533l040
$$ 914 12610 -696 -23724 -28906 -20177 -33061 -46471 -32627 -14863 -8222 -25717 -24184 -27224
11834b7224J573J5133L3983J326l0111j7234L2029J2227R691j2442m415K3405
$$ -27224 -25651 -10518 23465 24791 -5320 -22554 9475 21702 31393 18951 14536 37941
11822C7941n757k7114j0306j2716J9319J0367j4262j1960k554j53N897K5451N390
$$ 37941 32184 5070 -5236 -17952 1367 11734 -2528 -14488 -17042 -17195 -11298 14153 19543
11809A9543J607p823k580k363J0313K9695J9321l1910j7723p560M560l263j6225
$$ 19543 21150 13327 10747 8384 18697 48392 67713 35803 18080 10520 15080 11817 -4408
11796d408j1882P268J1558O900k4581l0533K8763K8671J2620m328r973K4912j1832
$$ -4408 -16290 -9022 2536 9436 -15145 -45678 -16915 11756 24376 20048 10075 34987 23155
11783B3155j2784j34P704K3131J244j5215P848p452l5013K8344K9396J905m756
$$ 23155 10371 10237 17941 41072 42316 27101 34949 27497 -7516 20828 50224 52129 47373
11770D7373m386k598j0493j3769n918r625l4308j2926P536J2997l1342r531J3313
$$ 47373 42987 40389 29896 16127 10209 584 -33724 -46650 -39114 -26117 -57459 -66990 -53677
11757e3677K9523J5768L0297j587r345j6875j3909k6692J8246L1977O111o421
$$ -53677 -24154 -8386 21911 20324 10979 -5896 -19805 -46497 -28251 3726 9837 3416
11745C416n368p474k6141j5151n722J193r840K0918N4809K1628j4888j4868j7776
$$ 3416 -1952 -9426 -35567 -50718 -56440 -55247 -65087 -44169 10640 32268 17380 2512 -15264
11732a5264o662J4469N1320k9764k5174j1379j1554N311j4135j7349K0198L7967
$$ -15264 -21926 -7457 43863 14099 -11075 -22454 -34008 -28697 -42832 -60181 -39983 -2016
11720b016J8969M57p470N814k635m2747p786Q327L2715j6451K1166J3250l6703
$$ -2016 16953 17410 9940 15754 13119 -29628 -37414 -29087 3628 -12823 8343 21593 -15110
11707a5110m009J3386p022J0287r32k869l176j7797L885l597k1050j339Q61J9474
$$ -15110 -19119 -5733 -12755 -2468 -3400 -6269 -9445 -27242 -23357 -26954 -48004 -49343 -48482 -29008
11693b9008K1348k3108p97J9614Q166o259k1918k642R698J1294J3049j4281q689
$$ -29008 -7660 -30768 -31565 -11951 -3785 -10044 -31962 -34604 -24906 -13612 -563 -14844 -23533
11680b3533J3747P82q52J815o806J9298n071j3281Q479J1329J104J5817m913Q428
$$ -23533 -9786 -9004 -9856 -8041 -14847 4451 -620 -13901 -5422 5907 7011 22828 17915 26343
11666B6343k450k0274R393K1796k27j7872j5339M982k1218L907J49k8k477l3984
$$ 26343 23893 3619 13012 34808 34581 16709 1370 6352 -14866 -10959 -10810 -10838 -13315 -47299
11652d7299n705K1224J3753K0921N449n330j1815K582m600o103J629p597j7578
$$ -47299 -53004 -31780 -18027 2894 8343 3013 -8802 -6220 -10820 -16923 -15294 -22891 -40469
11639d0469M870N0923K8374k3832K666k5297m3818j2634M851l3201L7137M2987
$$ -40469 -35599 15324 43698 19866 22532 -2765 -46583 -59217 -54366 -87567 -50430 -7443
11627g443J2891Q441L967k5520O530N858r125o774q202k8476O643K044j041J631
$$ -7443 5448 13889 17856 -7664 -1134 4724 -4401 -11175 -19377 -47853 -41210 -39166 -40207 -38576
11613c8576K8705j1179q469K1461M373q74j383j0666Q004k879j3093R991K4296
$$ -38576 -9871 -21050 -29519 -8058 -3685 -4559 -5942 -16608 -8604 -11483 -24576 -14585 9711
11600I711J5606j6746j9876j4729L46M157o964j998n01j277J3483n361J1232J28
$$ 9711 25317 8571 -11305 -26034 -25688 -21531 -28495 -30493 -30994 -32271 -18788 -24149 -12917 -12789
11586a2789O482j3797k744J8448P842j482n656J2281J0420j3685P79P231o326
$$ -12789 -6307 -20104 -22848 -4400 3442 1960 -3696 8585 19005 5320 6099 13330 7004
11573G004l788j6399n085R196j508K016j036K412K0289q871k1844l2600p014j731
$$ 7004 3216 -13183 -18268 -9072 -10580 -8564 -9600 -7188 13101 4230 -17614 -50214 -57228 -58959
11559e8959L05l256J9490K2466K2969J3175L906l0128k257l758L1622J3776k6184
$$ -58959 -58654 -61910 -42420 -19954 3015 16190 20096 -10032 -12289 -16047 15575 29351 3167
11546C167j4325M74j3276J7271L198J6321o491l1311r447p415J097K1910J3065
$$ 3167 -11158 -10684 -23960 -6689 -3491 12830 6339 -24972 -34419 -41834 -40737 -18827 -5762
11533e762k4163l546n942k5864J2954N3345n912k2718Q036J2295l746j5873O781
$$ -5762 -29925 -33471 -39413 -65277 -52323 1022 -4890 -27608 -19572 -7277 -11023 -26896 -20115
11520b0115J3001j6587l4721N850L4064L2374J572k240r292r05R747O139P414
$$ -20115 -7114 -23701 -58422 -52572 -18508 13866 15438 13198 3906 3001 12748 18887 26301
11507B6301k324k333j9259j2689m855l022K3650J5521J6749k317k8704j8419L205
$$ 26301 23977 21644 2385 -10304 -15159 -18181 5469 20990 37739 35422 6718 -11701 -8496
11494h496k026P640P226O06R727k394K1258j241r648n902k3889P792j6424k5459
$$ -8496 -10522 -2882 4344 4950 14677 12283 33541 32300 22652 16750 -7139 653 -15771 -41230
11480d1230L1001L4647q845j2626L110K4629J706L184L3059j631j9942k8192j8471
$$ -41230 -10229 24418 15573 2947 6057 30686 32392 35576 68635 67004 47062 18870 399
11467C99j0061J3065J1186p075M102K495J3986j4118j166r357k2578J0374P46
$$ 399 -9662 3403 14589 7514 11616 14111 28097 13979 12813 3456 -19122 -8748 -8002
11454h002M358j379n979j9639R678J6626j4844j5823n748k3335J8798L4756J7896
$$ -8002 -3644 -5023 -11002 -30641 -20963 -4337 -19181 -35004 -40752 -64087 -45289 -10533 7363
11441G363K6657k0376l9740q210J1993k331q512n697n473M088J8197N023O698
$$ 7363 34020 13644 -26096 -34306 -22313 -24644 -33156 -38853 -44326 -40238 -22041 -17018 -10320
11428a0320m445n021q142N482l447K3679K5544j8488k18K2594k5065m0558j6467
$$ -10320 -14765 -19786 -27928 -22446 -25893 -2214 23330 4842 4624 27218 2153 -38405 -54872
11415e4872K945K8934R812k456R045K3080L92J2143l753o218J753j2453j9924
$$ -54872 -51927 -22993 -13181 -15637 -6592 16488 16880 29023 25270 19052 20805 8352 -11572
11402a1572q640L2030J4472j2440j7987q644r078P7J9032J1966j3176n050n022
$$ -11572 -20212 11818 26290 13850 -4137 -12781 -21859 -21782 -2750 9216 -3960 -9010 -14032
11389a4032J2218o12p345Q240N453J0388l3588m6585R504M2059l244l340K0295
$$ -14032 -1814 -2426 -9771 -1531 3922 14310 -19278 -65863 -56359 -14300 -17544 -20884 -589
11376e89m866l0818k0932L3045J9158q169P622j5614m773R367p674Q193J3601
$$ -589 -5455 -36273 -57205 -24160 -5002 -13171 -5549 -21163 -25936 -16569 -24243 -16050 -2449
11363b449J2893j7443K0935j495l6244J6543K0644p132K791j3390q507j0650l2508
$$ -2449 10444 -6999 13936 12441 -23803 -7260 13384 6252 9043 -4347 -12854 -23504 -56012
11350e6012k983N4865J5613j7852j9377L363L335l050J345k1474j5802l9116O491
$$ -56012 -58995 -4130 11483 -6369 -25746 -22383 -19048 -22098 -20753 -42227 -58029 -97145 -90654
11337i0654J8758J2454J528J2883P357R206n970J5114Q996J5352j3694J5095M3046
$$ -90654 -71896 -59442 -57914 -45031 -37674 -28468 -34438 -19324 -10328 5024 -8670 6425 49471
11324D9471J3214m2208m0903M378K3041n646l616K526K977J0509k70k5300J8077
$$ 49471 62685 20477 -20426 -16048 6993 1347 -2269 257 3234 13743 13473 -11827 6250
11311F250p188O946J9087K3139j9095j2295k056j2369J5104K0980K3828k0071
$$ 6250 -938 6008 25095 48234 29139 16844 14788 2419 17523 38503 62331 42260
11299D2260j4203j4106J8217J9755J4285P092R459K1405J3384J532O510j8986
$$ 42260 28057 13951 32168 51923 66208 73300 82759 104164 117548 119080 125590 106604
11287A06604l0528j8524M285J1101k5702J1537J039l9732J1840K4625l2255p059
$$ 106604 76076 57552 61837 72938 47236 58773 59812 20080 31920 56545 24290 17231
11275A7231q227M77p56L2383k3695j4161J0579m848j5890k0976J7400K4636J6181
$$ 17231 9004 9481 8725 41108 17413 3252 13831 8983 -6907 -27883 -10483 14153 30334
11262C0334l173j8100l0964j1597J6486J2548j3391k0368j2697P229J0634K2952
$$ 30334 27161 9061 -21903 -33500 -17014 -4466 -17857 -38225 -50922 -43693 -33059 -10107
11250a0107J1201J2237J4650q212l7113o687K7081J9515M999L079n085k7864j1147
$$ -10107 1094 13331 27981 19769 -17344 -24031 3050 22565 27564 30643 25558 -2306 -13453
11237a3453J2795j7361j1471J0868K6291R835j3968k771j1826k854L913J1741
$$ -13453 -658 -18019 -29490 -18622 7669 17504 3536 765 -11061 -13915 -10002 1739
11225A739n081k5412O894J9818J771K342k974j3301J2100J3144R07k1202N113
$$ 1739 -3342 -28754 -21860 -2042 -271 2071 -903 -14204 -2104 11040 11947 -9255 -4142
11212d142J5160Q840N189J5673J2086J4928m966k017K194O056k6664k6437j3215
$$ -4142 11018 19858 25047 40720 52806 67734 62768 60751 62945 69001 42337 15900 2685
11199B685k7072K6868K5143J000j8779j179J8479N751k3241n317K0802Q168m800
$$ 2685 -24387 2481 27624 28624 9845 8666 27145 32896 9655 4338 25140 33308 28508
11186B8508J2425L3951q318m2485j0040K423J9433J1813K3508N552j2833J4529
$$ 28508 40933 74884 66566 24081 14041 16464 35897 47710 71218 76770 63937 78466
11174G8466j0090l3697l628j6173L5456k61J272k1515j8061j4500j3727l723j9879
$$ 78466 68376 34679 31051 14878 50334 50073 51345 29830 11769 -2731 -16458 -20181 -40060
11161d0060K285J3530k788j7192l019p741j842j6491o120p72J0130j2693J1307
$$ -40060 -37775 -24245 -27033 -44225 -47244 -54985 -56827 -73318 -79438 -80210 -70080 -82773 -71466
11148g1466L2971m726j7543o253K068J5949K5716k645Q512q41j759K430M30J653
$$ -71466 -38495 -43221 -60764 -67017 -64949 -49000 -23284 -25929 -17417 -18258 -20017 -17587 -17157 -15504
11134a5504K484r509K493J7836M996l4924p2K4400J3268J3790j5197Q052j3448
$$ -15504 -13020 -22529 -20036 -2200 2796 -32128 -32200 -7800 5468 19258 4061 12113 -1335
11121a335j0137Q352j3296m845Q90P359j4490O407K1652Q666k9552j827k3902
$$ -1335 -11472 -3120 -16416 -21261 -20371 -13012 -27502 -21095 557 9223 -20329 -22156 -46058
11108d6058K379n602J6720K1689k773l3126p658N912K4191J8741l720k598j593
$$ -46058 -43679 -49281 -32561 -10872 -13645 -46771 -54429 -48517 -24326 -5585 -9305 -11903 -13496
11095a3496k3263k075K2904J7086M427j2035j0097J2829j231R661K3349O219j0673
$$ -13496 -36759 -38834 -15930 1156 5583 -6452 -16549 -3720 -4951 4710 28059 34278 23605
11082B3605k801j1498J803n192q96J4262n97k0285n367N917J2626J1628k5989
$$ 23605 20804 9306 11109 5917 5021 19283 18686 -1599 -6966 -1049 11577 23205 -2784
11069b784Q664k6541l2415j0436K9842L8134M045k3503L148J8002j6657j1692
$$ -2784 5880 -20661 -53076 -63512 -33670 4464 8509 -14994 -11846 6156 -10501 -22193
11057b2193J474p951k0993j6608k108p592J3571J0226L7987p104j9168K656J3585
$$ -22193 -20719 -28670 -49663 -66271 -68379 -75971 -62400 -52174 -14187 -21291 -40459 -37803 -24218
11044b4218Q257j9368L575N835K0310M1714M508j5594j8064k441J0588j5625j8620
$$ -24218 -15961 -35329 -31754 -25919 -5609 36105 40613 25019 6955 4514 15102 -523 -19143
11031a9143J4913K5335r778J2813J8788j1578k536j442J8643l6606j4652K1209
$$ -19143 -4230 21105 11327 24140 42928 31350 28814 27372 46015 9409 -5243 15966
11019A5966J6223J8748l20j9474j4709o922L341j678Q336J0447J2359l032k0566
$$ 15966 32189 50937 50617 31143 16434 9512 12853 11175 19511 29958 42317 39285 18719
11006A8719q317K0853K388o728k6492j5805j2876L043K9433J8127o161q721n862
$$ 18719 10402 31255 33643 26915 423 -15382 -28258 -25215 4218 22345 16184 7463 1601
10993A601J2362J1629k0353j4388J2887L225J283o746O58j9094j7302K1021m984
$$ 1601 13963 25592 5239 -9149 3738 6963 8246 1500 2158 -16936 -34238 -13217 -18201
10980a8201j0131J1015Q56J2452L3239J7539k2372j848m946J928K095Q758l7210
$$ -18201 -28332 -17317 -16461 -4009 29230 46769 24397 22549 17603 19531 21626 30384 -6826
10967f826k6099j4385M2037K5332m674N114K5309j2632p217K0194m306n539J3419
$$ -6826 -32925 -47310 -5273 20059 15385 20499 45808 33176 25959 46153 41847 36308 49727
10954D9727J5124k5471l3764J072J6338K687J0454k273K0801L6877o731j2690
$$ 49727 64851 39380 5616 6688 23026 25713 36167 33894 54695 91572 84841 72151
10942G2151k9803k1592j8513q298J1357M363l7238j0368L0130j2822K095J6663
$$ 72151 42348 20756 2243 -6055 5302 9665 -27573 -37941 -7811 -20633 -18538 -1875
10930a875J0819l090j1630k8091R602J1320J9437J5802M636m0546r361K0098p352
$$ -1875 8944 5854 -5776 -33867 -24265 -12945 6492 22294 26930 -13616 -22977 -2879 -10231
10917a0231J1266l614L4317J3877j3382j1042l0119K1J1085J1127K4553k1607
$$ -10231 1035 -2579 31738 45615 32233 21191 -8928 -8907 2178 13305 37858 16251
10905A6251j1084j181l4154K1070R35K1271K6112J6348j4248j1704L171l2680
$$ 16251 5167 3986 -30168 -9098 -8163 13108 39220 55568 41320 29616 32787 107
10893A07l3395K3747J6566j6702o704R319K3097o823j6519J7422N0K7859m731
$$ 107 -33288 -9541 7025 -9677 -16381 -7062 16035 9212 -7307 10115 10165 38024 33293
10880C3293o646j4857j0716j2485j7677n247N1282J808k5531J725J1405J7340
$$ 33293 26647 11790 1074 -11411 -29088 -34335 16947 18755 -6776 -5051 6354 23694
10868B3694j6763l2900j3884k7955J651J6195J6760m518J5811l272J327M1780
$$ 23694 6931 -25969 -39853 -67808 -66157 -49962 -33202 -37720 -21909 -25181 -23854 17926
10856A7926K6799N401m4422J200O002j9195k3803L416K1700M1809o343l3356k9163
$$ 17926 44725 50126 5704 6904 12906 -6289 -30092 -26676 -4976 36833 30490 -2866 -32029
10843c2029m322J6731J6520J6515J7240o450j5104J3034J568j8247j338j8126
$$ -32029 -36351 -19620 -3100 13415 30655 24205 9101 22135 23703 5456 4118 -14008
10831a4008j8592J4842L8284k1719k2025L368K4895m512r120Q680J4855L255n604
$$ -14008 -32600 -17758 20526 -1193 -23218 -19850 5045 533 -8587 93 14948 18203 12599
10818A2599n428j074J714k057Q085N676j887j3260k4636n403l498l044K1392L550
$$ 12599 7171 6097 7811 5754 13839 19515 17628 4368 -20268 -25671 -29169 -32213 -10821 -7271
10804g271k0763J517J2222J8633J4676Q011R301m137k6295j7378O998K3464L4298
$$ -7271 -28034 -26517 -14295 4338 19014 27025 36326 32189 5894 -11484 -4486 18978 53276
10791E3276J4574j9165k5059k5538l202J381J136K0876P543j3477l0881M513P280
$$ 53276 67850 48685 23626 -1912 -5114 -3733 -2597 18279 25822 12345 -18536 -14023 -6743
10778f743j6384j1464N398J581j4341k0016j7196J7707N968L6607J1917J3376
$$ -6743 -23127 -34591 -29193 -27612 -41953 -61969 -79165 -61458 -55490 -18883 -6966 6410
10766F410J2166K2063l32j0255k1177p850m16k542q332J4769J5346N197m43j3218
$$ 6410 18576 40639 40307 30052 8875 1025 609 -1933 -10265 4504 19850 25047 24604 11386
10752A1386j5404K2693J4500k35p559J167j2115l085P311J2877r73r868J720r293
$$ 11386 -4018 18675 33175 32940 25381 26548 14433 11348 18659 31536 30563 20695 22415 13122
10738A3122m375P782K0188L733K0604J7522L7106r466m1960k7006j186k095N79
$$ 13122 8747 16529 36717 40450 61054 78576 115682 106216 64256 37250 36064 33969 34548
10725C4548J5262J1498O903J5626k7902k8430m080R133j5094L385K3388k2138
$$ 34548 49810 61308 68211 83837 55935 27505 23425 32558 17464 20849 44237 22099
10713B2099J981N709m2959n703r901j0305p065J2740R588j0728j9730J3139K0919
$$ 22099 24080 29789 -13170 -18873 -28774 -39079 -46144 -33404 -23816 -34544 -54274 -41135 -20216
10700b0216Q932M1443J8646j0252l0260k1829N199m505K7571L701j3942q927Q195
$$ -20216 -11284 30159 48805 38553 8293 -13536 -8337 -12842 14729 18430 4488 -4439 3756
10687C756J774M235J1113q852j3611l0792Q449K5315j337O437M863k361j923k4660
$$ 3756 5530 9765 20878 12026 -1585 -32377 -23928 1387 50 6487 11350 8989 7066 -17594
10673a7594k704J9036k8942l9285J9744J0833j0919O627L3343k8682j485P318
$$ -17594 -20298 -1262 -30204 -69489 -49745 -38912 -49831 -43204 -9861 -38543 -40028 -32710
10661c2710J0606R111N955R929J3466N217j3800J0084J3860K5200K7311j2136
$$ -32710 -22104 -12993 -7038 2891 16357 21574 7774 17858 31718 56918 84229 72093
10649G2093j9004l2250j7220n836p864j2211J355J643J194k009p374J2053K7263
$$ 72093 53089 20839 3619 -2217 -10081 -22292 -20937 -19294 -18100 -20109 -27483 -15430 11833
10636A1833n492J9731L450j4142k3728l798N44J6356R692q967J5458L9472j6395
$$ 11833 6341 26072 29522 15380 -8348 -12146 -11602 4754 14446 5479 20937 60409 44014
10623D4014k8719j2650Q478k0664J883k905m838J8667J8323o569k0375k4433R713
$$ 44014 15295 2645 11123 -9541 -7658 -10563 -15401 3266 21589 15020 -5355 -29788 -20075
10610b0075L4995n406o968O872O570J089l26k97N228J3363o230K354J0054l315
$$ -20075 14920 9514 2546 9418 15988 17077 16751 16454 21682 35045 28815 31169 41223 37908
10596C7908j2717l1774L850m511N735L6940K3235J79r740Q428n865k1785j4639
$$ 37908 25191 -6583 -2733 -7244 -1509 35431 58666 58845 49105 57533 51668 29883 15244
10583A5244J0797N461J3358l479l7142Q70R760L59j7123p802j1946N10R432L5523
$$ 15244 26041 31502 44860 41381 4239 5109 14869 15228 -1895 -9697 -21643 -21133 -11701 23822
10569B3822m210J5413J6989O991j464j9280k4204j2236j3407k415j775J2426M8440
$$ 23822 19612 35025 52014 59005 57541 38261 14057 1821 -11586 -14001 -15776 -3350 45090
10556D5090J4291k620J2610p27N175r644Q282k2986L2348N5621L6838J450P758
$$ 45090 59381 56761 69371 68644 73819 64175 72457 49471 81819 137440 174278 175728 183486
10543A83486J0605l745n889k4491K894M880r084k165k5724j6895k6876j3162J1731
$$ 183486 194091 190346 184457 159966 162860 167740 158656 156491 130767 113872 86996 73834 85565
10530H5565K554J3377R622r523k0636n16L638O365J9806j2805L148L1426J3467
$$ 85565 88119 101496 111118 101595 80959 80443 84081 90446 110252 97447 100595 132021 145488
10517A45488J5899L8362R522M0083O8998M5528K8210J7722K8926L2834K3736O345
$$ 145488 161387 199749 209271 249354 318352 363880 392090 409812 438738 471572 495308 501653
10505E01653k0689k4070k4680k5158k5007n2853j4672j7980l6480k8180k9412
$$ 501653 480964 456894 432214 407056 382049 329196 314524 296544 260064 231884 202472
10494B02472K4033K2493j2374j9382K405K2199K7881j5379P972r643o530L1398
$$ 202472 226505 248998 236624 217242 219647 241846 269727 254348 262320 252677 246147 277545
10482B77545K3409J7916M4851L4327J1188L5671N5385M7824N9752O1781L4684
$$ 277545 300954 318870 363721 398048 409236 444907 500292 548116 607868 669649 704333
10471G04333J2191k2416m6328r1295k6260l2849l4390o2972m4620m8791n0304
$$ 704333 716524 694108 647780 556485 530225 497376 462986 400014 355394 306603 256299
10460B56299k5547J2161q427J1081k4691j3274R079q758l5264j2475N971m8L808
$$ 256299 230752 242913 234486 245567 220876 207602 216681 207923 172659 160184 166155 166107 169915
10447A69915K9856J4283L2193p431J4018O1233L9619O325M3023N3492L4959J3447
$$ 169915 199771 214054 246247 238816 252834 314067 353686 360011 403034 456526 491485 504932
10435E04932M129J93k2962o2911m3120l9027n9439m6702j9354j0039L309m433
$$ 504932 509061 509254 486292 423381 380261 341234 281795 235093 215739 205700 209009 204576
10423B04576j4601k0588Q833k311l875l0531j4963N465k4659l0285p734L2731
$$ 204576 189975 169387 178220 175909 172034 141503 126540 132005 107346 77061 69327 102058
10411A02058J6547m268K5972j5436J1722L1936j2704j876J5609M5842O992L100
$$ 102058 118605 114337 140309 124873 136595 168531 155827 153951 169560 215402 222394 225494
10399B25494j5380k5841J5913j3716k9715j8767K5797r174j6449J3913O00j9032
$$ 225494 210114 184273 200186 186470 156755 137988 163785 154611 138162 152075 152675 133643
10387A33643r196K3742k535l124k9342l7471J2000K2533j4020j2256K1374j0425
$$ 133643 124447 148189 145654 142530 113188 75717 87717 110250 96230 83974 105348 94923
10375I4923j3126L8099L7627R62J5066K5800m347j6656J243K2233K6000L3811
$$ 94923 81797 119896 157523 158485 173551 199351 195004 178348 179591 201824 227824 261635
10363B61635j8857J6787k461J1733J1782j666k1729k202M2613O5903N0713M6997
$$ 261635 242778 259565 257104 268837 280619 278953 257224 255022 297635 363538 414251 461248
10351D61248O2090O6093R0300J23835J55958J84275J84107J90879J61452J27622
$$ 461248 523338 589431 679731 803566 959524 1143799 1327906 1518785 1680237 1807859
10341A807859N0775N2021J9121p0948j15595j35514j56970j42762j62387j67126
$$ 1807859 1858634 1910655 1929776 1858828 1743233 1607719 1450749 1307987 1145600 978474
10331I78474j08082q1517p9956q3035m1982l0135n8399j3115n9342n7122k8141
$$ 978474 870392 788875 708919 625884 583902 553767 495368 482253 422911 365789 337648
10320C37648k6431K3596O938k8694k5764k948k838j6066j6997j6680J635j0906
$$ 337648 311217 334813 341751 313057 287293 284345 281507 265441 248444 231764 233399 222493
10308B22493j2422r444K5609K5765k5461l6485j331L1018M7971J8879l14p074
$$ 222493 210071 200627 226236 252001 226540 190055 188724 219742 267713 286592 286278 279204
10296B79204k1927L907J6937n124J6104j4128l2144J0821J0027k0699p822K5954
$$ 279204 257277 261184 278121 272997 289101 274973 242829 253650 263677 242978 235156 261110
10284B61110K0374P700p477R283L4732K4288j0440R169k2616j6554l9150k4503
$$ 261110 281484 289184 281707 290990 325722 350010 339570 348739 326123 309569 270419 245916
10272B45916L2922J6014M119j2891k5729L215J7451L3696L8467k0904l0631L9041
$$ 245916 278838 294852 298971 286080 260351 263566 281017 314713 353180 332276 301645 340686
10260C40686R061k9331q08L4271L820m88J4740q549J2910J8114L908N767M0285
$$ 340686 349747 320416 319608 353879 357699 357211 371951 363402 376312 394426 398334 404101 444386
10247D44386P339j8732j1452K1528J9718J7361K01j2220m42k8479m721K1027j5769
$$ 444386 451725 432993 421541 443069 462787 480148 480349 468129 467687 439208 434487 455514 439745
10234D39745j1492o866J9882p912L307j7880j6269P005J8946J7923K9863k944
$$ 439745 428253 421387 441269 433357 436664 418784 402515 409520 428466 446389 476252 473308
10222D73308J3854K2987O109K0329N250m222M170J063j2227L1718K5803J7697
$$ 473308 487162 510149 516258 536587 541837 537615 541785 542848 530621 562339 588142 605839
10210F05839L8204K2491M4645L6187J3856j7889R367j0277J1651K7221N1694N5803
$$ 605839 644043 666534 711179 747366 761222 743333 752700 742423 754074 781295 832989 888792
10198H88792R909K466r315J770q974L8792L2727K244K5154K3300R718R824K1530
$$ 888792 898701 901167 891852 893622 884648 923440 956167 958411 983565 1006865 1016583 1026407 1047937
10185A047937N7423N5986N4245L4513M1412N3273M8186L8362L6882P1886J00796
$$ 1047937 1105360 1161346 1215591 1250104 1291516 1344789 1392975 1431337 1468219 1540105 1640901
10174A640901P2818K7680O7656R0896Q0237J08550J53250J16865J13114J46802
$$ 1640901 1713719 1741399 1809055 1899951 1980188 2088738 2241988 2358853 2471967 2618769
10164B618769J89556J87457K29358K81231L01547L60623M30204N33302O53793
$$ 2618769 2808325 2995782 3225140 3506371 3807918 4168541 4598745 5132047 5785840
10155E785840P70524R52398J227625J561160J991371K508587L110195L889637
$$ 5785840 6556364 7508762 8736387 10297547 12288918 14797505 17907700 21797337
10147B1797337M746130M945744L216024m30931l325823l915226l391637k775176
$$ 21797337 26543467 31489211 34705235 34274304 30948481 27033255 23641618 20866442
10139B0866442k288308j797986j335298r27994n57895k22891Q9385L83848P35891
$$ 20866442 18578134 16780148 15444850 14516856 13958961 13736070 13825455 14209303 14945194
10130A4945194Q64300N39602r0255m23025k37209J06524M58240Q54067J338641
$$ 14945194 15809494 16349096 16258841 15835816 15598607 15705131 16163371 17017438 18356079
10121A8356079J856425K477862L277000M238844N452133O970818Q700819R604386
$$ 18356079 20212504 22690366 25967366 30206210 35658343 42629161 51329980 60934366
10113F0934366Q457010O608063O715921P328306M874726m31637m059157m959551
$$ 60934366 69391376 75999439 82715360 90043666 94918392 94486755 90427598 85468047
10105H5468047o459129q630473q832408p355717n705971m246508l046838k365822
$$ 85468047 79008918 70378445 61546037 54190320 48484349 44237841 41191003 38825181
10097C8825181k190539j855508j512747j334055r62378l01255L95740P86976O56207
$$ 38825181 36634642 34779134 33266387 31932332 30969954 30668699 31064439 31851415 32507622
10088C2507622O03921J177935K135022L276241M632344O177293P457317P204749
$$ 32507622 33111543 34289478 36424500 39700741 44333085 50510378 57967695 65172444
10080F5172444N343376M575544O601036R988047J3558816J6196225J4172860M102370
$$ 65172444 70515820 75091364 81692400 91680447 105239263 121435488 135608348 139710718
10072A39710718q148029j3452820j2559489r791002p234645o151654p035799p970627
$$ 139710718 131562689 118109869 105550380 95759378 88524733 82373079 75337280 67366653
10064F7366653p756953o713017n432167m259562l168368k275384j808136j890914
$$ 67366653 59609700 52896683 47464516 43204954 40036586 37761202 35953066 34062152
10056C4062152j825817j258471n31041J45842O97661R79354J023435J073135J278595
$$ 34062152 32236335 30977864 30446823 30592665 31290326 32269680 33293115 34366250 35644845
10047C5644845K171899L516421N013112O698069P906305P237538N275404M839506
$$ 35644845 37816744 41333165 46346277 53044346 60950651 68188189 73463593 78303099
10039G8303099N609223M599580J072959k717255m541979n368753p355448r176055
$$ 78303099 83912322 88511902 89584861 86867606 82325627 76956874 69601426 60425371
10031F0425371q837308p421250o073815m952796m011570l231528k566227k049787
$$ 60425371 51588063 44166813 38092998 33140202 29128632 25897104 23330877 21281090
10023B1281090j548453j121783p57583l84174r6961k19033p24954j112333j005688
$$ 21281090 19732637 18610854 17853271 17469097 17372136 17153103 16428149 15315816 14310128
10014A4310128p24133m49904j67393J39616M68661Q96198J333776J851865K482361
$$ 14310128 13585995 13136091 12968698 13108314 13576975 14473173 15806949 17658814 20141175
10005B0141175L174876L781310L755678J995605j248856l634374m020154l524148
$$ 20141175 23316051 27097361 30853039 32848644 31599788 27965414 23945260 20421112
9997B0421112k947145k502166k105356j697703j349036j105560r44578p81304
$$ 20421112 17473967 14971801 12866445 11168742 9819706 8714146 7769568 6988264
9989F988264o68207n61529m69132m23702l71725l14623k84473k82148k36222j93086
$$ 6988264 6320057 5758528 5289396 4865694 4493969 4179346 3894873 3612725 3376503 3183417
9979C183417j80024j48474j57726j12441j37832j39427j30764j22041p3155l5138
$$ 3183417 3003393 2854919 2697193 2584752 2446920 2307493 2176729 2054688 1981533 1946395
9969A946395o7373o9162m9686o5077q1908o5189k4396M4l4848n1505k6830n2510
$$ 1946395 1879022 1809860 1760174 1695097 1613189 1548000 1523604 1523648 1488800 1437295 1410465 1357955
9957A357955l0408j3100j5123j2959k6729m158r872k9400o451P676j1252k8631
$$ 1357955 1327547 1314447 1299324 1286365 1259636 1255478 1245606 1216206 1209755 1217431 1206179 1177548
9945A177548l4198M380j6139m4803p452k2981k6901m040j021n4565m4033k8901
$$ 1177548 1143350 1147730 1131591 1086788 1079336 1056355 1029454 1025414 1024393 969828 925795 896894
9933H96894l8721m3038l2851m8121j2251J850j0560j1480L191j5379m014l4181
$$ 896894 858173 815135 782284 734163 721912 723762 713202 701722 704913 689534 685520 651339
9921F51339j1236K4130J3808j641R653J6064j0616k3235j0609J4531J9809k2800
$$ 651339 640103 664233 678041 676400 686053 702117 691501 668266 657657 672188 691997 669197
9909F69197j6682j5328J8335R004L2120K1213l6982k6062m1089k8689k1836L1507
$$ 669197 652515 637187 655522 664526 696646 717859 680877 654815 613726 585037 563201 594708
9897E94708K2516j26m0506m9349j3711k789j645q010k5607k2528j7775J4419K004
$$ 594708 617224 617098 576592 527243 513532 510743 509098 501088 475481 452953 435178 449597 451601
9884D51601j3220j5658k0604l4044m4920P461L182R958K6763K1498K6766P378
$$ 451601 438381 422723 402119 368075 323155 330616 333798 343756 370519 392017 418783 426161
9872D26161l1463J0692J523J7315L645p203j6565j8061l8779k8946j3309K2103
$$ 426161 394698 405390 406913 424228 427873 420670 404105 386044 347265 318319 305010 327113
9860C27113K4161Q326j4011j1560j8734j5086j4055P6r301r433o466R450k0539
$$ 327113 351274 359600 345589 334029 315295 300209 286154 286230 276929 267496 261030 270480 249941
9847B49941M166K7357Q701k3682k6519K694J1780j9796J5963N128q434j3642m384
$$ 249941 254107 281464 290165 266483 239964 242658 254438 234642 250605 255733 247299 233657 229273
9834B29273p942K179J7343M6855J523j8513N618o707j6971k2368k0514K3836K5569
$$ 229273 221331 223510 240853 287708 289231 270718 276336 269629 252658 230290 209776 233612 259181
9821B59181M309m6431k2539j91J0056L619j990J7281J302j2365L918J6486J391
$$ 259181 263490 217059 194520 194329 204385 208004 206014 223295 224597 212232 216150 232636 234027
9808B34027P42j2483j7198j4187J445P555p470J6447l447o14J5590k2578J6378
$$ 234027 234769 222286 205088 190901 192346 199901 192431 208878 205431 204817 220407 197829 214207
9795B14207j1277K1437L7906J9683o903j2729l3107p089p567p712k4266j3922
$$ 214207 202930 224367 262273 281956 275053 262324 229217 222128 214561 206849 182583 168661
9783A68661L6525j036n772R524Q764J5858N003j6552l3460m729J6404K156R144
$$ 168661 205186 204150 198378 207902 216666 232524 237527 220975 187515 182786 199190 201346 210490
9770B10490L203l0190k321m765K0918K724l171Q844N3386J5632n3477k3309r768
$$ 210490 213693 183503 181182 176417 197335 200059 196888 205732 259118 274750 221273 197964 188196
9757A88196K3905P734J007J5028L569j6875j3131O566N078m714J669K0925M2680
$$ 188196 212101 219835 220842 235870 239439 222564 209433 215999 221077 216363 218032 238957 281637
9744B81637R203J7012J9662R860j0142k6381j6450J5494j4921k1490l4707o345
$$ 281637 290840 307852 327514 337374 327232 300851 284401 299895 284974 263484 228777 222432
9732B22432m884J562P465P437p510k0198n070j3351R105k267j075j168L434K2465
$$ 222432 217548 219110 226575 234012 226502 206304 201234 187883 196988 194721 193646 192478 195912 218377
9718B18377K462k233K0522J6373K172M4650Q2623N5693L8454L2380R41L0333N5309
$$ 218377 220839 218606 239128 255501 257673 302323 384946 440639 479093 511473 512414 542747 598056
9705E98056L3554J1180r381m3390m5040o1684m4094m0583o7456l5213J119r50
$$ 598056 631610 642790 633409 590019 544979 483295 439201 398618 331162 295949 297068 296118
9693B96118L455k1714j4606k9958k1902K1160K1441p952R036J6261K1476M0787
$$ 296118 299573 277859 263253 233295 211393 232553 253994 246042 255078 271339 292815 333602
9681C33602K0707m552K2334M6062M337Q883N6421O4086L3021N0719R2498O6455
$$ 333602 354309 349757 372091 418153 422490 431373 487794 551880 584901 635620 728118 794573
9669G94573L7033m2801n5614o9828m6278o4070n0557l0995l2220m3241o1618k0993
$$ 794573 831606 788805 733191 663363 617085 553015 502458 471463 439243 396002 334384 313391
9657C13391j5151Q691j9920k1626j888j6374J1678K1054k4987Q986R98m16O771
$$ 313391 298240 306931 287011 265385 263497 247123 258801 279855 254868 263854 264852 264436 271207
9644B71207l811K4792L6449J9874J6791M3887M0262L1830J1772M1597M1483j0264
$$ 271207 267396 292188 328637 348511 365302 409189 449451 481281 493053 534650 576133 565869
9632E65869l9119k5897k8938k6807l0063q0079n1938j752k0841o07M414l1427
$$ 565869 526750 500853 471915 445108 415045 334966 283028 281276 260435 259828 264242 232815
9620B32815m0657j658Q093k3262k8351j4574p821K2596J3000K9248N253j3616
$$ 232815 192158 190500 198593 175331 146980 132406 124585 147181 160181 189429 194682 181066
9608A81066k4976l2585j4711J3542K948L3958L6087J9602m163J5879K3251J5769
$$ 181066 156090 123505 108794 122336 125284 159242 195329 214931 210768 226647 249898 265667
9596B65667j3661l8504m8567k898m952j8940m8863r5R033J2783K6663l2829k1849
$$ 265667 252006 213502 164935 162037 157085 138145 89282 89187 98220 111003 137666 104837 82988
9583H2988L028m554M947J942K236r794k4461k3122J3293L7056K4556J5135J7645
$$ 82988 86016 81462 86409 88351 90587 80793 56332 33210 46503 83559 108115 123250 140895
9570A40895K466k1503j768J5764j5118k7863j4283q249k5439n016J5167k0985
$$ 140895 143361 121858 120090 135854 120736 92873 78590 70341 44902 39886 55053 34068
9558C4068j0787R030L0353J4791R881r374l2054m7511K447L5077k938p195J7116
$$ 34068 23281 32311 62664 77455 87336 77962 45908 -1603 844 35921 32983 25788 42904
9545D2904O432q814j0923l3455J0090J302J2592K5307k0200r326j511K9991J4320
$$ 42904 49336 40522 29599 -3856 6234 7536 20128 45435 25235 15909 14398 44389 58709
9532E8709o133j7618o522K3729K0672J2135q948j3359m4056j3408L2113K5491
$$ 58709 52576 34958 28436 52165 72837 84972 76024 62665 18609 5201 37314 62805
9520F2805K0684l7287l3096j230L3307l446r858q820K557J8132l609Q327L4636
$$ 62805 83489 46202 13106 11876 45183 41737 31879 23059 25616 43748 40139 48466 83102
9507H3102R406j7104k1302k6064j4835j479r203J2263J7909J5122M032j5014j5197
$$ 83102 92508 75404 54102 28038 13203 11724 2521 14784 32693 47815 51847 36833 21636
9494B1636K8162J2446J8931k4569j7578j5541l7076J270k314J9R107K3379L6970
$$ 21636 49798 62244 81175 56606 39028 23487 -13589 -12319 -14633 -14614 -5507 17872 54842
9481E4842l641k0233J4009O726q15J0061M131K0188k7879j8150K2636J1727k5319
$$ 54842 51201 30968 44977 51703 50888 60949 65080 85268 57389 39239 61875 73602 48283
9468D8283k7966j7955k5077j0196M890J6627L5002o709o600L221O36J4395K7068
$$ 48283 20317 2362 -22715 -32911 -28021 -11394 23608 16899 10299 13520 14156 28551 55619
9455E5619j2704l2612N538N901N958K6822n869q06l438J6754O440k4292o788K0718
$$ 55619 42915 10303 15841 21742 27700 54522 48653 47847 44409 61163 67603 43311 36523 57241
9441E7241K3962j6535n091j3327O917k438l6150P590n268J0804n029l582Q905
$$ 57241 81203 64668 59577 46250 53167 50729 14579 22169 16901 27705 22676 19094 27999
9428B7999j5554j7401J6047J5716Q494M251m572J4N429l319l867k383M0j7558
$$ 27999 12445 -4956 11091 26807 35301 39552 34980 34994 40423 37104 33237 30854 30894 13336
9414A3336K20J4312J7013K70k6969l8172j2471Q109K4809J7051K3136j4028J782
$$ 13336 13556 27868 44881 45151 18182 -19990 -32461 -24352 457 17508 40644 26616 28398
9401B8398J1048q527K362L4164L418k2130j7547j871J746o072k6751j1572O727
$$ 28398 39446 30919 33281 67445 70863 48733 31186 29315 31061 24989 -1762 -13334 -6607
9388f607j0192k199K1879J8800J0741l845Q136l372k9001N048m486K9919r857
$$ -6607 -16799 -18998 2881 21681 32422 28577 36713 33341 4340 9388 4902 34821 24964
9375B4964j743J7947n618j0245r767Q441p589r032K1977K5017J1817J623k3324
$$ 24964 23221 41168 35550 25305 15538 23979 16390 7358 29335 54352 66169 67792 44468
9362D4468K174M54j8677j3585O2J207Q08K974n557J2015M1799j6111j1708p025
$$ 44468 46642 47096 28419 14834 14896 16103 16911 19885 14328 26343 68142 52031 40323 33298
9348C3298j0743K2763k408l3527m5159j5374K8154q055J5679K6499K3036J2494
$$ 33298 22555 45318 42910 9383 -35776 -51150 -22996 -31051 -15372 11127 34163 46657
9336D6657n384L9055J4626n9538k6919L6267P511J2652l272j8814R684R801P144
$$ 46657 41273 80328 94954 35416 8497 44764 52275 64927 61655 42841 52525 62326 69470
9323F9470k1585l8772k4524J1791O20O67N018K0037J787p220K4065J5297q890
$$ 69470 47885 9113 -15411 -3620 -3000 -2333 2685 22722 24509 17289 41354 56651 47761
9310D7761j7703R21P994J278J86M607P530j9569M995K7314o444k5400R280r94
$$ 47761 30058 30979 38973 40251 40437 45044 52574 33005 38000 65314 58870 33470 42750 41756
9296D1756j0541k2457o557J448P609K1547O794k8226J3293K900J415J7041K40
$$ 41756 31215 8758 2201 3649 11258 32805 39599 11373 24666 27566 28981 46022 46262
9283D6262m295k5438o126l306J1488K3971K7558j3779m748k4760P422J8837P622
$$ 46262 41967 16529 10403 7097 18585 42556 70114 56335 51587 26827 34249 53086 60708
9270F0708J6469Q366j1331l4954j0700Q036l4785j4771P973p266j5764N402J4949
$$ 60708 77177 85543 74212 39258 28558 36594 1809 -12962 -4989 -12255 -28019 -22617 -7668
9257g668J6347J5640M3296k2520j8596K749Q570K875k0429K0178k578j1032k5302
$$ -7668 8679 24319 67615 45095 26499 29248 37818 40693 20264 40442 37864 26832 1530
9244A530L319J9912J5960q632J1610j6073L131n304j7515M056J3255n415O488
$$ 1530 4849 24761 40721 32089 43699 27626 30757 25453 7938 11994 25249 19834 26322
9231B6322M791K1452p648l8206k3934n675J4872K4653R102P005J7617J4114P933
$$ 26322 31113 52565 44917 6711 -17223 -22898 -8026 16627 25729 32734 50351 64465 72398
9218G2398l0458j6617j502q262j9728j0121L1934O29J4091J6999l333L98J3460
$$ 72398 41940 25323 23821 15559 -4169 -14290 17644 18273 32364 49363 46030 46428 59888
9205E9888j5044k4835l458N00K7942j927k2269o416j4104N521N964J7021j3368
$$ 59888 44844 20009 16551 17051 44993 43066 20797 14381 277 5798 11762 28783 15415
9192A5415P483O272K837O416o360J7102J6582K970m371o068N706q051j9496j561
$$ 15415 22898 29170 32007 38423 32063 49165 65747 68717 64346 58278 63984 55933 36437 34876
9178C4876N883K623m292K8744K9402k1025j6292K2203K7641J0804k6762j8257
$$ 34876 40759 43382 39090 67834 97236 76211 59919 82122 109763 120567 93805 75548
9166G5548j253J5199p573j2716J0774K2983J8234q268m853N958J365R859l021
$$ 75548 74295 89494 81921 69205 79979 102962 121196 112928 108075 114033 115398 125257 122236
9153A22236j692J0514O285J9409J350L6877M7006N4238L3796J5080j7459J6236
$$ 122236 120544 131058 137343 156752 158102 194979 241985 296223 330019 345099 327640 343876
9141C43876N8739K9810K7879N6011J01312Q3319J05114J65602K06074L00319M25919
$$ 343876 402615 432425 460304 516315 617627 700946 806060 971662 1177736 1478055 1903974
9130A903974N57415O53984P99390J056196J527832K006033J123117j157344j893878
$$ 1903974 2461389 3115373 3914763 4970959 6498791 8504824 9627941 8470597 6576719
9121F576719j326952r87379q00718o71436n17822m12000k89940k46036j90736
$$ 6576719 5249767 4262388 3461670 2790234 2272412 1860412 1570472 1324436 1133700
9112A133700j45618p5980r9166j02849o1746o0975n7612n9328n0704l2962n3829
$$ 1133700 988082 912102 812936 710087 648341 587366 529754 470426 419722 386760 332931
9101C32931k9855p166l4668q867k1258k9475m5376p419l629J4985K1240p17j1706
$$ 332931 303076 295910 261242 252375 231117 201642 156266 148847 145218 160203 181443 180726 169020
9088A69020k4304n28r388L416l421k152K6114l5687j6004l238j0825q816K963
$$ 169020 144716 144188 134800 138216 134795 132643 158757 123070 107066 103828 93003 84187 87150
9075H7150j2829j6541L201K7224r956k0262k401K2373R504j172j6973k4503j0439
$$ 87150 74321 57780 60981 88205 78249 57987 55586 77959 87463 86291 69318 44815 34376
9062C4376J1380L7013J1065P908N576j8202m1230j4270O148R05P540k5249R029
$$ 34376 45756 82769 93834 101742 107318 89116 47886 33616 39764 40669 48209 22960 31989
9049C1989k5066J0882K3614j2443l957p223j0170K7077J694Ol454o405K336o959
$$ 31989 6923 17805 41419 28976 25019 17796 7626 34703 36397 36403 32949 26544 28880 21921
9035B1921l565j6270l759j2670L245P175p9J6665j6092j4889Q097M2052K7425
$$ 21921 18356 2086 -1673 -14343 -11098 -3923 -4002 12663 -3429 -18318 -10221 31831 59256
9022E9256k700r376k8607k2254J4182j1392m08J3882L229M083n416L885l499l618
$$ 59256 56556 47180 18573 -3681 10501 -891 -1299 12583 15812 19895 14479 18364 14865 11247
9008A1247N347J4137j017j6615k0932N682J0908M5790J9831j3678m5291q204P876
$$ 11247 16594 30731 29714 13099 -7833 -2151 8757 54547 74378 60700 15409 7205 15081
8995A5081L8537n359J9190k2721l9826j3948J7697n202k5484J5236R138O566J6039
$$ 15081 53618 48259 67449 44728 4902 -9046 8651 3449 -22035 -6799 2339 8905 24944
8982B4944J5426k853q774K0685P123k303r242j3505j8894l0222p119K7278K5395
$$ 24944 40370 37517 28743 49428 56551 54248 45006 31501 12607 -17615 -24734 2544 27939
8969B7939L416J1094J0747p1O791o294J0192N548k75k8303j7063J8979K3976l2373
$$ 27939 31355 42449 53196 53125 59916 53622 63814 69362 69087 40784 23721 42700 66676 34303
8955C4303j9704L279m238J050r091n716K9172K7149J4032k2079j0657n036P014
$$ 34303 14599 17878 13640 14690 5599 -117 29055 56204 70236 48157 37500 32464 39478
8942C9478j5556k9159K111K529N322K4566M87r041l478j7992N616K9326J0453
$$ 39478 23922 -5237 -3126 -597 4725 29291 29778 20737 17259 -733 4883 34209 44662
8929D4662Q389l7651p678j8320J2068O5968m298l4030J3744L090j2018P211K275
$$ 44662 53051 15400 7722 -10598 1470 67438 63140 29110 42854 45944 33926 41137 43412
8916D3412j1016k5988J917q300j6532q763L5860j1206l5798P789M1663L1102J0045
$$ 43412 32396 6408 8325 25 -16507 -25270 10590 -616 -36414 -28625 13038 44140 54185
8903E4185k732P004k7363k8381K408R116K557k2455O494K3521k511r212o075r447
$$ 54185 51453 58457 31094 2713 5121 14237 16794 -5661 833 24354 21843 12631 6556 -2891
8889b891k4873K5414L7757L0904O721N213j0507j8188j6023l1832k2781J7058
$$ -2891 -27764 -2350 35407 66311 73032 78245 67738 49550 33527 1695 -21086 -4028
8877d028Q961P437j3339k8252J4038L2497K3947O797J355p991N572J4337j3115
$$ -4028 4933 12370 -969 -29221 -15183 17314 41261 48058 49413 41422 46994 61331 48216
8864D8216k7874J0689l451J0057L3452k0341p671k0485k5538K6487K9773J1538
$$ 48216 20342 31031 27580 37637 71089 50748 43077 22592 -2946 23541 53314 64852
8852F4852K6601J195q765k8082k4936M942j5375j3467m070j3583k6299K9762M5624
$$ 64852 91453 92648 83883 55801 30865 35807 20432 6965 2895 -10688 -36987 -7225 38399
8839C8399k745k1068j7068J4796K8849O478O970O23K1763K4750j4125K80K3408
$$ 38399 35654 14586 -2482 12314 41163 47641 54611 55234 76997 101747 87622 87902 111310
8826A11310J2344l9090l657N330k8830J9467M0773L6073O8270O1144P1702L2116
$$ 111310 123654 84564 80907 86237 57407 76874 117647 153720 221990 283134 354836 386952
8814C86952j9381l0702k9067l3103j9456j2335p006m4997k1843q913k233j0306
$$ 386952 367571 336869 307802 274699 255243 242908 235902 190905 169062 160149 157916 147610
8802A47610k9992K388J6113r062n6553k1753k7043L3099K7240m392m03L0715M408
$$ 147610 117618 120006 136119 127057 70504 48751 21708 54807 82047 77655 77252 107967 112375
8789A12375K116L3703K4067j5164k9326J8343K6234k8967j9948j2658n4721j4297
$$ 112375 114491 148194 172261 157097 127771 146114 172348 143381 123433 110775 56054 41757
8777D1757Q024j6851n766q901j0454J6635J1386L0336L5938m726l7316j1131m1058
$$ 41757 49781 32930 27164 18263 7809 24444 35830 66166 102104 97378 60062 48931 7873
8764G873q138J3755K2440q855K330L1876j924j2069l549N708J936q8l5909m57
$$ 7873 -265 13490 35930 27075 29405 61281 59357 47288 43739 49447 51383 51295 15386 14929
8750A4929P000j209P188k2545P330L2301L4760K5639n010j3316Q278k5171l5164
$$ 14929 21929 20720 27908 5363 12693 44994 79754 105393 100383 87067 95345 70174 35010
8737C5010J9284K823K0516J7751j066l1201N63O818k0456r762K5213N420j027
$$ 35010 54294 57117 77633 95384 94318 63117 63680 70498 50042 40280 65493 70913 69886
8724F9886Q995J0411k3479j163n943J0517N269n566l3898O815J839O6N157l2556
$$ 69886 78881 89292 65813 64650 58707 69224 74493 68927 35029 41844 43683 43749 48906 16350
8710A6350l7597m121J5058j7223j7804J7277p086K514q532m099J7393r130k2301
$$ 16350 -21247 -25368 -10310 -27533 -45337 -28060 -35146 -32632 -41164 -45263 -27870 -37000 -59301
8697e9301R576Q497K0828K1142L3992K4756j031k1704k2871k806Q182k4261m132
$$ -59301 -49725 -41228 -20400 742 34734 59490 58459 36755 13884 11078 19260 -5001 -9133
8684i133J9805K5585Q617K5651j7194j0190l4575j2294J8986M0003J2329n877
$$ -9133 10672 36257 44874 70525 53331 43141 8566 -3728 15258 55261 67590 61713
8672F1713j8452n038J027K5073Q717k0298j7148l1228k5154k0996K615K9502J5332
$$ 61713 43261 38223 39250 64323 73040 52742 35594 4366 -20788 -41784 -39169 -9667 5665
8659E665J0491M486n46l325j949P775J5604K43k688J9866R453R60j7338k3719
$$ 5665 16156 20642 20096 16771 14822 22597 38201 38444 35756 55622 65075 66035 48697 24978
8645B4978J5792K2284M031N861k0210j3159L57j6113m707q156J5290j9354l565
$$ 24978 40770 63054 67085 72946 52736 39577 39934 23821 19114 10958 26248 6894 3329
8632C329L2317M4094j2511m9010j5609R255k45J3112p719j921j1083l5231R07
$$ 3329 35646 79740 67229 18219 2610 11865 11620 24732 17013 15092 4009 -31222 -30315
8619c0315L4416P3835J9701k6924q550l3871j0202L6709O1346M52j9788l31J8591
$$ -30315 4101 77936 97637 70713 62163 28292 18090 54799 116145 116597 96809 96478 115069
8606A15069k113n200M971J0103K025P67M2633K3260k3404m157J983j4696j6092
$$ 115069 112956 107756 112727 122830 124855 125622 168255 191515 168111 163954 165937 151241 135149
8593A35149N159r346k6971j9127k641l3096k0931O091l4099K913K8955l054l2231
$$ 135149 140308 130962 103991 84864 82223 49127 28196 34287 188 3101 32056 29002 -3229
8580c229L500J0331Q672J7274J2365m769o3690k2858K4822K3177J8349p845j9133
$$ -3229 271 10602 19274 36548 48913 44144 -19546 -42404 -17582 5595 23944 16099 -3034
8567c034q092r661J8283J6797J1888J5086p596r576o280j2225Q167J8878J7721
$$ -3034 -11126 -20787 -2504 14293 26181 41267 33671 24095 17815 5590 13757 32635 50356
8554E0356P027q950j8351r534L683j003J9649j2135n030k0794J8456q201m7433
$$ 50356 57383 48433 30082 20548 24231 23228 42877 30742 25712 4918 23374 15173 -32260
8541c2260P459j3840j7586J6259M9401M7083J5650k0042p383j3298l7107K0358
$$ -32260 -24801 -38641 -56227 -39968 9433 56516 72166 52124 44741 31443 -5664 14694
8529A4694J4295K674k310j4278k432n257N659j6926J1373L3118K6145n650J9075
$$ 14694 28989 31663 29353 15075 12643 7386 13045 -3881 7492 40610 66755 61105 80180
8516H0180Q533l1782k0362k6469j1689k2677L78M793K8930j1269k0471J7431l068
$$ 80180 88713 56931 36569 10100 -1589 -24266 -23888 -19095 9835 -1434 -21905 -4474 -7542
8503g542j7628j2585j0617K5241K1459l352j7844J5242j1636j2819K0308K5252
$$ -7542 -25170 -37755 -48372 -23131 -1672 -5024 -22868 -7626 -19262 -32081 -11773 13479
8491A3479J9474j7717p653k1737K5665K7592j1020j3490J4223l38J119k1530J3520
$$ 13479 32953 15236 7583 -14154 11511 39103 28083 14593 28816 28478 29597 8067 21587
8478B1587Q262k0572p835o635q286J2996K4270q028o4j3411K5735K0181l2207
$$ 21587 29849 9277 1442 -5193 -13479 -483 23787 15759 15695 2284 28019 48200 15993
8465A5993j5912N85Q371j9348K380L5973l576m222q872j3936j313M503k4681K0464
$$ 15993 81 666 9037 -10311 -7931 28042 24466 20244 11372 -2564 -3877 626 -24055 -3591
8451c591K02k582M4756J0197k6425k7315Q182o092O671O88m3270j2682K0512J5588
$$ -3591 -3389 -5971 38785 48982 22557 -4758 3424 -2668 4003 4691 -38579 -51261 -30749 -15161
8437a5161J9535L2892Q43m760l773J9370j2483k5579k3594O178J3504m399J3471
$$ -15161 4374 37266 38109 33349 29576 48946 36463 10884 -12710 -6532 6972 2573 16044
8424A6044j6955j2730R504K2190j0252j442p152Q766l4804J1188J9665M5940J0590
$$ 16044 -911 -13641 -4137 18053 7801 6359 -793 7973 -26831 -15643 4022 49962 60552
8411F0552j9818L68n900r335J9978J1925R737o797l0916j2831J66P821n28j8703
$$ 60552 40734 41102 35202 25867 45845 57770 67507 60710 29794 16963 17129 24950 24422 5719
8397E719j1087j3596k507n171N490L1430J8092N032Q426r502j0270j9712K2210
$$ 5719 -5368 -18964 -21471 -26642 -21152 10278 28370 33402 41828 32326 22056 2344 24554
8384B4554j7038l7766m250O485m9R296J9209K670j1410k4265J0257J0225L671
$$ 24554 7516 -30250 -34500 -28015 -28064 -18768 441 3111 -8299 -32564 -22307 -12082 -8411
8371h411M91p155J0371j5980l833j1102L0058O117P52J7516K0910k0827m522J7663
$$ -8411 -7920 -15075 -4704 -20684 -24517 -35619 -5561 556 1308 18824 39734 18907 14385 32048
8357C2048P963j4669J7106J5436l3155J489j3444j0063l251Q441J3238j4082j3913
$$ 32048 40011 25342 42448 57884 24729 26218 12774 2711 -540 7901 21139 7057 -6856
8344f856N784m467N682L970N952J2443j0163L492j0540J139p650P729K1960n546
$$ -6856 -1072 -5539 143 4113 10065 22508 12345 15837 5297 6436 -1214 6515 28475 22929
8330B2929j5786k3452O510J2925p889p828L4600l055J057J966N28k8554n017J8593
$$ 22929 7143 -16309 -9799 3126 -4763 -12591 22009 18954 20011 21977 22505 -6049 -11066 7527
8316G527q280k7987k64K0430j3845J6927K0873K426m900j8082j127j2907j1647
$$ 7527 -753 -28740 -29004 -8574 -22419 -5492 15381 17807 12907 -5175 -6302 -19209 -30856
8303c0856J5300O034j6710o771p425J1597J5303K8665r867j4454r358o099J1523
$$ -30856 -15556 -9522 -26232 -33003 -40428 -28831 -13528 15137 5270 -9184 -18542 -24641 -13118
8290a3118J8143L793k0290j5294K348J7272J3685L2452k0702m965j8583m039r818
$$ -13118 5025 8818 -11472 -26766 -24418 -7146 6539 38991 18289 13324 -5259 -9298 -19116
8277a9116l679J1136L0043Q226l0900M266J3935Q581j0247M442J3213L88N697
$$ -19116 -22795 -11659 18384 26610 -4290 -24 13911 22492 12245 16687 29900 30288 35985
8264C5985m986K0640j7930k5923j48Q889l1458j5989J6504P835J2369J2138O361
$$ 35985 30999 51639 33709 7786 7638 16527 -14931 -30920 -14416 -6581 5788 17926 24287
8251B4287L6604o465l7726p365Q81J0429k5969j0082k017K68K2851j6197O364
$$ 24287 60891 54426 16700 9335 10216 20645 -5324 -15406 -17423 -17155 5696 -10501 -4137
8238d137j958L123K2695Q31j0544J8662K4398r324j3517q169l690J855l190j2252
$$ -4137 -6095 -2972 19723 20554 10010 28672 53070 43746 30229 22060 18370 20225 17035 4783
8224D783j985N653K8749k6508k0478r141j3241K796Q291J484k3061l609J354M968
$$ 4783 2798 8451 37200 10692 -9786 -18927 -32168 -29372 -21081 -19597 -42658 -46267 -44913 -39945
8210c9945j8668J9632M810J0322O402K6840K6321L0455o063J96L171o765j3151
$$ -39945 -58613 -38981 -34171 -23849 -17447 9393 35714 66169 60106 60302 63473 56708 43557
8197D3557l3504L1190O581k046l8180J6692k848n862j0572k730j1611k714q546
$$ 43557 10053 41243 47824 45778 7598 24290 21442 15580 5008 2278 -9333 -12047 -20593
8184b0593J0590K6672L5046M951O885m926j3429k3410j6427p447K479J1195J0879
$$ -20593 -10003 16669 51715 56666 63551 58625 45196 21786 5359 -2088 391 11586 22465
8171B2465l1232l503J5112J6704j4410J8507j011n86j0671l529k3448l357P201
$$ 22465 -8767 -12270 2842 19546 5136 23643 22632 22046 11375 7846 -15602 -18959 -11758
8158a1758K7441J6123l1064q21K2308j129k5019j0088K0721q762j2872k4092j2930
$$ -11758 15683 31806 742 -79 22229 21100 -3919 -14007 6714 -2048 -14920 -39012 -51942
8145e1942K0498J2614J0870r368k6113n689J0515J9300J9441J5495l7460j5754
$$ -51942 -31444 -18830 -7960 -17328 -43441 -49130 -38615 -19315 126 15621 -21839 -37593
8133c7593O536M102j471R440K8178J6505J5132L7468J6648l5309m2636j4294r406
$$ -37593 -31057 -26955 -28426 -18986 9192 25697 40829 78297 94945 59636 17000 2706 -6700
8120f700J5035k515k650r78j1482p139o501K0915n862O207j1532j9763J0899N060
$$ -6700 8335 5820 3170 2192 -9290 -16429 -22930 -2015 -7877 -1670 -13202 -32965 -22066 -17006
8106a7006k7941j4899K5137K0681K6179K510m516K168r875J3862l06O667M391
$$ -17006 -44947 -59846 -34709 -14028 12151 14661 10145 12313 2438 16300 15994 22661 27052
8093B7052n256j4328m430Q354P586m710q972L360k9827J013M0103J3563k1314
$$ 27052 21796 7468 3038 11392 18978 14268 5296 8656 -21171 -20158 19945 33508 12194
8080A2194p112j3564j6728K6906J3362j4775j0577J0897J2433P328R14J6856j3267
$$ 12194 5082 -8482 -25210 1696 15058 283 -10294 603 13036 20364 21278 38134 24867
8067B4867k1858k1752q93J7334J9576K0427j2976Q814q721l286M010J300J790
$$ 24867 3009 -18743 -19636 -2302 17274 37701 24725 33539 24818 21532 25542 26842 28632
8054B8632L333j3057q740r335J1199J8621P481J9790k0332k2993j0157p324k9082
$$ 28632 31965 18908 10168 833 12032 30653 38134 57924 37592 14599 4442 -2882 -31964
8041c1964K5300K5841Q946j2405k6380l7182q323K8033n30J8216K8087K6224K776
$$ -31964 -6664 19177 28123 15718 -10662 -47844 -56167 -28134 -28664 -10448 17639 43863 46639
8028D6639o978n660j3595K980o80J690j708j1391K096J2470j6580j2292O805J333
$$ 46639 39661 34001 20406 23386 22706 24396 22688 11297 13393 25863 9283 -3009 3796 5129
8014E129P376j3570j3218l1083J0510K8487K2030J5011J0525r340m818n102K6637
$$ 5129 12505 -1065 -14283 -45366 -34856 -6369 15661 30672 41197 31857 27039 21937 48574
8001D8574k0528k4567q99J1917p15j5374k5430l3822M53J9547J5225l1746J7457
$$ 48574 28046 3479 2580 14497 13782 -1592 -27022 -60844 -60391 -40844 -25619 -57365 -39908
7988c9908L5558K1223J7216R6l249k0576l4364M15L7818m632k2402J9745n341
$$ -39908 -4350 16873 34089 34185 30936 10360 -24004 -23589 14229 9597 -12805 6940 1599
7975A599j4777L404k234L3227l569l690J7514m31K2371k0912j1003J5372l854
$$ 1599 -13178 -9774 -12008 21219 17650 13960 31474 31043 53414 32502 21499 36871 33017
7962C3017J764k1007j6297R052K506j6219J8898j993J3796J304j376j7152j5146
$$ 33017 34781 13774 -2523 6529 9035 -7184 11714 9721 23517 24821 23445 6293 -8853
7949h853k840K6744j9713j4878N542J1787m078k1900j609R891q847j2822K1477
$$ -8853 -11693 15051 -4662 -19540 -13998 -2211 -6289 -28189 -29798 -19907 -28754 -41576 -20099
7936b0099Q081p284j229J8135J4792J3794r00l0678j5962L957K0296Q602m104
$$ -20099 -12018 -19302 -20531 -2396 12396 26190 25290 -5388 -21350 -17393 2903 11505 7401
7923G401P273N525R79K0958O707n958O929k0704n785j6272J1558k863m258k3239
$$ 7401 14674 20199 21178 42136 48843 42885 49814 29110 23325 7053 18611 15748 11490 -11749
7909a1749l989O380O516K095j5708q965l579J2693J5191p96L5481M053l5117l923
$$ -11749 -15738 -9358 -2842 -747 -16455 -25420 -28999 -16306 -1115 -1911 33570 37623 2506 -1417
7895a417n467K3730N346j1581J9835o320j1816j2577K449M229J2919k0139k9824
$$ -1417 -6884 16846 22192 10611 30446 24126 12310 -267 2182 6411 19330 -809 -30633
7882c0633K0429J7663L6821K431n7187l0354K9486J6421K688n046j7402Q255J3945
$$ -30633 -10204 7459 44280 46711 -10476 -40830 -11344 5077 7765 2719 -14683 -6428 7517
7869G517k450L2022J6527J0156k4311j5211r602j1634R269j4805J8872J3847J2842
$$ 7517 5067 37089 53616 63772 39461 24250 14648 3014 12283 -2522 16350 30197 43039
7856D3039j7650j6882o580k48k0225M060K8757k000J20j1444P323O726k1464J0269
$$ 43039 25389 8507 1927 1679 -18546 -14486 14271 12271 12391 947 8270 14996 -6468 3801
7842C801r290j2996j6215J6729K3812j3408j4993K4263j4837l0769K2293L6561
$$ 3801 -5489 -18485 -34700 -17971 5841 -7567 -22560 1703 -13134 -43903 -21610 14951
7830A4951N624k8856j2504J2103J672N184k9529l189J4096K126K075K6904P267
$$ 14951 20575 -8281 -20785 -8682 -7010 -1826 -31355 -34544 -20448 -18322 -16247 10657 17924
7817A7924Q832j5366j9721j5665m746L6246J7782l2505j6859K7106J5107J7096
$$ 17924 26756 11390 -8331 -23996 -28742 7504 25286 -7219 -24078 3028 18135 35231
7805C5231k8344r911Q24j3230P510J0097l584J633o626j5412J228k805K669p258
$$ 35231 6887 -3024 -2200 -15430 -7920 2177 -1407 226 -6400 -21812 -20584 -23389 -20720 -27978
7791b7978j1504J1299J4184R187L1695J4140L330k6443j3886P531J5959k4028
$$ -27978 -39482 -28183 -13999 -4812 26883 41023 44353 17910 4024 11555 27514 3486
7779C486k6836J4032P770L866J4927r239j499j1357L1878j3663j0727j6982n482
$$ 3486 -23350 -9318 -1548 2318 17245 8006 6507 -4850 27028 13365 2638 -14344 -19826
7766a9826K7133j3933m354K1554q01j8878n645M408O087j6993k7914r292J6969
$$ -19826 7307 -6626 -10980 10574 9773 -9105 -14750 -10342 -4255 -21248 -49162 -58454 -41485
7753d1485N323K0304K5681o757l1628L6325J1817k053o891j6635l083j2157j841
$$ -41485 -36162 -15858 9823 3066 -28562 7763 19580 17527 10636 -5999 -9082 -21239 -23080
7740b3080M554j0507K172P787m269J2709J6043J1796J1499j0692j165L322k0164
$$ -23080 -18526 -29033 -26861 -19074 -23343 -10634 5409 17205 28704 18012 16847 20169 5
7727EJ939j1004k2324j3474n273p69J065J8265K6473N613q573O899J684O454O452
$$ 5 1944 -9060 -31384 -44858 -50131 -50900 -49835 -31570 -5097 516 -8057 -1158 526 6980 13432
7712A3432j1083Q693J1297l5117j6925J2210J3134K0613J4804n323q785O074L82
$$ 13432 2349 11042 22339 -12778 -29703 -17493 -4359 16254 31058 25735 16950 23024 23406
7699B3406j5034Q80J0532k824l692K234J1170J4152L1911r057k5122n898j2287
$$ 23406 8372 9252 19784 16960 13268 15502 26672 40824 72735 63678 38556 32658 20371
7686B0371j5224R496j3424j6771j4782K363N785j1603n315K1922l3j136O376J6173
$$ 20371 5147 14643 1219 -15552 -30334 -27971 -22186 -33789 -39104 -17182 -17215 -18351 -11975 4198
7672D198O437j6278n255j627l8336R30L6037K5715N393L379j7877N716K9011J7543
$$ 4198 10635 -5643 -10898 -12525 -50861 -49931 -13894 11821 17214 20593 2716 8432 37443 54986
7658E4986L648k0802j082P297K3853p914j6849j4832j1999j9928j1423K933j1445
$$ 54986 58634 37832 36750 44047 67900 59986 43137 28305 16306 -3622 -15045 -12112 -23557
7645b3557L536m860j1089j3694K4225R31O518k4455N38K5515K0975n381L0594
$$ -23557 -20021 -24881 -35970 -49664 -25439 -24508 -17990 -42445 -41907 -16392 4583 -798 29796
7632B9796L1270k275l8854j0935J6222P349q36k246J8971j6183j7529r523J1415
$$ 29796 61066 58791 19937 9002 25224 32573 31737 29491 48462 32279 14750 5227 16642
7619A6642l265j9571J7980J5754j3557j7737K2062M955k6823N379M675j1218p094
$$ 16642 13377 -6194 11786 27540 13983 -3754 18308 23263 -3560 1819 6494 -4724 -11818
7606a1818K5490R575p452P68j7806n360J4075k397N665J6951j2083j3919J769
$$ -11818 13672 23247 15795 16563 -1243 -6603 7472 5075 10740 27691 15608 1689 3458
7593C458O954p629K27J0059R369m295m5448j5520R095K2194O521M74J5333P331
$$ 3458 10412 2783 3010 13069 22438 18143 -27305 -42825 -33730 -11536 -5015 -4541 10792 18123
7579A8123j6319m123j0466p525j1808l203O330J227L9469R961O180j7021J4546
$$ 18123 1804 -2319 -12785 -20310 -32118 -35321 -28991 -27764 11705 21666 27846 10825 25371
7566B5371R446P939k3323m521j647J3210j4188l2168l2198j896K9385M5j3470
$$ 25371 34817 42756 19433 14912 13265 26475 12287 -19881 -52079 -53975 -24590 -24545 -38015
7553c8015R936J5576L0337O500J2935j1230j4570o837j4016j5392K0001P437l146
$$ -38015 -28079 -12503 17834 24334 37269 26039 11469 4632 -9384 -24776 -4775 2662 -484
7540d84R862J8841j7705k351p03Q105o011j3686K8459k292j8116r173Q955j7486
$$ -484 9378 28219 10514 8163 7460 15565 9554 -4132 24327 22035 3919 -5254 3701 -13785
7526a3785R178Q987j0544k5567o125K0143K1408J265l9176K7404p161j0077J5965
$$ -13785 -4607 4380 -6164 -31731 -37856 -17713 3695 4960 -34216 -6812 -13973 -24050 -8085
7513h085M500m251K195l268J9238J3925J5226J8252j7413l3608j629O385pL8541
$$ -8085 -3585 -7836 -5641 -8909 10329 24254 39480 57732 40319 6711 5082 11467 11460 50001
7499E0001J1901J0242k6069k9666p598K1968l275j2658N64%m722l2112J5005J1590
$$ 50001 61902 72144 46075 16409 8811 30779 27504 14846 15410 15410 10688 -21424 -6419 5171
7485E171j0405M6J6505K414J1770q51j0257k2567j6280l042j2452r700k5457J0794
$$ 5171 -5234 -5188 11317 13731 25501 24650 14393 -8174 -24454 -27496 -39948 -49648 -75105 -64311
7471f4311J7515K9179J0162N122m805j3725J792L8359K0384m7454j4015n541q231
$$ -64311 -46796 -17617 -7455 -2333 -7138 -20863 -19071 19288 39672 -7782 -21797 -27338 -35569
7458c5569K8083L8672j4377m068k975L241j6144M270o908O603l3992k8784K3775
$$ -35569 -7486 31186 16809 12741 9766 13007 -3137 1133 -5775 828 -33164 -61948 -38173
7445c8173K2628J3268j3723k1548J1578j5238R776k239k2411n685J1718K7051
$$ -38173 -15545 -2277 -16000 -37548 -25970 -41208 -31432 -33671 -56082 -61767 -50049 -22998
7433b2998J5177r011l386o003J4529J1168L89N71K799K6230L631l2518k4314k1521
$$ -22998 -7821 -16832 -20218 -26221 -11692 -524 -135 436 3235 29465 33096 578 -23736 -45257
7419d5257J8153R014p838Q325O950j8595n566k00j5383J7084L0866N723l2178
$$ -45257 -27104 -18090 -25928 -17603 -10653 -29248 -34814 -35014 -50397 -33313 -2447 3276 -28902
7406b8902l8824K8367L8360K1524j5012j3037J3203J112j0422k3140j7869L1392
$$ -28902 -67726 -39359 -999 20525 5513 -7524 5679 6791 -3631 -26771 -44640 -13248
7394a3248L2981O386j1911k6101R671o301j0708l4580j2933K7554J6315o694o050
$$ -13248 19733 26119 14208 -11893 -2222 -8523 -19231 -53811 -66744 -39190 -22875 -29569 -35619
7381c5619L360j261K3061m792o267J096J483j4253Q595O980L230K2934L384r909
$$ -35619 -32259 -33520 -10459 -15251 -21518 -20422 -18939 -33192 -24597 -17617 -14387 8547 11931 2022
7367B022K0268J4796j3570l1316O07j4802K387P947M298J0990J063L76k5545p374
$$ 2022 22290 37086 23516 -7800 -7193 -21995 -19608 -11661 -7363 3627 4690 5066 -20479 -27853
7353b7853K8555R889J2000q810o393l3002j8991q14J5795K8527k6886k0069L9839
$$ -27853 702 10591 22591 13781 7388 -25614 -44605 -45419 -29624 -1097 -27983 -48052 -8213
7340h213M6066J5627J4258j9122n586k047l5959q062l508k0324j0958l823N101
$$ -8213 37853 53480 67738 48616 43030 40983 5024 -3038 -6546 -26870 -37828 -41651 -36550
7327c6550J6383L228j9354Q081J9270L073J294l89J2704K4496R931n7136l1291
$$ -36550 -20167 -16939 -36293 -28212 -8942 -5869 -4575 -4964 7740 32236 42167 -14969 -46260
7314d6260P464K3562J4608q671j9672n178L2216K5784M204m1890M645L0084N895
$$ -46260 -38796 -15234 -626 -9297 -28969 -34147 -1931 23853 28057 -13833 -9188 20896 26791
7301B6791j0910k4567J8830K0154q301j5922J737P317O329j1539k3556n034k0430
$$ 26791 15881 -8686 10144 30298 21997 6075 7812 15129 21458 9919 -13637 -18671 -39101
$$ [...]
##END NTUPLES=NMR SPECTRUM
##END=
