##TITLE=Analysis number 326792
Compound Code cc 29541
Project Code adrs
Chemist Name fudan
##JCAMPDX= 6.0         $$ Bruker NMR JCAMP-DX V2.0
##DATA TYPE= NMR SPECTRUM
##DATA CLASS= NTUPLES
##ORIGIN= Bruker BioSpin GmbH
##OWNER= nmr
$$ XWIN-NMR		Version 3.5
$$ Thu Feb 22 10:33:00 2007 GMT Standard Time (UT+0h)  MAYBRIDGE\nmr@NMR_250MHZ
##.OBSERVE FREQUENCY= 250.131544655141
##.OBSERVE NUCLEUS= ^1H
##.ACQUISITION MODE= SIMULTANEOUS (DQD)
##.ACQUISITION SCHEME= undefined
##.AVERAGES= 16
##.DIGITISER RES= 18
##SPECTROMETER/DATA SYSTEM= dpx250
##.PULSE SEQUENCE= zg30
##.SOLVENT NAME= CDCl3
##.SHIFT REFERENCE= (INTERNAL, CDCl3, 0, 16.522)
##AUDIT TRAIL= $$ (NUMBER, WHEN, WHO, WHERE, WHAT)
$$ ##TITLE= Audit trail, XWIN-NMR		Version 3.5
$$ ##JCAMPDX= 5.01
$$ ##ORIGIN= Bruker BioSpin GmbH
$$ ##OWNER= nmr
$$ C:\u/data/dgb/nmr/ADRS/1490/pdata/1/auditp.txt
$$ ##AUDIT TRAIL=  $$ (NUMBER, WHEN, WHO, WHERE, WHAT)
(   1,<2007-02-22 10:32:35.61 +000>,<MAYBRIDGE\nmr>,<NMR_250MHZ>,
      <created by zg, POWCHK disabled, PULCHK disabled
       configuration hash MD5:
       49 4B E0 1D 92 C2 6B 37 9F E6 65 BC 52 41 86 1D
       data hash MD5: 64K
       A0 9E 6F 7A 43 77 CB 92 B5 FC 1A F2 F0 9F 66 28>)
(   2,<2007-02-22 10:32:48.28 +000>,<MAYBRIDGE\nmr>,<NMR_250MHZ>,
      <Start of raw data processing
       ef LB = 0.3 FT_mod = 6 PKNL = 1 SI = 32K 
       data hash MD5: 32K
       EC E7 1C 33 0B B8 AC A1 9F 53 C2 ED E6 22 32 0B>)
(   3,<2007-02-22 10:32:50.47 +000>,<MAYBRIDGE\nmr>,<NMR_250MHZ>,
      <apk 
       data hash MD5: 32K
       0B 29 79 F7 FF 5E C5 DD 3E F4 67 F6 B0 8E 28 18>)
(   4,<2007-02-22 10:32:51.18 +000>,<MAYBRIDGE\nmr>,<NMR_250MHZ>,
      <abs ABSG = 5 
       data hash MD5: 32K
       04 20 1C 0E 25 88 4E 2D 1E 55 ED 46 0D A7 52 61>)
$$ ##END=
$$ 
$$ hash MD5
$$ 19 E2 12 D2 FA 52 B8 AB 84 80 15 89 98 DF 33 1A
##$RELAX= 
##$RELAX= 
##$RELAX= 
##$RELAX= 
##$RELAX= 
##$RELAX= 
##$RELAX= 
$$ Bruker specific parameters
$$ --------------------------
##$DU= <C:\u>
##$EXPNO= 1490
##$NAME= <ADRS>
##$PROCNO= 1
##$TYPE= <nmr>
##$USER= <dgb>
##$AMP= (0..31)
100 100 100 100 100 100 100 100 100 100 100 100 100 100 100 100 100 100 
100 100 100 100 100 100 100 100 100 100 100 100 100 100 
##$AQSEQ= 0
##$AQ_mod= 3
##$AUNM= <au_zg>
##$AUTOPOS= <57 >
##$BF1= 250.13
##$BF2= 250.13
##$BF3= 250.13
##$BF4= 250.13
##$BF5= 500.13
##$BF6= 500.13
##$BF7= 500.13
##$BF8= 500.13
##$BYTORDA= 1
##$CFDGTYP= 0
##$CFRGTYP= 5
##$CHEMSTR= <none>
##$CNST= (0..31)
1 1 145 1 1 1 1 1 1 1 1 1 1 1 1 1 1 1 1 1 1 1 1 1 1 1 1 1 1 1 1 1 
##$CPDPRG= <>
##$CPDPRG1= <>
##$CPDPRG2= <>
##$CPDPRG3= <>
##$CPDPRG4= <mlev>
##$CPDPRG5= <mlev>
##$CPDPRG6= <mlev>
##$CPDPRG7= <mlev>
##$CPDPRG8= <mlev>
##$CPDPRGB= <>
##$CPDPRGT= <>
##$D= (0..31)
0 1 0 0 0 0 0 0 0 0.06 0 0 0 0 0 0 0.0002 0 0 0 0 0 0 0 0 0 0 0 0 0 0 
0 
##$DATE= 1172140353
##$DBL= (0..7)
120 120 120 120 120 120 120 120 
##$DBP= (0..7)
150 150 150 150 150 150 150 150 
##$DBP07= 0
##$DBPNAM0= <>
##$DBPNAM1= <>
##$DBPNAM2= <>
$$ [...]
##$SUBNAM7= <"">
##$SUBNAM8= <"">
##$SUBNAM9= <"">
##$SW= 20.6930455092707
##$SWIBOX= (0..15)
0 0 3 0 0 0 0 0 0 0 0 0 0 0 0 0 
##$SW_h= 5175.983436853
##$TD= 65536
##$TD0= 1
##$TE= 294.16
##$TE2= 300
##$TE3= 300
##$TEG= 300
##$TL= (0..7)
0 120 120 120 120 120 120 120 
##$TP= (0..7)
150 150 150 150 150 150 150 150 
##$TP07= 0
##$TPNAME0= <>
##$TPNAME1= <>
##$TPNAME2= <>
##$TPNAME3= <>
##$TPNAME4= <>
##$TPNAME5= <>
##$TPNAME6= <>
##$TPNAME7= <>
##$TPOAL= (0..7)
0.5 0.5 0.5 0.5 0.5 0.5 0.5 0.5 
##$TPOFFS= (0..7)
0 0 0 0 0 0 0 0 
##$TUNHIN= 0
##$TUNHOUT= 0
##$TUNXOUT= 0
##$USERA1= <user>
##$USERA2= <user>
##$USERA3= <user>
##$USERA4= <user>
##$USERA5= <user>
##$V9= 5
##$VALIST= <valist>
##$VCLIST= <CCCCCCCCCCCCCCC>
##$VD= 0
##$VDLIST= <DDDDDDDDDDDDDDD>
##$VPLIST= <PPPPPPPPPPPPPPP>
##$VTLIST= <TTTTTTTTTTTTTTT>
##$WBST= 1024
##$WBSW= 4
##$XGAIN= (0..3)
0 0 0 0 
##$XL= 0
##$YL= 0
##$YMAX_a= 380299
##$YMIN_a= -396931
##$ZGOPTNS= <>
##$ZL1= 120
##$ZL2= 120
##$ZL3= 120
##$ZL4= 120
##$ABSF1= 16.522
##$ABSF2= -4.171173
##$ABSG= 5
##$ABSL= 3
##$ALPHA= 0
##$AQORDER= 0
##$ASSFAC= 0
##$ASSFACI= 0
##$ASSFACX= 0
##$ASSWID= 0
##$AUNMP= <proc_1d>
##$AZFE= 0.1
##$AZFW= 0.1
##$BCFW= 0
##$BC_mod= 0
##$BYTORDP= 0
##$COROFFS= 0
##$CY= 12.5
##$DATMOD= 1
##$DC= 0
##$DFILT= <>
##$DTYPP= 0
##$F1P= 14.0000005364418
##$F2P= -0.99999901652339
##$FCOR= 0.5
##$FTSIZE= 32768
##$FT_mod= 6
##$GAMMA= 0
##$GB= 0
##$INTBC= 1
##$INTSCL= 1
##$ISEN= 128
##$LB= 0.3
##$LEV0= 0
##$LPBIN= 0
##$MAXI= 10000
##$MC2= 0
##$MEAN= 0
##$ME_mod= 0
##$MI= 0
##$NCOEF= 0
##$NC_proc= -4
##$NLEV= 6
##$NOISF1= 0
##$NOISF2= 0
##$NSP= 0
##$NTH_PI= 0
##$NZP= 0
##$OFFSET= 16.522
##$PC= 1
##$PHC0= 72.41711
##$PHC1= 7.242619
##$PH_mod= 1
##$PKNL= yes
##$PPARMOD= 0
##$PSCAL= 4
##$PSIGN= 0
##$REVERSE= no
##$SF= 250.13
##$SI= 32768
##$SIGF1= 0
##$SIGF2= 0
##$SINO= 400
##$SIOLD= 32768
##$SREGLST= <1H.CDCl3>
##$SSB= 0
##$STSI= 32768
##$STSR= 0
##$SW_p= 5175.98343685301
##$SYMM= 0
##$S_DEV= 0
##$TDeff= 65536
##$TDoff= 0
##$TI= <Analysis number 999999
Compound Code 99
Book Reference 9
Project Code 9>
##$TILT= no
##$TM1= 0
##$TM2= 0
##$TOPLEV= 0
##$USERP1= <user>
##$USERP2= <user>
##$USERP3= <user>
##$USERP4= <user>
##$USERP5= <user>
##$WDW= 1
##$XDIM= 32768
##$YMAX_p= 456167190
##$YMIN_p= -41172
$$ End of Bruker specific parameters
$$ ---------------------------------
##NTUPLES= NMR SPECTRUM
##VAR_NAME=  FREQUENCY,     SPECTRUM/REAL,   SPECTRUM/IMAG
##SYMBOL=    X,             R,               I
##VAR_TYPE=  INDEPENDENT,   DEPENDENT,       DEPENDENT
##VAR_FORM=  AFFN,          ASDF,            ASDF
##VAR_DIM=   32768,         32768,           32768
##UNITS=     HZ,            ARBITRARY UNITS, ARBITRARY UNITS
##FACTOR=    0.157963299565203, 1,           1
##FIRST=     4132.6476996994, 0,             0
##LAST=      -1043.33573715361, 0,           0
##MIN=       -1043.33573715361, -41172,      0
##MAX=       4132.6476996994, 456167190,     0
$$ Real data points
##PAGE= N=1
##DATA TABLE= (X++(R..R)), XYDATA
$$ [...]
18375 190 -14243 -20013 -7763 7914 12587 12580 17364 20204 12247 7998 13785 4906 6430 3646 10974
18360 10974 12758 11534 12403 13758 13440 17064 13512 3833 3170 -6718 2739 5378 2838 1858 853
18345 853 6229 -2650 -4035 -4456 2271 18408 15540 5556 -80 4377 7190 -251 -510 94 -692 -2112
18329 -2112 5528 8910 2513 -2951 -4676 -9638 -10850 -6497 -2959 5052 4036 4518 1628 -1342 -6036
18314 -6036 -7299 -2731 -10513 -11967 -11385 -9036 -6390 15 -3624 -884 -4236 -6005 -9447 -11364 -7676
18299 -7676 -3636 -3724 -3662 -7016 -3499 -4265 6507 4039 940 8637 6106 8306 11567 8112 1276 -4209
18283 -4209 3128 6782 7071 2066 -2516 6808 16049 26362 26131 22329 23865 31360 34834 24660 12307
18268 12307 -643 5387 6251 12620 9941 8167 13937 24182 38682 33530 26265 20028 29499 48748
18254 48748 53410 44868 31610 31104 32192 20168 19990 23545 29897 36634 43265 43515 46473 47893 47286
18239 47286 46519 49547 57697 65996 64633 57881 51371 49029 46663 43273 37727 33020 29448 32145 40900
18224 40900 47418 43160 38776 42995 34115 20544 14236 22067 19661 18897 17208 17036 16284 15762 16497
18209 16497 23377 31348 22139 16607 5440 5583 -3646 -1311 4804 16848 30448 34008 37533 26301
18195 26301 17158 26407 23841 12696 10794 17742 13048 15647 22329 16875 9522 10495 18126 21368
18181 21368 14170 1221 426 7878 9014 7736 12039 23304 22449 22484 22971 16763 19818 20260 26682
18166 26682 24788 29519 34457 45533 52703 50517 55167 58972 71541 80188 90878 86885 89112 84814
18152 84814 75852 66499 55673 54250 57694 52937 50529 56367 58878 60274 72882 75621 66946 73846
18138 73846 78102 74533 87539 96063 104045 119681 141467 151656 153770 154772 161771 173122 191557
18125 191557 214542 245837 282157 320532 397511 491604 597492 711405 841222 1039631 1337557
18114 1337557 1796264 2537868 3781982 6080765 10533292 18084930 24311014 21433601
18106 21433601 13473677 7835678 4819119 3224026 2320492 1731377 1314619 1020563 811447
18097 811447 673600 570746 502274 445180 384066 335422 304244 274940 250377 215585 176157
18086 176157 154746 148028 131268 127329 137859 134705 130842 114722 109435 104086 87321 81819 80643
18073 80643 83011 72878 51425 44551 37988 34310 32054 31360 33892 33331 29681 31619 33497 30775
18059 30775 23370 18260 23868 30845 33050 26529 16983 9826 5133 2140 11704 20550 16951 14423
18045 14423 18381 12213 4842 12192 30693 33293 22181 13471 9219 13208 18853 25245 16196 6147
18031 6147 -971 -646 7372 10294 15710 21918 24478 27681 25837 13971 5837 10395 10344 6884 12457
18016 12457 6353 -1441 -4096 -8849 -3369 8436 13900 18400 20929 18629 13705 10997 12959 17873
18002 17873 12472 3174 4239 -5467 -14989 -13830 5689 6679 7155 14563 26449 25067 15500 16330 14951
17987 14951 21010 19937 5709 -1130 -4580 -108 3645 9525 12496 7868 -1731 -5939 -8718 4608
17973 4608 14101 16471 13662 16605 18047 13850 19031 19757 4004 -7036 -13421 -18936 -15328 -11018
17959 -11018 -9206 -9868 -12449 -13941 -7079 7201 8546 7068 -1965 3648 8652 6780 3400 5553
17945 5553 5641 11522 14058 13110 8803 4367 14525 21554 17019 -4511 -13213 -9286 -3488 1937 5026
17930 5026 9886 8588 4275 3544 5565 10299 9897 4641 4389 5654 5049 -724 -10591 -4530 353 -3946
17914 -3946 -9766 -10330 3728 4007 -10178 -14399 -9886 -14732 -12150 -16569 -25174 -21115 -8563 -1872
17900 -1872 5729 7297 7565 2857 -5376 -5381 -3909 949 6998 9531 8988 5996 6417 15608 16535 14263
17884 14263 6066 11329 9819 5989 -2405 -13189 -9343 -12138 -11737 -11504 2615 -1770 -6095 -8614
17870 -8614 -1789 -420 2641 9428 11427 9958 6478 3359 3306 681 -2836 6563 11540 11344 12519
17855 12519 8631 10830 16550 16428 11215 14120 22416 37078 46119 30941 24187 20655 25945 22802
17841 22802 15019 11224 6324 6182 8286 17455 25658 15384 4577 2514 2552 -4470 2332 8842 4656
17826 4656 -4921 -6074 -9361 -13960 -16925 -17575 -6444 -8640 -9286 -75 15715 7730 6468 7332 11170
17811 11170 5387 567 -41 -1422 6635 18253 6362 -2243 -649 -9145 787 6322 4081 -6741
17797 -6741 -14230 -16351 -11060 -20646 -19511 2377 12589 8649 1297 -7572 -8542 -8366 -193 4888 2501
17782 2501 4444 13210 10713 6194 -1119 -12341 -9511 6770 -1610 -9834 -3887 -8427 -6131 720
17768 720 4491 2362 3382 -3589 -16068 -19671 -17087 -19503 -22842 -23218 -23596 -19674 -25687 -29745 -23936
17753 -23936 -17142 -16814 -24044 -24704 -17412 -5290 2093 9848 18929 8473 -3609 5082 8997 6431
17739 6431 9804 8564 -2630 -925 -1236 -15123 -10932 -1462 3167 -5477 -8476 -8659 -3862 -2031 603
17724 603 2126 -129 -4934 -4932 -1459 6312 5045 4187 17049 24550 20184 17487 11986 13959 20234 17296
17708 17296 23504 27506 29036 26214 26006 25672 16739 6502 5927 8682 7389 8833 3744 -4317 5002
17693 5002 13556 5235 -3604 -9333 -14442 -13670 -9200 -5391 -6581 -2822 298 657 1126 -7238 -14146
17678 -14146 -20804 -23677 -18392 -4253 7568 5366 5460 11026 9921 6622 9162 15427 12684 4063
17664 4063 9477 17181 22495 20334 11579 -1233 -898 3218 8883 4731 -5743 -6955 2318 4216
17650 4216 3300 -3512 -7437 -12869 -9359 -2531 -635 -9155 -10382 -13732 -12110 -1679 279 7421 8392
17635 8392 5865 9803 13237 12486 1078 -12620 -7330 5004 7692 -1309 -4286 -6746 -5638 -3512
17621 -3512 -2894 -655 -3016 -6715 -13980 -8246 6027 10017 6608 5645 5085 -1296 -616 1945 8403
17606 8403 10662 -1253 -12522 -17506 -14336 -15568 -14188 -6878 -4696 3993 9747 7203 17513 20353
17592 20353 21467 13711 6110 13395 10613 5180 -79 -2880 -3069 -2569 -3383 2740 6128 6771 10760
17577 10760 8153 6105 6862 1191 6339 16647 12195 5500 14135 25380 17727 1218 10015 24372
17563 24372 29337 13894 -1965 1899 8327 1422 -311 -2762 -9968 -6179 -2331 4703 6267 9638
17549 9638 14347 8056 11588 6414 480 -10317 -7583 -4168 5940 6018 -924 -8594 -7495 -7515 -1194
17534 -1194 -826 626 -9038 -19649 -18784 -23271 -15587 -7193 -8689 -4157 210 1136 1425 3357 8606
17519 8606 -1781 -13476 -3221 7826 16315 12402 -3996 -7757 -6235 -7097 -992 503 2393 1308
17505 1308 2606 6756 2281 10760 23660 22991 12629 12907 14351 12684 20929 36590 32290 19511
17491 19511 21901 31032 32559 30271 32378 42611 53644 51777 48192 47009 48092 49083 44519 63076
17477 63076 64277 62228 68423 88695 105615 123175 154214 180526 208368 254822 300315 323987
17465 323987 321942 322596 328735 327050 284268 231149 188201 155288 128640 112683 90696 70773
17453 70773 69709 62528 71396 80475 85914 83225 66741 69181 83092 90449 117058 149042 163808
17440 163808 130093 84040 59714 49583 41083 36296 31550 27195 33675 39187 41208 42635 35743
17427 35743 24727 32832 23677 19491 25424 21882 14212 6311 1526 -2835 -2027 3422 -1469 2172
17413 2172 12905 21002 19714 17088 8879 7144 3041 -1167 5903 12363 9675 3300 -7426 -6062
17399 -6062 -769 -2268 -1285 6100 11665 13560 18952 20570 13956 5978 5452 7623 5969 -582 -3770
17384 -3770 -5708 -6401 1073 4775 -5112 -11141 -10294 -12688 -6031 -4171 219 3719 1786 -4067 -4301
17369 -4301 -3294 -1996 -7847 -8941 -4297 1559 7398 12351 14768 13841 5521 -2865 1755 -4168 -11353
17354 -11353 -11417 -17456 -19037 -11407 -9540 -90 -783 5121 4776 -538 -2514 3247 5894 2862 -3657
17339 -3657 -801 -8089 -12607 -4327 -13201 -23419 -24464 -25113 -13145 3226 12885 3883 1117 9178
17325 9178 3985 4802 7768 18562 18829 17249 21971 19643 23643 16345 13608 14943 13263 16565 9008
17310 9008 43 3579 3437 9677 16245 16325 14116 7409 -2579 -12137 -6580 -5394 -4365 -2147 3068
17295 3068 1953 1204 2322 667 6044 11651 20564 31887 25122 15118 16376 26366 34208 34146 31458
17280 31458 28741 16561 7501 14256 12580 9245 8540 2608 1109 -5214 -11316 169 3070 9164
17266 9164 12466 14601 16951 13135 17961 20595 22966 19392 25313 15909 15652 18067 16590 13304 22843
17251 22843 28146 28598 34018 29446 32772 27451 11283 4134 -3793 -9193 -3117 -5117 -7646 -2697
17237 -2697 -1014 2435 3209 -5188 -7937 -4826 5601 15900 12408 10488 11414 13420 25005 27420
17223 27420 25846 29831 24152 11571 11555 22684 23581 23343 21360 25198 26774 12119 -2736 -3674 -328
17208 -328 -4744 -13581 -9973 -9331 -10830 -15025 -12598 419 7920 9476 6371 4872 -1399 -3494 12334
17193 12334 17805 20936 17888 26849 32464 39036 47850 45513 39916 21992 18483 24204 23160 27982
17179 27982 35658 36447 35302 25728 23562 21182 19609 23744 27023 23792 29446 30577 30826 45668 59527
17164 59527 69762 79243 79010 68454 51720 51385 68184 77655 73431 66925 64038 60049 53878 49999
17150 49999 42278 38129 35373 25623 17179 15900 24053 31555 25106 22915 11814 17592 23594 26338
17136 26338 19720 14448 15556 21173 30517 21591 19870 21423 28076 29968 26506 25127 20291 24977
17122 24977 26268 26337 21699 32077 31448 26695 34390 50395 51958 43636 40727 36182 34668 54035
17108 54035 57969 51700 42942 36894 33587 34449 38518 34953 40052 37288 28559 23898 37540 43532
17094 43532 56861 67915 62035 57234 65844 65359 55669 49108 50760 47525 45538 44259 56178 61000
17080 61000 54630 47529 51618 50598 41170 44733 52803 51351 37543 36555 35123 31260 50148 55528
17066 55528 52941 51166 55238 61806 76982 90623 95094 96065 92742 90286 84410 64437 60876 70470
17052 70470 65169 61658 73195 73292 60522 57502 50430 44628 46181 54792 58327 59465 58109 59753
17038 59753 59974 68144 77456 79605 92697 94861 101106 114682 116485 111547 98611 89152 78643 70231
17024 70231 62595 53278 51028 48889 47590 44871 63585 66010 61614 61044 71171 90185 81202 77881
17010 77881 72122 64641 68767 72992 77916 81311 84636 83715 80056 87863 93824 91347 92384 90877 95986
16995 95986 102095 114059 109531 109013 103526 109692 110596 115901 120130 117578 113695 116420 105647 109596
16981 109596 110036 109039 123868 133541 133314 150672 161038 151302 151406 162798 177156 183255 184312 182730
16967 182730 189293 191968 196102 208179 223829 234093 250183 262460 265792 278588 292354 312238
16955 312238 341478 362495 390942 415076 440483 474560 509427 554264 608933 664378 718486
16944 718486 790758 873881 945755 988647 1027909 1099505 1167488 1222250 1311568 1442291 1641394
16933 1641394 1934357 2376768 2984426 3673843 4350651 5139060 6160952 7135898 7634872
16924 7634872 7778386 8027240 8327554 8230628 7767970 7372169 7257042 7400919 7899571 9030642
16914 9030642 11214476 14914712 20357974 26648880 32415299 38721203 47958341 58020479
16906 58020479 62307397 60913178 60747053 62545194 59776901 50804460 41437645 34297279
16898 34297279 27917077 21546901 16097014 12249760 9865444 8544677 7877566 7580737
16890 7580737 7586035 7956234 8471900 8659326 8432910 8198115 8063383 7612899 6686280 5636632
16880 5636632 4752499 3973878 3235290 2574851 2070723 1718592 1483405 1324520 1204391
16871 1204391 1106075 1047854 1022612 1006813 966844 915295 869146 827339 759986 669104 593147
16860 593147 535755 474177 415270 367591 331923 307418 286271 259021 250178 242510 229897 235484
16848 235484 238913 238633 231899 220550 212630 206959 201891 185147 171718 152068 131015 119911 116759
16835 116759 113087 110950 111209 101339 91387 87523 97531 100000 94859 95244 94842 86940 80991 68900
16821 68900 58853 58208 50685 50305 49566 41443 34981 38587 43625 47714 46820 55227 52373 52306 64743
16806 64743 64331 58475 60891 60393 64074 59448 47902 49195 52166 47369 42607 39251 47611 51496 47808
16791 47808 43144 46278 55167 55559 56313 61195 58621 49399 51734 65809 60968 55225 52814 65739
16777 65739 76076 70196 60437 56740 48871 46756 47118 43819 45690 40999 36202 39883 39296 28287
16763 28287 25060 25759 18347 3767 1783 -875 -2981 1530 11292 9390 3186 5766 13516 15460
16749 15460 23986 21978 9987 10024 16866 12900 8249 9540 6635 38 -4392 1656 3321 -4858 -10598
16734 -10598 -10310 -14196 -7427 -10827 -17701 -16988 -12254 -2396 647 -13838 -15540 -13568 -12014 -14207 -10733
16719 -10733 -16216 -15061 -9111 1502 4328 2710 4422 3875 1632 13894 14857 14908 15770 8511 11397
16704 11397 17383 11148 5939 3732 -812 35 3638 1155 -4359 -5576 2641 12573 16377 11510 4118
16689 4118 5614 2506 8195 8590 8039 -4055 2326 -3163 1678 1263 1085 -7419 -11521 -11511 -7870 -6041
16673 -6041 3353 12058 7893 -2047 -15531 -17410 -7037 -7475 -3201 4963 5196 -5712 -10736 -245
16659 -245 12633 15157 19320 19756 5979 -2510 -11729 -10210 -10941 -12099 -10129 -8885 -1526 3146 1393
16644 1393 -1596 -3210 1269 4875 12013 7505 1626 -4259 -1907 2665 944 -2097 3186 3126 901
16629 901 3813 -1178 -8277 -14168 -14015 -6929 395 -2004 -6192 -4556 -4822 -3643 3904 11965 7571
16614 7571 10595 4695 4722 10679 9271 9076 23204 27378 11028 3315 2536 4515 2739 -2827 -35
16599 -35 -4405 -7325 -6643 -9709 -13131 -15704 -14320 -16335 -12879 -10812 -13942 -2726 11798 8096 -2617
16584 -2617 -3768 -5821 1569 -11458 -13073 -4684 -15607 -17771 -15207 -13868 -7241 -6531 -7070 -2744 -6802
16569 -6802 -9821 -11969 -13622 -15319 -5971 4137 4330 126 -4328 -8676 -14087 -13614 -7288 -3672 -4364
16554 -4364 -5302 1126 -4622 -7039 -10175 -8087 -3715 5091 1808 -7787 -7410 -9501 -11002 -9439 -6364
16539 -6364 -3164 -2451 -3105 -2819 -10107 -10482 -4933 -323 -2083 -7380 -13646 -17489 -18385 -9281 -5955 1164
16523 1164 3219 -7268 -10910 -2545 12487 4103 524 3149 1576 -1390 -3797 -7857 -7910 -8607 -11170
16508 -11170 -6767 -7916 -7464 -3426 -6267 253 7477 9216 4059 -486 2273 3765 -1051 -2471 -8135
16493 -8135 -5641 -6883 -6010 -15533 -15778 -7610 -4176 -343 -2053 -17865 -14036 -1689 1796 10478 9882
16478 9882 9348 7589 5967 3985 -182 4465 -4611 -11419 -11957 -9941 620 8151 9925 -3294 -7642
16463 -7642 -3323 6684 15741 19733 11447 3072 3397 6172 4629 2845 194 -1804 315 7809 11057
16448 11057 9811 9572 12796 9815 5345 -898 -7196 -2344 607 -1009 -3363 -2824 8496 9229 941
16433 941 302 705 -1774 -10146 -14080 -8676 -15483 -1778 7459 -497 7453 6027 -399 -11798 -19987
16418 -19987 -23605 -18135 -18888 -15880 -24702 -29570 -32945 -33689 -40180 -37114 -27882 -17873 -10521 -4745 -8084
16403 -8084 -7657 -6309 -652 -729 -16482 -18536 -13179 -6838 -3295 -5643 -1756 -8795 -6625 -3920 14
16388 14 -150 -1866 -5009 -1190 -1370 -6627 -6106 -7093 -2443 -13851 -16799 -6919 975 7313 10554 4007
16372 4007 854 1923 3756 4731 -3753 -5723 -5690 -4035 4802 4240 13329 27760 37254 49710 49406
16357 49406 41691 39835 34203 37091 43459 42830 41081 35616 41146 55890 71380 86395 104821 130184
16343 130184 166148 212714 252922 299057 330292 326657 319514 320839 297645 258301 214070 179693
16331 179693 156193 134244 104255 68589 43066 36681 39185 36739 34175 30685 36950 34949 32982
16318 32982 39285 34234 38358 34200 25351 25316 18280 15894 9318 -198 -12484 -6289 7766 5927
16304 5927 11305 10074 4964 411 -3126 -2383 -9140 -1012 9506 -382 -6491 -3687 -10406 -16498 -6923
16289 -6923 -4527 -5603 -1342 -2194 -1029 -3535 -15443 -19106 -22727 -11552 -4726 -7358 -12042 -4153
16275 -4153 -7477 -8236 -7900 -9574 -8227 -12612 -24209 -24032 -12163 -1504 1897 6988 -377 -7362 -10372
16260 -10372 -11535 -10388 -6916 -6219 76 -1467 -2538 -5455 -8235 -5220 -3545 -1749 7740 8688 -6628
16245 -6628 -17018 -10441 8851 18085 9824 2106 -6522 -9064 -25992 -20274 -20125 -20844 -18187 -23060
16231 -23060 -29984 -36351 -35376 -28806 -10902 341 813 -5567 -6392 -6250 -8887 -11711 -14008 -11900 -6775
16216 -6775 -4463 1049 -9147 -7439 -8198 -6841 -2498 -2986 2499 2826 12587 15253 6538 3734 -1734
16201 -1734 -6569 1685 6449 13389 14437 10325 4651 -1146 -2631 -1560 -4653 -6944 316 -9080 -5051
16186 -5051 -8530 -11798 -8067 -9715 -6312 -6014 -4064 -5724 -10466 -10149 -17740 -8779 -10457 -16051 -16650
16171 -16650 -10723 -13984 -13132 -12176 -8036 -5209 -1428 -1745 1121 -115 -3022 -2372 2032 4238 -2159
16156 -2159 -2677 -1926 -14363 -18276 -23947 -22889 -12703 -8623 -6263 -2423 -562 -8626 -10097 943
16142 943 8138 5986 -367 -5518 -11677 -18120 -14537 -7603 -496 2184 4138 1832 -1977 -6377 -7280
16127 -7280 -10081 -18857 -19155 -14600 -12052 -13077 -18560 -15931 -21109 -20140 -20594 -11531 1856 3239 -8697
16112 -8697 -22198 -23322 -17310 -8181 -3863 -10060 -12793 -22018 -16846 -12120 -12123 -12520 -12449 -9614 -5873 -3688
16096 -3688 -1988 -2160 2302 2170 -764 -6196 -7557 1250 -1682 -10688 -20829 -22777 -26712 -15861 -12705
16081 -12705 -7082 1530 7620 3066 -2469 -1280 -6657 -8027 -1402 3476 -4880 -13031 -14629 -13218
16067 -13218 -5990 -2398 -10867 1722 1493 -2839 2141 2989 509 3558 6339 6430 -6069 -8487 -12651
16052 -12651 -8466 -4185 -2320 -9968 -17464 -19134 -8641 62 -6611 -2295 -640 742 -1775 4974
16038 4974 8143 6994 9943 13080 9878 4995 -5515 -5464 -3395 -1210 9641 16160 2117 1362 6646
16023 6646 1215 -9201 -15014 -13716 -12458 -3438 -2288 -7497 -10317 -4008 -2 6183 8780 2302
16009 2302 -4194 -6239 4084 5822 3611 -1309 2425 -3180 -4535 -5850 -10276 -5721 -532 1855
15995 1855 8403 5599 -1945 55 -4129 -8450 -4389 -10409 -13723 -12154 -20959 -21966 -7945 -3151
15981 -3151 -11183 -10411 -4343 1625 210 9033 13036 9338 3417 4357 9515 12534 15558 -822 -6774
15966 -6774 -3559 -4817 -5788 -10515 -17596 -7194 -1875 -3789 -6388 -9154 -7410 8619 14018 2518
15952 2518 -4495 -5486 -2595 -5781 -12105 -10879 -7039 -2084 191 -610 -2779 -5280 -8429 -4966 1855
15937 1855 3658 8590 9987 -2613 -10093 -9965 -9065 -15330 -11444 -20531 -15579 -14474 -9861 -10097 -10674
15922 -10674 -15285 -11314 -8695 155 14036 12810 7967 7084 -6262 -9671 -15681 -25009 -27656 -20040
15908 -20040 -11286 -10212 -8777 -522 3550 -2920 -6322 -1967 -10788 -11674 -8960 -761 7295 -2597 -5211
15893 -5211 -13968 -8879 -4106 -5007 -3686 5094 -169 -15431 -9322 3337 -3224 -17434 -16421 -12354
15879 -12354 -3454 7283 -7553 -18071 -19839 -5475 3598 -3750 -10816 -21506 -20586 -6965 8166
15866 8166 8031 -148 -6170 -8415 -16347 -18527 -15695 -8215 -7891 -13139 -20318 -28770 -17752 -17323 -19819
15851 -19819 -20220 -12391 -11655 -9644 -7049 -2349 -1443 -7016 -16582 -20465 -18410 -11077 -14959 -19516 -23460
15836 -23460 -25437 -21123 -16320 -17686 -17426 -13348 -9090 -10183 -4765 4435 -264 108 -7915 -11586 -17527
15821 -17527 -18649 -18754 -15933 -934 -1816 -11075 -17078 -27851 -22333 -14356 -9086 -12582 -10797 -11342 -8226
15806 -8226 -6241 -9727 -17077 -18119 -23266 -21323 -8869 -1859 740 4616 19184 10540 -2146 -9379
15792 -9379 -12735 -14555 -13734 -12700 -14306 -19881 -1327 11 -7208 -4565 -6286 -5344 -1285 -8023 -13208
15777 -13208 -3519 4090 437 -11042 -11749 -2688 -3991 -1904 -7199 -16198 -13200 -13681 -7438 -5296 920
15762 920 253 -3518 -15901 -18408 -14507 -18766 -19956 -9939 -61 1258 -2281 423 646 -2592 -3078
15747 -3078 -1078 -7612 -2510 2037 -7512 -8611 -9302 -6950 -2012 11509 18783 14428 6408 -1420 -7674
15732 -7674 -11679 4251 14723 11776 12818 11242 7451 5716 3673 -5069 -1637 1131 -2887 -9175
15718 -9175 -8549 -12223 -14226 -13956 -11604 -11567 -11720 -10298 -8268 959 827 -4195 -13992 -13640 -2310 -4773
15702 -4773 -16503 -17744 -13333 -14803 -15842 -1681 -4711 -10464 -3885 -5517 -1032 6595 8364 3984
15688 3984 220 -2662 -7637 -4766 -3916 -7229 -13377 -8201 524 5375 831 153 -2369 -9236 -12167
15673 -12167 -17548 -15507 -10175 -14514 -17952 -13098 -22278 -25004 -21132 -19359 -16607 -10979 -11900 -18254 -14969
15658 -14969 -15601 -18207 -22807 -21150 -13654 -10312 -13299 -18767 -21501 -8026 -3235 -2143 1630 -56
15644 -56 -3069 -2593 -11711 -11594 -7599 -3619 -704 -887 -1220 -8743 -17589 -19186 -14160 -9709 -2882 -6623
15628 -6623 -10710 -17161 -26357 -24945 -21323 -15102 -11335 -7698 -8908 -6690 -3186 -5207 -16279 -7493
15614 -7493 -2396 -8278 -14624 -19300 -14969 -1829 -1736 -1742 4122 -5187 -15159 -10181 -4129 -7555 -8405 -13093
15598 -13093 -12534 -388 1899 -8567 -11897 -9819 -18075 -25587 -19582 -14990 -739 -2060 -1090 -5593
15584 -5593 -15520 -19444 -19100 -31358 -24909 -12053 -2387 5554 17726 13072 3368 2470 3907 1924
15570 1924 2237 -4243 -12190 -14211 -19376 -13031 -7223 -11881 -21938 -10741 7535 11162 4416 -5994
15556 -5994 -11626 -10229 -3693 -87 -11189 -20370 -18986 -20938 -16018 -10069 -12960 -12654 -8925 -10693 -8570
15541 -8570 -11720 -20700 -14018 -5860 -12585 -10912 -4428 -8704 -10355 -8634 -9813 -1068 3820 -9161
15527 -9161 -13216 -16122 -10683 -14931 -19813 -18067 -14967 -11461 -10473 -2932 2061 -7496 -15050 -3840 7206
15512 7206 812 -13030 -10680 -8322 -8746 -8748 -177 4604 -9900 -18838 -10284 -14003 -13210 -20186 -25211
15497 -25211 -13589 -13060 -7194 -1478 -4394 -4407 -9666 -17275 -23328 -19710 -17469 -13322 -773 13142
15483 13142 7685 7900 3585 3353 5265 1461 -3750 -13992 -19876 -15340 -5084 3177 -306 -7613
15469 -7613 -17670 -15555 -12633 -12211 -12084 -9793 -13459 -13280 -20130 -22174 -14627 -9313 -8105 -17477 -25427
15454 -25427 -13134 -8401 -13553 -13270 -16263 -14656 -17350 -16832 -16680 -17502 -7953 -5280 -25941 -24273 -7154
15439 -7154 -5680 -12252 -9580 -7896 -6437 -4622 -4221 -2752 2321 -942 -8509 -6109 7950 6070 -4910
15424 -4910 -197 3102 -1685 -8623 -15294 -13946 -12919 -3921 1902 15962 23802 26754 23576 16592
15410 16592 1066 1787 -1852 -4450 244 -5763 -4503 1409 -3344 7511 9273 -372 -8232 -11950
15396 -11950 -7767 -15283 -12249 -4093 -7937 -4066 -8157 -14292 -14442 -16377 -17252 -11976 -11096 -8343 -110
15381 -110 -7979 -7986 -1117 -7762 -14063 -12189 -12836 -11209 -7763 -8240 -5183 -1082 -9765 -9279 -10351 -21503
15365 -21503 -10488 -112 -684 -3097 -10307 -16167 -24073 -23533 -11563 -11638 -11064 -13139 -13467 -12426 -4592
15350 -4592 13516 8494 -7128 -12431 -10326 -9485 -9654 -7780 -14590 -15851 -18429 -29038 -25948 -19040
15336 -19040 -5338 -1332 -5198 -8161 -8125 -7686 -12170 -13702 -14897 -9961 -8646 -11175 -10834 -14597 -6118
15321 -6118 -4694 -19096 -31370 -25794 -18552 -17739 -7774 4905 -2835 -18211 -20505 -9989 482
15308 482 -6683 -8398 -5621 -9668 -20866 -20115 -10287 -11196 -18767 -20908 -23634 -20419 -12876 -9576 -10281
15293 -10281 -12929 -17143 -24427 -15183 -2410 857 1281 -2751 -10635 -16234 -14221 -15390 -19815 -11640
15279 -11640 -6329 -4889 -11710 -12324 -8981 79 -3194 -5050 -13689 -7141 6630 11524 3040 -3324
15265 -3324 -13910 -11238 -10808 -15466 -23383 -21539 -14559 -12065 -6474 1090 10191 3732 2884 -2179 -6881
15250 -6881 -9722 -15544 -12720 -4086 3318 -6141 -5338 -4677 -5835 -3300 1004 5346 1775 -5783 -3726
15235 -3726 7229 11577 -1511 -5938 -3574 -3092 -27 4776 -5502 -11759 -16327 -15447 -14390 -15136 -8520
15220 -8520 -3232 5408 -8949 -10433 -5361 -12288 -14563 -9423 -14037 -16386 -5898 -1368 -5558 -5272
15206 -5272 -6678 -2118 4040 -320 2740 -6080 -6645 3660 155 -10185 -12911 -9748 4497 2512
15192 2512 -3988 -7501 -5745 -1514 -6830 2800 12421 16122 8654 -2703 -3168 12074 9532 2464
15178 2464 -9103 -15650 -20600 -14061 7669 5899 -6369 -18642 -14165 -1554 4617 -6340 -1783
15165 -1783 -2972 422 2228 -2942 -3697 3266 9048 6364 7640 4983 675 -1542 -5264 -4470 -3571
15150 -3571 984 -2605 854 7773 11818 15550 13902 1000 -4364 -2332 -4803 -11192 -19557 -20704
15136 -20704 -11815 -3599 -8862 -5205 5893 8945 3956 -160 -4548 -1209 1383 -6082 -19833 -25894
15122 -25894 -21047 -18952 -15257 280 8739 7317 10574 13397 11720 833 -16896 -28658 -19768
15109 -19768 -15674 -17454 -14947 -10012 -1042 4178 -5887 -9898 -12625 -12011 -16483 -13635 -5328 -2852
15095 -2852 -6620 -4675 1128 5593 -393 -10669 -4671 5415 -400 -4350 -9023 -15680 -25210 -16475
15081 -16475 -12384 -14552 -25126 -25123 -18310 -11322 -1680 8777 -6356 -19698 -20471 -1668 313 -5495
15067 -5495 -8679 -1250 11733 6641 -9 3547 6138 -8784 -17516 -21374 -15157 -4261 -2634 -5539
15053 -5539 -7660 -16473 -13586 -1836 8185 8639 4443 8876 15602 12488 6242 -7026 -6491 1779
15039 1779 -5138 3706 9323 9607 3646 3589 15278 17471 13477 3608 170 -6958 4246 6576 5895
15024 5895 85 -3166 1530 -2680 -5746 -6560 1327 1132 4882 410 -2116 532 1645 -8086 -368
15009 -368 15147 9355 6037 8130 8592 7506 -1244 -3156 264 3649 3951 -7325 -14060 -20230 -31698
14994 -31698 -24916 -15594 -4471 -7733 -9122 -12472 -12590 -130 2495 -274 6480 6527 4302 157 -3649
14979 -3649 -9973 -7756 -5925 2339 9604 5504 4498 2534 4199 4341 1707 4472 -2390 -11698 -13074
14964 -13074 -15135 -27650 -21872 -6185 10241 14748 7462 8206 3206 -10757 -12042 -10854 -4415 -2054
14950 -2054 7715 8896 7059 7408 12897 14516 7770 2732 -322 -12129 -13705 -15765 -22806 -21501 -22611
14935 -22611 -9118 -6237 -17704 -18200 -18425 -11466 -12227 -12097 -7756 -17022 -18638 -8207 -7904 -10666 -6981
14920 -6981 -6516 -7122 -4818 -5463 -7579 -2981 1318 -1308 -4634 -581 5236 5650 5951 1400 -2636 3907
14904 3907 2452 13673 12869 3513 984 790 -1250 -5174 -13842 -21123 -22962 -21728 -15512 -9911 -12062
14889 -12062 -9850 -5779 -3660 -2228 -6665 -7799 -11948 -15204 -12406 -15934 -8066 -584 3681 5973
14875 5973 -2102 -6422 -13579 -15003 -6211 -4591 -9593 -16828 -18137 -7932 5524 5254 9671 15930
14861 15930 7648 -3710 -5413 -10167 -13637 -9313 -5248 -9790 -16350 -19596 -18176 -18140 -12162 -17190 -13061
14846 -13061 -5909 -2754 -3467 -1277 -658 3719 7918 3255 -9931 -18863 -18459 -17549 -10148 2928 3272
14831 3272 -3179 -5921 288 6245 3062 3582 7853 6863 10219 12414 2011 -5695 -511 -871 3305
14816 3305 1639 -4795 -3046 -4566 -10667 -20354 -22324 1882 6504 3031 129 -1131 2694 8381
14802 8381 329 1920 -1454 -11482 -6568 -2877 -3937 -1704 -290 131 -4949 -12206 -14163 -6925 -5106
14787 -5106 -9375 -18725 -18407 -17741 -7876 -677 -286 -7277 -5283 1223 8058 2377 -10751 -14738 -6908
14772 -6908 -4804 1546 -4189 -4668 -3595 -2162 2225 1598 2834 4708 4558 3536 11917 9168 -2971
14757 -2971 78 7187 8710 4825 3804 -4259 -257 9114 2212 -10035 -9067 -13519 456 12418
14743 12418 -4420 -12052 -12016 -17194 -10603 -4184 -2841 -2565 -7481 -17315 -4828 3215 -2086 -12261
14729 -12261 -6501 -7477 -7395 -14596 -16446 -10388 -13785 -13601 -10269 -6274 351 -351 3400 -1072 -9789 -12762
14713 -12762 -6470 4000 -374 -5180 -4215 -599 8278 10401 9145 -389 4190 -1476 -4677 7915
14699 7915 2930 -12263 -18435 -17807 -14651 -13521 -8755 -13361 -9956 -16363 -16084 -18996 -12661 236 948
14684 948 1748 4224 -4408 -7722 -8535 -6284 -2204 4032 9066 6668 -5981 -7804 30 341 9416
14669 9416 15995 13155 987 1801 9520 14708 13100 7699 2782 2491 -2164 -4507 4717 10342 7389
14654 7389 -2510 -6740 -1024 4803 -3018 -12899 -15045 -12768 -5586 2404 8403 13399 2629 2536 4525
14639 4525 -3460 -5998 -14072 -16907 -11608 -11972 -1955 4125 10010 13011 6887 1642 -370 -3295 -4920
14624 -4920 -2017 -3359 -4773 -183 9950 23609 21557 19390 8450 -4935 1984 166 10198
14611 10198 9638 2979 5 7928 13056 13550 5871 6018 5359 4169 6021 2246 -7674 -16372 -10861
14596 -10861 2445 6571 2701 -2286 -9031 -18098 -10537 -4386 -5516 3606 7749 2487 -2937 -7731
14582 -7731 -13272 -3259 -1438 -7400 -10463 -5427 -6335 -8615 -12624 -8075 -9049 -11759 -16178 -20158 -21294
14567 -21294 -21773 -15506 -6566 -3250 -5579 -12477 -16862 -19481 -16542 -18477 -18130 -9907 -3300 -5544 -9376
14552 -9376 4589 20186 14150 7885 6986 5136 9712 20778 18030 9786 916 -3356 -8263 2566
14538 2566 -2152 2406 -1350 -10886 -5196 -2407 -1853 -2637 1263 935 6678 8643 8955 7014 -2641 -11670
14522 -11670 -4507 -2112 1535 -3480 -4583 -4555 -16932 -16708 -9846 -16393 -17552 -20155 -15559 -18364 -17692
14507 -17692 -16355 -20020 -13783 -10727 -5830 -815 14711 24422 15271 8560 -6136 -8980 2050 150
14493 150 -4630 4506 1712 -6740 -13365 -10570 -12241 -5753 407 4543 -609 -6717 -369 -662 -4533
14478 -4533 2801 -4498 -2543 100 -267 -6572 -9645 -3465 -1076 5694 49 -6764 -1396 253 -3976
14463 -3976 3637 8936 15085 11907 9576 3351 4519 1852 5029 8915 2412 -11474 -9541 -7571
14449 -7571 -7150 -91 7587 1992 356 2830 5883 5061 -1695 -6116 -7234 -3898 -3868 -3923 -6629 -14931
14433 -14931 -18797 -24369 -28552 -24825 -24237 -13819 -4716 -11758 -7767 -13324 -11386 -3553 -7854 429
14419 429 10898 10806 4663 7129 3291 4879 12518 7708 -1064 -230 3163 15185 12167 4313 12987
14404 12987 22440 16105 7014 -937 -11687 -12450 -15244 -14294 -11316 -1888 4347 -1848 366 6886 3878
14389 3878 8367 11124 10514 5599 1958 7623 5755 8107 10050 -209 -17265 -26111 -21737 -5171
14375 -5171 11207 9724 5192 9158 10785 866 -8018 -11818 -7215 -8071 -2486 -8496 -4868 -9644 -8522
14360 -8522 -6321 -580 -14366 -12903 -8127 -2190 -536 -1960 -6048 -854 4402 4683 -182 279 4609
14345 4609 -2496 -3749 -9540 -10336 -8270 -7349 -6096 -7490 -6993 -10663 -9640 4049 10212 4627 797
14330 797 -10523 -17076 -11526 -11618 -11551 -16168 -13888 185 2118 1949 5054 6754 3572 2756 9603 6956
14314 6956 11662 103 -3211 -11873 -16581 -16095 -13587 -17259 -9387 -127 12497 15562 9690 6977
14300 6977 16079 16185 14487 8739 6706 -2615 -6332 -3415 -4990 -4367 -4226 -15219 -18315 -10581 -6878
14285 -6878 -9183 -10585 679 3425 -3781 -8665 -3646 2968 3623 7681 9309 6002 -723 -10795
14271 -10795 -11643 1856 6243 2013 4091 3495 1096 -4280 -14650 -14018 -4700 -10167 -8938 -2160 4885
14256 4885 6436 345 5831 3732 2962 13348 16560 14391 14289 1699 -11109 -6386 -6441 -10609 -8243
14241 -8243 -9116 -11736 -12410 -8898 -5333 -16157 -19017 -11071 -8760 -15024 -13144 -3022 -317 6688 13228
14226 13228 8819 5418 -2852 -8378 -16199 -24778 -15108 -8819 4473 4037 2733 3945 612 -3136
14212 -3136 3804 9246 14061 17173 15741 -1629 -1131 -3250 4615 -3338 -3189 -739 66 9066 8977 2835
14196 2835 5352 5691 1578 4099 2155 3384 -4458 -9047 -8132 -10282 -22907 -20615 -4075 1000 -1861
14181 -1861 -573 -3422 -2995 -6246 3169 3241 5254 -2212 -7990 -1477 -3262 -16612 -15846 -6176 -7622
14166 -7622 -12325 -8156 -2300 -3824 687 -465 -3884 -1288 6191 5903 9653 2579 -3996 -10523 -10764
14151 -10764 -8104 -5173 -5160 4054 6890 -4334 -10300 -9457 -5290 8086 -2537 -11463 -2306 4849
14137 4849 9912 16856 21790 15415 6767 -4888 -8246 2467 1357 3962 11390 15473 13764 7448
14123 7448 1232 1329 5059 4870 4670 8680 3275 -1176 -3938 -10901 -16527 -16044 -489 9306 11378 465
14107 465 -8953 -3778 7019 10035 6758 2091 -1064 -10088 -10842 -9033 -14182 -6350 3992 7053 6613
14092 6613 2727 7969 1165 -232 4222 -329 -3575 4881 4246 7388 1073 2376 -466 175 1863
14077 1863 1713 180 -6352 -11531 -18161 -15118 -10498 -8025 6452 7759 1639 -2886 -12147 -10554 -9822
14062 -9822 -7167 -10918 -5112 3354 1955 7726 21649 21875 6690 -479 -2216 3039 -945 -801 5491
14047 5491 6333 7903 11966 18589 14153 3091 7572 10436 -4255 -8011 -9389 5468 9377 3192
14033 3192 477 -548 -3853 -18676 -23910 -24987 -25594 -25153 -9905 -1109 4613 10466 14988 17522 10195
14018 10195 8945 8031 5705 11005 14225 14196 16739 17810 11721 -2056 2278 8754 13337 17621 4963
14003 4963 -3339 -10914 -6799 -3660 -3171 -7946 -8451 -9164 -12702 -11244 -122 803 -4999 -12235 -12348 -2422
13987 -2422 -1960 -2043 423 6045 -3890 -4659 -2291 103 4032 5227 -6058 -8695 -598 -9449 -7722
13972 -7722 -9507 -3292 265 -1184 -4564 -4684 -5639 -611 -721 -10099 -12399 -15746 -17046 -14703 -14388 -3487
13956 -3487 -1602 -5569 -1211 141 1136 11730 16182 16845 4007 196 -742 2650 -5423 -967 5279
13941 5279 10692 9466 13439 7710 4688 10425 19589 26156 17929 9396 21347 24887 17252 18385
13927 18385 6979 5424 13621 1650 -7248 921 -1839 -3827 -10854 -13757 -9988 -613 3961 7405
13913 7405 9423 -2963 -14433 -9122 -5694 -11016 -16026 -3265 5783 6539 766 2942 5185 3210
13899 3210 2269 5628 6266 11903 9582 4669 7771 15349 11180 3330 -2483 -125 2432 3372 -7289
13884 -7289 529 -4305 -7601 -6003 -2928 5786 4772 7879 1516 -1691 11861 21033 26663 25086
13870 25086 12501 4175 -1039 -3110 1938 -1693 -16662 -12244 656 14462 24178 22282 21213
13857 21213 24679 31947 36448 31402 9855 -3585 -5502 -9394 -17553 -11960 -14754 -15526 -10962 -6016
13843 -6016 -6343 -9046 -1063 -1536 2344 9890 9335 2099 4913 10377 9239 14711 10710 1148 2313
13828 2313 9554 12085 1891 -4892 -12325 -7724 -6319 971 3403 3693 3648 -7406 -7057 6886 10583
13813 10583 12520 4394 -9085 -23067 -26536 -21701 -13771 -3994 886 4549 16671 16621 6778 10676
13799 10676 19968 19188 19297 12559 4463 4039 14462 11205 423 -2047 1498 228 11922 15157
13785 15157 6491 2481 1884 1696 -254 4958 8038 15433 7971 7705 8036 13196 2107 -11329 -15540
13770 -15540 -12091 -9119 -7634 -2593 -11537 -15887 -8378 -4892 -8468 -15957 -16319 -14837 -11286 -9187 -7749
13755 -7749 -8887 -11205 -6315 -272 2039 -347 11221 16668 16988 17045 17837 12579 10538 213 -1204
13740 -1204 -2690 2432 14775 28504 33121 24404 10568 11060 12057 5071 -6496 -4533 5024 10300
13726 10300 16587 19103 18234 20726 18337 12475 7005 19614 22029 12665 4014 3564 -3620 2445 13702
13711 13702 14972 10594 1425 -1300 -866 2353 5389 10085 6735 5571 1880 4244 1017 -2461 139
13696 139 -438 1309 4615 4347 6511 -1795 3079 -2803 -19791 -15027 -6437 -6110 1103 7551 -207
13681 -207 10473 16272 3756 7548 11671 4864 5892 4410 2648 -1127 6411 14158 17140 16900 12449
13666 12449 5440 6515 15157 21084 12783 4399 7053 470 7649 11672 2761 8521 9645 8071
13652 8071 18677 22943 25585 20453 18968 13231 13413 10242 11386 23430 28698 20959 17019 10345
13638 10345 6618 5943 14212 24422 20041 18674 15371 14995 10360 10289 7463 13279 12175 9439 7504
13623 7504 -774 -10004 -7334 -7939 -6233 6329 13978 11219 6289 13451 13638 10921 9496 10979 6911
13608 6911 3882 9470 9296 8539 13346 22853 18252 8989 2236 1750 6332 12600 5751 2717 14828
13593 14828 23667 11785 11181 16238 17098 30124 23961 20500 20260 16771 7093 273 -2011 -295 9443
13578 9443 22170 12294 6813 13898 26061 25308 15336 8926 8375 18476 21413 15302 7768 3184
13564 3184 2866 -2535 399 7738 2900 -8389 -11748 -2394 7171 10748 10121 8162 8531 12870 13812
13549 13812 -8835 -11527 -2370 9741 17212 11701 9603 17280 18565 7001 9349 19154 13915 14378
13535 14378 19483 26265 27218 23576 12149 6048 11040 15562 12854 10435 544 -12298 -18665 -21973
13521 -21973 -2170 13243 14075 8019 4288 15401 17016 13959 7894 2060 880 -288 -2797 -3774
13507 -3774 2569 -561 -3407 -1871 -470 3235 -4743 -3480 4576 17423 12700 13921 13158 10483 15036
13492 15036 22437 24151 18587 7259 7750 6246 1510 4413 4410 2328 12463 24175 27631 22657 12456
13477 12456 10499 15617 11458 4000 3894 3101 -9793 -20214 -7732 4713 11024 6272 -1112 4785
13463 4785 569 6154 5377 1268 2708 10837 15447 15817 12823 11523 9236 1273 4375 13196 22036
13448 22036 27312 19718 20158 19603 19797 22795 25671 24429 22165 22058 18913 14179 9873 20338 24765
13433 24765 26731 30961 13185 897 4636 10363 16657 21009 29576 41306 37716 38521 38558 27415
13419 27415 16060 19537 19625 11704 5635 6665 10505 7288 8726 18261 23952 27002 21074 21609 22452
13404 22452 30183 41010 30041 25563 33302 31161 31072 33271 25006 20363 23893 25317 22131 26160
13390 26160 26156 28102 34529 28063 21984 19581 19830 18482 24024 22593 11049 13186 13381 9901 6410
13375 6410 3088 5243 8638 13978 20955 30152 33328 29843 20062 23123 11906 -448 -6554 -4574
13361 -4574 2212 2318 10364 10328 3892 15280 26428 28678 24194 24909 39350 46000 32583 29664 30929
13346 30929 28195 35044 36511 28172 25268 20846 23169 30183 35663 24359 26166 36989 41792 40905
13332 40905 37245 50956 52873 52656 62473 70387 61099 56762 55571 65884 77767 99055 138312
13319 138312 175660 227615 288124 373284 483740 606567 736984 872527 1007355 1077577
13309 1077577 1083787 1088566 1077936 988131 851696 727391 624580 522090 421267 327803 254324
13298 254324 195305 161459 134899 112849 97371 93327 84330 76457 67056 65608 59130 54331 56985
13285 56985 77504 76071 59128 52777 55516 46152 41143 45005 50768 50453 56717 58646 44652 32769
13271 32769 33239 39116 41459 40392 40644 35292 33958 38666 44227 47908 47568 39206 30755 30854 32993 27567
13255 27567 15628 23403 28141 22911 23317 22223 29996 29171 23545 26631 22950 22332 16603 13288 22174
13240 22174 31717 27669 24760 17649 22761 17556 17889 27095 25232 20604 35560 40440 43210 51975
13226 51975 55050 51172 43153 44131 42275 43700 50916 46714 36683 37600 39177 39795 30099 19887 19215
13211 19215 24982 26967 33848 38492 27044 16228 20471 35822 34074 22638 26659 29034 28176 37500
13197 37500 31307 18223 13447 22959 23125 25820 30207 34670 31893 29856 29193 22263 21476 12612 16100
13182 16100 21099 21896 21560 24092 24408 22860 20139 22178 31168 34335 32257 29419 26335 22556 22670
13167 22670 36025 39852 31770 27207 29623 35442 36792 28949 20330 19865 21533 25944 28150 34768
13153 34768 42261 34653 39316 42155 35213 33508 36849 39475 36000 44295 49822 55392 56518 57777
13139 57777 59934 59973 62011 61338 68776 87469 102642 114472 134834 153519 176971 175637 182488 202200
13125 202200 220201 220306 208898 204476 205236 186694 169006 148562 134729 133717 112724 101620 97093
13112 97093 98067 93983 88316 84833 83081 80817 65318 59290 66396 64981 56586 54293 60874 62989
13098 62989 60466 58417 58385 70464 77758 75964 64108 57560 49629 52862 65521 56336 49448 53383
13084 53383 52235 40962 45326 57242 72699 70000 64846 71475 75628 78814 76149 71274 76712 86655
13070 86655 85105 90405 88452 92949 111162 126119 134202 140277 137682 141126 151966 148114 144914 145149
13056 145149 151878 163309 168916 166623 170588 174899 168648 152344 136400 117299 116082 120003 117193
13043 117193 115488 126484 127632 132055 127426 133740 133991 128928 123046 117795 124156 120815 112870 117247
13029 117247 126363 131667 139864 139709 149001 140566 130985 130389 123283 116164 125725 132936 135667 130375 130815
13014 130815 128555 128702 130594 127722 122025 129016 138295 150730 153921 162395 181937 199457 210230
13001 210230 245056 274817 283873 297215 307117 307934 305686 294480 275234 254962 234328 221065
12989 221065 207157 203736 191706 181730 176676 172002 170188 168962 178952 181389 172838 184464 201067
12976 201067 199757 208609 231053 248549 255611 253666 273059 287058 296469 311235 331707 351532
12964 351532 369321 387169 401650 411420 422302 436684 463703 471585 454006 427940 404811 383438
12952 383438 374087 379102 368325 349039 348279 346145 354969 357950 358370 365681 373108 393613 414129 428547
12938 428547 447382 470486 481614 493429 508014 519026 524423 525718 546352 571810 600636 631868
12926 631868 671221 715297 760087 803854 859098 913610 973430 1032948 1099633 1142789 1186924
12915 1186924 1227622 1254031 1281561 1301290 1330735 1358695 1391410 1427332 1472001 1536240 1630062
12904 1630062 1725027 1829768 1954434 2099563 2264766 2434560 2624251 2863323 3123892 3394930
12894 3394930 3717468 4109838 4574721 5141487 5824651 6670490 7731186 9080378 10815259
12885 10815259 13071127 16088767 20163487 25535326 32305958 41044152 53147525 69636672
12877 69636672 89947709 112544929 136447631 163101696 192003898 211955039 215438260
12870 215438260 214693669 216119386 205933742 179770548 151808375 128732905 106867109
12863 106867109 84956890 65497839 50393421 39668435 31856913 25639925 20665708
12856 20665708 16884669 14079322 11938230 10247232 8886814 7782323 6881008 6123986
12848 6123986 5480113 4931775 4475239 4067233 3716125 3413516 3142485 2894162 2683026
12839 2683026 2492659 2328319 2175452 2027865 1904558 1786546 1663035 1550159 1454465 1369948
12829 1369948 1291312 1221265 1156039 1107717 1054752 992454 947770 895397 850280 796505 739477
12818 739477 699959 667413 647766 631584 634274 633176 616394 597371 576596 561486 551010 533127
12806 533127 511056 490364 470887 459288 451702 444412 434276 437176 426264 404469 389930 382706
12794 382706 372114 349705 338962 327821 315667 311728 294309 280931 266792 245315 226639 215626
12782 215626 205190 190846 178163 180110 181561 179815 175617 170754 180688 189688 189370 199346 210921
12769 210921 211225 201702 186197 187065 200540 195713 176345 163995 165768 170501 177265 174429 170691 187472
12755 187472 205416 193274 188065 199685 206019 207560 213302 212279 209106 213536 221116 229659 231386
12742 231386 228759 228673 226658 218336 209391 195608 178626 169491 172883 160699 149125 136248 137513
12729 137513 128107 121513 112896 99432 91184 85868 97346 98704 106296 107781 116392 127939 155542
12716 155542 181910 182680 182798 186243 183974 172583 154136 138305 122486 114899 103939 82200 54100
12703 54100 44938 36465 27789 30836 26349 20571 22752 20435 11586 3629 -2203 -555 720 -7816
12689 -7816 -9161 -15436 -27304 -34648 -37843 -23805 -12443 -7870 -2034 7689 15646 12588 2425 -423
12675 -423 16568 20002 23719 20516 20184 16591 16396 18593 33261 39164 44857 42926 38356 29812 22692
12660 22692 27401 34876 30512 23857 25943 31109 27159 17395 23959 27699 27142 20824 7873 2384
12646 2384 -1810 338 5944 12074 18021 11090 5982 6570 5880 6303 4077 2376 5016 6383 12977
12631 12977 6348 1032 -3789 -6321 -4533 6318 4941 4176 8294 28564 41890 40062 34033 21564
12617 21564 23283 34931 28404 20263 20780 23118 26118 28396 24131 22146 21688 16888 23557 25729 22840
12602 22840 24569 23477 16110 6977 -1278 -3557 10743 20125 23720 20059 22425 13668 5796 9966
12588 9966 11972 18933 19214 16006 7956 5194 8645 12692 13682 10285 4566 917 175 -31 2329 -628
12572 -628 -4597 -8824 -5610 4402 22881 25875 17321 18646 15298 14715 3677 7526 5060 5107 14545
12557 14545 9716 12087 13764 14145 9976 18821 12469 1208 9307 -9879 -15015 -7171 -7218 -8760 -2107
12542 -2107 6545 13581 9224 4400 8428 11455 12168 9963 745 -8422 -19665 -23289 -19096 -16185 -15702
12527 -15702 -20691 -18497 -2199 6021 2036 -2655 -1720 -426 -4467 1527 11765 14845 22677 15163
12513 15163 10646 7157 6980 4942 -5818 -3448 -5431 -12660 -8857 183 1254 196 -6195 -14327
12499 -14327 -18030 -8982 -8797 -14189 -10077 -9626 -12196 -5151 -4513 -5909 821 4655 3716 -2706 3312
12484 3312 -952 -4651 -2503 8067 12756 3864 -3144 -254 1390 -5048 -6665 -8251 -4867 -8485
12470 -8485 -12799 2693 18727 19583 21981 28916 37981 43594 46065 36776 27520 21684 8372 -2850
12456 -2850 -1360 9855 12205 12453 21386 29008 34780 40045 43636 57954 72390 78114 82690 76871
12442 76871 63479 58603 69438 86461 110597 144465 171998 206869 255389 326260 419129 532170
12430 532170 662312 790406 932733 1045146 1088900 1092794 1096638 1055993 938135 787205 663728
12419 663728 561483 470092 376849 305642 260559 230822 206063 185455 167723 151067 131858
12408 131858 116193 107858 106678 108460 110663 99395 85295 67130 53779 39222 27532 21407
12396 21407 10695 9628 5885 9772 13270 5489 -2376 4829 17308 18833 5763 1397 1781 -1009
12382 -1009 -4105 -1891 -2802 -12415 -15919 -8917 3336 9325 5576 2862 19296 37097 55481 57940
12368 57940 41380 26399 15826 22025 26392 34977 50145 46366 32608 30345 25189 18057 22437
12355 22437 21920 3523 -2266 6218 -1434 -12983 -14461 -14831 -12271 -6263 8457 9133 -4955 -19124
12341 -19124 -33956 -27541 -10047 4632 8964 14487 15429 10320 383 -8527 -5516 13410 20877 28522
12327 28522 34339 31020 32526 22728 12060 10879 13622 10409 2519 787 232 359 -7477 -10120 -20516
12312 -20516 -22320 -17126 -15076 -16483 -9296 -5859 -13967 -17921 -8561 -6645 -14721 -18958 -13944 -6112
12298 -6112 -4182 -15240 -15890 -12213 -7937 -6582 -5356 -8161 -12793 -22146 -13829 -6095 -6622 -2693 5561
12283 5561 15092 11663 10996 16046 14196 17280 20201 18775 6472 1842 4077 -6158 -6853 3143 1414
12268 1414 -4077 -99 6079 4757 1352 2714 4073 1280 704 -1940 6442 4775 -5570 -13413 -12819
12253 -12819 -4552 -3224 -2249 -5416 -3054 -5335 -6756 6812 12889 8644 2830 -1498 -574 -1674 1722
12238 1722 -4275 -7337 -7118 -3567 -5883 -8736 -17789 -23068 -17632 -21363 -14762 -7515 -15781 -21595 -16061
12223 -16061 -15597 -23368 -32132 -26075 -34533 -34236 -30685 -16851 -8840 -4689 -1694 3116 1850 2452 2739
12208 2739 2677 -2742 -5915 -11340 -15028 -15003 -6669 -1287 -2488 -1535 2454 8310 11477 9234 3651 2225
12192 2225 -1510 -938 -3621 -19466 -24595 -21392 -17367 -24333 -14040 -14639 -14990 2447 6061 5180 -3575
12177 -3575 -1676 -4473 -2081 4138 3237 -4407 -13724 -7642 -4446 -8041 -7367 -2962 81 -4222 -1093
12162 -1093 39 -3463 -7533 -11142 -13719 -25209 -29392 -28878 -17264 -12500 -3974 -3361 -5822 -7756 -5842
12147 -5842 -13943 -17685 -15290 -21395 -20617 -5297 -1767 -3679 -299 3374 -1112 -19857 -21435 -11123
12133 -11123 -17228 -16506 -11979 -12691 -15954 -15640 -20606 -17753 -16523 -17192 -24924 -24049 -22904 -20745 -22836 -12097
12117 -12097 -1215 -9884 -23089 -28018 -29809 -21665 -15362 -19683 -21577 -18924 -15207 -13852 -15718 -22923
12103 -22923 -20092 -5076 -6852 -7061 -3223 -10939 -18030 -19972 -10953 -109 1516 -3018 -12795 -19269
12089 -19269 -12484 -6507 -12083 -15181 -19133 -22983 -20972 -17353 -13973 -16898 -13699 -9151 683 -2850
12075 -2850 -11256 -7232 -10182 -21226 -11287 -13997 -4701 -4586 -8591 -11491 -15831 -11688 -12964 -11481 -27381
12060 -27381 -33898 -32709 -30202 -25247 -25651 -30602 -31654 -28689 -28675 -17867 4908 7814 -5812 -9648
12046 -9648 -4114 1376 -4031 -9157 -11109 -22071 -24024 -15724 -14398 -11639 -2987 -570 -7021 -3433
12032 -3433 -6131 -3612 -11071 -11429 -5380 -9971 -9423 -6695 -10470 -9548 -17014 -24033 -19212 -10857 -14892
12017 -14892 -25914 -23923 -13986 -15127 -6183 -6170 -6917 -6793 -2630 -8443 -13329 -15468 -29130 -33658 -25798
12002 -25798 -21754 -17545 -16363 -13859 -6498 -8281 -17187 -17800 -13983 -14705 -20632 -14700 -15839 -28373 -32212
11987 -32212 -29947 -30447 -27742 -26146 -23832 -22458 -24152 -16714 -22293 -23272 -16941 -13420 -9477 -6238 -5237
11972 -5237 -13249 -13710 -9218 -448 10231 7053 4052 -6 -6105 -8275 -4301 -8872 -10009 -5966 -2043
11957 -2043 -11227 -19966 -20822 -15825 -23882 -27760 -13747 -6130 -8321 -13824 -18285 -41172 -36306 -16485
11943 -16485 -4853 -3980 -6827 1320 -4395 -2280 -329 957 6931 3738 1170 -7394 -11388 -10621 -5924
11928 -5924 -248 -5835 -13989 -10481 -9542 -20661 -27438 -28612 -27153 -20060 -5873 -9064 -13330 -9734
11914 -9734 -7096 -3655 8543 16061 9567 8227 8158 12147 1728 344 6425 7666 828 -12081
11900 -12081 -14939 -3589 -5988 89 808 1323 -9003 -16598 -20498 -9328 5366 2533 -13072 -18748
11886 -18748 -14877 -21845 -22156 -20134 -16984 -20179 -20968 -25537 -31005 -23647 -15005 -10307 -349 -1519 -7268
11871 -7268 -8200 -1560 -8909 -18496 -21235 -15374 -11226 -8999 -9276 -14189 -20512 -19592 -15482 -17485 -19626
11856 -19626 -26862 -22906 -12042 -11863 -19917 -22387 -21214 -24464 -24335 -18390 -9980 -4976 -3763 -9049 -5156
11841 -5156 -513 -2815 -9663 -13426 -24992 -25025 -13960 -15313 -18660 -9457 -4340 -13154 -22542 -23150 -28094
11826 -28094 -30976 -17577 -9376 -6730 -3013 -7806 -4744 -1687 -6790 -6599 -9659 -11889 -19643 -27021
11812 -27021 -28153 -25765 -16594 -1818 308 -7967 -14588 -10000 -13854 -6375 -12049 -9626 -1833 -882
11798 -882 -8673 -11165 -13021 -10705 -13270 -12482 -4243 -13274 -23498 -24011 -25550 -37674 -35460 -34718 -31667
11783 -31667 -28724 -22682 -14985 -22682 -26661 -28493 -11546 -8083 -6191 -6897 -13921 -16815 -15444 -10274
11769 -10274 -5718 -8862 -15378 -26225 -31131 -23394 -9304 -4180 -21882 -17072 -9652 -7436 -6895 -3538
11755 -3538 -9050 -4065 11549 9765 2577 -1923 -11244 -18319 -19201 -13965 -17186 -18337 -18356 -13439 -9251
11740 -9251 -5613 -13960 -19165 -20893 -21319 -19407 -6936 -9197 -10237 -19362 -11130 -3498 -792 2315 1318
11725 1318 3218 3862 6607 2083 -7721 -8325 -8950 -8173 -1612 -1931 -6595 -23507 -26891 -10758 -1362
11710 -1362 -3866 -12906 -17714 -15576 -6133 247 -3199 -1189 -846 -4226 -10681 2441 7979 10948 776
11695 776 -3605 -13590 -30708 -39696 -30215 -32663 -20171 -1744 3204 -8466 -9486 -6162 -12281 -12655
11681 -12655 -11894 -8924 -15709 -14542 -6068 -2986 -445 -1899 -10703 -6783 -3709 5124 10980 -696
11667 -696 -7379 -8812 -12974 -22576 -24522 -8051 -7504 -14729 -9351 8277 8440 2357 422 -358 -1222
11652 -1222 -9774 -4157 -1022 2760 229 -7632 -11474 -16874 -3758 2937 1348 -2272 -14536 -12238
11638 -12238 -4818 724 394 4179 223 3868 6204 315 -2945 -723 3900 9599 2333 -7318 -11738
11623 -11738 -20561 -20811 -8885 -6279 -7591 -3176 -5734 -6770 -6691 -15112 -22792 -15731 -9561 3101 1995
11608 1995 -10859 -10592 -8042 -6425 -4767 12831 18237 17076 18485 10476 11283 6480 3115 6446 63
11593 63 -3388 -2901 -6388 -12357 -14463 -9914 -8381 -10756 -11851 -1502 -5219 -3095 10860 13203 2231
11578 2231 -5089 -9882 -14602 -11862 -8695 -10445 -11588 -17994 -12988 -4863 -1869 -7863 -16134 -13795 -12011
11563 -12011 -13545 -17052 -14767 -22190 -20602 -8732 -8459 -16729 -21184 -18183 -11430 -15657 -16443 -13875 -3142
11548 -3142 -797 -4931 -1864 1933 -4488 -6794 -3313 -489 -8133 -11212 -11846 -11781 -13227 -17351 -13951
11533 -13951 -6809 -10365 -20986 -23069 -25217 -13921 -12319 -14118 -24456 -25769 -21510 -11639 -7809 -14992
11519 -14992 -23073 -24790 -24051 -15588 -22551 -34719 -27096 -29158 -25864 -29373 -25695 -25172 -26827 -17552 -19865
11504 -19865 -23990 -22213 -12582 -10737 -18008 -22260 -30009 -26843 -26538 -15687 -16338 -15288 -18050 -13582 -13471
11489 -13471 -16681 -15151 -10115 -23765 -29904 -33040 -25134 -25080 -18151 -20571 -11513 -9297 -16318 -17648 -12581
11474 -12581 -7224 -6123 -16851 -11194 -10916 -3379 9482 8730 5135 7921 7712 5376 3380 -4145 -8100
11459 -8100 -2239 -13566 -14059 -10168 -6992 -6338 -2259 1536 8877 -3566 -20075 -20723 -13890 -1199
11445 -1199 8770 10776 5366 -6815 -7890 -7121 3824 8627 -9300 -15405 -6345 -275 -3565 -15007
11431 -15007 -20084 -12630 -2831 6033 -6456 -5450 -2999 -10488 -8836 -5007 -3028 -9427 -4633 -1635
11417 -1635 -2946 -7678 -458 6073 7925 6928 5626 -1066 -11127 -1183 -728 -2532 -8153 -10610 -11322
11402 -11322 166 5631 -10700 -15090 -10166 -21581 -28899 -27676 -15716 -8087 -13744 -16431 -21808
11389 -21808 -22236 -10001 -4553 4632 6896 553 312 8789 17641 21382 13350 -3229 -5765 -16050
11375 -16050 -14214 -11320 -9471 754 2966 -5393 -1821 20 765 -5254 -9926 -5794 -13078 -5748
11361 -5748 3245 6335 3948 -10063 -15087 -12801 -11007 -4390 -6167 -7203 -4207 -1881 -11909 -20046
11347 -20046 -19252 -22213 -16428 -7201 -4726 -3413 -1720 -5984 -1556 -9480 -15287 -17773 -22242 -14797 -13562
11332 -13562 -13799 -19892 -18755 -17638 -15620 -5541 -4888 2948 812 -3661 -1344 3322 -2430 -10453 -741
11317 -741 -2178 -4406 -4003 -14007 -20715 -14319 -10880 -10105 -10084 -21040 -20860 -14594 -2531 572 -1717
11302 -1717 -7812 -5307 1110 -7410 -19665 -24771 -19590 -14834 -15295 -15714 -13439 4097 8328 5828 -1508
11287 -1508 -1545 10616 7328 3938 -3942 -1795 1318 1698 -3109 -11912 -17835 -22091 -19129 -14169 -9454
11272 -9454 -20751 -26226 -17020 -5669 2404 5718 6669 2870 -11411 -15274 -6802 2 -83 -4806 -697
11257 -697 3452 2205 -4741 -5030 -6482 945 -4884 -9412 -5847 -5206 -9994 -17847 -15736 -14792 -7249 -9091
11241 -9091 -16148 -23472 -23293 -24015 -20170 -17622 -17683 -9820 -3923 -2917 -5833 -4742 -6797 -10698 -5659 -9614
11225 -9614 -12890 -7608 1049 -7011 -7930 -1042 -3206 -758 -5049 -8098 -14480 -18095 -7711 100 -4408
11210 -4408 -3385 8908 10673 2605 -2227 -7773 -10045 -8398 -3793 -5009 -6986 854 4542 1026
11196 1026 -2521 1942 1555 -5009 -2933 -1967 -3119 -9426 -9215 -7138 -7438 -7662 -8299 -5943 -8603 -2992
11180 -2992 -7308 -6225 -2438 3020 -2147 -13635 -10853 -12089 -15107 -21095 -8434 5346 4750 -590
11166 -590 -10388 -14252 -18077 -15891 -9982 -6801 -14227 -13193 -13051 -15018 -10374 -7020 -1070 -4259 -8956
11151 -8956 -17863 -13206 -10963 -12306 -18379 -25067 -28036 -27637 -16476 -6997 -8909 -1749 -3548 -11419 -20332
11136 -20332 -13398 -8847 -9587 -10497 -20160 -16973 -8317 -7853 -1960 10620 16581 20412 12031 257 7618
11121 7618 3453 -2667 -6680 -15117 -16235 -22300 -18954 -15625 -15799 -15303 -26838 -17884 -3363 4861 -3403
11106 -3403 -6075 -4314 3358 4593 6802 4355 -229 -12587 -22024 -15243 -20989 -13889 -8933 -8610 -8691
11091 -8691 -3947 -4244 -1634 -6120 -10781 -5517 -6072 -3859 -8610 -14064 -15325 -8766 -4214 -2603 222
11076 222 -2099 -2176 -8805 -7091 -443 -744 -9764 -13073 -11176 -5550 4382 13589 6336 -3114 -11673 -17383
11060 -17383 -19150 -20761 -20584 -6976 3585 6007 -1393 -5373 -15016 -15818 -8078 -1000 238 -3294
11046 -3294 -2914 -15350 -12496 -5264 -5778 2844 351 -6101 -4506 -1158 -220 -3457 6687 15378 10309
11031 10309 -44 -9604 -2183 3786 6556 -3394 -7579 -2028 -12358 -6607 -5727 -129 1913 -7313
11017 -7313 -12822 -8034 -6273 -6725 -4887 -2949 -3837 -4751 -6132 -8714 -8898 -14177 -13144 -10469 -4672 -2657
11001 -2657 -3805 3899 8780 -519 104 2118 -80 -6965 -9928 -12237 -11880 -3607 -2990 -12073 -13123
10986 -13123 -6117 -10852 -8981 -5683 1099 14980 16057 17055 15268 12097 5322 -1395 -3365 809
10972 809 -2026 -6058 -10145 -14411 -14649 -9034 -5660 -1310 9401 17603 15046 56 -5820 -1605 -635
10957 -635 -7988 -21111 -10183 163 -1524 907 4065 -1817 490 3828 1089 -5331 -15831 -17129
10943 -17129 -9493 -5850 -4978 -2261 3127 1423 4771 4431 592 -5551 -7792 -12725 -11747 -7371 -2352
10928 -2352 -2429 86 2346 -3115 -10085 -14344 -31234 -33832 -23086 -21214 -18879 -11885 -10133 -7765 -5929
10913 -5929 -6511 1059 -503 3838 1547 -1383 7431 10587 12581 7647 5677 10481 3992 -1521 -2701
10898 -2701 -5059 -9328 -15694 -14602 -538 12711 12372 10020 4081 -2225 4194 11987 10716 10091 3126
10883 3126 -6571 -9046 2458 8642 2829 -1629 5025 7366 -5056 -4814 923 6621 7107 9868 13471
10868 13471 1428 1329 9086 9807 6000 6568 2975 -4113 -4646 -11651 -11245 -8843 -2397 20 6101 5373
10852 5373 8833 11830 2606 5231 4677 4274 6122 5038 -2912 -2295 2859 2371 -4034 -8300 -3795 6313
10836 6313 1442 3958 7691 15587 15420 9451 7881 6590 3600 3731 10768 12052 -1698 -4859 6914
10821 6914 19870 18979 10574 8275 4411 7618 7830 2785 8869 15178 8406 7956 14330 10797 10548
10806 10548 10343 7597 -1127 -2219 -14791 -16592 -2586 2673 1608 -1127 5294 8926 2690 4159
10792 4159 2943 285 1341 5247 9517 14126 13730 13636 10569 2483 3295 2124 -242 -1080 5322 7825
10776 7825 18620 18124 5415 -279 -5859 -3764 -1083 -876 1658 -4879 -10587 -4812 -2650 -4143 -47
10761 -47 4624 -4031 -9587 5693 8065 11103 23030 27397 9849 -12681 -14863 -8462 -5927 -6225
10747 -6225 250 13185 17652 7549 -1491 3032 9347 5148 11143 11784 20946 25613 11314 6405
10733 6405 13693 18721 8393 5022 5077 1753 -6391 -107 -934 -1839 7473 4575 4980 4878 -1161 -2216
10717 -2216 4228 1658 -3700 4597 21309 16311 12038 7505 12514 11285 5708 9320 9416 9508 -5233
10702 -5233 -2746 4069 9004 10275 10422 8178 4400 6604 1745 -984 -4730 3640 -467 -1251 5250
10687 5250 12353 18642 23049 23299 13439 13976 19767 10826 4847 7015 3703 7629 8698 6002 10180
10672 10180 6662 2551 4142 7287 15914 22494 14670 13012 15410 15120 13976 4062 8595 7997 -3165
10657 -3165 -6417 2841 13561 14548 10705 8880 6985 7580 2405 10840 13079 -2111 -2645 -2515 -9689
10642 -9689 -14174 -14320 -9593 2163 7027 5780 3813 4767 4652 7046 11633 9550 6261 4907 3829
10627 3829 1256 426 -4083 -7905 -11322 -10933 -632 11892 17253 8176 5643 11102 11767 15337 13002
10612 13002 8022 9315 7058 9026 7509 3356 16 3118 4879 6283 6523 -4376 4326 7533
10598 7533 5095 6990 9981 8518 11548 10477 13266 15864 9939 14504 9664 3117 7963 4029 317
10583 317 6933 7183 11700 21689 20112 3531 -279 7989 4600 -2925 6706 5847 -290 -736 11469
10568 11469 16628 9784 10156 13821 10849 4108 7425 16480 21262 21229 20233 13017 11087 3032 -211
10553 -211 2434 5781 8958 10965 11005 20683 16621 8821 6307 -635 -4846 2172 8874 7950 6544 6222
10537 6222 -3959 -7047 -3385 167 962 -4295 -7388 3241 14344 17988 9896 14257 17327 24777
10523 24777 25710 16694 5026 -325 -2663 -4430 23 3266 -4413 -4760 -7258 -3337 10277 19112
10509 19112 16483 12828 15179 14542 11133 19776 17626 10973 4353 216 8874 8562 6564 6337 10831
10494 10831 12265 2732 3658 14165 13817 8250 10863 9416 8 4009 7334 2266 -4897 -5522 3646
10479 3646 6745 6203 418 3878 8152 3406 -1975 -1225 1750 6289 7189 14466 16807 27498 27664
10464 27664 29543 20964 13785 11951 10854 51 -7600 -6990 -11951 -183 12176 11135 6089 14165
10450 14165 17817 14093 8673 8587 16523 12160 4313 10161 15871 13423 10658 13397 14975 15822 19575
10435 19575 9978 15544 22352 31141 32148 17233 11904 13493 12492 3590 -99 3584 13557 16569
10421 16569 12248 4072 5303 6996 17611 28032 20381 12354 -411 -2003 13206 17434 21652
10408 21652 13746 7560 3968 8436 2443 -8201 -5127 3477 2299 -691 -5519 -1798 -734 210
10394 210 15205 16128 13911 15073 4702 -7565 -10546 -3712 5509 7659 626 2857 4870 6848
10380 6848 8646 11121 14581 18690 6859 5808 1236 1308 11410 15226 14934 8963 1277 751 11417
10365 11417 21177 18489 23680 24734 14806 4945 2337 8388 12715 15415 14632 14823 12435 7866 9570
10350 9570 15193 15756 9132 13509 17529 17071 5456 1541 -3033 5273 8445 9875 12474 10470 11806
10335 11806 22303 21654 21766 26800 27854 28970 19983 11500 1368 -8223 273 3330 -1459 2717
10321 2717 24625 38977 36930 23496 17072 13615 11122 10747 11951 10926 8474 10222 14011 14717
10307 14717 29122 33553 28375 18389 13762 17524 20399 22849 16024 14064 18541 16532 12232 18023
10293 18023 22788 15986 22019 29201 26835 29107 26282 22136 20815 18691 12652 9999 23600 34180
10279 34180 29560 27011 23834 14233 22660 36803 34820 32846 31044 21420 10918 9676 6649 3044
10265 3044 756 2351 9612 9242 6114 10675 23290 21394 17352 13640 18268 23217 20011 19809 23297
10250 23297 28680 24424 20527 16347 21422 28673 31899 18783 13682 11218 14546 22190 25470 30551
10236 30551 22149 13235 9083 13053 17174 19017 23180 27848 24217 20805 23250 35502 39697 35732
10222 35732 29135 21270 19690 22056 23122 23778 15824 13255 14844 27656 31816 37379 42482 42111 41762
10207 41762 35961 27452 21161 12975 12388 16733 33066 33439 23114 15678 17564 19704 15802 9461
10193 9461 15054 14043 20361 18110 9570 12754 11690 7192 8435 13935 15460 16407 13184 14417 15261
10178 15261 11174 10819 24160 22645 16167 15169 19585 26120 24744 28913 35102 31538 21102 5782
10164 5782 2976 13168 12028 18517 12610 13926 18377 13173 17287 24914 30427 22002 24930 24122 13626
10149 13626 15807 18615 13309 5292 891 8434 16171 20223 22458 14066 14960 22285 26417 29567 21893
10134 21893 23947 22757 16920 9494 7754 4501 10672 15603 22287 22616 22807 21370 25927 29390 32680
10119 32680 32768 34715 33348 29103 15259 4480 2955 6244 5685 2487 1023 3632 8669 25940
10105 25940 29280 24126 18420 6627 8603 14371 26108 31922 17793 23381 21250 18254 18523 10744
10091 10744 8842 9916 15102 16273 11660 16246 20052 23932 17137 12399 8996 15138 21621 31173
10077 31173 30193 29116 27057 28739 29814 26544 31578 29956 21415 25039 27919 25065 22975 16633 15998
10062 15998 22289 21960 22101 24396 18137 22063 28307 34456 39160 43159 50312 51518 51716 52426 41665
10047 41665 30611 29508 32767 30190 25984 28560 28065 40684 57105 69996 67573 57207 42998
10034 42998 31637 23117 14655 14388 21023 24974 30868 33696 35049 22821 19640 16278 13023 22996
10020 22996 35077 23448 28681 45111 54458 60046 59117 55077 44703 35853 28217 32891 25246 25143
10006 25143 26606 31390 24431 23611 28701 33374 38764 41407 35035 28586 39386 38035 37941 38974 41182
9991 41182 38660 37874 45382 50894 57778 51140 39481 33205 28508 33942 45943 53062 47744 42904
9977 42904 32025 28707 27925 28516 36187 40318 34136 37993 29182 33183 36321 33660 29365 39926 46284
9962 46284 43334 34042 36327 36740 25950 22796 26007 32904 48812 50036 42745 34643 31502 32590
9948 32590 29329 33586 40365 42758 46382 46014 44210 48956 43277 33218 39649 50209 40052 18383
9934 18383 18722 37779 38009 35243 28989 22468 24018 35176 38626 44754 51178 52547 48735 50294 48430
9919 48430 54262 49858 49352 42021 39087 37728 40471 51042 46496 45885 44319 38031 34264 36131 42814
9904 42814 47007 56908 61272 56046 56994 53644 48859 56924 57447 43940 33844 37290 44149 49943 56176
9889 56176 51496 36765 30626 32080 29335 34883 47781 48792 55588 64279 63852 56262 46486 36198
9875 36198 37198 40230 39666 47190 50310 51121 34751 21735 27431 25896 31295 34773 42184 49573 46682
9860 46682 39834 41979 44133 40423 28354 29046 47744 61159 67387 57719 57510 73410 84148 87028
9846 87028 89244 97069 111014 128469 139564 173493 233046 331197 447669 528410 509858 398578
9834 398578 292215 216885 165782 136343 124126 108145 101957 93020 79933 73432 73328 72877 73603
9821 73603 71830 62425 55942 60560 70249 63477 55571 48489 42219 45574 53003 50910 46350 50185 60229
9806 60229 66348 63753 58091 56174 57960 66318 67116 65707 73193 70746 69764 64029 53878 54927 57500
9791 57500 54837 50310 54001 52683 51258 47913 43919 41142 52189 50653 51931 47725 48714 50550 51322
9776 51322 43650 44601 53891 58317 59149 57864 54953 52781 51229 54539 56052 49906 51640 59797 66290
9761 66290 63637 59979 61233 51762 54881 49465 51441 63714 73412 73257 72876 56032 45828 38998
9747 38998 38047 40452 39674 36936 42851 58844 69185 68199 60107 58670 60766 57817 60308 59571 59572 61402
9731 61402 55179 57508 63728 63938 63329 61880 56998 60114 54597 59786 60796 68542 73275 68746 67406
9716 67406 68096 63703 73024 82539 73420 79454 80331 77064 74621 71447 70963 73391 69657 69671 68053 75390
9700 75390 82087 85011 79227 84004 77554 73125 70520 66327 64968 63405 66367 78994 77125 72949
9686 72949 76723 75440 64246 54521 60066 62966 62655 63327 74713 76078 65055 62238 61469 60710 65285
9671 65285 72549 79414 78259 71297 66482 70890 79532 83928 80192 81563 98881 110881 105551 90569
9657 90569 95815 103687 93897 90383 99089 102057 98973 94035 87042 85760 100250 109255 115351 112723
9643 112723 98162 82699 74706 68594 69485 83358 84069 87646 93261 86459 87193 88658 83176 79116
9629 79116 83127 84289 81564 91890 93601 91497 86478 93792 96857 88439 91890 92689 95807 97726 104574
9614 104574 104179 104338 102648 105362 106651 103027 99963 103108 99702 107609 115416 114554 117146 130038 126561
9599 126561 122022 125618 121562 112645 106832 110381 122236 125876 122877 125880 119573 119398 105309 104857
9585 104857 103132 103342 106402 104308 100971 103069 100722 91421 90894 96437 106824 119177 130348 127672
9571 127672 115351 102210 105603 99701 88815 93650 95724 92704 96348 107084 105211 101651 102776
9558 102776 110871 114919 118932 117072 114695 120147 121817 113676 103519 105783 114275 124464 123545 115883
9544 115883 103894 105336 114198 128184 129185 126607 120547 118702 122763 127839 138091 151562 171030
9531 171030 182293 191756 203649 205772 203527 212277 225933 212707 189269 172063 172464 162131 157040
9518 157040 147894 144059 143807 129001 115077 110797 121753 118164 101569 109397 121900 123384 122132
9505 122132 122226 120820 124805 132533 135708 138817 148171 162772 167656 167252 165959 181465 214809 245820
9491 245820 253543 274719 294067 301249 307354 309307 311246 310635 306721 317361 341616 351988 343303
9478 343303 332602 322619 310551 309294 307112 300321 305897 319064 305938 278547 268327 261137 247043
9465 247043 232094 213333 214980 229986 237397 233935 235402 235416 231030 226743 212898 210592 227671 233600
9451 233600 236366 255442 277716 298985 317295 320733 322324 318162 310117 305936 302531 309025 318353
9438 318353 331949 355320 395739 442276 495087 526511 537404 542161 552708 559799 553964 526704
9426 526704 500915 485961 484062 480523 456400 424816 381072 340592 321373 311446 313024 315974 315280
9413 315280 321121 334091 364010 385438 388690 372740 356331 347127 334163 318679 304352 304728 296145
9400 296145 304627 326769 346321 359973 371261 375813 379305 381329 376237 365833 357425 362198 378731
9387 378731 410778 455177 510324 559563 579153 580050 567036 549620 542929 541459 528579 493016
9375 493016 446559 413052 395171 378705 377422 373807 381239 402063 431550 452229 464585 464302 447768
9362 447768 411621 384178 362592 344534 324618 314759 314823 316508 320027 321554 330492 344299 357770
9349 357770 353308 358862 360170 363852 363381 366083 374705 381292 380691 381212 384698 383770 398728 418474 427920
9334 427920 446300 462127 490836 516630 506510 498403 502516 503183 500331 495566 473506 460373 473367
9321 473367 480051 480294 486400 510928 547161 583366 616541 669240 732336 809807 922445 1064886
9309 1064886 1238805 1404810 1521591 1589453 1664263 1829313 2107058 2511205 3027220 3701300
9299 3701300 4778691 6797557 9905436 11824594 10068960 6854770 4621981 3319242
9291 3319242 2541631 2040327 1678964 1424107 1258800 1155642 1069853 1000297 964170 930339
9281 930339 904546 877914 870411 879002 887537 911314 955393 1015052 1110598 1244357 1427678 1663597
9269 1663597 1956280 2269482 2586973 2878111 3076806 3169378 3246467 3371819 3545013 3787851
9259 3787851 4101923 4375115 4444661 4268675 3996169 3756075 3637224 3664986 3805192 3944418
9249 3944418 3952221 3811019 3607776 3429364 3302894 3191324 3090138 2998279 2904286 2843627
9239 2843627 2821144 2829504 2827198 2738998 2591931 2419138 2279003 2204045 2214752 2313246 2461450
9228 2461450 2616752 2765887 2906461 3025041 3084225 3091329 3107001 3196905 3381908 3631790
9218 3631790 3878111 4084516 4287219 4575295 4975082 5476076 5947770 6212363 6273193 6314569
9208 6314569 6531038 6965008 7452127 7783331 7845555 7671055 7386061 7116257 6898016 6675479
9198 6675479 6354111 5941637 5535498 5206183 4929977 4702890 4517125 4382324 4303669 4263325
9188 4263325 4219599 4134332 4013703 3914661 3878282 3913524 3984335 3982340 3873562 3714004 3592704
9177 3592704 3564682 3643050 3763439 3823596 3764947 3633500 3515082 3479895 3591822 3838853
9167 3838853 4150180 4477757 4821360 5193134 5623189 6084104 6480028 6677799 6741297 6823403
9157 6823403 7008544 7218738 7422291 7607286 7688441 7622347 7509041 7438975 7407356 7355555
9147 7355555 7350382 7555307 8130965 9183436 10818844 12996459 15155730 16117872 15197493
9138 15197493 13212930 11418560 10333443 9943695 10156664 10853246 11953764 13238145 14079327
9129 14079327 13824407 12431720 10476740 8571029 7053313 5972257 5230093 4748005 4441269
9120 4441269 4249365 4143179 4108133 4130615 4232299 4434899 4760266 5187357 5675960 6131510
9110 6131510 6517695 6889733 7376223 8094060 9052082 10235567 11582256 13089503 14985912
9101 14985912 17719188 21792253 27423074 34232503 40981323 45217067 44677869 40517998
9093 40517998 36265713 33799895 32614491 31668682 30765843 29917660 28486579 26042685 23262920
9084 23262920 21202771 20405222 20881872 22295156 24009329 25358668 26108812 26409936 26293778
9075 26293778 25369070 23181281 20214149 17555408 15839396 15272311 15911085 17637646 19792550
9066 19792550 21285596 21324997 19954160 17955143 16356151 15846805 16618281 18691153 21872869
9057 21872869 25169411 27112880 27523500 27680071 28549647 30300844 32986598 36795969 41462384
9048 41462384 45531097 47515338 48370136 50642004 55417371 60835449 63677256 63363994
9040 63363994 62775203 64065094 66033920 65923171 62968904 58297272 52660523 46767919
9032 46767919 41619647 37752936 34921596 32398025 29699508 26847558 24284792 22510872
9024 22510872 21868449 22627297 24769740 27558843 29312200 29073357 27970257 27393416 27438526
9015 27438526 27513068 27405640 27428906 27520371 26558192 24363549 22715616 23145806 26031496
9006 26031496 30686425 34739939 35326185 32302719 28434954 26074863 25897371 27957815
8998 27957815 32408037 39666534 49961401 62273084 73106130 78197957 76655877 70692509
8990 70692509 62876865 55388704 48786714 42282648 35644672 29601094 24817681 21427563
8982 21427563 19281979 18197280 18134865 19178241 21566884 25676990 31758539 39125341
8974 39125341 45222766 47152019 44698447 39282980 32110468 25024734 19452465 15495714
8966 15495714 12752870 10877202 9581285 8680846 8045655 7596946 7308213 7176372 7145175
8957 7145175 7167272 7231551 7348656 7587384 8036273 8811548 10071751 12021536 14954231
8948 14954231 19192189 24636476 29953794 32519892 30985860 27187960 23830185 22255971
8940 22255971 22720961 25029946 28438195 31147238 31066808 27924638 23483963 19291182 15799987
8931 15799987 13012537 10862259 9224537 7957995 6987407 6240944 5643427 5148382 4766549
8922 4766549 4516512 4368978 4309682 4296011 4280687 4232832 4187249 4178528 4162545 4112601 4061691
8911 4061691 4056389 4084478 4130145 4220631 4350696 4478719 4505959 4353503 4094162 3844650 3678859
8900 3678859 3622499 3649848 3709138 3756220 3745216 3697357 3675830 3730148 3854197 4040178 4259606
8889 4259606 4500720 4768874 5059426 5381336 5676050 5865640 5977921 6041926 6101811 6174786
8879 6174786 6244779 6243761 6073960 5761173 5424992 5161610 5022196 4978723 4987985 5011470 5064933
8868 5064933 5191866 5356692 5466369 5429319 5260776 5079983 4951575 4882221 4864055 4884606
8858 4884606 4939333 5045143 5200976 5357345 5498732 5623456 5748256 5923615 6192185 6573335
8848 6573335 7067104 7642155 8249318 8874831 9646073 10774303 12371670 14337602 16529705
8839 16529705 19017641 22016199 25190274 27088552 26147589 22793033 18927328 15806027
8831 15806027 13681617 12339922 11493030 10916563 10460888 10093073 9846909 9725963 9644190
8822 9644190 9503114 9289355 9037467 8854872 8883495 9214313 9829803 10535618 11094500 11451783
8812 11451783 11794349 12359670 13261729 14327384 15202308 15603007 15506827 15189375 15002269
8803 15002269 15251999 16079515 17526846 19637757 22576509 26535638 31674449 38071145
8795 38071145 45515991 53519672 61416905 67774782 70597638 69728730 67239323 63418581
8787 63418581 56563486 47637209 39575753 33649972 29618795 26920982 24930080 23177653
8779 23177653 21529285 20042398 18666178 17349384 16135660 15080724 14268635 13749489
8771 13749489 13502826 13498982 13763545 14386447 15410480 16677285 17865370 18916564 20021892
8762 20021892 21403115 23187224 25254718 27345940 29171883 30810317 32984923 36490936
8754 36490936 41496585 47518993 54143446 61529585 69892288 78867381 87176318 93020520
8746 93020520 95012689 93568789 90620193 87989374 86521989 84805703 80584987 74135607
8738 74135607 66945351 59407636 51657827 44334336 38148674 33268582 29432478 26403637
8730 26403637 24015773 22014998 20221463 18677166 17442770 16561231 16125364 16143258 16559420
8721 16559420 17293297 18286715 19516570 20822651 22057936 23397721 25137954 27304300
8713 27304300 29610492 31766232 33745008 35925701 38969003 43189409 48284156 53909066
8705 53909066 59993836 66191899 71770583 75966130 78226048 79043026 80186859 82838227
8697 82838227 86108540 88081826 87854832 85283765 79461320 69751823 57863671 46715328
8689 46715328 37975796 31745766 27534188 24670287 22476322 20471638 18524938 16780629
8681 16780629 15307725 14019257 12939404 12132932 11576099 11274870 11230540 11435822 11849322
8672 11849322 12371953 12985500 13760582 14641905 15439783 16137999 16845262 17769608 19109333
8663 19109333 20917295 23119924 25726379 28824794 32593458 37205784 42495129 47865934
8655 47865934 52808283 57056470 60311708 62532356 63481857 62367317 58335923 51445160
8647 51445160 43353027 35880072 29722813 24962614 21485365 19019643 17211729 15634852
8639 15634852 14104038 12700709 11552771 10686568 10035935 9503173 9016863 8541769 8102239
8630 8102239 7742117 7499768 7385998 7356725 7329768 7287802 7256924 7261242 7353677 7556332 7842266
8619 7842266 8157366 8472403 8827161 9316330 10031350 11070238 12535624 14515036 17074751
8610 17074751 20189458 23536754 26262078 27204894 25819944 22891199 19763721 17208850
8602 17208850 15306839 13830655 12587717 11534388 10677867 10012642 9473696 8987913 8486802
8593 8486802 7937577 7410029 6969587 6617788 6339776 6127798 5970223 5850292 5749119 5597843
8583 5597843 5368245 5040312 4660303 4299320 3999070 3754638 3549447 3383749 3236287 3091455
8573 3091455 2963441 2851552 2759877 2706236 2700409 2733790 2839475 3030643 3321100 3689975
8563 3689975 4067054 4352092 4475581 4431203 4301919 4240009 4349720 4629989 4985778 5246086
8553 5246086 5302818 5158078 4894473 4630443 4420098 4273389 4177537 4107232 4036955 3966692
8543 3966692 3882907 3766463 3610748 3415280 3190102 2966854 2759434 2585858 2458346 2356949
8533 2356949 2275208 2225826 2190169 2166035 2147552 2135598 2147210 2176840 2230526 2290971 2345644
8522 2345644 2412060 2482881 2540562 2607161 2697292 2816418 2957523 3107096 3274671 3447490
8512 3447490 3631869 3839430 4083626 4390738 4756106 5195828 5751474 6438700 7283401 8272834
8502 8272834 9470775 10967653 12884682 15452147 19029309 24155049 31650501 42677519
8494 42677519 58495168 79262394 102124972 121506230 132977508 135648875 129485015
8487 129485015 114019367 92134729 70072296 52318790 39649999 30979736 25069214
8480 25069214 21023169 18239308 16296485 14879047 13799904 12973868 12359729 11946280 11756634
8471 11756634 11807902 12045769 12371492 12760062 13332286 14263791 15745081 17979644 21352218
8462 21352218 26441775 33257904 39876670 43154791 42283067 39603373 37306107 35647627
8454 35647627 34520985 34590748 36441517 39590582 42485578 43861370 44083715 44338615 45106491
8445 45106491 46347668 48412896 52006660 57877062 66574050 77180030 86612982 91872588
8437 91872588 93344483 93674726 93419860 90626516 84717609 78002708 73279146 71512976
8429 71512976 71406912 70324078 66603649 61081617 55313702 49764301 44181423 38510984
8421 38510984 33166412 28715347 25432606 22793798 20153568 17580862 15483337 13974703
8413 13974703 12877961 11984438 11145198 10332095 9605633 8988989 8505741 8145238 7902316
8404 7902316 7783778 7810464 8002463 8375714 8956004 9778377 10918867 12545238 14909960
8395 14909960 18339633 23382920 30805388 41312718 54622320 68395753 78962071 84328151
8387 84328151 86059784 86368132 83791796 75152079 61271978 46667964 34801272 26365432
8379 26365432 20630823 16736908 14033345 12103435 10667896 9558789 8670569 7916741
8371 7916741 7247205 6637406 6073715 5597242 5216719 4914146 4687104 4533681 4447192 4414841
8361 4414841 4375738 4285039 4125429 3901811 3668163 3469076 3314104 3212020 3128815 3023086
8351 3023086 2896396 2760461 2640552 2533309 2450770 2395255 2344635 2309296 2286542 2253822 2229723
8340 2229723 2199265 2186227 2195703 2250779 2385862 2609457 2954938 3486631 4261735 5307915
8330 5307915 6532419 7676854 8465675 8732324 8537101 8171715 8018576 8288822 8869643
8321 8869643 9387551 9486314 8995212 8004305 6808615 5733289 4948179 4455260 4162843
8312 4162843 3967864 3806168 3639396 3443872 3212003 2973432 2754912 2583894 2467168 2402961
8302 2402961 2401720 2447337 2529042 2666763 2885922 3172088 3482307 3734765 3827569 3766742 3714068
8291 3714068 3845016 4222651 4765492 5314460 5657234 5661054 5429953 5173662 5065402 5137820
8281 5137820 5378174 5757733 6210327 6725705 7230858 7616455 7845749 7925488 7882693 7813165
8271 7813165 7854956 8077268 8379199 8639804 8796731 8787040 8581280 8143529 7521838 6871280
8261 6871280 6360915 6048803 5891956 5851889 5806367 5560500 5054108 4428147 3868972 3433949
8251 3433949 3103996 2837019 2597437 2343246 2108428 1920583 1779408 1681286 1623294 1591818
8241 1591818 1571714 1560462 1567232 1576588 1589624 1586762 1592111 1628336 1710796 1847567 2063790 2401647
8229 2401647 2898602 3590440 4446404 5344253 6101420 6554266 6659348 6509077 6331596 6350272
8219 6350272 6625590 7012914 7243482 7112082 6542750 5631837 4604876 3692448 2982935
8210 2982935 2466906 2096017 1832876 1660460 1548047 1479517 1421235 1369855 1302276 1218883
8200 1218883 1142700 1073106 1008212 951875 911735 891258 871672 850447 836919 833630 835622 829597
8188 829597 818764 808133 800194 810991 829871 842050 866292 891457 921310 940896 951953 945429
8176 945429 915290 887798 855486 814213 785693 775479 774980 774770 782675 781183 784415 793174 818857
8163 818857 884421 974384 1083902 1185143 1260835 1305115 1314904 1306550 1286730 1280193 1285277 1290946
8151 1290946 1287708 1282878 1281220 1267612 1250471 1231262 1229162 1231354 1227815 1215340 1200100 1184818 1191572
8138 1191572 1217861 1245265 1286576 1342227 1414106 1489246 1567797 1634244 1676704 1710990 1737064
8127 1737064 1759698 1799565 1860914 1920402 1982923 2044274 2107416 2180060 2252582 2336570 2446079
8116 2446079 2578683 2753882 2975456 3264281 3595230 3965507 4343033 4678713 4946136 5153412
8106 5153412 5345068 5557126 5811039 6152245 6672872 7392321 8253404 9181494 10079353 10839223
8096 10839223 11438912 11908367 12316163 12781795 13490385 14630139 16394876 18952704 22469407
8087 22469407 27244628 33912932 43549831 57805979 78502826 106337497 139236738 173249774
8079 173249774 205018745 228928918 235716841 222996043 197396553 164243708 128375751
8072 128375751 96698498 72868025 56197035 44672460 36622428 31001494 27185517
8065 27185517 24699766 23076546 21912606 20901005 19888976 18899994 18058995 17492155 17291757
8056 17291757 17512025 18202859 19354919 20802261 22241774 23312549 23861398 24040328 24165541
8047 24165541 24602319 25589056 27249413 29701960 33135019 37909208 44576135 54035481
8039 54035481 67888893 88815206 121220334 171083146 241521513 325376166 405720884
8032 405720884 456167190 455166038 408422585 335031037 255677705 188682253 140041432
8025 140041432 106507329 83307958 66944976 55247627 46955699 41162389 37087278
8018 37087278 34014104 31480832 29288431 27307632 25363876 23442918 21702309 20283154
8010 20283154 19196498 18366450 17745949 17362948 17148481 17002698 16897546 16865458 16949566 17237226
8000 17237226 17823893 18793996 20206106 22195042 25031816 29160528 35305960 44550247
7992 44550247 58254615 77282175 100363103 124141962 146391122 165172971 173654902
7985 173654902 166017418 148689572 130878658 111678672 88819576 66623967 49397142
7978 49397142 37463736 29440259 23989739 20194946 17461731 15406915 13772956 12405064
7970 12405064 11187591 10107110 9168938 8392259 7766163 7244873 6766527 6299057 5811214
7961 5811214 5343261 4926069 4536333 4193365 3908650 3673199 3483780 3328382 3204598 3098005
7951 3098005 2987200 2861756 2731953 2590562 2435333 2300536 2176087 2071325 1996307 1925722
7941 1925722 1874822 1828525 1791931 1748864 1704299 1648480 1599915 1545857 1497724 1447505 1406346
7930 1406346 1378247 1350208 1321770 1307485 1297574 1288987 1279485 1265955 1264807 1264687 1262568 1271076 1274347
7917 1274347 1266504 1254556 1245967 1214813 1192029 1174415 1140080 1085058 1028521 977553 947319 944671
7905 944671 948268 952908 941894 919692 884617 826392 769933 722045 665997 625673 602844 586923
7893 586923 579133 576130 563180 561761 544616 517906 509511 510143 514683 510370 504924 494348 483294
7880 483294 483167 477967 473168 474041 472898 478066 491895 497316 508466 514050 511554 494691 467036 461474
7866 461474 451034 435288 441082 446631 455838 459934 461606 459623 456856 453244 432126 406721 375662
7853 375662 337983 310027 275626 243985 234102 231317 227890 226440 233933 240021 252522 254988 253296
7840 253296 243873 234157 235311 240229 250016 253083 259740 269276 272451 276158 283462 288082 304413 312252
7826 312252 311626 306627 292914 284621 272835 258765 245176 241946 244104 241586 235300 245692 250855
7813 250855 251028 245258 241507 238222 223450 195945 180199 182029 178100 175604 162092 163048 163700 159554
7799 159554 166855 172064 178486 183957 182615 176356 172699 173319 181157 177013 176082 166925 152996 165043
7785 165043 194260 203247 201477 203881 199299 195656 191367 189908 193556 196500 202802 206147 200831 194717
7771 194717 181089 168695 162951 165844 166279 164456 163421 160286 169344 175297 167328 166333 158821 150550
7757 150550 136867 133621 131173 138170 149365 159075 152600 136986 131902 136406 137693 136867 133839 125418
7743 125418 120798 125762 129195 120924 108336 116150 129441 126217 132274 138176 146251 151355 156754 158911
7729 158911 157366 152710 155581 150737 142098 143347 142276 136378 143912 142339 131149 129897 130489 127335
7715 127335 130310 139041 137675 137397 124658 123859 117318 111144 113724 110973 104112 102007 104268 110921 120892
7700 120892 125302 130404 124665 125439 125832 129186 150989 173900 193918 205790 219317 237805 255013
7687 255013 295743 363539 469177 633012 857933 1107269 1315645 1416983 1380888 1219111
7677 1219111 999537 775160 599068 468254 397278 353972 301527 246770 212961 189051 172263
7666 172263 164602 160503 172639 177072 164205 162509 156184 158802 164814 163089 157263 160846 179054 185084
7652 185084 176907 176575 185000 188668 200617 222621 248628 273369 299705 334952 389218 464836 594150
7639 594150 790899 1083413 1512828 2028641 2510486 2742149 2578063 2119307 1616633 1205123
7629 1205123 916048 717765 574777 465451 385514 337239 309359 292819 273850 252149 238507
7618 238507 223274 210107 199011 190473 179371 164118 151144 145459 146123 147602 150217 149980 155106
7605 155106 153733 153132 171936 188842 198313 210615 212180 217023 232051 267169 324653 413559 524031
7592 524031 655639 825777 1007338 1123678 1130108 1036486 876737 694925 530313 399080
7582 399080 298399 242938 215636 201090 189097 190302 194237 185516 176061 161398 146464 131626
7570 131626 109875 84499 82090 76594 68930 66162 62262 62256 63067 62717 61906 58688 55000 54182 59439 58944
7554 58944 54488 50221 62058 57198 41977 35641 31589 47953 48464 33836 23032 28347 30792 37209
7540 37209 47869 47398 44550 45185 41438 35078 30493 23995 30229 45946 50543 54005 50538 48630 37011
7525 37011 30822 25175 19654 24765 30307 37726 39003 29691 24096 23942 24657 31373 43257 42630 39427
7510 39427 34715 30858 28849 31349 31226 25849 16410 17175 28046 27612 19318 18055 15104 21126 33524
7495 33524 40285 29943 19633 11010 10769 10586 11270 5717 3814 2159 3832 10564 7400 10354 20190
7480 20190 31491 36302 34113 28217 27821 31704 25738 14366 21699 25282 22758 26219 23649 20411
7466 20411 16729 14860 8930 8824 7755 12093 21222 32133 37392 39109 47049 41179 37649 34223 23354
7451 23354 16045 7672 9526 9752 11103 13627 903 -3889 11640 19226 19649 16721 21858 19528 18503
7436 18503 25339 36128 42054 40310 33217 24952 21134 24943 29515 31389 29644 27497 24931 19910
7422 19910 14556 7249 9688 15492 7621 3350 1892 14223 22065 26399 20371 17870 14452 19000
7408 19000 13634 11707 6886 3942 9980 12015 9945 5620 14229 19566 16860 20717 28054 29569 20830
7393 20830 16339 16916 23603 23912 28748 29926 19683 13430 22070 17400 13066 10296 11205 -1461 -10199
7378 -10199 -12034 -18098 -15678 -4015 -947 2671 2289 6398 3919 7570 11020 10596 4405 11862 13423
7363 13423 15062 28554 37352 33470 27466 15193 18086 11665 8879 10817 12829 19313 26222 28227
7349 28227 27003 11732 -8372 -11844 -10130 -2297 11556 15860 18196 16860 10248 925 2350 10269
7335 10269 20341 20164 3553 -6098 -5955 -2979 6034 23297 28508 16243 11686 20852 28317 30920
7321 30920 30270 34571 42356 41643 37486 37111 36744 30391 22580 17096 17172 15158 3334 -354 -5469 3332
7305 3332 -1331 -3948 -2250 746 4490 6527 266 63 -3348 -7588 -8024 -6297 -8574 -5387 -2920
7290 -2920 -6895 -2561 2886 -1651 6507 8839 6766 82 -3279 -1332 5542 15996 20788 15089 21119
7275 21119 38223 45041 42393 44685 36861 16508 4897 5547 6393 8646 18981 21337 19882 18315
7261 18315 10311 9801 10368 3355 4175 5098 12192 19768 18317 11248 -2569 1313 2614 4636 6528
7246 6528 1739 1525 7025 3779 4827 8270 12262 11631 -83 -8169 -12545 -3174 4731 5238 6723
7231 6723 12407 6303 -3763 -1645 -3730 -5306 -7930 -12431 -16400 -16233 -9490 -1733 -3772 -966 1477
7216 1477 4792 11579 9600 2710 370 8357 9896 17459 13493 16028 21146 16717 11633 11159 11314
7201 11314 9854 1494 -4665 -6146 5650 14288 15988 12385 9345 1838 1607 2327 4810 2065 4051
7186 4051 3128 9506 10155 6501 17694 23390 14477 -4436 -17605 -13410 -8139 -749 -2758 -363 -8659
7171 -8659 -17526 -11093 -5353 11494 10191 -4886 -3584 259 -1829 -2370 -3592 -4135 1726 -536 -813
7156 -813 3165 11110 -2067 -14324 -12644 -17420 -19654 -367 12950 10346 7598 -1627 -8121 -9825
7142 -9825 -4696 10550 14178 14340 19920 17076 476 -11436 -12386 -5098 1642 7424 15463 698
7128 698 -9327 -8927 -2468 3012 6554 2046 3153 -3521 -9278 4482 9920 9326 11078 18270 14447
7113 14447 811 -17148 -18243 -10090 1991 1425 317 -9712 -21423 -17893 -19442 -17509 -13374 -8323
7099 -8323 -6243 -9355 -12723 -19676 -17374 -8193 3046 9456 14325 26012 36224 34663 12964 -19029
7085 -19029 -31041 -35966 -23458 -4499 10031 11553 1458 -6499 -8348 -15290 -4983 23676 44212
7072 44212 32442 20742 14258 12715 13830 2014 -7606 -14391 -15428 -9227 -9684 -14090 -8564 -14494
7058 -14494 -19791 -14278 -9863 -14916 -22546 -29743 -20681 -21285 -23843 -15997 -14244 -10904 -8010 -3465 -1428
7043 -1428 -6743 -3745 -8503 -6362 -7079 -13456 -31680 -39121 -37416 -17007 -5844 4896 13950 12632
7029 12632 13419 15337 7951 4769 8709 16060 6772 823 -14978 -13751 2182 6847 11612 7589
7015 7589 1833 -2567 -4631 -2963 -1837 -1230 6600 10923 -1180 -13477 -10790 -5889 -7413 -12085 -19596
7000 -19596 -27809 -23513 -17689 -7867 -2392 -6792 -15994 -10456 -12012 -7343 2852 -76 -11529 -20754
6986 -20754 -14345 -13999 -18076 -12579 -12362 -2301 8406 18378 15061 9968 1007 -2332 2483 -2706 252
6971 252 3793 3677 -7011 -14011 -18222 -6181 -1435 4808 6299 -12387 -29404 -29469 -28628 -19793 -15337
6956 -15337 -12332 -15575 -28936 -31950 -20216 -11065 -8224 -12801 -22442 -17472 -12024 -12630 -13296 -23591
6942 -23591 -25453 -24257 -18812 -3491 -2527 -1571 4202 6312 -549 -16588 -19919 -23783 -14861 -8278 -5951
6927 -5951 -8401 -8322 -16764 -20255 -18116 -11005 -1939 -1184 -981 1659 2846 -422 -8542 -7481 -2589 -5896
6911 -5896 -11585 -11901 -9831 3209 9348 4696 11998 2270 -7211 648 -2841 -4718 -236 -2500 -1872
6896 -1872 3521 -6956 -6072 -898 -5387 -1260 6978 8964 19970 22639 10719 3503 -5955 -4889
6882 -4889 4490 10975 7648 -851 -2118 -1913 2420 988 903 1338 -8038 -11786 -11427 -9989 -19037 -20030
6866 -20030 -10457 -5256 -3219 -6451 -7802 -11386 -21582 -17476 -15015 -19425 -7128 -1030 -3049 -1563
6852 -1563 2722 1085 -2812 -2720 -3154 -1693 -10228 -12304 -1473 6388 12761 12577 16183 10403 1649 1495
6836 1495 4866 3172 -683 -4880 -6525 -7168 -2877 -3784 -4174 -9344 -9466 1982 5170 3751 -4203 -15577
6820 -15577 -12212 -4730 -2796 -9655 -15743 -22078 -22221 -18563 -16657 -16638 -24737 -22111 -17227 -16771 -16685 -6351
6804 -6351 -6532 -16103 -15891 -8114 3242 14669 15670 8548 -3911 -5128 -4499 4652 2640 -7390 -7043
6789 -7043 537 479 4337 2920 -3354 -8071 -10672 -8624 -2599 1597 7847 78 1000 -6986 -20836
6774 -20836 -22804 -16131 -13932 -4295 -6613 -7596 -5986 -10316 -12803 -15218 -5553 -5610 -9879 -19258 -11107
6759 -11107 -1356 -5509 -7742 -5457 -8645 -7880 -13114 -23915 -27676 -28267 -22995 -16371 -4848 741 -116
6744 -116 -2625 -9768 -12866 -1260 4062 -7176 -11221 -12353 -14359 -17912 -13955 -15205 -19032 -16271 -17728
6729 -17728 -18692 -16260 -22185 -19910 -8799 -5473 2396 5285 -179 -4285 3650 7625 3400 1142 -1154
6714 -1154 -3736 -7014 -12581 -19097 -7336 -2756 -5448 -9153 -9252 -11292 -21911 -21808 -7156 1895 -3370
6699 -3370 -12782 -7115 3009 11558 15453 13917 8544 4091 4205 2097 4496 9463 4812 1335 -2530
6684 -2530 1565 -2486 -13206 -12516 569 12744 11150 -4671 -19130 -16404 -5047 4559 1851 1729
6670 1729 1487 -9531 -15632 -11315 1987 12710 16972 14536 20682 11307 -4956 -11550 -18335 -19740
6656 -19740 -5609 10287 7477 9181 14585 19523 11143 4082 1655 102 -3349 8329 16121 11387
6642 11387 3697 12930 12164 4061 6291 -1842 -10781 -1809 -871 1102 5682 4276 9837 4329 -2285
6627 -2285 -4439 452 1950 -5730 -14715 -12449 -4031 -7966 5882 17028 7628 -4392 -12909 -13774
6613 -13774 -16783 -14117 -15774 -20655 -15272 -8000 -17800 -19576 -11278 -10247 -6934 -2959 4747 8267 6834
6598 6834 -1425 -13805 -13491 -4915 6162 9310 10442 1141 -1923 611 3012 5989 1480 2874 -1886
6583 -1886 -8633 -3592 -7480 -10161 -3192 -4299 -16933 -34540 -37289 -24857 -15296 -8057 -6578 -6994
6569 -6994 -6477 -13616 -19312 -21484 -9579 7854 9058 10493 9995 5994 3526 6951 11955 11152 6614
6554 6614 7643 10236 -2066 -7645 -2501 4647 -7080 -9051 -27 -7250 -11738 -5576 -1241 2950
6540 2950 -117 -4287 -2368 -235 10053 8750 2878 -5657 -11874 -1818 5195 1773 -5254 -7842
6526 -7842 -6301 -8579 -8231 -9870 -9558 -3453 -4546 -15126 -14740 -7768 -9033 -11801 -9050 -12959 -9881
6511 -9881 -8628 -5521 -10672 -6117 -6525 -11508 -18575 -17462 -14494 -11131 -11331 -1642 11220 13514 187
6496 187 -5706 -10359 -18134 -27043 -27382 -23450 -10199 -2290 7015 -3795 -2290 11645 8211 13695 15085
6481 15085 12032 9156 2899 4108 3475 8823 6799 845 -1386 3878 8298 3142 2951 2966 -7921
6466 -7921 -18363 -14173 -9662 -4570 -847 12643 16298 7849 1238 -1252 -7346 -2584 485 5515
6452 5515 11603 5485 3649 3831 -1038 -1167 -1125 -2213 -4142 -2941 -12256 -14372 -13024 -10707 3840 14672
6436 14672 22160 21400 12895 5821 3885 2565 -4901 -8697 -6966 -9622 -7551 -4957 -708 3790 7464
6421 7464 -6208 -9422 -13098 -6150 -1960 -831 -2541 -8599 -7511 -11243 -9244 -6338 -1674 143 -3271
6406 -3271 -3064 -6674 12425 12361 -7868 -13337 -8153 -8156 -13048 -9832 -7526 -1909 1424 -632 -2348 104
6390 104 -3509 1623 -4231 -8931 -295 5848 -3069 4307 10783 23184 24758 14967 11249 -3558 -10246
6375 -10246 -6248 -9853 -5728 -4217 -5953 -5865 -3401 -5057 -7927 -7995 -10238 -4366 11112 20801 20110 20802
6359 20802 21583 15092 7780 6029 6813 2438 -893 -8582 -6742 -6894 -1663 -6097 -3662 1344 1163 279
6343 279 -1531 1474 -978 -5735 -2830 -4771 -4191 1007 -3915 -7685 -6330 -4400 -2686 1568 1259 9725
6327 9725 10463 6426 9067 4516 9268 6833 18459 20526 10583 5966 2342 7212 6286 4359 -2692
6312 -2692 -2236 7030 17600 11298 1302 696 7589 10159 -2273 802 -722 -10579 -5099 -586 2737
6297 2737 17333 10673 4769 15324 18688 18203 19019 20184 18801 24011 32929 35189 31472 38622 38800
6282 38800 26666 26149 28312 31049 38079 37118 35463 32711 42324 38317 23853 15969 13896 8731 -5967
6267 -5967 -9001 -8778 -4703 -273 -413 2369 -3351 1981 17436 32231 32073 26551 25661 21517 13185
6252 13185 12017 9841 -1095 -3440 3572 5435 24379 36295 23062 7087 3944 12956 22100
6239 22100 22237 24806 23260 10879 9103 21536 40602 51019 42258 42987 42506 43673 52933 53843 57752
6224 57752 76722 105105 120417 143945 176711 220749 284562 369224 491694 652087 835044
6213 835044 1006504 1100142 1074296 925396 735646 562958 433501 338343 273942 219561 180283
6202 180283 142825 115739 107125 92706 82877 78532 62919 56478 52638 49221 44529 43113 37285
6189 37285 36637 38632 31684 24239 24367 23181 27848 21753 20683 19515 19033 13049 14459 15077 18172 22521
6173 22521 21903 25923 35752 31494 14141 6156 -477 -10627 -1506 10001 18487 30572 40369 39147
6159 39147 32651 19223 20216 14824 8302 22548 27601 29471 32443 29898 31377 36755 29455 18810
6145 18810 16563 29834 40612 50426 58809 57423 55131 51228 42239 42093 32401 28500 25690 23091
6131 23091 15950 12772 13792 13811 9185 12970 12338 9397 10889 10514 678 -6156 -11178 -13916 -13580 -16805
6115 -16805 -9373 717 1161 4445 3505 -2849 -6389 -8245 -9297 849 6801 8462 11473 12713 974
6100 974 3149 7319 4323 -1405 7921 6372 1012 3749 11822 16299 17281 11322 2585 -5105 -7821
6085 -7821 -6734 -6556 -9708 -9006 -3340 7104 -3334 -10447 -15974 -11040 -5270 -7259 -6139 -7155 -7102
6070 -7102 -7026 -2566 -9820 -13534 -9616 -6433 -4660 909 -2204 -8368 -5542 -7259 -12738 -7696 -3685
6055 -3685 1059 -2402 64 3278 8841 6153 6709 9169 -439 -7470 -16921 -15391 -7290 -11106 -15925
6040 -15925 -18283 -4197 4080 4047 -12036 -18559 -22497 -16805 283 2299 -3679 1547 1564 2470 1820
6025 1820 -10924 -23136 -22982 -17439 -2895 -1278 -6487 -411 3119 1684 -4887 -12047 -13968 -15613
6011 -15613 -16485 -7045 3161 -829 -2156 -9934 -1365 5263 11067 22062 27109 11659 10046 9346
5997 9346 1976 8170 14810 4814 -2171 -9335 -16636 -13322 -14640 -10302 -728 2671 -6462 -11329 -1076
5982 -1076 3564 1938 6695 9889 7404 73 -1256 -2909 -6084 -14411 -9180 6480 -779 -12728
5968 -12728 -11752 -8148 -10584 -9057 -8008 -16149 -14203 -13806 -14876 -8915 -1889 -10837 -21198 -25700 -25500
5953 -25500 -24745 -21293 -1275 15553 11427 1472 -1559 -1446 3055 3662 6064 11460 4696 3021 -635
5938 -635 -5284 -14691 -11689 -11425 -3083 5118 8237 11289 8391 309 -2061 -11260 -19043 -9073 -8580 -14637
5922 -14637 -17567 -9124 -7804 4763 14293 5187 8951 14794 7396 -4418 -9584 -7536 -3488 10388
5908 10388 15535 6697 -9135 -10409 -10995 -7258 -7195 -796 12390 20495 13340 206 -12457 -14876
5894 -14876 -2698 -1586 -7302 -4768 -8535 952 672 4754 6609 1170 -3852 -2481 -990 -2043 -7862
5879 -7862 -12317 -11904 -7908 -13396 -29 1463 -2127 -8237 -7960 -8555 -758 7067 3350 -5690 -11374
5864 -11374 -2591 -4724 -9745 -11808 -17273 -15115 -14522 -16022 -18140 -17689 -15707 -2849 -660 1115 8262
5849 8262 15402 6159 1000 -971 6171 1260 -5022 -16834 -16418 -13279 -10551 -11846 -11381 -3299 -6517
5834 -6517 -10123 -561 6184 -2903 -13767 -13091 -8250 -215 -4487 -2588 -1658 1528 -6815 -8839 -12387
5819 -12387 -8015 -2093 -732 5783 -874 -9030 -4910 -4131 -2284 -3829 -2725 -6673 -4682 -8908 865
5804 865 9104 7096 591 -9049 -5920 -4419 1333 -6004 -13777 -15699 -9438 -11623 -9463 -5980 -7068
5789 -7068 -7631 -10573 -8577 -4459 826 269 6864 5219 1543 1412 -3032 -3926 1568 -14946 -23963 -18532
5773 -18532 -8371 1130 2061 3122 -2871 2632 5056 -1503 -1231 2054 11207 13813 -2712 -9329 -2114
5758 -2114 4100 4036 5184 8407 7808 4075 -2033 -5905 -8058 -11648 -11550 -6596 -4714 -4942 -7860 -9924
5742 -9924 -17856 -18533 -10285 -6905 -7178 -5143 -505 6570 6265 -3131 -13701 -9035 -15871 -15032 -8627 -6582
5726 -6582 -10996 -6082 -13120 -20407 -14760 -16425 -16721 -12974 -4019 5101 3351 -6887 -13352 -1121 13640
5711 13640 15867 17794 9507 12561 9244 231 -8919 2109 4319 14003 8054 3007 3544 -3651 -4478
5696 -4478 -1670 1929 -518 -2198 -3372 -653 2437 -4911 1930 6797 4475 7188 113 -4800 -8040
5681 -8040 142 -377 -4916 -6759 -3702 -7727 -13356 -3269 -4273 -9907 -8449 -8400 -816 3850 6354
5666 6354 6607 -8058 -12458 -6765 -8269 -5351 -7612 -10717 -11193 -10558 -6464 87 7665 13401 9372
5651 9372 7899 10803 7181 6908 7774 5435 -7702 -10781 5540 3396 -1295 -7098 -5513 3082 -1052
5636 -1052 1113 -869 -2062 -8035 -15620 -14241 -16225 -15226 -140 7325 10171 14167 2275 3421 4590
5621 4590 -1663 -20 -9542 -20957 -24951 -25331 -22773 -16988 -14887 -2406 2301 -5076 -3275 -3680 -13690
5606 -13690 -22309 -18268 1871 6374 -421 2914 6636 5132 5848 2350 4872 6059 11406 5650 1442
5591 1442 -8418 -6744 -4151 -7207 -6320 -2662 965 9502 4080 5148 10996 3244 7403 8764 7109
5576 7109 5941 4739 5610 16403 20985 18657 17749 15049 8155 13171 11639 5308 -3505 -16021 -16336
5561 -16336 -12116 -13364 -10909 -6558 -8147 -6636 -1833 -3694 1368 1372 470 -3784 -7909 -4439 38 255
5545 255 -9117 -4681 -2519 386 5095 9290 6957 -8312 -4451 777 -149 -3073 -3136 -6166 -9933 -6212
5529 -6212 -9315 -9243 45 -8438 -10585 -5373 2106 1124 2742 10091 1358 -2806 -7846 -8728 -11932 -6869
5513 -6869 -1197 -5487 -13364 -21397 -25450 -22695 -23104 -25945 -20858 -6908 3472 -2397 -8064 -12072 -12845
5498 -12845 -2457 2117 -2406 -3156 -7874 -13009 -7436 -5812 -5808 -5719 -2673 -2387 -1739 -4057 -4508 -7404 -5682
5481 -5682 -9726 -11898 -7362 -8206 -6346 -10870 -5072 -8117 -13209 -8393 -9942 -9312 -10498 -7719 -2679
5466 -2679 -2760 -908 419 7226 7432 2922 2313 15559 9064 -2408 -16366 -19321 -16002 -16090 -17425 -11485
5450 -11485 -1170 -1820 -10707 -9018 7043 21393 26822 28904 15462 -8381 -13565 -12010 -19833 -14473
5436 -14473 -12797 -18141 -15033 -8621 -2112 -3538 -4509 -9190 -8048 262 2317 -7501 -8170 -1101 3322
5421 3322 4404 7846 7537 1593 -2272 -3855 -15020 -23471 -25864 -14483 -5102 -6876 -10735 -12200 -1216
5406 -1216 84 -3554 -2505 -2097 -4863 -9266 -9274 256 -3280 -7150 -11659 -19497 -9205 -3028 7182
5391 7182 8249 2536 5117 9942 17107 16994 10745 5517 -343 -4422 -5882 -5043 -878 1108 5430
5376 5430 6336 -2004 -17264 -19125 -18620 -7160 -2548 -10614 -5888 -10928 -11309 -5336 3917 6993 2670
5361 2670 -1465 -6512 12250 24135 20915 15784 16660 13277 6709 5405 16195 11329 12046 2937 -8510
5346 -8510 -10029 -16889 -13462 -10605 -3706 5557 -6836 -12331 -7693 -11197 -17337 -14698 -14817 -13847 -7445
5331 -7445 -10018 -9233 -8090 -17504 -15945 -16411 -11374 -4097 3900 2176 -1798 -5755 1802 3085 8342
5316 8342 1519 995 370 -9871 -19816 -15924 -16515 -15524 -14156 -15474 -12699 2065 3399 10003 8889
5301 8889 6128 7337 2271 1929 4610 3058 1023 -2938 -17912 -19066 -2527 4909 -2813 -7708 -12867
5286 -12867 -6719 -3311 -3263 1106 -3886 -6258 -9701 -5726 -2419 -3995 -8089 -11421 -14941 -10482 -3859
5271 -3859 -592 984 -6848 -8114 -5304 -700 4058 4928 12226 5756 6362 8236 8943 13872 13830 11978
5255 11978 16285 7015 7777 4657 3399 -2199 -8963 -12977 -3062 -64 -6071 -12604 -10224 -6871 -6001
5240 -6001 -16244 -17721 -12889 -2229 -5416 -11771 -20450 -19677 -10488 2796 5050 456 -4827 299
5226 299 2765 -3195 -10169 -5610 1189 -1199 4779 1788 -6362 -5853 -890 -3532 -3416 -8536 -5999 -1198
5210 -1198 11149 14961 9946 1354 -1349 -2580 5247 941 637 -10385 -18372 -6466 -10919 -18313
5196 -18313 -25526 -15427 -6194 -1813 1737 -8315 2700 -1954 -1435 9235 20407 10018 261
5183 261 -11417 -6048 -7456 -11665 -12875 -3427 6475 4741 5466 12822 2945 -6875 -525 7107 -1316
5168 -1316 -11043 -1550 5127 -4844 -6607 -9736 -5201 2525 5823 -1815 -12422 -14401 -17644 -15102 -17638
5153 -17638 -17352 -3315 -2106 -6708 -17467 -13050 -10155 -12640 -19119 -13462 -11988 -9255 -1234 3000
5139 3000 3659 -2010 -2811 -6379 -1934 -624 -3228 484 -1421 -1304 -5401 -3091 2067 -5470 692 3410
5123 3410 1046 424 -2086 -2548 -3830 -11063 -24384 -36809 -30460 -13658 -8831 -9705 -8640 -9051 -20377
5108 -20377 -11737 -2023 -1587 2006 -3129 -6839 -4013 8937 9967 -7321 -20040 -21262 -10126 -2697
5094 -2697 708 1057 6917 2335 -780 -5099 -4344 -6347 -6334 -7959 -2831 -4767 -10928 -12382 -6667 -1463
5078 -1463 1036 6553 10619 3672 -1902 29 9754 4568 570 2675 11393 7617 3132 2324 8599
5063 8599 3618 4677 10131 -1502 -4465 -3884 -9163 1603 6525 -7366 -5172 2581 4494 5309 1003
5048 1003 -2073 -2370 -5631 -10231 -9623 -12795 -21521 -21983 -10243 -4192 -7902 -6766 -1547 5184 11621
5033 11621 9807 6759 1254 5387 7858 2894 -827 8162 11036 -2753 -9183 3905 7508 5289
5019 5289 -1551 -9735 4023 8796 6597 13679 18888 23615 29763 16760 2779 8346 8629 4341
5005 4341 -10516 -21703 -11122 -6288 -6835 -1009 8154 12079 17002 14266 9716 9194 6604 3459 -6234
4990 -6234 -6641 -9777 -12285 -18964 -20147 -18165 -6942 -90 -2808 -9504 -4422 -2992 3411 1249 -4413
4975 -4413 211 -5468 -9106 -2930 4738 5156 14124 15251 8897 4544 3415 -9239 -21510 -24395 -24577
4960 -24577 -18088 -8366 -9567 -8374 -9188 -12643 -9540 -3230 71 -1309 -10109 -11073 -4261 1184 -5341
4945 -5341 -11303 -5378 -5216 -7292 144 -2074 -10126 -9530 -12297 -8770 -2866 3256 -1080 11098 18286
4930 18286 12118 7060 6306 3676 5705 460 -5393 2748 2291 -2044 -2899 -243 1447 -4277 -8193
4915 -8193 -121 6508 11814 -481 -6797 -6665 -7687 -6792 -6647 -8810 -4100 -2616 7531 14344 24112
4900 24112 26380 20072 16615 12159 14043 18022 13156 10529 -85 -1708 8816 12319 14801 16715
4886 16715 12255 10205 6336 -1964 -1655 2360 2370 1652 2301 161 -3507 -4996 -3912 -5406 -11842 -13304
4870 -13304 -11754 -7672 -642 1020 -186 1651 4575 -1009 -8352 -5482 882 -875 -3420 -10462 -7773
4855 -7773 -2042 -8970 -3230 1065 -7443 2233 15308 22776 14159 2138 -3525 -3084 9747 18431
4841 18431 15322 11114 6324 -2136 -7799 -8382 1018 8228 2097 -4594 -2188 -3056 -3869 -4468 -3820 1031
4825 1031 -2197 -4504 -5606 -9542 -12274 -10511 -7997 -5595 -8071 -7130 -1243 -503 -5908 -9968 -8750
4810 -8750 -8101 -14140 -17705 -16971 -9784 -11354 -8425 -5482 1572 5142 9995 11733 11038 18314 16990 11974
4794 11974 4772 -1643 1616 4105 -2925 -5439 -3264 -8881 -13857 -9084 -16825 -16175 -15267 -631 13019
4779 13019 7564 -4565 -8534 795 1783 1354 11113 24384 31764 33095 24618 14893 -1835 -10298
4765 -10298 -11258 3981 7375 5620 11032 6306 -490 -4539 -1328 5844 7950 6993 5883 -2334 -3952
4750 -3952 -823 5353 9118 -3148 -9325 -6699 -12833 -2026 -10526 -17538 -18157 -9148 -11551 -9274 -5316
4735 -5316 -7401 -13689 -19235 -15355 -6287 -13800 -16134 -16570 -14000 -12912 -18830 -14743 -11223 -2562 -722
4720 -722 -343 -465 -7804 -9364 -8229 -15246 -14507 -3279 -4751 -1907 2817 3466 -4899 -9155 -3408 -12501
4704 -12501 -18000 -21274 -18729 -10221 1801 3910 3684 -4162 -7395 -6362 4558 -41 -5407 -4342
4690 -4342 -10465 -8623 -13950 -14043 494 297 -3480 2476 -4352 -1950 2280 -4477 -9571 -13817 -17021
4675 -17021 -14020 -14156 -6463 -16019 -24542 -34636 -24107 -14754 -13923 -1827 5188 1397 -11467 -24792
4661 -24792 -22995 -11161 -2176 -1665 -3579 -7872 -9629 -3252 -6758 -9385 -1058 13296 24035 17619
4647 17619 20763 7940 -420 7039 13490 10779 9741 11095 13152 9876 6731 2355 -37 9081
4633 9081 5938 5164 -7333 -13496 -17691 -10841 -4797 -6164 -11993 -16847 -19423 -8105 3143 -3315
4619 -3315 -14025 -14199 -9004 -5869 481 -2844 -348 2784 27 8170 6807 1975 7742 9504 6226
4604 6226 2354 -5587 -10643 -622 2348 -2756 891 2161 2744 -4920 -1237 4935 4207 12736 719
4589 719 -3773 -5334 -9240 -7035 -9411 -4247 -4382 -8742 -19803 -16072 -9631 -9198 -25479 -31045 -21574
4574 -21574 -12540 -11569 -2224 -1248 6446 5635 -109 -4496 -6234 -1450 5162 15057 13067 1020 162
4559 162 -775 -9030 -11175 -13305 -10277 2076 4123 -9725 -14967 -9883 2285 -2097 -7695 70 6631
4544 6631 10869 312 5 5390 5276 -2532 -4927 -6655 -12650 -2247 3144 805 809 5260 4685 -10302
4528 -10302 -21429 -9404 3055 4452 7577 15448 8034 -5295 -8018 -7234 -8287 -6222 -7936 5241
4514 5241 2876 5549 781 -3438 2395 7471 8912 9902 4690 884 8510 14448 23120 25060 22949
4499 22949 13879 11624 1172 6170 11767 9888 9067 14705 19063 17093 16244 6493 2154 -259 -4067
4484 -4067 -8597 -3070 -9424 -15108 -20722 -16921 -9596 -11396 -12803 -9975 -4179 -6653 -7489 -1008 10455
4469 10455 14394 10738 18494 24674 24007 15180 10574 15837 16447 6408 639 -5545 -10398 -12708 -12573
4454 -12573 -5202 4572 5939 2946 -9717 -13938 -6886 -6207 -5327 -2979 -12029 -5702 -2848 -17185 -20776
4439 -20776 -12158 -8843 -8343 -2814 -5499 -14266 -13890 -2742 2615 -7577 -13564 -7111 -1796 -2518 -5732
4424 -5732 12428 17019 19272 16640 16830 8647 -1190 -4448 3165 7127 7918 8675 -4175 -10837 -10138
4409 -10138 -1938 6591 16758 16576 15485 30164 27496 9834 9234 5600 -1665 -11249 -11595 -4564 -530
4394 -530 1309 10076 11965 19528 26835 19441 15154 7897 66 -7957 -8438 -10896 -13254 -16864 -10389
4379 -10389 887 -6704 -12624 -10626 -3178 2586 -6551 -6674 -10861 -4257 7120 7314 4375 1086 6799
4364 6799 5266 5743 5571 -3046 -4179 -1514 -13644 -23427 -12372 -6433 -19875 -23913 -21286 -19771 -14749
4349 -14749 -19663 -14935 -13214 -20818 -21334 -10746 -3769 -5152 -10309 -3603 4036 3618 3487 652 -4
4334 -4 3997 -28 3588 7475 8775 4431 -1098 7066 4463 6422 10242 8118 4312 -4031 -1428 -2492
4318 -2492 -5345 -8009 -6178 -3340 -1770 -2868 -175 7899 1623 -2045 1157 -3244 -8573 -8880 -1247
4303 -1247 -1403 2684 2678 124 3189 -508 -8314 -1530 -3278 -8281 1972 8452 8004 13287 11239 2431
4287 2431 -5805 -8266 -8904 -9699 -6072 -10045 -5153 4853 5689 -2862 -3157 7061 5375 915 11057
4272 11057 19213 18307 9655 6614 7818 4102 -5308 -8855 -1984 2418 911 6550 7943 12900 13392
4257 13392 14272 19325 14795 9561 6150 8584 4377 -11423 -15388 -13503 -10431 -10390 -5839 -6174 -14022
4242 -14022 -19182 -19357 -22369 -29231 -27405 -19295 -8790 -11521 -7286 -3267 -5072 2341 -2624 -3206 -10005
4227 -10005 -6754 -8280 -10457 -20565 -21538 -18413 -14911 -21791 -16214 -7544 -14875 -15273 -16794 -15150 -7350
4212 -7350 -4002 2629 -4442 -5584 3789 4249 8602 9330 4888 -1706 4641 14911 16423 13298 3476
4197 3476 3748 3706 8098 1143 -12524 -14690 -9059 -18257 -18533 -21784 -21138 -20645 -12343 -14378 -18912 -19583
4181 -19583 -13756 -977 -10297 -13587 -6992 -2437 -2676 -2806 -7576 -20255 -22003 -12928 -3708 9917
4167 9917 14226 8166 7696 602 -1717 -1753 -2308 -7072 -9444 -6152 -2417 8742 11038 13893 16638 7465
4151 7465 -4224 2241 4616 -1306 -5945 -4129 -1937 -59 -4546 2830 13252 21821 22652 13867 6621
4136 6621 12611 7599 4310 925 -1867 -12249 -14063 -13374 -11854 -9882 -11730 -16711 -20637 -15513 -13414
4121 -13414 -14417 -13393 -8660 242 1189 -4099 -6819 -10137 -20691 -20227 -12749 -5298 -85 1384 -4394
4106 -4394 -5345 7720 4462 519 1478 -5190 301 4976 -7108 -10190 -10279 -6520 -10000 -15549 -7921
4091 -7921 -14358 -8748 -18148 -32313 -27698 -14157 -8179 -8633 -9570 390 9212 4312 1267 4504 8989
4076 8989 12129 656 -3333 -4274 -2508 334 -4232 -10958 -4406 3755 306 -3530 345 1632 13559
4061 13559 20933 12173 -62 -1920 -1407 -758 -7337 -12417 -1756 -6521 -18189 -18321 -5705 7214
4047 7214 708 -5134 -2196 6872 6192 1164 2111 10304 17418 7461 -8583 -6627 11704 8728 2787
4032 2787 1968 -6577 -4886 3951 4823 4787 -4791 -13759 -3232 -76 13806 15095 15471 16926 20357 13909
4016 13909 9306 12416 5975 -1361 -5135 -10626 -18159 -12575 -5397 5978 6008 2521 -3695 -3116 7656
4001 7656 17319 21161 19113 18425 16433 6101 3331 -1805 -7171 -13840 -11893 -13723 -13721 -9103 1835
3986 1835 2048 7338 12095 14954 14973 1934 -7111 -2613 3556 1605 -2934 -1372 2075 -5180 -9173
3971 -9173 3438 13206 12077 6445 -277 -4034 -8305 -4873 -5281 -6613 -1016 -492 -8475 -4930 -5525
3956 -5525 -8049 -6362 -9857 -12212 -5840 475 7935 7127 2975 2930 1254 -13618 -24097 -15016 -5041
3941 -5041 4328 9347 1875 11359 -3708 -10376 -1722 6965 5174 5987 13487 6522 -1572 -2181 2824
3926 2824 3938 430 -5265 4985 9341 -250 -4046 -4084 -8674 -3588 -6900 -6471 663 5815 10660
3911 10660 9780 10826 11563 7999 1072 -12479 -1135 12523 9589 12970 15846 9850 4123 -455
3897 -455 -5881 -3787 -11272 -13815 -10861 -11166 -3829 -1612 -2586 10579 18210 19313 13940 7993 6000
3882 6000 5628 9073 19662 18307 9892 -3290 -1549 11687 8569 6100 12071 4661 4452 8210 15233
3867 15233 14521 21954 31267 30067 25148 24937 14907 8720 7174 8225 8335 8266 7984 11417 6631 2094
3851 2094 6725 8434 10063 19347 24589 14074 9772 12544 8366 17123 14001 2672 -9421 -4263
3837 -4263 -1918 -7591 -9157 -5094 -45 -9314 -14088 -15680 -13031 -5337 -10402 -22394 -12641 1687
3823 1687 7187 6597 -505 2861 2159 1631 0 -7785 -12040 -7980 -6664 -5928 754 -991 4951 3765
3807 3765 1972 4543 2309 3973 4543 1312 2373 -11471 -20305 -23455 -21044 -6785 8356 7158
3793 7158 4869 5076 11572 22556 20012 13575 14569 8061 2807 1507 8421 3677 -515 -16111 -20384
3778 -20384 -22646 -27427 -19313 -5592 -6392 -21171 -28371 -21405 -5895 792 8244 16936 16231 5881
3764 5881 -943 55 10480 5329 2916 4580 7717 1220 1764 3688 3136 -1692 4750 7042 1016
3749 1016 -3989 -7111 -7088 -4277 -10899 -24217 -30259 -33066 -26311 -20911 -11539 -9229 -15753 -22543 -24431
3734 -24431 -19463 -19221 -21774 -13499 6383 15567 9200 3398 7965 4930 10870 12792 4043 7528 6294
3719 6294 -2198 -7788 -9277 -20851 -21827 -21291 -17993 -7049 2175 12474 17286 11878 6062 -1393 -3007
3704 -3007 -83 -4715 -10390 -14498 -12001 -6262 3068 -2045 -4146 -4361 5774 5876 -2781 -5527 5019
3689 5019 2809 -8765 -10839 -11475 -8164 -1537 -5883 -9963 -15125 -14638 -10334 -9628 -18857 -20339 -14192
3674 -14192 -8785 -9652 -7304 -12713 -14283 -8393 -5779 -6142 -12741 -13922 -8798 -4987 -10067 -15507 -15364
3659 -15364 -10114 -2744 1799 2098 -475 -4324 11353 15810 8554 15272 16372 15654 11671 4680 -7822
3644 -7822 -4683 -503 -889 2609 -3537 -11883 -15525 -6780 -3086 -3055 -348 -887 -5629 -8207 6351 5237
3628 5237 3509 2314 -5390 -19306 -18012 -2698 21545 29782 24776 9220 1829 -145 4452 15985
3614 15985 16725 7214 7126 6471 1753 -5516 -11810 -11321 -9072 -2557 1930 20 -4324 -4764 13043 19501
3598 19501 17730 18292 18298 9775 7369 7268 5009 10294 9957 5304 353 2551 601 2440 9105 8491
3582 8491 3212 -3943 -14752 -10375 -2029 -7221 -15842 -24290 -27147 -19917 -12850 -4492 -7970 -4691 4810
3567 4810 7108 5913 -8487 -16445 -10125 -13969 -13453 -18177 -13962 -12711 -13558 -10874 -14147 -16645 -11071
3552 -11071 4160 12698 10251 1937 -1794 -3188 -2586 -17772 -20519 -14019 -12516 -12007 -12903 -21984 -27264
3537 -27264 -31596 -29747 -22593 -12855 -3078 -3392 -8079 -14360 -13322 -8292 -8127 -5960 -6299 -8151 -10336
3522 -10336 -2400 1797 -6273 -12338 -6570 -893 -6879 -10567 -4826 1951 2600 6883 6828 -749 -5176
3507 -5176 -8483 -18378 -25701 -28554 -31851 -23859 -16710 -9940 -14137 -26065 -23142 -15715 -23978 -11883
3493 -11883 -4926 -2777 2938 7773 6458 10691 5656 -6461 -5961 -10780 -17138 -23528 -25569 -17422 -11995
3478 -11995 -9597 -17599 -9490 -7019 -7914 885 -147 683 -7148 -54 821 -13844 -18593 -12824 -4976
3463 -4976 -5071 -13738 -19587 -23019 -24190 -13786 -6334 -8054 -5433 -3386 -3767 2650 -2734 -7465 -9606
3448 -9606 -1757 5382 9890 15744 8499 3280 -5582 -15480 -27308 -21513 -16140 -17908 -19192 -14169 -5726
3433 -5726 -9617 -18556 -12269 -3118 2739 14342 13396 4332 816 -11417 -21122 -26731 -25749 -15788 -10100
3418 -10100 -3042 -1182 -1858 -9216 -13661 -14287 -13765 -14558 -21506 -20990 -22364 -18217 -16636 -1365 10575
3403 10575 13924 -752 -17331 -10291 -666 10152 13074 -2919 -9425 -5628 -5551 -873 5078 9113
3389 9113 5961 11245 11540 9247 4835 -127 -7917 -1833 3929 6184 6455 9139 17795 22339 17292
3374 17292 15129 8367 6527 -1788 -11416 -10059 -3245 6468 9840 9278 3446 -859 9666 13828 1276
3359 1276 -429 -3092 -7761 -11566 -19043 -10952 -3723 -3806 -4775 219 2351 -1942 8427 20538 15105
3344 15105 12665 11602 10849 7662 8463 -1853 -1129 4512 -2438 -12158 564 9011 -1254 -13982
3330 -13982 -13174 -5035 -8185 -20182 -19524 -22936 -29861 -20989 -15851 -12380 -9055 -13208 -11573 -9194 -5831
3315 -5831 3535 4451 6767 2051 10980 17390 12999 8137 5400 13154 9671 -2649 -5834 -4339 -7426
3300 -7426 -4715 -9300 -7480 -1628 7755 2342 -4503 -18718 -18334 -15597 -15020 -17344 -9060 -12541 -16616
3285 -16616 -13586 -13944 -12635 -9638 -14697 -14509 -50 6958 16997 19321 18549 16190 8986 16617 15504
3270 15504 9938 15126 23748 20544 11535 987 -5598 -241 8486 19 -5460 -4105 497 -3187
3256 -3187 -7674 -4531 7554 7710 4716 -10979 -18783 -15079 -17729 -12348 -3638 -6498 64 9426 18707
3241 18707 21000 11047 16305 19562 13740 961 2449 4111 -3632 568 -4017 -13885 -12139 -11784 -5477
3226 -5477 -9294 -15081 -12823 -5292 8992 11863 -1024 -3471 9696 -3971 -11929 -7316 -9606 -5386
3212 -5386 -2851 -9 1862 -3158 -8877 -9408 -9517 -12017 -15029 -11497 -9895 -6070 -1511 5173 17329
3197 17329 35624 34896 43659 60334 66370 61770 51168 44514 25227 10543 11091 1963 4172 3489
3183 3489 -1107 4319 10856 15188 9582 1016 -1712 -14336 -10754 -10475 -8536 -5430 -3366 -1921 4038
3168 4038 -4311 -12762 -8289 3649 -1038 1423 1651 -5197 -6481 458 7700 16029 13178 7505 9062
3153 9062 11859 12514 8593 1107 -7545 -8799 -4974 -1762 885 -1995 -3428 774 4198 6483 3428
3138 3428 122 -6472 -5242 -14141 -16625 -15614 -8921 937 -147 5298 -3220 -5041 -1915 -1506 6747
3123 6747 10507 6022 -3456 -3805 8469 11938 15203 10563 5312 -4628 -2022 4221 11396 5268 -3229
3108 -3229 -7745 -10499 2001 3368 -908 -4730 -11432 -18052 -22030 -25205 -17161 -9136 4856 5454 3715
3093 3715 11679 17800 19047 14201 11121 9376 9527 7258 5762 13951 21692 25019 14023 8550 -2041
3078 -2041 140 3010 -1633 479 542 -1912 -3529 -4789 -7739 -13838 -12249 -6899 -11004 -9878 -2406
3063 -2406 6420 13093 12551 8858 -80 -522 -42 8951 17196 17051 13948 14547 12634 1210 4428 11081
3047 11081 1228 -2796 -2831 -4030 1579 1540 -1076 2406 7654 7882 2855 -1910 -253 -2719 -13910 -11998
3031 -11998 -3409 1227 -1683 -3278 -4178 -436 -4198 -8692 1472 2159 -3480 7761 18593 30251
3017 30251 17778 3056 -4837 -2554 3 -4631 -713 8270 6494 4422 1754 10092 10863 11661 3970
3002 3970 1769 1654 -3706 1876 -6532 -10744 -13980 -11198 -7331 -4697 6977 12840 11656 9035 -3259
2987 -3259 -14121 -10454 475 -5674 -13933 -11834 -5828 -4507 -7142 -2012 -5796 -9658 -4427 -9309
2973 -9309 -10954 -2878 3011 993 -2539 -7386 -9165 -256 10054 13259 3426 -2631 -16269 -17833
2959 -17833 94 2284 2986 4066 -319 1279 5046 9776 2819 2168 1893 2028 11916 10886 -3783
2944 -3783 -12824 -12399 -13499 -15940 -11374 -8277 -7760 -10498 -10827 -10824 -7931 3091 2920 2130 7725 221 -2899
2927 -2899 318 8347 14334 9698 4212 -4997 -883 2346 13799 14726 12590 10950 9160 2358 -6495
2912 -6495 -15290 -15762 -12230 -8700 -8367 -2783 1933 5029 5823 3374 -4936 -14800 -16350 -17941 -8204 -7962
2896 -7962 -7384 -9472 -4779 3671 6862 6418 3877 5472 3837 -4266 -9522 -13531 -18850 -17846 -8125
2881 -8125 -4584 -1640 -7025 -4547 3125 8479 8048 4188 2898 8633 2665 -6607 -2452 5271 2082
2866 2082 -4450 -7689 -7452 -8042 -5060 -8581 -9375 -3611 -2896 -7781 -8841 -6142 2659 -183 2297 -963
2850 -963 -2944 -3698 -11949 -21442 -18821 -1537 5234 735 -279 805 3511 -6516 -18759 -21787 -25425
2835 -25425 -17738 -7194 -5998 -9648 -6755 4300 10692 5967 1188 5926 2618 4917 -6864 -11571
2821 -11571 -9470 -261 7513 6891 7668 13375 10536 1762 -1337 -9441 -20175 -16310 -9826 -9353 -18720
2806 -18720 -14987 -5923 -5010 -1126 -5933 -3965 -1046 5935 7097 9111 8844 -5247 -11987 -8935 -13090
2791 -13090 -17878 -16906 -18402 -13903 -14528 -2653 -1930 -9044 -5633 -5288 -1075 -913 -3294 -8203 -12743 -15090
2775 -15090 -14185 -4908 1033 2962 -3208 -11061 -4672 -7195 -8740 -2471 1442 -11911 -14338 -15953 -11152
2760 -11152 -12375 -3816 11778 16559 5668 -7253 -5991 1019 9357 55 -9573 -8542 -9409 -2698
2746 -2698 1249 4338 2996 -10959 -16793 -6062 -796 -1819 6085 2702 3267 -4548 373 6367 7009
2731 7009 5659 -4126 -633 11931 15582 12010 14373 14925 12325 4469 6067 4497 11958 18501 18434
2716 18434 15222 11362 13115 9285 10563 6467 7129 7133 4108 4126 7446 -245 -110 -4750 -12203 -1866
2700 -1866 7165 10079 7565 -14 -3636 -7184 2166 9883 9715 -871 -8600 -6116 598 5956 8550
2685 8550 10560 6590 575 -5871 -10166 -9767 -5617 2949 9135 7430 11319 454 3520 9776 6551
2670 6551 -5859 -8274 -6944 -7971 -8641 -10054 -13042 -19008 -14972 -15149 -19841 -13801 -6292 2985 11902
2655 11902 11708 1571 -6580 -15380 -12312 -7744 -4586 -2895 7078 16531 24625 25368 15607 -11052 -18479
2640 -18479 -12679 -10496 -4245 -14871 -13812 -4214 119 -6425 -6398 -4964 -12336 -9071 -858 3264 8314
2625 8314 20153 10518 -4781 245 -938 -1335 4114 1388 7967 7684 12437 7942 3481 -7251 -1417
2610 -1417 3370 -39 60 -1136 -4589 -7335 -7231 -9974 -10045 -4608 3118 3562 -5692 -14211 -10515 -7936
2594 -7936 -7690 -8120 1166 1862 -4282 2320 4665 7103 4182 892 3570 9014 12133 9979 8259 2818
2578 2818 -8635 -14786 -18027 -15134 -18576 -19100 -10722 -1883 -1809 -5157 -1931 9875 10668 9698 10651 11911
2562 11911 11657 7038 -1122 -2101 1695 -8680 -7763 730 9738 6767 4558 3079 7468 4101 -6814
2547 -6814 -14310 -16240 -9436 -13344 -10725 -9409 -8298 -6232 -5670 -1370 -4678 -9678 -5914 -1628 2868
2532 2868 3844 4478 6691 1078 3130 36 6594 7773 2897 1945 -3637 -8746 -5272 -12029 -5360 -13861
2516 -13861 -21373 -14793 1004 9626 15503 18517 21313 20198 7988 7922 7443 -3221 5396 8035 6274
2501 6274 16538 19143 17073 9416 8284 10408 7250 11162 8210 834 -62 -8805 -5942 -6779 -7406
2486 -7406 -8715 -5681 -5432 -4735 -4468 346 6888 -2965 -7171 -11381 -464 9331 8971 6683 -1935 9563
2470 9563 15419 7773 1229 4760 3801 5197 11979 20100 22772 10906 11732 16702 16480 17342 17868 11108
2454 11108 3471 -6483 -4801 -5360 -4351 -3664 -4938 -10377 -5053 -1017 -579 2549 3725 5645 5689 4435
2438 4435 -929 -9253 -11462 -13862 -18156 -4977 12517 16353 15721 1678 -4516 8594 21336 28766
2424 28766 20802 5286 -4188 -515 -650 6327 10230 8806 3358 9166 7369 688 2196 -1725 -11355
2409 -11355 -4130 1536 -766 -851 4404 5956 322 -8016 439 -7987 -13601 -1171 640 -4305 -4985
2394 -4985 1619 -1561 -9990 -10943 -4102 3167 -639 -5794 3589 6673 3338 -1388 -5416 -4715 8237
2379 8237 15440 16044 17206 11008 11823 8182 11985 9092 -3118 -1180 7860 1990 -6328 -11131 -15069
2364 -15069 -11698 -19385 -28926 -24734 -17267 -17350 -1380 11106 4251 -7801 -10675 -7080 -4229 -4821 -7707
2349 -7707 2236 1007 -11883 -3083 -1238 -10947 -8441 2397 8241 7367 8985 9385 -268 2992 1601
2334 1601 -5731 -13670 -20433 -19593 -15621 -11481 -7857 -7134 -17391 -15421 -4794 2743 -4377 -6687 573
2319 573 7166 -5512 -20075 -29470 -28562 -19414 -11257 -4499 1547 6729 8088 3893 -6124 -4504 -4389
2304 -4389 -6825 -10924 -10887 -2136 11710 13387 13336 13864 12693 8423 7377 9314 6323 10780 1107 -9305
2288 -9305 -14271 -20082 -10054 9098 10973 7337 14446 23968 9972 7273 6109 13626 14938 20125
2274 20125 17030 21341 22229 6553 4031 10145 18085 20652 18729 14731 24944 23975 18518 23443 16774
2259 16774 3688 12405 13840 7733 9463 9654 6613 12539 8992 6693 7659 10258 9497 4552 684
2244 684 -954 1596 3919 1649 1376 -4460 391 6052 1725 -1341 4653 -184 -502 129 -5889 -1854
2228 -1854 2679 6916 1072 7711 7584 11186 10816 10288 3175 1837 5666 -1423 -2578 -1568 -7243 -13947
2212 -13947 -11946 -1491 2752 3617 -1167 -7212 -7349 -3556 -7703 -9337 -3821 -6192 -4631 404 -236
2197 -236 6761 3714 -2401 -5972 -6635 4240 4306 -522 -3505 -3718 -9644 -10435 6530 12326 10188 -949
2181 -949 -10286 -13438 -12306 -11773 -8411 -2916 6832 10061 10698 5755 6508 -1467 -1921 6046 7245 4635
2165 4635 10694 15496 19685 18733 8950 -1092 -2935 -2447 -7752 -15181 -3814 -5587 -15402 -15115 -6542
2150 -6542 -3708 -2846 -1014 -3508 -12020 -13239 -15302 -8692 -6179 3841 -1728 -3051 2559 13665 4912
2135 4912 1678 4077 7329 2272 -8526 -7753 -852 12392 21970 21892 18130 15012 14854 20586 22656
2120 22656 15395 10550 4608 -807 -5549 -830 -228 6562 8021 5799 6293 5257 7222 8726 -666
2105 -666 -4341 3402 11786 6214 577 -2785 -9320 -14273 -18738 -23133 -23305 -21676 -14342 -13629 -10582 -11529
2089 -11529 -9357 -14559 -9230 -2676 7392 17437 23244 17105 847 -5119 -2731 -10273 -7325 -4328
2075 -4328 2700 -4303 -8540 2326 -3421 -8706 -10164 1112 8611 -3620 -5805 -2812 -2003 -6689
2061 -6689 -24228 -25284 -18059 -8835 -2401 -6032 -4368 -7568 -4869 -4947 -5403 -2685 4161 1311 -4576
2046 -4576 -3796 -2460 6488 14947 18313 11873 3962 -1029 3285 12334 7744 -6705 -7298 -4777 4092
2031 4092 11923 6856 -2617 2596 4598 9136 4964 6547 3275 4188 3878 1076 -840 -8499 -8158 878
2015 878 -4674 -972 5612 -1832 -4766 -656 -7056 -9364 -4480 -10156 -19782 -25674 -29449 -28417 -18703
2000 -18703 -15753 -12183 -1383 7106 7646 -3125 -13153 -3545 -2470 3819 3428 6883 4370 -850
1986 -850 -10901 -12330 -4987 -4408 -11218 -14107 -6599 -2253 -6128 -8412 -5894 545 6733 8527 15511
1971 15511 13894 5256 -2817 1688 922 1457 10994 7700 -8088 -18991 -16100 -10846 -5892 -3140 -1349
1956 -1349 -6281 -10042 -5211 -8650 -2992 2632 6540 5623 -3291 -5905 -5819 3400 5974 2639 -2397 -10408
1940 -10408 -5812 4849 9614 17128 8255 1205 -4973 -6963 -3462 871 -1283 -9700 -14379 -7198
1926 -7198 -17050 -26233 -20767 -16425 -19460 -12875 -10912 -16324 -9211 10961 19195 22401 18628 11658 13049
1911 13049 29227 36579 33469 28554 19318 11879 22196 15775 11020 5900 3175 10070 5300 -4430
1897 -4430 -5895 -5956 592 -2510 -12376 -11397 -625 -350 2908 6151 3758 2876 -1852 -7059 -6898 -7339
1881 -7339 -3711 8034 16735 9309 1831 10146 16225 17908 15009 21002 17032 7376 2000 6727 12159
1866 12159 11647 9448 11100 12050 15189 3308 810 7703 2471 -5046 -6912 -4637 4694 3929 -805
1851 -805 -4027 -12550 -22866 -11760 -5336 -5131 5943 17131 10872 572 6963 2134 4598 15954
1837 15954 15083 2859 -4446 -917 1183 2549 6375 6300 8998 10344 5805 -578 -2332 6537 1367
1822 1367 1079 4460 -2877 -2949 -16892 -25600 -18464 -516 3 -4657 7318 4864 8907 12936 4800
1807 4800 -3432 -1998 6184 15852 8519 -2008 -3350 263 -2579 111 -1009 650 5055 -103 -1607
1792 -1607 -546 2277 7308 158 -1249 -9006 -2291 12635 9373 5824 -481 -3356 -1096 -4624 -555
1777 -555 -1372 -4070 -538 8772 8910 2606 1664 7585 10584 11758 20775 16886 4709 1078 4867 3884
1761 3884 11206 10811 711 -4678 -813 6163 5480 3424 -10390 -25061 -17572 -12414 -7351 -2824 1457
1746 1457 1673 6119 2115 2579 5114 -867 -3726 -15428 -9525 -3065 -3933 -11903 -7374 -5806 -10655
1731 -10655 -4600 -3785 -5338 -6423 -3322 498 -400 2801 336 6755 9652 13098 -987 -5138 -5030
1716 -5030 -3977 4084 3709 -2218 -4806 -8304 -7662 -13703 -13814 3090 6818 3201 -5464 -13320 -11177
1701 -11177 -3455 10500 20045 13184 4191 6688 3390 -13775 -14842 -3744 -4380 -1252 5051 6402
1687 6402 177 -2268 7844 1250 4707 2223 8647 3679 1674 -5860 -11023 -13631 -2389 -2915 -5115
1672 -5115 3583 3198 8994 12120 9039 584 -1892 -6484 -1226 -2655 -6339 -3101 3708 -5203 -12528
1657 -12528 -13003 -5307 -6190 -3654 5230 -6390 -13290 -7354 -4514 -1115 1010 -4544 -8259 -10403 -13755
1642 -13755 -10292 -10834 -11244 -3543 8788 15951 9700 -3911 -515 2121 6063 11902 10352 6926 9843
1627 9843 17930 21000 15705 5734 2148 1771 -4547 -4653 -1648 216 5590 11811 16838 16940 17354 14234
1611 14234 24146 21455 13085 5837 449 -910 5306 8335 18075 20049 14500 11078 5249 1948 6570
1596 6570 9257 9494 14388 24168 21834 19847 17430 11203 9933 9702 2878 4954 10965 10895 14115 12882
1580 12882 5808 -243 -1478 2954 -1236 -9120 -11254 -11385 120 7388 10378 13301 11970 12910 5752
1565 5752 -5136 -4860 -6543 -7239 2462 5212 14608 21600 22600 14626 5592 4519 1679 -560 -4990
1550 -4990 118 13747 11539 4054 109 -5102 -7172 -4751 3275 11080 15627 10363 8145 -586 -4108
1535 -4108 -12547 -26705 -25611 -14311 -8807 -8306 -7637 -2386 -1780 4854 3578 7625 14292 12458 6507
1520 6507 739 234 -1350 1727 -955 -1448 6361 2534 11253 13384 13787 13302 22394 25531 19495 15124
1504 15124 8251 8722 12732 9449 1961 4077 3135 1347 962 6335 -9935 -14683 -4652 -3790 -7957
1489 -7957 -2985 -5227 -10114 864 6791 -4928 -11025 -20472 -19534 -14480 -7382 3792 3156 -1460 345
1474 345 -157 -1659 203 -6164 -6307 -3411 -2859 -5350 -15436 -16384 -17483 -23681 -12928 251 4500
1459 4500 2023 -4644 -7627 -1759 -760 1309 7387 -3049 -17674 -13197 -1843 3913 2456 5019
1445 5019 4726 8197 10085 6791 -5272 -3313 -14006 -16838 -7235 -1185 4824 4717 5771 222 2805
1430 2805 12879 14743 10769 2833 426 948 7067 14794 11997 4283 -1080 -1275 83 14838 18142
1415 18142 3940 1183 852 -731 1712 1418 7221 11161 17820 16776 12182 1383 1555 -676 -3870
1400 -3870 -2406 -9619 -11095 -11138 -4607 -852 -2172 1684 4249 4190 4566 1657 4150 9849 3644 -10421
1384 -10421 -13590 -4832 -2920 -7299 -10104 -11949 -10109 -7199 -2747 983 -3748 -4580 -3993 -5959 -14103
1369 -14103 -17771 -19578 -12025 -8587 -17417 -13901 -9385 -3852 148 3630 7684 12911 6477 -1453 -9112
1354 -9112 -14220 -21566 -14845 -5935 -2248 -1863 -7517 -10667 -3728 7167 13456 7848 4222 3347 6268
1339 6268 9093 9873 -2081 758 7252 5390 2171 3076 5816 4654 5332 7743 13859 20989 29354
1324 29354 27945 14634 10100 698 4347 217 -3034 -6232 -1865 -82 -10177 -13434 -5042 -5904
1310 -5904 -2996 6858 13551 2755 -2164 -15168 -21207 -16154 -7763 -5277 -3778 -3695 -11838 -7585 -9732
1295 -9732 -9177 6637 12144 6840 25 2139 3159 2559 -2612 -11392 -7001 -1432 -7049 -9381 -8717
1280 -8717 -4316 2980 2051 5976 6893 8259 11117 250 -2090 -573 -4652 -8131 -10341 -6967 -9776
1265 -9776 -6519 -6637 5398 5011 -4290 -6432 1215 4721 -2173 -7915 3207 6529 1353 -1082 -1929
1250 -1929 105 2439 2198 2493 21 -3050 -3949 7032 1030 -1137 6567 8463 5572 -1941 -10335
1235 -10335 -10936 -6700 2764 5960 4810 8714 9077 1552 -13573 -13101 -101 9416 11414 9655 5205
1220 5205 1433 -2301 2582 8063 15603 19426 27039 26323 15783 5719 1380 2321 10100 11199 11404
1205 11404 7482 2522 7111 7638 10948 3943 -3839 -2053 3589 13996 11518 2075 181 3492 -5316
1190 -5316 -4429 -6872 -4871 239 -2053 -7711 -11543 -12629 -4167 1847 4171 8186 7827 2681 -2102
1175 -2102 -2887 -1210 8029 16727 13872 17215 12368 8553 525 -10584 -8547 -7086 -1800 2531 534
1160 534 1705 2247 6079 10168 12234 14722 14211 12551 6329 11179 8216 2353 -3829 -6069 -6639 1468
1144 1468 3644 3938 11799 4949 -2638 897 4433 9081 12479 11376 2267 2505 6150 2668 -387
1129 -387 3642 1033 3735 622 -5650 6260 773 -1739 1179 -13800 -19898 -14878 -16771 -15772 -6632
1114 -6632 3478 2794 1902 2341 5318 10307 11017 21127 18956 13270 7106 4904 -420 -1539 -8196
1099 -8196 -3966 957 6184 10706 10875 1105 -8542 -5669 -2311 -5758 -2722 -1132 -2570 -3025 4520
1084 4520 9788 7516 5701 10301 9509 16390 9749 -2098 6301 7993 -4577 -12393 -10647 -13271 -16506
1069 -16506 -10157 -1418 9981 6582 3302 -107 8589 14023 7839 3391 -158 -4005 9344 1730
1055 1730 -4128 -5627 -7670 -7918 1236 7307 8937 3434 1687 5951 11461 18016 11795 5676 2760
1040 2760 9657 -5642 -13617 -8670 -4172 -9130 -2399 4081 9345 4327 4081 11042 3798 -2127 1522
1025 1522 4171 5149 4219 9257 8154 6792 9836 6011 5896 3750 2930 -8057 -10310 -5516 2241 15126
1009 15126 15536 21583 14062 -782 -6667 -6036 7633 12776 9404 11362 8045 4737 772 -2644 6241
994 6241 4546 -4449 -15641 -1998 5018 1118 3528 3208 3931 1410 -1539 -7709 -9172 -2834 3104
979 3104 10487 15541 18093 17825 9706 1684 7075 6805 4838 -867 3424 10405 20110 28409 24669 19995
963 19995 13580 9687 6644 6423 4645 -10339 -14707 -9867 -14523 -12279 -17226 -14626 -7891 -1993 -1844
948 -1844 -858 5161 9942 7650 4978 3617 8915 10048 4528 744 2655 -7788 -18974 -7268 1026
933 1026 -5262 -6992 -8121 5276 9703 6345 18900 16029 995 -6160 -10134 -11291 190 1195
919 1195 -3703 5846 12741 11936 11551 7415 14591 17717 12693 -898 -3738 4605 -2380 -13626 -4753
904 -4753 2880 2106 3133 4074 4205 8481 7129 10987 2847 -848 8134 19577 16722 8671 -2769
889 -2769 -865 15550 21298 7995 8661 13380 12848 15256 7587 172 -887 -5764 -6010 -6180 -5440 -1961
873 -1961 8755 1575 -8717 -9962 -10065 235 8883 8941 6771 12651 12186 11919 3817 527 11911
858 11911 10505 3484 -3776 -7037 -7425 805 5714 11584 -3467 -14279 -11180 -3904 -4101 2830 5401
843 5401 6580 13792 10940 3210 12541 9210 7846 1559 -9461 -441 10418 4691 6398 5324 9224
828 9224 9762 5217 1381 -6756 -9812 -11572 -5473 296 372 6991 7199 5423 12183 3915 3113 13476
812 13476 20815 22984 23683 23689 20949 8474 12004 17260 14933 9387 6582 8264 -1494 -15303 -7955
797 -7955 -979 5138 7641 8246 11285 17079 5796 15210 21287 17953 16608 14282 13285 9683 10560 11295
781 11295 13499 16861 12619 6191 6269 3407 -2614 5190 15063 20950 15493 7062 7292 7091 6372 4563
765 4563 6940 13994 15400 15422 24277 25771 23955 21717 13491 19128 23938 26390 14273 6049 6647 9505
749 9505 3825 865 -100 5575 4668 7150 9713 13837 13485 12358 17906 22010 22800 13737 22181 27395
733 27395 23467 18454 5921 2583 9786 16183 13760 7923 13295 18042 6257 3940 3629 15776
719 15776 17250 13396 5401 4975 -313 675 3165 8650 3617 254 -6715 -10770 -200 10438 10736
704 10736 4623 -3028 1765 17284 17829 19832 13784 6610 3133 2903 15966 34239 39457 28088
690 28088 21008 17679 15155 9337 2751 1638 8217 9402 14777 26438 30668 28124 32840 31834 29167
675 29167 28893 29682 22064 14984 11425 17243 25029 32498 21549 10196 3889 1679 -751 683 11188
660 11188 13483 11792 5087 5125 6028 2171 -12536 -15041 -7814 -8878 -947 5680 10076 16194 17639
645 17639 19307 16287 12852 10890 27913 47888 47978 34457 19922 4961 2285 5690 5365 16566
631 16566 21100 14204 13804 15199 10311 7742 7633 14785 19079 13120 3669 4152 1430 -2141 2185 4104
615 4104 -309 2747 2951 370 4313 13086 18015 17989 22621 21821 17898 10966 14072 15458 10867 12677
599 12677 14473 8649 7140 6518 12398 13492 5200 -945 -6937 3854 21559 17822 4725 14095
585 14095 18829 18078 18564 16489 19525 18808 15402 5624 3359 2983 2668 3381 3787 3941 4416 9723 9001
568 9001 3051 451 5004 10936 10276 9695 6026 10649 11819 4505 5178 1136 -2169 4254 8057 7133
552 7133 -2551 -14050 -6175 7370 10531 15362 32292 36216 22123 13910 8583 7680 14425 16542
538 16542 14025 6180 -6332 -10479 5381 10571 13893 10220 11536 9322 10750 5652 5602 3441 -986
523 -986 8241 14717 14743 15144 7477 8044 12401 22324 25349 16126 11408 20181 26113 20592 14485 7326
507 7326 2256 5345 11251 13524 20252 13155 17224 23838 21488 17464 13803 7784 1409 1662 5440
492 5440 5431 7789 8762 17954 17752 7477 11472 22231 17416 21315 17733 11253 12066 23195 34212 38356
476 38356 33777 28536 21873 14305 6534 4200 5319 13666 16738 11296 18409 15998 16368 19794 16686
461 16686 12173 10068 5501 6080 13516 21857 14519 13113 8575 15111 18715 20020 30023 30283 27803
446 27803 21871 9517 2119 7513 7491 11509 12523 8287 13004 15838 13417 21786 19508 18210 23253
431 23253 21817 20352 10352 12232 15609 16019 10732 8062 2486 3589 3731 5600 15297 20656 27185
416 27185 23305 17775 17553 12565 8748 1419 -2831 3610 1164 -3582 6509 8362 -2006 2318 10130
401 10130 12505 13145 12984 13956 11382 15526 23139 12429 11617 14798 19056 9177 6046 4523 6777 13592
385 13592 24011 22136 24425 25126 16153 7804 13326 13679 10492 11815 8060 6228 4108 9111 24810
370 24810 21389 10221 6938 5710 2591 158 -3706 -3411 8245 13628 6096 -466 4323 8283 9328
355 9328 5281 4006 7976 14272 17601 27703 21058 21631 13706 5116 11650 20821 30043 36200 32382
340 32382 23396 17246 17348 22529 27142 24208 7514 631 458 1864 -312 -1118 3024 3087 2977 13952
324 13952 10014 6406 7414 2160 11015 18128 12830 6787 9967 15719 21916 23428 9392 -2336
310 -2336 -13661 -18668 -16251 -2937 1707 4426 8780 12452 16249 24345 27821 27375 18890 13993 12616
295 12616 14497 17525 14402 19086 16418 10276 12227 10574 9977 8515 10385 11639 19148 21839 22339
280 22339 15107 7304 6811 6912 10569 12734 10185 15494 7180 -2974 -11147 -5936 6833 12593 17169
265 17169 13944 13939 12723 6009 6917 21744 22548 12294 4970 7280 5689 402 2030 6088 7707 8650
249 8650 7966 3934 -38 -2121 485 1339 1778 2922 6630 9675 15699 17004 20744 27383 19379 4986
233 4986 2113 5433 6808 15126 21679 22089 20363 16880 7243 5409 -444 843 4191 -978 -285 4611
217 4611 7915 14382 19742 19731 17437 11706 16185 9301 5705 10808 12741 18797 19810 22249 27976 22997
201 22997 16848 10529 9272 15390 22635 19133 14054 18346 23635 21209 21305 15421 18550 18521 14296 8261
185 8261 4716 11007 15015 10932 12093 11293 7068 5968 3635 12017 19122 16069 10296 11349 3620
170 3620 374 6530 10650 17647 16003 15672 14272 14048 13902 20783 25923 29446 26803 17901 14768 10440
154 10440 7009 6833 7005 6561 6599 5780 5121 16877 24639 27615 24699 14792 12899 22448 18792 12125
138 12125 11999 14325 14784 11302 10561 13924 16665 11087 16164 10396 4768 5136 -13 -3161 404 5556
122 5556 14087 15954 23638 29624 21478 17393 21876 24324 17591 7696 10745 13375 13539 21637 19677
107 19677 15623 13107 16376 11533 8736 8321 16026 20223 20781 22470 16511 10869 19022 27360 23593
92 23593 15455 11658 8077 3619 -425 -533 -384 -940 -746 -1437 2642 3383 4528 8309 10590 13482 15774
75 15774 13527 15937 13936 14989 17274 14010 3483 344 -4685 -4617 4242 13429 19277 14459 7432
60 7432 1178 7438 13489 11103 10450 20278 28613 24960 19665 14206 9896 8174 7505 3302 2088 4516
44 4516 11789 18287 11025 8988 9290 9588 6564 9381 12056 13054 9639 9160 11407 10077 14882 16821
28 16821 17459 14347 7326 5428 9714 12352 16177 20461 22758 24288 18150 16206 11859 13713 16559
13 16559 19914 13724 11835 10002 8984 12061 17351 13504 19996 13135 7351 6337 5018
0 5018
$$ Imaginary data points
##PAGE= N=2
##DATA TABLE= (X++(I..I)), XYDATA
32767 26459 26184 25657 26034 30775 28976 31373 40512 43412 42606 41595 41611 43988 47311 55156 56143 52696
32751 52696 56187 56828 54398 55552 57046 55791 56372 55306 51061 50634 51082 54637 55676 54243 60440
32736 60440 70459 72698 76947 75902 76494 77159 82801 81292 77511 83985 88378 85328 84349 80285 83333
32721 83333 89018 98496 97421 96066 96574 104785 110205 110874 116329 115986 111404 113979 117181 115052 115862
32706 115862 117745 122455 119549 119691 120974 121664 127851 128171 131163 138031 139460 139776 140099 142517 145671
32691 145671 146679 142365 145946 146324 142640 144801 146256 146869 149637 146472 151716 156707 157281 158529 170810
32676 170810 164384 162562 167583 165150 160488 158715 158903 163636 164447 168665 172856 173517 177801 183018 184428
32661 184428 182539 179580 182588 188711 195178 194647 196561 191793 189237 201733 204841 198567 196653 200374
32647 200374 203760 209022 205776 202670 204137 208570 211357 209924 212347 210563 204507 198349 200795 209741
32633 209741 221707 232100 227393 225748 226795 225387 217637 223936 231343 229926 228356 227381 226061 231664
32619 231664 238661 241093 246450 257517 259918 262814 265857 264369 259231 260780 255856 249457 253939 263708
32605 263708 261234 260558 259096 262483 262182 260555 258046 254851 257516 260988 263469 276606 280738 285083
32591 285083 286118 281475 280051 280158 283142 290063 292073 288834 285850 280650 278653 278900 277536 287068 292527
32576 292527 291563 295781 301157 302084 304858 305836 311105 316035 312279 302750 298202 303675 309386 305521 312447
32561 312447 317744 315279 308170 311075 314195 310886 306135 304508 308684 314540 313775 312226 307924 318128
32547 318128 322102 320212 317780 320751 325302 331768 338510 346268 347080 349296 352819 339893 334549 333943
32533 333943 340531 342684 345001 340885 339474 343990 342907 348745 350488 350659 349983 346082 348660 356662 356556
32518 356556 352575 349554 351396 349770 344647 351472 364690 368726 374168 369795 362211 364856 365892 373457
32504 373457 381972 380869 380533 373839 373980 379200 380783 374193 366742 375498 378414 379731 382502 383967 389783
32489 389783 389424 379904 378169 387387 383266 381473 387515 381851 394008 400910 397129 396304 390407 385050
32475 385050 391386 397397 399231 399096 408086 413031 411292 404312 398158 405729 407943 409856 413489 414590
32461 414590 415114 414512 406353 408715 412323 411450 411533 410286 417633 422851 412939 402309 401643 407619 413763
32446 413763 414337 410515 403420 399895 403260 403538 398341 404654 415261 419680 414368 408960 409220 423396
32432 423396 430243 432305 437436 432718 433722 434058 436334 437765 439150 439622 439277 436409 430920 421323 422701
32417 422701 429224 424163 414556 416838 426872 439767 447881 437850 427292 433636 443036 448313 454581
32404 454581 460995 458300 455847 451992 436872 441655 449128 462527 463441 456846 461219 457570 449217 444231
32390 444231 440488 446018 451028 438682 437017 449972 460938 468511 469298 463281 460737 462367 455990 451760
32376 451760 443098 444180 450469 469371 482840 475279 460477 462173 467982 471650 476003 466900 460037
32363 460037 465729 476787 479615 463620 455607 463244 471876 479642 482049 480791 477835 475759 481517 477615
32349 477615 473033 466621 461213 470434 474823 475533 467966 461075 466244 467063 475153 480020 477546 483905 497602
32334 497602 494458 485901 492947 485259 474905 468558 477674 489235 493961 487482 470796 469697 479643
32321 479643 483510 487191 491615 488404 491455 492758 499568 497098 495649 487681 483052 481353 481205 478646
32307 478646 475141 485929 486182 482922 477553 474625 480560 473398 470474 470625 477998 487429 497128 488600
32293 488600 483418 478209 487510 498169 500645 501035 501468 500299 503647 497151 486261 494726 499717 495737
32279 495737 489860 492326 498396 497509 487091 486223 494657 500509 494503 491921 483882 487685 499616 493370
32265 493370 501865 514594 513885 517243 513331 504101 499320 507178 519891 510164 499198 501056 504236 499644
32251 499644 498914 499788 506086 511518 508587 502721 502442 507104 511773 496191 492543 493273 488808 491775 489188
32236 489188 491072 499033 505976 505660 500549 498710 505157 502382 502175 505608 507931 502860 502797 492356 491872
32221 491872 494361 503576 512375 522099 518960 508828 509568 509545 511055 516883 524353 523790 524852 524740 530613
32206 530613 519950 514571 510079 514303 518726 518660 520970 511115 508900 514042 517741 515114 513352 511500
32192 511500 506475 507670 511768 522286 524244 521015 513952 507615 503169 509010 515145 518524 516634 505912
32178 505912 506386 500357 506640 515846 514944 519463 530581 527018 520219 512445 507631 509090 514662 518641
32164 518641 515350 514950 515373 511127 509228 511060 511987 513175 525972 524378 507020 496406 506820 518294
32150 518294 512318 509785 506520 507952 504302 500000 501303 504884 507366 496859 502682 514657 513647 505881
32136 505881 504235 510922 517891 510189 509986 510665 511958 520262 528878 522359 519369 521543 526889 519872 513474
32121 513474 514883 516305 518605 519289 506587 499230 505475 516714 518222 516445 522520 528157 532454 529307
32107 529307 524366 528577 518697 507557 507132 503051 501075 505420 507813 509761 521121 530802 528231 514062
32093 514062 512207 516179 517737 519675 512574 517891 520456 519588 518271 520019 510997 511286 520908 521707 517934
32078 517934 523583 524252 522262 518381 528594 522282 515648 514264 519138 521041 530973 525854 526933 533210
32064 533210 531793 529462 525299 523519 518875 513815 513023 507646 506055 512021 516402 514280 514824 508589 505328
32049 505328 513359 512694 510743 503953 503353 512054 516402 512437 515428 528419 530676 518508 512514 515025
32035 515025 520928 519570 519271 523351 525242 524523 512795 515887 528359 522413 522318 522500 517879 513910 513036
32020 513036 519845 526845 527754 533297 530248 518293 516880 509825 510925 512413 523135 523575 514063 519097
32006 519097 533137 532480 526321 523894 521232 516989 518856 517716 519897 524810 519513 508342 507005 518500
31992 518500 513711 509046 506822 518595 525995 532745 528274 528712 530085 522537 519997 525871 524895 514905
31978 514905 514906 521287 522640 521351 529822 534862 534851 530336 528799 524298 525158 525322 518706 515243 517502 515313
31962 515313 520662 524573 518192 513016 517726 506746 501160 512145 515495 523419 519512 511179 514498 520004
31948 520004 532806 538435 534383 535274 530192 527065 529409 529302 530842 527436 525315 518438 516053 514747
31934 514747 516702 522236 517904 514344 524239 523543 527653 530087 533169 540615 539158 537775 544520 547476
31920 547476 542782 532159 529812 534681 529891 526824 532773 533064 526232 527001 520392 512682 507989 510657
31906 510657 509457 511431 516335 517025 520805 517481 519003 516306 519155 513925 508518 513566 522366 530502
31892 530502 521850 519582 528915 536275 529221 512210 510871 520855 527177 529513 533077 540584 540330 533974
31878 533974 522941 522751 529591 524930 528761 530255 528421 530122 540909 545846 546758 531088 519814 523387
31864 523387 527541 531810 530661 523941 527774 529049 525018 529087 535941 531561 522799 528050 522629 522474
31850 522474 526554 529517 530515 525077 531584 530212 529644 525278 518353 521276 521409 522244 537912 529399 529419
31835 529419 535640 530091 531681 530009 529751 529776 539291 539509 543913 543441 532138 525425 528045 524653 528376
31820 528376 537997 545565 547097 551103 544375 533001 532325 528470 520966 527245 538197 529224 523565 525872
31806 525872 527420 523711 521529 525674 529179 528306 525046 523431 536363 533070 527820 535078 534846 530141
31792 530141 534254 530125 523576 533668 534648 535277 526422 519078 518345 523216 524767 523045 524145 521615 528797
31777 528797 527137 531501 545042 538532 533651 523527 520596 523101 533578 529802 530581 537819 540733 539538
31763 539538 535173 524152 525881 532286 526920 517018 514749 509470 507258 511515 519833 518166 522243 523732
31749 523732 524192 532603 532143 531334 538420 534836 538288 542778 544273 544177 538241 536393 533927 537478 536497 544979
31733 544979 537659 517885 511113 512329 521020 514610 517695 530473 535117 533267 531319 531985 525459 520069
31719 520069 522895 530339 533497 532067 533369 535503 540232 544712 531829 520643 519476 523735 524929 519535
31705 519535 517710 527633 539247 537572 524017 514011 520967 535237 535041 523743 515698 514147 527736
31692 527736 531075 534650 539218 533147 529672 534613 536519 538509 535737 528691 530549 522489 522617 525400
31678 525400 527499 529075 532290 527367 517552 522037 529317 532103 536443 532411 531222 535164 550119 546810
31664 546810 542129 539432 529336 526421 522148 524487 532734 527444 535146 544859 551471 547233 530475 530024
31650 530024 539579 544318 531441 529100 533513 528058 533416 534559 538078 540115 538804 524918 517081 517129
31636 517129 524166 526677 522518 529347 547079 550972 542659 533536 530870 525282 528545 534431 532856 528873
31622 528873 534582 540694 538699 536394 535846 539699 533575 527569 527703 531066 529555 531506 532689 536586 532293
31607 532293 524063 524115 527694 535760 539839 541066 533117 531788 533025 531285 539073 531429 525483 522601 533398
31592 533398 541353 539314 528000 537438 534213 525695 526433 540711 529703 519246 516492 518591 526886
31579 526886 530804 534324 533328 533812 538943 543291 540893 539722 533941 532911 537344 548817 542010 536737
31565 536737 532698 531174 528350 519644 518954 529122 535105 537217 531576 526651 531814 528614 520734 540446
31551 540446 553388 554823 548098 546254 544558 541916 540891 541575 542879 544775 541448 537026 532070 532464
31537 532464 539629 546423 544842 533608 528475 536232 540249 548336 543250 534281 536456 542464 539062 534476
31523 534476 537179 540191 528444 514419 516000 525457 525246 525775 519702 511990 522788 526782 526981 536741
31509 536741 539915 534173 528673 523897 537871 542552 534365 532310 520817 511728 510926 518918 516084 515284
31495 515284 522842 525695 524777 519416 523011 536679 544063 550431 561278 549615 540172 542802 539556 547752
31481 547752 549139 539815 531222 528877 526193 527262 533909 539976 537175 533409 536154 541529 539505 538585
31467 538585 536384 529358 519902 516517 527564 531789 525232 523107 526213 533263 539038 543728 543626 543115
31453 543115 532913 526664 529692 542209 549758 543962 544374 543746 537161 529302 530274 533228 545525 547444
31439 547444 549147 542965 529420 529610 526231 527614 540019 545436 548081 554568 552930 542942 535662 535755
31425 535755 539067 536588 528889 531233 522964 515143 522856 525799 535198 538366 538071 546005 553954 551003
31411 551003 546330 536093 526823 522965 536844 543776 541466 540774 533954 523098 511708 514204 516881
31398 516881 525558 525826 521463 511513 511556 512078 517507 530263 543226 536115 528993 516800 520909 541673
31384 541673 547020 540355 546039 548820 540949 534270 534111 525672 521048 529603 533559 538258 538974 540060 532217
31369 532217 526917 538416 547018 542202 540892 539136 537724 531820 520530 525518 529413 532583 539809 542990
31355 542990 545975 542824 538709 538845 543317 545715 539234 530448 524810 524350 532131 543729 539420 539956 540989
31340 540989 543671 545154 551566 551922 549408 544969 544139 546815 547108 543011 534144 544556 551817 555726 553721
31325 553721 540718 539986 549736 544823 526565 518340 517688 526835 533486 541161 539221 545737 542793 546448
31311 546448 549307 553376 547433 539377 540096 538731 534771 536476 541452 551980 553329 548685 545021 534353
31297 534353 540134 550135 545360 533448 537550 542257 534375 535800 530354 527039 528763 541884 549880
31284 549880 551411 539819 534859 537075 549347 549123 543737 539989 550497 556465 545357 540599 539727 529918
31270 529918 527116 529136 531803 538500 539606 545870 544412 539188 540434 536382 531795 530799 538501 540467
31256 540467 533689 532512 534064 530972 529910 528216 529331 519607 525761 536928 538377 534472 539101 540831
31242 540831 536192 539058 546754 546229 540176 538084 531562 532351 530896 528527 528456 524709 528359 532716 532153
31227 532153 539617 541199 535603 527377 527451 527745 530894 540958 547107 560399 558670 542643 523783 518639
31213 518639 518608 524691 529046 538064 546945 551403 545964 535983 539558 556155 552096 549476 538377 534439
31199 534439 539832 535556 537190 540942 543534 543826 542911 542708 534295 533143 544351 541942 542795 541154 543326
31184 543326 541593 543997 539477 533118 537515 543498 536953 532363 542579 547993 534925 531444 537714 537876
31170 537876 535208 536737 534288 534490 533064 540327 547874 549518 546203 534876 533400 539270 538047 535435
31156 535435 542533 553863 563958 556863 557520 550158 536203 526860 532102 543125 532944 524735 529766
31143 529766 538082 543550 547592 545977 550570 551580 543085 532040 533912 539750 539496 535514 543079 544396
31129 544396 544675 546433 530175 522153 530219 535093 532987 533888 544747 547300 544924 545756 536537 530924
31115 530924 539244 540822 538324 533898 538508 539026 541326 547917 547284 551122 561427 560934 551654 535578
31101 535578 530526 535198 535625 528909 519129 520863 522630 520343 527656 532632 532245 543051 540865 543623
31087 543623 535167 533929 539669 545175 551510 546166 544572 548482 547121 551122 542288 544961 551486 551304
31073 551304 545577 540446 546324 551941 550323 550819 543114 541268 546749 542179 538645 529453 546625 547470
31059 547470 537948 537678 530953 533608 537817 542578 549333 553416 554633 550127 536975 541424 546809 546282
31045 546282 540903 544464 548596 549264 544977 540516 543293 542475 545535 546610 545583 548493 556535 558474 553083
31030 553083 544746 547988 555801 554132 550735 548924 548869 547890 543087 544856 543951 536799 537624 537086 526398
31015 526398 530683 532679 531362 537794 538184 539162 549242 547956 556712 547760 550937 547402 538809 540894
31001 540894 538673 547220 555915 563312 561448 563604 549814 544809 548642 545932 541019 540219 544510 543384
30987 543384 545061 544076 540510 544088 546358 548112 544715 540888 540363 548759 543757 540116 550225 554482
30973 554482 551266 541652 537797 541877 548902 548566 547159 537756 531693 530380 534410 542561 543738 551827
30959 551827 545519 547573 555232 554837 550166 544709 550988 556885 562563 554279 548692 547433 549635 550645
30945 550645 544756 544279 544014 547642 546659 548238 552795 565018 560537 560456 559825 544565 542084 544645 552170
30930 552170 551707 546774 543027 544140 549849 542447 543165 546771 548580 548857 545240 545057 547246 541132 530216
30915 530216 531081 542473 555244 557843 553717 551355 551289 557402 560758 564507 555646 556702 556405 567878
30901 567878 563882 556358 554375 551626 550166 549089 547068 540857 539361 550149 546861 547538 554164 552557
30887 552557 552894 554168 551994 540742 549113 552420 549161 549168 545633 543722 546853 548482 547799 548412 544659
30872 544659 536711 542399 551296 537789 539211 546614 542325 533780 534788 549652 552923 549780 547989 549963
30858 549963 553014 552774 552310 556113 554295 565524 556220 549328 553845 563538 565285 554600 553291 550693
30844 550693 553108 556052 558220 564430 565815 563959 548479 540460 542131 540039 535279 540635 532572 518659
30830 518659 520324 531991 545189 535801 532597 535519 537642 541354 550587 558307 550943 547904 549117 555203
30816 555203 555227 551207 546845 548324 562552 547353 534791 534444 537453 547847 547478 545773 551463 552934
30802 552934 549102 546923 556646 559064 549166 542733 548085 559867 572215 574854 574127 570011 566064 561676
30788 561676 568210 572511 575098 567446 563105 556631 541664 540059 546769 545790 541445 544550 543455 546388
30774 546388 552908 552534 557702 560317 554530 542633 544776 548786 549805 543162 538637 538069 542706 547464
30760 547464 542442 532140 538825 536002 545104 551942 549980 558802 564922 562687 558322 550867 558041 567324
30746 567324 568138 566049 557365 549204 549149 552398 541606 543791 543455 547221 550581 556630 569902 573228 565272
30731 565272 549960 546222 546652 549403 548744 548653 551681 550677 547464 555179 566165 568587 570647 562489 553689
30716 553689 554797 560799 562814 559554 557163 552122 551410 554916 549905 554191 555468 551446 541168 542935
30702 542935 549501 551957 551314 556258 554894 558113 557933 547593 546721 543090 541524 552196 559398 552919
30688 552919 544845 547918 541640 538905 541144 544431 551485 560440 565924 562695 554625 548399 545151 541205
30674 541205 544571 552600 568708 580565 566374 564427 564182 557723 552468 559318 568143 557495 556236
30661 556236 557968 555725 549774 545648 545258 547931 548542 557640 554915 551482 559687 558136 553725 552311 553005
30646 553005 556859 559529 553109 539760 540210 554695 554715 554563 556073 548794 544117 548061 555335 561056 558263
30631 558263 559671 558256 560130 550402 551507 552405 558802 563332 558018 553800 563345 565100 570523 560289
30617 560289 557871 557666 559370 553746 550866 556348 559839 558463 557498 564181 573230 573990 574645 577077 568444
30602 568444 565954 575898 578996 562675 562342 562558 559632 557209 552410 544298 542391 553250 556501 551895
30588 551895 548169 547030 547291 553061 561538 556117 553234 549243 549331 539804 542448 548619 551150 557206 561643
30573 561643 551913 548859 552622 553191 555091 552235 555666 557137 558634 556867 554438 559144 559516 566598 562945
30558 562945 554595 558638 568751 568659 566090 569983 568021 558034 558933 552672 554141 567018 571355 572778
30544 572778 575689 577884 563447 555243 559767 567010 570278 563693 556116 555983 559804 557397 562279 569841
30530 569841 560933 564973 565499 562595 558502 562601 559217 554300 547341 552236 562046 566562 573156 564596
30516 564596 556828 561586 557067 554828 560414 557999 555949 562497 561912 559066 545869 540754 548661 551399
30502 551399 558549 554925 556322 563571 565146 570944 570058 564010 566439 570676 566039 565967 558107 556361 559631
30487 559631 559355 565327 564521 562780 560384 559040 556885 568908 574309 569392 571172 575337 569966 558780
30473 558780 551003 552963 556814 559736 572039 570496 562702 554753 552534 556655 557899 557787 557334 550806
30459 550806 551032 550444 557615 561194 557793 562184 559809 559013 560229 555132 560530 567568 576511 570261 573421
30444 573421 576579 573086 572422 567641 573411 574493 578556 571685 560127 561029 556679 559807 560422 561965 564123
30429 564123 564185 559957 562829 558731 558501 563665 561285 553523 543529 541594 545402 546312 545172 544150 541495
30414 541495 551088 546684 549530 561228 567451 565733 566242 562026 553298 553809 568253 579292 580846 574852
30400 574852 567992 567685 563139 569562 565704 554666 546205 551222 554839 549474 556669 564227 562015 563652
30386 563652 560202 560609 561273 567877 573836 575309 568063 570846 572075 573915 574041 569142 566533 558932 561418
30371 561418 570393 563194 561957 558713 558440 555186 550073 545726 543223 550890 554035 550353 558539 561609
30357 561609 558971 564726 568579 561439 561699 563109 561206 567686 568830 556591 551812 555546 567253 573973
30343 573973 574948 578354 575718 572959 572505 567976 572575 576657 580159 577693 572378 565209 563229 559136 551487
30328 551487 548321 551461 557985 565974 575256 569137 567753 566474 559009 563242 572850 579906 587446 579458
30314 579458 564914 556883 569688 568223 566349 561329 551141 556805 557400 548217 548405 560107 567773 575182
30300 575182 571379 554922 551570 564470 571002 580288 581688 566167 566013 572604 574000 576612 574609 571762
30286 571762 566377 568742 572821 570653 563203 564575 567897 558599 555339 564248 566130 570772 574250 571283
30272 571283 572785 565697 565241 567222 571959 570205 572551 568950 567929 569043 567579 565545 562176 571962
30258 571962 574527 574056 570100 571096 571965 569035 576906 583677 574524 573043 574714 576344 578883 578544 570198
30243 570198 567260 564916 570138 570794 564468 551805 550758 561479 563141 565177 568814 566974 569684 571133
30229 571133 557642 552756 556826 563440 568449 556503 552867 562229 564268 568938 564102 563766 558391 564200
30215 564200 569041 579915 578513 571564 567017 562668 558227 557594 559319 567107 559124 561176 566134 571645
30201 571645 569947 570323 583913 588478 574946 569211 570909 566249 573052 586617 586075 575934 582044 584113
30187 584113 585488 575923 566847 568591 566419 564273 580646 589256 593715 590793 574395 563109 561735
30174 561735 566002 563479 563684 567178 570032 562562 557514 560396 557405 569925 574918 568317 568944 579673
30160 579673 578799 577881 574345 575003 579711 572060 573699 573804 582438 588496 585445 589856 589778 585976 583498 581155
30144 581155 574147 579668 577170 570134 574931 580798 577238 583023 594158 596230 589711 577817 565878
30131 565878 556853 561947 563134 568313 573721 565855 565498 566386 557361 558278 564561 573728 565580 564630 572910
30116 572910 578215 566205 552333 550700 557276 567762 569345 576833 580123 575238 570344 578574 581348
30103 581348 589227 592356 595710 599508 599450 591693 590390 586871 585818 582631 584819 585845 589733 588393 585795
30088 585795 584713 582812 580187 571435 566717 561841 564642 570289 577106 578342 570000 566261 560807 564333
30074 564333 570194 575159 576781 573984 559246 560290 554596 558024 562348 566420 569221 573216 573714 576951
30060 576951 580383 573451 575665 579424 569309 562711 569775 584367 577726 580021 581838 580502 579616 569463
30046 569463 563111 567616 581050 586965 580083 577753 580525 580351 578184 580512 584630 587997 575655 559775
30032 559775 562494 567149 569381 562086 561205 558415 559703 558385 567014 571517 574401 576647 578753 572455
30018 572455 572123 572325 579400 570804 562315 557396 561627 560250 560043 564751 574265 575920 575981 570698 574321
30003 574321 578709 577386 582983 595768 590136 580587 566530 564086 573356 580625 586489 584756 582115 573177
29989 573177 575627 577755 577525 572818 570930 579188 586258 578699 563824 553147 558154 568442 573739 569774
29975 569774 566261 565532 567572 573285 574344 574866 569817 559214 561915 564151 565367 562038 571521 579546
29961 579546 582134 581835 584501 593868 589912 581502 580707 582991 582834 584218 577917 574284 576376 573733 569401
29946 569401 581971 594089 604056 592680 585495 575871 564349 558863 558617 561396 569387 562693 551320
29933 551320 554833 561159 572166 563896 553728 554641 560413 572761 567261 559810 565921 563272 573881
29920 573881 572720 572837 575219 569467 573002 576033 580772 575391 575998 580984 577566 577775 575170 578833 588110
29905 588110 588926 582257 572280 571488 578019 584845 570896 566528 572224 585606 580074 581010 587574 581560
29891 581560 583797 578321 571394 570191 578381 582720 574620 574220 579911 581215 580578 581014 579365 586701 591562
29876 591562 593829 584130 580655 584863 582176 579924 577929 575080 574499 573355 566774 567735 574067 580322 586746
29861 586746 588765 586541 584269 573814 570670 578479 586098 584823 588945 587546 577845 579159 589191 593151
29847 593151 592734 591067 584577 583608 584724 585872 588809 589705 583896 582043 574064 573186 574017 576997 572153
29832 572153 566523 574249 588661 588696 580809 579330 578895 584642 584289 583996 586119 583877 589103 595155 596639
29817 596639 586134 576111 578784 591140 590883 584360 578060 579851 584039 587293 595141 595141 598769 598153 579533
29802 579533 568480 566879 570094 568218 564247 569606 574525 572469 569977 575009 576280 583647 574469 565759
29788 565759 561686 566085 570675 577464 571700 568050 574579 582523 581642 578214 578038 578599 578671 572264 562266
29773 562266 570439 573723 579898 590159 585936 581051 583820 586418 583668 587285 583794 568000 567902 573190
29759 573190 571858 568679 574598 579276 575962 575680 583153 583092 580384 579844 567866 570995 575492 569187 563840
29744 563840 566073 574554 572465 572587 582501 581913 589467 592540 581926 570403 569855 570494 570862 581635 581090
29729 581090 582928 577110 571070 577929 589944 587016 581118 579521 576135 573239 575935 581800 579580 574013
29715 574013 575876 583457 584075 584246 582822 577642 585150 597121 598681 597014 590053 585290 576868 568018
29701 568018 582688 586766 579493 574803 581156 585286 577311 570706 565285 575557 584523 589528 596963 601195
29687 601195 600291 591180 586097 580227 566103 566515 575782 577048 573449 578665 573171 574202 575870 583690
29673 583690 592493 584265 566078 577250 587560 577729 576606 581245 587841 587792 581817 575186 580720 581167
29659 581167 579726 572751 570993 573881 575984 575721 582154 589229 597483 593418 591239 597196 594163 593343 591489
29644 591489 594414 600780 589915 579955 588036 598231 602765 596284 582265 578316 581127 584933 585493 579880
29630 579880 577746 578906 583575 577167 573491 575242 577666 578697 575006 565010 571854 575468 584779 590627
29616 590627 593966 598941 593760 590752 590437 587951 583912 581070 586623 585514 590357 594187 594333 591470 590027
29601 590027 589511 588374 587356 593529 599151 590663 579137 588637 597450 596300 597223 596449 598026 605514 593560
29586 593560 584132 575857 571373 571132 573185 581546 578123 571846 577463 573113 572375 578549 584718 575561 576267
29571 576267 581063 585545 580742 583595 598741 599675 578961 583511 590121 596765 599290 602110 600906 601041
29557 601041 596333 584081 583683 584969 576107 576121 576587 581860 589184 592166 588042 580684 576382 581082 581160
29542 581160 579144 588054 588054 591591 593265 586874 580842 575607 569247 573360 582715 583913 586696 598143 594001
$$ [...]
##END NTUPLES=NMR SPECTRUM
##END=
