##TITLE=Analysis number 326551
Compound Code cc 31201
Project Code adrs
Chemist Name ugmt
##JCAMPDX= 6.0         $$ Bruker NMR JCAMP-DX V2.0
##DATA TYPE= NMR SPECTRUM
##DATA CLASS= NTUPLES
##ORIGIN= Bruker BioSpin GmbH
##OWNER= nmr
$$ XWIN-NMR		Version 3.5
$$ Tue Feb 13 09:08:14 2007 GMT Standard Time (UT+0h)  MAYBRIDGE\nmr@NMR_250MHZ
##.OBSERVE FREQUENCY= 250.131544655141
##.OBSERVE NUCLEUS= ^1H
##.ACQUISITION MODE= SIMULTANEOUS (DQD)
##.ACQUISITION SCHEME= undefined
##.AVERAGES= 16
##.DIGITISER RES= 18
##SPECTROMETER/DATA SYSTEM= dpx250
##.PULSE SEQUENCE= zg30
##.SOLVENT NAME= DMSO
##.SHIFT REFERENCE= (INTERNAL, DMSO, 0, 16.522)
##AUDIT TRAIL= $$ (NUMBER, WHEN, WHO, WHERE, WHAT)
$$ ##TITLE= Audit trail, XWIN-NMR		Version 3.5
$$ ##JCAMPDX= 5.01
$$ ##ORIGIN= Bruker BioSpin GmbH
$$ ##OWNER= nmr
$$ C:\u/data/dgb/nmr/ADRS/720/pdata/1/auditp.txt
$$ ##AUDIT TRAIL=  $$ (NUMBER, WHEN, WHO, WHERE, WHAT)
(   1,<2007-02-13 09:07:50.59 +000>,<MAYBRIDGE\nmr>,<NMR_250MHZ>,
      <created by zg, POWCHK disabled, PULCHK disabled
       configuration hash MD5:
       49 4B E0 1D 92 C2 6B 37 9F E6 65 BC 52 41 86 1D
       data hash MD5: 64K
       69 3F C3 84 AD 00 0F 6F C6 80 06 4A 50 2E 20 8E>)
(   2,<2007-02-13 09:08:04.93 +000>,<MAYBRIDGE\nmr>,<NMR_250MHZ>,
      <Start of raw data processing
       ef LB = 0.3 FT_mod = 6 PKNL = 1 SI = 32K 
       data hash MD5: 32K
       BF AE F2 0D F4 B3 F0 95 AF C5 CF 1C D0 6D 40 E7>)
(   3,<2007-02-13 09:08:06.53 +000>,<MAYBRIDGE\nmr>,<NMR_250MHZ>,
      <apk 
       data hash MD5: 32K
       92 AE CE B9 F1 78 19 12 D4 D0 57 D1 8C 91 29 8C>)
(   4,<2007-02-13 09:08:07.26 +000>,<MAYBRIDGE\nmr>,<NMR_250MHZ>,
      <abs ABSG = 5 
       data hash MD5: 32K
       80 0F 72 8C F9 C4 31 03 B7 B3 6D 6B E7 6E 59 BE>)
$$ ##END=
$$ 
$$ hash MD5
$$ 06 79 DF 37 1E 26 9D FC D6 79 2A F0 5E 1B B5 EB
##$RELAX= 
##$RELAX= 
##$RELAX= 
##$RELAX= 
##$RELAX= 
##$RELAX= 
##$RELAX= 
$$ Bruker specific parameters
$$ --------------------------
##$DU= <C:\u>
##$EXPNO= 720
##$NAME= <ADRS>
##$PROCNO= 1
##$TYPE= <nmr>
##$USER= <dgb>
##$AMP= (0..31)
100 100 100 100 100 100 100 100 100 100 100 100 100 100 100 100 100 100 
100 100 100 100 100 100 100 100 100 100 100 100 100 100 
##$AQSEQ= 0
##$AQ_mod= 3
##$AUNM= <au_zg>
##$AUTOPOS= <35 >
##$BF1= 250.13
##$BF2= 250.13
##$BF3= 250.13
##$BF4= 250.13
##$BF5= 500.13
##$BF6= 500.13
##$BF7= 500.13
##$BF8= 500.13
##$BYTORDA= 1
##$CFDGTYP= 0
##$CFRGTYP= 5
##$CHEMSTR= <none>
##$CNST= (0..31)
1 1 145 1 1 1 1 1 1 1 1 1 1 1 1 1 1 1 1 1 1 1 1 1 1 1 1 1 1 1 1 1 
##$CPDPRG= <>
##$CPDPRG1= <>
##$CPDPRG2= <>
##$CPDPRG3= <>
##$CPDPRG4= <mlev>
##$CPDPRG5= <mlev>
##$CPDPRG6= <mlev>
##$CPDPRG7= <mlev>
##$CPDPRG8= <mlev>
##$CPDPRGB= <>
##$CPDPRGT= <>
##$D= (0..31)
0 1 0 0 0 0 0 0 0 0.06 0 0 0 0 0 0 0.0002 0 0 0 0 0 0 0 0 0 0 0 0 0 0 
0 
##$DATE= 1171357669
##$DBL= (0..7)
120 120 120 120 120 120 120 120 
##$DBP= (0..7)
150 150 150 150 150 150 150 150 
##$DBP07= 0
##$DBPNAM0= <>
##$DBPNAM1= <>
##$DBPNAM2= <>
##$DBPNAM3= <>
$$ [...]
##$SUBNAM7= <"">
##$SUBNAM8= <"">
##$SUBNAM9= <"">
##$SW= 20.6930455092707
##$SWIBOX= (0..15)
0 0 3 0 0 0 0 0 0 0 0 0 0 0 0 0 
##$SW_h= 5175.983436853
##$TD= 65536
##$TD0= 1
##$TE= 295.16
##$TE2= 300
##$TE3= 300
##$TEG= 300
##$TL= (0..7)
0 120 120 120 120 120 120 120 
##$TP= (0..7)
150 150 150 150 150 150 150 150 
##$TP07= 0
##$TPNAME0= <>
##$TPNAME1= <>
##$TPNAME2= <>
##$TPNAME3= <>
##$TPNAME4= <>
##$TPNAME5= <>
##$TPNAME6= <>
##$TPNAME7= <>
##$TPOAL= (0..7)
0.5 0.5 0.5 0.5 0.5 0.5 0.5 0.5 
##$TPOFFS= (0..7)
0 0 0 0 0 0 0 0 
##$TUNHIN= 0
##$TUNHOUT= 0
##$TUNXOUT= 0
##$USERA1= <user>
##$USERA2= <user>
##$USERA3= <user>
##$USERA4= <user>
##$USERA5= <user>
##$V9= 5
##$VALIST= <valist>
##$VCLIST= <CCCCCCCCCCCCCCC>
##$VD= 0
##$VDLIST= <DDDDDDDDDDDDDDD>
##$VPLIST= <PPPPPPPPPPPPPPP>
##$VTLIST= <TTTTTTTTTTTTTTT>
##$WBST= 1024
##$WBSW= 4
##$XGAIN= (0..3)
0 0 0 0 
##$XL= 0
##$YL= 0
##$YMAX_a= 230695
##$YMIN_a= -208775
##$ZGOPTNS= <>
##$ZL1= 120
##$ZL2= 120
##$ZL3= 120
##$ZL4= 120
##$ABSF1= 16.522
##$ABSF2= -4.171173
##$ABSG= 5
##$ABSL= 3
##$ALPHA= 0
##$AQORDER= 0
##$ASSFAC= 0
##$ASSFACI= 0
##$ASSFACX= 0
##$ASSWID= 0
##$AUNMP= <proc_1d>
##$AZFE= 0.1
##$AZFW= 0.1
##$BCFW= 0
##$BC_mod= 0
##$BYTORDP= 0
##$COROFFS= 0
##$CY= 12.5
##$DATMOD= 1
##$DC= 0
##$DFILT= <>
##$DTYPP= 0
##$F1P= 14.0000005364418
##$F2P= -0.99999901652339
##$FCOR= 0.5
##$FTSIZE= 32768
##$FT_mod= 6
##$GAMMA= 0
##$GB= 0
##$INTBC= 1
##$INTSCL= 1
##$ISEN= 128
##$LB= 0.3
##$LEV0= 0
##$LPBIN= 0
##$MAXI= 10000
##$MC2= 0
##$MEAN= 0
##$ME_mod= 0
##$MI= 0
##$NCOEF= 0
##$NC_proc= -5
##$NLEV= 6
##$NOISF1= 0
##$NOISF2= 0
##$NSP= 0
##$NTH_PI= 0
##$NZP= 0
##$OFFSET= 16.522
##$PC= 1
##$PHC0= 218.7993
##$PHC1= 12.17002
##$PH_mod= 1
##$PKNL= yes
##$PPARMOD= 0
##$PSCAL= 4
##$PSIGN= 0
##$REVERSE= no
##$SF= 250.13
##$SI= 32768
##$SIGF1= 0
##$SIGF2= 0
##$SINO= 400
##$SIOLD= 32768
##$SREGLST= <1H.DMSO>
##$SSB= 0
##$STSI= 32768
##$STSR= 0
##$SW_p= 5175.98343685301
##$SYMM= 0
##$S_DEV= 0
##$TDeff= 65536
##$TDoff= 0
##$TI= <Analysis number 999999
Compound Code 99
Book Reference 9
Project Code 9>
##$TILT= no
##$TM1= 0
##$TM2= 0
##$TOPLEV= 0
##$USERP1= <user>
##$USERP2= <user>
##$USERP3= <user>
##$USERP4= <user>
##$USERP5= <user>
##$WDW= 1
##$XDIM= 32768
##$YMAX_p= 420919434
##$YMIN_p= -1403882
$$ End of Bruker specific parameters
$$ ---------------------------------
##NTUPLES= NMR SPECTRUM
##VAR_NAME=  FREQUENCY,     SPECTRUM/REAL,   SPECTRUM/IMAG
##SYMBOL=    X,             R,               I
##VAR_TYPE=  INDEPENDENT,   DEPENDENT,       DEPENDENT
##VAR_FORM=  AFFN,          ASDF,            ASDF
##VAR_DIM=   32768,         32768,           32768
##UNITS=     HZ,            ARBITRARY UNITS, ARBITRARY UNITS
##FACTOR=    0.157963299565203, 1,           1
##FIRST=     4132.6476996994, 0,             0
##LAST=      -1043.33573715361, 0,           0
##MIN=       -1043.33573715361, -1403882,    0
##MAX=       4132.6476996994, 420919434,     0
$$ Real data points
##PAGE= N=1
##DATA TABLE= (X++(R..R)), XYDATA
$$ [...]
$$ plain form
15785 -218351 -242125 -232917 -245007 -197883 -118349 -79590 -176455 -274013 -334188 -394655 -472786 -247020
15773 -247020 -78087 33132 -97795 -38612 139462 3896 -90530 -44190 -5433 -106800
15763 -106800 -20366 167947 112140 89585 25919 -83424 -59705 19460 -22134 -46354 -14900
15752 -14900 -72717 -135552 -64715 198 -36248 -54387 1727 12800 -21390 -243589 -353115
15741 -353115 -379924 -308949 -320769 -256615 -292612 -332721 -242374 -235862 -187833 -206856 -236477 -109878
15729 -109878 60343 12106 -59549 22966 -59040 29038 109077 -86153 -190419 -259947 -267079
15718 -267079 -76644 -39689 -11572 -39216 109315 207660 253443 103802 -66823 -145422 -203613
15707 -203613 -192557 -215397 -221480 -138398 -85393 -116466 -102805 142560 164338 249836 258813 192779
$$ packed form
15785b18351k3774R208j2090M7124P9534L8759r6865r7558o0175o0467p8131K25766
15773b47020J68933J11219j30927N9183J78074j35566r4426M6340L8757j01367
15763a06800Q6434J88313n5807k2555o3666j09343K3719P9165m1594k4220L1454
15752a4900n7817o2835P0837O4913l6446j8139N6114J1073l4190k22199j09526
15741c53115k6809P0975j1820O4154l5997m0109R0347O512M8029j9023k9621J26599
15729a09878J70221m8237p1655Q2515q2006Q8078Q0039j95230j04266o9528p132
15718b67079J90435L6955K8117k7644J48531R8345M5783j49641j70625p8599n8191
15707b03613J1056k2840o083Q3082N3005l1073J3661K45365K1778Q5498Q977o6034
$$ plain form
15695 192779 -7979 -132551 -221772 -202083 -55302 116233 251654 133086 54364 146549
15685 146549 69028 -13199 47172 36289 132745 47881 47703 32471 -19295 -118696 -265298 -102783
15673 -102783 -102670 -167859 -48448 -61259 -174931 -261434 -314207 -321704 -196891 -202113 -75177
15662 -75177 -105691 -65198 -180539 -182200 -188352 -227124 -284232 -189446 -264857 -349170 -357452 -228727
15650 -228727 -109022 1005 17846 -96501 -50643 -175082 -180043 -105437 -170165 -157695 -272202
15639 -272202 -327297 -238103 -145095 -89327 20305 -34152 -153294 -169455 -7460 -151623 -39894
15628 -39894 58833 -45379 -175429 -170846 -133643 -15748 -29287 -101926 -33437 49932 -56943
15617 -56943 -2056 188125 156319 115959 -26186 33711 29394 -224042 -295850 -301803 -276348
$$ packed form
15695A92779k00758j24572q9221J9689J46781J71535J35421j18568p8722R2185
15685A46549p7521q2227O0371j0883R6456q4864j78j5232n1766r9401j46602J62515
15673a02783J13o5189J19411j2811j13672q6503n2773p497J24813n222J26936
15662g5177l0514M0493j15341j661o152l8772n7108R4786p5411q4313q282J28725
15650b28727J19705J10027J6841j14347M5858j24439m961P4606o4728J2470j14507
15639b72202n5095Q9194R3008N5768J09632n4457j19142j6161J61995j44163J11729
15628c9894R8727j04212j30050M583L7203J17895j3539p2639O8489Q3369j06875
15617e6943N4887J90181l1806m0360j42145N9897m317k53436p1808n953K5455
$$ plain form
15606 -276348 -322081 -280994 -196442 -71131 32109 -32959 -368955 -473999 -262661 -107924
15596 -107924 -48025 8989 10387 -1589 -86377 -253095 -185189 -121700 -295854 -243318 -164104
15585 -164104 -151985 -319866 -359085 -436309 -309900 -292447 -265949 -177166 -152273 -197424 -132470
15574 -132470 -251990 -340114 -321658 -332782 -386515 -365954 -310103 -160482 -56649 -1684 76079
15563 76079 31967 -50286 -80430 54621 -63071 -31388 122903 114112 100823 21348 -75689
15552 -75689 -103806 7119 87004 10462 5442 -22272 -36063 -87107 -78250 -50122 -103968 -124434
15540 -124434 -193279 -131096 57359 194856 68585 -18311 9994 -57887 -205350 -324774
15530 -324774 -393061 -295858 -75983 -150692 -232426 -129928 -183466 -63367 -9672 -124396 -279794
$$ packed form
15606b76348m5733M1087Q4552J25311J03240o5068l35996j05044K11338J54737
15596a07924N9899N7014J398j1976q4788j66718O7906O3489j74154N2536P9214
15585a64104J2119j67881l9219p7224J26409J7453K6498Q8783K4893m5151O4954
15574a32470j19520q8124J8456j1124n3733K0561N5851J49621J03833N4965P7763
15563G6079m4112q2253l0144J35051j17692L1683J54291q791j3289p9475r7037
15552g5689k8117J10925P9885p6542n020k7714j3791n1044Q857K8128n3846k0466
15540a24434o8845O2183J88455J37497j26271q6896K8305o7881j47463j19424
15530c24774o8287R7203K19875p4709q1734J02498n3538J20099N3695j14724j55398
$$ plain form
15519 -279794 -322827 -202769 -89988 -130532 -75181 -259770 -205471 -119374 -177704 -164033 -114194
15508 -114194 -39144 -58305 -203829 -183035 -129930 -315411 -359972 -206328 -92551 41776
15498 41776 155976 163703 102762 65735 15989 -35045 25989 137909 69335 1605 -93578
15487 -93578 -42602 -43766 -155977 -83852 -58202 -100561 -94529 -143531 -89441 -100168 23892 9024
15475 9024 -142431 -162440 -28159 25496 -14367 -136963 -216978 -236557 -244117 -446634 -530337
15464 -530337 -341868 -212175 -143837 -136662 -249762 -288404 -312893 -310137 -385546 -239713 -105245
15453 -105245 -75934 13416 70347 78302 22055 89517 191166 263228 238706 129003 41176
15442 41176 4535 -66519 -136556 -189447 -16021 142000 124789 126175 -42214 48957 -15431
$$ packed form
15519b79794m3033J20058J12781m0544N5351j84589N4299Q6097n8330J3671M9839
15508a14194P5050j9161j45524K0794N3105j85481m4561J53644J13777J34327
15498D1776J14200P727o0941l7027m9746n1034O1034J11920o8574o7730r5183
15487i3578N0976j164j12211P2125K5650m2359O032m9002N4090j0727J24060j4868
15475I024j51455k0009J34281N3655l9863j22596q0015j9579p560k02517q3703
15464e30337J88469J29693O8338P175j13100l8642k4489K756p5409J45833J34468
15453a05245K9311Q9350N6931P955n6247O7462J01649P2062k4522j09703q7827
15442D1176l6641p1054p0037n2891J73426J58021j7211J386j68389R1171o4388
$$ plain form
15431 -15431 -124469 -83175 -213600 -267695 -154840 -253762 -253212 -167942 -212562 -188433 -51099
15420 -51099 143875 180705 139353 -7492 -53289 -23580 -30714 -60599 -66653 -108750 -190376 -161755
15408 -161755 -229612 -323964 -278843 -84519 134017 227352 177256 166637 104323 -60601 -111300
15397 -111300 -881 -203628 -369387 -386951 -342044 -290462 -55398 17942 34604 -68688
15387 -68688 -195739 -104315 44960 7215 -118880 -262137 -207116 -166159 -290062 -322611 -424950
15376 -424950 -440975 -475847 -414071 -391983 -408041 -538906 -446646 -170151 -68721 -183483 -95605
15365 -95605 9688 85345 98829 29447 -43461 -177149 -74638 18755 -28597 -73112 -118466
15354 -118466 -62950 -65826 -93429 -61814 -223303 -280414 -242438 -7864 100401 -42467 -115107
$$ packed form
15431a5431j09038M1294j30425n4095J12855r8922N50Q5270m4620K4129J37334
15420e1099J94974L6830m1352j46845m5797K9709p134k9885o054m2097q1626K8621
15408a61755o7857r4352M5121J94324K18536R3335n0096j0619o2314j64924n0699
15397a11300J10419k02747j65759j7564M4907N1582K35064P3340J6662j03292
15387f8688j27051R1424J49275l7745j26095j43257N5021M0957j23903l2549j02339
15376d24950j6025l4872O1776K2088j6058j30865R2260K76495J01430j14762Q7878
15365i5605J05293P5657J3484o9382p2908j33688J02511R3393m7352m4515m5354
15354a18466N5516k876k7603L1615j61489n7111L7976K34574J08265j42868p2640
$$ plain form
15343 -115107 -126371 -85048 -268694 -265838 -403718 -527217 -533004 -346663 -206388 -125683 78625
15332 78625 52048 3849 9512 34469 62010 56744 -7045 -67238 -200162 -45900 -103556 -277722
15320 -277722 -390782 -327598 -87670 62754 162231 58870 64410 115295 114558 -20404 -285204
15309 -285204 -389673 -236830 -130822 6583 152974 179773 -3062 -162731 -109687 -194485
15299 -194485 -130071 -135305 -92931 -103059 -306455 -164395 -51485 -66509 -83864 15775 -2105
15288 -2105 86956 45032 63986 67037 -65031 -145566 -75908 153118 9892 -226138 -216740
15277 -216740 -215147 -268406 -379927 -252707 -179744 -92011 -46190 101843 150485 105672 -79946
15266 -79946 -150316 -110014 179441 442368 477014 426198 422217 350299 346350 357388 254095
$$ packed form
15343a15107j1264M1323j83646K856j37880j23499n787J86341J40275Q0705K04308
15332G8625k6577m8199N663K4957K7541n266o3789o0193j32924J54262n7656j74166
15320b77722j13060O3184K39928J50424R9477j03361N540N0885p37j34962k64800
15309b85204j04469J52843J06008J37405J46391K6799j82835j59669N3044q4798
15299a94485O4414n234M2374j0128k03396J42060J12910j5024j7355R9639j7880
15288b105Q9061m1924J8954L051j32068q0535O9658K29026j43226k36030R398
15277b16740J593n3259j11521J27220P2963Q7733M5821J48033M8642m4813j85618
15266g9946p0370M0302K89455K62927L4646n0816l981p1918l949J1038j03293
$$ plain form
15255 254095 237141 238703 281525 310249 313352 291297 195025 61354 -57206 -79600 -58199
15244 -58199 -98816 -150775 -211221 -308479 -317087 -220157 -253972 -356894 -310706 -50193 266619
15233 266619 117351 16047 61746 27195 -97323 -222807 -251418 -11130 1027 -56208
15223 -56208 46252 -59647 -72982 -17732 125511 187110 223923 170332 42054 -160338 -290439
15212 -290439 -276698 -227360 -178006 -139868 -154837 -41379 -14254 -101132 -289241 -224434 -115473
15201 -115473 8198 -116537 -237517 -152224 -123032 -120217 -128296 -131768 -18523 21426 -56978
15190 -56978 -131350 -77815 -1629 -15405 26047 128834 117688 127406 89612 1430 -159303
15179 -159303 -269066 -276860 -143531 2049 116793 313742 192528 22955 75139 49596
$$ packed form
15255B54095j6954J562M2822K8724L103k2055r6272j33671j18560k2394K1401
15244e8199m0617n1959o0446r7258q608R6930l3815j02922M6188K60513L16812
15233B66619j49268j01304M5699l4551j24518j25484k8611K40288J2157n7235
15223e6208J02460j05899j3335N5250J43243O1599L6813n3591j28278k02392j30101
15212b90439J3741M9338M9354L8138j4969J13458K7125q6878j88109O4807J08961
15201a15473J23671j24735j20980Q5293K9192K815q079l472J13245L9949p8404
15190e6978p4372N3535P6186j3776M1452J02787j1146R718l7794q8182j60733
15179a59303j09763p794J33329J45580J14744J96949j21214j69573N2184k5543
$$ plain form
15169 49596 60636 14913 -61692 17824 -8398 -30509 51480 48418 -16947 83272 57077 101971
15157 101971 141819 111224 161250 215666 214095 228293 101267 21061 -58626 -271233 -195975
15146 -195975 -235183 -267090 -298931 -360169 -311844 -292858 -199370 -109181 -152273 -185365 -458167
15135 -458167 -493220 -388813 -335812 -221185 -118892 -69908 -76879 -145968 -109228 -151210 -198786
15124 -198786 -138641 118318 118020 117520 102167 170982 323453 391460 229170 104766 9000
15113 9000 20 -56469 -151552 -163605 -207598 -134581 53344 123590 107619 93440 -17333 78583
15101 78583 142370 31668 -100539 -44047 -14933 150052 173466 96311 74001 16749 -63706
15090 -63706 -214436 -130289 -14330 -100527 -90596 2857 29923 39357 93017 64982 -89286
$$ packed form
15169D9596J1040m5723p6605P9516k6222k2111Q1989l062o5365J00219k6195M4894
15157A01971L9848l0595N0026N4416j571J4198j27026q0206p9687k12607P5258
15146a95975l9208l1907l1841o1238M8325J8986R3488R0189m3092l3092k72802
15135d58167l5053J04407N3001J14627J02293M8984o971o9089L6740m1982m7576
15124a98786O0145K56959k98n00j5353O8815J52471O8007j62290j24404r5766
15113I000q980n6489r5083j2053m3993P3017J87925P0246j5971j4179j10773R5916
15101G8583O3787j10702j32207N6492K9114J64985K3414p7155k2310n7252q0455
15090f3706j50730Q4147J15959q6197R931R3453K7066R434N3660k8035j54268
$$ plain form
15079 -89286 -306967 -206282 -87059 -123274 -134109 -78839 -152341 -83299 -57007 -130966 44335
15068 44335 208759 230823 225731 198976 68726 -5436 -153696 -179223 -218552 -128303 -61248
15057 -61248 22852 178582 182611 74652 30243 -13722 44029 102989 -25238 1649 3593
15046 3593 -103658 -65961 128561 215651 272273 45489 -113295 -108046 30721 158207 32078
15035 32078 -73025 -95719 -249987 -323223 -219556 -257455 -197766 -164874 -163739 -204452 -234872
15024 -234872 -351198 -290916 -285589 -172982 -25087 -45640 -157612 -266407 -118590 -28710
15014 -28710 90937 -2134 -128567 -86209 45334 194914 245284 207823 201953 153631 52240
15003 52240 5266 -75414 -21731 -67032 -105313 -125781 -125267 40473 179472 114011 160320 208271
$$ packed form
15079h9286k17681J00685J19223l6215j0835N5270p3502O9042K6292p3959J75301
15068D4335J64424K2064n092k6755j30250p4162j48260k5527l9329R0249O7055
15057f1248Q4100J55730M029j07959m4409m3965N7751N8960j28227K6887J944
15046C593j07251L7697J94522Q7090N6622k26784j58784N249J38767J27486j26129
15035C2078j05103k2694j54268p3236J03667l7899N9689L2892J135m0713l0420
15024b34872j16326O0282N327J12607J47895k0553j11972j08795J47817Q9880
15014b8710J19647r3071j26433M2358J31543J49580N0370l7461n870m8322j01391
15003E2240m6974q0680N3683m5301l8281k0468N14J65740J38999o5461M6309M7951
$$ plain form
14991 208271 130344 141719 -37088 -40904 37214 -141935 -307697 -296176 -164510 -206410 -288649
14980 -288649 -318058 -367776 -385770 -258013 -137447 15314 183058 196518 8855 -218494
14970 -218494 -171994 -88840 -60754 -93461 -104923 -108571 -91923 17415 21452 125282 -40574
14959 -40574 -143080 -2416 57294 228833 238293 138064 83783 163510 2349 -114292 -67432
14948 -67432 -128643 -52603 61428 79362 -42690 -17346 -6043 186586 6188 -157816 -63006
14937 -63006 15293 -48375 128627 3395 -188428 -108065 -116126 -250657 -202132 -208902 -284779
14926 -284779 -188658 -98575 -176335 -136250 -124490 -49676 86013 98620 135323 210355 129287
14915 129287 36817 -10864 -214453 -226692 -61382 45849 -7511 30828 -24232 -133363 -195945
$$ packed form
14991B08271p7927J1375j78807l816P8118j79149j65762J1521J31666m1900q2239
14980b88649k9409m9718j7994J27757J20566J52761J67744J3460j87663k27349
14970b18494M6500Q3154K8086l2707j1462l648J6648J09338M037J03830j65856
14959d0574j02506J40664N9710J71539R460j00229n4281P9727j61161j16641M6860
14948f7432o1211P6040J14031J7934j22052K5344J1303J92629j80398j64004R4810
14937f3006P8299o3668J77002j25232j91823Q0363q061j34531M8525o770p5877
14926b84779R6121R0083p7760M0085J1760P4814J35689J2607L6703P5032q1068
14915A29287r2470m7681k03589j2239J65310J07231n3360L8339n5060j09131o2582
$$ plain form
14904 -195945 -239149 -106427 -17927 -54758 -48645 64207 97561 89828 157961 114169 -117036
14893 -117036 -212922 -267271 -147179 34061 -48878 -75008 98278 30506 46804 19331 72890
14882 72890 112513 102841 45835 24474 -11161 -104886 -126456 81839 -56766 -114920 -133954
14871 -133954 -210247 -262086 -102461 -48800 -216449 -377511 -215572 -115647 -11158 194326
14861 194326 236443 273283 248153 135785 90187 -87373 -258397 -334699 -388690 -192918 82586
14850 82586 103074 27291 -51088 -145959 -35321 35057 -161981 -228405 -279289 -279431 -329144 -195208
14838 -195208 -149636 -233641 -105038 14592 -54741 -84918 -147842 -113969 -10848 -3345 -65900
14827 -65900 -152929 -198713 -240052 -106831 76285 -13464 -186414 -235600 -319596 -235762 -142643
$$ packed form
14904a95945m3204J32722Q8500l6831O113J12852L3354p733O8133m3792k31205
14893a17036r5886n4349J20092J81240q2939k6130J73286o7772J6298k7473N3559
14882G2890L9623r672n7006k1361l5635r3725k1570K08295j38605n8154j9034
14871a33954p6293n1839J59625N3661j67649j61062J61939R9925J04489K05484
14861A94326M2117L6840k5130j12368m5598j77560j71024p6302n3991J95772K75504
14850H2586K0488p5783p8379r4871J10638P0378j97038o6424n0884j42m9713J33936
14838a95208M5572q4005J28603J19630o9333l0177o2924L3873J03121P503o2555
14827f5900q7029m5784m1339J33221J83116q9749j72950m9186q3996Q3834R3119
$$ plain form
14816 -142643 26591 46404 -26827 -199406 -263573 -148661 -195119 -84988 -156658 -271568
14806 -271568 -393599 -255871 -56974 186656 219282 107193 70348 61720 72655 -32452
14796 -32452 -86975 7882 94267 152517 132030 74259 -88328 -249424 -286984 -418447 -406606
14785 -406606 -316238 -141338 -43643 48867 211 -88370 -79032 -45134 -44720 -201775 -246344 -91288
14773 -91288 -71742 -143697 -139814 -101487 -151502 -235578 -333752 -216705 -90112 -234355 -128877
14762 -128877 -16394 -75787 31569 187821 144744 -33666 64035 145245 90070 94750 174951
14751 174951 234798 177350 -121106 -125591 -144462 -163000 -94081 -318154 -354913 -142924 -26741
14740 -26741 24069 -121186 -175211 -49864 -22110 -50660 -55851 -34375 12007 -47235 -89562
$$ packed form
14816a42643J69234J9813p3231j72579o4167J14912m6458J10131p1670j14910
14806b71568j22031J37728J98897K43630L2626j12089l6845q628J0935j05107
14796c2452n4523R4857Q6385N8250k0487n7771j62587j61096l7560j31463J1841
14785d06606R0368J74900R7695R2510m8656q8581R338L3898M14j57055m4569J55056
14773i1288J9546p1955L883L8327n0015q4076r8174J17047J26593j44243J05478
14762a28877J12483n9393J07356J56252m3077j78410R7701Q1210n5175M680Q0201
14751A74951N9847n7448k98456m485j8871j8538O8919k24073l6759K11989J16183
14740b6741N0810j45255n4025J25347K7754k8550n191K1476M6382n9242m2327
$$ plain form
14729 -89562 -38038 44452 247428 111283 19564 -87985 -375 55961 -112822 19589 75446
14718 75446 -25107 -129436 -334988 -432905 -372541 -349746 -270896 -176660 -195453 -238485 -20051
14707 -20051 101383 163528 34196 -229584 -316086 -301328 -270061 17558 -32740 -77757 -117723
14696 -117723 -113082 -170876 -132809 -244161 -350700 -178695 59885 -14998 -14392 -46637 2777
14685 2777 14621 25495 105098 94943 125324 11336 -78432 -7120 -92452 -186831 -163608 -192103
14673 -192103 -162597 -92889 -25495 28566 85843 167110 334482 281003 288546 174164 34658
14662 34658 71484 36596 -95692 -45756 9782 -97020 -275789 -267689 -56360 8713 -60923
14651 -60923 -165010 -215038 -193899 -98509 12246 23305 24518 -106799 -62643 112244 164216
$$ packed form
14729h9562N1524Q2490K02976j36145r1719j07549Q7610N6336j68783J32411N5857
14718G5446j00553j04329k05552r7917O0364K2795P8850R4236j8793m3032K18434
14707b0051J21434O2145j29332k63780q6502J4758L1267K87619n0298m5017l9966
14696a17723M641n7794L8067j11352j06539J72005K38580p4883O06l2245M9414
14685B777J1844J0874P9603j0155L0381j13988q9768P1312q5332r4379K3223k8495
14673a92103K9506O9708O7394N4061N7277Q1267J67372n3479P543j14382j39506
14662C4658L6826l4888j32288M9936N5538j06802j78769Q100K11329O5073o9636
14651f0923j04087n0028K1139R5390J10755J1059J213j31317M4156J74887N1972
$$ plain form
14640 164216 120395 257748 440792 407979 316644 122174 -10688 -93139 95106 192984
14630 192984 260017 158269 135294 12812 46127 -83993 -169692 -219037 -269039 -252255 -175554
14619 -175554 -12572 2127 5508 27724 115872 68169 60821 102973 61928 80167 35472 -187834
14607 -187834 -190917 -82398 48628 -11680 7089 68041 44585 -56558 -205292 -228238 -281596
14596 -281596 -82891 51044 64169 -21336 7778 149496 83160 73089 65598 19339 20869
14585 20869 18728 -48022 -93238 -30778 -48729 -68293 -33212 -81632 -64413 -195191 -185801 35016
14573 35016 78166 47860 -10784 -155419 -193533 -131424 -126029 -123171 -83279 -11247 58459 126016
14561 126016 55724 -50060 64423 165965 120287 40243 148193 335125 223670 -4431
$$ packed form
14640A64216m3821J37353J83044l2813r1335j94470j32862q2451J88245R7878
14630A92984O7033j01748k2975j22482L3315j30120q5699m9345n0002J6784P6701
14619a75554J62982J4699L381K2216Q8148m7703p348M2152m1045J8239m4695k23306
14607a87834l083J08519J31026o0308J8769O0952k3456j01143j48734k2946n3358
14596b81596J98705J33935J3125q5505K9114J41718o6336j0071p491m6259J530
14585B0869k141o6750m5216O2460j7951j9564L5081m8420J7219j30778R390K20817
14573C5016M3150l0306n8644j44635l8114O2109N395K858L9892P2032O9706O7557
14561A26016p0292j05784J14483J01542m5678q0044J07950J86932j11455k28101
$$ plain form
14551 -4431 -89331 -26134 -158581 -33042 85158 -21088 -40453 39544 188137 57183 -123899
14540 -123899 -164618 -186340 -231114 -152939 -36520 38616 -70442 -124658 -4566 135613 118437
14529 118437 30269 -181142 -215267 -103377 -53357 93389 40991 29714 -7721 -40556 -16626
14518 -16626 38321 -54866 -65826 789 -86817 -32598 13679 180961 142906 56560 -12688
14507 -12688 -128376 -55489 -90900 -105607 -41194 -92474 -68010 -113425 -137611 -26560 121029
14496 121029 93614 -52323 42630 96071 161519 4475 -138156 -128947 -126329 -128966 -171515
14485 -171515 -133556 31324 82425 28671 4991 -169642 -275496 -109912 112253 168345
14475 168345 229188 156513 202553 306062 275300 226532 154922 369439 602084 545416 593626
$$ packed form
14551d431q4900O3197j32447J25539J18200j06246j9365P9997J48593j30954j81082
14540a23899m0719k1722m4774P8175J16419P5136j09058n4216J20092J40179j7176
14529A18437q8168k11411l4125J11890N0020J46746n2398j1277l7435l2835K3930
14518a6626N4947r3187j0960O6615q7606N4219M6277J67282l8055q6346o9248
14507a2688j15688P2887l5411j4707O4413n1280K4464m5415k4186J11051J47589
14496A21029k7415j45937R4953N3441O5448j57044j42631R209K618k637m2549
14485a71515L7959J64880N1101n3754k3680j74633j05854J65584K22165N6092
14475A68345O0843p2675M6040J03509l0762m8768p1610K14517K32645n6668M8210
$$ plain form
14464 593626 614660 450599 292211 147467 129101 -119043 -255055 -102367 -214339 -275584
14454 -275584 -181967 -19084 -20942 135846 29623 -166337 -154151 -69528 -16275 -53847 -78643
14443 -78643 -210179 -187386 -146780 -93936 30419 28371 21453 -48335 34875 57277 93309 128905
14431 128905 151360 62750 -7749 3457 -6263 -133042 -25491 273092 451992 506314 451914
14420 451914 394204 277086 196674 280682 159822 165186 110304 116993 229449 250350 255163
14409 255163 98725 67269 -3219 -37906 -154682 -183533 -209810 -183388 2680 -20633 -52396
14398 -52396 -4834 33325 30463 -49346 -42009 78369 147977 58358 197937 237434 178256 31010
14386 31010 -35170 53413 224067 175619 -10485 -2882 -45777 -162934 -115968 -87573 -13020
$$ packed form
14464E93626K1034j64061j58388j44744j8366k48144j36012J52688j11972o1245
14454b75584R3617J62883j858J56788j06223j95960J2186Q4623N3253l7572k4796
14443g8643j31536K2793M0606N2844J24355k048o918o9788Q3210K2402L6032L5596
14431A28905K2455q8610p0499J1206r720j26779J07551K98583J78900N4322n4400
14420D51914n7710j17118q0412Q4008j20860N364n4882O689J12456K0901M813
14409B55163j56438l1456p0488l4687j16776k8851k6277K6422J86068k3313l1763
14398e2396M7562L8159k862p9809P337J20378O9608q9619J39579L9497n9178j47246
14386C1010o6180Q8583J70654m8448j86104P603m2895j17157M6966K8395P4553
$$ plain form
14375 -13020 -65728 -29617 -15113 -69619 -161629 -86644 -152943 -157837 -209904 -176124 -174588 -218785
14363 -218785 -168361 -135352 -103908 -87959 36922 105063 224446 268592 373439 256105 159296
14352 159296 6450 -32811 -126932 -76081 -25941 -4601 137964 117328 -16878 108335 49250
14341 49250 -11765 -50135 169844 311147 179468 109640 161192 115004 -25003 -215813 -178083
14330 -178083 -119954 -111357 93249 146678 131413 32514 -67307 -103239 -102940 14871 158744
14319 158744 384382 374068 318052 301525 123031 39549 -44489 -97250 -83195 -172872 -266221
14308 -266221 -131414 -136253 -134491 -81763 -71914 -40081 -98724 -190956 -155429 106481 221560
14297 221560 43260 -137491 -44533 -57930 35718 173519 117860 109668 67855 -118062 -117452
$$ packed form
14375a3020n2708L6111J4504n4506r2010P4985o6299m894n2067L3780J536m4197
14363b18785N0424L3009L1444J5949J24881O8141J19383M4146J04847j17334r6809
14352A59296j52846l9261r4121N0851N0140K1340J42565k0636j34206J25213n9085
14341D9250o1015l8370K19979J41303j31679o9828N1552m6188j40007j90810L7730
14330a78083N8129Q597K04606N3429j5265r8899r9821l5932K99J17811J43873
14319A58744K25638j0314n6016j6527j78494q3482q4038n2761J4055q9677r3349
14308b66221J34807m839J762N2728R849L1833n8643r2232L5527K61910J15079
14297B21560j78300j80751R2958j3397R3648J37801n5659q192m1813j85917O10
$$ plain form
14286 -117452 -127922 -165536 -172994 5067 128276 149551 133632 109545 -153040 -311277 -88020
14275 -88020 20649 57794 128271 139090 145854 170176 330140 272033 186006 72735 -17200
14264 -17200 -131514 -127999 -34037 210877 273944 268901 246394 209806 420244 438170 345977
14253 345977 225825 219802 171971 96844 85390 131748 60026 67413 58033 286539 549320
14242 549320 450975 289325 300551 182177 27495 3305 22308 83146 -615 -189441 -390357
14231 -390357 -475081 -388141 -337694 -187043 -165586 -66979 61755 -64908 4068 -46172 -79322
14220 -79322 -30874 20165 242191 258523 140388 -70205 -141653 -166537 -15968 116638 -4998
14209 -4998 -171593 -35063 36521 -14620 -80366 35163 224719 258234 214695 81301 26831
$$ packed form
14286a17452j0470l7614p458J78061J23209K1275j5919k4087k62585j58237K23257
14275h8020J08669L7145P0477J0819O764K4322J59964n8107q6027j13271q9935
14264a7200j14314L515R3962K44914O3067n043k2507l6588K10438J7926r2193
14253C45977j20152o023m7831p5127j1454M6358p1722P387r380K28506K62781
14242E49320r8345j61650J1226j18374j54682k4190J9003O0838q3761j88826k00916
14231c90357q4724Q6940N0447J50651K1457R8607J28734j26663O8976n0240l3150
14220g9322M8448N1039K22026J6332j18135k10593p1448k4884J50569J32606j21636
14209d998j66595J36530P1584n1141o5746J15529J89556L3515m3539j33394n4470
$$ plain form
14198 26831 66593 277179 360129 343349 133550 39474 54282 50677 67581 -9158 -6790 24383
14186 24383 115346 236673 260942 312644 290206 199139 296551 409119 333600 131825 80429
14175 80429 194124 142363 85179 30768 88846 63853 45676 -98462 -88932 -25506 -2160
14164 -2160 -52468 -143373 -141307 -94027 -194805 -156560 -137754 -32322 105076 91457 91112 172865
14152 172865 -17200 16464 74584 197999 116726 -59505 15018 156786 77839 56943 60306
14141 60306 123928 187607 237940 250377 45264 -88305 43436 47643 12406 -12536 25286
14130 25286 219281 279668 154447 123618 76617 97412 108720 66884 72204 234377 42203
14119 42203 -134612 -127281 71288 173032 213136 195314 126369 27777 76785 93653 42357
$$ packed form
14198B6831L9762K10586Q2950j6780k09799r4076J4808l605J6904p6739K368L1173
14186B4383R0963J21327K4269N1702k2438r1067R7412J12568p5519k01775n1396
14175H0429J13695n1761n7184n4411N8078k4993j8177j44138R530O3426K3346
14164b160n0308r0905K066M7280j00778L8245J8806J05432J37398j3619l45Q1753
14152A72865j90065L3664N8120J23415q1273j76231P4523J41768p8947k0896L363
14141F0306O3622O3679N0333J2437k05113j33569J31741M207l5237k4942L7822
14130B5286J93995O0387j25221l0829m7001K0795J1308m1836N320J62173j92174
14119D2203j76815P331J98569J01744M0104j7822o8945r8592M9008J6868n1296
$$ plain form
14108 42357 111376 180447 431317 343367 213973 152426 22692 -142249 -51162 144650 180254
14097 180254 161572 140682 116170 -41509 41075 107566 194885 160449 209316 46246 12679
14086 12679 66706 137209 125979 285444 306843 176127 -78399 -85673 -1431 -56333 -102774
14075 -102774 -72734 135431 119043 60607 44357 22071 -1157 -14350 216735 215145 12862
14064 12862 105507 183829 189406 111784 74519 77673 86461 163997 257040 330893 350494 440813
14052 440813 337136 331572 305322 16825 81268 397668 197188 78812 184956 197416
14042 197416 -18967 -185460 -89953 83686 205095 160236 91650 62850 72700 -1952 -132726
14031 -132726 6843 46702 25624 -42538 -2964 -6789 -6671 186043 307525 269850 156459
$$ packed form
14108D2357O9019O9071K50870q7950j29394o1547j29734j64941R1087J95812L5604
14097A80254j8682k0890k4512j57679Q2584O6491Q7319l4436M8867j63070l3567
14086A2679N4027P0503j1230J59465K1399j30716k54526p274Q4242n4902m6441
14075a02774L0040K08165j6388n8436j6250k2286k3228j3193K31085j590k02283
14064A2862R2645P8322N577p7622l7265L154Q788P7536R3043P3853J9601R0319
14052D40813j03677n564k6250k88497O4443L16400k00480j18376J06144J2460
14042A97416k16383j66493R5507J73639J21409m4859o8586k8800R850p4652j30774
14031a32726J39569L9859k1078o8162L9574l825J18J92714J21482l7675j13391
$$ plain form
14020 156459 7423 -64542 -16378 104368 182206 130657 66103 87331 130661 114740 78507
14009 78507 68623 165872 105106 93863 140604 144804 84986 87287 77770 -120048 -128929 20879
13997 20879 -45967 -187631 -144117 -113671 -38248 -97527 -84279 -50761 -211325 -341318 -296374
13986 -296374 -305417 -271259 -105612 95463 69420 -179476 -129571 14034 123357 -58559
13976 -58559 -41040 254921 216070 75422 -82239 -124742 -32589 34754 103485 134761 179695
13965 179695 187723 150059 117767 31082 104084 131230 75403 -45514 146956 -22752 -178687
13954 -178687 -112050 -36554 -27334 -71155 -111571 -117575 -61643 137074 134033 27400 5653 33615
13942 33615 6957 -51706 -175879 -200524 -34846 109673 192366 122731 -143217 -239096 -35847
$$ packed form
14020A56459j49036p1965M8164J20746P7838n1549o4554K1228M3330j5921l6233
14009G8507r884R7249o0766j1243M6741M200n9818K301r517j97818q881J49808
13997B0879o6846j41664M3514L0446P5423n9279J3248L3518j60564j29993M4944
13986b96374r043L4158J65647K01075k6043k48896M9905J43605J09323j81916
13976e8559J7519K95961l8851j40648j57661m2503R2153O7343O8731L1276M4934
13965A79695Q028l7664l2292q6685P3002K7146n5827j20917J92470j69708j55935
13954a78687O6637P5496R220m3821m0416o004N5932J98717l041j06633k1747K7962
13942C3615k6658n8663j24173k4645J65678J44519Q2693o9635k65948r5879K03249
$$ plain form
13931 -35847 626 100845 16859 -127395 -73719 79402 165757 195102 137491 -1458 20746
13920 20746 230562 369040 313900 289697 257073 62812 -44482 35834 153115 392642
13910 392642 652603 462650 117691 -47652 -42018 -25825 108478 50740 61924 216102
13900 216102 35858 -6599 -47448 -140143 -226278 -166650 14398 -43964 -9043 42016 -170040
13889 -170040 -216860 -262660 -178389 -267176 -216284 -61382 26931 -167089 -126978 -24224 57030
13878 57030 141744 137233 43644 -65754 -34402 -22423 -33769 7486 124 1246 55239 82091
13866 82091 176385 309660 300951 211289 124357 85291 38726 -16076 -37537 178993 148285
13855 148285 96586 160729 225305 194794 177756 30700 -23576 -20395 8268 -41783 -18386
$$ packed form
13931c5847L6473J00219q3986j44254N3676J53121Q6355K9345n7611j38949K2204
13920B0746K09816J38478n5140k4203l2624j94261j07294Q0316J17281K39527
13910C92642K59961j89953l44959j65343N634J6193J34303n7738J1184J54178
13900B16102j80244m2457m0849r2695q6135N9628J81048n8362L4921N1059k12056
13889a70040m6820m5800Q4271q8787N0892J54902Q8313j94020M0111J02754Q1254
13878E7030Q4714m511r3589j09398L1352J1979j1346M1255p362J122N3993K6852
13866H2091R4294J33275q709q9662q6932l9066m6565n4802k1461K16530l0708
13855A48285n1699O4143O4576l0511j7038j47056n4276L181K8663n0051K3397
$$ plain form
13844 -18386 -47701 -97278 -154616 -54178 42364 48178 57013 142867 282614 168088 84
13833 84 -34298 -10800 -101509 -35502 112943 185186 123009 43499 20282 -17928 -56798 83762
13821 83762 16473 14746 59568 -146827 -364044 -302881 -28805 109092 52583 -115107 -75859
13810 -75859 -88386 -41895 64641 124778 132107 196155 157704 28053 -44236 59541 87588
13799 87588 110870 294040 324630 98113 182583 145735 -51128 -92873 -107641 115890 139109
13788 139109 -92329 -220468 -114737 -71531 -134293 -68172 -93540 -121079 105229 195070 99080
13777 99080 37500 32699 -15867 84618 129567 63864 169008 313217 343075 315086 347665
13766 347665 192670 130177 199182 13890 -109368 -24663 51330 64871 116273 116165 76672
$$ packed form
13844a8386k9315m9577n7338J00438R6542N814Q835Q5854J39747j14526j68004
13833H4l4382K3498r0709O6007J48445P2243o2177p9510k3217l8210l8870J40560
13821H3762o7289j727M4822k06395k17217O1163K74076J37897n6509j67690L9248
13810g5859j2527M6491J06536O0137P329O4048l8451j29651p2289J03777K8047
13799H7588K3282J83170L0590k26517Q4470l6848j96863m1745j4768K23531K3219
13788A39109k31438j28139J05731M3206o2762O6121k5368k7539K26308Q9841r5990
13777I9080o1580m801m8566J00485M4949o5703J05144J44209K9858k7989L2579
13766C47665j54995o2493O9005j85292j23258Q4705P5993J3541N1402j08l9493
$$ plain form
13755 76672 122703 53413 158169 160708 58686 8844 42742 251865 155946 96864 -49795
13744 -49795 -51913 -127096 -257861 -252537 -124824 25154 40834 65550 142744 122874 49818
13733 49818 13549 -138652 -86667 35907 119808 13297 -66325 68262 197782 124533 -1377
13722 -1377 -158845 -322914 -212906 -8842 -16948 -103862 -85038 53667 5437 -100909 -241027
13711 -241027 -202753 -118295 -245872 -185186 -107317 -147159 -268530 -188472 -15391 87631 -17920
13700 -17920 -147084 -192498 -238062 -159170 -50605 -19570 87541 38069 27153 -82681 -134059
13689 -134059 42870 152993 151952 73431 5858 -13334 62312 -8003 -69860 -31083 -43391
13678 -43391 -35622 77011 64888 -80480 2920 23414 -94496 20957 193897 200253 143719
$$ packed form
13755G6672M6031o9290J04756K539j02022m9842L3898K09123r5919n9082j46659
13744d9795k118p5183j30765N324J27713J49978J5680K4716P7194j9870p3056
13733D9818l6269j52201N1985J22574Q3901j06511p9622J34587J29520p3249j25910
13722a377j57468j64069J10008K04064q106q6914J8824J38705m8230j06346j40118
13711b41027L8274Q4458j27577O0686P7869l9842j21371Q0058J73081J03022j05551
13700a7920j29164m5414m5564P8892J08565L1035J07111m9472j0916j09834n1378
13689a34059J76929J10123j041p8521o7573j9192P5646p0315o1857L8777j2308
13678d3391P769J12633j2123j45368Q3400K0494j17910J15453J72940O356n6534
$$ plain form
13667 143719 -35628 -271220 -286274 117780 279581 352347 173623 41259 -128634 -91440
13657 -91440 -17474 125446 61661 -216974 -293192 -288839 -261677 -217137 -195957 -251195 -184278
13646 -184278 -166164 -88633 42979 17468 27452 37306 96081 231468 333859 326800 449425
13635 449425 590349 437714 313538 214267 197656 57526 55250 88249 -52824 30972 46170
13624 46170 -28236 -87753 -156776 -180128 5157 -104057 -40380 29039 -67395 -86840 -58331
13613 -58331 -66384 -97541 69399 197517 213006 127009 219004 9849 -241817 -194412 -123672
13602 -123672 -140323 -73299 72920 182957 241446 326041 257365 111512 -78437 -57399 35179
13591 35179 94572 61805 -11464 -15579 30793 86747 216462 213472 46166 97874 236646
$$ packed form
13667A43719j79347k35592j5054M04054J61801P2766j78724j32364j69893L7194
13657i1440P3966J42920o3785k78635p6218M353K7162M4540K1180n5238O6917
13646a84278J8114P7531J31612k5511R984R854N8775J35387J02391p059J22625
13635D49425J40924j52635j24176r9271j6611j40130k276L2999j41073Q3796J5198
13624D6170p4406n9517o9023k3352J85285j09214O3677O9419r6434j9445K8509
13613e8331q053l1157J66940J28118J5489q5997R1995k09155k51666M7405P0740
13602a23672j6651O7024J46219J10037N8489Q4595o8676j45853j89949K1038R2578
13591C5179N9393l2767p3269m115M6372N5954J29715k990j67306N1708J38772
$$ plain form
13580 236646 327838 432024 259720 113193 -72397 -122878 -108252 115411 90425 54846
13570 54846 278 154367 183596 277791 303426 223188 99883 87977 101860 16097 -53818
13559 -53818 5600 -77622 -31873 95239 153159 39144 -25482 116294 132367 -32303 -116129
13548 -116129 -6813 32010 89266 4419 -142143 -80400 -17672 11535 164764 18791 -49738
13537 -49738 96228 263405 179944 9500 64345 146071 254337 406990 480548 571103 437147
13526 437147 263937 295899 387221 371685 431866 333686 168337 12830 106146 108660 -68996
13515 -68996 -103531 -113862 -104465 -63411 -14711 -76718 -98715 -6846 103770 136130 104102 87651
13503 87651 164302 126505 10488 -116812 -141505 -167403 -108724 -27091 12593 74577 132363
$$ packed form
13580B36646R1192J04186j72304j46527j85590n0481J4626K23663k4986l5579
13570E4846n4568J54089K9229R4195K5635q0238j23305j1906J3883q5763o9915
13559e3818N9418q3222M5749J27112N7920j14015o4626J41776J6073j64670q3826
13548a16129J09316L8823N7256q4847j46562O1743O2728K9207J53229j45973o8529
13537d9738J45966J67177q3461j70444N4845Q1726J08266J52653P3558R0555j33956
13526D37147j73210L1962R1322j5536O0181r8180j65349j55507R3316K514j77656
13515f8996l4535j0331R397M1054M8700o2007k1997R1869J10616L2360l2028j6451
13503H7651P6651l7797j16017j27300k4693k5898N8679Q1633L9684O1984N7786
$$ plain form
13492 132363 219693 157669 79296 89901 116282 142646 193295 110480 66570 -105201 -222824
13481 -222824 -331479 -215668 -127671 37689 122258 -730 -187322 -135626 32361 27437
13471 27437 7900 -64338 78928 93018 139022 186976 124406 147914 54460 -45927 -34718
13460 -34718 82407 56424 -69126 -49406 68910 86393 64944 94447 144516 140346 -66557
13449 -66557 -40810 100735 122927 177396 270004 300798 180963 -38727 49462 82063 104586
13438 104586 77430 116974 191648 244584 274115 162626 101564 120408 -4111 -206866 -153052
13427 -153052 90490 271562 229493 218222 209257 134061 184670 132911 97635 -83800 -93415
13416 -93415 -57691 -211279 -172180 -64403 -155467 -221024 -202107 -65586 -68806 3030 195320
$$ packed form
13492A32363Q7330o2024p8373J0605K6381K6364N0649q2815m3910j71771j17623
13481b22824j08655J15811Q7997J65360Q4569j22988j86592N1696J67987m924
13471B7437j9537p2238J43266J4090M6004M7954o2570K3508r3454j00387J1209
13460c4718J17125k5983j25550J9720J18316J7483k1449K9503N0069m170k06903
13449f6557K5747J41545K2192N4469R2608L0794j19835k19690Q8189L2601K2523
13438A04586k7156L9544P4674N2936K9531j11489o1062J8844j24519k02755N3814
13427a53052K43542J81072m2069j1271q965p5196N0609n1759l5276j81435r615
13416i3415L5724j53588L9099J07777r1064o5557J8917J36521l220P1836J92290
$$ plain form
13405 195320 110212 -30613 -82261 -45798 -126228 -215658 -108561 -58327 -48382 -40421 28550
13394 28550 -2275 -89734 -220015 -122179 15381 77029 4009 -125421 -17375 27818 107462
13383 107462 82234 186225 167802 -89104 -333951 -379933 -267817 -259653 -151264 -59497 121400
13372 121400 170837 79490 126267 197369 17296 54007 184367 178356 106975 -103741 -262071
13361 -262071 -104506 37556 -11013 43641 136281 208809 23510 -148024 -27153 -41256
13351 -41256 -208948 -172278 -137454 -63962 -24688 65882 -25263 -55387 16553 85600 66031
13340 66031 154509 190177 71892 145142 108745 58284 142562 192739 154044 -47558 -133212
13329 -133212 -168489 -156617 -184973 -136839 -230216 -137792 121866 50001 -181855 -95041 -5454
$$ packed form
13405A95320q5108j40825n1648L6463q0430q9430J07097N0234R945P961O8971
13394B8550l0825q7459j30281R7836J37560O1648p3020j29430J08046M5193P9644
13383A07462k5228J03991j8423k56906k44847m5982J12116Q164J08389R1767J80897
13372A21400M9437r1347M6777P1102j80073L6711J30360o011p1381k10716j58330
13361b62071J57565J42062m8569N4654R2640P2528j85299j71534J20871j4103
13351d1256j67692L6670L4824P3492L9274R0570r1145l0124P1940O9047j9569
13340F6031Q8478L5668j18285P3250l6397n0461Q4278N0177l8695k01602q5654
13329a33212l5277J1872k8356M8134r3377R2424K59658p1865k31856Q6814Q9587
$$ plain form
13318 -5454 48177 -19626 -145621 -180958 -60669 12162 24890 102589 80973 107877 62981
13307 62981 143979 193208 291627 158237 -41290 -92565 -24734 -99295 -249053 -178770 -84970
13296 -84970 -224130 -128401 56005 56577 2523 85932 246583 402613 390567 241770 3221
13285 3221 -129467 -24552 -3794 -72341 77336 197003 55300 15921 93382 119536 75107
13274 75107 -5455 -3278 31093 34244 -54008 -96247 -37888 52896 -2995 -9774 -102323 -1701
13262 -1701 36490 91160 13596 93932 151390 95421 -1119 -60689 51462 -167159 -147839
13251 -147839 -47960 45216 -39745 34881 139053 85794 93023 67836 63436 20766 14875 147450
13239 147450 224375 136258 190992 213424 166258 249189 305353 388876 258940 148037 172784
$$ packed form
13318e454N3631o7803j25995l5337J20289P2831J2728P7699k1616K6904m4896
13307F2981Q0998M9229R8419j33390j99527n1275O7831p4561j49758P0283R3800
13296h4970j39160R5729J84406N72n4054Q3409J60651J56030j2046j48797k38549
13285C221j32688J04915K0758o8547J49677J19667j41703l9379P7461K6154m4429
13274G5107q0562K177L4371L151q8252m2239N8359R0784n5891o779r2549J00622
13262a701L8191N4670p7564Q0336N7458n5969r6540n9570J12151k18621J9320
13251a47839R9879R3176q4961P4626J04172n3259P229k5187m400m2670n891J32575
13239A47450P6925q8117N4734K2432m7166Q2931N6164Q3523j29936j10903K4747
$$ plain form
13228 172784 242316 130138 59598 -36788 -165283 -152127 150104 218314 38396 -37355 2277
13217 2277 87405 236446 219924 137701 96717 194119 122276 -14655 39040 32397 105208 216839
13205 216839 275439 175892 48361 92856 127950 43599 62631 58216 55351 82509 69357 3805
13193 3805 -65228 -129715 -133933 -88095 -23910 35558 184972 164504 161203 229182 215189 40777
13181 40777 -122365 -137589 -79746 -14655 -47282 -32935 -24622 8186 98194 221247 268728
13170 268728 82209 -98131 -136373 -71268 -99510 -99015 -149209 -94970 -193370 -178914 -51913
13159 -51913 269315 425986 212328 -21385 -193611 8816 -83649 -247753 -148207 138395
13149 138395 473491 300476 56350 13887 -99367 -19719 -43250 64910 34421 18794
$$ packed form
13228A72784O9532j12178p0540r6386j28495J3156L02231O8210j79918p5751L9632
13217B277Q5128J49041j6522q2223m0984R7402p1843j36931N3695o643P2811J11631
13205B16839N8600r9547j27531M4495L5094q4351J9032m415k865K7158j3152o5552
13193C805o9033o4487m218M5838O4185N9468J49414k0468l301O7979j3993j74412
13181D0777j63142j5224N7843O5091l2627J4347Q313L2808R0008J23053M7481
13170B68728j86519j80340l8242O5105k8242M95n0194N4239r8400J4456J27001
13159e1913L21228J56671k13658k33713j72226K02427r2465j64104R9546K86602
13149A38395L35096j73015k44126m2463j13254P9648k3531J08160l0489j5627
$$ plain form
13139 18794 109417 165468 -27524 -45542 3126 81608 218119 209027 86457 -165087 -80383
13128 -80383 -88170 -155557 -38597 3320 -35279 22110 36288 218972 168871 125589 17080
13117 17080 -161176 -290794 -272613 -202497 46131 63433 139489 79623 441 38777 201393
13106 201393 104762 30125 -16289 -39318 -70030 -8078 140384 223047 205762 -75468 -43542
13095 -43542 -37683 -138043 -175338 -138338 -166364 -287409 -211771 -88130 22843 84902 -127693
13084 -127693 -107216 -75679 33730 135388 48389 -45155 -36694 139444 129496 202624 344797
13073 344797 556566 529079 498262 450251 298302 21744 2717 85220 29883 10304 -4941
13062 -4941 173395 228065 223870 177359 123341 -76374 -114561 -35667 127055 153440 131863
$$ packed form
13139A8794R0623N6051j92992j8018M8668P8482J36511r092j22570k51544Q4704
13128h0383p787o7387J16960M1917l8599N7389J4178J82684n0101m3282j08509
13117A7080j78256j29618J8181P0116K48628J7302P6056n9866p9182L8336J62616
13106B01393r6631p4637m6414k3029l0712O1952J48462Q2663j7285k81230L1926
13095d3542N859j00360l7295L7000k8026j21045P5638J23641J10973O2059k12595
13084a27693K0477L1537J09409J01658q6999r3544Q461J76138r948P3128J42173
13073C44797K11769k7487l0817m8011j51949k76558j9027Q2503n5337j9579j5245
13062d941J78336N4670m195m6511n4018j99715l8187P8894J62722K6385k1577
$$ plain form
13051 131863 343738 413958 417480 383938 485591 485878 382278 375243 496566 435167 188905
13040 188905 208078 271286 133171 209571 271778 205919 180456 126880 143436 215660 428067
13029 428067 710646 962269 1208002 1274702 1201135 1133506 847291 547807 315467 323427
13019 323427 230468 142280 208242 63074 -30999 -140226 -47822 76136 148080 322728 219428
13008 219428 89885 -66601 -15954 -10086 20348 -19255 8063 -3788 -23531 35993 116873
12997 116873 150703 171271 232028 271352 245906 226538 227527 132398 44448 70142 225076 339169
12985 339169 343564 314085 470355 835418 1042765 1201669 973993 714425 547603 495102
12975 495102 368246 212677 176249 201576 225992 181154 113014 4578 109914 139813 144343
$$ packed form
13051A31863K11875P0220L522l3542J01653K87j03600p035J21323o1399k46262
13040A88905J9173O3208j38115P6400O2207o5859k5463n3576J6556P2224K12407
13029D28067K82579K51623K45733O6700p3567o7629k86215k99484k32340P960
13019C23427r2959q8188O5962j45168r4073j09227R2404J23958P1944J74648j03300
13008B19428j29543j56486N0647N868L0434l9603K7318j1851j9743N9524Q0880
12997A16873L3830K0568O0757L9324k5446j9368R89r5129q7950K5694J54934J14093
12985C39169M395k9479J56270L65063K07347J58904k27676k59568j66822n2501
12975D95102j26856j55569l6428K5327K4416m4838o8140j08436J05336K9899M530
$$ plain form
12964 144343 279463 174476 91738 164346 249930 298826 334123 326656 243488 -64198 -162442
12953 -162442 -72497 -56159 69946 87326 93026 111402 215932 207809 163982 93104 64972
12942 64972 185087 175016 290452 481877 474492 504517 528160 543364 447348 384298 276644
12931 276644 55391 9585 -75376 -112716 -27633 136224 107102 67327 152110 134892 110615
12920 110615 22216 115455 148056 61900 14110 11669 -24193 -3405 -63103 -87176 99881
12909 99881 143787 -32008 -9375 142486 67282 -91355 30086 213634 133906 137608 222350
12898 222350 162842 153642 -1727 -27849 -4815 6341 106785 298939 229074 123601 156237
12887 156237 1055 17531 289079 424058 419960 370403 212407 123495 166582 188580 257238
$$ packed form
12964A44343J35120j04987q2738P2608Q5584M8896L5297p467q3168l07686r8244
12953a62442Q9945J6338J26105J7380N700J8376J04530q123m3827p0878k8132
12942F4972J20115j0071J15436J91425p385L0025K3643J5204r6016o3050j07654
12931B76644k21253m5806q4961l7340Q5083J63857k9122l9775Q4783j7218k4277
12920A10615q8399R3239L2601q6156m7790k441l5862K0788n9698k4073J87057
12909I9881M3906j75795K2633J51861p5204j58637J21441J83548p9728L702Q4742
12898B22350n9508r200j55369k6122K3034J1156J00444J92154o9865j05473L2636
12887A56237j55182J6476K71548J34979m098m9557j57996q8912M3087K1998O8658
$$ plain form
12876 257238 234242 -113537 -231425 -159450 -149707 -217000 -31877 8577 -94382 5376 120464
12865 120464 317380 385831 266003 84817 84455 50412 60009 105855 7070 36243 112806
12854 112806 134407 171685 68182 -49588 -181228 -109375 -16448 -46518 -149768 65763
12844 65763 47643 105695 235781 332267 245448 247207 253098 16032 -76849 -61927 84483
12833 84483 142073 328478 444344 416157 209002 105079 171080 254843 241463 167740 121469
12822 121469 41438 43686 60068 108486 108686 -18276 -56036 101646 133323 109884 181849 110341
12810 110341 122069 102261 72882 116143 99631 67685 131395 44897 188421 -9618 -186192
12799 -186192 -235485 -52173 -36647 -228801 -243680 -295076 -167116 196262 263379 78899
$$ packed form
12876B57238k2996l47779j17888P1975R743o7293J85123M0454j02959R9758J15088
12865A20464J96916O8451j19828j81186l62l4043R597M5846r8785K9173P6563
12854A12806K1601L7278j03503j17770j31640P1853R2927l0070j03250K15531
12844F5763j8120N8052J30086R6486q6819J759N891k37066r2881J4922J46410
12833H4483N7590J86405J15866k8187k07155j03923O6001Q3763j3380p3723m6271
12822A21469q0031K248J6382M8418K00j26962l7760J57682L1677k3439P1965p1508
12810A10341J1728j9808k9379M3261j6512l1946O3710q6498J43524j98039j76574
12799a86192m9293J83312J5526j92154j4879n1396J27960L63378O7117j84480
$$ plain form
12789 78899 -33143 54044 159643 180355 99531 45196 130196 94994 82934 297998 392708
12778 392708 298054 101725 42911 -35506 -115776 -119940 -80117 16297 140157 92671 48858
12767 48858 74121 38083 169056 300609 341180 28031 -224771 -248251 -18490 159249
12757 159249 48412 -109242 -258153 -151687 -35688 101622 174047 177314 44113 114702
12747 114702 181122 225011 304138 255335 111275 51454 147497 120112 109179 15157 -170629
12736 -170629 -10778 194356 113045 -89290 -46794 -109714 -54598 -32456 -34606 -117603 -14657
12725 -14657 77066 -142079 -118068 -94213 97587 29415 -63379 -214460 -131491 -23998 140676
12714 140676 212017 200580 218926 171792 83325 -73887 -182205 -64313 55970 -30092 72881
$$ packed form
12789G8899j12042Q7187J05599K0712q0824n4335Q5000l5202j2060K15064R4710
12778C92708r4654j96329n8814p8417q0270m164L9823R6414J23860m7486m3813
12767D8858K5263l6038J30973J31553M0571l13149k52802k3480K29761J77739
12757A59249j10837j57654j48911J06466J15999J37310P2425L267j33201P0589
12747A14702O6420M3889P9127m8803j44060n9821R6043k7385j0933r4022j85786
12736a70629J59851K05134q1311k02335M2496o2920N5116K2142k150q2997J02946
12725a4657R1723k19145K4011K3855J91800o8172r2794j51081Q2969J07493J64674
12714A40676P1341j1437J8346m7134q8467j57212j08318J17892J20283q6062J02973
$$ plain form
12703 72881 158928 144371 135139 53193 -17591 -35137 57539 231289 230322 126749 17100 -85293
12691 -85293 -154905 36258 51209 -63845 -97695 -212519 -160014 10903 70573 131825 97141
12680 97141 115353 82196 -91615 -126512 -43651 53426 91412 121640 255485 126752 159821
12669 159821 266085 213207 246112 446461 491992 293027 191947 176793 234223 236005 151153
12658 151153 104667 219842 318642 194264 164768 345609 344635 341858 291494 308280 258551
12647 258551 47986 -137265 -158187 -2161 9485 73724 110550 40726 -48652 -89101 -8949
12636 -8949 116937 183683 249582 324269 299133 380945 363685 250527 145886 172788 139840
12625 139840 73770 108271 160089 113566 39260 -64597 -112124 23736 87294 58833 -61050
$$ packed form
12703G2881Q6047j4557r232q1946p0784j7546R2676J73750r67j03573j09649j02393
12691h5293o9612J91163J4951j15054l3850j14824N2505J70917N9670O1252l4684
12680I7141J8212l3157j73811l4897Q2861R7077L7986L0228J33845j28733L3069
12669A59821J06264n2878L2905K00349M5531j98965j01080j5154N7430J782q4852
12658A51153m6486J15175R8800j24378k9496J80841r74k777n0364J6786m9729
12647B58551k10565j85251k0922J56026J1646O4239L6826o9824q9378m0449Q0152
12636h949J25886O6746O5899P4687k5136Q1812j7260j13158j04641K6902l2948
12625A39840o6070L4501N1818m6523p4306j03857m7527J35860O3558k8461j19883
$$ plain form
12614 -61050 -5078 -131562 -127711 -33228 -45128 39564 156338 127209 147853 251556 284632
12603 284632 68773 -70464 17564 61161 54137 181042 25462 95973 231259 162384 82052
12592 82052 -15424 -99952 -78234 -45801 9940 18004 36184 -56049 -131545 -122143 -125446 -144272
12580 -144272 -71903 -10422 -54576 66287 129804 96551 189720 144420 81603 6183 -7295
12569 -7295 182153 500649 516742 345038 112608 -74590 -91832 198788 401681 316802
12559 316802 316275 390966 338714 101126 -50572 71719 153187 220361 350604 326549 273181
12548 273181 196160 63070 -17948 65977 79260 202354 261302 220182 283720 314534 146610
12537 146610 110836 224400 378401 325717 200337 156113 226257 369741 437655 566700
$$ packed form
12614f1050N5972j26484L851R4483j1900Q4692J16774k9129K0644J03703L3076
12603B84632k15859j39237Q8028M3597p024J26905j55580P0511J35286o8875q0332
12592H2052r7476q4528K1718L2433N5741Q064J8180r2233p5496R402l303j8826
12580a44272P2369O1481m4154J20863O3517l3253R3169m5300o2817p5420j3478
12569g295J89448L18496J6093j71704k32430j87198j7242K90620K02893q4879
12559C16802n27P4691n2252k37588j51698J22291Q1468O7174J30243k4055n3368
12548B73181p7021j33090q1018Q3925J3283J23094N8948m1120O3538L0814j67924
12537A46610l5774J13564J54001n2684j25380m4224P0144J43484O7914J29045
$$ plain form
12527 566700 489605 460488 565442 506679 302878 125931 138586 377453 516752 453833
12517 453833 210173 217837 257053 396478 504868 478078 421351 421388 392805 419457 438136 136037
12505 136037 -20065 34373 -9054 174417 372229 281311 314299 423810 491779 474269 522742
12494 522742 533192 313976 166550 153144 207683 281095 293008 426539 448904 560643 671604
12483 671604 624734 632797 641652 513380 367135 306309 321876 412643 397312 333750 328630 293179
12471 293179 227412 250875 314133 366226 394273 200322 200157 283240 305335 214203 295048 231917
12459 231917 27627 -136735 8936 29485 -51580 89821 164813 165532 148796 238648 295343
12448 295343 368804 464480 535375 411934 439615 442333 325230 480342 807360 855517 866863
$$ packed form
12527E66700p7095k9117J04954n8763k03801j76947J2655K38867J39299o2919
12517D53833k43660P664L9216J39425J08390k6790n6727L7k8583K6652J8679l02099
12505A36037j56102N4438m3427J83471J97812r0918L2988J09511O7969j7510M8473
12494E22742J0450k19216j47426j3406N4539P3412J1913J33531K2365J11739J10961
12483F71604m6870Q063Q855j28272j46245o0826J5567R0767j5331o3562n120l5451
12471B93179o5767K3463O3258N2093K8047j93951j65Q3083K2095r1132Q0845o3131
12459B31917k04290j64362J45671K0549q1065J41401P4992P19j6736Q9852N6695
12448B95343P3461R5676P0895j23441K7681K718j17103J55112L27018M8157J1346
$$ plain form
12437 866863 684373 581762 348521 394200 481887 339589 270322 212288 439470 436768 421232
12426 421232 454579 228666 123103 400410 407509 320237 384259 315421 414181 469563 390479
12415 390479 421340 341243 324137 350633 452817 288341 188214 301383 483667 537239
12405 537239 402741 439991 511758 287020 320287 421671 479300 536712 547099 522948 504976
12394 504976 626096 758361 734294 510105 445793 460468 565335 553417 545149 527748 444027
12383 444027 413257 459679 541643 593971 676694 631054 568141 450477 439044 606732 606897
12372 606897 718874 797141 659904 569337 607566 584616 487016 508511 491884 403002 472371
12361 472371 463118 570323 692567 663998 627734 537601 582822 596547 555648 333456 336860
$$ packed form
12437H66863j82490j02611k33241M5679Q7687j42298o9267n8034K27182k702j5536
12426D21232L3347k25913j05563K77307P099q7272O4022o8838R8760N5382p9084
12415C90479L0861q0097j7106K6496J02184j64476j00127J13169J82284N3572
12405E37239j34498L7250P1767k24738L3267J01384N7629N7412J0387k4151j7972
12394E04976J21120J32265k4067k24189o4312J4675J04867j1918q268j7401q3721
12383D44027l0770M6422Q1964N2328Q2723m5640o2913j17664j1433J67688J65
12372F06897J11977P8267j37237r0567L8229k2950r7600K1495j6627q8882O9369
12361D72371r253J07205J22244k8569l6264r0133M5221J3725m0899k22192L404
$$ plain form
12350 336860 412009 396521 436198 592532 535225 479399 435798 514678 529625 717690 712774
12339 712774 636528 647656 651488 627488 716424 786605 737944 525190 625012 583816 479977
12328 479977 450229 444099 516828 632052 656146 635761 570609 540602 626043 594969 437960
12317 437960 439583 591012 735285 768907 608765 567902 700971 718994 827690 804112 812813
12306 812813 973576 850810 859239 896074 932368 1000236 1019475 965112 885165 923792 860635
12295 860635 823512 718542 644047 847819 1055195 1015662 971202 960162 993854 871726 813274
12284 813274 833606 711148 727155 737045 910554 989090 1005277 839106 669337 801642 951154
12273 951154 923029 916935 1070764 982941 1055437 987741 887741 967071 1071523 983233 823294
$$ packed form
12350C36860P5149j5488L9677J56334n7307n5826m3601P8880J4947J88065m916
12339G12774p6246J1128L832k4000Q8936P0181m8661k12754R9822m1196j03839
12328D79977k9748o130P2729J15224K4094k0385o5152l0007Q5441l1074j57009
12317D37960J623J51429J44273L3622j60142m0863J33069J8023J08696k3578Q701
12306H12813J60763j22766Q429L6835L6294O7868J9239n4363p9947L8627o3157
12295H60635l7123j04970p4495K03772K07376l9533m4460j1040L3692j22128n8452
12284H13274K0332j22458J6007R890J73509P8536J6187j66171j69769J32305J49512
12273I51154k8125o094J53829q7823P2496o7696j00000P9330J04452q8290j59939
$$ plain form
12262 823294 875643 862733 871609 1053420 1288240 1193156 1049075 1115990 1126887 1116978 1081676
12251 1081676 1016914 960943 909101 1068132 1179518 1095975 1108566 1146589 1061899 1167325 1411271
12240 1411271 1442813 1397042 1378726 1324480 1228291 1204503 1217434 1309285 1260189 1353134 1388461
12229 1388461 1431093 1365328 1449750 1441365 1401913 1430358 1312882 1223142 1237541 1253197 1317711
12218 1317711 1403559 1475018 1464470 1387032 1401368 1433972 1487798 1663910 1455710 1449051 1526119
12207 1526119 1420008 1469868 1610808 1496269 1367648 1484027 1560516 1618549 1663484 1634413
12197 1634413 1571061 1479566 1513345 1711968 1738498 1769625 1803143 1748179 1656362 1668587 1665367
12186 1665367 1676837 1653765 1747713 1911362 1928649 1928281 1902978 1910551 1903324 1733197 1656372 1812128
$$ packed form
12262H23294N2349j2910Q876J81811K34820r5084j44081O6915J0897r909l5302
12251A081676o4762n5971n1842J59031J11386q3543J2591L8023q4690J05426K43946
12240A411271L1542m5771j8316n4246r6189k3788J2931R1851m9096R2945L5327
12229A388461M2632o5765Q4422q385l9452K8445j17476q9740J4399J5656O4514
12218A317711Q5848P1459j0548p7438J4336L2604N3826J76112k08200o659P7068
12207A526119j06111M9860J40940j14539j28621J16379P6489N8033M4935k9071
12197A634413o3352r1495L3779J98623K6530L1127L3518n4964r1817J2225l220
12186A665367J1470k3072R3948J63649J7287l68k5303P573p227j70127p6825J55756
$$ plain form
12174 1812128 1976377 2261871 2288105 2260582 2260728 2208124 2107790 2140988 2119232 2089220 2150336
12163 2150336 2152487 2134865 2247949 2278295 2343678 2311685 2253153 2387976 2418190 2381675 2488310
12152 2488310 2658907 2650470 2623951 2456772 2482602 2593527 2489677 2344719 2342789 2588552
12142 2588552 2593821 2490034 2554375 2834027 3019067 2929338 3007229 2967074 2816471 2828575 2900391
12131 2900391 2977030 2885661 2925784 3023884 3122431 3066846 3072057 3155238 3191932 3099043 3018536
12120 3018536 3015991 2889686 2919868 2983212 3015374 3254871 3266707 3198110 3167887 3193439 3347557
12109 3347557 3474797 3636487 3711787 3589232 3605316 3801279 3881235 3816986 3970911 3993263
12099 3993263 4035311 3933098 3858633 3944729 4014581 4145038 4272412 4549761 4735371 4801061
$$ packed form
12174A812128J64249K85494K6234k7523J46n2604j00334L3198k1756l0012O1116
12163B150336K151j7622J13084L0346O5383l1993n8532J34823L0214l6515J06635
12152B488310J70597q437k6519j67179K5830J10925j03850j44958j930K45763
12142B588552N269j03787O4341K79652J85040q9729P7891m0155j50603J2104P1816
12131B900391P6639r1369M0123R8100R8547n5585N211Q3181L6694r2889q0507
12120C018536k545j26305L0182O3344L2162K39497J1836o8597l0223K5552J54118
12109C347557J27240J61690P5300j22555J6084J95963P9956o4249J53925K2352
12099C993263M2048j02213p4465Q6096O9852J30457J27374K77349J85610O5690
$$ plain form
12089 4801061 4829535 4711890 4383262 4333933 4505224 4695603 5003299 5191542 5055482 5112968
12079 5112968 5103878 5066640 4893777 4932372 5202872 5161771 5218949 5430278 5533023 5566527 5540679
12068 5540679 5747440 5850827 5819169 5854035 5875704 6009456 6087399 6135550 6222940 6242614 6271385
12057 6271385 6435102 6497916 6504436 6683903 6677975 6794131 6825632 6804731 6940305 7145547 7306799
12046 7306799 7542164 7565331 7692324 7746084 7735057 7805736 7959063 8027924 8138024 8489022
12036 8489022 8658543 8791896 8777016 8756165 8875387 8850120 8817817 9086446 9199023 9406319
12026 9406319 9447400 9524615 9872130 10085140 10012045 10216944 10404751 10590538 10816969 11053539
12016 11053539 11368697 11541248 11777649 11771650 11836495 12111918 12361276 12462970 12691000 13025798
$$ packed form
12089D801061K8474j17645l28628m9329J71291J90379L07696J88243j36060N7486
12079E112968r090l7238j72863L8595K70500m1101N7178K11329J02745L3504k5848
12068E540679K06761J03387l1658L4866K1669J33752P7943M8151Q7390J9674K8771
12057F271385J63717O2814O520J79467n928J16156L1501k0901J35574K05242J61252
12046G306799K35365K3167J26993N3760j1027P0679J53327O8861J10100L50998
12036H489022J69521J33353j4880k0851J19222k5267l2303K68629J12577K07296
12026I406319M1081P7215L47515K13010p3095K04899J87807J85787K26431K36570
12016A1053539L15158J72551K36401n999O4845K75423K49358J01694K28030L34798
$$ plain form
12006 13025798 13278821 13459732 13538260 13837789 13999971 14301275 14648696 14837974 15050196
11997 15050196 15308590 15574647 15938612 16269171 16693618 16950778 17222401 17558025 17794674
11988 17794674 17897729 18283173 18789825 19313213 19786197 20156336 20440731 20876939 21027476
11979 21027476 21159718 21477540 21849118 22337079 22733172 22939108 23332133 23724257 24305825
11970 24305825 24776793 25194234 25735518 26199780 26795857 27220029 27634908 28086166 28552438
11961 28552438 29034675 29419602 29877308 30302141 30654583 31278753 31898999 32230074 32720073
11952 32720073 33164626 33568289 34111950 34585814 34838341 35179794 35656935 36285812 36960228
11943 36960228 37252416 37676901 38093573 38638828 39149024 39343668 39698499 40119001 40365978
$$ packed form
12006A3025798K53023J80911P8528K99529J62182L01304L47421J89278K12222
11997A5050196K58394K66057L63965L30559M24447K57160K71623L35624K36649
11988A7794674J03055L85444N06652N23388M72984L70139K84395M36208J50537
11979B1027476J32242L17822L71578M87961L96093K05936L93025L92124N81568
11970B4305825M70968M17441N41284M64262N96077M24172M14879M51258M66272
11961B8552438M82237L84927M57706M24833L52442O24170O20246L31075M89999
11952C2720073M44553M03663N43661M73864K52527L41453M77141O28877O74416
11943C6960228K92188M24485M16672N45255N10196J94644L54831M20502K46977
$$ plain form
11934 40365978 40558118 40925216 41218867 41524468 41891429 42115454 42281691 42450656 42555420
11925 42555420 42783817 42865471 43079669 43172063 43029158 42985766 42859719 42801938 42677465 42660173
11915 42660173 42771620 42665686 42416601 42056166 41703075 41508008 41339271 40957960 40775238
11906 40775238 40676298 40410303 40175163 39832196 39281810 38607017 38246468 37860004 37466201
11897 37466201 37059087 36707236 36229132 35729840 35328269 34896869 34390755 33813053 33274759
11888 33274759 32935161 32542586 32103156 31613276 31141399 30592703 30242016 29920263 29509234
11879 29509234 28896884 28301625 27835063 27496100 26992113 26501078 26164115 25738187 25378182
11870 25378182 24900495 24419710 23831853 23436469 23191987 22877818 22610430 22268586 21827118
$$ packed form
11934D0365978J92140L67098K93651L05601L66961K24025J66237J68965J04764
11925D2555420K28397Q1654K14198R2394j42905m3392j26047n7781j24473j7292
11915D2660173J11447j05934k49085l60435l53091j95067j68737l81311j82722
11906D0775238r8940k65995k35140l42967n50386o74793l60549l86464l93803
11897C7466201m07114l51851m78104m99292m01571m31400n06114n77702n38294
11888C3274759l39598l92575m39430m89880m71877n48696l50687l21753m11029
11879B9509234o12350n95259m66562l38963n03987m91035l36963m25928l60005
11870B5378182m77687m80785n87857l95384k44482l14169k67388l41844m41468
$$ plain form
11861 21827118 21380466 21075074 20774771 20474288 20123084 19656215 19353235 19061772 18906963
11852 18906963 18671991 18146499 17756663 17452467 17145853 16844210 16634907 16419021 16262592
11843 16262592 16096710 15759496 15430872 15266779 15095378 14844966 14531254 14466657 14184405
11834 14184405 13933762 13666866 13413842 13252279 13037266 12698580 12518904 12535235 12397600
11825 12397600 12188323 12107635 11884221 11634674 11500272 11294796 11217683 11058365 10921979 10769607
11815 10769607 10558128 10296641 10156148 10163422 10045681 9772750 9615536 9475012 9207406 9034081
11805 9034081 9127759 9167521 9004203 8787302 8697105 8418643 8123733 8009046 8128303 8144480
11795 8144480 7952663 7858851 7683513 7741386 7575062 7395660 7332769 7324501 7175327 7034754
$$ packed form
11861B1827118m46652l05392l00303l00483l51204m66869l02980k91463j54809
11852A8906963k34972n25492l89836l04196l06614l01643k09303k15886j56429
11843A6262592j65882l37214l28624j64093j71401k50412l13712o4597k82252
11834A4184405k50643k66896k53024j61563k15013l38686j79676J6331j37635
11825A2397600k09277q0688k23414k49547j34402k05476p7113j59318j36386j52372
11815A0769607k11479k61487j40493P274j17741k72931j57214j40524k67606j73325
11805I034081R3678L9762j63318k16901r0197k78462k94910j14687J19257J6177
11795H144480j91817r3812j75338N7873j66324j79402o2891q268j49174j40573
$$ plain form
11785 7034754 6870468 6851970 6882445 6883365 6796920 6555908 6382904 6243035 6269570 6188923 6112675
11774 6112675 6175980 6212761 6009171 5939530 5838142 5775074 5539693 5466656 5523385 5614056 5557835
11763 5557835 5548747 5504198 5391047 5175135 4989230 4841670 4856841 4964630 4945954 4866157
11753 4866157 4764430 4852732 4805814 4840471 4734884 4728099 4629639 4497748 4374860 4244513
11743 4244513 3952197 3867713 3950518 3919288 4155504 4390550 4289274 4272602 4225143 4103145
11733 4103145 4106308 3993000 3997931 3995250 4022161 3854898 3724507 3814326 3728043 3521311 3447436
11722 3447436 3462480 3602682 3685065 3525434 3533064 3609871 3600794 3466767 3359506 3317871 3305573
11711 3305573 3170836 3102360 2950974 3067609 3089738 2927308 2855056 2808984 2876010 2708009
$$ packed form
11785G034754j64286j8498L0475R20q6445k41012j73004j39869K6535q0647p6248
11774F112675O3305L6781k03590o9641j01388o3068k35381p3037N6729R0671n6221
11763E557835r088m4549j13151k15912j85905j47560J5171J07789j8676p9797
11753D866157j01727Q8302m6918L4657j05587o785r8460j31891j22888j30347
11743D244513k92316q4484Q2805l1230K36216K35046j01276j6672m7459j21998
11733D103145L163j13308M931k681K6911j67263j30391Q9819q6283k06732p3875
11722C447436J5044J40202Q2383j59631P630P6807r077j34027j07261m1635j2298
11711C305573j34737o8476j51386J16635K2129j62430p2252m6072O7026j68001
$$ plain form
11701 2708009 2679794 2596738 2689931 2848275 2803758 2827080 2800679 2824664 2823793 2717630 2666673
11690 2666673 2696533 2739862 2784457 2907206 2862640 2742181 2642911 2637214 2635679 2641197 2610888
11679 2610888 2642983 2614217 2588939 2474228 2319641 2298658 2276160 2438252 2436788 2229875 2198098
11668 2198098 2069454 2103626 2072228 1947691 2008487 2260622 2220440 2054324 2022303 2100082
11658 2100082 1958798 1973878 2016491 1910849 1795495 1888415 1980059 1929744 1708178 1705913 1966223
11647 1966223 2130299 2113059 2106743 2035583 1968136 1901077 1799639 1850602 1822213 1677673 1791411
11636 1791411 1908356 1906853 1729470 1832358 1997675 1987987 1710665 1508387 1439383 1573997
11626 1573997 1635035 1639334 1613352 1688502 1683347 1678962 1598234 1581873 1693812 1660362 1730405 1741946
$$ packed form
11701B708009k8215q3056R3193J58344m4517K3322k6401K3985q71j06163n0957
11690B666673K9860M3329M4595J22749m4566j20459r9270n697j535N518l0309
11679B610888L2095k8766k5278j14711j54587k0983k2498J62092j464k06913l1777
11668B198098j28644L4172l1398j24537O0796K52135m0182j66116l2021P7779
11658B100082j41284J5080M2613j05642j15354R2920R1644n0315k21566k265K60310
11647A966223J64076j7240o316p1160o7447o7059j01438N0963k8389j44540J13738
11636A791411J16945j503j77383J02888J65317r688k77322k02278o9004J34614
11626A573997O1038M299k5982P5150n155m385q0728j6361J11939l3450P0043J1541
$$ plain form
11614 1741946 1685999 1674196 1548989 1348913 1372544 1465236 1494175 1570557 1525650 1412385 1199504
11603 1199504 1199149 1381588 1440300 1498982 1470583 1443807 1421735 1554198 1550820 1419809 1288284
11592 1288284 1270723 1111079 996721 888373 983510 957264 877137 926252 1007403 1153964
11582 1153964 1238752 1211476 1156883 937187 1002330 992858 954762 1024413 1101934 1083229 1303568
11571 1303568 1337326 1117737 911760 1012947 1059751 1027023 994572 927750 763343 861016
11561 861016 1013187 1093346 1139233 923265 861070 918529 763635 751289 834586 1018779 938494
11550 938494 916998 1028785 899401 798502 921598 983482 958953 1130561 1216119 1093000
11540 1093000 1106641 1069874 1030832 973198 894990 1001048 1105863 1008440 847554 767943 752812
$$ packed form
11614A741946n5947j1803j25207k00076K3631R2692K8939P6382m4907j13265k12881
11603A199504l55J82439N8712N8682k8399k6776k2072J32463l378j31011j31525
11592A288284j7561j59644j14358j08348R5137k6246q0127M9115Q1151J46561
11582A153964Q4788k7276n4593k19696O5143r472l8096O9651P7521j8705K20339
11571A303568L3758k19589k05977J01187M6804l2728l2451o6822j64407R7673
11561H61016J52171Q0159M5887k15968o2195N7459j54894j2346Q3297J84193q0285
11550I38494k1496J11787j29384j00899J23096O1884k4529J71608Q5558j23119
11540A093000J3641l6767l9042n7634p8208J06058J04815r7423j60886p9611j5131
$$ plain form
11529 752812 830665 828711 886981 856329 779844 661780 832543 881688 957042 988014 960889
11518 960889 896243 1022841 951626 984931 1042776 989620 914194 906069 853797 775050 753689
11507 753689 875978 1080297 1037537 688752 596265 762883 766387 681438 564737 639814 729018
11496 729018 756321 717081 888638 1011243 854393 828334 829057 802939 623901 653093 840918
11485 840918 825063 860999 761557 891598 918319 820491 897623 872374 714961 650338 587604
11474 587604 577726 547074 373482 323710 154301 106658 227714 511420 702818 637316 641158
11463 641158 740900 853456 713604 692158 701305 733693 824149 719131 545608 381529 404578
11452 404578 360238 399763 535506 611290 599718 663594 737871 728289 651105 588190 590061 679242
$$ packed form
11529G52812P7853j954N8270l0652p6485j18064J70763M9145P5354L0972k7125
11518I60889o4646J26598p1215L3305N7845n3156p5426q125n2272p8747k1361
11507G53689J22289K04319m2760l48785r2487J66618L504q4949j16701P5077Q9204
11496G29018K7303l9240J71557J22605j56850k6059P23k6118j79038K9192J87825
11485H40918j5855L5936r9442J30041K6721r7828P7132k5249j57413o4623o2734
11474E87604r878l0652j73592m9772j69409m7643J21056K83706J91398o5502L842
11463F41158R9742J12556j39852k1446R147L2388R0456j05018j73523j64079K3049
11452D04578m4340L9525J35743P5784j1572O3876P4277r582p7184o2915J871Q9181
$$ plain form
11440 679242 655359 566282 472255 284278 249560 383585 502937 527887 410853 446360 514588
11429 514588 598778 593231 590517 554982 444894 358090 240269 98010 133963 332593 350638
11418 350638 307979 355748 458068 491157 425948 434431 419538 388469 317297 251800 128440
11407 128440 49329 31568 230685 349310 259669 363236 477560 376249 319388 367261
11397 367261 329084 262821 156171 111645 217404 253430 350281 445441 483178 591980 613866
11386 613866 508299 362150 304432 331785 446253 460218 313450 382227 416696 405990 337401
11375 337401 390424 620968 553573 390743 143875 105465 89859 261187 256340 146277 237386
11364 237386 172489 96204 243805 228289 177288 224863 332742 417059 438272 409412 414064
$$ packed form
11440F79242k3883q9077r4027j87977l4718J34025J19352K4950j17034L5507O8228
11429E14588Q4190n547k714l5535j10088q6804j17821j42259L5953J98630J8045
11418C50638m2659M7769J02320L3089o5209Q483j4893l1069p1172o5497j23360
11407A28440p9111j7761J99117J18625q9641J03567J14324j01311n6861M7873
11397C67261l8177o6263j06650m4526J05759L6026R6851R5160L7737J08802K1886
11386F13866j05567j46149n7718K7353J14468J3965j46768O8777L4469j0706o8589
11375C37401N3023K30544o7395j62830k46868l8410j5606J71328m847j10063R1109
11364B37386o4897p6285J47601j5516n1001M7575J07879Q4317K1213k8860M652
$$ plain form
11353 414064 274287 265109 359777 384662 430923 401634 337594 338001 371919 289328 178228 292791
11341 292791 369323 516344 540660 456264 456610 497997 418294 428949 468385 467361 329817 202561
11329 202561 287299 239262 155050 251302 346570 393315 426080 497285 372512 162718 -735
11318 -735 24568 103824 206213 206827 192092 110071 -56120 -13896 92046 210042 297858 423114
11306 423114 430805 505572 377340 99343 141554 76602 -56852 19712 138300 193338 323172
11295 323172 349562 348775 328600 363913 312024 282702 237638 44846 10402 82080 252853
11284 252853 220883 106432 23649 -27570 88841 157065 136793 128552 153183 171281 106010
11273 106010 17240 156829 421360 510447 422655 370608 422668 345109 108405 -32366 -17409
$$ packed form
11353D14064j39777r178R4668K4885M6261k9289o4040M07L3918q2591j11100J14563
11341B92791P6532J47021K4316q4396L46M1387p9703J0655L9436j024j37544j27256
11329B02561Q4738m8037q4212R6252R5268M6745L2765P1205j24773k09794j63453
11318g35K5303P9256J02389O14j4735q2021j66191M2224J05942J17996Q7816J25256
11306D23114P691P4767j28232k77997M2211o4952j33454P6564J18588N5038J29834
11295C23172K6390p87k0175L5313n1889k9322m5064j92792l4444P1678J70773
11284B52853l1970j14451q2783n1219J16411O8224k0272q241K4631J8098o5271
11273A06010q8770J39589K64531Q9087q7792n2047N2060p7559k36704j40771J4957
$$ plain form
11262 -17409 247529 253876 213119 232736 302227 282205 294715 236002 343302 405932 267640
11251 267640 282885 391285 330286 325313 203173 238515 386033 468343 558773 239947 42118
11240 42118 158995 323362 363606 336097 293187 200487 152420 46304 -64308 -134614 -192706
11229 -192706 -50147 103131 274617 289556 172408 168230 79992 153657 231587 333994 441649
11218 441649 506272 653438 781450 1022804 1162843 1051294 1072322 1285809 1722397 2248752
11208 2248752 3390658 5555570 8308506 11903631 14969532 16387984 16393427 15167523 12296037
11199 12296037 8791240 5755206 3987817 3001710 2356784 1848359 1611133 1429015 1302412
11190 1302412 1160780 1147052 1132325 1053804 981321 810411 495545 386592 417393 360088
$$ packed form
11262a7409K64938O347m0757J9617O9491k0022J2510n8713J07300O2630j38292
11251B67640J5245J08400o0999m973j22140L5342J47518Q2310R0430l18826j97829
11240D2118J16877J64367M0244k7509m2910r2700m8067j06116j10612p0306n8092
11229a92706J42559J53278J71486J4939j17148m178q8238P3665P7930J02407J07655
11218D41649O4623J47166J28012K41354J40039j11549K1028K13487M36588N26355
11208B248752J141906K164912K752936L595125L065901J418452N443j225904k871486
11199A2296037l504797l036034j767389r86107o44926n08425k37226j82118j26603
11190A302412j41632j3728j4727p8521p2483j70910l14866j08953L0801n7305
$$ plain form
11180 360088 274620 199084 186422 229989 155228 104658 114995 62918 126666 206861 208234 382537
11168 382537 313789 274252 191785 149761 147911 76765 144428 474809 448845 210201 165975
11157 165975 179570 156898 210870 89180 -226 171071 120269 -81963 -49972 57812 158482
11146 158482 139552 161550 72338 -129823 -40111 117260 33284 23927 -5509 -15135 -148379
11135 -148379 -316631 -286838 -61617 177845 315763 355759 132191 72048 -34077 -172333
11125 -172333 -198357 -199641 -48932 28324 -79132 -115002 -114564 46550 73640 121217 53994
11114 53994 189279 238806 232270 400581 419308 263778 142748 -88016 -42635 46390 39639
11103 39639 75143 82991 5616 -6245 -78227 -110588 -200162 -145186 -4360 22249 394 -4532
$$ packed form
11180C60088q5468p5536j2662M3567p4761n0570J0337n2077O3748Q0195J373J74303
11168C82537o8748l9537q2467m2024j850p1146O7663L30381k5964k38644m4226
11157A65975J3595k2672N3972j21690q9406J71297n0802k02232L1991J07784J00670
11146A58482j8930K1998q9212k02161Q9712J57371q3976r357k9436r626j33244
11135a48379j68252K9793K25221K39462J37918L9996k23568o0143j06125j38256
11125a72333k6024j284J50709P7256j07456l5870M38J61114K7090M7577o7223
11114E3994J35285M9527o536J68311J8727j55530j21030k30764M5381Q9025o751
11103C9639L5504P848p7375j1861p1982l2361q9574N4976J40826K6609k1855m926
$$ plain form
11091 -4532 -99279 -962 175935 144642 -45740 -38049 70990 204311 281727 244926 67240
11080 67240 7955 82720 238428 448838 393856 268192 203213 30404 121557 28291 -96405
11069 -96405 84134 206174 243382 310158 267540 75618 187955 398455 392157 311388 245453
11058 245453 250096 192111 -107682 -135436 29356 130946 92160 52495 66958 164427 333938
11047 333938 341517 255128 431758 469743 499866 605969 703797 663731 682686 759729 824481
11036 824481 1048432 1247118 1347214 1750715 1835389 1553858 1486725 1298466 1048854 1068719
11026 1068719 1047770 1077659 1520334 1909649 2212071 2345977 2266712 2030179 1665602 1325761
11016 1325761 1074901 1050105 1081884 1127890 1212316 1260047 1386576 1585552 1835316 1783146
$$ packed form
11091d532r4747R8317J76897l1293j90382P691J09039J33321P7416l6801j77686
11080F7240n9285P4765J55708K10410n4982j25664o4979j72809R1153r3266j24696
11069i6405J80539J22040L7208O6776m2618j91922J12337K10500o298q0769o5935
11058B45453M643n7985k99793k7754J64792J01590l8786l9665J4463R7469J69511
11047C33938P579q6389J76630L7985L0123J06103R7828m0066J8955P7043O4752
11036H24481K23951J98686J00096M03501Q4674k81531o7133j88259k49612J9865
11026A068719k0949K9889M42675L89315L02422J33906p9265k36533l64577l39841
11016A325761k50860k4796L1779M6006Q4426M7731J26529J98976K49764n2170
$$ plain form
11006 1783146 1511661 1135357 772222 617987 506263 467492 470283 528958 575154 836530
10996 836530 738845 485468 292437 246176 222102 231492 251317 188610 115946 10272 119009
10985 119009 -27294 -155769 -240255 -164135 -73181 -76652 44048 21970 -132802 -90060 -20283
10974 -20283 6947 -82435 -78977 -44228 -9899 130688 278181 262810 281212 381957 346365
10963 346365 515678 583530 758645 1012792 1247131 1506846 2028785 3207585 4912461
10954 4912461 7569971 10675250 12689134 13001321 12697429 12785131 12681593 10928542 7878727
10945 7878727 5156789 3306481 2309024 1883093 1462237 1189416 1120767 941665 804594
10936 804594 701628 603285 608601 600803 358209 262600 318135 374309 312586 225201 243857
$$ packed form
11006A783146k71485l76304l63135j54235j11724l8771K791N8675M6196K61376
10996H36530r7685k53377j93031m6261k4074R390J9825o2707p2664j05674J08737
10985A19009j46303j28475q4486P6120R0954l471J20700k2078j54772M2742O9777
10974b0283K7230q9382L458L4749L4329J40587J47493j5371J8402J00745l5592
10963C46365J69313O7852J75115K54147K34339K59715N21939J178800J704876
10954D912461K657510L105279K013884L12187l03892Q7702j03538j753051l049815
10945G878727k721938j850308r97457m25931m20856k72821o8649j79102j37071
10936H04594j02966r8343N316p798k42594r5609N5535N6174o1723q7385J8656
$$ plain form
10925 243857 149380 172348 71667 -75976 -152617 -132070 33445 201993 192687 164324 42913
10914 42913 -75798 -179764 -83861 -90506 -2907 -16630 -162704 -235656 -224366 -223025 -279912
10903 -279912 -267877 -112184 -25516 -128214 -93309 -53554 -116334 106634 411645 381663 65367
10892 65367 51753 214588 242912 216249 125501 -45561 -84528 -12369 154988 314673 321175
10881 321175 119653 94704 144935 179072 76557 -31089 -10687 68290 -29661 -99708 -189673
10870 -189673 -129824 -41178 36940 221860 327040 183562 151115 147632 174261 86545 -15640
10859 -15640 84086 115178 71366 138015 191610 320662 163521 157877 135259 114052 95818
10848 95818 20764 203403 230698 182488 87783 125903 147757 78003 57461 86276 38425
$$ packed form
10925B43857r4477K2968j00681j47643p6641K0547J65515J68548r306k8363j21411
10914D2913j18711j03966R5903o645Q7599j3723j46074p2952J1290J341n6887
10903b79912J2035J55693Q6668j02698L4905L9755o2780K22968L05011k9982l16296
10892F5367j3614J62835K8324k6663r0748j71062l8967P2159J67357J59685O502
10881C21175k01522k4949N0231L4137j02515j07646K0402P8977r7951p0047q9965
10870a89673N9849Q8646P8118J84920J05180j43478l2447l483K6629q7716j02185
10859a5640R9726L1092m3812O6649N3595J29052j57141n644k2618k1207j8234
10848I5818p5054J82639K7295m8210r4705L8120K1854o9754k0542K8815m7851
$$ plain form
10837 38425 -12504 13209 -44817 -23331 8893 26019 84242 99890 2869 31803 150955
10826 150955 233657 179884 135116 20651 -42885 -72924 -156391 69446 226046 200093 66177
10815 66177 7681 14533 -32408 -8941 34863 -65931 -36268 -64464 -123445 -11150 -146917
10804 -146917 -151216 -1488 -95300 -189233 -307375 -257161 -127014 15668 50387 -62511 -149220
10793 -149220 -363820 -407596 -271630 -227163 -306528 -425083 -465850 -261660 -332367 -437171
10783 -437171 -330040 -238894 -341761 -444181 -413554 -448456 -372484 -493647 -574490 -327646
10773 -327646 -170218 -360568 -274980 -260122 -286844 -332909 -488624 -595935 -643325 -424497
10763 -424497 -193580 -95684 -170529 -74002 63750 98642 156574 93209 -32292 105085 144981
$$ packed form
10837C8425n0929K5713n8026K1486L2224J7126N8223J5648r7021K8934J19152
10826A50955Q2702n3773m4768j14465o3536l0039q3467K25837J56600k5953j33916
10815F6177n8496O852m6941K3467M3804j00794K9663k8196n8981J12295j35767
10804a46917m299J49728r3812r3933j18142N0214J30147J42682L4719j12898q6709
10793a49220k14600m3776J35966M4467p9365j18555m0767K04190p0707j04804
10783d37171J07131R1146j02867j02420L0627l4902P5972j21163q0843K46844
10773c27646J57428j90350Q5588J4858k6722m6065j55715j07311m7390K18828
10763d24497K30917R7896p4845R6527J37752L4892N7932o3365j25501J37377L9896
$$ plain form
10752 144981 195291 151918 76454 166231 114045 -43260 -26474 115140 201378 300388 308539
10741 308539 230257 244953 113413 62636 2613 -1157 67317 126371 288081 457030 384386
10730 384386 490506 465688 204402 40844 -6192 -69334 -86423 48477 87191 194179
10720 194179 14408 -191064 -318772 -237038 -275504 -531889 -751929 -977325 -1033837 -864295
10710 -864295 -674825 -661124 -649178 -640619 -654510 -758196 -914883 -1130538 -1403882 -1337790 -1173503
10699 -1173503 -1247652 -1188330 -1170441 -1156655 -1201518 -1257715 -1271023 -1361940 -1326356 -1156967 -1046323
10688 -1046323 -983694 -951199 -1067104 -1325983 -1325168 -1238630 -1028856 -981729 -1005760 -1054084 -991991
10677 -991991 -909897 -681253 -682533 -771686 -933698 -1005065 -1081621 -1220853 -1218501 -1132897 -943960
$$ packed form
10752A44981N0310m3373p5464Q9777n2186j57305J6786J41614Q6238R9010Q151
10741C08539p8282J4696j31540n0777o0023l770O8474N9054J61710J68949p2644
10730C84386J06120k4818k61286j63558m7036o3142j7089J34900L8714J06988
10720A94179j79771k05472j27708Q1734l8466k56385k20040k25396n6512J69542
10710h64295J89470J3701J1946Q559j3891j03686j56687k15655k73344O6092J64287
10699a173503p4149N9322J7889J3786m4863n6197j3308r0917L5584J69389J10644
10688a046323O2629L2495j15905k58879Q15Q6538K09774M7127k4031m8324O2093
10677i91991Q2094K28644j280q9153j62012p1367p6556j39232K352Q5604J88937
$$ plain form
10666 -943960 -863394 -907016 -889372 -1019653 -1070585 -1063081 -945634 -760807 -731596 -678022 -652301
10655 -652301 -663036 -598997 -469745 -455424 -557787 -418155 -305528 -239391 -279230 -154017
10645 -154017 -63894 244686 417425 298880 452546 599988 780068 854395 1156307 1573064
10635 1573064 2193729 2766080 3502300 4471796 5409151 6200168 6550966 7151874 8137083
10626 8137083 9304306 10898720 13012930 15905105 19921182 25552803 33392965 43906747
10618 43906747 57768144 75300608 95395583 114858190 128422053 132144305 128091983
10611 128091983 121112931 115894457 115677695 122484185 137514378 162187799 196730511 237882794
10603 237882794 275939891 296838570 292796928 270279301 242920713 221837359 212196639
$$ packed form
10666i43960Q0566m3622J7644j30281n0932P504J17447J84827K9211N3574K5721
10655f52301j0735O4039J29252J4321j02363J39632J12627O6137l9839J25213
10645a54017R0123L08580J72739j18545J53666J47442J80080P4327L01912M16757
10635A573064O20665N72351P36220R69496R37355P91017L50798O00908R85209
10626H137083J167223J594414K114210K892175M016077N631621P840162J0513782
10618D3906747J3861397J7532464K0094975J9462607J3563863L722252m052322
10611A28091983o979052n218474k16762O806490J5030193K4673421L4542712M1152283
10603B37882794L8057097K0898679m041642k2517627k7358588k1083354r640720
$$ plain form
10596 212196639 215531758 232723927 264767814 310203762 362192500 405808719 420919434
10589 420919434 399096726 352320343 301350519 260263281 233737536 221760026 223057887
10582 223057887 236548232 259798982 286756646 306218394 305183577 279906770 240282682
10575 240282682 200137496 168371626 147127621 135027095 130547734 132257590 137866038
10568 137866038 144109678 146276862 140108326 124775771 104416147 84302081 67267483
10561 67267483 54071958 44599199 37570517 32131408 27764074 24496629 21801295 19517465
10553 19517465 17706551 16347139 15001070 13745462 12603675 11710509 10960797 10179590
10545 10179590 9481971 8942487 8632686 8192206 7657519 7324852 7003858 6610063 6318158
$$ packed form
10596B12196639L335119J7192169L2043887M5435948N1988738M3616219J5110715
10589D20919434k1822708m6776383n0969824m1087238k6525745j1977510J297861
10582B23057887J3490345K3250750K6957664J9461748j034817k5276807l9624088
10575B40282682m0145186l1765870k1244005j2100526m479361J709856N608448
10568A37866038O243640K167184o168536j5332555k0359624k0114066j7034598
10561F7267483j3195525r472759p028682n439109m367334l267445k695334k283830
10553A9517465j810914j359412j346069j255608j141787q93166p49712p81207
10545A0179590o97619n39484l09801m40480n34687l32667l20994l93795k91905
$$ plain form
10536 6318158 6034910 5793650 5604818 5446785 5346723 4995381 4795448 4724476 4706750 4495133
10526 4495133 4392464 4353705 4207100 4090272 3969144 3998628 3964607 3989816 3851741 3687565
10516 3687565 3548008 3540605 3573712 3545345 3486193 3263432 3195983 3275673 3180715 3199316 3269137
10505 3269137 3277857 3106810 2828302 3035713 3120157 3003287 2986715 2920553 2841403 2754882 2682514
10494 2682514 2623617 2623813 2734231 2762004 2688368 2737921 2762817 2830581 2889400 2843954 2882898
10483 2882898 3029913 3198675 3236385 3092494 3060542 3083708 3032011 2840611 2685811 2491760
10473 2491760 2224550 2233731 2296892 2299292 2538901 2761281 2742120 2662782 2620232 2382488 2121222
10462 2121222 1807638 1632323 1681949 1690948 1657808 1647026 1880578 1955693 1892654 1864023 1722673
$$ packed form
10536F318158k83248k41260j88832j58033j00062l51342j99933p0972j7726k11617
10526D495133j02669l8759j46605j16828j21128K9484l4021K5209j38075j64176
10516C687565j39557p403L3107k8367n9152k22761o7449P9690r4958J8601O9821
10505C269137Q720j71047k78508K07411Q4444j16870j6572o6162p9150q6521p2368
10494B682514n8897J96J10418K7773p3636M9553K4896O7764N8819m5446L8944
10483B882898J47015J68762L7710j43891l1952K3166n1697j91400j54800j94051
10473B491760k67210R181O3161K400K39609K22380j9161p9338m2550k37744k61266
10462B121222l13584j75315M9626Q999l3140j0782K33552P5115o3039k8631j41350
$$ plain form
10451 1722673 1490766 1297129 1166136 1072634 1011395 1129552 1155563 1097305 1004807 995546 959686
10440 959686 888866 776025 810878 787773 780404 603978 508017 548069 517991 695732 865060
10429 865060 847525 966411 1078241 1222708 1053287 1083544 1149442 943159 796642 722504
10419 722504 674153 771894 1053796 1177249 1105516 786120 671822 654390 662150 717238 877112
10408 877112 904883 975606 936491 1038287 1176800 1245372 1080373 880206 858032 981106
10398 981106 923663 993046 1008337 947785 786628 739506 755995 649996 584672 588290 563770
10387 563770 640750 759282 731898 631692 568573 474385 493535 524356 664052 657664 510007
10376 510007 315719 315709 395900 479586 345020 499404 519225 430258 398838 459288 524935
$$ packed form
10451A722673k31907j93637j30993r3502o1239J18157K6011n8258r2498r261l5860
10440I59686p0820j12841L4853k3105p369j76426r5961M0052l0078J77741J69328
10429H65060j7535J18886J11830J44467j69421L0257O5898k06283j46517p4138
10419G22504m8351R7741K81902J23453p1733l19396j14298j7432P760N5088J59874
10408H77112K7771P0723l9115J01796J38513O8572j64999k00167k2174J23074
10398I81106n7443O9383J5291o0552j61157m7122J6489j05999o5324L618k4520
10387E63770P6980J18532k7384j00206o3119r4188J9150L0821J39696o388j47657
10376E10007j94288j0Q0191Q3686j34566J54384J9821q8967l1420O0450O5647
$$ plain form
10365 524935 438163 440218 368367 282497 293379 449546 659125 717825 495126 380767 421281
10354 421281 316768 467613 592368 527041 422202 449750 327776 249782 309307 435183
10344 435183 496479 453865 452216 439023 573696 673039 682571 527949 179783 211256 325318
10333 325318 290668 229887 359031 382985 452107 476929 367673 382723 530176 478863 409174
10322 409174 416301 341112 246703 244711 225885 328723 469984 538674 348520 201875 196141
10311 196141 233742 166604 101793 186547 291393 531407 499269 454709 369633 426655 436396
10300 436396 218604 204932 230670 484823 282505 57536 88942 215006 189072 156699
10290 156699 71162 -1400 67828 -48272 -83568 -10990 73338 173105 225927 385385 365439
$$ packed form
10365E24935q6772K055p1851q5870J0882J56167K09579N8700k22699j14359M0514
10354D21281j04513J50845J24755o5327j04839K7548j21974p7994N9525J25876
10344D35183O1296m2614j649j3193J34673R9343R532j54622l48166L1473J14062
10333C25318l4650o0781J29144K3954O9122K4822j09256J5050J47453n1313o9689
10322D09174P127p5189r4409j992j8826J02838J41261O8690j90154j46645n734
10311A96141L7601o7138o4811Q4754J04846K40014l2138m4560q5076N7022R741
10300D36396k17792j3672K5738K54153k02318k24969L1406J26064k5934l2373
10290A56699q5537p2562O9228j16100l5296P2578Q4328R9767N2822J59458j9946
$$ plain form
10279 365439 493993 654879 544755 446828 485314 498313 387825 298458 233073 240923 426654
10268 426654 573520 605586 623569 633733 646738 626969 443482 346176 314040 409277 467988
10257 467988 433521 465007 463671 421515 439966 341133 302729 343774 413753 338797 400055 401422
10245 401422 461899 375975 357972 374830 485661 534564 524004 595055 637648 600006 615997
10234 615997 593640 598267 580333 420703 291832 257128 279890 297692 310276 320913 317186
10223 317186 391882 328007 452403 581979 670485 424863 247450 397369 395982 213657
10213 213657 183907 280900 428963 362856 356704 315710 353534 339010 444839 470880 424630
10202 424630 456960 482223 292494 281739 410335 459398 427772 380340 511146 627644 727439
$$ packed form
10279C65439J28554J60886j10124r7927L8486J2999j10488q9367o5385P850J85731
10268D26654J46866L2066J7983J0164J3005j9769j83487r7306l2136R5237N8711
10257D67988l4467L1486j336m2156J8451r8833l8404M1045O9979p4956O1258J367
10245D01422O0477q5924j8003J6858J10831M8903j0560P1051M2593l7642J5991
10234F15997k2357M627j7934j59630j28871l4704K2762J7802J2584J0637l727
10223C17186P4696o3875J24396J29576Q8506k45622j77413J49919j387j82325
10213B13657k9750R6993J48063o6107o152m0994L7824j4524J05829K6041m6250
10202D24630L2330K5263j89729j0755J28596M9063l1626m7432J30806J16498R9795
$$ plain form
10191 727439 603871 421430 388726 500702 550828 439917 429059 323706 420869 529158
10181 529158 614126 641591 732769 818914 1002050 969432 980925 1282184 1184986 1075961 1188516
10170 1188516 1486021 1486234 1517250 1636284 1824058 1941215 1906072 1687097 1456363 1382677
10160 1382677 1320336 1308792 1439151 1764233 2001143 2306474 2591845 2621773 2215522 1845940
10150 1845940 1782040 1786514 1740808 1693199 1685766 1561882 1645141 1994613 2121542 1958907 1663939
10139 1663939 1324715 1139789 1096471 932312 937941 896732 1010621 1072235 992105 986466 865360
10128 865360 661298 655093 480379 346063 408794 497645 395473 595674 552726 334144
10118 334144 346913 302289 378494 218025 60554 228651 306427 438439 409341 222764
$$ packed form
10191G27439j23568j82441l2704J11976N0126j10911j0858j05353R7163J08289
10181E29158Q4968K7465R1178Q6145J83136l2618J1493L01259r7198j09025J12555
10170A188516K97505K13L1016J19034J87774J17157l5143k18975k30734p3686
10160A382677o2341j1544J30359L25082K36910L05331K85371K9928m06251l69582
10150A845940o3900M474m5706m7609p433j23884Q3259L49472J26929j62635k94968
10139A663939l39224j84926m3318j64159N629m1209J13889O1614q0130n639j21106
10128H65360k04062o205j74714j34316O2731Q8851j02172K00201m2948k18582
10118C34144J2769m4624P6205j60469j57471J68097P7776J32012k9098j86577
$$ plain form
10108 222764 39343 -66623 5040 134853 198024 353629 325966 360381 307427 341836 411704
10097 411704 454705 576700 551068 470485 374296 198527 78457 268620 265233 78525 151278
10086 151278 139472 132084 45435 103706 304453 209032 53802 175298 177266 165663 86662
10075 86662 17865 71614 31712 28773 187104 112466 214292 260699 155393 134415 110715
10064 110715 212126 378459 678555 488130 339921 357116 419271 569367 512083 256196
10054 256196 152880 200039 391446 424921 309365 283508 189827 128315 213305 156787 21656
10043 21656 18649 -28492 92478 252355 272756 370487 381688 426598 126130 -9736 77264
10032 77264 190259 426763 520028 363519 210125 353401 451438 462834 485085 407797 513885
$$ packed form
10108B22764j83421j05966P1663J29813O3171J55605k7663L4415n2954L4409O9868
10097D11704M3001J21995k5632q0583r6189j75769j20070J90163l387j86708P2753
10086A51278j1806p388q6649N8271K00747r5421j55230J21496J968j1603p9001
10075H6662o8797N3749l9902k939J58331p4638J01826M6407j05306k0978k3700
10064A10715J01411J66333L00096j90425j48209J7195O2155J50096n7284k55887
10054B56196j03316M7159J91407L3475j15556k5857r3681o1512Q4990n6518j35131
10043B1656l007m7141J20970J59877K0401R7731J1201M4910l00468j35866Q7000
10032G7264J12995K36504R3265j56509j53394J43276R8037J1396K2251p7288J06088
$$ plain form
10021 513885 520015 395743 257095 206742 104923 187662 344949 199028 126105 201274 344874
10010 344874 345589 430719 516812 410843 254817 160010 8158 40542 149803 216199 113206
9999 113206 158762 254148 283932 134812 94944 69761 -3342 -158858 -95639 -7998 62558
9988 62558 201057 168471 102232 -20851 -78749 -47184 225007 323395 326020 283605 356358
9977 356358 283231 191447 212391 149474 57480 197511 222435 106674 49130 75832 120217
9966 120217 280020 266625 161050 148695 143214 56249 13991 95730 76700 30497 131229
9955 131229 211144 212380 184981 181480 161676 128059 18994 -3791 73561 94528 127688 127814
9943 127814 99986 125281 220451 202388 160349 -5246 171662 315098 385183 301030 251443
$$ packed form
10021E13885O130j24272j38648n0353j01819Q2739J57287j45921p2923P5169J43600
10010C44874P15Q5130Q6093j05969j56026r4807j51852L2384J09261O6396j02993
9999A13206M5556R5386K9784j49120l9868k5183p3103j55516O3219Q7641P0556
9988F2558J38499l2586o6239j23083n7898L1565K72191R8388K625m2415P2753
9977C56358p3127r1784K0944o2917r1994J40031K4924j15761n7544K6702M4385
9966A20217J59803j3395j05575j2355n481q6965m2258Q1739j9030m6203J00732
9955A31229P9915J236k7399l501j9804l3617j09065k2785P7352K0967L3160J26
9943A27814k7828K5295R5170j8063m2039j65595J76908J43436P0085q4153m9587
$$ plain form
9932 251443 290978 398264 417953 419519 433934 318716 193442 194247 238691 291329 66284
9921 66284 27932 183580 219379 281702 415433 293336 348152 395653 304409 186067 297575
9910 297575 408622 402232 246716 274451 125182 44027 153522 162919 -113698 -89244 118498
9899 118498 221173 199674 281894 327255 236435 92838 34089 -46662 73911 82628 83080 -111573
9887 -111573 -174306 -129660 150170 128972 80522 35860 23497 -140190 -165166 -52224 -3327
9876 -3327 63182 126726 66059 97146 78438 182614 188234 144430 50890 -46524 -51079 3677
9864 3677 532 75616 124353 147173 13033 -35547 -38859 124417 202322 140153 117048 85757
9852 85757 183916 194336 74560 61534 30839 -26857 -26445 99586 114454 58084 26091 97741
$$ packed form
9932B51443L9535J07286J9689J566J4415j15218j25274Q05M4444N2638k25045
9921F6284l8352J55648L5799O2323J33731j22097N4816M7501r1244j18342J11508
9910B97575J11047o390j55516K7735j49269q1155J09495R397k76617K4454K07742
9899A18498J02675k1499Q2220M5361r0820j43597n8749q0751J20573Q717M52j94653
9887a11573o2733M4646K79830k1198m8450m4662j2363j63687k4976J12942M8897
9876c327O6509O3544o0667L1087j8708J04176N620m3804r3540r7414m555N4756
9864C677l145P5084M8737K2820j34140m8580l312J63276P7905o2169k3105l1291
9852H5757R8159J0420j19776j3026l0695n7696M12J26031J4868n6370l1993P1650
$$ plain form
9840 97741 -9609 84677 133843 172313 303245 382510 295770 230739 156307 44762 54368
9829 54368 212963 279813 201090 217791 253156 75884 12552 150511 -13700 -140080 60896
9818 60896 216881 129791 -22348 -117752 -66908 47382 180669 126993 -109847 -146474 -197007
9807 -197007 -73989 -36869 -84553 -79588 -69546 -105489 -78189 103513 61245 159109 385531
9796 385531 315574 77872 124378 250507 306728 336752 427371 469944 575765 466225 455329
9785 455329 455342 527586 680185 786403 981613 1399480 2354063 3650174 5140094 6082541
9775 6082541 5720590 4260721 2752261 1740997 1206037 965902 673371 609603 594428
9766 594428 559724 516088 580245 531422 373832 220263 154000 77814 202528 253822 161749
$$ packed form
9840I7741j07350R4286M9166L8470J30932P9265q6740o5031p4432j11545R606
9829E4368J58595O6850p8723J6701L5365j77272o3332J37959j64211j26380K00976
9818F0896J55985q7090j52139r5404N0844J14290J33287n3676k36840l6627n0533
9807a97007J23018L7120m7684M965J0042l5943K7300J81702m2268R7864K26422
9796C85531o9957k37702M6506J26129N6221L0024R0619M2573J05821j09540j0896
9785D55329J3P2244J52599J06218J95210M17867R54583J296111J489920R42447
9775F082541l61951j459869j508460j011264n34960k40135k92531o3768j5175
9766E94428l4704m3636O4157m8823j57590j53569o6263p6186J24714N1294r2073
$$ plain form
9755 161749 295435 288531 204731 157709 206214 255188 168367 48646 49870 51004 58565 115355
9743 115355 133307 31395 -223903 -208201 -54284 101490 147604 60458 61681 203027 360167
9732 360167 303101 315519 191551 46365 61269 63798 164996 181707 165922 260077 339028
9721 339028 246459 63093 31050 5137 13927 -96425 -79399 89863 151711 103828 197177
9710 197177 -14286 -61280 -18832 -132661 -239301 -168688 -43419 -52162 65995 70891 -41437
9699 -41437 194303 170049 35863 -142638 -141943 104672 162389 -4015 -65757 82531 -92480
9688 -92480 -2665 264540 250713 114011 -139731 -175689 -14018 17274 169253 179231 16382
9677 16382 119556 116616 25639 6487 40489 70370 92534 21994 73141 133061 180155 197130
$$ packed form
9755A61749J33686o904q3800m7022M8505M8974q6821j19721J224J134P561N6790
9743A15355J7952j01912k55298J5702J53917J55774M6114q7146J223J41346J57140
9732C60167n7066J2418j23968j45186J4904K529J01198J6711j5785R4155P8951
9721C39028r2569j83366l2043k5913Q790j10352J7026J69262O1848m7883R3349
9710A97177k11463m6994M2448j13829j06640P0613J25269q743J18157M896j12328
9699d1437K35740k4254j34186j78501O95K46615N7717j66404o1742J48288j75011
9688i2480Q9815K67205j3827j36702k53742l5958J61671L1292J51979R978j62849
9677A6382J03174k940r0977j9152L4002K9881K2164p0540N1147N9920M7094J6975
$$ plain form
9665 197130 229403 274810 196823 111776 200066 108063 -14697 -26564 -124010 -90492 -46524
9654 -46524 54466 222663 269593 532178 524294 378813 131383 11654 165189 244965 199112
9643 199112 196506 9671 121378 170743 92357 192017 297578 89193 -83193 -98261 65065
9632 65065 -65328 -36025 95648 136941 86749 63699 178259 191821 217716 339941 277225
9621 277225 170660 243565 236455 150218 291120 380469 239183 120769 125620 23099 -75664
9610 -75664 35979 126930 124105 161303 284029 337543 342139 221420 162591 121699 -32938
9599 -32938 -103051 740 96180 210105 315969 195394 53262 3316 14082 -2970 21834
9588 21834 69173 22495 -118241 -171552 -329984 -390146 -136653 71305 9838 -151243 -127370
$$ packed form
9665A97130L2273M5407p7987q5047Q8290r2003j22760j1867r7446L3518M3968
9654d6524J00990J68197M6930K62585p884j45481k47430j19729J53535P9776m5853
9643A99112k606j86835J11707M9365p8386R9660J05561k08385j72386j5068J63326
9632F5065j30393K9303J31673M1293n0192k3050J14560J3562K5895J22225o2716
9621B77225j06565P2905p110q6237J40902Q9349j41286j18414M851j02521r8763
9610g5664J11643R0951k825L7198J22726N3514M596j20719n8829m0892j54637
9599c2938p0113J03791R5440J13925J05864j20575j42132m9946J0766j7052K4804
9588B1834M7339m6678j40736n3311j58432o0162K53493K07958o1467j61081K3873
$$ plain form
9577 -127370 -96598 -49742 125508 121666 173916 232889 247673 207067 54545 -70806 -75491
9566 -75491 -25081 -29692 -108074 -171009 -102153 -24027 -29124 -53598 -21093 -77464 -171665 -365171
9554 -365171 -359616 -234570 -31388 -89125 -233261 -104273 -21909 -129208 23136 170074
9544 170074 317211 298970 166163 277421 487804 395566 396895 324644 181260 150220 12552
9533 12552 96042 18602 -111482 -165915 -81544 1535 961 99692 91440 38495 -47994 63863
9521 63863 91866 133990 101729 -74716 -9201 -74581 -80888 -8099 51097 106196 165598 218911
9509 218911 288359 182425 75864 78332 49653 56669 43669 38134 226180 296989 259970 216670
9497 216670 142330 236305 182326 142608 208823 371631 373946 324603 283866 262957 200029 199602
$$ packed form
9577a27370L0772M6856J75250l842N2250N8973J4784m0606j52522j25351m685
9566g5491N0410m611p8382o2935O8856P8126n097k4474L2505n6371r4201j93506
9554c65171N555J25046K03182n7737j44136J28988Q2364j07299J52344J46938
9544A70074J47137j8241j32807J11258K10383r2238J329p2251j43384l1040j37668
9533A2552Q3490p7440j30084n4433Q4371Q3079n74R8731q252n2945q6489J11857
9521F3863K8003M2124l2261j76445O5515o5380o307P2789N9196N5099N9402N3313
9509B18911O9448j05934j06561K468k8679P016j3000n535J88046P0809l7019m3300
9497B16670p4340R3975n3979l9718O6215J62808K315m9343m0737k0909o2928m27
$$ plain form
9485 199602 249211 62789 -39096 -25595 -22002 3623 166386 235895 261500 77150 -154523
9474 -154523 -25782 166326 131017 26751 119825 296680 371056 305105 284409 303616 349122
9463 349122 291605 167951 192286 73444 -77267 -54295 -128980 -96973 -188004 -197965 -102118
9452 -102118 106806 189501 171842 153371 130074 148246 121436 8783 48833 33809 123901
9441 123901 663 30440 70493 113292 6148 -16905 15137 60496 141738 48750 6037
9430 6037 11468 -77941 -283346 -159054 -118269 -81126 59387 108374 199841 129575 -47201
9419 -47201 -156277 -235081 -473255 -450677 -140288 -16592 -97392 -14412 86844 102683 190365
9408 190365 16607 92027 137313 342227 261629 228966 284982 35720 -35227 -39748 85573
$$ packed form
9485A99602M9609j86422j01885J3501L593K5625J62763O9509K5605j84350k31673
9474a54523J28741J92108l5309j04266R3074J76855P4376o5951k0696J9207M5506
9463C49122n7517j23654K4335j18842j50711K2972p4685L2007r1031r961R5847
9452a02118K08924Q2695j7659j8471k3297J8172k6810j12653M0050j5024R0092
9441A23901j23238K9777M0053M2799j07144k3053L2042M5359Q1242r2988m2713
9430F037N431q9409k05405J24292M0785L7143J40513M8987R1467p0266j76776
9419d7201j09076p8804k38174K2578L10389J23696q0800Q2980J01256J5839Q7682
9408A90365j73758P5420M5286K04914q0598l2663N6016k49262p0947m521J25321
$$ plain form
9397 85573 119469 155877 214724 74798 -5068 39160 -17213 124030 130873 -82882 -198229
9386 -198229 -144145 -99706 -116894 -135072 -242605 -211147 3725 -20374 -48331 -94606 -176457
9375 -176457 -99664 -100788 -143187 -152631 -168440 -24957 43064 113401 -5843 -50733 58590
9364 58590 94267 202653 186106 88288 -43952 -54406 211480 281080 158553 -26511 -53478
9353 -53478 18289 -56273 -137067 -136258 -116730 -103455 -133846 84327 121058 7346 82316 50288
9341 50288 -76610 -20581 -23874 107830 157967 253974 304291 142128 112375 52987 189441
9330 189441 338296 471853 470327 326793 228424 242610 73160 -124615 -205632 -56242 44892
9319 44892 -24214 19505 18081 49616 117414 37164 76880 61433 -80909 -100880 -123084 -11665
$$ packed form
9397H5573L3896L6408N8847j39926p9866M4228n6373J41243O843k13755j15347
9386a98229N4084M4439j7188j8178j07533L1458K14872k4099k7957m6275q1851
9375a76457P6793j124m2399r444j5809J43483O8021P0337j19244m4890J09323
9364E8590L5677J08386j6547r7818j32240j0454K65886O9600j22527j85064k6967
9353e3478P1767p4562q0794Q09J9528J3275l0391K18173L6731j13712P4970l2028
9341E0288j26898N6029l293J31704N0137R6007N0317j62163k9753n9388J36454
9330A89441J48855J33557j526j43534r8369J4186j69450j97775q1017J49390J01134
9319D4892o9106M3719j424L1535O7798q0250L9716j5447j42342j9971k2204J11419
$$ plain form
9307 -11665 -115144 -167997 -22728 41997 204081 249293 138038 83138 -46087 -11762 53642
9296 53642 138109 345985 364449 193700 93347 -98675 -29147 192595 323020 292918 252405
9285 252405 113230 136226 323323 178401 190983 277563 397705 281964 153356 13562
9275 13562 -108031 -256373 -126194 -57435 -82425 -33084 -47541 139638 119120 -15047 -76849
9264 -76849 32896 113186 -102041 -34622 194322 152486 17446 -165368 -209774 -55451 42722
9253 42722 74277 -30101 -37125 -79093 102213 253080 260112 129866 197863 132270 -25467
9242 -25467 -146105 -54644 154932 123868 5742 1108 -188973 -192755 -61800 67463 61137
9231 61137 32997 92737 166095 119643 73976 78724 143497 293068 186766 -31821 -220687
$$ packed form
9307a1665j03479n2853J45269O4725J62084M5212j11255n4900j29225L4325O5404
9296E3642Q4467K07876J8464j70749j00353j92022O9528K21742J30425l0102m0513
9285B52405j39175K2996J87097j44922J2582Q6580J20142j15741j28608j39794
9275A3562j21593j48342J30179O8759k4990M9341j4457J87179k0518j34167o1802
9264g6849J09745Q0290k15227O7419K28944m1836j35040j82814m4406J54323R8173
9253D2722L1555j04378p024m1968J81306J50867P032j30246O7997o5593j57737
9242b5467j20638R1461K09576l1064j18126m634j90081l782J30955J29263o326
9231F1137k8140N9740P3358m6452m5667M748O4773J49571j06302k18587j88866
$$ plain form
9220 -220687 -131030 -76347 16108 -44701 -63325 -39787 -94534 -167456 -111140 -84617 68226
9209 68226 106720 19120 -142508 -182742 -69967 7656 127323 169764 30765 -68649 -33025
9198 -33025 -76364 -78761 -132395 -97341 -29206 -58947 -106162 -146016 -124339 -94170 40345 18283
9186 18283 64832 111423 175105 148027 45195 119024 68042 26672 229963 272306 160417
9175 160417 -74668 -118683 -84192 28474 97760 161309 32463 -49581 -117400 14555 -108027
9164 -108027 -245465 -254749 -114983 63207 -19004 -147041 -80804 30686 21723 -85186 -109269
9153 -109269 -171386 10860 45856 26521 58467 22509 -52235 -263475 -375812 -272171 -16455
9142 -16455 32599 -16342 6212 21869 43127 87727 -24283 105318 107157 55582 -247334
$$ packed form
9220b20687Q9657N4683R2455o0809j8624K3538n4747p2922N6316K6523J52843
9209F8226L8494q7600j61628m0234J12775P7623J19667M2441j38999r9414L5624
9198c3025m3339k397n3634L5054O8135k9741m7215l9854K1677L0169J34515k2062
9186A8283M6549M6591O3682k7078j02832P3829n0982m1370K03291M2343j11889
9175A60417k35085m4015L4491J12666O9286O3549j28846q2044o7819J31955j22582
9164a08027j37438r284J39766J78190q2211j28037O6237J11490q963j06909k4083
9153a09269o2117J82246L4996j9335L1946l5958p4744k11240j12337J03641K55716
9142a6455M9054m8941K2554J5657K1258M4600j12010J29601J839n1575l02916
$$ plain form
9131 -247334 -315582 -68749 72262 75427 129652 131530 91027 2614 53095 278899 311980
9120 311980 216428 -51057 -203223 -150397 -97424 56427 49435 85707 106443 -49571 73165
9109 73165 7185 -10704 -99602 -4084 42857 42831 -53961 16096 138913 28701 12994 -3120
9097 -3120 131644 100414 79967 8970 -108817 -154304 -73860 -43347 103854 242137 121968
9086 121968 137263 337198 467723 305362 147454 205691 285851 91621 269710 421970
9076 421970 204591 -72064 -121090 -152658 -189880 7323 5798 45879 139626 101864 -98451
9065 -98451 -139738 -22263 107196 76142 19289 -102869 -104172 26115 -152278 -145539 -49049
9054 -49049 -16646 -13580 13353 -5827 -132589 -113124 19419 131806 241800 254035 173047
$$ packed form
9131b47334o8248K46833J41011L165N4225J878m0503q8413N0481K25804L3081
9120C11980r5552k67485j52166N2826N2973J53851o992L6272K0736j56014J22736
9109G3165o5980j7889q8898R5518M6941k6r6792P0057J22817j10212j5707j6114
9097c120J34764l1230k0447p0997j17787m5487Q0444L0513J47201J38283j20169
9086A21968J5295J99935J30525j62361j57908N8237Q0160j94230J78089J52260
9076D21970k17379k76655m9026l1568l7222J97203j525M0081R3747l7762k00315
9065i8451m1287J17475J29459l1054n6853j22158j303J30287j78393O739R6490
9054d9049L2403L066K6933j9180j26762J9465J32543J12387J09994J2235q0988
$$ plain form
9043 173047 34386 146008 256144 277832 267258 96627 49209 104807 180585 156906 -117460
9032 -117460 -137999 -27373 84295 -75696 -289721 -182855 -47866 -18768 33782 -105564
9022 -105564 -268928 -299018 -339970 -127292 -39813 -130651 -96950 7787 277420 323983 200539
9011 200539 -3352 -141101 -307029 -388701 -227872 -134910 -157133 104389 313830 205103
9001 205103 62485 -112468 -267714 -339118 -184965 -63194 20987 -25842 12589 180667
8991 180667 107776 -59993 -157144 -290876 -182533 17336 111520 59531 78516 16338 10246
8980 10246 -44433 -143174 -151349 -99852 -75238 -132758 -55626 135003 193253 124533 78563 -82571
8968 -82571 -12212 99893 -52695 -147479 -20258 136612 31762 -53559 -12910 -85390 -37284
$$ packed form
9043A73047j38661J11622J10136K1688j0574j70631m7418N5598P5778k3679k74366
9032a17460k0539J10626J11668j59991k14025J06866J34989K9098N2550j39346
9022a05564j63364l0090m0952K12678Q7479r0838L3701J04737K69633M6563j23444
9011B00539k03891j37749j65928q1672J60829R2962k2223K61522K09441j08727
9001B05103j42618j74953j55246p1404J54153J21771Q4181m6829L8431J68078
8991A80667p2891j67769r7151j33732J08343J99869R4184n1989J8985o2178o092
8980A0246n4679r8741q175N1497K4614n7520P7132J90629N8250o8720m5970j61134
8968h2571P0359J12105j52588r4784J27221J56870j04850q5321M0649p2480M8106
$$ plain form
8957 -37284 -143468 -19031 23337 -32583 -57973 -77324 -110535 -194022 -179994 9748 58866
8946 58866 -28603 -94085 -47467 -129054 -70432 -47723 56153 168575 117810 63136 44807
8935 44807 -39759 -194572 -127697 -108050 65624 136094 -21497 -34571 -7052 102161 234565
8924 234565 191105 188540 131770 -52230 -122147 -50756 -100304 -122344 -136391 -183268 -311693
8913 -311693 -238276 14388 226792 149997 146657 -59232 -137948 -112452 -182501 34909 122071
8902 122071 221863 225177 172768 272275 214587 14651 138948 281899 367652 337796 221466
8891 221466 -9337 4642 10999 -127647 -10402 -73389 72100 80464 43399 -73729 17726
8880 17726 151405 122222 113624 163716 155650 182815 46163 -62932 -55144 -73563 -194378 -236492
$$ packed form
8957c7284j06184J24437M2368n5920k5390j9351l3211q3487J4028J89742M9118
8946E8866q7469o5482M6618q1587N8622K2709J03876J12422n0765n4674j8329
8935D4807q4566j54813O6875J9647J73674P0470j57591j3074K7519J09213J32404
8924B34565m3460k565n6770j84000o9917P1391m9548k2040j4047m6877j28425
8913c11693P3417K52664K12404p6795l340k05889p8716K5496p0049K17410Q7162
8902A22071R9792L314n2409R9507n7688j99936J24297J42951Q5753k9856j16330
8891B21466k30803J3979O357j38646J17245o2987J45489Q364l7065j17128R1455
8880A7726J33679k9183q598N0092q066K7165j36652j09095P788j8419j20815m2114
$$ plain form
8868 -236492 -184894 -234792 -484993 -432391 -254812 -83929 -181435 -40698 115139 79519 151146
8857 151146 81269 90725 -14887 -64409 -5592 37822 -32595 -37024 3177 137091 185429 45734
8845 45734 9537 -171339 -403263 -391762 -240740 -87278 -122383 -238653 -115242 -27630 -78903
8834 -78903 -91469 -9159 -125463 16255 117089 23785 -15272 -155506 -77298 -74468 -202445
8823 -202445 -192389 -19812 76105 40518 167694 -44883 -212396 -158748 -203181 -217390 -169933
8812 -169933 -222222 -170376 -99227 -123375 -144233 -199337 -12308 231116 174098 99608 -10108
8801 -10108 165173 135333 100499 245253 310272 167168 5741 46310 233361 415926 238542
8790 238542 276011 423628 431548 339509 219471 226690 373322 312755 255210 194368 156846
$$ packed form
8868b36492N1598m9898k50201N2602J77579J70883r7506J40737J55837l5620P1627
8857A51146o9877R456j05612m9522N8817M3414p0417m429M0201J33914M8338j39695
8845D5734l6197j80876k31924J1501J51022J53462l5105j16270J23411Q7612n1273
8834g8903j2566Q2310j16304J41718J00834r3304l9057j40234P8208K830j27977
8823b02445J0056J72577R5917l5587J27176k12577j67513N3648m4433j4209M7457
8812a69933n2289N1846P1149k4148k0858n5104J87029K43424n7018p4490j09716
8801a0108J75281k9840l4834J44754O5019j43104j61427M0569J87051J82565j77384
8790B38542L7469J47617P920r2039j20038P219J46632o0567n7545o0842l7522
$$ plain form
8779 156846 96711 81288 106163 -17237 -200 161820 90909 69549 61191 -6740 -143559
8768 -143559 -71475 -35920 -68942 -107276 -160342 -117523 -127899 -189010 -120209 -164942 -311272
8757 -311272 -204277 -239184 -173917 -41663 -172709 -121806 19470 129126 167687 81656 129137
8746 129137 408288 661641 741715 800514 631497 303412 92812 203635 315545 243412
8736 243412 107782 178231 365339 476436 291343 100035 158070 18620 -70629 -91837
8726 -91837 -3848 128671 182501 202290 230019 162972 231962 294805 298598 179157 105727 175638
8714 175638 54871 -76319 -177060 -86915 -74144 -162572 35388 93903 25259 -81873 -84310
8703 -84310 8239 -19789 -48774 124422 381901 326807 348426 339012 91987 101760 -50860
$$ packed form
8779A56846o0135j5423K4875j23400J7037J62020p0911k1360q358o7931j36819
8768a43559P2084L5555l3022l8334n3066M2819j0376o1111O8801m4733j46330
8757c11272J06995l4907O5267J32254j31046N0903J41276J09656L8561q6031M7481
8746A29137K79151K53353Q0074N8799j69017l28085k10600J10823J11910p2133
8736B43412j35630P0449J87108J11097j85093j91308N8035j39450q9249k1208
8726i1837Q7989J32519N3830J9789K7729o7047O8990O2843L793j19441p3430O9911
8714A75638j20767j31190j00741R0145J2771q8428J97960N8515o8644j07132k437
8703h4310R2549k8028k8985J73196K57479n5094K1619r414k47025R773j52620
$$ plain form
8692 -50860 -122545 -50279 -42976 -198582 -169768 -111747 -114656 -159139 -108937 -99865 -166911 -232873
8680 -232873 -184707 -131872 -29035 156527 129696 107527 -24206 -133340 -116742 21706 19706
8669 19706 19286 40370 -6063 -49711 -10349 -106941 -248229 -265008 -185953 -236372 -334208 -486188
8657 -486188 -431513 -262960 57389 105534 -74868 -129728 -129766 -149510 -139070 -110529 -74128 -83939
8645 -83939 -41212 46313 67746 57215 -76310 -53273 -161817 -197573 -88886 -78996 37972
8634 37972 249584 364112 93989 -56060 -94692 -48781 -22535 -111778 -50835 46420 132156
8623 132156 124981 254626 243227 196583 28954 -61667 -53019 85989 96384 135807 139669 108675
8611 108675 46942 -117811 -301229 -247513 -221545 -318810 -346955 -187792 -89372 -63574 113289
$$ packed form
8692e0860p1685P2266P303j55606K8814N8021k909m4483N0202R072o7046o5962
8680b32873M8166N2835J02837J85562k6831k2169j31733j09134J6598J38448k000
8669A9706m20K1084m6433m3648L9362r6592j41288j6779P9055n0419r7836j51980
8657d86188N4675J68553L20349M8145j80402n4860l8j9744J0440K8541L6401r811
8645h3939M2727Q7525K1433j0531j33525K3037j08544l5756J08687R890J16968
8634C7972K11612J14528k70123j50049l8632M5911K6246q9243O0943R7255Q5736
8623A32156p175J29645j1399m6644j67629r0621Q648J39008J0395L9423L862l0994
8611A08675o1733j64753j83418N3716K5968r7265k8145J59163R8420K5798J76863
$$ plain form
8600 113289 44756 29035 -100666 -214635 -45106 -30397 -37291 -164289 -254648 -110534 -115993
8589 -115993 -47522 -109997 -28685 -92986 -136667 -170761 -238759 -136494 26035 76981 73642
8578 73642 55381 97455 93018 11273 27161 -86861 68422 191497 104142 43148 38665 -56257
8566 -56257 15783 -95851 -219742 -264170 -240735 -131812 -5009 -177806 -201938 -206014 -163297
8555 -163297 -40813 -180561 -236543 -110844 -96495 -77597 -40536 -130357 -45509 28436 -88373
8544 -88373 -155899 65030 192452 126247 -51586 -91731 -16119 69294 81469 187824 276380
8533 276380 218966 282067 503578 918620 1381756 1359064 1066586 683141 394512 285647
8523 285647 246946 202493 462942 349540 196763 247968 138671 -23766 18192 -60987 -79248
$$ packed form
8600A13289o8533j5721j29701j13969J69529J4709o894j26998r0359J44114n459
8589a15993O8471o2475Q1312o4301m3681l4094o7998J02265J62529N0946l339
8578G3642j8261M2074m437q1745J5888j14022J55283J23075q7355o0994m483r4922
8566e6257P2040j11634j23891m4428K3435J08923J26803j72797k4132m076M2717
8555a63297J22484j39748n5982J25699J4349J8898L7061q9821Q4848P3945j16809
8544h8373o7526K20929J27422o6205j77833m0145P5612Q5413J2175J06355Q8556
8533B76380n7414O3101K21511M15042M63136k2692k92478l83445k88629j08865
8523B85647l8701m4453K60449j13402j52777N1205j09297j62437M1958p9179j8261
$$ plain form
8512 -79248 -76815 -83777 -103544 35134 72182 55717 123331 234476 222069 193337 157024 101418
8500 101418 151178 166850 100399 -13035 -192491 -120437 -116455 33274 113907 102836 216985
8489 216985 281939 392938 736575 1161261 1941858 2714330 2658279 1948101 1259212 750948
8479 750948 596671 534095 497007 533240 361838 193883 130867 125807 129520 272673 234749
8468 234749 220667 113899 38238 195421 155418 140341 143753 125989 -65736 -113629 -282580
8457 -282580 -223453 -70471 -10274 91029 30778 -15586 -22700 -63616 -121092 137506 196911
8446 196911 247551 256360 366554 519493 839861 1290422 1512039 1553350 1536734 1247776 1002847
8435 1002847 876044 634567 433672 374275 176829 -77721 -50586 104333 312375 458742
$$ packed form
8512g9248K433o962j9767J38678L7048j6465O7614J11145j2407k8732l6313n5606
8500A01418M9760J5672o6451j13434j79456P2054L982J49729Q0633j1071J14149
8489B16985O4954J10999L43637M24686P80597P72472n6051p10178o88889n08264
8479G50948j54277o2576l7088L6233j71402j67955o3016n060L713J43153l7924
8468B34749j4082j06768p5661J57183m0003j5077L412j7764j91725m7893j68951
8457b82580N9127J52982O0197J01303o0251m6364p114m0916n7476K58598N9405
8446A96911N0640Q809J10194J52939L20368M50561K21617M1311j6616k88958k44929
8435A002847j26803k41477k00895n9397j97446k54550K7135J54919K08042J46367
$$ plain form
8425 458742 346895 299157 317020 267756 15809 59561 141684 139633 107240 118737 128828
8414 128828 99152 130921 177905 8077 94320 -21331 23604 78470 -35177 46687 59333
8403 59333 116364 -1220 5626 178960 185913 -20574 -11622 28585 159325 191079 170669 189428
8391 189428 117163 194777 52924 138968 195069 101806 257032 167783 126316 35031 -202418
8380 -202418 -245940 -153653 -161748 -170498 -105335 -134569 -49656 78396 44890 21358 164811 182648
8368 182648 13975 -83886 -187855 -115640 90771 159141 199204 160582 223658 205737 101252
8357 101252 42152 80069 189587 15439 -206100 -76848 32219 -9939 -48226 -36815 -5479
8346 -5479 -14342 140213 136488 -3295 93953 443403 519920 478202 273223 185437 210039 169972
$$ packed form
8425D58742j11847m7738J7863m9264k51947M3752Q2123k051l2393J1497J0091
8414A28828k9676L1769M6984j69828Q6243j15651M4935N4866j13647Q1864J2646
8403E9333N7031j17584O846J73334O953k06487Q952M0207J30740L1754k0410J8759
8391A89428p2265P7614j41853Q6044N6101r3263J55226q9249m1467r1285k37449
8380b02418m3522R2287q095q750O5163k9234Q4913J28052l3506k3532J43453J7837
8368A82648j68673r7861j03969P2215K06411O8370M0063l8622O3076j7921j04485
8357A01252n9100L7917J09518j74148k21539J29252J09067m2158l8287J1411L1336
8346e479q863J54555l725j39783R7248L49450P6517m1718k04979q7786K4602m0067
$$ plain form
8334 169972 99597 -12466 -180938 -290512 -168286 125528 310492 292346 34714 -10805
8324 -10805 48208 73030 108228 74172 -78763 -54635 -15054 21226 29050 24302 -75872 -27808
8312 -27808 63679 83089 133664 151090 234169 345985 212592 174959 151137 153713 143785 366703
8300 366703 512141 557598 536759 446385 254653 143377 -27080 -105677 -59047 6944 133388
8289 133388 175511 60951 10038 -12077 43586 81860 -30310 -66213 112573 227034 304069
8278 304069 251834 -1842 -119359 10475 13895 -21363 -34190 -93600 -117347 -70280 4205
8267 4205 130427 307882 366670 280791 190983 -25360 -73466 -54209 106951 196052 239161
8256 239161 84892 66267 40431 58938 -19211 -65667 -123676 -157852 -146716 -184520 -229926
$$ packed form
8334A69972p0375j12063j68472j09574J22226K93814J84964j8146k57632m5519
8324a0805N9013K4822L5198l4056j52935K4128L9581L6280P824m748j00174M8064
8312b7808R1487J9410N0575J7426Q3079J11816j33393l7633k3822K576r928K22918
8300C66703J45438M5457k0839r0374j91732j11276j70457p8597M6630O5991J26444
8289A33388M2123j14560n0913k2115N5663L8274j12170l5903J78786J14461P7035
8278C04069n2235k53676j17517J29834L420l5258j2827n9410k3747M7067P4485
8267D205J26222J77455N8788q5879q9808k16343m8106J9257J61160Q9101M3109
8256B39161j54269j8625k5836J8507p8149m6456n8009l4176J1136l7804m5406
$$ plain form
8245 -229926 -120163 -53043 74452 179716 138639 10443 -138982 -158971 -97799 26184
8235 26184 40485 -91427 -190962 -129451 -55749 50630 5151 -7524 141419 237629 -5497
8224 -5497 -99196 -26745 -72384 -84392 -142291 -152593 -139793 -148013 13874 4294 13697 19402 -13068
8211 -13068 48665 65558 19369 -34441 -86024 -39388 140260 190961 29307 110943 48560
8200 48560 -62951 -158518 -102846 138150 117621 115287 -31051 -100595 -151778 -123163 -59954
8189 -59954 24660 87390 -163180 -38413 88925 46167 24431 31148 32445 -144888 -118901
8178 -118901 86605 57068 -79911 -155683 -196092 -153783 7821 -185747 -157624 -56029 -75191
8167 -75191 -137640 -134911 -225219 -144643 22470 89453 148316 -125415 -196566 -42469 -77872
$$ packed form
8245b29926J09763O7120J27495J05264m1077j28196j49425j9989O1172J23983
8235B6184J4301j31912r9535O1511P3702J06379m5479j2675J48943R6210k43126
8224e497r3699P2451m5639j2008n7899j0302J2800q220J61887r580R403N705l2470
8211a3068O1733J6893m6189n3810n1583M6636J79648N0701j61654Q1636o2383
8200D8560j11511r5567N5672K40996k0529k334j46338o9544n1183K8615O3209
8189e9954Q4614O2730k50570J24767J27338m2758k1736O717J297j77333K5987
8178a18901K05506k9537j36979p5772m0409M2309J61604j93568K8123J01595j9162
8167g5191o2449K729r0308Q0576J67113O6983N8863k73731p1151J54097l5403
$$ plain form
8156 -77872 -250736 -204462 -280131 -235294 -252659 -84384 26504 -65399 -157061 -100346 48439
8145 48439 138602 174793 243634 117538 -23345 -131777 -85166 -133352 -127630 -98124 -198548
8134 -198548 -86498 -63220 -78589 -112593 -40554 -156893 -213928 -178569 -189513 -136641 29582
8123 29582 24217 -17564 -44886 -17844 -70630 -58598 -61688 10746 167939 135508 10093 12380
8111 12380 -51939 -47677 -124340 -234811 -213100 -111575 56213 92730 118190 -13333 -223516
8100 -223516 -299502 -165157 -145717 -98410 -188694 -278407 -182442 10489 158734 201821 20701
8089 20701 -185383 -342106 -236774 -13868 -44488 -73139 44912 135140 59659 -25866 769
8078 769 2278 56292 91976 181689 160302 -13665 -117941 21852 131895 78373 19206 -14380
$$ packed form
8156g7872j72864M6274p5669M4837j7365J68275J10888r1903r1662N6715J48785
8145D8439R0163L6191O8841j26096j40883j08432M6611m8186N722K9506j00424
8134a98548J12050K3278j5369l4004P2039j16339n7035L5359j0944N2872J66223
8123B9582n365m1781k7322K7042n2786J2032l090P2434J57193l2431j25415K287
8111A2380o4319M262p6663j10471K1711J01525J67788L6517K5460j31523k10183
8100b23516p5986J34345J9440M7307r0284q9713R5965J92931J48245M3087j81120
8089B0701k06084j56723J05332K22906l0620k8651J18051R0228p5481q5525K6635
8078G69J509N4014L5684Q9713k1387j73967j04276J39793J10043n3522n9167l3586
$$ plain form
8066 -14380 -111555 -256006 -307351 -215790 -76411 163275 55470 44256 240741 205405 60127
8055 60127 136492 91917 146749 233243 333051 369137 254558 224071 141391 4061 -7528
8044 -7528 11899 -103887 29503 72839 42177 -18986 -19867 15654 -36887 -57427 -182747 -150110
8032 -150110 -231422 -213594 -239992 -222202 -335340 -241069 133614 193090 210134 -55079 -151645
8021 -151645 -121008 -114410 -83879 4194 80065 -27288 29938 76830 50941 -128883 -42889
8010 -42889 144750 186173 190134 186112 142907 13494 -56539 -41223 -38441 -4494 31392 126460
7998 126460 -29548 -124921 -203100 -272925 -155152 -138887 -185445 -68616 4739 -43450 -73127
7987 -73127 -116286 -163553 -177703 -100958 -95918 -76430 -101999 -175500 -231203 -168999 -63302 59052
$$ packed form
8066a4380r7175j44451n1345R1561J39379K39686j07805j1214J96485l5336j45278
8055F0127P6365m4575N4832Q6494R9808L6086j14579l0487q2680j37330j1589
8044g528J9427j15786J33390M3336l0662o1163q81L5521n2541k0540j25320L2637
8032a50110q1312J7828k6398J7790j13138R4271L74683N9476J7044k65213r6566
8021a51645L0637O598L0531Q8073P5871j07353N7226M6892k5889j79824Q5994
8010d2889J87639M1423L961m022m3205j29413p0033J5316K782L3947L5886R5068
7998A26460j56008r5373p8179o9825J17773J6265m6558J16829P3355m8189k9677
7987g3127m3159m7267j4150P6745N040J9488k5569p3501n5703O2204J05697J22354
$$ plain form
7975 59052 14482 16238 121804 55334 -71073 -123961 -78478 194261 32459 -153350 -160818
7964 -160818 -144560 -44221 42678 -96275 -52069 170225 218966 63925 -178682 -114512 -28314
7953 -28314 158484 85637 -66976 -87944 -58413 3082 -35206 -240058 -309029 -87061 46711
7942 46711 -11393 41103 -156255 -361055 -390698 -325155 -122474 119937 193379 164627 -59178
7931 -59178 20267 113496 -17973 -72179 -100746 25656 -84449 -122204 -217340 -107812 103819
7920 103819 172119 87919 -75810 -36058 85361 69863 -12577 5241 141329 96150 57044
7909 57044 75650 241226 332129 177681 39919 -27506 19261 -16096 -27571 -27169 -116379 -270634
7897 -270634 -324680 -54999 117234 176227 91108 -17331 -85069 -93874 20028 4811 -179570
$$ packed form
7975E9052m4570J756J05566o6470j26407n2888M5483K72739j61802j85809p468
7964a60818J6258J00339Q6899j38953M4206K22294M8741j55041k42607O4170Q6198
7953b8314J86798p2847j52613k0968K9531O1495l8288k04852o8971K21968J33772
7942D6711n8104N2496j97358k04800k9643O5543K02681K42411P3442k8752k23805
7931e9178P9445R3229j31469n4206k8567J26402j10105l7755r5136J09528K11631
7920A03819O8300q4200j63729L9752J21419j5498q2440J7818J36088m5179l9106
7909E7044J8606J65576R0903j54448j37762o7425M6767l5357j1475M02q9210j54255
7897b70634n4046K69681J72233N8993q5119j08439o7738q805J13902j5217j84381
$$ plain form
7886 -179570 -123334 -258822 -285720 -240440 -111537 -194167 -368323 -396367 -217958 -154410 -87784
7875 -87784 -54981 -62885 -32292 34084 253933 101919 -3997 -104014 -34003 94573 201944
7864 201944 136410 97715 132341 34516 -47113 106675 28293 -4120 37824 75855 -36759
7853 -36759 -63709 88008 119887 -11721 -13448 -119149 -118640 -148716 -170252 -213334 35246 -21076
7841 -21076 -153429 -85906 -34726 -60241 -162998 -189181 -63808 -65633 -271774 -492257 -397997
7830 -397997 -122725 -111479 -225841 -273820 -289097 -190419 -218643 -135109 -68386 -164593 -42826
7819 -42826 -115918 -67055 97852 162238 33318 4184 -3188 -86099 -27085 216564 288303
7808 288303 152192 -36363 -109341 -286239 -517733 -434663 -253971 -190575 -163290 -43367
$$ packed form
7886a79570N6236j35488k6898M5280J28903q2630j74156k8044J78409O3548O6626
7875h7784L2803p904L0593O6376K19849j52014j05916j00017P0011J28576J07371
7864B01944o5534l8695L4626r7825q1629J53788p8382l2413M1944L8031j12614
7853c6759k6950J51717L1879j31608j727j05701N09l0076k1536m3082K48580n6322
7841b1076j32353O7523N1180k5515j02757k6183J25373j825k06141k20483R4260
7830c97997K75272J1246j14362m7979j5277R8678k8224Q3534O6723r6207J21767
7819d2826p3092M8863J64907O4386j28920k9134p372q2911N9014K43649P1739
7808B88303j36111j88555p2978j76898k31494Q3070J80692O3396K7285J19923
$$ plain form
7798 -43367 -205298 -210890 -219118 -108364 21075 81391 78996 -23635 -123130 -50405 18499 -8580
7786 -8580 113449 136305 74454 13704 -208680 -333767 -270045 -203493 -233403 -364274 -354923
7775 -354923 -278667 -107637 -127669 -89358 -116208 -142457 -91719 -35773 -150851 -79358 -196633
7764 -196633 -216613 -38545 -131569 -106315 -115759 -141570 71232 256992 132583 65024 -117366
7753 -117366 -160965 -125967 -119050 -241843 -271963 -107540 45323 233118 29071 -47932 59474
7742 59474 151298 259083 145932 63385 87736 57751 -57229 -68186 -4751 -157235 -140277
7731 -140277 -146354 27631 90545 13688 -2798 -75714 -271249 -266527 51112 160459 139153
7720 139153 -127418 -243901 -107592 -116770 19135 128757 165395 263423 95169 4602 -155281
$$ packed form
7798d3367j61931n592q228J10754J29439O0316k395j02631r9495P2725O8904k7079
7786h580J22029K2856o1851o0750k22384j25087O3722O6552k9910j30871R351
7775c54923P6256J71030k0032L8311k6850k6249N0738N5946j15078P1493j17275
7764a96633j9980J78068r3024K5254r444k5811K12802J85760j24409o7559j82390
7753a17366m3599L4998O917j22793l0120J64423J52863J87795k04047p7003J07406
7742E9474R1824J07785j13151q2547K4351k9985j14980j0957O3435j52484J6958
7731a40277o077J73985O2914p6857j6486p2916j95535M722L17639J09347k1306
7720A39153k66571j16483J36309r178J35905J09622L6638R8028j68254r0567j59883
$$ plain form
7709 -155281 -151463 -203313 -131253 -46894 -76336 -33183 -59443 -90847 -141341 -147320 -240496 -198715
7697 -198715 -85394 -88114 -76709 -27931 -69947 -207731 -366311 -388896 -443967 -482535 -366742
7686 -366742 -200655 -24513 -19180 -48125 -60378 92995 21554 -151247 -143296 -25961 39525
7675 39525 59323 -61407 109863 261740 121820 -4298 -57848 -294219 -238101 -57736
7665 -57736 64331 122315 64542 76036 195941 191316 118722 106819 15940 -65479 -151666 -240324
7653 -240324 -425177 -447456 -553600 -386505 -132787 -11055 -51238 -109424 39824 -12967
7643 -12967 -7305 54913 -3787 -159852 -155571 -149230 -150400 -175996 -16757 -21684 -236881 -95876
7631 -95876 63116 116651 6392 -92826 -243332 -191586 -135518 -214313 -203626 -125683 -46640
$$ packed form
7709a55281L818n1850P2060Q4359k9442M3153k6260l1404n0494n979r3176M1781
7697a98715J13321k720J1405M8778m2016j37784j58580k2585n5071l8568J15793
7686c66742J66087J76142N333k8945j2253J53373p1441j72801P951J17335O5486
7675C9525J9798j20730J71270J51877j39920j26118n3550k36371N6118J80365
7665e7736J22067N7984n7773J1494J19905m625p2594j1903r0879q1419q6187q8658
7653b40324j84853k2279j06144J67095K53718J21732m0183n8186J49248n2791
7643a2967N662O2218n8700j56065M281O341j170k5596J59239m927k15197J41005
7631i5876J58992N3535j10259r9218j50506N1746N6068p8795J0687P7943P9043
$$ plain form
7620 -46640 -144749 -94609 81547 175199 260786 141357 86506 143806 256371 186499 150481
7609 150481 -17874 -255051 -291309 -146555 23524 13432 28082 98723 52322 36918 40622
7598 40622 -6364 -9110 -133575 -57454 10750 -5674 92603 219417 184042 24130 -16876
7587 -16876 -6984 5989 165004 92422 -25583 -36299 -7324 -36990 -111647 -189657 -40261
7576 -40261 19328 -93785 -128333 -732 -101846 -226372 -232217 -102002 -23126 -26100 -36130
7565 -36130 -102351 49515 142322 231459 375094 288152 80707 69631 162712 142099 -100069
7554 -100069 -210312 -176663 -56782 -84969 84861 67847 61873 -4138 24358 -24078 -162176
7543 -162176 -247623 -269505 -333033 -356678 -284994 -164020 -283711 -371469 -400715 -240006 -101530
$$ packed form
7620d6640r8109N0140J76156R3652Q5587j19429n4851N7300J12565o9872l6018
7609A50481j68355k37177l6258J44754J70079j0092J4650P0641m6401j5404L704
7598D0622m6986k746j24465P6121O8204j6424R8277J26814l5375j59912m1006
7587a6876R892J2973J59015p2582j18005j0716K8975k9666p4657p8010J49396
7576d0261N9589j13113l4548J27601j01114j24526n845J30215P8876k974j0030
7565c6130o6221J51866R2807Q9137J43635q6942k07445j1076R3081k0613k42168
7554a00069j10243L3649J19881k8187J69830j7014n974o6011K8496m8436j38098
7543a62176q5447k1882o3528k3645P1684J20974j19691q7758k9246J60709J38476
$$ plain form
7532 -101530 -73586 -105 -25871 112516 85515 90002 239407 239996 100270 -16418 -18305 117184
7520 117184 97903 22103 -125317 -82632 -39619 -4799 45329 13285 -24930 14589 30962
7509 30962 80802 67499 100407 118978 202949 125061 76392 60074 87342 142455 177351 181506
7497 181506 -45020 -97670 -199457 -255256 -189882 -28596 75536 145266 82259 -81539 -119898
7486 -119898 -168 50292 4637 198279 216948 196850 -25728 -195819 -253316 -189673 -189171
7475 -189171 -196638 -221983 -229733 -155054 -259155 -247000 -105272 -122318 -8829 124973 80831
7464 80831 -40732 -179998 -123280 -164599 -86480 -37510 58008 -35379 -117901 -17782 -15298
7453 -15298 -59080 30028 150402 -152540 -122890 -100003 -97321 133512 330088 317648 294997
$$ packed form
7532a01530K7944P3481k5766J38387k7001M487J49405N89j39726j16688j887J35489
7520A17184j9281p5800j47420M2685M3013L4820N0128l2044l8215L9519J6373
7509C0962M9840j3303L2908J8571Q3971p7888m8669j6318K7268N5113L4896M155
7497A81506k26526n2650j01787n5799O5374J61286J04132O9730o3007j63798l8359
7486a19898J19730N0460m5655J93642J8669k0098k22578j70091n7497O3643N02
7475a89171p467k5345p750P4679j04101J2155J41728j7046J13489J33802m4142
7464H0831j21563j39266N6718m1319P8119M8970R5518r3387q2522J00119K484
7453a5298m3782Q9108J20374l02942K9650K2887K682K30833J96576j2440k2651
$$ plain form
7442 294997 316461 199725 176576 219846 172333 175155 218827 -24143 -101506 -91686 -72594 -107582
7430 -107582 -169833 -230942 -179434 -148187 -188709 -203542 -249149 -305867 -257971 -198012 -285025 -311432
7418 -311432 -222481 -299860 -362079 -311614 -221440 -288194 -241689 -95960 51398 204065 123591
7407 123591 -196052 -258832 -155882 -162271 -171553 -173831 -132596 -8703 16354 94820 164155 -64499
7395 -64499 -78617 -150401 -77460 -120138 -294860 -317305 -171029 -262832 -243323 -158612 -230331
7384 -230331 -272162 -128800 -28976 30078 -194060 -201924 -86511 -28001 114249 391545 306077
7373 306077 21777 -243442 -152258 63806 89292 35804 38755 4346 -46736 -97147 49512
7362 49512 87431 7211 28619 71632 49834 166911 36073 -16688 -30053 -231815 -239643
$$ packed form
7442B94997K1464j16736k3149M3270m7513K822M3672k42970p7363R820J9092l4988
7430a07582o2251o1109N1508L1247m0522j4833m5607n6718M7896N9959q7013k6407
7418c11432Q8951p7379o2219N0465R0174o6754M6505J45729J47358J52667q0474
7407A23591l19643o2780J02950o389r282k278M1235J23893K5057P8466O9335k28654
7395f4499j4118p1784P2941m2678j74722k2445J46276r1803J9509Q4711p1719
7384b30331m1831J43362R9824N9054k24138p864J15413N8510J42250K77296q5468
7373C06077k84300k65219R1184K16064K5486n3488K951l4409n1082n0411J46659
7362D9512L7919q0220K1408M3013k1798J17077j30838n2761j3365k01762p828
$$ plain form
7351 -239643 -229822 -172846 -33206 31631 3542 -63547 -147716 -118235 56393 109744 22441
7340 22441 126679 14554 -85333 150494 328700 316650 130930 94903 100647 46528 189938
7329 189938 155185 18710 -202958 -299343 -315387 -211969 -182705 -141820 -185005 -82952 18173
7318 18173 -39215 45669 70293 -55320 -179798 -237587 -228397 -129812 29996 110047 3276
7307 3276 -22515 54344 57429 -105644 25955 203217 100495 -25484 -62618 -47202 -124739
7296 -124739 59805 112655 -78219 -104725 -211120 -314710 -165439 -108312 -1637 5075 -235857
7285 -235857 -205352 59729 145088 146175 -42967 -157623 -233913 -373891 -372640 -192909 -102347
7274 -102347 -91905 -35581 -143299 -257593 -283136 -157947 60696 163588 142137 -92843
$$ packed form
7351b39643R821N6976J39640O4837k8089o7089q4169K9481J74628N3351q7303
7340B2441J04238j12125r9887K35827J78206j2050j85720l6027N744n4119J43410
7329A89938l4753j36475k21668r6385j6044J03418K9264M0885m3185J02053J01125
7318A8173n7388Q4884K4624j25613j24478n7789R190R8585J59808Q0051j06771
7307C276k5791P6859L085j63073J31599J77262j02722j25979l7134J5416p7537
7296a24739J84544N2850j90874k6506j06395j03590J49271N7127J06675O712k40932
7285b35857L0505K65081Q5359J087j89142j14656p6290j39978J251J79731R0562
7274a02347J0442N6324j07718j14294k5543J25189K18643J02892k1451k34980
$$ plain form
7264 -92843 -205110 -46513 87850 20927 -84109 -119971 -120107 -228105 -229730 -189711 -296870
7253 -296870 -367269 -517306 -571161 -566502 -532401 -257504 -92086 -149015 -245067 -21025 105207
7242 105207 136907 350473 465068 450075 310552 48790 -144052 -144904 -136385 -74557 -140738
7231 -140738 -243071 -211398 -214250 -237571 -259416 -364503 -374561 -202567 -248261 -271128 -212690
7220 -212690 -235921 -89206 -89244 -63085 -45515 13849 2155 -33112 -86555 -141628 -298891 -394473
7208 -394473 -345021 -214582 -303778 -350482 -276317 51462 125880 33733 49315 -53447 -109387
7197 -109387 -412974 -569452 -439693 -232795 34743 24359 -65285 -92429 43901 57220
7187 57220 46373 37784 -85762 -85199 -137432 -92602 17767 42109 46889 8105 -23784 -13930
$$ packed form
7264i2843j12267J58597J34363o6923j05036l5862j36j07998j625M0019j07159
7253b96870p0399j50037n3855M659L4101K74897J65418n6929r6052K24042J26232
7242A05207L1700K13566J14595j4993j39523k61762j92842q52Q519O1828o6181
7231a40738j02333L1673k852k3321k1845j05087j0058J71994m5694k2867N8438
7220b12690k3231J46715l8K6159J7570N9364j1694l5267n3443n5073j57263r5582
7208c94473M9452J30439q9196m6704P4165L27779P4418r2147J5582j02762n5940
7197a09387l03587j56478J29759K06898K67538j0384q9644k7144J36330J3319
7187E7220j0847q589j23546N63n2233M4830J10369K4342M780l8784l1889R854
$$ plain form
7175 -13930 -167209 -193618 -34782 -184733 -259470 -171741 -25369 -85554 -176497 -183629 -178475
7164 -178475 -179233 -330772 -273556 -319779 -84665 -36161 -146025 -244932 -113501 -191688 -135693
7153 -135693 17102 56227 18845 13162 -6732 -224176 -432538 -467796 -370748 -202032 -199549
7142 -199549 -194735 -182456 -244945 59783 164242 107622 95647 46161 61194 5725 -138154
7131 -138154 -343736 -236351 -54336 -105480 60359 -10016 -52471 -120636 -74681 88178 100691
7120 100691 -59482 -118382 -323424 -266150 -42417 -11322 77394 43408 -61109 -77719 -128273
7109 -128273 -4110 16312 -98808 -162345 27759 78686 80762 6343 -98186 -292825 -367372
7098 -367372 -75458 -15355 -77548 8007 42325 -113583 -158631 -195672 -200287 -218357 -83802
$$ packed form
7175a3930j53279k6409J58836j49951p4737Q7729J46372o0185r0943p132N154
7164a78475p58j51539N7216m6223K35114M8504j09864r8907J31431p8187N5995
7153a35693J52795L9125l7382n683j9894k17444k08362l5258R7048J68716K483
7142a99549M814J2279o2489L04728J04459n6620j1975m9486J5033n5469j43879
7131a38154k05582J07385J82015n1144J65839p0375m2455o8165M5955J62859J2513
7120A00691j60173n8900k05042N7274K23733L1095Q8716l3986j04517j6610n0554
7109a28273J24163K0422j15120o3537J90104N0927K076p4419j04529j94639p4547
7098c67372K91914O0103o2193Q5555L4318j55908m5048l7041m615j8070J34555
$$ plain form
7087 -83802 120420 212610 143857 -110030 -141149 -150266 -200094 -173304 -17682 195745 326901
7076 326901 421046 366534 274640 119680 -80350 -307138 -239728 -164646 -64197 -105657 -202026
7065 -202026 -201391 -189541 54481 181511 152652 85023 113573 -2054 144221 306500 189573
7054 189573 -62329 -111934 -117633 -107354 -208240 -110154 -154122 -269861 -211580 -295285 -306806
7043 -306806 -158103 -46932 36185 -68498 -15741 -195225 -314984 -150522 -56264 23150
7033 23150 62639 108670 25374 77955 194324 67583 -146645 -272007 -256862 -188365 -125924
7022 -125924 -135093 -88850 104268 19351 -60068 -98654 -191730 -253926 -44471 7617 -114282
7011 -114282 7409 464 -37709 -71061 -107676 -34315 -3884 150063 143501 -20661 -39101
$$ packed form
7087h3802K04222R2190o8753k53887l1119r117m9828K6790J55622K13427J31156
7076C26901R4145n4512r1894j54960k00030k26788O7410P5082J00449m1460r6369
7065b02026O35J1850K44022J27030k8859o7629K8550j15627J46275J62279j16927
7054A89573k51902m9605n699J0279j00886R8086m3968j15739N8281q3705j1521
7043c06806J48703J11171Q3117j04683N2757j79484j19759J64462R4258P9414
7033B3150L9489M6031q3296N2581J16369j26741k14228j25362J5145O8497O2441
7022a25924r169M6243J93118q4917p9419l8586r3076o2196K09455N2088j21899
7011a14282J21691o945l8173l3352l6615P3361L0431J53947o562j64162j8440
$$ plain form
7000 -39101 -64713 -75878 -26474 -51902 26568 74141 141107 14102 -70461 35184 167713
6989 167713 99736 50683 -124457 -119939 -18989 217479 256065 31036 -57527 -42087 -25643
6978 -25643 -17216 -28182 54574 -32118 -241979 -256558 -161020 -63454 -25733 9726 119100 -41657
6966 -41657 -135543 -91321 16043 51036 -53484 -151440 -148428 8322 55259 185464 289948
6955 289948 112190 -135725 -205721 -88115 123622 153600 66041 26083 34747 112849 -95061
6944 -95061 -290266 -274869 -13030 66579 77462 -16563 -88573 -203821 -194397 -97459 -21315
6933 -21315 -9807 19734 -20060 -18349 -75573 -76761 -49535 35577 -67919 -233127 -340358 -328744
6921 -328744 -187966 -41602 29852 59596 79904 -199891 -147439 -74896 -9750 -144799 -231985
$$ packed form
7000c9101k5612j1165M9404k5428P8470M7573O6966j27005q4563J05645J32529
6989A67713o7977m9053j75140M518J00950K36468L8586k25029q8563J5440J6444
6978b5643Q427j0966Q2756q6692k09861j4579R5538R7566L7721L5459J09374j60757
6966d1657r3886M4222J07364L4993j04520r7956L012J56750M6937J30205J04484
6955B89948j77758k47915o9996J17606K11737K9978q7559l9958Q664P8102k07910
6944i5061j95205J5397K61839P9609J0883r4025p2010j15248R424R6938P6144
6933b1315J1508K9541l9794J711n7224j188K7226Q5112j03496j65208j07231J1614
6921c28744J40778J46364P1454K9744K0308k79795N2452P2543O5146j35049q7186
$$ plain form
6910 -231985 -254743 12470 225064 73726 -4793 169237 82210 -24774 -102727 -71765 -19407
6899 -19407 93772 61508 36052 31374 -34354 -18896 -96022 -60258 -4260 125326 165996 234493
6887 234493 264756 179987 215689 126852 -21471 -200994 -261493 -263292 -185251 17354 23952
6876 23952 -94455 -286980 -315858 -71790 207311 226575 105787 185809 223010 -15123 -32029
6865 -32029 12207 8153 -59314 -49913 -31041 133690 189278 194225 99099 148825 4116 -8439
6853 -8439 -117716 -176767 -174712 -155897 -41614 3882 55056 -121540 -157175 -235761 -253676 -261370
6841 -261370 -89609 78389 -49660 -65356 -10363 -112953 -15122 16972 98681 108539 118719
6830 118719 140133 7903 -129251 -54741 17697 25414 -92601 -138622 -41122 33633 9993
$$ packed form
6910b31985k2758K67213K12594j51338p8519J74030q7027j06984p7953L0962N2358
6899a9407J13179l2264k5456m678o5728J5458p7126L5764N5998J29586M0670O8497
6887B34493L0263q4769L5702q8837j48323j79523o0499j799P8041K02605O598
6876B3952j18407j92525k8878K44068K79101J9264j20788Q0022L7201k38133j6906
6865c2029M4236m054o7467R401J8872J64731N5588M947r5126M9726j44709j2555
6853h439j09277n9051K055J8815J14283M5496N1174j76596l5635p8586j7915p694
6841b61370J71761J67998j28049j5696N4993j02590R7831L2094Q1709R858J0180
6830A18719K1414j32230j37154P4510P2438P717j18015m6021R7500P4755k3640
$$ plain form
6819 9993 6207 -38085 -144483 -157261 -104039 -23199 6294 -6487 -95403 -132630 -90406 141057
6807 141057 239530 305576 290141 176268 -53286 -169483 -98992 -226061 -209467 -193195 -290121
6796 -290121 -209970 -109514 -33483 -117171 -110274 -288001 -389508 -287776 -145051 -236931 -188991
6785 -188991 -30761 23387 57956 -76283 -167674 -117508 22874 73886 65656 -31631 -191085
6774 -191085 -255319 -256234 -248952 -287809 -256263 -198812 -215409 -330707 -239992 -5399 193115 87557
6762 87557 -85462 -158391 -68157 -66575 -125797 -45057 -76425 -172128 -134236 -44796 -50408 -158271
6750 -158271 -174061 -41122 148314 131216 210757 208708 123501 54126 61395 23340 5773 69045
6738 69045 -119870 -182766 -163325 -159745 -140598 -83715 -38797 -152346 -115942 39432 34760 936
$$ packed form
6819I993l786m4292j06398j2778N3222Q0840K9493j2781q8916l7227M2224K31463
6807A41057R8473O6046j5435j13873k29554j16197P0491j27069J6594J6272r6926
6796b90121Q0151J00456P6031q3688O897j77727j01507J01732J42725r1880M7940
6785a88991J58230N4148L4569j34239r1391N0166J40382N1012q230r7287j59454
6774a91085o4234r15P282l8857L1546N7451j6597j15298R0715K34593J98514j05558
6762H7557j73019p2929R0234J582n9222Q0740l1368r5703L7892Q9440n612j07863
6750a58271j5790J32939J89436j7098P9541k049q5207o9375P269l8055j7567O3272
6738F9045j88915o2896J9441L580J9147N6883M4918j13549L6404J55374m672l3824
$$ plain form
6726 936 20184 7154 -80160 -176679 -203039 -225855 -140068 6855 249124 215090 -12986 -71727
6714 -71727 -68059 -49601 -108729 90146 254888 180305 38866 -37641 -108464 -21964 -138364
6703 -138364 -183815 -112281 -85487 -110921 -134295 -212666 -170854 -122660 -56372 97631 268673
6692 268673 277886 242737 107583 -33356 -74485 14314 113594 1971 -24839 -24365 11892 24585
6680 24585 1383 -129938 -216085 -182649 -129996 -179260 -98859 -83418 -165519 -253243 -508116
6669 -508116 -332694 -133879 -47175 -101851 -31807 -133636 -74537 -130630 -315804 -275377 -270238
6658 -270238 -135681 -708 -98169 -187543 9789 53623 -3127 -96450 -175548 -181354 -130395
6647 -130395 -46343 132245 110914 -3189 -33215 -75390 -170970 -158656 -136653 -143615 80
$$ packed form
6726I36J9248j3030q7314r6519k6360k2816Q5787J46923K42269l4034k28076n8741
6714g1727L668J8458n9128J98875J64742p4583j41439p6507p0823Q6500j16400
6703a38364m5451P1534K6794k5434k3374p8371M1812M8194O6288J54003J71042
6692B68673R213l5149j35154j40939m1129Q8799R9280j11623k6810M74L6257J2693
6680B4585k3202j31321q6147L3436N2653m9264Q0401J5441q2101q7724k54873
6669e08116J75422J98815Q6704n4676P0044j01829N9099n6093j85174M0427N139
6658b70238J34557J34973r7461q9374J97332M3834n6750r3323p9098n806N0959
6647a30395Q4052J78588k1331j14103l0026m2175r5580J2314K2003o962J43695
$$ plain form
6636 80 289477 346708 276712 94723 -137915 -61803 -13330 -61856 13374 116721 120519 -7529
6624 -7529 -157069 -201184 -32799 106123 125434 -59561 -289925 -115109 90845 -71504
6614 -71504 -24824 127448 121738 11672 153355 232365 195650 121669 67058 198151 103106
6603 103106 -83889 -164316 2270 11392 28434 143317 -11836 -163201 -180457 -75210 -31309
6592 -31309 72216 133278 1240 -130347 -267540 -181405 -9814 21251 58782 56622 -27928
6581 -27928 -13558 57333 -58932 -88595 103406 58800 -117733 -152319 -140108 -23146 12254
6570 12254 -19003 -122391 -132626 -168919 -213875 -31515 -77990 -241104 -110116 -67488 20015
6559 20015 117262 25057 -40437 -55948 68101 128492 119404 14483 -55661 -175486 -197807
$$ packed form
6636H0K89397N7231o9996j81989k32638P6112M8473m8526P5230J03347L798j28048
6624g529j49540m4115J68385J38922J9311j84995k30364J74816K05954j62349
6614g1504M6680J52272n710j10066J41683P9010l6715p3981n4611J31093r5045
6603A03106j86995q0427J66586R122J7042J14883j55153j51365j7256J05247M3901
6592c1309J03525O1062j32038j31587j37193Q6135J71591L1065L7531k160q4550
6581b7928J4370P0891j16265k9663J92001m4606j76533l4586J2211J16962L5400
6570A2254l1257j03388j0235l6293m4956J82360m6475j63114J30988M2628Q7503
6559B0015R7247r2205o5494j5511J24049O0391r088j04921p0144j19825k2321
$$ plain form
6548 -197807 -251921 -208518 -225242 -223094 -209373 -255733 -146368 -209002 -255353 -192336 -177032 -185130
6536 -185130 49004 186236 319734 429743 260032 72955 124850 150353 5593 2501
6526 2501 237388 486488 290699 -36096 28338 54477 -3338 -46321 -108967 -54987 -213610
6515 -213610 -232633 -73675 169553 237470 306326 267076 98752 -43123 9046 118408 -73582
6504 -73582 -399024 -448287 -312858 -142607 40070 28629 52105 196234 35242 20582 172077
6493 172077 143535 144715 33410 -112487 -175325 -198929 -192406 -216735 -120458 36992 54718
6482 54718 165593 303569 309766 223547 117447 246439 179270 120066 92984 45558 36185
6471 36185 76701 105905 65547 69607 -6691 -97687 15858 -24467 -65898 24508 -152555 -167370
$$ packed form
6548a97807n4114M3403j6724K148J3721m6360J09365o2634m6351O3017J5304q098
6536a85130K34134J37232J33498J10009j69711j87077N1895K5503j44760l092
6526B501K34887K49100j95789l26795O4434K6139n7815m2983o2646N3980j58623
6515b13610j9023J58958K43228O7917O8856l9250j68324j41875N2169J09362j91990
6504g3582l25442m9263J35429J70251J82677j1441K3476J44129j60992j4660J51495
6493A72077k8542J180j11305j45897o2838k3604O523k4329R6277J57450J7726
6482E4718J10875J37976O197q6219j06100J28992o7169n9204k7082m7426r373
6471C6185M0516K9204m0358M060p6298r0996J13545m0325m1431R0406j77063j4815
$$ plain form
6459 -167370 -150148 -90535 -108245 -34929 -79264 -87473 -105284 -82772 -201939 -273892 -115974
6448 -115974 -80403 -120719 -92956 -94250 -29782 -19165 -109270 -254585 -367022 -362934 -300345 -267371
6436 -267371 -284893 -294273 -189933 21073 178159 256575 227749 35797 -21681 107161 53056
6425 53056 98777 158009 47998 197435 220096 219004 151703 124989 83886 66658 -120072
6414 -120072 -36090 -17149 -75910 34086 43747 -56829 585 127977 -15744 -97599 -11343
6403 -11343 94072 -30459 41283 -2642 -57205 -71615 -3515 106526 -71987 -331602 -317048
6392 -317048 -58702 -27499 -25820 4199 -109492 -57960 -52669 -43095 -5904 64880 164642 179698
6380 179698 209232 260976 327666 238633 182972 106815 62387 15798 -196483 -166916 -209034
$$ packed form
6459a67370J7222N9613j7710P3316m4335q209j7811K2512j19167p1953J57918
6448a15974L5571m0316K7763j294O4468J0617r0105j45315j12437M088O2589L2974
6436b67371j7522r380J04340K11006J57086P8416k8826j91952n7478J28842n4105
6425E3056M5721N9232j10011J49437K2661j092o7301k6714m1103j7228j86730
6414a20072Q3982J8941n8761J09996R661j00576N7414J27392j43721q1855Q6256
6403a1343J05415j24531P1742m3925n4563j4410O8100J10041j78513k59615J4554
6392c17048K58346L1203J679L0019j13691N1532N291R574L7191P0784R9762J5056
6380A79698K9534N1744O6690q9033n5661p6157m4428m6589k12281K9567m2118
$$ plain form
6369 -209034 -65579 109583 106566 14707 -36111 -159213 -203865 -58033 48642 89398 142050
6358 142050 134292 -53119 -74277 -12838 11800 27974 -153982 -311208 -293050 -136274 88274
6347 88274 249606 161425 135148 118886 224576 221321 259947 236664 88038 43191 -76745
6336 -76745 -127640 -27508 -38618 -74857 -54796 28697 -120892 -213895 -92111 -80045 -220156
6325 -220156 -304795 -245095 -198853 -236554 -210226 -150005 -30894 282631 214591 112228 94557
6314 94557 -19927 8551 67628 99984 134290 89797 46544 -10218 78790 114910 70815 87618
6302 87618 239629 215395 167645 -56353 -16409 11086 19898 -11810 -91580 -122909 -90636 -150963
6290 -150963 -145377 -114238 -114369 -43429 54210 12100 18376 -51658 -256667 -109939 37458 85145
$$ packed form
6369b09034J43455J75162l017r1859n0818j23102m4652J45832J06675M0756N2652
6358A42050p758j87411k1158O1439K4638J6174j81956j57226J8158J56776K24548
6347H8274J61332q8181k6277j6262J05690l255L8626k3283j48626m4847j19936
6336g6745n0895J00132j1110l6239K0061Q3493j49589r3003J21784J2066j40111
6325b20156q4639N9700M6242l7701K6328O0221J19111L13525o8040j02363j7671
6314I4557j14484K8478N9077L2356L4306m4493m3253n6762Q9008L6120m4095J6803
6302H7618J52011k4234m7750k23998L9944K7495Q812l1708p9770l1329L2273o0327
6290a50963N586L1139j31P0940R7639m2110O276p0034k05009J46728J47397M7687
$$ plain form
6278 85145 14177 -110194 -123079 -60430 -113413 -56041 77694 89673 30476 -6294 62499
6267 62499 -91851 -89369 -93401 -115167 -8507 25451 -26330 -28158 -144655 -173385 -172963 -51044
6255 -51044 -16568 -68245 -32800 68234 -26059 -245312 -243396 -106569 -154842 -187925 -173977
6244 -173977 -152498 -202847 -99167 -99348 -247379 -125316 -86692 8569 -28064 -33015 -24802 -31625
6232 -31625 53150 253305 219044 -16970 -72617 -80344 -162459 -166779 -227584 -73256 104302
6221 104302 181676 69710 172898 43822 44196 103367 211010 171461 145365 144335 100889
6210 100889 75774 40691 -80958 -158630 -208295 -154467 -81923 -66249 -8845 -173932 -281930
6199 -281930 -303274 -334447 -377186 -318701 -316223 -261958 -289880 -297219 -94224 -5836 -118713 -147558
$$ packed form
6278H5145p0968j24371j2885O2649n2983N7372J33735J1979n9197l6770O8793
6267F2499j54350K482m032k1766J06660L3958n1781j828j16497k8730M22J21919
6255e1044L4476n1677L5445J01034r4293k19253J916J36827m8273l3083J3948
6244a73977K1479n0349J03680j81j48031J22063L8624R5261l6633m951Q213o823
6232c1625Q4775K00155l4261k36014n5647p727q2115m320o0805J54328J77558
6221A04302P7374j11966J03188j29076L74N9171J07643l9549k6096j030m3446
6210A00889k5115l5083j21649p7672m9665N3828P2544J5674N7404j65087j07998
6199b81930k1344l1173m2739N8485K478N4265k7922p339K02995Q8388j12877k8845
$$ plain form
6187 -147558 -77081 -45479 -180405 -133990 -19746 -221882 -253210 -268219 -176497 -81401 18691
6176 18691 69984 -21508 -3737 -39716 -208040 -129348 17079 -47673 -90495 -158372 24822
6165 24822 120563 7576 96529 19812 -115806 -46703 -94447 -3837 -42150 -156648 -118860
6154 -118860 -7077 178448 205992 160046 -29142 -155744 -67866 -59631 -56540 -153747 -52335
6143 -52335 -12631 -26986 -55469 -23562 88382 -64987 -313960 -359298 -186402 -267193 -384524
6132 -384524 -353729 -208529 -122201 -97532 -92982 -21836 -118340 -209160 -66328 -62166 -215199
6121 -215199 -315884 -185753 -54308 120487 121706 75444 -73092 -21501 -125048 -96271 -103021
6110 -103021 -151703 -222182 -112781 -5256 92714 -54422 -106538 -7759 -80069 -162457 -177959
$$ packed form
6187a47558P0477L1602j34926M6415J14244k02136l1328j5009R1722R5096J00092
6176A8691N1293r1492J7771l5979j68324P8692J46427o4752m2822o7877J83194
6165B4822R5741j12987Q8953p6717j35618O9103m7744R0610l8313j14498L7788
6154a18860J11783J85525K7544m5946j89188j26602Q7878Q235L091r7207J01412
6143e2335L9704j4355k8483L1907J11944j53369k48973m5338J72896q0791j17331
6132c84524L0795J45200Q6328K4669M550P1146r6504r0820J42832M162j53033
6121b15199j00685J30131J31445J74795J219m6262j48536N1591j03547K8777o750
6110a03021m8682p0479J09401J07525R7970j47136n2116R8779p2310q2388j5502
$$ plain form
6099 -177959 -78321 33995 126072 81098 50146 -143333 -234669 -86869 29231 120227 -190548
6088 -190548 -308618 -162672 -286959 -295526 -105830 142154 223354 360277 246738 -185686
6078 -185686 -209751 -69379 2224 7829 -11157 -61731 -254955 -369722 -393643 -314290 -82420
6067 -82420 39042 -40952 -130569 20959 -33382 -65869 -255659 -165924 20641 184370 249081
6056 249081 248996 55016 -231688 -124511 -106873 35714 -110617 -155444 -124784 -44126 -67112
6045 -67112 -156175 -159583 -72794 -10532 -45273 17866 -94652 -128221 32604 8696 -53727 -56854
6033 -56854 84599 9946 5390 79155 -1991 92288 157354 161667 29076 10028 -39927 -167933
6021 -167933 -179441 -187560 -83937 -44368 74606 -14053 -198407 -163874 -14381 163623 193793
$$ packed form
6099a77959R9638J12316R2077m4974l0952j93479r1336J47800J16100R0996l10775
6088a90548j18070J45946j24287q567J89696K47984Q1200J36923j13539m32424
6078a85686k4065J40372P1603N605j8986n0574j93224j14767k3921P9353K31870
6067h2420J21462p9994q9617J51528n4341l2487j89790Q9735J86565J63729O4711
6056B49081q5j93980k86704J07177J7638J42587j46331m4827L0660Q0658k2986
6045f7112q9063l408Q6789O2262l4741O3139j12518l3569J60825k3908o2423l127
6033e6854J41453p4653m556P3765q1146R4279O5066M313j32591j9048m9955j28006
6021a67933j1508q119J03623L9569J18974q8659j84354L4533J49493J78004L0170
$$ plain form
6010 193793 30864 5724 -46901 -89405 -52275 -105656 -35742 93516 160001 5615 -60172
5999 -60172 163856 222020 172189 173357 293038 265783 251452 193263 -48350 -206361 -56348
5988 -56348 -119775 -179758 -85143 -24742 53505 -144400 -28718 -67656 -231613 -216123 59862
5977 59862 83809 51453 70950 42082 -37752 -93252 -53956 41597 174928 118875 -85392
5966 -85392 -208140 -137979 46422 177246 185437 177990 240465 138145 -24138 22239 71740
5955 71740 14177 68156 -750 -68217 -100720 -83202 -84161 78386 32112 -245357 -315054 -306986
5943 -306986 -257709 -235108 -227681 -197970 -181315 -223864 -216187 -108816 -152808 -227668 -211607 -197411
5931 -197411 -157704 54586 64014 101039 59931 -113659 -103366 -81769 85820 51243 -33595
$$ packed form
6010A93793j62929k5140n2625m2504L7130n3381O9914J29258O6485j54386o5787
5999f0172K24028N8164m9831J168J19681k7255j4331n8189k41613j58011J50013
5988e6348o3427n9983R4615O0401P8247j97905J15682l8938j63957J5490K75985
5977E9862K3947l2356J9497k8868p9834n5500L9296R5553J33331n6053k04267
5966h5392j22748P0161J84401J30824Q191p447O2475j02320j62283M6377M9501
5955G1740n7563N3979o8906o7467l2503J7518r59J62547m6274k77469o9697Q068
5943c06986M9277K2601P427K9711J6655m2549P677J07371m3992p4860J6061J4196
5931a97411L9707K12290R428L7025m1108j73590J0293K1597J67589l4577q4838
$$ plain form
5920 -33595 -111273 -40828 -3661 -99653 -77040 -44797 22308 -7988 -323318 -303616 -170594
5909 -170594 -84519 -117085 -327323 -357507 -118432 -87388 -108773 -56313 -55044 -4876 -52445
5898 -52445 -152537 -144804 -235283 -149916 -84293 94114 78198 -9831 140195 370134 288746
5887 288746 154709 74225 -49831 4856 54826 42919 81108 55184 1211 -151157 -139553
5876 -139553 24025 39508 117151 75857 32139 116266 -12357 -99497 -167501 -140539 34414
5865 34414 165355 138965 51654 35508 -78699 -79741 -56712 88917 228388 176364 133453
5854 133453 -86615 -134734 -116359 -161144 -260342 -173841 -37116 -37093 68236 117552 186719 88453
5842 88453 70302 46763 721 -68418 -56507 -26387 -85540 -158692 -167907 -240691 -239756 -162883
$$ packed form
5920c3595p7678P0445L7167r5992K2613L2243O7105l0296l15330J9702J33022
5909a70594Q6075l2566k10238l0184K39075L1044k1385N2460J269N0168m7569
5898e2445j00092P733r0479Q5367O5623J78407j5916q8029J50026K29939q1388
5887B88746j34037q0484j24056N4687M9970j1907L8189k5924n3973j52368J1604
5876a39553J63578J5483P7643m1294m3718Q4127j28623q7140o8004K6962J74953
5865C4414J30941k6390q7311j6146j14207j042K3029J45629J39471n2024m2911
5854A33453k20068m8119J8375m4785r9198Q6501J36725K3J05329M9316O9167r8266
5842H8453j8151k3539m6042o9139J1911L0120n9153p3152r215p2784R35P6873
$$ plain form
5830 -162883 -57220 36779 -40548 -32901 191075 219300 168604 196908 37393 25044 178910
5819 178910 334170 359094 156861 106765 -154329 -315034 -155547 -206471 -78772 51044
5809 51044 135905 164981 266113 216825 -72976 -196787 63771 190004 281914 279308 233790
5798 233790 200073 238537 42393 -199241 49278 168806 -22684 -191204 -123781 -74055
5788 -74055 -100455 -118575 -806 85685 154138 209381 111819 -124837 -151048 -118494 -86528
5777 -86528 38046 -31700 -109380 -10508 82317 -101957 -221937 -134354 -194088 -209762 -148397
5766 -148397 114058 121898 66812 10954 -137100 -165357 -101612 24104 -73926 -100777 -123258
5755 -123258 -164131 -64907 -55670 -50017 -119741 43768 175122 270822 77551 91384 49650
$$ packed form
5830a62883J05663R3999p7327P647K23976K8225n0696K8304j59515j2349J53866
5819A78910J55260K4924k02233n0096k61094j60705J59487n0924J27699J29816
5809E1044Q4861K9076J01132m9288k89801j23811K60558J26233R1910k606m5518
5798B33790l3717L8464j96144k41634K48519J19528j91490j68520O7423M9726
5788g4055k6400j8120J17769Q6491O8453N5243r7562k36656k6211L2554L1966
5777h6528J24574o9746p7680R8872R2825j84274j19980Q7583n9734j5674O1365
5766a48397K62455P840n5086n5858j48054k8257O3745J25716r8030k6851k2481
5755a23258m0873R9224R237N653o9724J63509J31354R5700j93271J3833m1734
$$ plain form
5744 49650 3905 137271 161302 189476 7634 -142113 -167227 -256054 -206625 -60081 70735
5733 70735 214654 210611 264221 134312 -76728 -100414 -214993 -230879 -350918 -410182 -196823
5722 -196823 -112555 -245485 -192498 103542 123688 12965 15755 64969 161569 142931 80810
5711 80810 -6707 -201367 -245454 -139003 -170551 -139784 -33238 -113550 -159978 -124596 -80972
5700 -80972 -63344 -92468 -62305 51758 99563 192451 144048 -37415 -36050 93638 198359
5689 198359 246430 62308 -28409 -110396 -164483 -167714 -223841 -219364 -173251 -46153 -22213 24955
5677 24955 226555 387321 500830 410983 250100 364113 361276 114261 125348 201593 152511
5666 152511 -36169 -106215 -4846 -1909 38002 92464 269336 428726 302615 74423 87933
$$ packed form
5744D9650m5745J33366K4031K8174j81842j49747k5114q8827M9429J46544J30816
5733G0735J43919m043N3610j29909k11040k3686j14579j5886j20039n9264K13359
5722a96823Q4268j32930N2987K96040K0146j10723K790M9214R6600j8638o2121
5711H0810q7517j94660m4087J06451l1548L0767J06546q0312m6428L5382M3624
5700h0972J7628k9124L0163J14063M7805R2888m8403j81463J365J29688J04721
5689A98359M8071j84122r0717q1987n4087l231n6127M477M6113J27098K3940M7168
5677B4955K01600J60766J13509q9847j60883J14013k837k47015J1087P6245m9082
5666A52511j88680p0046J01369K937L9911N4462J76872J59390j26111k28192J3510
$$ plain form
5655 87933 -57236 -112910 -185267 29143 256671 261476 64256 -196822 -50819 39507 41125
5644 41125 -12322 -105429 -79680 -243242 -285189 -180986 -173073 -162268 -85127 -119850 -26596 96981
5632 96981 149740 110194 31422 -29115 -11991 -71867 -26680 -60608 -40921 -191301 -181981 -57684
5620 -57684 84302 31575 24237 -57424 -141697 -80849 142788 336338 276758 127240 -95516
5609 -95516 -163804 -275859 -104643 -11160 71915 32534 -24028 -27004 -24194 -14095 -6325 -41267
5597 -41267 -104415 -247880 -237490 -160912 -53976 -163249 -238290 -176491 -291361 -242762 -137368
5586 -137368 -53455 -17369 -157854 -95684 15170 102858 36695 -33958 -63564 -18167 -76232
5575 -76232 -16340 122615 50440 -76725 -316950 -287422 -168452 -53941 -15492 35922 85975
$$ packed form
5655H7933j45169n5674p2357K14410K27528M805j97220k61078J46003R0326J618
5644D1125n3447r3107K5749j63562m1947J04203P913J0805P7141l4723R3254J23577
5632I6981N2759l9546p8772o0537J7124n9876M5187l3928J9687j50380R320J24297
5620e7684J41986n2727p338q1661q4273O0848K23637J93550n9580j49518k22756
5609i5516o8288j12055J71216R3483Q3075l9381n6562k976K810J0099P770l4942
5597d1267o3148j43465J0390P6578J06936j09273p5041O1799j14870M8599J05394
5586a37368Q3913L6086j40485O2170J10854Q7688o6163p0653k9606M5397n8065
5575g6232N9892J38955p2175j27165k40225K9528J18970J14511L8449N1414N0053
$$ plain form
5564 85975 157459 151623 137540 81001 15593 -8249 -25746 -11215 -96384 -98804 -12389 44523
5552 44523 163179 184656 142305 148172 77917 6505 -11556 65182 206748 151204 11661
5541 11661 -6476 120626 22455 -23305 -80232 76421 29964 41891 -36278 -20370 -85864
5530 -85864 -42525 815 -17859 -77861 -72151 37670 148348 -28624 -134128 -54365 -100569
5519 -100569 1332 75031 101114 -5397 -118541 -39634 -98064 -191467 -324302 -388734 -415969
5508 -415969 -252412 33530 5579 -144535 -53247 87226 -67878 -150916 -244025 -405643
5498 -405643 -414101 -374170 -186403 -204477 -106101 -71093 -148715 -215384 -350483 -274119 -150175
5487 -150175 -73538 41349 27800 3945 34068 -48881 -182984 -153915 23288 115336 6313
$$ packed form
5564H5975P1484n836j4083n6539o5408k3842j7497J4531q5169k420Q6415N6912
5552D4523J18656K1477m2351N867p0255p1412j8061P6738J41566n5544j39543
5541A1661j8137J27102r8171m5760n6927J56653m6457J1927p8169J5908o5494
5530h5864M3339M3340j8674o0002N710J09821J10678j76972j05504P9763m6204
5519a00569J01901P3699K6083j06511j13144P8907n8430r3403j32835o4432k7235
5508d15969J63557K85942k7951j50114R1288J40473j55104q3038r3109j61618
5498d05643q458L9931J87767j8074R8376L5008p7622o6669j35099P6364J23944
5487a50175P6637J14887j3549k3855L0123q2949j34103K9069J77203R2048j09023
$$ plain form
5476 6313 107254 14815 -177148 -173382 -148050 57928 280507 319690 203033 70755 45158
5465 45158 -59085 -132466 -39092 -139073 -125729 -174551 -143320 -47327 72645 223977 332707
5454 332707 272012 212612 128002 185834 44186 -156837 -236534 -19601 224896 78539 -242629
5443 -242629 -311153 -173159 -260251 -264473 -20391 90272 74476 -35071 -52114 49992 -83874
5432 -83874 -249744 -165125 -95393 -141407 -46383 -71961 58779 128544 -36472 37699 85550
5421 85550 143696 200499 215244 129309 16572 -84863 -88696 88398 305096 433388 435840
5410 435840 435331 142690 53902 69312 46359 -39551 -28340 -210007 -481791 -397979 -37590
5399 -37590 86548 -145764 -323667 -226583 -189052 -182145 -78367 27503 139670 154789 193741
$$ packed form
5476F313J00941r2439j91963L766K5332K05978K22579L9183j16657j32278k5597
5465D5158j04243p3381R3374r9981J3344m8822L1231R5993J19972J51332J08730
5454C32707o0695n9400q4610N7832j41648k01023p9697K16933K44497j46357l21168
5443b42629o8524J37994q7092m222K44082J10663j5796j09547j7043J02106j33866
5432h3874j65870Q4619O9732m6014R5024k5578J30740O9765j65016P4171M7851
5421H5550N8146N6803J4745q5935j12737j01435l833J77094K16698J28292K452
5410D35840n09k92641q8788J5410k2953q5910J1211j81667k71784Q3812L60389
5399c7590J24138k32312j77903R7084L7531O907J03778J05870J12167J5119L8952
$$ plain form
5388 193741 148836 1763 -122713 -142088 -241556 -271419 -227308 -117812 -102004 76295 153370
5377 153370 369710 323082 232441 209335 152940 123175 137702 114221 30357 36487 197920
5366 197920 85233 -170363 -192192 -233965 -89092 133468 216136 307322 297368 49908 -105045
5355 -105045 -151601 -234317 -62474 -26644 -76962 19408 126044 147582 -31194 -41530 54549
5344 54549 111197 92111 149324 86591 -122210 -192891 -102218 -27138 200309 165862 11784
5333 11784 -9041 21215 -4098 14853 5203 -77924 41938 105307 143147 82718 127494 78296
5321 78296 15990 -49304 -129393 -321113 -305977 -104239 59595 42070 148023 97389 -50280
5310 -50280 -25983 -31136 -299971 -360055 -280017 -280144 -270112 -252378 -370232 -328294 -200033 49606
$$ packed form
5388A93741m4905j47073j24476j9375r9468k9863M4111J09496J5808J78299P7075
5377A53370K16340m6628r0641k3106n6395k9765J4527k3481q3864O130J61433
5366A97920j12687k55596k1829m1773J44873K22560Q2668R1186r954k47460j54953
5355a05045m6556q2716J71843L5830n0318R6370J06636K1538j78776j0336R6079
5344E4549N6648j9086N7213o2733k08801p0681R0673P5080K27447l4447j54078
5333A1784k0825L0256k5313J8951r650q3127J19862O3369L7840o0429M4776m9198
5321G8296o2306o5294q0089j91720J5136K01738J63834j7525J05953n0634j47669
5310e0280K4297n153k68835o0084Q0038j27J0032J7734j17854M1938J28261K49639
$$ plain form
5298 49606 9210 -4506 -27883 -175842 -164652 -151612 -169269 -142989 -165887 -79628 -85451 23400
5286 23400 -11465 -116697 -194635 -136027 -38506 68509 156089 -54741 -128062 -66745 149098
5275 149098 259905 260792 230286 260945 256416 221970 205278 187950 60616 -85775 -41930 108290
5263 108290 139697 154123 99583 -79702 -111939 75224 31968 -25755 -87599 -212444 -173606
$$ packed form
5298D9606m0396j3716k3377j47959J1190J3040j7657K6280k2898Q6259n823J08851
5286B3400l4865j05232p7938N8608R7521J07015Q7580k10830p3321O1317K15843
5275A49098J10807Q87l0506L0659m529l4446j6692j7328j27334j46391M3845J50220
5263A08290L1407J4426n4540j79285l2237J87163m3256n7723o1844j24845L8838
$$ [...]
##END NTUPLES=NMR SPECTRUM
##END=
