##TITLE=Analysis number 325839
Compound Code cc 36502
Book Reference 518/45
Project Code adrs
Chemist Name colinb
##JCAMPDX= 6.0         $$ Bruker NMR JCAMP-DX V2.0
##DATA TYPE= NMR SPECTRUM
##DATA CLASS= NTUPLES
##ORIGIN= Bruker BioSpin GmbH
##OWNER= nmr
$$ XWIN-NMR		Version 3.5
$$ Tue Jan 16 14:11:25 2007 GMT Standard Time (UT+0h)  MAYBRIDGE\nmr@NMR_250MHZ
##.OBSERVE FREQUENCY= 250.131544655141
##.OBSERVE NUCLEUS= ^1H
##.ACQUISITION MODE= SIMULTANEOUS (DQD)
##.ACQUISITION SCHEME= undefined
##.AVERAGES= 16
##.DIGITISER RES= 18
##SPECTROMETER/DATA SYSTEM= dpx250
##.PULSE SEQUENCE= zg30
##.SOLVENT NAME= CDCl3
##.SHIFT REFERENCE= (INTERNAL, CDCl3, 0, 16.4494)
##AUDIT TRAIL= $$ (NUMBER, WHEN, WHO, WHERE, WHAT)
$$ ##TITLE= Audit trail, XWIN-NMR		Version 3.5
$$ ##JCAMPDX= 5.01
$$ ##ORIGIN= Bruker BioSpin GmbH
$$ ##OWNER= nmr
$$ C:\u/data/dgb/nmr/ADRS/1260/pdata/1/auditp.txt
$$ ##AUDIT TRAIL=  $$ (NUMBER, WHEN, WHO, WHERE, WHAT)
(   1,<2007-01-16 14:11:05.15 +000>,<MAYBRIDGE\nmr>,<NMR_250MHZ>,
      <created by zg, POWCHK disabled, PULCHK disabled
       configuration hash MD5:
       49 4B E0 1D 92 C2 6B 37 9F E6 65 BC 52 41 86 1D
       data hash MD5: 64K
       49 8C C4 22 C9 BD 98 FF 0C BC 46 0A 5F BB E3 09>)
(   2,<2007-01-16 14:11:16.54 +000>,<MAYBRIDGE\nmr>,<NMR_250MHZ>,
      <Start of raw data processing
       ef LB = 0.3 FT_mod = 6 PKNL = 1 SI = 32K 
       data hash MD5: 32K
       7D CD 88 D7 50 9A 49 DE 53 24 CF 2E 62 99 D1 6C>)
(   3,<2007-01-16 14:11:18.15 +000>,<MAYBRIDGE\nmr>,<NMR_250MHZ>,
      <apk 
       data hash MD5: 32K
       1F 1E C0 A2 38 92 73 EA A6 44 84 40 DE 66 C2 BA>)
(   4,<2007-01-16 14:11:18.82 +000>,<MAYBRIDGE\nmr>,<NMR_250MHZ>,
      <abs ABSG = 5 
       data hash MD5: 32K
       ED 9C 57 C1 F0 B4 75 EB 55 F9 43 18 C0 49 43 CC>)
$$ ##END=
$$ 
$$ hash MD5
$$ EB D2 FB ED 1C 98 FC EE A4 3E 1C 47 65 FF 9F 96
##$RELAX= 
##$RELAX= 
##$RELAX= 
##$RELAX= 
##$RELAX= 
##$RELAX= 
##$RELAX= 
$$ Bruker specific parameters
$$ --------------------------
##$DU= <C:\u>
##$EXPNO= 1260
##$NAME= <ADRS>
##$PROCNO= 1
##$TYPE= <nmr>
##$USER= <dgb>
##$AMP= (0..31)
100 100 100 100 100 100 100 100 100 100 100 100 100 100 100 100 100 100 
100 100 100 100 100 100 100 100 100 100 100 100 100 100 
##$AQSEQ= 0
##$AQ_mod= 3
##$AUNM= <au_zg>
##$AUTOPOS= <48 >
##$BF1= 250.13
##$BF2= 250.13
##$BF3= 250.13
##$BF4= 250.13
##$BF5= 500.13
##$BF6= 500.13
##$BF7= 500.13
##$BF8= 500.13
##$BYTORDA= 1
##$CFDGTYP= 0
##$CFRGTYP= 5
##$CHEMSTR= <none>
##$CNST= (0..31)
1 1 145 1 1 1 1 1 1 1 1 1 1 1 1 1 1 1 1 1 1 1 1 1 1 1 1 1 1 1 1 1 
##$CPDPRG= <>
##$CPDPRG1= <>
##$CPDPRG2= <>
##$CPDPRG3= <>
##$CPDPRG4= <mlev>
##$CPDPRG5= <mlev>
##$CPDPRG6= <mlev>
##$CPDPRG7= <mlev>
##$CPDPRG8= <mlev>
##$CPDPRGB= <>
##$CPDPRGT= <>
##$D= (0..31)
0 1 0 0 0 0 0 0 0 0.06 0 0 0 0 0 0 0.0002 0 0 0 0 0 0 0 0 0 0 0 0 0 0 
0 
##$DATE= 1168956664
##$DBL= (0..7)
120 120 120 120 120 120 120 120 
##$DBP= (0..7)
150 150 150 150 150 150 150 150 
##$DBP07= 0
##$DBPNAM0= <>
##$DBPNAM1= <>
$$ [...]
##$SUBNAM7= <"">
##$SUBNAM8= <"">
##$SUBNAM9= <"">
##$SW= 20.6930455092707
##$SWIBOX= (0..15)
0 0 3 0 0 0 0 0 0 0 0 0 0 0 0 0 
##$SW_h= 5175.983436853
##$TD= 65536
##$TD0= 1
##$TE= 294.16
##$TE2= 300
##$TE3= 300
##$TEG= 300
##$TL= (0..7)
0 120 120 120 120 120 120 120 
##$TP= (0..7)
150 150 150 150 150 150 150 150 
##$TP07= 0
##$TPNAME0= <>
##$TPNAME1= <>
##$TPNAME2= <>
##$TPNAME3= <>
##$TPNAME4= <>
##$TPNAME5= <>
##$TPNAME6= <>
##$TPNAME7= <>
##$TPOAL= (0..7)
0.5 0.5 0.5 0.5 0.5 0.5 0.5 0.5 
##$TPOFFS= (0..7)
0 0 0 0 0 0 0 0 
##$TUNHIN= 0
##$TUNHOUT= 0
##$TUNXOUT= 0
##$USERA1= <user>
##$USERA2= <user>
##$USERA3= <user>
##$USERA4= <user>
##$USERA5= <user>
##$V9= 5
##$VALIST= <valist>
##$VCLIST= <CCCCCCCCCCCCCCC>
##$VD= 0
##$VDLIST= <DDDDDDDDDDDDDDD>
##$VPLIST= <PPPPPPPPPPPPPPP>
##$VTLIST= <TTTTTTTTTTTTTTT>
##$WBST= 1024
##$WBSW= 4
##$XGAIN= (0..3)
0 0 0 0 
##$XL= 0
##$YL= 0
##$YMAX_a= 384479
##$YMIN_a= -452602
##$ZGOPTNS= <>
##$ZL1= 120
##$ZL2= 120
##$ZL3= 120
##$ZL4= 120
##$ABSF1= 16.44942
##$ABSF2= -4.243752
##$ABSG= 5
##$ABSL= 3
##$ALPHA= 0
##$AQORDER= 0
##$ASSFAC= 0
##$ASSFACI= 0
##$ASSFACX= 0
##$ASSWID= 0
##$AUNMP= <proc_1d>
##$AZFE= 0.1
##$AZFW= 0.1
##$BCFW= 0
##$BC_mod= 0
##$BYTORDP= 0
##$COROFFS= 0
##$CY= 12.5
##$DATMOD= 1
##$DC= 0
##$DFILT= <>
##$DTYPP= 0
##$F1P= 14.0000005364418
##$F2P= -0.99999901652339
##$FCOR= 0.5
##$FTSIZE= 32768
##$FT_mod= 6
##$GAMMA= 0
##$GB= 0
##$INTBC= 1
##$INTSCL= 1
##$ISEN= 128
##$LB= 0.3
##$LEV0= 0
##$LPBIN= 0
##$MAXI= 10000
##$MC2= 0
##$MEAN= 0
##$ME_mod= 0
##$MI= 0
##$NCOEF= 0
##$NC_proc= -4
##$NLEV= 6
##$NOISF1= 0
##$NOISF2= 0
##$NSP= 0
##$NTH_PI= 0
##$NZP= 0
##$OFFSET= 16.44942
##$PC= 1
##$PHC0= 228.2373
##$PHC1= 17.43409
##$PH_mod= 1
##$PKNL= yes
##$PPARMOD= 0
##$PSCAL= 4
##$PSIGN= 0
##$REVERSE= no
##$SF= 250.130018152308
##$SI= 32768
##$SIGF1= 0
##$SIGF2= 0
##$SINO= 400
##$SIOLD= 32768
##$SREGLST= <1H.CDCl3>
##$SSB= 0
##$STSI= 32768
##$STSR= 0
##$SW_p= 5175.98343685301
##$SYMM= 0
##$S_DEV= 0
##$TDeff= 65536
##$TDoff= 0
##$TI= <Analysis number 999999
Compound Code 99
Book Reference 9
Project Code 9>
##$TILT= no
##$TM1= 0
##$TM2= 0
##$TOPLEV= 0
##$USERP1= <user>
##$USERP2= <user>
##$USERP3= <user>
##$USERP4= <user>
##$USERP5= <user>
##$WDW= 1
##$XDIM= 32768
##$YMAX_p= 301831462
##$YMIN_p= -360636
$$ End of Bruker specific parameters
$$ ---------------------------------
##NTUPLES= NMR SPECTRUM
##VAR_NAME=  FREQUENCY,     SPECTRUM/REAL,   SPECTRUM/IMAG
##SYMBOL=    X,             R,               I
##VAR_TYPE=  INDEPENDENT,   DEPENDENT,       DEPENDENT
##VAR_FORM=  AFFN,          ASDF,            ASDF
##VAR_DIM=   32768,         32768,           32768
##UNITS=     HZ,            ARBITRARY UNITS, ARBITRARY UNITS
##FACTOR=    0.157963299565203, 1,           1
##FIRST=     4114.49395555449, 0,            0
##LAST=      -1061.48948129852, 0,           0
##MIN=       -1061.48948129852, -360636,     0
##MAX=       4114.49395555449, 301831462,    0
$$ Real data points
##PAGE= N=1
##DATA TABLE= (X++(R..R)), XYDATA
$$ [...]
23702A19776p8157k1371J3132p782m9338J9402K9168K0710l4494q3665m7344l3351
$$ 119776 41619 20248 33380 25598 -23740 -4338 24830 45540 11046 -72619 -119963 -153314
23690a53314O0034J55412m1795j7903o195j3478L5426M0776N3083k220j7811K0120
$$ -153314 -93280 62132 20337 2434 -3761 -17239 18187 58963 112046 109826 92015 112135
23678A12135J9747o9794j18431Q8100R456j57983j06950N0588J03760L506P6329
$$ 112135 131882 62088 -56343 31757 41213 -116770 -223720 -173132 -69372 -65866 10463
23667A0463q00m6719o2963l0398k1722k1358N1524j8403k3346o3643P2159P3096
$$ 10463 9663 -37056 -100019 -130417 -152139 -173497 -121973 -140376 -163722 -227365 -155206 -82110
23655h2110O2441M1008k0965j3511M3750L0698L1215j36641K6909M7353L3233
$$ -82110 -19669 21339 374 -13137 30613 61311 92526 -44115 -17206 30147 63380
23644F3380k6169n4703L7570L1436J04066k720n1650j1525p4819j4706K7123R0445
$$ 63380 37211 -17492 20078 51514 155580 152860 101210 89685 14866 160 27283 117728
23632A17728l0852o0416r4875k9870O515Q4121R8799N5026k1794l3078q485j9524
$$ 117728 86876 26460 -68415 -98285 -91770 -7649 91150 146176 124382 91304 82819 63295
23620F3295P238l9161k9717k6130m0412K541L8822P5173J2729o1124m3827M4705
$$ 63295 70533 31372 1655 -24475 -64887 -62346 -23524 51649 64378 3254 -40573 4132
23608D132N559L3572n6671N2836J7443q0579M084p2004k6032O9473L3016L4519
$$ 4132 9691 43263 -13408 39428 56871 -23708 -19624 -91628 -117660 -48187 -15171 19348
23596A9348J5104p6729l1968L088j8428k8728J2211J3474R5778l7810o176k3915
$$ 19348 34452 -42277 -74245 -71157 -89585 -118313 -106102 -92628 3150 -34660 -40836 -64751
23584f4751j2759J21919J25529J05574o0526p3263r652o0756k6276l7688r4404
$$ -64751 -77510 44409 169938 275512 214986 141723 132071 71315 45039 7351 -87053
23573h7053n5387K0424L3381M3684N0060P3226K2772r7998k8987O0350P4509n4067
$$ -87053 -142440 -122016 -88635 -44951 5109 78335 101107 3109 -25878 34472 108981 54914
23561E4914k1738O9890K5762l754k9972l906L8026K442k9216l4892Q283m207j3460
$$ 54914 33176 103066 128828 125074 95102 91196 129222 131664 102448 67556 75839 71632 58172
23548E8172l3134J7992L7056J1523r1945j7264O5313j8178q998L7478n845L9770
$$ 58172 25038 43030 80086 91609 -336 -17600 47713 29535 20537 58015 52170 91940
23536I1940r286j4997J1201o2138m8641K0983R248l9324j7371j1274j9641q599
$$ 91940 82654 67657 78858 16720 -31921 -10938 -1690 -41014 -58385 -69659 -89300 -97899
23524i7899K2793K3227o0454L2327J86770j7955q9137r165o9715p2431m4127M6808
$$ -97899 -75106 -51879 -112333 -80006 106764 88809 -328 -9493 -79208 -151639 -195766 -148958
23512a48958J34080J1804o4113k1150p7319n0747M3553L270q005N4473O7587j5809
$$ -148958 -14878 -3074 -67187 -88337 -165656 -216403 -172850 -169580 -177585 -123112 -55525 -71334
23500g1334j9961l2914N0522N6637k422q21Q557K8102m2828q6504n0536L0840
$$ -71334 -91295 -124209 -73687 -17050 -19472 -20293 -11736 16366 -26462 -112966 -163502 -132662
23488a32662N2001P0756P3633M4871j02676r9068K2961l1395o6545R1785m2454
$$ -132662 -80661 -9905 63728 108599 5923 -93145 -70184 -101579 -168124 -76339 -118793
23477a18793n5523j2607J4424j6626P0545O7094O5792K6794r87j545M3260p7930
$$ -118793 -174316 -186923 -172499 -189125 -118580 -51486 14306 41100 40113 38568 81828 3898
23465C898M784k8890k3608j0003l3984J9584O2196J7687l5205M7310M129O2362
$$ 3898 8682 -20208 -43816 -53819 -87803 -68219 -6023 11664 -23541 23769 27898 90260
23453I0260j5278K5263L3567L5515l4417j15365K3181O738j7818m4322j05061
$$ 90260 74982 100245 133812 169327 134910 19545 42726 49464 31646 -12676 -117737
23442a17737m6513R8396K0543j7605q5842K1977J47130N8958J4094l3786L9325
$$ -117737 -164250 -65854 -45311 -62916 -148758 -126781 20349 79307 93401 59615 98940
23431I8940l4061o7593L415L6147J2546q8542m3432K3316L1397n0654j5015n3935
$$ 98940 64879 -2714 701 36848 49394 -39148 -82580 -59264 -27867 -78521 -93536 -147471
23419a47471j966M8955n5292j497P5589Q3461m493j4144K0505l475L2504R973
$$ -147471 -149437 -100482 -155774 -157271 -81682 1779 -2714 -16858 3647 172 32676 42649
23407D2649j52144Q659M8837Q6740J4422q2869l2081J31380J6952J506q4892Q327
$$ 42649 -109495 -100836 -51999 34741 49163 -33706 -65787 65593 82545 84051 -841 7486
23395G486L0329j3827q7755r7616O981N7187j6334o6437L8431r253R4427Q0490
$$ 7486 37815 23988 -63767 -161383 -154402 -97215 -113549 -179986 -141555 -150808 -56381 24109
23383B4109L0984j49493p5960m9102M7062O9200j8628k1488P0376O5651l625k898
$$ 24109 55093 -94400 -170360 -219462 -172400 -103200 -121828 -143316 -72940 -7289 -10914 -13812
23371a3812K8919n3766m4155J2865R199k1305M8467K4191r978r879K4658n536
$$ -13812 15107 -38659 -82814 -69949 -60750 -82055 -33588 -9397 -19375 -29254 -4596 -10132
23359a0132J2039L1032l5861k088k0498j648J00763J7490q9768n4586l9076k2119
$$ -10132 1907 32939 -2922 -5010 -25508 -27156 73607 91097 1329 -53257 -92333 -114452
23347a14452J7080K8685p540m7423P9337R1184j2689P8725j3167p5892m8573r043
$$ -114452 -97372 -68687 -76227 -123650 -44313 46871 34182 112907 99740 23848 -24725 -33768
23335c3768n4741K4252r857l7213N5494n7397o6092J5480J19900m5944j6844L1925
$$ -33768 -88509 -64257 -74114 -111327 -55833 -113230 -179322 -163842 -43942 -89886 -106730 -74805
23323g4805M4975K4366q2144q1585L0906m5242L738J18305N9749L3772K8254p0325
$$ -74805 -29830 -5464 -87608 -169193 -138287 -183529 -179791 -61486 -1737 32035 60289 -10036
23311a0036j12837p1011O8530J35080n4538n3578p1077K1849k1376j2731N584
$$ -10036 -122873 -193884 -125354 9726 -44812 -98390 -169467 -147618 -168994 -181725 -176141
23300a76141P4890L8235j8283J6590P846j7311K4675M1920j2779M592L6061k4078
$$ -176141 -101251 -63016 -81299 -64709 -56863 -74174 -49499 -7579 -20358 -15766 20295 -3783
23288c783o9794l3987J3951l4532M0138L0938N6599k06r0760J5707J3674J6327
$$ -3783 -73577 -107564 -93613 -128145 -88007 -57069 -470 -676 -91436 -75729 -62055 -45728
23276d5728j8952q0641K5369M4867O6798o011J03013m027p2967R228L8603Q3339
$$ -45728 -64680 -145321 -119952 -75085 -8287 -14298 88715 84688 11721 20949 59552 142891
23264A42891l5223j3230P6785p5358p0006L1974r719m6642q653P3013M518M7293
$$ 142891 107668 94438 171223 95865 25859 57833 48114 1472 -7181 65832 70350 117643
23252A17643j4495J7182n9137j11080J9870J02214J8640l355L4104K9300L9207
$$ 117643 103148 120330 61193 -49887 -30017 72197 90837 87482 121586 150886 190093
23241A90093j23083j00610N4048K4546j9281M984o276l3555j2427q740k5716O353
$$ 190093 67010 -33600 20448 44994 25713 30697 24421 -9134 -21561 -30301 -56017 -49664
23229d9664O8199k070J4194M7858Q492n6791k4940n1989m9856k3445P9366J17510
$$ -49664 18535 16465 30659 78517 87009 30218 5278 -46711 -96567 -120012 -40646 76864
23217G6864K8612n1202p4078n298K7327K8839o20l264P0479o0025j25500l3631
$$ 76864 105476 54274 -19804 -25102 2225 31064 30444 27180 97659 37634 -87866 -121497
23205a21497m61l6093O0818J17412l1743o9021k0715Q5842J4063M6122J3437J749
$$ -121497 -121958 -158051 -97233 20179 -11564 -80585 -101300 -15458 -1395 44727 58164 59913
23193E9913p2208j8695O4681j3282l1260j19334j4472R7692o0135n5176M1599
$$ 59913 -12295 -30990 33691 20409 -10851 -130185 -144657 -46965 -107100 -162276 -120677
23182a20677j2230n2373J9113J32460n0766o6795M9448O4964k9215m1253j4696
$$ -120677 -132907 -185280 -166167 -33707 -84473 -151268 -101820 -36856 -66071 -107324 -122020
23171a22020J03950Q6009K6042n9781o270O7426P0756o4623j01572k6527l4180
$$ -122020 -18070 67939 93981 34200 27930 95356 166112 101489 -83 -26610 -60790
23160f0790K3673P098m8386l3776J6076J5270p934N3111K9927R090J9078n6356
$$ -60790 -37117 -30019 -78405 -112181 -96105 -80835 -88769 -35658 -5731 3359 22437 -33919
23148c3919j1917o874j0677p876m7258J7593R0933M2787M6008r0711r4521j0483
$$ -33919 -45836 -52710 -63387 -71263 -118521 -100928 -9995 32792 78800 -11911 -106432 -116915
23136a16915m885K3602L1066n2443J3055N0259L5037Q9932k5827j4999r4800K1192
$$ -116915 -121800 -98198 -67132 -119575 -106520 -56261 -21224 68708 42881 27882 -66918 -45726
23124d5726K8180m4718j3068J23J1101k5531J03609J03017N2625j01068n2218
$$ -45726 -17546 -62264 -75332 -75209 -64108 -89639 13970 116987 169612 68544 16326
23113A6326k0209r6897K6583K9443L0746K0777p8485j7246Q5679N8106K643l9347
$$ 16326 -3883 -100780 -74197 -44754 -14008 6769 -71716 -88962 -3283 54823 57466 18119
23101A8119r5510n1512R859R4076J02027P1046l5929n3714l9532o0856N9584O6717
$$ 18119 -77391 -128903 -119044 -24968 77059 148105 112176 58462 18930 -41926 17658 84375
23089H4375j4289l50J3814n2222o5383n4307L4164J2755j8139L8264R783L6115
$$ 84375 70086 69736 83550 31328 -34055 -88362 -54198 -41443 -59582 -21318 -11535 24580
23077B4580N2525q0441p2865L1281J333M6345O368o1417N6688P8218q413K3534
$$ 24580 77105 -3336 -76201 -44920 -43587 2758 9126 -52291 4397 82615 74202 97736
23065I7736k730o1199q1891M0545J4019l5177j0778O4728O056o0061k7406n620
$$ 97736 95006 33807 -48084 -7539 6480 -28697 -39475 25253 31309 -28752 -56158 -61778
23053f1778p77J5420L9330k052o3275q8670N2141J03138J8100k3100P3545M1790
$$ -61778 -62555 -47135 -7805 -9857 -73132 -161802 -109661 -6523 11577 -11523 62022 103812
23041A03812J6859n8079j1125Q6082M046j53438p8089q96P1920J10555r304j9107
$$ 103812 120671 62592 51467 137549 141595 -11843 -89932 -90828 -18908 91647 82343 63236
23029F3236j04016J00346R6010L4327k675j4752j24808n6747O9713m4011r2779
$$ 63236 -40780 59566 155576 189903 187228 172476 47668 -9079 60634 16623 -76156
23018g6156m5688N9742l3806N444L6500o2289L8216L7788m8377n7254J21797M7591
$$ -76156 -121844 -62102 -95908 -90464 -53964 -116253 -78037 -40249 -88626 -145880 -24083 23508
23006B3508K7726K7187p079J1125N883J5287o606j05449o8674l814N2131k0937
$$ 23508 51234 78421 71342 82467 88350 103637 97031 -8418 -77092 -80906 -28775 -49712
22994d9712K6918j38148j02716P1111O6901R1686K6897m1318j3626M2150L5829
$$ -49712 -22794 -160942 -263658 -192547 -125646 -33960 -7063 -48381 -62007 -19857 15972
22983A5972N937J1924q9901J1864P1793L9134m657k733r5671l6287j3879M9100
$$ 15972 21909 33833 -56068 -44204 27589 66723 62066 59333 -36338 -72625 -86504 -37404
22971c7404P1625M249K4737n7325q5320K1682O5053Q8555j0884K355m3228j7934
$$ -37404 34221 38470 63207 5882 -79438 -57756 7297 95852 84968 87323 44095 26161
22959B6161m7669j0095k1323P9898P8841n6264K6417n4635l3169N4529K1850r4308
$$ 26161 -21508 -31603 -52926 26972 105813 49549 75966 21331 -11838 42691 64541 -29767
22947b9767l5995K1241o3025N266J12839Q1044q5848L6203M3701n9256m9940j9507
$$ -29767 -65762 -44521 -107546 -102280 10559 91603 5755 41958 85659 26403 -23537 -43044
22935d3044J3679q3784j15623K6943R1166J69252K4208M9640M4325l2578p8090
$$ -43044 -29365 -113149 -228772 -201829 -110663 58589 82797 132437 176762 144184 66094
22924F6094p6105k973J3569N5859K0680L5557K6982m6669p3381l1878K1307N0251
$$ 66094 -10011 -12984 585 56444 77124 112681 139663 92994 19613 -12265 9042 59293
22912E9293r0997P2307m1540m6912j1175M9830O5508K6075K0290k5577N6592J799
$$ 59293 -31704 40603 -937 -47849 -59024 -9194 56314 82389 102679 77102 133694 135493
22900A35493l6290o1696K965N439m3379K6837J8462l4303J471L632l4198Q130
$$ 135493 99203 37507 40472 45911 2532 29369 47831 13528 14999 18631 -15567 -7437
22888g437m8351L2681p072L0201O4256l5369l3012j3798m9813p5747k6789J26922
$$ -7437 -55788 -23107 -30179 22 64278 28909 -4103 -17901 -67714 -143461 -170250 -43328
22876d3328R5283M8056k8465k0321j5783J3327N8384J7183O4082m6577r0644n0063
$$ -43328 51955 100011 71546 51225 35442 48769 107153 124336 188418 141841 51197 1134
22864A134K0076m4088j3855O4872j04353m9039j7564O7916L9169L7436q5924k6489
$$ 1134 21210 -22878 -36733 28139 -76214 -125253 -142817 -74901 -35732 1704 -84220 -110709
22852a10709M063P3752j9857M2060N9479O8610l863l6563j10644l5332K573R8021
$$ -110709 -106646 -32894 -52751 -10691 48788 117398 113535 76972 -33672 -69004 -66431 31590
22840C1590M079p5763q948K435L4340P7428P2830J6105k6811p8811J7665n573
$$ 31590 35669 -40094 -49042 -46607 -12267 65161 137991 154096 127285 48474 66139 60566
22828F0566l7319j06763m5631J01888M6380Q753j4739p0420K84j7479Q8762l438
$$ 60566 23247 -83516 -129147 -27259 19121 27874 13135 -57285 -57001 -74480 14282 10844
22816A0844M9979J3333o726m5803k0432j2111N1825Q5295J6650o7585M9006m6572
$$ 10844 60823 74156 67430 21627 1195 -10916 40909 126204 142854 75269 124275 77703
22804G7703q3903l250O4219N1204k8393k4032o523q2146j2795O8315k8370N983
$$ 77703 -6200 -9450 54769 105973 77580 53548 47025 -35121 -47916 20399 -7971 -1988
22792a988k663k9368N5586p6052p4615O6695J0270M8206m8291m7053N3656Q7685
$$ -1988 -4651 -34019 21567 -54485 -129100 -62405 -52135 -3929 -52220 -99273 -45617 42068
22780D2068J6292L264j3977j341k4021m1495j3345j4377j1267n5953N0962J2291
$$ 42068 58360 61624 47647 46306 22285 -19210 -32555 -46932 -58199 -114152 -63190 -50899
22768e0899P7832m392m0278j5007k2230O4723j229o982r3745j2144O0518O2863
$$ -50899 26933 22541 -17737 -32744 -54974 9749 8520 1538 -92207 -104351 -43833 19030
22756A9030m0504m4716J2113L3127J5261k2391L6108o708K2718J8751l357n8673
$$ 19030 -21474 -66190 -54077 -20950 -5689 -28080 8028 1320 24038 42789 39432 -19241
22744a9241p298K4371n8178N3235O1696J2095n2046m8838J30331N1881p6738p4814
$$ -19241 -26539 -2168 -60346 -7111 54585 66680 14634 -34204 96127 148008 71270 -3544
22732c544n9039M3376k2410k3051N6900J8432M7450K2725l2229R70k9977M3043
$$ -3544 -62583 -19207 -41617 -64668 -7768 10664 58114 80839 48610 49580 19603 62646
22720F2646K7481q2891j18278J8275N884K1831M4891m4619k4367j1659K947O7344
$$ 62646 90127 7236 -111042 -92767 -86883 -65052 -20161 -64780 -89147 -100806 -97859 -30515
22708c0515L7344l4941q2192O3303K3182Q0522L6144j64521J4760r149M4629N9718
$$ -30515 6829 -28112 -110304 -47001 -23819 56703 92847 -71674 -56914 -66063 -21434 38284
22696C8284J0555k7920J4048j7677j06221n845O7143K0174J4682k3919j6448O4450
$$ 38284 48839 20919 34967 17290 -88931 -94776 -27633 -7459 7223 -16696 -33144 31306
22684C1306M8277J4758j21290q8779K498N8467L6526M1533L2014J4958m4562n9496
$$ 31306 79583 94341 -26949 -115728 -113230 -54763 -18237 23296 55310 70268 25706 -33790
22672c3790R699k9086N8518O3751N2671k8441r4388K2351K3976q4998j1999O6243
$$ -33790 -24091 -53177 5341 69092 121763 93322 -1066 21285 45261 -39737 -51736 14507
22660A4507j01303k098J5417m1201J98R2391J44695K9186p8529r6979j9666n8665
$$ 14507 -86796 -88894 -73477 -114678 -114480 -22089 122606 151792 73263 -23716 -43382 -102047
22648a02047j2306j2894J4869N931O1171J07539m9336j06301p8559Q4318M7960
$$ -102047 -114353 -127247 -112378 -106447 -45276 62263 12927 -93374 -171933 -87615 -39655
22637c9655R3868L5220J4232M7401o3710j27463j17379K2006M0055N4816L0679
$$ -39655 54213 89433 103665 151066 87356 -40107 -157486 -135480 -95425 -40609 -9930
22626i930m3340p3100L9957P1657K2300L9646J1476r2247l981J3987m1101K7589
$$ -9930 -53270 -126370 -86413 -14756 7544 47190 58666 -33581 -37562 -23575 -64676 -37087
22614c7087M2153n008q0483n3271L2893L6638O2685j1887j4357J03827J8075M3438
$$ -37087 5066 58 -80425 -133696 -100803 -64165 -1480 -13367 -27724 76103 94178 137616
22602A37616O5132o6817p0058o0754j9381l3536L7472K7039m5415n9190M2293
$$ 137616 202748 135931 65873 5119 -14262 -47798 -10326 16713 -28702 -87892 -45599
22591d5599J4049J11912l0052j2589K3785q9692j0144K2943P9098j9328k4055
$$ -45599 -31550 80362 50310 37721 61506 -28186 -38330 -15387 63711 44383 20328
22580B0328M5893j2873k071K5329J9352j3374m513L1476N7630m5088j05942O890
$$ 20328 66221 53348 51277 76606 95958 82584 78071 109547 167177 122089 16147 23037
22568B3037R724K002o727J6858q279O764n412j8394l1250L7770O3660o8524k2790
$$ 23037 32761 34763 28036 44894 36615 43379 37967 19573 -11677 26093 89753 21229 -1561
22555a561L6144M787M3129l7057j08032l3073J11507M8105q9227p8523J0695M3205
$$ -1561 34583 39370 82499 45442 -62590 -95663 15844 63949 -25278 -103801 -93106 -49901
22543d9901R983M990M3483K2937K1078L0415m1478N9306L1004j03228j7953j7182
$$ -49901 -39918 -34928 8555 31492 52570 82985 41507 100813 131817 28589 10636 -6546
22531f546j9372J4753N5909q1995l9442J02668j7842o5149Q718k4360N6199O3963
$$ -6546 -25918 -11165 44744 -37251 -76693 25975 8133 -57016 -48298 -72658 -16459 47504
22519D7504J8853l0768M4574p3339o2019L8022K7883n992K9330O869l0880l4977
$$ 47504 66357 35589 80163 6824 -55195 -17173 10710 4718 34048 40917 10037 -24940
22507b4940K5442K9332N63L09o745n0441m3623j2834Q9982O3280q842m3174K3639
$$ -24940 502 29834 30397 30706 23961 -26480 -70103 -82937 7045 70325 61483 18309 41948
22494D1948l893R867o1139P553P2789n1135M408N3812n6693O792J992N487o1698
$$ 41948 38055 47922 -13217 -5664 67125 15990 20398 74210 17517 24309 26301 31788 -29910
22481b9910j2519J47413J0869p2246J2877L9035l9450q4815j6745P6510N4319
$$ -29910 -42429 104984 115853 43607 56484 95519 56069 -28746 -45491 31019 85338
22470H5338O4546q0746k4984J8007j2475K5739M6375l9213m5116j10747O3079
$$ 85338 149884 69138 44154 62161 49686 75425 121800 82587 37471 -73276 -10197
22459a0197Q1087P4116M7995n142r2208q4792j6504K8079j03650o5129N8925r678
$$ -10197 70890 145006 193001 187859 95651 10859 -5645 22434 -81216 -146345 -87420 -97098
22447i7098K4945l0775k7449N5691O5677J9168j29055J1652O2792N8527j4063
$$ -97098 -72153 -102928 -130377 -74686 -9009 10159 -118896 -107244 -44452 14075 12
22436A2l2674N068K9951N7337m2067n1226j04255j7734K3910m708K0689L1156
$$ 12 -32662 -27594 2357 59694 17627 -33599 -137854 -155588 -131678 -136386 -115697 -84541
22424h4541Q150m1947o2502J2067j7781J5433L92M0056N4943J3915O3498q053
$$ -84541 -76391 -118338 -180840 -168773 -186554 -171121 -170729 -130673 -75730 -61815 1683 -6370
22412f370r732k6579K6585p0248Q6671l4424o2942p1951N6304J06257N6186p891
$$ -6370 -16102 -42681 -16096 -86344 327 -34097 -97039 -168990 -112686 -6429 49757 41866
22400D1866p6671J8936l0929l3804n7251k8724J8708P4307O3864l7606k5570L6924
$$ 41866 -34805 -15869 -46798 -80602 -137853 -166577 -147869 -73562 -9698 -47304 -72874 -35950
22388c5950J07903R914o8010o3056L4513Q2183j8525p3561j0630j3367J09769
$$ -35950 71953 81867 13857 -49199 -14686 67497 48972 -24589 -35219 -48586 61183
22377F1183K0041o8527n9061O6180K2669j2221K8056o541M2949j4637m8462J6518
$$ 61183 81224 12697 -46364 19816 42485 30264 58320 51779 94728 80091 31629 48147
22365D8147k4250n4256K8444l0518k1924J13490N1133o1267K8932k4612r1484
$$ 48147 23897 -30359 -1915 -32433 -54357 59133 110266 48999 77931 53319 -38165
22354c8165j06679l926K1280P6307J19801M8634n7360m1353j18366n2990M2004
$$ -38165 -144844 -148770 -127490 -51183 68618 117252 59892 18539 -99827 -152817 -110813
22343a10813j8249o223j9693Q4720l678q1363l5709j2059Q9846N1646O977M6707
$$ -110813 -129062 -135285 -154978 -70258 -73936 -155299 -191008 -203067 -113221 -61575 -54598 -7891
22331g891j3838L1777Q950j4388M226N5001N650n5250J1912L0320K8783L5528
$$ -7891 -21729 10048 18998 4610 8836 63837 69487 14237 26149 56469 85252 120780
22319A20780p1590k5145O520O275K5235j6726j24031o7258k8956j6902O8275J23734
$$ 120780 49190 24045 30565 36840 62075 45349 -78682 -145940 -174896 -191798 -123523 211
22307B11L6499P923k240j7473k9955o4585m3743N9930P0238J8604K7881l9293
$$ 211 36710 44633 42393 24920 -5035 -69620 -113363 -53433 16805 35409 63290 23997
22295B3997k8578r093K1519N933J2724L7499j8653m3891K4934Q281k6963n2770
$$ 23997 -4581 -13674 7845 13778 26502 64001 45348 1457 26391 34672 7709 -45061
22283d5061N5075n2183m8129o5167m688J01480K3287J3621N6212l2661K2589q18
$$ -45061 10014 -42169 -90298 -155465 -160153 -58673 -35386 -21765 34447 1786 24375 23557
22271B3557r6712j38035M9248O5543l4834m5240L6518L7563k205J3714L1803K7657
$$ 23557 -73155 -211190 -161942 -96399 -131233 -176473 -139955 -102392 -104597 -90883 -59080 -31423
22259c1423l7274J0035L6481j1863k7052l0759J111K632j5239O2970L3182l2058
$$ -31423 -68697 -58662 -22181 -34044 -61096 -91855 -90744 -88112 -103351 -40381 -7199 -39257
22247c9257j13787l1986J06372J02041M4376O2021L4213j2394J6336o4889j04653
$$ -39257 -153044 -185030 -78658 23383 67759 129780 163993 151599 167935 103046 -1607
22236a607M6741j0035l1902m1683j10004l1952J31826K874L4847q1115r03P154
$$ -1607 45134 35099 3197 -38486 -148490 -180442 -48616 -45742 -10895 -92010 -92913 -85759
22224h5759j6785o3195k2335K02464R0154p3159K4445q1053r6019r368J7719K5537
$$ -85759 -102544 -165739 -188074 14390 104544 31385 55830 -25223 -121242 -130610 -112891 -87354
22212h7354k3431J8252P0379o1211l1844O0499Q7313l2074o7669P839O7851O7258
$$ -87354 -110785 -92533 -22154 -83365 -115209 -54710 32603 529 -67140 -59301 8550 75808
22200G5808J6326l5445J1238o4400m5709l1261o5041k3502O0174L215J10519j4218
$$ 75808 92134 56689 67927 3527 -42182 -73443 -138484 -161986 -101812 -98597 11922 -2296
22188b296j0960M70m0760K2060P1884J9209l9614R692l2426j4953N4322N0366
$$ -2296 -13256 -12786 -53546 -31486 40398 59607 19993 29685 -2741 -17694 36628 86994
22176H6994l7184l2796R8434L8581r5339m9027m6270O97l3431m7394j7525O7804
$$ 86994 49810 17014 115448 154029 58690 9663 -36607 -35910 -69341 -116735 -134260 -66456
22164f6456J38636N1952O2204M8656n4395j15294r919r2648K9805j4405n260L4799
$$ -66456 72180 124132 186336 234992 180597 65303 55384 -37264 -7459 -21864 -27124 7675
22152G675N6511L7927k5304j2000L6913J03110j26371l8533J7337n283n2914n3224
$$ 7675 64186 102113 76809 64809 101722 204832 78461 39928 57265 51982 -932 -54156
22140e4156j8669J0007o231j5583q1235J0500K8213N5881M1615k8661o46M4098
$$ -54156 -72825 -62818 -69049 -84632 -165867 -155367 -127154 -71273 -29658 -58319 -58965 -14867
22128a4867q9331j22964L4790Q5772k4417K2310M8168O5438O2797p572p1975K7893
$$ -14867 -104198 -227162 -192372 -106600 -131017 -108707 -60539 4899 67696 60124 -11851 16042
22116A6042O6080K52J3664k219K325l6248J866l4074m7281k8740M110q4813O1854
$$ 16042 82122 82374 96038 93819 96144 59896 61762 27688 -19593 -48333 -44223 -129036 -67182
22103f7182R0821n6317j0238k0843L7842k788k7726l1648K2717O764n680Q58k2993
$$ -67182 23639 -32678 -42916 -63759 -25917 -28705 -56431 -88079 -65362 -58598 -64278 -63420 -86413
22090h6413M3298R9554n2742p3528J5761j7980K7735L9752p243O1932P2045o345
$$ -86413 -43115 56439 3697 -69831 -54070 -72050 -44315 -4563 -11806 50126 122171 115826
22078A15826j21426j00345p543M9002P7708Q7870l5552k0576L213k0477J3276
$$ 115826 -5600 -105945 -113488 -64486 13222 101092 65540 44964 48177 27700 40976
22067D0976K9843m1526R54P7616j9269l4449n2965K3606K0189L1519k6742l0256
$$ 40976 70819 29293 30247 107863 88594 54145 1180 24786 44975 76494 49752 19496
22055A9496J0714M666J9716k2844k8340j8587j3554j3234J4719j5461K1281N3855
$$ 19496 30210 34876 54592 31748 3408 -15179 -28733 -41967 -27248 -42709 -21428 32427
22043C2427m6973j0405N8719P4422J9929j08473q1520r808J4523N7079K3793J5323
$$ 32427 -14546 -24951 33768 108190 128119 19646 -61874 -71682 -57159 -80 23713 39036
22031C9036J581L2748k7631o9948J921k5236j4607P205N2181N7400r908n2626
$$ 39036 40617 73365 45734 -24214 -22293 -47529 -62136 -54931 -2750 54650 44742 -7884
22019g884k4221r550m7524K8893j4201p1446M4938N4104K3642q0909q345O3930
$$ -7884 -32105 -41655 -89179 -60286 -74487 -145933 -100995 -46891 -23249 -104158 -112503 -48573
22007d8573j670o2654q2814L5406O8931L882Q248J5959K1600j1163m5107K8425
$$ -48573 -50243 -112897 -195711 -160305 -91374 -87492 -79244 -63285 -41685 -52848 -97955 -69530
21995f9530q5910P361Q4621L0831p106n3038P117J9087J03166M7073N8454j307
$$ -69530 -155440 -148079 -63458 -32627 -39733 -92771 -85654 -66567 36599 83672 142126 140819
21983A40819r9417o1724o772L6740L2927j6060L6761l8572K858k4943L7223m2185
$$ 140819 41402 -20322 -27094 9646 42573 26513 63274 24702 27560 2617 39840 -2345
21971b345L9264p1467l9775L9699N8489l3110R3600n7690r3547r062N4991R189
$$ -2345 36919 -34548 -74323 -34624 23865 -9245 84355 26665 -66882 -75944 -20953 -11764
21959a1764q8856m1854L5683P3477J06097j5791p5484N4481L8178m1726q6947
$$ -11764 -100620 -142474 -106791 -33314 72783 56992 -18492 35989 74167 32441 -54506
21948e4506o1992l3543R565P3586L9212M7646J50037j0118J3626l8691K814N5944
$$ -54506 -116498 -150041 -140476 -66890 -27678 19968 170005 159887 173513 134822 137636 193580
21936A93580l8902j38323l7975m9594O6228K5187r7268O3364N0979j795M4683
$$ 193580 154678 16355 -21620 -71214 -4986 20201 -77067 -13703 37276 35481 80164
21925H0164q3846P115M6538L7472q8351n8168J0572K6582M0240k8697j2399j7123
$$ 80164 -3682 3433 49971 87443 -908 -59076 -48504 -21922 18318 -10379 -22778 -39901
21913c9901k5420o6872j870O1307Q6739Q3747n1156m452J0190n2237o9278n7644
$$ -39901 -65321 -132193 -134063 -72756 13983 97730 46574 42122 52312 75 -69203 -126847
21901a26847O5050K9223P779k046Q1232O2621k3454p9572o2646j19383O8899J18765
$$ -126847 -61797 -32574 -24795 -26841 54391 117012 93558 13986 -48660 -168043 -99144 19621
21889A9621J15332K7909j14592l1181m1561m5400j588m4717k9317j2479P2275
$$ 19621 134953 162862 48270 17089 -24472 -69872 -71460 -116177 -145494 -157973 -85698
21878h5698J23356P8392k534l6164k4327l9016J8529k5334K3764N9160n7318j37331
$$ -85698 37658 116050 113516 77352 53025 14009 32538 7204 30968 90128 32810 -104521
21866a04521r1062m7643N3403M3811K127o6828l3147J3689M6634R4246M0289J5297
$$ -104521 -195583 -243226 -189823 -146012 -143885 -210713 -243860 -230171 -183537 -89291 -49002 -33705
21854c3705M9394J7182J2506j7245J112l5424o801L5091O825r0940k0593J452
$$ -33705 15689 32871 45377 28132 29244 -6180 -12981 22110 28935 -62005 -82598 -81146
21842h1146M85K1533K8016N4562N533m6264l0727j1409Q6709O7406J5384k6314
$$ -81146 -80661 -59128 -31112 23450 28983 -17281 -48008 -59417 27292 94698 110082 83768
21830H3768m5817M138L389L0628o5725j4455q374p538l3050n2101K4835L0882
$$ 83768 37951 42089 45478 76106 10381 -4074 -12448 -19986 -53036 -105137 -80302 -49420
21818d9420m807m4714L2530L0289L8731R9079m3888j52839p5710J107J07633r76
$$ -49420 -54227 -98941 -66411 -36122 2609 101688 57800 -95039 -170749 -169642 -62009 -62985
21806f2985M5535K3913k0244K8801P8098j5712r0514q0211O129K0611o9936k1865
$$ -62985 -17450 6463 -13781 15020 93118 77406 -13108 -93319 -87190 -66579 -136515 -158380
21794a58380Q0001q500J2016M5564J595O873j193N6718N9897q3996J5891r920
$$ -158380 -78379 -86879 -74863 -29299 -27704 -20831 -22024 34694 94591 10595 26486 16566
21782A6566n6042r706O9881J2914p5979m9966J1265m2148M8504L8969K2713J1807
$$ 16566 -39476 -49182 20699 33613 -42366 -92332 -81067 -123215 -74711 -35742 -13029 -1222
21770a222K7876O329L4147j292J7983P4311R4540p7337j34467l0643o7947m4961
$$ -1222 26654 32983 67130 65838 83821 158132 252672 175335 40868 10225 -57722 -102683
21758a02683L3039M0152j6137k1739p543P7359K544l7997l9482m6414J28007M5492
$$ -102683 -69644 -29492 -45629 -67368 -74911 2448 4992 -33005 -72487 -118901 9106 54598
21746E4598m2330K1812J8857r0862N6181K4078r1365k1704l1823K5966J01154
$$ 54598 12268 34080 52937 -37925 18256 42334 -49031 -70735 -102558 -76592 24562
21735B4562L8727l2309m4868J032l4231k9868p6419L9473O3411N3614J8884M6838
$$ 24562 63289 30980 -13888 -12856 -47087 -76955 -153374 -113901 -50490 3124 22008 68846
21723F8846M4779m4074j0507K5688J2583m729M0450m3817k5006q136L6882K8361
$$ 68846 113625 69551 59044 84732 97315 92586 133036 89219 64213 56077 92959 121320
21711A21320N450n2624l5849K1513o6001n1864K4727M4438L0123k0407m6300P8868
$$ 121320 126770 74146 38297 59810 -6191 -58055 -33328 11110 41233 20826 -25474 53394
21699E3394R5925L9355m9147j8184k910k5306M1156k5934L6165K3990j6307m5286
$$ 53394 149319 188674 139527 121343 118433 93127 134283 108349 144514 168504 152197 106911
21687A06911J3180k9631k4122o1463j1724Q585k8183o386N4274o3491m3409M1550
$$ 106911 120091 90460 66338 4875 -6849 1736 -26447 -32833 21441 -42050 -85459 -43909
21675d3909N0293N5526l8778N792M0962p9211O4383j6374m4290M9204N2655q3350
$$ -43909 6384 61910 23132 28924 69886 -9325 55058 38684 -5606 43598 96253 12903
21663A2903L3616n0601j9913q8946L7085J25845J11073L1445j09019M8496M5289
$$ 12903 46519 -4082 -23995 -112941 -75856 49989 161062 192507 83488 131984 177273
21652A77273j07844k8771K0701o5621k7416n0698m7186J51958L7727O458k9777
$$ 177273 69429 40658 61359 -4262 -31678 -82376 -129562 22396 60123 66581 36804
21641C6804j34290L5768N8783L6535j4290r4595Q3261P5491l4592p9046R125J8095
$$ 36804 -97486 -61718 -2935 33600 19310 -75285 7976 83467 48875 -30171 -21046 -2951
21629b951M2215k012q4064o7880J8439k426l8848J8466P3418j0724N9230m1837
$$ -2951 39264 37252 -46812 -114692 -96253 -98679 -137527 -119061 -45643 -56367 2863 -38974
21617c8974m6916K2966K5583j0819M1651M1690j29898j1188P2178l598J04510
$$ -38974 -85890 -62924 -37341 -48160 -6509 35181 -94717 -105905 -33727 -37325 67185
21606F7185m6931q2961j0351N0430K0616k570n1259l8474L6814K0849K9090o509
$$ 67185 20254 -62707 -73058 -22628 -2012 -4582 -55841 -94315 -57501 -36652 -7562 -14071
21594a4071K876n6547j496N5288j5785n771j4018m1103K3006J8406q312k253K2247
$$ -14071 -11195 -67742 -69238 -13950 -29735 -35506 -49524 -90627 -67621 -49215 -57527 -59780 -37533
21581c7533J5538K6552R0130P5606L9270n5644p0732k6349J3227n2934m8190n3138
$$ -37533 -21995 4557 94687 170293 209563 153919 83187 56838 70065 17131 -31059 -84197
21569h4197j0750J3096O1104N4591p9673L0373M5455m6179j06331o3340N2527
$$ -84197 -94947 -81851 -20747 33844 -45829 -15456 29999 -16180 -122511 -185851 -133324
21558a33324J08382j4017p8444M3877O7986N9992L165K5539k0535n4875P2773
$$ -133324 -24942 -38959 -117403 -73526 -5540 54452 57617 83156 62621 7746 80519
21547H0519J8444k5756J2811j21730j1905J2995M614m13J3719K4564n1454K3520
$$ 80519 98963 73207 86018 -35712 -47617 -34622 -30008 -30421 -16702 7862 -43592 -20072
21535b0072k6261r5993O0085N9661l0670j4929K7926l706n2166L280P629k0601
$$ -20072 -46333 -142326 -82241 -22580 -53250 -68179 -40253 -43959 -96125 -92845 -85216 -105817
21523a05817n386q718J00907J4413L6343L5247r8342n8090M0980M3357K3119m3412
$$ -105817 -111203 -119921 -19014 -4601 31742 66989 -31353 -89443 -48463 -5106 18013 -25399
21511b5399K1255n434M8161L362n0790M4510L1922L93K3974R001j02242j06751
$$ -25399 -4144 -9578 38583 41945 -8845 35665 67587 67980 91954 100955 -1287 -108038
21499a08038j2061O9336Q3966L1093q2555J4042Q528K2123K858j01026M4409K7668
$$ -108038 -120099 -50763 33203 64296 -18259 -4217 4311 26434 29292 -71734 -27325 343
21487C43o7663o1653K2529J01255L8911r122k0789N8809o341q2052j3821M2844
$$ 343 -67320 -128973 -106444 -5189 33722 24600 3811 62620 56279 -25773 -39594 3250
21475C250n102m8108K1185L8983J49885J747n8042k6234n9922k6240p125p0438
$$ 3250 -1852 -49960 -28775 10208 160093 161840 103798 77564 17642 -8598 -15723 -86161
21463h6161k7301Q733p3212l4322m131p9953o4289J07364J23756O8064O4831J8673
$$ -86161 -113462 -104729 -177941 -212263 -216394 -296347 -360636 -253272 -129516 -61452 3379 22052
21451B2052q4336o8531J6471j1610M4451P8234P0123N5813j0016p3494l2513k5350
$$ 22052 -62284 -130815 -114344 -125954 -81503 -3269 66854 122667 112651 39157 6644 -18706
21439a8706l0579j4748L3823Q6863O1779o8648r1410J5099M5510n9779k0993r5196
$$ -18706 -49285 -64033 -30210 56653 118432 49784 -41626 -26527 18983 -40796 -61789 -156985
21427a56985p100N9661J77017J36145L055o6072L068j62941l6220O8520R788k4986
$$ -156985 -164085 -104424 72593 208738 211793 145721 148789 -14152 -50372 18148 27936 2950
21415B950J06852n6567m5700l1963j12949L2520R1799p772m8255K2429P3780K345
$$ 2950 109802 53235 7535 -24428 -137377 -104857 -13058 -20830 -69085 -46656 27124 29469
21403B9469o7163K2007P4373r018m2986M648n3713r9842K0862J07899Q1576l2192
$$ 29469 -37694 -15687 58686 49668 6682 11330 -42383 -142225 -121363 -13464 68112 35920
21391C5920l7537q2745P5582Q9161P968o3586l8747r167J2643N4976k869O2609
$$ 35920 -1617 -84362 -8780 80381 88349 24763 -13984 -23151 -10508 44468 41599 104208
21379A04208l6705j23355j02239O678M1886O6164J1213m0270K0793R7229o8213
$$ 104208 67503 -55852 -158091 -151413 -109527 -43363 -32150 -72420 -51627 45602 -22611
21368b2611r035R2375K2723o9932R4407K7768n209J25824m8978j30937j00716
$$ -22611 -31646 60729 83452 13520 107927 135695 130486 256310 207332 76395 -24321
21357b4321J2598K3077l0052L9883k5934M8938n1833p6458m946j5148l8826l802
$$ -24321 -11723 11354 -18698 21185 -4749 44189 -7644 -84102 -89048 -104196 -143022 -146824
21345a46824l753O4067O0644J0656M1831J4037m5705K6230J9775j9366l6407m047
$$ -146824 -150577 -86510 -25866 -15210 26621 40658 -5047 21183 40958 21592 -14815 -18862
21333a8862k7811J5854K065n6879m6247k8381P4171J6212j2897J13709P1229l3559
$$ -18862 -46673 -30819 -28754 -85633 -131880 -160261 -86090 -69878 -82775 30934 102163 68604
21321F8604J6833m5879o0307j1867o4735R2475Q9427q7538q2144K4589k6020m3147
$$ 68604 85437 39558 -20749 -32616 -97351 -4876 84551 -2987 -85131 -60542 -86562 -129709
21309a29709J05415N4752n6159o7531J5872L8408N1817k8912p4566J2362n2088
$$ -129709 -24294 30458 -25701 -93232 -77360 -38952 12865 -16047 -90613 -78251 -130339
21298a30339l2717N9724k6760m2339R2105L3650k1553l3618P4965K7769j0963
$$ -130339 -163056 -103332 -130092 -172431 -80326 -46676 -68229 -101847 -26882 887 -10076
21287a0076N1216r5791o7728Q2244L484n7296R352R873N9145k1782q2906r828
$$ -10076 41140 -54651 -122379 -40135 -36651 -93947 -84595 -74722 -15577 -37359 -120265 -130093
21275a30093j4099R5956N0842j0088p3487J8924J9577P3742j8356j09239Q0717
$$ -130093 -144192 -48236 2606 -7482 -80969 -62045 -42468 31274 12918 -96321 -15604
21264a5604k9662l0464k2111K5853m4510L8318P3788J2243l6174k5158m2472l9796
$$ -15604 -45266 -75730 -97841 -71988 -116498 -78180 -4392 7851 -28323 -53481 -95953 -135749
21252a35749M4161L5405o8541L0594L6780j2344o2320Q5797L6060j2843J723N0146
$$ -135749 -91588 -56183 -124724 -94130 -57350 -69694 -132014 -46217 -10157 -23000 -21277 28869
21240B8869n4788K2876K6566N1520J34644n0026n4352j6358k3761n8939l8144
$$ 28869 -25919 -3043 23523 75043 209687 159661 105309 88951 65190 6251 -31893
21229c1893q0421K8201J7369L4193P9002L562j054m7987l8424k0487R538Q3298
$$ -31893 -112314 -84113 -66744 -32551 46451 50013 48959 972 -37452 -57939 -48401 34897
21217C4897J0085L4461J1165r7609P3055M6151k2509L4296k486J2790n2299n287
$$ 34897 44982 79443 90608 -7001 66054 112205 89696 123992 121506 134296 81997 76710
21205G6710j37887j4950R1754P4259j2992q477k4701J1579l1109p4972k7821k5930
$$ 76710 -61177 -76127 15627 89886 76894 68417 43716 55295 24186 -50786 -78607 -104537
21193a04537k6209l293J33168M7449l9627L558K2055R7052m046k7808O5643m8248
$$ -104537 -130746 -134039 -871 46578 6951 10509 32564 129616 125570 97762 163405 115157
21181A15157o8422L2775j8558J09485K0558q6065p5526M6605J30529l1551m3290
$$ 115157 46735 79510 60952 170437 190995 104930 29404 76009 206538 174987 131697
21170A31697M1986o5897j18344j5020N8214L6830k5091r121j0319m8161q0168
$$ 131697 173683 107786 -10558 -25578 32636 69466 44375 35254 24935 -23226 -103394
21159a03394Q5179P8175p7088k5958m8458j2789n6535r438L8494M7873O9695J0190
$$ -103394 -18215 59960 -17128 -43086 -91544 -104333 -160868 -170306 -131812 -83939 -14244 -4054
21147d054O9792Q520p427j5726r4196L178K0939o9486j5795J00209J2711o3884
$$ -4054 65738 74258 66831 51105 -43091 -39913 -18974 -88460 -104255 -4046 8665 -55219
21135e5219N996K3716M8341L3342j3968K5857j3025j7471l8778m745L0065J1729
$$ -55219 -49223 -25507 22834 56176 42208 68065 55040 37569 -1209 -5954 24111 35840
21123C5840m106k988L3006K8694Q294Q0489k9559r9071l6846L4900k9708n9202
$$ 35840 31734 28746 61752 90446 98740 179229 149670 50599 13753 48653 18945 -40257
21111d0257R419O4394j3978n4856J5640L2946M2762o7197P7483P7714k8403n5572
$$ -40257 -30838 33556 19578 -35278 -19638 13308 56070 -11127 66356 144070 115667 60095
21099F0095n5796N857L1815m5213j2078l681L3967J6338l7105m390J19737L3250
$$ 60095 4299 10156 41971 -3242 -15320 -19001 14966 31304 -5801 -10191 109546 142796
21087A42796L8774K7717o1712n9019n1863j17471q0726L6631l3912J01436K5727
$$ 142796 181570 209287 147575 88556 36693 -80778 -161504 -124873 -158785 -57349 -31622
21076c1622N1897J3150q4378l1767k0221k481n2749Q4085N3086O0048o6932j7912
$$ -31622 20275 33425 -50953 -82720 -102941 -105422 -158171 -74086 -21000 39048 -27884 -45796
21064d5796j5531N970J4041J3699j4131J8165M7598m0686j6368K6266R478L1102
$$ -45796 -61327 -55357 -41316 -27617 -41748 -23583 24015 -16671 -33039 -6773 2705 33807
21052C3807p0536J6236J38525M705o5064n917m666M2085l397K2805l9373l1068
$$ 33807 -36729 -20493 118032 122737 57673 51756 47090 89175 85778 108583 69210 38142
21040C8142j5601J2766l6202R464J01711o5064n6908J1100K8029J9234M0330k0989
$$ 38142 22541 35307 -895 8569 110280 45216 -11692 -592 27437 46671 87001 66012
21028F6012q2187m4643P1231N6062m2052M0773M27m0540K6652M8452K3765j0019
$$ 66012 -16175 -60818 10413 66475 24423 65196 65623 25083 51735 100187 123952 113933
21016A13933j09549m4360o5534Q1384J00026R959L972n9656p7049j4340O6996
$$ 113933 4384 -39976 -105510 -24126 75900 85859 89831 30175 -46874 -61214 5782
21005E782J2627R1658P5927l2730M116j01850o6342M0443L7927k4501l4331K2806
$$ 5782 18409 110067 185994 153264 157380 55530 -10812 29631 67558 43057 8726 31532
20993C1532M5044k471L5181j2074l8098O4358J430o2606L1934j1815j10076n5610
$$ 31532 76576 74105 109286 97212 59114 123472 124902 62296 94230 82415 -27661 -83271
20981h3271R6891J856k1923M3386J5995O7013J1012m1915m9860n0006N3621K2360
$$ -83271 13620 15476 -6447 36939 52934 119947 130959 89044 39184 -10822 42799 65159
20969F5159o8104m2051K5084O0615J7021R8585K0569r0080j9755l2148p3446O6569
$$ 65159 -2945 -44996 -19912 40703 57724 156309 176878 86798 67043 34895 -38551 28018
20957B8018R2605J9735k9052K3340k1992n9161j00092n325j362J4981P2958l288
$$ 28018 120623 140358 111306 134646 112654 53493 -46599 -51924 -53286 -38305 34653 31365
20945C1365L3108J8179R983O6036p6832N4766Q4842q2816r7166l7721l9759O4639
$$ 31365 64473 82652 92635 158671 81839 136605 221447 138631 41465 3744 -36015 28624
20933B8624K5899J5469J14470L0203q3194r1923q08J09104O309l8406o1030O291
$$ 28624 54523 69992 184462 214665 131471 39548 38740 147844 154153 115747 54717 61008
20921F1008R8183k5895j30441m9373J7553k700J9881M2160J11437J605k2151m551
$$ 61008 159191 133296 2855 -46518 -28965 -31665 -11784 30376 141813 143418 121267 116716
20909A16716J2101K5001P9078K6685l3739l7856N343n275j4770O7998m763M1602
$$ 116716 128817 153818 232896 259581 225842 187986 193329 188054 173284 241282 236519 278121
20897B78121J64063J01894j244L6740L9726L9378o3541o6392q7607l2054O7836
$$ 278121 442184 544078 542834 579574 619300 658678 595137 528745 441138 409084 476920
20886D76920J20052J57160K22769K2247J9333P7709r0642j70014j94343k19023
$$ 476920 596972 754132 976901 999148 1018481 1096190 1005548 835534 641191 422168
20876D22168N519J35267J23315P7425L579m3756j05225m2251k8916r9847j79261
$$ 422168 427687 562954 686269 763694 767273 723517 618292 576041 547125 447278 268017
20865B68017q5258j5771m996N619k5207L3706k1291r211r8685n2256L0337K9655
$$ 268017 182759 166988 161992 167611 142404 176110 154819 145608 46923 -5333 25004 54659
20853E4659O4625n0871M9413K4585k1034q652n9077l7259k5392J01893l3741p5734
$$ 54659 119284 68413 117826 142411 121377 112725 53648 16389 -9003 92890 59149 -16585
20841a6585l3633L4719Q4142j6419L3018l9764m1178J6979R0793N289j02008J9547
$$ -16585 -50218 -15499 68643 52224 85242 45478 4300 21279 112072 117361 15353 34900
20829C4900R5588k9860p9880P661J3470o6023K7026L5015j6976K0175J3900N0525
$$ 34900 130488 100628 20748 28409 41879 -24144 2882 37897 20921 41096 54996 105521
20817A05521p7594n6487N8193K1980j9892L416K9167q576j55820J27J12089K2292
$$ 105521 27927 -28560 29633 51613 31721 35137 64304 55728 -100092 -99965 12124 34416
20805C4416r3184l317J7719j1973r8117o2822N4386M3260O5210N1068j6467K4102
$$ 34416 -58768 -62085 -44366 -56339 -154456 -217278 -162892 -119632 -54422 -3354 -19821 4281
20793D281Q120j1286o1854L1828j3720o5254M2829N4711R0744Q2105J6327o6283
$$ 4281 12401 1115 -60739 -28911 -42631 -107885 -65056 -10345 80399 162504 178831 112548
20781A12548q0870P4358J6165O035R2847Q1184P624j16593n4662j487p1821j33691
$$ 112548 31678 106036 122201 128236 221083 302267 309891 193298 138636 137149 65328 -68363
20769f8363M5946M5880K3305j15055m2461J91J8541P9532J5932J5644L2399P8937
$$ -68363 -22417 23463 46768 -68287 -110748 -110557 -92016 -12484 3448 19092 51491 130428
20757A30428M1468m2179k1171l2397j48593o9948L8813L0513N2156p692q7Q8288
$$ 130428 171896 129717 108546 76149 -72444 -142392 -103579 -73066 -20910 -28602 -28689 59599
20745E9599L045N1481k4368q678j1234L8153R00l8851J9756L8923K4042j28453
$$ 59599 62644 114125 89757 81079 69845 107998 108898 70047 89803 128726 152768 24315
20733B4315j36537P3805M7175j5692r6564L3852L3383L9938K2370K8819L9838
$$ 24315 -112222 -38417 8758 -6934 -103498 -69646 -36263 3675 26045 54864 94702
20722I4702K4626k2527k4499l8411j2236J3523Q0568O5935P6773j7239j3245p0782
$$ 94702 119328 96801 72302 33891 21655 35178 115746 181681 258454 241215 227970 157188
20710A57188j14946k4051L5598j5494p948l5237j17581L0521J27353Q32r2817
$$ 157188 42242 18191 53789 38295 30347 -4890 -122471 -91950 35403 36235 -56582
20699e6582j0922R1823K3858l4386J560p722r7087k0311L9403L2784m7453M6508
$$ -56582 -67504 24319 48177 13791 15351 7629 -89458 -109769 -70366 -37582 -85035 -38527
20687c8527Q6997o2355N3321N3652m9393L849Q321J00787n6760r7136j3889N2373
$$ -38527 48470 -13885 39436 93088 43695 47544 55865 156652 99892 2756 -11133 41240
20675D1240K6235L8512m8051k2736L3123L6109O1405j03227j6458N0132J2913
$$ 41240 67475 105987 57936 35200 68323 104432 165837 62610 46152 96284 109197
20664A09197K9131J837J3434p649n678N6017j0197L4051j04478L222j250q636
$$ 109197 138328 140165 153599 145950 140272 196289 186092 220143 115665 118887 117637 109001
20652A09001M1193q979O2034O5442o4427o0062l8941L5105L9007J4357q6067j04402
$$ 109001 150194 141215 203249 268691 204264 144202 105261 140366 179373 193730 107663 3261
20640C261M4249L0440K5303m542N3334k3201m0504J53031M0822j2060m3095m6703
$$ 3261 47510 77950 103253 98711 152045 128844 88340 241371 282193 270133 227038 180335
20628A80335m0234n285j5332M9877L291k901M0490l0631M0765P8452O6877l1825
$$ 180335 140101 134816 119484 169361 172652 169751 210241 179610 220375 298827 365704 333879
20616C33879k8141J535N9689m0824p6245n0866M0397R127j7114l5510q7525K0907
$$ 333879 305738 307273 366962 326138 249893 199027 239424 248551 231437 195927 108402 129309
20604A29309P3352L7721n3235m0165L7992m1543m7043n8199m4799M2802J8032
$$ 129309 202661 240382 187147 146982 184974 143431 96388 38189 -6610 36192 54224
20593E4224n4621j6056O5027N0082l4747o627j1435J7087L6531J5891m9387l8576
$$ 54224 -397 -16453 48574 98656 63909 57282 45847 62934 99465 115356 65969 27393
20581B7393J977O3519K7894o7367l8307k0002J1857N8471M90m330J9908k0644
$$ 27393 29370 92889 120783 53416 15109 -4893 6964 65435 65925 61595 81503 60859
20569F0859O8742P6638Q4579j3324n4804j5969l2419Q8966j5704j08069k9737
$$ 60859 129601 206239 290818 277494 222690 206721 174302 263268 247564 139495 109758
20558A09758L8374P319k4448O3473N4992K0061L4181l268q1845K7704Q5128p545
$$ 109758 148132 155451 131003 194476 249468 269529 303710 300442 218597 246301 331429 323884
20546C23884j01759j6072N6150l2803o5520j2198P5274k7450l0909N1782P8781
$$ 323884 222125 206053 262203 229400 163880 151682 226956 199506 168597 220379 299160
20535B99160m9880k1135l8518r77k3813K0726k5446l8582O4085O5488P7789M378
$$ 299160 249280 228145 189627 188650 164837 185563 160117 121535 185620 251108 328897 333275
20523C33275L201O3144j5397r3539L5265K0661M5653q358R2081O2296k6289n4397
$$ 333275 336476 399620 384223 290684 325949 346610 392263 383905 475986 538282 511993 457596
20511D57596L4519N3395L7062J5781M8034J6339M8664R8360P0017O0827k6600
$$ 457596 492115 545510 582572 598353 646387 662726 711390 809750 879767 940594 913994
20500I13994L9659N8207q7499K4100Q023J03550P1155N1528J10428J65540K7564
$$ 913994 953653 1011860 924361 948461 956484 1060034 1131189 1182717 1293145 1458685 1486249
20489A486249j05492m7323n2310n4009q9953k0946R4736N4032P2368J43380K9753
$$ 1486249 1380757 1333434 1281124 1227115 1137162 1116216 1210952 1264984 1337352 1480732 1510485
20478A510485k4315n4503r660J17137M0361n4924q0035n5438q2540P888K6027
$$ 1510485 1486170 1431667 1422007 1539144 1579505 1524581 1444546 1389108 1306568 1314456 1340483
20467A340483k2715K4818J9901K8590j0809l3114n9306l0864M4045J7518P1635
$$ 1340483 1317768 1342586 1362487 1391077 1380268 1347154 1287848 1256984 1301029 1318547 1390182
20456A390182M2111j47764j00639o7247n1123k9699m6117n0010L838R830q663
$$ 1390182 1432293 1284529 1183890 1116643 1065520 1035821 989704 939694 943532 953362 944699
20445I44699k3069J13911N7592p1524m9250n8343p769q443K0435l669n9777l7776
$$ 944699 921630 1035541 1093133 1021609 972359 914016 906247 897804 918239 914570 854793 817017
20433H17017k5314L958R1631j0280o5192k8065Q2756L9036K0208M3380j0408J0429
$$ 817017 791703 795661 887292 877012 811820 783755 866511 905547 925755 969135 958727 969156
20421I69156M7436P1342j13293k213N2013O2619K8261m598K3569o650M8197K3044
$$ 969156 1016592 1087934 974641 972428 1024441 1087060 1115321 1110723 1134292 1127642 1175839 1198883
20409A198883K7781J19879J72975J42035L5328K6673J11428L8520J28812K67396
$$ 1198883 1226664 1346543 1519518 1661553 1696881 1723554 1834982 1873502 2002314 2269710
20399B269710J89642J47689L69822N73819N11171L98160L22454L23568K63741
$$ 2269710 2459352 2607041 2976863 3550682 4061853 4460013 4782467 5106035 5369776
20390E369776K68113L73441M81586P39534J072615J465466J934191K556129L223240
$$ 5369776 5637889 6011330 6492916 7232450 8305065 9770531 11704722 14260851 17484091
20381A7484091M458013P046592J1496872J8458304K4284955J7918003M001464
$$ 17484091 21942104 28988696 40485568 58943872 83228827 101146830 105148294
20374A05148294K694753L184927j0586964j9221892j2238539j252875R970971
$$ 105148294 107843047 111027974 100441010 81219118 68980579 67727704 77698675
20367G7698675K3835146M0637370M5855847K0575130k774453J839913p756719
$$ 77698675 101533821 142171191 188027038 208602168 205827715 207667628 199910909
20360A99910909l8814079m5211916k8939127j3295722j632215R483404J9283344
$$ 199910909 161096830 115884914 86945787 73650065 72017850 81501254 100784598
20353A00784598J7178142L26356n545130j560195j1987063k5216197k2591663
$$ 100784598 117962740 118289096 112743966 111183771 99196708 73980511 51388848
20346E1388848j4366011q781229n843585m280352l353869k556131j885308j380509
$$ 51388848 37022837 28241608 22398023 18117671 14763802 12207671 10322363 8941854
20338H941854r69516o35906m00725l19534m62258m42113n17851m81666m54347
$$ 8941854 7972338 7336432 6935707 6616173 6153915 5711802 5193951 4712285 4257938
20329D257938n47862n30864l19774l31121k88002j16465j55445j19333r8637j19849
$$ 4257938 3710076 3179212 2859438 2528317 2240315 2123850 1968405 1849072 1750435 1630586
20319A630586p8151L548j08269o6141l5861n6358l8023p6725r1993p8951p831
$$ 1630586 1552435 1555983 1447714 1381573 1345712 1289354 1251331 1174606 1082613 1003662 995831
20308I95831m7205l7552j8370l6053m1737j13479p8981k8568m548J9300l3179
$$ 995831 948626 911074 892704 856651 814914 701435 622454 593886 589338 608638 575459
20297E75459l8250L724M7967j0648J6742M8359J27795M2186q2155l4140j4001
$$ 575459 537209 540933 588900 578252 594994 643353 771148 813334 731179 697039 683038
20286F83038o2713N5966R8506Q722o5728Q4376M2526M3505P251q6858o9785k2436
$$ 683038 620325 676291 774797 783519 717791 802167 844693 888198 895449 808591 738806 716370
20274G16370p7343j3289J5761O4255J8453j14127j56017n9650o1101m4214r949
$$ 716370 639027 625738 641499 705754 724207 610080 454063 394413 333312 289098 279149
20263B79149l4060m6158j7011k9456N303J21220O7821o1062K845n0972o9952j192
$$ 279149 245089 198931 181920 152464 157767 278987 346808 285746 288591 237619 167667 166475
20251A66475J1592p6311k3861m4331P914l5984J59177J82940J38018K0654j4279
$$ 166475 178067 101756 77895 33564 41478 5494 164671 347611 485629 506283 492004
20240D92004m6853j71224j60452m3304N6999O8183O6021O6207J7507N444m237
$$ 492004 445151 273927 113475 70171 127170 195353 261374 327581 345088 350532 346295
20229C46295k9669j15231j16029j01176L6314j3042J08070J49426n7344n091o4023
$$ 346295 316626 201395 85366 -15810 20504 7462 115532 264958 207614 202523 138500
20218A38500r8827n6208K1684J2773l0431j0675Q1822Q4834L6909O1103n1321
$$ 138500 39673 -16535 5149 17922 -12509 -23184 58638 143472 180381 241484 190163
20207A90163j6205o8601r0676M9090l8905P320O0493J8053R551M5225p7692j07269
$$ 190163 173958 105357 14681 63771 24866 32186 92679 110732 120283 165508 87816 -19453
20195a9453j01581R6875N3481O0573J1138n271k0129O9163K0459l2926l3938j0554
$$ -19453 -121034 -24159 29322 89895 101033 95762 75633 144796 165255 132329 98391 87837
20183H7837k7687K2524J17861Q7795R456q0939o2447k3476r8766M7632n471k8636
$$ 87837 60150 82674 200535 288330 297786 216847 154400 130924 32158 79790 74319 45683
20171D5683l0104n3837N5322P1906o9676j7892J27533M0434M3354O4n3605k5086
$$ 45683 15579 -38258 17064 88970 19294 1402 128935 169369 212723 212787 159182 134096
20159A34096N5716P8861m1750q4760m5352J7658l0416N6598P3269m5884j1736
$$ 134096 189812 268673 226923 142163 96811 114469 84053 140651 213920 168036 156300
20148A56300l5726M8651K0004k3629K62L8763k37k7173m6107n1537o4784J5930
$$ 156300 120574 169225 189229 165600 165862 204625 204388 177215 131108 79571 14787 30717
20136C0717M3833J6843J7j9945L2792K0370n4562r9057L0320P3108m825j04593
$$ 30717 74550 91393 91410 71465 104257 124627 70065 -28992 1328 74436 69611 -34982
20124c4982k7588J9259M7336j5814J7569J09180P3771K9372O244K1467r4181l7885
$$ -34982 -62570 -43311 4025 -11789 5780 114960 188731 218103 224347 245814 151633 113748
20112A13748N1831R053r798k5495K3265p8225L6873J30960R3785n1841K8529p826
$$ 113748 165579 174632 164834 139339 162604 84379 121252 252212 345997 294156 322685 314859
20100C14859m6586M981O5187J02674O8229m7589j4947j0836l7872l3636L295J2865
$$ 314859 268273 273254 338441 441115 509344 461755 446808 435972 398100 364464 367759 380624
20088C80624m4694m6464M0969J69563J0569j34383j57096p8120j41280p1682Q1885
$$ 380624 335930 289466 330435 499998 510567 376184 219088 140968 -312 -71994 9891
20077I891K5439L6701k7879l1599N0331R562k5593r91j2264l7286n7629R3711
$$ 9891 35330 72031 44152 12553 62884 72446 46853 45862 33598 -3688 -61317 32394
20065C2394J5130l9146j10809L3279J02927Q0340l3534J4467M4775N5279O5521
$$ 32394 47524 8378 -102431 -69152 33775 114115 80581 95048 139823 195102 260623
20054B60623R777J0981n034K6467P7319R5165J84915J01972k9184j30441j20210
$$ 260623 270400 281381 276347 302814 380133 475298 660213 762185 733001 602560 482350
20043D82350n372J17234J8238j08025j30108p5181r96M8903o049K0849q0338j8032
$$ 482350 476978 594212 612450 504425 374317 299136 298140 347043 340994 361843 281505 263473
20031B63473o9141m4194n6162P6313K7831k2113k1929K2327M4209N7480j006j17714
$$ 263473 194332 150138 93976 170289 198120 176007 154078 176405 220614 278094 277088 159374
20019A59374j00156m3236J1923Q0717P4210P25J6869m1582n8267J4277K2241j3635
$$ 159374 59218 15982 27905 108622 182832 183557 200426 158844 100577 114854 137095 123460
20007A23460m4787l5039l5893n1566Q52J05500O0754k1667J691m009m0465k5792
$$ 123460 78673 43634 7741 -43825 -42973 62527 123281 101614 103305 99296 58831 33039
19995C3039K4016J7748q1918k8339R981P615P5131P1948M0592j5526n1204k5982
$$ 33039 57055 74803 -7115 -35454 -25473 -17858 57273 129221 169813 154287 103083 77101
19983G7101J6537n3278L156M0684j0824n8681N9319K1912K8049J6275p0511q6890
$$ 77101 93638 40360 43516 84200 73376 14695 74014 95926 123975 140250 69739 -17151
19971a7151P1703K5348N5314L1435J2201J2537K1798l6090K4945j00220j76486
$$ -17151 54552 79900 135214 166649 178850 191387 213185 177095 202040 101820 -74666
19960g4666q6266N2731P6022p1202n9314O6213J11196J6409M010P3824J1938p0814
$$ -74666 -160932 -108201 -32179 -103381 -162695 -96482 14714 31123 35133 108957 120895 50081
19948E0081o1568L6078O291m9648L5325K4369K9121K5488j6820n5385K9753j5764
$$ 50081 -11487 24591 30882 -18766 16559 40928 70049 95537 78717 23332 53085 37321
19936C7321m5361J8277J03676O677k4624k415k1345L387J13728j1521m2312J6169
$$ 37321 -8040 10237 113913 120590 95966 93551 72206 75593 189321 177800 135488 151657
19924A51657k9591p7982o9481L9017k3822k8227J40872J06066J0559j8927K1220
$$ 151657 122066 44084 -25397 13620 -10202 -38429 102443 208509 219068 200141 221361
19913B21361m8455n4777Q7366J02922o360J8473J0614J7174l4976N9176k2574
$$ 221361 172906 118129 205495 308417 302057 320530 331144 348318 313342 372518 349944
19902C49944p4979l1523P5126O7414o6464m2924N5416P2819L356n7205j51471
$$ 349944 274965 243442 318568 385982 319518 276594 332010 404829 408185 350980 199509
19891A99509J9302p749L6866O9486L7235j9030n3273m0848Q6578N4225j01344
$$ 199509 218811 211062 247928 317414 354649 335619 282346 241498 328076 382301 280957
19880B80957m1734O3409L7287p0389q4843J4164M2610R8617P4337K0103n3600
$$ 280957 239223 302632 339919 269530 184687 198851 241461 340078 414415 434518 380918
19869C80918o7246O6769J8141m7200m4335K4071M5689N5126M5099N1497N3157
$$ 380918 313672 380441 398582 351382 307047 331118 376807 431933 477032 528529 581686
19858E81686J1631P657j3640L8425L2289N7164J91953J14602J15583N1660j22722
$$ 581686 593317 600974 587334 625759 658048 715212 907165 1021767 1137350 1189010 1066288
19847A066288p7121q6546L58L2231P6600J61781L00431J33908J0462k2721n7240
$$ 1066288 989167 902621 902979 935210 1011810 1173591 1474022 1607930 1618392 1595671 1538431
19836A538431p3092j47841j03999n9341k089k1734J72564J22919P9962O7024m7051
$$ 1538431 1465339 1317498 1213499 1154158 1152069 1130335 1302899 1425818 1505780 1572804 1525753
19825A525753l7670o4068n5630K6738N8891n3894K6068N1406Q5703J35709P4625
$$ 1525753 1488083 1424015 1368385 1395123 1454014 1400120 1426188 1477594 1563297 1699006 1773631
19814A773631j2660P8641J51775J46739J02582J01277J14620J37118J62330Q8072
$$ 1773631 1760971 1839612 1991387 2138126 2240708 2341985 2456605 2593723 2756053 2844125
19804B844125J6882O0676N4629J01414P8134J67152Q4460O1504K31918K53636
$$ 2844125 2861007 2921683 2976312 3077726 3155860 3323012 3407472 3468976 3700894 3954530
19794C954530L67108K83385L10719L50977M40336P02954J010457J336780J697264
$$ 3954530 4321638 4605023 4915742 5266719 5707055 6410009 7420466 8757246 10454510
19785A0454510K479108L836132O268167J0442958J6293886J9293061Q670612r210718
$$ 10454510 12933618 16769750 23037917 33480875 49774761 69067822 77738434 68527716
19777F8527716j3042775n658130L323188J2620493J9608726J3281720m390611
$$ 68527716 55484941 49826811 53149999 65770492 85379218 98660938 94270327
19770I4270327q262632K032523N309151p535882j7310820j2953640m173113M569784
$$ 94270327 86007695 88040218 93349369 85813487 68502667 55549027 51375914 55945698
19762E5945698J2671528J3255351k577077j8791358j8374687j1899600p143109
$$ 55945698 68617226 81872577 79295500 60504142 42129455 30229855 23086746
19755B3086746m230092k798438j962890j339580q97690p27852p37347m12545l64592
$$ 23086746 18856654 16058216 14095326 12755746 11858056 11130204 10392857 9980312 9615720
19746I615720m55821l17161l2166o4388r5637J83419M54797O43730R18305J422461
$$ 9615720 9159899 8842738 8810572 8746184 8650547 8833966 9288763 9932493 10850798 12273259
19736A2273259K226860L363409N325048Q764242J4448727K0363251J6910724k009260
$$ 12273259 14500119 17863528 23188576 31952818 46401545 66764796 83675520 81666260
19728H1666260j4736638j0393420r00866Q855771J8026730J9005934L270000r661340
$$ 81666260 66929622 56536202 55635336 64491107 82517837 101523771 104793771 95132431
19720I5132431k907935O908829k62728j6343209j7941686q970650O14646R877602
$$ 95132431 92224496 99133325 98870597 82527388 64585702 55615052 56229698 66107300
19712F6107300J5622871O550336j4279438k2093541j6266729j0033085o215050
$$ 66107300 81730171 88280507 74001069 51907528 35640799 25607714 19392664
19705A9392664l916570k712630k035782j471092j118732r02726n47194l97842
$$ 19392664 15476094 12763464 10727682 9256590 8137858 7235132 6687938 6290096
19697F290096m33847o32159n87216l66474l98324k85530j68426j29287j83167
$$ 6290096 5856249 5224090 4636874 4270400 3872076 3586546 3418120 3288833 3105666
19688C105666j78699n4912o8604j23788o3539o9794K8570k9235L5486P0357P9241
$$ 3105666 2926967 2872055 2803451 2679663 2616124 2546330 2574900 2545665 2581151 2651508 2730749
19677B730749J33443M1809J993N744p3476j6042o6771p6299k01804k39330k04436
$$ 2730749 2864192 2906001 2907994 2913738 2840262 2824220 2757449 2681150 2479346 2240016 2035580
19666B035580j55198j17580j35368j10667p7664r3796M585N2674J7554n4224j10612
$$ 2035580 1880382 1762802 1627434 1516767 1439103 1345307 1349892 1402566 1420120 1365896 1255284
19655A255284j16981l0798j24079n8846P4526j822k0904P1953J00228L2793p2283
$$ 1255284 1138303 1107505 983426 924580 999106 997284 976380 1048333 1148561 1181354 1109071
19644A109071j44009m2452K6815Q6323J20499L2047K6179K6771J04948O1029Q0419
$$ 1109071 965062 922610 949425 1035748 1156247 1188294 1214473 1241244 1346192 1407221 1487640
19633A487640m730J55634K16149J64752J54514J33582L050O6446J15225O1391
$$ 1487640 1482910 1638544 1854693 2019445 2173959 2307541 2310591 2377037 2492262 2553653
19623B553653o160m2138q0633j30733j22694j03710j25708j15601j16284j45524
$$ 2553653 2547493 2505355 2424722 2293989 2171295 2067585 1941877 1826276 1709992 1564468
19613A564468o9391q560N8154P5978P8591K2239L9500J2453Q4290O3324J1200
$$ 1564468 1495077 1486517 1544671 1620649 1699240 1721479 1760979 1773432 1857722 1921046 1932246
19602A932246J29879K24228L09941L38876J20741N1094L5546K61648L90825N40134
$$ 1932246 2062125 2286353 2596294 2935170 3055911 3107005 3142551 3404199 3795024 4335158
19592D335158N33996O56722Q28939J119527J579328K291816L331643N210684Q960488
$$ 4335158 4869154 5525876 6354815 7474342 9053670 11345486 14677129 19887813 28848301
19583B8848301J5274866K1181259J4950017o250201j5746547r449290m26244Q647864
$$ 28848301 44123167 65304426 80254443 74004242 58257695 48808405 48382161 57030025
19575E7030025J7263340J6067662j864130j0720834j37885J0417498L343028j4776439
$$ 57030025 74293365 90361027 88496897 77776063 77638178 88055676 91398704 76622265
19567G6622265j7815177r226951m18680P953068J4328636P641960j2882249k0695624
$$ 76622265 58807088 49580137 49161457 57114525 71443161 79085121 66202872 45507248
19559D5507248j4408035q329171m993618l205958k149639j694530j292222q19730
$$ 45507248 31099213 22770042 17776424 14570466 12420827 10726297 9434075 8614345
19551H614345m82384k31025j73049m8983p6925o9478M4363Q4277K70604L09443
$$ 8614345 8131961 7900936 7727887 7678904 7601979 7532501 7576864 7661141 7931745 8241188
19541H241188M09656N83072R92516J630168K431104L443838N471627R355277J6146637
$$ 8241188 8650844 9233916 10226432 11856600 14287704 17731542 23203169 32558446 48705083
19532D8705083K3683996J9499576m128673j8347418j2499184k264054P733329
$$ 48705083 72389079 91888655 87759982 69412564 56913380 54649326 62382655
19525F2382655J7313003J8085462R59423j0958240j211317J1817847O934277j4988271
$$ 62382655 79695658 97781120 98740543 87782303 86570986 98388833 105323110 90334839
19517I0334839k1720481j2475099k227217P145779J4671600J0019739j1270574
$$ 90334839 68614358 56139259 53912042 61057821 75729421 85749160 74478586
19510G4478586k2603474j6953405r959333o115558l925159k729429k119262j547198
$$ 74478586 51875112 34921707 24962374 18846816 14921657 12192228 10072966 8525768
19502H525768j170218r03262o17335n18912n30321l57391j53263j35450k86437
$$ 8525768 7355550 6452288 5834953 5316041 4785720 4428329 4275066 4139616 3853179
19493C853179m34395l89690l21182k26245j77660j21987j94047p7024r5200k42321
$$ 3853179 3418784 3029094 2707912 2481667 2304007 2182020 1987973 1910949 1815749 1573428
19483A573428j59445j04622j87716q1547p2955q005L6106K3389n3599q1183o8155
$$ 1573428 1413983 1309361 1121645 1040098 967143 959138 995244 1018633 965034 883851 815696
19472H15696r0500l4659m2875M5431J8416l4463p4142p4716q711O0958O5181r8719
$$ 815696 725196 690537 647662 693093 711509 677046 602904 528188 519477 580435 645616 546897
19460E46897o5984k2117N9065O8772Q064j07526o5102j3480P960n4454q4731K962
$$ 546897 480913 458796 517861 586633 594697 487171 422069 408589 416549 362095 277364 280326
19448B80326k5636Q9849R8085j21031r1561q5774J7476K2712l1860P6767N0839
$$ 280326 254690 344539 442624 321593 230032 144258 161734 184446 152586 229353 280192
19437B80192Q823N8355J4344l4484M5556O1584k2971M6319o5417l6619l0838l3460
$$ 280192 289015 347370 361714 327230 372786 434370 411399 457718 392301 355682 324844 291384
19425B91384K4120n456o1837O799o8872j5264J5390J6054Q5465m8423j8678J56336
$$ 291384 315504 310048 248211 255010 186138 170874 186264 202318 287783 239360 220682 377018
19413C77018M4525R387l531M5579l0984m3026l8920j7938j08155m3877j06174
$$ 377018 421543 430930 427399 472978 441994 398968 360048 342110 233955 190078 83904
19402H3904p9768l2185O677L0360j9851o2291m9687j5541M4574R0154M3884k3381
$$ 83904 4136 -28049 -21372 8988 -10863 -73154 -122841 -138382 -93808 -3654 40230 16849
19390A6849j2777j6170j4001j9127j352n2543M4711J39508O1225J8517n9747j15853
$$ 16849 4072 -12098 -26099 -45226 -46578 -99121 -54410 85098 146323 164840 105093 -10760
19378a0760l953O3790O1371M2634l555J5901K0471p2840l7298N9124J13366N109
$$ -10760 -14713 49077 110448 153082 149527 165428 185899 113059 75761 134885 248251 253360
19366B53360J3105J6839j7177j38621j3583L2650Q0672L6895l6992k939N281l0737
$$ 253360 266465 283304 266127 127506 113923 146573 227245 264140 227148 224209 229490 198753
19354A98753p2588J3790K2090K335J14612R289j23730n8244L6745Q7629L6397
$$ 198753 126165 139955 162045 164380 278992 288281 164551 106307 143052 230681 267078
19343B67078n8980n1432j334l47J4167k8653j3049l5478m6354O0581P2929k1436
$$ 267078 208098 156666 155332 154985 169152 140499 127450 91972 45618 106199 179128 157692
19331A57692L7149N6046r136K2551j3195k1220K272l4741K4071K9236J6152M3982
$$ 157692 194841 250887 241751 264302 251107 229887 232159 197418 221489 250725 266877 310859
19319C10859p9331j04068L8751Q9834J04980k9825N4949J45734J26246R9782Q9972
$$ 310859 231528 127460 166211 256045 361025 331200 386149 531883 658129 757911 847883
19308H47883Q3431J0188j01882j30283r6227m5435m6880r5740m0965K3073M1399
$$ 847883 931314 941502 839620 709337 613110 567675 520795 425055 384090 407163 448562
19297D48562M1444N0192N0460O6045K1358O890L729Q5068J14727K3065P4431L881
$$ 448562 490006 540198 590658 656703 678061 684951 688680 773748 888475 911540 985971 989852
19285I89852j72118k50070p2706q0463L1739M1608q8078k5346K2300j7254N9844
$$ 989852 817734 567664 494958 414495 446234 487842 399764 374418 396718 379464 439308
19274D39308O7230j0433j44068q6958P6140K6687L6993L750K7180R1317J62181
$$ 439308 506538 496105 352037 265079 341219 367906 404899 408649 435829 527146 689327
19263F89327J10866P5796k9442j17780L5691J05304N6977L1973J2159m2119N2790
$$ 689327 800193 875989 846547 728767 764458 869762 926739 958712 970871 928752 981542
19252I81542R7473L7582o1878l2814n2793P1222J34494O1036J24019J14109Q8
$$ 981542 1079015 1116597 1054719 1021905 969112 1040334 1174828 1235864 1359883 1473992 1474080
19241A474080R4512J21658J5326J45566K9855r1984j03881m2928K24379K80890
$$ 1474080 1568592 1690250 1705576 1851142 1880997 1789013 1685132 1642204 1866583 2147473
19231B147473L37306L45657L43003J69299L7608j25003l45253l91697k25453k06632
$$ 2147473 2484779 2830436 3173439 3342738 3380346 3255343 2910090 2518393 2292940 2086308
19221B086308o4084K8890J11830J03676J18884K36142L93182M86013L70075K41892
$$ 2086308 2022224 2051114 2162944 2266620 2385504 2621646 3014828 3500841 3870916 4112808
19211D112808K01050L35009M39831L25345K43052J77513j23526k04642j9791J85043
$$ 4112808 4313858 4648867 5088698 5414043 5657095 5834608 5711082 5506440 5486649 5671692
19201E671692J48076J92961L13675M79269O61187Q78910J031093J305992J581673
$$ 5671692 5819768 6012729 6326404 6805673 7466860 8345770 9376863 10682855 12264528
19192A2264528J922579K373899K740502L519685N003944P224748J0464622J6040542
$$ 12264528 14187107 16561006 19301508 22821193 27825137 35049885 45514507 61555049
19184F1555049K5015564L8100962N1217412M7857873J0490561l6240950n1096124
$$ 61555049 86570613 124671575 175888987 223746860 234237421 197996471 146900347
19177A46900347m0811058k7194277j7423257j1367401p363060m703781k613613
$$ 146900347 106089289 78895012 61471755 50104354 42741294 38037513 35423900
19170C5423900q83861P04832K459254M673658P747025J2370690J9552129L0803748
$$ 35423900 34540039 35244871 37704125 42377783 50124808 62495498 82047627 112851375
19162A12851375M5413258N4269027L5741298j4084721n1627098n2397792l7763112
$$ 112851375 158264633 212533660 248274958 234190237 182563139 130165347 92402235
19155I2402235k4848978j6415048j1214113p906760n837600m374017l262423k294237
$$ 92402235 67553257 51138209 39924096 32017336 26179736 21805719 18543296 16249059
19147A6249059j707427j438365j351799j184555r33866q09532p02422o23993n15539
$$ 16249059 14541632 13103267 11751468 10566913 9633047 8823515 8121093 7497100 6981561
19138F981561m00037l30427k96106j42387K9200j24122l14294k95777j00493k1565
$$ 6981561 6581524 6251097 5954991 5812604 5841804 5717682 5403388 5107611 5007118 4985553
19128D985553k13762l28894l06972l77556l27978m10286k35547j66716j23781
$$ 4985553 4771791 4442897 4135925 3758369 3430391 3020105 2784558 2617842 2494061
19119B494061r4660N248K9395J33742K03730L28782J53779q4991j95485j06930
$$ 2494061 2399401 2404649 2434044 2567786 2771516 3100298 3254077 3169086 2973601 2866671
19109B866671J9244n2297k13746k59900k72824k73780l21232k00604n2936o8522
$$ 2866671 2885915 2833618 2619872 2359972 2087148 1813368 1492136 1291532 1238596 1170074
19099A170074o2961m1798l0094n7992J6319q396m8895K3805j0883p3253n3842
$$ 1170074 1107113 1065315 1035221 977229 993548 985152 936257 960062 949179 875926 822084
19088H22084m7288o698J6036l5051r344j2458m2197j32084r1244J10579N9807
$$ 822084 774796 768098 784134 749083 739739 727281 685084 553000 461756 572335 632142
19077F32142j5362N1182K3400M3394L9912J4581l6792j10026m3063M2749L8925
$$ 632142 616780 667962 691362 734756 774668 789249 752457 642431 599368 642117 681042
19066F81042n9402K7927l9593m5280j6040K3619K3098j0718r7402q8927r058n1103
$$ 681042 621640 649567 609974 564694 548654 572273 595371 584653 487251 398324 389266 338163
19054C38163p8926N2955p670M0226J21667n629K058J0320Q6857K6560j7057L0046
$$ 338163 259237 312192 304522 344748 466415 460786 462844 473164 560021 586581 569524 599570
19042E99570N861j4192q5467k7914P7808Q786j23395j71095k36772k11707N698
$$ 599570 605431 591239 505772 477858 555666 564452 441057 269962 33190 -178517 -172819
19031a72819K3111K8490R7192R2747j7961M5124J15203j5528o0070M44P9263M1722
$$ -172819 -149708 -121218 -24026 68721 50760 95884 211087 195559 135489 135933 215196 256918
19019B56918l5807j2105q663K8122Q6187k2709r3253k9994K957m9518N4497L1149
$$ 256918 221111 209006 200343 228465 314652 291943 198690 168696 171653 122135 176632 207781
19007B07781J15687J56092J5089J18372M6953j9200p8121l8215K9179Q9907P3108
$$ 207781 323468 479560 494649 613021 659974 640774 562653 524438 553617 643524 716632
18996G16632N362K275J9692K7674N9959M3229p859j9273J63028K79660L92474
$$ 716632 721994 724269 743961 771635 831594 874823 866964 847691 1010719 1290379 1682853
18985A682853M04876J3925l33740l97779k91708k46855k04058q4865l5224j6622
$$ 1682853 2087729 2101654 1767914 1370135 1078427 831572 627514 542649 507425 490803
18975D90803l6795l3164l8122K2762k5163J7151P8368J63807J42264K35802K43997
$$ 490803 454008 420844 382722 405484 380321 397472 475840 639647 781911 1017713 1261710
18964A261710K16552r4116l25819k98006j79198j47817m5588l4516l2627m2123
$$ 1261710 1478262 1384146 1058327 760321 581123 433306 387718 353202 320575 278452
18954B78452n8774j00614o5726O6693k3923M240P2487P0347k4637j33638q7692
$$ 278452 219678 119064 53338 120031 96108 100348 172835 243182 218545 84907 -2785
18943b785J0995P0665k6839m6468L3870P2241K6592j1574j04714L1727R628K5778
$$ -2785 8210 78875 52036 5568 39438 111679 138271 126697 21983 53710 63338 89116
18931H9116k7295L8130J01671J51505L7198k5277K9280l9686m6689m4633M760
$$ 89116 61821 99951 201622 353127 390325 365048 394328 354642 307953 263320 268080
18920B68080M388L1382k5222k0706n3745l5333k5262j8814Q089K6274M0221K52
$$ 268080 272468 303850 278628 257922 204177 168844 143582 124768 132857 159131 199352 199604
18908A99604k2093M290j3614o9755L3287K9679L9967n204l6990q8024l2573K5035
$$ 199604 177511 181801 168187 98432 131719 161398 201365 196161 159171 71147 38574 63609
18896F3609O7176o249j2980l0565n0426M9773O2238n2963j34175o242K7709M0910
$$ 63609 130785 124536 111556 80991 30565 80338 142576 89613 -44562 -50804 -23095 17815
18884A7815J7846M6115N6481k1769j5504L9413M1961M0569m7771R293j8082l5966
$$ 17815 35661 81776 138257 116488 100984 140397 182358 222927 175156 184449 166367 130401
18872A30401q533j6466M4627J8867M6679l8o5920q2061k6818M9368K7662m990
$$ 130401 121868 105402 150029 168896 215575 215537 149617 67556 40738 90106 117768 112778
18860A12778k346N9096l6110l4979J9947P4837m991O9769L7908N4712M7139J4187
$$ 112778 110432 169528 133418 98439 118386 193223 188232 258001 295909 350621 397760 411947
18848D11947j03144j1508q2088r0923m980k2004m032K393J8126J2440K0821o8226
$$ 411947 308803 297295 215207 124284 119304 97300 93268 95661 113787 126227 147048 78822
18836G8822n4685k4784o6212J28902L9124o7577j5842L9520L3828J23908Q3359
$$ 78822 24137 -647 -66859 62043 101167 33590 17748 57268 91096 215004 298363
18825B98363p8993p2210k6455N2044k2402l5885N997m707k2061L6291J4958j19438
$$ 298363 219370 147160 120705 172749 150347 114462 120459 115752 93691 129982 144940 25502
18813B5502K5189O5370l1375j0742k1717R9892M803N8256J4438M7934K04022J41097
$$ 25502 50691 116061 84686 73944 52227 152119 156922 215178 229616 277550 481572 622669
18801F22669R4537N7631n7083n427p906j91113k14455j00877P0477L809M201L7662
$$ 622669 717206 774837 717754 712327 704421 513308 298853 197976 268453 272262 276463 314125
18789C14125J8102N0633m3886o1300N8845J3891P667J43908J25630N4085M0530
$$ 314125 332227 382860 338974 277674 336519 350410 358077 501985 627615 681700 722230
18778G22230P6466J30764R0843K28853K45493R2112J8371M2816M5792J42998K51556
$$ 722230 798696 929460 1020303 1249156 1494649 1586761 1605132 1647948 1693740 1836738 2088294
18767B088294K17716l3144m06734l28019k61175j58951l0294j09879j04369J57729
$$ 2088294 2306010 2272866 1866132 1538113 1276938 1117987 1087693 977814 873445 1031174
18757A031174J45439L1645P1616R0164K78963L10818L50559L11715J18025J6066
$$ 1031174 1176613 1208258 1279874 1370038 1649001 1959819 2310378 2622093 2740118 2756184
18747B756184l202j65265k33884k19819L8689J05152J13853K06131K78185L56398
$$ 2756184 2752982 2587717 2353833 2134014 2172703 2277855 2391708 2597839 2876024 3232422
18737C232422M11326N52390P74385R32289J144801J677142K488704L519785N106876
$$ 3232422 3643748 4196138 4970523 5902812 7047613 8724755 11213459 14733244 19840120
18728A9840120P662051J2440336K0795893K8638278K0879189N16045j007599K923870
$$ 19840120 27502171 39942507 60738400 89376678 110255867 110771912 109764313 112688183
18720A12688183j4447868k8562786k2409892j3500846q462360n750966l920861
$$ 112688183 98240315 69677529 47267637 33766791 25304431 19553465 15632604
18713A5632604k713651k146155j700828j271401r25495p06857n85729l38315j71105
$$ 15632604 12918953 10772798 9071970 7800569 6875074 6168217 5582488 5244173 5073068
18704E073068p9928P4472L73086N99220M56527L07444J67342p5339l24158m65807
$$ 5073068 4993140 5067612 5440698 6039918 6496445 6803889 6971231 6895892 6571734 6105927
18694F105927n18035m20670q3004K00341K45351L30718M71814P06892R95957J322970
$$ 6105927 5587892 5167222 5084218 5284559 5529910 5860628 6332442 7039334 8035291 9358261
18684I358261J657754K244822L197631M592754O701161R813147J5123719K5176115
$$ 9358261 11016015 13260837 16458468 21051222 27752383 37565530 52689249 77865364
18676G7865364M0501133M9612489K8783286j037097N69655q95780l2894485m9363563
$$ 77865364 118366497 167978986 196762272 195725175 196294830 195399050 162504565 113141002
18668A13141002l6835114k2109169j3916257r401002o418957m539530l597813
$$ 113141002 76305888 54196719 40280462 30879460 24460503 19920973 16323160
18661A6323160k794320j966729j463533j118030r05156q37178n78066l03286j70222
$$ 16323160 13528840 11562111 10098578 8980548 8075392 7238214 6660148 6356862 6186640
18652F186640l7385K07112K52464K39765M6028j93354k40386l45809o86731n82464
$$ 6186640 6149255 6356367 6608831 6848596 6894624 6701270 6460884 6115075 5428344 4845880
18642D845880l63883j54654j9521Q276O6284K69825L78029N41992O74067R25492
$$ 4845880 4481997 4327343 4307822 4316098 4382382 4652207 5030236 5572228 6246295 7171787
18632G171787J417180K101011L109216M698258P340964J2466936J9943290K3127397
$$ 7171787 8588967 10689978 13799194 18497452 25838416 38305352 58248642 81376039
18624H1376039R889477k988138J577244j369932j8815457k2849962j5144359q992619
$$ 81376039 91265516 88277378 89854622 88484690 69669233 46819271 31674912 22682293
18616B2682293n705079l838233k575688j958791j493898j101199q53516o41226
$$ 22682293 16977214 13138981 10563293 8604502 7110604 6009405 5155889 4514663
18608D514663n30595m09977k87648l18387o5905o8070n5162o5440m3398l1787
$$ 4514663 3984068 3574091 3286443 2968056 2902151 2834081 2778919 2713479 2670081 2638294
18598B638294k04282j50582p4138k38225l20820k58162k36974o8589K230k5340
$$ 2638294 2434012 2283430 2209292 1971067 1650247 1392085 1155111 1086522 1088752 1063412
18588A063412M0900J17590J49745K29300K04314Q2668j44544k87861k05053j38087
$$ 1063412 1104312 1221902 1371647 1600947 1805261 1887929 1743385 1455524 1250471 1112384
18578A112384j51289k07569o1993M228M8867N6174m8686r2408m6486J6048M0650
$$ 1112384 961095 753526 691533 695761 744628 800802 752116 659708 613222 629270 669920
18567F69920J11509K57153L03952L01369K28338k310k94244k61509k15959r4531
$$ 669920 781429 1038582 1342534 1643903 1872241 1869931 1575687 1314178 1098219 1003688
18557A003688q9675m8875j6380j49307q5889l3955J9108j12879j73535j23276
$$ 1003688 914013 865138 848758 699451 613562 579607 598715 485836 312301 189025
18547A89025q6621j48539r6549N392J21457P2685O5818P8984o761L5246J07216
$$ 189025 102404 -46135 -142684 -137292 -15835 56850 122668 201652 194891 230137 337353
18536C37353P898J8765l0352n5670j6954J4572J7103J0408L0126M3731p1548q7666
$$ 337353 345251 364016 333664 277994 261040 275612 292715 303123 333249 376980 305432 217766
18524B17766N0285J44776J26086L4816J5714Q9770K2808J57079J93954J32457
$$ 217766 268051 412827 538913 573729 589443 679213 702021 859100 1053054 1185511
18514A185511Q7154j42164k93077k47137k15408j420J4247J0127J0883j6972L7090
$$ 1185511 1272665 1130501 837424 590287 374879 373459 387706 397833 408716 391744 428834
18503D28834P1746o4943M522n4882l8191N4629R3326J05724J56195J61824J4007
$$ 428834 500580 435637 440159 385277 347086 401715 495041 600765 756960 918784 932791
18492I32791k63941k25496l3600J0530m7618m1701P3939J1993j9155r9932j9113
$$ 932791 668850 443354 409754 420284 372666 330965 404904 416897 397742 297810 278697
18481B78697L8152k9317j08221o1526k9593J209L1744L9572M6978K727O6839J21223
$$ 278697 316849 287532 179311 117785 88192 89401 121145 160717 207695 210422 277261 398484
18469C98484p0271J6910J6593j0886R1327L136l3157p1773l2775K7485m0110k5860
$$ 398484 328213 345123 361716 350830 442157 445293 412136 340363 307588 335073 294963 269103
18457B69103M3288J0791J58869Q6542j9970n8492m0962l6717l7252Q1338N4367
$$ 269103 312391 323182 482051 568593 548623 490131 449169 412452 375200 456538 510905
18446E10905m0551J2747J8828P2688P9805P646o670K2076R5965J1631p6705o2461
$$ 510905 470354 483101 501929 574617 654422 662068 655398 677474 773439 785070 708365 645904
18434F45904m4790R0701O7566l4318L5064J08039L4129j7096J04825M6342P1668
$$ 645904 601114 691815 759381 725063 760127 868166 902295 885199 990024 1036366 1108034
18423A108034O1174M7808M1835j714R4644J85818J30104J38946J60491J51495
$$ 1108034 1169208 1217016 1258851 1257137 1351781 1537599 1667703 1806649 1967140 2118635
18413B118635K07410K91784L80338O40129P93313Q31848N15660K49170J50967
$$ 2118635 2326045 2617829 2998167 3638296 4431609 5263457 5779117 6028287 6179254
18404F179254Q3577J77981K90200N58526Q44442J344266J805028K264612K990912
$$ 6179254 6262831 6440812 6731012 7289538 8133980 9478246 11283274 13547886 16538798
18395A6538798M115868O093734R308158J4680477K4637089M2595212O7958380
$$ 16538798 20654666 26748400 36056558 50737035 75374124 117969336 185927716
18388A85927716Q0234225L5669521m6007725p8013670n9335258l5877612k1198874
$$ 185927716 266161941 301831462 255823737 177810067 118474809 82597197 61398323
18381F1398323j2995516q427917n510820l376881j576246Q1200J503299L306610
$$ 61398323 48402807 39974890 34464070 31087189 29510943 29592143 31095442 34402052
18373C4402052N854002R846250J6750774K9145015M9575484P1959335O3871226
$$ 34402052 40256054 50102304 66853078 95998093 145573577 217532912 281404138
18366B81404138l269031o8337748p1742510m6919541k7714303j6719528j0817414
$$ 281404138 278135107 209797359 138054849 91135308 63421005 46701477 35884063
18359C5884063p594988n464766m116123k939932k063880j606251j274743j187711
$$ 35884063 28289075 22824309 18708186 15768254 13704374 12098123 10823380 9635669
18351I635669q08446n46563l29104q7805N9166J24652k55761p18207j105155q36336
$$ 9635669 8827223 8280660 7951556 7863751 7922917 8047569 7791808 7073601 5968446 5132110
18341E132110n95371m28610m08257l24357j87983k09229j52460k35792j63047
$$ 5132110 4536739 4108129 3699872 3375515 3187532 2978303 2825843 2590051 2427004
18332B427004p9479q0339n813j5010n5899j00618j04914j0656n6042j59214j80332
$$ 2427004 2347525 2267186 2261373 2246363 2190464 2089846 1984932 1974276 1918234 1759020 1578688
18321A578688j10382k965J013O889n0082m702m2895q1190j2345j18629r6070q8160
$$ 1578688 1468306 1465341 1466354 1473243 1423161 1418459 1375564 1294374 1282029 1163400 1067330 979170
18309I79170j57004j9436P2208J00412N3493j21669j00119L4880J224O787J9935
$$ 979170 822166 802730 874938 975350 1028843 907174 807055 841935 843159 849946 869881
18298H69881k5618j8023l8527o0107q4153j0713J29231q2844q8345m2580o1590
$$ 869881 844263 826240 787713 727606 643453 632740 761971 679127 590782 548202 486612
18287D86612J365M0067k44K0996K8175K0013m3623k2561J8776N977K8508l8073
$$ 486612 487977 528044 527800 548796 576971 596984 553361 530800 549576 555553 584061 545988
18275E45988k2197n9148j0615N2223M4636j4395p3091q4853k5842l137j7130m1884
$$ 545988 523791 464643 454028 506251 550887 536492 463401 378548 352706 349569 332439 290555
18263B90555k75573o4176n9409j26042N2235R1050J24924Q5839M7761N0402J45920
$$ 290555 14982 -49194 -108603 -234645 -182410 -91360 33564 119403 167164 217566 363486
18252C63486J6361m0317O9767j4381j4016o9052K9825O8117j34110j90450j98597
$$ 363486 379847 339530 409297 394916 380900 311848 341673 409790 275680 85230 -113367
18241a13367q8049p6294R9732K05081K20028K65807J95373j1285k16499j47391
$$ -113367 -201416 -277710 -177978 27103 247131 512938 708311 697026 480527 333136
18231C33136j07747l0618L0384r8073R361N4529l1243m8308J02964P0444p7616
$$ 333136 225389 194771 225155 127082 136443 190972 159729 111421 214385 284829 207213
18220B07213j06400m8121j7175M0480J81341J16095p4073l6327r5634m4210n579
$$ 207213 100813 52692 35517 75997 257338 373433 299360 263033 167399 123189 117610
18209A17610k59N7385L7590k1245J5084j2845J41329K26170J37128j1237j45780
$$ 117610 117351 174736 212326 191081 206165 193320 334649 560819 697947 686710 540930
18198E40930N6319L4418k7035j13897r4477j34129l7131j1970O0775m7792l0682
$$ 540930 597249 631667 604632 490735 396258 262129 224998 213028 273803 226011 195329
18187A95329P3170Q8143o3038o8226k2621M2105j5834n9013j18685l9404K2134
$$ 195329 268499 356642 293604 225378 202757 244862 229028 170015 51330 11926 34060
18176C4060J02592J27189j6277J9395k6894o8142j5478O9674J05504J18971L6187
$$ 34060 136652 263841 247564 266959 240065 171923 156445 226119 331623 450594 486781
18165D86781j3909p7800q3014j8094Q7818O7690J1847K9345K353l4583N7263J44411
$$ 486781 472872 395072 312058 293964 381782 449472 461319 490664 493017 458434 515697 660108
18153F60108J39681K37181K24990J06856J3864P6486J7891j91908k58468j05320
$$ 660108 799789 1036970 1261960 1368816 1382680 1459166 1477057 1285149 1026681 921361
18143I21361r2385k23999l5017R7853P2967K9885l3569J1819j8556O481j7106
$$ 921361 828976 604977 569960 667813 740780 770665 737096 748915 730359 736840 719734
18132G19734J51801K06383N5843n0237J99220K25134J22533K06300K93564K44175
$$ 719734 871535 1077918 1133761 1083524 1282744 1507878 1630411 1836711 2130275 2374450
18122B374450K77586L72515P44873J000836J034072J152084J693872K723863M347659
$$ 2374450 2652036 3024551 3769424 4770260 5804332 6956416 8650288 11374151 15721810
18113A5721810O779646J1569289K1988943M3143701P2882611N7749444m2647527
$$ 15721810 22501456 34070745 56059688 99203389 172086000 229835444 187187917
18106A87187917p7835073m5480651k2676639j2396071p451107m802981l478700
$$ 187187917 109352844 63872193 41195554 28799483 21348376 16545395 13066695
18099A3066695k617080j946716j273789r17043q92336p47887o20343n89078l64266
$$ 13066695 10449615 8502899 7229110 6312067 5419731 4671844 4051501 3462423 3098157
18090C098157k77002j45331j76041j50968k60332l08275j73960j09440p4620n2663
$$ 3098157 2821155 2675824 2499783 2348815 2088483 1780208 1606248 1496808 1422188 1369525
18080A369525m9959j06135j09919n0361r2759n4302l1184n4205K5564n172p3154
$$ 1369525 1319566 1213431 1103512 1053151 960392 906090 874906 820701 846265 841093 767939
18069G67939p3353j6287l2466r4467r2003p4388M6862J56028L2886r8927n5077
$$ 767939 694586 678299 645833 551366 459363 384975 431837 587865 620751 521824 466747
18058D66747M0210J38145J7519l703k308J7863l972m7449o6655M4838o0632j05145
$$ 466747 506957 645102 662621 658918 656610 674473 670501 623052 556397 601235 540603 435458
18046D35458p2549j02523P981M095N439l1039o2029K0048N9421O0751K0964l4131
$$ 435458 362909 260386 268367 272462 277901 246862 184833 204881 264302 325053 346017 311886
18034C11886o5414o564L2612J8006K9691j5743o4749j28132l3256R9570N711k3520
$$ 311886 246472 239908 272520 290526 320217 304474 239725 111593 78337 177907 183618 160098
18022A60098k0907L226l7307j7577Q699l1978J5533J04021J23421m8839j36859
$$ 160098 139191 142417 105110 87533 96232 64254 79787 183808 307229 258390 121531
18011A21531k6273P5521J19296K0974n2241o8812l1121P1630o2296k2116P9867
$$ 121531 95258 170779 290075 311049 258808 189996 158875 230505 168209 146093 225960
18000B25960N0564l5396L8357N7866p238k0706j0281M0232J5760J8840L6501M2332
$$ 225960 276524 241128 279485 337351 330113 309407 299126 339358 355118 373958 410459 452791
17988D52791m038J3283O8767L9348k7750j28563k24923k30635Q6975J51457k6295
$$ 452791 448753 462036 530803 570151 542401 413838 188915 -41720 45255 196712 170417
17977A70417l3597P541J3428M868l8513N9210N1094n0662m8865K1974n9562n7419
$$ 170417 136820 144361 157789 162657 124144 183354 234448 183786 134921 156895 97333 39914
17965C9914J5178k9082j2798r772l8555P7205J21593k3411r048K6166K1853J3533
$$ 39914 55092 26010 13212 3440 -35115 42090 163683 140272 131224 157390 179243 192776
17953A92776J5526o0709l6024P4095J4800K4742N415p9914m2472k0382M6689J5130
$$ 192776 208302 147593 111569 185664 200464 225206 230621 150707 108235 87853 134542 149672
17941A49672L6732O9028l3256l9872p5274j3548L8818Q3643J3467L1933j5287
$$ 149672 186404 255432 222176 182304 107030 93482 132300 215943 229410 261343 246056
17930B46056p7168k0435O648k5311o9970l3880p9369O1787K8780j7702q4470M3030
$$ 246056 168888 148453 155101 129790 59820 25940 -53429 8358 37138 19436 -65034 -22004
17918b2004l0921m3771M8340N4168M6552K9642K9473L0593n9681j46904L9634
$$ -22004 -52925 -96696 -48356 5812 52364 82006 111479 142072 82391 -64513 -24879
17907b4879L9202j3962L3627j6331L715J07649j5343j7470p0506j08098o2931
$$ -24879 14323 361 33988 17657 21372 129021 113678 96208 25702 -82396 -145327
17896a45327J04552J00663K8058j8617L9588M0745m421l3078n0727k3005L9675
$$ -145327 -40775 59888 87946 69329 108917 149662 145241 112163 61436 38431 78106
17885G8106K7813K0288L5375R8080k6428n9590k5785k3716p554l3277n5800j6312
$$ 78106 105919 126207 161582 259662 233234 173644 147859 124143 116589 83312 27512 11200
17873A1200J8480J12283O8311o9815m7515q697l1236l1681Q967l1507N4667k602
$$ 11200 29680 141963 210274 140459 92944 84247 53011 21330 30297 -1210 53457 50855
17861E0855o7653P5650r1038j2483J46812M4350r1280j13905m7825M7221N1999
$$ 50855 -16798 58852 -32186 -44669 102143 146493 55213 -58692 -106517 -59296 -7297
17850g297J8654k9057L1474K6031j3696J066n4990n2656K2211N5532R9257R013
$$ -7297 11357 -17700 13774 39805 26109 27175 -27815 -80471 -58260 -2728 96529 105542
17838A05542j5140P5718q554j41978j02696j8253M9596Q5821L9987J1979j4180
$$ 105542 90402 166120 157566 15588 -87108 -105361 -55765 30056 70043 82022 67842
17827F7842o1244J9748q75m7271l0896J2643K0964J13594M1087k0262R609K4818
$$ 67842 6598 26346 25471 -21800 -52696 -40053 -19089 94505 135592 115330 124939 149757
17815A49757O301l4123L9222o9385m844j176n513n4628M9188J6847j8469Q6050
$$ 149757 156058 121935 161157 91772 86928 85752 80239 25611 74799 91646 73177 159227
17803A59227K2713q6054r0391q251q5440P3542J6747K3362Q4773L2259J4270l4109
$$ 159227 181940 95886 5495 -2756 -88196 -14654 2093 25455 110228 142487 156757 122648
17791A22648J4081N5640P0167Q0997M5047M9529J60776K37819L17813K67171K1589
$$ 122648 136729 192369 262536 343533 388580 438109 598885 836704 1154517 1421688 1443277
17780A443277j69968l91125k26386j87382j06412o6053j402j7506p8675j12146
$$ 1443277 1273309 882184 655798 468416 362004 295951 294549 277043 198368 86222
17770H6222k8175R1606N2058j5288Q9879J28071K31117M21098L48259J17630k50812
$$ 86222 58047 149653 201711 186423 276302 404373 635490 1056588 1404847 1522477 1271665
17759A271665l42295k81008j95879j83572j08601j2611o8792m8065R3348M3740
$$ 1271665 929370 648362 452483 268911 160310 147699 78907 30842 124190 167930
17749A67930n5931k9484j3274k3962K1864n0954k5140q6923P544l4761N9833N6512
$$ 167930 111999 82515 69241 45279 67143 16189 -8951 -95874 -88330 -123091 -63258 -6746
17737f746J5743r0423l023J2856L7481M199p443p317l5360k5066R9097R5557M1447
$$ -6746 8997 -81426 -84449 -71593 -34112 -29913 -37356 -44673 -80033 -105099 -6002 89555 131002
17724A31002J0940n0086m5021j4204m66k1558N8964j1837l8332N026l2206O3114
$$ 131002 141942 91856 46835 32631 32165 10607 69571 57734 19402 24428 -7778 55336
17712E5336O1374L303q7130o566l4352L618p5531k4972P1724J4552k835q244k4884
$$ 55336 116710 120013 32883 26317 -8035 -4417 -79948 -104920 -33196 -18644 -21479 -29723 -54607
17699e4607k6972m106L7792n668Q9307l8390p3162j1431K8636k4735j4668K3498
$$ -54607 -81579 -85685 -47893 -53561 35746 -2644 -75806 -87237 -58601 -83336 -98004 -74506
17687g4506M284M5876P0858N4780n3438j2234j4096j02798J7096K2127R0905L9554
$$ -74506 -70222 -24346 46512 101292 47854 35620 21524 -81274 -64178 -42051 48854 88408
17675H8408o1266j70034R285Q2140j583O2562O9984k9222n58J6741p4407m6984
$$ 88408 27142 -142892 -133607 -51467 -53050 9512 79496 50274 49716 66457 -7950 -54934
17663e4934P0739M2331M0501J33055k2602m0207r755q5182L0681o073q7860j30320
$$ -54934 15805 58136 98637 231692 209090 168883 159128 73946 104627 98554 10694 -119626
17651a19626l2195M6461Q2041o0508p119j6606m4699O3773J5913Q4259l988l9695
$$ -119626 -151821 -105360 -23319 -83827 -90946 -107552 -152251 -88478 -72565 11694 7706 -31989
17639c1989o4702o2201k7186N6069O5564P7733P1859n5575k2863j5975M971L4978
$$ -31989 -96691 -158892 -186078 -130009 -64445 13288 85147 29572 6709 -9266 -4295 30683
17627C0683l4891j6218r8218J29824R1080o7503p1569j8729N5724L627m0138K4356
$$ 30683 -4208 -20426 -118644 11180 102260 34757 -36812 -55541 183 3810 -36328 -11972
17615a1972N4013L8901o0864l6598n0868j526O7280l7626k4075L0586L7839o743
$$ -11972 42041 80942 20078 -16520 -67388 -68914 -1634 -39260 -63335 -32749 5090 -1653
17603a653P5072P6667k2047p1864m2328q0857j02913O5511J11090M5466j4016
$$ -1653 73419 150086 128039 56175 13847 -67010 -169923 -104412 6678 52144 38128
17592C8128l8224M827k893N5470N8128K0653K962r916r8151J9308L6027k7402
$$ 38128 -96 4731 1838 57308 115436 136089 139051 129135 30984 50292 86319 58917
17580E8917o3905j1342j6046j02152M826Q8063L6298J1440o8676j4499j4547L4344
$$ 58917 -4988 -16330 -32376 -134528 -129702 -41639 -5341 6099 -62577 -77076 -91623 -57279
17568e7279N7878O9399m4052n6280m7634L9500M3850M0358q8789q9690p526L7719
$$ -57279 599 69998 25946 -30334 -77968 -38468 5382 45740 -43049 -132739 -140265 -102546
17556a02546R2861p2876P121o440n3484M044O6496K1114M9438R438l0209M7286
$$ -102546 -9685 -82561 -75440 -81880 -135364 -131320 -64824 -43710 5728 15166 -15043 32243
17544C2243L0747L198J388m3167M3790K2328n806N487r2043j2162N7902J6821
$$ 32243 62990 66188 67576 24409 68199 90527 84721 90208 -1835 -13997 43905 60726
17532F0726L8910N2849o7065j10536k5318L574P9103M831k5155l485N1715M8169
$$ 60726 99636 152485 85420 -25116 -50434 -46860 32243 37074 11919 8434 60149 108318
17520A08318R440q077k6966k1626n286n1070j80370n6279Q8722O5680J4462L8131
$$ 108318 117758 109681 82715 61089 55803 4733 -175637 -231916 -143194 -77514 -63052 -24921
17508b4921J14624J975l6825k3647l6035o9784L7785M2232K8579m1509m718N2360
$$ -24921 89703 91678 54853 31206 -4829 -74613 -36828 5404 33983 -7526 -12244 40116
17496D0116j23736p5454M5073P9948O3393o2035N803q6706L2245O4033j5824j6008
$$ 40116 -83620 -159074 -114001 -34053 29340 -32695 -26892 -113598 -81353 -17320 -33144 -49152
17484d9152q162k3873k8940J8334J0036K3992P4880N7653O2520J6741j12464O1320
$$ -49152 -57314 -81187 -110127 -91793 -81757 -57765 17115 74768 137288 154029 41565 102885
17472A02885O1784o9697p4817M7851O2800k3924J4138k8779j02087l7312K8285
$$ 102885 164669 94972 20155 68006 130806 106882 121020 92241 -9846 -47158 -18873
17461a8873O8501P0469J6003p8550l0195l8663N644K9397o8798r0067M1216K4560
$$ -18873 49628 120097 136100 57550 27355 -11308 -5664 23733 -45065 -135132 -93916 -69356
17449f9356l4505P8204O4050n4784Q1693K91320M25704L55686m6412m23362l04024
$$ -69356 -103861 -25657 38393 -16391 65302 356622 782326 1138012 1091600 668238 364214
17438C64214m9770j1311n9649j06870j09389r652M6770p5992K9796M3604m4214
$$ 364214 314444 303133 243484 136614 27225 17573 64343 -11649 18147 61751 17537
17427A7537k9981o0146n9053M0246J7146J00204P1609Q786o058O489p3582q3663
$$ 17537 -12444 -72590 -131643 -91397 -74251 25953 97562 106348 100290 106779 33197 -50466
17415e0466M7073M4231J3232l4827n4341q3731J404J08115Q2177j6359j7523P3990
$$ -50466 -3393 40838 54070 19243 -35098 -118829 -117425 -9310 72867 56508 38985 112975
17403A12975R506j6076n4418m7374n587J1722J7750k3180p4695k6623J7543J1294
$$ 112975 122481 106405 51987 4613 -974 10748 28498 5318 -69377 -96000 -78457 -67163
17391f7163K9438k9651k4352M1442J1501p60n8569J03928J9193J2306o2794J5627
$$ -67163 -37725 -67376 -91728 -50286 -38785 -39545 -98114 5814 25007 37313 -25481 -9854
17379i854M3080m0753o6193N1712K1514n9314l9710R352J1665j4425l1051M2204
$$ -9854 33226 -7527 -73720 -22008 -494 -59808 -99518 -90166 -78501 -92926 -123977 -81773
17367h1773R1113M6993p413N4561q5484q2486l8657M8217J05672l2463j11414
$$ -81773 9340 56333 48920 103481 17997 -64489 -103146 -54929 50743 18280 -93134
17356i3134j6515M2779R5992P6632K1922R3363k9372r3537L9067n3691o9839j2220
$$ -93134 -109649 -66870 29122 105754 127676 221039 191667 98130 137197 83506 13667 1447
17344A447J7867l600l598J6385k1596r229p4922k7886O0860L720Q992k9634M0214
$$ 1447 19314 15714 12116 28501 6905 -2324 -77246 -105132 -44272 -40552 -31560 -61194 -20980
17331b0980L3828R5243m9958r7116k8761M5637n164J3377j8733l3262q589p816
$$ -20980 12848 108091 58133 -38983 -67744 -22107 -27271 -13894 -32627 -65889 -74478 -82294
17319h2294N7634O064o9157L2588M6263M3569j6307l0729o0542q5854L0115l8047
$$ -82294 -24660 -18596 -87753 -55165 -8902 34667 18360 -12369 -72911 -158765 -128650 -166697
17307a66697q489Q3418J09130l191q9800M713m8349l1614L4093K8227P7476N3137
$$ -166697 -175186 -91768 17362 14171 -75629 -70916 -119265 -150879 -116786 -88559 -11083 42054
17295D2054o4583p6616m7345P9957q2313q0623J31139M8897m8023M3190K7946
$$ 42054 -22529 -99145 -146490 -66533 -148846 -229469 -98330 -49433 -97456 -54266 -26320
17284b6320p8230l447J26746M9606m4025j59610j1697J32923Q208k6826K4375
$$ -26320 -104550 -107997 18749 68355 24330 -135280 -146977 -14054 -5846 -32672 -8297
17273h297L5286l0200q353J7232l0047J6203l3054p8137n4992m3184m654P3316
$$ -8297 26989 -3211 -11564 5668 -24379 -8176 -41230 -119367 -174359 -217543 -222197 -148881
17261a48881R1551N4011P8649j6500J9930J4179j28104n0994k9819P259K2245
$$ -148881 -57330 -3319 75330 58830 78760 92939 -35165 -86159 -115978 -108719 -86474
17250h6474q9473p4730N4909J3462P9879M8544K1155o778n9785k2357j8978O129
$$ -86474 -175947 -250677 -195768 -182306 -102427 -53883 -32728 -39506 -99291 -121648 -140626 -134497
17238a34497J7484M9318k508l128K3282J05224K8724P374J9444o2108j13970q7130
$$ -134497 -117013 -67695 -70203 -73331 -50049 55175 83899 91273 110717 48609 -65361 -152491
17226a52491l5035O3650J09072L1460q2409o9311L1675M7132N4909M3016q7938
$$ -152491 -187526 -123876 -14804 16656 -65753 -135064 -103389 -56257 -1348 41668 -46270
17215d6270k4519P9889j2219K102q695j335j8255l5560J1350L4808l2134K0742
$$ -46270 -70789 9100 -3119 -1017 -9712 -11047 -29302 -64862 -53512 -18704 -50838 -30096
17203c0096o3027n1913J04237P545o0652n6296o3316N6619J68879K146P8797R3984
$$ -30096 -93123 -145036 -40799 -33254 -93906 -150202 -213518 -156899 11980 14126 92923 186907
17191A86907m6160l9413J4633q5006O66M3056J1020l5197j6263m1677M2372l7376
$$ 186907 140747 101334 115967 30961 31627 74683 85703 50506 34243 -7434 34938 -2438
17179b438o0710j6643l2855M2634J49206j0374k2991k9616m4406l1578n2957n1488
$$ -2438 -63148 -79791 -112646 -70012 79194 68820 45829 16213 -28193 -59771 -112728 -164216
17167a64216l9088Q8453J74087M2825K1051k237l3674j143N8637n9178m9849K8810
$$ -164216 -203304 -114851 59236 102061 123112 120875 87201 86058 144695 85517 35668 64478
17155F4478M7884l7586n5731k5362l1703J8452K3738m5028q9599Q7969O5556j12578
$$ 64478 112362 74776 19045 -6317 -38020 -19568 4170 -40858 -130457 -42488 23068 -89510
17143h9510j7681P9361L7012l075o411K8731m6784Q2175J10131P568q6340n8726
$$ -89510 -107191 -27830 9182 6107 -304 28427 -18357 63818 173949 181517 95177 36451
17131C6451k0767L0527j077P713N9193l8180n3697L1830L1766m184J9231J0194
$$ 36451 15684 46211 45134 52847 112040 73860 20163 51993 83759 79575 98806 109000
17119A09000p8790j12518J1717O2140J05470k9524j46519p295R2786o0768q1208
$$ 109000 30210 -82308 -70591 -8451 97019 67495 -79024 -86319 6467 -54301 -135509
17108a35509l8336q875J75906O0618M224n6313l2139J4354K236K9023l550J4486
$$ -135509 -173845 -182720 -6814 53804 58028 1715 -30424 -16070 -13834 15189 11639 26125
17096B6125J02600J8224o6878o8738M9216J9363l7518N0209J893L1844P2563L5021
$$ 26125 128725 146949 80071 11333 60549 79912 42394 92603 94496 126340 198903 233924
17084B33924j04510p4628n2852n4250k3886O7685N7449N655k2330Q6907k4332
$$ 233924 129414 54786 1934 -52316 -76202 -8517 48932 54587 32257 119164 94832
17073I4832j53246k5982N9868M9965K9673J5911j0303m6663R457q081o4136n9058
$$ 94832 -58414 -84396 -24528 25437 55110 71021 60718 14055 23512 15431 -48705 -107763
17061a07763L8698o969l4908P7844M3279P752O8789L6372j8400l4877K7857J3310
$$ -107763 -69065 -76034 -110942 -33098 10181 17933 86722 123094 104694 69817 97674 110984
17049A10984p6631K5104m4578n0350M5190N837o7027k9673j27745l7029O7181
$$ 110984 34353 59457 14879 -35471 9719 15556 -51471 -81144 -208889 -245918 -178737
17038a78737N4965L8807j8756K8481M6976k2891o5253N5785N0120o5772k6086
$$ -178737 -123772 -84965 -103721 -75240 -28264 -51155 -116408 -60623 -10503 -76275 -102361
17027a02361N3524J4337J50978M4785l8237m7009n5888n6275M46J450l049Q179
$$ -102361 -48837 -34500 116478 161263 123026 76017 20129 -36146 -35700 -34250 -37299 -29120
17015b9120P606m6972M5694O9729m885J0376k5553m5562j6241M2355o3560k9810
$$ -29120 -21514 -68486 -22792 46937 42052 52428 26875 -18687 -34928 7427 -56133 -85943
17003h5943o598J7483K9841P936O2963n113m2567L9583K4455m5100l2231J6883
$$ -85943 -92541 -75058 -45217 -37281 25682 20569 -21998 17585 42040 -3060 -35291 -18408
16991a8408M9078m8482m0298O2815k6947Q04Q7298j540r909r6848q9826j1308
$$ -18408 30670 -17812 -58110 4705 -22242 -21438 65860 64320 54411 -42437 -132263 -143571
16979a43571J7017K2922N4046L1067j6647J5017m7214Q6613l1634l3230l5818
$$ -143571 -126554 -103632 -49586 -18519 -35166 -20149 -67363 19250 -12384 -45614 -81432
16968h1432L1915K3969K3227L1935r1391m3104j3618O3080K8399k2845J229M1489
$$ -81432 -49517 -25548 -2321 29614 -61777 -104881 -118499 -55419 -27020 -49865 -48636 -7147
16956g147j0183N9319Q0505o2353r3648n4929L237p396P8075L0005j4979p155
$$ -7147 -17330 41989 122494 60141 -33507 -88436 -85199 -92595 -14520 15485 506 -6649
16944f649q2916J8232L4243J20223O9436p0618n5422j13965j3968J23850J8582
$$ -6649 -89565 -71333 -37090 83133 152569 81951 26529 -87436 -101404 22446 41028
16933D1028o2075m4392m6188R1479K1217L5466j1348o4469L018P9217q0851l9936
$$ 41028 -21047 -65439 -111627 -20148 1069 36535 25187 -39282 -36264 42953 -37898 -77834
16921g7834P931R625K184N0196j5947J9852P2191P122m6366k0371p5034J7538
$$ -77834 -69903 -60278 -58094 -7898 -23845 -3993 68198 75320 28954 8583 -66451 -48913
16909d8913R7928o779r2357J6979L2413q5158o201l7168L3070j6745L2999P8979
$$ -48913 49015 42236 -50121 -33142 -729 -85887 -92088 -129256 -96186 -112931 -79932 -953
16897i53K2724j8238L2670Q2523j6012l8087O8493k396j2031l4367j01349p4873
$$ -953 21771 3533 36203 118726 102714 64627 133120 130724 118693 84326 -17023 -91896
16885i1896l3861j0674q316K7577r662O2970k0322K6921L2580j6223K2411Q4449
$$ -91896 -125757 -136431 -144747 -117170 -126832 -63862 -84184 -57263 -24683 -40906 -18495 65954
16873F5954O487o4813j3894N9048l1310o8664j2351L0647Q807M4833k7978L5575
$$ 65954 72441 7628 -6266 52782 21472 -47192 -59543 -28896 -20089 24744 -3234 32341
16861C2341J07258L003k5081n7906q0695P830N7894L55r4550l6911K4444M9017
$$ 32341 139599 142602 117521 59615 -21080 -13250 44644 44999 -49551 -86462 -62018 -13001
16849a3001P9638m2358n4656j45493j1140L5945O4579Q5809J7082R8706M6799
$$ -13001 66637 24279 -30377 -175870 -187010 -151065 -86486 -677 16405 115111 161910
16838A61910j5153r8221j32410l9743Q5812N8569k3636m1047k289j1754k8703
$$ 161910 146757 48536 -83874 -123617 -37805 20764 -2872 -43919 -46208 -57962 -86665
16827h6665j7742j02954J3901L6182N0536n680O6930K3987K4578K5520k1503j2492
$$ -86665 -104407 -207361 -193460 -157278 -106742 -112422 -45492 -21505 3073 28593 7090 -5402
16815e402o8234l2042N5516K7990K2952k4319J626J4865j4517L4379q5421m5896
$$ -5402 -73636 -105678 -50162 -22172 780 -23539 -21913 -7048 -21565 12814 -72607 -118503
16803a18503K8392m3034O6691P1330J05070n8989q5059r9786O0160J1172j8482
$$ -118503 -90111 -133145 -66454 4876 109946 50957 -34102 -133888 -73728 -62556 -81038
16792h1038j3497K9305L1716J929k4799r5739m354Q6116J36074K3821O4306N3443
$$ -81038 -94535 -65230 -33514 -31585 -56384 -152123 -156477 -70361 65713 89534 153840 207283
16780B07283l338l6024j06907j12773p262R3286Q1310J19078m5332q8468j27267
$$ 207283 203945 167921 61014 -51759 -59021 34265 115575 234653 189321 100853 -26414
16769b6414K0549M0568J11089k4559p8983l8095j04049K851K8043L6882q322k5745
$$ -26414 -5865 34703 145792 121233 42250 4155 -99894 -97043 -69000 -32118 -40440 -66185
16757f6185K7018k937K8994L1768l0206O5849M192k3141J3908M862k93q2438k3199
$$ -66185 -39167 -42104 -13110 18658 -11548 54301 58493 35352 49260 54122 53829 -28609 -51808
16744e1808N0967K1130L812l6424j5321l1865K5966p928J1561k8662j8973J9093
$$ -51808 -841 20289 24101 -12323 -27644 -59509 -33543 -41471 -29910 -58572 -77545 -58452
16732e8452l3488R855N1081J8560o5746m2831k9765M95M019N7654j3277K5048
$$ -58452 -91940 -82085 -31004 -12444 -78190 -121021 -150786 -150291 -146272 -88618 -101895 -76847
16720g6847N6899M0282k7870m087n1936L2310Q4233M0880m9913N2646Q190k0099
$$ -76847 -19948 20334 -7536 -11623 -63559 -31249 52984 93864 43951 96597 104787 84688
16708H4688q6548l395m8861q6503j3107R543m834m257O9975M9050m108O4475J2215
$$ 84688 -1860 -5255 -54116 -140619 -153726 -144183 -149017 -153274 -83299 -34249 -38357 26118 38333
16695C8333M2611P087O3187J9420p1248j38063r1158k1463J4584N294m26l9315
$$ 38333 80944 88031 151218 170638 99390 -38673 -129831 -151294 -136710 -131416 -131842 -171157
16683a71157L2230Q7235N8374L4920o3063J2232J721O9091k1517q0763p292N474
$$ -171157 -138927 -51692 6682 41602 -21461 -9229 -7508 61583 40066 -40697 -47989 -42515
16671d2515l29j5188Q2926L9619m0191n524J5260m129j907o6599N9793l9064m8709
$$ -42515 -42844 -58032 24894 64513 24322 18798 34058 29929 28022 -38577 21216 -17848 -66557
16658f6557q8m4466P7879L6757j8742J0852j8756K8349o1339m2072J1254P4042
$$ -66557 -66645 -111111 -33232 3525 -15217 -4365 -23121 5228 -56111 -98183 -86929 -12887
16646a2887k076M1365L6374m7537r0142l5686J5529J7519Q6260P4335o2792n8771
$$ -12887 -14963 26402 62776 15239 -74903 -110589 -95060 -77541 8719 83054 20262 -38509
16634c8509j4435M3383N6651o7887k0991J5109j3771p8151j0940P7815M2263M1375
$$ -38509 -52944 -9561 47090 -20797 -41788 -26679 -40450 -118601 -129541 -51726 -9463 31912
16622C1912o0198j51323k6454l0265L350J8743N8570j2251L1038P4922r031n6425
$$ 31912 -28286 -179609 -206063 -236328 -232978 -214235 -155665 -167916 -136878 -61956 -70987 -127412
16610a27412Q15P3109J5756r8441l4436O5992P5452Q953l8671P444Q6714L0940
$$ -127412 -126597 -53488 -37732 -136173 -170609 -104617 -29165 -20212 -58883 -51439 35275 66215
16598F6215j00440j17684O6946P267j01687M1179N1741P0074L4542l0200k2931
$$ 66215 -34225 -151909 -84963 -77696 -179383 -138204 -86463 -16389 18153 -12047 -34978
16587c4978K2053O8877J9667m1079n3707n5437N2689n1449K4419M2309P3602j00493
$$ -34978 -12925 55952 75619 34540 -19167 -74604 -21915 -73364 -48945 -6636 66966 -33527
16575c3527n6081r207k869M2025k3963K5882P3817P5033n2734j8360N8645M161
$$ -33527 -89608 -98815 -101684 -59659 -83622 -57740 16077 91110 38376 20016 78661 82822
16563H2822q1446m1296J9938p2736k1551n4338L796O0933K4610k7952J48000O715
$$ 82822 1376 -39920 -19982 -92718 -114269 -168607 -164811 -103878 -79268 -107220 40780 47495
16551D7495n0662q3695n235J3451k2473j0696K864N7792R6799M4566p8279k8461
$$ 47495 -3167 -86862 -92097 -78646 -101119 -111815 -108951 -51159 45640 90206 11927 -16534
16539a6534q057k5677o212J6577K7371l4485k9812m1119k8819k3836O0215L0414
$$ -16534 -24591 -50268 -56480 -39903 -12532 -47017 -76829 -117948 -146767 -170603 -110388 -79974
16527g9974M2283O4932n119o9798J0263R589M8122J9116n0928J09773K5807j8241
$$ -79974 -37691 27241 22122 -47676 -37413 -27824 20298 39414 -11514 98259 124066 105825
16515A05825m3312n2434L6708k5270r5531K9049l1360j6423k115j03471k3090
$$ 105825 62513 10079 46787 21517 -74014 -44965 -76325 -92748 -94863 -198334 -221424
16504b21424P613K7650K7740j3758l2657L2358J2074L3522M6919J03753M7284
$$ -221424 -213811 -186161 -158421 -172179 -204836 -172478 -160404 -126882 -79963 23790 71074
16493G1074o4747p7364M0717L7891m1144n0717o3696m6941L080n064L1431N4313
$$ 71074 6327 -71037 -30320 7571 -33573 -84290 -147986 -194927 -191847 -196911 -165480 -111167
16481a11167P176N5924P0008k6368n9436l1221M3796J4706r440K0130R6779K852
$$ -111167 -103991 -48067 21941 -4427 -63863 -95084 -51288 -36582 -46022 -25892 70887 73739
16469G3739K5816k2462k5797o1305j1796O5421l8098L377K5702M510p1798o9029
$$ 73739 99555 77093 51296 -10009 -21805 43616 5518 8895 34597 39107 -32691 -101720
16457a01720k1436N2640L547J747N8259L2691l7071K7154O35l6859p5372m0748
$$ -101720 -123156 -70516 -66969 -65222 -6963 25728 -11343 15811 16446 -20413 -95785 -136533
16445a36533m6341P5005J962r0777j042P9369j4226o097R0627P3145O2584o0088
$$ -136533 -182874 -107869 -105907 -196684 -197726 -118357 -132583 -138680 -48053 25092 87676 27588
16433B7588o9725p2245J7768p21M8397Q5939k1912K9210L2249l4795o4016q8203
$$ 27588 -42137 -114382 -96614 -97335 -48938 37001 15089 44299 76548 41753 -22263 -110466
16421a10466n7412J11053M351M698K1746J36624l5007m7302l4340J12400K6969
$$ -110466 -167878 -56825 -52474 -47776 -26030 110594 75587 28285 -6055 106345 133314
16410A33314q3035k8646k2092K0138l1566j5709k9071R522j3864Q0988L7944Q136
$$ 133314 50279 21633 -459 19679 -11887 -27596 -56667 -47145 -61009 19979 57923 66059
16398F6059o4359n0045p0238J4607N3080L2275l6530N919K7172L8542K8609L9790
$$ 66059 1700 -48345 -118583 -103976 -50896 -18621 -55151 -49232 -22060 16482 45091 84881
16386H4881m7295r2136k6547R4564m1291j8611J39648j1980K7727m1839J063J9716
$$ 84881 37586 -54550 -81097 13467 -27824 -46435 93213 81233 108960 67121 68184 87900
16374H7900p245m0638p9194l5228L9521J2010j03727q1814j0762R3123Q2308o8606
$$ 87900 80655 40017 -39177 -74405 -34884 -22874 -126601 -208415 -219177 -126054 -43746 -112352
16362a12352j13069K9432O8999Q309l1707R5506K3077J5267L7138m9887k7595
$$ -112352 -225421 -195989 -126990 -118681 -150388 -54882 -31805 -16538 20600 -29287 -56882
16351e6882R2369N5252p8309p2236M9992o891r4283M1031J0802M1580m4400O2074
$$ -56882 35487 90739 12430 -59806 -9814 -16705 -110988 -69957 -59155 -17575 -61975 99
16339I9L4547j5371l0601m4867n3510k4083p7302N2270K2105M325M2948M8381
$$ 99 34646 19275 -11326 -56193 -109703 -133786 -211088 -158818 -136713 -132388 -89440 -41059
16327d1059J43168M9744m4912m2074K2307k6729q3422M8500N9587l7281j74511
$$ -41059 102109 151853 106941 64867 87174 60445 -22977 25523 85110 47829 -126682
16316a26682m7486R5051J06347M9240q4198r1826m4640K8634j4273O2904J37683
$$ -126682 -174168 -79117 27230 76470 -7728 -99554 -144194 -115560 -129833 -66929 70754
16305G0754O1373j26999o6783l1314n7322J88P5627k8258k9526R4739P3863l8720
$$ 70754 132127 5128 -61655 -92969 -150291 -150103 -74476 -102734 -132260 -37521 36342 -2378
16293b378O5232J07370K1641o1373k8184j34223j07469K4748M6321J82441m1133
$$ -2378 62854 170224 191865 130492 102308 -31915 -139384 -114636 -68315 114126 72993
16282G2993j03440k8476K8924O91j1739J4086k062L138O192N4292m9468j00208
$$ 72993 -30447 -58923 -29999 -29308 -41047 -26961 -29023 -25885 -19693 34599 -14869 -115077
16270a15077l8767P2289K1144L4694L8904l1681N390r0113j4894Q1909M1053L9505
$$ -115077 -153844 -81555 -60411 -25717 13187 -18494 -13104 -103217 -118111 -36202 4851 44356
16258D4356j2761q11p4298K0q3372l1231J9621l5282m7976M7756J06716n554j03890
$$ 44356 31595 30784 -43514 -43494 -126866 -158097 -138476 -173758 -221734 -173978 -67262 -72816 -176706
16245a76706j3154K3924J21752P1130K7176j7636j1336n6095l3768l4616L834
$$ -176706 -189860 -165936 -44184 26946 54122 36486 25150 -30945 -64713 -99329 -95495
16234i5495Q1231J0822K5270j2643k7772m8596k5996j429J6004o2507J6682J147
$$ -95495 -14264 -3442 21828 9185 -18587 -67183 -93179 -94608 -78604 -141111 -124429 -123282
16222a23282J5309K0133L6665Q495L1777l9445l0100L1484m5342P361k6621L5981
$$ -123282 -107973 -87840 -51175 -42680 -10903 -50348 -80448 -48964 -94306 -86945 -113566 -77585
16210g7585L8528J8668r958P451J7120P807J9171K3589m0178o9871n0478L3656
$$ -77585 -39057 -20389 -30347 -22896 -5776 2031 21202 44791 4613 -65258 -115736 -82080
16198h2080J10691P7076m5123q7426j5946L1481K9387m5547l3213o5717j5261
$$ -82080 28611 105687 60564 -26862 -42808 -11327 18060 -27487 -60700 -126417 -141678
16187a41678J27287J26962l933n5527n9070p6241k3174p907l0789L9685K6083
$$ -141678 -14391 112571 108638 53111 -5959 -82200 -105374 -113281 -144070 -104385 -78302
16176g8302P8507R7382j34394p3184R6431L9518q9940q2337Q451M9186L5049M4275
$$ -78302 205 97587 -36807 -109991 -13560 25958 -63982 -146319 -137868 -88682 -53633 -9358
16164i358P1006k3376l6869L4635P7089M5448m6710j10861o4491J58922M44j02433
$$ -9358 61648 38272 1403 36038 113127 158575 111865 1004 -63487 95435 95879 -6554
16152f554p3557k8009K8089P3736m5622l3721j0232L3689O3514L1704m7397n9823
$$ -6554 -80111 -108120 -80031 -6295 -51917 -85638 -95870 -62181 1333 33037 -14360 -74183
16140g4183m4344p1412J0725N8208L1864M5827J4995M0373N1870K2873L9199j0192
$$ -74183 -118527 -189939 -179214 -121006 -89142 -43315 -28320 12053 63923 86796 125995 115803
16128A15803k2281j8543o1098M7768j2091P2498L4060p7944o5921k6283n6154
$$ 115803 93522 74979 13881 61649 49558 122056 156116 78172 12251 -14032 -70186
16117g0186l5853k408J7016L878k5358l9390q095P7720J60j14697L8144R3134
$$ -70186 -106039 -108447 -91431 -87553 -112911 -152301 -160396 -82676 -82516 -197213 -159069 -65935
16105f5935M8577q409K827P5931P6734j9091q1492k1174O2941N8531N5475q7306
$$ -65935 -17358 -25767 -22940 52991 129725 110634 29142 7968 70909 129440 184915 97609
16093I7609j16525j8522n9303K0685J0214o338q7713l3455K5149J02282j0201
$$ 97609 -18916 -37438 -96741 -76056 -65842 -72180 -159893 -193348 -168199 -65917 -76118
16082g6118m5894j9574j1602Q776L8349N5201N5078j23877o3013n862J31393M937
$$ -76118 -122012 -141586 -153188 -144412 -106063 -50862 4216 -119661 -182674 -188536 -57143 -52206
16070e2206J9252r980Q0053K3972K6785j7096M9572j60311j12224k2681q662o735
$$ -52206 -32954 -42934 37119 61091 87876 70780 120352 -39959 -152183 -174864 -183526 -190261
16058a90261M3367Q1607R1927J19728L6778j21498j16089m4686l1413k4005m2994
$$ -190261 -146894 -65287 26640 146368 183146 61648 -54441 -99127 -130540 -154545 -197539
16047a97539N8393J36401M3918n3617r8494P63M9835Q9554L1173p2226k4957M4038
$$ -197539 -139146 -2745 41173 -12444 -110938 -110175 -60340 29214 60387 -11839 -36796 7242
16035G242K1967N057k3192Q398J703M770O7148P6421r4q07n3219l5805J0842k6048
$$ 7242 29209 34266 11074 19472 21175 25945 93093 169514 169420 168613 115394 79589 90431 64383
16021F4383o0756k4098k5125k049L1185K438j8901L5034L0711K9377j702m8243
$$ 64383 3627 -20471 -45596 -47645 -16460 -14022 -32923 2111 32822 62199 60497 12254
16009A2254l2856O7029l8104K5025K6500R001m7807n3338l5956o8010l4111O9849
$$ 12254 -20602 46427 8323 33348 59848 68849 21042 -32296 -68252 -136262 -170373 -100524
15997a00524J02165m2310J4131K3134L5723j0908k0038k4763n49J8262K7082O0863
$$ -100524 1641 -40669 -26538 -3404 32319 21411 1373 -23390 -23939 -5677 21405 82268
15985H2268p832k6997j4072n8365n8962L3503k4835J9491L0051k1729O951N2136
$$ 82268 74436 47439 33367 -24998 -83960 -50457 -75292 -55801 -25750 -47479 -40528 11608
15973A1608M1546o120l8422m7567K535k5572J8636K0131l6002j4318L8848L7983
$$ 11608 53154 47034 8612 -38955 -36420 -61992 -43356 -23225 -59227 -73545 -34697 3286
15961C286l8894j6917O0160O3245m1373m8766J8904n1038M6709J06605M9378j0228
$$ 3286 -35608 -52525 7635 70880 29507 -19259 -355 -51393 -4684 101921 151299 141071
15949A41071r8301K4452n563m1626k6186k9728M4514R8886n121M2353l042k05
$$ 141071 42770 67222 61659 20033 -6153 -35881 8633 107519 102398 144751 141709 141504
15937A41504q3309m2999n80L0201J7859l0464n0539j4338Q122k8204m3584o2818
$$ 141504 58195 15196 14616 44817 62676 32212 -18327 -32665 -24543 -52747 -96331 -159149
15925a59149J9529L386j1193p86J32113L9128k1830K6487L240q8998p5892L0866
$$ -159149 -139620 -136234 -147427 -148213 -16100 23028 1198 27685 30925 -58073 -133965 -103099
15913a03099j9970P4389M2258q449n1188N666Q4291L6620k9709K7540k6219J6226
$$ -103099 -123069 -48680 -6422 -14871 -66059 -60393 23898 60518 30809 58349 32130 48356
15901D8356P926J6690j7687r5359p3306L7849J30606O3112l6676n3994j7957j6292
$$ 48356 56282 72972 55285 -40074 -113380 -75531 55075 118187 81511 27517 9560 -6732
15889f732r9863o4267R6164J05674J5993J8747J5895j22161L6953O7678j2127
$$ -6732 -106595 -170862 -74698 30976 46969 65716 81611 -40550 -3597 64081 51954
15878E1954j05845N0612q2j9665J02195Q2256L8771j0512k180k3441p7156j26636
$$ 51954 -53891 -3279 -3361 -23026 79169 161425 200196 189684 187504 164063 86907 -39729
15866c9729n116l1819J3916M6174O3029j9472K1609Q273p2500j00563P1330Q1361
$$ -39729 -44845 -76664 -62748 -16574 46455 26983 48592 56865 -15635 -116198 -44868 36493
15854C6493J7542l434q9636q740J6894M0575o7712n912P1586L608K8017R842j8169
$$ 36493 54035 50601 -39035 -47775 -30881 9694 -58018 -63930 7656 11264 39281 49123 30954
15841C0954P86N8319L3153m2853k1849l8556l3012l577l4755M4718O6547J7146
$$ 30954 31740 90059 123212 80359 58510 19954 -13058 -16635 -51390 -6672 59875 77021
15829G7021O8347J4867l5031l6164n4375m3867o8792j1304M6617J03310O2724
$$ 77021 145368 160235 125204 89040 34665 -9202 -77994 -89298 -42681 60629 123353
15818A23353q6765J6126L3016K9678Q513m7910o9864J8573n6973q1740K3209P1658
$$ 123353 36588 52714 85730 115408 123921 76011 6147 24720 -32253 -113993 -90784 -19126
15806a9126P5309l866o2607k4195K9204J9574l4449k7521L501N9630N7968m6029
$$ -19126 56183 52317 -10290 -34485 -5281 14293 -20156 -47677 -44176 15454 73422 27393
15794B7393j729P541k7045k976O2961q764J1370m9169r5872J1280j2227M334N896
$$ 27393 25664 33205 6160 3184 66145 57381 68751 19582 -76290 -65010 -77237 -72903 -67007
15781f7007P2838L996l7504l124P6699j0996j3830m8563N0363M7457J8491m6570
$$ -67007 5831 9827 -27677 -30801 45898 34902 21072 -27491 22872 70329 88820 42250
15769D2250p2925q581j6030M5216J4823P724J2744m778K981j3196n1466N6326
$$ 42250 -30675 -39256 -55286 -10070 4753 12477 25221 20443 23424 10228 -41238 15088
15757A5088l7846j01722m4629M6176O0627M141q4324J16879P3804o2996l2875
$$ 15088 -22758 -124480 -169109 -122933 -62306 -58165 -142489 -25610 48194 -14802 -47677
15746d7677n2385K5047P9648k9209o1820j0970J7103K45N7520L0071N4966N183
$$ -47677 -100062 -75015 4633 -24576 -86396 -97366 -80263 -80018 -22498 7573 62539 67722
15734F7722j4411j16154n6478K7598m3125L2344N0005J8627R9822N5684j1132
$$ 67722 53311 -62843 -119321 -91723 -134848 -102504 -52499 -33872 65950 121634 110502
15723A10502p4970m7728n2474o879L1018K6065l390J1490P2383J2837r3821K1984
$$ 110502 35532 -12196 -64670 -71549 -40531 -14466 -17856 -6366 66017 78854 -14967 7017
15711G017M1505l3239q1144k2034m769m8115K5270O1649j7005l2074J6640N5611
$$ 7017 48522 15283 -65861 -87895 -92664 -140779 -115509 -53860 -70865 -102939 -86299 -30688
15699c0688n193O0543l7616m699Q4140j068r0585j0222Q1808l2554l0612N0003
$$ -30688 -35881 24662 -12954 -17653 66487 65419 -25166 -35388 46420 13866 -16746 33257
15687C3257J8503J1003l9691k8716k6640M301M866m3939r182M0055m269j7078
$$ 33257 51760 62763 23072 -5644 -32284 -27983 -23117 -67056 -76238 -36183 -40452 -57530
15675e7530q5381O11L8112O589P5574M2421L2265l8312P3978P1796q0293k9137
$$ -57530 -142911 -142300 -104188 -97599 -22025 20396 52661 14349 88327 160123 79830 50693
15663E0693m505k4903j1436M473n5877r158M2637n222o320L3857J02689r4501
$$ 50693 46188 21285 9849 14322 -41555 -50713 -8076 -13298 -19618 14239 116928 22427
15651B2427k2986J4136j3743L5627N4249K6341J0765m2791M4283l0033l6828J5489
$$ 22427 -559 13577 -166 35461 89710 116051 126816 84025 128308 98275 61447 76936
15639G6936O669q595n9069o4235l8550o8580L1296M5153M7115Q555l5367L4923
$$ 76936 83605 75010 15941 -48294 -86844 -155424 -124128 -78975 -31860 -23305 -58672 -23749
15627b3749j744l0533M0948J46794l1624j4925p0953P311J9695o0238j25374l3759
$$ -23749 -25493 -56026 -15078 131716 100092 85167 14214 21525 41220 -19018 -144392 -178151
15615a78151L9430N3059J8070J7316K4406R6278p80q176j7413m1379M5076L1026
$$ -178151 -138721 -85662 -67592 -50276 -25870 70408 69628 61452 44039 2660 47736 78762
15603G8762m6022P377r408k7797j5714o8179l2484L044L13L1488N279K9550R4525
$$ 78762 32740 40117 30709 2912 -12802 -80981 -113465 -110421 -110108 -78620 -73341 -43791 50734
15590E0734q838p3179r650L3624M6972p038n4054k6861O303L581o595J4876M3363
$$ 50734 41896 -31283 -40933 -7309 39663 32625 -21429 -48290 -41987 -38406 -45001 -30125 13238
15577A3238k3693M3724N7175L075j32951j3063O3593K8867n8059j3874p4749l2536
$$ 13238 -10455 33269 90444 93519 -39432 -52495 11098 39965 -18094 -31968 -106717 -139253
15565a39253N2978P9126M924m9869p6595O8011M8578N5139n3239M1006O8886l8193
$$ -139253 -86275 -7149 -2225 -52094 -128689 -60678 -12100 43039 -10200 30806 99692 61499
15553F1499J2970o7777o8196l8910M5846q4537l4900P6522O1529k6161K1342j6617
$$ 61499 74469 6692 -61504 -100414 -54568 -139105 -174005 -97483 -35954 -62115 -40773 -57390
15541e7390M2163L7473n7882n1270l8904K7359Q8863J6221o1731o45K2205l2164
$$ -57390 -15227 22246 -35636 -86906 -125810 -98451 -9588 6633 -55098 -55743 -33538 -65702
15529f5702J0898P2060L7499K6505j27760m8970L0890L6253q553m708o5732j13475
$$ -65702 -54804 17256 54755 81260 -46500 -95470 -64580 -28327 -36880 -41588 -107320 -220795
15517b20795O9950j4153O9676J51077p624r736R555m7179o9201P8846K8685p138
$$ -220795 -150845 -164998 -95322 55755 48131 38395 47950 771 -68430 10416 39101 31963
15505C1963q5117m474J04853O6703o6857j26206N485P529j0258L5188N6090K9912
$$ 31963 -53154 -57628 47225 113928 47071 -79135 -73650 -66121 -76379 -41191 14899 44811
15493D4811l5244M788n7337p0318J5152O2887L2824j2586n2568L288m1445Q430
$$ 44811 9567 14355 -42982 -113300 -98148 -35261 -2437 -15023 -67591 -64303 -105748 -97318
15481i7318J12375N4651J2836m3177n6474n0219n9732j0340J21011J06053J8181
$$ -97318 15057 69708 82544 39367 -17107 -67326 -127058 -137398 -16387 89666 107847
15470A07847j5516l6575k8935l9612j2109K634p3686j4023M265M5054O7966N6833
$$ 107847 92331 55756 26821 -12791 -24900 -22266 -95952 -109975 -105710 -60656 7310 64143
15458F4143r387K8460J5239J6315l8144q3611l997O2662m7428p5629N1693M2161
$$ 64143 54756 83216 98455 114770 76626 -6985 -10982 51680 4252 -71377 -19684 22477
15446B2477l4228n4198M0309r5278M612M0484M2128N2570K0114K3033K4840n8899
$$ 22477 -11751 -65949 -25640 -120918 -116306 -75822 -33694 18876 38990 62023 86863 27964
15434B7964p1456L9703M8535n7968m9732n0817J8423L0857N2195J9094j5401j7297
$$ 27964 -43492 -3789 44746 -13222 -62954 -113771 -95348 -64491 -12296 6798 -8603 -25900
15422b5900r561L5393Q882m5356N3027p504M270j8870J1835J4806k654m2372o2432
$$ -25900 -35461 -68 8814 -36542 16485 8981 13251 -5619 6216 21022 18368 -24004 -86436
15409h6436o3151N0121n4056O730J54778P6092K018j4635p9757M3396O859o2970
$$ -86436 -149587 -99466 -153522 -146792 7986 84078 86096 71461 -8296 35100 41959 -21011
15397b1011r2372k9289L5442M9276Q5983L1858K2226k8144K2924K6946m6022m1795
$$ -21011 -113383 -142672 -107230 -57954 28029 59887 82113 53969 76893 103839 57817 16022
15385A6022n2573r8710m8736K4854R2834P6931m1831k9185M3766r8990l5111M0855
$$ 16022 -36551 -135261 -183997 -159143 -66309 10622 -31209 -60394 -16628 -115618 -150729 -109874
15373a09874N6147O2423P1402j6365l1803N847N5334j9806K4350j246J7522n7957
$$ -109874 -53727 8696 80098 63733 31930 37777 93111 73305 97655 96409 113931 55974
15361E5974j08504M8529P0610m3393m4742O0650O7852l5852J7075K6887q4407
$$ 55974 -52530 -4001 66609 23216 -21526 39124 106976 71124 88199 115086 30679
15350C0679r3285K9513J7710p6939Q6476O2956K3875N642o2038p2806k5352J0025
$$ 30679 -62606 -33093 -15383 -92322 -5846 57110 80985 86627 24589 -48217 -73569 -63544
15338f3544Q1483N2123r2017q1831n17M7844J9183K2480l7690o4055J20834O0787
$$ -63544 17939 70062 -21955 -103786 -104303 -56459 -37276 -14796 -52486 -116541 4293 65080
15326F5080k8055K6644K2087K6393K35p2350n7466o1556m6100J7640J24923P5131
$$ 65080 37025 63669 85756 112149 112384 40034 -17432 -78988 -125088 -107448 17475 92606
15314I2606k8729r6790l1717N6436P924M0401N5293p7019M5973J14792m1920p9942
$$ 92606 63877 -32913 -64630 -8194 -270 40131 95424 18405 64378 179170 137250 57308
15302E7308p6193q2417N5760L9479J6950l4642J1430K7067n607O0322n1651p4942
$$ 57308 -18885 -101302 -45542 -6063 10887 -23755 -12325 14742 9135 69457 17806 -57136
15290e7136Q3016k7252m7180J4215O284O563J1324n1194J745J10256K1047Q762
$$ -57136 25880 -1372 -48552 -34337 -28053 -21490 -10166 -61360 -59615 50641 71688 80450
15278H0450J4030o7746M2062J41354O6299j48433j25316j8863L058p3166l905
$$ 80450 94480 26734 68796 210150 276449 128016 2700 -16163 -13105 -86271 -90176
15267i0176L141j8107J9289m468j2538J24495R6737l0972p609o5132j02481Q2862
$$ -90176 -87035 -105142 -85853 -90321 -102859 21636 118373 87401 79792 14660 -87821 -4959
15255d959K3526P2937M5584n6765n5450j0508K0551k469O8745O0697n750j10755
$$ -4959 18567 91504 137088 80323 24873 14365 34916 32447 101192 161889 156139 45384
15243D5384n2119l9853M7156R3882o3250l4753J395J12109j4402j33866p0354
$$ 45384 -6735 -46588 568 94450 31200 -3553 -2158 109951 95549 -38317 -108671
15232a08671J9333J34796K6001o5354R163K8612m9775M0782k6980j17287L8974
$$ -108671 -89338 45458 71459 6105 15268 43880 -5895 34887 7907 -109380 -70406
15221g0406P8292j4788M6155M4529l7707j0582j0635K5722n1922p5710M0972Q9655
$$ -70406 7886 -6902 39253 83782 46075 35493 24858 50580 -1342 -77052 -36080 53575
15209E3575j01319m5591j860L5717p5786M3918N5027q7347k1045M034R8342r125
$$ 53575 -47744 -93335 -95195 -59478 -135264 -91346 -36319 -123666 -144711 -140677 -42335 -51460
15197e1460L6615j0259k4251P5421Q4122J5089q0282l5576l6155m1794n0617M6583
$$ -51460 -14845 -25104 -49355 26066 110188 125277 44995 9419 -26736 -68530 -119147 -72564
15185g2564P9803K3639k4500K1794M3245J6241p8059l9701L9647R009M5517o9690
$$ -72564 7239 30878 6378 28172 71417 87658 9599 -30102 9545 18554 64071 -5619
15173e619j02638R806Q2045Q5474O7090l171r9564m6202Q861l9565l5637M0392
$$ -5619 -108257 -98451 -16406 69068 136158 132987 33423 -12779 -3918 -43483 -79120 -38728
15161c8728N7167n4863K5772R2478k6556n2264r1892l4810M7702n2853p532P8404
$$ -38728 18439 -36424 -10652 81826 55270 3006 -88886 -123696 -75994 -128847 -136379 -57975
15149e7975P4057R3007o3202n8853r104N6912l7521o4253R212K5275K7927o3558
$$ -57975 16082 109089 45887 -12966 -22070 34842 -2679 -66932 -57720 -32445 -4518 -68076
15137f8076l1407K8964Q034R7543M1155o5849k4808L6506K991K3694J1476l6963
$$ -68076 -99483 -70519 -62485 35058 76213 10364 -14444 22062 25053 48747 60223 23260
15125B3260m9291l1606O3723N824m2341N2047k5218p9947O8655L4017q3644p9861
$$ 23260 -26031 -57637 6086 11910 -30431 21616 -3602 -83549 -14894 19123 -64521 -144382
15113a44382r8490L1808P6800N0313K8824o7063O1141K9005n4692k472J40765
$$ -144382 -242872 -211064 -134264 -83951 -55127 -122190 -61049 -32044 -86736 -89208 51557
15102E1557K6952m6925o472O1881L074l7592l9850J8096O0579k7915n4018j9246
$$ 51557 78509 31584 25112 86993 90067 52475 12625 30721 91300 63385 9367 -9879
15090i879O7547M0052P158q8631r2056N984L9131O6870M7772N693j6990m1811
$$ -9879 57668 97720 104878 16247 -75809 -69825 -30694 36176 83948 89641 72651 30840
15078C0840l7922j29921L749j0906P6509N0473k6282P0883M5350J6255q0746l028
$$ 30840 -7082 -137003 -133254 -144160 -67651 -17178 -43460 27423 72773 89028 8282 5254
15066E254o12K6271L5915J01227n2017n6630L408L1242k6977r0084R5511n9141
$$ 5254 4642 30913 66828 168055 116038 59408 62816 94058 67081 -23003 72508 13367
15054A3367j12535K4905L286J06424O1780N8590J3275J8481n1498j17024m6366
$$ 13367 -99168 -74263 -70977 35447 97227 155817 169092 187573 136075 19051 -27315
15043b7315k2553L5225n660o536j003K5296j7686n0509L2087L8859l1675k0977
$$ -27315 -49868 -14643 -20303 -26839 -27842 -2546 -20232 -70741 -38654 205 -31470 -52447
15031e2447m0240k1691J4818Q5867L1851o7101P8691L1436L787L741m8163L9543
$$ -52447 -92687 -114378 -99560 -13693 18158 -48943 29748 61184 64971 68712 20549 60092
15019F0092k213m0954m3164Q814P519J4914O3521M1515l4939o5540o4791L2775
$$ 60092 57879 16925 -26239 -17425 -9906 5008 68529 110044 75105 9565 -55226 -22451
15007b2451m1373j6351L5805j442J5141J18558l6619j5407j0274n4016L5587L920
$$ -22451 -63824 -80175 -44370 -45812 -30671 87887 51268 35861 25587 -28429 7158 11078
14995A1078p5750n5727L8627L4168L9095J2297P282l6550k7908P3407p4243P333
$$ 11078 -64672 -120399 -81772 -47604 -8509 3788 11070 -25480 -53388 20019 -54224 -46891
14983d6891O0626l4784N704K2288K7497Q251m2846n3483n0465R0003R1554j8226
$$ -46891 13735 -21049 -15345 6943 34440 42691 -155 -53638 -104103 -14100 77454 59228
14971E9228n6833p8733r37r937K0144K0319k276k5192N2752L3384J14106R0287
$$ 59228 2395 -76338 -77275 -87212 -67068 -46749 -49025 -74217 -21465 11919 126025 216312
14959B16312n0957j2381j35320j27891M3712J6343L6079J7031M8947J0501l4218
$$ 216312 165355 152974 17654 -110237 -66525 -50182 -14103 2928 51875 62376 28158
14948B8158j4586q103J24030K1428j05429J5096p172p5991q7842L7667L0399j995
$$ 28158 13572 5469 129499 150927 45498 60594 53422 -22569 -110411 -72744 -42345 -44340
14936d4340L0883K5483M0300q7077M2075K8502j9724k7007J8876r565j2449k8040
$$ -44340 -13457 12026 52326 -34751 7324 35826 16102 -10905 7971 -1594 -14043 -42083
14924d2083M3191L1693k9660l02j6115j860p66P7694Q8775o8189j28356J8480
$$ -42083 1108 32801 3141 2839 -13276 -15136 -15902 61792 150567 82378 -45978 -27498
14912b7498L71l6661j5017K528K3039o4359k1200j8914Q744J04535R3899j4844
$$ -27498 -27127 -63788 -78805 -76277 -53238 -117597 -138797 -157711 -148967 -44432 49467 34623
14900C4623M8285m649m010J6685q120l5622l9238J3960k3576j0113Q4419p5819
$$ 34623 82908 78259 74249 90934 82814 47192 7954 21914 -1662 -11775 72644 -3175
14888c175J2232L9290O8131n8510r6570j8992J5327p6034Q0764N0066j3082L341
$$ -3175 9057 48347 116478 57968 -38602 -57594 -42267 -118301 -37537 12529 -553 2788
14876B788j01886K5790L9573o385l4281L6984O4449N8144L4780O09l5321l3196
$$ 2788 -99098 -73308 -33735 -40120 -74401 -37417 27032 85176 119956 120565 85244 52048
14864E2048J3063L6270N5420N155p3515p502o7491q8763j0915M5563l7654l4314
$$ 52048 65111 101381 156801 161956 88441 80939 13448 -75315 -86230 -40667 -78321 -112635
14852a12635L9892K3905J8349l1775M4393l0963l8880O730J06008p7575n706M5231
$$ -112635 -72743 -48838 -30489 -62264 -17871 -48834 -87714 -80984 25024 -52551 -58257 -13026
14840a3026k8580K5474L8136O8844j3834K0868J7551o489k9882K4936O2589K6647
$$ -13026 -41606 -16132 22004 90848 77014 97882 115433 108944 79062 103998 166587 193234
14828A93234p8037r6876n4087L4128R7087m578k5393O962j3620r0209o1456J6974
$$ 193234 115197 18321 -35766 -1638 95449 90871 65478 72440 58820 -31389 -92845 -75871
14816g5871J5631R3822P6886l6243j9077J2189n0059l0432M3101l6341J7748J0751
$$ -75871 -60240 33582 110468 74225 55148 67337 17278 -13154 29947 -6394 11354 22105
14804B2105K8402r127j5432l8387l2932n3964n7334J8213L9562N4579P7391k5269
$$ 22105 50507 41380 25948 -12439 -45371 -99335 -156669 -138456 -98894 -44315 33076 7807
14792G807j4099J0528L3094L2581o817o3100m2768M3835p8350N669N9158l5644
$$ 7807 -6292 4236 37330 69911 63094 -6 -42774 1061 -77289 -71620 -12462 -48106
14780d8106m1743M5897M1474O7019j06384o2518o2142k1278j4977K693J02783
$$ -48106 -89849 -43952 -2478 64541 -41843 -104361 -166503 -187781 -202758 -200065 -97282
14769i7282N8705L6327l0601k1788J3154O8067k5042K3337K5128n6704l8460j1018
$$ -97282 -38577 -2250 -32851 -54639 -41485 26582 1540 24877 50005 -6699 -45159 -56177
14757e6177l0712j1004n2736Q1090N8048k411J785R938n3516N3821N6460N812
$$ -56177 -86889 -97893 -150629 -69539 -11491 -13902 -12117 -2179 -55695 -1874 54586 60398
14745F0398N1m5592p87M1955m609j4085l9912j4596k3827K1927O3045k6824j33616
$$ 60398 60449 14857 14070 56025 51416 37331 -2581 -17177 -41004 -19077 43968 17144 -116472
14732a16472J3250J6095J4944J03882J4982m8501m8867J3728J2522J1784O5687
$$ -116472 -103222 -87127 -72183 31699 46681 -1820 -50687 -36959 -24437 -12653 53034
14721E3034m9545m2807j7773P2566O7216k6111o0223M5452P4477k9728j27137
$$ 53034 3489 -39318 -57091 15475 82691 56580 -3643 41809 116286 86558 -40579
14710d0579j7976J763l0961L5474o0631l1992L0679O1197K9115o1471J2603K0621
$$ -40579 -58555 -56792 -87753 -52279 -112910 -144902 -114223 -53026 -23911 -85382 -72779 -52158
14698e2158N8467k9596k9588j4020J1336L9375M7464p3342n0118k7031j2172N9338
$$ -52158 6309 -23287 -52875 -66895 -55559 -16184 31280 -42062 -92180 -119211 -131383 -72045
14686g2045J7352P069L9252Q893k1955m9371P1866P0719j9076q6753K8832k8897
$$ -72045 -54693 -47624 -8372 521 -21434 -70805 1061 71780 52704 -34049 -5217 -34114
14674c4114k552L3622N6570L9216j5931q9500k7811j1826k1395L6066k0754J1284
$$ -34114 -36666 -3044 53526 92742 76811 -12689 -40500 -52326 -73721 -37655 -58409 -47125
14662d7125J14193R1375m8189q3045m3296n3818o391K9517k5326j5580l3832l5793
$$ -47125 67068 158443 110254 27209 -16087 -69905 -76296 -46779 -72105 -87685 -121517 -157310
14650a57310M8591M9635k9190P1521R1888j8397q2136k4008K9102M5995M6288
$$ -157310 -108719 -59084 -88274 -16753 75135 56738 -25398 -49406 -20304 25691 71979
14639G1979j9111n0962q698j1275J867M6934J2563m923k3803j01082l663j5461
$$ 71979 52868 1906 -6792 -18067 -16200 30734 43297 38374 14571 -86511 -90174 -105635
14627a05635j8371M1298K6474k1231l0229k3896n23R9957P9662P3122j03637j52971
$$ -105635 -124006 -82708 -56234 -77465 -107694 -131590 -132113 -32156 47506 120628 16991 -135980
14615a35980k0269K7749J00184K7601K9596j2840o1853k1928J2547j2159j8888
$$ -135980 -156249 -128500 -28316 -715 28881 16041 -45812 -67740 -55193 -67352 -86240
14604h6240K314J7536O1010P0242n5467J7319o5772m5261K0769O6678J9583J7086
$$ -86240 -83926 -66390 -5380 64862 9395 26714 -39058 -84319 -63550 3128 22711 39797
14592C9797O5355O7551j12689l4772L878m4293j0530j7080k0082k6610M5286J15676
$$ 39797 105152 172703 60014 25242 29120 -15173 -25703 -42783 -62865 -89475 -44189 71487
14580G1487O3942j8089l5728l6881o6323L0615p1004L3248n4315J3628n2127o3427
$$ 71487 135429 117340 81612 44731 -21592 9023 -61981 -28733 -83048 -69420 -121547 -184974
14568a84974O9917J619J2273P432M2514Q6765L9075k2455o4831l067k1648q1458
$$ -184974 -115057 -113438 -101165 -93733 -51219 35546 74621 52166 -12665 -15732 -37380 -118838
14556a18838l955N4841l3820K7063N8761M6065j09431n0263M377L2057K6875L8620
$$ -118838 -122793 -67952 -101772 -74709 -15948 30117 -79314 -129577 -125200 -93143 -66268 -27648
14544b7648r329J6985M8430k888j6620p1369k2379j6312m5394n378L2614P9082
$$ -27648 -36977 -19992 28438 25550 8930 -62439 -84818 -101130 -146524 -151902 -119288 -40206
14532d0206R805q5787K0327K3805J3015N44J8717l8194m7374N75Q6375K3214n1197
$$ -40206 -30401 -116188 -95861 -72056 -59041 -58497 -39780 -77974 -125348 -124773 -38398 -15184 -66381
14519f6381k4627P1696K4201j6612J5981P5655J04465J3687l7633n7742m0493
$$ -66381 -91008 -19312 4889 -11723 4258 79913 184378 198065 160432 102690 62197
14508F2197p7118o5924n8995J4376O3575l0207q325K4114j194K6957K5999l9965
$$ 62197 -14921 -80845 -139840 -125464 -61889 -92096 -100421 -76307 -77501 -50544 -24545 -64510
14496f4510l106j5712q886R7692l6027r3930n9336K904J0562Q373J22909P0202
$$ -64510 -67616 -83328 -92214 5478 -30549 -124479 -183815 -180911 -170349 -161976 -39067 31135
14484C1135K2424o763K9127j9356K3291K6513m9686o5765l0547p3613r49O1382
$$ 31135 53559 46796 75923 56567 79858 106371 56685 -9080 -39627 -113240 -114189 -52807
14472e2807O7393J14135l4716p0637p4684Q6124L9100j5731M822l2208k2306l5478
$$ -52807 14586 128721 94005 23368 -51316 34808 73908 58177 62999 30791 8485 -26993
14460b6993r5448o3721L9716K0570N3990O4769J4686L8084p0974n3324J3611R7297
$$ -26993 -122441 -186162 -146446 -125876 -71886 -7117 7569 45653 -25321 -78645 -65034 32263
14448C2263j8980k7453K0188n832K3703J738n4266n7924J5402p8680m6311L4021
$$ 32263 13283 -14170 6018 186 23889 25627 -28639 -86563 -71161 -149841 -196152 -162131
14436a62131J37370Q0742n354K892O2773j98m2338q3107r8875m4509J1969M2942
$$ -162131 -24761 55981 50627 53519 116292 116094 73756 -9351 -108226 -152735 -140766 -97824
14424i7824j949N2050O2901l3067n2362n8023P5118R2489L1732p0800p8514J4050
$$ -97824 -99773 -47723 15178 -17889 -70251 -128274 -53156 39333 71065 265 -78249 -64199
14412f4199Q5731J52m168J9864P5252K2869p7831K5947r5337M6338M6518J1646
$$ -64199 21532 21684 17516 37380 112632 135501 57670 83617 -11720 34618 81136 92782
14400I2782N8020n2077j30840K3630l2039n1825j9331L4135P1421N2250j4757
$$ 92782 150802 98725 -32115 -8485 -40524 -92349 -111680 -77545 -6124 46126 31369
14389C1369N326J1123M726p2486L2571n308N282l7336j6627n7358R184M9551P1419
$$ 31369 36695 47818 52544 -19942 12629 7321 12603 -24733 -41360 -98718 -89534 -39983 31436
14376C1436J714Q1357J3634l6676l1573r4060J8432J05201J02012K7497m7042
$$ 31436 33150 114507 128141 91465 59892 -34168 -15736 89465 191477 218974 171932
14365A71932j19522n9767k7642p1139l043O9907n1356K650p0006j0536P4108J57874
$$ 171932 52410 -7357 -34999 -106138 -109181 -39274 -90630 -87980 -157986 -168522 -94414 63460
14353F3460R6537K9488J6505j5491p8741r3535p7884K8669R7763L8581j17667
$$ 63460 159997 189485 205990 190499 111758 18223 -59661 -30992 66771 105352 -12315
14342a2315N2346K4519o0152J701j9390J9865L9700J957j056m489P054l1420m1484
$$ -12315 40031 64550 4398 6099 -13291 6574 46274 48231 47175 42686 49740 18320 -23164
14329b3164q3348O4768n7944k9865J11327L3651p2032r1162J9153J01326k2822
$$ -23164 -106512 -41744 -99688 -129553 -18226 15425 -56607 -147769 -128616 -27290 -50112
14318e0112l7714O4837Q4396J1246m7481p065n1574K6396K1852L8287J2189l4126
$$ -50112 -87826 -22989 61407 72653 25172 18107 -33467 -7071 14781 53068 65257 31131
14306C1131J6774Q0694l3677j14710m3299L9545n9492n9864J22256Q0939N189
$$ 31131 47905 128599 94922 -19788 -63087 -23542 -83034 -142898 -20642 60297 65486
14295F5486R4690l7974p1739q541K3193M7532J5918M26J7844n4861r1133l6592
$$ 65486 160176 122202 50463 41922 65115 112647 128565 128991 146835 91974 841 -35751
14283c5751K9993P9484l3682q7218m8495M6500L7443p8116l8039L0780m1214L2217
$$ -35751 -5758 73726 40044 -47174 -95669 -49169 -11726 -89842 -127881 -97101 -138315 -106098
14271a06098M1343K1873J2374l5924p2480q1302K8573J06742j6404j25253L4726
$$ -106098 -64755 -42882 -30508 -66432 -138912 -220214 -191641 -84899 -101303 -226556 -191830
14260a91830J47715K0499j6551K5393n4524K5997M9219M4022k8081n7677J5660
$$ -191830 -44115 -23616 -40167 -14774 -69298 -43301 5918 49940 21859 -35818 -20158
14249b0158O0642J6266ql4121l6540J6149L3566p4049k5551m9846K5795L9392
$$ -20158 40484 56750 56742 22621 -13919 2230 35796 -38253 -63804 -113650 -87855 -48463
14237d8463p0523o2858N8740K5775R3474o8693o5449K0634Q9710K2109J014M3082
$$ -48463 -118986 -181844 -123104 -97329 -3855 -72548 -137997 -117363 -27653 -5544 -4530 38552
14225C8552n4141j01900K0967P4087M0377m2321K4050R0543O5430m0061m4901
$$ 38552 -15589 -117489 -96522 -22435 17942 -24379 -329 90214 155644 115583 70682
14214G0682j7525R2051Q61q71J6233l3259N2416o3189r0577r7910m0338K6110
$$ 70682 53157 145208 146069 145198 161431 128172 180588 117399 26822 -71088 -111426 -85316
14202h5316O9200K4277K8060j0641l0804n6941q802N4762K1762M4368j672r118
$$ -85316 -16116 8161 36221 25580 -5224 -62165 -70967 -16205 5557 49925 48253 39135
14190C9135q7352J3340K2171L7609J1018k4743o579l4952P8012P744l5265r86
$$ 39135 -48217 -34877 -12706 24903 35921 11178 4599 -30353 47659 55403 20138 19152
14178A9152J1749k8275K4953Q3876o1700p9382k4659k3782j2401P891J6713m083
$$ 19152 30901 2626 27579 111455 49755 -29627 -54286 -78068 -90469 -82578 -65865 -69948
14166f9948O3915Q94L2697n252o1062k7974n5214J3824Q1653j9359j1654R3177
$$ -69948 -6033 -5139 27558 22306 -38756 -66730 -121944 -108120 -26467 -45826 -57480 35697
14154C5697P3375k7864k6391J1197n0678p1070m979M5840N6674M9321J4831j5510
$$ 35697 109072 81208 54817 66014 15336 -55734 -60713 -14873 41801 91122 105953 90443
14142I0443j1059o774o4760l2468K6452L6755L7992m2496n4373K9888L5107l3324
$$ 90443 79384 72610 7850 -24618 1834 38589 76581 34085 -20288 9600 44707 11383
14130A1383P6441M6195J9732M4504l1084m3423j0890k3543j23364Q055l5673L5070
$$ 11383 87824 134019 153751 198255 167171 123748 112858 89315 -34049 -25994 -61667 -26597
14118b6597J25305R235N83k3717N3480K6183p6330j00531O5783L9425r5429m2886
$$ -26597 98708 107943 108526 84809 138289 164472 88142 -12389 53394 92819 -2610 -45496
14106d5496J0481r705j5401m885r297o5696m6754P6934Q2918J8986O4526N3498
$$ -45496 -35015 -44720 -60121 -65006 -74303 -139999 -186753 -109819 -26901 -7915 56611 110109
14094A10109Q197J6018j1098j2162q0166P112N5260Q554j18974q7078N3683L2663
$$ 110109 118306 134324 123226 111064 30898 38010 93270 101824 -17150 -104228 -50545 -17882
14082a7882j6285l422N1204J1867q0671o226M06j9664O6247M1419N437m151r7694
$$ -17882 -34167 -37589 13615 25482 -55189 -61415 -61009 -80673 -14426 26993 32430 28279 -69415
14069f9415L4273K0077m0329M2126M9850m1550l0216l0009k2455P6911K1674k7231
$$ -69415 -35142 -15065 -55394 -13268 36582 -4968 -35184 -65193 -87648 -10737 10937 -16294
14057a6294N7982O2839R621L0020j07045o7472K8967J46663N0322j996o8527j15346
$$ -16294 41688 104527 114148 144168 37123 -30349 -1382 145281 195603 193607 125080 9734
14045I734o2190k7882j1453j6964L4364Q1269K9352K3227L0287j1234n8963k9581
$$ 9734 -52456 -80338 -91791 -108755 -74391 6878 36230 59457 89744 78510 19547 -10034
14033a0034l8833q159N3070J1564j6398j1934k8206K8993j12146j10456K6077
$$ -10034 -48867 -57026 -3956 7608 -8790 -20724 -48930 -19937 -132083 -242539 -216462
14022b16462J10436O6457k6944O6559N1850p954K6622k5825k6491m3937l8256
$$ -216462 -106026 -39569 -66513 46 51896 43942 70564 44739 18248 -25689 -63945
14011f3945l0577r007L6377J8798P5836K2912p6396n4768k6387N0462K5114m0051
$$ -63945 -94522 -103529 -67152 -48354 27482 50394 -26002 -80770 -107157 -56695 -31581 -71632
13999g1632j4173N3965P2750q2744p196n5474k1971J02327J19537o6339q6205
$$ -71632 -85805 -31840 40910 -41834 -49030 -104504 -126475 -24148 95389 29050 -57155
13988e7155L8803k41k8866M3976k9533m3565P3342N7268K2140L6939M8511R863
$$ -57155 -18352 -18593 -47459 -3483 -33016 -76581 -3239 54029 76169 113108 161619 171482
13976A71482j28875n5465J13352N2410n9124n7324j0478J1230K833L6174N0819
$$ 171482 42607 -12858 100494 152904 93780 36456 25978 37208 40041 76215 127034
13965A27034j2131k4390k0668l9479J1355J1275o0084K3158P3514j8641M032o9625
$$ 127034 114903 90513 69845 30366 41721 52996 -7088 16070 89584 70943 74975 5350
13953E350j13387k9228m8083L694R4040J9129L6100l5353k1456O1293J18102O7645
$$ 5350 -108037 -137265 -185348 -181654 -87614 -68485 -32385 -67738 -89194 -27901 90201 157846
13941A57846j8977n1204p9117J1215q759N1978K4346j24890m5035O8908j9207
$$ 157846 138869 87665 8548 19763 11004 62982 87328 -37562 -82597 -13689 -32896
13930c2896n2123m5010m726K9383M5404j6042L1281O975N5048j3967N4763l9928
$$ -32896 -85019 -130029 -134755 -105372 -59968 -76010 -44729 -37754 17294 3327 58090 18162
13918A8162j06009m9145K4169m5434L4433l1078Q135L9303K5734Q32p268M1618
$$ 18162 -87847 -136992 -112823 -158257 -123824 -154902 -146767 -107464 -81730 -80898 -88166 -46548
13906d6548J5295l6657J03514K515j23179J9139K8203j7673l9629O7760j8921
$$ -46548 -31253 -67910 35604 38119 -85060 -65921 -37718 -55391 -95020 -27260 -46181
13895d6181j6463n5656k9448K8580P5716O8066J2761j5764p6919M1441M4150r9551
$$ -46181 -62644 -118300 -147748 -119168 -43452 24614 37375 21611 -55308 -13867 30283 -69268
13883f9268o8707R4589O4092m9940m1906j9243J2214J3563j5232j4993Q7396J0331
$$ -69268 -137975 -43386 20706 -29234 -71140 -90383 -78169 -64606 -79838 -94831 -7435 2896
13871B896K4023k4189o912J4537L7043m4320J2094m4048J351l2085M0924k4688
$$ 2896 26919 2730 -4182 10355 47398 3078 15172 -28876 -27525 -59610 -18686 -43374
13859d3374M1997K1692j1231j9337N7659J02675O1042j8313n7859n8369r7539
$$ -43374 -1377 20315 9084 -10253 47406 150081 211123 192810 134951 76582 -20957
13848b0957n2171k671J8540l1435L3036j3399Q99J9956j1570r125O4237R9248
$$ -20957 -73128 -75799 -57259 -88694 -55658 -69057 -68158 -48202 -59772 -68897 -4660 94588
13836I4588j4421l9123p9809L8198n753K4957K5946r7318m4380J4356Q0782j6783
$$ 94588 80167 41044 -38765 -567 -6320 18637 44583 -52735 -97115 -82759 -1977 -18760
13824a8760j03354R4315K0921p320M5928P3249M8632j6548j45677k9288l3699
$$ -18760 -122114 -27799 -6878 -14198 31730 104979 153611 137063 -8614 -37902 -71601
13813g1601M925O6307k8385k0627N1660J3999K0647k3611J8192L5533o4474p9335
$$ -71601 -66676 -369 -28754 -49381 2279 16278 36925 13314 31506 67039 2565 -76770
13801g6770j0401L9756Q3264l105m0391J9773L2898l4464K4463J0073M0073m7680
$$ -76770 -87171 -47415 35849 32744 -7647 12126 45024 10560 35023 45096 85169 37489
13789C7489j0260m115o1263p823L8210M882L8141N2100n2750O384J0503j5310
$$ 37489 27229 23114 -38149 -45972 -7762 -2880 35261 87361 34611 40995 51498 36188
13777C6188r894p4136q7204J4051N4396N0821Q5489L7883j755o4254J7993j0969
$$ 36188 26294 -47842 -135046 -120995 -66599 -15778 69711 107594 105839 41585 59578 48609
13765D8609K4585J7204l9785r0032K8202L324j14590o299Q2925O5274p0780L9181
$$ 48609 73194 90398 50613 -39419 -11217 -7893 -122483 -128782 -45857 19417 -51363 -12182
13753a2182p6102m8273L9931J9368J19274N9821j5403j3357n7152O149l8008p0360
$$ -12182 -88284 -136557 -96626 -77258 42016 101837 86434 73077 15925 22074 -15934 -86294
13741h6294L667J51247N3298l5002l8864j862Q915o424o8720m1696N0218m1688
$$ -86294 -82627 68620 121918 86916 48052 46190 55105 48681 -20039 -61735 -11517 -53205
13729e3205n5893K3418K7311K6058O026M6960l6597l242M1554r029L9871M8184
$$ -53205 -109098 -85680 -58369 -32311 -26285 20675 -15922 -19164 22390 13361 53232 101416
13717A01416n9632k5352J7373p6755j03646j7502P831J8219R3839Q4495k5599
$$ 101416 41784 16432 33805 -42950 -146596 -164098 -156267 -138048 -44209 40286 14687
13706A4687L07K2464K3435j9014L680m2978n8415j6345K6632L1012K0294n0941
$$ 14687 14994 37458 60893 41879 45559 2581 -55834 -72179 -45547 -14535 5759 -45182
13694d5182K3660M801J5554m583n195m7799p624k5392M690j1861L6864M808k0244
$$ -45182 -21522 -16721 -1167 -5750 -10945 -58744 -66368 -91760 -87070 -98931 -62067 -57259 -77503
13681g7503J6742P5512L7359N9519k7280m8364O825J208K1973q488r922J8127
$$ -77503 -60761 14751 52110 111629 84349 35985 42810 44018 65991 57503 47581 65708
13669F5708j986l1725K218O1302r988j09259p108M5878Q9114O8216R391M7814
$$ 65708 63722 31997 34215 95517 85529 -23730 -30838 15040 104154 172370 181761 229575
13657B29575q5701j8676j1477o8344l5420L4622L0984l6188M0702K8345j9208
$$ 229575 143874 125198 113721 45377 9957 44579 75563 39375 80077 108422 89214
13646H9214l747l4216p278J31191p040n5551J049n2454o9664J7395q5350N0067
$$ 89214 85467 51251 43973 175164 168124 112573 113622 61168 -8496 8899 -76451 -26384
13634b6384K1824l6285j9589j8811Q0912N0530J4829L4253p5033k4775M578l8267
$$ -26384 -4560 -40845 -60434 -79245 1667 52197 67026 101279 26246 1471 6049 -32218
13622c2218l089K4687j7481N8241j3028m736m5290o117P5963J35836p2237l4332
$$ -32218 -35307 -10620 -28101 30140 17112 12376 -32914 -39031 36932 172768 100531 66199
13610F6199K7319m1106n1467n8300j7808j6623p498J2253L2959K1353p804L3075
$$ 66199 93518 52412 945 -57355 -75163 -91786 -99284 -87031 -54072 -32719 -40523 -7448
13598g448n2115j9695O7622P1394J1059M8326k7311k6474L603J7704p4211m4704
$$ -7448 -59563 -79258 -11636 59758 70817 119143 91832 65358 68961 86665 12454 -32250
13586c2250R3678O7434o60r1330k5561L5026q7822P1076R8792q7781r5519N1936
$$ -32250 61428 128862 128202 36872 11311 46337 -41485 29591 128383 40602 -54917 -2981
13574b981J9314k4672M6801j9825j9626j5571Q1860K7385j4342k1632n4883j08601
$$ -2981 16333 -8339 38462 18637 -989 -16560 65300 92685 78343 56711 1828 -106773
13562a06773O6454M8225k312k5192k6317K1899n1140n9505l7263J06397O5976
$$ -106773 -40319 7906 5594 -19598 -45915 -24016 -75156 -134661 -171924 -65527 449
13551D49k7396l6555M0703M4174m8850M575p1832R23Q1856M7855l6859M8827J14060
$$ 449 -26947 -63502 -22799 21375 -27475 -22900 -94732 -93809 -11953 35902 -957 47870 161930
13538A61930L0446n6981j06019j14470l2324J2234M6305Q251q0979L2999M741
$$ 161930 192376 135395 29376 -85094 -117418 -105184 -58879 -50628 -131607 -98608 -93867
13527i3867J4264N1422k7543L6927R10j8221l2445R8960o3631l2561J2662o1314
$$ -93867 -79603 -28181 -55724 -18797 -17887 -36108 -68553 30407 -33224 -65785 -53123 -114437
13515a14437N887l121p288m769O3995L4131m9643j3073O1542N4304K0558l9097
$$ -114437 -108550 -111671 -118959 -123728 -59733 -25602 -75245 -88318 -26776 27528 48086 8989
13503H989m8671o729q299P086M8033M3550p586p6271l87K4020j9430N5717J5725
$$ 8989 -39682 -46411 -54710 -47624 409 43959 36373 -39898 -40285 -16265 -35695 20022 35747
13490C5747r4562r4811K0968M9320J0967K002J11144q8882l7753J3556J2429k1152
$$ 35747 -58815 -153626 -132658 -83338 -72371 -70369 40775 -48107 -85860 -72304 -59875 -81027
13478h1027p043m176J6341o4492Q4506K1813K7031O8799o436J9673l322R85q9039
$$ -81027 -88070 -92246 -75905 -140397 -55891 -34078 -7047 61752 55316 74989 71667 72652 -16387
13465a6387m6177k2561J7597j1738l548R7117P915r866K3186k0666n4423K8781
$$ -16387 -62564 -85125 -67528 -79266 -82814 14303 22218 12352 35538 14872 -39551 -10770
13453a0770O8672K7262L7101k471r8413o1596N4639k1m0129j6942j0246l183j902
$$ -10770 57902 85164 122265 119794 21381 -40215 14424 14403 -25726 -42668 -52914 -56097 -57999
13440e7999Q3197m7957N1010k9939m6873N3851k7393l1024O7284j1544K4745N6527
$$ -57999 25198 -22759 28251 -1688 -48561 5290 -22103 -53127 14157 2613 27358 83885
13428H3885K1155j997m0114J2676M4402o5089r4684R4785J5755p022n2342J8768
$$ 83885 105040 103043 62929 75605 120007 54918 -39766 55019 70774 63752 11410 30178
13416C0178R796M0053q188Q302j0673k0045j239o0266O6945L2653j14808J2472
$$ 30178 39974 80027 71839 80141 69468 49423 48184 -12082 54863 87516 -27292 -14820
13404a4820l0098O38j4522K1728l4154O7980R0024p3225j07563J4611Q6620j4169
$$ -14820 -44918 -44280 -58802 -37074 -71228 -3248 86776 13551 -94012 -79401 7219 -6950
13392f950R1090N60k4938m9445l1928k6254r041l523k6538M0717k3729l0090K137
$$ -6950 84140 84700 59762 10317 -21611 -47865 -56906 -60429 -86967 -46250 -69979 -100069 -97932
13379i7932L4395l8740Q5700N6616J5161n2718o5076k819K2062k7911J18426L9340
$$ -97932 -63537 -102277 -16577 40039 55200 2482 -62594 -65413 -43351 -71262 47164 86504
13367H6504n4268n4153P7171O9086r5418K3315p0429q91K1685n2945J7533k3775
$$ 86504 32236 -21917 55254 124340 28922 52237 -18192 -19083 2602 -50343 -32810 -56585
13355e6585M3373M003n1752Q952J2577J8615M3320K6402J06978n221p5798O0423
$$ -56585 -13212 -9209 -60961 -52009 -39432 -20817 22503 48905 155883 150662 74864 135287
13343A35287M2804j08169p6002j6035N1740R9097J236m6925j14879M8686M962
$$ 135287 178091 69922 -6080 -22115 29625 128722 129958 83033 -31846 16840 21802
13332B1802M110l7321l7730k721J23786J5087q8343j6429O2689K2447l3262n758
$$ 21802 25912 -11409 -49139 -51860 71926 87013 -1330 -17759 44930 67377 34115 28357
13320B8357m3304p434j6254M3879L6448j3715j6536l7473J1424n5913l9329L1180
$$ 28357 -14947 -22381 -38635 5244 41692 27977 11441 -26032 -14608 -70521 -109850 -78670
13308g8670J29397j6593j1531m6880r926J8673J384o7247k6789K0563M1533M6467
$$ -78670 50727 34134 22603 -24277 -34203 -15530 -14146 -81393 -108182 -87619 -46086 381
13296C81j633k5497L8105M7620l8004m3791K5143k1975l6310P8594K659j08150
$$ 381 -1252 -26749 11356 58976 20972 -22819 2324 -19651 -55961 22633 25292 -82858
13284h2858o838l154O7151o1576j0403K9195m0292K7931J05879p378j23569n1764
$$ -82858 -89696 -92850 -25699 -87275 -97678 -68483 -108775 -80844 25035 17657 -105912 -157676
13272a57676O3120L0457J3358K0763M6913M9052l68k6741O9768l4599o1246k3652
$$ -157676 -94556 -64099 -50741 -29978 16935 65987 65619 38878 108646 74047 12801 -10851
13260a0851k0978Q35k3925M062K6043L4243k7109L680P8900M9948j32453k7094
$$ -10851 -31829 -30994 -54919 -50857 -24814 9429 -17680 -14000 64900 114848 -17605 -44699
13248d4699M7752K4207o4317k7337o6563j30472K5630J17842M9742j1711q078
$$ -44699 3053 27260 -37057 -64394 -130957 -261429 -235799 -117957 -68215 -79926 -88004
13237h8004K1928Q884n320k2029N8099j4149O406k7163J495R0416M940l4723l4015
$$ -88004 -66076 -57192 -62512 -84541 -26442 -40591 -34185 -61348 -59853 30563 35503 780 -33235
13224c3235L1753O2862j4779k4684j7389m350j1627l281R702k1361R682J8637
$$ -33235 -1482 61380 46601 21917 4528 178 -11449 -14730 -5028 -26389 -16707 1930
13212A930l1331K948N0551l671M6061n4099m1876J7522k3638N691N4733O7691
$$ 1930 -29401 -26453 24098 20427 66488 12389 -29487 -11965 -35603 -29912 24821 92512
13200I2512K7309l2859q3995p862n0086R754N2784N9242p000m664l5581L457j0725
$$ 92512 119821 86962 2967 -4895 -54981 -45227 7557 66799 59799 55135 19554 23011 12286
13187A2286j0637M7044p650m7583K6627P7754L8553j36923j04704k817o600Q307
$$ 12286 1649 48693 41043 -6540 20087 97841 136394 -529 -105233 -108050 -114650 -106343
13175a06343M2011M2588J774o0736K1314O283O3739J4746j1419k1264n5704p7494
$$ -106343 -64332 -21744 -19970 -80706 -59392 -53109 10630 25376 13957 -7307 -63011 -140505
13163a40505L5729M3943L6497k5564O7027R2601q263o6964n2501n8973L9353N0878
$$ -140505 -104776 -60833 -24336 -49900 17127 109728 101465 34501 -18000 -76973 -37620 13258
13151A3258N2572k9828n356N0353j5243L073q3871q4590m1416O472Q1604K6765
$$ 13258 65830 36002 30646 80999 65756 68829 -15042 -99632 -141048 -134576 -52972 -26207
13139b6207k3618l450N8358M3097l8020R574m4541j7030q068O8594J1542j9162
$$ -26207 -49825 -53275 5083 48180 10160 19734 -24807 -41837 -49905 18689 30231 11069
13127A1069j1641N030N7905L1683J5030l0432j17061n707R7056M6883m4567r0339
$$ 11069 -572 4458 62363 94046 109076 78644 -38417 -44124 52932 99815 55248 -35091
13115c5091p1096M5174K6439K8412p8791j3775K0591n1651L7896P7083K3304l1674
$$ -35091 -106187 -61013 -34574 -6162 -84953 -98728 -78137 -129788 -91892 -14809 8495 -23179
13103b3179Q6156j7351l8092K5833k9393l3797O9092N8645k063j9552m1430n6165
$$ -23179 62977 45626 7534 33367 3974 -29823 39269 97914 95851 76299 34869 -21296
13091b1296l2692O1389L3352r1579J2214J4824q4969o6303P2893M1527P4166L5187
$$ -21296 -53988 7401 40753 -50826 -38612 -23788 -108757 -175060 -102167 -60640 13526 48713
13079D8713O752r642k876j9218r9686J2562J9435m7173O0222Q9093l667l4299
$$ 48713 55465 45823 42947 23729 -75957 -63395 -43960 -91133 -30911 58182 54515 20216
13067B0216K05J636O73N4008j7051k5770k3298N0366j72r878j2781L8821o8885
$$ 20216 20421 22057 22730 76738 59687 33917 10619 60985 60813 50935 38154 76975 8090
13054H090n3209k7152Q5919L511N0408K4627J8377r0679m9141L8933j8683k1130
$$ 8090 -45119 -72271 13648 17159 67567 92194 110571 19892 -29249 9684 -8999 -30129
13042c0129K5272n2836k3894R2016J6766j6339J8270n735m2998K3796l1669Q912
$$ -30129 -4857 -57693 -81587 10429 27195 10856 29126 23391 -19607 4189 -27480 -18568
13030a8568m3073k2975O1018L4357p747n0417L7612K1095n093r744r621N1952
$$ -18568 -61641 -84616 -23598 10759 3012 -47405 -9793 11302 6209 -3535 -13156 38796
13018C8796n0824l5407R5594j5996N4710L7662n1410q6772N2195M985k5661j2856
$$ 38796 -12028 -47435 48159 32163 86873 124535 73125 -13647 38548 43533 17872 5016
13006E016R2122m2960r8180j0940J5302m0809l4361N359J9064j8851n8305L6009
$$ 5016 97138 54178 -44002 -54942 -39640 -80449 -114810 -109451 -90387 -109238 -167543 -131534
12994a31534L9802P2850K0681j4397K7808Q049p4652K013K9747P3101K0520P538
$$ -131534 -91732 -18882 1799 -12598 15210 23259 -51393 -49380 -19633 53468 73988 81526
12982H1526j1502L2691m7047r9453M0420J05315N0635M3627L580p8805j24467
$$ 81526 70024 102715 55668 -43785 -3365 101950 152585 196212 199792 120987 -3480
12971c480j3486n0936M6187K7727l3659N960J0244m3461j2694N2416L2568l0932
$$ -3480 -16966 -67902 -21715 6012 -27647 -21687 -11443 -54904 -67598 -15182 17386 -13546
12959a3546k5164q587j2792N0274K527O9353N1446k8242J4064l4708p6772j0835
$$ -13546 -38710 -47297 -60089 -9815 -7288 62065 113511 85269 99333 64625 -12147 -22982
12947b2982J11954M0900j2340j32643j0281k8075J5939P917k0533K9166O037j6330
$$ -22982 88972 129872 117532 -15111 -25392 -53467 -37528 -29611 -50144 -20978 -14941 -31271
12935c1271L1657M9706k8539l0350q391N2286l1318P802o5660p1995J06822Q4719
$$ -31271 386 50092 21553 -8797 -17188 35098 3780 11582 -54078 -126073 -19251 65468
12923F5468M4275J5649k8116q3362m060R296o2502j5273m8614R3310q052m4921
$$ 65468 109743 125392 97276 13914 9854 19150 -43352 -58625 -107239 -13929 -21981 -66902
12911f6902M7236J7037j17M675L3969l6954N1284J1820o8281j2269p0772n8147
$$ -66902 -19666 -2629 -2746 1929 35898 -1056 50228 62048 -6233 -18502 -89274 -147421
12899a47421O2994M4735L913j699p2661M5659K7552Q041k0501K6463r6101L6932
$$ -147421 -84427 -39692 -35779 -37478 -110139 -64480 -36928 -28887 -49388 -22925 -119026 -82094
12887h2094L0187M1050r302J5905k490k1340m2910J6513J7664O4407K8071L2250
$$ -82094 -51907 -10857 -20159 -4254 -6744 -28084 -70994 -54481 -36817 27590 55661 87911
12875H7911l7535J9844N2403k1164n5180p7215J459N8320J7739n8619p6136n8616
$$ 87911 50376 70220 122623 101459 46279 -30936 -29477 28843 46582 -12037 -88173 -146789
12863a46789o0468m1247J13419J48232K0863K6720l7185K760l414q694L6624k313
$$ -146789 -207257 -248504 -135085 13147 34010 60730 23545 26305 22891 14197 50821 48508
12851D8508o0161Q342k0296l6789k2260Q1901J56505J883q2274o1065q5488M5097
$$ 48508 -11653 -3311 -23607 -60396 -82656 -755 155750 157633 75359 14294 -71194 -26097
12839b6097K7244m4309m3695O305M0406J1747K85R888n3069m2046j2804j4694
$$ -26097 1147 -43162 -86857 -80552 -40146 -28399 -28114 -18226 -71295 -113341 -126145 -140839
12827a40839l2081J17201J08048R7726l6812K391l0298p4901j9226P0691J3171
$$ -140839 -172920 -55719 52329 150055 113243 115634 85336 10435 -8791 61900 75071
12816G5071o1004r4029N9340O3622q3066J0846k2173O6031N1596n910k9385O5937
$$ 75071 14067 -79962 -20622 43000 -40066 -29220 -51393 14638 66234 60324 30939 96876
12804I6876l5403p1084O2374k5736l0537J8154q5303J4200k1657j2199N3934O9776
$$ 96876 61473 -9611 52763 27027 -3510 14644 -70659 -56459 -78116 -90315 -36381 33395
12792C3395l2219o3287m2619M5627N0791L845O5135K9720o5811o3095j3920R8181
$$ 33395 1176 -62111 -104730 -59103 -8312 -4467 60668 90388 24577 -38518 -52438 45743
12780D5743j7502k1312Q8996O6060k0808l0343j7781k7526J0735L6009l4753o6830
$$ 45743 28241 6929 95925 161985 141177 110834 93053 65527 76262 112271 77518 10688
12768A0688J9568j10510l9955J5605N6328J4904k9711P423J09236J00736j05764
$$ 10688 30256 -80254 -120209 -104604 -48276 -33372 -63083 -55660 53576 154312 48548
12757D8548j07136Q4535N1648o3997L9057j0005K1001n6470j4862K5846o2688
$$ 48548 -58588 25947 77595 13598 52655 42650 63651 7181 -7681 18165 -44523
12746d4523L2634R2107l1475k0434n8877k6169L7669n7498N950J8392L0040j7529
$$ -44523 -11889 80218 48743 28309 -30568 -56737 -19068 -76566 -70616 -52224 -22184 -39713
12734c9713k6829k415q33N4979j7017j529k8786l8114k4434l6419j5953j0050
$$ -39713 -66542 -68957 -69790 -14811 -31828 -33357 -62143 -100257 -124691 -161110 -177063 -187113
$$ [...]
##END NTUPLES=NMR SPECTRUM
##END=
