##TITLE=Analysis number 325792
Compound Code cc 50226
Book Reference 464/88/2
Project Code adrs
Chemist Name chrisr
##JCAMPDX= 6.0         $$ Bruker NMR JCAMP-DX V2.0
##DATA TYPE= NMR SPECTRUM
##DATA CLASS= NTUPLES
##ORIGIN= Bruker BioSpin GmbH
##OWNER= nmr
$$ XWIN-NMR		Version 3.5
$$ Mon Jan 15 11:15:47 2007 GMT Standard Time (UT+0h)  MAYBRIDGE\nmr@NMR_250MHZ
##.OBSERVE FREQUENCY= 250.131544655141
##.OBSERVE NUCLEUS= ^1H
##.ACQUISITION MODE= SIMULTANEOUS (DQD)
##.ACQUISITION SCHEME= undefined
##.AVERAGES= 16
##.DIGITISER RES= 18
##SPECTROMETER/DATA SYSTEM= dpx250
##.PULSE SEQUENCE= zg30
##.SOLVENT NAME= CDCl3
##.SHIFT REFERENCE= (INTERNAL, CDCl3, 0, 16.4448)
##AUDIT TRAIL= $$ (NUMBER, WHEN, WHO, WHERE, WHAT)
$$ ##TITLE= Audit trail, XWIN-NMR		Version 3.5
$$ ##JCAMPDX= 5.01
$$ ##ORIGIN= Bruker BioSpin GmbH
$$ ##OWNER= nmr
$$ C:\u/data/dgb/nmr/ADRS/1030/pdata/1/auditp.txt
$$ ##AUDIT TRAIL=  $$ (NUMBER, WHEN, WHO, WHERE, WHAT)
(   1,<2007-01-15 11:15:24.64 +000>,<MAYBRIDGE\nmr>,<NMR_250MHZ>,
      <created by zg, POWCHK disabled, PULCHK disabled
       configuration hash MD5:
       49 4B E0 1D 92 C2 6B 37 9F E6 65 BC 52 41 86 1D
       data hash MD5: 64K
       34 30 08 7E BD 51 E1 7B 03 FE 6E 4B 33 A6 9B 8A>)
(   2,<2007-01-15 11:15:37.93 +000>,<MAYBRIDGE\nmr>,<NMR_250MHZ>,
      <Start of raw data processing
       ef LB = 0.3 FT_mod = 6 PKNL = 1 SI = 32K 
       data hash MD5: 32K
       77 8A E2 60 C1 D1 E2 CB B0 7F C2 C6 72 0B 4E 99>)
(   3,<2007-01-15 11:15:39.54 +000>,<MAYBRIDGE\nmr>,<NMR_250MHZ>,
      <apk 
       data hash MD5: 32K
       AD 89 9F D3 5D 1C AB 37 55 4F 7B A6 8B 37 3E 74>)
(   4,<2007-01-15 11:15:40.23 +000>,<MAYBRIDGE\nmr>,<NMR_250MHZ>,
      <abs ABSG = 5 
       data hash MD5: 32K
       15 38 49 97 CD 0A 2B 7E DF BF A7 5D 04 1B AC 0F>)
$$ ##END=
$$ 
$$ hash MD5
$$ 6F ED 8C 2B 49 33 B7 3F EC 79 69 E8 E4 43 26 F8
##$RELAX= 
##$RELAX= 
##$RELAX= 
##$RELAX= 
##$RELAX= 
##$RELAX= 
##$RELAX= 
$$ Bruker specific parameters
$$ --------------------------
##$DU= <C:\u>
##$EXPNO= 1030
##$NAME= <ADRS>
##$PROCNO= 1
##$TYPE= <nmr>
##$USER= <dgb>
##$AMP= (0..31)
100 100 100 100 100 100 100 100 100 100 100 100 100 100 100 100 100 100 
100 100 100 100 100 100 100 100 100 100 100 100 100 100 
##$AQSEQ= 0
##$AQ_mod= 3
##$AUNM= <au_zg>
##$AUTOPOS= <19 >
##$BF1= 250.13
##$BF2= 250.13
##$BF3= 250.13
##$BF4= 250.13
##$BF5= 500.13
##$BF6= 500.13
##$BF7= 500.13
##$BF8= 500.13
##$BYTORDA= 1
##$CFDGTYP= 0
##$CFRGTYP= 5
##$CHEMSTR= <none>
##$CNST= (0..31)
1 1 145 1 1 1 1 1 1 1 1 1 1 1 1 1 1 1 1 1 1 1 1 1 1 1 1 1 1 1 1 1 
##$CPDPRG= <>
##$CPDPRG1= <>
##$CPDPRG2= <>
##$CPDPRG3= <>
##$CPDPRG4= <mlev>
##$CPDPRG5= <mlev>
##$CPDPRG6= <mlev>
##$CPDPRG7= <mlev>
##$CPDPRG8= <mlev>
##$CPDPRGB= <>
##$CPDPRGT= <>
##$D= (0..31)
0 1 0 0 0 0 0 0 0 0.06 0 0 0 0 0 0 0.0002 0 0 0 0 0 0 0 0 0 0 0 0 0 0 
0 
##$DATE= 1168859723
##$DBL= (0..7)
120 120 120 120 120 120 120 120 
##$DBP= (0..7)
150 150 150 150 150 150 150 150 
##$DBP07= 0
##$DBPNAM0= <>
##$DBPNAM1= <>
$$ [...]
##$SUBNAM7= <"">
##$SUBNAM8= <"">
##$SUBNAM9= <"">
##$SW= 20.6930455092707
##$SWIBOX= (0..15)
0 0 3 0 0 0 0 0 0 0 0 0 0 0 0 0 
##$SW_h= 5175.983436853
##$TD= 65536
##$TD0= 1
##$TE= 294.16
##$TE2= 300
##$TE3= 300
##$TEG= 300
##$TL= (0..7)
0 120 120 120 120 120 120 120 
##$TP= (0..7)
150 150 150 150 150 150 150 150 
##$TP07= 0
##$TPNAME0= <>
##$TPNAME1= <>
##$TPNAME2= <>
##$TPNAME3= <>
##$TPNAME4= <>
##$TPNAME5= <>
##$TPNAME6= <>
##$TPNAME7= <>
##$TPOAL= (0..7)
0.5 0.5 0.5 0.5 0.5 0.5 0.5 0.5 
##$TPOFFS= (0..7)
0 0 0 0 0 0 0 0 
##$TUNHIN= 0
##$TUNHOUT= 0
##$TUNXOUT= 0
##$USERA1= <user>
##$USERA2= <user>
##$USERA3= <user>
##$USERA4= <user>
##$USERA5= <user>
##$V9= 5
##$VALIST= <valist>
##$VCLIST= <CCCCCCCCCCCCCCC>
##$VD= 0
##$VDLIST= <DDDDDDDDDDDDDDD>
##$VPLIST= <PPPPPPPPPPPPPPP>
##$VTLIST= <TTTTTTTTTTTTTTT>
##$WBST= 1024
##$WBSW= 4
##$XGAIN= (0..3)
0 0 0 0 
##$XL= 0
##$YL= 0
##$YMAX_a= 323245
##$YMIN_a= -392150
##$ZGOPTNS= <>
##$ZL1= 120
##$ZL2= 120
##$ZL3= 120
##$ZL4= 120
##$ABSF1= 16.44482
##$ABSF2= -4.248352
##$ABSG= 5
##$ABSL= 3
##$ALPHA= 0
##$AQORDER= 0
##$ASSFAC= 0
##$ASSFACI= 0
##$ASSFACX= 0
##$ASSWID= 0
##$AUNMP= <proc_1d>
##$AZFE= 0.1
##$AZFW= 0.1
##$BCFW= 0
##$BC_mod= 0
##$BYTORDP= 0
##$COROFFS= 0
##$CY= 12.5
##$DATMOD= 1
##$DC= 0
##$DFILT= <>
##$DTYPP= 0
##$F1P= 14.0000005364418
##$F2P= -0.99999901652339
##$FCOR= 0.5
##$FTSIZE= 32768
##$FT_mod= 6
##$GAMMA= 0
##$GB= 0
##$INTBC= 1
##$INTSCL= 1
##$ISEN= 128
##$LB= 0.3
##$LEV0= 0
##$LPBIN= 0
##$MAXI= 10000
##$MC2= 0
##$MEAN= 0
##$ME_mod= 0
##$MI= 0
##$NCOEF= 0
##$NC_proc= -5
##$NLEV= 6
##$NOISF1= 0
##$NOISF2= 0
##$NSP= 0
##$NTH_PI= 0
##$NZP= 0
##$OFFSET= 16.44482
##$PC= 1
##$PHC0= 231.8111
##$PHC1= 0.4193628
##$PH_mod= 1
##$PKNL= yes
##$PPARMOD= 0
##$PSCAL= 4
##$PSIGN= 0
##$REVERSE= no
##$SF= 250.130019303369
##$SI= 32768
##$SIGF1= 0
##$SIGF2= 0
##$SINO= 400
##$SIOLD= 32768
##$SREGLST= <1H.CDCl3>
##$SSB= 0
##$STSI= 32768
##$STSR= 0
##$SW_p= 5175.98343685301
##$SYMM= 0
##$S_DEV= 0
##$TDeff= 65536
##$TDoff= 0
##$TI= <Analysis number 999999
Compound Code 99
Book Reference 9
Project Code 9>
##$TILT= no
##$TM1= 0
##$TM2= 0
##$TOPLEV= 0
##$USERP1= <user>
##$USERP2= <user>
##$USERP3= <user>
##$USERP4= <user>
##$USERP5= <user>
##$WDW= 1
##$XDIM= 32768
##$YMAX_p= 333506648
##$YMIN_p= -681532
$$ End of Bruker specific parameters
$$ ---------------------------------
##NTUPLES= NMR SPECTRUM
##VAR_NAME=  FREQUENCY,     SPECTRUM/REAL,   SPECTRUM/IMAG
##SYMBOL=    X,             R,               I
##VAR_TYPE=  INDEPENDENT,   DEPENDENT,       DEPENDENT
##VAR_FORM=  AFFN,          ASDF,            ASDF
##VAR_DIM=   32768,         32768,           32768
##UNITS=     HZ,            ARBITRARY UNITS, ARBITRARY UNITS
##FACTOR=    0.157963299565203, 1,           1
##FIRST=     4113.34324510615, 0,            0
##LAST=      -1062.64019174686, 0,           0
##MIN=       -1062.64019174686, -681532,     0
##MAX=       4113.34324510615, 333506648,    0
$$ Real data points
##PAGE= N=1
##DATA TABLE= (X++(R..R)), XYDATA
$$ [...]
22779B10086q4581n4250p1637j2731M5474J0858l384J46764o3895r3218j56627
$$ 210086 125505 71255 -382 -13113 32361 43219 39835 186599 122704 29486 -127141
22768a27141j13221m4653J02304J04462l3366p0453q0272l2465K3457J98548Q9813
$$ -127141 -240362 -285015 -182711 -78249 -111615 -182068 -262340 -294805 -271348 -72800 17013
22757A7013l5566n6673k6522L2713P9292R393N3366R426m2002O4124M2763P723
$$ 17013 -18553 -75226 -101748 -69035 10257 19650 73016 82442 40440 104564 147327 155050
22745A55050k6322o5194o4478N0223J58690o4289j77846O7847P618p0886o341
$$ 155050 128728 63534 -944 49279 207969 143680 -34166 33681 41299 -29587 -35928
22734c5928L0538J55603L1844j9142m2511k8303j30413j04818j4278J40772J31378
$$ -35928 -5390 150213 182057 162915 120404 92101 -38312 -143130 -157408 -16636 114742
22723A14742J2825n1846o9372O0003j17477k7774M9208N3899l0969j16014l5513
$$ 114742 127567 75721 6349 66352 -51125 -78899 -29691 24208 -6761 -122775 -158288
22712a58288o7205M4784P9127Q50P3086K9589k1943J03717O8772p4022J9755L6999
$$ -158288 -225493 -180709 -101582 -100732 -27646 1943 -20000 83717 152489 78467 98222 135221
22700A35221r9238j4385l0080P648O4707l672j90240m4193R2584P3527P9028m0930
$$ 135221 35983 21598 -8482 -834 63873 60201 -130039 -174232 -81648 -8121 70907 29977
22688B9977q7696j21329l9828R146J2079J4986l1253P6906K8906k7934j05279
$$ 29977 -57719 -179048 -218876 -209730 -197651 -182665 -213918 -137012 -108106 -136040 -241319
22677b41319J5344l663K01404K17170r9691l2786M5965J11166L02j61406q0844
$$ -241319 -225975 -229638 -28234 188936 89245 56459 102424 213590 213892 52486 -28358
22666b8358J6093m2234J0932j999j41250J46222J34305j07967J099J4095O2848
$$ -28358 -12265 -54499 -43567 -45566 -186816 -40594 93711 -14256 -13157 938 63786
22655F3786p2399M9977J5682o1516o5715o099J24752N1033o7614q1223k4806P1292
$$ 63786 -8613 41364 57046 -4470 -70185 -76284 48468 99501 31887 -49336 -74142 -2850
22643b850p5651J25032L1232j00672j27164j13262J47552N4406M586O4115q545
$$ -2850 -78501 46531 77763 -22909 -150073 -263335 -115783 -61377 -56791 7324 -1221
22632a221j19707Q655k5952N3829p147m3709l5466K9150k589m1388Q9684J11690
$$ -1221 -120928 -112273 -138225 -84396 -91543 -135252 -170718 -141568 -144157 -185545 -95861 15829
22620A5829M6354j59665j35726k4695n473K13349K28876L3904m2007R5108r0427
$$ 15829 62183 -97482 -233208 -257903 -263376 -50027 178849 212753 170746 265854 175427
22609A75427q4015j85918k5182L2703J27478M4742l4619n6609j39843r5015J30372
$$ 175427 91412 -94506 -119688 -86985 40493 85235 50616 -5993 -145836 -240851 -110479
22598a10479J64752j22594l4160L5081J89913K9405k3697l8408k2510J35280J4952
$$ -110479 54273 -68321 -102481 -67400 122513 151918 128221 89813 67303 202583 217535
22587B17535j45774j38127K6986J1772R580J38237m0955j1515j04476Q1466J32413
$$ 217535 71761 -66366 -39380 -27608 -18028 120209 79254 67739 -36737 44729 177142
22576A77142O082j89419q2682j10542n6347M9281R4048N4423j7541m8638J06093
$$ 177142 183224 -6195 -88877 -199419 -255766 -206485 -112437 -58014 -75555 -124193 -18100
22565a8100J43560p401j20915j05781j0713K6523O0856K1037o2464n5507o8270
$$ -18100 125460 118059 -2856 -108637 -119350 -92827 -31971 -10934 -73398 -128905 -197175
22554a97175m059J43489O6638k0576N7095M9209p7530j07097m4125J44589M5068
$$ -197175 -201234 -57745 8893 -11683 45412 94621 17091 -90006 -134131 10458 55526
22543E5526l9050q9820M6134J41863L7228K821p4526o6409q6333N0547J04573
$$ 55526 16476 -73344 -27210 114653 151881 154702 80176 13767 -72566 -22019 82554
22532H2554m381k5189R8106J867p4934k2069j0217M3448j47572j5766Q3130j46972
$$ 82554 78173 52984 151090 152957 78023 55954 45737 89185 -58387 -74153 8977 -137995
22520a37995j5900L8667P2588N0574j4858l0400l6655P802j3404m7838J26167
$$ -137995 -153895 -115228 -42640 7934 -6924 -37324 -73979 -66177 -79581 -127419 -1252
22509a252J8495M2246L4118j37767q715L3850L3162m6248l1445j67561L9219K6995
$$ -1252 17243 59489 93607 -44160 -52875 -19025 14137 -32111 -63556 -231117 -191898 -164903
22497a64903L5644J79036L5814p7937Q9627l1421l5621J3334m7367P5269J61438
$$ -164903 -129259 49777 85591 7654 97281 65860 30239 43573 -3794 71475 232913
22486B32913k7655o8594m3675m2206j13144N1020M3436L3526q1872P8862j15085
$$ 232913 205258 136664 92989 50783 -62361 -11341 32095 65621 -16251 62611 -52474
22475e2474K3376N9288o9411N3864J2296n5133k1848k8273n5233j80620Q0077
$$ -52474 -29098 30190 -39221 14643 26939 -28194 -50042 -78315 -133548 -314168 -234091
22464b34091R9405N0697L1460L2036J94339j8577K1701P422o3798j78018M9316
$$ -234091 -134686 -83989 -52529 -20493 173846 155269 176970 184392 120594 -57424 -8108
22453h108J62498J19278j71717j37105j21390p408j6057j4995P8525K0128J1483
$$ -8108 154390 273668 101951 -35154 -156544 -163952 -180009 -195004 -116479 -96351 -84868
22442h4868m8567j38400j24912R9513R7929M5704R1224R6283j1572N9195K3031
$$ -84868 -133435 -271835 -396747 -297234 -199305 -153601 -62377 33906 22334 81529 104560
22431A04560k3142j3527j84608M9286O5172j16669n274j486R738J8400R0091N9167
$$ 104560 81418 67891 -116717 -67431 -2259 -118928 -124202 -125688 -115950 -97550 -7459 51708
22419E1708k5603q139L2499n8607N4334n9788q1503k6229M7365j2424P1979R4485
$$ 51708 26105 17966 50465 -8142 46192 -13596 -95099 -121328 -73963 -86387 -14408 80077
22407H0077k08058m6334r8029o5414J56671R0110N9463P4602k1936k27287p2329
$$ 80077 -127981 -174315 -272344 -337758 -181087 -90977 -31514 43088 21152 -206135 -278464
22396b78464l8267R5070K07086r0487j3409J46255O581m3450j1307q445j8033
$$ -278464 -316731 -221661 -14575 -105062 -118471 27784 34365 -9085 -20392 -28837 -46870
22385d6870p7623O3419R1935j1203r0876J73m4687O1915p6855l761L6932p6125
$$ -46870 -124493 -61074 30861 19658 -71218 -71045 -115732 -53817 -130672 -134433 -97501 -173626
22373a73626l4761J29688L9073J0873J32230j9487j00672J6605n1312j68769R5240
$$ -173626 -208387 -78699 -39626 -28753 103477 83990 -16682 -77 -51389 -220158 -124918
22362a24918Q7687j31069J8363L7802P2881J31718L903j36080n081j9258m5877
$$ -124918 -37231 -168300 -149937 -112135 -39254 92464 96367 -39713 -44794 -64052 -109929
22351a09929j2485Q8792m1352p809j17769l5418J9111J02070M2497J31352J31952
$$ -109929 -122414 -33622 -74974 -82783 -200552 -235970 -216859 -114789 -72292 59060 191012
22340A91012q9787L1000O5269m960o5920q4443M1372J6879j46101j7310K07350
$$ 191012 101225 132225 197494 192534 126614 42171 83543 100422 -45679 -62989 144361
22329A44361J09453J01927j59521j50097j36943j04475Q7078J39769M9208q060
$$ 144361 253814 355741 196220 46123 -90820 -195295 -108217 31552 80760 72700
22319G2700o1077n1964L1279L017j20925J26569O5606j4045O1811k837k1884P3643
$$ 72700 11623 -40341 -9062 -6045 -126970 -401 65205 51160 112971 110134 88250 161893
22307A61893j01399j91740j36365N4271J7634J01901J30965Q2980o0464m9946
$$ 161893 60494 -131246 -267611 -213340 -195706 -93805 37160 120140 59676 9730
22297I730N675m7557Q754M3119J3820n0148l902k9933J08246J72405K5297p9064
$$ 9730 15405 -32152 -23398 19721 33541 -16607 -20509 -50442 57804 230209 255506 176442
22285A76442j6801m7980r6764n7548r6595J2849J38513K25631Q4982q9776j38439
$$ 176442 159641 111661 14897 -42651 -139246 -126397 12116 237747 322729 232953 94514
22274I4514m9066l2995o6508m2006P354J2381P7080L582k2674M3532Q75J44365
$$ 94514 45448 12453 -54055 -96061 -88707 -76326 754 4336 -18338 25194 26069 170434
22262A70434J00743p9739k62238n0152r0007q9127N9479j5230Q6910J09770P8117
$$ 170434 271177 191438 -70800 -120952 -210959 -300086 -240607 -255837 -168927 -59157 18960
22251A8960O1485J33360P3432l2527j56899m3063l4987j1585n5539j57312j7522
$$ 18960 80445 213805 287237 254710 97811 54748 19761 8176 -47363 -204675 -222197
22240b22197J72084j367L1032O4890J07047m4382l1427j36722q1221P5472J9118
$$ -222197 -50113 -51480 -20448 44442 151489 107107 75680 -61042 -142263 -66791 -47673
22229d7673J40606j8347m4199M0172k3474r4462J9730k1285o0942J0264j28925
$$ -47673 92933 74586 30387 70559 47085 -47377 -27647 -48932 -109874 -99610 -228535
22218b28535k9497Q9183Q3615K5209P704L1510n8388L0647R815k5859o8579j4063
$$ -228535 -258032 -168849 -85234 -60025 -52321 -20811 -79199 -48552 -38737 -64596 -133175 -147238
22206a47238K7985M1411Q1105l4821j09664N208M5349p5094Q5971J01703l292
$$ -147238 -119253 -77842 3263 -31558 -141222 -136014 -90665 -165759 -79788 21915 18623
22195A8623o7063j63924J25080K16349Q830j04905l689j88244j35075o1158J49709
$$ 18623 -48440 -212364 -87284 129065 137895 32990 29301 -158943 -294018 -355176 -205467
22184b05467K38995m7105o7481K5360j730N2808j23354K1529L1600J08199j8701
$$ -205467 33528 -13577 -81058 -55698 -57428 -4620 -127974 -106445 -74845 33354 14653
22173A4653k001n0093n3925J23168O343j26691M7656O0341j0984j22447o2635
$$ 14653 12652 -37441 -91366 31802 38145 -88546 -40890 19451 8467 -113980 -176615
22162a76615J88135L3442l000n149K1864J09446Q9762j23380r7056l9077P1181
$$ -176615 11520 44962 41962 36813 58677 168123 257885 134505 37449 -1628 69553
22151F9553n1674q6641P9764J00451M5523R8027p5835k06417n2602m3758j2125
$$ 69553 17879 -68762 11002 111453 156976 255003 179168 -27249 -79851 -123609 -135734
22140a35734J20159l0169N4128j14878k1371P7594L6844o4456j34317k1416K127
$$ -135734 -15575 -45744 8384 -106494 -127865 -50271 -13427 -77883 -212200 -233616 -231489
22129b31489K65037j5689j27231J32736J30665J25332j15176j35578m9594m7092
$$ -231489 33548 17859 -109372 23364 154029 279361 164185 28607 -20987 -68079
22119f8079M4680J22454p318K7704L9594q2861q2692J10162J19577m3377q1049
$$ -68079 -23399 99055 91737 119441 159035 76174 -6518 103644 223221 179844 98795
22108I8795j10326j27763K930J22854J50607r4366k3715J88802J89306k8467p2049
$$ 98795 -11531 -139294 -136364 -13510 137097 42731 19016 207818 397124 368657 296608
22097B96608K2946q2161j44872M3183P8095j34037o3066j9112J16817O7871o4402
$$ 296608 319554 237393 92521 135704 213799 79762 16696 -2416 114401 182272 117870
22086A17870p5003m9062r3623J15644L0690J6362l0712k46155r4898J75874J73030
$$ 117870 42867 -6195 -99818 15826 46516 62878 32166 -213989 -308887 -133013 40017
22075D0017L143j2749L0411k0695L5200j0286r5217j486O1382M879n5415J718
$$ 40017 43160 30411 60822 40127 75327 65041 -30176 -31662 29720 34599 -20816 -19098
22063a9098Q5539L5668l7131O1548J9279l1794n2166j61977p5402j1595N7573
$$ -19098 66441 102109 64978 126526 145805 114011 61845 -100132 -175534 -187129 -129556
22052a29556p5781k9040k8723J10147R5413J38921o5754l7377m663q1479J4065
$$ -129556 -205337 -234377 -263100 -152953 -57540 81381 15627 -21750 -26413 -107892 -93827
22041i3827M3152Q8933l7378r9612k0591o2946n195M179J75482p4250r2038J13742
$$ -93827 -50675 38258 880 -98732 -119323 -182269 -187464 -183285 -7803 -82053 -174091 -60349
22029f0349J07074J45370q2703j62165m3385m6217N878l8938o333n727O5958K26360
$$ -60349 46725 192095 109392 -52773 -96158 -142375 -136497 -175435 -181768 -187495 -121537 104823
22017A04823J14427m9495k600J4397j87231j67032K6906J62651M8308n3286j15959
$$ 104823 219250 169755 167155 181552 -5679 -172711 -145805 16846 65154 11868 -104091
22006a04091j5931J05615m7844p9279J34049R0467j00521K0960j1495j16533j2635
$$ -104091 -120022 -14407 -62251 -141530 -7481 82986 -17535 3425 -8070 -124603 -137238
21995a37238j53524j6736J22856K67027L775o6423o3035M6363k9227q7825N5161
$$ -137238 -290762 -307498 -184642 82385 86160 19737 -43298 3065 -26162 -113987 -58826
21984e8826K2107r810j4860Q5683K5229q8242l5482K649N5585l4752R6713L6299
$$ -58826 -36719 -46529 -61389 24294 49523 -38719 -74201 -71552 -15967 -50719 45994 82293
21972H2293j9312M3249k5657r2612j02717k6061J8733J27547K9221N5024j02354
$$ 82293 62981 106230 80573 -12039 -114756 -140817 -122084 5463 34684 89708 -12646
21961a2646n2122o737j02850Q2397L5778j3268l4571J4347k5802N693K27446p281
$$ -12646 -64768 -71505 -174355 -91958 -56180 -69448 -104019 -89672 -115474 -109781 117665 110384
21949A10384o5977j06373j4638J27641J27745J03820P8454j10653k06515r4052
$$ 110384 44407 -61966 -76604 51037 178782 282602 361056 250403 43888 -50164
21939e0164n2645r8166N1128K8029J6940P7913J08486l4381o1403o8536J10804
$$ -50164 -102809 -200975 -149847 -121818 -104878 -26965 81521 47140 -14263 -82799 28005
21928B8005L1183N6222K17475l2348j02722j13517j43544J2813k494J40186P8050
$$ 28005 59188 115410 332885 300537 197815 84298 -59246 -46433 -48927 91259 169309
21917A69309j08651m7632J83356O9435l8019j17246J02323N0971m3430P8616o3546
$$ 169309 60658 13026 196382 265817 227798 110552 212875 263846 220416 299032 235486
21906B35486k6360q4190j31761N3714O9554M7358j3798j41891n2183K2021j4773
$$ 235486 209126 124936 -6825 46889 116443 163801 150003 8112 -44071 -22050 -36823
21895c6823m9962Q3803M0780n8783l8917n8933N7324J22522n1537K5284l9015
$$ -36823 -86785 -2982 37798 -20985 -59902 -118835 -61511 61011 9474 34758 -4257
21884d257m9264L2576R596R8266N8186K4495J37400J3001m7114o8562m3081J1626
$$ -4257 -53521 -20945 -11349 86917 145103 169598 306998 319999 272885 204323 161242 172868
21872A72868j70642J3481L8050o7018R0919N6425j47673j09309L4558L9319M8330
$$ 172868 2226 15707 53757 -13261 77658 134083 -13590 -122899 -88341 -49022 -692
21861f92O3873Q126j2633K1573m0895r1717J25187N9271J04727j19887m2943M2600
$$ -692 63181 71307 58674 80247 39352 -52365 72822 132093 236820 116933 73990 116590
21849A16590j7050J09135q0670M2370J47169J34791j68847l4461L2396K1245p6562
$$ 116590 99540 208675 128005 170375 317544 452335 283488 249027 281423 302668 226106
21838B26106j39617q7967j41685p7266J07002J73252m129r0465l3199J01587M7768
$$ 226106 86489 -1478 -143163 -220429 -113427 59825 55696 -34769 -67968 33619 81387
21827H1387K4117K5600j00735J15477P6233j35067r2666r8480J37266Q2210m4213
$$ 81387 105504 131104 30369 145846 222079 87012 -5654 -104134 33132 115342 71129
21816G1129m2774p4391k824Q423q9425O9531J24285j19701J46829N7671o3132
$$ 71129 28355 -46036 -48860 -40437 -129862 -60331 63954 -55747 91082 148753 85621
21805H5621j23601l6668m522r0557j057J01207l7009K136j14677j60004k950J32275
$$ 85621 -37980 -74648 -79170 -169727 -170784 -69577 -106586 -104450 -219127 -379131 -382081 -249806
21793b49806J33793o103l017L5325k0333j42777l1395r965J18038Q9550p4258
$$ -249806 -116013 -122116 -125133 -89808 -110141 -252918 -284313 -294278 -176240 -86690 -160948
21782a60948J26789Q8324j8163r3254j80798n9899O2963N3442R0270m6131j5233
$$ -160948 -34159 54165 36002 -57252 -238050 -297949 -234986 -181544 -91274 -137405 -152638
21771a52638O3936J04765K7373J50103o8250j78485q2110o1717J8964J19482N6705
$$ -152638 -88702 16063 43436 193539 125289 -53196 -135306 -197023 -178059 -58577 -1872
21760a872K8629L312j3645j449o4113j12973K8573n2448K2282J14594r7726r036
$$ -1872 26757 30069 16424 14975 -49138 -162111 -133538 -185986 -163704 -49110 -146836 -155872
21748a55872L0338p0105J29820L5278M8233p930l8485q0312R2477J87738N199
$$ -155872 -125534 -195639 -65819 -30541 17692 9762 -28723 -109035 -16558 171180 176379
21737A76379N1851m6216p6320m3117N8979n0420j11300K0634K5213R995l1808
$$ 176379 228230 182014 105694 62577 121556 71136 -40164 -19530 5683 15678 -16130
21726a6130p7180P8741N5164M5587J47657n8671k57231J67987K8299p3372j11166
$$ -16130 -93310 -14569 40595 86182 233839 175168 -82063 85924 114223 40851 -70315
21715g0315p6289l3070J17289J00205m1799P9698R9953q1374N8587R8336q5675
$$ -70315 -146604 -179674 -62385 37820 -3979 75719 175672 94298 152885 251221 165546
21704A65546j2125j19351k2002J29958J08634l1087q5262o0760k9995L1810P2095
$$ 165546 153421 34070 12068 142026 250660 219573 134311 73551 43556 75366 147461
21693A47461p8399j37913O3333j03251k9340Q8864K01807J03546o1047r2902r3503
$$ 147461 69062 -68851 -5518 -108769 -138109 -49245 152562 256108 195061 102159 8656
21682H656l3739J10438Q3667M3772n3264j30194m0836R7426M156N6794q7670Q1506
$$ 8656 -25083 85355 169022 212794 159530 29336 -11500 85926 90082 146876 59206 140712
21670A40712p1360j6332O6192j27783n646l7774k928l1120j0383J4995P0182J66954
$$ 140712 69352 53020 119212 -8571 -14217 -51991 -54919 -86039 -96422 -81427 -11245 155709
21658A55709j8033j49493n6430M9987k5925J16623J9570N0928l389n0295p5405
$$ 155709 137676 -11817 -68247 -18260 -44185 72438 92008 142936 139547 89252 13847
21647A3847k0459p7960J2349j991o866J43180j4462l7863J05932l433J48216j65835
$$ 13847 -6612 -84572 -72223 -74214 -81080 62100 47638 9775 115707 112274 260490 94655
21635I4655n5398l5381j62204k6891O9126J6101q7293Q2442O2923M7074J1633
$$ 94655 39257 3876 -158328 -185219 -116093 -99992 -187285 -104843 -41920 5154 16787
21624A6787O2140L3535o8107n55j7538j08352j2838J55347J11275m7459k4390
$$ 16787 78927 112462 44355 43800 26262 -82090 -94928 60419 171694 124235 99845
21613I9845j22441l4699j72768o3677Q0839J14469J7050j57832L1899J46565J03215
$$ 99845 -22596 -57295 -230063 -293740 -212901 -98432 -81382 -239214 -207315 -60750 42465
21602D2465l9077O727K1540M4765j454q2892j00093l7902m1135J26405J894j45592
$$ 42465 3388 10115 31655 76420 74966 -7926 -108019 -145921 -187056 -60651 -58757 -204349
21590b04349l3464M5058L3833Q5660o789n5240J10865j7300j5792q8238o3478
$$ -204349 -237813 -192755 -158922 -73262 -80051 -135291 -24426 -41726 -57518 -145756 -209234
21579b09234J23443O7173J29813J3661m0149j01851O1925J11306o0774r0840K2838
$$ -209234 -85791 -18618 111195 124856 84707 -17144 44781 156087 95313 4473 27311
21568B7311O5066k2801j43484M6625m4647k003p9205J88775J70900j04867j25952
$$ 27311 92377 69576 -73908 -27283 -71930 -73933 -153138 35637 206537 101670 -24282
21557b4282M5r213Q7833j9202J00677k9074j10624m4069M8941N3087R2740K9690
$$ -24282 -24237 -33450 54383 35181 135858 106784 -3840 -47909 1032 54119 146859 176549
21545A76549k2054K1758J8430K6420p4818k34020j64896n8017Q8859O1065j30683
$$ 176549 154495 176253 194683 221103 146285 -87735 -252631 -310648 -221789 -160724 -291407
21534b91407J5773R2436J09758k435q51J01436J1628l269M0112J81524k8222j23471
$$ -291407 -275634 -183198 -73440 -75875 -76726 24710 36338 33069 73181 254705 226483 103012
21522A03012j26792R848O3150K625j04322j3352K4948L2132o6503O3512P5681
$$ 103012 -23780 -13932 49218 51843 -52479 -65831 -40883 -8751 -75254 -11742 63939
21511F3939k4490o1119r177L4825j2949K6426j6408q53q5946j72351j72600Q8717
$$ 63939 39449 -21670 -30847 3978 -8971 17455 1047 194 -85752 -258103 -430703 -341986
21499c41986L9088R8519R2704N7630O4967J35088n7854r1331l3852P5743n35j39879
$$ -341986 -302898 -204379 -111675 -54045 10922 146010 88156 -3175 -37027 38716 38181 -101698
21487a01698Q5496l2805n9188j1990j3886k3006r1595O8733o4857M4297J09293
$$ -101698 -16202 -49007 -108195 -120185 -134071 -157077 -248672 -179939 -244796 -200499 -91206
21476i1206L7522n7487o4427M0099j260L6631J38797J1557k0083k8505L8278R0987
$$ -91206 -53684 -111171 -175598 -135499 -136759 -100128 38669 50226 30143 1638 39916 130903
21464A30903o3779j56206R8619l3979M1380J01480m5646N0695J65138n9652o4368
$$ 130903 67124 -89082 9537 -24442 16938 118418 72772 123467 288605 228953 164585
21453A64585j33804k6N7943k7506l9720Q7177L7909R205j1655j81346r0869J22092
$$ 164585 30781 30755 88698 61192 21472 108649 146558 155763 144108 -37238 -128107 -6015
21441f015J04917l5188n8523R3612L6004l4489k6885j6359L0671j56827J01174
$$ -6015 98902 63714 5191 98803 134807 100318 73433 57074 87745 -69082 32092
21430C2092M2138j13549j7944R8731J35352j9925o8352q9360L0913J5392m9971
$$ 32092 74230 -39319 -57263 41468 176820 156895 88543 -817 30096 45488 -4483
21419d483J41181M0819j9815j8743M440n8758l0726N9567m0759j37863P9935J2957
$$ -4483 136698 177517 157702 138959 143399 84641 53915 113482 72723 -65140 14795 27752
21407B7752R3503M2425n1473o7622k27783k1541M4125p25J37884J26778K2721
$$ 27752 121255 163680 112207 44585 -183198 -204739 -160614 -161339 -23455 103323 126044
21396A26044l4219j183j21012J2505J39098k1801q1646j27026K1529J21445n0905
$$ 126044 91825 90642 -30370 -17865 121233 99432 17786 -109240 -87711 33734 -17171
21385a7171L5171l1433l5467K5476p337N0150O2727k7663q6582O6764O9956k8355
$$ -17171 18000 -13433 -48900 -23424 -30761 19389 82116 54453 -32129 34635 104591 76236
21373G6236M9218J9214n8372o3552n0021m066M8311P6831L3015q3435J6707K1282
$$ 76236 125454 144668 86296 22744 -27277 -31343 16968 93799 126814 43379 60086 81368
21361H1368n903L4336m2414p5438K0491R2435R4026r4247n9436o6350j59997p090
$$ 81368 75465 109801 67387 -8051 12440 104875 198901 104654 45218 -21132 -181129 -188219
21349a88219M7033P8933j48856j8397O3222J13635K5235O4978m1362r4446j5671
$$ -188219 -141186 -62253 -211109 -229506 -166284 -52649 -27414 37564 -3798 -98244 -113915
21338a13915q5370k9645R7659J52871J39324o0952m9273K8456J09198j5663j68683
$$ -113915 -199285 -228930 -131271 21600 160924 99972 50699 79155 188353 172690 4007
21327D007M0565M519N8145p401k5105P1253J0932j29648k8285L0656Q7134M5922
$$ 4007 44572 49091 107236 99835 74730 145983 156915 27267 -1018 29638 116772 162694
21315A62694o8920J4010j10995m992L0175J06538J04477q3548p1129k0579q556
$$ 162694 93774 107784 -3211 -8203 21972 128510 232987 149439 78310 57731 49175
21304D9175j63299n5164k1884L688Q7351J5841N5243n0656L0415N5955P76r3392
$$ 49175 -114124 -169288 -191172 -187484 -100133 -84292 -29049 -79705 -49290 6665 7441 -85951
21292h5951j16646q165J59836J56378l9421r8643j4351p234Q0624q8857k7973
$$ -85951 -202597 -210762 -50926 105452 66031 -32612 -46963 -54197 26427 -62430 -90403
21281i0403p2115n3324Q0086M455j0330J3009Q7538O9757l1110j6847Q133R5030
$$ -90403 -162518 -215842 -135756 -131301 -141631 -128622 -41084 28673 -2437 -19284 -11151 83879
21269H3879J75393n2196l4194j41250N9819R7446n597j44049n7578L2035K13668
$$ 83879 259272 207076 172882 31632 91451 188897 183300 39251 -18327 13708 227376
21258B27376J26301j19098j86489l9277J74643R3759k2266j8672p0554R039r4531
$$ 227376 353677 234579 48090 8813 183456 277215 254949 236277 165723 174762 80231
21247H0231j7466J03330p8092R3965n4822r8319j5933p0863J2091J32404K8229
$$ 80231 62765 166095 88003 181968 127146 28827 12894 -57969 -45878 86526 114755
21236A14755l7142j12782l0431M1541N0644m2613m0530m2294J4593J26134Q1186
$$ 114755 77613 -35169 -65600 -24059 26585 -16028 -56558 -98852 -84259 41875 123061
21225A23061m1172r9790j03835m3748l8092N9322J88850K6392j04165q5668J30529
$$ 123061 81889 -17901 -121736 -165484 -203576 -144254 44596 70988 -33177 -118845 11684
21214A1684J02276M3057O143p0203j17500R9900L0194j26920o6564M9306J1921
$$ 11684 113960 157017 163160 92957 -24543 75357 105551 -21369 -87933 -38627 -26706
21203b6706K6171M1329l1913O0112l2637N933Q749K2076J2805q0082k6736n4917
$$ -26706 -535 40794 8881 68993 36356 42289 51038 73114 85919 5837 -20899 -75816
21191g5816o1309O6550o05l0105k4076l6869O5927M6184P6867l812k4221j20595
$$ -75816 -137125 -70575 -71180 -101285 -125361 -162230 -96303 -50119 26748 22936 -1285 -121880
21179a21880q6636J6731J14464p308r086N8510o1653K2596J78553m7575N6023
$$ -121880 -208516 -191785 -77321 -84629 -93715 -35205 -96858 -74262 104291 56716 112739
21168A12739J08148o5180j01223l0549j28304o895J0143L8231M8795Q911Q9629
$$ 112739 220887 155707 54484 23935 -104369 -111264 -101121 -62890 -14095 -5184 84445
21157H4445j07822n4490M1753j41037N4596L73r846L4613m093j50097k6899P5901
$$ 84445 -23377 -77867 -36114 -177151 -122555 -122182 -132028 -97415 -101508 -251605 -278504 -202603
21145b02603Q0270J26423P8638n979J6748L4349o5568q9173K1874K7742L5361
$$ -202603 -122333 4090 82728 76749 93497 127846 62278 -26895 -5021 22721 58082
21134E8082l9389m1712q5840O4266r443n967q0398P934m1110J1377l321J4658
$$ 58082 18693 -23019 -108859 -44593 -54036 -60003 -140401 -132467 -173577 -162200 -165521 -150863
21122a50863j48655o4939J10583R5563j06374J4087K59665J08834n2166N6059
$$ -150863 -299518 -364457 -253874 -158311 -264685 -250598 9067 117901 65735 121794
21112A21794j07055j39598l1729j20315R363J26073K26663N0135q5792J3869o4546
$$ 121794 14739 -124859 -156588 -276903 -267540 -141467 85196 135331 49539 63408 -1138
21101a138r042j1515J6430J11430J95327M6860k00417n0300k354k3803P6406O5220
$$ -1138 -10180 -21695 -5265 106165 301492 348352 147935 97635 95281 71478 147884 213104
21089B13104n2333m9512J27488L3815m6356o2850q4349l5118L0739L5238k9313
$$ 213104 160771 111259 238747 272562 226206 163356 79007 43889 74628 109866 80553
21078H0553k0434P6949p0112o5524L3489P9034K6997k4821l6792l8714L4714r345
$$ 80553 60119 137068 66956 1432 34921 113955 140952 116131 79339 40625 75339 65994
21066F5994p6262L5193N6050P3514n6229N2807K8871J47773J5646k0558k558n7311
$$ 65994 -10268 24925 80975 154489 98260 151067 179938 327711 343357 322799 320241 262930
21054B62930k60468j17471Q6516R8800n977k976l5165O7693J7209j18478R6490
$$ 262930 2462 -115009 -28493 70307 64330 61354 26189 93882 111091 -7387 89103
21043H9103M0516k5419m9541P2576J4634p1567j30290j40425l4194q8579M3495
$$ 89103 129619 104200 54659 127235 141869 70302 -59988 -200413 -234607 -323186 -279691
21032b79691J00460K05051O3564m1477o6464M0269O406n5033J323O3585n5231
$$ -279691 -179231 25820 89384 47907 -18557 21712 28118 -26915 -25592 37993 -17238
21021a7238k16934j23270O2593J04689M97N5123R9314J2683l2550J59392k8430
$$ -17238 -234172 -357442 -294849 -190160 -189663 -134540 -35226 -22543 -55093 104299 75869
21010G5869j20513O6681R066j13138p6871J04196R1049J15332K0761q6479j13906
$$ 75869 -44644 22037 31103 -82035 -158906 -54710 36339 151671 172432 85953 -27953
20999b7953M1674P8657j3708k8257L1396L6950j53958N2148M926P4311J08899
$$ -27953 13721 92378 78670 50413 81809 118759 -35199 16949 21875 96186 205085
20988B05085k525j96714o5540l396k4376k5775J45484j62386L9543n6021j08839
$$ 205085 202560 5846 -59694 -63090 -87466 -113241 32243 -130143 -90600 -146621 -255460
20977b55460q2589K05589J91286m5872n5409Q7976J08813L5996N0403m0418r513
$$ -255460 -338049 -132460 58826 12954 -42455 45521 154334 190330 240733 200315 190802
20966A90802j52736j02203L5818J76765l8229l2860O6164J8171n7282j9283m469
$$ 190802 38066 -64137 -28319 148446 110217 77357 143521 161692 104410 85127 80658
20955H0658O2723K840j69839Q5813J57389L5476r8676o6265j8079K3575j04163
$$ 80658 143381 146221 -23618 62195 219584 255060 156384 90119 72040 95615 -8548
20944h548N6957L3032P89q8r6560m1515r2596j17272P324J13425M2489Q4526J2654
$$ -8548 48409 81441 82230 82142 -14418 -55933 -148529 -265801 -258477 -145052 -102563 -18037 -5383
20931e383m2665p266M4571L1094m569O0181j0047M40n0631j78085j5227N8575
$$ -5383 -48048 -55314 -10743 20351 15782 75963 65916 66356 15725 -162360 -177587 -119012
20919a19012M7837j3820n0059J29009q3530n3098O7642Q2180O2971j4961m9698
$$ -119012 -71175 -84995 -135054 -6045 -89575 -142673 -75031 7149 70120 55159 5461
20908E461n0990N1977j19535K3366Q5364o6202k352O8147K5013Q979j341q5864
$$ 5461 -45529 6448 -113087 -89721 -4357 -70559 -72911 -4764 20249 29228 27887 -57977
20896e7977r9160Q8974K8033r4483r1626J5541P5293K39651Q2825j14113L1678
$$ -57977 -157137 -68163 -40130 -134613 -226239 -210698 -135405 104246 187071 72958 104636
20885A04636K063p539m3151K3575O414l4464J42933k626n1584m5266j15681k0172
$$ 104636 106699 99160 56009 79584 85998 51534 194467 191841 140257 94991 -20690 -40862
20873d0862o5844j54422J85666j6449m8750M1152O1229L243K7363k3161J05844
$$ -40862 -106706 -261128 -75462 -91911 -140661 -99509 -38280 -35037 -7674 -30835 75009
20862G5009J07123j33208J0404J00648R4622j3340j42123m8618Q6924m6559J22034
$$ 75009 182132 48924 59328 159976 254598 241258 99135 50517 137441 90882 212916
20851B12916P47p0215j06344l2647l8733J7364k9199J07011J41544l3379o7870
$$ 212916 213663 143448 37104 4457 -34276 -16912 -46111 60900 202444 169065 101195
20840A01195P4553L0296j01408Q1187j3365q7135p4723K4612J58828j12339k12799
$$ 101195 175748 206044 104636 185823 172458 85323 10600 35212 194040 81701 -131098
20829a31098q297M5210K8466j04789m6053R7256J75407k0534j17127M1073R3204
$$ -131098 -139395 -94185 -65719 -170508 -216561 -119305 56102 35568 -81559 -40486 52718
20818E2718k942L2904m2645n1190r8499j2073P2367Q3252J07516k3994l4765j72654
$$ 52718 49776 82680 40035 -11155 -109654 -121727 -49360 33892 141408 117414 82649 -90005
20806i0005o8406P7446J8484r014J7889m7601o125P5497j8112J9174L1046n3992
$$ -90005 -158411 -80965 -62481 -71495 -53606 -101207 -107332 -31835 -49947 -30773 273 -53719
20794e3719r7904k6298K6894P8510R6661L3387l0598q3155n5311N5998O0788L4403
$$ -53719 -151623 -177921 -151027 -72517 24144 57531 26933 -56222 -111533 -55535 5253 39656
20782C9656J8238J250j02340j35114N9983l0379o5722P8733J30142o296Q1390
$$ 39656 57894 59144 -43196 -178310 -118327 -148706 -214428 -135695 -5553 -11849 69541
20771F9541N5117m5077m1740p9288j9240N1606K1810q247k486k3061j549Q1607
$$ 69541 124658 79581 37841 -41447 -60687 -9081 12729 4482 1996 -21065 -22614 58993
20759E8993p3136j26639J02761M4460r2569j34907J7707R4971J27492j59702q4961
$$ 58993 -14143 -140782 -38021 6439 -86130 -221037 -203330 -108359 19133 -140569 -225530
20748b25530K97422R5075P2283O1447r1413j94456j95803M997P7767O2856J2087
$$ -225530 71892 166967 239250 300697 209284 14828 -180975 -175978 -98211 -35355 -23268
20737b3268Q170J08111n4474k2459j59810O4231j3260k7415J00862Q6151N084
$$ -23268 -15098 93013 38539 16080 -143730 -79499 -92759 -120174 -19312 66839 71923
20726G1923L1029O7004J2869j01326L5544J3448N472J46368k4709M5688j6741
$$ 71923 102952 169956 182825 81499 117043 130491 135963 282331 257622 303310 286569
20715B86569m5052k6557k1152j20005J3052J54773J20510j19869j51980J76019
$$ 286569 241517 214960 193808 73803 86855 241628 362138 242269 90289 266308
20705B66308P994j06008m7549L0489o386O5383j7957j35848N576J33247o4733
$$ 266308 274302 168294 120745 151234 144848 210231 192274 56426 62002 195249 130516
20694A30516p1579P5173L1163L8073j77075j42957M9428J19148O682R2835J78566
$$ 130516 58937 134110 165273 203346 26271 -116686 -67258 51890 58572 151407 329973
20683C29973O167q8249m4945j82738p9355j07126l6889K903R8878l4919j25234
$$ 329973 336140 247891 202946 20208 -59147 -166273 -203162 -200259 -101381 -136300 -261534
20672b61534k2423P749k1442N1522J37598O7248N5921K09952J04853k7593l9307
$$ -261534 -283957 -276208 -297650 -246128 -108530 -41282 14639 224591 329444 301851 262544
20661B62544j64992j57903l9181J36501J04398O5740j02104m8101M5786R1460
$$ 262544 97552 -60351 -99532 36969 141367 207107 105003 56902 102688 194148
20651A94148l0584j76796O8523l2595p2452J04020J48010O3470m5093j89837j50547
$$ 194148 163564 -13232 55291 22696 -49756 54264 202274 265744 220651 30814 -119733
20640a19733L0552L1871o9239K76184J58665m9289q7700L1932n3398k5268n9604
$$ -119733 -89181 -57310 -126549 149635 308300 259011 171311 203243 149845 124577 64973
20629F4973m1555J44400q595j51013K2557n1525m8607o0645j16046R749O4366
$$ 64973 23418 167818 159223 8210 30767 -20758 -69365 -130010 -246056 -236307 -171941
20618a71941j29487J54431J45415p6297l474M0069J58176M3156j1429j20290l3414
$$ -171941 -301428 -146997 -1582 -77879 -81353 -41284 116892 160048 148619 28329 -5085
20607e085j1883j1129j21982J83699J86507o6658j08316k9276k3234J3447J78681
$$ -5085 -16968 -28097 -150079 33620 220127 153469 45153 15877 -7357 6090 184771
20596A84771j782O3666j43479p9570p7835r0090m4086l2908n559J20269n9773
$$ 184771 182989 246655 103176 23606 -54229 -144319 -188405 -221313 -226872 -106603 -166376
20585a66376J15556J55389k1005k3585J30874o0008L9798P1207N689J868j24237
$$ -166376 -50820 104569 83564 59979 190853 130845 170643 241850 247539 249407 125170
20574A25170r5861M9541N4560J05707J41363J00231j24337k09573n9999K1311
$$ 125170 29309 78850 133410 239117 380480 480711 356374 146801 86802 108113
20564A08113K8762j0069m2401N4273O3668Q5537o7400K8911J0736o5586q0416
$$ 108113 136875 126806 84405 138678 202346 287883 220483 249394 260130 194544 114128
20553A14128n626o0763o8697P1214r744n277K3493m0326j5049j3429R5604N60
$$ 114128 108502 47739 -20958 50256 40512 35235 58728 18402 3353 -10076 85528 86088
20541H6088j27841o7918K49571N5033r1330J03602L0048q1825M0701J64436r5220
$$ 86088 -41753 -109671 139900 194933 103603 207205 237253 155428 196129 360565 265345
20530B65345j1830m2627l4460l3711k7079k1501k9257J8883O1437J89042q9291
$$ 265345 253515 210888 176428 142717 115638 94137 64880 83763 145200 334242 244951
20519B44951j44583L4670P827j13536j6310K2000Q3149P0192K2105j23399p8054
$$ 244951 100368 135038 142865 29329 13019 35019 118168 188360 210465 87066 9012
20508I012N9603m5741j09012M0018M466l8390Q4010J06708l40n8792k15326n8970
$$ 9012 68615 22874 -86138 -46120 -41654 -80044 3966 110674 110334 51542 -163784 -222754
20496b22754J74025J12261M5499K2065M799l3333n242O5836O4049r9503j49717
$$ -222754 -48729 63532 109031 131096 135895 102562 97320 163156 227205 127702 -22015
20485b2015n5143o7944j69258K5042Q5215p485j7209K7046J35164n2472j18932
$$ -22015 -77158 -145102 -314360 -289318 -204103 -211588 -228797 -201751 -66587 -119059 -237991
20474b37991j44863Q071J25060J13840m0125n103J69383l359l8815O7396K0588
$$ -237991 -382854 -374783 -249723 -135883 -176008 -181111 -11728 -15087 -53902 13494 34082
20463C4082O3782L5231o6534J56953k3336j63564l6544P3280q9844q1945j8964
$$ 34082 97864 133095 66561 223514 200178 36614 70 73350 -16494 -98439 -117403
20452a17403L8096J9194j34775l063q0918J43201q6K0554J42695R2820N2117l1431
$$ -117403 -79307 -60113 -194888 -197951 -278869 -135668 -135754 -115200 27495 120315 172432 141001
20440A41001k4601R2467j0154j13371K7426Q2006j13282q6850j17794N8460J57829
$$ 141001 116400 208867 198713 85342 112768 194774 81492 -5358 -123152 -64692 93137
20429I3137k9209j61965J67963N8820j14253r726M8236J49501L4296j01566j00467
$$ 93137 63928 -98037 69926 128746 14493 4767 53003 202504 236800 135234 34767
20418C4767P691o4731q8084K7881m869N3942K4859J569J07647P8251J7611k0727
$$ 34767 42458 -22273 -110357 -82476 -87345 -33403 -8544 -6975 100672 178923 196534 175807
20406A75807j42188K3888l0708k9310J6364J6901N0762N1198m8248q336j00243
$$ 175807 33619 57507 26799 -2511 13853 30754 81516 132714 84466 76130 -24113
20395b4113o4506K2015J0437l9150n4375R3425K5083J7060n4516J6943j4618L2277
$$ -24113 -88619 -66604 -56167 -95317 -149692 -56267 -31184 -14124 -68640 -51697 -66315 -34038
20383c4038J4015K03672J14364o0103j12036j21259Q5000J8577j08413K9597J1698
$$ -34038 -20023 183649 298013 237910 125874 4615 89615 108192 -221 29376 41074
20372D1074n9426o7317o5421K4207R1434K833j15474O1247q7233n0905J48546
$$ 41074 -18352 -85669 -151090 -126883 -35449 -32616 -148090 -86843 -174076 -224981 -76435
20361g6435P3699j42481j0285K0636j6265O3258P6471J51951L3190P2842l8045
$$ -76435 -2736 -145217 -155502 -134866 -151131 -87873 -11402 140549 173739 246581 208536
20350B08536j53733q3784J01519L7774k554r0392k4020j38264q1762O1479J4229
$$ 208536 54803 -28981 72538 110312 107758 17366 -6654 -144918 -226680 -165201 -150972
20339a50972R4739K70801K1918j50646j04727L8397o3620o4712q8925J43027J94986
$$ -150972 -56233 214568 236486 85840 -18887 19510 -44110 -108822 -197747 -54720 140266
20328A40266r237M6884M9517K0579j7994j26401l5680k7753P5425J14400L1482
$$ 140266 131029 177913 227430 248009 230015 103614 67934 40181 115606 230006 261488
20317B61488j05489R978J36732Q2737O5044j16802l346O8447M4591k01088j04569
$$ 261488 155999 165977 302709 385446 450490 333688 330342 398789 443380 242292 137723
20306A37723n1306N4146O2482R5908n9111j03492j32499l4583J8889J48907j0458
$$ 137723 86417 140563 203045 298953 239842 136350 3851 -30732 -11843 137064 126606
20295A26606j05813l7155r6812J38583L0261j48064p1105n0445K6620M260J27716
$$ 126606 20793 -16362 -113174 25409 55670 -92394 -163499 -213944 -187324 -183064 -55348
20284e5348P0730L1178j2877l8748m4966n2922J47575N8521m6323J00349q919
$$ -55348 15382 46560 33683 -5065 -50031 -102953 44622 103143 56820 157169 148250
20273A48250n5532L6422l1827j44725r6622q705N9291N568K632R8961J30530l3176
$$ 148250 92718 129140 97313 -47412 -144034 -152739 -93448 -87880 -85248 13713 144243 111067
20261A11067j36372j635N313o9532r1585J66587J78525J34012m950j94251j39360
$$ 111067 -25305 -26940 -21627 -91159 -182744 -16157 162368 296380 291430 97179 -42181
20250d2181Q1811q345n6731L2234L8866M5909m2009K55185P3659j05169j05623
$$ -42181 39630 31285 -25446 6788 45654 91563 49554 304739 378398 273229 167606
20239A67606j26916l5037O0492J8007p8869l6652j1859K4515O9357N3042r7038
$$ 167606 40690 5653 66145 84152 5283 -31369 -43228 -18713 50644 103686 6648
20228F648m2935M0030J1930M7259R4700m1787o8091k614k2766Q1038J09970j68870
$$ 6648 -36287 3743 15673 62932 157632 115845 47754 45140 22374 103412 213382 44512
20216D4512j00576J22418R6963K5927J6184m363l2068J7006l9606N4690J6107
$$ 44512 -56064 66354 163317 189244 205428 201065 168997 186003 146397 201087 217194
20205B17194j20858j41233J960k368L1305R3022m2086Q299m1196l197K1529Q436
$$ 217194 96336 -44897 -42937 -45305 -14000 79022 36936 45235 4039 842 22371 30807
20193C0807l0295N557N2097j0444P9223j6443n1178J5605K1707J47918J26826
$$ 30807 512 6069 58166 47722 126945 110502 59324 74929 96636 244554 371380
20182C71380K24134M2968L5298p8565q2892j20861Q7758L2628q6581J2280J57614
$$ 371380 595514 638482 673780 595215 512323 391462 479220 511848 425267 437547 595161
20171E95161J69257O7058j21854p3057O1106j61239j68354J83658R5937J9637
$$ 595161 764418 831476 709622 636565 697671 536432 368078 551736 647673 667310
20161F67310k17272k45719p213M7017j38561j25549N5003K00782R8760J58818
$$ 667310 450038 204319 197106 244123 105562 -19987 35016 235798 334558 493376
20151D93376J97799R5593o4006o918N5436M856O0129q0169q7326N1612P8923j35980
$$ 493376 691175 786768 722762 715844 771280 776136 836265 756096 668770 720382 799305 663325
20139F63325J0494Q1610o971p7107m3638J74764M7759m0631j67185j22731o632
$$ 663325 673819 755429 748458 671351 627713 802477 850236 809605 642420 519689 513057
20128E13057j47995j85945m9911J40080O5446J7145l3057L8295J2567k5072O0254
$$ 513057 365062 179117 129206 269286 334732 351877 318820 357115 369682 344610 404864
20117D04864n5528j13165j50363j3051J32742L9350j53720j00672o6724n7274
$$ 404864 349336 236171 85808 72757 205499 244849 91129 -9543 -76267 -133541
20107a33541R8696Q6627R6229J81902O5728n0128j4278n8468o0227r7112Q777
$$ -133541 -34845 51782 148011 329913 395641 345513 331235 272767 212540 115428 124205
20096A24205K26j6775P9680m631J2053M423j40512J7556J6638q4601M0855J6167
$$ 124205 124431 107656 187336 182705 194758 199181 58669 76225 92863 8262 49117 65284
20084F5284j7404m2327k0006R1556J55136n4193k6723l2230q4354j01594M5530
$$ 65284 47880 5553 -14453 77103 232239 178046 151323 119093 34739 -66855 -21325
20073b1325m7240r1103N763Q5508O3061J63830L6901p9887J9799o6029l850O5714
$$ -21325 -68565 -159668 -153905 -68397 -5336 158494 195395 115508 135307 69278 65428 131142
20061A31142J6309K93p6891N4813L408M896k27261q8469K1667j54683M4602K57688
$$ 131142 147451 147744 70853 125666 129074 133970 -93291 -181760 -160093 -314776 -270174 -12486
20049a2486Q7525o8441j00371J7436J05477n2086Q7190J52850q8563j94762R9719
$$ -12486 75039 6598 -93773 -76337 29140 -22946 64244 217094 128531 -66231 33488
20038C3488Q2465J25367J6463o9657R0817p022k02546R634O8225Q4253l095j42679
$$ 33488 115953 241320 257783 188126 278943 271921 69375 79009 147234 231487 228392 85713
20026H5713R990Q8661l8357L7900N2479m9474Q7646R8048N2658m4076m5764O2521
$$ 85713 95703 184364 146007 183907 236386 186912 274558 372606 425264 381188 335424 397945
20014C97945j16110r2806r9965M4331K0595K2987J4431j3952j52835j85349n0918
$$ 397945 281835 189029 89064 133395 153990 176977 191408 177456 24621 -160728 -211646
20003b11646L106P4164L0290M9527J20052N5372l7539L939M9064L3011N8443p48
$$ -211646 -208540 -134376 -104086 -54559 65493 120865 83326 87265 136329 169340 227783 227035
19991B27035J1580l7412J15488p0855m1176j54129Q926K1558R1225K22059j2732
$$ 227035 238615 201203 316691 245836 204660 50531 59457 81015 172240 394299 381567
19980C81567k97287o0145J0932J24264J10471R7994n5968j00137j8823O8182L8086
$$ 381567 84280 24135 35067 159331 269802 367796 311828 211691 192868 261050 299136
19969B99136J4203L0044j08676K9368m2981n0840Q7278Q1608J1780o0720l1004
$$ 299136 313339 343383 234707 264075 221094 170254 257532 339140 350920 290200 259196
19958B59196m597O7344q5742K4818k505m05k9831l7455p2615p954j39635K29R4497
$$ 259196 254599 321943 236201 261019 258514 258109 228278 190823 118208 110254 -29381 -29152 65345
19945F5345J27494j15828m6193Q9638N3550L8290K1504k0924j09420k1243o9851
$$ 65345 192839 77011 30818 120456 174006 212296 233800 212876 103456 82213 12362
19934A2362P1772J08420J3303P3506K24055o4207k10522j9214m5804r1089J00922
$$ 12362 84134 192554 205857 279363 503418 439211 228689 209475 163671 72582 173504
19923A73504J63787l8829q017l0470O7429J31193m0915p8037P84J66926N3919
$$ 173504 337291 298462 290445 259975 327404 458597 417682 339645 340429 507355 561274
19912E61274p635j9025k74382k8660K30375R7523N6254J23197J20325r4393j45147
$$ 561274 553639 534614 260232 231572 461947 559470 615724 738921 859246 764853 619706
19901F19706J5446L6370o328N879O046k3702r4701O4699J99858r9614k95440l7002
$$ 619706 635152 671522 665194 671073 677119 653417 558716 623415 823273 723659 428219 391217
19889C91217r3385L9800P0474N7806j7811J4103k401l7976j57867O457J32525
$$ 391217 297832 337632 408106 465912 448101 462204 459803 421827 263960 270417 402942
19878D02942j05297k8288m6258q8583j9968j00857O6940J84067K19355p591o4509
$$ 402942 297645 269357 223099 134516 114548 13691 80631 264698 484053 476462 411953
19867D11953p7315J64164K34864Q2941l5558J6582O2187O560j27430O6537J87854
$$ 411953 334638 498802 733666 816607 781049 797631 859818 866378 738948 805485 993339
19856I93339J13229N5217J8601j7967k91745l05033n1564k3109R2263O8149P1739
$$ 993339 1106568 1161785 1180386 1162419 870674 565641 514077 490968 583231 651380 723119
19845G23119N4363j10522k8967j28669p7804K9571m3388j16168k0051M8235J45132
$$ 723119 777482 666960 637993 509324 431520 461091 417703 301535 281484 329719 474851
19834D74851o8626j45973j8143p2286p598P6949J84912k4038n2138l1453J84256
$$ 474851 406225 260252 242109 169823 162225 239174 424086 400048 347910 316457 500713
19823E00713j7093m5044Q8542k1060m5786j28024j31564K6341o1460j8775L2660
$$ 500713 483620 438576 527118 506058 460272 332248 200684 227025 165565 146790 179450
19812A79450Q4734p1134j73618m9611J16687J49207K2453J05567J5054j30209
$$ 179450 264184 193050 19432 -30179 86508 235715 258168 363735 378789 248580
19802B48580p7857o7075O449k553K0432k588Q0770P4848K7918Q9256J1285p6110
$$ 248580 170723 103648 110097 107544 127976 125388 206158 281006 308924 398180 409465 333355
19790C33355m3215k5713N9738J17528m9444j65466p6045l5864N7218J8922J38736
$$ 333355 290140 264427 324165 441693 392249 226783 150738 114874 172092 191014 329750
19779C29750l0876n374l5343L2923J42077K55258K5007j8064J0181J13317J22499
$$ 329750 298874 293500 258157 291080 433157 688415 713422 695358 705539 818856 941355
19768I41355l6586O2335K7956n5152p8145n2710O9112J67497J78392K2227J8858
$$ 941355 904769 967104 995060 939908 861763 809053 878165 1045662 1224054 1246281 1265139
19757A265139J69959J95257O3170j83922r3632r3985j45553j83181m3039q138
$$ 1265139 1435098 1630355 1693525 1509603 1415971 1321986 1176433 993252 950213 942075
19747I42075J65970K39059Q9927r2497j08769R885K5074r7340j83904j74663o8062
$$ 942075 1108045 1347104 1437031 1344534 1235765 1245650 1270724 1173384 989480 814817 746755
19736G46755j08439j22629j79295p4995J77647J07077J46265k3638j15764p6137
$$ 746755 638316 515687 336392 261397 439044 546121 692386 668748 552984 476847
19726D76847p7978j5848J05967L2618j18287j19829j27645M1626J9386Q2123J4598
$$ 476847 398869 383021 488988 521606 403319 283490 155845 197471 216857 298980 313578
19715C13578O0414J6228k0257N1711Q9165M9860R6870m3828k2732N7562m4185
$$ 313578 373992 390220 369963 421674 510839 560699 657569 613741 591009 648571 604386
19704F04386p0146o2833l4295J61365K78180j01381r266m9838q9225P0173M0671
$$ 604386 534240 471407 437112 598477 876657 775276 766010 716172 626947 697120 737791
19693G37791j25449j34364P233R7994K118p0089j4071J29686Q606k4571j35768
$$ 737791 612342 477978 485211 583205 585323 515234 501163 630849 639455 614884 479116
19682D79116j23544l5196J45341o8122p3890l9715k0305J59879K1564N7606J0443
$$ 479116 355572 320376 465717 397595 323705 283990 263685 423564 445128 502734 513177
19671E13177j914O3423M234Q8522J45269j7860j09559J58765K3229n5240J48372
$$ 513177 511263 574686 578920 667442 812711 794851 685292 844057 867286 812046 960418
19660I60418J35320l6043n5195l884P8655Q7317R7201K50567J45834m8620Q3325
$$ 960418 1095738 1059695 1004500 1000616 1079271 1166588 1263789 1514356 1660190 1611570 1694895
19649A694895J20051J59343J21562J13641j30935m6801P7300J34601K77338L50683
$$ 1694895 1814946 1974289 2095851 2209492 2078557 2031756 2109056 2243657 2520995 2871678
19639B871678L66238J53985K59487L12837J88301J52581J48909J07527J09614
$$ 2871678 3237916 3391901 3651388 3964225 4152526 4305107 4454016 4561543 4671157
19630D671157K03012J9755K05902N55666Q21403R94490J217157J344111J964613
$$ 4671157 4874169 4893924 5099826 5655492 6476895 7471385 8688542 10032653 11997266
19621A1997266K594498L475166M939241P109935J1122001J7277871K2016325J7721422
$$ 11997266 14591764 18066930 23006171 30116106 41238107 58515978 80532303 98253725
19613I8253725K961581p353573k412260Q069214R661457k369627j5734827j5897885
$$ 98253725 101215306 93861733 91449473 99518687 109180144 106810517 91075690 75177805
19605G5177805o620518L728873J3671152J9626196J2999841l768308j2084370
$$ 75177805 68557287 72286160 85957312 105583508 118583349 114815041 102730671
19598A02730671l637429P237265N214791j0313134k2816715k0848447j2769776
$$ 102730671 99093242 106330507 111545298 101232164 78415449 57567002 44797226
19591D4797226p131939l446828q90536J218826L790200P428493J2855019J9704541
$$ 44797226 37665287 34218459 33327923 34546749 38336949 45765442 58620461 78325002
19583G8325002K1602536J1151784m816358q345396K466126J1349320N838524j0772706
$$ 78325002 99927538 111079322 106262964 97917568 100383694 111733014 117571538 106798832
19575A06798832j9796037j3486932k475396P782402J6853610J8374981N938317
$$ 106798832 87002795 73515863 71040467 78822869 95676479 114051460 119989777
19568A19989777r554545j0394038J354928Q029175q84786j8128565k5070557j9317713
$$ 119989777 110435232 100041194 101396122 109425297 108540511 90411946 65341389 46023676
19560D6023676j2069043p466777n148579l631907k658067k048901j821132j382159
$$ 46023676 33954633 26487856 21339277 17707370 15049303 13000402 11179270 9797111
19552I797111j021383q52204o63307o23269n25445l18786j99818j93916k68371
$$ 9797111 8775728 7923524 7260217 6636948 6111503 5792717 5592899 5398983 5130612
19543E130612k88692k22868p0441j91955j09416k75574l04744l37986k49100j08670
$$ 5130612 4841920 4619052 4548611 4356656 4247240 3971666 3666922 3328936 3079836 2971166
19533B971166k2970M335L4792j20369j84313j07096j19932p9037k33876j34984
$$ 2971166 2948196 2952531 2987323 2866954 2682641 2575545 2455613 2376576 2142700 2007716
19523B007716r4931j16778p0271k8765M4127L0848n6616k43262l5484o688k06312
$$ 2007716 1912785 1796007 1725736 1696971 1741098 1771946 1715330 1472068 1436584 1429896 1223584
19512A223584l4604N5275J33740q7151q0744r6853j56967K2568J0165L1583M8814
$$ 1223584 1188980 1244255 1377995 1290844 1210100 1113247 956280 978848 989013 1020596 1069410
19501A069410O3889K00883J52383k2380j51489r5494r9921q1692P0822L1848l6464
$$ 1069410 1133299 1334182 1486565 1464185 1312696 1217202 1117281 1035589 1106411 1138259 1101795
19490A101795k4475l8867M6395N6347j40710j3261O070p7749j99760m9014P2550
$$ 1101795 1077320 1038453 1084848 1141195 1000485 987224 993294 915545 715785 666771 739321
19479G39321q9092M1553J08149j8928P7760J14124O6370j158o9805j39312j30705
$$ 739321 650229 691782 799931 781003 858763 972887 1039257 1038099 968294 828982 698277
19468F98277J44108K25857L2446n3490j73319J5523J33792P3362p7219k6308P5266
$$ 698277 842385 1068242 1100688 1047198 873879 889402 1023194 1096556 1019337 993029 1068295
19457A068295j45825j74743M566M5775J72386M0337q1802M4568N5140j25579o6832
$$ 1068295 922470 747727 752293 798068 970454 1010791 928989 973557 1028697 903118 836286
19446H36286K7747J06385L399K1838N4001j9352O1463m6488J57517J22721l8921
$$ 836286 864033 970418 973817 995655 1049656 1030304 1091767 1045279 1202796 1325517 1286596
19435A286596j9904M8725n8104j86927k08922r9462j7601P0413J73132J32316
$$ 1286596 1266692 1315417 1257313 1070386 861464 762002 744401 814814 987946 1120262
19425A120262k9461p7404R7272O7929N3332J16606Q470J79313J69391K67742K29237
$$ 1120262 1090801 1013397 1110669 1178598 1231930 1348536 1357006 1536319 1705710 1973452 2202689
19414B202689Q5181K62960K32411K49276K69517M05984K39887J76694K98246M17479
$$ 2202689 2287870 2550830 2783241 3032517 3302034 3708018 3947905 4124599 4422845 4840324
19404D840324N72241N30425N58733N30223P17067R76216J189581J573273K291002
$$ 4840324 5412565 5942990 6501723 7031946 7749013 8725229 9914810 11488083 13779085
19395A3779085L109090M632282P461837J1859717J7945057K0222876R400531q551343
$$ 13779085 16888175 21520457 28982294 40842011 58787068 79009944 88410475 79859132
19387G9859132j5265500q275720Q23190Q898872J8585656K7544862K6789218J3682644
$$ 79859132 64593632 56317912 57141102 66039974 84625630 112170492 138959710 152642354
19379A52642354m385814k0696834k8858198k1826357r757215L14654R555496J6453741
$$ 152642354 148256540 127559706 98701508 76875151 67117936 67432590 76988086 93441827
19371I3441827J1242880q563372k3966476k1898849j3757793q190061n282296
$$ 93441827 104684707 96121335 72154859 50256010 36498217 28308156 23025860
19364B3025860l463974k516666j837636j252443r34779p43000m34983j46117j19663
$$ 23025860 19561886 17045220 15207584 13955141 13020362 12277362 11842379 11696262 11576599
19355A1576599M8945J82378L42499P60804R57641J063458J337247K121415L256169
$$ 11576599 11625544 11807922 12150421 12911225 13868866 14932324 16269571 18390986 21647155
19346B1647155N222824Q800884J4519082K1595891K2456418P081605j3925077
$$ 21647155 26869979 35670863 50189945 71785836 94242254 101323859 87398782
19339H7398782j8106038q073699K081033J1477145K1811072L0228544K7741050
$$ 87398782 69292744 61219045 63300078 74777223 96588295 126816839 154557889
19332A54557889J5434540l01409k0368478l4779339k7874719j2569845k61263
$$ 154557889 169992429 169691020 149322542 114543203 86668484 74098639 73837376
19325G3837376J0820031J9519907J5023592p040672k7285843k6997632j7033917
$$ 73837376 84657407 104177314 119200906 112160234 84874391 57876759 40842842
19318D0842842r969795o509995m678174l459335k446248j832347j309510j014618
$$ 40842842 30873047 24363052 19684878 16225543 13779295 11946948 10637438 9622820
19310I622820q48172q92641q33817p03059m70059k17017j69632j31221l44541
$$ 9622820 8774648 7882007 7048190 6345131 5875072 5658055 5488423 5357202 5012661
19301E012661n54732m07698k80019j43650q4405j08125k96147r2274k10764j85280
$$ 5012661 4457929 4050231 3770212 3626562 3542157 3434032 3137885 3045611 2834847 2649567
19291B649567p1022l3563n6919n6659P2759L3523j37624q3649P6641K7605k8545
$$ 2649567 2578545 2544982 2488063 2431404 2504163 2537686 2400062 2316413 2393054 2420659 2392114
19280B392114Q5437j1864L7347R1208N7095J38483N603J05451J05575K18016M59150
$$ 2392114 2477551 2465687 2503034 2594242 2651337 2789820 2795423 2900874 3006449 3224465 3683615
19269C683615M58198K12289L19697L26027N16933P01402O02214O12715O87353
$$ 3683615 4141813 4354102 4673799 4999826 5516759 6218161 6820375 7433090 8120443
19260H120443O58894O88593Q63356J130078J580567K098168L121590M542644O458643
$$ 8120443 8779337 9467930 10331286 11461364 13041931 15140099 18261689 22804333 29262976
19251B9262976R640846J5340140K3848356L1230072K7105178J3034207N959894
$$ 29262976 38903822 54243962 78092318 109322390 136427568 149461775 155421669
19244A55421669J736392j5690657k8896201k0601817m756806R536663K2007299
$$ 155421669 157158061 141467404 112571203 91969386 87212580 96749243 118756542
19237A18756542K5941917J7069560J0818383K0449450K5222540Q442159j2554790
$$ 118756542 144698459 161768019 172586402 193035852 218258392 226700551 214145761
19230B14145761j6119350j1991874k1578031l3268071k6464983r890444N171416
$$ 214145761 198026411 186034537 164456506 131188435 104723452 94833008 100004424
19223A00004424J7139934J8716444N597797o214796n786642j0526309k4097352
$$ 100004424 117144358 135860802 141458599 135243803 129457161 118930852 94833500
19216I4833500k7566192j9617315j2009648p654204n404998l893713k791648j982636
$$ 94833500 67267308 47649993 35640345 27986141 22581143 18687430 15895782 13913146
19208A3913146j336849j065711j016420r98238q26762q89449o59814o26796o23809
$$ 13913146 12576297 11510586 10494166 9495928 8669166 7779717 7119903 6493107 5869298
19199E869298o96411p17247n18416l31459l45062j12098j95717j08563J19820
$$ 5869298 5172887 4455640 3937224 3605765 3260703 3148605 2952888 2844325 2964145
19190B964145K7613O3641j40892j88515j68441j56982k44569j49720j11083O042
$$ 2964145 2991758 3055399 2914507 2725992 2557551 2400569 2156000 2006280 1895197 1901239
19180A901239j16334k46857p3117J862k8345q7002j34486m9431m283J1989k2495
$$ 1901239 1784905 1538048 1464931 1466793 1438448 1351446 1216960 1167529 1163246 1175235 1152740
19169A152740J04510k9686j44235N6670k8462j78437o3454N3512k1584Q6206p5990
$$ 1152740 1257250 1227564 1083329 1139999 1111537 933100 869646 923158 901574 987780 911790
19158I11790k5310J3514j27895o3396K4596M8810m808o2975K7992L5368k2363
$$ 911790 886480 899994 772099 708703 733299 782109 777301 714326 742318 777686 755323
19147G55323M3912J08439J13340J61729k5193l8551L5262K90154K98344J59293
$$ 755323 799235 907674 1021014 1182743 1157550 1118999 1154261 1444415 1742759 1902052
19137A902052P643m3324j71717j99854j47337l8314j4686j21281j75537j05290
$$ 1902052 1909695 1866371 1694654 1494800 1347463 1309149 1294463 1173182 997645 892355
19127H92355j39661j04408N7537J25236j1997p2652j16840j7136m8353m144K9695
$$ 892355 752694 648286 705823 831059 819062 746410 629570 612434 564081 559937 589632
19116E89632P538J7160Q2394R9177l909l5703p7321P0650p4113j11855j19190
$$ 589632 597170 614330 696724 795901 791992 756289 678968 749618 675505 563650 444460
19105D44460N0219j1269p1034P9284O2682J08619p204n6906l1343j4734j11748
$$ 444460 494679 483410 412376 491660 554342 662961 655757 598851 567508 552774 441026
19094D41026K5716J04789o7143m7326J03082O0575N1511J55734O6595M7762m4052
$$ 441026 466742 571531 504388 457062 560144 620719 672230 827964 894559 942321 898269
19083H98269j15712r0065j2871n2604l5519j7185r2654p4930m7469K7608P5244
$$ 898269 782557 692492 679621 627017 591498 574313 481659 406729 359260 386868 462112
19072D62112J0463o2243Q4083L2058P4619N5576K2994M8062j92966j01018j1549
$$ 462112 472575 410332 494415 526473 601092 656668 679662 727724 534758 433740 422191
19061D22191l5382m3955J02828O5346j06232J0348K08436j05300j0500J20659
$$ 422191 386809 342854 445682 511028 404796 415144 623580 518280 507780 628439
19051F28439l4564p8769j39584K2122L02590P5566p2099J23906J82502M5381P8929
$$ 628439 593875 515106 375522 397644 700234 775800 703701 827607 1010109 1055490 1134419
19040A134419L3720k38105p2520J89703J79171q6218j31871n0146P3943L582N9947
$$ 1134419 1168139 930034 857514 1047217 1226388 1140170 1008299 958153 1032096 1035678 1095625
19029A095625J77423R3341k5652n5385K9996M6663O8610J08480J29980n8474k22824
$$ 1095625 1273048 1366389 1340737 1285352 1315348 1362011 1430621 1539101 1669081 1610607 1387783
19018A387783r0682m0934j68261k10940l3546k3332q9048J2032J72697J52279
$$ 1387783 1297101 1256167 1087906 876966 843420 820088 731040 743072 915769 1068048
19008A068048J8024l982j05748J1096o328J26459o2406N3497m3950r5141J03331
$$ 1068048 1086072 1082090 976342 987438 981110 1107569 1045163 1098660 1054710 959569 1062900
18997A062900J59530R8967m5670J976J42266J31879R2712p3137j70480k1654N3927
$$ 1062900 1222430 1321397 1275727 1277703 1419969 1551848 1644560 1571423 1400943 1379289 1433216
18986A433216J84644k3711j31654j95094j45241J1559l4280j01645J22753K1018
$$ 1433216 1617860 1594149 1462495 1267401 1122160 1133719 1099439 997794 1120547 1141565
18976A141565J07919J34607J7959Q1116N4404L5251K62185J25521N0165J4878
$$ 1141565 1249484 1384091 1402050 1483166 1537570 1572821 1835006 1960527 2010692 2025570
18966B025570j59561O022Q9935J83489O5688j72219l5598J48915L71200K66978
$$ 2025570 1866009 1872031 1961966 2145455 2211143 2038924 2003326 2152241 2523441 2790419
18956B790419j4177j9530J92408J45269L30875M45692M21052N85455P96707J030505
$$ 2790419 2776242 2756712 2949120 3094389 3425264 3870956 4292008 4877463 5674170 6704675
18946F704675J475236K540757L716473N752066R380749J5146706K1512262J8662663
$$ 6704675 8179911 10720668 14437141 20189207 29569956 44716662 66228924 84891587
18938H4891587L27442j9175395k1057696j2680599o554077l156716p82391J402249
$$ 84891587 85219029 66043634 44985938 32305339 25751262 22594546 21812155 23214404
18930B3214404M432928Q750615J5054348K0697100J5150308n063466k2187089
$$ 23214404 27647332 36397947 51452295 72149395 87299703 82236237 60049148
18923F0049148k0701721j2209837o806834m066956k640642j800915j459062j244055
$$ 60049148 39347427 27137590 20330756 16263800 13623158 11822243 10363181 9119126
18915I119126p88790m68316l57555j12688j65227j87960j09897N6315L08661M00741
$$ 9119126 8330336 7862020 7504465 7391777 7226550 7038590 6928693 6985008 7293669 7694410
18905G694410N10630L04264M67084J115804J707613K138608L118496M921788P776795
$$ 7694410 8205040 8509304 8976388 10092192 11799805 13938413 17056909 21978697 29755492
18896B9755492J2197166J9340415K5845784J9496372k179423j8489980j2710176
$$ 29755492 41952658 61293073 87138857 106635229 104455806 85965826 73255650
18889G3255650J808639J4891473J9783990P457543j3017518j8379835o185552
$$ 73255650 75064289 89955762 109739752 117197295 104179777 85799942 79614390
18882G9614390Q082336J7133015J1078570q710874k0482944j2320175K247459
$$ 79614390 87696726 104829741 115908311 107197437 86714493 74394318 76641777
18875G6641777J4199267J5071520k449988k3341853k5895966j6410370r353794
$$ 76641777 90841044 105912564 103462576 80120723 54224757 37814387 28460593
18868B8460593n912493l955147k779715k147270j607831j087329n62792n93786
$$ 28460593 22548100 18592953 15813238 13665968 12058137 10970808 10408016 9814230
18860I814230o44473m98332l90285l40362N9522J80462J41245J64199K96696M55174
$$ 9814230 9169757 8671425 8281140 7940778 8000300 8180762 8322007 8486206 8782902 9238076
18850I238076P80381J090267J486784K409972M196174O608843J0598161J7411833
$$ 9238076 10018457 11108724 12595508 15005480 19201654 25810497 36408658 53820491
18842E3820491K5108006K3409904K500014k2381272k6359935j6164861q420179
$$ 53820491 78928497 102338401 104838415 82457143 56097208 39932347 31512168
18835C1512168m103681j251691J574446M874204R653892J6535733K3373508J8346250
$$ 31512168 27408487 26156796 27731242 32605446 42259338 58795071 82168579 100514829
18827A00514829l989023k4914541k4994306j5137125q655379n509706l639581
$$ 100514829 96525806 71611265 46616959 31479834 22824455 17314749 13675168
18820A3675168k603325j812213j307534r08661n29456n39362o95144n49997l57754
$$ 13675168 11071843 9259630 7952096 7043435 6513979 5974617 5279473 4729476 4371722
18811D371722k37482p4935j58731l03959j79477J4638J497L6075k61092m18757
$$ 4371722 4134240 4059305 3900574 3596615 3417138 3431776 3433273 3469348 3208256 2789499
18801B789499m19347k53241Q3499K3935J24133q765k72580k14983k34216j81912
$$ 2789499 2370152 2116911 2200410 2224345 2348478 2339713 2067133 1852150 1617934 1436022
18791A436022j8849m0699k00364K1427q286R2028Q0192l6039k98392j71637P8118
$$ 1436022 1417173 1376474 1176110 1197537 1189251 1281279 1361471 1325432 1027040 855403 933521
18780I33521O5412R3187J57066l9229k8676O0269k684k28335q8955N5390K38034
$$ 933521 998933 1092120 1249186 1209957 1181281 1241550 1238866 1010531 921576 976966 1215000
18769A215000L59508N55178N15142K86165l35499o98098l16079m3660o7423j93834
$$ 1215000 1574508 2129686 2644828 2930993 2595494 1897396 1581317 1537657 1470234 1276400
18759A276400j76112r5275J57879Q2231Q5044j26774j25816k2740j05903p9336
$$ 1276400 1100288 1005013 1162892 1245123 1330167 1203393 1077577 1054837 948934 869598
18749H69598j65993j20104q1652j08720R3176P4746q8512p4453J7758J59746l5744
$$ 869598 703605 583501 501849 393129 486305 561051 472539 398086 415844 575590 539846
18738E39846M3343L3857O8008n6599j8635J19141L9442Q6046O8163J00615j3888
$$ 539846 583189 617046 685054 628455 609820 728961 768403 854449 922612 1023227 1009339
18727A009339j8367J8695Q0053m5105J7661J15520J9412J65230J60695J79872
$$ 1009339 990972 1009667 1089720 1044615 1062276 1177796 1197208 1362438 1523133 1703005
18717A703005J27546J24003P40n7069J24073L43699L16785K51916K95500L17100
$$ 1703005 1830551 1954554 1955294 1898225 2022298 2365997 2682782 2934698 3230198 3547298
18707C547298K90074M0352o5641o7724j43405k12244j88620p1313l48278j23933
$$ 3547298 3837372 3877724 3812083 3744359 3600954 3388710 3200090 3128777 2780499 2656566
18697B656566J52732K95019L00871K74512L90632K27027L82852M63502O74334
$$ 2656566 2809298 3104317 3405188 3679700 4070332 4297359 4680211 5143713 5818047
18688E818047J035353J494222K126029K982742M445191O977969J1202513J7355678
$$ 5818047 6853400 8347622 10473651 13456393 17901584 24879553 36082066 53437744
18680E3437744K2430833J7513345N281916o62230l235679j3905895k2451099j8528989
$$ 53437744 75868577 93381922 98663838 98001608 94765929 80860034 58408935 39879946
18672C9879946j1217155o799239m628358l239234k277902j592729j290903j020228
$$ 39879946 28662791 21863552 17235194 13995960 11718058 10125329 8834426 7814198
18664G814198p10913l35295l31090j42073K3194K45314L0517M0639J00168l0406
$$ 7814198 7103285 6767990 6436900 6294827 6318021 6563335 6593852 6634491 6734659 6704253
18654F704253k12135j08528J08080m4304r3151M2645Q7310J59948K76328L50186
$$ 6704253 6492118 6383590 6491670 6447366 6354215 6396860 6484170 6644118 6920446 7270632
18644G270632L77329N78287Q19152J028119J338490K054792L090966M173502N860191
$$ 7270632 7647961 8226248 9045400 10073519 11412009 13466801 16557767 20731269 26591460
18635B6591460Q454637J2721342J9340654K5181905K5202718K5054980L4851751
$$ 26591460 35046097 47767439 67108093 92289998 117492716 142547696 177399447
18628A77399447M0326168J8505257j1102919j7479108j9415088l5801768m3751257
$$ 177399447 217725615 236230872 225127953 207648845 188233757 152431989 108680732
18621A08680732l2943657k0152331j2694850q889006o345063m675577l627308
$$ 108680732 75737075 55584744 42889894 34000888 27655825 22980248 19352940
18614A9352940k771408k165111j654360j134842p62631o52729p23088m97723m05652
$$ 19352940 16581532 14416421 12762061 11627219 10864588 10211859 9488771 8991048 8585396
18605H585396k97440l43305k76262p4100O3834J72249J34364L0184j0900J04452
$$ 8585396 8287956 7944651 7668389 7594289 7658123 7830372 7964736 7994920 7984020 8088472
18595H088472N9426K42438L93669M00415M93012R24561J580666K223522L208882
$$ 8088472 8147898 8390336 8784005 9184420 9677432 10601993 12182659 14406181 17615063
18586A7615063M467097O675560R883471J4950783K3720954L5037358L7122195
$$ 17615063 22082160 28757720 38641191 53591974 77312928 112350286 149472481
18579A49472481J9671771p47619k796425n845787k6035511l8758280l0632160
$$ 149472481 169144252 168396633 165600208 159754421 133718910 94960630 64328470
18572F4328470j8504836j1204685p461964n355112l862750k842119k366470j794139
$$ 64328470 45823634 34618949 27156985 21801873 17939123 15097004 12730534 10936395
18564A0936395j298760j149670q67329p24993p62206m24092l71036j12482j05223
$$ 10936395 9637635 8487965 7620636 6895643 6133437 5709345 5338309 5225827 5120604
18555E120604p6499K15982J50313J54676Q0586K53761P5824k20064j40585m8729
$$ 5120604 5044105 5260087 5410400 5565076 5645662 5899423 5975247 5755183 5614598 5565869
18545E565869k95553k42625j34542M5811L34893O02786N68306N60328N27771M52422
$$ 5565869 5270316 5027691 4893149 4938960 5273853 5876639 6444945 7005273 7533044 7985466
18535G985466N25434P18306J165652J559138J882539K485589L530142N043517
$$ 7985466 8510900 9229206 10394858 11953996 13836535 16322124 19852266 24895783
18527B4895783P600403J2138325J9607219K8991988L0651280J1563456j6631882
$$ 24895783 32496186 44634511 64241730 93233718 123884998 135448454 118816572
18520A18816572k6142941j5702599k180954J0412693K3380348L0852047J7885730
$$ 118816572 92673631 76971032 74790078 85202771 108583119 139435166 157320896
18513A57320896j2841292k9625124j8827990n95230J5146057K2214687R904379
$$ 157320896 144479604 114854480 96026490 95431260 110577317 132792004 142696383
18506A42696383j5236484k7090766j8284429m828809P324519J9180701K4522962
$$ 142696383 127459899 100369133 82084704 77255895 84580414 103761115 128284077
18499A28284077R648390k0012242l4867898k6794109j5835322r545079o138734
$$ 128284077 137932467 117920225 83052327 56258218 40422896 30877817 24739083
18492B4739083m247024l083125k344742j584410j001654q73427p19374o35555
$$ 24739083 20492059 17408934 15064192 13479782 12478128 11604701 10885327 10249772
18484A0249772n69412m18548n0911L22792M94615N56239J092291J645781K616683
$$ 10249772 9680360 9261812 9210901 9533693 10028308 10584547 11676838 13322619 15939302
18475A5939302M011790O537025J0818533J5681375J4727879K171169j2258438
$$ 15939302 19951092 26488117 37306650 52988025 67715904 69887073 57628635
18468E7628635j3904794p051339j005532M490764R833414J1764200M570751p338567
$$ 57628635 43723841 36672502 35666970 40157734 49991148 61755348 66326099 58987532
18460E8987532j0791412m411938L733077J1080184J2849406K900429j1833635
$$ 58987532 48196120 43784182 47517259 58597443 71446849 74347278 62513643
18453F2513643j5507319q918068j915009L641151Q962502J0060223J158077j1534779
$$ 62513643 47006324 38088256 36173247 39814398 48776900 58837123 59995200 48460421
18445D8460421j5409439j0673009o033515l655739k580717j796700j251619j061646
$$ 48460421 33050982 22377973 16344458 12688719 10108002 8311302 7059683 5998037
18437E998037q24690n88621k61310m05343l88012j52399j86339k90656l07130
$$ 5998037 5173347 4584726 4323416 3918073 3530061 3377662 3191323 2900667 2593537
18428B593537k99920j91802q569K24296O8290j51077j95896j78010j82230j77536
$$ 2593537 2293617 2101815 2093246 2317542 2385832 2234755 2038859 1860849 1678619 1501083
18418A501083k69381j06513n9337q7132K179P2859J06493K26322J44827p3027
$$ 1501083 1231702 1125189 1065852 978720 980899 1053758 1160251 1386573 1531400 1458373
18408A458373k19393j59352j33473k6122L8201j09170n9111m244L4542J2783r6540
$$ 1458373 1238980 1079628 946155 920033 958234 849064 789953 785709 820251 833034 736494
18397G36494j1436j423l8628j45770O3526j39508n1879L7785O0464j13442j46954
$$ 736494 725058 723635 685007 539237 602763 463255 411376 449161 509625 396183 249229
18386B49229K00855K80715m1287m2916l9756L6548J14243m628j15122K2511J16865
$$ 249229 450084 730799 689512 646596 606840 643388 757631 753003 637881 660392 777257
18375G77257M0524j8998l9193o134J17772J44038m6200j97953k09535J3811N4891
$$ 777257 817781 798783 759590 753456 871228 1015266 969066 771113 561578 575389 630280
18364F30280L4274L13082P0562j13864j6594p1758o0681N3659r1113p6493j25724
$$ 630280 664554 977636 1048198 934334 917740 845982 785301 838960 747847 671354 545630
18353E45630J29975J06237j68115j51804Q9043n2503j13516n9887k1303L5549
$$ 545630 675605 781842 613727 461923 550966 498463 384947 325060 303757 339306
18343C39306O4951K20045J55833k7100R6261j3742J15717J1380j61520n95j04396
$$ 339306 404257 624302 780135 753035 849296 835554 951271 962651 801131 800536 696140
18332F96140k01012L1331q232j22069q1812P8014O5065O3867J05038O040J4536
$$ 696140 495128 526459 518227 396158 314346 392360 457425 521292 626330 632370 646906
18321F46906j37624j59722J3639J43726J19591m5619n1968J32001o5467L6645
$$ 646906 509282 349560 363199 506925 626516 580897 528929 660930 595463 632108
18311F32108J13380K21834N4334l7111K7900K3926m6859K4610M0333j99136k05722
$$ 632108 745488 967322 1021656 984545 1012445 1036371 989512 1014122 1054455 855319 649597
18300F49597k2263l4917K3147P8969K11130Q9045l1344k32864k04636O3894J67988
$$ 649597 627334 592417 615564 694533 905663 994708 963364 730500 525864 589758 757746
18289G57746Q2145P0656M542q8978o0853j81383j55544m9355q11o2204Q60J41294
$$ 757746 839891 910547 915089 826111 765258 583875 428331 378976 378165 315961 316821 458115
18277D58115J49664J35381K11758J30515O5983K6038Q8228J72517R426m8424j88692
$$ 458115 607779 743160 954918 1085433 1151416 1177454 1265682 1438199 1447625 1399201 1210509
18266A210509M0197J90580N2387j92034j93911k05761o3691k4597j33134J8234
$$ 1210509 1250706 1441286 1493673 1301639 1107728 901967 838276 813679 680545 698779
18256F98779n4402j39679r9383j12725J8703J22494M8655l288J7506j11621j29832
$$ 698779 644377 504698 405315 292590 311293 433787 482442 479154 496660 385039 255207
18245B55207L6241Q510o5741Q994N1885J22171K19086J23773J69199k5303j98133
$$ 255207 291448 299958 234217 243211 295096 417267 636353 760126 929325 904022 705889
18234G05889l17324k88518q0251J69459K09518J27982j6462j34113o7479L070
$$ 705889 388565 100047 19796 189255 398773 526755 510293 376180 308701 311771
18224C11771L8658J98061M0444m7720K63529J78205J32920J44041k25570k08291
$$ 311771 350429 548490 588934 541214 804743 982948 1115868 1259909 1034339 826048
18214H26048j16726k9847R2934l4946j64425j45153k3931p4983p295J7095J3898
$$ 826048 709322 679475 772409 737463 573038 427885 403954 328971 321676 338771 352669
18203C52669q3700j21382O3993L6595P7125q9943j8932J4009M9603J8859J84814
$$ 352669 268969 147587 211580 248175 325300 235357 216425 230434 280037 298896 483710
18192D83710J6086j85971j16612j7670R2747Q219O084Q8070Q7512p163j95087
$$ 483710 499796 313825 197213 179543 272290 280509 286593 374663 462175 455012 259925
18181B59925r8933N1226J08108m9255j1200j4044o381R7377R2244L6529m6102
$$ 259925 160992 212218 320326 271071 259871 245827 239446 336823 429067 465596 419494
18170D19494o2597q0150Q6076J87194l3867J5078M5586J5924J21254J14207m1436
$$ 419494 356897 276747 362823 550017 516150 531228 576814 592738 713992 828199 786763
18159G86763M0436J2836j4087j77629K7381L30990J67347J05508k6899m880l4656
$$ 786763 827199 840035 825948 648319 675700 1006690 1174037 1279545 1252646 1247766 1213110
18148A213110r5172Q0109k803l1107l3145J27751J41672n0953k731K3906o716
$$ 1213110 1117938 1198047 1195244 1164137 1130992 1258743 1400415 1349462 1346731 1370637 1363921
18137A363921J44696L76647J51393M0962O1281J45934j3083J3749J21290Q71K93993
$$ 1363921 1508617 1885264 2036657 2077619 2138900 2284834 2271751 2285500 2406790 2407661 2701654
18126B701654N62600M73457L81150M74892N81092Q25291J058573J535778K048987
$$ 2701654 3264254 3737711 4118861 4593753 5174845 6000136 7058709 8594487 10643474
18117A0643474K873939L837863N185519P960946J2663982K1291776L6995658O5600382
$$ 10643474 13517413 17355276 22540795 30501741 43165723 64457499 101453157 167053539
18109A67053539R7221683O9231426l4110102j07145039q1068012m0724843k1176210
$$ 167053539 264275222 333506648 299396546 192251507 111183495 70458652 49282442
18102D9282442j2273326q126091n991166m493985l130653k354452j906370j573541
$$ 49282442 37009116 28883025 22891859 18397874 15267221 12912769 11006399 9432858
18094I432858j327066j206460j048294p36035n76949m88074l95938l49235m75173
$$ 9432858 8105792 6899332 5851038 5115003 4538054 4049980 3654042 3304807 2829634
18085B829634m09341l58452n7643j29934j31862m9598k5065q6763p7641k4298
$$ 2829634 2420293 2061841 2004198 1874264 1742402 1692804 1667739 1580976 1503335 1479037
18075A479037l7366o2396J4120k227j16934o762q8225j22068j23069O8074k4290
$$ 1479037 1441671 1379275 1393395 1391168 1274234 1267472 1179247 1057179 934110 1002184 977894
18064I77894m2564j7851j01700k2063J8542m3450l0515K679R3687J4700J51759
$$ 977894 935330 917479 815779 793716 812258 768808 738293 740972 834659 849359 1001118
18053A001118J0883m445N783P7449k0656j26537m3448k65958j09698n6841k7262
$$ 1001118 1012001 1007556 1013339 1090788 1070132 943595 900147 634189 524491 467650 440388
18042D40388j1984J84964J4194j54248O0785j4288j41410k1869J04438j733j6866
$$ 440388 428404 613368 627562 473314 534099 519811 378401 356532 460970 459237 442371
18031D42371j763n5010j4794n8990N3844l182J3597Q8875P4765p2113P074l1273
$$ 442371 440608 385598 370804 311814 365658 362476 376073 464948 539713 467600 474674 443401
18019D43401l9768k13421J09300L8826n2085l8759r1761J8808N6950J52642J96656
$$ 443401 403633 190212 299512 338338 286253 247494 155733 174541 231491 384133 580789
18008E80789J09309J42554J76378k7567r4175r3763l2930J45430K46796P1510
$$ 580789 690098 832652 1009030 981463 887288 793525 760595 906025 1152821 1224331
17998A224331l4644q6882j45716k8019M6401J84635M306j01539n1438m7141j2723
$$ 1224331 1189687 1102805 957089 929070 975471 1160106 1164412 1062873 1011435 964294 951571
17987I51571M1785J5939L8441q856r6801k03210j64127j03446j7125N2580n7818
$$ 951571 993356 1009295 1047736 1038880 942079 738869 574742 471296 454171 506751 448933
17976D48933o359M9160p004k8064M2584j1917n4774m4837L4217L485j15613P1349
$$ 448933 442574 491734 484730 456666 499250 487333 432559 387722 421939 425424 309811 381160
17964C81160n2902n6041J09400J17383K460R8053J3404P0950R6837J7459l670
$$ 381160 328258 272217 381617 499000 501460 599513 612917 683867 780704 798163 794493
17953G94493q818r8089J33548K18599K18531k7232r0486j31992o419j07689L8808
$$ 794493 785675 687586 821134 1039733 1258264 1231032 1140546 1008554 1002135 894446 933254
17942I33254p3845M5558L8869k2948M1010k6787j32534j36040j04539j9842J00376
$$ 933254 859409 904967 943836 920888 961898 935111 802577 666537 561998 542156 642532
17931F42532K8641m8450j01702m144N8377o9988j08172r6287q2230O2632L5580
$$ 642532 671173 622723 521021 516877 575254 505266 397094 300807 218577 281209 316789
17920C16789J15784N3303Q0411p9894l2740M3465l4202J38969Q8542L7522r1969
$$ 316789 432573 485876 566287 486393 453653 497118 462916 601885 690427 727949 635980
17909F35980j22234p2898o227P8207J29817k7614k4760j3565O5364R9453N3878
$$ 635980 513746 440848 434621 512828 642645 615031 590271 576706 642070 741523 795401
17898G95401o1763j03609q0603N8584p0895n4673N4605m7274p0907j23709m7420
$$ 795401 733638 630029 549426 608010 537115 482442 537047 489773 418866 295157 247737
17887B47737L7896K29993L9631O2716N6688o245k21J4435M6563P2277n0955j5421
$$ 247737 285633 515626 555257 617973 674661 668416 668195 682630 729193 801470 750515 735094
17875G35094K22512L01347K34099J95144j35512l07440j46981K9j8405j7871j50841
$$ 735094 957606 1258953 1493052 1688196 1552684 1245244 1098263 1098292 1079887 1062016 911175
17864I11175j00411l3013J8620N2073m7952j9166m3887O1989N1380N6463O9091
$$ 911175 810764 777751 796371 848444 800492 781326 737439 799428 850808 907271 976362
17853I76362k7788Q5262J49195K05544Q2104j7844J00019L24165L24177J79053
$$ 976362 948574 1033836 1183031 1388575 1470679 1452835 1552854 1877019 2201196 2380249
17843B380249K79771J49898Q863J39712M05809L89848K48811J61164J77567L25629
$$ 2380249 2660020 2809918 2818781 2958493 3364302 3754150 4002961 4164125 4341692 4667321
17833D667321O54743Q13208R83695J310250J698077K428878L551572N288819P831096
$$ 4667321 5322064 6135272 7118967 8429217 10127294 12556172 16107744 21396563 29227659
17824B9227659J2400150J9933639K5143073J6430457m021435j4417795m638618
$$ 29227659 41627809 61561448 86704521 103134978 99113543 84695748 80057130
17817H0057130J1130020K0693109J0389001j6072904l1411556k4656984j4211540
$$ 80057130 91187150 111880259 122269260 106196356 74784800 50127816 35916276
17810C5916276q148495n142714l426519k562424j936928j448463q85323m01998
$$ 35916276 27767781 22625067 19198548 16636124 14699196 13250733 12365410 11963412
17802A1963412o697L25899N22630O55034R25171J533753K374511L725351N749702
$$ 11963412 11956715 12282614 12805244 13460278 14385449 15919202 18293713 22019064 27768766
17793B7768766Q853912J4263250K0848355K0834175P062394r000441q639866N058410
$$ 27768766 36622678 50885928 71734283 92568458 99630852 90630411 81990545 87048955
17785H7048955J8924076K0602891P50817k4013028k6903756j4145068k777621
$$ 87048955 105973031 126575922 127326739 103313711 76409955 62264887 59487266
17778E9487266O843311J6447237K0666261R080778j0369280j5435093l256229
$$ 59487266 66330577 82777814 103444075 112524853 102155573 86720480 83464251
17771H3464251J1048017J6565420L873386j8904535k7581831j9481234j1142974
$$ 83464251 94512268 111077688 114951074 96046539 68464708 48983474 37840500
17764C7840500o643703m031331k360450j163613l61000J75579R83868K600408
$$ 37840500 31196797 27165466 24805016 23641403 23280403 23455982 24439850 27040258
17756B7040258M613412P312579J1610731J8482759K8548511L4443962K3791356
$$ 27040258 31653670 38966249 50576980 69059739 97608250 132052212 155843568
17749A55843568L536291J475118K4593475N2185291N6386843J6889407l8297848
$$ 155843568 159379859 160854977 185448452 237633743 294020586 310909993 272612145
17742B72612145n4823778k8383776M052133J5244576k607382l3605759m8457649
$$ 272612145 217788367 189404591 193456724 208701300 206093918 172488159 124030510
17735A24030510l9673739k4081889j4313907r235231o534976m961520l967094
$$ 124030510 84356771 60274882 45960975 36725744 30190768 25229248 21262154
17728B1262154k857657j974942j544107j164542r24856r52369r41576p32052n06850
$$ 21262154 18404497 16429555 14885448 13720906 12796050 11843681 10902105 10170053 9663203
17719I663203k57151k32353k30220k47521o5317j3890M1482J14236J33625J96388
$$ 9663203 9406052 9173699 8943479 8695958 8630641 8616751 8658233 8772469 8906094 9102482
17709I102482O26164R33603J425691J759303K450349L657769N515672Q676330
$$ 9102482 9728646 10662249 12087940 13847243 16297592 19955361 25471033 34147363
17701C4147363J3861184K1838995K9712808K4754165N276406n953189P064018
$$ 34147363 48008547 69847542 99560350 124314515 129590921 123637732 130701750
17694A30701750K9512284L6191404R804605k9624317m0700460k2390796k339278
$$ 130701750 160214034 196405438 206210043 176585726 135885266 113494470 111155192
17687A11155192J962034j1673927k6017001k4353353j5310675r058264n676567
$$ 111155192 113117226 101443299 75426298 51072945 35762270 26704006 21027439
17680B1027439l911597k893156k271929j734778j311406r90758p18270o03727
$$ 21027439 17115842 14222686 11950757 10215979 8904573 7913815 7195545 6591818
17672F591818m82437p05568n97590n43662m05768l74704k13728j98642m18367
$$ 6591818 6109381 5403813 4806223 4262561 3856793 3482089 3268361 3069719 2651352
17663B651352l34155k21462j64089j06669j4281o5305k21199j17103L045N9152
$$ 2651352 2317197 2095735 1931646 1824977 1810696 1745391 1524192 1407089 1410134 1469286
17653A469286l3760L6078l2091m0417k17330k10359j2278M6945q4867K3108o0514
$$ 1469286 1435526 1471604 1439513 1399096 1181766 971407 959129 1006074 921207 944315 883801
17642H83801O742L8552m1705k4470L7282l6554p6534j03500j07084p256O8667
$$ 883801 890543 929095 887390 862920 900202 863648 787114 683614 576530 569274 637941
17631F37941N4463J9238j12976J6695L0837O6734J9841k00738j35668P4043L5324
$$ 637941 692404 711642 598666 615361 646198 712932 732773 532035 396367 470410 505734
17620E05734L8431n6099j86451j25805j15694j1767M9859J36268j8962j2068J0931
$$ 505734 544165 488066 301615 175810 60116 48349 98208 234476 215514 203446 214377
17609B14377r5175Q1747J10098N4854p5133p4075j14790j14678j05949N6899J07900
$$ 214377 119202 200949 311047 365901 290768 216693 101903 -12775 -118724 -61825 46075
17598D6075P4358O0405K0374J10001j34010j12997l3361J42963J37174j24109
$$ 46075 120433 180838 201212 311213 177203 64206 30845 173808 310982 186873
17588A86873p2097J49351l5451k8678j1039q0804M2790R286R5036j14478j23835
$$ 186873 114776 264127 228676 199998 188959 108155 150945 160231 255267 140789 16954
17577A6954M1078L0722P7137L9654K0883j26929j2414R377k7451Q1746J24367
$$ 16954 58032 88754 165891 205545 226428 99499 87085 96462 69011 150757 275124
17566B75124j14043k40850l0583N2449m1853p0220N903J8432J25047N8369O436
$$ 275124 161081 -79769 -110352 -57903 -99756 -169976 -164073 -145641 -20594 37775 44211
17555D4211l4033R6992J9104m905j9401p3730p5128o3612o8978o7842R2549R3510
$$ 44211 10178 107170 126274 121369 101968 28238 -46890 -110502 -179480 -247322 -154773 -61263
17543f1263n5946Q572L0716j1084J5296R0801J8345M2957o3026j11437o5245J6058
$$ -61263 -117209 -108637 -77921 -89005 -73709 17092 35437 78394 15368 -96069 -161314 -145256
17531a45256l5755P214L7768P8839J14888L6139m4481l0361m1948j51105o0815
$$ -145256 -181011 -173797 -136029 -57190 57698 93837 49356 18995 -22953 -174058 -234873
17520b34873J69392J20005j09411J2352P1095n5945L1694l139P887k4486k6404
$$ -234873 -65481 54524 -54887 -42535 28560 -27385 4309 1170 9057 -15429 -41833
17509d1833p8376j07m8316J4055P0824Q7939O3272o3424n508R8374J50933q0514
$$ -41833 -120209 -120316 -168632 -154577 -83753 4186 67458 4034 -1474 96900 247833 167319
17497A67319n0687p6226m9694o8431K1384j34002k5240M1898o2820M1508P4898
$$ 167319 116632 40406 -9288 -77719 -56335 -190337 -215577 -173679 -236499 -194991 -120093
17486a20093J47832P79m210j91969j46071j1600P0215J5319J1271Q2534N7223
$$ -120093 27739 28518 24308 -167661 -313732 -325332 -255117 -239798 -228527 -145993 -88770
17475h8770k4559J0205O3555L7312L9109q661m456n1932j98821j47706l6439L6896
$$ -88770 -113329 -103124 -39569 -2257 36852 28191 23735 -28197 -227018 -374724 -411163 -374267
17463c74267o858l3824J3822J27795J25326j04453M3375O4991m4033P9426R8299
$$ -374267 -381125 -414949 -401127 -273332 -148006 -252459 -209084 -144093 -188126 -108700 -10401
17452a0401l4348O2629n3917k8397O1464J8731J36839L24745L52982M26332L24386
$$ -10401 -44749 17880 -36037 -64434 -2970 15761 152600 477345 830327 1256659 1581045
17441A581045k1470m81904m18665l00660k53667j9026n7246j37036p5334O4812
$$ 1581045 1559575 1077671 659006 358346 104679 85653 28407 -108629 -183963 -119151
17431a19151N1927r3689J4221J30010J09306p7430j2779n28k196l5361K235L8531
$$ -119151 -67224 -160913 -146692 -16682 92624 15194 2415 1887 -309 -35670 -33435 5096
17419E096m1626m7765K130m0250m9385n3453N8290L8896J3240r7095N0216J13500
$$ 5096 -36530 -84295 -82165 -122415 -171800 -225253 -166963 -128067 -114827 -211922 -161706 -48206
17407d8206k4812P5163l29K7910n6655r4286r097L2307p8444J46577K90365k96
$$ -48206 -73018 2145 1816 29726 -26929 -121215 -130312 -98005 -176449 -29872 260493 260197
17395B60197m3126n7959n9373j03264o2912L6746J8605R1544l4197K8105Q50J915
$$ 260197 217071 159112 99739 -3525 -66437 -29691 -11086 80458 46261 74366 75216 77131
17383G7131m9597o2334m5150k521J5641k15983N0036K45987P1280Q1554k4093
$$ 77131 27534 -34800 -79950 -82471 -66830 -282813 -232777 13210 84490 166044 141951
17372A41951p9956k02330p5147j8990J27950O3046r1181n8928j3410p9780J09601
$$ 141951 61995 -140335 -215482 -234472 -106522 -43476 -134657 -193585 -206995 -286775 -177174
17361a77174k3289j4280l0734J26790P0758o705r5350J63365J96820n8451j82563
$$ -177174 -200463 -214743 -245477 -118687 -47929 -54634 -149984 13381 210201 151750 -30813
17350c0813j11293O2434j4771o4278o4489m8420J0544J31196Q1144m4722j18670
$$ -30813 -142106 -79672 -94443 -158721 -223210 -271630 -261086 -129890 -48746 -93468 -212138
17339b12138J1235J66814j14j39903j76827Q233O3666O7275m1581k0837j49081
$$ -212138 -200903 -34089 -34203 -174106 -350933 -342700 -279034 -211759 -253340 -274177 -423258
17328d23258J48246K958n814N0892n5696k1391Q1531O0651n0511k6156J56909
$$ -423258 -275012 -272054 -277868 -226976 -282672 -304063 -222532 -161881 -212392 -238548 -81639
17317h1639J66352k0688p1420j53047j13163J19777Q6695j9899J14384J27812
$$ -81639 84713 64025 -7395 -160442 -273605 -153828 -67133 -87032 27352 155164
17307A55164p300Q6405p5719n2101j4325l4640P4558M9599q1389L9117M1438K38681
$$ 155164 147864 234269 158550 106449 92124 57484 132042 181641 100252 139369 180807 419488
17295D19488K30435n6171M6295k834j46895r814j01616r1543Q0195k3056l441
$$ 419488 649923 593752 640047 637213 490318 480504 378888 287345 367540 344484 341043
17284C41043J5171j14446j85103q525j29901o2937K7433L2767O1063k742j18697
$$ 341043 356214 241768 56665 48140 -81761 -144698 -117265 -84498 -23435 -26177 -144874
17273a44874K1727K5075p1670N5705k0113M2748N4762J13179J00730N7976J88841
$$ -144874 -123147 -98072 -169742 -114037 -134150 -91402 -36640 76539 177269 235245 424086
17262D24086J15875j992r3129L0087J54418K8919p5896j11705j22190j83482m0373
$$ 424086 539961 537969 444840 474927 629345 658264 582368 470663 348473 164991 124618
17251A24618J58263J51806K5789Q1151r0095q0194l7934R8042K5089M220j3477
$$ 124618 282881 434687 460476 541627 451532 371338 333404 431446 456535 460755 447278
17240D47278j28969n8677l9499n4439M5931l1603j00136n0111q0032J3094J77219
$$ 447278 318309 259632 220133 165694 211625 180022 79886 29775 -50257 -37163 140056
17229A40056K70798J1870j37166o5332R4440p8428J1656K41363K77875J27806
$$ 140056 410854 422724 285558 220226 314666 236238 247894 489257 767132 894938
17219H94938N4416J69966K5906n2571K0810K44543J70795j65757j97035k09371
$$ 894938 949354 1119320 1145226 1092655 1113465 1358008 1528803 1363046 1166011 956640
17209I56640j73053m2317p3926k20908k51059j33087J3010l9669J1105j22780
$$ 956640 783587 741270 667344 446436 195377 62290 75300 35631 46736 -76044
17199g6044p594J39795j05544o3818J9850j70190J76507J21438k6975j62740m4602
$$ -76044 -83638 56157 -49387 -113205 -93355 -263545 -87038 34400 7425 -155315 -199917
17188a99917J98320L4157j79153N1752K21829P7308L6218r3660O3656K7708k635
$$ -199917 -1597 32560 -146593 -94841 126988 204296 240514 146854 210510 238218 235583
17177B35583p5575m6181l2568l1488K2247j5548M5361K83180J30031k7149O5013
$$ 235583 160008 113827 81259 49771 72018 56470 101831 385011 515042 487893 552906
17166E52906J17705K3608k7835Q0589K866R2153M1421j04108j72446j24661l9172
$$ 552906 670611 694219 666384 746973 749839 841992 883413 779305 606859 482198 443026
17155D43026q531l0602j33797o4361r3104j19748q4326M4838J32467p4821k5654
$$ 443026 434495 403893 270096 205735 112631 -7117 -91443 -46605 85862 11041 -14613
17144a4613o5612j1775J12488J14932m6309o5706J10384J03693p6513j2800q1699
$$ -14613 -80225 -92000 20488 135420 89111 23405 133789 237482 160969 148169 66470
17133F6470r0401j16808Q5911K3764O8429L311j03772J4694O2655R9439l7718
$$ 66470 -23931 -140739 -54828 -31064 37365 40676 -63096 -48402 14253 113692 75974
17122G5974j29665j01353n1589N5846O4164N8919r067q0805p7747P4112J9549
$$ 75974 -53691 -155044 -206633 -150787 -86623 -27704 -36771 -117576 -195323 -121211 -101662
17111a01662o6701k8204M0360J220R4409o785M3337Q0549o3690l0552K3250N276
$$ -101662 -168363 -196567 -156207 -154987 -60578 -67363 -24026 56523 -7167 -37719 -14469 -9193
17099i193N0324N9914p3866K3703N7457n5446o5599Q168q0597n0627J28198J35077
$$ -9193 41131 101045 27179 50882 108339 52893 -12706 -4538 -85135 -135762 -7564 127513
17087A27513l3848j50400j38698j35398k2561O7420P1431R9636j5112m1572m9851
$$ 127513 93665 -56735 -195433 -330831 -353392 -285972 -214541 -114905 -130017 -171589 -221440
17076b21440P9292K33842K02325r588j44445k47884k01730R007J75087Q8793J9530
$$ -221440 -142148 91694 294019 284431 139986 -107898 -309628 -300621 -125534 -36741 -17211
17065a7211P1984j63643q3376O9365K7012n9611J36818J53252j64959k25549j6045
$$ -17211 54773 -108870 -192246 -122881 -95869 -155480 -18662 134590 -30369 -255918 -271963
17054b71963p2785Q5328J08464p7954j25460Q8987J00489J13263P2976m1935k8101
$$ -271963 -344748 -259420 -150956 -228910 -354370 -265383 -164894 -51631 21345 -20590 -48691
17043d8691J44610J442j24115j1291p8846N367L9526P2332J7987q0629p8271O4113
$$ -48691 95919 97361 -26754 -38045 -116891 -111524 -71998 334 18321 -62308 -140579 -76466
17031g6466Q4539R6737P3354j4445j78749P558j32355m0076J71958R4631j47006
$$ -76466 8073 104810 178164 163719 -15030 -7472 -139827 -179903 -7945 86686 -60320
17020f0320o2312J29820J04198p2462n7009M5551p875m7341P7853m3473n2203
$$ -60320 -122632 7188 111386 38924 -18085 27466 19591 -27750 50103 6630 -45573
17009d5573P1151r5578r5793q4230o0068J69120J00523j06615K7835J6359p7269
$$ -45573 25578 -70000 -165793 -250023 -310091 -140971 -40448 -147063 -119228 -102869 -180138
16998a80138k2828P2829m5033j145l4387J04521N8112M1580R4479k2242k23199
$$ -180138 -202966 -130137 -175170 -176315 -210702 -106181 -48069 -6489 87990 65748 -157451
16987a57451j57332R9320P3709j4638j6994R4179Q1499O3996K4260j8616o2231
$$ -157451 -314783 -215463 -141754 -156392 -173386 -79207 2292 66288 90548 71932 9701
16976I701M6609j07023l9731m9879J74626J40824n4812m6144m3781R1034P8392
$$ 9701 56310 -50713 -90444 -140323 34303 175127 120315 74171 30390 121424 199816
16965A99816n8468n2465j45788l0229J22739Q1705j24058j32214n3764j16829
$$ 199816 141348 88883 -56905 -87134 35605 117310 -6748 -138962 -192726 -309555
16955c09555l9398P486j0986N8700J33594J86234K7836l190j28277l7758N8510
$$ -309555 -348953 -341467 -352453 -293753 -160159 26075 53911 50721 -77556 -115314 -56804
16944e6804m9148P521J00209P0254n9878l0396j14543j1681l5735m9751R2195
$$ -56804 -105952 -98431 1778 72032 12154 -18242 -132785 -144466 -180201 -229952 -137757
16933a37757O6569l7920O2984J70969j9140n7330j2599l7916m6501m3762k6823
$$ -137757 -71188 -109108 -46124 124845 105705 48375 35776 -2140 -48641 -92403 -119226
16922a19226O0147K9004K6048l2763J29041n451l4481r8004O8102j2217r1902
$$ -119226 -59079 -30075 -4027 -36790 92251 86800 52319 -45685 22417 10200 -81702
16911h1702O40M5519m4685J2580j9015J058O2801J46071k7599j3350k743n074
$$ -81702 -81062 -35543 -80228 -67648 -86663 -85605 -22804 123267 95668 82318 79575 74501
16899G4501j84581J478m9493k7830o7119L3M9322j0912L1064r5799k7162R6826
$$ 74501 -110080 -108602 -158095 -185925 -253044 -253011 -203689 -214601 -183537 -279336 -306498 -209672
16887b09672J40921R0463r7235j514R962P3452N909J20636Q7886N1904n4723j33281
$$ -209672 -68751 21712 -75523 -77037 -67075 6377 12286 132922 220808 272712 217989 84708
16875H4708K4944J4421p8309j99235M671N9832J00291o906k7955O56M5862m352
$$ 84708 109652 124073 45764 -153471 -148800 -88968 11323 4417 -23538 -22882 22980 18628
16863A8628j62555m5904j07935q6380J10922Q7644M6511M5231j9677L5634m7265
$$ 18628 -143927 -189831 -297766 -384146 -273224 -185580 -139069 -93838 -113515 -77881 -125146
16852a25146j7921K5385O5919j0031l1182J38724n5463j6289j6584P0446j08903
$$ -125146 -143067 -117682 -51763 -61794 -92976 45748 -9715 -26004 -42588 27858 -81045
16841h1045J5860J7184K7306p775J0703L9372J48392j82114q6148j2690q2994
$$ -81045 -65185 -48001 -20695 -28470 -17767 21605 169997 -12117 -98265 -110955 -193949
16830a93949l7197P3532L5496L6660j58509j0604J26366J80391m5167q3253o9115
$$ -193949 -231146 -157614 -122118 -85458 -243967 -254571 -128205 52186 7019 -76234 -145349
16819a45349O2716O1989q5891j39681R4557K24176l9662j88192K07353J73363
$$ -145349 -82633 -20644 -106535 -246216 -151659 72517 32855 -155337 52016 225379
16809B25379k8532j24948r8238m3296O905j5399j26182J26088P7028N6149k909
$$ 225379 196847 71899 -26339 -69635 -62730 -78129 -204311 -78223 -1195 54954 52045
16798E2045o2740q9028l156L0710k9603M2794q1642o2803M3456k0288j02506M591
$$ 52045 -10695 -99723 -102879 -72169 -101772 -58978 -140620 -203423 -159967 -180255 -282761 -278170
16786b78170J13601J84935J1258j26795m305K6310l6120q6245K34905J62674n9984
$$ -278170 -164569 20366 31624 -95171 -99476 -73166 -109286 -195531 39374 202048 142064
16775A42064k13679k3034q0143R6Q8688k9711m4847J33213j06989q3582P2926
$$ 142064 -71615 -94649 -174792 -174696 -86008 -115719 -160566 -27353 -134342 -217924 -144998
16764a44998J22783J61881q3337N3346o71p3698m7312j9097q726L4596m6698j38500
$$ -144998 -22215 139666 56329 109675 109004 35306 -12006 -31103 -39829 -5233 -51931 -190431
16752a90431J47M468L4173j05957r8767J52569R4138p029M5904K0536l3662N6551
$$ -190431 -190284 -185816 -151643 -257600 -356367 -203798 -109660 -116689 -70785 -50249 -83911 -27360
16740b7360K5655O693Q3094J31335j00656n4497J5781m3298l9815j93562P1469
$$ -27360 -1705 4988 88082 219417 118761 64264 80045 36747 -3068 -196630 -125161
16729a25161K75904J71665p7285n8847j93630r6527K2732J13687N6166m6632p2544
$$ -125161 150743 322408 245123 186276 -7354 -103881 -81149 32538 88704 42072 -30472
16718c0472R4888o8521p8485j53463r7511k7171Q2436J00616Q2092J12372J10092
$$ -30472 64416 -4105 -82590 -236053 -333564 -360735 -278299 -177683 -95591 16781 126873
16707A26873J7791l0353J0647K3267n4108k0646j3068j86635j26799L0939L6763
$$ 126873 144664 114311 124958 148225 94117 73471 60403 -126232 -253031 -222092 -185329
16696a85329O0799k2981P7144K0569P7837j0521K2238J9865K5965n5444j08198
$$ -185329 -124530 -147511 -70367 -49798 28039 17518 39756 59621 85586 30142 -78056
16685g8056J4967j00207o8847j8441N8205J41799J20903j25404j0197k5430q9585
$$ -78056 -63089 -163296 -232143 -250584 -192379 -50580 70323 -55081 -65278 -90708 -180293
16674a80293O4854J36472J56206j8389j83887R12k5072K18671Q5607J7118p9836
$$ -180293 -115439 21033 177239 158850 -25037 -24125 -49197 169474 255081 272199 192363
16663A92363j40141r0228L457M595j36292m0269p8734J00601J7528q177J59955
$$ 192363 52222 -38006 -34549 -29954 -166246 -206515 -285249 -184648 -167120 -175297 -15342
16652a5342R9093p9341K5224J13065R3205m2858m1855R5412k298k3207J6640r4551
$$ -15342 83751 4410 29634 142699 235904 193046 151191 246603 244305 221098 237738 143187
16640A43187j40247J54372Q2555m139m3739r9380l7452r8430N0004N4287k0425
$$ 143187 2940 157312 239867 235728 191989 92609 55157 -43273 6731 61018 40593
16629D0593k3321M451j02940O1283m819P867L3062O7729L2535k2777J07304j00756
$$ 40593 17272 21723 -81217 -19934 -24753 -16886 16176 83905 116440 93663 200967 100211
16617A00211k03045R0838J58310q6038l6155o3578p188j9195j7718O0777J06436
$$ 100211 -102834 -11996 146314 60276 24121 -39457 -46645 -65840 -83558 -22781 83655
16606H3655K1225n4362K9357N5169q5880j02191j40016r7523k245L0406O0832
$$ 83655 104880 50518 79875 135044 49164 -53027 -193043 -290566 -292811 -262405 -201573
16595b01573j4429p7501j09487P1941J51770O2174K9461l972n817N3506K7323
$$ -201573 -216002 -293503 -402990 -331049 -179279 -117105 -87644 -91616 -97433 -43927 -16604
16584a6604L0722M9025j0430k3849M9231M8139j01883q9341n0058p8649j9431
$$ -16604 14118 63143 52713 28864 78095 126234 24351 -64990 -115048 -193697 -213128
16573b13128N9034J37004J40074N2476n9395p1185J4671q8459q3237p3504L9112
$$ -213128 -154094 -17090 122984 175460 116065 44880 59551 -28908 -112145 -185649 -146537
16562a46537j14075j00696R6795K29461M8520L8971j21380p0976J35423M224q7200
$$ -146537 -260612 -361308 -264513 -35052 13468 52439 -68941 -139917 -4494 -270 -87470
16551h7470j23912j24547J5315J46302M6312M7745m4356j06680j9517k781J2741
$$ -87470 -211382 -335929 -320614 -174312 -128000 -80255 -124611 -231291 -250808 -253589 -240848
16540b40848J28416J34709N7250m0446j80918q0438J3499M330j19090J36526R0712
$$ -240848 -112432 22277 79527 39081 -141837 -222275 -208776 -204446 -323536 -187010 -96298
16529i6298O0523j55111j1332K6953j8317J8873P2916K8838q7117N5147R8982
$$ -96298 -35775 -190886 -202218 -175265 -193582 -174709 -101793 -72955 -160072 -104925 -5943
16518e943J00923o1208M519q4851j32286o0666J34452k1923j36271l3210P3814
$$ -5943 94980 33772 38291 -46560 -178846 -239512 -105060 -126983 -263254 -296464 -222650
16507b22650j67807j32800j8009J74616K9223J03279O7229m575p5279o5278O1117
$$ -222650 -390457 -523257 -541266 -366650 -337427 -234148 -166919 -171494 -246773 -312051 -250934
16496b50934k910N0823J8779r5169l5242J06966J32751M617K1931N0711k4521
$$ -250934 -253844 -203021 -184242 -279411 -314653 -207687 -74936 -70319 -48388 2323 -22198
16485b2198n2270j7187Q2781R7001K5104Q308K3142L3082Q903j4928m3897l4195
$$ -22198 -74468 -91655 -8874 88127 113231 121539 144681 177763 186666 171738 127841 93646
16473I3646L9282l8115l561N8976M811j9212r8515m1520O2965m805o4730o2600
$$ 93646 132928 94813 91252 150228 155039 135827 37312 -4208 58757 53952 -10778 -73378
16461g3378L5663j8300q7284N5232J41714O119n8973k37696O0287J07782L703
$$ -73378 -37715 -56015 -143299 -88067 53647 59766 793 -236903 -176616 -68834 -65131
16450f5131L7538L5166o4932M1207P4589J17792j04674k4085k471R89p852j30251
$$ -65131 -27593 7573 -57359 -16152 58437 176229 71555 47470 44999 45988 38136 -92115
16438i2115P5614N9856r5525J68066K0976o9383m0657k1342N59k9032l9444J41820
$$ -92115 -16501 43355 -52170 115896 136872 67489 26832 5490 6049 -22983 -62427 79393
16426G9393N8844p2219J4552N1274Q4074m2118L95q6912j93184j48815Q0115J0986
$$ 79393 138237 66018 80570 131844 215918 173800 174195 87283 -105901 -254716 -174601 -163615
16414a63615Q2201J20008j04917j15792O5764J14306J12411j41370n372R4808
$$ -163615 -81414 38594 -66323 -182115 -116351 -2045 110366 -31004 -36376 58432
16404E8432O4946n768j47983k3837r5682o8458q5302j15642O7262K7023L3715
$$ 58432 123378 117610 -30373 -54210 -149892 -218350 -303652 -419294 -352032 -325009 -291294
16393b91294K09212R7976o2459j5998o6578j56441o9080p2654J22435Q2798M4579
$$ -291294 -82082 15894 -46565 -62563 -129141 -285582 -354662 -427316 -304881 -222083 -177504
16382a77504n1975k4627J11905M2210j9912j6277j6289j5378r0546n265J78141
$$ -177504 -229479 -254106 -142201 -99991 -119903 -136180 -152469 -167847 -258393 -263658 -85517
16371h5517m9197o0786J7395R0230r8726m9509J5790Q5446K1805j08388k6778
$$ -85517 -134714 -195500 -178105 -87875 -186601 -236110 -220320 -134874 -113069 -221457 -248235
16360b48235J02757J03676O0012J957j1928K730K4119M4743P343N748j9680J2161
$$ -248235 -145478 -41802 18210 20167 8239 10969 35088 79831 87174 92922 73242 85403
16348H5403j07369K7228o3226j56393n1601L4059J16941J33278j2763k7253M5409
$$ 85403 -21966 5262 -57964 -214357 -265958 -231899 -114958 18320 5557 -21696 23713
16337B3713K035k0568J7402M2633K8650n9254q5614k8003K6809N275J50655q4833
$$ 23713 25748 5180 22582 65215 93865 34611 -51003 -79006 -52197 -46922 103733 18900
16325A8900l0121N2545j06460L257N9027L852K3856o7336j0161p1659j701R311
$$ 18900 -11221 41324 -65136 -61879 -2852 1000 24856 -42480 -52641 -124300 -126001 -116690
16313a16690n4090j36307p6779Q0694J01019J1761J06529J38986n4944J6272M1621
$$ -116690 -170780 -307087 -383866 -303172 -202153 -190392 -83863 55123 179 16451 58072
16302E8072K8427q058j8179n4537l9789p4070q69p3297R8054K8022L017J54736
$$ 58072 86499 78441 60262 5725 -34064 -108134 -109003 -182300 -84246 -56224 -53207 101529
16290A01529o610k747J05512n2513L5472p31r7095p8720K6602k7019P5977Q5433
$$ 101529 94919 92172 197684 145171 180643 179912 82817 4097 30699 3680 79657 165090
16278A65090j03162M5485K3296l892N5152K0208j45753k26695p017P7183J00056
$$ 165090 61928 107413 130709 126817 181969 202177 56424 -170271 -177288 -100105 -49
16267d9K9200R7108l7220j48426o4482j9433O9837m3581p2792L2275O2556J71713
$$ -49 29151 126259 89039 -59387 -123869 -143302 -73465 -117046 -189838 -157563 -95007 76706
16255G6706K6799m7237j72832n4352P8503J05517J10614l8020j50694M832k8786
$$ 76706 103505 56268 -116564 -170916 -92413 13104 123718 85698 -64996 -60164 -88950
16244h8950M1394L2606Q3505k24717L1005O3237n9027O261J137M7632O3961n9507
$$ -88950 -47556 -14950 68555 -156162 -125157 -61920 -120947 -114686 -113549 -65917 -1956 -61463
16232f1463J1942j7846P009M2157K9840O5347j4961n7446J529n7884J8220m4235
$$ -61463 -49521 -67367 -60358 -18201 11639 76986 62025 4579 6108 -51776 -33556 -77791
16220g7791j18705R5245K73043L8468j35495p7559M1080j2793l4308n6471J1196
$$ -77791 -196496 -101251 171792 210260 74765 -2794 38286 25493 -8815 -65286 -54090
16209e4090M095Q7776p819o3906j1591J146K1237J032m0175m4933k2714o2965
$$ -54090 -49995 37781 29962 -33944 -45535 -44389 -23152 -22120 -62295 -107228 -129942 -192907
16197a92907P8026P2029j57618o674J72431N4816M9419J20566o920l8632j87082
$$ -192907 -114881 -42852 -200470 -207144 -34713 20103 69522 190088 183168 144536 -42546
16186d2546j18466p944O9611K7638k2763p1796O0398J02895K9459l3185r2376
$$ -42546 -161012 -168956 -99345 -71707 -94470 -166266 -105868 -2973 26486 -6699 -99075
16175i9075l517N6354L9333M3668L1399P636L2360J05997j52005o764n7601j84484
$$ -99075 -102592 -46238 -6905 36763 68162 75798 108158 214155 62150 55386 -2215 -186699
16163a86699r6760J14651J34813L6676j15593P6223l0944j01131n7539J14184
$$ -186699 -283459 -168808 -33995 2681 -112912 -36689 -67633 -168764 -226303 -112119
16153a12119J60636p5859n5927K9972j02311P6137J30686m8614L36M6766M7674
$$ -112119 48517 -27342 -83269 -53297 -155608 -79471 51215 2601 2937 49703 97377
16142I7377j54059q6793O4082K3091K2876o6072l1722j0374n1238j30648R7667
$$ 97377 -56682 -143475 -79393 -56302 -33426 -99498 -131220 -141594 -192832 -323480 -225813
16131b25813O5406R6486m6472R571Q2979k8530K3906q467R524M887J4168o0909
$$ -225813 -160407 -63921 -110393 -100822 -17843 -46373 -22467 -30934 -21410 -16523 -2355 -63264
16119f3264j7474k3187o1105P800n2725k1078k202j11147M6985Q1377L2538K1260
$$ -63264 -80738 -103925 -165030 -157230 -209955 -231033 -233235 -344382 -297397 -216020 -183482 -162222
16107a62222O9293M0465M6168N9159N4332j24888J3591j0265K3611R1582P7576
$$ -162222 -92929 -52464 -6296 52863 107195 -17693 -4102 -14367 9244 100826 178402
16096A78402j67433j16668m1325O9094J31703L2908j30051M1441N0568N3850j61560
$$ 178402 10969 -105699 -147024 -77930 53773 86681 -43370 -1929 48639 102489 -59071
16085e9071N5501J7831M9992K7648K6351l1497j9742k4709r0948o9143l7262N4931
$$ -59071 -3570 14261 64253 91901 118252 86755 67013 42304 -48644 -117787 -155049 -100118
16073a00118K3108j17513K3370O1071k2345r6131k0565K19740j1563j0872K5988
$$ -100118 -77010 -194523 -171153 -110082 -132427 -228558 -249123 -29383 -40946 -51818 -25830
16062b5830Q7489n469j13102p3740L450l800J59807q7587J7650M1806q0585r930
$$ -25830 61659 56190 -56912 -130652 -127202 -131002 28805 -58782 -41132 674 -79911 -89841
16050h9841k4729J1734J12770J25949O4506J34724k9245k19598j27244j25771
$$ -89841 -114570 -102836 9934 135883 200389 335113 305868 86270 -40974 -166745
16040a66745m5864M6006J23183L3864j10529j8929j564k7413n4659k2073M7974
$$ -166745 -212609 -166603 -43420 -9556 -120085 -139014 -140578 -167991 -222650 -244723 -196749
16029a96749L8357J17260K3527J6800n4640n3247J57479Q7330o5460j24331L5053
$$ -196749 -158392 -41132 -17605 -805 -55445 -108692 48787 136117 70657 -53674 -18621
16018a8621J83068k4133P7553J8173k8189N260j01266M8618m0091j62091j44879
$$ -18621 164447 140314 217867 236040 207851 213111 111845 160463 120372 -41719 -186598
16007a86598Q6079M2736O226J14325M6274j06949k11783n2371O5287N8486j09448
$$ -186598 -100519 -57783 -51557 62768 109042 2093 -209690 -262061 -196774 -138288 -247736
15996b47736n9273j1243M3569o4647L9798O2429l1408P2276J51456p5738p76J0662
$$ -247736 -307009 -318252 -274683 -339330 -299532 -237103 -268511 -196235 -44779 -120517 -121293 -110631
15984a10631k9063J0569o1248q9082J9301J60622J34796m6880o1912l786K3079
$$ -110631 -139694 -129125 -190373 -279455 -260154 -99532 35264 -11616 -73528 -77314 -54235
15973e4235J4061o0949O4091m8236n2623j9469Q9969M2350q3924o4303N5279J32088
$$ -54235 -40174 -101123 -37032 -85268 -137891 -157360 -67391 -25041 -108965 -173268 -117989 14099
15961A4099K4854N8020K02870N7457m5318j97153m4872K0789K9544N7810k692
$$ 14099 38953 96973 299843 357300 311982 114829 69957 90746 120290 178100 175408
15950A75408O5024K1110n0930o4812j00090K1975j64568q5142K2280J41106J80310
$$ 175408 240432 261542 210612 145800 45710 67685 -96883 -182025 -159745 -18639 161671
15939A61671J4482j22474l4009l8033N162n8396L6994m6032j95583j04400R2168
$$ 161671 176153 53679 19670 -18363 -13201 -71597 -34603 -80635 -276218 -380618 -288450
15928b88450J66665Q6818K5213O9836J01394K5873o492j667p3501Q2981K916r3198
$$ -288450 -121785 -34967 -9754 60082 161476 187349 180857 179190 105689 188670 191586 98388
15916I8388J5264M7681j1527k0254q286N403P6971J9846l870j55455l4298l7616
$$ 98388 113652 161333 149806 129552 121266 126669 203640 223486 219616 64161 29863 -7753
15904g753n4072P7624R887k47238o8037Q1358M1956M8719R2801J25609R0913J2217
$$ -7753 -61825 15799 25686 -221552 -289589 -208231 -166275 -117556 -24755 100854 191767 203984
15892B03984q0093j38694M7062q0957j06193o5306J19657o7605N8106R22M3500
$$ 203984 123891 -14803 32259 -48698 -154891 -220197 -100540 -168145 -110039 -109117 -65617
15881f5617R9732N4241N7745j69690j12481R2135r5467O384j24145j5403P2177
$$ -65617 34115 88356 146101 -23589 -136070 -43935 -139402 -133018 -257163 -272566 -200389
15870b00389J07798j9390M966j5279j14844r723l6911J55357K25897P7569k3097
$$ -200389 -92591 -111981 -107015 -122294 -237138 -246861 -283772 -128415 97482 175051 151954
15859A51954o6663j12506j2795L1471P997l6808O140j11190j21338J43396J14928
$$ 151954 85291 -27215 -40010 -8539 -542 -37350 -31210 -142400 -263738 -120342 -5414
15848e414J45570J4113M9916j42890o182r0141j16773J16866M2399L1909L9427
$$ -5414 140156 154269 204185 61295 55113 -35028 -151801 -34935 7464 39373 78800
15837G8800N920K7484n546p6655j9370M56m9907j07181p8217J8078M6682R9238
$$ 78800 84720 112204 106658 30003 10633 11089 -38818 -145999 -224216 -206138 -159456 -60218
15825f0218L2934J06711L7932r0123m2157J49217j1033j40268o6258l5857L9000
$$ -60218 -27284 79427 117359 27236 -14921 134296 123263 -17005 -83263 -119120 -80120
15814h0120J65829j16294o5572P3643m9959o8966J08644N6474J08302j30220l6759
$$ -80120 85709 -30585 -96157 -22514 -72473 -141439 -32795 23679 131981 1761 -34998
15803c4998R1582j22688N1169o0679j27499O2500R9170J41607K6271p7785n4983
$$ -34998 56584 -66104 -14935 -75614 -203113 -140613 -41443 100164 126435 48650 -6333
15792f333R5668K0333j55482j29228O4947K13563J5406J34961k9662j04166j34281
$$ -6333 89335 109668 -45814 -175042 -110095 103468 118874 253835 224173 120007 -14274
15781a4274m6071p3282J06667k0993M5205j44486J0260J06992Q8516R7436N627
$$ -14274 -60345 -133627 -26960 -47953 -2748 -147234 -136974 -29982 58534 155970 161597
15770A61597L428J8709r0806J18915k3124j0188j03296j25888R2730j57766r0348
$$ 161597 165025 183734 92928 211843 188719 178531 75235 -50653 42077 -115689 -206037
15759b06037l3167Q1582P242j06838K2085p7696p502M802N7800J58403Q8418M5885
$$ -206037 -239204 -157622 -150380 -257218 -235133 -312829 -320331 -315529 -257729 -99326 -10908 34977
15747C4977k5031p9930M9539o5744j74636J89487L7480k4144J75087J01332j2347
$$ 34977 9946 -69984 -20445 -86189 -260825 -71338 -33858 -58002 117085 218417 206070
15736B06070n7762j10983m0804m7652n1778k3494J59754K36480J16118j52070
$$ 206070 148308 37325 -3479 -51131 -102909 -126403 33351 269831 385949 233879
15726B33879k51656O1862K30291r7740j01021p2941k5457l661m616k2838j52532
$$ 233879 -17777 44085 274376 176636 75615 2674 -22783 -26444 -31060 -53898 -206430
15715b06430p5564j2609J03311K23618R7391j41513l6523K5337J02365N0283p4129
$$ -206430 -281994 -294603 -191292 32326 129717 -11796 -48319 -22982 79383 129666 55537
15704E5537j6082M30n0778K6076m5769j8010j47925N4917R0686J10952J88879
$$ 55537 39455 39885 -10893 15183 -30586 -48596 -196521 -141604 -50918 60034 248913
15693B48913O4760j661j41576o0638j9598N2802o2292N184j28259o2521r4451
$$ 248913 313673 312012 170436 109798 90200 143002 80710 85894 -42365 -104886 -199337
15682a99337j00021J02544Q4408M3902L3952J130o5172k5410P7714Q1598l987
$$ -199337 -299358 -196814 -112406 -68504 -34552 -33422 -98594 -124004 -46290 35308 31321
15671C1321M5912R2902p2938k08524l2238K5919l8004p652J0349N3361K5414n2303
$$ 31321 77233 170135 97197 -111327 -143565 -117646 -155650 -163302 -152953 -99592 -74178 -126481
15659a26481J8748K4811J2029L3346m00O8427j2909L2767J47971l6447o2362n3322
$$ -126481 -107733 -82922 -70893 -37547 -37947 30480 17571 50338 198309 161862 99500 46178
15647D6178o8188K0250K196l1428k0515r0560k4747J1569p0301P8527J73577p1760
$$ 46178 -22010 -1760 436 -30992 -51507 -142067 -166814 -155245 -225546 -147019 26558 -45202
15635d5202l3655P9306R4077k3060p5366K613J04421N8436K2621J0183q0583O2248
$$ -45202 -78857 449 94526 71466 -3900 -1287 103134 161570 184191 194374 113791 176039
15623A76039L6357q6004j16538k7254q9299j4134l1355N9775J23371L7012K1037
$$ 176039 212396 126392 9854 -17400 -106699 -120833 -152188 -92413 30958 67970 89007
15612H9007j70746m6086J62104J50250p5594k9731l8097m4396l1528J0024l2633
$$ 89007 -81739 -127825 34279 184529 108935 79204 41107 -3289 -34817 -24793 -57426
15601e7426j5085P1879Q2600N812J8954N5025o4106q1610l6416p3117M8542k0501
$$ -57426 -72511 -632 81968 87780 106734 161759 97653 16043 -20373 -93490 -44948 -65449
15589f5449J25743R1928p3645M4339j49797L711j9012j2084p0158K0906j1455
$$ -65449 60294 152222 78577 122916 -26881 -23170 -42182 -54266 -124424 -103518 -114973
15578a14973n4587J4603J57660J72023M1397k30612K2905K9388O924J3508J39763
$$ -114973 -169560 -154957 2703 174726 216123 -14489 8416 37804 44728 58236 197999
15567A97999J12910O7534m1531r1679O112k7126k7171j13055L033O9598N6699
$$ 197999 310909 378443 336912 245233 251345 224219 197048 83993 87026 156624 213323
15556B13323R9031k59112k38949k1757l7177L4858N4115O9584J2154k3746j18686
$$ 213323 312354 53242 -185707 -207464 -244641 -209783 -155668 -86084 -73930 -97676 -216362
15545b16362o563O3349J67j11119K7514K83102R9384J6372r6455n5801j12079
$$ -216362 -222925 -159576 -159409 -270528 -243014 40088 139472 155844 59389 3588 -108491
15534a08491R8644J64984k5529r1131k9196J00288m085n0042k50117q7169K198
$$ -108491 -9847 155137 129608 38477 9281 109569 105484 55442 -194675 -281844 -279646
15523b79646k1968Q2868J8823J7143J50341R2866o157k1817o7996o0231N4950
$$ -279646 -301614 -218746 -199923 -182780 -32439 60427 54270 32453 -35543 -95774 -40824
15512d0824R7830j1879L4752p3133j4100o5216l7663J6626P510Q0267j5973o4873
$$ -40824 57006 45127 79879 6746 -7354 -72570 -110233 -93607 -86097 -5830 -21803 -86676
15500h6676k40178R3356L5610J7186j4507O2186K16186L589l9910m776j64007
$$ -86676 -326854 -233498 -197888 -180702 -195209 -133023 83163 86752 46842 42066 -121941
15489a21941l5637O3101J5867j362j6523l1738n5311q3731j24028k9284J06307
$$ -121941 -157578 -94477 -78610 -79972 -96495 -128233 -183544 -267275 -391303 -420587 -314280
15478c14280J14734M2092k0892O1836P3045J79659m5174j92649j52606R1815J58354
$$ -314280 -199546 -157454 -178346 -116510 -43465 136194 91020 -101629 -254235 -162420 -4066
15467d066o0160M5736Q8006J0220m1047J9363L4535r1297n072R515J5088J28428
$$ -4066 -64226 -18490 69516 79736 38689 58052 92587 1290 -3782 5733 20821 149249
15455A49249J56266j49431j03048J1530m1822n5832N2957M0330K377j70263j3078
$$ 149249 305515 156084 53036 64566 22744 -33088 19869 60199 62576 -107687 -120765
15444a20765J09285K0684n2017K7733K9430q4359K8388R774M4217N2224L2636
$$ -120765 -11480 9204 -42813 -15080 14350 -70009 -41621 -31847 12370 64594 97230
15433I7230M4717L3375j33923m9768k944p570j32822l372K45885J97889k4996
$$ 97230 141947 175322 41399 -8369 -11313 -18883 -151705 -155077 90808 288697 263701
15422B63701k18805l790m3074L7086o516j57941n7854K4905J30710r2928r9083
$$ 263701 44896 41106 -1968 35118 28602 -129339 -187193 -162288 -31578 -124506 -223589
15411b23589Q2458O7359l1158M043K829j45315l0542J44730J58183N3675p6934
$$ -223589 -141131 -73772 -104930 -100887 -98058 -243373 -273915 -129185 28998 82673 5739
15400E739q8922o545j25067J36823K3505K9573Q4528k5951J03344m7127r752p8674
$$ 5739 -83183 -89728 -214795 -77972 -54467 -24894 59634 33683 137027 89900 80148 1474
15388A474j34977k7461O8311J66595N7639m067J28680j5459M015r0148k64596
$$ 1474 -133503 -160964 -92653 73942 131581 127514 256194 240735 244750 154602 -109994
15377a09994k14990M9236J43675P7362R3772J01832M116j55428J5748P397J29291
$$ -109994 -324984 -275748 -132073 -54711 39061 140893 145009 -10419 5329 12726 142017
15366A42017P9355j43998n6074M6450O874m2802q6000l1172j1296o4150j07530
$$ 142017 221372 77374 21300 67750 74624 31822 -54178 -85350 -96646 -160796 -268326
15355b68326J10354P0457R4418M0011K7359M119L6584P545j22696J811K9702k7279
$$ -268326 -157972 -87515 6903 46914 74273 78392 114976 122521 -175 1636 31338 4059
15343D059j9563J30167j2081q823k2409o4157o6218j36226M8042K3293J00202
$$ 4059 -15504 114663 102582 93759 71350 7193 -59025 -195251 -147209 -123916 -23714
15332b3714L3147n7327J8644r9650o9826K38804K628k01065n2076M0790O1870
$$ -23714 9433 -47894 -29250 -128900 -198726 40078 42706 -158359 -210435 -169645 -107775
15321a07775J3995J08958O6530O5139P8182j34245m2380N4554Q1862j45j73510
$$ -107775 -93780 15178 81708 146847 225029 90784 48404 102958 184820 184675 11165
15310A1165o5702M0944m215J6066O4250j4524M3723O5292K9775L8207j09364j26960
$$ 11165 -54537 -13593 -17808 -1742 62508 47984 91707 156999 186774 224981 115617 -11343
15298a1343l5129M636J56754M1907j25467O5822n3966j29841j4485K3221N3361
$$ -11343 -46472 -41836 114918 156825 31358 97180 43214 -86627 -101112 -77891 -24530
15287b4530J10047m1042l0060R3007n7890K3774k7366L8929Q420q6438q6297K5259
$$ -24530 85517 44475 14415 107422 49532 73306 45940 84869 93289 6851 -79446 -54187
15275e4187M3706j3723L2899K1468j06838j29636K5971J40651R467l2331K0227
$$ -54187 -10481 -24204 8695 30163 -76675 -206311 -180340 -39689 -30222 -62553 -42326
15264d2326Q0816k34K6665K8777r4773m3488K9586k0389m1353j3681K5266Q7090
$$ -42326 38490 38256 64921 93698 -1075 -44563 -14977 -35366 -76719 -90400 -65134 21956
15252B1956k2242j7404r858J8703l3805N8075q1637P6490J7391P7815n2382o5010
$$ 21956 -286 -17690 -27548 -8845 -42650 15425 -66212 10278 27669 105484 53102 -11908
15240a1908l2938Q9120O4310j07890j14761k6486J76001P9247O143J04092j94060
$$ -11908 -44846 44274 108584 694 -114067 -140553 35448 114695 120838 224930 30870
15229C0870j09247O3722r2653l1497N4496J05315o7113p6476r968J84171j8673
$$ 30870 -78377 -14655 -107308 -138805 -84309 21006 -46107 -122583 -132551 51620 32947
15218C2947N0320N4352j68132j4446K7395j33724J37056m9398p5607O9638J67578
$$ 32947 83267 137619 -30513 -44959 -17564 -151288 -14232 -63630 -139237 -69599 97979
15207I7979m793J2311p3448o3598L0564J1569p4956j33915L0008k7416J17739
$$ 97979 93186 105497 32049 -31549 -985 10584 -64372 -198287 -168279 -195695 -77956
15196g7956J7070r9396O7048K931j4909r5535P6815J1267N5803o2795L4026L7632
$$ -77956 -60886 -160282 -93234 -90303 -105212 -200747 -123932 -112665 -56862 -119657 -85631 -47999
15184d7999P960p2018P6038J74473m8626j53583n8073o5397P0282N2764J34711
$$ -47999 -40039 -112057 -36019 138454 89828 -63755 -121828 -187225 -116943 -64179 70532
15173G0532j52666O0049J09074K2945q0495K1767m0460p79l4006M9687J21154
$$ 70532 -82134 -22085 86989 109934 29439 51206 10746 9967 -24039 25648 146802
15162A46802M900o0671k24879j13989J98667J08829M0986j15376K3445R2367J72328
$$ 146802 151702 91031 -133848 -247837 -49170 59659 100645 -14731 8714 101081 273409
15151B73409Q8584q7643r8726K4034o3327q7986j21070O0532J0734m5382K3279
$$ 273409 361993 274350 175624 199658 136331 48345 -72725 -12193 -1459 -46841 -23562
15140b3562P912K0630R6102J72941O9617j29449k16506p9312k9674J3993O3915
$$ -23562 -15650 4980 101082 274023 343640 214191 -2315 -81627 -111301 -97308 -33393
15129c3393m0210k0747o8732j0491J01443Q8158j0125l6602P4754N362l6188j5515
$$ -33393 -73603 -94350 -163082 -173573 -72130 16028 5903 -30699 44055 49417 13229 -2286
15117b286J17071J09756K5107j4412r8160k5782n1937k9386k802q0118L6327J55226
$$ -2286 114785 224541 249648 235236 137076 111294 59357 29971 27169 -52949 -16622 138604
15105A38604l3587r3356q5331J4504J72338p5185q1935J67928p2956j43714q7736
$$ 138604 105017 11661 -73670 -59166 113172 37987 -43948 123980 51024 -92690 -180426
15094a80426J48357J11158O9858m7686p0070r4604p0707J57751N8967J3338j2421
$$ -180426 -32069 79089 148947 101261 31191 -63413 -134120 23631 82598 95936 83515
15083H3515J13063o4081j36501M8075O9158J08863o2937q2334Q9183N359r8530
$$ 83515 196578 132497 -4004 44071 113229 222092 159155 76821 166004 171363 72833
15072G2833n8148M0548p5117k2802J49225o6405k3669n4259l8094o0984J20631
$$ 72833 14685 55233 -19884 -42686 106539 40134 16465 -37794 -75888 -136872 -16241
15061a6241O7773p684N2642O4496l0429q989j8650j18234j41468m3579K603J9511
$$ -16241 51532 43848 96490 160986 130557 121568 102918 -15316 -156784 -200363 -197760 -178249
15049a78249P4984p171k2689r7630p5362J33669k3345k1740J70743J19550J5242
$$ -178249 -103265 -110436 -133125 -230755 -306117 -172448 -195793 -217533 -46790 72760 88002
15038H8002Q8909M5693m6591k19149j20892J4072J75048K7992J5634R2698m1749
$$ 88002 176911 222604 176013 -43136 -164028 -149956 25092 53084 68718 161416 119667
15027A19667n0515O2297p64n6418k5409n2207k8768N4338N1484j57862n7024J017
$$ 119667 69152 131449 130685 74267 48858 -3349 -32117 22221 73705 -84157 -141181 -140164
15015a40164J8989J12670O2115K9803j53982J6967p95o0253J02462m6572r6647
$$ -140164 -121175 -8505 53610 83413 -70569 -53602 -54397 -114650 -12188 -58760 -155407
15004a55407r3278L6233O5807J08977J2947M3582P9202J09840j9737p2541L7973
$$ -155407 -248685 -212452 -146645 -37668 -24721 18861 98063 207903 188166 115625 153598
14993A53598k4834l4487n1017j24524p031K9117J84718J00574O4824j77964q4104
$$ 153598 128764 94277 43260 -81264 -88295 -59178 125540 226114 290938 112974 28870
14982B8870o7489O6842J6782L4302P6136P710J2636j27279j12752P758L901q1390
$$ 28870 -38619 28223 45005 79307 155443 163153 175789 48510 -64242 -56484 -52583 -133973
14970a33973K8418J36489k643Q3781N4238K3524j04981J5896L6438J06500J2014
$$ -133973 -105555 30934 28291 112072 166310 189834 84853 100749 137187 243687 255701
14959B55701p2212o3098k6716j0398o4976m908P3387J37657L9263n6392L4988
$$ 255701 183489 120391 93675 83277 18301 13393 86780 224437 263700 207308 242296
14948B42296n4641j26900n6190K9206K2117J21973n3843m3319p4515j79697j18300
$$ 242296 187655 60755 4565 33771 55888 177861 124018 80699 6184 -173513 -291813
14937b91813P7080q9453o7582L6756O0719P6054J3016J68949J18677q7814j70462
$$ -291813 -214733 -304186 -371768 -335012 -274293 -198239 -185223 -16274 102403 14589 -155873
14926a55873M8983k5123M1785J31125J20412n7573n5418P310J37767M8441K061
$$ -155873 -106890 -132013 -90228 40897 161309 103736 48318 55628 193395 241836 243897
14915B43897n6947m6895k9413r1978Q920O4166j0140p500j79321M8735J38738
$$ 243897 186950 140055 110642 18664 27584 91750 81610 74110 -105211 -56476 82262
14904H2262M6314J33309k9488p6168J3268M1061q4768q3202j00441K5609K5954
$$ 82262 128576 261885 232397 156229 169497 210558 125790 42588 -57853 -32244 -6290
14893f290J28524m1766j49025J0437O8515m2400j21914Q6297J21522J24682m8682
$$ -6290 122234 80468 -68557 -58120 10395 -32005 -153919 -67622 53900 178582 129900
14882A29900j61186J44604M2842j18801j01710j0430K65r9783L6343K0796K2347
$$ 129900 -31286 113318 156160 37359 -64351 -74781 -74516 -174299 -137956 -117160 -94813
14871i4813K2299j5781m3601O452J17861Q9950J17778M0097j04377j04783q9226
$$ -94813 -72514 -88295 -131896 -125444 -7583 82367 200145 240242 135865 31082 -58144
14860e8144J6515J85198N5270R247j38058j38621k4992M9981J474P7499l9066
$$ -58144 -41629 143569 198839 208086 70028 -68593 -93585 -43604 -42130 35369 -3697
14849c697n6070O2430J36601J53171k534k10499o5370J8691l3078p9206k9176
$$ -3697 -59767 2663 139264 292435 289901 79402 14032 32723 -355 -79561 -108737
14838a08737K23904M0749l7307j52492q0251K4293o1604o0999J19315j9396K1174
$$ -108737 115167 155916 118609 -33883 -114134 -89841 -151445 -212444 -93129 -112525 -91351
14827i1351M9889n2904m6163R7836K2633m959o3412r5030l586J04717p0224J23185
$$ -91351 -41462 -94366 -140529 -42693 -20060 -25019 -88431 -183461 -187047 -82330 -152554 -29369
14815b9369J11270K0822O814m8547p352K4128M750m9812J20818o5030j68963m3474
$$ -29369 81901 102723 109537 60990 53638 77766 82516 32704 153522 88492 -80471 -123945
14803a23945j5464Q5148P8833N7358J08873J79013j0446N3672p0863k23069j62889
$$ -123945 -139409 -54261 24572 81930 190803 369816 359370 413042 342179 119110 -43779
14792d3779j5183J40888P3148q8803j46507r5390n625R4342K4618J8021J18630
$$ -43779 -58962 81926 155074 66271 -80236 -175626 -181251 -86909 -62291 -44270 74360
14781G4360J5605k3439Q5022J6137r2333m9160J02566J0815K6755J4505K4093
$$ 74360 89965 66526 151548 167685 75352 26192 128758 139573 166328 180833 204926
14770B04926j84055l4218l1396l0039n9519j38557j27355L3848J25484J43264
$$ 204926 20871 -13347 -44743 -74782 -134301 -272858 -400213 -366365 -240881 -97617
14760i7617O0774R4142J05598R3684k8535j06631k2949j5527o3716n8669P9113
$$ -97617 -36843 57299 162897 256581 228046 121415 98466 82939 19223 -39446 39667
14749C9667Q1342J6461j7505O0781K786l7648p0964j33746m6301l9891j5382O0513
$$ 39667 121009 137470 119965 180746 183532 145884 74920 -58826 -105127 -145018 -160400 -99887
14737i9887M1524J40804r9257j0310J17563R5835j37789n3852J64687R3198p564
$$ -99887 -58363 82441 -16816 -27126 90437 186272 48483 -5369 159318 252516 244952
14726B44952o9990n0533N634r3845J583J04567j48370l5687N0979J1228p690J8609
$$ 244952 174962 124429 130063 36218 37801 142368 -6002 -41689 9290 20518 12828 31437
14714C1437n0977l888Q010m3293q6800K6719n9802R911J39324l615L1122p2466
$$ 31437 -19540 -23428 -15418 -58711 -145511 -118792 -178594 -168683 -29359 -32974 -1852 -74318
14702g4318J7898Q6026M4056o3113N1436O5302j5906q3655L491L4565J03857o7703
$$ -74318 -56420 29606 73662 10549 61985 127287 111381 27726 31217 65782 169639 101936
14690A01936k76198J8000L7343J49742J33099L1181P2896k8941l5727n5338j43350
$$ 101936 -174262 -156262 -118919 30823 163922 195103 267999 239058 203331 147993 4643
14679D643K7657n5371j18243P9442K6059q2636k7743O182N5719L1452Q0148m7389
$$ 4643 32300 -23071 -141314 -61872 -35813 -118449 -146192 -140010 -84291 -52839 27309 -20080
14667b0080O6440N5512j64271o2260J87444L4373r9595j09765R5431J51224l4447
$$ -20080 46360 101872 -62399 -124659 62785 97158 -2437 -112202 -16771 134453 100006
14656A00006m7988n2062o3792o2012J53899J30486r02J9120n7873l3605p9436
$$ 100006 52018 -44 -63836 -125848 28051 158537 157635 176755 118882 85277 5841
14645E841j22320r0804R6265J03591r0666j29832K9560q8636P845K99830R4051
$$ 5841 -116479 -207283 -111018 -7427 -98093 -227925 -198365 -287001 -279156 20674 114725
14634A14725P0898J0851N5636n2967r8970j22433j19502n91J81615Q9071l3454
$$ 114725 185623 196474 252110 199143 100173 -22260 -141762 -142353 39262 128333 94879
14623I4879R2818J50512M744K345j56404j03068j3326k9006n1191r633O172p142
$$ 94879 187697 338209 342953 345298 188894 85826 72500 43494 -7697 -17330 -11158 -18300
14611a8300r0377J04288Q5599k7398l1601K4292J0886r130J0590N4357j24584
$$ -18300 -108677 -4389 81210 53812 22211 46503 57389 48259 58849 113206 -11378
14600a1378j46546O4388N8245M3899K11667N6563J3766k1336q5308l2962j22846
$$ -11378 -157924 -93536 -35291 8608 220275 276838 290604 269268 183960 150998 28152
14589B8152N193n0585j37341J75539L3826p7615k7680j8243J2384r2729j06340
$$ 28152 33345 -17240 -154581 20958 54784 -22831 -50511 -68754 -56370 -149099 -255439
14578b55439N6482K5929J33681N7676Q6098R2926j33245j17292k762r024j08275
$$ -255439 -198957 -173028 -39347 18329 104427 197353 64108 -53184 -55946 -64970 -173245
14567a73245N0661J49270J3727K7615n2190j3512n0082l6397R197N5758L9017
$$ -173245 -122584 26686 40413 68028 15838 2326 -47756 -84153 -74956 -19198 19819
14556A9819K4572n0896j9229j74443l8495o0925L8687O6662J48221O1151O9686
$$ 19819 44391 -6505 -25734 -200177 -238672 -299597 -260910 -194248 -46027 15124 84810
14545H4810O6673L0085n5395m2731n980L6554O2389L8957M409o253L9368j21930
$$ 84810 151483 181568 126173 83442 77462 114016 176405 215362 219771 213518 252886 130956
14533A30956k08338j39295K4896N1864N7718K5334J2754k9764k2937J84741J29683
$$ 130956 -77382 -216677 -191781 -139917 -82199 -56865 -44111 -73875 -96812 87929 217612
14522B17612J5145J4432j03104o6327j3149M56k5256M8450L4069L2870O7177k4725
$$ 217612 232757 247189 144085 77758 64609 65065 39809 88259 122328 155198 222375 197650
14510A97650k3338K8403j5850K4907j29388r0172r2724k013P6077J1905K5350
$$ 197650 174312 202715 186865 211772 82384 -7788 -100512 -102525 -26448 -14543 10807
14499A0807P7436L9746K338l8821m9127K7052K1791J5511j09399j10934j4205
$$ 10807 88243 127989 130327 91506 42379 69431 91222 106733 -2666 -113600 -127805
14488a27805Q7904R3309O472k3579P2487N2757n7114J1685l7657L8896K1523k767
$$ -127805 -39901 53408 59880 36301 108788 161545 104431 116116 78459 117355 138878 136111
14476A36111j24740p7210J3408J8812J36138J51070L4251p0770p5250K9845j4953
$$ 136111 11371 -65839 -52431 -33619 102519 253589 287840 217070 141820 171665 156712
14465A56712m6782l0675N7264q0685m0700n274J6690P3806j0081j75651j55374
$$ 156712 109930 79255 136519 55834 15134 9860 26550 100356 90275 -85376 -240750
14454b40750J11981n7918j28410J86277K20355q6171K0411K1282j16507M194k6888
$$ -240750 -128769 -186687 -315097 -128820 91535 5364 25775 47057 -69450 -65256 -92144
14443i2144J14278P7788N3156K4679n8799j05355J19404l9998j3321j48499m2727
$$ -92144 22134 99922 153078 177757 118958 13603 133007 93009 79688 -68811 -111538
14432a11538N068J37166O9028q5897j08897O4967j87057p9800N7525J1525P2174
$$ -111538 -106470 30696 99724 13827 -95070 -30103 -217160 -296960 -239435 -227910 -155736
14421a55736M4176J55460k7787P455j06100o7988P292k3298J1809O9294R8881
$$ -155736 -111560 43900 16113 23568 -82532 -150520 -143228 -166526 -154717 -85423 13458
14410A3458l7814Q28J1507j62811J35707J4305k5521P9938n5721n4035J4150q3389
$$ 13458 -24356 -23528 -12021 -174832 -39125 -24820 -50341 29597 -26124 -80159 -66009 -149398
14398a49398j18433J07851j65J02166J38869O406J4521J17532q3947j39300P2269
$$ -149398 -267831 -159980 -160145 -57979 80890 87296 101817 219349 135402 -3898 68371
14387F8371m1724p5291P108Q6234J33546J3857Q0315J1747j29010l6778p5113
$$ 68371 26647 -48644 -41536 44698 178244 192101 272416 284163 155153 118375 43262
14376D3262m604o9135j17309p5373p1797k692j1676J60114J40245O3755L308Q548
$$ 43262 38658 -30477 -147786 -223159 -294956 -297648 -309324 -149210 -8965 54790 58098 66646
14364F6646j2131Q6093J31179n143r4978j57160J06389O5821m8853P045m9059
$$ 66646 54515 140608 271787 266644 171666 14506 120895 186716 137863 144908 95849
14353I5849m671K3344l3808J08256m2362p9250L0953k1445j18323N2996J21503
$$ 95849 91178 114522 80714 188970 146608 67358 98311 76866 -41457 11539 133042
14342A33042j0011j24301j60762n8334n556K06238K1852n6758M8152j8698r6462
$$ 133042 123031 -1270 -162032 -220366 -225922 -19684 2168 -54590 -6438 -25136 -121598
14331a21598R1611J19171q7784r7422p2417l4478K0464O2355J28911k053j5775
$$ -121598 -29987 89184 1400 -96022 -168439 -202917 -182453 -120098 8813 6760 -9015
14320i015J06323M2003M7226k0620j16100K1046p0705j46138r1049p2998J0529
$$ -9015 97308 139311 186537 165917 49817 70863 158 -145980 -237029 -310027 -299498
14309b99498P1518R5330L2447m2502L8714p5244Q7613O8611K7751P7569Q3869
$$ -299498 -227980 -132650 -100203 -142705 -103991 -179235 -91622 -23011 4740 82309 166178
14298A66178n3705o9138r1124P302L8238m5906J57896l4521j00846Q0529P6196
$$ 166178 112473 43335 -47789 -40487 -2249 -48155 109741 75220 -25626 54903 131099
14287A31099j17357R8568Q3038m3951n7337p839r77m5985j04157k7120J97518
$$ 131099 13742 112310 195348 151397 94060 86221 85244 39259 -64898 -92018 105500
14276A05500J28678p7751K936K7777n009L672K8195K1264j5540m6533j94630j6060
$$ 105500 234178 156427 159363 187140 182131 185803 213998 235262 219722 173189 -21441 -37501
14264c7501O9495J0888Q7167K94984O0532j96319j82646j86266j5299Q2414O0464
$$ -37501 31994 42882 130049 425033 485565 289246 106600 -79666 -94965 -12551 47913
14253D7913O5988k683O2516j62033q7126Q5881j0878j2722P515j6041N7370n0448
$$ 47913 113901 111218 173734 11701 -75425 10456 -422 -13144 -5629 -21670 35700 -14748
14241a4748m5973K3296k9648m9801J0249J1202L4615M3839j2357j12725L1847
$$ -14748 -60721 -37425 -67073 -116874 -106625 -95423 -60808 -16969 -29326 -142051 -110204
14230a10204J33925J46927o2057r5032j5355L53J8664q1596j09325P7794M5553
$$ -110204 23721 170648 108591 13559 -1796 -1443 17221 -64375 -173700 -95906 -50353
14219e0353j27882o4108j2684Q7934p001J38412K08148J62170m6195O2428n0035
$$ -50353 -178235 -242343 -255027 -167093 -174094 -35682 172466 334636 288441 350869 300834
14208C00834k24549o2895K7477p2288m7517j79645L9651P6752n9745J54366J08601
$$ 300834 76285 13390 40867 -31421 -78938 -258583 -218932 -142180 -201925 -47559 61042
14197F1042J5611k1604j9600m0701m7328J7551M3322L4431Q6602L9888n3749l7236
$$ 61042 76653 55049 35449 -5252 -52580 -35029 8293 42724 129326 169214 115465 78229
14185G8229J46368M9520j54108n1660j12615q3211j2072N5472L4785O7331J16586
$$ 78229 224597 274117 120009 68349 -44266 -127477 -139549 -84077 -49292 18039 134625
14174A34625J48152n9448p4891p9858j24469P2577m83j40041q9271j1856O3888
$$ 134625 282777 223329 148438 68580 -55889 16688 16205 -123836 -213107 -224963 -161075
14163a61075J09468J82674P3472j36883j52976j8585L1234M3039p8088l6105m2523
$$ -161075 -51607 131067 204539 67656 -85320 -103905 -72671 -29632 -107720 -143825 -186348
14152a86348R8636Q0407k4993K1776P3724K0086q8695l0885j3326L7386o9517
$$ -186348 -87712 -7305 -32298 -10522 63202 83288 -5407 -36292 -49618 -12232 -81749
14141h1749M7455n820k0393n3884M5099P1964J27446Q1364Q7042k0579r8054o2427
$$ -81749 -34294 -40114 -60507 -114391 -69292 2672 130118 211482 298524 277945 179891 117464
14129A17464J85200n3978k6437K6574j40138j54085n7334J21349n4433n3750R7269
$$ 117464 302664 248686 222249 248823 108685 -45400 -102734 18615 -35818 -89568 7701
14118G701j6111R1132J40452j01596j41127Q904K2972q5746j2277q9670j8558
$$ 7701 -8410 82722 223174 121578 -19549 -10645 12327 -73419 -85696 -175366 -193924
14107a93924Q0358K4441J15972J13113k4962k4858j36607N1264R8901O5724q520
$$ -193924 -113566 -89125 26847 139960 114998 90140 -46467 4797 103698 169422 160902
14096A60902j9631n7350P0509o1864j02378n4610Q7889J69638R6481j18625j03028
$$ 160902 141271 83921 154430 92566 -9812 -64422 23467 193105 289586 170961 67933
14085F7933n7853j60963Q4296J04299k9577r9347j2816o6916N7141j8483M6369
$$ 67933 10080 -150883 -66587 37712 8135 -91212 -104028 -170944 -113803 -132286 -85917
14074h5917J11793P0350J30600l0906l2185j42241J7964J64799R3981j23490o7718
$$ -85917 25876 96226 226826 195920 163735 21494 39458 204257 298238 174748 107030
14063A07030j5653k2882l7123q2476m6859O2965q7239n7817O0697N4932J5690
$$ 107030 91377 68495 31372 -51104 -97963 -34998 -122237 -180054 -119357 -64425 -48735
14052d8735P5230J13457o9674l9327n6045L4623K17449m8551p4488J2644o0111
$$ -48735 26495 139952 70278 30951 -25094 9529 226978 178427 103939 116583 56472
14041E6472J4852n4743J30735M6068L9377Q4647l5598k1965n4671j2991j55229
$$ 56472 71324 16581 147316 193384 232761 317408 281810 259845 205174 192183 36954
14030C6954n7671q0903P0923J114j10537J6643J69693J68427J9462j21495j01782
$$ 36954 -20717 -101620 -30697 -29583 -140120 -123477 46216 214643 234105 112610 10828
14019A0828Q6667p832J6362p726j64927l0922J47418P2819N255m0303q4651l0816
$$ 10828 97495 89663 106025 98299 -66628 -97550 49868 122687 127942 87639 2988 -27828
14007b7828J44104K4474r0690r3131j50375q9862M4627Q8388O234K17708Q1488
$$ -27828 116276 140750 50060 -43071 -193446 -283308 -238681 -150293 -144059 73649 155137
13996A55137k7542P145l3432O9853L8929r1q0482n6604k6235j6339J19938j4720
$$ 155137 127595 134740 101308 171161 210090 209999 129517 72913 46678 30339 150277 135557
13984A35557j44699O5095J25981o21k0337J33439q766j41321o1190P3962M6366
$$ 135557 -9142 55953 181934 181313 160976 294415 285649 144328 83138 157100 203466
13973B03466o3120j30894M978O9437M0908o4847J5362j9049M186L2309Q1162M4625
$$ 203466 140346 9452 14430 83867 124775 59928 75290 56241 60427 92736 173898 218523
13961B18523p9904o2273m5363R3767o2477m4690J17595j9859j4159j648p3735
$$ 218523 138619 76346 30983 124750 62273 17583 135178 115319 101160 99512 25777
13950B5777N9376Q7242n3957p2852o4416K1669r519O0466J65701n8982j57642
$$ 25777 85153 172395 118438 45586 -18830 2839 -6680 53786 219487 160505 2863
13939B863J64058J6026j25374R5149j19236j03875L0051J72035j8206k1623p652
$$ 2863 166921 182947 57573 152722 33486 -70389 -40338 131697 113491 91868 84216
13928H4216M5289J1116l5010K2782r7605J8746K5749o2461q2963N2263K3644j03710
$$ 84216 129505 140621 105611 128393 30788 49534 75283 12822 -70141 -17878 5766 -97944
13916i7944J12580J36944j9871j23002q9899o962L526k3757M078o8813j7058J23369
$$ -97944 14636 151580 131709 8707 -81192 -88154 -84628 -108385 -104307 -173120 -190178 -66809
13904f6809J19349J26756k1830k0701N9392J9313r9739J16481K9058J1876q2558
$$ -66809 52540 179296 157466 136765 196157 215470 115731 232212 261270 273146 190588
13893A90588m6385j04364r7571J5353q7078K0441n4139o9703L4697J7582K3147
$$ 190588 144203 39839 -57732 -42379 -129457 -109016 -163155 -232858 -198161 -180579 -157432
13882a57432L0267K87213l7813m2059j4414j00414k1084P6469j2650q9274J30698
$$ -157432 -127165 160048 122235 80176 65762 -34652 -55736 20733 8083 -81191 49507
13871D9507J07871j14822k8431J53517p7406n1685o3041K7592m0725l197p8060
$$ 49507 157378 42556 14125 167642 90236 38551 -24490 3102 -37623 -40820 -118880
13860a18880N8820J17243K63486Q9244j36765q8549j17729j69522J0267M1169
$$ -118880 -60060 57183 320669 409913 273148 184599 66870 -102652 -92385 -51216
13850e1216l383O2735j2105O4049l2429m1353j31876K9792J54039p1959R1933
$$ -51216 -54599 8136 -3969 60080 27651 -13702 -145578 -115786 38253 -33706 58227
13839E8227Q4508N2979K2851J9729r1079p3378M3980J01293o9764j03392j45840
$$ 58227 142735 195714 218565 238294 147215 73837 117817 219110 149346 45954 -99886
13828i9886j11869R4613O8783L5506K5887l6362L4243P7210l8728j93965l9468
$$ -99886 -211755 -117142 -48359 -12853 13034 -23328 10915 88125 49397 -144568 -184036
13817a84036J34100P7729q1621j69968r3569P5249R6483k2549m5017q1980P8214
$$ -184036 -49936 27793 -53828 -223796 -317365 -242116 -145633 -168182 -213199 -295179 -216965
13806b16965P5439N3243J16496J321j11080P7121L0586j32157k2939M2538O3351
$$ -216965 -141526 -88283 28213 29534 -81546 -4425 26161 -105996 -128935 -86397 -23046
13795b3046p8918m2628M4011l214q1092P6951K30770J09883L1489q1179k9890
$$ -23046 -101964 -144592 -100581 -103795 -184887 -107936 122834 232717 264206 183027 153137
13784A53137R218o236m2052L5157m5026L5550k2458N8157J4414j18592j28925
$$ 153137 162355 156119 114067 149224 104198 139748 117290 175447 189861 71269 -57656
13773e7656N490r9657n564j14158k2951J6254J79681Q1234n1960J0520j5866K7434
$$ -57656 -52166 -151823 -157387 -271545 -294496 -278242 -98561 -17327 -69287 -58767 -74633 -47199
13761d7199l3001P1743L6492o7855M3329Q5221k0679O6999J03398J9765j40338
$$ -47199 -80200 -8457 28035 -39820 3509 88730 68051 135050 238448 258213 117875
13750A17875J9498l3157o9959J37746J96160J8488k3551j73139p8600J90401m4656
$$ 117875 137373 104216 34257 172003 368163 386651 363100 189961 111361 301762 257106
13739B57106o9303L3405p5626n5769j09510l6668n7863N4309L1534P3762m5537
$$ 257106 187803 221208 145582 89813 -19697 -56365 -114228 -59919 -28385 45377 -160
13728a60J562m0238j19819n3641J15149J59734q465K4424J545J940l1054j2717
$$ -160 1402 -38836 -158655 -212296 -97147 62587 54122 78546 80091 82031 50977 38260
13716C8260K4772O476n1008O809K18696J51085j31295j31519j00850n8079J35241
$$ 38260 63032 69508 18500 25309 244005 395090 263795 132276 31426 -26653 108588
13705A08588J88729r0061j12824L0277O6711l2167j1034j29235q3342O0838O2800
$$ 108588 297317 207256 94432 124709 191420 159253 148219 18984 -64358 -3520 59280
13694E9280o2828j27347m4282K3669Q755O0433l3896L0615J4869Q7996J84284
$$ 59280 -3548 -130895 -175177 -151508 -142753 -82320 -116216 -85601 -70732 17264 201548
13683B01548J1534P2650k6668k3028j30130k05491j02653J04181J25800J56948
$$ 201548 213082 285732 259064 236036 105906 -99585 -202238 -98057 27743 184691
13673A84691l5582m5448l9534K0045j61515l9040J56097J35414k0018L8456n3800
$$ 184691 149109 103661 64127 84172 -77343 -116383 39714 175128 155110 193566 139766
13662A39766j93133J9805l5948j23189N4338J41839J08304L65q9834q2539J25232
$$ 139766 -53367 -33562 -69510 -192699 -138361 3478 111782 112147 22313 -60226 65006
13651F5006L9488n2655O320l1544l972j41855J5743J12121o0312R3765J39056
$$ 65006 104494 51839 58159 26615 22643 -119212 -103469 8652 -51660 42105 181161
13640A81161l2989k680j64590k9112O5754j83610l793J07922L6859p0920j0514
$$ 181161 148172 145492 -19098 -48210 17544 -166066 -169859 -61937 -25078 -95998 -106512
13629a06512J2734J89010q9102k74681O2406J86204l8348m6596M0988M5307l8372
$$ -106512 -93778 95232 6130 -268551 -206145 -19941 -58289 -104885 -63897 -18590 -56962
13618e6962N2915P0080N9842L0352k8656l4103L0056k1868q8411p7462J3912R433
$$ -56962 -4047 66033 125875 156227 127571 93468 123524 101656 13245 -64217 -50305 -40872
13606d0872k1880N8157p3710Q1964r8290j51221Q3279J35976J34973m04k7666
$$ -40872 -62752 -4595 -78305 3659 -94631 -245852 -162573 -26597 108376 107972 80306
13595H0306O898J1445q7120n7104q646p7032O2264J77125k8665J8176J4982l3567
$$ 80306 87204 98649 11529 -45575 -54221 -131253 -68989 108136 79471 97647 112629 79062
13583G9062R9286L4753k02374j64376N3400J9767k6972j24903J23905J58394m3065
$$ 79062 178348 213101 10727 -153649 -100249 -80482 -107454 -232357 -108452 49942 6877
13572F877N6574Q1106K1225r0174j69253J7187Q2047r4873N8932J10175j22458
$$ 6877 63451 144557 165782 75608 -93645 -76458 5589 -89284 -30352 79823 -42635
13561d2635J0875K1758j33745j3139J69859J64627m42q2574q3997l5788n6827
$$ -42635 -31760 -10002 -143747 -156886 12973 177600 177158 94584 10587 -25201 -82028
13550h2028n5375J45897j3825j72614J8190k1895L639M9697J04369J8005k4318
$$ -82028 -137403 8494 -5331 -177945 -159755 -181650 -178011 -128314 -23945 -5940 -30258
13539c0258P8203Q9945n609j40871o6620J57151q273J6346J5171n1584m7733M1295
$$ -30258 47945 137890 132281 -8590 -75210 81941 73668 90014 105185 53601 5868 47163
13527D7163j9473k7619l0185j4028P6471K4318m4666K9724l3117j31873j29027
$$ 47163 27690 71 -30114 -44142 32329 56647 11981 41705 8588 -123285 -252312
13516b52312m5971O2705J34297K28375L4957p7965j40545l5787j15020N4604j3560
$$ -252312 -298283 -235578 -101281 127094 162051 84086 -56459 -92246 -207266 -152662 -166222
13505a66222J9189J11351l8492p6813P2352J92645K8419p4515r1786P1777L014
$$ -166222 -147033 -35682 -74174 -150987 -78635 114010 142429 67914 -23872 47905 50919
13494E0919J27362l7510l1842l8327J8543P8287n1503O2603n2828j00692r2939
$$ 50919 178281 140771 108929 70602 89145 167432 115929 178532 125704 25012 -67927
13483f7927K4848P9484r1558J6612l3423K358J32828L8272L174J7530O5792j870
$$ -67927 -43079 36405 -55153 -38541 -71964 -69606 63222 101494 104668 122198 187990 186120
13471A86120k0393J22620m2369r6018m6062P1838J972K5132n9892J1465j24008
$$ 186120 165727 288347 245978 149960 103898 175736 177708 202840 142948 154413 30405
13460C0405j66975l6611J04156M6969O1917J74558R1591j26494r7849j25474o4392
$$ 30405 -136570 -173181 -69025 -22056 39861 214419 306010 179516 81667 -43807 -108199
13449a08199o7480o0869R2638J44126J36052L14j97723o7028p087M9433L1798
$$ -108199 -175679 -236548 -143910 216 136268 136582 -61141 -128169 -135256 -85823 -54025
13438e4025O8606Q6350K3258P8860j34924r9128O0853K1228o4493Q4866J03379
$$ -54025 14581 100931 124189 203049 68125 -31003 29850 51078 -13415 71451 174830
13427A74830P3668j66632j15391P8999L7081j5334N4075J4065r0443m1907j05977
$$ 174830 248498 81866 -33525 45474 82555 67221 121296 135361 44918 3011 -102966
13416a02966l2723p7090O3401J01513P9348l7648j7500j09165q9151N4938Q1247
$$ -102966 -135689 -212779 -149378 -47865 31483 -6165 -23665 -132830 -221981 -167043 -85796
13405h5796J66142K3178l1801R8651r505k5404Q247p7626j38199q6251O8689P8487
$$ -85796 80346 103524 71723 170374 160869 135465 143712 66086 -72113 -158364 -89675 -11188
13393a1188j4787K3074l0152p1453K6904o2205L4120J49492P3823m9253j11502
$$ -11188 -25975 -2901 -33053 -104506 -77602 -139807 -105687 43805 117628 68375 -43127
13382d3127L6604P6530J6989q2522n0535j2104O3338p0988l6903M5562j2577K1495
$$ -43127 -6523 70007 86996 4474 -46061 -58165 5173 -65815 -102718 -57156 -69733 -48238
13370d8238Q1494O4795Q4854Q3698q1714j43357J7883l7091j90864n234Q7952
$$ -48238 33256 98051 182905 266603 184889 41532 59415 22324 -168540 -173774 -85822
13359h5822m1552o8437J5084J48508M7723n7217L0504N8110n179R1139j34113
$$ -85822 -127374 -195811 -180727 -32219 15504 -41713 -11209 46901 41722 132861 -1252
13348a252N4525J18122M3378k3574L5092k5239j718R676M2844k2824j34917j78605
$$ -1252 53273 171395 214773 191199 226291 201052 199334 209010 251854 229030 94113 -84492
13336h4492j5107o0931j636J11924Q3455M2850r4526n2098J7376K4600k9534q5583
$$ -84492 -99599 -160530 -162166 -50242 33213 76063 -18463 -70561 -53185 -28585 -58119 -143702
13324a43702J25220K07454J41474K711l2634j05697l5927n1253j23916j14562
$$ -143702 -18482 188972 330446 333157 300523 194826 158899 107646 -16270 -130832
13314a30832k4503M6754J74144K9683L1760N667j47422j45027n034Q7659Q5366
$$ -130832 -155335 -108581 65563 95246 127006 132673 -14749 -159776 -164810 -77151 8215
13303H215Q1373m2374j31465n3615J03494m2784K6573J83442J38799q6917j86972
$$ 8215 89588 47214 -84251 -137866 -34372 -77156 -50583 132859 271658 184741 -2231
13292b231j24653j7638O4792J08501m0059j0876L7971J62927n5976m2310j00526
$$ -2231 -126884 -144522 -79730 28771 -11288 -22164 15807 178734 122758 80448 -20078
13281b0078m6429o133j2410L9348R8836L8679P2661M3935K076o4340j24148Q2663
$$ -20078 -66507 -72640 -85050 -45702 53134 91813 164474 208409 210485 146145 21997 104660
13269A04660K9121j08012j15449r5504K3333m4463L2091j45504J2647K90525P2055
$$ 104660 133781 25769 -89680 -185184 -161851 -206314 -174223 -319727 -307080 -16555 55500
13258E5500n4306j52227N4335K3710N0425K3330J7970K5066N3177j12088M4837
$$ 55500 1194 -151033 -96698 -72988 -22563 767 18737 43803 96980 -15108 29729
13247B9729R721O743J37350m9708R5356J16533r281k0597q4374r7875M864n8782
$$ 29729 39450 46193 183543 133835 229191 345724 336443 315846 231472 133597 138461 79679
13235G9679j01892K8425M736K5268J02997N6866q3028J4938k3059o1230r4352
$$ 79679 -22213 6212 10948 36216 139213 196079 113051 127989 104930 43700 -50652
13224e0652L5960m459J35123K3526j6618Q3517k7418Q957j07338k7900j11539
$$ -50652 -14692 -19151 115972 139498 122880 206397 178979 187936 80598 52698 -58841
13213e8841m9938M6563L9133P528q105J34103J7837k8260J4594m8329l584L6839
$$ -58841 -108779 -62216 -23083 -15555 -23660 110443 128280 100020 114614 66285 62701 99540
13201I9540j20987M2533J23738o3098n3520m0140n1838k4146O0180k6789J2155
$$ 99540 -21447 21086 144824 81726 28206 -11934 -63772 -87918 -27738 -54527 -42372
13190d2372r3796M0222J56573k1221n231m1052M6596r2264m8512l7979n0643q2260
$$ -42372 -136168 -95946 60627 39406 34175 -6877 39719 -52545 -101057 -139036 -189679 -271939
13178b71939O8694J38493R9659j67943o4814P5050J73965P1925q3349j00352P984
$$ -271939 -203245 -64752 34907 -133036 -197850 -122800 51165 123090 39741 -60611 -52627
13167e2627K03834J44744J3510r3946r7187N5915N843J08928J13579q952k11634
$$ -52627 151207 295951 309461 215515 118328 174243 180086 289014 402593 393641 182007
13156A82007k13577N9249J22931M4924j13963j6051L9311j28969M7938J3996l1199
$$ 182007 -31570 27679 150610 195534 81571 65520 104831 -24138 23800 37796 6597
13145F597L6279l5445L8003J40045J782l6366j04673n9663Q386j24108Q0167J324
$$ 6597 42876 7431 45434 185479 187261 150895 46222 -13441 -5055 -129163 -48996 -47672
13133d7672N2727J4116K8553k9917j43274k2452J48385K3331K8149J09445j8966
$$ -47672 5055 19171 47724 17807 -125467 -147919 466 23797 51946 161391 142425
13122A42425j46900m3584J17635Q5108Q1746N5144L852O5435o647r4205m2963
$$ 142425 -4475 -48059 69576 154684 236430 291574 295426 360861 354214 260009 217046
13111B17046j5739j2442M1887J5836j18359q3429N7852l2023p1304m4987M1534
$$ 217046 201307 188865 230752 246588 128229 44800 102652 70629 -675 -45662 -4128
13100d128J01897Q1254P2844r8480j5098j82916n2194L5993J8291j49034O3766
$$ -4128 97769 179023 251867 153387 138289 -44627 -96821 -60828 -42537 -191571 -127805
13089a27805O7265k1871k305K8469k7095p1344n4961J6564J35760P1392k4902
$$ -127805 -60540 -82411 -84716 -56247 -83342 -154686 -209647 -193083 -57323 14069 -10833
13078a0833p3315l725Q6613Q4585L1620J0630j7821k0480J3343J4075o4028j07890
$$ -10833 -84148 -87873 -1260 83325 114945 125575 107754 87274 100617 114692 50664 -57226
13066e7226j4044K094o1103O1836N9528k499K9504l5481j9790L7802Q5405J01620
$$ -57226 -71270 -69176 -130279 -68443 -8915 -11414 18090 -17391 -37181 621 86026 187646
13054A87646j09463k5512k2248j15323q4788N786K5676J99013M5756q7364j24236
$$ 187646 78183 52671 30423 -84900 -169688 -163902 -138226 60787 106543 19179 -105057
13043a05057m6447Q4815P4047J95409l3156n2780j26917j62615n6286J04636Q7861
$$ -105057 -151504 -66689 7358 202767 169611 116831 -10086 -172701 -228987 -124351 -36490
13032c6490M4813m5483R22k7136k4381m6203R9112J34157J4161p7813r2168o4645
$$ -36490 8323 -37160 -36238 -63374 -87755 -133958 -34846 99311 113472 35659 -56509 -121154
13020a21154l0101N2697J76652J49949q9492j30635Q6840J11774J22129M068j46824
$$ -121154 -151255 -98558 78094 228043 138551 7916 94756 206530 328659 332727 185903
13009A85903j53883L5744J62563N3871q2457m3015j69914l5940J11704K338l2598
$$ 185903 32020 67764 230327 284198 201741 158726 -11188 -47128 64576 66914 34316
12998C4316J38o0070J39830J06845j18804k7009J302L6756q3902J2152J09173
$$ 34316 34454 -25616 114214 221059 102255 75246 76548 113304 29402 41554 150727
12987A50727J14677k5781j20374j52531o0967M4173Q347L900n1957j02925Q4832
$$ 150727 265404 239623 119249 -33282 -94249 -50076 -41729 -37829 -89786 -192711 -107879
12976a07879Q0426J4152L1902j24053o1773Q6544j6611M3106O4560m8003n6220
$$ -107879 -27453 -13301 18601 -105452 -167225 -80681 -97292 -54186 10374 -37629 -93849
12965i3849k559l0458j29502K2606Q4778l4116k1072m8883J3772N6189R9517o34
$$ -93849 -96408 -126866 -256368 -233762 -148984 -183100 -204172 -253055 -239283 -183094 -83577 -84211
12953h4211K9919Q7611k7795k5695L2824M0562L5638R465k6145l085q6342N2780
$$ -84211 -54292 33319 5524 -20171 12653 53215 88853 98318 72173 69088 -17254 35526
12941C5526O6385j09139p2395M3250k2380K6208m3991P0587k7470o9379L6686
$$ 35526 101911 -7228 -79623 -36373 -58753 -32545 -76536 -5949 -33419 -102798 -66112
12930f6112J39552J45746k3133j22427p11J21500M1543j40445m2920j8362j25051
$$ -66112 73440 219186 196053 73626 72915 194415 235958 95513 52593 34231 -90820
12919i0820P2544N8413P8454m2996O6015J24969j51727j74364K1482J51028K6387
$$ -90820 -18276 40137 118591 75595 141610 266579 114852 -59512 -38030 112998 139385
12908A39385j3090J15221r9521j72049J3892J09534m8147q7369j4648J5826J2072
$$ 139385 126295 241516 141995 -30054 -16162 93372 45225 -42144 -56792 -40966 -28894
12897b8894J01805k77381j79576J520o6529P0274J73499K85569M8529m7066r5849
$$ -28894 72911 -204470 -384046 -382526 -449055 -378781 -205282 80287 128816 81750 -14099
12886a4099k9388k8962j1100Q8390J8268O4748J26864j46677n7291K0702J3878
$$ -14099 -43487 -72449 -83549 4841 23109 87857 214721 68044 10753 31455 45333
12875D5333K9368K7784j04712J04264J26730o0556j26924J4229P0581l0490j45952
$$ 45333 74701 102485 -2227 102037 228767 168211 41287 55516 126097 95607 -50345
12864e0345j77929M7491J85119j673k2983J4631l8321j08619K8974K4187L7058
$$ -50345 -228274 -180783 4336 2663 -20320 -5689 -44010 -152629 -123655 -99468 -62410
12853f2410Q8605l3830O1531J20748q881l8159j81563l4308M7722J12933N3824
$$ -62410 26195 -7635 53896 174644 165763 127604 -53959 -88267 -40545 72388 126212
12842A26212L2856N9925K2591p0898j28785j23538q0634P4382l9657Q8418Q5673
$$ 126212 159068 218993 241584 170686 41901 -81637 -162271 -87889 -127546 -39128 46545
12831D6545n5558J2359n2424Q601K1569K8776K9686J19215L5706j33224L793J9150
$$ 46545 -9013 3346 -49078 -40477 -18908 9868 39554 158769 194475 61251 65044 84194
12819H4194P766n5235j0956M4837Q5305k1342p8143n4918O3197O4847M7755r193
$$ 84194 91960 36725 25769 70606 155911 134569 56426 1508 64705 129552 177307 168114
12807A68114j89890m2190j0996P5912O5386L6058q0513n2001R1750M1488n8049
$$ 168114 -21776 -63966 -74962 950 66336 102394 21881 -30120 61630 103118 45069
12796D5069J3679L6043k2725K6409Q3237j3564j37408n616K9971l3078R2251k4192
$$ 45069 58748 94791 72066 98475 181712 168148 30740 25124 55095 22017 114268 90076
12784I0076p0171J0700J0062p6722P8371J44442k3124q6323p6337k2688o6544
$$ 90076 19905 30605 40667 -36055 42316 186758 163634 77311 974 -21714 -88258
12773h8258K9131Q3954j17156K805r80k218L5504n2114j7213J27938J40798K4988
$$ -88258 -59127 24827 -92329 -89524 -90504 -92722 -57218 -109332 -126545 1393 142191 167179
12761A67179m8149j59145m8396n9121Q0073J01926Q9515P8785k5354Q5268K0104
$$ 167179 119030 -40115 -88511 -147632 -67559 34367 123882 202667 177313 262581 282685
12750B82685K2470j55061j05631L2381J6537k7459j49726m2430K8503J22517Q7187
$$ 282685 305155 150094 44463 76844 93381 65922 -83804 -126234 -97731 24786 111973
12739A11973k9762k9349k17285m7889R3051J36674q251j53102L8335J81163J18122
$$ 111973 82211 52862 -164423 -212312 -119261 17413 9162 -143940 -105605 75558 193680
12728A93680p5995j0449l708p1085J5060k7457j11516n5909j7114P6445K8724
$$ 193680 117685 107236 103528 32443 47503 20046 -91470 -147379 -164493 -88048 -59324
12717e9324k6953m1946k8178J44857J9136k5534n0958p4786J1675J78N0908K09395
$$ -59324 -86277 -128223 -156401 -11544 7592 -17942 -68900 -143686 -132011 -131833 -80925 128470
12705A28470l7948k0412q1572N0167K4358J2171m6493J3584n8597j41239n1220
$$ 128470 90522 70110 -11462 38705 63063 75234 28741 42325 -16272 -157511 -208731
12694b08731R6155L8768l6738J74084J96780Q1492k7341j39859p9565N383j21040
$$ -208731 -112576 -73808 -110546 63538 260318 341810 314469 174610 95045 100428 -20612
12683b0612j0634j7112K9073K14671k5680o9893p0718r0426O1732p1007l3837
$$ -20612 -31246 -48358 -19285 195386 169706 99813 29095 -61331 401 -70606 -104443
12672a04443O9231M0413p1661M6523J5423N2691O0752r124m8624M9843m5421j7931
$$ -104443 -35212 5201 -66460 -19937 -4514 48177 108929 99805 51181 101024 55603 37672
12660C7672r7595l0338Q4925R0180l7347L8673m4738n6662K5486j8659k6714k6716
$$ 37672 -59923 -90261 -5336 84844 47497 86170 41432 -15230 10256 -8403 -35117 -61833
12648f1833j5988J21233j37057j05410R2314J67751R9424q8430Q84L2185j08655
$$ -61833 -77821 43412 -93645 -199055 -106741 61010 160434 72004 72888 105073 -3582
12637c582n1772L0197L0803o1066m8843L0390L09849N1698j15235j11828m5899
$$ -3582 -55354 -25157 5646 -55420 -104263 -73873 235976 287674 172439 60611 14712
12626A4712n7743l4924j34721L8868J28134l0344n7454N0235k8659Q6820O9791
$$ 14712 -43031 -77955 -212676 -173808 -45674 -76018 -133472 -83237 -111896 -25076 44715
12615D4715L2M2631k514O735J5544p4671j8525P5139K5286o6967j29986R3458
$$ 44715 44747 87378 84864 91599 107143 32472 13947 89086 114372 47405 -82581 10877
12603A0877J66081r43j29495k18265l3044J3231Q4903m4901R6560J81916N9721
$$ 10877 176958 176015 46520 -171745 -204789 -191558 -106655 -151556 -54996 126920 186641
12592A86641l0591k1606j58729j1859J16113j01257j40140K0718Q1045q7472l0049
$$ 186641 156050 134444 -24285 -36144 79969 -21288 -161428 -140710 -59665 -147137 -177186
12581a77186N9849J773j03168j37293O7842J79108O8659O5823J92275K8652j80850
$$ -177186 -117337 -115564 -218732 -356025 -288183 -109075 -40416 25407 217682 246334 65484
12570F5484j8999J2166j36764l9511l4386R346J1849P3391J8372J15357J47986
$$ 65484 46485 58651 -78113 -117624 -152010 -142664 -130815 -57424 -39052 76305 224291
12559B24291j09517q4604N8341N7788L2046m1412K8834n5028o2486J7564o6454
$$ 224291 114774 30170 88511 146299 178345 136933 165767 110739 48253 65817 -637
12548f37J18600K22232N7632j40266j17797j9953o0505k0559J7419R6075j9928
$$ -637 117963 340195 397827 257561 139764 119811 59306 38747 56166 152241 132313
12537A32313J0071m32j05407j05766Q9628l3576q0096L1953L4098O9265R1258
$$ 132313 142384 141952 36545 -69221 20407 -13169 -93265 -61312 -27214 42051 133309
12526A33309j6518r9750m3581P0078J10821k5250N2325j70717q5378O2560J83577
$$ 133309 116791 17041 -26540 43538 154359 129109 181434 10717 -74661 -12101 171476
12515A71476K7789k08031Q2993P7260n3514o8236j16570l3939O0523m499m802
$$ 171476 199265 -8766 74227 151487 97973 29737 -86833 -120772 -60249 -64748 -69550
12504f9550M1439K0278P6641m361K1129n1791o3009k780j27589q2364P8710J794
$$ -69550 -28111 -7833 68808 64447 85576 33785 -29224 -32004 -159593 -241957 -163247 -161453
12492a61453J5556J0755R6301K06921n8097n3319K1711M4566j02378j52055l9972
$$ -161453 -145897 -135142 -38841 168080 109983 56664 78375 122941 20563 -131492 -171464
12481a71464j6782J15640O2245O5986J80168m6512j68535j7559q7044j25366R3732
$$ -171464 -188246 -72606 -10361 55625 235793 189281 20746 3187 -83857 -209223 -115491
12470a15491m4653Q6785K01001j05316m2055m55L3242N6805n9849R306r7227k6170
$$ -115491 -160144 -73359 127642 22326 -19729 -20184 13058 69863 10014 19320 -77907 -104077
12458a04077O1151P066N6622k4815J03482j32088J8427M8891N6701P4479j45782
$$ -104077 -42926 -35860 20762 -4053 99429 -32659 -14232 34659 91360 165839 20057
12447B0057o5367j19427r0067J02876O9748R3769J16059Q7803J14311o0050j84206
$$ 20057 -45310 -164737 -254804 -151928 -82180 11589 127648 215451 329762 269712 85506
12436H5506j91510K5700j0697k50J5677L9468L9796N2581L5628K3030J2886n0819
$$ 85506 -106004 -80304 -91001 -91251 -75574 -36106 3690 56271 91899 114929 127815 76996
12424G6996K6119M2528O6150K9918J2218J63609j6006j19405k29303k0566J15770
$$ 76996 103115 145643 211793 241711 253929 417538 401532 282127 52824 32258 148028
12413A48028l6721m9134n1080o281j17765k3093K5571K6540L0947o7633l6736
$$ 148028 111307 62173 11093 4812 -112953 -136046 -110475 -83935 -52988 -120621 -157357
12402a57357N3339O2847J26677O2533j51872k7175Q4822J6239L9004J41359P433
$$ -157357 -104018 -41171 85506 148039 -3833 -31008 53814 70053 109057 250416 257849
12391B57849j98240q8001k5994m9645K1654N3620j9072P7914q0482l5915M4532
$$ 257849 59609 -28392 -54386 -104031 -82377 -28757 -47829 30085 -50397 -86312 -41780
12380d1780j210l7171Q2121j079q1636l0692r0921j7246J51364N5310j12508J32127
$$ -41780 -42990 -80161 1960 881 -80755 -111447 -202368 -219614 -68250 -12940 -125448 6679
12368F679R3923M5943P9654j55005j91919q1007Q2353P9693J2264P5075m2420
$$ 6679 100602 146545 226199 71194 -120725 -201732 -119379 -39686 -27422 47653 5233
12357E233K2139L4777N4820J9549p3753n7366L0170R6144r4309O0087l0718l4912
$$ 5233 27372 62149 116969 136518 62765 5399 35569 131713 37404 97491 66773 31861
12345C1861J6326n4193r9324J4748J05023r984o3166J69841J42097q8722j56208
$$ 31861 48187 -6006 -105330 -90582 14441 4457 -58709 111132 253229 164507 8299
$$ [...]
##END NTUPLES=NMR SPECTRUM
##END=
