##TITLE=Analysis number 326519
Compound Code cc 52208
Book Reference 467/124/3
Project Code adrs
Chemist Name benw
##JCAMPDX= 6.0         $$ Bruker NMR JCAMP-DX V2.0
##DATA TYPE= NMR SPECTRUM
##DATA CLASS= NTUPLES
##ORIGIN= Bruker BioSpin GmbH
##OWNER= nmr
$$ XWIN-NMR		Version 3.5
$$ Fri Feb  9 10:43:06 2007 GMT Standard Time (UT+0h)  MAYBRIDGE\nmr@NMR_250MHZ
##.OBSERVE FREQUENCY= 250.131544655141
##.OBSERVE NUCLEUS= ^1H
##.ACQUISITION MODE= SIMULTANEOUS (DQD)
##.ACQUISITION SCHEME= undefined
##.AVERAGES= 16
##.DIGITISER RES= 18
##SPECTROMETER/DATA SYSTEM= dpx250
##.PULSE SEQUENCE= zg30
##.SOLVENT NAME= CDCl3
##.SHIFT REFERENCE= (INTERNAL, CDCl3, 0, 16.522)
##AUDIT TRAIL= $$ (NUMBER, WHEN, WHO, WHERE, WHAT)
$$ ##TITLE= Audit trail, XWIN-NMR		Version 3.5
$$ ##JCAMPDX= 5.01
$$ ##ORIGIN= Bruker BioSpin GmbH
$$ ##OWNER= nmr
$$ C:\u/data/dgb/nmr/ADRS/620/pdata/1/auditp.txt
$$ ##AUDIT TRAIL=  $$ (NUMBER, WHEN, WHO, WHERE, WHAT)
(   1,<2007-02-09 10:42:22.27 +000>,<MAYBRIDGE\nmr>,<NMR_250MHZ>,
      <created by zg, POWCHK disabled, PULCHK disabled
       configuration hash MD5:
       49 4B E0 1D 92 C2 6B 37 9F E6 65 BC 52 41 86 1D
       data hash MD5: 64K
       E2 C3 12 DF 74 7C 04 FD D7 CC 98 60 5F 69 47 BB>)
(   2,<2007-02-09 10:42:42.13 +000>,<MAYBRIDGE\nmr>,<NMR_250MHZ>,
      <Start of raw data processing
       ef LB = 0.3 FT_mod = 6 PKNL = 1 SI = 32K 
       data hash MD5: 32K
       25 CE 27 C9 6D 6E 5C 7D C4 E3 04 42 CC 9D DD 87>)
(   3,<2007-02-09 10:42:47.68 +000>,<MAYBRIDGE\nmr>,<NMR_250MHZ>,
      <apk 
       data hash MD5: 32K
       71 76 C1 55 27 EA 98 A7 D5 4B D0 AE 48 E2 6E 03>)
(   4,<2007-02-09 10:42:49.22 +000>,<MAYBRIDGE\nmr>,<NMR_250MHZ>,
      <abs ABSG = 5 
       data hash MD5: 32K
       C9 64 FA EB 03 ED F1 36 76 0F 19 1F 0F 19 2C 93>)
$$ ##END=
$$ 
$$ hash MD5
$$ 5B 33 28 02 F0 BD 2C 23 32 DA 99 F7 A8 EC BB 74
##$RELAX= 
##$RELAX= 
##$RELAX= 
##$RELAX= 
##$RELAX= 
##$RELAX= 
##$RELAX= 
$$ Bruker specific parameters
$$ --------------------------
##$DU= <C:\u>
##$EXPNO= 620
##$NAME= <ADRS>
##$PROCNO= 1
##$TYPE= <nmr>
##$USER= <dgb>
##$AMP= (0..31)
100 100 100 100 100 100 100 100 100 100 100 100 100 100 100 100 100 100 
100 100 100 100 100 100 100 100 100 100 100 100 100 100 
##$AQSEQ= 0
##$AQ_mod= 3
##$AUNM= <au_zg>
##$AUTOPOS= <33 >
##$BF1= 250.13
##$BF2= 250.13
##$BF3= 250.13
##$BF4= 250.13
##$BF5= 500.13
##$BF6= 500.13
##$BF7= 500.13
##$BF8= 500.13
##$BYTORDA= 1
##$CFDGTYP= 0
##$CFRGTYP= 5
##$CHEMSTR= <none>
##$CNST= (0..31)
1 1 145 1 1 1 1 1 1 1 1 1 1 1 1 1 1 1 1 1 1 1 1 1 1 1 1 1 1 1 1 1 
##$CPDPRG= <>
##$CPDPRG1= <>
##$CPDPRG2= <>
##$CPDPRG3= <>
##$CPDPRG4= <mlev>
##$CPDPRG5= <mlev>
##$CPDPRG6= <mlev>
##$CPDPRG7= <mlev>
##$CPDPRG8= <mlev>
##$CPDPRGB= <>
##$CPDPRGT= <>
##$D= (0..31)
0 1 0 0 0 0 0 0 0 0.06 0 0 0 0 0 0 0.0002 0 0 0 0 0 0 0 0 0 0 0 0 0 0 
0 
##$DATE= 1171017739
##$DBL= (0..7)
120 120 120 120 120 120 120 120 
##$DBP= (0..7)
150 150 150 150 150 150 150 150 
##$DBP07= 0
##$DBPNAM0= <>
##$DBPNAM1= <>
$$ [...]
##$SUBNAM7= <"">
##$SUBNAM8= <"">
##$SUBNAM9= <"">
##$SW= 20.6930455092707
##$SWIBOX= (0..15)
0 0 3 0 0 0 0 0 0 0 0 0 0 0 0 0 
##$SW_h= 5175.983436853
##$TD= 65536
##$TD0= 1
##$TE= 294.16
##$TE2= 300
##$TE3= 300
##$TEG= 300
##$TL= (0..7)
0 120 120 120 120 120 120 120 
##$TP= (0..7)
150 150 150 150 150 150 150 150 
##$TP07= 0
##$TPNAME0= <>
##$TPNAME1= <>
##$TPNAME2= <>
##$TPNAME3= <>
##$TPNAME4= <>
##$TPNAME5= <>
##$TPNAME6= <>
##$TPNAME7= <>
##$TPOAL= (0..7)
0.5 0.5 0.5 0.5 0.5 0.5 0.5 0.5 
##$TPOFFS= (0..7)
0 0 0 0 0 0 0 0 
##$TUNHIN= 0
##$TUNHOUT= 0
##$TUNXOUT= 0
##$USERA1= <user>
##$USERA2= <user>
##$USERA3= <user>
##$USERA4= <user>
##$USERA5= <user>
##$V9= 5
##$VALIST= <valist>
##$VCLIST= <CCCCCCCCCCCCCCC>
##$VD= 0
##$VDLIST= <DDDDDDDDDDDDDDD>
##$VPLIST= <PPPPPPPPPPPPPPP>
##$VTLIST= <TTTTTTTTTTTTTTT>
##$WBST= 1024
##$WBSW= 4
##$XGAIN= (0..3)
0 0 0 0 
##$XL= 0
##$YL= 0
##$YMAX_a= 322528
##$YMIN_a= -434679
##$ZGOPTNS= <>
##$ZL1= 120
##$ZL2= 120
##$ZL3= 120
##$ZL4= 120
##$ABSF1= 16.522
##$ABSF2= -4.171173
##$ABSG= 5
##$ABSL= 3
##$ALPHA= 0
##$AQORDER= 0
##$ASSFAC= 0
##$ASSFACI= 0
##$ASSFACX= 0
##$ASSWID= 0
##$AUNMP= <proc_1d>
##$AZFE= 0.1
##$AZFW= 0.1
##$BCFW= 0
##$BC_mod= 0
##$BYTORDP= 0
##$COROFFS= 0
##$CY= 12.5
##$DATMOD= 1
##$DC= 0
##$DFILT= <>
##$DTYPP= 0
##$F1P= 14.0000005364418
##$F2P= -0.99999901652339
##$FCOR= 0.5
##$FTSIZE= 32768
##$FT_mod= 6
##$GAMMA= 0
##$GB= 0
##$INTBC= 1
##$INTSCL= 1
##$ISEN= 128
##$LB= 0.3
##$LEV0= 0
##$LPBIN= 0
##$MAXI= 10000
##$MC2= 0
##$MEAN= 0
##$ME_mod= 0
##$MI= 0
##$NCOEF= 0
##$NC_proc= -4
##$NLEV= 6
##$NOISF1= 0
##$NOISF2= 0
##$NSP= 0
##$NTH_PI= 0
##$NZP= 0
##$OFFSET= 16.522
##$PC= 1
##$PHC0= 232.5342
##$PHC1= 4.312865
##$PH_mod= 1
##$PKNL= yes
##$PPARMOD= 0
##$PSCAL= 4
##$PSIGN= 0
##$REVERSE= no
##$SF= 250.13
##$SI= 32768
##$SIGF1= 0
##$SIGF2= 0
##$SINO= 400
##$SIOLD= 32768
##$SREGLST= <1H.CDCl3>
##$SSB= 0
##$STSI= 32768
##$STSR= 0
##$SW_p= 5175.98343685301
##$SYMM= 0
##$S_DEV= 0
##$TDeff= 65536
##$TDoff= 0
##$TI= <Analysis number 999999
Compound Code 99
Book Reference 9
Project Code 9>
##$TILT= no
##$TM1= 0
##$TM2= 0
##$TOPLEV= 0
##$USERP1= <user>
##$USERP2= <user>
##$USERP3= <user>
##$USERP4= <user>
##$USERP5= <user>
##$WDW= 1
##$XDIM= 32768
##$YMAX_p= 363992963
##$YMIN_p= -184472
$$ End of Bruker specific parameters
$$ ---------------------------------
##NTUPLES= NMR SPECTRUM
##VAR_NAME=  FREQUENCY,     SPECTRUM/REAL,   SPECTRUM/IMAG
##SYMBOL=    X,             R,               I
##VAR_TYPE=  INDEPENDENT,   DEPENDENT,       DEPENDENT
##VAR_FORM=  AFFN,          ASDF,            ASDF
##VAR_DIM=   32768,         32768,           32768
##UNITS=     HZ,            ARBITRARY UNITS, ARBITRARY UNITS
##FACTOR=    0.157963299565203, 1,           1
##FIRST=     4132.6476996994, 0,             0
##LAST=      -1043.33573715361, 0,           0
##MIN=       -1043.33573715361, -184472,     0
##MAX=       4132.6476996994, 363992963,     0
$$ Real data points
##PAGE= N=1
##DATA TABLE= (X++(R..R)), XYDATA
$$ [...]
19487F954j3780P289J3584K3998n101J5961K6827J964m0308j6528J7351r376k3431
19474E404k5161r440J0488L6142L6527j1837j3687r325J7505K3392p60l7137k7335
19461e224l0808K1527j4978o847J1697M277k8841j6301L8509j4028j594r920N567
19448d6964J1059p537j4201K4645M5074l875N660m8760m0421j0855l65L0676K0648
19435c5216j1104n573j0366J3217l2341J1949L2476J8331K7940r711l6104J5310
19423b1192L2956N4183N269k1605k7592m7330l2178l388q20K4575L0643L1476
19411B4997M0235m7930n4526R761q806n29M113k3041l3151j1341O563L7103N3799
19398b753K6895M940l5946m7528j2849M0260K2845j2823k667L1019R541q678j3032
$$ plain form
19487 6954 -6826 463 14047 38045 32944 48905 75732 77696 37388 20860 38211 28835 5404
19474 5404 -19757 -29197 -18709 17433 53960 42123 28436 19111 36616 60008 59248 22111 -5224
19461 -5224 -36032 -14505 -29483 -36330 -24633 -20356 -49197 -65498 -26989 -41017 -42611 -52531 -46964
19448 -46964 -35905 -43442 -57643 -32998 12076 8201 13861 -34899 -75320 -86175 -86540 -55864 -35216
19435 -35216 -46320 -51893 -62259 -49042 -81383 -69434 -36958 -18627 9313 -398 -36502 -21192
19423 -21192 11764 65947 71216 49611 22019 -25311 -57489 -60877 -61697 -37122 -6479 24997
19411 24997 65232 17302 -37224 -27463 -36269 -36798 -32685 -55726 -88877 -100218 -93655 -56552 -2753
19398 -2753 24142 29082 -6864 -54392 -67241 -26981 -4136 -16959 -19626 11393 20934 12256 -776
19385g76L1376K4629m0696l7776Q486L5955J2334k1697j5874j8796p503m5179
19373g5517m0319K9748M700P648K934O0222K8917j8237n645L2933L3525k0361
19361D0548k4668M757j8989k1118J3609K8536j3736k3367P644M7992L7822Q947
19349H7977m963p5716o3762j5251J6700O3618K3999Q036L956r842K57j7360J2841
19336C0490K3138k6156j5665N423j7709l4524M805P005R236p462J2537l5555j2393
19323e6830M1812k988K3935Q111K568k5531k5186p420j14J0538J9746J9981j3657
19310e035j8549R798R130k9381O310K22J1378K2929m7162L143J8709q861j9271
19297d6640K469P322k1006L8284l4533k0170N190j1829J6258K750k0157M006J2173
$$ plain form
19385 -776 30600 55229 14533 -23243 -14757 21198 33532 11835 -4039 -22835 -30338 -75517
19373 -75517 -115836 -86088 -81388 -73740 -70806 -10584 18333 96 -5549 27384 60909 40548
19361 40548 15880 20637 1648 -19470 -5861 22675 8939 -14428 -6784 41208 79030 87977
19349 87977 83014 7298 -56464 -71715 -55015 8603 32602 40638 44594 34752 35009 17649 30490
19336 30490 53628 27472 11807 17230 -479 -35003 -30198 -23193 -13957 -21419 -8882 -44437 -56830
19323 -56830 -15018 -18006 5929 14040 16608 -8923 -34109 -41529 -41643 -31105 -11359 8622 -5035
19310 -5035 -23584 -13786 -4656 -34037 -27727 -27505 -16127 6802 -40360 -37217 -18508 -27369 -46640
19297 -46640 -44171 -36849 -57855 -19571 -54104 -74274 -69084 -80913 -64655 -61905 -82062 -78056 -65883
19284f5883J3349L663K3237J8065j7111l2273j606K8887K9258k5101k0183j1713
19272e7411J8564M7170K7635j7934J093J5903m76p975J2796r15l8975M4083J7133
19259F0691k2151k4412O755J6648l2433J4645J6998r377q695K116m68n422k3235
19246h340R685M757o380l1117j8773J5075r803M0465Q825p878L3357m2619n6277
19233f9023q647K3714R254J3198J8278L0099J01j1931l8350j1778j8711P69L5776
19220b7251J6418j2961j931M175J4920q772L580O572m1843n4390L8370p72K4555
19207c9330K7749n058j0481j7351R307K2433j4868m086J7531Q315O752n155j4995
19194a9237K681M228p471O889K1372L2374K28j5889j8413j6496j5896o369J9495
$$ plain form
19284 -65883 -52534 -48871 -25634 -7569 -24680 -56953 -58559 -29672 -414 -25515 -45698 -57411
19272 -57411 -38847 8323 35958 18024 19117 35020 34544 26569 39365 38450 -525 43558 60691
19259 60691 38540 14128 20883 37531 5098 19743 36741 27364 18669 20785 20317 14895 -8340
19246 -8340 1345 6102 -278 -31395 -50168 -35093 -44896 -4431 4394 -3484 29873 -12746 -69023
19233 -69023 -77670 -53956 -44702 -31504 -13226 16873 16974 5043 -33307 -45085 -63796 -63027 -27251
19220 -27251 -10833 -23794 -25725 -21550 -6630 -15402 -11822 -5250 -47093 -101483 -63113 -63885 -39330
19207 -39330 -11581 -16639 -27120 -44471 -35164 -12731 -27599 -31685 -14154 -5839 913 -4242 -19237
19194 -19237 -16556 -12328 -19799 -12910 8462 40836 41064 25175 6762 -9734 -25630 -31999 -12504
19181a2504K4662k6965j3183L3645M872q452j9290k9128K1120M8931L7865k0113
19169D1460l9327m537l082O615j7212l5734r453k298L5199K1607M639k415j8326
19156b2864j0103n037J0909J0149j3495P503R505J3364j5557l1125k354j1464
19144f0569K0133o82m4070K8206Q241J4467k273J0610L3827j2762j1508K402k17
19131a4195J704m178N460l911J0486k4139j2594K2195K5207J9j4820j0874j6991
19118c6631r232j9201j2544J3670m6821J1785K6723K2366R396n978K0211K9151
19106B895J7738J3308p721k012k0965j7576Q677P534k70k5998k9044O017P398
19093d0019M6712M435m2290k4843P720L657O560M1710n685k9954n540j6701L6470
$$ plain form
19181 -12504 12158 -14807 -27990 5655 10527 2075 -17215 -46343 -25223 23708 61573 41460
19169 41460 2133 -2404 -5486 1129 -16083 -51817 -61270 -63568 -28369 -6762 -2123 -4538 -22864
19156 -22864 -32967 -38004 -27095 -16946 -30441 -22938 -13433 -69 -15626 -46751 -49105 -60569
19144 -60569 -40436 -41118 -85188 -56982 -48741 -34274 -36547 -25937 7890 -4872 -16380 -13978 -14195
19131 -14195 -12491 -16669 -11209 -15120 -4634 -28773 -41367 -19172 6035 6054 -8766 -19640 -36631
19118 -36631 -45863 -65064 -77608 -63938 -110759 -98974 -72251 -49885 -40489 -46467 -26256 2895
19106 2895 20633 33941 26220 24208 3243 -14333 -5656 1878 1608 -24390 -53434 -47417 -40019
19093 -40019 6693 11128 -31162 -56005 -48285 -44628 -38068 3642 -2043 -31997 -37537 -54238 -17768
19080a7768J6688n065k2839m4465J1490L3999j2782l790J0143R540L3819N234
19068A4204K3407J9215l352l710n4476J870J3111L550l1349l7012J8316j9109
19056e5335l967L5873O711K352M359j0847j7511K502N592N908q109l3153J5213
19043e0412N853J2874K3058J3098j3489j2926L5666K0368J7273K5200l0257m7379
19031a073l1211J7870K0799M2299l8718n1852l3794M1073N4134l505J0111J5837
19019D1970j1475J2492m075l6861j3195K1810k5843l3843O635K1712M1992l7443
19007a6124l5161K2709J5330j3762K760J1609j8286l0152k745L1366K2072L275
18995g109N5305N372l8794k6823J0215L829j4078J0258m654m9197k2117K2865
$$ plain form
19080 -17768 -1080 -6145 -28984 -73449 -61959 -27960 -40742 -44532 -34389 -24849 8970 14204
19068 14204 37611 56826 53474 49764 -4712 -2842 10269 13819 -17530 -54542 -36226 -55335
19056 -55335 -59302 -23429 -16718 -14366 -10007 -20854 -38365 -35863 -30271 -24363 -32472 -65625 -50412
19043 -50412 -44559 -31685 -8627 4471 -9018 -21944 13722 34090 51363 76563 46306 -1073
19031 -1073 -32284 -14414 6385 48684 9966 -41886 -75680 -34607 19527 16022 26133 41970
19019 41970 30495 42987 38912 2051 -11144 10666 -15177 -49020 -42385 -20673 21319 -16124
19007 -16124 -51285 -28576 -13246 -27008 -24248 -12639 -30925 -61077 -63822 -32456 -10384 -7109
18995 -7109 48196 53568 14774 -12049 -1834 1995 -12083 -1825 -6479 -55676 -77793 -54928
18983e4928L3249j1420O499L6708M846J861K5150l763l9899j380k8337k1025O4136
18970A1697O3322k2846n6883k9022M2226J672k1342j7297P971K5047J4686j2525
18958F706j2659j452j9234j1511j292l0181k1114J487M5619Q724j931K6211L1125
18945B0498j1474k9604o279J7660k8036l3467k323L8379J7343K2427M92J0465
18933A6081K8899n977j1377l1909k2493k7856J0881J8637j6687L088M019J7258
18921a7436M027j4443N362k63K2334j8972K794R453L9773K9559k3918m5028l4819
18908d1577J446K0455O888K3649O397r029k1834N589j942o19J7319L0332p329
18895B9745l727L1018n693l6174N625P100k6143R116o216l0486J006J7036j0916
$$ plain form
18983 -54928 -21679 -33099 -26600 10108 14954 16815 41965 38202 -1697 -3077 -31414 -52439 11697
18970 11697 75019 52173 -4710 -33732 8494 10166 -11176 -28473 -20502 4545 19231 6706
18958 6706 -5953 -7405 -26639 -38150 -39442 -69623 -90737 -89250 -43631 -34907 -36838 -10627 20498
18945 20498 9024 -20580 -26859 -9199 -37235 -70702 -73025 -34646 -17303 5124 5616 16081
18933 16081 44980 39003 27626 -4283 -26776 -54632 -43751 -25114 -41801 -38713 -34694 -17436
18921 -17436 -13409 -27852 -22490 -22753 -419 -19391 -16597 -7144 32629 62188 38270 -6758 -41577
18908 -41577 -40131 -19676 -12788 10861 17258 8229 -13605 -8016 -9958 -10577 6742 37074 29745
18895 29745 26018 57036 51343 15169 20794 27894 1751 10867 4651 -25835 -24829 -7793 -18709
18882a8709j7993q979L4604L4170J0985l7804j7264J2438k447J4082L6851j3350
18870B6584k0329j1515K4785J5129n3948j0160m778L3876K7007p64j7343O813
18858A5357n732P288p104n233j5668K5177J504j5603l1232n1410J1295M5847N0007
18845B4493J2351m8059J7219q640k0132J7165J233l4381j4583K1348L684l3565
18833f1867p642j8639J4895K2945m1088j0372L9113L4691m397K0869M4326J1589
18821D4423J2252K9511J688k5392l707k6966m3850l7182J3052K2876J9276l3034
18809b7053l7074r002J4712K0145k81J7484M041j461L8140k360p315r634n773
18796e431j6605P166N4244J7386j9114k9225k323j1678j8337J3971J3222J6044
$$ plain form
18882 -18709 -36702 -45681 -11077 23093 34078 -3726 -20990 -8552 -10999 3083 39934 26584
18870 26584 6255 -5260 19525 34654 -19294 -29454 -34232 -356 26651 25887 8544 15357
18858 15357 9625 16913 9809 4576 -11092 14085 15589 -14 -31246 -82656 -71361 -25514 24493
18845 24493 36844 -11215 6004 -2636 -22768 -5603 -4370 -38751 -53334 -31986 -28302 -61867
18833 -61867 -69509 -88148 -73253 -50308 -91396 -101768 -62655 -27964 -32361 -11492 32834 44423
18821 44423 56675 86186 87874 62482 58775 31809 -12041 -49223 -36171 -13295 5981 -27053
18809 -27053 -64127 -73129 -58417 -38272 -38553 -21069 -17028 -18489 19651 17291 9976 342 -5431
18796 -5431 -22036 -14870 39374 56760 37646 8421 6098 -5580 -23917 -9946 3276 19320
18784A9320j8752J9264L9219k6012k3112L6236K5587J2691M1821K3290M2350O3921
18772B55823K6355j9565N365N5028J16096J13216M0965k5499o5188j17189n4208
18761C31199k551k9883p0386l1685k0299n2378j8623l4451l3612l44J3857O1302
18749A12146l1565p6333l6748L5557J6303j7702J3089N5144K4092k6354l3950
18738C3679M481L4433K5607m560K2562k3148o156k575K6460O2300J0103L7808
18726B20994N0694L0193J1169n1729n7388k0503k9271K7772J5654L429J2141J8067
18714B31222L5008P725o5302n9648k5731K541k8382O589j0369k8957k2884p3539
18702c1727K0482J5954K5743k6987J8589n461l2018M5907J3129J7576o877k0810
$$ plain form
18784 19320 568 19832 59051 33039 9927 46163 71750 84441 126262 149552 191902 255823
18772 255823 282178 262613 267978 323006 439102 552318 593283 567784 502596 385407 331199
18761 331199 328648 298765 228379 196694 176395 124017 105394 70943 37331 36987 50844 112146
18749 112146 80581 4248 -32500 3057 19360 1658 14747 69891 93983 67629 33679
18738 33679 38160 72593 98200 93640 116202 93054 86898 84323 110783 173083 183186 220994
18726 220994 271688 301881 313050 261321 203933 183430 154159 181931 197585 201014 213155 231222
18714 231222 266230 273955 208653 149005 123274 125815 97433 104022 93653 64696 41812 -31727
18702 -31727 -11245 4709 30452 3465 22054 16593 -15425 30482 43611 61187 54310 33500
18690C3500Q473J535m2521L0810J0903m0994j4980m700j310M027L0373J1843N584
18677C2543P896M0553R430J1085l339j0138K0217N421j3757J8420K459k2555P304
18664A05539j1009q27m081Q612J7886j233m1995j1872n065n005m4644j0836K9569
18651B5039k833k6382j8601j8821K0802J6508o022o102K0667K1046k492n365L5993
18638E3437j6139j4026l2826J4109K7158O245J3867K7103J7964L9979N9606k2804
18626A73673k0177M9586R082l4953j9037m09J109k7609M2851N6329M6043k5754
18614B50734m2356j7804M537K077j51o7107n8660J8572L120O055J085k0172k208
18601G7722k8922P715k6078j7846M2271L2027J0349m8571l4282j5287l6072o308
$$ plain form
18690 33500 41973 43508 987 31797 42700 1706 -13274 -17974 -19284 -15257 15116 26959 32543
18677 32543 40439 80992 90422 101507 98168 88030 108247 113668 99911 118331 120790 98235 105539
18664 105539 94530 93703 89622 98234 116120 114887 72892 61020 55955 50950 6306 -4530 25039
18651 25039 22206 -4176 -22777 -41598 -20796 -4288 -10310 -16412 4255 25301 22809 17444 53437
18638 53437 37298 23272 -9554 4555 31713 37958 51825 78928 96892 136871 196477 173673
18626 173673 153496 203082 212164 177211 158174 157765 158874 131265 174116 230445 276488 250734
18614 250734 208378 190574 195111 197188 197037 129930 71270 89842 92962 99017 100102 79930 77722
18601 77722 48800 56515 30437 12591 54862 86889 97238 48667 14385 -902 -36974 -43282
18589d3282K8019L168m5101j690J5020M6789N2402J3289p484j668J3774M7056
18577A20292J9152J471J1088j6502n786k5338L958j8169K4323R084j6209j4108
18565I3256K7282J8071J3754j2175j9458n0219l9116J424L0025K9473l7063l2066
18553B3188k247l0601R84J6374J8021J2852L825m8267l1092M4095L5361K7272
18541F9765L4148J3585n2265j0303k384q449J4379N064k5748J1458M3768M587
18529I7605k0583j7694p575P826J0928Q51k3566J715L8076K9814J9057l1950k5185
18516G9319j0348m058m1057l0621k4628L5098o349o074k2910J6766N262J2121
18504B521K9373Q404k0343l4622q316m036K3487j0540M2224K0262K0360N622q892
$$ plain form
18589 -43282 -15263 -12095 -57196 -58886 -43866 2923 55325 68614 61130 59462 73236 120292
18577 120292 139444 140915 152003 135501 129715 104377 108335 90166 114489 123573 107364 93256
18565 93256 120538 138609 152363 140188 120730 70511 31395 32819 62844 92317 55254 23188
18553 23188 20941 -9660 -8676 7698 25719 38571 42396 -5871 -36963 7132 42493 69765
18541 69765 103913 117498 65233 54930 52546 44097 58476 63540 37792 49250 93018 97605
18529 97605 77022 59328 51753 59579 70507 71358 47792 49507 87583 117397 136454 104504 79319
18516 79319 68971 64913 23856 -6765 -31393 3705 -2644 -8718 -31628 -14862 -9600 2521
18504 2521 31894 40298 19955 -14667 -22983 -27019 -3532 -14072 28152 48414 68774 74396 65504
18491F5504k4160l5942M930L0841K4943M4412L1513m7075k5901k4504L4169q24
18479G7906k9012j4494M579q914L4297J9338K4842K565J2694j4397m4800j1613
18467E2991R525k41k4540l7612j2301j7464j1239J8955M7444J0738n9682j7873
18455d1299J1265O2479O2298K9449j3906l438l0686M065j356m3419r429M4271
18443G0294L5051o047K625k4703K864K2178Q488l2405M7991Q22k8728j0829j0000
18430G7601K6072K4385j4575k4249L1462j6677p076K4951K329j5226j2151K2097
18418A18943K8109q125K3242m0009l4690n789J2522M0628J5098l9601r73O9488
18406A78843N23m1774J6612P962l0351o4466q164R315J6990L8044K5341M822k566
$$ plain form
18491 65504 41344 5402 10332 41173 66116 110528 142041 94966 69065 44561 78730 77906
18479 77906 48894 34400 38979 30065 64362 83700 108542 111107 123801 109404 64604 52991
18467 52991 62516 62275 37735 123 -12178 -29642 -40881 -21926 25518 36256 -23426 -41299
18455 -41299 -30034 32445 94743 124192 110286 106848 76162 80227 78871 35452 26023 70294
18443 70294 105345 99298 101923 77220 80084 102262 110750 78345 126336 127158 98430 87601 77601
18430 77601 103673 128058 113483 89234 120696 104019 96943 121894 124223 108997 96846 118943
18418 118943 147052 138927 162169 122160 87470 81681 94203 134831 149929 110328 109355 178843
18406 178843 179366 137592 154204 162166 131815 67349 59185 68500 85490 123534 148875 153697 151131
18393A51131K892k080J7447l721n5393m8110k6065l6266J0330N8418J7258p481
18381G8360l9220m931L3257M2582n419j7056j1317L5584O943K7434J0879J7748
18369A74844k0410l8139O912P654K1740J0380M4297O0123K4369j6341m791j6339
18357B54299k6138J4121l059n4655l6196L7602J0255j6369L0422J5240K6219J7448
18345B69189p4l1617j4634J6999J9828l8996K032P052l3749l6248J1317M3407
18333B14506M1797K2008j1553k4683J7526K2648K7782j5442l62K0184r303R940
18321C15048J0259M6558M1777K5854m4358j0705J9673M4988K6112J6748K492N8195
18309E52641O6933Q1296P1142J38793J18184R2922M2064M3351K5324J7462O9413
$$ plain form
18393 151131 154023 151943 169390 165669 110276 62166 36101 -165 10165 68583 85841 78360
18381 78360 39140 34209 67466 110048 104629 87573 76256 111840 118783 146217 157096 174844
18369 174844 154434 116295 123207 130861 152601 162981 207278 267401 291770 275429 270638 254299
18357 254299 228161 242282 239223 184568 148372 185974 196229 179860 210282 225522 251741 269189
18345 269189 269115 237498 222864 239863 259691 220695 222727 229779 196030 159782 171099 214506
18333 214506 256303 278311 266758 242075 259601 282249 310031 294589 294227 314411 305108 315048
18321 315048 325307 371865 413642 439496 395138 384433 404106 449094 475206 491954 494446 552641
18309 552641 619574 700870 772012 910805 1028989 1121911 1163975 1207326 1232650 1250112 1319525
18298A319525R4569P1402J05498J40004J39601J72596J41705J42574J79971J82070
18288B689515K81749M38457O33389R17285J394269K137703L218270M635010N973421
18279B2319068O870600O411115M378443J672766j474757m022356m787095m010726
18271B7357058j825539J079940L948346O048122O447112M491963J234719k567260
18263D6214461o006932p629426p602197o457315m784519l312694k177233j472226
18255F771919r73949o75395m47875k94031j60620o0900K3141N3762L2800M4694
18245D313546L7166M0041O6263J34362K40196M20093O42343Q88269J362461K066989
18235A0211729L142646M640633O223147P400737P375432N497490K720471p19616
$$ plain form
18298 1319525 1414094 1485496 1590994 1730998 1870599 2043195 2184900 2327474 2507445 2689515
18288 2689515 2971264 3409721 4043110 4960395 6354664 8492367 11710637 16345647 22319068
18279 22319068 29189668 35600783 39979226 41651992 40177235 36154879 31367784 27357058
18271 27357058 25531519 26611459 30559805 36607927 43055039 47547002 48781721 46214461
18263 46214461 40207529 32578103 24975906 18518591 13734072 10421378 8244145 6771919
18255 6771919 5797970 5122575 4674700 4380669 4220049 4159149 4182290 4236052 4268852 4313546
18245 4313546 4350712 4390753 4457016 4591378 4831574 5251667 5894010 6782279 8144740 10211729
18235 10211729 13354375 17995008 24218155 31618892 38994324 44491814 47212285 46492669
18227D6492669l912450n235987m838762k793356L25877L614027O295957P493879
18219D7441854O121676K717428j373177n673046q358853r005591q207288o461736
18211A7201267m568084l077058k053136j395626r51844o45300m58299l18464k11926
18202C521530j58263j55613j86847k01868j85529j61270j16544q5851J5364O0481
18192B345590P0938K3036L6011m0230o0760r4482l9086J1582P5009J28001J23028
18181B578637K42015M01319O38203Q31543J305137K176678L446882M862137N386230
18172B1868781L814849L27171k907539m335813l961246k684114j260400N8254
18164A0919943J486046K917909L913704L311940P12677k342474l986029m022379
$$ plain form
18227 46492669 42580219 37344232 32505470 29712114 30037991 33652018 39947975 47441854
18219 47441854 53563530 56280958 54907781 49234735 40875882 31870291 23663003 17201267
18211 17201267 12633183 9556125 7502989 6107363 5155519 4510219 4051920 3733456 3521530
18202 3521530 3363267 3207654 3020807 2818939 2633410 2472140 2355596 2269745 2285109 2345590
18192 2345590 2416528 2439564 2475575 2435345 2374585 2280103 2241017 2252599 2327608 2455609 2578637
18181 2578637 2820652 3221971 3860174 4691717 5996854 8173532 11620414 16482551 21868781
18172 21868781 25683630 26010801 23103262 18767449 14806203 12122089 10861689 10919943
18164 10919943 12405989 15323898 19237602 22549542 23262219 20919745 16933716 12911337
18156A2911337l201816k184081j487865j000032o92150m99287l57283k97075j61867
18147C029881m6415J4339M745L4494O6054M9063L0285R5618J21003J48644K37491
18136C785202L52311L97339M66796N64170P72684J075724J610866K510724L992318
18127A5528134N950586P575082P240943M485111J326594K59348R10333J229423
18119D4505554m37545k660990l229783j404767J691209M268433N402021O328591
18111E4462723J0191974J8257027K4629160J3134114j1898424k5322784k5797150
18104E7656640j9203628j1861824p169020m409905k890919k056194j522853j094798
18096G447499p34738n75770m15863k94125j93779j58056k27159k20740k15244
$$ plain form
18156 12911337 9709521 7525440 6037575 5037543 4345393 3846106 3488823 3191748 3029881
18147 3029881 2983466 2997805 3002550 3037044 3103098 3152161 3182446 3278064 3399067 3547711 3785202
18136 3785202 4137513 4534852 5001648 5565818 6338502 7414226 9025092 11535816 15528134
18127 15528134 21478720 29053802 36294745 40779856 42106450 42365798 43276131 44505554
18119 44505554 44068009 41407019 38177236 36772469 38463678 42732111 48134132 54462723
18111 54462723 64654697 82911724 107540884 120674998 108776574 83453790 57656640
18104 57656640 38453012 26591188 19422168 15012263 12121344 10065150 8542297 7447499
18096 7447499 6712761 6136991 5721128 5427003 5233224 5075168 4848009 4627269 4412025
18087D412025k39814j10681j2946J44294K84467L64550L82254N97479Q66847J269013
18077G957488K104713L499993N494961P240969P076874L653952j425679n065673
18069C0537598o035060m895769k926916r49724Q82510K805234M566558N225497
18061B9209928L321953q44745m570045o039177n588827m189268k829593j825067
18053F645159j288170j013320p63866n51316l81532k33013k15428j94578j09375
18044A894561p5082q7901j17060r1220o3834o3766q8553k5853M8026P5989N7380
18033A462687L9803L0345q741q5084j09186j36405r5032l3140o334J5639K0221
18022A094773N1480P6629L4570J1351N53j7202j2428J489l5755J6617N5601R9944
$$ plain form
18087 4412025 4172211 4061530 4048584 4192878 4477345 4841895 5224149 5821628 6688475 7957488
18077 7957488 10062201 13562194 19057155 26298124 33374998 37028950 35603271 30537598
18069 30537598 24502538 19606769 16679853 15730129 16612639 19417873 23984431 29209928
18061 29209928 32531881 31687136 27117091 21077914 15489087 11299819 8470226 6645159
18053 6645159 5356989 4343669 3579803 3028487 2646955 2413942 2198514 2003936 1894561
18044 1894561 1819479 1731578 1614518 1523298 1459464 1395698 1307145 1281292 1329318 1405307 1462687
18033 1462687 1502490 1532835 1524094 1439010 1329824 1193419 1098387 1065247 1058913 1074552 1094773
18022 1094773 1146253 1222882 1257452 1268803 1269356 1252154 1239726 1241215 1205460 1222077 1277678 1377622
18010A377622J14939M5402P8640J73638J54301J52356J87183J91693J78164J64242
18000B818180J34538J46796P4569J2562j5273n1254n0426r5513j38973q6138m5558
17989B703510j11083q9581p4767j5627p956L6665M4056M3409J06431Q8871J39191
17978B863119J33651P4322N1499k3460n6586p7447r4112q0017j9527L1668O9711
17967B872821N2653Q5580Q5694J17531P0654P7236j4006j51955j80240j78661
17957B837307j96313j29826j36602j66759j40184j5942K7622j3354j3931j3086
17947B038932l9817l7942M902n566k6546m0162o947K2651M7060K2965K2845Q7190
17935B089565M7652L506m2660j28785j58767j55685p5855n7550O422J23401J60462
$$ plain form
18010 1377622 1492561 1537963 1616603 1790241 1944542 2096898 2284081 2475774 2653938 2818180
18000 2818180 2952718 3099514 3174083 3186645 3171372 3120118 3069692 2974179 2835206 2749068 2703510
17989 2703510 2592427 2502846 2428079 2412452 2404496 2441161 2485217 2528626 2635057 2723928 2863119
17978 2863119 2996770 3071092 3122591 3099131 3042545 2965098 2870986 2790969 2771442 2803110 2872821
17967 2872821 2925474 3011054 3096748 3214279 3284933 3362169 3348163 3196208 3015968 2837307
17957 2837307 2640994 2511168 2374566 2207807 2067623 2051681 2079303 2065949 2052018 2038932
17947 2038932 1999115 1961173 1966075 1960509 1933963 1893801 1886854 1909505 1956565 1979530 2002375 2089565
17935 2089565 2137217 2140723 2098063 1969278 1810511 1654826 1578971 1521421 1527843 1651244 1811706
17924A811706J40391J09702P0209n1448j80517k48840k44709j61357j64167j23793
17914I57177j03001m7308k4340J4326L8677n062m0676k6435L2247L0718J4697
17903H41020J9629k2437m941J0026K2744K7562K2777K9375M5521M2682R2357J01905
17891A228220J23768J85179J94255J48008R0811M4111K7692J1776M732l6879j8889
17880B002784O4015P6762L0172m5448q8950q4203j30909j32084j33314j61218
17870A397607j33728j07178k9842J1670M7973N9735k143q341o0341r7067j25799
17859I52546r1073r4877j14777m9326l2431m3182m8257K0571k099m1968N833K6727
17847D87687m6877k8127k5287J536Q270K0476K1468k91k746N5781J14241J29610
$$ plain form
17924 1811706 1952097 2061799 2132008 2080560 1900043 1651203 1406494 1245137 1080970 957177
17914 957177 854176 806868 782528 796854 835531 830469 789793 763358 795605 826323 841020
17903 841020 860649 838212 833271 843297 866041 893603 916380 945755 991276 1033958 1126315 1228220
17891 1228220 1351988 1537167 1731422 1879430 1970241 2014352 2042044 2053820 2058552 2021673 2002784
17880 2002784 2066799 2143561 2173733 2128285 2039335 1955132 1824223 1692139 1558825 1397607
17870 1397607 1263879 1156701 1126859 1138529 1186502 1246237 1244094 1235753 1175412 1078345 952546
17859 952546 861473 766596 651819 602493 570062 526880 478623 499194 497095 455127 460960 487687
17847 487687 440810 412683 387396 388932 397202 417678 439146 438855 436109 491890 606131 735741
17835G35741J22477P4476J24975J36632J36668R9187J37710J03103J11583N7145
17825A839697m163p0663j16799j20499j00461n9706j9941k7457j3484L6225O2672
17814A405421M5791L6261L010K5984m9692r2164j36253k01858j86268j52967j08787
17803E88478l8113m2554j6737o625l5388j0512j5662l3393j6033j5217k3899l9639
17791B94706k821n352K6954J5355J6008J4686L7115j1848N308L4399M0532j1483
17779D53559j9322R518J2325m410j5442M433j5153K0980o712J366L9655O1691
17767E42488L0380r220l922O371j2002J4582m3206o3129n2555k7751m8072l0953
17755C03011l8501j4215J9279K216l3288k746L8048j8385k9747l4982k6315K8896
$$ plain form
17835 735741 858218 932694 1057669 1194301 1330969 1430156 1567866 1670969 1782552 1839697
17825 1839697 1835534 1764871 1648072 1527573 1427112 1367406 1347465 1320008 1306524 1342749 1405421
17814 1405421 1451212 1487473 1490483 1516467 1466775 1374611 1238358 1036500 850232 697265 588478
17803 588478 550365 507811 491074 484449 449061 438549 422887 389494 373461 358244 334345 294706
17791 294706 291885 286533 313487 328842 344850 359536 396651 384803 390111 424510 465042 453559
17779 453559 434237 443755 456080 451670 436228 440661 425508 446488 439776 441142 480797 542488
17767 542488 572868 563648 559726 566097 554095 568677 525471 462342 409787 382036 333964 303011
17755 303011 264510 250295 269574 271790 238502 235756 273804 255419 225672 190690 164375 193271
17743A93271J8156k476L4931M4175o213K6631J2814j4943J989J196L7161J7192
17731C63884M9691L2091N9947L6287P75m4880l2632k2865M827j7766J2791M2434
17719D84584N3237M7980J3215J4482j1451m100k6303l2035j2807k5250q17o956
17707D93779l4755k5600n605J7978m100K012k1725k5822j307l391k5963k5560
17695C39941J9263r33m0j725O8986J1134k899o3243k7015L029K9351l0011J5231
17682C61069L7305k4879j4275L1157L9904N1002R1210J04470J17516J15199R1060
17671A000738N1543M5581L8939M719l1775k8912k2368j01759j03154r5938j00018
17660F57596m8034J77j4306o2404k8183k6186q007l439K9438L9294J5507J4440
$$ plain form
17743 193271 211427 208951 243882 288057 281844 308475 321289 306346 308335 309531 346692 363884
17731 363884 413575 445666 505613 541900 542675 497795 465163 442298 447125 429359 442150 484584
17719 484584 537821 585801 599016 613498 602047 597947 571644 539609 526802 501552 500735 493779
17707 493779 459024 433424 427819 445797 441697 443709 421984 396162 394855 391464 365501 339941
17695 339941 359204 358271 358231 356506 425492 436626 433727 370484 343469 346498 375849 345838 361069
17682 361069 398374 373495 359220 390377 430281 481283 572493 676963 794479 909678 1000738
17671 1000738 1052281 1097862 1136801 1141520 1109745 1080833 1058465 956706 853552 757614 657596
17660 657596 609562 609739 595433 533029 504846 478660 470653 467214 496652 535946 551453 565893
17648E65893K8256L9270L8540L7569K7560j0705Q276K7360J8474L0822N3455Q7898
17636I52668Q3513O4859J5900J0783J8477N1609J28797J81882J48276J41001M9396
17625A847161K7946L1491M6778J14430K09404K93885M30159O07402Q06433J130850
17615E545939J736603K735272M184961N722194O325281M971792J772012j052172
17607C1941882j869789m13979K231219L815168K699382j065096m977141o930547
17599B5431099o693368n222044l584121k328336j471136r45465o64614n04718
17591D017297l03481j20736j17223o3780p081P7275J18922J14239L4536R379N8530
17580C817877J02954O3483M172j9724J7671J41348K77177M54776O02124Q89542
$$ plain form
17648 565893 594149 633419 671959 709528 737088 726383 734659 762019 780493 811315 864770 952668
17636 952668 1036181 1101040 1116940 1127723 1146200 1197809 1326606 1508488 1656764 1797765 1847161
17625 1847161 1875107 1906598 1953376 2067806 2277210 2571095 3001254 3608656 4415089 5545939
17615 5545939 7282542 10017814 14202775 19924969 26250250 31222042 32994054 31941882
17607 31941882 30072093 29658114 31889333 35704501 38403883 37338787 32361646 25431099
17599 25431099 18737731 13515687 9931566 7603230 6132094 5186629 4522015 4017297
17591 4017297 3713816 3593080 3475857 3412077 3404996 3482271 3601193 3715432 3749968 3759347 3817877
17580 3817877 3920831 3984314 3988486 3968762 3986433 4127781 4404958 4859734 5461858 6351400
17570F351400J307139J892245K793073M157489O253980Q840208J0521346R397134
17562E1514014M789128n18613k981940j524094K639655O188752N720429L4224
17554F5861555p117854j1517307j2061137r881653p010171m628403k965812j925944
17546H753274j280888r46634o21433l69055k13296j06320m8836l9925l737O560
17536E129710k4917L697Q319J14835J98670L08967L91539M13191M86479P02296
17526G732786J037555J550312K330608L390992M841322O457829Q161544R712197
17518D5215145J0831152J1267237J0193933O938829K693642n52895k040193j798108
17510H2748742p35113p73349l147851p007061j0143097j1418184j0839332r029182
$$ plain form
17570 6351400 7658539 9550784 12343857 16501346 22755326 31595534 42116880 51514014
17562 51514014 56303142 55784529 52802589 51278495 53918150 60106902 65827331 65861555
17554 65861555 58743701 47226394 35165257 25283604 18273433 13645030 10679218 8753274
17546 8753274 7472386 6525752 5904319 5535264 5321968 5215648 5166812 5126887 5123150 5129710
17536 5129710 5104793 5108490 5116809 5231644 5430314 5739281 6130820 6544011 7030490 7732786
17526 7732786 8770341 10320653 12651261 16042253 20883575 27341404 35502948 45215145
17518 45215145 56046297 67313534 77507467 84446296 87139938 86587043 84546850 82748742
17510 82748742 82013629 81240280 78092429 71085368 60942271 49524087 38684755 29655573
17502B9655573o998881n206107l674779k540639j761618j262022q78144o78360
17494F655023n47817m09177k79694k18428j62603j34883j75264j64171n6651N7215
17484D563550J15166J95457J59719J55452J79664J34450J95949K97591L75785
17475F372783N22825P17418R43541J287683J959539K850323L907100N017950N855772
17466B9434934N984642N643556M870725L592657K192090J074146L4672r82429
17458E1844993j726850k299118l041832l944343m702212n337324n555804n236218
17450B0001292m535970l605340k618113j837648j272103q19789n44635l55322
17442D412372k49466l34284l49289l24888k65758j53785j77813j97435j24770
$$ plain form
17502 29655573 22656692 17450585 13775806 11235167 9473549 8211527 7333383 6655023
17494 6655023 6107206 5698029 5418335 5199907 5037304 4902421 4727157 4562986 4506335 4563550
17484 4563550 4678716 4874173 5033892 5189344 5369008 5503458 5699407 5996998 6372783
17475 6372783 6895608 7613026 8556567 9844250 11803789 14654112 18561212 23579162 29434934
17466 29434934 35419576 41063132 45933857 49526514 51718604 52792750 52827422 51844993
17458 51844993 50118143 47819025 44777193 40832850 36130638 30793314 25237510 20001292
17450 20001292 15465322 11859982 9241869 7404221 6132118 5312329 4767694 4412372
17442 4412372 4162906 3828622 3479333 3154445 2888687 2734902 2557089 2359654 2234884
17433B234884p9957j2401J1642L5192J7118q34n783O495l513k1278r0179m2277
17421B049109n6047j09757n6710j18171j32188j18280j07509j29878j44841o0973
17411A014755l4667p6832m1130l1034n1985l6569K888J6161k8582m9616k3668
17400F59721l1074j705J8709n6239j1030k1838n0518k0552l080k2723J2728m4177
17388D28222o161k0011j3857l4786n733l8633j184j220J1532m1404j2969j0296
17376B53500j5021k6246L3192N4038Q334j9393k071j2822J4641L4976L0906K6278
17364C80312K3980j0103k5783P736M608m111J5274M2313L2663M7409P2975O8494
17352F55767Q3836J27596J83519K23012K45535K52512K04032J18746P889j04235
$$ plain form
17433 2234884 2154927 2142526 2154168 2189360 2206478 2205644 2199861 2206356 2202843 2181565 2091386 2049109
17421 2049109 1993062 1883305 1826595 1708424 1576236 1457956 1350447 1220569 1075728 1014755
17411 1014755 980088 903256 862126 831092 779107 742538 745426 761587 733005 683389 659721
17400 659721 628647 626942 645651 589412 578382 556544 506026 485474 482394 459671 472399 428222
17388 428222 422061 402050 388193 353407 347674 309041 307857 306637 318169 276765 263796 253500
17376 253500 238479 212233 245425 299463 307797 288404 286333 273511 288152 323128 354034 380312
17364 380312 404292 394189 368406 376142 380750 376639 391913 434226 466889 514298 587273 655767
17352 655767 739603 867199 1050718 1273730 1519265 1771777 1975809 2094555 2102444 1998209
17342A998209j88671j93669k41399k20005k05466k02929j50945r1241n9214l9315
17332D05355q0574n1649n4130m80o7J074J8300m905K0746K9222m3567k9040J098
17319B11383M9333P0980j0098N670M9508L1287p795K4858R894j0251J5830l3597
17307D07002o7810J3596K6489k0933k4899L6825P5011N8661O9926R1909J23511
17296G89288K04512K33410K14613J51338Q7933L0254q374j09104j93980k40780
17286A159110k02291j95032j66036j11637n6132p0687o0188m2915l2944j6882
17276B04366J238l1225k3596k0695N2280M3218j2658l3718k3462M9238L8710j8348
17264B25348l7864m825K4871r918K3845j8699K285N6208j051j6849k7031n3804
$$ plain form
17342 1998209 1809538 1615869 1374470 1154465 948999 746070 595125 503884 444670 405355
17332 405355 324781 273132 219002 218522 218455 219529 237829 232924 253670 282892 239325 210285 211383
17319 211383 260716 331696 321598 327268 376776 408063 400268 425126 435020 424769 440599 407002
17307 407002 339192 352788 379277 358344 333445 370270 445281 503942 573868 665777 789288
17296 789288 993800 1227210 1441823 1593161 1681094 1711348 1702974 1593870 1399890 1159110
17286 1159110 956819 761787 595751 484114 427982 357295 297107 254192 221248 204366
17276 204366 205604 174379 150783 130088 182368 225586 212928 179210 155748 204986 243696 225348
17264 225348 187484 182659 207530 197612 221457 202758 205043 261251 260200 243351 216320 162516
17252A62516J70K9387l5993j9311j2999m785j6340K6863O270k3917j2038n2772
17240D7051m2874n323K1926K8517j8252K6600K9089L2332L5780k423j6078O097
17228A42442O674j2407k7977r706P6j8482J0473J2401j4450K2779j5998l3605
17216F2220P859J3029k011j6033K2567r611R920Q427n5129k3815k306M620j1785
17203G952P166K311J9878O182k7353j5442j1826j81P732K2265n77k6670j4489
17190b3052R804J7657L4721M2378K6122k1377J1225m658j8851j4230P945k3047
17178D4637m799O04M717j1097J2112l920l7687j1039M4575K635q093K7279M5849
17165A05773l3073K998o313m2553m0918J0041K7393j1535p136M7645J621L0882
$$ plain form
17252 162516 162686 192073 156080 136769 123770 118985 102645 129508 135778 111861 99823 47051
17240 47051 4177 -1146 20780 49297 31045 57645 86734 119066 154846 152423 136345 142442
17228 142442 149116 136709 108732 99026 99102 80620 91093 103494 89044 111823 95825 62220
17216 62220 70079 83108 81097 65064 87631 78020 87940 96367 41238 17423 15117 19737 7952
17203 7952 15118 17429 37307 43489 16136 694 -11132 -11313 -3581 18684 18107 -8563 -23052
17190 -23052 -13248 4409 39130 81508 107630 86253 97478 92820 73969 59739 67684 44637
17178 44637 39838 40442 45159 34062 46174 42254 4567 -6472 38103 40738 32645 59924 105773
17165 105773 72700 75698 69385 26832 -14086 -4045 23348 11813 4677 52322 53943 84825
17153H4825K8151m0640n9254L548N848N488k1094j9943o610r28M3992N4196j1620
17140F5959l48J6382l7624r989R005k2077k7279J6718l284l1810L5939J2844J8085
17127D2521J4878k0356k8931J8517K2826k9935k3113M3798J7933j2099K1161j5853
17115E1347l7314N658j3888j6677P424m834J8042j5150K8788l501K3352L686l2289
17102A4644j820K1274J6478M8907L1913P420K9635L4117M2248o915n4134m422
17090A79345J9912L2075J2104l55m8413n4635m1052n818Q619J7351o854k9924
17078H2355p515p04K0441m756k9477l771j7317j0260l6142n741K3633k066R165
17065A7845N3849M6165m3211j6347K4248l8288n182M8685Q045k3067J7469N973
$$ plain form
17153 84825 112976 72336 13082 16630 22478 27966 6872 -13071 -19681 -20609 23383 77579 65959
17140 65959 65611 81993 44369 34380 43385 21308 -5971 10747 7463 -24347 11592 24436 42521
17127 42521 57399 37043 8112 26629 49455 19520 -3593 40205 58138 46039 67200 51347
17115 51347 14033 19691 5803 -10874 -3450 -8284 9758 -5392 23396 19895 43247 46933 14644
17102 14644 12824 34098 50576 99483 131396 138816 168451 202568 244816 237901 183767 179345
17090 179345 199257 231332 243436 243081 194668 140033 98981 93163 101782 119133 112279 82355
17078 82355 74840 74136 94577 89821 60344 56573 39256 28996 -7146 -12887 10746 8680 17845
17065 17845 71694 117859 74648 58301 82549 44261 39079 87764 95809 72742 90211 96184
17053I6184k31K9583m668m229R9430O3246M7482J5907l1891n2822K3041M0155
17041C21187M3468K2667l1209o3955o3835n1107l2788k4515j7898J2212K4300
17030A38527J1771j4549J8797k3221l7451J8929J4901j7558k2149J1331M4676
17019A44004Q595j0976O3779N6584K8466M1494N6004J9306o8821k2049J985J9797
17007C38168J6068n200l1176l9240k7040J0712J2427o390l2554l2093m358l9049
16995A60275M384L1509P791K2802j2386m2721l1705q336l8858m4524J8228l4261
16983C2198q700P775K8898j3782l7030N829R243o371k394L3706K8510J2375j5752
16970G4505m0270r784R901K0180L2857M7507M0009K7475J4922J4371O389J9175
$$ plain form
17053 96184 95953 125536 120868 116639 216069 279315 326797 342704 310813 257991 281032 321187
17041 321187 364655 387322 356113 292158 228323 177216 144428 119913 102015 114227 138527
17030 138527 150298 135749 154546 131325 93874 112803 127704 110146 87997 99328 144004
17019 144004 152599 141623 205402 261986 290452 331946 387950 407256 338435 316386 318371 338168
17007 338168 354236 349036 317860 278620 251580 262292 274719 268329 235775 203682 199324 160275
16995 160275 164659 196168 203959 226761 214375 171654 139949 131613 92755 48231 66459 32198
16983 32198 23498 31273 60171 46389 9359 15188 24431 18060 15666 49372 77882 90257 74505
16970 74505 34235 24451 34352 54532 87389 134896 174905 202380 217302 231673 238062 257237
16958B57237M2865J3284j6084p097m2533m9368m4561l2932n455l404l180k0565
16946H8207j6650J8140k3261p142k4943k0197r247P138k4026J2946J2614j5004
16934a425K7049M300j8946O038L1802L0741l4592l6895k2304j462J515M9694J15
16921C5630l1351j0357m3029M1906M7469p63J7142K760N977p676l6396l3438J6698
16908D572j5297k5006k5039J8169J9989M1653K0649m4405k132k3741M116M5413
16896A8941J7448k5572k8085L630J6624L8801m525l0984l0559O689L1143J5875
16884B9426K2435j7240k9300L3215k0724R552j0302j5582j1707J4351j812J570
16872C882k923m645j3o65R485J1148K2796J9650N463j1646k4716N435j6619m2491
$$ plain form
16958 257237 300102 313386 297302 290205 247672 198304 153743 120811 115356 111952 108772 88207
16946 88207 71557 89697 66436 59294 34351 14154 4907 12045 -11981 965 13579 -1425
16934 -1425 25624 29924 10978 17016 48818 79559 44967 8072 -14232 -15694 -14179 35515 35630
16921 35630 4279 -6078 -49107 -7201 40268 39505 56647 59407 65384 57708 21312 -12126 4572
16908 4572 -10725 -35731 -60770 -42601 -22612 19041 39690 -4715 -6847 -30588 -26472 18941
16896 18941 36389 10817 -17268 -13638 2986 41787 37262 6278 -24281 -17592 13551 29426
16884 29426 51861 34621 5321 38536 17812 27364 17062 1480 -10227 4124 2312 3882
16872 3882 959 -3686 -3699 -4364 5121 16269 39065 58715 64178 52532 27816 33251 16632 -25859
16858b5859J0406j864J2130L1710l621k2027j1244k8601k802K7359L1981J6139
16846C3707R452k0192O821P699k2216j8886O88p729k655J3140j01j0458k663k2976
16832c6369j6583J3934L6529k727k972M820K794K9596J008n407m7902L0654L7934
16819D5309K3785k7576k7496k0148K0072j2925K274K887K1178l3797k0759J0542
16807a6654J9185o620n389m1250M894L0597M684N934P186J1985m4257p945K465
16794c5185J1337J3737J0738L527N247O981M214j7941j0088l5543j1316k7898
16782h2190J5642O4240q961p893j2645o251k1417P850J0129J358m296J5109O027
16769b3298Q095o824p764m4481J5548P162J2799M7330L8431l3663j0634J0527
$$ plain form
16858 -25859 -15453 -17317 -5187 26523 22902 875 -10369 -38970 -41772 -14413 17568 33707
16846 33707 43159 22967 29788 37487 15271 -3615 -2927 -10656 -13311 -171 -272 -10730 -13393 -36369
16832 -36369 -52952 -39018 -2489 -5216 -8188 -3368 -574 29022 30030 24623 -23279 7375 45309
16819 45309 69094 41518 14022 -6126 13946 1021 3295 6182 27360 -6437 -27196 -16654
16807 -16654 2531 -4089 -9478 -50728 -45834 -15237 -10553 -4619 2567 14552 -29705 -37650 -35185
16794 -35185 -23848 -10111 627 4154 9401 16382 20596 2655 -7433 -42976 -54292 -82190
16782 -82190 -66548 -2308 -11269 -19162 -31807 -38058 -59475 -51625 -41496 -40138 -44434 -29325 -23298
16769 -23298 -15203 -22027 -29791 -74272 -58724 -51562 -38763 8567 46998 13335 2701 13228
16757A3228K7005P853m290J575J8033k4318M636J1154J9377l5093o1353K4370
16745B177n005R695K3297J1577J9329l7437r434k9951M237K3406j0395J1795k143
16732A1148j3492p116P746K7704J2557k0488k1349M631R686j042o905r685O171
16719d34j3008J0710L9541R949j9573K5121L9262j9565k8107l5320k4695q784
16707b4903k594M1651M0200R11j5223o5622m2379J9867N6979N3683L539J4559
16695H0668J2706J7405m0829j8258n0698m236L0652q700K138K6421K3881j2727
16683E8423Q703l9314j0602J6913l3717j0659l0764n851K9789K8562P299L6457
16671E5239J0340j4227J557p590k4680m678J5160j3806R471r477m7202J2867K1508
$$ plain form
16757 13228 40233 48086 43796 45371 63404 39086 43722 54876 74253 39160 -22193 2177
16745 2177 -2828 6867 30164 41741 61070 23633 14199 -15752 -11515 11891 1496 13291 11148
16732 11148 -2344 -9460 -1714 25990 38547 18059 -3290 1341 11027 9985 3080 -6605 -434
16719 -434 -13442 -2732 36809 46758 27185 52306 91568 72003 43896 8576 -16119 -24903
16707 -24903 -27497 14154 54354 55265 40042 -25580 -67959 -48092 8887 62570 66109 80668
16695 80668 93374 110779 69950 51692 994 -3242 27410 18710 20848 47269 71150 58423
16683 58423 67126 27812 17210 34123 406 -10253 -41017 -46868 -17079 11483 18782 55239
16671 55239 65579 51352 52909 45319 20639 15961 31121 17315 26786 17309 -29893 -17026 4482
16658D482j339m0777K2558R094j248r739K0985n320K386J7850K5226K3209K325
16645F9692k3651k7510l858k0146k9996K1463M2707N675J1621j1660k1324L6097
16633D9110q481k1846j1118M704K0721M857j513K0045j8231K1538j1992k7294
16621B0500l2058m1280J122K8035R009j5308j0064J5568O837K8942J5299l3846
16609g244k2111j1143j0815K2248L0156o063n152m45M50k1766j6975J460P582
16596c9818l1917J4868J3029N16k8699M7799K2345q732K4552K5062l0448p381
16584A176P259J2146j496N010K2958L9127N978k2277l2796j1631J1137J0365j3921
16571C3035o0341j9158k63p772L1925r839J9097J4970k1709l6303M87K4944q707
$$ plain form
16658 4482 3143 -37634 -15076 -5982 -7230 -16969 4016 -1304 1082 18932 44158 67367 69692
16645 69692 46041 18531 14673 -5473 -35469 -14006 28701 34376 45997 34337 13013 49110
16633 49110 40629 18783 7665 12369 33090 37947 36434 56479 38248 59786 47794 20500
16621 20500 -11558 -52838 -51716 -23681 -14672 -29980 -40044 -24476 -17639 11303 26602 -7244
16609 -7244 -29355 -40498 -51313 -29065 1091 -4972 -10124 -10569 -10119 -31885 -48860 -47400 -39818
16596 -39818 -71735 -56867 -43838 -43322 -72021 -24222 -1877 -10609 13943 39005 8557 1176
16584 1176 8435 20581 19085 24095 47053 86180 92158 69881 37085 25454 36591 46956 33035
16571 33035 -27306 -46464 -46727 -54499 -22574 -32413 -13316 1654 -20055 -56358 -55871 -30927 -39634
16558c9634k6676K4158K9704Q953J2842L2508q797k3371J210j9824J29P61l009
16545a1046K070o064k0678k4312J3730J5021J547j7362k051J9975K0012J3429
16533D271p730l3522P195L466Q592J3883j1420K4611R559N333n237L4408l121
16520E0288k7825l0366r027j6411L1706J4747n3222j2600J4747J8742L0329M289
16508A5397j2280N206J8898j9195j7165J9589J4628n115l6720r558j9981m2698
16496h8994l4238m729J3802N2786j2302j4765K6760J3649K315L8527J7626k7744
16484a7307q663L3312P912j603K1526p775l2426q704J6747q487K975J1967N882
16471A5356L166J3888m291k2939l4340L7164M664n6392j200M6111J5193O020r683
$$ plain form
16558 -39634 -66310 -42152 -12448 -3495 9347 41855 33058 9687 10897 -8927 -8798 -8037 -11046
16545 -11046 -8976 -15040 -35718 -60030 -46300 -31279 -29732 -47094 -49145 -29170 -9158 4271
16533 4271 -3459 -36981 -29786 -26320 -17728 -3845 -15265 9346 18905 24238 19001 53409 50288
16520 50288 22463 -7903 -16930 -33341 -1635 13112 -40110 -52710 -37963 -19221 11108 15397
16508 15397 3117 8323 27221 8026 -9139 10450 25078 19963 -16757 -26315 -46296 -88994
16496 -88994 -123232 -127961 -114159 -61373 -73675 -88440 -61680 -48031 -45716 -7189 10437 -17307
16484 -17307 -25970 7342 15254 13651 35177 27402 -5024 -13728 3019 -5468 -2493 9474 15356
16471 15356 18522 32410 28119 5180 -29160 8004 12668 -43724 -44924 1187 16380 22400 12717
16458A2717j8040N32K2184L5808k3481j0018k535l6408k6143j2608L1613n060
16446c1439p256J4449L4816J4052k0321k9607l3183m903K9318l07L7926J7806
16434B1351r450j5689K4950j4310l3384j8098J4303j4906N7105L292m8430l573
16422c6839J1507j64n584k0526O0264L634J2313J6219k0164k4597K6797k6924
16410d064l0301J0141k732J7697K3559P320l2753k535K6280N229J3948j1399r279
16397A1111K1117k3384l1460k2093R884L7432k2089J0653J8818p365K4n315k2375
16384b5042j6489K3864K5780j1j9508k077J6465J1923K5150N301K0915m048n1186
16371A1037k6938j9487p973j0856K4341J8367K4929r624Q823k9939J7611q775
$$ plain form
16458 12717 -5323 -4791 17393 53201 29720 19702 17167 -19241 -45384 -57992 -26379 -31439
16446 -31439 -38695 -24246 10570 24622 4301 -25306 -58489 -63392 -34074 -34381 3545 21351
16434 21351 11901 -3788 21162 6852 -26532 -44630 -30327 -45233 11872 15164 -33266 -36839
16422 -36839 -25332 -25496 -31080 -51606 8658 12292 24605 40824 20660 -3937 22860 -4064
16410 -4064 -34365 -24224 -26956 -9259 14300 21620 -11133 -13668 12612 17841 31789 20390 11111
16397 11111 32228 8844 -22616 -44709 -34825 2607 -19482 -8829 9989 2624 2648 -2667 -25042
16384 -25042 -41531 -17667 8113 8102 -11406 -13483 2982 14905 40055 45356 66271 62223 11037
16371 11037 -15901 -35388 -43361 -54217 -29876 -11509 13420 3796 12619 -17320 291 -8484
16359h484o180P884J6725J1629L883L186Q265m077J5915k6409J4011O060k4282
16346A8126k5712R701L2245J6192j8247l3942j4415K8969J5998K0425p065q178
16334C4097J4743j1479l1564k8078J1179K5931L985J5967J634L6992o535L468
16322G0340o841k6119k9494n8227J6339J7082J3355P08R187K3206J5617l1155
16310A3998j7036J9287j0848j1205K3375j1399O012q87j527K662j9078l5531J4739
16297b7438L7742K5414P644l0836J9365Q619P303K4544K8980l5325m9674j4723
16285A615J7517P622k5775N7235Q589k3670R66Q402m4079m550M749J5781m1j4830
16271I531k7078R622J0343o325k5199J2425K4947K0409N399p172l4938j8075m002
$$ plain form
16359 -8484 -14664 -6780 9945 21574 25457 28643 36908 32831 48746 22337 36348 42408 18126
16346 18126 -7586 2115 34360 50552 32305 -1637 -16052 12917 28915 49340 42275 34097
16334 34097 48840 37361 5797 -22281 -11102 14829 18814 34781 36415 73407 66872 70340
16322 70340 63499 37380 7886 -50341 -34002 -16920 -3565 -2857 6330 29536 45153 13998
16310 13998 -3038 16249 5401 -5804 17571 6172 12184 11297 9770 12432 -6646 -42177 -27438
16297 -27438 10304 35718 43362 12526 31891 40510 47813 72357 101337 66012 16338 1615
16285 1615 19132 26754 979 58214 66803 43133 44099 52501 8422 3872 8621 24402 24361 9531
16271 9531 -17547 -7925 2418 -3907 -29106 -16681 8266 28675 34074 26902 -8036 -26111 -30113
16258c0113j9378K719J0755L0815J2086L5788L6421n207r081q4409j9551M3276
16246D121J5811j2526K5138L8863K3910l9500k7620l6739J5047P021k032k441
16234I053P459K2778m146k6408m6492j0233M03K7437J5022j5517k4718k6625J9714
16221e2273L0880K2550j2583J2761K9040J777k5781m5877l27M0850N4270L2656
16209H7943k324j8246Q65l0962j1456k6075q896K2377l8064k6877p966J051O2239
16196C609J8591j9090p690O402j7204K440J7029L3063N4539j6362o9534j4236
16184h443J2746n2917l6121J7290J3407O073k2891L0773R144N784L40K0151n418
16171a0082J4869L399k735L6493r40J0074k9590j6861J4041K4493R881l0251q435
$$ plain form
16258 -30113 -49491 -46772 -36017 -5202 6884 42672 79093 73886 64805 -19604 -39155 4121
16246 4121 19932 7406 32544 71407 95317 55817 28197 -8542 6505 13526 11494 9053
16234 9053 16512 39290 35144 8736 -37756 -47989 -47586 -20149 -5127 -20644 -45362 -71987 -52273
16221 -52273 -21393 1157 -11426 1335 30375 32152 6371 -39506 -39833 1017 55287 87943
16209 87943 85619 67373 68238 37276 25820 -255 -9151 13226 -24838 -51715 -59681 -58630 3609
16196 3609 22200 3110 -4580 1822 -15382 -12942 4087 37150 91689 75327 5793 -8443
16184 -8443 4303 -48614 -84735 -67445 -54038 -47965 -70856 -40083 -30939 -25155 -24815 -4664 -10082
16171 -10082 4787 8186 5451 41944 41004 51078 21488 4627 18668 43161 53042 22791 14356
16158A4356N32k1995l816J593l1297K5777Q372K188p997k2705j8000Q948O430
16145c7614K5203K190j2496K5772k8608J086M6344J1762J0410K9671R393l4210
16133D8903l5332q130j9566l6570j1150J1922K9322n6863l3645O5849K2666K8852
16121F258L2320J6875k1219j0335j1180J671j9654l1260j3360q435K3219L4623
16109d77L0273k813k520J6622j1256j8265j1427J5881o625O918Q972K853p541
16096B0595K768l666K631j9631k5278k171J1902K2128L041R714k0378l1531j4622
16083d4498J7673J1287k2503k7266K0580M5545R165j4103J6822J4951r596j478
16071A6579J2715j3167J3684K2528l4812l3325Q42K2035j7969J1725r528l1721
$$ plain form
16158 14356 14888 -7107 -10923 -9330 -40627 -14850 -6478 -4290 -12287 -34992 -52992 -44044 -37614
16145 -37614 -12411 -10221 -22717 3055 -25553 -24467 21877 33639 44049 73720 83113 48903
16133 48903 13571 5441 -14125 -50695 -61845 -49923 -20601 -77464 -111109 -45260 -22594 6258
16121 6258 38578 55453 34234 23899 12719 14390 -5264 -36524 -49884 -58319 -35100 -477
16109 -477 29796 26983 24463 41085 29829 11564 137 16018 9393 16311 25283 28136 20595
16096 20595 23363 19697 22328 2697 -22581 -24752 -12850 9278 12319 22033 1655 -29876 -44498
16083 -44498 -26825 -15538 -38041 -65307 -44727 818 9983 -4120 12702 27653 18057 16579
16071 16579 29294 16127 29811 52339 17527 -15798 -14956 7079 -10890 835 -8693 -40414
16059d0414k3147K3598n094K142L5403J7395q031m7826o086J1738o947L2620J8146
16046C497o0426j6634j570k6562K3657K2173M7293K1028K455J8640q793K6449
16034E1207q39l5928j0132K043J3759P283j7128j3404k7056o690J0225M1690L9012
16021E4042L4725j2970m0902j247k4836j2720n1154K533J2841N445M3417k154
16009G020k2202k338K1395L4495J6882j4253p15m3579m1986J0033L5582K6786
15997B7120j1521k2298l0588R823K678J2828P180J265k4767k5149L2987K5266
15985D824j0053k3235J9243N0323p171R743j1005j8965j5331m1257j3603r549
15973f6036l18M4220J3547j0178k3437m75L3852M7138q138R485L5413l7091k1486
$$ plain form
16059 -40414 -63561 -39963 -45057 -42915 -7512 9883 1852 -45974 -52060 -40322 -47269 -14649 3497
16046 3497 -56929 -73563 -75133 -101695 -78038 -55865 -8572 12456 14911 33551 24758 51207
16034 51207 50368 14440 4308 6351 20110 27393 10265 -3139 -30195 -36885 -26660 15030 54042
16021 54042 88767 75797 34895 33648 8812 -3908 -55062 -52529 -39688 -34243 9174 7020
16009 7020 -15182 -17520 3875 38370 55252 40999 40284 -3295 -45281 -35248 334 27120
15997 27120 15599 -6699 -37287 -27464 -24786 -11958 -4778 -3513 -28280 -53429 -20442 4824
15985 4824 -5229 -28464 -9221 41102 33931 43674 32669 13704 -1627 -42884 -56487 -66036
15973 -66036 -66354 -22134 -8587 -18765 -42202 -42677 -8825 38313 30175 39660 75073 37982 16496
15960A6496j5134j7917j1210K9891J6406j171j6025O91j9040J1425k619l92Q423
15947a76Q993j4430j0791k2134q180k1654L1142M1772J3214J2594j5241m0056
15935b4947p073M6411l122j6704M71L7498J954l3460n9033J3116O8554l507k8122
15922g964p618Q076K5935J1371j2680k0398J6815k2206n0455L1778L6074r758
15910a030k4135K6217K5007K6401M690j7827k7622k8846p509k2647k4286p164
15898g8751L0283K0255L245k3678N975J502q79k151P906K2044m176r175l1928
15885e9528P000M0753K5266N945j067P178j0054l803K871K9036j2572k621P358
15872C5762l1540n0683m558p358J1391O0473J1111J2268k1786o02k041k6139L971
$$ plain form
15960 16496 1362 -16555 -27765 2126 18532 17361 1336 2027 -17013 -5588 -8207 -8599 -176
15947 -176 8817 -5613 -16404 -38538 -46718 -68372 -37230 4542 17756 30350 15109 -24947
15935 -24947 -32020 14391 11269 -5435 -4964 32534 34488 1028 -58005 -44889 23665 20158 -7964
15922 -7964 -15582 -7506 18429 29800 17120 -3278 13537 -8669 -59124 -27346 8728 -1030
15910 -1030 -25165 1052 26059 52460 57150 39323 11701 -17145 -24654 -47301 -71587 -78751
15898 -78751 -48468 -28213 -24968 -48646 -42671 -41169 -42048 -44199 -36293 -14249 -18425 -27600 -59528
15885 -59528 -52528 -11775 13491 19436 18369 25547 15493 11690 14561 43597 31025 28404 35762
15872 35762 4222 -46461 -51019 -58377 -46986 13487 24598 36866 15080 14478 12437 -13702 -9731
15859i731M1030L0092l3787j3001J8724K83P69j1477K0135K1536R470j4344k5988
15846C3711m6576p457j484O260K1667J3622m272j3116M935L7477J2703j7511k2813
15833A7146k316l1403l26J7329K5069K2048J5111k2294K581j1422l360l5212m5561
15820e2610p108J5207L44M929L6915M5641J5777l6774m2067n914K9978L2933O171
15807D3422J4366P720q225j9492j7723J4906N977O220n070k3854k2059l881j8475
15794b6168M4201L1516k9090j7217r399l6009J3291J2939L3692J7917j5596k0839
15782g62j6462L3093k4777j1778M0329j2035k1213K7948J0187k999j3718k4575
15770a6762N4509p794r318n089J2922L677j8470j8256j1741j1797J6222p509j1542
$$ plain form
15859 -9731 31299 61391 27604 14603 33327 33610 34379 22902 43037 64573 74043 59699 33711
15846 33711 -12865 -20322 -21806 -15546 6121 19743 15471 2355 7290 44767 57470 39959 17146
15833 17146 14830 -16573 -16899 430 25499 47547 62658 40364 42945 31523 28163 -7049 -52610
15820 -52610 -59718 -44511 -44167 -39238 -2323 43318 59095 22321 -19746 -25660 4318 37251 43422
15807 43422 57788 65508 57283 37791 20068 34974 40951 47171 42101 18247 -3812 -7693 -26168
15794 -26168 18033 49549 20459 3242 -6157 -42166 -28875 -15936 17756 35673 20077 -762
15782 -762 -17224 15869 -8908 -20686 19643 7608 -13605 14343 24530 21531 7813 -16762
15770 -16762 37747 29953 20635 15546 28468 32145 13675 -4581 -16322 -28119 -11897 -19406 -30948
15757c0948j5791L7883M1644k0544m4742o672J144J8131k8116J0931M249j228
15745c4059J6383L63r731Q418K234j0222k3676J7253J125k6861K6687J7343J4136
15732f07M1786k0532K9147j6637o625M8482P211n3418k3993j1835R765O367J5369
15719B4480K8616l731m5755j0197P20K9207K6760N536k5495n1007o537k146K4635
15706d914r71k737L4754k311L5764j8523m8788l5544J1811K1711K1529L8213m2522
15693G472o7995J0408K6087K6439J0960o341q713j4132J2738P289n264q904J5932
15680E976O1847K4218m9619k7742J2259M706O370j155j189j0419k6277J678r196
15667h543j1363j1137J2809Q47J7433J1810n147J128j9114k7545K1227K6165K0899
$$ plain form
15757 -30948 -46739 -8856 32788 12244 -32498 -39170 -38026 -19895 -48011 -37080 -32831 -34059
15745 -34059 -17676 -17313 -27044 -18626 -16392 -26614 -50290 -33037 -31912 -58773 -32086 -14743 -607
15732 -607 41179 20647 49794 33157 26532 75014 82225 28807 4814 -7021 2744 9111 24480
15719 24480 53096 49365 3610 -6587 -5867 23340 50100 55636 30141 -20866 -27403 -29549 -4914
15706 -4914 -5885 -8622 26132 23821 59585 41062 -7726 -43270 -31459 -9748 11781 49994 7472
15693 7472 -60523 -50115 -24028 2411 13371 7030 -1683 -15815 -3077 4212 -1052 -9956 5976
15680 5976 67823 92041 42422 14680 26939 31645 38015 36860 35671 25252 -1025 653 -8543
15667 -8543 -19906 -31043 -18234 -17387 46 11856 6709 7837 -11277 -38822 -17595 8570 29469
15654B9469L968m3918k4327q515K1634J6078K692K5064L541l4851k4572Q915J0722
15641a4100M945k4740q805L0811J6670L373j0790k2719L714J631l436L0032J8332
15628B4918J4769l676k2818n952J3178j8584k2539J4119L7200M548M4638L6307
15616A16108l3783l2393j2263j5855j3327M139l7929n2911q340J5199J3810k5856
15604h3401n3142m7929J4705O2459L8034N580m393L7665J9483l5710j2586O820
15592e2415J2518L5978P570J908K6490J7997k646J0044k6128o1568N131J6073
15580i048P118k9039m5795j1418m722J2839N0233K9838L1734o367P557r799M875
15567B8006j3444L1505R497j3605J7039m3813l4771K819K4405k6580j6673M5140
$$ plain form
15654 29469 33437 -10481 -34808 -43323 -21689 -5611 -2919 22145 25686 -9165 -33737 -24822 -14100
15641 -14100 -9155 -33895 -42700 -11889 4781 8154 -2636 -25355 -21641 -20010 -23446 6586 24918
15628 24918 39687 36011 13193 7241 20419 1835 -20704 -6585 30615 35163 79801 116108
15616 116108 82325 49932 37669 21814 8487 12626 -25303 -78214 -86554 -71355 -57545 -83401
15604 -83401 -136543 -184472 -169767 -107308 -69274 -63694 -68087 -30422 -10939 -46649 -59235 -52415
15592 -52415 -39897 -3919 3651 5559 32049 50046 47400 57444 31316 -30252 -25121 -9048
15580 -9048 -1930 -30969 -76764 -88182 -92904 -80065 -29832 6 31740 25373 32930 23131 28006
15567 28006 14562 46067 55564 41959 58998 15185 -19586 -16767 7638 -18942 -35615 9525
15555I525J9518j5446j2006j7514k120K2456J7515J835l0206P379J3532L8731
15543E3199K0969J2707k4531n9694k6352J3407K2635j4961K2171k5739l4567Q020
15531c2736J7151K8503L2144J5997J0959n2331j100L3839J7565j0279K7989r848
15519G7853l6758k4099J574O871J483j4960j0235J305K9897k8377J159L8484L9268
15506H3465o996r845k3713o2139k5827J9550L021M0624J5352M644L6798l0726
15494D4208j8956l9890j7324L5291k8228m013K0291J2626J497J6242J1665j8262
15482A5147k6294k5727J0088J2384N812r350J0291L1634K9440r108j5371K227
15470C1173K1421M239k6380m8485n592j587K5868J6810r037j4237J8336L2930
$$ plain form
15555 9525 29043 13597 1591 -15923 -18043 4413 21928 23763 -6443 936 14468 53199
15543 53199 74168 86875 62344 2650 -23702 -10295 12340 -2621 19550 -6189 -40756 -32736
15531 -32736 -15585 12918 45062 61059 72018 19687 18587 52426 69991 59712 87701 77853
15519 77853 41095 16996 18570 25441 26924 11964 1729 3034 32931 4554 5713 44197 83465
15506 83465 76469 66624 42911 -19228 -45055 -25505 -22484 18140 33492 38136 74934 44208
15494 44208 25252 -14638 -31962 3329 -24899 -28912 -8621 4005 5502 21744 33409 15147
15482 15147 -11147 -36874 -26786 -14402 -8590 -17940 -7649 23985 53425 44317 28946 31173
15470 31173 52594 56833 30453 -18032 -23624 -25211 657 17467 8430 -5807 12529 45459
15458D5459k3871q744J4442m5188Q447N6086J2903l4314l743N876j4641r259J9537
15445B2990L4075J7369k4701k4212K1482J5713M757m3488m0798P278j2588j2622
15433c4745L0718R328K6462R314r645P108J9044j0659k8927j9567K4016k1409
15421A038o2262n40J3363N371l81L0931j1769L6623L4913k2768n191j568J0668
15408B8428j8695j1211j4909J7026J5219m3734k8092k0057m432O263L6725L5586
15396a883K3511O112j3641l148K6938j8088o786O213K784k2843k8433K0109N1139
15383D1984p440J5701k2322k4469P070M2370K2784k5444n360q267l4948O434L044
15370A1137J3971q801k5390L0013l125j0278k1238j0972O321j5598j0880m567
$$ plain form
15458 45459 21588 12844 27286 -17902 -9455 46631 59534 25220 21477 27353 12712 3453 22990
15445 22990 57065 74434 49733 25521 47003 62716 67473 23985 -16813 -9535 -22123 -34745
15433 -34745 -4027 5301 31763 41077 31432 38540 57584 46925 17998 -1569 22447 1038
15421 1038 -61224 -61764 -48401 -43030 -43411 -12480 -24249 12374 47287 24519 19328 17760 28428
15408 28428 9733 -1478 -16387 639 15858 -27876 -55968 -76025 -80457 -74194 -37469 -1883
15396 -1883 21628 27740 14099 10951 37889 19801 13015 19228 22012 -831 -29264 -9155 41984
15383 41984 34544 50245 27923 3454 10524 52894 75678 50234 44874 36607 1659 8093 11137
15370 11137 25108 16307 -9083 20930 17805 7527 -13711 -24683 -18362 -33960 -44840 -49407
15358d9407J9267J4302m878K9415J2830j0391L396j3109k6255j4406L5484K8204
15346B4452k4144M025J0156j9589N720L2157m299j618J0416N581l2453k925j2515
15333e036J6902l148m8938j4552L3596K0614l2565k1624L0470K9449J4772J0952
15321C0892k6129l94j9804l20J9477o616R70m257M4698N6440l5222o4990j4063
15308a9318J7523l1267J1793q704j0838n79K890P100K7104l289n951l2514J7069
15295b8981J7754n564o004J020P788K7802l4468m1306M2332K7977M965K220P981
15282B3516k4056l5507L2328L8211k008n8879j7574K3286k6841K4286n374R916
15270a8696K0077N064k3422J651J3677j1706n738m367k328K6873j8257K2489R796
$$ plain form
15358 -49407 -30140 -15838 -20716 8699 21529 11138 14534 1425 -24830 -39236 -3752 24452
15346 24452 308 4333 14489 -5100 620 32777 28478 26860 37276 42857 10404 7479 -5036
15333 -5036 11866 8718 -40220 -54772 -21176 -562 -33127 -54751 -24281 5168 19940 30892
15321 30892 4763 4369 -15435 -15755 3722 -2894 -1924 -6181 38517 94957 59735 -5255 -19318
15308 -19318 -1795 -33062 -21269 -29973 -40811 -41390 -38500 -31400 -4296 -7585 -13536 -46050 -28981
15295 -28981 -11227 -16791 -22795 -21775 -13987 13815 -20653 -61959 -19627 8350 13315 15535 23516
15282 23516 -540 -36047 -3719 34492 32484 -26395 -43969 -20683 -47524 -23238 -28612 -18696
15270 -18696 1381 6445 -16977 -15326 -1649 -13355 -19093 -23460 -25788 1085 -17172 5317 15113
15257A5113n400k8353j7877J2725K9186L520j0047j5279K6311J1948l7650j7915
15245c3718N4475K2417j3408k5634k7112J0501n915k401M3112L4580P299k3384
15233D0812k2916Q907K2342L274o598o250k2778j2894L7603O003k6657l0817l7254
15220d7223N80R104M0465K1692J5574J004n635m1719M9614K5815J3335j3705l5716
15207C3185l4020j8042j7586K3514J3651O678J2608l9906K8969K8633J3741j9763
15195C1662k2489p117N52K032m9777n526L3186O9128q642n731k98J7932K9126
15182H4038m972o381M815l6441M788L149m096k1923l8216m050K68K6557l426l2631
15168b8521j3073L9268j288R460J774m5379J8534N279j1547J620L731J0778M9177
$$ plain form
15257 15113 9713 -18640 -36517 -23792 5394 8914 -1133 -16412 9899 21847 -15803 -33718
15245 -33718 20757 43174 29766 4132 -22980 -12479 -18394 -20795 22317 56897 64196 40812
15233 40812 17896 26803 49145 52419 45821 39571 16793 3899 41502 47505 20848 -9969 -47223
15220 -47223 -46643 -37539 2926 24618 40192 41196 35561 -6158 43456 69271 82606 68901 33185
15207 33185 -835 -18877 -36463 -12949 702 7380 19988 -19918 9051 37684 51425 31662
15195 31662 9173 2056 2608 4640 -45137 -50663 -17477 51651 43009 37278 36980 54912 84038
15182 84038 79066 72685 77500 41059 45847 48996 44900 22977 -15239 -19289 -19021 7536 4110 -28521
15168 -28521 -41594 -2326 -3614 5846 7620 -37759 -19225 -13946 -25493 -23873 -20142 -9364 39813
15155C9813o3741k2898L450j552L2834N5161J3430n0937j3719M0600J0163Q007
15143E0611m6710l1391J7472K521L3576J7338M966j2425r926j3521K0969q777
15131B4703R47J3773J9802O992l3323m2218N279L6495K206j3952n4989l66J5212
15118a9439k6520j524K0121N3781N0515j3314j3075j1043K208r819k6470l101
15106B320P194k1657j5074J6028J9703L4132J2743L2798P890Q755J5559k2716
15094I7675n9500n6739j426m762o498q477J7329J0672o694o591j1355J4360n20
15081b2526o687J377l3825M3402P2519k6422l1460L189n253K9691l5971j9197
15069c1163j2026K9713L9285k6061k9565J3915L9533O48l9150R3J7062j7351k4824
$$ plain form
15155 39813 -23928 -46826 -43376 -44928 -12094 43067 56497 5560 -8159 32441 42604 50611
15143 50611 3901 -27490 -10018 -7497 26079 43417 48383 35958 26032 12511 33480 24703
15131 24703 25650 39423 59225 66217 32894 -9324 -4045 32450 34656 20704 -34285 -34651 -19439
15118 -19439 -45959 -47483 -27362 26419 76934 63620 50545 39502 41710 31891 5421 2320
15106 2320 9514 -12143 -27217 -11189 8514 42646 55389 88187 96077 104832 120391 97675
15094 97675 38175 -18564 -19990 -24752 -31250 -39727 -22398 -11726 -18420 -25011 -36366 -22006 -22526
15081 -22526 -29213 -27836 -61661 -18259 54260 27838 -3622 -433 -5686 24005 -11966 -31163
15069 -31163 -43189 -13476 25809 -252 -29817 -15902 23631 24279 -14871 -14778 2284 -15067 -39891
15056c9891K8866J8068k989N337N7115l0448k2505m960N010J8610k0759n0129
15044c8675j135o593R031j6306q807J5570k5796P015K3960K0752L7285r918n316
15031A067J9582O529J270j3755o482p797k475J7018J43k9192k5216Q93M3672J4651
15017A9908k3879M102j1663K221K6139J7355r213j8833j0270J1939R883j9974
15005b285k4433j5943J7868j2117k458J9099L0762K2629K3261K8626r381k5562
14993E0066j5639r843k465m6059j6602J3862J6419J1438r086K4724O478k0325
14981B968l0686J2083Q101J7972k095K4088K022K8304K5461k8625n0330P452o392
14968A0323j795K0355L936n37l9676k2971O562J1377J2622k2373N364J6958O258
$$ plain form
15056 -39891 -11025 7043 4054 9391 66506 36058 13553 8593 13603 32213 11454 -38675
15044 -38675 -39810 -46403 -37372 -53678 -62485 -46915 -72711 -65696 -41736 -20984 16301 6383 1067
15031 1067 20649 27178 28448 14693 8211 414 -2061 14957 15100 -14092 -39308 -38415 5257 19908
15017 19908 -3971 131 -11532 -9311 16828 34183 24970 6137 -4133 7806 17689 -2285
15005 -2285 -26718 -42661 -24793 -36910 -39368 -20269 10493 33122 56383 85009 75628 50066
14993 50066 34427 24584 22119 -23940 -40542 -26680 -10261 1177 -7909 16815 23293 2968
14981 2968 -27718 -15635 -7534 10438 8343 32431 34453 62757 88218 59593 9263 16715 10323
14968 10323 8528 28883 32819 32282 -7394 -30365 -23803 -12426 196 -22177 -16813 145 6403
14955F403O508k479J3729m691p447K0617J7097k7321o711j1946O018j0531r780
14942a0534J0357j2782j5606J4243N4487P60k4600l4589j0043K9392J4182L5456
14930E0723J5778k5165m0159j8921J8812K5877j491r191M888O616J3597J6240
14918E7604J1784N21j274L636J0610K952m8005j9286j1874k3845K5897M5530j810
14905E2440j2052k1977J7717K7622j3887n6855p2471k8984J0978M6923J4419K7347
14893h780j4100m0958M6584J4898m882j0417K9573N2211l0260k5500k4389J6117
14881I7K3598j149J5548l5488k2250N003rm567Q369p845Q457J5806K5891Q496
14867C9957n168L7284P31n6289l229J5447j6740J108M672q38M0739j6123l4495
$$ plain form
14955 6403 12911 10432 24161 19470 12023 32640 49737 22416 15705 3759 9777 -754 -10534
14942 -10534 -177 -12959 -28565 -14322 40165 40925 16325 -18264 -28307 1085 15267 50723
14930 50723 66501 41336 1177 -17744 1068 26945 25454 16263 21151 27767 41364 57604
14918 57604 69388 69909 68635 72271 82881 85833 37828 18542 6668 -17177 8720 54250 52440
14905 52440 40388 18411 36128 63750 49863 -6992 -79463 -108447 -97469 -50546 -36127 -8780
14893 -8780 -22880 -63838 -17254 -2356 -7238 -17655 11918 64129 33869 8369 -16020 97
14881 97 23695 22546 38094 2606 -19644 -14641 -14650 -19217 -10848 -18693 -10236 5570 31461 39957
14867 39957 34789 72073 72804 16515 13286 28733 11993 13101 17773 16935 57674 41551 7056
14854G056n0261J9035K1373O07K242J7386J1622L3602J373o6387j1869M813P819
14841a589R621m751j2454L0521M9986L885l6571J776Q107J5880j4256j9168L572
14828C4559J3264m8669j4029Q134l8157j7802L8967K7109K6088J5308r650M3682
14816G8804J4709o640j8011l5118l1263K9462L4309R581j4304l2019k7795K9232
14804C0947q070l2037J9949J1167j1773k5551l9642O3139L5513j6294j8313q355
14792F80L3628J8372j1763J0143K2355J4388j4138n8322l7178N747Q2J0253m3221
14779d8974K1255L4364l2747O484K4648J4704n933m2522j3282J6113K0055j8516
14767b4351J8590M409J9064m6l2561J5815k28l7274P468L205J1283l2897j0291
$$ plain form
14854 7056 -43205 -24170 -2797 -2190 52 17438 29060 62662 64035 -2352 -14221 -9408 -1589
14841 -1589 8032 3281 -9173 21348 71334 75219 38648 40424 48531 64411 50155 30987 34559
14828 34559 47823 -846 -14875 -6741 -44898 -62700 -23733 3376 29464 44772 35122 78804
14816 78804 93513 86873 68862 33744 2481 31943 66252 75833 61529 29510 1715 30947
14804 30947 22877 -9160 10789 21956 10183 -15368 -55010 8129 43642 27348 9035 680
14792 680 34308 52680 40917 51060 73415 87803 73665 15343 -21835 -16088 -16006 -5753 -48974
14779 -48974 -27719 6645 -26102 -19618 5030 19734 13801 -28721 -42003 -25890 -5835 -24351
14767 -24351 -5761 -1352 17712 17666 -14895 920 692 -36582 -29114 -25909 -14626 -47523 -57814
14754e7814K6593r397n360l985k6271m767K1396L409j93K8541L3431J6254J0436
14741C2273j3541K94J227j1711m6911k08r526J753K4093J9926p339M204j5447
14728b0913j0032m4354K5777P18j2741J421J208k1347M3916N0163K065k794l653
14715I434k4290k0826n581j334M7940M0786J3292j2628k4409R060p427l1903k7719
14702c5605p161J0419M884J1679K9028Q80l8462k4981J264K5010M2354K7180j9188
14689B7301l5562J5112q224k7147j2303K794L991K9193K7337J6456j2453J8213
14677D4708K3179j9924l399j397k6785q140M840Q442K2530k4929m1410R293M3011
14664C0019L393k6760q448L0436k3002j5996J3784L834k9147J2286N2936L265
$$ plain form
14754 -57814 -31221 -40618 -45978 -49963 -76234 -81001 -59605 -56196 -56389 -27848 5583 21837 32273
14741 32273 18732 19026 20253 8542 -38369 -38577 -48103 -46350 -22257 -2331 -9670 -5466 -20913
14728 -20913 -30945 -75299 -49522 -48804 -61545 -60124 -58916 -80263 -36347 13816 15881 13087 9434
14715 9434 -14856 -35682 -41263 -42597 5343 46129 59421 46793 22384 31444 24017 -7886 -35605
14702 -35605 -42766 -32347 -27463 -15784 13244 14124 -24338 -49319 -48055 -23045 19309 46489 27301
14689 27301 -8261 6851 -1373 -28520 -40823 -38029 -34038 -4845 22492 38948 26495 44708
14677 44708 67887 47963 44564 43167 16382 8242 13082 21524 44054 19125 -22285 -12992 30019
14664 30019 33412 6652 -1796 28640 5638 -10358 3426 7260 -21887 -9601 43335 46600
14652D6600p076l4026o233l85K0756k2073l2167M59k1137J7838P501o160J6834
14639a9269J2996J5627K3047l2056o801J0024K303l3738k6626R75L4300L3721
14627A4503N908K5139O878k7413L36j2082j348l8774k102J8497j5066J4042j0493
14614b1975J4463L9978o506p814l19l0963j6027L196J6203K6031J2716l660L336
14601B8659J7140o924p386P180O040k1271k0228m548L1035M6097K8267j1593l5754
14588E6714k0076P094P149l1270Q041M343J8839M0224K6889k3340K79K8851J0016
14575A33753J1744j4124r406p114n0099k0589Q054J8321P2627M9231O9670J22499
14563C84567J35024M7990j7071o5551p5523r8836n7156l4896j01665o8934m7275
$$ plain form
14652 46600 39524 5498 -735 -1120 19636 -2437 -34604 -34145 -55282 -37444 -29943 -36103 -19269
14639 -19269 -6273 9354 32401 345 -6456 3568 5871 -27867 -54493 -53518 -19218 14503
14627 14503 20411 45550 52428 25015 25351 13269 11921 -26853 -28955 -10458 -25524 -11482 -21975
14614 -21975 -7512 32466 25960 18146 17827 -13136 -29163 -25967 -9764 16267 28983 25323 28659
14601 28659 45799 38875 31489 38669 44709 23438 3210 -1338 29697 75794 104061 92468 56714
14588 56714 36638 43732 50881 19611 27652 31995 50834 91058 117947 94607 94886 123737 133753
14575 133753 145497 131373 121967 114853 64754 44165 52219 70540 143167 192398 262068 384567
14563 384567 519591 567581 550510 484959 409436 310600 253444 218548 116883 47949 674
14552F74k8612M58K0026L9528M3469j3383m1164M012P762j054j5287m4640k3806
14539e2017K6198K2750J0811K0038p038l3125j4146j883K4172P532L3617o692
14527C0217k7506l2874o265O2497J5916k4513k4514L2411L1493j670J061J8162
14515G4415P153J2331n2960J0527r511l4623q736j5171k8056j2976J8609K3470
14503a5528k161J6479L4831N7421l9832J5049J9635j5155j4805K8340J0517l2543
14491F2248j8350K3394K7138J433k6785n4757j2450J1046j1463j7712L388Q668
14479d202K723Q900k2633J8677L5882J2168m931J4989L2403J7054j3149m2052
14467E5829j9446l3682K4889R389q449K1325Q299N457k0774m7542k4120Q142j8358
$$ plain form
14552 674 -27938 -27480 -7454 32074 75543 62160 20996 25008 32770 31716 16429 -28211 -52017
14539 -52017 -25819 -3069 7742 27780 20742 -12383 -26529 -28412 -4240 3292 36909 30217
14527 30217 2711 -30163 -36428 26069 41985 17472 -7042 25369 56862 55192 56253 74415
14515 74415 81568 93899 40939 51466 41955 7332 -1404 -16575 -44631 -57607 -38998 -15528
14503 -15528 -17689 -1210 33621 91042 51210 66259 85894 70739 55934 84274 94791 62248
14491 62248 43898 67292 94430 95863 69078 14321 1871 12917 1454 -16258 -12870 -4202
14479 -4202 -1479 7421 -15212 3465 39347 51515 46584 61573 93976 111030 97881 55829
14467 55829 36383 2701 27590 36979 28530 49855 58154 63611 42837 -4705 -28825 -20683 -39041
14454c9041J9515L6233K0984q85P625M380K4943J0024L4379J8044l5148k8184
14442G2869L6564L206m084k8814j9724L0562L187K7735m4345j7792K9879M1126
14430A30369L941k7749j4064K6743M3411K9187j9913l2978j8310k9439k328J7474
14418A06344l7655q508L9808k833q864n175j0817j6828p621M0243R467Q949M87
14405A06997J6520K4528N352K9655J8892M3896J4011k0860j8010k4372n0988p562
14393A38059K5550j8960n5435k6944j0188j397K1319L3559j1952J4812L2315M3925
14381A84663J0919L1540P192J3110L724k9335J0704L2766k047N42o780l7688m0589
14368A78721J1094O0419N1360J7020P7264R6339J73582K28494K41821K82782K82837
$$ plain form
14454 -39041 -19526 16707 37691 36806 44431 48811 73754 83778 118157 136201 101053 72869
14442 72869 109433 112639 108555 79741 60017 90579 93766 121501 77156 59364 89243 130369
14430 130369 134310 106561 92497 119240 162651 191838 171925 138947 120637 91198 88870 106344
14418 106344 68689 60181 99989 97156 88292 83117 72300 55472 47851 88094 97561 106510 106997
14405 106997 123517 148045 153397 183052 201944 245840 259851 238991 220981 196609 145621 138059
14393 138059 163609 144649 89214 62270 52082 50685 72004 105563 93611 108423 140738 184663
14381 184663 195582 227122 234314 247424 251148 221813 232517 265283 263236 263778 256998 219310 178721
14368 178721 189815 250234 301594 318614 395878 492217 665799 894293 1136114 1418896 1701733
14357A701733J77922K1623j19223k06858k75677k90690k37366j64731j28730j59988
14347C18015r5621l3105l3723O090j2699K6258Q591j3170k598j3776l3606J7284
14335A37940J6813J7178q671K5600J5627K3222J0265m3962n9610j1061k4590p707
14323I1044j521J4722J194l6292m9664j5264K4055J726k1710M827L9136K156k2961
14310C1448l202J289m8185k8302Q146R97K3924L7258K4597k3379J7999J1433j7459
14297C6564K7930K8725j410O018l1453N755j3906o1658J4487L6681K6020J4169
14285H7922j3272o662m5347k7229J9627M9391l1781J3319Q047j9049j094Q442
14273D2314O3174k8961l8047n025J8663P689j8267k6852J1664J348L1384K6185
$$ plain form
14357 1701733 1879655 1901278 1782055 1575197 1299520 1008830 771464 606733 478003 318015
14347 318015 222394 189289 155566 161656 148957 175215 183806 170636 168038 154262 120656 137940
14335 137940 154753 171931 163260 188860 204487 227709 237974 194012 134402 123341 98751 91044
14323 91044 89523 104245 105439 69147 19483 4219 28274 30000 8290 13117 52253 54409 31448
14310 31448 28246 29535 -18650 -46952 -38806 -37809 -13885 23373 47970 24591 42590 54023 36564
14297 36564 64494 93219 91809 97827 66374 72129 58223 -3435 11052 47733 73753 87922
14285 87922 74650 67988 22641 -4588 15039 64430 32649 45968 54015 34966 33872 42314
14273 42314 105488 76527 38480 33455 52118 59807 41540 14688 26352 27700 59084 85269
14261H5269l5224j1811K4309N955M2884j6316Q354m85J1231m1793k1598k6131
14249B4644J853K7211K7171j1601N685K072p603m4811M813M7194J1365l6120J3517
14236F5390J6433L0459r53n8737J334O8413L3032k1743m5080m3133j3035K9720
14224F2100P1609K110l4778J0348O445L7071J3476k6874N42r502j5236K2981K9740
14211A70032P930j6191k7864m199k1478k5691o014J1442j0448k527R781K9499
14199A14272L1429J1003o995k0840l9889J0089o698J142K104j2048O805K7292
14187A17666J0059J3001m4434j420J8914ql377J1502j3949Q293m069K52N0292
14174A62722L3291k326r997J291M284m566k9342l0875j2066J5905l1372k2785
$$ plain form
14261 85269 50045 38234 62543 68498 111382 95066 103420 102935 114166 72373 50775 24644
14249 24644 26497 53708 80879 69278 74963 77035 69432 24621 29434 76628 87993 51873 65390
14236 65390 81823 112282 111329 52592 53926 122339 155371 133628 88548 45415 32380 62100
14224 62100 133709 135819 101041 111389 117834 154905 168381 141507 142049 132547 117311 140292 170032
14211 170032 177962 161771 133907 129708 108230 82539 76525 87967 77519 74992 84773 114272
14199 114272 145701 156704 149709 128869 88980 99069 92371 93513 95617 83569 90374 117666
14187 117666 127725 140726 96292 94872 113786 113778 110401 121903 107954 116247 112178 112430 162722
14174 162722 196013 193687 183690 184981 189265 184699 155357 124482 112416 128321 96949 74164
14162G4164p711j8879K7331K467j3652r192j2966J5040L7283N0584J2145q053
14150A48561j3434k305R558K760k7126P770k431K7664J2008J0306J4684N413O527
14137A99955K2561N265l0381J967j0749j6903P813M3378N8979M0380M1787P4456
14125D38508N9086M4576l3656o1395m1877m0843l6006l6979q341l34N522l8172
14113B50089j9938j9465m581J7477m7747m0805N2484L0105P480P817K4675J5139
14101B72730Q933J8056K7094M7728k4176l2677O592j6480k4126K0217M898o582
14089C02207k7041j3737J1279K8764M674J4980m233J0461j7095k3118l667K4327
14077C07801M4269J9937l6192J2347M8825J4248k5297k2490m3442K240K8147J2510
$$ plain form
14162 74164 66453 47574 74905 77372 63720 54528 41562 56602 93885 144469 156614 148561
14150 148561 135127 132822 142380 145140 118014 125784 123353 151017 163025 173331 188015 193428 199955
14137 199955 222516 227781 197400 199367 188618 171715 179528 222906 281885 322265 364052 438508
14125 438508 497594 542170 508514 447119 405242 364399 328393 291414 283073 282739 288261 250089
14113 250089 230151 210686 206105 223582 175835 135030 187514 217619 225099 232916 257591 272730
14101 272730 281663 299719 326813 374541 350365 317688 324280 307800 283674 303891 308789 302207
14089 302207 275166 261429 272708 301472 306146 321126 316893 327354 310259 287141 283474 307801
14077 307801 352070 372007 335815 348162 396987 411235 385938 363448 320006 322246 350393 362903
14065C62903K3597J4157Q724J3200J3515k8927k058L066j8692j967J6879j6253
14053C88144p060L1702k110K9591J9314K6413J4228j785j9438J1699J2752m029
14041D99421j363l0884l0039j73J5637K4919L5353P623P4430N4117N477J12206
14029G66724J46392R5010R0081P1891Q4097K09590K75458L44699M70650O14037
14019C168629P96099Q89437R38541R28805Q32215O24074L78057Q3514k12823m59017
14009G967531o25183o83346o69294n97846n04159l27227j54123N91J21715K68250
13999D796909M20780O67243Q98773J182537J452085J621138J742639J641019J350588
13990A5773711R09377M13238k29631p63568j195646j451174j475581j412569j192399
$$ plain form
14065 362903 386500 400657 409381 422581 436096 407169 405111 408177 389485 387518 404397 388144
14053 388144 381084 412786 410676 440267 459581 485994 500222 498437 478999 490698 503450 499421
14041 499421 498058 467174 437135 436962 452599 477518 512871 520494 594924 649041 654518 766724
14029 766724 913116 1008126 1098207 1170098 1254195 1463785 1739243 2083942 2554592 3168629
14019 3168629 3964728 4854165 5792706 6721511 7553726 8177800 8555857 8639371 8426548 7967531
14009 7967531 7342348 6659002 5989708 5391862 4887703 4560476 4406353 4406944 4528659 4796909
13999 4796909 5217689 5884932 6783705 7966242 9418327 11039465 12782104 14423123 15773711
13990 15773711 16683088 17096326 16866695 16103127 14907481 13456307 11980726 10568157 9375758
13981I375758q66136m59231j06670L37427Q23513J244282J633368J972092K253620
13972A6208023K374125K291207J906766J361144O85190j01519q65683j507265
13964B2351988j937574k162461k140697j968946j639656j188010p49200l24150
13956A0241294K09722P99043J364169K001425K624801L108562L443312L470311
13948B7262639L091549K321313J291480J51182j023257k140233k961838l336240
13940B4656595l405684l141050k642574k081789j445352q59877l00676K42479
13932A1022072P14763J147417J593846J982999K181660K304929K169882J811467
13924B4929035J167219L67792m32894j198326j780708k180038k370010k302478
$$ plain form
13981 9375758 8509622 8050391 7943721 8281148 9104661 10348943 11982311 13954403 16208023
13972 16208023 18582148 20873355 22780121 24141265 24826455 24724936 23859253 22351988
13964 22351988 20414414 18251953 16111256 14142310 12502654 11314644 10565444 10241294
13956 10241294 10451016 11250059 12614228 14615653 17240454 20349016 23792328 27262639
13948 27262639 30354188 32675501 33966981 34118163 33094906 30954673 27992835 24656595
13940 24656595 21250911 18109861 15467287 13385498 11940146 11080269 10779593 11022072
13932 11022072 11736835 12884252 14478098 16461097 18642757 20947686 23117568 24929035
13924 24929035 26096254 26464046 26031152 24832826 23052118 20872080 18502070 16199592
13916A6199592k059007j727976j276352q20230l37371P2241M70763R21947J323911
13907A2767518J537818J660289J715007J457948J078934N89139j7818n98929j061035
13898A9128871j360004j453230j354925j131614q24892m35213J1799M53007Q32436
13889A3866235J200846J534723J853236K311521K702385L129041L704380M369137
13881C4671504N377068P073454J0018474J5177772K3550977L5430801M8571751
13874A79871801N8405812N8876983M6011793K0826574j0388293l8301894n5731518
13867B59571258n9899058n3364321m1344586k9052458j9311561j2586563q260501
13860C5752210n642837m082019l117517k542171k190401j863891j617820j456568
$$ plain form
13916 16199592 14140585 12412609 11136257 10316027 9978656 10050897 10521660 11443607 12767518
13907 12767518 14305336 15965625 17680632 19138580 20217514 20806653 20788835 20189906 19128871
13898 19128871 17768867 16315637 14960712 13829098 13004206 12568993 12580792 13033799 13866235
13889 13866235 15067081 16601804 18455040 20766561 23468946 26597987 30302367 34671504
13881 34671504 40048572 47122026 57140500 72318272 95869249 131300050 179871801
13874 179871801 238277613 297154596 343166389 363992963 353604670 315302776 259571258
13867 259571258 199672200 146307879 104963293 75910835 56599274 44012711 35752210
13860 35752210 30109373 26027354 22909837 20367666 18177265 16313374 14695554 13238986
13852A3238986j371896j269058j190043j033733q88838p13826n28110l96307l47123
13843E500052k61095k20638k64637k18113k14545k23184k19585j77286j84065
13834C516904k15960k14473j99391j31401r5657q4365l5332J8231J4038K4177
13824B596771O0563L9807M1069j3483p5131o3274j33981q9022q7173j47115j05160
13813B023871j12632j06828p5092o4057m2134n396o670K9546L6276K5700K0156
13802A722740P3007J16962J01611J02304Q2033M4103J4727r189l5372j5733j5443
13791B181750J9164P0508J48772K04764K96153M76130P02144R63426J172944J218079
13781G453834R83684N29677n2936o73492j000933j104707j036985q53248o60273
$$ plain form
13852 13238986 11867090 10598032 9407989 8374256 7485418 6771592 6243482 5847175 5500052
13843 5500052 5238957 5018319 4753682 4535569 4321024 4097840 3878255 3700969 3516904
13834 3516904 3300944 3086471 2887080 2755679 2660022 2575657 2540325 2558556 2572594 2596771
13824 2596771 2657334 2697141 2738210 2724727 2649596 2586322 2452341 2363319 2276146 2129031 2023871
13813 2023871 1911239 1804411 1729319 1665262 1623128 1617732 1611062 1640608 1676884 1702584 1722740
13802 1722740 1795747 1912709 2014320 2116624 2198657 2242760 2257487 2248298 2212926 2197193 2181750
13791 2181750 2200914 2271422 2420194 2624958 2921111 3397241 4099385 5062811 6235755 7453834
13781 7453834 8437518 8967195 8914259 8240767 7239834 6135127 5098142 4244894 3584621
13772C584621m90092l62240l07234k26177k06752j88102j37652j04528n7275o7287
13762A437282l7840j8050m4517j4864P3469R6573J09959J27909J33305Q3856L2902
13751A979984m801k3460k8063j21003j73823j65158k01237j42811j46989j13652
13741H58987j6351j1162m3547r0623n7530L3249N2443M9338P1833R1299O5035
13730A002971M4596L2566L3963j9644L6326K0636n4383o8648o5880l3655n6910
13719H71938q4962q8739m1084m3598l7856m1706l0123j304k8405O530Q2504P3546
13707F36741N1436K0338L1766J8013k2120J482j4898l9266p1297m6440o5309r4036
13695D06410j7793j2040l8324j7322j151j9226l581K69j366K8869L8403K1822
$$ plain form
13772 3584621 3094529 2732289 2425055 2198878 1992126 1804024 1666372 1561844 1504569 1437282
13762 1437282 1399442 1381392 1336875 1322011 1395480 1492053 1602012 1729921 1863226 1947082 1979984
13751 1979984 1975183 1951723 1923660 1802657 1628834 1463676 1262439 1119628 972639 858987
13741 858987 842636 831474 787927 697304 639774 673023 725466 774804 846637 937936 1002971
13730 1002971 1047567 1080133 1114096 1094452 1130778 1151414 1097031 1028383 962503 928848 871938
13719 871938 786976 698237 657153 613555 575699 533993 503870 502566 474161 480691 563195 636741
13707 636741 688177 708515 740281 758294 736174 737656 722758 683492 612195 565755 500446 406410
13695 406410 388617 376577 338253 320931 319780 300554 296973 297242 295876 324745 363148 384970
13683C84970K097j0842L3887J5788J1508n703j3612J7435k9885k5684l0055j4024
13671C35880L2878j691J0198J9042l3208k7252l1443l7717k8041j9798r83l576
13659B14289j0219K7194Q961r542n0162l3508p82k1494k9759K8383M3079j1076
13647A55364m1990Q901J5843K8514L429J0433M8643l615M110Q1182l069k2494
13635B85251L725j3982n4891j7810j5368K564n039n422J934K5741L3581m139j2240
13622B23905J297L111m1679O946L6461o3480l818L2246m383M046K7899o0804n5952
13609A05795L0940K898p297p030l5413K0075m142Q936J6444J7098M330k8781k5126
13596I8727M962K2662K0965K2931q637l6256K659j6913M8401K9454l3120J6869
$$ plain form
13683 384970 387067 376225 410112 425900 437408 431705 418093 435528 405643 379959 349904 335880
13671 335880 368758 367067 377265 396307 363099 335847 304404 266687 238646 218848 217865 214289
13659 214289 204070 231264 240225 230683 180521 147013 146231 124737 94978 123361 166440 155364
13647 155364 113374 122275 138118 166632 170061 180494 229137 225522 229632 310814 307745 285251
13635 285251 288976 274994 220103 202293 186925 189489 184450 179028 180962 206703 240284 236145 223905
13622 223905 225202 228313 186634 193580 230041 166561 162743 194989 190606 194652 222551 161747 105795
13609 105795 136735 139633 132336 125306 89893 109968 105826 114762 131206 148304 152634 123853 98727
13596 98727 103689 126351 147316 170247 161610 125354 128013 111100 159501 188955 155835 172704
13584A72704p334l5781m184O110k8376m515J7137n282k0259q391o307K7707k5935
13571G7294k7697n3190J2334M0445J0602L124M4887O42J2959l3318j2785k8394
13559D6903J5975K5405L2428L2675r51l6759R155K2070k5472j9493j0605K5324
13547A16655L2448J3556m8056l618J8306M4201N1574P968k3834k8199L927J0441
13535A95369M2864P0166N239j9026m532N815o405k3918N592p565j0786P89l6599
13522B17003k8232l7859k1420K4012J3513L8986L6369P068Q69P7547L2749L8234
13510C98839L217l6706m3756j1984j3199l4485l7858K1587m841J989N398j8276
13498B29925J2611O866J3130K6313M747j10L8761K6120M086L1356J5138j7737
$$ plain form
13584 172704 165370 129589 125405 131515 103139 98624 115761 110479 90220 81829 75522 103229 77294
13571 77294 49597 -3593 8741 49186 59788 62912 107799 108441 121400 88082 75297 46903
13559 46903 62878 88283 120711 153386 152435 115676 124831 146901 121429 101936 91331 116655
13547 116655 149103 162659 114603 110985 129291 173492 225066 233034 209200 181001 184928 195369
13535 195369 238233 308399 313638 294612 290080 295895 289490 265572 271164 263599 252813 253602 217003
13522 217003 188771 150912 129492 153504 167017 206003 242372 249440 250309 327856 360605 398839
13510 398839 402056 365350 321594 309610 296411 261926 224068 245655 240814 242803 248201 229925
13498 229925 242536 249402 262532 288845 293592 293482 332243 358363 362449 393805 408943 391206
13486C91206J516J0087K6138l0391L11m8667l7461m0403k6728K7818j7740m3442
13474B12244J1383n054L940J2238j3633K3244J8958K9891P5516P4950L3342K7857
13462E04876K1542J5693l5631J1809k9102j2886m5812o3633o5848j3332J4149
13451C01825p8405j5655K5048j7986j1900o638K4939O1623K9174L4125j1377J721
13439C36494K9494j1695J7558k6971l4348J4799J5887j8183m7848m9160j4694
13428B11333m086r060j8991r747J5225J9464j836J263J2905J2091L3259j1115
13416B50705r582R772J0546K3772N677l9779j0614l9827r566K8216r84n2442j2521
13403A53373K2209L2454J0018J7925K4766N421k7830R82N0811J3854K1364J4675
$$ plain form
13486 391206 392722 402809 428947 398556 398867 350200 312739 272336 245608 273426 255686 212244
13474 212244 223627 218573 222513 234751 221118 244362 263320 293211 368727 443677 477019 504876
13462 504876 526418 542111 506480 518289 489187 476301 430489 366856 301008 287676 301825
13451 301825 223420 207765 232813 214827 202927 196289 221228 282851 312025 346150 334773 336494
13439 336494 365988 354293 371851 344880 310532 325331 341218 323035 275187 226027 211333
13428 211333 207247 198187 179196 169449 184674 204138 202302 203565 216470 228561 261820 250705
13416 250705 241123 250895 261441 285213 290890 251111 240497 200670 191104 219320 218336 165894 153373
13403 153373 175582 208036 218054 235979 260745 266166 238336 239318 290129 303983 325347 340022
13391C40022J8868J345k0568M6786O4269P0451Q2545P9983J79369K55459K71601
13380A390130L06101K32163M9691o7088k24931l32078k88071k26978j88107j42586
13370E08246q9859p1933k2025m8456k4884n5016p986J7076K9J9621p221m1983
13358A75609l5403O550p590k7275J8375N5323j216j539k1541k2648K740j3633
13346A27752k7232l21M1072p826J2992L4316k9095k886r55l7801j2403M5674k8008
13333A15279k365R555K5329P881n361J6521k8370o0058n4766j475O5764K2735
13321A10669K2079L3890M818l606m7547n1726o111n513m320L2012N794O2759M4761
13308A97959j8200j2648j5595l4509k8903P147J9769J5178j238j5210j5053Q974
$$ plain form
13391 340022 358890 360235 339667 386453 450722 521173 603718 683701 863070 1118529 1390130
13380 1390130 1696231 1928394 1978085 1910997 1686066 1353988 1065917 838939 650832 508246
13370 508246 418387 346454 324429 275973 251089 196073 188087 205163 205192 224813 217592 175609
13358 175609 140206 146756 139166 111891 130266 185589 184373 182834 161293 138645 141385 127752
13346 127752 100520 100199 141271 133445 146437 180753 151658 148772 147817 110016 97613 143287 115279
13333 115279 112914 122469 147798 155679 150318 166839 138469 78411 23645 22170 87934 110669
13321 110669 132748 166638 171456 167850 120303 68577 62466 56953 52633 84645 90439 153198 197959
13308 197959 179759 167111 151516 117007 88104 95251 115020 130198 128960 113750 98697 107671
13296A07671J9785j1130l760J2040M062L0718j131j4684M7967J5355R771J180
13284B17844j0122J5553R027j8861n6010l4086k0272L4263J8613L80k2263m2066
13272I2000J056J3670j5880k7554M1139N2819L6934J0411J1451J9846J0806j6115
13260B30583k1946l6905R176K6232j5576l5710l2569K9162K1503L463l3984r604
13248A33825J0243j5100k3051J7456N625J3114M1848j1207j5674J8681L1413l5376
13236A71797l8665j0391K9381J951k9387l7199K2353L6211L8375O813j7719k6129
13224A47391m9376j1823L5122M3529L2866j4163l741j6475l849J6732O67J7269
13212A94149N237K8025K2126j5281j1915P74N402P418j3451j1910j6819r519j17
$$ plain form
13296 107671 127456 116326 112566 124606 128668 159386 158255 143571 191538 206893 216664 217844
13284 217844 207722 223275 232302 213441 157431 123345 103073 137336 155949 156329 134066 92000
13272 92000 93056 106726 90846 63292 104431 157250 194184 204595 216046 235892 246698 230583
13260 230583 208637 171732 180908 207140 191564 155854 123285 152447 173950 177413 143429 133825
13248 133825 144068 128968 105917 123373 128998 142112 183960 172753 157079 175760 207173 171797
13236 171797 133132 122741 152122 154073 124686 87487 109840 146051 184426 191239 173520 147391
13224 147391 98015 86192 121314 164843 197709 183546 179805 163330 159481 176213 176880 194149
13212 194149 199386 227411 249537 234256 222341 223115 228517 235935 222484 210574 193755 184236 184119
13199A84119j528N9953K0816k3223j1374o951Q541k374K7506N4159L3039K5510
13187C68193n6304l0491j1036k6311j2429k4136J3949Q990N537R521m0216l8237
13175A67030m457K1098J2558J8428K0846j855J3979n810l873J9579K2748j0693
13163B69578q824K53J7718K8034N694q088k3845l0819k3026J5647K5103O03P404
13150B75432K00M6857L6908q795j0223K6944o248J7544l178k3673R919j0793M183
13137C55077M0634k6195q299o331P046K8556L3609j2756j8150L3430p432k8606
13125C90583J5444J7087K9025K9740L2942k2411J9157L4660N0976K3928L3346
13114F54477j238K9318L2349K8695M3698M7689O6365J6511M5018J10450J11789
$$ plain form
13199 184119 182591 242544 263360 240137 228763 221812 230353 227979 255485 309644 342683 368193
13187 368193 311889 281398 270362 244051 231622 207486 221435 230425 235962 245483 205267 167030
13175 167030 162573 183671 196229 214657 235503 233648 247627 241817 237944 257523 280271 269578
13163 269578 260754 261007 278725 306759 312453 304365 280520 249701 226675 242322 267425 268028 275432
13150 275432 275632 322489 359397 350602 340379 367323 361075 378619 375441 351768 361687 350894 355077
13137 355077 395711 369516 361217 354886 361932 390488 424097 411341 393191 426621 419189 390583
13125 390583 406027 423114 452139 481879 514821 492410 511567 546227 597203 621131 654477
13114 654477 653239 682557 714906 743601 787299 834988 901353 917864 962882 1073332 1185121
13103A185121R6065J17559J17399R0861Q3206J14258J70779K38124K70433L62139
13093B845944M52842N77833P56260R41978J172643J503552J963909K563777L241492
13084A6020230L545141L478090L068366K381910J319267j13135j426334k348317
13076B5925218k934223l173525l133379k805140k216079j587427j010392m52356
13068H612697P1406N00875R54455J504335K086761K715810L255124L518291L326801
13059B6546555K877113K180420J031878m45127j793738k684747l213375l428657
13051B1070322l308753k893594k259152j644655r86883m60918j4433M36104Q89783
13042A0827821J290067J798279K321858K801199L112634L134821K752499K125631
$$ plain form
13103 1185121 1281186 1398745 1516144 1607005 1690211 1804469 1975248 2213372 2483805 2845944
13093 2845944 3298786 3876619 4632879 5574857 6747500 8251052 10214961 12778738 16020230
13084 16020230 19565371 23043461 26111827 28493737 29813004 29699869 28273535 25925218
13076 25925218 22990995 19817470 16684091 13878951 11662872 10075445 9065053 8612697
13068 8612697 8684103 9184978 10139433 11643768 13730529 16446339 19701463 23219754 26546555
13059 26546555 29423668 31604088 32635966 32190839 30397101 27712354 24498979 21070322
13051 21070322 17761569 14867975 12608823 10964168 9977285 9516367 9501934 9938038 10827821
13042 10827821 12117888 13916167 16238025 19039224 22151858 25286679 28039178 30164809
13034C0164809J358198M04388p25807j747101k433000k766882k867859k799900
13026A8586846k437335j906163j263841n55870Q4226O83745J311654J982491K718599
13017A9204352L387118M014712M717894N224181N419708N229724M660235L750845
13009E5608769K433107Q17090r08037k496921l799964m730676n195723n279185
13001C6448460n099780m630411l987147l269101k546699j769408j026627k59126
12993A3860161N63865J386914K280622L009018L494546L695924L704395L391603
12985C5387048K632526J387196M7395j044779k118840l031654l625361l738941
12977B5894590l518407l058260k439791j889958j361970p82803k02833M04785
$$ plain form
13034 30164809 31523007 31927395 31201588 29454487 27021487 24254605 21386746 18586846
13026 18586846 16149511 14243348 12979507 12423637 12507863 13191608 14503262 16485753 19204352
13017 19204352 22591470 26606182 31324076 36548257 41967965 47197689 51857924 55608769
13009 55608769 58041876 58858966 57950929 55454008 51654044 46923368 41727645 36448460
13001 36448460 31348680 26718269 22731122 19462021 16915322 15145914 14119287 13860161
12993 13860161 14424026 15810940 18091562 21100580 24595126 28291050 31995445 35387048
12985 35387048 38019574 39406770 39454165 38409386 36290546 33258892 29633531 25894590
12977 25894590 22376183 19317923 16878132 14988174 13626204 12843401 12640568 13045353
12969A3045353J088370J881654K749353L550356M140673M331136M129636L544614
12961C8461145K438426P97252r39942k375558l484492m190702m336978m022440
12953B2346711l340314k580321j863596j242063p53708k22655L66441J041474
12945A3751969J827973K645907L397902L881056M109765L949903L434725K235633
12937C9234833N53910j191452k624364l718297m440930m619934m257802l563062
12929A5372902k774297k099089j550838j259862j056965q80738p41473n80440
12921D429200m52095l65978k64658k59170k15406j76665j54585j57317p1107p2985
12911B239234p7189o2651p9335K0814Q9755j2939n505M3205p89l9441m9031p0655
$$ plain form
12969 13045353 14133723 16015377 18764730 22315086 26455759 30786895 34916531 38461145
12961 38461145 40899571 41696823 40756881 38381323 34896831 30706129 26369151 22346711
12953 22346711 19006397 16426076 14562480 13320417 12566709 12344054 12710495 13751969
12945 13751969 15579942 18225849 21623751 25504807 29614572 33564475 36999200 39234833
12937 39234833 39788743 38597291 35972927 32254630 27813700 23193766 18935964 15372902
12929 15372902 12598605 10499516 8948678 7688816 6631851 5751113 5009640 4429200
12921 4429200 3977105 3611127 3346469 3087299 2871893 2695228 2540643 2383326 2312219 2239234
12911 2239234 2162045 2099394 2020059 2040873 2130628 2117689 2112184 2155389 2154600 2115159 2066128 1995473
12899A995473r2973r3465j20312j23979j27040r0467o0771q7663p9327n8271o1666
12888I99539o1516n0629k4706j512k5440j5216k4457K9173j3460k3226O281P477
12876H02308J1642n516O272l5977J7669J7921l7091K153P047N9673R6279M6271
12864I88651L7306M5280J5669J7229m469o4973j5785k3331n7658p1261q1328p0972
12852G14358n3508l9178m2718k3228J950k7668l0125r163K9331l5236j0272J6843
12840D91386J2463L3046J7511l7351k3590J8559M9815K8495M5443J1434j9010
12829F28201j8763P214r707j1601j5390m4505k6887L4653k708j7853L0318K0210
12817E73182L1872K3121J9530K3804O936K935L1560O184K6674N0698M5477O5068
$$ plain form
12899 1995473 1902500 1809035 1688723 1564744 1437704 1347237 1286466 1198803 1119476 1061205 999539
12888 999539 938023 887394 862688 861176 835736 820520 796063 825236 811776 788550 794831 802308
12876 802308 813950 808434 814706 778729 796398 814319 777228 779381 786428 846101 942380 988651
12864 988651 1025957 1071237 1086906 1104135 1099666 1034693 1018908 995577 937919 866658 785330 714358
12852 714358 660850 621672 578954 555726 557676 530008 499883 490720 520051 484815 474543 491386
12840 491386 503849 536895 554406 517055 493465 512024 561839 590334 635777 647211 628201
12829 628201 609438 616652 606945 595344 579954 535449 508562 543215 540507 522654 552972 573182
12817 573182 605054 628175 647705 671509 678445 681380 712940 719124 745798 796496 841973 907041
12805I07041J22312J12071R7154J25652J88414K09713K56061L93753M70174M87942
12795C370287N86126O23866N24086M46517L76255K46251Q3547j02871k87547m29450
12785E437067m56237m51809m93664m74135m05880l55961l57093k64732j63289
12776B014267j50541j08986j01654l4629L345k0830l6118L2722L610o4723j05488
12765A430975j23430r6798o9842n3336k5057k4326m7952N972L2144j3129j44K6435
12753A041512O0938M8875J0073L893J1480j9695j112l5015n1571n6268k9749n0933
12741I32428q8130n4437o932j5542l5062L273K8114O3870k150N5083M6427P0783
12729I97725Q5465P6683Q0736K6328Q8548R8765P3558N4012n230L6996k4825m0170
$$ plain form
12805 907041 1029353 1141424 1238578 1364230 1552644 1762357 2018418 2412171 2882345 3370287
12795 3370287 3956413 4580279 5104365 5550882 5927137 6173388 6256935 6154064 5866517 5437067
12785 5437067 4980830 4529021 4035357 3561222 3155342 2799381 2442288 2177556 2014267
12776 2014267 1863726 1754740 1653086 1618457 1621802 1600972 1564854 1597576 1601186 1536463 1430975
12765 1430975 1307545 1210747 1140905 1087569 1062512 1038186 990234 996206 1028350 1015221 1015077 1041512
12753 1041512 1102450 1151325 1161398 1165291 1176771 1157076 1155964 1120949 1069378 1013110 983361 932428
12741 932428 844298 789861 782929 767387 732325 735598 763712 827582 825432 880515 926942 997725
12729 997725 1083190 1159873 1240609 1266937 1355485 1454250 1527808 1581820 1576590 1613586 1588761 1548591
12717A548591k2598o3553r4678j24535j19145p8408m8791l7330L444K2793O5495
12706A051285O6191O1466J4967N2228R5829O9959O5897L2096K6288M050M0282
12695A580538L0112k7393r4919j18089n8938r1107r5982l3544k5749m3919o296
12684A014714M2229K9402M8486Q8767O3812P5973R8389L3169L1302J6804o4766
12673A478281q6658j29122j22848p3278q2411r0418r6567r2761l4500j8443J9343
12662F70618L0157N4740M4527M9631J00425P3472L4217P8084O8173n042n897n0326
12650A142779o2029p9420j25355p3326k6763o3110p2033k044m008k5364l6051
12639E73276m1683m5065k8935j502l9329j507j4668k7404p057j2879K6851J9058
$$ plain form
12717 1548591 1525993 1462440 1367762 1243227 1124082 1045674 996883 959553 962997 985790 1051285
12706 1051285 1117476 1178942 1193909 1246137 1341966 1411925 1477822 1509918 1536206 1540256 1580538
12695 1580538 1610650 1583257 1488338 1370249 1311311 1220204 1124222 1090678 1064929 1021010 1014714
12684 1014714 1056943 1086345 1134831 1223598 1287410 1363383 1461772 1494941 1526243 1543047 1478281
12673 1478281 1391623 1262501 1139653 1066375 983964 893546 796979 704218 669718 651275 670618
12662 670618 700775 755515 800042 849673 950098 1023570 1057787 1135871 1204044 1199002 1193105 1142779
12650 1142779 1080750 1001330 875975 802649 775886 712776 640743 638699 634691 609327 573276
12639 573276 531593 486528 457593 456091 416762 415255 400587 373183 366126 353247 380098 399156
12627C99156J4171J6956k4501P214j9700p911J062L037k063k0346K2880K3594
12615D13549R309j7543l2474Q918l624j5763l8864m1371j4789K5663l090m2793
12603B47128k2748l877K7808J4202K0631J0536K8678L2410l5548j3862K7683J5534
12591C48575n3842L68L8598k8797O743N691j6897Q939J3949L240K3478m71L594
12578C53168M3913J1409j7163M0562M670k0823K001r628j8542j8035L572J6220
12566C91324k3114j2117k6526k3167K4984M063L439Q406m0594M066M3688K8822
12554C83274K5156l20J7018J6593K5512M3144J7685R755J6439J512n9997n2065
12542D43706k9300j4435J4538R275m2263k9350K0219j4196k6529j0359J7903j0516
$$ plain form
12627 399156 413327 430283 405782 412996 393296 385385 386447 389484 387421 367075 389955 413549
12615 413549 422858 405315 372841 381759 378135 362372 323508 282137 267348 293011 289921 247128
12603 247128 224380 220503 248311 262513 283144 293680 322358 354768 319220 305358 333041 348575
12591 348575 294733 295101 333699 304902 311645 317336 300439 309378 323327 326567 350045 349574 353168
12578 353168 397081 408490 391327 431889 436559 415736 417737 408109 389567 371532 375104 391324
12566 391324 368210 356093 329567 306400 331384 335447 338886 347292 306698 310764 354452 383274
12554 383274 408430 408110 425128 441721 467233 510377 528062 537817 554256 555768 495771 443706
12542 443706 414406 399971 414509 423784 381521 352171 372390 358194 331665 321306 339209 328693
12530C28693L4505J6951j1301L6203K4062L8261R056L0410k485j3450K3501k0725
12518D93681k0742l4222q121K4133M2036o507k0102L6911K582k5715J1339K9740
12506E25013J5739j8385K2900K6182J1033K521J5959J5134J1945L0707L4025N214
12494F97987j3852J1559P323J9368n731K6750N9155L5729N1439N5579N0299J5951
12482A011556M4910O6255Q8117Q0743R3810J04492J02958J17259R5240J11103
12472A916443J22110J80328K37333K92329L06323L76746M51489N64814P24079
12463E171994R20887J225114J561866K004847K582867L324948M257553M952457
12455B6002533N243783M847273L521279J364145j235270l536907m970203n323518
$$ plain form
12530 328693 363198 380149 368848 405051 429113 467374 476430 506840 504355 490905 514406 493681
12518 493681 472939 438717 430596 454729 496765 490258 470156 507067 509649 483934 495273 525013
12506 525013 540752 522367 545267 571449 582482 585003 600962 616096 628041 658748 692773 697987
12494 697987 684135 695694 703017 722385 716654 743404 802559 838288 889727 945306 995605 1011556
12482 1011556 1056466 1122721 1210838 1291581 1385391 1489883 1592841 1710100 1805340 1916443
12472 1916443 2038553 2218881 2456214 2748543 3054866 3431612 3883101 4447915 5171994
12463 5171994 6092881 7317995 8879861 10884708 13467575 16792523 21050076 26002533
12455 26002533 31246316 36093589 39614868 40979013 39743743 36206836 31236633 25913115
12447B5913115m842644l853428k841707j992708j325881p69540k92873J01180
12439A0095514N38502J092990J684716K341490L015928L741416M449976M855808
12431C1816340M708821L895219K430667M16775j799224l726610m975656n263856
12423B7502476m810273l886266k767054j651096o77159J83566R65915J732389
12415A6592498K537716L273996M010577M523131M689395M149581K906370J044609
12407D3727873j030555k918757m245852m863345m855022m375540l581852k626820
12399A5230130j759296j018326m26214J32836P53964J389754K070505K894899
12391A9268252L853577M651315N230548N517089N410440M950311M094950K790153
$$ plain form
12447 25913115 21070471 17217043 14375336 12382628 11056747 10287207 9994334 10095514
12439 10095514 10634016 11727006 13411722 15753212 18769140 22510556 26960532 31816340
12431 31816340 36525161 40420380 42851047 43267822 41468598 37741988 32766332 27502476
12423 27502476 22692203 18805937 16038883 14387787 13710628 13894194 14860109 16592498
12415 16592498 19130214 22404210 26414787 30937918 35627313 39776894 42683264 43727873
12407 43727873 42697318 39778561 35532709 30669364 25814342 21438802 17856950 15230130
12399 15230130 13470834 12452508 12026294 12159130 12913094 14302848 16373353 19268252
12391 19268252 23121829 27773144 33003692 38520781 43931221 48881532 52976482 55766635
12383E5766635J243831j39764j301311k378328l304090m041647m502678m773891
12375C6568757m810372m666096m225791l583866k865540k172824j530408r62020
12367A1751840n05133n1542L50438P42342J338953J968177K667780L376196L781321
12358B5420372L687734L052805J865825L13787j185062k462316l276208l541705
12350B3875232l405124k982194k384897j772890j160145n89073R2829P81614J555811
12341A4011163K395243L324509M093999M442523M033705K931466J265385n40445
12333C5957548k096439l310030l892050l895529l582974l100289k547517j994363
12325A1538357j406412r06253m67437n3675L02314P20541J197476J793361K573961
$$ plain form
12383 55766635 57010466 56870702 55569391 53191063 49886973 45845326 41342648 36568757
12375 36568757 31758385 27092289 22866498 19282632 16417092 14244268 12713860 11751840
12367 11751840 11246707 11195165 11545603 12287945 13626898 15595075 18262855 21639051 25420372
12358 25420372 29108106 32160911 34026736 34340523 33155461 30693145 27416937 23875232
12350 23875232 20470108 17487914 15103017 13330127 12169982 11580909 11673738 12455352 14011163
12341 14011163 16406406 19730915 23824914 28267437 32301142 35232608 36497993 35957548
12333 35957548 33861109 30551079 26659029 22763500 19180526 16080237 13532720 11538357
12325 11538357 10131945 9225692 8758255 8704580 9006894 9727435 10924911 12718272 15292233
12316A5292233L590163M485648M825017M300643K823211O79778j514046l204427
12308C1278220m163874m356837m007129l463880k869295k290583j784109j336764
12300G005749j041369p86876n66970m09141k83202j96351j54908j22926o4202
12291C379804r4289q3046q0072p8752j08106p1780p2139j01182j22030k09342
12281B359066k04867j83938j97924r5556p8702q0480p7118L4142O4469M7928M2670
12270A629690P1803Q3893P2962L7481j0085k5642j9055O319L6209N4313O5088
12259B002976K5296k7073j09483j57849j16545j67358j27467j14619p4921o8913
12249A064044m0553k4354P322N1363M4299N2644Q3227J01047J24063J57892J57700
$$ plain form
12316 15292233 18882396 23368044 28193061 32493704 35316915 35996693 34482647 31278220
12308 31278220 27114346 22757509 18750380 15286500 12417205 10126622 8342513 7005749
12300 7005749 5964380 5177504 4610534 4201393 3918191 3721840 3566932 3444006 3379804
12291 3379804 3285515 3202469 3122397 3043645 2935539 2863759 2791620 2690438 2568408 2359066
12281 2359066 2154199 1970261 1772337 1676781 1598079 1517599 1440481 1474623 1539092 1587020 1629690
12270 1629690 1701493 1785386 1858348 1895829 1885744 1860102 1841047 1847366 1883575 1937888 2002976
12259 2002976 2028272 2001199 1891716 1733867 1617322 1449964 1322497 1207878 1132957 1064044
12249 1064044 1023491 999137 1006459 1057822 1102121 1154765 1237992 1339039 1463102 1620994 1778694
12238A778694J90713J24937M2178j0077o6234j35171j63705j69885j73890j23446
12228A294114j19959j21416r6131o3748p4163n6188l4093L1656K1856J0468P6459
12217H68855J0480M7847P7706M5237L2176Q358M3181M840n6485p9527q9009o7576
12205H46083r9958m4217j1084p624K77m2384m7314ql296O339L6417L1072O0049
12192G24352M5273N3256M0990R7720Q1696J14020O5561K0019n2743p5477j01078
12181A013589j19439r2882r1783m2782m0747j5819n313l3527L67K252L3088L9111
12169F46115N5647P0119L7257O1845P5420L1883j562k1398m9355n9126j09373
12158G37472p2778o4887o2565p1198p6877K605l0807m6160O255l2734l866q936
$$ plain form
12238 1778694 1969407 2094344 2136522 2126445 2060211 1925040 1761335 1591450 1417560 1294114
12228 1294114 1174155 1052739 956608 892860 818697 762509 728416 760072 781928 792396 868855
12217 868855 879335 927182 1004888 1050125 1082301 1090659 1133840 1138680 1082195 1002668 913659 846083
12205 846083 746125 701908 690824 683200 683477 641093 593779 593771 590475 596814 633231 664303 724352
12192 724352 769625 822881 863871 961591 1043287 1157307 1222868 1242887 1190144 1114667 1013589
12181 1013589 894150 801268 709485 666703 625956 610137 604824 571297 571664 573916 607004 646115
12169 646115 701762 771881 809138 870983 946403 978286 976724 955326 905971 846845 737472
12158 737472 664694 599807 537242 466044 389167 391772 360965 314805 321060 288326 284460 275524
12146B75524m993j3165K0299K6848L9305m023m8121p8751j9343L2708L9089J1480
12134B76857p6968l2155J1529L3828K835L8592Q788o1834m8079k131J0727J7865
12122A79854j6630j3360r787k100j4702j5659k7254J5477M9838M0120j0431m997
12110A70369r839o3292m4163L4997K1600j4025k4274J8839k1810Q087J1690K5856
12098A14035l2579m7638Q977k537j1380Q651O3861O083k7038j6086K7217n5n0101
12085D1410L7559J4223o328p630K5835r194L511J0461M3290P211R081J876j7386
12072A53919r848j3093k3111j5713K8223M070J0144P949k2517n6720k1211K6358
12060F8450l126K820j491K248k721K467k0338l601p995j1285L558P078j6527L84
$$ plain form
12146 275524 270531 257366 277665 304513 343818 339795 291674 212923 193580 226288 265377 276857
12134 276857 199889 167734 179263 213091 215926 254518 263306 201472 153393 151262 161989 179854
12122 179854 163224 149864 140077 137977 123275 107616 80362 95839 145677 185797 175366 170369
12110 170369 160530 97238 53075 88072 109672 95647 71373 90212 68402 76489 88179 114035
12098 114035 81456 33818 42795 40258 28878 37529 101390 107473 80435 64349 91566 91511 41410
12085 41410 78969 93192 86864 79234 105069 95875 99386 109847 153137 160348 169429 171305 153919
12072 153919 144071 130978 107867 92154 120377 124447 134591 142540 120023 63303 42092 68450
12060 68450 65324 68144 66653 68901 66180 68647 48309 44708 36713 25428 28986 36064 19537 19921
12046A9921J7852K1855q341J4355j0992j0475l7677k1543J2396J3454k2208k3444
12034c4847Q868M5073j4181N727L135M8968L7690k1612k4246J6922J4149K997
12022H8643k0174l1222j4434L0563k516Q71q762n0231k9248J2548P329M8367L5187
12009F6921J7449M298K8364k6590L1540O2309L6911L3305N336l4773l7479J18
11997A87709J376Q718j7806j1249j0180l6770m5052K5605k8042k9031J8450L2129
11985I5857R125J7544N56k3427K3758L985Q136K7034O2712L402l2303k0530Q428
11972A84277L5119j4942k3675m267k5068j2966p159j919j6229L66M6661k3773
11960A36425Q906K5099K7020K302R18p004R166M8320l69l3174r017j3429K046
$$ plain form
12046 19921 37773 59628 51287 65642 54650 44175 6498 -15045 -2649 10805 -11403 -34847
12034 -34847 -25979 19094 4913 10640 13775 62743 100433 78821 54575 71497 85646 88643
12022 88643 68469 37247 22813 53376 50860 51731 42969 -7262 -36510 -23962 -16633 31734 66921
12009 66921 84370 88668 117032 90442 121982 184291 221202 254507 259843 225070 187591 187709
11997 187709 189085 197803 179997 168748 158568 121798 76746 102351 74309 45278 63728 95857
11985 95857 104982 122526 123082 99655 123413 127398 135534 162568 225280 228682 196379 175849 184277
11972 184277 219396 204454 180779 176512 151444 138478 131319 129400 113171 113537 160198 136425
11960 136425 145331 170430 197450 199752 200670 193666 202832 251152 250783 217609 208592 195163 197209
11947A97209l0632r631j3702l918l2425l7348M5955K0368L4623J4770k5305J4451
11935A74415M8769J7374O1246O7728J8872j8957j7776j4994k3649j7727l7680
11924B57621n128k4112m8649j8856J4432o675j1436k5362j2072P288j1746m586
11912A10719l3025L172L8027K620k376L914K1930j3840J9734J6984J4005L6536
11900B18400L117k9451l2970J1658j1110l3506l0711K8976l6432k3511M8552R463
11888A22475J1478O578J0976K5661L2397L2386J7658P40J554k7904n2310m6864
11876A34825m1592K2107o570r92L337n431Q709k4982l0109J9890L9272l309J0574
11863A25729n612M9775M9430M4012K3436k9009R477P762k4731N649o2575q8066
$$ plain form
11947 197209 166577 156946 143244 139326 106901 69553 115508 135876 170499 185269 159964 174415
11935 174415 223184 240558 301804 369532 388404 369447 351671 336677 313028 295301 257621
11924 257621 252493 228381 179732 160876 175308 168633 157197 131835 119763 127051 115305 110719
11912 110719 77694 80866 118893 121513 119137 123051 144981 131141 150875 167859 181864 218400
11900 218400 221517 192066 159096 170754 159644 126138 95427 124403 87971 64460 113012 122475
11888 122475 133953 140531 151507 177168 209565 241951 259609 260349 261903 233999 181689 134825
11876 134825 93233 115340 108770 107778 111115 105684 114393 89411 59302 79192 118464 115155 125729
11863 125729 120117 169892 219322 263334 286770 257761 267238 275000 250269 255918 193343 105277
11851A05277m2743m6227k9476K2647M1688L1217K2089J2592l1921l5573k7663
11840B1907M1644j3432J9358K2450k3135N26k6201K32J3292J2761j8765q621j4443
11827B7573J4383J9289J1308m5545N578J5830j2352J8230l4607K0834L9721K7112
11815A07354l6417k0843J8271K8199K0007J165m658l4479j9483j7879k4011J2332
11803B9558P809K4981J3589j3873k0611o557k414Q451l0210j7707J350O824r272
11790h082k1594L0642L6561L2132k4417k3186J6744L2577m1904k3163O609l8341
11778b5422m1149K5855M7841j7820r405J2546k10K2907K8330l0154k0048k16K3416
11765A6471p173r764j818J2247M5410k2861m4034P030M3921M042K747L0848O344
$$ plain form
11851 105277 62534 16307 -13169 9478 51166 82383 104472 117064 85143 49570 21907
11840 21907 63551 50119 69477 91927 68792 69318 43117 43349 56641 69402 50637 42016 27573
11827 27573 41956 61245 72553 27008 32586 48416 36064 54294 19687 40521 80242 107354
11815 107354 70937 50094 68365 96564 116571 117736 113078 78599 59116 41237 17226 29558
11803 29558 37367 62348 75937 62064 41453 34896 32482 40933 10723 -6984 -5634 1190 -8082
11790 -8082 -29676 966 37527 69659 45242 22056 38800 71377 29473 6310 12919 -25422
11778 -25422 -66571 -40716 7125 -10695 -20100 -7554 -7764 15143 43473 13319 -6729 -6945 16471
11765 16471 9298 -466 -2284 9963 55373 32512 -11522 -4492 39429 43471 46218 77066 83410
11752H3410j8312k8442k2925q621m115k9262l6041J1718M3255J4161r497J1242
11740F571j5015p695J7434O247j8121J4615J5217O6858n695k3224l8096j2874
11728F222k8782L6297L1489l487k0079n355J813O800L592J1095n911n844L468
11715C1318J9908k155l5378n2395J1552N0191M1789j0099j7914k4232p330l04
11703D951L385J4898p772j1112l0830j4963K1671P877L4360K6201m2890j3007
11691g231k060K0094O328k0355j8597J5653M1115j4754j3559m0705p387K6842
11679a4616J1539J1321j134l0005j1221M9420M0805j7905k1863l129K3349j4569
11667B1992j3802l2005J5331M9352K1763J8759K3115k8894n8792J7510J9058K2884
$$ plain form
11752 83410 65098 36656 13731 5110 995 -28267 -64308 -52590 -9335 4826 -4671 6571
11740 6571 -8444 -16139 1295 7542 -10579 4036 19253 86111 80416 57192 19096 6222
11728 6222 -22560 13737 45226 41739 21660 16305 18118 24918 28510 39605 33694 27850 31318
11715 31318 51226 49071 13693 -38702 -27150 23041 64830 54731 36817 12585 5255 4951
11703 4951 8336 23234 15462 4350 -26480 -41443 -19772 -11895 22465 48666 5776 -7231
11691 -7231 -9291 10803 17131 -3224 -21821 -6168 34947 20193 6634 -34071 -41458 -14616
11679 -14616 -3077 8244 7110 -22895 -34116 15304 56109 38204 16341 13212 36561 21992
11667 21992 8190 -23815 -8484 40868 62631 81390 104505 75611 16819 34329 53387 76271
11655G6271j6245m4408m373j9768J1270K5775L0125m371Q431k0616J4088p479
11643D8700N280L3622m558k2015l0278k4395J3871N1509J1556k2414j0395j7875
11631C2608j4744k0402k9291j5743j4099q420K347M0864K3931N2783l3392p9418
11619f2976j1723P973M4329L5986l672l429k751j8205O122j4262K0721L629N2686
11606E4428K4160l3597k9369j484L0506J5103O371j7317j2952j130j8529l9908
11594b3718J2426m281q154n610M369O199K5474j725l4971n2312K0632J2673J1704
11581c7294J7465L6609l7070j3558L6789K1765m876j5639J3152j251J6693k3550
11569I235k7936O61J7016k571K8343J9489j4690N92m6933J2544L3938k1153n140
$$ plain form
11655 76271 60026 15618 11245 -8523 2747 28522 58647 54276 62707 42091 56179 48700
11643 48700 53980 87602 83044 61029 30751 6356 20227 71736 83292 60878 50483 32608
11631 32608 17864 -2538 -31829 -47572 -61671 -70091 -67744 -26880 -2949 49834 16442 -62976
11619 -62976 -74699 -66726 -22397 13589 9917 6488 3737 -14468 -8346 -22608 -1887 1742 54428
11606 54428 78588 44991 15622 14138 44644 59747 66118 48801 35849 34719 16190 -23718
11594 -23718 -11292 -15573 -23727 -29337 -24968 -18769 6705 4980 -29991 -82303 -61671 -48998 -37294
11581 -37294 -19829 16780 -20290 -33848 2941 24706 19830 4191 17343 16092 32785 9235
11569 9235 -18701 -18040 -1024 -3595 24748 44237 29547 30139 -16794 -4250 29688 8535 3395
11556C395M6745j6916k8937M889J2084L3844J2871j4479L200L6635Q266l7335
11544F4262j8751J6171K9312K556l378K2117j5540l5012R558L8168p895o391k1779
11531G3398l7588l8665M185j1466K3277Q322j2037j1327J4826K6082L1374l9288
11519C1093j2954n285n1881J2816M885p393J5148J4188j1940q164J4053K6478
11507B1044n777k195K6377N476J94m280j155m0764k8986j6599q44L15L3667J9835
11493F308q637J6634J15K058K2060J5508k0273l0613k5540p697R613O3797J4147
11480E7480Q496j0959l7952L328O525l0964m5591L8153J6506k347Q922l875j220
11467F502j969j9256j3468Q266J5834L988R076J8334J8030j1634M637O465J8117
$$ plain form
11556 3395 50140 33224 4287 9176 21260 55104 67975 53496 56696 93331 101597 64262
11544 64262 45511 61682 90994 93550 90172 112289 96749 61737 71295 109463 101568 95177 73398
11531 73398 35810 -2855 1330 -10136 13141 21463 9426 -1901 12925 39007 70381 31093
11519 31093 18139 12854 -39027 -26211 -21326 -28719 -13571 617 -11323 -19487 -5434 21044
11507 21044 15267 13072 39449 44925 45119 40839 39684 -1080 -30066 -46665 -47509 -47194 -13527 6308
11493 6308 -2329 14305 14420 16478 38538 54046 33773 3160 -22380 -30077 -20464 43333 57480
11480 57480 65976 55017 17065 20393 26918 -4046 -49637 -11484 5022 2675 11597 7722 6502
11467 6502 4533 -14723 -28191 -19925 -4091 -103 8973 27307 45337 33703 38340 44805 62922
11454F2922J3416l7481j0187j6163p891r846K0726J5339J58o953j1654Q780l4405
11441a3239j6030k383Q244j432M9541K593j8330k5274L4680K3789N710j0k8513
11428A9346l0617K8805J278k7041m4953p334J2360J1557P592M0572l4n289l8409
11415c2167K563J1796L697j634J7257J6609L357k1547J974k628P861J8467L2073
11402E7678k072l4515K6684j8635k7965L3368J5796l5630m3740k918r805K0007
11390b1747p845J0909N5694J2300m964K4997j2050o3836l7142p876K9831M1119
11378A9390M6347J3491k8000l0496R915j2529q648M447j251o142J1747k9497j4523
11365b5749J581K2489j1471M3861N1187L044o8085l2540Q5542M4044P180m694
$$ plain form
11454 62922 76338 38857 28670 12507 4616 -5230 15496 30835 30993 24040 12386 21166 -13239
11441 -13239 -29269 -31652 -23408 -24840 24701 27294 8964 -16310 18370 42159 47869 47859 19346
11428 19346 -11271 17534 18812 -8229 -53182 -60516 -48156 -36599 -29007 11565 11531 6242 -32167
11415 -32167 -29604 -17808 -14111 -15745 1512 18121 21478 -69 1905 -723 7138 25605 57678
11402 57678 55606 21091 47775 29140 1175 34543 50339 14709 -29031 -31949 -41754 -21747
11390 -21747 -29592 -18683 37011 49311 44347 69344 57294 -6542 -43684 -51560 -21729 19390
11378 19390 65737 79228 51228 20732 30647 18118 9470 13917 12666 6524 18271 -11226 -25749
11365 -25749 -24168 -1679 -13150 30711 81898 84942 16857 -15683 69859 113903 121083 116389
11353A16389m9553q3464k4329J9666L2089k3469k1086J9221Q926k5828o744R598
11341b8584L1405j0944L9701J0101n9166R72K1143J1590k0451O633L5200J8322
11329E5922l9486k1342l1409J3371K1887j5388j1935J2360O917R272k2100M071
11317a7860j5280M295Q851m848K0088J5369j8502L9500N9685l6736n2796L20K8948
11304C1034o25n5415j0637K0064P971M489R441l230J503j8909j7725L7252J2227
11291A7440R724P209n2012j613J7650Q303j4220l487p898K6272k265j1882m419
11278a1198J1257k16R799N1446O587k2362n8075l776N1677L0102j9083m355m764
11265C7039K8939N225k2638j5893j980N422O253l3498k7142j2815k5010J2324
$$ plain form
11353 116389 66836 -16628 -40957 -21291 10798 -12671 -33757 -14536 -5610 -31438 -38182 -28584
11341 -28584 2821 -8123 31578 41679 -17487 -16515 4628 16218 -4233 2400 37600 55922
11329 55922 16436 -4906 -36315 -22944 -1057 -16445 -28380 -16020 -9103 169 -21931 -17860
11317 -17860 -33140 -28845 -19994 -24842 -4754 10615 -7887 31613 91298 54562 1766 2086 31034
11304 31034 30409 -25006 -35643 -15579 -7608 -3119 6322 3092 4595 -14314 -32039 5213 17440
11291 17440 27164 34373 -17639 -19252 -1602 6701 -7519 -11006 -18904 7368 5103 -6779 -11198
11278 -11198 59 -157 9642 61088 67675 45313 -12762 -16538 35139 65241 46158 41803 37039
11265 37039 65978 71203 48565 32672 30692 36114 42367 8869 -18273 -31088 -56098 -43774
11253d3774j7018k7939L1137J2738J5492K5559K7842l6552r96L6775J4979J0770
11241D9013k9774l535K5924J2901k263l0613j1810R049k3078q615M569J3208L6432
11228D1408Q776l650m2143j5312O045J2252j5284j1785O400J3766L0439m228m0517
11215a3833k1138l0132j2174l30J6864M0523J2220l3057j800K014j2197J0356
11203d2684J7894K9431j1956k1655P995m91k127j6045K9369K5945m7990k3956
11191e6270P009J5481Q887k1326j3007j2267m293K5757K7519J4770L459R022J3243
11178A7984K6518k6643k5735J9739L463j4920j7264J6372J950k2233q869O619
11166b3019q636m100J3531k457K0638J9008N682q802J1614o273K5683p490k1220
$$ plain form
11253 -43774 -60792 -88731 -57594 -44856 -29364 -3805 24037 -12515 -13511 23264 38243 49013
11241 49013 19239 15704 41628 54529 52266 21653 9843 18892 -4186 -12801 -8232 4976 41408
11228 41408 50184 46534 4391 -10921 -4876 7376 -7908 -19693 -13293 473 30912 26684 -13833
11215 -13833 -34971 -65103 -77277 -77607 -60743 -20220 -8000 -41057 -42857 -40843 -53040 -42684
11203 -42684 -24790 4641 -7315 -28970 -20975 -21466 -23593 -39638 -10269 15676 -32314 -56270
11191 -56270 -49261 -33780 -24893 -46219 -59226 -71493 -75786 -50029 -22510 -7740 -4281 4741 17984
11178 17984 44502 17859 -7876 11863 15326 406 -16858 -486 1464 -20769 -29638 -23019
11166 -23019 -31655 -35755 -22224 -24681 -4043 14965 20647 11845 23459 17186 42869 35379 14159
11153A4159J462k2217m5482l4670J7762K8501L8747M0253N589n6999o2439L947
11141g1387J0668k245J6999L6216M9986q33j1137k835j0157l9427K833L3387l5523
11128b3455p770k2880j964L7381L8305j7712J4576k8952o533N0293j5119k5075
11116h905J0330J4215k0465J6259K2203J3069J1180r349m2318m3820l1993K303
11104f7291K8513O421R205J8726L2487l525k8183p299L3751L1777j5621m4525
11092e564K5896M9844K6329J692m8092k6605J1895J4249q129J385o2542m2265
11080f1907j9744L653k2709K3931N3602N1706J1335l350p313k9248K2046L915
11068B5917L2455K6678j3720l2322j5765j6976p197P982K821j3356J5627J2732
$$ plain form
11153 14159 15621 -6596 -52078 -86748 -68986 -40485 -1738 38515 44104 -12895 -75334 -71387
11141 -71387 -60719 -62964 -45965 -9749 40237 39404 28267 25432 15275 -24152 -21319 12068 -23455
11128 -23455 -31225 -54105 -56069 -18688 19617 1905 16481 -12471 -19004 31289 16170 -8905
11116 -8905 1425 15640 -4825 11434 33637 46706 57886 48537 6219 -37601 -69594 -67291
11104 -67291 -38778 -32357 -23152 -4426 28061 24536 -3647 -10946 22805 54582 38961 -5564
11092 -5564 20332 70176 96505 98197 50105 23500 35395 49644 41515 42900 -19642 -61907
11080 -61907 -81651 -77998 -100707 -76776 -23174 28532 39867 36517 29204 -44 22002 25917
11068 25917 58372 85050 71330 39008 23243 6267 -930 7052 9873 -3483 12144 24876
11056B4876l4746k5716k547L7767K2938l9554n537k125L7116J7816m241P457j6339
11043A7165r937j6481K9302J2126k5569l5284l3681J1193L3146K7881j5922p735
11031a3796K0590J1171K1791L0675m465K053j9069p8975j6815N8088J7828l3075
11019c999j6653j1334J8936K9961P329L5711j1844k3873j4096L334j6718k5970
11007b9216L2277n790N659L72J5031k1182L8391l029k1850L1012Q368n139j8883
10994B6021j7324K6774K1560p635J7683k2966j8782K7707R019P806k6816j9469
10982B3578j0505L6978r239k2643O747j1757k3577J5743k6316k1859L6895K2296
10970A6341K0145O625J2530j5534j9451j2756J784j3242J6116R607k7429l5012
$$ plain form
11056 24876 -9870 -35586 -38133 -366 22572 -16982 -22519 -24644 12472 30288 26047 33504 17165
11043 17165 7228 -9253 20049 32175 6606 -28678 -62359 -51166 -18020 9861 -6061 -13796
11031 -13796 6794 17965 39756 70431 65966 68019 48950 -30025 -46840 11248 29076 -3999
11019 -3999 -20652 -31986 -13050 16911 24240 59951 48107 24234 10138 13472 -3246 -29216
11007 -29216 3061 -2729 2930 3302 18333 -2849 35542 32513 10663 41675 50043 44904 26021
10994 26021 8697 35471 57031 49396 67079 44113 25331 53038 62057 69863 43047 23578
10982 23578 13073 50051 40812 18169 24916 13159 -10418 5325 -20991 -42850 -5955 16341
10970 16341 36486 43111 55641 40107 20656 7900 9684 -3558 12558 22165 -5264 -40276
10958d0276M2477K3264l3203m201L5199J6786k1658k0965j9583M9251p504j8762
10946H25k0235M616J6800J4276K3643j1354k5394J5925K9913j724l8611j968M185
10933A0897j3982j5351k0260l4658r850K8926j6180N981M8031N418j0013L817
10921a7224k5027l236J0675K9909K4476k7176k1751k7539J0263Q99P555K3976
10909a4200K6501N675J9482q728j4727J892j2485n7999J047L4437J6573M6709
10897D4177J2412n7709k3851m198j2288J9619J1777j8303J4551K5419l0951j1768
10885c1113n389J0442j0682K3336J5863J8267J0417N742j6965k6467J3862j182
10873F131j4417L1122K3092J8263k0662J087l4522k3200o94J6785L737q385j1050
$$ plain form
10958 -40276 2201 25465 -7738 -11939 23260 40046 18388 -2577 -22160 27091 19587 825
10946 825 -19410 -14794 2006 16282 39925 28571 3177 19102 49015 47291 8680 6712 10897
10933 10897 -3085 -18436 -38696 -73354 -83204 -54278 -70458 -64477 -16446 -11028 -21041 -17224
10921 -17224 -42251 -45487 -34812 -4903 19573 -7603 -29354 -56893 -46630 -45731 -38176 -14200
10909 -14200 12301 17976 37458 28730 14003 15895 3410 -54589 -53542 -19105 -2532 44177
10897 44177 56589 -1120 -24971 -29169 -41457 -21838 -10061 -28364 -13813 11606 -19345 -31113
10885 -31113 -36502 -26060 -36742 -13406 2457 20724 31141 36883 19918 -6549 7313 6131
10873 6131 -8286 22836 45928 64191 43529 44616 10094 -13106 -13800 2985 6722 -1663 -12713
10860a2713M9743n5062k656M735J5910p426J35J3669J3582l7768J2187L1015m8097
10847b2746j9984L6498J9324K975o369J1155J9872L2815l8093k1866k7039k8627
10835d2085J1696J243O544N1947J6296J1838l043l216l877l63j8569k1158N334
10822A2587l07j1753j5038J9715P29j1367n0413j1672O172K3474k2720k0823K0034
10809f1382K9914M0517L4917K772l8573j5931k0689J0848Q133J5099k6522j1155
10797c2052j6079o805K8734J1806J4733P670K3246k4802K7246K5589j2368m1611
10785E307m983q443K2551K8012K2497k7543j9115n407l1877K4433j812K0253J9295
10772D3168K0869j3772m707J5428n0255k9072j3023K8343K201J4116m661L4340
$$ plain form
10860 -12713 37030 -18032 -20688 -15953 -43 -7469 -7334 6335 19917 -17851 -5664 25351 -22746
10847 -22746 -42730 -6232 13092 16067 9698 20853 40725 73540 35447 13581 -13458 -42085
10835 -42085 -30389 -29146 -22602 29345 45641 57479 54436 51220 47343 46980 28411 7253 12587
10822 12587 12280 527 -14511 5204 5933 -5434 -55847 -67519 -61347 -37873 -60593 -81416 -61382
10809 -61382 -31468 9049 43966 46738 8165 -7766 -28455 -17607 -9474 5625 -20897 -32052
10797 -32052 -48131 -54936 -26202 -14396 337 8007 31253 6451 33697 59286 46918 5307
10785 5307 324 -8119 14432 42444 64941 37398 18283 12876 -19001 5432 3620 23873 43168
10772 43168 64037 50265 45558 60986 10731 -18341 -31364 -3021 -820 13296 8635 42975
10760D2975q642L0289J6616l0610k1135Q250n3274j6433M915L6101M699n6776
10748d3025k2279J2315L0663K4197N037K9903M3765R227j3010J8999p836l9081
10736D8875k2926K0689j489k3442l9970j6230K4845K6258l8561k2431J8429J3249
10724a2704q087j8874M856J3097k7231J805L3445K0315o566J764K0292K7701j5226
10711C4587l1596j941j2883k37K6425J4653k3816O510L1944N361N465m1087k9133
10698a5748L1630n156J4298J2336K8160Q635k6850j5467k0391R688n067k230k2951
10685i113k842J3037R176q068J86j1611Q833K0156k1454j475M412p554J5221L6066
10671D4970j4923o8M618j8791j1225k4977q457J6242J2741K1780k5658j2798m4098
$$ plain form
10760 42975 34333 64622 81238 50628 29493 37743 -15531 -31964 -27049 9052 13751 -43025
10748 -43025 -65304 -52989 -22326 1871 6908 36811 80576 89803 76793 95792 87956 48875
10736 48875 25949 46638 45149 21707 -18263 -34493 -9648 16610 -21951 -44382 -25953 -12704
10724 -12704 -20791 -39665 -34809 -21712 -48943 -47138 -13693 6622 56 1820 22112 49813 34587
10711 34587 2991 1050 -11833 -12070 14355 29008 5192 11702 43646 49007 54472 13385 -15748
10698 -15748 15882 10726 25024 37360 65520 74155 47305 31838 11447 21135 16068 13838 -9113
10685 -9113 -11955 1082 10258 2190 2376 -9235 -402 19754 -1700 -3175 1237 -6317 8904 44970
10671 44970 30047 29979 34597 15806 4581 -20396 -28853 -12611 130 21910 -3748 -16546 -60644
10658f0644j560P3584j961k1898j4705P267J7824l600k0575L4416r60o710K2235
10645B2713J8704q499m944m0912K93M2620k991k1244J0241l5004l9078L1210L0885
10632C994J2520M664L070j4632N961k3753j0223J9095K6193K84l689j4566K3796
10619C2714Q002k5636k3718K875J1612j9267J8255J696l1777j3399J7445l533
10607b4731P320K6461j2081N918J7650L0487L6055R343P141l5029l3356r931j3216
10594A2031P956L0233r80k8053q785j307p958L9424j243j4574k5408j2882M784
10581f762k549k4570r292L8318K1364Q617J0641l952L513L6596J0259J3213j0591
10568H4805M971k4396l8446j6084L0724J8932j1931l9781P560N2529o048J723
$$ plain form
10658 -60644 -62204 11380 9419 -12479 -27184 -19917 -2093 -5693 -26268 8148 7188 478 22713
10645 22713 41417 32918 27974 -12938 -12645 29975 26984 5740 15981 -19023 -58101 -26891 3994
10632 3994 16514 21178 24248 9616 15577 -8176 -18399 696 26889 27173 23484 8918 32714
10619 32714 40716 15080 -8638 -5763 5849 -13418 4837 6533 -25244 -38643 -21198 -24731
10607 -24731 -17411 9050 -3031 2887 20537 51024 87079 96422 103563 68534 35178 25247 12031
10594 12031 19987 50220 49240 21187 12402 11095 3137 42561 41318 26744 1336 -11546 -6762
10581 -6762 -9311 -33881 -43173 -4855 16509 25126 35767 31815 35328 71924 82183 95396 84805
10568 84805 89776 65380 26934 10850 41574 60506 48575 8794 16354 68883 62835 64558
10556F4558n829m8723O036m95n974l6544O628n1860o286N1257K3480K5781N937
10543B7966J6667k5271l0199j6992J438K835j0202J3763J3854j2844k9778k4862
10531g3625J0714N2893q423k0099K8319P223Q979R243K534k2797J806N4512J8902
10518G0181l0045N189k1422P863j331k1426k6644j1165J4727J5536j054K6501
10506B6910O899k9232k3403l863K0827K0526J5382j3536k3483K54J6403n1713
10494c8029k3386J5338K6048N715L885J0219J8051j9745q593P785M2420k8221
10482A1487O549K8222K9512k2559j2581o908l7285J1303n28M8595J660L464l4225
10469B6706j6872q075m1944N249M6966J1580M2341O467j816J6278K8690J4501
$$ plain form
10556 64558 58729 10006 16042 15547 9573 -26971 -20343 -72203 -78489 -27232 -3752 22029 27966
10543 27966 44633 19362 -10837 -27829 -26391 -23556 -33758 -19995 -6141 -18985 -48763 -73625
10531 -73625 -62911 -10018 -18441 -38540 -10221 -2998 5981 15224 17758 -5039 -3233 51279 70181
10518 70181 40136 45325 23903 31766 30435 9009 -17635 -28800 -14073 1463 409 26910
10506 26910 33809 4577 -18826 -22689 -1862 18664 34046 20510 -2973 -2719 13684 -38029
10494 -38029 -61415 -46077 -20029 -14314 -10429 -210 17841 -1904 -10497 -2712 39708 11487
10482 11487 18036 46258 75770 53211 40630 33722 -3563 7740 7212 55807 57467 60931 26706
10469 26706 9834 1759 -40185 -34936 12030 23610 65951 72418 70602 86880 115570 130071
10457A30071r115M180J5580k650j9168k9102K2346J2031j974k2228K1965k4875
10445I7061l1054k6289j5335p821K5152J1051p8288l1227K6892L1064m162k6641
10433b9597K466O463J7168K9538M6769j8679j6562o690R714n998l3042R59J3214
10420A5723J539J0987K2698L3730k9166o376K9501l791j3788r103J569j4594K3857
10407F2786M8261K022n719r55l3689m0722m978N2985L7293k5381j4436j9k5669
10394E1779Q856J011j8845J5136J8552J0898j3869J440j3889l502L882q765K1855
10381G4539M1411L001q94l608k078L2489m909l973J2449o501q705R948L1845N3157
10367B28171J5004o19J1934n969L5539L8056L9424L1805N3451Q0734K2949O7941
$$ plain form
10457 130071 120956 125136 140716 138066 118898 89796 112142 124173 122199 99971 121936 97061
10445 97061 66007 39718 24383 16562 41714 52765 -25523 -56750 -29858 1206 -2956 -29597
10433 -29597 -27131 -20668 -3500 26038 72807 54128 37566 30876 40590 34592 1550 2509 15723
10420 15723 17262 28249 50947 84677 55511 49135 78636 74845 61057 51954 53523 38929 62786
10407 62786 111047 113069 107350 106395 72706 31984 27006 79991 117284 91903 77467 77448 51779
10394 51779 60635 61646 42801 57937 76489 87387 73518 74958 61069 57567 61449 52684 74539
10381 74539 115950 118951 118057 114449 112371 144860 139951 135978 148427 141926 133221 143169 175014 228171
10367 228171 243175 242556 254490 248521 284060 322116 361540 393345 446796 527530 550479 618420
10355F18420J28176K28240L26175M50058N83664P02935P51781P71677P74270O51299
10345E986695M17773J60877o6709k85481n45166p29245p94970p21851o87842o01423
10335B132658n37828m41866l01591k02385r3963m9073k6852p5394l5798J1978
10325C79886l2695O551Q509K5388r92o5151l2378j1386k1554J8113J5467o9307
10313B20451j0976J8244J6632j1119k9066n936k9288q636q656l627L1668K1204
10301B00895K3503K959k4041j4201J2170K0799k0157P246k78r168L3524J8214
10289B51465K3806R38k714J575M987j4069r173K1742M9455J0662m0802p201J8444
10276C09115K0351J255l8099n98J003k5458n286L8939L0827L4983J8690O0219
$$ plain form
10355 618420 746596 974836 1301011 1751069 2334733 3037668 3789449 4561126 5335396 5986695
10345 5986695 6404468 6565345 6498636 6213155 5667989 4938744 4143774 3421923 2734081 2132658
10335 2132658 1594830 1152964 851373 648988 555025 505952 479100 403706 367908 379886
10325 379886 347191 353742 362251 387639 386647 321496 289118 277732 256178 274291 289758 220451
10313 220451 209475 227719 244351 233232 204166 198230 168942 160306 151650 148023 179691 200895
10301 200895 224398 227357 203316 189115 201285 222084 201927 209173 208895 199727 233251 251465
10289 251465 275271 276209 273495 275070 280057 265988 256815 278557 328012 338674 297872 290671 309115
10276 309115 329466 330721 292622 292024 293027 267569 262283 301222 332049 367032 385722 445941
10264D45941L7121N9986J36256J68285J58339J24713P4839K1184j7059n9753o8280
10253A081572p7848q9505j42658j04465n4519q9576r4703k6074m1351o2280l9405
10242B59188L631k3867J7265M2608N5446L8111j569K6293K3576j0225j885K0441
10230D49013O578m936L0992l6790m3597m631O793J7238M7009N3489Q2736J36164
10218G40058J81244K07487J52553J59754J47160R2907l3630r7721j21776j13441
10208A314595j37634j46159q2338n2321k4261J402m0183o4814j9022m9378j24524
10197E75363q7988o7751n2174k6484K5765o920j9733k3199K392k2609n230M3139
10185C34571j8787m7901J2346j4829j4574k5218J7806J6979p829k0182n2775m8969
$$ plain form
10264 445941 483062 543048 679304 847589 1005928 1130641 1205480 1226664 1209605 1149852 1081572
10253 1081572 1003724 914219 771561 667096 612577 523001 428298 402224 360873 298593 259188
10242 259188 262819 238952 256217 298825 354271 392382 390813 417106 440682 430457 428572 449013
10230 449013 455591 450655 481647 444857 401260 396629 403422 420660 467669 521158 603894 740058
10218 740058 921302 1128789 1281342 1441096 1588256 1681163 1647533 1549812 1428036 1314595
10208 1314595 1176961 1030802 948464 896143 871882 873284 833101 768287 749265 699887 575363
10197 575363 487375 419624 367450 340966 366731 359811 340078 316879 319271 296662 291432 334571
10185 334571 315784 267883 280229 265400 250826 225608 243414 260393 252564 232382 179607 130638
10173A30638J1954L7991k398o354J798P257k4193M211K755j0377j5107l660l6091
10160I8424l1438K8262N3823O2724L7061k6151o9573j698K0726L318k7906M6744
10148A94316R181r896O848o913N271q82J4254K9726k8356l1017J1884J8616J8144
10135B31176k3207m1231k1151J1296j1899l6256l516N5359J3641P614j6439K7074
10123A92461P822J9488m162k2990j869K0598p979O950K0207K1557L5413L5152
10111C22648L6191J4182l0981m0691l1823K4789J3282k3338j4262J230k0280K060
10099B53007J3140k9259k0958M563K086M008L1911L8756J7932K1335K6294M3533
10087D06348L2460j5983l3983j8668L812M1326M1874J2627j0424Q56j3709n669
$$ plain form
10173 130638 142592 180583 178185 171831 173629 180886 156693 160904 163659 153282 138175 134515 98424
10160 98424 66986 95248 149071 211795 248856 222705 153132 151434 172160 175478 147572 194316
10148 194316 203497 193601 200449 193536 198807 197925 212179 241905 213549 182532 194416 213032 231176
10135 231176 207969 166738 145587 156883 144984 108728 105212 160571 174212 181826 165387 192461
10123 192461 200283 219771 215609 192619 190750 211348 203369 210319 230526 252083 287496 322648
10111 322648 358839 373021 342040 301349 269526 294315 307597 284259 269997 271227 250947 253007
10099 253007 266147 236888 215930 220493 222579 226587 258498 297254 315186 336521 362815 406348
10087 406348 438808 422825 388842 370174 373986 415312 457186 469813 459389 460245 446536 440867
10075D40867j8809O938N1079R7039J34675O5798L5266O8027J04905R4931O2428
10064A143144J07291J64496K38578K44353L78495O48857J012421J872901L467515
10055I278051O074733Q105976M343132l067591o434772o352887m446671k530712
10047D969259j426816q56800n75051l61136k26458j53539j07259j08396q9909
10038A063895m7634k7173n7552m7515j3067n5557j07724j03359q0995J74R297
10027E32790k865J2266N8818j3660j8891k0568k271J5511M8373n016j9437m6047
10015E39003n9046q044k1002j5730J5859K8410K7357k0148P551M6804L4323K4625
10003E99962J7505j8548l679J3768M9957n763Q846M7193M9364J8546j2544j4003
$$ plain form
10075 440867 422058 428996 480075 577114 711789 777587 812853 880880 985785 1080716 1143144
10064 1143144 1250435 1414931 1653509 1897862 2276357 2925214 3937635 5810536 9278051
10055 9278051 15352784 23458760 27801892 24734301 18299529 11946642 7499971 4969259
10047 4969259 3542443 2685643 2110592 1749456 1522998 1369459 1262200 1153804 1063895
10038 1063895 1016261 989088 931536 884021 870954 815397 707673 604314 523319 523493 532790
10027 532790 529925 542191 601009 587349 568458 547890 545619 561130 609503 604487 585050 539003
10015 539003 479957 471913 450911 435181 451040 479450 506807 486659 494210 541014 575337 599962
10003 599962 617467 598919 595240 609008 658965 653202 662048 709241 758605 777151 764607 750604
9991G50604K3465M6436q220N062p365J7528N2174O9774O4604J03198R0673P6079
9979A284012P6408J10330J84501K31628K86569M22894M78958N36512O94367Q35315
9969E141494J002696J140382J022745P97161N48814L51828K70601K94015K99700
9960A0869436J00799l00378p45571j062425j076603r22463o72858l75978r8195
9951E715764K13557N50603Q50917J121166J523737J907031K149859K049739J574278
9942A7656651J031292O51126M43639L03946L75947M26861J7247p68116j697087
9933A8441506k369681k469967k141757j622914j016846m57350O5945N09345R92313
9924I930594J432231J731027J907832J725945J230461P26828N52558N13333M59668
$$ plain form
9991 750604 774069 820505 812285 817347 809982 827510 879684 949458 1014062 1117260 1207933 1284012
9979 1284012 1360420 1470750 1655251 1886879 2173448 2596342 3075300 3611812 4306179 5141494
9969 5141494 6144190 7284572 8307317 9104478 9653292 10005120 10275721 10569736 10869436
9960 10869436 10970235 10669857 9924286 8861861 7785258 6862795 6189937 5813959 5715764
9951 5715764 5929321 6479924 7330841 8452007 9975744 11882775 14032634 16082373 17656651
9942 17656651 18687943 19339069 19782708 20086654 20462601 20889462 20906709 20138593 18441506
9933 18441506 16071825 13601858 11460101 9837187 8820341 8362991 8428936 8938281 9930594
9924 9930594 11362825 13093852 15001684 16727629 17958090 18684918 19237476 19750809 20210477
9915B0210477L85860K62567m8288o96165j463225k096444k318556k125675j663191
9906A0447360j113655n70039m9967N03279J036093J450848J781306J902130J655951
9897A7043306J119418O18431M64617N54375Q15349Q87113Q54480N08111o9354
9888B2795846o67635r19459p51833k72037L23354Q12446R97012Q32266O04660
9879B3754620M48514L98098M60181N87977O90437N44894J38586m05415r54588
9870B5663304j286529j292518j006675o56620l26557n5928K98743Q58073J602368
9861B3797661K423579L089498L346863K893674J796169O85894k17018p37815q65323
9852C6213182n68265k52132m50061j266113k344628l167739l443482l190982k529265
$$ plain form
9915 20210477 20596337 20858904 20810616 20114451 18651226 16554782 14236226 12110551 10447360
9906 10447360 9333705 8763666 8713699 9216978 10253071 11703919 13485225 15387355 17043306
9897 17043306 18162724 18781155 19245772 19800147 20615496 21502609 22357089 22865200 22795846
9888 22795846 22128211 21208752 20456919 20184882 20508236 21320682 22317694 23149960 23754620
9879 23754620 24203134 24601232 25061413 25649390 26339827 26884721 27023307 26617892 25663304
9870 25663304 24376775 23084257 22077582 21420962 21094405 21038477 21337220 22195293 23797661
9861 23797661 26221240 29310738 32657601 35551275 37347444 38033338 37816320 37078505 36213182
9852 36213182 35644917 35392785 34942724 33676611 31331983 28164244 24720762 21529780 19000515
9843A9000515j631871o45249L96156J532426K598617L602891M080859L862526
9835C2796870L061158J777108O35461j5745l17850m96434n67686n71145r10516
9826C5391221j798042k802856l380510l391358k973875k380303j575732p65503
9818A6323042J80126J195885K278582L324087M090744M238667L523604K156020
9810C7310757P32324r7512l12284k69883l95404o89641j301694k331134l301955
9801B9343574l781340l662642l187450k574592k007531j466218q23074k36789
9793A1603938K84707Q48256J386255J787147J918947J603010Q60229R3651l09026
9784B0077114l24202k53894l38523o23302j095669j585376j923135j953664j765756
$$ plain form
9843 19000515 17368644 16723395 17119551 18651977 21250594 24853485 28934344 32796870
9835 32796870 35858028 37635136 38270597 38254852 37937002 37440568 36872882 36301737 35391221
9826 35391221 33593179 30790323 27409813 24018455 21044580 18664277 17088545 16323042
9818 16323042 16503168 17699053 19977635 23301722 27392466 31631133 35154737 37310757
9810 37310757 38043081 37945569 37633285 37363402 36967998 36278357 34976663 32645529 29343574
9801 29343574 25562234 21899592 18712142 16137550 14130019 12663801 11840727 11603938
9793 11603938 11888645 12736901 14123156 15910303 17829250 19432260 20292489 20386140 20077114
9784 20077114 19752912 19499018 19160495 18537193 17441524 15856148 13933013 11979349 10213593
9775A0213593j573047j325029j088526q50562o00467m52780l68413k73156j96807
9766C484806j08673q3760j23156j13245n0822l0579n6209m8126k3139k5578p1427
9755B750092j11297j04706r3304j49648j03711n5954k2874k925j391l3551j6450
9744B054281l4853n4316J3078M8611K8828L4638M6924O5682N5104N7914k1964
9733B293927n0975l7735n738n609K299K8208n382K5954J7204Q630k0299M4148
9721B294632R9886R9299J28937J62115K08648K68764L52274L90908M28616N13773
9711D947852O54460Q18400R64632J238679J597578K146323K691922K885373K636696
9702B0581915J725758O30758j12302m98125p63812j159314j782037k171851k240531
$$ plain form
9775 10213593 8640546 7315517 6226991 5376429 4775962 4323182 3954769 3681613 3484806
9766 3484806 3376133 3292373 3169217 3055972 3005150 2974571 2918362 2870236 2847097 2821519 2750092
9755 2750092 2638795 2534089 2440785 2291137 2187426 2131472 2108598 2105673 2104282 2070731 2054281
9744 2054281 2019428 1965112 1978190 2026801 2055629 2090267 2137191 2202873 2257977 2315891 2293927
9733 2293927 2242952 2205217 2199479 2193870 2196169 2224377 2218995 2244949 2262153 2270783 2250484 2294632
9721 2294632 2394518 2493817 2622754 2784869 2993517 3262281 3614555 4005463 4434079 4947852
9711 4947852 5602312 6420712 7385344 8624023 10221601 12367924 15059846 17945219 20581915
9702 20581915 22307673 22938431 22826129 22328004 21564192 20404878 18622841 16450990 14210459
9693A4210459j959751j486762j057660o13246j97161K08854N52150Q64620J300726
9684A1822229J730630K054907K206809K168628J867191J268670N58533k8760k62355
9675B3386482k55715m68101r44855j544327j956253j851892j374639o90719J32618
9666A4432599Q28411J660930K468129L213381L929806M343579M233699L494289
9658C8604823K399482J401114O27626k24537j477105k865968m024238m496216
9650B9944981m336782l622675k784011j908329j167109m43634L66946J235221
9642A7284608K081967K923132L540787L819658L601568K917588K106111J406248
9634C9681667R44366O89624K41893p81821k191001l434038m202160m270271l709666
$$ plain form
9693 14210459 12250708 10763946 9706286 9093040 8895879 9104733 9656883 10521503 11822229
9684 11822229 13552859 15607766 17814575 19983203 21850394 23119064 23677597 23648837 23386482
9675 23386482 23130767 22662666 21717811 20173484 18217231 16365339 14990700 14299981 14432599
9666 14432599 15261010 16921940 19390069 22603450 26533256 30876835 35110534 38604823
9658 38604823 41004305 42405419 43033045 42808508 41331403 38465435 34441197 29944981
9650 29944981 25608199 21985524 19201513 17293184 16126075 15682441 16049387 17284608
9642 17284608 19366575 22289707 25830494 29650152 33251720 36169308 38275419 39681667
9634 39681667 40626033 41315657 41557550 40775729 38584728 35150690 30948530 26678259 22968593
9625B2968593k737879j742867p78614K14064J185903K037939K615269K701017
9617B6463425K287763J477663O08471L65442M38557L58021l31773j393372k446752
9608B7827445l101597l183377k841988k309429j744866j229548o56907J7283O48550
9599A3425566J347984K128991K759179L054427K833617K040557J102493L80790
9591B9073604K29890M43232M88819k63809j445235k397388k956513k904615k454458
9582A7813527j838188j178825m81272K60469J018518J670259K096475K144643
9574B1505606J704363R04713Q8922m43479o54079p95179r61029j310240j679422
9565A8360176k005585k092162j871941j514131j112594p25682l52422Q1277N61667
$$ plain form
9625 22968593 20230714 18487847 17709233 17923297 19109200 21147139 23762408 26463425
9617 26463425 28751188 30228851 30837322 31202764 31641321 31999342 31667569 30274197 27827445
9608 27827445 24725848 21542471 18700483 16391054 14646188 13416640 12759733 12777016 13425566
9599 13425566 14773550 16902541 19661720 22716147 25549764 27590321 28692814 29073604
9591 29073604 29303494 29746726 30235545 29971736 28526501 26129113 23172600 20267985 17813527
9582 17813527 15975339 14796514 14315242 14575711 15594229 17264488 19360963 21505606
9574 21505606 23209969 24114682 24203604 23760125 23106046 22310867 21349838 20039598 18360176
9565 18360176 16354591 14262429 12390488 10876357 9763763 9038081 8685659 8766936 9328603
9556I328603R89627J453652J974501K467112K557097K149543J320864M94396o1700
9547B2673695m18773q19657j350516j953455k269501k220703j949800j557293
9539A0133997j187071q72000m50855r0300L18009P15807J049908J105300Q63185
9530A1585980N07342K24623J43855J43679p60l48157p04439r50788j102175j188553
9520H310607j117393r12871o89683n22040l44448j54805K2663K33102N44875Q35359
9510F205366J108120J239163J078998P95345N76387L51634K97163K7809m45393
9501A1234592j025845j396139j459408j269710j005233p79172o48575n21866m13719
9492B714925l15842k66126k60560j80733j51745j22518j05088p6563l7436k6989
$$ plain form
9556 9328603 10318230 11771882 13746383 16213495 18770592 20920135 22240999 22735395 22673695
9547 22673695 22254922 21435265 20084749 18131294 15861793 13641090 11691290 10133997
9539 10133997 8946926 8074926 7624071 7533771 7851780 8567587 9617495 10722795 11585980
9530 11585980 12093322 12317945 12461800 12605479 12604719 12256562 11552123 10601335 9499160 8310607
9520 8310607 7193214 6280343 5590660 5068620 4724172 4569367 4592030 4825132 5370007 6205366
9510 6205366 7313486 8552649 9631647 10426992 11003379 11355013 11652176 11679985 11234592
9501 11234592 10208747 8812608 7353200 6083490 5078257 4299085 3650510 3128644 2714925
9492 2714925 2399083 2132957 1872397 1691664 1539919 1417401 1312313 1235750 1198314 1171325
9482A171325J5147j0212j5168J147l5217R044J535j9396n2167n3991n0699o3080
9470H98268j3996k5812l6015j2248p356j5616n8249l3649j2802K638K04K0224
9458G05591q821K4360N3738O7712N0347j7852j2853k5620m7298o815M602k0160
9446G66931o642N0128M7959M8166j4131m1115K983M8739K3600o845m8872m7150
9434H23751k0974m1073k0118O411k0532j8703k9001k7007P064j1532j4686O133
9422F39733P3113N7209P2344K1876j1706K2634M4047j1339l5494m765J3767k0229
9410H61190j7829l4388J0414k476l2100m4292l3909l9224j9591j143M3206Q6535
9398G76393J26340Q0389L0659P1191Q9173L5440O1796N3544j9367m5273p5817
$$ plain form
9482 1171325 1186472 1176260 1161092 1162239 1127022 1136066 1137601 1118205 1066038 1012047 961348 898268
9470 898268 884272 858460 822445 810197 802841 787225 728976 695327 682525 685163 685367 705591
9458 705591 696770 721130 774868 842580 892927 875075 862222 836602 789304 782489 787091 766931
9446 766931 760289 810417 858376 906542 892411 851296 854279 903018 926618 919773 870901 823751
9434 823751 802777 761704 741586 747997 727465 708762 679761 652754 659818 648286 633600 639733
9422 639733 712846 770055 842399 864275 852569 875203 919250 907911 872417 867652 881419 861190
9410 861190 843361 808973 819387 816911 784811 740519 706610 667386 647795 646652 689858 776393
9398 776393 902733 983122 1013781 1084972 1174145 1209585 1271381 1324925 1305558 1260285 1184468
9387A184468k7267o2056r3539n2673q1030n7929k5383n5255m1476m415K0550N7709
9375G61704M0064M4562N1716P8747O2472N9580L255p143L5933L2102J6605l9724
9363A139873o3466j18410o9888m2045q426j7424j4753J9673q113J204M5541J2128
9351H75894N664k3466l4609Q690J5835K8440J3123q083K9257q802k8772n6818
9339H16353o6683m4243J0562J4244k8859K2670M7456K029m553J4991J0633l2186
9327G62414r594L6909J9678L3711L1298k5156p363J8961J7238j661m1267m5556
9315G89612O182j3010j9273J1020J3397P0949P9607K2406j4259j8014q383J9888
9303I40122L235l3737q8467r0054l1941l0174r3814l0568l7850J3864P6132K0802
$$ plain form
9387 1184468 1157201 1095145 1001606 948933 867903 809974 784591 729336 687860 683445 703995 761704
9375 761704 801768 846330 898046 976793 1039265 1098845 1102100 1094957 1130890 1162992 1179597 1139873
9363 1139873 1076407 957997 888109 846064 837638 820214 805461 825134 817021 818225 863766 875894
9351 875894 881558 858092 823483 832173 848008 876448 889571 881488 910745 901943 873171 816353
9339 816353 749670 705427 715989 730233 701374 724044 771500 773529 768976 783967 794600 762414
9327 762414 752820 789729 809407 843118 874416 849260 841897 860858 878096 876435 835168 789612
9315 789612 795794 782784 763511 774531 787928 858877 938484 960890 946631 928617 920234 940122
9303 940122 943357 909620 821153 731099 699158 668984 575170 544602 506752 520616 596748 617550
9291F17550q992p009O2835J03914P1544N9782K7483J4722M333k274q6116n8273
9279G99499j0263j8240l7021m6031m4009l8340l1991j1570j4159n6053J7742J7380
9267E26944J6926P457j9915L1217L3854K5256J2759l244L131M409m2649k3157
9255E72988r133k825K414n5131k8663k1502l3691N4621K9759j4115j8330K6651
9243E03043K1466J8648l7673k4817K6073J3823O321l079N1500L1533o7115o1826
9231D77897l1879o0560m8682M0461M5174q170l0973L0701K2562J0019J6425k7217
9219D35758j1950k0997j6284j655K20l4647l1563l0319j7285J6096L2954J3607
9207C33935n724k7807j6129K1339K2992M603j6043l3872n261p852J1995M2338
$$ plain form
9291 617550 608558 601549 664384 768298 839842 899624 927107 941829 946162 943888 857772 799499
9279 799499 789236 770996 733975 687944 643935 605595 573604 562034 547875 491822 509564 526944
9267 526944 543870 551327 531412 562629 596483 621739 634498 631254 634385 638794 596145 572988
9255 572988 563855 561030 563444 508313 479650 458148 424457 479078 508837 494722 476392 503043
9243 503043 524509 543157 505484 480667 506740 520563 526884 523805 575305 606838 539723 477897
9231 477897 446018 385458 336776 377237 422411 414241 383268 413969 436531 446550 462975 435758
9219 435758 423808 402811 386527 384872 385092 350445 318882 288563 271278 287374 320328 333935
9207 333935 328211 300404 284275 305614 328606 333209 317166 283294 278033 270181 282176 324514
9195C24514L7154l162l8086J7352M5048l5399m4740j0445j084k7372J6055K9829
9183C09664L0381K2009M873j0173N987k914J9989N9156M3535J1819j7024j3600
9171D63702J0496q987L8911M9799O394j5269N7667M3443Q0447P0617O2519Q6858
9159I46597R8438J05463J85426K79857K94538L65311M52249O48157R78399J527652
9149E882087K482316L944943N833319O882002M481788q84131m990458o106459
9141A7525407n261166l738579k422004j573980j120021p83955n12267l10972k48034
9132A554429k04885j87480j27023j05086j26664q6341m8424m5615o1470m2372
9122E19069m1904m3136k6599k8378l4351j3172J538p869o6654k2332Q374L8906
$$ plain form
9195 324514 361668 358506 320420 337772 382820 347421 302681 292236 291152 263780 279835 309664
9183 309664 340045 362054 366927 356754 362741 359827 379816 438972 482507 494326 477302 463702
9171 463702 474198 465211 504122 553921 560315 545046 602713 646156 726603 797220 859739 946597
9159 946597 1045035 1150498 1335924 1615781 1910319 2275630 2727879 3376036 4354435 5882087
9149 5882087 8364403 12309346 18142665 25024667 29506455 28622324 23631866 17525407
9141 17525407 12264241 8525662 6103658 4529678 3409657 2625702 2113435 1802463 1554429
9132 1554429 1349544 1162064 1035041 929955 803291 716950 668526 622911 561441 519069
9122 519069 477165 434029 407430 379052 344701 331529 333067 325198 258544 236212 244586 283492
9110B83492j0399m5484R353M166J31r673L0797L0141n9476j08932l6863J3314
9098A00567K6818L8871o285J714j9551k5379J4142m68n295o889J1916K3667J309
9085A55137k9688K997K8722j3026j0786O738l5658j6012M4773M4969J3835l6238
9073A55763k6359m9746k1105L8641r368k4009j375J652J5551K3544l02j2941o174
9060H3772l9214l6092L8644K4313N52J0511k942n429k8262j5680R864l633k4204
9047A2200j4439K6510K0914j7711j6365j6050L1278K7612J0454p721j8491r218
9035B8973k5597k5404K6485K7431P342O466k1636J1561J5720j5070j0674k8167
9023b570m0393k4913M5458N0267N9358j4062J8587J3543m1197l6233J4222K0958
$$ plain form
9110 283492 273093 227609 236962 241128 241259 231586 262383 292524 233048 124116 87253 100567
9098 100567 127385 166256 159971 161685 142134 116755 130897 130429 125134 118245 130161 153828 155137
9085 155137 125449 128446 157168 144142 133356 140094 104436 88424 133197 178166 192001 155763
9073 155763 129404 79658 58553 97194 87826 63817 62442 64094 79645 103189 102887 89946 83772
9060 83772 44558 8466 47110 71423 71975 82486 79544 74115 45853 30173 40037 36404 12200
9047 12200 -2239 24271 45185 27474 11109 -4941 26337 53949 64403 56682 38191 28973
9035 28973 3376 -22028 4457 31888 39230 45696 24060 35621 51341 36271 25597 -2570
9023 -2570 -42963 -67876 -22418 27849 87207 73145 91732 105275 64078 27845 42067 63025
9011F3025J7661K347l6152J6820j3599k5735J959j3658N2442L2955j2022k4316
8999F1727L215j5993J01L3856J5214Q112m1310k4971O222K5929M2178l3113j01897
8986b0730l9503N8969O316l255J1048O3828M1471j8699j5694L589J1133k5319
8974G3154k6882J2045J7249l7126j4025k1015k9338J2121j1159K8836L5687J7162
8962E6709j2220j5825n467l1675K0274J5007j4121J7384L0941k5413k556J9010
8950E2048K1538k7009k9427K4318R185Q374J9216L2293k5330k8490L3638L6013
8938A26367L6070k7100m9781n897L1898r53j7026j3885J2321O722M892K822j828
8925A04622J942j2437m31n619J1434m149J8683l4593k383J8634j4796Q298L8306
$$ plain form
9011 63025 80686 83033 46881 63701 50102 24367 26326 12668 65110 98065 86043 61727
8999 61727 64942 48949 49050 82906 98120 106232 64922 39951 46173 72102 114280 81167 -20730
8986 -20730 -60233 -1264 5052 1797 12845 76673 118144 99445 83751 87340 98473 73154
8974 73154 46272 58317 75566 38440 24415 3400 -25938 -13817 -24976 3860 39547 56709
8962 56709 44489 28664 23197 -8478 11796 26803 12682 30066 61007 35594 33038 52048
8950 52048 73586 46577 17150 41468 50653 59027 78243 110536 85206 56716 90354 126367
8938 126367 162437 135337 85556 79659 111557 110604 93578 79693 92014 98736 103628 106450 104622
8925 104622 106564 94127 93696 88077 99511 95362 114045 79452 77069 95703 80907 89205 127511
8912A27511J0340k4544q235M6686J5549N589J9565J233m763L7876K9142N769Q670
8899B70388N7573N3200P6051O6792R3508J07496J29727J46577J59007J09324J52326
8888A421969K40914L59225O22081J085367J770612K505134K615590J156937r74177
8879A0803652k241909k436709j906998j286819q19263n56603l22863k21797j22723
8870H87968n9569r8546q6234p8668o4115k8711n4101m0834n3942l9175j7786l7805
8858B28482k6177j6420l556l2585k6945K3874M8722k2380m5422m1506k7033K8791
8846H7845m07k160l601J6426m421j4102R919P834j5440q643J5497J1752j386L2797
8832A31910l4770l281k1607m7873O891L3883J3450K188k6848j2886N46J3536J9932
$$ plain form
8912 127511 137851 113307 105072 151758 167307 172896 192461 193694 188931 226807 255949 261718 270388
8899 270388 327961 381161 457212 524004 617512 725008 854735 1001312 1160319 1269643 1421969
8888 1421969 1662883 2022108 2644189 3729556 5500168 8005302 10620892 11777829 10803652
8879 10803652 8561743 6125034 4218036 2931217 2111954 1555351 1232488 1010691 887968
8870 887968 828399 729853 643619 564951 500836 472125 418024 377190 323248 284073 266287 228482
8858 228482 202305 185885 182329 149744 122799 146673 195395 173015 127593 86087 59054 87845
8846 87845 87438 85278 81677 98103 93682 79580 89499 97333 81893 73250 88747 100499 99113 131910
8832 131910 97140 93859 72252 24379 31270 65153 78603 80791 53943 41057 41603 55139 75071
8819G5071l540j4324k4365j595j6770k4169K7368M8972j482m4062j7461l770j4875
8806a5002J8954J6916k2136k265L1466K736J0400J2114K1901j1462j8527m1779
8794C316k7900l3207L6154N0290M1054k550k1942n4527j7610K3299l808J4241
8782F810L1052k204P222M3088J8611n6313n7995k4182m692J8740L9596J9135j0763
8769B8105K5501J0726k3337j0891P397J5957K49K0166K6024K27m9273m206K1892
8756F8537k624L711Q9j6799l083q393j1429K1136L4103J1866P998K8390O575k164
8742A37913m7109k8832l036m2679j906j465K5682J284L894l0473l1701Q921J987
8729g520j5162N49r930J4672l3788J1767J6754L2430K9144l6986j8968J6686K1158
$$ plain form
8819 75071 71531 57207 32842 31247 14477 -9692 17676 66648 65166 21104 3643 -127 -15002
8806 -15002 3952 20868 -1268 -3533 27933 30669 41069 53183 75084 63622 45095 3316
8794 3316 -24584 -57791 -21637 28653 69707 67157 45215 -9312 -26922 -3623 -7431 6810
8782 6810 37862 35658 42880 85968 104579 48266 -9729 -33911 -38603 -19863 19733 38868 28105
8769 28105 53606 64332 40995 30104 37501 53458 53707 73873 99897 100124 50851 46645 68537
8756 68537 65913 69624 69713 52914 49831 41438 30009 51145 85248 97114 105112 133502 140077 137913
8742 137913 90804 61972 58936 16257 14351 12886 38568 39852 43746 13273 -18428 -9507 -7520
8729 -7520 -22682 -22133 -32063 -17391 -51179 -39412 -22658 9772 38916 1930 -17038 -352 20806
8716B0806j9196j7568M994K2552R997k2333k6421p992Q031K1625N325J1209K3749
8703C4778j9097J6004J8908j782l4055k4199J3846J0564M6987M315k2053m1319
8691B897K7573K5873j913l404l5034j9751j8010R913J7397N398J9044K6296q852
8678D7427K2997K0146j1651k5529M832J4257l92J750r998O600o954n2891R548
8665B0142K9181K706O25j404k5047k2401L4192J5122k4684k4115j4867J542J1629
8652B621J0875L2297K3485R98l600k2251j887J8219J1238k3994j7811l6929K677
8639d062Q390O273j480K6307o504M5354j0149p7604R586n242m816J8188J7668
8626B1909R163N4039R544n8760n9916k2726J6261L5673J5816K2793N7671M7721
$$ plain form
8716 20806 1610 -15958 -10964 11588 21585 -748 -27169 -35161 -27130 -5505 -180 11029 34778
8703 34778 15681 31685 50593 48811 14756 -9443 4403 14967 61954 66269 44216 2897
8691 2897 30470 56343 54430 51026 15992 -3759 -21769 -11856 5541 10939 29983 56279 47427
8678 47427 70424 90570 78919 53390 58222 72479 72087 73837 63839 70439 63485 10594 20142
8665 20142 49323 52029 52654 51250 26203 3802 37994 53116 28432 4317 -10550 -9008 2621
8652 2621 13496 45793 69278 70276 66676 44425 42538 60757 71995 48001 30190 -6739 -4062
8639 -4062 4328 10601 9121 35428 28924 74278 64129 -13475 -3889 -9131 -13947 4241 21909
8626 21909 31072 85111 94655 35895 -24021 -46747 -30486 5187 21003 43796 101467 149188
8614A49188J8659N42J3807k8881n5781N913L872K5035j0575J2300K6752J0441
8602A71272N013K6050L5576n5854l0012q376N02l3624j0511n521q374N443n489
8589H6095j4619N115k7547k6833R766J3987k9551j4693l618j0361K2924o009J1149
8576A5805j764J6501n663j3278L7568J3210L1775N648r526J2477k643j925j1770
8563H6415m1042k8523J1220L3490N938k1589O083j3454J2404K0920l9017j4112
8551A8733J4377j4613M448r730l1475K3898J5040l3923R24M2878K5832J5193n4204
8538A7378k9516M2850J7287k6890m627k8403k6563L1450K0865J2247L235r126
8526B0187J4637J4726L834N630l6857k8213Q906m707L884L0036K2424n7387l6123
$$ plain form
8614 149188 167847 168389 182196 153315 97534 103447 107319 132354 121779 134079 160831 171272
8602 171272 176285 202335 237911 182057 152045 143669 144171 110547 100036 94515 86141 91584 86095
8589 86095 71476 76591 49044 22211 31977 45964 16413 1720 -1898 -12259 10665 4656 15805
8576 15805 14041 30542 24879 11601 49169 62379 94154 99802 90276 102753 100110 98185 86415
8563 86415 45373 16850 28070 61560 67498 45909 51992 38538 50942 71862 32845 18733
8551 18733 33110 18497 22945 13215 -18260 5638 20678 -13245 -12321 30557 56389 71582 17378
8538 17378 -12138 30712 47999 21109 16482 -11921 -38484 -7034 13831 26078 29313 20187
8526 20187 34824 49550 53384 59014 22157 -6056 2850 -1857 2027 32063 54487 -2900 -39023
8513c9023J7596N1431j4389k1680R549r147o167P408q665J2784k5335P924L0366
8500A2652k577k958J076L7527l531j0871l295j116M625n279L2463o584J9349l3960
8486C7521m1214m173N524m143M9821R689R918M9287p259j4363k7153n0251j3903
8473f99K821L5574k1656j719k990P009J2520R762J0662k8490k4011k6519K146
8460b5590J3790J767o069J4943K2908J8188j9188j1543j0089J0189k8829N880
$$ plain form
8513 -39023 -21427 30004 15615 -6065 3484 -5663 -11830 -4422 -13087 -303 -25638 -17714 12652
8500 12652 10075 7117 8193 45720 42189 31318 28023 26907 31532 26253 58716 52132 71481 37521
8486 37521 -3693 -7866 -2342 -6485 43336 53025 62943 112230 104971 90608 63455 13204 -699
8473 -699 2122 37696 16040 14321 11331 18340 30860 40622 51284 22794 -1217 -27736 -25590
8460 -25590 -11800 -10033 -16102 -1159 21749 39937 20749 9206 -883 9306 -19523 -13643
$$ [...]
##END NTUPLES=NMR SPECTRUM
##END=
