##TITLE=Analysis number 325910
Compound Code cc 52211
Book Reference 467/122/2
Project Code adrs
Chemist Name benw
##JCAMPDX= 6.0         $$ Bruker NMR JCAMP-DX V2.0
##DATA TYPE= NMR SPECTRUM
##DATA CLASS= NTUPLES
##ORIGIN= Bruker BioSpin GmbH
##OWNER= nmr
$$ XWIN-NMR		Version 3.5
$$ Thu Jan 18 11:42:45 2007 GMT Standard Time (UT+0h)  MAYBRIDGE\nmr@NMR_250MHZ
##.OBSERVE FREQUENCY= 250.131544655141
##.OBSERVE NUCLEUS= ^1H
##.ACQUISITION MODE= SIMULTANEOUS (DQD)
##.ACQUISITION SCHEME= undefined
##.AVERAGES= 16
##.DIGITISER RES= 18
##SPECTROMETER/DATA SYSTEM= dpx250
##.PULSE SEQUENCE= zg30
##.SOLVENT NAME= CDCl3
##.SHIFT REFERENCE= (INTERNAL, CDCl3, 0, 16.522)
##AUDIT TRAIL= $$ (NUMBER, WHEN, WHO, WHERE, WHAT)
$$ ##TITLE= Audit trail, XWIN-NMR		Version 3.5
$$ ##JCAMPDX= 5.01
$$ ##ORIGIN= Bruker BioSpin GmbH
$$ ##OWNER= nmr
$$ C:\u/data/dgb/nmr/ADRS/1380/pdata/1/auditp.txt
$$ ##AUDIT TRAIL=  $$ (NUMBER, WHEN, WHO, WHERE, WHAT)
(   1,<2007-01-18 11:42:13.69 +000>,<MAYBRIDGE\nmr>,<NMR_250MHZ>,
      <created by zg, POWCHK disabled, PULCHK disabled
       configuration hash MD5:
       49 4B E0 1D 92 C2 6B 37 9F E6 65 BC 52 41 86 1D
       data hash MD5: 64K
       23 E8 E1 78 77 2F 93 A8 2D 6C C9 BD CE 79 23 21>)
(   2,<2007-01-18 11:42:28.13 +000>,<MAYBRIDGE\nmr>,<NMR_250MHZ>,
      <Start of raw data processing
       ef LB = 0.3 FT_mod = 6 PKNL = 1 SI = 32K 
       data hash MD5: 32K
       21 E3 0A 9C 9A CB 38 83 23 8A 28 EA BC 8B 7C B6>)
(   3,<2007-01-18 11:42:32.66 +000>,<MAYBRIDGE\nmr>,<NMR_250MHZ>,
      <apk 
       data hash MD5: 32K
       40 6F 70 2C 90 4D EA D9 90 CA 50 B0 7B 80 FF 11>)
(   4,<2007-01-18 11:42:34.19 +000>,<MAYBRIDGE\nmr>,<NMR_250MHZ>,
      <abs ABSG = 5 
       data hash MD5: 32K
       A4 D3 55 B0 C6 69 8E 17 D7 A6 0F BB D5 12 2C CA>)
$$ ##END=
$$ 
$$ hash MD5
$$ 52 B4 52 E8 3C 9F D7 1B 75 6B 0F 38 A3 FA BB 73
##$RELAX= 
##$RELAX= 
##$RELAX= 
##$RELAX= 
##$RELAX= 
##$RELAX= 
##$RELAX= 
$$ Bruker specific parameters
$$ --------------------------
##$DU= <C:\u>
##$EXPNO= 1380
##$NAME= <ADRS>
##$PROCNO= 1
##$TYPE= <nmr>
##$USER= <dgb>
##$AMP= (0..31)
100 100 100 100 100 100 100 100 100 100 100 100 100 100 100 100 100 100 
100 100 100 100 100 100 100 100 100 100 100 100 100 100 
##$AQSEQ= 0
##$AQ_mod= 3
##$AUNM= <au_zg>
##$AUTOPOS= <18 >
##$BF1= 250.13
##$BF2= 250.13
##$BF3= 250.13
##$BF4= 250.13
##$BF5= 500.13
##$BF6= 500.13
##$BF7= 500.13
##$BF8= 500.13
##$BYTORDA= 1
##$CFDGTYP= 0
##$CFRGTYP= 5
##$CHEMSTR= <none>
##$CNST= (0..31)
1 1 145 1 1 1 1 1 1 1 1 1 1 1 1 1 1 1 1 1 1 1 1 1 1 1 1 1 1 1 1 1 
##$CPDPRG= <>
##$CPDPRG1= <>
##$CPDPRG2= <>
##$CPDPRG3= <>
##$CPDPRG4= <mlev>
##$CPDPRG5= <mlev>
##$CPDPRG6= <mlev>
##$CPDPRG7= <mlev>
##$CPDPRG8= <mlev>
##$CPDPRGB= <>
##$CPDPRGT= <>
##$D= (0..31)
0 1 0 0 0 0 0 0 0 0.06 0 0 0 0 0 0 0.0002 0 0 0 0 0 0 0 0 0 0 0 0 0 0 
0 
##$DATE= 1169120531
##$DBL= (0..7)
120 120 120 120 120 120 120 120 
##$DBP= (0..7)
150 150 150 150 150 150 150 150 
##$DBP07= 0
##$DBPNAM0= <>
##$DBPNAM1= <>
$$ [...]
##$SUBNAM7= <"">
##$SUBNAM8= <"">
##$SUBNAM9= <"">
##$SW= 20.6930455092707
##$SWIBOX= (0..15)
0 0 3 0 0 0 0 0 0 0 0 0 0 0 0 0 
##$SW_h= 5175.983436853
##$TD= 65536
##$TD0= 1
##$TE= 294.16
##$TE2= 300
##$TE3= 300
##$TEG= 300
##$TL= (0..7)
0 120 120 120 120 120 120 120 
##$TP= (0..7)
150 150 150 150 150 150 150 150 
##$TP07= 0
##$TPNAME0= <>
##$TPNAME1= <>
##$TPNAME2= <>
##$TPNAME3= <>
##$TPNAME4= <>
##$TPNAME5= <>
##$TPNAME6= <>
##$TPNAME7= <>
##$TPOAL= (0..7)
0.5 0.5 0.5 0.5 0.5 0.5 0.5 0.5 
##$TPOFFS= (0..7)
0 0 0 0 0 0 0 0 
##$TUNHIN= 0
##$TUNHOUT= 0
##$TUNXOUT= 0
##$USERA1= <user>
##$USERA2= <user>
##$USERA3= <user>
##$USERA4= <user>
##$USERA5= <user>
##$V9= 5
##$VALIST= <valist>
##$VCLIST= <CCCCCCCCCCCCCCC>
##$VD= 0
##$VDLIST= <DDDDDDDDDDDDDDD>
##$VPLIST= <PPPPPPPPPPPPPPP>
##$VTLIST= <TTTTTTTTTTTTTTT>
##$WBST= 1024
##$WBSW= 4
##$XGAIN= (0..3)
0 0 0 0 
##$XL= 0
##$YL= 0
##$YMAX_a= 333844
##$YMIN_a= -454216
##$ZGOPTNS= <>
##$ZL1= 120
##$ZL2= 120
##$ZL3= 120
##$ZL4= 120
##$ABSF1= 16.522
##$ABSF2= -4.171173
##$ABSG= 5
##$ABSL= 3
##$ALPHA= 0
##$AQORDER= 0
##$ASSFAC= 0
##$ASSFACI= 0
##$ASSFACX= 0
##$ASSWID= 0
##$AUNMP= <proc_1d>
##$AZFE= 0.1
##$AZFW= 0.1
##$BCFW= 0
##$BC_mod= 0
##$BYTORDP= 0
##$COROFFS= 0
##$CY= 12.5
##$DATMOD= 1
##$DC= 0
##$DFILT= <>
##$DTYPP= 0
##$F1P= 14.0000005364418
##$F2P= -0.99999901652339
##$FCOR= 0.5
##$FTSIZE= 32768
##$FT_mod= 6
##$GAMMA= 0
##$GB= 0
##$INTBC= 1
##$INTSCL= 1
##$ISEN= 128
##$LB= 0.3
##$LEV0= 0
##$LPBIN= 0
##$MAXI= 10000
##$MC2= 0
##$MEAN= 0
##$ME_mod= 0
##$MI= 0
##$NCOEF= 0
##$NC_proc= -5
##$NLEV= 6
##$NOISF1= 0
##$NOISF2= 0
##$NSP= 0
##$NTH_PI= 0
##$NZP= 0
##$OFFSET= 16.522
##$PC= 1
##$PHC0= 225.8622
##$PHC1= 8.480651
##$PH_mod= 1
##$PKNL= yes
##$PPARMOD= 0
##$PSCAL= 4
##$PSIGN= 0
##$REVERSE= no
##$SF= 250.13
##$SI= 32768
##$SIGF1= 0
##$SIGF2= 0
##$SINO= 400
##$SIOLD= 32768
##$SREGLST= <1H.CDCl3>
##$SSB= 0
##$STSI= 32768
##$STSR= 0
##$SW_p= 5175.98343685301
##$SYMM= 0
##$S_DEV= 0
##$TDeff= 65536
##$TDoff= 0
##$TI= <Analysis number 999999
Compound Code 99
Book Reference 9
Project Code 9>
##$TILT= no
##$TM1= 0
##$TM2= 0
##$TOPLEV= 0
##$USERP1= <user>
##$USERP2= <user>
##$USERP3= <user>
##$USERP4= <user>
##$USERP5= <user>
##$WDW= 1
##$XDIM= 32768
##$YMAX_p= 298408505
##$YMIN_p= -430913
$$ End of Bruker specific parameters
$$ ---------------------------------
##NTUPLES= NMR SPECTRUM
##VAR_NAME=  FREQUENCY,     SPECTRUM/REAL,   SPECTRUM/IMAG
##SYMBOL=    X,             R,               I
##VAR_TYPE=  INDEPENDENT,   DEPENDENT,       DEPENDENT
##VAR_FORM=  AFFN,          ASDF,            ASDF
##VAR_DIM=   32768,         32768,           32768
##UNITS=     HZ,            ARBITRARY UNITS, ARBITRARY UNITS
##FACTOR=    0.157963299565203, 1,           1
##FIRST=     4132.6476996994, 0,             0
##LAST=      -1043.33573715361, 0,           0
##MIN=       -1043.33573715361, -430913,     0
##MAX=       4132.6476996994, 298408505,     0
$$ Real data points
##PAGE= N=1
##DATA TABLE= (X++(R..R)), XYDATA
$$ [...]
24511A27759k1771j56744m526N5091j35486j1355O0975o2035j5277K5198l4687
$$ 127759 105988 -50756 -55282 -191 -135677 -147032 -86057 -148092 -163369 -138171 -172858
24500a72858J8958O0394j7718o1391j6158O5944M9078P7831M1527o8875Q563O3186
$$ -172858 -153900 -93506 -111224 -172615 -188773 -122829 -73751 4080 45607 -23268 -14705 48481
24488D8481J04339J6600N4828p1279j02682p7678m9627J7248L0109M7845q4503
$$ 48481 152820 169420 224248 152969 50287 -27391 -77018 -59770 -29661 18184 -66319
24477f6319L6078P5094L4563m4248q8956N4534O0764k6120p7750M2121R0463L4167
$$ -66319 -30241 44853 79416 35168 -53788 746 61510 35390 -42360 -239 90224 124391
24465A24391l0245m6340o4206m3432r7767m267J2918M5975p520j00246N2136J80711
$$ 124391 94146 47806 -16400 -59832 -157599 -161866 -148948 -102973 -110493 -210739 -158603 22108
24453B2108K8457o885N5312O036r021o1650l0155l4447L4047n5188o913l3655
$$ 22108 50565 43680 98992 105028 96007 34357 4202 -30245 3802 -51386 -58299 -91954
24441i1954o2641N4062J51407M1394k9918Q081K9656K5884O4027n5563p3481j24449
$$ -91954 -154595 -100533 50874 92268 62350 70431 100087 125971 189998 134435 60954 -63495
24429f3495m8520M8991N7649L6936k1827L9405M888p6505r356O680K9705p4923
$$ -63495 -112015 -63024 -5375 31561 9734 49139 54027 -22478 -31834 -25154 4551 -70372
24417g0372m8652k0178K9481R3561o6162J3061N4203j34828N6437J01025P0628
$$ -70372 -119024 -139202 -109721 -16160 -82322 -69261 -15058 -149886 -93449 7576 78204
24406G8204n1227j4254L6264k392q2504K0109L1136N45L68j6371M5799J14075
$$ 78204 26977 12723 48987 46595 -35909 -15800 15336 15881 16249 -122 45677 159752
24394A59752o9091j01522J1548m9336J1570L7430n9805q8675P4003J48882K6058
$$ 159752 90661 -10861 687 -48649 -37079 351 -59454 -148129 -74126 74756 100814
24383A00814M9928p6590o818n6080K6588m147l0430N2363P8038J2277l7245n5453
$$ 100814 150742 74152 67334 11254 37842 33695 3265 55628 133666 145943 108698 53245
24371E3245O2662L9431j58001L7139N2234r1998K8804O4517j19897j920L0301
$$ 53245 115907 155338 -2663 34476 86710 -5288 23516 88033 -31864 -33784 -3483
24360c483j7888O7980K7970r0086j04128N1709P184J18R262l2383m9187M2889
$$ -3483 -21371 46609 74579 -15507 -119635 -67926 -60742 -60624 -51362 -83745 -132932 -90043
24348i0043J21177N2076m2083K3467M642q9478M0714p520o9581O093K3513J1258
$$ -90043 31134 83210 41127 64594 69236 -20242 20472 12952 -56629 -50536 -27023 -15765
24336a5765r789l4944k8244Q4755o9511Q25L5445J46462l1230p5603m4058J4055
$$ -15765 -25554 -60498 -88742 -3987 -73498 -72673 -37228 109234 78004 2401 -41657 -27602
24324b7602P0491p5923q4810N3043k9995J6053J5755P580N3156N5216p0622q2221
$$ -27602 42889 -33034 -117844 -64801 -94796 -78743 -62988 -55408 -2252 52964 -17658 -99879
24312i9879J0894K1114K4361K6315r5607o4446J3133J67879p970q167k5416j335
$$ -99879 -88985 -67871 -43510 -17195 -112802 -177248 -164115 3764 -4206 -12373 -37789 -39124
24300c9124J8133J48462J10169j17447k8928j1629l9120N0264J9218m6009P6381
$$ -39124 -20991 127471 237640 120193 91265 79636 40516 90780 109998 63989 140370
24289A40370j5141r3113J0755q7707k4932J06019r781l3969L9376L6251j14120
$$ 140370 125229 32116 42871 -44836 -69768 36251 26470 -7499 31877 68128 -45992
24278d5992o3310J06379O1033r5149r100N257L9163K2475K8943k9619k3320L2792
$$ -45992 -109302 -2923 58110 -37039 -46139 -40882 -1719 20756 49699 20080 -3240 29552
24266B9552P6207r4383k61959q6521O1038J01364J17364j5643R6340J0568p7105
$$ 29552 105759 11376 -250583 -337104 -276066 -174702 -57338 -72981 23359 33927 -43178
24255d3178j1408o5029M8995P9667m0108L8841O9620q1383l5814Q8661K8019J2478
$$ -43178 -54586 -119615 -70620 9047 -31061 7780 77400 -3983 -39797 48864 76883 89361
24243H9361q0032K3534J20686m4259p490j05658K0022n7616K9451L8988m6266
$$ 89361 9329 32863 153549 109290 101800 -3858 16164 -41452 -12001 26987 -19279
24232a9279p1757P483N0882j6807K5238L6494n9666K7595M5849j9445p0919N9310
$$ -19279 -91036 -83553 -32671 -49478 -24240 12254 -47412 -19817 26032 6587 -64332 -5022
24220e022L9527j09999J1585P9105Q4483k0826j3830P3432J2794N1609J7982N1300
$$ -5022 34505 -75494 -63909 15196 99679 78853 65023 138455 151249 202858 220840 272140
24208B72140J2719j20316Q6019o8297j32654r9339P489Q579j8449r1136m7357
$$ 272140 284859 164543 250562 182265 49611 -49728 -42239 -33660 -52109 -143245 -190602
24197a90602N4378m0876M5992J01003J75641k3810j0207P5023J9392k6436j044
$$ -190602 -136224 -177100 -131108 -30105 145536 121726 111519 186542 205934 179498 178454
24186A78454K314o7534j93836p6729K8888l512M9514R8705m8144l5608r9133q8827
$$ 178454 180768 113234 -80602 -157331 -128443 -131955 -82441 16264 -31880 -67488 -166621 -255448
24174b55448R4314P8415n3352K6149K2556O9739m5218k3982L9197n862J79088
$$ -255448 -161134 -82719 -136071 -109922 -87366 -17627 -62845 -86827 -47630 -53492 125596
24163A25596K0760p9510L1760p4730r18r536j05213M2139K6313o5309l9808N150
$$ 125596 146356 66846 98606 23876 22958 13422 -91791 -49652 -23339 -88648 -128456 -123306
24151a23306Q0708N8234J13565n4895p4340K0513J35384k3826J4790Q3352Q2055
$$ -123306 -42598 15636 129201 74306 -34 20479 155863 132037 146827 230179 312234
24140C12234m4098j6614l6122m8560n2307M4831q8924o0551l751K4954P4387L5784
$$ 312234 268136 251522 215400 166840 114533 159364 70440 9889 6138 31092 105479 141263
24128A41263m3076J9903k5010o6783K8885k0992j1113O040J08469Q590k0079p3912
$$ 141263 98187 118090 93080 26297 55182 34190 23077 29117 137586 146176 126097 52185
24116E2185l5694p3057k7045J06706j1185N4995k2275n2709J3137q0939M6926
$$ 52185 16491 -56566 -83611 23095 11910 66905 44630 -8079 5058 -75881 -28955
24105b8955L5057j917j72107p0979M1291M7166q436J1144J21873J12352L2171
$$ -28955 6102 4185 -167922 -238901 -197610 -150444 -158880 -147736 -25863 86489 118660
24094A18660l2900k6718m9936r3449n0360L1974O4865N1113Q1653O0995p3107
$$ 118660 85760 59042 9106 -84343 -134703 -102729 -37864 13249 94902 155897 82790
24083H2790j24800p4598R0601k8203J0617M7139m0073K8013O2456k5178N1872
$$ 82790 -42010 -116608 -26007 -54210 -43593 3546 -36527 -8514 53942 28764 80636
24072H0636K9570q993m4101n1709m5787l130Q2922J7015m5474j212J4125k5364
$$ 80636 110206 101213 57112 5403 -40384 -43514 39408 56423 10949 9737 23862 -1502
24060a502j8269O3M779Q7197J9047K6706K9534j03347k0657R724J1013L3576j0050
$$ -1502 -19771 -19708 -14929 72268 91315 118021 147555 44208 23551 33275 44288 77864 67814
24047F7814k8730q9300j48235P936P3169J01482o0683j06348M5578J34559k6717
$$ 67814 39084 -50216 -198451 -190515 -117346 -15864 -76547 -182895 -137317 -2758 -29475
24036b9475n8292l9444R6213N2928p6912j5625r287J0554J05795m4878K445l0112
$$ -29475 -87767 -127211 -30998 21930 -54982 -70607 -79894 -69340 36455 -8423 -5978 -36090
24024c6090k6438L5075p553J511J1601m2407l7970m5684J210K6365o769Q3825
$$ -36090 -62528 -27453 -35006 -33495 -21894 -64301 -102271 -147955 -146745 -120380 -127149 -43324
24012d3324K0861o1418j3483m6778J55782L0718j7589p740O9667n2108j25877
$$ -43324 -22463 -83881 -97364 -144142 11640 42358 24769 17029 86696 34588 -91289
24001i1289J63240l733r890J4892j7797Q606p0358K7583J3698L4707l185q2586
$$ -91289 71951 68218 58328 73220 55423 64029 -6329 21254 34952 69659 66474 -16112
23989a6112j54092K8600J18945M6119q2989j20182o6303o540R8733N497K7536
$$ -16112 -170204 -141604 -22659 23460 -59529 -179711 -246014 -252554 -153821 -148324 -120788
23978a20788R888J12223L8966j108N7586k3633j03430j29107O5602P1652N6074
$$ -120788 -110900 1323 40289 39181 96767 73134 -30296 -159403 -93801 -22149 33925
23967C3925P5041o3150o5765J2307J6926Q3921N3693P561m2713r9994m5781O612
$$ 33925 108966 45816 -19949 -7642 9284 93205 146898 154459 111746 11752 -34029 -27417
23955b7417m5091p4997j6251o1556l6276Q5537N6901J12210l3667L699J6891k9119
$$ -27417 -72508 -147505 -163756 -225312 -261588 -176051 -119150 -6940 -40607 -36908 -20017 -49136
23943d9136j3940j3718J02832P233K6410L8150o9328L8260k4040M9165m2207m0044
$$ -49136 -63076 -76794 26038 33271 59681 97831 28503 66763 42723 91888 49681 9637
23931I637M735R868l4312j35610J35061J39603j07516l3729J3905N7417O6620
$$ 9637 14372 24240 -10072 -145682 -10621 128982 21466 -12263 1642 59059 125679
23920A25679K4208l3803P443j18672l7635l0115J6214L9445k9971k6862l8051
$$ 125679 149887 116084 123527 4855 -32780 -62895 -46681 -7236 -37207 -64069 -102120
23909a02120J57234q786j24130l1358n5621P4057M5390K7767k9604r8515j24927
$$ -102120 55114 46328 -77802 -109160 -164781 -90724 -45334 -17567 -47171 -145686 -270613
23898b70613K7621N5648L9296n5269O9009J88835O9733q803j535p9478j1258j8846
$$ -270613 -242992 -187344 -148048 -203317 -134308 54527 124260 115457 113922 34444 23186 4340
23886D340p5350n9505L000J03519J44231l431j32719l5964O8966R9743J9596o4898
$$ 4340 -71010 -130515 -127515 -23996 120235 116804 -15915 -51879 17087 116830 136426 71528
23874G1528q9862l3179R1786Q3829p8099j01117m9015J6559K1543N6121p587L5424
$$ 71528 -18334 -51513 40273 124102 46003 -55114 -104129 -87570 -66027 -9906 -17493 17931
23862A7931N819j5193j8359K0461m3026L5772q9315m025L3557q8758j15762J52089
$$ 17931 23750 8557 -9802 10659 -32367 3405 -85910 -89935 -56378 -145136 -260898 -108809
23850a08809m4101j34610k6385Q40O1513J53011K801J12741p2632r1145M5530
$$ -108809 -152910 -287520 -313905 -313065 -251552 -98541 -95740 17001 -55631 -146776 -101246
23839a01246J1305P443M7310L6589K2691k5668o2369M5835P6942q4959p2228J2438
$$ -101246 -89941 -82498 -35188 1401 24092 -1576 -63945 -18110 58832 -26127 -98355 -85917
23827h5917J5671N2453K0523j2914n5135m9658j0277K2410k1176k5425M9612J06856
$$ -85917 -70246 -17793 2730 -10184 -65319 -114977 -125254 -102844 -124020 -149445 -99833 7023
23815G023P8283j34671J6217n7244M9838K5719r914l5281k786J2707j09062M8720
$$ 7023 85306 -49365 -33148 -90392 -40554 -14835 -24749 -60030 -62816 -50109 -159171 -110451
23803a10451O4903L1105n5682j9083K4545j02797r0695N2284J49197P0771k0429
$$ -110451 -45548 -14443 -70125 -89208 -64663 -167460 -258155 -205871 -56674 14097 -6332
23792f332j036k4356M3720O6164O2686m2160m3330M5993l8776K2138J8514o3641
$$ -6332 -7368 -31724 11996 78160 140846 98686 55356 101349 62573 84711 103225 39584
23780C9584j05282R9531N9577J956K1749L2330o0304l7590l8411L534L6548N556
$$ 39584 -65698 33833 93410 95366 117115 149445 89141 51551 13140 16674 53222 58778
23768E8778j57627j19793l759p023N4769k3975O2481P3973N333m4533r2001Q2982
$$ 58778 -98849 -218642 -222401 -229424 -174655 -198630 -136149 -62176 -56843 -101376 -193377 -110395
23756a10395L0489k5626p9488q0637J65887Q1870j6208n579Q975M2236Q2408o1264
$$ -110395 -79906 -105532 -185020 -265657 -99770 -17900 -34108 -39687 -30712 11524 93932 32668
23744C2668j09907k7287P812J747J74998M5200r1419j5759M836k9795r74O1807
$$ 32668 -77239 -104526 -96714 -94967 80031 125231 33812 18053 22889 -6906 -7880 53927
23732E3927o4738k6796P4384J57730O2604j18658j16900q358N5872p0854O7521
$$ 53927 -10811 -37607 36777 194507 257111 138453 21553 13195 69067 -1787 65734
23721F5734m7717j31881P5461N1642j6631n8736N5568L9643P806J5242L7356l4412
$$ 65734 18017 -113864 -38403 13239 -3392 -62128 -6560 33083 40889 56131 93487 59075
23709E9075k4840j4505K3427J9339j13485n9262k6360j9143J20381k6352m1970
$$ 59075 34235 19730 43157 62496 -50989 -110251 -136611 -155754 -35373 -61725 -103695
23698a03695L6491K9776L7219P6880l035j11960n773N4788J6163j9220l3732j7322
$$ -103695 -67204 -37428 -209 76671 73636 -38324 -44097 10691 26854 7634 -26098 -43420
23686d3420L2205j087L6033Q2629R0258J4876j0329q2878n1975M7073K6022p6189
$$ -43420 -11215 -12302 23731 106360 196618 211494 201165 118287 66312 113385 139407 63218
23674F3218M0373m1413p5941o9723k3938P9566j11363N9069J6371l4250m845N7432
$$ 63218 103591 62178 -13763 -83486 -107424 -27858 -139221 -80152 -63781 -98031 -102876 -45444
23662d5444R9819O4318j24064l0217N0421O4752m2226j0335m9455j1059O4027
$$ -45444 54375 118693 -5371 -35588 14833 79585 37359 27024 -22431 -33490 30537
23651C0537l5596j12802l6891Q0645Q3729m827l8803q803N0454L30n9545l3688
$$ 30537 -5059 -117861 -154752 -74107 9622 4795 -34008 -42811 7643 7973 -51572 -85260
23639h5260k5653J3211J21553k2762K036q3592p8603k7578R160J50513R4991p8202
$$ -85260 -110913 -97702 23851 1089 3125 -80467 -159070 -186648 -177488 -26975 68016 -10186
23627a0186J7564J60m2586o2763o3898L3278J76928O7252n3816j24033m9765N8647
$$ -10186 7378 7538 -35048 -97811 -161709 -128431 48497 115749 61933 -62100 -111865 -53218
23615e3218l7004M4036l9460L6258N3207K8005J7999L1919l1061R4865j4088J0816
$$ -53218 -90222 -46186 -85646 -49388 3819 31824 49823 81742 50681 145546 131458 142274
23603A42274l1112p9826j6933k4779n157N9864N4267L3595j8494J34379K5377
$$ 142274 111162 31336 14403 -10376 -15533 44331 98598 132193 113699 248078 273455
23592B73455j50811J5218l0912R2143k8467p0755K9939R602j15859o4391j85981
$$ 273455 122644 137862 106950 199093 170626 99871 129810 139412 23553 -40838 -226819
23581b26819J2949L7319Q636J05780J13499n9617n0864K437j23496o8818P512
$$ -226819 -213870 -176551 -167915 -62135 51364 -8253 -59117 -56680 -180176 -248994 -241482
23570b41482n0702l1517L0207K3455J58027J17667Q1246K2904l2078n3649R62
$$ -241482 -292184 -323701 -293494 -270039 -112012 5655 86901 109805 77727 24078 25040
23559B5040k2497M0308P2005n4234J1783l4914p899k29j13226j1745R7460p9401
$$ 25040 2543 42851 114856 60622 72405 37491 29592 29363 -83863 -95608 1852 -77549
23547g7549k7141J8063L8015J01091j13740q4264J0049O0388P5684p8660j10998
$$ -77549 -104690 -86627 -48612 52479 -61261 -145525 -135476 -75088 596 -78064 -189062
23536a89062q1464m5260J12611N6953O4969J48971j078r8026r0344m4636J00585
$$ -189062 -270526 -315786 -203175 -146222 -81253 67718 66640 -31386 -121730 -166366 -65781
23525f5781P2764M2494K8347m1763R87Q2652m2929L6350K1764J3732K3210q6582
$$ -65781 6983 49477 77824 36061 37048 119700 76771 113121 134885 148617 171827 85245
23513H5245o4891m0072q7088M7239k0333K2826o2086m775j85r316L0983J0406
$$ 85245 20354 -19718 -106806 -59567 -79900 -57074 -119160 -123935 -124120 -133436 -102453 -92047
23501i2047O7196J18253o1908N0450R8638L170q0833j5109r8505p8041j23658
$$ -92047 -24851 93402 31494 81944 180582 183752 102919 87810 -10695 -88736 -212394
23490b12394j0306J48997R4170r420k4996K0598o3480K1507N1191j03350J8913
$$ -212394 -222700 -73703 20467 11047 -13949 6649 -56831 -35324 15867 -87483 -68570
23479f8570L4787j1075q0089r0681j0781N1509J31740K9455j3801K7169N3093
$$ -68570 -33783 -44858 -124947 -215628 -226409 -174900 -43160 -13705 -27506 -337 52756
23468E2756n0711o947r6791R5305L6077j3808m829j3761L5887L9196M8717K13
$$ 52756 2045 -4902 -101693 -6388 29689 15881 11052 -2709 33178 72374 121091 121304
23456A21304q2301j024J22546m2969m9616M599J41599k7448j40539j38237J0017
$$ 121304 39003 37979 160525 117556 67940 72539 214138 186690 46151 -92086 -82069
23445h2069N9324j5917n7421l7800o6779J15148R5415l334L9717J0981j1737J29952
$$ -82069 -22745 -38662 -96083 -133883 -200662 -85514 9901 6567 46284 57265 45528 175480
23433A75480L1359o2547j06311m6459M1807O8279p957j9651j7340j07662l6200
$$ 175480 206839 144292 37981 -8478 33329 101608 93651 74000 56660 -51002 -87202
23422h7202j4556o1813J68612N1385p8419o3813R0085K2424K0897j11790m549
$$ -87202 -101758 -163571 5041 56426 -21993 -85806 4279 26703 47600 -64190 -68739
23411f8739N2432J397K9352P8843J46520q2449n0271l0054o1718L5358N4441K9270
$$ -68739 -16307 -14910 14442 93285 239805 157356 107085 77031 15313 50671 105112 134382
23399A34382k2160m3146J9360Q8940M901M116Q2818m6085o3604k0789R851J45728
$$ 134382 112222 69076 88436 177376 182277 186393 269211 223126 159522 138733 148584 294312
23387B94312o2027j4919l256j47524j59168J09295r303K9923M1609j60632j08496
$$ 294312 232285 217366 214110 66586 -92582 16713 7410 37333 78942 -81690 -190186
23376a90186N3778O1175m4734p6611O3928n986k6853O0605m5220J0565O90J7746
$$ -190186 -136408 -75233 -119967 -196578 -132650 -138636 -165489 -104884 -150104 -139539 -138849 -121103
23364a21103J6868n716p360l5223O6901L4184j516p8464o6783J07424L0902j717
$$ -121103 -104235 -109951 -117311 -152534 -85633 -51449 -52965 -131429 -198212 -90788 -59886 -61603
23352f1603L2666J31741M0216L9631j673r1160k0306J4316J280l8046o5911k540
$$ -61603 -28937 102804 143020 182651 180978 89818 69512 83828 85108 47062 -18849 -21389
23340b1389R1601L2499j22450k7529N6291j3349k2504q9715m8511K9482P1943
$$ -21389 70212 102711 -19739 -47268 9023 -4326 -26830 -116545 -165056 -135574 -63631
23329f3631O927k0466J12344j5890L4424Q0605O1530J2276j4969l8564j12729
$$ -63631 -56704 -77170 35174 19284 53708 134313 195843 208119 193150 154586 41857
23318D1857L0803J29847o8305m2472p2829M8861L1494k7525j0386n2830j46267
$$ 41857 72660 202507 134202 91730 18901 67762 99256 71731 61345 8515 -137752
23307a37752O4312J37885L6354r0458K825l6880l8072L7910N1561m087p0840j4621
$$ -137752 -73440 64445 100799 10341 13166 -23714 -61786 -23876 27685 23598 -47242 -61863
23295f1863J45353m9511l1729P189o1445K0021N2596L1392k8175j0258J2128l2947
$$ -61863 83490 33979 2250 9439 -52006 -31985 20611 52003 23828 13570 25698 -7249
23283g249j10388r9226K7154P2476J16568M5693L5899p0734J5508M673m3273m1912
$$ -7249 -117637 -216863 -189709 -117233 -665 45028 80927 10193 25701 30374 -12899 -54811
23271e4811r0673j8746N890j04200k8344J33000J81514R1789p1257j24216m5381
$$ -54811 -145484 -164230 -158340 -262540 -290884 -157884 23630 115419 44162 -80054 -125435
23260a25435K8184N9610k0175o988P719M8904M6468J49946O5709j15984o788p7191
$$ -125435 -97251 -37641 -57816 -64804 -57085 -8181 38287 188233 253942 137958 131170 53979
23248E3979N5970j08817p8213J3502N532J4684Q3582R1948O3070j2211l2663j67876
$$ 53979 109949 1132 -77081 -63579 -58047 -43363 40219 132167 195237 183026 150363 -17513
23236a7513k078l6054l7971n652L3992j0654Q1886K7633K8239k3259m1001j10856
$$ -17513 -19591 -55645 -93616 -99268 -65276 -75930 5956 33589 61828 38569 -2432 -113288
23224a13288M6572J11870M6811j7057j65054P1791J82931Q8381j9991j20686p0083
$$ -113288 -66716 45154 91965 74908 -90146 -18355 164576 252957 232966 112280 42197
23213D2197o0203j54939p3121O5839R5324J0927O7016k2988K6569J9339o5725
$$ 42197 -18006 -172945 -246066 -180227 -84903 -73976 -6960 -29948 -3379 15960 -49765
23202d9765L1649K5550j3799k1547l1831p489j6117k5875K3630n7145r7897m5768
$$ -49765 -18116 7434 -6365 -27912 -59743 -67232 -83349 -109224 -85594 -142739 -240636 -286404
23190b86404J14049P0827J31898k3431l7489m4347j04487k632P0175R8985N8527
$$ -286404 -172355 -101528 30370 6939 -30550 -74897 -179384 -182016 -111841 -12856 45671
23179D5671J7618Q2651L3995j38559N656o102K054m6193l8562L6478j4070P3318
$$ 45671 63289 145940 179935 41376 47032 40930 42984 -3209 -41771 -5293 -19363 53955
23167E3955Q17r5309K00m0915k7835P256J0916n1048K8265J04416N1979j6607
$$ 53955 54772 -40537 -40337 -81252 -109087 -101831 -90915 -141963 -113698 -9282 42697 26090
23155B6090L4470N8586j38j12703k5713j6611l685L9217o3123L4240k7499J7889
$$ 26090 60560 119146 119008 6305 -19408 -36019 -39704 -487 -63610 -29370 -56869 -38980
23143c8980o1084N6190P6559p8829j643M3509k1681J7691l8381m348R8670R012
$$ -38980 -100064 -43874 32685 -46144 -47787 -4278 -25959 -8268 -46649 -50997 47673 56685
23131E6685k1960M7363m5923j18006L914O5531M0879j21492n7722J20911O402
$$ 56685 34725 82088 36165 -81841 -77927 -12396 28483 -93009 -150731 -29820 -23418
23120b3418L0413j5776n6191l9119k0096N3246K9695r9030q9273q840J32037L5364
$$ -23418 6995 -8781 -64972 -104091 -124187 -70941 -41246 -140276 -229549 -238389 -106352 -70988
23108g0988K08737L3077n4290o3012K3249o527l4037N6772O5856K3167j83535
$$ -70988 137749 170826 116536 53524 76773 70246 36209 92981 158837 182004 -1531
23097a531M0549M3523L8763M5196j1072p5114o9684l4355J2179j15109p5704J9129
$$ -1531 39018 82541 121304 166500 155428 80314 10630 -23725 -11546 -126655 -202359 -183230
23085a83230J62667J48263k1113j80355M1608Q0355J8347q1447m882j3717K39
$$ -183230 -20563 127700 106587 -73768 -32160 48195 66542 -14905 -19787 -33504 -33265
23074c3265j7694l8903p37J6036K7411n5235o6816J47581Q4851r5129N8351k6257
$$ -33265 -50959 -89862 -90599 -74563 -47152 -102387 -169203 -21622 63229 -31900 26451 194
23062A94n1942J3128J33020O6094l3903J8436k822j1942j03024m2196J2598O3127
$$ 194 -51748 -38620 94400 160494 126591 145027 142205 130263 27239 -14957 -2359 60768
23050F0768n7960J3197n1011l0387m820M067n3861n072J670n7661K2471o8450
$$ 60768 2808 16005 -35006 -65393 -70213 -66146 -120007 -125079 -123409 -181070 -158599 -227049
23038b27049k4326N2496J49995O481N616k7517K9096J39823M2139q6823Q529N4153
$$ -227049 -251375 -198879 -48884 -42403 -36787 -64304 -35208 104615 146754 59931 68460 122613
23026A22613m4465m1368m8846o1082r6642k2694J2974P9202J23918p9980J320
$$ 122613 78148 36780 -12066 -73148 -169790 -192484 -179510 -100308 23610 -56370 -55050
23015e5050p9905M0524R3486N8053M5362j06954l3854J9570P6208P1893j8860
$$ -55050 -134955 -94431 -945 57108 102470 -4484 -38338 -18768 57440 129333 110473
23004A10473m733n1085l2148P2398j67577o4102N2584p4323r8132N1071P0990
$$ 110473 105740 54655 22507 94905 -72672 -136774 -84190 -158513 -256645 -205574 -134584
22993a34584k3372R2023J49536o4446p4335J01070j8120j14299k8296J41494J1226
$$ -134584 -157956 -65933 83603 19157 -55178 45892 27772 -86527 -114823 26671 37897
22982C7897j70201J5471K8970L0765K1005o762N42r7279o7105R1922k7205k683
$$ 37897 -132304 -116833 -87863 -57098 -36093 -42855 -42313 -139592 -206697 -114775 -141980 -144663
22970a44663n9998L7116J2316O7175M18k6289N9241Q8643K1201n1192o9572R7548
$$ -144663 -204661 -167545 -155229 -88054 -87636 -113925 -54684 33959 55160 3968 -65604 31944
22958C1944J7815n6403k4737J8945M9528K0856J04643m0393j98929L3281R3539
$$ 31944 49759 -6644 -31381 -12436 37092 57948 162591 122198 -76731 -43450 50089
22947E0089J06730L1900m0110m9053o3465k3733k0224l0164j0991Q960J1149m7868
$$ 50089 156819 188719 148609 99556 36091 12358 -7866 -38030 -49021 -40061 -28912 -76780
22935g6780m6080j3156J35829J3844n5667R4607q6933k3765Q1556j17512m5126
$$ -76780 -122860 -136016 -187 13657 -42010 52597 -34336 -58101 23455 -94057 -139183
22924a39183k615R9020P4834l8722J0913P9513o486R3529P2107K2564p3810j13882
$$ -139183 -141798 -42778 32056 -6666 4247 83760 77274 170803 242910 265474 191664 77782
22912G7782l6743Q7j01403o5540N9538j15896K7909N8890N5589L134r925r3918
$$ 77782 41039 41126 -60277 -125817 -66279 -182175 -154266 -95376 -39787 -36653 -46578 -140496
22900a40496J6238R6964K3731k3703j8428K2698n0833o116J05823R9134n6533
$$ -140496 -124258 -27294 -3563 -27266 -45694 -22996 -73829 -79945 25878 125012 68479
22889F8479M2186N407l5425j9390q7936j19839j1009J94374P6871M2018q4475
$$ 68479 110665 116072 80647 61257 -26679 -146518 -157527 36847 113718 155736 71261
22878G1261o3406m4088n4261k6107N4992J47203J22691M8034j12096n8512m647
$$ 71261 7855 -36233 -90494 -116601 -61609 85594 208285 256319 144223 85711 81064
22867H1064l0733O3277j716j31339n248m2216j4693K3452Q3787M4397N8247O5541
$$ 81064 50331 113608 111892 -19447 -24695 -66911 -81604 -58152 25635 70032 128279 193820
22855A93820k1387J7340k4936r2245k6445p8322j49136M5820J82133n5917p8943
$$ 193820 172433 189773 164837 72592 46147 -32175 -181311 -135491 46642 -9275 -88218
22844h8218K5933J1888l3529l0496P1486J9601n2056q846N6998j3622n230l342
$$ -88218 -62285 -50397 -83926 -114422 -42936 -23335 -75391 -84237 -27239 -40861 -46091 -49433
22832d9433Q1468k9471L3408m0425r8265q598R0233r984j11903Q3028K45050j1624
$$ -49433 32035 2564 35972 -4453 -102718 -111316 -21083 -31067 -142970 -59942 185108 173484
22820A73484r4784j18783p3640o78M1773J9310J48l0880J45174J15028K1806q8928
$$ 173484 78700 -40083 -113723 -114401 -72628 -53318 -53170 -84050 61124 176152 197958 109030
22808A09030k9579R694j09338m8148m4787l235q7139O2605J60367l8593j955K6423
$$ 109030 79451 89145 -20193 -68341 -113128 -116363 -203502 -140897 19470 -19123 -21078 5345
22796E345Q983P2863R032q0317j00461O3883K5047m6398M3170k4899p9631J10234
$$ 5345 14328 87191 96223 15906 -84555 -20672 4375 -42023 1147 -23752 -103383 6851
22784F851L1074n0773p0214p3407o2258o3174j8292R2667J38673j0111m0824k8305
$$ 6851 37925 -12848 -83062 -156469 -218727 -281901 -300193 -207526 -68853 -78964 -119788 -148093
22772a48093j1187K2843N7185k0104Q0010n808J7584n6496q8392L5872J04020
$$ -148093 -159280 -136437 -79252 -99356 -19346 -25154 -7570 -64066 -152458 -116586 -12566
22761a2566n8136k7586J3209J3213L924J258M9878q661M6052k4325r8754m7215
$$ -12566 -70702 -98288 -85079 -71866 -67942 -66684 -16806 -25467 20585 -3740 -102494 -149709
22749a49709K8020O8049O7911j20014j96452m136J38712J75311K702o2587k0402
$$ -149709 -121689 -53640 14271 -105743 -302195 -306331 -167619 7692 10394 -52193 -72595
22738g2595K0117o9010j08318N5042o8016m1669J48190J35923O3500P5002o9464
$$ -72595 -52478 -121488 -229806 -174764 -242780 -284449 -136259 -336 63164 138166 68702
22727F8702p4216q9117J07911M3601J0493j8116o1014m064K834j18513o955J35111
$$ 68702 -5514 -94631 13280 56881 67374 49258 -11756 -15820 -12986 -131499 -138454 -3343
22715c343J58868L4745p5903j31486l9243K189J04458O8320j5161P5343k9036
$$ -3343 155525 190270 114367 -17119 -56362 -54173 50285 118605 103444 178787 149751
22704A49751o9290o7285p504k152N2256P7056K6678n9962l9905p0120k686M5954
$$ 149751 80461 13176 5672 3520 55776 132832 159510 99548 59643 -10477 -13163 32791
22692C2791L5129M2628q4088j09666J03479O4165L1196M5149N7054p501O8452
$$ 32791 67920 110548 26460 -83206 20273 84438 115634 160783 217837 210336 278788
22681B78788r8655j23120j00381Q954O829o1286l1480O8344k1916q886K3290k0992
$$ 278788 180133 57013 -43368 -34414 -27585 -88871 -120351 -52007 -73923 -82809 -59519 -80511
22669h0511O7297J5471p4573l1055O0774M1627p1878p9144L3536L0682J7265O4688
$$ -80511 -13214 2257 -72316 -103371 -42597 -970 -72848 -151992 -118456 -87774 -70509 -5821
22657e821n1512j4741j6155n6713J02066J59942J46410k4235p2572l6013R8907
$$ -5821 -57333 -72074 -88229 -144942 -42876 117066 263476 239241 166669 130656 229563
22646B29563j1062j14423j25732K1785o3074r9497K3757m473P6908j4525M1885
$$ 229563 218501 104078 -21654 131 -62943 -162440 -138683 -143156 -66248 -80773 -38888
22635c8888J21360R8479j20107j54678J18488K5841J07326p7566M4328j7241O4341
$$ -38888 82472 180951 60844 -93834 24654 50495 157821 80255 124583 107342 171683
22624A71683j9915p2277k9206Q253r2037j67771n2806P9200Q3104J36336R4566
$$ 171683 151768 79491 50285 58538 -33499 -201270 -254076 -174876 -91772 44564 139130
22613A39130K652q4039o7310l0517M6317l1900J5593P9509q618n8634J9504j9927
$$ 139130 141782 57743 -9567 -40084 6233 -25667 -10074 69435 60817 2183 21687 1760
22601A760N941R971J0110j19870j11538O4658P2684K9733M4954k9300K2799p044
$$ 1760 7701 17672 27782 -92088 -203626 -138968 -66284 -36551 8403 -20897 1902 -5142
22589e142J19317N9972K5130L1778n0771j14804j5538j3201j17916J4389p355
$$ -5142 114175 174147 199277 231055 180284 65480 49942 36741 -81175 -66786 -74141
22578g4141o0875j9585J7886m0423j9439N3647R5190M4144q9456K7157O8080J61957
$$ -74141 -135016 -154601 -136715 -177138 -196577 -142930 -47740 -3596 -93052 -65895 2185 164142
22566A64142Q3618j2283m0862J8568K6685p1521p7512q2570K1388p7657L7586
$$ 164142 247760 235477 194615 213183 239868 168347 90835 8265 29653 -48004 -10418
22555a0418L2029M60J29573K9518n838m3159j0000m4872p7721j8511R1515M9367
$$ -10418 21611 22071 151644 181162 175324 132165 122165 77293 -428 -18939 72576 121943
22543A21943o6907o2018P5357L2978K3664l8769j1974r7631r3632P4766K3834
$$ 121943 55036 -6982 68375 101353 125017 86248 74274 -23357 -116989 -42223 -18389
22532a8389J2155P7602Q1034j0951o8129o3117k1258j1664L9589L9568o8022L9612
$$ -18389 -6234 71368 152402 141451 73322 10205 -11053 -22717 16872 56440 -11582 28030
22520B8030J18055j7459j28587n8930n2021l5429P1487O0932J9022N94m5773r3415
$$ 28030 146085 128626 39 -58891 -110912 -146341 -74854 -13922 5100 5694 -40079 -133494
22508a33494N712K5578K1468N2607L3652P274N4941O9995m0614J14061r1950m6314
$$ -133494 -127782 -102204 -80736 -28129 5523 12797 67738 137733 97119 211180 119230 72916
22496G2916m1468k667L2353q530l4171J540j796q3459M2532K163r150M3596P3048
$$ 72916 31448 28781 61134 52604 18433 19973 18177 -65282 -22750 -20587 -29737 13859 86907
22483H6907m0563O1816N0263K1822j22014l5969j1796m7147l7232k8561k9044
$$ 86907 46344 108160 158423 180245 58231 22262 10466 -36681 -73913 -102474 -131518
22472a31518l4517N8344L8066K1185j7692M0803O1200m1062K0775R4937m1572
$$ -131518 -166035 -107691 -69625 -48440 -66132 -25329 35871 -5191 15584 110521 68949
22461F8949j42556l1008Q9800j0140o8355P1309m1112J9859Q0079K2766r8660
$$ 68949 -73607 -104615 -14815 -24955 -93310 -22001 -63113 -43254 36825 59591 -39069
22450c9069m169q2470K4139l6897K7361M6112J65677L6427K1740m3066L7207K459
$$ -39069 -43238 -125708 -101569 -138466 -111105 -64993 100684 137111 158851 115785 152992 155451
22438A55451j22151n3449k7014o9299o405p461M1470N255p6747o4045Q555K3547
$$ 155451 33300 -20149 -47163 -116462 -122867 -130328 -88858 -83603 -160350 -224395 -215840 -192293
22426a92293J9902J07468O218J11125l061L175M7650J824j228k5412j8222J4346
$$ -192293 -172391 -64923 -58705 52420 49359 52534 100184 102008 100780 75368 57146 71492
22414G1492j925j10097J4402Q5532J03545m6938k6256M3367n4481q6866q7740
$$ 71492 69567 -40530 -26128 59404 162949 116011 89755 133122 78641 -8225 -95965
22403i5965O8481J40480m3304m9735J486k4422O1556O0015l2529j68932P3102
$$ -95965 -27484 112996 69692 19957 21443 -2979 58577 118592 86063 -82869 -9767
22392i767O2050p0804M9750k3451q4003o9637K705Q9495J27778O4840p5340K4416
$$ -9767 52283 -18521 31229 7778 -76225 -145862 -143157 -53662 74116 138956 63616 88032
22380H8032m2441q0136N5509O3186q3619p2552N406L1178M7712J5455k8710n116
$$ 88032 45591 -34545 20964 84150 531 -72021 -66615 -35437 12275 27730 -980 -6096
22368f096j00210q4574K0908N092L4578J74807K5360r1519K1585J02853L3236
$$ -6096 -106306 -190880 -169972 -164880 -130302 44505 69865 -21654 -69 102784 136020
22357A36020n2158k2765J6551k0287n6887p5970j9817L1728P4885q2684p0880
$$ 136020 83862 61097 77648 57361 474 -75496 -95313 -63585 11300 -71384 -142264
22346a42264m5666J19551M6089K8216P5472l8046m5493l4251q3379M4069o4811
$$ -142264 -187930 -68379 -22290 5926 81398 43352 -2141 -36392 -119771 -75702 -140513
22335a40513M8681L1351L8654N3201l7528l9192O9602J13432o4841q6051n0517
$$ -140513 -91832 -60481 -21827 31374 -6154 -45346 24256 137688 72847 -13204 -63721
22324f3721l5758k9540J2864R2658K3735L779Q240L8049l3330k8937m6224l3589
$$ -63721 -99479 -129019 -116155 -23497 238 4017 12257 50306 16976 -11961 -58185 -91774
22312i1774K254l8153L3056P2627N0396l5654J7702q3825l0408L777P4776Q7101
$$ -91774 -89520 -127673 -94617 -21990 28406 -7248 10454 -73371 -103779 -100002 -25226 61875
22300F1875J2781r6454M6480n1254j35659J9341O994L3620O4485M1870L5161l6246
$$ 61875 74656 -21798 24682 -26572 -162231 -142890 -135896 -102276 -37791 4079 39240 2994
22288B994L8081P1046L5377m0915k7097K0211j10796L5191Q986N921P0893r8663
$$ 2994 41075 112121 147498 106583 79486 99697 -11099 24092 33078 38999 109892 11229
22276A1229l6100p2712j77516Q4177K2550K4727O5194Q6607J5023o7323n5113
$$ 11229 -24871 -97583 -275099 -190922 -168372 -143645 -78451 8156 23179 -44144 -99257
22265i9257J763L8967o9285j8885R9209R0043k6538o4681k5155j2989j8204N4772
$$ -99257 -97494 -58527 -127812 -146697 -47488 42555 16017 -48664 -73819 -86808 -105012 -50240
22253e0240l2239P8188J8817O086J8455N2753k0758l7549P7491N8542o4739J0291
$$ -50240 -82479 -4291 14526 20612 39067 91820 71062 33513 111004 169546 104807 115098
22241A15098L6212K8156k4635N9765l6419j54837o4750K0280M8044m7195n7379
$$ 115098 151310 179466 154831 214596 178177 23340 -41410 -21130 26914 -20281 -77660
22230g7660l9098k1136L2232K7036P7326J6803L2152K8527j3053p8057l9911k7966
$$ -77660 -116758 -137894 -105662 -78626 -1300 15503 47655 76182 63129 -14928 -54839 -82805
22218h2805K7092J3990o6034R8664Q5945l4061P4994k8863j91874O1677Q7553
$$ -82805 -55713 -41723 -107757 -9093 76852 42791 117785 88922 -102952 -41275 46278
22207D6278O0323j09942K591l363J775K2973p9359J1641Q601P1334O3367m0440
$$ 46278 106601 -3341 -750 -4113 -2338 20635 -58724 -47083 -38482 32852 96219 55779
22195E5779p8779l597J468q88p8348p0625J0844M3611O407K6622j24548N4071
$$ 55779 -23000 -26597 -25129 -26017 -104365 -174990 -164146 -120535 -114128 -87506 -212054 -157983
22183a57983M4176l0086J8406L2341m0638J2376N9900p8306l5666J5318R959j0870
$$ -157983 -113807 -143893 -125487 -93146 -133784 -121408 -61508 -139814 -175480 -160162 -150203 -161073
22171a61073J6619P3967N4685J02963m6690m0335L057p2170j6590k6154O6723
$$ -161073 -144454 -70487 -15802 87161 40471 136 3193 -68977 -85567 -111721 -44998
22160d4998Q7088k386n5256j24965J4936J12839P1076m6826l7670o1668M8720
$$ -44998 42090 39704 -15552 -140517 -125581 -12742 58334 11508 -26162 -87830 -39110
22149c9110l7044p4144P9100P4354n82k8326l3461K0990o290l5432j7698Q317
$$ -39110 -76154 -150298 -71198 3156 2574 -25752 -59213 -38223 -44513 -79945 -97643 -89326
22137h9326M6323N9639M8717j5221j5700N785k0710l7465o5750O9911k7461p9145
$$ -89326 -43003 16636 65353 50132 34432 40217 19507 -17958 -83708 -13797 -41258 -120403
22125a20403j7884K9836M8100P9924M7364K2570n7957k4166k3041Q582K4243R0660
$$ -120403 -138287 -108451 -60351 19573 66937 89507 31550 7384 -15657 -7075 17168 107828
22113A07828j0916j55464n2276K9984P8439Q0710K0938o3777m623n7900m3054
$$ 107828 96912 -58552 -110828 -80844 -2405 78305 99243 35466 30843 -27057 -70111
22102g0111K2884q9184j1690k6866M1167p7248L6812j7448o5452N7821J09627
$$ -70111 -47227 -136411 -148101 -174967 -133800 -211048 -174236 -191684 -257136 -199315 -89688
22091h9688P1566j16049j24006R5039R0076P8909j7597k7252J08576Q3793o3664
$$ -89688 -18122 -134171 -258177 -163138 -73062 5847 -11750 -39002 69574 153367 89703
22080H9703j00772O0596k7968j10742K0388N2089m1267m8355o1277q2880J20575
$$ 89703 -11069 49527 21559 -89183 -68795 -16706 -57973 -106328 -167605 -250485 -129910
22069a29910j179K537k0827J2612N0223O5566n2405n6753M1853O4454L6955K2031
$$ -129910 -131089 -128552 -149379 -136767 -86544 -20978 -73383 -130136 -88283 -23829 13126 35157
22057C5157j15629j13900P1269K5964j8541L2122Q2181M2555m0534n1174m5813
$$ 35157 -80472 -194372 -123103 -97139 -115680 -83558 -1377 41178 644 -50530 -96343
22046i6343n91Q8762L8342k9361M9391L8487K17n0270m6801p1060r3276R8557
$$ -96343 -96934 -8172 30170 809 50200 88687 88904 38634 -8167 -79227 -172503 -73946
22034g3946O9743j1237j08918p4500N9789J78116k7433j66655j57675J64266Q8065
$$ -73946 -4203 -15440 -124358 -198858 -139069 39047 11614 -155041 -312716 -148450 -60385
22023f0385N4463M6677J0241o7866k1698k3854L809K1991n9039N0358K2910P294
$$ -60385 -5922 40755 50996 -16870 -38568 -62422 -58613 -36622 -95661 -45303 -22393 -15099
22011a5099l0642p1660M8974R6122K11699K964o0196o4338m3471n1979r461M6725
$$ -15099 -45741 -117401 -68427 27695 239394 242358 182162 117824 74353 22374 12913 59638
21999E9638N6264K4166l4486l9724N0788J6554J1150l9948K0634N3990m5145n1757
$$ 59638 115902 140068 105582 65858 116646 133200 144350 104402 125036 179026 133881 82124
21987H2124K361m5655n6777L7384P513j0427r6883k0590O6812N927O595Q2392
$$ 82124 84485 38830 -17947 19437 26950 16523 -80360 -100950 -34138 -28211 -21616 60776
21975F0776L8477j42230l7334L3021K2670J6351M6713P6315k2893j3340K8206
$$ 60776 99253 -42977 -80311 -47290 -24620 -8269 38444 114759 91866 78526 106732
21964A06732M4049k9761n172L2162Q391O6156m442m7783p1843l7211m9286K3618
$$ 106732 150781 121020 115848 148010 156401 222557 218115 170332 98489 61278 11992 35610
21952C5610j21049j1692o5993K2301M7153P1363p960N1747O9781n9768m9404L9454
$$ 35610 -85439 -97131 -163124 -140823 -93670 -22307 -30267 21480 91261 31493 -17911 21543
21940B1543j0369M4306q254j10138N7484J43518O038j06842q9890r5397L6406
$$ 21543 11174 55480 47226 -62912 -5428 138090 144128 37286 -52604 -148001 -111595
21929a11595m4497l6843j1675p127K4670P4456L0609j2299o3465O4037k0381n2955
$$ -111595 -156092 -192935 -204610 -211737 -187067 -112611 -82002 -94301 -157766 -93729 -114110 -167065
21917a67065P5157o107M9001L4785p9782j5338M3151L1089K5150l1916k0551Q0521
$$ -167065 -91908 -98015 -49014 -14229 -94011 -109349 -66198 -35109 -9959 -41875 -62426 18095
21905A8095p4223k6951K2988l6815j1992k0518M4434o0633J8357P5743J10695
$$ 18095 -56128 -83079 -60091 -96906 -108898 -129416 -84982 -145615 -127258 -51515 59180
21894E9180L964q3297l2044p927M376M2698R1804q6184j2617O8796K9726K6143
$$ 59180 63144 -20153 -52197 -60124 -55748 -13050 78754 -7430 -20047 48749 78475 104618
21882A04618l8116q0439L9899L255N4164k6680j10815j05575J04169m6477L499
$$ 104618 66502 -13937 25962 29217 83381 56701 -54114 -159689 -55520 -101997 -98498
21871i8498P6482M0910l7708j00875j7802K941J5247l9106p15J60952N1360j02835
$$ -98498 -22016 18894 -18814 -119689 -137491 -134550 -119303 -158409 -159124 1828 53188 -49647
21859d9647R5028R200o1148P3566p892q6277l3463K0821O2194J3636M1885J5462
$$ -49647 45381 54581 -6567 66999 59107 -27170 -60633 -39812 22382 36018 77903 93365
21847I3365L1095l7083q6864k14173j8745J32310O3427l0704Q225q412k6421j7977
$$ 93365 124460 87377 513 -213660 -232405 -100095 -36668 -67372 -59147 -67559 -93980 -111957
21835a11957Q0493J5675j34948j4675M6820L3493k3030N5257N849q4683M8449
$$ -111957 -31464 -15789 -150737 -165412 -118592 -85099 -108129 -52872 -47023 -131706 -83257
21824h3257J38734k7894j66061q3539M9885N2322J6963j0913j1759k0219j33151
$$ -83257 55477 27583 -138478 -222017 -172132 -119810 -102847 -113760 -125519 -145738 -278889
21813b78889K0653P7705j9059Q2633J10438P238o0535L4441M7118N5051n8312
$$ -278889 -258236 -180531 -199590 -116957 -6519 719 -59816 -25375 21743 76794 18482
21802A8482j11476L7469l4242Q8112L1318L5743J7833j71203K9698J1324N3453
$$ 18482 -92994 -55525 -89767 -1655 29663 65406 83239 -87964 -58266 -46942 6511
21791F511K1516p0233R9787K4771l1784J11381j2454o1682k8162p76q1342q8307
$$ 6511 28027 -42206 57581 82352 50568 161949 149495 87813 59651 58875 -22467 -110774
21779a10774l0918J46774J3920P7222j8644o4262q3618R5480O1179k2432o1368
$$ -110774 -141692 5082 19002 96224 77580 13318 -70300 25180 86359 63927 2559
21768B559q856R1489j10981m6243J1141N2644J37554j2828n8017q744K189K751
$$ 2559 -6297 85192 -25789 -72032 -60891 -8247 129307 116479 58462 49718 51907 54658
21756E4658L8090J8460L04n6737K3652O1287m4785Q7272M2398J9352j18420n5228
$$ 54658 92748 111208 111512 54775 78427 139714 94929 182201 224599 243951 125531 70303
21744G0303q2938n1043p2730m1958J34097Q9711J8507o4529j43798p721K10437
$$ 70303 -12635 -63678 -136408 -178366 -44269 45442 63949 -580 -144378 -152099 58338
21733E8338O3699k08958r3389J22938Q2655K9949r802o9450K2620J79843P1788
$$ 58338 122037 -86921 -180310 -57372 25283 55232 45430 -24020 -1400 178443 250231
21722B50231k0081o992p0674q4847j9953q159Q7974k3913q4704K6325j0509q9159
$$ 250231 230150 223158 152484 67637 47684 39525 127499 103586 18882 45207 34698 -54461
21710e4461m0013N9380J01150R1482l5326q9308j827j0207L77J12207M6822j24576
$$ -54461 -94474 -35094 66056 157538 122212 32904 31077 20870 21247 133454 180276 55700
21698E5700r8359n0241L2114r7629K8907J43964M0284P796j0109m4078j01501
$$ 55700 -42659 -92900 -60786 -158415 -129508 14456 54740 62536 52427 8349 -93152
21687i3152K049M7953J1172L5165o1086J4582J27095m3080j55484l8274j8450
$$ -93152 -91103 -43150 -31978 3187 -57899 -43317 83778 40698 -114786 -153060 -171510
21676a71510J43395k8275j6710j8735O05L6770J0075o8794P5299J06518J00752
$$ -171510 -28115 -56390 -73100 -91835 -91230 -54460 -44385 -113179 -37880 68638 169390
21665A69390L3267o9421j01958m0015j35698l2196J45715P1367o0481j10767P2339
$$ 169390 202657 133236 31278 -8737 -144435 -176631 -30916 40451 -20030 -130797 -58458
21654e8458j180k8699O3886J7597p0125j52306m539J26431P0451K7331o1279m8937
$$ -58458 -59638 -88337 -24451 -6854 -76979 -229285 -233824 -107393 -36942 -9611 -70890 -119827
21642a19827j2727J8276M5103N3311N0497L4965J58684p0581j38626l7467P1296
$$ -119827 -132554 -114278 -69175 -15864 34633 69598 228282 157701 19075 -18392 52904
21631E2904N8018L0077N0376m3670j28638l1568M6876J3099N2582n9643j06762
$$ 52904 110922 140999 191375 147705 19067 -12501 34375 47474 100056 40413 -66349
21620f6349M1142r0139N144M6159L2029J11352j5507m7456M8344k487n2611Q0014
$$ -66349 -25207 -115346 -110202 -64043 -32014 79338 63831 16375 64719 62232 9621 89635
21608H9635L7462p9182k3303n2242l4354j12628R1573J64719M2082n8065p0593
$$ 89635 127097 47915 24612 -27630 -61984 -174612 -83039 81680 123762 65697 -4896
21597d896K3420Q4931o9867k6838J20613L6594j45964r2813j16683P4583P3899
$$ -4896 18524 103455 33588 6750 127363 163957 17993 -74820 -191503 -116920 -43021
21586d3021M3742r1256L9278o4690M1769P3833l7700R2128J10298m1361j45362
$$ -43021 721 -90535 -51257 -115947 -74178 -345 -38045 54083 164381 123020 -22342
21575b2342j7393Q2607k6729m7899N7547k0209J13004L1960q3645q4076K6594
$$ -22342 -39735 42872 16143 -31756 25791 5582 118586 150546 66901 -17175 9419
21564I419N3073l5187j8213J5848L3737J1580l1242o0721L5652M0301O4542J5913
$$ 9419 62492 27305 9092 24940 58677 70257 39015 -21706 13946 54247 118789 134702
21552A34702O6120R8058q8047o8704j4378l2218o8642q3845k5406K0595n3466
$$ 134702 200822 298880 210833 142129 127751 95533 26891 -56954 -82360 -61765 -115231
21541a15231k2833M9344r251O0540N6247q268P4775P6303k1077P2879J0986j06372
$$ -115231 -138064 -88720 -97971 -37431 18816 10548 85323 161626 140549 213428 224414 118042
21529A18042n0751l8183j5336P075M8749L0535L9147o3335m4273k6050m7808q6408
$$ 118042 67291 29108 13772 20847 69596 100131 139278 75943 31670 5620 -42188 -128596
21517a28596M2Q2082J40707o083O8553L1070p5201q0825k6154P1196l6829J1893
$$ -128596 -128554 -46472 94235 88152 156705 187775 112574 31749 5595 76791 39962 51855
21505E1855j4339L5085O9661J64750p5493j03968n5838j9690J62499J28736n5447
$$ 51855 37516 72601 142262 307012 231519 127551 71713 52023 214522 343258 287811
21494B87811J6496k0877m1407L159o6396m4846P82M9184m1401l4464J6277n8731
$$ 287811 304307 283430 242023 245182 178786 133940 134722 183906 142505 108041 124318 65587
21482F5587r7819P9985o509K4224r7411M9246Q4394m3906l1886p7549J3556P3267
$$ 65587 -32232 47753 41244 65468 -31943 17303 101697 57791 25905 -51644 -38088 35179
21470C5179P0261l0126o9424k9414O2058L3526j0011O391K3248p0864q1961J03240
$$ 35179 105440 75314 5890 -23524 38534 72060 62049 68440 91688 20824 -61137 42103
21458D2103m0333p1N2898m0627L0884p628q8470l734J32615n9755r2550k1332
$$ 42103 1770 1699 54597 13970 44854 37226 -51244 -54978 77637 17882 -74668 -96000
21446i6000N9521N5750K3296k0106j3223j04921K6863j5704M6840L0682L3166
$$ -96000 -36479 19271 42567 22461 9238 -95683 -68820 -84524 -37684 -7002 26164
21435B6164M0873o7491o3431j2618K6080J481j6859R400o761N5752J69871K1202
$$ 26164 67037 -454 -63885 -76503 -50423 -48942 -65801 -56401 -63162 -7410 162461 183663
21423A83663j09541L8535K1959n2180n9637K7109r4485k8091M9553r961n6048
$$ 183663 74122 112657 134616 82436 22799 49908 -44577 -72668 -23115 -33076 -89124
21412h9124j3374J7184l9154L5930j1845L3860J9716m2492N208K4540J47083J41805
$$ -89124 -102498 -85314 -124468 -88538 -100383 -66523 -46807 -89299 -84091 -59551 87532 229337
21400B29337n5454j76816j46833k9029k8033M8620M8074k7200J4295Q5954o2733
$$ 229337 173883 -2933 -149766 -178795 -206828 -158208 -110134 -137334 -123039 -37085 -99818
21389i9818r552J01448o2416P4301J01047m4269j23584k0343K367p7888j090P384
$$ -99818 -109370 -7922 -70338 3963 105010 60741 -62843 -83186 -80819 -158707 -159797 -152413
21377a52413J41259J13507k6649r7139K4988l2704j3245j9523J16114j4977r2050
$$ -152413 -11154 102353 75704 -21435 3553 -29151 -42396 -61919 54195 39218 -52832
21366e2832p6309j8370k2079Q6315J07554j1887J0691J9928O3926j9653m6051
$$ -52832 -129141 -147511 -169590 -83275 24279 12392 23083 43011 106937 87284 41233
21355D1233q8441j29255L9683K1178N3710J2930N5477M5199p0299n6138K5659
$$ 41233 -47208 -176463 -136780 -115602 -61892 -48962 6515 51714 -18585 -74723 -49064
21344d9064M7637L5197k7329j22978m3079o1799J22330j0187n6601J1458N9174
$$ -49064 -1427 33770 6441 -116537 -159616 -221415 -99085 -109272 -165873 -154415 -95241
21333i5241Q7228L2097q4768M4214J22627N2137p6890j51103M7390L4719q6975
$$ -95241 -8013 24084 -60684 -16470 106157 158294 81404 -69699 -22309 12410 -74565
21322g4565k1397O3281M7713k9993O322k6814M616J15736N3280M2381q0338j08014
$$ -74565 -95962 -32681 15032 -14961 -8639 -35453 -30837 84899 138179 180560 100222 -7792
21310g792l2438j18435p5369P5584N4839L525J2860K5143J5769P0129J4179n9583
$$ -7792 -40230 -158665 -234034 -158450 -103611 -100086 -87226 -62083 -46314 23815 37994 -21589
21298b1589n4123M5514m0409L6774M6946K6005j03725j8575J3146N1023M7837
$$ -21589 -75712 -30198 -70607 -33833 13113 39118 -64607 -83182 -70036 -19013 28824
21287B8824l2630m861L6581o253o139r021J811P6614j884K4499k0625m7347l7813
$$ 28824 -3806 -8667 27914 21661 15522 6501 8312 84926 83042 107541 86916 39569 1756
21274A756j14234n2430Q6610l1785L7567L5435J0890p167J1757L8920J7399p4468
$$ 1756 -112478 -164908 -78298 -110083 -72516 -37081 -26191 -33358 -21601 17319 34718 -39750
21262c9750j2414L7560K1828R131q2874k1971J62696L6408K0907m7658q5206p2900
$$ -39750 -52164 -14604 7224 16355 -66519 -88490 74206 110614 131521 83863 -1343 -74243
21250g4243J09320O574m961N4792M6447l9050o6743M5118l014q302n3202J5340
$$ -74243 35077 41651 36690 91482 137929 98879 32136 77254 74240 65938 12736 28076
21238B8076J9475q121j35213l8721K3424p878O9748O1203N8584M4939J4200m6622
$$ 28076 47551 39430 -95783 -134504 -111080 -118958 -49210 11993 70577 115516 129716 83094
21226H3094p9769Q0642m1603o1552o1676j2688Q40J09214r6635p8358K1906N5395
$$ 83094 3325 83967 42364 -19188 -80864 -93552 -92712 16502 -80133 -158491 -136585 -81190
21214h1190R514j13012J49423n099r8235M545k4010m4772j047R4672L0431N7595
$$ -81190 -71676 -184688 -35265 -40364 -138599 -134054 -158064 -202836 -203883 -109211 -78780 -21185
21202b1185P610j2409r3749k3579M0835M3494O7904R991k4114n6186j6488k4636
$$ -21185 -13575 -25984 -119733 -143312 -102477 -58983 8921 18912 -5202 -61388 -77876 -102512
21190a02512j02429J14596O9083n7263p9482m2644P9566L5914k301R9206L4586
$$ -102512 -204941 -90345 -21262 -78525 -158007 -200651 -121085 -85171 -87472 11734 46320
21179D6320n8260k3789m9258Q5229M781Q6733r049k57038o3396O7663J0J11187
$$ 46320 -11940 -35729 -84987 242 5023 91756 82707 -174331 -237727 -170064 -170054 -58867
21167e8867J12626P3336j50708l1772O8030j19859r0729P4899Q476n4136j09960
$$ -58867 53759 127095 -23613 -55385 12645 -107214 -197943 -123044 -114568 -168704 -278664
21156b78664M6080Q9064J03509L8874N4085K4885n715j27466q6210N401M2372
$$ -278664 -232584 -143520 -40011 -1137 52948 77833 72118 -55348 -141558 -136157 -93785
21145i3785m1715o1611j1576Q507Q7729J03373o066l0457P4582O1974J0289j3475
$$ -93785 -135500 -197111 -208687 -200180 -112451 -9078 -15144 -45601 28981 90955 101244 87769
21133H7769J8939L3475O2422p1564m5022K9495o5503j1752O2599l7173q2474r5532
$$ 87769 106708 140183 202605 131041 86019 115514 50011 38259 100858 63685 -18789 -114321
21121a14321l0516N2750O7060N4933M1874j1553L3257j45235q8259L465q5553
$$ -114321 -144837 -92087 -25027 29906 71780 60227 93484 -51751 -140010 -136545 -222098
21110b22098N4710P5000J5651r9536K8525R8986P4177q2281l9042R3549k3169
$$ -222098 -167388 -92388 -76737 -176273 -147748 -48762 25415 -56866 -95908 -2359 -25528
21099b5528r0004L0893P5972l2858n5803R4059N4670m2786k9365J0815r8051J0724
$$ -25528 -115532 -84639 -8667 -41525 -97328 -3269 51401 8615 -20750 -9935 -107986 -97262
21087i7262J4378j2264J34409J5766l762M322N7028j04318l7086L6688L4854l3727
$$ -97262 -82884 -95148 39261 55027 51265 55587 112615 8297 -28789 7899 42753 9026
21075I026m5649l7740K8958l1722Q0128L286J5728J9174L7023n785m6664M3170
$$ 9026 -36623 -74363 -45405 -77127 3001 6287 22015 41189 78212 72427 25763 68933
21063F8933R1420M9882l3627n9788n6133j08063L2305k4048L3094K8595L673M985
$$ 68933 160353 210235 176608 116820 60687 -47376 -15071 -39119 -6025 22570 26243 31228
21051C1228q9161j783R0095Q5080O9476m365n7880o7590p5599O7920O3765O2190
$$ 31228 -57933 -59716 30379 115459 184935 180570 122690 55100 -20499 47421 111186 173376
21039A73376j6453o2151l2651p3139L9031O145l313j3890O0515k403Q625p1668
$$ 173376 156923 94772 62121 -11018 28013 34158 30845 16955 77470 75067 83692 12024
21027A2024L3462p2614o8568J40592J0140j23391j01056N0268o600N2739R0963
$$ 12024 45486 -27128 -95696 44896 55036 -68355 -169411 -119143 -125743 -73004 17959
21016A7959J09400k7601q3469m9803J00294k6539J3187l8671j01192J1849J7174
$$ 17959 127359 99758 16289 -33514 66780 40241 53428 14757 -86435 -74586 -57412
21005e7412o7337k9544o5070L9805O4127J1139J01806P373J133k5523J6633R4275
$$ -57412 -124749 -154293 -219363 -179558 -115431 -104292 -2486 4887 6020 -19503 -2870 91405
20993I1405L1273j25176q2268N0535o7659k3561J00586R0001m0984R512R6063
$$ 91405 122678 -2498 -84766 -34231 -101890 -125451 -24865 65136 24152 33664 129727
20982A29727L5060j7053j31740n9864L0807n9253j4542O6145J43070m4515q8727
$$ 129727 164787 147734 15994 -43870 -13063 -72316 -86858 -20713 122357 77842 -10885
20971a0885n4403L5429j9638K9532P9202m9640l7795M1224k0291K5454o6596n9206
$$ -10885 -65288 -29859 -49497 -19965 59237 9597 -28198 13026 -7265 18189 -48407 -107613
20959a07613P2747L9413M4577K9881p7344n6369l4116l4932l0281N4445M4312
$$ -107613 -34866 4547 49124 79005 1661 -54708 -88824 -123756 -154037 -99592 -55280
20948e5280k8699N8619k1185J9613L4822o3082o6758J09687J24515k742r4656
$$ -55280 -83979 -25360 -46545 -26932 7890 -55192 -121950 -12263 112252 109510 14854
20937A4854Q489M7028J25515N962n9017J7575j02576j22270J9737O1291Q7916
$$ 14854 23343 70371 195886 201848 142831 160406 57830 -64440 -44703 16588 104504
20926A04504m605r6874l1016K843K1326M3534N7995m7405J06026O9480q1050j60199
$$ 104504 99899 3025 -27991 -25148 -3822 39712 97707 50302 156328 225808 144758 -15441
20914a5441r5011K0093M5227j5167J4016l8667q5377L9229J2857R2377Q7153j13047
$$ -15441 -110452 -90359 -45132 -60299 -46283 -84950 -170327 -131098 -118241 -25864 61289 -51758
20902e1758R6970Q5350j90442j72720q448P4362J06743p5072n7438O8117N4043
$$ -51758 45212 130562 -59880 -232600 -241048 -166686 -59943 -135015 -192453 -124336 -70293
20891g0293R3635n8263j03505N8186k8504m5256R8187j9983K388j0961K6434q3795
$$ -70293 23342 -34921 -138426 -80240 -108744 -154000 -55813 -75796 -73408 -84369 -57935 -141730
20879a41730P2836j9629K9580O4681r432l2732j8415O2753j2591o1252j9189N273
$$ -141730 -68894 -88523 -58943 5738 -3694 -36426 -54841 7912 -4679 -65931 -85120 -79847
20867g9847L6670l0126j8045n2093M4167P3054n4933j29733M2004Q9958Q491J2730
$$ -79847 -43177 -73303 -91348 -143441 -99274 -26220 -81153 -210886 -168882 -78924 -70433 -57703
20855e7703J05309L4796r8920k9368J1460Q4543N1003m922M7692M5120k5020l4000
$$ -57703 47606 82402 -16518 -45886 -34426 50117 101120 96198 143890 189010 163990 129990
20843A29990o1332n4305J4475n28k5189m8450j1382l685L1167j2961Q3935P3634
$$ 129990 68658 14353 28828 28300 3111 -45339 -56721 -60406 -29239 -42200 41735 115369
20831A15369m619j38069m9780N2329J33037n1215k3196K5931j17646j4129P1070
$$ 115369 110750 -27319 -77099 -24770 108267 57052 33856 59787 -57859 -71988 -918
20820i18J565m0659Q8740O977j1315J4862m781k1134r4907P7774O0510k6945O651
$$ -918 647 -40012 48728 55705 44390 59252 54471 33337 -61570 16204 76714 49769 56420
20807E6420P6160N6928j25226j12633j7443N9718o230N9085k0011o3209M7884
$$ 56420 132580 189508 64282 -48351 -65794 -6076 -12306 46779 26768 -36441 11443
20796A1443O7832j5788R548o4739m2186O694M7475P6465l1558j05j2144J976M8721
$$ 11443 79275 63487 73035 8296 -33890 -27196 20279 96744 65186 65081 52937 54913 103634
20783A03634j43800j7894J02191J53182p0656o0315P0724J813j74093j18044L9824
$$ 103634 -40166 -58060 44131 197313 126657 66342 137066 138879 -35214 -153258 -113434
20772a13434P7978j6672p8656m2656p2664J44036L2353o6377p0049p0480j1019
$$ -113434 -35456 -52128 -130784 -173440 -246104 -102068 -69715 -136092 -206141 -276621 -287640
20761b87640j1499k1536J18163L8376k3869M0385K1603N2934J8650R1582K3976
$$ -287640 -299139 -320675 -202512 -164136 -188005 -147620 -126017 -73083 -54433 37149 61125
20750F1125P74p8291N2730j2677Q694k3464o0680J07119P4350n2516J9442M1973
$$ 61125 61899 -16392 36338 23661 32355 8891 -51789 55330 129680 77164 96606 138579
20738A38579n9101q5943j93092j03645K2704P2347L4110l4814L0371J1699N5387
$$ 138579 79478 -6465 -199557 -303202 -280498 -208151 -174041 -208855 -178484 -166785 -111398
20727a11398K5510N184K3683l9024K7457R1826j71562r1038o314J40116M4984
$$ -111398 -85888 -80704 -57021 -96045 -68588 23238 -148324 -239362 -245676 -105560 -60576
20716f0576j48785l5202K5403O8917N2964O9233M9935O9307J6753r738P8855l2578
$$ -60576 -209361 -244563 -219160 -150243 -97279 -28046 21889 91196 107949 98211 177066 144488
20704A44488m4132p8087J5680n8091r3923l2571O2224K4705O5879K6504K7314
$$ 144488 100356 22269 37949 -20142 -114065 -146636 -84412 -59707 6172 32676 59990
20693E9990n290l2607l8312n738j10368M575O5211P8421j8017j56882J07436Q4601
$$ 59990 54700 22093 -16219 -21957 -132325 -127750 -62539 15882 -2135 -159017 -51581 33020
20681C3020r3620j62946N4330R4904J08529J2425M404l122l8145m3759o8145M0269
$$ 33020 -60600 -223546 -169216 -74312 34217 46642 51046 47924 9779 -33980 -102125 -61856
20669f1856J9057j927M6521O2373N6110K964J5610j8133J4611q8176p1380o0525
$$ -61856 -42799 -44726 1795 64168 120278 123242 138852 120719 135330 47154 -24226 -84751
20657h4751r191J51029K5271q1682n1246J8646J2639P9065m3029q1384M9524M0723
$$ -84751 -93942 57087 82358 676 -50570 -31924 -19285 59780 16751 -64633 -15109 25614
20645B5614J2272p2094M994N5912N8932L6842l6923k0425j19091l8283k9771p7544
$$ 25614 37886 -34208 -29214 26698 85630 122472 85549 65124 -53967 -92250 -122021 -199565
20633a99565J8852K8894L5725j2610j2899R1806L4817n0036q3741j2179J9584
$$ -199565 -180713 -151819 -116094 -128704 -141603 -49797 -14980 -65016 -148757 -160936 -141352
20622a41352J3691o2413R5480j4130l1533q6399Q8603N2353L6387P1145J4407
$$ -141352 -127661 -190074 -94594 -108724 -140257 -226656 -138053 -85700 -49313 21832 36239
20611C6239M4201l38k9409q1161l2496M3099O0240m5139J7195r3845k7756J32894
$$ 36239 80440 80102 50693 -30468 -62964 -19865 40375 -4764 12431 -81414 -109170 23724
20599B3724R981j06796k3554N2540M7780P1386j3202O7148r6514r1568n3688M3950
$$ 23724 33705 -73091 -96645 -44105 3675 75061 61859 129007 32493 -59075 -112763 -68813
20587f8813l8327M2233q400j02544j9062O8758P2011q4405r2780M2974O9302L2162
$$ -68813 -107140 -64907 -73307 -175851 -194913 -126155 -54144 -138549 -231329 -188355 -119053 -86891
20575h6891J39750N8845J2283k3122r6344l4601o377o9917M1229J43684K8404
$$ -86891 52859 111704 123987 100865 4521 -30080 -36457 -106374 -65145 78539 106943
20564A06943k986K7798M4137K1254L002l2404Q7010J7559m9236p5022j28192k7801
$$ 106943 103957 131755 175892 197146 200148 167744 254754 272313 223077 148055 19863 -7938
20552g938P370q4146j8556M5685K4007L1099J33898O03o3633r4146J54925Q6331
$$ -7938 -568 -84714 -103270 -57585 -33578 -2479 131419 132022 68389 -25757 129168 215499
20540B15499l1979l9533r5514L2950M6779j35287m336k5692k8000J32494j759
$$ 215499 183520 143987 48473 81423 128202 -7085 -11421 -37113 -65113 67381 65622
20529F5622L6869Q6646O7448p3707j06598k7485o7460l8028n7928l3541L3703
$$ 65622 102491 189137 256585 182878 76280 48795 -18665 -56693 -114621 -148162 -114459
20518a14459N2094O8994K7571n8061j20316N2814P7785k7077Q8276j3275o3740
$$ -114459 -62365 6629 34200 -23861 -144177 -91363 -13578 -40655 47621 34346 -29394
20507b9394n2373J23558j230k4523j29597o2813R4913P4747l0650J5157k0249
$$ -29394 -81767 41791 40561 16038 -113559 -176372 -81459 -6712 -37362 -22205 -42454
20496d2454r8246n4407O999K7780l2149K4226Q2075K6521J31642k6503q3314j32740
$$ -42454 -140700 -195107 -188108 -160328 -192477 -168251 -86176 -59655 71987 45484 -37830 -170570
20484a70570o4023K2228P8686R1941k8518n6733L1100m0763j4377J27778j3106
$$ -170570 -234593 -212365 -133679 -41738 -70256 -126989 -95889 -136652 -151029 -23251 -36357
20473c6357l6227p0498j9630k3629J3802o9326O8567J17303O1778M9712O6222
$$ -36357 -72584 -143082 -162712 -186341 -172539 -241865 -173298 -55995 5783 55495 121717
20462A21717j37573m9341k5765j7075K7736M9998M4180l2712M3436m3646L6925
$$ 121717 -15856 -65197 -90962 -108037 -80301 -30303 13877 -18835 24601 -19045 17880
20451A7880L3213o2782L2245J2994P65K1205j1384j7678J2029r4695Q8075n3158
$$ 17880 51093 -11689 20556 33550 34315 55520 44136 26458 38487 -56208 31867 -21291
20439b1291k8972M3651J36993O453r8200l551j7255J8740J00008K4940o4204j12276
$$ -21291 -50263 -6612 130381 136834 38634 35083 17828 36568 136576 161516 97312 -14964
20427a4964n1136L9190J6007N0204M7246k911n4192q946k038L4041M4115K4247
$$ -14964 -66100 -26910 -10903 39301 86547 83636 29444 20498 18460 52501 96616 120863
20415A20863N4376K6281k1421n5792o0741n4521q4190J01386O5745j746j38279
$$ 120863 175239 201520 180099 124307 63566 9045 -75145 26241 91986 90240 -48039
20404d8039L1821m882j2993J21673j21402P9297L0243k413j45840O9467R5885
$$ -48039 -16218 -21100 -34093 87580 -33822 45475 75718 73305 -72535 -3068 92817
20393I2817k9163l9585q3908p9668o5797J07378O1834m2033O2151J72202J3780
$$ 92817 63654 24069 -59839 -139507 -205304 -97926 -36092 -78125 -15974 156228 170008
20382A70008p5090p6531j3739L8437n4384m1568l4805K0287n8460O4187O8281
$$ 170008 94918 18387 4648 43085 -11299 -52867 -87672 -67385 -125845 -61658 6623
20371F623j4216l7616R0645J6579k8323r1489j7654k40N8746J39516M7232m9596
$$ 6623 -7593 -45209 45436 62015 33692 -57797 -75451 -75691 -16945 122571 169803 120207
20359A20207l8428P1652j6326r9213k7336J5927k900l5527j9245L8561N2154r985
$$ 120207 81779 153431 137105 37892 10556 26483 23583 -11944 -31189 7372 59526 49541
20347D9541j19161j38963P1616k6152j0197m1434N5183L5444J61479J20087N6193
$$ 49541 -69620 -208583 -136967 -163119 -173316 -214750 -159567 -124123 37356 157443 213636
20336B13636q3799j32429n4104r671k9584j3998k999o1191N5567J01844l0339
$$ 213636 129837 -2592 -56696 -66367 -95951 -109949 -112948 -174139 -118572 -16728 -47067
20325d7067K7093J00724r4400l6393r9797l6080m0597N9403N6443J7047J295J03208
$$ -47067 -19974 80750 -13650 -50043 -149840 -185920 -226517 -167114 -110671 -93624 -92329 10879
20313A0879J58950k7635k1093p1861j7628L4946j3890j0177k930m3844p4585r8957
$$ 10879 169829 142194 121101 49240 31612 66558 52668 42491 39561 -4283 -78868 -177825
20301a77825R0925L2790J5383M5539Q535K4279j51040j3050M8308J5052k1114
$$ -177825 -86900 -54110 -38727 6812 15347 39626 -111414 -124464 -76156 -61104 -82218
20290h2218n7419l8586m6248R596j7170R971J17591Q4390k2169M3434N67o8518
$$ -82218 -139637 -178223 -224471 -214875 -232045 -222074 -104483 -20093 -42262 1172 1739 -66779
20278f6779o5915J4616l2832k3042P6916R3685p9103m491l7712l5859o539p45
$$ -66779 -132694 -118078 -150910 -173952 -97036 -3351 -82454 -86945 -124657 -160516 -167055 -167800
20266a67800J33369L1984M8295R2124N008N4861l2694j03802n5312q7134p5933
$$ -167800 -34431 -2447 45848 137972 142980 197841 165147 61345 6033 -81101 -157034
20255a57034K4408J33562J08411r0282o9246m4213L7797K8638J22781P0163l2236
$$ -157034 -132626 936 109347 19065 -50181 -94394 -56597 -27959 94822 164985 132749
20244A32749n8195q5878P598J20979m8266j08791m3377L4298P7945M547K3300
$$ 132749 74554 -11324 -3726 117253 68987 -39804 -83181 -48883 29062 33609 56909
20233E6909j5742j4740R2422l6594m6975N5181k9296p1797M4811o9445n0265q3000
$$ 56909 41167 26427 118849 82255 35280 90461 61165 -10632 34179 -35266 -85531 -168531
20221a68531L846J74364k4193L0290K1972N835j9391P361n8781o063l8441k2222
$$ -168531 -164685 9679 -14514 15776 37748 43583 24192 31553 -27228 -33291 -71732 -93954
20209i3954K8405R0013Q4324m3981p7380M8094k9801k4445q9158m9023k2537J16445
$$ -93954 -65549 24464 108788 64807 -12573 35521 5720 -18725 -107883 -156906 -179443 -62998
20197f2998R4819o4790l3368k9441J34248R0821q4330q8019N9064M4355Q4j25053
$$ -62998 31821 -32969 -66337 -95778 38470 129291 44961 -43058 16006 60361 60445 -64608
20185f4608r9575M8387K1097M7215M6638m3487J8934R6715J06778J8608l2467
$$ -64608 -164183 -115796 -94699 -47484 -846 -44333 -25399 71316 178094 196702 164235
20174A64235q7849j5653n4347n3601k9363R3952Q1934l7408j6615J03692j28531
$$ 164235 76386 60733 6386 -47215 -76578 17374 99308 61900 45285 148977 20446
20163B0446o6467M739j9094j3656J3357J06039N1092j6534o0367j54657P590O1095
$$ 20446 -46021 -41282 -60376 -74032 -60675 45364 96456 79922 19555 -135102 -127512 -66417
20151f6417K7417l5505m0289M7933O0370p165L9239O8917j2710L7481o1334j37539
$$ -66417 -39000 -74505 -114794 -66861 -6491 -13656 25583 94500 81790 119271 57937 -79602
20139g9602j5001J77496l7906k5923m2474N2309r693p5266j4166M8244K7531l4087
$$ -79602 -94603 82893 44987 19064 -23410 28899 19206 -56060 -70226 -21982 5549 -28538
20127b8538L884k9242J6091k4835p28K4704P5790m2852j29272L9016J33060L1792
$$ -28538 -24654 -53896 -37805 -62640 -63368 -38664 37126 -5726 -134998 -95982 37078 68870
20115F8870J06783o263J3242m9077r5600j03565l5499j9827O5654P6370l1315
$$ 68870 175653 169390 182632 133555 37955 -65610 -101109 -120936 -55282 21088 -10227
20104a0227p732p3461J8881J14693J2084j13101m7519Q5366J13533r2716O56p3054
$$ -10227 -17959 -91420 -72539 42154 54238 -58863 -106382 -21016 92517 -199 457 -72597
20092g2597k3508K0523J8863P4911R9949j5860K6977n4877j14489k7544J30744
$$ -72597 -96105 -75582 -56719 18192 118141 102281 129258 74381 -40108 -67652 63092
20081F3092l7226R3261K4173o5877k3318P0718j08070k2384R4587k1398n7831
$$ 63092 25866 119127 143300 77423 54105 124823 16753 -5631 88956 67558 9727
20070I727o4143J7295k0328l6358M7206p546n4252m573m5607M0055L8726Q234
$$ 9727 -54416 -37121 -57449 -93807 -46601 -54147 -108399 -112972 -158579 -118524 -79798 -71564
20058g1564Q5441n8088N741P5682p152l91K4663o3003M8353J6185j1620k2566
$$ -71564 13877 -44211 -38470 37212 30060 29669 54332 -8671 39682 55867 44247 21681
20046B1681M7513Q3266r5558p4189M0894j2635q6070l7970K2423j24161k3150
$$ 21681 69194 152460 56902 -17287 23607 10972 -75098 -113068 -90645 -214806 -237956
20035b37956J18978j798J23810M7743k3060m7218p8642O4496N3166M5447j05179
$$ -237956 -118978 -120776 3034 50777 27717 -19501 -98143 -33647 19519 64966 -40213
20024d0213j1846L7614L8617R5933J03229j6620j17474L6441M041J540r3337o3870
$$ -40213 -52059 -14445 24172 120105 223334 206714 89240 125681 129722 131262 37925 -25945
20012b5945N8869Q5635j16494p7409J8621O7373R3810K7451J9582m5820p3131
$$ -25945 32924 118559 2065 -75344 -56723 10650 104460 131911 151493 105673 32542
20001C2542P7768k5669O1080R5148o5351j62666l7310l9930n1050j873l4305J11424
$$ 32542 110310 84641 145721 240869 175518 12852 -24458 -64388 -115438 -117311 -151616 -40192
19989d0192L7052K2966j3082p095K9767k0386l9054k5141p587j13387j8251R0278
$$ -40192 -3140 19826 6744 -351 29416 9030 -30024 -55165 -62752 -176139 -194390 -104112
19977a04112k9496q0461o6855J36736R6819J3213L1152q5673p0755J2480P3159
$$ -104112 -133608 -214069 -280924 -144188 -47369 -34156 -3004 -88677 -159432 -146952 -73793
19966g3793Q620K3949j1566k5137l3540J16367R8170j0852r5085L5678K4892j32004
$$ -73793 -65173 -41224 -52790 -77927 -111467 4900 103070 92218 -2867 32811 57703 -74301
19954g4301L6559M5104q477j11309j9200M4302J9256n411K9614Q7486J08935Q7433
$$ -74301 -37742 7362 -1115 -112424 -131624 -87322 -68066 -73477 -43863 43623 152558 239991
19942B39991p5485j23859Q924M825k8003j2831Q4825O9079j19256m7813K0048
$$ 239991 164506 40647 49571 54396 26393 13562 98387 167466 48210 397 20445
19931B0445K2611L0301l2891j09428m7274n6910K6287O7828o63k482O021l2050
$$ 20445 43056 73357 40466 -68962 -116236 -173146 -146859 -79031 -79694 -82176 -76155 -108205
19919a08205J19416J13082j08294j33706O0062J41099K7533l464q3856k3105K4931
$$ -108205 11211 124293 15999 -117707 -57645 83454 110987 107523 23667 562 25493
19908B5493L7649Q7880K0828r6438o2369r0260j71033Q7318K5872n8764N2355
$$ 25493 63142 151022 171850 75412 13043 -77217 -248250 -160932 -135060 -193824 -141469
19897a41469k9171O0547r342N1212P812K8458L5480K4801k3576r0621m3871P3673
$$ -141469 -170640 -110093 -119435 -68223 -60411 -31953 3527 28328 4752 -85869 -129740 -56067
19885e6067j01545m1962M8681Q919J4526Q3524J10826K2016n6250j1149J303M6771
$$ -56067 -157612 -199574 -150893 -141974 -127448 -43924 66902 88918 32668 21519 22822 69593
19873F9593N5235j2014o4447j40077k5843m1455J83411p7867j01835j8988k0872
$$ 69593 124828 112814 48367 -91710 -117553 -159008 24403 -53464 -155299 -174287 -195159
19862a95159J1217N8125r3492N5322J43624j1365k388M2799P064J8174q2314O7651
$$ -195159 -183942 -125817 -219309 -163987 -20363 -31728 -34116 8683 15747 33921 -48393 19258
19850A9258J9278k027K4932j6515m2200k6942m4916m060l9018k4224k8287p082
$$ 19258 38536 36509 61441 44926 2726 -24216 -69132 -73192 -112210 -136434 -164721 -171803
19838a71803J11454R8963r5158r3467J5331L5991L3118m849J1169j1185L2258
$$ -171803 -60349 38614 -56544 -150011 -134680 -98689 -65571 -70420 -59251 -70436 -38178
19827c8178M7002n0350O981J07189n0574r9072j2237k4319J7694j03047K9316
$$ -38178 8824 -41526 -34545 72644 22070 -77002 -89239 -113558 -95864 -198911 -169595
19816a69595M1594K9427j1009N0569k8975j9979Q209p2684L6405J78235R7920
$$ -169595 -128001 -98574 -109583 -59014 -87989 -107968 -99759 -172443 -136038 42197 140117
19805A40117p0339j45024l6795O0200N81m074J4879L4643P3057L2433J808r9622
$$ 140117 69778 -75246 -112041 -51841 -51260 -55334 -40455 -5812 67245 99678 101486 1864
19793A864j917Q7382k5441k0732l2646l0419k141k1758K4899J15947J6277j20022
$$ 1864 -53 87329 61888 41156 8510 -21909 -24050 -45808 -20909 95038 111315 -8707
19781h707j09875l5180O377L7777L383m37O8224L4841j12932o2997M7099P9221
$$ -8707 -118582 -153762 -147385 -109608 -106225 -106662 -38438 -3597 -116529 -179526 -132427 -53206
19769e3206m3515o2746K0186J03993O7653L4220o7870j07912J1121O1345L7327
$$ -53206 -96721 -159467 -139281 -35288 32365 66585 -1285 -109197 -98076 -36731 596
19758E96j0529k7154m6663L4490J50091l9154j19602M054M5624j45n442n9823
$$ 596 -9933 -37087 -83750 -49260 100831 61677 -57925 -53871 -8247 -8392 -13834 -73657
19746g3657L4444l1323o028Q717l6354K6218J28900Q4004l7056P4347N3122j8046
$$ -73657 -39213 -70536 -76564 -67847 -104201 -77983 50917 134921 97865 172212 225334 207288
19734B07288j93769o9156O6431L1369l4767k8206j0235K3568J15917k7586l0399
$$ 207288 13519 -55637 10794 42163 7396 -20810 -31045 -7477 108440 80854 50455
19723E0455K9285M4091N5338J8357j5095j22839n983P358K0944J0058l6329l5790
$$ 50455 79740 123831 179169 197526 182431 59592 53609 60967 81911 91969 55640 19850
19711A9850n3201r8799j9949n3150m5019P6590P8063P8629M7343l8088N5226M6670
$$ 19850 -33351 -132150 -152099 -205249 -250268 -173678 -95615 -16986 30357 -7731 47495 94165
19699I4165j02316j03151M455P3705P6121K9287Q103m3792n1244n9259O639P8669
$$ 94165 -8151 -111302 -106847 -33142 42979 72266 80369 36577 -14667 -73926 -67287 11382
19687A1382l920m1410j3892K0160J0327r41J06522L4037j9810n2636J8780l4745
$$ 11382 7462 -33948 -47840 -27680 -17353 -18294 88228 122265 102455 49819 68599 33854
19675C3854k1668J9856k4989r486O0237J4058N072n4868m9271l2082j20570L5446
$$ 33854 12186 32042 7053 -2433 57804 71862 76934 22066 -27205 -59287 -179857 -144411
19663a44411q9130J78922K2700L4809P6355j19056o6313q353J11529J9363n192
$$ -144411 -233541 -54619 -31919 2890 79245 -39811 -106124 -114477 -2948 16415 11223
19652A1223k5295M2349j8086j8712j8012L0759o109N113K8721j01838J4946Q5061
$$ 11223 -14072 28277 10191 -8521 -26533 4226 -1883 3230 31951 -69887 -54941 30120
19640C0120M0510o0185K3275J35311p2627p2001N2316N2239J5618n8101m1120
$$ 30120 70630 10445 33720 169031 96404 24403 76719 128958 144576 86475 45355
19629D5355J8372l6991n342p441J4391O4232k9950O111N3885r4319l8053k9686
$$ 45355 63727 26736 21394 13953 28344 92576 62626 68737 122622 28303 -9750 -39436
19617c9436p281J4258J22665n5152K3830J4648o7142k4166n5451l4428m3473n7968
$$ -39436 -46717 -32459 90206 35054 58884 73532 6390 -17776 -73227 -107655 -151128 -209096
19605b09096O5271J01325k154M3747J34611O6698m6015j19473m9235Q5933M7792
$$ -209096 -143825 -42500 -44654 -907 133704 200402 154387 34914 -14321 71612 119404
19594A19404j29111l5522J18755J83381l7710j18904j46123J3726j8579L8501
$$ 119404 -9707 -45229 73526 256907 219197 100293 -45830 -32104 -50683 -12182
19584a2182J23170p8599q072Q582l4804L5499m1500j09754m2691J17346O9536
$$ -12182 110988 32389 24317 32899 -1905 33594 -7906 -117660 -160351 -43005 26531
19573B6531j4042j0134m1418q732r015K9840J25568J403N055o4340j3047Q6980
$$ 26531 12489 2355 -39063 -47795 -56810 -26970 98598 100001 105056 40716 27669 114649
19561A14649r610j7271m8402n2170J3422k0954N4211K442j15932j0097L7767j6854
$$ 114649 105039 87768 39366 -12804 618 -20336 33875 36317 -79615 -89712 -51945 -68799
19549f8799r875j4667j5814K7133Q7127M0954o4415K1876O6527J8640Q986L268
$$ -68799 -78674 -93341 -109155 -82022 5105 46059 -18356 3520 70047 88687 97673 100941
19537A00941K2733q67j1064J2053l0313L766k7189L303L735k943R6352q9425j04218
$$ 100941 123674 122807 111743 123796 93483 97249 70060 73363 77098 74155 170507 81082 -23136
19524b3136o850N5199O6071o2576p7791j1791k4276j0725K4435L9015m5843j4295
$$ -23136 -29986 25213 91284 28708 -49083 -60874 -85150 -95875 -71440 -32425 -78268 -92563
19512i2563Q2936L9574M8507O9148K4301r9489K8332m7164o33o5713n7597k2371
$$ -92563 -9627 29947 78454 147602 171903 72414 100746 53582 52949 -12764 -70361 -92732
19500i2732m7077K3713J06293J49447J06134R6889J78249N0019J2878J11383K35275
$$ -92732 -139809 -116096 -9803 139644 245778 342667 520916 570935 583813 695196 930471
19489I30471Q4449k14154k48784j23744O8699M215R0201J38410M7059J19985O5498
$$ 930471 1014920 800766 551982 428238 496937 501152 591353 729763 776822 896807 962305
19478I62305j2247k80928j83600p5687j15242q8740j16482o9291N2233J26361
$$ 962305 950058 669130 485530 409843 294601 205861 89379 20088 72321 198682
19468A98682q2026q2800p8421O4150J38683j1993m967P6123j06264r3242R5421
$$ 198682 116656 33856 -44565 19585 158268 146275 141308 217431 111167 17925 113346
19457A13346J64130M4732o5957j04825k4449m5074n5151N2632M977O2374O1145
$$ 113346 277476 322208 256251 151426 126977 81903 26752 79384 84361 146735 207880
19446B07880J2940M6650J42313K05357J38777J92339M3836j56802j64434j31790
$$ 207880 220820 267470 409783 615140 753917 946256 990092 833290 668856 537066
19436E37066j84715R301R7154Q6205J65238J89519O9377r5102k88540j35171m4271
$$ 537066 352351 361652 458806 545011 710249 899768 969145 874043 585503 450332 406061
19425D06061j58112n6560N9011p8497L7153K7882p3961j02119k5306K9632o9561
$$ 406061 247949 191389 250400 171903 209056 236938 162977 60858 35552 65184 -4377
19414d377r5143N7768J07095M8058Q503M7429n1357l5806n199n7433J12729j6608
$$ -4377 -99520 -41752 65343 113401 121904 169333 117976 82170 76971 19538 132267 115659
19402A15659k0644r7794k8424l7264N0285m8381o5947p2620l9994J83452Q0764
$$ 115659 95015 -2779 -31203 -68467 -18182 -66563 -132510 -205130 -245124 -61672 19092
19391A9092r8229o7642P4484N893N2940n3814q4023R8154M7414K4673N3211m5930
$$ 19092 -79137 -146779 -72295 -66402 -13462 -67276 -151299 -53145 -5731 18942 72153 26223
19379B6223k2670N203l025j607L7925j7755J05158J7105n0151j27297m044J04595
$$ 26223 3553 8756 5731 4124 42049 24294 129452 146557 96406 -30891 -34935 69660
19367F9660N5319n5429p982K3756n5428m4682K2385K2247Q4876J8665M3398M9042
$$ 69660 124979 69550 61568 85324 29896 -14786 7599 29846 114722 133387 176785 225827
19355B25827n7373J2584l2309j36489j95969M089P1082J19038J54824L3451n2855
$$ 225827 168454 181038 148729 12240 -183729 -179640 -108558 10480 165304 198755 145900
19344A45900o1875l2065p2189K3646N6234k2999l0210k4498n6961K8648j5915
$$ 145900 84025 51960 -20229 3417 59651 36652 6442 -18056 -75017 -46369 -62284
19333f2284k2145N2063j1486J3890R7981m9665j45895o201J00833j0541K4428
$$ -62284 -84429 -32366 -43852 -29962 68019 18354 -127541 -133742 -32909 -43450 -19022
19322a9022J97628P090n3252M4694L1961n422r2550O9515k2345o2863L1007l4860
$$ -19022 178606 185696 132444 177138 209099 203677 111127 180642 158297 95434 126441 91581
19310I1581K7791J8840r1635r7367n3722J1856K06169M3624j44794L1971L1967
$$ 91581 119372 138212 46577 -50790 -104512 -92656 113513 157137 12343 44314 76281
19299G6281J7978J646j08888n6619M2479Q6973K0705j02481o9160N7126Q683r265
$$ 76281 94259 95905 -12983 -69602 -27123 59850 80555 -21926 -91086 -33960 -25277 -34542
19287c4542Q5727P8179J0810M6075k6367q0090m9867P4020m9096N8109Q8613l4857
$$ -34542 51185 129364 140174 186249 159882 79792 29925 103945 54849 112958 201571 166714
19275A66714l0318j23774q5200m1742J8717J04627J28303n3107j15149J334M2449
$$ 166714 136396 12622 -72578 -114320 -95603 9024 137327 84220 -30929 -29595 12854
19264A2854J0327p8376n474o8327P5658P7330l3870L8476L1792q8294n5213J7619
$$ 12854 23181 -55195 -60669 -128996 -53338 23992 -9878 28598 60390 -27904 -83117 -65498
19252f5498J6937J24975R6469Q7895o8448k5162L5471J301j27154P2891K1992
$$ -65498 -48561 76414 172883 260778 192330 167168 202639 203940 76786 149677 171669
19241A71669J4755m8485J2818j7414r8000P4846K0165J39573P1809k3553l5974
$$ 171669 186424 137939 150757 133343 35343 110189 130354 269927 341736 318183 282209
19230B82209m9695L9166j90635K1575N898j2964J25230Q8563j63042j49698Q604
$$ 282209 232514 271680 81045 102620 108518 95554 220784 309347 146305 -3393 5211
19219E211J34444q7726j16465K5384J2043K0572P7937O3245O2049m3145q2142
$$ 5211 139655 51929 -64536 -39152 -27109 -6537 71400 134645 196694 153549 71407
19208G1407j49377n2546j4052l0553J4587J2456R1684J90356P0137l6916l0668
$$ 71407 -77970 -130516 -144568 -175121 -160534 -148078 -56394 133962 204099 167183 136515
19197A36515n6226j6902L575n2058r4505O1588Q4820J949M7216o2701j7241M3989
$$ 136515 80289 63387 66962 14904 -79601 -18013 66807 68756 115972 53271 36030 80019
19185H0019p1490J9308L5182N0148J4000q430M3777N4338L1673M5129q011q318
$$ 80019 8529 27837 63019 113167 127167 118737 162514 216852 248525 293654 285643 277325
19173B77325j8566j73729p2309m7693Q0796R7809M4178J36371n1805o1160q8910
$$ 277325 258759 85030 12721 -34972 45824 143633 187811 324182 272377 211217 122307
19162A22307K1737q353l1698J0316N5563n5975r7767o4696P5625m3271n0955N0949
$$ 122307 144044 135691 103993 114309 169872 113897 16130 -48566 27059 -16212 -67167 -16218
19150a6218J9800N9570K1615l3898p414k6580R9013K1810r8095l1695L6194J5714
$$ -16218 3582 63152 84767 50869 43455 16875 115888 137698 39603 7908 44102 59816
19138E9816l3462J3752N7997J9184q6788J2168m2092P271K5038m6349R8842L7405
$$ 59816 26354 40106 98103 117287 30499 42667 575 7846 32884 -13465 85377 122782
19126A22782k9934p4694q5576N5157Q3555P3957p528r015k1784P3983o5280j58633
$$ 122782 92848 18154 -67422 -12265 71290 145247 137719 128704 106920 180903 115623 -43010
19114d3010L4009O7016N6925J26404J02076P642o3931p1603n9930l8069j5933
$$ -43010 -9001 58015 114940 241344 343420 351062 287131 215528 155598 117529 101596
19103A01596j780K00664k6976K9015J52351N5513o088p3784P746o7510J842p1943
$$ 101596 99816 300480 273504 302519 454870 510383 504295 430511 438257 370747 372589 300646
19091C00646q449Q7379j7268K3052o0408j27409l4762L9295O456L9718K5677O5978
$$ 300646 292197 379576 362308 385360 324952 197543 162781 202076 208532 248250 273927 339905
19079C39905r0548j30909p9274j8130J06523n727J20595Q9040p6603J3234j8914
$$ 339905 249357 118448 39174 21044 127567 121840 242435 331475 254872 268106 249192
19068B49192n0817k8092n9509N340N8776j9481P6801J28021J25215k7167N337
$$ 249192 198375 170283 110774 116114 174890 155409 232210 360231 485446 458279 463616
19057D63616r6135j39357q2272K01356M9190J7009R3842P4455m020p2876l3457
$$ 463616 367481 228124 145852 347208 396398 413407 507249 581704 577684 504808 471351
19046D71351j29943k9472K2136j6559J17087J7470j14081q257K191m7669P376
$$ 471351 341408 311936 334072 317513 434600 452070 337989 329732 331923 284254 291630
19035B91630L6832q4146j02536N8358J55746J02132K3610O8330K9116O0344Q16
$$ 291630 328462 244316 141780 200138 355884 458016 481626 549956 579072 639416 640232
19024F40232j1702K1678N358n6245N1842J30254p2765l3815P4295R4087k0600
$$ 640232 628530 650208 655566 599321 651163 781417 708652 674837 749132 843219 822619
19013H22619r864P4258P5015K3309l8759N6590j1471L2215O8533K13094J73400
$$ 822619 812755 887013 962028 985337 946578 1003168 991697 1023912 1092445 1305539 1478939
19002A478939K38913K78671M33144M84381M21082N3201l70030m16463J5861P8945
$$ 1478939 1717852 1996523 2429667 2914048 3335130 3388331 3018301 2601838 2617699 2696644
18992B696644L9983L20217N59293P30340O07722L17651L9092J34300L22072N24810
$$ 2696644 2736627 3056844 3616137 4346477 4954199 5271850 5310942 5445242 5767314 6292124
18982F292124R85924J331487J796503K231075L015559M618217P650096J2856925
$$ 6292124 7278048 8609535 10406038 12637113 15652672 20270889 27920985 40777910
18974D0777910K2016941L5612379M5053276K7800529n634922l6393264l8189774
$$ 40777910 62794851 98407230 143460506 171261035 165626113 129232849 91043075
18967I1043075k3710227r461750J448425J2571042K7371511M2408427L4978007
$$ 91043075 67332848 57871098 59319523 71890565 99262076 141670503 176648510
18960A76648510Q34706l4361303m6789759l4634164k0214996j1389237o956738
$$ 176648510 177483216 143121913 96332154 61697990 41482994 30093757 23137019
18953B3137019m415633k718273j827773j363289j014327r45541q61131p41394
$$ 23137019 18721386 16003113 14175340 12812051 11797724 10852183 9991052 9249658
18945I249658m73276l74936k78043k32570k80311O7086L07725L04024K06157J03618
$$ 9249658 8776382 8401446 8123403 7890833 7610522 7677608 7985333 8289357 8495514 8599132
18935H599132M12748N98517P09880Q41320J141560J768084K507513L807429O391853
$$ 8599132 9011880 9610397 10320277 11161597 12303157 14071241 16578754 20386183 26778036
18926B6778036J0688087J8483528L1330539M6003536M1411571R654655k7879812
$$ 26778036 37466123 55949651 87280190 133283726 174695297 184349952 156470140
18919A56470140m4118648l2482194j5944515l156961Q015758K1570533L8154708
$$ 156470140 112351492 79869298 63924783 60767822 68783580 90354113 128508821
18912A28508821M4043271J7682258k0578811m7779078m3486990k7726049j5658822
$$ 128508821 172552092 190234350 169655539 121876461 78389471 50663422 35004600
18905C5004600r223558n721956l685334k651286k088241j674371j380693j060884
$$ 35004600 25781042 20059086 16373752 13722466 11634225 9959854 8579161 7518277
18897G518277o81175k25770k01114n80064o80141p85760n70506l31350k16943
$$ 7518277 6837102 6611332 6410218 5830154 5150013 4364253 3793747 3462397 3245454
18888C245454j29179p0160K17547K67327r9845m58523m97646m53167l31772j46095
$$ 3245454 3116275 3046115 3263662 3530989 3431144 2972621 2474975 2021808 1690036 1543941
18878A543941j81248j68685m5506J7028j27740j06512k08075j21931L5919Q0731
$$ 1543941 1362693 1194008 1148502 1165530 1037790 931278 723203 601272 637191 717922
18868G17922o4791m9039K6925J09950l614j00613j30183p244K7444K5718R0273
$$ 717922 653131 604092 631017 740967 737353 636740 506557 499313 526757 552475 642748
18857F42748K053o3114N0066r8490q9019n6065p7684o96N9836N0811K4479M6472
$$ 642748 644801 581687 631753 533263 444244 388179 310495 309799 369635 420446 444925 491397
18845D91397p6784p6904J0380q5692q5223J30976J02570J1580K5510k6147q0240
$$ 491397 414613 337709 348089 262397 177174 308150 410720 422300 447810 421663 341423
18834C41423J264o7142J15379J3573j0025j5883r0033m932O1954J07513m1121
$$ 341423 342687 275545 390924 404497 394472 378589 288556 283624 345578 453091 411970
18823D11970o4621j14720M1774J14668P04Q4478j680j03771n9269n3677l026P6672
$$ 411970 347349 232629 274403 389071 389775 474253 472573 368802 309533 255856 252830 329502
18811C29502O5239J43271J60790K32345K84935L75585P33065J326504J856156
$$ 329502 394741 538012 698802 931147 1216082 1591667 2324732 3651236 5507392
18802E507392J190808m83437j698907j727193j017675n20977l02309k08595m1890
$$ 5507392 6698200 6214763 4515856 2788663 1770988 1250011 947702 739107 697217
18793F97217q4930j55792K8552p7223j19003j60923j00733O1798J16902n3913
$$ 697217 612287 456495 485047 407824 288821 127898 27165 88963 205865 151952
18783A51952j5627j30062J4009J63187O1926j6687Q2301L9876N5431j2905j2660
$$ 151952 136325 6263 20272 183459 245385 228698 310999 350875 406306 393401 380741
18772C80741J14706J13506k0748K04224L76168M79561K37059m99867n00459j72734
$$ 380741 495447 608953 588205 792429 1168597 1648158 1885217 1385350 884891 712157
18762G12157j42013j247L956P1000Q7967J4317Q6763L18856K44034M88374R42124
$$ 712157 570144 568897 572853 643853 731820 746137 832900 1151756 1395790 1884164 2826288
18751B826288J733519K005442P53528j174252k023465j496040q69210n01745l49546
$$ 2826288 4559807 6565249 7318777 6144525 4121060 2625020 1755810 1254065 904519
18742I04519j55059n2692j9970r1475n0844j64676j15920n6980K9369K802j06201
$$ 904519 749460 696768 676798 585323 534479 369803 253883 196903 226272 229074 122873
18731A22873K9014m871O3763J8689o9601o2780o0065r6085r3665N6184R8794J49266
$$ 122873 151887 147016 210779 229468 159867 97087 37022 -59063 -152728 -96544 2250 151516
18719A51516L017R7522N5204j12724K0891L1440k227M7479k3776N4604k1729m5125
$$ 151516 154533 252055 307259 194535 215426 246866 244639 292118 268342 322946 301217 256092
18707B56092n0098r9388j09152j8232J31962O6512r591m6979p5475L7944N0362
$$ 256092 205994 106606 -2546 -20778 111184 177696 168105 121126 45651 83595 133957
18696A33957L8660Q0552J78316J6842J03833K7190r4760n1851k5620k8364k5160
$$ 133957 172617 253169 431485 448327 552160 579350 484590 432739 407119 378755 353595
18685C53595L9869J7220m6319L2013J01628p3375j49083j46902J5358J2398J0916
$$ 353595 393464 410684 364365 396378 498006 424631 275548 128646 144004 156402 167318
18674A67318j7830K432k639M1991m6147K6172P1656J3891j58354k9298p2350L9857
$$ 167318 149488 151920 149281 191272 145125 171297 242953 256844 98490 69192 -3158 36699
18662C6699N3836l8484l9374J0784k4263J9580r29J68983J23646j66778k7510
$$ 36699 90535 52051 12677 23461 -802 18778 17849 186832 310478 143700 116190
18651A16190M1759r356l3561J7250M6115J85618J16039R2844Q4604m8755l3216
$$ 116190 157949 148593 115032 132282 178397 364015 480054 572898 657502 608747 575531
18640E75531J10419P1291j4478k6441m0581J12830J30730p5997r5944Q491L9412
$$ 575531 685950 757241 742763 716322 675741 788571 919301 843304 747360 755851 795263
18629G95263k1701r6979k46091j96048n3608o1853j38673l1099J48587O5332O225
$$ 795263 773562 676583 430492 234444 180836 118983 -19690 -50789 97798 163130 169355
18618A69355j56511j4682J2676L6769j7916k3604q5196n5689N4449P5019j03812
$$ 169355 12844 -1838 10838 47607 29691 6087 -79109 -134798 -80349 -5330 -109142
18607a09142J18416J42258j16857n1397L781j6868N6633N7096J6994N0969j9048
$$ -109142 9274 151532 34675 -16722 -12941 -29809 26824 83920 100914 151883 132835
18596A32835J42186O2656J13321J29233K8056r8123j24753j22221o815j08009
$$ 132835 275021 337677 450998 580231 608287 510164 385411 263190 256375 148366
18586A48366P94J26420J83410J41613L6824m9938j40147j42768p4227k804o0472
$$ 148366 149160 275580 458990 600603 637427 587489 447342 304574 230347 227543 167071
18575A67071p5036o6499k9753l3859j39930J13543J25621J5295l9140k8763J3391
$$ 167071 92035 25536 -4217 -38076 -178006 -64463 61158 76453 37313 8550 21941
18564B1941P6257P1329J06282K7178p4281j22765o7134Q261p6884K3067R9530
$$ 21941 98198 169527 275809 302987 228706 105941 38807 47068 -29816 -6749 92781
18553I2781r304r7015q4723n7184Q1415O7306N8315J13169p0444q0819N0411o1969
$$ 92781 83477 -13538 -98261 -155445 -74030 -6724 51591 164760 94316 13497 63908 1939
18541A939k6083M0825j7127P8850k4949n2871j3050o0277m0849o6641j6063J33819
$$ 1939 -24144 16681 -446 78404 53455 584 -12466 -72743 -113592 -180233 -196296 -62477
18529f2477N1318k79k5506P910J24931J641n2978K1653K1306P2036m186p5791
$$ -62477 -11159 -11438 -36944 -29034 95897 97538 44560 66213 87519 159555 155369 79578
18517G9578M9960J9184L2870P7292r5523o5120j9667k7914k9882q6077K3637J71979
$$ 79578 129538 148722 181592 258884 163361 98241 78574 50660 20778 -65299 -41662 130317
18505A30317J8089o039m7380l5687p2134L8997N4195j01606p3929K4345J1326
$$ 130317 148406 142367 94987 59300 -12834 26163 80358 -21248 -95177 -70832 -59506
18494e9506L8473J9126o332n3680j297j7656J06986J03388k4023l4158j5764l7026
$$ -59506 -21033 -1907 -8239 -61919 -63216 -80872 26114 129502 105479 71321 55557 18531
18482A8531J2288M3277M7417J39384R4030k993j8716m7034m3832l2091l4510o0113
$$ 18531 30819 74096 121513 260897 354927 351934 333218 286184 242352 210261 175751 115638
18470A15638p4462m5325J71696J3192j3202J8604n6028J06429P8006Q643j32966
$$ 115638 41176 -4149 167547 180739 167537 186141 130113 236542 314548 323191 190225
18459A90225j87003o710M0872L1044j5075j01055M3881R698R0807J58764K10793
$$ 190225 3222 -3488 37384 68428 53353 -47702 -3821 5877 96684 255448 466241
18448D66241K24839K18434R0920j8497j04460q5440j00075j27414j0337J61647
$$ 466241 691080 909514 1000434 981937 877477 792037 691962 564548 554211 715858
18438G15858J08129J95066N8769p5258j45380j75255j69884j05851j2982j37811
$$ 715858 823987 1019053 1077822 1002564 857184 681929 512045 406194 393212 255401
18428B55401q6785n2179j286k8090L7435J24783M5123j43437q7241J0904n2212
$$ 255401 168616 116437 115151 87061 124496 249279 294402 150965 63724 74628 22416
18417B2416J5849p707J3294p577l3511K2748K1016k3493J1430J0529m7400Q9704
$$ 22416 38265 30558 43852 36275 2764 25512 46528 23035 34465 44994 -2406 87298
18405H7298j2302J43917K28228M3025k2811L0902J93129K40722J80458r8211l10674
$$ 87298 74996 218913 447141 490166 467355 498257 691386 932108 1112566 1014355 703681
18394G03681r3055l3583k2271N4393j9878J6718L09282K59654J40769j66320k79058
$$ 703681 610626 577043 554772 609165 589287 606005 915287 1174941 1315710 1149390 870332
18383H70332j61107p3280p8030k27941j43848L3094M9424o1507j9401r510k6197
$$ 870332 709225 635945 557915 329974 186126 219220 268644 207137 187736 178226 152029
18372A52029J5446L4508j18982N0315P6429L925k8401J6170J3972O9046N5701
$$ 152029 167475 201983 83001 133316 209745 213670 185269 201439 215411 284457 340158
18361C40158o5495j63276j27587j1040m7359J47510Q6879p7284o2916J3116k3739
$$ 340158 274663 111387 -16200 -27240 -74599 72911 159790 82506 19590 32706 8967
18350H967J0176j2075l4451Q1753Q1212k5527j4801n0487L0993n8155J7991O7896
$$ 8967 19143 7068 -27383 54370 135582 110055 95254 44767 75760 17605 35596 103492
18338A03492K5360M1690o9893j1197J5265L9231j2410j5604J0530Q2288M2456
$$ 103492 128852 170542 100649 89452 104717 143948 131538 115934 126464 208752 251208
18327B51208J7256l7608L0930j4861K8082l5921m8546n8356O9876n4346o3407
$$ 251208 268464 230856 261786 246925 275007 239086 190540 132184 202060 147714 84307
18316H4307N6795Q0670M334P707P3110k2047j0801L8004k7326K2434p7154k15580
$$ 84307 141102 221772 226106 233813 306923 284876 274075 312079 284753 307187 230033 14453
18304A4453o4482n5174O6180J31851J7208m4703p5659N8847K5426q1787R7901
$$ 14453 -50029 -105203 -39023 92828 110036 65333 -10326 48521 73947 -7840 90061
18293I0061J48324J7947j78295o285M080m5580K7845K982O2283M5698M0551J2563
$$ 90061 238385 256332 78037 71752 75832 30252 58097 61079 123362 169060 209611 222174
18281B22174O2184O1199o3563j12550N2281N9215J35958N6915q8039j53919o3465
$$ 222174 284358 345557 281994 169444 221725 280940 416898 473813 385774 231855 168390
18270A68390O8390l1594n6721R4762R1709q3527K4095M8738p2632k5859R0767
$$ 168390 236780 205186 148465 243227 334936 251409 275504 324242 251610 225751 316518
18259C16518N5761p504L7612M8826Q637j5035p2151l2616O7543J50261j04571
$$ 316518 372279 364775 402387 451213 459850 444815 372664 340048 407591 557852 453281
18248D53281j20779p6700L1626P8949M8969K4997R4423M1076L0696J50549R3057
$$ 453281 332502 255802 287428 366377 415346 440343 534766 575842 606538 757087 850144
18237H50144R5656O8504O0998l2017p1777j3178N0212O8160n8370n6397P0961
$$ 850144 945800 1014304 1075302 1043285 971508 958330 1008542 1076702 1018332 961935 1032896
18226A032896Q8065o8721m6162L0112j12384J53466J91068M8960L51334J18624
$$ 1032896 1120961 1052240 1006078 1036190 923806 1077272 1268340 1317300 1668634 1787258
18216A787258K2730q1956r7259L4218N8485K3590L3318J34613J67621J69548J66577
$$ 1787258 1809988 1728032 1630773 1664991 1723476 1747066 1780384 1914997 2082618 2252166 2418743
18205B418743J29437J09182O0745O4271J39855L86260M66083O75189P27794O82851
$$ 2418743 2548180 2657362 2718107 2782378 2922233 3308493 3774576 4449765 5177559 5860410
18195E860410P82709J276475J990082K704817M265403P127009J2164908J9239789
$$ 5860410 6643119 7919594 9909676 12614493 16879896 24006905 36171813 55411602
18187E5411602K3313125Q185451j6285564k0632011j3512569o299518j716408
$$ 55411602 78724727 86910178 70624614 49992603 36480034 30180516 28464108
18180B8464108K341781P422658J4228971K0917693J4700348j1094262k3531774
$$ 28464108 30805889 38228547 52457518 73375211 88075559 76981297 53449523
18173E3449523j8550897j0720689n744477l458237k445911j814957j303053r35200
$$ 53449523 34898626 24177937 18433460 14975223 12529312 10714355 9411302 8476102
18165H476102n59367n01342l42996k27037j54722J64891K08484J66664J42456
$$ 8476102 7916735 7415393 7072397 6845360 6690638 6855529 7064013 7230677 7373133
18156G373133K1754M1888L18540L51883N55770R04987R39662J162709J560862
$$ 7373133 7394887 7436775 7755315 8107198 8662968 9567955 10507617 11670326 13231188
18147A3231188K089621K930875M249294P008171J1981423J9511182K7477036K2753146
$$ 13231188 15320809 18251684 22500978 29509149 41490572 61001754 88478790 111231936
18139A11231936m048682j6603522o623484J0240314K2838321J3996934j0163495
$$ 111231936 107183254 90579732 83956248 94196562 117034883 131031817 120868322
18132A20868322j2321319K822425J3634066q82445j9983707j6113300l05103J4894855
$$ 120868322 108547003 111369428 125003494 124121049 104137342 88024042 87718939 102613794
18124A02613794J4838777j1791529k8366687k3730710j4062220p330583l808974
$$ 102613794 117452571 105661042 77294355 53563645 39501425 32170842 28361868
18117B8361868j771440q4774J830250M183351Q355815J6202076L0579141N5510603
$$ 28361868 26590428 26505654 28335904 32519255 40875070 57077146 87656287 143166890
18109A43166890Q8188980O7052635n5256359r1402241o2093168l1568254j6323893
$$ 143166890 231355870 298408505 243152146 151749905 89656737 58088483 41764590
18102D1764590r359647n685431l783530k405757j292031l83794K20273P12995
$$ 41764590 32404943 26719512 22935982 20530225 19238194 18854400 19074673 19787668
18094A9787668J518893K846601N715641J0693953J8448275K7770940K5547573
$$ 19787668 21306561 24153162 29868803 40562756 59011031 86781971 112329544
18087A12329544m680650k7238463k4042785j3632642n781632q0007N438133J2446124
$$ 112329544 107648894 80410431 56367646 42735004 36953372 36873365 42311498 54757622
18079E4757622K1505236K6056025O032803k3914966k8637804j9575826j1076499
$$ 54757622 76262858 102318883 108351686 84436720 55798916 36223090 25146591
18072B5146591o192891m071692k946198k154698j683285j291148j005755p44172
$$ 25146591 18953700 14882008 11935810 9781112 8097827 6806679 5800924 5056752
18064E056752m43345l70253k22496r0354j13490j96072k10400l01496m46100k61969
$$ 5056752 4613407 4243154 4020658 3930304 3816814 3620742 3410342 3108846 2662746 2400777
18054B400777k29985j47345l0709L8139Q5680O297m3789p2414j46850k65840k32779
$$ 2400777 2170792 2023447 1992738 2030877 2116557 2122854 2079065 2006651 1859801 1593961 1361182
18043A361182j10788j38292j58562o5690L2093J4887j49867o4436J3814J63788
$$ 1361182 1250394 1112102 953540 887850 919943 934830 784963 720527 734341 898129
18033H98129J02716r4093j37616J7386J5966m4787k8686j20563N547J67526l2216
$$ 898129 1000845 906752 769136 786522 802488 757701 729015 608452 613999 781525 749309
18022G49309q5234m316p1261j31626j3770P451p842n6506m4067n7576J4755o7975
$$ 749309 664075 659759 588498 456872 443102 450553 442711 386205 342138 284562 299317 231342
18010B31342K2592K085Q8163J46393k7537m9782M5858p3180M3813K4480l0773
$$ 231342 253934 256019 344182 490575 463038 413256 459114 385934 429747 454227 423454
17999D23454J8584n6170j85062L346J32402N4787j49648j14059R0057J03470M6719
$$ 423454 442038 385868 200806 204152 336554 391341 241693 127634 217691 321161 367880
17988C67880q517l4217K4112J24274J3811M898n1820l7201J8462j9053N8663k6849
$$ 367880 359363 325146 349258 473532 487343 492241 440421 403220 421682 402629 461292 434443
17976D34443l8849o093J16338K0006j87167l4290N2136M0449K9290M314j11009
$$ 434443 395594 389501 505839 525845 338678 304388 356524 396973 426263 430577 319568
17965C19568o1800M3830J08333J39839K7453J05216K53780Q4933J2364O5466O2967
$$ 319568 257768 301598 409931 549770 577223 682439 936219 1021152 1033516 1098982 1161949
17954A161949J34387l8379j32094q2965k3487N4729J07070J05347p3785o5494
$$ 1161949 1296336 1257957 1125863 1042898 1019411 1074140 1181210 1286557 1212772 1147278
17944A147278k02939k88217k83159J1769M6439p6104j32967r9425N2524l2555
$$ 1147278 944339 656122 372963 384732 431171 355067 222100 122675 175199 142644
17934A42644K7341P007n5197N5645m425J5622J8569r04q4524J5597m4267o9224
$$ 142644 169985 176992 121795 177440 173015 188637 207206 206302 121778 137375 93108 23884
17922B3884L8644J53767N3727m885K4753r836j0553j889J2286k5939N8155Q6786
$$ 23884 62528 216295 270022 265137 289890 280054 269501 267612 279898 253959 312114 398900
17910C98900l2957l1774l5675J27014J81304J19081L9165J8233j15867j69139
$$ 398900 365943 334169 298494 425508 606812 725893 765058 783291 667424 498285
17900D98285j0499N309O4203O4500J17807k784q2799L1128q9293J1012j09318
$$ 498285 487786 493095 557298 621798 739605 736821 654022 685150 595857 606869 497551
17889D97551j82387n8871l7539L4630J18479K8013n6144k2891k590l8036m1235
$$ 497551 315164 256293 218754 253384 371863 399876 343732 320841 318251 280215 238980
17878B38980r71j96319q0N5475O3247L307j60313K4073J36340M8042q9291k3247
$$ 238980 238009 41690 41610 97085 160332 163639 3326 27399 163739 211781 122490 99243
17866I9243q830j6644L4126P66N0856n8001j10894k6351j6623J13179j9592l6931
$$ 99243 90413 73769 107895 108661 159517 101516 -9378 -35729 -52352 60827 41235 4304
17854D304M570N4091k2579L4730p852J7491p6369J4787K8755k603J5769P431N1035
$$ 4304 8874 62965 40386 75116 67264 84755 8386 23173 51928 49325 65094 72525 123560
17841A23560J409k0125L0950O1775R0977j53514K4011N6109K9441N7952L9284
$$ 123560 124969 104844 135794 197569 288546 135032 159043 215152 244593 302545 341829
17830C41829r1443k8255j9071j6422j23116l0856M7368K3287l8563Q2358J34405
$$ 341829 250386 222131 203060 186638 63522 32666 80034 103321 64758 147116 281521
17819B81521l2039j47498p8888l3803L6310O7877J16590Q7327N8258K03249J67706
$$ 281521 249482 101984 23096 -10707 25603 93480 210070 297397 355655 558904 726610
17808G26610J05134j77343j63013j22748j572J9781N6630J62379J14945N978j99114
$$ 726610 831744 654401 491388 368640 367068 386849 443479 605858 720803 726781 527667
17797E27667k01906j13534p2211q0750J8128L3071j10325o7284J70004J86910
$$ 527667 325761 212227 140016 59266 77394 110465 140 -67144 102860 289770
17787B89770m7744q0549k9427K3895J45794P3636K7201o8879r9550j372k5838
$$ 289770 242026 161477 132050 155945 301739 375375 402576 333697 234147 232775 206937
17776B06937L140K6174L1187P3588j20931j11003j676k0041L9782J75367Q5630
$$ 206937 210077 236251 267438 341026 220095 109092 107416 87375 127157 302524 388154
17765C88154J0256L7880J72061J69802R9049J12280K558j90807o3891N4506K5399
$$ 388154 398410 436290 608351 778153 877202 989482 992040 801233 737342 791848 817247
17754H17247Q2904J64844J39121O3945l9535j49249j19364k13212k36171j04419
$$ 817247 900151 1064995 1204116 1268061 1228526 1079277 959913 746701 510530 406111
17744D06111l0163J02996P143q1721l7120p5148o2554j5045k5436q6875O9087
$$ 406111 375948 478944 486087 404366 367246 292098 229544 214499 189063 102188 171275
17733A71275j9717P1032L362J02271M3420j08750m7215j73988j51711M1431J58082
$$ 171275 151558 222590 225952 328223 371643 262893 215678 41690 -110021 -68590 89492
17722H9492J51846K0723J33359k115r010J10475K1441O0462K08519K89349j2222
$$ 89492 241338 262061 395420 393305 384295 494770 516211 576673 785192 1074541 1062319
17711A062319o2089m092J18747K43606J06351L5257N6733R9363J29840j59830
$$ 1062319 1000230 996138 1114885 1358491 1464842 1500099 1556832 1656195 1786035 1626205
17701A626205j98072j23787M2165l0085k92086k06760k1309J6976p6656n4156
$$ 1626205 1428133 1304346 1346511 1316426 1024340 817580 796271 813247 736591 682435
17691F82435r8011j03716j65690q1099n9580l2398P5211K5998N5171N0499j358
$$ 682435 584424 480708 315018 233919 174339 141941 217152 243150 298321 348820 347462
17680C47462K1750K00734J28812j963o9401k05974L1515P5810K9745P0381K00671
$$ 347462 369212 569946 698758 696795 627394 421420 452935 528745 558490 628871 829542
17669H29542K60253J91775K07402J09239J68726J36211k6879j9304P5625o8695
$$ 829542 1089795 1281570 1488972 1598211 1766937 1903148 1876269 1856965 1932590 1863895
17659A863895l4546L4108m483j5893j60537K1881J39001q4563j76205j73914l12046
$$ 1863895 1829349 1863457 1858974 1843081 1682544 1704425 1843426 1758863 1582658 1408744 1096698
17648A096698j68897j01877m5788K1605p395m112j01124p3320o2665q1531r4246
$$ 1096698 927801 825924 780136 801741 794346 790234 689110 615790 553125 471594 377348
17637C77348J9616J30994O9127L7529K3056P7511J43195k9824j1092N5980Q3042
$$ 377348 396964 527958 597085 634614 657670 735181 878376 848552 837460 893440 976482
17626I76482J42079J56559M308O117P4719M3208R1460K7065J91404K87411K37931
$$ 976482 1118561 1275120 1279428 1285545 1360264 1403472 1494932 1521997 1713401 2000812 2238743
17615B238743J26717j40731j94024m8814R4228R0557P356j16229j71089o3440
$$ 2238743 2365460 2224729 2030705 1981891 2076119 2166676 2174032 2057803 1886714 1823274
17605A823274j5002l0762L9098K5550K79626J97730k1600j62609k90330n4307
$$ 1823274 1808272 1777510 1816608 1842158 2121784 2319514 2297914 2135305 1844975 1790668
17595A790668Q0005P2215K01738R0532j58710l39639k19301k8483j38229n2295
$$ 1790668 1870673 1942888 2144626 2235158 2076448 1736809 1517508 1489025 1350796 1298501
17585A298501P7993j78597o4619m013J84381L09060k3854k16966j49537k07937
$$ 1298501 1376494 1197897 1133278 1129265 1313646 1622706 1598852 1381886 1232349 1024412
17575A024412p9762p5459j22850Q8506K79699K43871n8345r8332p4997k21280
$$ 1024412 944650 869191 746341 834847 1114546 1358417 1300072 1201740 1126743 905463
17565I05463k02646k8550L2271J19772m541j5205M9602M4290O9947o2305j20488
$$ 905463 702817 674267 706538 826310 821769 806564 856166 900456 970403 908098 787610
17554G87610m7962K4521J35531J96669M2254j01682k9264J45649K95866M11595
$$ 787610 739648 764169 899700 1096369 1138623 1036941 1007677 1153326 1449192 1860787
17544A860787J23125Q28k04925j41097Q557L0891M3862r8370j30149k05711k19473
$$ 1860787 1983912 1984740 1779815 1638718 1647275 1678166 1722028 1623658 1493509 1287798 1068325
17533A068325j52105j29833l7760R120p6604n7395n5698j3430O0274j50J4681
$$ 1068325 916220 786387 748627 757747 681143 623748 568050 554620 614894 614744 629425
17522F29425R6253o390j05880o8049n994J21494P8904J8734r2036n477r3834o5832
$$ 629425 725678 719288 613408 545359 539365 660859 739763 758497 666461 660984 567150 501318
17510E01318J02175J65978O3400J14657N2546P9073O2242o9976m6728N6528L0163
$$ 501318 603493 769471 832871 947528 1000074 1079147 1141389 1071413 1024685 1081213 1111376
17499A111376Q4207Q7490J02742L1715J08662J22210O0162R7888J39429K2068
$$ 1111376 1195583 1283073 1385815 1417530 1526192 1648402 1708564 1806452 1945881 1967949
17489A967949K3519J09538K92015M06371M11226K80103J99379J50728K22023J92126
$$ 1967949 1991468 2101006 2393021 2799392 3210618 3490721 3690100 3840828 4062851 4254977
17479D254977R2931M5870K96489N07193L35592M11812N27221M85786N09791O90677
$$ 4254977 4347908 4393778 4690267 5197460 5533052 5944864 6472085 6957871 7467662 8158339
17469H158339R79003J520953K241615L343719M849240P677299J2663817J9960583
$$ 8158339 9137342 10658295 12899910 16243629 21092869 28770168 41433985 61394568
17461F1394568K7188678K6026043J7195395P400056J623168l576403r007525j0094564
$$ 61394568 88583246 114609289 131804684 139204740 140827908 137251505 128243980 118149416
17453A18149416Q75548J5033946J6565053Q378965o89517o726993j5037753k4637923
$$ 118149416 119024964 134058910 150623963 159002928 158313411 151586418 136548665 111910742
17445A11910742k9855831k4623632j6040629r751682o565511m815275l393783
$$ 111910742 82054911 57431279 41390650 31638968 25073457 20258182 16864399
17438A6864399k264435j689228j191685p55940m96814l24115m07933m42486k76417
$$ 16864399 14599964 12910736 11719051 10963111 10466297 10142182 9734249 9291763 9015346
17429I015346l21179l07459j33707j3022J22951J07549M9982N6625j3748L0721
$$ 9015346 8694167 8386708 8253001 8239979 8362930 8470479 8520461 8577086 8563338 8594059
17419H594059J32206L56195N93570J053295J742271K623445L979879O295725J0242970
$$ 8594059 8726265 9082460 9676030 10729325 12471596 15095041 19074920 25370645 35613615
17410C5613615J6161629K2699774K3205787J6605852Q497027L705174j588193
$$ 35613615 51775244 74475018 97680805 114286657 122783684 126488858 124900665
17403A24900665q148649j1891476l865937R105091J3216036Q225327J744405k886672
$$ 124900665 116752016 104860540 100994603 110099694 123315730 131541057 133285462 130398790
17395A30398790j0607800j9993073k6451361k2907307j5230059r280687n853214
$$ 130398790 119790990 99797917 73346556 50439249 35209190 25928503 20075289
17388B0075289l824966k521277j700350j133010p23349k21101K21579J57675j73978
$$ 20075289 16250323 13729046 12028696 10895686 10172337 9951236 10172815 10330490 10156512
17379A0156512l89814m60140p33209q99064j016340p53263m79441k60628l2482
$$ 10156512 9766698 9306558 8573349 7674285 6657945 5904682 5425241 5164613 5132131
17370E132131L2209N03227Q22760O85871J86820k15724j30512l74210r93384j311386
$$ 5132131 5164340 5667567 6490327 7176198 7363018 7147294 7016782 6642572 5649188 4337802
17360D337802j082677o15337l53141l03235j45087k9647K3718J1703k8237N9036
$$ 4337802 3255125 2639788 2286647 1983412 1838325 1808678 1832396 1844099 1815862 1874898
17350A874898N7742j16649j20881j77445j56673p7820j2738j16430O0672J51956
$$ 1874898 1932640 1815991 1695110 1517665 1360992 1283172 1270434 1154004 1214676 1366632
17340A366632p2097m9190q9650O2231J47998Q3119L8959J08483J74166J07782
$$ 1366632 1294535 1245345 1155695 1217926 1365924 1449043 1488002 1596485 1770651 1878433
17330A878433O3701J1234j28246o0846J890O2700K02496J85287K70289J29287
$$ 1878433 1942134 1953368 1825122 1764276 1766166 1828866 2031362 2216649 2486938 2616225
17320B616225j36668j45410k2430J08930K24688J62286J48676J02450J06473P0985
$$ 2616225 2479557 2334147 2311717 2420647 2645335 2807621 2956297 3058747 3165220 3236205
17310C236205L60868M14053N67856O21367Q10196J086211J455480K419617L451447
$$ 3236205 3597073 4011126 4578982 5200349 6010545 7096756 8552236 10971853 14423300
17301A4423300N307193Q312256J2787206J9159845K8164727K5041491o958219
$$ 14423300 19730493 28042749 40829955 59989800 88154527 113196018 106237799
17294A06237799k6761656k1986026j0829390j800313N986244J5023265K3672083
$$ 106237799 79476143 57490117 46660727 44860414 50846658 65869923 89542006
17287H9542006J7396329j2870356k7249993k2209783j3925334q068177m779770
$$ 89542006 106938335 94067979 66817986 44608203 30682869 22614692 17834922
17280A7834922l038637k077316j675681j173580r30550p68733m43911l23829l37039
$$ 17834922 14796285 12718969 11043288 9869708 8939158 8170425 7726514 7402685 7065646
17271G065646k78558o9331O0904l2680j28905m1091J95932L47834L84958N09629
$$ 7065646 6787088 6717757 6778661 6745981 6617076 6575985 6771917 7119751 7504709 8014338
17261H014338P70815O15104Q42699J246879J846694L107844M676818O937316J0913959
$$ 8014338 8785153 9400257 10242956 11489835 13336529 16444373 21121191 28058507 38972466
17252C8972466J7752771K8341937L7071336K4171893M055039N743696n062931
$$ 38972466 56725237 85067174 122138510 146310403 150365442 156109138 151046207
17245A51046207k5619180k2336833n370400J2811890K2897802J0902140l422506
$$ 151046207 125427027 103090194 97719794 110531684 133429486 144331626 140909120
17238A40909120j440131j4953491l2772736k9343597j8422190j0301685o450932
$$ 140909120 139468989 124515498 91742762 62399165 43976975 33675290 27224358
17231B7224358n210354m072875l014551k181682j667242j284191j015398q15033
$$ 27224358 22014004 17941129 14926578 12744896 11077654 9793463 8778065 7963032
17223G963032m66468l64345m13193k34691j53066j88132j24355J8668J30670K10403
$$ 7963032 7496564 7132219 6719026 6484335 6331269 6143137 6018782 6037450 6168120 6378523
17213F378523L01257K45347K16244K86041O04319J005994J685484K607761L866402
$$ 6378523 6679780 6925127 7141371 7427412 8031731 9037725 10723209 13330970 17197372
17204A7197372O144827J0296686J7322192K5430829K0337768r302019k3706386
$$ 17197372 23342199 33638885 50961077 76391906 96729674 87427655 63721269
17197F3721269j7661603q015243o69914N877602J3803207K0860369J2596799j4694837
$$ 63721269 46059666 38044423 37374509 43252111 57055318 77915687 90512486 75817649
17189G5817649k4654812j8469340j0734406n981837l614383k437480j743671j319197
$$ 75817649 51162837 32693497 21959091 15977254 12362871 9925391 8181720 6862523
17181F862523j057555q68384p82975m28894k81549l41904j86523j06129p6069
$$ 6862523 5804968 4936584 4153609 3724715 3443166 3101262 2914739 2808610 2732541
17172B732541j56768l24439k58077j13701m2962J57563R0617m8127j84669j62029
$$ 2732541 2575773 2251334 1993257 1879556 1836594 1994157 2084774 2036647 1851978 1689949
17162A689949j84606j32947q2733K2775J05885m3485k38141k12083L3085L3552
$$ 1689949 1505343 1372396 1289663 1312438 1418323 1374838 1136697 924614 957699 991251
17152I91251j08130p2746k10055o2512k5165r0455K6840j183N1219J7507O2170
$$ 991251 883121 810375 600320 537808 512643 422188 449028 447845 499064 516571 578741
17141E78741l5484k6182J0417j64911n4476J16273K6914l5183J3634l4971n0325
$$ 578741 543257 517075 527492 362581 308105 424378 451292 416109 429743 394772 344447
17130C44447j00842Q196J8687K9321L4263K3672l862O1694P8442N044m5047n0590
$$ 344447 243605 251801 270488 299809 334072 357744 353882 415576 494018 499062 454015 403425
17118D03425M2655o5260p4389P6875J34423q9442j80932j30245J8088O6228K9279
$$ 403425 446080 380820 306431 383306 517729 428287 247355 117110 135198 201426 230705
17107B30705N2123l9142o5244r4702J5196l7067M0365R7196O5233J3141O2510
$$ 230705 282828 243686 178442 83740 98936 61869 102234 199430 264663 277804 340314
17096C40314k6888r9207K3962P4835J2199J9927j26493k3638P9224K662q8335
$$ 340314 313426 214219 238181 313016 325215 345142 218649 195011 274235 276897 188562
17085A88562O526m703K3557n6225K4780K7349K6901J4311M8488L4824q7620j27721
$$ 188562 195088 190385 213942 157717 182497 209846 236747 251058 299546 334370 246750 119029
17073A19029k8186j8439j8669j09004P6348M2605N6211J35242l2533j18536l1093
$$ 119029 90843 72404 53735 -55269 21079 63684 119895 255137 222604 104068 72975
17062G2975J01377p5499p2940P702r7855j7463L9506J07385K0803j32079J26749
$$ 72975 174352 98853 25913 33615 -64240 -81703 -42197 65188 85991 -46088 80661
17051H0661J24253j30402k7515P2451l0664J7722j6697M8614p1283n0428K9055
$$ 80661 204914 74512 46997 119448 88784 106506 89809 138423 67140 16712 45767
17040D5767P124j77450O3412J11831P4549J103m682j15307o6790j9963N7910J48382
$$ 45767 52891 -124559 -61147 50684 125233 126336 121654 6347 -60443 -80406 -22496 125886
17028A25886o768j46010l5155q5105J00386N4950M7019M3964j08535L3709J05049
$$ 125886 119118 -26892 -62047 -147152 -46766 8184 55203 99167 -9368 24341 129390
17017A29390J74128K4797q7103k7262j00175q6520N6070N4020j3248l0969j9183
$$ 129390 303518 328315 241212 213950 113775 27255 83325 137345 124097 93128 73945
17006G3945m1124m3871O4812k2914k1386q681J1114Q873P2095Q0438M3752j22399
$$ 73945 32821 -11050 53762 30848 9462 781 11895 20768 92863 173301 217053 94654
16994I4654j64608J7390Q510N2733K5438n3810K9983n4425n0173J10861L0796
$$ 94654 -69954 -52564 -44054 8679 34117 -19693 10290 -44135 -94308 16553 47349
16983D7349J25951o5923q8368J32221K8891p4116l6392Q1079K1336n5526l6872
$$ 47349 173300 107377 19009 151230 180121 106005 69613 150692 172028 116502 79630
16972G9630j7211J17071R2010j70836j27158J3482N5280K4711l2029J33311P8142
$$ 79630 62419 179490 271500 100664 -26494 -13012 42268 66979 34950 168261 246403
16961B46403j35257m7294m8568J03977J13944O7012J54680K10305q9740r7693
$$ 246403 111146 63852 15284 119261 233205 300217 454897 665202 575462 477769
16951D77769N6241J06007J31340n0505n0780l6628J50296J32043l3491k27551
$$ 477769 534010 640017 771357 720852 670072 633444 783740 915783 882292 654741
16941F54741j66358j2879K7092K7997j41698j39860r9455q9162q239l020j7638
$$ 654741 488383 475504 502596 530593 388895 249035 149580 60418 52179 49159 31521
16930C1521p6516K1006L8896j2732J04300M6364L6569l3196m315Q756K0116n0994
$$ 31521 -44995 -23989 14907 2175 106475 152839 189408 156212 151897 160653 180769 129775
16918A29775j03074j3551r1650l8371M1628k3686n4749M384j4523J32313J33554
$$ 129775 26701 13150 -78500 -116871 -75243 -98929 -153678 -149294 -163817 -31504 102050
16907A02050O0867Q9022Q7460N5780Q6938N0164M2560J60507J13417j4685j60310
$$ 102050 162917 251939 339399 395179 482117 532281 574841 735348 848765 834080 673770
16896F73770j50777l7980J19143J38411j10199j00207L9026R8768o5706k54727
$$ 673770 522993 485013 604156 742567 632368 532161 571187 669955 604249 349522
16886C49522j49773p9745M2204j5951k6941o6751q6386j08634N0405Q4485p379
$$ 349522 199749 120004 162208 146257 119316 52565 -33821 -142455 -92050 -7565 -14944
16875a4944p5660k9151k6271R5492J15151r5924R1608Q8000L0217o2514r0346
$$ -14944 -90604 -119755 -146026 -50534 64617 -31307 60301 148301 178518 116004 25658
16864B5658o4562O346N8840n092K1142l4292k6561N9161N5783n9190j4561P6895
$$ 25658 -38904 -32558 26282 21190 42332 8040 -18521 40640 96423 37233 22672 99567
16852I9567P6257q6326k0746j664l4114L042m0207N9692O5679P3233o0199M8361
$$ 99567 175824 89498 68752 67088 32974 36016 -4191 55501 121180 194413 134214 182575
16840A82575m0802j34476l5958R5312N1282m4402K6521m0649M8902m2482q6976
$$ 182575 141773 7297 -28661 66651 117933 73531 100052 59403 108305 65823 -21153
16829b1153J5188o1394p079j68009J37010J51841M7882j0585o6189L915l4434
$$ -21153 -5965 -67359 -74438 -242447 -105437 46404 94286 83701 17512 21427 -13007
16818a3007j3969l1251m8753r608m1489K2329N1346L6755O8449R4212n364J5770
$$ -13007 -26976 -58227 -106980 -116588 -158077 -135748 -84402 -47647 20802 115014 109650 125420
16806A25420r561l1553j17783r7073N942o5397L3262j5379M0981k4794o161J9997
$$ 125420 115859 84306 -33477 -130550 -124608 -190005 -156743 -172122 -131141 -155935 -162096 -142099
16794a42099p8500J2708L8280M4285K01018J15622j01061k8954j07376l6407M086
$$ -142099 -220599 -207891 -169611 -125326 75692 191314 90253 61299 -46077 -82484 -78398
16783g8398k5386Q2861Q2826J46909J77898J79045J24441M1548j51929j64281
$$ -78398 -103784 -20923 61903 208812 386710 565755 690196 731744 579815 415534
16773D15534j58566p3760K1713J15508K16562m2962n7831r4825j05964j25410
$$ 415534 256968 183208 204921 320429 536991 494029 436198 341373 235409 109999
16763A09999J8315m9649r8968J7391Q6750q0871k482M8737k2619j10566L9851
$$ 109999 128314 78665 -20303 -2912 83838 2967 485 49222 26603 -83963 -44112
16752d4112J25975n202N7676J14948P564O4391J521j11605j23226j64601k23J05458
$$ -44112 81863 76661 134337 249285 256849 321240 322761 211156 87930 -76671 -76894 28564
16740B8564m1845K1575J43344J31473o5326j29163M4023J13470J01606J56441
$$ 28564 -13281 8294 151638 283111 217785 88622 132645 246115 347721 504162
16730E04162J27765J26565M5725j6520p4150o5346l5207M9315J52395K6588j6445
$$ 504162 631927 758492 804217 787697 713547 648201 612994 662309 814704 841292 824847
16719H24847O7024j16704k81318j98462j49484o2685P48k860K6875M6964j14382
$$ 824847 891871 775167 493849 295387 145903 83218 83966 81106 107981 154945 40563
16708D0563j01534p156l0203N0212L7356J23115O963o8575L0299p4787j9193j4118
$$ 40563 -60971 -68127 -98330 -48118 -10762 112353 119316 50741 81040 6253 -12940 -27058
16696b7058o7880k5309K8876o0111k3303J07490Q2117M2166J32213J5365n6267
$$ -27058 -94938 -120247 -91371 -151482 -174785 -67295 14822 56988 189201 204566 148299
16685A48299o6658L7503Q8996J5439Q0861J02091p355n3961q2036q4598O8680
$$ 148299 81641 119144 208140 223579 304440 406531 399176 345215 263179 178581 247261
16674B47261O4415J86361J65266N9161k08106k32759j96812j06932o0022N422
$$ 247261 311676 498037 663303 722464 514358 281599 84787 -22145 -82167 -76745
16664g6745J37325J6052o1563k8703M0907J4052n0814L6331J6791k7646m3936
$$ -76745 60580 76632 15069 -13634 27273 41325 -9489 26842 43633 15987 -27949
16653b7949n6491j9619P1072J2082n0825n5571k9777J9887r7895M6640M6206q892
$$ -27949 -84440 -104059 -32987 -20905 -71730 -127301 -157078 -137191 -235086 -188446 -142240 -151132
16641a51132k9337r682Q4290L5850M5927K6477l1080P4265L6405r9471o6288l7215
$$ -151132 -180469 -190151 -105861 -70011 -24084 2393 -28687 45578 81983 -17488 -83776 -120991
16629a20991N5152P8977P8982J7954m6711n0907o9921j7765j17683K4150J2621
$$ -120991 -65839 13138 92120 110074 63363 12456 -57465 -75230 -192913 -168763 -156142
16618a56142J6702o739j5516K1663O7334p4067J3100j1727p1530K9850M7299O6313
$$ -156142 -139440 -146179 -161695 -140032 -72698 -146765 -133665 -145392 -216922 -187072 -139773 -73460
16606g3460O3720O3586L707K5821j3915O1697O9804N223j71300o0441P8506j2319
$$ -73460 -9740 53846 57553 83374 69459 131156 200960 206183 34883 -25558 52948 40629
16594D0629m9339J00129J33254j0757M6792q3401j02541n863Q8942j2158N6455
$$ 40629 -8710 91419 224673 213916 260708 177307 74766 68903 157845 145687 202142
16583B02142q461q7123r3910j01428l3151K0691J2912m13O0492Q2221r1161o7481
$$ 202142 193681 106558 12648 -88780 -121931 -101240 -88328 -88741 -28249 53972 -37189 -104670
16571a04670J4719O2397L6343L6028M1490L4890J6938l9850j30260r4395N3527
$$ -104670 -89951 -27554 8789 44817 86307 121197 138135 98285 -31975 -126370 -72843
16560g2843M1281K9268K9223L272L2194j694N19m4437m2522O6517l5915L9044
$$ -72843 -31562 -2294 26929 30201 62395 60701 61220 16783 -25739 40778 4863 43907
16548D3907k9774M9748n428p3214m3856M9404m6911N295L6927j1175J5206o4597
$$ 43907 14133 63881 58453 -14761 -58617 -9213 -56124 -50829 -13902 -25077 -9871 -74468
16536g4468l8945l0954K299j3160N5937J04894J7524n7140n568O8246k0706J7108
$$ -74468 -113413 -144367 -142068 -155228 -99291 5603 23127 -34013 -39581 28665 7959 25067
16524B5067p155j2313j54548L001J0481J6614N5092j4578N8163p3652m436O8705
$$ 25067 17912 5599 -148949 -145948 -135467 -118853 -63761 -78339 -20176 -93828 -98264 -29559
16512b9559k6374M3033J7284O0124R794j5177j01779M411J1646J4192J6731j8683
$$ -29559 -55933 -12900 4384 64508 74302 59125 -42654 -38243 -26597 -12405 4326 -14357
16500a4357n2134m8934l027L9042q0996P3437R0094J51927r8745j39880q6175
$$ -14357 -66491 -115425 -118452 -79410 -160406 -86969 3125 155052 56307 -83573 -169748
16489a69748l9971K1026P1843j2888j63553L6015O8978M3993J62175J7208o9153
$$ -169748 -209719 -188693 -116850 -129738 -293291 -257276 -188298 -144305 17870 35078 -34075
16478c4075J4354l2162j1720l1736J3003k8941j6240K5358L6900J200Q7694R5535
$$ -34075 -19721 -51883 -63603 -95339 -82336 -111277 -127517 -102159 -65259 -64059 23635 119170
16466A19170J12774l3696j43553m4010K1319L9202m4180J5835J20176n4107q2742
$$ 119170 231944 198248 54695 10685 32004 71206 27026 42861 163037 108930 26188
16455B6188M0898l2954j16269K8383j7140P6426J01496n8679m52j21033q6380
$$ 26188 67086 34132 -82137 -53754 -70894 5532 107028 48349 47897 -73136 -159516
16444a59516m2853J09921Q8506O1023L0273j02961m1112n9312J9289Q6228j1871
$$ -159516 -202369 -92448 -3942 57081 87354 -15607 -56719 -116031 -96742 -10514 -22385
16433b2385K3997j33360L5975Q445m9567K1678K7064O8975R2470m1385k3990M8173
$$ -22385 1612 -131748 -95773 -87328 -136895 -115217 -88153 -19178 73292 31907 7917 56090
16421E6090K9612K0422K1448l2974n5662R3286m6822j61002k1407O2840l3234
$$ 56090 85702 106124 127572 94598 38936 132222 85400 -75602 -97009 -34169 -67403
16410f7403Q8801p956j56350j27837O8669J06182l403M6734N2o6363q8316m8113
$$ -67403 21398 13442 -142908 -270745 -202076 -95894 -99297 -52563 -52511 -118874 -207190 -255303
16398b55303P7715O3982p044o3848o2538p3761J41659J02277Q9864J4338l7220
$$ -255303 -177588 -113606 -120650 -184498 -247036 -320797 -179138 -76861 13003 27341 -9879
16387i879m1281o1223J4412K8764P2625O0543j2282m5828M1877K9532r3191K5125
$$ -9879 -51160 -112383 -97971 -69207 3418 63961 51679 5851 47728 77260 -15931 9194
16375I194k5595q7614j24615J6717j892O1585J01408P0870K7137n2780L6941L0927
$$ 9194 -16401 -104015 -228630 -211913 -213805 -152220 -50812 20058 47195 -5585 31356 62283
16363F2283K4111k6256j20835p8619j364J07876n8811p0917j1345K6544K9680
$$ 62283 86394 60138 -60697 -139316 -140680 -32804 -91615 -162532 -173877 -147333 -117653
16352a17653l8384m1679J2871O5906K8396K046j2811O2942J7795j6374J4914N4707
$$ -117653 -156037 -197716 -184845 -118939 -90543 -88497 -101308 -38366 -20571 -36945 -22031 32676
16340C2676J3734n3461j11644o8730Q2665Q9343O7538O7830K859n0616k6831P569
$$ 32676 46410 -7051 -118695 -187425 -104760 -15417 52121 119951 122810 72194 45363 52932
16328E2932O2816j5705o1053j31604l0058K4024N4724J36338m743j26681l0168
$$ 52932 115748 100043 38990 -92614 -122672 -98648 -43924 92414 87671 -39010 -69178
16317f9178R884j05406l2228K4036Q4325M3487P4550k6375m2333n1804N0227p1747
$$ -69178 -59294 -164700 -196928 -172892 -88567 -45080 29470 3095 -39238 -91042 -40815 -112562
16305a12562k6608R0492R9493p9406j35717j9542J2970J02781P7095J19660J8455
$$ -112562 -139170 -48678 50815 -28591 -164308 -183850 -170880 -68099 8996 128656 147111
16294A47111j56118q6175P6328J5779j50565R316J24263M9034N6548j7560M9863
$$ 147111 -9007 -95182 -18854 -3075 -153640 -144324 -20061 28973 85521 67961 117824
16283A17824m1714j05451l7322L577p7452R9789M293o9420J08484J8835J4099
$$ 117824 76110 -29341 -66663 -63086 -140538 -40749 -36456 -105876 2608 21443 35542
16272C5542M2774J07567q0038p1087P8651N0016j10085j16997L8297L3973K4132
$$ 35542 78316 185883 105845 34758 113409 163425 53340 -63657 -25360 8613 32745
16261C2745K6128j4264m3711k2571j52075M9137J12946j8137k5657M7840K3935
$$ 32745 58873 44609 898 -21673 -173748 -124611 -11665 -29802 -55459 -7619 16316
16250A6316r716l6440p7832k8404M8024O255J1387L0593J629O2511J21303n7306
$$ 16316 6600 -29840 -107672 -136076 -88052 -81797 -70410 -39817 -38188 24323 145626 88320
16238H8320l7812l8797P850O0502n9578M8227Q8821J2591j76174j22147l0918
$$ 88320 50508 11711 19561 80063 20485 68712 157533 170124 -6050 -128197 -159115
16227a59115K1797J8976k3748O5710Q7671J4817j686l2278L8464k9289o8896k9353
$$ -159115 -137318 -118342 -142090 -76380 11291 26108 24422 -7856 30608 1319 -67577 -96930
16215i6930P8794j2846r4873O5517q842j0219k4253O9766O8200j1757p8591J06091
$$ -96930 -18136 -30982 -125855 -60338 -69180 -79399 -103652 -33886 34314 22557 -56034 50057
16203E0057M2336K9747m135M9787L4825k7307p4902n7260q4263N2788P7803O5763
$$ 50057 92393 122140 118005 167792 202617 175310 100408 43148 -41115 11673 89476 155239
16191A55239q4126j52038R5607k2549k0060M3986J1504j05439j35973M9189J35999
$$ 155239 71113 -80925 14682 -7867 -27927 16059 27563 -77876 -213849 -164660 -28661
16180b8661K3635p800m6694j579N043M1955l5457n3573j4643J8422J48738Q2548
$$ -28661 -5026 -12826 -59520 -61099 -56056 -14101 -49558 -103131 -117774 -99352 49386 131934
16168A31934n0024L708o3028O5998K9762j9040m6743J8590k7992j12422l6994
$$ 131934 81910 85618 22590 88588 118350 99310 52567 71157 43165 -69257 -106251
16157a06251p649M8422K541P2334K2903q9707J6655j865L6985P9947M7071l3907
$$ -106251 -113900 -65478 -62937 9397 32300 -57407 -40752 -42617 -5632 74315 121386 87479
16145H7479o9806L7681M2755q1881k02938j70190Q4444L1970k476m9125N1243
$$ 87479 17673 55354 98109 16228 -186710 -356900 -272456 -240486 -242962 -292087 -240844
16134b40844K3622o6729k5090Q8626O3249q391m6166J9976O9445K8202R2782m2905
$$ -240844 -217222 -283951 -309041 -220415 -157166 -165557 -211723 -191747 -122302 -94100 -1318 -44223
16122d4223Q8643J3972j36538N2891o7646K2100L0712j0156r2569Q1908Q8248
$$ -44223 44420 58392 -78146 -25255 -92901 -70801 -40089 -50245 -142814 -60906 27342
16111B7342k3610K7326P3920m1799j27314P457P7450L6713k3291O6057j612j77855
$$ 27342 3732 31058 104978 63179 -64135 -56678 20772 57485 34194 100251 98639 -79216
16099g9216m9119j16753L5702k2526M566o2048p3428J1616P1946J06427j2381
$$ -79216 -128335 -245088 -209386 -231912 -227346 -289394 -362822 -351206 -279260 -172833 -185214
16088a85214J5320m8730L2626O3666J09881J01069r580L911l3898M2327j7824
$$ -185214 -169894 -218624 -185998 -122332 -12451 88618 79038 82949 49051 91378 73554
16077G3554q2702k8200P6852j100p8367m7813J32133Q2274o2463k5207j9342j03812
$$ 73554 -9148 -37348 39504 38404 -39963 -87776 44357 126631 64168 38961 19619 -84193
16065h4193l8637j303K1613J5881J0488O8103J37996o7384p9202K4101M2229M8436
$$ -84193 -122830 -124133 -102520 -86639 -76151 -8048 129948 62564 -16638 7463 49692 98128
16053I8128M5250q5346L3992N1473r7774j02729j6909J62773R1084p1333p9987
$$ 98128 143378 58032 92024 143497 45723 -57006 -73915 88858 179942 108609 28622
16042B8622j21598n4800K5366M8274J42334M2249j59164J2524k7788J4299o2323
$$ 28622 -92976 -147776 -122410 -74136 68198 110447 -48717 -36193 -63981 -49682 -112005
16031a12005l6138L4083J16258M7782k2021l6365m4985r3677J187l310p8044Q1729
$$ -112005 -148143 -114060 2198 49980 27959 -8406 -53391 -147068 -145881 -149191 -227235 -145506
16019a45506j8546n7072K11663M4335k8470j10419k0529J26676Q9841j60931r5470
$$ -145506 -164052 -221124 -9461 34874 6404 -104015 -124544 2132 91973 -68958 -164428
16008a64428K1743K0682l0357L7481J35607j8567l7061k7998M4599o7469L6604
$$ -164428 -142685 -122003 -152360 -114879 20728 2161 -34900 -62898 -18299 -85768 -49164
15997d9164m5436l9119p6416n0202N9851j0204q7961j3946M3196P2430Q1654J2863
$$ -49164 -94600 -133719 -210135 -260337 -200486 -210690 -298651 -312597 -269401 -196971 -115317 -102454
15985a02454m2624j05831K0409P0984Q4268J03961m7323N5126L1209l644j0621
$$ -102454 -145078 -250909 -230500 -159516 -75248 28713 -18610 36516 67725 64081 53460
15974E3460L8053j19195n3232j7721R2039K5861k7839j2639q7608n089k2669J07272
$$ 53460 91513 -27682 -80914 -98635 -6596 19265 -8574 -21213 -108821 -113910 -136579 -29307
15962b9307P6805K0325k3351J38888M2250n9435l9186l2913j28835m1932j17996
$$ -29307 47498 67823 44472 183360 225610 166175 126989 94076 -34759 -76691 -194687
15951a94687p3297m259K9993J38786M3552P409k2844l2904Q1891Q6616N6542j38241
$$ -194687 -267984 -272243 -242250 -103464 -59912 -52503 -75347 -108251 -26360 60256 116798 -21443
15939b1443J00309O6163k1471j09363l8831P95r8165j6411k1551M9447J29338
$$ -21443 78866 145029 123558 14195 -24636 -23841 -122006 -138417 -159968 -110521 18817
15928A8817N4893O9494m3458n2653R469Q3604n6765j20984K8580J23384N8364
$$ 18817 73710 143204 99746 47093 56562 140166 83401 -37583 -9003 114381 172745
15917A72745l7025p2972n3451p6217N1804j7172j47421j8970P1649K8009K0814
$$ 172745 135720 62748 9297 -66920 -15116 -32288 -179709 -198679 -127030 -99021 -78207
15906g8207l8020Q0726j2433r4113Q1731J00136N2832k8436r3238j4979O2755
$$ -78207 -116227 -35501 -47934 -142047 -60316 39820 92652 64216 -29022 -44001 18754
15895A8754n912j741R063j19376l263P6897l3387j13335j36966J4623K10651L6031
$$ 18754 12842 11101 20164 -99212 -102475 -25578 -58965 -172300 -309266 -294643 -83992 -47961
15883d7961p2801l240L8669J2719k0375m4855q0159N5026M7703L4008N461m7383
$$ -47961 -120762 -124002 -85333 -72614 -92989 -137844 -218003 -162977 -115274 -81266 -75805 -123188
15871a23188n6278Q8338M8418l9334m44R6993j1414O133P4999l628L0109L5498
$$ -123188 -179466 -91128 -42710 -82044 -82488 14505 3091 9224 84223 80595 110704 146202
15859A46202q4084J17826N0828p6869n9088n7103k4993j4870n0437K1439J19791
$$ 146202 62118 179944 230772 153903 94815 37712 12719 -2151 -52588 -31149 88642
15848H8642O3923j6041k4625n6437j10088N9731O5004k6307L637l2329p709N8015
$$ 88642 152565 136524 111899 55462 -54626 5105 70109 43802 47439 15110 7401 65416
15836F5416J16708k2122m9772o5169J4873k318j69489q80q131Q2634Q5517M5336
$$ 65416 182124 160002 110230 45061 59934 57616 -111873 -112753 -120884 -38250 47267 92603
15824I2603L6324l7651l6410m6471r0430N99K8422J5642K934l6575P5584L4357
$$ 92603 128927 91276 54866 8395 -82035 -81436 -53014 -37372 -34438 -71013 4571 38928
15812C8928q319N1311Q9198l633m5618M4189m8220p6778m4609q8916p4942M2055
$$ 38928 30609 81920 171118 167485 121867 166056 117836 41058 -3551 -92467 -167409 -125354
15800a25354O8690l2061N1537N1074k3960n635O7928j55294P9052l7123n9996
$$ -125354 -56664 -88725 -37188 13886 -10074 -15709 52219 -103075 -24023 -61146 -121142
15789a21142K8582q733J4853Q415M1969N6762J33171l4838o9454l4024q1071J9252
$$ -121142 -92560 -101293 -86440 -78025 -36056 20706 153877 119039 49585 15561 -65510 -46258
15777d6258J0177o0117Q6097j0433j88949l1394J32097P7040j5327k5079j3071
$$ -46258 -36081 -96198 -10101 -20534 -209483 -240877 -108780 -31740 -47067 -72146 -85217
15766h5217L3124N9167j5360p5790o9740k5838k7667J1627O808N648n6083R5150
$$ -85217 -52093 7074 -8286 -84076 -153816 -179654 -207321 -195694 -188886 -183238 -239321 -144171
15754a44171l8577N8673P8946M1963P2276q7524J7454Q446j27085m4621O4884
$$ -144171 -182748 -124075 -45129 -3166 69110 -18414 -960 7486 -119599 -164220 -99336
15743i9336j8950L1683J93758J15780j06884p1504j9110k3554O4617j2105j06721
$$ -99336 -118286 -86603 107155 222935 116051 44547 25437 1883 66500 54395 -52326
15732e2326N1302L031K7312Q0886r4185r642O9398K135m6222M270R8635l9611
$$ -52326 -1024 2007 29319 110205 16020 6378 75776 77911 31689 35959 134594 94983
15720I4983q674J3642K1108m6599o4287K251m4598O1891P1891K4569q9267n3663
$$ 94983 86309 99951 121059 74460 10173 12424 -32174 29717 101608 126177 36910 -16753
15708a6753p7227m9658N1540M712N2251M5196l8862p8421J7917M1181O2477O757
$$ -16753 -93980 -143638 -92098 -87386 -35135 10061 -28801 -107222 -89305 -48124 14353 21110
15696B1110P912n652j4813j6900p7986N4078K2648l8357j0875M0912M7649L266
$$ 21110 29022 23370 8557 -8343 -86329 -32251 -9603 -47960 -58835 -17923 29726 32992
15684C2992O10Q2117L0251P1642m4854j9483o8056o6721O1552o5317m4798K2266
$$ 32992 33602 115719 145970 217612 172758 153275 85219 18498 80050 14733 -30065 -7799
15672g799q1628j4607l1558j7191j618M9292R6395m492R140J36161K7058n6677
$$ -7799 -89427 -104034 -135592 -152783 -154401 -105109 -8714 -13206 -4066 132095 159153 102476
15660A02476l2608n5590k6259R4641K3124Q320j2690l6123n9746j09829l290P9408
$$ 102476 69868 14278 -11981 82660 105784 114104 101414 65291 5545 -104284 -107574 -28166
15648b8166J7523m5087l1191q1726R9336j1467j02524R063Q4581N0753j32358
$$ -28166 -10643 -55730 -86921 -168647 -69311 -80778 -183302 -174239 -89658 -38905 -171263
15637a71263r161K3851M1579k1083n9377O2123J36589N2978O8348Q8544j18731
$$ -171263 -180424 -156573 -114994 -136077 -195454 -133331 3258 56236 124584 213128 94397
15626I4397p1610K624O7966k1049K8427p888J6592r2805l9174q9116R832M3233
$$ 94397 22787 25411 93377 72328 100755 92867 109459 16654 -22520 -111636 -101804 -58571
15614e8571Q2046O8031l0800m1493l6190K6828K0731o331o663N5000P3649N5293
$$ -58571 23475 91506 60706 19213 -16977 9851 30582 24251 17588 72588 146237 201530
15602B01530l9815p1759o5484m9822j52465j17333J21579P1155o1092J7825Q4821
$$ 201530 161715 89956 24472 -25350 -177815 -295148 -173569 -102414 -163506 -145681 -60860
15591f0860Q810m2867j62106m4962J67910N2582L8571n0443n3939K6551J54049
$$ -60860 -52050 -94917 -257023 -301985 -134075 -81493 -42922 -93365 -147304 -120753 33296
15580C3296m839L8703j31899j24909n2190N1520N5501m5624n0432o4180k9917
$$ 33296 28457 67160 -64739 -189648 -241838 -190318 -134817 -180441 -230873 -295053 -324970
15569c24970P031J19721R6314K0911o755k3946m1951R1686N1766o791m3604p1182
$$ -324970 -317939 -198218 -101904 -80993 -87748 -111694 -153645 -61959 -10193 -16984 -60588 -131770
15557a31770L6066Q4567R050K8837N0172r9678k7525N9601j2137o7470J7662M9151
$$ -131770 -95704 -11137 -2087 26750 76922 -22756 -50281 9320 -2817 -70287 -52625 -3474
15545c474O2024K2466m4560k8660q9309P7184J56986m6724n4878j02877k6913
$$ -3474 58550 81016 36456 7796 -81513 -4329 152657 105933 51055 -51822 -78735
15534g8735L2233J1222J4216K8479P2479j0465o7204p2913o8877O138p7089P4202
$$ -78735 -46502 -35280 -21064 7415 79894 69429 2225 -70688 -139565 -133427 -210516 -136314
15522a36314l3737l3845R7690N0789m2990N3557O6736o539o2588L68M8451j9626
$$ -136314 -170051 -203896 -106206 -55417 -98407 -44850 21886 15347 -47241 -46873 1578 -18048
15510a8048q7448r6665K6267N3172L6594j422P5694K1322l1751O9810J16208N7086
$$ -18048 -105496 -202161 -175894 -122722 -86128 -87550 -11856 9466 -22285 47525 163733 220819
15498B20819n2805j52650j44864q8060Q513p987l4843J3259P3567J48230O8482
$$ 220819 168014 15364 -129500 -217560 -209047 -217034 -251877 -238618 -165051 -16821 51661
15487E1661m6980Q579P0261k0782p3824l1898l4180J27452N9411k7984q287l7843
$$ 51661 4681 13260 83521 62739 -11085 -42983 -77163 50289 109700 81716 73429 35586
15475C5586K2546l7994j9983J01614n549n8583k3530o5638k0926K3519N3258O3320
$$ 35586 58132 20138 155 101769 96220 37637 14107 -51531 -72457 -48938 4320 67640
15463F7640J208L2857N7396L3697l0851p8338L6068k1097j28006O0465M7150Q7208
$$ 67640 68848 101705 159101 192798 161947 83609 119677 98580 -29426 31039 78189 165397
15451A65397n9420j01479M1435K5999q285o5100n2271k2856j1221l4489r8824
$$ 165397 105977 4498 45933 71932 63647 -1453 -53724 -76580 -87801 -122290 -221114
15440b21114o8812J35062K09375J0415L0894K3216k0459n0022n3482m7819J8793
$$ -221114 -289926 -154864 54511 64926 95820 119036 98577 48555 -4927 -52746 -33953
15429c3953n4617L3587k29Q1014J36637L4268j15219m4407K001J15075q2419j03198
$$ -33953 -88570 -54983 -55212 25802 162439 196707 81488 37081 39082 154157 71738 -31460
15417c1460n8474o5770M2407J37268J21115K1935m059j5245j36445q4436K3273
$$ -31460 -89934 -155704 -113297 23971 145086 167021 162962 147717 11272 -73164 -49891
15406d9891J17590L2215n377p5761j06688m7149P6348O4176p3773J6826O0397
$$ -49891 67699 99914 94537 18776 -87912 -135061 -58713 5463 -68310 -51484 8913
15395H913l8531q4746P0798O2827L5983q3278L252M0671Q9632Q866r6870j2832
$$ 8913 -29618 -114364 -43566 19261 55244 -28034 -24782 15889 105521 114387 17517 4685
15383D685K3681q2555L5855n2229J4817J5674L9716j25381p9720K7030P4816J25932
$$ 4685 28366 -54189 -18334 -70563 -55746 -40072 -356 -125737 -205457 -178427 -103611 22321
15371B2321J7051l4834k4382M8175j1068p3593m4789k033L8384P8576o433q2361
$$ 22321 39372 4538 -19844 28331 17263 -56330 -101119 -103152 -64768 13808 7375 -74986
15359g4986k8488J18100q7024j9012p84K7631L460k1754j7033l8116L9127k1258
$$ -74986 -103474 14626 -72398 -91410 -92194 -64563 -61103 -82857 -99890 -138006 -98879 -120137
15347a20137j3653Q0413L7047n1763p4576J0830J3621J1384N0186K0224p5006
$$ -120137 -133790 -53377 -16330 -68093 -142669 -131839 -118218 -106834 -56648 -36424 -111430
15336a11430m7781J5019J00991J12642l156p3789r8090q1785m1952R2249J21344
$$ -111430 -159211 -144192 -43201 69441 66285 -7504 -105594 -187379 -229331 -137082 -15738
15325a5738M4976J4430K432p3240Q0832K964k2089o5893L6280M2988n152R4443
$$ -15738 29238 43668 46100 -27140 53692 56656 34567 -31326 4954 47942 42790 137233
15313A37233P4235j71822k2543l6162P4267J10495J4940j89511j1349P1741L6174
$$ 137233 211468 39646 17103 -19059 55208 165703 180643 -8868 -20217 51524 87698
15302H7698L390J28095q415k5176J2708j51946j18727O1101l6738m9755N5070
$$ 87698 91088 219183 210768 185592 198300 46354 -72373 -11272 -48010 -97765 -42695
15291d2695k5797L3927j6164J3437N3170J23907N453L435j34827n1065L8771N9020
$$ -42695 -68492 -34565 -50729 -37292 15878 139785 145238 148673 13846 -37219 1552 60572
15279F0572Q345k2192j06393k8488L3331p838k1720O7074J85195K9915p2204m3428
$$ 60572 68917 46725 -59668 -88156 -54825 -62663 -84383 -17309 167886 197801 125597 82169
15267H2169r1001l6548m884J7757n1111L0140L6406K8397o013P7675j4360m962
$$ 82169 -8832 -45380 -50264 -32507 -83618 -53478 -17072 11325 5312 82987 68627 63665
15255F3665p571P6743J1274l9142k6694j7818O2752R1761K7005J2523q5649q1926
$$ 63665 56094 132837 144111 104969 78275 60457 123209 214970 241975 254498 168849 86923
15243H6923M9924j58118j64517K8191J04383K209r5327j8847L408J6827P7338
$$ 86923 136847 -21271 -185788 -157597 -53214 -51005 -146332 -165179 -161771 -144944 -67606
15232f7606K5200p2575q42L3006n7432K7353l9656L9186k4487K0373M7074l1841
$$ -67606 -42406 -114981 -115823 -82817 -140249 -112896 -152552 -113366 -137853 -117480 -70406 -102247
15220a02247J16266J17286K0058q104j13428r1208M8487M1382N6698K5054m8684
$$ -102247 14019 131305 151363 143259 29831 -61377 -12890 28492 85190 110244 61560
15209F1560q5637K6285j0534o7761j00880R8185K7032M1249O445r4691k8701K9757
$$ 61560 -24077 2208 -8326 -76087 -176967 -78782 -51750 -10501 -4056 -98747 -127448 -97691
15197i7691M8466o93l0873J11514N8405k4640l2708m9122O5277m3616O685k2712
$$ -97691 -49225 -49918 -80791 30723 89128 64488 31780 -17342 47935 4319 11004 -11708
15185a1708l0057Q5392l9264j08109j28205p190k0534M8626P3442P8879P5988
$$ -11708 -41765 43627 4363 -103746 -231951 -239141 -259675 -211049 -137607 -58728 17260
15174A7260l3334k2209N9765J34616N5128k7107o7910q1883K9957R3337L1395
$$ 17260 -16074 -38283 21482 156098 211226 184119 116209 34326 64283 157620 189015
15163A89015l2894q9788q8369p4460p7979O515M0766M9267L2207o5508o2739n427
$$ 189015 156121 66333 -22036 -96496 -174475 -167960 -127194 -77927 -45720 -111228 -173967 -179394
15151a79394J6887N4531J31567L2605k06858k5256J29279L1231r895K0893O8576
$$ -179394 -162507 -107976 23591 56196 -150662 -175918 -46639 -15408 -25303 -4410 64166
15140F4166o7528o5615k3468l3515J26220J5501r2691o3230l1274K1867l4596
$$ 64166 -3362 -68977 -92445 -125960 260 15761 -76930 -140160 -171434 -149567 -184163
15129a84163o5762M2309k3111L8322p154Q2073p368K6856M7527k6640Q8993M4698
$$ -184163 -249925 -207616 -230727 -192405 -199559 -117486 -124854 -97998 -50471 -77111 11882 56580
15117E6580J0177N697O105J14498l3061k9351Q267n1562K5313q1454l6354j67826
$$ 56580 66757 72454 78559 193057 159996 130645 138912 87350 112663 31209 -5145 -172971
15105a72971J5650J11505j9989q1315k2828K2284j2721n2339q539R2732J05883
$$ -172971 -157321 -45816 -65805 -147120 -169948 -147664 -160385 -212724 -221263 -128531 -22648
15094b2648O1478N6994m8970k1876Q49J8009R0440Q4474k8989j10772j52967M677
$$ -22648 38830 95824 46854 24978 25827 43836 134276 218750 189761 78989 -73978 -69301
15082f9301N2942L1918n9714o333j2684L5873m4077o8080o5089P0344J26208j3286
$$ -69301 -16359 15559 -44155 -50488 -63172 -27299 -71376 -139456 -204545 -134201 -7993 -21279
15070b1279j54139j7982O5499J8264J7507k0843K560L7248Q8872m7303j26950
$$ -21279 -175418 -193400 -127901 -109637 -92130 -112973 -110413 -73165 15707 -31596 -158546
15059a58546k1489N1653L0300q0217P010M1937k9524m580m4837N7315R2331m3804
$$ -158546 -180035 -128382 -98082 -178299 -171289 -129352 -158876 -163456 -208293 -150978 -58647 -102451
15047a02451P3189m8115j16457M6407J03534j130n3064J20852j680j924n1899
$$ -102451 -29262 -77377 -193834 -147427 -43893 -45023 -98087 22765 21085 19161 -32738
15036c2738o4002k7505L4157N0095P2369l8923j1804l0206l551J571k1728K472
$$ -32738 -96740 -124245 -90088 -39993 32376 -6547 -18351 -48557 -52108 -50537 -72265 -69793
15024f9793L9929K8302O6375J02555o7866k8537p0908o1226Q7740l080m2220o0582
$$ -69793 -29864 -1562 64813 167368 99502 70965 57 -61169 26571 23491 -18729 -79311
15012g9311O4015n29L00j2141N6982k129l087K4391P3353j4845o1389M8935J7172
$$ -79311 -15296 -15825 -15525 -27666 29316 27187 24100 48491 121844 106999 45610 94545 111717
14999A11717j06241o7956p3846r3313K02604Q6188j3784N3579K07J2597j4808
$$ 111717 5476 -62480 -136326 -229639 -27035 59153 45369 98948 99155 111752 96944
14988I6944L6807J05880L563j52968O609l8758p0832l3009O3802q195L1717N8696
$$ 96944 133751 239631 243194 90226 96835 58077 -12755 -45764 18038 9843 41560 100256
14976A00256K8254n092K7613k487K3690j6067J8914M3287l0883o2471K3678k4754
$$ 100256 128510 123418 151031 148544 172234 156167 175081 218368 187485 125014 148692 123938
14964A23938m5880j64768o2114J63553J5943j08237o8682J6895K1300M3410j41269
$$ 123938 78058 -86710 -148824 14729 30672 -77565 -146247 -129352 -108052 -64642 -205911
14953b05911P219J13073O5612J10770R427K1802L8834q6806o2129M7920M3327
$$ -205911 -198692 -85619 -20007 90763 100190 121992 160826 74020 11891 59811 103138
14942A03138n7191l346k2643j09358P8761l4421m231N2015n1432R0980o14m8607
$$ 103138 45947 42601 19958 -89400 -10639 -45060 -49291 2724 -48708 42272 41658 -6949
14930f949K4908P2283l9435P3289J39455M4545j17515j75762r4558k8861k4232
$$ -6949 17959 90242 50807 124096 263551 308096 190581 14819 -79739 -108600 -132832
14919a32832N6310J65875J635p9650m6478q6379j2715l8205L4035Q0904l2116
$$ -132832 -76522 89353 90988 11338 -35140 -121519 -134234 -172439 -138404 -57500 -89616
14908h9616m073Q278P324j46038k8414M7513J4430J05341l7735o1979p810L8419
$$ -89616 -93689 -85411 -78087 -224125 -252539 -205026 -190596 -85255 -122990 -184969 -192779 -154360
14896a54360R6513l4262m5772j707Q9897P0854k2530j098J9515l100M2735K956
$$ -154360 -57847 -92109 -137881 -139588 -49691 21163 -1367 -2465 17050 13950 56685 59641
14884E9641j2816N354j97075o1196L9622R1253J40768q552o0873j7863L8357r6103
$$ 59641 46825 52179 -144896 -206092 -166470 -75217 65551 56999 -3874 -21737 16620 -79483
14872g9483j2494J14511p926Q2680l121j26976l1127L9437K5975j07199j21104
$$ -79483 -91977 22534 14608 97288 94167 -32809 -63936 -24499 1476 -105723 -226827
14861b26827J06763J16013K0939Q9516p7809j72789r6475N8680J6077p383P8432
$$ -226827 -120064 -4051 16888 106404 28595 -144194 -240669 -181989 -165912 -173295 -94863
14850i4863J28953R4722j28480l1924P2728M5415m2683r7981M2475r310N2429
$$ -94863 34090 128812 332 -31592 41136 86551 43868 -54113 -11638 -20948 31481
14839C1481K625J7342N0689p1559j6141K7048P0064o6435j77186j6844j0108J24240
$$ 31481 34106 51448 102137 30578 14437 41485 111549 45114 -132072 -148916 -159024 -34784
14827c4784J25336J4402j5481l1508k2259m7225L9479J04477k6743p8701l7926
$$ -34784 90552 104954 89473 57965 35706 -11519 27960 132437 105694 26993 -10933
14816a0933l7318n8848K3013O745M9732L2927K6517o4875J581k7486N1772N2591
$$ -10933 -48251 -107099 -84086 -77341 -27609 5318 31835 -33040 -31459 -58945 -7173 45418
14804D5418K5255r5733p1668m795J01096j2437m7225R6853M2518n4997m4307m8663
$$ 45418 70673 -25060 -96728 -101523 -427 -12864 -60089 36764 79282 24285 -20022 -68685
14792f8685M7991Q2584m2233o1957r73l7753n094J29930M7053o8774l3683m4310
$$ -68685 -20694 61890 19657 -42300 -43273 -81026 -86120 43810 90863 22089 -11594 -55904
14780e5904O6786J164O0255J13161j08854j55909m1103p728Q268m8347m1408N6346
$$ -55904 10882 12046 72301 185462 76608 -79301 -120404 -128132 -119864 -168211 -209619 -153273
14768a53273K0174o196l707O9487L5262r0470N8949J35423Q7143J9920l0490j03099
$$ -153273 -133099 -139295 -143002 -73515 -38253 -128723 -69774 65649 152792 172712 142222 39123
14756C9123q6830l3034n750P9193M8564o2967O5721l7722j02803j6236J23468
$$ 39123 -47707 -80741 -86491 -7298 41266 -21701 44020 6298 -96505 -112741 10727
14745A0727k5085o3308p3412n125P6292O188k8471J01255k8923j486j8776j0291
$$ 10727 -14358 -77666 -151078 -156203 -79911 -73723 -102194 -939 -29862 -31348 -50124 -60415
14733f0415K4070K3748J2327L5383J0409k2624p6037m1699o0868K296J42058J38672
$$ -60415 -36345 -12597 -270 35113 45522 22898 -53139 -94838 -155706 -153410 -11352 127320
14721A27320k2782j2076k9921l5340J2674p3854L3906p852J0733m738k8239O2807
$$ 127320 104538 92462 62541 27201 39875 -33979 -73 -7925 2808 -1930 -30169 32638
14709C2638O306m242Q710n2626r5853q0303o3439L3530J17364P3565J12240n2965
$$ 32638 38944 34702 43412 -9214 -105067 -185370 -248809 -215279 -97915 -24350 87890 34925
14697C4925k5299p4697o5046r7243O3231J25470K4029L9184L5144p7312k7772
$$ 34925 9626 -65071 -130117 -227360 -164129 -38659 -14630 24554 59698 -17614 -45386
14686d5386P659m6747o6782L9384P4347J05844k9606n0868N0632j06842m5135
$$ -45386 -37727 -84474 -151256 -111872 -37525 68319 38713 -12155 38477 -68365 -113500
14675a13500P7138o8350J1391j8410l7879n8980O484N9451O7786J13697R507m8856
$$ -113500 -36362 -104712 -93321 -111731 -149610 -208590 -202106 -142655 -74869 38828 48335 -521
14663e21J0446k3088j4607N2835l7075n915N5088n9417o5175K9233k5365P7161
$$ -521 9925 -13163 -27770 25065 -12010 -17925 37163 -22254 -87429 -58196 -83561 -6400
14651f400N2833r1754m7076m2467j1903Q4984J09510P438L9482k1268M644m7258
$$ -6400 46433 -45321 -92397 -134864 -146767 -61783 47727 55165 94647 73379 78023 30765
14639C0765J1094j9358p9233R1239o0196j05794M5403P5499R2350n2110j30953
$$ 30765 41859 22501 -56732 34507 -25689 -131483 -86080 -10581 81769 29659 -101294
14628a01294k2068j6872L2979P0620N1878L8578l4538n1598m9054q668J3058P9525
$$ -101294 -123362 -140234 -107255 -36635 15243 53821 19283 -32315 -81369 -90037 -76979 2546
14616B546O1485P1789p4101n8132K2178k6619l7518J3196n3298p9846O8272P9259
$$ 2546 64031 135820 61719 3587 25765 -854 -38372 -25176 -78474 -158320 -90048 -10789
14604a0789J4414l8831k0935J9514L5353m0976q8904P6219R6176J5263m4645l1300
$$ -10789 3625 -35206 -56141 -36627 -1274 -42250 -131154 -54935 41241 56504 11859 -19441
14592a9441m8777n9294N0835J28743J11529o2540j18020j46099K9975J0446N9426
$$ -19441 -68218 -127512 -76677 52066 163595 101055 -16965 -163064 -133089 -122643 -63217
14581f3217L4964L8797r5601p2662M7589q5215R1703Q5015P4980p3643j01327
$$ -63217 -28253 10544 -85057 -157719 -110130 -195345 -103642 -18627 56353 -17290 -118617
14570a18617p1819J7136L278Q7736J18886L2058r3348r3394m862k3482N9936l1797
$$ -118617 -190436 -173300 -170022 -82286 36600 68658 -24690 -118084 -122946 -146428 -86492 -118289
14558a18289q5157L6448J1461N6779J13818R3195k8359o6600l0451M5619M0653
$$ -118289 -203446 -166998 -155537 -98758 15060 108255 79896 13296 -17155 28464 69117
14547F9117J1480k9083j67057M4769L6394R12M5842N0116r249j3256p245M9464
$$ 69117 80597 51514 -115543 -70774 -34380 -33468 12374 62490 53241 39985 32740 82204
14535H2204n2551p1501L1787k2342n5618p7311O629J21243N9514k1123m668P956
$$ 82204 29653 -41848 -10061 -32403 -88021 -165332 -158703 -37460 22054 931 -3737 4219
14523D219n2103o4375J8254J8392M7700K6141L4866m7746l4645M0112j32214Q337
$$ 4219 -47884 -112259 -94005 -75613 -27913 -1772 33094 -14652 -49297 -9185 -141399 -133062
14511a33062L5958O914M6937j9868L0403o8959J3050J03514P0402K1999L2661
$$ -133062 -97104 -90190 -43253 -63121 -32718 -101677 -88627 14887 85289 107288 139949
14500A39949L0609p3619n7809O5788k1293n5744P892q731n2667J3504n269q6877
$$ 139949 170558 96939 39130 104918 83625 27881 35773 27042 -25625 -12121 -17390 -104267
14488a04267p1113R345Q2190K2951J1181j7599l0900R483L9020M3460p2802p3042
$$ -104267 -175380 -166035 -83845 -60894 -49713 -67312 -98212 -88729 -49709 -6249 -79051 -152093
14476a52093j2853K8822J53634J00675K6589O4975l9492j69530n2158K8747N6848
$$ -152093 -164946 -136124 17510 118185 144774 209749 170257 727 -51431 -22684 34164
14465C4164J03087j4533r5708K3934j250k8706L478l913n1335P0027j5209k4561
$$ 34164 137251 122718 27010 50944 49694 20988 24466 20553 -30782 39245 24036 -525
14453e25j788N875N4453J4868m1325j2264o1234P2441J11839l9200l9470L859
$$ -525 -2313 3562 58015 72883 31558 19294 -41940 30501 142340 103140 63670 67529
14441F7529k2797Q4363j46152o6884J41148R1548l6766r9843M3180J17745q6222
$$ 67529 44732 129095 -17057 -83941 57207 148755 111989 12146 55326 173071 86849
14430H6849Q161q6247l2657R264n5883J38168j4592p6484J11416k5008k52Q5143
$$ 86849 95010 8763 -23894 -14630 -70513 67655 53063 -23421 87995 62987 62735 147878
14418A47878k8335N3511p2483p1279j09443l6601q7053J34989K12080L4786J7141
$$ 147878 119543 173054 100571 29292 -80151 -116752 -203805 -68816 143264 178050 195191
14407A95191M1501R7915o0872k1127j44744J2142J3920n2507L1996Q7041L6124
$$ 195191 236692 334607 273735 252608 107864 120006 133926 81419 113415 200456 236580
14396B36580j5188M454k3894r2940K0455M3915J05422M2509N162k505K0283j00603
$$ 236580 221392 225846 201952 109012 129467 173382 278804 321313 326475 323970 344253 243650
14384B43650j14715j2527o5845k8769J4259j4494j09604N9008k4941O1627R1782
$$ 243650 128935 116408 50563 21794 36053 21559 -88045 -29037 -53978 7649 99431
14373I9431M7495J11866J8599j8215K1672N8605m9852Q7166P7097j70074j44885
$$ 99431 146926 258792 277391 259176 280848 339453 289601 376767 453864 283790 138905
14362A38905J20894Q5166J5413l8774j01872j55386r4702o0071J05235J04601
$$ 138905 259799 344965 360378 321604 219732 64346 -30356 -90427 14808 119409
14352A19409J38841L2442j1512Q9011q9376M6370j4736q208J00052R6548O5439
$$ 119409 258250 290692 279180 368191 278815 325185 310449 302241 402293 498841 564280
14341E64280j06784p9071k23152j55408O6949Q506K8238n3186r2991j0762O8613
$$ 564280 457496 378425 155273 -135 66814 75320 103558 50372 -42619 -53381 15232
14330A5232O6022J90549J9133n468j6677L5604l1512n2461M2271N9950j2417j13118
$$ 15232 81254 271803 290936 285468 268791 304395 272883 220422 262693 322643 310226 197108
14318A97108j50549j2328j7481j0855k1393k0403M8868L581n0922k0114J2831
$$ 197108 46559 34231 16750 5895 -15498 -35901 12967 16548 -34374 -54488 -41657
14307d1657Q1599r4L7296J02988M8490j2366r0122N237P4320N02L0042k0447o1284
$$ -41657 39942 39848 77144 180132 228622 216256 126134 131371 205691 206193 236235 215788 154504
14294A54504q910j09569j3770N8988J5847k1807r7831m9774q8121p183Q8171J07956
$$ 154504 145594 36025 22255 81243 97090 75283 -22548 -72322 -160443 -167626 -79455 28501
14282B8501O301o583K7388J09100Q9711k3897q1525j10612k4328J4631O7117L6751
$$ 28501 34802 28219 55607 164707 254418 230521 148996 38384 14056 28687 95804 132555
14270A32555p6005n1670O0271M6832m0880l4570J3369k3418j299K8199k4761m2989
$$ 132555 56550 4880 65151 111983 71103 36533 49902 26484 25185 53384 28623 -14366
14258a4366N335L0811K4112L5003L8509J15996O5080j5507j17558o6761p3705
$$ -14366 -9031 21780 45892 80895 119404 235400 300480 284973 167415 100654 26949
14247B6949L0113M1818p023m1118m9425J7993J17015r7521J7445m3958k5249M5643
$$ 26949 57062 98880 91857 50739 1314 19307 136322 38801 56246 12288 -12961 32682
14235C2682R7820L0498l2992q8503k163O2115J9764P5118p7478o1334j37113k02546
$$ 32682 130502 161000 128008 39505 37342 99457 119221 194339 116861 55527 -81586 -284132
14223b84132P9029J45712J93410l383o4408l4794M6469O771j7118l7043J9203
$$ -284132 -205103 -59391 134019 130636 66228 31434 77903 84674 67556 30513 49716
14212D9716J2491k5943n3897k6182J38984M6388J3922M716m9989j27138M3518
$$ 49716 62207 36264 -17633 -43815 95169 141557 155479 160195 110206 -16932 26586
14201B6586N0661k671j5210J3253M5848l8921n5407r3092k9071J43746P3050J6550
$$ 26586 77247 74576 59366 72619 118467 79546 24139 -68953 -98024 45722 118772 135322
14189A35322n4262m910j2516M7777J8326j14902l8484J36720l8818o0130N3963
$$ 135322 81060 76150 63634 111411 129737 14835 -23649 113071 74253 14123 68086
14178F8086K2716j03175l4701J14645m8614m7911l0259M6397R6217L4615J0104
$$ 68086 90802 -12373 -47074 67571 18957 -28954 -59213 -12816 83401 118016 128120
14167A28120m4752j14647M7247J06262O6963m4951j19659k5440J18805L0397o0999
$$ 128120 83368 -31279 15968 122230 189193 144242 24583 -857 117948 148345 87346
14156H7346m7590n5304p6046o9797M1502R6004J00650L8832m195n9647K3416K6883
$$ 87346 39756 -15548 -91594 -161391 -119889 -23885 76765 115597 111402 51755 75171 102054
14144A02054k0670j782l8229p3564M3228m6914q0531N2738Q7991P5630n4838L7394
$$ 102054 81384 79602 41373 -32191 11037 -35877 -116408 -63670 24321 99951 45113 82507
14132H2507L3615j2430P2047j1231L4567M8385l0440q8417o0542o6369r5537R4764
$$ 82507 116122 103692 175739 164508 199075 247460 217020 128603 68061 1692 -93845 919
14120I19J28600L8257q8775n4530O646R809l251n8475o939N3069J5382K3748Q4700
$$ 919 129519 167776 79001 24471 31117 40926 37675 -20800 -27739 25330 40712 64460 149160
14107A49160K4126j244r7694o4594r5868J273J9501R8492Q1272k3550J02000K9307
$$ 149160 173286 172042 74348 9754 -86114 -84841 -65340 33152 114424 90874 192874 222181
14095B22181j21393n2177j3367P18L542J5871m2911K1639J0583m6349o0268Q236
$$ 222181 100788 48611 35244 35962 39504 55375 12464 34103 44686 -1663 -61931 -53695
14083e3695J88016M2455o5778j4358J08834l8372j42881N1061l8803q9643Q5591
$$ -53695 134321 176776 110998 96640 205474 167102 24221 75282 36479 -53164 32427
14072C2427Q5843J2333j86930Q5306P7179j4704m420K085l566J15011Q6610O5501
$$ 32427 118270 130603 -56327 28979 106158 91454 87034 89119 85553 200564 287174 352675
14060C52675r3143N839l8740o0760j9341o4346p0613p679k0452k181L7559K928
$$ 352675 259532 265371 226631 165871 146530 82184 11571 3892 -16560 -18741 18818 21746
14048B1746K7026l3039r930P7406p915n6503o1501L3144N8176O0774N8000O5215
$$ 21746 48772 15733 5803 83209 75294 18791 -42710 -9566 48610 109384 167384 232599
14036B32599L6470L9251N0190j497N4467l9372K6168j2578m8123j11869o5944
$$ 232599 269069 308320 358510 357013 411480 372108 398276 385698 337575 225706 159762
14025A59762k7033j2360J7993j9916Q6816M3158O6232j1532k2868K3653P7091
$$ 159762 132729 120369 138362 118446 205262 248420 314652 303120 280252 303905 380996
14014C80996k9180j06898m5871p5435N3914O5109J34101R5154l2786l2542M4047
$$ 380996 351816 244918 199047 123612 177526 242635 376736 471890 439104 406562 450609
14003D50609J8532p1506K9212Q5520J18448J42280J9755m213O3975R0889P4015
$$ 450609 469141 397635 426847 512367 630815 773095 792850 788637 852612 943501 1017516
13992A017516l5263Q6668K26501J72540J49534L34365L78030L48642M38807N85986
$$ 1017516 982253 1068921 1295422 1467962 1617496 1951861 2329891 2678533 3117340 3703326
13982C703326P41058J030616J426015J794353K009906K390793K614116K508888
$$ 3703326 4444384 5475000 6901015 8695368 10705274 13096067 15710183 18219071
13974A8219071K067234J480654P29151l6970p52864j476694j891677j956598j924220
$$ 18219071 20286305 21766959 22496110 22459140 21706276 20229582 18337905 16381307 14457087
13965A4457087j662269j300882q20624m09476J1691O15966J301906J846188K735668
$$ 14457087 12794818 11493936 10673312 10263836 10275527 10891493 12193399 14039587 16775255
13956A6775255L531599M271353M853835M850530M753814M070255K732373J069327
$$ 16775255 20306854 24578207 29432042 34282572 39036386 43106641 45839014 46908341
13948D6908341n56985k145123l350179l977527m095676l650291k783139j621755
$$ 46908341 46351356 44206233 40856054 36878527 32782851 29132560 26349421 24727666
13940B4727666l45547J095849K446599L865956M811680N642808N874009N800845
$$ 24727666 24382119 25477968 27924567 31790523 36602203 42245011 48119020 53919865
13932E3919865N075326L704505K243571O45461j242451k988801m150016m927117
$$ 53919865 58995191 62699696 64943267 65588728 64346277 61357476 57207460 52280343
13924E2280343n255580n014235m414512l460087k385137j144643O32998K351720
$$ 52280343 47024763 42010528 37596016 34135929 31750792 30606149 31239147 33590867
13916C3590867M254559O179544P850419R209662R649303Q983710P571671M888361
$$ 33590867 37845426 44024970 51875389 61085051 70734354 79718064 87289735 92178096
13908I2178096J493358j875754n068238p540369q969918r398729q857637p479957
$$ 92178096 93671454 91795700 86727462 79187093 70217175 60818446 51960809 44480852
13900D4480852n935514m205522k349817n74420R26443K272820L396184M412552
$$ 44480852 38545338 34339816 31989999 31415579 32342022 34614842 38011026 42423578
13892D2423578N191751N397138N328262M584458L308489J687718j81862k176741
$$ 42423578 47615329 53012467 58340729 62925187 66233676 67921394 67739532 65562791
13884F5562791l874804n098126n874891o071513n731551m893996l853611k453739
$$ 65562791 61687987 56589861 50714970 44643457 38911906 34017910 30164299 27710560
13876B7710560j113569L36846J729852K896501L789200M249929M109390L232901
$$ 27710560 26596991 26933837 28663689 31560190 35349390 39599319 43708709 46941610
13868D6941610K090041P13241j057144k656265m019485m755183n021263m827011
$$ 46941610 49031651 49744892 48687748 46031483 42011998 37256815 32235552 27408541
13860B7408541m222854l602969k737427k041696j428819p59533m01861Q1418Q14738
$$ 27408541 23185687 19582718 16845291 14803595 13374776 12615243 12213382 12294800 13109538
13851A3109538J277660J647563K024940K142741J827811J511448R28407J23954
$$ 13109538 14387198 16034761 18059701 20202442 22030253 23541701 24470108 24594062
13843B4594062p56953j436588k043899k424084k462140k419052k190009j883871
$$ 24594062 23837109 22400521 20356622 17932538 15470398 13051346 10861337 8977466
13835H977466j656527j386809j013661p26908n11320l88538m10803k94878k77640
$$ 8977466 7320939 5934130 4920469 4193561 3682241 3293703 2882900 2588022 2310382
13826B310382j58502j66685j68422p2744l3483m0985O46m0744j14522p9069n2188
$$ 2310382 2151880 1985195 1816773 1744029 1710546 1669561 1670207 1629463 1514941 1435872 1383684
13815A383684K0148J42585j8854j94946r9579q6129p5844j02101j07325J51110
$$ 1383684 1403832 1546417 1527563 1332617 1233038 1146909 1071065 968964 861639 1012749
13805A012749J52878o7462j01539j13540q8402K2205j7849L8806j7035p2330m5151
$$ 1012749 1165627 1098165 996626 883086 794684 816889 799040 837846 820811 748481 703330
13794G03330M6428p6672q4398q093l5125j24671p6794M8465Q1585N8632J3772
$$ 703330 749758 673086 588688 580595 545470 420799 344005 392470 474055 532687 546459
13783E46459o7906J7868j2600k3920l62k38O4905M2943k5959Q0202q4703q880
$$ 546459 478553 496421 483821 459901 459539 459301 524206 567149 541190 621392 536689 527809
13771E27809P7825R7759Q5863l2113m5200J3147p2470n2848j67248l3928O8325
$$ 527809 605634 703393 789256 757143 711943 725090 652620 599772 432524 398596 466921
13760D66921J38993Q6360p8954L7895m8530j84413k3548K9671M4708o0731J8281
$$ 466921 605914 692274 613320 651215 602685 418272 394724 424395 469103 408372 426653
$$ [...]
##END NTUPLES=NMR SPECTRUM
##END=
