##TITLE=Analysis number 327126
Compound Code cd 00064
Project Code adrs
Chemist Name stores
##JCAMPDX= 6.0         $$ Bruker NMR JCAMP-DX V2.0
##DATA TYPE= NMR SPECTRUM
##DATA CLASS= NTUPLES
##ORIGIN= Bruker BioSpin GmbH
##OWNER= nmr
$$ XWIN-NMR		Version 3.5
$$ Tue Mar 13 09:01:47 2007 GMT Standard Time (UT+0h)  MAYBRIDGE\nmr@NMR_250MHZ
##.OBSERVE FREQUENCY= 250.131544655141
##.OBSERVE NUCLEUS= ^1H
##.ACQUISITION MODE= SIMULTANEOUS (DQD)
##.ACQUISITION SCHEME= undefined
##.AVERAGES= 16
##.DIGITISER RES= 18
##SPECTROMETER/DATA SYSTEM= dpx250
##.PULSE SEQUENCE= zg30
##.SOLVENT NAME= DMSO
##.SHIFT REFERENCE= (INTERNAL, DMSO, 0, 16.522)
##AUDIT TRAIL= $$ (NUMBER, WHEN, WHO, WHERE, WHAT)
$$ ##TITLE= Audit trail, XWIN-NMR		Version 3.5
$$ ##JCAMPDX= 5.01
$$ ##ORIGIN= Bruker BioSpin GmbH
$$ ##OWNER= nmr
$$ C:\u/data/dgb/nmr/ADRS/720/pdata/1/auditp.txt
$$ ##AUDIT TRAIL=  $$ (NUMBER, WHEN, WHO, WHERE, WHAT)
(   1,<2007-03-13 09:01:27.12 +000>,<MAYBRIDGE\nmr>,<NMR_250MHZ>,
      <created by zg, POWCHK disabled, PULCHK disabled
       configuration hash MD5:
       49 4B E0 1D 92 C2 6B 37 9F E6 65 BC 52 41 86 1D
       data hash MD5: 64K
       10 6A 20 EE 62 FE 1A E5 D5 51 13 79 72 79 FB E0>)
(   2,<2007-03-13 09:01:38.11 +000>,<MAYBRIDGE\nmr>,<NMR_250MHZ>,
      <Start of raw data processing
       ef LB = 0.3 FT_mod = 6 PKNL = 1 SI = 32K 
       data hash MD5: 32K
       47 1C 9D DE D3 09 A4 E2 CF D5 EC FA 75 F9 AD AA>)
(   3,<2007-03-13 09:01:40.21 +000>,<MAYBRIDGE\nmr>,<NMR_250MHZ>,
      <apk 
       data hash MD5: 32K
       14 AD B1 05 11 A1 2B 0A 1E 02 74 D2 05 A3 85 BE>)
(   4,<2007-03-13 09:01:40.98 +000>,<MAYBRIDGE\nmr>,<NMR_250MHZ>,
      <abs ABSG = 5 
       data hash MD5: 32K
       E1 54 66 39 DA 6F 4D BB 1C F3 E1 31 FD 14 93 07>)
$$ ##END=
$$ 
$$ hash MD5
$$ 8E 2F EC 14 17 0C A3 11 FD 5D 1D D6 70 F0 F0 75
##$RELAX= 
##$RELAX= 
##$RELAX= 
##$RELAX= 
##$RELAX= 
##$RELAX= 
##$RELAX= 
$$ Bruker specific parameters
$$ --------------------------
##$DU= <C:\u>
##$EXPNO= 720
##$NAME= <ADRS>
##$PROCNO= 1
##$TYPE= <nmr>
##$USER= <dgb>
##$AMP= (0..31)
100 100 100 100 100 100 100 100 100 100 100 100 100 100 100 100 100 100 
100 100 100 100 100 100 100 100 100 100 100 100 100 100 
##$AQSEQ= 0
##$AQ_mod= 3
##$AUNM= <au_zg>
##$AUTOPOS= <59 >
##$BF1= 250.13
##$BF2= 250.13
##$BF3= 250.13
##$BF4= 250.13
##$BF5= 500.13
##$BF6= 500.13
##$BF7= 500.13
##$BF8= 500.13
##$BYTORDA= 1
##$CFDGTYP= 0
##$CFRGTYP= 5
##$CHEMSTR= <none>
##$CNST= (0..31)
1 1 145 1 1 1 1 1 1 1 1 1 1 1 1 1 1 1 1 1 1 1 1 1 1 1 1 1 1 1 1 1 
##$CPDPRG= <>
##$CPDPRG1= <>
##$CPDPRG2= <>
##$CPDPRG3= <>
##$CPDPRG4= <mlev>
##$CPDPRG5= <mlev>
##$CPDPRG6= <mlev>
##$CPDPRG7= <mlev>
##$CPDPRG8= <mlev>
##$CPDPRGB= <>
##$CPDPRGT= <>
##$D= (0..31)
0 1 0 0 0 0 0 0 0 0.06 0 0 0 0 0 0 0.0002 0 0 0 0 0 0 0 0 0 0 0 0 0 0 
0 
##$DATE= 1173776486
##$DBL= (0..7)
120 120 120 120 120 120 120 120 
##$DBP= (0..7)
150 150 150 150 150 150 150 150 
##$DBP07= 0
##$DBPNAM0= <>
##$DBPNAM1= <>
##$DBPNAM2= <>
##$DBPNAM3= <>
$$ [...]
##$SUBNAM7= <"">
##$SUBNAM8= <"">
##$SUBNAM9= <"">
##$SW= 20.6930455092707
##$SWIBOX= (0..15)
0 0 3 0 0 0 0 0 0 0 0 0 0 0 0 0 
##$SW_h= 5175.983436853
##$TD= 65536
##$TD0= 1
##$TE= 683.16
##$TE2= 300
##$TE3= 300
##$TEG= 300
##$TL= (0..7)
0 120 120 120 120 120 120 120 
##$TP= (0..7)
150 150 150 150 150 150 150 150 
##$TP07= 0
##$TPNAME0= <>
##$TPNAME1= <>
##$TPNAME2= <>
##$TPNAME3= <>
##$TPNAME4= <>
##$TPNAME5= <>
##$TPNAME6= <>
##$TPNAME7= <>
##$TPOAL= (0..7)
0.5 0.5 0.5 0.5 0.5 0.5 0.5 0.5 
##$TPOFFS= (0..7)
0 0 0 0 0 0 0 0 
##$TUNHIN= 0
##$TUNHOUT= 0
##$TUNXOUT= 0
##$USERA1= <user>
##$USERA2= <user>
##$USERA3= <user>
##$USERA4= <user>
##$USERA5= <user>
##$V9= 5
##$VALIST= <valist>
##$VCLIST= <CCCCCCCCCCCCCCC>
##$VD= 0
##$VDLIST= <DDDDDDDDDDDDDDD>
##$VPLIST= <PPPPPPPPPPPPPPP>
##$VTLIST= <TTTTTTTTTTTTTTT>
##$WBST= 1024
##$WBSW= 4
##$XGAIN= (0..3)
0 0 0 0 
##$XL= 0
##$YL= 0
##$YMAX_a= 426759
##$YMIN_a= -471293
##$ZGOPTNS= <>
##$ZL1= 120
##$ZL2= 120
##$ZL3= 120
##$ZL4= 120
##$ABSF1= 16.522
##$ABSF2= -4.171173
##$ABSG= 5
##$ABSL= 3
##$ALPHA= 0
##$AQORDER= 0
##$ASSFAC= 0
##$ASSFACI= 0
##$ASSFACX= 0
##$ASSWID= 0
##$AUNMP= <proc_1d>
##$AZFE= 0.1
##$AZFW= 0.1
##$BCFW= 0
##$BC_mod= 0
##$BYTORDP= 0
##$COROFFS= 0
##$CY= 12.5
##$DATMOD= 1
##$DC= 0
##$DFILT= <>
##$DTYPP= 0
##$F1P= 14.0000005364418
##$F2P= -0.99999901652339
##$FCOR= 0.5
##$FTSIZE= 32768
##$FT_mod= 6
##$GAMMA= 0
##$GB= 0
##$INTBC= 1
##$INTSCL= 1
##$ISEN= 128
##$LB= 0.3
##$LEV0= 0
##$LPBIN= 0
##$MAXI= 10000
##$MC2= 0
##$MEAN= 0
##$ME_mod= 0
##$MI= 0
##$NCOEF= 0
##$NC_proc= -5
##$NLEV= 6
##$NOISF1= 0
##$NOISF2= 0
##$NSP= 0
##$NTH_PI= 0
##$NZP= 0
##$OFFSET= 16.522
##$PC= 1
##$PHC0= 227.6611
##$PHC1= -6.424253
##$PH_mod= 1
##$PKNL= yes
##$PPARMOD= 0
##$PSCAL= 4
##$PSIGN= 0
##$REVERSE= no
##$SF= 250.13
##$SI= 32768
##$SIGF1= 0
##$SIGF2= 0
##$SINO= 400
##$SIOLD= 32768
##$SREGLST= <1H.DMSO>
##$SSB= 0
##$STSI= 32768
##$STSR= 0
##$SW_p= 5175.98343685301
##$SYMM= 0
##$S_DEV= 0
##$TDeff= 65536
##$TDoff= 0
##$TI= <Analysis number 999999
Compound Code 99
Book Reference 9
Project Code 9>
##$TILT= no
##$TM1= 0
##$TM2= 0
##$TOPLEV= 0
##$USERP1= <user>
##$USERP2= <user>
##$USERP3= <user>
##$USERP4= <user>
##$USERP5= <user>
##$WDW= 1
##$XDIM= 32768
##$YMAX_p= 384741214
##$YMIN_p= -243141
$$ End of Bruker specific parameters
$$ ---------------------------------
##NTUPLES= NMR SPECTRUM
##VAR_NAME=  FREQUENCY,     SPECTRUM/REAL,   SPECTRUM/IMAG
##SYMBOL=    X,             R,               I
##VAR_TYPE=  INDEPENDENT,   DEPENDENT,       DEPENDENT
##VAR_FORM=  AFFN,          ASDF,            ASDF
##VAR_DIM=   32768,         32768,           32768
##UNITS=     HZ,            ARBITRARY UNITS, ARBITRARY UNITS
##FACTOR=    0.157963299565203, 1,           1
##FIRST=     4132.6476996994, 0,             0
##LAST=      -1043.33573715361, 0,           0
##MIN=       -1043.33573715361, -243141,     0
##MAX=       4132.6476996994, 384741214,     0
$$ Real data points
##PAGE= N=1
##DATA TABLE= (X++(R..R)), XYDATA
$$ [...]
15560e7177K2108j1844L7525J248J22l0461O482O540m1204k1119J2818n519J3742
$$ -57177 -35069 -46913 -9388 -8140 -8018 -38479 -31997 -25457 -66661 -87780 -74962 -80481 -66739
15547f6739K6616O4996J03039m6366p3938J2520j7593q272M441q910j1857j1726
$$ -66739 -40123 24873 127912 81546 7608 20128 2535 -5737 -1296 -10206 -22063 -33789
15535c3789j158k9026K0547K97j060l7291l1797O846L4603j1385l3214L1984M7164
$$ -33789 -34947 -63973 -43426 -43129 -44189 -81480 -113277 -106431 -71828 -83213 -116427 -84443 -37279
15522c7279P191l3118p139l3348O9863L8830K8824j8825j4646n904q962l7263
$$ -37279 -30088 -63206 -70345 -103693 -33830 5000 33824 14999 353 -5551 -14513 -51776
15510e1776m6907o527O3519M886k3123J0226K4930R0874k6946p2618o501L3236
$$ -51776 -98683 -105210 -41691 -36805 -59928 -49702 -24772 66102 39156 -33462 -39963 -6727
15498f727J8561m0588n372j1871m1873Q743L8188J939K6025P191l1968k3005p690
$$ -6727 11834 -28754 -34126 -45997 -87870 -79127 -40939 -39000 -12975 -5784 -37752 -60757 -68447
15485f8447j4480M7649O097l3179M7388K26n2926M2112N2868m0132o0810N5578
$$ -68447 -82927 -35278 -29181 -62360 -14972 -14746 -67672 -25560 27308 -12824 -73634 -18056
15473a8056l1914l2846J8773O8605J0048j4694K1953M428M667J3283l3092m8739
$$ -18056 -49970 -82816 -64043 4562 14610 -84 21869 26297 30964 44247 11155 -37584
15461c7584k7426J9119k0450J9244m1848j0435L0999J5084j9248J1309J3134R876
$$ -37584 -65010 -45891 -66341 -47097 -88945 -99380 -68381 -53297 -72545 -61236 -48102 -38226
15449c8226J3119P814J2880n4985n1739r305k7081J1878Q0523J3818j8385k2855
$$ -38226 -25107 -17293 -4413 -59398 -111137 -120442 -147523 -135645 -55122 -41304 -59689 -82544
15437h2544J0285n70P6589M4084m0518k8461j6983M545J3631K7593n462J0306
$$ -82544 -72259 -72829 3760 47844 7326 -21135 -38118 -33573 -19942 7651 2189 12495
15425A2495J7016J6330R165m2913j4773m0750N3518L9003n1817j5308J04221j9606
$$ 12495 29511 45841 55006 12093 -2680 -43430 10088 49091 -2726 -18034 86187 66581
15413F6581m3747n798k7512L539q809j9976n5448o019N2894j9649q267L0962L809
$$ 66581 22834 17036 -10476 -6937 -15746 -35722 -91170 -97189 -44295 -63944 -72211 -41249 -37440
15400c7440j0724l2694l720L8455J1491m3847L7835K4915k0351j2862r976M4876
$$ -37440 -48164 -80858 -84578 -46123 -34632 -78479 -40644 -15729 -36080 -48942 -58918 -14042
15388a4042O617L017O834Q251k650Q93P257p5622l0894J1899J4279p3189K8461
$$ -14042 -7425 -4408 2426 10677 8027 8920 16177 -59445 -90339 -78440 -64161 -137350 -108889
15375a08889P5094N7534Q718l1789n245O8517L9474l4195n6096j9425L2450k0175
$$ -108889 -33795 23739 32457 668 -4577 63940 103414 69219 13123 -6302 26148 5973
15363E973l3701J0411J5553n311m040M0829n086j8047J7954J9713J7820l0229
$$ 5973 -27728 -17317 -1764 -7075 -11115 29714 24628 6581 24535 44248 62068 31839
15351C1839j2462j5596k2126l0633k432L3240K3014L4247j4353m1431l6842R746
$$ 31839 19377 3781 -18345 -48978 -51410 -18170 4844 39091 24738 -16693 -53535 -43789
15339d3789N159J0404K7906j2521J7191R4j22416m6137Q3932L4744K8451q742
$$ -43789 -38630 -28226 -320 -12841 4350 4444 -117972 -164109 -80177 -45433 -16982 -25724
15327b5724m6834k484K9179j2886r211M5721l506k030l1190k7070K5107L6465
$$ -25724 -72558 -75042 -45863 -58749 -67960 -22239 -25745 -27775 -58965 -86035 -60928 -24463
15315b4463k5460l0473L5194m771L0560N346l6547r634n4324l758K6172j3354
$$ -24463 -49923 -80396 -45202 -49973 -19413 -14067 -50614 -60248 -114572 -118330 -92158 -105512
15303a05512N371k3619L6229j8623J2362J7063K7447M2671p897k8465m4646k7384
$$ -105512 -100141 -123760 -87531 -106154 -93792 -76729 -49282 -6611 -14508 -42973 -87619 -115003
15291a15003L8619K7730K7910K6278L3164n7132o0051J3706N5826k2694k1087
$$ -115003 -76384 -48654 -20744 5534 38698 -18434 -78485 -64779 -8953 -31647 -52734
15280e2734K7836L3938L2036j2967o5497j4855r585N441l8240j8697k1388K397
$$ -52734 -24898 9040 41076 28109 -37388 -52243 -61828 -56387 -94627 -113324 -134712 -132315
15268a32315J8278j1035O442M6658O7424j3932m0524L4433N1887K9093n3648k7009
$$ -132315 -114037 -125072 -118630 -71972 -4548 -18480 -59004 -24571 27316 56409 2761 -24248
15256b4248M7487O6776j4518k9979l1016K2546L7052k0114o778q892m2950m1025
$$ -24248 23239 90015 75497 45518 14502 37048 74100 53986 47208 38316 -4634 -45659
15244d5659P795o9252j5645O8635N9234K5829K6270L268j4653m6324k4179J1516
$$ -45659 -37864 -107116 -122761 -54126 5108 30937 57207 60475 45822 -502 -24681 -13165
15232a3165J1822J2450R55o321k577j7085j9774p643J6704n248M2847L2298k0949
$$ -13165 -1343 11107 12062 5741 3164 -13921 -33695 -41338 -24634 -29882 12965 45263 24314
15219B4314k6966k4644j0311J0706J6456N1376P085O602J0905k6887m0530J0522
$$ 24314 -2652 -27296 -37607 -26901 -10445 40931 48016 54618 65523 38636 -1894 8628
15207H628J8685N808l9670J7068J1410m8453L1082O2765j4506j5833J2425K8886
$$ 8628 27313 33121 -6549 10519 21929 -26524 4558 67323 52817 36984 49409 78295
15195G8295K625m7206l5960l9705o1577K9416l444n403K620k0014O209P0811l636
$$ 78295 80920 33714 -2246 -41951 -103528 -74112 -77556 -82959 -80339 -100353 -94144 -23333 -26969
15182b6969J5655L1244L149q757M7238N162m7135O969j0547N213K1155j710J3619
$$ -26969 -11314 19930 23079 14322 61560 66722 19587 26556 16009 21222 42377 40667 54286
15169E4286l2197p580k0861o0615K2512M6132M159j10842J3943L1117J6285r973
$$ 54286 22089 14509 -6352 -66967 -44455 1677 5836 -105006 -91063 -59946 -43661 -53634
15157e3634m558M5926M7197M9105k0959j4531j2233n2170r465R354J1534N6376
$$ -53634 -58192 -12266 34931 84036 63077 48546 36313 -15857 -25322 -15968 -4434 51942
15145E1942j1142J5314k791P232K6214Q302P85J0139j8779l0846P1041N1084j7448
$$ 51942 40800 56114 53323 60555 86769 95071 95856 105995 87216 56370 127411 178495 161047
15132A61047k7981k2206m1095k0l2827j1765K7053L7157n0154m6379M72N7446
$$ 161047 133066 110860 69765 69745 36918 25153 52206 89363 39209 -7170 -6698 50748
15120E0748J6084o3133l0093K789L1502N5914J9873n6092o2651p875K3295J5470
$$ 50748 66832 3699 -26394 -23605 7897 63811 83684 27592 -35059 -42934 -19639 -4169
15108d169k1160m8903L229O5422K3817j2993J1426j226O922n4252n6559m2192
$$ -4169 -25329 -74232 -71003 -5581 18236 5243 16669 15443 22365 -31887 -88446 -130638
15096a30638m210N4018L3350j0460r737M7972N1019J4804o9732q1870l384M6058
$$ -130638 -134848 -80830 -47480 -57940 -67677 -19705 31314 46118 -23614 -105484 -108868 -62810
15084f2810j5991J757M6654L7296M8473M882p64k342L3630m5808m9580m4540J9578
$$ -62810 -78801 -77044 -30390 6906 55379 60261 59497 57155 90785 44977 -4603 -49143 -29565
15071b9565L9417K8661O135l0434k1397r32K2904l2848q34k8030l657L5526j1887
$$ -29565 9852 38513 44648 14214 -7183 -8115 14789 -18059 -18893 -46923 -50580 -15054 -26941
15058b6941l2037j3524k470M9797N3901L1895L935m9847k9894j9015M6841J5834
$$ -26941 -58978 -72502 -74972 -25175 28726 60621 64556 14709 -15185 -34200 12641 28475
15046B8475k4736j8977k1771q037K8550K7339J619l3438j0881m7573m0484L1565
$$ 28475 3739 -15238 -37009 -45046 -16496 10843 12462 -20976 -31857 -79430 -119914 -88349
15034h8349M3558L510P92j8931M580p240p772J2238J2410N926N456M2908J9547
$$ -88349 -44791 -41281 -40489 -59420 -54840 -62080 -69852 -57614 -45204 -39278 -33822 9086 28633
15021B8633M5021m5849p294R166n0600n3968k2269l0969J2020O4012O3697L9359
$$ 28633 73654 27805 20511 29677 -20923 -74891 -97160 -128129 -116109 -52097 11600 50959
15009E0959m0942J0626J0533O0096l800m9595M302P592k9457j4696k0876J0226
$$ 50959 10017 20643 31176 91272 87472 37877 42179 49771 20314 5618 -15258 -5032
14997e032N7292J9599J5901K6556P715J0448l4104n5749J669j1756R401K4041
$$ -5032 52260 71859 87760 114316 122031 132479 98375 42626 44295 32539 41940 65981
14985F5981l8188k6731n103L6223j5095K0699K916M233j1487n2682K4039j6793
$$ 65981 27793 1062 -4041 32182 17087 37786 40702 44935 33448 -19234 4805 -11988
14973a1988p0741k21J3012p117M2352L8911k6042l9670K5185J11151N8153l4770
$$ -11988 -82729 -82950 -69938 -77055 -34703 4208 -21834 -61504 -36319 74832 132985 98215
14961I8215m4485m8691l7233l7112l7747J2064O8212N7056L4682k6767l0953j5033
$$ 98215 53730 5039 -32194 -69306 -107053 -94989 -26777 30279 64961 38194 7241 -7792
14949g792J6268K5040m1156L6607N474m1477j2196j2878L1169l3137l4910N1608
$$ -7792 8476 33516 -7640 28967 34441 -7036 -19232 -32110 -941 -34078 -68988 -17380
14937a7380O2692n647k3636Q267O6459L4818m9146n5080M7930j5325j7995n2592
$$ -17380 45312 39665 16029 24296 90755 125573 76427 21347 69277 53952 35957 -16635
14925a6635l4529k286K1932L0275K1100k9671l269J5119l0039l2974M8712k2568
$$ -16635 -51164 -53450 -31518 -1243 19857 -9814 -13083 2036 -28003 -60977 -12265 -34833
14913c4833M560j5496K3047o289k9463O262J3185M1765j0705L2530J5876M9516
$$ -34833 -30273 -45769 -22722 -29011 -58474 -52212 -39027 2738 -7967 24563 40439 89955
14901H9955n1433o981L2017o0507m3044O7427L9413m5606l6558K4768L6394j1952
$$ 89955 38522 31541 63558 3051 -39993 27434 66847 21241 -15317 9451 45845 33893
14889C3893j9577K716p635P259k0299k2408l6040k7723L6290K3311M566K9503
$$ 33893 14316 17032 9397 16656 -3643 -26051 -62091 -89814 -53524 -30213 -25647 3856
14877C856J7963Q747M085P339l265J2996n1026k5927N1339Q2684k065o1434k9955
$$ 3856 21819 30566 34651 41990 38725 51721 695 -25232 26107 108791 106726 45292 15337
14864A5337j3600j9146m068n372M1101J0621l7370n214L2571J5764m1204j6231
$$ 15337 1737 -17409 -21477 -26849 14252 24873 -12497 -17711 14860 30624 -10580 -26811
14852b6811L650j3307j7365j8984n654J0761N5003m20m6238l877l869N825M173
$$ -26811 -23161 -36468 -53833 -72817 -78471 -67710 -12707 -13127 -59365 -63242 -67111 -61286 -57113
14839e7113L478Q288l2901K5718L6359j972j3313k2882P632L4672J9407M2084
$$ -57113 -53635 -45347 -78248 -52530 -16171 -18143 -31456 -54338 -46706 -12034 7373 49457
14827D9457K9365n5189m2907l3990J1325L6698L5568M270r639m2674m2108l953
$$ 49457 78822 23633 -19274 -53264 -41939 -5241 30327 34597 24958 -17716 -59824 -63777
14815f3777N3865M452o8608R543J7669k4363k6237n085l776N0202L7213J8210
$$ -63777 -9912 -5460 -74068 -64525 -46856 -71219 -97456 -102541 -106317 -56115 -18902 -692
14803f92R212L4175k1842K0706K889J1344R752l084m5701q9551J772M427l0816
$$ -692 8520 42695 20853 41559 44448 55792 65544 62460 16759 -72792 -71020 -66593 -97409
14790i7409m8171L3566j5595k5892O868M3008L7110l071R295N0224L1996l2896
$$ -97409 -145580 -112014 -127609 -153501 -146633 -103625 -66515 -69586 -60291 -10067 21929 -10967
14778a0967m2869O3087O7822J295p6105m3505m9782l8958l2518K2769R339L9398
$$ -10967 -53836 9251 77073 78368 2263 -41242 -91024 -129982 -162500 -139731 -130392 -90994
14766i0994M7503j5026M981M241m0386k8118L9619J9933R373j6171L1456p464
$$ -90994 -43491 -58517 -53536 -49295 -89681 -117799 -78180 -58247 -48874 -65045 -33589 -41053
14754d1053N02l1044j1373p084L206M0411L3641j2424J2386j681j422P20M744
$$ -41053 -40551 -71595 -82968 -90052 -86846 -46435 -12794 -25218 -12832 -14513 -15935 -15215 -10471
14741a0471j5356j4802K3788J6339j9537l946Q744J685j3976j422J8359L973l2332
$$ -10471 -25827 -40629 -16841 -502 -20039 -23985 -15241 -13556 -27532 -28954 -10595 -6622 -38954
14728c8954J463j8427l9816M9862O1014P9355m7873l8376L3593J7373j1419n1906
$$ -38954 -37491 -55918 -95734 -45872 15142 94497 46624 8248 41841 59214 47795 -4111
14716d111l4811j4976O5244K2079o476p102k9805J0209l938R79L0701n0103n5572
$$ -4111 -38922 -53898 11346 33425 26949 19847 -9958 251 -3687 -2708 27993 -22110 -77682
14703g7682J3718J0960l5734m5014m783K1966N1897L8638j495J6286n463J9825
$$ -77682 -63964 -53004 -88738 -133752 -138535 -116569 -64672 -26034 -27529 -11243 -16706 3119
14691C119K2072J8109P550J1292N690N992K4027m1127k6008J3801o3905k1907
$$ 3119 25191 43300 50850 62142 67832 73824 97851 56724 30716 44517 -19388 -41295
14679d1295n538K0605k8785j0119N5462K0981m4391m9661k1161Q5686J23877L4786
$$ -41295 -46833 -26228 -55013 -65132 -9670 11311 -33080 -82741 -103902 -18216 105661 140447
14667A40447p5829p3514J583O7812J4233k3583j3924n9502m8179Q999K6805O4008
$$ 140447 64618 -8896 -7313 60499 74732 51149 37225 -22277 -70456 -61457 -34652 29356
14655B9356L8377m913N1797k0686r8697k1929K5764L4370j9680J9244j3386J7076
$$ 29356 67733 62820 114617 93931 -4766 -26695 -931 33439 13759 33003 19617 36693
14643C6693J7717K7738k3878J1460l6420K1056j9802k0324M0907J3365K2907l4730
$$ 36693 54410 82148 58270 69730 33310 54366 34564 14240 55147 68512 91419 56689
14631E6689n0223l2688k903M2855j0446J1910k9888K2893q598p641J2421J6647
$$ 56689 6466 -26222 -29125 13730 3284 15194 -14694 8199 -399 -8040 4381 21028
14619B1028Q3558N075O187R862j7788K558K8393l945k1836L047j2623j7959J1500
$$ 21028 104586 109661 115848 125710 107922 110480 138873 134928 113092 116139 103516 85557 97057
14606I7057m6799l7025p925O7087J3419o1353O960R871l1153J767K2885K6620
$$ 97057 50258 13233 5308 72395 85814 24461 31421 41292 10139 11906 34791 61411
14594F1411L3316m866N611j0555p877k4190K5000J8364m9159o9959N149J9287
$$ 61411 94727 89861 95472 84917 77040 52850 77850 96214 47055 -22904 -17755 1532
14582A532L5363O5519j9255K7302J7257m6721p374N6458M0210L1921m7118k8664
$$ 1532 36895 102414 83159 110461 127718 80997 73623 130081 170291 202212 155094 126430
14570A26430k7839p2128p2890M2317R2183R9729M3680m7052k5607J0131m433l2224
$$ 126430 98591 26463 -46427 -4110 88073 187802 231482 184430 158823 168954 164521 132297
14558A32297k298M7521L7443J8734n1799L134M9584L7566J1160m5900k3064j7768
$$ 132297 129999 177520 214963 233697 181898 185032 234616 272182 283342 237442 214378 196610
14546A96610o7859j2568o21Q960n3506K7587J9323k7100k8728k7935j8209M0118
$$ 196610 128751 116183 115562 124522 71016 98603 117926 90826 62098 34163 15954 56072
14534E6072o927j6226m1974K799j715j7012M2858p458O55J7880J8682O0856k1117
$$ 56072 49145 32919 -9055 -6256 -7971 -24983 17875 10417 11072 28952 47634 108490 87373
14521H7373K5471n4572l8024o9448M7280R7018M8167L0695R564J451K9999k1678
$$ 87373 112844 58272 20248 -49200 -1920 95098 143265 173960 183524 184975 214974 193296
14509A93296m4879j9062o7886l3402J3932L5059K6465J1446j816O553p3568l1379
$$ 193296 148417 129355 61469 28067 41999 77058 103523 114969 113153 119706 46138 14759
14497A4759j3359j7313j848k557L7150k4604N02K5494R696l9627Q740K6450N191
$$ 14759 1400 -15913 -17761 -20318 16832 -7772 -7270 18224 27920 -11707 -2967 23483 28674
14484B8674J9306J8624m3250k841K5164O378m8337k9622l9910M421j3833L1964
$$ 28674 47980 66604 23354 20513 45677 52055 3718 -25904 -65814 -61393 -75226 -43262
14472d3262j5363L7619L0653k1103n05p917o0696n738P7816M7769j8507m5140
$$ -43262 -58625 -21006 9647 -11456 -11961 -19878 -80574 -86312 -8496 39273 20766 -24374
14460b4374M3620J5416k845q159k1232o8219m572L1927k1199j7151m514l8923
$$ -24374 19246 34662 31817 23658 2426 -65793 -70365 -38438 -59637 -76788 -81302 -120225
14448a20225M2433K4304R343J21017N3626q6515m9588l2479J1833l4103J9810
$$ -120225 -77792 -53488 -44145 76872 130498 43983 -5605 -38084 -26251 -60354 -40544
14437d0544M9138q91J8986q138m1498l4911K544l3945J1489J4409l9482n0923
$$ -40544 8594 7703 26689 18551 -22947 -57858 -55314 -89259 -77770 -63361 -102843 -153766
14425a53766J1861q701J2630O8718N7462p898l1509k4328M3943P001J8989N4804
$$ -153766 -141905 -150606 -137976 -69258 -11796 -19694 -51203 -75531 -31588 -24587 -5598 49206
14413D9206K0524J291m9607J2731L966k0086K3093j4170n8989o3017q623J7366
$$ 49206 69730 71021 21414 34145 38111 18025 41118 26948 -32041 -95058 -103681 -86315
14401h6315l4196L6609J330J6442K2809J2275k1923m6121K5531M4108L1389N057
$$ -86315 -120511 -83902 -82572 -66130 -43321 -31046 -52969 -99090 -73559 -29451 1938 6995
14389F995k2151k9667K6372K0517O945M685P988L7621J6529r35j2924m4087P236
$$ 6995 -15156 -44823 -18451 2066 9011 13696 21684 59305 75834 74899 61975 17888 25124
14376B5124R3117J1579j9224J50O626K0371j6874n6003r731K9207N25p1653m0385
$$ 25124 118241 129820 110596 110746 117372 137743 120869 64866 55135 84342 84867 13214 -27171
14363b7171j6028k4384Q2298K3098k9518n5154L5429M4994r789k4843K5081J7291
$$ -27171 -43199 -67583 14715 37813 8295 -46859 -11430 33564 23775 -1068 24013 41304
14351D1304j6105m9419J3981L0201J6030o269l141n8359m6539L4343k0290m0206
$$ 41304 25199 -24220 -10239 19962 35992 29723 26582 -31777 -78316 -43973 -64263 -104469
14339a04469l840R0135Q6054j6788l2787o69M9272l7151n3874o374L4766K2852
$$ -104469 -108309 -18174 67880 51092 18305 17636 66908 29757 -24117 -30491 4275 27127
14327B7127K7955l5018k7684K1543j7972J4638J9216m4007l1742l681M7952L7912
$$ 27127 55082 20064 -7620 13923 -4049 10589 29805 -14202 -45944 -49625 -1673 36239
14315C6239Q138j8739l7861K889K604J5822p885j5311K0077o123m6996P288O7637
$$ 36239 44377 25638 -12223 -9334 -6730 9092 1207 -14104 5973 -150 -47146 -39858 27779
14302B7779O2290n0059o2442K9193j7614K2213k1035p257L5840l3134K8414K9109
$$ 27779 90069 40010 -22432 6761 -10853 11360 -9675 -16932 18908 -14226 14188 43297
14290D3297k4636P432j7307K5985L5678p667m8344p1652N153K104L0492L5713
$$ 43297 18661 26093 8786 34771 70449 62782 14438 -57214 -52061 -49957 -19465 16248
14278A6248k7131m4892L211m3024j7537M8343J8885M6785L395k6964k3486j2028
$$ 16248 -10883 -55775 -52564 -95588 -113125 -64782 -45897 888 4283 -22681 -46167 -58195
14266e8195o115R992J6742L9433k4167l9735J1014P3755j7304m0641l7768k6647
$$ -58195 -64310 -54318 -37576 1857 -22310 -62045 -51031 22724 5420 -35221 -72989 -99636
14254i9636j4467J9885K5282j5989l6059K5428M3973J0833j0546m0252j7549M8798
$$ -99636 -114103 -94218 -68936 -84925 -120984 -95556 -51583 -40750 -51296 -91548 -109097 -60299
14242f0299M5881K2397P2637j2306k0201k9594K981m744m0165M1824l830J2366
$$ -60299 -14418 7979 80616 68310 48109 18515 21496 16752 -23413 18411 14581 26947
14230B6947L6391j2717n8748k4678k6921M44M2881l3l8875L0068l4830l5958J3260
$$ 26947 63338 50621 -8127 -32805 -59726 -59282 -16401 -16434 -55309 -25241 -60071 -96029 -82769
14217h2769L5645K0232o2079l0516M9505j9340l3952l0522J6978J8290P3440R574
$$ -82769 -47124 -26892 -88971 -119487 -69982 -89322 -123274 -153796 -136818 -118528 -45088 -35514
14205c5514o2382k1060O8038P6111p425o1712j9425K4144M5565r775k7876k5007
$$ -35514 -97896 -118956 -50918 25193 17768 -43944 -63369 -39225 6340 -3435 -31311 -56318
14193e6318j8366q9150p3521L1920N0209O8752N2613L0104m299p510J6764Q574
$$ -56318 -74684 -163834 -237355 -205435 -155226 -86474 -33861 -3757 -8056 -15566 1198 9772
14181I772j341j0758j1929k5635k3262Q04L1112L2518J140J0743J7961l1418j4858
$$ 9772 8431 -2327 -14256 -39891 -63153 -62349 -31237 1281 2421 13164 31125 -293 -15151
14168a5151l2871p190j3950l7304J4119K0841j814L0505j4842M4391K474j3737
$$ -15151 -48022 -55212 -69162 -106466 -92347 -71506 -73320 -42815 -57657 -13266 -10792 -24529
14156b4529P507J8689P419m1777J834J778m1733k944J0699n1018M1387P7529n019
$$ -24529 -17022 1667 9086 -32691 -30857 -29079 -70812 -73756 -63057 -114075 -72688 4841 -178
14143a78m9329L188k5177l460J8644J7917j7448k6896L4150M2318j2603n436m5924
$$ -178 -49507 -46319 -71496 -74956 -56312 -38395 -55843 -82739 -48589 -6271 -18874 -24310 -70234
14130g0234m82N054N9022l0574k7521L9455n7842M4810Q48L045k3344J1010J4752
$$ -70234 -70716 -65662 -6640 -37214 -64735 -25280 -83122 -38312 -37464 -34419 -57763 -46753 -32001
14117c2001j0266j0460j0435M2443J4922r73L2474K1658m3606m0223j4639m53
$$ -32001 -42267 -52727 -63162 -20719 -5797 -6770 25704 47362 3756 -36467 -51106 -51559
14105e1559L9563j1675l8806L9908r185m2095k3319N3850O528k3499J2739m9011
$$ -51559 -11996 -23671 -62477 -22569 -31754 -73849 -97168 -43318 -36790 -60289 -47550 -96561
14093i6561j4895J3078K298M4408o441l8373L6492j2783J4848J0375o432N8458
$$ -96561 -111456 -98378 -96080 -51672 -58113 -96486 -59994 -72777 -57929 -47554 -53986 4472
14081D472J3458j234l0268l2324N030j6384j918j4849M6408n385l2555J2406n401
$$ 4472 17930 16696 -13572 -45896 -40866 -57250 -59168 -74017 -27609 -32994 -65549 -53143 -58544
14068e8544m4359l9263L3364K3401J5021K5533Q351L4094O153k5550m845n1075
$$ -58544 -102903 -142166 -108802 -85401 -70380 -44847 -36496 -2402 3751 -21799 -26644 -77719
14056g7719q085M5448k2501o9571L9516J40111P6852o8298r5960k8975j4658J942
$$ -77719 -85804 -40356 -62857 -132428 -92912 47199 124051 55753 -40207 -69182 -83840 -81898
14044h1898p062k330L4802n618N104l7607n3157k6443M0708M3372L7789K4498
$$ -81898 -88960 -91290 -56488 -62106 -57002 -94609 -147766 -174209 -133501 -90129 -52340 -27842
14032b7842j6257m1720J1170O3295K2293L4531N5364j949l8364l1725q503j623
$$ -27842 -44099 -85819 -74649 -11354 10939 45470 100834 98885 60521 28796 20293 18670
14020A8670J3317j6430k2972j1376p3563k1636J3771Q226k8292K450L1102J2814
$$ 18670 31987 15557 -7415 -18791 -92354 -113990 -100219 -91993 -120285 -117835 -86733 -73919
14008g3919j2218l070K2625J7721M5797L4876m3751l8231L795k6921J7289N438
$$ -73919 -86137 -89207 -66582 -48861 -3064 31812 -11939 -50170 -46375 -73296 -56007 -50569
13996e0569R703J8469j3736r942j206K5017r371R372J2652j6979m911N8103j0698
$$ -50569 -40866 -22397 -36133 -46075 -47281 -22264 -31635 -22263 -9611 -26590 -31501 26602 15904
13983A5904k2967l2307k5229k0725O226r17K6390P6790K6585N039o5345k2052
$$ 15904 -7063 -39370 -64599 -85324 -79098 -80015 -53625 23165 49750 54789 -10556 -32608
13971c2608Q497J4154l0040m1818j473P0656K8063n4079o2881J7600K3794j7599
$$ -32608 -24111 -9957 -39997 -81815 -83288 -12632 15431 -38648 -101529 -83929 -60135 -77734
13959g7734K9186k9303O630J1662L3004J675j3540J0917l7306l0895K6695K3341
$$ -77734 -48548 -77851 -71221 -59559 -26555 -24880 -38420 -27503 -64809 -95704 -69009 -45668
13947d5668J7841L178q105j9248m632M1481M254p8568P070k5449K5320K4458k0514
$$ -45668 -27827 -24649 -32754 -52002 -56634 -15153 -10899 -89467 -82397 -107846 -82526 -58068 -78582
13934g8582N119M6587K6693j2299j7437J8266j8353k2142k1249J5794M099L8056
$$ -78582 -73463 -26876 -183 -12482 -29919 -11653 -30006 -52148 -73397 -57603 -53504 -15448
13922a5448m1150l9629L6277J4046j9079K2732K400j7677J2283L005J6396K7452
$$ -15448 -56598 -96227 -59950 -45904 -64983 -42251 -39851 -57528 -45245 -42240 -25844 1608
13910A608L6398K2882q723k4392L499k4500l1182N2699J3760J3381K4309j889
$$ 1608 38006 60888 52165 27773 31272 6772 -24410 28289 42049 55430 79739 77850
13898G7850l3436l5180l7840k2639N8596r840R009O9417N077n4194m6510J4452
$$ 77850 44414 9234 -28606 -51245 7351 -2489 6520 75937 81014 26820 -19690 -5238
13886e238K9480K9594M669R571J1122n5532l2387k507J8111N464K4876K4362j4481
$$ -5238 24242 53836 58505 68076 79198 23666 -8721 -11228 6883 12347 37223 61585 47104
13873D7104j6348k8936M102l317l0557k5257k3389n5169M259L7989O3492K5822
$$ 47104 30756 1820 5922 2605 -27952 -53209 -76598 -131767 -127508 -89519 -26027 -205
13861b05l5402j5749K6739N23J0205L9092j3651m951K1919P441r588p9552m0212
$$ -205 -35607 -51356 -24617 -24094 -13889 25203 11552 6601 28520 35961 26373 -53179 -93391
13848i3391M4397L6502K0488j1518J4089J4117k8510m7795J3529J1785J9591J1928
$$ -93391 -48994 -12492 7996 -3522 10567 24684 -3826 -51621 -38092 -26307 -6716 5212
13836E212M7213K3491n2789m3781l1441J7454N1202L427p1661R988L6960j8826
$$ 5212 52425 75916 23127 -20654 -52095 -34641 16561 19988 -51673 -41685 -4725 -23551
13824b3551j9687J6974J5042J9331K0972L2712l011k1297l8075N0660p326m1690
$$ -23551 -43238 -26264 -11222 8109 29081 61793 58782 37485 -590 50070 42744 1054
13812A054K3384L7218P693J582k2127k9214l5778N5096L2194m4453k4780j771
$$ 1054 24438 61656 69349 70931 48804 19590 -16188 38908 71102 26649 1869 98
13800I8J2558j7404o127j2528K0518M1004L5294K5132k0400k1887L2268L7298
$$ 98 12656 -4748 -10875 -23403 -2885 38119 73413 98545 78145 56258 88526 125824
13788A25824m0327q6431m959K0839L6759L017l9872l4041j4756k96L9121O132
$$ 125824 85497 -934 -5893 14946 51705 54722 14850 -19191 -33947 -34243 4878 11010
13776A1010r279L746L9392K9923M8029p022j4009m6497R001n4924l8596j1973
$$ 11010 1731 5477 44869 74792 122821 115799 101790 55293 64294 9370 -29226 -41199
13764d1199o3229j3573L2757M6074N4574J3364k7418l0588J8906N2945K4752o2547
$$ -41199 -104428 -118001 -85244 -39170 15404 28768 1350 -29238 -10332 42613 67365 4818
13752D818r3153K835L3396K7706j3093J5412J2532p449M132k038L2172N135m0975
$$ 4818 -88335 -85500 -52104 -24398 -37491 -22079 -9547 -16996 -12864 -14902 17270 22405 -18570
13739a8570o0183j520M1724K9651l7497R320K6631K5457J0517J9661m2672m2305
$$ -18570 -78753 -80273 -38549 -8898 -46395 -37075 -10444 15013 25530 45191 2519 -39786
13727c9786l0953r063J7027N4217k7859k9819j4500l6023L0389J5605J12867O6305
$$ -39786 -70739 -79802 -62775 -8558 -36417 -66236 -80736 -116759 -86370 -70765 42102 108407
13715A08407k2862q5679l3424k2037q284M1600M4572J5872p569j4179q529J1360
$$ 108407 85545 -134 -33558 -55595 -63879 -22279 22293 38165 30596 16417 7888 19248
13703A9248k7160Q10m996L6041n529K3193K569m4956j6804J1965n2650n4025k2662
$$ 19248 -7912 -7102 -12098 23943 18414 41607 44176 -780 -17584 -5619 -58269 -112294 -134956
13690a34956l8342j9851J3271K2187N7714J3608Q113L3031j3544j0015L2276N8116
$$ -134956 -173298 -193149 -179878 -157691 -99977 -86369 -78256 -45225 -58769 -68784 -36508 21608
13678B1608N5156n807K0736n4671k5327O147j3930l7142k540M672o979q80o489
$$ 21608 76764 70957 91693 37022 11695 17842 3912 -33230 -35770 -31098 -38077 -38957 -45446
13665d5446k0220r35K5248M18n6153k0042J4653J3681J0628k5723k3021K3650
$$ -45446 -65666 -66601 -41353 -40935 -97088 -117130 -102477 -88796 -78168 -103891 -126912 -103262
13653a03262M3802N4908L4990l0354N539k3880r230J7506K8341J4647k7429k1879
$$ -103262 -59460 -4552 30438 84 5623 -18257 -27487 -9981 18360 33007 5578 -16301
13641a6301q1459m6458j6444j8794J7373R5094N4439o286k2501l9817L8569J6179
$$ -16301 -97760 -144218 -160662 -179456 -162083 -66989 -12550 -18836 -41337 -81154 -42585 -26406
13629b6406m4521k7496L6433Q1672l658j4945j3410R696K3603J5738l4488m7199
$$ -26406 -70927 -98423 -61990 19682 16024 1079 -12331 -2635 20968 36706 2218 -44981
13617d4981j841k2749M3296k4319l5317L9669P5430m4254o803K9726J3200l5605
$$ -44981 -46822 -69571 -26275 -50594 -85911 -46242 29188 -15066 -21869 7857 21057 -14548
13605a4548m8930K1289q477p126l6250K1328N2162J6956L2028o6286k5587n490
$$ -14548 -63478 -42189 -50666 -57792 -94042 -72714 -20552 -3596 28432 -37854 -63441 -68931
13593f8931l8461L1415J9696k4386l3477m271L7932L2496n844J2846q77m7417
$$ -68931 -107392 -75977 -56281 -80667 -114144 -118415 -80483 -47987 -53831 -40985 -41862 -89279
13581h9279M2554J9399J1883l5748K2815n279q1051k5491L6331K7843K5237K2420
$$ -89279 -46725 -27326 -15443 -51191 -28376 -33655 -114706 -140197 -103866 -76023 -50786 -28366
13569b8366l6168l090k9153m9465L3284O1301M7648P504l9442m8494L7025K1225
$$ -28366 -64534 -67624 -96777 -146242 -112958 -51657 -4009 3495 -35947 -84441 -47416 -26191
13557b6191p068j0178K9697K0568l6085J0345p515L2310o309o0183j6563l0815
$$ -26191 -33259 -43437 -13740 6828 -29257 -18912 -26427 5883 -426 -60609 -77172 -107987
13545a07987m4070j0250K4008J3002Q577K9615p351o521j3057K6665K010k6331
$$ -107987 -152057 -162307 -138299 -125297 -116720 -87105 -94456 -100977 -114034 -87369 -85359 -111690
13533a11690j7188M851p616l192n1553n6753J03650Q4628k3653L417J8374J272
$$ -111690 -128878 -124027 -131643 -134835 -186388 -243141 -139491 -54863 -78516 -75099 -56725 -55453
13521e5453j4064K181M0631N3305K3141m3586j7443J0108o9128k1961O6042M8842
$$ -55453 -69517 -67336 -26705 26600 49741 6155 -11288 -1180 -70308 -92269 -26227 22615
13509B2615M2384j5626j5800j2029m6790J9151o903L3969J1904m6235L1964K9790
$$ 22615 64999 49373 33573 21544 -25246 -6095 -12998 20971 32875 -13360 18604 48394
13497D8394k0989K2236K4918j3513J4176j5806l5167k5871l8023l9996l0024L2949
$$ 48394 27405 49641 74559 61046 75222 59416 24249 -1622 -39645 -79641 -109665 -76716
13485g6716K1550k3451N454M0881J207N321J0025j7116L2812k0706k8672J2026
$$ -76716 -55166 -78617 -73163 -32282 -31075 -25754 -15729 -32845 -33 -20739 -49411 -37385
13473c7385M5869N90j3863j5511k428l0278n1393K1682L4101k1086N3137R834
$$ -37385 8484 9074 -4789 -20300 -22728 -53006 -104399 -82717 -48616 -69702 -16565 -6731
13461f731r1446o0696L2723L8797k9845K4441L1274J3702j5554o192Q7864L5816
$$ -6731 -98177 -158873 -126150 -87353 -117198 -92757 -61483 -47781 -63335 -69527 18337 54153
13449E4153j7844R373m4697M724M0450M011l6288p4731l3340q699j8897n21L8482
$$ 54153 36309 45682 985 5709 46159 50170 13882 -60849 -94189 -102888 -121785 -122306 -83824
13436h3824K538m8299o443j6268o40N0703J1962L7929j4471L7518n699p094M892
$$ -83824 -81286 -129585 -136028 -152296 -152936 -102233 -90271 -52342 -66813 -29295 -34994 -42088 -37196
13423c7196O8436k575l8029K1062k3793l3224m7975m5712K7054Q4255N899o221
$$ -37196 31240 28665 -9364 11698 -12095 -45319 -93294 -139006 -111952 -27697 -21798 -28019
13411b8019N663l433r22o3438j5430M0714n651j282K3242L3819k3702q0466J0844
$$ -28019 -22356 -25789 -26711 -90149 -105579 -64865 -70516 -71798 -48556 -14737 -38439 -118905 -108061
13398a08061M0679p229J3643j132K4691l4701k6933R947M9229j2152n6044K2646
$$ -108061 -67382 -74611 -60968 -62100 -37409 -72110 -99043 -89096 -39867 -52019 -108063 -85417
13386h5417M7804N9916l131q438q9808j9490O8719Q240O737J240M071m6982l9053
$$ -85417 -37613 22303 19172 10734 -79074 -98564 -29845 -21605 -14868 -13628 -9557 -56539 -95592
13373i5592j9078j2617j9549K8300N5566N8598K595k7360m0929K4155J0421K6992
$$ -95592 -114670 -127287 -146836 -118536 -62970 -4372 -1777 -29137 -70066 -45911 -35490 -8498
13361h498m064j3026k7376q182J8483N3257L878p943j3450n392j3966k0063m300
$$ -8498 -12562 -25588 -52964 -61146 -42663 10594 14472 6529 -6921 -12313 -26279 -46342 -50642
13348e0642L9201P1928J8045l6309o0809k231q755K842L3091O8435L9225j4315
$$ -50642 -11441 60487 78532 42223 -18586 -20817 -29572 -26730 6361 74796 114021 99706
13336I9706P152M4225J870j0630J700J8744j7748k584J3666l7100L7851J9477
$$ 99706 106858 151083 152953 142323 144023 162767 145019 142435 156101 119001 156852 176329
13324A76329o8796m7555k992j3345O7886P5027j8228o7465j6065n9458o6035q729
$$ 176329 107533 59978 56986 43641 111527 186554 168326 100861 84796 25338 -40697 -49426
13312d9426j7449j9340O8049P9043o0790L3476K683q4248r19L5819l956l4195
$$ -49426 -66875 -86215 -18166 60877 87 33563 36246 -48002 -48921 -13102 -17058 -51253
13300e1253m080j49J4884M1480j9066n7121j6130J4841q684M6625L1751j7685
$$ -51253 -55333 -55482 -40598 882 -18184 -75305 -91435 -76594 -85278 -38653 -6902 -24587
13288b4587q616K7126J8200l040J1595j5342m9506m831n477j1887K4962J6184
$$ -24587 -33203 -6077 12123 9083 20678 5336 -44170 -49001 -54478 -66365 -41403 -25219
13276b5219p6188L7686N0807L9492k4972k5775O409r216q78l3499J6107M4070
$$ -25219 -101407 -63721 -12914 26578 1606 -24169 -17760 -26976 -27854 -61353 -45246 -1176
13264a176N3919n5505p6105l8948j369K2747O2558L7324o2144N835N8710k4480
$$ -1176 52743 -2762 -78867 -117815 -119184 -96437 -33879 3445 -58699 -52864 5846 -18634
13252a8634n4580J4768N4039J5303K9658K1413k4752k745j7921K1142P1618Q996
$$ -18634 -73214 -58446 -4407 10896 40554 61967 37215 34470 16549 37691 109309 118305
13240A18305K1567R694J8580m7826K7021L2876k2774k3065L2537m6059k2130k1232
$$ 118305 139872 149566 168146 120320 147341 180217 157443 134378 166915 120856 98726 77494
13228G7494j4116J7965K5681k2370m3612j1868L6568L4776j0923q550J5631m7094
$$ 77494 63378 81343 107024 84654 41042 29174 65742 100518 89595 81045 96676 49582
13216D9582k8932m243j1253N418n7391n1585j9221O0175J7876m840J6933M3805
$$ 49582 20650 16407 5154 10572 -46819 -98404 -117625 -57450 -39574 -44414 -27481 16324
13204A6324o6009m5720L8377L212j5949K8753K0619m454j0505l0802k3714K8251
$$ 16324 -49685 -95405 -57028 -53816 -69765 -41012 -20393 -24847 -35352 -66154 -89868 -61617
13192f1617K0805L8073j359o125L0748p470l4908J9330n281K4r963k1694l5426
$$ -61617 -40812 -2739 -4098 -10223 20525 13055 -21853 -2523 -7804 -7780 -17743 -39437 -74863
13179g4863L2949J733J1413k7828K4718J8673j5814P1022J2535j7023K7876K6675
$$ -74863 -41914 -40181 -28768 -56596 -31878 -13205 -29019 42003 54538 37515 65391 92066
13167I2066K0761l3873o8514q935L3838k5592R777m3355J4582j1008k2980J8950
$$ 92066 112827 78954 10440 1505 35343 9751 19528 -23827 -9245 -20253 -43233 -24283
13155b4283l6243O8499L0273Q8104o379r4151l609j1797Q311J4896J2372J957
$$ -24283 -60526 7973 38246 126350 119971 25820 22211 10414 18725 33621 45993 47950
13143D7950K0041j0370j9732k6273j9301P070m4918m8262R2130L9976K9517j3043
$$ 47950 67991 57621 37889 11616 -7685 -615 -45533 -93795 -1665 38311 67828 54785
13131E4785m5602j346M1742M0214l4930o1478K9889j7087k6416M2703P7528K7395
$$ 54785 9183 7837 49579 89793 54863 -6615 23274 6187 -20229 22474 100002 127397
13119A27397l5284J310N6749J887o6875j7046K1462Q290m09k8434o7407Q8000
$$ 127397 92113 93423 150172 152059 85184 68138 89600 97890 97481 69047 1640 89640
13107H9640K1675j7926K5202L0338J2157l5345j9738J7746l3665o1352O191J7127
$$ 89640 111315 93389 118591 148929 161086 125741 106003 123749 90084 28732 34923 52050
13095E2050N8568J7554P189k1691k6525N792j20l2602Q303K9896J192N2702N5939
$$ 52050 110618 128172 135361 113670 87145 92937 92817 60215 68518 98414 99606 152308 208247
13082B08247k1145K830J5016J9328n426O3295Q0030O4418K5387j146j5202Q0890
$$ 208247 187102 189932 204948 224276 218850 282145 362175 426593 451980 450834 435632 516522
13070E16522R4742M0297N8559J10606J32663J02055J02151Q4804j4025k8336q9726
$$ 516522 611264 651561 710120 820726 953389 1055444 1157595 1242399 1228374 1200038 1110312
13059A110312o1034m5329n3971j1733p5675j32262l8182k7445n7701k5974o5154
$$ 1110312 1049278 1003949 949978 938245 862570 730308 692126 664681 606980 581006 515852
13048E15852k8388J399p2372q601m263J3006l1593m1818n4384j5915O464J5573
$$ 515852 487464 488863 416491 407890 403627 416633 385040 343222 288838 272923 279387 294960
13036B94960j1909r307p672K8877l1234m6906M8035M0812k1128j1520L1526M8448
$$ 294960 283051 273744 266072 294949 263715 216809 264844 305656 284528 273008 304534 352982
13024C52982n887K1806L5005l7285j9858j6053M4697o188k7436M9398j6685k6235
$$ 352982 347095 368901 403906 366621 346763 330710 375407 369219 341783 391181 374496 348261
13012C48261K4968Q08l4077K6183L6331k309l1298o475P169k0327J1371p8582
$$ 348261 373229 374037 339960 366143 402474 400165 368867 362392 369561 349234 360605 282023
13000B82023K6885M8106J5578K8201j5845P544n585l3697L8330R1310K8459M2076
$$ 282023 308908 357014 372592 400793 384948 392492 386907 353210 391540 482850 511309 553385
12988E53385j8891M446M7180J1851q882J3616K5483O9386l859o0678l3804O487
$$ 553385 534494 538940 586120 597971 589089 602705 628188 697574 693715 633037 599233 605720
12976F05720L5412N463J6806L6672M9065J3282K6458J3161J11892N9683L7494
$$ 605720 641132 646595 663401 700073 749138 762420 788878 802039 913931 973614 1011108
12965A011108k2539r185N5799O9917J28133N4395R0334M0014O9564M0827P4131
$$ 1011108 988569 979384 1035183 1105100 1233233 1287628 1377962 1417976 1487540 1528367 1602498
12954A602498J49494O8896Q3173J23088J03310J92396K14965J25540J78529J95196
$$ 1602498 1751992 1820888 1904061 2027149 2130459 2322855 2537820 2663360 2841889 3037085
12944C037085K37255K65697L20784L54622L44175L85712M59133N52570O21870
$$ 3037085 3274340 3540037 3860821 4215443 4559618 4945330 5404463 5957033 6578903
12935F578903O50583P54862Q71800J014387J161636J252997J420511J727305K070704
$$ 6578903 7229486 7984348 8856148 9870535 11032171 12285168 13705679 15432984 17503688
12926A7503688K408049K731081L156697L573324L751493L828407L766800L335414
$$ 17503688 19911737 22642818 25799515 29372839 33124332 36952739 40719539 44054953
12918D4054953K606896J624197M16331q36739j937151k836647l349615l588781
$$ 44054953 46661849 48286046 48702377 47865638 45928487 43091840 39742225 36153444
12910C6153444l583271l406598l142602k836511k407308k143474j872761j645270
$$ 36153444 32570173 29163575 26020973 23184462 20777154 18633680 16760919 15115649
12902A5115649j447493j213126j044408r41374q23449p61331o69535o68692n97941
$$ 15115649 13668156 12455030 11410622 10469248 9645799 8884468 8214933 7546241 6948300
12893F948300m61655l69655l83164l68321l74881k87296k23427j83499k00039
$$ 6948300 6486645 6116990 5733826 5365505 4990624 4703328 4479901 4296402 4096363
12884D096363k24602j43585j28733q6278j31913j01306r0653j14732p0138o9012
$$ 4096363 3871761 3728176 3599443 3513165 3381252 3279946 3189293 3074561 3004423 2935411
12874B935411k9934q0312n1327p5050o1705l7322j3664J0637K480M2887k3444
$$ 2935411 2905477 2825165 2773838 2698788 2637083 2599761 2586097 2596734 2599214 2642101 2618657
12863B618657L9109N5113k1750K3520N3967O2655J07683J95880P6960P4599Q0332
$$ 2618657 2657766 2712879 2691129 2714649 2768616 2831271 2938954 3134834 3211794 3286393 3366725
12852C366725J10576K09486J63320K05389K95126K72136L66116L70003M82904
$$ 3366725 3477301 3686787 3850107 4055496 4350622 4622758 4988874 5358877 5841781
12843E841781M86177N09508O16866O70788P23109Q22813R93592J152933J327399
$$ 5841781 6327958 6837466 7454332 8125120 8848229 9671042 10664634 11817567 13144966
12834A3144966J541231J821336K158128K470905K839952L180624L485838L768794
$$ 13144966 14686197 16507533 18665661 21136566 23976518 27157142 30642980 34411774
12826C4411774L815269L591359L072816K335172J300071O8042j160275k192458
$$ 34411774 38227043 41818402 44891218 47226390 48526461 48594503 47434228 45241770
12818D5241770k986435l446767l619672l630229l360700l036637k754435k400424
$$ 45241770 42255335 38808568 35188896 31558667 28197967 25161330 22406895 20006471
12810B0006471k098260j822691j571735j384536j212201j040368r44057q76336
$$ 20006471 17908211 16085520 14513785 13129249 11917048 10876680 9932623 9056287
12802I056287o79722o65935o37649n32579m26147m36502m69505l70294l60842
$$ 9056287 8376565 7710630 7072981 6540402 6114255 5677753 5208248 4837954 4477112
12793D477112l13124k48375j76909j48104j61451j43052j37512j74707j56101
$$ 4477112 4163988 3915613 3738704 3590600 3429149 3286097 3148585 2973878 2817777
12784B817777j45851q7979q5680j70632j31193j09497l5025o5973j17283j12997
$$ 2817777 2671926 2583947 2498267 2327635 2196442 2086945 2051920 1985947 1868664 1755667
12774A755667q7836l7666J0983r8582n7803l7289j16992k6950k504p6506r9646
$$ 1755667 1667831 1630165 1641148 1542566 1484763 1447474 1330482 1303532 1301028 1224522 1124876
12763A124876l1152J0783j5764k4465J915M960n047o0534p6185n0714m1594j3724
$$ 1124876 1093724 1104507 1088743 1064278 1066193 1071153 1066106 1005572 929387 878673 837079 823355
12751H23355J844N3640k8962n64m2871r887J0105l9263m5432k2920k085l82o721
$$ 823355 825199 878839 849877 849313 806442 796555 806660 767397 721965 699045 696960 696578 689857
12738F89857n4782m981o116J5345k5574o8337n874Q820K1695M9017J2691k1935
$$ 689857 635075 630094 623978 639323 613749 545412 539538 548358 570053 619070 631761 609826
12726F09826o1426m884J6610K5622p069j8871l2421m3276j8340K4573K8794m1351
$$ 609826 548400 543516 560126 585748 578679 559808 527387 484111 465771 490344 519138 477787
12714D77787O480Q444O198l6995n5909l3458M6744j830J2679J2260m0615k5314
$$ 477787 484267 492711 498909 461914 406005 372547 419291 417461 430140 442400 401785 376471
12702C76471M242K661n5090j2289j6768O846K2005K5570J4205J0336k8621l1243
$$ 376471 380713 383374 328284 315995 299227 306073 328078 353648 367853 378189 349568 318325
12690C18325Q757p6242m7199L6589L0568j7819R56N9049L6144K5145K1154j2869
$$ 318325 327082 250840 203641 240230 270798 252979 253935 312984 349128 374273 395427 382558
12678C82558j526m9670q7724m507L2956M7525J6789k7858q1612l9511q408O0620
$$ 382558 381032 331362 243638 239131 272087 319612 336401 308543 226931 187420 179012 239632
12666B39632N2858J6221k9321j5517q960n9265O410K2292m4472J0667M5548K4180
$$ 239632 292490 308711 279390 263873 254913 195648 202058 224350 179878 190545 236093 260273
12654B60273q636K0332P5731N491m8915M457o6457r8798k7668o703O3107L3607
$$ 260273 251637 271969 347700 353191 304276 308733 242276 143478 115810 109107 172214 205821
12642B05821p3854n531N3505N7128l8637n7240J7692L4958K2172k0622J924l1663
$$ 205821 131967 126436 179941 237069 198432 141192 158884 193842 216014 195392 197316 165653
12630A65653k0024k572j0083j2078N98N5884m8124k0378N5446K7583k6361J4421
$$ 165653 145629 143057 132974 120896 121494 177378 129254 108876 164322 191905 165544 179965
12618A79965J6878J2602P345r253J3896r052n6051m199O72j3871K6200J151n8755
$$ 179965 196843 209445 216790 207537 221433 212381 156330 152131 152803 138932 165132 166283 107528
12605A07528l2218Q440j0994L592M1060J3469R385J0934l6950M0653M040n0737
$$ 107528 75310 83750 72756 76348 117408 130877 140262 151196 114246 154899 158939 108202
12593A08202k2248l225N0385N8841l3019l5105o2059J3193O0853k4158K9501k2987
$$ 108202 85954 82729 133114 191955 158936 123831 61772 74965 135818 111660 141161 118174
12581A18174j0230J6140K944M0846M603n7533l4553L1464m2037N3063P0937j9075
$$ 118174 107944 124084 127028 167874 172477 114944 80391 111855 69818 122881 193818 174743
12569A74743o7165n4337m262k3543k9752M6879K3905j6613p429k3508J0081K0737
$$ 174743 107578 53241 48979 25436 -4316 42563 66468 49855 42426 18918 28999 49736
12557D9736M9493Q885J954o282J7128N3633k0069j0612J3341R222N7250q740n9123
$$ 49736 99229 108114 110068 103786 120914 174547 154478 143866 157207 166429 223679 214939 155816
12544A55816j05801m121O7294J1150o1669J8288k9667O481L6691K9417J0104j1778
$$ 155816 50015 45894 113188 124338 62669 80957 51290 57771 94462 123879 133983 122205
12532A22205n2661l559N1024p654j0643J878N1929J448k3616m0079q478j8850
$$ 122205 69544 65985 117009 109355 98712 100590 152519 153967 130351 90272 81794 62944
12520F2944K3177j647j3985O0579j7052K0346k5431N1199K6667m5752l7184k0841
$$ 62944 86121 84474 70489 131068 114016 134362 108931 160130 186797 141045 103861 83020
12508H3020K665Q0148L1656k2193R06N771O2434j5702L9556J8767o879l2733q872
$$ 83020 85685 165833 197489 175296 176202 181973 244407 228705 268261 287028 280149 247416 238544
12495B38544M2309k0617n1801K2887m911p5166k9348o2152j5957M0513N9883n049
$$ 238544 280853 260236 208435 231322 226411 151245 121897 59745 43788 84301 144184 139135
12483A39135r132l6066J2044K4012O2228L0344n7044n3001j3636M7104K6544q1766
$$ 139135 130003 93937 105981 129993 192221 222565 165521 112520 98884 145988 172532 90766
12471I0766o8258k2630N5643L4779J6216O690K6129l0824m6940m8680k2930p8452
$$ 90766 22508 -122 55521 90300 106516 113206 139335 108511 61571 12891 -10039 -88491
12459h8491M5851O8719o843j5691M2450l0664j5064J4911l9762Q968L0824K1383
$$ -88491 -42640 26079 19236 3545 45995 15331 267 15178 -24584 -15616 15208 36591
12447C6591j6771J1385n810r167k1326j4102k3567Q1200N695r028K3830l1508
$$ 36591 19820 31205 25395 16228 -5098 -19200 -42767 38433 44128 35100 58930 27422
12435B7422l7382M2390O7637L5927N17j0932K9936j1425l5681p8450l1556K683
$$ 27422 -9960 32430 100067 135994 136511 125579 155515 144090 108409 29959 -1597 1086
12423A086o611J0264K7315L013M2806P062J0431j3895L4536J2053K8212K1411
$$ 1086 -5525 4739 32054 35067 77873 84935 95366 81471 116007 128060 156272 177683
12411A77683P213K315M2346O6288k244O441j5090J4831j8737n1169k0484n5395
$$ 177683 184896 187211 229557 295845 293601 300042 284952 299783 281046 229877 209393 153998
12399A53998o963p972J3061L3412M0518k5404n3808l9178j926K4295J1383o3665
$$ 153998 147035 139063 152124 185536 226054 200650 146842 107664 105738 130033 141416 77751
12387G7751k9831l9143J1831j9193q546M2740p612J5373Q5814K3443o3018o0494
$$ 77751 47920 8777 20608 1415 -7131 35609 27997 43370 129184 152627 89609 29115
12375B9115j5579m8323j0625l291l1439k0305K3965j4492K9795M3148M1933r220
$$ 29115 13536 -34787 -45412 -48703 -80142 -100447 -76482 -90974 -61179 -18031 23902 14682
12363A4682m0958L5744L7271m8007K3775N0514l2472j5463M9396J3751j8922l8762
$$ 14682 -26276 9468 46739 -1268 22507 73021 40549 25086 74482 88233 69311 30549
12351C0549m5886r994J3771P2793j5186o9579j2580r95P181Q872L9392Q493m5017
$$ 30549 -15337 -25331 -11560 61233 46047 -23532 -36112 -37107 -29926 -21054 18338 26831 -18186
12338a8186P067Q045n1523l907n1257O647O4667J8153j9055L4379m123L5856K9426
$$ -18186 -11119 -3074 -54597 -58504 -109761 -103114 -38447 -20294 -39349 -4970 -9093 26763 56189
12325E6189j0545k2506M2293J29l4756m2014K4205O780l42J2942N4393l8334j6189
$$ 56189 45644 23138 65431 65560 30804 -11210 12995 19775 19433 32375 86768 48434 32245
12312C2245K963m236J48P755j9623k3191j6780j866j1978J8729K330K8643J4968
$$ 32245 35208 30972 31120 38875 19252 -3939 -20719 -22585 -34563 -15834 -13504 15139 30107
12299C0107k0477q745L2673N9769R370q9249j3324p184n300k6871K8557j4035
$$ 30107 9630 885 33558 93327 102697 13448 124 -7060 -12360 -39231 -10674 -24709
12287b4709K3112o387m2500J8271L5894k6557k9238p676n2898p227r515M5249
$$ -24709 -1597 -7984 -50484 -32213 3681 -22876 -52114 -59790 -112688 -119915 -129430 -84181
12275h4181J2069j3984O671K5087j7069N654P107J8949p587K8818L1125l4064
$$ -84181 -72112 -86096 -79425 -54338 -71407 -65753 -58646 -39697 -47284 -18466 12659 -21405
12263b1405m7816j4185M7833J6477j1626l2929R603K9426L2423L5960n8365l8619
$$ -21405 -69221 -83406 -35573 -19096 -30722 -63651 -54048 -24622 7801 43761 -14604 -53223
12251e3223l339M8584L4588n5271n1572j6690R696k5121K3081P0165M4789k1845
$$ -53223 -56562 -7978 26610 -28661 -80233 -96923 -87227 -112348 -89267 -19102 25687 3842
12239C842j9424j7373Q988k2741J304J8110k0714l9128n562j5759M342K7086K7165
$$ 3842 -15582 -32955 -23967 -46708 -45404 -27294 -48008 -87136 -92698 -108457 -104115 -77029 -49864
12226d9864N2291N3200m4157n8245K5473P4720l3857p588k6535k8670l0705J2052
$$ -49864 2427 55627 11470 -46775 -21302 53418 19561 11973 -14562 -43232 -73937 -61885
12214f1885J1589L3254M7454J2417o7376m206j1040K6086J159l2872k6327r858
$$ -61885 -50296 -17042 30412 42829 -24547 -28753 -39793 -13707 -12548 -45420 -71747 -81605
12202h1605k0165R466K4936j236J8603l3277n9773O8198L1950P6306o777p8197
$$ -81605 -101770 -92304 -67368 -68604 -50001 -83278 -143051 -74853 -42903 33403 26626 -51571
12190e1571n8976J2870K2525P883Q263L2353M983j3706j7972k3284L5884J06274
$$ -51571 -110547 -97677 -75152 -67269 -59006 -26653 -21670 -35376 -53348 -76632 -40748 65526
12178F5526O9895l2772l0494L3586m4394n3666q261j8831M278K5215K5404m6325
$$ 65526 135421 102649 72155 105741 61347 7681 -580 -19411 -15133 10082 35486 -10839
12166a0839J5Q731K3493j8906k1283K7226j7806J5985L4864q592j8072K7124m903
$$ -10839 -10824 -2093 21400 2494 -18789 8437 -9369 6616 41480 32888 14816 41940 37037
12153C7037n3291m9723j0010R420K8918j9850M2018q824J2022q58R706J8927o1938
$$ 37037 -16254 -65977 -75987 -66567 -37649 -57499 -15481 -24305 -12283 -13141 -3435 15492 -46446
12140d6446L2740P2481j391O541L0727n0920J79k567j145p802j8282J9998p417
$$ -46446 -13706 58775 57384 63925 94652 43732 43911 41344 40199 32397 14115 34113 26696
12127B6696k3281j0821O467l2779j0139k7049K8511R584q005P354L3821l385K7350
$$ 26696 3415 -7406 -939 -33718 -43857 -70906 -42395 -32811 -40816 -33462 359 -3026 24324
12114B4324o670k4556j7668R393j5733K7298K3006l8554m6119K4216R311k5946
$$ 24324 17654 -6902 -24570 -15177 -30910 -3612 19394 -19160 -65279 -41063 -31752 -57698
12102e7698K1007j827K6652n1223n0570n9852O7978M8754M4443j7971K1176r651
$$ -57698 -36691 -38518 -11866 -63089 -113659 -173511 -105533 -56779 -12336 -30307 -9131 -18782
12090a8782o7222k5301K419k6157l7868j7909K7209N4891J0154M6571l0656J1157
$$ -18782 -86004 -111305 -108886 -135043 -172911 -190820 -163611 -108720 -98566 -51995 -82651 -71494
12078g1494j0338k5971k6878M2043k984j7212p736j3337m1735L0385n101n0533
$$ -71494 -81832 -107803 -134681 -92638 -95622 -112834 -120570 -133907 -175642 -145257 -150358 -200891
12066b00891O3726O6541l6455k2499M7045P8105L1414j4332j04603m759P1403
$$ -200891 -137165 -70624 -107079 -129578 -82533 -4428 26986 12654 -91949 -96708 -25305
12055b5305K1499N2708P2549R5675L3262l641m3003j6190N6939j1263q7359o786
$$ -25305 -3806 48902 121451 217126 250388 246747 203744 187554 244493 233230 145871 139085
12043A39085l2262m2445J3364L775K0577k9343k9305j1397L8202o0097p0525j7826
$$ 139085 106823 64378 77742 81517 102094 72751 43446 32049 70251 10154 -60371 -78197
12031g8197L078O3689p473j4297K884l92n1506q840N0031L176K241J9992M4199
$$ -78197 -75119 -11430 -18903 -33200 -30316 -30708 -82214 -91054 -41023 -37847 -35606 -15614 28585
12018B8585M6524L0609m6584K5361O469P601L849j732j4572p0494k6960M8616
$$ 28585 75109 105718 59134 84495 90964 98565 102414 100682 86110 15616 -11344 37272
12006C7272l2822j5025R943N161r846J6393M1598P0895M0376m8662n7600j6724
$$ 37272 4450 -10575 -632 4529 -5317 11076 52674 123569 163945 115283 57683 40959
11994D0959J6327J8540m732P0966M8268n985P960n609L317p638l5433K4166K3829
$$ 40959 57286 75826 71094 142060 190328 184343 192303 186694 190011 182373 146940 171106 194935
11981A94935P741P2964J9131J9190K9265J8682Q728J6513O1529j1027P7017m757
$$ 194935 202676 275640 294771 313961 343226 361908 370636 387149 448678 437651 514668 509911
11969E09911J4255O1740O8897J29991R4370L8772K3147O1968J07739R5624M1504
$$ 509911 524166 585906 654803 784794 879164 917936 941083 1003051 1110790 1206414 1247918
11958A247918O1311J20805P9959J89001K12499J46846J84201K18194K39931L18031
$$ 1247918 1309229 1430034 1509993 1698994 1911493 2058339 2242540 2460734 2700665 3018696
11948C018696L08522L67142M38588N99105O62146Q14167Q43934R60103J252307
$$ 3018696 3327218 3694360 4132948 4732053 5394199 6208366 7052300 8012403 9264710
11939I264710J616795J976538K499290L144621M130190N478834P465907J0356785
$$ 9264710 10881505 12858043 15357333 18501954 22632144 28110978 35576885 45933670
11931D5933670J4495788K0045222K6736838L2786414L4629238K7200747Q011353
$$ 45933670 60429458 80474680 107211518 139997932 174627170 201827917 209839270
11924B09839270j5546907l0083430l2043272k7276217k1146632j5959991j2059818
$$ 209839270 194292363 164208933 132165661 104889444 83742812 67782821 55723003
11917E5723003r200874p175180n591619m423556l552785k865212k318171j941568
$$ 55723003 46522129 39346949 33755330 29331774 25778989 22913777 20595606 18654038
11909A8654038j567428j301696j152753r97866q31551o96926o70141n40313l77586
$$ 18654038 17086610 15784914 14632161 13634295 12802744 12105818 11435677 10895364 10517778
11900A0517778m10020l99192k88237l20077l58686k44378j90735k52005k29381
$$ 10517778 10107758 9708566 9420329 9100252 8741566 8497188 8306453 8054448 7825067
11891G825067k46409k37072k69889k96318l11653k81054k94727l11920l04936
$$ 7825067 7578658 7341586 7071697 6775379 6463726 6182672 5887945 5576025 5271089
11882E271089l38649l04930k70744k92700j86808k17879k87771k68725k10367
$$ 5271089 4932440 4627510 4356766 4064066 3877258 3659379 3371608 3102883 2892516
11873B892516k13646j47514j68934j79585j31374o9322q1590j32931q4514r5623
$$ 2892516 2678870 2531356 2362422 2182837 2051463 1982141 1900551 1767620 1683106 1587483
11863A587483o2657p0071l7755m6331q7244n9309m7757p5447q3655l0480m0413
$$ 1587483 1524826 1454755 1417000 1370669 1283425 1224116 1176359 1100912 1017257 986777 946364
11852I46364k3400p9964m9797N6029J1104m5266n0015k5153j687J525n6769m7503
$$ 946364 922964 843000 793203 849232 860336 815070 765055 739902 738215 739740 682971 635468
11840F35468l4081m5027j6901K6702l9261o4317p646R478N1943K8298L4910Q655
$$ 635468 601387 556360 539459 566161 526900 462583 454937 464415 516358 544656 579566 588221
11828E88221N240k8975k3384o3985m8407j1877K533L3837P844q2992j6366J1824
$$ 588221 593461 564486 541102 477117 428710 416833 419366 453203 461047 378055 361689 373513
11816C73513k530m7073r14n2967j01923m740R8054M0410l533O051P376J4300M3782
$$ 373513 370983 323910 322996 270029 168106 163366 261420 301830 298297 304348 311724 326024 369806
11803C69806k6646k1420k0555k5693j3724J0540N5858N729K3542M738k8141n7532
$$ 369806 343160 321740 301185 275492 261768 272308 328166 333895 357437 362175 334034 276502
11791B76502K6302j0476P363N5563k1084j4366L0165m31K8426L3399m8401L4299
$$ 276502 302804 292328 299691 355254 334170 319804 349969 349538 377964 411363 362962 397261
11779C97261k7021l807j1230l6606l6627l8051m2637l0376K8604N1191K7696J6761
$$ 397261 370240 366433 355203 318597 281970 243919 201282 170906 199510 250701 278397 295158
11767B95158k8640k3466K3406j83r9847o6531L6291j8454j2789Q371L2631k4071
$$ 295158 266518 243052 266458 266275 166428 99897 136188 117734 104945 113316 145947 121876
11755A21876k0168N223J7694N2657k2570k5025J1007k8487K0693j767N897k731
$$ 121876 101708 106931 124625 177282 154712 129687 140694 112207 132900 131133 137030 134299
11743A34299j9661N885J6417K6318O493K055K1510l9406p9715l5169L2336k5626
$$ 134299 114638 120523 136940 163258 169751 171806 193316 153910 74195 39026 71362 45736
11731D5736j1157j9583L8544K2805M0326J0366J0133j5993k9364l8590L205J3262
$$ 45736 34579 14996 53540 76345 116671 127037 137170 121177 91813 53223 56428 69690
11719F9690k6329J6403L7213j9212N859l9657j6062K0682L9906l289k2961K9217
$$ 69690 43361 59764 96977 77765 83624 43967 27905 48587 88493 85204 62243 91460
11707I1460k8767l0563Q622m741N4869k3861L747L1362k5321j5467J8436L5665
$$ 91460 62693 32130 40752 36011 90880 67019 70766 102128 76807 61340 79776 115441
11695A15441l1326k8108K7886K5034L9967J6866k1840N0159k2491m8263j22O2783
$$ 115441 84115 56007 83893 108927 148894 165760 143920 194079 171588 123325 123203 185986
11683A85986k5186q462L2237p1588p074R272K0342j3278n8969k5200K8458m5381
$$ 185986 160800 152338 184575 112987 105913 115185 135527 122249 63280 38080 66538 21157
11671B1157R138O9363P2774J3431m2961j8029m1920k7127p46L6577M6201j0650
$$ 21157 30295 99658 172432 185863 142902 124873 82953 55826 55080 91657 137858 127208
11659A27208l6815J8560L3629j0567k5983K4097r650k7053J0749l2064j0415p411
$$ 127208 90393 108953 142582 132015 106032 130129 120479 93426 104175 72111 61696 54285
11647E4285Q344q632j957Q07j628j3022K7044k6467J5092k813J9461N392l7233
$$ 54285 62629 53997 52040 52847 51219 38197 65241 38774 53866 51053 70514 75906 38673
11634C8673n4858P002L1672L0186M1850p367n9631K940K5270j6560m491P278P296
$$ 38673 -16185 -9183 22489 52675 94525 87158 27527 30467 55737 39177 34686 41964 49260
11621D9260q154j1011m5568N361J9673k4366M5919J6670R976Q329J1646K4555
$$ 49260 41106 30095 -15473 -10112 9561 -14805 31114 47784 57760 66089 77735 102290
11609A02290k4547k8812n391j974n2058r94L7163O5278j9128k9636j5830M667
$$ 102290 77743 48931 43540 41566 -10492 -11486 25677 90955 71827 42191 26361 31028
11597C1028J9687r173n0437n1895j095Q3934L5338O3188m4522l2870L0723l7800
$$ 31028 50715 41542 -8895 -60790 -61885 22049 57387 120575 76053 43183 73906 36106
11585C6106j7520K2174o9552m4357j3516j181n1388N4754J17918M8489j8377k0856
$$ 36106 18586 40760 -28792 -73149 -86665 -87846 -139234 -84480 33438 81927 63550 42694
11573D2694K2744k2972k7267K4589Q203k8934K9219P130k831o399j2144k8852
$$ 42694 65438 42466 15199 39788 47991 19057 48276 55406 52575 46176 34032 5180
11561E180P788J9212j279m280n714r188M558o456K4496L3454l5836Q842J6164
$$ 5180 12968 32180 30901 26621 20907 11719 16277 9821 34317 67771 31935 40777 56941
11548E6941m799J8240J0593m4883o7737k9987k6351M1208M3333j1755j0759O081
$$ 56941 52142 70382 80975 36092 -31645 -61632 -87983 -46775 -3442 -15197 -25956 -19875
11536a9875J6915k1656M234O1231J1603j5198j4513R182J252k2631j5965Q088
$$ -19875 -2960 -24616 -20382 40849 52452 37254 22741 31923 33175 10544 -5421 2667
11524B667L1632N8494M1881o1441o2714k0213R151m3560j1085j5368Q37J8912
$$ 2667 34299 92793 134674 73233 10519 -9694 -543 -44103 -55188 -70556 -69719 -50807
11512e0807L6239M3562J4891m8882q236P0283L9394M477n3298l0823O744O291
$$ -50807 -14568 28994 43885 -4997 -13233 57050 96444 100921 47623 16800 23544 29835
11500B9835K2074N074K223P41k542l0849L1980n051J6685J5780j1847j2926K649
$$ 29835 51909 56983 59206 59947 57405 26556 58536 53485 70170 85950 74103 61177 63826
11487F3826oo5144l1187N592K3981J8158N2829Q0994k8568q3260l2511k0815K4641
$$ 63826 63820 -1324 -32511 -26919 -2938 15220 68049 149043 120475 37215 4704 -16111 8530
11474H530K3318K2813j9527p1081J363J6903N2290j041l0265Q709K8163l9979
$$ 8530 31848 54661 35134 -35947 -34584 -17681 34609 33568 3303 12012 40175 196
11462A96l0525k6383J4453K9903K2269L6726k4381n2240l7020J522O808K9907
$$ 196 -30329 -56712 -42259 -12356 9913 46639 22258 -29982 -67002 -65480 -58672 -28765
11450b8765J5285L762L7815P2276l7596k2801q919Q547J1263N959k417l1658n2314
$$ -28765 -13480 -9718 28097 100373 62777 39976 31057 39604 50867 56826 54409 22751 -29563
11437b9563r015j742K0116M4100L0932K4419M567m6203l4388O9980q204l8813
$$ -29563 -38578 -40320 -20204 23896 54828 79247 83814 37611 3223 73203 64999 26186
11425B6186m3921m3374L5184n053j2225j3508k1511P660O9571N2381p515l016
$$ 26186 -17735 -61109 -25925 -30978 -43203 -56711 -78222 -70562 -991 51390 43875 40859
11413D0859j2507K7066J7809j2324l3698K0120Q191M9205K6370l2041o5132m855
$$ 40859 28352 55418 73227 60903 27205 47325 55516 104721 131091 99050 33918 29063
11401B9063J244K69j6587j4043L287o3219O328L0898O11K6192K2061k4997J2580
$$ 29063 30307 30576 13989 -54 3233 -59986 -53658 -22760 -22149 4043 26104 1107 13687
11388A3687l8049k8910O0320M7486k9936o1748K832l1203l2785j494K8765R432
$$ 13687 -24362 -53272 7048 54534 24598 -37150 -34318 -65521 -98306 -99800 -71035 -61603
11376f1603O611L2945K2134K3817m420L797P03o1091m759J09343m080j4138l6173
$$ -61603 -54992 -22047 87 23904 19484 23281 23984 -37107 -41866 67477 63397 49259 13086
11363A3086K6237M9556j8758m6827J0758l251j644j3290m6452K6075k0934r699
$$ 13086 39323 88879 70121 23294 34052 30801 29157 15867 -30585 -4510 -25444 -35143
11351c5143k3964j6220O8958K2273N0782p838n6477n486K1078K2478K0613j4948
$$ -35143 -59107 -75327 -6369 15904 66686 58848 2371 -3115 17963 40441 61054 46106
11339D6106o73o426L7323m6867m8127L9048K4700k1347k6035j2967k9679m9926
$$ 46106 45433 39007 76330 29463 -18664 20384 45084 23737 -2298 -15265 -44944 -94870
11327i4870J0524M3156k0128n2380K5106l0322q261O134K3640J9803L7430M1264
$$ -94870 -84346 -41190 -61318 -113698 -88592 -118914 -127175 -121041 -97401 -77598 -40168 1096
11315A096J9155j3897l4292J2647N9133q926j9605o0567n3677J982K7457K1953
$$ 1096 20251 6354 -27938 -15291 43842 34916 15311 -45256 -98933 -96951 -69494 -47541
11303d7541l9644J3253K3852K1507M416j1439o3591L3184N7060k8194n9645J2352
$$ -47541 -87185 -73932 -50080 -28573 -24157 -35596 -99187 -66003 -8943 -37137 -96782 -84430
11291h4430M086K5046L0451k4752P995m2636J4558l1068J2992o23k3018K8071
$$ -84430 -80344 -55298 -24847 -49599 -41604 -84240 -69682 -100750 -87758 -88381 -111399 -83328
11279h3328K4929J4853j9442j5948P3167O2519k4952k1944l1784k7184J2141K0900
$$ -83328 -58399 -43546 -62988 -78936 -5769 56750 31798 9854 -21930 -49114 -36973 -16073
11267a6073m4770k6133P6546K2600k0071J7206K147P51J5172K2770j8679j17804
$$ -16073 -60843 -86976 -10430 12170 -7901 9305 11452 12203 27375 50145 31466 -86338
11255h6338r603M4362R642m661K0964K1145k1882M630q395r465M9002J1568k1040
$$ -86338 -95941 -51579 -41937 -46598 -25634 -4489 -26371 -21741 -30136 -39601 9401 20969 -71
11242g1j9178n631j2183k2270N5531K5064l1902M000j303K0794j757o9587M6112
$$ -71 -19249 -24880 -37063 -59333 -3802 21262 -10640 -6640 -7943 12851 11094 -58493 -12381
11229a2381k3828k6750J2861K1166J7312K7958j6945l8759j056M1359l5534m7748
$$ -12381 -36209 -62959 -50098 -28932 -11620 16338 -607 -39366 -40422 937 -34597 -82345
11217h2345M99L7900q317O091Q103j04j6882k5389O9678J2502l2350M7355R2017
$$ -82345 -81846 -43946 -52263 -46172 -38069 -38173 -55055 -80444 -10766 1736 -30614 16741 108758
11204A08758L3606l6478k5483k1167m8871l6374K0442K5316n462l5999j4202k6388
$$ 108758 142364 105886 80403 59236 10365 -26009 -5567 19749 14287 -21712 -35914 -62302
11192f2302L3690O5228K9513j0177p8651n2044K8177O764K8676k3864k0737L118
$$ -62302 -28612 36616 66129 55952 -22699 -74743 -46566 -39802 -11126 -34990 -55727 -52609
11180e2609j2005K4071J2771l0890L1894J936K3706L5756l1224o8869j4975m750
$$ -52609 -64614 -40543 -27772 -58662 -26768 -24832 -1126 34630 3406 -65463 -80438 -85188
11168h5188O2787N8675J6826k4992l6216k1895j269o2257k1873L1231J8204M010
$$ -85188 -22401 36274 53100 28108 -8108 -30003 -31272 -93529 -115402 -84171 -65967 -61957
11156f1957J6973M2138J6266m3160K2074j0888p1756m7892N8512J9941j1642j5804
$$ -61957 -44984 -2846 13420 -29740 -7666 -18554 -90310 -138202 -79690 -59749 -71391 -87195
11144h7195M669J3371J4523J0529M380o2650m7459J2445L6009R3024P4313n4090
$$ -87195 -82526 -69155 -54632 -44103 -39723 -102373 -149832 -137387 -101378 -8354 65959 11869
11132A1869j13292n4049j3476M852N4493J1114J4424J9891J208l3092J7075P519
$$ 11869 -101423 -155472 -168948 -164096 -109603 -98489 -84065 -64174 -62966 -96058 -78983 -71464
11120g1464m0967j3690n392k875Q0691M7287R140J9097J2423k3902j4249k1598
$$ -71464 -112431 -126121 -131513 -134388 -53697 -6410 2730 21827 34250 10348 -3901 -25499
11108b5499o5583n2795L0658k1508j595j2736J7756J8965j1794j3448j4224K0161
$$ -25499 -91082 -143877 -113219 -134727 -136322 -149058 -131302 -112337 -124131 -137579 -151803 -131642
11096a31642K7072K6616Q610k0737L4154J8190M29L057p847n5438J4607L8574
$$ -131642 -104570 -77954 -69344 -90081 -55927 -37737 -37308 -34251 -42098 -97536 -82929 -44355
11084d4355j6079K4462n1449l8378R940J09978L3511K3122m7476n7859q19R656
$$ -44355 -60434 -35972 -87421 -125799 -115859 -5881 27630 50752 3276 -54583 -55402 -45746
11072d5746n373l3333j6136p93Q622l3576O789L4591m7863k5778J694M4252K0440
$$ -45746 -51119 -84452 -100588 -101381 -92759 -126335 -119546 -84955 -132818 -158596 -156902 -112650 -92210
11059i2210m7101k1674O0511N1925K6751N0031k0624p8558k6689j1957L0608J11158
$$ -92210 -139311 -160985 -100474 -48549 -21798 28233 7609 -70949 -97638 -109595 -78987 32171
11047C2171L7426K5274ML9615K3972k2924j6551K0117K4913J2032L3740Q2295
$$ 32171 69597 94871 94875 134490 158462 135538 118987 139104 164017 176049 209789 292084
11035B92084N7859M3311O9053N3758L0208m185p8183q1602l3638K8230K9927N6484
$$ 292084 349943 393254 462307 516065 546273 542088 463905 382303 348665 376895 406822 463306
11023D63306N7945P8753J35182J4565m8441p9668j29560r3648l6243k6559J9067
$$ 463306 521251 600004 735186 749751 701310 621642 492082 398434 362191 335632 354699
11012C54699L5328J6861O0372N9808k0099o2131l7378n5704n7503q7476N694M7897
$$ 354699 390027 406888 467260 527068 506969 444838 407460 351756 294253 206777 212471 260368
11000B60368j4387m3722K6482p039n1462o7769n2471j7765K5001q624m2941l378
$$ 260368 245981 202259 228741 221702 170240 102471 50000 32235 57236 48612 5671 2293
10988B293J7221k3956p2886o760L8581P896n1995l3771n31K4971L929p018Q189
$$ 2293 19514 -4442 -77328 -84088 -45507 -37611 -89606 -123377 -123908 -98937 -95008 -102026 -93837
10975i3837L3781J9428m213J2499M6741l8919m1741K5968M1900P002M6185O0342
$$ -93837 -60056 -40628 -44841 -32342 14399 -24520 -66261 -40293 1607 8609 54794 115136
10963A15136k4176n0861j4378o9204j7896k8301K9534j0011o946J0939O0354K2559
$$ 115136 90960 40099 25721 -43483 -61379 -89680 -60146 -70157 -77103 -66164 -5810 16749
10951A6749l6258p907j9735J5917P0290L4555r066m9429j8581j1102q670n1891
$$ 16749 -19509 -27416 -47151 -31234 39056 73611 64545 15116 -3465 -14567 -23237 -75128
10939g5128m2451K3390K1349m818L7915N4304j9466J304o0681J5073k4953K5146
$$ -75128 -117579 -94189 -72840 -77658 -39743 14561 -4905 -3601 -64282 -49209 -74162 -49016
10927d9016N1745j9001J2474M7802k5318J1603l0287m4363L9944k370k2224L7100
$$ -49016 2729 -16272 -3798 44004 18686 30289 2 -44361 -4417 -6787 -29011 8089
10915H089K482m8189j9892j8141M8775P5807l048R091L3525K051o2068l6260l316
$$ 8089 10571 -37618 -57510 -75651 -26876 48931 45883 54974 88499 90550 28482 -7778 -11094
10902a1094J1202p2410m6872L1804L2158J4217K0007J091K5007K1526l6281J3425
$$ -11094 108 -72302 -119174 -87370 -55212 -40995 -20988 -19897 5110 26636 -9645 3780
10890C780m2623J9269m5997j0458N940J200j8737q262L1286M4288L6487J1324
$$ 3780 -38843 -19574 -65571 -76029 -70089 -68889 -87626 -95888 -64602 -20314 16173 27497
10878B7497l6735m633O1048k0977m0217o4281j1581P0563k0636n6614l3774l516
$$ 27497 -9238 -13871 47177 26200 -14017 -78298 -89879 -19316 -39952 -96566 -130340 -133856
10866a33856O9241J0438k9390K8221j3341L4031K7510N0356j0242M566m0704j9184
$$ -133856 -64615 -54177 -83567 -55346 -68687 -34656 -7146 43210 32968 37534 -3170 -22354
10854b2354j4037Q045l948k213K3788l8056j5816J9718O9110O2620m38n1251m1599
$$ -22354 -36391 -28346 -32294 -34507 -10719 -48775 -64591 -44873 24237 86857 86419 35168 -6431
10841f431J8688P7555M1228n2212j02260l1381L7640l8488j3456O0921M8033K8214
$$ -6431 12257 89812 131040 78828 -23432 -54813 -17173 -55661 -69117 -8196 39837 68051
10829F8051L8738l1042o2355q0492j4131Q642k3505K5825O3803L907J4408k1265
$$ 68051 106789 75747 13392 -67100 -81231 -72589 -96094 -70269 -6466 -2559 11849 -9416
10817i416j2400O3843K8781L587L091j6511o9536j5302k4627l52K5572j5626m039
$$ -9416 -21816 42027 70808 74395 77486 60975 -8561 -23863 -48490 -48842 -23270 -38896 -42935
10804d2935k9523Q637J9403M0845L5889r551K3054l560K5240j8752l8982K4519
$$ -42935 -72458 -63821 -44418 -3573 32316 22765 45819 42259 67499 48747 9765 34284
10792C4284N774R359K5709m5412l7574m2411L3281N5803P8272k2386l0314L18
$$ 34284 40058 49417 75126 29714 -7860 -50271 -16990 38813 117085 94699 64385 64703
10780F4703L757j8555l7441o4470l8423j4224j3461j3399J2115O5874J7039M3544
$$ 64703 68460 49905 12464 -52006 -90429 -104653 -118114 -131513 -119398 -53524 -36485 7059
10768G059O9571J0121m5376o5817N840K0387k0839m8103j9377N6664K9510M0184
$$ 7059 76630 86751 41375 -24442 -18602 1785 -19054 -67157 -86534 -29870 -360 39824
10756C9824J5999k8680o3257o3862K4258J5577J953o804R926J0829k1923L0841
$$ 39824 55823 27143 -36114 -99976 -75718 -60141 -58188 -64992 -55066 -44237 -66160 -35319
10744c5319J8917k3707M109J214k3740K4238j4823m2740l395P981P0563M1500
$$ -35319 -16402 -40109 -36000 -34786 -58526 -34288 -49111 -91851 -95246 -87265 -16702 24798
10732B4798J6858L252l374M8823L6108J1603o1o947l7928m2740J0807J3051j5973
$$ 24798 41656 44908 41534 90357 126465 138068 138007 131060 93132 50392 61199 74250 58277
10719E8277L1879k417L3841K3708M3564K201O908l4104q3078k6336P377K6882
$$ 58277 90156 87739 121580 145288 188852 191053 197961 163857 80779 54443 61820 88702
10707H8702Q720L6855K2882n07J0633J4768n1891o2791M7283q990m9053K148L3314
$$ 88702 97422 134277 157159 156652 167285 182053 130162 67371 114654 105664 56611 58759 92073
10694I2073N3890N1155K1811o3074j7107L6604N487j1407o084l5006o1881j7966
$$ 92073 145963 197118 218929 155855 138748 175352 180839 169432 163348 128342 66461 48495
10682D8495K7781P749J6102k2044J0719m5785l5350P1281N2364L1303k8046k8339
$$ 48495 76276 84025 100127 78083 88802 43017 7667 78948 131312 162615 134569 106230
10670A06230J0637K8375K1043o7368k7225L343J7274L9582q466l4565m1175n433
$$ 106230 116867 145242 166285 98917 71692 75035 92309 131891 123425 88860 47685 42252
10658D2252k399J9122L7550M9046L2314L961K3764j024O2512N3644L6281O9221
$$ 42252 39853 58975 96525 145571 177885 181846 205610 204586 267098 320742 357023 426244
10646D26244R3850J19886Q622l6962K9369K1656M5066J15137J07152O1140J07896
$$ 426244 520094 639980 648602 611640 641009 662665 707731 822868 930020 991160 1099056
10635A099056J66832K17200K39959K46235K65254K78824K43607J77644L08691
$$ 1099056 1265888 1483088 1723047 1969282 2234536 2513360 2756967 2934611 3243302
10626C243302M31403N64677Q01687J059909J423952K010871K724264L684251M820051
$$ 3243302 3674705 4239382 5041069 6100978 7524930 9535801 12260065 15944316 20764367
10617B0764367O052992O924056O542413M410941J102263j533552k320505j539730
$$ 20764367 26817359 33741415 40283828 44694769 45797032 44263480 41942975 40403245
10609D0403245J97150K547809N430003Q723795J1972201J4043484J2770344O555826
$$ 40403245 40600395 43148204 48578207 57302002 69274203 83317687 96088031 102643857
10601A02643857k189898q120961r006646o540219k735514J601536O345410J1291252
$$ 102643857 100453959 92332998 83326352 76786133 74050619 75652155 81997565 93288817
10593I3288817J5639412J7587416J4352412M345134q590770j6556393j6914970
$$ 93288817 108928229 126515645 140868057 145213191 136622421 120066028 103151058
10586A03151058j3173181q461310l727002P07021M755531P901610Q923512N993085
$$ 103151058 89977877 81516567 77789565 78496586 83252117 91153727 100077239 106070324
10578A06070324j272325r533391j3975910j3415911j0301967o934022l989750
$$ 106070324 104797999 95264608 81288698 67872787 57570820 50636798 46647048
10571D6647048j439952N44403J749944J862907M69219k452867n594819p089270
$$ 46647048 45207096 45751499 47501443 49364350 49833569 47380702 41785883 34696613
10563C4696613o839265n616866m279507l256749k466207j873507j510400j161093
$$ 34696613 27857348 22240482 17960975 14704226 12238019 10364512 8854112 7693019
10555G693019q42836o96509n79741m75285l71080m24732l89295l35307k66638
$$ 7693019 6850183 6153674 5573933 5098648 4727568 4302836 3913541 3578234 3311596
10546C311596k16547k26970j68502j44924j46164j61475j47057r2006m0698j3129
$$ 3311596 3095049 2868079 2699577 2554653 2408489 2247014 2099957 2007951 1967253 1954124
10536A954124n2951n2118n5885p0426j09839q3387N253N818M089n8460l3086l4287
$$ 1954124 1901173 1849055 1793170 1722744 1612905 1529518 1534771 1540589 1544678 1486218 1453132 1418845
10524A418845l1181q616k1278l127k1897j2912q771L1680J4616l3618k3987J7435
$$ 1418845 1387664 1379048 1357770 1354643 1332746 1319834 1311063 1342743 1357359 1323741 1299754 1317189
10512A317189M3525j476K3064Q5902P8150L2095J7045j4771J4128k3136j919k70
$$ 1317189 1360714 1359238 1382302 1468204 1546354 1578449 1595494 1580723 1594851 1571715 1569796 1569526
10500A569526L1846l1071l0155k780n182j0149j2226O7805J0649l8715n5377n0939
$$ 1569526 1601372 1570301 1540146 1537366 1532184 1522035 1509809 1577614 1588263 1549548 1494171 1443232
10488A443232k2579n0491o5100l9338m6981l1096m979M8251j3672n4710n2210
$$ 1443232 1420653 1370162 1305062 1265724 1218743 1187647 1182668 1230919 1217247 1162537 1110327
10477A110327l2722N7583Q6885J3340L8449K4339k716O4238R9772L1776K8183
$$ 1110327 1077605 1135188 1222073 1235413 1273862 1298201 1295485 1359723 1459495 1491271 1519454
10466A519454J43963J98736J38507R2305R9275P8721N8894N9397N2028M9454o867
$$ 1519454 1663417 1862153 2000660 2092965 2192240 2270961 2329855 2389252 2441280 2490734 2483867
10455B483867l9461k9504q0155p9186r9813j32637j41023p1644r6450r5700j36060
$$ 2483867 2444406 2414902 2334747 2255561 2155748 2023111 1882088 1810444 1713994 1618294 1482234
10444A482234n1617m2731o9897j3910J0275N873o7688m2096p009m2619n3090l5296
$$ 1482234 1430617 1387886 1317989 1304079 1314354 1320227 1252539 1210443 1203434 1160815 1107725 1072429
10432A072429k8425J1854n2327r44Q877O910j9807m0462k330l0194m7401m0245
$$ 1072429 1044004 1055858 1003531 1002587 1011464 1018374 998567 958105 955775 925581 878180 837935
10420H37935L7525J0570J2670N6697J4772p2145n1968O4067M7302m0759K0986
$$ 837935 875460 886030 898700 955397 970169 898024 846056 910123 957425 916666 937652
10409I37652M3855j6042p9114J8926N115k2362K7251j4290o4628P584O0030p57
$$ 937652 981507 965465 886351 905277 910392 888030 915281 900991 836363 843947 903977 903220
10397I03220j1242k7689M593L0630L478o323m3606j8049K7290K2453J0429j3174
$$ 903220 891978 864289 868882 899512 902990 896667 853061 835012 862302 884755 895184 882010
10385H82010R063K4540k1512l7500K6804r970k8724o1875k1641j6874K9953J5128
$$ 882010 891073 915613 894101 856601 883405 873435 844711 782836 761195 744321 774274 789402
10373G89402M9333L5480M6678J9155M25L8294K8743j5760M651M1465J5705j8052
$$ 789402 838735 874215 920893 940048 940473 978767 1007510 991750 996401 1037866 1053571 1035519
10361A035519M157o244J3579J9468N9861j7280K9757k6329R176r505N8467K5772
$$ 1035519 1039676 1033432 1047011 1066479 1126340 1109060 1138817 1112488 1121664 1112159 1170626 1196398
10349A196398L5379j4668n7955p708k5695m7213j8552Q5680R017m6509R840j4032
$$ 1196398 1231777 1217109 1159154 1151446 1125751 1078538 1059986 1145666 1154683 1108174 1118014 1103982
10337A103982m8642L197k9761j4957J1542L5413Q144J597Q0879O8496L07K5297
$$ 1103982 1055340 1058537 1028776 1013819 1025361 1060774 1068918 1070515 1151394 1219890 1220197 1245494
10325A245494M5582J26997O1876R1907P2683M1572L1422K9957R8891J06813P0481
$$ 1245494 1291076 1418073 1479949 1571856 1644539 1686111 1717533 1747490 1846381 1953194 2023675
10314B023675P651K8183j3724N7456M3746J0893L1675p2497l5456J0986j2640
$$ 2023675 2031326 2059509 2045785 2103241 2146987 2157880 2189555 2117058 2081602 2092588 2079948
10303B079948L0710m8067j1242k957J8053K7181M7162k6536l7047N9470Q3517
$$ 2079948 2110658 2062591 2051349 2048392 2066445 2093626 2140788 2114252 2077205 2136675 2220192
10292B220192J07202M6332o482O3432Q7967Q093M9757J30088R9905Q5657J40737
$$ 2220192 2327394 2373726 2367244 2430676 2518643 2526736 2576493 2706581 2806486 2892143 3032880
10281C032880J46413R8868O5442O0990J03598L6407N7562O9407J6086N528O4245
$$ 3032880 3179293 3278161 3343603 3404593 3508191 3544598 3602160 3671567 3687653 3693181 3757426
10270C757426O2173l5351K443J4407l3592j2362K4323j2539R4343Q1236P3624
$$ 3757426 3819599 3784248 3786691 3801098 3767506 3755144 3779467 3766928 3861271 3942507 4016131
10259D016131K9046N5187R1049R6992j2826L4432N1109p21O1652J23482Q9969
$$ 4016131 4045177 4100364 4191413 4288405 4275579 4310011 4361120 4360399 4422051 4545533 4635502
10248D635502O5935M7326Q9732J24723R7805J16038J44485J52941J60809K52969
$$ 4635502 4701437 4748763 4838495 4963218 5061023 5177061 5321546 5474487 5635296 5888265
10238E888265K58297J48229K61916K66568K60915K30073K65395K97887L04024
$$ 5888265 6146562 6294791 6556707 6823275 7084190 7314263 7579658 7877545 8181569
10229H181569L74622L97671L92100M44669M57984N25334O32648N88205O85815
$$ 8181569 8556191 8953862 9345962 9790631 10248615 10773949 11406597 11994802 12680617
10220A2680617P84649R32876J072353J202432J309616J495281J624290J862299
$$ 12680617 13465266 14398142 15470495 16672927 17982543 19477824 21102114 22964413
10212B2964413K232818K529330K931165L394547L940137M682947N531571O613544
$$ 22964413 25197231 27726561 30657726 34052273 37992410 42675357 48206928 54820472
10204E4820472P947872R568945J1459913J3546531J5632931J7645407J9335337
$$ 54820472 62768344 72337289 83797202 97343733 112976664 130622071 149957408
10197A49957408K0314417K0387039J9515385J7704769J5186166J2314364R180790
$$ 149957408 170271825 190658864 210174249 227879018 243065184 255379548 264560338
10190B64560338O451760M128753K137535K48593j661265l812027o360137r335370
$$ 264560338 271012098 275140851 277278386 277526979 275865714 272053687 265693550 256358180
10182B56358180j2503054j5417862j7774742j9237818j9752107j9268658j7902463
$$ 256358180 243855126 228437264 210662522 191424704 171672597 152403939 134501476
10175A34501476j5992991j3789970j1715699r774461q020892o454654n141968
$$ 134501476 118508485 104718515 93002816 83228355 75207463 68752809 63610841
10168F3610841m042143l064058k385786j781661j357335j021985p92631o43853
$$ 63610841 59568698 56504640 54118854 52337193 50979858 49957873 49165242 48521389
10160D8521389n84404n43752p28097p97667r31162j032097j110030j187326j252879
$$ 48521389 47936985 47393233 46665136 45867469 44936307 43904210 42794180 41606854 40353975
10151D0353975j240312j101000r77729q92400q30157o53596m72115l76319l38657
$$ 40353975 39113663 38012663 37034934 36142534 35312377 34658781 34186666 33810347 33471690
10142C3471690k58413k37446k55327j30961J4564K10003M16973O11967P07272
$$ 33471690 33213277 32975831 32720504 32589543 32604107 32814110 33231083 33843050 34550322
10133C4550322Q88233J036147J194114J314435J334759J355967J474030J613875
$$ 34550322 35438555 36474702 37668816 38983251 40318010 41673977 43148007 44761882
10125D4761882J885626K185012K531054L023068L725574M437762N391052O576842
$$ 44761882 46647508 48832520 51363574 54386642 58112216 62549978 67941030 74517872
10117G4517872P782778R131585J0315025J0994154J1008871J0068668Q055447
$$ 74517872 82300650 91432235 101747260 112741414 123750285 133818953 141874400
10110A41874400N266665K000245j105995l406916m718191m815993l842097k200316
$$ 141874400 147141065 149141310 148035315 144628399 139910208 135094215 131252118 129051802
10102A29051802j63242J953015M026322N563290O316716O133077M733145K331086
$$ 129051802 128888560 130841575 134867897 140431187 146747903 152880980 157614125 159945211
10094A59945211o56871l752676o422863q160428q926175q680523p744322o412890
$$ 159945211 159288340 155535664 149112801 140952373 132026198 123345675 115601353 109188463
10086A09188463n012053l580435k169784r06183L10067J435021K592276L824209
$$ 109188463 104176410 100595975 98426191 97520008 97830075 99265096 101857372 105681581
10078A05681581N159086O667856Q298643J0183621J2449630J5017388J7815867
$$ 105681581 110840667 117508523 125807166 135990787 148440417 163457805 181273672
10071A81273672K0662073K3125147K5244560K6259181K6039406K4590239K1708392
$$ 181273672 201935745 225060892 250305452 276564633 302604039 327194278 348902670
10064C48902670J7443621J2245343O149580m26952o999215j3067866j8435316
$$ 348902670 366346291 378591634 384741214 384314262 377315047 364247181 345811865
10057C45811865k2545185k5422170k6875837k7032302k6001217k4092708k1574099
$$ 345811865 323266680 297844510 270968673 243936371 217935154 193842446 172268347
10050A72268347j8808850j6091127j3624516j1453991r652109q055152o853149
$$ 172268347 153459497 137368370 123743854 112289863 102637754 94582602 87729453
10043H7729453n949834n113393m464235l898931l355632k843790k468279k114853
$$ 87729453 81779619 76666226 72201991 68303060 64947428 62103638 59635359 57520506
10035E7520506j768927j478409j183283r58104p70169n54979l79011k55102o9445
$$ 57520506 55751579 54273170 53089887 52131783 51361614 50806635 50427624 50172522 50103077
10026E0103077q621J3447l1503k7436j53852l65699n71365p19910q24212r26516
$$ 50103077 50094456 50107903 50076400 50048964 49895112 49529413 48958048 48238138 47413926 46487410
10016D6487410r15209r00630q47906p77839o79627o01218n96670n28435n00519
$$ 46487410 45572201 44671571 43823665 43045826 42366199 41764981 41168311 40639876 40139357
10007D0139357n63468n83179o04797n91115o60336p37879q01408r44818q84370
$$ 40139357 39575889 38992710 38387913 37796798 37136462 36398583 35597175 34652357 33767987
9998C3767987p99038p33387p25764o51971n09635m27956l18911j56071j00942
$$ 33767987 32968949 32235562 31509798 30857827 30348192 29920236 29601325 29445254 29344312
9989B9344312j28350r1921j9956k1938o1175n4763o5089k7784Q5017K28690K39251
$$ 29344312 29215962 29124041 29104085 29082147 29020972 28966209 28901120 28873336 28958353 29187043 29426294
9978B9426294K23506J69227J04259o814k33010m78032o06739p82010r84160j014308
$$ 29426294 29649800 29819027 29923286 29916472 29683462 29205430 28598691 27816681 26832521 25818213
9968B5818213j152609j175278j137647j090680j037210r51705q19054n96967m79867
$$ 25818213 24665604 23490326 22352679 21261999 20224789 19273084 18454030 17857063 17377196
9959A7377196l75310k01454j44824k0648K03745L02912K69124J48769Q2698o9131
$$ 17377196 17001886 16800432 16655608 16634960 16838705 17141617 17410741 17559510 17642208 17573077
9949A7573077k93991n47143q01107j037538j043828j041816r87310r97108r16379
$$ 17573077 17279086 16731943 15930836 14893298 13849470 12807654 11820344 10823236 9906857
9940I906857q21288o66439n85903m16578l46865l06704k56465k30300j33553j51275
$$ 9906857 9085569 8419130 7833227 7416649 7069784 6763080 6506615 6276315 6142762 5991487
9930E991487j02264j28691k45370k32675j38269j30264r7750q6691j15743j45399
$$ 5991487 5889223 5760532 5515162 5282487 5144218 5013954 4916204 4829513 4713770 4568371
9920D568371j17044o5332n1812q8174m8802o9947j00844k8754m6898p3399r9442
$$ 4568371 4451327 4385995 4334183 4246009 4197207 4127260 4026416 3997662 3950764 3877365 3777923
9909C777923k5460m9783o7371p4197n6058m6254q465M364o3979n7961P175l9908
$$ 3777923 3752463 3702680 3635309 3561112 3505054 3458800 3450335 3454699 3390720 3332759 3339934 3300026
9897C300026k1756o8555j23997n2905p7467k9244p7473j09831r9923k6146l7987
$$ 3300026 3278270 3209715 3085718 3032813 2955346 2926102 2848629 2738798 2638875 2612729 2574742
9886B574742j8023q2324J199l123j8834m0398m5420n9679l6998J804n0880j0706
$$ 2574742 2556719 2474395 2475594 2472471 2453637 2413239 2367819 2308140 2271142 2272946 2222066 2211360
9874B211360K6423n8350m6308k0251n1064n2625k6942n2076k5341N307j8319p1314
$$ 2211360 2237783 2179433 2133125 2112874 2061810 2009185 1982243 1930167 1904826 1910133 1891814 1820500
9862A820500l0531j0860l1694r360l0939p043j02552p7151j0857N9695L9536k3291
$$ 1820500 1789969 1779109 1747415 1738055 1707116 1700073 1597521 1520370 1509513 1569208 1608744 1585453
9850A585453j7358k2322O73j0728j8777O509J2917M96m9015m2635k5473k7082
$$ 1585453 1568095 1545773 1546446 1535718 1516941 1523450 1536367 1536863 1487848 1445213 1419740 1392658
9838A392658M1316j9693k5532m3726L5389N6719O2272m183k7341j8558l1576p659
$$ 1392658 1433974 1414281 1388749 1345023 1380412 1437131 1499403 1495220 1467879 1449321 1417745 1410086
9826A410086K9307N6984J2702j7656m0922o4270o1602m2074m9510M015K0152M5601
$$ 1410086 1439393 1496377 1509079 1491423 1450501 1386231 1324629 1282555 1233045 1237060 1257212 1302813
9814A302813n0792J9506L4917L8664m5050r022p127j8332Q11M7284M5588L8117
$$ 1302813 1252021 1271527 1306444 1345108 1300058 1291036 1283909 1265577 1266388 1313672 1359260 1397377
9802A397377q707O4978N3034N9780Q6280J17862J34394J07311R1632P8722R2656
$$ 1397377 1388670 1453648 1506682 1566462 1652742 1770604 1904998 2012309 2103941 2182663 2275319
9791B275319P3539L0111M2956P0538L9962p766m7421j2644n9827l2541p5295j52539
$$ 2275319 2348858 2378969 2421925 2492463 2532425 2524659 2477238 2464594 2404767 2372226 2296931 2144392
9779B144392j01058o4526j00179j12137q6068j48273q3244j1963k0316k6758p5627
$$ 2144392 2043334 1978808 1878629 1766492 1680424 1532151 1448907 1436944 1416628 1389870 1314243
9768A314243k8930o394r0368m4443l2009k458N3990o955q6058m0791l203Q036
$$ 1314243 1285313 1278919 1188551 1144108 1112099 1109641 1163631 1156676 1070618 1029827 1026624 1034660
9756A034660J4477N4823O9396K6574k001l4290p798J6562j639M3252P8255O9430
$$ 1034660 1049137 1103960 1173356 1199930 1197929 1163639 1155841 1172403 1170764 1214016 1292271 1361701
9744A361701O2008Q9628N7661J33135J43561J88132K77679L40970M52745N20584
$$ 1361701 1423709 1513337 1570998 1704133 1847694 2035826 2313505 2654475 3107220 3627804
9734C627804O47070P72138Q02096Q49316Q46501P20761N35069L00671j513k75158
$$ 3627804 4274874 5047012 5849108 6698424 7544925 8265686 8800755 9101426 9099913 8824755
9724H824755m93911o98914q26892q03668p84936p28109o51852m71892l49659k37137
$$ 8824755 8330844 7631930 6805038 6001370 5216434 4488325 3836473 3364581 3014922 2777785
9714B777785k47075j92218m6541j4874r3624j37253r2669o3220r8069m7844m919
$$ 2777785 2530710 2338492 2291951 2277077 2183453 2046200 1953531 1890311 1792242 1744398 1739479
9703A739479j29425p1973m185J463J1713j2170j817P1552J5057n7385n7267m2227
$$ 1739479 1610054 1538081 1533896 1535359 1547072 1534902 1533085 1604637 1619694 1562309 1505042 1462815
9691A462815P670K6857m223l5275n0345J4333j06177j10859k8867l4523m2462
$$ 1462815 1470485 1497342 1493119 1457844 1407499 1421832 1315655 1204796 1175929 1141406 1098944
9680A098944l1713m138R2063N3174O2963R9668R4113M9239K5306k1864O4824J27026
$$ 1098944 1067231 1063093 1155156 1208330 1271293 1370961 1465074 1514313 1539619 1517755 1582579 1709605
9668A709605J71503J33805J21643P4273Q5743J72794J27797L0155r89r787l7651
$$ 1709605 1881108 2014913 2136556 2210829 2296572 2469366 2597163 2627318 2626329 2616542 2578891
9657B578891n5363P230m4746L7517R2973Q9293k11483m36177l09544k05394j44514
$$ 2578891 2523528 2530758 2486012 2523529 2616502 2705795 2494312 2058135 1748591 1543197 1398683
9646A398683j15422j11881l7124k2591j02326r1923K3333O8790l1825n6654l2321
$$ 1398683 1283261 1171380 1134256 1111665 1009339 917416 940749 1009539 977714 921060 888739
9635H88739o7410L783p149n7928k5416J4415k991J6365N791j2355M7748Q964m7917
$$ 888739 821329 825112 817963 760035 734619 749034 746043 762408 768199 755844 803592 812556 764639
9622G64639m242j3864q5292M135O8671N1979l0542m5944o6167j3227J9236J4967
$$ 764639 760397 746533 661241 665376 734047 786026 755484 709540 643373 630146 649382 664349
9610F64349j8433j2926Q723q430J4519k143K7471q609K0939J3480p909p793J4
$$ 664349 645916 632990 641713 633283 647802 645659 673130 664521 685460 698940 691031 683238 683252
9597F83252n0383l1813M3365M5597K3686M5875o1668j6386K0281j3740K0060l8900
$$ 683252 632869 601056 644421 690018 713704 759579 697911 681525 701806 688066 708126 669226
9585F69226o499M1022L691k2597K3422k4029K4146m7035n6316p944L1917K4098
$$ 669226 662727 703749 707440 684843 708265 684236 708382 661347 605031 597087 629004 653102
9573F53102O441j7959o1831j0754J5043q353K8803K8759m5808l8303K8842k1462
$$ 653102 659543 641584 579753 568999 584042 575689 604492 633251 587443 549140 577982 556520
9561E56520j9318J2990N355n1965j2109K2866k5528O334O3685N1746o0541j9367
$$ 556520 537202 550192 555547 503582 491473 514339 488811 495145 558830 610576 550035 530668
9549E30668l307O490k7614N267K3255L2236o482k5225k0611k143n9571j0927J9049
$$ 530668 527361 533851 506237 511504 534759 566995 560513 535288 514677 512534 452963 442036 461085
9536D61085K7055O647l4445M9164J8787j55m6230l0586j6629k1744L6806J2518
$$ 461085 488140 494787 460342 509506 528293 528138 481908 451322 434693 412949 449755 462273
9524D62273j0440J9676m6453L0015L5391k6520q712j5529J2177K6472l4128n0398
$$ 462273 451833 471509 425056 455071 490462 463942 455230 439701 451878 478350 444222 393824
9512C93824k8202k4638l8367K5027J0529j9464K1142N2894K1163k6655O493j6270
$$ 393824 365622 340984 302617 327644 338173 318709 339851 392745 413908 387253 393746 377476
9500C77476O1865l2717l0668N9425J5201l0340o2379j5608l5657L0339K6700k4705
$$ 377476 439341 406624 375956 435381 450582 420242 357863 342255 306598 336937 363637 338932
9488C38932L3783k4499k3021j0533J6468L15m6327N5117J3740n0407l7057N5687
$$ 338932 372715 348216 325195 314662 331130 331445 285118 340235 353975 303568 266511 322198
9476C22198M4145l699l9192o1767k586M1267O608j1847k0207N1920R5689L6833
$$ 322198 366343 362644 323452 261685 259099 300366 306974 295127 274920 326840 422529 459362
9464D59362p5009o0609L8194P2599j969k8665j1306j8332K1600K434J9912m3260
$$ 459362 384353 323744 361938 434537 432568 403903 392597 374265 395865 398299 418211 374951
9452C74951q3854l179R2346k4607j7234M9787J2494J6184n658J7344L720J3067
$$ 374951 291097 287918 380264 355657 338423 388210 400704 416888 411230 428574 432294 445361
9440D45361j2739m4595j1347K3799k0595l1597k6723j7908J4883K2103q540O819
$$ 445361 432622 388027 376680 400479 379884 348287 321564 303656 318539 340642 332102 338921
9428C38921n610N1007J7097p502k2654m291j6270o649K59P94K8913k6111j8172
$$ 338921 333311 384318 401415 393913 371259 366968 350698 344049 344308 345102 374015 347904 329732
9415C29732r713L4216K2396j6496K154n8481l9241J0888J0087L0161r2l0179l4382
$$ 329732 320019 354235 376631 360135 362289 303808 264567 275455 285542 315703 315611 285432 251050
9402B51050l8171Q6042M2080J8265J8907m0988j9227L9124L6041l9903m2558P228
$$ 251050 212879 298921 341001 359266 378173 337185 317958 357082 393123 353220 310662 317890
9390C17890M9299j1790l8641l7620r515L8717Q191l095q280j4877l3005k4726
$$ 317890 367189 355399 316758 279138 269623 308340 316531 313436 305156 290279 257274 232548
9378B32548L0216j6473K8102M55j3467k731L6760L7314M2808J6136j09k0070J0596
$$ 232548 262764 246291 274393 274848 261381 258650 295410 332724 375532 391668 391559 371489 382085
9365C82085j8068m7379r985j2857m4791P426k9581L3978K7514J3101K3030p36
$$ 382085 364017 316638 306653 293796 249005 256431 226850 260828 288342 301443 324473 323737
9353C23737k2013r077k0827J4752k23k0941j9389Q692R006J2077L9831k4433m2610
$$ 323737 301724 292647 271820 286572 286349 265408 246019 254711 263717 275794 315625 291192 248582
9340B48582p243p8404k856M6271K1678K8115M6949K4599m192J1470J7876O1239
$$ 248582 241339 162935 160079 206350 228028 256143 303092 327691 323499 334969 352845 414084
9328D14084j9541m1044J801L2056k1696n4110n5156k6809L5414n8568j180P3699
$$ 414084 394543 353499 355300 387356 365660 311550 256394 229585 264999 206431 205251 278950
9316B78950Q2945K0292K8549j1167l9551m0093o99m5580j2956L8182K306n4199
$$ 278950 361895 382187 410736 399569 360018 319925 319226 273646 260690 298872 301178 246979
9304B46979K8842L5368P5807N881J0605l16Q070k5346l001K3702l0243j4704l4116
$$ 246979 275821 311189 386996 392877 403482 403166 411236 385890 382889 406591 376348 361644 327528
9291C27528m3417K58l1258K3863J3263l3351R755k4654j5228J0639O046O3718
$$ 327528 284111 284369 253111 276974 290237 256886 266641 241987 226759 237398 243444 307162
9279C07162L1375n8222m1571j5338L7318K8929L2347M3225P1335k2464o6855l7802
$$ 307162 338537 280315 238744 223406 260724 289653 322000 365225 436560 414096 347241 309439
9267C09439L5669K2953l5787M366M9513o152k672J7286J4318n9159o1749L635
$$ 309439 345108 368061 332274 336640 386153 380001 377329 394615 408933 349774 288025 291660
9255B91660K8981K0674j721j1516l4123J4737M7519J0289k6892j18040k3150O6785
$$ 291660 320641 341315 339594 328078 293955 308692 356211 366500 339608 221568 198418 265203
9243B65203m7723k7732J4201P8785O4604L841L2637k2814m1620k4186K6783K4895
$$ 265203 217480 189748 203949 282734 347338 351179 383816 361002 319382 295196 321979 346874
9231C46874j1909o552N1530K263J1935L606l0094j924K2065J0984O8744j9492
$$ 346874 334965 328413 379943 382206 394141 397747 367653 365729 387794 398778 467522 448030
9219D48030L7801M5271k1080K7382K4981j4206l3430n3808k2297L4184O6o7997
$$ 448030 485831 531102 510022 537404 562385 548179 514749 460941 438644 472828 472894 404897
9207D04897N2806P9049N3321l2490m3072k9136l4972k274L0372j5724l912K9274
$$ 404897 457703 536752 590073 557583 514511 485375 450403 448129 478501 462777 458865 488139
9195D88139o424r420q392P02m5637l8201L6097K8635J0230M4526J8169L8154j483
$$ 488139 481715 472295 463903 464605 418968 380767 416864 445499 455729 500255 518424 556578 555095
9182E55095l2042k0865L5880L0517O119J7432N0096M0264K2975k552N219L9132
$$ 555095 523053 502188 538068 568585 574704 592136 642232 682496 705471 702919 708138 747270
9170G47270K8623M0680Q5566J2468j8396J2011l1831n3777j6264J3568p4109m4376
$$ 747270 775893 816573 902139 914607 896211 908222 876391 822614 806350 819918 745809 701433
9158G01433K4657L8399k7107n0970O4436K703n1999l5082o3261k5215L4853J701
$$ 701433 726090 764489 737382 686412 750848 753551 701552 666470 603209 577994 612847 614548
9146F14548J9839J0413j1970M1627l2792K1796N763M018l3967k0947M7015L7382
$$ 614548 634387 644800 632830 674457 641665 663461 669224 673242 639275 618328 665343 702725
9134G02725N0276L793J2677L3031k3431J0093K3149N9514R4035N2828K7812k8389
$$ 702725 753001 756794 769471 802502 779071 789164 812313 871827 965862 1018690 1046502 1018113
9122A018113p6676L230P6746l2979p1658j3854P152J0839J6512k8051l5126j1781
$$ 1018113 941437 944667 1021413 988434 916776 902922 910074 920913 937425 909374 874248 862467
9110H62467m0014R295N07j5441K2747O818N248n3582o9357l0249j9508m0918M2502
$$ 862467 822453 831748 832255 816814 839561 846379 851627 798045 728688 698439 678931 638013 680515
9097F80515M615m3110j6525k3932j3441L4823P3555K7621j7461l0172o358J6629
$$ 680515 685130 642020 625495 601563 588122 622945 696500 724121 706660 676488 670130 686759
9085F86759L8314M2673N438j1116P3909L6129J2782j974j8583J1183q443q367
$$ 686759 725073 767746 773184 762068 835977 872106 884888 882914 864331 875514 867071 858704
9073H58704L291L0636l3356n594K6851k9268J2772j7373k3950k1223o167j8036
$$ 858704 861995 892631 859275 853681 880532 851264 864036 846663 822713 801490 795323 777287
9061G77287m7635L2140K1859R797o838j8006k4435l5322q7064N1679j3452m0927
$$ 777287 729652 761792 783651 793448 786610 768604 744169 708847 621783 673462 660010 619083
9049F19083O743k2589K3560N7863n9329m7167K6398O0434K2040n755P773J96l705
$$ 619083 625826 603237 626797 684660 625331 578164 604562 664996 687036 681281 689054 689250 685545
9036F85545J6356K5770L4588m113J575k4119k0372J7485M9883m677p2875k8451
$$ 685545 701901 727671 762259 758146 759721 735602 715230 732715 782598 777921 705046 676595
9024F76595K4439n38l069j8701L8312L3836L2365k2257j6982L3623n056l4066
$$ 676595 701034 700496 697427 678726 717038 750874 783239 760982 744000 777623 772567 738501
9012G38501l0301K7659m4399J0278K8045J5120k1810l9666n881O654n3370L6628
$$ 738501 708200 735859 691460 701738 729783 744903 723093 683427 677546 684200 630830 667458
9000F67458P9850M577p1385l5464j3239O89L9166K3369j9683n4008k6008L4932
$$ 667458 747308 751885 680500 645036 631797 632486 671652 695021 675338 621330 595322 630254
8988F30254K5299M0882J9921k5302q032k0361j6949L9456P5637N3284o2337n1412
$$ 630254 655553 696435 716356 691054 683022 662661 645712 685168 760805 814089 751752 700340
8976G00340L0691Q2843K3326l6758j1495N1211K1413J3391j8927K3636K275l9894
$$ 700340 731031 813874 837200 800442 788947 840158 861571 874962 856035 879671 881946 842052
8964H42052l5009N9698M6095j1334p66j00551n241L4043M4655L7261m1171k8369
$$ 842052 807043 866741 912836 901502 900736 800185 794944 828987 873642 910903 869732 841363
8952H41363M1033K18m739j6059K6329r726L0490k9336k4130l271q527k3479R995
$$ 841363 882396 882614 877875 861816 888145 878419 908909 879573 855443 852172 843645 820166 830161
8939H30161J037L4626L7091Q9286l375K9107K6328j7487k4571k2085J2766k0152
$$ 830161 831198 865824 902915 992201 988826 1017933 1044261 1026774 1002203 980118 992884 972732
8927I72732k0382J9549L1871P2520l2383l4238J8398L2407l8264m5889P1489l1203
$$ 972732 952350 971899 1003770 1076290 1043907 1009669 1028067 1060474 1022210 976321 1047810 1016607
8915A016607J0158K3158k774q085N562L9814j0590L4904R1070M4458p463N212
$$ 1016607 1026765 1049923 1047149 1039064 1044626 1084440 1073850 1108754 1199824 1244282 1236819 1242031
8903A242031K5903J2320R8443K9122j8577K5055N6463R9451M3579j1896K0026
$$ 1242031 1267934 1280254 1378697 1407819 1389242 1414297 1470760 1570211 1613790 1601894 1621920
8892A621920O6793Q9341J21471J19590J00266J37640J15480N0407P4093J35140
$$ 1621920 1688713 1778054 1899525 2019115 2119381 2257021 2372501 2422908 2497001 2632141
8882B632141Q2038P3519M4256J34972J48582J64937L9619N179N0185O5343P695
$$ 2632141 2714179 2787698 2831954 2966926 3115508 3280445 3320064 3325243 3375428 3440771 3448466
8871C448466J1705J9438r109Q527R3542J07178N1018O4416J41513J64062K14714
$$ 3448466 3460171 3479609 3470500 3479027 3572569 3679747 3730765 3795181 3936694 4100756 4315470
8860D315470K16994J84442K04346J32508J61081J43178Q6109N9794M4590J08221
$$ 4315470 4532464 4716906 4921252 5053760 5214841 5358019 5444128 5503922 5548512 5656733
8850E656733J23956Q3887J31640J48903J80287K57545L12086L53457L25995K97235
$$ 5656733 5780689 5864576 5996216 6145119 6325406 6582951 6895037 7248494 7574489 7871724
8840G871724L14949L01099L97214L70317L82057M01986M45035L86189L56559L62053
$$ 7871724 8186673 8487772 8884986 9255303 9637360 10039346 10484381 10870570 11227129 11589182
8830A1589182L88225L79737L83692M10354L61335M45320M98027N27792M73368
$$ 11589182 11977407 12357144 12740836 13151190 13512525 13957845 14455872 14983664 15457032
8821A5457032M58356M23047N01312N61682O00476N92733N44761N05470N12337
$$ 15457032 15915388 16338435 16839747 17401429 18001905 18594638 19139399 19644869 20157206
8812B0157206M62386M48244K93422K34761P6359m7277j79541k42570k72112k44628
$$ 20157206 20619592 21067836 21361258 21596019 21672378 21625101 21445560 21202990 20930878 20686250
8802B0686250j30651K0031J46110J85019L52577M79495O34463P08099Q10621R08399
$$ 20686250 20555599 20575630 20721740 20906759 21259336 21738831 22373294 23081393 23892014 24800413
8792B4800413J015842J129119J162407J303561J432259J524233J563292J637532
$$ 24800413 25816255 26945374 28107781 29411342 30843601 32367834 33931126 35568658
8784C5568658J743582J899984J948416J981064K002125J990303J974906K009271
$$ 35568658 37312240 39212224 41160640 43141704 45143829 47134132 49109038 51118309
8776E1118309J940250J883097J869153J989226K134350K299222K365325K460589
$$ 51118309 53058559 54941656 56810809 58800035 60934385 63233607 65598932 68059521
8768F8059521K538476K478749K469769K186633J748800J159024L24450l62233
$$ 68059521 70597997 73076746 75546515 77733148 79481948 80640972 80965422 80603189
8760H0603189r08489j341867j573622j453038j261495q78646m65815K3132N55529
$$ 80603189 79694700 78352833 76779211 75326173 74064678 73186032 72720217 72743349 73298878
8751G3298878J068319J613062K147017K599494K890652L053147L210792L272566
$$ 73298878 74367197 75980259 78127276 80726770 83617422 86670569 89881361 93153927
8743I3153927L153456K991660K836275K576068K180120J858134J543636J151474
$$ 93153927 96307383 99299043 102135318 104711386 106891506 108749640 110293276 111444750
8735A11444750P95347N89219L86626J97741R3295J16861K42500M53793N88410
$$ 111444750 112240097 112829316 113215942 113413683 113506978 113623839 113866339 114320132 114908542
8726A14908542R10746J345161J734525K147538K583095K946923L065572L006061
$$ 114908542 115819288 117164449 118898974 121046512 123629607 126576530 129642102 132648163
8718A32648163K593011J788582P93407k63382j374381k423015l155459l531018
$$ 132648163 135241174 137029756 137823163 137559781 136185400 133762385 130606926 127075908
8710A27075908l635658l464940l234224k844013k335215j864730j431110j099834
$$ 127075908 123440250 119975310 116741086 113897073 111561858 109697128 108266018 107166184
8702A07166184p81224m89037k69268r0960o3850j47813k36532l18467n29626p80359
$$ 107166184 106384960 105895923 105626655 105535695 105471845 105324032 105087500 104769033 104239407 103459048
8692A03459048r41036j176318j284830j348495j406007j340032j387355j380876
$$ 103459048 102518012 101341694 100056864 98708369 97302362 95962330 94574975 93194099
8684I3194099j371504j413881j566469j758571j886600j857188j721727j507449
$$ 93194099 91822595 90408714 88842245 87083674 85197074 83339886 81618159 80110710
8676H0110710j281265j154619r55523r05181r55703j026474j102480j236698j280967
$$ 80110710 78829445 77674826 76719303 75814122 74858419 73831945 72729465 71492767 70211800
8667G0211800j424151j479014j516325j578142j582132j610429j582279j570284
$$ 70211800 68787649 67308635 65792310 64214168 62632036 61021607 59439328 57869044
8659E7869044j607457j559664j570917j524501j402861j383160j265562j080614
$$ 57869044 56261587 54701923 53131006 51606505 50203644 48820484 47554922 46474308
8651D6474308j006333r60007q44256o60895n93874m49928m50189m78208m82344
$$ 46474308 45467975 44507968 43663712 43002817 42408943 41959015 41508826 41030618 40548274
8642D0548274n28021o03974p16120p77727q06854q91010j009395j138381j300928
$$ 40548274 40020253 39416279 38700159 37922432 37115578 36224568 35215173 34076792 32775864
8633C2775864j341295j329027j182945j096248j021170q98467q00873p02653o22313
$$ 32775864 31434569 30105542 28922597 27826349 26805179 25906712 25105839 24403186 23780873
8624B3780873n32866m22608m56491l78994l18079k97150k18652j33890j72323
$$ 23780873 23248007 22825399 22368908 21989914 21671835 21374685 21156033 21022143 20849820
8615B0849820j71939k19963l07973k96322l34533l77928l73724l50780l14696
$$ 20849820 20677881 20457918 20149945 19853623 19519090 19141162 18767438 18416658 18101962
8606A8101962l06434l05888j70358k08980j99911j68996j60459k29325k58792
$$ 18101962 17795528 17489640 17319282 17110302 16910391 16741395 16580936 16351611 16092819
8597A6092819l29575l12389l28652l77443m68872m61845m27968m84680m96260
$$ 16092819 15763244 15450855 15122203 14744760 14275888 13814043 13386075 12901395 12405135
8588A2405135m28614m82255n14620m12668l80410m08377l84077l34592l25670
$$ 12405135 11976521 11494266 10979646 10566978 10186568 9778191 9394114 9059522 8733852
8579H733852l64947k73333j92937k03741k11759j85807j50298n5812r9369j50086
$$ 8733852 8368905 8095572 7902635 7698894 7487135 7301328 7151030 7095218 6995849 6845763
8569F845763j17692j08906j16214o8606r5490j54897j34947j28457j51659j53536
$$ 6845763 6728071 6619165 6502951 6434345 6338855 6183958 6049011 5920554 5768895 5615359
8559E615359j84539j89065j96470j56333j46172j52163j11170j14423k6948k4971
$$ 5615359 5430820 5241755 5045285 4888952 4742780 4590617 4479447 4365024 4338076 4313105
8549D313105o0201p3032q801o7372j08946j31994r1121j63781j38524j63592j57908
$$ 4313105 4252904 4179872 4171071 4103699 3994753 3862759 3771638 3607857 3469333 3305741 3147833
8538C147833j78936j65377j24206j18099n3096q3988q3121o2869l8204m8146j06063
$$ 3147833 2968897 2803520 2679314 2561215 2508119 2424131 2341010 2278141 2239937 2191791 2085728
8527B085728p8497n2341n2579q0682q0753M35O414m1104m5716k5985o9327n9403
$$ 2085728 2007231 1954890 1902311 1821629 1740876 1741311 1747725 1706621 1660905 1634920 1565593 1506190
8515A506190q4307m3534k756l3515k794j5971k1356M8627m7010r1079m2378K0967
$$ 1506190 1421883 1378349 1375593 1342078 1339284 1323313 1301957 1350584 1303574 1212495 1170117 1191084
8503A191084p714j5729J2482n781j6782l0775l9566j303M2556L52J6466j14075
$$ 1191084 1183370 1167641 1180123 1174342 1157560 1126785 1087219 1085916 1128472 1128824 1145290 1031215
8491A031215o7014N7729K0501r477n803p357J8306N6715j8275j06746r9033j3108
$$ 1031215 964201 1021930 1042431 1032954 1027151 1019794 1038100 1094815 1076540 969794 870761 857653
8479H57653L1626M2927l481L8965L6592j1035P986M2889j5145J5715L3502k5904
$$ 857653 889279 932206 928725 967690 1004282 993247 1001233 1044122 1028977 1044692 1078194 1052290
8467A052290p5419n2330j8255K0773L6482j7858k6317J6077L9705l5020o6879
$$ 1052290 976871 924541 906286 927059 963541 945683 919366 935443 975148 940128 873249
8456H73249M0474l270l7393l6821J7507j5801l0917K5302P903l4170J7370L527
$$ 873249 913723 910453 873060 836239 853746 837945 807028 832330 840233 806063 823433 826960
8444H26960j4269o940K4199q545k269n0975j9666l1335k3951P524L0059R950J341
$$ 826960 812691 805751 829950 821405 819136 768161 748495 717160 693209 700733 730792 740742 742083
8431G42083n5778m4240M9537j2806j2801L2749K8713k2018J7744L1126J8463K5620
$$ 742083 686305 642065 691602 678796 665995 698744 727457 705439 723183 754309 772772 798392
8419G98392l5971m4186M8099O4874K6303P782r766J9234Q7882M2834j6729k4413
$$ 798392 762421 718235 766334 831208 857511 865293 855527 874761 962643 1005477 988748 964335
8407I64335J734j8469L5553k2769K3205O8609M2287L0728l1977Q135N8945K9601
$$ 964335 966069 947600 983153 960384 983589 1052198 1094485 1125213 1093236 1101371 1160316 1189917
8395A189917J0497J4228l8833k9281O8232N4858J9378l4923K737J2872n2558j4293
$$ 1189917 1200414 1214642 1175809 1146528 1214760 1269618 1288996 1254073 1256810 1269682 1217124 1202831
8383A202831L5545k3204n3787K8809j7706o4478J741K2217L3565J318O651J7885
$$ 1202831 1238376 1215172 1161385 1190194 1172488 1108010 1109751 1131968 1165533 1166851 1173502 1191387
8371A191387N477j3197K9601J9818K5375L2203J08226R1374k0997J3750P5099
$$ 1191387 1196864 1183667 1213268 1233086 1258461 1290664 1398890 1490264 1469267 1483017 1558116
8360A558116J24302P3048J45367J57552Q8168J31334J01920q9331q8646q5665
$$ 1558116 1682418 1755466 1900833 2058385 2146553 2277887 2379807 2290476 2201830 2116165
8350B116165r4338j20167j41795j29832j22848r6983l5544k9758o9341J0079l8741
$$ 2116165 2021827 1901660 1759865 1630033 1507185 1410202 1374658 1344900 1275559 1285638 1246897
8339A246897j5135L0991m6285m3380j0973j1986K591l8731K2298L8113l1603M153
$$ 1246897 1231762 1262753 1216468 1173088 1162115 1150129 1152720 1113989 1136287 1174400 1142797 1146950
8327A146950R850O925O6748O8701J5094j9655M401k0038J3453J5399l261K3201
$$ 1146950 1156800 1163725 1230473 1299174 1314268 1294613 1299014 1278976 1292429 1307828 1304567 1327768
8315A327768q826L2294J4812K8505K06n6094j4357R678l4869l6046m2377n4050
$$ 1327768 1318942 1351236 1366048 1394553 1394759 1338665 1324308 1333986 1299117 1263071 1220694 1166644
8303A166644l6624N35o585n3144m7768j3413K8326k6172l5092J6128j5490j3154
$$ 1166644 1130020 1130555 1123970 1070826 1023058 1009645 1037971 1011799 976707 992835 977345 964191
8291I64191L621l1826r8J6170j0960n848Q703L654j1299p073l216m4747o766Q0674
$$ 964191 967812 935986 935888 952058 941098 935250 943953 947607 936308 929235 926019 881272 874506 955180
8277I55180k0064o1643n5876L2674R9017J3275N934J9035J1207j6254m3052m1843
$$ 955180 935116 873473 817597 850271 949288 962563 968497 987532 998739 982485 939433 897590
8265H97590j0435j327k676J2105M5006j1310p074k5816q343K5156N69m1218J0918
$$ 897590 887155 885828 883152 895257 940263 928953 921879 896063 887720 912876 913445 872227 883145
8252H83145N0976M3248o9064n4549k5101J2571J6656j9335n2889j176l1584j9684
$$ 883145 934121 977369 908305 853756 828655 841226 857882 838547 785658 784482 752898 733214
8240G33214M9614j5205K0720k7691j9327m609k6121K6193P240L1832L4223J2296
$$ 733214 782828 767623 788343 760652 741325 736716 710595 736788 744028 775860 810083 822379
8228H22379n162n4697q4507m0510K7595P7742L4714q329j9745N421m122M7994
$$ 822379 817217 762520 678013 637503 665098 742840 777554 769225 749480 754901 750779 798773
8216G98773O3488M1249K617m7761p033k1182n4474l605n1139j9962o762l8146
$$ 798773 862261 903510 906127 858366 851333 830151 775677 772072 720933 700971 694209 656063
8204F56063K5592L058o6995M4438Q382k2387R259L375n303k8079J4682K560L1533
$$ 656063 681655 684713 617718 662156 670538 648151 657410 660785 655482 627403 642085 644645 676178
8191F76178K6446j6985j3996k6290m3363J5390o275J1089j9981J9850J932J6516
$$ 676178 702624 685639 671643 645353 601990 617380 611105 622194 602213 622063 623995 640511
8179F40511M2024j2016J4497m4104M8385K2022j7836j7228N4489J2776m1842M5494
$$ 640511 682535 670519 685016 640912 689297 711319 693483 676255 730744 743520 701678 747172
8167G47172k6893k4576l2826m6769k3865K9373J3747m9143k0919L2158P4085O460
$$ 747172 720279 695703 662877 616108 592243 621616 635363 586220 565301 597459 671544 678004
8155F78004k4781J1697J1134j3589K8367K8568l5276l6737k6697K0754O0293j5203
$$ 678004 653223 664920 676054 662465 690832 719400 684124 647387 620690 641444 701737 686534
8143F86534M1816O6300l560n3993j3581K9473N1740j2495l7807k429L7634L4779
$$ 686534 728350 794650 791090 737097 723516 752989 804729 792234 754427 751998 789632 824411
8131H24411P1661l3445K5767N0758P7887P9489L4328K9162k5855K932j6537k5395
$$ 824411 896072 862627 888394 939152 1017039 1096528 1130856 1160018 1134163 1137095 1120558 1095163
8119A095163j2456L5076J2541p956N791k1835J8175K1114K1237K9993L6343R581
$$ 1095163 1082707 1117783 1130324 1122368 1128159 1106324 1124499 1145613 1166850 1196843 1233186 1242767
8107A242767J9621L6746M2674M6771K9980J4184N1861P1631P9317M7803k9710
$$ 1242767 1262388 1299134 1341808 1388579 1418559 1432743 1484604 1556235 1635552 1683355 1653645
8096A653645l9819M8181Q0680R1602J04153J53099J19298J58688J43585J32631
$$ 1653645 1613826 1662007 1742687 1834289 1938442 2091541 2210839 2369527 2513112 2645743
8086B645743J23213N0745N7553k951N0728N2518O9423P4212J09983O6913J25961
$$ 2645743 2768956 2819701 2877254 2874303 2925031 2977549 3046972 3121184 3231167 3298080 3424041
8075C424041O0619M1258N5786L925j855J2101M3616R2232o495K4917P0709J3933
$$ 3424041 3484660 3525918 3581704 3585629 3583774 3595875 3639491 3731723 3725228 3750145 3820854 3834787
8063C834787M236N2209R711j6844J02736R2997J13903L6864N1263Q2529O9316
$$ 3834787 3839023 3891232 3900943 3884099 3986835 4079832 4193735 4230599 4281862 4364391 4433707
8052D433707P0530Q4033J21052J41808J62267J33800J68075J45900J38058J51116
$$ 4433707 4504237 4588270 4709322 4851130 5013397 5147197 5315272 5461172 5599230 5750346
8042E750346J87162J67483K07351K21385K84232K82326K85771L50248L81924M33482
$$ 5750346 5937508 6104991 6312342 6533727 6817959 7100285 7386056 7736304 8118228 8551710
8032H551710M79442M13435N05932N31069O33584P13938P41048Q19290Q08475Q61164
$$ 8551710 9031152 9444587 9950519 10481588 11115172 11829110 12570158 13389448 14197923 15059087
8022A5059087R61579J146006J368164J592995J792226K071414K391431K709545
$$ 15059087 16020666 17166672 18534836 20127831 21920057 23991471 26382902 29092447
8014B9092447L231994L807694M609348N470032O457429P513543Q551026R442464
$$ 29092447 32324441 36132135 40741483 46211515 52668944 60182487 68733513 78175977
8006G8175977R778415R221321P645853N227906K503882m08264k865174m380224
$$ 78175977 87954392 97175713 104821566 110049472 112553354 112145090 109279916 104899692
7998A04899692n173618n313499n048203m643296m092679l519434l039422k526773
$$ 104899692 99726074 94412575 89364372 84721076 80628397 77108963 74069541 71542768
7990G1542768k066553j590267j192977r32575n93894k74594K6393M12851O76371
$$ 71542768 69476215 67885948 66692971 65760396 65166502 64891908 64918301 65331152 66007523
7981F6007523J053226J459389J820130K192666K490673K824341L255301L730533
$$ 66007523 67060749 68520138 70340268 72532934 75023607 77847948 81103249 84833782
7973H4833782M224514M924102N764536O956015Q494343J0643614J3598321J7664393
$$ 84833782 89058296 93982398 99746934 106702949 115197292 125840906 139439227 157103620
7965A57103620K2860523K8856460L3825852L4142866K5169186N118026j8438135
$$ 157103620 179964143 208820603 242646455 276789321 301958507 307076533 288638398
7958B88638398l3334802l6418625l2628709k6871211k1438518j6884946j3271696
$$ 288638398 255303596 218884971 186256262 159385051 137946533 121061587 107789891
7951A07789891j0550673q530177o876729n539811m532698l717101k992359k650171
$$ 107789891 97239218 88709041 81832312 76292501 71759803 68042702 65050343 62400172
7943F2400172k357304k042670j776992j558763j373787j099844p93707n33841
$$ 62400172 60042868 58000198 56223206 54664443 53290656 52190812 51397105 50863264
7935E0863264k48863J23968M14981P00369R99728J369497J744509K085964K458710
$$ 50863264 50614401 50738369 51153350 51853719 52853447 54222944 55967453 58053417 60512127
7926F0512127K828227L368612L843602M437446N019493N487344N647927N355507
$$ 60512127 63340354 66708966 70552568 74990014 80009507 85496851 91144778 96500285
7918I6500285M334213K634289L44454k452363n043092p083917q378575q814176
$$ 96500285 100834498 103468787 103813241 101360878 96317786 89233869 80855294 72041118
7910G2041118q500292p887779o945818o057298n107955m290994l623679l044746
$$ 72041118 63540826 55653047 48707229 42649931 37541976 33250982 29627303 26582557
7902B6582557k581985k160509j715385j502118j327657j191327j092552j070938
$$ 26582557 24000572 21840063 20124678 18622560 17294903 16103576 15011024 13940086
7894A3940086j024204q93096p49735o70750n98758n89810n04127m22870m06025
$$ 13940086 12915882 12022786 11273051 10602301 10003543 9413733 8909606 8486736 8080711
7885H080711l54598l79880k73690k51162l30468k31119j75353k57348k47932k01817
$$ 8080711 7726113 7346233 7072543 6821381 6490913 6259794 6084441 5827093 5579161 5377344
7875E377344j98989j64779j39927j73265j55878k25351j73219j75790j65183j11582
$$ 5377344 5178355 5013576 4873649 4700384 4544506 4319155 4145936 3970146 3804963 3693381
7865C693381j00700j05090j82683j68864p9251m9648j23105q2355j12363j15138
$$ 3693381 3592681 3487591 3304908 3136044 3056793 3007145 2884040 2801685 2689322 2574184
7855B574184r8907p5715j19224o4682l6193n3425q2648q8424m6702J306m4398
$$ 2574184 2475277 2399562 2280338 2215656 2179463 2126038 2043390 1954966 1908264 1909570 1865172
7844A865172j2357n3703n2975m3223j3578J3477k1395j8248m7824j859l9565k6975
$$ 1865172 1852815 1799112 1746137 1702914 1689336 1702813 1681418 1663170 1615346 1613487 1573922 1546947
7832A546947K5600r070q8140p2577j979l6844p8312k0278o6757l0071l5712K736
$$ 1546947 1572547 1563477 1475337 1402760 1400781 1363937 1285625 1265347 1198590 1168519 1132807 1135543
7820A135543J6703p1088l563M938m5248l4644n3408m1638l7145j0509M996K7289
$$ 1135543 1152246 1081158 1077595 1082533 1037285 1002641 949233 907595 870450 859941 864937 892226
7808H92226J5162K6882p1130p6757k1950j2526m2211p772l1362P213l8613m9284
$$ 892226 907388 934270 863140 786383 764433 751907 709696 701924 670562 677775 639162 589878
7796E89878O0730J817O415K1563j1771p2714n8630O184J7504o201l3349L0713
$$ 589878 650608 652425 658840 680403 668632 595918 537288 543472 560976 554775 521426 552139
7784E52139K8983j1690N8352p253o1104m954n6625k3472M9646M5894K9177m0432
$$ 552139 581122 569432 627784 620531 559427 554473 497848 474376 524022 569916 599093 558661
7772E58661q0811J0292P998M1502j5752l9721k5294p8114p1819R129K7257K8538
$$ 558661 477850 488142 496140 537642 521890 482169 456875 378761 306942 316071 343328 371866
7760C71866J06m3932k7589R002Q182p894L1281k0781J0696l428J0644l8269j9586
$$ 371866 371972 328040 300451 309453 317635 309741 341022 320241 330937 327509 338153 299884 280298
7747B80298k0920n819R745l4222J7892r080K6468P815M1659P3079L0615j7536
$$ 280298 259378 253559 263304 229082 246974 237894 264362 272177 313836 386915 417530 399994
7735C99994k3344k1924J18j2405m1538j7052K3246K4118J0718k5884q200K1909
$$ 399994 376650 354726 354844 342439 300901 283849 307095 331213 341931 316047 307847 329756
7723C29756K2766n451m0184j8872j2905k331J9091l8459M014O6877q434n4648
$$ 329756 352522 347071 306887 288015 275110 272779 291870 253411 257425 324302 315868 261220
7711B61220n948p3628K3458P6428K1179K1647k7169n1253m824N8954J3938m9841
$$ 261220 255272 181644 205102 281530 302709 324356 297187 245934 241110 300064 314002 264161
7699B64161m9563m3571m6490M1052P400P377l9148J5388L4139L7823M2096l1937
$$ 264161 214598 171027 124537 165589 172989 180366 141218 156606 190745 228568 270664 238727
7687B38727m5411m0467L799L9432L6993J0711p761k2671K0541N256l6929L120
$$ 238727 193316 152849 156648 196080 233073 243784 236023 213352 233893 239149 202220 205340
7675B05340k5498K7352j2125N2414K739m8334N598R788L2021m9063l8221L5045
$$ 205340 179842 207194 195069 247483 250222 201888 207486 217274 249295 200232 162011 197056
7663A97056m897l6564L3903L1914L7535j9006n8433K386k4114Q450J8668n105
$$ 197056 192159 155595 189498 221412 258947 239941 181508 183894 159780 168230 186898 181793
7651A81793m930R777p906p573L3342J8405n379M6702P0513J1519o7302o9492j2025
$$ 181793 176863 186640 178734 171161 204503 222908 217529 264231 334744 346263 278961 209469 197444
7638A97444L7069M3455J032o2199l6002L8134N7890j9370l7018R443k9808K9572
$$ 197444 234513 277968 279000 216801 180799 218933 276823 257453 220435 229878 200070 229642
7626B29642N2676m6763m552L6220L4327J7276j6753l783j0955n3911o234R1486
$$ 229642 282318 235555 231003 267223 301550 318826 302073 298290 287335 233424 227190 318676
7614C18676N6408M9454O960L5923K4324O1558R7692J5138Q2448N2889j775n5608
$$ 318676 375084 424538 431498 467421 491745 553303 650995 666133 748581 801470 799695 744087
7602G44087l1095k1425n2530n7887K494K5508J7687m7117q8283l6048L2143J7656
$$ 744087 712992 691567 639037 581150 583644 609152 626839 579722 491439 455391 487534 505190
7590E05190l5384m650M2762L6541n933r954k861o738J0428j0107k7397j9813K35
$$ 505190 469806 465156 507918 544459 538526 528572 525711 518973 529401 519294 491897 472084 472319
7577D72319J8702L0205p5023N4706J03849O3725R9136P7814Q6143R1655P6192
$$ 472319 491021 521226 446203 500909 604758 668483 767619 845433 931576 1023231 1099423
7566A099423J44246J57425J89427J64695J01880k7251j18909k14059j95029j83586
$$ 1099423 1243669 1401094 1590521 1755216 1857096 1829845 1710936 1496877 1301848 1118262
7556A118262j32245q0795l9081p1620p0540p3463o3825r2736j9950q636n1302
$$ 1118262 986017 905222 866141 794521 723981 650518 586693 493957 474007 465371 414069
7545D14069J1552K5979j651m6489k1880o799N7775K137J3680J921n8958l3584
$$ 414069 425621 451600 449949 403460 381580 374781 432556 434693 448373 450294 391336 357752
7533C57752m9754K7208J0261l771o305K2530j674L6904M9446L2921N7497M5993
$$ 357752 307998 335206 345467 341696 335391 357921 356247 393151 442597 475518 533015 579008
7521E79008O3216O6564N7958L473n6465k6454J2781k6098p1747r6238m3640m0093
$$ 579008 642224 708788 766746 770219 713754 687300 700081 673983 602236 505998 462358 422265
7509D22265p7678p7558m748K4079O5426R402k7621o5854n5073J0273n1882l4057
$$ 422265 344587 267029 262281 286360 351786 361188 333567 267713 212640 222913 171031 136974
7497A36974o7713K1267j7101l252K4933J7174r927m013O3582M3130k6507J3645
$$ 136974 69261 90528 73427 70175 95108 112282 102355 98342 161924 205054 178547 192192
7485A92192j00193j7600N9198L5329J8945l1941k1875N421r324k065j3161k4598
$$ 192192 91999 74399 133597 168926 187871 155930 134055 139476 130152 128087 114926 90328
7473I0328N132K5607P443o1839j6109M3805J1598M1517j3430n732j9580j2340
$$ 90328 95460 121067 128510 66671 50562 94367 105965 147482 134052 128320 108740 96400
7461I6400M0451N305l8105k7299L0602M3329Q530k2900L8837k0173r9012l3249
$$ 96400 136851 142156 104051 76752 107354 150683 159213 136313 175150 154977 55965 22716
7449B2716J5719k631J0096J6837j0281K7740K6275J3608o4966l9770q459K6161
$$ 22716 38435 35804 45900 62737 52456 80196 106471 120079 55113 15343 6884 33045
7437C3045P3437K8859M1967P061l7522K0781J9894L5806O133k8931n2674j8291
$$ 33045 106482 135341 177308 184369 146847 167628 187522 223328 229461 200530 147856 129565
7425A29565o0906j8685K1420J4412J7435k6854K1645N113q503J9209J8310o247
$$ 129565 68659 49974 71394 85806 103241 76387 98032 103145 94642 113851 132161 125914
7413A25914m6053j1753j136p296j1857J1590K4012J7323Q154k3954o7123J1461
$$ 125914 79861 68108 66972 59676 47819 59409 83421 100744 108898 84944 17821 29282
7401B9282K1351j5659j2809K2509l9948j711K2791M2058N3692K0952r7835m4900
$$ 29282 50633 34974 22165 44674 4726 3015 25806 67864 121556 142508 44673 -227
7389b27n1749K6373M7218P6892J7068m1280q6519o729j5465k713P0362M0508J1930
$$ -227 -51976 -25603 21615 98507 115575 74295 -12224 -18953 -34418 -37131 33231 73739 85669
7376H5669J7833l4320K7520j9821Q61l627m3474q568O3173M0270J8463j0952n6642
$$ 85669 103502 69182 96702 76881 77742 74115 30641 22073 85246 125516 143979 133027 76385
7363G6385L901l1556m2735j2330J4604L1414M8157L5065k651j771o4320j6814
$$ 76385 80286 48730 5995 -6335 8269 39683 87840 122905 120254 118483 54163 37349
7351C7349L4043K005J6215l8679k4372j2048k505Q438k6345K0448L4322M5123
$$ 37349 71392 73397 89612 50933 26561 14513 12008 20446 -5899 14549 48871 93994
7339I3994L0408k5052k7777L4208o1201n6278l2115O7973O6104j1459k642J7986
$$ 93994 124402 99350 71573 105781 44580 -11698 -43813 24160 90264 78805 76163 94149
7327I4149J0787m20p7336j6477J7466L1395J8993K5325k0892J1670R344R779j317
$$ 94149 104936 104516 27180 10703 28169 59564 78557 103882 82990 94660 104004 113783 112466
7314A12466K3749l6339k1522j0791l8269L1226K2714l8548p6215L6067P6920L896
$$ 112466 136215 99876 78354 67563 29294 60520 83234 44686 -31529 4538 81458 85354
7302H5354l034o5405n4794K0443Q233K0224l5658M4531K5638j0770R700K2591
$$ 85354 82320 16915 -37879 -17436 -9203 11021 -24637 19894 45532 34762 44462 67053
7290F7053n597j8529N672j5558l789n3580l9192O7469R6059l8573l3693j9278
$$ 67053 61456 42927 48599 33041 29252 -24328 -63520 3949 100008 61435 27742 8464
7278H464L7670O4725L3424m2246k1292n625L8966L0382k3113n1741Q230j7704
$$ 8464 46134 110859 144283 102037 80745 75120 114086 144468 121355 69614 77844 60140
7266F0140n6195j3145o206M9856k188l6398o161O2646K1941j5640k7384P600k6306
$$ 60140 3945 -9200 -15406 34450 32262 -4136 -10297 52349 74290 58650 31266 38866 12560
7253A2560m0956l619J6954J4079M1586j2723K820k4038r315M0740n214K912o7458
$$ 12560 -28396 -32015 -15061 -982 40604 27881 30701 6663 -2652 38088 32874 35786 -31672
7240c1672m611P8942L3826l4610r532j965K961k0078L3301M2637k2779n6246M2165
$$ -31672 -36283 42659 76485 41875 32343 30378 33339 13261 46562 89199 66420 10174 52339
7227E2339k0926M108j89j0415O4681l0182k1552j9428J6139M4809m9134m4558
$$ 52339 31413 35521 35332 24917 89598 59416 37864 18436 34575 79384 30250 -14308
7215a4308k4984l0663M5520O0969K0733L3150j6435l6262k621J1309J535n586
$$ -14308 -39292 -69955 -24435 36534 57267 90417 73982 37720 35099 46408 47943 42357
7203D2357K2236j8047j1051l621O313M1567J4360M227k5423j4384K2701n842M6342
$$ 42357 64593 46546 35495 31874 38187 79754 94114 98341 72918 58534 81235 75393 121735
7190A21735K1917j7959o0997k2869K0774n568M692k7476k2778k2593L8503m962
$$ 121735 143652 125693 64696 41827 62601 57033 61725 34249 11471 -11122 27381 22419
7178B2419l2014j705L3552K0861k7767l9488o924P4714P3575l7534m4451q1344
$$ 22419 -9595 -11300 22252 43113 15346 -24142 -31066 43648 117223 79689 35238 -46106
7166d6106R91O0992P3459L8589n8797q467R091Q164j1312n512O363k6776O3107
$$ -46106 -45115 15877 89336 127925 69128 60661 69752 77916 66604 61092 67455 40679 103786
7153A03786R103m1323L0444p158K0889j1000r840j7537l6235J0306k9076j4521
$$ 103786 112889 71566 102010 94852 115741 104741 94901 77364 41129 51435 22359 7838
7141G838l989K0310O3496k2508N913K1682J0914k5160j9139o088j4958n9164o5240
$$ 7838 3849 24159 87655 65147 71060 92742 103656 78496 59357 53269 38311 -20853 -86093
7128h6093k338m9250m773N1599R6066N5236n1359J0945K2321j010K2771P0836
$$ -86093 -88431 -137681 -142454 -90855 5211 60447 9088 20033 42354 41344 64115 134951
7116A34951N436n2795l9871m9237l2491L1818o20j9129m410Q759L8310m3746J2097
$$ 134951 140387 87592 47721 -1516 -34007 -2189 -2809 -21938 -26348 -17589 20721 -23025 -10928
7103a0928L5518L7900k1239l3557J5783J5373m7969J4779K4764K7247J2272K503
$$ -10928 24590 62490 41251 7694 23477 38850 -9119 5660 30424 57671 69943 72446
7091G2446l4991J7210n312l1112M0791o8251K922j3925m7352J7617K1101L7674
$$ 72446 37455 54665 49353 18241 59032 -9219 -6297 -20222 -67574 -49957 -28856 8818
7079H818P9655j3870l5687l4396o4150k0504M389L1096j7732L6670l7212M851
$$ 8818 88473 74603 38916 4520 -59630 -80134 -75745 -44649 -62381 -25711 -62923 -58072
7067e8072R9483J9127j7662k3670L3040R882P577N039q874n8828J6331L9710j0917
$$ -58072 41411 60538 42876 19206 52246 62128 69705 74744 65870 7042 23373 63083 52166
7054E2166l6905P639k9067l575K7335m799j8571j0257M6991K3997l7313J4499
$$ 52166 15261 22900 -6167 -9742 17593 12794 -5777 -16034 30957 54954 17641 32140
7042C2140r710j2341o1226j5775L8813J1262J6362L5129j5658j9679m747L3311
$$ 32140 22430 10089 -51137 -66912 -28099 -16837 -475 34654 18996 -683 -5430 27881
7030B7881M5144j3464l880j3237n6567K4141K3369m032P057M2612L603K6720k8350
$$ 27881 73025 59561 55681 42444 -14123 10018 33387 29355 36412 79024 82627 109347 80997
7017H0997n2055j7149O5371M6951O588p733n0234n5872N4310p590O472o966L915
$$ 80997 28942 11793 77164 124115 130703 122970 72736 16864 71174 63584 70056 63090 67005
7004F7005L9140M186q420L504m8483m5843k2266L7377N2178j2497o66M05r983
$$ 67005 106145 110331 101911 105415 56932 11089 -11177 26200 78378 65881 65215 65620 55637
6991E5637L473L0364l3219j625K0204M0092K822l9605m4397m0523O7500m163k7515
$$ 55637 59110 89474 56255 54630 74834 114926 117748 78143 33746 -6777 60723 56560 29045
6978B9045j0094m386L6118K2267L5731j4048k8280l1429j2000k927k9706K258
$$ 29045 18951 14565 50683 72950 108681 94633 66353 34924 22924 19997 -9709 -7451
6966g451N4624J7062o670K1602j4966N1330L4431Q365o5837k867L2454M5344O772
$$ -7451 47173 64235 57565 79167 64201 115531 149962 158327 92490 89623 122077 167421 174193
6953A74193n7070n8931l5897r079j3646k0790M7251p166n0531k7900M5483j6549
$$ 174193 117123 58192 22295 13216 -430 -21220 26031 18865 -31666 -59566 -14083 -30632
6941c0632m380Q339M2392L7451J2456q269P45o6020Q981K8191k8822Q345j8776
$$ -30632 -35012 -26673 15719 53170 65626 57357 58102 -7918 1063 29254 432 8777 -9999
6928i999M0995J2190l9028J6811J0260k0459P180K7779L3156m0245k892N6839
$$ -9999 30996 43186 4158 20969 31229 10770 17950 45729 78885 38640 35748 92587
6916I2587k8600j7282K9653L1577l0773m6974j4358K6744m0450n1967K8024L6001
$$ 92587 63987 46705 76358 107935 77162 30188 15830 42574 2124 -49843 -21819 14182
6904A4182n1776j785O8710K5052l3215J1603L0458r940n5528k061K0398M858Q159
$$ 14182 -37594 -39379 29331 54383 21168 32771 63229 53289 -2239 -4300 16098 20956 29115
6891B9115j1353n2862K1m893L7920J8717J4076j7617J2788m267k349J5052J0521
$$ 29115 17762 -35100 -35079 -39972 -2052 16665 30741 13124 25912 21645 19296 34348 44869
6878D4869L7586k1632k7104L617j5928J1938K6679M881j1850k1615m3328k0764
$$ 44869 82455 60823 33719 37336 21408 33346 60025 64906 53056 31441 -11887 -32651
6866c2651J267M6897r942L5585k5507j0263r704J9851m2058Q980L1132K1870m2690
$$ -32651 -31384 15513 5571 41156 15649 5386 -4318 15533 -26525 -17545 13587 35457 -7233
6853g233J6403N3265q867M996N520K863K5157j2285k4458m4301l7349K9295N1856
$$ -7233 9170 62435 53568 58564 64084 66947 92104 79819 55361 11060 -26289 3006 54862
6840E4862R687n214m1127j7857M0598L8077m1369k026L9270l5558n5564k635J6663
$$ 54862 64549 59335 18208 351 40949 79026 37657 35631 74901 39343 -16221 -18856 -2193
6827b193K1276J0805m0298j5846k2122M5428J9887J651L3517j3005k5686K0653
$$ -2193 19083 29888 -10410 -26256 -48378 -2950 16937 18588 52105 39100 13414 34067
6815C4067M1934N658l3564M042k0207n8289n0021L938N8413R130M9802M400p9421
$$ 34067 76001 81659 48095 52137 31930 -26359 -76380 -72442 -14029 -4899 44903 49303 -30118
6802c0118k2222l7642J7653L1447J9023K1121M2355K3247r880j1524l9099L709
$$ -30118 -52340 -89982 -72329 -40882 -21859 -738 41617 64864 54984 43460 4361 8070
6790H070L1783K5960k0274j0494L516J5291O005l8670k6936o4548q830M5232M2213
$$ 8070 39853 65813 45539 35045 38561 53852 59857 21187 -5749 -70297 -79127 -33895 8318
6777H318l7492j7519M2901o498k3881O556K1078K9540R641j0232K9279L0716n523
$$ 8318 -29174 -46693 -3792 -10290 -34171 -27615 -6537 23003 32644 22412 51691 82407 76884
6764G6884m6302m923N2943m9011m0045k7399k172n7524L8208N6729J4180m367
$$ 76884 30582 25659 78602 29591 -10454 -37853 -40025 -97549 -59341 -2612 11568 7201
6752G201K3371l5970l7100k135L2578J0523K2891J9624o468o927l6223n8181R503
$$ 7201 30572 -5398 -42498 -44633 -12055 -1532 21359 40983 34515 27588 -8635 -66816 -57313
6739e7313J3858J0646k2139R211P8905M5272K7932m8784l5411l311J1236K832
$$ -57313 -43455 -32809 -54948 -45737 33168 78440 106372 57588 22177 18866 30102 32934
6727C2934l2054o5491R637J8266K0338L1887O019n4472l4603l0038N4844Q6375
$$ 32934 880 -64611 -54974 -36708 -16370 15517 21536 -32936 -67539 -97577 -42733 43642
6715D3642L3970q981p4607k7176m5895R739Q3777P0357R114k6828p472O020Q750
$$ 43642 77612 68631 -5976 -33152 -79047 -69308 14469 84826 93940 67112 59640 65660 74410
6702G4410n584m6156p608q888J1766K0432K8596l8632l6088j588j526K4196o792
$$ 74410 68826 22670 15062 6174 17940 38372 66968 28336 -7752 -9340 -10866 13330 6538
6689F538l3639K3784J5820L0813j7946n7004j9097K8109j3897j2635J5389L4784
$$ 6538 -27101 -3317 12503 43316 25370 -31634 -50731 -22622 -36519 -49154 -33765 1019
6677A019J2070p4591k4927J4654M3853j8572L8619j4384p927l0448j7000N8889
$$ 1019 13089 -61502 -86429 -71775 -27922 -46494 -7875 -22259 -30186 -60634 -77634 -18745
6665a8745P883k6731J8181K8546o304J4118K7029J0410Q540k3759K338O183J3414
$$ -18745 -10862 -37593 -19412 9134 2830 16948 43977 54387 62927 39168 41506 47689 61103
6652F1103l0197k549m5501r946J4896m8658p5011k5233O1313K5926M0123M1893
$$ 61103 30906 28357 -17144 -27090 -12194 -60852 -135863 -161096 -99783 -73857 -33734 8159
6640H159K0065J1275r748O554l8888l1613L8757Q4050K5971Q288p8688j5665N890
$$ 8159 28224 39499 29751 36305 -2583 -34196 4561 88611 114582 122870 44182 28517 34407
6627C4407O037j5773m3831K2530j2372J6164L1662K2841O746l9412m8855q1173
$$ 34407 40444 24671 -19160 3370 -9002 7162 38824 61665 68411 28999 -19856 -101029
6615a01029N2089R3831J0917L0847O4538M5969n338O868n8265j00424m2711n512
$$ -101029 -48940 44891 55808 86655 151193 197162 191824 198692 140427 40003 -2708 -8220
6603h220L241J2288l1783k6676N9059J1736J9324P614m773m1226p8605k381R3474
$$ -8220 -4979 7309 -24474 -51150 7909 19645 38969 46583 41810 584 -78021 -80402 13072
6590A3072j3545k8650j11K1259j8470K868N5733M65M089l085k2586J8835J3307
$$ 13072 -473 -29123 -29234 -7975 -26445 -23577 32156 32621 36710 33625 11039 29874 43181
6577D3181m1260k0377K359O3537n3732l2595O0217J7403K5131j9257O95K4376
$$ 43181 1921 -18456 -16097 47440 -6292 -38887 21330 38733 63864 44607 45302 69678
6565F9678j2400J3299k2742o4930q698N2416O339o4405j6566O7002j8595j8528
$$ 69678 57278 70577 47835 -17095 -25793 26623 32962 -31443 -48009 18993 398 -18130
6553a8130O8728K1594j04577n7972j3414K5861L6109M2034R817l2184R873K8322
$$ -18130 50598 72192 -32385 -90357 -103771 -77910 -41801 233 10050 -22134 -12261 16061
6541A6061J1303L4299K147k1909J7272L137m4523k3292p399k3566j3924J5099
$$ 16061 27364 61663 63810 41901 59173 62310 17787 -5505 -12904 -36470 -50394 -35295
6529c5295J3865N2656K4789k2950L6418L2695o3153n5456k2315R495K6285K1602
$$ -35295 -21430 31226 56015 33065 69483 102178 39025 -16431 -38746 -29251 -2966 18636
6517A8636j9479j7617l975L3319R754K4292J1729j5791m2495k5006m2377J5577
$$ 18636 -843 -18460 -22435 10884 20638 44930 56659 40868 -1627 -26633 -69010 -53433
6505e3433M2044k5404N0002M7087J4211l9416l8041k1764J0061j6106K989J7843
$$ -53433 -11389 -36793 13209 60296 74507 35091 -2950 -24714 -14653 -30759 -27770 -9927
6493i927J2186R961n469k7752n2795L0458L3523m6143P43K6647K4794K3394J1925
$$ -9927 2259 12220 6751 -21001 -73796 -43338 -9815 -55958 -55215 -28568 -3774 19620 31545
6480C1545k3313L7738n473J4670J1985l6783k4622J3432K941O702o053k2112N361
$$ 31545 8232 45970 40497 55167 67152 30369 5747 19179 22120 28822 22769 657 6018
6467F018L321M9042L9563l0698l6022o1992K7221M3271j1468N933o1868o5650
$$ 6018 9339 58381 97944 67246 31224 -30768 -3547 39724 28256 34189 -27679 -93329
6455i3329j0993L2560M0336N2452K6158n4701l8506L592k9421K4360O4540L4770
$$ -93329 -104322 -71762 -31426 21026 47184 -7517 -46023 -42431 -71852 -47492 17048 51818
6443E1818m087p881l2711J1728N0316O370j8229n2509l567R835K7386M486k710
$$ 51818 47731 39850 7139 18867 69183 75553 57324 4815 1248 11083 38469 42955 40245
6430D0245l5597m4217P0579L1206l5321p325J4038K0977k4750k8004q662J9664
$$ 40245 4648 -39569 31010 62216 26895 19570 33608 54585 29835 1831 -6831 12833
6418A2833N8751l5022j6299L9050K3668l4895o896k4882L5166M2929m4123n5759
$$ 12833 71584 36562 20263 59313 82981 48086 41190 16308 51474 94403 50280 -5479
6406e479k9284N6623K930k6580J3856O7585J5187j2431o0916l1660K4299l0322
$$ -5479 -34763 21860 24790 -1790 12066 79651 94838 82407 21491 -10169 14130 -16192
6394a6192j4468K4208K8950R582j0148l4575O124K5933J7393m0944m306J7401
$$ -16192 -30660 -6452 22498 32080 21932 -12643 -6519 19414 36807 -4137 -8443 8958
6382H958k361l9376L0540K4161p1642j7603P2697M4283J609m3328j5358k6586
$$ 8958 6597 -32779 -2239 21922 -49720 -67323 5374 49657 51266 7938 -7420 -34006
6370c4006o940K3631P162j2862P949K1881M5302l3469n581m6848R78M3607l7129
$$ -34006 -40946 -17315 -10153 -23015 -15066 6815 52117 18648 13067 -33781 -32803 10804 -26325
6357b6325l2818j7527J2140K7756P063P005J540j9366K5985r089j737K6413M8245
$$ -26325 -59143 -76670 -64530 -36774 -29711 -22706 -21166 -40532 -14547 -23636 -25373 1040 49285
6344D9285q637J7536J1206K8006O1467K7320m1182o4105q2297r011N7177M2830
$$ 49285 40648 58184 69390 97396 158863 186183 145001 80896 -1401 -10412 46765 89595
6332H9595J8885m6515m7859J6520J5597j147O310K7511k8121m4103K8164K144
$$ 89595 108480 61965 14106 30626 46223 45076 51386 78897 50776 6673 34837 36981
6320C6981j1346j4453O506k1066n3983k6356M9474O5062K6358N2465r134m012
$$ 36981 25635 11182 17688 -3378 -57361 -83717 -34243 30819 57177 109642 100508 96496
6308I6496o5380p1146L5374L9125J8783P864m8889l7487K0666q8m4954J6757N7246
$$ 96496 31116 -40030 -4656 34469 53252 61116 12227 -25260 -4594 -4682 -49636 -32879 24367
6295B4367l5370J285J0329J3967R016K280k6034j2038l4968M180K6736N323N4287
$$ 24367 -11003 -9718 611 14578 23594 25874 -160 -12198 -47166 -42986 -16250 -10927 43360
6282D3360O4650P149l9686o2429N634M7333L3943p852m9646n6999Q5190q606L7974
$$ 43360 108010 115159 75473 13044 18678 66011 99954 92102 42456 -14543 70647 62041 100015
6269A00015j3335l9737m2704k6128l6959L1721O3141k7759n0560k8017l562N1366
$$ 100015 86680 46943 4239 -21889 -58848 -27127 36014 8255 -42305 -70322 -73884 -22518
6257b2518L8857R198J2072O194l614l9563l8883J9453O1379K8551l6469j7523
$$ -22518 16339 25537 37609 43803 40189 626 -38257 -18804 42575 71126 34657 17134
6245A7134k3971J2029J9889M8125j8498r1226m7357L025m687J01010P7213J7277
$$ 17134 -6837 5192 25081 73206 54708 -36518 -83875 -80850 -85537 15473 92686 109963
6233A09963l3410R001o3052K516j9672n5822j0837L0057L1347m6258l3390M4905
$$ 109963 76553 85554 22502 25018 5346 -50476 -61313 -31256 91 -46167 -79557 -34652
6221c4652L6559m569l494L2890l3992j8855Q3688J1006k897j247L6524n2992m7058
$$ -34652 1907 -2662 -6156 26734 -7258 -26113 57575 68581 65684 64437 100961 47969 911
6208I11L5505M4517J4512K1657N822R023J340r4479K385M1729l8073o9970q638
$$ 911 36416 80933 95445 117102 122924 131947 133287 38808 41193 82922 44849 -25121 -33759
6195c3759J2753j3638J83Q870L0044k4335j2274J0333q106l2769L6600M6827K6777
$$ -33759 -21006 -34644 -34461 -25591 4453 -19882 -32156 -21823 -29929 -62698 -26098 20729 47506
6182D7506j0760l3248J9469j0283k1805j7100l090j8596k1762M4434N9710J4958
$$ 47506 36746 3498 22967 12684 -9121 -26221 -29311 -47907 -69669 -25235 34475 49433
6170D9433p1441j115K4196j8384Q831J0405l111l6425k8131k035J3691O7436J8296
$$ 49433 -22008 -23123 1073 -17311 -8480 1925 -1186 -37611 -65742 -67777 -54086 13350 31646
6157C1646k8489K7403L9712P2140m3804n3352p359n92k8995Q43K6000l2110L3482
$$ 31646 3157 30560 70272 142412 98608 45256 37897 37305 8310 9153 35153 3043 36525
6144C6525k3139L92M6435J2536K9065N0128j4164q8477q6177m12N1931O2682J7865
$$ 36525 13386 13778 60213 72749 101814 151942 137778 49301 -36876 -37288 14643 77325 95190
6131I5190J3657l2442o7982j2805l5321J9884L9662J8515j652j0097l9817Q5547
$$ 95190 108847 76405 8423 -4382 -39703 -19819 19843 38358 36706 26609 -13208 72339
6119G2339k8244m1977R379j8431l2356l2555J065O3632M8590j693l1568N213j0440
$$ 72339 44095 2118 11497 -6934 -39290 -71845 -70780 -7148 41442 39749 8181 13394 2954
6106B954J570l44L2903j77J27l9876j0690J5681L9555K7850o1051k5896M826N8779
$$ 2954 4524 4180 37083 36906 37033 -2843 -13533 2148 41703 69553 8502 -17394 -12568 46211
6092D6211m351l170l7059L1749L0885k38n0487l0809k2177j15815m2373R5774
$$ 46211 41860 38690 1631 33380 64265 64027 13540 -17269 -39446 -155261 -197634 -101860
6080a01860M6927j5870j591l546K4928M3793k90l3o585Q968K09r624k9289M788
$$ -101860 -54933 -70803 -72394 -75940 -51012 -7219 -7509 -7542 -14127 -5159 -4950 -14574 -43863 -39075
6066c9075L0176n249L0072J7389o915n83j8254O629J1492K3457j9690j8171L2069
$$ -39075 -8899 -14148 15924 33313 26398 25815 7561 14190 25682 49139 29449 11278 43347
6053D3347J8470K1555K2115n7393m5530M3689N1548m3877m0593k7684q257l2868
$$ 43347 61817 83372 105487 48094 2564 46253 97801 53924 13331 -14353 -22610 -55478
6041e5478j1487M270K8149O9238L640K0352j232Q101k9379q0040k8986j8389O7582
$$ -55478 -66965 -62695 -34546 34692 38332 58684 57452 65553 36174 -43866 -72852 -91241 -23659
6028b3659N3302l8417R844K5951M546r257k7630o4586j3015L0362k9103n5249
$$ -23659 29643 -8774 1070 27021 31567 22310 -5320 -69906 -82921 -52559 -81662 -136911
6016a36911j3135N6747N9614K9202K1985r617J7842l481p2621J8124q104L3649
$$ -136911 -150046 -93299 -33685 -4483 17502 7885 25727 22246 -50375 -32251 -40355 -6706
6004f706j2349l5945j3768K7235J8804K67J699p999R27q088l5524N030N238j0141
$$ -6706 -19055 -55000 -68768 -41533 -22729 -22462 -20763 -28762 -27835 -35923 -71447 -66417 -61179 -71320
5990g1320o702N914l090m3526K3284O2614n9743l99O7773O3770p60k5026L1583
$$ -71320 -78022 -72108 -75198 -118724 -95440 -32826 -92569 -92968 -25195 38575 37815 12789 44372
5977D4372N403l1663l8271K098R044L8829M0567k3391J3212k2200n9505J4808
$$ 44372 49775 18112 -20159 -18061 -9017 29812 70379 46988 60200 38000 -21505 -6697
5965f697L8827L3053L1546k5903j00743k4713M0429K26n2781M2397N6397l916
$$ -6697 32130 65183 96729 70826 -29917 -54630 -14201 -13975 -66756 -24359 32038 28122
5953B8122j5110j8387Q508k1515K0940Q928o0164j8470R720J3145P529k4389J3053
$$ 28122 13012 -5375 3133 -18382 2558 11486 -48678 -67148 -57428 -44283 -36754 -61143 -48090
5940d8090P7734O1797n4992p7823q3171L0442M8529K9052m0542l9068J9649K0084
$$ -48090 29644 91441 36449 -41374 -124545 -94103 -45574 -16522 -57064 -96132 -76483 -56399
5928e6399j4703M2048j427l350K9703l7313q365Q199L1179M1212L632m7069o8523
$$ -56399 -71102 -29054 -30481 -33831 -4128 -41441 -49806 -41607 -10428 30784 34416 -12653 -81176
5915h1176k6079M504J9921P184K6083J3179P240n630j2421M9943n664j2950l1341
$$ -81176 -107255 -102751 -82830 -75646 -49563 -36384 -29144 -34774 -47195 2748 -2916 -15866 -47207
5902d7207l1718K5588j7992J0758J5341M4K1545L3388K8444N8J9394k2154j2686
$$ -47207 -78925 -53337 -71329 -60571 -45230 -45186 -23641 9747 38191 38249 57643 35489 22803
5889B2803l2193l3179k7276l0855N2108O2599J2824l7511l1102K2927N2755K0955
$$ 22803 -9390 -42569 -69845 -100700 -48592 14007 26831 -10680 -41782 -18855 33900 54855
5877E4855q793O3081k2217r126m5556m8130k4172k376m0801K065o699L1902J9206
$$ 54855 46062 109143 86926 77800 32244 -15886 -40058 -42434 -83235 -81170 -87869 -55967 -36761
5864c6761q347j9442L6287J6022J3877n9j6057q603o231L9585J7253Q733N992
$$ -36761 -45108 -64550 -28263 -12241 1636 1577 -14480 -23083 -29314 10271 27524 36257 42249
5851D2249J5793J542p5230p226Q877O71k0314K5157k2676j5432j2321J6124k6481
$$ 42249 58042 59584 -15646 -22872 -13995 -13324 -33638 -8481 -31157 -46589 -58910 -42786 -69267
5838f9267M2552J5164p8981p877n0511k7599N7001L7530M5965j7796k4636O1528
$$ -69267 -26715 -11551 -90532 -98409 -148920 -176519 -119518 -81988 -36023 -53819 -78455 -16927
5826a6927K3304o2696k1686J5936K7830n949L0205J1135j050P496M4038M4003
$$ -16927 6377 -56319 -78005 -62069 -34239 -40188 -9983 1152 102 7598 51636 95639
5814I5639J432l1413j6773L2782K9626m7176k8831k2553k0134j1190p721j9022
$$ 95639 97071 65658 48885 81667 111293 64117 35286 12733 -7401 -18591 -26312 -45334
5802d5334j14K6910k8167P908J3333K5455j7161n343m8252J3068J3847J2458K5198
$$ -45334 -45448 -18538 -46705 -38797 -25464 -9 -17170 -22513 -70765 -57697 -43850 -31392 -6194
5789f194j2866p8290K5617N2787n280J9049K7109L3861O710L6920j8686l5689
$$ -6194 -19060 -97350 -71733 -18946 -24226 -5177 21932 55793 62503 99423 80737 45048
5777D5048n6019m6245J9101K8667K7758l1194N3304N348k4930J553l6495J432
$$ 45048 -10971 -57216 -38115 -9448 18310 -12884 40420 45768 20838 22391 -14104 -12672
5765a2672J1254L449k199O1095P0341k8682n2816l3648j5301p864K8409L3287
$$ -12672 -1418 2031 -168 60927 131268 102586 49770 16122 821 -7043 21366 54653
5753E4653q6940o961P544j2656j3061O0126M8306k3609j1687N3738L5243K8199
$$ 54653 -32287 -39248 -31704 -44360 -57421 2705 51011 27402 15715 69453 104696 132895
5741A32895m6822m5230l3567k9740K8599N3832j6776n0643l2794J635L1351m4789
$$ 132895 86073 40843 7276 -22464 6135 59967 43191 -7452 -40246 -38611 -7260 -52049
5729e2049P603N5216L0398J2259k1105J3786L4706O279j408j0215m3978k8654
$$ -52049 -44446 10770 41168 53427 32322 46108 80814 87093 85685 75470 31492 2838
5717B838K1989K3873l0939j2305P8879M1176p960j9954m9296o0851M091P1443
$$ 2838 24827 48700 17761 5456 84335 125511 117551 97597 48301 -12550 -8459 62984
5705F2984M820Q272O511k1735p9572p3177J0302N6927L8977J3272n1591m5313
$$ 62984 67804 76076 82587 60852 -18720 -91897 -81595 -24668 14309 27581 -24010 -69323
5693f9323J5102K102k6349m4053j1189J7309N4327K6635l0172j657J0210p130
$$ -69323 -54221 -52119 -78468 -122521 -133710 -116401 -62074 -35439 -65611 -67268 -57058 -64188
5681f4188K9013J9435O065M7529P351j3390j2254j9795P1820K2738o1189l4044
$$ -64188 -35175 -15740 -9675 37854 45205 31815 19561 -234 71586 94324 33135 -909
5669i09l1619k1778N2073j1288r220M7667O4307k4274l0766J6325K4482l803k2433
$$ -909 -32528 -54306 -2233 -13521 -22741 24926 89233 64959 34193 50518 75000 71197 48764
5656D8764j7108J4752j0192Q955o378J1972j5940j8790j6922L7589j2057m1548
$$ 48764 31656 46408 36216 45171 38793 50765 34825 16035 -887 36702 24645 -16903
5644a6903k6063k3837k5728l4640K4570K6283K5355j9910r24J5427n417k7972
$$ -16903 -42966 -66803 -92531 -127171 -102601 -76318 -50963 -70873 -71797 -56370 -61787 -89759
5632h9759M0151j0695j0175P503m067l058J4122j697O929m607M4981L2273k7502
$$ -89759 -49608 -60303 -70478 -62975 -67042 -70100 -55978 -57675 -50746 -55353 -10372 21901 -5601
5619e601l9145O2539J8349o1082L2134N2992O757k0992k1059J38K6899N1035l6414
$$ -5601 -44746 17793 36142 -24940 7194 60186 66943 45951 24892 25030 51929 102964 66550
5606F6550m2061K1034m5767p5349j6706K8433P146k846L9392j625L3344J5966
$$ 66550 24489 45523 -244 -75593 -92299 -63866 -56720 -59566 -20174 -21799 11545 27511
5594B7511j1360j8584m801k8750k8844j4704r354Q174L5624k2049O7074O5554
$$ 27511 16151 -2433 -7234 -35984 -64828 -79532 -88886 -80712 -45088 -67137 -63 65491
5582F5491j9989l5648K5629o242J9010m4979m0301K0847l008p106l784m8776L0884
$$ 65491 45502 9854 35483 29241 48251 3272 -37029 -16182 -19190 -26296 -30080 -78856 -47972
5569d7972K6770l8275j3013M3048Q417o7879k6499O2175J7295K0618m3453j2J670
$$ -47972 -21202 -59477 -72490 -29442 -21025 -88904 -115403 -53228 -35933 -15315 -58768 -58780 -57110
5556e7110N8093L8332K2060n5428J4192J8706m7419j1081m516O711J4663L4075
$$ -57110 983 39315 61375 5947 20139 38845 -8574 -19655 -24171 -17460 -2797 31278
5544C1278J1424m1744k6205j8139R474N7052R136l0833K4338l5842n0758K461
$$ 31278 42702 958 -25247 -43386 -33912 23140 32276 1443 25781 -10061 -60819 -58358
5532e8358K2586K4872m704Q95k0427j0420K0906N311M0721Q236j9759l4043M0593
$$ -58358 -35772 -10900 -15604 -14709 -35136 -45556 -24650 -19339 21382 29618 9859 -24184 16409
5519A6409j1704p2707m0675J1658j7631N1362K9284j8553M8255O00K8855J3661
$$ 16409 4705 -68002 -108677 -97019 -114650 -63288 -34004 -52557 -4302 -3702 25153 38814
5507C8814m9473O845k3444j291K6498l3545P811m1309l2919P5052M0576n2351
$$ 38814 -10659 -3814 -27258 -28549 -2051 -35596 -27785 -69094 -102013 -26961 13615 -38736
5495c8736j6571L9777L5183k355M6079j2670l7649K8110K2171n0297J1780j399
$$ -38736 -55307 -15530 19653 17298 63377 50707 13058 41168 63339 13042 24822 23423
5483B3423j5928m6376l1572l0466K9607N195O963N6952P639O266N5794j2181j2740
$$ 23423 7495 -38881 -70453 -100919 -71312 -66117 -59154 -2202 5437 11703 67497 55316 42576
5470D2576J0833L8337m553j02406l3466L7967p402m8900l3529R0721O9841l877
$$ 42576 53409 91746 87193 -15213 -48679 -10712 -18114 -67014 -100543 -9822 60019 56142
5458E6142J1389k4014n906K5844M0996n009j1965m3616M2567k66p6291o3542M0864
$$ 56142 67531 43517 37611 63455 104451 99442 87477 43861 86428 86162 9871 -53671 -12807
5445a2807O1188j452J6498K8909m3494l2000j6733Q939M6195K4291o772k5849
$$ -12807 48381 46929 63427 92336 48842 16842 109 9048 55243 79534 72762 46913
5433D6913m0673K528K9343k8353q0611n4957r355J9333P1623J6417l9445p3135
$$ 46913 6240 8768 38111 9758 -70853 -125810 -135165 -115832 -44209 -27792 -67237 -140372
5421a40372k7096M7080Q6404J3405p078o6670K725Q5596N4648J6577l0590M118
$$ -140372 -167468 -120388 -33984 -20579 -27657 -94327 -91602 -6006 48642 65219 34629 38747
5409C8747K807m6028j9615l4434l7691M6031L4403K295m2551j640J5860l1121
$$ 38747 41554 -4474 -24089 -58523 -96214 -50183 -15780 -13485 -56036 -57676 -41816 -72937
5397g2937p669P9459L8067j9479k1338l7717n2944r466P9779j044J7479k7311
$$ -72937 -80606 -1147 36920 17441 -3897 -41614 -94558 -104024 -24245 -25289 -7810 -35121
5385c5121l4130m928J7140j4408l028K2426O1781l4247l3098n87L5754j814l866
$$ -35121 -69251 -74179 -57039 -71447 -74475 -52049 9732 -24515 -57613 -58200 -22446 -24260 -28126
5372b8126k2704N3820k0814l2151J9804O0776N4981k1167m7999O066K7591j9443
$$ -28126 -50830 2990 -17824 -49975 -30171 30605 85586 64419 16420 22486 50077 30634
5360C0634j8445j0619M8777J247m1749l6081J8868L535J2053L224K529J2927j4013
$$ 30634 12189 1570 50347 51594 9845 -26236 -7368 -3833 8220 11444 13973 26900 12887
5347A2887M5488K8096k2145l8481L0073o8052k3087L6767L1572j7752M3311P87
$$ 12887 58375 86471 64326 25845 55918 -12134 -35221 1546 33118 15366 58677 59464
5335E9464k2737j4050k8233j7163n6399l4901J4169N4632L4361N1478l310N6500
$$ 59464 36727 22677 -5556 -22719 -79118 -114019 -99850 -45218 -10857 40621 37311 93811
5323I3811m1391l5473k1924J5841j6117M524J7522L8427l3676j7562J602l6678
$$ 93811 52420 16947 -4977 10864 -5253 -729 16793 55220 21544 3982 5584 -31094
5311c1094M0360k7058J872N5429K9069j6365m2761k5557M71q547k8406o0714o091
$$ -31094 9266 -17792 -15920 39509 68578 52213 9452 -16105 -15634 -24181 -52587 -113301 -119392
5298a19392j9930P596J0188p411Q474J7319P3891Q9839L7339l1076p5512n3198
$$ -119392 -139322 -131726 -121538 -128949 -120475 -103156 -29265 60574 97913 66837 -8675 -61873
5286f1873j3241l80J4658n1843l1717M5263P2434k0552j9796j666j6738m150L8173
$$ -61873 -75114 -75494 -60836 -112679 -144396 -99133 -26699 -47251 -67047 -68713 -85451 -89601 -51428
5273e1428K6952j4496q41K1137p329Q492L8175j6898k8610K2707k9432J7039K7122
$$ -51428 -24476 -38972 -39813 -18676 -26005 -17513 20662 3764 -24846 -2139 -31571 -14532 12590
5260A2590m0250m8176k4249J184N1512P7593L9870J9912k6781K5435n7318r30
$$ 12590 -27660 -75836 -100085 -98901 -47389 30204 70074 89986 63205 88640 31322 30392
5248C0392R7041k7537m8733L6398o362m1332j2151m6587m2551n1331M7882P968
$$ 30392 127433 99896 51163 87561 81199 39867 27716 -18871 -61422 -112753 -64871 -56903
5236e6903J1476L7222K2304K379k1089L539l4315j9135O1555K4844l8572j1149
$$ -56903 -45427 -8205 14099 16478 -4611 -1072 -35387 -54522 7033 31877 -6695 -17844
5224a7844j9822j629L4342K9968k5798Q78J9143j3445l7436j867P4204K1631l4436
$$ -17844 -37666 -39295 -4953 25015 -783 95 19238 5793 -31643 -33510 40694 62325 27889
5211B7889r504j9445n9611p7975m161L4965K550J9599L5917P6926M0632m1605
$$ 27889 18385 -1060 -60671 -138646 -142807 -107842 -105292 -85693 -49776 27150 67782 26177
5199B6177J0173J3032j1534K1616r739k7198j5166K3966l1583p1676m6310N1928
$$ 26177 36350 49382 37848 59464 49725 22527 7361 31327 -256 -71932 -118242 -66314
5187f6314O3578K9092j3678k3609n2193j2376j0675K9722L0831Q9437k9919o1055
$$ -66314 -2736 26356 12678 -10931 -63124 -75500 -86175 -56453 -25622 63815 33896 -27159
5175b7159M479R230p2023M454N6362L2052l4551l6938K432k7798K7465N8290J3299
$$ -27159 -22680 -13450 -85473 -81019 -24657 7395 -27156 -64094 -61662 -89460 -61995 -3705 9594
5162I594j0765q855m8959j317N154M0227J1464K678N4288K9711N160j9611o9955
$$ 9594 -1171 -10026 -58985 -60302 -55148 -14921 -3457 -779 53509 83220 88380 68769 -1186
5149a186k3250L8624m53j5297l2518O142L5896J6996M0462j9369n5564n6372K7920
$$ -1186 -24436 14188 13735 -1562 -34080 -27938 7958 24954 65416 46047 -9517 -65889 -37969
5136c7969N362j6583M8696Q879m1283m6317K4842M4187L3684L0316J1362l2993
$$ -37969 -32607 -49190 -494 8385 -32898 -79215 -54373 -10186 23498 53814 65176 32183
5124C2183m8222n5939R395j173j4430l0899J1539j7912J3718O5338K5458k0640
$$ 32183 -16039 -71978 -62583 -63756 -78186 -109085 -97546 -115458 -101740 -36402 -10944 -31584
5112c1584l0454K6152J1203k2996m7326Q015M2907Q586k2771m4678n5271M2016
$$ -31584 -62038 -35886 -24683 -47679 -95005 -86990 -44083 -35497 -58268 -102946 -158217 -116201
5100a16201L7296j2113n2960M32P0564P2520Q830m743L3155J0001J7924L3688
$$ -116201 -78905 -91018 -143978 -143546 -72982 -462 8368 3625 36780 46781 64705 98393
5088I8393l9356l9143J4418n2576n3587j2467L2493L4660J042k7701j9656N305
$$ 98393 59037 19894 34312 -18264 -71851 -84318 -51825 -17165 -16123 -43824 -63480 -58175
5076e8175O9184J820k9390l0590J7069M7146n8757p617L1064j7951J2710P2426
$$ -58175 11009 12829 -16561 -47151 -30082 17064 -41693 -49310 -18246 -36197 -23487 48939
5064D8939J4478l402o5386L877q278M320j0346P4568k014n784l6955l403n3525
$$ 48939 63417 60015 -5371 -1494 -9772 -5452 -15798 58770 56756 50972 14017 10614 -42911
5051d2911j6087M4799l6811k4459J8441l1629j5733j3615n121l8276p488k65K7533
$$ -42911 -58998 -14199 -51010 -75469 -57028 -88657 -104390 -118005 -123126 -161402 -168890 -169155 -141622
5038a41622N1816L1595L7293J1291o7185m9734O772K5067M0150L5370j1894k4240
$$ -141622 -89806 -58211 -20918 -9627 -76812 -126546 -119774 -94707 -54557 -19187 -31081 -55321
5026e5321n3053j7558Q7486O1854j9945n2011L8066L0135k6365j3749L4001J9918
$$ -55321 -108374 -125932 -38446 23408 3463 -48548 -10482 19653 -6712 -20461 13540 33458
5014C3458n7521L878L9401m8616o1225Q935n754O1274J7489n6376o1159L9526
$$ 33458 -24063 -20185 19216 -29400 -90625 -81690 -87444 -26170 -8681 -65057 -126216 -86690
5002h6690Q5433p255k8071m0583Q660N1104J8991l5348K6455K1647J4460M0633
$$ -86690 -1257 -8512 -36583 -77166 -68506 -17402 1589 -33759 -7304 14343 28803 69436
4990F9436j4246j07101p145J6210M6103r333J0385j7709j330J5415j4808M3703
$$ 69436 55190 -51911 -59056 -42846 3257 -6076 4309 -13400 -14730 685 -14123 29580
4978B9580K362m9137R806Q46J2270l7836l6665K5786j2126K5682M7318J2981k2333
$$ 29580 31942 -17195 -7389 -6543 5727 -32109 -68774 -42988 -55114 -29432 17886 30867 8534
4965H534K3642O963N562j972J1136J84o8944J6747k4975q3831j6040L7380M6977
$$ 8534 32176 39139 44701 42729 53865 54049 -14895 1852 -23123 -106954 -122994 -85614 -38637
4952c8637O8456K507m8461j8091J6466k0007J9616j4998l5786l5655K7057o810
$$ -38637 29819 32326 -16135 -34226 -17760 -37767 -18151 -33149 -68935 -104590 -77533 -84343
4940h4343j8287l311P884k6776K4091j900L1410K7530K1132N5383J1968l022o1146
$$ -84343 -102630 -105941 -98057 -124833 -100742 -102642 -71232 -43702 -22570 32813 44781 41759 -19387
4927a9387k5837k5713O6647K6999r753l3005P798K4125L3111K3927j2797j5284
$$ -19387 -45224 -70937 -4290 22709 12956 -20049 -12251 11874 44985 68912 56115 40831
4915D0831K0033P90k4097p9958k7843J9305K8185J138j1816j8795J7081L2838
$$ 40831 60864 61654 37557 -42401 -70244 -50939 -22754 -21616 -33432 -52227 -35146 -2308
4903b308P751j3924K9975J7614n596k4863N481K3375J3031l156m2013l8692j0479
$$ -2308 5443 -8481 21494 39108 33512 8649 14130 37505 50536 47380 5367 -33325 -43804
4890d3804O2679M308k5064k3333l1851j9725m847j7J6125P035L6932J6948j2080
$$ -43804 18875 23183 -1881 -25214 -57065 -76790 -81637 -81654 -65529 -58494 -21562 -4614 -16694
4877a6694p628L3224O1643K6120J8376l8470J3863l4991n8014m8939K9468J7559
$$ -16694 -24322 8902 70545 96665 115041 76571 90434 55443 -2571 -51510 -22042 -4483
4865d483r274M0265l5653q029J5699R041j8042O062N5535m5150o8114o5059k023
$$ -4483 -13757 26508 -9145 -17174 -1475 7566 -10476 -4414 51121 5971 -62143 -127202 -129225
4852a29225R695K0567j573L1216R0335N5155m2017o6368J4978k4482J3796O6900
$$ -129225 -119530 -98963 -100536 -69320 21015 76170 34153 -32215 -17237 -41719 -27923 38977
4840C8977k7318l2312J1182K8298j0170k480K8453N364M562j8195j530n8579K2347
$$ 38977 11659 -20653 -9471 18827 8657 6177 34630 39994 44556 26361 24831 -33748 -11401
4827a1401K6563l2651M9993J2909J0013l726l497l1274N407R4771n4878m2507
$$ -11401 15162 -17489 32504 45413 55426 51700 48203 16929 22336 117107 62229 19722
4815A9722J6765k8774k0585J7846J7745L89N8680O687k70m5755j00936n1723N8359
$$ 19722 36487 7713 -12872 4974 22719 23108 81788 88475 88205 42450 -58486 -110209 -51850
4802e1850M822k7466N604O815J7844l4142j7588O2595l7803k6180J6324J598N8489
$$ -51850 -47028 -74494 -68890 -62075 -44231 -78373 -95961 -33366 -71169 -97349 -81025 -79427 -20938
4789b0938Q1946n0675m4845n6741n340O3123m2135N757J4124k6279M2231K2749
$$ -20938 61008 10333 -34512 -91253 -96593 -33470 -75605 -69848 -55724 -82003 -39772 -17023
4777a7023N1624K7784k6605n3688j0340K2621N1157j5078o3590k4011L3227j9600
$$ -17023 34601 62385 35780 -17908 -28248 -5627 45530 30452 -33138 -57149 -23922 -43522
4765d3522J7384J4077K9061J5003j4785l7743l7590K518R4944k1726N596J1721
$$ -43522 -26138 -12061 17000 32003 17218 -20525 -58115 -55597 39347 17621 23217 34938
4753C4938o2362l2347Q080l18Q528j9709p709Q323q274k2097m074L6806K5278
$$ 34938 -27424 -59771 -51691 -52009 -43481 -63190 -70899 -62576 -70850 -92947 -97021 -60215 -34937
4740c4937M277j3350q189N9838L6817K3619m4031k1893M4479k9945l9887n5323
$$ -34937 -30660 -44010 -52199 7639 44456 68075 24044 2151 46630 16685 -23202 -78525
4728g8525n6527L6982R1669O0736j8112J2925L2122O500J745k5754n0686j2803
$$ -78525 -135052 -98070 -6401 54335 36223 49148 81270 87770 89515 63761 13075 272
4716B72J8616L2208n4165j00929j7404L0387J0284K3347J5017l1552m8694L5341
$$ 272 18888 51096 -3069 -103998 -121402 -91015 -80731 -57384 -42367 -73919 -122613 -87272
4704h7272K4042N2162o834K0668j4070M86L8852K4960k0240m6432p8080M6062
$$ -87272 -63230 -11068 -17902 2766 -11304 -10818 28034 52994 32754 -13678 -91758 -45696
4692d5696O6193m0871J1530K3492Q178J5901n553P60j5045r857l1573k3255J5730
$$ -45696 20497 -20374 -8844 14648 22826 38727 33174 33934 18889 9032 -22541 -45796 -30066
4679c0066j5730K290L6512K0405j8901n8332k7882J0468M1519l716K7806K4024
$$ -30066 -45796 -43506 -6994 13411 -5490 -63822 -91704 -81236 -39717 -43433 -15627 8397
4667H397K3264m588l7396l6591O0217L7284m859J4901l6194m0422k1170k583M0593
$$ 8397 31661 27073 -10323 -46914 13303 50587 45728 60629 24435 -15987 -37157 -39740 853
4654H53o483M390M334L8748m905o6318j0270j0291Q990L3324m449j1963M7942
$$ 853 -5630 -1240 3094 41842 36937 -29381 -39651 -49942 -40952 -7628 -12077 -24040 23902
4641B3902L7199m7067n2841O0804M5024M860l9411j5814J0118l1484m3189m7429
$$ 23902 61101 14034 -38807 21997 67021 71881 32470 16656 26774 -4710 -47899 -95328
4629i5328M1443J2034l9260M533K9040J3934l2284L1456O967J4777k0126M3203
$$ -95328 -53885 -41851 -81111 -76578 -47538 -33604 -65888 -34432 -27465 -12688 -32814 10389
4617A0389k2250K9712K1516m6442j6487J284j162L1537L9516K8531n563O139l2653
$$ 10389 -11861 17851 39367 -7075 -23562 -22278 -23440 8097 47613 76144 70581 76720 44067
4604D4067P092L1369R056k6994j2449k0292l8280K366N8179J8151k689j6176R277
$$ 44067 51159 82528 91584 64590 52141 31849 -6431 -4065 54114 72265 69576 53400 62677
4591F2677j3296m8795J2884k6711m3001l5288o997O0690o367l4278N378K0782
$$ 62677 49381 586 13470 -13241 -56242 -91530 -98527 -37837 -44204 -78482 -73104 -52322
4579e2322L2843O5330N3772o8191o4822l1703K8791j7622k4332j694n970L694
$$ -52322 -19479 45851 99623 31432 -33390 -65093 -36302 -53924 -78256 -79950 -85920 -82226
4567h2226M120P0127K1518J0092L391K786k195m1191l4829R4080O7483M7000j2834
$$ -82226 -78106 -7979 13539 23631 27022 29808 27613 -13578 -48407 45673 113156 160156 147322
4554A47322k9725j8831k6288l6916n0423r0816m6808P2597N0331M5752j7867j3470
$$ 147322 117597 98766 72478 35562 -14861 -105677 -152485 -79888 -29557 16195 -1672 -15142
4542a5142r783m8959r212M7646K6817j1242O2357L6170n7598l0330k3248j3483
$$ -15142 -24925 -73884 -83096 -35450 -8633 -19875 42482 78652 21054 -9276 -32524 -46007
$$ [...]
##END NTUPLES=NMR SPECTRUM
##END=
