##TITLE=Analysis number 327789
Compound Code cd 07751
Book Reference 174518
Project Code qc-cat flro3
Chemist Name jom
##JCAMPDX= 6.0         $$ Bruker NMR JCAMP-DX V2.0
##DATA TYPE= NMR SPECTRUM
##DATA CLASS= NTUPLES
##ORIGIN= Bruker BioSpin GmbH
##OWNER= nmr
$$ XWIN-NMR		Version 3.5
$$ Tue Apr 10 09:52:47 2007 GMT Daylight Time (UT+1h)  MAYBRIDGE\nmr@NMR_250MHZ
##.OBSERVE FREQUENCY= 250.131544655141
##.OBSERVE NUCLEUS= ^1H
##.ACQUISITION MODE= SIMULTANEOUS (DQD)
##.ACQUISITION SCHEME= undefined
##.AVERAGES= 16
##.DIGITISER RES= 18
##SPECTROMETER/DATA SYSTEM= dpx250
##.PULSE SEQUENCE= zg30
##.SOLVENT NAME= CDCl3
##.SHIFT REFERENCE= (INTERNAL, CDCl3, 0, 16.522)
##AUDIT TRAIL= $$ (NUMBER, WHEN, WHO, WHERE, WHAT)
$$ ##TITLE= Audit trail, XWIN-NMR		Version 3.5
$$ ##JCAMPDX= 5.01
$$ ##ORIGIN= Bruker BioSpin GmbH
$$ ##OWNER= nmr
$$ C:\u/data/dgb/nmr/ADRS/720/pdata/1/auditp.txt
$$ ##AUDIT TRAIL=  $$ (NUMBER, WHEN, WHO, WHERE, WHAT)
(   1,<2007-04-10 09:52:21.88 +100>,<MAYBRIDGE\nmr>,<NMR_250MHZ>,
      <created by zg, POWCHK disabled, PULCHK disabled
       configuration hash MD5:
       49 4B E0 1D 92 C2 6B 37 9F E6 65 BC 52 41 86 1D
       data hash MD5: 64K
       B5 7C 12 11 4F 6E C4 A3 7C BC EE 48 D5 E5 95 8B>)
(   2,<2007-04-10 09:52:37.34 +100>,<MAYBRIDGE\nmr>,<NMR_250MHZ>,
      <Start of raw data processing
       ef LB = 0.3 FT_mod = 6 PKNL = 1 SI = 32K 
       data hash MD5: 32K
       54 06 C2 F1 89 FE 17 17 90 8E E1 DF F4 C8 9F 98>)
(   3,<2007-04-10 09:52:38.99 +100>,<MAYBRIDGE\nmr>,<NMR_250MHZ>,
      <apk 
       data hash MD5: 32K
       E2 4A 91 2A 65 5E 97 8B C3 A2 0E 4B 04 16 58 87>)
(   4,<2007-04-10 09:52:39.70 +100>,<MAYBRIDGE\nmr>,<NMR_250MHZ>,
      <abs ABSG = 5 
       data hash MD5: 32K
       31 EA DC C2 4A 4D 7B E6 0C F4 DE A0 75 68 47 8C>)
$$ ##END=
$$ 
$$ hash MD5
$$ 07 DA F9 70 2D E7 06 77 CC 38 1A F6 52 55 C6 32
##$RELAX= 
##$RELAX= 
##$RELAX= 
##$RELAX= 
##$RELAX= 
##$RELAX= 
##$RELAX= 
$$ Bruker specific parameters
$$ --------------------------
##$DU= <C:\u>
##$EXPNO= 720
##$NAME= <ADRS>
##$PROCNO= 1
##$TYPE= <nmr>
##$USER= <dgb>
##$AMP= (0..31)
100 100 100 100 100 100 100 100 100 100 100 100 100 100 100 100 100 100 
100 100 100 100 100 100 100 100 100 100 100 100 100 100 
##$AQSEQ= 0
##$AQ_mod= 3
##$AUNM= <au_zg>
##$AUTOPOS= <9 >
##$BF1= 250.13
##$BF2= 250.13
##$BF3= 250.13
##$BF4= 250.13
##$BF5= 500.13
##$BF6= 500.13
##$BF7= 500.13
##$BF8= 500.13
##$BYTORDA= 1
##$CFDGTYP= 0
##$CFRGTYP= 5
##$CHEMSTR= <none>
##$CNST= (0..31)
1 1 145 1 1 1 1 1 1 1 1 1 1 1 1 1 1 1 1 1 1 1 1 1 1 1 1 1 1 1 1 1 
##$CPDPRG= <>
##$CPDPRG1= <>
##$CPDPRG2= <>
##$CPDPRG3= <>
##$CPDPRG4= <mlev>
##$CPDPRG5= <mlev>
##$CPDPRG6= <mlev>
##$CPDPRG7= <mlev>
##$CPDPRG8= <mlev>
##$CPDPRGB= <>
##$CPDPRGT= <>
##$D= (0..31)
0 1 0 0 0 0 0 0 0 0.06 0 0 0 0 0 0 0.0002 0 0 0 0 0 0 0 0 0 0 0 0 0 0 
0 
##$DATE= 1176195140
##$DBL= (0..7)
120 120 120 120 120 120 120 120 
##$DBP= (0..7)
150 150 150 150 150 150 150 150 
##$DBP07= 0
##$DBPNAM0= <>
##$DBPNAM1= <>
$$ [...]
##$SUBNAM7= <"">
##$SUBNAM8= <"">
##$SUBNAM9= <"">
##$SW= 20.6930455092707
##$SWIBOX= (0..15)
0 0 3 0 0 0 0 0 0 0 0 0 0 0 0 0 
##$SW_h= 5175.983436853
##$TD= 65536
##$TD0= 1
##$TE= 683.16
##$TE2= 300
##$TE3= 300
##$TEG= 300
##$TL= (0..7)
0 120 120 120 120 120 120 120 
##$TP= (0..7)
150 150 150 150 150 150 150 150 
##$TP07= 0
##$TPNAME0= <>
##$TPNAME1= <>
##$TPNAME2= <>
##$TPNAME3= <>
##$TPNAME4= <>
##$TPNAME5= <>
##$TPNAME6= <>
##$TPNAME7= <>
##$TPOAL= (0..7)
0.5 0.5 0.5 0.5 0.5 0.5 0.5 0.5 
##$TPOFFS= (0..7)
0 0 0 0 0 0 0 0 
##$TUNHIN= 0
##$TUNHOUT= 0
##$TUNXOUT= 0
##$USERA1= <user>
##$USERA2= <user>
##$USERA3= <user>
##$USERA4= <user>
##$USERA5= <user>
##$V9= 5
##$VALIST= <valist>
##$VCLIST= <CCCCCCCCCCCCCCC>
##$VD= 0
##$VDLIST= <DDDDDDDDDDDDDDD>
##$VPLIST= <PPPPPPPPPPPPPPP>
##$VTLIST= <TTTTTTTTTTTTTTT>
##$WBST= 1024
##$WBSW= 4
##$XGAIN= (0..3)
0 0 0 0 
##$XL= 0
##$YL= 0
##$YMAX_a= 519141
##$YMIN_a= -584145
##$ZGOPTNS= <>
##$ZL1= 120
##$ZL2= 120
##$ZL3= 120
##$ZL4= 120
##$ABSF1= 16.522
##$ABSF2= -4.171173
##$ABSG= 5
##$ABSL= 3
##$ALPHA= 0
##$AQORDER= 0
##$ASSFAC= 0
##$ASSFACI= 0
##$ASSFACX= 0
##$ASSWID= 0
##$AUNMP= <proc_1d>
##$AZFE= 0.1
##$AZFW= 0.1
##$BCFW= 0
##$BC_mod= 0
##$BYTORDP= 0
##$COROFFS= 0
##$CY= 12.5
##$DATMOD= 1
##$DC= 0
##$DFILT= <>
##$DTYPP= 0
##$F1P= 14.0000005364418
##$F2P= -0.99999901652339
##$FCOR= 0.5
##$FTSIZE= 32768
##$FT_mod= 6
##$GAMMA= 0
##$GB= 0
##$INTBC= 1
##$INTSCL= 1
##$ISEN= 128
##$LB= 0.3
##$LEV0= 0
##$LPBIN= 0
##$MAXI= 10000
##$MC2= 0
##$MEAN= 0
##$ME_mod= 0
##$MI= 0
##$NCOEF= 0
##$NC_proc= -4
##$NLEV= 6
##$NOISF1= 0
##$NOISF2= 0
##$NSP= 0
##$NTH_PI= 0
##$NZP= 0
##$OFFSET= 16.522
##$PC= 1
##$PHC0= 231.0657
##$PHC1= 6.11052
##$PH_mod= 1
##$PKNL= yes
##$PPARMOD= 0
##$PSCAL= 4
##$PSIGN= 0
##$REVERSE= no
##$SF= 250.13
##$SI= 32768
##$SIGF1= 0
##$SIGF2= 0
##$SINO= 400
##$SIOLD= 32768
##$SREGLST= <1H.CDCl3>
##$SSB= 0
##$STSI= 32768
##$STSR= 0
##$SW_p= 5175.98343685301
##$SYMM= 0
##$S_DEV= 0
##$TDeff= 65536
##$TDoff= 0
##$TI= <Analysis number 999999
Compound Code 99
Book Reference 9
Project Code 9>
##$TILT= no
##$TM1= 0
##$TM2= 0
##$TOPLEV= 0
##$USERP1= <user>
##$USERP2= <user>
##$USERP3= <user>
##$USERP4= <user>
##$USERP5= <user>
##$WDW= 1
##$XDIM= 32768
##$YMAX_p= 419442419
##$YMIN_p= -108501
$$ End of Bruker specific parameters
$$ ---------------------------------
##NTUPLES= NMR SPECTRUM
##VAR_NAME=  FREQUENCY,     SPECTRUM/REAL,   SPECTRUM/IMAG
##SYMBOL=    X,             R,               I
##VAR_TYPE=  INDEPENDENT,   DEPENDENT,       DEPENDENT
##VAR_FORM=  AFFN,          ASDF,            ASDF
##VAR_DIM=   32768,         32768,           32768
##UNITS=     HZ,            ARBITRARY UNITS, ARBITRARY UNITS
##FACTOR=    0.157963299565203, 1,           1
##FIRST=     4132.6476996994, 0,             0
##LAST=      -1043.33573715361, 0,           0
##MIN=       -1043.33573715361, -108501,     0
##MAX=       4132.6476996994, 419442419,     0
$$ Real data points
##PAGE= N=1
##DATA TABLE= (X++(R..R)), XYDATA
$$ [...]
$$ plain form
18359 88834 90311 65541 39463 -1812 -1122 -1447 -13269 -16600 -22207 -19887 -7211 5580 5105 25666
18345 25666 30686 21193 22175 14155 2325 -17261 -15428 -8742 4374 26744 18500 7770 5660
18332 5660 11344 28269 25506 3775 3602 8061 11453 6410 9623 7368 35712 72553 80601 62843
18318 62843 49986 56003 61931 51792 73083 32515 31736 46927 43183 45911 30145 48749 62393
18305 62393 77228 72234 28070 32061 46830 40272 41843 52195 61044 42341 37945 33220 14926
18292 14926 14288 -8863 -20558 -4226 -1505 4488 2650 -3981 -15197 -9053 947 19041 12948
18279 12948 -21672 -10193 -23561 -45894 -57519 -40659 -31418 -10613 23887 47517 33513 49748
18267 49748 38718 27428 31546 5768 11522 1061 738 -844 -125 1741 9684 15761 27264 23072
$$ packed form
18359H8834J477k4770k6078m1275O90l25j1822l331n607K320J2676J2791m75K0561
18345B5666N020r493R82q020j1830j9586J833O686J3116K2370q244j0730k110
18332E660N684J6925k763k1731j73M459L392n043L213k255K8344L6841Q048j7758
18318F2843j2857O017N928j0139K1291m0568p79J5191l744K728j5766J8604J3644
18305F2393J4835m994m4164L991J4769o558J571J0352Q849j8703m396m725j8294
18292A4926o38k3151j1695J6332K721N993j838o631j1216O144J0000J8094o093
18279A2948l4620J1479j3368k2333j1625J6860R241K0805L4500K3630j4004J6235
18267D9748j1030j1290M118k5778N754j0461l23j582P19J866P943O077J1503m192
$$ plain form
18253 23072 36691 17270 19679 35321 41919 59906 82088 70995 46890 32577 63014 66857
18241 66857 39462 51442 50869 37891 35847 70586 96520 123102 156105 181299 197267 228415
18229 228415 258013 266495 224770 188009 170030 138447 142089 150560 166496 161922 145438 158054
18217 158054 164260 186122 220031 253032 266272 276629 274924 264401 228823 210255 210089 200841
18205 200841 195002 177332 170877 187374 192121 179612 132841 125575 117081 111577 114981 146272 165115
18192 165115 168860 163451 191994 238198 286292 365288 368877 382837 397044 402021 393735 344955
18180 344955 319975 345558 391485 436335 484049 514910 594079 673249 755082 850912 919842
18169 919842 942130 907072 821695 733228 672979 633361 598206 567672 559778 538247 524914 495381
$$ packed form
18253B3072J3619j9421K409J5642O598J7987K2182j1093k4105j4313L0437L843
18241F6857k7395J1980n73j2978k044L4739K5934K6582L3003K5194J5968L1148
18229B28415K9598Q482m1725l6761j7979l1583L642Q471J5936m574j6484J2616
18217A58054O206K1862L3909L3001J3240J0357j705j0523l5578j8568j66r248
18205B00841n839j7670o455J6497M747j2509m6771p266q494n504L404L1291J8843
18192A65115L745n409K8543M6204M8094P8996L589J3960J4207M977q286m8780
18180C44955k4980K5583M5927M4850M7714L0861P9169P9170Q1833R5830O8930
18169I19842K2288l5058q5377q8467o0249l9618l5155l0534p894k1531j3333k9533
$$ plain form
18157 495381 474316 465899 451808 454093 432526 427681 442434 433854 423305 423774 417579 395620 385139
18144 385139 363939 346811 346032 364771 404721 434382 473838 477180 450331 447894 466060 508382
18132 508382 571341 606463 642901 709352 787608 864838 985054 1156482 1310961 1435846 1536088
18121 1536088 1649190 1815173 2036554 2312817 2737552 3388476 4391158 6016218 8834438
18112 8834438 13671279 21573760 33266987 44243370 47704573 44059610 32070921 18671574
18104 18671574 11531244 7932448 5938539 4704096 3881617 3286560 2810051 2455341 2256919
18095 2256919 2088694 1945393 1867414 1799544 1736332 1687586 1691170 1669955 1539285 1368838 1219525
18084 1219525 1148955 1145110 1175468 1267068 1387777 1437549 1427640 1407181 1320053 1264275 1244642
$$ packed form
18157D95381k1065q417j4091K285k1567m845J4753q580j0549M69o195k1959j0481
18144C85139k1200j7128p79J8739L9950K9661L9456L342k6849k437J8166M2322
18132E08382O2959L5122L6438O6451P8256P7230J20216J71428J54479J24885J00242
18121A536088J13102J65983K21381K76263M24735O50924J002682J625060K818220
18112H834438M836841P902481J1693227J0976383L461203l644963j1988689j3399347
18104A8671574p140330l598796j993909j234443q22479n95057m76509l54710j98422
18095B256919j68225j43301p7979o7870o3212m8746L584k1215j30670j70447j49313
18084A219525p0570l845L0358R1600J20709M9772r909k0459q7128n5778j9633
$$ plain form
18073 1244642 1249977 1254429 1230014 1181490 1113374 1121899 1148454 1181547 1215041 1290433 1358619 1363837
18061 1363837 1353894 1349619 1355435 1388948 1409945 1429206 1404301 1337429 1239701 1106690 1013871 942193
18049 942193 910814 895327 910159 908433 931294 963958 1027173 1086176 1146014 1220366 1261103 1299155
18037 1299155 1333107 1385872 1468805 1531257 1608235 1669613 1790660 1950532 2134781 2347462
18027 2347462 2652555 3058087 3586169 4346915 5472135 7177538 9588604 12417253 14906162
18018 14906162 16081594 15510386 13532318 11166901 9478039 8872839 9311588 10872412
18010 10872412 13749762 18256409 24253782 31043242 36960451 39867309 38702255 33667687
18002 33667687 26818575 20395593 15813263 13083748 11563536 10736384 10242246 9985711
$$ packed form
18073A244642N335M452k4415m8524o8116Q525K6555L3093L3494P5392O8186N218
18061A363837r943m275N816L3513K0997J9261k4905o6872r7728j33011r2819p1678
18049I42193l1379j5487J4832j726K2861L2664O3215N9003N9838P4352M0737L8052
18037A299155L3952N2765Q2933O2452P6978O1378J21047J59872J84249K12681
18027B347462L05093M05532N28082P60746J125220J705403K411066K828649K488909
18018A4906162J175432n71208j978068k365417j688862o05200M38749J560824
18010A0872412K877350M506647N997373O789460N917209K906858j165054n034568
18002C3667687o849112o422982m582330k729515j520212q27152m94138k56535
$$ plain form
17994 9985711 9975301 10239986 10790381 11485910 12309812 13263910 14405377 15985526 18146383
17985 18146383 21100920 25305826 31357105 40591773 55487286 79482627 116162798 164961671
17977 164961671 208779518 225815675 212955432 171311260 124560393 98128078 89911307
17970 89911307 94119737 105792326 118402051 124508008 119969356 106053532 88384418
17963 88384418 74327492 67274906 67363938 74668881 90761944 118098057 158142776 208563047
17955 208563047 258039440 288532936 288022644 254597953 201054993 148043357 108206240
17948 108206240 83173267 68864539 61421280 59129661 61949895 70738028 86495367
17941 86495367 107827418 127590161 136215503 129294900 108218967 81759154 60538339
$$ packed form
17994I985711j0410K64685N50395O95529Q23902R54098J141467J580149K160857
17985A8146383K954537M204906O051279R234668J4895513K3995341L6680171M8798873
17977A64961671M3817847J7036157j2860243m1644172m6750867k6432315q216771
17970H9911307M208430J1672589J2609725O105957m538652j3915824j7669114
17963H8384418j4056926p052586Q9032P304943J6093063K7336113M0044719N0420271
17955B08563047M9476393L0493496n10292l3424691n3542960n3011636l9837117
17948A08206240k5032973j4308728p443259k291619K820234Q788133J5757339
17941H6495367K1332051J9762743Q625342o920603k1075933k6459813k1220815
$$ plain form
17934 60538339 46907670 38304291 32493705 28298315 25156147 22722477 20864030 19454384
17926 19454384 18246321 17110179 16056774 15131951 14468820 14198490 14227234 14372448 14614046
17917 14614046 14975161 15546113 16579593 18386606 21399177 26311077 34155698 45999415
17909 45999415 62201660 80681690 96105522 102629811 97801244 83434596 65319233
17902 65319233 49267085 37234671 28568184 22559285 18567808 15857228 13998682 12809554
17894 12809554 12226672 12295128 13244744 15253263 18309918 21509682 23227856 22638059 19728271
17885 19728271 15650710 12209178 9964658 8524662 7504704 6802230 6281188 5868483
17877 5868483 5489748 5164308 4895816 4766820 4766331 4899538 5074215 5215947 5329286 5393386
$$ packed form
17934F0538339j3630669q603379n810586m195390l142168k433670j858447j409646
17926A9454384j208063j136142j053405r24823o63131k70330K8744J45214K41598
17917A4614046L61115N70952J033480J807013L012571M911900P844621J1843717
17909D5999415J6202245J8480030J5423832O524289m828567j4366648j8115363
17902F5319233j6052148j2032414q666487o008899l991477k710580j858546j189128
17894A2809554n82882O8456R49616K008519L056655L199764J718174n89797k909788
17885A9728271m077561l441532k244520j439996j019958p02474n21042m12705
17877E868483l78735l25440k68492j28996m89J33207J74677J41732J13339O4100
$$ plain form
17867 5393386 5455796 5550432 5716741 6068833 6672104 7689037 9265114 11809082 15775775
17858 15775775 21333916 27907664 33620112 36149176 34239090 28459531 21209862 15058967
17850 15058967 10937900 8393620 6790005 5728930 5013739 4475444 4090521 3778343 3491182
17841 3491182 3226833 3007092 2789839 2631350 2523283 2469203 2407473 2324937 2227869 2116387
17831 2116387 2003653 1927211 1847895 1783754 1733073 1669070 1609466 1569278 1546311 1588998 1671287
17820 1671287 1764603 1889816 1979585 2013223 2011957 1985147 1962602 1943256 1895621 1856046 1808712
17809 1808712 1733041 1661023 1568988 1529161 1506805 1461703 1426911 1415260 1374015 1358911 1323722
17798 1323722 1279091 1227890 1193157 1134072 1065316 991980 907264 880446 849604 860247 837125
$$ packed form
17867E393386O2410R4636J66309L52092O03271J016933J576077K543968L966693
17858A5775775N558141O573748N712448K529064j910086n779559p249669o150895
17850A5058967m121067k544280j603615j061075p15191n38295l84923l12178k87161
17841C491182k64349k19741k17253j58489j08067n4080o1730q2536r7068j11482
17831B116387j12734p6442p9316o4141n0681o4003n9604m0188k2967M2687Q2289
17820A671287R3316J25213Q9769L3638j266k6810k2545j9346m7635l9575m7334
17809A808712p5671p2018r2035l9827k2356m5102l4792j1651m1245j5104l5189
17798A323722m4631n1201l4733n9085o8756p3336q4716k6818l0842J0643k3122
$$ plain form
17787 837125 817331 801367 805875 786237 768590 741733 733155 753198 749465 732222 719816 731568
17775 731568 722929 747290 747467 752365 793956 840963 877968 900443 935113 964825 989503 1008522
17763 1008522 1028196 1074826 1141835 1191235 1206194 1211518 1236718 1287382 1335413 1358960 1405984
17752 1405984 1422437 1415122 1359719 1299102 1251380 1202063 1219006 1267573 1356613 1480665 1640583
17741 1640583 1811199 2109049 2529823 3133563 4005480 5161678 6431808 7748958 9027753
17732 9027753 9999832 10461691 10423659 9718790 8547369 7390893 6303568 5311691 4615227
17723 4615227 4250205 4071518 4038240 4116711 4252149 4430591 4631445 4863169 5203399 5745376
17713 5745376 6584814 7887482 9905135 12978133 17642588 24460888 33346521 43371193
$$ packed form
17787H37125j9794j5964M508j9638j7647k6857q578K0043l733j7243j2406J1752
17775G31568q639K4361J77M898M1591M7007L7005K2475L4670K9712K4678J9019
17763A008522J9674M6630O7009M9400J4959N324K5200N0664M8031K3547M7024
17752A405984J6453p315n5403o0617m7722m9317J6943M8567Q9040J24052J59918
17741A640583J70616K97850M20774O03740Q71917J156198J270130J317150J278795
17732I027753R72079M61859l8032p04869j171421j156476j087325r91877o96464
17723D615227l65022j78687l3278P8471J35438J78442K00854K31724L40230N41977
17713E745376Q39438J302668K017653L072998M664455O818300Q885633J0024672
$$ plain form
17705 43371193 53150457 59851744 61379058 57978687 49841233 40059163 31245442 24138458
17697 24138458 19322619 16186889 14048624 12506704 11506829 11020489 10887040 11101519 11774880
17688 11774880 13158592 15559656 19203891 23644392 28118231 32475077 36630341 39707845
17680 39707845 40815634 39764742 36420999 32200715 28603069 25328783 22050158 19727524
17672 19727524 19401498 21277474 25492476 32160737 40455087 47574176 50266450 47250556
17664 47250556 39456449 30321668 23353179 19061786 16524669 15021911 14170858 13756749
17656 13756749 13713334 14082717 15034505 16871623 19978793 24924003 32376380 42893412
17648 42893412 56134036 71117184 85242305 94895489 98584469 94443240 84127692
$$ packed form
17705D3371193R779264O701287J527314l400371q137454r782070q813721p106984
17697B4138458m815839l135730k138265j541920r99875m86340j33449K14479O73361
17688A1774880J383712K401064L644235M440501M473839M356846M155264L077504
17680C9707845J107789j050892l343743m220284l597646l274286l278625k322634
17672A9727524l26026J875976M215002O668261Q294350P119089K692274l015894
17664D7250556p794107r134781o968489m291393k537117j502758q51053m14109
17656A3756749m3415L69383R51788J837118L107170M945210P452377J0517032
17648D2893412J3240624J4983148J4125121R653184L688980m141229j0315548
$$ plain form
17641 84127692 71377845 58432198 48814640 43634107 43027023 45951961 50734062 56098428
17633 56098428 59316698 59004445 55684023 48726956 40328971 32742728 25840584 20348890
17625 20348890 16675449 14245664 12603076 11539551 10928313 10717344 10890859 11398854 12094106
17616 12094106 12661108 12779325 12263775 11228464 10059613 9125851 8556504 8320495 8320583 8535270
17606 8535270 9057719 10033550 11629848 14263674 18413992 24373190 31779434 39434688
17598 39434688 45333502 47231679 44697384 38573614 31302339 25316012 21548053 20312608
17590 20312608 21367627 24554050 29471553 35199567 40563021 43423332 42851967 39140466
17582 39140466 32599095 25647029 19573173 14756946 11435310 9227813 7726479 6670647
$$ packed form
17641H4127692j2749847j2945647r617558n180533o07084K924938M782101N364366
17633E6098428L218270l12253l320422o957067q397985p586243o902144n491694
17625B0348890l673441k429785j642588j063525o11238k10969J73515N07995O95252
17616A2094106N67002J18217n15550j035311j168851r33762n69347k36009Q8K14687
17606H535270N22449R75831J596298K633826M150318N959198P406244P655254
17598C9434688N898814J898177k534295o123770p271275n986327l767959j235445
17590B0312608J055019L186423M917503N728014N363454K860311n71365l711501
17582C9140466o541371o952066o073856m816227l321636k207497j501334j055832
$$ plain form
17574 6670647 5906008 5378420 5026914 4793293 4602922 4388241 4171120 3917620 3633797
17565 3633797 3367720 3124360 2866871 2665221 2516892 2408320 2322741 2244133 2096291 1957016
17555 1957016 1844657 1730718 1666088 1610575 1565768 1515781 1460371 1409629 1359137 1279747 1228118
17544 1228118 1197687 1162274 1137776 1125785 1105291 1131796 1208467 1295767 1474349 1709349 1875868
17533 1875868 1929853 1816079 1549710 1225759 1020468 922004 853013 788701 741934 726773
17523 726773 692183 647115 628426 604682 612944 626201 603468 551101 520870 520827 496367 481382
17511 481382 487458 485864 470596 460565 455064 452421 416303 401598 412761 439184 460072 460290 437944
17498 437944 412523 410820 432278 444659 429586 409133 413661 418227 435329 418016 398462 374484
$$ packed form
17574F670647p64639n27588l51506k33621j90371k14681k17121k53500k83823
17565C633797k66077k43360k57489k01650j48329j08572q5579p8608j47842j39275
17555A957016j12359j13939o4630n5513m4807m9987n5410n0742n0492p9390n1629
17544A228118l0431l5413k4498j1991k0494K6505P6671Q7300J78582K35000J66519
17533A875868N3985j13774k66369l23951k05291r8464o8991o4312m6767j5161
17523G26773l4590m5068j8689k3744Q262J3257k2733n2367l0231m3k4460j4985
17511D81382O076j594j5268j0031n501k643l6118j4705J1163K6423K0888K18k2346
17498D37944k5421j703K1458J2381j5073k0453M528M566J7102j7313j9554k3978
$$ plain form
17486 374484 357687 351378 359572 379630 393603 397357 401915 433557 492999 560678 640003 756828
17474 756828 872178 937471 938425 865549 801616 772406 788309 802528 862414 922140 926731 906378
17462 906378 839187 763315 725729 706360 688056 663708 630205 563648 503025 451805 405330
17451 405330 377589 352971 334215 307210 338213 347360 391247 442322 510025 559315 597351 627910
17439 627910 596443 571974 591077 639215 666524 642921 584608 514226 467768 438080 415792
17428 415792 428468 474441 539832 626742 739515 843536 945510 984140 946981 864051 782347
17417 782347 742613 760116 765363 758687 730727 711841 651672 579332 554043 539464 516783 500149
17405 500149 480066 412069 324562 306484 291627 281279 234698 217922 235438 241988 221172 220523
$$ packed form
17486C74484j6797o309Q194K0058J3973L754M558L1642N9442O7679P9325J16825
17474G56828J15350O5293R54p2876o3933k9210J5903J4219N9886N9726M591k0353
17462I06378o7191p5872l7586j9369j8304k4348l3503o6557o0623n1220m6475
17451D05330k7741k4618j8756k7005L1003R147M3887N1075O7703M9290L8036L0559
17439F27910l1467k4469J9103M8138K7309k3603n8313p0382m6458k9688k2288
17428D15792J2676M5973O5391Q6910J12773J04021J01974L8630l7159q2930q1704
17417G82347l9734J7503N247o676k7960j8886o0169p2340k5289j4579k2681j6634
17405E00149k0083o7997q7507j8078j4857j0348m6581j6776J7516O550k0816o49
$$ plain form
17393 220523 248836 231889 236592 298553 375123 402755 464519 571113 638679 652320 668879
17382 668879 619205 535050 457009 382628 324750 299937 275818 255626 245456 263568 308847
17371 308847 326868 335214 339902 302209 272117 235994 191512 195468 202467 192326 151823 123752
17359 123752 103355 87882 93508 90718 120347 124022 120556 131004 124469 125808 104355 123342 143428
17346 143428 135452 140146 151795 139165 134997 137349 151796 167026 188945 183961 194296 222259
17334 222259 249854 283612 283394 283836 267032 193839 167156 142518 137265 133890 122396 131032 129690
17321 129690 109199 87471 109770 116111 83531 60626 55422 64137 85192 100533 104272 113210
17309 113210 85685 122226 131011 112855 107682 104832 100035 105357 96822 93869 78710 72971 67362
$$ packed form
17393B20523K8313j6947M703O1961P6570K7632O1764J06594O7566J3641J6559
17382F68879m9674q4155p8041p4381n7878k4813k4119k0192j0170J8112M5279
17371C08847J8021Q346M688l7693l0092l6123m4482L956O999j0141m0503k8071
17359A23752k0397j5473N626k790K9629L675l466J0448o535J339k1453J8987K0086
17346A43428p976M694J1649j2630m168K352J4447J5230K1919m984J0335K7963
17334B22259K7595L3758k18M42j6804p3193k6683k4638n253l375j1494Q636j342
17321A29690k0491k1728K2299O341l2580k2905n204Q715K1055J5341L739Q938
17309A13210k7525L6541Q785j8156n173k850m797N322q535k953j5159n739n609
$$ plain form
17296 67362 77080 89592 86582 83869 93189 130314 168007 179736 177947 184722 178207 178768 172779 134045
17282 134045 92498 84540 71366 89252 132389 140300 126033 119393 128346 144328 169156 149910
17270 149910 167185 158410 120131 94462 93185 84120 64983 37371 39123 52258 65463 120735
17258 120735 158429 128660 110537 111762 115064 112937 108560 103000 114401 125624 105368 116468
17246 116468 120640 115582 135062 155504 157582 131879 94154 67908 60594 62820 106346 116225 102413
17233 102413 92502 87237 107276 138758 168252 160294 156431 149620 136162 94481 61102 62407 49634
17220 49634 38634 59891 89825 64888 31379 28412 40535 29605 31752 36193 70302 116402
17208 116402 128743 106002 72489 59426 63416 69821 48073 30463 44579 90246 102150 81866
$$ packed form
17296F7362R718J2512l010k713R320L7125L7693J1729j789O775o515N61n989l8734
17282A34045m1547p958j3174J7886M3137P911j4267o640Q953J5982K4828j9246
17270A49910J7275q775l8279k5669j277r065j9137k7612J752J3135J3205N5272
17258A20735L7694k9769j8123J225L302k127m377n560J1401J1223k0256J1100
17246A16468M172n058J9480K0442K078k5703l7725k6246p314K226M3526R879j3812
17233A02413r911n265K0039L1482K9494p958l863o811j3458m1681l3379J305j2773
17220D9634j1000K1257K9934k4937l3509k967J2123j0930K147M441L4109M6100
17208A16402J2341k2741l3513j3063L990O405k1748j7610J4116M5667J1904k0284
$$ plain form
17196 81866 83390 107436 94669 76366 79902 88055 83758 97610 83684 78732 102190 141146 178156
17183 178156 216109 242825 286335 319670 291485 268089 262955 222091 200124 161840 129600 94119
17171 94119 94538 113203 119430 111092 108954 104936 101555 95581 86702 81189 64315 78523 115004 110041
17157 110041 131743 154603 218791 265972 308315 341588 390892 428331 408037 373059 328132
17146 328132 287659 248488 218904 199479 164126 151026 141471 120501 113581 120771 142298 135918
17134 135918 130934 129634 119597 106324 118402 140640 167754 181227 192453 229741 330829 412368
17122 412368 483365 572984 586101 526933 462165 388186 315650 261310 222603 176481 150583
17111 150583 170199 200276 219295 218735 238924 254952 266124 290697 289305 238336 187914 142084
$$ packed form
17196H1866J524K4046j2767j8303L536Q153m297J3852j3926m952K3458L8956L7010
17183A78156L7953K6716M3510L3335k8185k3396n134m0864k1967l8284l2240l5481
17171I4119M19J8665O227q338k138m018l381n974q879n513j6874J4208L6481m963
17157A10041K1702K2860O4188M7181M2343L3273M9304L7439k0294l4978m4927
17146C28132m0473l9171k9584j9425l5353j3100r555k0970o920P190K1527o380
17134A35918m984j300j0037j3273J2078K2238K7114J3473J1226L7288J01088Q1539
17122D12368P0997Q9619J3117n9168o4768p3979p2536n4340l8707m6122k5898
17111A50583J9616L0077J9019n60K0189J6028J1172K4573j392n0969n0422m5830
$$ plain form
17099 142084 107409 84421 83522 94894 90173 117080 154232 162999 149759 154420 141166 130395
17087 130395 157945 220884 303730 396560 490349 546478 573056 559625 568743 629838 706924 730150
17075 730150 697703 574896 405665 295024 204083 195201 192382 169857 175078 181144 190293 225972
17063 225972 282187 337489 339861 300547 251607 231949 192246 175245 134390 114647 106667 99321
17051 99321 74009 47600 62185 67820 63635 88669 111292 95516 95828 105420 90363 81465 86012
17038 86012 118748 164315 206552 284193 377204 462740 468448 432705 379650 363273 399769 426955
17026 426955 438305 383017 312258 236908 183212 155547 125356 96309 104251 112133 115621 110568
17014 110568 76320 49687 30560 27321 32483 53056 81194 55728 34444 22611 16730 8377
$$ packed form
17099A42084l4675k2988q99J1372m721K6907L7152Q767j3240M661j3254j0771
17087A30395K7550O2939Q2846R2830R3789N6129K6578j3431R118O1095P7086K3226
17075G30150l2447j22807j69231j10641r0941q882k819k2525N221O066R149L5679
17063B25972N6215N5302K372l9314m8940j9658l9703j7001m0855j9743p980p346
17051I9321k5312k6409J4585N635m185K5034K2623j5776L12R592j5057q898M547
17038H6012L2736M5567M2237P7641R3011Q5536N708l5743n3055j6377L6496K7186
17026D26955J1350n5288p0759p5350n3696k7665l0191k9047P942P882L488n053
17014A10568l4248k6633j9127l239N162K0573K8138k5466k1284j1833n881q353
$$ plain form
17002 8377 11968 45693 48305 63467 62705 46227 37106 36832 43418 59041 67117 72963 56592 32939
16988 32939 44519 61356 76102 79710 89116 108674 130177 131946 149020 177558 184761 197522
16976 197522 219255 249398 302130 318372 322649 330891 357028 379288 394420 410943 402426 403646
16964 403646 400873 380147 322414 280985 243955 209451 157735 110213 79993 82582 62677 56311
16952 56311 44370 16648 982 13247 21564 22338 20757 28536 53642 62237 62740 41040 27130
16939 27130 21936 53874 76564 61476 77642 65351 81084 96826 109647 92731 87199 98864
16927 98864 97147 103271 131352 122851 127033 181133 198585 203880 247734 296023 329267 340089 351477
16914 351477 381235 371782 356620 350549 308233 270736 254433 220172 216268 192041 157379 101532
$$ packed form
17002H377L591L3725K612J5162p62j6478r121k74O586J5623Q076N846j6371k3653
16988C2939J1580J6837J4746L608R406J9558K1503J769J7074K8538P203J2761
16976A97522K1733L0143N2732J6242M277Q242K6137K2260J5132J6523q517J220
16964D03646k773k0726n7733m1429l7030l4504n1716m7522l0220K589j9905o366
16952E6311j1941k7722j5666J2265Q317P74j581P779K5106Q595N03k1700j3910
16939B7130n194L1938K2690j5088J6166j2291J5733J5742J2821j6916n532J1665
16927I8864j717O124K8081q501M182N4100J7452N295M3854M8289L3244J0822J1388
16914C51477K9758r453j5162o071m2316l7497j6303l4261l904k4227l4662n5847
$$ plain form
16902 101532 81494 84124 83103 66963 32988 40176 45097 35699 21443 24103 32678 48749 38719
16889 38719 30327 33482 2775 5758 26627 35286 51525 40054 30861 22062 36347 26602 4132
16876 4132 -19635 -50110 -34207 -26236 2492 24436 34065 22992 35371 42616 42232 34111 7555
16863 7555 4753 2757 22861 38997 28615 14056 18154 21853 25171 16120 -14193 -25013 -16878
16850 -16878 -5002 -22914 -41404 -24156 14535 31012 33050 52272 31524 -13030 5478 32428
16838 32428 52421 76655 68512 62591 58935 55501 39360 37200 22245 12014 -4476 -21186 -39404
16825 -39404 -33726 -11445 11902 19329 13053 10132 17487 54 4289 18309 6242 935 -7464
16812 -7464 15095 22569 7220 17098 21395 25719 10660 40254 53675 38840 21354 13660 18916
$$ packed form
16902A01532k0038K630j021j6140l3975P188M921r398j4256K660Q575J6071j0030
16889C8719q392L155l0707K983K0869Q659J6239j1471r193q799J4285r745k2470
16876D132k3767l0475J5903P971K8728K1944R629j1073J2379P245l84q121k6556
16863G555k802j996K0104J6136j0382j4559M098L699L318r051l0313j0820Q135
16850a6878J1876j7912j8490J7248L8691J6477K038J9222k0748m4554J8508K6950
16838C2428J9993K4234q143n921l656l434j6141k160j4955j0231j6490j6710j8218
16825c9404N678K2281K3347P427o276k921P355j7433M235J4020j2067n307q399
16812g464K2559P474j5349R878M297M324j5059K9594J3421j4835j7486p694N256
$$ plain form
16799 18916 -11739 -18518 -24706 -10925 -695 2021 -12600 -962 -14784 -29224 -9647 28252
16787 28252 41980 37616 38747 31793 14755 10101 20065 19941 10577 32838 42537 21339 -17503
16774 -17503 -6437 23858 55853 35877 -3663 -23092 -60115 -58083 -23068 -24904 -17545 639
16762 639 -2969 3260 16900 7725 -7417 3064 -13541 -29881 -8691 19902 10642 15004 29408
16749 29408 27997 9827 3483 24044 25133 12639 -17153 -7339 36942 37428 27271 26524 12474
16736 12474 -8927 -2486 -24367 -37226 780 35771 6995 -8511 -17318 -2642 9481 -1272
16724 -1272 -20987 3668 -21864 -39567 -35282 -40479 -21597 14379 28467 50749 22364 28359
16712 28359 40011 15087 11535 3197 -4171 -20755 -19464 10519 11373 14716 33374 12283 15797
$$ packed form
16799A8916l0655o779o188J3781J0230K716j4621J1638j3822j4440J9577L7899
16787B8252J3728m364J131o954j7038m654R964j24r364K2261R699k1198l8842
16774a7503J1066L0295L1995j9976l9540j9429l7023K032L5015j836P359J8184
16762F39l608O229J3640r175j5142J0481j6605j6340K1190K8593r260M362J4404
16749B9408j411j8170o344K0561J089j2494k9792R814M4281M86j0157p47j4050
16736A2474k1401O441k1881j2859L8006L4991k8776j5506q807J4676J2123j0753
16724a272j9715K4655k5532j7703M285n197J8882L5976J4088K2282k8385N995
16712B8359J1652k4924l552q338p368j6584J291K9983Q54L343J8658k1091L514
$$ plain form
16699 15797 7905 1407 43183 43314 34167 19649 39845 41047 45848 57114 78649 66275 79450
16686 79450 68183 49863 30571 36397 35188 31549 11717 -18455 -3355 30889 55733 67800
16674 67800 53486 52311 39464 19006 5821 -5124 21447 30603 24649 15619 27080 5707
16662 5707 8544 11429 52696 74189 63481 14683 6478 -7285 -26042 -24312 -33174 -39250 -5208
16649 -5208 15577 2920 -12242 -12562 -2705 879 -13201 -17876 -6906 10004 13843 -3070 -2294
16636 -2294 1535 -3428 -2054 7294 -19560 -44830 -46490 -37759 -3405 12661 15175 27994 37309
16623 37309 24064 9173 -9295 -18056 -9317 16646 32327 31649 45562 28105 -7123 -27761
16611 -27761 -40306 -44277 -46720 -47265 -26559 -21964 -25590 -20856 17080 29812 31675 17009 22616
$$ packed form
16699A5797p892o498M1776J31r147j4518K0196J202M801J1266K1535j2374J3175
16686G9450j1267j8320j9292N826j209l639j9832l0172J5100L4244K4844J2067
16674F7800j4314j175j2847k0458j3185j0945K6571R156n954r030J1461k1373
16662E707K837K885M1267K1493j0708m8798q205j3763j8757J730q862o076L4042
16649e208K0785j2657j5162l20R857L584j4080m675J0970J6910L839j6913P76
16636b294L829m963J374R348k6854k5270j660Q731L4354J6066K514J2819R315
16623C7309j3245j4891j8468q761Q739K5963J5681o78J3913j7457l5228k0638
16611b7761j2545l971k443n45K0706M595l626M734L7936J2732J863j4666N607
$$ plain form
16598 22616 20967 -4725 -7698 -22265 -21732 12124 30124 43130 66506 69091 38904 29684 2773
16585 2773 -23927 -36433 -61019 -37471 -29264 -8984 2511 17971 27394 54987 55492 23995 24209
16572 24209 18873 18335 2511 -3981 17948 40211 8117 -12397 3149 15021 18642 38184 31877
16559 31877 31509 -3051 -12164 -1105 -9138 -12152 -19851 -15724 1037 34155 22230 12206 -5612
16546 -5612 -7097 -31560 -42873 -30050 11509 61706 63742 46545 32306 26122 13787 3845 29234
16533 29234 60815 66294 14169 4835 22863 52516 62115 46075 30477 19296 12570 18433 40925
16520 40925 52716 23351 16914 38264 27411 10408 6192 12371 18671 25320 35411 13777 10153
16507 10153 -1351 -23726 -19073 -12765 -720 17974 26955 23334 26783 37702 31636 38430 28389
$$ packed form
16598B2616j649k5692k973j4567N33L3856J8000J3006K3376K585l0187r220k6911
16585B773k6700j2506k4586K3548Q207K0280J1495J5460R423K7593N05l1497K14
16572B4209n336n38j5824o492K1929K2263l2094k0514J5546J1872L621J9542o307
16559C1877l68l4560r113J1059q033l014p699M127J6761L3118j1925j0024j7818
16546e612j485k4463j1313J2823M1559N0197K036j7197j4239o184j2335r942K5389
16533B9234L1581N479n2125r334J8028K9653R599j6040j5598j1181o726N863K2492
16520D0925J1791k9365o437K1350j0853j7003m216O179O300O649J0091k1634l624
16507A0153j1504k2375M653O308J2045J8694Q981l621L449J0919o066O794j0041
$$ plain form
16494 28389 28408 11259 20404 2203 -13155 -31698 -18789 -9292 -3563 -1066 -864 -9628 -2634 5689
16480 5689 25793 13017 -2423 11085 29001 23786 32740 34553 22035 4336 -1001 286 -20452
16467 -20452 -20675 -11322 -972 -2384 7284 13808 33403 31354 17550 36369 49072 42191 20939
16454 20939 1346 20168 27772 38542 14681 -10547 24787 51166 49790 43371 29887 25874
16442 25874 40016 46282 61793 54822 32750 40135 42723 32039 40011 35783 40641 45795 36131
16429 36131 24590 18145 13538 7521 -10217 6149 23693 -13479 -50690 -53216 -50279 -48968 -20515
16416 -20515 -5475 -17396 -20389 -29085 -35446 -54158 -67170 -43519 -39990 -29148 21035 39152
16404 39152 39430 43662 22599 -8796 -573 10832 1364 -4088 -31123 -6534 26911 51363 50131
$$ packed form
16494B8389J9j7149R145j8201j5358j8543J2909R497N729K497K02q764O994Q323
16480E689K0104j2776j5440J3508J7916n215Q954J813j2518j7699n337J287k0738
16467b0452k23R353J0350j412R668O524J9595k049j3804J8819J2703o881k1252
16454B0939j9593J8822P604J0770k3861k5228L5334K6379j376o419j3484m013
16442B5874J4142O266J5511o971k2072P385K588j0684P972m228M858N154r664
16429C6131j1541o445m607o017j7738J6366J7544l7172l7211k526K937J311K8453
16416b0515J5040j1921k993q696o361j8712j3012K3651L529J0842N0183J8117
16404C9152K78M232k1063l1395Q223J1405r468n452k7035K4589L3445K4452j232
$$ plain form
16391 50131 73292 63933 54625 49769 53299 55157 9976 -644 798 21704 12858 24268 28142
16378 28142 18266 10106 10938 16014 4661 -6102 -10438 -17644 -30540 -33637 -21323 -766 18086
16365 18086 28266 15298 25 5015 35309 26237 -4381 -10835 6106 12169 -1632 -13276
16353 -13276 -15878 3943 22911 2609 -18050 -20513 -15267 -12274 -2603 -28969 -41795 -29275 -63416
16340 -63416 -66469 -65652 -58017 -53056 -62016 -30932 100 6322 3533 4289 8193 7529 -6161 -10831
16326 -10831 -15017 -31289 -14993 -4374 -10023 4302 3293 -15001 -15161 42125 34865 24615 19907
16313 19907 9524 -17922 13974 56382 46301 29652 44662 39106 17796 -26456 -35383 -11351
16301 -11351 -9945 -22914 -5342 17817 9141 23629 25334 12474 10616 28624 38882 8244
$$ packed form
16391E0131K3161r359r308m856L530J858m5181j0620J442K0906q846J1410L874
16378B8142r876q160Q32N076j1353j0763m336p206j2896l097J2314K0557J8852
16365A8086J0180j2968j5273M990L0294r072l0618o454J6941O063j3801j1644
16353a3276k602J9821J8968k0302k0659k463N246K993R671k6366j2826J2520l4141
16340f3416l053Q17P635M961q960L1084L1032O222k789P56L904o64j3690m670
16326a0831m186j6272J6296J0619n649J4325j009j8294j60N7286p260j0250m708
16313A9907j0383k7446L1896M2408j0081j6649J5010n556k1310m4252q927K4032
16301a1351J406j2969J7572K3159q676J4488J705j2860j858J8008J0258l0638
$$ plain form
16289 8244 6094 35768 31051 7419 5003 23232 32513 54631 41109 15512 1618 -34259 -35446
16276 -35446 -34439 -16395 27661 51161 40381 34430 48037 64514 41987 47242 32522 -10994
16264 -10994 -12499 21166 19171 42679 58095 72022 62084 27200 24890 24210 16590 22283 10437
16251 10437 9795 15235 12841 30967 26208 21257 2857 -14203 -32794 -7466 -10258 -39378 -35823
16238 -35823 -24215 -18482 13059 -8536 -6891 24376 61238 69770 50073 21559 13515 31676
16226 31676 31673 60994 75489 84024 93315 64470 39532 33004 47582 76919 99596 77805 47313
16213 47313 19674 23032 40064 24251 20320 16704 40999 42541 35739 38861 28437 27921 35386
16200 35386 29000 28720 4453 -22525 -7116 22151 50709 50599 37148 35981 31253 6071 -564
$$ packed form
16289H244k150K9674m717k3632k416J8229R281K2118j3522k5597j3894l5877j187
16276c5446J007J8044M4056K3500j0780n951J3607J6477k2527N255j4720m3516
16264a0994j505L3665j995K3508J5416J3927r938l4884k310o80p620N693j1846
16251A0437o42N440k394J8126m759m951j8400j7060j8591K5328k792k9120L555
16238c5823J1608N733L1541k1595J645L1267L6862Q532j9697k8514q044J8161
16226C1676lK9321J4495Q535R291k8845k4938o528J4578K9337K2677k1791l0492
16213D7313k7639L358J7032j5813l931l616K4295J542o802L122j0424n16P465
16200C5386o386k80k4267k6978J5409K9267K8558j10j3451j167m728k5182o635
$$ plain form
16187 -564 12649 26475 26302 35595 38816 18359 12810 21180 26641 13843 10116 14164 1314 -8634
16173 -8634 12320 27550 7609 -12496 -37145 -23024 1194 20145 16504 28196 64945 56680
16161 56680 17036 11766 986 19374 2711 -5875 4535 19943 16534 -2481 20695 14402
16149 14402 31847 71731 55221 21733 20517 28236 43557 46493 39071 27247 21088 33311 47828
16136 47828 39325 43631 56339 55304 48249 43508 41628 28495 41942 62964 51130 36951 13807
16123 13807 5899 6579 11081 13607 21309 27026 35123 48696 15439 32278 68739 67830 65178 39495
16109 39495 39679 45558 26003 14960 26132 38113 -15196 -31845 -24247 -4716 27614 21659 4904
16096 4904 -8454 -18488 -16470 -20790 -28546 -16579 24574 31300 20594 13821 12049 7587 -13372
$$ packed form
16187e64J3213J3826j73R293L221k0457n549Q370N461j2798l727M048j2850r948
16173h634K0954J5230j9941k0105k4649J4121K4218J8951l641J1692L6749q265
16161E6680l9644n270j0780J8388j6663q586J0410J5408l409j9015K3176o293
16149A4402J7445L9884j6510l3488j216P719J5321K936p422j1824o159J2223J4517
16136D7828q503M306J2708j035p055m741j880j3133J3447K1022j1834j4179k3144
16123A3807p908O80M502K526P702N717Q097J3573l3257J6839L6461r09k652k5683
16109C9495J84N879j9555j1043J1172J1981n3309j6649P598J9531L2330n955j6755
16096D904j3358j0034K018m320p756J1967M1153O726j0706o773j772m462k0959
$$ plain form
16083 -13372 -6882 3029 45413 38743 14413 881 2824 -3939 18411 10606 16502 -10636 -20425
16070 -20425 -26798 -23584 -18655 -3866 -1683 -2301 11786 31749 7292 9493 10161 11415 -23386 -43190
16056 -43190 -8997 40444 22390 -27848 -22684 -16161 -19009 -24745 -51653 -62170 -40109 -20038
16044 -20038 -19189 2993 2455 2876 3633 -5046 -20471 -40943 -43749 -47168 -24958 -24971 -15153 -14792 -291
16029 -291 15598 2245 -12440 -6583 13547 11003 24787 30197 39056 53468 41555 9930 24272
16016 24272 32965 20454 27240 8805 7954 21235 25143 19804 28052 16245 2519 12221 16900
16003 16900 37313 34663 11167 15465 34863 20197 -4169 -21973 -29474 -74013 -83136 -55251
15991 -55251 -34180 -34986 -17947 -36677 -73256 -78307 -29192 102 6672 7799 -8817 -12804 -843
$$ packed form
16083a3372O490R911M2384o670k4330j3532J943o763K2350p805N896k7138r789
16070b0425o373L214M929J4789K183o18J4087J9963k4457K201O68J254l4801j9804
16056d3190L4193M9441j8054n0238N164O523k848n736k6908j0517K2061K0071
16044b0038Q49K2182n38M21P57q679j5425k0472k806l419K2210j3R818L61J4501
16029b91J5889j3353j4685N857K0130k544J3784N410Q859J4412j1913l1625J4342
16016B4272Q693j2511O786j8435q51J3281L908n339Q248j1807j3726R702M679
16003A6900K0413k650k3496M298J9398j4666k4366j7804p501m4539r123K7885
15991e5251K1071q06J7039j8730l6579n051M9115K9294O570J127j6616l987J1961
$$ plain form
15978 -843 34524 29061 -810 -10821 4518 7918 -3171 -9936 -19046 -21770 -9926 -1906 -16490
15965 -16490 -26406 -40767 -29505 -31381 -37517 -49907 -50855 -23250 -24162 -2167 -280 -30290 -15205
15952 -15205 -354 -23193 -31997 -48619 -44336 -36576 -31707 -14606 12792 22510 25106 40810 27305
15939 27305 40943 38452 24285 8995 11885 5687 -404 -9018 -23419 -31635 -27791 -13984 -39606
15926 -39606 -35575 -39671 -27681 -5401 5418 30582 19343 -3935 -12798 -35134 -28965 -29383 -31274
15913 -31274 -20616 8404 38526 16967 -7375 -543 24658 47228 22025 -8274 5344 15428
15901 15428 23373 33723 40194 30059 44853 49408 49898 51921 69458 61189 35590 7007 -10104
15888 -10104 -12473 -9784 -4246 15233 8775 22008 5643 5955 4297 5001 -12406 -15060 3723 -6547
$$ packed form
15978h43L5367n463k9871j0011J5339L400j1089o765r110k724J1844Q020j4584
15965a6490r916j4361J1262j876o136j2390r48K7605r12K1995J887l0010J5085
15952a5205J4851k2839q804j6622M283P760M869J7101K7398R718K596J5704j3505
15939B7305J3638k491j4167j5290K890o198o091q614j4401q216L844J3807k5622
15926c9606M031m096J1990K2280J0819K5164j1239k3278q863k2336O169m18j891
15913c1274J0658K9020L0122k1559k4342O832K5201K2570k5203l0299J3618J0084
15901A5428P945J0350O471j0135J4794M555M90K023J7537q269k5599k8583j7111
15888a0104k369K689N538J9479o458J3233j6365L12j658P04j7407k654J8783j0270
$$ plain form
15874 -6547 -35450 -24338 -20930 -18531 4046 5131 13938 8399 29811 36169 -4018 -13854 6352
15861 6352 7663 7318 19039 4461 -10393 -12951 -28649 -25055 -12938 -2611 -21066 -27723 -16583
15848 -16583 -22238 -5332 7583 -313 3109 2300 -26560 -64645 -73222 -81133 -63673 -45877 -37208
15835 -37208 -48539 -64928 -57369 -41197 -52134 -53833 -22836 18059 25787 20020 39169 54410
15823 54410 60160 51634 51521 38586 19921 19083 1639 2366 12237 -11767 -41765 -55551 -68027
15810 -68027 -77825 -84250 -47391 -18397 -4376 2181 -9588 11419 -32908 -50723 -44715 -9532
15798 -9532 4807 3104 12532 3785 14355 34345 33555 29016 42305 29332 23449 14910 22423 -395
15784 -395 2550 4302 -11960 -39557 -46649 -21890 34202 28732 7050 -21592 -78678 -98391 -72769
$$ packed form
15874f547k8903J1112L408K399K2577J085Q807n539K1412O358m0187r836K0206
15861F352J311l45J1721j4578j4854k558j5698L594J2117J0327j8455o657J1140
15848a6583n655J6906J2915p896L422q09k8860l8085q577p911J7460J7796Q669
15835c7208j1331j6389P559J6172j0937j699L0997M0895P728n767J9149J5241
15823E4410N750q526j13j2935j8665q38j7444P27R871k4004k9998j3786j2476
15810f8027r798o425L6859K8994J4021O557j1769K1007m4327j7815O008L5183
15798i532J4339j703R428q747J0570J9990p90m539J3289j2973n883q539P513k2818
15784c95K945J752j6262k7597p092K4759N6092n470k1682k8642n7086j9713K5622
$$ plain form
15771 -72769 -31492 -4601 20282 17052 11378 18268 12511 42026 38924 31810 29483 29483 18615 -1220
15757 -1220 -15830 -35759 -16118 -13062 -14525 -4532 21485 -1836 -31378 -28295 -10794 -15961 -17304
15744 -17304 15826 6885 -732 -32597 -47858 -38706 -27462 -10063 17430 15731 -1126 -2519 2736
15731 2736 -2994 7032 16467 -91 2205 8664 1214 -5531 -6020 -23396 -55179 -70487 -52719
15718 -52719 -17045 -19051 -11314 7086 9346 3831 24226 10471 -8203 -23952 -5511 7718
15706 7718 29900 16809 5010 -5752 -7441 -7490 -22590 -8843 -13780 -8454 540 -11966 -26308
15693 -26308 -37112 -24236 -38909 -63938 -23787 -100 -25165 -25067 -17888 -26126 -20046 -36690 -28119
15680 -28119 -10132 9137 6765 6400 6661 -6921 5519 -3704 7970 29582 44848 36131 -16303
$$ packed form
15771g2769M1277K6891K4883l230n674O890n757K9515l102p114k327%j0868j9835
15757a220j4610j9929J9641L056j463R993K6017k3321k9542L083J7501n167j343
15744a7304L3130q941p617l1865j5261R152J1244J7399K7493j699j6857j393N255
15731B736n730J0026R435j6558K296O459p450o745m89j7376l1783j5308J7768
15718e2719L5674k006P737J8400K260n515K0395j3755j8674j5749J8441J3229
15706G718K2182j3091j1799j0762j689m9j5100J3747m937N326Q994j2506j4342
15693b6308j0804J2876j4673k5029M0151K3687k5065R8P179q238O080j6644Q571
15680b8119J7987J9269k372l65K61j3582J2440r223J1674K1612J5266q717n2434
$$ plain form
15667 -16303 3670 15727 2243 -14180 -35048 -28251 -26615 -35522 -29367 -19765 -31732 -29202 -15319
15654 -15319 -3078 5465 -7137 -16881 4798 -13070 -5232 2072 -8008 -12508 -36762 -48918 -20317
15641 -20317 -28133 -54210 -80141 -47511 3926 32044 17094 6226 -7475 -40410 -51480 -29374
15629 -29374 -30339 -8622 33661 9451 -21885 -40167 -28029 -20320 -22398 -19839 5129 18305 13679
15616 13679 -1899 1513 -4909 -8299 -41087 -37900 -7674 6373 4425 2816 -12322 -18199 -8729
15603 -8729 -13669 -24328 -13787 -18973 8305 21087 208 -2148 1988 -12782 -12459 16720 29503
15590 29503 20149 12555 7723 47818 33689 8509 -2197 -2250 -6350 -3184 -10397 6477 39373
15577 39373 33426 -8120 -7098 4548 1639 -13249 -29120 -30711 7030 17707 955 9999 3158
$$ packed form
15667a6303J9973J2057j3484j6423k0868O797J636q907O155R602j1967K530J3883
15654a5319J2241Q543j2602r744K1679j7868P838P304j0080m500k4254j2156K8601
15641b0317p816k6077k5931L2630N1437K8118j4950j0868j3701l2935j1070K2106
15629b9374r65K1717M2283k4210l1336j8282J2138P709k078K559K4968J3176m626
15616A3679j5578L412o422l390l2788L187L0226J4047j948j609j5138n877R470
15603h729m940j0659J0541n186K7278J2782k0879k356M136j4770L23K9179J2783
15590B9503r354p594m832M0095j4129k5180j0706n3m100L166p213J6874L2896
15577C9373n947m1546J022J1646k909j4888j5871j591L7741J0677j6752R044o841
$$ plain form
15564 3158 -8363 -30779 -29744 -30088 -26128 -29341 -33281 -34685 -36606 -35747 -24114 -15234 774 9384
15550 9384 452 -20326 -33105 -17998 8543 17182 22204 901 17079 38267 3697 -31608
15538 -31608 -32040 -24507 -31636 -28327 17692 20023 25164 13816 -6595 -41072 -45872 -37113 -66726
15525 -66726 -68244 -64347 -44001 -29072 -25494 -9259 5575 30221 42370 32944 -1381 -10271 -4511
15512 -4511 9982 18057 9446 -14117 -29408 -11167 7451 -10813 -30570 -40471 -38777 -24154 -25875
15499 -25875 -7398 8929 -18568 -35082 -29404 2042 14053 16488 73 -13150 -31327 -47129
15487 -47129 -22854 3935 3542 653 5183 19965 20724 1980 -3092 6229 28112 36999 46430 47962
15473 47962 17877 1299 -10604 -14301 -22867 -30043 -57857 -54356 -23591 -6903 -39162 -46354 -24936
$$ packed form
15564C158j1521k2416J035l44L960l213l940j404j921Q59J1633Q880J6008Q610
15550I384q932k0778j2779J5107K6541Q639N022k1303J6178K1188l4570l5305
15538c1608m32P533p129L309M6019K331N141j1348k0411l4477m800Q759k9613
15525f6726j518L897K0346J4929L578J6235J4834K4646J2149r426l4325q890N760
15512d511J4493Q075q611k3563j5291J8241J8618j8264j9757r901J694J4623j721
15499b5875J8477J6327k7497j6514N678L1446J2011K435j6415j3223j8177j5802
15487d7129K4275K6789l93k889M530J4782P59j8744n072R321K1883Q887R431J532
15473D7962l0085j6578j1903l697q566p176k7814L501L0765J6688l2259p192K1418
$$ plain form
15460 -24936 -14562 -34964 -39382 -33147 -26439 -10881 14257 22495 48539 22685 -14641 -43931
15448 -43931 -37741 -49916 -50513 -21434 -5111 -27990 -9806 -2684 -6772 -16394 -33434 -39782 -5821
15435 -5821 8815 4524 -22888 -24851 -16622 4698 15802 -17476 -18257 -7283 -29474 -47477 -33558
15422 -33558 -33600 -52203 -35768 -34979 -26334 -19511 -26175 -3383 -4877 -9795 -5603 -7597 -5530 -7787
15408 -7787 -25824 -28491 -2053 -7209 -957 2022 -21338 -14878 -16973 -33214 -53499 -34914 -29405
15395 -29405 -47709 -22881 6188 9476 -16217 -39600 -30622 -23452 -29252 -20572 -17536 138 26410
15382 26410 -1105 -19570 -28909 -22960 -4491 12041 37238 33888 -5267 4545 4496 -12768 -19247
15369 -19247 -22838 -42394 -36099 -18506 -12230 -40644 -33105 -37263 -43866 -24085 9640 -8157 -43082
$$ packed form
15460b4936J0374k0402m418O235O708J5558K5138Q238K6044k5854l7326k9290
15448d3931O190j2175n97K9079J6323k2879J8184P122m088r622j7040o348L3961
15435e821J4636m291k7412j963Q229K1320J1104l3278p81J0974k2191j8003J3919
15422c3558m2j8603J6435P89Q645O823o664K2792j494m918M192j994K067k257
15408g787j8037k667K6438n156O252K979k3360O460k095j6241k0285J8585N509
15395b9405j8304K4828K9069L288k5693k3383Q978P170n800Q680L036J7674K6272
15382B6410k7515j8465r339N949J8469J6532K5197l350l9155R812m9j7264o479
15369a9247l591j9556O295J7593O276k8414P539m158o603J9781L3725j7797l4925
$$ plain form
15356 -43082 -34376 -20760 -46779 -42159 -19216 -9757 -13102 11296 52484 71831 53968 -4187
15344 -4187 -14314 16214 13600 41945 55236 36930 12587 -5380 10236 29387 16678 595
15332 595 -3363 3736 -6148 14100 3088 7043 23638 28578 29800 37273 17151 3527 -11289
15319 -11289 -25717 -31479 -18533 -9922 501 -3212 -17915 -29764 -30330 -16840 10796 3002 -9222
15306 -9222 -12758 -17662 -6783 -2263 9635 -6282 -5212 20589 10514 9966 16092 6574 -961 -19133
15292 -19133 -30103 -5032 -601 -14740 -43576 -37591 -43212 -38500 -31314 -16207 5696 -2057 -9248
15279 -9248 -4193 1957 -31966 -20296 -38277 -29291 -21785 -3680 20484 18001 21269 18203 15793
15266 15793 11513 1415 -18620 -32086 -26071 -14282 -8158 11852 42540 53088 29128 9365
$$ packed form
15356d3082Q706J3616k6019M620K2943R459l345K4398M1188J9347j7863n8155
15344d187j0127L0528k614K8345J3291j8306k4343j7967J5616J9151j2709j6083
15332E95l958P099r884K0248j1012L955J6595M940J222P473k0122j3624j4816
15319a1289j4428n762J2946Q611J0423l713j4703j1849n66J3490K7636p794j2224
15306i222l536m904J0879M520J1898j5917J070K5801j0075n48O126r518p535j8172
15292a9133j0970K5071M431j4139k8836N985n621M712P186J5107K1903p753p191
15279i248N055O150l3923J1670j7981Q986P506J8105K4164k483L268l066k410
15266A5793m280j0098k0035j3466O015J1789O124K0010L0688J0548k3960j9763
$$ plain form
15254 9365 6134 9942 21191 44112 34948 15584 4734 7458 9325 1870 -17802 -16053 -27801
15241 -27801 -51405 -39855 -40169 -35263 -50229 -63437 -23890 11950 17084 -1545 -19971 -11990 -11472
15228 -11472 -20715 -48024 -46633 -17274 7507 -11656 -34601 -41492 -62131 -36576 -37815 -40716 -38222
15215 -38222 -42306 -24144 -2354 1871 -20236 -20791 -18013 -28302 -3972 -22958 -36246 -32013 -199
15202 -199 9420 1998 -5873 -5869 6944 -206 2611 -8763 -2264 5166 21601 -1825 -21495 -13751
15188 -13751 -23840 -6690 20811 10219 -12548 -24912 -10941 -71 -26772 -33623 -3421 -17091
15176 -17091 -14409 -4632 -5306 439 -13781 -2964 3768 21688 44673 12349 32126 44186 48140
15163 48140 29361 -12751 -38893 -22652 3172 3933 -6603 -19060 6943 16090 -4249 -24990
$$ packed form
15254I365l231L808J1249K2921r164j9364j0850K724J867p455j9672J749j1748
15241b7801k3604J1550l14M906j4966j3208L9547L5840N134j8629j8426P981N18
15228a1472r243k7309J391K9359K4781j9163k2945o891k0639K5555j239k901K494
15215c8222m084J8162K1790M225k2107n55K778j0289K4330j8986j3288M233L1814
15202a99R619p422p871MJ2813p150K817j1374O499P430J6435k3426j9670P744
15188a3751j0089J7150K7501j0592k2767j2364J3971J0870k6701o851L0202j3670
15176a7091K682R777o74N745j4220J0817O732J7920K2985l2324J9777J2060L954
15163D8140j8779m2112k6142J6241K5824P61j0536j2457K6003R147k0339k0741
$$ plain form
15151 -24990 -53514 -40505 -44419 -42849 -20116 22823 -9642 -11296 9708 8711 -20934 -17692 12764
15138 12764 31014 23852 -19889 -47216 -55020 -58317 -39781 -32871 -26204 -20525 1444 22298 23914
15125 23914 28127 2379 -9864 -14773 -35956 -42998 -35317 11454 32479 18799 -3627 -17121
15113 -17121 -39432 -74544 -73925 -53483 -7573 34279 31207 16378 10383 12015 14227 19765 -11554
15100 -11554 -13421 -194 -19002 -30565 -25721 -30555 -37523 -12006 -20479 -9392 -11834 -46712 -36862
15087 -36862 -13715 1509 -7262 -33592 -32953 -20133 -22282 -19255 -18000 -55514 -27133 4195 -8759
15074 -8759 -3969 -20001 -23515 -39174 -58023 -67228 -62708 -54887 -40172 -39741 -40909 -54132 -46597 -48037
15060 -48037 -47537 -52175 -27982 -8827 -30134 -52310 -53131 -49792 -46818 -47958 -36661 -9051 -9583 -37716
$$ packed form
15151b4990k8524J3009l914J570K2733M2939l2465j654K1004r97k9645L242L0456
15138A2764J8250p162m3741k7327p804l297J8536O910O667N679K1969K0854J616
15125B3914M213k5748j2243m909k1183p042P681M6771K1025j3680k2426j3494
15113a7121k2311l5112O19K0442M5910M1852l072j4829n995J632K212N538l1319
15100a1554j867J3227j8808j1563M844m834o968K5517q473J1087k442l4878R850
15087c6862K3147J5224q771k6330O39J2820k149L027J255l7514K8381L1328j2954
15074h759M790j6032l514j5659j8849r205M520P821J4715M31j168j3223P535j440
15060d8037N00m638K4193J9155k1307k2176q21L339K974j140J1297K7610n32k8133
$$ plain form
15046 -37716 -35853 -25263 -34379 -8399 7777 15776 42029 32735 13737 3243 19646 13529 20165
15033 20165 25331 22547 7054 -30826 -44963 -61661 -49702 -31083 -1879 -13269 -56911 -87571
15021 -87571 -39319 -7305 -19319 -41440 -11019 -5166 -37810 -57601 -62132 -60488 -65875 -74749 -39340
15008 -39340 -48332 -57769 -63285 -52285 -71621 -85356 -49723 -49263 -33340 -16261 838 -4624 -49903
14995 -49903 -39866 -6812 17906 27065 33562 40086 48438 6262 -32363 -17383 28957 25982 11391
14982 11391 13820 4569 7504 -7251 -14799 6441 -3627 -40182 -3038 23320 40126 18823
14970 18823 -7209 -15026 -2760 -6065 -14794 17411 6315 -7139 -20123 -8295 21605 37754
14958 37754 44250 51475 39385 8110 -35695 -61055 -48385 -23671 -15473 -15024 -35410 -51359 -46104
$$ packed form
15046c7716J863J0590r116K5980J6176P999K6253r294j8998j0494J6403o117O636
15033B0165N166k784j5493l7880j4137j6698J1959J8619K9204j1390m3642l0660
15021h7571M8252L2014j2014k2121L0421N853l2644j9791m531J644n387q874L5409
15008c9340q992r437n516J1000j9336j3735L5633M60J5923J7079J7099n462m5279
14995d9903J0037L3054K4718R159O497O524Q352m2176l8625J4980M6340k975j4591
14982A1391K429r251K935j4755p548K1240j0068l6555L7144K6358J6806k1303
14970A8823k6032p817J2266l305q729L2205j1096j3454j2984J1828K9900J6149
14958C7754O496P225j2090l1275m3805k5360J2670K4714Q198M49k0386j5949N255
$$ plain form
14945 -46104 -42442 -31882 -12309 -11989 -21788 -24557 -16937 -16216 -28197 7274 45863 24134 -21611
14932 -21611 -40312 -45547 -57670 -52620 -17727 -19667 -15264 -6751 7263 17658 43741 24259 11462
14919 11462 4 -14076 -10866 20396 1462 -18466 -26091 4111 1268 -4264 -13073 -34670 -56479
14906 -56479 -58961 -11167 -3284 -13169 -15502 -4820 21811 -6026 -1376 6685 -19439 -28358 -45343
14893 -45343 -22873 -20062 -24275 -39378 -7221 11917 15142 6090 40013 37638 33017 34225 36187
14880 36187 8207 -11350 -30672 -42876 -16037 2474 17094 16990 11890 -14992 -29814 -29896 -14633
14867 -14633 -40093 -53626 -61186 -51183 -38993 -24270 -10716 -15009 7071 902 -19150 -18084
14855 -18084 -2000 4511 -20159 -33484 -40075 -32749 -46649 -61191 -35655 -22452 -1490 3622
$$ packed form
14945d6104L662J0560J9573L20r799k769P620P21j1981L5471L8589k1729m5745
14932b1611j8701n235j2123N050L4893j940M403Q513J4014J0395K6083j9482j2797
14919A1462j1458j4080L210L1262j8934j9928p625L0202k843n532q809k1597k1809
14906e6479k482M7794P883r885k333J0682K6631k7837M650Q061k6124q919j6985
14893d5343K2470K811m213j5103L2157J9138L225r052L3923k375m621J208J962
14880C6187k7980j9557j9322j2204K6839J8511J4620j04n100k6882j4822q2J5263
14867a4633k5460j3533p560J0003J2190J4723J3554m293K2080o169k0052J066
14855a8084J6084O511k4670j3325o591P326j3900j4542K5536J3203K0962N112
$$ plain form
14843 3622 9229 13073 23337 -17 -31104 -10479 -10229 -14652 -24288 -55081 -42835 -23309 -22251
14830 -22251 -928 1996 -12283 -12315 -6351 -24405 -21874 -17760 619 -660 -4456 -16028 -17047 23675
14816 23675 5924 -15059 4983 10296 -14389 -20350 -43028 -56977 -32518 4117 6718 11059
14804 11059 -13303 -16046 -15984 -9711 -1448 -12120 -57879 -64831 -47411 -42382 -25413 -3810 4735
14791 4735 -12224 -38095 -25863 -30349 -30570 -3699 17765 31613 17467 43150 34037 39952 4809
14778 4809 3667 24504 23589 17680 -9476 -34662 17260 65483 26969 -4706 -14439 3190 1104
14765 1104 -23757 -17269 -1902 9939 -17945 -16937 3318 -9279 -20467 -6642 -17698 -23533
14753 -23533 -17434 -7831 -16697 -22887 -8830 11323 7292 4721 -18214 -33131 -42520 -51125 -43671
$$ packed form
14843C622N607L844J0264k3354l1087K0625K50m423r636l0793J2246J9526J058
14830b2251K1323K924j4279l2N964j8054K531M114J8379j279l796j1572j019M0722
14816B3675j7751k0983K0042N313k4685n961k2678j3949K4459L6635K601M341
14804A1059k4362k743O2O273Q263j0672m5759o952J7420N029J6969K1603Q545
14791D735j6959k5871J2232m486k21K6871K1464J3848j4146K5683r113N915l5143
14778D809j142K0837r15n909k7156k5186N1922M8223l8514l1675r733J7629k086
14765A104k4861O488J5367J1841k7884J008K0255j2597j1188J3825j1056n835
14753b3533O099R603q866o190J4057K0153m031k571k2935j4917r389q605P454
$$ plain form
14740 -43671 -25023 1411 10551 4286 -5143 -7122 -27397 -26322 -3523 2583 15903 6826 -10540
14727 -10540 -17119 -1941 -12128 -17002 -16666 -17617 -12182 -21945 -13199 -29859 -47856 -40415 -34016 3909
14713 3909 -4659 -35034 -34460 -2711 31097 42282 32308 -20392 -39976 -33789 -4463 11510 28009
14700 28009 21433 25809 15924 -7760 -21490 -26076 5675 18815 -20847 -55983 -28118 -15619
14688 -15619 -24206 -39657 -43286 -25780 -23577 -7207 -3149 -9570 -22114 -31437 -52029 -73047 -57066
14675 -57066 -24769 -9693 -10572 -10262 17807 29175 977 -11037 -5584 -8629 -21938 7580 22222
14662 22222 -14449 -45057 -49927 -48674 -43918 -18142 -15133 -6768 25362 16260 3277 18078 8359
14649 8359 -3058 -21055 -35072 -37698 -42025 -42541 -26037 -23199 -37106 -22361 -7064 -22509 -37447
$$ packed form
14740d3671J8648K6434R140o265r429j979k0275J075K2799O106J3320r077j7366
14727a0540o579J5178j0187m874L36r51N435r763Q746j6660j7997P441O399L7925
14713C909q568l0375N74L1749L3808J1185r974n2700j9584O187K9326J5973J6499
14700B8009o576M376r885k3684j3730m586L1751J3140l9662l5136K7865J2499
14688a5619q587j5451l629J7506K203J6370M058o421j2544r323k0592k1018J5981
14675e7066L2297J5076q79L10K8069J1368k8198j2014N453l045j3309K9518J4642
14662B2222l6671l0608m870J253M756K5776L009Q365L2130r102j2983J4801r719
14649H359j1417j7997j4017k626m327n16J6504K838j3907J4745J5297j5445j4938
$$ plain form
14636 -37447 -26359 -28807 -29597 -7492 -11294 -20966 -48083 -32127 -40669 -34764 4029 4096 -6135 -3981
14622 -3981 -13804 -24565 -16050 -12487 -2948 -4258 -15482 2251 15061 -4933 5294 15315 15538
14609 15538 -1249 -8363 -35155 -49923 -14054 10957 22568 36918 58505 57810 35483 7209
14597 7209 7696 2282 18096 3074 -8173 -15729 -17239 -23073 -14365 -1932 -20105 -9393 18333
14584 18333 20016 3289 -6441 15050 3330 -10270 -2115 4281 8554 -2937 -22371 -21926 16695
14571 16695 48410 26113 5892 22160 20329 16804 16860 2268 -16767 -10255 -24175 -24485 -31822
14558 -31822 -44380 -34185 -5709 5970 12955 20868 21329 -33767 -34111 17543 17167 -14593 -30560
14545 -30560 -17455 -1833 -23459 -30467 -19714 -16824 -19885 2540 25199 35388 29788 -7116
$$ packed form
14636c7447J1088k448p90K2105l802r672k7117J5956q542N905L8793O7j0231K154
14622c981r823j0761Q515L563R539j310j1224J7733J2810j9994J0227J0021K23
14609A5538j6787p114k6792j4768L5869K5011J1611J4350K1587o95k2327k8274
14597G209M87n414J5814j5022j1247p556j510n834Q708J2433j8173J0712K7726
14584A8333J683j6727r730K1491j1720j3600Q155O396M273j1491j9434M45L8621
14571A6695L1715k2297k0221J6268j831l525N6j4592j9035O512j3920l10p337
14558c1822j2558J0195K8476J1679O985P913M61n5096l44N1654l76l1760j5967
14545c0560J3105J5622k1626p008J0753K890l061K2425K2659J0189n600l6904
$$ plain form
14533 -7116 4010 2661 703 14427 32268 12553 2432 -6055 -9037 3535 1150 17025 6715
14520 6715 -1329 3055 6415 21217 45135 46362 47120 46860 13809 10187 15863 9354 -2169 -1193
14506 -1193 -12616 -32548 -50290 -27352 -10822 -8629 -8242 -13703 -17929 -9335 -16536 -20948 -29082 -49628
14492 -49628 -30642 -22904 -35844 -23859 7929 20758 -762 -19985 1774 19097 -3063 -23448
14480 -23448 -4407 8003 8294 35195 23686 5107 16789 19680 2390 -2477 6697 -15045 -29887
14467 -29887 -41890 -34308 -26032 -25000 -28106 -17583 -9344 -8251 297 8911 13638 -649 8841 -5035
14453 -5035 -3179 -9798 -4148 2361 961 595 -3083 -3315 21399 -3784 -34040 -31736 -15137 -26970
14439 -26970 -29035 -59283 -66629 -56939 -63478 -63666 -35545 -40082 -79119 -87989 -69134 -36342 -486
$$ packed form
14533g116J1126j349j958J3724J7841j9715j0121q487k982J2572k385J5875j0310
14520F715q044M384L360J4802K3918J227P58k60l3051l622N676o509j1523R76
14506a193j1423j9932j7742K2938J6530K193L87n461m226Q594p201m412q134k0546
14492d9628J8986P738j2940J1985L1788J2829k1520j9223K1759J7323k2160k0385
14480b3448J9041J2410K91K6901j1509j8579J1682K891j7290m867R174k1742j4842
14467b9887j2003P582Q276J032l106J0523Q239J093Q548Q614M727j4287R490j3876
14453e035J856o619N650O509j400l66l678k32K4714k5183l0256K304J6599j1833
14439b6970k065l0248p346R690o539j88K8121m537l9037q870J8855L2792L5856
$$ plain form
14426 -486 -20134 -19433 -720 -37146 -34267 -45782 -7923 4242 -239 -13008 -12096 16125 28194
14413 28194 12606 -33480 -56003 -56490 -38857 2670 15175 4227 -10299 10408 33056 27720
14401 27720 20138 15757 37761 50954 25137 13551 -9875 -40307 -32778 -15036 -10776 10713
14389 10713 20709 11004 -9235 -39534 -36569 -19288 -21997 -39083 -25834 -27604 -25639 -27542 -21610
14376 -21610 -10870 -20383 -30977 -35512 -15385 -16218 -22566 -30960 -50098 -69620 -36017 1940 21498
14363 21498 2276 5273 -1307 17200 -8376 -23921 6472 31503 45911 32624 1851 -15109
14351 -15109 -4518 5684 10044 8535 5038 -10685 -28316 -42761 -56988 -52422 -37565 -37592 -28187
14338 -28187 -45475 -45951 -35074 -42642 -38204 -33845 -21095 -23118 -28434 -9980 -16089 -17813 -10421 -27014
$$ packed form
14426d86j9648P01J8713l6426K879j1515L7859J2165m481j2769R12K8221J2069
14413B8194j5588m6086k2523m87J7633M1527J2505j0948j4526K0707K2648n336
14401B7720p582m381K2004J3193k5817j1586k3426l0432P529J7742M260K1489
14389A0713R996r705k0239l0299K965J7281k709j7086J3249j770J965j903N932
14376b1610J0740r513j0594m535K0127q33o348q394j9138j9522L3603L7957J9558
14363B1498j9222K997o580J8507k5576j5545L0393K5031J4408j3287l0773j6960
14351a5109J0591J0202M360j509l497j5723j7631j4445j4227M566J4857k7R405
14338b8187j7288m76J0877p568M438M359J2750k023n316J8454o109j724P392j6593
$$ plain form
14324 -27014 -40313 -53485 -96698 -93293 -38140 -19847 -17016 -12744 14676 21395 2299 6043 19194
14311 19194 27861 17389 17841 27891 37244 26469 -8817 -44095 -46143 -16351 7084 11939 -10011
14298 -10011 -9712 -12298 -9253 17193 23785 -12893 -42717 -44097 -48523 -40897 -50460 -57009 -30636 -25067
14284 -25067 -20609 -3581 -24314 -23483 -36492 -62169 -45790 -41143 -36582 -39126 -27902 -32080 -43265
14271 -43265 -27526 -25565 -12730 -34840 -31948 -13704 10717 18148 27512 7986 2290 17200 13344
14258 13344 -1545 -17072 -30254 -25064 -18496 -13517 13741 -582 -32888 -39252 -47119 -32839 -22366
14245 -22366 1906 -4323 -6049 -6237 -23680 -37313 -23072 -7326 7867 -2839 -13196 -8578 5342
14232 5342 16708 32230 25279 14851 -561 -6662 13659 19420 37390 33447 33412 40903 18028
$$ packed form
14324b7014j3299j3172m3213L405N5153J8293K831M272K7420O719j9096L744J3151
14311A9194Q667j0472M52J0050R353j0775l5286l5278k048K9792K3435M855k1950
14298a0011K99k586L045K6446O592l6678k9824j380m426P626r563o549K6373N569
14284b5067M458J7028k0733Q31j3009k5677J6379M647M561k544J1224m178j1185
14271d3265J5739J961J2835k2110K892J8244K4421P431R364j9526n696J4910l856
14258A3344j4889j5527j3182N190O568M979K7258j4323l2306o364p867J4280J0473
14245b2366K4272o229j726j88j7443j3633J4241J5746J5193j0706j0357M618J3920
14232E342J1366J5522o951j0428j5412o101K0321N761J7970l943l5P491k2875
$$ plain form
14219 18028 -3043 -18562 -28459 -45638 -39850 -46639 -68689 -66999 -46060 -40762 -5147 11556 6542
14206 6542 24221 6645 1381 12360 872 -19044 -12807 7194 14746 41012 44949 46055 43929
14193 43929 18122 3468 -9042 -15100 -7673 48503 77804 105755 140571 155859 171629 187811
14181 187811 173294 147172 101132 55873 50302 32746 43461 66993 83578 129947 188864 241439
14169 241439 234271 179887 140720 100641 62109 56295 53493 32071 16481 23785 31922 32359 28405
14156 28405 17269 3316 10357 8086 12563 1065 -3475 18170 38872 32023 27167 5140 -9903
14143 -9903 -9250 -12679 -17838 -36083 -41269 -19812 -14405 -32770 116 26557 5392 -9246 -12168
14130 -12168 -4868 19833 46556 9173 -4895 -10806 -16562 -19644 -2869 -368 -25193 -8941 -1535
$$ packed form
14219A8028k1071j5519r897j7179N788o789k2050J690K0939N298L5615J6703n014
14206F542J7679j7576n264J0979j1488j9916O237K0001P552K6266L937J106k126
14193D3929k5807j4654j2510o058P427N6176K9301K7951L4816J5288J5770J6182
14181A87811j4517k6122m6040m5259n571j7556J0715K3532J6585M6369N8917N2575
14169B41439p168n4384l9167m0079l8532n814k802k1422j5590P304Q137M37l954
14156B8405j1136j3953P041k271M477j1498m540K1645K0702o849m856k2027j5043
14143i903O53l429n159j8245n186K1457N407j8365L2886K6441k1165j4638k922
14130a2168P300K4701K6723l7383j4068n911n756l082J6775K501k4825J6252P406
$$ plain form
14117 -1535 25513 44161 26302 182 16872 47552 31390 44310 26052 4010 7396 -3223
14105 -3223 -12442 -14456 -13151 16310 -1010 -14335 -14152 30079 33336 17203 15912 -11530 -26006
14092 -26006 -14709 -25082 -14460 -5100 8188 41315 64945 42925 32251 32379 27194 21572 21300
14079 21300 1601 -23311 -19472 -8327 -4373 -8547 -26642 -24830 -23256 15322 32432 23832 8418
14066 8418 -45852 -79564 -98066 -99173 -82214 -54173 -42774 -21440 -10497 858 11049 -4681
14054 -4681 -10103 -15817 -20842 2543 17000 -23205 -54958 -34786 -29645 -21115 -18670 -34265 -42584
14041 -42584 -52835 -30869 9690 7332 -15549 -26599 -25812 -2066 -9428 -20138 -691 28877
14029 28877 -516 15380 21179 -30 -9616 -10689 -24760 -58942 -51913 -15337 -10804 -2549 10462
$$ packed form
14117a535K7048J8648j7859k6120J6690L0680j6162J2920j8258k2042L386j0619
14105c223r219k014J305K9461j7320j3325J83M4231L257j6133j291k7442j4476
14092b6006J1297j0373J0622R360J3288L3127K3630k2020j0674J28n185n622k72
14079B1300j9699k4912L839J1145L954m174j8095J812J574L8578J7110q600j5414
14066H418n4270l3712j8502j107J6959K8041J1399K1334J0943J1355J0191j5730
14054d681n422n714n025K3385J4457m0205l1753K0172N141Q530K445j5595q319
14041d2584j0251K1966M0559k358k2881j1050P87K3746p362j0710J9447K9568
14029B8877k9393J5896N799k1209r586j073j4071l4182P029L6576M533Q255J3011
$$ plain form
14016 10462 -7791 -10540 -420 -13700 7782 22841 55194 66910 45625 20827 -15124 -41102
14004 -41102 -64324 -48394 -28800 -20464 -39345 -61668 -60260 -31474 -43649 -71942 -63302 -23625
13992 -23625 -19899 -18189 -15110 -7978 4405 -520 6383 -3406 11817 20272 23947 45663 38998 25880
13978 25880 27833 23883 -10061 -14593 -3411 11636 4963 -30321 -54460 -34631 -10821 -12077 -34781
13965 -34781 -26065 150 -33443 -66143 -49381 -53012 -36108 -22187 20686 35002 26016 10021
13953 10021 8361 -25304 -51052 -52805 -43044 -11273 -8978 -1624 17368 18196 26376 32582 31139 8067
13939 8067 -8757 -9631 -8402 11921 20652 -13264 -25309 -19827 -10149 6496 14389 938 -14434
13926 -14434 -37605 -41242 -29236 -5542 871 4762 -10346 1397 17128 14672 -15918 -37913
$$ packed form
14016A0462j8253k749J0120j3280K1482J5059L2353J1716k1285k4798l5951k5978
14004d1102k3222J5930J9594Q336j8881k2323J408K8786j2175k8293Q640L9677
13992b3625L726J710L079P132J2383m925O903r789J5223Q455L675K1716o665j3118
13978B5880J953l950l3944m532J1182J5047o673l5284k4139J9829K3810j256k2704
13965c4781Q716K6215l3593l2700J6762l631J6904J3921M2873J4316q986j5995
13953A0021j660l3665k5748j753R761L1771K295P354J8992Q28Q180O206j443k3072
13939H067j6824q74J229K0323Q731l3916j2045N482R678J6645P893j3451j5372
13926a4434k3171l637J2006K3694O413L891j5108J1743J5731k456l0590k1995
$$ plain form
13914 -37913 -22518 -788 -3018 -6932 11913 36910 49675 55706 66540 117875 122605 97730
13902 97730 74941 46270 2974 -12101 -14811 -26208 -14607 2446 -1410 20422 44410 81604
13890 81604 119941 94911 52004 39554 25758 -3336 -19483 -15090 943 10995 -22075 -40854
13878 -40854 -51133 -35080 2045 -100 -944 25518 28687 31900 38968 28495 8801 -29669 -42682
13865 -42682 -52299 -39811 -28428 -23107 -12496 6147 2262 -32372 -59346 -65505 -38289 -46582 -60915
13852 -60915 -38959 -33944 -30320 -33996 -12657 -2190 -15636 -11719 -29155 -32443 -31497 -26496 4667
13839 4667 24540 23894 29731 19844 918 5855 19293 54753 59223 36022 10912 -22963 -52816
13826 -52816 -63914 -49727 -12973 -8514 -44209 -43240 -35223 -18851 -25204 -45686 -24430 24713 23816
$$ packed form
13914c7913J5395K1730k230l914J8845K4997J2765O031J0834N1335M730k4875
13902I7730k2789k8671m3296j5075k710j1397J1601J7053l856K1832K3988L7194
13890H1604L8337k5030m2907j2450j3796k9094j6147M393J6033J0052l3070j8779
13878d0854j0279J6053L7125k145q44K6462L169L213P068j0473j9694l8470j3013
13865d2682r617J2488J1383N321J0611J8643l885l4634k6974o159K7216q293j4333
13852f0915K1956N015L624l676K1339J0467j3446L917j7436l288R46N001L1163
13839D667J9873o46N837r887j8926M937J3438L5460M470k3201k5110l3875k9853
13826e2816j1098J4187L6754M459l5695R69Q017J6372o353k0482K1256M9143q97
$$ plain form
13813 23816 6606 -11336 -27920 -41759 -24085 -33671 -31532 -45860 -53297 -40539 -7635 16199
13801 16199 10251 -18972 -9146 10977 20277 42070 54143 39594 33954 34140 29662 -2286 -31140
13788 -31140 -28829 -35278 -42249 -19221 -32918 -59155 -56511 -40793 -19512 -25000 -19876 -11530 -3316
13775 -3316 -33456 -35703 -25487 -13072 -2272 9173 10330 12380 26638 35508 25270 22471 -11509
13762 -11509 -58002 -42451 -34260 -20443 -22838 -37746 -57280 -50801 -28787 9749 36878 19126
13750 19126 -9523 -21304 -18074 -19212 -16124 -5989 3575 -22644 4117 10309 -14261 -24786 -45996
13737 -45996 -348 23696 -12357 -31007 -28117 -34698 -54093 -67193 -57973 -36400 -11018 -6962
13725 -6962 2093 -29769 -44105 -53332 -62932 -35429 -21468 15185 45004 52430 6998 -6502 -12133
$$ packed form
13813B3816j7210j7942j6584j3839J7674r586K139j4328p437J2758L2904K3834
13801A6199n948k9223R826K0123R300K1793J2073j4549n640J86m478l1948k8854
13788c1140K311o449o971K3028j3697k6237K644J5718K1281n488N124Q346Q214
13775c316l0140k247J0216J2415J0800J1445J157K050J4258Q870j0238k799l3980
13762a1509m6493J5551Q191J3817k395j4908j9534O479K2014L8536K7129j7752
13750A9126k8649j1781L230j138L088J0135R564k6219K6761O192k4570j0525k1210
13737d5996M5648K4044l6053j8650K890o581j9395j3100R220K1573K5382M056
13725f962R055l1862j4336r227r600K7503J3961L6653K9819P426m5432j3500n631
$$ plain form
13712 -12133 -32534 -7476 -4591 4619 4939 -1405 -33126 -43807 -49941 -47216 -34003 -22434 -18889
13699 -18889 -23660 -6083 13290 9554 6462 738 -7918 -5475 -12884 -37075 -69864 -73598 -71752
13686 -71752 -68333 -15245 15261 380 556 -1268 1902 -24475 -35629 -21377 -46580 -33158 866
13673 866 -13131 -16428 -3090 -18816 -12050 -11693 -1664 -7368 -12437 15437 9147 1904 -9692 -5393
13659 -5393 -13188 -10835 -11991 5542 7769 -9373 -11828 -28895 -60762 -45861 -43955 -45064 -25695
13646 -25695 -26389 -20977 -27696 -46044 -31018 -33752 -38022 -44387 -44323 -37271 -26777 -10543 16262 28531
13632 28531 26728 22981 38187 36725 9362 -17776 -30803 -13168 -18998 -11426 -664 -15767 -23842
13619 -23842 -24310 -27606 -27268 -57390 -72726 -29960 -13375 -22170 -25982 -21355 -6573 4795 3401
$$ packed form
13712a2133k0401K5058K885R210L20o344l1721j0681o134K725J3213J1569L545
13699a8889m771J7577J9373l736l092n724q656K443p409k4191l2789l734J846
13686g1752L419N3088L0506j4881J76j824L170k6377j1154J4252k5203J3422L4024
13673H66j3997l297J3338j5726O766L57J0029n704n069K7874o290p243j1596M299
13659e393p795K353j156J7533K227j7142k455j7067l1867J4901J906j109J9369
13646b5695o94N412o719j8348J5026k734m270o365O4P052J0494J6234K6805J2269
13632B8531j803l747J5206j462k7363k7138j3027J7635n830P572J0762j5103q075
13619b3842m68l296L38l0122j5336M2766J6585q795l812M627J4782J1368j394
$$ plain form
13606 3401 -15098 -27425 -8772 -18071 -25690 -35780 -57690 -57889 -53324 -28420 -33172 -13006 15037
13593 15037 12097 -24652 -41371 -16215 24215 22559 27790 25578 2630 -8454 -18204 1586 -2967
13580 -2967 -21833 -14110 -4247 4799 -8383 -38170 -28266 -18439 -9719 -12735 -25753 -50752 -71638
13567 -71638 -68327 -52430 -66559 -54655 -54656 -76014 -87921 -93278 -92225 -84844 -80216 -48737 -34147
13554 -34147 -708 26428 17824 9437 -1731 -27718 -36211 -11835 15415 15643 10178 -3770 -2667
13541 -2667 1025 1623 -23824 -41934 -36283 -36476 -19012 -9325 -27034 -28165 -33407 -25401 -5675 -23585
13527 -23585 -48754 -53582 -14295 -9409 -32259 -43460 -29318 -20057 -24879 -7677 -3625 -10984 3938
13514 3938 8009 -10767 -28840 -40430 -40208 -10465 -4820 -19527 -13672 -9727 -16516 -4968 -3622
$$ packed form
13606C401j8499j2327J8653r299p619j0090k1910j99M565K4904m752K0166K8043
13593A5037k940l6749j6719K5156M0430j656N231k212k2948j1084r750J9790m553
13580b967j8866P723R863R046j3182k9787R904R827Q720l016j3018k4999k0886
13567g1638L311J5897j4129J1904jk1358j1907n357J053P381M628L1479J4590
13554c4147L3439K7136q604q387j1168k5987q493K4376K7250K28n465j3948J103
13541b667L692N98k5447j8110N651j93J7464R687j7709j131n242Q006J9726j7910
13527b3585k5169m828L9287M886k2850j1201J4142R261m822J7202M052p359J4922
13514C938M071j8776j8073j1590K22K9743N645j4707N855L945o789J1548J346
$$ plain form
13501 -3622 -2390 -8364 647 -15099 -43715 -48997 -41330 -20069 -4709 8301 11163 8893 -4121
13488 -4121 28833 53591 46647 14513 5122 17572 20734 43213 59589 42335 45738 48525 38034
13475 38034 42476 38642 32276 -4804 -8593 -8402 -34666 -37559 -12902 -12306 -18002 -27028 -40202 -24319
13461 -24319 -1222 -9716 -9573 -16053 -4705 18050 13857 13509 21309 15515 -3673 20103 17709 22173
13447 22173 5003 -20752 -9343 12760 19791 24806 26738 12290 44033 51801 46099 38634 41504
13434 41504 58763 60691 49161 43637 55988 80351 105475 139428 182003 239039 306312 370554
13422 370554 508758 659984 826731 973568 1019453 1007550 949973 828345 697484 586624
13412 586624 566462 613759 734662 861583 992524 1072821 1060714 972852 845965 691745
$$ packed form
13501c622J232n974R011j5746k8616n282P667K1261J5360J3010K862k270j3014
13488d121L2954K4758o944l2134r391J2450L162K2479J6376j7254L403K787j0491
13475C8034M442l834o366l7080l789J91k6264k893K4657N96n696r026j3174J5883
13461b4319K3097q494J43o480J1348K2755m193l48P800n794j9188K3776k394M464
13447B2173j7170k5755J1409K2103P031N015J932j4448L1743P768n702p465K870
13434D1504J7259J928j1530n524J2351K4363K5124L3953M2575N7036O7273O4242
13422C70554J38204J51226J66747J46837M5885j1903n7577j21628j30861j10860
13412E86624k0162M7297J20903J26921J30941Q0297j2107q7862j26887j54220
$$ plain form
13402 691745 551529 379709 285675 221895 164146 123936 119007 107889 104227 77891 68597 64903
13390 64903 43957 43624 56665 39999 20076 41083 47999 34872 31322 5817 23288 12479
13378 12479 15554 19755 23969 10974 5818 1870 -3402 7800 15763 22382 1274 -17106 -8271
13365 -8271 19573 41612 54564 58871 28001 -22235 -44617 -45676 -16702 -7463 -531 24133 32911
13352 32911 49841 30878 3829 7655 -9099 -27470 -23912 -27872 -12990 5016 -21724 -41378
13340 -41378 -21265 -13332 -20801 -1112 23490 18705 6208 -2236 19073 12717 -2558 -10474 9868
13327 9868 29230 25085 -4451 -17507 21089 24970 22404 13792 4559 -7344 -41651 -57236 -33314
13314 -33314 -28475 -21863 -2361 2531 13809 20042 20910 10660 -15588 -12009 21614 22967 18787
$$ packed form
13402F91745j40216j71820r4034o3780n7749m0210m929j1118l662k6336r294l694
13390F4903k0946l33J3041j6666j9923K1007O916j3127l550k5505J7471j0809
13378A2479L075M201M214j2995n156l948n272J1202P963O619k1108j8380Q835
13365h271K7844K2039J2952M307l0870n0236k2382j059K8974R239O932K4664Q778
13352C2911J6930j8963k7049L826j6754j8371L558l960J4882J8006k6740j9654
13340d1378K0113P933p469J9689K4602m785j2497q444K1309o356j5275p916K0342
13327I868J9362m145k9536j3056L8596L881k566q612r233j1903l4307j5585K3922
13314c3314M839O612J9502M892J1278O233Q68j0250k6248L579L3623J353m180
$$ plain form
13301 18787 10929 -1656 -20685 -29305 -16381 -21260 -45043 -36386 -14408 -31369 -4643 -3680 -18195
13288 -18195 -26289 -38480 -43389 -42167 -22182 -3875 -6457 -33126 -26892 1165 13775 -11917 -40961
13275 -40961 -22106 12515 18606 37477 21847 13522 -2827 6820 22466 34197 39227 19118
13263 19118 5638 -28330 -16504 -650 -2011 10967 20965 9614 20164 26818 -210 12818
13251 12818 34036 26464 37207 51277 32928 4384 -13759 -3939 17202 20465 13514 7904 8348
13238 8348 -472 -1365 21248 31894 22013 25276 45634 75084 83031 64457 52521 53827 66821
13225 66821 75371 74871 58603 41293 43541 72925 68745 60138 62255 71323 64496 46615 50671 44184
13211 44184 57573 48758 41467 15318 -11971 -4185 7649 -14215 -28771 3953 35412 33046
$$ packed form
13301A8787p858j2585j9029q620J2924m879k3783Q657K1978j6961K6726R63j4515
13288a8195q094j2191m909J222J9985J8307k582k6669O234K8057J2610k5692k9044
13275d0961J8855L4621O091J8871j5630q325j6349R647J5646J1731N030k0109
13263A9118j3480l3968J1826J5854j361J2978R998j1351J0550O654k7028J3028
13251A2818K1218p572J0743J4070j8349k8544j8143R820K1141L263o951n610M44
13238H348q820q93K2613J0646r881L263K0358K9450P947j8574j1936J306J2994
13225F6821Q550n00j6268j7310K248K9384m180q607K117R068o827j7881M056o487
13211D4184J3389q815p291k6149k7289P786J1834k1864j4556L2724L1459k366
$$ plain form
13199 33046 22120 19046 1980 9604 4505 5633 17178 40913 47665 31896 30872 29979 23879
13186 23879 25302 35535 30192 47883 40216 33157 58465 83028 84943 52084 29039 18192 37383
13173 37383 47513 58922 66680 61354 64402 89460 125582 140715 126715 118395 134130 158910
13161 158910 184827 223142 266874 280171 331763 423085 566401 788949 1103202 1476409 1814502
13150 1814502 2062792 2148056 2068319 1871106 1587420 1366244 1239500 1256169 1339860 1535040
13140 1535040 1792155 2009415 2129399 2098339 1925618 1657459 1337595 1040922 794393 616471
13130 616471 488188 390337 327491 288341 268573 248248 219917 212735 216181 183959 161377 147659
13118 147659 123670 103819 86110 75332 83873 106526 97215 55710 48569 60678 84240 84303 70732
$$ packed form
13199C3046j0926l074j7066P624n099J128J1545K3735O752j5769j024q93o100
13186B3879J423J0233n343J7691p667p059K5308K4563J915l2859k3045j0847J9191
13173C7383J0130J1409P758n326L048K5058L6122J5133j4000q320J5735K4780
13161A58910K5917L8315M3732J3297N1592R1322J43316K22548L14253L73207L38093
13150A814502K48290Q5264p9737j97213k83686k21176j26744J6669Q3691J95180
13140A535040K57115K17260J19984l1060j72721k68159l19864k96673k46529j77922
13130F16471j28283r7851o2846l9150j9768k0325k8331p182L446l2222k2582j3718
13118A47659k3989j9851j7709j0778Q541K2653r311m1505p141J2109K3562O3j3571
$$ plain form
13105 70732 72725 78957 105494 86017 54788 52390 64825 60126 18496 7891 -10583 -27414
13093 -27414 -19554 -9709 121 13879 25385 10048 23098 28026 30681 25419 15001 23194 33233
13080 33233 52269 73710 76902 80715 75887 75174 101216 112761 105972 105826 112610 116562 148177 174622
13066 174622 204376 223327 267922 374192 491356 600058 674030 704483 675031 601283 507883
13055 507883 420878 398644 417244 493004 603586 657296 667649 627264 534617 425521 315740
13044 315740 255083 208141 149286 119552 138334 140081 132738 128812 133201 134244 124199 103024
13032 103024 102995 112270 94582 55757 47495 60732 68402 65992 52484 47990 50270 54848 77349
13019 77349 114111 96181 71961 50635 41121 38697 49755 51791 53876 47696 40978 41765 11872
$$ packed form
13105G0732J993O232K6537j9477l1229k398J2435m699m1630j0605j8474j6831
13093b7414P860R845R830J3758J1506j5337J3050M928K655n262j0418Q193J0039
13080C3233J9036K1441L192L813m828p13K6042J1545o789j46O784L952L1615K6445
13066A74622K9754J8951M4595J06270J17164J08702P3972L0453k9452p3748r3400
13055E07883q7005k2234J8600P5760J10582N3710J0353m0385r2647j09096j09781
13044C15740o0657m6942n8855k9734J8782J747p343l926M389J043j0045k1175
13032A03024k9R275j7688l8825q262J3237P670k410j3508m494K280M578K2501
13019G7349L6762j7930k4220k1326r514k424J1058K036K085o180o718P87k9893
$$ plain form
13006 11872 -22619 -10976 -14003 7112 22484 45536 24892 27620 71928 105252 82104 56732
12994 56732 79809 123577 151342 169042 181404 228932 286145 379143 519590 619810 694103
12983 694103 713611 668992 625317 589827 606426 647805 699772 734237 742662 696936 625777 482193
12971 482193 408146 353902 304098 260082 219678 188859 158946 139481 145833 183979 203517 158595
12959 158595 109683 87336 75952 84923 86928 119369 128724 142308 186993 193355 193620 214439 229121
12946 229121 280460 371605 479488 586910 674201 704009 712347 710764 694160 616246 523914
12935 523914 425923 329506 271878 229316 189190 173050 175885 167076 177064 177948 158048 130934
12923 130934 88392 85886 92089 109042 117124 141235 146045 131217 128980 135281 153786 191297 197551
$$ packed form
13006A1872l4491J1643l027K1115J5372K3052k0644K728M4308L3324k3148k5372
12994E6732K3077M3768K7765J7700J2362M7528N7213R2998J40447J00220P4293
12983F94103J9508m4619m3675l5490J6599M1379N1967L4465Q425m5726p1159j43584
12971D82193p4047n4244m9804m4016m0404l0819k9913j9465O352L8146J9538m4922
12959A58595m8912k2347j1384Q971K005L2441R355J3584M4685O362K65K0819J4682
12946B29121N1339R1145J07883J07422Q7291K9808Q338j583j6604p7914r2332
12935E23914r7991r6417n7628m2562m0126j6140K835q809R988Q84j9900k7114
12923A30934m2542k506O203J6953Q082K4111M810j4828k237O301J8505L7511O254
$$ plain form
12910 197551 209030 231820 229967 234720 208919 209550 256913 329031 383169 411586 425614 444324
12898 444324 466611 495955 510215 541403 550399 551931 545096 518567 497099 486551 452106 465063
12886 465063 499300 530871 546369 573418 578713 580986 553144 506743 491148 464196 401929 387235
12874 387235 387650 415222 465371 491953 485911 534926 619319 669160 687694 716674 738725 718691
12862 718691 688647 610220 520781 477661 466984 501679 554587 626677 689171 716130 701625
12851 701625 670712 597966 534387 471545 418336 358118 359767 383388 381507 373271 364765 330073
12839 330073 332602 355624 345618 320362 332198 351869 374029 424325 426185 403028 389895 383939
12827 383939 383600 384689 389272 392152 412997 426792 421230 431872 454582 492483 514778 548680 581709
$$ packed form
12910A97551J1479K2790j853M753k5801O31M7363P2118N4138K8417J4028J8710
12898D44324K2287K9344J4260L1188Q996J532o835k6529k1468j0548l4445J2957
12886D65063L4237L1571J5498K7049N295K273k7842m6401j5595k6952o2267j4694
12874C87235M15K7572N0149K6582o042M9015Q4393M9841J8534K8980K2051k0034
12862G18691l0044p8427q9439m3120j0677L4695N2908P2090O2494K6959j4505
12851G01625l0913p2746o3579o2842n3209o0218J649K3621j881q236q506l4692
12839C30073K529K3022j0006k5256J1836J9671K2160N0296J860k3157j3133n956
12827C83939l39J089M583K880K0845J3795n562J0642K2710L7901K2295L3902L3029
$$ plain form
12814 581709 618239 639964 658067 683828 698903 734526 779637 872883 982753 1111285 1261718
12803 1261718 1390443 1459204 1452618 1485364 1500936 1489543 1519187 1594910 1677515 1757282 1855543
12792 1855543 1993564 2115369 2260521 2480139 2810060 3288393 3896060 4586597 5174242
12783 5174242 5541516 5626973 5509064 5280716 5068286 4937626 4888511 4975130 5209217 5542098
12773 5542098 5911166 6185083 6253076 6162265 5904205 5549933 5155153 4774218 4410727 4071397
12763 4071397 3739835 3399179 3136629 2953231 2835239 2766326 2785976 2856644 2972530 3097680
12753 3097680 3189282 3270373 3346295 3406969 3504160 3625494 3790864 3987203 4185220 4351032
12743 4351032 4442406 4546667 4610818 4664183 4797602 5007713 5270719 5555423 5870464 6212148
$$ packed form
12814E81709L6530K1725J8103K5761J5075L5623M5111R3246J09870J28532J50433
12803A261718J28725O8761o586L2746J5572j1393K9644P5723Q2605P9767R8261
12792A855543J38021J21805J45152K19618L29921M78333O07667O90537N87645
12783E174242L67274Q5457j17909k28348k12430j30660m9115Q6619K34087L32881
12773E542098L69068K73917O7993r0811k58060l54272l94780l80935l63491l39330
12763D071397l31562l40656k62550j83398j17992o8913J9650P0668J15886J25150
12753C097680R1602Q1091P5922O0674R7191J21334J65370J96339J98017J65812
12743D351032R1374J04261O4151N3365J33419K10111K63006K84704L15041L41684
$$ plain form
12733 6212148 6534099 6786081 6982565 7178741 7408737 7700012 8190330 8854696 9651117
12724 9651117 10622556 11733780 12996091 14482239 16127036 17931472 19890139 22001683
12716 22001683 24326909 26860299 29604991 32694364 36509314 41711650 49356881 60810684
12708 60810684 78150393 104438049 143680170 199463295 270194909 342313759 396801689
12701 396801689 419442419 402579230 356922081 301966025 252459735 220722012 214314011
12694 214314011 234301945 276659391 331022206 381187698 410306274 407292405 372565035
12687 372565035 316826303 253872682 195225456 147298324 112168491 88188951 71904686
12680 71904686 60594608 52531513 46637101 42090775 38291771 34952591 31847927 28923775
$$ packed form
12733F212148L21951K51982J96484J96176K29996K91275M90318O64366P96421
12724I651117R71439J111224J262311J486148J644797J804436J958667K111544
12716B2001683K325226K533390K744692L089373L814950N202336P645231J1453803
12708F0810684J7339709K6287656L9242121N5783125P0731614P2118850N4487930
12701C96801689K2640730j6863189m5657149n4956056m9506290l1737723o408001
12694B14314011J9987934M2357446N4362815N0165492K9118576l013869l4727370
12687C72565035n5738732o2953621n8647226m7927132l5129833k3979540j6284265
12680G1904686j1310078q063095n894412m546326l799004l339180l104664k924152
$$ plain form
12672 28923775 26222066 23741654 21466964 19452508 17676326 16124637 14812399 13707530
12664 13707530 12734059 11893437 11126375 10411311 9785233 9222722 8697881 8265447 7884192
12655 7884192 7551613 7263768 6999519 6706660 6447564 6189897 5913771 5631676 5381557
12646 5381557 5164855 4988005 4840937 4671847 4517270 4362402 4232559 4106544 3985180
12637 3985180 3870644 3775632 3657398 3612321 3568347 3491131 3462012 3420973 3339185 3257300 3159149
12626 3159149 3012591 2864598 2748449 2646455 2567068 2533353 2530911 2539285 2540628 2520059 2485450
12615 2485450 2424444 2332466 2206372 2087004 2033768 2039629 2016034 1963051 1930075 1948501 1962651
12604 1962651 1987092 1990623 2007312 2039368 2039632 2096148 2144162 2126507 2103805 2106140 2084098 2046307
$$ packed form
12672B8923775k701709k480412k274690k014456j776182j551689j312238j104869
12664A3707530r73471q40622p67062p15064o26078n62511n24841m32434l81255
12655G884192l32579k87845k64249k92859k59096k57667k76126k82095k50119
12646E381557k16702j76850j47068j69090j54577j54868j29843j26015j21364
12637C985180j14536r5012j18234m5077m3974p7216k9119m1039q1788q1885r8151
12626C159149j46558j47993j16149j01994p9387l3715k442Q374J343k0569l4609
12615B485450o1006r1978j26094j19368n3236N861k3595n2983l2976J8426J4150
12604A962651K4441L531J6689L2056K64N6516M8014j7655k2702K335k2042l7791
$$ plain form
12592 2046307 2027894 1994304 1934522 1877152 1772652 1656058 1510839 1373798 1293571 1242841
12582 1242841 1204149 1158636 1122829 1095541 1077833 1060261 989175 939432 914334 896109 893697
12571 893697 897613 884544 891872 888292 880832 871052 848696 830798 821462 812322 813523 798842 824075
12558 824075 873694 918223 927828 915722 932582 930288 912764 894662 893425 881601 851778 835258
12546 835258 856934 820329 788498 736898 696723 638388 552838 529876 548892 567363 552913
12535 552913 542428 505186 495734 495394 491430 466456 432547 437307 443322 421803 412701 391385 394072
12522 394072 424934 456862 420221 370238 352521 381616 359948 348244 377806 360598 362734 372718
12510 372718 341026 308252 296326 298116 287994 293278 295591 316428 337741 367317 370340 316949
$$ packed form
12592B046307j8413l3590n9782n7370j04500j16594j45219j37041q0227n0730
12582A242841l8692m5513l5807k7288j7708j7572p1086m9743k5098j8225k412
12571H93697L916j3069P328l580p460r780k2356j7898r336r140J201j4681K5233
12558H24075M9619M4529R605j2106J6860k294j7524j8102j237j1824k9823j6520
12546H35258K1676l6605l1831n1600m0175n8335q5550k2962J9016J8471j4450
12535E52913j0485l7242r452l40l964k4974l3909M760O015k1519r102k1316K687
12522C94072L0862L1928l6641m9983j7717K9095k1668j1704K9562j7208K136R984
12510C72718l1692l2774j1926J790j0122N284K313K0837K1313K9576L023n3391
$$ plain form
12498 316949 285204 282767 264614 247738 232229 228632 257635 289103 319314 369551 384006 379413
12486 379413 391348 378420 343967 332992 330234 318965 333505 352726 332369 321272 321354 302033
12474 302033 271573 237671 283667 307047 301685 287039 285779 285474 297236 297180 292297 260605 237619
12461 237619 238052 275603 278546 261119 247790 259583 254681 280219 309512 293176 294137 268819 286058
12448 286058 305824 305592 318489 335359 346597 363527 362849 366148 362769 398296 454236 519020 616275
12435 616275 721604 828778 929429 1033546 1116703 1177956 1211399 1218957 1212820 1219357 1214499
12424 1214499 1149489 1057739 992611 918573 845316 752830 655069 573346 493996 435296 382173
12413 382173 340101 320552 293090 276049 291740 272348 246396 257496 269925 262354 258443 268191
$$ packed form
12498C16949l1745k437j8153j6876j5509l597K9003L1468L0211N0237J4455m593
12486C79413J1935j2928l4453j0975k758j1269J4540J9221k0357j1097Q2j9321
12474C02033l0460l3902M5996K3380n362j4646j260l05J1762n6m883l1692k2986
12461B37619M33L7551K943j7427j3329J1793m902K5538K9293j6336R61k5318J7239
12448B86058J9766k32J2897J6870J1238J6930o78L299l379L5527N5940O4784R7255
12435F16275J05329J07174J00651J04117Q3157O1253L3443P558o137O537m858
12424A214499o5010r1750o5128p4038p3257r2486r7761q1723p9350n8700n3123
12413C82173m2072j9549k7462j7041J5691j9392k5952J1100J2429p571l911R748
$$ plain form
12401 268191 281013 264119 254629 260797 277034 260600 257769 267898 229878 207305 213782 204389
12389 204389 199627 211436 227323 249304 231304 210025 192983 188573 187904 188294 201197 178355 161998
12376 161998 179243 186801 185982 183917 195588 194611 171409 145212 181587 227433 229190 193875 210559
12363 210559 212251 200182 183776 211282 255813 259618 263903 269352 248301 246848 211874 197455
12351 197455 226957 250615 237590 223746 208369 217423 248540 274084 258040 238162 232819 235109
12339 235109 212199 178756 154228 189931 196909 177571 214561 244966 246943 234637 246086 216276
12327 216276 219290 216777 191013 191043 208600 186362 182645 223140 273126 262189 252714 262226 286277
12314 286277 304886 328863 342741 362148 358577 348732 342154 335695 341055 366040 392250 386660 341176
$$ packed form
12401B68191J2822j6894r490O168J6237j6434k831J0129l8020k2573O477r393
12389B04389m762J1809J5887K1981j8000k1279j7042m410o69L90J2903k2842j6357
12376A61998J7245P558q19k065J1671r77k3202k6197L6375M5846J757l5315J6684
12363B10559J692j2069j6406K7506M4531L805M285N449k1051j453l4974j4419
12351A97455K9502K3658j3025j3844j5377R054L1117K5544j6044j9878n343K290
12339B35109k2910l3443k4528L5703O978j9338L6990L0405J977j2306J1449k9810
12327B16276L014k513k5764L0J7557k2238l717M0495M9986j0937r475R512K4051
12314B86277J8609K3977J3878J9407l571r845o578o459N360K4985K6210n590m5484
$$ plain form
12301 341176 313703 286752 259775 285795 277288 278908 280234 264497 238970 211292 198429 221601
12289 221601 262631 266639 260063 242008 247529 247372 243206 259817 288323 310473 321625 316538 309105
12276 309105 315976 340058 361309 380339 401610 395221 361377 321245 326687 349816 373634 398828
12264 398828 410227 424290 421473 421541 423441 441188 463695 488383 543316 605123 689269 806532
12252 806532 963438 1177954 1477132 1861408 2206193 2381122 2382365 2280498 2079789 1795109
12242 1795109 1593028 1506494 1548082 1701634 1934520 2185584 2378720 2461280 2368964 2139260
12232 2139260 1835650 1516062 1250656 1037610 846757 717172 630545 543782 489124 483629
12222 483629 454394 412329 395715 376944 326551 292167 306983 308049 316876 337608 359389 385115
$$ packed form
12301C41176k7473k6951k6977K6020q507J620J326j5737k5527k7678j2863K3172
12289B21601M1030M008o576j8055N521j57m166J6611K8506K2150J1152n087p433
12276C09105O871K4082K1251J9030K1271o389l3844m0132N442K3129K3818K5194
12264C98828J1399J4063k817O8J900J7747K2507K4688N4933O1807Q4146J17263
12252H06532J56906K14516K99178L84276L44785J74929J243j01867k00709k84680
12242A795109k02081q6534M1588J53552K32886K51064J93136Q2560r2316k29704
12232B139260l03610l19588k65406k13046j90853j29585q6627q6763n4658n495
12222D83629k9235m2065j6614j8771n0393l4384J4816J066Q827K0732K1781K5726
$$ plain form
12210 385115 357731 316232 306273 311600 312025 293730 279085 256526 253440 272151 304596 299768 298443
12197 298443 314411 300972 279966 264608 277443 289395 276605 263432 261780 248673 223206 229501
12185 229501 253332 235566 238047 258903 276955 257569 260994 328415 348823 335339 331122 317486
12173 317486 318761 316124 299381 325955 337660 326296 310672 306105 306889 282422 278632 303040 266123
12160 266123 255180 273377 256177 240894 237694 242782 252778 249952 236394 227754 213141 194631
12148 194631 178696 175493 201276 187555 196572 194465 193520 202154 228596 228192 243236 263544 264467
12135 264467 271223 303684 330413 354244 378841 377393 381953 376674 388061 391946 382588 365159 311640
12122 311640 312382 304039 281737 278012 270152 290726 278078 284647 296987 276172 302104 301652 301192
$$ packed form
12210C85115k7384m1499r959N327M25j8295j4645k2559l086J8711L2445m828j325
12197B98443J5968j3439k1006j5358J2835J1952j2790j3173j652j3107k5467O295
12185B29501K3831j7766K481K0856J8052j9386L425O7421K0408j3484m217j3636
12173C17486J275k637j6743K6574J1705j1364j5624m567P84k4467l790K4408l6917
12160B66123j0943J8197j7200j5283l200N088R996k826j3558q640j4613j8510
12148A94631j5935l203K5783j3721R017k107r45Q634K6442m04J5044K0308R23
12135B64467O756L2461K6729K3831K4597j448M560n279J1387L885r358j7429n3519
12122C11640P42q343k2302l725p860K0574j2648O569J2340k0815K5932m52m60
$$ plain form
12109 301192 309160 324971 320970 330621 341861 345381 375126 430899 447988 447900 469810 475923 450847
12096 450847 438812 439428 442932 457451 487659 530809 536644 534463 541030 553167 544751 519453 499404
12083 499404 454216 437992 410119 393291 417454 421615 405740 399459 409390 428561 464651 536381
12071 536381 583233 634230 693433 756996 837311 877687 910951 942184 1022592 1100081 1179078
12060 1179078 1264043 1306239 1336280 1349895 1375805 1426370 1464929 1475353 1489409 1496738 1511488
12049 1511488 1478386 1453097 1427058 1359848 1259944 1145524 1067213 995208 906044 845202 780298
12038 780298 727299 703208 689083 661903 628183 633943 625052 633616 705319 748774 805825 911888
12026 911888 991684 1068253 1150310 1204572 1253994 1312991 1396000 1469930 1571116 1669042 1743981
$$ packed form
12109C01192P968J5811m001R651J1240L520K9745N5773J7089q8K1910O113k5076
12096D50847j2035O16L504J4519L0208M3150N835k181O567J2137q416k5298k0049
12083D99404m5188j6224k7873j6828K4163M161j5875o281R931J9171L6090P1730
12071E36381M6852N0997N9203O3563Q0315M0376L3264L1233Q0408P7489P8997
12060A179078Q4965M2196L0041J3615K5910N0565L8559J0424J4056P329J4750
12049A511488l3102k5289k6039o7210r9904j14420p8311p2005q9164o0842o4904
12038G80298n2999k4091j4125k7180l3720N760q891Q564P1703M3455N7051J06063
12026I11888P9796P6569Q2057N4262M9422N8997Q3009P3930J01186R7926P4939
$$ plain form
12015 1743981 1825248 1885643 1950943 2023715 2077732 2119838 2165512 2198564 2178820 2106757 2047301
12004 2047301 1943829 1883419 1833637 1771383 1679898 1615810 1543535 1479892 1420254 1331854 1244739
11993 1244739 1142636 1064217 985454 927446 861268 816759 809312 776365 768568 761517 758001 760140
11981 760140 767850 785444 815552 822685 819406 853263 863384 864023 866451 853065 916461 1000731 1058930
11968 1058930 1132898 1187788 1226147 1259474 1252256 1230303 1214127 1185668 1157320 1121226 1098641
11957 1098641 1098466 1083772 1047173 1016578 968421 899009 842439 792809 761078 739100 696714 627463
11945 627463 573850 538955 502513 465468 428899 391582 358830 346380 321635 296247 295391 292291
11933 292291 278644 275084 285511 280395 252396 235219 225700 215719 217396 228006 220492 201645 206638
$$ packed form
12015A743981Q1267O0395O5300P2772N4017M2106M5674L3052j9744p2063n9456
12004B047301j03472o0410m9782o2254r1485o4088p2275o3643n9638q8400q7115
11993A244739j02103p8419p8763n8008o6178m4509p447l2947p797p051l516K139
11981G60140P710J7594L0108P133l279L3857J0121O39K428j3386O3396Q4270N8199
11968A058930P3968N4890L8359L3327p218k1953j6176k8459k8348l6094k2585
11957A098641j75j4694l6599l0595m8157o9412n6570m9630l1731k1978m2386o9251
11945F27463n3613l4895l6442l7045l6569l7317l2752j2450k4745k5388q56l100
11933B92291j3647l560J0427n116k7999j7177r519r981J677J0610p514j8847M993
$$ plain form
11920 206638 197157 195479 194779 201688 242007 250286 234628 236020 216404 216963 212184 217879 223112 209385
11906 209385 219897 231971 203269 201715 211216 238820 256531 250709 278604 285038 277951 273241 277717
11893 277717 252939 247471 273994 304602 309489 290603 264403 253314 240053 220275 224704 248487
11881 248487 262502 279611 293670 292296 296260 274276 268328 259216 246766 250021 254903 271792 264055
11868 264055 265274 289336 300161 282774 257676 263756 266157 259929 227409 200108 191877 188192 205206
11855 205206 197374 195416 218559 233909 235153 265370 285418 276889 259170 264251 267523 300138 322863
11842 322863 326945 317862 302961 325543 359792 397302 463459 495750 511810 553026 560981 587387
11830 587387 586937 544506 542041 511703 464840 419669 354450 323685 287838 264857 249797 227275
$$ packed form
11920B06638r481j678p00O909M0319Q279j5658J392j9616N59m779N695N233j3727
11906B09385J0512J2074k8702j554R501K7604J7711n822K7895O434p087m710M476
11893B77717k4778n468K6523L0608M887j8886k6200j1089j3261j9778M429K3783
11881B48487J4015J7109J4059j374L964k1984n948r112j2450L255M882J6889p737
11868B64055J219K4062J0825j7387k5098O080K401o228l2520k7301q231l685J7014
11855B05206p832j958K3143J5350J244L0217K0048q529j7719N081L272L2615K2725
11842C22863M082r083j4901K2582L4249L7510O6157L2291J6060M1216P955K6406
11830E87387m50m2431k465l0338m6863m5171o5219l0765l5847k2981j5060k2522
$$ plain form
11818 227275 222252 206512 169711 143825 122695 139296 154831 188337 215271 199707 229677 247664
11806 247664 270635 308674 332257 379985 418785 448376 477710 481007 495921 511899 533183 526443
11794 526443 526635 534801 501440 446681 414091 380580 328079 244801 196907 190341 200962 193781
11782 193781 154439 134865 141023 154453 139745 103418 118613 108392 112762 124817 120640 88498
11770 88498 75712 95106 115176 155396 170480 181962 193875 214931 230391 258658 302796 298135
11758 298135 286253 286382 258202 221765 228810 223447 195085 208552 269893 294099 299121 297086 279425
11745 279425 265908 239568 264795 293986 321691 330932 325404 258405 205227 166122 155360 143082
11733 143082 144575 139468 133292 129151 90919 91737 91368 103548 97966 102612 94279 131676 173342 196340
$$ packed form
11818B27275n023j5740l6801k5886k1130J6601J5535L3506K6934j5564K9970J7987
11806B47664K2971L8039K3583M7728L8800K9591K9334L297J4914J5978K1284o740
11794E26443J92Q166l3361n4759l2590l3511n2501q3278m7894o566J0621p181
11782A93781l9342j9574O158J3430j4708l6327J5195j0221M370J2055m177l2142
11770H8498j2786J9394K0070M0220J5084J1482J1913K1056J5460K8267M4138m661
11758B98135j1882J29k8180l6437P045n363k8362J3467O1341K4206N022k035j7661
11745B79425j3517k6340K5227K9191K7705R241n528o6999n3178l9105j0762j2278
11733A43082J493n107o176m141l8232Q18l69J2180n582M646q333L7397M1666K2998
$$ plain form
11719 196340 195925 214352 263858 355305 419753 451583 457167 493131 498050 502167 500865 503383 484275
11706 484275 461681 423911 391360 350922 311543 277871 238946 214636 182212 172198 141507
11695 141507 138352 140087 116751 93974 83258 94643 120998 129731 145892 144424 126180 145585
11683 145585 163684 205835 220018 221753 264486 328081 363746 349011 317206 282010 235026 176606
11671 176606 126585 148734 173756 178787 153948 144989 135837 148399 139354 145164 135217 120161 127339
11658 127339 139377 116999 112406 106453 116693 130453 146578 134761 121858 136987 148787 164320
11646 164320 163709 182073 167568 201133 248959 286187 339266 407337 508660 646735 795385
11635 795385 899579 936921 929996 854567 721571 614927 511744 432295 368454 327117 292259
$$ packed form
11719A96340m15J8427M9506R1447O4448L1830N584L5964M919M117j302K518j9108
11706D84275k2594l7770l2551m0438l9379l3672l8925k4310l2424j0014l0691
11695A41507l155J735k3336k2777j0716J1385K6355Q733J6161j468j8244J9405
11683A45585J8099M2151J4183J735M2733O3595L5665j4735l1805l5196m6984n8420
11671A76606n0021K2149K5022N031k4839q959r152J2562r045N810r947j5056P178
11658A27339J2038k2378m593n953J0240J3760J6125j1817j2903J5129J1800J5533
11646A64320o11J8364j4505L3565M7826L7228N3079O8071J01323J38075J48650
11635G95385J04194L7342o925p5429j32996j06644j03183p9449o3841m1337l4858
$$ plain form
11624 292259 302232 308516 273960 212833 192176 194708 189393 161190 118821 111321 128376 143372
11612 143372 156140 177430 185839 199890 199463 185225 183224 229672 302285 356473 419249 489828
11600 489828 605374 767829 1000977 1290050 1586207 1801636 1927397 1882592 1697251 1472337
11590 1472337 1237448 1006735 813843 665852 562510 495318 418744 382450 360780 319164
11580 319164 269692 259417 272886 191084 150484 170960 178007 143863 146975 168671 184856 175206
11568 175206 158212 162323 177449 180090 172855 223936 273540 322578 393694 497969 643029 790020
11556 790020 932645 1054179 1131814 1137261 1026549 879562 712099 552111 479222 426111
11546 426111 386224 374881 342597 285738 257180 259648 252278 199946 189739 194472 184624 165783
$$ packed form
11624B92259R973O284l4556o1127k0657K532n315k8203m2369p500J7055J4996
11612A43372J2768K1290Q409J4051m27j4238k001M6448P2613N4188O2776P0579
11600D89828J15546J62455K33148K89073K96157K15429J25761m4805j85341k24914
11590A472337k34889k30713j92892j47991j03342o7192p6574l6294k1670m1616
11580C19164m9472j0275J3469q1802m0600K0476P047l4144L112K1696J6185r650
11568A75206j6994M111J5126K641p235N1081M9604M9038P1116J04275J45060J46991
11556G90020J42625J21534P7635N447j10712j46987j67463j59988p2889n3111
11546D26111l9887j1343l2284n6859k8558K468p370n2332j0207M733r848j8841
$$ plain form
11534 165783 164870 171204 195416 184653 172884 182399 193394 185357 157725 156166 166170 173190 194131
11521 194131 189376 181792 157323 143343 149785 146100 144494 156379 139456 149646 150312 147590 121417
11508 121417 116301 118989 129289 134114 148642 148007 151814 156197 115853 121438 133715 120644 118271
11495 118271 116855 128275 149893 177305 190446 193786 197466 223122 216848 191849 184825 187115 179802
11482 179802 185787 172364 148377 129465 127030 137027 143542 158233 156483 169391 169452 160115 176975
11469 176975 177463 183904 175834 187675 185665 170702 135517 118181 125766 117750 120119 93961 99175
11456 99175 113695 127048 134376 127189 134462 135573 129036 146892 145924 165775 204891 218870 208148
11443 208148 169955 133160 144807 171476 183441 196093 172635 169380 216581 246231 278191 279576
$$ packed form
11534A65783r13O334K4212j0763j1769R515J0995q037k7632j559J0004P020K0941
11521A94131m755p584k4469j3980O442l685j606J1885j6923J0190O66k722k6173
11508A21417n116K688J0300M825J4528o35L807M383m0344N585J2277j3071k373
11495A18271j416J1420K1618K7412J3141L340L680K5656o274k4999p024K290p313
11482A79802N985j3423k3987j8912k435R997O515J4691j750J2908O1r337J6860
11469A76975M88O441q070J1841k010j4963l5185j7336P585q016K369k6158N214
11456I9175J4520J3353P328p187P273J111o537J7856r68J9851L9116J3979j0722
11443B08148l8193l6795J1647K6669J1965J2652k3458l255M7201K9650L1960J385
$$ plain form
11431 279576 248997 245246 202025 181311 160580 143708 131587 137376 156268 167961 175538 166050
11419 166050 138688 134138 125757 138136 166286 174394 165751 166145 182058 197095 193238 196572 227086
11406 227086 254582 246277 256719 270674 271300 276022 273676 266363 249866 224528 234217 243251 223522
11393 223522 205374 218829 259693 267467 264668 266099 275729 250833 272679 287580 274808 271543
11381 271543 268253 258610 237892 230424 269809 279014 280771 279946 298871 289185 306286 315743 324918
11368 324918 360636 402838 406970 401455 389373 405982 427015 445154 408800 406474 439817 404507
11356 404507 372765 334398 337661 345169 352143 361983 356410 331751 338362 341082 333979 345604 332369
11343 332369 322608 334730 330507 324959 335688 323180 297212 308738 304193 310116 329088 347602
$$ packed form
11431B79576l0579l751m3221k0714k0731j6872j2121N789J8892J1693P577r488
11419A66050k7362m550q381J2379K8150Q108q643L94J5913J5037l857L334L0514
11406B27086K7496q305J0442J3955O26M722k346p313j6497k5338R689R034j9729
11393B23522j8148J3455M0864P774k799J431R630k4896K1846J4901j2772l265
11381B71543l290r643k0718p468L9385R205J757q25J8925r686J7101R457R175
11368C24918L5718M2202M132n515j2082J6609K1033J8139l6354k326L3343l5310
11356D04507l1742l8367L263P508O974R840n573k4659O611K720p103J1625j3235
11343C32369r761J2122m223n548J0729j2508k5968J1526m545N923J8972J8514
$$ plain form
11331 347602 382312 413590 433019 441768 449499 477352 509257 500507 501293 494743 504999 490583 479560
11318 479560 487106 484259 469533 457706 476436 530453 557161 570282 576464 596795 602496 611449
11306 611449 606202 583037 572929 569672 567257 551138 572941 616275 624758 639609 669267 716813
11294 716813 737812 745855 751253 744172 715399 676721 692173 682497 655895 634935 671709 682669
11282 682669 685156 695857 723764 750542 781608 845291 888024 927931 1007244 1078383 1163142 1228685
11270 1228685 1251179 1296773 1312855 1284293 1274527 1275146 1270307 1255902 1241135 1230656 1246502 1315125
11258 1315125 1382989 1431724 1506260 1547454 1557155 1527656 1488012 1499356 1548018 1575076 1592004
11247 1592004 1599266 1596620 1646581 1723568 1780634 1836270 1899844 2011350 2133535 2273961 2426201
$$ packed form
11331C47602L4710L1278J9429Q749P731K7853L1905q750P86o550J0256j4416j1023
11318D79560P546k847j4726j1827J8730N4017K6708J3121O182K0331N701Q953
11306F11449n247k3165j0108l257k415j6119K1803M3334Q483J4851K9658M7546
11294G16813K0999Q043N398p081k8773l8678J5452r676k6602k0960L6774J0960
11282F82669K487J0701K7907K6778L1066O3683M2733L9907P9313P1139Q4759O5543
11270A228685K2494M5594J6082k8562r766O19m839j4405j4767j0479J5846O8623
11258A315125O7864M8735P4536M1194R701k9499l9644J1344M8662K7058J6928
11247A592004P262k646M9961P6987N7066N5636O3574J11506J22185J40426J52240
$$ plain form
11236 2426201 2557718 2683950 2888391 3113236 3330354 3575712 3870332 4153168 4463229
11227 4463229 4818337 5222851 5702235 6295116 6993121 7889884 9022957 10468864 12362224
11218 12362224 14882209 18311313 23139448 29913395 39433030 52468684 68997067 87458509
11210 87458509 105054514 118882066 127052314 129489815 126460536 117995986 104292144 86947779
11202 86947779 68977260 53363805 41708426 33626760 28049630 24075730 21230033 19171054
11194 19171054 17658662 16617385 15916646 15491731 15310890 15344107 15626732 16119715 16815156
11185 16815156 17675191 18768694 20188458 22027729 24469468 27730213 32115934 38127624
11177 38127624 46432084 58054267 74393593 97164278 127937923 166831174 211026412
$$ packed form
11236B426201J31517J26232K04441K24845K17118K45358K94620K82836L10061
11227D463229L55108M04514M79384N92881O98005Q96763J133073J445907J893360
11218A2362224K519985L429104M828135O773947R519635J3035654J6528383J8461442
11210H7458509J7596005J3827552Q170248K437501l029279q464550j3703842j7344365
11202H6947779j7970519j5613455j1655379q081666n577130l973900k845697k058979
11194A9171054j512392j041277p00739m24915j80841L3217K82625M92983O95441
11185A6815156Q60035J093503J419764J839271K441739L260745M385721O011690
11177C8127624Q304460J1622183J6339326K2770685L0773645L8893251M4195238
$$ plain form
11170 211026412 254439134 288871225 307447635 307775856 292508454 267140135 237110588
11163 237110588 205043668 171967886 139496086 109970854 85892665 68060045 55496859
11156 55496859 46541718 39957014 34946711 31056563 28000268 25599671 23745239 22321644
11148 22321644 21262631 20563267 20207133 20153583 20365106 20818050 21530897 22556079 23955678
11139 23955678 25920203 28695013 32590569 38166277 46247550 57959579 74644824 97226473
11131 97226473 124957556 154562251 181210073 199677592 206249488 200131085 182376254
11124 182376254 156182862 126642384 98464256 75307969 58424726 46621705 38242965
11117 38242965 32091445 27418448 23782521 20852468 18473860 16557166 14981097 13702530
$$ packed form
11170B11026412M3412722L4432091J8576410L28221j5267402k5368319l0029547
11163B37110588l2066920l3075782l2471800k9525232k4078189j7832620j2563186
11156E5496859q955141o584704n010303l890148l056295k400597j854432j423595
11148B2321644j059013o99364l56134n3550K11523M52944P12847J025182J399599
11139B3955678J964525K774810L895556N575708Q081273J1712029J6685245K2581649
11131I7226473K7731083K9604695K6647822J8467519O571896o118403j7754831
11124A82376254k6193392k9540478k8178128k3156287j6883243j1803021q378740
11117C8242965o151520m672997l635927k930053k378608j916694j576069j278567
$$ plain form
11109 13702530 12695217 11896287 11241904 10692398 10239539 9863652 9532446 9215981 8909575
11100 8909575 8626832 8394865 8175309 8049751 7959449 7860200 7725020 7507183 7274204 7034446
11090 7034446 6777860 6501416 6152682 5742490 5366519 5059846 4833180 4679265 4535015
11081 4535015 4397072 4277579 4163586 4074611 3958214 3831557 3721761 3577489 3456198 3323322
11071 3323322 3214093 3133218 3081447 3010479 2974416 2949372 2930248 2928847 2917339 2856220 2800702
11060 2800702 2758288 2719331 2692938 2668929 2692228 2743385 2823787 2954983 3105005 3228611 3315232
11049 3315232 3369893 3395848 3382399 3293852 3173888 3034437 2929958 2767832 2641521 2565576
11039 2565576 2517891 2504625 2489290 2451962 2438515 2403412 2335179 2283144 2199489 2110811 2015210
$$ packed form
11109A3702530j007313p98930o54383n49506m52859l75887l31206l16465l06406
11100H909575k82743k31967k19556j25558r0302r9249j35180k17837k32979k39758
11090G034446k56586k76444l48734m10192l75971l06673k26666j53915j44250
11081D535015j37943j19493j13993q8975j16397j26657j09796j44272j21291j32876
11071C323322j09229q0875n1771p0968l6063k5044j9124j401j1508o1119n5518
11060B800702m2414l8957k6393k4009K3299N1157Q0402J31196J50022J23606Q6621
11049C315232N4661K5955j3449q8547j19964j39451j04479j62126j26311p5945
11039B565576m7685j3266j5335l7328j3447l5103o8233n2035q3655q8678r5601
$$ plain form
11028 2015210 1880208 1755397 1659966 1582840 1556404 1559212 1594499 1604397 1604096 1622575 1656665 1680433
11016 1680433 1694703 1699347 1706112 1688594 1659324 1623060 1544415 1469526 1414984 1383184 1353948 1315246
11004 1315246 1263849 1266734 1276599 1318928 1361663 1400011 1467305 1531733 1614202 1680169 1710294 1742815
10992 1742815 1731438 1688756 1682705 1671632 1606444 1528084 1446930 1395994 1362077 1295848 1217345
10981 1217345 1185662 1154661 1104185 1087367 1109000 1091445 1047716 1047971 1047047 1068831 1107676 1120580
10969 1120580 1122248 1120422 1090117 1054883 1054123 1049788 1023007 1017094 1041401 1036120 1019240 1018152 1043453
10956 1043453 1037817 1013382 999250 1016134 1016827 1018840 1024607 1043880 1019445 983330 966637 975391
10944 975391 957168 931705 871629 827064 833645 830154 832397 805840 807958 779896 786481 792327 807518
$$ packed form
11028B015210j35002j24811r5431p7126k6436K808L5287R898l01J8479L4090K3768
11016A680433J4270M644O765j7518k9270l6264p8645p4889n4542l1800k9236l8702
11004A315246n1397K885R865M2329M2735L8348O7294O4428Q2469O5967L0125L2521
10992A742815j1377m2682o051j1073o5188p8360q1154n0936l3917o6229p8503
10981A217345l1683l1001n0476j6818K1633j7555m3729K55r24K1784L8845J2904
10969A120580J668j826l0305l5234p60m335k6781n913K4307n281j6880j088K5301
10956A043453n636k4435j4132J6884O93K013N767J9273k4435l6115j6693Q754
10944I75391j8223k5463o0076m4565O581l491K243k6557K118k8062O585N846J5191
$$ plain form
10931 807518 827180 838362 841788 831820 815058 842506 855907 835288 827697 838576 831978 832911 854839
10918 854839 860733 874815 885826 910718 921911 944578 955809 967163 977109 966116 982663 1016110
10906 1016110 1022147 1018437 1047403 1042611 1042277 1054243 1092071 1119811 1126793 1121527 1125417 1120728 1110580
10893 1110580 1093968 1084600 1056085 1012718 1010565 1025707 1047283 1033680 1023623 1050412 1080761 1088064
10881 1088064 1094462 1131912 1152249 1136007 1123162 1127076 1146227 1170570 1181754 1214167 1287363 1356110
10869 1356110 1377758 1443048 1506036 1546310 1579908 1617110 1633859 1605764 1629325 1657847 1638383
10858 1638383 1615206 1597609 1645628 1713134 1720739 1696256 1702787 1707466 1739699 1756844 1758568 1783781
10846 1783781 1786787 1783153 1793110 1808724 1826427 1871532 1884971 1876370 1897698 1927764 1940402 1939853
$$ packed form
10931H07518J9662J1182L426r968j6762K7448J3401k0619p591J0879o598R33K1928
10918H54839N894J4082J1011K4892J1193K2667J1231J1354R946j0993J6547L3447
10906A016110O037l710K8966m792l34J1966L7828K7740O982n266L890m689j0148
10893A110580j6612r368k8515m3367k153J5142K1576j3603j0057K6789L0349P303
10881A088064O398L7450K0337j6242j2845L914J9151K4343J1184L2413P3196O8747
10869A356110K1648O5290O2988M0274L3598L7202J6749k8095K3561K8522j9464
10858A638383k3177j7597M8019O7506P605k4483O531M679L2233J7145J724K5213
10846A783781L006l634R957J5614J7703M5105J3439q601K1328L0066J2638n49
$$ plain form
10834 1939853 1945539 1984538 2049715 2127358 2184274 2258011 2345240 2440831 2533446 2654011 2773385
10823 2773385 2905809 3049115 3197007 3396060 3623852 3854462 4113410 4413710 4813882
10814 4813882 5262655 5787385 6404990 7084494 7870603 8759551 9763083 10932533 12327319
10805 12327319 14084832 16395652 19521717 23823739 29920458 38628862 50923701 67403471
10797 67403471 87288758 108217899 128008408 145586436 159867148 169586390 172736977
10790 172736977 167936229 156425209 140952106 123506884 104574043 84643667 66353559
10783 66353559 52278742 42428877 35649734 30851925 27383621 24789757 22824798 21363653
10775 21363653 20318366 19622282 19249180 19164312 19364936 19862157 20689291 21882867 23496136
$$ packed form
10834A939853N686L8999O5177P7643N6916P3737Q7229R5591R2615J20565J19374
10823B773385J32424J43306J47892J99053K27792K30610K58948L00300M00172
10814D813882M48773N24730O17605O79504P86109Q88948J003532J169450J394786
10805A2327319J757513K310820L126065M302022O096719Q708404J2294839J6479770
10797F7403471J9885287K0929141J9790509J7578028J4280712R719242L150587
10790A72736977m800748j1511020j5473103j7445222j8932841j9930376j8290108
10783F6353559j4074817r849865o779143m797809l468304k593864j964959j461145
10775B1363653j045287o96084l73102q4868K00624M97221Q27134J193576J613269
$$ plain form
10766 23496136 25671189 28710999 33002184 39141980 47992742 60594585 77668672 98847537
10758 98847537 122718210 148193976 175404340 204236475 232522444 255511973 268069091
10751 268069091 268932353 260733121 246953242 228642026 204801700 175867801 144772619
10744 144772619 115592800 91266800 72773624 59380577 49728720 42645155 37305222
10737 37305222 33191948 29979363 27387375 25314452 23618714 22225418 21085753 20122807
10729 20122807 19374696 18898762 18676785 18781897 19238750 20175706 21819856 24395764 28323851
10720 28323851 34062399 42226636 53025890 65412648 77552838 88463386 98330129
10713 98330129 107571734 115085159 118046036 114748118 106045813 95256074 84787766 74046760
$$ packed form
10766B3496136K175053L039810M291185O139796Q850762J2601843J7074087K1178865
10758I8847537K3870673K5475766K7210364K8832135K8285969K2989529J2557118
10751B68069091Q63262q199232j3779879j8311216k3840326k8933899l1095182
10744A44772619k9179819k4326000j8493176j3393047r651857p083565n339933
10737C7305222m113274l212585k591988k072923j695738j393296j139665r62946
10729B0122807p48111m75934k21977J05112M56853R36956J644150K575908L928087
10720B8323851N738548Q164237J0799254J2386758J2140190J0910548R866743
10713I8330129R241605P513425K960877l297918q702305j0789739j0468308j0741006
$$ plain form
10705 74046760 62033210 49472313 38627863 30629921 25033165 21069549 18173263 15927685
10697 15927685 14161574 12658397 11404206 10343384 9406168 8592519 7887817 7263861 6753482
10688 6753482 6311625 5929381 5589653 5260700 4963239 4714483 4475102 4258803 4051871
10679 4051871 3857921 3680056 3536945 3386636 3246337 3167031 3091134 2993423 2923083 2821361
10669 2821361 2716712 2628987 2590128 2559140 2522610 2475262 2457581 2443957 2424235 2395807 2411374
10658 2411374 2441399 2438923 2413151 2353841 2286732 2207033 2077710 1977317 1924135 1853792 1780712
10647 1780712 1743289 1694046 1619810 1543127 1476294 1425107 1367567 1310960 1273941 1253392 1246312
10636 1246312 1217506 1165414 1133099 1129592 1117280 1095033 1089722 1098953 1115198 1111897 1114204 1160525
$$ packed form
10705G4046760j2013550j2560897j0844450p997942n596756l963616k896286k245578
10697A5927685j766111j503177j254191j060822r37216q13649p04702o23956n10379
10688F753482m41857l82244l39728l28953k97461k48756k39381k16299k06932
10679D051871j93950j77865j43111j50309j40299p9306p5897r7711p0340j01722
10669B821361j04649q7725l8859l0988l6530m7348j7681j3624j9722k8428J5567
10658B411374L0025k476k5772n9310o7109p9699j29323j00393n3182p0343p3080
10647A780712l7423m9243p4236p6683o6833n1187n7540n6607l7019k0549p080
10636A246312k8806n2092l2315l507j2312k2247n311R231J6245l301K307M6321
$$ plain form
10624 1160525 1227876 1276171 1312603 1370769 1432575 1490072 1519310 1563105 1579480 1528540 1471144
10613 1471144 1366219 1276642 1203316 1130988 1041141 970610 951399 944379 911765 851288 819712
10602 819712 798544 780143 768608 721774 692762 698138 698647 690363 701243 683076 652995 639539
10590 639539 609828 620458 625244 630943 626766 629737 627124 655379 727829 785578 828916 838100 849382
10577 849382 811934 787102 747874 752756 690785 619879 567136 548753 530289 525979 527423 525864
10565 525864 544754 532766 516443 525940 520075 500150 472150 452631 433662 433978 445328 428968
10553 428968 441129 479503 508626 508783 508142 511106 514992 522387 514781 506079 487687 485861 475377
10540 475377 478787 450821 434735 392683 370901 375071 353915 352326 349087 335657 339870 325659
$$ packed form
10624A160525O7351M8295L6432N8166O1806N7497K9238M3795J6375n0940n7396
10613A471144j04925q9577p3326p2328q9847p0531j9211p020l2614o0477l1576
10602H19712k1168j8401j1535m6834k9012N376N09q284J0880j8167l0081j3456
10590F39539k9711J0630M786N699m177K971k613K8255P2450N7749M3338R184J1282
10577H49382l7448k4832l9228M882o1971p0906n2743j8383j8464m310J444j559
10565E25864J8890j1988j6323R497n865j9925k8000j9519j8969L16J1350j6360
10553D28968J2161L8374K9123J57o41K964L886P395p606q702j8392j826j0484
10540D75377L410k7966j6086m2052k1782M170k1156j589l239j3430M213j4211
$$ plain form
10528 325659 335610 365643 346518 330599 318161 301145 298151 275765 284273 302053 312966 322018
10516 322018 330883 319746 329100 320869 324066 316074 327912 342858 316520 316904 348605 349906 323532
10503 323532 325577 321137 295239 280694 280635 277107 285412 271588 295520 297395 302259 311053 311424 300294
10489 300294 283218 279844 308826 302049 277109 268630 301743 304412 289648 275549 279233 298051
10477 298051 288158 295923 301719 291542 282549 275221 277479 283934 303188 300044 305929 326194 316623
10464 316623 324680 334261 317609 302225 293167 259534 238984 217829 224917 243874 251474 279612
10452 279612 310713 331671 329688 329098 293407 259056 240061 210871 202857 173810 180948 210786
10440 210786 229058 215853 227881 223695 188130 152219 148278 151729 151159 165710 179127 183660 184538
$$ packed form
10528C25659R951L0033j9125j5919j2438j7016k994k2386Q508J7780J0913R052
10516C22018Q865j1137R354q231L197p992J1838J4946k6338L84L1701J301k6374
10503C23532K045m440k5898j4545n9l528Q305j3824K3932J875M864Q794L71j1130
10489C00294j7076l374K8982o777k4940q479L3113K669j4764j4099L684J8818
10477B98051r893P765N796j0177q993p328K258O455J9254l144N885K0265r571
10464C16623Q057R581j6652j5384r058l3633k0550k1155P088J8957P600K8138
10452B79612L1101K0958j983n90l5691l4351j8995k9190q014k9047P138K9838
10440B10786J8272j3205J2028m186l5565l5911l941L451n70J4551J3417M533Q78
$$ plain form
10427 184538 183701 196021 187486 196466 197278 203406 187417 221741 212368 203191 214647 210084 209238 198053
10413 198053 226862 250723 260063 243445 242703 229886 221701 206726 220023 226908 201734 217655
10401 217655 223185 229784 216977 215109 193431 194658 224993 202031 177784 172611 165573 148237 168980
10388 168980 176637 179471 180841 176751 177594 171998 177048 199973 223459 225500 191514 193405 196474 196604
10374 196604 190035 191078 215258 242177 246675 253411 252255 270030 302138 304492 315595 335850 357172
10361 357172 414998 488364 545817 643314 775243 889145 966370 1016768 1025995 1011114 996034
10350 996034 978627 907545 781951 664842 534052 436798 377204 362393 360864 330729 302776
10339 302776 291606 303131 311480 312251 283946 296264 284971 240628 264713 298672 309789 312838
$$ packed form
10427A84538q37J2320q535Q980Q12O128j5989L4324r373r177J1456m563q46j1185
10413A98053K8809K3861R340j6618p42j2817q185j4975J3297O885k5174J5921
10401B17655N530O599j2807j868k1678J227L0335k2962k4247n173p038j7336K0743
10388A68980P657K834J370m090Q43n596N050K2925K3486K041l3986J891L069J30
10374A96604o569J043K4180K6919M498O736j156J7775L2108K354J1103K0255K1322
10361C57172N7826P3366N7453R7497J31929J13902P7225N0398R227j4881j5080
10350I96034j7407p1082j25594j17109j30790r7254n9594j4811j529l0135k7953
10339C02776j1170J1525Q349P71k8305J2318j1293m4343K4085L3959J1117L049
$$ plain form
10327 312838 328484 350112 385913 414323 427627 475604 556055 662644 807821 965112 1148253
10316 1148253 1324014 1507519 1657503 1715642 1707650 1623287 1504561 1391482 1257775 1083853
10306 1083853 936259 783262 647169 546620 478571 453235 407188 309133 279192 290043
10296 290043 278569 281470 280447 254045 248577 251278 245998 222855 218813 224300 233121 235763 229332
10283 229332 264991 310000 331679 400254 442030 520180 613067 700778 795600 869531 919489
10272 919489 917607 908342 868627 797303 676797 594924 497253 397335 359143 309557 265870 218693
10260 218693 208708 222163 197870 179940 169473 143856 123188 165307 198272 206805 174013 170748
10248 170748 166539 168253 175955 147316 120583 150374 152140 103697 109431 133403 125882 110942 112207
$$ packed form
10327C12838J5646K1628L5801K8410J3304M7977Q0451J06589J45177J57291J83141
10316A148253J75761J83505J49984N8139p992q4363j18726j13079j33707j73922
10306A083853j47594j52997j36093j00549o8049k5336m6047r8055k9941J0851
10296B90043j1474K901j023k6402n468K701n280k3143m042N487Q821K642o431
10283B29332L5659M5009K1679O8575M1776P8150R2887Q7711R4822P3931M9958
10272I19489j882r265l9715p1324j20506q1873r7671r9918l8192m9586m3687m7177
10260B18693r985J3455k4293j7930j0467k5617k0668M2119L2965Q533l2792l265
10248A70748m209J714P702k8639k6733K9791J766m8443N734K3972p521j4940J265
$$ plain form
10235 112207 109876 116612 97583 85417 73299 89692 129748 162619 151500 147166 174169 176463
10223 176463 177074 179947 186225 171993 145368 135568 122637 113652 135914 120757 129830 157992 170325
10210 170325 165803 154207 159259 185726 189808 190383 174374 189897 203643 219094 196762 178929
10198 178929 188092 204213 229978 239761 245035 258776 271578 276869 231317 199915 178422 172587
10186 172587 179130 168112 176548 184771 185406 192789 188531 172494 167582 176947 172263 173524 168698 177456
10172 177456 199313 219938 193654 205250 213639 221795 211461 212682 218622 211799 217044 187938 171530
10159 171530 186442 185780 181527 168771 152323 176293 169920 129430 114480 115695 126939 108760
10147 108760 76853 81079 96709 88298 78221 102613 133185 126042 132244 112019 114046 115757 109623
$$ packed form
10235A12207k331O736j9029j2166j2118J6393M0056L2871j1119m334K7003K294
10223A76463O11K873O278j4232k6625r800j2931q985K2262j5157R073K8162J2333
10210A70325m522j1596N052K6467M082N75j6009J5523J3746J5451k2332j7833
10198A78929R163J6121K5765R783N274J3741J2802N291m5552l1402k1493n835
10186A72587O543j1018Q436Q223O35P383m258j6037m912R365m684J261m826Q758
10172A77456K1857K0625k6284J1596Q389Q156j0334J221N940o823N245k9106j6408
10159A71530J4912o62m253j2756j6448K3970o373m0490j4950J215J1244j8179
10147A08760l1907M226J5630q411j0077K4392L0572p143O202k0225K027J711o134
$$ plain form
10134 109623 126452 113370 73992 52060 58765 86989 115617 103532 75359 96856 131017 117181
10122 117181 86500 83596 99205 103249 100887 104195 97828 105607 96657 92694 93245 87771 95978 95886
10108 95886 88059 91558 111853 109687 101756 101814 113145 121329 115562 113176 105610 83709 88809 86866
10094 86866 88392 87131 78379 101044 95292 98607 124319 117357 107260 95017 97044 96898 85963
10081 85963 86543 120335 141314 123196 101668 115289 133802 148724 160128 154269 143461 170539
10069 170539 159926 146238 137631 113619 109226 96455 94295 124075 128885 139424 130573 69389
10057 69389 70051 71467 85127 117825 112740 121297 132544 112796 114256 155209 162270 135174 132316
10044 132316 164135 180192 173221 149436 123077 85064 64585 61417 70195 71800 52197 44047
$$ packed form
10134A09623J6829j3082l9378k1932O705K8224K8628j2085k8173K1497L4161j3836
10122A17181l0681k904J5609M044k362L308o367P779q950l963N51n474Q207r2
10108I5886p827L499K0295k166p931N8J1331Q184n767k386p566k1901N100j943
10094H6866J526j261q752K2665n752L315K5712o962j0097j2243K027j46j0935
10081H5963N80L3792K0979j8118k1528J3621J8513J4922J1404n859j0808K7078
10069A70539j0613j3688q607k4012m393j2771k160K9780M810J0539q851o1184
10057F9389O62J416J3660L2698n085Q557J1247j9748J460M0953P061k7096k858
10044A32316L1819J6057o971k3785k6359l8013k0479l168Q778J605j9603q150
$$ plain form
10032 44047 54699 60618 67815 70098 99009 123182 135766 130366 152495 127781 126122 162786 183091
10019 183091 178282 182569 188953 224538 300972 398945 553201 834800 1283856 2072442 3136841
10008 3136841 3819689 3828250 3270806 2104186 1246422 834695 620921 482239 414596 377324
9998 377324 322465 275207 255843 203131 166668 173658 177039 151735 160473 186542 207901 212070
9986 212070 205717 197626 190976 210086 249075 287061 341874 373605 430012 478689 485531 467289
9974 467289 434861 364239 294268 236737 186095 169178 167967 162038 158794 148358 142131 129859
9962 129859 130061 133462 138517 128985 118333 136171 138225 102308 106931 113085 105684 84295 79412 82519
9948 82519 84447 93351 80829 73478 76276 93318 115505 124375 85053 75875 105495 113434 95836
$$ packed form
10032D4047J0652N919P197K283K8911K4173J2584n400K2129k4714j659L6664K0305
10019A83091m809M287O384L5585P6434R7973J54256K81599M49056P88586J064399
10008C136841O82848Q561n57444j166620q57764m11727k13774j38682o7643l7272
9998C77324n4859m7258j9364n2712l6463O990L381k5304Q738K6069K1359M169
9986B12070o353q091o650J9110L8989L7986N4813L1731N6407M8677O842j8242
9974D67289l2428p0622o9971n7531n0642j6917j211n929l244j0436o227j2272
9962A29859K02L401N055r532j0652J7838K054l5917M623O154p401k1389m883L107
9948H2519J928Q904j2522p351K798J7042K2187Q870l9322r178K9620P939j7598
$$ plain form
9935 95836 88517 85499 81306 70762 59659 75655 94581 113214 128715 134395 127772 110459 103224
9922 103224 110788 65092 36074 54044 49357 69744 81369 84725 93901 80038 69605 75126 89530
9909 89530 96208 96389 83631 76352 98360 100191 81104 85475 89113 92735 100888 115250 92139 67300
9895 67300 82066 68186 62709 73912 103601 119111 119822 146011 122680 103477 92625 73328
9883 73328 52606 57107 50991 45656 67667 77441 64965 64596 95870 121619 139783 175300 180719
9870 180719 184476 149766 125026 117432 125516 139910 116361 94118 74032 88974 101837 123611
9858 123611 128769 128672 123875 114798 115806 144252 149804 153538 143717 139026 134271 120198 117297 124136
9844 124136 137251 163203 181846 197343 214855 237364 294558 320185 344691 369755 355032 338603
$$ packed form
9935I5836p319l018m193j0544j1103J5996J8926J8633J5501N680o623j7313p235
9922A03224P564m5696k9018J7970m687K0387J1625L356R176j3863j0433N521J4404
9909H9530O678J81j2758p279K2008J831j9087M371L638L622Q153J4362k3111k4839
9895F7300J4766j3880n477J1203K9689J5510P11K6189k3331j9203j0852j9297
9883G3328k0722M501o116n335K2011R774j2476l69L1274K5749J8164L5517N419
9870A80719L757l4710k4740p594Q084J4394k3549k2243k0086J4942J2863K1774
9858A23611N158r7m797r077J008K8446N552L734r821m691m755j4073k901O839
9844A24136J3115K5952J8643J5497J7512K2509N7194K5627K4506K5064j4723j6429
$$ plain form
9832 338603 333468 327216 311372 290347 287747 315746 308801 275784 269846 249074 240474 246913 229745
9819 229745 203450 220607 227991 236430 248877 246852 264631 266152 262149 228021 206763 247118 261063
9806 261063 257626 267186 294566 297349 295979 290120 313730 322105 304198 309875 324315 293560 306024
9793 306024 319451 326616 364992 438445 501762 538935 597770 648725 728084 811589 932196 1122956
9781 1122956 1402763 1800240 2270548 2844812 3383696 3848679 4153430 4250805 4281772 4375204
9771 4375204 4693723 5307658 6118945 6900353 7348686 7305774 6781786 5965327 5201335 4696957
9761 4696957 4484461 4457685 4454147 4327400 3988395 3475629 2876404 2321202 1883464 1556970
9751 1556970 1317869 1109860 962180 865482 798161 731185 649301 591497 565514 515065 490203
$$ packed form
9832C38603n135o252j5844k1025k600K7999o945l3017n938k0772q600O439j7168
9819B29745k6295J7157P384Q439J2447k025J7779J521m003l4128k1258M0355J3945
9806B61063l437R560K7380K783j370n859K3610Q375j7907N677J4440l0755J2464
9793C06024J3427P165L8376P3453O3317L7173N8835N0955P9359Q3505J20607J90760
9781A122956K79807L97477M70308N74264N38884M64983L04751R7375L0967R3432
9771D375204L18519O13935Q11287P81408M48333m2912n23988q16459p63992n04378
9761D696957k12496k6776l538j26747l39005n12766n99225n55202m37738l26494
9751A556970k39101k08009j47680r6698o7321o6976q1884n7804k5983n0449k4862
$$ plain form
9740 490203 474807 442928 421396 393007 362051 346111 344693 325485 310580 280895 260995 263552
9728 263552 272772 288177 295078 310602 315620 333694 332740 329381 345193 334521 385952 441874 451369
9715 451369 445996 462621 456911 472686 473214 449312 468830 479427 502344 513143 461102 434694
9703 434694 447537 465831 447765 435780 448431 433565 431178 491774 615974 843787 1152800
9692 1152800 1508025 1853783 2125344 2162933 1967394 1651090 1285568 976301 800606 711616
9682 711616 616128 553081 538320 542739 549020 555168 548809 483953 413440 367774 370327 384937 371725
9669 371725 358596 305233 260192 224338 189571 163978 164026 119959 122405 138157 143921 112948 78780
9656 78780 79299 111542 113951 100400 80553 73824 67824 70342 100553 123860 123268 133455 132339 107757
$$ packed form
9740D90203j5396l1879k1532k8389l0956j5940j418j9208j4905k9685j9900K557
9728B63552R220J5405O901J5524N018J8074r54l359J5812j0672N1431N5922R495
9715D51369n373J6625n710J5775N28k3902J9518J0597K2917J0799n2041k6408
9703D34694J2843J8294j8066j1985J2651j4866k387O0596J24200K27813L09013
9692A152800L55225L45758K71561L7589j95539l16304l65522l09267j75695q8990
9682G11616r5488o3047j4761M419O281O148o359o4856p0513m5666K553J4610j3212
9669C71725j3129n3363m5041l5854l4767k5593M8m4067K446J5752N764l0973l4168
9656G8780N19L2243K409j3551j9847o729o000K518L0211K3307n92J0187j116k4582
$$ plain form
9642 107757 109553 124335 124277 85135 85820 109232 134320 143451 152362 149462 152776 154359 152067 150935
9628 150935 158873 146399 112772 125488 145143 134119 109471 133146 140468 134405 135760 146876
9616 146876 157335 173582 166844 160315 156244 146080 145059 168822 132344 117136 145537 132417
9604 132417 138062 138971 138500 118554 121305 120171 110896 110886 131717 145350 150294 129095 137145 147749
9590 147749 114056 96624 91977 92535 132017 156246 145784 135590 130835 124501 133204 118369 142133
9577 142133 117004 101159 102735 122416 142052 145609 165424 177068 204525 202951 203074 212002 249466
9564 249466 260056 255660 255372 247775 229657 213997 179454 138002 123773 121119 110873 98272 94882
9551 94882 73697 79294 118935 140443 136296 131109 126936 94917 99726 111073 135229 168604 208831
$$ packed form
9642A07757J796J4782n8l9142O85K3412K5088R131Q911k900L314J583k292j132
9628A50935P938j2474l3627J2716J9655j1024k4648K3675P322o063J355J1116
9616A46876J0459J6247o738o529m071j0164j021K3763l6478j5208K8401j3120
9604A32417N645R09m71j9946K751j134r275j0K0831J3633M944k1199Q050J0604
9590A47749l3693j7432m647N58L9482K4229j0462j0194m755o334Q703j4835K3764
9577A42133k5129j5845J576J9681J9636L557J9815J1644K7457j574J23Q928L7464
9564B49466J0590m396k88p597j8118j5660l4543m1452j4229k654j0246j2601l390
9551I4882k1185N597L9641K1508m147n187m173l2019M809J1347K4156L3375M0227
$$ plain form
9538 208831 213257 217077 231996 238233 208619 155951 130449 144471 146131 145033 159105 176477 188202
9525 188202 210684 217644 217218 218433 224639 222649 205505 209251 211706 214165 206482 192495 169653 158340
9511 158340 144815 178475 230697 235495 211966 226530 250376 241550 224238 263108 282533 290314
9499 290314 318851 356112 369578 395123 425921 466785 515220 571877 621162 684492 770687 868004
9487 868004 987656 1147213 1370839 1678200 2085917 2673450 3413500 4284929 5265930 6237950
9477 6237950 7160471 8052176 8864119 9418950 9548763 9182197 8426518 7509187 6579067 5664338
9467 5664338 4753019 3866126 3088077 2496733 2040972 1703341 1468089 1289429 1148783 1016857
9457 1016857 889552 817266 727171 671066 623008 564202 518359 530020 515608 459988 422695
$$ packed form
9538B08831M426L820J4919O237k9614n2668k5502J4022J660j098J4072J7372J1725
9525A88202K2482O960m26J215O206j990j7144L746K455K459p683j3987k2842j1313
9511A58340j3525L3660N2222M798k3529J4564K3846q826j7312L8870J9425P781
9499B90314K8537L7261J3466K5545L0798M0864M8435N6657M9285O3330Q6195R7317
9487H68004J19652J59557K23626L07361M07717N87533P40050Q71429R81001R72020
9477F237950R22521Q91705Q11943N54831J29813l66566p55679r17331r30120r14729
9467E664338r11319q86893p78049n91344m55761l37631k35252j78660j40646j31926
9457A016857j27305p2286r0095n6105m8058n8806m5843J1661j4412n5620l7293
$$ plain form
9446 422695 412445 417284 421046 426174 442943 486820 535431 567916 595791 662351 699643 728179
9434 728179 732392 730829 713354 656315 580686 538700 507236 425423 359046 312246 305298 295887
9422 295887 265667 254882 260700 252468 242300 250370 230490 221794 189075 161432 147991 175756
9410 175756 198750 219087 221933 224409 208553 221096 206942 188179 178786 158569 187900 206674
9398 206674 213811 220294 205562 238469 277279 267740 275036 313532 339622 363028 366192 399119 396704
9385 396704 407565 414799 397227 369038 326459 319383 256923 218573 221060 220045 195770 190821 185069
9372 185069 176665 166073 177930 182393 192673 209105 204806 199894 182559 166994 163938 169560 159051
9359 159051 159808 145531 153347 156724 164492 187897 201384 178993 169707 185860 169549 126250 121793
$$ packed form
9446D22695j0250M839L762N128J6769M3877M8611L2485K7875O6560L7292K8536
9434G28179M213j563j7475n7039p5629m1986l1464q1813o6377m6800o948r411
9422B95887l0220j0785N818q232j0168Q070j9880q696l2719k7643j3441K7765
9410A75756K2994K0337K846K476j5856J2543j4154j8763r393k0217K9331J8774
9398B06674P137O483j4732L2907L8810r539P296L8496K6090K3406L164L2927k415
9385C96704J0861P234j7572k8189m2579p076o2460l8350K487j015k4275m949n752
9372A85069q404j0592J1857M463J0280J6432m299m912j7335j5565l056N622j0509
9359A59051P57j4277P816L377P768K3405J3487k2391r286J6153j6311m3299m457
$$ plain form
9346 121793 142642 145753 155898 159171 159512 152898 164857 179724 167830 149285 146451 158667 203208
9333 203208 227406 200021 159700 146343 123577 120405 146016 142791 145618 160032 154961 161863 187973
9320 187973 181283 163027 146574 144415 137604 154157 161114 152715 131347 111396 123637 139579 129421
9307 129421 140556 150818 147568 153776 147584 131649 152724 129150 104974 108421 136003 140928 144552
9294 144552 155936 153051 150688 136262 144904 134776 152433 120207 98062 89345 111087 110819 90391
9281 90391 81824 76849 97232 113190 118234 123756 150358 169389 165139 180367 198512 190863 172609
9268 172609 192069 164874 162773 152554 151472 139384 130399 131599 156099 167020 159404 172956 134064
9255 134064 120638 134380 140817 148560 173808 169868 183318 184000 155401 158908 160421 127728 80986
$$ packed form
9346A21793K0849L111J0145L273L41o614J1959J4867j1894j8545k834J2216M4541
9333B03208K4198k7385m0321j3357k2766l172K5611l225K827J4414n071O902K6110
9320A87973o690j8256j6453k159o811J6553O957q399k1368j9951J2241J5942j0158
9307A29421J1135J0262l250O208o192j5935K1075k3574k4176L447K7582M925L624
9294A44552J1384k885k363j4426Q642j0128J7657l2226k2145q717K1742k68k0428
9281I0391q567m975K0383J5958N044N522K6602J9031m250J5228J8145p649j8254
9268A72609J9460k7195k101j0219j082j2088q985J200K4500J0921p616J3552l8892
9255A34064j3426J3742O437P743K5248l940J3450O82k8599L507J513l2693m6742
$$ plain form
9242 80986 82506 94155 117618 143472 152440 145953 141454 140161 152411 175433 178061 194240 195339
9229 195339 191236 191833 201247 193230 194713 173217 166880 178905 187374 170845 141400 145644 159308
9216 159308 170794 160809 149977 135526 152689 137218 113117 97243 125353 153896 155052 120194
9204 120194 116495 143057 144347 141706 159497 149617 162213 170892 157132 137407 142047 146881 163107
9191 163107 186107 185260 199829 191474 203899 210764 212450 195854 176426 170384 154144 142296 132559
9178 132559 137394 169441 171195 177803 200114 213290 194713 182306 200802 199262 162326 171213 205046
9165 205046 210259 215078 201902 200547 201619 188440 193084 192703 183077 184338 208003 211309 229997 224109
9151 224109 198514 192609 193561 197239 193709 167676 168654 182840 181708 197335 214253 207704 225178
$$ packed form
9242H0986J520J1649K3463K5854Q968o487m499j293J2250K3022K628J6179J099
9229A95339m103N97R414q017J483k1496o337J2025Q469j6529k9445M244J3664
9216A59308J1486r985j0832j4451J7163j5471k4101j5874K8110K8543J156l4858
9204A20194l699K6562J290k641J7791r880J2596Q679j3760j9725M640M834J6226
9191A63107K3000q47J4569q355J2425O865J686j6596j9428o042j6240j1848r737
9178A32559M835L2047J754O608K2311J3176j8577j2407J8496j540l6936Q887L3833
9165B05046N213M819j3176j355J072j3179M644l81r626J261K3665L306J8688n888
9151B24109k5595n905R52L678l530k6033R78J4186j132J5627J6918o549J7474
$$ plain form
9138 225178 251043 253019 221167 214254 200643 169812 169970 164000 165165 172662 167967 201389 195119
9125 195119 167376 185687 205739 220506 244637 273122 275327 288452 302564 319463 328293 297050
9113 297050 269466 269215 299331 304272 299769 305111 312083 367817 418308 458862 562276 686049
9101 686049 810049 923034 950807 880017 722680 550892 467619 407968 348541 298702 281974
9090 281974 293720 332282 344582 333512 307922 296045 298846 296613 305422 303741 297544 291812 308872
9077 308872 318304 332048 345317 350581 359743 358678 371415 381288 375969 358696 340496 309871 329689
9064 329689 332823 318714 331357 362413 348848 350750 365943 385447 396666 425118 415052 415101 412844
9051 412844 344234 333847 350543 334000 322928 330512 335292 338700 316408 301787 334648 345764
$$ packed form
9138B25178K5865J976l1852o913j3611l0831J58n970J165P497m695L3422o270
9125A95119k7743J8311K0052J4767K4131K8485K205J3125J4112J6899Q830l1243
9113B97050k7584k51L0116M941m503N342O972N5734N0491M0554J03414J23773
9101F86049J24000J12985K7773p0790j57337j71788q3273n9651n9427m9839j6728
9090B81974J1746L8562J2300j1070k5590j1877K801k233Q809j681o197n732J7060
9077C08872R432J3744J3269N264R162j065J2737R873n319j7273j8200l0625J9818
9064C29689L134j4109J2643L1056j3565J902J5193J9504J1219K8452j0066M9k257
9051D12844o8610j0387J6696j6543j1072P584M780L408k2292j4621L2861J1116
$$ plain form
9039 345764 369643 360463 336784 356652 353713 351098 354172 356179 352383 355564 344997 337058 337570 322242
9025 322242 336138 367188 403682 404464 389309 404978 423423 454343 489562 490973 504046 511601
9013 511601 494601 481761 472282 450736 435159 435820 435340 435234 457718 438356 403419 370777 361152
9000 361152 400087 414985 418472 431222 433039 425037 414489 439610 456601 447250 456733 449412 425296
8987 425296 428083 468742 519922 531507 501824 487492 489964 498129 506602 514251 546162 574492 575050
8974 575050 573556 557996 544157 553119 512742 486395 511259 544597 565137 584673 564825 569785
8962 569785 592739 624226 601331 576472 573916 569743 559125 562079 573931 578110 588012 615624 623167
8949 623167 615525 616708 626193 627768 622025 625485 630571 642243 673873 719505 741535 745373 738114
$$ packed form
9039C45764K3879r180k3679J9868k939k615L074K007l796L181j0567p939N12j5328
9025C22242J3896L1050L6494P82j5155J5669J8445L0920L5219J411J3073P555
9013E11601j7000j2840r479k1546j5577O61m80j06K2484j9362l4937l2642r625
9000C61152L8935J4898L487J2750J817q002j0548K5121J6991r351R483p321k4116
8987D25296K787M0659N1180J1585k9683j4332K472Q165Q473P649L1911K8330N58
8974E75050j494j5560j3839Q962m0377k6347K4864L3338K0540J9536j9848M960
8962E69785K2954L1487k2895k4859k556m173j0618K954J1852M179R902K7612P543
8949F23167p642J183R485J575n743L460N086J1672L1630M5632K2030L838p259
$$ plain form
8936 738114 728976 734794 751192 771062 772025 791280 800160 789533 776623 797407 809877 810870 811269
8923 811269 810681 816728 818479 835560 864223 891395 915134 931646 955585 992296 999533 1023221 1032450
8910 1032450 1041060 1044154 1026380 1009051 1018436 1049337 1068384 1100382 1132848 1146303 1158044 1156612
8898 1156612 1158255 1178983 1203397 1258489 1281813 1277997 1282820 1275748 1246674 1232534 1209765 1211352
8886 1211352 1219198 1230102 1264050 1284599 1266482 1259001 1284082 1317702 1346641 1353051 1362795 1363868
8874 1363868 1365490 1397733 1434762 1474513 1437373 1435904 1476550 1474419 1453754 1468045 1504955 1539163
8862 1539163 1530590 1538611 1550946 1572000 1608297 1650032 1699998 1736399 1741147 1748367 1742606 1761139
8850 1761139 1763217 1806351 1839180 1842691 1883216 1918796 1918836 1925614 1948810 1990720 2043770 2047455 2092732
$$ packed form
8936G38114r138N818J6398J9870R63J9255Q880j0627j2910K0784J2470R93L99
8923H11269n88O047J751J7081K8663K7172K3739J6512K3939L6711P237K3688R229
8910A032450Q610L094j7774j7329R385L0901J9047L1998L2466J3455J1741j432
8898A156612J643K0728K4414N5092K3324l816M823p072k9074j4140k2769J587
8886A211352P846J0904L3948K0549j8117p481K5081L3620K8939O410R744J073
8874A363868J622L2243L7029L9751l7140j469M0646k131k0665J4291L6910L4208
8862A539163q573Q021J2335K1054L6297M1735M9966L6401M748P220n761J8533
8850A761139K078M3134L2829L511M0525L5580M0O778K3196M1910N3050L685M5277
$$ plain form
8837 2092732 2137257 2165542 2185586 2237440 2295629 2315906 2357712 2409442 2457795 2489831 2522220
8826 2522220 2560632 2614552 2675157 2714217 2763742 2817434 2871438 2920065 2964778 3011307 3069907
8815 3069907 3137438 3215203 3292873 3342894 3381704 3426315 3508623 3575415 3647429 3729582 3789510
8804 3789510 3828388 3916456 3985446 4030670 4089318 4162292 4208796 4305572 4388429 4448906 4526314
8793 4526314 4578387 4654585 4779598 4861405 4928032 4992473 5128461 5262665 5366727 5499051
8783 5499051 5627307 5752597 5899267 6038146 6182338 6341918 6517300 6713735 6916044 7114973
8773 7114973 7289976 7476478 7669838 7878220 8112010 8375844 8616588 8839835 9089458 9365644
8763 9365644 9658729 9962236 10293928 10664744 11010660 11371479 11781371 12201608 12610599 13086430
$$ packed form
8837B092732M4525K8285K0044N1854N8189K0277M1806N1730M8353L2036L2389
8826B522220L8412N3920O0605L9060M9525N3692N4004M8627M4713M6529N8600
8815C069907O7531P7765P7670N0021L8810M4611Q2308O6792P2014Q2153N9928
8804C789510L8878Q8068O8990M5224N8648P2974M6504R6776Q2857O0477P7408
8793D526314N2073P6198J25013Q1807O6627O4441J35988J34204J04062J32324
8783E499051J28256J25290J46670J38879J44192J59580J75382J96435K02309J98929
8773G114973J75003J86502J93360K08382K33790K63834K40744K23247K49623K76186
8763I365644K93085L03507L31692L70816L45916L60819M09892M20237M08991M75831
$$ plain form
8753 13086430 13580700 14096885 14647117 15207763 15799455 16403672 17088982 17821540 18594133
8744 18594133 19399452 20249284 21164918 22160972 23230584 24341060 25569760 26891667 28286532
8735 28286532 29794707 31404978 33148176 35031946 37088609 39314626 41761676 44419841
8727 44419841 47265195 50344629 53716882 57442067 61497188 65927753 70771260 76036926
8719 76036926 81795501 88080677 94953608 102427506 110547911 119299926 128621807 138505643
8711 138505643 148867031 159560953 170376674 181019086 191147528 200443542 208472181
8704 208472181 214785030 219129915 221263390 221027562 218446299 213762193 207216723 199179308
8696 199179308 190026843 180132955 169862839 159516462 149349970 139549068 130203306 121347598
$$ packed form
8753A3086430M94270N16185N50232N60646N91692O04217O85310P32558P72593
8744A8594133Q05319Q49832R15634R96054J069612J110476J228700J321907J394865
8735B8286532J508175J610271J743198J883770K056663K226017K447050K658165
8727D4419841K845354L079434L372253L725185M055121M430565M843507N265666
8719G6036926N758575O285176O872931P473898Q120405Q752015R321881R883836
8711A38505643J0361388J0693922J0815721J0642412J0128442R296014Q028639
8704B08472181O312849M344885K133475k35828k581263m684106o545470q037415
8696A99179308r152465r893888j0270116j0346377j0166492r800902r345762q855708
$$ plain form
8688 121347598 113054041 105323381 98174180 91582302 85506458 79904559 74732998 69966446
8680 69966446 65608615 61628197 57967688 54592187 51472106 48590688 45952341 43487770
8672 43487770 41215468 39093387 37118911 35308411 33620828 32048915 30580634 29200133
8664 29200133 27915496 26703871 25559098 24449057 23427406 22467357 21563013 20722354 19943466
8655 19943466 19217327 18513388 17809838 17172498 16566185 15974988 15414676 14885387 14418153
8646 14418153 13960783 13523190 13118964 12739287 12357256 11993758 11628536 11276265 10963877
8637 10963877 10645598 10336726 10030255 9729481 9443547 9196178 8965252 8740663 8538949
8628 8538949 8305046 8094261 7895613 7687443 7484628 7329167 7199012 7045551 6912630 6743539
$$ packed form
8688A21347598q293557p730660p149201o591878o075844n601899n171561m766552
8680F9966446m357831l980418l660509l375501l120081k881418k638347k464571
8672D3487770k272302k122081j974476j810500j687583j571913j468281j380501
8664B9200133j284637j211625j144773j110041j021651r60049r04344q40659p78888
8655A9943466p26139p03939p03550o37340o06313n91197n60312n29289m67234
8646A4418153m57370m37593m04226l79677l82031l63498l65222l52271l12388
8637A0963877l18279l08872l06471l00774k85934k47369k30926k24589k01714
8628H538949k33903k10785j98648k08170k02815j55461j30155j53461j32921j69091
$$ plain form
8618 6743539 6570108 6430953 6307990 6191143 6071318 5970885 5841818 5766724 5678092 5575272
8608 5575272 5507300 5405784 5313663 5197313 5086046 4959441 4849999 4754089 4669589 4551787
8598 4551787 4447817 4347413 4299529 4211089 4108450 4018896 3938933 3862937 3802457 3719267 3634466
8587 3634466 3569283 3496379 3458009 3412236 3396512 3358637 3288996 3207189 3132205 3106141 3059086
8576 3059086 3005357 2920226 2871737 2828088 2798765 2770744 2751677 2716466 2675326 2663095 2641498
8565 2641498 2582837 2523301 2500132 2475627 2460967 2440474 2411096 2356370 2307422 2271566 2240651
8554 2240651 2199243 2148444 2096772 2054243 2044245 2001081 1995239 1972854 1949234 1924395 1887526 1862789
8542 1862789 1818524 1783293 1771964 1772510 1755257 1726526 1705977 1689679 1650912 1614244 1609731 1602463
$$ packed form
8618F743539j73431j39155j22963j16847j19825j00433j29067p5094q8632j02820
8608E575272o7972j01516r2121j16350j11267j26605j09442r5910q4500j17802
8598D551787j03970j00404m7884q8440j02639q9554p9963p5996o0480q3190q4801
8587C634466o5183p2904l8370m5773j5724l7875o9641q1807p4984k6064m7055
8576C059086n3729q5131m8489m3649k9323k8021j9067l5211m1140j2231k1597
8565B641498n8661n9536k3169k4505j4660k0493k9378n4726m8948l5856l0915
8554B240651m1408n0799n1672m2529r998m3164n842k2385k3620k4839l6869k4737
8542A862789m4265l5231j1329N46j7253k8731k0549j6298l8767l6668m513p268
$$ plain form
8530 1602463 1598473 1585674 1559541 1542910 1555427 1541875 1543999 1548547 1516572 1494231 1477724 1459027
8518 1459027 1445469 1425895 1414032 1416028 1401248 1358599 1341937 1345266 1334384 1336973 1340971 1326799
8506 1326799 1288664 1269584 1242066 1235460 1208370 1191290 1180373 1166626 1173161 1179012 1178912 1186452 1180566
8493 1180566 1173050 1152238 1154854 1177327 1161857 1127159 1109730 1094283 1090885 1060445 1042399 1053546
8481 1053546 1048899 1029591 1029963 1025617 1029441 1020797 1041408 1055232 1040533 1046405 1046536 1042302 1005649
8468 1005649 972915 972605 988502 948895 925529 936569 934265 935721 954463 958458 944532 922938
8456 922938 929457 940405 957940 947939 922167 904401 909279 865778 827661 806421 797082 789394
8444 789394 814888 824566 834699 843774 850368 852851 854917 855896 843289 822557 831872 831978 803015 763825
$$ packed form
8530A602463l990j2799k6133j6631J2517j3552K124M548l1975k2341j6507j8697
8518A459027j3558j9574j1863J996j4780m2649j6662L329j0882K589L998j4172
8506A326799l8135j9080k7518o606k7090j7080j0917j3747O535N851j00P540n886
8493A180566p516k0812K616K2473j5470l4698j7429j5447l398l0440j8046J1147
8481A053546m647j9308L72m346L824q644K0611J3824j4699N872J31m234l6653
8468A005649l2734l10J5897l9607k3366J1040k304J456J8742L995j3926k1594
8456I22938O519J0948J7535j0001k5772j7766M878m3501l8117k1240r339p688
8444G89394K5494R678J0133R075O594K483K066R79j2607k0732R315J06k8963l9190
$$ plain form
8430 763825 743754 752131 758975 741863 717657 718595 705486 699028 703492 703188 711395 703282 686545 680593
8416 680593 698177 686456 663844 649295 660254 650107 641816 641941 655164 668650 630432 631329 648132
8403 648132 611885 589659 596192 578229 592719 607749 609200 608905 590833 595389 588081 584199 588284
8390 588284 584585 573332 582087 582701 551294 542439 517259 525039 542684 546933 527078 519206 501779
8377 501779 482223 485924 479292 474805 470173 478874 495758 527456 531932 534682 527377 495097 503520
8364 503520 541959 552538 549919 542142 558275 562654 565364 531105 520031 518898 502368 482110 487351
8351 487351 490041 481906 486519 477993 475710 466861 443180 426388 436486 441370 397501 373263 390848
8338 390848 389005 387681 416030 435113 399416 382112 405850 398004 402228 393014 396991 402874 398199
$$ packed form
8430G63825k0071Q377O844j7112k4206R38j3109o458M464l04Q207q113j6737n952
8416F80593J7584j1721k2612j4549J0959j0147q291J25J3223J3486l8218Q97J6803
8403F48132l6247k2226O533j7963J4490J5030J451k95j8072M556p308l882M085
8390E88284l699j1253Q755O14l1407q855k5180P780J7645M249j9855p872j7427
8377E01779j9556L701o632m487m632Q701J6884L1698M476K750p305l2280Q423
8364E03520L8439J0579k619p777J6133M379K710l4259j1074j133j6530k0258N241
8351D87351K690q135M613q526k283q849k3681j6792J0098M884m3869k4238J7585
8338C90848j843j324K8349J9083l5697j7304K3738p846M224r214L977N883m675
$$ plain form
8325 398199 384906 378459 378704 379358 390843 389637 387931 390185 377849 355037 374920 348467 352933
8312 352933 351752 365206 352592 341419 356081 371519 355150 362140 365152 359103 395800 433792
8300 433792 452158 447890 456138 480138 525676 588546 613028 635922 649808 627881 585534 547024
8288 547024 546708 547504 567895 570150 551828 527078 486102 423114 388794 364091 370963 344769 348785
8275 348785 360857 330044 319662 321326 323601 341267 337689 334857 354720 328644 336772 345229 350555
8262 350555 366120 382775 427293 479634 505275 511116 551996 669200 803863 893691 940527
8251 940527 931513 854967 760561 693301 658398 617965 580185 555337 489957 454168 413265 388043
8239 388043 389771 375822 348951 320811 303330 273272 270992 262713 256935 272463 294616 282122
$$ packed form
8325C98199j3293o447K45O54J1485j206j706K254j2336k2812J9883k6453M466
8312C52933j181J3454j2614j1173J4662J5438j6369O990L012o049L6697L7992
8300D33792J8366m268Q248K4000M5538O2870K4482K2894J3886k1927m2347l8510
8288E47024l16P96K0391K255j8322k4750m0976o2988l4320k4703O872k6194M016
8275C48785J2072l0813j0382J664K275J7666l578k832J9863k6076Q128Q457N326
8262C50555J5565J6655M4518N2341K5641N841M0880J17204J34663Q9828M6836
8251I40527r014p6546r4406o7260l4903m0433l7780k4848o5380l5789m0903k5222
8239C88043J728j3949k6871k8140j7481l0058k280q279n778J5528K2153j2494
$$ plain form
8227 282122 256515 231563 240710 291722 311395 322522 325693 309281 303778 322436 342248 350061
8215 350061 411778 459821 500859 553933 567783 489691 414723 353707 316626 308619 288562 250796
8203 250796 254425 255696 255309 242404 246945 241913 230184 209058 231783 257800 256996 222925 214165
8190 214165 213978 229150 266585 261995 254294 241237 239850 203601 197756 188156 183648 221373 213189
8177 213189 222889 214949 182765 165578 173798 202999 208480 224311 254204 250946 243520 219861 218751
8164 218751 191537 195716 190839 207070 214585 213931 196771 163623 162320 192624 219116 214162 192149
8151 192149 185067 182611 159707 162913 183110 194863 167727 153572 169885 170069 183962 193751 174442
8138 174442 173776 159781 161759 166080 160225 144267 118978 122098 128548 129436 105153 101954 134555 164515
$$ packed form
8227B82122k5607k4952R147N1012J9673J1127L171j6412n503J8658J9812P813
8215C50061O1717M8043M1038N3074J3850p8092p4968o1016l7081q007k0057l7766
8203B50796L629J271l87j2905M541n032j1729k1126K2725K6017q04l4071q760
8190B14165j87J5172L7435m590p701j3057j387l6249n845r600m508L7725q184
8177B13189R700p940l2184j7187Q220K9201N481J5831K9893l258p426k3659j110
8164B18751k7214M179m877J6231P515o54j7160l3148j303L0304K6492m954k2013
8151A92149p082k456k2904L206K0197J1753k7136j4155J6313J84J3893R789j9309
8138A74442o66j3995J978M321n855j5958k5289L120O450Q88k4283l199L2601K9960
$$ plain form
8124 164515 175910 163978 135905 143914 152806 160364 177280 210719 219217 196325 177750 185083 194564
8111 194564 168152 145122 137614 149101 166141 171140 151093 148880 155188 138780 139287 159128 172255
8098 172255 162715 175107 197520 172961 168726 160393 165805 184698 199070 190771 183240 168262 169724
8085 169724 154045 148183 138059 129902 139581 137597 142870 139835 137486 143158 144022 130582 115483 141176
8071 141176 138331 125699 139354 142431 165796 143802 135984 150811 165391 176826 174482 178374 183883
8058 183883 165498 129220 119340 140962 141104 131720 134607 144732 150668 156076 148422 144513 143991 158066
8044 158066 152441 151727 147614 144418 138284 123550 120403 106733 84663 72008 78026 97882 126434
8031 126434 124918 111146 90193 86079 129546 125512 129091 130296 126901 128668 132554 144602 125311
$$ packed form
8124A64515J1395j1932k8073Q009Q892P558J6916L3439Q498k2892j8575P333R481
8111A94564k6412k3030p508J1487J7040M999k0047k213O308j6408N07J9841J3127
8098A72255r540J2392K2413k4559m235q333N412J8893J4372q299p531j4978J462
8085A69724j5679n862j0124q157R679j984N273l035k349N672Q64j3440j5099K5693
8071A41176k845j2632J3655L077K3365k1994p818J4827J4580J1435k344L892N509
8058A83883j8385l6278r880K1622J42r384K887J0125N936N408p654l909n22J4075
8044A58066n625p14m113l196o134j4734l147j3670k2070j2655O018J9856K8552
8031A26434j516j3772k0953m114M3467m034L579J205l395J767L886J2048j9291
$$ plain form
8018 125311 105302 95559 93982 94009 99068 119269 133714 125127 105531 122961 130032 120495 100373
8005 100373 120880 132386 122356 104487 93687 88254 107313 117987 115364 124182 122435 125685 94712
7992 94712 85911 97026 104988 108701 123397 145272 156334 153946 127383 102355 79893 105231 96544
7979 96544 82007 111633 138602 135259 123703 131557 133342 109938 111072 124658 120786 109826 122254
7966 122254 116251 114097 114316 145360 172327 164979 142324 139571 138829 132158 136887 120128 106520 126855
7952 126855 140458 129313 136354 158761 171938 160640 152676 134154 105111 78394 65799 96124
7940 96124 127457 120185 101161 93742 73967 90941 123018 120360 109731 109376 127661 97112 99475
7927 99475 132769 136475 137924 130812 126970 109096 99032 119486 114901 122106 125543 116251 103630
$$ packed form
8018A25311k0009r743j577K7N059K0201J4445q587j9596J7430P071r537k0122
8005A00373K0507J1506j0030j7869j0800n433J9059J0674k623Q818j747L250l0973
7992I4712q801J1115P962L713J4696K1875J1062k388k6563k5028k2462K5338q687
7979I6544j4537K9626K6969l343j1556P854J785k3404J134J3586l872j0960J2428
7966A22254o003k154K19L1044K6967p348k2655k753p42o671M729j6759j3608K0335
7952A26855J3603j1145P041K2407J3177j1298p964j8522k9043k6717j2595L0325
7940I6124L1333p272j9024p419j9775J6974L2077k658j0629l55J8285l0549K363
7927I9475L3294L706J449p112l842j7874j0064K0454m585P205L437r292j2621
$$ plain form
7914 103630 125944 134920 156671 147726 115231 122830 144418 149897 138548 116767 92382 71884
7902 71884 51193 51181 66113 98397 113848 86256 51456 47185 56428 50893 53031 89390 104389
7889 104389 101562 107201 105769 91208 97270 119782 133630 133089 112404 91476 114542 140279 121029
7876 121029 120609 114222 118447 94663 86767 103204 131903 130238 125981 112855 124183 126302 126465 132588
7862 132588 124347 110747 76400 57231 52772 60252 77428 98664 106227 99293 79869 75684 57095
7849 57095 71691 82525 79957 90409 86509 75985 84138 96997 113081 123248 140199 106872
7837 106872 86290 101663 127536 147985 103286 85196 88093 59352 44503 72793 65589 58439
7825 58439 74741 68580 76724 101737 98117 107365 131356 111620 105925 92935 85106 60509 46345
$$ packed form
7914A03630K2314Q976K1751q945l2495P599K1588N479j1349k1781k4385k0498
7902G1884k0691j2J4932L2284J5451k7592l4800m271R243n535K138L6359J4999
7889A04389k827N639j432j4561O062K2512J3848n41k0685k0928K3066K5737j9250
7876A21029m20o387M225k3784p896J6437K8699j665m257j3126J1328K119J63O123
7862A32588q241j3600l4347j9169m459P480J7176K1236P563o934j9424m185j8589
7849E7095J4596J0834k568J0452l900j0524Q153J2859J6084J0167J6951l3327
7837A06872k0582J5373K5873K0449m4699j8090K897k8741j4849K8290p204p150
7825E8439J6302o161Q144K5013l620R248K3991j9736n695j2990p829k4597j4164
$$ plain form
7812 46345 40033 42902 63349 86957 97432 84832 67208 53060 73089 84336 84186 72264 64925
7799 64925 100071 93439 57552 39404 25170 24643 31423 38056 50504 28681 31106 34949 20127
7786 20127 9350 36068 36341 40783 58499 64763 66430 41313 28228 20056 47647 61152 84659
7773 84659 82214 76733 97176 111014 82957 46929 40573 28612 48738 69948 81741 68080
7761 68080 49193 46053 79305 65247 58704 65322 68555 97666 84922 80328 84316 94532 73382
7748 73382 70882 77744 58871 41965 36737 55139 66083 58393 66221 57358 49055 57750 60306 51027
7734 51027 41203 66012 95733 109003 112016 69479 19588 10468 11074 31446 40631 30578 39519
7721 39519 46450 73403 67164 73810 94447 107985 103677 85772 75510 69418 57528 45180 39109
$$ packed form
7812D6345o312K869K0447K3608J0475j2600j7624j4148K0029J1247j50j1922p339
7799F4925L5146o632l5887j8148j4234n27O780O633J2448k1823K425L843j4822
7786B0127j0777K6718K73M442J7716O264J667k5117j3085q172K7591J3505K3507
7773H4659k445n481K0443J3838k8057l6028o356j1961K0126K1210J1793j3661
7761F8080j8887l140L3252j4058o543O618L233K9111j2744m594L988J0216k1150
7748G3382k500O862j8873j6906n228J8402J0944p690P828q863q303Q695K556r279
7734E1027r824K4809K9721J3270L013m2537m9891r120O06K0372R185j0053Q941
7721C9519O931K6953o239O646K0637J3538m308j7905j0262o092j1890j2348o071
$$ plain form
7708 39109 66373 108509 87691 75394 63288 45945 30570 6036 39573 63925 84959 66538
7696 66538 75848 117782 116047 140104 129799 120652 121611 86852 65508 78630 61950 48733 38331
7683 38331 29892 25191 1439 -2478 15841 12956 407 8414 8902 30706 50549 48893 35011
7670 35011 30749 30519 31787 29949 36653 29681 16666 22591 17025 32489 61897 68978 58617 29873
7656 29873 27289 17535 2238 -6000 458 26584 38136 58116 55948 35503 37505 22976 18923
7643 18923 28441 52992 55839 25435 2816 -4071 19227 37493 32700 21467 13921 -14635 -25822
7630 -25822 10062 37768 60901 57638 38874 48772 69987 55426 38555 56740 53622 37365
7618 37365 24820 15100 9207 7362 29178 55419 41831 19516 32099 32809 17760 14449 27263
$$ packed form
7708C9109K7264M2136k0818j2297j2106j7343j5375k4534L3537K4352K1034j8421
7696F6538R310M1934j735K4057j0305r147R59l4759k1344J3122j6680j3217j0402
7683C8331q439m701k3752l917J8319k885j2549Q007M88K1804J9843j656j3882
7670C5011m262k30J268j838O704o972j3015N925n566J5464K9408P081j0361k8744
7656B9873k584r754j5297q238O458K6126J1552J9980k168k0445K002j4529m053
7643A8923R518K4551K847l0404k2619o887K3298J8266m793j1233p546k8556j1187
7630b5822L5884K7706K3133l263j8764R898K1215j4561j6871J8185l118j6257
7618C7365j2545r720n893j845K1816K6241j3588k2315J2583P10j5049l311J2814
$$ plain form
7605 27263 28659 25009 40575 26071 -7272 2758 10350 23989 32800 22044 15507 19827 40097
7592 40097 53861 51961 64263 85756 99396 96755 82149 57408 31784 29164 20533 1217 3914
7579 3914 23300 58525 86191 41373 9137 26666 27753 6190 7365 13033 27179 23417 32516
7566 32516 29268 34891 38851 40038 35840 15981 17030 43712 60540 59499 45107 32115 69915
7553 69915 72350 56882 41475 31329 36586 30828 45662 63839 58405 31143 6094 -40609 -25157
7540 -25157 -5668 6857 41826 55765 42548 39258 45524 64972 64793 57171 48115 34992 19038
7527 19038 24026 25945 38796 40190 60475 65480 41333 43393 48058 10245 4356 18453 38166
7514 38166 45485 21204 17893 43947 41992 49018 14982 24487 36897 54075 72602 59095 52887
$$ packed form
7605B7263J396l650J5566j4504l3343J0030P592J3639Q811j0756o537M320K0270
7592D0097J3764j900J2302K1493J3640k641j4606k4741k5624k620q631j9316K697
7579C914J9386L5225K7666m4818l2236J7529J087k1563J175N668J4146l762R099
7566C2516l248N623L960J187m198j9859J049K6682J6828j041j4392j2992L7800
7553F9915K435j5468j5407j0146N257n758J4834J8177n434k7262k5049m6703J5452
7540b5157J9489J2525L4969J3939j3217l290O266J9448j79p622r056j3123j5954
7527A9038M988J919J2851J394K0285N005k4147K060M665l7813n889J4097J9713
7514C8166P319k4281l311K6054j955P026l4036R505J2410J7178J8527j3507o208
$$ plain form
7501 52887 56945 38050 25910 45171 56005 67192 49303 35076 24351 10505 -12331 -16178
7489 -16178 -12870 4835 24251 15267 37617 48216 42021 22987 26814 9514 583 -21957 -47161
7476 -47161 -21364 -9215 7273 36367 15287 -16731 6078 18152 -6128 -28830 -13203 -8768
7464 -8768 -427 4388 -9920 8991 1212 -2994 -10609 -5176 14473 38676 54416 71351 54811
7451 54811 33018 17711 14359 15570 24897 27240 -10024 -15184 -33415 -29521 3005 35451 42605
7438 42605 82594 106831 88028 69159 41284 29693 -6883 -39314 -30430 3780 8593 28577
7426 28577 46378 44347 30920 37980 35639 62022 62214 29157 25212 39180 52760 80015 97565
7413 97565 61436 10699 8518 19070 6026 14502 31560 36376 31897 62395 55188 42139 19978
$$ packed form
7501E2887M058j8895j2140J9261J0834J1187j7889j4227j0725j3846k2836l847
7489a6178L308J7705J9416q984K2350J0599o195j9034L827j7300q931k2540k5204
7476d7161K5797J2149J6488K9094k1080l2018K2809J2074k4280k2702J5627M435
7464h768Q341M815j4308J8911p779m206p615N433J9649K4203J5740J6935j6540
7451E4811k1793j5307l352J211R327K343l7264n160j8231L894L2526L2446P154
7438D2605L9989K4237j8803j8869k7875j1591l6576l2431Q884L4210M813J9984
7426B8577J7801k031j3427P060k341K6383J92l3057l945J3968J3580K7255J7550
7413I7565l6129n0737k181J0552j3044Q476J7058M816m479L0498p207j3049k2161
$$ plain form
7400 19978 11522 11601 20828 27188 25995 13059 6140 3384 6677 -45 -11637 -3076 36687 32156
7386 32156 14354 14412 17746 1325 -2845 8278 -714 3576 26007 8944 -12235 -6489 18111
7373 18111 27146 53269 57577 44051 26107 738 -24923 -8193 23748 22616 22769 46826 30958
7360 30958 43199 31692 54652 45653 22413 677 -8240 -9867 -11401 7154 36078 52737 52505
7347 52505 38106 18657 26363 29046 -7605 17110 45235 18463 4673 6031 8261 9434 21572
7334 21572 38790 52881 37047 20683 14439 -1189 -477 5069 24845 21974 33038 25436 13992
7321 13992 13186 14274 12337 10234 21257 34121 34848 20387 -6162 -2784 2072 18419 30496 23113
7307 23113 10542 12672 25013 33604 11999 -4982 -16425 -6062 2958 26173 36778 18276
$$ packed form
7400A9978q456P9R227O360j193j2936o919k756L293o722j1592Q561L9763m531
7386C2156j7802N8L334j6421m170J1123q992M290K2431j7063k1179N746K4600
7373A8111R035K6123M308j3526j7944k5369k5661J6730L1941j132J53K4057j5868
7360C0958J2241j1507K2960q999k3240k1736q917j627j534J8555K8924J6659k32
7347E2505j4399j9449P706K683l6651K4715K8125k6772j3790J358K230J173J2138
7334B1572J7218J4091j5834j6364o244j5628P12N546J9776k871J1064p602j1444
7321A3992q06J088j937k103J1023J2864P27j4461k6549L378M856J6347J2077p383
7307B3113j2571K130J2341Q591k1605j6981j1443J0363R020K3215J0605j8502
$$ plain form
7295 18276 26224 43412 54630 55884 28540 -15338 8003 33557 46931 37265 44538 55639 49830
7282 49830 51913 50137 47055 33461 30928 53830 70981 58806 46459 35477 25506 13654 15397
7269 15397 6068 -12304 13373 52497 59445 58284 54985 38137 6553 -12621 -16379 7362 25328
7256 25328 40411 49127 56203 50439 34197 49223 36341 -3757 14551 36137 32161 31224 29218
7243 29218 16321 31648 39895 25368 13265 28094 21597 132 20852 27653 25528 28784 26142
7230 26142 29933 26544 15388 25224 39206 42777 45042 63685 27487 24137 24830 27197 6188 2094
7216 2094 17578 11215 12307 27622 36126 68072 78199 39667 12204 -10277 1341 -16945 -13767
7203 -13767 13611 23539 26273 40520 33613 31380 33523 15631 1382 3198 17259 22287 38792
$$ packed form
7295A8276P948J7188J1218J254k7344m3878K3341K5554J3374r666P273J1101n809
7282D9830K083j776l082j3594k533K2902J7151j2175j2347j0982r971j1852J743
7269A5397r329j8372K5677L9124O948j161l299j6848l1584j9174l758K3741J7966
7256B5328J5083Q716P076n764j6242J5026j2882m0098J8308K1586l976r37k006
7243B9218j2897J5327Q247j4527j2103J4829o497k1465K0720O801k125L256k642
7230B6142L791l389j1156R836J3982L571K265J8643l6198l350O93K367k1009m094
7216B094J5484o363J092J5315Q504L1946J0127l8532k7463k2481J1618j8286L178
7203a3767K7378R928K734J4247o907k233K143j7892j4249J816J4061N028J6505
$$ plain form
7190 38792 43073 32146 38470 57555 61466 48606 30211 24827 21446 15992 6364 686 -13352
7177 -13352 8062 24619 16131 11946 21272 29057 46928 36414 49069 25896 16074 7876 -1048
$$ packed form
7190C8792M281j0927O324J9085L911j2860j8395n384l381n454r628n678j4038
7177a3352K1414J6557q488m185R326P785J7871j0514J2655k3173r822q198q924
$$ [...]
##END NTUPLES=NMR SPECTRUM
##END=
