##TITLE=Analysis number 327792
Compound Code cd 09405
Book Reference 216771
Project Code adrs flro3
Chemist Name jom
##JCAMPDX= 6.0         $$ Bruker NMR JCAMP-DX V2.0
##DATA TYPE= NMR SPECTRUM
##DATA CLASS= NTUPLES
##ORIGIN= Bruker BioSpin GmbH
##OWNER= nmr
$$ XWIN-NMR		Version 3.5
$$ Tue Apr 10 10:15:46 2007 GMT Daylight Time (UT+1h)  MAYBRIDGE\nmr@NMR_250MHZ
##.OBSERVE FREQUENCY= 250.131544655141
##.OBSERVE NUCLEUS= ^1H
##.ACQUISITION MODE= SIMULTANEOUS (DQD)
##.ACQUISITION SCHEME= undefined
##.AVERAGES= 16
##.DIGITISER RES= 18
##SPECTROMETER/DATA SYSTEM= dpx250
##.PULSE SEQUENCE= zg30
##.SOLVENT NAME= DMSO
##.SHIFT REFERENCE= (INTERNAL, DMSO, 0, 16.522)
##AUDIT TRAIL= $$ (NUMBER, WHEN, WHO, WHERE, WHAT)
$$ ##TITLE= Audit trail, XWIN-NMR		Version 3.5
$$ ##JCAMPDX= 5.01
$$ ##ORIGIN= Bruker BioSpin GmbH
$$ ##OWNER= nmr
$$ C:\u/data/dgb/nmr/ADRS/750/pdata/1/auditp.txt
$$ ##AUDIT TRAIL=  $$ (NUMBER, WHEN, WHO, WHERE, WHAT)
(   1,<2007-04-10 10:15:25.17 +100>,<MAYBRIDGE\nmr>,<NMR_250MHZ>,
      <created by zg, POWCHK disabled, PULCHK disabled
       configuration hash MD5:
       49 4B E0 1D 92 C2 6B 37 9F E6 65 BC 52 41 86 1D
       data hash MD5: 64K
       47 13 1D C9 66 00 DE 34 54 BB 02 2B F6 7B F0 33>)
(   2,<2007-04-10 10:15:37.51 +100>,<MAYBRIDGE\nmr>,<NMR_250MHZ>,
      <Start of raw data processing
       ef LB = 0.3 FT_mod = 6 PKNL = 1 SI = 32K 
       data hash MD5: 32K
       AF 48 59 94 7B D7 54 06 CB 61 AA ED 46 1E 1C 7E>)
(   3,<2007-04-10 10:15:39.13 +100>,<MAYBRIDGE\nmr>,<NMR_250MHZ>,
      <apk 
       data hash MD5: 32K
       3E 39 87 EF 2A 10 77 CE 69 A8 91 55 84 77 87 D9>)
(   4,<2007-04-10 10:15:39.85 +100>,<MAYBRIDGE\nmr>,<NMR_250MHZ>,
      <abs ABSG = 5 
       data hash MD5: 32K
       7B 81 DE CD C4 9F 8D A1 0B E7 87 4D 08 1D A3 D0>)
$$ ##END=
$$ 
$$ hash MD5
$$ 50 FA 57 DE 0F 8A 5C 52 FF 8C 9B 2F 19 54 F9 A3
##$RELAX= 
##$RELAX= 
##$RELAX= 
##$RELAX= 
##$RELAX= 
##$RELAX= 
##$RELAX= 
$$ Bruker specific parameters
$$ --------------------------
##$DU= <C:\u>
##$EXPNO= 750
##$NAME= <ADRS>
##$PROCNO= 1
##$TYPE= <nmr>
##$USER= <dgb>
##$AMP= (0..31)
100 100 100 100 100 100 100 100 100 100 100 100 100 100 100 100 100 100 
100 100 100 100 100 100 100 100 100 100 100 100 100 100 
##$AQSEQ= 0
##$AQ_mod= 3
##$AUNM= <au_zg>
##$AUTOPOS= <12 >
##$BF1= 250.13
##$BF2= 250.13
##$BF3= 250.13
##$BF4= 250.13
##$BF5= 500.13
##$BF6= 500.13
##$BF7= 500.13
##$BF8= 500.13
##$BYTORDA= 1
##$CFDGTYP= 0
##$CFRGTYP= 5
##$CHEMSTR= <none>
##$CNST= (0..31)
1 1 145 1 1 1 1 1 1 1 1 1 1 1 1 1 1 1 1 1 1 1 1 1 1 1 1 1 1 1 1 1 
##$CPDPRG= <>
##$CPDPRG1= <>
##$CPDPRG2= <>
##$CPDPRG3= <>
##$CPDPRG4= <mlev>
##$CPDPRG5= <mlev>
##$CPDPRG6= <mlev>
##$CPDPRG7= <mlev>
##$CPDPRG8= <mlev>
##$CPDPRGB= <>
##$CPDPRGT= <>
##$D= (0..31)
0 1 0 0 0 0 0 0 0 0.06 0 0 0 0 0 0 0.0002 0 0 0 0 0 0 0 0 0 0 0 0 0 0 
0 
##$DATE= 1176196524
##$DBL= (0..7)
120 120 120 120 120 120 120 120 
##$DBP= (0..7)
150 150 150 150 150 150 150 150 
##$DBP07= 0
##$DBPNAM0= <>
##$DBPNAM1= <>
$$ [...]
##$SUBNAM6= <"">
##$SUBNAM7= <"">
##$SUBNAM8= <"">
##$SUBNAM9= <"">
##$SW= 20.6930455092707
##$SWIBOX= (0..15)
0 0 3 0 0 0 0 0 0 0 0 0 0 0 0 0 
##$SW_h= 5175.983436853
##$TD= 65536
##$TD0= 1
##$TE= 683.16
##$TE2= 300
##$TE3= 300
##$TEG= 300
##$TL= (0..7)
0 120 120 120 120 120 120 120 
##$TP= (0..7)
150 150 150 150 150 150 150 150 
##$TP07= 0
##$TPNAME0= <>
##$TPNAME1= <>
##$TPNAME2= <>
##$TPNAME3= <>
##$TPNAME4= <>
##$TPNAME5= <>
##$TPNAME6= <>
##$TPNAME7= <>
##$TPOAL= (0..7)
0.5 0.5 0.5 0.5 0.5 0.5 0.5 0.5 
##$TPOFFS= (0..7)
0 0 0 0 0 0 0 0 
##$TUNHIN= 0
##$TUNHOUT= 0
##$TUNXOUT= 0
##$USERA1= <user>
##$USERA2= <user>
##$USERA3= <user>
##$USERA4= <user>
##$USERA5= <user>
##$V9= 5
##$VALIST= <valist>
##$VCLIST= <CCCCCCCCCCCCCCC>
##$VD= 0
##$VDLIST= <DDDDDDDDDDDDDDD>
##$VPLIST= <PPPPPPPPPPPPPPP>
##$VTLIST= <TTTTTTTTTTTTTTT>
##$WBST= 1024
##$WBSW= 4
##$XGAIN= (0..3)
0 0 0 0 
##$XL= 0
##$YL= 0
##$YMAX_a= 345986
##$YMIN_a= -391289
##$ZGOPTNS= <>
##$ZL1= 120
##$ZL2= 120
##$ZL3= 120
##$ZL4= 120
##$ABSF1= 16.522
##$ABSF2= -4.171173
##$ABSG= 5
##$ABSL= 3
##$ALPHA= 0
##$AQORDER= 0
##$ASSFAC= 0
##$ASSFACI= 0
##$ASSFACX= 0
##$ASSWID= 0
##$AUNMP= <proc_1d>
##$AZFE= 0.1
##$AZFW= 0.1
##$BCFW= 0
##$BC_mod= 0
##$BYTORDP= 0
##$COROFFS= 0
##$CY= 12.5
##$DATMOD= 1
##$DC= 0
##$DFILT= <>
##$DTYPP= 0
##$F1P= 14.0000005364418
##$F2P= -0.99999901652339
##$FCOR= 0.5
##$FTSIZE= 32768
##$FT_mod= 6
##$GAMMA= 0
##$GB= 0
##$INTBC= 1
##$INTSCL= 1
##$ISEN= 128
##$LB= 0.3
##$LEV0= 0
##$LPBIN= 0
##$MAXI= 10000
##$MC2= 0
##$MEAN= 0
##$ME_mod= 0
##$MI= 0
##$NCOEF= 0
##$NC_proc= -3
##$NLEV= 6
##$NOISF1= 0
##$NOISF2= 0
##$NSP= 0
##$NTH_PI= 0
##$NZP= 0
##$OFFSET= 16.522
##$PC= 1
##$PHC0= 220.2923
##$PHC1= 5.799829
##$PH_mod= 1
##$PKNL= yes
##$PPARMOD= 0
##$PSCAL= 4
##$PSIGN= 0
##$REVERSE= no
##$SF= 250.13
##$SI= 32768
##$SIGF1= 0
##$SIGF2= 0
##$SINO= 400
##$SIOLD= 32768
##$SREGLST= <1H.DMSO>
##$SSB= 0
##$STSI= 32768
##$STSR= 0
##$SW_p= 5175.98343685301
##$SYMM= 0
##$S_DEV= 0
##$TDeff= 65536
##$TDoff= 0
##$TI= <Analysis number 999999
Compound Code 99
Book Reference 9
Project Code 9>
##$TILT= no
##$TM1= 0
##$TM2= 0
##$TOPLEV= 0
##$USERP1= <user>
##$USERP2= <user>
##$USERP3= <user>
##$USERP4= <user>
##$USERP5= <user>
##$WDW= 1
##$XDIM= 32768
##$YMAX_p= 401268852
##$YMIN_p= -87847
$$ End of Bruker specific parameters
$$ ---------------------------------
##NTUPLES= NMR SPECTRUM
##VAR_NAME=  FREQUENCY,     SPECTRUM/REAL,   SPECTRUM/IMAG
##SYMBOL=    X,             R,               I
##VAR_TYPE=  INDEPENDENT,   DEPENDENT,       DEPENDENT
##VAR_FORM=  AFFN,          ASDF,            ASDF
##VAR_DIM=   32768,         32768,           32768
##UNITS=     HZ,            ARBITRARY UNITS, ARBITRARY UNITS
##FACTOR=    0.157963299565203, 1,           1
##FIRST=     4132.6476996994, 0,             0
##LAST=      -1043.33573715361, 0,           0
##MIN=       -1043.33573715361, -87847,      0
##MAX=       4132.6476996994, 401268852,     0
$$ Real data points
##PAGE= N=1
##DATA TABLE= (X++(R..R)), XYDATA
$$ [...]
$$ plain form
15779 -12479 -11951 6147 20493 -9185 -21631 -13162 5222 16640 34497 35966 21114 20666 27050
15766 27050 10857 -11956 -10948 9947 31436 36699 24858 2597 -19946 -10094 11316 35831
15754 35831 67062 60373 52275 62058 100357 145770 190644 245531 281101 275698 253551 215017
15742 215017 185646 140399 91406 79800 71279 63842 72375 59786 14751 1266 25268 42699
15730 42699 48315 56811 53058 58359 23183 26204 30232 28633 40463 58424 68543 43795 14799
15717 14799 20232 29903 67518 67457 70889 76061 76628 92462 158495 243433 337845 449690 536192
15704 536192 567956 551862 506020 421830 313986 210230 153810 120234 104835 96205 75851
15693 75851 50329 40451 24396 19374 29559 34704 50601 58563 50829 37737 30802 40873 58308
$$ packed form
15779a2479N28J8098J4346k9678j2446Q469J8384J1418J7857J469j4852m48O384
15766B7050j6193k2813J008K0895K1489N263j1841k2261k2543R852K1410K4515
15754C5831L1231o689q098R783L8299M5413M4874N4887L5570n403k2147l8534
15742B15017k9371m5247m8993j1606q521p437Q533j2589m5035j3485K4002J7431
15730D2699N616Q496l753N301l5176L021M028j599J1830J7961J0119k4748k8996
15717A4799N433R671L7615o1L432N172N67J5834O6033Q4938R4412J11845Q6502
15704E36192L1764j6094m5842q4190j07844j03756n6420l3576j5399q630k0354
15693G5851k5522r878j6055n022J0185N145J5897P962p734j3092o935J0071J7435
$$ plain form
15680 58308 54129 45875 37474 32290 32437 47541 43350 41885 56703 49304 52508 37356 53589 81998
15666 81998 125140 167973 218070 265930 298534 271645 224658 177503 144093 114545 105660 89567
15654 89567 45901 31033 27169 25224 3097 -26167 -25148 -98 -6618 -23444 -33922 -23123
15642 -23123 -16141 18672 24634 29751 9308 6660 21940 39321 43086 24571 16525 21046 29888
15629 29888 30036 9834 -275 7573 3758 10296 -5344 -17342 -29447 -36091 -24587 7756 36392
15616 36392 31562 11993 -11690 -30056 -26609 -17196 -4085 4771 6301 -341 810 -12769 -26758
15603 -26758 -15806 -9598 -14734 -7374 -9306 -7684 2706 -14614 -6540 132 1650 -7848 6172
15590 6172 12388 3538 5298 15401 2191 2797 4037 -26525 -21740 -14578 -19065 -23241 -20367 -30716
$$ packed form
15680E8308m179q254q401n184J47J5104m191j465J4818p399L204j5152J6233K8409
15666H1998M3142M2833N0097M7860L2604k6889m6987m7155l3410k9548q885j6093
15654H9567m3666j4868l864j945k2127k9264J019K5050o520j6826j0478J0799
15642b3123O982L4813N962N117k0443k648J5280J7381L765j8515q046M521Q842
15629B9888J48k0202j0109P848l815O538j5640j1998j2105o644J1504L2343K8636
15616C6392m830j9569k3683j8366L447R413J3111Q856J530o642J151j3579j3989
15603b6758J0952O208n136P360j932J622J0390j7320Q074O672J518r498J4020
15590F172O216q850J760J0103j3210O06J240l0562M785P162m487m176K874j0349
$$ plain form
15576 -30716 -11323 -12520 -18085 -14243 -11766 -12211 -34039 -45666 -38596 -38972 -17710 1455 3591 16586
15562 16586 22224 39487 29661 15893 836 -14487 -3847 5292 -19345 -28728 -20983 -39891 -48470
15549 -48470 -27009 -36762 -43499 -29238 -22400 -29318 -23673 -13880 12767 27502 13813 7125 1533
15536 1533 18620 26107 25455 24144 8633 19472 6823 -19003 -24493 -1119 -278 289 1908 1833
15522 1833 12752 7244 -9405 -9175 -34845 -45821 -16902 -21261 -28853 -25314 -40264 -47927 -30555
15509 -30555 -24954 -680 -16092 -25572 -33458 -4661 18719 22599 21129 24929 41175 48345 27444
15496 27444 2186 -14934 -12503 -20462 3251 7264 -2987 -17002 16 960 -2192 -13102 -6687
15483 -6687 12689 30525 38710 26395 13477 9337 17856 24378 26279 22815 21511 26856 31181 15929
$$ packed form
15576c0716J9393j197n565L842K477m45k1828j1627P070l76K1262J9165K136J2995
15562A6586N638J7263r826j3768j5057j5323J0640R139k4637r383P745j8908q579
15549d8470K1461r753o737J4261O838o918N645R793K6647J4735j3689o688n592
15536A533J7087P487o52j311j5511J0839j2649k5826n490K3374Q41N67J619p5
15522A833J0919n508j6649K30k5670j0976K8919m359p592L539j4950p663J7372
15509c0555N601K4274j5412r480p886K8797K3380L880j470L800J6246P170k0901
15496B7444k5258j7120K431p959K3713M013j0251j4015J7018R44l152j0910O415
15483f687J9376J7836Q185j2315j2918m140Q519O522J901l464j304N345M325j5252
$$ plain form
15469 15929 13405 17319 23337 21617 -3582 4920 2365 7610 10331 -9479 -41502 -33261 -17510
15456 -17510 -22487 -22349 466 9489 14009 6471 3195 -9059 -11300 321 -267 1324 9261 11712
15442 11712 18993 38986 27159 36343 63779 63922 37274 48620 29643 26040 36832 25404 10163
15429 10163 17843 29946 15061 11108 10252 13027 22137 2916 -19139 -6019 5487 7772 23978
15416 23978 35775 27734 16919 17523 31939 29691 19926 8104 -25839 -42647 -44473 -36473 -22563
15403 -22563 1609 2831 17341 9051 -705 -21145 -20890 -14113 -9692 11215 35222 25419 48171
15390 48171 58320 43004 32194 25333 42319 43432 19298 2168 -17702 -30538 -53999 -37796
15378 -37796 -14807 2301 13973 -9405 -13504 7868 9421 -3481 -14819 -35109 -18489 8442
$$ packed form
15469A5929k524L914O018j720k5199Q502k555N245K721j9810l2023Q241J5751
15456a7510m977J38K2815R023M520p538l276j2254k241J1621n88J591P937K451
15442A1712P281J9993j1827R184K7436J43k6648J1346j8977l603J0792j1428j5241
15429A0163P680J2103j4885l953q56K775R110j9221k2055J3120J1506K285J6206
15416B3978J1797q041j0815O04J4416k248r765j1822l3943j6808j826Q000J3910
15403b2563K4172J222J4510q290r756k0440K55O777M421K0907K4007r803K2752
15390D8171J0149j5316j0810o861J6986J113k4134j7130j9870j2836k3461J6203
15378c7796K2989J7108J1672k3378m099K1372J553j2902j1338k0290J6620K6931
$$ plain form
15366 8442 25370 20664 16908 31636 26383 15137 4862 1452 -3188 -5365 -14535 -26399 -26678 -5289
15352 -5289 8715 -580 -5614 28 22480 16688 14255 -2460 6371 10375 31497 37456 9490
15339 9490 -12392 -18202 -24025 -8613 5375 11300 9397 -4311 -13366 -13792 -7229 -8607 -21433 -21902
15325 -21902 -8000 13450 12852 -16183 -17923 -10400 -5579 -19196 -32382 -13021 -8286 -7531 -2115
15312 -2115 -9179 -12893 -20491 -19831 -78 -10331 -14979 -7531 -6665 -16343 -13527 -12216 -13830 7862
15298 7862 26210 23012 33967 10575 5775 17240 -2563 -24463 -33630 -29246 -6163 -5137 -26434
15285 -26434 -28876 -20421 -23241 -47337 -40943 -24987 -21043 -20981 -31697 -1702 25204 38887 25611
15272 25611 4230 8443 -10364 -1353 11922 5838 -3629 4421 24086 18980 22383 35873 25184
$$ packed form
15366H442J6928m706l756J4728n253j1246j0275l410m640k177r170j1864k79K1389
15352e289J4004r295n034N642K2452n792k433j6715Q831M004K1122N959k7966
15339I490k1882n810n823J5412J3988N925j903j3708r055m26O563j378j2826m69
15325b1902J3902K1450n98k9035j740P523M821j3617j3186J9361M735P55N416
15312b115p064l714p598O60J9753j0253m648P448Q66r678K816J311j614K1692
15298G862J8348l198J0955k3392m800J1465j9803k1900r167M384K3083J026k1297
15285b6434k442Q455k820k4096O394J5956L944O2j0716K9995K6906J3683j3276
15272B5611k1381M213j8807R011J3275o084r467Q050J9665n106L403J3490j0689
$$ plain form
15259 25184 11577 -5616 -15445 -30689 -26864 -10683 8840 -2961 -4730 -5840 3569 734 24674
15246 24674 27086 15215 637 -5121 9218 4302 5705 10046 22196 15838 13153 27994 51812
15233 51812 29604 4960 -888 -25399 -13082 -9576 -2804 -1832 -8682 -7520 -5274 -7409 -42692
15220 -42692 -39211 -1464 8504 -1206 -9404 1288 11760 22842 24842 797 -12580 -28400 -42620
15207 -42620 -24007 16294 43303 33260 20486 30630 24472 1826 -13068 -656 4278 -7362
15195 -7362 -8483 -1675 4399 7944 2139 -11755 -20625 -10475 -517 29500 23137 8433 1906 -3835
15181 -3835 -16146 -13071 1305 -34716 -33739 -15496 -1344 -21329 -26840 -17753 -8369 8220 -2686
15168 -2686 -30381 -53202 -35798 -15327 5158 2340 -16623 -10305 6334 27414 7415 -16678
$$ packed form
15259B5184j3607j7193r829j5244L825J6181J9523j1801j769j110R409k835K3940
15246B4674K412j1871j4578n758J4339m916J403M341J2150o358k685J4841K3818
15233E1812k2208k4644n848k4511J2317L506O772R72o850J162K246k135l5283
15220d2692L481L7747R968r710q198J0692J0472J1082K000k4045j3377j5820j4220
15207d2620J8613M0301K7009j0043j2774J0144o158k2646j4894J2412M934j1640
15195g362j121O808O074L545n805j3894q870J0150R958L0017o363j4704o527n741
15181c835j2311L075J4376l6021R77J8243J4152j9985n511R087R384J6589j0906
15168b686k7695k2821J7404K0471K0485k818j8963O318J6639K1080j9999k4093
$$ plain form
15156 -16678 -19762 -17297 -19832 -23871 -22251 354 -4075 -10804 -272 -12770 -6563 15837 14985 30316
15142 30316 23042 -10654 13395 13663 -3801 -6880 6169 6589 7342 28828 31810 13804 -14208
15129 -14208 -31463 -44579 -36367 -28883 -23904 -10863 16225 16516 30471 22552 5080 -14884 -38095
15116 -38095 -16421 -5630 1387 -8305 -8693 3534 18990 26175 48858 59521 42826 12425 -917
15103 -917 -1170 3510 14791 31629 41495 5944 -9959 -36386 -27069 -31291 -25407 -14389 -15346 -20093
15089 -20093 -32247 -27543 -24443 -9776 1301 16016 5511 -17970 -20505 -15568 -13833 -17292 -1080
15076 -1080 22681 12146 16632 9806 13891 8272 1113 -19246 -26612 -41543 -38228 -48560 -58900
15063 -58900 -25708 15572 20515 874 14331 -3612 -12371 -7073 -18062 -32899 -31296 -12970
$$ packed form
15156a6678l084K465k535m039J620K2605m429o729J0532j2498O207K2400q52J5331
15142C0316p274l3696K4049K68j7464l079J3049M20P53K1486K982j8006k8012
15129a4208j7255j3116Q212P484M979J3041K7088K91J3955p919j7472j9964k3211
15116c8095K1674J0791P017r692l88J2227J5456P185K2683J0663j6695l0401j3342
15103i17k53M680J1281J6838R866l5551j5903k6427R317m222N884J1018r57m747
15089b0093j2154M704L100J4667J1077J4715j0505k3481k535M937J735l459J6212
15076a080K3761j0535M486o826M085n619p159k0359p366j4931L315j0332j0340
15063e8900L3192M1280M943j9641J3457j7943q759N298j0989j4837J603J8326
$$ plain form
15051 -12970 -9544 -17200 -18505 -24725 -39350 -15549 7249 28914 17187 10086 -1844 1768 9357
15038 9357 6638 -1517 -7112 -26655 -54117 -59568 -32513 -21043 -5983 2052 -8867 -16435 -813
15025 -813 -17308 -9423 -1832 -8970 1254 15845 -20711 -56202 -63577 -27336 6942 4109 1501
15012 1501 -9223 -7171 -24615 2909 20906 10316 -20140 -7973 24751 28796 42149 16078
15000 16078 -18440 5118 15887 12160 -3968 -18360 -7061 -7749 4476 2479 -5671 -28728 -38689
14987 -38689 -13172 -17809 -18048 -51119 -56322 -43393 -28207 -25597 -2594 10978 -9419 -42416 -62142
14974 -62142 -48660 -44927 -57593 -64261 -53862 -41923 -32835 -15290 -11684 -16748 -37266 -40800 -38763
14961 -38763 -19283 -28507 -36803 -22525 -28932 4134 24849 5420 -11333 -30417 -50228 -49341 -28045
$$ packed form
15051a2970L426p656j305o220j4625K3801K2798K1665j1727p101j1930L612P589
15038I357k719q155n595j9543k7462n451K7055J1470J5060Q035j0919p568J5622
15025h13j6495P885P591p138J0224J4591l6556l5491p375L6241L4278k833k608
15012A501j0724K052j7444K7524J7997j0590l0456J2167L2724M045J3353k6071
15000A6078l4518K3558J0769l727j6128j4392J1299o88J2225j997q150k3057r961
14987c8689K5517m637k39l3071n203J2929J5186K610K3003J3572k0397l2997j9726
14974f2142J3482L733j2666o668J0399J1939R088J7545L606n064k0518l534K037
14961c8763J9480r224q296J4278o407L3066K0715j9429j6753j9084j9811Q87K1296
$$ plain form
14948 -28045 -22726 -27516 -21672 -5392 306 -3586 -12022 -6234 372 639 -14249 -30835 -21435 3753
14934 3753 -9785 -22895 -24019 -16788 -14168 -30024 -17465 -21272 -16363 -3753 7429 2812 26967
14921 26967 18300 -3997 -10764 -801 -13866 -27413 -25831 -18315 -747 14497 19423 10147 -11053
14908 -11053 6721 7694 -5376 -10893 -12245 -31908 -35478 -16835 -27198 -15693 16751 17105 15424
14895 15424 14424 12677 -4361 9539 20523 22560 19478 -16594 -35163 -26604 -29953 -34497 -40883
14882 -40883 -42658 -47262 -65130 -44750 -18969 19257 29792 16475 -7967 -16708 2193 27615
14870 27615 6771 -17842 -30694 -33930 -46846 -54301 -47482 -34550 -14700 -10073 -12420 -20627 -20350
14857 -20350 -19270 139 40719 49436 50775 14602 -18819 -33604 -18544 13143 42614 44444
$$ packed form
14948b8045N319m790N844J6280N698l892q436N788O606K67j4888j6586R400K5188
14934C753j3538j3110j124P231K620j5856J2559l807M909J2610J1182m617K4155
14921B6967q667k2297o767R963j3065j3547J582P516J7568J5244M926r276k1200
14908a1053J7774R73j3070n517j352j9663l570J8643j0363J1505L2444L54j681
14895A5424j000j747j7038J3900J0984K037l082l6072j8569Q559l349m544o386
14882d0883j775m604j7868K0380K5781L8226J0535j3317k4442q741J8901K5422
14870B7615k0844k4613j2852l236j2916p455O819J2932J9850M627k347q207K77
14857b0350J080J9409M0580Q717J339l6173l3421j4785J5060L1687K9471J830
$$ plain form
14845 44444 19974 10650 25977 27996 20517 10201 -2600 8269 -2744 -10445 2897 18071
14833 18071 25460 5276 -2899 -21687 -6573 10929 10197 364 12577 31122 41569 29822 38240
14820 38240 28892 19075 27101 36638 25931 8697 -5007 1613 1706 -8959 28536 30931 45172
14807 45172 31513 9176 2267 -1958 7475 -1981 -10314 6173 19246 13516 2276 -3815 5275
14794 5275 25510 33355 23419 12346 11435 -2559 -4330 5492 14824 7031 -12766 -27548 -34184 -16685
14780 -16685 -33645 -54426 -50440 -31286 3106 12762 1640 5906 3286 -7751 2707 -26668
14768 -26668 -57215 -38030 -21505 -14917 9428 2396 4034 28151 44282 45298 25926 -2997
14756 -2997 -15328 -15922 -11441 -775 16403 15223 -3159 -35687 -38726 -24881 -20887 -7504 14749
$$ packed form
14845D4444k4470r324J5327K019p479j0316j2801J0869j1013p701J3342J5174
14833A8071P389k0184q175j8788J5114J7502p32r833J2213J8545J0447j1747Q418
14820C8240r348r817Q026R537j0707j7234j3704O620R3j0665L7495K395J4241
14807D5172j3659k2337o909m225R433r456q333J6487J3073n730j1240o091R090
14794E275K0235P845r936j1073r11j3994j771R822R332p793j9797j4782o636J7499
14780a6685j6960k0781L986J9154L4392R656j1122M266k620j1037J0458k9375
14768b6668l0547J9185J6525O588K4345p032J638K4117J6131J016j9372k8923
14756b997j2331n94M481J0666J7178j180j8382l2528l039J3845L994J3383K2253
$$ plain form
14743 14749 -3190 16269 36210 28004 7291 -6556 -14577 -4198 -19001 -14737 -14641 1222 21165
14730 21165 26266 22286 31115 41709 11175 -2666 180 16784 26198 10638 -7637 9662 26404
14717 26404 17277 52 -9323 -6101 -4812 -12054 -16260 -26973 -34179 -35213 -46085 -36104 -30343 -5972
14703 -5972 -16314 -35731 -54717 -63644 -49508 -38119 -29160 -25455 -17331 -3088 -10738 -25419 -11717
14690 -11717 4785 12087 1207 -9503 -9172 27477 54367 49646 19464 -11235 31090 32161 -23665
14677 -23665 -63666 -62935 -42677 -27674 -27334 -39063 -45722 -16375 -20410 9259 9857 -9788 -20479
14664 -20479 -29316 -19865 -6068 -4573 -9735 4533 18887 20997 -2291 19075 17782 13032 930
14651 930 -310 -25453 -34454 5943 12564 8185 -5541 856 2590 8260 1262 1365 -2864 -8607
$$ packed form
14743A4749j7939J9459J9941q206k0713j3847q021J0379j4803M264R6J5863J9943
14730B1165N101l980Q829J0594l0534j3841K846J6604R414j5560j8275J7299J6742
14717B6404r127j7225r375L222J289p242m206j0713p206j034j0872R981N761K4371
14703e972j0342j9417j8986q927J4136J1389Q959L705Q124J4243p650j4681J3702
14690a1717J6502P302j0880j0710L31L6649K6890m721l0182l0699M2325J071n5826
14677b3665m0001P31K0258J5003L40j1729o659K9347m035K9669N98j9645j0691
14664b0479q837R451J3797J495n162J4268J4354K110k3288K1366j293m750j2102
14651I30j240k5143r001M0397O621m379j3726O397J734N670o998J03m229n743
$$ plain form
14637 -8607 5668 15197 26566 40802 37351 25647 15543 -8231 11040 31296 3874 -21800
14625 -21800 -5620 26863 5922 5372 772 19284 41175 22000 7656 4865 8397 7115 14507
14612 14507 12798 957 7561 19865 31252 29801 -266 -30375 -29918 -12277 -22324 -21118 22102
14599 22102 12432 -10418 -14504 -13417 -22538 -20871 -28418 -18805 -6138 13631 21041 9518 28256
14586 28256 4625 -11052 -2170 7489 1229 3201 19608 23203 17967 11961 -412 -18134 -23789
14573 -23789 -16345 -15498 -14734 -17330 -28966 -26753 12829 26975 -12235 -24620 -30975 -26601 -25394 -31707
14559 -31707 -27284 -37393 -36758 -9514 -7570 4070 -17704 -18130 -21831 -28883 -20959 -8556 4680
14546 4680 6145 16162 17287 20464 9370 7887 -8839 -7333 2954 10515 4608 764 -21198
$$ packed form
14637h607J4275R529J1369J4236l451j1704j0104k3774J9271K0256k7422k5674
14625b1800J6180L2483k0941n50m600J8512K1891j9175j4344k791L532j282P392
14612A4507j709j1841O604J2304J1387j451l0067l0109M57J7641j0047J206M3220
14599B2102r670k2850m086J087r121J667p547R613J2667J9769P410j1523J8738
14586B8256k3631j5677Q882R659o260J972J6407L595n236o006j2373j7722n655
14573b3789P444Q47P64k596j1636K213L9582J4146l9210j2385o355M374J207o313
14559c1707M423j0109O35K7244J944J1640k1774m26l701p052P924J2403J3236
14546D680J465J0017J125L177j1094j483j6726J506J0287P561n907l844k1962
$$ plain form
14533 -21198 -28389 -4849 -2264 -14322 -31649 -23381 -8413 12854 17118 15367 -4645 -39123 -35927
14520 -35927 -8027 -6360 -24225 -26523 -13148 -7694 397 2106 15956 39567 13418 8063 11604
14507 11604 26496 27765 34920 25630 -2191 -6937 -15821 -22757 -14870 5793 8907 2361 -7284 -13120
14493 -13120 -10855 -16406 8151 16783 24660 25765 -11187 -24992 -13911 -18431 -14049 13056 22370
14480 22370 13985 2040 -14588 -18506 -20460 -10298 2183 5862 -583 -14130 -26359 -29604 -44996
14467 -44996 -39248 -28305 -14488 -4200 -9448 -16560 -11171 6724 7327 -3198 16373 13438 -7429
14454 -7429 5110 11227 32456 34909 39130 37134 40101 24545 7069 10726 12409 9207 -4424
14441 -4424 -10252 -25268 -27936 -46682 -32390 -17700 -10637 -4049 -13372 -31899 -29115 651 8999
$$ packed form
14533b1198p191K3540K585j2058j7327Q268J4968K1267M264j751k0012l4478L196
14520c5927K7900J667j7865k298J3375N454Q091J709J3850K3611k6149n355L541
14507A1604J4892J269P155r290k7821m746q884o936P887K0663L114o546r645n836
14493a3120K265n551K4557Q632P877J105l6952j3805J1081m520M382K7105R314
14480B2370q385j1945j6628l918j954J0162J2481L679o445j3547j2229l245j5392
14467d4996N748J0943J3817J0288n248p112N389J7895O03j0525J9571k935k0867
14454g429J2539O117K1229K453M221j996K967j5556j7476L657J683l202j3631
14441d424n828j5016k668j8746J4292J4690P063O588r323j8527K784K9766Q348
$$ plain form
14428 8999 10376 5812 -1799 -6758 -34 32257 43358 27430 24051 17446 -17095 -39014 -27658
14415 -27658 -12830 -13725 -17582 -12970 -8090 -13220 -1897 -8460 -18699 -6849 14610 14174 7414 -5319
14401 -5319 -4969 -4619 6483 26645 21304 20821 48679 52467 24981 1613 -5270 6952 12033 -16816
14387 -16816 -33185 -7789 8781 2873 -26156 -25524 -13727 -17748 -28503 -42120 -52065 -14742 -16709
14374 -16709 -12517 13936 2111 -3451 1311 -948 -26335 -49970 -57609 -24990 -8814 -3126 7172
14361 7172 16708 -16486 -31706 -29420 -13521 -3800 -4592 -5365 -8396 -14423 -44178 -36331 -18583 -39147
14347 -39147 -38017 -3703 25868 42921 35384 487 -19448 -13842 -3134 -24067 -25160 -5001
14335 -5001 -6726 2661 -13004 4573 13349 41617 56875 48811 19998 1260 25348 53056 52691
$$ packed form
14428H999J377m564p611m959O724L2291J1101j5928l379o605l4541k1919J1356
14415b7658J4828q95l857M612M880n130J1323o563j0239J1850K1459m36o760j2733
14401e319L50L50J1102K0162n341m83K7858L788k7486k3368o883J2222N081k8849
14387a6816j6369K5396J6570n908k9029O32J1797m021j0755j3617r945L7323j967
14374a6709M192K6453j1825n562M762k259k5387k3635p639L2619J6176N688J0298
14361G172R536l3194j5220K286J5899R721p92p73l031o027k9755P847J7748k0564
14347c9147J130L4314K9571J7053p537l4897j9935N606J0708k0933j093K0159
14335e001j725R387j5665J7577Q776K8268J5258q064k8813j8738K4088K7708l65
$$ plain form
14322 52691 35365 25484 33250 31679 46366 48496 46378 536 -24315 -36718 -25935 -22766 -9743
14309 -9743 -19333 -33772 -17936 14843 22845 6242 -6448 6213 2223 -566 748 -9152 2290
14296 2290 5638 -4609 8101 13465 18348 26189 8923 -24556 -37833 -36608 -16641 721 9978
14283 9978 19114 19827 5039 -936 17017 13241 -13919 -14743 -7581 6244 14599 23006 13214 -8218
14269 -8218 1352 12683 -3878 6909 17709 12804 11304 10026 -704 -38349 -56159 -35754 -29130
14256 -29130 -16757 13858 11384 13433 14445 12192 -4548 -32079 -25018 -40346 -57274 -53431 -39608
14243 -39608 -30608 -31682 -20921 -21076 -17626 -11269 -22326 -19339 -13872 -21776 -22848 -7011 -13089 -11531
14229 -11531 3424 10820 18138 2493 17928 15362 2248 -1478 1946 9983 7723 -978 255
$$ packed form
14322E2691j7326r881P766j571J4687K130k118m5842k4851j2403J0783L169J3023
14309i743r590j4439J5836L2779Q002j6603j2690J2661l990k789J314r900J1442
14296B290L348j0247J2710N364M883P841j7266l3479j3277J225J9967J7362R257
14283I978R136P13j4788n975J7953l776k7160q24P162J3825Q355Q407r792k1432
14269h218R570J1331j6561J0787J0800m905j500j278j0730l7645j7810K0405O624
14256b9130J2373L0615k474K049J012k253j6740k7531P061j5328j6928L843J3823
14243c9608R000j074J0761j55L450O357j1057K987N467p904j072J5837o078J558
14229a1531J4955P396P318j5645J5435k566j3114l726L424Q037k260q701J233
$$ plain form
14216 255 5953 593 -8313 -16141 -23452 -22579 -11863 -23872 -57088 -56736 -35994 -32833 -14239 2945
14202 2945 8644 -6079 -7687 -3691 -19045 -9938 16203 27061 11836 12961 19590 22473 15817
14189 15817 -7378 -33770 -32743 -25706 -31214 -26795 -34525 -41640 -40458 -28891 -14697 12041 27638
14176 27638 4509 -7092 1861 -14155 -45213 -52814 -36975 -23433 -16466 -1404 23231 17328
14164 17328 -1939 18019 5643 -1556 1540 -13933 -1087 -3921 -17864 -17372 -8426 -11695 -18562
14151 -18562 -8583 -6713 -8383 -5989 -16370 -28352 -13625 9072 10303 16001 -761 -5884 -10437
14138 -10437 -23279 -19831 -1462 -886 7272 -3175 -768 13860 8294 770 -265 -11774 -12080 -12820
14124 -12820 -7143 14574 20835 38210 47985 30444 2235 -17556 -8656 4048 30924 24662 25322
$$ packed form
14216B55N698n360q906p828p311Q73J0716j2009l3216L52K0742L161J8594J7184
14202B945N699j4723j608L996j5354R107K6141J0858j5225J125O629K883o656
14189A5817k3195k6392J027P037n508M419p730p115J182J1567J4194K6738J5597
14176B7638k3129j1601Q953j6016l1058p601J5839J3542O967J5062K4635n903
14164A7328j9267J9958j2376p199L096j5473J2846k834j3943M92Q946l269o867
14151a8562R979J870j670K394j0381j1982J4727K2697J231N698j6762n123m553
14138a0437j2842L448J8369N76Q158j0447K407J4628n566p524j035j1509l06p40
14124a2820N677K1717O261J7375R775j7541k8209j9791Q900J2704K6876o262O60
$$ plain form
14111 25322 -2076 -16641 21886 45337 28421 8611 -1953 -12722 -28924 -19262 -7375 21976
14099 21976 36693 26815 -6850 -19535 -15964 -31392 -50010 -21565 1442 4648 -4537 440 21499
14086 21499 4951 -2377 -7467 -42490 -32771 5302 19614 -12290 -36399 -46267 -28722 -2971
14074 -2971 -18156 -22932 -18026 -16377 -28714 -46617 -56821 -28367 -21826 -32586 -28396 -12260 -10369
14061 -10369 4739 1161 -4403 -20661 -27684 -25372 -29338 -48581 -30834 -11417 1081 4829 -5323
14048 -5323 -13825 -10096 -8722 -14096 -41870 -26192 5501 4454 9680 19835 15545 4042 -525
14035 -525 -16444 -8877 6490 15419 457 -5122 -4349 4186 5575 -14581 -49632 -58497 -39723 -35835
14021 -35835 -32371 -46673 -25874 -1379 -9156 -40906 -57438 -50911 -36070 -33791 -23135 -19700 -5717
$$ packed form
14111B5322k7398j4565L8527K3451j6916j9810j0564j0769j6202R662J1887K9351
14099B1976J4717r878l3665j2685L571j5428j8618K8445K3007L206r185M977K1059
14086B1499j6548p328n090l5023R719L8073J4312l1904k4109r868J7545K5751
14074b971j5185m776M906J649j2337j7903j0204K8454O541j0760M190J6136J891
14061a0369J5108l578n564j6258p023K312l966j9243J7747J9417J2498L748j0152
14048e323q502L729J374n374k7774J5678L1693j047N226J0155m290j1503m567
14035e25j5919P567J5367Q929j4962n579P73Q535J389k0156l5051q865J8774L888
14021c5835L464j4302K0799K4495p777l1750j6532O527J4841K279J0656L435J3983
$$ plain form
14008 -5717 -19625 -10583 -14936 -8221 24080 5525 -21650 -18207 -20486 -27951 -44301 -62577 -37242
13995 -37242 -7949 1959 14495 -9467 -40213 -53586 -28259 -30778 -16749 -49514 -67565 -49380
13983 -49380 -28493 -30002 -30523 -19418 -5165 17820 -10053 -29756 -34840 -7246 16076 7004 7468
13970 7468 -5949 -20500 -4865 12200 -2063 5633 -6012 -26972 -31079 -13821 -466 19315
13958 19315 19556 30159 13420 -9473 -27654 -56097 -49799 -27218 -5552 24621 19424 -30095
13946 -30095 -28363 -17185 -23090 -27860 -21374 -1997 -2742 14631 8858 18126 39522 24346 4643
13933 4643 -16713 -45282 -46099 -39267 -30451 -25443 -22294 -21299 -28357 -48056 -26813 -684 11207 22308
13919 22308 17142 8068 -7106 -13671 2332 38624 31254 15984 -943 -8164 -4286 12815 -4206
$$ packed form
14008e717j3908R042m353O715L2301j8555k7175L443k279p465j6350j8276K5335
13995c7242K9293R908J2536k3962l0746j3373K5327k519J4029l2765j8051J8185
13983d9380K0887j509n21J1105J4253K2985k7873j9703n084K7594K3322r072M64
13970G468j3417j4551J5635J7065j4263P696j1645k0960m107J7258J3355J9781
13958A9315K41J0603j6739k2893j8181k8443O298K2581K1666L0173n197m9519
13946c0095J732J1178n905m770O486J9377p45J7373n773R268K1396j5176j9703
13933D643k1356k8569q17O832Q816N008L149R95p058j9699K1243K6129J1891J1101
13919B2308n166r074j5174o565J6003L6292p370j5270j6927p221L878J7101j7021
$$ plain form
13906 -4206 9688 20491 17887 -1459 -9964 -5287 -28361 -32282 -22279 -12176 -3348 430 8021
13893 8021 815 9134 10558 18496 348 -27183 -27807 -14376 -7186 7059 10951 17602 21049 26991
13879 26991 15875 20387 14134 23219 23163 25950 25441 -567 -7874 -3479 -8072 -5672 -24705 -28832
13865 -28832 -34776 -29184 -14543 -11473 11986 7230 7645 16911 18858 -6453 -31770 -12251 9797
13852 9797 -15570 -42214 -41099 -29031 -21339 -19381 -2898 15623 15950 187 13059 29564 9332
13839 9332 13092 -11801 -7356 -14870 -17250 -37665 -6681 15619 10150 -7076 -6140 35728 52092
13826 52092 51586 3597 -15204 -14672 -5910 1478 6779 -1800 -7501 4513 10340 -26729 -35599 -21949
13812 -21949 -8972 2275 9355 674 12873 21594 -6770 -13748 -17634 3671 5472 -14076 -11941
$$ packed form
13906d206J3894J0803k604j9346q505M677k3074l921J0003J0103Q828L778P591
13893H021p206Q319J424P938j8148k7531o24J3431P190J4245L892O651L447N942
13879B6991j1116M512o253R085n6K787n09k6008p307M395m593K400j9033m127
13865b8832n944N592J4641L070K3459m756M15R266J947k5311k5317J9519K2048
13852I797k5367k6644J115J2068P692J958J6483J8521L27j5763J2872J6505k0232
13839I332L760k4893M445p514k380k0415L0984K2300n469j7226R36M1868J6364
13826E2092n06m7989j8801N32Q762P388N301q579n701J2014N827l7069q870J3650
13812b1949J2977J1247P080q681J2199Q721k8364o978l886K1305J801j9548K135
$$ plain form
13799 -11941 -8539 -9459 -5332 5142 12114 14522 -7759 -4164 -32444 -21574 5098 10002 4404
13786 4404 -28208 -30807 -28377 -16485 -4418 -2838 1413 -7367 5689 5943 1328 -21221 -12360 14992
13772 14992 24712 35353 33807 19517 799 -8349 -7582 -12265 7797 25550 20811 -10211 -34977
13759 -34977 -29428 -13429 -18216 -38380 -32702 -25339 -32225 -12351 999 2831 -7360 -31418 -22781
13746 -22781 -9351 -36 13014 11776 6933 5148 13007 -5280 -22767 -37426 -45979 -19361 23823
13733 23823 24419 -22412 -31749 -22083 -5765 -6285 -18951 -28042 -24781 -4913 12726 -9564 -32172
13720 -32172 -14416 2152 3922 -2912 4583 -12777 -19229 -16189 -6968 15607 24259 12343 -13630
13707 -13630 -6686 2744 -19694 -27362 -10614 -28055 -37594 -34057 -23217 -689 9479 -19871 -17531
$$ packed form
13799a1941L402r20M127J0474O972K408k2281L595k8280J0870K6672M904n598
13786D404l2612k599K430J1892J2067J580M251q780J3056K54m615k2549Q861K7352
13772A4992R720J0641j546j4290j8718r148P67m683K0062J7753m739l1022k4766
13759c4977N549J5999m787k0164N678P363o886J9874J3350J832j0191k4058Q637
13746b2781J3430R315J3050j238m843j785P859j8287j7487j4659q553K6618M3184
13733B3823N96m6831r337R666J6318n20j2666r091L261J9868J7639k2290k2608
13720c2172J7756J6568J770o834P495j7360o452L040R221K2575Q652j1916k5973
13707a3630O944R430k2438p668J6748j7441r539L537J0840K2528J0168k9350K340
$$ plain form
13694 -17531 -11836 -19727 -16598 -5640 -8583 -4391 -623 26037 10533 -13986 2359 27767 41034
13681 41034 30738 30575 17320 -5038 -1369 6085 -7450 -24936 -15732 -9820 845 2306 -12645
13668 -12645 -2999 -3268 -3482 9477 16956 23828 13874 26697 31639 12283 3368 14875 32221 26125
13654 26125 20365 20821 17626 22847 35901 52872 57016 63359 46787 5274 -16474 -30182 -42553
13641 -42553 -22439 -17441 -7217 -6748 -17909 -41960 -42516 -9333 12110 4627 -13924 -14560 -3780
13628 -3780 1658 206 -35399 -27697 -12569 -30828 -27907 -5291 12946 -2467 -21751 -36872 -58488
13615 -58488 -61249 -34394 -21890 -7168 4882 -27971 -33208 -24444 -6479 -18017 -13987 -19187 -52011
13602 -52011 -35694 -19235 5079 17742 5961 406 4261 -10480 14358 25439 24894 6735
$$ packed form
13694a7531N695p891L129J0958k943M192L768K6660j5504k4519J6345K5408J3267
13681D1034j0296j63j3255k2358L669P454j3535j7486R204N912J0665J461j4951
13668a2645R646k69k14J2959P479O872r954J2823M942j9356q915J1507J7346o096
13654B6125n760M56l195N221J3054J6971M144O343j6572m1513k1748j3708j2371
13641d2553K0114M998J0224M69j1161k4051n56L3183K1443p483j8551o36J0780
13628c780N438j452l5605P702J5128j8259K921K2616J8237j5413j9284j5121k1616
13615e8488k761K6855J2504J4722J2050l2853n237Q764J7965j1538M030n200l2824
13602e2011J6317J6459K4314J2663j1781n555L855j4741K4838J1081n45j8159
$$ plain form
13590 6735 -10988 -15592 5988 -1332 6587 14570 22797 27045 13632 6715 -3964 -8128 -23098
13577 -23098 -7705 -11765 50 4146 -6340 -8290 -23444 -30597 -24092 -29293 12409 17850 11110
13564 11110 7192 21311 44139 39714 18465 5528 12861 17177 10411 -13320 -31382 -16615 -690
13551 -690 -16296 -43906 -53611 -32467 -22782 -27928 -23583 -8691 -16940 -1804 -13109 -1845 -1848 -7609
13537 -7609 -8071 -32966 -30734 -15181 -18538 -9134 -35624 -35978 -20074 -10020 -12190 -2142 -18648
13524 -18648 -18030 -25680 -20900 -23250 -20468 -36092 -36413 -26670 -7922 12619 14206 19114 28327 21167
13510 21167 11841 19512 19761 8144 -14512 -13362 13229 40481 19638 -21543 -32887 -16374 -4053
13497 -4053 -6054 10786 23259 20611 18610 7439 1586 7850 6500 11280 20538 9520 -2877
$$ packed form
13590F735j7723m604K1580p320P919P983Q227M248j3413o917j0679m164j4970
13577b3098J5393m060J1815M096j0486j950j5154p153O505n201M1702N441o740
13564A1110l918J4119K2828m425k1249j2937P333M316o766k3731j8062J4767J5925
13551f90j5606k7610r705K1144R685n146M345J4892q249J5136j1305J1264ln761
13537g609m62k4895K232J5553l357R404k6490l54J5904J0054k170J0048j6506
13524a8648O18p650M780k350K782j5624l21R743J8748K0541J587M908R213p160
13510B1167r326P671K49j1617k2656J150K6591K7252k0843m1181j1344J6513J2321
13497d053k001J6840J2473k648k001j1171n853O264j350M780R258j1018j2397
$$ plain form
13484 -2877 1367 -2426 9381 15489 3083 -564 14602 16906 10730 14472 894 -17362 -1437
13471 -1437 6237 14087 24741 9616 5224 6481 -13566 -44162 -42874 -674 13985 14272 25832
13458 25832 -10688 -39494 -35130 -30310 5831 17134 -3977 -20560 -15119 -1258 10330 -6548
13446 -6548 -24498 -26574 -41761 -56479 -54237 -51383 -31394 -7020 5310 11449 13959 8295 628
13433 628 -11074 -10987 -16369 -25678 -16958 -6754 -33738 -38667 -21112 -934 11661 7801 -9349 -1078
13419 -1078 -609 -14039 -2407 -715 -8627 2030 10617 11960 1134 13202 23000 23021 12697 21981
13405 21981 16855 2379 -406 1232 -1413 6223 -519 4683 18309 36847 16727 -5423 -23417
13392 -23417 -1580 3098 -2600 -5895 -17874 -27672 -9654 -3036 29948 35578 646 -24899 -37202
$$ packed form
13484b877M244l793J1807O108j2406l647J5166K304o176L742j3578j8256J5925
13471a437P674P850J0654j5125m392J257k0047l0596J288M2200J4659K87J1560
13458B5832l6520k8806M364M820L6141J1303k1111j6583N441J3861J1588j6878
13446f548j7950k076j5187j4718K242K854J9989K4374J2330O139K510n664p667
13433F28j1702Q7n382r309Q720J0204k6984m929J7555K0178J2595l860j7150Q271
13419a078M69j3430J1632J692p912J0657Q587J343j0826J2068R798K1j0324R284
13405B1981n126j4476k785J638k645P636o742N202J3626J8538k0120k2150j7994
13392b3417K1837M678n698l295j1979r798J8018O618L2984N630l4932k5545j2303
$$ plain form
13379 -37202 -61335 -51172 -38393 -33601 -37195 -13386 1323 8034 8332 -2247 -18976 -15544 -33936
13366 -33936 -69571 -81703 -47675 -27952 -265 261 -3861 3499 -9566 8491 4981 -1041 19521
13353 19521 -2577 -5110 -35684 -42354 -11875 -34398 -36875 -29253 -26189 -3792 19569 5742 8962
13340 8962 7111 9340 7146 559 16966 25657 18541 2020 -26101 -18215 -9904 -883 7893 13665
13326 13665 7650 2615 2858 -5997 -16524 -12892 8553 12652 10912 13628 -1888 11912 3312 -1444
13312 -1444 3868 -7583 -28827 -26348 -8226 7129 21559 16241 15438 28683 25203 39010 38706
13299 38706 7243 -15610 -19228 -251 24425 41146 11464 7512 2289 7057 -3641 -4310 5636
13286 5636 24252 14702 4433 -19979 -27475 -24632 -12211 -5664 9017 12491 -4194 -12992 -6989
$$ packed form
13379c7202k4133J0163J2779M792l594K3809J4709O711K98j0579j6729L432j8392
13366c3936l5635j2132L4028J9723K7687N26m122P360j3065J8057l510o022K0562
13353A9521k2098k533l0574o670L0479k2523k477P622L064K2397K3361j3827L220
13340H962j851K229k194o587J6407Q691p116j6521k8121P886Q311R021Q776N772
13326A3665o015n035K43q855j0527L632K1445M099j740K716j5516J3800q600m756
13312a444N312j1451k1244K479J8122J5355J4430n318q03J3245l480J3807l04
13299C8706l1463k2853l618J8977K4676J6721k9682l952n223M768j0698o69R946
13286E636J8616r550j0269k4412p496K843J2421O547J4681L474j6685q798O003
$$ plain form
13273 -6989 -21858 -8258 10327 1287 11570 23572 -3613 -11658 -30005 -46038 -55465 -48542 -25788
13260 -25788 -2128 24030 38387 24861 18803 -12337 -28547 -20094 1233 10675 7483 -3009
13248 -3009 6184 -11182 -14530 -11512 -26746 -16063 -1999 -2465 -11792 -25232 -23814 -33629 -22130
13235 -22130 15125 48133 56208 27206 -18249 -29189 -30347 -26048 -17336 -9361 -17373 -27977 -27328
13222 -27328 -21779 -8063 -10237 -8703 -11237 -2204 -2616 -20986 -20839 -24455 -42841 -29775 -36498 -20234
13208 -20234 -31102 -27066 -15868 -20271 -29932 -22097 -8590 -10814 -5557 9171 3360 2364 25131
13195 25131 21682 20503 4905 -2746 41 -1554 7281 -1896 -5443 -800 1073 -14753 -14926 -23396
13181 -23396 -25284 -19705 -31864 -26671 -26505 -6953 2321 15300 17357 25887 24350 18955 -1897 -19794
$$ packed form
13273f989j4869J3600J8585r040J0283J2002k7185q045j8347j6033r427O923K2754
13260b5788K3660K6158J4357j3526o058l1140j6210Q453K1327R442l192j0492
13248c009R193j7366l348L018j5234J0683J4064m66r327j3440J418r815J1499
13235b2130L7255L3008Q075k9002m5455j0940j158M299Q712P975q012j0604O49
13222b7328N549J3716k174J534k534R033m12j8370J47l616j8386J3066o723J6264
13208b0234j0868M036J1198m403r661P835J3507k224N257J4728n811r96K2767
13195B5131l449j179j5598p651K787j595Q835r177l547M643J873j5826j73q470
13181b3396j888N579j2159N193J66J9552R274J2979K057Q530j537n395k0852j7897
$$ plain form
13167 -19794 -18640 16995 27291 11333 6681 -3695 -20912 -30462 -14648 -3282 -11581 -21670
13155 -21670 -15247 15039 22655 8994 15981 2582 12965 24913 13686 -5974 -31683 -51770
13143 -51770 -39016 -6805 28561 25678 -7676 -28652 -47871 -51926 -44720 -13725 9895 13224
13131 13224 8145 -8983 -18471 -16745 -9536 -13703 -5399 7653 7052 3567 8400 11180 -839 8947
13117 8947 -15917 -10238 -15024 -33583 -48771 -44990 -15894 13236 30338 8216 -25444 -29670 -19098
13104 -19098 -11200 8299 -127 -11094 -2638 3798 22782 23949 -2959 -37913 -42490 -14211 -4289
13091 -4289 -19926 -25393 -12181 -18824 -11150 -7778 2706 10159 17669 9681 -9631 -11834 -4587 9161
13077 9161 -10575 -22466 -7309 6027 16237 2556 -426 -13269 -28252 -9635 12183 5609
$$ packed form
13167a9794J154L5635J0296j5958m652j0376j7217r550J5814J1366q299j0089
13155b1670O423L0286P616j3661O987j3399J0383J1948j1227j9660k5709k0087
13143e1770J2754L2211L5366k883l3354k0976j9219m055P206L0995K3620L329
13131A3224n079j7128r488J726P209m167Q304J3052o01l485M833K780j2019R786
13117H947k4864N679m786j8559j5188L781K9096K9130J7102k2122l3660m226J0572
13104a9098P898J9499q426j0967Q456O436J8984J167k6908l4954m577K8279R922
13091d289j5637n467J3212o643P674L372J0484P453P510p988j9312k203P247J3748
13077I161j9736j1891J5157J3336J0210j3681k982j2843j4983J8617K1818o574
$$ plain form
13065 5609 11524 26967 22361 -2897 7633 13812 -28598 -38650 -16956 10607 1707 7048 2825
13052 2825 2161 14318 2114 7724 9804 33774 35119 -13997 -22530 -21338 -45968 -50033 -43927 -56370
13038 -56370 -42334 -15692 21077 30407 20316 16245 25449 36644 27496 14756 24300 12966 -9017
13025 -9017 -5661 -13798 9873 16630 -2343 -23990 -25329 938 -685 -13082 -45787 -53796 -26847
13012 -26847 -18647 -5553 13399 27162 32158 19601 239 -11439 3918 11160 5819 25793
13000 25793 38149 13134 6430 3550 26982 31832 19991 -663 -1353 -2458 -11656 -17440 541
12987 541 780 19955 22934 11864 -9475 -22282 -7087 -18110 -29545 -14633 -5052 -15084 -8520
12974 -8520 -4566 -13348 -19214 -6229 -9184 -27520 -22410 -28291 -19682 -21342 -17207 3608 12558 16747
$$ packed form
13065E609N915J5443m606k5258J0530O179m2410j0052K1694K7563q900N341m223
13052B825o64J2157j2204N610K080K3970J345m9116q533J192k4630m065O106j2443
13038e6370J4036K6642L6769R330j0091m071R204J1195r148j2740R544j1334k1983
13025i017L356q137K3671O757j8973k1647j339K6267j623j2397l2705q009K6949
13012b6847Q200J3094J8952J3763M996j2557j9362j1678J5357P242n341J9974
13000B5793J2356k5015o704k880K3432M850j1841k0654o90j105r198n784J7981
12987E41K39J9175K979j1070k1339j2807J5195j1023j1435J4912R581j0032O564
12974h520L954q782n866J2985k955j8336N110n881Q609j660M135K0815Q950M189
$$ plain form
12960 16747 10963 9892 -11899 -26834 1874 23938 18925 9952 -19082 -16257 -17257 -14600 -15552
12947 -15552 -15603 -25361 -33495 -15675 -35475 -34830 -29630 -35151 -30819 -48782 -65223 -57948 -16471 21734
12933 21734 28624 7063 -8257 -1300 12709 19098 9960 18762 6412 -21413 -24806 -27415 -41383
12920 -41383 -25402 -2874 5008 -1591 -9200 -8782 19293 44901 25072 27279 22419 12393 9714
12907 9714 2155 -2718 -8808 -25469 -13977 5801 -11843 -26835 -44249 -41756 -33147 -37793 -21889
12894 -21889 -32006 -51114 -48973 -35810 -11345 9615 13434 18920 21994 18877 4432 -31760 -42393
12881 -42393 1333 15608 25780 20789 -162 -24218 -21662 -25701 -4957 18582 13096 8970 20737
12868 20737 -7178 -14246 10453 -2414 -30460 -43060 -28503 -4570 26812 9825 -4082 1187
$$ packed form
12960A6747n784j071k1791j4935K8708K2064n013q973k9034K825j000K657r52
12947a5552n1r758q134J7820j9800O45N200n521M332j7963j6441P275M1477L8205
12933B1734O890k1561j5320O957J4009O389r138Q802j2350k7825l393k609j3968
12920d1383J5981K2528P882o599p609M18K8075K5608j9829K207m860j0026k679
12907I714p559m873o090j6661J1492J9778j7644j4992j7414K493Q609m646J5904
12894b1889j0117j9108K141J3163K4465K0960L819N486L074l117j4445l6192j0633
12881d2393M3726J4275J0172m991k0951k4056K556m039K0744K3539n486m126J1767
12868B0737k7915p068K4699j2867k8046j2600J4557K3933L1382j6987j3907N269
$$ plain form
12856 1187 -1556 614 -6313 -20065 -21615 -20976 -16328 -38033 -47623 -29567 -10798 14027 3115
12843 3115 -15598 -34454 -36238 -20439 -14418 -4852 -6496 -950 2247 -8500 9248 24501 6928
12830 6928 8795 -6404 11484 20340 40683 32579 728 -1901 -2874 -4702 -11520 -9335 -11093 -3655
12816 -3655 -3000 -1165 18012 41316 41043 13532 21843 12346 3497 19491 11395 3071 -4883 -7968
12802 -7968 -7198 737 20429 11196 -21181 -30207 -34656 -33700 -30130 -29654 -26686 -21294 -23279 -11741 -9662
12787 -9662 330 31906 48962 48287 11795 -12465 -41539 -22208 -8785 -16374 -6432 21586 44013
12774 44013 27616 24241 15017 16966 11016 14501 7230 6481 -649 -11115 -682 3641 26136 22751
12760 22751 -2633 -2650 -14132 -37118 -42858 -40184 -33512 -19729 -41085 -42824 -25856 -24192 -7504
$$ packed form
12856A187k743K170o927j3752j550O39M648k1705r590J8056J8769K4825j0912
12843C115j8713j8856j784J5799O021R566j644N546L197j0747J7748J5253j7573
12830F928J867j5199J7888Q856K0343q104l1851k629r73j828o818K185j758P438
12816c655O55J835J9177K3304k73k7511Q311r497q849J5994q096q324p954l085
12802g968P70P935J9692r233l2377r026m449R56L570M76K968N392j985J1538K079
12787i662R992L1576J7056o75l6492k4260k9074J9331J3423p589R942K8018K2427
12774D4013j6397l375r224J949n950L485p271p49p130j0466J0433M323K2495l385
12760B2751k5384j7j1482k2986n740K674O672J3783k1356j739J6968J664J6688
$$ plain form
12747 -7504 -13823 -6007 14510 -3174 -11993 -18696 -44799 -9266 11182 -16565 -13705 -29883 -36881
12734 -36881 10956 22133 17576 22193 16601 4668 -35194 -57709 -28228 1555 3179 -4788 -14213
12721 -14213 -24969 -14231 2599 5575 5726 -797 8154 2928 8011 -12655 -31411 8490 38248
12708 38248 36166 26611 9121 11100 25373 8282 4788 17015 4451 -16447 -26921 6705
12696 6705 38696 32207 22931 23990 30673 53586 46338 6437 -7579 -16519 -28907 -15873 -2250
12683 -2250 -9064 -14049 8123 8611 15540 37641 35663 25212 28108 20413 8885 24105 24427 2631
12669 2631 11075 31078 35905 40800 49370 58592 41746 38168 20375 7009 6290 -23127 -34332
12656 -34332 -5246 30770 41362 14823 9035 9008 1106 8840 -6537 10110 11633 304 -22648
$$ packed form
12747g504o319P816K0517j7684q819o703k6103L5533K0448k7747K860j6178o998
12734c6881M7837J1177m557M617n592j1933l9862k2515K9481K9783J624p967r425
12721a4213j0756J0738J6830K976J51o523Q951n226N083k0666j8756L9901K9758
12708C8248k082r555j7490J979J4273j7091l494J2227j2564k0898j0474L3626
12696F705L1991o489r276J059O683K2913p248l9901j4016q940j2388J3034J3623
12683b250o814m985K2172M88O929K2101j978j0451K896p695j1528J5220L22k1796
12669B631Q444K0003M827M895Q570R222j6846l578j7793j3366p19k9417j1205
12656c4332K9086L6016J0592k6539n788k7p902P734j5377J6647J523j1329k2952
$$ plain form
12643 -22648 -27156 -42226 -25454 -11530 -20929 -13468 447 2220 23131 25459 591 -19058 -21123
12630 -21123 -19008 -28670 -38917 -3293 14359 13495 -6158 -5899 -7587 -2518 9081 1363 -3922 12267
12616 12267 17076 3427 -3563 3123 4585 16005 11371 18014 23812 31128 28635 25989 11472 14253
12602 14253 -3718 -11895 11297 31340 51432 35225 35694 11644 -2909 7065 20136 34183
12590 34183 40582 30526 16730 8012 -2672 -2501 -7955 3126 11017 1990 -8015 -5748 -40097
12577 -40097 -25936 -1710 27960 50459 52235 40842 36905 27983 21850 6064 11041 -6966 -17908
12564 -17908 -13176 -31413 -20470 -5812 11090 16312 20429 25753 7001 -188 4333 28921 27806
12551 27806 13498 4770 -18940 -25241 -4341 1156 -6565 -15291 -23042 -25493 -28584 -7871 387
$$ packed form
12643b2648m508j5070J6772J3924r399P461J3915J773K0911K328k4868j9649k065
12630b1123K115r662j0247L5624J7652q64j9653K59j688N069J1599p718n285J6189
12616A2267M809j3649o990O686J462J1420m634O643N798P316k493k646j4517K781
12602A4253j7971q177K3192K0043K0092j6207M69k4050j4553R974J3071J4047
12590C4183O399j0056j3796q718j0684J71n454J1081P891r027j0005K267l4349
12577d0097J4161K4226K9670K2499J776j1393l937q922o133j5786M977j8007j0942
12564a7908M732j8237J0943J4658J6902N222M117N324j8752p189M521K4588j115
12551B7806j4308q728k3710o301K0900N497p721q726p751k451l091K0713Q258
$$ plain form
12538 387 1698 14751 15682 6796 18192 2431 -11704 4752 11654 -4958 -4544 5339 2925 -15267
12524 -15267 -27031 -26080 1947 7287 18863 -7775 -27858 -9061 6527 6124 22924 10604 3478
12511 3478 2422 14964 370 -19381 -9939 15504 8937 9937 9901 -30930 -58005 -57817 -37713 -4196
12497 -4196 -13726 -1062 10311 30264 25597 20115 14931 -6097 -4547 2383 23466 34382 50106
12484 50106 42260 37009 35285 31959 24188 13362 -10689 -15936 -9482 -4103 -15080 -11633 -23268
12471 -23268 -36352 -18873 1553 7742 830 -3288 9013 20220 23320 26574 33997 17140 -2099
12458 -2099 -4265 -3874 -21378 -42 20648 6988 -38860 -53431 -52543 -19846 2147 -13276 -15836
12445 -15836 -16685 -36177 -25759 5482 5526 -18910 -32611 -4004 22416 22445 -1470 2407 -5480 -29195
$$ packed form
12538C87J311J3053R31q886J1396j5761j4135J6456O902j6612M14R883k414j8192
12524a5267j1764R51K8027N340J1576k6638k0083J8797J5588m03J6800j2320p126
12511C478j056J2542j4594j9751R442K5443o567J000l6m0831k7075J88K0104L3517
12497d196r530J2664J1373J9953m667n482n184k1028J550O930K1083J0916J5724
12484E0106p846n251j724l326p771j0826k4051n247O454N379j0977L447j1635
12471b3268j3084J7479K0426O189o912m118J2301J1207L100L254P423j6857j9239
12458b099k166L91j7504K1336K0690j3660m5848j4571Q88L2697K1993j5423k560
12445a5836q49j9492J0418L1241M4k4436j3701K8607K6420K9k3915L877p887k3715
$$ plain form
12431 -29195 -6609 16569 2211 2384 -8798 -12955 -12234 117 15078 12041 14401 1501 -21082
12418 -21082 -18414 -51622 -53471 -30314 -14751 -10980 7541 598 1243 11097 11634 -4628 -13658 -44389
12404 -44389 -36670 -31705 -38142 -32588 -10093 -18205 -2589 -19679 -15535 6813 13558 3571 8621
12391 8621 19477 8510 5385 11032 10939 18873 23060 30295 28252 27424 25032 2156 -3612 716 -14083
12376 -14083 -9657 -19751 -29073 -23309 -31887 -11547 -10970 -4252 -4583 -24649 -6851 20232 35846
12363 35846 7930 -16009 -6045 -11724 -12661 -16829 -16899 -39154 -51816 -39245 -21698 -17559 -7678 -3391
12349 -3391 344 -2133 -12574 -8959 12534 32431 28607 17476 26129 30241 31828 20845 -1800
12336 -1800 -13681 12282 7183 -16938 -9566 -15272 -17387 -16790 -12289 -22151 -27972 -14552 -16582 -24822
$$ packed form
12431b9195K2586K3178j4358J73j1182m157P21J2351J4961l037K360j2900k2583
12418b1082K668l3208j849K3157J5563L771J8521o943O45R854N37j6262r030l0731
12404d4389P719M965o437N554K2495q112J5616j7090M144K2348O745r987N050
12391H621J0856j0967l125N647r3P934M187P235k043q28k392k2876n768M328j4799
12376a4083M426j0094r322N764q578K0340N77O718l31k0066J7798K7083J5614
12363C5846k7916k3939R964n679r37m168p0k2255j2662J2571J7547M139R881M287
12349c391L735k477j0441L615K1493J9897l824j1131Q653M112J587j0983k2645
12336a800j1881K5963n099k4121P372n706k115N97M501r862n821J3420k030q240
$$ plain form
12322 -24822 -13336 4525 -2910 -11974 -16640 -9023 508 -1561 -5302 -7213 17268 30325 19468
12309 19468 3166 -5461 -1835 -326 21202 39309 33029 22307 25610 -13390 -8567 -7292 -3041
12296 -3041 -7881 -6397 -10 -6206 3572 13399 23820 48885 63261 62014 33466 -11538 -32910
12283 -32910 -7407 -8853 -5092 -20051 -16368 9594 5453 -407 -3933 -3846 13528 -5230 -19946
12270 -19946 -28065 -23555 15764 28825 34927 41053 30465 27667 15373 5332 1974 -5967 -7028
12257 -7028 2206 -15329 -503 -6144 -9894 38525 43891 26093 31259 49808 38339 42005 23255
12244 23255 20243 25050 49731 85860 57442 29567 41121 39789 48456 52942 28231 13685 26491
12231 26491 20766 8101 3791 15194 4477 7505 37093 33776 15331 3084 -5921 -27046 -8336
$$ packed form
12322b4822J1486J7861p435r064m666P617R531k069l741j911K4481J3057j0857
12309A9468j6302q627L626J509K1528J8107o280j0722L303l9000M823J275M251
12296c041m840J484O387o196R778R827J0421K5065J4376j247k8548m5004k1372
12283c2910K5503j446L761j4959L683K5962m141n860l526Q7J7374j8758j4716
12270a9946q119M510L9319J3061O102O126j0588k798j2294j0041l358p941j061
12257g028R234j7535J4826n641l750M8419N366j7798N166J8549j1469L666j8750
12244B3255l012M807K4681L6129k8418k7875J1554j332Q667M486k4711j4546J2806
12231B6491n725j2665m310J1403j0717L028K9588l317j8445j2247r005k1125J8710
$$ plain form
12218 -8336 24048 42279 8962 5051 -24146 -31564 -12279 22445 35438 27466 13845 11532 12173
12205 12173 9430 21390 47491 45511 44598 46676 48727 34917 7114 11101 18131 10497 10400 32908
12191 32908 66272 88802 113277 111520 120070 111884 107210 84211 70254 61857 64991 56511 46415
12178 46415 37890 51280 40411 55566 44303 39992 27775 30944 43171 46178 52562 64523 54948
12165 54948 47369 42365 28995 30963 49850 35886 29532 27412 24282 25269 29850 21346 12404 17876
12151 17876 56711 54000 51640 44287 38480 36963 55867 40197 35869 24611 18423 25367 17100
12138 17100 31942 45314 39297 24446 13572 26806 45344 33560 8059 10361 25611 43065
12126 43065 42693 34250 47944 53204 38342 27230 44299 39625 28978 37511 32612 66984 88500
$$ packed form
12218h336L2384J8231l3317l911k9197p418J9285L4724J2993p972j3621k313O41
12205A2173k743J1960K6101j980r13K078K051j3810k7803L987P030p634r7K2508
12191C2908L3364K2530K4475j757Q550q186m674k2999j3957q397L134q480j0096
12178D6415q525J3390j0869J5155j1263m311j2217L169J2227L007O384J1961r575
12165E4948p579n004j3370J968J8887j3964o354k120l130R87M581q504q942N472
12151A7876L8835k711k360p353n807j517J8904j5670m328j1258o188O944q267
12138A7100J4842J3372o017j4851j0874J3234J8538j1784k5501K302J5250J7454
12126D3065l72q443J3694N260j4862j1112J7069m674j0647Q533m899L4372K1516
$$ plain form
12113 88500 64990 57694 72903 73891 79223 57316 68521 64875 57965 58693 67401 60610 48833 37248
12099 37248 42312 82941 103114 112615 100924 110011 89065 59322 34349 37246 48342 80888
12087 80888 73044 62147 52899 61765 71355 95788 115296 99173 83002 80074 97587 103945 92307
12074 92307 99267 110242 128345 152043 151121 161342 159171 141605 124188 128040 169326 186803 199658
12061 199658 204389 205738 203692 189100 178273 163194 155858 158049 159723 157986 167102 178855 181925
12048 181925 164486 149149 143118 136354 138054 158000 182096 197080 177091 195766 207051 183251
12036 183251 178485 180702 184778 202464 196227 188183 195595 206442 208748 206007 227204 238685 247482
12023 247482 284744 319441 311832 308731 330446 329337 310638 307077 315888 309016 285427 280399 305224
$$ packed form
12113H8500k3510p296J5209R88N332k1907J1205l646o910P28Q708o791j1777j1585
12099C7248N064M0629K0173R501j1691R087k0946k9743k4973K897J1096L2546
12087H0888p844j0897r248Q866R590K4433J9508j6123j6171k928J7513O358j1638
12074I2307O960J0975J8103K3698r22J0221k171j7566j7417L852M1286J7477J2855
12061A99658M731J349k046j4592j0827j5079p336K191J674j737R116J1753L070
12048A81925j7439j5337o031o764J700J9946K4096J4984j9989J8675J1285k3800
12036A83251m766K217M076J7686o237q044P412J0847K306k741K1197J1481Q797
12023B47482L7262L4697p609l101K1715j109j8699l561Q811o872k3589n028K4825
$$ plain form
12010 305224 337483 372979 374944 392489 400090 426032 435440 463845 486229 496224 476731 491746
11998 491746 503401 519649 533331 553037 568121 604893 637018 604154 602449 624789 677530 726767
11986 726767 779436 811107 853260 906264 937815 964583 1014550 1066166 1122311 1158213 1203314
11975 1203314 1262140 1323793 1402967 1480951 1561834 1633465 1723095 1813086 1930230 2017888 2109554
11964 2109554 2277599 2441439 2617277 2786040 2982451 3205046 3429188 3677204 3966222
11955 3966222 4296432 4689613 5123684 5633170 6208777 6865992 7628939 8512183 9559699
11946 9559699 10828682 12339188 14160667 16385225 19136878 22551965 26864037 32276003
11938 32276003 39074300 47551495 57840613 69603878 81607750 91525659 96445494 94613826
$$ packed form
12010C05224L2259L5496J965J7545P601K5942R408K8405K2384R995j9493J5015
11998D91746J1655J6248J3682J9706J5084L6772L2125l2864j705K2340N2741M9237
11986G26767N2669L1671M2153N3004L1551K6768M9967N1616N6145L5902M5101
11975A203314N8826O1653P9174P7984Q0883P1631Q9630Q9991J17144Q7658R1666
11964B109554J68045J63840J75838J68763J96411K22595K24142K48016K89018
11955C966222L30210L93181M34071N09486N75607O57215P62947Q83244J047516
11946I559699J268983J510506J821479K224558K751653L415087M312072N411966
11938C2276003O798297Q477195J0289118J1763265J2003872R917909M919835j831668
$$ plain form
11930 94613826 86809806 75675659 63894280 53145893 44084303 36706475 30724321 25928238
11922 25928238 22087801 18970298 16430379 14351002 12626018 11181312 9945189 8903016
11914 8903016 8017918 7259644 6603814 6015595 5484367 5030697 4632933 4278459 3967887
11905 3967887 3701994 3465373 3258565 3077113 2888187 2721083 2556918 2387224 2247445
11896 2247445 2141911 2041177 1920323 1839255 1755738 1647917 1575001 1500088 1424915 1357448
11886 1357448 1278962 1214290 1182601 1149472 1107076 1065953 1030645 1001416 986209 965392 965020 916722
11874 916722 851711 809111 758274 735721 714950 671803 681447 676679 647324 609417 595905 606914
11862 606914 590383 553925 529277 504538 507713 499794 474781 486145 465323 441959 430750 448836
$$ packed form
11930I4613826p804020j1134147j1781379j0748387r061590p377828n982154m796083
11922B5928238l840437l117503k539919k079377j724984j444706j236123j042173
11914H903016q85098p58274o55830n88219n31228m53670l97764l54474l10572
11905C967887k65893k36621k06808j81452j88926j67104j64165j69694j39779
11896B247445j05534j00734j20854q1068q3517j07821p2916p4913p5173o7467
11886A357448p8486o4672l1689l3129m2396m1123l5308k9229j5207k0817l72m8298
11874I16722o5011m2600n0837k2553k0771m3147R644m768k9355l7907j3512J1009
11862F06914j6531l6458k4648k4739L175p919k5013J1364k0822k3364j1209J8086
$$ plain form
11850 448836 458067 434498 430549 441258 410418 389226 397163 382953 369858 353954 344599 349000
11838 349000 373847 361872 342604 343682 359680 371766 358540 350581 343285 325981 306784 288195
11826 288195 283285 300897 308235 293493 282414 251456 249166 262468 284538 294224 275024 283820
11814 283820 268456 253006 262202 267106 301752 304634 306063 300946 282967 277247 254365 240484 252580
11801 252580 246194 210936 180921 160612 151542 135530 145337 164744 167348 157730 156188 153629 138634
11788 138634 154135 137051 129882 121023 111428 124243 137284 134521 127559 108334 127649 142150
11776 142150 128690 115986 114029 123270 125212 111684 92679 80723 85854 102174 75088 71741
11764 71741 90223 102900 79592 95750 103740 105082 101880 91787 112407 80186 78989 95336
$$ packed form
11850D48836R231k3569l949J0709l0840k1192P937j4210j3095j5904r355M401
11838C49000K4847j1975j9268J078J5998J2086j3226p959p296j7304j9197j8589
11826B88195m910J7612P338j4742j1079l0958k290J3302K2070R686j9200Q796
11814B83820j5364j5450R196M904L4646K882J429n117j7979n720k2882j3881J2096
11801B52580o386l5258l0015k0309r070j6012R807J9407K604r618j542k559j4995
11788A38634J5501j7084p169q859r595J2815J3041k763o962j9225J9315J4501
11776A42150j3460j2704j957R241J942j3528j9005j1956N131J6320k7086l347
11764G1741J8482J2677k3308J6158P990J342l202j0093K0620l2221j197J6347
$$ plain form
11752 95336 93234 58737 58531 47590 57959 80967 96495 110207 100889 114337 115217 100999 82522
11739 82522 55890 68293 88753 83716 76454 57095 55656 74661 62317 52023 61706 78914
11727 78914 66571 48194 48811 59700 62020 62841 65052 66183 57420 49478 38095 65808 71256 58592
11713 58592 58183 37304 20950 47679 73185 73781 60858 55007 63293 51110 55773 45205 20008
11700 20008 -1849 4665 8527 19762 45842 70625 79729 94985 85569 57049 54740 78271 79625
11687 79625 60139 61559 58674 64257 51752 46191 46819 54782 52169 58317 60037 29335 3481 1313
11673 1313 -1482 -18020 -9374 9872 20660 1155 -17054 -14781 1054 30333 41766 52526
11661 52526 39311 30936 36333 37441 31050 19271 37071 16979 -2599 8244 38532 48059 27277
$$ packed form
11752I5336k102l4497k06j0941J0369K3008J5528J3712r318J3448Q80j4218j8477
11739H2522k6632J2403K0460n037p262j9359j439J9005j2344j0294R683J7208
11727G8914j2343j8377O17J0889K320Q21K211J131q763p942j1383K7713N448j2664
11713E8592m09k0879j6354K6729K5506N96j2923n851Q286j2183M663j0568k5197
11700B0008k1857O514L862J1235K6080K4783R104J5256r416k8520k309K3531J354
11687G9625j9486J420k885N583j2505n561O28P963k613O148J720l0702k5854k168
11673A313k795j6538Q646J9246J0788j9505j8209K273J5835K9279J1433J0760
11661E2526j3215q375N397J108o391j1779J7800k0092j9578J0843L0288R527k0782
$$ plain form
11648 27277 15285 12656 14485 14531 26919 36631 33721 31941 54702 53877 56671 32947 22501 15168
11634 15168 27060 53847 57952 56281 46984 51125 66459 51791 57023 65590 49622 37038 38675
11621 38675 27300 22174 46708 52364 31113 42324 33340 17492 13218 13457 10749 -7094 -20551
11608 -20551 -32388 -13040 -13884 -2511 9371 25676 30612 52836 31264 25143 9841 5568 19604
11595 19604 15973 15568 15140 15267 19960 8102 -2063 54 23095 23900 4700 3117 31031 25168
11581 25168 25019 10402 -5073 6392 17876 2105 2340 -3624 10533 31993 41628 38908 43263
11568 43263 38109 21963 2515 -8574 337 19096 43092 25363 169 6455 -5956 2759
11556 2759 15118 16140 823 -1569 -911 17257 6353 -32012 -38948 -14759 17057 17691 105
$$ packed form
11648B7277j1992k629J829M6J2388R712k910j780K2761q25K794k3724j0446p333
11634A5168J1892K6787M105j671r297M141J5334j4668N232Q567j5968j2584J637
11621C8675j1375n126K4534N656k1251J1211q984j5848m274K39k708j7843j3457
11608b0551j1837J9348q44J1373J1882J6305M936K2224k1572o121j5302m273J4036
11595A9604l631m05m28J27M693j1858j0165K117K3041Q05j9200j583K7914n863
11581B5168j49j4617j5475J1465J1484j5771K35n964J4157K1460R635k720M355
11568D3263n154j6146j9448j1089Q911J8759K3996j7729k5194O286j2411Q715
11556B759J2359J022j5317k392O58J8168j0904l8365o936K4189L1816O34j7586
$$ plain form
11543 105 -12560 -19002 -6648 -23751 -8874 -19501 -10494 10247 15548 21912 24303 3801 15909
11530 15909 40655 27615 19446 18020 20466 11649 10488 27318 46669 52961 30324 11022 24875
11517 24875 24985 15896 25590 14557 7017 12183 16619 28806 18734 10754 -657 -5337 19411
11504 19411 26371 1088 -385 -444 -5321 -27071 -31490 -31718 8779 43460 40224 5728 22263 49990
11490 49990 50352 49986 55315 36938 7927 13913 18037 18245 35961 57961 62364 49806 47715 31821
11476 31821 17276 7943 3759 8047 152 -11531 -23331 -17584 -5567 -6231 -16273 -6045 25023
11463 25023 49895 48921 31989 24425 24506 22350 20667 27776 38969 41644 51676 10606 -9569 -15483
11449 -15483 -20579 -29004 -16890 -22447 -632 19233 19797 29796 37912 22819 8449 20534 8652
$$ packed form
11543A05j2665o442J2354j7103J4877j0627R007K0741N301O364K391k0502J2108
11530A5909K4746j3040q169j426K446q817j161J6830J9351O292k2637j9302J3853
11517B4875J10r089R694j1033p540N166M436J2187j0072p980j1411m680K4748
11504A9411O960k5283j473n9m877k1750m419k28M0497L4681l236l4496J6535K7727
11490D9990L62l66N329j8377k9011N986M124K08J7716K2000M403j2558k091j5894
11476C1821j4545r333m184M288p895j1683j1800N747J2017o64j0042J0228L1068
11463B5023K4872r74j6932p564Q1k156j683P109J1193K675J0032m1070k0175n914
11449a5483n096q425J2114n557K1815J9865N64R999Q116j5093j4370J2085j1882
$$ plain form
11436 8652 12602 9249 4581 1173 22147 13906 -6436 -1093 738 -7533 -7522 1491 -7914 -3972 18504
11421 18504 15253 13616 14375 10080 27504 36327 40403 32308 27937 41513 33621 -1315 -18946 -21596
11407 -21596 -20554 -28511 -14298 -11139 -42320 -41104 -23089 -6818 12817 11269 19825 13846 49
11394 49 13932 15564 35832 25887 -2996 -14054 -26848 -44257 -47874 -29919 392 10295 5635
11381 5635 -457 -11811 16724 26823 -4920 -19423 2699 11219 7525 14624 25090 17445 -4831
11368 -4831 21160 42665 23283 5758 14726 29540 31097 17345 -19481 -43083 -14670 4048
11356 4048 -19256 -19878 -6993 -29333 -4827 24442 35880 -67 -253 9535 -4108 6348 -650
11343 -650 18128 15155 -488 -4568 223 8063 16706 18129 20593 31366 29312 24613 26311 39194
$$ packed form
11436H652L950l353m668l408K0974q241k0342N343J831q271J1R013r405L942K2476
11421A8504l251j637P59m295J7424Q823M076q095m371J3576p892l4936j7631k650
11407b1596J042p957J4213L159l1181J216J8015J6271J9635j548Q556n979j3797
11394D9J3883J632K0268r945k8883j1058j2794j7409l617J7955L0311R903m660
11381E635o092j1354K8535J0099l1743j4503K2122Q520l694P099J0466p645k2276
11368d831K5991K1505j9382j7525Q968J4814J557j3752l6826k3602K8413J8718
11356D048k3304o22J2885k2340K4506K9269J1438l5947j86R788j3643J0456o998
11343f50J8778k973j5643m080M791P840Q643J423K464J0773k054m699J698J2883
$$ plain form
11329 39194 38987 19448 9801 8623 5042 3834 2888 2628 -11429 -13083 3909 34385 21089 -10718
11315 -10718 -13026 -5262 6044 6809 -3386 -5532 2449 -25820 -16017 628 -19330 -31890 -27777
11302 -27777 -28425 -6798 18064 16560 14196 6226 -16833 -21030 -17173 -14846 -5169 -4300 12198 26309
11288 26309 33320 38392 33218 57063 38702 3878 -579 -10620 1897 16427 26775 14300
11276 14300 -7533 2492 4372 -3455 2478 -1040 -16676 -15616 -18768 -10249 -3776 4318 6345 10760
11262 10760 -12 -2159 -2766 -3065 -657 -17953 -11495 -6398 -18308 -25792 -18193 -21288 457 -3591
11248 -3591 -24483 -858 15761 -3464 -23097 -8911 -6009 -10026 -9863 -36141 -26548 -18517 -2187
11235 -2187 6478 27642 34428 24626 18304 -7865 -36761 -23476 -21132 -13689 -8542 -41068 -39992
$$ packed form
11329C9194k07j9539r647j178l581j208r46k60j4057j654J6992L0476j3296l1807
11315a0718k308P764J1306P65j0195k146P981k8269R803J6645j9958j2560M113
11302b7777o48K1627K4862j504k364p970k3059m197L857K327R677Q69J6498J4111
11288B6309P011N072n174K3845j8361l4824m457j0041J2517J4530J0348j2475
11276A4300k1833J0025J880p827N933l518j5636J060l152Q519O473Q094K027M415
11262A0760j0772k147o07k99K408j7296O458N097j1910p484P599l095K1745m048
11248c591k0892K3625J6619j9225j9633J4186K902m017J63k6278R593Q031J6330
11235b187Q665K1164O786r802o322k6169k8896J3285K344P443N147l2526J076
$$ plain form
11222 -39992 -36976 -19428 3961 25594 48018 33252 21319 8004 -13458 -21590 -19455 -10756
11210 -10756 -26310 -40795 -21451 -23928 -21413 -11575 -6099 -6047 -12821 -18359 -21260 -30963 -26142 -10268
11196 -10268 -3206 5002 -154 -1772 11277 15291 18503 6472 4981 -2608 -13990 -25107 -24621 9639
11182 9639 16858 13822 24078 5611 -13957 -1211 14020 26214 25233 3807 -10108 -3947 -6643
11169 -6643 13611 24285 39555 18525 -3667 -9137 -17082 -4547 22173 29453 11764 -12609
11157 -12609 -6566 -1761 -1647 -18377 -35960 -39641 -33763 -28450 -19964 -21465 -27458 -967 21548 288
11143 288 -18179 -29906 -8372 -8589 -16033 -37239 -62462 -68372 -54845 -26886 -17749 -12780 15373
11130 15373 35799 22557 -8294 -12487 -4248 4332 21218 9128 18100 11784 5148 115 30888
$$ packed form
11222c9992L016J7548K3389K1633K2424j4766j1933j3315k1462q132K135Q699
11210a0756j5554j4485J9344k477K515R838N476N2o774n538k901r703M821J5874
11196a0268P062Q208n156j618J3049M014L212j2031j491p589j1382j1117M86L4260
11182I639P219l036J0256j8467j9568J2746J5231J2194r81k1426j3915O161k696
11169f643K0254J0674J5270k1030k2192n470p945J2535K6720P280j7689k4373
11157a2609O043M805J14j6730j7583l681N878N313Q486j501n993K6491K2515k1260
11143B88j8467j1727K1534k17p444k1206k5223n910J3527K7959R137M969K8153
11130A5373K0426j3242l0851m193Q239Q580J6886j2090Q972o316o636n033L0773
$$ plain form
11117 30888 42734 25304 1193 -330 12623 10753 -8641 -320 5735 319 2073 19629 798
11104 798 -6745 -23606 -25934 -35088 -39251 5572 22776 -3480 -37824 -42563 -40078 -8773 9724
11091 9724 10610 -870 6898 36305 34571 6499 -3257 -20090 -42372 -28623 -25015 -54506 -54095
11078 -54095 -33810 -11514 -15925 -29152 -25625 -4378 -12306 6671 15889 10691 3435 9445 -8324
11065 -8324 -6254 -5349 2361 30284 34778 24900 10344 -3964 -680 -2339 -15155 -7815 1570 10717
11051 10717 23249 31650 32420 31076 41213 20518 45958 73393 81513 81950 68376 78408 110168
11038 110168 87242 79716 96931 99092 106671 142634 180513 154650 131933 112280 107567 122719
11026 122719 127336 135406 139930 177996 196407 233744 257848 234910 204054 177155 170063 160259
$$ packed form
11117C0888J1846j7430k4111j523J2953j870j9394Q321O055n416J754J7556j8831
11104G98p543j6861k328r154m163M4823J7204k6256l4344m739K485L1305J8497
11091I724Q86j1480P768K9407j734k8072r756j6833k2282J3749L608k9491M11
11078e4095K0285K2296m411j3227L527K1247p928J8977R218n198p256O010j7769
11065h324K070R05P710K7923M494r878j4556j4308L284j659j2816P340R385R147
11051A0717J2532Q401P70j344J0137k0695K5440K7435Q120M37j3574J0032L1760
11038A10168k2926p526J7215K161P579L5963L7879k5863k2717j9653m713J5152
11026A22719M617Q070M524L8066J8411L7337K4104k2938l0856k6899p092r804
$$ plain form
11014 160259 136804 130299 142543 133779 126357 153964 170629 126686 79780 85168 82803 78492 95651
11001 95651 88089 71113 68428 68828 82774 102650 64950 48569 41387 18843 -6876 -1898 2398
10988 2398 4409 19144 15600 8028 20165 4025 -13743 -11003 -2723 8753 9843 2832 2529 19392
10974 19392 21115 20284 13637 -9822 -22026 -16864 17425 24523 18966 17763 15493 4607 4383 8770
10960 8770 268 -6307 470 -4777 737 14636 -195 -7065 -26783 -29012 -28295 -26146 -50156 -50099
10946 -50099 -27322 -22935 -1359 17838 35892 29354 15289 9909 -704 -26709 -36947 -34062
10934 -34062 -36303 -23745 -20835 -26017 -13514 -11802 5163 11030 -18203 -21343 -35957 -34700 -30837
10921 -30837 -28882 -3693 9491 41 -8677 -22964 -39789 -43328 -31909 -26192 -10164 4459 4249
$$ packed form
11014A60259k3455o505J2244q764p422K7607J6665m3943m6906N388k365m311J7159
11001I5651p562j6976k685M00J3946J9876l7700j6381p182k2544k5719M978M296
10988B398K011J4735l544p572J2137j6140j7768K740Q280J1476J090p011l03J6863
10974A9392J723q31o647k3459j2204N162L4289P098n557j203k270j0886k24M387
10960H770q502o575O777n247N514J3899j4831o870j9718k229P17K149k4010N7
10946e0099K2777M387K1576J9197J8054o538j4065n380j0613k6005j0238K885
10934c4062k241J2558K910n182J2503J712J6965N867k9233l140j4614J257L863
10921c0837J955K5189J3184r450q718j4287j6825l539J1419N717J6028J4623k10
$$ plain form
10908 4249 -7278 -1773 10635 15032 17169 -11675 -9223 -3223 9340 6153 719 -249 14292 18480
10894 18480 28003 28259 -3446 8348 12208 28122 38211 40199 44309 32116 36882 33098 21078
10881 21078 19423 7111 -2386 -21293 -18312 -14953 -4247 1403 15851 30028 32445 42825 44660
10868 44660 44348 23271 -849 -23738 -33842 -48935 -34368 -9269 -10124 28924 39512 33032 16697
10855 16697 21600 34889 35190 43791 42600 5055 -1982 3928 5512 21134 10163 29317 16618
10842 16618 19439 35041 39646 26226 7174 552 14738 13889 1337 -27728 -23206 6528 20007
10829 20007 24050 33019 9139 27220 41252 19903 23520 18844 1510 -10755 -4786 -3698 2011
10816 2011 24388 26215 14748 11161 11942 16093 9323 -13617 -13368 -2031 5 3130 -3332 -10832
$$ packed form
10908D249j1527N505J2408M397K137k8844K452O000J2563l187n434r68J4541M188
10894A8480R523K56l1705J1794L860J5914J0089J988M110j2193M766l784j2020
10881B1078j655j2312r497j8907K981L359J0706N650J4448J4177K417J0380J835
10868D4660l12k1077k4120k2889j0104j5093J4567K5099q55L9048J0588o480j6335
10855A6697M903J3289L01Q601j191l7545p037N910J584J5622j0971J9154j2699
10842A6618K821J5602M605j3420j9052o622J4186q49j2552k9065M522K9734J3479
10829B0007M043Q969k3880J8081J4032k1349L617m676j7334j2265N969J088N709
10816B011K2377J827j1467l587P81M151o770k2940K49J1337K036L125o462p500
$$ plain form
10802 -10832 18916 42501 53736 55426 21376 14596 19128 22969 6943 -143 8928 28705 33431
10789 33431 19659 16655 20220 21110 894 12560 1098 -6158 -17959 -15142 -6838 -3079 6086
10776 6086 6067 27754 2356 147 25306 35114 39968 26231 2956 14734 13270 7217 2860 1173
10762 1173 8628 20502 24711 38665 31062 12111 16107 38679 39181 18475 -3270 5278 12040
10749 12040 20643 31501 37421 9219 13103 40785 30994 1019 -2493 33290 55943 61747 54826
10736 54826 38166 28550 31174 26236 29416 30052 18491 21666 45731 78246 63172 47318 31565
10723 31565 17724 21658 18926 14145 15788 28330 38863 49280 60074 25436 -12208 643
10711 643 23650 34843 34981 41196 43705 36588 18962 6857 1375 10500 25063 9405 -860
$$ packed form
10802a0832K9748K3585J1235J690l4050o780M532L841j6026p086R071J9777M726
10789C3431j3772l004L565Q90k0216J1666j1462p256j1801K817Q304L759R165
10776F086j9K1687k5398k209K5159R808M854j3737k3275J1778j464o053m357j687
10762A173P455J1874M209J3954p603j8951L996K2572N02k0706k1745Q548O762
10749A2040Q603J0858N920k8202L884K7682r791k9975l512L5783K2653N804o921
10736E4826j6660r616K624m938L180O36j1561L175K4065L2515j5074j5854j5753
10723C1565j3841L934k732m781J643J2542J0533J0417J0794l4638l7644J2851
10711F43K3007J1193J38O215K509p117j7626j2105n482R125J4563j5658j0265
$$ plain form
10698 -860 13026 15047 24949 25626 23302 7705 45257 46629 32376 4039 18724 32828 16602
10685 16602 -6597 19743 47173 60705 44130 14813 2834 16256 43683 40674 13527 11025
10673 11025 34751 50145 63260 55372 67563 66709 58342 84220 96546 59598 38393 39409 70435
10660 70435 94096 110590 112571 121001 133022 139130 182282 233167 255315 267018 278589 293434
10648 293434 326902 326947 289749 247777 245960 278921 299088 309308 334839 352250 373801 415409
10636 415409 449148 486387 570172 668355 783738 914140 987049 1030399 1077397 1168385 1284958
10625 1284958 1434455 1621591 1912635 2270685 2769101 3479381 4464176 5787535 7498637
10616 7498637 9666378 11978147 13754921 14365746 13855309 12901905 12130071 11886399 12301187
$$ packed form
10698h60J3886K021R902O77k324j5597L7552J372j4253k8337J4685J4104j6226
10685A6602k3199K6340K7430J3532j6575k9317j1979J3422K7427l009k7147k502
10673A1025K3726J5394J3115p888J2191q54q367K5878J2326l6948k1205J016L1026
10660G0435K3661J6494J981Q430J2021O108M3152N0885K2148J1703J1571J4845
10648B93434L3468M5l7198m1972j817L2961K0167J0220K5531J7411K1551M1608
10636D15409L3739L7239Q3785R8183J15383J30402P2909M3350M6998R0988J16573
10625A284958J49497J87136K91044L58050M98416P10280R84795J323359J711102
10616G498637K167741K311769J776774O10825n10437r53404p71834k43672M14788
$$ plain form
10607 12301187 13489200 15636557 18953169 23453461 28271388 31486214 31490220 28796285
10599 28796285 25397250 22703323 21228135 21066459 22323748 25137835 29639425 35572297
10591 35572297 41510911 44630398 42826489 37390624 31311652 26457958 23245654 21580541
10583 21580541 21314620 22421250 24811333 28098764 31134900 31997426 29595355 25040255
10575 25040255 20352625 16694589 14251138 12840195 12253270 12378199 13039085 13942464 14571435
10566 14571435 14270151 12787995 10553777 8280436 6373003 4964917 3936339 3191103
10558 3191103 2668439 2277193 1959761 1700037 1501081 1358835 1220133 1109314 1003197
10549 1003197 904879 849718 773624 721241 631372 552749 502423 471004 453230 432137 414247
$$ packed form
10607A2301187J188013K147357L316612M500292M817927L214826M006k693935
10599B8796285l399035k693927j475188j61676J257289K814087M501590N932872
10591C5572297N938614L119487j803909n435865o078972m853694l212304j665113
10583B1580541k65921J106630K390083L287431L036136Q62526k402071m555100
10575B5040255m687630l658036k443451j410943n86925J24929O60886R03379O28971
10566A4571435l01284j482156k234218k273341j907433j408086j028578p45236
10558C191103n22664l91246l17432k59724j98956j42246j38702j10819j06117
10549A003197r8318n5161p6094n2383q9869p8623n0326l1419j7774k1093j7890
$$ plain form
10538 414247 392924 398903 382142 367089 356944 303242 282187 281832 265279 263869 271015 274087 280572
10525 280572 271592 259375 242737 216994 193042 201878 198336 178585 190831 187530 172716 186615
10513 186615 194925 180172 176373 172792 144166 156117 180099 173050 178016 174646 149602 144066 159403
10500 159403 154146 174921 199778 188275 165861 139325 113770 93138 109996 136908 143170 145852
10488 145852 135149 119094 123592 118760 99658 98292 91252 105716 100504 122532 135327 154923
10476 154923 137677 123487 110082 106004 94393 99368 97570 101594 104807 105223 104127 96534 121626
10463 121626 131460 112922 111185 106447 84994 70968 77032 97486 101270 109958 106420 85755 63480
10450 63480 67117 77099 59578 63345 60912 36716 22335 40510 60941 59063 51209 58619 86060
$$ packed form
10538D14247k1323N979j6761j5053j0145n3702k1055l55j6553j410P146L072O485
10525B80572q980j2217j6638k5743k3952Q836l542j9751J2246l301j4814J3899
10513A86615Q310j4753l799l581k8626J1951K3982p049M966l370k5044n536J5337
10500A59403n257K0775K4857j1503k2414k6536k5555k0632J6858K6912O262K682
10488A45852j0703j6055M498m832j9102j366p040J4464n212K2028J2795J9596
10476A54923j7246j4190j3405m078j1611M975j798M024L213M16j096p593K5092
10463A21626R834j8538j737m738k1453j4026O064K0454L784Q688l538k0665k2275
10450F3480L637R982j7521L767k433k4196j4381J8175K0431j878p854P410K7441
$$ plain form
10437 86060 95087 72719 55943 39545 29385 26286 9011 16610 24514 42420 59689 59280 48673
10424 48673 42157 36614 18146 16170 49036 73895 57705 41410 21801 6677 9419 37013
10412 37013 39569 60597 65681 57394 48861 23120 1701 5084 9957 19864 24060 27809 55520
10399 55520 41623 24096 32410 41509 33935 38834 42361 30631 27696 36234 32666 21430 37544
10386 37544 61824 84630 87507 74464 66217 56707 57136 80976 111102 140674 161561 178694 205091
10373 205091 204066 203351 190840 171126 156037 127491 129270 136540 115406 89607 74703 56419
10361 56419 31546 27213 49055 51339 36084 36339 32417 21345 9524 14560 37214 39075 19774
10348 19774 20669 21988 10640 8269 17366 43539 56968 25288 3618 -17122 -9808 8742 16756
$$ packed form
10437H6060R027k2368j6776j6398j0160l099j7275P599P904J7906J7269m09j0607
10424D8673o516n543j8468j976L2866K4859j6190j6295j9609j5124K742K7594
10412C7013K556K1028N084q287q533k5741k1419L383M873R907M196L749K7711
10399E5520j3897j7527Q314R099p574M899L527j1730k935Q538l568j1236J6114
10386C7544K4280K2806K877j3043q247r510M29K3840L0126K9572K0887J7133K6397
10373B05091j025p15j2511j9714j5089k8546J779P270k1134k5799j4904j8284
10361E6419k4873m333K1842K284j5255K55l922j1072j1821N036K2654J861j9301
10348A9774Q95J319j1348k371R097K6173J3429l1680k1670k0740P314J8550Q014
$$ plain form
10335 16756 41332 48717 25051 14384 14990 12109 32928 32565 10603 19137 39534 41194 56523
10322 56523 54184 26239 35664 27610 13304 14822 13631 27549 25871 11418 14082 23357 14243
10309 14243 4124 7460 31682 48938 35603 29892 39865 46107 59834 65448 67551 39557 24514
10296 24514 25125 33881 32033 18096 21958 26642 37932 38176 41254 29363 28741 16276 6247 23356
10282 23356 24714 21873 28003 30654 36643 52902 32247 12358 22160 59450 80700 99413 147638
10269 147638 223574 333841 423727 496263 597339 717467 812356 856844 875308 861022 808917
10258 808917 744589 632795 502813 406633 314851 228728 135853 87414 87731 84763 75762 69224
10246 69224 58012 65658 76583 70701 62655 62593 56071 50556 43349 31298 29064 45078 29546 8158
$$ packed form
10335A6756K4576P385k3666j0667O06k881K0819l63k1962Q534K0397J660J5329
10322E6523k339k7945R425q054j4306J518j191J3918j678j4453K664R275r114
10309A4243j0119L336K4222J7256j3335n711R973O242J3727N614K103k7994j5043
10296B4514O11Q756j848j3937L862M684J1290K44L078j1891o22j2465j0029J7109
10282B3356J358k841O130K651N989J6259k0655j9889R802L7290K1250J8713M8225
10269A47638P5936J10267Q9886P2536J01076J20128R4889M4488J8464j4286n2105
10258H08917o4328j11794j29982r6180r1782q6123r2875m8439L17k968r001o538
10246F9224j1212P646J0925n882q046o2o522n515p207j2051k234J6014j5532k1388
$$ plain form
10232 8158 3693 -3212 4933 16562 16732 35594 53170 57461 50631 34872 14444 33023 45461
10219 45461 39184 32762 15526 19749 28277 40491 37106 29856 14255 12369 2615 -7378 -10913 -8689
10205 -8689 593 -7280 -16142 151 5890 -1506 -91 -1676 732 2828 -4242 -4316 -3414 -5805 19209
10190 19209 47870 46805 32224 26787 -5088 -6819 17564 54816 76127 84891 75418 80951 93988
10177 93988 93889 89833 95138 97591 85495 89817 106494 112524 133590 151443 181086 198483 178406
10164 178406 179274 173609 136879 115873 134884 155307 172609 193538 220862 266872 302020 316495
10152 316495 278255 236873 210621 194516 162558 152777 171252 178818 170962 187669 217662 246468
10140 246468 262066 247833 230436 225315 201290 200786 204673 210926 233017 297359 347390 375905
$$ packed form
10232H158m465o905Q145J1629J70J8862J7576M291o830j5759k0428J8579J2438
10219D5461o277o422j7236M223Q528J2214l385p250j5601j886r754r993l535K224
10205h689R282p873q862J6293N739p396J415j585K408K096p070p4R02k391K5014
10190A9209K8661j065j4581n437l1875j731K4383L7252K1311Q764r473N533J3037
10177I3988r9m056N305K453j2096M322J6677O030K1066J7853K9643J7397k0077
10164A78406Q68n665l6730k1006J9011K0423J7302K0929K7324M6010L5148J4475
10152C16495l8240m1382k6252j6105l1958r781J8475P566p856J6707K9993K8806
10140B46468J5598j4233j7397n121k4025n04L887O253K2091O4342N0031K8515
$$ plain form
10128 375905 469846 620633 854996 1128202 1372789 1515835 1635426 1744172 1869965 2013543
10118 2013543 2128064 2115387 2005020 1871465 1741925 1653220 1544678 1369689 1100459 805185
10108 805185 592767 431692 323859 245038 218594 198927 196135 188100 178454 165621 150030
10097 150030 153712 146485 133025 112228 83048 76414 99245 99156 83214 82008 83040 81411 63528
10084 63528 60623 34294 22899 48010 51934 23440 7386 12114 30355 57740 24766 -16132
10072 -16132 -19573 22307 20792 12714 3973 -8134 -10280 18223 7698 6928 28378 44550 37433
10059 37433 24850 42933 58700 33156 3883 10138 8572 44392 63100 44496 29245 36646
10047 36646 25454 3315 1060 5234 12765 38228 52083 45743 57416 52966 47592 19166 9404
$$ packed form
10128C75905R3941J50787K34363K73206K44587J43046J19591J08746J25793J43578
10118B013543J14521j2677j10367j33555j29540q8705j08542j74989k69230k95274
10108H05185k12418j61075j07833p8821k6444j9667k792q035r646j2833j5591
10097A50030L682p227j3460k0797k9180o634K2831q9j5942j206J032j629j7883
10084F3528k905k6329j1395K5111L924k8494j6054M728J8241K7385l2974m0898
10072a6132l441M1880j515q078q741j2107k146K8503j0525p70K1450J6172p117
10059C7433j2583J8083J5767k5544k9273O255j566L5820J8708j8604j5251P401
10047C6646j1192k2139k255M174P531K5463J3855o340J1673m450n374k8426r762
$$ plain form
10034 9404 13051 18695 6552 -8213 -5876 24571 26200 31518 36447 44024 45472 37805 31268 10393
10020 10393 246 20272 40106 52151 71977 63300 43895 42035 15722 -9975 3075 14999
10008 14999 38488 50315 46186 57721 53474 44003 71247 79939 51421 45803 26521 30703 31592
9995 31592 31380 44360 46360 66253 82483 98993 107451 101832 89007 87811 96702 94473 103769 124187
9981 124187 147878 159242 202986 212679 249684 302606 333447 346055 355453 345640 346108 366569 371515
9968 371515 367054 331194 303856 279263 251052 240268 199215 149168 124253 105774 121699 130913
9956 130913 124262 124975 114085 120989 103231 85165 82985 85670 92312 97498 97482 137373 129162 141899
9942 141899 134725 137958 136906 108004 96711 109695 129441 127165 134513 145637 146510 124994 92932
$$ packed form
10034I404L647N644j2143j4765K337L0447J629N318M929P577J448p667o537k0875
10020A0393j0147K0026J9834J2045J9826q677j9405j860k6313k5697J3050J1924
10008A4999K3489J1827m129J1535m247r471K7244Q692k8518n618j9282M182Q89
9995C1592k12J2980K000J9893J6230J6510Q458n619j2825j196Q891k229R296K0418
9981A24187K3691J1364M3744R693L7005N2922L0841J2608R398r813M68K0461M946
9968C71515m461l5860k7338k4593k8211j0784m1053n0047k4915j8479J5925R214
9956A30913o651P13j0890O904j7758j8066k180K685O642N186j6L9891q211J2737
9942A41899p174L233j052k8902j1293J2984J9746k276P348J1124Q73k1516l2062
$$ plain form
9929 92932 81355 92902 130941 168988 188918 184065 185465 176141 192303 201831 207088 227564 270675
9916 270675 346920 453331 633866 840866 1077766 1324154 1525972 1715526 1871161 2024180
9906 2024180 2121727 2150845 2106648 1987358 1814850 1625991 1417049 1184483 926396 730441
9896 730441 593372 497947 418342 354006 316080 327467 335879 321162 297830 256150 210992 216440
9884 216440 242365 241019 216116 191546 185169 183963 184544 173249 155460 162043 168905 174918 216146
9871 216146 221182 236577 255971 261981 244950 237592 258755 263609 250773 251962 271464 307101 319996
9858 319996 336755 363929 397348 459225 514746 574441 620310 657166 692349 710645 735416 740198
9846 740198 719258 696796 657344 619700 542559 471488 407163 367258 319090 262666 207379 167871
$$ packed form
9929I2932j1577J1547L8039L8047J9930m853J400r324J6162R528N257K0476M3111
9916B70675P6245J06411J80535K07000K36900K46388K01818J89554J55635J53019
9906B024180R7547K9118m4197j19290j72508j88859k08942k32566k58087j95955
9896G30441j37069r5425p9605o4336l7926J1387Q412j4717k3332m1680m5158N448
9884B16440K5925j346k4903k4570o377j206N81j1295j7789O583O862O013M1228
9871B16146N036J5395J9394O010j7031p358K1163M854j2836J189J9502L5637J2895
9858C19996J6759K7174L3419O1877N5521N9695M5869L6856L5183J8296K4771M782
9846G40198k0940k2462l9452l7644p7141p1071o4325l9905m8168n6424n5287l9508
$$ plain form
9834 167871 180427 182065 185646 192426 161991 140796 134855 142987 142116 143427 149854 154010 150041 164544
9820 164544 190337 181038 196184 221587 225911 200068 203090 229302 267930 287593 309952 313743
9808 313743 326803 347568 379354 399230 422943 423721 382971 369347 400972 438012 470866 482328
9796 482328 494109 507382 528274 563652 572247 567869 574562 596466 619934 661117 695603 697962
9784 697962 708826 753149 779793 786737 807107 838780 872856 912891 959281 999544 1047614 1086212
9772 1086212 1155509 1214734 1272658 1327914 1401488 1493240 1573180 1665541 1740446 1825948 1908409
9761 1908409 2024798 2172704 2290570 2379357 2486137 2626712 2798981 3000320 3240524 3471115
9751 3471115 3739206 4045331 4396553 4827015 5326424 5940274 6727436 7642708 8578481 9583901
$$ packed form
9834A67871J2556J638L581O780l0435k1195n941Q132q71J311O427M156l969J4503
9820A64544K5793r299J5146K5403M324k5843L022K6212L8628J9663K2359L791
9808C13743J3060K0765L1786J9876K3713P78m0750j3624L1625L7040L2854J1462
9796D82328J1781J3273K0892L5378Q595m378O693K1904K3468M1183L4486K359
9784F97962J0864M4323K6644O944K0370L1673L4076M0035M6390M0263M8070L8598
9772A086212O9297N9225N7924N5256P3574R1752P9940R2361P4905Q5502Q2461
9761A908409J16389J47906J17866Q8787J06780J40575J72269K01339K40204K30591
9751C471115K68091L06125L51222M30462M99409O13850P87162R15272R35773J005420
$$ plain form
9741 9583901 10665762 11856865 13234519 14835918 16654589 18512787 20510997 22925968
9733 22925968 25943813 29955616 35352592 42910436 53856526 70790623 98076248 140938024
9725 140938024 197919791 248144088 279404388 300320799 317243336 342951779 371149722
9718 371149722 397008663 401268852 377753313 350733451 325142060 307947482 289943099
9711 289943099 261382464 216110083 158817184 112613394 82796491 63906961 51476176
9704 51476176 42839526 36560878 31819729 28137987 25181368 22717184 20609516 18682328
9696 18682328 16861737 15176544 13688749 12320249 11111443 10046405 9092936 8175076
9688 8175076 7347912 6616895 6038611 5569621 5186091 4873132 4573519 4308774 4059402 3845525
$$ packed form
9741I583901J081861J191103J377654J601399J818671J858198J998210K414971
9733B2925968L017845M011803N396976P557844J0946090J6934097K7285625M2861776
9725A40938024N6981767N0224297L1260300K0916411J6922537K5708443K8197943
9718C71149722K5858941M260189k3515539k7019862k5591391j7194578j8004383
9711B89943099k8560635m5272381n7292899m6203790k9816903j8889530j2430785
9704E1476176q636650o278648m741149l681742k956619k464184k107668j927188
9696A8682328j820591j685193j487795j368500j208806j065038r53469r17860
9688H175076q27164p31017n78284m68990l83530l12959k99613k64745k49372k13877
$$ plain form
9678 3845525 3645269 3468519 3292512 3142954 3003467 2857809 2720207 2621096 2554683 2466111
9668 2466111 2352435 2246920 2149943 2067307 2003449 1951697 1902017 1835250 1799766 1768458 1728079
9657 1728079 1678787 1622475 1591457 1563336 1545987 1526354 1551791 1611045 1616711 1469917 1350377
9646 1350377 1268202 1186883 1142721 1098366 1052768 1046648 1036679 1005954 977120 976415 962937 934441
9634 934441 900236 878956 866113 858748 848185 839886 840784 827919 806467 801055 815030 825103 825406
9621 825406 808987 811922 798548 775518 749218 732717 709660 712555 696323 691867 695058 712693
9609 712693 717342 697885 684086 682738 690054 703958 732816 753298 793465 824999 863289 889462
9597 889462 917004 928246 937869 934333 917112 902771 846224 802506 777114 717534 662147 597329
$$ packed form
9678C845525k00256j76750j76007j49558j39487j45658j37602r9111o6413q8572
9668B466111j13676j05515r6977q2636o3858n1752m9680o6767l5484l1308m0379
9657A728079m9292n6312l1018k8121j7349j9633K5437N9254N666j46794j19540
9646A350377q2175q1319m4162m4355m5598o120r969l0725k8834p05j3478k8496
9634I34441l4205k1280j2843p365j0563q299Q98j2865k1452n412J3975J0073L03
9621H25406j6419K935j3374k3030k6300j6501k3057K895j6232m456L191J7635
9609G12693M649j9457j3799j348P316J3904K8858K0482M0167L1534L8290K6173
9597H89462K7542J1242R623l536j7221j4341n6547m3718k5392n9580n5387o4818
$$ plain form
9585 597329 533966 474517 435297 411733 382098 369542 338132 337514 342284 332172 334303 344581
9573 344581 348745 331703 340139 348494 360017 340839 337447 349753 334476 335900 324791 290297 289513
9560 289513 303827 296359 322515 303016 299197 290909 269123 265517 246113 264792 277415 255650
9548 255650 247963 227744 229206 230283 217486 222591 223998 188985 174019 201675 189292 171526 175360
9535 175360 183349 202581 207826 196423 193662 215001 221036 230208 235444 252117 260239 267515 255061
9522 255061 258945 257221 262613 246428 243311 236537 239441 233074 229342 233251 216268 221491 206597 193350
9508 193350 181771 177634 184098 191956 176278 160729 152230 147986 155705 180086 172241 135572 121252
9495 121252 131454 124535 95195 86002 92558 102924 102227 89089 110935 130149 125396 125866 97415
$$ packed form
9585E97329o3363n9449l9220k3564k9635j2556l1410o18M770j0112K131J0278
9573C44581M164j7042Q436Q355J1523j9178l392J2306j5277J424j1109l4494p84
9560B89513J4314p468K6156j9499l819q288k1786l606j9404J8679J2623k1765
9548B55650p687k0219J462J077j2797N105J407l5013j4966K7656j2383j7766L834
9535A75360P989J9232N245j1403k761K1339O035R172N236J6673Q122P276j2454
9522B55061L884j724N392j6185l117o774K904o367l732L909j6983N223j4894j3247
9508A93350j1579m137O464P858j5678j5549q499m244P719K4381p845l6669j4320
9495A21252J0202o919k9340r193O556J0366o97j3138K1846J9214m753M70k8451
$$ plain form
9482 97415 98696 105130 93199 94186 139171 187323 179531 166035 150602 109832 110901 132718 159779
9469 159779 162447 153508 142823 135015 127265 140403 151428 162532 156219 162074 142929 139870 173462
9456 173462 167818 171243 177408 170228 143560 115249 119216 148355 161536 172464 158636 167228 168957
9443 168957 151479 137388 143605 152730 165922 169498 165258 140229 108341 94281 100920 115008 153939
9430 153939 157186 140433 137201 138412 118003 121395 143450 155227 147797 143428 95268 68040 76925
9417 76925 76290 105223 123890 97409 79059 62627 66481 64956 68387 72797 68560 79898 92277
9404 92277 105568 116503 125634 142993 117573 92555 103698 92844 87218 95093 97165 99398 97548
9391 97548 88975 83880 80701 72450 76302 78036 87877 112485 127031 127556 123016 131743 132053 122331 135611
$$ packed form
9482I7415J281O434j1931R87M4985M8152p792j3496j5433m0770J069K1817K7061
9469A59779K668q939j0685p808p750J3138J1025J1104o313N855j9145l059L3592
9456A73462n644L425O165p180k6668k8311L967K9139J3181J0928j3828Q592J729
9443A68957j7478j4091O217R125J3192L576m240k5029l1888j4060O639J4088L8931
9430A53939L247j6753l232J211k0409L392K2055J1777p430m369m8160k7228Q885
9417G6925o35K8933J8667k6481j8350j6432L854j525L431M410m237J1338J2379
9404I2277J3291J0935R131J7359k5420k5018J1143j0854n626P875K072K233j850
9391I7548q573n095l179q251L852J734R841K4608J4546N25m540Q727L10r722J3280
$$ plain form
9376 135611 111908 121802 126234 115834 118498 116655 97946 92481 96154 94345 103302 97272 91647 107732
9362 107732 120520 102601 100606 110157 100088 90204 96374 104404 103960 105279 117424 117548 78284 81443
9348 81443 89037 99605 97879 112847 110737 114939 122216 88173 64154 62736 76404 97865 111378
9335 111378 84180 80069 105222 125475 149042 156327 139502 147872 166282 192959 233250 293027
9323 293027 352856 451476 598289 849395 1136974 1404229 1569717 1687151 1772695 1888385
9313 1888385 2014776 2119079 2125778 2037226 1910212 1778145 1672398 1558318 1387152 1158172
9303 1158172 882241 648663 486775 375414 315409 271813 227541 195644 187337 192265 183797
9292 183797 179064 164270 133723 119007 118872 115600 130100 121371 116678 142638 156512 118884 95055
$$ packed form
9376A35611k3703R894M432j0400K664j843j8709n465L673j809Q957o030n625J6085
9362A07732J2788j7919j995R551j0069r884O170Q030m44J319J2145J24l9264L159
9348H1443P594J0568j726J4968k110M202P277l4043k4019j418J3668K1461J3513
9335A11378k7198m111K5153K0253K3567P285j6825Q370J8410K6677M0291N9777
9323B93027N9829R8620J46813K51106K87579K67255J65488J17434Q5544J15690
9313A888385J26391J04303O699q8552j27014j32067j05747j14080j71166k28980
9303A158172k75931k33578j61888j11361o0005m3596m4272l1897q307M928q468
9292A83797m733j4794l0547j4716j35l272J4500q729m693K5960J3874l7628k3829
$$ plain form
9279 95055 102646 84746 60456 39022 42656 55801 44646 26837 36413 41638 27152 17519 -8497
9266 -8497 8252 49529 69618 54462 47855 54119 52120 34437 30011 32262 31535 34556 33820 45015
9252 45015 65393 70083 62226 43515 22266 5388 19738 38331 41213 56363 78298 62243
9240 62243 47662 49362 15694 5390 -19435 -2647 35773 55320 57287 61862 39687 28204
9228 28204 13906 11819 12886 25302 29923 37558 42420 54733 49989 25659 15533 38010 34900
9215 34900 40660 45979 41431 47429 37047 45472 32094 13978 39015 56106 42560 60803 75690
9202 75690 74779 49265 46999 35704 -2065 15258 25338 24967 40578 55897 43582 45037 36158
9189 36158 28200 38086 29478 7642 -8607 -5964 -10085 -1217 25151 42785 37320 32783 40862 45791
$$ packed form
9279I5055P591j7900k4290k1434L634J3145j1155j7809R576N225j4486r633k6016
9266h497J6749M1277K0089j5156o607O264j999j7683m426K251p27L021p36J1195
9252D5015K0378M690p857j8711k1249j6878J4350J8593K882J5150K1935j6055
9240F2243j4581J700l3668j0304k4825J6788L8420J9547J967M575k2175j1483
9228B8204j4298k087J067J2416M621P635M862J2313m744k4330j0126K2477l110
9215C4900N760N319m548N998j0382Q425j3378j8116K5037J7091j3546J8243J4887
9202G5690r11k5514k266j1295l7769J7323J0080l71J5611J5319j2315J455q879
9189C6158p958R886q608k1836j6249K643m121Q868K6368J7634n465m537Q079M929
$$ plain form
9175 45791 23765 9885 9076 22188 11680 -9789 -3981 752 9497 25859 34428 10318 33257
9162 33257 54607 45842 41860 19354 -15009 -4018 22405 19797 10872 15945 -8895 1079 20807
9149 20807 41532 64053 56000 43032 11633 -13445 -25772 -25897 -7100 25010 34261 12788 -1111
9136 -1111 12417 1302 -6217 5307 10310 26682 28053 44156 65225 46452 1439 -13593 -15314
9123 -15314 -35064 -27675 14468 41289 6821 -11000 -20026 -24634 -2289 4086 19600 7725 11973
9110 11973 12019 3833 2202 -8909 -19793 -22578 1063 33482 59075 59287 56240 46957 42915 28967
9096 28967 15952 42478 52513 67990 45743 21301 28679 38561 28241 32282 19803 31247
9084 31247 43382 52921 19798 -7206 -8934 8108 27713 20694 16989 27402 20872 18746 17653
$$ packed form
9175D5791k2026j3880q09J3112j0508k1469N808M733Q745J6362Q569k4110K2939
9162C3257K1350q765l982k2506l4363J0991K6423k608q925N073k4840R974J9728
9149B0807K0725K2521q053j2968l1399k5078j2327j25J8797L2110R251k1473j3899
9136a111J3528j1115p519J1524N003J6372J371J6103K1069j8773m5013j5032j721
9123a5314j9750P389M2143K6821l4468j7821r026m608K2345O375J5514j1875M248
9110A1973M6q186j631j1111j0884k785K3641L2419K5593K12l047r283m042j3948
9096B8967j3015K6526J0035J5477k2247k4442P378R882j0320M041j2479J1444
9084C1247J2135R539l3123k7004j728J7042J9605p019l705J0413o530k126j093
$$ plain form
9071 17653 21468 13858 18294 35575 23361 -691 -16346 5541 33235 44565 47607 36117 39623
9058 39623 27744 51801 55185 49421 39526 57663 65996 49603 33607 17830 10016 17644 16553
9045 16553 32399 49083 26571 -6823 -21729 -10166 101 2882 23060 35993 36772 42077 33741
9032 33741 34008 36003 26875 28032 26972 20194 27064 14851 12972 19146 22313 21571 38529 55801
9018 55801 67306 60636 43954 56918 44310 25201 51650 49304 38283 52772 39041 28545
9006 28545 43254 51595 65227 55905 52830 28339 15204 27482 35636 42512 45170 42007 6354
8993 6354 -999 4310 33295 50211 50367 33070 24439 9811 6335 -4059 4535 24731 25754 28932
8979 28932 23020 3477 -13795 -20296 -13514 5153 -1718 -7752 5160 -764 1012 -11504 -33091
$$ packed form
9071A7653L815p610M436J7281j2214k4052j5655K1887K7694J1330L042j1490L506
9058C9623j1879K4057L384n764r895J8137Q333j6393j5996j5777p814P628j091
9045A6553J5846J6684k2512l3394j4906J1563J0267K781K0178J2933P79N305q336
9032C3741K67J995r128J157j060o778O870j2213j879O174L167p42J6958J7272
9018E5801J1505o670j6682J2964j2608j9109K6449k346j1021J4489j3731j0496
9006B8545J4709Q341J3632r322l075k4491j3135J2278Q154O876K658l163l5653
8993F354p353N309K8985J6916J56j7297q631j4628l476j0394Q594K0196J023L178
8979B8932n912j9543j7272o501O782J8667o871o034J2912n924J776j2516k1587
$$ plain form
8966 -33091 -33126 -41837 -40107 -9429 3340 30536 64352 78314 62523 53208 42175 27036 16183
8953 16183 17239 32335 26665 17133 19369 24831 24714 18079 11528 19725 34806 47713 59010 51513
8939 51513 28004 7519 36187 37737 8935 5559 2296 3907 3764 25566 17900 15994 3959
8926 3959 16543 11238 14353 12774 -7830 3563 19206 21075 35189 15226 12988 -3875 -28274
8913 -28274 -35428 -22573 -1602 -8237 -4342 8447 24735 34370 46741 44963 34734 41617 40382
8900 40382 28739 12543 -5157 -1082 -16280 -10902 -3363 -748 1090 -9923 -6132 10557 364
8887 364 -23243 -21529 -4233 18515 15839 -1013 -2216 -11008 20503 38840 16409 -266 14826
8874 14826 18340 19113 12050 -6803 -15106 -9177 11681 -15306 -30295 -25105 -30415 -33330 -31271 -19134
$$ packed form
8966c3091l5q711J730L0678J2769K7196L3816J3962j5791r315j1033j5139j0853
8953A6183J056J5096n670r532K236N462j17o635o551Q197J5081J2907J1297p497
8939E1513k3509k0485K8668J550k8802l376l263J611j43K1802p666j906j2035
8926C959J2584n305L115j579k0604J1393J5643J869J4114j9963k238j6863k4399
8913b8274p154J2855K0971o635L895J2789J6288R635J2371j778j0229O883j235
8900D0382j1643j6196j7700M075j5198N378P539K615J838j1013L791J6689j0193
8887C64k3607J714J7296K2748k676j6852j203q792L1511J8337k2431j6675J5092
8874A4826L514P73p063j8853q303N929K0858k6987j4989N190n310k915K059J2137
$$ plain form
8860 -19134 -2446 4057 7446 35676 51761 51690 64754 55861 46222 38485 43644 73758 49814 13700
8846 13700 -12789 8392 25645 11995 -27604 -30783 -17035 -10215 2996 20873 37905 39795
8834 39795 39230 31638 16287 -4728 -29158 -24480 -15491 23135 13992 32393 38945 32148 12785
8821 12785 8176 -1952 8097 34495 23189 4391 15576 14893 18593 17159 13364 17336 20669
8808 20669 10762 15437 25362 30118 10175 1948 24743 32299 20826 -1290 6084 26582 50758
8795 50758 50119 20074 -5413 9367 2904 16266 17342 2019 -5184 -1130 8080 21482 27091
8782 27091 22432 19122 11604 32788 25428 7719 -7149 -4564 22308 37101 37587 17210 -4886
8769 -4886 -6317 32854 37592 20056 -57 -2519 -8728 -8678 -16601 -10953 -6987 -14986 -8189 1962
$$ packed form
8860a9134J6688O503L389K8230J6085p1J3064q893r639p737N159L0114k3944l6114
8846A3700k6489K1181J7253j3650l9599l179J3748O820J3211J7877J7032J890
8834C9795n65p592j5351k1015k4430M678Q989L8626r143J8401O552o797j9363
8821A2785m609j0128J0049K6398j1306j8798J1185o83L700j434l795L972L333
8808B0669r907M675R925M756j9943q227K2795P556j1473k2116P374K0498K4176
8795E0758o39l0045k5487J4780o463J3362J076j5323p203M054R210J3402N609
8782B7091m659l310p518K1184p360j7709j4868K585K6872J4793M86k0377k2096
8769d886j431L9171M738j7536k0113k462o209N0p923N648L966p999O797J0151
$$ plain form
8755 1962 2068 -2511 19678 39763 33970 37356 31602 24908 18079 26109 2444 -9203 9069 772
8741 772 -5399 19289 46345 45208 45123 37913 43241 24734 -4333 -30354 -23696 -15318 8939 19043
8727 19043 10452 16078 17129 5326 -19907 -4166 411 1090 9700 23206 27719 22989 6763 907
8713 907 -5065 -10633 -12395 10185 32049 23707 12784 8614 -5448 -25364 -24806 9158 43921 52072
8699 52072 55404 47405 27171 21390 9872 -360 -12732 -1451 18714 23925 18777 9855 13879
8686 13879 17189 17096 4268 15093 15939 17320 22249 10539 1814 -4109 15963 41511 24730 24433
8672 24433 13333 25942 17037 9367 7545 -19239 -34591 4631 22995 15034 14195 11785 20792
8659 20792 25218 44733 32297 33282 34371 51266 41696 40338 44851 58592 34776 36369 64016
$$ packed form
8755A962J06m579K2189K0085n793L386n754o694o829Q030k3665j1647J8272q297
8741G72o171K4688K7056j137q5p210N328j8507k9067k6021O658Q378K4257J0104
8727A9043q591N626J051j1803k5233J5741M577O79Q610J3506M513m730j6226n856
8713I07n972n568j762K2580K1864q342j0923m170j4062j9916N58L3964L4763Q151
8699E2072L332p999k0234n781j1518j0232j2372J1281K0165N211n148q922M024
8686A3879L310r3j2828J0825Q46J381M929j1710q725n923K0072K5548j6781k97
8672B4433j1100J2609q905p670j822k6784j5352L9222J8364p961q39k410R007
8659B0792M426J9515j2436R85J089J6895r570j358M513J3741k3816J593K7647
$$ plain form
8646 64016 90197 87510 57419 36448 10745 14742 50770 37929 16035 -479 -334 1034 -9993
8633 -9993 -23618 -26159 -2440 20459 30012 26788 6494 -12056 -23459 -14553 -8672 -14019 -10468
8620 -10468 -38087 -30237 2036 3942 -17083 -16568 -223 -667 7555 3042 523 10541 32559 72257
8606 72257 63570 16386 -13165 -24548 -1957 -5291 -11523 -42185 -62507 -39966 -26440 -4266
8594 -4266 -4193 5779 8078 725 -15513 -27600 -24907 -13164 -2865 -22457 -22888 -20036 11513 43067
8580 43067 35876 32532 30146 36726 29304 4223 -2429 -8833 5399 5280 15396 16742 15726 10152
8566 10152 15047 6165 -5137 1424 -513 12485 27678 27562 27015 23778 17912 4693 23345 9836
8552 9836 780 403 2262 -2165 -5685 -8897 -13761 -8382 37299 54474 28332 17179 6629 32764
$$ packed form
8646F4016K6181k687l0091k0971k5703L997L6028j2841k1894j6514J45J368j1027
8633i993j3625k541K3719K2899R553l224k0294j8550j1403Q906N881n347L551
8620a0468k7619P850L2273J906k1025N15J6345m44Q222m513k519J0018K2018L9698
8606G2257q687m7184k9551j1383K2591l334o232l0662k0322K2541J3526K2174
8594d266P3R972K299p353j6238j2087K693J1743J0299j9592m31K852L1549L1554
8580D3067p191l344k386O580p422k5081o652o404J4232j19J0116J346j016n574
8566A0152M895q882j1302O561j937J2998J5193j16n47l237n866j3219J8652j3509
8552I836r056l77J859m427l520l212m864N379M5681J7175k6142j1153j0550K6135
$$ plain form
8538 32764 28096 8283 10621 13667 3115 -10455 -8034 -23432 -26650 -22242 4110 6792 -7738
8525 -7738 9238 2154 5981 12050 -1797 7016 2891 8613 9872 2441 -26934 -9375 23535 10317
8511 10317 4402 12801 6432 -6386 -6570 9871 23544 35784 22462 -5773 -14256 -14361 2386
8498 2386 -7786 -17437 -31391 -31844 -53319 -77532 -67285 -29189 -4248 -12096 -26343 -12222 19553
8485 19553 18689 -8217 -36299 -46333 -24596 22502 23054 4752 -14166 -21369 -16056 15116 22083
8472 22083 8846 -15178 -18062 -4626 -4762 624 17324 43891 50407 38139 19114 24427 17366
8459 17366 -6026 23227 26353 12621 21116 27869 38507 34618 37931 14136 3813 -16329 -23969
8446 -23969 -31795 -1765 18383 4148 -4961 -8088 -4827 -387 12271 23028 29690 39350 49629
$$ packed form
8538C2764m668j9813K338L046j0552j3570K421j5398l218M408K6352K682j4530
8525g738J6976p084L827O069j3847Q813m125N722J259p431k9375J7559L2910j3218
8511A0317n915Q399o369j2818j84J6441J3673J2240j3322k8235q483j05J6747
8498B386j0172r651j3954m53k1475k4213J0247L8096K4941p848j4247J4121L1775
8485A9553q64k6906k8082j0034K1737M7098N52j8302j8918p203N313L1172O967
8472B2083j3237k4024k884J3436j36N386J6700K6567O516j2268j9025N313p061
8459A7366k3392K9253L126j3732Q495O753J0638l889L313k3795j0323k0142p640
8446b3969p826L0030K0148j4235r109l127L261M440J2658J0757O662R660J0279
$$ plain form
8433 49629 54620 34388 16025 27124 11637 21108 18497 12171 7233 7625 6899 5976 6472 -5774
8419 -5774 -19998 -25235 -28705 -13589 -15389 -22673 -34307 -19112 -26147 -16991 4177 13468 11679 -7459
8405 -7459 -1103 5661 30474 21165 2277 -14860 -17721 -27341 -21700 6316 20792 48358 40687
8392 40687 37846 26231 5915 -27899 -45772 -29292 -29706 -2829 21426 20806 8694 -1081 -37483
8379 -37483 -28571 -32457 -22915 -17621 -10746 8226 9806 3281 14436 11822 20832 59350 58284 32025
8365 32025 2420 2453 27406 53298 45952 38789 23473 9923 2252 4359 -2730 -15551 -23309 -16892
8351 -16892 339 12916 868 -2192 20848 41078 62517 73420 38769 22267 8280 10460
8339 10460 20982 16677 5453 14104 28022 9485 -5949 -7462 19636 28562 8048 8562 -537
$$ packed form
8433D9629M991k0232j8363J1099j5487R471k611o326m938L92p26r23M96j2246
8419e774j4224n237l470J5116j800p284j1634J5195p035R156K1168R291j789j9138
8405g459O356O764K4813r309j8888j7137k861r620N641K8016J4476K7566p671
8392D0687k841j1615k0316l3814j7873J6480m14K6877K4255o20j2112r775l6402
8379c7483Q912l886R542N294O875J8972J580o525J1155k614R010L8518j066k6259
8365C2025k9605L3K4953K5892p346p163j5316j3550p671K107p089j2821p758O417
8351a6892J7231J2577j2048l060K3040K0230K1439J0903l4651j6502j3987K180
8339A0460J0522m305j1224Q651J3918j8537j5434j513K7098Q926k0514N14r099
$$ plain form
8326 -537 -2806 10054 23174 26684 42021 45498 62223 57194 9404 -4035 -5916 -33244 -41158
8313 -41158 -50038 -27344 -2653 551 -12146 -11933 13504 20936 18379 -2930 -3951 5893 12765 26336
8299 26336 34348 29171 25427 21423 -1826 -1787 -11830 632 9932 -1672 3025 -4658 7465 -1948
8285 -1948 -24295 -33220 -16428 -9251 -22985 -29968 -18405 7153 5465 -31324 -33345 -36082 -28771
8272 -28771 2177 22856 12764 11973 13939 18188 11573 -8201 -29223 -14347 -10667 -44287 -41258
8259 -41258 -9436 5146 12188 30479 19818 7825 9635 -2444 -9092 14397 37598 41376 40051
8246 40051 20913 14672 26962 30559 30289 18375 -7497 -10499 1861 12166 8322 -875 21081
8233 21081 32335 25507 15001 26195 32523 37467 20973 -30556 -41570 -37176 -41168 -6285 28713
$$ packed form
8326e37k269J2860J3120L510J5337L477J6725n029m7790j3439j881k7328p914
8313d1158q880K2694K4691L204j2697K13K5437P432k557k1309j021R844O872J3571
8299B6336Q012n177l744m004k3249L9j0043J2462R300j1604M697p683J2123r413
8285a948k2347q925J6792P177j3734o983J1563K5558j688l6789k021k737P311
8272b8771L0948K0679j0092p91J966M249o615j9774k1022J4876L680l3620L029
8259d1258L1822J4582P042J8291j0661j1993J810j2079o648K3489K3201L778j325
8246D0051j9138o241J2290L597k70j1914k5872l002J2360J0305l844r197K1956
8233B1081J1254o828j0506J1194O328M944j6494n1529j1014M394l992L4883L4998
$$ plain form
8220 28713 27836 15868 27432 13737 1916 -9838 -16137 -40453 -37844 -37670 -17819 -10847 4736
8207 4736 13477 -6862 -23409 -12494 604 14311 15862 -27102 -30450 -12656 -21356 -501 21135
8194 21135 24856 9953 -8168 -13145 9476 -5345 -18977 -5359 -13808 -20224 -33785 -40318 -1297
8181 -1297 20373 19287 8656 6936 -13412 -4270 9886 11200 9611 10229 -992 -16090 -18841 -31524
8167 -31524 -26438 -7848 -26595 -30302 -15367 -11413 8038 21336 4101 13080 22156 14640 13634
8154 13634 13626 36820 34332 34657 24744 -1370 -7816 -21643 -5099 13320 23815 12482 6956 4197
8140 4197 -2680 12377 10378 -4075 -11003 3946 5289 -7315 -2678 -15306 -29635 -20259 -19013
8127 -19013 -3793 582 4447 8077 15432 26748 34689 39724 23353 27750 20088 14630 31750 -7029
$$ packed form
8220B8713q77j1968J1564j3695j1821j1754o299k4316K609J74J9851O972J5583
8207D736Q741k0339j6547J0915J3098J3707J551m2964l348J7794q700K0855K1636
8194B1135L721j4903j8121m977K2621j4821j3632J3618q449o416j3561o533L9021
8181a297K1670j086j0631j720k0348R142J4156J314j589O18j1221j5098k751j2683
8167c1524N086J8590j8747l707J4935L954J9451J3298j7235Q979R076p516j006
8154A3634qK3194k488L25r913k6114o446j3827J6544J8419J0495j1333n526k759
8140D197o877J5057j999j4453o928J4949J343j2604M637j2628j4329R376J246
8127a9013J5220M375L865L630P355J1316P941N035j6371M397p662n458J7120l8779
$$ plain form
8113 -7029 -34378 -28096 -11357 10889 -265 -760 -8690 -3045 13596 16433 4551 -18057 -25205
8100 -25205 -51747 -35516 -30551 -13144 -4522 -3640 6103 24817 -2917 -18724 -8493 -1498 -6467
8087 -6467 2237 21273 32825 14122 4661 16145 22787 2653 -6364 -12290 -6664 -22609 -17386
8074 -17386 6219 -643 -6935 -28218 -54525 -65499 -52448 -38211 -8581 9298 -768 11593
8062 11593 23361 12847 26199 -323 -35975 -23304 -22279 -25376 -13324 -7623 10143 8583 12355
8049 12355 20956 30581 10812 11966 21758 11126 -22893 -30182 -25709 -22742 -23355 -17835 -3655 -13534
8035 -13534 -27402 -20207 7619 24198 25503 17958 20319 -13550 12667 6074 -9863 -17076 -6388
8022 -6388 -2537 3396 -478 -15122 -25423 -28374 -11321 -25414 -33134 -26649 -31283 -9087 7372
$$ packed form
8113g029k7349O282J6739K2246j1154m95p930N645J6641K837j1882k2608p148
8100b5205k6542J6231M965J7407Q622Q82R743J8714k7734j5807J0231O995m969
8087f467Q704J9036J1552j8703r461J1484O642k0134r017n926N626j5945N223
8074a7386K3605o862o292k1283k6307j0974J3051J4237K9630J7879j0066J2361
8062A1593J1768j0514J3352k6522l5652J2671J025l097J2052N701J7766j560L772
8049A2355Q601R625j9769J154R792j0632l4019p289M473K967o13N520J4180r879
8035a3534j3868P195K7826J6579J305p545K361l3869K6217o593j5937p213J0688
8022f388L851N933l874j4644j0301k951J7053j4093p720O485m634K2196J6459
$$ plain form
8009 7372 5932 5575 11488 -6563 -560 19143 11346 678 2261 20386 32227 9795 -24002
7996 -24002 -14536 19772 18288 22880 18048 3750 -9661 -4261 -8294 -4691 -17333 -28668 -33115
7983 -33115 -18124 -16437 -21940 -26371 -49603 -36069 -23482 -12838 -5709 -2156 3732 4469 5584 9332
7969 9332 10126 21198 36296 27477 4419 -8797 5218 7447 -1761 -9303 12774 9636 -13736
7956 -13736 -46954 -44726 -22504 20144 16017 7992 26066 25090 2955 -7108 -14092 -34208 -26532
7943 -26532 -23637 -11577 -4095 -15931 -7929 6196 -5413 102 4531 1839 238 2249 -18239
7930 -18239 -7636 5165 16461 47893 37637 16373 40589 40023 13370 -9154 -18567 -19290 -55326
7917 -55326 -63293 -61123 -53935 -32434 -17961 686 4569 15457 19624 -552 -12547 -20786 -16153
$$ packed form
8009G372j440l57N913j8051O003J9703p797j0668J583J8125J1841k2432l3797
7996b4002R466L4308j484M592m832j4298j3411N400m033L603j2642j1335m447
7983c3115J4991J687n503m431k3232J3534J2587J0644P129L553N888P37J115L748
7969I332P94J1072J5098q819k3058j3216J4015K229r208p542K2077l138k3372
7956a3736l3218K228K2222M2648m127q025J8074r76k2135j0063o984k0116P676
7943b6532K895J2060P482j1836Q002J4125j1609N515M429k692j601K011k0488
7930a8239J0603J2801J1296L1432j0256k1264K4216n66k6653k2524r413p23l6036
7917e5326p967K170P188K1501J4473J8647L883J0888M167k0176j1995q239M633
$$ plain form
7904 -16153 -12890 -3610 -9804 1080 20996 36869 38165 20122 27135 40230 46695 30447 -5775
7891 -5775 -21705 -35020 -28939 -3607 2009 -10902 -33043 -37479 -21094 -6236 -12860 -20204 -28298
7878 -28298 -19616 -13486 -37203 -17446 2864 7099 4487 5814 431 -16194 -24563 -17488 -7830 -2076
7864 -2076 17481 24343 8257 8390 -5143 -572 -4925 -16836 -7777 -15500 -29656 -14380 12004
7851 12004 20953 3005 -8234 -20898 -28860 -36294 -34012 -27398 -18874 -23810 -33984 -27550 -21914 -28592
7837 -28592 -29205 -43701 -49291 -33538 -23718 -32343 -33962 -26959 -15996 13978 19845 31179 6976
7824 6976 -14335 -20102 -7969 -25297 -30123 8310 44116 51666 35027 36268 33749 35437 3627
7811 3627 -5035 -5603 -16304 -17897 -8156 2432 16402 8414 76 2504 -13692 -7434 277 5766
$$ packed form
7904a6153L263R280o194J0884J9916J5873J296j8043P013J3095O465j6248l6222
7891e775j5930j3315O081K5332N616j2911k2141m436J6385J4858o624p344q094
7878b8298Q682O130k3717J9757K0310M235k612J327n383j6625q369P075R658N754
7864b076J9557O862j6086J33j3533M571m353j1911R059p723j4156J5276K6384
7851A2004Q949j7948j1239j2664p962p434K282O614Q524m936j0174O434N636o678
7837b8592o13j4496n590J5753R820q625j619P003J0963K9974N867J1334k4203
7824F976k1311n767J2133j7328m826L8433L5806P550j6639J241k519J688l1810
7811C627q662n68j0701j593R741J0588J3970p988q338K428j6196O258P711N489
$$ plain form
7797 5766 6011 10128 13830 24048 22461 12108 -4035 -11338 -2954 -8754 -24255 -21880 -1286 -3947
7783 -3947 -11146 -17798 -10294 -24308 -39126 -28573 -20038 -31825 -14391 7373 337 11309 12302
7770 12302 19013 29967 17261 -2257 455 6886 22662 26097 24036 28077 29300 27179 -1789
7757 -1789 6566 20908 -3525 9203 33841 29961 726 3712 23195 39467 35780 24459 24908
7744 24908 -6731 -18761 -7422 -11283 -22604 -24545 -32545 -35028 -43119 -42778 -35221 -40291 -13212 3711
7730 3711 -2133 -16664 -23161 -25567 -12909 -14053 -23276 -24348 -17114 -12176 -16870 -36027 -29297 4081
7716 4081 13276 5205 12367 11374 11925 7606 4201 -8347 -10427 -13539 -4847 -5069 -22821 -15447 10165
7701 10165 4978 14037 -7243 2189 15782 7946 -4345 -2103 -32015 -47378 -44742 -35410 -37490
$$ packed form
7797E766K45M117L702J0218j587j0353j6143p303Q384n800j5501K375K0594k661
7783c947p199o652P504j4014j4818J0553Q535j1787J7434K1764p036J0972R93
7770A2302O711J0954j2706j9518K712O431J5776L435k061M041J223k121k8968
7757a789Q355J4342k4433J2728K4638l880k9235K986J9483J6272l687j1321M49
7744B4908l1639j2030J1339l861j1321j941q000k483q091L41P557n070K7079J6923
7730C711n844j4531o497k406J2658j144r223j072P234M938m694j9157O730L3378
7716D081R195q071P162r93N51m319l405j2548k080l112Q692k22j7752P374K5612
7701A0165n187R059k1280R432J3593p836j2291K242k9912j5363K636R332k080
$$ plain form
7688 -37490 -59189 -60916 -29360 232 -11144 -27291 -33290 -9033 -20340 -24214 -17577 -23849 -21740
7675 -21740 -19221 -17505 -7719 8274 -10917 -28698 -21339 -8912 146 -5872 -12861 -30403 -39049
7662 -39049 -17420 -29117 -40935 -12494 7418 17726 11625 1723 -3863 4623 3945 -13118 -12508
7649 -12508 -10107 -10357 2376 -5122 -23083 -18496 -21132 -17220 -6546 17034 30204 14601 15489 30670
7635 30670 32021 18142 8767 2214 3779 10354 29762 38079 36556 14544 -2545 -1386 -1658 -10791
7621 -10791 -3714 -1300 -9552 5860 14191 -20559 -30531 -26647 -32186 -21076 -18543 -39930 -41477 -52975
7607 -52975 -39224 -32400 -31931 -48219 -53098 -36346 -7734 -12342 -550 -4491 -25163 -41083 -37473
7594 -37473 -16196 -20562 -18445 -8285 -13845 -26510 -29761 -7984 12444 5499 33821 13513 1667
$$ packed form
7688c7490k1699j727L1556K9592j1376j6147n999K4257j1307l874O637o272K109
7675b1740K519J716R786J5993j9191j7781P359J2427R058o018o989j7542q646
7662c9049K1629j1697j1818K8441J9912J0308o101r902n586Q486o78j7063O10
7649a2508K401k50J2733p498j7961M587k636L912J0674K3580J3170j5603Q88J5181
7635C0670J351j3879r375o553J565O575J9408Q317j523k2012j7089J159k72r133
7621a0791P077K414q252J5412Q331l4750r972L884n539J1110K533k1387j547j1498
7607e2975J3751O824M69j6288m879J6752K8612m608J1792l941k0672j5920L610
7594c7473K1277m366K117J0160n560j2665l251K1777K0428o945K8322k0308j1846
$$ plain form
7581 1667 -8989 -40947 -36293 -19191 -16423 -20448 -3333 -6162 -8121 -17554 -20241 -14917 11950 16642
7567 16642 6552 30725 11055 3572 3773 -14802 -10576 -14439 -8098 -15799 -40892 -52543 -28668
7554 -28668 195 -29881 -55607 -50343 336 11373 1071 1849 1536 -9377 -18273 -25233 -22877
7541 -22877 -5986 20320 24057 24080 17816 12980 14442 15523 2438 9024 5024 5582 -4238 7749
7527 7749 8882 14981 -10967 -32884 -54249 -44959 -36279 -35100 -23918 -10152 -8899 -4899 -4174 -7655
7513 -7655 -4284 -16467 -13017 13821 37215 28710 47129 62141 69793 66582 48204 32582 25879
7500 25879 29639 -3950 -15134 -9462 4912 -4099 159 -7221 -6961 -32824 -59700 -39175 -13483
7487 -13483 -14378 -2333 -8987 -37479 -26691 -24857 -33318 -39679 -22766 -13671 -11383 -20438 -25008 -11670
$$ packed form
7581A667j0656l1958M654J7102K768m025J7115k829j959r433k687N324K6867M692
7567A6642j0090K4173j9670p483K01j8575M226l863O341p701k5093j1651K3875
7554b8668K8863l0076k5726N264N0679J1037j0302P78l13j0913q896o960K356
7541b2877J6891K6306L737K3o264m836J462J081j3085O586m000N58r820J1987
7527G749J133O099k5948k1917k1365R290Q680J179J1182J3766J253M000P25l481
7513g655L371j2183L450K6838K3394q505J8419J5012P652l211j8378j5622o703
7500B5879L760l3589j1184N672J4374r011M258p380K60k5863k6876K0525K5692
7487a3483q95J2045o654k8492J0788J834q461o361J6913R095K288r055m570J3338
$$ plain form
7473 -11670 -8496 6409 27440 2271 8658 17384 -3344 -6507 3465 6685 -14886 -30777 -39347
7460 -39347 -40404 -41454 -50461 -8671 23249 42065 24412 19942 22643 6824 -3081 -8965 -6657
7447 -6657 -16805 -8904 -14368 -24831 -34240 -21168 3319 26381 29126 34291 6577 -212 -7685
7434 -7685 -18000 -13757 21087 30728 30317 10703 -7543 -3587 -3745 11104 16480 6116 3464 -23511
7420 -23511 -29728 -11528 -1673 -5316 -7034 14538 -737 -29247 -25228 -5666 6989 4221 2826
7407 2826 -8245 -42813 -50782 -42674 -26811 -9321 757 -1869 3159 16671 7698 8304 -138 10907
7393 10907 16820 -18421 -67060 -78634 -66924 -49468 -29455 -17330 -13552 -19699 -35558 -30701 -6052
7380 -6052 -14295 -11680 4006 -4031 8525 10843 -960 13954 13811 23999 27070 14704 15028 -4799
$$ packed form
7473a1670L174J4905K1031k5169O387Q726k0728l163R972L220k1571j5891q570
7460c9347j057j050r007M1790L1920J8816j7653m470K701j5819r905n884K308
7447f657j0148P901n464j0463r409J3072K4487K3062K745N165k7714o789p473
7434g685j0315M243L4844R641m11j9614j8246L956j58J4849N376j0364k652k6975
7420b3511o217J8200R855l643j718K1572j5275k8510M019J9562J2655k768j395
7407B826j1071l4568p969Q108J5863J7490J0078k626N028J3512q973O06q442J1045
7393A0907N913l5241m8639j1574J1710J7456K0013J2125L778o147j5859M857K4649
7380f052q243K615J5686q037J2556K318j1803J4914j43J0188L071j2366L24j9827
$$ plain form
7366 -4799 -30424 -37239 -5734 30638 35997 34244 -1527 -10718 1248 -12169 2805 2 -122
7353 -122 -17871 -38786 -38173 -8287 21189 24621 20033 27025 32576 22661 4214 1132 -20678 -31889
7339 -31889 -43896 -54079 -25882 -25818 -43766 -42553 -27330 -11335 -2179 14340 4757 -10497 -2952
7326 -2952 15714 26266 21465 5696 316 -3886 -13078 -6870 10193 19625 -3082 -36223 -33060
7313 -33060 -21290 1353 -4230 7404 20261 29868 32437 32564 31690 15825 11936 30702 -9913
7300 -9913 -18359 -18942 -35231 -35956 -30298 -24173 -11573 -5167 -18605 -4177 -6565 -3047 7279 -3453
7286 -3453 14677 11668 -30685 -42014 -26716 -28008 -17358 9265 11395 -846 1282 -7510 -3667
7273 -3667 -8595 -16053 -13790 -6152 -18413 -33431 -30528 -10038 -1963 -20751 -9892 -9025 -12963 -11238
$$ packed form
7366d799k5625o815L1505L6372N359j753l5771r191J1966j3417J4974k803j24
7353a22j7749k0915O13K9886K9476L432m588O992N551r915j8447l082k1810j1211
7339c1889j2007j0183K8197O4j7948J213J5223J5995R156J6519r583j5254P545
7326b952J8666J0552m801j5769n380m202r192O208J7063R432k2707l3141L163
7313c3060J1770K2643n583J1634J2857R607K569J27q74j5865l889J8766m0615
7300i913q446n83j6289p25N658O125J2600O406j3438J4428k388L518J0326j0732
7286c453J8130l009m2353j1329J5298j292J0650K6623K130j2241K128q792L843
7273c667m928p458K263P638j2261j5018K903K0490Q075j8788J0859Q67l938J725
$$ plain form
7259 -11238 -11916 12532 26352 31829 9502 1798 -16856 -33824 -16186 17978 33476 37000 46365
7246 46365 27452 14798 10107 6049 5799 17877 49382 58017 24456 72 4068 4130 -12786 -16879
7232 -16879 -16558 -8346 199 2694 -4347 15974 4369 11055 14614 27193 36739 32250 15669 12390
7218 12390 -5305 -5710 -13895 -20610 -19707 -14005 -19152 -16837 -7878 -6263 23646 17306 -22496 -37702
7204 -37702 -8478 5931 16730 13384 29738 41897 34368 23149 21321 30673 3767 2176 698
7191 698 1444 -5554 12687 1487 -19243 -2482 9703 2409 16626 22301 13471 14555 32451 37641
7177 37641 18309 -7785 -13957 -15934 -14329 -26432 -17530 -16998 -14995 -20238 -13036 -27274 -30411 -41590
7163 -41590 -30596 -31693 -31963 -24460 -17749 -16336 -3640 3648 11638 15811 13852 6663 14347 -6476
$$ packed form
7259a1238o78K4448J3820N477k2327p704j8654j6968J7638L4164J5498L524R365
7246D6365j8913j2654m691m058k50J2078L1505Q635l3561k4384L996O2j6916m093
7232a6879L21Q212Q545K495p041K0321j1605O686L559J2579R546m489j6581l279
7218A2390j7695m05q185o715R03N702n147K315Q959J615K9909o340l9802j5206
7204c7702K9224J4409J0799l346J6354J2159p529j1219j828R352k6906j591j478
7191F98P46o998J8241j1200k0730J6761J2185p294J4217N675q830J084J7896N190
7177C7641j9332k6094o172j977J605j2103Q902N32K003n243P202j4238l137j1179
7163d1590J0994j097k70P503O711J413J2696P288P990M173j959p189P684k0823
$$ plain form
7149 -6476 -10519 557 -11659 -54793 -61939 -41239 -37847 -27788 -24763 -8800 5628 -19973 -41391
7136 -41391 -21247 -11559 13714 14410 8311 -7251 -8503 -11336 -14675 9510 9803 11501 -3136 5671
7122 5671 10697 11404 8001 10509 -6704 -6374 -10560 -2382 -16058 -23321 -43298 -56014 -51786 -37144
7108 -37144 -12352 4679 -6919 -13969 883 6467 -474 -2545 -2272 170 22173 22338 -10783 -32352
7094 -32352 -29432 -4501 11000 10154 16141 38394 38012 6125 -19555 9221 19139 10039 -7867
7081 -7867 -12119 -6194 -4120 -8192 1849 12379 -5606 -3159 -22599 -15161 -6250 -666 18374 19619
7067 19619 12874 -4667 4949 33749 46434 15821 11643 -19094 -34723 -25729 -2317 12496 1739
7054 1739 -5950 -1821 7184 -247 -5829 -2700 -10145 -16699 -23011 -15484 -9285 -7464 -26 11916 19439
$$ packed form
7149f476m043J1076j2216m3134p146K0700L392J0059L025J5963J4428k5601k1418
7136d1391K0144R688K5273O96o099j5562j252k833l339K4185K93J698j4637Q807
7122E671N026P07l403K508j7213L30m186Q178j3676p263j9977j2716M228J4642
7108c7144K4792J7031j1598p050J4852N584o941k071K73K442K2003J65l3121k1569
7094c2352K920K4931J5501q46N987K2253l82l1887k5680K8776R918r100j7906
7081g867m252N925K074m072J0041J0530j7985K447j9440P438Q911N584J9040J245
7067A9619o745j7541R616K8800J2685l0613m178l0737j5629Q994K3412J4813j0757
7054A739p689M129R005p431n582L129p445o554o312P527O199J821P438J1942P523
$$ plain form
7039 19439 -7935 -21453 -25916 -35751 -28028 -9340 -8746 -9098 6303 6536 20187 16713 -16634 -31099
7025 -31099 -19707 -23931 -32766 -28735 -35963 -43467 -38830 -31499 -29808 -21960 -27802 -16343 -9509 -14058
7011 -14058 -5659 -16076 -25413 -7628 8932 20284 13311 12215 28806 27422 22248 25416 25114 30834
6997 30834 24453 28727 27665 17408 108 12371 24880 24033 24327 -953 -5405 -20827 -51383
6984 -51383 -44982 -18715 3551 14864 -9473 -29382 -11041 2390 8117 -14931 -6357 8370
6972 8370 2567 -6528 -9726 5309 12401 22845 25684 -3323 -9251 -20846 -27145 -37400 -34562 -24452
6958 -24452 -12043 -7282 -7942 -5068 -24649 -5489 23513 30154 24950 1167 -21670 -11206 -22749
6945 -22749 -17918 657 23146 18969 17171 -17949 -34165 -3514 2259 4470 -4234 2721 3253 925
$$ packed form
7039A9439k7374j3518m463r835P723J8688N94l52J5401K33J3651l474l3347j4465
7025c1099J1392m224q835M031p228p504M637P331J691P848n842J1459O834m549
7011a4058Q399j0417r337J7785J6560J1352o973j096J6591j384n174L168l02N720
6997C0834o381M274j062j0257j7300J2263J2509q47K94k5280m452j5422l0556
6984e1383O401K6267K2266J1313k4337j9909J8341J3431N727k3048Q574J4727
6972H370n803r095l198J5035P092J0444K839k9007n928j1595o299j0255K838J0110
6958b4452J2409M761o60K874j9581J9160K9002O641n204k3783k2837J0464j1543
6945b2749M831J8575K2489m177j798l5120j6216L0651N773K211q704O955N32k328
$$ plain form
6931 925 3504 20150 25447 29083 33773 28270 34573 41441 21510 -17993 -27553 -16159 -25171 -10513
6917 -10513 4104 1712 -1531 -5596 -5551 9604 16219 11622 13632 265 -9096 3090 5093 8751
6903 8751 -7057 -33146 -30813 -32680 -34373 -7225 9159 -4098 -15158 -8304 -7570 -13841 -24639
6890 -24639 -28538 -8937 17959 14175 10873 23658 11949 9886 19972 19435 27555 36710 15826
6877 15826 -18701 -26302 2586 8481 -12017 -7919 -3308 -27323 -23196 -14122 16233 4202 -24845
6864 -24845 -49134 -57694 -37443 -21432 1840 4022 24151 10374 -6681 -25819 -28768 -40017
6852 -40017 -45915 -34504 -19687 -22487 -8694 -14833 -22084 -17123 9462 22509 29030 33540 -2625
6839 -2625 -6405 13336 10425 20767 32314 27410 43475 32130 16805 24465 10416 -11852 -30476
$$ packed form
6931I25K579J6646N297L636M690n503O303O868j9931l9503r560J1394r012J4658
6917a0513J4617k392l243m065M5J5155O615m597K010j3367r361J2186K003L658
6903H751j5808k6089K333j867j693K7148J6384j3257j1060O854P34o271j0798
6890b4639l899J9601K6896l784l302J2785j1709k063J0086n37Q120R155k0884
6877A5826l4527p601K8888N895k0498M098M611k4015M127R074L0355j2031k9047
6864b4845k4289q560K0251J6011K3272K182K0129j3777j7055j9138k949j1249
6852d0017n898J1411J4817k800J3793o139p251M961K6585J3047O521M510l6165
6839b625l780J9741k911J0342J1547m904J6065j1345j5325P660j4049k2268j8624
$$ plain form
6826 -30476 -18411 -4717 -4235 -28806 -48437 -50819 -31392 -17530 -42111 -48747 -42363 -42160 -9564
6813 -9564 4652 17429 3783 -7983 -9545 -9262 -14436 -28075 -55707 -36344 -17721 -42528 -58369
6800 -58369 -19715 -7408 19872 13968 -1927 -1000 9324 -25532 -36098 -4200 -10714 -27829 -36784
6787 -36784 -47991 -44638 -29921 -6376 6981 -4136 -8580 -9996 -1739 14512 17513 1186 -1432
6774 -1432 -576 55 -13681 -13434 -29233 -442 17405 7929 -3149 22632 41875 33985 10013 -10875
6760 -10875 -16258 -5945 -10036 -6951 12460 24169 17650 15225 20498 3414 -8090 -16582 -12108
6747 -12108 -6339 -2942 252 -2909 5018 -11448 -38678 -48842 -27095 -10564 -15939 -21604 -25510
6734 -25510 -23462 -23162 -26469 -12226 -12932 -37140 -46411 -12286 38370 38020 17497 5269 3767 8596
$$ packed form
6826c0476J2065J3694M82k4571j9631k382J9427J3862k4581o636O384K03L2596
6813i564J4216J2777j3646j1766j562K83n174j3639k7632J9363J8623k4807j5841
6800e8369L8654J2307K7280n904j5895R27J0324l4856j0566L1898o514j7115q955
6787c6784j1207L353J4717K3545J3357j1117m444j416Q257J6251L001j6327k618
6774a432Q56O31j3736K47j5799K8791J7847r476j1078K5781J9243p890k3972k0888
6760a0875n383J0313m091L085J9411J1709o519k425N273j7084j1504q492M474
6747a2108N769L397L194l161P927j6466k7230j0164K1747J6531n375n665l906
6734b5510K048L00l307J4243p06k4208r271L4125N0656l50k0523j2228j502M829
$$ plain form
6720 8596 11504 -11232 -8874 -2822 -2780 -348 15285 9484 -1567 -19756 -10777 -2044 -21037 -5583
6706 -5583 540 9172 4757 -13538 -16352 -20475 8845 3495 -6297 3167 -2211 -13773 -27793 -7295
6692 -7295 -9374 -15167 -3150 8549 16972 18244 23409 27871 9706 12334 27956 10532 -7427
6679 -7427 -16856 -19050 2576 8005 23737 15531 -125 -9524 -7348 -4723 -5425 -23261 -13689 -8331
6665 -8331 -29323 -22339 6372 2536 -453 -12555 -18394 -28023 -31665 -16356 2438 14731 10859
6652 10859 -16210 -22126 -28100 -36303 -24511 -27280 -20000 -16390 -34212 -19751 -18186 -14251 -18233 2427
6638 2427 18143 13359 17271 41351 20861 10077 4179 13828 5700 -3092 -16109 -6738 17213
6625 17213 12117 6688 11652 23181 29340 18253 3712 -8995 -2871 1738 -962 6670 -1626 -4876
$$ packed form
6720H596K908k2736K358O052M2K432J5633n801j1051j8189Q979Q733j8993J5454
6706e583O123Q632m415j8295k814m123K9320n350r792R464n378j1562j4020K0498
6692g295k079n793J2017J1699Q423J272N165M462j8165K628J5622j7424j7959
6679g427r429k194K1626N429J5732q206j5656r399K176K625p02j7836R572N358
6665h331k0992O984K8711l836k989j2102n839r629l642J5309J8794J2293l872
6652A0859k7069n916n974q203J1792k769P280L610j7822J4461J565L935l982K0660
6638B427J5716m784L912K4080k0490j0784n898R649q128q792j3017R371K3951
6625A7213n096n429M964J1529O159j1087j4541j2707O124M609k700P632q296l250
$$ plain form
6611 -4876 -20644 -14831 8836 7835 -550 -5533 -727 7027 10859 11725 4650 2924 -22538 -27172
6597 -27172 -18085 -19894 -18392 -12854 -20915 -27495 -29929 -35501 -52489 -42951 -42967 -26010 -23573 -17570 -3205
6582 -3205 -2033 -14509 -25774 -34733 -22511 -36255 -19634 -12162 -4735 10309 10234 4868 5543 11932
6568 11932 23904 10119 -6033 -5319 -8253 -26087 -33556 -22185 -16594 -30631 -28189 -4530 15060
6555 15060 -19774 -22197 -38853 -36295 -54914 -44279 -26410 -11207 -1570 1540 9668 -1415 -5831
6542 -5831 -1998 -12720 9562 18433 -1413 2914 12906 19034 26269 42655 50913 59820 59498 63906
6528 63906 55184 14678 -6435 -25344 -38136 -30062 -15191 1621 3341 380 11763 17722 4199
6515 4199 -10401 -24476 -21223 -5864 9460 -1948 2430 6407 18433 39263 21570 -1856 11434
$$ packed form
6611d876j5768N813K3667j001q385m983M806P754L832Q66p075j726k5462m634
6597b7172R087j809J502N538q061o580k434n572j6988R538j6J6957K437O003J4365
6582c205J172j2476j1265q959J2222j3744J6621P472P427J5044p5n366O75O389
6568A1932J1972j3785j6152P14k934j7834p469J1371N591j4037K442K3659J9590
6555A5060l4834k423j6656K558j8619J0635J7869J5203R637L110Q128j1083m416
6542e831L833j0722K2282Q871j9846M327R992O128P235J6386Q258Q907l22M408
6528F3906q722m0506k1113j8909j2792Q074J4871J6812J720k961J1383N959j3523
6515D199j4600j4075L253J5359J5324j1408M378L977J2026K0830j7693k3426J3290
$$ plain form
6502 11434 -705 -23824 -36411 -51846 -30421 30 14010 5626 -14301 2449 11465 9829
6490 9829 -11052 -25048 -6847 -4972 -19449 -30979 -29603 -25329 -6841 -3209 20080 48650 35211
6477 35211 17843 -5124 -24708 -9757 -2217 7453 13328 36265 45939 33861 32972 31544 6240
6464 6240 10410 15690 8323 -4041 1463 -15433 -19773 -916 10987 12663 11357 11470 14183 -4447
6450 -4447 13154 8236 -3302 -12760 -19861 -18929 -6014 -4187 14922 25214 7147 3002 13297
6437 13297 -716 -7722 -16981 -26215 -9646 18031 17209 13024 10458 15597 17953 17076 2816 10146
6423 10146 24230 31932 1136 -21869 -1240 29034 40847 28822 19732 9581 289 2579 1504
6410 1504 9638 -11769 -8659 -2071 -10787 -11756 -10444 -10392 -30117 -26440 -7689 -1751 -13815 -27261
$$ packed form
6502A1434j2139k3119j2587j5435K1425L0451J3980q384j9927J6750R016j636
6490I829k0881j3996J8201J875j4477j1530J376M274J8488L632K3289K8570j3439
6477C5211j7368k2967j9584J4951P540R670N875K2937R674j2078q89j428k5304
6464F240M170N280p367j2364N504j6896m340J8857J1903J676j306J13K713j8630
6450d447J7601m918j1538r458p101R32J2915J827J9109J0292j8067m145J0295
6437A3297j4013p006r259r234J6569K7677q22m185k566N139K356q77j4260P330
6423A0146J4084P702l0796k3005K0629L0274J1813j2025r090j0151r292K290j075
6410A504Q134k1407L110O588q716r69J312N2j9725L677J8751N938j2064j3446
$$ plain form
6396 -27261 -23137 -6310 -2798 21108 39388 -746 -19403 -21540 -9822 -17964 -17966 -1132 -6748 25584
6382 25584 11235 -40707 -43831 -65791 -84577 -64289 -15328 19818 14290 -1442 11618 1959
6370 1959 6624 1536 1912 -7750 -9514 -13250 4455 -9316 -19457 -21084 -13983 -8232 -14891 -3489
6356 -3489 796 13125 1869 -29180 -53634 -61011 -41307 -25286 -26470 -22440 -23553 -14339 -17318
6343 -17318 -33856 -44910 -64112 -63431 -36559 -10698 -14692 -29257 -49665 -56386 -46440 -24423 -33315
6330 -33315 -35320 -23873 -15104 -21020 -26140 -32332 -43275 -36192 -18111 -6629 -15438 -14598 -22015 -33681
6316 -33681 -41494 -40905 -22917 347 -4843 -4405 -13546 -2380 4357 2869 -17844 -9301 3282 -19042
6302 -19042 -17593 8569 18154 -222 -27551 -39803 -25696 -16758 -35355 -18119 -10065 -28032 -31421
$$ packed form
6396b7261M124J6827L512K3906J8280m0134j8657k137J1718q142kJ6834n616L2332
6382B5584j4349n1942l124k1960j8786K0288M8961L5146n528j5732J3060r659
6370A959M665n088L76r662j764l736J7705j3771j0141j627P101N751o659J1402
6356c489M285J2329j1256l1049k4454p377J9704J6021j184M030j113R214k979
6343a7318j6538j1054j9202O81K6872K5861l994j4565k0408o721R946K2017q892
6330c3315k005J1447Q769n916n120o192j0943P083J8081J1482q809Q40p417j1666
6316c3681p813N89J7988K3264n190M38r141J1166O737j488k0713Q543J2583k2324
6302a9042J449K6162R585j8376k7329j2252J4107Q938j8597J7236Q054j7967l389
$$ plain form
6289 -31421 -4967 8483 -7762 -5245 12917 22257 8818 12669 19954 -7067 -25276 -4289 516
6276 516 2882 -7913 -35423 -28400 -18354 -11666 5646 -1774 -29556 -46914 -31293 -12999 4739
6263 4739 -4559 27540 58751 54106 39086 21383 -4436 -16205 -25516 -6827 -18584 -41212 -51221
6250 -51221 -27374 2408 -7027 -7036 1619 -16403 -36930 -35308 -15639 -7563 1087 -623 -5308 -20184
6236 -20184 -21806 -27280 -26473 -11752 -11811 -14223 3343 16326 17867 24290 -10619 -13952 -1019 -785
6222 -785 -4932 26724 33460 17614 11044 -3176 -24416 -18201 -22373 63 18458 17362 -2160
6209 -2160 -4930 7131 23305 22609 29540 29762 18447 -21386 -42211 -46369 -53648 -43736 -36732 -34370
6195 -34370 -42375 -44018 -22358 -19310 -31394 -45948 -61170 -55877 -31838 -12039 -11204 -6858 14946
$$ packed form
6289c1421K6454J3450j6245K517J8162R340j3439L851P285k7021j8209K0987M805
6276E16K366j0795k7510P023J0046O688J7312p420k7782j7358J5621J8294J7738
6263D739r298L2099L1211m645j5020j7703k5819j1769r311J8689j1757k2628j0009
6250e1221K3847K9782r435rQ655j8022k0527J622J9669Q076Q650j710m685j4876
6236b0184j622n474Q07J4721n9k412J7566J2983J541O423l4909l333J2933K34
6222g85m147L1656O736j5846o570j4220k1240O215m172K2436J8395j096j9522
6209b160k770J2061J6174o96O931K22j1315l9833k0825m158p279R912P004K362
6195c4370q005j643K1660L048j2084j4554j5222N293K4039J9799Q35M346K1804
$$ plain form
6182 14946 19392 19968 15182 2430 -5077 -7802 -31404 -48198 -37816 -45071 -51411 -39427 -34351 -21223
6168 -21223 -1077 -13265 -30994 -28232 -36584 -24042 -4639 5476 -1797 -826 8551 6675 9900
6155 9900 -1469 7099 20967 28849 2319 -4637 793 13949 13042 5243 -2353 4682 22861 12592
6141 12592 2466 -6112 -17291 -20363 7731 23316 -1048 -15787 -3959 13426 1939 -6250
6129 -6250 17218 15609 2332 -11849 2498 13559 16455 20005 10815 7876 14359 32356 27648
6116 27648 2332 -7526 -15823 -19113 -2540 1408 3069 -14264 -15113 11346 19845 3731 -22497
6103 -22497 -41978 -15961 -682 7357 19508 8272 -11671 -12289 -3737 -6716 -19031 -44204 -17486
6090 -17486 -16896 -13279 -4766 -389 3136 19736 20493 25786 14179 2660 12151 22185 19828 21646
$$ packed form
6182A4946M446N76m786j2752p507k725k3602j6794J0382p255o340J1984N076J3128
6168b1223K0146j2188j7729K762q352J2542J9403J0115p273R71R377j876L225
6155I900j1369Q568J3868P882k6530o956N430J3156r07p799p596P035J8179j0269
6141A2592j0126q578j1179l072K8094J5585k4364j4739J1828J7385j1487q189
6129f250K3468j609j3277j4181J4347J1061K896L550r190k939O483J7997m708
6116B7648k5316r858q297l290J6573L948J661j7333q49K6459Q499j6114k6228
6103b2497j9481K6017J5279Q039J2151j1236j9943o18Q552k979j2315k5173K6718
6090a7486N90L617Q513M377L525J6600P57N293j1607j1519R491J0034k357J818
$$ plain form
6076 21646 36268 30906 24795 23842 34188 41454 33034 -2194 -34354 -10126 10334 12273 16562
6063 16562 15991 26626 24561 -20913 -39739 -36757 -34260 -8659 -29974 -39623 -41041 -33777 -22996
6050 -22996 -25291 -36735 -15599 -12676 -9480 20642 5767 -31367 -34507 -24591 -17193 -13224 -2483
6037 -2483 11416 10871 8085 12941 -2688 8483 12164 -9920 -31829 -22916 -17689 -19622 -27131 -10438
6023 -10438 14029 15078 19792 18668 33798 3694 -25620 -30951 -15471 -41408 -69881 -54624 -14035
6010 -14035 5580 1019 -18841 -22376 3610 18973 5831 10602 15835 19861 19643 -4184 -34179
5997 -34179 -39527 -4635 18627 -3013 90 12520 7297 -7081 -10341 -2893 -22828 -20914 2934
5984 2934 3707 -445 -4318 13922 9563 -10565 -14375 3019 20037 1191 -7328 -15798 9889 19340
$$ packed form
6076B1646J4622n362o111r53J0346P266q420l5228l2160K4228K0460J939M289
6063A6562n71J0635k065m5474j8826K982K497K5601k1315r649j418P264J0781
6050b2996k295j1444K1136K923L196L0122j4875l7134l140R916P398L969J0741
6037b483J3899n45k786M856j5629J1171L681k2084k1909Q913N227j933p509J6693
6023a0438K4467J049M714j124J5130l0104k9314n331J5480k5937k8473J5257M0589
6010a4035J9615m561j9860l535K5986J5363j3142M771N233M026k18k3827k9995
5997c4179n348L4892K3262k1640L103J2430n223j4378l260P448j9935J914K3848
5984B934P73m152l873J8240m359k0128l810J7394J7018j8846q519q470K5687R451
$$ plain form
5970 19340 2185 -11424 -29354 -15326 -18560 -31708 -36298 -29932 -161 7776 -3917 -29185 -30116
5957 -30116 -10338 117 6748 14486 -2593 4081 4725 -19950 -11982 25746 23187 967 -5352
5944 -5352 -12911 -22408 -2092 26899 26452 27407 12503 3640 -10104 -23380 -35031 -26435 -11735 -11908
5930 -11908 -2264 -8912 5480 -500 7591 3487 -10488 -10234 1640 14637 9918 -13737 -24893
5917 -24893 -27984 -28916 -25280 -28496 -40983 -29221 -16191 -8570 -7953 3848 -359 -26125 -23823 -16932
5903 -16932 -29003 -24288 -24711 -45254 -41178 -14440 -4285 -11597 -5640 9673 9750 -21403 -14081 -1585
5889 -1585 -2657 -3261 -18052 -11944 -20279 -19978 -19866 -14783 -28669 -25702 -8992 22377 24191 31633 17809
5874 17809 11940 40278 52311 44566 23091 12704 -13936 -45895 -44073 -30676 -13649 -6963 217
$$ packed form
5970A9340j7155j3609j7930J4028l234j3148m590O366K9771P937j1693k5268r31
5957c0116J9778J0455O631P738j7079O674O44k4675P968L7728k559k2220o319
5944e352p559r497K0316K8991m47R55j4904q863j3744j3276j1651Q596J4700j73
5930a1908R644o648J4392n980Q091m104j3975K54J1874J2997m719k3655j1156
5917b4893l091r32L636l216j2487J1762J3030P621O17J1801m207k5766K302O891
5903a6932j2071M715m23k0543M076K6738J0155p312N957J5313P7l1153P322J2496
5889a585j072o04j4791O108q335L01J12N083j3886K967J6710L1369J814P442j3824
5874A7809n869K8338J2033p745k1475j0387k6640l1959J822J3397J7027O686P180
$$ plain form
5861 217 12045 16240 28851 18893 8213 -7924 -8723 16160 20492 15611 14998 -19039 -36782 -39263
5847 -39263 -7619 3817 -12425 -43477 -44071 -26818 -12104 -1697 5551 1733 13552 28343 28715
5834 28715 28608 -13777 -15548 -19686 -20304 -49000 -55948 -37191 -39561 -42549 -33138 -37698 -22839 -19789
5820 -19789 -18267 -26226 -16747 -21919 -49123 -37130 -23394 -47325 -52896 -56581 -61547 -70375 -37659
5807 -37659 -4289 -17670 -26683 -28801 -5532 3151 -15516 -4665 -91 -1241 -46256 -62731 -35455
5794 -35455 -37101 -42015 -15901 460 -3858 -26934 -36966 -36926 -36938 -28744 -25639 -5734 -18393 -19948
5780 -19948 4460 13448 1215 22882 13002 -10169 1716 -4168 3167 28870 9767 8556 31534
5767 31534 42637 31002 32899 37051 30268 7446 18659 21571 9266 13026 -17287 -16312 -191
$$ packed form
5861B17J1828M195J2611r958j0680j6137p99K4883M332m881o13l4037j7743k481
5847c9263L1644J1436j6242l1052n94J7253J4714J0407P248l818J1819J4791L72
5834B8715j07m2385j771m138o18k8696o948J8757k370k988R411m560J4859L050
5820a9789J522p959R479n172k7204J1993J3736k3931n571l685m966q828L2716
5807c7659L3370j3381r013k118K3269Q683j8667J0851M574j150m5015j6475K7276
5794c5455j646m914K6114J6361m318k3076j0032M0j2Q194L105J9905j2659j555
5780a9948K4408Q988j2233K1667r880k3171J1885n884P335K5703j9103j211K2978
5767C1534J1103j1635J897M152o783k2822J1213K912j2305L760l0313R75J6121
$$ plain form
5754 -191 3055 21423 20653 10048 -4716 -4773 11842 32298 27019 4272 -31263 -42475 -26810 -8450
5740 -8450 -5262 -1743 -20811 -46949 -32040 -13406 8085 6154 -8965 -20078 -30013 -40372 -40976
5727 -40976 -31298 -11909 -3281 4815 3480 -10920 -15923 -13200 -10959 -21463 -28478 -28147 -5722 1720
5713 1720 -21626 -7725 -17318 -5768 3747 7328 -14376 2773 -8158 -6385 -750 20895 18835
5700 18835 3960 -1177 18832 24406 28246 612 -12247 1463 -10244 -4650 2594 15159 14185
5687 14185 18190 24355 11639 9629 12426 13659 27122 48917 48636 28801 19814 6904 -13361
5674 -13361 -18898 -9597 -10122 6257 19230 11670 -14516 -11824 -5277 -16228 -24426 -30200 -17667 -22224
5660 -22224 571 18224 22139 27015 10364 6055 -6967 -20578 -22995 -27310 -36900 -24360 -19163
$$ packed form
5754a91L246J8368p70j0605j4764n7J6615K0456n279k2747l5535j1212J5665J8360
5740h450L188L519j9068k6138J4909J8634K1491j931j5119j1113r935j0359o04
5727d0976R678J9389Q628Q096j335j4400n003K723K241j0504p015L31K2425P442
5713A720k3346J3901r593J1550R515L581k1704J7149j0931J773N635K1645k060
5700A8835j4875n137K0009N574L840k7634j2859J3710j1707N594P244J2565r74
5687A4185M005O165j2716k010K797J233J3463K1795k81j9835q987j2910k0265
5674a3361n537R301n25J6379J2973p560k6186K692O547j0951q198n774J2533m557
5660b2224K2795J7653L915M876j6651m309j3022j3611k417m315r590J2540N197
$$ plain form
5647 -19163 -6604 -5162 -12095 -6962 -1418 -21349 -10428 2024 8937 -1826 -5932 -8737 -13922
5634 -13922 -8180 -6475 -12813 -13416 -5384 3734 -1066 -15613 -18843 4456 -6061 4418 24675 1184
5620 1184 -902 -2517 -20796 -33493 -16267 8 -22595 -34378 -6704 25781 20506 6284 5254
5607 5254 14721 -8113 -7486 -10226 -13782 -21086 -40059 -51221 -45304 -45369 -48544 -31584 -4748 -5165 -7997
5592 -7997 -12386 -20451 4041 -27097 -33419 -5514 9499 -16314 -37514 -41735 -16186 -2153 16396
5579 16396 -3515 -23811 -17343 -10736 15527 43160 16133 -3853 -14228 -13701 -28526 -19763 -11274
5566 -11274 -8087 22509 37173 38434 28008 31902 23960 14420 6744 9290 37076 36000 21134
5553 21134 4729 -27786 -34741 -32030 -20312 -20784 -9209 -13108 -24867 -30735 -415 -23511 -27463
$$ packed form
5647a9163J2559J442o933N133N544j9931J0921J2452O913j0763m106k805n185
5634a3922N742J705o338o03Q032R118m800j4547l230K3299j0517J0479K0257k3491
5620A184k086j615j8279j2697J7226J6275k2603j1783K7674L2485n275j4222j030
5607E254R467k2834O27k740l556p304j8973j1162N917o5l175J6960K6836m17k832
5592g997m389q065K4492l1138o322K7905J5013k5813k1200m221K5549J4033J8549
5579A6396j9911k0296O468O607K6263K7633k7027j9986j0375N27j4825Q763Q489
5566a1274L187L0596J4664J261j0426L894p942r540p676K546K7786j076j4866
5553B1134j6405l2515o955K711J1718m72J1575l899j1759n868L0320k3096l952
$$ plain form
5540 -27463 -15893 6215 22598 27812 -9075 -24075 1896 25067 9636 988 4917 -1353 -10130
5527 -10130 -14003 -2988 -24883 -58559 -59926 -61294 -45687 -29592 -37160 -26743 -26395 -36067 -55523
5514 -55523 -31839 -10537 2830 -3033 -32098 -23773 -12957 -14847 -15896 -4181 12738 -3491 -17392
5501 -17392 -7679 -9394 -7115 -7464 -2155 10945 -3667 -28450 -17861 -8314 -23503 -15404 -8425 -1278
5487 -1278 15252 14673 5804 -6044 -24250 -38505 -46107 -37673 -25472 -37561 -37208 -23134 8225
5474 8225 17915 22615 19646 -423 -19044 -36979 -19153 -19609 -41429 -35005 -19932 9612 3767
5461 3767 -11662 -5649 -9286 -17373 -10984 -9672 318 8735 10528 6573 17221 920 -35529 -43559
5447 -43559 -28720 -28084 -26410 -7490 28913 34290 22519 14434 -5813 -17245 -11592 3124 15047
$$ packed form
5540b7463J1570K2108J6383N214l6887j5000K5971K3171j5431q648L929o270q777
5527a0130l873J1015k1895l3676j367j368J5607J6095p568J0417L48r672j9456
5514e5523K3684K1302J3367n863k9065Q325J0816j890j049J1715J6919j6229j3901
5501a7392R713j715K279l49N309J3100j4612k4783J0589R547j5189Q099O979P147
5487a278J6530n79q869j1848j8206j4255p602Q434J2201j2089L53J4074L1359
5474H225R690M700k969k0069j8621j7935J7826m56k1820O424J5073K9544n845
5461C767j5429O013l637q087O389J312R990Q417J793l955J0648j6301l6449q030
5447d3559J4839O36J674J8920L6403N377j1771q085k0247j1432N653J4716J1923
$$ plain form
5434 15047 19334 -4542 -7468 4986 -2036 4299 -342 -30041 -43587 -15766 5423 12668 23136
5421 23136 21580 -6935 -65554 -84389 -75389 -71844 -60946 -42055 4814 17529 9074 -32585 -16188
5408 -16188 801 -10712 -12353 486 2283 11689 -4196 -20253 -16824 -9673 -15917 -17123 -19459
5395 -19459 -1613 2964 29257 28016 23565 -6388 -46227 -35677 -15060 -13328 10493 21922 -15144
5382 -15144 -56747 -50501 -18579 -9458 -6717 6120 11251 17578 25767 2259 -25913 -27657 -17167
5369 -17167 -9657 -3568 19116 45076 63895 65265 42863 30860 -17604 -29463 4381 16189
5357 16189 17577 36176 25902 -3632 -23071 -39386 -47223 -22465 -2605 3424 -10153 -30516
5345 -30516 -56790 -45110 -67493 -56653 -29676 -15225 -21613 -16953 5982 -3180 -540 37606 48768
$$ packed form
5434A5047M287k3876k926J2454p022O335m641k9699j3546K7821K1189P245J0468
5421B3136j556k8515n8619j8835R000L545J0898J8891M6869J2715q455m1659J6397
5408a6188J6989j1513j641J2839J797R406j5885j6057L429P151o244j206k336
5395a9459J7846M577K6293j241m451k9953l9839J0550K0617J732K3821J1429l7066
5382a5144m1603O246L1922R121K741J2837N131O327Q189k3508k8172j744J0490
5369a7167P510O089K2684K5960J8819J370k2402j2003m8464j1859L3844J1808
5357A6189J388J8599j0274k9534j9439j6315p837K4758J9860O029j3577k0363
5345c0516k6274J1680k2383J0840K6977J4451o388M660K2935r162K640L8146J1162
$$ plain form
5332 48768 33004 12681 7040 8760 3702 -7006 8083 17841 -1703 -8176 -25773 -41070 -23137
5319 -23137 3252 25802 -4599 -20241 -2674 10013 6858 -3549 -35082 -20487 -9576 -16120
5307 -16120 -15810 -21621 -30597 -29976 -40989 -40500 -33046 -13920 8834 8704 -6642 -2864 -6357 -12286 3232
5292 3232 18686 -6302 -8942 18143 35696 22194 -6249 -11701 1825 -10055 -22369 -28432 -38017
5279 -38017 -29876 -9719 -10840 -30386 -33930 -40888 -30254 -5157 2380 -380 -10589 -24865 -34957
5266 -34957 -42762 -47679 -65932 -63967 -29369 3849 35543 32313 17324 15771 9206 25006 33773
5253 33773 29543 13731 14964 18104 -8852 -25206 -23377 5549 724 -9194 -13473 -18383 -6398
5240 -6398 4939 3739 -5725 -5046 -6549 -14757 -18232 -1312 22157 10508 9171 -700 1039 -3493
$$ packed form
5332D8768j5764k0323n641J720n058j0708J5089R758j9544o473j7597j5297J7933
5319b3137K6389K2550l0401j5642J7567J2687l155j0407l1533J4595J0911o544
5307a6120L10n811q976O21j1013M89P454J9126K2754j30j5346L778l493n929J5518
5292C232J5454k4988k640K7085J7553j3502k8443n452J3526j1880j2314o063r585
5279c8017Q141K0157j121j9546l544o958J0634K5097P537k760j0209j4276j0092
5266c4957p805m917j8253J965L4598L3218L1694l230j4989j553o565J5800Q767
5253C3773m230j5812J233L140k6956j6354J829K8926m825r918m279m910J1985
5240f398J1337j200r464O79j503q208l475J6920K3469j1649j337r871J739m532
$$ plain form
5226 -3493 -15239 -20382 -31040 -16316 -15031 4059 2074 -9840 -10519 2534 22907 25788 12689
5213 12689 16209 17378 34487 39973 30743 19378 18919 32582 26968 16334 1966 -12307 4017
5200 4017 24596 25483 24771 28709 20953 28916 32326 30172 19132 23123 29523 35956 34001 6092 -13300
5185 -13300 -18475 -19233 -8902 -37937 -55227 -42512 -32607 -7144 19967 21414 23101 32728 30468
5172 30468 8189 2961 6291 8107 20572 20535 3000 14885 23502 26362 24710 -2510 -24802 -10922
5158 -10922 -2212 -19858 -22224 170 -11483 -12323 -5691 687 -697 -16834 -21650 -3448 -36108
5145 -36108 -52723 -42870 -33390 -6395 -18490 -23892 -22737 -28197 -33390 -11792 -33953 -17221 -5038
5132 -5038 -12025 2852 7133 -18117 -27421 -18817 -20356 -45142 -28855 -18035 -10231 -10382 -1015 4489
$$ packed form
5226c493j1746n143j0658J4724J285J9090j985j1914o79J3053K0373K881j3099
5213A2689L520J169J7109N486r230j1365m59J3663n614j0634j4368j4273J6324
5200D017K0579Q87p12L938p756P963L410k154j1040L991O400O433j955k7909j9392
5185a3300n175p58J0331k9035j7290J2715R905K5463K7111J447J687R627k260
5172C0468k2279n228L330J816J2465l7j7535J1885Q617K860j652k7220k2292J3880
5158a0922Q710j7646k366K2394j1653q40O632O378j384j6137m816J8202l2660
5145c6108j6615R853R480K6995j2095n402J155n460n193K1598k2161J6732J2183
5132e038o987J4877M281k5250r304Q604j539k4786J6287J0820P804j51R367N504
$$ plain form
5118 4489 20676 28034 -1179 -13629 -18636 -15525 -25205 -32745 -34803 -413 20334 13760 6838 3240
5104 3240 -14736 -5305 14864 5631 17556 25053 16196 -14848 -16979 -10569 -30169 -34016 -35614 -46937
5090 -46937 -23395 -32119 -50614 -44373 -19746 -30020 -57581 -65585 -45972 -33724 -49609 -28768
5078 -28768 10414 -3853 -16342 -19716 -11471 -2761 7218 20446 28129 25329 14546 -7931 20978
5065 20978 32968 -3623 -27621 -17169 2421 -17287 -36682 -20532 11710 966 20272 14100
5053 14100 -78 -25268 -32360 -11221 -9211 -36637 -33157 -23262 -25578 -27189 -24088 -13277 9357
5040 9357 30743 29313 19744 36256 20736 -2577 -1657 21680 29670 34599 14388 -10797 -20477
5027 -20477 -28784 -35253 -26011 -32806 -9614 4259 1100 1078 -9048 -20057 -14733 -2292 6662 29362
$$ packed form
5118D489J6187P358k9213j2450n007L111r680p540k058L4390K0747o574o922l598
5104C240j7976R431K0169r233J1925P497q857l1044k131O410j9600l847j598j1323
5090d6937K3542q724j8495O241K4627j0274k7561q004J9613J2248j5885K0841
5078b8768L9182j4267j2489l374Q245Q710R979J3228P683k800j0783k2477K8909
5065B0978J1990l6591k3998J0452J9590j9708j9395J6150L2242j0744J9306o172
5053A4100j4178k5190p092K1139K010k7426L480R895k316j611L101J0811K2634
5040I357K1386j430r569J6512j5520k3313R20K3337P990M929k0211k5185r680
5027b0477q307o469R242o795K3192J3873l159k2j0126j1009N324J2441Q954K2700
$$ plain form
5013 29362 53165 39040 2677 -19282 -23890 -19438 -4813 -3414 -23299 -25484 -22326 -18494 -8538
5000 -8538 10591 7053 -21787 -27038 -9357 -21836 -31746 -25718 -34537 -17893 13044 15652 3383
4987 3383 7345 30655 21229 12827 19284 32981 26596 17890 21823 -3774 -26029 16166 21239 9356
4973 9356 21555 12940 3237 -459 18753 8907 -8843 -9333 -18100 -16552 -2638 -9882 -981 14649
4959 14649 27011 21720 21524 16412 1984 -14032 -7566 -11115 -23271 -48883 -46325 -14082 -1863
4946 -1863 -13654 -16418 -29314 -12805 -1327 -6038 2663 7448 -6246 -6683 -632 -4871 -26319 -32077
4932 -32077 -18737 -9701 2126 6851 13100 22077 17429 252 -3135 2660 267 318 10867 -1256
4918 -1256 518 1588 -6297 2030 13598 28084 47820 47670 15361 -18 2434 4967 13893 10626
$$ packed form
5013B9362K3803j4125l6363k1959m608M452J4625J399j9885k185L158L832R956
5000h538J9129l538k8840n251J7681j2479r910O028q819J6644L0937K608j2269
4987C383L962K3310r426q402O457J3697o385q706L933k5597k2255M2195N073j1883
4973I356J2199q615r703l696J9212r846j7750m90q767J548J3914p244Q901J5630
4959A4649J2362n291j96n112j4428j6016O466l549j2156k5612K558L2243J2219
4946a863j1791k764j2896J6509J1478m711Q701M785j3694m37O051m239k1448n758
4932c2077J3340R036J1827M725O249Q977m648j7177l387N795k393N1J0549j2123
4918a256J774J070p885Q327J1568J4486J9736j50l2309j5379K452K533Q926l267
$$ plain form
4904 10626 -9941 -11272 -17112 -22894 -45728 -27073 -38448 -54989 -61316 -64822 -71424 -63710 -27907
4891 -27907 2081 9474 6519 -4140 -32422 -24192 -13738 8185 10945 6749 -4972 1733 8328
4878 8328 633 -2161 25027 49803 19599 -22456 -23790 -2207 3940 209 -8914 -13278 -10949 -26065
4864 -26065 -42041 -43768 -26593 -29276 -18013 -40900 -53002 -19974 -23423 -28730 -23890 -7008 -11526
4851 -11526 -21536 -25160 -35350 -34557 -20201 -18824 -14411 -7676 -13211 -10477 -915 -154 5883 1308
4837 1308 9703 3012 -518 -7639 -15945 -22706 -22150 -6840 2751 -3872 -18553 -16060 -16694 -55065 -63138
4822 -63138 -52791 -29109 -20253 -25906 -11758 7676 13660 17100 -7832 -33447 -12205 12440 7610
4809 7610 5654 9163 -1207 -20418 -10676 -16209 -34777 -53709 -31491 -21595 -14518 10033 42517
$$ packed form
4904A0626k0567j331n840n782k2834J8655j1375j6541o327l506o602P714L5803
4891b7907K9988P393k955j0659k8282Q230J0454K1923K760m196j1721O705O595
4878H328p695k794K7188K4776l0204m2055j334K1583O147l731r123m364K329j5116
4864b6065j5976j727J7175k683J1263k2887j2102L3028l449n307M840J6882m518
4851a1526j0010l624j0190P93J4356J377M413O735n535K734R562P61O037m575
4837A308Q395o691l530p121q306o761N56J5310R591o623j4681K493o34l8371q073
4822f3138J0347K3682Q856n653J4148J9434N984L440k4932k5615K1242K4645m830
4809G610j956L509j0370j9211R742n533j8568j8932K2218R896P077K4551L2484
$$ plain form
4796 42517 43208 13932 23034 9460 668 10754 -12235 -40344 -75220 -71197 -49688 -12316 -18840
4783 -18840 -642 11256 21433 11644 -1639 10029 3422 15945 -8406 -34282 -36972 -28823 -23718
4770 -23718 -20868 -9994 11287 8388 8253 11157 1424 5175 -10567 -1048 -28095 -44003 -24260
4757 -24260 -6805 4191 15698 23843 31297 16805 -12448 -20398 -11914 19275 21317 15353 31198
4744 31198 28441 11451 -11051 3562 9221 8902 4451 -2046 -9161 -12612 -7273 -9326 -25291 -24029
4730 -24029 -23051 -9066 -2912 10140 35030 10096 -11550 -11019 -7688 -21448 -23065 -29680 -36801 -19916
4716 -19916 -23549 -38902 -40494 -30082 -37343 -25159 28697 45704 42814 53447 69653 51007 51261
4703 51261 41000 27307 22263 25409 12329 27261 13719 -3262 -16777 -18950 -8944 -759 -13006
$$ packed form
4796D2517O91k9276R102j3574q792J0086k2989k8109l4876M023K1509L7372o524
4783a8840J8198J1898J0177r789j3283J1668o607J2523k4351k5876k690Q149N105
4770b3718K850J0874K1281k899j35K904r733L751j5742R519k7047j5908J9743
4757b4260J7455J0996J1507Q145P454j4492k9253p950Q484L1189K042n964J5845
4744C1198k757j6990k2502J4613N659l19m451o497p115l451N339k053j5965J262
4730b4029R78J3985O154J3052K4890k4934k1646N31L331j3760j617o615p121J6885
4716a9916l633j5353j592J0412p261J2184N3856J7007k890J0633J6206j8646K54
4703E1261j0261j3693n044L146j3080J4932j3542j6981j3515k173J0006Q185j2247
$$ plain form
4690 -13006 -23964 -26245 -12966 -2648 -9517 -23375 -46602 -35968 -20733 -17984 -24973 -38021 -24250
4677 -24250 -15031 3941 24752 30601 28229 8284 22500 39744 17191 4866 27121 31028 14211
4664 14211 19996 4948 11008 -17380 -33447 -7047 25503 24156 22346 27731 39522 29861 24565
4651 24565 23318 20589 16236 33747 34950 24756 52880 37298 12926 -9682 -27565 -31724 -28882
4638 -28882 -12757 -12493 -14318 -18723 -6007 15454 25878 8438 538 10941 -751 14715 29218
4625 29218 -2038 -23597 -24794 -25377 4993 5590 -5468 -18213 -27954 -18447 -17990 -20658 -39103 -42585
4611 -42585 -25199 65 -18972 -12219 21442 29549 26465 19689 28850 35518 22420 34000 47038
4598 47038 1514 -19323 3483 24482 18917 -9194 -206 -3008 -7461 4937 12021 -9662 -10982
$$ packed form
4690a3006j0958k281J3279J0318o869j3858k3227J0634J5235K749o989j3048J3771
4677b4250R219J8972K0811N849k372j9945J4216J7244k2553j2325K2255L907j6817
4664A4211N785j5048O060k8388j6067K6400L2550j347j810N385J1791r661n296
4651B4565j247k729m353J7511J203j0194K8124j5582k4372k2608j7883m159K842
4638b8882J6125K64j825m405J2716K1461J0424j7440p900J0403j1692J5466J4503
4625B9218l1256k1559j197n83L0370N97j1058j2745r741R507M57k668j8445l482
4611d2585J7386K5264j9037O753L3661Q107l084o776R161O668j3098J1580J3038
4598D7038m5524k0837K2806K0999n565k8111Q988k802m453J2398P084k1683j320
$$ plain form
4585 -10982 -344 7290 12147 18133 26379 51580 44660 3292 -536 -2122 -1704 -7786 -15078 -17677
4571 -17677 -21252 -37939 -36188 -23539 531 16959 11618 37138 28859 10234 -4722 -9014 -9863
4558 -9863 25653 23208 16548 4550 1488 18176 20884 10861 5057 7979 15465 -4512 -11210 -39682
4544 -39682 -49696 -41635 -27635 -26452 -24696 -38697 -35632 -20336 -31106 -25588 2924 9691 -255
4531 -255 -12809 -12690 -24916 -15018 -13847 -18855 -28294 -44635 -60127 -56974 -50987 -42285 -22232 435
4517 435 -1468 -8716 -9636 -9870 -7220 -19633 20758 13001 15881 14816 -5497 10794 18251 -1512
4503 -1512 -15457 -3220 9870 15023 13499 18391 13568 14233 5331 12523 6092 -3238 -10914 -2107
4489 -2107 16893 -4020 -7896 574 3338 -13835 -21974 -19211 6054 17357 32869 42449 27882
$$ packed form
4585a0982J0638P634M857N986Q246K5201o920m1368l828j586M18o082p292k599
4571a7677l575j6687J751J2649K4070J6428n341K5520q279j8625j4956m292q49
4558i863L5516k445o660j1998l062J6688K708j0023n804K922P486j9977o698k8472
4544c9682j0014Q061J4000J183J756j4001L065J5296j0770N518K8512O767r946
4531b55j2554J19j2226R898J171n008r439j6341j5492L153N987Q702K0053K2667
4517D35j903p248r20k34K650j2413M0391p757K880j065k0313J6291P457j9763
4503a512j3945J2237J3090N153j524M892m823O65q902P192o431r330p676Q807
4489b107J9000k0913l876Q470K764j7173q139K763K5265J1303J5512R580j4567
$$ plain form
4476 27882 1476 -9471 -29199 -33532 -29161 -15645 -6453 -23718 -18810 -22871 -24302 -12371 5324
4463 5324 2037 -14246 -17808 -21051 -31970 -19667 1465 36341 29054 22845 12116 6949 -23050
4450 -23050 -28898 -27523 -18862 -20576 -4964 -4642 -16673 -11274 -17442 -17006 8974 11480 -8813 -4602
4436 -4602 -3440 -10669 -14503 -365 -14148 -14848 -8675 682 4158 -17051 -17880 -22706 -20445 -12335 7304
4421 7304 -399 -2476 -6990 -12161 -27574 -41560 -22649 6021 15519 21635 19597 29103 43934 70213
4407 70213 68352 64019 51603 30027 9111 9975 -4452 12851 36173 50166 33961 30058 27955
4394 27955 45118 48513 22355 19967 37691 19272 28051 49383 46047 33550 22943 -4868 -20168
4381 -20168 -25653 -23680 -51758 -42442 -18384 -1786 -3918 -13967 -25456 -40216 -37832 -37876 -4628
$$ packed form
4476B7882k6406j0947j9728m333M371J3516R192j7265M908m061j431J1931J7695
4463E324l287j6283l562l243j0919J2303K1132L4876p287o209j0729n167k9999
4450b3050n848J375Q661j714J5612L22j2031N399o168M36K5980K506k0293M211
4436d602J162p229l834J4138j3783p00O173R357L476k1209q29m826K261Q110J9639
4421G304p703k077m514n171j5413j3986J8911K8670R498O116k038R506J4831K6279
4407G0213j861m333j2416k1576k0916Q64j4427J7303K3322J3993j6205l903k103
4394B7955J7163L395k6158k388J7724j8419Q779K1332l336j2497j0607k7811j5300
4381b0168n485J973k8078R316K4058J6598k132j0049j1489j4760K384m4L3248
$$ plain form
4368 -4628 -4725 -1819 16603 21575 18909 9332 -13280 -17402 -28691 -15182 15802 14836 27799 33900
4354 33900 10586 -21487 -8541 5744 14890 6923 13943 -4954 -15808 14405 24103 23902 11526
4341 11526 -9395 -7372 -3426 -4634 11550 7974 11343 19220 46567 26358 -3758 -784 6374
4328 6374 -18541 -21635 -17833 9877 22514 2280 -24039 -17441 19521 49723 54037 39385 36322
4315 36322 32087 16509 18390 995 -46694 -64789 -43824 -24470 -36705 -43720 -20927 -28738 -29848
4302 -29848 -11750 5311 7972 4978 -17413 -24804 1251 3415 -16384 -26614 -24977 -35421 -41222
4289 -41222 -31175 -27864 -24996 -18747 -20947 4686 18280 10618 -8220 2283 34865 40509 14523
4276 14523 -13634 -9877 -11864 -28419 -40297 -54383 -47651 -33433 -14644 -4906 -22876 -10493 9103
$$ packed form
4368d628r7K906J8422M972k666r577k2612m122j1289J3509L0984r66J2963O101
4354C3900k3314l2073J2946J4285R146p967P020j8897j0854L0213R698k01j2376
4341A1526k0921K023L946j208J6184l576L369P877K7347k0209l0116K974P158
4328F374k4915l094L802K7710J2637k0234k6319O598L6962L0202M314j4652l063
4315C6322m235j5578J881j7395m7689j8095K0965J9354j2235p015K2793p811j110
4302b9848J8098J7061K661k994k2391p391K6055K164j9799j0230J637j0444n801
4289d1222J0047L311K868O249k200K5633J3594p662j8838J0503L2582N644k5986
4276A4523k8157L757j987j6555j1878j4086O732J4218J8789R738j7970J2383J9596
$$ plain form
4263 9103 2633 14386 3680 -15381 -20688 -27769 -17253 -11152 -19348 -16186 10873 23202 36823
4250 36823 42068 45083 15631 4306 5970 -4354 -83 21380 21901 18511 794 -17584 -1614
4237 -1614 36465 17986 2609 -5517 -17416 -15033 -4269 8173 -11523 -28692 -20841 -28450 -60523
4224 -60523 -64753 -57922 -25021 -18539 -13026 1405 3903 5063 9368 12952 18946 25145 33961 18814
4210 18814 6367 -9211 -28895 -12152 15752 18547 26701 -9507 -17320 -7383 4295 -3855 5700
4197 5700 16329 -9716 -41264 -50814 -34674 -20706 -46731 -69519 -48717 -24368 3078 4286
4185 4286 708 -18817 -13894 2660 3558 -9781 -15660 2587 2421 -4078 11795 13131 270 320
4171 320 7662 -6384 -15202 -10922 10942 9988 -18854 -23907 -12395 9458 12824 988 -2987 -1530
$$ packed form
4263I103o470J1753j0706j9061n307p081J0516O101q196L162K7059J2329J3621
4250C6823N245L015k9452j1325J664j0324M271K1463N21l390j7717j8378J5970
4237a614L8079j8479j5377q126j1899K383J0764J2442j9696j7169P851p609l2073
4224f0523m230O831L2901O482N513J4431K498J160M305L584N994O199Q816j5147
4210A8814j2447j5578j9684J6743K7904K795Q154l6208p813R937J1678q150R555
4197E700J0629k6045l1548r550J6140J3968k6025k2788K0802K4349K7446J208
4185D286l578j9525M923J6554Q98j3339n879J8247j66o499J5873J336j2861N0
4171C20P342j4046q818M280K1864r54k8842n053J1512K1853L366j1836l975J457
$$ plain form
4157 -1530 20258 38061 37353 29185 39211 24937 19976 15466 17947 18961 12276 -20270 -17062 1215
4143 1215 8244 21270 34903 51688 48134 26887 22576 11238 15185 2529 -9633 -10605 -13380
4130 -13380 -18636 -15041 -7449 -11561 -9104 11231 15607 15601 13282 9899 -6125 1419 13998 12833 855
4115 855 34932 40851 15767 18998 10616 -7385 -24974 -11782 7904 2329 -25086 -21719 -25595
4102 -25595 -19803 -23810 -37775 -34986 -23735 -1927 7729 11438 13260 -3094 -34855 -31125 -17552
4089 -17552 -17181 -12115 -13801 -28342 -35707 -24175 23273 24404 7502 -10745 -24251 -37860 -31745
4076 -31745 -17831 -27812 -25885 -22998 -1589 36887 40447 15743 -15982 -29040 -14374 -10353 -19071
4063 -19071 -45855 -26409 -14409 -14498 -2687 -10055 -28848 -26027 -5730 -194 5497 16554 2982
$$ packed form
4157a530K1788J7803p08q168J0026j4274m961m510K481J014o685l2546L208J8277
4143A215P029J3026J3633J6785l554k1247m311j1338L947j2656j2162r72k775
4130a3380n256L595P592m112K457K0335M376ok319l383j6024P544J2579j165j1978
4115H55L4077N919k5084L231q382j8001j7589J3192J9686n575k7415L367l876
4102b5595N792m007j3965K789J1251K1808R656L709J822j6354l1761L730J3573
4089a7552L71N066j686j4541p365J1532M7448J131j6902j8247j3506j3609O115
4076c1745J3914r981J927K887K1409L8476L560k4704l1725j3058J4666M021q718
4063a9071k6784J9446J2000q9J1811p368j8793K821K0297N536N691J1057j3572
$$ plain form
4050 2982 4985 -1692 5775 15120 -3457 -17477 -14309 -5833 9417 12451 11041 11779 25118 26223
4036 26223 21364 31346 23791 16763 -2566 8034 19637 -13474 -14026 -16106 -18478 -14509 -13330 -21187
4022 -21187 -19776 -11055 169 -3138 -15251 -22089 -34115 -15772 2227 -18894 -16880 -16338 -8827
4009 -8827 9528 6666 -15030 -2390 12382 -2653 5435 16980 30148 13095 -480 38868
3997 38868 8379 -19825 -21849 -20343 -23287 -20856 -21697 -723 9225 -9330 -8827 -11544 15297 6730
3983 6730 -5617 10465 6512 -7109 -26389 -28950 -17949 -14741 -8708 7060 20018 -6568 -12927
3970 -12927 6681 351 -14521 4825 -1376 -5044 -3264 -6590 4777 -4433 -7964 -12281 -21346 -27829
3956 -27829 -10578 13545 16025 12298 14341 31522 10051 -24201 -24101 -17521 -28187 -36670 -38986
$$ packed form
4050B982K003o677P467R345j8577j4020L168Q476J5250L034j410P38J3339J105
4036B6223m859R982p555p028j9329J0600J1603l3111n52k080k372L969J179p857
4022b1187J411Q721J1224l307j2113o838j2026J8343J7999k1121K014N42P511
4009h827J8355k862k1696J2640J4772j5035Q088J1545J3168j7053j3575L9348
3997C8868l0489k8204k024J506k944K431q41K0974R948j8555N03k717K6841q567
3983F730j2347J6082l953j3621j9280k561J1001L208O033J5768J2958k6586o359
3970a2927J9608o330j4872J9346o201l668J780l326J1367r210l531m317r065o483
3956b7829J7251K4123K480l727K043J7181k1471l4252J00O580j0666q483k316
$$ plain form
3943 -38986 -19241 -5345 -25155 -34345 -16144 -3223 17163 31763 27815 30018 9671 15466 13479
3930 13479 -14568 -22589 -8502 -21341 -21279 -10562 -10887 -13990 -10933 -7438 -16518 -43293 -55246 -34759
3916 -34759 -16155 -26230 -11112 3782 -2349 -23683 -23521 -18284 -8209 -22970 -11581 -15397 -24251
3903 -24251 4327 15930 -226 -852 5277 6313 -6583 8367 12246 -6846 -14522 -1607 4080
3890 4080 -7111 -1150 4904 8721 3597 -8970 -15978 -9696 -30313 -56323 -35614 -168 29096
3877 29096 27094 1193 7436 12731 -5441 -15406 -6691 -1875 -6107 -16418 -19430 -2903 13571
3864 13571 20426 6828 -12305 -33179 -54945 -32904 -14103 4213 -21850 -18180 14240 33745
3852 33745 20859 18532 15464 11495 -11311 -18713 -3326 6547 7614 11482 11501 -11585 -23780 -34680
$$ packed form
3943c8986J9745J3896j9810r190J8201J2921K0386J4600l948K203k0347N795j987
3930A3479k8047q021J4087j2839O2J0717l25l103L057L495r080k6775j1953K0487
3916c4759J8604j0075J5118J4894o131k1334J62N237J0075j4761J1389l816q854
3903b4251K8578J1603j6156o26O129J036j2896J4950L879j9092p676J2915N687
3890D080j1191N961O054L817n124j2567p008O282k0617k6010K0709L5446K9264
3877B9096k002k5901O243N295j8172r965Q715M816m232j0311l012J6527J6474
3864A3571O855j3598j9133k0874k1766K2041J8801J8316k6063L670L2420J9505
3852C3745j2886k327l068l969k2806p402J5387R873J067L868J9k3086j2195j0900
$$ plain form
3838 -34680 -40179 -46120 -32797 -12894 -515 11159 21850 1612 -10063 -25413 10723 13348
3826 13348 20640 19099 18302 29309 40838 27070 24787 15034 -18284 -19561 -2863 12974 -3691
3813 -3691 -27891 -25598 3612 4690 5406 1836 -7905 -2975 29233 28827 34433 24783 10270 2857
3799 2857 -10405 -2664 19261 25970 25900 29066 21503 16373 36452 41688 47771 58386 38786 8353
3785 8353 6249 14292 870 5648 14928 17376 19279 13064 7066 13823 -2725 -8720 3296 11372
3771 11372 14865 30195 53551 42652 10687 19506 22140 18503 -1018 19248 13171 -29461 -30904
3758 -30904 -6847 17283 17441 2269 1666 10833 5040 11315 -1697 -15196 -22623 -6221 10708
3745 10708 7110 -14594 -6999 14213 18773 14112 40664 16646 -4307 6245 14485 -750 5980
$$ packed form
3838c4680n499n941J3323J9903J2379J1674J0691k0238j1675j5350L6136K625
3826A3348P292j541p97J1007J1529j3768k283r753l3318j277J6698J5837j6665
3813c691k4200K293K9210J078P16l570r741M930L2208m06N606r650j4513p413
3799B857j3262P741K1925O709p0L166p563n130K0079N236O083J0615j9600l0433
3785H353k104Q043j3422M778R280K448J903o215n998O757j6548n995J2016Q076
3771A1372L493J5330K3356j0899l1965Q819K634l637j9521K0266o077m2632j443
3758c0904K4057K4130J58j5172o03R167n793O275j3012j3499p427J6402J6929
3745A0708l598k1704P595K1212M560m661K6552k4018k0953J0552Q240j5235O730
$$ plain form
3732 5980 4693 -5517 2729 868 -8300 -27631 -40638 -25128 -4646 2337 -234 13410 26297
3719 26297 16599 38421 44447 36375 25602 25368 6021 -8261 -18366 -18457 -31065 1953 935 9734
3705 9734 30646 26388 196 -9538 5319 30684 35485 13754 7194 22270 25155 13766 -2819
3692 -2819 -17813 -30908 -28972 -12655 -10671 2360 29271 22813 8539 6363 -21272 -19076 -8908
3679 -8908 -25509 -35754 -18498 -11921 -20473 -17903 -9909 -25184 -15883 17415 16449 7417 7651 -13459
3665 -13459 -6856 16050 15088 4815 -10774 4948 9107 -6586 -18699 -8991 10234 1983 -31787
3652 -31787 -30544 -32682 -16692 -6230 -7306 -5490 -21866 -26490 -36787 -36398 -16399 12974 35065
3639 35065 -1081 -5932 -7795 -8189 -13056 -9247 4090 2258 12264 19324 376 -46572 -51936 -36446
$$ packed form
3732E980j287j0210Q246j861r168j9331j3007J5510K0482O983k571J3644J2887
3719B6297r698K1822O026q072j0773k34j9347j4282j0105r1j2608L3018j018Q799
3705I734K0912m258k6192r734J4857K5365M801k1731o560J5076K885j1389j6585
3692b819j4994j3095J936J6317J984J3031K6911o458j4274k176k7635K196J0168
3679h908j6601j0245J7256O577q552K570P994j5275R301L3298r66r032K34k1110
3665a3459O603K2906r62j0273j5589J5722M159j5693j2113R708J9225q251l3770
3652c1787J243k138J5990J0462j076J816j6376m624j0297L89J9999K9373K2091
3639C5065l6146m851j863l94m867L809J3337j832J0006P060j8948m6948n364J5490
$$ plain form
3625 -36446 -12538 12827 11205 136 -2719 3547 1647 -668 3571 16863 12347 6639 12503 11997
3611 11997 26594 27653 36261 23346 22399 7370 -506 15438 28151 25442 16786 27747 10461
3598 10461 -3542 -10881 484 3736 -33132 -36088 -13338 -9632 -8637 -4691 21301 -3239 -21034
3585 -21034 -29822 -3178 4074 -3448 8939 19479 28701 24999 2262 -5614 -4086 -6805 -22012
3572 -22012 -6121 -3562 -13757 -21693 -34418 -33261 5972 18115 22380 39779 36424 15374 -12417
3559 -12417 -7813 -4411 -12849 -7561 -20804 -43096 -39246 -14408 -2311 6774 -9049 -8813 -4421 -10791
3545 -10791 -23333 -18991 3219 -11131 -17689 -9913 5374 15172 169 -4703 -10007 -10380 -22936
3532 -22936 -44796 -40430 -18685 -4410 -8540 -16450 -2357 -12771 -12671 -10421 -2520 547 -10983
$$ packed form
3625c6446K3908K5365j622j1069k855O266j900k315M239J3292m516n708N864n06
3611A1997J4597J059Q608j2915r47j5029p876J5944J2713k709q656J0961j7286
3598A0461j4003p339J1365L252l6868k956K2750L706R95L946K5992k4540j7795
3585b1034q788K6644P252p522J2387J0540R222l702k2737p876J528k719j5207
3572b2012J5891K559j0195p936j2725J157L9233J2143M265J7399l355k1050k7791
3559a2417M604L402q438N288j3243k2292L850K4838J2097R085j5823K36M392o370
3545a0791j2542M342K2210j4350o558P776J5287R798j5003m872n304l73j2556
3532b2936k1860M366K1745J4275m130p910J4093j0414J00K250P901L067j1530
$$ plain form
3519 -10983 16396 36180 36077 35243 15846 -32351 -47667 -19418 15814 27829 19222 7793 26350
3506 26350 24355 12376 12961 11692 3271 18303 47868 47520 46508 39902 18624 4900 4289 9251
3492 9251 20753 19730 30164 19135 9107 -11386 -31099 -21543 23143 20234 24579 3613 11958
3479 11958 -3817 -14638 -19875 -13643 10663 23160 4812 2006 -478 7582 -16065 -24083 -41238
3466 -41238 -30986 -16778 -8294 -22739 -28164 -48272 -57218 -36375 -18907 -19336 -691 5507 -4426
3453 -4426 11275 18220 8294 -9225 -9487 -11177 360 2951 -19480 -11164 -13640 -11077 -3134 -6573
3439 -6573 27787 39349 40613 38719 12700 611 -7121 -9005 1678 9768 1572 -9524 -13463
$$ packed form
3519a0983K7379J9784j03q34j9397m8197j5316K8249L5232J2015q607j1429J8557
3506B6350j995j1979N85j269q421J5032K9565l48j012o606k1278j3724o11M962
3492I251J1502j023J0434j1029j0028k0493j9713R556M4686k909M345k0966Q345
3479A1958j5775j0821n237O232K4306J2497j8348k806k484Q060k3647q018j7155
3466d1238J0252J4208Q484j4445n425k0108q946K0843J7468m29J8645O198r933
3453d426J5701O945r926j7519k62j690J1537K591k2431Q316k476K563P943l439
3439f573L4360J1562J264j894k6019j2089p732j884J0683Q090q196j1096l939
$$ [...]
##END NTUPLES=NMR SPECTRUM
##END=
