##TITLE=Analysis number 327671
Compound Code dfp 00070
Book Reference 22544
Project Code adrs flro3
Chemist Name jom
##JCAMPDX= 6.0         $$ Bruker NMR JCAMP-DX V2.0
##DATA TYPE= NMR SPECTRUM
##DATA CLASS= NTUPLES
##ORIGIN= Bruker BioSpin GmbH
##OWNER= nmr
$$ XWIN-NMR		Version 3.5
$$ Fri Mar 30 10:10:57 2007 GMT Daylight Time (UT+1h)  MAYBRIDGE\nmr@NMR_250MHZ
##.OBSERVE FREQUENCY= 250.131544655141
##.OBSERVE NUCLEUS= ^1H
##.ACQUISITION MODE= SIMULTANEOUS (DQD)
##.ACQUISITION SCHEME= undefined
##.AVERAGES= 16
##.DIGITISER RES= 18
##SPECTROMETER/DATA SYSTEM= dpx250
##.PULSE SEQUENCE= zg30
##.SOLVENT NAME= CDCl3
##.SHIFT REFERENCE= (INTERNAL, CDCl3, 0, 16.522)
##AUDIT TRAIL= $$ (NUMBER, WHEN, WHO, WHERE, WHAT)
$$ ##TITLE= Audit trail, XWIN-NMR		Version 3.5
$$ ##JCAMPDX= 5.01
$$ ##ORIGIN= Bruker BioSpin GmbH
$$ ##OWNER= nmr
$$ C:\u/data/dgb/nmr/ADRS/2680/pdata/1/auditp.txt
$$ ##AUDIT TRAIL=  $$ (NUMBER, WHEN, WHO, WHERE, WHAT)
(   1,<2007-03-30 10:10:35.20 +100>,<MAYBRIDGE\nmr>,<NMR_250MHZ>,
      <created by zg, POWCHK disabled, PULCHK disabled
       configuration hash MD5:
       49 4B E0 1D 92 C2 6B 37 9F E6 65 BC 52 41 86 1D
       data hash MD5: 64K
       F8 E5 44 B3 D0 03 9D B6 6C 87 E8 4F 9E 2D 29 E6>)
(   2,<2007-03-30 10:10:48.15 +100>,<MAYBRIDGE\nmr>,<NMR_250MHZ>,
      <Start of raw data processing
       ef LB = 0.3 FT_mod = 6 PKNL = 1 SI = 32K 
       data hash MD5: 32K
       0E 48 72 6C 3F 19 EB BC DE 4F F0 D0 92 B1 D1 72>)
(   3,<2007-03-30 10:10:49.81 +100>,<MAYBRIDGE\nmr>,<NMR_250MHZ>,
      <apk 
       data hash MD5: 32K
       41 6F BB A6 57 0D 1F 04 39 18 10 A1 3B D3 67 F8>)
(   4,<2007-03-30 10:10:50.56 +100>,<MAYBRIDGE\nmr>,<NMR_250MHZ>,
      <abs ABSG = 5 
       data hash MD5: 32K
       9D 30 D1 97 8B 93 E0 AF 79 1D DF 59 0A C7 1F BB>)
$$ ##END=
$$ 
$$ hash MD5
$$ 0A BD E2 B3 EE 47 94 8B 5E D3 0A AE DA 70 5D 3A
##$RELAX= 
##$RELAX= 
##$RELAX= 
##$RELAX= 
##$RELAX= 
##$RELAX= 
##$RELAX= 
$$ Bruker specific parameters
$$ --------------------------
##$DU= <C:\u>
##$EXPNO= 2680
##$NAME= <ADRS>
##$PROCNO= 1
##$TYPE= <nmr>
##$USER= <dgb>
##$AMP= (0..31)
100 100 100 100 100 100 100 100 100 100 100 100 100 100 100 100 100 100 
100 100 100 100 100 100 100 100 100 100 100 100 100 100 
##$AQSEQ= 0
##$AQ_mod= 3
##$AUNM= <au_zg>
##$AUTOPOS= <53 >
##$BF1= 250.13
##$BF2= 250.13
##$BF3= 250.13
##$BF4= 250.13
##$BF5= 500.13
##$BF6= 500.13
##$BF7= 500.13
##$BF8= 500.13
##$BYTORDA= 1
##$CFDGTYP= 0
##$CFRGTYP= 5
##$CHEMSTR= <none>
##$CNST= (0..31)
1 1 145 1 1 1 1 1 1 1 1 1 1 1 1 1 1 1 1 1 1 1 1 1 1 1 1 1 1 1 1 1 
##$CPDPRG= <>
##$CPDPRG1= <>
##$CPDPRG2= <>
##$CPDPRG3= <>
##$CPDPRG4= <mlev>
##$CPDPRG5= <mlev>
##$CPDPRG6= <mlev>
##$CPDPRG7= <mlev>
##$CPDPRG8= <mlev>
##$CPDPRGB= <>
##$CPDPRGT= <>
##$D= (0..31)
0 1 0 0 0 0 0 0 0 0.06 0 0 0 0 0 0 0.0002 0 0 0 0 0 0 0 0 0 0 0 0 0 0 
0 
##$DATE= 1175245833
##$DBL= (0..7)
120 120 120 120 120 120 120 120 
##$DBP= (0..7)
150 150 150 150 150 150 150 150 
##$DBP07= 0
##$DBPNAM0= <>
##$DBPNAM1= <>
$$ [...]
##$SUBNAM7= <"">
##$SUBNAM8= <"">
##$SUBNAM9= <"">
##$SW= 20.6930455092707
##$SWIBOX= (0..15)
0 0 3 0 0 0 0 0 0 0 0 0 0 0 0 0 
##$SW_h= 5175.983436853
##$TD= 65536
##$TD0= 1
##$TE= 683.16
##$TE2= 300
##$TE3= 300
##$TEG= 300
##$TL= (0..7)
0 120 120 120 120 120 120 120 
##$TP= (0..7)
150 150 150 150 150 150 150 150 
##$TP07= 0
##$TPNAME0= <>
##$TPNAME1= <>
##$TPNAME2= <>
##$TPNAME3= <>
##$TPNAME4= <>
##$TPNAME5= <>
##$TPNAME6= <>
##$TPNAME7= <>
##$TPOAL= (0..7)
0.5 0.5 0.5 0.5 0.5 0.5 0.5 0.5 
##$TPOFFS= (0..7)
0 0 0 0 0 0 0 0 
##$TUNHIN= 0
##$TUNHOUT= 0
##$TUNXOUT= 0
##$USERA1= <user>
##$USERA2= <user>
##$USERA3= <user>
##$USERA4= <user>
##$USERA5= <user>
##$V9= 5
##$VALIST= <valist>
##$VCLIST= <CCCCCCCCCCCCCCC>
##$VD= 0
##$VDLIST= <DDDDDDDDDDDDDDD>
##$VPLIST= <PPPPPPPPPPPPPPP>
##$VTLIST= <TTTTTTTTTTTTTTT>
##$WBST= 1024
##$WBSW= 4
##$XGAIN= (0..3)
0 0 0 0 
##$XL= 0
##$YL= 0
##$YMAX_a= 434647
##$YMIN_a= -440279
##$ZGOPTNS= <>
##$ZL1= 120
##$ZL2= 120
##$ZL3= 120
##$ZL4= 120
##$ABSF1= 16.522
##$ABSF2= -4.171173
##$ABSG= 5
##$ABSL= 3
##$ALPHA= 0
##$AQORDER= 0
##$ASSFAC= 0
##$ASSFACI= 0
##$ASSFACX= 0
##$ASSWID= 0
##$AUNMP= <proc_1d>
##$AZFE= 0.1
##$AZFW= 0.1
##$BCFW= 0
##$BC_mod= 0
##$BYTORDP= 0
##$COROFFS= 0
##$CY= 12.5
##$DATMOD= 1
##$DC= 0
##$DFILT= <>
##$DTYPP= 0
##$F1P= 14.0000005364418
##$F2P= -0.99999901652339
##$FCOR= 0.5
##$FTSIZE= 32768
##$FT_mod= 6
##$GAMMA= 0
##$GB= 0
##$INTBC= 1
##$INTSCL= 1
##$ISEN= 128
##$LB= 0.3
##$LEV0= 0
##$LPBIN= 0
##$MAXI= 10000
##$MC2= 0
##$MEAN= 0
##$ME_mod= 0
##$MI= 0
##$NCOEF= 0
##$NC_proc= -4
##$NLEV= 6
##$NOISF1= 0
##$NOISF2= 0
##$NSP= 0
##$NTH_PI= 0
##$NZP= 0
##$OFFSET= 16.522
##$PC= 1
##$PHC0= 233.9518
##$PHC1= 4.394034
##$PH_mod= 1
##$PKNL= yes
##$PPARMOD= 0
##$PSCAL= 4
##$PSIGN= 0
##$REVERSE= no
##$SF= 250.13
##$SI= 32768
##$SIGF1= 0
##$SIGF2= 0
##$SINO= 400
##$SIOLD= 32768
##$SREGLST= <1H.CDCl3>
##$SSB= 0
##$STSI= 32768
##$STSR= 0
##$SW_p= 5175.98343685301
##$SYMM= 0
##$S_DEV= 0
##$TDeff= 65536
##$TDoff= 0
##$TI= <Analysis number 999999
Compound Code 99
Book Reference 9
Project Code 9>
##$TILT= no
##$TM1= 0
##$TM2= 0
##$TOPLEV= 0
##$USERP1= <user>
##$USERP2= <user>
##$USERP3= <user>
##$USERP4= <user>
##$USERP5= <user>
##$WDW= 1
##$XDIM= 32768
##$YMAX_p= 325935800
##$YMIN_p= -213420
$$ End of Bruker specific parameters
$$ ---------------------------------
##NTUPLES= NMR SPECTRUM
##VAR_NAME=  FREQUENCY,     SPECTRUM/REAL,   SPECTRUM/IMAG
##SYMBOL=    X,             R,               I
##VAR_TYPE=  INDEPENDENT,   DEPENDENT,       DEPENDENT
##VAR_FORM=  AFFN,          ASDF,            ASDF
##VAR_DIM=   32768,         32768,           32768
##UNITS=     HZ,            ARBITRARY UNITS, ARBITRARY UNITS
##FACTOR=    0.157963299565203, 1,           1
##FIRST=     4132.6476996994, 0,             0
##LAST=      -1043.33573715361, 0,           0
##MIN=       -1043.33573715361, -213420,     0
##MAX=       4132.6476996994, 325935800,     0
$$ Real data points
##PAGE= N=1
##DATA TABLE= (X++(R..R)), XYDATA
$$ [...]
18386G5949n9195K913J1225j6421n6619L715m59L1819K224l3854J6706L9417K8871
18373D6291L608Q862j6074j0369J765m4025P919L4468L8910J4371M0399K3415
18361A49540o604m762R677k2091R386l2229l0212k614Q55k5583k9295q993J535
18348H610J2426J451k4299N0500k8369k0775K48p1737j1795J3018Q0846O1446
18336G1570J6412J2033o7582j3329j5666m2087k010K304O210m503L6331J4608
18324A4291k6835K8977o895K116R690J2343R737o7237m1738M2216K5485l6338
18312c4188p492k7600l4892N0862L8907K898k9353K0406l0255j0262M1050O9680
18300D9761M9409J8715n0592p6271j6961k3067O7388J6186j8721J4059L9762P397
$$ y = [75949, 16754, 19667, 30892, 14471, -42148, -38433, -38892, -7073, -4849, -38703, -21997, 17420, 46291, 49899, 58761, 42687, 32318, 34083, -9942, -2023, 32445, 71355, 85726, 126125, 149540, 142936, 138174, 147851, 125760, 135146, 102917, 72705, 70091, 70946, 45363, 16068, 7075, 8610, 21036, 22487, -1812, 48688, 20319, -456, -208, -71945, -83740, -70722, 10124, 71570, 87982, 100015, 32433, 19104, 3438, -38649, -40659, -38355, -32145, -36648, -317, 14291, -12544, 16433, 9538, 11654, 21344, 33687, 43424, -23813, -65551, -23335, 2150, -34188, -41680, -69280, -104172, -53310, -14403, -11505, -40858, -20452, -50707, -60969, -19919, 49761, 99170, 117885, 67293, -8978, -25939, -49006, 18382, 34568, 15847, 29906, 69668, 77065]
18288G7065J5572j02474j19458l7844L6537K8746J1890L822J4550K5344M6463
18277B13M9289k6500p967O7540O1249j0752l8649m0093m7222n2813k276m243J1280
18264d0944r607L0057M3025K1186j4377K3024N4514m724k7498k580L8477J843
18252A12396O849L0737k4664j2286J5428L1950l5529L595Q478N6622K2405o3224
18240A52757k5084N5307M8341j5324q9835J8176k8673r687J171J7271j4609l5647
18228G4164L6267k6377j1779M0702K0295m2392r520j424k721M382p182l7391M6367
18215H3391L7154k3300q346N1567m0587J1195L8269k9369j4067L7224L3993q060
18203A69064J6063N41N987p6845l971K1260N0720L103l148Q4099m109l3771n329
$$ y = [77065, 92637, -9837, -129295, -167139, -130602, -101856, -89966, -86144, -71594, -46250, 213, 49502, 23002, 15035, 82575, 143824, 133072, 94423, 54330, 7108, -45705, -47981, -52224, -40944, -50551, -20494, 22531, 43717, 29340, 52364, 106878, 102154, 74656, 72076, 110553, 112396, 119245, 149982, 125318, 113032, 128460, 160410, 124881, 128476, 136954, 193576, 215981, 152757, 127673, 182980, 231321, 215997, 126162, 144338, 115665, 105978, 107149, 124420, 109811, 74164, 110431, 84054, 72275, 112977, 133272, 90880, 81360, 79936, 77215, 81597, 74415, 37024, 83391, 120545, 97245, 88899, 140466, 99879, 111074, 149343, 119974, 105907, 143131, 177124, 169064, 185127, 185668, 191655, 114810, 110839, 132099, 182819, 185922, 182774, 266873, 262764, 228993, 223664]
18190B23664O686O6076M5810K1683O761J9152J1879l400J09947N2452j9010n7551
18178D84149k7086M9675M5798P8405N3504M9605K5919R1023J00986J43870Q7308
18167A183156P0550J19290P4047n550K4226J9303J31902J30695R5469J04800J64252
18156B112140J68067K29645L03322L65745M63631M05075L57615N64062Q80055
18147E849357J285576J628703K100182K547759L127763M250124O733829J0235678
18139C7758971J1533082J0526587Q982687N84989j2710583j2668115n083181J361528
18131D0285965O310340Q196865P532083M691888m328799j4980429j4905467r276822
18123B3525624m947040k508532j141474k93129M31089J245978K244957L309952
$$ y = [223664, 230350, 296426, 342236, 363919, 370680, 389832, 401711, 398311, 508258, 560710, 541700, 484149, 457063, 506738, 552536, 630941, 684445, 734050, 759969, 850992, 951978, 1095848, 1183156, 1253706, 1372996, 1447043, 1441493, 1465719, 1485022, 1616924, 1747619, 1843088, 1947888, 2112140, 2280207, 2509852, 2813174, 3178919, 3642550, 4047625, 4405240, 4969302, 5849357, 7134933, 8763636, 10863818, 13411577, 16539340, 20789464, 27523293, 37758971, 49292053, 59818640, 68801327, 69386316, 56675733, 44007618, 38924437, 40285965, 46596305, 54793170, 62325253, 67017141, 62688342, 47707913, 32802446, 23525624, 18578584, 16070052, 14928578, 14635449, 15066538, 16312516, 18557473, 21867425]
18115B1867425M516424N706791P008842R373384J4890717K4170622L0178495K9664487
18107A47377187K6356171Q503723k8776292m3947684l3710972j6740260m919896
18100E4141977L451562P799467P651324O328214j280363j7297767k0863248j3208091
18092B6723075p336791m324670k702407j789381j458610j240228j005403p63336
18084F102249m57620l38658l20215k99516l10880l02874k94264k28387k00828
18075C349007j34122j02942k13074j65255n7918j22693j19134R543p3905j33319
18065B236188k27640k49545j42871j05933p4708j19865l8622m6492r7626j22484
18055A010402q8556o5809J186N419k7287k3187p4262r2220p8487K934K6320l9271
$$ y = [21867425, 26383849, 32090640, 39099482, 48472866, 63363583, 87534205, 117712700, 147377187, 173733358, 182237081, 153460789, 109513105, 75802133, 59061873, 54141977, 57593539, 65393006, 73044330, 79372544, 78092181, 60794414, 39931166, 26723075, 19386284, 15061614, 12359207, 10569826, 9111216, 7870988, 6865585, 6102249, 5644629, 5305971, 4985756, 4686240, 4375360, 4072486, 3778222, 3549835, 3349007, 3214885, 3111943, 2898869, 2733614, 2675696, 2553003, 2433869, 2443412, 2369507, 2236188, 2008548, 1759003, 1616132, 1510199, 1435491, 1315626, 1277004, 1230512, 1132886, 1010402, 921846, 856037, 857223, 862642, 835355, 812168, 737906, 645686, 567199, 570133, 596453, 557182]
18043E57182q9113k279L2658K9727K9368p365k7920k4028J2385L2392M1111j3468
18031E70650r6894k1629M1640k4632n2316K716K9480P8755K3006j4806Q797l216
18019E41551n6207r1424p554j7742m9823o633R49K3335p0027k3385J786L4732
18007B79558l1282q684L1352K2775K2551m0517l0914K3315J6061p2289J298J64
17995B13388J6584K3163P3483p799N916L3058j8684l3328k2983m5742p2668J2299
17983A76687N2448K4841l0282m5003l9764J0955N6833l194m22M0293O4784k465
17971C05711n8897j03392J8023M2434l6534N491j8298M0028l2527p4076M4039
17960A32002P722n5052p051j280n608L0070M8342L3364p952m7886Q204L6m45J2714
$$ y = [557182, 468069, 465790, 498448, 528175, 557543, 550178, 522258, 498230, 510615, 543007, 584118, 570650, 473756, 452127, 493767, 469135, 416819, 419535, 449015, 527770, 550776, 535970, 544767, 541551, 485344, 393920, 386366, 368624, 318801, 312168, 313117, 336452, 266425, 243040, 244826, 279558, 248276, 239592, 270944, 293719, 316270, 275753, 244839, 268154, 284215, 211926, 213224, 213388, 229972, 253135, 326618, 318819, 324735, 357793, 339109, 305781, 282798, 237056, 164388, 176687, 229135, 253976, 223694, 178691, 138927, 149882, 206715, 203521, 203099, 243392, 308176, 305711, 246814, 143422, 161445, 203879, 167345, 172836, 154538, 194566, 162039, 87963, 132002, 139724, 84672, 77621, 76341, 70733, 100803, 149145, 182509, 174557, 126671, 134875, 134911, 134466, 147180]
17946A47180K190K7025k6735k8910P320J0534P8055L0722j2370p5468j5813K2620
17934A66350R263N637L1182J0052m2063k2146j570k5248L6070N2J0414K5888K4323
17921B28204M5995j3445p6201l3360l8809m9960J5835J270k7093J4757R5893K5001
17909A88087J3282j2895j1420j5319M503n0059r709J9327N645K2645K983l8186
17897A18884n2343l1879j1010L0106M0598J924J11665J3373q2570j497l8907l0119
17885F8225k8792M0269j4018J0576M3660K0468J0642J3674K602J7488L627k6958
17873A61463k4118m5117m3346j6074j773M3473K2557l6601j9347J9297m5086L3179
17861D8507M2612l7608k5468j1836p749p304P0971L2873Q614M086k0676M5644
$$ y = [147180, 149370, 176395, 149660, 120750, 128070, 138604, 216659, 247381, 235011, 159543, 143730, 166350, 175613, 181250, 212432, 222484, 180421, 158275, 156705, 131457, 167527, 167579, 177993, 203881, 228204, 274199, 260754, 184553, 151193, 112384, 62424, 78259, 79529, 52436, 67193, 163086, 188087, 201369, 188474, 177054, 161735, 166238, 116179, 106470, 125797, 131442, 154087, 157070, 118884, 66541, 34662, 23652, 53758, 94356, 96280, 207945, 221318, 138748, 137251, 98344, 68225, 39433, 79702, 65684, 76260, 119920, 140388, 151030, 164704, 167306, 184794, 188421, 161463, 137345, 92228, 48882, 32808, 31035, 74508, 97065, 60464, 41117, 60414, 15328, 48507, 91119, 53511, 28043, 16207, 8458, 1154, 72125, 104998, 113612, 117698, 97022, 142666]
17849A42666L3436k2086J6267r773k5729n5204l7801L9319L7264o81Q969M2094
17837A68741J7736k3592l2213L2827N655J863L3778k1940p803k3844o5656K6068
17825A11620K7088l589J6530p157o5349k1243m1506L8037Q1353K8512j3373j04258
17813D6665l7946K5125Q4174j956j4338j6622k4958K411k3129K0267K2356J709
17801H3758o4557o9243Q0685L8304k3936n02K7604j6939m868L4965j6563r6529
17789b7821j0643j3894Q305N0409M9480L0447n4334l1103K6858M2804m0237n3493
17777b3222M2181p032k460N5923J4379J9476K644R340o139K842k1046q98k7047
17764E8941k7067j6606J1184N6015J9909k6725r210l2254M819N6743M6301R225
$$ y = [142666, 176102, 154016, 170283, 160510, 134781, 79577, 41776, 81095, 118359, 117678, 126647, 168741, 186477, 162885, 130672, 163499, 169154, 171017, 204795, 182855, 175052, 151208, 85552, 111620, 138708, 135119, 151649, 144492, 79143, 57900, 16394, 54431, 135784, 164296, 150923, 46665, 8719, 33844, 118018, 116062, 101724, 85102, 60144, 62555, 39426, 59693, 82049, 83758, 19201, -50042, 30643, 68947, 45011, 44509, 72113, 55174, 50306, 85271, 68708, -27821, -38464, -52358, -44053, 6356, 55836, 86283, 31949, 846, 27704, 70508, 30271, -23222, 18959, 11927, 9467, 65390, 79769, 99245, 101889, 111229, 105090, 107932, 86886, 85988, 58941, 31874, 15268, 26452, 82467, 102376, 75651, 66441, 34187, 39006, 95749, 142050, 151275]
17752A51275l4253j8921m1114Q977L5638n1997o6864O8643M8958k2165k5511M3285
17740I5951m5568j3577N5342J4684N1530K8881p538J8499K6049J7708k6289l5277
17728A80395j2200M3808N160j9648K262N4442K6586K7966l795k4399l1784n4224
17716A94569l0765L454L6112J4809K4053L0586k9880k1746M4964K5557m6492r93
17704B44228O4453N952k6779j5002o911n645Q863P1680J3619K914K3628l6119
17692C44881j6725K2457M9379M5174m3911j8523O8664K1699M3908P3326P3684
17681F64013P0499L9607O6173P715J7501j0642J8400N9265Q3167J92364J63087
17670A371149R8387Q9205J64094J90460L04736L37987L42703M95142P18078R55850
$$ y = [151275, 117022, 98101, 56987, 65964, 101602, 49605, -17259, 51384, 100342, 78177, 52666, 95951, 50383, 36806, 92148, 106832, 158362, 187243, 179705, 198204, 224253, 241961, 215672, 180395, 168195, 212003, 217163, 197515, 199777, 254219, 280805, 308771, 304976, 280577, 248793, 194569, 163804, 167258, 203370, 218179, 242232, 272818, 242938, 221192, 266156, 291713, 245221, 244228, 308681, 314633, 287854, 272852, 265941, 260296, 269159, 340839, 354458, 357372, 381000, 344881, 328156, 350613, 399992, 445166, 401255, 382732, 451396, 473095, 517003, 590329, 664013, 734512, 774119, 840292, 848007, 865508, 854866, 873266, 932531, 1015698, 1208062, 1371149, 1469536, 1558741, 1722835, 1913295, 2218031, 2556018, 2898721, 3393863, 4111941, 5067791]
17660E067791J144077J373723J696572K115810K937597M574618O562496P708475
17652C3181159P163780M980241m26189q025061j0945191q321173m677922k432858
17644A0496786j164219m43322N0187M68412R39145J453826K122376K820845L543923
17635B0287959M689865O743625J0160740J3901877J5622688J4098048Q795853
17628I4300655l243092j7327975k0552922j4423534p143143j760825J442823K459449
17620C3751436K131435p1163n181812p986568n756202l106581j571672o69414
17612A1539459p0181K75580P69053J144840J654371K274362K914220L738595M798673
17603B9038972O612349J0066910J4906617J8237462J7778136J5265360O299803
$$ y = [5067791, 6211868, 7585591, 9282163, 11397973, 14335570, 18910188, 25472684, 33181159, 40344939, 45325180, 44898991, 36873930, 25928739, 17607566, 12929644, 10496786, 9332567, 8889245, 8939432, 9407844, 10346989, 11800815, 13923191, 16744036, 20287959, 24977824, 31721449, 41882189, 55784066, 71406754, 85504802, 94300655, 91057563, 73729588, 53176666, 38753132, 31609989, 29849164, 31291987, 33751436, 35882871, 35811708, 30629896, 22643328, 16887126, 13780545, 12208873, 11539459, 11469278, 11744858, 12513911, 13658751, 15313122, 17587484, 20501704, 24240299, 29038972, 35651321, 45718231, 60624848, 78862310, 96640446, 111905806, 118205609]
17596A18205609j1261826j9138211j2337230n555508j879247J622546M205842
17589G3861975N872547M310702j300579k537808Q98108K706311J164764j485421
17581H3490599k489685j202459l257699r289776r598513n360271k370328k328038
17573D7593830m271358m343192k872377j302989L92636J362444J733238K67296
17565C8559528k617597k616805q45713J86983j05244j410742j916224j274343
17557B7959843j893659l619780l277161k001304j334606j780592k677714k474783
17549H900244j669163j118351q32582n92702l97499k94971j87020j96775k37629
17540C373552j23636j35483k02207k84249k38127j75150k41353j39057o5384j8618
$$ y = [118205609, 106943783, 87805572, 75468342, 69912834, 68033587, 69656133, 73861975, 79734522, 84045224, 82744645, 80206837, 81104945, 83811256, 84976020, 83490599, 81000914, 79798455, 76540756, 67250980, 57652467, 52292196, 49921868, 47593830, 43322472, 38979280, 36106903, 34803914, 35196550, 36558994, 38292232, 38559528, 35941931, 33325126, 32479413, 32666396, 32561152, 31150410, 29234186, 27959843, 26066184, 22446404, 19169243, 17167939, 15833333, 14052741, 11375027, 8900244, 7231081, 6112730, 5280148, 4687446, 4289947, 3994976, 3807956, 3611181, 3373552, 3249916, 3114433, 2912226, 2627977, 2389850, 2214700, 1973347, 1834290, 1768906, 1750288]
17530A750288K9898o8375m4531k12986j26839m8827m3572j15937k5838m931r7076
17519I91274j28690q685J3539O7495k7041p1333l5521K4601K3088K605k1123j6130
17507H14079j1369j1004o647m4008O485O327k1894j0061j1673r9839m9070k8612
17495E32714k7430K1849k485j3160J5279m0412n9570n4826r778K0216j666M7629
17483D28360N1878j6514k0108k8870p0881K4058K1167j3902k981M0850L0343j7888
17471D25512K3601l5725m5643j1800M3274K1941K4956L830J9241j32l9656m6170
17459C83229p930J5559q643J6009M675M5676M5582J5031J5723P7355Q7081P1957
17447G61304M581m9409J4321J08109R7006J00657N9719j1314j85033k34544j17505
$$ y = [1750288, 1780186, 1711811, 1667280, 1454294, 1327455, 1278628, 1235056, 1119119, 1093281, 1088350, 991274, 862584, 853899, 867438, 934933, 907892, 836559, 801038, 825639, 848727, 851332, 830209, 814079, 802710, 791706, 785059, 741051, 747536, 753863, 731969, 721908, 710235, 610396, 561326, 532714, 505284, 527133, 524648, 511488, 526767, 486355, 426785, 371959, 362181, 382397, 380731, 428360, 480238, 463724, 443616, 414746, 343865, 367923, 389090, 375188, 372207, 413057, 443400, 425512, 449113, 413388, 367745, 355945, 399219, 421160, 446116, 449946, 469187, 469055, 429399, 383229, 375299, 390858, 382215, 398224, 402899, 448575, 494157, 509188, 524911, 602266, 689347, 761304, 765885, 716476, 730797, 838906, 935912, 1036569, 1096288, 1084974, 899941, 665397, 547892]
17436E47892o8281j5169k2184j6972J5408K8228P5320J31137J30896k4043j4973
17425G67259K8042k7429p0018j14727m9676j0415m5277q1517r8496r7014N382
17414B06114L223J1006m850o2166j2330K0526j7461M6011J3922n294J5487N1088
17402B65276J2828m4979k4232l0101l2458R311K6185J6544J8049j5241r8646p260
17390I5276J9793K5870k7184N7973R8802M4171j1432o1425k7164j1049L988R296
17378B16915M1755J1267q08K9446J9330l9055n1628R120l7566J775K0654K0531
17366B41736K0992N2380R7506Q1199L2920P417k2261l7022O1012L1984k7808l9306
17354E00749n6386m6042o6678p9356r870j9028K7434k4409k4735M4589j4803J7619
$$ y = [547892, 479611, 464442, 442258, 425286, 440694, 468922, 544242, 675379, 806275, 782232, 767259, 795301, 767872, 697854, 583127, 533451, 523036, 477759, 396242, 297746, 200732, 206114, 209337, 220343, 215493, 153327, 140997, 161523, 144062, 190073, 203995, 198701, 214188, 265276, 278104, 233125, 208893, 178792, 146334, 155645, 181830, 198374, 216423, 201182, 102536, 95276, 115069, 140939, 113755, 171728, 270530, 314701, 303269, 241844, 214680, 203631, 207619, 216915, 258670, 269937, 269129, 298575, 317905, 278850, 227222, 236342, 198776, 200551, 221205, 241736, 262728, 315108, 412614, 493813, 526733, 534150, 511889, 474867, 535879, 567863, 540055, 500749, 444363, 398321, 331643, 252287, 242417, 223389, 250823, 226414, 201679, 246268, 231465, 249084]
17342B49084N3454p7134l7556N3125O1482N2311M5116p964k0491k0646k6742k4640
17330B99399o6661J0920j4423k0717L1999K2098l2388k2591l5305j5052M6832
17319B04111l815n0014l6109J0855N1662M3958K4003M0424m7329r4529p8965l6209
17307B8043l6079J9119k6822L4476k0940N488O9170k4594m7953M6181k6416M8838
17295F8511J19218J3741l0950m4144p61K196k833n81J2991K8019k0640k319l0775
17282A11673j4937O135L722J1998m732K0691k9711j1377M3632k3067j6994K9839
17270A26872k2376j3008K0220m2317M98j0700k0214J428k3477K2515O1657j8561
17258H2537m9127M5587O8857p9800l0942k6391o791N9959J3971n3574m4779j0284
$$ y = [249084, 302538, 225404, 187848, 240973, 302455, 354766, 399882, 391918, 371427, 350781, 324039, 299399, 232738, 243658, 229235, 208518, 240517, 262615, 230227, 207636, 172331, 157279, 204111, 200296, 150282, 114173, 125028, 176690, 220648, 244651, 285075, 237746, 143217, 64252, 28043, -8036, 11083, -15739, 18737, -2203, 3285, 72455, 47861, -92, 46089, 19673, 68511, 187729, 201470, 170520, 126376, 125615, 127811, 124978, 124397, 137388, 165407, 144767, 142448, 111673, 96736, 102871, 106593, 118591, 113859, 134550, 104839, 93462, 137094, 114027, 97033, 126872, 104496, 91488, 111708, 69391, 69889, 59189, 38975, 40403, 16926, 39441, 101098, 82537, 33410, 78997, 147854, 68054, 37112, 10721, 3930, 63889, 77860, 24286, -20493, -30777]
17246c0777L2064j8270k5295O5057P9589K506k7544k8944k357m2350M7389L8573
17234H9641k6127n6835N546P050M4988M5676l6048m7953N053M7448J7105k7965
17222F7579j9591J2417L6466o079k3680m0048m1058k4757n900J957J789P2494
17210C1589O2029l9471m0344J8405N339N5877M8593m4601l8182N07l3806k5880
17198E5M5067J6062R204p5843m951M2985J9815K5962k2344l0148J8075K7593O0143
17185A31675J0818n9414o7352L9170P2316J6718k5944J8931L7766k0133J9620
17174A74171l5896n5109j6724l330q0826l5829N9471L292o708j7896j1050O6006
17162C9572R4158O740n3694M7040J1119K6718k9186o9622n219L4403K8439n920
$$ y = [-30777, 1287, -16983, -42278, 22779, 102368, 104874, 77330, 48386, 46029, 3679, 51068, 89641, 63514, 6679, 12225, 19275, 64263, 109939, 73891, 25938, 30991, 78439, 95544, 67579, 47988, 60405, 96871, 90792, 67112, 27064, -13994, -38751, -44651, -42694, -40905, 31589, 93618, 54147, 13803, 32208, 37547, 93424, 142017, 97416, 59234, 59741, 25935, 55, 45122, 61184, 70388, -5455, -10406, 32579, 52394, 78356, 56012, 25864, 43939, 71532, 131675, 142493, 83079, 15727, 54897, 127213, 143931, 117987, 136918, 174684, 154551, 174171, 138275, 83166, 66442, 63112, -17714, -53543, 5928, 9220, 2512, -15384, -26434, 39572, 133730, 140470, 86776, 133816, 144935, 171653, 142467, 72845, 67626, 102029, 130468, 124548]
17150A24548l0457l0178k4662K0289n6870j6128k2534k1399Q4757O7787J4493
17139A09646m5004p0664N7026j3647K1974L3224k7426J4453L0996j5127o65L4437
17127A29223L763j9070k2143N360j4541J2194J8638n4813K8201N4056J31952R8727
17115C71547L0311m5838k1738j24456q6074q7662K9717J07764j3368k8301p5592
17104E6310M005L4994J7232m2756q192N1311K7511L4042R234N6035Q1092L7345
17092C58163L917n6168J5939K6288j3582n1865K1591N1153P6489L2751m5367j03457
17080C15852p2297o1054l3095j2426r932j2252M3097j6480q243p043L8078O0844
17068B25049r458N8303J05868O6580K1779O2681R994N6121O4340l4033o5721p3370
$$ y = [124548, 94091, 63913, 39251, 59540, 2670, -13458, -35992, -57391, 27366, 95153, 109646, 64642, -6022, 51004, 37357, 59331, 92555, 65129, 79582, 110578, 95451, 94786, 129223, 132986, 113916, 91773, 97133, 82592, 94786, 113424, 58611, 86812, 140868, 272820, 371547, 401858, 356020, 334282, 209826, 123752, 36090, 65807, 173571, 160203, 131902, 56310, 60315, 95309, 112541, 69785, 61593, 112904, 140415, 174457, 183691, 239726, 320818, 358163, 362080, 305912, 321851, 348139, 334557, 282692, 304283, 355436, 431925, 464676, 419309, 315852, 243555, 182501, 149406, 136980, 127048, 114796, 157893, 141413, 133170, 126127, 164205, 225049, 215591, 273894, 379762, 446342, 468121, 530802, 540796, 596917, 661257, 627224, 561503, 488133]
17056D88133q9036q5555j3167l8186j8070o08K6195p07o4906J0341R8809j3401
17044B99842l0299O5793O8299K4558p9560l6452l7564K824M5921Q157k9339l5880
17032B66300J8725n9497q5069k3929J844k3064m8848j7620n8964l7624K9966M6544
17020H764L4648j1489m967R791l4019L5895j4296l0406K1096L5035J8514L7233
17008A05799j2966l2830m2858l8890j4182J9317L7809J9466K7821j1670o0966
16997d150J2401L9181l1519m2244L6652O0803O0946N829O604n4900n3858L295
16985C9040K7557P6138r544j59165m4037j477J1924J4504l2706L0344P2676J1758
16973C7012j295j3784J1130L3677k6218j2758J7523l7475j4602n433l1525m8572
$$ y = [488133, 399097, 313542, 300375, 262189, 244119, 243511, 269706, 268999, 204093, 214434, 313243, 299842, 269543, 335336, 403635, 428193, 348633, 312181, 274617, 277441, 323362, 331519, 302180, 266300, 285025, 225528, 140459, 116530, 118374, 95310, 46462, 28842, -30122, -67746, -37780, 8764, 43412, 31923, 26956, 36747, 2728, 38623, 24327, -6079, 15017, 50052, 68566, 105799, 92833, 60003, 17145, -21745, -35927, -16610, 21199, 40665, 68486, 56816, -4150, 8251, 47432, 15913, -26331, 10321, 71124, 132070, 137899, 144503, 89603, 35745, 39040, 66597, 142735, 133191, -25974, -70011, -71488, -59564, -45060, -77766, -47422, 25254, 37012, 35717, 21933, 33063, 66740, 40522, 27764, 45287, 7812, -6790, -12223, -43748, -92320]
16961i2320m508P1989N2380j8474j1666l3584q710n2111J2140O3714K5048L1752
16949C5650l7098j7411j4377K1146k8475l1584k4349O3782K3533P4002K15m4383
16937B0651k2534j1359O2400Q07k4047L2241j6373k7128N768l2204n0599O268
16925e6109L0996J3820K3867M1136j5125o2314n5391P8986L5272m6359r0389m7042
16913a48652M9510K9067J3562L4428O4044n2843n7481J7611n534J9591j0849N6035
16901H489M7244l8403m3859l0017o892K1171N9926NJ5580N3039q657j04967j2757
16888d0098L118N2057L676L2281P1809k4723m5299N2625j663n984M1443N22j2041
16875A27723l1837j8384M1251K6307p8287K732L8070K0480m9417j23229J8083
$$ y = [-92320, -96828, -24839, 27541, 9067, -2599, -36183, -44893, -97004, -84864, -21150, 3898, 35650, -1448, -18859, -33236, -12090, -40565, -72149, -96498, -32716, -9183, 64819, 65034, 20651, -1883, -13242, 49158, 49965, 25918, 58159, 41786, 14658, 20426, -11778, -62377, -56109, -25113, -11293, 12574, 53710, 38585, -23729, -79120, -134, 35138, -11221, -101610, -148652, -99142, -70075, -56513, -22085, 41959, -10884, -68365, -50754, -56288, -36697, -47546, 8489, 55733, 17330, -26529, -56546, -63438, -42267, 17659, 17664, 33244, 86283, 77626, -27341, -40098, -36980, 15077, 18753, 51034, 122843, 98120, 52821, 105446, 103783, 97799, 139242, 139764, 127723, 95886, 77502, 118753, 145060, 66773, 69505, 107575, 128055, 78638, -44591, -26508]
16864b6508j5182j9966J1392j5878k4885L8346Q7699j7281j411O4035m1040K860
16852D2181R908L2206L242k7425m0240p9662q0717k2930Q0517J06086K1184p654
16840C6696K0345p280k2397Q148j4952n925o273P36k4449M9320J8347M0611M8362
16827A41289Q669l3291K2086K730p0965m0816m1389K8591J6273r904L8841J878
16815F3992j510M9071j207r2922m6573K4660n0720j4499N255K1616Q271K9715
16803d851n1537m1233N417O0851J4678M4031L7630N135O923j3479k9695M6m0923
16790g007J05448N9625j0108l7631k4799r171K2579o5294n3132J3341K3101l7123
16778b0171j9794J866N1985l0452r807N1017j1378O490L3474j3498J418p6483
$$ y = [-26508, -41690, -61656, -50264, -66142, -91027, -52681, 35018, 17737, 16326, 80361, 39321, 42181, 52089, 84295, 87537, 60112, 19872, -59790, -140507, -163437, -82920, 23166, 44350, 36696, 57041, 49761, 27364, 35512, 20560, 14635, 8362, 9098, -15351, 33969, 52316, 92927, 141289, 149958, 116667, 138753, 141483, 70518, 29702, -11687, 16904, 33177, 23273, 62114, 63992, 62482, 111553, 110346, 17424, -29149, -4489, -55209, -69708, -64453, -42837, -34566, -4851, -56388, -97621, -92204, -31353, -16675, 27356, 64986, 70121, 77044, 63565, 33870, 33916, -7007, 98441, 158066, 147958, 110327, 85528, 76357, 98936, 33642, -19490, -6149, 16952, -20171, -39965, -38099, 13886, -16566, -26373, 24644, 13266, 19756, 53230, 39732, 41150, -35333]
16766c5333m2499n5528R258L9385P332K5444J2555r206k0990l7040M5315M8340
16754a2967j7416O9920j8733k1201L8499K2108q4381q2288Q451L3757L87n1919
16742a15783m2768O1377M4422j6306m445J323N8198M2356l9733M76M0302l2480
16730c061k4423l7975L0758L0481J7945M0167r224l8556m329l4826n6779K5954
16718f3868M9864q831l6N1963R679n731P690j5275n072J8961j6526k3203k0788
16705b1173j8234L4387k5734p2195k7640L8680j7105L1828q926k1486M794L2403
16693g0401M2636l6794m3509L6241L9941m5067l1834j1068J5918M9965K8991l3486
16681e8467l2134j6478M3223N3753j2448L4835Q750N047J596m407n6574J4552
$$ y = [-35333, -77832, -133360, -124102, -84717, -77385, -51941, -39386, -48592, -69582, -106622, -61307, -12967, -30383, 39537, 20804, -397, 38102, 60210, -24171, -106459, -98008, -64251, -63864, -115783, -158551, -97174, -52752, -69058, -73503, -72180, -13982, 28374, -11359, -10883, 29419, -3061, -27484, -65459, -34701, -4220, 13725, 53892, 44668, 6112, 1783, -33043, -89822, -63868, -14004, -22835, -22871, 29092, 38771, 33040, 40730, 25455, 20383, 39344, 22818, -385, -21173, -39407, -5020, -30754, -102949, -130589, -91909, -109014, -77186, -86112, -107598, -102804, -70401, -27765, -64559, -108068, -71827, -31886, -76953, -108787, -119855, -103937, -53972, -24981, -58467, -90601, -107079, -63856, -10103, -22551, 12284, 21034, 26081, 27677, 23270, -33304, -18752]
16669a8752J2086O5793J8964n4149o2667n1698L1508L7534j4166j8853M0394O0839
16657D6833k6494r25N3232k3890q7991k7500r040K3661K1899O3766l4878P3343
16645G2016n634l4347L0281J3639J2926l6450k5094m8928k3137l5909J1364k4437
16633i3710j223M0975J1590N9184K0709n429m6215R421Q7592L6805k6247K3059
16621A16511p6209m5725l6315K1788l9041j1531L5151j0431J9240p2799l6548
16610a35909M8718K9260k6704n4717J1918N2826K4521l350N7841N4590o2137q7269
16598i0412o072P7460L3641N086k0575O573k2843l2588K5011J1824j5072K7541
16586d26N8985o535O579M1306m3363r677K9582j9428j8274j0485k0217m8650J038
$$ y = [-18752, -6666, 59127, 78091, 23942, -38725, -90423, -58915, -21381, -35547, -54400, -14006, 46833, 20339, 19414, 72646, 48756, -39235, -66735, -75775, -52114, -30215, 33551, -1327, 72016, 66382, 32035, 62316, 75955, 88881, 52431, 27337, -21591, -44728, -80637, -69273, -93710, -94933, -53958, -42368, 16816, 37525, 32096, -14119, -4698, 82894, 119699, 93452, 116511, 40302, -5423, -41738, -19950, -58991, -70522, -35371, -45802, -26562, -99361, -135909, -87191, -57931, -84635, -139352, -127434, -74608, -50087, -53437, 4404, 58994, -3143, -90412, -96484, -19024, 14617, 19703, -872, 5701, -17142, -49730, -24719, -12895, -27967, -426, 58559, 52024, 58603, 99909, 56546, 46869, 76451, 57023, 38749, 28264, 8047, -40603, -39565]
16573c9565o427M5178L7761n3560k5785J2819m477l438l0741k9554j1561K4313
16561h5037q425P4824L926J0237J8181L8522L898j6028J6013M4487k5757o889
16549F7952m0309Q629O8951R2031J6959k1549o4130p0980q7435l451K0408K4560
16537A1636o4881N464O333j8751J2141P504k9444l6379j1438M9613N3776k3493
16525c7919J4293L5987l5683j0632P633L1982l7660m4833J7563j9477L9027J5900
16513b3819l9861L3812L363J7159L6593l027l1732p686k2776M111N9570j0673
16501A5034K5662J3838n9257k2268j152o056Q954M738J3644M0911L0171m216q7071
16488b7068p3084J4892J4788J7492K2910R066n4701L6993J0296m5923j3263L0053
$$ y = [-39565, -45992, -814, 36947, -16613, -42398, -29579, -34056, -37494, -68235, -97789, -109350, -85037, -93462, -18638, -14712, -4475, 13706, 52228, 56126, 40098, 56111, 100598, 74841, 67952, 27643, 36272, 105223, 197254, 214213, 192664, 128534, 57554, -29881, -33332, -12924, 11636, -53245, -47781, -41448, -60199, -48058, -40554, -69998, -106377, -117815, -68202, -14426, -37919, -23626, 12361, -23322, -33954, -26321, 5661, -31999, -76832, -59269, -78746, -39719, -23819, -63680, -29868, -26505, -9346, 27247, 24220, -7512, -15198, -37974, -33863, 25707, 15034, 40696, 54534, -4723, -26991, -28143, -34199, -25245, -20507, -6863, 34048, 64219, 60003, -27068, -100152, -85260, -70472, -52980, -30070, -21004, -75705, -38712, -28416, -74339, -87602, -57549]
16476e7549J4094P2278N6414p9822o1201j7858m1234J4787P4671K0498L7643q180
16464B4541K3137O246k0767P354J6643p156o8616o0372j060J0063k2602k1470
16452a14059O8208K5076k8983m4417K0561P2466N1165K1825N581q252q148K6346
16440H7369J9488l0245r479j4809p2215l039m1199N8028J7481J0865p3723r91
16428e2469j549M472O1609j7544k8969l0808N5047m2641K071M9945J0329p911
16416A582l1709J1100J0572M3350j8934l1767J3273o236Q011L5151J07450j7892
16404A23951j05234l7030P2525j4264j0988l4607m9140J7823N1428L2664l3625
16393A3503k2343R120L5441K1753l2587p806K4369k0035m1899J7178l7605j495
$$ y = [-57549, -43455, 28823, 85237, 5415, -55786, -73644, -114878, -100091, -25420, -4922, 32721, 24541, 47678, 53924, 33157, 40511, 57154, 49998, -18618, -78990, -80050, -69987, -92589, -114059, -45851, -20775, -49758, -94175, -73614, -1148, 50017, 71842, 77423, 69171, 61023, 87369, 106857, 76612, 67133, 52324, -19891, -22930, -64129, -6101, 11380, 22245, -51478, -52469, -54018, -49546, 12063, -5481, -34450, -65258, -10211, -52852, -50781, -836, 9493, 1582, -30127, -19027, -8455, 34895, 15961, -15806, -2533, -8769, -758, 34393, 141843, 123951, 18717, -18313, 54212, 39948, 28960, -5647, -54787, -36964, 14464, 47128, 13503, -8840, 280, 35721, 57474, 24887, 17081, 41450, 21415, -20484, -3306, -40911, -42406]
16381d2406K5942m523n217m0895m6891J2342N8576K6910j2828N403j0583P3914
16369C9744q578O2461K8356n9313q3716k8985O2182n805k1721m3613J3015K6410
16357a9563n683K2224l375j4018k6383j8614j9151L1526Q6866K2751m2370o0884
16345d6674m4003r53L4245O495O2938J8702p2833p0435K2031J7398K4693N8506
16333A0110Q308k2988J7952L99p292m1388R19L9134O1031n087l7007K224P5639
16320A01954l9906p3075l3433k1079j7382N2286L3355n7305Q542N1421k2903j1299
16308b8824l2364l8337P414p273L0644P0802O481l6173n7022n6181L3240K0747
16296h6846P518N1211R728L9803L5910K0764r732m0192j6513J9555k5220L0316
$$ y = [-42406, -16464, -20987, -26204, -67099, -113990, -101648, -43072, -16162, -28990, -23587, -34170, 39744, 31166, 93627, 121983, 62670, -21046, -50031, 12151, 6346, -15375, -58988, -45973, -19563, -25246, -3022, -6397, -20415, -46798, -65412, -84563, -53037, 33829, 56580, 14210, -46674, -90677, -91630, -57385, -50890, 12048, 30750, -42083, -112518, -90487, -73089, -48396, 10110, 18418, -4570, 13382, 13781, 6489, -34899, -33980, 5154, 66185, 61098, 24091, 26315, 101954, 62048, -11027, -44460, -65539, -82921, -30635, 2720, -54585, -46043, 5378, -17525, -28824, -61188, -99525, -92111, -99384, -68740, 2062, 8543, -27630, -84652, -140833, -107593, -86846, -79328, -28117, -18389, 21414, 57324, 78088, 68356, 28164, 11651, 31206, 5986, 36302]
16284C6302k4708J464N1669k8189q4841J8162j7852k7659r886K5395N1029R5l7020
16271d6039J4177L1746J0107K8611l1248k3035K3540K492n2875j0974N6415L665
16259F582o0100j0562N0616k737k4017K1306M0714K8928k4776p948m7419O263
16247b3150K0756Q2823M721n4856j12819m5485J628N07j1842J8707J2685j5189
16235a21514J6476L1702N9944j9034K4755n9601n1169P970L9748L9694M8365l5353
16223a8017n6609j4398J9353o207N8757n749K4754M7421K6313O243m42m6911J4700
16210D9208J3998p3777l3520K2104M9037n4156P413K236R965n7792P565O2853
16198E134m0109M5767n2016m8682N0972l5262M9145L7518m3260L4542k2564O713
$$ y = [36302, 11594, 13058, 64727, 36538, -48303, -30141, -47993, -75652, -85538, -60143, -9114, -9019, -46039, -31862, -116, 9991, 38602, 7354, -15681, 7859, 10351, -42524, -53498, 2917, 6582, -53518, -64080, -13464, -16201, -40218, -18912, 21802, 50730, 25954, 18006, -29413, -23150, -2394, 80429, 85150, 30294, -82525, -128010, -126382, -125875, -137717, -119010, -106325, -121514, -105038, -73336, -13392, -32426, -7671, -67272, -118441, -110471, -70723, -31029, 17336, -18017, -74626, -89024, -69671, -75878, -17121, -22870, 1884, 49305, 75618, 81861, 81419, 34508, 49208, 63206, -10571, -44091, -21987, 27050, -27106, -19693, -17457, -7492, -65284, -57719, 5134, -34975, 10792, -41224, -89906, -38934, -74196, -25051, 12467, -30793, 3749, -18815, -12102]
16186a2102j8515j1545l8950L1914N6283M5982j05449p675O8990k7957K6481K1235
16174B8692M5773J5987o147J23j8966j8446m0990p1199P3784L2532j7404j2598
16162A1141K5439k4485m4924m0697L9871L1242p667p0523k5212N7086p640K0049
16150c6320P6660m5108k8603m33P033M0022J6533o9567l0604L1187M7084q835
16138i51j7537j1767p9197L7576J1259k8560L6754N3199q314j9857P0460M5595
16126H8660l1188m7747j2659M2645j308m0233N0016k2548p5841n3790J4278N2030
16114c7685M8676Q802r332j9702K4882j857j2053k3537K7485L9433j4171j3426
16102A7515K9070l1709m7514L3379M8845j9051q9657l6656M2509J8253P8388J0541
$$ y = [-12102, -30617, -42162, -81112, -49198, 7085, 53067, -52382, -60057, 8933, -19024, 7457, 28692, 74465, 90452, 84305, 84428, 65462, 47016, 6026, -65173, 8611, 41143, 23739, 11141, 36580, 12095, -32829, -73526, -33655, -2413, -10080, -80603, -105815, -48729, -56369, -36320, 40340, -4768, -33371, -33804, -26771, 13251, 29784, -39783, -70387, -39200, 7884, -951, -18488, -30255, -109452, -71876, -60617, -89177, -52423, 776, -7538, -27395, 43065, 88660, 57472, 9725, -2934, 39711, 38403, -1830, 48186, 25638, -50203, -103993, -89715, -37685, 10991, 19793, 10461, -9241, 15641, 13784, 1731, -21806, 5679, 45112, 30941, 17515, 46585, 14876, -32638, 741, 49586, 30535, -59122, -95778, -53269, -35016, 43372, 53913]
16090E3913l5594j2940o088m3845p845o578J9440K3938p750K5136J6559P922j1138
16077A5130k8676K734n2773j0282N6365k2757l4618q156k8121K0527P8556N9854
16065D7783n3415n1273P1489K6662l2294n3564R083K9497J893l5697j2070q617
16053f0523q5137o7760P5624M8262k1793k437L2848P3228K728O6728K7766m9313
16041D0221l4286n8146l2949J5927J10777O1785k6476K256q401n1932m118M2663
16029E7321n362l4457j5910K7419k2301p813K3803P111j4678j6255o104j4162
16017b1388L455l3601L5541O5833k217l0990J1043k0009j6487N1355k1434p4667
16005e3566R366L50M0061K7118j0495R199j7364M731l3822j3447K9105n7683L5339
$$ y = [53913, 18319, 5379, -709, -44554, -52399, -58977, -39537, -15599, -23349, 1787, 18346, 26268, 15130, -13546, -10812, -63585, -73867, -17502, -40259, -74877, -83033, -111154, -90627, -12071, 47783, -5632, -56905, 14584, 41246, 8952, -44612, -35529, -6032, -4139, -39836, -51906, -60523, -145660, -213420, -137796, -89534, -111327, -113764, -80916, -7688, -4960, 61768, 89534, 40221, 5935, -52211, -85160, -69233, 41544, 103329, 76853, 79109, 70708, 18776, 14658, 57321, 51959, 17502, 1592, 29011, 6710, -1103, 22700, 29811, 15133, -1122, -7226, -21388, -17933, -51534, -15993, 49840, 47623, 16633, 27676, 7667, -8820, 42535, 21101, -53566, -44200, -43850, -3789, 23329, 12834, 22033, 4669, 9400, -24422, -37869, -8764, -66447, -31108]
15992c1108M6567N499L3880K1401l2743o3423J7844Q25j2592N291r864M048O4261
15979D9886k5874K392J7362k9922p1752k0559J0283Q387J8844N5170n771M231
15967A2677j618K4195j8247j1509J3572k1363O4087k8212l4684k056K5785L2423
15955E5050J5973K5336l1981j25754o4875R4140M2920Q169l3093k5131l2682K0150
15943e1778K6266j6138r569R515k933k4887N9668O7509k6784n8002P813P620M7801
15930C6101n00Q9370k9747j4558k441j3177n2164K9499P334o5134K7549L2277
15918D4409n9615J8307N1112J8596o057k6453L26o0871J109K3206p278j6585k6677
15905d6471j1901p882N574J689M4091k6237L7801K0364k2936J6171J5273j0890
$$ y = [-31108, 15459, 20958, 54838, 76239, 43496, -19927, -2083, -1258, -13850, -8559, -18423, -14375, 49886, 24012, 26404, 43766, 13844, -57908, -78467, -68184, -59797, -40953, 14217, 8446, 12677, 11059, 35254, 17007, 5498, 19070, -2293, 61794, 33582, -1102, -3158, 22627, 55050, 71023, 96359, 64378, -61376, -126251, -32111, 10809, 18978, -14115, -39246, -71928, -51778, -25512, -41650, -51219, -41704, -44637, -69524, -9856, 57653, 30869, -27133, -19320, -11700, 36101, 35601, 124971, 95224, 80666, 78225, 65048, 12884, 42383, 49717, -15417, 12132, 44409, -15206, 3101, 54213, 72809, 66752, 40299, 40625, -20246, -19137, 4069, -3209, -19794, -46471, -58372, -66254, -60680, -58991, -14900, -41137, -3336, 17028, -5908, 10263, 25536, 14646]
15893A4646m6550L2868j9108J767Q2380j6230m349K628o5809l1668J2548L9241
15881B364M407J3731j9919j0981o0M809K8025J293J1815K2342k5979l1884M4470
15868D4433k1127p1394N3652Q7324n1177m5446M1515M0221k1426j3510l5629n5328
15856d7892K7989l5120J6553R4681O1548m4599l6060j4891m7403j6038J3449j3628
15844d1411L6660L0032m6241l064J00616L3312n4035m3356K0289M8271q7328m7276
15832e3531K2707J144P7766L0235l0153L633J8419L2719R244k5847n4043j03071
15820g0778J7091K4396M6686K8109l5142l2944J0523L0974k4575J826r134l5076
15808d8044K2249N2217K1788L8369K0841K7645l6190k7817n9232J2536m2809l2790
$$ y = [14646, -31904, 964, -18144, -16377, 66003, 49773, 45424, 48052, -17757, -49425, -36877, 2364, 6771, 20502, 583, -10398, -10458, -5649, 22376, 23669, 35484, 57826, 31847, -37, 44433, 23306, -48088, 5564, 92888, 41711, -3735, 37780, 78001, 56575, 43065, 7436, -47892, -19903, -55023, -38470, 56211, 117759, 73160, 37100, 22209, -25194, -41232, -27783, -41411, -4751, 25281, -20960, -24024, 76592, 109904, 55869, 12513, 32802, 81073, -6255, -53531, -30824, -29680, 48086, 78321, 48168, 51801, 70220, 102939, 112183, 86336, 32293, -70778, -53687, -29291, 17395, 45504, 10362, -22582, -12059, 18915, -5660, -3834, -12968, -48044, -25795, 26422, 48210, 86579, 107420, 135065, 98875, 71058, 11826, 24362, -18447, -51237]
15796e1237L9590P044l1557K0784M6102k4799J1707K6421L8746j5368r8471n4673
15784h5711K3542J3560N1220M9611N4585j4197k9677R317j7574n4735n7898o7096
15772a25053K2909R0214o966l4586m9084L726P1487J3740M4100j554m0626K3838
15760A2145K455k6348j0476l1178N329j9452J6354O047O185M038R23L4307J5752
15747A6081j9819J484j6067N136l6539Q136N0524l4517j0866m628K9854N2332
15735D1111k0207n8637Q586L0870L0719M5314l084m996k4991O1428L0885l9179
15723I7819l0510o4608j4985M2334n759l5828l9522n669J5709N915k0194K1902
15711c3396k8322L7874Q5205L7217l1116J8722N283l1301p0374K0941J0642l957
$$ y = [-51237, -11647, -4603, -36160, -15376, 30726, 5927, 17634, 44055, 82801, 67433, -31038, -85711, -62169, -48609, 2611, 52222, 106807, 92610, 62933, 72250, 54676, -59, -57957, -125053, -102144, -11930, -18896, -53482, -102566, -98840, -27353, -13613, 30487, 28933, -11693, 12145, 14600, -11748, -22224, -53402, -48073, -67525, -51171, -45124, -38939, -34901, -33978, 329, 16081, -3738, -2254, -18321, -13185, -49724, -41588, 8936, -25581, -36447, -41075, -11221, 41111, 20904, -37733, -29147, 1723, 32442, 77756, 74672, 69676, 44685, 106113, 136998, 97819, 67309, 2701, -12284, 30050, 24291, -11537, -51059, -56728, -41019, -35104, -55298, -33396, -61718, -23844, 61361, 98578, 67462, 86184, 91467, 60166, -10208, 10733, 21375, 17418]
15699A7418k1953p288j4998l833L8031M218J9216o7340p2598O634P1602N3522
15687B2631k0112l7277J0779J3180Q530j5614k3374J2547M8465n832j4008k10
15675b95L9195j353k2683L1673J8911Q311k8828o734M156L1826J2433l9079K740
15662E0273L3393j5905k1854M3310j3919J8149J2863m0677n0564r474m8420j1514
15650e4339R232N0319N4331L651q6408n8576M9079J429n513M9497J3649k3798
15638B553k1276m9187l5784L2772Q7565M8727p0703n9638J983P2848j959K4925
15626C2826k7127j4347J1166N648M1890l5167M8993p631l6083l8417m2297O2138
15614A592k7083L224P913J1113L0646L619R760M0325j8966o0839j1224K6840k0860
$$ y = [17418, -4535, -11823, -26821, -30654, 7377, 11595, 30811, -36529, -109127, -102493, -30891, 22631, 2519, -34758, -23979, -10799, -2269, -17883, -41257, -28710, 19755, 13923, -85, -295, 38900, 37547, 14864, 46537, 65448, 73759, 44931, 38197, 42353, 74179, 86612, 47533, 50273, 83666, 67761, 45907, 89217, 75298, 93447, 106310, 65633, 15069, 5595, -42825, -54339, -45107, 5212, 59543, 63194, -23214, -81790, -32711, -31282, -36795, 12702, 26351, 2553, -18723, -67910, -103694, -70922, 16643, 65370, -5333, -64971, -62988, 9860, 7901, 32826, 5699, -8648, 2518, 8166, 50056, 14889, 63882, 56251, 20168, -18249, -60546, 1592, -25491, -22267, -14354, -3241, 27405, 31024, 40784, 81109, 62143, 1304, -9920, 16920, -3940]
15601c940M8676P471o6516M3651j5403K809P13k4170k5671l1585k9781O4172P0991
15588D1417m3932q3592j8888M1643R1414M762o4565q161K3778K3738m7699l4073
15576g4158J3228N6559L4901k4480K4626q964p2149j3578K2306q267l4922L3870
15564e1028N2029J413K3970j9360l1945o99r664J9706j8585j7332O0966P1703
15552H1174K4269k7324j4343n1333j8971j3654k7771L2840L4153R257j2476j6920
15540a099J401M289l694q062K7467q140k5533P213L9523N0483J7095j4199k038
15527H4706l0384j491M073j5563n3320m1461k2222K8111N2387M5888j073l7123
15515A2528l8171j7947l4886K2606m0443j9201K014L7965J0891M1121K5602l6774
$$ y = [-3940, 44736, 52207, -14309, 29342, 13939, 16748, 17461, -6709, -32380, -63965, -93746, -29574, 41417, -2515, -86107, -104995, -63352, 28062, 32824, -31741, -39902, -16124, 7614, -40085, -74158, -60930, -4371, 30530, 6050, 30676, 21712, -50437, -64015, -41709, -49976, -84898, -51028, 1001, 2414, 26384, 7024, -24921, -25620, -35284, -15578, -34163, -51495, 9471, 81174, 105443, 78119, 63776, 12443, -6528, -20182, -47953, -15113, 19040, 28297, 15821, -1099, 302, 4591, 897, -7165, 20302, 12162, -13371, -6158, 33365, 83848, 100943, 86744, 84706, 54322, 52831, 56904, 41341, -11979, -53440, -75662, -47551, 4836, 50724, 49651, 12528, -25643, -43590, -78476, -55870, -96313, -115514, -113500, -75535, -64644, -23523, 2079, -34695]
15503c4695j2247n9953k7252K3003L7805J0061L3104O7544L517N660l3255k4304
15491a1012J566j5859J2585q934k9378n229J2656l684L0877K2214L7453m1081
15479B174J3091l3685k160M6459k0592L5758M634n8034j5054M1318J4436k6490
15467A855J6204k9420K5805j0366j8822M7159l2748M498M4985L6920o432m3471
15455C6167n0107n3476o768m7484K9726R8543N3924n7079r177L6140J1633L6006
15443G8048J5561n3339r075J6287K195L377M7374j8052m7300O7063J0951n1210
15431F1880k0210j7321k9343M1766l1188m4305M8309j9639k1278j3175O0675L9166
15419E5337J867l661n757l0716l6947j220P859L9685P4525k2396K9735N7688j3854
$$ y = [-34695, -46942, -106895, -134147, -111144, -73339, -63278, -30174, 37370, 40887, 46547, 13292, -11012, -9446, -25305, -12720, -21654, -51032, -56261, -43605, -47289, -16412, 5802, 43255, 2174, 15265, -18420, -20580, 25879, 5287, 41045, 45679, -12355, -27409, 13909, 28345, 1855, 18059, -11361, 14444, 4078, -14744, 32415, -333, 4165, 49150, 86070, 79638, 36167, -13940, -67416, -74184, -121668, -91942, 6601, 60525, 3446, -5731, 30409, 42042, 78048, 93609, 40270, 31195, 47482, 49677, 53054, 100428, 82376, 35076, 102139, 113090, 61880, 41670, 24349, -4994, 36772, 5584, -38721, 9588, -10051, -31329, -44504, 16171, 55337, 57204, 53543, 47786, 17070, -19877, -21097, -13238, 26447, 100972, 78576, 108311, 165999, 152145]
15406A52145o5585q8775m0958O5939J172j3586k1856J2916k5959q8926K4419M7037
15394d2017Q415L9399M2755R346k2033k2199Q554l3726r645J6880m348l3774j1277
15381e3670k8193k8329J7752j6428J2834N7999O0281P42p502L7690o5654m6073
15369e8551k406K6394M3413K5970j8179k5087k6881L30N1759J5106P0407m448
15357I7827k2758K498l2780J2460O7210k1862n4636p2514n1592r332n816j5172
15345a06467K159j0249q642J9564O4184P495L9796j2130l816L2437r612l5983
15333b1264O296L8775J228M5394R3715j763p2891l1002m1683J7234l5368q191
15321i520o090q5090K0151O140L2980q495L1724N6302k6434l9198j4305J3579
$$ y = [152145, 86560, -2215, -43173, 22766, 23938, 10352, -11504, 1412, -24547, -113473, -89054, -42017, -33602, 5797, 48552, 57898, 35865, 13666, 22220, -11506, -21151, -4271, -8619, -42393, -53670, -81863, -110192, -92440, -108868, -96034, -38035, 22246, 22988, 15486, 53176, -12478, -58551, -60957, -34563, 8850, 34820, 16641, -8446, -35327, -34997, 16762, 31868, 102275, 97827, 75069, 77567, 44787, 57247, 124457, 102595, 47959, -24555, -76147, -85479, -91295, -106467, -104308, -114557, -123199, -103635, -39451, -31956, 7840, -4290, -8106, 24331, 14719, -21264, -14968, 23807, 25035, 70429, 164144, 162381, 89490, 58488, 16805, 34039, -1329, -9520, -15610, -100700, -80549, -74409, -41429, -49924, -18200, 38102, 11668, -27530, -41835, -28256]
15309b8256K9721q6598j4771N5972M1738J7249n8879j4840L5270N2409p961q0381
15297e9327k6857K7165k596o8279J9695L5874O5738l849P708p049l4891K1727
15285b4941p2639k462r843L5107K6055R5398P1204J8197l1070l3807m6842K0899
15273D5256K678m8331k3651J2605l9168P60K2951M1937Q30J4397N4121K8361l215
15260A09531m6676j1438J586l0838m5321K366K9494l6987m1883q185M5536N389
15248b7426J0052q740p9006n2147M1356O9812O809k5107M2946M0786N8618J3226
15236I1179l9812l8578j4757J2877J334K0388N9860l0298l2567J8303j49L473
15224E1253o663o9655M628Q924k5893j6181K1647M4499K6317k4712k9903K7820
$$ y = [-28256, 1465, -85133, -99904, -43932, -2194, 15055, -43824, -58664, -23394, 29015, 21054, -59327, -86184, -59019, -61615, -129894, -110199, -74325, -8587, -12436, -4728, -11777, -46668, -24941, -97580, -100042, -109885, -74778, -48723, 46675, 117879, 136076, 105006, 71199, 24357, 45256, 47934, -397, -24048, -11443, -50611, -49851, -26900, 15037, 15867, 30264, 84385, 112746, 109531, 62855, 51417, 53003, 22165, -23156, -20790, 8704, -28283, -70166, -78351, -32815, -27426, -17374, -26114, -105120, -157267, -115911, -46099, -39290, -64397, -21451, 19335, 77953, 91179, 51367, 12789, -1968, 10909, 12243, 32631, 92491, 62193, 29626, 47929, 47780, 51253, 44590, -25065, -20437, -11513, -37406, -53587, -31940, 12559, 38876, 14164, -15739, 12081]
15212A2081n3530n67P8555K6727j3070M7407m1538l3470K1593l682j5650m9436
15200b4580K2779N7444M7886o2780o3589Q432j5360j5604P2706L6400l8624j881
15188B3229r233m293L806J3380l2883M0436M5028m9957J4026N8171M4635k4586
15176A21759l4676j6566L6031J5938k0215q4825m9662l6248L0838M0238l8275
15165c5663m4487Q96P5964L2454k2187l8929P597o658j8337k864J4400L7255N2465
15152E1906N1804R620O57n3337o3049J6044j3335j1028J0717j4841O8201M7751
15140A01110k4092J0430J629l5023o7263o6225J546M8945J6190N1569K0148K7976
15128H6940m9995l7355k809J1433q393q742l7802j1578N0712j4482j4881j4243
$$ y = [12081, -41449, -42016, 36539, 63266, 50196, 97603, 56065, 22595, 44188, 40506, 24856, -24580, -1801, 55643, 103529, 40749, -22840, -14408, -29768, -45372, 27334, 63734, 25110, 23229, 13996, 9703, 13509, 26889, -5994, 34442, 79470, 29513, 43539, 101710, 146345, 121759, 87083, 70517, 106548, 122486, 102271, 17446, -32216, -68464, -37626, 2612, -35663, -80150, -79254, -3290, 29164, 6977, -31952, -24355, -31013, -49350, -52214, -37814, -559, 51906, 103710, 113330, 113987, 60650, -2399, 13645, 310, -10718, -1, -14842, 53359, 101110, 77018, 87448, 89077, 54054, -13209, -79434, -77888, -28943, -12753, 38816, 58964, 86940, 36945, -410, -3219, 8214, -179, -8921, -46723, -58301, -7589, -22071, -36952, -51195]
15116e1195l902n901j7607j3393M0810n6814M41k3016j1891K5545l7040M7178
15104a06785M6121K3937M373N2065J8903J043m0695j5458j8153n0997k4908R095
15092a01459K9752K8397L6657j3767j2571j9987l0430j8482N9681O1340j8215
15081I16k1741L2677L5627K4078r004o1474j057L5871p5745K4303R4628J8583
15069I7662p4602l4111M5738K5226p399m6006n6197O248K8483J4738K4639o1237
15057c6818l0811L4978J0213k0789M198P713m5826j0339J4225j4890n868L789
15045i0225P4914L7051L2108k9710j1931l8066P0120L2545r835j6474P666M1989
15033A00152K975j9282j2392n4145l8738M1095J3446l9713k3591k65m3253Q185
$$ y = [-51195, -55097, -60998, -78605, -91998, -51188, -108002, -107561, -130577, -142468, -116923, -153963, -106785, -60664, -36727, -32354, 19711, 38614, 39657, -1038, -16496, -34649, -85646, -110554, -101459, -71707, -43310, -6653, -20420, -32991, -52978, -83408, -101890, -42209, 19131, 916, -20825, 11852, 47479, 71557, 62553, 1079, 22, 35893, -39852, -15549, 79079, 97662, 23060, -11051, 34687, 59913, 52514, 6508, -49689, -43441, -14958, -220, 24419, -36818, -67629, -32651, -22438, -43227, -39029, -31316, -77142, -87481, -73256, -88146, -94014, -90225, -15311, 21740, 53848, 24138, 12207, -25859, 44261, 76806, 66971, 50497, 58163, 100152, 103127, 83845, 71453, 17308, -21430, 19665, 33111, -6602, -30193, -30458, -73711, -65526]
15021f5526J4662L4185K5398k3978j40779o635M9762k2520K1015M0102N7999M1568
15009B5253k7869J3921j8746K7012O1510K623j2867J0751l1446k7374o121l4528
14997a7881L7072P9079m6133j3219o3259m4058k685k9442K3016O1695m6003j7418
14985g9236P628K20M6824J6471k6230l545j9371J2091J8632J9908j3093k5871
14973d5572J482L5338j5038l2924N649N9954L0548o487M4413M320o4140K8409
14961D5952j3661q1014K3965N0104M153k5532J0044K9998L1275k8687K7081M2798
14949A16476R6424k8258n1496r2473q6707l3512j9302J21172N7337m3541j0834
14938B5286K2849L941m9863k7480L886J3883J3089m61J5582L58o3115m0392L2875
$$ y = [-65526, -50864, -16679, 8719, -15259, -156038, -162673, -112911, -135431, -114416, -74314, -16315, 25253, -2616, 11305, -7441, 19571, 81081, 83704, 70837, 81588, 50142, 22768, 16647, -17881, 19191, 98270, 52137, 38918, -24341, -68399, -71084, -100526, -77510, -15815, -61818, -79236, -71608, -71388, -24564, -8093, -34323, -37868, -57239, -45148, -26516, -6608, -19701, -45572, -44090, -8752, -23790, -56714, -51065, 8889, 39437, 32950, 77363, 81683, 17543, 45952, 32291, -48723, -24758, 25346, 29499, 3967, 14011, 44009, 75284, 46597, 73678, 116476, 212900, 184642, 133146, 40673, -46034, -79546, -98848, 22324, 79661, 36120, 25286, 48135, 52076, 2213, -25267, -21381, -7498, 5591, 5130, 20712, 21070, -42045, -82437, -49562]
14925d9562l0656J1370k2087l852J00346J06551K5152j3732m7421k0015o3738
14914g644n2198q49N0269j2551j9641J1100R6443K4345l7418p718j6251l1214
14902c327o3127J2787M5956l7813k8949p948J6105m475j544N5275M0874m465l7119
14889a7770l1715J4429M3967k2693R800K6536j9648o8470J9800N8743j5134r3462
14877i5617r608M0400k3352K1415L0088N7656k0093n5645K351M9517Q171l5237
14865b9954j7541M8237p912J0808O0692K2297J944M398n7298j060j8122m5853
14853b9364o7171p329P396j2898p989n3260j216N4567O8422P2702j5980k4345
14841a6465M0943N895O921j582J0941K6288J0582j1407k7168n0233l1316l4493
$$ y = [-49562, -80218, -68848, -90935, -94787, 5559, 112110, 137262, 123530, 76109, 56094, -7644, -59842, -60691, -10422, -22973, -42614, -31514, 64929, 89274, 51856, 44138, 27887, -3327, -66454, -53667, -7711, -45524, -74473, -82421, -66316, -70791, -72335, -17060, 23814, 19349, -17770, -49485, -35056, 8911, -13782, -3982, 22554, 2906, -65564, -45764, 12979, -2155, -95617, -105225, -64825, -88177, -66762, -36674, 20982, 889, -54756, -52405, -2888, 5283, -29954, -47495, 742, -7170, 3638, 64330, 86627, 88571, 92969, 35671, 34611, 16489, -29364, -96535, -103864, -96468, -109366, -117355, -170615, -171831, -117264, -48842, 23860, 7880, -16465, 24478, 30373, 37294, 35712, 46653, 72941, 83523, 72116, 44948, -5285, -36601, -71094]
14829g1094M7578K1646N2033j3607l5469k9666O9150J543k727m1290k1700O6892
14817D3289L5505m9419k2450m0875l3361R539J6219O4254N7084j2435k1871o2493
14805a7014j0367J1481p749n841M223k8077m0429l2637R863K9670P4248L1277
14793A8648K223J5311L1960J3891l6058l7001K579K9746Q97j6089k2844k3814
14781b0551l9959l6407O095L4390K9798N5067k0779n4964l953j4090N864M4683
14769a4806L9888r606r842n4179q9126R661P9808K6228L8343L0842l8061j7665
14757h515j649Q452J4601J1250j3687K4481J149J055K5036J4941J637J0360N0814
14744A39925m215r7550k8194L402J778P924J9167N578L25n9726L3497M1088n3157
$$ y = [-71094, -23516, -1870, 50163, 36556, 1087, -28579, 40571, 42114, 39387, -1903, -23603, 43289, 78794, 29375, 6925, -33950, -67311, -57772, -41553, 22701, 79785, 67350, 45479, -17014, -27381, -15900, -23649, -29490, -25267, -53344, -93773, -126410, -116547, -86877, -12629, 18648, 20871, 36182, 68142, 82033, 45975, 8974, 11553, 41299, 42196, 26107, 3263, -20551, -60510, -96917, -90822, -56432, -26634, 28433, 7654, -47310, -51263, -65353, -59489, -14806, 25082, 15476, 5634, -48545, -137671, -128010, -48202, -21974, 16369, 47211, 9150, -8515, -10164, -1712, 12889, 24139, 10452, 34933, 36082, 37137, 62173, 77114, 78751, 89111, 139925, 135710, 38160, 9966, 13368, 15146, 23070, 42237, 47815, 48140, -11586, 21911, 62999, 9842]
14731I842k2185R109m6550m3626J1228j505k1198K4870r611R991J4081M2654M7094
14718B4194l90m3309m7146K6865J6127K3666O9326j4296p8151j8737J7988l2068
14706e5931J9739l019O126L5142Q4812K0997J0772k6054l3832J13194k7057q009
14694A36880q2825j8260k8645m3879n9197K4094L7156L7039P5693L8535l2985
14683H3606J8643N4831o6920n8954n1869J3931J9395L1239J7700L8131j9813k0863
14671E9057K0062m9283J3216M1299p2008l3671J9826M5944j1954l9239k1857m4756
14659g3364j3690J8368K4259j5916K3589j8971n8267O2573N1008Q090j2511k7472
14647c2304l7375J7707J710k4174j979l4729n1158J9991N3557k2560m995M5935
$$ y = [9842, -12343, -3234, -49784, -93410, -82182, -83687, -104885, -80015, -89626, -79635, -65554, -22900, 24194, 23804, -19505, -66651, -39786, -23659, 7, 69333, 55037, -23114, -41851, -23863, -55931, -36192, -39211, -33085, 2057, 86869, 107866, 118638, 92584, 58752, 171946, 144889, 136880, 54055, 35795, 7150, -36729, -95926, -71832, -34676, 2363, 78056, 116591, 83606, 102249, 157080, 90160, 31206, -20663, -6732, 12663, 43902, 61602, 99733, 79920, 59057, 79119, 29836, 43052, 84351, 12343, -21328, -1502, 44442, 32488, -6751, -28608, -73364, -87054, -68686, -44427, -60343, -36754, -55725, -113992, -51419, -411, 7679, -4832, -32304, -69679, -51972, -50262, -74436, -76415, -111144, -162302, -142311, -88754, -111314, -116309, -70374]
14635g0374o157l1663q879J5405o922M7425O1249l4562l3279M5542M3896k0077
14623A604k5074M7420K6606k4155J9452m623p2897m5024L5186Q01L9629L341l7002
14610c4736n8188j3090m7336L6434M3545L0063J5181m8821P632N4509l071k7481
14598d5359K8240q435k2615M8495O1108j1563n0542j2670l9298N9795J7591o054
14586A8693J2001m0966M6023L2469K7861k728k8650o6579P76N1790Q632k9772
14574B9550j7658J6653R309j4577n2691l1862n4570j2230K4189J2755L4255o774
14562f3651n6561K3588J3410n7174N386M8031M6147N8309K3805L4833R747k1890
14550F3980l708N0529m7497m2858k0568K7339M1822M28j35145m3930N0401J5426
$$ y = [-70374, -76531, -108194, -117073, -101668, -108590, -61165, 84, -34478, -67757, -22215, 21681, 1604, -23470, 23950, 50556, 26401, 45853, 41230, -31667, -76691, -41505, -40704, -1075, 2266, -34736, -92924, -106014, -153350, -116916, -73371, -43308, -28127, -76948, -69316, -14807, -17878, -45359, -17119, -25554, -48169, 326, 61434, 49871, -671, -13341, -52639, 7156, 24747, 18693, 30694, -10272, 35751, 68220, 96081, 93353, 64703, -1876, -1100, 50690, 59322, 29550, 11892, 28545, 37854, 23277, -29414, -61276, -115846, -128076, -103887, -91132, -56877, -63651, -120212, -96624, -83214, -140388, -135002, -86971, -40824, 17485, 41290, 76123, 85870, 63980, 60272, 110801, 63304, 20446, -122, 27217, 69039, 69467, -65678, -109608, -59207, -43781]
14538d3781M4942L7761j2083n2633k8121r060K1572N109n531j0802R9520J8336
14526F5229k4571k0629m9038K148K7801n426L2951k3210l8340P4799J2978o9552
14514a4860o4428j7321k1017l843M7071j3234K9335J13k8374P182k789L8447K1428
14501b2290J1855L0972j8103k6823P8756J4720j4999m0503l6882j1839O406R803
14489a8927M6640K7206p663m8074k17O131q7304J8472J5735K6158K4960L9966
14477D3083O549l4076k3060N2830K6142L2730L8661n2893p6340l3032J8525N6550
14465E5669K2512k0175m4853L347k1542j3942L0540M099j6375m279l3847q80Q7056
14452D7330O0514q7971n0591p689r162O788j2311K1969O4331M9646p656j7619
$$ y = [-43781, 1161, 38922, 26839, -25794, -53915, -62975, -41403, -36294, -41825, -52627, 46893, 65229, 40658, 20029, -29009, -26861, 940, -4486, 28465, 5255, -33085, 41714, 54692, -14860, -79288, -96609, -117626, -121469, -74398, -87632, -58297, -58184, -86558, -79376, -82165, -43718, -22290, -10435, 20537, 2434, -24389, 54367, 69087, 54088, 13585, -23297, -35136, -28730, -18927, 27713, 54919, 47256, -818, -1035, 5096, -82208, -63736, -48001, -21843, 3117, 43083, 49632, 15556, -7504, 45326, 71468, 104198, 142859, 89966, 13626, -19406, -881, 55669, 78181, 58006, 13153, 16500, -5042, -18984, 11556, 15655, -720, -4999, -38846, -39726, 47330, 107844, 19873, -30718, -38407, -47569, -40781, -53092, -31123, 33208, 82854, 75198, 57579]
14440E7579l22l4896j9621n0611m2575M3616n315M6166J8970K1574K5003l214
14428E6354N6407L4090k8687n9469n3911K1092j9792J2480J6537l5784R966L798
14416A3081l0115m6792l0810j4149l4443M0619P5298j0407J493J8698j0762M6655
14404A8366K5011k8725R362k0631k7457L6063N3913J0651m9177m0415q2558j7621
14392a13218Q3279P2629p3507M24R259J3329Q128j2332J9808l602n1974o0396
14380a08173N3262J23730j425p451M5721J332k9924o2029n6165k2924Q8980L2174
14368E7108m5313o4705L1964N2949l2273q690j4147j7819M1961O5828k8644q6335
14356d8116J9496J6776M5673k6818p529M42K2655m0631J1769P1850J1002j7714
$$ y = [57579, 57257, 22361, 2740, -47871, -90446, -46830, -52145, -5979, 12991, 34565, 59568, 56354, 112761, 146851, 118164, 58695, 4784, 25876, 6084, 18564, 35101, -683, 9283, 13081, -17034, -63826, -94636, -108785, -143228, -102609, -27311, -37718, -36225, -17527, -28289, 18366, 43377, 14652, 24014, 3383, -24074, 11989, 65902, 76553, 27376, -13039, -95597, -113218, -29939, 42690, -30817, -30393, -21134, -7805, 323, -12009, 7799, 4197, -47777, -108173, -54911, 68819, 67394, 59943, 105664, 106996, 77072, 15043, -41122, -64046, 24934, 57108, 11795, -52910, -20946, 32003, -270, -8960, -23107, -40926, 1035, 66863, 38219, -48116, -28620, -11844, 33829, 7011, -518, -76, 22579, -18052, -6283, 65567, 76569, 58855]
14344E8855j7188l5314N9847M6949r6673m5737K7497N606M3380j9202m2221j234
14332a5435K3964K6142J7155J8931K3857n117J1162k5655l30J0859o0421n8773
14320c3661n3221o666J9562j4508l2968N1415L7712J3737K0405o864Q938k3161
14308a9280N540N2940l4851m1821J982j002r807o432m962L6520m206m7613L8190
14295c4802L8646J126p6981l7055L8481N5340K2161j1597j9470p661L7028L3982
14283C9198N420r76k7914j6583J228L5027R010p1719P357J613n709J3162k2731
14270c3617j9630j7480N1284J907q2815m9777j4292M7310P5455L560l2363K5317
14258d5141j3997J9691N3632j9036R273L5751J878j2485j5424M3732j013o680
$$ y = [58855, 41667, 6353, 66200, 113149, 16476, -29261, -1764, 3842, 47222, 28020, -14201, -15435, 8529, 34671, 51826, 70757, 94614, 89497, 100659, 75004, 74674, 85533, 25112, -33661, -86882, -93548, -73986, -88494, -121462, -70047, -32335, -18598, 1807, -5057, 3881, -19280, -13740, 39200, 4349, -37472, -35490, -36492, -46299, -52731, -57693, -21173, -25379, -72992, -34802, 3844, 4970, -72011, -109066, -70585, -15245, 6916, -4681, -24151, -31812, 5216, 39198, 44618, 43642, 15728, -855, 373, 35400, 44410, -27309, -19952, -18339, -24048, -10886, -33617, -53247, -70727, -19443, -17536, -100351, -150128, -164420, -117110, -41655, -38095, -70458, -45141, -59138, -39447, 14185, -4851, 4422, 40173, 42051, 29566, 14142, 57874, 56861, 50181]
14246E0181K4940n1419j6341J7712K13O2071M4563j4967m5498J5447n5327r1911
14234f0336j1715P8147Q3620j8099n5970r7235n320Q039J6992L3001P3601O0875
14222A05600k5718J9328k8471m257o5014k1662L6561J4445r8743m7064K2080K8651
14210f4264k7562J5140N2488N659l689j5340l3276J9517L1229J9962M2211J7225
14198E9300Q267n233n2490m6019o3863p143M5940K8291L3351m4548J7598K9659
14186C110l0250o534j1858J3717Q0710N0884Q258p5378m1735n492O0881J9076
14174F5389j0092K0578J3882l8815k8342l1958p7683N1925O8813j5020j9686J3081
14162A2072j3957q0384k2123O189L1833O6889m5873j1923Q059M3544O3991m285
$$ y = [50181, 75121, 23702, 7361, 25073, 25286, 87357, 131920, 116953, 71455, 86902, 31575, -60336, -72051, 6096, 89716, 71617, 15647, -81588, -86908, -78869, -61877, -28876, 44725, 105600, 79882, 99210, 70739, 66482, 1468, -20194, 16367, 30812, -67931, -114995, -92915, -64264, -91826, -76686, -24198, -18539, -22228, -37568, -70844, -51327, -20098, -136, 42075, 59300, 67567, 62334, 9844, -36175, -100038, -107181, -61241, -32950, 401, -44147, -26549, 3110, -27140, -33674, -45532, -31815, 48895, 99779, 108037, 32659, -9076, -14568, 46313, 65389, 55297, 75875, 89757, 50942, 22600, -9358, -87041, -35116, 33697, 18677, -1009, 12072, -1885, -82269, -104392, -98203, -66370, 519, -45354, -57277, -49218, -5674, 58317, 54032]
14150E4032k8966K1645l2441q78j5123r604n3212K0355O6707P4451o5879l5194
14138d107J028j4196J7466J0882k2160J6998J3460n3638p980P5411j6123l3477
14126a6436n9130m1510P5025N0938j073K67j5380j4080l007o9747q0113J3022
14114a61224O7332J1804N831Q3199k4667k9703L533K1960M3282M5034K3779J1612
14102A01772l9125Q152p7827n4631m2756q149M3990R4128m1716j3575K4765q09
14090e781Q2838J5855L3379m9579p1407j9548j2697J9439j5195k7726M485N4805
14078H868N9132k6267J48M2096j0358q7299m6791o058m079o766K4033L8107n2417
14065f7651K1075O0751M2894K9997j3041m6280j1195N4684j9866p2072l165j527
$$ y = [54032, 25066, 46711, 14270, 13392, -1731, -11335, -64547, -44192, 22515, 96966, 31087, -4107, -3079, -17275, 191, 11073, -11087, 5911, 19371, -34267, -42247, 33164, 17041, -16436, -75566, -117076, -42051, 8887, 7814, 8081, -7299, -21379, -24386, -94133, -174246, -161224, -93892, -82088, -76257, 6942, -17725, -47428, -43895, -21935, 21347, 66381, 90160, 101772, 62647, 70799, -7028, -61659, -104415, -112564, -68574, 25554, -16162, -29737, -4972, -5781, 77057, 92912, 126291, 76712, 5305, -14243, -26940, -7501, -22696, -50422, -45937, 8868, 68000, 41733, 41881, 83977, 73619, -13680, -60471, -66529, -70608, -77374, -53341, -15234, -67651, -46576, 14175, 57069, 87066, 74025, 27745, 16550, 71234, 51368, -20704, -23869, -25396]
14053b5396j4463j3885J9653L9658l2279l5475J9894K5825K7775P098l5443j9754
14041c6792k2404J2677K9228K4677m683j7868l5824Q1566m731m0871q263o3284
14029h6572J7456M3156K4279j7500K0976J9563J8871K361j8464l6056J5532O4563
14017F8165m466N9360N4695k3997r791o3232o6620J6864k3567O139m738n336m2908
14004c9432j8769o3557M6596P8108P9451k7411L2168Q6347p6518j04892k4710
13993c2619M6322K6293L4734J4555J8439l9845n3141J5376p594O005L5084n243
13981E8366k6917K2169L3032L2445K7085k2259O274j22m5342l6790J1913k8335
13969C1519p623j1099r3309j3430N9831J0407Q300l2424l326P402k9948K7283
$$ y = [-25396, -39859, -53744, -34091, 5567, -26712, -62187, -42293, -16468, 11307, 18405, -17038, -36792, -59196, -46519, -17291, 7386, 2703, -15165, -50989, 30577, 25846, -15025, -23288, -86572, -69116, -25960, -1681, -19181, 1795, 21358, 40229, 42590, 24126, -11930, 3602, 68165, 63699, 123059, 177754, 153757, 143966, 80734, 14114, 30978, 7411, 13550, 8812, 3476, -39432, -58201, -121758, -75162, 2946, 82397, 54986, 87154, 173501, 96983, -7909, -32619, 13703, 39996, 74730, 89285, 107724, 67879, 14738, 30114, 22520, 28525, 63609, 58366, 31449, 53618, 86650, 119095, 146180, 123921, 130195, 130073, 84731, 47941, 59854, 31519, 23896, 12797, -80512, -93942, -34111, -23704, -15404, -47828, -51154, -43752, -73700, -46417]
13957d6417k910M352K2774K6466l3727o0043P3528J34393N715n4427l0964l115
13945C5625m1407o0616Q0630K9851k4456p6531L741N1352L2991l6281o5660j35
13933g0896j4945N0512K3104L637k2455J3977j7148K8258J2461k1537r798N9235
13921C4405j0964l162m8444m5666J3473K9133J1254m767k0955J4828K4431j2756
13909a9190q354K1151J3530P025j0001l8145n4156K5075k903L833K5888J2442
13897b3805L3221j094l1719j9454r176J8147L5901k0996k1062k6596Q796k0555
13885g8392k1932M1264N1622P99J7271l0208L7215k1967j6264N5365L4861J6592
13873H6226L362m9499m2973P0284N3551j4614m4040M950m7761K0349P062q0766
$$ y = [-46417, -49327, -44975, -22201, 4265, -29462, -89505, -15977, 118416, 124131, 69704, 38740, 35625, -5782, -66398, 14232, 44083, 19627, -56904, -53163, -1811, 31180, -5101, -70761, -70896, -85841, -35329, -12225, -8588, -31043, -17066, -34214, -5956, 6505, -15032, -24830, 34405, 23441, 20279, -28165, -73831, -60358, -31225, -19971, -24738, -45693, -30865, -6434, -19190, -27544, -6393, 7137, 14162, 4161, -33984, -88140, -63065, -65968, -62135, -36247, -23805, 9416, 8322, -23397, -42851, -52027, -33880, 2021, -18975, -40037, -66633, -57837, -78392, -100324, -59060, -7438, -6639, 10632, -19576, 17639, -4328, -20592, 34773, 69634, 86226, 89588, 40089, -2884, 67400, 120951, 106337, 62297, 67247, 19486, 39835, 46897, -33869]
13861c3869q527K6451k2048L4709N1950K0032k1523l1075l7971k6774J0847k1370
13849e9168N7855J9223n1612p6011O4751Q1137O1954j5764l2280m9770N8586n046
13837E3855l5893j9233j8758L3778K9356J9496k059m5156K0378P5772K9818M0533
13825A81887q6461o5443L6643J08773O3978P9469J34981O2648J24065J36404J91443
13814I68387J36621K16094J27758J21293M0403m7008o3602o0016j73741k59014
13804A007175k27156k51629j51801j07114m6901n2097l9740K0362o0426m996P2092
13793A57769K059l0221l5207K2429K2631j48088l6290K0852R059l360J1809m64
13781g022j3705J3495M9845n619p2159j05335L9007J11632m053K0625M1462k6347
$$ y = [-33869, -42396, -15945, -37993, -3284, 48666, 68698, 47175, 16100, -21871, -48645, -37798, -59168, -1313, 17910, -33702, -109713, -44962, 36175, 98129, 82365, 50085, 315, 58901, 53855, 17962, -1271, -20029, 13749, 43105, 62601, 60542, 15386, 35764, 111536, 141354, 181887, 95426, 29983, 66626, 175399, 239377, 318846, 453827, 516475, 640540, 776944, 968387, 1105008, 1321102, 1448860, 1570153, 1610556, 1563548, 1499946, 1439930, 1266189, 1007175, 780019, 528390, 376589, 269475, 222574, 170477, 130737, 151099, 90673, 85677, 157769, 159828, 129607, 94400, 116829, 139460, -8628, -44918, -24066, -15007, -18367, -6558, -7022, -20727, -7232, 42613, 36994, -35165, -140500, -101493, 10139, 6086, 26711, 68173, 41826]
13769D1826m6370j422l1890J8343Q2698j7549p55n3989N8193J2668J6823n1737
13757B6839j399N6839J8011j6630J3140o8284R719L4763R406k2787J5564l2543
13745D2638m314L0937O7501k4286k1853j5661j5980J0255j0202J9795r511p3622
13733d303O585L2267l6058m1889J4136M7135M481j4691M3791P060l4573L1922
13721E5863l7788o1529p2699j5981p470J2902m369O3166Q4288o146J5638k9047
13709c172J9589m650p1431P408P7337P2353o835k4265n1820l4942N655N083M0850
13696C1160N2721m953l6462J6166O4741J7400k9909o2383j0850L3742j101j8690
13684E1582M124N2482n3111j03997n1559K2854K5098K9872J8404k4912j2531N884
$$ y = [41826, -4544, -5966, -37856, -19513, 63185, 45636, 44881, -9108, 49085, 61753, 78576, 26839, 25440, 82279, 100290, 83660, 96800, 28516, 38235, 72998, 82404, 59617, 75181, 42638, 38324, 69261, 136762, 112476, 90623, 74962, 58982, 69237, 59035, 78830, 69319, -4303, 2282, 34549, -1509, -43398, -29262, 17873, 22354, 7663, 51454, 58514, 23941, 55863, 18075, -43454, -116153, -132134, -139604, -126702, -131071, -67905, 16383, 10237, 25875, -3172, 16417, 11767, -59664, -52256, 25081, 97434, 90599, 66334, 14514, -20428, -14773, -9690, 31160, 83881, 78928, 42466, 58632, 123373, 140773, 110864, 48481, 37631, 71373, 70272, 51582, 55706, 108188, 55077, -48920, -100479, -77625, -52527, -22655, -4251, -29163, -41694, -35810]
13672c5810j2026K8804L7439p062j048P804k3840j2664j1514j3554q389j8514
13660g0374J3234k1660L8136P3629N4890p7780q9249k7863k2420M627k873L0640
13648i7063N9728q471O138K4496j1317j6740J3477K1198L1612j3071m2910L558
13636b9365K0863K5237n6605m8972J3955K1806p533L3504O1528l1306l0742k2377
13624e0007K970N0548J4312L2820n1066o4045J1583J524M8430N9941j5998l8788
13612B224k2878l3444j4219r199K3430J5827l86J6645J1656p597r4407J4741K0966
13599g6641J4921K7375k2476o8100P7522N0270M4974l4090o0199l5281o829J6732
13587g1822m1506J7695Q8338k9685l8260M3461l078J2443K5825L3636k6210j2452
$$ y = [-35810, -47836, -19032, 18407, 11345, 10297, 18101, -5739, -18403, -29917, -43471, -51860, -70374, -57140, -78800, -40664, 32965, 87855, 10075, -79174, -107037, -129457, -124830, -127703, -97063, -37335, -45806, -39668, -15172, -26489, -43229, -29752, -8554, 23058, 9987, -32923, -29365, -8502, 16735, -39870, -88842, -74887, -53081, -60614, -27110, 34418, 3112, -27630, -50007, -47037, 3511, 17823, 50643, -423, -64468, -52885, -51361, -2931, 57010, 41012, 2224, -20654, -54098, -68317, -77516, -54086, -38259, -38645, -22000, -10344, -17941, -112348, -97607, -76641, -61720, -34345, -56821, -124921, -47399, 2871, 47845, 13755, -46444, -81725, -88554, -71822, -113328, -95633, -7295, -36980, -75240, -31779, -34857, -22414, 3411, 37047, 10837, -1615]
13575a615n9395k3392l4288N8587N3248K0355j2013K1709R980L268m230n0441
13563a8227J9519J5665P99k0279N7408j6207n7219m1752J1856M9421O243n9630
13551e2403j1685P9067O0402p838n3777K1988L1154P4022K1439o6652o6640K2206
13539E1283l0736k3974K3222K0628K6507J535j7943n662j8112m0441l2611k9614
13527g5918K0922l2868j5601R7254P1110l0121j06388k0401N7307M2239L0745
13516C8280L2933K9087o837l8438m8791m2809M2298k1594m393Q014N021o110K0114
13503F775L5257M0459n7575q9814k7042M4194N9487M9981J2240m2076k5859n9010
13491e2983J7420N9442N6475l6678O418K8090k7861L3299L4492j7905j6307l5033
$$ y = [-1615, -61010, -84402, -118690, -60103, -6855, 13500, 1487, 23196, 33176, 36444, 32214, -18227, 1292, 16957, 17756, -2523, 54885, 38678, -18541, -60293, -48437, 984, 7227, -52403, -64088, 14979, 75381, 67543, 13766, 35754, 66908, 140930, 162369, 95717, 29077, 51283, 20547, -3427, 19795, 40423, 66930, 68465, 50522, 44860, 26748, -13693, -46304, -75918, -54996, -87864, -103465, -6211, 64899, 34778, -71610, -92011, -34704, 7535, 38280, 71213, 100300, 93463, 55025, 6234, -36575, 5723, -15871, -20264, -12250, -7229, -13339, 6775, 42032, 82491, 24916, -64898, -91940, -47746, 11741, 61722, 73962, 31886, 6027, -52983, -35563, 23879, 80354, 43676, 50094, 78184, 50323, 83622, 118114, 100209, 83902, 48869]
13479D8869m5461o1031M9980J0494m7830l0563l0820o755K8181M7357m768p5701
13467a18048r4077M2907Q3298J8305J8999J5206j2046q422K5194O8167k3943L237
13455A8777l996O462n1059o224K670K336j1538L2296K9619J8687k3724K645K681
13442A9632m10J1264P82l1298m6637j244N0429o985l7107k839J3522J7716o318
13429a9493o3127K7065K9031L107N0370J0838J9460l1793j9463K7966k2801m980
13417F180M7659j3706o2048r526N846M7359J4497m201m9741P6572k769m7070Q662
13404A7714J95K2982j6468L7310J6194J8613o9285K0858Q984k6296n3071k34M4660
13391B2156O3645j2818o9396k7276J1802O0474l6979j05567j5750P8170N2752
$$ y = [48869, 3408, -57623, -7643, 2851, -44979, -75542, -106362, -113117, -84936, -37579, -42347, -118048, -212125, -169218, -85920, -67615, -48616, -33410, -45456, -53878, -28684, 39483, 15540, 18777, 14781, 21243, -29816, -36040, -33370, -31034, -42572, -10276, 19343, 38030, 14306, 16951, 19632, 19222, 30486, 31268, -30, -46667, -47911, 2518, -4467, -41574, -44413, -30891, -13175, -19493, -82620, -55555, -26524, -23417, 26953, 37791, 57251, 25458, 5995, 33961, 11160, 6180, 53839, 40133, -21915, -31441, -25595, 21764, 36261, 32060, -17681, 58891, 56122, 9052, 17714, 17909, 40891, 24423, 61733, 77927, 96540, 27255, 48113, 57097, 30801, -22270, -22504, 22156, 85801, 72983, 3587, -23689, -11887, 48587, 11608, -93959, -109709, -31539, 21213]
13380B1213n4038r7953M6812K0947O96O7253j6301n644m2751J9301m684j6452
13368f1601p173k6627N8574O9948N8872m6037Q167N776p635K6309o250k8790r9986
13355e6453o040P4712N1453O421K425q855l3917n7676j9567k0983L2034M0055
13343C609K5217j911n7447l9156j2545Q307j4781k5798N3410N5225K2789Q211
13331B5130l7243M188P872l2474k0712N6004J0231K5986k1198p5331j3992j523
13319g3062Q8775j4785n0110k3411L1814L1375k9138p1414L860K4269L11L7868
13307d3648N8032R92n0264N224J3456J9516j0598k7938K6854K3113K7921m370
13295C8290m0247m5045l233k0512N0329P676K6228J6228k583M6091N0618l6763
$$ y = [21213, -32825, -130778, -83966, -63019, -62323, 4930, -11371, -17015, -59766, -40465, -45149, -61601, -68774, -95401, -36827, 33121, 91993, 45956, 54123, 59899, 52264, 78573, 72323, 43533, -56453, -62493, 12219, 63672, 70093, 72518, 63663, 29746, -27930, -47497, -68480, -36446, 3609, 28826, 26915, -30532, -69688, -82233, -73926, -88707, -114505, -61095, -5870, 16919, 25130, -12113, -7925, -53, -32527, -53239, 2765, 12996, 38982, 17784, -57547, -71539, -73062, 15713, 928, -49182, -72593, -40779, -9404, -38542, -109956, -106096, -81827, -81516, -43648, 14384, 15376, -34888, -29664, -16208, 3308, -7290, -35228, -8374, 14739, 42660, 38290, -1957, -47002, -50235, -70747, -20418, -12742, 13486, 29714, 27131, 73222, 123840, 87077]
13283H7077q536n4627j7893o2598r853J7702j0809L646K5343k2511J2593N8991
13271A8525K1527p7582K2017L0410J9644L2019n801L473k891J927k7492k5426
13259A0350p4O1405j5795j7387P506R886j8320m8115R565M6904j8369j8447p1513
13246f2404n8818k5081Q1395M5107Q283K7290m826M0098j5750m4076l1711l8396
13234g8889K7054K3511K2238m5777K1977M7299L4457m0195p4998k40Q898m844
13222e9509l4002j1331L2109L5273K4653M3284O413K493K048k6249m3458R0237
13210F1961k8409J2097J9862K1882m2407q877P634R0052q884o0927m9116n882
13198H986N5805k6287K7663N9543j2383p713o82O163K0076j2776r946l6570k9387
$$ y = [87077, 78541, 23914, 6021, -56577, -66430, -48728, -59537, -55891, -30548, -53059, -40466, 18525, 40052, -37530, -15513, 14897, 34541, 66560, 60759, 64232, 61341, 63268, 35776, 10350, 10276, 71681, 55886, 38499, 46005, 55891, 37571, -10544, -979, 45925, 27556, 9109, -62404, -121222, -146303, -64908, -19801, -11518, 15772, 10946, 51044, 35294, -8782, -40493, -78889, -51835, -28324, -6086, -51863, -29886, 17413, 51870, 11675, -63323, -63563, -54665, -59509, -93511, -104842, -72733, -37460, -12807, 30477, 36890, 39383, 41431, 15182, -28276, 61961, 33552, 45649, 65511, 87393, 44986, 36109, 43743, 133795, 124911, 63984, 14868, 8986, 64791, 38504, 66167, 125710, 113327, 105614, 104932, 111095, 131171, 118395, 108449, 71879, 42492]
13185D2492k3227n3804J8882M3583L0894L9758M3527n4589l9399M1883J1833k0102
13173H1731K1825J6432K8394J09633R3614M0821P9138P6361O4714J50451J75605
13162I38719J99739J99090K02738J39127O1190j7798r6966r6357p8333j97535
13152A253614k64985k81886k64645p3059o6097p4179j06566l4621K7297J4232
13142A29105L2391M1075k0007p7309P001l4950j1392j9518P427l8145n7454O4301
13130B2525M3108k3705n2091J0240M0166K706o4189J8999N1204K7909L444P32
13118H1048J0651k1995K2442L0122k78l8171n4355l0016L4752J0963J9422P69
13106F5354l7006K0854M2726r3593j5191Q740L3303M1338Q1515L7961p9285k9059
$$ y = [42492, 19265, -34539, -15657, 27926, 58820, 98578, 142105, 87516, 48117, 90000, 101833, 81731, 103556, 119988, 148382, 258015, 351629, 392450, 471588, 547949, 612663, 763114, 938719, 1138458, 1337548, 1540286, 1679413, 1740603, 1722805, 1625839, 1529482, 1451149, 1253614, 988629, 706743, 442098, 369039, 302942, 228763, 122197, 87576, 114873, 129105, 161496, 202571, 182564, 105255, 112256, 77306, 65914, 46396, 53823, 15678, -41776, 22525, 65633, 41928, -10163, 77, 40243, 42949, -21240, -2241, 48963, 76872, 80316, 81048, 91699, 69704, 92146, 122268, 121990, 83819, 29464, -552, 34200, 45163, 64585, 65354, 28348, 49202, 91928, -1665, -16856, -8116, 25187, 66525, 148040, 186001, 106716, 77657]
13094G7657l7503o3511l7975J3360O8388N5803J3073k3760m0704j816L9058k2394
13082C9676m1744O5828k904L6890N7519n7788n8259k6443j0386N7290J9784j9805
13070E9658K0259Q759m0926J2775n3522l5264K8329K6409O0188k3724k575K4485
13058H4851Q543k1552P38Q882l2850K4060j3397L8673l3624j2718l9830J1996
13046B3772J8440m7103K1617J6370n165P539L4200L183k5929k970J4179J9300
13034G7433o1231J6630L5768L2459J3347o6828K2732l4202l9328P5635O1590J4666
13022A48671n5253j6630K2592M5475j5743n3132r714P55j517N523K6897m0778
13010E7146l6404N911J8718K0062K6132n073k8016M8822K776l5189k9071k1913
$$ y = [77657, 40154, -23357, -61332, -47972, 20416, 76219, 89292, 65532, 24828, 23012, 62070, 39676, -2068, 63760, 60856, 97746, 155265, 97477, 39218, 12775, 2389, 59679, 79463, 59658, 79917, 88676, 47750, 60525, 7003, -28261, 68, 26477, 86665, 62941, 60366, 84851, 93394, 71842, 72580, 81462, 48612, 72672, 59275, 97948, 64324, 51606, 11776, 23772, 42212, -4891, 16726, 33096, 27931, 35470, 69670, 72853, 46924, 43954, 58133, 77433, 16202, 32832, 68600, 101059, 114406, 47578, 70310, 36108, -3220, 72415, 134005, 148671, 93418, 76788, 99380, 144855, 129112, 75980, 66266, 67021, 65504, 71027, 97924, 57146, 20742, 26653, 45371, 65433, 91565, 86492, 58476, 107298, 110074, 74885, 45814, 23901]
12998B3901L5609J5049q45N0410j6017k014K5246N1975L0918K275J8736O741L0181
12985B72165N1345L1308k1800p9320k1233P5519L2547n7262n6617R366k6831m5758
12973A63429k4081j7475L638o94L0352L8774l2202j1404J0118N0540m835K3873
12961B30033k8751k4198L7537J8412n5008j8685M048q837Q626n7048r581J40410
12949B36958P9346J6377J6185O4289N2939M3072J8792j8100l1345k8388l8418
12938D11707l983m1197p1855o5378j7729o8327l7155N1784j4524n9816O32R857
12926I4016J4132L533k9750K540M9208l9355r761j225o308J0605L3887O633n155
12913A23000l5944k9795j2796L291j5870R8486O6799m2585n8050m7983L4129K7665
$$ y = [23901, 59510, 74559, 73714, 124124, 108107, 106093, 131339, 183314, 214232, 216507, 235243, 241984, 272165, 323510, 354818, 333018, 253698, 232465, 307984, 340531, 283269, 226652, 236018, 209187, 163429, 139348, 121873, 125511, 124817, 155169, 193943, 161741, 150337, 160455, 210995, 206160, 230033, 201282, 177084, 214621, 233033, 178025, 159340, 163388, 154551, 163177, 106129, 96548, 236958, 316304, 332681, 348866, 413155, 466094, 509166, 527958, 509858, 478513, 450125, 411707, 407724, 366527, 294672, 229294, 211565, 143238, 106083, 157867, 143343, 83527, 84159, 94016, 108148, 111681, 81931, 84471, 133679, 94324, 84563, 83338, 77030, 87635, 121522, 128155, 123000, 87056, 57261, 44465, 47756, 31886, 130372, 197171, 154586, 96536, 48553, 82682, 110347]
12901A10347L0412m3236l2268l7617l0826J3539O089J8925J5521Q679k5498J509
12889C5576M0627j9868j7248P932Q4815M6080j3590R276N3753j8181j06610Q528
12877A11090Q8059P1893L8413Q460j4248j2512M9043M9161L0034J6032N2219k2988
12865D64656k2445L8004N826n7781n9337L3700j72l1210j5896o3884o8762j1102
12853B11597n067J1883O4310J8232k7489J0348J6722j5228k0519L3849L1426k2087
12841C07977j02529k5034M2011J1045J8772K1495K9360k3367r869k8652M0376
12830B81585L2000l9891m3642K5785M8773L6566K0998K4747L1527m9742n7533
12819C11173p823Q4740N3425M7469n2180l0430n313p804J36914J13712k8098M1847
$$ y = [110347, 140759, 97523, 65255, 27638, -3188, 10351, 16440, 35365, 50886, 59565, 34067, 35576, 76203, 56335, 39087, 47019, 131834, 177914, 164324, 173600, 227353, 209172, 102562, 111090, 199149, 271042, 309455, 317915, 303667, 291155, 340198, 389359, 419393, 435425, 487644, 464656, 442211, 480215, 486041, 428260, 368923, 402623, 402451, 371241, 355345, 291461, 222699, 211597, 206530, 218413, 282723, 300955, 273466, 283814, 300536, 285308, 264789, 298638, 330064, 307977, 205448, 180414, 222425, 233470, 252242, 273737, 303097, 279730, 269861, 241209, 281585, 313585, 273694, 230052, 255837, 304610, 341176, 362174, 386921, 418448, 368706, 311173, 303350, 388090, 441515, 488984, 436804, 406374, 401061, 393257, 530171, 643883, 615785, 657632]
12807F57632M8421m815j0646j1563m6446j5201k6388j1139L6191M1322J3427K0931
12795F91726J6642J5757k4999m2426N8629J21405Q2845J6229L2786J32439P9126
12784A180159k4531M8988J02779R5402O0564Q4079Q2363P7607J04913O0381L6215
12773A908919R4938J59783J02522J07919R9810P7829J32758J40189J80933K09697
12763C215297K26182K38509K66829L51189L83876M35290M30907N56829P56040
12754F860948R03103J135927J345425J704585K097129K565133K999374L402380
12746B3014004L714058M183020N032030O535297Q386200J0521541J3010586J6994746
12738I1391482K3713522L3378214M2843467M7098149M4138978L2534576J0837412
$$ y = [657632, 706053, 701238, 690592, 679029, 632583, 617382, 590994, 579855, 616046, 657368, 670795, 691726, 708368, 724125, 699126, 656700, 715329, 836734, 919579, 935808, 968594, 1101033, 1180159, 1155628, 1204616, 1307395, 1402797, 1463361, 1547440, 1629803, 1707410, 1812323, 1872704, 1908919, 2003857, 2163640, 2266162, 2374081, 2473891, 2551720, 2684478, 2824667, 3005600, 3215297, 3441479, 3679988, 3946817, 4298006, 4681882, 5117172, 5548079, 6104908, 6860948, 7764051, 8899978, 10245403, 11949988, 14047117, 16612250, 19611624, 23014004, 26728062, 30911082, 35943112, 42478409, 50864609, 61386150, 74396736, 91391482, 115105004, 148483218, 191326685, 238424834, 282563812, 315098388, 325935800]
12731C25935800r782932j3422543o977153q542151k7317561n1928136n8171829
12724A49793495m4586901k8553046j7698864j1257491p551222n421211m164514
12717C0560246l408748k842301k399844k093553k039680k036850k018463j857055
12709A1863752j574542j181257r13312p38790o44526n28253m90514m53846l73471
12700D965241l76442l72723j82942k94354l09781j85255j82121j92368j49833
12691B719422j20987j35328j60267j22363o9216j45762k34933j44362l4948n2596
12681A498660j1338m6532N731M3884m763k5651n5750j2178p6626o847k030n150
12669A301410k5928n5929K2194L6952O317j7131N6151P9360J15924J26298J57238
$$ y = [325935800, 316152868, 302730325, 295753172, 287211021, 259893460, 207965324, 149793495, 105206594, 76653548, 58954684, 47697193, 40145971, 34724760, 30560246, 27151498, 24309197, 21909353, 19815800, 17776120, 15739270, 13720807, 11863752, 10289210, 9107953, 8194641, 7455851, 6811325, 6283072, 5792558, 5338712, 4965241, 4588799, 4216076, 4033134, 3738780, 3428999, 3243744, 3061623, 2869255, 2719422, 2598435, 2463107, 2302840, 2180477, 2111261, 1965499, 1730566, 1586204, 1551256, 1498660, 1487322, 1440790, 1446521, 1490405, 1485642, 1459991, 1404241, 1392063, 1315437, 1308590, 1306560, 1301410, 1275482, 1219553, 1241747, 1278699, 1285016, 1267885, 1324036, 1403396, 1519320, 1645618, 1802856]
12658A802856J09353N5921R9769k8877n2145l7684j3536j9446j67509j78031j11825
12647A458846j01638j60611j71685j20388k3039m0946j35489N5157K4588n4361
12637G30434k6818o7340m8453K668p74m8050M0171l4077l3890K5394j2018J3409
12625E40656J5003K816n9630O5520j7407j2201k469k507l5275J128P1831j1358
12613E56107p8009m7436J7485K1433j572j9861K9300K6966L0351k8736q3365o9471
12601C53192m4374j0677n3918K4709J3963L064K6592J2554j735j2219R758k3505
12589B97404o251o169L1436l3722M499m7456P1244L4916k7996k2538O4481O7425
12577D27273N1397k1413L6426R630N7136N4605L0267R700K6161m307K0076K4430
$$ y = [1802856, 1912209, 1968130, 2067899, 2039022, 1986877, 1949193, 1935657, 1916211, 1748702, 1570671, 1458846, 1357208, 1196597, 1024912, 904524, 881485, 840539, 705050, 760207, 784795, 730434, 703616, 636276, 587823, 590491, 589717, 541667, 581838, 547761, 513871, 539265, 527247, 540656, 555659, 558475, 498845, 564365, 546958, 534757, 532288, 529781, 494506, 495634, 567465, 556107, 478098, 430662, 448147, 469580, 468008, 448147, 477447, 504413, 534764, 506028, 422663, 353192, 308818, 298141, 244223, 268932, 282895, 285959, 312551, 325105, 323370, 311151, 320909, 297404, 291153, 284984, 316420, 282698, 287197, 239741, 310985, 345901, 317905, 295367, 359848, 427273, 478670, 457257, 493683, 503313, 560449, 615054, 645321, 655021, 681182, 676875, 696951, 721381]
12565G21381m6164l0261r3993q0928m5756j871m8353k4999Q52K4789K6330j1333
12553C89694j2244r654l8036k0901j2399J8570l3654O3109M4652j9372K1934l1524
12541C60175m5615N0409L1112q7176m2448Q9377N3232Q6279J05501L2304R473
12530F42623K8377N4300Q4412J41587J10667J28195J69546J28283J14962K6419
12520A629371j25522k02252k11933j75832j18081o9405o8514j03755p8728l0771
12510D44578k7400k1530p6412o0084m2303K1237l222j4792O525L1493J5565m1420
12498B32235l2533L5245N3893k1208k8265m3743L8085M4849J1359O7798L7721
12487C95436J8260O2223O4134N3339R2268J62654J56874J99801K44022N5941k848
$$ y = [721381, 675217, 644956, 550963, 470035, 424279, 422408, 374055, 349056, 349908, 374697, 401027, 389694, 377450, 367796, 329760, 308859, 296460, 315030, 281376, 344485, 389137, 369765, 391699, 360175, 314560, 364969, 396081, 308905, 266457, 355834, 409066, 495345, 600846, 633150, 642623, 671000, 725300, 809712, 951299, 1061966, 1190161, 1359707, 1487990, 1602952, 1629371, 1503849, 1301597, 1089664, 913832, 795751, 726346, 657832, 554077, 475349, 444578, 417178, 395648, 319236, 259152, 216849, 238086, 234864, 220072, 226597, 258090, 273655, 232235, 199702, 234947, 288840, 267632, 239367, 195624, 233709, 278558, 289917, 357715, 395436, 413696, 475919, 540053, 593392, 685660, 848314, 1005188, 1204989, 1449011, 1504952, 1502104]
12476A502104k2889j37214k28871k11962j56178q3492p0366n6917j09532p4673
12466C50010j4574N5863l9083p1778o0428o1275r848J7018j6895j1602r435J1776
12454A39749k1679P2227O4860o7855j8385L5057M737k8465J6311L851K8739J1801
12442B40948R837O428N5202J9058K6799O8676J09072N7398M0388K4030r135J1813
12430F60514j8625l3801j0221N9478K534o7630m2314j07630K7823L5095n9016
12419D46207o8841k9969n8838j21668P924M088p9n4650o6477L9169R541k8852
12407G7555m9999K083K4237M425l8645M2891L6133j6638M3670o0270n7093l1879
12395b3530K5957j1111L9201J0946J5756L3392k3480j6436O1322K4197q3338k2306
$$ y = [1502104, 1479215, 1342001, 1113130, 901168, 744990, 661498, 591132, 534215, 424683, 350010, 335436, 391299, 352216, 280438, 220010, 158735, 148887, 165905, 149010, 137408, 127973, 139749, 118070, 190297, 255157, 187302, 168917, 203974, 208711, 180246, 196557, 200408, 229147, 240948, 250785, 257213, 312415, 331473, 358272, 426948, 536020, 593418, 633806, 657836, 648701, 660514, 641889, 608088, 597867, 657345, 659879, 592249, 549935, 442305, 470128, 505223, 446207, 377366, 347397, 288559, 166891, 174815, 178903, 178824, 124174, 57697, 96866, 106407, 77555, 27556, 29639, 53876, 58301, 19656, 62547, 98680, 82042, 125712, 65442, 8349, -23530, 2427, -8684, 30517, 41463, 57219, 90611, 67131, 50695, 112017, 136214, 52876, 30570]
12383C0570O6200J1503J9311J5670Q97L2026j902m1074j0498Q006M0875j0404
12371A61180m7178k0485o610j9074j9049L54n4981J347j53M217O2689J2258j640
12358G2875J094k4182L3206kL1038j6291m5306m338r633m2800J6586J1309M7741
12345G1297J6128l022j5770J9410k7394r782M1946L3639m0361l6520j8842j8679
12333A2050L246k7989O7175N3344r554J6732k312k203n2232m8788N9583K7842
12321I6894m8331J4027Q6032O7721J00427M3742o2828o2961K7829O0724K7620
12310C50896L3029Q9519j7425o190P3430J11703J46362K40078K28776J73547J11730
12299A535455Q4605l7977j13151q6561n6179n3188j97526k75182j95301j26431
$$ y = [30570, 96770, 108273, 127584, 143254, 144151, 176177, 174275, 133201, 122703, 130709, 171584, 161180, 114002, 93517, 86907, 67833, 48784, 49138, -5843, -4496, -4649, -432, 62257, 74515, 72875, 73969, 49787, 82993, 82991, 114029, 97738, 52432, 48094, 38461, -4339, 12247, 23556, 71297, 87425, 84403, 68633, 88043, 60649, 50867, 92813, 126452, 86091, 49571, 30729, 12050, 15296, -12693, 54482, 107826, 98272, 115004, 112692, 110489, 58257, 9469, 69052, 96894, 48563, 62590, 148622, 216343, 316770, 360512, 297684, 234723, 262552, 323276, 350896, 383925, 473444, 456019, 449829, 523259, 634962, 781324, 1021402, 1250178, 1423725, 1535455, 1620060, 1582083, 1468932, 1382371, 1326192, 1273004, 1075478, 800296, 604995, 478564]
12289D78564q3397m9217j04017p2341J5763N2090J5300n3682p2001K6120J6547
12278A69729m712j8563k9531J0928k4305m3316k4136n3111r2613k1148K2816R5346
12266a2616J8659p895o295l303K7769N2204N8232O2999k5638l7692l7505J3805
12254A02724Q5450k4903p3193n5977k2579M0115l86K352j98p004M9805O9054k3339
12241A41921o6419o7281l1020Q863M0335j0708P453L388p297k3101l7236L8470
12229b632P2162M8919k2457m4165l4431L026J3644K1136K1553J8548m23K964r0442
12216G402k7954o190J0040K2414n491N1213P3000J0201l720p3955k7731j0024
12204A9205L752J3449M8441l2647p9476j1237l4317J1787j671J4745J0136L8260
$$ y = [478564, 395167, 345950, 241933, 169592, 185355, 237445, 252745, 199063, 127062, 153182, 169729, 165017, 146454, 116923, 127851, 103546, 60230, 36094, -17017, -109630, -130778, -107962, -12616, 6043, -1852, -8147, -11450, 16319, 68523, 126755, 189754, 164116, 126424, 88919, 102724, 188174, 163271, 90078, 34101, 11522, 51637, 51251, 53603, 53405, 46401, 96206, 165260, 141921, 75502, 8221, -22799, -13936, 26399, 15691, 23144, 26532, 19235, -3866, -41102, -2632, 69530, 118449, 95992, 51827, 17396, 20422, 34066, 55202, 76755, 95303, 94880, 97844, 7402, -20552, -26742, -16702, 5712, 221, 51434, 124434, 134635, 130915, 56960, 29229, 19205, 22957, 36406, 84847, 52200, -27276, -38513, -72830, -61043, -62714, -47969, -37833, 427]
12192D27n00P481J6005L5479P633m423L2611J2579J4238q887N826J6523o1684
12179G3308L408P737m4111n6602J3911L8261O165j926K9676j8390k2269L9173
12167F8341Q122l2101J2076L8973j8315k6512k635R2N717n2702M6843J00554K7137
12154A75590l6881n5873l4926p048r474r971L4449n0629J302J3158L0916M9220
12142I9833R2400k2992j24277M2523O3753L4678J5651J8532l7784N008N2709O8967
12130C09001M2978l2392j1750p9332m1716L01j830J8543p7250p4847O0673j5555
12118I6824p6641p931N5870J2486n438k9335J0556k6889L023L5028K6251j9889
12106G3915j3121N542J1930R209N047m155n7905N253P3435m0432k1898j5988M219
$$ y = [427, -73, 7408, 23413, 58892, 66525, 62102, 94713, 107292, 121530, 112643, 118469, 134992, 73308, 76716, 84453, 40342, -16260, -2349, 35912, 42077, 40151, 69827, 51437, 29168, 68341, 76463, 44362, 56438, 95411, 77096, 50584, 47949, 48041, 53758, 1056, 47899, 148453, 175590, 138709, 82836, 47910, 40862, 31388, 21417, 55866, 5237, 6539, 19697, 50613, 99833, 192233, 169241, 44964, 87487, 151240, 185918, 201569, 220101, 182317, 187325, 240034, 309001, 351979, 319587, 307837, 228505, 186789, 187090, 185260, 203803, 126553, 51706, 112379, 96824, 20183, 12252, 68122, 80608, 75170, 45835, 56391, 29502, 32525, 67553, 93804, 73915, 60794, 66336, 78266, 87475, 92522, 88367, 30462, 35715, 109150, 68718, 46820, 30832, 35051]
12093C5051J9979k9487n265k1152M790L9135J6108l9241l432M1850j7092K4514
12081F5758L9105Q987j6979j9275l0117j6198m0014k7999p7194L283N1929N0924
12069g790K1399N4784J4977J1033R130l7763j5752k3948k9856q629R6206l427
12057H0364n3838j08302n6348O3291L1123J4449K780L6688M5890p1812j00829
12046a16544K8781Q2527M4357R936J035L6070J2643J2191K0081o528q3107q0146
12034c8704n887R133P2321R4789n2195k0345l3902n6758M0155M2341K1220l0677
12022D1491K0K8654J2105K0117j7926n2373j1386p360L3954K2035k5670o6804
12010b3143N8016J2921O3371L2060n163K5006J6214k9942j9948k4463M4104M3533
$$ y = [35051, 55030, 25543, 20278, -874, 3916, 43051, 59159, 19918, 16486, 58336, 41244, 65758, 104863, 113850, 96871, 77596, 47479, 31281, -8733, -36732, -113926, -110643, -58714, -7790, 13609, 68393, 83370, 94403, 103533, 65770, 50018, 26070, -3786, -12415, 83791, 80364, 26526, -81776, -138124, -74833, -43710, -29261, -26481, 10207, 56097, -15715, -116544, -87763, -5236, 39121, 49057, 50092, 86162, 98805, 110996, 131077, 124549, 41442, -38704, -44591, -35458, 36863, 131652, 79457, 59112, 25210, -31548, 8607, 50948, 72168, 41491, 41511, 70165, 82270, 102387, 84461, 32088, 20702, 13342, 47296, 69331, 43661, -23143, 34873, 47794, 111165, 143225, 138062, 163068, 179282, 149340, 129392, 104929, 149033, 192566]
11998A92566o641J6272Q0371L5892O1595O4486J08873J24904J91648J27394L42770
11987A340130N25614O91073O65084O44369L92961l57598j120485r80283o25139
11978A175726l72584k42899j17731m2605l4039j3971M6308L3041p4469l4739n520
11967C16518k0498j3488J0717K4153O888k2795J8616P3919J09905M8461j075r663
11955E41658L3643K0896n0624j6421k2258O6504J4402m0362m2953j2033o9207
11944D23245N3059M4816k7235j6745q499j6302K4139K3939k1120N2663L4211M1522
11932F07693o5890n560J7074J4547k1754L1657l972L7463M3991N4489O5640K3272
11920G98650J7687p1385o0806L9381K3695J404J7253J1284K1926L3397J0809j2111
$$ y = [192566, 185925, 202197, 282568, 318460, 380055, 444541, 553414, 678318, 869966, 997360, 1340130, 1865744, 2556817, 3221901, 3866270, 4259231, 3901633, 2781148, 1800865, 1175726, 803142, 560243, 442512, 399907, 365868, 351897, 398205, 431246, 356777, 322038, 316518, 296020, 282532, 293249, 317402, 324290, 301495, 320111, 394030, 503935, 552396, 551321, 541658, 575301, 596197, 545573, 529152, 506894, 573398, 587800, 547438, 504485, 492452, 423245, 476304, 521120, 493885, 477140, 468641, 452339, 476478, 500417, 479297, 531960, 566171, 607693, 541803, 536243, 553317, 567864, 546110, 577767, 573795, 611258, 655249, 709738, 775378, 798650, 816337, 744952, 684146, 723527, 747222, 748626, 765879, 777163, 799089, 832486, 843295, 831184]
11908H31184q8137r3030j5739l0811l9516L0044j6429K0455O0868K3848L154l8582
11896F47309l7998o2686K6569N1938P6747M4270P2745N8788k5482K2298K28j3771
11884H60955j4242O4032N1045J7038q918l4136p838J9106N0114P5253m945m202
11872A063262l4833J1386m1138P399n3872m2931k9174o7813j6404n8097o8661
11861F69124p4423J2019K2508k6286j8594K557R9235M2203M342O3783L0710J7987
11849H45165m3622O081N677O1128N903L924m6552k6423J3624J20790K4822k4422
11837I46095J7397m4619k8669R007q2394o789Q788L3990m2725K1548L1629m4173
11825H19085m4405K4307n95M011J221J9647L7296L5888p5516j00570K0486J9494
$$ y = [831184, 743047, 650017, 634278, 603467, 563951, 593995, 577566, 598021, 658889, 682737, 685891, 647309, 609311, 546625, 573194, 625132, 701879, 746149, 818894, 877682, 852200, 874498, 874726, 860955, 846713, 910745, 961790, 978828, 969910, 935774, 927936, 947042, 997156, 1072409, 1067464, 1063262, 1028429, 1039815, 998677, 1006076, 952204, 909273, 880099, 812286, 795882, 737785, 669124, 594701, 606720, 629228, 602942, 584348, 586905, 686140, 728343, 732685, 796468, 827178, 845165, 801543, 807624, 813301, 874429, 880332, 884256, 837704, 811281, 824905, 945695, 970517, 946095, 963492, 918873, 890204, 899211, 816817, 810028, 818816, 852806, 810081, 831629, 863258, 819085, 774680, 798987, 798392, 802403, 803624, 823271, 860567, 896455, 820939, 720369, 740855, 760349]
11813G60349K2166q061k9038m1561M4061R4696O9117L3157P562K4451O2176M057
11801A043132k2312k4706j06098m3915o3551j0996m3303J4629l7970m8717J8112
11790F74305l8660m3799l7378m2138J2235o6217j30191r997n572N1495J5950p8180
11778C01853m0117L8089J0916j5778p8336k1160M4054M5909n470l2137k352j3121
11766B32350N7930m0103m2102L7303L4309K2821n9329K5046J3628j0180J5846
11755B87519P7583K0091p7816R57K9001N7143R73l7105K6472M4076l7064p5771
11743C16059L3855N7644m088k1401J9959L4857o2094n4698m343M8273J1868m6441
11731C29450K0324l5412J1852J9898l6371k508N1842L571K2526k475L6555N0470
$$ y = [760349, 782515, 774454, 745416, 703855, 747916, 842612, 911729, 944886, 952448, 976899, 1039075, 1043132, 1020820, 996114, 890016, 846101, 782550, 771554, 728251, 742880, 704910, 656193, 674305, 635645, 591846, 554468, 512330, 524565, 458348, 328157, 318160, 312588, 364083, 380033, 301853, 261736, 299825, 310741, 294963, 216627, 195467, 239521, 285430, 279960, 247823, 245471, 232350, 290280, 250177, 208075, 245378, 279687, 302508, 243179, 268225, 281853, 271673, 287519, 365102, 385193, 307377, 308334, 337335, 394478, 395451, 358346, 384818, 428894, 391830, 316059, 349914, 407558, 403470, 382069, 402028, 436885, 374791, 320093, 315750, 364023, 375891, 329450, 349774, 314362, 326214, 346112, 309741, 307233, 359075, 362646, 385172, 382697, 419252, 469722]
11719D69722K1158K1547K5698j5845L5512p425p761k1792j787n1833L3223k199
11707D98218J2479L0979L1106J6803k882K5523k6077j6920j7880K827k5264k9965
11695D98947p849J6678K746n2985m2540l8302L5177J7273N7008K5796P1132N6370
11683F39451k8391K3390K4485L643J2525l9354n5335J1834N2556M9151l5408K6487
11671F85034n5218p4679L4686O5268k9589j8542L3180m4940n2004m2759M9600
11660E50037N5630j5930J0295Q641l626j6130j7636n1547j5528K8976L2418J1779
11648E77379o1072j9799J5168M2811j0533m0326M1391J9973o023L2539K801j2859
11636E81450L7391J191k0508J187J3777n051J4614m7336P478J1378J0561N1725
$$ y = [469722, 490880, 512427, 538125, 522280, 557792, 550367, 542606, 520814, 519027, 467194, 500417, 498218, 510697, 541676, 572782, 589585, 586703, 612226, 586149, 569229, 551349, 554176, 528912, 498947, 491098, 507776, 510522, 457537, 414997, 376695, 411872, 429145, 486153, 511949, 583081, 639451, 611060, 634450, 658935, 662578, 675103, 635749, 580414, 592248, 644804, 693955, 658547, 685034, 629816, 555137, 589823, 655091, 625502, 606960, 640140, 595200, 543196, 500437, 550037, 605667, 589737, 600032, 608673, 605047, 588917, 571281, 519734, 504206, 533182, 565600, 577379, 516307, 496508, 511676, 554487, 543954, 503628, 545019, 564992, 558969, 591508, 594309, 581450, 618841, 620032, 599524, 600711, 614488, 609437, 624051, 576715, 584193, 595571, 606132, 657857]
11624F57857K7575L9471l7395k0709n0825k2251n079J212O2955N4864r132m5326
11612F53217K3235M2112J2415j5983K3762L1138M4464n958p659L6532k0923J9420
11600H35772N4567J9421j3507L0276O3416R197j5342l0970l5713R996M6634O801
11588I80548j13174m9151P7528K8168M048l752M7350M9764m1815J6279N9515O4153
11576A119461P2227N5291O0783j6815J9770Q0103P6315L4966M719L113N4854K7926
11564A592713Q7948J25119P1045r037K3758J17162J51447J71473Q5312J15676
11554B532616J15301J21496J19726R3953J10190J24907K00547K17752K70539L23142
11544D230169L25422L06511L43183M14101M63000M50786N12788P35805R09148
$$ y = [657857, 685432, 724903, 687508, 666799, 615974, 593723, 588644, 589856, 652811, 707675, 698543, 653217, 676452, 718564, 730979, 714996, 738758, 769896, 814360, 808402, 800743, 837275, 816352, 835772, 890339, 909760, 896253, 926529, 989945, 999142, 983800, 952830, 917117, 927113, 973747, 980548, 867374, 818223, 895751, 923919, 927967, 924215, 971565, 1021329, 979514, 995793, 1055308, 1119461, 1191688, 1246979, 1307762, 1290947, 1310717, 1390820, 1467135, 1502101, 1506820, 1509933, 1564787, 1592713, 1680661, 1805780, 1876825, 1867788, 1891546, 2008708, 2160155, 2331628, 2416940, 2532616, 2647917, 2769413, 2889139, 2983092, 3093282, 3218189, 3418736, 3636488, 3907027, 4230169, 4555591, 4862102, 5205285, 5619386, 6082386, 6533172, 7045960, 7781765, 8690913]
11535H690913J097714J417735J728655K058397K330515K453279K430110K028759
11527B4236077J482456J023879Q02998J040474J507783J958819K434971K575111
11519C7062568K217387J547164R59373N98981O89743J209986J795498K085757
11511D8166457K079887J764442J305449R89219J065817J395507J853719K119190
11503F0739687K040625J754215J440366J306909J207690J055038P75622K03019
11495G0523171m68840r17763r95813r59664r08860o90758m60422k11092J5688
11486F4925647L77177Q14956J331997J967956K599547L137977L493606L745505
11478H2394368L832982L823299L658459L402611L180635L100985L138514L374910
$$ y = [8690913, 9788627, 11206362, 12935017, 14993414, 17323929, 19777208, 22207318, 24236077, 25718533, 26742412, 27545410, 28585884, 30093667, 32052486, 34487457, 37062568, 39279955, 40827119, 41786492, 42385473, 43075216, 44285202, 46080700, 48166457, 50246344, 52010786, 53316235, 54305454, 55371271, 56766778, 58620497, 60739687, 62780312, 64534527, 65974893, 67281802, 68489492, 69544530, 70320152, 70523171, 70054331, 69136568, 68140755, 67181091, 66272231, 65581473, 65121051, 64909959, 64925647, 65302824, 66117780, 67449777, 69417733, 72017280, 75155257, 78648863, 82394368, 86227350, 90050649, 93709108, 97111719, 100292354, 103393339, 106531853, 109906763]
11470A09906763L945854M689138N440266O404897P570023Q593035R248332R623094
11462A65421402R819593R995592J0506059J1298055J2184468J2362464J1413300
11455B43000933R560390P022947L631355n51078n126603r246401j2932037j5904170
11447B19455336j7430206j7708542j7161975j5929923j3971634j1344478q575674
11440A17332904n819759l205069m49102K338327N044862P549162R791942J1746772
11432A44330039J3525642J5092992J6152355J6244977J4842523J1891025P873746
11425B39953299L453065l50721k732250m229715n337199o488525p512376q119885
11417B08635693q391134q798306r048939q907749q510298p988010p892327p956081
$$ y = [109906763, 113852617, 118541755, 123982021, 130386918, 137956941, 146549976, 155798308, 165421402, 175240995, 185236587, 195742646, 207040701, 219225169, 231587633, 243000933, 252561323, 259584270, 263215625, 262664547, 257537944, 248291543, 235359506, 219455336, 202025130, 184316588, 167154613, 151224690, 137253056, 125908578, 117332904, 111513145, 108308076, 107858974, 110197301, 115242163, 122791325, 132583267, 144330039, 157855681, 172948673, 189101028, 205346005, 220188528, 232079553, 239953299, 243406364, 243055643, 240323393, 236093678, 230756479, 224267954, 216755578, 208635693, 200244559, 191446253, 182397314, 173489565, 164979267, 156991257, 149098930, 141142849]
11409A41142849p636262p047762o624595o611932o808855o750855o175778m928954
11401H8557856l545646k547550j804136j291554j020141q72001j011647j493844
11393G4971337j766648j868968j572788r68111j92202L77277N25027L64589r7544
11384F9771969l32867k41850l14003n96180r52432j228722j424075j490731j367880
11375F1823229j156840j056858r95420j017782r60151p76893n43715l90823n33859
11366E4390888r19015j418680j954868k384769k658619k609814k166673j753021
11358C8525429j286141q27048m80446l74373o41904j006399j608355k152905k417278
11349B7730580k476470k527631k504270k235406k014962j912137j529380j372763
$$ y = [141142849, 133506587, 126458825, 119834230, 113222298, 106413443, 99662588, 93486810, 88557856, 85012210, 82464660, 80660524, 79368970, 78348829, 77476828, 76465181, 74971337, 73204689, 71335721, 69762933, 68794822, 68602620, 68979897, 69504924, 69869513, 69771969, 69439102, 69197252, 68883249, 68287069, 67334637, 66105915, 64681840, 63191109, 61823229, 60666389, 59609531, 58614111, 57596329, 56636178, 55859285, 55315570, 54924747, 54390888, 53471873, 52053193, 50098325, 47713556, 45054937, 42445123, 40278450, 38525429, 37239288, 36412240, 35931794, 35557421, 34915517, 33909118, 32300763, 30147858, 27730580, 25254110, 22726479, 20222209, 17986803, 15971841, 14059704, 12530324, 11157561]
11341A1157561j031515p65539p05403o40401n22800n14532m57591n14852m15396
11332E589532l10768k63186k92866k89349j64803j09178j63884j90446j56483
11323C648569j02529j13247j21248j72007j54433p4525l7327j30367j59212j29992
11313B453682m4807m1697p3771j6080m3847n8917m2315m5031o6380q0612j6117
11302A924108l2230l7063n2350j036m5547k6954k9254n1135M0912j7434p5595
11291A596422k5877K603n8696r0006P624k6335o3812r421l9261l9536O572k1474
11279A238803L7293o578M797l5782q4397K960k6284j5565k8094k5334J8510q436
11267A071893n0001k5199r719m1337J6739R825j746N2944J2788M176o3246J468
$$ y = [11157561, 10126046, 9360507, 8655104, 8014703, 7491903, 6977371, 6519780, 6004928, 5589532, 5278764, 5015578, 4722712, 4433363, 4268560, 4159382, 3995498, 3805052, 3648569, 3546040, 3432793, 3311545, 3139538, 2985105, 2910580, 2873253, 2742886, 2583674, 2453682, 2408875, 2367178, 2293407, 2277327, 2233480, 2174563, 2132248, 2087217, 2020837, 1940225, 1924108, 1891878, 1854815, 1802465, 1801429, 1755882, 1728928, 1699674, 1648539, 1689451, 1672017, 1596422, 1570545, 1573148, 1514452, 1424446, 1432070, 1405735, 1341923, 1332502, 1293241, 1253705, 1260277, 1238803, 1276096, 1269518, 1274315, 1238533, 1154136, 1157096, 1130812, 1115247, 1087153, 1061819, 1080329, 1071893, 1021892, 996693, 986974, 945637, 962376, 972201, 970455, 1023399, 1036187, 1040363, 977117, 978585]
11255I78585N6466k7282J2102j8286p1569n5449l3779K6012K9178M94m5823l1757
11243H18892N519L526L1922j1998k6979n2042m8087P657k3457N357J6614K3476
11231G50400m2750k043k9018k5690k4560j573m6026o5984M0571Q7318K6316q018
11219F58943r30k2909m3129j757K0731K0895l5567l0605l8508j0679L6300N701
11207E58486o0105o4526J0011L6377M2978k1881l8563k2300L2748J9303l5210
11196D57318j6148L6278m608L86o130J1080j2380q784k7617o7426J603n3704J1254
11183C21122P6061j5538l6107K6599Q483k9533n5887l6896O4574J5114O6697K6267
11171D30956l0749o6042J6741K0117K1870l074M010l6216o1486O1806J8073l5447
$$ y = [978585, 1035051, 1007769, 1019871, 1001585, 930016, 874567, 840788, 866800, 895978, 896472, 850649, 818892, 824411, 827937, 859859, 847861, 820882, 768840, 720753, 728410, 704953, 710310, 726924, 750400, 707650, 705607, 676589, 650899, 626339, 624766, 578740, 512756, 553327, 640645, 666961, 658943, 658013, 635104, 591975, 590218, 610949, 631844, 596277, 565672, 527164, 516485, 552785, 558486, 498381, 433855, 443866, 480243, 523221, 501340, 462777, 440477, 473225, 492528, 457318, 441170, 477448, 472840, 473226, 467096, 478176, 465796, 457012, 429395, 361969, 363572, 309868, 321122, 397183, 381645, 345538, 372137, 380620, 351087, 295200, 258304, 322878, 337992, 404689, 430956, 400207, 334165, 350906, 371023, 392893, 389819, 393829, 357613, 296127, 357933, 376006, 340559]
11159C40559L8911L0346L5205m3301o1969j8867N0283R974K7989N5954r055l1379
11147D24650j1083n3652m3387j727J6041p967L0967k1774j4947K4007j3306K2137
11135C49959m5751r547j7669o3990J8716k3695j2173L4700L3402J7978L4880K6546
11123C43356L6916n465k2281k6803p3504J8787m0451K170O4762r061J8060k7658
11111B78828m25m1403n8569j3960J5252j639K0090L4047M3633J4259j7730j936
11099B70447p2785l2069L1283m403n0091j0307O7941R7161m029n8627k9401j5678
11087A89442J1973O0220M2714k685O4812M4070m547N8081M970k4757J7288R0306
11075E51887N6509M1716J2465l4649J1496J999P2246Q3019R337J7206q115J3592
$$ y = [340559, 379470, 409816, 445021, 401720, 339751, 320884, 371167, 381141, 409130, 465084, 456029, 424650, 413567, 359915, 316528, 314801, 330842, 322875, 353842, 332068, 317121, 341128, 327822, 349959, 304208, 294661, 276992, 213002, 231718, 208023, 195850, 230550, 263952, 281930, 316810, 343356, 380272, 374807, 352526, 325723, 252219, 271006, 230555, 232725, 297487, 288426, 306486, 278828, 278403, 237000, 178431, 164471, 179723, 178084, 198174, 232221, 275854, 290113, 272383, 270447, 197662, 165593, 196876, 192473, 142382, 132075, 200016, 297177, 293148, 234521, 205120, 189442, 201415, 261635, 304349, 301664, 366476, 410546, 405999, 464080, 469050, 444293, 461581, 551887, 608396, 650112, 662577, 627928, 639424, 641423, 713669, 796688, 806025, 823231, 815116, 828708]
11063H28708l4278M6763L368m4561o3505j1526Q49o7213q3882N0350P9515l4731
11051F69857o4821q869K6063j5875j645n9444J565Q9766J1480o037m7436M8105
11039F42709O6021J4578L1474J3833N0824R0660J6508o8753n9614n5454m9194
11028F93592L1250L2247M0184n9544l2593N9878n40l847n8875n2801l9331j3985
11016E95635k7158o1470N1266L5052J6887k8842j8595j6040J1464Q0457Q1065
11005G19721K2156M1126J08816M3125J660m797K1366M8038n192j690M1970P5602
10993A111901O6506J6209l6349k2119l992j6642r7979j21424m4950K8807J3023
10982H92991j65508o8300o691M5080K395K957j4286J8881L5509m3123k5424l5727
$$ y = [828708, 794430, 841193, 844561, 800000, 736495, 724969, 725818, 658605, 574723, 625073, 704588, 669857, 605036, 596167, 622230, 606355, 604710, 545266, 546831, 636597, 648077, 642040, 594604, 642709, 708730, 723308, 754782, 768615, 819439, 910099, 926607, 857854, 798240, 742786, 693592, 724842, 757089, 797273, 737729, 705136, 765014, 764474, 760627, 701752, 648951, 609620, 595635, 568477, 507007, 558273, 593325, 610212, 581370, 562775, 546735, 558199, 638656, 719721, 741877, 783003, 891819, 934944, 936604, 931807, 953173, 1001211, 996019, 994329, 1036299, 1111901, 1178407, 1194616, 1158267, 1136148, 1132156, 1115514, 1017535, 896111, 851161, 879968, 892991, 727483, 659183, 652492, 697572, 699967, 702924, 688638, 707519, 743028, 699905, 674481, 638754]
10970F38754m6659J0632R5310J7839k6012J5569k7840K1393K4253k264l2295N8993
10958G47673N71L327K4389O5032N5552M8738j9951j06103n9633Q976j048l3715
10946G33808k5024j5522K6037k6156m5926m3512j2670M4144k3682k9054o2622
10935E19821l086k2544j9413j3131J0583J1536N1883L7359l40l5880J16557M8772
10923G02117l2378J1366M1245o3215p1968n2159r9703L620l0952l875l2013q5475
10911B86610m5943K868j6726l2140J7815L319J9785k624K8459J0576k4433m6976
10899B00590o7905j1098m7011m9182M8485L3444J4560j2843o9187O4780p3211
10888C1422k0365o311M3035K2866J7689L169m5769J5138O268K6120R645k1998
$$ y = [638754, 592095, 602727, 698037, 715876, 689864, 705433, 677593, 698986, 723239, 720975, 688680, 747673, 748244, 751571, 775960, 840992, 896544, 945282, 925331, 819228, 759595, 768571, 767523, 733808, 708784, 693262, 719299, 693143, 647217, 603705, 591035, 635179, 611497, 582443, 519821, 516735, 494191, 474778, 461647, 472230, 483766, 535649, 573008, 572668, 536788, 653345, 702117, 669739, 681105, 722350, 659135, 587167, 535008, 435305, 438925, 407973, 404098, 372085, 286610, 240667, 243535, 226809, 194669, 212484, 215803, 235588, 232964, 261423, 271999, 247566, 200590, 132685, 121587, 74576, 25394, 73879, 107323, 121883, 109040, 39853, 104633, 31422, 11057, 4746, 47781, 70647, 88336, 91505, 45736, 60874, 67142, 93262, 102907, 80909]
10876H0909l0160J9331j0163M8786q986K549K2905l035L1793k1456j0044k0941
10864A01488l5685M79J1402n237L3579N929K1865k1383o246j4536n6430o9740
10852c4515k0971l340J06281M8607K0627L2343P12m5019k4660N0253k6481j8699
10840H5138r29M3742j3643j6466o3528l3047J7672K5627L6612N447Q219l1941
10828F2903m7453j4414N6954M5064J08973l1344m5320j02824o173Q8110L4095
10817A48571p0103j7738q367q68M8054R354j1059n6877J6817M265K9141L2960
10805A24150N265j8706M9973m1037p2797m9060q330J2522L5455P3869L9791m8639
10793A02456n1037M648N7457j7972l2341m930k232L6846j6798L4535J2718l1074
$$ y = [80909, 50749, 70080, 59917, 108703, 99717, 102266, 125171, 122136, 153929, 132473, 122429, 101488, 65803, 66282, 77684, 72447, 106026, 111955, 133820, 112437, 106191, 91655, 35225, -34515, -55486, -58826, 47455, 96062, 116689, 149032, 149744, 104725, 80065, 130318, 103837, 85138, 84209, 127951, 114308, 97842, 34314, 1267, 18939, 44566, 81178, 86625, 94844, 62903, 15450, 1036, 57990, 103054, 212027, 180683, 135363, 32539, 26366, 114476, 148571, 78468, 60730, 52363, 51495, 99549, 108903, 97844, 40967, 57784, 62049, 91190, 124150, 129415, 110709, 160682, 119645, 46848, -2212, -10542, 1980, 37435, 111304, 151095, 102456, 51419, 56067, 113524, 95552, 63211, 58281, 56049, 92895, 76097, 110632, 123350, 92276]
10781I2276j3105K5269K0539m3692j4057k5558K3612K0665n4196j2980K6210O0401
10769A05384M1268m372m752l1691j5010j2553j0548k5018q6472K0861M1801m445
10757A4453k4573l5206R886P4750Q5580l3773p0035k6560Q212L6145K7984n6233
10745A0630Q527L0654O374l5013J6782M8937l6019P223k1273R105L1005M569o9950
10732A1551K8203K3466o1530r18L7362k2902K553j5482l3728K4766M4338L1373
10720F9052L9167j9327n0733o5485J4056M3207M5537j4707J3494o387m66j5794
10708E1614m473l9343K4446k3486j5159N9950O705J0616l340N0183n9138r3644
10696c5069j9405q732N4745j186l6753L1799Q223K9569J4702m0521l1037J9174
$$ y = [92276, 79171, 104440, 124979, 81287, 67230, 41672, 65284, 85949, 31753, 18773, 44983, 105384, 146652, 142280, 137528, 105837, 90827, 78274, 67726, 42708, -43764, -22903, 18898, 14453, -10120, -45326, -35440, 39310, 124890, 91117, 21082, -5478, 2734, 38879, 66863, 10630, 19157, 49811, 56185, 21172, 37954, 86891, 50872, 58095, 36822, 45927, 76932, 81501, 11551, 39754, 63220, 1690, 772, 38134, 15232, 17785, 2303, -31425, -6659, 37679, 69052, 108219, 88892, 38159, -27326, -13270, 29937, 75474, 60767, 74261, 67874, 67408, 51614, 47141, 7798, 32244, 8758, -6401, 53549, 60254, 70870, 67530, 117713, 58575, -35069, -54474, -63206, -8461, -9647, -46400, -14601, -6378, 23191, 37893, -2628, -33665, -14491]
10684a4491P3179L4943k8768j8406K3669r016p5383n225M646K6798Q103k5762
10672e713M948J4278Q0342J3892k2295j1483o1977L7782M6533J1808j3332l8232
10660E6551m0725J8474k7991M5572Q2548P914l5131j2058o2188m7324P07J0978
10648b673J3214R815L4650Q371j3610N267m5554m0776n654M9947K3076j0613O5686
10635I1146N2154n9613q5773m9049k1026J7639L4680k7406k47J6558N1349L8719
10623E9131j2044K1308r105j6320l4908n0919m7610L8266P0577K8937l1347q416
10611G550J009o038l5109n255N1727K6755O5853L6891P910j5236J8070L0222J9172
10598B03521k9767l7457n0707K9473j9834j08135k6354n1939L6482J2649j6632
$$ y = [-14491, 58688, 93631, 64863, 46457, 70126, 61110, -14273, -19498, -14852, 11946, 20049, -5713, -765, 13513, 93855, 107747, 85452, 73969, 11992, 49774, 96307, 108115, 94783, 56551, 15826, 34300, 6309, 51881, 134429, 142343, 107212, 95154, 32966, -14358, -13651, -2673, 10541, 20356, 55006, 63377, 49767, 55034, 9480, -31296, -36950, 12997, 36073, 25460, 91146, 143300, 83687, -2086, -51135, -72161, -54522, -19842, -47248, -47495, -30937, 20412, 59131, 47087, 68395, 59290, 42970, 8062, -42857, -90467, -52201, 18376, 47313, 15966, 7550, 8559, 2521, -32588, -37843, 13884, 40639, 106492, 143383, 151293, 136057, 154127, 184349, 203521, 173754, 136297, 85590, 115063, 95229, -12906, -39260, -91199, -54717, -42068, -58700]
10587e8700O2212K4779J2459J3042l24L1997N3350k8413m5536j2591L2992M4583
10575A29850j366K8506M2385n7710o7407l6664o5375n601L4692N3786K2824k3834
10563E4086J390K2459n3597k0623P405L9403l1694p4935j6731r390k9942L4770
10551g7399Q4095m5624m2741L528J6397M3914J7089l7666O3972K418o0863m7677
10539h0557j8613J23137R3229n5831k7889M853m93n2345j7827L9824J5693Q3606
10527A06787P268p8711n6707q310P1487J5179l5778J6151L2319J284j48K3020
10515I3841m83p609j4889j5147r377j1029j02639K3159M9146m499M9034L1008
10503H0516j7526M1336P547j6909o3903k517R355P5324K5405j0943m466q19J0571
$$ y = [-58700, 3512, 28291, 40750, 53792, 53468, 85465, 138815, 110402, 64866, 52275, 85267, 129850, 128484, 156990, 199375, 141665, 74258, 37594, -27781, -33382, 1310, 55096, 77920, 54086, 55476, 77935, 24338, 3715, 11120, 50523, 18829, -56106, -72837, -82227, -112169, -77399, 6696, -38928, -81669, -78141, -61744, -17830, -741, -38407, 25565, 27983, -32880, -80557, -99170, 23967, 117196, 61365, 33476, 38329, 37836, -14509, -32336, 7488, 23181, 106787, 114055, 35344, -21363, -29673, 41814, 56993, 21215, 37366, 69685, 70969, 70821, 93841, 93358, 85749, 70860, 55713, 46336, 35307, -67332, -44173, 4973, 474, 49508, 80516, 62990, 104326, 111873, 94964, 31061, 28544, 37899, 113223, 138628, 127685, 123219, 122400, 132971]
10490A32971L6987J7573m8648o0207j02794K7039R124k2887K4201L6765L5329
10479H5453j6443l3474o8504j9695N9713M0946j3038l534P0757K9415j5178j1412
10467A05006k1102l5311N5741K44j2715o8090k1477J0822n3364K455J18049J9884
10455A00142n0243n088k5372j6327N8482l903n416N6032R35k3854J7030K4276
10443A26694J3311k6478j4698K1602m1801l5070R651j0038K2213j9525q3605J07746
10431G0002O8405N267m7357j0565p441k4812l8184m7521J570J0715Q484j4887
10419b6324P879Q5813L348j5994J3783l345l5500k0540l51l88l4133M215N4497
10406C2960K0729q601L2310j6623K311L275m4229k2213J2365j8318k6306j7369
$$ y = [132971, 169958, 187531, 138883, 78676, -24118, 2921, 12045, -10842, 13359, 50124, 85453, 69010, 35536, -32968, -52663, 7050, 47996, 34958, 31424, 102181, 131596, 116418, 105006, 83904, 48593, 104334, 104578, 91863, 23773, 2296, 13118, -40246, -37791, 80258, 100142, 49899, 44811, 19439, 3112, 61594, 57691, 52275, 108307, 109242, 85388, 102418, 126694, 140005, 113527, 98829, 120431, 78630, 43560, 53211, 43173, 65386, 45861, -37744, 70002, 138407, 143674, 96317, 85752, 78311, 53499, 15315, -32206, -30636, -19921, -11437, -26324, -18445, 67368, 70716, 54722, 68505, 65160, 29660, 9120, 8769, 8381, -25752, -21537, 32960, 53689, 45088, 77398, 60775, 63086, 66361, 22132, -81, 12284, -6034, -32340, -49709]
10394d9709R697j1627L1717m874k2324J4649M1383J706j8551j133J3421N0741
10382E5096Q6119j950q1060K456M719k9065j9021K640K5209K0114n2039o2879
10370d9661o4092M963J2695L06p549L4519N7475L7934M5551p980k4890j0118P0407
10357I9560p158k7011P886k9276q8111J605j0175j9086M1029Q2389L7786L43J5421
10344A05202k9317O790K1527j2437q848P248M3703r987k7689p214K406j7241K6007
10331A00150l3767k2149K9779l7010m2756j1562K3818n894J4907N5771o8268Q285
10319A1304O0228L061k0064j0671k5785n5457n7323K6308N5642L5791m5141j7386
10307c9493K7947J1592J9151K1097O432k6686J5675N1532J9825J209n9314m7401
$$ y = [-49709, -40012, -51639, -19922, -24796, -47120, -32471, 8912, 10618, -7933, -9066, 4355, 55096, 141215, 139265, 58205, 60661, 65380, 36315, 17294, 19934, 45143, 65257, 13218, -49661, -113753, -108790, -96095, -95789, -103338, -68819, -11344, 26590, 72141, 64161, 39271, 29153, 99560, 92402, 65391, 73277, 44001, -44110, -42505, -52680, -71766, -30737, 51652, 89438, 89781, 105202, 75885, 82675, 104202, 91765, 82917, 90165, 133868, 123881, 96192, 88978, 91384, 74143, 100150, 66383, 44234, 74013, 37003, -5753, -17315, 6503, 609, 15516, 71287, 3019, 11304, 71532, 74593, 54529, 43858, 18073, -37384, -94707, -68399, -12757, 23034, -22107, -39493, -11546, 46, 19197, 40294, 46726, 20040, 35715, 87247, 107072, 108281, 48967, 1566]
10295A566k8338o6204O181Q9662k913J3712L7085L3280l7381n5365P3915L7135
10283A02335k7306k0778J7309k3183j1965j8655M510k9704l610L1970k6686k7375
10271c3138N3453N5976k7859p5191m0764Q7940J21761J2212l7204n2431l1648
10260C3107k8546m5591n3768J9371M2772N7921J8493N3459L0304m3671m8010j6264
10248A9577j5728l154j7163N710L2388L0528K2458L7136k7563l1218j3405m7087
10236g521K6860Q1644p2075n9650l5107J2020P847L9081J374J7759L8909K7680
10224G8821q194l0735j1208q702J4160K8176n6159Q804M7332J3147O354l258k8633
10211D9905J5327l8303l7709l1453Q013J7350K8787O0478L5378n6903k6833M7811
$$ y = [1566, -26772, -92976, -86795, 2867, -46, 13666, 50751, 84031, 46650, -8715, 65200, 102335, 75029, 54251, 71560, 48377, 36412, 17757, 22267, -7437, -11047, 20923, -5763, -33138, 20315, 76291, 48432, -26759, -67523, 20417, 142178, 154390, 117186, 64755, 33107, 4561, -41030, -94798, -75427, -32655, 25266, 43759, 97218, 127522, 83851, 35841, 19577, 3849, 695, -16468, -10758, 21630, 52158, 74616, 111752, 84189, 52971, 39566, -7521, 19339, 100983, 28908, -30742, -65849, -53829, -45982, -6901, -5527, 12232, 51141, 78821, 70627, 39892, 28684, 19982, 34142, 62318, 6159, 14963, 62295, 75442, 81796, 78538, 49905, 65232, 26929, -10780, -42233, -34220, -16870, 11917, 72395, 107773, 50870, 24037, 71848]
10199G1848K1023K1238p4491l5262j6078n679j1887K0063K3519O032l3750j8635
10187c2059j2875k4472P5010P3069j1622p83j8663n1511q1765L3345K7073M302
10175b0951L6468J3490j0902m713N5482J8514k5519N3469K0952p2646l3521l8151
10163h028J1847J9039l1919J8268r918l6057r801p2l3545o305O6596j0491J3963
10150a6423R9803J7488p293j21458l0685R646Q5505L3167Q562k6945l8463J4943
10138B7847j3356o6200q3605K39L8102N3023j5087n3736J3589M8219P5415j6039
10126H411J8496m0011k4691K3812K1713k4297N5080K3768m3309J4680J590k291
10114C2951l9284k8772K4847P3168J2254Q393k5170K3503l0495m3384m7k007o1038
$$ y = [71848, 92871, 114109, 39618, 4356, -11722, -17401, -29288, -9225, 14294, 20326, -13424, -32059, -44934, -69406, 5604, 78673, 67051, 66268, 47605, -3906, -85671, -52326, -25253, -20951, 15517, 29007, 18105, 13392, 68874, 87388, 61869, 115338, 136290, 63644, 30123, -8028, 3819, 22858, -9061, 9207, -711, -36768, -46569, -46641, -80186, -86491, -19895, -30386, -16423, 83380, 100868, 93575, -27883, -58568, -48922, 36583, 69750, 78312, 51367, 12904, 27847, 14491, -51709, -135314, -135075, -96973, -43950, -59037, -112773, -99184, -50965, 24450, 8411, 26907, -13104, -37795, -13983, 7730, -16567, 38513, 62281, 18972, 33652, 35242, 32951, -6333, -35105, -10258, 62910, 75164, 83557, 58387, 81890, 51395, 8011, 7964, 5957, -55081]
10101e5081m2343K6445L6294J399L5924N0566j8434P0994J514k6179m6683j7942
10089A6474K5916j5105K5712J3341j4141n5955k0882J8453K9403k2675M0843Q2202
10077A23586J14794k2230j02716m7648L9599Q4893L1177N7002J3552M5560P6835
10066D14404P9778L4870M2762O4892J14081J14986J52727K17358K63109L71252
10056A870219N85082O75612Q08154J029292J468780K501867M068295M382247L661264
10047B1050812L199388j301832q077237o453234l246342j618352r59011n88120
10039B006072l69546l54127k76252j13569q6963r7242m5456m5501p1817m4712
10029E00887M8301o9064l9996m6968j42218o2455J9097j2406P428O2286k372m0754
$$ y = [-55081, -97424, -70979, -34685, -33286, 2638, 53204, 34770, 105764, 107278, 81099, 34416, 16474, 42390, 27285, 52997, 66338, 52197, -3758, -24640, -6187, 23216, 541, 41384, 123586, 238380, 216150, 113434, 65786, 105385, 190278, 221455, 278457, 292009, 337569, 414404, 494182, 529052, 571814, 636706, 750787, 865773, 1018500, 1235858, 1498967, 1870219, 2455301, 3130913, 3939067, 4968359, 6437139, 8939006, 13007301, 17389548, 21050812, 24250200, 22948368, 14871131, 8417897, 5171555, 3553203, 2594192, 2006072, 1636526, 1282399, 1006147, 892578, 805615, 708373, 662917, 617416, 545599, 500887, 549188, 480124, 440128, 393160, 250942, 188487, 207584, 195178, 202606, 264892, 262520, 221766]
10017B21766j3176p1113O014q900J3264M8703o0346m5684j987k5784l4244k8902
10005c89j4356N7430P158r770l7567k3307J3752R779k3256j0175j3209M4938K2785
9992B3813m005m1403l293J2393J0481n530k5634R516M8307O505r088l8986J908
9979a5016N310J2028J6638m6684m3622j2822O172k899J0694N4352K7836l6675
9967b4688J681M6545j9271J0834j6939j3198J2517K4155l6436j9013L6569k5384
9955b2628p8370K7435K6892L27l8474N6744M2377L7171K5664l8506n519l4815
9943a702R072K1597Q751J0216J6973O001k9771k6843n6360J6421N1094K2452k6792
9930B1109K469j4117j7313K1852R665J6173L5300K514P001J9684j4338K5181o687
$$ y = [221766, 208590, 137477, 143491, 134591, 147855, 196558, 136212, 90528, 88541, 62757, 28513, -389, -14745, 42685, 49843, 40073, 2506, -20801, -7049, 2730, -20526, -30701, -43910, 1028, 23813, 19808, -21595, -24888, -12495, -2014, -7544, -33178, -23662, 24645, 31150, 22062, -16924, -15016, -9706, 2322, 18960, -27724, -71346, -84168, -77996, -80895, -70201, -15849, 11987, -24688, -23007, 23538, 4267, 15101, -1838, -15036, -2519, 21636, -14800, -33813, 2756, -22628, -100998, -73563, -46671, -46344, -84818, -28074, 14303, 51474, 77138, 38632, 33113, -1702, 7370, 28967, 37718, 47934, 64907, 70908, 41137, 14294, -42066, -25645, 25449, 47901, 21109, 23578, 9461, -7852, 14000, 23665, 39838, 75138, 77652, 84653, 104337, 89999, 115180, 108493]
9917A08493l1588n2903K4175L0934o2352k3063K8830L3089o675m5765j12038J7416
9905i1447N8585m1056m3761N6139Q2184j2311j2668j0388K3599M7080J5338l7359
9893C3935n2586m5164L0986N2623M3815p4862J0743K5336j5453J3582k1511K0308
9881B1752J0158K6482k0324o1006K1935k1111J7925J1844m7043L6209K7674J2821
9869C7316Q651l4291M0598J5149J6596m969l6732N1111l876M9768l144k2071L732
9856A17838J9718o6181M989K2032k8641m4983n4776L042J3709K9813R379j0541
9844A5398o082l5944m5912J2077K7087l7207Q983R20L3976r427k4325j308L5892
9831b5872k866K204k895Q1124q927K3576L741l1346J6346m3245o4180R105N3615
$$ y = [108493, 76905, 24002, 48177, 79111, 16759, -6304, 22526, 55615, 48940, 3175, -108863, -91447, -32862, -73918, -117679, -61540, 20644, 8333, -4335, -14723, 8876, 55956, 71294, 33935, -18651, -63815, -32829, 19794, 63609, -11253, -510, 24826, 9373, 22955, 1444, 21752, 31910, 58392, 38068, -22938, -1003, -22114, -4189, 7655, -39388, -3179, 24495, 37316, 45967, 11676, 52274, 67423, 84019, 79050, 42318, 93429, 89553, 139321, 136177, 114106, 117838, 137556, 71375, 76364, 98396, 69755, 24772, -30004, -26962, -13253, 16560, 25939, 15398, 9316, -26628, -72540, -60463, -33376, -70583, -61600, -60680, -26704, -36131, -60456, -61764, -25872, -28738, -26534, -29429, 51695, 42768, 66344, 70085, 38739, 55085, 11840, -52340, -43235, 10380]
9818A0380J8800k1631n7713J283M8398m5169J4996k0674N3456L8607j7502n3710
9806c0479k1986M0465K7335k070L368N3219L8554j6395j4046j3614j7737k9169
9794A7445K3461N199k4766J0812M1252l2519l0422k5424j4009J3818O0716P1602
9782A17165K3062Q340l1328k809k3346l5822m3436l983k052m4686q806O5231L2892
9769E0422n4592j898M0197M9483M8963K1589l6422o7613n6576M4694L2977n0292
9757B0932m6882k6509q402O0459Q05K2453N1415M998n5302J1405o6879p540J9940
9744a9107R581J1435K670l3704j6220K0938J8058p690O668L237K2371L8932j0262
9731D6907n6321l6811J3253n794K9428J8471m0850k6095O7880M7548O3819k8310
$$ y = [10380, 29180, 7549, -50164, -48881, -483, -45652, -30656, -51330, 2126, 40733, 23231, -30479, -52465, -12000, 15335, 13265, 16633, 69852, 108406, 92011, 77965, 64351, 46614, 17445, 40906, 46105, 21339, 32151, 73403, 40884, 10462, -14962, -28971, -15153, 45563, 117165, 140227, 148567, 117239, 114430, 91084, 55262, 11826, 7843, 5791, -38895, -47701, 17530, 50422, -4170, -6068, 34129, 83612, 132575, 154164, 117742, 50129, -6447, 38247, 71224, 20932, -25950, -52459, -60861, -402, 403, 22856, 74271, 79269, 23967, 35372, -31507, -39047, -19107, -9526, 1909, 4579, -29125, -45345, -24407, -6349, -14039, -7371, -4134, 18237, 57169, 46907, -9414, -46225, -32972, -38766, -9338, 9133, -31717, -57812, 10068, 57616, 121435, 93125]
9719I3125l8086j0666k9291m2993Q536Q6139M206K959m900l5115J2029J0733j0197
9706D6479L0868L3918n5156m063j6604N911O4802k4235l8762j5855l8050k685
9694a3432K2617O803l1860n9081o024O7735K7271l2918l563K7128L8059Q31J9193
9681F2759n377k6302K1519m5140K3700L3044N2703n8452n7470k7746l353L8745
9669H630N5926m0385K693K149p5621k1160J6701N1966L0022L56j9637J228J2604
9656B5472N0051j9283n6280m0266o4341L4543J9206n094L4815P8058j189j2362
9644D3330L0056L6855P954k0036j1187q342J8880r6K1229m6941j1922n9421m7964
9631d7605K390k5522l6677J7693q422J6193K4968M0750J427j9773L994M7333L2573
$$ y = [93125, 55039, 44373, 15082, -27911, -19375, 66764, 70970, 73929, 69029, 33914, 45943, 56676, 46479, 77347, 111265, 56109, 52046, 35442, 41353, 106155, 81920, 43158, 27303, -10747, -13432, 9185, 15988, -15872, -74953, -80977, -13242, 14029, -18889, -22452, 4676, 42735, 43566, 62759, 57382, 31080, 52599, 7459, 31159, 64203, 116906, 58454, 984, -26762, -30115, 8630, 64556, 24171, 26864, 29013, -46608, -67768, -51067, 899, 30921, 31277, 11640, 12868, 25472, 75523, 56240, -40, -40306, -104647, -70104, -50898, -55992, -21177, 56881, 55692, 43330, 73386, 110241, 118195, 98159, 86972, 78630, 97510, 97414, 118643, 71702, 59780, 359, -47605, -45215, -70737, -107414, -89721, -98143, -81950, -56982, -16232, -14805, -34578, -30584, 16749, 49322]
9618D9322l4779o985j9205J1852O4774L3197K7534n4005p9611n9442r95J9321
9606d9022M8593N9868K687n6366j4936O0951P504j3964N9552k7100j5076R91n3845
9593I837l7814L7193L4843k4017j7982P377K0793k391J5050Q033j5081O1555j8767
9580G8629m0078R497K3172J7075m3177j6406L4190M087m3293n7220L8894L0617
9568C5987M9366l3583m9145k5722k5746N9326M2557k2523r64K1391n55P387L9597
9555I7373l5862m9152k9280N2981j0298M6310K549j8918j0412j7067j8226J6252
9543B6250J4439J3385O6883m811p6016k6212k1941p485J4430J8362J8722M0878
9531G6884q083J1882J1478j523o8912n013l6870l808O0781k864p018L1734O5246
$$ y = [49322, 14543, 7558, -11647, 205, 64979, 98176, 125710, 71705, -7906, -67348, -68343, -49022, -429, 59439, 62126, 5760, -9176, 51775, 59279, 45315, 104867, 77767, 62691, 63682, 9837, -27977, 9216, 44059, 20042, 2060, 9437, 30230, 27839, 42889, 50922, 35841, 97396, 78629, 38551, 48048, 71220, 88295, 45118, 28712, 62902, 66989, 23696, -33524, 5370, 35987, 85353, 51770, 2625, -23097, -48843, 10483, 53040, 30517, 29553, 50944, 50389, 57776, 97373, 61511, 12359, -16921, 36060, 25762, 72072, 74621, 55703, 45291, 28224, 9998, 26250, 40689, 54074, 120957, 116146, 40130, 13918, -8023, -15508, -1078, 17284, 36006, 76884, 68801, 80683, 92161, 90638, 21726, 16713, -20157, -23965, 36816, 33952, 26934, 58668, 123914]
9518A23914n778r415j1688k4613n1560r603n693P8160q193l7282k8863K7457m805
9505C2038k6822K5919j7518j3296o64j1387l1435L9051P4032k043m9832M7039
9493F5082K8602n8178K4555K5847l2251o2009m3508L5472L8091r26J746J9639
9481D2162K5157O0772m2873j1256L9011J4878o260j02251l2050O4000k1824K0942
9469E0408j5669j6624l9194j4074O922N1548J4193l865n104k003k3377M102N5404
9456F2667k5965r1064o0079M9940M8423J9806j163L8975L5068O6746m710j9303
9444A19341m6265P938L3650J8254N537l5985m7529k1263j2509l8690l2756O3261
9432A2984K3101o4560K9949Q879l217M686l3733k0906j5904N0293N4747L9739
$$ y = [123914, 118136, 108721, 97033, 72420, 20860, 11257, 5564, 83724, 75531, 38249, 9386, 36843, 32038, 5216, 31135, 13617, 321, -343, -11730, -43165, -4114, 69918, 67875, 18043, 65082, 93684, 35506, 60061, 85908, 53657, -8352, -51860, -16388, 21703, 20777, 22523, 42162, 67319, 128091, 85218, 73962, 112973, 127851, 121591, 19340, -12710, 51290, 29466, 50408, 34739, 18115, -21079, -35153, -28231, 23317, 37510, 33645, 28541, 26538, 3161, 7263, 62667, 36702, -54362, -114441, -64501, -16078, 3728, 2565, 41540, 76608, 143354, 138644, 119341, 73076, 81014, 114664, 132918, 138455, 102470, 54941, 33678, 21169, -17521, -50277, 12984, 36085, -28475, 1474, 10353, 7136, 11822, -21911, -42817, -58721, -8428, 46319, 86058]
9420H6058k1828k1853J6442k897o6085k5172L9931K2216K7950N3614K0793p365
9408A21804K2555o928l6709n799J9794K641o1276m2942J3310k035K4438O3825
9396A12678L876m1881l0172K3791J2308J8932l0742j637K2362l2737n1460m6377
9384d1059j6125k07L559M2896L1499M6381N147m0280J3019K0155L960L5312l765
9371A00492j7319O374J7462k3428k0861L3227K3918j305j8445l5625K0272j685
9359H3077K5448J3371n2647k5127j3979k4714k0861K7613N8020m1484M8023M6672
9347A23412o7750N290Q485J7557n1266K296J3875k458j9612m3636M7159O2232
9335I5584M8471m2271k418J6561O703k0702n7243p0283j7700M5974L7870K0104
$$ y = [86058, 64230, 42377, 58819, 55922, -10163, -35335, 4596, 26812, 54762, 108376, 129169, 121804, 144359, 137431, 100722, 94923, 114717, 117358, 56082, 13140, 26450, 24415, 48853, 112678, 116554, 74673, 44501, 68292, 80600, 99532, 68790, 67153, 89515, 56778, 5318, -41059, -57184, -57391, -53832, -10936, 20563, 66944, 72091, 31811, 44830, 64985, 68945, 104257, 100492, 83173, 89547, 107009, 83581, 62720, 95947, 119865, 118560, 100115, 64490, 84762, 83077, 108525, 121896, 69249, 44122, 30143, 5429, -15432, 12181, 70201, 28717, 76740, 123412, 55662, 60952, 69437, 86994, 35728, 38024, 51899, 49441, 29829, -13807, 33352, 95584, 144055, 101784, 99366, 115927, 122630, 101928, 44685, -25598, -43298, 2676, 40546, 60650]
9323F0650N2849j0853N3930J8712l6875k263L4805M4408j7931L1901J0002l080
9311B36255j3743k4558p299M3112m3178J632J7083m0817m4114K7889M9786l8140
9299A63908L2335j7255K9207K2774m8018l1359j0161L6694L6664m9359L4676q029
9287A92077J0647L3179J8694J0639J6087j6633J1719K6980J1459p7256m5159j1569
9275A80864l148O6347J4585p9144K1749J7345J6369o953K9273M5380m4415l6983
9263B21269q050O805M9422P356m1834m6977P533Q648L9213J2029k2348L9627P447
9250B80140N612j7189J0271M0369l6177J5808L3790k3851M1749J0548j0973m142
9238C45955J5406K2808k624K3524l6286N468L9116M7747O516p590R104K8437n2340
$$ y = [60650, 113499, 102646, 156576, 175288, 138413, 136150, 170955, 215363, 197432, 229333, 239335, 236255, 222512, 197954, 190655, 233767, 190589, 192221, 209304, 168487, 124373, 152262, 202048, 163908, 196243, 178988, 208195, 230969, 182951, 151592, 141431, 178125, 214789, 165430, 200106, 192077, 202724, 235903, 254597, 265236, 281323, 264690, 276409, 303389, 314848, 237592, 192433, 180864, 177716, 244063, 258648, 179504, 201253, 218598, 234967, 228014, 257287, 302667, 258252, 221269, 213219, 220024, 269446, 276802, 234968, 187991, 195524, 204172, 243385, 255414, 233066, 272693, 280140, 285752, 268563, 278834, 319203, 283026, 298834, 332624, 308773, 350522, 361070, 350097, 345955, 361361, 384169, 381545, 405069, 368783, 374251, 413367, 461114, 467630, 460040, 469144, 497581, 445241]
9225D45241J6395K5556J7950j7339J076J9074N763N5907N1823K7805K1951J6012
9213F87214R488M7640J4796l9562l1661O8900P6240M4556L8945O5341k5613q252
9201I48032O955Q1864L0960K1323L9640L6073j910P5272M0716J23241R4925N4859
9189A551950q914O7166J4424P4504Q2027N6164P4970J44767O7091M5845L5505
9178B205499O7828N5825K1012N1567P3026Q7870O8238L4902J46192P0528M0383
9167B922870R2704P0412J20898Q6411Q7033M3709Q0616J11026L8937O8980O3986
9156C787582m1031n207r3752k1481K4036K5931K1077l3910p0611l4912r3737r0284
9144C373701j05806j02207o4471k1831j9585q380k6352j50012j02389k4633k9423
$$ y = [445241, 461636, 487192, 505142, 487803, 488879, 507953, 513716, 569623, 621446, 649251, 671202, 687214, 696702, 744342, 759138, 719576, 687915, 756815, 833055, 877611, 916556, 981897, 956284, 948032, 954987, 1036851, 1067811, 1089134, 1128774, 1164847, 1162937, 1238209, 1278925, 1402166, 1497091, 1551950, 1543036, 1610202, 1624626, 1699130, 1781157, 1837321, 1912291, 2057058, 2124149, 2169994, 2205499, 2273327, 2329152, 2350164, 2401731, 2474757, 2562627, 2630865, 2665767, 2811959, 2882487, 2922870, 3015574, 3085986, 3206884, 3293295, 3380328, 3424037, 3504653, 3615679, 3654616, 3723596, 3787582, 3746551, 3741344, 3647592, 3626111, 3650147, 3676078, 3697155, 3663245, 3592634, 3557722, 3463985, 3373701, 3267895, 3165688, 3101217, 3079386, 3059801, 3051421, 3025069, 2875057, 2772668, 2748035, 2718612]
9133B718612p1919j16622n5691j22139r5175M103o7817j38641j08188j08368o2300
9122A775855q5823n9421l3611J136p5372l8146j1607n8682j39445k6989J3484
9111A261379j1286J7004m6115o8405K8170l1577j05646l0114L5325n4841o8420
9100I25474n5621j7834j1650m7711J010j8192q1759o0637p645m5990M0100M8777
9088F68322K2669J0575q7961q1374N733K2319K8905j0100j0542N677l6451o1503
9076D76269k4929J2806j6037k7733q618J790l282l0724N8828N7628J1054p0411
9064D36641n0186J6246L2856n4259n957m5250j6759M8063j1749k2044m779j1585
9052C11238j3292J7220J2891j9048n3071q694k3710P7654P8104k9177m7061j2410
$$ y = [2718612, 2646693, 2530071, 2474380, 2352241, 2257066, 2261169, 2193352, 2054711, 1946523, 1838155, 1775855, 1690032, 1630611, 1597000, 1598136, 1522764, 1484618, 1473011, 1414329, 1274884, 1247895, 1261379, 1250093, 1267097, 1220982, 1152577, 1180747, 1149170, 1043524, 1013410, 1048735, 993894, 925474, 869853, 852019, 840369, 792658, 793668, 775476, 693717, 633080, 625435, 579445, 619545, 668322, 690991, 701566, 613605, 532231, 537964, 560283, 589188, 579088, 568546, 574223, 537772, 476269, 451340, 464146, 448109, 420376, 411758, 413548, 410266, 379542, 438370, 495998, 507052, 436641, 386455, 402701, 435557, 381298, 375341, 330091, 313332, 361395, 349646, 327602, 322823, 311238, 297946, 315166, 328057, 309009, 255938, 247244, 223534, 301188, 379292, 350115, 303054, 290644]
9040B90644j9174k7847n8586l545M3068m1365Q364k768K1958M8570q355N1969
9028C02933j8377p5053q7558O500J8340L5159l0931J6033K8102J2545K3210k0675
9016B10228L0663M6055L8120K837l1885r2406k8961L9828j8q7841q020K5931J6515
9003A61046J9008K8108j5099n5014p2086k0175L9340o233n104L4290L8335k3793
8991A22623n9785p5269l1573J09431N8250M418L6696J9851L3264K813q2884k2850
8979A14985j897n2409L5230M1947J4458P846O313l2914Q048o1417m9159k2913
8967H118j1701P58K2642P1741L0403L0199k6422m1853M7238L4806L8810l536j5828
8954A85375j0391k9869R800K4642l2991j2615J6029O2647j8730p2411k8906m3662
$$ y = [290644, 271470, 243623, 185037, 181492, 224560, 183195, 191559, 188791, 210749, 259319, 250964, 302933, 284556, 209503, 121945, 128445, 146785, 181944, 151013, 167046, 195148, 207693, 230903, 210228, 240891, 286946, 325066, 327903, 296018, 203612, 174651, 214479, 214461, 126620, 118600, 144531, 161046, 180054, 208162, 193063, 138049, 65963, 45788, 85128, 78895, 73791, 108081, 146416, 122623, 62838, -12431, -44004, 65427, 123677, 128095, 164791, 184642, 217906, 220719, 137835, 114985, 113088, 60679, 95909, 137856, 152314, 160160, 166473, 133559, 141607, 80190, 31031, 8118, -3583, -2825, 19817, 91558, 121961, 152160, 125738, 83885, 131123, 165929, 204739, 201203, 185375, 174984, 145115, 154915, 179557, 146566, 133951, 149980, 212627, 193897, 121486, 92580, 48918]
8942D8918L5182M1756K3382N566m71r794m3979J5960K448m284m313J8191J0290
8929A38852k5567l1401K6162k6788j609m5957k3241N5411Q494p150K8888O0579
8917A56673O654n4814k3778j491l422K2108m1132k4563J5508r141K946J5834J1545
8904G2927M3734J5691r082q289J5141k1832m013K8946o4003m2411o826P763N863
8891C3609j8485M799O2415K7281m6010n8728L860J7599O7241J4111l5164k0681
8879E1847j2026M3043o69k6056N4240L7116m4817o3855k9939J5625k8041l492
8867g024K2917K6057k5590l9553m151K2231J5860J8685L0578m1432l6645J2928
8855e139P9534L9428q6741p5754q584j2153K3945J01855J6830j8150Q156j0941
$$ y = [48918, 84100, 125856, 149238, 154804, 154333, 144539, 100560, 116520, 118968, 114684, 110371, 128562, 138852, 113285, 81884, 108046, 81258, 79649, 33692, 10451, 65862, 74356, 67206, 96094, 156673, 163327, 108513, 84735, 83244, 79822, 101930, 60798, 36235, 51743, 42602, 45548, 61382, 72927, 116661, 132352, 123270, 114981, 130122, 108290, 104277, 133223, 69220, 26809, 19983, 27746, 33609, 15124, 19923, 82338, 109619, 63609, 4881, 8741, 26340, 93581, 107692, 72528, 51847, 39821, 82864, 82195, 56139, 110379, 147495, 102678, 38823, 8884, 24509, -3532, -7024, 15893, 41950, 16360, -23193, -27344, -5113, 10747, 29432, 60010, 18578, -18067, -5139, 74395, 113823, 27082, -48672, -57256, -69409, -45464, 56391, 73221, 55071, 63227, 52286]
8843E2286m9409J5559j032o5794k4110J05931R2128j7077m6423n503k8666J8642
8831D6532M9670j9004j1277j9415m032L2403N8586K1209j14345r3052k6031J4360
8819f4396N8340L232K3075M2059J5386k4904l488M5562M5344r2441n6435N145
8807c521L449N6114k4448J947k2729N3456O8614j2208J581q184m7195K0125L3853
8794A20854m2570P082L7513J7674l5861l3191L1814M6761l0370m8005n4077l3494
8782a5870Q3766L118k6211n4826K5916j007j6527K4050M4522J3763N5065k8274
8770A07485o3976J4457Q4016L3886k4817o2281p3072k1996O4178R796j7451P2639
8758A22864J6873m4245l8584l1875j8367O619M4732J4957J7106K6810l4000l8176
$$ y = [52286, 2877, 18436, 17404, -48390, -72500, 33431, 125559, 108482, 62059, 56556, 27890, 46532, 96202, 77198, 65921, 46506, 42474, 74877, 133463, 154672, 40327, -52725, -78756, -64396, -6056, -2824, 20251, 62310, 77696, 52792, 49304, 94866, 140210, 47769, -8666, -3521, -72, 56042, 31594, 33541, 10812, 64268, 132882, 120674, 122255, 114071, 66876, 87001, 120854, 78284, 85366, 122879, 140553, 104692, 71501, 103315, 150076, 119706, 71701, 17624, -15870, 67896, 71014, 44803, -10023, 15893, 14886, -1641, 22409, 66931, 80694, 135759, 107485, 43509, 57966, 141982, 175868, 151051, 88770, 15698, -6298, 57880, 67676, 50225, 122864, 139737, 95492, 56908, 25033, 6666, 13285, 58017, 72974, 90080, 116890, 82890, 44714]
8746D4714n5760j5962L4221M6954j054j9969k4950j3588q518M2348K4777o2409
8734i196k1602J3809Q729N6194P7942j5975k6116M1675K5791l1837j00286j3034
8722F094m1803J3403n1689K602K5292l1482l1578Q473J07032P0175R519N8241
8710A44279j8773j5338L7315l753l5597m7469l7854p05K3705N2314J6486n6013
8698E8597J660K6977j6379Q120m1995k4646P9511K5285k5585N443l8094m3197
8686A5697n102L8854L4748K7679K7802L949m232N550j6600j3999n4089k543J5166
8673G2880j6722q4L3972K5214l1205m1589j5352j5553J8046L350O6206L2697J9722
8660A51582M5136m8227o5388p7116j0686M1273j5291M0828O3063L0078J9384m8660
$$ y = [44714, -11046, -27008, 7213, 54167, 53113, 33144, 8194, -5394, -13912, 28436, 53213, -9196, -30798, -16989, -8260, 47934, 125876, 109901, 83785, 125460, 151251, 119414, 19128, 6094, -35709, -22306, -73995, -71393, -46101, -77583, -109161, -100688, 6344, 76519, 86038, 144279, 125506, 110168, 147483, 143730, 108133, 60664, 22810, 22105, 45810, 98124, 114610, 58597, 60257, 87234, 70855, 78975, 36980, 12334, 91845, 117130, 91545, 96988, 58894, 15697, 10595, 49449, 84197, 111876, 139678, 143627, 139395, 144945, 128345, 114346, 60257, 57714, 72880, 56158, 56074, 90046, 115260, 84055, 42466, 27114, 11561, 29607, 32957, 99163, 131860, 151582, 196718, 148491, 83103, 5987, -4699, 36574, 21283, 62111, 125174, 155252, 174636, 125976]
8648A25976m392K4717J9547j9558k3638Q133k3586M3107N3894k1716m6189K6639
8636A62934K4657P589P2078O292j7267L0013J3787K0745M5802M9230K03258J59347
8624G78465J70839K42276L70201M99856M37626L73572o910p21132p74835n23594
8614H46364k58619j07745n2332j00841m7848L2023J4191m3964m5447j0413J6510
8603B41879L3914p047j9533J3613k3856K1158m41k9262k9867k9558K6455P8207
8591B75662L4127O8935Q6819L1625L9934P228O6986J17995J66865J89092J50646
8580A235914K61235M57188P52877R63959Q91816Q37131M44681r40635j803349
8571C100817j177424n99713l20804k04339j05310j53587j15174j07614k993J8746
$$ y = [125976, 121584, 146301, 165848, 146290, 122652, 130785, 107199, 150306, 204200, 182484, 136295, 162934, 187591, 195180, 267258, 273550, 256283, 286296, 300083, 320828, 366630, 415860, 619118, 778465, 949304, 1191580, 1561781, 2061637, 2499263, 2872835, 2865925, 2144793, 1369958, 846364, 587745, 480000, 427668, 326827, 278979, 311002, 325193, 281229, 235782, 225369, 241879, 275793, 268746, 249213, 262826, 238970, 260128, 259687, 230425, 200558, 171000, 197455, 275662, 309789, 378724, 465543, 497168, 537102, 544330, 611316, 729311, 896176, 1085268, 1235914, 1497149, 1954337, 2707214, 3671173, 4562989, 5400120, 5844801, 4904166, 3100817, 1923393, 1323680, 1002876, 798537, 693227, 539640, 424466, 316852, 313859, 332605]
8561C32605p3867j1854p289L6488l6388r1788k7590N6357j3747M700L1827L0874
8549B30328K4748K0409m385j2177n4417l5380Q940q362Q5733J9517N0374J43599
8537D68927J08513J73770J85002K57918M23759N03064L55340K46741j51836p66401
8527A804797p52500l85719j70857q8926q0290o5969K2047J7632m0406j34054M572
8516A30327N530j9068J616L9330j7305p347l6389k1722L9780M818M365L1669r751
8503A45853r9235j0097J6284M2661k2296k0919n256p8465m2374M4710N0093K1465
8491D2424o248M7946P34M1621j4314k4711N3059j7645n3150l5531k8683P4305
8479G9807N0154q919j0872j4633o6866q830M4153m9538j2245q695M2266R897N900
$$ y = [332605, 258738, 246884, 239595, 276083, 239695, 147907, 120317, 176674, 162927, 167627, 199454, 230328, 255076, 275485, 271100, 258923, 204506, 169126, 178066, 169704, 255437, 274954, 325328, 468927, 577440, 751210, 936212, 1194130, 1617889, 2120953, 2476293, 2723034, 2571198, 1804797, 1052297, 666578, 495721, 406795, 326505, 260536, 282583, 300215, 259809, 125755, 130327, 135857, 116789, 118405, 157735, 140430, 133083, 96694, 74972, 114752, 119570, 123935, 155604, 145853, 46618, 36521, 52805, 95466, 73170, 52251, 46995, -31470, -73844, -29134, 20959, 42424, 36176, 84122, 84856, 126477, 112163, 87452, 140511, 122866, 69716, 34185, 5502, 79807, 129961, 121042, 110170, 95537, 28671, 19841, 63994, 14456, 2211, -6484, 35782, 45679, 51579]
8466E1579O1184J4200j3674k1521K2589K787N34m0664l0697k7044L5632K3553
8454G8458K592j961n1625n6082J5627M7978O550K6983R027L0292k7444l5332k730
8441D2333N2578M943l5579k5912K5054K0490n6783q1600j0417J9655P932J3142
8429b4164r14p86M7404K6166N6555k0835p0888k8546M593K6366l0581l6798M3082
8416i346J2962n929n252l5717J798K6431J870O939O6352k5774n8544k9480j2464
8403f6154j9593Q134J5561q057m0301L3742N7355N3340L9487L2718K5247l8768
8391I2711J9721K8641q6783j7590L249j9245J9166J0807J403Q372L8459L8350
8379A37261k5821p0259k5821L1355K985K7855k4352k3417k5841R09J1692Q074
$$ y = [51579, 112763, 126963, 113289, 91768, 114357, 117144, 117678, 77014, 46317, 19273, 54905, 78458, 81050, 79089, 27464, -28618, -12991, 34987, 41537, 68520, 77547, 107839, 80395, 45063, 42333, 94911, 99854, 64275, 38363, 63417, 83907, 27124, -54476, -64893, -45238, -37306, -24164, -25078, -25864, 21540, 47706, 104261, 83426, 12538, -16008, -11415, 14951, -15630, -52428, -9346, 3616, -2313, -7565, -43282, -41484, -15053, -13183, -6244, 60108, 34334, -24210, -53690, -66154, -85747, -77613, -62052, -70109, -110410, -76668, -19313, 34027, 73514, 106232, 131479, 92711, 112432, 141073, 54290, 36700, 39949, 20704, 39870, 50677, 52080, 60452, 98911, 137261, 111440, 41181, 15360, 46715, 49700, 77555, 53203, 29786, 3945, 4854, 16546, 24620]
8367B4620l602m3751l3041M0675J993o2401k4432K3641R0214L006m829j9492l768
8354a1167o1795M2072L8230j8626m1000l0432N2161R4955M539M8103K155m1894
8342G7301r376j2953J6348L0249l1137j6250k458R904o719l3835l5728k0072M5365
8329A0639K0467K6652l403o9609l2084K8511K8757j533o4224l5390J6535L5021
8317c9661j3039Q885L0501m8438p1241N84M5784M5499L4438N121j9039K1315O268
8304F977p2403O146N0859J4238j0276K1252M4279k8611o1850j8379J1622K9018
8292g128n686J0111Q9M037l8449K8124Q742n636N8728k2967J2203K5321L6924
8279A04413o1105k3489O848n2897L5279J10p0261k5334K8813K5200L0052J8249
$$ y = [24620, 21018, -22733, -55774, -15099, -13106, -75507, -99939, -76298, 13916, 16922, 12093, -7399, -11167, -72962, -30890, 7340, -11286, -52286, -82718, -30557, 64398, 68937, 117040, 119195, 77301, 67925, 54972, 71320, 101569, 70432, 54182, 51724, 61628, 54909, 21074, -14654, -34726, 10639, 31106, 57758, 54355, -15254, -47338, -18827, 9930, 8397, -55827, -91217, -74682, -39661, -52700, -43815, -13314, -61752, -132993, -132409, -86625, -41126, -6688, -1567, -20606, 709, 6977, -65426, -59280, -8421, 5817, -4459, 16793, 61072, 32461, -29389, -47768, -36146, -7128, -12814, -2703, -2614, 1423, -37026, -8902, -160, -5796, 52932, 29965, 42168, 67489, 104413, 43308, 19819, 26667, -26230, 9049, 9159, -61102, -86436, -57623, -32423, -2371, 15878]
8267A5878M390j068o4922l2284N6960J4443K3056j7746J1764k7170K4437k1385
8255a3647m0024Q520K0649J9464J8276l8876j6445J1458P7843r796j01228K373
8243f1433L8295n5826k087O3775M2710K1918j0025P302k6332k9187k3034J0101
8231b3823N2871k4624m5049l1761L4006N5552J4130k271o654j9178J2782L8956
8219E4937n9432k7381k4023K9664L4466K630l3243L898J6698j6079l8933J6633
8207d0165R4670J1764l5913K9857j8669j8243l184j2087q949j984M7066j9985
8195B4178m400k1001l2549j5240p689K2442K0907M0859J011L9070l0168n3654
8183a6234r099m1615J5903J7641P1827P2016o0178r0094N893j0300J4029J4174
$$ y = [15878, 20268, 19200, -45722, -78006, -21046, -6603, 16453, -1293, 10471, -16699, 7738, -13647, -53671, -45151, -24502, -5038, 13238, -25638, -42083, -30625, 47218, 37422, -63806, -61433, -23138, -78964, -81051, -17276, 25434, 47352, 37327, 44629, 18297, -10890, -33924, -23823, 29048, 4424, -40625, -72386, -38380, 17172, 31302, 29031, 22377, 3199, 15981, 54937, -4495, -31876, -55899, -26235, 8231, 10861, -22382, -18484, -1786, -17865, -56798, -40165, 54505, 66269, 30356, 60213, 41544, 23301, 20117, 8030, -919, -2903, 44163, 24178, 19778, -1223, -33772, -49012, -56701, -34259, -13352, 27507, 28518, 67588, 37420, -16234, -25333, -66948, -51045, -33404, 38423, 110439, 50261, -39833, -33940, -44240, -30211, -16037]
8171a6037j5753l4147j5022O0675M6120j5396j7959j4039K9408M5490R144L8120
8159A00604M4258K0128l4896o4787o24k7218l9966j5816L8195O6924L5219o8637
8147E3384n7950M35L3555p67l9712J4721M3279K6469r526L9848n838l4103K3424
8134H7219M2511l5214M223N5348K7318l7713n0081q7545K714P1259m0475k7244
8122A2320K3470J0323l5085M109k6145l5499k9831j3730O9129K2466P82m8185
8110d5876o136K987K6045K8363N7385j9321m993o6270L3509j3175k5934j531K7247
8097g700N3156K0009n5405n9842l937J9578L8867M1665J3278k6685m8471k2208
8085c7695n2971k4968j1370m3247M8762R6136Q4284K69J3632J0636Q728l0127
$$ y = [-16037, -31790, -65937, -80959, -20284, 25836, 10440, -7519, -21558, 7850, 53340, 62484, 100604, 144862, 164990, 130094, 65307, 64683, 37465, -2501, -18317, 19878, 86802, 122021, 53384, -4566, -4131, 29424, 28657, -11055, 3666, 46945, 73414, 63888, 103736, 97898, 63795, 87219, 129730, 94516, 98739, 154087, 181405, 143692, 93611, 6066, 8780, 80039, 39564, 12320, 35790, 46113, 11028, 15137, -11008, -46507, -76338, -90068, -20939, 1527, 2309, -45876, -52012, -49025, -22980, 5383, 62768, 43447, 38454, -27816, 5693, -7482, -33416, -34947, -7700, 45456, 65465, 10060, -49782, -53719, -34141, 4726, 46391, 59669, 32984, -15487, -37695, -90666, -115634, -127004, -170251, -121489, -25353, 58931, 59200, 72832, 83468, 92196, 62069]
8073F2069o6883m4479j9514J3785k4699J7836j9315J4517K977P8885K193j7893
8061e21R815J321l968K7019O362J7505K0570K9728p1541o9469m74R452N6439N139
8047C7377k34k6483q967k8642K2519J6496J6776l4704O670R981l3441j170K4279
8034D57O105o79k2153k2920o870L9117K6223j2111m5966o5768m898K1656K5189
8021f2618M8913R43K9419M0251K1899k4361q7602j944M1692j8144J7554l6851
8009c0849L2685N362n4470j560J3421N945L1822j4997n5223O7102M4167M4111
7997H7516q977q2597J9394M7537m7870m9585j9735L1968P1485j8751j1451K9986
7985D8920K7688o4985k8911K457l4891J5271l2618m6904M2424O3353j9221J2263
$$ y = [62069, -4814, -49293, -68807, -55022, -79721, -61885, -81200, -66683, -63706, 15179, 17372, -521, 9294, 10615, 6647, 33666, 40028, 57533, 78103, 107831, 36290, -33179, -33653, -24201, 32238, 37377, 37143, 10660, 1693, -26949, -4430, 12066, 28842, -5862, 808, 10789, -22652, -23822, 457, 6562, 5883, -16270, -39190, -46060, -6943, 19280, 7169, -38797, -104565, -109463, -87807, -62618, -13705, -12762, 16657, 56908, 78807, 54446, -33156, -35100, 6592, -11552, 6002, -30849, 1836, 7198, -47272, -48832, -35411, -29466, 2356, -12641, -67864, -762, 43405, 87516, 78539, -4058, 15336, 62873, 15003, -34582, -54317, -22349, 49136, 30385, 18934, 48920, 76608, 11623, -17288, -14831, -49722, -34451, -67069, -113973, -71549, -8196, -27417, -15154]
7973a5154Q8094R696n4366j020k6220m014j2881J6934N6722Q476K5310k3263k704
7960F5610J7007k3850k1010L3255j3091k0667j9315N004N9108J6786N9343j719
7948A56461l7285l9794l5826J745n0555o449O8969l7597P643L1614l2255j2214
7936A4457k0234L8305q259p960J4338J62k053J7333J6167Q246o5969o4881M2946
7923a7402N3795j8030N994P2199p268j6594J8819o2505J5850Q127l6336J8876
7911C5525K701K6720M5384j0663k3779l6494m2780m1434m056J9168N3578M048
7899B7918j8161L5958n2526j6166K7112R319p3856l7006l7450M0361K8632L0190
7887c5675J0712l2876M1875M616M2509L0071m675l6885m3521M4742j7239o3777
$$ y = [-15154, 72940, 82636, 28270, 27250, 1030, -2984, -15865, 1069, 57791, 66267, 91577, 68314, 65610, 82617, 58767, 37757, 71012, 57921, 37254, 17939, 22943, 82051, 98837, 158180, 156461, 119176, 79382, 43556, 45301, -5254, -11703, 57266, 19669, 27312, 58926, 26671, 14457, -5777, 32528, 24269, 16309, 30647, 30809, 28756, 46089, 62256, 70502, 4533, -60348, -17402, 36393, 18363, 24357, 96556, 89288, 72694, 91513, 29008, 44858, 52985, 16649, 35525, 38226, 64946, 110330, 99667, 75888, 39394, -3386, -44820, -48876, -29708, 23870, 27918, 9757, 45715, -6811, -22977, 4135, 13454, -60402, -97408, -134858, -94497, -65865, -35675, -24963, -57839, -15964, -11348, 31161, 61232, 56557, 19672, -23849, 20893, 3654, -60123]
7875f0123L0790K1172m6074J3351K0715j0881j9409O71l5478n2323L3256R0764
7863a3569N0306m0515p6964r95r833k230K633R9046N7221K4048K9520n9597q0107
7850b1036K6848J12317l3147o9887l9668l7020K632L8370L7527N658L926q380
7838A8140l7597K1740K8409j61j8290L394k9980l1204m8128R737O4627o526J4125
7825a1714m3776l2203l4335J0097M3477L3144k0328p790j7666K8388R2032K8780
7813F8106j1087j9580M6048K1050J8990L5098k5788l5204r777L0716m3254n7546
7801A7772p1213l1091M3626N8954j3927r364m1747L1436Q6572N574j8545r147
7789D8900k6541p7652o9080P7060K3503N1837L6407m0840o8199j7439K725J5357
$$ y = [-60123, -29333, -8161, -54235, -40884, -20169, -31050, -50459, -49788, -85266, -137589, -104333, -13569, 36737, -3778, -80742, -81737, -91570, -93800, -91167, 7879, 65100, 89148, 118668, 59071, -21036, 5812, 118129, 84982, 15095, -24573, -61593, -58961, -20591, 16936, 22594, 26520, 18140, -19457, 2283, 30692, 30531, 12241, 15635, -14345, -45549, -93677, -83940, -19313, -25839, -11714, -55490, -87693, -122028, -111931, -68454, -35310, -55638, -63428, -81094, -52706, 39326, 68106, 57019, 37439, 83487, 104537, 123527, 158625, 132837, 97633, 87856, 118572, 75318, 17772, -53441, -84532, -40906, 18048, 4121, -5243, -46990, -15554, 71018, 76592, 58047, 48900, 22359, -55293, -124373, -47313, -23810, 28027, 64434, 23594, -44605, -62044, -59319, -43962]
7777d3962M8447J7052k7954m0771k3294K9008R876q6390m101N0803J0822k8182
7765h8646J6946K7699j7071M3300K4793J480j6616N2733k4870n8925J4023J0249
7753a4905k7868p551o3516J0995m0870j7449L2773J402Q1087P7175J1683j4808
7741B8148p6248j0936l449N5062L3800J4713n2393p321L8833M9014r100l7037
7729B3086m9687q3489M4732p524K6980O1821P2197N8125j8568l2019l9707l5930
7717B0017L5340k0404j8438M210L987K1635J8551j5830l2736L3422j3523q8204
7705e1973J821M3223j7335j2774L6743L2529o853k753l2333m8640k1504P880M0093
7692c1876O6564O6256P006K1060m245K0206n2777J3136l1240r7434p1460n5355
$$ y = [-43962, 4485, 21537, -6417, -47188, -70482, -41474, -31598, -117988, -122089, -71286, -60464, -88646, -71700, -44001, -61072, -17772, 7021, 8501, -8115, 44618, 19748, -39177, -25154, -14905, -42773, -50324, -113840, -102845, -143715, -161164, -128391, -126989, -45902, 31273, 42956, 28148, -48100, -59036, -62485, -7423, 26377, 41090, -11303, -18624, 20209, 69223, 60123, 23086, -26601, -110090, -65358, -72882, -45902, 15919, 88116, 146241, 127673, 95654, 55947, 20017, 55357, 34953, 16515, 20725, 24712, 46347, 64898, 49068, 16332, 49754, 36231, -51973, -50152, -6929, -24264, -37038, -295, 32234, 25381, 22628, -9705, -58345, -79849, -71969, -31876, 34688, 100944, 107950, 129010, 124765, 144971, 92194, 105330, 74090, -23344, -94804, -150159]
7680a50159O6120L9160O3700J1504n3793J0089N3582l74n9441m1774k2978L4028
7668e0336L6806l7595l1171O0086k9717N1480l1982j1251j8184j1525R113J4944
7656d9332M7184k6080m0937J275M1084o2757j8824M4451O2867M415K1949l3249
7644g954L1719L9833l8986k1587N15K3402J2373J1723N8690R206j5365n2129n5610
7631d170q7055o882L3076J7793m0404j5330k9764j2930O5561O0838J5077L85L1373
7618B7568L2766j713k7113m262n910P051J754k5490j3768K5999k5055l1031J4105
7605b5099M0204J7391m5586n344j4031N6818N2101k7059n634r836K5626j084j4350
7592D4117k877J6832J5553k4016r8190j1433L1027p267N4163M2336k4860M5585
$$ y = [-150159, -84039, -44879, 18821, 30325, -23468, -13379, 40203, 39829, -19612, -61386, -84364, -50336, -13530, -51125, -82296, -22210, -51927, -447, -32429, -43680, -61864, -73389, -64276, -49332, -2148, -28228, -69165, -67890, -26806, -89563, -108387, -63936, -1069, 3346, 25295, -7954, 23765, 63598, 24612, 3025, 3540, 26942, 39315, 51038, 109728, 118934, 103569, 51440, -4170, -91225, -98107, -65031, -47238, -87642, -102972, -132736, -145666, -80105, -19267, -4190, -3805, 27568, 60334, 58621, 31508, 27246, 21336, 28387, 30141, 4651, -9117, 16882, -8173, -39204, -25099, 15105, 32496, -13090, -18434, -32465, 24353, 76454, 49395, 43761, 33925, 59551, 58467, 44117, 41240, 58072, 73625, 49609, -48581, -60014, -28987, -36254, 17909, 60245, 35385, 80970]
7580H0970m4930j0251J3553j0884o5226k2358m4939L4341P6599M8659p470l1542
7568A6522l8694o9918L297R4000K1052k1673k3121J0607L5466J9907M513J6552
7556F8510l0997o1306K2502k6665j0662K3458O962L2547K7809j1822K5122l8175
7544B7283k4770j3850Q158k7504l5510j7192J6547L3409L0224N0924j8334k9707
7532c22p776K2082m4534K1633M0917m6401l6743j2790M381M9344K8002k2146J6711
7519A2358o060l5678K747J1174k0323L4803L022K822j5677K2349O8828K5494m6198
7506E9661j00025P002J8253p792m768K615Q84N2986N0153L8740K3088m9354j1832
7493G9611k0538j3456n196J3759l5139k8255M5309K896p337k635k6238l7363k3363
$$ y = [80970, 36040, 25789, 39342, 28458, -36768, -59126, -104065, -69724, 6875, 55534, 48064, 16522, -22172, -92090, -88793, 5207, 26259, 4586, -18535, -7928, 27538, 47445, 51958, 68510, 37513, -23793, -1291, -27956, -38618, -15160, -8198, 24349, 52158, 40336, 65458, 27283, 2513, -11337, -3179, -30683, -66193, -83385, -66838, -33429, -3205, 47719, 29385, -322, -8098, 13984, -30550, -8917, 32000, -14401, -51144, -63934, -59553, -10209, 17793, -4353, 12358, 6298, -29380, -26633, -15459, -35782, -979, 2043, 4865, -10812, 11537, 80365, 105859, 59661, -40364, -33362, -15109, -22901, -27669, -25054, -24170, 28816, 78969, 117709, 140797, 91443, 79611, 59073, 45617, 40421, 54180, 19041, -9214, 36095, 38991, 31654, 29019, 2781, -34582, -57945]
7480e7945K3578j0748o1593K5066K4093J1356K6243J1681O4948M0041j0256n5509
7468C0955J903k7458N373l8340n0858k2276K5427Q2367j3578j6530J3219J9585
7456I789o2998k0101M3895j4M5926o8848l0374M3373P6887j9695l624k4638l2541
7443d2963J698O1532N8845J401n8281K2175K4602k6388n7509K8174N066M3957
7431F2309K0730l7062L161L4826j0773n7169k6302m740L5368p683p5907k4791
7419h8033M3765N4417k1856J4057J9006K6837K7272k7349n8776o7855k7338K8031
7407g7822P8774k2493L1279r183M6378J0035k0278o1238k1619O9607K4498n9825
7395a1887j5869P984k3800p018p2462o431M31J2757O4053l2499j8839R477k3760
$$ y = [-57945, -34367, -45115, -106708, -81642, -57549, -46193, -19950, -8269, 56679, 96720, 86464, 30955, 32858, 5400, 10773, -27567, -78425, -100701, -75274, 7093, -6485, -23015, -9796, 9789, -53209, -73310, -29415, -29429, 16497, -52351, -82725, -39352, 37535, 17840, 14216, -10422, -42963, -41265, 20267, 79112, 80513, 22232, 44407, 69009, 42621, -14888, 13286, 18352, 62309, 83039, 45977, 49138, 83964, 73191, 16022, -10280, -15020, 20348, 12665, -63242, -88033, -44268, 10149, -11707, 2350, 21356, 48193, 75465, 48116, -10660, -78515, -105853, -77822, 952, -21541, 9738, 555, 46933, 56968, 36690, -24548, -46167, 23440, 47938, -11887, -27756, -19772, -43572, -50590, -123052, -129483, -129052, -116295, -52242, -84741, -103580, -94103, -117863]
7382a17863J2044j785P776j7819L4001R1325k3503m1414k3131M3054J8346n5802
7370g4771l6009L0645J7028r168O05j0477L7315J5649J0254p782J04748J1748
7358H9785n1975n5350k6716K5307K3617q445K3035k4266j5351l2015m6758K735
7346i6397O6810J2147l1654k9954l8508O6137J19918O1227r650j7379m4365l0044
7334B8288m9562n5578p97J1095K957P731l131k6128K1911Q790l2127M1681J7134
7321b7736L4184N8396j6559p39l2597K094j2717l2267k1360K41K4908J6430k7026
7308c4748k4605Q112n018J473j0513K1347p885K0106M6722O154O250M72l7246
7295i379o754L6061L0621r379n5537p0827O6598L4631n989q452k8284l3344L5292
$$ y = [-117863, -105819, -107604, -99828, -117647, -83646, 7679, -15824, -57238, -80369, -37315, -18969, -74771, -110780, -80135, -63107, -72275, -71670, -82147, -44832, -29183, -18929, -26711, 78037, 89785, 37810, -17540, -44256, -18949, 4668, -3777, 19258, -5008, -20359, -52374, -99132, -96397, -29587, -17440, -49094, -79048, -117556, -51419, 68499, 129726, 120076, 102697, 58332, 28288, -21274, -76852, -77649, -66554, -63597, -55866, -58997, -85125, -63214, -54424, -86551, -44870, -27736, 6448, 64844, 48285, 47546, 14949, 17043, 4326, -27941, -49301, -49060, -24152, -7722, -34748, -59353, -51241, -56259, -54786, -65299, -43952, -51837, -31731, 14991, 21145, 27395, 27867, -9379, -16133, 19928, 50549, 41170, -14367, -85194, -18596, 16035, 10046, 1594, -26690, -60034, -24742]
7282b4742L7444k4400j6979L1138L1527O658j0778J3775K7734o113j3441l9454
7270A2369k7109n120k064r951J3336L1183n1199j6095l2558J0557O1856J9486
7258D691q968k6490K2564L5072q103n718j0175l0751j0491N963n587k3068j3182
7245g4243Q699L6080N0665J06863k7566l8593q2456l5052M443M392k1509K7895
7233d0382K0894J7588j0078o4772M5743N5198n5242m3992n3620P4991M1326l7163
7221d9509K8805o554J9639K0544k490j6039l31k1608k227K8520j6059l8798L3867
7208b2240P020q666j0801M2287L6270O3015L3028m1261l7193r2241M2256R1195
7196A02669n8589k2902J3922j6690j5283j4148l5422L623J9503p4402k6417o6800
$$ y = [-24742, 12702, -11698, -28677, 2461, 33988, 40646, 29868, 43643, 71377, 65264, 51823, 12369, -14740, -19860, -21924, -31875, -18539, 12644, -38555, -54650, -87208, -76651, -14795, 4691, -4277, -30767, -8203, 26869, 18766, 13048, 2873, -27878, -38369, -32406, -37993, -61061, -74243, -65544, -29464, 21201, 128064, 100498, 61905, -20551, -55603, -51160, -46768, -68277, -40382, -19488, -1900, -11978, -76750, -31007, 24191, -31051, -75043, -128663, -53672, -12346, -49509, -20704, -27258, -7619, 12925, 10435, -5604, -5935, -27543, -29770, -1250, -17309, -56107, -22240, -15220, -23886, -34687, 7600, 43870, 106885, 139913, 98652, 61459, -30782, 11474, 102669, 44080, 21178, 35100, 18410, 3127, -11021, -46443, -42820, -23317, -97719, -124136, -190936]
7184a90936J7233p62L90N2512N2442J7354K6444L9699K4298j3822K7201r43r2752
7171d1642N4826l1287k5393O1837k8259n2207l4306N8723r070l0720j4005L340
7159h8163o273j4177M3773p429j2464n5768O7392L9537J8231m093n7686J709J89
7146g5222j4218J1587N6654J6662j1212m4372M245Q370n649n7108j0591L7748
7134h3106j6104m61L6596k9731Q074j6084m2872K7099P0790Q910r074J3470J4991
7121a7502N2103L7007M1775n0200p449j7656K2588k2306p3587R78o314Q726M951
7108b6886K7943N1408j0039j116m3134l290k0778m3375j4262k6043L8206M9364
7096b2002o0402J8458l633L2755J9618N702J5467j7412R562R481n1232k6954M5252
$$ y = [-190936, -173703, -174465, -174075, -121563, -69121, -51767, -25323, 14376, 38674, 24852, 52053, 51110, -41642, 13184, -18103, -43496, 18341, -9918, -62125, -96431, -37708, -46778, -77498, -91503, -88163, -94436, -108613, -64840, -72269, -84733, -140501, -73109, -33572, -15341, -19434, -77120, -75411, -75222, -89440, -77853, -21199, -4537, -15749, -60121, -55876, -47506, -53155, -110263, -120854, -83106, -99210, -99671, -63075, -92806, -84732, -100816, -143688, -116589, -45799, -36889, -45963, -32493, -17502, 34601, 71608, 113383, 63183, 55734, 38078, 60666, 38360, -35227, -34249, -40563, -31837, -26886, 1057, 52465, 42426, 41310, -1824, -5114, -25892, -69267, -83529, -109572, -71366, -22002, -82404, -63946, -67579, -34824, -15206, -9504, 5963, -11449, -1887, 7594, -43638, -70592, -25340]
7083b5340k1441j091k5125N5651l1543k8841O4976m245l7397J7421N0050R5868
$$ y = [-25340, -46781, -47872, -72997, -17346, -48889, -77730, -12754, -16999, -54396, -36975, 13075, 108943]
$$ [...]
##END NTUPLES=NMR SPECTRUM
##END=
