##TITLE=Analysis number 327622
Compound Code dp 01095
Book Reference 192316
Project Code adrs flro3
Chemist Name jom
##JCAMPDX= 6.0         $$ Bruker NMR JCAMP-DX V2.0
##DATA TYPE= NMR SPECTRUM
##DATA CLASS= NTUPLES
##ORIGIN= Bruker BioSpin GmbH
##OWNER= nmr
$$ XWIN-NMR		Version 3.5
$$ Wed Mar 28 11:24:24 2007 GMT Daylight Time (UT+1h)  MAYBRIDGE\nmr@NMR_250MHZ
##.OBSERVE FREQUENCY= 250.131544655141
##.OBSERVE NUCLEUS= ^1H
##.ACQUISITION MODE= SIMULTANEOUS (DQD)
##.ACQUISITION SCHEME= undefined
##.AVERAGES= 16
##.DIGITISER RES= 18
##SPECTROMETER/DATA SYSTEM= dpx250
##.PULSE SEQUENCE= zg30
##.SOLVENT NAME= DMSO
##.SHIFT REFERENCE= (INTERNAL, DMSO, 0, 16.522)
##AUDIT TRAIL= $$ (NUMBER, WHEN, WHO, WHERE, WHAT)
$$ ##TITLE= Audit trail, XWIN-NMR		Version 3.5
$$ ##JCAMPDX= 5.01
$$ ##ORIGIN= Bruker BioSpin GmbH
$$ ##OWNER= nmr
$$ C:\u/data/dgb/nmr/ADRS/2430/pdata/1/auditp.txt
$$ ##AUDIT TRAIL=  $$ (NUMBER, WHEN, WHO, WHERE, WHAT)
(   1,<2007-03-28 11:24:00.82 +100>,<MAYBRIDGE\nmr>,<NMR_250MHZ>,
      <created by zg, POWCHK disabled, PULCHK disabled
       configuration hash MD5:
       49 4B E0 1D 92 C2 6B 37 9F E6 65 BC 52 41 86 1D
       data hash MD5: 64K
       94 76 19 F3 82 2E 8F F3 0C 59 16 21 E0 71 0F E8>)
(   2,<2007-03-28 11:24:14.22 +100>,<MAYBRIDGE\nmr>,<NMR_250MHZ>,
      <Start of raw data processing
       ef LB = 0.3 FT_mod = 6 PKNL = 1 SI = 32K 
       data hash MD5: 32K
       8F 1B 1F 2E 38 85 7A A5 68 2F 48 D1 F1 32 C0 5C>)
(   3,<2007-03-28 11:24:15.89 +100>,<MAYBRIDGE\nmr>,<NMR_250MHZ>,
      <apk 
       data hash MD5: 32K
       F4 D2 CB 89 1E BA 0E 3C 02 7F 1C 10 04 50 67 58>)
(   4,<2007-03-28 11:24:16.80 +100>,<MAYBRIDGE\nmr>,<NMR_250MHZ>,
      <abs ABSG = 5 
       data hash MD5: 32K
       D3 12 C9 D8 27 2B 06 D2 49 60 79 7B A1 CA A7 A4>)
$$ ##END=
$$ 
$$ hash MD5
$$ 8D 6D F3 69 7F 12 32 D9 DA 5E BC 30 18 2C D0 A5
##$RELAX= 
##$RELAX= 
##$RELAX= 
##$RELAX= 
##$RELAX= 
##$RELAX= 
##$RELAX= 
$$ Bruker specific parameters
$$ --------------------------
##$DU= <C:\u>
##$EXPNO= 2430
##$NAME= <ADRS>
##$PROCNO= 1
##$TYPE= <nmr>
##$USER= <dgb>
##$AMP= (0..31)
100 100 100 100 100 100 100 100 100 100 100 100 100 100 100 100 100 100 
100 100 100 100 100 100 100 100 100 100 100 100 100 100 
##$AQSEQ= 0
##$AQ_mod= 3
##$AUNM= <au_zg>
##$AUTOPOS= <9 >
##$BF1= 250.13
##$BF2= 250.13
##$BF3= 250.13
##$BF4= 250.13
##$BF5= 500.13
##$BF6= 500.13
##$BF7= 500.13
##$BF8= 500.13
##$BYTORDA= 1
##$CFDGTYP= 0
##$CFRGTYP= 5
##$CHEMSTR= <none>
##$CNST= (0..31)
1 1 145 1 1 1 1 1 1 1 1 1 1 1 1 1 1 1 1 1 1 1 1 1 1 1 1 1 1 1 1 1 
##$CPDPRG= <>
##$CPDPRG1= <>
##$CPDPRG2= <>
##$CPDPRG3= <>
##$CPDPRG4= <mlev>
##$CPDPRG5= <mlev>
##$CPDPRG6= <mlev>
##$CPDPRG7= <mlev>
##$CPDPRG8= <mlev>
##$CPDPRGB= <>
##$CPDPRGT= <>
##$D= (0..31)
0 1 0 0 0 0 0 0 0 0.06 0 0 0 0 0 0 0.0002 0 0 0 0 0 0 0 0 0 0 0 0 0 0 
0 
##$DATE= 1175077439
##$DBL= (0..7)
120 120 120 120 120 120 120 120 
##$DBP= (0..7)
150 150 150 150 150 150 150 150 
##$DBP07= 0
##$DBPNAM0= <>
##$DBPNAM1= <>
$$ [...]
##$SUBNAM7= <"">
##$SUBNAM8= <"">
##$SUBNAM9= <"">
##$SW= 20.6930455092707
##$SWIBOX= (0..15)
0 0 3 0 0 0 0 0 0 0 0 0 0 0 0 0 
##$SW_h= 5175.983436853
##$TD= 65536
##$TD0= 1
##$TE= 683.16
##$TE2= 300
##$TE3= 300
##$TEG= 300
##$TL= (0..7)
0 120 120 120 120 120 120 120 
##$TP= (0..7)
150 150 150 150 150 150 150 150 
##$TP07= 0
##$TPNAME0= <>
##$TPNAME1= <>
##$TPNAME2= <>
##$TPNAME3= <>
##$TPNAME4= <>
##$TPNAME5= <>
##$TPNAME6= <>
##$TPNAME7= <>
##$TPOAL= (0..7)
0.5 0.5 0.5 0.5 0.5 0.5 0.5 0.5 
##$TPOFFS= (0..7)
0 0 0 0 0 0 0 0 
##$TUNHIN= 0
##$TUNHOUT= 0
##$TUNXOUT= 0
##$USERA1= <user>
##$USERA2= <user>
##$USERA3= <user>
##$USERA4= <user>
##$USERA5= <user>
##$V9= 5
##$VALIST= <valist>
##$VCLIST= <CCCCCCCCCCCCCCC>
##$VD= 0
##$VDLIST= <DDDDDDDDDDDDDDD>
##$VPLIST= <PPPPPPPPPPPPPPP>
##$VTLIST= <TTTTTTTTTTTTTTT>
##$WBST= 1024
##$WBSW= 4
##$XGAIN= (0..3)
0 0 0 0 
##$XL= 0
##$YL= 0
##$YMAX_a= 286192
##$YMIN_a= -335233
##$ZGOPTNS= <>
##$ZL1= 120
##$ZL2= 120
##$ZL3= 120
##$ZL4= 120
##$ABSF1= 16.522
##$ABSF2= -4.171173
##$ABSG= 5
##$ABSL= 3
##$ALPHA= 0
##$AQORDER= 0
##$ASSFAC= 0
##$ASSFACI= 0
##$ASSFACX= 0
##$ASSWID= 0
##$AUNMP= <proc_1d>
##$AZFE= 0.1
##$AZFW= 0.1
##$BCFW= 0
##$BC_mod= 0
##$BYTORDP= 0
##$COROFFS= 0
##$CY= 12.5
##$DATMOD= 1
##$DC= 0
##$DFILT= <>
##$DTYPP= 0
##$F1P= 14.0000005364418
##$F2P= -0.99999901652339
##$FCOR= 0.5
##$FTSIZE= 32768
##$FT_mod= 6
##$GAMMA= 0
##$GB= 0
##$INTBC= 1
##$INTSCL= 1
##$ISEN= 128
##$LB= 0.3
##$LEV0= 0
##$LPBIN= 0
##$MAXI= 10000
##$MC2= 0
##$MEAN= 0
##$ME_mod= 0
##$MI= 0
##$NCOEF= 0
##$NC_proc= -6
##$NLEV= 6
##$NOISF1= 0
##$NOISF2= 0
##$NSP= 0
##$NTH_PI= 0
##$NZP= 0
##$OFFSET= 16.522
##$PC= 1
##$PHC0= 211.7902
##$PHC1= 18.46487
##$PH_mod= 1
##$PKNL= yes
##$PPARMOD= 0
##$PSCAL= 4
##$PSIGN= 0
##$REVERSE= no
##$SF= 250.13
##$SI= 32768
##$SIGF1= 0
##$SIGF2= 0
##$SINO= 400
##$SIOLD= 32768
##$SREGLST= <1H.DMSO>
##$SSB= 0
##$STSI= 32768
##$STSR= 0
##$SW_p= 5175.98343685301
##$SYMM= 0
##$S_DEV= 0
##$TDeff= 65536
##$TDoff= 0
##$TI= <Analysis number 999999
Compound Code 99
Book Reference 9
Project Code 9>
##$TILT= no
##$TM1= 0
##$TM2= 0
##$TOPLEV= 0
##$USERP1= <user>
##$USERP2= <user>
##$USERP3= <user>
##$USERP4= <user>
##$USERP5= <user>
##$WDW= 1
##$XDIM= 32768
##$YMAX_p= 500258881
##$YMIN_p= -1278429
$$ End of Bruker specific parameters
$$ ---------------------------------
##NTUPLES= NMR SPECTRUM
##VAR_NAME=  FREQUENCY,     SPECTRUM/REAL,   SPECTRUM/IMAG
##SYMBOL=    X,             R,               I
##VAR_TYPE=  INDEPENDENT,   DEPENDENT,       DEPENDENT
##VAR_FORM=  AFFN,          ASDF,            ASDF
##VAR_DIM=   32768,         32768,           32768
##UNITS=     HZ,            ARBITRARY UNITS, ARBITRARY UNITS
##FACTOR=    0.157963299565203, 1,           1
##FIRST=     4132.6476996994, 0,             0
##LAST=      -1043.33573715361, 0,           0
##MIN=       -1043.33573715361, -1278429,    0
##MAX=       4132.6476996994, 500258881,     0
$$ Real data points
##PAGE= N=1
##DATA TABLE= (X++(R..R)), XYDATA
$$ [...]
15518c44909n5319P8827J37569j5694R0868R2961n1820o5324j28812O5258J53923
15507d2472J75849j1391j71948Q3184M0317m45458p2477R6292J6209K19085P4705
15496c8105q8689J51679J91114J88322j5322j20496l26132k04400o2811K19034
15486a05806j34568j64005j7928P8756M2757r6200K37588O2417m3993J09389j55819
15475a87412k44961L07762J0492P6895j37472J18383r7189j42102l2595n8751
15465c86950l9238K09567J32965l02J6011j16479m0022l8910j44322L98031J25990
15454A16341l91967j05698R0184k1455L3481j58987L36994R1203k0974j09291
15444a40169j51708k00105p5728P3384L1506K67319p3900k67278J49684R9205
$$ plain form
15518 -344909 -400228 -321401 -183832 -199526 -108658 -15697 -67517 -132841 -261653 -196395 -42472
15507 -42472 133377 121986 -49962 33222 73539 -371919 -444396 -348104 -331895 -112810 -38105
15496 -38105 -126794 24885 215999 404321 388999 268503 -57629 -262029 -324840 -105806
15486 -105806 -240374 -404379 -422307 -343551 -300794 -396994 -159406 -96989 -140982 -31593 -187412
15475 -187412 -432373 -124611 -114119 -37224 -174696 -56313 -153502 -295604 -328199 -386950
15465 -386950 -426188 -216621 -83656 -83958 -67947 -184426 -224448 -263358 -407680 -9649 116341
15454 116341 -275626 -381324 -291140 -312595 -279114 -438101 -101107 -9904 -30878 -140169
15444 -140169 -291877 -491982 -567710 -494326 -462820 -195501 -269401 -536679 -386995 -287790
15434b87790m3710J67838J89651l9029p7253q9155J60230J82949k04595k6781
15424f7645M6489p8674q5391k46812M1459j23004Q593K28332J50647K37524K54165
15413C65683k56004l68764l8011J81113o8174j57916j14222j1794k3901J23424
15403c68566K3405j49176k834K85530m4456j06423r2339k60119K2690K70861M0696
15392c80731J97034J38151m7438L3883J85638o0204j76765r6206r2256n8047Q1504
15381b75437m1450j62738J92404N8787J41064P778j24474k11514k23474p4201
15371g13255O4633p632R3798Q8291K49770J67868M7291L5085k99769o9451k3754
15360c67125k45853K73053J96720j04092j85755k96680k4397J62349J57755K21188
$$ plain form
15434 -287790 -331500 -163662 25989 -13040 -90293 -179448 -19218 163731 -40864 -67645
15424 -67645 -21156 -99830 -185221 -432033 -390574 -513578 -504985 -276653 -126006 111518 365683
15413 365683 109679 -259085 -297096 -115983 -184157 -342073 -456295 -468089 -491990 -368566
15403 -368566 -345161 -494337 -497171 -211641 -256097 -362520 -454859 -714978 -692288 -421427 -380731
15392 -380731 -183697 -45546 -92984 -59101 126537 66333 -110432 -206638 -298894 -356941 -275437
15381 -275437 -316887 -479625 -287221 -228434 -87370 -79592 -204066 -415580 -639054 -713255
15371 -713255 -648622 -656254 -562456 -474165 -224395 -56527 -9236 25849 -273920 -343371 -367125
15360 -367125 -612978 -339925 -143205 -247297 -433052 -729732 -754129 -591780 -434025 -212837
15350b12837k979k02609L5270M0535j30960m6058J08175j40335k70818J93166
15340f29450M06513j5348L6336k83281M0557J15790J36260M2089O6759M1985k85811
15329c27601n5864J76463Q4001J1935j72093k05212J5515K0251j9109l04958k57563
15318a034235J10386P3906J95488K94786p147j466K72103l1367K02507J7213J7143
15307A09317K89529J28525k78572R1264K62571l72284l17806j05564m8927K86141
15297D4194n5754j74096j54863O8245n7929m2044k9090l8535o001J29802j16547
15286d32618k81579J78410J50452j9336J73885j1086r2431j10653J90374k0230
15276b74812n2602L7197K01553N8097k49887k6948J11402R0291K09530l3397j34487
$$ plain form
15350 -212837 -215816 -418425 -383155 -342620 -473580 -519638 -411463 -551798 -822616 -629450
15340 -629450 -222937 -238285 -201949 -485230 -444673 -328883 -192623 -150534 -83775 -41790 -327601
15329 -327601 -383465 -207002 -123001 -111066 -283159 -488371 -472856 -452605 -471714 -776672 -1034235
15318 -1034235 -923849 -849943 -654455 -359669 -366816 -368282 -96179 -127546 74961 92174 109317
15307 109317 398846 527371 248799 340063 602634 230350 -87456 -193020 -241947 44194
15297 44194 -11560 -185656 -340519 -272274 -330203 -372247 -401337 -439872 -445873 -316071 -432618
15286 -432618 -714197 -535787 -385335 -404671 -230786 -241872 -334303 -444956 -254582 -274812
15276 -274812 -327414 -290217 -88664 -30567 -280454 -307402 -196000 -105709 103821 70424 -64063
15265f4063o5928K06929J53864j30847l05689N4944J79341j35426j94977O4402
15255b37450l6732p1581p0748J45410m9387k4996M9056K11370o2782o3247j653
15244b12740J0960O1498L3064j59619K11999p1147l9278j37187J6105Q1786o7378
15233b71937m07217j20418J98437M87653j1897k22971J18090p1049q5820O5745
15223c21384K35134J59073J72581j23599k94808j72977j89532j00381j46610k2588
15213h05091K226K26051J83291J28612R7579r8689J33071l4437j86513p8508q6777
15202e19185P932j65118J5698K08907K73265L6577j67925R591J12920M1054j28846
15191b75130m4437O7539k1303J69646J45076l35531j15570k2710L2078N5839j25827
$$ plain form
15265 -64063 -129991 76938 230802 99955 -205734 -150790 28551 -106875 -301852 -237450
15255 -237450 -274182 -345763 -416511 -271101 -320488 -345484 -296428 -85058 -147840 -211087 -212740
15244 -212740 -201780 -140282 -107218 -266837 -54838 -125985 -165263 -302450 -286345 -204559 -271937
15233 -271937 -679154 -799572 -601135 -113482 -125379 -348350 -230260 -301309 -387129 -321384
15223 -321384 -86250 72823 245404 121805 -173003 -345980 -535512 -635893 -782503 -805091
15213 -805091 -802865 -576814 -393523 -264911 -167332 -266021 -132950 -167387 -353900 -432408 -519185
15202 -519185 -511253 -676371 -660673 -451766 -178501 -141924 -309849 -300258 -187338 -146284 -275130
15191 -275130 -319567 -252028 -273331 -103685 41391 -294140 -409710 -432420 -400342 -344503 -470330
15180d70330r0574q3930J03885j05223k9294L11512J32759L71143n4891j4972
15170G0085N1046j30193j56985p1084K37424K12275J01121j97974j44827r0352
15160a19464J12419K75006m0834m4048j35386q6495j64021k6833J4278r7248j89360
15149e01986j0404K33685N6049K18718J41754k74835k68484o6607l5055J04027
15139d03138J89894j05913m39592k21843J604R3782J70713M9114j3209L12321
15129c66267P7069J7228R8563m8272j7286j50341k1963m3639R0137j15982R6545
15118c84208J15783j05949l2513j13672j43534r7760l9985K98242K56513n4463
15108c01546J92372J12889l14562m24204n3146J69593L31221R7271k99917k71919
$$ plain form
15180 -470330 -560904 -644834 -540949 -646172 -675466 -363954 -231195 139948 85057 70085
15170 70085 121131 -9062 -166047 -237131 293 212568 313689 115715 -29112 -119464
15160 -119464 -7045 267961 227127 183079 47693 -38802 -202823 -229656 -215378 -312626 -501986
15149 -501986 -512390 -278705 -222656 -3938 137816 -137019 -405503 -472110 -507165 -403138
15139 -403138 -213244 -319157 -758749 -980592 -978988 -885206 -714493 -665379 -678588 -366267
15129 -366267 -289198 -271970 -173407 -221679 -238965 -389306 -411269 -454908 -364771 -480753 -384208
15118 -384208 -268425 -374374 -406887 -520559 -664093 -761853 -801838 -503596 -247083 -301546
15108 -301546 -109174 3715 -310847 -735051 -788197 -618604 -287383 -190112 -490029 -761948
15098g61948o4755J82249o342J93548Q5208J03983q5417j85783j73568M7808K45865
15087d19152K2711R4560J42364l3406O9248q3944k26150K33916J27670j84756
15077b56939j94163j28099l6275R2959O7181P695Q8446J35694Q2512L9725K13642
15066A12378j85990l01810k72565j264l572L75136J10220J17632P7965j16737
15056h8607Q4958Q2013M7547r2692k8099n2930r0220n3145j84703K91460j28566
15045b12984J9909k20369l05941Q5640m726L8555K60271P9973J29315J19224L01331
15034B90198j5303q6229j66971j6964l29058n5097K02252q2958k27875P0508J4441
15023d03056J35607j5978M7501K05984K57691k87046k64235M1398J51568q3809
$$ plain form
15098 -761948 -826703 -644454 -650796 -457248 -372040 -268057 -353474 -539257 -712825 -665017 -419152
15087 -419152 -396441 -301881 -159517 -192923 -123675 -207619 -433769 -199853 -72183 -256939
15077 -256939 -451102 -579201 -615476 -522517 -455336 -447641 -359195 -223501 -140989 -101264 112378
15066 112378 -73612 -375422 -647987 -649251 -652823 -277687 -167467 -49835 28130 -88607
15056 -88607 -3649 78364 125911 33219 5120 -47810 -138030 -191175 -375878 -84418 -212984
15045 -212984 -193075 -413444 -719385 -633745 -638471 -599916 -339645 -259672 -130357 -11133 290198
15034 290198 274895 188666 21695 4731 -324327 -379424 -177172 -260130 -488005 -417497 -403056
15023 -403056 -267449 -283427 -235926 -29942 227749 -59297 -323532 -282134 -130566 -214375
15013b14375N6451p1873n0635J36787l9630N5114l4985j63996N3963P4228p8114
15002b77065q7586K22814K90657J03489K8854j76956l22335l01069k00551K16556
14992e03192J51353r8098J3086j25287p8376j12875L17861P7986J66067J90379
14982a096O3615J6199k06096J18867k47731j86567j66865J2495K89547k4610m9249
14971c81491k56098k01872J31155J19029J50688N5181k08448J60935M15941P3459
14961E8479k46698Q7590J88489k54481k35116k10756J11292M19380K21361J18347
14951B57887j14460J12173j5729P5995k46715N804J10933J71732P8974k84782
14941A51812j29027K8748p1718J3931j85883j52735k06802j22718K86824Q8525
$$ plain form
15013 -214375 -157924 -229797 -280432 -143645 -183275 -128161 -163146 -327142 -273179 -198951 -277065
15002 -277065 -364651 -141837 148820 252309 281163 104207 -218128 -519197 -719748 -503192
14992 -503192 -351839 -449937 -436851 -562138 -640514 -753389 -435528 -357542 -191475 -1096
14982 -1096 62519 78718 -127378 -8511 -256242 -442809 -609674 -597179 -307632 -332242 -381491
14971 -381491 -637589 -839461 -708306 -589277 -438589 -383408 -591856 -430921 -14980 58479
14961 58479 -188219 -100629 87860 -166621 -401737 -612493 -501201 -81821 139540 257887
14951 257887 143427 255600 239871 315866 69151 74955 185888 357620 436594 151812
14941 151812 22785 51533 -20185 -6254 -192137 -344872 -551674 -674392 -387568 -299043
14931b99043j14191N4148L3986j35916Q0797K13024J38349j22118L6045L91065
14921B76146j57443l24933O7957J87043n5209l01765k28178R6218K48854j94793
14911c86103M8962J48832J48995j6709K95165K25649j49388k07795j57953K7879
14901b2466O2074j26772j64654J80076P7743p0108q1990J27326l5856M4257K22966
14890B12596p9027j13263o667J91255L9098j16939j30224j34238R8067j219J20529
14879G9968j49415p538q6722k59837o2318P3837N6936O5338J25622k01076j20998
14868d86203J85142O5721j79977Q8495J36772l4764j03628K06650R2955k01112
14858b29949O1252J95050l8949P7909J56098k57431k48191l6458o7779O6230j37718
$$ plain form
14931 -299043 -413234 -359086 -325100 -461016 -380219 -167195 -28846 -150964 -114919 276146
14921 276146 118703 -206230 -138273 48770 -6439 -308204 -536382 -440164 -191310 -386103
14911 -386103 -337141 -188309 -39314 -56023 239142 464791 315403 107608 -50345 -22466
14901 -22466 39608 -87164 -251818 -71742 6001 -64107 -146097 -18771 -54627 -10370 212596
14890 212596 133569 20306 13639 204894 243992 127053 -3171 -137409 -39342 -40561 79968
14879 79968 -69447 -76985 -163707 -423544 -485862 -412025 -355089 -289751 -164129 -365205 -486203
14868 -486203 -301061 -235340 -415317 -326822 -190050 -224814 -328442 -121792 -28837 -229949
14858 -229949 -168697 26353 -12596 65313 221411 -36020 -284211 -320669 -388448 -322218 -459936
14847d59936l6277J30905L11821J54015k03967l62340J60747K1752n1452K16140
14837a18592j23759p103M1366J34847P0519J64579j45841k74861q766r2866J53925
14826b06552K85733j04349j09201q8027l7343k3568K16993J07904O351Q1434j48497
14815a9122k18990j23110J26057j21544j41197Q3345K42007K86192O1623j59694
14805A5567J3195k61627j47289K18574J1368J38275l813j78318j49190K24877
14795a18381M55283K12904m2196N3734q2671N8967P9138r6205m69305o2474j45367
14784a56573K3747N9450Q4779J1573J25025J25944j2775j80644J36870R0524q1867
14773B26053j56394q0678L2843j38698p1843J48812J66088l41591j877j76533
$$ plain form
14847 -459936 -496213 -365308 -53487 100528 -103439 -465779 -305032 -283280 -334732 -118592
14837 -118592 -242351 -249454 -208088 -73241 -2722 161857 16016 -258845 -267611 -360477 -206552
14826 -206552 79181 -25168 -134369 -222396 -259739 -283307 -66314 41590 47941 129375 -19122
14815 -19122 -238112 -361222 -235165 -356709 -497906 -414561 -172554 113638 175261 15567
14805 15567 28762 -232865 -380154 -161580 -150212 -11937 -15750 -194068 -343258 -118381
14795 -118381 336902 549806 507610 561344 478673 537640 616778 520573 51268 -11206 -156573
14784 -156573 -132826 -73376 11403 22976 148001 273945 261170 80526 217396 307920 226053
14773 226053 69659 -11019 21824 -116874 -188717 -39905 126183 -215408 -217285 -393818
14763c93818O0572L4871j90343j88316j0257K07617J65205M1451o0642J22610
14753b11050J35586r9717l05620l0231L50979J60754k0743l7646j89194J49680
14743i7202O2J98388k8997j67756j68865J06283K24911j1645j05725k15946j08996
14732c75488J14831L2778q4933o0978J49040j43095l2495J21303m206m5673J28607
14721b00309r834O5526K27880R4903J29601J34723j96511Q1197p398j49611k49951
14710g9784j24068L6455j84797k40216L21745M32883m1155r546k91800j79782
14700c60065J76368K7765L12394K3909k42578j1598M0120k13000l00739m8464
14690e95888k2863K84714K07670o2277r9065j73069M814K88424J99155L07952
$$ plain form
14763 -393818 -333246 -298375 -488718 -677034 -687291 -479674 -314469 -273018 -333660 -211050
14753 -211050 -75464 -175181 -480801 -511032 -160053 701 -20042 -57688 -246882 -97202
14743 -97202 -97140 101248 72251 -95505 -264370 -158087 66824 55179 -50546 -266492 -375488
14732 -375488 -260657 -227879 -312812 -373790 -224750 -367845 -400340 -279037 -283243 -328916 -200309
14721 -200309 -210143 -144617 83263 178166 307767 442490 245979 327176 319778 170167 -79784
14710 -79784 -203852 -167397 -352194 -592410 -270665 162218 121063 111517 -180283 -360065
14700 -360065 -183697 -155932 156462 180371 -62207 -73805 -33685 -246685 -547424 -595888
14690 -595888 -618751 -334037 -126367 -188644 -287709 -460778 -455964 -167540 31615 339567
14680C39567j63355k83890j16152L6996J83895l9324n9454j42911j0375J43456
14670a11547J48554j64148k26935J54987J61208l7460j19413K3558J45444j8271
14660d4023Q1484p9856j71319j34683k0020J65328J60138O9957j24223j29119
14650b26336J68376k14739l50302K1626J71326N6574l946K58304K88354O565Q2914
14639B58716l5794j73926o1952r5287o1029r3226P421j41075j9207m8369K28141
14628b35587J12297M29585J59630j12454K9232j92816q2534p5704k20693k6569
14618b15613N8204M7801j25668K3768j19543L9629J2893m4080o7271p7465L02232
14607a65113L55827J32231m38049j15649J04665K35736K22384Q50j94241k41750
$$ plain form
14680 339567 176212 -107678 -223830 -186834 -2939 -42263 -101717 -244628 -255003 -111547
14670 -111547 37007 -127141 -354076 -199089 -37881 -75341 -194754 -171196 -25752 -44023
14660 -44023 37461 -42395 -213714 -348397 -368417 -203089 -42951 27006 -97217 -226336
14650 -226336 -57960 -272699 -623001 -601375 -430049 -373475 -377421 -119117 169237 175802 258716
14639 258716 222922 48996 -12956 -108243 -169272 -262498 -255077 -396152 -415359 -463728 -235587
14628 -235587 -123290 306295 465925 353471 382703 189887 107353 31649 -189044 -215613
14618 -215613 -157409 -109608 -235276 -211508 -331051 -291422 -278529 -322609 -389880 -467345 -165113
14607 -165113 190714 322945 -115104 -230753 -126088 109648 332032 332882 138641 -103109
14597a03109j03576j11608k53555J5901J16212J99795J67386j16j33443L6456
14587a69657L68521J32832k72770j83187J14669K6998J57879L1254j85745k17696
14577a96902k875J40673j31657J31130M5678k86197J10721L56428J41052k6679
14567B81372K16965j46889l87224k34245J97951Q5613q8373j68235J79462L41366
14557B77763J59709j11849n7876l29520m4651K49335n366j6260J48912k3696n2598
14546A93903K71453P2304Q5624j65374j39256P855k25425Q9383J87777J59903
14536E38147j71351N0433n8311r0222p00J42902j98460j85389L5444L9037j65550
14525f4020m2784k3063M18k09319K5507J9987P8112k21178j25772J38736p6854
$$ plain form
14597 -103109 -206685 -318293 -571848 -555947 -439735 -239940 -72554 -72670 -206113 -169657
14587 -169657 198864 331696 58926 -124261 -9592 17406 175285 206539 20794 -196902
14577 -196902 -199777 -59104 -190761 -59631 -13953 -300150 -189429 166999 308051 281372
14567 281372 498337 351448 -35776 -270021 -72070 13543 -74830 -243065 -63603 277763
14557 277763 437472 325623 267747 -61773 -106424 142911 137545 121285 270197 246501 193903
14546 193903 465356 537660 623284 457910 318654 326509 101084 190467 378244 538147
14536 538147 366796 417229 358918 268696 267996 410898 212438 27049 62493 101530 -64020
14525 -64020 -106804 -129867 -129449 -338768 -313261 -293274 -215162 -436340 -562112 -423376 -500230
14514e00230L718K23680q6009k04071j3209K30823K57221k2259J10463O4044j07784
14503d3613l7097K0026l94453m25520J32515M03137L37626P2462o9280k97879
14493c02076L4092J65689J07561J45061o3659n239j76676k27512K76947j3900
14483e9712l7685J20337K1507o4246l39989j34516K78919J93208M8846J09910
14473A36579J6201J45025J62130j04216n5233J89675O5786k35909P4078k88261
14463A05855j27550P2293K13531j48890k75581p2740n228J35643n3735j3016L9795
14452a29623J37233J3047j25495J56609R8930k04715j14028N1960J03206J50770
14442A37894R8623j54179n5184j15473k31123l56333j82178L49691J29412J1117
$$ plain form
14514 -500230 -496512 -272832 -358841 -562912 -576121 -345298 -88077 -110336 127 64171 -43613
14503 -43613 -80710 -60684 -455137 -880657 -748142 -345005 -7379 65083 -4197 -302076
14493 -302076 -267984 -102295 5266 150327 86668 81429 -95247 -322759 -45812 -59712
14483 -59712 -97397 22940 44447 -19799 -359788 -494304 -215385 -22177 26669 136579
14473 136579 152780 297805 459935 355719 300486 490161 555947 320038 394116 105855
14463 105855 -21695 50598 264129 115239 -160342 -233082 -238310 -102667 -156402 -169418 -129623
14452 -129623 7610 20657 -104838 51771 150701 -54014 -168042 -116082 -12876 137894
14442 137894 236517 82338 27154 -88319 -319442 -675775 -857953 -508262 -378850 -367733
14432c67733J24747L6542J26572J79727m7896j05902J77908J19329K8298J26083
14422C97675n3911k50916m21729k27109K93250K73878j4545o1486J44833o6602
14412A3338j53624j05748J50970M5460n90J78540n9811k55841J18316K33139j59647
14401D502j44832N528Q1053o5523J81690M8547l3050N3128l5220J13038l811r8136
14389A06914j87370K16322m811l08283j69848J43406J15432R0362j62037L136
14379a56777K52539L7225J21396j93298R1184P1986L3463j59076K0807j3679J96372
14368C02142j00936M156j64162K749K28221k0957N38J566O6922l24341K94981
14357B90879K51445o8334j43761l37925m11899M8800J69832J5499J67699L3280
$$ plain form
14432 -367733 -242986 -206444 -79872 99855 51959 -53943 123965 243294 271592 397675
14422 397675 343764 92848 -328881 -555990 -262740 11138 -3407 -64893 79940 13338
14412 13338 -140286 -246034 -95064 -49604 -50194 128346 68535 -187306 -68990 164149 4502
14401 4502 -140330 -134802 -53749 -119272 62418 110965 77915 131043 95823 208861 205050 106914
14389 106914 -80456 135866 131055 -177228 -347076 -203670 -88238 2124 -159913 -156777
14379 -156777 95762 132987 254383 61085 152269 224255 257718 98642 119449 105770 302142
14368 302142 201206 205362 41200 43949 272170 251213 251751 253317 320239 -4102 290879
14357 290879 542324 473990 330229 -7696 -419595 -370795 -200963 -185464 -17765 15515
14347A5515q5442k1722Q531K00560o3387j5229J00142K43449r6604L5269K00427
14336E21509J40562n5267J6392N3538K05121k73505n42218Q0746K08964L36420
14326F92262L10012j48061r0147K42129M8051O189q9864J44548J89357j96007
14316A108469o3103Q8497k94026j93692n1557L6421J69245J44692p5232p041J61645
14305A024318M965j41060l295l53456j22614J28397Q4105k56512j77068R6075
14295B83855Q5124k4140j89693j46649j39532J50826K20625K51330L8009l14787
14285B14968k87286J39629J43146P9423l16710k99283J09513K38420O6687k07860
14275a19353m1932N0421l3241J6179O8822j17084j20297Q1023K76016k86674j1363
$$ plain form
14347 15515 -69927 -91649 -83118 117442 54055 38826 138968 382417 285813 321082 521509
14336 521509 662071 606804 623196 676734 881855 608350 66132 146878 355842 692262
14326 692262 1002274 854213 764066 1006195 1054246 1060435 970571 1115119 1304476 1108469
14316 1108469 1045366 1133863 839837 646145 594588 631009 800254 944946 869714 862673 1024318
14305 1024318 1029283 888223 884928 531472 408858 537255 621360 364848 187780 283855
14295 283855 368979 344839 155146 8497 -131035 19791 240416 491746 529755 214968
14285 214968 -72318 67311 210457 289880 -26830 -326113 -216600 21820 88507 -119353
14275 -119353 -161285 -110864 -144105 -127926 -59104 -176188 -296485 -215462 60554 -226120 -237483
14264b37483L458J36359J27993j44624l50019r183N85891r4154k42848P3709J58487
14253G586k4375J00242J17297k97300j07229k79318j79318K20878K25892N06865
14243B91220L40730n0441l35749o9305Q6730P4117o8779o2417J18968m699j35064
14232A85311J03997J27015r8246j12552m8360P9359k3557R816p1939J39004j0322
14221B79526P0038q2747O279J66961l41777Q5591J72383j99478P696l218J95846
14210C57100L4656k41844k41267N6439K62342J16515j75156K3499n4463n7701
14200H0120j40257J35367J74666j63773N4113J10889J02297j70093j71488k09278
14190a97437p4688r9502O3211N7686M9600j39896J13290K82982K50713J67140
$$ plain form
14264 -237483 -234025 -97666 30327 -114297 -464316 -473499 112392 18238 -224610 -150901 7586
14253 7586 -16789 83453 200750 -96550 -203779 -483097 -662415 -441537 -215645 291220
14243 291220 631950 581509 245760 176455 263185 337302 268523 206106 325074 320375 185311
14232 185311 289308 416323 318077 205525 157165 236524 212967 222783 150844 289848 279526
14221 279526 349564 266817 273096 440057 98280 183871 356254 156776 164472 161254 357100
14210 357100 391756 149912 -91355 -34916 227426 343941 168785 192284 137821 80120
14200 80120 -60137 75230 249896 86123 140236 251125 353422 183329 11841 -197437
14190 -197437 -272125 -371627 -308416 -250730 -201130 -341026 -227736 55246 305959 473099
14180D73099p5687p4317k11344o8846J46660k01202k3505K20079j01192J94745
14170B78490K4918Q1495k72320j33593J63214Q5513O601l74161P3630r3492k19185
14159c78890k13661N0821N43457J83674k91657K2806K31871j39588q0613J11009
14149C9229j15849j45315r0224J1521K64777q664q5977j58676l3453k19996j78693
14138g21320J75125K58702M55778K62420j34026m21946L1722O1259r2553K25151
14128A00312j18299l8469J25008m5242l5602j6769j61172J7145k1450J68402L54285
14117C28149K00484r9735k66403k8153p8998p3291J47520o5708K27092P8741j33115
14106B36583J05239P1171l56195k06940K572K31723K48736j01665j12841M1672
$$ plain form
14180 473099 397412 323095 111751 42905 189565 -11637 -35142 184937 83745 278490
14170 278490 303408 384903 112583 -21010 142204 227717 234318 -139843 -66213 -159705 -378890
14159 -378890 -592551 -541730 1727 185401 -106256 -83450 148421 8833 -71780 39229
14149 39229 -76620 -221935 -312159 -300638 -35861 -44525 -130502 -289178 -322631 -542627 -721320
14138 -721320 -546195 -287493 168285 430705 296679 -125267 -93545 -32286 -124839 100312
14128 100312 -17987 -56456 68552 23310 -12292 -29061 -190233 -173088 -194538 -26136 328149
14117 328149 528633 428898 162495 134342 55344 -17947 129573 63865 290957 369698 236583
14106 236583 341822 412993 56798 -150142 -147570 84153 332889 231224 118383 160055
14096A60055J75859J19339j30976k32020k23386o9961j7468R244K20932K70097
14086B81715N8433l5427Q3910M53019q2819k98360j21475k16023J186M3262n9626
14075A07795j29436K3106n2593j91595L514l4419p5668j08920m0844J74116J02809
14064b22135P8753N8899K92886K38733k61899k87105R9444J67909l27707j07170
14054b69392K36776K10122K01242K9512p6672j72818j94304J64661M6909k46140
14044g0104j01878m4821R0452j71965P4776R2592K26766p2591J93504n6682J11413
14033B71462O6099j64813j72782N4461O8565k74194j61831K56113J53899k42052
14023a45073k1370P9041K8648J93359q7356q8677J97416j18711k0945L53165K14056
$$ plain form
14096 160055 335914 455253 324277 92257 -131129 -201090 -218558 -209314 11618 281715
14086 281715 340148 304721 388631 841650 758831 460471 338996 122973 124159 167421 107795
14075 107795 -21641 1465 -51128 -242723 -239209 -273628 -349296 -458216 -499060 -324944 -222135
14064 -222135 -143382 -84483 208403 447136 185237 -101868 -2424 165485 -162222 -269392
14054 -269392 -32616 177506 378748 408260 331588 158770 -35534 129127 176036 -70104
14044 -70104 -171982 -216803 -126351 -298316 -223540 -130948 95818 23227 216731 160049 271462
14033 271462 337561 172748 -34 54427 122992 -151202 -313033 -56920 96979 -145073
14023 -145073 -166443 -87402 -58754 134605 47249 -41428 155988 37277 16332 369497 583553
14012E83553k20483k66310j54476J43477k5132j7825l167N6595n9631l20219k56037
14001e39655K53383K86080K21070j33492j62617N098J50726k177P8392q6335J8271
13990H8744p8111O7178J08333K15570k49926k5334n825N4282J1253L3404l2007
13979A87561L8212l23733l1725M23040j25790j24516q6733O3006k779J51633K84714
13968D52890K62940J19024k12153J429k82419l77971P5221j24544K8507p6139
13958a33215n8819J26668O1670J13993J23708k43606j8919l8669o9739j05989
13948b42917J81725J97401Q7476j11435q569r1919j71463J92933J91863m2308
13938A82787j85741l46108J55751J36296J92695J14052J1990O032M584K1942N2577
$$ plain form
14012 583553 363070 96760 -57716 85761 60629 42804 39637 96232 36601 -283618 -539655
14001 -539655 -286272 -192 220878 87386 -75231 -70133 80593 78416 156808 70473 88744
13990 88744 10633 77811 186144 401714 151788 126454 120629 174911 186164 219568 187561
13979 187561 225773 -97960 -129685 293355 167565 43049 -43684 19322 16543 168176 452890
13968 452890 715830 834854 622701 624130 341711 -36260 38961 -85583 -57076 -133215
13958 -133215 -192034 -65366 -3696 110297 234005 -9601 -28520 -67189 -136928 -242917
13948 -242917 -61192 136209 223685 112250 103681 11762 -159701 33232 225095 182787
13938 182787 -2954 -349062 -193311 -57015 135680 249732 261722 267754 272338 294280 346857
13927C46857j67648k81421j83789J17343Q6912L51951K25861k06178m12455m5097
13917a67664K43509P6462j61116J0392Q9654l45023K19567L25968n4516l48147
13907a10914m8737K5468k7328Q0101P7609J00548J14325j25451j40751J37003
13897H1873l12699j14972O7683L21001K40364j05969l27388K6926O1717o5679
13887a27143j80591P5580J00718J89215K40704K0980j26869j04547J2685l3322
13877F7410J14220J0939l22320j01395K52568R8164k84878j96821L3155L4452
13867b94506M3838P5J663L51928J40525R4259k9487j25135k07241j80913L6799
13856a68195j61606q9955N468J88054J47708N6213n8709n4664J98392j6114j60896
$$ plain form
13927 346857 179209 -102212 -286001 -168658 -81746 270205 496066 289888 -122567 -167664
13917 -167664 75845 152307 -8809 1583 91237 -253786 -34219 291749 237233 -110914
13907 -110914 -159651 -134183 -161511 -81410 -3801 96747 211072 85621 -55130 81873
13897 81873 -230826 -345798 -278115 42886 283250 177281 -150107 -123181 -61464 -127143
13887 -127143 -307734 -232154 -131436 57779 298483 319463 192594 88047 100732 67410
13877 67410 181630 192569 -129751 -231146 21422 119586 -165292 -362113 -328958 -294506
13867 -294506 -250668 -250593 -248930 102998 243523 337782 308295 183160 -24081 -204994 -168195
13856 -168195 -329801 -419756 -414288 -226234 -78526 -22313 -81022 -135686 62706 46592 -114304
13845a14304K70781J64492j32180j39535N2643L9862K63418q596j77269j30834
13835H8478k4007r6080j48451j63558o4628j04584K78511P5050o2222j79371K28833
13824a72029K53917m9677L4113K0474n0127J05279P4962J9216J00418J21679k26887
13813B31338J87921j0357l65218l91455K46109L39874P4964l25601k5442m7011
13803h4878K36816L4510l54965j92469L04245L01104k29726j00677J05502q1556
13793f2094o6110n0069J28385o314J66456j6655J60499R2340k19088l02301j25142
13782c00093R9018j12890J14855K26833K26878m4457J78968o2182J25630R8250
13772E50810k03631k60799L5221R4756Q6250l2220p6934O6298j4691p776k1410
$$ plain form
13845 -114304 156477 320969 188789 49254 101897 141759 405177 396581 219312 88478
13835 88478 64471 -31609 -180060 -343618 -408246 -512830 -234319 -159269 -221491 -400862 -172029
13824 -172029 81888 32211 66324 86798 36671 141950 216912 236128 336546 458225 231338
13813 231338 419259 408902 43684 -347771 -101662 238212 313176 -12425 -37867 -84878
13803 -84878 151938 186448 -168517 -360986 -56741 244363 14637 -86040 19462 -62094
13793 -62094 -128204 -178273 -49888 -56202 110254 93599 254098 346438 127350 -174951 -300093
13782 -300093 -201075 -313965 -199110 27723 254601 210144 389112 326930 452560 550810
13772 550810 347179 86380 121601 216357 302607 270387 193453 259751 245060 237284 215874
13761B15874M7372k44386P1190J73140k34053K15989J26326l50732r6803R2216
13751A6133j85809n8603K02148Q7918Q1917K4551j97251J36635K82826l7877j9452
13740C33136l82776k43954N8921Q8734j5994R7877n8808r3905Q1752L30835J24690
13729C20508o8453o7365j62517l4111L1823K00817L61088J36255n01187l26512
13719a09654J58909P2340j91237j36616L9921K9682l0725o251N748r806j75119
13708c52808L22959J89300J43786R9380K0405k45762k38800j73740M2694L78794
13698A86208K79187k4937k58817J61569k94376j07181J10238J87276J11590K69199
13688F19956J90532j45399j74798k44416l29200p4325K80478L64139J88145k14023
$$ plain form
13761 215874 263246 18860 90050 263190 29137 245126 371452 20720 -76083 16133
13751 16133 -169676 -228279 -26131 61787 143704 168255 -28996 107639 390465 352588 333136
13740 333136 -49640 -293594 -234673 -145939 -161933 -64056 -122864 -216769 -135017 195818 320508
13729 320508 252055 184690 22173 -11938 19885 220702 581790 718045 216858 -109654
13719 -109654 49255 121595 -69642 -206258 -166337 -136655 -167380 -173631 -167883 -177689 -352808
13708 -352808 -29849 159451 303237 402617 423022 177260 -61540 -235280 -192586 186208
13698 186208 465395 440458 181641 343210 48834 -58347 51891 239167 350757 619956
13688 619956 810488 665089 490291 245875 -83325 -157650 122828 486967 675112 461089
13678D61089l39059L5521M497o5891Q537n5041J14194Q2364j16914J7744j11515
13667C5526P9452q8063J20181K4887j33291j42405j98655r4333P1377N586L14862
13656d876j52125o340k28132r0570K31345L64402n1811k9311L60009J63063k15504
13645C40150k90249r461m4949J57126J88799p5855p8034J6013J88313j75801j10322
13634A05730j72166K97639J84427k9737k01740j63841M4463l6244k6666N3018
13624E4883q1167K49619L16609K31443l5211j47860q5649J52515o187l33543J27777
13613D43229K16930O8771r1760q671n1925j8907l14154o8711J17892M5764J17129
13602D55587J33725o9537k53234p7440J9094J44382r993n1555M88213K42725r9356
$$ plain form
13678 461089 122030 157551 162048 96157 104694 49653 163847 246211 129297 147041 35526
13667 35526 114978 26915 147096 171983 38692 -103713 -302368 -396701 -325324 -319738 -4876
13656 -4876 -157001 -163341 -391473 -482043 -250698 113704 61893 32582 392591 555654 340150
13645 340150 49901 40440 -4509 152617 341416 265561 187527 203540 391853 216052 105730
13634 105730 -66436 231203 415630 385893 184153 20312 64775 28531 1865 54883
13624 54883 -26284 223335 539944 771387 736176 588316 502667 655182 648995 315452 443229
13613 443229 660159 728930 637170 628499 576574 557667 243513 174802 292694 338458 455587
13602 455587 589312 519775 266541 189101 208195 352577 342584 291029 779242 1021967 922611
13591I22611j74388k23667n7308q4951P0168n5765N2951j25740o0851k47892j77163
13580a61995R6398J94663K88630K33754j65648k95176J12967P1225m6331N3049
13570C81536q4222m8995K09783K68276k49819j90466Q8543K87482r2375j15922
13560D53821j33425l76247J03020R8870J18624R6046j7894j43041P7024L00314
13550E77112K9377L85269K49382l77796j57449l625K48858k25294l54591j56857
13540B14386K31821J99148J29518n7299j08837j30484j64121J18981O3888j41032
13530C55969j63327O6890K34607R326k08780j2218j6434j80848J62792M7626P164
13519C02767J97688j16703p2002K55909j26451k81469K22749J27955p0831j61425
$$ plain form
13591 922611 748223 524556 467248 382297 452465 396700 449651 323911 263060 15168 -161995
13580 -161995 -65597 129066 417696 651450 485802 190626 303593 374818 328487 381536
13570 381536 297314 248319 458102 726378 476559 286093 374636 662118 569743 453821
13560 453821 320396 -55851 47169 146039 264663 360709 342815 199774 276798 577112
13550 577112 606489 991758 1241140 863344 705895 702270 951128 725834 371243 214386
13540 214386 446207 645355 774873 717574 608737 478253 314132 433113 497001 355969
13530 355969 192642 259532 494139 503465 294685 282467 266033 85185 247977 295603 302767
13519 302767 500455 383752 311750 567659 441208 159739 382488 510443 439612 278187
13509B78187L3252J28622m02255j06145J87647J25680r3980k29913L69538J54756
13499D45389m5327P576K18542Q6489k5067k62727K40122K95413l21450l78735
13489B60225O2485K21695k41189l19387N8474L16569K20085P2116j07236j96300
13479C47537M1165m3944j97077P1004L66206J53878k5981j61869m4186k99397
13469B07336r5732L5261L9157r0723P3008R4921q6831L0435K05015N6070L8955
13458E06872n087k35093k43755q0413K90504J94934l2773M6349j27190m4313K95864
13447E65899J08637j46972j44125M7886J25523o2420j30280P4471q5861k9392
13437C23366k4067R6719n8399j31228K3653J54580L378j89399k11701P0711j25733
$$ plain form
13509 278187 311439 440061 37806 -68339 119308 244988 151008 -78905 290633 445389
13499 445389 400062 407638 626180 712669 687602 424875 664997 960410 638960 260225
13489 260225 322710 544405 303216 -16171 42303 358872 578957 651073 543837 347537
13479 347537 388702 344758 147681 218685 584891 738769 712788 550919 506733 207336
13469 207336 111604 146865 186022 95299 168307 263228 176397 206832 411847 467917 506872
13458 506872 501785 266692 22937 -57476 233028 427962 395189 441538 314348 270035 565899
13447 565899 674536 527564 383439 431325 556848 494428 364148 438619 352758 323366
13437 323366 299299 396018 337619 206391 230044 384624 388002 198603 -13098 57613 -68120
13426f8120J19749P4641l2217j23315j21445J34441K13926J62465n6555j0375
13416B93195O401L41603L32555j56479j89034l57742j86797J14201j26792J6943
13406H8054K7626q2931N0097R183Q0387K18833J34232l1697j88256k32271M4558
13395A17815K24774J1042l0332K7078M5541k75088l47328R9631j6444j05014j9315
13384b67640R4529K19580L779N8079Q4439K71631J5922l05969j11359Q6986K88256
13373D38233K46956j60723j97174j5065J59137J36113j2143k40147L7729J6523
13363D09439n9959K20432K74837j35443o2130J23701k52152l48869j0099J83227
13353C42984j3455L3119K0924K78329J96589r6897k86370k28490J12757K69162
$$ plain form
13426 -68120 51629 126270 94053 -29262 -150707 -16266 197660 360125 303570 293195
13416 293195 299596 641199 973754 817275 628241 270499 83702 197903 71111 88054
13406 88054 115680 32749 82846 92029 172416 391249 525481 493784 305528 73257 117815
13395 117815 342589 353631 323299 350377 395918 120830 -226498 -126867 -143311 -248325 -267640
13384 -267640 -173111 46469 50248 108327 192766 464397 480319 174350 62991 149977 438233
13373 438233 685189 524466 327292 312227 471364 607477 595334 355187 392916 409439
13363 409439 349480 569912 844749 709306 647176 770877 518725 169856 159757 342984
13353 342984 329529 362648 383572 661901 858490 761593 475223 246733 359490 628652
13343F28652J41997j74820j66154q8066P0207M6639L3531k07725j13445L15550
13333D86366K90057O2168k90101l12654J03357J39856O9165l02934j59333l17645
13323b31698o5359K09626K57783j38103N1078J73036J60991K48297J41178R1863
13313H98692n4896k44353k68701j47648J23896J98170Q1068O2000j68592j51668
13303C27968k8852k7370M4829J23632j68218m0538o102j41200K2087o2205K52582
13292B96613K73440Q0188j41486l92366j41295k121K88604L10319J75099l06144
13282D40851l30562j47707K88448m8923R8856J07264k7512J69230j54712K26903
13272F22136R5652K2730j67964k06326N2203J35072M1646l18918o1808n2488m1720
$$ plain form
13343 628652 770649 595829 429675 341609 411816 458455 491986 284261 170816 486366
13333 486366 776423 838591 548490 235836 339193 479049 548214 245280 85947 -231698
13323 -231698 -297057 -87431 170352 32249 83327 256363 417354 665651 806829 898692
13313 898692 843796 599443 330742 183094 306990 505160 586228 648228 479636 327968
13303 327968 299116 271746 316575 440207 271989 231451 225349 84149 106236 44031 296613
13292 296613 570053 650241 508755 116389 -24906 -27027 261577 571896 746995 440851
13282 440851 110289 -37418 251030 202107 300963 408227 380715 549945 395233 622136
13272 622136 717788 740518 572554 366228 418431 553503 595149 276231 214423 161935 120215
13261A20215J0041O2028q4451o8687N7797M25438q3167j18978J27269Q408k2614
13250D33299j76118K31760K7168m2482k12329J3916o2029J9294p4388k86097j6371
13239a44377J31458J587p7655J70678K89110J43332n1575L74721K02516k57993
13229G81802l00618K69346j53398k08734j22436j5675K42926m02202j43204L00615
13219B48422L41910K39765J4449k06922k59082L8810J47194J99936K1018k59044
13209E26456J21796K34796J54180j90871j25351j17834q2386R2821J27490m36560
13199C04537p389R6726K00187J04495P5206m8050j64928M0275Q8461j47759k98997
13188B42764j47910J36308j1887o8945J41831J95906r2079k36249J835J60539
$$ plain form
13261 120215 130256 192284 107833 39146 96943 522381 439214 320236 447505 455913 433299
13250 433299 257181 488941 516109 473627 261298 275214 213185 232479 158091 -128006 -144377
13239 -144377 -12919 -11332 -88987 81691 370801 514133 462558 837279 1039795 781802
13229 781802 481184 750530 597132 388398 265962 250287 493213 91011 -52193 248422
13219 248422 590332 830097 844546 637624 378542 417352 564546 764482 785500 526456
13209 526456 648252 883048 1037228 846357 721006 603172 520786 613607 741097 304537
13199 304537 297148 393874 594061 698556 773762 725712 560784 601059 689520 541761 242764
13188 242764 94854 231162 219275 150330 292161 488067 395988 159739 161574 322113
13178C22113k18399N3963J74327K89009m6251k530j20637k09135K15669N67085
13168A025214q5317m874k52224k27370J35144J22377p0164J17538Q8252k28005
13158F20571N5739J69713J22950l09598j91168n8020N2611J92328j76689k92692
13148A85745J52279J3149Q6961K54185J07942l78564j1333n521r5423n0711k7233
13137B31476j01839k13846L03485Q3088J48624J48587M5668j04334Q3959N1215
13127F76083K49985L31808j77755k43832J14462q7436j65577l00905m7309J85122
13117E34646P6986l67039k63793R9438K6603K19307L46590L18974k07532o7640
13107G16540J95692J24481J30619N314m04311j90025J15145J33631l5052j12248
$$ plain form
13178 322113 103714 157677 332004 621013 574762 572232 451595 242460 458129 1025214
13168 1025214 939897 935023 682799 455429 590573 712950 642786 760324 848576 620571
13158 620571 676310 846023 968973 659375 468207 410187 462798 655126 478437 185745
13148 185745 338024 351173 438134 692319 800261 421697 410364 404843 309420 258709 231476
13137 231476 129637 -84209 219276 302364 450988 599575 645243 540909 624868 676083
13127 676083 926068 1257876 1080121 836289 950751 863315 697738 396833 349524 534646
13117 534646 611632 244593 -19200 80238 106841 326148 672738 991712 784180 716540
13107 716540 912232 1036713 1167332 1172646 768335 578310 693455 827086 792034 679786
13097F79786n2796j47698j14328J23811N3854j42279p9828K45321K16629O8629
13087H51101k7121R0418k59161k78554j86445J10395L63059j7449n346j52999
13077D87898L7339j06224J31605J11643K3497O4002j64986k45318o1013Q1982
13067C60425K95998R3422j42846o3874J86388J58589J79237p4603k24232j09752
13057F58752K86908J11551M627l41475J15847J65989R3320k20589l49205j65292
13047C60433m0266N2701J57097n8116K20781J25756J93444J47466j97378r9816
13037H62102J41086l11413J60484K84034j2721p5051R0883j63193k03431n4978
13027G17802p3063j86247K23087m4890k12290J03306J37417N6908J4828K89081
$$ plain form
13097 679786 626990 479292 364964 488775 542629 400350 320522 565843 782472 851101
13087 851101 823980 914398 655237 376683 190238 300633 663692 646243 640897 487898
13077 487898 525237 419013 550618 662261 685758 749760 584774 339456 278443 360425
13067 360425 656423 749845 606999 543125 729513 888102 1067339 992736 768504 658752
13057 658752 945660 1057211 1061838 720363 836210 1002199 1095519 874930 525725 360433
13047 360433 320167 372868 529965 471849 692630 818386 1011830 1159296 961918 862102
13037 862102 1003188 691775 852259 1136293 1123572 1048521 1139404 976211 772780 717802
13027 717802 644739 458492 681579 636689 424399 527705 665122 722030 736858 1025939
13017A025939Q8160j27373m6316q4638j08880n3530J90611K49170k34268o8359
13007H30516Q1565j18882m4003j16104J09351L62548P8454m786k30065l82709
12997E65885m3222n2573j77318J24904L59036N8292O8938M44105O3846l21772
12987A090121M4717P7355q2387j77068r9878K34389k25128j22028k63961J2959
12977D89091J36457j68964l7542K48091K25208j49361P2272K86735k7699j00316
12967I73972L30269J60113j94085j52493j01166K5140K76891p6748m29613k3564
12957G88716K14098o7427k04836O9292L45585K9981Q6300k16954l21681J76492
12947H99566L82919j59420m5709Q0522J28297K39856j33224j81355j56132O0630
$$ plain form
13017 1025939 1114099 986726 940410 855772 746892 693362 883973 1133143 898875 830516
13007 830516 912081 793199 749196 633092 742443 1104991 1183445 1178659 948594 565885
12997 565885 522663 470090 292772 417676 776712 835004 903942 1348047 1411893 1090121
12987 1090121 1134838 1212193 1129806 952738 852860 1087249 862121 740093 476132 489091
12977 489091 625548 456584 419042 667133 892341 742980 815252 1101987 1074288 973972
12967 973972 1304241 1464354 1270269 1117776 1016610 1041750 1318641 1241893 812280 788716
12957 788716 1002814 935387 730551 799843 1145428 1175409 1261709 1044755 723074 899566
12947 899566 1282485 1123065 1077356 1157878 1286175 1526031 1392807 1211452 1055320 1115950
12937A115950j18786j20631K94960P9831l6665k0487l05258m07643l8184l2669
12927D10418J06149p216N1797K67643J85275J6875j85522J990P5303n5091j57225
12916G10396p55L69423K30383Q1931J17770m1505k89820q8057j25392l2429l0038
12905I01907J07884J41706M7832k10931q6054J1086M7612k03474k94744Q5353
12895E48177J94547J46816K2586l2383Q219J28125J47293j95141k36912J13056
12885H44383J80099k11484m3542J42766M7215P5671J13790J29728j95833k38982
12875H43811L2428P7592O9814J41449j70406O0507R6857k43973j19017k42134
12865E46928M34295M71671j5984n3502k0721j1072r3065k12591j23156M1087J82136
$$ plain form
12937 1115950 997164 876533 1171493 1251324 1214659 1194172 888914 481271 443087 410418
12927 410418 516567 509351 561148 828791 1014066 1030941 845419 847409 922712 867621 710396
12916 710396 709641 1079064 1309447 1391378 1509148 1467643 1177823 1089766 964374 931945 901907
12905 901907 1009791 1151497 1199329 988398 902344 913430 961042 757568 462824 548177
12895 548177 742724 889540 912126 879743 887962 1016087 1163380 968239 731327 844383
12885 844383 1024482 812998 769456 912222 959437 1035108 1148898 1278626 1082793 843811
12875 843811 876239 953831 1023645 1165094 994688 1055195 1152052 908079 789062 546928
12865 546928 981223 1452894 1436910 1383408 1362687 1351615 1258550 1045959 922803 963890 1146026
12854A146026J24067J12714j75082q7708n4550L429j24241k44040J30171J50462
12844I81248M4344J83644J58639R4570k2571n6176k20512j55062j4791L15966
12834A309299L05187J86826j5719M3727l2632j52611n09542j84119j4934J03117
12824A038599M4452j41251k03148K8727L34393L10886q4724j43957P4528q7928
12814A170577Q4521J90765J59949j28666m25181l5721P9174M2643k44867L79110
12804A272304M88808J03160L0715j56378l2324j4503j51908K668m6646k43594
12794A252302k13338K76013L77780k3006k84208l20450Q6298K41022J14246O490
12784A513149L60160K9305k57251N7288R4868j9511Q091j84274q4513J030N1064
$$ plain form
12854 1146026 1270093 1382807 1207725 1120017 1065467 1068896 944655 700615 830786 981248
12844 981248 1025592 1209236 1367875 1462445 1439874 1383698 1163186 1008124 993333 1309299
12834 1309299 1614486 1801312 1785593 1829320 1796688 1644077 1134535 950416 935482 1038599
12824 1038599 1083051 941800 738652 767379 1101772 1412658 1327934 1183977 1258505 1170577
12814 1170577 1255098 1445863 1605812 1477146 1051965 1016244 1095418 1138061 893194 1272304
12804 1272304 1761112 1864272 1894987 1738609 1706285 1691782 1539874 1542542 1495896 1252302
12794 1252302 1038964 1314977 1692757 1669751 1385543 1065093 1151391 1392413 1506659 1513149
12784 1513149 1873309 1902614 1645363 1702651 1797519 1778008 1786099 1601825 1517312 1518342 1569406
12773A569406J68887k0553J45596l23937j19104J42552l2313o929j89032J78154
12763A512727j49922j89719Q8395J95571l37280Q499J90881K63068J71429q1060
12753A672589q9615j7246k4450j29703J02034M1374j34793n5760j09783l2201
12743A222446l9795R0999K14738K39803k86206k12413J96638O4044j2388j6388
12733A461478r1746m7006K42578J82806m6445j8713P5842J66417r2759k77826
12723A554626M135K71964m5153j6856j31529J44284J95544Q7743j55304j2038
12713A897416n4704J29463j5720l8171Q5596M167m2427J3060j04154O6609j6059
12702A925076l91755k07983J60025M94894m1578J76548j07686r6080J6598l22763
$$ plain form
12773 1569406 1738293 1717740 1863336 1539399 1420295 1562847 1530534 1523605 1334573 1512727
12763 1512727 1362805 1173086 1261481 1457052 1119772 1128271 1319152 1582220 1753649 1672589
12753 1672589 1582974 1565728 1541278 1411575 1513609 1554983 1420190 1364430 1254647 1222446
12743 1222446 1182651 1273650 1488388 1728191 1441985 1229572 1426210 1490254 1477866 1461478
12733 1461478 1369732 1322726 1565304 1748110 1701665 1682952 1758794 1925211 1832452 1554626
12723 1554626 1558761 1830725 1785572 1768716 1637187 1781471 1977015 2064758 1909454 1897416
12713 1897416 1842712 1972175 1956455 1918284 2003880 2008047 1965620 1978680 1874526 1941135 1925076
12702 1925076 1533321 1325338 1485363 1980257 1938679 2115227 2007541 1911461 1928059 1605296
12692A605296Q5958O8831j62511j48325K14717L28399J72167l2540o6534l87618
12682A677840L1223k7199J30316j66226Q240K54527O1640j3914J39561n45J11145
12671B206608j89736j76564J65898M9934k87669k74587K78119o3273J32826N7573
12661A899129L3193k25693M3223N6635k23150J39762L4322O0884L73200N1557
12651B243062p1108L4165J04341l310R4002j24041J8357m7637q3902J4988j76801
12640B002116j73122m6462P7946K02769j192M1413K21353K2098N6872o03J50319
12629B553507m2853l12909m08301k9727J58712K51706J55122M56703J15511k65957
12619B631514j97528j17252j92618k34815Q4046J71072K26914o4883j27935L2101
$$ plain form
12692 1605296 1691254 1760085 1597574 1449249 1663966 1992365 2164532 2131992 2065458 1677840
12682 1677840 1709063 1681864 1812180 1645954 1654194 1908721 1970361 1956447 2096008 2095463 2206608
12671 2206608 2016872 1840308 2006206 2056140 1768471 1493884 1772003 1708730 1841556 1899129
12661 1899129 1932322 1706629 1749852 1806487 1583337 1723099 1757421 1818305 2191505 2243062
12651 2243062 2171954 2206119 2310460 2307150 2401152 2277111 2295468 2247831 2163929 2178917 2002116
12640 2002116 1828994 1782532 1860478 2063247 2062055 2103468 2324821 2346919 2403791 2403188 2553507
12629 2553507 2510654 2197745 1789444 1759717 1918429 2170135 2325257 2781960 2897471 2631514
12619 2631514 2433986 2316734 2124116 1889301 1973347 2144419 2371333 2306450 2178515 2210616
12609B210616N3110q2703N56465K02204O7460K184k41095k02495o8900J67889
12599B664735J01356j06159L2812N6949p7051k81723j37288M67682J43241j81190
12589B683364j1339j44689n8971L46372L7407K607j18601k27350j66604J24020
12579B466216O5275l1298k12798M3598P7086J31035J86980J3694M89J08955K79831
12568C129063k6197j82252J47107r2148L9191l0112O9015O1560j93138k5255K300
12557B899134q510n8992m506R0357n3497K25344J46147j39169k07213M6922K35802
12546C171819J09347k27242j23493k32158o2561o739K3841j15914J60361Q0588
12536B777849J08647j5992j00957K42218L16142M412J4600P9332k78844j14144
$$ plain form
12609 2210616 2263726 2181023 2737488 2939692 3007152 3009336 2768241 2565746 2496846 2664735
12599 2664735 2766091 2659932 2692744 2749693 2672642 2390919 2253631 2721313 2864554 2683364
12589 2683364 2672025 2527336 2468365 2814737 2852144 2854751 2736150 2508800 2342196 2466216
12579 2466216 2531491 2500193 2287395 2330993 2408079 2539114 2726094 2739788 2740277 2849232 3129063
12568 3129063 3102866 2920614 3067721 2975573 3014764 2984652 3053667 3115227 2922089 2896834 2899134
12557 2899134 2890624 2831632 2827126 2917483 2863986 3089330 3235477 3096308 2889095 2936017 3171819
12546 3171819 3281166 3053924 2930431 2698273 2635712 2628973 2652814 2536900 2697261 2777849
12536 2777849 2886496 2870504 2769547 3011765 3327907 3332319 3346919 3426251 3147407 3033263
12526C033263R443q8830K04062J49335J58162J52342K71560o7397l12222n1571
12516C458147o904l32380j47363K45643q8161k65209m36820n7708M81396J06376
12506B957017K3049k12880Q8189L00618L52199K12054r9001k43950Q6738k03124
12496C260909j34442K77696L30386j36768j74862j3759Q7319J20414m3980k8997
12486C543916K12367K00243q4676k73416k28230j76601J28556K50190K89408J92347
12476D054104K25951O0952k14361k39280q2590N1310j23304j20172P97k02269
12466C411138L04656M42838j0857m65167r1792k8369j65698J79131P7249j49414
12456C503715j8575K48489L04055k4993j69763k14632L3789J18050P490k5773
$$ plain form
12526 3033263 3042706 2953876 3157938 3307273 3465435 3617777 3889337 3821940 3509718 3458147
12516 3458147 3451243 3118863 2971500 3217143 3128982 2863773 2426953 2369245 2850641 2957017
12506 2957017 2980066 2767186 2855375 3155993 3508192 3720246 3621245 3377295 3464033 3260909
12496 3260909 3126467 3404163 3734549 3597781 3422919 3409160 3496479 3616893 3572913 3543916
12486 3543916 3756283 3956526 3871850 3598434 3370204 3193603 3322159 3572349 3861757 4054104
12476 4054104 4280055 4341007 4126646 3887366 3804776 3856086 3732782 3612610 3613407 3411138
12466 3411138 3715794 4158632 4147775 3682608 3590816 3562447 3396749 3575880 3653129 3503715
12456 3503715 3485140 3733629 4037684 4012691 3842928 3628296 3662085 3780135 3787625 3761852
12446C761852j091J02337L20685O9693J9382m1673j85934J9604O6892K5026k46775
12435C909998J63907K58731O5585j24838N3534k1615K7666L00387J0124j09167
12425D534312P8469J98425j62283l07205j54135K68659J71849J15250P4646l69157
12415D448830J2273R0606J71567J85756j30186j50143K57810K95225J20367l929
12405E298176k29520k71829j54243N7971P8190o6025k32317l352R7651L7399K75950
12394D888051K673j38722J09254J14886Q473j36071j63136K29249L7955O5858
12384E018470K21828k04165r7398J26294O6824L21187J41474R9058j40858j13646
12374E439068l37687j13444K42317J43785o4753j79277Q3281J17351L57850K0498
$$ plain form
12446 3761852 3760761 3863098 4183783 4253476 4272858 4231185 4045251 4064855 4131747 4156773 3909998
12435 3909998 4073905 4332636 4398221 4273383 4326917 4305302 4332968 4633355 4643479 4534312
12425 4534312 4612781 4811206 4648923 4341718 4187583 4456242 4628091 4743341 4817987 4448830
12415 4448830 4461103 4551709 4723276 4909032 4778846 4628703 4886513 5181738 5302105 5298176
12405 5298176 5068656 4796827 4642584 4700555 4778745 4712720 4480403 4477051 4574702 4612101 4888051
12394 4888051 4890724 4752002 4861256 4976142 4984615 4848544 4685408 4914657 4952612 5018470
12384 5018470 5240298 5036133 4938735 5065029 5131853 5453040 5594514 5693572 5552714 5439068
12374 5439068 5101381 4987937 5230254 5374039 5309286 5130009 5213290 5330641 5688491 5708989
12364E708989j96159m8323L89843K31532j36909M5485J32165n6631j33386p676
12354E928930Q2708j52497k03694p1899N1271O8485J15935J39512K95242J64744
12344F418737j18978J0878p1366k36661N9199j82965j04842n0754L94320K63631
12334F381199N2356K03594L4894j57015K38360k48658j79202j2647J68622J92957
12324F674460k8916J52470J63750j08338J03930J12724J22483P5882o478P7642
12314G339609K5652k4733N2292O503j37901r5029L12909L8302N7568R7101k3392
12303G648881K44048q9496j92976O5449P8487J12397J81783J5027k7542R7151
12293H133209k06363O1360O9725K02293P4657q9423k0680K11653K74931K15709
$$ plain form
12364 5708989 5512830 5464507 5854350 6085882 5948973 5994458 6126623 6069992 5936606 5928930
12354 5928930 6011638 5859141 5655447 5583548 5634819 5703304 5819239 5958751 6253993 6418737
12344 6418737 6299759 6310637 6239271 6002610 6061809 5878844 5774002 5723248 6117568 6381199
12334 6381199 6433555 6637149 6672043 6515028 6753388 6504730 6325528 6312881 6481503 6674460
12324 6674460 6645544 6798014 6961764 6853426 6957356 7070080 7192563 7268445 7261967 7339609
12314 7339609 7365261 7340528 7392820 7399323 7261422 7166393 7479302 7517604 7575172 7672273 7648881
12303 7648881 7892929 7803433 7610457 7675906 7754393 7866790 8048573 8063600 8036058 8133209
12293 8133209 7926846 7988206 8057931 8260224 8334881 8245458 8224778 8436431 8711362 8927071
12283H927071Q1958m5632j66972L63538K69482O88935P93027J339435J998340
12274A4249182J487261m61597j820428j547372q25040n28816l86940j52118N2295
12265A0066427o5058l15854k41420J17034k24330j62211J39256L0604K4204K21371
12255I590023K15623J55680k44348p0068j19711P1357Q25J83453Q6990M0410J06107
12244A0016341J33354R8175R46O1264L093K65216K94892J8089O3665J60961J27112
12233A1243108J0359j39262Q2877J21926M774j11995o2198K34666J92112j68685
12223A1407682Q5229M4115J0289L13606J14690k1175j9802j28817J40881K56744
12213A2203442M4162l6906J26626J64857Q5935l6177o3493L1959J41073J92533
$$ plain form
12283 8927071 9009029 8963397 8796425 9159963 9429445 10118380 10911407 12250842 14249182
12274 14249182 15736443 15274846 13454418 11907046 11082006 10553190 10166250 10014132 10066427
12265 10066427 10001369 9685515 9444095 9561129 9336799 9174588 9313844 9344448 9368652 9590023
12255 9590023 9805646 9961326 9716978 9646910 9527199 9598556 9599381 9782834 9869824 9910234 10016341
12244 10016341 10149695 10247870 10248816 10310080 10313173 10578389 10873281 10891370 10955035 11115996 11243108
12233 11243108 11253467 11114205 11197082 11319008 11323782 11211787 11149589 11384255 11576367 11407682
12223 11407682 11492911 11537026 11547315 11860921 11975611 11954436 11934634 11805817 11946698 12203442
12213 12203442 12247604 12210698 12337324 12502181 12588116 12551939 12488446 12520405 12661478 12854011
12203A2854011K78143O8516M1784L7790l64721J54964M75982J57421J63740r3904
12193A3773726M615l2158M3416L17042K89964N873o801K91021K93527q7575J2459
12182A4905109K6192n8727m76K54504M5270Q4963J97428K0287J04231j35763P5963
12171A5518981K96367P3836j03872J69212K99023K07518L69192J76329n055J30596
12161A7132127R3703r5923j00259J43223J15671p0455M2701J22947J52068n9897
12151A7475906K12038K77503K90917J7631J90977K35667K66335J10455n0536J1384
12141A9038277K04738J29137J72725K92080J35558L6719M5133N1058J44407K30086
12131B0479918J34902K8348n0149J88153K52608J2829M15565J78133K9350J40954
$$ plain form
12203 12854011 13132154 13200670 13242454 13280244 12915523 13070487 13546469 13703890 13867630 13773726
12193 13773726 13778341 13746183 13789599 14106641 14396605 14402478 14395677 14686698 14980225 14892650 14905109
12182 14905109 14931301 14872574 14872098 15126602 15171872 15256835 15454263 15474550 15578781 15443018 15518981
12171 15518981 15815348 15889184 15785312 15954524 16253547 16461065 16830257 17006586 17001531 17132127
12161 17132127 17225830 17129907 17029648 17172871 17288542 17218087 17260788 17383735 17535803 17475906
12151 17475906 17687944 17965447 18256364 18273995 18464972 18700639 18966974 19077429 19026893 19038277
12141 19038277 19243015 19372152 19544877 19836957 19972515 20009234 20054367 20105425 20249832 20479918
12131 20479918 20614820 20643168 20593019 20781172 21033780 21046609 21462174 21640307 21669657 21810611
12121B1810611j68460o3281J59610N33548K37681L26679M10716O0483j18081J52814
12111B3342320J65141O8354r9506J80430L20919J63202J88520K90307L94815L16262
12101B5330764K02937O9929J14198j55649J29566L97554M85464K50033J2052J00905
12091B6937753K62100M12658J2992K27197M86311J03615n8463J62611P0355j82614
12081B8434515J6762M36437M86839J87827p926J60248J85417M63851N3992N81892
12071C0999854N01417K62717K21866P9287J75086K34301L08700o4741J82465M92014
12061C3392966K26056J02905J59257L10059O76208J13014j87873J96617N01428
12052C5490637R9975K23645K68451L29832L38934J71424L27675K28673M19581
$$ plain form
12121 21810611 21642151 21578870 21738480 22272028 22509709 22836388 23247104 23307587 23189506 23342320
12111 23342320 23507461 23575815 23476309 23656739 23977658 24140860 24329380 24619687 25014502 25330764
12101 25330764 25533701 25603630 25717828 25562179 25691745 26089299 26574763 26824796 26836848 26937753
12091 26937753 27199853 27612511 27625503 27852700 28339011 28442626 28384163 28546774 28617129 28434515
12081 28434515 28451277 28887714 29374553 29562380 29554454 29714702 29900119 30363970 30417962 30999854
12071 30999854 31501271 31763988 31985854 32065141 32240227 32474528 32783228 32718487 32900952 33392966
12061 33392966 33619022 33721927 33881184 34191243 34867451 34980465 34792592 34989209 35490637
12052 35490637 35590612 35814257 36082708 36412540 36751474 36922898 37250573 37479246 37898827
12043C7898827J09430m6741K74029K35507K09991J34181K64356N85178K29698
12034C9894456O7166p6269L45262L30912J03822L88395L69809M41633J11626L7550
12024D2014362L63121K07192k05789J61772P15185M73701M35224L48513K8961
12015D4542242L60206M54771K17920l9642L37409J76257K55909J71958P3053L87235
12005D6937318R3453L0795K89689N02986P19199M06828J45698P9705j10198J64447
11995D9259920M62840K47478R2580J59708R8803J65606J74582K80311J42402N21302
11985E1605532K65499K52750K81759J06471N4978K87458K81707o1505J95509L53717
11975E3623875M7166j49305K35335J76305O0777L61131K7083N8906K2650K4615
$$ plain form
12043 37898827 38008257 37961516 38235545 38471052 38681043 38815224 39079580 39664758 39894456
12034 39894456 39961622 39885353 40230615 40561527 40665349 41053744 41423553 41865186 41976812 42014362
12024 42014362 42377483 42584675 42378886 42540658 43255843 43729544 44164768 44513281 44542242
12015 44542242 44902448 45357219 45575139 45535497 45872906 46049163 46305072 46477030 46550083 46937318
12005 46937318 47030771 47061566 47351255 47854241 48573440 48980268 49125966 49205671 49095473 49259920
11995 49259920 49722760 49970238 50062818 50222526 50321329 50486935 50661517 50941828 51084230 51605532
11985 51605532 51871031 52123781 52405540 52512011 52566989 52854447 53136154 53074649 53270158 53623875
11975 53623875 53671041 53521736 53757071 53933376 53994153 54355284 54382367 54441273 54463923 54488538
11965E4488538L3791J4920L44512J42515J70014L06946j34575N9964K23635J57977
11955E5808237j96175O799L30441j42588k18154R8637n7376K32960J3909J27857
11945E6004547j2238j69601K18366Q8932j43259j29953l33553j99700J76911j07687
11935E5392765l43160m6222J91554J47410m6875q1051j20023O7676j04877j65085
11925E4892112r3073k9696m80262J37591J75530k11582l38113k06406k446j04176
11915E3739479j68480l02429j59113j74192r8482k64549l95456k44865n1892j01107
11905E1778914j84574l39136n5972L1254j35400k96572n36675l6628k58415k59455
11895D9707341m82888n2521K08622j74799l06511m50558n48264m20774L0148q4646
$$ plain form
11965 54488538 54522329 54537249 54881761 55024276 55194290 55501236 55366661 55426625 55650260 55808237
11955 55808237 55612062 55618861 55949302 55806714 55588560 55687197 55629821 55862781 55876690 56004547
11945 56004547 55992309 55822708 56041074 56130006 55986747 55856794 55523241 55323541 55500452 55392765
11935 55392765 55049605 55003383 55194937 55342347 55295472 55214421 55094398 55162074 55057197 54892112
11925 54892112 54799039 54769343 54289081 54426672 54602202 54390620 54052507 53846101 53843655 53739479
11915 53739479 53570999 53268570 53109457 52935265 52836783 52572234 52176778 51931913 51880021 51778914
11905 51778914 51594340 51255204 51199232 51230486 51095086 50798514 50261839 50225211 49966796 49707341
11895 49707341 49224453 49171932 49380554 49205755 48899244 48448686 47900422 47479648 47509796 47425150
11885D7425150j69699K2453n6782k96335J71370j02028n83221m75117m18012k63373
11875D5254406n24516k65449k40120j58503j89870n6580J3717k67862l55588m29801
11865D2779834m56820j98039l72784l76202k49930j81389j96468j57667m25586
11856D0164949l94251k62627l53860j90611M7970n77887k76854l57025j29379
11847C7670425o4418l55591l12891l86851l73427l95373J68079N5760k52105l70985
11837C5382623k70950k16307m90367m33517j46280P4427j06459k03108j52466
11828C3437596l75470m18011l14629j08169r417N1971j33440l01858l25900m41834
11818C1060839j96334l41652j25862j09149l73733k94759j91582l96321j28803
$$ plain form
11885 47425150 47255451 47277904 47221122 46924787 47096157 46994129 46410908 45935791 45517779 45254406
11875 45254406 44729890 44464441 44224321 44065818 43875948 43819368 43833085 43565223 43209635 42779834
11865 42779834 42323014 42124975 41752191 41375989 41126059 40944670 40748202 40590535 40164949
11856 40164949 39770698 39508071 39154211 38963600 39011570 38433683 38156829 37799804 37670425
11847 37670425 37606007 37250416 36937525 36550674 36177247 35781874 35949953 36005713 35753608 35382623
11837 35382623 35111673 34895366 34404999 33971482 33825202 33899629 33793170 33590062 33437596
11828 33437596 33062126 32644115 32329486 32221317 32211900 32263871 32130431 31828573 31502673 31060839
11818 31060839 30864505 30522853 30396991 30287842 29914109 29619350 29427768 29031447 28902644
11809B8902644R2326j61524k48756m51198j40085j30008j91757l23673l92437
11800B6955532k65485j08052O1881k944k60284l48266L1161N1311j31022r2682
11790B5891150k37219k40516k60504m99k91264m04502o3367N8299l21649l61992
11780B3767937k24036n3938k02113l28793l88710k15140n6329p7988m91887j89434
11770B1539569j1088k47392j2146K5852k33593l41919k62900m9751M9811O5587
11760B0522030p0612k78441l81190j699j24562q2979l8136j13048j17560l5213
11750A9278590j33843l31267l16417l6368K41084N9762j89924l91442k92938J6162
11740A7903399O277o5204j29742l03914n7076M786l3519k45560l34537k35908
$$ plain form
11809 28902644 28994970 28833446 28584690 28133492 27993407 27863399 27671642 27347969 26955532
11800 26955532 26690047 26581995 26643876 26640932 26380648 26032382 26063543 26114854 25983832 25891150
11790 25891150 25653931 25413415 25152911 25152412 24861148 24456646 24393279 24451578 24129929 23767937
11780 23767937 23543901 23489963 23287850 22959057 22570347 22355207 22298878 22220890 21729003 21539569
11770 21539569 21528481 21281089 21268943 21294795 21061202 20719283 20456383 20406632 20456443 20522030
11760 20522030 20451418 20172977 19791787 19790088 19665526 19582547 19544411 19431363 19313803 19278590
11750 19278590 19144747 18813480 18497063 18460695 18701779 18761541 18571617 18180175 17887237 17903399
11740 17903399 17909676 17844472 17714730 17410816 17353740 17358526 17325007 17079447 16744910 16509002
11730A6509002N2063r3996q7273m8926O7022k28409p8251K2677k69674l47576
11720A5496659k26367J7262m3248o4556j59971k61146k1483J0823o2768Q9337
11710A4774542q4244l47487k15695p2840k74026j61535j62081J77781J36428O9283
11700A3840126k08531m79190p6428Q7142j63831k45127O7107K8160k14428M9509
11690A2684509L86750P3043N008k01352l50246o7986k05854l08733k16786j29785
11680A1668568J47013K10021J04877j18055k04084l096J55798j27580j06482j09154
11670A1617826m2621j24809j15495j46568j26413m29134j26878R7519j40345r0372
11660A0372710J01541k14352K59122J76138j48062j27335k3066J47823k6246k80834
$$ plain form
11730 16509002 16561065 16467069 16379796 16330870 16397892 16169483 16091232 16113909 15844235 15496659
11720 15496659 15270292 15287554 15244306 15179750 15019779 14758633 14737150 14747973 14685205 14774542
11710 14774542 14690298 14342811 14127116 14054276 13780250 13618715 13456634 13634415 13770843 13840126
11700 13840126 13631595 13152405 13075977 13163119 12999288 12754161 12821268 12849428 12635000 12684509
11690 12684509 13071259 13144302 13149310 12947958 12597712 12529726 12323872 12015139 11798353 11668568
11680 11668568 11815581 12025602 12130479 12012424 11808340 11805244 11961042 11833462 11726980 11617826
11670 11617826 11575205 11450396 11334901 11188333 11061920 10632786 10505908 10603427 10463082 10372710
11660 10372710 10474251 10259899 10519021 10695159 10547097 10419762 10396696 10544519 10518273 10237439
11650A0237439j42312j17565j56584R3945K79144p6844k28494l7742k58846q5659
11640I506482k16487k8421q0284K83810K09038j71098j26971k25767r8002L0939
11630I083239j46501J26384K11735k45000n8093K96683O6860j84080l1470p5851
11620I043906k17689J1705M9495k24208l46639j0071J58164k02788r2219n3147
11610H116509k834n9985l65765r2987L8920L68745K14305n3013j66204k48374
11600G749317p5510k29085k12386r4030R9785q1982Q0574L69675K4693j0551Q7816
11589G708316l55328j40796j50904j47419Q0760K63880j15848k06476k04636j93709
11579F537840O0685j83187J8520Q1421j80511o1116O702Q8622K3496N8505J22070
$$ plain form
11650 10237439 10095127 9977562 9820978 9914923 10194067 10117223 9888729 9850987 9592141 9506482
11640 9506482 9289995 9261574 9181290 9465100 9674138 9503040 9376069 9150302 9052300 9083239
11630 9083239 8936738 9063122 9274857 9029857 8971764 9268447 9335307 9151227 9119757 9043906
11620 9043906 8826217 8837922 8887417 8663209 8316570 8306499 8464663 8261875 8169656 8116509
11610 8116509 8113675 8053690 7687925 7594938 7633858 8002603 8216908 8163895 7997691 7749317
11600 7749317 7673807 7444722 7232336 7138306 7238091 7156109 7236683 7606358 7631051 7620500 7708316
11589 7708316 7352988 7212192 7061288 6913869 6994629 7258509 7142661 6936185 6731549 6537840
11579 6537840 6598525 6415338 6433858 6515279 6334768 6273652 6280354 6368976 6392472 6450977 6573047
11568F573047p0937p8316j16690J4974q9684K89218m3853n33303q748J90763P6392
11557F202863k82183l6140n1653N0959M8977k2824J16159L741j53593k23358m238
11546E648710j86523J1009J04637O0319K2517K13100K65983o0761J267n3177k45826
11535E781255j95639j91321J68411j51116q8855K84528j7080L4313M203p1990
11525E556709j17768l87835P3924K58326J8117J14226j24277j8754R8239j00302
11515E370605l95848l4441K31770R2928J7507j88860j07433J11380K7490k17132
11505D907966k22576K47927J93886k29163l31533N9288o6356r4146j11328Q5927
11495D439892P9180j0498k06508P299m7032M430J41969j45111j83025k63465j59017
$$ plain form
11568 6573047 6502110 6423794 6307104 6322078 6232394 6521612 6477759 5944456 5935708 6126471 6202863
11557 6202863 5920680 5884540 5832887 5883846 5932823 5909999 6026158 6029899 5876306 5652948 5648710
11546 5648710 5462187 5473196 5577833 5638152 5660669 5873769 6139752 6078991 6080258 6027081 5781255
11535 5781255 5585616 5394295 5562706 5411590 5322735 5607263 5590183 5624496 5628699 5556709
11525 5556709 5438941 5051106 5125030 5383356 5401473 5515699 5391422 5372668 5470907 5370605
11515 5370605 4974757 4940316 5172086 5265014 5282521 5093661 4986228 5097608 5125098 4907966
11505 4907966 4685390 4933317 5127203 4898040 4566507 4625795 4559439 4465293 4353965 4439892
11495 4439892 4519072 4508574 4302066 4309365 4262333 4266763 4408732 4263621 4080596 3817131 3658114
11484C658114n821K72145K85993J54121j63912j40531L4180J87823K1207l13953
11474C989366n9419N9802O8971K71900L33362j55483l97220m00739k52350K26486
11464C684676M82588K70166r763j71001n8274K06245k33620k91654l26056K2336
11454C575643K67764R7698K7307J6305n8356j6759N6995j50025k60786l529J16722
11443C668979J71447J23485K05711j08248l21937r5539l0302K53320N1155J3714
11433C931785j74064j02194J08698l06120j56857L2861R209L0845J33649m72461
11423C035351J420K40684j93279k17618N9248L08930K97166k35777l20724R3853
11413C069254J03899J76713J71152o0278j01708l52208J06759o2878k18829L18245
$$ plain form
11484 3658114 3652293 3924438 4210431 4364552 4200640 4060109 4094289 4282112 4303319 3989366
11474 3989366 3929947 3989749 4058720 4330620 4663982 4508499 4111279 3710540 3458190 3684676
11464 3684676 4167264 4437430 4427667 4256666 4198392 4404637 4171017 3879363 3553307 3575643
11454 3575643 3843407 3941105 3968412 3984717 3926361 3909602 3966597 3816572 3555786 3552257 3668979
11443 3668979 3840426 3963911 4169622 4061374 3739437 3643898 3613596 3866916 3918071 3931785
11433 3931785 3757721 3655527 3764225 3458105 3301248 3334109 3343318 3374163 3507812 3035351
11423 3035351 3036771 3277455 3084176 2866558 2925806 3234736 3531902 3296125 2975401 3069254
11413 3069254 3173153 3349866 3521018 3460740 3359032 3006824 3113583 3050705 2831876 3150121
11403C150121O1415k04602j6868N8176K8717r0213K57938l0619K9926N8307n6440
11392C245858p5089j71597k08007k77270j03849R5068J20905R9434K6450k06905
11382B544998J4157j77359q9216L3698K21627K15075K17148o5566r09j34237k71477
11371B507939r9799J64830O4015O2337K1056K22766j16064k25993l1674J51674
11361B721087k31332O7170L2599R2364L1313l27243j06521j55213k04882J47490
11351B066832J83943L5709P2304L03607J54676k88868j16146j3514k4032m05925
11341A968586J55215K87269J82270j8690j35987K2148j42404k10594J05185K86968
11331B499966k3622j19319j96023j41661p2933R0383K98436P3800J8270j58704
$$ plain form
11403 3150121 3211536 3006934 2990066 3048242 3076959 2986746 3244684 3214065 3243991 3302298 3245858
11392 3245858 3170769 2999172 2791165 2513895 2410046 2505114 2626019 2725453 2751903 2544998
11382 2544998 2559155 2381796 2292580 2326278 2547905 2762980 2980128 2914562 2913653 2779416 2507939
11371 2507939 2408140 2572970 2636985 2699322 2720378 2943144 2827080 2601087 2569413 2721087
11361 2721087 2489755 2556925 2589524 2681888 2713201 2385958 2279437 2124224 1919342 2066832
11351 2066832 2250775 2286484 2358788 2662395 2817071 2528203 2412057 2398543 2374511 1968586
11341 1968586 2123801 2411070 2593340 2574650 2438663 2460811 2318407 2107813 2212998 2499966
11331 2499966 2476344 2357025 2161002 2019341 1946408 2036791 2335227 2409027 2427297 2268593
11321B268593k91172N4321K99737R1555p569J31416J8100r575k35958k4064J88921
11310B484305J80851l43584l13830K4006j18296K84232R5995n6974J51968p9919
11300B308754j99202J36897K32617m6816r1640j83734j15519Q1976j3569j1608
11290B098156k47931j04332K18K7244j01603K3228L17706J48517k26295k13677
11280A721231O3811P7600Q0218P8893k8701M4182K29165j2648p2034R4857J44303
11269B420877Q0626j63519m1966j08942j95852k24962k20580j70284L10939K34823
11259A921160p1462K00710K6169k37956l205K878k69956N5446Q5136M091j60095
11248A552916J39334O6273j46830k1420K9907J35435J63428J09782l4039L8086
$$ plain form
11321 2268593 1977421 2031742 2331479 2423034 2415465 2546881 2564981 2555406 2319448 2295384 2484305
11310 2484305 2665156 2321572 2007742 2031748 1913452 2197684 2293679 2236705 2388673 2308754
11300 2308754 2109552 2246449 2479066 2432250 2340610 2156876 2041357 2123333 2109764 2098156
11290 2098156 1850225 1745893 1746111 1773355 1671752 1694980 2012686 2161203 1934908 1721231
11280 1721231 1785042 1862642 1942860 2021753 1993052 2037234 2266399 2253751 2181717 2276574 2420877
11269 2420877 2501503 2337984 2296018 2187076 1991224 1766262 1545682 1375398 1686337 1921160
11259 1921160 1849698 2050408 2076577 1838621 1835416 1838294 1568338 1623784 1708920 1713011 1552916
11248 1552916 1692250 1758523 1611693 1590273 1620180 1755615 1919043 2028825 1994786 2032872
11238B032872K07265j85540k51922j66527j94004j03721n3177J13591J16565q5168
11228A430234j92407J00608j8037J08810K23916Q3179k84051r9688L32786K27906
11218A913256j12536j7144O6831o0444j74112L04p2679J57156q6942j6705k09884
11207A387101J81056M23311L5338r3000L54402L41799m09631l73296o9055K6848
11197A804873K30297p5278l0203j28034l08473q6937j85880q5709K47206K74012
11187A655874k07606J01992L1568J82111M0235J66943j64289k48904j33741Q0493
11177A504676K78181J86470k29074k21715O7471O3653J56597j64886n6253J59651
11167A744771q0514J61761j2998k17698j557k07701j37134m8080o5024n1448q6258
$$ plain form
11238 2032872 2240137 2054597 1802675 1636148 1442144 1338423 1285246 1398837 1515402 1430234
11228 1430234 1237827 1338435 1320398 1429208 1653124 1736303 1452252 1352564 1685350 1913256
11218 1913256 1800720 1783576 1850407 1789963 1615851 1616155 1543476 1700632 1613690 1596985 1387101
11207 1387101 1568157 1991468 2026806 1933806 2288208 2630007 2220376 1847080 1778025 1804873
11197 1804873 2035170 1959892 1929689 1801655 1493182 1406245 1220365 1134656 1381862 1655874
11187 1655874 1448268 1550260 1581828 1763939 1804174 1971117 1806828 1557924 1424183 1504676
11177 1504676 1782857 1969327 1740253 1518538 1586009 1649662 1806259 1641373 1585120 1744771
11167 1744771 1664257 1826018 1813020 1595322 1593765 1386064 1248930 1200850 1135826 1084378 998120
11156I98120m1944J65309k681j45579K27154J20848k56860l52386J50330J7912
11146H80223K18989r8619J1267J78530K34693J24698M342j79660j71069N1468
11136A254862N5326n409r0241N6897J91761m3168L3189k3038j42795N8932j45652
11125A200664k6549K29371R9198j78347j07629J9386J22144Q4857r5563q1055
11115A266477o2334k8735k0432J36685Q6041k3136q5414M0610J83160j5529l25811
11104A151582m4395J12742J58588R4405J35203P5219k29357j00432l5693j6966
11094A300896m0109j75577q3612R1498K7899n1176j35546j08224n4708K24365
11084I95706j64672j40219J81866L8542j2126q7235k90985O3086J14076J78188
$$ plain form
11156 998120 956176 1121485 1118804 973225 1200379 1321227 1064367 711981 862311 880223
11146 880223 1099212 1000593 1011860 1190390 1425083 1549781 1554123 1374463 1203394 1254862
11136 1254862 1310188 1304779 1214538 1271435 1463196 1420028 1453217 1430179 1287384 1346316 1200664
11125 1200664 1174115 1403486 1502684 1324337 1216708 1236094 1358238 1443095 1347532 1266477
11115 1266477 1204143 1175408 1154976 1291661 1377702 1354566 1269152 1309762 1492922 1477393 1151582
11104 1151582 1107187 1219929 1378517 1472922 1608125 1683344 1453987 1353555 1317862 1300896
11094 1300896 1260787 1085210 1001598 1093096 1120995 1069819 934273 826049 771341 995706
11084 995706 831034 690815 872681 911223 899097 811862 520877 583963 698039 876227
11074H76227J04138j25598J5533q0063p7902Q1419M10313Q7348p4487J6716q7068
11063A146576j58232p0949Q3895l1637m2675M9197j931J77473M3198J43996J2709
11052A351620o1676k61342M7079K2606Q3523K26942J1925L81976K44862j02804
11042A944711l2515M1758j87396R2093L8162K53185K76863L44469M3961M6418
11032B861709j70892k74261m1080J53635k7125k10928j80494Q3743K67529K02120
11022B663956O40880N29141J00673l43427k38799l62205r7235k92728o02906l379
11012A993971K46192M73068L31121K91624N7287q2476j99921n48656n06825l99830
11002A655555j56935n9057K20756O8457K10133J18655k93950l64935j3593m5103
$$ plain form
11074 876227 980365 854767 870300 790237 712335 793754 1204067 1291415 1216928 1233644 1146576
11063 1146576 988344 917395 1001290 969653 926978 976175 974244 1151717 1194915 1338911 1351620
11052 1351620 1289944 1028602 1075681 1098287 1181810 1408752 1420677 1802653 2047515 1944711
11042 1944711 1912196 1953954 1766558 1858651 1896813 2149998 2426861 2771330 2815291 2861709
11032 2861709 2690817 2416556 2375476 2529111 2501986 2291058 2110564 2194307 2461836 2663956
11022 2663956 3304836 3833977 3934650 3591223 3352424 2990219 2892984 2600256 1997350 1993971
11012 1993971 2240163 2713231 3044352 3335976 3393263 3310787 3110866 2562210 2055385 1655555
11002 1655555 1498620 1439563 1660319 1728776 1938909 2057564 1763614 1398679 1385086 1339983
10992A339983J19462l6720J981m9396J02056q5772K6795j46747l263m84838m5
10981G83496K19012K39718Q6584q5647j24413m08430j5551J08991j05795j26475
10971E71490J78789K45986L1143j08554j57493j09563J62899Q4474K7529K54580
10961A181280l7194J00243L93320J89453j07405m86750j45039J09695K88025J42044
10951A627672L2054r3761K5023j23534p4698n2835j8323m39862l61905j05084
10941D14747J08819J94936K29349J84401k0981J40659j69635n18510k24798P7868
10931D16855j64569k18627L12247J45836J12419N8721k17496k89751m5458J01737
10921B11914j57720j9491K24409J88266p6988J9217K1251p2930k23839J51152
$$ plain form
10992 1339983 1459445 1422725 1424706 1375310 1477366 1391594 1418389 1271642 1268379 783541 783496
10981 783496 1002508 1242226 1328810 1243163 1118750 710320 694769 803760 697965 571490
10971 571490 750279 996265 1027408 918854 761361 651798 814697 899171 926700 1181280
10961 1181280 1144086 1244329 1637649 1827102 1719697 1232947 1087908 1197603 1485628 1627672
10951 1627672 1659726 1565965 1590988 1467454 1392756 1339921 1321598 881736 519831 414747
10941 414747 523566 718502 947851 1132252 1111271 1251930 1082295 563785 338987 416855
10931 416855 252286 33659 345906 491742 604161 662882 445386 155635 110177 211914
10921 211914 54194 34703 259112 447378 370390 389607 410858 337928 114089 265241
10911B65241J09001K52899J39207k54307M7462Q5556O9036N1089k36049k57029
10901B72106Q0539m1014j0960J63422K55535K71001K7888Q8650J62217k36395
10891A032989l54090l0121L1709P4662j49638K0501J9903n563j02109O6574j38563
10880D66254k06232K5138K24158N5295j92862l4254j5564K82218L31481k15599
10870G20033Q4623L7511k13209r8863j48848K27993j91367j0189O775k1699N043
10859C97803P0319L8498O9544n1429n9578K31030j8955k97831k45919M75986J01632
10848G11100k81220n1687M0076k04014K00467L14748N5730k07966q1285p210j06519
10837C82220J0127R0200j94782p2220J53152O3820j80639L2389J11101K42680
$$ plain form
10911 265241 374242 627141 766348 512041 559503 645059 714095 765184 529135 272106
10901 272106 352645 311631 300671 464093 719628 990629 1018517 1107167 1269384 1032989
10891 1032989 678899 648778 680487 755149 605511 626012 645915 640352 538243 604817 466254
10880 466254 260022 285160 509318 564613 371751 337497 321933 604151 935632 720033
10870 720033 804656 842167 628958 530095 381247 609240 417873 407684 414459 392760 397803
10859 397803 468122 506620 576164 524735 465157 696187 677232 379401 133482 609468 711100
10848 711100 429880 378193 418269 214255 414722 729470 785200 577234 495949 488739 382220
10837 382220 392347 482547 287765 215545 368697 432517 251878 284267 395368 638048
10827F38048J65222j43348l69755j95281k7586J43421J38936j81950J61106K47405
10817E76218K08192m5861l33897k49272r0166J40622j20469Q4662L27661o4188
10807D33502j52688k09107k19418J75406J60686q190j47866j17689P6267J53343
10797A44246J2611o4218M1540J87571M9455j93037Q9233J82325K09040j68930
10787D89836j64217j45388p1857J67122k21508m4485j6185q1943J70046J64209
10777B45630K4764P8531q3735J97033K21352k08709l85333J58221K20876J89993
10767F58623j84339l78343L20086L99603J87514j45563n5080p7440j9985Q7019
10757G92095j1907k52551K31869j18297j88380M09601k2699P8196J44281k42342
$$ plain form
10827 638048 803270 659922 290167 94886 67300 210721 349657 167707 328813 576218
10817 576218 784410 738549 404652 155380 65214 205836 85367 170029 497690 433502
10807 433502 280814 71707 -147711 27695 188381 180191 32325 -85364 -9097 144246
10797 144246 156857 92639 134179 321750 371205 178168 267401 449726 658766 489836
10787 489836 325619 180231 108374 275496 53988 9503 -6682 -88625 81421 245630
10777 245630 270394 348925 265190 462223 683575 474866 89533 247754 468630 658623
10767 658623 474284 95941 416027 815630 1003144 857581 802501 725061 705076 792095
10757 792095 780188 527637 759506 641209 452829 862430 839731 917927 1062208 819866
10747H19866p0505n6672m8085k80592j39184P8967P5862N676Q7933m2780j7082
10736D13404J24127J14893J38774l3869j79745l826J78258Q7285J32211M2868
10726A014380k02689r2950j57097m3994n1923J11327J17547r0267Q4091j38535
10716E49890j02644N1196J8099J48939j34797Q3194J74270r7112K3530m4793l69712
10705C00060J94842K22624j50771k03281Q9195J37107j30880l9423J05806l5617
10695D89662j99370P9563R8987K09187J55819m3081k84981j60124n1582K75594
10685E69674k58298J43102K13134P9050K9496L1895J41855L6566J47477o2390
10675A071561K4336N346l06861k77666K77474L46684M0327o551j95358q2538K20980
$$ plain form
10747 819866 749361 692689 644604 364012 224828 303795 379657 385333 473266 430486 413404
10736 413404 537531 652424 791198 757329 577584 573758 752016 839301 971512 1014380
10726 1014380 811691 718741 561644 517650 465727 577054 694601 604334 688425 549890
10716 549890 447246 498442 516541 665480 530683 613877 788147 691035 714565 669772 300060
10705 300060 494902 717526 566755 363474 452669 589776 458896 419473 525279 489662
10695 489662 290292 369855 468842 678029 833848 790767 505786 345662 294080 569674
10685 569674 311376 454478 667612 746662 776158 808053 949908 986474 1133951 1071561
10675 1071561 1095897 1101243 794382 516716 794190 1140874 1181201 1174650 979292 896754 1117734
10664A117734L2834j9867K10828J23726n8048j01956j09209J01343K36912M30653
10654A964950K55186K08159L1990k0669J83436K02424M14574M52177M8232j02758
10644C637701n4680J36668j07251m1791K34686P68586M00794M16432L64209N44272
10634F299626R58912J136808R55689J091478J242143J056061J122231J342663
10626A5205611J687519K261056L111396L727944M902011O864859R323475J2327782
10618E9411653J5511746J9438436K2588677K2539198J7087759P648935j973914
10611A62252490o154092m727490L8081P299581J6175060K6247383L6750901M4741432
10603B82623346M4041899K8753463K055142k1196344k9241810k3742715j1940917
$$ plain form
10664 1117734 1150568 1130701 1341529 1465255 1407207 1305251 1196042 1297385 1534297 1964950
10654 1964950 2220136 2428295 2460285 2439616 2623052 2825476 3240050 3692227 3740459 3637701
10644 3637701 3583021 3719689 3612438 3570647 3805333 4573919 4974713 5391145 5755354 6299626
10634 6299626 7258538 8395346 9351035 10442513 11684656 12740717 13862948 15205611
10626 15205611 16893130 19154186 22265582 25993526 30895537 37760396 47083871 59411653
10618 59411653 74923399 94361835 116950512 139489710 156577469 164226404 162252490
10611 162252490 156098398 151370908 151408989 158708570 174883630 201131013 237881914 282623346
10603 282623346 326665245 355418708 357473850 336277506 307035696 283292981 271352064
10596B71352064K070125J6661679L2182524M7269348N5693028N0494197K4535916
10589E00258881j5859404m8140056n7192156m8048905l3088729j7140738k319794
10582B78469099J1506606K2915397K8043725K2550853L038955k3790381m2861654
10575B99872600m6182234l7946762k6842535j6402486p770260p04307M168747
10568A68192763N817973K603726n891731j6091327k2619694k3414801k0521928
10561H8074981j6232018j2363364r484700p224687n429369m162160l601230k935555
10553B6641898k572853k087919j816304j295285r47280j241233j273383q75060
10545A4532581p15028p30769o52420p55205p24413n51485n33971o79507n28382
$$ plain form
10596 271352064 273422189 290083868 322266392 369535740 425228768 475722965 500258881
10589 500258881 484399477 436259421 379067265 331018360 297929631 280788893 278469099
10582 278469099 289975705 312891102 340934827 363485680 366524635 342734254 299872600
10575 299872600 253690366 215743604 188901069 172498583 164728323 164024016 168192763
10568 168192763 174010736 176614462 170722731 154631404 132011710 108596909 88074981
10561 88074981 71842963 59479599 49994899 42770212 37340843 33178683 29577453 26641898
10553 26641898 24069045 21981126 20164822 18869537 17922257 16681024 15407641 14532581
10545 14532581 13817553 13086784 12434364 11679159 10954746 10403261 9869290 9189783 8661401
10536H661401l14889k59983m70330l68089j33564k76548k49720q7313K9674j98605
10526F332034j65436k13750m41544l47123p3021j98719k68388j23112j14088m3312
10516D343541k14844l4375O2779j95542j92563l5130N4985j04882j63349j73113
10506C347507L2587o2102j56034P2659n3451r8974j3170k17837k63188j1976K82599
10495B858620J15005n1597j37297j3252j90059k15342j03702N690j42541J01819
10485B227344P0967k55932o8452l9718p564J56445P6745J19277K74006p378o7487
10474B478253p1461j95320k88027j17393R8211J15989Q6122j62076j25114J47276
10464A966460L83256r7593l23280j45322j35788Q0609L44144k46992l67987J85941
$$ plain form
10536 8661401 8346512 8086529 7616199 7248110 7114546 6837998 6588278 6500965 6530639 6332034
10526 6332034 6166598 5952848 5511304 5164181 5091160 4892441 4624053 4500941 4386853 4343541
10516 4343541 4128697 4094322 4157101 3961559 3768996 3733866 3788851 3683969 3520620 3347507
10506 3347507 3380094 3317992 3161958 3234617 3181166 3082192 3069022 2851185 2587997 2576021 2858620
10495 2858620 2973625 2922028 2784731 2771479 2581420 2366078 2262376 2268066 2125525 2227344
10485 2227344 2298311 2042379 1973927 1934209 1926645 2083090 2159835 2279112 2553118 2545740 2478253
10474 2478253 2406792 2211472 1923445 1806052 1904263 2020252 2106374 1944298 1819184 1966460
10464 1966460 2349716 2252123 1928843 1783521 1647733 1728342 2072486 1825494 1457507 1643448
10454A643448k05456j16796o9839m3366J45156J55216j00350R7359j09149j51721
10444A244502p0763J00260M17875R9930K0370J48488j6658k09825j28163K2497
10434A628513j08645k07879j67135J47556J78246l72651j82782J10999L6807J21483
10424A184512J19545j68079m4246M5585K15875J56535k90473j72641K83079k95757
10414A033935k28168N6437k42362K3165O5494J14073K2768K17431J27432j70390
10404A019815k56579j41639O8641k88051j03224K08760L19865J28626J47125j5547
10394A087792K7057J56777j69511k69541L13557J90150J58724l38703j67606O4911
10384A053607r7949O6676m5296l9620J95288j62604l56695n955J73508J91283
$$ plain form
10454 1643448 1437992 1321196 1251357 1207991 1353147 1508363 1408013 1505372 1396223 1244502
10444 1244502 1173739 1273999 1691874 1791804 1812174 1960662 1944004 1734179 1606016 1628513
10434 1628513 1519868 1311989 1144854 1292410 1470656 1098005 915223 1026222 1063029 1184512
10424 1184512 1304057 1135978 1091732 1137317 1353192 1509727 1219254 1046613 1329692 1033935
10414 1033935 805767 862204 619842 643007 708501 822574 845342 1062773 1190205 1019815
10404 1019815 763236 621597 690238 402187 298963 507723 827588 956214 1103339 1087792
10394 1087792 1114849 1271626 1102115 832574 1146131 1336281 1495005 1156302 988696 1053607
10384 1053607 955658 1022334 977038 937418 1132706 970102 613407 607452 780960 972243
10374I72243K94122J6269q5579K8461j87547Q423l9402p6920j00017K18946K39757
10363A288756j82836k32j58348o8112M4288L2055r9943N4281p8468j32918J04471
10352H02994m1277j8367R8568K08146N1321l8594k42058p6706K5376L3130K35193
10341A037726J54675j25158J49094K36998o4317m683j8588k6972k71143j42668
10331I24964j43043j21832k8740J61609K01992j52894m28867j10252J09437j3484
10321C98890m7933P7066L57828o0473k52304K82193R1692r6699q1427j53763k6250
10310D88820N4609K8316J48544J98662k3170q3531r0919J7930J0929R6480o0779
10299G85891J06148j15555R1274J64680l68686j25048k68967J17618m1680J49960
$$ plain form
10374 972243 1266365 1282634 1197055 1225516 1037969 1046392 1006990 930070 830053 1048999 1288756
10363 1288756 1105920 1105688 947340 879228 923516 955571 855628 909909 831441 698523 802994
10352 802994 761717 743350 841918 1050064 1101385 1062791 820733 744027 769403 802533 1037726
10341 1037726 1192401 1067243 1216337 1453335 1389018 1384335 1365747 1338775 1067632 924964
10331 924964 781921 660089 631349 792958 994950 842056 413189 302937 412374 398890
10321 398890 350957 428023 785851 725378 473074 755267 846959 750260 668833 515070 488820
10310 488820 543429 571745 720289 918951 895781 812250 721331 739261 750190 846670 785891
10299 785891 892039 776484 867758 1032438 663752 538704 269737 387355 345675 495635
10289D95635J24584J554j71274J72224K57461j964j50614o4669l6642J59497j36922
10278F48870j02871K5409O5695J0857j0586K9707J3349J14524P0710j99846r3975
10267E71843J86415K83875J10797J6076k59943l04720j49066r0197k6604m4033
10257B94443J81273p672K30427R517k05423P0528k4676k06382p6327K04368j61325
10246C08751j86797J76054K87663Q6187j87876j03002R2463k0595j04341j30108
10236B18399J26249n5p2654j3911K7918J26792n8595K39481P1311j53838j21749
10225C89348L3874J34133J16379q5621q4321j26543l1301K4948n3564J70416K62015
10214G49763q4186j17675r3661r254k230k27454J85255L05858j47295Q5749J62770
$$ plain form
10289 495635 620219 621773 450499 622723 880184 878220 727606 662937 626295 785792 648870
10278 648870 545999 571408 637103 647960 637374 667081 680430 794954 865664 665818 571843
10267 571843 758258 1042133 1152930 1169006 909063 604343 455277 365080 338476 294443
10257 294443 475716 468044 698471 707988 502565 573093 548417 342035 265708 470076 308751
10246 308751 121954 298008 585671 671858 483982 380980 473443 452848 348507 218399
10236 218399 344648 344593 271939 258028 285946 412738 354143 593624 664935 511097 389348
10225 389348 423222 557355 673734 588113 503792 377249 345948 370896 317332 487748 749763
10214 749763 665577 547902 454241 444987 442757 215303 400558 706416 559121 644870 807640
10203H07640q6966j67137J47693p900m8435K49104o0946j41094j46520j04427
10193D41012J67329R3800J11694j61310P6603K49553Q9621k54611k04789J37383
10183G46285L379J19093L14184L64433L9699J70410J01803j66903l02354k28543
10173A161486J59460K79559J79123o2595J06023L18394J74532J70450O4573j14797
10163B436208j74648l28439r0976R5679J15392P3212L26407L36780K55658K42602
10153C287875k96479l54766j93092l88498j72192j76670p7054J73646J86780J67016
10143B156566P6371K06257Q1750l15302k60770k55177l00910m96317l59987J15404
10133F47885J51039J32528j24906L3362L5614k0773j25935K3479j49127j58261
$$ plain form
10203 807640 720674 553537 701230 693330 644895 893999 833053 691959 545439 441012
10193 441012 608341 702141 813835 652525 729128 978681 1068302 813691 608902 746285
10183 746285 749664 868757 1182941 1547374 1587073 1757483 1859286 1692383 1390029 1161486
10173 1161486 1320946 1600505 1779628 1717033 1823056 2141450 2315982 2486432 2551005 2436208
10163 2436208 2261560 1933121 1842145 1937824 2053216 2126428 2452835 2789615 3045273 3287875
10153 3287875 2991396 2636630 2443538 2055040 1882848 1706178 1629124 1802770 1989550 2156566
10143 2156566 2232937 2439194 2520944 2205642 1944872 1689695 1388785 892468 532481 647885
10133 647885 798924 931452 806546 839908 875522 854749 728814 752293 603166 444905
10123D44905R8109J88234P3598k98376j07282P887l8088n1192m7914k54171N0966
10112F6676J83583J01607P7341Q4145p6970j0592q2683P9065k07272k25903q5633
10101i6636J2185K56724J50318P6928K16278P3752p9708m8854J5486Q5741j27839
10090E34375j45011j80300j67224k8314m929M1070k00914j90220J1437p3746J53228
10079b50548M31004K28857Q1439k0832O4202o8071j83522m27799K0708J78155
10069E3593Q6013o608n5113m89Q8747R256m1781m9054J13058O2461j7157j16274
10057A26652k42396J68969K45513J54258l4193l50948q8023J30677L55415J22555
10047E88479J31408k27196o9222j75078J12239K19951j3418K07924l86042o9655
$$ plain form
10123 444905 543014 731248 804846 506470 399188 407075 368987 317795 269881 15710 66676
10112 66676 250259 351866 429207 513352 436382 425790 343107 422172 214900 -11003 -96636
10101 -96636 -84451 172273 322591 399519 615797 689549 609841 560987 576473 662214 534375
10090 534375 389364 209064 41840 13526 8597 49667 -151247 -341467 -330030 -403776 -250548
10079 -250548 180456 409313 490752 469920 534122 466051 282529 -145270 -124562 53593
10069 53593 139606 132998 77885 77396 166143 175399 133618 84564 197622 260083 242926 126652
10057 126652 -115744 53225 298738 452996 418803 67855 -20168 110509 465924 588479
10047 588479 719887 492691 423469 248391 360630 580581 567163 775087 389045 319390
10037C19390J96118M1616k08267J53986J22866j55397L12083O4436j09805m85960
10027B51066k12738K31238J0655r6727M666l02510k45441J44502O4880k78005
10017d28414J4996M26618L14785J18071L84351K3596j70499p6372j68673J405
10007D39864j97365r0723R3497K30997K05950k67139j35097l792j44570J45079
9997B76701L3588O3145j05007o2207j44915l6783M6799J03691J701p7926j17541
9986a8754l09675J77875J35189k3897J39349L10087N019j31459J44422O7732j33275
9975C62613j59517j77409J27335J59422J1189m0291M9421m0816k60926P1947M89996
9964E92964k02310k70955m13787K69315K08310J90997k5100j83170j75277N2322
$$ plain form
10037 319390 515508 557124 348857 502843 625709 470312 782395 846831 737026 251066
10027 251066 38328 269566 280221 183494 188160 -114350 -359791 -215289 -150409 -428414
10017 -428414 -413418 13200 327985 446056 830407 854003 683504 607132 438459 439864
10007 439864 242499 151776 245273 476270 682220 415081 279984 276192 131622 276701
9997 276701 310289 373434 268427 206220 61305 24522 71321 175012 176713 98787 -18754
9986 -18754 -328429 -150554 -15365 -39262 100087 410174 415193 283734 428156 495888 362613
9975 362613 203096 25687 153022 312444 323633 283342 332763 291947 31021 102968 592964
9964 592964 390654 119699 -294088 -24773 183537 374534 349434 166264 -9013 43309
9954D3309K09386Q7573K5776K0657k72159k68362K9364L53433J94512j45247m6226
9943B32016K06265Q650K7461J17052K34606J52787m5894J652K70663M09639O48368
9932B263265J159491J854484K790711L624303J243193l431742l917232k152940
9924C433533r40240o27689m16198j87132m1455j68705j4805l14743j05764K59788
9914H76590J42563R1799m3686k94287j12673p0306p4294l06593n9654K85733L101
9903D38293M5910M5655J27911j61252p957J21003J29945l07624m12716j37784
9893a18616l7965J36226n199q9339K22449K29257J55289M4491l47965k78064j2476
9882a01912k4090K61406l7031o8635K48061k00194k65714J00384K32153P061j37129
$$ plain form
9954 43309 252695 340268 366044 386701 114542 -153820 -124456 228977 423489 278242 232016
9943 232016 438281 446931 474392 591444 826050 978837 932943 934595 1205258 1614897 2263265
9932 2263265 3422756 5277240 8067951 11692254 12935447 9503705 5586473 3433533
9924 3433533 2493293 1865604 1449406 1262274 1220819 1052114 1037309 722566 616802 876590
9914 876590 1019153 1110952 1067266 772979 660306 590000 515706 209113 149459 435192 438293
9903 438293 484203 529858 657769 496517 488560 609563 739508 431884 19168 -118616
9893 -118616 -156581 -20355 -25554 -114893 107556 336813 492102 536593 188628 -89436 -101912
9882 -101912 -126002 135404 98373 29738 277799 77605 -188109 -87725 144428 151489 14360
9871A4360J343r9691j40698P3927M57962j47305l25734O5019N4205L8728n4437
9860f2321K71193P6823k03930o4785P0476Q685n1815j5532r389N6760j53509l3760
9848a11104l0768J56107K17928j8105J899j03547m05289n9040K98182J90614j07343
9837B9534N0673R2974J92762j58028J11754J51537J81518k63210l50840j5350
9827B3324N3940N611O3524R9042k0704n076P488m3431k24145J36942Q5917J08344
9815B90776P4848j15970j7976j02283k3122j85166L4232L55530j19777N2904O5435
9804C09431j4763P7565J93013p2054N5139j03818k76417K4322Q2820J15806J15783
9793E06827j71928l46898k16610Q7332L03094O5612j03299o1550J06458J81263
$$ plain form
9871 14360 15703 -83988 -224686 -150759 307203 159898 -165836 -100817 -46612 -7884 -62321
9860 -62321 208872 285695 81765 16980 87456 96141 44326 28794 19405 76165 -77344 -111104
9848 -111104 -141872 14235 232163 214058 215957 112410 -292879 -351919 -53737 136877 29534
9837 29534 80207 173181 365943 207915 319669 471206 652724 389514 38674 23324
9827 23324 77264 82875 146399 245441 224737 219661 227149 183718 -40427 96515 182432 290776
9815 290776 365624 249654 231678 129395 106273 -78893 -44661 310869 191092 243996 309431
9804 309431 294668 372233 565246 493192 548331 444513 168096 192418 275238 391044 506827
9793 506827 334899 -11999 -228609 -141277 161817 227429 124130 62580 169038 350301
9783C50301j2525p2990j09268j21635K39761Q8313k01942l73377J93816K46300
9773B26754r2269K74K09299J16477j5067R4312m2138j9301o3801q4011K61384
9762E91913J87679k8259k09197l48957j76671m0604j17950k71238J3155K73472
9752a26657J46979l8410o6j12305j00224J66493N2153J8000R2107N6775K00748
9741C55593o8451J4939J24589j49720q952J64413j77913j11672Q6213M7034M8622
9730C24695m36630l75703J2171L44325J19580l7338J27784R1718N9849j88001
9720D2450q0172p2605J62156J86679R2532j79452k94246M1432L91064O4165m7899
9709C06104k8468j88552J47519J34237k23956k46590J60614q9370m049J62062
$$ plain form
9783 350301 337776 264786 155518 33883 273644 361957 160015 -213362 -19546 226754
9773 226754 134485 134759 344058 460535 445468 539780 497642 478341 414540 330529 591913
9762 591913 779592 751333 542136 193179 16508 -24096 -142046 -413284 -400129 -126657
9752 -126657 20322 -18088 -18154 -130459 -230683 -64190 -12037 5963 98070 154845 355593
9741 355593 287142 302081 426670 276950 267998 432411 254498 142826 229039 276073 324695
9730 324695 -111935 -487638 -475467 -131142 -11562 -48900 78884 170602 230451 42450
9720 42450 -37722 -110327 51829 238508 331040 151588 -142658 -101226 289838 354003 306104
9709 306104 277636 89084 236603 370840 146884 -99706 60908 -28462 -32511 129551
9699A29551j08741l00561Q2149K36648J87395L762j06849p7364k12908j02134
9689b69052k8138J0801K41030n2177m9698K33726Q5309O8006J59101J35788L0818
9678E65514k65135k94144O8965L22751N6132J46191q9369j38283O8264Q5825j6053
9667E10658P4512k3495j80643r2801k52768q6417J51879q5834J05731J03988N9400
9656B84210j75037k84743M0677K40588J88568k92694J61176P0456L38338j93386
9646C78153m53235k2129J83011J21721J01650k18402r9340J22280J99468O2080
9636C75257j74903j94302m6172J18126Q0822l04264J13656J99378P8385l3692
9626B12291j18749p2521P4505j5826j43987J36244J02121P7697q7334J32668r5658
$$ plain form
9699 129551 20810 -279751 -197602 39046 226441 230203 123354 45990 -166918 -269052
9689 -269052 -297190 -286389 -45359 -97536 -147234 86492 171801 239807 398908 534696 565514
9678 565514 300379 6235 75200 397951 454083 600274 510905 372622 440886 526711 510658
9667 510658 585170 561675 381032 288231 35463 -50954 100925 15091 120822 224810 284210
9656 284210 109173 -175570 -134893 105695 294263 1569 162745 233201 571539 378153
9646 378153 -75082 -97211 85800 207521 309171 90769 -8571 113709 313177 375257
9636 375257 200354 6052 -40120 78006 158828 -145436 -31780 167598 245983 212291
9626 212291 93542 21021 95526 79700 -64287 71957 174078 251775 164441 297109 201451
9615B01451j65223j55657K14027J48672N9976K82452K66535k97055m23845q6J26543
9604B57790N4680m2108M0447m0014j21064j08599Q4544J25459M5855J37718O1216
9593D95924p9095k20392k8911j20207r3873n0681J39899J41158J01112J44134
9583D29068m1393n1838J23865o3633m24522j86819j26381K65855J28686J90392
9573B43280N0351M5398K12430R9667k16794k21741J12717P4047J1505K83900O1611
9562G56371J28229J63126J17052J82514J22808L25755K22101K98691K81893O53824
9552C252364Q52619P70418J016280J276360O32904J91711l75989q67283j116206
9543E633178j100978j060535n59648l86122j66207j45075o41428l02793j17561
$$ plain form
9615 201451 36228 -119429 94598 243270 303246 585698 852233 555178 131333 131247 257790
9604 257790 312470 270362 310809 270795 149731 41132 125676 251135 296990 434708 495924
9593 495924 416829 196437 167526 47319 -46554 -97235 42664 183822 284934 429068
9583 429068 387675 335837 459702 396069 -28453 -215272 -341653 -75798 52888 243280
9573 243280 293631 339029 551459 651126 434332 212591 325308 399355 410860 694760 756371
9562 756371 884600 1047726 1164778 1347292 1470100 1795855 2017956 2316647 2598540 3252364
9552 3252364 4104983 4875401 5891681 7168041 7800945 7992656 7616667 6749384 5633178
9543 5633178 4532200 3471665 2912017 2525895 2359688 2214613 1573185 1270392 1152831
9534A152831q0774k7415j00828J45651O8849o9474N0097j51690k45755N585J53003
9523I00080k08843l35179k3154J79642j4091j13773j52605P0734r8650K56487
9513D60648J98060k48050j80379l6382J96719J02855k50679K56706N6436l81496
9503A74438J13825K13008k52783J25024r0315j53221L04289J64193k79500k86084
9493C2874K34081J58273j46476j09363q6297j40119L9028J42418m9798j39817
9483f5196j17680R0172j18487J43458P4180J72488K38815l3538k60596r5661J34979
9472A62934j08079k17770N0541M3241K99979J83220j08495Q4865N2042j25225
9462C17253q3322L6763j14620k5128J24719Q8707l4412k80236l57247m9937M1506
$$ plain form
9534 1152831 1072057 1044642 943814 1089465 1158314 1088840 1138937 987247 741492 747077 900080
9523 900080 691237 356058 332904 512546 498455 384682 232077 302811 204161 460648
9513 460648 658708 410658 230279 193897 390616 493471 242792 499498 555934 174438
9503 174438 288263 501271 248488 373512 283197 129976 434265 598458 318958 32874
9493 32874 266955 425228 278752 169389 83092 -57027 -17999 124419 74621 -65196
9483 -65196 -182876 -92704 -211191 -67733 6447 178935 417750 384212 123616 27955 162934
9472 162934 54855 -162915 -112374 -69133 230846 414066 305571 390436 442478 317253
9462 317253 233931 270694 156074 130946 255665 344372 309960 29724 -327523 -377460 -335954
9451c35954K88767K97457L57998L1324k50271n03237Q3342J52063k5916j24863
9441b9290L70202j64199l11821K34609J9076O8212J95056j10037o7186j11533
9431I3089Q5603P3071k75458o8357J05721J71420r5374K4222k42902l33082Q9788
9420c72259R5836K3173J36100j55657p4744J45428O1619P1033K278r0915p263
9409a65371m8756l0413Q5577R2204j6634j10914m8063j37761p1166P8745j34999
9398e07551O2217j4836K40714o7131L38687K40675K4264O6083q4254j07655k20642
9387b9429k41689L7842K0237j4655J42254m3000K0480M74834J15062l41162k03977
9376f3203J36555p502K27352J80385m23833n1068j28784J61060J10240J14643
$$ plain form
9451 -335954 -47187 250270 608268 639592 389321 -113916 -30574 121489 95573 -29290
9441 -29290 340912 176713 -135108 99501 118577 186789 381845 271808 204622 93089
9431 93089 178692 251763 -23695 -92052 13669 185089 89715 113937 -128965 -462047 -372259
9420 -372259 -276423 -253250 -117150 -272807 -347551 -202123 -140504 -69471 -67193 -158108 -165371
9409 -165371 -214127 -244540 -158963 -66759 -83393 -194307 -242370 -380131 -451297 -372552 -507551
9398 -507551 -445334 -460170 -219456 -286587 52100 292775 317039 383122 298868 191213 -29429
9387 -29429 -271118 -233276 -213039 -227694 -85440 -128440 -107960 366874 481936 140774 -63203
9376 -63203 73352 65850 293202 473587 49754 -1314 -130098 30962 141202 255845
9366B55845J9050j47421J09935J07057j52644j88760L4371O2742J26872P031l154
9355B30924j55287p7094J2836J14330q7797r3056j9476N6918N7837K13227k41956
9344A1406r7595J60997o9402o4027J2601k47696o5145K85305K39405J43391J23269
9333D32509J18757p4279q7514m7080p0161j0388k23957k27417J2311K20035J36579
9322A79395L974K11614k73372j00748j5049K91866J46204J8493l12681J1162O6547
9311B27405j69705L09510Q1837J44898J30217O0677m7801l139m09113j04890J5635
9300B35531p0730j88366J49106J18449Q4072K40524L40154j02438l57453K4864
9290D73713J53655K13517j7946n6082k480J17479J2016j87121k03776k16134L27504
$$ plain form
9366 255845 274895 127474 237409 344466 191822 3062 37433 100175 227047 234078 230924
9355 230924 75637 -1457 11379 125709 37912 -55144 -74620 -17702 40135 253362 11406
9344 11406 -86189 74808 5406 -58621 -46020 -293716 -358861 -73556 165849 309240 432509
9333 432509 551266 476987 389473 342393 272232 261844 37887 -189530 -177219 42816 179395
9322 179395 183369 394983 121611 20863 5814 297680 443884 462377 149696 160858 227405
9311 227405 57700 367210 449047 593945 724162 784839 737038 733899 324786 219896 235531
9300 235531 164801 -23565 125541 243990 328062 568586 908740 806302 448849 473713
9290 473713 627368 840885 822939 766857 764377 881856 893872 706751 502975 286841 614345
9279F14345M32634J65462J27465N8648j64893J37898L04309N7989j08240J53443
9269A779060P5797J82504M80639K06117K03914L81514O02386L44660L21710M91610
9259E069911M00703M87791Q25946J154219J061796J158153J673995K001410K641390
9250A6475314L120949L527330M045276M152161L766140K880083R11170q29106
9242C8049317k672718l827416l747674l574922l274797l029398k683854k287503
9234A2951035j334847r11906j095734r94013p88118n51922p76787n35077l67039
9225E595592n14126p48402n38662m41936j07868j27658o3801j26411j58457l95183
9215B373088n15330k04693J08324O5857K70800o6876j98060J29031Q1682N6516
$$ plain form
9279 614345 1046979 1212441 1339906 1398554 1233661 1371559 1675868 1733857 1625617 1779060
9269 1779060 1854857 2037361 2518000 2724117 2928031 3309545 3911931 4256591 4578301 5069911
9259 5069911 5470614 5958405 6784351 7938570 9000366 10158519 11832514 13833924 16475314
9250 16475314 19596263 23123593 27168869 31321030 35087170 37967253 38878423 38049317
9242 38049317 35376599 31549183 27801509 24226587 20951790 17922392 15238538 12951035
9234 12951035 11616188 10704282 9608548 8614535 7826417 7274495 6497708 5962631 5595592
9225 5595592 5081466 4333064 3794402 3352466 3244598 3116940 3053139 2926728 2768271 2373088
9215 2373088 1857758 1653065 1761389 1827246 2098046 2031170 1833110 1962141 2043823 2100339
9205B100339k82832l24156j62785J57415j83720j26821K12093j73084k91167l29498
9195E95784K48774k9301j20543j02171o0738J90032o604j10828L30303J87435
9185A122143P9736O0342p7912o9078m4356j5916m1131j85905J25142k23194j96927
9174E32944n8562n0618J29126L9028k07012j22443J8391n2944K82240K01048l8757
9163F72441j4289k10042k79525j49727N6436R3317k6252o8713j9120J15234K92512
9152D62272K27809j03329j67516N655k33661p1785J85094J68255K00617o8973
9142F04438k32576n7470k05978j36941m0258K45585L2855j64084O9349K91333
9132D06253J7736R8960o343N6639M5467k55166K4393K4984J63672l3610l3037
$$ plain form
9205 2100339 1817507 1493351 1330566 1487981 1304261 1177440 1389533 1216449 925282 595784
9195 595784 844558 815257 694714 592543 531805 721837 715233 604405 934708 1122143
9185 1122143 1201879 1262221 1184309 1115231 1070875 1054959 1013828 827923 953065 729871 532944
9174 532944 474382 423764 552890 591918 384906 262463 280854 227910 510150 711198 672441
9163 672441 658152 448110 168585 18858 75294 168611 142359 73646 54526 169760 462272
9152 462272 690081 586752 419236 424891 191230 119445 304539 472794 673411 604438
9142 604438 371862 314392 108414 -28527 -68785 176800 209655 45571 114920 406253
9132 406253 423989 522949 516606 573245 618712 363546 387939 412923 576595 542985 509948
9121E09948k37683k88871j7770m8092j01885J23265K94100N5810K1719M71j39490
9110A71522k03605k98414M7735J74963L89707K93019k07028J45526p7462j32769
9100C03194J7191P8264k9274j54374R624J15533j7956Q0347L3738J34413k0788
9089E49912j60555K90k8929R2856q1662N3707j05553K5234q0239q3988q7967Q4676
9077A77782m2885j33152J63267j78418j2732J10416M38283K33468n827j06917
9067F43285j63320k08387P5537o2401j3233P8393J19607k28350l05014K06655
9057A42772K14425n6527j29984r1187J64142J8607j18568K22867L10516j34716
9047E42347k75393p9669j83949J01659l18063j88429L29102O49190k7928k52610
$$ plain form
9121 509948 272265 -16606 -34376 -82468 -184353 -61088 233012 288822 310541 311012 171522
9110 171522 -32083 -330497 -282762 -107799 281908 574927 367899 513425 435963 303194
9100 303194 320385 398649 369375 215001 224625 340158 322202 402549 436287 570700 549912
9089 549912 389357 389647 360718 453574 371912 425619 320066 345300 265061 181073 93106 177782
9077 177782 134897 1745 165012 -13406 -26138 84278 522561 756029 750202 643285
9067 643285 479965 271578 347115 284714 271481 349874 469481 241131 -63883 142772
9057 142772 357197 300670 170686 79499 243641 262248 143680 366547 677063 542347
9047 542347 266954 187285 3336 104995 -213068 -401497 -72395 576795 548867 296257
9037B96257M2331J09459j48531j38904R5280J267j524r6001l3813l6492J2774
9026A02103J31102k29050K9278K64650j55375O0704R5412K90712j81867K067O8598
9015D78334J98630K09438O4382k40872k36584l3015K13675M14132l9403l04338
9005G24379O817L86285K05214K64495L0996J00797q6185P9659n4571l6415m096
8994A617375j33149m17408l80669j13427m7327j29404j38061n7023q6989r995
8984A03923o0542j21602K1467P8186r740J77479K03165O3700j16252p9860J81761
8973D41685p4568k3255o1588j85458O7413J35952J07934n8570q0396P2167k58135
8962H3181j30447J09307J11150J14475n355L2519j24470j47732J08313L79791
$$ plain form
9037 296257 338588 448047 299516 160612 255892 257159 255635 159634 125821 89329 102103
9026 102103 233205 4155 33433 298083 142708 203412 298824 589536 407669 409736 478334
9015 478334 676964 886402 950784 709912 473328 440313 653988 1068120 1028717 724379
9005 724379 731196 1117481 1322695 1587190 1618186 1718983 1632798 1712457 1657886 1621471 1617375
8994 1617375 1484226 1066818 686149 572722 525395 395991 257930 200907 113918 103923
8984 103923 43381 -78221 -56754 21432 11692 189171 392336 456036 339784 259924 441685
8973 441685 367117 343862 282274 96816 164229 300181 408115 349545 269149 341316 83181
8962 83181 -47266 62041 173191 287666 282311 314830 190360 42628 150941 530732
8952E30732j4089M0232m5347j04771k35531l455K22578J29542P1215k46819k91244
8941E3043L66431L43428o9940k67162l06128J19740j86565J7699J45497J9205
8931B35248k3252Q5234R5566K13482L43229k07474k72578q6580J09682p3265k24462
8920A94830J22234j2305q8492o610J58803K1397Q5789N686k08980m6695q436J2840
8908B30061j04131k7355J14352R3707j32529l34520r4737K3514P1619J10430R7740
8897D8151J14335m429j6616q1039J00171L8790J40746J13549P2487k327j68485
8886C55333M2266k88260j86942J63843Q9770j72845j96925P5804L94931k65698
8876A1277l36973j1585L82486L3412j74280J16719J15337l04152O858K5772r8675
$$ plain form
8952 530732 516643 556875 511528 406757 171226 167771 390349 519891 591106 344287 53043
8941 53043 419474 762902 692962 425800 119672 239412 52847 70546 216043 235248
8931 235248 211996 297230 392796 606278 949507 742033 469455 382875 492557 419292 194830
8920 194830 317064 304759 216267 209657 368460 389857 475646 481332 272352 225657 217221 230061
8908 230061 125930 98575 212927 306634 174105 -160415 -255152 -231638 -160019 -49589 48151
8897 48151 162486 158057 141441 60402 160573 199363 340109 453658 526145 523818 355333
8886 355333 397599 109339 -77603 86240 176010 3165 -193760 -117956 276975 11277
8876 11277 -325696 -337281 45205 78617 -95663 21056 136393 -167759 -160901 -135129 -233804
8865b33804k17722L02570K52947J09075L2807j65785J81439r3994k65385k15983
8855c13835K61866K21039k05014P8977K03082J52448o988j9752K01210n4880p6655
8844D41498K6768O4238K2660m82760k92646J51869R087n7997K29751j42377M2543
8833A2634R5259l39803j84151J95407L09457K2860k95211j02111J61588L5104
8823h8967l20333n1651r1617L3949K08355n3728L40313J74029k63944j09227J22818
8812a00003J56422M968J59775J05434j26920j90748J52298J42103K2127r7074
8802B28382l8191L10635o7974k09565j704J12284R7172k50569k96272k61676L1936
8791c45542n9880Q9433K13167j5010q9741k26612P0196R6219J36829J91223r0693
$$ plain form
8865 -233804 -451526 -148956 103991 213066 245873 80088 261527 167533 -97852 -313835
8855 -313835 -51969 169070 -35944 43033 246115 398563 391575 371823 573033 518153 441498
8844 441498 468266 532504 555164 72404 -220242 -68373 -59286 -117283 112468 -29909 12634
8833 12634 107893 -231910 -416061 -220654 88803 111663 -183548 -285659 -124071 -88967
8823 -88967 -409300 -460951 -552568 -518619 -310264 -363992 -23679 150350 -113594 -222821 -100003
8812 -100003 56419 61387 221162 326596 199676 8928 161226 303329 325456 228382
8802 228382 190191 500826 432852 223287 221583 333867 431039 180470 -115802 -377478 -345542
8791 -345542 -405422 -315989 -102822 -117832 -207573 -434185 -363989 -267770 -130941 60282 -30411
8780c0411j05739J21645Q3195K39185K3415q8108N7471K02073O9324j54591J26507
8769E43966J73887k67409o6456l25N6582J72118l8611k68906k47764j9190p5446
8758c7554L0844o0400K1412K13399K57728k8164k10553k58869r5357p2619K5951
8747b14182L7733r3781Q1542j52300j3544j08265K1474q8717J62859K08124l9701
8736a98758Q6737R8105K15242j02837j79360j98977J97278n234l30314l5771j3455
8725d67344J33018K81779j6110N6337N8603J19388l8451J03248j12676J01478
8715B19270K49825l9549p8917Q923j3445p2478k43362r9500K77495o9272k34806
8704i5816K2792M2256K09214J56645j59684j13594k0805J75183N0170N0623n9015
$$ plain form
8780 -30411 -136150 -14505 68690 307875 331290 243182 300653 502726 572050 417459 543966
8769 543966 717853 450444 383988 383663 440245 612363 573752 304846 57082 37892 -37554
8758 -37554 -6710 -67110 -45698 167701 425429 397265 186712 -72157 -167514 -240133 -214182
8747 -214182 -176449 -270230 -188688 -340988 -354532 -462797 -441323 -530040 -367181 -159057 -198758
8736 -198758 -112021 -13916 201326 98489 -80871 -279848 -82570 -87804 -418118 -453889 -467344
8725 -467344 -334326 -52547 -68657 -12320 46283 165671 127220 230468 117792 219270
8715 219270 469095 429546 350629 359552 346107 273629 30267 -69233 208262 138990 -95816
8704 -95816 -73024 -30768 178446 335091 175407 61813 41008 216191 266361 316984 257969
8693B57969q5043k27348M8015j32178Q5545K43182N70o8294N654J32537M2292
8682C02901o1886J63531l9593j25734r3288p1353K07694R8675M2618j39751k31507
8671E2307N4218j37611j36489R9203n5240P4786j46921M8202J42628j33564Q03
8660a37678M8707K00961K1892l1509M7111J98900L6232j36426l26351n709K84303
8649B00433J09185J8003m5743k70506k39981K22799J7520P4319m7116j75081k62099
8638c98267M13603P19j59791P4815M840K82286L09877J42271L2446J47289K1547
8627H71635j51227j75238j30883m3464j32166p0476j44858N8830R3843K05847
8617C81843R3301j93300j5642Q9830J80457K18847K0502m22061j79960L05629
$$ plain form
8693 257969 172926 -54422 -6407 -138585 -53040 190142 190712 122418 128072 260609 302901
8682 302901 241015 404546 364953 239219 145931 74578 282272 380947 423565 283814 52307
8671 52307 106525 -31086 -167575 -68372 -123612 -48826 -195747 -147545 -4917 -138481 -137678
8660 -137678 -88971 111990 133882 102373 149484 348384 384616 248190 -78161 -83870 200433
8649 200433 309618 327621 281878 11372 -228609 -5810 11710 86029 38913 -136168 -398267
8638 -398267 15336 16055 -143736 -68921 -64081 218205 528082 670353 702799 850088 871635
8627 871635 720408 545170 414287 370823 238657 168181 23323 82153 175996 381843
8617 381843 475144 281844 266202 356032 536489 755336 775838 353777 173817 479446
8607D79446m8658l2889j6524o8802P6112j57184J1702R8320j18925k35056l37900
8596c50358O1543R8450J48999L5961J41126K4633j50272n0725K11626J49711r270
8585C11424r0142K01054P4320m5398j11352K26901J87424l17393j01277m4084
8575B91477l5151l9444L09002k51928j6634J82131L34J66116k06136k34913J41817
8564C06671L16492j36809k39795j24286j36556r4540J3679J6864J60454J21594
8554B03768J77222o1181k02071l01486L02633K97423R5266j92015o4265J22127
8544C77421r8301k84414j95980J68375P7416o1509r1648K48441K39143k65258
8534A13686k64614L2860R4803P8014Q2788m278q0888k39202j85870J94219O0057
$$ plain form
8607 479446 430788 397899 381375 312573 388685 231501 243203 341523 222598 -12458 -350358
8596 -350358 -288815 -190365 -41366 -5405 135721 160354 10082 -40643 170983 320694 311424
8585 311424 221282 422336 496656 451258 339906 566807 754231 436838 335561 291477
8575 291477 256326 216882 525884 273956 257322 439453 439787 605903 399767 164854 306671
8564 306671 623163 486354 246559 122273 -14283 -108823 -95144 -78280 82174 203768
8554 203768 380990 319809 117738 -183748 118885 416308 511574 319559 255294 377421
8544 377421 279120 -5294 -201274 -32899 44517 -16992 -108640 139801 378944 113686
8534 113686 -150928 -118068 -23265 54749 137537 133259 52371 -186831 -372701 -178482 -118425
8523a18425j80163j4641M4108L29418M4213j76132j91969J61769p3517L94005
8513B18666L65359J56771j40809k12808j60878q6808k1340K81378J37486j92723
8503C44294o2907L625j65409k04518M6289L50017J91098k3899j38873k26884J6127
8492A28960L39898K53283l6795n18203K2608k60504j39933m6709K30114J64976
8482A37695M80400k49995o7428k7372j99016k32431N082j0227j4681P8562J82023
8471H2612j06649j51093q9961P3243P1992J18337J63013j5869l5745M1209Q3698
8460B34787J25334r0050l22780j65765Q3941J12658j28347L14300J11772L0760
8450C06610J46465J22547j69075l39318P0610L85838k2688k28772o6121o7309
$$ plain form
8523 -118425 -298588 -313229 -269121 60297 104510 -71622 -263591 -101822 -175339 218666
8513 218666 584025 740796 599987 387179 226301 139493 118153 399531 537017 344294
8503 344294 281387 285012 119603 -84915 -38626 311391 502489 478590 339717 112833 128960
8492 128960 468858 722141 685346 167143 189751 -70753 -210686 -257395 -27281 137695
8482 137695 618095 368100 300672 273300 74284 -158147 -153065 -163292 -177973 -99411 82612
8471 82612 -24037 -175130 -265091 -191848 -119856 -1519 161494 145625 109880 151089 234787
8460 234787 360121 270071 -52709 -218474 -134533 -21875 -150222 164078 275850 306610
8450 306610 453075 575622 406547 67229 137839 523677 500989 272217 206096 138787
8440A38787k3621J17338M2719R8504j76512l3103k9163J6708k9590J90676J951
8429C14694j16278p533j64009k1043J54495K98137k97969l56731k40025M7498
8419c88764L72360K53186M8511k86333q5471N7494j640J93607n7761l23846j62196
8408c80853J0915J11198m4083J43389J27597o7173j21053K11683M16655L45443
8398G53718m4694k47036j98056j83329k46599j43732j47626R534J23807N4217
8388b69796p2841j37198J80034K57112J27732N5779r5135J68322k65664l4695
8378h6350r3073r1061j68689L0528K8380K84664J94502N0592n7904j08240j73903
8367a90554p3296K00907O2859q0894K66849L3390j72597l00602k01477J73918
$$ plain form
8440 138787 115166 232504 275223 373727 197215 164112 134949 151657 122067 312743 314694
8429 314694 198416 190883 26874 5831 160326 458463 160494 -196237 -436262 -388764
8419 -388764 -16404 236782 285293 -1040 -86511 -29017 -30657 162950 105189 -218657 -380853
8408 -380853 -369938 -258740 -302823 -159434 -31837 -99010 -220063 -8380 408275 753718
8398 753718 709024 461988 263932 80603 -165996 -309728 -457354 -447820 -324013 -269796
8388 -269796 -342637 -479835 -299801 -42689 85043 140822 45687 214009 -51655 -86350
8378 -86350 -179423 -270484 -439173 -408645 -380265 -95601 98901 149493 91589 -16651 -190554
8367 -190554 -263850 -62943 -84 -80978 185871 219261 46664 -253938 -455415 -281497
8357b81497k8842j5061O434K29209m303q022j16527J63885K44336k8116k13733
8346e2237j43182O256P1966k70471K9297R0886n06067r4632J81139j28041L72188
8335d42898K30839J28973p4040j11291L7313J52735j38372K19884J83140J6217
8325B02500p9229k85503k50426j53774Q574J05731J06201K33760J0391j46077
8315b47852q9102j42936n5726K95618K80672Q1152J38935L3139k81155j57142
8305a44397K43348k51204j10506J05845q5913J12520K6194Q2340l5889N4379n281
8294h564j20255K15056L3280j78137j75514J34766L0795J31995j86755P0528J66291
8283A13486k44340L0061L4111J73058o3816j30983J02219J5919j6755j16467L5118
$$ plain form
8357 -281497 -310339 -325400 -318966 -89757 -94060 -102082 -218609 -54724 189612 161496 -52237
8346 -52237 -195419 -189163 -117197 -387668 -358371 -267485 -773552 -868184 -687045 -815086 -442898
8335 -442898 -212059 -83086 -157126 -268417 -231104 -78369 -216741 3143 186283 202500
8325 202500 123271 -162232 -412658 -566432 -557858 -452127 -345926 -112166 -101775 -247852
8315 -247852 -336954 -479890 -535616 -239998 40674 121826 260761 293900 12745 -144397
8305 -144397 98951 -152253 -262759 -156914 -242827 -130307 -104113 -21773 -57662 -3283 -8564
8294 -8564 -128819 86237 119517 -58620 -234134 -99368 -68573 63422 -123333 -52805 113486
8283 113486 -130854 -100793 -66682 106376 42560 -88423 13796 29715 12960 -103507 -68389
8272f8389J16401K09183N0131j46572j04076n216J45439J08366l3327l10952m45752
8261d84764j00724j579o7765J31487M3136J44425J63448k3346j88092k55473n2515
8250f91762L4940J18020j17152j70630l8278J88430L67434J15528j02029m24605
8240g20104j0833K25819K46300P7348j25844k65629m1422j2039j2331j32603L2575
8229g38763L8016j88186m6416J11352L76583M52613J45384j33039k8486Q6862
8219G5920J06430j50032j2259j17819O8564O5448K17509K19440j3863k95917j61483
8208A938l38590k95566J9347K17739J0173r8908J33110O2441P0232k6375q2089
8197c26548o6860n9090K52762M4648l3411M5213J06116q9112K93960L49026J97136
$$ plain form
8272 -68389 48012 257195 307326 160754 56678 51462 196901 305267 271940 -39012 -484764
8261 -484764 -585488 -587067 -654832 -523345 -480209 -335784 -172336 -195682 -383774 -639247 -691762
8250 -691762 -656822 -538802 -655954 -826584 -864862 -676432 -308998 -193470 -295499 -720104
8240 -720104 -730937 -505118 -258818 -181470 -307314 -572943 -614365 -626404 -638735 -771338 -738763
8229 -738763 -700747 -888933 -935349 -823997 -447414 5199 150583 17544 -10942 75920
8219 75920 182350 32318 20059 -97760 -29196 36252 253761 473201 459338 163421 1938
8208 1938 -336652 -632218 -612871 -395132 -384959 -483867 -350757 -288316 -218084 -244459 -326548
8197 -326548 -393408 -452498 -199736 -155088 -188499 -143286 -37170 -126282 167678 516704 713840
8186G13840j1448k57290l3205k67381j15859K0933k69148J79032K68520p203k22239
8175a448J6117o246j6367J34808j4812m8438m8699l147J64181O2306q3778j94016
8163c9539m1156J56086L7204l8089k55411j0131J22989Q706r0700K07622J70140
8152B27721R5211m951k12557K4694j6444k0777k33803r5345J14491n2188o2807
8141b36755J106j65119j54508L34228K46526K2274K88099j25371l49343N5221
8131h3642J91157J00908K46449l4271l2568l67686l84914o9270m3206J97508K35341
8120d4194K38136j12587k28063Q7423M0415J32960J87068J40696K1886l26049
8110A37691m46890J38629J12362l9959j60267J2215O4519J79871m3400j75892
$$ plain form
8186 713840 702392 445102 411897 144516 28657 49590 -219558 -40526 227994 220791 -1448
8175 -1448 14669 8423 -7944 126864 112052 63614 14915 11768 175949 238255 154477 -39539
8163 -39539 -80695 75391 112595 74506 -180905 -191036 -68047 -59341 -150041 57581 227721
8152 227721 322932 317981 105424 130118 113674 92897 -140906 -236251 -121760 -173948 -236755
8141 -236755 -235649 -400768 -555276 -221048 25478 47752 335851 210480 -138863 -83642
8131 -83642 107515 208423 454872 420601 388033 20347 -364567 -433837 -477043 -279535 -44194
8120 -44194 193942 81355 -146708 -59285 -18870 114090 301158 441854 463740 137691
8110 137691 -309199 -170570 -58208 -98167 -258434 -246219 -181700 -1829 -45229 -221121
8100b21121J08102M8718K24322j25877M695q2990N4535J24111j4226j09618j69805
8089a59154K4851n2999K4198l8908L5980K8422P5230n4351J292k09337l29106
8078f53882n1575J82040K80344K94006k46082l9739J73116K04583m4409J08557
8068B06959J86714k30080K20508R9074m1843k37286j52270j7780K7129k57404
8058a96279l6240J15037Q9927K91395l3980j3635m9963l4639J67706N6878k56090
8047A00117r1923q1590n2748r2028L1586J79300J52224j22002P3891J91963O1860
8036C50650J4178m5812J8228j96803n5304O484J6623j44297q2742J72047J6756
8025G0008l58260k22579n7535J14779K22147N31959k1607l50709j76007J53220
$$ plain form
8100 -221121 -113019 -64301 160021 34144 38839 -44151 10384 134495 120269 10651 -159154
8089 -159154 -134303 -187302 -163104 -202012 -166032 -137610 -62380 -116731 -115439 -324776 -653882
8078 -653882 -705457 -523417 -243073 50933 -195149 -234888 -61772 142811 98402 206959
8068 206959 393673 163593 384101 483175 441332 204046 51776 33996 61125 -196279
8058 -196279 -232519 -117482 -27555 263840 229860 216225 166262 131623 299329 356207 100117
8047 100117 8194 -73396 -126144 -218172 -186586 -7286 144938 22936 96827 288790 350650
8036 350650 364828 319016 337244 140441 85137 91621 108244 -36053 -118795 53252 70008
8025 70008 -288252 -510831 -568366 -453587 -231440 300519 278912 -71797 -247804 -94584
8015i4584O6395O7557P0192j11354j06978j24844Q4924L93060r3946k65415l35503
8004d50496k0130Q0267J76508j16402j20406J21180J85175J50547k2840j73151
7994a89748K66733J72824J06357j03490j30202j94587k82232K16467J44588J99092
7984B05802O2251l17538l8703J20140K78457J64261J01372K8295k84653j61642
7974A58042l60775n754J06864J30055n3561l8199M1847k0775L6749k10082j91733
7963d07322Q2153J33774J37432m9380j98479K00936j35521J25942j72123L8869
7953b43719L72954o0536k99884K83623J12681k63573p7907P4606K4169J66118
7943H8532K53583j27268l39290k14932K01223L97193L4940j70946j0576K63263
$$ plain form
8015 -94584 -28189 39368 109560 -1794 -108772 -233616 -148692 244368 150422 -114993 -450496
8004 -450496 -470626 -390359 -213851 -330253 -450659 -329479 -144304 6243 -16597 -189748
7994 -189748 76985 249809 356166 252676 122474 -72113 -354345 -137878 6710 205802
7984 205802 268053 -49485 -88188 31952 310409 474670 576042 604337 319684 158042
7974 158042 -202733 -208487 -101623 28432 -25129 -63328 -21481 -42256 -5507 -215589 -407322
7963 -407322 -325169 -191395 -53963 -103343 -301822 -100886 -236407 -110465 -282588 -243719
7953 -243719 129235 68699 -231185 52438 165119 -98454 -176361 -101755 -77586 88532
7943 88532 342115 214847 -124443 -339375 -138152 259041 293981 123035 112459 375722
7933C75722p5900l11176j58809K95458J61266J35442j19181m4196j57825m01914
7923c01113k43642J03178J6118K55068N914j38738m7825J40570K84173J11446
7913A85149j39990j88339J35676P721M6715M3328k93619j20604j03050L820J17504
7902c05689K52637O7819N8832J46879j74942p8712N7737k02952l44381j46250
7892f69022K23999J14336K42242J87195K25135J48095q0697m00717j18105J30354
7882B815K4585O3751k7930k76313J22674K80216n0458l15994r6020J4815O7419
7871a90440o1553L4887q8818M2084J01057o8369j3851K02389J30306k07869J14273
7860e904m9791j76278Q0821Q7341K10635M2426k71319l3653J27367Q9626j83004
$$ plain form
7933 375722 299822 -11354 -170163 125295 286561 422003 302822 258626 100801 -301113
7923 -301113 -544755 -441577 -425459 -170391 -164477 -303215 -351040 -210470 73703 185149
7913 185149 45159 -143180 -7504 217 46932 90260 -203359 -323963 -427013 -423193 -305689
7902 -305689 -53052 14767 73599 220478 45536 -33176 24561 -178391 -522772 -669022
7892 -669022 -445023 -330687 -88445 98750 323885 471980 391283 -9434 -127539 2815
7882 2815 27400 91151 63221 -213092 -90418 189798 139340 -176654 -272674 -257859 -190440
7871 -190440 -251993 -217106 -305924 -263840 -162783 -231152 -245003 -42614 87692 -120177 -5904
7860 -5904 -55695 -231973 -151152 -63811 146824 189250 -82069 -115722 11645 101271 -81733
7849h1733J0021N6923M4265j54697r4640j7129n9738L15946l211j91497O3835
7838a11655l0193l6386Q2031R0979L14090J51152l36183l70395J40836K94767
7828A89043k9902J10368j1594j89856J41592k14175k54709n9612l4973j31141
7818d84959p1701l2192K24702O9938R9615j15917k87684J15308K79270K00322
7808c298J03603j82215k02439N5695K13027J19412K20604L8263p2878o2029l41365
7797a13620j62447m7021m2368j24013M4363R3559j47566J64772r6333q5979K66990
7786b49663K18467K34867j06785J02200J02563j49898o3117k2367M6831k43468
7776a30370J84143K7332M5923L59376K04691j40021k26067k01151j53117P112
$$ plain form
7849 -81733 -71712 -14789 29476 -125221 -219861 -236990 -296728 19218 16007 -175490 -111655
7838 -111655 -141848 -178234 -96203 -5224 308866 460018 123835 -246560 -105724 189043
7828 189043 159141 269509 257915 68059 209651 -4524 -259233 -318845 -353818 -484959
7818 -484959 -556660 -588852 -364150 -294212 -194597 -310514 -598198 -482890 -203620 -3298
7808 -3298 100305 -81910 -284349 -228654 -15627 103785 324389 362652 289774 227745 -113620
7797 -113620 -276067 -323088 -365456 -489469 -445106 -351547 -499113 -334341 -430674 -516653 -249663
7786 -249663 -31196 203671 96886 199086 301649 151751 88634 66267 113098 -130370
7776 -130370 53773 81105 127028 486404 691095 551074 325007 123856 -29261 -22149
7766b2149j45639o3853J66526J66098k9171k61094l2697J3145k4094n8205J1050
7755b80083K7796n5572j22822p3311J9088j04580K94893J00131j24323J36781
7745a82002r9829j19703n0130J20033K71076j44829J38735j30452K8950J07498
7735f0653J56156q1792j34932n8292N3959k9856j04613j22237j03676J11500Q0000
7724b94436k91225k0738J0782K43180J40050j83006J28243M80456J89764k54558
7714A48512k86542J64739k5302J38711j01064J10113j76321k37503J14999J57764
7704H106q2615m7224p5920o4653J63733Q9776J11915p7926j13079j7114m7467
7693a52468J0234m0118N3267R5186J2955j43918p9933K11104j60611j85623o4151
$$ plain form
7766 -22149 -167788 -231641 -65115 100983 71812 -189282 -221979 -208834 -232928 -291133 -280083
7755 -280083 -252287 -307859 -430681 -503992 -484904 -589484 -294591 -194460 -318783 -182002
7745 -182002 -281831 -401534 -451664 -331631 -60555 -205384 -66649 -197101 -168151 -60653
7735 -60653 95503 13711 -121221 -179513 -125554 -155410 -260023 -382260 -485936 -374436 -294436
7724 -294436 -585661 -606399 -595617 -352437 -212387 -395393 -267150 213306 403070 148512
7714 148512 -138030 26709 1407 140118 39054 149167 -27154 -264657 -149658 8106
7704 8106 -74509 -121733 -197653 -262306 -98573 -8797 103118 25192 -87887 -105001 -152468
7693 -152468 -142234 -182352 -129085 -33899 -20944 -164862 -244795 -33691 -194302 -379925 -444076
7682d44076K42500P2609o2646k98618J927J39734J58012O293J01218K359J03488
7671B2800q4011k36877J52538Q2452j23071J47265L31249r7921j40866p0711j94635
7660b11788J60939J11102J3995j39346o3650M2824m1835K139O8150j65862j28249
7649c51581j60599J77840K44304J75911j16403m5053j90969j52413m0388K54844
7639b04507K37888k53332j69285M0792J14854L50951K33032j90050l46700n5284
7629b41641N3854O3248M5136j32945P4904Q0307j43211P0215R9560k83601k49051
7618e63225n6192L38266J36136L8284O655j2666l21064J25832K06498j78079j50529
7607d30084l9827k431l7177K68881J82943q805R5580J10520j9295j43675J19328
$$ plain form
7682 -444076 -201576 -128967 -191613 -490231 -488304 -348570 -190558 -184265 -83047 -80688 22800
7671 22800 -61211 -298088 -145550 -63098 -186169 -38904 292345 194424 53558 -17153 -211788
7660 -211788 -50849 60253 74248 -65098 -128748 -85924 -127759 -125620 -57470 -223332 -351581
7649 -351581 -512180 -334340 -90036 85875 -30528 -75581 -266550 -418963 -459351 -204507
7639 -204507 33381 -219951 -389236 -348444 -233590 117361 350393 160343 -186357 -241641
7629 -241641 -187787 -124539 -79403 -212348 -137444 -57137 -200348 -130133 -30573 -314174 -563225
7618 -563225 -619417 -281151 -145015 -106731 -100076 -112742 -433806 -307974 -101476 -279555 -430084
7607 -430084 -469911 -472342 -509519 -240638 -57695 -66500 29080 139600 120305 -23370 95958
7596I5958J33339o1942q3418j77308l62864k58492K5074R2594J37871L13361J57218
7585A1391j54150j93794L4209K16142j7089k5978L07826j02883j54450K885J87329
7574A11438M9214k90472k69611j38714m941j23716J94371L0298k3939J36296o3522
7563c93298m2993M7761N4793K95146L96387K73510r6826j23184q4830k36959k56411
7552a66904m7867N8064L074o8951J10587m7315j8069j57639j73301K23397K38141
7541d6783j6812q4080L15792K5434j36333j10595j3973r539q8371j55882O6207
7530b54935L07612K28193N6002O6780l20360j21397R5356n133J4930n9191R6537
7519A04394J58884k03661j86435J29251J36357p1991J66118J07573J28021R5920
$$ plain form
7596 95958 229297 167355 83937 -93371 -456235 -714727 -689653 -597059 -459188 -145827 11391
7585 11391 -142759 -336553 -302344 -86202 -103291 -129269 178557 75674 -78776 -75891 111438
7574 111438 160652 -129820 -399431 -538145 -543086 -666802 -472431 -442133 -466072 -329776 -393298
7563 -393298 -436291 -388530 -333737 -38591 357796 631306 534480 411296 326466 89507 -166904
7552 -166904 -214771 -156707 -153633 -222584 -111997 -159312 -177381 -335020 -508321 -284924 -46783
7541 -46783 -63595 -147675 168117 193551 57218 -53377 -67350 -76889 -165260 -321142 -254935
7530 -254935 52677 280870 336872 403652 83292 -38105 57251 52118 67048 7857 104394
7519 104394 263278 59617 -126818 2433 138790 66799 232917 340490 468511 564431
7509E64431q7695k38807j42524k47165M6791O7412k0710k56133M14732J36060
7499B36392k80220K27494q7746j79806j96532r1288j01531K42053K91954j91696
7489a30926j73173p1590Q9060J13460K84319K6772k54623p9261R3703L05338P0655
7478B73734P3140Q735j80976q2340N9493L010n2644J15942L36263m9432k16777
7467B88148j49881m43598J11658J88138J30719J07289l6373l2219j63570q4303
7457h3992N6114M7291r6547J26696j06179k7697j43555J4603j0484P229m7177
7446b63698k21726p2096J23981N11757K50943j8376r8308l53933j49800j35097
7436d26353j96993J17730m6913j73461R8303N2616M7866P719J33370K18698k1754
$$ plain form
7509 564431 476736 237929 95405 -151760 -104969 -37557 -58267 -314400 100332 236392
7499 236392 -43828 183666 95920 -83886 -280418 -371706 -473237 -231184 60770 -130926
7489 -130926 -304099 -375689 -286629 -173169 111150 137922 -116701 -195962 -102259 203079 273734
7478 273734 346874 355609 174633 92293 151786 154796 102152 218094 554357 504925 288148
7467 288148 138267 -305331 -193673 -5535 125184 232473 196100 163881 311 -83992
7457 -83992 -27878 19413 -77134 49562 -56617 -84314 -227869 -213266 -223750 -216521 -263698
7446 -263698 -485424 -557520 -433539 78218 329161 310785 212477 -141456 -291256 -426353
7436 -426353 -623346 -505616 -552529 -725990 -627687 -575071 -527205 -519486 -386116 -167418 -189172
7425a89172j23883J94769J55952k6538m0268o5739o6871K06713J06269j76780
7415b5548k27043K20492K56804J86978j24213j95110l91492l01172L45139J72927
7405h2238p1713q6357R8586K1497k03937j62218O0399K95693M9416L659o1583
7394a38796j34664L62910J88461k42314j5596j27024J50115k8954j27683P6975
7384c6570l2440j4057K06876P45j38625P7790Q364j38424k33774k08718j26741
7373f35574j4805L8153L60586q7188k06219L46320J40158j53506j86330K7403
7363c71002J4518L5556R0047J35633o0511J587J40354K12609p3323k15733j70760
7352b61025j04699K23777m0094Q9668K62850J5532j61578j13346k17014N7615
$$ plain form
7425 -189172 -313055 -118286 37666 11128 -29140 -94879 -161750 44963 151232 -25548
7415 -25548 -252591 -32099 224705 411683 287470 92360 -299132 -600304 -255165 -82238
7405 -82238 -153951 -240308 -141722 -120225 -324162 -486380 -425981 -130288 -80872 -77213 -138796
7394 -138796 -273460 89450 277911 35597 20001 -107023 43092 14138 -113545 -36570
7384 -36570 -69010 -83067 123809 124554 -14071 63719 72083 -66341 -300115 -508833 -635574
7373 -635574 -650379 -612226 -251640 -338828 -545047 -198727 -58569 -212075 -398405 -371002
7363 -371002 -356484 -320928 -230881 -95248 -155759 -154172 -13818 198791 125468 -90265 -261025
7352 -261025 -365724 -141947 -182041 -92373 170477 186009 24431 -88915 -305929 -248314
7342b48314L13496l4905N0595j77910k18098o6497J52110K42350Q811k3925J80162
7331A77875o7746j05788O4666l29775j18144J38049l3969k00339j69673j30342
7321g75186K72388R9560R6432k681K7969K55518o0273O96j411J30482K8566j08085
7309c6025o7053N661j97591M8984P6731J24325J21514l00512k58033M24757J68175
7298A10933k83763j02028m8742p6083L15237J29736q8099P2101Q3042j14716K544
7287A62l6440J47364J86922L7406n2423j02244n3952q5457R844j49419q7557n548
7275a91342q1760K00066J35190o174n7704j66577J73318J03655l4574j29561j08130
7264a63593K1017J14580Q0942j22380j84726l3234m2728M1729K68208K42598j82376
$$ plain form
7342 -248314 65182 30277 80872 -97038 -315136 -381633 -229523 12827 21638 -2287 177875
7331 177875 110129 4341 69007 -260768 -378912 -240863 -274832 -475171 -644844 -775186
7321 -775186 -502798 -403238 -306806 -309487 -281518 -26000 -86273 -85577 -86988 43494 72060 -36025
7309 -36025 -103078 -97417 -295008 -246024 -169293 -44968 76546 -223966 -481999 -57242 110933
7298 110933 -172830 -274858 -323600 -399683 -84446 45290 -42809 29292 112334 -2382 162
7287 162 -36278 111086 298008 335414 282991 180747 126795 41338 51182 -98237 -185794 -191342
7275 -191342 -273102 -73036 62154 55980 -1724 -168301 5017 108672 74098 -55463 -163593
7264 -163593 -142576 -27996 52946 -69434 -254160 -287394 -330122 -288393 -20185 222413 40037
7253D0037J30003J33407j30714m00342j82523J08552L233K14581q910j58566p7809
7242c29051K40830j44289J54436J87619K07239m7072J40932K04704j33984k43543
7232B37821k8591j36921L9466J10735J79891k83162K677m5582k67408K0022r6362
7221b67414J5578n769k1162J48953J70187o4350N3080J2683j20345p4984j67781
7210c21324J3210J9042O8727m3137o5867O9553L4405J26677J18245J92143J48791
7199C60465l97765j22343K12100j28308n0924k19914J9378K24675J18514L3103
7189D8981J6255j69834k96997j67260J71902K67118L66559J46602j7026j88656
7179A77644j53141j93998k0581O1671j20786j338l8482K04618J62356j50287J58670
$$ plain form
7253 40037 170040 303447 172733 -227609 -410132 -301580 -298347 -83766 -92676 -251242 -329051
7242 -329051 -88221 -232510 -78074 109545 316784 269712 410644 615348 481364 237821
7232 237821 209230 72309 111775 222510 402401 119239 121916 76334 -191074 -171052 -267414
7221 -267414 -251836 -257605 -278767 -129814 40373 -23977 29103 41786 -78559 -153543 -321324
7210 -321324 -308114 -289072 -220345 -263482 -329349 -259796 -225391 -98714 19531 211674 360465
7199 360465 -37300 -159643 52457 -75851 -126775 -346689 -327311 -102636 15878 48981
7189 48981 65236 -104598 -401595 -568855 -396953 -129835 236724 383326 366300 177644
7179 177644 24503 -169495 -190076 -128405 -249191 -250529 -289011 -84393 77963 -72324 86346
7168H6346O8128j1464l08723k47933M29280K2637j55439J74265M5863q2496k5938
7157e474p9948j0387j16936K7117J56268N851j27960k23436j52069J12350M073
7146d10551K38002J0748J53109P931P858Q9247k89171R4160J28378L3068J62792
7135B25571n8272o5286k71737j35963K26120K26274j99725j23346j60675K8762
7125c08277q1265m9235j61959L29612Q7544J68736J29201J19751J11921q0833
7115B65196m53648j50595Q9852J47437K09527k00787J29r7668l8700N5006J14962
7104e9289n0933o8127J5715l829L787m552Q3880J35285j28322J11033J4219q9017
7092d0150k4339Q9248K10797J1613j41619n2860J65304n4140k37061L8237M8976
$$ plain form
7168 86346 154474 143010 -165713 -413646 15634 38271 -117168 57097 102960 20464 -5474
7157 -5474 -85422 -95809 -212745 -185628 -29360 -23509 -151469 -374905 -526974 -414624 -410551
7146 -410551 -172549 -161801 -8692 -761 7097 96344 -192827 -98667 29711 62779 225571
7135 225571 167299 102013 -169724 -305687 -79567 146707 -53018 -176364 -337039 -308277
7125 -308277 -389542 -438777 -600736 -271124 -183580 -14844 114357 234108 346029 265196
7115 265196 -188452 -339047 -249195 -101758 107769 -93018 -92889 -190557 -229257 -174251 -59289
7104 -59289 -110222 -178349 -162634 -166463 -162676 -167228 -83348 51937 -76385 34648 48867 -40150
7092 -40150 -64489 24759 235556 247169 105550 52690 217994 163854 -73207 -34970 14006
7081A4006J37008j73190q7837k1191J43962J86094k36779k94642j31492L86158
7071g7903K33052j47004k9570M1257j37983j75520k91284K33622L92261K93755
7061C34683M5432k49222j28562j74944o4393J85870J33925j67022r4321j7367
7051a95921Q1757j66255O6887p6235l51513r7883Q0698J11942M20891J20412j27142
7040a32362j87359R953j39115P6865M10934P2557l8194l62255m5955K85807J07533
7029E8409p4830k56328O6597J77852j15336J9650J71791p7322j31142n9095J30724
7018h9030K98102L1426j87157k3620J7052k01114k32130n4399n3611p9636K03212
7007c70905J39752J07772j99840o9536J51625O8263k27117J6480L40932J37210
$$ plain form
7081 14006 151014 -22176 -110013 -131204 12758 198852 -37927 -332569 -464061 -77903
7071 -77903 155149 8145 -21425 19832 -118151 -293671 -584955 -351333 40928 334683
7061 334683 380115 130893 2331 -172613 -237006 -51136 82789 -84233 -178554 -195921
7051 -195921 -114164 -280419 -213532 -289767 -641280 -739163 -658465 -546523 -125632 -5220 -132362
7040 -132362 -319721 -309768 -448883 -372018 38916 111473 73279 -288976 -334931 -49124 58409
7029 58409 -16421 -272749 -206152 -28300 -143636 -123986 47805 -29517 -160659 -219754 -89030
7018 -89030 209072 240498 53341 29721 46773 -154341 -386471 -440870 -494481 -574117 -370905
7007 -370905 -231153 -123381 -323221 -392757 -241132 -172869 -399986 -383506 -42574 94636
6997I4636J08435k69473l21997J33886J55162n7369M6565M8319k6285m3134j40885
6986b72140k6202J5287k1369K77393j19030J49831j09079j42513j629j30241J05307
6975b74385j47197j41919R4263o0157P6215p0985J45080J01339K39358K34427
6965A96039L1105p6061l94444k33357L43083K62702J0928j98399k07223M0213
6955b25414J72974M6199k4995J22998J01102j97246j45705R1332m9325l9795K1148
6944a26727k08058M2925J08864o1438J36563K69786M9959m8537l22510j1881Q8300
6933h2754J32080j75388j00792P804J86283J60660j70918j22786j74551K96441
6923d3921J4541j04310k26537J37204J21419l7190L6499k0034j45236L72540R4888
$$ plain form
6997 94636 203071 -66402 -388399 -254513 -99351 -156720 -110155 -61836 -88121 -131255 -272140
6986 -272140 -298342 -283055 -304424 -27031 -146061 3770 -105309 -247822 -249451 -379692 -274385
6975 -274385 -421582 -563501 -469238 -529395 -453180 -524165 -379085 -277746 -38388 196039
6965 196039 227144 151083 -243361 -476718 -133635 129067 139995 -58404 -265627 -225414
6955 -225414 -52440 -6241 -31236 91762 192864 -4382 -150087 -58755 -108080 -147875 -126727
6944 -126727 -334785 -291860 -182996 -244434 -107871 161915 211874 163337 -159173 -171054 -82754
6933 -82754 49326 -126062 -226854 -219050 -32767 127893 -43025 -165811 -340362 -43921
6923 -43921 -29380 -133690 -360227 -223023 -101604 -138794 -102295 -122329 -267565 104975 199863
6912A99863k12420L160Q7994K6794J1936j41404Q8599N1142j23246r1327l5076
6901a33985m2251O2572K1098L4727r4603j66270j33850J86487K01410Q6068j34776
6890a13373j61113r5770j09924j32635J8257m9511k267K37809Q3345K01261L55706
6879B31785k9217m8265r9381m4186j88702K72491J25722J09257P0567m68767l44735
6868d13431M1565N3294J62938J31004l402J00411j21198j07690J14623Q3588J18372
6857A60074j08890k84760q0613L38340K76337j70376j00745l5569j42293J38981
6847i514J66812n7241l4700o3117O2602O2917n9553j33015J16465j59046k98024
6836d05414L994P3754N7707m7467j07723o4434J78832K73277J44269k69928K18
$$ plain form
6912 199863 -12557 -9397 78597 105391 117327 -24077 64522 115664 -7582 -98909 -133985
6901 -133985 -176236 -113664 -92566 -57839 -152442 -318712 -452562 -266075 -64665 21403 -113373
6890 -113373 -274486 -370256 -480180 -612815 -594558 -644069 -646336 -408527 -325182 -123921 231785
6879 231785 202568 154303 54922 10736 -177966 94525 220247 329504 400071 -68696 -413431
6868 -413431 -371866 -318572 -155634 -24630 -28032 72379 -48819 -156509 -41886 41702 160074
6857 160074 51184 -233576 -314189 24151 300488 130112 29367 -6202 -148495 -9514
6847 -9514 157298 100057 65357 2240 64842 127759 68206 -64809 51656 -107390 -405414
6836 -405414 -401420 -327666 -269959 -317426 -425149 -489583 -310751 -37474 106795 -163133 -162915
6825a62915j00327Q8432K99476j82855l09364k4200J16471j345j27283L05620
6815i8290l8554l2861k710n0753O0590l3292k19430j06101r5120K30724K07938
6804a77859J40593L5200J02405J31180l41493j33790R2662j4639K09938j0119
6794C4078k676j31950j46706l60920k7099P457K49441J20707P4263N1509J71324
6783C9428j55559j35015p5218K65113j18130p6451j5292j10074J21117K2497J31107
6772a06477J23579J41917j3681J7699q6416K3819P2067L7524o285j8801K752R5803
6760B83500n8539N6891r3198o9824j46507Q8374q8732J61848k6853k05655m5989
6749a44684r3398k69753J0410Q0178J29390K0254N0487n2312R5299O392j82035
$$ plain form
6825 -162915 -263242 -174810 124666 -58189 -367553 -391753 -275282 -276627 -403910 -98290
6815 -98290 -136844 -169705 -172415 -223168 -162578 -195870 -415300 -521401 -616521 -385797 -177859
6804 -177859 -37266 -2066 100339 231519 -109974 -243764 -151102 -165741 44197 34078
6794 34078 31402 -100548 -247254 -608174 -635273 -627816 -378375 -257668 -183405 -131896 39428
6783 39428 -116131 -251146 -326364 -61251 -179381 -255832 -271124 -381198 -260081 -237584 -106477
6772 -106477 17102 159019 145338 163037 76621 100440 172507 210031 203746 184945 187697 283500
6760 283500 224961 281852 188654 118830 -27677 60697 -28035 133813 106960 -98695 -144684
6749 -144684 -238082 -507835 -497425 -417247 -287857 -267603 -217116 -269428 -174129 -167737 -349772
6738c49772K11789J6176l49822n7356J05355K61238L22507j95041n1100O8892
6728a7134k6627k70562j45230p1186N1830K99941K63518m3697k1923K17747j05720
6717A30957j90383k41687j66902O9447J75341o5139J70915J56431K7597r9060
6707c2483L32679J83742J69481J17089k39865o7169l1237l07261J1109J80824
6697C16909k32169l56660J4594M55481j5753k63147J51202J04000o9445l1864
6687G3148O2675M91683Q5395k35239j36503J3514L5966O0032p9260r1766j54102
6676A25543k74525K1032l55023O9533K08734K33648J83176m2376j47270K9941
6666E2413l31154J04188J4070j65645K2612Q0876j63303k07522K05928P4281j55785
$$ plain form
6738 -349772 -137983 -121807 -471629 -528985 -423630 -162392 160115 -34926 -86026 -17134
6728 -17134 -43761 -314323 -459553 -530739 -478909 -178968 84550 40853 18930 236677 130957
6717 130957 -59426 -301113 -468015 -398568 -223227 -288366 -117451 38980 66577 -32483
6707 -32483 300196 483938 653419 770508 530643 463474 432237 124976 136085 316909
6697 316909 84740 -271920 -257326 198155 182402 -80745 70457 174457 105012 73148
6687 73148 135823 627506 712901 477662 341159 354673 390639 450671 371411 279645 125543
6676 125543 -148982 -127950 -482973 -413440 -204706 28942 212118 169742 22472 52413
6666 52413 -278741 -174553 -160483 -326128 -303516 -222640 -385943 -593465 -387537 -313256 -469041
6655d69041M4658K24946K9296M9814k61634J91914K43392r0712K4769K88019r627
6644B65794q1804m8859j00047j73495L14863J36775k34166q9659J23768J35536
6634B48706L4762j76332k76279L8489j026l28785o0009L66509J85754j46276j58535
6623b73022o8158J09064K54211j98501k13436j01918P2082K20128k18259j10593
6613e28402q805Q1063J05122L34139J0022l07860r7033q6048Q4599K86037P3804
6602e3362k38648j66187J53648p1384J97085M8486m27806K1507L98935J83852
6592D6126j2014J93169P0105o9142m18p6326j17379p8925K2209P404K03124n9875
6580A28058k55362Q8256k2320k06797j41716k26483J422L8275L86858K37978K37126
$$ plain form
6655 -469041 -424383 -199437 -170141 -120327 -381961 -190047 53345 -37367 -12598 275421 265794
6644 265794 183990 135131 35084 -138411 176452 313227 79061 -10598 113170 248706
6634 248706 283468 107136 -169143 -130654 -131680 -460465 -520474 -153965 31789 -114487 -273022
6623 -273022 -341180 -232116 22095 -176406 -389842 -491760 -419678 -199550 -417809 -528402
6613 -528402 -537207 -456144 -351022 -16883 -6861 -314721 -411754 -497802 -413203 -127166 -53362
6602 -53362 -292010 -458197 -304549 -375933 -178848 -130362 -558168 -536661 -137726 46126
6592 46126 34112 227281 297386 228244 227826 151500 34121 -44804 -22595 -15191 187933 128058
6580 128058 -127304 -39048 -61368 -268165 -409881 -636364 -634942 -596667 -209809 28169 265295
6569B65295k31O601j62295J9373q2613m99127j19141J51613K35569L1474j42927
6558b96409O976j90164M2681M7348k05968P9632K75760L96190K22555k20359l56366
6547a98124j30769j72001r2736J81096K59354l1930K24985J4868r7406k61302
6537c03965n9697J87865J12465K15167m2353l22988j759L24474K09614l14635
6527D188K9373r2499Q4819k60807o3477n6543M3389L4441n7231J09154J98835
6516b6358M3q5128k96007j25613Q1857J68734j86829j71637Q1717K91142J30472
6505a37607O2588K5271j50490j7018j50754J66062K287j39185m0444J12117m5381
6494c12554j84548J77561J73774K09314J17754k381J74593j30545k64816K12211
$$ plain form
6569 265295 265064 271665 109370 128743 46130 -452997 -572138 -420525 -184956 -153482 -296409
6558 -296409 -289433 -479597 -436916 -389568 -595536 -515904 -240144 156046 378601 158242 -198124
6547 -198124 -328893 -500894 -593630 -412534 -153180 -185110 39875 54743 -42663 -303965
6537 -303965 -363662 -175797 -63332 151835 109482 -213506 -215265 109209 318823 4188
6527 4188 33561 -58938 25881 -234926 -298403 -354946 -311557 -277116 -334347 -225193 -26358
6516 -26358 -26315 -111443 -407450 -533063 -451206 -282472 -469301 -640938 -559221 -268079 -137607
6505 -137607 -75019 -49748 -200238 -217256 -368010 -201948 -199661 -338846 -379290 -267173 -312554
6494 -312554 -497102 -319541 -145767 63547 181301 178920 353513 222968 -41848 170363
6484A70363K08855m8877j5884J73322j17909j35981O9868p0608r0115o5419k77662
6473b00047k63332j9508K44060J19303n3345j11308k65625q4984K37201K57909
6463a39676L22648r2058k71496p2990J62812L42034j07796k32488r6681j78317
6453c64008k78435J40489R8313j61757r6738l8803J21386J81505K5578k46566
6443f19036K26747K17673P9673n678O9326j2248P0784J90864p8969m1188L49k52063
6431a53766J55191K317l43635k12378o1331j7801N4854J72786j80579J19583K04315
6420b60444J94413K18787p5476j56531k16311K78705L21398j71654k24087J23243
6410C2043P8716j18448k8206o5116r7611k25697R5475r4810k31059K09427K2592
$$ plain form
6484 170363 379218 330341 314457 487779 369870 233889 303757 233149 143034 77615 -200047
6473 -200047 -463379 -482887 -238827 -119524 -172869 -284177 -549802 -634786 -397585 -139676
6463 -139676 182972 90914 -180582 -253572 -90760 251274 143478 -89010 -185691 -364008
6453 -364008 -642443 -501954 -403641 -565398 -662136 -700939 -579553 -398048 -372470 -619036
6443 -619036 -392289 -174616 -94943 -100621 -31295 -43543 27241 218105 139136 97948 98297 -153766
6431 -153766 1425 3742 -339893 -552271 -613602 -631403 -576549 -403763 -584342 -464759 -260444
6420 -260444 -66031 152756 77280 -79251 -295562 -16857 304541 132887 -91200 32043
6410 32043 110759 -7689 -35895 -101011 -198622 -424319 -328844 -423654 -654713 -445286 -422694
6399d22694P9627K7897k98752J59390J83592j14050J01896Q0790K70917p2163
6389c550l47387j97946K55946J96241K91334L3568j39574k48905j51939j55909
6379d68121J24000K13449R2151k72302l8248R6906J54893j21672p2429K19740
6369g1633J31462k9005n9777p0152n8524j97846M6482j12812K48071J62372p3561
6358h4923j11912j7372L84348o7299j15773r1699o2613J82120N8591j59523j45217
6347b31272j83599p1958K54900K03570M2866J33918O0320r1638k43958m4526Q6726
6336h4651o7475K8495o3956J7090J40764O9039L15278j99097k36922p6599K72096
6325A14062P8j61727j59698q6667Q5286j70381q3490j42004j80163R7247J76372
$$ plain form
6399 -422694 -343067 -315170 -613922 -454532 -270940 -384990 -283094 -202304 68613 -3550
6389 -3550 -350937 -548883 -292937 -96696 194638 228206 88632 -160273 -312212 -468121
6379 -468121 -344121 -130672 -38521 -310823 -349071 -252165 -97272 -218944 -291373 -71633
6369 -71633 59829 30824 -28953 -99105 -157629 -355475 -308993 -421805 -173734 -11362 -84923
6358 -84923 -196835 -214207 170141 102842 -12931 -104630 -167243 14877 73468 -86055 -231272
6347 -231272 -414871 -486829 -231929 -28359 14507 148425 208745 117107 -126851 -171377 -84651
6336 -84651 -152126 -123631 -187587 -170497 -29733 39306 354584 155487 -81435 -158034 114062
6325 114062 114140 -47587 -207285 -293952 -208666 -379047 -462537 -604541 -784704 -687457 -511085
6314e11085J44921N069j28601J66687K27838p6909N9284K20021K24705o1918l2958
6303B37054j70065m7562J44314q695l35894j05458J43812J20421Q4626k20140
6293a57587l29818j81117k55419R0937K65065K77563r0230Q8784n0477m5365K7124
6282c60540J23521k5370j16514L5807p1503m4793L6556j91129n727R7553j17834
6271f39973R3856J82973L83005J29204k52150j01192j279j68978P4785J65311
6261a34438j38694n5797j0511Q5561o5937j25262N439J52661J87501K2348j9181
6250i6310j3400j95029p6528n8571J87394J92819q5018n2768J29343n0998n3587
6239a72653k129J55451K00378O5526Q3369l15953k2291R7657j05518k43325j06745
$$ plain form
6314 -511085 -366164 -361095 -489696 -323009 -95171 -172080 -112796 107225 331930 270012 237054
6303 237054 66989 19427 163741 155046 -180848 -286306 -142494 -22073 62553 -157587
6293 -157587 -487405 -668522 -923941 -833004 -567939 -290376 -380606 -291822 -342299 -387664 -360540
6282 -360540 -237019 -262389 -378903 -343096 -414599 -459392 -422836 -613965 -619692 -522139 -639973
6271 -639973 -546117 -363144 19861 149065 -103085 -204277 -205556 -374534 -299749 -134438
6261 -134438 -273132 -328929 -339440 -253879 -319816 -445078 -439639 -286978 -99477 -77129 -96310
6250 -96310 -109710 -304739 -381267 -439838 -252444 -59625 -144643 -197411 -68068 -119066 -172653
6239 -172653 -174782 -19331 181047 246573 329942 13989 -8302 89355 -16163 -259488 -366233
6228c66233J03125L716R022K6379K44488j31408l13254P5862N6381K7133J56746
6217a08043N7970J56041k6104j21180J21450O395o5488J03774J21074r8613Q73
6206A48149j8870M9898j92727k23546j71291r948Q5266m3160M6379Q7118J71844
6195g0888j11008k69178J57625L50038M4128R8487Q1200k4426j68229n72809N5997
6184d29063J40617J91146L87807O5016J0832j72422n45694l42626m3129K24424
6174e13092K53249K57053K16695k27392p9285J07458r5582J22599o9921j00305
6164a28523j02442N8536J05048M1449m9923R187J08110o8842j8292L0370n6013
6153g1335O5128j16601J37525K5336m5435J42076K9039n4453k4772K438J63117
$$ plain form
6228 -366233 -263108 -259392 -250370 -223991 20497 -110911 -424165 -348303 -291922 -264789 -108043
6217 -108043 -50073 105968 79864 -41316 80134 86529 21041 124815 245889 147276 148149
6206 148149 129279 179177 -13550 -237096 -408387 -418335 -333069 -376229 -329850 -242732 -70888
6195 -70888 -181896 -451074 -293449 56589 100717 199204 280404 255978 87749 -485060 -429063
6184 -429063 -288446 -97300 290507 355523 366355 193933 -351761 -694387 -737516 -513092
6174 -513092 -259843 -2790 213905 -13487 -92772 14686 -80896 41703 -28218 -128523
6164 -128523 -230965 -172429 -67381 -25932 -75855 -66668 41442 -27400 -45692 -15322 -71335
6153 -71335 -6207 -122808 14717 40053 -5382 136694 165733 111280 86508 88946 252063
6142B52063R1434R3436k01815k06826r5761n049J19290r1647k54382j14424K12981
6131b00700n5024J25043M5020l78466l3679J50053J56095J28305J27059K48710
6121C12416J0339M400j71858j42322N972R7890J14484q3416k9171j986j91926
6110g5178k77163o5920Q9774J79464P1745J28707J624p9229j00760j48298o1438
6099c36672l5415R1447J80649j03847J09565k4126o740k4349j393p8485P7612
6088a51754j51142j98070J17143N3081j85736K58641J66057n0539J35763O7212
6078F0656N7918Q7981k2328j08251L6075R0125k04094j26801K0078k69874M6737
6067c31778J00635q4699K63439j54356n24260J57596J86975k53465L48914M02052
$$ plain form
6142 252063 343497 436933 235118 28292 -67469 -72518 46772 -44875 -299257 -413681 -200700
6131 -200700 -255724 -130681 -85661 -464127 -497806 -347753 -191658 -63353 63706 312416
6121 312416 322755 327155 155297 12975 18947 116837 231321 147905 118734 116748 -75178
6110 -75178 -352341 -418261 -328487 -149023 -77278 51429 53053 -26176 -126936 -275234 -336672
6099 -336672 -372087 -280640 -99991 -203838 -94273 -118399 -125139 -149488 -150881 -229366 -151754
6088 -151754 -302896 -500966 -383823 -330742 -516478 -257837 -91780 -142319 -6556 60656
6078 60656 118574 206555 184227 75976 112051 202176 -1918 -128719 -108641 -378515 -331778
6067 -331778 -231143 -315842 -52403 -206759 -731019 -573423 -386448 -639913 -290999 111053
6057A11053J12654j72889l08085j98370k6580J58751n9121j78858j41444J52929
6047e49960K63263J57124m9139l57576k02967K53353K08466o6886K74643K91878
6037B22199N7794j77413l7372r7430l010q5666J86195p3729k48927J36639N109
6026a15611k38709J39915M04269j20183J18824J91290k49482l52761k66456J29711
6016c59193K81337k5380j06982N3723o8549p1256k5562P6299R6172k35008l20766
6005g05165K1222J96877J17023J10488O3787K42551k52317j68924q1901M4662
5995d11697J40864M0627K64125K08178L0525K39578j42052k76205k4783k8534
5985D0626J29923K61074J04940k31181J36606J60737n26546j48196K4172p3750
$$ plain form
6057 111053 223707 50818 -257267 -455637 -482217 -323466 -382587 -561445 -702889 -549960
6047 -549960 -286697 -129573 -178712 -536288 -739255 -485902 -277436 -344322 -69679 222199
6037 222199 279993 102580 65208 -32222 -35232 -120898 65297 -8432 -257359 -120720 -115611
6026 -115611 -354320 -214405 189864 69681 188505 379795 130313 -222448 -488904 -359193
6016 -359193 -77856 -103236 -210218 -156495 -225044 -296300 -321862 -245563 -149391 -384399 -705165
6005 -705165 -683943 -487066 -370043 -259555 -195768 46783 -205534 -374458 -456359 -411697
5995 -411697 -270833 -230206 33919 242097 272622 512200 370148 93943 69160 40626
5985 40626 170549 431623 536563 305382 441988 602725 76179 -72017 -47845 -121595
5975a21595j01038p0728L8481L05720K06914P9614j56172L00n9630j94762Q7124
5964A4228m877j85990k31564M7664o1021K44389J67329O570K40915q0974j52924
5953C745L6495j21723J08385K45983J70702k84139L5597j79581j97535J8168j52976
5942c16879J64333J9000K06480J27816l800m19197p7518J54952L34967Q9665j68107
5931A11712k10386k17798j32913Q4278J21460p8682K70693J34317K24008j0501
5921B96188j15554J65630r4811j49401q8937j12747j49515j39705k96895j37397
5911h23144J83717R4203J78580L50886J80763k27095k59838l494q0914J8191J79528
5900b08617K27710L8464J52797M2766k34835j9697J53471k750k04912J85478J22289
$$ plain form
5975 -121595 -222633 -293361 -254880 50840 257754 337368 181196 181496 121866 -72896 14228
5964 14228 9351 -176639 -408203 -360539 -421560 -177171 -9842 -3272 237643 156669 3745
5953 3745 40240 -81483 26902 272885 443587 159448 195045 15464 -182071 -163903 -316879
5942 -316879 -152546 -133546 72934 200750 196950 -222247 -299765 -144813 190154 279819 111712
5931 111712 -98674 -316472 -449385 -365107 -243647 -322329 -51636 82681 306689 296188
5921 296188 180634 346264 251453 102052 13115 -99632 -249147 -388852 -685747 -823144
5911 -823144 -639427 -545224 -366644 -15758 165005 -62090 -321928 -325422 -406336 -388145 -208617
5900 -208617 19093 57557 210354 253120 18285 -1412 152059 149309 -55603 129875 252164
5889B52164o696J23017m0565p9663q6464q9148j06657J12314J80274j03668j47343
5878G565j61075p8396j0178J05857J34287P4569j12081L34111J13898k18728n82431
5867c92602j04172N6468k09719o7860J02623J89090l5869k0081J24639K26511
5857a30972n1753o3497O2766j37107K2828J9376j97640l27234J83659J58494L67760
5846i3320K31327R6211j11968k18754k7836r439J19065O6569k77902m2611K8911
5835b39747l08187K8700J7528K47998O8472l44565j03364J72982P1275K65074
5825a23834K04471k39807j15765m5740M8494j72130r262l0396J23032Q66J20474
5814b39597m5623J9955J00509R2327K12646P7800k01095o1189L8617L5431k20682
$$ plain form
5889 252164 245468 368485 327920 248257 161793 72645 -34012 78302 258576 154908 7565
5878 7565 -153510 -231906 -242084 -136227 -1940 72629 -39452 294659 408557 189829 -392602
5867 -392602 -496774 -440306 -650025 -717885 -615262 -426172 -462041 -482122 -357483 -130972
5857 -130972 -182725 -246222 -183456 -320563 -297735 -278359 -475999 -803233 -619574 -461080 -93320
5846 -93320 138007 234218 122250 -96504 -124340 -133779 -14714 51855 -226047 -268658 -239747
5835 -239747 -547934 -519234 -501706 -253708 -185236 -529801 -633165 -460183 -388908 -123834
5825 -123834 80637 -159170 -274935 -320675 -272181 -444311 -453573 -483969 -360937 -360071 -239597
5814 -239597 -285220 -265265 -164756 -72429 140217 218017 16922 -44267 -5650 29781 -190901
5803a90901K67499J43015k20542k16860J9004l7298O9327J52767k3884j38275
5793a76148P8355L30024j64795J84679p6214k10888P4328q301j01087P6421K26761
5782B33135N4327k96017r6878k93015J03187J03125J71691P8503L10965j32873
5772B36150k95261N8823j70843R8131O621j16399J68087K94048J61304j25488
5762C15173m12879k23331n8123J05158K4965J67785j54731k32419o9123K6463
5752e11062J26602q820K8403p995l47825j85697K48179K10762K58237k2376J43334
5741f8258J62562J5537j60986j18625J64625o1247O7464o5266P5072j66226K17714
5730F2366J05088J8269r4600O2272J34524k26165J10588j87468n4546O1670K07019
$$ plain form
5803 -190901 76598 219613 -929 -217789 -198785 -236083 -166756 -13989 -37873 -176148
5793 -176148 -97793 232231 67436 252115 175901 -34987 39341 31040 -70047 6374 233135
5782 233135 287462 -8555 -105433 -398448 -295261 -192136 -20445 58058 369023 236150
5772 236150 -59111 -288 -171131 -73000 -66379 -182778 -14691 279357 440661 315173
5762 315173 -97706 -321037 -379160 -274002 -249037 -81252 -235983 -468402 -537525 -511062
5752 -511062 -384460 -393280 -364877 -372872 -720697 -906394 -658215 -447453 -189216 -211592 -68258
5741 -68258 94304 109841 -51145 -169770 -5145 -66392 1072 -64194 10878 -155348 62366
5730 62366 167454 185723 91123 153395 287919 61754 172342 -15126 -69672 -8002 199017
5719A99017j78632j67608L53121P5755q2060j00507l03715j64871O7564J54108
5709a47828L12118K32774j05064j59220k08159M2688J18491j10675k1418n3349
5699i9642J31726Q4913m01347L65720J12946P5971j297q5537l57090j43285N3140
5688b63782j13898K7867J60617J39570k03375j21059N8983J78397L7812J72651
5678G3783P3213O4126J49497N8159j20659o0581j6153p7819j13778K17258J4396
5667B61442j37219k92735j69131j22377J70039J85673N573K54276M33759r0845
5657D98455m11836p0503P8103Q4247P9617P0062l87524q9499j33529m0136J3150
5646c09393K18511J05555J23015J14162K6858m5643k65484k9798J86192j66828
$$ plain form
5719 199017 20385 -147223 205898 281653 199593 99086 -204629 -369500 -301936 -147828
5709 -147828 164290 397064 292000 132780 -75379 -32691 85800 -24875 -46293 -99642
5699 -99642 32084 116997 -284350 81370 194316 270287 268990 183453 -173637 -316922 -263782
5688 -263782 -377680 -349813 -189196 -49626 -253001 -374060 -315077 -136680 -98868 73783
5678 73783 146996 211122 360619 418778 298119 237538 221385 143566 29788 247046 261442
5667 261442 124223 -168512 -337643 -460020 -289981 -104308 -98735 155541 589300 498455
5657 498455 86619 16116 94219 178466 258083 328145 -59379 -148878 -282407 -322543 -309393
5646 -309393 -90882 14673 137688 251850 278708 233065 -32419 -62217 123975 -42853
5636d2853j73975k11426o15K2909p5692R5462L43333K25775J3136j33365j91939
5625a29250j27180J64927j01329O8552K40461k4722k52623J25942J26682k69233
5615a77773j03277J6522l14276j14983j5166K84161M26538J9936k21982J5816
5605a84484M2081K62795j59779k77709J5011j4344O0119K47430k2514p1749O376
5594i6767J93514j02711L5065K32903m30649m41938K14500K19060r359j38670
5584c25052P9084K46428J37676n6009q370r8961L7836J58874o2805o2581L1843
5573G7963p9063R9486j45051n0689J48648j12869q8760M5401J16364j48619M0201
5562i6988k20908j54452J48302L61266j13581J06828J9220k02913N0705r5480
$$ plain form
5636 -42853 -216828 -428254 -428869 -405960 -481652 -386190 -42857 182918 196054 62689 -129250
5625 -129250 -256430 -91503 -192832 -124280 116181 91459 -161164 -35222 91460 -177773
5615 -177773 -281050 -264528 -578804 -693787 -708953 -424792 1746 21682 -200300 -184484
5605 -184484 -142403 120392 -39387 -317096 -302085 -316429 -256310 -8880 -31394 -103143 -96767
5594 -96767 96747 -5964 29101 262004 -168645 -610583 -396083 -177023 -186382 -325052
5584 -325052 -245968 460 138136 82127 73757 -25204 12632 171506 108701 46120 77963
5573 77963 -1100 98386 -46665 -97354 51294 -61575 -150335 -104934 11430 -137189 -96988
5562 -96988 -317896 -472348 -324046 37220 -76361 30467 49687 -153226 -102521 -198001
5552a98001J33908K48402k40827k34054m255k06846L4938J93947O2788K30951
5542B0951J50291l9487k15967j18018J06541K0731r9918j41356K2380j0425K7510
5531b76767J03733j11763m4190R1699J63942J55737k201n2310n9931j93794J51449
$$ plain form
5552 -198001 -64093 184309 -56518 -290572 -294827 -501673 -466735 -272788 -210000 20951
5542 20951 171242 131755 -84212 -202230 -95689 -74958 -174876 -316232 -293852 -304277 -276767
5531 -276767 -173034 -284797 -328987 -237288 -73346 82391 80190 27880 -32051 -225845 -74396
$$ [...]
##END NTUPLES=NMR SPECTRUM
##END=
