##TITLE=Analysis number 327450
Compound Code gk 00199
Book Reference 225059
Project Code qc-fl flro3
Chemist Name jom
##JCAMPDX= 6.0         $$ Bruker NMR JCAMP-DX V2.0
##DATA TYPE= NMR SPECTRUM
##DATA CLASS= NTUPLES
##ORIGIN= Bruker BioSpin GmbH
##OWNER= nmr
$$ XWIN-NMR		Version 3.5
$$ Mon Mar 26 14:46:33 2007 GMT Daylight Time (UT+1h)  MAYBRIDGE\nmr@NMR_250MHZ
##.OBSERVE FREQUENCY= 250.131544655141
##.OBSERVE NUCLEUS= ^1H
##.ACQUISITION MODE= SIMULTANEOUS (DQD)
##.ACQUISITION SCHEME= undefined
##.AVERAGES= 16
##.DIGITISER RES= 18
##SPECTROMETER/DATA SYSTEM= dpx250
##.PULSE SEQUENCE= zg30
##.SOLVENT NAME= DMSO
##.SHIFT REFERENCE= (INTERNAL, DMSO, 0, 16.522)
##AUDIT TRAIL= $$ (NUMBER, WHEN, WHO, WHERE, WHAT)
$$ ##TITLE= Audit trail, XWIN-NMR		Version 3.5
$$ ##JCAMPDX= 5.01
$$ ##ORIGIN= Bruker BioSpin GmbH
$$ ##OWNER= nmr
$$ C:\u/data/dgb/nmr/ADRS/1940/pdata/1/auditp.txt
$$ ##AUDIT TRAIL=  $$ (NUMBER, WHEN, WHO, WHERE, WHAT)
(   1,<2007-03-26 14:46:05.86 +100>,<MAYBRIDGE\nmr>,<NMR_250MHZ>,
      <created by zg, POWCHK disabled, PULCHK disabled
       configuration hash MD5:
       49 4B E0 1D 92 C2 6B 37 9F E6 65 BC 52 41 86 1D
       data hash MD5: 64K
       84 39 AB FB 4A E9 26 20 E8 C9 4F 4C 88 91 3D D6>)
(   2,<2007-03-26 14:46:22.47 +100>,<MAYBRIDGE\nmr>,<NMR_250MHZ>,
      <Start of raw data processing
       ef LB = 0.3 FT_mod = 6 PKNL = 1 SI = 32K 
       data hash MD5: 32K
       B0 58 35 7C D9 47 D3 2B 15 03 07 5B 20 CC D8 0D>)
(   3,<2007-03-26 14:46:24.10 +100>,<MAYBRIDGE\nmr>,<NMR_250MHZ>,
      <apk 
       data hash MD5: 32K
       C6 4B 50 4A 74 0F 38 91 C2 F3 06 DE 74 26 C4 1E>)
(   4,<2007-03-26 14:46:24.93 +100>,<MAYBRIDGE\nmr>,<NMR_250MHZ>,
      <abs ABSG = 5 
       data hash MD5: 32K
       F3 90 D3 AA FE 8F B9 F5 FD 50 76 33 73 6A CF 3A>)
$$ ##END=
$$ 
$$ hash MD5
$$ 87 33 26 2E 29 A8 A7 E9 8F 9A 2F 71 F7 6D 91 22
##$RELAX= 
##$RELAX= 
##$RELAX= 
##$RELAX= 
##$RELAX= 
##$RELAX= 
##$RELAX= 
$$ Bruker specific parameters
$$ --------------------------
##$DU= <C:\u>
##$EXPNO= 1940
##$NAME= <ADRS>
##$PROCNO= 1
##$TYPE= <nmr>
##$USER= <dgb>
##$AMP= (0..31)
100 100 100 100 100 100 100 100 100 100 100 100 100 100 100 100 100 100 
100 100 100 100 100 100 100 100 100 100 100 100 100 100 
##$AQSEQ= 0
##$AQ_mod= 3
##$AUNM= <au_zg>
##$AUTOPOS= <40 >
##$BF1= 250.13
##$BF2= 250.13
##$BF3= 250.13
##$BF4= 250.13
##$BF5= 500.13
##$BF6= 500.13
##$BF7= 500.13
##$BF8= 500.13
##$BYTORDA= 1
##$CFDGTYP= 0
##$CFRGTYP= 5
##$CHEMSTR= <none>
##$CNST= (0..31)
1 1 145 1 1 1 1 1 1 1 1 1 1 1 1 1 1 1 1 1 1 1 1 1 1 1 1 1 1 1 1 1 
##$CPDPRG= <>
##$CPDPRG1= <>
##$CPDPRG2= <>
##$CPDPRG3= <>
##$CPDPRG4= <mlev>
##$CPDPRG5= <mlev>
##$CPDPRG6= <mlev>
##$CPDPRG7= <mlev>
##$CPDPRG8= <mlev>
##$CPDPRGB= <>
##$CPDPRGT= <>
##$D= (0..31)
0 1 0 0 0 0 0 0 0 0.06 0 0 0 0 0 0 0.0002 0 0 0 0 0 0 0 0 0 0 0 0 0 0 
0 
##$DATE= 1174916765
##$DBL= (0..7)
120 120 120 120 120 120 120 120 
##$DBP= (0..7)
150 150 150 150 150 150 150 150 
##$DBP07= 0
##$DBPNAM0= <>
##$DBPNAM1= <>
$$ [...]
##$SUBNAM7= <"">
##$SUBNAM8= <"">
##$SUBNAM9= <"">
##$SW= 20.6930455092707
##$SWIBOX= (0..15)
0 0 3 0 0 0 0 0 0 0 0 0 0 0 0 0 
##$SW_h= 5175.983436853
##$TD= 65536
##$TD0= 1
##$TE= 683.16
##$TE2= 300
##$TE3= 300
##$TEG= 300
##$TL= (0..7)
0 120 120 120 120 120 120 120 
##$TP= (0..7)
150 150 150 150 150 150 150 150 
##$TP07= 0
##$TPNAME0= <>
##$TPNAME1= <>
##$TPNAME2= <>
##$TPNAME3= <>
##$TPNAME4= <>
##$TPNAME5= <>
##$TPNAME6= <>
##$TPNAME7= <>
##$TPOAL= (0..7)
0.5 0.5 0.5 0.5 0.5 0.5 0.5 0.5 
##$TPOFFS= (0..7)
0 0 0 0 0 0 0 0 
##$TUNHIN= 0
##$TUNHOUT= 0
##$TUNXOUT= 0
##$USERA1= <user>
##$USERA2= <user>
##$USERA3= <user>
##$USERA4= <user>
##$USERA5= <user>
##$V9= 5
##$VALIST= <valist>
##$VCLIST= <CCCCCCCCCCCCCCC>
##$VD= 0
##$VDLIST= <DDDDDDDDDDDDDDD>
##$VPLIST= <PPPPPPPPPPPPPPP>
##$VTLIST= <TTTTTTTTTTTTTTT>
##$WBST= 1024
##$WBSW= 4
##$XGAIN= (0..3)
0 0 0 0 
##$XL= 0
##$YL= 0
##$YMAX_a= 319543
##$YMIN_a= -381258
##$ZGOPTNS= <>
##$ZL1= 120
##$ZL2= 120
##$ZL3= 120
##$ZL4= 120
##$ABSF1= 16.522
##$ABSF2= -4.171173
##$ABSG= 5
##$ABSL= 3
##$ALPHA= 0
##$AQORDER= 0
##$ASSFAC= 0
##$ASSFACI= 0
##$ASSFACX= 0
##$ASSWID= 0
##$AUNMP= <proc_1d>
##$AZFE= 0.1
##$AZFW= 0.1
##$BCFW= 0
##$BC_mod= 0
##$BYTORDP= 0
##$COROFFS= 0
##$CY= 12.5
##$DATMOD= 1
##$DC= 0
##$DFILT= <>
##$DTYPP= 0
##$F1P= 14.0000005364418
##$F2P= -0.99999901652339
##$FCOR= 0.5
##$FTSIZE= 32768
##$FT_mod= 6
##$GAMMA= 0
##$GB= 0
##$INTBC= 1
##$INTSCL= 1
##$ISEN= 128
##$LB= 0.3
##$LEV0= 0
##$LPBIN= 0
##$MAXI= 10000
##$MC2= 0
##$MEAN= 0
##$ME_mod= 0
##$MI= 0
##$NCOEF= 0
##$NC_proc= -4
##$NLEV= 6
##$NOISF1= 0
##$NOISF2= 0
##$NSP= 0
##$NTH_PI= 0
##$NZP= 0
##$OFFSET= 16.522
##$PC= 1
##$PHC0= 218.1969
##$PHC1= 7.195402
##$PH_mod= 1
##$PKNL= yes
##$PPARMOD= 0
##$PSCAL= 4
##$PSIGN= 0
##$REVERSE= no
##$SF= 250.13
##$SI= 32768
##$SIGF1= 0
##$SIGF2= 0
##$SINO= 400
##$SIOLD= 32768
##$SREGLST= <1H.DMSO>
##$SSB= 0
##$STSI= 32768
##$STSR= 0
##$SW_p= 5175.98343685301
##$SYMM= 0
##$S_DEV= 0
##$TDeff= 65536
##$TDoff= 0
##$TI= <Analysis number 999999
Compound Code 99
Book Reference 9
Project Code 9>
##$TILT= no
##$TM1= 0
##$TM2= 0
##$TOPLEV= 0
##$USERP1= <user>
##$USERP2= <user>
##$USERP3= <user>
##$USERP4= <user>
##$USERP5= <user>
##$WDW= 1
##$XDIM= 32768
##$YMAX_p= 514352100
##$YMIN_p= -200476
$$ End of Bruker specific parameters
$$ ---------------------------------
##NTUPLES= NMR SPECTRUM
##VAR_NAME=  FREQUENCY,     SPECTRUM/REAL,   SPECTRUM/IMAG
##SYMBOL=    X,             R,               I
##VAR_TYPE=  INDEPENDENT,   DEPENDENT,       DEPENDENT
##VAR_FORM=  AFFN,          ASDF,            ASDF
##VAR_DIM=   32768,         32768,           32768
##UNITS=     HZ,            ARBITRARY UNITS, ARBITRARY UNITS
##FACTOR=    0.157963299565203, 1,           1
##FIRST=     4132.6476996994, 0,             0
##LAST=      -1043.33573715361, 0,           0
##MIN=       -1043.33573715361, -200476,     0
##MAX=       4132.6476996994, 514352100,     0
$$ Real data points
##PAGE= N=1
##DATA TABLE= (X++(R..R)), XYDATA
$$ [...]
15909D21987m1628Q649n564l8636r332q856M6048J2085J9384J3284l2568k8574
15897C56279R149k9812k1853j5164j3165M6600O0418j3371J2833j1344m407o635
15885C69528k3691M2329L0138l4045L3560l9878l6481j9603M3687K0340n981J0593
15873C90496M577k731k049J8911j7413j3593K9771p87j6369N758l404j2430L1197
15860D11934J0378n1135o1864j4160l8629m604M135j4309p556k4216p1966l6529
15848A01479J0255J0191k2123j5076j1563j7044J5783J6176l9930j3776J2404
15837D6776J9412j0337m1170l7140k5040R982L0943M8484j2463k5460k2149K7690
15825I528M4780M9010j4950m4136K1291L0829j4582o6721l2659J6386L6347M4795
$$ plain form
15909 421987 380359 389008 383444 344808 335476 326620 372668 384753 404137 417421 384853 356279
15897 356279 365428 335616 313763 298599 285434 332034 392452 379081 391914 380570 376163 369528
15885 369528 345837 388166 418304 384259 417819 377941 341460 321857 365544 385884 379903 390496
15873 390496 395073 392342 390293 409204 391791 378198 407969 407182 390813 396571 393167 380737 411934
15860 411934 422312 371177 309313 295153 256524 251920 256055 241746 234190 209974 138008 101479
15848 101479 111734 121925 99802 84726 73163 56119 71902 88078 48148 34372 46776
15837 46776 66188 55851 14681 -22459 -47499 -37517 -6574 41910 29447 3987 -18162 9528
15825 9528 54308 103318 88368 44232 65523 96352 81770 15049 -17610 -1224 35123 79918
15813G9918J3344J0418k7573m2716m052L4259K3257j0857l1350j3065J2415R694
15801E3692o0086k592P871L0484K1315m0554k8669N3764P7819K801J2971m594
15789A24222m4390O946K3118J4672L7559L9924k7420k1978k0155l882J070J7430
15777A47116l5507k7738k786K4291l376L4340M2037j0770m4972j1606R246n4792
15765F5483j256j9948P3444m4770j2300J0046J45p223L9472J3505K250j7895j7783
15752H3170k8639q199M2762L919J2345M6613J0698j7958m3497M8111l885p395
15740A38045J2317k1435J120P237J194k5436k869n357k8255J3047K7570l6922
15728H0256K2099K3331m1178m5310J5571j7024J2458J6295j4368j7107P280n450
$$ plain form
15813 79918 93262 103680 76107 33391 29339 63598 86855 75998 44648 31583 43998 53692
15801 53692 -6394 -8986 -1115 29369 50684 10130 -18539 35225 113044 115845 128816 124222
15789 124222 79832 86778 109896 124568 162127 202051 174631 152653 132498 128616 129686 147116
15777 147116 111609 83871 81085 105376 102000 136340 178377 167607 122635 111029 120275 65483
15765 65483 64227 44279 117723 72953 60653 70699 70844 63621 103093 116598 118848 100953 83170
15752 83170 54531 46332 89094 93013 105358 151971 162669 144711 101214 149325 145440 138045
15740 138045 150362 128927 130047 137284 138478 113042 110173 104816 76561 89608 117178 80256
15728 80256 102355 125686 84508 39198 54769 37745 50203 66498 52130 35023 42303 36853
15716C6853l0075N267L9667J6642j5868q970N603J9763r694k888K8615j4290j8498
15703E2127k392Q850J6500l814o6911j9609J5260j9072l6724j571N014r739j239
15690f3320K2917j704K2715K5027M506K2025p161n293K6663K8095K2975R229K5579
15677A32253O625l0931j2659j0643j3342l1180m1514l0978R797K7668n208N0843
15665E0731P3053k4826m3908n2534J3426K4472K1704J5257O665l919j7346k9062
15653C3713L658k404P5797Q2596k6371q696k2114l7987K1471k1823j0383Q889
15641I6346J4395q411R950n8026m6075L2825k6762L1055L2196J0529j6153l7743
15629C4126l26K8506k1993j099j8995l9626M2487n424k2151l1824l6491K1110
$$ plain form
15716 36853 6778 12045 51712 68354 52486 43516 49119 68882 59188 56300 84915 70625 52127
15703 52127 49735 58585 75085 71271 4360 -15249 11 -19061 -55785 -57356 -52342 -62081 -63320
15690 -63320 -40403 -42107 -19392 5635 10141 32166 25005 19712 46375 74470 97445 106674 132253
15677 132253 138878 107947 95288 84645 71303 40123 -1391 -32369 -22572 5096 -112 50731
15665 50731 123784 98958 55050 2516 15942 40414 62118 77375 84040 80121 62775 33713
15653 33713 37371 34967 110764 193360 166989 158293 136179 98192 119663 97840 87457 96346
15641 96346 110741 102330 112280 54254 8179 41004 14242 45297 77493 88022 71869 34126
15629 34126 33800 62306 40313 39214 20219 -19407 23080 17656 -4495 -36319 -72810 -51700
15617e1700M2775J2608l7943j3663K0000R515j3585l723N867J4011J9735M2498
15605D6395J2031j0450j896L4197M683o632l8527j8357k3182o11J2820J7162K5422
15592E3055J0643n150K8241r121l2966k3018l7093k5586j545K5631K6563J0095
15580A9749k2104k4364K5331O1193J2332J2113l2582M753l381r498l2095k1981
15568a0534o129J4579l006n833J9253p718j5260K9534J1743L1492n9762k0614
15556b2255M9847L4843L6997O963R158l9993k5300k2641l4965M487l298J3795
15544G638N125N062k6913Q569K4924N835J3519l0716N3093N8005l1636k7652k8099
15531C6754K0740P866l0342n6767K093L6788P115J9114K7797l4443l2864K5582
$$ plain form
15617 -51700 -8925 3683 -34260 -47923 -27923 -18408 -31993 -35716 -29849 -15838 3897 46395
15605 46395 58426 47976 46080 80277 84960 78328 39801 21444 -1738 -2349 10471 27633 53055
15592 53055 63698 58548 86789 77668 44702 21684 -15409 -40995 -42540 -16909 9654 19749
15580 19749 -2355 -26719 -1388 59805 72137 84250 51668 56421 53040 43542 11447 -10534
15568 -10534 -16663 -2084 -5090 -10923 8330 612 -14648 14886 26629 58121 -1641 -22255
15556 -22255 27592 62435 99432 106395 115553 75560 50260 27619 -7346 -2859 -6157 7638
15544 7638 12763 17825 -9088 -519 24405 30240 43759 13043 66136 124141 92505 64853 36754
15531 36754 57494 65360 35018 -21749 -19656 17132 24247 43361 71158 36715 3851 29433
15519B9433L361j4291j1184q681l523J1871j083k243k2051M643N1596N5836K0185
15506A13869l3738Q688J2064k1872j150o043l887P703j2295k9281J9237k9266
15494B4029l3458l0524J6674L4637K0533P930k7543K0401N5166l2053p8897r829
15482c2934J5000K9163K1084K963L4413N4974J056m2185j5861j7518J1991j4351
15470D7795Q593k7336m8461l5171K4471K9231m7477K6689K6561K2852J1609n204
15458C4152n7583m72K5678L7603M672k1417k1793n169L204O306L2425k9905K846
15445A0547k7523m9491n429K8251K8466K2163Q634j9982o685L9278j2297K0153
15433C6085K3990J9126k752k0439p251j795j2041o0733k5474M9407J1882k2790
$$ plain form
15519 29433 32794 18503 7319 -1362 -4885 6986 5903 3660 -18391 -13748 37848 93684 113869
15506 113869 80131 88819 100883 79011 77861 71818 67931 75634 63339 34058 53295 24029
15494 24029 -9429 -39953 -23279 11358 31891 39821 12278 32679 87845 55792 -23105 -32934
15482 -32934 -17934 11229 32313 35276 69689 124663 125719 83534 67673 50155 62146 47795
15470 47795 56388 29052 -19409 -54580 -30109 -878 -48355 -21666 4895 27747 39356 34152
15458 34152 -23431 -23903 1775 39378 44050 22633 840 -4329 -1125 5181 37606 7701 10547
15445 10547 -16976 -66467 -71896 -43645 -15179 6984 15618 -4364 -11049 28229 15932 36085
15433 36085 60075 79201 76449 56010 48759 46964 34923 -25810 -51284 -1877 10005 -12785
15421a2785l1490J2163N5183P1065n5309k8573J4297K8177J3396L2457O2164M0133
15409B00878M9717L8745l9166Q65N6777L5989M7934J2297P1481O5447L2963J4924
15397E88851J0743M3491R990l802L077k034J7945L1303o0064p3769l2418l2073
15385E01240p2400k5700l7219m9160m1587p2113J4438m0504K0696J9709m7768
15374A69632m7346j06859k0415N0335j8872j3790J0292M4814k0413j5828J0867
15363D2417L0139L1913k9363K1423P709j0978j9271l0862N4647l05l2416l2470
15351C2583O933L0679Q802n284l2388k6814n5061m1946M7818K9746j1385r605
15339b5922K4485M6996L5359m2018k7596L367j931M342k6602j1117J9088j5251
$$ plain form
15421 -12785 -44275 -32112 23071 94136 38827 10254 24551 52728 66124 98581 160745 200878
15409 200878 250595 289340 250174 251039 307816 343805 391739 404036 475517 540964 573927 588851
15397 588851 599594 643085 653075 649273 652350 650316 668261 699564 639500 565731 533313 501240
15385 501240 428840 403140 365921 316761 275174 203061 217499 176995 197691 217400 169632
15374 169632 122286 15427 -4988 45347 26475 12685 22977 67791 47378 31550 42417
15363 42417 72556 104469 75106 96529 104238 93260 73989 43127 97774 97469 65053 32583
15351 32583 39516 70195 78997 73713 41325 14511 -40550 -82496 -34678 -4932 -16317 -25922
15339 -25922 -1437 45559 80918 38900 11304 14671 12740 17082 -9520 -20637 -1549 -16800
15327a6800j9767L3532K524Q694K6560M8030o113J2355j9938n5622n514J5707
15315B3648R093j9409k072K5761L310l7444k6820M0418J6387L6422J7708M303
15303I1305m8564m0104j0119N3432j7389j372p295L0900m3712m4472m50l1264
15291f9104k1202R1218P4697K1947n983k4053m6826k8817J6363j6004l0512K0546
15279a7730J3139m8092R53K9365M4609L6852j6470l110l3795k2490j7134L2486
15267a417M8447l5193J4718K1672k2032L9728k6883k3844k9811j0921J0974J5953
15255A391j5439l3069m3168N612N7834k126N1437J2588J991K8059j5065k7082
15243B2963R890k296l5256J8518J6267N0446N767m7715j3127O584m495J3735J2099
$$ plain form
15327 -16800 -36567 -3035 -511 8183 34743 82773 76660 89015 69077 13455 7941 23648
15315 23648 32741 13332 11260 37021 40331 2887 -23933 16485 32872 69294 87002 91305
15303 91305 42741 2637 -7482 45950 28561 27189 19894 50794 7082 -37390 -37840 -69104
15291 -69104 -90306 912 75609 97556 91573 67520 20694 -8123 8240 -7764 -38276 -17730
15279 -17730 -4591 -52683 -51730 -22365 22244 59096 42626 39516 5721 -16769 -33903 -1417
15267 -1417 47030 11837 26555 48227 26195 65923 39040 15196 -14615 -25536 -14562 1391
15255 1391 -14048 -47117 -90285 -84673 -26839 -28965 22472 35060 37051 65110 50045 22963
15243 22963 32853 30557 -4699 13819 30086 80532 86299 38584 25457 32041 27546 41281 53380
15230E3380n576K4800J2115J1799j7126o3861k0136N4870J0660q964j4126J5214
15218E3049J418j8132J5847k7305j0070J1077J3936q94k2194k4887k1435J7426
15206a2164k255J0513J0657j4102J0517K1284J7742l1799k6806J1165J5890k6664
15194a6022m326K090k3330j7880J4181N1467L9065j0465m81N2161j6320k2741
15182D7399k8808M565J194j964L3658k4532k314l1142q778L603k3641k0921M1361
15169a0320m449M9656K2067P557K999q946m2933J0415j222k5650j9536l065J6811
15156f616M952k289P876L6777M0733k7502l9369j6299J3169K2459J0758M139k0492
15143B8296k312p37m023n9415n4368K0356N6956K1671J7044J8457J0203k492l3091
$$ plain form
15230 53380 47804 72604 84719 96518 79392 15531 -4605 50265 60925 51961 37835 53049
15218 53049 54467 36335 52182 24877 14807 25884 39820 38926 16732 -8155 -29590 -12164
15206 -12164 -14419 -3906 6751 -7351 3166 24450 42192 10393 -16413 -5248 10642 -16022
15194 -16022 -20348 -18258 -41588 -59468 -45287 6180 45245 34780 34299 86460 70140 47399
15182 47399 18591 23156 24350 22386 56044 31512 29198 -1944 -10722 -7119 -30760 -51681 -10320
15169 -10320 -14769 34887 56954 64511 67510 58564 15631 26046 24824 -826 -20362 -23427 -6616
15156 -6616 -1664 -3953 3923 40700 81433 53931 14562 -1737 11432 33891 44649 48788 28296
15143 28296 25984 25247 21224 -38191 -92559 -72203 -15247 6424 23468 41925 52128 49636 16545
15130A6545J395K3653J2774l58P316q16j5853m0580j3804J4095Q263j8723j113
15117g206K7673J1965l3466M083M925K2142L97q765k1427R019J7391k5310k5864
15104b4443L4751M078k929j5917J8439j5751k64m0510p404j1039J3538K8985L8562
15091B0096q374K1794M3170M083r8J9879j8531j703l3050j5795R3277K2217l6601
15078A10364n1789m7294K4987L1904n492j5661J7808q979k0191k6445p692K6701
15066B8221O377K3359J350m8705j7129k2835K4181n2471k4006K5634K7163J0576
15054a8285r912j3856j786k0557J6242k6641k1644P4073N9403P1479k26n9315
15042D8975m2646J2406l7392l5710M3414L6449j5745J8407L0731J6455j4918k9730
$$ plain form
15130 16545 17940 41593 54367 54009 61325 60509 44656 4076 -9728 4367 12630 -6093 -7206
15117 -7206 20467 32432 -1034 3049 7974 30116 30513 21748 321 9340 26731 1421 -24443
15104 -24443 10308 14386 11457 -4460 13979 -1772 -2036 -42546 -49950 -60989 -47451 -18466 20096
15091 20096 11722 33516 76686 80769 80671 100550 82019 80316 47266 31471 124748 146965 110364
15078 110364 58575 11281 36268 68172 62680 47019 64827 55848 35657 9212 1520 28221
15066 28221 34598 57957 59307 10602 -6527 -29362 -5181 -57652 -81658 -56024 -28861 -18285
15054 -18285 -28197 -42053 -43839 -64396 -48154 -74795 -96439 -22366 37037 108516 108290 48975
15042 48975 6329 18735 -18657 -54367 -10953 25496 9751 28158 58889 75344 60426 30696
15030C0696j1643j0921J382J7028L4028l9522k355M1092M3044j6925l5852K2104
15018G2156j069j4455k3732J6542K0342J5236K2107m6437l3735J5855L10p8573
15006c5453L650J2889O1902K6223m0680m5659m025j4865P904K7566L5553J7903
14994E2908k7339P905K2752j381J7605j4523n1278R538N4936O301j7805j9497
14982D0122N58Q309o9090k1160K8158L3285k9788J5676J1611q999P073j5818k3491
14969b3554M233N9021Q007J0378J0393J3734m0582m0257J9560r735j3744k5567
14957b8113k9878Q180J1599J3551O313K697j3193K3695K0647N101n0829j578J9098
14944a2710M4041k3795L8098k9323j0386k5075k345l812J8807M5516j4138j4922
$$ plain form
15030 30696 19053 8132 9514 26542 60570 21048 18693 59785 102829 85904 50052 72156
15018 72156 71087 56632 32900 49442 69784 85020 107127 60690 26955 42810 43120 -35453
15006 -35453 -31803 -18914 42988 69211 28531 -17128 -21153 -36018 -28114 -548 35005 52908
14994 52908 25569 33474 56226 54845 72450 57927 6649 16187 71123 77424 59619 40122
14982 40122 40680 48989 -20101 -41261 -13103 20182 -9606 6070 17681 8682 15755 -63 -23554
14969 -23554 -19321 39700 47707 58085 68478 82212 41630 1373 20933 11198 -2546 -28113
14957 -28113 -57991 -49811 -38212 -24661 -18348 -15651 -28844 -5149 15498 20599 -30230 -31808 -12710
14944 -12710 31331 7536 45634 16311 5925 -19150 -21495 -25307 -6500 39016 24878 9956
14932I956K5966k1820o521l8104n3326L1661K7758M2911K3943m7623K3316Q066
14920B6183m9549j2804J7693l1916K3861L6975K226j8133r623J6703l5433l2006
14908f5823l1017Q767J1286M0682J7966J2676M512K5708j9956k0925k8985j3087
14896e8196K6716J2602o874j4048L2780N4218J1812m0481r283J6235L1492l0270
14884B6703o3362l417J2033J1382l0088M0677M1978J2278L616K6305l5750K3742
14872F6097O392j071l2555n2775j9831j124m357P772J884K3513J9474J720k2514
14859g375j5361k4493j8927K1996J2600J0463p041J7871j778p376L3476J1022
14847B5077k3460J6028P844r218l5842o842k2473j1157M1269k017j9557L9499
$$ plain form
14932 9956 35922 14102 7581 -30523 -83849 -52188 -24430 18481 42424 -5199 18117 26183
14920 26183 -23366 -36170 -18477 -50393 -26532 10443 12669 -5464 -15087 1616 -33817 -65823
14908 -65823 -96840 -88073 -76787 -36105 -18139 -5463 -951 24757 4801 -16124 -45109 -58196
14896 -58196 -31480 -18878 -25752 -39800 -7020 47198 59010 18529 9246 25481 56973 26703
14884 26703 -36659 -40076 -28043 -16661 -46749 -6072 35906 48184 51800 78105 42355 66097
14872 66097 72489 71418 38863 -13912 -33743 -34867 -39224 -31452 -29568 -6055 13419 15139 -7375
14859 -7375 -22736 -47229 -66156 -44160 -31560 -21097 -28138 -10267 -12045 -19421 14055 25077
14847 25077 1617 17645 25489 16271 -19571 -26413 -48886 -60043 -18774 -20791 -40348 -849
14835h49P0179J4814j7317o524K5896j0906k2064o3524l431N5624m981l4832K4515
14822B6600k6046j7674K8039j8741O80J6255k7074J4371L5067l599m5379k5145
14810d2646j8963K6159J396k0605L882k236l7385L603L0896q137j8267k8223L6466
14797g4060L5414L2800L6983j0230j928M2197K0312m1667l0586n0489R041k884
14785c5097q4j2648k0170j3306K9798M4533l2801k5507q282L1794K2723J447J0679
14772f921J0457j452r217l2582l2467J1103J6941K7823M207J148l330j6764k8943
14759e9997l6866K0350l831l75K2405K2043K3160J6081n3380k8267J6558l0247
14747i2366l0902N4415K5250R959K8846K9414L3506j4871l0860k2604j6347K2099
$$ plain form
14835 -849 69330 84144 66827 60303 86199 75293 53229 -10295 -13726 41898 36917 2085 26600
14822 26600 554 -17120 10919 -7822 -7142 9113 -17961 -3590 31477 27878 -17501 -42646
14810 -42646 -61609 -35450 -34054 -54659 -50777 -53013 -90398 -86795 -55899 -64036 -82303 -110526 -74060
14797 -74060 -38646 -5846 31137 20907 18979 61176 81488 39821 9235 -41254 -32213 -35097
14785 -35097 -35181 -47829 -67999 -81305 -51507 -6974 -39775 -65282 -73564 -41770 -19047 -17600 -6921
14772 -6921 3536 2084 -7133 -39715 -72182 -61079 -44138 -16315 -12108 -10960 -14290 -31054 -59997
14759 -59997 -96863 -76513 -80344 -80719 -58314 -36271 -13111 2970 -50410 -78677 -62119 -92366
14747 -92366 -123268 -68853 -43603 -33644 -4798 24616 58122 43251 12391 -10213 -26560 -4461
14735d461k0793l8417N825J9660K5649K8498K3359M3673Q642m3747n9937k0591
14723c2640K1502L382M0083K2558l0511J6887J8743m7114j7213l667l8834l431
14711e0255L3584N2681j1862j1813k603n174k9680K3243L0894l9927r248r583
14699b9743K9928K2911k090J0421M065L0007k6507l4515Q853n960l7054j085L208
14686b7561K7818J9769l0943m699P910r553m113n0152M3156L3403k6564J854K303
14673a7372l5694j0606L1236M5458M1839j9073r8979P39N428n40N8041K7287j996
14660B5768j2276J9156J397o0885l992m0238J031J3763J7964K701J3601r389l2431
14647f3830L2325K8629K1395j007k9017j8668k3245K7435k978j7725j6250K2312
$$ plain form
14735 -4461 -25254 -63671 -57846 -38186 -12537 15961 39320 82993 91635 47888 -12049 -32640
14723 -32640 -11138 -7756 32327 54885 24374 41261 60004 12890 -4323 -7990 -46824 -50255
14711 -50255 -16671 36010 24148 12335 9732 4558 -25122 -1879 29015 -10912 -20160 -29743
14699 -29743 185 23096 21006 31427 35492 65499 38992 4477 13330 7370 -29684 -30769 -27561
14686 -27561 257 20026 -10917 -15616 -7706 -17259 -21372 -71524 -28368 5035 -21529 -19675 -17372
14673 -17372 -53066 -63672 -32436 13022 54861 35788 -63191 -62452 -57024 -57564 477 27764 25768
14660 25768 13492 32648 34045 -26840 -30832 -71070 -70039 -56276 -38312 -35611 -22010 -31399 -63830
14647 -63830 -31505 -2876 18519 17512 -11505 -30173 -53418 -25983 -28961 -46686 -62936 -40624
14635d0624J0517k2046l371L6899K7168j8901k0715L5969J7110j2187j4993k71
14623e445l12Q025k721L664P6625o560m0116m8300j6826K9610k81K9560l1213
14610d290O594L1994m4722J1599J6850J0070J1214N445J0843k7040m2394k0382
14598c4219J2325j5288M649k4327N8385O978m729k9026P971o324L3624K8760l241
14585C5538j1594L0507j3121l5597k3083l1441J5566N6363r373J5234j1973m2562
14573b5536j677N102J8731Q935k5656k849k2695p517n7P956R628P189L5998j1105
14559c553l1074M400n414j2529l0103j5268j917K2078M5347J8095N228J9733p119
14546G904k749m5004m5722L7919L603j7117j5983M4305L2918k0072j0762L1284
$$ plain form
14635 -40624 -30107 -52153 -55524 -18625 8543 -10358 -31073 4896 22006 9819 -5174 -5445
14623 -5445 -5757 2268 -453 3211 79836 73276 33160 -15140 -31966 -2356 -2637 26923 -4290
14610 -4290 2304 34298 -10424 1175 18025 28095 39309 44754 55597 28557 -13837 -34219
14598 -34219 -21894 -37182 -32533 -56860 1525 8503 3774 -25252 -17281 -23605 10019 38779 35538
14585 35538 23944 54451 41330 5733 -17350 -48791 -33225 23138 13765 28999 17026 -25536
14573 -25536 -27213 -22111 -3380 5555 -20101 -22950 -45645 -53162 -53219 -45263 -35635 -28446 7552 -3553
14559 -3553 -34627 -30227 -35641 -48170 -78273 -93541 -95458 -73380 -28033 -9938 -4710 15023 7904
14546 7904 5155 -39849 -85571 -47652 -44049 -61166 -77149 -32844 74 -19998 -30760 524
14534E24n601l4020j4751k017M5037L4574k1294k8967J1923L7642j258m5474l0683
14521e4365M1626N5071K0508p253j8131n3230l6769o362N7236N3895j0522K0930
14509F2634j1360j5622m0480l3817j3549J7111j6681M0965L3447l6768n0786r654
14497g4560O657O0247Q833P612K1762J9741J3175l3526l7062r254o289l181j5495
14484d1340J8402m9928L736N0890K394l6860l0212J6525L9819o146m4817k9061
14472a06598L6184L6858k7731L314K7895K0149J0667J8238L874k0681k7666J5027
14460a0470N4631l4155m7433j1838J7655J3215M7493L5246p466j9512m5716p1918
14448h0268k8556k1574k4701M3774K2328N914L4270K8548J9302m9352q362j131
$$ plain form
14534 524 -5077 -39097 -53848 -55865 -10828 23746 2452 -26515 -14592 23050 21792 -23682 -54365
14521 -54365 -12739 42332 62840 55587 37456 -15774 -52543 -58905 -1669 52226 41704 62634
14509 62634 51274 35652 -4828 -38645 -52194 -35083 -51764 -10799 22648 -14120 -64906 -74560
14497 -74560 -67903 -7656 1177 8789 30551 50292 63467 29941 -7121 -16375 -22664 -25845 -41340
14484 -41340 -22938 -72866 -69130 -18240 -15846 -52706 -82918 -66393 -26574 -32720 -77537 -106598
14472 -106598 -70414 -33556 -61287 -57973 -30078 -9929 738 18976 22850 2169 -25497 -10470
14460 -10470 44161 10006 -37427 -49265 -31610 -18395 29098 64344 56878 37366 -8350 -80268
14448 -80268 -108824 -130398 -155099 -111325 -88997 -83083 -48813 -20265 -963 -50315 -58677 -59808
14436e9808K5558j2913M788M6584J1806l65R054J2356j192m6353L7639m925l1709
14423i480o9915Q376M0607m0589J8294J2765L1291M2105J544M7919p345k6759
14411D8813k7117M136l51n8466M049k2046j2162O9918K9867q05l853N398J8696
14398E6077j3966r554J2426k4264k3253k3348j5724L3051j8685r0154J653M5202
14386g0539J3004K8930J663k7631K7503J0836J3915R49k3492K0804K6139J4616
14374C6697l059N65L4102l1798j03007n1669J4902M5457Q874N641M3349L7031
14362C7085j9215N2388q0651k9870J5001p144l3872K7052K8389m367k1772L0083
14350f893M6476o876j5065l8755R963N019q330l5338K5749j1481k4188O116N0065
$$ plain form
14436 -59808 -34250 -47163 -42375 4209 16015 15650 24704 37060 35868 -10485 27154 22229 -9480
14423 -9480 -79395 -71019 -30412 -71001 -52707 -39942 -8651 33454 34998 82917 75572 48813
14411 48813 21696 25832 25481 -32985 -28936 -50982 -63144 6774 36641 35836 31983 37381 56077
14398 56077 42111 32557 44983 20719 -2534 -25882 -41606 -8555 -27240 -117394 -115741 -70539
14386 -70539 -57535 -28605 -26942 -54573 -27070 -16234 -2319 -1370 -24862 -4058 22081 36697
14374 36697 33638 34203 68305 36507 -66500 -118169 -103267 -57810 -48936 -43295 54 37085
14362 37085 17870 70258 -10393 -40263 -25262 -32406 -66278 -39226 -10837 -15204 -36976 -6893
14350 -6893 39583 32707 17642 -21113 -11150 -6131 -14461 -49799 -24050 -35531 -59719 -53603 -3538
14337c538k516l1492j3143J7094L0334L1621L2600l4811m2637J3290q348l1895
14325d3441l6179k4421J8054J316k4847M7752K7020k3139L6783M4047J6307j4461
14313B4791k9531l9218M3975r26P787P215k3292k3764L852q297M1342J5262j4165
14300E031l1128o663P615l895m0783l3050K7284O2807L629L0195Q663M2167J2812
14287H4684k5733k7053j0833K943j0830l5095Q286N0703m275k5787k2280M100
14275a1170J9963R824R869O064o3944m2773M5561P1823N412n0256j1759j0243
14263b1629o001l6445o926k660M2867L2989j9143j9793k0522K7299N8540j1102
14251A7474k2095n107L2110Q72o8196o3421j6510L3960L0495K1369P243q050n164
$$ plain form
14337 -3538 -6054 -37546 -50689 -33595 -3261 28360 60960 26149 -16488 -3198 -11546 -43441
14325 -43441 -79620 -104041 -85987 -84671 -109518 -61766 -34746 -57885 -21102 22945 39252 24791
14313 24791 -4740 -43958 17 -909 6878 14093 -9199 -32963 -29111 -37408 3934 19196 5031
14300 5031 -26097 -32760 -25145 -29040 -69823 -102873 -75589 -12782 -9153 21042 29705 71872 84684
14287 84684 58951 31898 21065 24008 13178 -21917 -13631 37072 32797 7010 -15270 -11170
14275 -11170 8793 18617 28486 34550 -29394 -72167 -26606 45217 50629 373 -11386 -21629
14263 -21629 -27630 -64075 -71001 -73661 -30794 2195 -16948 -36741 -57263 -29964 28576 17474
14251 17474 -4621 -9728 22382 23254 -44942 -108363 -124873 -90913 -60418 -39049 -31806 -39856 -45020
14238d5020n415L1475N8517q294k6797j5417M5006j1750j1703j6626k8029j6086
14226e0139J4817r412L5126R028l3260j1174M4973M4788O397q196k9864j8428
14214e344J2033L77k0504O557M2951k1120m6395k7442j6581K4930M6816k5827
14202b9549q699K2141J0137K632K7291j5184k0868l9486J195K6108o066J0532
14190a9816j8598M5367J620k5004N510p454k630J771k424N2087k9882j5226R244
14177e435J6718k1330k3388k3286Q086J6683J5637L0304k7640O314L532M618k5787
14164b4974j9682K0002M1868P248k1332M7664j950k0582k485l2894n8240L07J5309
14151d9741J8466k4966O144K0882K891K4847L5363K665m8999j4794J8717k1603
$$ plain form
14238 -45020 -50435 -18960 39557 31263 4466 -10951 34055 22305 10602 -6024 -34053 -50139
14226 -50139 -35322 -44734 -9608 -580 -33840 -45014 -41 44747 51144 42948 13084 -5344
14214 -5344 6689 7066 -13438 -6881 36070 14950 -31445 -58887 -75468 -50538 -3722 -29549
14202 -29549 -38248 -16107 -5970 -3338 23953 8769 -12099 -51585 -50390 -24282 -30348 -19816
14190 -19816 -38414 6953 8573 -16431 -10921 -18375 -21005 -19234 -21658 30429 547 -14679 -5435
14177 -5435 11283 -10047 -33435 -56721 -48635 -31952 -16315 13989 -13651 -7337 -3805 813 -24974
14164 -24974 -44656 -24654 17214 24462 3130 50794 48844 28262 25777 -7117 -65357 -65050 -49741
14151 -49741 -31275 -56241 -50097 -29215 -26324 -1477 33886 36551 -12448 -27242 -8525 -30128
14139c0128k2127J1537p688M1900J2860l6447N0951L2682R928l6672j1826l2958
14127a7988j8809j3169M112M6268J4450k9558j2530j5180K66j495Q499M8342M971
14114A8179j3935J9609M3005M1926K5205l4845l8323j3109N550o535k2868r524
14102A4335n146k2723r00J8768J5597p034k1846J1907k064J875L2973l8002k2632
14089b4892k8097k9771M993M912L3387J4666k7596L6169J1722K0127k295N079
14077A8404l154k5495p7191J1982O5556J3848k0749p0681o151N1902J2375j4043
14065d3397L4508R124k0088n415K0309m3911l9521j0840L2123M5695j344k2825
14053d5582j9134j5476p092M9661J4111l3008m0951L735K7814L1888K26l10P5215
$$ plain form
14139 -30128 -52255 -40718 -48406 -6506 6354 -30093 20858 53540 63468 26796 14970 -17988
14127 -17988 -36797 -49966 -45854 414 14864 -14694 -27224 -42404 -42138 -43633 -35134 13208 18179
14114 18179 4244 23853 66858 108784 133989 99144 60821 47712 53262 46727 23859 14335
14102 14335 9189 -13534 -14434 4334 19931 12897 -8949 2958 894 2769 35742 -2260 -24892
14089 -24892 -52989 -82760 -77767 -72855 -39468 -24802 -52398 -16229 -4507 15620 13325 18404
14077 18404 15250 -10245 -87436 -75454 -9898 3950 -16799 -87480 -93631 -41729 -29354 -43397
14065 -43397 -8889 235 -19853 -25268 -4959 -48870 -88391 -99231 -67108 -21413 -22757 -45582
14053 -45582 -64716 -80192 -87284 -37623 -23512 -56520 -97471 -93736 -65922 -34034 -33808 -34118 41097
14040D1097Q549k7772K2815k6840l289K3318j26L6028L0643k3540k9367l1543
14028A9973l9518l9974L3324L7000m891j0074q484K4273M5900l3423k4558K3363
14016B2911L6061J4731m9096o725j995m4855K2562J0433m2607K1065J0666j0551
14004a7400k8877k0494L4021P24l2012k5837J3147J037O807k08P1335K5675k2872
13991E046r900K096M4320O674k3812k9853m1875j1697k9914k2570L1838M9178
13979c0469K2277J7673p67j4942o196l1166n7414K9540J9458q973Q004M4792J293
13966f890k929r020p8660J3524O7854L4384j9109k1697l1938k3616L4506K1528
13954b2063J8121j0626l678P1262m1757j9750K7896k9569k0392J0787M1138m2496
$$ plain form
14040 41097 49646 21874 44689 17849 14560 37878 37752 73780 104423 80883 51516 19973
14028 19973 -19545 -59519 -26195 10805 5914 -4160 -12644 11629 57529 24106 -452 22911
14016 22911 58972 73703 24607 17882 15887 -28968 -6406 4027 -38580 -17515 -6849 -17400
14004 -17400 -46277 -66771 -32750 -32026 -64038 -89875 -76728 -75691 -68884 -69092 2243 27918 5046
13991 5046 -4854 -2758 41562 48236 24424 -5429 -47304 -59001 -88915 -111485 -79647 -30469
13979 -30469 -8192 9481 8714 -6228 -12424 -43590 -101004 -71464 -52006 -60979 -52975 -8183 -6890
13966 -6890 -9819 -18839 -97499 -83975 -16121 18263 -846 -22543 -54481 -78097 -43591 -22063
13954 -22063 -3942 -14568 -18246 53016 11259 -8491 19405 -10164 -30556 -19769 21369 -21127
13942b1127k2993k7650m788J0383J0963j9645K7068N2452J9221j8583l8902J1371
13930b2230L3951k5607l3048M1440K4149r561J5051J667n8592p4114l8273L6638
13918a08529M9175j9516j54N9037k5782k5386J8210L8157K1950j4474k7635P846
13906b7101M5688j1348n5048J964J1741L7010L8761l5342K543N3242J2377m742
13894F9745L6667J2403n7250k3019k5523L0676L6832O0805Q3246L7642Q4601R4649
13882D41474J02538J21710q945p9298j26193j00048j06988l7599m1205n5633p4599
13871C5214l435n122j6914L9604K1660j7483R794K2737L2236K0399j6681l46K1152
13858A42815J1893J5186O733N5815Q2891J44805J26907K2997n968j03791j53763
$$ plain form
13942 -21127 -44120 -71770 -76558 -66175 -55212 -74857 -47789 4663 23884 5301 -33601 -22230
13930 -22230 11721 -13886 -46934 -5494 18655 9094 24145 25812 -32780 -106894 -145167 -108529
13918 -108529 -59354 -78870 -79024 -19987 -45769 -71155 -52945 -14788 7162 -7312 -34947 -27101
13906 -27101 18587 7239 -47809 -45845 -34104 2906 41667 6325 8868 62110 74487 69745
13894 69745 106412 118815 61565 38546 13023 43699 80531 141336 224582 262224 346825 441474
13882 441474 544012 665722 656777 577479 451286 351238 244250 206651 165446 109813 35214
13871 35214 31779 26657 9743 49347 71007 53524 63318 86055 118291 138690 122009 121663 142815
13858 142815 154708 169894 176627 232442 315333 460138 587045 610042 604074 500283 346520
13847C46520j43688p5321r0335o054J1447k0385k9596J6525P804l5657M217M4871
13835C0348l4952k3748j8992j8885K8107N666L5491J7972J9454L65j0269K436
13823C2993k0462J3605l1048j1941m7037N592J8818K7051J6588L9665l9819n0156
13811d6151M2753j5598n3765k1135K1678J0374k1205j027J7134L1818L5570L066
13799C512k6708j6979j2381k4443L6248K5587R716L373J9533j6820n9534o6377
13787a25273l384J00148o084j3687J699J0752M9072L7589o4478L6159l203k4003
13775d693j5347k6697L6900k571j2570k1879K0470j0312P426N209k130o818k508
13762c5520N099j1141K77J3285J3635l8522J0730L4661M0727L3679m1399k3568
$$ plain form
13847 346520 202832 127511 37176 31122 42569 22184 -7412 9113 16917 -18740 -14523 30348
13835 30348 -4604 -28352 -47344 -66229 -38122 -32456 3035 21007 40461 40826 30557 32993
13823 32993 12531 26136 -4912 -16853 -63890 -58298 -39480 -12429 4159 43824 4005 -46151
13811 -46151 -3398 -18996 -72761 -93896 -72218 -61844 -83049 -84076 -66942 -35124 446 3512
13799 3512 -23196 -40175 -52556 -76999 -40751 -15164 -5448 -2075 17458 638 -58896 -125273
13787 -125273 -128657 -28509 -34593 -48280 -46581 -35829 13243 50832 -13646 22513 19310 -4693
13775 -4693 -20040 -46737 -9837 -12408 -24978 -46857 -26387 -36699 -29273 -24064 -26194 -33012 -35520
13762 -35520 -30421 -41562 -41285 -28000 -14365 -52887 -42157 -7496 33231 66910 25511 1943
13750A943k6324J0279K34l8692K7516N8792L0429J1347m1822k9916m589K1160
13738B0357N4332k305l3704O780j7967p568p1028l7553p24O5525O890Q967R822
13725A824m3143j3793O078j4440l285J4748k2537J7030J1015L0816j2538n5762
13713h3987J7728L4695L5868J2036L2935K3286n9038k2779m9029L9737L4512J5423
13701C1387j5128N21K2n5474j0044j7404l9018N0317K8402L456n3428M4903K5671
13688e817L9491K3099j7292o076k1099M694O7287P5430n9586l3546M843p0325
13676A103l9624R313M984r536m539K5011L1686R669l3579J8266j3426K3076J1968
13663C4372L9458J6732J6446q847r882k0493k1956j1263Q228q225P87J0418j520
$$ plain form
13750 1943 -24381 -14102 -13868 -52560 -25044 33748 64177 75524 33702 3786 -803 20357
13738 20357 74689 72384 38680 45460 27493 19925 -51103 -88656 -89380 -23855 -16965 -7998 1824
13725 1824 -41319 -55112 -49034 -63474 -66759 -52011 -74548 -57518 -46503 -15687 -28225 -83987
13713 -83987 -66259 -31564 4304 16340 49275 72561 13523 -9256 -58285 -18548 15964 31387
13701 31387 16259 16780 16802 -38672 -48716 -66120 -105138 -54821 -26419 -22963 -76391 -31488 -5817
13688 -5817 33674 56773 39481 33405 12306 17000 84287 159717 100131 66585 71428 1103
13676 1103 -38521 -29208 -24224 -33760 -38299 -13288 18398 28067 -5512 12754 -672 22404 34372
13663 34372 73830 90562 107008 98161 88279 67786 45830 34567 42795 34570 35357 45775 44255
13650D4255m233J3646k4937K3154J2397m5541n5409k975P226P674K0979j1398
13638a5162l842j0766l6922K4608P682k7280J440L9531L2624L2282P37J4110J5771
13625G4813m9602J337L4611l7L2945J8459j4432m7010p8455O238M700m1702J2292
13612d5843L0091K7747j6923M1168J9503j1804k7237o9185j4634j7183L7332L8887
13600h081k6383k6499N2715J5462l9855j5562n505j9298n042o456l691O3241L3745
13587H791J6820j9814R52L7803M594m2095j6370J2953l5080l1716M0233M1423
13575A8494J3562j0098l2359j9937N111O2762Q453p386k1830k9751j1058l3019
13563e7056j214Q4273K2799p954J9763O69j3594k9460q276p863k4871L2128q626
$$ plain form
13650 44255 40022 53668 28731 51885 64282 18741 -36668 -39643 -32417 -24743 -3764 -15162
13638 -15162 -19004 -29770 -66692 -42084 -34402 -61682 -60242 -20711 11913 44195 44932 59042 74813
13625 74813 25211 26548 61159 61122 94067 112526 98094 51084 -27371 -21133 -16433 -58135 -45843
13612 -45843 -15752 11995 -4928 36240 55743 43939 16702 -52483 -67117 -84300 -46968 -8081
13600 -8081 -34464 -60963 -8248 7214 -32641 -48203 -53708 -73006 -78048 -84504 -88195 -24954 8791
13587 8791 25611 5797 6749 44552 49146 7051 -9319 3634 -31446 -63162 -22929 18494
13575 18494 32056 21958 -10401 -30338 -25227 37535 45988 38602 16772 -12979 -24037 -57056
13563 -57056 -58270 26003 48802 40848 60611 61280 47686 18226 9950 2087 -22784 9344 718
13550G18k782K8994L5104m011K12J4115K9042l9449m4358J2640K6977m2621M9764
13537F4345k356k2714K6927K3960m5831k2054O628l3878J2823K3312J6496j659
13525D5999r6503L932N1744k5924n774K1314k0708M993O885j0111k3159p641J0176
13512d4777L5256J8142k1499k9792N0718o879L6390L317k1629k8704Q023J8438
13500A7004L285m7634j3377J7073K5385k6822j3583M3014N929l2840j6397q790
13488d7753l5272j2049J5582K0972K6689L1300K8127n0613m3016L4499M1955J5810
13476B6231K1229J6196J3084l352k7425r29J9424r353J2651m6515j3489N388l8266
13463b5126Q106k3461K9219M8177L671J673j4548l9227l6728J1133j0569k5587
$$ plain form
13550 718 -2064 26930 62034 58023 58235 72350 101392 61943 17585 30225 57202 14581 64345
13537 64345 61989 39275 66202 90162 44331 22277 28905 -4973 7850 31162 47658 45999
13525 45999 -50504 -46572 5172 -20752 -26526 -5212 -25920 -20927 -14042 -24153 -47312 -54953 -44777
13512 -44777 -9521 8621 -12878 -42670 8048 1169 37559 40876 19247 -9457 -1434 17004
13500 17004 20289 -27345 -40722 -23649 1736 -25086 -38669 4345 10274 -22566 -38963 -47753
13488 -47753 -83025 -95074 -79492 -58520 -31831 -531 27596 -23017 -66033 -31534 10421 26231
13476 26231 47460 63656 76740 73388 45963 45034 64458 55105 67756 21241 7752 13140 -25126
13463 -25126 -17020 -40481 -11262 36915 40586 42259 27711 -11516 -48244 -37111 -47680 -73267
13451g3267M4918o80j9094j3490P110L6799m0595j3120M9642K4180o648J9930
13439A5685K7655n1959l7641o202J341J4740j349l9138M2268J1156J5796J4831
13427G183k0599k7043k886k9676M2708J5637p587L5102N6361M370m6953k3245
13415C372l566k1688p3246j7748M2484M4849m48J7115m2424p224L0714O505j0422
13402c1727l9452j0213j3887M0724N4289l007K409j1812K0296r350Q403K0439
13390B7112J6758j7940m833Q585K1092K7400m2275j043J3549k4464J5115O597
13378D5653l3723n9676m185J6516J2135J8505P501q352K0098K1926l5438k2703
13366b1743n4524L995N2543O7135K1423O235k3494m5141k6884J6421n691K5906
$$ plain form
13451 -73267 -28349 -29029 -48123 -61613 -54503 -17704 -58299 -71419 -21777 2403 -4245 15685
13439 15685 43340 -8619 -46260 -52462 -51121 -36381 -37730 -76868 -34600 -23444 -7648 7183
13427 7183 -13416 -40459 -43345 -73021 -30313 -14676 -22263 12839 69200 73570 26617 3372
13415 3372 -194 -21882 -95128 -112876 -70392 -25543 -25991 -8876 -51300 -58524 -27810 -21305 -31727
13402 -31727 -71179 -81392 -95279 -54555 -266 -3273 -864 -12676 7620 -1730 6673 27112
13390 27112 43870 25930 21097 29682 50774 78174 35899 34856 48405 23941 39056 45653
13378 45653 11930 -47746 -51931 -35415 -23280 -4775 2726 -5626 14472 36398 960 -21743
13366 -21743 -76267 -72272 -19729 47406 68829 75064 51570 6429 -20455 -4034 -9725 16181
13354A6181j7978K82j5861j0296O978N1278j494l1451o5826r841N4014k7838m2070
13341i3922M1135J6197n2257M441M3474K147K1616K5774o416L5265l782m2686
13329i014k4779P669J66K5733L9186k0775l0121q146J7007K6711k1438j3141l9606
13316e0548j4893K3088j5156L9489J2350j1424O184Q11k058q067k5093m3622K0642
13303f8297J2023M7895O871m5665K9356O2053J6442l9857j1794K3109j4273L2000
13291D9863l3648l5192k7883L8789K0380r962K939m6450J4008p061k913J4386
13279b2744N4641p165n7476j4954m0277L1400l058j2139L3749J0288l714k0272
13267e1721K7701J5867j067o572k3897j721P563K4285L0155K6229J2461m402l6146
$$ plain form
13354 16181 -1797 -1515 -17376 -27672 -20694 30584 29090 -2361 -68187 -78028 -24014 -51852 -93922
13341 -93922 -52787 -36590 -88847 -84406 -40932 -38785 -17169 8605 2189 37454 33672 -9014
13329 -9014 -33793 -26124 -25958 -225 38961 18186 -11935 -20081 -3074 23637 2199 -10942 -50548
13316 -50548 -65441 -42353 -57509 -18020 -5670 -17094 -10910 -10099 -12157 -20224 -45317 -88939 -68297
13303 -68297 -56274 -8379 -1508 -47173 -17817 44236 60678 20821 9027 32136 17863 49863
13291 49863 16215 -18977 -46860 -8071 12309 2347 5286 -41164 -27156 -34217 -37130 -22744
13279 -22744 31897 24732 -32744 -47698 -87975 -56575 -59633 -71772 -38023 -27735 -31449 -51721
13267 -51721 -24020 -8153 -9220 -15792 -39689 -41410 -33847 -9562 20593 46822 59283 54881 18735
13254A8735K8410M9526Q349m2363m5873j4152m2899L0245j6509j6040j1528N509
13242d8590K479j7966k8788K7018L3753L0341M8787J5342j8786j2964k8821k4979
13230b3174j6126P419L0739p012L5270K0407n7126o9665J0330M3954k6462j9984
13218g1430O665l2811k1605J3248M7388J1129L997J7804J3416p771R940K5814
13206A5784k7162l9542L700J0519q046j7828j7614J6088J3493N8934M170M522
13194A7018m1813j095K129L9648n331Q282K986j0133M5122j0373k7903l0662K0396
13181H271p978N142J5198j9400J3848j9167l9598J5795m569N3179K7762p355k214
13168C8914Q003l7217J9586K2823l4986J878k3858l2615j7891K8532M0069N8419
$$ plain form
13254 18735 47145 96671 105020 62657 16784 2632 -40267 -10022 -26531 -42571 -54099 -48590
13242 -48590 -46111 -64077 -92865 -65847 -32094 -1753 47034 62376 43590 30626 1805 -23174
13230 -23174 -39300 -31881 -1142 -8154 27116 47523 -9603 -79268 -68938 -24984 -51446 -71430
13218 -71430 -64765 -97576 -119181 -105933 -58545 -47416 -43419 -25615 -12199 -19970 -10030 15784
13206 15784 -11378 -50920 -47220 -36701 -44747 -62575 -80189 -64101 -50608 8326 12496 17018
13194 17018 -24795 -25890 -23761 15887 10556 18838 21824 11691 56813 46440 18537 -12125 8271
13181 8271 293 5435 20633 1233 15081 -4086 -43684 -27889 -32458 20721 48483 41128 38914
13168 38914 46917 9700 29286 52109 17123 19001 -4857 -37472 -55363 -26831 13238 71657
13156G1657k8125P140O671n2490k9309r64k5017P21M3675K6405l1599k2892M0309
13143F182P762k0662J3160k250K0816k9665k1583O046K570k0341J389k2478k3974
13130h3028L0194N3829j1124R52r860K0098L1629K533m291J4394j6665J8238k5314
13117B1585n4100j9911n164J8720K3723j1673r083J004j252N1260Q021o0080L5369
13104a581K7525l6722j2587q712R515N2101j6670q6947O1244L4689m083j9819
13092b047J0739Q776j9671J4482l5751M350M0885J6352k1622l00l6790k0148L6563
13079d182n665J1046j0297J9719r669j8783L4763k5055L6814L8609k8303k5913
13067A3084o497J3361n037m9882m220l6956L8657L3883j0054r19N4910k0597k7664
$$ plain form
13156 71657 43532 50672 57343 4853 -24456 -25420 -50437 -49716 -6041 20364 -11235 -34127 6182
13143 6182 13944 -6718 6442 4192 25008 -4657 -26240 -20194 -17624 -37965 -36576 -59054 -83028
13130 -83028 -52834 995 -10129 -9177 -19037 1061 32690 35223 30932 45326 28661 46899 21585
13117 21585 -32515 -52426 -57590 -38870 -15147 -26820 -35903 -34899 -36151 15109 23130 -36950 -1581
13104 -1581 25944 -10778 -23365 -32077 -22562 29539 12869 -74078 -12834 21855 17772 -2047
13092 -2047 8692 17468 -2203 12279 -23472 -19122 21763 38115 16493 16193 -20597 -40745 -4182
13079 -4182 -9847 1199 -9098 10621 952 -17831 16932 -8123 28691 67300 38997 13084
13067 13084 6587 19948 14911 -34971 -39191 -76147 -37490 -3607 -13661 -14580 40330 19733 -7931
13054g931m650M446O213n034K511J3179m500j2219j79J1760Q757l3527k4997O846
13040c9325L4456K0100m8451k6676P462j2686M8113N745m6267J7700P9936J8596
13028E8703k8644l1235m8148m7666K3350R834O768k667K9581K2601L855m636N0043
13015D1739K5818J1630l6420n4121q477K5774K5221J6482q046m4447n449M8684
13003C8388J5530l4880J1296m466m972l7002J8911O4906o0714o527k523O849M5299
12990E0095k7897k7064J9578j5952j6396m1287j1718l455l1976L3040J4599N7134
12978a299O371L8618o238p535J267L2282L5520J8246l6493o6734o0742P187J1731
12965b7819J1718J5281n7112j0132O1298q251j8134j9562j4730k2695O6393N0587
$$ plain form
13054 -7931 -12581 -8135 -1922 -6956 -4445 8734 4234 -7985 -8164 3596 12353 -21174 -46171 -39325
13040 -39325 -4869 15231 -33220 -59896 -52434 -65120 -17007 -11262 -57529 -39829 40107 58703
13028 58703 30059 -1176 -49324 -96990 -73640 -63806 -57038 -59705 -30124 -7523 -3668 -8304 41739
13015 41739 67557 79187 42767 -11354 -19831 5943 31164 47646 39600 -4847 -10296 38388
13003 38388 53918 19038 30334 25868 20896 -16106 2805 67711 6997 470 -2053 4796 50095
12990 50095 22198 -4866 14712 -1240 -17636 -58923 -70641 -74096 -106072 -73032 -58433 -1299
12978 -1299 5072 43690 37452 29917 31184 63466 98986 117232 80739 14005 -46737 -39550 -27819
12965 -27819 -16101 -820 -57932 -68064 -6766 -15017 -33151 -52713 -67443 -90138 -23745 26842
12953B6842m0535k1423j8114j3331l155J7686J8627J4339L0442n830J4222K9552
12941D9322l2512k1437J7801M324K3565N746p411l5280l8586j1959L8144L50k5396
12928c3329r367O1048l7254p6507L5073Q3725m8176J0453n1731l0085L2384L3239
12916c0527O0392J4978l3293l8047K870J8607L6265N0786j5918Q90N630k4861
12904D7772J0410l1675k4276l9059j369J1605M0796q217m5085k5777L8477N2096
12892B5698O2432J7238k235l2730n0368j3007J626m0741K3975k1284m1510j4050
12880h4956J0456M2508J0951J8325K3168m7815n1408O543L2312J2959j1303J9486
12868a8774L9129k4828o268n153j5366m0719M8412O3712l2529r31J5393j913p1186
$$ plain form
12953 26842 -13693 -35116 -53230 -66561 -69716 -52030 -33403 -19064 11378 5548 19770 49322
12941 49322 16810 -4627 13174 17498 41063 46809 39398 4118 -34468 -46427 -8283 -7933 -33329
12928 -33329 -42696 18352 -18902 -95409 -60336 23389 -24787 -14334 -66065 -96150 -63766 -30527
12916 -30527 29865 44843 11550 -26497 -23627 -5020 31245 82031 66113 67003 72633 47772
12904 47772 58182 26507 2231 -36828 -38197 -26592 14204 5987 -39098 -64875 -26398 25698
12892 25698 88130 105368 103133 70403 20035 7028 8654 -32087 -8112 -29396 -70906 -84956
12880 -84956 -74500 -31992 -21041 -2716 20452 -27363 -78771 -72228 -39916 -26957 -38260 -18774
12868 -18774 20355 -4473 -10741 -15894 -31260 -71979 -23567 40145 7616 6685 22078 20165 -51021
12855e1021M831k3945N0118L1756m2469J697J4955l7107l9650l8392J8702Q7369
12843b3156J4183l7856m9852J897K7777j5023J011K9372J8048L2170K8581J7777
12831D4929k6601m6063q5966l3564q150J081m73N4633P3434N019J1450n43o337
12818a7151l2969l8829J1222O0885K819j349K951M968J2130K5250m5500r6976
12806a12549M563L6246J9742N5012l0891o1575M875J4724l62j1087K0330N2442
12794h530P8812L2313n9441J722j4129m1866j5186K2564k4610m2102L0939M2529
12782C015L545l2462j8007j369L4224J933l8329j5418J1510k7332M120M1131L4200
12769G61J2852j2028j4233j7630j6100k4350k691o365L5787M284j5249n838L681
$$ plain form
12855 -51021 -46190 -70135 -20017 11739 -30730 -29033 -14078 -51185 -90835 -129227 -110525 -23156
12843 -23156 -8973 -46829 -96681 -94784 -67007 -82030 -81019 -51647 -33599 -1429 27152 44929
12831 44929 18328 -27735 -113701 -147265 -155415 -154334 -154807 -100174 -26740 -21721 -10271 -10814 -17151
12818 -17151 -50120 -88949 -77727 -16842 -14023 -15372 -12421 -7453 4677 29927 -15573 -112549
12806 -112549 -107986 -71740 -51998 3014 -27877 -89452 -84577 -69853 -70215 -81302 -60972 -8530
12794 -8530 70282 102595 43154 44876 30747 -11119 -26305 -3741 -28351 -70453 -39514 3015
12782 3015 6560 -25902 -43909 -45278 -11054 -9121 -47450 -62868 -51358 -78690 -74570 -33439 761
12769 761 13613 1585 -12648 -30278 -46378 -70728 -73419 -79784 -43997 -39713 -54962 -60800 -57119
12756e7119M1665L6496R270k2436n1766l4832J8687J705l6940j1678M9728J4130
12744d3090J6897K743o4812m8576l835M2670Q3633M0207K6569n9825l1287L4893
12732c813N2003k7023k5118O352L5550O7453k6400m8482m3399j8890p06L1723
12720g50R986P783m5655j7615L2790l515J3289J8896q232k3606n302N0140K7907
12707E6116n5624l6330p988K9415K0363n417K479k7745O3360J1695J0387j9181
12695D1530j1788k1509j694j924q57l1151j8335k6562N7085M6617J6588n0220
12683b220p9695j382m765k0368K3336M580r962M4681K5861P2091m993k8599L451
12670B2016j8440o1032k8628J6973O3136N5430j8014K6577k9553j597J7345n79
$$ plain form
12756 -57119 -15454 21042 30312 7876 -43890 -78722 -60035 -58330 -95270 -106948 -57220 -43090
12744 -43090 -26193 -23450 -88262 -136838 -140673 -98003 -14370 25837 52406 -7419 -38706 -3813
12732 -3813 48190 21167 -3951 2401 37951 105404 79004 30522 -12877 -31767 -32473 -750
12720 -750 9236 17019 -28636 -46251 -13461 -16976 -3687 15209 6977 -16629 -21931 28209 56116
12707 56116 492 -35838 -43826 -14411 5952 535 3014 -24731 38629 50324 60711 41530
12695 41530 29742 8233 6539 4615 3758 -27393 -45728 -72290 -15205 31412 48000 -2220
12683 -2220 -81915 -83297 -88062 -108430 -85094 -80514 -90476 -45795 -19934 52157 47164 18565 22016
12670 22016 3576 -57456 -86084 -69111 -5975 49455 31441 58018 28465 26868 44213 43634
12658D3634j7930j6107o3693N9004J8677M055j7928r135l09J8657K4692p624k9877
12645F116Q779J4445o610l082L9867K6360j4820j4720l7231k3592M4485n41k7651
12632A1805P73O8496L796l5510J55J3455P386J8711k7861k554k0915J4072q421
12619D3388n8530o9047k0198l233l7081N2471L2727P0629L4810l185m3914j1390
12607a2553J6778M8827j622n0939R44K4970J0189k3728L5992n09j3909K7342j3068
12594D8714k8900k4142p892K4887j6516J5333J1677N5059J3757m3417l9408J3593
12582B2745N0010k7410o6217K0833o000l5538j2464n2655L2265K2583O1205K9455
12570C8812K5556J8507j9115j0900K171J3524n456n191j8545j0674K1352J9541
$$ plain form
12658 43634 25704 9597 -54096 4908 23585 27640 9712 577 268 18925 43617 35993 6116
12645 6116 14895 29340 22730 19648 59515 85875 71055 56335 19104 -4488 39997 39456 11805
12632 11805 12578 81074 84870 49360 49515 62970 70356 89067 61206 58652 37737 51809 43388
12619 43388 -15142 -84189 -104387 -107620 -144701 -92230 -59503 11126 45936 42751 -1163 -12553
12607 -12553 4225 53052 51430 491 1435 26405 36594 12866 48858 48349 34440 61782 48714
12594 48714 19814 -4328 -12220 12667 -3849 11484 23161 78220 91977 48560 9152 22745
12582 22745 72755 45345 -20872 -39 -6039 -41577 -54041 -106696 -74431 -51848 9357 38812
12570 38812 64368 82875 63760 52860 55031 68555 63099 57908 39363 28689 50041 69582
12558F9582K2487M9003j1667l9103M3546N6601k1865l6576J6758r409k5545k181
12546A11631K7513M1189j1545k3921m404o1953o9863L492J4684J8568j4921j6679
12534A3791K0099J0543J2045k7232O945K0126O623j1818m7291n0524j4205K4548
12522c6350M6372L4652M2356j2169l8377P240J5467J9532O3317L066J7250L3491
12510A95847K5556l366l1502j4054l8956j9076L150j3436l7300j6017l8415M3540
12498E5971L1267l8032k0857J8025R520j3623J1216q69j6146J3329L6261P951
12486I4013l4973P817j9155l3953N1017N8046J4251K4099r070k1636j472k993
12474A25991J1147r539k1941k276n631J2552L089o928n1712m7633j5606L1236
$$ plain form
12558 69582 92069 141072 129405 90302 133848 190449 168584 132008 148766 139357 113812 111631
12546 111631 139144 180333 168788 144867 140463 78510 8647 12139 26823 45391 30470 13791
12534 13791 33890 44433 56478 29246 36191 56317 62940 51122 3831 -46693 -60898 -36350
12522 -36350 10022 44674 87030 74861 36484 43724 59191 78723 142040 145106 162356 195847
12510 195847 221403 218037 186535 172481 133525 114449 117599 104163 66863 50846 12431 55971
12498 55971 87238 49206 28349 46374 55894 42271 53487 52618 36472 49801 86062 94013
12486 94013 59040 66857 47702 13749 64766 122812 137063 161162 152092 130456 128984 125991
12474 125991 137138 127599 105658 103382 97751 110303 113392 106464 54752 7119 -8487 22749
12462B2749N279O0828J1388n7178m2700p699L7382r05j6939k8990j686L645j9642
12449c4468K5957k4911k3456N7330N1370K6940K5337l204M636L7219N2671j2590
12437A82831m0525j7826k9882l7470k8665k884N4519J4317m3897o7147l2731N149
12425d4211J6324P6981J1833l4795j9582l2447J1124L0819o477J6324K2381k8223
12413B0051j6217P26k3286L7934L6322O884L90j1038k1694o398l4945O088K0763
12400A5580J5129K7540k4742k5029J8196K900L4304j5657o8092k2137L7715J3996
12388I703l7774l0593m3853J8473Q131J3653M4537J3801Q333N1697K4651m5256
12376C5503m6911m9843j5377P0105Q856J9848P608M326M2787m040k0503k4832
$$ plain form
12462 22749 28028 88856 100244 43066 366 -7333 30049 29144 12205 -16785 -18471 -14826 -34468
12449 -34468 -8511 -33422 -56878 452 51822 78762 104099 100895 105531 142750 195421 182831
12437 182831 142306 124480 94598 57128 28463 25579 80098 94415 50518 -16629 -49360 -44211
12425 -44211 -27887 49094 60927 26132 6550 -25897 -14773 16046 9569 25893 48274 20051
12413 20051 3834 4560 -18726 19208 55530 62414 62804 51766 30072 23674 -11271 -5183 15580
12400 15580 30709 58249 33507 8478 26674 29574 63878 48221 -19871 -42008 -4293 9703
12388 9703 -28071 -58664 -102517 -84044 -75913 -62260 -17723 -3922 4411 56108 80759 35503
12376 35503 -11408 -61251 -76628 -6523 2333 22181 29789 34115 76902 72862 52359 27527
12364B7527j2344O875J6855K9854k6766J7318j1440j6453j2751p0145k4064N654
12352f9880J3871J7606M5991l682m9669J8547K7081L5661L6405L3171n646k3938
12340G5518o8650k9059k548J1303L1286k5993j7850j9043O205J5384J3484N619
12328d344l3421o9982O592J0950j7050m537K9516M3562M1485k7014m3970M6893
12316b1320J948p459j5587j8525k8517L0604K8636N7952K4607l8211Q674R534
12304C2336j2274l5935O4956J3994o7914J9257J5656j9837j6728J1835m793j3408
12292a2855j4065l6951k50l873J5512J4101J4364J6045J761r778K4730j3767l3108
12279c8134L0954j5931J7123r519j2928o003L3383J934k4434k9187R989M8432
$$ plain form
12364 27527 15183 22058 38913 68767 42001 59319 47879 31426 18675 -51470 -75534 -69880
12352 -69880 -56009 -38403 7588 3906 -45763 -27216 -135 35526 71931 105102 99456 75518
12340 75518 6868 -22191 -24739 -13436 17850 -8143 -25993 -45036 -38831 -23447 -9963 -4344
12328 -4344 -37765 -107747 -101155 -90205 -107255 -111792 -82276 -38714 2771 -24243 -68213 -21320
12316 -21320 -19372 -26831 -42418 -60943 -89460 -58856 -30220 27732 52339 14128 22802 32336
12304 32336 20062 -15873 49083 63077 -4837 14420 30076 10239 -6489 5346 553 -12855
12292 -12855 -26920 -63871 -64121 -67994 -52482 -38381 -24017 -7972 -6211 -15989 8741 -5026 -38134
12279 -38134 -7180 -23111 -5988 -15507 -28435 -34438 -1055 879 -23555 -52742 -42753 5679
12267E679R022l3139J1668L2577P409k8653q146j3371j3472J7918L5619j2180
12255A0931K1845J2506l7828l0617L7N565j8362l5289J7981L1469J157k0909J5148
12242b6366r205K9316M5287j3772m2009n990k5613J9643M295K9611P187m0518
12230b8134q81n455k2071L7370M0500k6421J3320J6742k8344n4726j9564M8177
12218b9487J8084J4219j1582K6069K0733J807q722j3037M725r270j0713j5628
12206a2802Q007K5587M3049L7070K2833q46k2099j4063j0023n7657m6304j9433
12194d6681J8758P3032N640n0679l6213J5368L789L200L7543M8767j5784J3404
12182G0144j0452L078m3721J1704K7960J9841R830K0798q654n0059j4659K5566
$$ plain form
12267 5679 14701 -18438 -6770 25807 33216 4563 -3583 -16954 -30426 -12508 23111 10931
12255 10931 32776 45282 7454 -23163 -23126 -17561 -35923 -71212 -53231 -21762 -20605 -41514 -26366
12242 -26366 -35571 -6255 39032 25260 -16749 -22739 -48352 -28709 -24414 5197 12384 -28134
12230 -28134 -29015 -34470 -56541 -19171 21329 -5092 8228 24970 -3374 -58100 -77664 -29487
12218 -29487 -11403 2816 -8766 17303 38036 39843 31121 18084 22809 13539 2826 -12802
12206 -12802 -4795 20792 63841 100911 123744 122898 100799 86736 76713 19056 -27248 -46681
12194 -46681 -27923 45109 50749 70 -36143 -20775 -16986 -13786 23757 72524 56740 70144
12182 70144 59692 62770 19049 30753 58713 78554 88384 109182 100528 50469 35810 61376
12170F1376J4869O814J8341m0021Q00j0960J5876O942k5924p072L8323o266l2100
12157D0998k9549m183K1797n724K9814j7881K6696j9177p10j7325j8587j2385
12145f216K6285J0905l7342R944R062m32p487M541L2166k1055p2134k8031L031
12132g6763O0134M7347J3657O81j4359l2308m9769n7576K8595M9396j6163l2941
12120h0069K1011N2496M3027l4894R878J6386O8560L2946L0245L4616J6109J4443
12108B24754K3895k1220j2277J3332m4981l6550k3965q241K418J0078j1620L8647
12096A54270J8652l2419j4924M1654J1169p6621o4233M4004K7709k1536J1296
12085I9021L0764J1449k5853P545Q023Q727m6274r343J8852K7016N2M4821K8777
$$ plain form
12170 61376 76245 83059 101400 61379 62179 51219 67095 74037 48113 41041 79364 73098 40998
12157 40998 11449 7266 29063 23339 53153 35272 61968 42791 42081 24756 6169 -6216
12145 -6216 20069 30974 -6368 3576 12638 12206 4719 9260 41426 20371 -51763 -79794 -76763
12132 -76763 -16629 30718 44375 45056 30697 -1611 -51380 -108956 -80361 -30965 -47128 -80069
12120 -80069 -59058 -6562 36465 1571 11449 27835 96395 129341 159586 194202 210311 224754
12108 224754 248649 227429 215152 228484 183503 146953 122988 114747 117165 127243 115623 154270
12096 154270 172922 140503 125579 167233 178402 101781 37548 81552 109261 87725 99021
12085 99021 129785 141234 115381 122926 130949 139676 93402 84059 102911 129927 129979 174800 203577
12072B03577O1827J0981k4696o3185n5120l3659l0476m1900J9228l9727l5827
12061b8977K6783P2796K7816n6713m5519Q649L5606N2059j4666j929l4658L0447
12049G1694k8280L865O9302K9155k6054p1672n4365K027N8413Q401r362j0079
12037D3045L2781l2659l83n9066j0539J05884L3445k9577l0407J1427J5448K9733
12025A09132J6653k4151l4129o7862M794K1821R03P5857P388m5928k8650K7868
12013F3696O2161M309k7020P634n232p7J469m9056N1586P2483J4056J3301J4282
12000B23592L7j8219r905j6694l4582j9878O720K0231K288L0826J4465m623K4675
11987B18933M1059M6071J1038n359N44l8286L9817P1915m436M415L1401K690l2778
$$ plain form
12072 203577 265404 276385 251689 188504 133384 99725 69249 27349 46577 6850 -28977
12061 -28977 -2194 70602 98418 41705 -3814 4835 40441 92500 77834 75905 41247 71694
12049 71694 43414 47279 116581 145736 119682 48010 -6355 -4328 54085 62486 53124 43045
12037 43045 75826 43167 42784 -16282 -26821 79063 112508 82931 52524 63951 79399 109132
12025 109132 125785 101634 67505 -357 4437 26258 27161 103018 110406 64478 35828 63696
12013 63696 125857 130166 103146 110780 105548 105471 106940 57884 109470 181953 196009 209310 223592
12000 223592 223629 205410 195505 178811 144229 124351 131071 151302 153590 184416 198881 194258 218933
11987 218933 259992 306063 317101 311742 312286 274000 313817 385732 381296 385711 417112 419802 387024
11974C87024n978N1607M0265J5559J2666N9264N2540J8839j2174l545N3948L0668
11962G00683o642P1840N4886M9589J1696L0254R2382Q2352N6841N9636M3740J39418
11950A386675J39215R4186J36844J54768J74503K54129L02582L03515M10579M35593
11940C792589N38885O49619Q89260J174636J516299J788360J921773K113186K267294
11931A6651901K561001L054112L948746N150629O833949R428399J2849938J7138045
11923G7616720K2611569K8243872L2972827L1535645R807396k4376891l8338136
11916A40073002l7379426l0595495k0820580j3267515q627425n967229m330519
11909A9084813l251863k535176j958552j590978j296155j064366q24596o42307
$$ plain form
11974 387024 381046 432653 472918 488477 501143 560407 612947 631786 619612 616067 670015 700683
11962 700683 694041 765881 820767 870356 882052 912306 1004688 1087040 1143881 1203517 1247257 1386675
11950 1386675 1525890 1620076 1756920 1911688 2086191 2340320 2642902 2946417 3356996 3792589
11940 3792589 4331474 4981093 5870353 7044989 8561288 10349648 12271421 14384607 16651901
11931 16651901 19212902 22267014 26215760 31366389 38200338 47628737 60478675 77616720
11923 77616720 100228289 128472161 161444988 192980633 202788029 178411138 140073002
11916 140073002 102693576 72098081 51277501 38009986 29382561 23415332 19084813
11909 19084813 15832950 13297774 11339222 9748244 8452089 7387723 6563127 5920820
11901E920820n74937m79674l66121k47023k93024k62751j84726j40764o1996o8288
11891C241516j979l7616K6958J05519Q1182R7387J01440R9842O480m5214j28187
11880C547328j76496k21063k33333k66249k58635k61361k56354j93246j70460
11871A510131j82804j99554j34212n3826n0966j8209m8687n1357n4153j21763
11861E94600o2031m923j593m6238n8323J071M2090j0746j3149L7500n5178l2275
11849C90805k3931l3148L9230Q857J73j5764l3135k2373j2847m3780Q858L3565
11837B96510k2871k5072K6907J4631M2681K0078q406m5441j4398L301M613J8454
11825C10987J0971j3203j4944m4743j2813P4169J2497k9783j589l8337j3463J2611
$$ plain form
11901 5920820 5345883 4866209 4500088 4253065 3960041 3697290 3512564 3371800 3309804 3241516
11891 3241516 3239537 3201921 3228879 3334398 3415580 3512967 3614407 3714249 3720729 3675515 3547328
11880 3547328 3370832 3149769 2916436 2650187 2391552 2130191 1873837 1680591 1510131
11871 1510131 1327327 1127773 993561 939735 888769 870560 821873 770516 716363 594600
11861 594600 532569 527646 526053 479815 421492 422563 464653 453907 440758 478258 423080 390805
11849 390805 366874 333726 372956 381813 381986 366222 333087 310714 297867 254087 262945 296510
11837 296510 273639 248567 275474 290105 332786 352864 344458 299017 284619 287920 292533 310987
11825 310987 321958 308755 293811 249068 236255 310424 322921 293138 291549 253212 239749 252360
11813B52360L8685R047l4342m6781R656L7758j081q059J5498k198J5954J0263
11801B96760n7708j9109M4452k647M719K2358O8679K4374m2875k8623k1239l9525
11789B49616k7022j3523n6002K5479J5909K090k0539k583L861j8605q976M4301
11777A94006R7255L2437J0004L6808L5826M041m1163j4446M1052N4958Q6365K55256
11765G92399M25389N39317O43616P66043R01284M67221o33654j152692j010312
11756A738611o73515l84451j99356q3322q1022n5503m8390K6464j132l6963j3454
11745A87967o4562m1588J6391K2401Q276L53L1790O3024N9301k6167j06506k3838
11733A26842J8351m6858m8318O576Q257J6455K2797L2915K4873m9118m0778N29
$$ plain form
11813 252360 291045 300092 265750 218969 228625 266383 265302 257243 272741 270543 286497 296760
11801 296760 239052 219943 264395 261748 266467 288825 357504 381878 339003 310380 289141 249616
11789 249616 222594 209071 153069 178548 194457 196547 176008 173425 177286 158681 149705 194006
11777 194006 291261 323698 333702 370510 406336 410377 369214 354768 395820 450778 537143 792399
11765 792399 1217788 1757105 2400721 3166764 4068048 4535269 3901615 2748923 1738611
11756 1738611 1065096 680645 481289 397967 316945 261442 213052 239516 238384 201421 187967
11745 187967 123405 81817 98208 120609 128885 129238 161028 224052 283353 257186 150680 126842
11733 126842 145193 98335 50017 56593 64850 81305 104102 137017 161890 112772 71994 72523
11721G2523j3522J5037J6486O2321K8065j2024j6109l7246j906j1559n966K6202
11709A22302j3680l2551n017K7287l985L1383N1170K915l1762j6094L8120L6774
11697B06862j7293l6230n3774m3160k129j4488P310p065K1645j9423n878O4768
11685A01145P232j692j7812J1421M2779R9839M6254Q1421R6010J8041m7451j51636
11673B85551j15465o0872j6253j3152k2287o876n2072O467L1037K253j7267L6222
11661E7286L5489o080m438j1587k0225l4527L78J9692p052M052K5684P299O970
11648G2941P821r846j3334O3004N5945M446K8411M0052O9421R0184N7891k5364
11636D41572r0188j29337p6655l8426K8489J9106m3615q0354L3q100M510J1662
$$ plain form
11721 72523 59001 74038 90524 152845 180910 168886 152777 115531 113625 102066 96100 122302
11709 122302 108622 76071 71054 98341 94356 125739 176909 179824 148062 131968 170088 206862
11697 206862 189569 153339 99565 56405 54276 39788 47098 40033 61678 42255 36377 101145
11685 101145 108377 106685 88873 100294 143073 242912 289166 370587 466597 484638 437187 285551
11673 285551 170086 109214 92961 79809 57522 50646 -1426 5041 36078 38331 21064 57286
11661 57286 92775 86695 82257 70670 50445 15918 16296 35988 28936 32988 58672 65971 72941
11648 72941 80762 70916 57582 120586 176531 180977 209388 249440 318861 409045 466936 441572
11636 441572 351384 222047 145392 106966 135455 154561 110946 30592 30625 22525 27035 38697
11624C8697l6065n4561m912J5044N4619L73J4489K2635J5787j5020m0301M2831
11612E3616O7467M4935J7001J1337K7447M1732J01017J07294N8178k1215j15749
11601C93060j27461p1093p5079m4879j0535M583L6066N471o3557l7669m76n1728
11589d3297M154L8201l421l6930O839J0450K4344J8928Q304K4767K0310j6016
11577E6633o563K9492O1753N0386J7968R6803J24251O6649j2982j01258j39370
11566B43762j18259p0788J1556K885l2636l8923J1856O373J7009p595O290L3591
11554F5121J6703l304J329k7675l444J0667Q264J3792O2111J2239N3900J1994
11542B21697o0227n2540q0563r099j4914k1046J031K7731O487j6198l60m7870
$$ plain form
11624 38697 2632 -51929 -56841 -41797 12822 13195 27684 50319 66106 51086 10785 53616
11612 53616 121083 166018 183019 194356 221803 263535 364552 471846 530024 508809 393060
11601 393060 265599 194506 119427 74548 64013 68596 104662 110133 46576 8907 8431 -43297
11589 -43297 -39143 -942 -4363 -41293 -34454 -24004 340 19268 27572 52339 72649 56633
11577 56633 50070 79562 141315 191701 209669 306472 430723 497372 484390 383132 243762
11566 243762 125503 54715 66271 69156 36520 -2403 9453 15826 32835 25240 31530 65121
11554 65121 81824 78520 79849 52174 48730 59397 67661 81453 143564 155803 209703 221697
11542 221697 161470 108930 28367 19268 4354 -16692 -15661 12070 18557 2359 1999 -45871
11530d5871j8798J0935J7410k727K273K242O82k9505N699M3204M1306J2993Q056
11517D7899n524J350L1561j429M4469N5344J1477Q760J4832k3129l4572p0217
11505H0821n6607j2991M5180l1685J3007p103N1869k274n9451J609j0639Q4n0323
11492c8503K4197K2917K5925o727k0206r104O881o797Q783j0185K4890l3597p726
11479a9252l964m701m10J215k0882J3404q423r265Q777K3730K7518p913o5847
11466f6013J8618M2770M2423K8678m9264k1760j2301L6283O0665J916k9867m8347
11454C801m13j4638J071J6421P280K7501j4681l5517j3153j0629J4968J2805l2309
11441c7493l3915P4351O7475N957k2461m4458J8063K520l050m3941k0236l0971
$$ plain form
11530 -45871 -64669 -53734 -36324 -39051 -36778 -34536 -33854 -63359 -57660 -14456 26850 39843 47899
11517 47899 42375 43725 75286 73857 118326 173670 185147 193907 208739 185610 151038 80821
11505 80821 24214 11223 56403 24718 37725 30622 82491 80217 20766 22375 11736 11820 -38503
11492 -38503 -14306 8611 34536 27809 7603 -1501 5380 -1417 7366 -2819 22071 -11526 -19252
11479 -19252 -23216 -27917 -28327 -27112 -47994 -34590 -43013 -52278 -43501 -19771 7747 -166 -66013
11466 -66013 -47395 -4625 37798 66476 17212 -4548 -16849 19434 80099 82015 52148 3801
11454 3801 3388 -11250 -10179 6242 13522 41023 26342 -9175 -22328 -32957 -17989 -5184 -37493
11441 -37493 -71408 2943 70418 76375 53914 9456 27519 30039 26989 -16952 -37188 -68159
11429f8159M2614N8906n257k1136K4718J0332n7416q4935j556M3264J2024K4873
11417b1728k4322M3087L3641j7516q083J3920n94n294l7852l2082J4634J3379
11405b8810M5475M2749j8926k5948o0453J8103M7702j7723r135J323j3774j4107
11393c3524J8783j1717K5698M2583L9090k29P727q152j299m1130l7912l1529J4048
11380a7563J7914k6723k7052m559J704K432J1395M445j9869L9646K7608q766K7271
11367B7883L2754k1645k5498n4867L0921K0010K4140j8527o4082N852L2456K9806
11355A9203p7021l1016J1752K2837l265j8925J6626L257J6474P660n1336P256
11343g6498N649P417O8308j9352p2319j5795N6170O1795P246J161k2101r629K3496
$$ plain form
11429 -68159 -25545 33361 28104 6968 31686 42018 -15398 -100333 -101889 -58625 -46601 -21728
11417 -21728 -46050 -2963 30678 13162 5079 18999 18405 13111 -24741 -56823 -42189 -28810
11405 -28810 16665 59414 40488 14540 -45913 -27810 19892 2169 -6966 -5643 -19417 -33524
11393 -33524 -14741 -26458 -760 41823 80913 80684 88411 80259 78960 37830 -82 -31611 -17563
11380 -17563 351 -26372 -53424 -57983 -56279 -53847 -42452 -38007 -57876 -18230 9378 612 27883
11367 27883 60637 38992 13494 -41373 -10452 9558 33698 15171 -48911 -43059 -10603 19203
11355 19203 -57818 -88834 -77082 -54245 -57510 -76435 -59809 -56552 -40078 -32418 -83754 -76498
11343 -76498 -70849 -63432 4876 -14476 -86795 -102590 -46420 15375 22621 23782 1681 -7948 15548
11330A5548L9794l274p5200o2642J0995M6669O1919L3642p690n765J969p534j6842
11317C1589L4810j6672j7074j2044P437M095K2763o979O73J557J6929k4317l7207
11304E560J1354p058p425L2901J6234k2246j326m779k3582l0470P709k6403J0750
11291c8781j7176j8560K5657L4145K0030L4522k3885n0018l7096o49M6707j954
11279b7058k1630k75J0195K0112J2949J108K9516M0617k761J6806k2187m8232
11267I160k0919J7656j3502J4999j075M641j835Q865j0476l6191l633j328L6443
11254B805K895m7001m94k1591k800L2811J5998K9205K9313k2493k9371K7915j369
11241A5823K3804n9962n431P131J3387K6231m4922m7473j8654J0780J9306m220
$$ plain form
11330 15548 55342 52068 -23132 -85774 -74779 -28110 33809 67451 59761 53996 55965 48431 31589
11317 31589 66399 49727 32653 20609 28046 32141 54904 47925 48598 50155 67084 42767 5560
11304 5560 16914 9856 2431 35332 51566 29320 27994 23215 -367 -30837 -23128 -49531 -38781
11291 -38781 -55957 -74517 -48860 -14715 5315 39837 15952 -34066 -71162 -71811 -25104 -27058
11279 -27058 -48688 -48963 -38768 -18656 -5707 -4599 24917 65534 62773 79579 57392 9160
11267 9160 -11759 5897 -7605 7394 6319 10960 9125 17990 7514 -28677 -32310 -33638 2805
11254 2805 5700 -41301 -41795 -63386 -66186 -33375 -17377 11828 41141 18648 -10723 17192 15823
11241 15823 39627 -20335 -25766 -18635 -5248 20983 -23939 -71412 -90066 -79286 -59980 -64200
11229f4200M9110k253L2J1057K2069j878n4756o988q905L4485K8745j0731m5210
11216d9423L5946J7541m5082k5528K0608J9794J2228L710k2765M2415N0413J0116
11204F9973k5341K5726p8335r0001K0196R7599j6172l0001K7737J6329K7196K007
11192D6913k9775O668n879l5298l5980l3493J9616J4475M4801M8862q912k7780
11180D218j1650L55J3164p948N404j2761j860O2435j4068l6078l6411M463l2434
11167f3171j8412l305l7824N834Q6375L4124J9603O797M02m3754m0113L2651J6400
11154d393r033L955j8309M8681L1920j4763j447r172j9803m0312m0039k9902r746
11141a12363K3768L3553J8456l0535l717L4277Q470l2410l1699L3853j2479J7893
$$ plain form
11229 -64200 -15090 -17343 -17311 -6254 15815 13937 -40819 -47807 -56712 -22227 6518 -4213 -49423
11216 -49423 -13477 4064 -41018 -66546 -45938 -26144 -13916 -10206 -32971 9444 59857 69973
11204 69973 44632 70358 -7977 -97978 -77782 19817 3645 -26356 1381 17710 44906 46913
11192 46913 17138 23806 17927 -17371 -53351 -86844 -67228 -52753 -7952 40910 31998 4218
11180 4218 -7432 -7077 6087 -1861 3543 -9218 -11078 51357 37289 1211 -35200 -30737 -63171
11167 -63171 -81583 -84888 -122712 -116878 -30503 3621 23224 30021 30423 -13331 -53444 -20793 -4393
11154 -4393 -13426 -9471 -27780 20901 52821 38058 36611 27439 7636 -32676 -72715 -102617 -112363
11141 -112363 -88595 -55042 -36586 -67121 -70838 -36561 -28091 -60501 -92200 -58347 -70826 -52933
11129e2933R9470L8881l1761j9778n2999k7489J7221N1962L9628p422L398p023
11117E1155J722m082J3847J5159l6122q059m2674K9203M4586j3473j277j9744
11105C0241j859p10l5842M8193K5466l6251l3135k6330l6106J8196N7643K4390
11093C3896M0115k1085m4131m1453k9757j1672N0854K6959j535O890k491l1703
11081b5113J8158j1345N2865m6210q256M7121K9688o67Q358j2177l6184j4110
11069B128J6910O476J5897L8151k9850k6892K6343j0288m9765L6210j538J2495
11057C6277K6422J2091p289n558k2918j8935L747O74N0811P4031K2441q165J5354
11044A78983L4773L3388k2269k3724J0077L343j4695L926L0473K5349N5260N5040
$$ plain form
11129 -52933 46537 85418 53657 33879 -19120 -46609 -29388 22574 62202 54780 58178 51155
11117 51155 52877 48795 62642 77801 41679 33620 -9054 20149 64735 51262 49985 30241
11105 30241 28382 27672 -8170 40023 65489 29238 -3897 -30227 -66333 -48137 9506 33896
11093 33896 74011 52926 8795 -32658 -62415 -74087 -23233 3726 2191 9081 6590 -25113
11081 -25113 -6955 -18300 34565 -11645 -19901 27220 56908 56241 64599 52422 16238 2128
11069 2128 19038 25514 41411 79562 49712 22820 49163 38875 -10890 25320 23782 36277
11057 36277 62699 74790 67501 61943 39025 20090 23837 24511 75322 149353 171794 163629 178983
11044 178983 213756 247144 224875 201151 211228 214571 199876 203802 234275 259624 314884 369924
11032C69924N6040N9195Q996m7706l5564j5987O813O00N4134M3251L8663O4745
11020F03104K7616N511m6241o381m6796o8597q9759m0331K3798K6213R525Q517
11008D06179K3138J7345p4375m7857p0667o0977k9575R050K2846K6201l798m7635
10996A69875n122j054j9711j1767j6976l4769l9414J1240j1927l6480m7400j9387
10984f2892j392J6841K9916L7937L2685l4772O686r350L059L9951M2333J5391
10972A16393j9305l2802j4488m6884J6529O942j7285l707K3196R5k4385n503K2162
10959B0958N525j4594M093K1662J831j9676j0985J3283R28Q714j521n110k0165
10946D943P2323P4234j1058p3672o5580K0121N3834J0214o0998k5120j8755o258
$$ plain form
11032 369924 425964 485159 494155 446449 410885 394898 401711 402311 456445 499696 538359 603104
11020 603104 630720 636231 589990 583609 536813 468216 378457 338126 361924 388137 397662 406179
11008 406179 429317 446662 372287 324430 253763 192786 163211 172261 195107 221308 217510 169875
10996 169875 164753 163699 143988 132221 115245 80476 41062 52302 40375 3895 -43505 -62892
10984 -62892 -64284 -47443 -17527 20410 53095 18323 25009 15659 18718 58669 101002 116393
10972 116393 97088 64286 49798 2914 19443 26385 9100 5393 28589 28684 4299 -1204 20958
10959 20958 26483 11889 15982 37644 39475 19799 8814 22097 23025 31739 30218 25108 4943
10946 4943 77266 151500 140442 66770 1190 21311 75145 85359 24361 -759 -19514 -25772
10934b5772k2788K3169L7577L6640L4184K919n2516m5707n092K0123J8750K2410
10922D3897j6749k607Q468N3530j5368l0725o0514l9652n75L5613K5906m925j2672
10909a6373K5110j6542k0608k4680J2375M1937p733m4952m9787J437L9658K9929
10897c0229O3480J4422L692j2738j9239J2999J8594k6800l5j7180k5319J3292
10885e061L247K1065K499k9053J3313j845r781o621j7774M053J0184K2521K7254
10872C4001M4755L700j8941l8360k5643L804o735J7718L7983K7911L4791n2172
10860F2812l4808K2955p415k9098L0340P655l3344J79m5411j0159K7044K0083
10848A0833O2063J6946J7952L5093K4502j8469m5203n1249J8811l1986j1846J9374
$$ plain form
10934 -25772 -48560 -25391 12186 48826 83010 85929 33413 -12294 -17386 2737 21487 43897
10922 43897 27148 24541 33009 86539 71171 40446 -20068 -59720 -60295 -24682 1224 -3701 -16373
10909 -16373 8737 -7805 -28413 -53093 -40718 1219 -6514 -51466 -101253 -99816 -60158 -30229
10897 -30229 33251 47673 51365 38627 19388 32387 50981 24181 24146 6966 -18353 -5061
10885 -5061 -1814 19251 21750 -7303 6010 4165 -5616 -12237 -30011 -25958 -15774 6747 34001
10872 34001 78756 82456 63515 25155 -488 3316 -3419 14299 52282 80193 114984 62812
10860 62812 28004 50959 43544 14446 44786 52441 19097 19276 -26135 -36294 -9250 10833
10848 10833 72896 89842 107794 142887 167389 148920 103717 52468 71279 39293 27447 46821
10836D6821M9773P3794K3001l2170l4323J6891m1018J6893k0317j177M3369k7130
10824A14407j5148L7572l3299n1363o114L0180K7016k2357m694j0011Q297J9742
10812I4228J4930m3369o1069J7100K9633J2151q573N343j8847L3360J747j0694
10800F5940j3057K6674m0199j694L9836L3456K455k2052K1303P788p056J2525
10788A25919l0663n4261m754k9120J2615L4233M3299k572m2759j7935Q189N0639
10776I2830K7912K2235j4512R138n793m5399j6606Q211M4907j1188m7784K3080
10764H7031j7187j555L4001K0424j9695l6401J2083K1073L196j0695K5919M3669
10752A61863n347k0403o7179J0956R8814J6503n774m0807k2142n571l2677Q386
$$ plain form
10836 46821 96594 170388 193389 161219 126896 143787 102769 119662 99345 98168 141537 114407
10824 114407 99259 136831 103532 52169 46055 76235 103251 80894 76200 66189 74486 94228
10812 94228 109158 65789 4720 21820 51453 63604 55031 60374 41527 74887 76634 65940
10800 65940 52883 79557 39358 37664 77500 110956 113411 91359 112662 120450 113394 125919
10788 125919 95256 40995 36241 7121 19736 53969 97268 94696 51937 34002 42191 92830
10776 92830 120742 142977 128465 137603 131810 86411 69805 78016 122923 111735 63951 87031
10764 87031 69844 68289 102290 122714 103019 66618 78701 99774 102970 92275 118194 161863
10752 161863 156516 136113 68934 79890 178704 195207 189433 148626 126484 120913 88236 96622
10740I6622j0347m8499P672O170K5267K6940n897K7414L3984k0114j3972j2202
10728A13038l9608k271K6057J1976o385l4283n8955O527j9585o1808N2567M8899
10716C6169L2734J6819m5651K3315M8679k8199m9879l5496N0103L6413J4191j5366
10704H3832k9946r035l0673j9787L833J5836J145Q975K2007j4951j8090o834N6444
10691F2756j6079j4683j868J6122j4366J1884l6457l6248N5719Q471k421J4456
10679D7286m435k806L2146M4312j1573j5243L3030L9404K9285l206J0223m4191
10667A54232j2758n934j9489K520Q5239J7767m3481j3607M0823M7669M3293r75
10655B95299K113O121m109L2000J3188q298O9358P670K6469K1462L6803L8327
$$ plain form
10740 96622 86275 37776 45448 51618 76885 103825 97928 125342 159326 139212 125240 113038
10728 113038 73430 71159 97216 109192 102807 68524 9569 16096 -3489 -65297 -12730 36169
10716 36169 68903 85722 40071 63386 112065 83866 33987 -1509 48594 85007 99198 83832
10704 83832 53886 44851 14178 -5609 -1776 14060 15205 24180 46187 31236 13146 6312 62756
10691 62756 46677 31994 30126 46248 31882 43766 7309 -28939 26780 35251 32830 47286
10679 47286 42851 40045 72191 116503 104930 89687 122717 162121 191406 188200 198423 154232
10667 154232 141474 135540 116051 118571 203810 221577 178096 164489 205312 252981 296274 295299
10655 295299 297412 303533 299424 331424 344612 336314 405672 413342 439811 461273 498076 536403
10643E36403N0228M5640K8298N2314P7745R5573P2298J51580J33170J30139J94947
10632A568335K02776K33970L41210L20394L48763L52019L74708M96978O01820
10623D840973P16136R51333J213744J515763K010043K482221K954888L382013
10615B0067114L619064L341635K375126J003508j99478n60792j32289Q21379K182854
10606C2518121L621036M949187O044371O445657N703321L271696l59954l232694
10598E8960741m056150l093913j033185J449355L819632N745051O994032P226209
10590G6011772N695214J592925l869067p798928q716568p257436m632834j995765
10582D9029313K91860K049307L011360L083826J896873r39420m535715o844607
$$ plain form
10643 536403 586631 632271 660569 712883 790628 886201 958499 1110079 1243249 1373388 1568335
10632 1568335 1771111 2005081 2346291 2666685 3015448 3367467 3742175 4239153 4840973
10623 4840973 5557109 6508442 7722186 9237949 11247992 13730213 16685101 20067114
10615 20067114 23686178 27027813 29402939 30406447 30206969 29646177 29513888 30335267 32518121
10606 32518121 36139157 41088344 47132715 53578372 59281693 62553389 62193435 58960741
10598 58960741 54904591 51810678 50777493 52226848 56046480 61791531 68785563 76011772
10590 76011772 81706986 83299911 79430844 71631916 62915348 55657912 51025078 49029313
10582 49029313 49321173 51370480 54381840 57465666 59362539 58423119 53887404 47042797
10574D7042797p082017n827701m031592k315526r58797j01635L40658L11643l59386
10565B7018444j471676k789125l666935l709683l167006k483320j819012j358253
10557F553434j004506p89110o31250m66980l06324k48569k43900j90456j85000
10548B487339j43565o2336m271P9444P0557R4076J34306K32683K67356K11319
10538C366908J00105m4180j45435j60347n7263J0788M4917M1832j39275l78524
10528B639526m07429l69427k85176j89605j63576j11801r9330m8689o8497j04039
10518G91957p9954o5882l5735o0666k6625l1412J373J764M8917J4169m5926l7045
10506D74935k868L993k6746M2916K9407r5117l043J9928m2231L9940M0352p0727
$$ plain form
10574 47042797 39960780 34133079 30101487 27785961 26827164 26725529 27066187 27377830 27018444
10565 27018444 25546768 22757643 19090708 15381025 12214019 9730699 7911687 6553434
10557 6553434 5548928 4759818 4128568 3661588 3355264 3106695 2862795 2672339 2487339
10548 2487339 2343774 2281438 2277167 2356611 2427168 2521244 2655550 2888233 3155589 3366908
10538 3366908 3467013 3422833 3277398 3117051 3059788 3070576 3115493 3157325 3018050 2639526
10528 2639526 2232097 1862670 1577494 1387889 1224313 1112512 1013182 964493 895996 791957
10518 791957 712003 646121 610386 549720 523095 491683 493056 494820 543737 557906 511980 474935
10506 474935 472067 476060 449314 492230 521637 426520 423477 443405 401174 441114 481466 410739
10494D10739l7841K5950j0478l1076n43j1692J9941K4830j6905k4716M6169M9537
10482D43915k3373m2351n6758J326j6583j3104j632k4131K8556L5037k6602m0665
10470B63635L2900j5411n681k872k5647K0717M467J2134k1018k4769J068l5611
10458B03912M9115M9305J9853j3972l506n0109l554k4836p9449k1453L688j33
10446A28861Q0991L6267N127n3796k2554O4236L2040K7318J3269l007J1239l9354
10434B80637k2914K8755K735m0522R509n542M9000K6292p277n6080p5708j4016
10422A74869k2346j6093k6903Q415J0324n297J340o318j7051L3689K2708J1260
10410A68597J3237L3899j0752M0298J8555r279k5318J3153K8420N3711O5489J6866
$$ plain form
10494 410739 372898 398848 388370 357294 356751 345059 365000 389830 372925 348209 394378 443915
10482 443915 420542 378191 321433 322759 306176 293072 291440 267309 295865 330902 304300 263635
10470 263635 296535 281124 275443 272571 246924 267641 272108 284242 263224 238455 239523 203912
10458 203912 253027 302332 322185 308213 304707 254598 251044 226208 146759 125306 128994 128861
10446 128861 209852 246119 251246 197450 174896 239132 271172 298490 311759 308752 319991 280637
10434 280637 257723 286478 289213 248691 258200 252658 301658 327950 320673 264593 188885 174869
10422 174869 152523 136430 109527 117942 128266 122969 124309 117991 100940 134629 157337 168597
10410 168597 181834 215733 204981 245279 263834 254555 229237 242390 270810 324521 390010 406876
10398D06876K653K126K8600O4574N4499L4359P6505J11806P5872N2730P2744J27349
10386A110693R5770J0057p4129p8640j42098j39757q7466p0549p3726k4852j114
10375E24189m762n5639m2064k2958k1075n6225J119O9717j0080p2664l6598N7665
10363C30625Q808k8459q688J9491K4487P620J1078j8615k9236K6500k90n3443
10351B89878j1572M1631K078o0342m0650k4956K677l790k6925J3754M7016j175
10339B27624l8032L2513P338Q835o035P0863O6515K0035K6633P5082L6148M8626
10327E76145L4245R872m5928l9936L9371K9325J7545L8093K711M883j9077p1817
10315E75432k8924q761K6696k3066l9669k3180M1321L5549J0892q494r798M4647
$$ plain form
10398 406876 409529 411655 440255 504829 559328 593687 670192 781998 857870 910600 983344 1110693
10386 1110693 1206463 1216520 1142391 1063751 921653 781896 694430 623881 550155 525303 524189
10375 524189 519427 463788 421724 398766 377691 321466 322585 392302 382222 309558 272960 330625
10363 330625 339433 310974 302286 321777 346264 353884 364962 346347 317111 343611 343321 289878
10351 289878 278306 319937 322015 261673 221023 196067 198744 194954 168029 181783 228799 227624
10339 227624 189592 222105 229443 238278 232243 303106 369621 389656 416289 491371 527519 576145
10327 576145 610390 620262 574334 534398 573769 603094 620639 658732 661443 666326 647249 575432
10315 575432 546508 537747 564443 541377 501708 478528 519849 555398 566290 557796 547998 592645
10303E92645K3376l4550r097L7109O5221Q249k0593k4135J02847Q3728K5975K7934
10291H78709J7552j296m8715m5901J0003J0349q7237q159J9334N447j22447j21583
10279E06056r468n7020j3133j2249O902L5387P4017M26K6455K2647n001P831J5820
10266E98670K1567j4982l3274l1252j7304l6666R094L5185m25L4170o936J7937
10254E75784j1909o6172n7214N232L0555J3849l9881j8533J8393J5385j0267M017
10242D59239J4071J877R041k3489l4079J8012N5030J1131l4114q458O0267K2370
10230E50898O1042L3667N289L7581N7114O3302N5813J0786l1104L9029Q2649l1790
10218I34276K4319R9485N3769K468L9078J4645L4870Q0902O2182N0338J8135n957
$$ plain form
10303 592645 616021 581471 572374 609483 674704 682953 662360 638225 741072 824800 850775 878709
10291 878709 896261 894965 846250 800349 810352 820701 733464 725305 744639 750086 627639 506056
10279 506056 496588 439568 426435 414186 421088 456475 530492 530918 557373 580020 575019 582850 598670
10266 598670 620237 605255 571981 540729 523425 486759 495853 531038 530613 564783 557847 575784
10254 575784 563875 497703 440489 445721 476276 490125 450244 431711 450104 465489 455222 459239
10242 459239 473310 475187 484228 460739 426660 444672 499702 510833 476719 468261 528528 550898
10230 550898 611940 645607 650896 688477 745591 808893 864706 875492 844388 883417 966066 934276
10218 934276 958595 1058080 1111849 1114317 1153395 1168040 1202910 1283812 1345994 1396332 1414467 1408510
10206A408510M9201J03147K3810J8568O5570Q9030O1338J00228R9672Q0344R2276
10195B191694J08886K7771R2986J22493J07292J05231R0070J31862J56681J25590
10185C260556Q7922R2783K00401J93295J87588K81022K80247K90215K82312K88416
10175E444757L24939L31327L86088M69870N08618N88328O41250P23452Q77647
10166A0296276R75137J134410J274055J445705J708897J962367K198195K300669
10158B3295711K503132K809321L323874M224370N227706O198761P038777P842294
10150F2463946Q733171R995658J2063124J5359732K0010217K6515519L4984640
10143A90126007M4852948N5024697O3929464O8717842O1720498K9980644j6075805
$$ plain form
10206 1408510 1457711 1560858 1584668 1603236 1668806 1757836 1819174 1919402 2019074 2099418 2191694
10195 2191694 2300580 2328351 2421337 2543830 2651122 2756353 2846423 2978285 3134966 3260556
10185 3260556 3348478 3441261 3641662 3834957 4022545 4303567 4583814 4874029 5156341 5444757
10175 5444757 5769696 6101023 6487111 6956981 7465599 8053927 8695177 9418629 10296276
10166 10296276 11271413 12405823 13679878 15125583 16834480 18796847 20995042 23295711
10158 23295711 25798843 28608164 31932038 36156408 41384114 47582875 54621652 62463946
10150 62463946 71197117 81192775 93255899 108615631 128625848 155141367 190126007
10143 190126007 234978955 290003652 353933116 422650958 484371456 514352100 498276295
10136D98276295l7697827l0812659q398741J4484530K7125140J8958258j9231414
10129D62703582o3933963q1363098p5439530n8149217m1226550k8762932k0324780
10122I3503512j4764542j0984732q484487o864144n679380m913429m350781l828101
10114C3633916l184392k511815k020493j642234j467491j586481j755971j789170
10106A7675869j675304j544835j293044j064779r26135p92461o48973o14832n51066
10097H564440m74328m17977m13416m01373l33436l22945k83858k61693l08682
10088E346732j67683j31115j68125k22754k38205j52089j87976j63790q3334q8137
10078C743524o3340r6827j29146o8344p2125k9254n0382j31929j40569p4531q9594
$$ plain form
10136 498276295 460578468 429765809 421367068 435851598 462976738 481934996 462703582
10129 462703582 398769619 317406521 241966991 183817774 142591224 113828292 93503512
10122 93503512 78738970 67754238 59269751 52405607 46726227 41812798 37462017 33633916
10114 33633916 30449524 27937709 25917216 24274982 22807491 21221010 19465039 17675869
10106 17675869 16000565 14455730 13162686 12097907 11171772 10379311 9730338 9115506 8564440
10097 8564440 8090112 7672135 7258719 6857346 6523910 6200965 5917107 5655414 5346732
10088 5346732 5179049 5047934 4879809 4657055 4418850 4266761 4078785 3914995 3831661 3743524
10078 3743524 3680184 3583357 3454211 3385867 3313742 3284488 3234106 3102177 2961608 2887077 2797483
10067B797483o2035l6499j2394o923M173L4704Q0718J25857P3250q2554k35389
10056B680391k45282k16371j50015j02692q1930j22628n0639k1667K6025j956
10046A713236n908j3778k5291L295k7137n2400J2311k5371l66P2271J263n3791
10034A598334l7937q679l1793q279k1415K3452n1501k9260l1245J1810k3756n931
10022A383800j0448K7600m647K2602j3092L660M344j8232m0565L798j082k883
10010A354855m6788k2628q959j4963m0581k5918l8123j9727m7925n4284p9688
9999I55271o5443o7580m5627j783k7840n486n0312m8954m996p4943r2590q0117
9987C89600l9775j00874k5664J3973j6433M678j1964j7141n0977m8562l7089L5282
$$ plain form
10067 2797483 2735448 2698949 2686555 2679632 2683805 2718509 2799227 2925084 2998334 2915780 2680391
10056 2680391 2435109 2218738 2068723 1966031 1884101 1761473 1710834 1689167 1715192 1713236
10046 1713236 1707328 1693550 1668259 1671554 1644417 1592017 1604328 1578957 1578591 1650862 1652125 1598334
10034 1598334 1560397 1551718 1519925 1511646 1490231 1513683 1462182 1432922 1401677 1413487 1389731 1383800
10022 1383800 1373352 1400952 1396305 1418907 1405815 1409475 1413819 1395587 1355022 1358820 1357738 1354855
10010 1354855 1308067 1285439 1276480 1261517 1220936 1195018 1156895 1137168 1089243 1034959 955271
9999 955271 889828 822248 776621 774838 746998 741512 691200 642246 637250 562307 469717 389600
9987 389600 349825 248951 223287 237260 220827 225505 213541 196400 145423 96861 59772 95054
9975I5054P8812J2970O259K915j7581L9646K7392k6268k1672L2952P607m5884
9963A92202J4199k1774p892K0394N287l5340L66P777j7417n9678k8895L0244K9825
9950A29298k0800L4152N0290nl156r458K917N2368O3281O8604R5578N1014L9169
9937E53252N8142n10k710q690J5834m120M3576Q3123L2617q3133p1232j0108l0969
9924E75072l0594m2028k9113M528l3487l3651n207L6585j5359p376K7564r161
9912D37773l2172J9504o707L0555O806K8435J2996k8139k3396K3418o665k7296
9900D35112l4170J77M642k6514j438j5430j3825k1671K1730K2608j7848m009J8124
9887C67488j2354n2898Q461r874N8532M0326j008r559l2743k0324k6620M8150
$$ plain form
9975 95054 173866 186836 193095 196010 178429 218075 245467 219199 197527 230479 238086 192202
9963 192202 206401 184627 176735 197129 202416 167076 167442 175219 157802 98124 69229 99473 129298
9950 129298 108498 142650 192940 192935 189779 180321 183238 235606 298887 367491 463069 514083 553252
9937 553252 611394 610884 608174 599484 615318 611198 654774 737897 770514 687381 616149 606041 575072
9924 575072 544478 502450 473337 477865 444378 410727 405520 442105 426746 419370 446934 437773
9912 437773 405601 425105 418398 448953 455759 484194 497190 469051 445655 469073 462408 435112
9900 435112 400942 401119 405761 379247 377809 362379 348554 326883 348613 371221 353373 349364 367488
9887 367488 355134 302236 310697 300823 359355 399681 398673 389114 356371 336047 309427 357577
9875C57577L5635j8171n1958j4378M390N103k5122n6477k7126o896j2806K3388
9863B13159K4537j7651J8033N451J131J1314k592j1869m2955J976j4161L107K9752
9850B19232k7589j2340l6738k0195J4987O339J3702Q490l350j9249j8381L525
9838A28433M3052o736n5360m2880k6579q720J7108P1776N9222j2933n2800l6425
9826G7158K2388J8076N4636M536j9962J252P6030O955l8134o6979O564M8310K8205
9813B19035J0985r952o443k7367j5997L3261K883J5880o446o5442l1639M0754
9801A59512j0766q789p891l311J4500j1710j1124O8371N6937k2788l2494j2529
9789A77918l8279l3581R325K4560J6339L2953k3601j9193J3457m519j7266j9189
$$ plain form
9875 357577 393212 375041 323083 308705 313095 318198 293076 236599 209473 202577 189771 213159
9863 213159 237696 220045 238078 243529 244660 255974 253382 241513 198558 200534 186373 189480 219232
9850 219232 191643 179303 142565 122370 137357 143696 157398 165888 162538 143289 124908 128433
9838 128433 171485 164749 109389 66509 39930 31210 48318 120094 179316 166383 113583 77158
9826 77158 99546 117622 172258 176794 156832 158084 234114 241069 202935 135956 142520 190830 219035
9813 219035 230020 220068 213625 186258 170261 203522 206405 222285 215839 150397 118758 159512
9801 159512 148746 139957 132066 128755 143255 131545 120421 188792 245729 222941 190447 177918
9789 177918 139639 106058 115383 139943 156282 189235 165634 146441 159898 155379 138113 118924
9777A18924J2390L8493j0156l5245J078J3477j1199J8023M9513k5383p8845Q380
9765I9450N0004J9182j1790p76K5634k2228J5252l943o4111J6725O5261K515k2722
9752A68453J33L6579M8166P8682N1781j9552J7695P5816M1298O7400J05268R0687
9740G62406P9389J32148J70463K07613L19285L06219K84560K38666J03341n7256
9730B546834j38660q5111J8079Q7889O8948J1533j95747l32100l49649k86681
9720A345335k18264k12585j63761j24091q4089k1349m0870j1549l1240q9884q2481
9709B65172j1826j2007K6m0464k9916j2824k9251L7154K4983m0337J4009k9935
9697A34784o840j8861m7483j7195O986J4628J4059L1016q824k2363L1593N3248
$$ plain form
9777 118924 131314 169807 159651 124406 125484 138961 127762 145785 195298 169915 91070 99450
9765 99450 149454 168636 156846 156070 181704 159476 174728 170785 106674 123399 188660 191175 168453
9752 168453 168586 205165 253331 332013 383794 364242 381937 457753 499051 566451 671719 762406
9740 762406 841795 973943 1144406 1352019 1671304 1977523 2262083 2500749 2604090 2546834
9730 2546834 2408174 2323063 2341142 2429031 2497979 2509512 2313765 1981665 1632016 1345335
9720 1345335 1127071 914486 750725 626634 542545 521196 480326 468777 437537 347653 265172
9709 265172 253346 241339 241365 200901 170985 158161 128910 166064 191047 150710 164719 134784
9697 134784 127944 109083 61600 44405 51391 66019 80078 111094 102270 79907 111500 164748
9685A64748K9959j0195R232K1450r8281l5443K3912J6815l6055n4970K0304N7685
9673A09161k1649K3993N0898M7678K9222p4054l4876n360M0833P523m3840m323
9661A25206L5655R259J1787L7434K7123M0485K6245O8053N8619N8019J00699P5916
9649F74500o2889j74745j66206n8544q0275k8882J0787J6909K1648l2672M570
9638A24201O4948M0944l332k3527k2247P869J7672J03742N9149J216J3254J9819
9626D03708L6115M6454k4293q4840n4407m5215k1353n4718k1991k8354J559j3610
9614A39055K936k3433l44r528Q519L24r253N838K6914J8495n425M306K5181R282
9600A92867n6442l3304J8105R414l5000k56n5604p0182l350K4805j484m8623J3028
$$ plain form
9685 164748 194707 184512 193744 215194 116913 81470 105382 122197 86142 31172 51476 109161
9673 109161 87512 111505 162403 210081 239303 165249 130373 125013 165846 173369 129529 125206
9661 125206 160861 170120 181907 219341 246464 286949 313194 381247 439866 497885 598584 674500
9649 674500 611611 436866 270660 212116 131841 102959 113746 130655 152303 119631 124201
9638 124201 189149 230093 226761 203234 180987 188856 206528 310270 369419 370635 383889 403708
9626 403708 439823 486277 461984 377144 322737 277522 256169 201451 179460 151106 152665 139055
9614 139055 141991 118558 118214 108686 117205 117529 108276 114114 141028 159523 154098 158404 183585 192867
9600 192867 136425 103121 121226 130640 95640 95384 39780 -30402 -33752 -8947 -10431 -59054 -46026
9587d6026K9843N3255J252M0581l22k6706m9655k2244O040J1813L5838L3024j4033
9574E2660J8203j3458k2879m052J188J170L4380O5j160j0187J4004N566n9904
9561A5596K6271q536l4519K5720J4626k6002l5698k807L2045L2589K525k4260
9549A7550K4764Q600q025o552j8272m6080L0249K4601O136J2407J5736n4865m995
9536A254K951K1495j8432J9088L5272L4704J394p628J5777j6995j9774N643J7619
9523I2368J3483j1372J0183O197J6598m1778j1139J3617K899K6533L2675N7996
9511B08260N397k9741j393M5742L9414K8296M770p5377n7027Q303m3125m4545
9499H8974j6927L9596J9033j1829K5965L941p9808j3797L443L012L2531j2330
$$ plain form
9587 -46026 -16183 37072 38324 78905 78583 51877 2222 -20022 -13982 -2169 33669 66693 52660
9574 52660 70863 57405 34526 30474 31662 32832 67212 67277 66117 55930 69934 75500 15596
9561 15596 41867 33331 -1188 24532 39158 13156 -22542 -25349 6696 39285 41810 17550
9549 17550 42314 50914 42889 36337 18065 -28015 2234 26835 32971 45378 61114 6249 1254
9536 1254 4205 25700 7268 26356 61628 96332 97726 90098 105875 88880 69106 74749 92368
9523 92368 105851 94479 104662 110859 127457 85679 74540 88157 91056 117589 150264 208260
9511 208260 213657 183916 182523 228265 267679 295975 300745 225368 168341 176644 133519 88974
9499 88974 72047 111643 130676 118847 144812 148753 68945 55148 58591 61603 94134 81804
9487H1804o2993j5254L8796K9469P0100j5172p0275j2980q31L7336j666k8492
9475D9842O48K758r619m8342J0353M5369K2784N012j2700m7324J2584K8966L6550
9462I6881k0547n1040k4242p449J4040j5715k9009K3099J1134J6516J8990l8846
9450f188M206L9324n127m949J7583Q582L1870Q626n8543m8802L2952J5632l1886
9437C280o255Q071L783K1914m4501j1395j1477j7374J3755L6804L5566K6043M1470
9424I9684q347p7546q944j7767M2018L3168l0615j4518l6793L6475J6449j2940
9412B0324K5713q646k0813j7065k2494p377K0028O858n3903K2901O8692K7741
9400F1959r364k8552L5484j5985k7944q127j5698j0725j2938L230p735k1194M6950
$$ plain form
9487 81804 18811 3557 42353 71822 141922 126750 56475 43495 42664 80000 78334 49842
9475 49842 50490 53248 43629 -4713 5640 51009 73793 78805 66105 18781 31365 60331 96881
9462 96881 76334 25294 1052 -6397 7643 -8072 -37081 -13982 -2848 13668 32658 -6188
9450 -6188 -1982 37342 32215 27266 44849 53431 85301 93927 35384 -13418 19534 35166 3280
9437 3280 -2975 5096 8879 30793 -13708 -25103 -36580 -53954 -40199 -3395 32171 58214 99684
9424 99684 91337 13791 4847 -12920 29098 62266 31651 17133 -19660 16815 33264 20324
9412 20324 46037 37391 16578 -487 -22981 -30358 -10330 -3472 -57375 -34474 34218 61959
9400 61959 52595 24043 59527 43542 15598 7471 -8227 -18952 -31890 -28660 -36395 -57589 -10639
9387a0639L0550J2522L28j7592q966M5619M0101P174l6238n8762k2567L6583K6686
9374D4799K5915M3209k5388K886L2321m7733m2482N352k4554m4001q259J5796
9362b2139j2307J151J642K4390L4852l7617k2810O0192J8267n6832J5945K9019
9350C3753P000M0805K1825k2850j8057k3991l9360m4946j9899Q228R039o703N5208
9337E2K3887O301l3283q203L7289L1063j9377m6002l5722k8644K8529M7530L3785
9324C7205j7401J8547L3851k300j9138N876n0444j5142J2594j0928n7799k6757
9312i1836J6197N1500O0703M3100j7276l7368M0944j2783m6162l1791l1894o366
9300f3032K3857K5152J5708M0445r724p349n7541K315J6352r658J7183M0284n849
$$ plain form
9387 -10639 19911 32433 32761 15169 6203 51822 91923 99097 62859 4097 -18470 18113 44799
9374 44799 70714 113923 88535 91421 123742 76009 33527 38879 14325 -29676 -37935 -22139
9362 -22139 -34446 -33295 -31653 -7263 27589 -10028 -32838 27354 45621 -11211 4734 33753
9350 33753 40753 81558 103383 80533 62476 38485 -875 -45821 -65720 -57492 -48453 -55156 52
9337 52 23939 30240 -3043 -11246 26043 57106 37729 -8273 -43995 -72639 -44110 3420 37205
9324 37205 19804 38351 72202 69902 50764 56640 6196 -8946 3648 -7280 -65079 -91836
9312 -91836 -75639 -24139 36564 79664 62388 25020 65964 53181 7019 -24772 -56666 -63032
9300 -63032 -39175 -14023 1685 42130 32406 25057 -32484 -30169 -13817 -23475 -6292 33992 28143
9287B8143L353m0448k6998J615j0082K1014k9982l649n504J0045K4789k753l0481
9274f0938j37J9971J7823Q742M6486n599n8514K379J0351J3660N9822K7323m4455
9261C6914o8451J3161N849M4700M3277l347k3055m7805m4367p007K6931q014M1135
9248I921J2468Q694m0081P740p616Q063Q340m5489n3396K9664N2346O7093o496
9235E1251O135l0108k0509J4484K7137r522m3358J7010J4879k9866l0758L2701
9223e24O3109l00n4610j1895j3451O712l6007L8517N995J5112K6425m833K593
9210C6843m2359K1789P6921k2670J6874j1816j1611j6169l4253l644J9674N1656
9198H1235o9262n0815N4247M6004J1390m9415R448j5724m1161M6695K3467K0968
$$ plain form
9287 28143 31496 -8952 -35950 -34335 -44417 -23403 -53385 -57034 -62538 -52493 -27704 -30457 -60938
9274 -60938 -61075 -41104 -23281 -14539 31947 26348 -32166 -29787 -19436 -5776 54046 81369 36914
9261 36914 -31537 -18376 -12527 32173 75450 72103 49048 1243 -43124 -50131 -23200 -31214 9921
9248 9921 22389 31083 -8998 -1258 -8874 -811 7529 -37960 -91356 -61692 -9346 57747 51251
9235 51251 57386 27278 6769 21253 48390 38868 -4490 12520 27399 -2467 -33225 -524
9223 -524 62585 62285 7675 -4220 -17671 -10959 -46966 -8449 -2454 12658 39083 34250 36843
9210 36843 -5516 16273 93194 70524 87398 75582 63971 47802 13549 9905 29579 81235
9198 81235 11973 -38842 15405 61409 72799 23384 32832 17108 -24053 22642 46109 67077
9186F7077j1756k5835n3054J163J4764K9450K3764j2799J0693M1950j6251q432
9174F0734P7123J3840n7473l8094l9746k3736J9571n506N4318K5879j642q590
9162G6678l8403o500L360o320k0139k3820J2191N688K0859j0473j5973j8552l7310
9149e8714J3016L1595K2988k2483k2384l9971K3454L1555L0179p01M3624R546
9137F1704q027o2179p2825J8377M9405M3707L8894J1772o2595j7170N8690J5594
9125G5347l5382n3517K6979M7591m3503m5163K3448M9791j3102k3772p3502L4277
9113c0508O2779L5646l4707n1168K1755M3871j764j2470M0921k600l9178n7342
9101b4765k9301R6J6896n125J3544J0997K440m2787m7776N162O3907J0234m0578
$$ plain form
9186 67077 55321 29486 -23568 -22405 -7641 21809 45573 32774 43467 85417 69166 60734
9174 60734 137857 151697 94224 56130 16384 -7352 12219 6713 61031 86910 85268 76678
9162 76678 38275 31775 35135 28815 8676 -15144 -2953 2735 23594 13121 -2852 -21404 -58714
9149 -58714 -45698 -14103 8885 -13598 -35982 -75953 -52499 -20944 9235 8534 52158 61704
9137 61704 53677 -8502 -81327 -62950 -13545 30162 69056 80828 18233 1063 59753 75347
9125 75347 39965 -13552 13427 61018 17515 -27648 -4200 45591 32489 8717 -64785 -30508
9113 -30508 32271 67917 33210 -17958 3797 47668 45904 33434 74355 71755 32577 -24765
9101 -24765 -54066 -53970 -37074 -42199 -28655 -17658 -15218 -58005 -105781 -100619 -36712 -26478 -67056
9088f7056N2421M4540K3482L364R506k9554K809K3033r826r783M0441L895l1479
9075E5793P559J347l359K2838j5151l5940j5037j628O158Q581M1255J0237k2803
9062E9850j0822j1290O213l9181k9174j3456r214L2883M8494L1665L2437m118
9050I4287L792k5805O842L6935J7665k9647k201K951r472k2705k4708L0041O3936
9037A41911R468l9116N452R19K6068J3037R734J4160J4298L6898P957K6260k2318
9024B44728k4663n4326l5542k2276K3347M4967R727l4322l7223q5965o5477K0266
9012a6759K6993K1102p017K0583j3465k5664J5492J3840J0950l7721j2972L2295
9000B7657P294J1677L5436l828n6312J4167Q919K8166R371q601l7644k1871j4391
$$ plain form
9088 -67056 -14635 29905 53387 56751 66257 36703 39512 62545 52719 42936 83377 87272 55793
9075 55793 63352 64699 61340 84178 69027 33087 18050 16422 22580 31161 72416 82653 59850
9062 59850 49028 37738 43951 4770 -24404 -37860 -47074 -14191 34303 65968 98405 94287
9050 94287 98079 72274 79116 116051 133716 104069 101868 104819 95347 72642 47934 77975 141911
9037 141911 151379 112263 117715 118634 144702 157739 167473 181633 195931 232829 240786 267046 244728
9024 244728 220065 165739 130197 107921 131268 176235 185962 151640 114417 28452 -37025 -16759
9012 -16759 10234 31336 24319 44902 31437 5773 21265 35105 46055 8334 -4638 27657
9000 27657 34951 46628 82064 78236 21924 36091 45010 73176 82547 73946 36302 14431 40
8987D0m6675K2479L1177K9181M1594k4748p747L1435L0469L598j0284j4441k6841
8974E9237n8497K384L9466K5392j5599m1227j9289n324j8594J5968q116J0977
8962a3222J4700J0428L7086k3930k5534j3451N6664L1239j1576q095m4813n5434
8950d5938K4602L8724k0786k7716K8671L1950K6673k5240j8459M7968J7110m9721
8938B7838k1218K0649j1874l1310j4732M6328Q550m3654j8427o011K8685O009
8926i167l5122m7157M175J0412J9254L1837J3691J9214L3767j4691k2604j3136
8914i527q00Q677j229J1103k944l4738o636K7749O9952K2803o063O974r514R054
8900H4861k3180j3338J493l2917L625K7426J7630j1137q917J5274L7514L306j2402
$$ plain form
8987 40 -46635 -24156 7021 36202 77796 53048 45301 76736 107205 110803 100519 86078 59237
8974 59237 740 3124 42590 67982 52383 11156 -8133 -13457 -32051 -16083 -24199 -13222
8962 -13222 1478 11906 48992 25062 -472 -13923 42741 73980 62404 54309 9496 -45938
8950 -45938 -21336 17388 -3398 -31114 -2443 29507 56180 30940 12481 60449 77559 27838
8938 27838 6620 27269 15395 -15915 -30647 15681 24231 -19423 -37850 -43861 -15176 -9167
8926 -9167 -44289 -91446 -87271 -76859 -57605 -25768 -12077 7137 40904 26213 3609 -9527
8914 -9527 -10327 -1650 -2879 8224 5280 -29458 -36094 -8345 61607 84410 78347 85321 75807 84861
8900 84861 61681 48343 49836 16919 20544 47970 65600 54463 45546 60820 98334 101640 89238
8887H9238J4237j4028l6139K5465J8222n7424J1643J5490L1549n164L8543k479
8875A29153J8190J5881m6051m3579k8631j0403m3091l9090k8570M0276L9517J2809
8863A6411k5953q098o783m5587j2632M6713l1412k5310L0717J546K7725K7885
8851d778K4040J0682j2245J4980k4032k2666R484O2687L9826n5680m8954j6198
8839b2854l336j2954O508k1435P451P4964L2733m2690k2608k8306J0114R408J0308
8826b697J0679l168L2497N3447k3005k5868l4717m3631k5695L0334K7563L5327
8814C1066J8430P194L6309j981l8816M647J6271m9343K3672N0597k7827m0839
8802B9380k9772K1075M0057L9173k9084j2611l336j876j2896m4088j4625J7048
$$ plain form
8887 89238 103475 89447 53308 78773 96995 39571 51214 66704 98253 93089 131632 129153
8875 129153 147343 163224 117173 73594 44963 34560 -8531 -47621 -76191 -35915 3602 16411
8863 16411 -9542 -17640 -24423 -70010 -82642 -35929 -67341 -92651 -61934 -60388 -32663 -4778
8851 -4778 19262 29944 17699 32679 8647 -14019 -4535 58152 97978 42298 -6656 -22854
8839 -22854 -26190 -39144 -32636 -54071 -46620 28344 61077 18387 -4221 -32527 -22413 -13005 -2697
8826 -2697 7982 4814 37311 90758 67753 41885 7168 -36463 -62158 -31824 -4261 31066
8814 31066 49496 56690 92999 91018 52202 56849 73120 23777 47449 98046 70219 29380
8802 29380 -392 20683 60740 99913 70829 58218 54882 53006 40110 -3978 -18603 -1555
8790a555K4533M2064L623r236p312p33J794j3987l2773K024o029K1613L2055J3431
8776F9512K679J467k0263l5143n7832n987J0409L117J8008j2216m3015J4312K8877
8763b6075k0199J5617L0702J9986N1432J2237m2562k7914K6778q331O927J2000
8751E0598n1572n7174l7363N3813l227j5683m1130K8305N0456N9784K7636J2998
8739G7441l3172l8725J9275o378K9346l2553j7784r981l5029P682j7492l965K2253
8726c9082l5957N5081R4721j7289j2272M7723k0757o8202n2822P835Q0693L1365
8714G1037J2576j4030j1833k8710K7713l2410p7668m09N2949L0467l3504J3893
8702A0071J5145j0895K2331l6354R876K2831j8169k3887N0316j8122j3998M0947
$$ plain form
8790 -1555 22978 65042 68665 59429 52117 51384 53178 39191 6418 8442 2413 24026 56081 69512
8776 69512 72191 73658 53395 18252 -39580 -45567 -35158 -32041 -14033 -26249 -69264 -54952 -26075
8763 -26075 -46274 -30657 45 20031 71463 83700 41138 13224 40002 31671 38598 50598
8751 50598 -974 -58148 -95511 -41698 -44925 -60608 -101738 -73433 -22977 36807 64443 77441
8739 77441 44269 5544 24819 18441 47787 15234 -2550 -12531 -47560 -39878 -57370 -61335 -39082
8726 -39082 -75039 -19958 74763 57474 45202 92925 72168 3966 -48856 -41021 39672 71037
8714 71037 83613 69583 57750 29040 56753 24343 -53325 -53734 -785 29682 -3822 10071
8702 10071 25216 14321 36652 298 10174 33005 14836 -9051 41265 23143 9145 50092
8690E0092K1696J0042K6015J8721J0628j5103j0178J5802L4974j3819j0911o8273
8678F9686l8568m854R897o536J3940L9687K3649l2213k114k0572l0926j2312M5987
8665E4751L4532L610k0213L2220l9300j5557l833K3128K0245N5215k9551n4943
8653F0304n755l4509L5884K408k7531k0474J8866M3641j6389j0424J2080M5175
8641A03276j7862Q732J4875K4436n771l2431l7892l6868k9362j920L4683n081
8629A8815o4163j7855M590L356N294J1499M4060M0622K1768k4077k5049M2643
8617F1503L3073j5664K3580l8263m2780q261j9397l5157q308n3575K4582N7877
8605b0790j7310o266M1195N008j4476l292o161n385J653K0566P112j4302m507
$$ plain form
8690 50092 71788 81830 107845 126566 137194 122091 111913 127715 162689 148870 137959 69686
8678 69686 31118 26264 36161 29625 43565 83252 106901 74688 72574 52002 21076 8764 54751
8665 54751 89283 92893 72680 104900 65600 50043 46210 69338 89583 144798 115247 60304
8653 60304 54549 20040 55924 58332 30801 10327 29193 72834 56445 46021 58101 103276
8641 103276 85414 94146 109021 133457 127686 95255 57363 20495 -8867 -10787 23896 18815
8629 18815 -45348 -63203 -58613 -55257 -49963 -38464 5596 46218 67986 43909 18860 61503
8617 61503 94576 78912 102492 64229 21449 13188 -6209 -41366 -49674 -103249 -78667 -20790
8605 -20790 -38100 -44366 -3171 1837 -12639 -15931 -22092 -27477 -25824 -5258 1854 -12448 -16955
8592a6955P950j1166J1636M089P044O993M6728J7686j3926l2377k6318K6549K9158
8579E7091o90j417J5836m5152m0080p725O1127M0442k0341j3380j871j5109k1296
8566G435j3488R627J9296j0817J5840M723r780j0439p796Q36K5433k7036l0489
8553b6655l5002O247J580j8593L335M9540N2737j694m1378n441J5128O445K7789
8540C4038L2492m1334o487M9384k4893j3685L9468M804j8358k914J0452M137k3948
8527D3156n9390L017r286j5823M7890K2897j7191R710K1630j1330k1333M1099
8515E5046r024m5181n7025L1333P799J8226N4008N627J1844j2468q2094k2129
8503d4038k5314k6036M2805L3136k067M0847j940p5712j1644O0424K7563K6919
$$ plain form
8592 -16955 -9005 -20171 -8535 -4446 2598 9591 56319 74005 60079 27702 1384 27933 57091
8579 57091 56401 54984 70820 25668 -14412 -22137 38990 79432 59091 45711 43840 28731 7435
8566 7435 -6053 3574 22870 12053 27893 32616 22836 12397 4601 5437 30870 3834 -26655
8553 -26655 -61657 -55410 -53830 -72423 -69088 -19548 33189 31495 -9883 -15324 -196 6249 34038
8540 34038 66530 25196 18709 68093 43200 29515 68983 73787 55429 52515 62967 67104 43156
8527 43156 -16234 -13217 -22503 -38326 9564 32461 15270 24980 46610 35280 13947 55046
8515 55046 46022 841 -56184 -24851 -17052 1174 55182 60809 72653 60185 -21909 -44038
8503 -44038 -69352 -95388 -52583 -19447 -21514 19333 17393 -58319 -69963 -9539 18024 44943
8491D4943K0184j6024m6113o895P142L1116O326k2644m1190J5792M4527j306J2347
8478D8205L9603k7300n2318n6933M439o030J3701Q403Q976j2071K6990J3623J9494
8465B8782J7129j1702o2785n4437j951M8161K6173K343n7165J8898L2065L3913
8453A9424L5813j5347J459p611j7285j4165R888M0398j1471l4756J3583k9475
8441i545k8262J9280l0185J0668J9433j1170J2264J835J9569K2812M081k2587
8429H193n4986N0666J5683j8026j8987n523m3832j3031K0040O0239K9097J5715
8417D5248j1987j73K0277Q643k7405m5464r204k2900Q026l6547R97j4512M0954
8404d4047J4777k3250N894l346K9520M4671R97Q854j3515M605K9660K7005j7944
$$ plain form
8491 44943 65127 49103 2990 -3905 3237 34353 40679 18035 -23155 -7363 37164 35858 48205
8478 48205 87808 60508 8190 -48743 -44304 -50334 -36633 -28230 -19254 -31325 -4335 9288 28782
8465 28782 45911 34209 -28576 -83013 -84964 -36803 -10630 -8287 -65452 -46554 -14489 19424
8453 19424 55237 39890 41349 33738 16453 2288 12176 52574 41103 6347 19930 -9545
8441 -9545 -37807 -18527 -48712 -38044 -18611 -29781 -17517 -15682 3887 26699 30780 8193
8429 8193 -46793 3873 19556 1530 -17457 -22980 -66812 -79843 -59803 436 29533 45248
8417 45248 33261 33088 53365 62008 34603 -10861 -20065 -42965 -34939 -71486 -70489 -85001 -44047
8404 -44047 -29270 -52520 -46626 -49972 -20452 24219 25216 34070 20555 25160 54820 81825 63881
8391F3881l9965n3045j9503j5216M1362K2921q635j970J9352j7389Q727N5015
8379E5535K2424k8891m6006l4431l6716K820M2204J5319K1063k8368r208j478
8367b5733J3261O081m8101n946J6225K9689j4523M0971M655O426L7616n6259K76
8354D638M5855L2015k8488l0616L3878P605k393k8648j5148l2379k8055N866k4237
8341f0107J9302M4707k3145l5347p6585l4938k1995j2368N1854O2989J8195K0349
8329d7089J0466N9304K8894k5112j3391n2373J7160M1899j6902o0239j2996J9153
8317e1226J3110M3883j9785M473J01k7423k9752p113L9624q336n705K5597J0158
8304a2394m161L1290r182o708N741J5630k551l8348p45j8033n591J3728N1221
$$ plain form
8391 63881 23916 -29129 -48632 -63848 -22486 435 -8200 -10170 9182 -8207 520 55535
8379 55535 77959 49068 3062 -31369 -68085 -65265 -23061 -7742 13321 -15047 -24255 -25733
8367 -25733 -12472 -6391 -54492 -60438 -44213 -14524 -29047 11924 16579 23005 60621 4362 4638
8354 4638 50493 82508 54020 23404 57282 64887 62494 33846 18698 -13681 -41736 -35870 -60107
8341 -60107 -40805 3902 -19243 -54590 -131175 -166113 -188108 -200476 -148622 -85633 -67438 -47089
8329 -47089 -36623 22681 51575 26463 13072 -39301 -22141 19758 2856 -57383 -70379 -51226
8317 -51226 -38116 5767 -14018 -9545 -9444 -36867 -66619 -73732 -34108 -42444 -48149 -22552 -12394
8304 -12394 -16555 14735 5553 -1155 4586 20216 17665 -20683 -21428 -39461 -45052 -31324 19897
8291A9897k130m4361p08K9642L9561o5762j4160M0879O9629j978o448j8339J8424
8278F4146l7242m6685J9135j9058k3917M637K7407n00K4768O26M055N5370M5292
8265A18034M316p5001j678M7906O7198M9555L2744J3426k1047j5254M4994P5725
8253C40918O8656Q527K4431J73747K28479K47745K83630L51867K39985n1470l86398
8242A530117m55547l86876k71734j34368n8250p4151m3527k7021J6360j4767j7877
8231F2359L9137k1330j2518p281R778k9498j603O2866L0703k5891q448M015k1985
8218H0304J4055O9299O8723j2555M7972M2185O2545J40453J57584K00863K87596
8207A159024K97844L10017J94702r3999l39459m20621l94800k43076j36076r1016
$$ plain form
8291 19897 17767 -26594 -27302 2340 41901 -23861 -38021 2858 72487 70509 64061 45722 64146
8278 64146 26904 -19781 -646 -19704 -43621 -38984 -11577 -12077 12691 13317 17372 72742 118034
8265 118034 122350 47349 45671 93577 160775 210330 243074 256500 235453 220199 265193 340918
8253 340918 409574 418101 442532 616279 844758 1092503 1376133 1728000 1967985 1916515 1530117
8242 1530117 1074570 687694 415960 281592 223342 149191 105664 78643 95003 80236 62359
8231 62359 101496 80166 67648 60367 70145 40647 39044 101910 132613 106722 98274 102289 80304
8218 80304 94359 163658 232381 219826 267798 309983 372528 512981 670565 871428 1159024
8207 1159024 1456868 1766885 1961587 1867588 1528129 1107508 712708 469632 333556 242540
8197B42540p8784l1012q756k1988m5016k6284k23J6260L9941J5267K4991J8448
8185A45384n135l8837k2933l9924J080m5953m0907l209m660M7646J7787J097k6124
8172a4688M962K572K2K0358j2677j5564J4799j0842k3338p87J3223M6692J7648
8159D2380l8092k6826L2499q791m4521r40P0893j6230l5958n887r408P2006Q1663
8146A12788n7361m4734j1425R561m1381k0594k3612L6515M8804M8496o337j6066
8134C4654m3640J8316M26j3374Q827K928m807n319j1504j5535K8877j4034l1804
8121d5989J5473K0175L6821L0934j2141K6847n5703n8400j308Q212j4476L2633
8109a6922M2369K9316j8690l0925l3942j2764J9264Q9907n319p0693o6049K0055
$$ plain form
8197 242540 163756 132744 123988 102000 56984 30700 30477 46737 86678 101945 126936 145384
8185 145384 140249 101412 78479 38555 39635 -6318 -47225 -50434 -55094 -7448 10339 11436 -14688
8172 -14688 -9726 -7154 -7132 13226 549 -15015 -216 -11058 -34396 -35183 -21960 24732 42380
8159 42380 4288 -22538 9961 1170 -43351 -44291 26602 10372 -25586 -31473 -40881 31125 112788
8146 112788 55427 10693 -732 8829 -32552 -53146 -76758 -40243 8561 57057 50720 34654
8134 34654 -8986 9330 9756 -3618 5209 8137 3330 -1989 -13493 -29028 -151 -14185 -45989
8121 -45989 -30516 -10341 26480 57414 45273 72120 16417 -41983 -43291 -35079 -49555 -16922
8109 -16922 25447 54763 36073 5148 -28794 -41558 -22294 67613 62294 -8399 -74448 -54393
8097e4393N5697M8044J3681k5217n6983j4039K919j0291J0646L1421k8779M8696
8085B1402O246n3927n6337k885O485J4911N1711j915n5064r085P133p499M6630
8072c2194P690l3399j6218j773K4146j201J6848K9614J8583K9984L9293J1420
8060I2793n3003n9420j7230J0094N4466K242k0211j2353J3904k0004J5554K470
8048I302J1087M452K1525R711K0409j5621K1323Q108l0389J871J6008j3299m765
8035E9722K1875l4164o2203K9459K830n640J2402j7986j2350J931J4642n6495
8023d5977J275L963R299L4563J3552j996k4198k4805L0833L1801l0786O920L5423
8010C9867q110n496q645l8345k0891J126J9493k5539l2536O125Q7252M6812J5442
$$ plain form
8097 -54393 1304 49348 63029 37812 -19171 -33210 -30291 -40582 -29936 1485 -27294 21402
8085 21402 27648 -26279 -82616 -85501 -79016 -64105 -12394 -14309 -69373 -78458 -71325 -78824 -32194
8072 -32194 -24504 -57903 -74121 -75894 -51748 -52949 -36101 -6487 12096 42080 81373 92793
8060 92793 39790 -19630 -36860 -26766 27700 29942 9731 -2622 11282 -8722 6832 9302
8048 9302 20389 24841 46366 56077 76486 60865 82188 90296 59907 61778 77786 64487 59722
8035 59722 81597 47433 -14770 14689 17519 11879 24281 6295 -6055 -4124 10518 -45977
8023 -45977 -44702 -40739 -31440 3123 16675 14679 -9519 -34324 -3491 28310 -2476 4444 39867
8010 39867 31757 26261 17616 -20729 -41620 -40494 -21001 -46540 -79076 -72951 14301 61113 76555
7997G6555k0635J1870m5537K8355k9466l0437M08J960J3843k1853Q281N3322K5814
7984G2480r805j5686j8715p3647K2918l5404J4684M0599K4570J3987l5569j2494
7972a2082L0062K4047O807N067l720J7334K0589o5789m8039j971L158L4847M6060
7959E6370M7803m5373m6113Q40M6000K6774j0840n251m3653m1931p772L203J1169
7946h774j5581J4889j5683J0031q336J4363J8449k4649k4126j5832k6100K1229
7934f0120K1452l3452K4981N6501J214L653k8960l5163O276j2382J8145K2330
7922a5525L8736l4220p639k7980Q95L8025L522J2546j2658P117k3099j6056O9186
7909C2850J7591k4514k6169M0965K9376l0789m6412O030j9158j8620j4606m610
$$ plain form
7997 76555 55920 67790 22253 50608 21142 -9295 -8887 -6927 6916 -14937 -6656 46666 72480
7984 72480 62675 46989 28274 -45373 -22455 -57859 -43175 -2576 21994 35981 412 -12082
7972 -12082 17980 42027 48834 53901 50181 67515 88104 22315 -25724 -27695 -24537 10310 56370
7959 56370 104173 58800 12687 13527 59527 86301 75461 70210 26557 -15374 -23146 -19943 -8774
7946 -8774 -24355 -9466 -25149 -15118 -23454 -9091 9358 -15291 -39417 -55249 -81349 -60120
7934 -60120 -38668 -72120 -47139 9362 10576 14229 -14731 -49894 -43618 -56000 -37855 -15525
7922 -15525 23211 -11009 -18648 -46628 -45733 -7708 -4186 8360 -4298 2819 -20280 -36336 32850
7909 32850 50441 25927 -242 40723 70099 39310 -7102 -1072 -20230 -38850 -53456 -58066
7897e8066K2160J9541J0924J9042L1713k0870m9455n6282K964K1672J2103L4581
7885i973K7451J9201J9657m6236j9662N9786j5455l8070L3238m4961K5146L4593
7873D4715o9854K0060k1312m5775j3410K754K0609Q073l335L2089K0785k0726
7861b5327R932o760m38N570k236K1732j3856K7919J4374l0105k3741J0948K3152
7848A1164M420l7788P158N7009L2199k6166m5628M725p742m7391L7627l732l5105
7835d9250L8224j2910q506k1712K261O2262L7184J3545k2815j5731M1635j2226
7823E1961j6817n290l1153J3001k8039k2984K8835j5250R952J3269M318p102J4051
7810H752J2262k5697N920r97K008J6449k5518l006L5467l1841k6235m1318J1779
$$ plain form
7897 -58066 -35906 -16365 -5441 13601 45314 24444 -25011 -81293 -78329 -56657 -44554 -9973
7885 -9973 17478 36679 56336 10100 -9562 50224 34769 -3301 29937 -15024 10122 44715
7873 44715 -25139 -5079 -26391 -72166 -85576 -82822 -62213 -54140 -57475 -25386 -4601 -25327
7861 -25327 -15395 -22155 -22593 -17023 -19259 2473 -11383 16536 30910 805 -22936 -11988 11164
7848 11164 15584 -22204 -15046 41963 74162 47996 2368 7093 -649 -48040 -10413 -14145 -49250
7835 -49250 -11026 -23936 -32442 -54154 -51893 10369 47553 61098 38283 22552 64187 51961
7823 51961 35144 29854 -1299 11702 -16337 -39321 -10486 -25736 -15784 -2515 1803 -5299 8752
7810 8752 21014 -4683 1237 240 2248 18697 -6821 -9827 25640 -6201 -32436 -73754 -61975
7797f1975M7039M2892l2912j1923K292K1509j0686l039j2078j3108J4485L8510
7785B1006M9087j9500K474k3333n4703j4788J6980J1846J0347m0386j6237K920
7773e4287J6980j1409l8130P313M6932M2213m9955o4692J8851K6458o325N405
7761f0646L5348J1214p2054O072N0790J2508K8301J3598l2767L0091j5156j1362
7749d063P517N008j1682M0354j1628l016k5685j3202K2736j6427n988p316N4678
7736C1286J6189L900J1608J2998J0557q976J1881m36o5698j9553m275k9084J2364
7723a7239J4293M8801j9482K1515K8778l1085n0712n0850Q153L236J6075L2373
7711C856J7260M529k5800k2922k9930L3957L372L8210K6961k8679m1863J4414
$$ plain form
7797 -61975 -14936 27956 -4956 -16879 -14587 6922 -3764 -6803 -18881 -31989 -17504 21006
7785 21006 70093 50593 53067 29734 -24969 -39757 -22777 -10931 -584 -40970 -57207 -54287
7773 -54287 -37307 -48716 -86846 -79533 -32601 9612 -40343 -105035 -86184 -59726 -66051 -60646
7761 -60646 -25298 -14084 -86138 -80066 -29276 -16768 11533 25131 -7636 22455 7299 -4063
7749 -4063 3454 8462 -3220 37134 25506 22490 -3195 -16397 6339 -10088 -16076 -23392 31286
7736 31286 47475 51375 62983 75981 86538 77562 89443 89007 23309 3756 -519 -29603 -17239
7723 -17239 -2946 45855 26373 47888 76666 45581 -5131 -55981 -47828 -44592 -28517 3856
7711 3856 21116 25645 -155 -23077 -53007 -19050 -15678 22532 49493 20814 -21049 -6635
7699f635J2084j5358K6638N5739K0739m186j9681l6535k3287J385P244O825j5734
7686I238K9945J3774n6211P82p055k2964m807K6973M1292L691m3557l1695q572
7673d9166L7076K8961n636L475k1606m0980j7402K7469Q0703M0364R240n6874
7661C5624k9479M7030K0145l7985m0134K2067J1846J2543j4904M5841L3862j1493
7649I4963o339r1378k9303j3507j5541j5401o397K6776P743k2813P761J4891N3556
7636E011K5763L229J7556k8264m0691p102O982K9924R924J2404J2935j4688j8365
7623A4618o5489n4613L508o04M253J6479j5152L643o145k5403R373J9067k4599
7610a21064R914J6013R256O6952K222J829K064k2780j2896J9094J8904q338J3447
$$ plain form
7699 -6635 5449 -9909 16729 72468 93207 89021 69340 32805 9518 10903 18147 24972 9238
7686 9238 39183 52957 -3254 -2472 -9527 -32491 -37298 -10325 30967 34658 -8899 -40594 -49166
7673 -49166 -12090 16871 11235 14710 -6896 -47876 -65278 -37809 42894 83258 92498 35624
7661 35624 6145 53175 73320 35335 -4799 17268 29114 41657 26753 72594 106456 94963
7649 94963 88624 -2754 -32057 -45564 -61105 -76506 -82903 -56127 -48384 -71197 -63436 -48545 5011
7636 5011 30774 34003 51559 23295 -17396 -24498 -17516 12408 22332 34736 47671 32983 14618
7623 14618 -50871 -105484 -101976 -102580 -98327 -81848 -97000 -93357 -99502 -124905 -115532 -96465 -121064
7610 -121064 -111150 -95137 -85881 -18929 -16707 -14878 -12814 -35594 -48490 -29396 -10492 -18830 -5383
7597e383k0208m8619K22L8744k0426l2204J8148Q952O319j8438K5667O5795M325
7584B2894k3617l477K807j3428L4528M0147q582l5892J6620J0215k0621m9810
7572b8216m8198l096L2759O933J4765L3063l415k8370K409M4884L931j7711j2715
7559b977k0811n011n043m304K947m1564q295J5048K0512O858Q106O04Q676L0068
7545D814j8799p7901k2949L2902K1335m869L222O3481M8930o701l7273o000L7334
7532C7526j0543M188L5216o2816m1738j7061j6553l956J582K4437K8628Q0873
7520E9783j6053m4646j5567k1852L981M687K4310j7692J956N7043N778o9562k7548
7507e5382O076K1439P7314Q176q2529j4022O2213l556J2702M3310N112n428j2801
$$ plain form
7597 -5383 -25591 -74210 -73988 -35244 -55670 -87874 -69726 -60774 -54455 -72893 -47226 18569 22894
7584 22894 -723 -4200 -1393 -14821 19707 59854 51272 15380 32000 42215 21594 -28216
7572 -28216 -76414 -79510 -46751 -39818 -25053 8010 4595 -23775 -21366 23518 27449 9738 -2977
7559 -2977 -23788 -28799 -33842 -38146 -35199 -76763 -85058 -70010 -49498 -42640 -34534 -33930 -25254 4814
7545 4814 -13985 -91886 -114835 -81933 -60598 -65467 -62245 1236 50166 43465 6192 192 37526
7532 37526 26983 31171 66387 3571 -38167 -55228 -71781 -75737 -74155 -49718 -21090 59783
7520 59783 43730 -916 -16483 -38335 -34354 -29667 -5357 -23049 -21093 35950 41728 -27834 -55382
7507 -55382 -49306 -27867 49447 57623 -24906 -38928 23285 19729 32431 75741 80853 75425 62624
7494F2624k9341k6020Q766L0243K9326j2459l1215k0377j2226O252L1312n286
7482C1599j9953n1257j93K4924j4612n2143N4835Q5388L213j7954k7253n4914
7470c8320J1089J5810j9701J1418j1084J8228L2339k4952k5802M3807O220j9619
7458e67q971j8889L839N7109n094K5639k4228l5325J6205J2681L6055k0742k826
7445C4886L7087l044l4808m1825k3416j829l4997k0929K9293K3586N5402N24l7387
7432a7457m3197k2170J9183K7397K1848M046q23L1188j1169L4156K3622j1135
7420E5489j7863l2966k1044M2300K9203M381k7521J4558o090l1846j1518k4530
7408b7447k891J1445N291l5723J1003m958L4672q748j3714M706q490Q014j183
$$ plain form
7494 62624 33283 7263 16029 46272 75598 63139 31924 11547 -679 5573 36885 31599
7482 31599 11646 -39611 -39804 -14880 -29492 -81635 -26800 58588 61801 43847 16594 -38320
7470 -38320 -27231 -11421 -31122 -19704 -30788 -12560 19779 -5173 -30975 12832 19052 -567
7458 -567 -9538 -28427 -24588 32521 27427 53066 28838 -6487 9718 22399 58454 37712 34886
7445 34886 71973 68929 34121 -7704 -31120 -32949 -67946 -88875 -59582 -35996 19406 19930 -17457
7432 -17457 -60654 -82824 -63641 -36244 -14396 -10350 -11173 20015 8846 43002 66624 55489
7420 55489 37626 4660 -16384 25916 55119 59500 31979 46537 40447 8601 -2917 -27447
7408 -27447 -30338 -18893 -13602 -49325 -38322 -43280 -8608 -17356 -31070 -26364 -34854 -26840 -28023
7395b8023j4297O760l4350L4454O5495o169p8469m0819M7486N6468L1433k8244
7383A1725j4886J0701j4955K5684K7633l3181k7434R897j8019O937K4245k1421
7371a3074R517Q992K2476J1185K5659L3261l4728m6902k4129r265j2483j1481
7359d0972j4278J5501q342L7092K2727k5145K1431L3918n0743J9388P455K6503
7347D4535K308o6711l1460l7100R990l5148J4816M8477K4332L1607K8768k9374
7335E040j6297k436j3180J6268K7249l5019m5781n3408j0955K5110L1269J4343
7323e7797Q152M021K150J584o743N2660J5600k113k043J3261k7940R813K0586
7310C1191m7111r180o202L665Q926M3821J2450m170J067J380j4422j7772l7109
$$ plain form
7395 -28023 -42320 -35560 -69910 -35456 30039 23870 -54599 -95418 -47932 8536 39969 11725
7383 11725 -3161 7540 -7415 18269 45902 12721 -14713 -4816 -22835 -15898 8347 -13074
7371 -13074 -3557 5435 27911 39096 64755 98016 63288 16386 -7743 -17008 -29491 -40972
7359 -40972 -55250 -39749 -48091 -10999 11728 -13417 8014 41932 -8811 10577 18032 44535
7347 44535 46843 -19868 -51328 -88428 -78438 -113586 -98770 -50293 -25961 5646 34414 5040
7335 5040 -11257 -13693 -26873 -10605 16644 -18375 -64156 -117564 -128519 -103409 -72140 -57797
7323 -57797 -49645 -45624 -43474 -41890 -48633 4027 19627 17514 15471 28732 792 10605 31191
7310 31191 -15920 -25100 -31302 -27637 -18711 25110 37560 33390 34457 35837 21415 3643 -33466
7297c3466k9207l3036m328N2115J7433j3895p706K9664J5674K9364K2098o6175
7285b1465m7168M2730L1682J0947L914m7243j7577R801n101J780n097J1633j6008
7272d7172K770m332J0400M5559J0705L1899J9184k2795j819j8543j7998j6464
7260h606j3999j4667P591L8163J2574J3981j0082k3062n4800M2496M9098j2459
7248B6228k0542L5046L8325J1563l3758o899K6031j8973l7260k2312L5511O933
7236C9893j5572J4610l4100k8549L6981j8570L4954L7368o0749Q666j2233j9015
7224a6316j9923L3018Q671j7098l560l8103r371j3440j5709M9139N4750K7399
7212C9457k1317j1075j0044j4264j3077J5510K6225k2537l4309j3474j080L837
$$ plain form
7297 -33466 -62673 -95709 -100037 -47922 -30489 -44384 -52090 -22426 -6752 22612 44710 -21465
7285 -21465 -68633 -25903 5779 16726 20640 -26603 -44180 -34379 -39480 -37700 -42797 -31164 -47172
7272 -47172 -44402 -48734 -38334 7225 17930 49829 69013 46218 44399 25856 7858 -8606
7260 -8606 -22605 -37272 -29681 8482 21056 35037 24955 1893 -52907 -10411 38687 26228
7248 26228 5686 40732 79057 90620 56862 49963 75994 57021 19761 -2551 32960 39893
7236 39893 24321 38931 4831 -23718 13263 -5307 29647 67015 6266 14932 2699 -16316
7224 -16316 -36239 -3221 5450 -11648 -15208 -53311 -62682 -76122 -91831 -42692 12058 39457
7212 39457 18140 7065 -2979 -17243 -30320 -14810 11415 -11122 -45431 -58905 -59985 -56148
7200e6148J6786K2317L4980J2628M6578L5987k2752m5711k7525q537k794j4577
7188h768k657j7406k2071k4587l210N565M9013N3547l939j3601L1838l3456m505
7175E763p394N043M301m202L725j0789L2273o926n3978r474n789J6224O438N4321
7161B9536j6710r9606M269L7320J9468m5446k0784K1169K0962L0683j7560J7903
7149a8796j579m467J8349k3779l5885l094K626P6708J5054m077j8129L4773J9422
7136E7126r633k535m2500j1776j205J2672m612P196L826n4653L611K0339j9131
7123d1275j9322M5354J7751m394L9222K3981l3151j9018L3438J5461j5654J3475
7111E5868k5253n8167j1029K2188l6347o5861J4924M7685L0373k3086l5322N2424
$$ plain form
7200 -56148 -39362 -17045 17935 30563 77141 113128 90376 44665 17140 8603 5809 -8768
7188 -8768 -11425 -28831 -50902 -75489 -78699 -73134 -24121 29426 25487 11886 43724 10268 5763
7175 5763 -1631 3412 7713 3511 7236 -3553 28720 21794 -32184 -41658 -47447 -31223 -24785 29536
7161 29536 12826 -86780 -82511 -45191 -25723 -71169 -91953 -70784 -49822 -19139 -36699 -18796
7149 -18796 -20375 -24842 -6493 -30272 -66157 -69251 -66625 10083 25137 21060 2931 37704 57126
7136 57126 47493 44958 2458 -9318 -10523 2149 -2463 4733 8559 -46094 -42483 -22144 -41275
7123 -41275 -60597 -15243 2508 -1886 37336 61317 28166 9148 42586 58047 42393 55868
7111 55868 30615 -27552 -38581 -16393 -52740 -118601 -103677 -55992 -25619 -48705 -84027 -31603
7099c1603O0394l4760J4795N450J9237P811K3026m3873k5484o479l7558l2802
7087h1846K9930Q4322L1405j1591p305l8420J3611J5418J2558L495o072m6081
7075e76k6867J8206r279l5125N836j6313J5380M7068K8240r440O3205k9118q9221
7062c8004m0649L4222j01o9713j2695P7726M9235j9427k027N1769J9683o4151
7050a4132l2204K7052j177l2691J1999p669k7976R479K1146Q724l7533N5982K3916
7037D916j7539q131j9144J2606M0656J2895l9267n9865k7224J3260P570O3346
7025a5921N0016j3068O487J1235j9110J283n2164K1444J3429j9894k6785j1365
7013e4413M7100R13J2584j3288j0254L5187K2234j8692j8194K6342o419j9995
$$ plain form
7099 -31603 28791 -5969 8826 14276 33513 41324 64350 20477 -5007 -11486 -49044 -81846
7087 -81846 -51916 32406 63811 52220 44915 6495 20106 35524 48082 51577 45505 -576
7075 -576 -27443 -9237 -18516 -53641 -47805 -64118 -48738 -1670 26570 17130 80335 51217 -38004
7062 -38004 -78653 -44431 -44532 -114245 -126940 -49214 21 -19406 -21433 30336 50019 -14132
7050 -14132 -46336 -19284 -20461 -53152 -41153 -48822 -76798 -67319 -46173 -37449 -74982 -19000 4916
7037 4916 -12623 -20754 -39898 -27292 13364 26259 -13008 -72873 -100097 -86837 -79267 -15921
7025 -15921 34095 21027 27514 38749 19639 20922 -31242 -9798 3631 -16263 -43048 -54413
7013 -54413 -7313 -6400 6184 -7104 -17358 17829 40063 21371 3177 29519 23100 3105
7001C105m503K4815N0403R222p796Q631j2285l4369J0394j690l430l038o6160
6988b6701K6205J8980k5893j3784q499j5700m6945L2867P0304R093j5994j8927
6976a4994P65Q39L5443P435l7267j6740J8078K2345k2189l6987k1085K5167R90
6963c8200L778J4732N3674j120n6946J9028l212l3571l2226j4538J6620o52k123
6950g4756o709J0703N4693R559K0719O369l4712l3838q051J0272J5678P455J4100
6937h518R225j2527l3181Q061L0270K7834K6435P963j1379j3850j9707P560K5156
6924D3342m917k1506l895m2912L5846J6259q851N496L5060K3898J2965m1741m8261
6911G83p714l5479k3251J7119k0704j5586N6189M1122P193k7113k7745K594J5636
$$ plain form
7001 3105 -1398 23417 73820 83042 75246 83877 71592 37223 47617 45927 42497 39459 -26701
6988 -26701 -496 18484 -7409 -21193 -29692 -45392 -92337 -59470 10834 19927 3933 -14994
6976 -14994 -14229 -13390 22053 29488 -7779 -24519 -6441 15904 -6285 -43272 -64357 -39190 -38200
6963 -38200 -34422 -19690 33984 32864 -24082 -5054 -8266 -41837 -74063 -88601 -71981 -72633 -74756
6950 -74756 -81465 -70762 -16069 -6510 14209 20578 -14134 -47972 -56023 -45751 -30073 -22618 -8518
6937 -8518 707 -11820 -45001 -36940 -6670 21164 47599 55562 44183 30333 10626 18186 43342
6924 43342 38425 16919 13024 -29888 5958 22217 13366 18862 53922 77820 90785 49044 783
6911 783 -6931 -42410 -65661 -48542 -69246 -84832 -28643 12479 19672 -7441 -35186 -32592 -16956
6898a6956J3976m7764l7513L8034L9085l847o655O617J7873J4636k8193k8079
6886c8786l0607J0278M2705q031p9426k5256M0211O1968M0793j5613K2180k1226
6874h10j3846j1047j1484L5561K529J3737r987J1527J0173j9197j83L1977M2051
6861H1001l864n0269m3498K6562l9409o5967j8431O4973N3572j8573j6511N275
6849b5139M2504k7372r703J6796k8190K5939m0808j1497J7158m2971O7M6494j7156
6836e3878J3650L7040j6584j4371J2008q7416k1612Q9413N0434l883K4308j7338
6824A1771k1496R234K0559m7781l5971M8859M2374J9096l7028n9624k5815J8324
6812e7498l722Q298L5062j1701l0807m986l318J8549L8484j7158k416J6311P4550
$$ plain form
6898 -16956 -2980 -50744 -88257 -50223 -11138 -14985 -21640 -15023 2850 17486 -10707 -38786
6886 -38786 -69393 -59115 -16410 -24441 -103867 -129123 -88912 -26944 13849 -1764 20416 -810
6874 -810 -14656 -25703 -37187 -1626 903 14640 4653 16180 26353 7156 6973 38950 81001
6861 81001 77137 26868 -16630 9932 -29477 -95444 -113875 -48902 4670 -13903 -30414 -25139
6849 -25139 17365 -10007 -19710 -2914 -31104 -5165 -45973 -57470 -40312 -83283 -83216 -36722 -53878
6836 -53878 -40228 -3188 -19772 -34143 -22135 -109551 -131163 -41750 8684 4801 29109 11771
6824 11771 -9725 -491 20068 -27713 -63684 -14825 27549 46645 9617 -50007 -75822 -57498
6812 -57498 -61220 -52922 -17860 -29561 -60368 -65354 -68672 -50123 -11639 -28797 -31213 -14902 59648
6799E9648k661q832j5299n3229M747l429j929n09o223k5802j5804K9843N4273
6786A4794o870Q262K8156p482J3921j5669k9037J6839j5228p3418k0235J7188
6774f8779j6009N086L7695J6256L0453m703k9521n905K696L122J1780L6734K4596
6761D3501j100k5206k1789N680L7676J9079l4111q234n6415l0636k1768j742O4330
6748c0735K004j9542m8199k6792P8313O1928M9764K658N0449J5927k07l0402k6959
6735G8207o9118k7141N1374j433m6623J5636j7452n515j319m4922J0862M5092
6723a2352K4976k388J789o3013k0332K0736k5796j4991M6388J1227j6512j7143
6711f7411L5353L3279J9509j4066K3922M4454m249p7797j8653L2869q090K0765
$$ plain form
6799 59648 56987 48155 32856 -20373 -15626 -19055 -20984 -21493 -27716 -53518 -69322 -39479 14794
6786 14794 7924 16186 44342 36860 50781 35112 6075 22914 7686 -65732 -85967 -68779
6774 -68779 -84788 -79702 -42007 -25751 4702 -1 -29522 -35427 -32731 -29609 -17829 18905 43501
6761 43501 42401 17195 -4594 1086 38762 57841 23730 15496 -40919 -71555 -93323 -95065 -30735
6748 -30735 -28731 -48273 -96472 -123264 -44951 16977 66741 69399 119848 135775 135568 105166 78207
6735 78207 9089 -18052 33322 31889 -14734 902 -16550 -22065 -23384 -68306 -57444 -12352
6723 -12352 12624 10236 12025 -50988 -71320 -50584 -76380 -91371 -44983 -33756 -50268 -67411
6711 -67411 -32058 1221 20730 6664 30586 75040 70791 -7006 -25659 7210 -880 19885
6699A9885n0104o0786L952N872k086J0011j5067J1304j1629M609K8850N7524m5708
6686d3373n274j1444L658m6994o0174K0144N9323N9619j0877j8371J1127r902
6674e2538M0923L3435k944n6805m2514k0814L2410L311M1674k7061L6623O1053
6662D6753k9996Q407K9593P86l2091L633j035k9481q794M1585J8097m4619p7912
6649g5074j6844L0519K9319j7749j1687O4672K6033k4883N5212M1448j9548n8471
6637B2947j0272r321n077l2743r808K351K4554O4429k0583m7623k1041L0878J9507
6624H198O8310j6779m4766k1445p0368J6649N4277n516R615l2711j3840K2845
6612b5531k3463j6566K5737N2096K5941J5736K3604j7177m599j5201j9474M2375
$$ plain form
6699 19885 -30219 -91005 -87053 -81181 -83267 -73256 -88323 -77019 -88648 -84039 -55189 2335 -43373
6686 -43373 -48647 -60091 -56433 -103427 -163601 -143457 -84134 -24515 -35392 -53763 -42636 -52538
6674 -52538 -11615 21820 18876 -37929 -80443 -101257 -68847 -65536 -23862 -50923 -14300 46753
6662 46753 16757 25164 54757 55543 23452 27085 26050 -3431 -12225 29360 47457 2838 -75074
6649 -75074 -91918 -61399 -32080 -49829 -61516 3156 29189 4306 59518 100966 81418 22947
6637 22947 12675 3354 -1723 -34466 -44274 -41923 -17369 47060 26477 -21146 -42187 -11309 8198
6624 8198 76508 59729 14963 -6482 -76850 -60201 -5924 -11440 -1825 -34536 -48376 -25531
6612 -25531 -48994 -65560 -39823 12273 38214 53950 77554 60377 55778 40577 21103 63478
6600F3478L841m1743l1994m0164J0417M4930j2645o611j045m5009l5851K3772
6588f8624P073L4543j4355j7865L6470Q504K1659m0706k5221M181P1785l6265
6576a8821o8193k8541N388J2832j442J9222p711k1138o299J3992L5551L1132n0328
6563h4356K2615P4084J2420l3272j9442J8503j9428n4360k3025J981J824K4099
6551g8357K7465J8029j4260l6547k1504L0731K3890J9879M1051l3844j3614j7928
6539e5009L6121K250k1346j4100J1595J372P07L8372K6904k1913m6108o0343L6903
6526f4595K3590L3078K3282m359P443j1543o0655l233M2851O445O2842Q8504O461
6513A50111k6888l5424n747k0189l7534l7032k5335Q713L4853K8365k4961l072
$$ plain form
6600 63478 67319 25576 -6418 -46582 -36165 8765 -3880 -10491 -11536 -56545 -92396 -68624
6588 -68624 -61551 -27008 -41363 -59228 -22758 -14254 7405 -33301 -58522 -54341 17444 -18821
6576 -18821 -87014 -115555 -110167 -97335 -98777 -79555 -87266 -108404 -114703 -100711 -65160 -34028 -84356
6563 -84356 -61741 12343 24763 -8509 -27951 -9448 -28876 -83236 -106261 -104280 -102456 -78357
6551 -78357 -50892 -32863 -47123 -83670 -105174 -74443 -50553 -30674 10377 -23467 -37081 -55009
6539 -55009 -18888 -16638 -37984 -52084 -40489 -39117 -38410 -38 26866 4953 -41155 -101498 -64595
6526 -64595 -41005 -7927 15355 10996 18439 6896 -53759 -56992 -14141 -7696 55146 143650 150111
6513 150111 123223 87799 82052 61863 24329 -12703 -38038 -29325 5528 33893 8932 5860
6501E860r988l6830k1733M135M7695L373l0996k5274J304k1003L3533J6039J500
6488c2385J9660J576Q516K0112K61Q663O3261j407l9578l2219k979r155l3656
6475b9330M1067L2743J1998k522l0233l9640n43o857j3374K0621P348n488k4182
6462c8392m297R551K3090p804n822l991M0040J9427k8127m3745l894M4282K0509
6449B0827m422J3344J9006j1664m3180j4463j9450l321N975L8880J0458L0039
6437D2029j2027K8857j3294l2147m2389k9070K4410n158l723Q487L705K4243O2793
6424E6716p614m1962n604L6477n5774p817L4523j6516m2127j9698J2301L1343
6412b5752K9748K2391j1733P84K071j3935l1538k6324J278M5915M6736l5631K3872
$$ plain form
6501 5860 -4128 -40958 -62691 -58556 -10861 -7488 -38484 -63758 -62454 -83457 -49924 -33885 -32385
6488 -32385 -12725 -11149 -2633 17479 17740 26403 89664 88257 48679 16460 13481 4326 -29330
6475 -29330 11737 44480 56478 53956 23723 -15917 -16460 -23317 -36691 -16070 -8722 -14210 -38392
6462 -38392 -42689 -33138 -10048 -17852 -23674 -27665 12375 31802 3675 -40070 -43964 318 20827
6449 20827 16405 29749 48755 37091 -6089 -20552 -40002 -43323 -37348 1532 11990 42029
6437 42029 30002 58859 45565 13418 -28971 -58041 -33631 -38789 -42512 -34025 -30320 -6077 56716
6424 56716 49102 7140 1536 38013 -17761 -25578 8945 -7571 -49698 -69396 -57095 -25752
6412 -25752 3996 26387 14654 15438 17509 3574 -27964 -54288 -53010 -7095 39641 4010 27882
6399B7882j4633j846j5097j4026J9974J9967j2470k3854J6288P188J0911K1955
6387D2239N100n4663k4782L1182l0979q320M0958J9821L0304j5308k8053J1529
6375A9028K1931j2461L976J731k6499M7152N742n1904k0571K1648o10m5265l0559
6362f6661N6653l849j3350k3277j93J3222N307j2395L2931r632o3153p412L4195
6349e7614K9553N5405n8017m6285O3773O0946J4114k4473M689l1444M169k2447
6337g631O555l882Q039j4576J1031k3350M2514J9382K4092l9313l5367K453M2663
6324C2610L1740j2280k9349m5992k0174K7735k5644l2182j6755K127q16M9952
6312c9028M3579M0670m040n0166k1727k531m169K2460L3692m8561n3538K0511
$$ plain form
6399 27882 13249 11403 -3694 -17720 2254 22221 9751 -14103 2185 9373 20284 42239
6387 42239 47339 -7324 -32106 -924 -31903 -40223 735 20556 50860 35552 7499 19028
6375 19028 40959 28498 32474 34205 7706 54858 60600 8696 -11875 9773 9163 -36102 -66661
6362 -66661 -10008 -13857 -27207 -50484 -50677 -37455 -32148 -44543 -11612 -21244 -84397 -91809 -57614
6349 -57614 -28061 27344 -30673 -76958 -13185 47761 61875 37402 42091 10647 14816 -7631
6337 -7631 -1076 -4958 3081 -11495 -464 -23814 18700 38082 62174 22861 -12506 -10053 32610
6324 32610 64350 52070 22721 -23271 -43445 -15710 -41354 -73536 -90291 -88164 -88980 -39028
6312 -39028 4551 45221 41181 -8985 -30712 -33243 -37412 -14952 18740 -29821 -83359 -62848
6300f2848L8992J4504N8365P184N377R83j6607P99L750k3658m6962l0912K5223
6287b5810K3703J1958l6926j0654l1028J5065J9675K7444k1176k8563l803K094
6275e8021j7407N7651K7522o3751j5723O941K8934O18j7015K6736K4434l324J7918
6262A5513l5269J4108Q633J3749J3451L6448r481j5488n6953O844M5393N2149
6250H9097k907m4980m2366n714j0381l090N0995k0073l1402P357P464N3254J8494
6237F5748k704m9250p0149N411j1257m6859J2834K5050R280M539K0823N4326L3746
6224E1538m982l6336l7512k8407J3611N0438R409K8643N8174L676k4002n4943
6212B9307l8157j7874R600j384l3374R221K5809K2430j187J5619m6931J8693O134
$$ plain form
6300 -62848 -23856 -9352 49013 56197 61574 62557 45950 46749 50499 26841 -20121 -51033 -25810
6287 -25810 -2107 9851 -27075 -37729 -68757 -53692 -34017 -6573 -27749 -56312 -60115 -58021
6275 -58021 -75428 -17777 9745 -54006 -69729 -62788 -33854 -33236 -50251 -23515 919 -2405 15513
6262 15513 -19756 -5648 2985 16734 30185 66633 57152 41664 -15289 -8445 36948 89097
6250 89097 86190 41210 -1156 -6870 -17251 -20341 30654 10581 -20821 -13464 -6000 47254 65748
6237 65748 63044 13794 -56355 -50944 -62201 -109060 -96226 -71176 -61896 -57357 -36534 17792 51538
6224 51538 46556 10220 -27292 -55699 -42088 8350 17759 46402 104576 108252 84250 29307
6212 29307 -8850 -26724 -17124 -18508 -51882 -42661 -16852 5578 4391 20010 -26921 -8228 -2094
6199b094n4212K354j5351q149M6809L9517k4574J0359q314n753M2837K3288k4368
6186B2349m6542l4593M8615N4813N801q7549k8429N4929M5359m8084j2503m1654
6174f7488J5447L6305l2362m2326j3084K4284M7895J3045k6537J6793M2133K1986
6162C6091m7392l9466J8573L2349J4658l8306K5670J3339k0620M5409j16p6731
6150c6542j6305O2064O3699l2734j6071k8427m6892o520q193j3184R277P9489
6138I661m608j4016L1380m6255p4155k9392J8175M6177N7172R433l8125q735R708
6125c3580L3792K6206L3251p6428n6602P262M0725L8146j3595J8536l9240j2830
6113c4357L3663K8320m3690O477K0632j8909j355M8948Q575k9697l5899K6687
$$ plain form
6199 -2094 -56306 -53952 -69303 -77452 -30643 8874 -15700 -5341 -13655 -19408 23429 46717 22349
6186 22349 -24193 -58786 -10171 44642 50443 -37106 -65535 -10606 34753 -13331 -25834 -67488
6174 -67488 -52041 -15736 -48098 -90424 -103508 -79224 -31329 -18284 -44821 -28028 14105 36091
6162 36091 -11301 -50767 -32194 155 14813 -23493 2177 15516 -5104 40305 40189 -36542
6150 -36542 -52847 9217 72916 40182 24111 -4316 -51208 -57728 -65921 -79105 -69828 9661
6138 9661 5053 -8963 22417 -23838 -97993 -127385 -109210 -63033 -5861 3572 -34553 -43288 -33580
6125 -33580 212 26418 59669 -16759 -73361 -66099 -25374 12772 -823 17713 -21527 -34357
6113 -34357 -694 27626 -16064 -9587 11045 -7864 -9219 39729 48304 18607 -17292 9395
6101I395K2091p43q863j1969k5413L061K5939j0289j5333J9725k3619N314M6362
6088C5658j4389k5307K7072k0700j522k8369j5684Q1109J0911m1463O415L922
6076A7653k4912J2373J2775j0961P473L3920n871L276j332q263l084q261j9326
6063E460K1121l4800n4033j292o26N2468M3730o549m9588l2709J7490K5498r353
6050b3183J064L3588J9949J0772r454l6834k556M1532j0848j7659N8821K0606
6038H5798m7607n4536k9416j5218j9807J7948L8022j8228k8234K0982l214q2J216
6025e2376O4944J4465k6876j1412L4162L0823K7113J5876k1320k057j9154k5462
6013B8726l8495j9793K3744M1103K0480J4988k6190l588J7271K150j7139Q046
$$ plain form
6101 9395 31486 30743 21880 9911 -15502 -12441 13498 3209 -12124 7601 -16018 -10704 35658
6088 35658 21269 -4038 23034 2334 812 -27557 -43241 37868 48779 7316 13731 17653
6076 17653 -7259 5114 17889 6928 14401 48321 42450 45726 44394 36131 33047 24786 5460
6063 5460 26581 -8219 -62252 -63544 -64170 -11702 32028 25479 -24109 -56818 -39328 -13830 -23183
6050 -23183 -22119 11469 31418 42190 32736 -4098 -6654 34878 24030 6371 65192 85798
6038 85798 38191 -16345 -45761 -60979 -80786 -62838 -24816 -43044 -71278 -50296 -53510 -53592 -52376
6025 -52376 12568 27033 157 -11255 22907 53730 80843 96719 75399 73342 54188 28726
6013 28726 -9769 -29562 -5818 35285 55765 70753 44563 40975 58246 60396 43257 51303
6001E1303m767m6650M222J4547K615K034L723m297l8822r57O1726L7938n8060
5988B4555l6193K4873N9212P442N397j7462k216R877l3179m6013j6836J9338k8897
5975c0102m3473j375M4894j1927J1268p22J9806R692n662k7848k1639N243K1182
5962c0663j4382l2851M6452L1133r087n3564P890k479j8061K2355K8317J3408
5950a1532o954K6000P185l9829K6796J0693j9340j4549M601j7036k7694N2425
5938i234M8097n59l8708R070j1232k2335l18k574k4305J0700K6295j0327k3509
5925d8939J7180K978j1109j3868l996K4416K9101J4825m948j1031L031l974J8081
5912A1747j461j6969k0275J2230k6611L7505K5762j2100K0429K4500j6203k0618
$$ plain form
6001 51303 46536 -114 4108 18655 21270 23304 27027 22730 -16092 -17049 44677 82615 24555
5988 24555 -11638 13235 72447 79889 85286 67824 65608 75485 42306 -3707 -20543 -1205 -30102
5975 -30102 -73575 -74950 -30056 -41983 -30715 -31437 -11631 -1939 -7601 -35449 -57088 -51845 -30663
5962 -30663 -45045 -77896 -31444 -311 -9398 -62962 -55072 -57551 -75612 -53257 -24940 -11532
5950 -11532 -18486 7514 14699 -25130 1666 12359 -6981 -21530 -16929 -33965 -61659 -9234
5938 -9234 38863 38304 -404 8666 -2566 -24901 -25219 -27793 -52098 -41398 -15103 -25430 -48939
5925 -48939 -31759 -28781 -39890 -53758 -57754 -33338 -4237 10588 5640 -5391 -2360 -6334 11747
5912 11747 10286 -6683 -26958 -14728 -41339 -3834 21928 9828 30257 54757 38554 17936
5900A7936l2535n0148R307P9255K8178p0517q4652K3308K8990j9986m292K6645
5888d8511O715j9401K6858N6831j1227o4052J8485J5887j6434m8591L8993J4432
5876c0015n130K7962k6473j1153j2608J9530K3735j1951j930L3428N892j2312
5864a025J7152n6433k4459p526J3098O8324R488n9330m0366N4412N4545J6763
5852D4643K307k0660k7487J1571K9947j2077N843k0519k9730k1801N1326K9612
5840D2975m505p229l184l0030n477K177L5370k9705k4607K3058M0211j027m6075
5827h048q574K5235j8201J2919n127k0284m0115J4119j7965N5911L1877j5381
5815F366k8705L126K114k727N1656K5681k4245p031j1389k5704J0794k6714M377
$$ plain form
5900 17936 -14599 -64747 -55440 23815 51993 -18524 -103176 -79868 -50878 -70864 -75156 -48511
5888 -48511 -41796 -61197 -34339 22492 11265 -52787 -34302 -18415 -34849 -83440 -44447 -30015
5876 -30015 -35145 -7183 -33656 -44809 -57417 -37887 -14152 -26103 -28033 5395 11287 -1025
5864 -1025 16127 -40306 -64765 -72291 -59193 9131 18619 -40711 -81077 -26665 27880 44643
5852 44643 46950 26290 -1197 10374 40321 28244 34087 13568 -16162 -37963 13363 42975
5840 42975 38470 31241 28057 -1973 -7450 -5273 30097 392 -24215 -1157 39054 38027 -8048
5827 -8048 -16622 8613 -9588 3331 -1796 -22080 -62195 -48076 -66041 -10130 21747 6366
5815 6366 -22339 -19213 -17099 -19826 31830 57511 33266 26235 14846 -10858 -64 -26778 -22401
5802b2401o547l262J3780J1517m5262j4393J816k2228k481P3632N6063L6194O000
5789H2428L9787k5029K230m022j9782k8472m3800O492n3845o619M3055J0267J147
5776C837K4033N4147q4194p2906k9446l724j9192N4471K8438J8826M0761m6991
5764c1940j8636N3481K4857L5754J0948m1800l0375M1781o010k8408q486l2451
5752c1285r39k431K8128J33l1060K9981L1299P881k4210k1092J7286j7352K231
5739a1430K052J6461j8730n9920L597L3919p657r514K094J851J4777o9K2989j4666
5725b4246o5945O983K7155j7563M8092N2161j1106o0869k9573M8448K0356k3945
5713c0052j0125L3371N0664k754l4410m2794J3263K8134l4969P310K7767L8091
$$ plain form
5802 -22401 -28948 -32210 -18430 -6913 -52175 -66568 -64752 -86980 -89461 -15829 40234 76428 82428
5789 82428 122215 97186 99416 95394 75612 47140 3340 9832 -44013 -50632 -7577 2690 3837
5776 3837 27870 82017 -2177 -75083 -104529 -108253 -127445 -72974 -44536 -25710 15051 -31940
5764 -31940 -50576 2905 27762 63516 74464 32664 2289 44070 38060 9652 1166 -31285
5752 -31285 -32224 -34655 -6527 -6394 -37454 -7473 23826 31707 7497 -13595 3691 -13661 -11430
5739 -11430 -9378 7083 -11647 -71567 -67970 -34051 -41708 -51222 -49128 -47277 -32500 -32569 -9580 -24246
5725 -24246 -90191 -83208 -56053 -73616 -25524 26637 15531 -45338 -74911 -26463 -6107 -30052
5713 -30052 -40177 -6806 43858 41104 6694 -36100 -22837 5297 -29672 -22362 5405 43496
5701D3496J7972j3973o4320q595L0886p226J7810K1436K0179j3600m4186r4R899
5688I684j374J8221p507m4251m6655j857J3349P029K6721L9454k777k309l012
5675D716R836K4340l4711j1246q133O8024K6803j4811j6538j6044j3957k3409
5663e130P409K0509k2024m9412l684J318k0163L1152J6867l715j1387K962J534
5650c3764M734m523M6447j0134O28n510K24p860J718L0796J2026j9752j4928k5403
5636b5301k0583K5431J9466k4948j5662M1849L4928J0878l7957J4042J5343n816
5624C1670J6489K7520k2504k0394m2308l8648m2114J4500l7890j5677M7817O0492
5612b1047J3989J5343n609l7421K2973J9791m0177k8458P482P165l027Q362K0300
$$ plain form
5701 43496 61468 47495 -16825 -25420 5466 -1760 16050 37486 57665 44065 -121 -215 9684
5688 9684 8310 26531 19024 -25227 -71882 -73739 -60390 -53361 -26640 12814 10037 7728 4716
5675 4716 14552 38892 4181 -7065 -15198 52826 79629 64818 48280 32236 18279 -5130
5663 -5130 2279 22788 764 -48648 -52332 -51014 -71177 -40025 -23158 -26873 -38260 -35298 -33764
5650 -33764 -29030 -33553 12894 2760 3388 -2122 -1898 -9758 -8040 22756 34782 15030 102 -25301
5636 -25301 -45884 -20453 -987 -25935 -41597 252 35180 46058 8101 22143 37486 31670
5624 31670 48159 75679 53175 32781 -9527 -48175 -90289 -75789 -113679 -129356 -81539 -21047
5612 -21047 -7058 8285 2676 -34745 -11772 8019 -32158 -60616 -53134 -45969 -48996 -40634 -20334
5599b0334k8453n888j0269j752M8123R959k2229J0452j6974L993J2616n133K3275
5586b614K8079O6935k215n3908j0594k0352K5107L0529m3402k5325j5816j0301
5574c3877j2066L0899M7549K7549L725q744k016l5762J3307J2068N2639j2990
5562H2281l3798k5888j4440R542j4418m831M4737N846l878l5646j4039Q812K0395
5549B4675j5834m3958K6591K1533k0881L3532L278n477m5952k5071J9283n6460
5537h4741R97J5840L9504J2030Q696n2K4022L0006J3256o2516K020N3860o398
5524D6524l1592n0604j4694j851L7905K3057R397n307K4196J6539j1454k0460
5512B1656k2324k2140J8217J5264O5714j2958k9261J5974L9634M84l3372m3377
$$ plain form
5599 -20334 -48787 -54675 -64944 -66696 -18573 -8614 -30843 -20391 -37365 -33372 -20756 -25889 -2614
5586 -2614 25465 92400 90185 36277 25683 5331 30438 60967 17565 -7760 -23576 -33877
5574 -33877 -45943 -15044 32505 60054 63779 55035 53019 17257 30564 42632 95271 82281
5562 82281 48483 22595 8155 17697 3279 -1552 43185 49031 45153 9507 -4532 4280 24675
5549 24675 8841 -35117 -8526 13007 -7874 25658 28936 23459 -22493 -47564 -28281 -84741
5537 -84741 -83744 -67904 -28400 -16370 -7674 -7726 16296 46302 59558 -2958 -938 52922 46524
5524 46524 14932 -35672 -50366 -52217 -14312 8745 18142 12835 37031 53570 42116 21656
5512 21656 -668 -22808 -4591 10673 76387 63429 34168 50142 89776 90260 56888 13511
5500A3511l5624N0259J6432p3668k8578L3911l4417K2056M6940k6529J5978M804
5488E075j3292j4737J647K263m5596p418K7708P054j8650p357k538l005M3602
5475b5244P0123K0330l2278l7652n3108j0795N2637K9432j109l6796k0443k6784
5463g1687m5950M0045M8454j9548K35P2418L1349j4275J201m9112O979k960O481
5450C630q753l6669k8971M537P42j2749J1360N1439N8867k28k328Q598k8437l1910
5436a0872L9723L9713L4961k887l8323j9275l960j536j8898K9015j3527r776L503
5423B7861J0817j9153n1823j7600L4828k8164K5322M3125j0510n8271n5241K2884
5411g5925N0222k8769l9498M8267K2854J6023L1698K153J42l7274J1159o036o4426
$$ plain form
5500 13511 -22113 28146 44578 -29090 -57668 -23757 -58174 -36118 10822 -15707 271 5075
5488 5075 -8217 -22954 -21307 -19044 -64640 -72058 -44350 -37296 -55946 -63303 -65841 -68846 -25244
5475 -25244 44879 65209 32931 -4721 -57829 -68624 -15987 13445 12336 -24460 -44903 -71687
5463 -71687 -117637 -77592 -29138 -48686 -48451 23967 55316 41041 42242 -6870 109 -2851 3630
5450 3630 -5123 -41792 -70763 -66226 -65484 -78233 -66873 -15434 43433 43205 40877 49475 21038 -10872
5436 -10872 28851 68564 103525 100638 62315 43040 39080 37544 18646 47661 34134 24358 27861
5423 27861 38678 19525 -32298 -49898 -15070 -43234 -17912 25213 14703 -43568 -98809 -75925
5411 -75925 -25703 -54472 -93970 -45703 -22849 -6826 24872 27025 27167 -10107 1052 -4984 -69410
5398f9410L1246k69N2905L4216o115J9241m6801O447m0676m0348L9513J9063K78
5385g10O92M675J7821R08O654q496o227j4206k9486j3722P611l2479J7099M3489
5371f377K9062m323J9353K446N583l3519l2387L642j200j5371j5775O6596N1768
5358F9498l4089m680J5809k5323L969J3491j1409o093m4315l6497j4681R400J9239
5345d5681L9369K3726l6629J8854p953m8744K6527L7492L7056j4245n4882M1575
5333A6465Q627k6088O249K1342m52l1977k4339K4661J7022J9803j8932j6149L1747
5320B7979n0748M148L4734K2732j9536l5620m5525N870K1725J0315O777L5974
5308A8825m0250l4857j071M022N6700L771k0054n990N0530R583L9328O005n7479
$$ plain form
5398 -69410 -38164 -38433 14472 48688 42573 61814 15013 21460 -19216 -59564 -20051 -988 -710
5385 -710 -18 4657 22478 23386 30040 21544 15317 1111 -28375 -42097 -34486 -66965 -49866 -6377
5371 -6377 22685 18362 37715 40161 45744 12225 -20162 -16520 -17720 -33091 -48866 17730 69498
5358 69498 35409 30729 46538 21215 25184 38675 27266 21173 -23142 -59639 -74320 -64920 -45681
5345 -45681 -6312 17414 -19215 -361 -8314 -57058 -30531 6961 44017 29772 -25110 16465
5333 16465 25092 -996 5253 26595 26143 -5834 -30173 -5512 11510 31313 12381 -3768 27979
5320 27979 -22769 -18621 16113 38845 19309 -16311 -61836 -55966 -34241 -23926 -17149 18825
5308 18825 -21425 -56282 -57353 -53331 3369 7140 -12914 -18904 31626 41209 80537 86542 29063
5295B9063k8396k610M123M34L2260j2841l2051L0638L9350j715j2450j5420j7397
5282A2988j4151R30K5530L9382K8448k422q9844l9783q078k4172L717K0607M5626
5269a222j828j9313j8319P95N9453M4087M33l0762k6856J1087j0512O989J6313
5256C0345m470O096l9020J7988L1844K0337l1715j4552p815o057o950l2751j0620
5243d7340n490M7284L0401m6623J1218N806o097m9381J4925L4618L9212O77j7515
5230A1695N17j6849N6363L0222m1742j956l2199j5600k2561j3784L2030P1932
5218E8068n676k9078j7214q040J9062L0004M7920k4489M671R178j1700l9088j9728
5205A3890J0756K9802Q272l1775n8348l575K7798K0435l9883K9441J709j7971
$$ plain form
5295 29063 667 -1943 2180 2614 34874 22033 -10018 20620 59970 58255 45805 30385 12988
5282 12988 -1163 -233 25297 64679 93127 90705 861 -38922 -47000 -71172 -67455 -46848 -1222
5269 -1222 -3050 -22363 -40682 -39887 19566 63653 64086 33324 6468 17555 7043 14032 30345
5256 30345 25875 31971 -7049 10939 42783 63120 31405 16853 9038 2981 -3969 -36720 -47340
5243 -47340 -52830 -5546 24855 -21768 -10550 -4744 -10841 -60222 -45297 -10679 28533 29210 11695
5230 11695 12212 -4637 51726 81948 40206 38250 6051 -9549 -32110 -45894 -13864 58068
5218 58068 52392 23314 6100 -1940 17122 47126 95046 70557 75228 84406 72706 33618 13890
5205 13890 24646 54448 62720 30945 -27403 -30978 -3180 17255 -22628 6813 8522 -9449
5193i449L571M194m6866L491m657L8597r421K3505k1211q6028J209R7994M7640
5180D2569J401l1879k871Q555O664r944l7029j3292L5018J5016J4166Q920o126
5167C1168J835k6707k3343j1814L461o19o029M3130K2392K7015j0095m4268k744
5154C382J1253j00086n1087Q165L8756J080J301Q3850L9505N789l744N006j9934
5141B3236k0205N104L0066j0398n5167K9833l844m4081j100J709L0780k700L5709
5128A8942J8157J5051q177m0560k0740m859o0124o239O753O2137J352k2427L0536
5115a0198l2665J5881K4670K3287k2966j9176O367j9361k9511p602J4414N3461
5103c399J7752j8598M3891q494p8642M44M0206k4795j7932N847J4949J2889J4567
$$ plain form
5193 -9449 -5878 -1684 -48550 -45059 -49716 -11119 -20540 2965 -18246 -104274 -103065 -5071 42569
5180 42569 43970 12091 9220 17775 24439 14495 -22534 -35826 -808 14208 28374 37294 31168
5167 31168 33003 6296 -17047 -28861 -25400 -26019 -32048 11082 33474 60489 50394 6126 3382
5154 3382 14635 -85451 -136538 -128373 -89617 -88537 -87236 -3386 36119 41908 38164 43170 23236
5141 23236 3031 8135 38201 27803 -27364 2469 -1375 -45456 -46556 -44847 -14067 -16767 18942
5128 18942 37099 52150 43973 3413 -17327 -22186 -82310 -88549 -81796 -19659 -18307 -40734 -10198
5115 -10198 -42863 -26982 -2312 20975 -1991 -21167 -14800 -34161 -63672 -71274 -56860 -3399
5103 -3399 14353 -4245 39646 31152 -47490 -47046 -6840 -31635 -49567 -43720 -28771 -15882 -1315
5090a315J2923k3914l8168L5496K3205k2551l947K1155p304j4371o907K5500j9663
5077a9861k7612K153K3591k2729M0534K4139J0457L5010M2907j2386n4820m9713
5065h330j6778R400J3594L1758o04q628Q161k4956k6864k8905p382J0465k2265
5052g1334K1688K8372J2152K4209K9917K2326J1721m5525J1514o0919n5881j6634
5040h8394l139k7880j0740N1414K7627m0182N3092N3913j0681R2l6239n4258j1380
5027i6755K5187r24j2960J4879N6306M1495J6650k9622J4724K4722K3198l6481
5015D0419m5065L5668L272J2496k2441l9601r097N638k572l835j0118K4650k8934
5002c9520P12j0366K0182K7699j7399O4653N1369k8672n6213L917J9020L0156
$$ plain form
5090 -1315 11608 -12306 -50474 -14978 8227 -14324 -18271 2884 -4420 -18791 -25698 -198 -19861
5077 -19861 -47473 -45320 -21729 -44458 -3924 20215 30672 65682 108589 96203 41383 -8330
5065 -8330 -25108 -15708 -2114 29644 29040 20412 28573 3617 -23247 -52152 -59534 -49069 -71334
5052 -71334 -49646 -21274 -9122 15087 45004 67330 79051 33526 45040 -15879 -71760 -88394
5040 -88394 -91533 -119413 -130153 -78739 -51112 -91294 -38202 15711 5030 5122 -31117 -85375 -96755
5027 -96755 -71568 -72492 -85452 -70573 -14267 27228 43878 14256 28980 53702 76900 40419
5015 40419 -4646 31022 34294 46790 24349 -15252 -24349 -18711 -21283 -25118 -35236 -10586 -39520
5002 -39520 -38808 -49174 -28992 -1293 -18692 45961 97330 68658 12445 16362 35382 65538
4990F5538m3371k1534m065J3338o213n831J435K8649P577k5068m2416l1055L5502
4977b7514O3117K3226n0773l4767m1510J3972J0150j9249N132M5729O241N1435
4965D5189O768o0069j9043M8032K3255m1559l0838N3843K0375J1905n5235k0642
4953a8019j7353j0512k0320J5826k144J2883M0484J7985k2730p416O002O763j1032
4940i583j0966o502j6574L1446K2972j590K7593j4751P401k7860k7940K3644L7990
4927C5280k8468o8129k4640l3512r170K8666r250K7740O1098j904J5036O4369
4915E7116J9751K652k0883l5060J8450k2850k0676l1816Q152l787N2813P874N37
4902C2273J9924o017q071k0879q4023r017L6635K2128L3202N337K8597L4078k4660
$$ plain form
4990 65538 22167 633 -3432 9906 3693 -2138 -703 27946 35523 10455 -31961 -63016 -27514
4977 -27514 35603 58829 8056 -26711 -68221 -54249 -44099 -63348 -58216 -12487 -6246 45189
4965 45189 51957 -8112 -27155 20877 44132 2573 -28265 25578 45953 57858 2623 -18019
4953 -18019 -35372 -45884 -66204 -50378 -52522 -39639 845 18830 -3900 -11316 -5314 1449 -9583
4940 -9583 -20549 -27051 -43625 -12179 10793 9203 36796 22045 29446 1586 -26354 -2710 35280
4927 35280 6812 -61317 -85957 -119469 -128639 -99973 -109223 -81483 -20385 -22289 -7253 57116
4915 57116 76867 79519 58636 23576 42026 19176 -1500 -33316 -25164 -28951 23862 31736 32273
4902 32273 52197 46180 38109 17230 -66793 -75810 -39175 -17047 16155 21492 50089 84167 59507
4889E9507k6100J210l4482j8136K3840L9139q737l8084l4803J5204N473L3781
4877A7812j7685K009j1282J2737M3630K7588j6905m3843l463k2337k3640R581
4865b5798K6800L247L2279j494J9046L8573k3760r574n618m6108m0373M1576J0792
4852A9588K0939L7838k0017j7760j2284k0224K0336M06k1541o494r912j5986K6128
4839A017l3035m7247L6714K9202j223J4242k2975k7957n846N607m772J892O8058
4826A3677L7701k8908o925j2643p187o621K8010j4394L212j358l9049k779Q653
4813b8611K6885J2723j1848l7522j4039O09K3475M1952L7300j1321J5746k0782
4801C4567L444m9181o5930M7554M1606J0828k9356J4410J2838J2151n295l3846
$$ plain form
4889 59507 33407 34617 135 -18001 5839 44978 36241 -1843 -36646 -21442 -15969 17812
4877 17812 127 2136 -9146 3591 47221 74809 57904 14061 10598 -11739 -35379 -25798
4865 -25798 1002 4249 36528 35034 54080 92653 68893 59319 53701 7593 -32780 8796 19588
4852 19588 40527 78365 58348 40588 28304 8080 28416 28822 7281 787 -9125 -25111 1017
4839 1017 -32018 -79265 -42551 -13349 -14572 -330 -23305 -51262 -57108 -51501 -56273 -54381 13677
4826 13677 51378 22470 15545 2902 -4285 -10906 17104 2710 5922 4564 -34485 -37264 -28611
4813 -28611 -1726 10997 -851 -38373 -52412 -51803 -28328 13624 50924 39603 55349 34567
4801 34567 38011 -11170 -77100 -29546 12060 22888 -6468 7942 20780 32931 27636 -6210
4789f210k8197K8417K6053j2859J6748n4864M0414O1986k0862p6773o3989J0747
4777g9389Q844M4245j0382M3389M9987l2372k2525k8512m9092M171O3603J8938
4765A0905l2993J6613O689j2902l3168J4726P780L432L7687L7513o072p3572j9419
4752d2781J6640k4432J9397k0121o505J6027m0197k1092N65l0614J5603L416J4733
4739i9361N3476K0658j908O65K7846N0614J8113p038k4220m4912K1311L5335K0309
4726G0888n5025j1938k3216j1584O09j5125J6271K9183j0697J0179J5721L5174
4714E0440M2784m3833n3714k3947k6849J2914j80J9309p46k4542L2571N0550L6282
4701G1039N728j6665J9217p3913n4292r427P327N1544M9499j3816j6728j7613
$$ plain form
4789 -6210 -34407 -5990 20063 7204 23952 -30912 9502 71488 50626 -26147 -90136 -79389
4777 -79389 -70545 -26300 -36682 6707 56694 24322 1797 -26715 -75807 -71636 -8033 10905
4765 10905 -22088 -5475 1214 -11688 -44856 -30130 -22350 -18918 18769 56282 50210 -23362 -42781
4752 -42781 -26141 -50573 -31176 -51297 -57802 -41775 -81972 -103064 -102499 -133113 -117510 -114094 -99361
4739 -99361 -45885 -25227 -27135 -26470 1376 51990 70103 63065 38845 -6067 15244 50579 70888
4726 70888 15863 3925 -19291 -30875 -30266 -45391 -29120 63 -10634 -455 15266 50440
4714 50440 93224 49391 -4323 -28270 -55119 -42205 -42385 -23076 -23822 -48364 -15793 34757 71039
4701 71039 76767 60102 79319 5406 -48886 -58313 -50986 558 50057 36241 19513 1900
4689A900j6000J2983J5818p6658J4247K4978R906J1292m5485L0702N3192l4056
4677B819K9591l4591q476q316n6842k041K9465L1000R57o4229K7988L7402K3274
4664H001n234k0329l8833r691k1189J5576l9972k5232J0721M4390P582L7515L1463
4651e232k590j96j439L9794k845l035j2758m3366l1436n885l446j1304J0067L5293
4637c8378k9972k8644J2263m854K235L7493P5771K0409r973q464r746J6805r016
4624B5929j609J6095j5703k4836L2179l1262l9026K4883J887l5586l9125M3272
4612d2902O7336j2175l7545L5391j5295m5699k7476k8419J3831L6630K1227K5336
4600i760k1445k2207J9672K2344O360m131L3003K8548j6827J656P70n3613j9205
$$ plain form
4689 1900 -14100 -1117 14701 -61957 -47710 -22732 -12826 -1534 -47019 -16317 36875 2819
4677 2819 32410 -2181 -10657 -18973 -75815 -77856 -48391 -17391 -16434 -80663 -52675 -15273 8001
4664 8001 2767 -17562 -56395 -66086 -87275 -71699 -111671 -136903 -126182 -81792 -74210 -36695 -5232
4651 -5232 -7822 -8018 -9457 30337 27492 24457 11699 -31667 -63103 -68988 -72434 -83738 -73671 -38378
4637 -38378 -68350 -96994 -84731 -89585 -87350 -49857 25914 46323 36350 27886 18140 34945 25929
4624 25929 24320 40415 24712 -124 32055 793 -38233 -13350 -11463 -47049 -86174 -42902
4612 -42902 24434 12259 -25286 10105 -5190 -50889 -78365 -106784 -92953 -56323 -35096 -9760
4600 -9760 -31205 -53412 -33740 -11396 -5036 -9167 23836 52384 35557 37213 37983 -15630 -34835
4587c4835J5692L77l6431K7709O3410J7816j7567j5032j9653k6559Q42J0494l6070
4574d9807k380L9396l7517L933L5592L1605M124j2319n2396k4971O0509P3665
4562F9434J3833m2641o2433l5623l786K9196J297K3482L1836K7018l4338n7843
4550d0568k7148N471j994j809m05K4899j4499J5923L3429m2798q248q173L2293
4537c3627L525J6594K0595k3156j9986N090L2315O8164k0786j4376o9370m9100
4525h4118M3688J9807r216M4309j3062j5379P383l167j8752j8043J9760L819J0490
4512a2481J7917l36j0227k7178r621K0428K6871K409L3586J1980k1986m9382K855
4499a5165k187j1707K9189L8720L3700m657N829l3857m321k3702J0608k5949k7085
$$ plain form
4587 -34835 -19143 -18766 -55197 -27488 35922 53738 36171 21139 1486 -25073 -24231 -13737 -49807
4574 -49807 -52187 -12791 -50308 -46375 -10783 20822 24946 12627 -39769 -64740 -4231 69434
4562 69434 83267 40626 -21807 -57430 -61216 -32020 -30723 -7241 24595 51613 17275 -40568
4550 -40568 -67716 -62245 -64239 -66048 -66453 -41554 -56053 -40130 -6701 -49499 -57747 -65920 -33627
4537 -33627 -30102 -13508 7087 -16069 -36055 -30965 1350 69514 48728 34352 -35018 -84118
4525 -84118 -40430 -20623 -29839 14470 1408 -13971 -6588 -9755 -28507 -46550 -26790 -22971 -12481
4512 -12481 5436 5100 -5127 -32305 -41926 -21498 5373 7782 41368 53348 31362 -18020 -15165
4499 -15165 -17352 -29059 130 38850 72550 67893 73722 39865 35544 11842 22450 -3499 -30584
4486c0584L0886j7954J5084k6432l2949k0909M3121L4975k7136J6619O6056N4918
4474A05695m7384m1026o2844l2662r951K0725N8497K15l0622m1779N562J4129
4462f1445j6707j7408K1656N3977K8845K8622K3446j5663j1292j5766K4196k9136
4450A3325O397J3718o146j8146m1771k4489J3412J4112o1264j4583J8561K8897
4438e7977N2402j8837p2778j2329L4834J6709L2402N2827J5938o749j2338k2355
4426A749k0190k1932J4682P433L3038m986j057L74j7054q493K4616K914j3716
4413b622l6467l8528N965M4275m7473m059J203J3359K5730m1344k4743l614L3716
4400g4602J6544K111L3566K0700K8292K2084j2084m864L5466j5992m1970m6152
$$ plain form
4486 -30584 302 -17652 -2568 -29000 -61949 -82858 -39737 -4762 -31898 -15279 50777 105695
4474 105695 58311 17285 -45559 -78221 -88172 -67447 -8950 -8735 -39357 -81136 -75574 -61445
4462 -61445 -78152 -95560 -73904 -19927 8918 37540 60986 45323 34031 18265 42461 13325
4450 13325 19722 33440 27294 9148 -32623 -57112 -43700 -29588 -90852 -105435 -86874 -57977
4438 -57977 -5575 -24412 -97190 -109519 -74685 -57976 -25574 27253 43191 36442 24104 1749
4426 1749 -18441 -40373 -25691 -18258 14780 9794 8737 9111 -7943 -16436 8180 11094 -2622
4413 -2622 -39089 -77617 -71652 -27377 -74850 -78909 -77706 -64347 -38617 -79961 -104704 -108318 -74602
4400 -74602 -58058 -55947 -22381 -1681 26611 48695 36611 31747 67213 51221 9251 -36901
4388c6901K6437L2051K0599M7580j6142n4304j3416o2224k1947q761J1335K7438
4376d8255K5989l7939P384K7407m603l584m5273M063N2532q196k8201L6232N7303
4363C4859K7321k3148j7331k9911l7562Q116K8789M2059J2879k2128k3337j6520
4351a5914O024l92k2979j9215J7115K3823J8637L578q257l401j8652j8485J0155
4338b7963J0049L6909L7117J6301k9360k0969k4367j1638l9043o997Q112L7497
4326a4352R6899m0719K032m7643k8697o711O157K7731J3467k5711j954J6529J5444
4313A2472K1067J2757j1219j009j7383L0920P9258o4586j06789o4689N1398L6880
4301b0923J8000j8455P523Q063J0105j0008J8413J3555n0969K2848j5279j0905
$$ plain form
4388 -36901 -10464 21587 42186 89766 73624 19320 5904 -56320 -78267 -87028 -75693 -48255
4376 -48255 -22266 -60205 -52821 -25414 -30017 -33601 -78874 -74811 -22279 -30475 -58676 -22444 34859
4363 34859 62180 39032 21701 -8210 -45772 -37656 -8867 33192 46071 23943 606 -15914
4351 -15914 -9890 -10282 -33261 -52476 -35361 -11538 7099 10677 2420 -981 -19633 -38118 -27963
4338 -27963 -17914 18995 56112 72413 43053 22084 -2283 -13921 -52964 -59961 -51849 -14352
4326 -14352 82547 41828 43860 -3783 -32480 -39191 -33034 -5303 8164 -17547 -19501 -2972 12472
4313 12472 33539 46296 35077 34068 16685 47605 126863 62277 -44512 -109201 -57803 -20923
4301 -20923 -2923 -21378 -13855 -5792 4313 -5695 12718 26273 -24696 -1848 -17127 -28032
4289b8032L8851J1343m6779j4402R933L0963j7426l8999l553J7196J1650O9180
4277C9925L6972L1028j3943m2446r0641n6882m8281K1981M326L5536o352k162
4265i0939L9173L4003K30n8619n8207N5559N4361o887l4835k2785p815J1837K997
4252h1927j5019J1635N2819L1116L9317r376n3911j1081M5663K3299j814j1029
4240A9692n515q989L771l393N683M130N3737q151k0447J5092q490l8727K5209
4227C3602L288k1907N206l908J1182L5739J6166J8034k0607m5336l1299j4771
4215a4611R577L0563j1703q935J0794l9843O481r42M4518L3408j2256m1085J648
4202G614J6374L5470j8285k4835K290J295k2454j9664L9558j7063k6295J3249
$$ plain form
4289 -28032 10819 22162 -24617 -39019 -29086 1877 -15549 -54548 -58101 -40905 -29255 39925
4277 39925 76897 107925 93982 51536 -39105 -95987 -144268 -122287 -117961 -82425 -88777 -90939
4265 -90939 -51766 -17763 -17533 -76152 -134359 -78800 -24439 -31326 -66161 -88946 -96761 -84924 -81927
4252 -81927 -96946 -85311 -32492 -1376 37941 28565 -25346 -36427 9236 32535 30721 19692
4240 19692 14177 5188 8959 5566 11249 15379 69116 60965 40518 55610 47120 8393 33602
4227 33602 36890 14983 20189 16281 27463 63202 79368 97402 76795 31459 160 -14611
4215 -14611 -5034 25529 13826 4891 15685 -24158 -17677 -18619 25899 59307 47051 5966 7614
4202 7614 23988 59458 41173 16338 18628 19923 -2531 -22195 17363 300 -25995 -12746
4190a2746m672p430J7508L4750m946J661K3283m2990p696K3945j3599O111p8j5923
4176b822k3623m202K2523K2728l7778J7912K8854J3283o637J8333j1811k0687
$$ plain form
4190 -12746 -17418 -24848 -7340 27410 22464 24125 47408 4418 -3278 20667 7068 13179 13101 -2822
4176 -2822 -26445 -30647 -8124 14604 -23174 -5262 23592 36875 30238 48571 36760 16073
$$ [...]
##END NTUPLES=NMR SPECTRUM
##END=
