##TITLE=Analysis number 327670
Compound Code gk 02784
Book Reference 231193
Project Code adrs flro3
Chemist Name jom
##JCAMPDX= 6.0         $$ Bruker NMR JCAMP-DX V2.0
##DATA TYPE= NMR SPECTRUM
##DATA CLASS= NTUPLES
##ORIGIN= Bruker BioSpin GmbH
##OWNER= nmr
$$ XWIN-NMR		Version 3.5
$$ Fri Mar 30 09:07:12 2007 GMT Daylight Time (UT+1h)  MAYBRIDGE\nmr@NMR_250MHZ
##.OBSERVE FREQUENCY= 250.131544655141
##.OBSERVE NUCLEUS= ^1H
##.ACQUISITION MODE= SIMULTANEOUS (DQD)
##.ACQUISITION SCHEME= undefined
##.AVERAGES= 16
##.DIGITISER RES= 18
##SPECTROMETER/DATA SYSTEM= dpx250
##.PULSE SEQUENCE= zg30
##.SOLVENT NAME= CDCl3
##.SHIFT REFERENCE= (INTERNAL, CDCl3, 0, 16.522)
##AUDIT TRAIL= $$ (NUMBER, WHEN, WHO, WHERE, WHAT)
$$ ##TITLE= Audit trail, XWIN-NMR		Version 3.5
$$ ##JCAMPDX= 5.01
$$ ##ORIGIN= Bruker BioSpin GmbH
$$ ##OWNER= nmr
$$ C:\u/data/dgb/nmr/ADRS/2670/pdata/1/auditp.txt
$$ ##AUDIT TRAIL=  $$ (NUMBER, WHEN, WHO, WHERE, WHAT)
(   1,<2007-03-30 09:06:51.73 +100>,<MAYBRIDGE\nmr>,<NMR_250MHZ>,
      <created by zg, POWCHK disabled, PULCHK disabled
       configuration hash MD5:
       49 4B E0 1D 92 C2 6B 37 9F E6 65 BC 52 41 86 1D
       data hash MD5: 64K
       A5 D8 3C 54 3D CC 91 87 97 6B B5 D6 B5 FB 09 79>)
(   2,<2007-03-30 09:07:03.67 +100>,<MAYBRIDGE\nmr>,<NMR_250MHZ>,
      <Start of raw data processing
       ef LB = 0.3 FT_mod = 6 PKNL = 1 SI = 32K 
       data hash MD5: 32K
       80 CA 68 AF D5 6B 4B 1F 50 C4 92 35 D9 0E C9 81>)
(   3,<2007-03-30 09:07:05.40 +100>,<MAYBRIDGE\nmr>,<NMR_250MHZ>,
      <apk 
       data hash MD5: 32K
       0D E7 1E C1 BC 13 7F E8 7E E4 D5 7F 68 85 62 87>)
(   4,<2007-03-30 09:07:06.15 +100>,<MAYBRIDGE\nmr>,<NMR_250MHZ>,
      <abs ABSG = 5 
       data hash MD5: 32K
       72 AE 13 92 F0 FB 4D 4F 4B C7 E7 8E 14 BF 87 A4>)
$$ ##END=
$$ 
$$ hash MD5
$$ F7 EC C0 55 EE CF 68 D3 79 D7 A9 5F CA F1 79 7E
##$RELAX= 
##$RELAX= 
##$RELAX= 
##$RELAX= 
##$RELAX= 
##$RELAX= 
##$RELAX= 
$$ Bruker specific parameters
$$ --------------------------
##$DU= <C:\u>
##$EXPNO= 2670
##$NAME= <ADRS>
##$PROCNO= 1
##$TYPE= <nmr>
##$USER= <dgb>
##$AMP= (0..31)
100 100 100 100 100 100 100 100 100 100 100 100 100 100 100 100 100 100 
100 100 100 100 100 100 100 100 100 100 100 100 100 100 
##$AQSEQ= 0
##$AQ_mod= 3
##$AUNM= <au_zg>
##$AUTOPOS= <45 >
##$BF1= 250.13
##$BF2= 250.13
##$BF3= 250.13
##$BF4= 250.13
##$BF5= 500.13
##$BF6= 500.13
##$BF7= 500.13
##$BF8= 500.13
##$BYTORDA= 1
##$CFDGTYP= 0
##$CFRGTYP= 5
##$CHEMSTR= <none>
##$CNST= (0..31)
1 1 145 1 1 1 1 1 1 1 1 1 1 1 1 1 1 1 1 1 1 1 1 1 1 1 1 1 1 1 1 1 
##$CPDPRG= <>
##$CPDPRG1= <>
##$CPDPRG2= <>
##$CPDPRG3= <>
##$CPDPRG4= <mlev>
##$CPDPRG5= <mlev>
##$CPDPRG6= <mlev>
##$CPDPRG7= <mlev>
##$CPDPRG8= <mlev>
##$CPDPRGB= <>
##$CPDPRGT= <>
##$D= (0..31)
0 1 0 0 0 0 0 0 0 0.06 0 0 0 0 0 0 0.0002 0 0 0 0 0 0 0 0 0 0 0 0 0 0 
0 
##$DATE= 1175242009
##$DBL= (0..7)
120 120 120 120 120 120 120 120 
##$DBP= (0..7)
150 150 150 150 150 150 150 150 
##$DBP07= 0
##$DBPNAM0= <>
##$DBPNAM1= <>
$$ [...]
##$SUBNAM7= <"">
##$SUBNAM8= <"">
##$SUBNAM9= <"">
##$SW= 20.6930455092707
##$SWIBOX= (0..15)
0 0 3 0 0 0 0 0 0 0 0 0 0 0 0 0 
##$SW_h= 5175.983436853
##$TD= 65536
##$TD0= 1
##$TE= 683.16
##$TE2= 300
##$TE3= 300
##$TEG= 300
##$TL= (0..7)
0 120 120 120 120 120 120 120 
##$TP= (0..7)
150 150 150 150 150 150 150 150 
##$TP07= 0
##$TPNAME0= <>
##$TPNAME1= <>
##$TPNAME2= <>
##$TPNAME3= <>
##$TPNAME4= <>
##$TPNAME5= <>
##$TPNAME6= <>
##$TPNAME7= <>
##$TPOAL= (0..7)
0.5 0.5 0.5 0.5 0.5 0.5 0.5 0.5 
##$TPOFFS= (0..7)
0 0 0 0 0 0 0 0 
##$TUNHIN= 0
##$TUNHOUT= 0
##$TUNXOUT= 0
##$USERA1= <user>
##$USERA2= <user>
##$USERA3= <user>
##$USERA4= <user>
##$USERA5= <user>
##$V9= 5
##$VALIST= <valist>
##$VCLIST= <CCCCCCCCCCCCCCC>
##$VD= 0
##$VDLIST= <DDDDDDDDDDDDDDD>
##$VPLIST= <PPPPPPPPPPPPPPP>
##$VTLIST= <TTTTTTTTTTTTTTT>
##$WBST= 1024
##$WBSW= 4
##$XGAIN= (0..3)
0 0 0 0 
##$XL= 0
##$YL= 0
##$YMAX_a= 291511
##$YMIN_a= -434304
##$ZGOPTNS= <>
##$ZL1= 120
##$ZL2= 120
##$ZL3= 120
##$ZL4= 120
##$ABSF1= 16.522
##$ABSF2= -4.171173
##$ABSG= 5
##$ABSL= 3
##$ALPHA= 0
##$AQORDER= 0
##$ASSFAC= 0
##$ASSFACI= 0
##$ASSFACX= 0
##$ASSWID= 0
##$AUNMP= <proc_1d>
##$AZFE= 0.1
##$AZFW= 0.1
##$BCFW= 0
##$BC_mod= 0
##$BYTORDP= 0
##$COROFFS= 0
##$CY= 12.5
##$DATMOD= 1
##$DC= 0
##$DFILT= <>
##$DTYPP= 0
##$F1P= 14.0000005364418
##$F2P= -0.99999901652339
##$FCOR= 0.5
##$FTSIZE= 32768
##$FT_mod= 6
##$GAMMA= 0
##$GB= 0
##$INTBC= 1
##$INTSCL= 1
##$ISEN= 128
##$LB= 0.3
##$LEV0= 0
##$LPBIN= 0
##$MAXI= 10000
##$MC2= 0
##$MEAN= 0
##$ME_mod= 0
##$MI= 0
##$NCOEF= 0
##$NC_proc= -3
##$NLEV= 6
##$NOISF1= 0
##$NOISF2= 0
##$NSP= 0
##$NTH_PI= 0
##$NZP= 0
##$OFFSET= 16.522
##$PC= 1
##$PHC0= 225.3786
##$PHC1= 16.56627
##$PH_mod= 1
##$PKNL= yes
##$PPARMOD= 0
##$PSCAL= 4
##$PSIGN= 0
##$REVERSE= no
##$SF= 250.13
##$SI= 32768
##$SIGF1= 0
##$SIGF2= 0
##$SINO= 400
##$SIOLD= 32768
##$SREGLST= <1H.CDCl3>
##$SSB= 0
##$STSI= 32768
##$STSR= 0
##$SW_p= 5175.98343685301
##$SYMM= 0
##$S_DEV= 0
##$TDeff= 65536
##$TDoff= 0
##$TI= <Analysis number 999999
Compound Code 99
Book Reference 9
Project Code 9>
##$TILT= no
##$TM1= 0
##$TM2= 0
##$TOPLEV= 0
##$USERP1= <user>
##$USERP2= <user>
##$USERP3= <user>
##$USERP4= <user>
##$USERP5= <user>
##$WDW= 1
##$XDIM= 32768
##$YMAX_p= 502847307
##$YMIN_p= -53397
$$ End of Bruker specific parameters
$$ ---------------------------------
##NTUPLES= NMR SPECTRUM
##VAR_NAME=  FREQUENCY,     SPECTRUM/REAL,   SPECTRUM/IMAG
##SYMBOL=    X,             R,               I
##VAR_TYPE=  INDEPENDENT,   DEPENDENT,       DEPENDENT
##VAR_FORM=  AFFN,          ASDF,            ASDF
##VAR_DIM=   32768,         32768,           32768
##UNITS=     HZ,            ARBITRARY UNITS, ARBITRARY UNITS
##FACTOR=    0.157963299565203, 1,           1
##FIRST=     4132.6476996994, 0,             0
##LAST=      -1043.33573715361, 0,           0
##MIN=       -1043.33573715361, -53397,      0
##MAX=       4132.6476996994, 502847307,     0
$$ Real data points
##PAGE= N=1
##DATA TABLE= (X++(R..R)), XYDATA
$$ [...]
18576D5738r263J8225K042n603k307j316Q040j393l718j748j776O086j1350j0995
18562C0662J850o049m749J2852R909r752l856R667L968n210j4743p792R658j358
18548B5057q358L674P301j152L356l896J283R688p919j944q094J5490p003p732
18534A9751M846J2122J1449p159M549L742j6071k5896n8K2668J5367n187n43o073
18520C3507q568p562l326K542J1830P172M691m071J906k954j3102O091J3604j59
18506D1601P524O842j2659j822m101m185N438L689K981n51j185L821n018J1118
18492E3493N597J6609n337j5748r127o890p907R862r626q823K5329L866k228K925
18478E1995p622o022j9669N888M706J6865N137k153O73J2294P922j2093j3282
$$ y = [45738, 36475, 54700, 56742, 51139, 48832, 47516, 55556, 54163, 50445, 48697, 46921, 53007, 41657, 30662, 32512, 26463, 21714, 34566, 44475, 34723, 30867, 40534, 44502, 39292, 24549, 16757, 26415, 25057, 16699, 20373, 27674, 26522, 29878, 25982, 27265, 36953, 29034, 27090, 18996, 34486, 27483, 19751, 24597, 36719, 48168, 41009, 45558, 49300, 33229, 7333, 7275, 29943, 45310, 40123, 39580, 33507, 24939, 17377, 14051, 16593, 28423, 35595, 40286, 36215, 38121, 35167, 22065, 28156, 41760, 41601, 49125, 55967, 43308, 41486, 37385, 33200, 38638, 42327, 45308, 44757, 43572, 47393, 42375, 53493, 59090, 75699, 70362, 54614, 45487, 38597, 30690, 40552, 30926, 22103, 47432, 51298, 49070, 51995, 44373, 38351, 18682, 24570, 29276, 46141, 51278, 49125, 49798, 62092, 70014, 57921, 44639]
18465D4639K45J2448j029k2243j3030N506J0317L613J4289K890m930K519l29M676
18451E9581m932j554m185K214k566j175J2599P586Q661k326q768q358j1329q081
18437C7367K533R869K189p23j506n721M742K1O333P521J120r012J383j2733Q768
18422E2151N15j6024J800R675J975k836K119K589J367r844r51J2423J2216j8517
18408D8658j6439J2911O796k549o665o527J7615P67n886j4437N637J0051J8004
18395F7936k808o37M915j1885K815L60q088m819j85P657J828l378J21N206J0454
18380F9492q036q186J2516J5929m931j3760J62j2901Q98R144k802j5552j4999
18367B6974K6182P739k709R419P59l086K0962M472j5370r646o817q67J0115k533
$$ y = [44639, 44884, 57332, 56303, 34060, 21030, 26536, 36853, 40466, 54755, 57645, 52715, 55234, 54905, 59581, 54649, 53095, 48910, 51124, 48558, 47383, 59982, 67568, 76229, 73903, 65135, 56777, 45448, 37367, 39900, 49769, 51958, 51235, 49729, 44008, 48750, 48771, 55104, 62625, 63745, 54733, 56116, 43383, 52151, 52666, 36642, 38442, 48117, 50092, 47256, 49375, 51964, 53331, 43487, 42536, 54959, 67175, 48658, 32219, 45130, 51926, 49377, 42712, 36185, 53800, 54567, 48681, 34244, 39881, 49932, 67936, 65128, 64491, 69406, 57521, 60336, 60696, 52608, 47789, 47604, 55261, 57089, 53711, 53832, 59038, 69492, 61456, 53270, 65786, 81715, 76784, 63024, 63186, 50285, 51183, 60327, 57525, 41973, 26974, 53156, 60895, 58186, 67605, 68364, 65278, 86240, 90712, 75342, 65696, 58879, 58012, 68127, 65594]
18353F5594J484J5090l126n198k5280j1022O364J501K555J157N091P750L442K89
18339F5691J780q869r439L631J6220K1769N538k9454n588J801P82L04J186k720
18325F2632j1188p175n198J9717L42Q13P734R820j75l516L69j258j2859j4176
18311D5882J900J4808J7292n622m222j85R883J7068J5461K280k651k7942j6456
18298F7496n62k993q562n654K731K4472R4o63Q37j906O787M833o14p804r577J0758
18282G9673J8985P677L522j3081N78J929j4918p875O339k259r6R045K819j1060
18268H1278m345L062o646r329K978k637P773J4651N455p288M561L49L908P97J3767
18253A08334R441m121j2486r73L326k344o464M035j968k607l652Q045L228j256
$$ y = [65594, 67078, 82168, 79042, 73844, 48564, 37542, 43906, 45407, 47962, 49119, 54210, 61960, 65402, 65691, 67471, 58602, 49163, 52794, 69014, 90783, 96321, 66867, 61279, 63080, 63862, 64166, 65352, 62632, 51444, 44269, 39071, 58788, 59130, 59943, 67677, 77497, 77322, 73806, 74175, 72917, 60058, 45882, 47782, 62590, 79882, 74260, 70038, 69853, 79736, 96804, 112265, 114545, 111894, 83952, 67496, 66934, 63941, 55379, 49725, 52456, 76928, 77022, 76359, 77196, 75290, 82077, 86910, 86296, 78492, 68915, 79673, 98658, 106335, 109857, 96776, 97354, 99283, 84365, 76490, 82829, 80570, 80474, 89519, 92338, 81278, 76933, 79995, 73349, 64020, 66998, 64361, 72134, 86785, 92240, 84952, 89513, 89862, 93770, 94567, 108334, 117775, 113654, 101168, 100195, 103521, 101177, 94713, 98748, 96780, 94173, 90521, 98566, 101794, 100538]
18239A00538o600q886j1090Q840K909K785o712N790k067n214J2552P805p122O670
18225A00198J779Q641K283p192o322q242J299N325J2202R368Q941o559l466n786
18211A12469n674p093m8m877l713l42N634J1315L671j906J6327K1850R252J4430
18197A71295J954k795L194R177K1372K0741R297J3394L7239M5867L8245L7942
18185D06922N5985L6233J8652q593n6167p4900o7394m6749k0770k1674q834j7258
18173A95453n57N686p85p224q64P603O296l396j497N668Q404J1318P818j314J0603
18158B43212J4855K1466J6442J3036K5517K8307L1770M0780N9559N8400M4637
18147E97981K9524J3387l1810n5874o2850m5805j3059Q390L40o578M108J3286
$$ y = [100538, 93938, 85052, 73962, 82802, 85711, 88496, 81784, 87574, 85507, 80293, 92845, 100650, 93528, 100198, 101977, 110618, 112901, 105709, 99387, 91145, 92444, 97769, 109971, 119339, 128280, 121721, 118255, 112469, 106795, 99702, 99654, 94777, 91064, 90722, 96356, 107671, 111342, 109436, 125763, 147613, 156865, 171295, 173249, 170454, 173648, 182825, 204197, 224938, 234235, 247629, 284868, 330735, 368980, 406922, 462907, 499140, 517792, 509199, 453032, 378132, 310738, 263989, 243219, 221545, 212711, 195453, 194896, 200582, 199797, 192573, 191709, 199312, 205608, 202212, 200715, 206383, 214787, 226105, 233923, 232609, 243212, 258067, 279533, 295975, 309011, 334528, 362835, 394605, 435385, 494944, 553344, 597981, 627505, 640892, 609082, 553208, 490358, 444553, 431494, 439884, 440224, 433646, 437754, 451040]
18135D51040L8656L9236K6751M7190N3754N7800Q2600R7563R0981Q5952J19844
18124A191367J20250J53327J83257K27083K51125K66009L23658L34842L63889
18115C414807M30403M92526O71179J088145J798505K609585K802991K365838K323629
18106A7997608P21046l127857m280615l302336k367602j610451j027684o61861
18098B340248m78353l62272k70471k19371j75569j17953r7813p2853n1639m4608
18088D49346l4021m2236l8257k1335k1842j8037q374k6263j5774q358p604j1385
18076A95860l2682j0086P136o696j6245r426p685j485n285k815l481j3061P988
18063A02037J2863j2312j6551P94l493j7350m817M645l131J2984J2207K662m393
$$ y = [451040, 489696, 528932, 555683, 602873, 656627, 714427, 797027, 894590, 985571, 1071523, 1191367, 1311617, 1464944, 1648201, 1875284, 2126409, 2392418, 2716076, 3050918, 3414807, 3845210, 4337736, 5008915, 6097060, 7895565, 10505150, 13308141, 15673979, 17997608, 18718654, 15590797, 11310182, 8007846, 5640244, 4029793, 3002109, 2340248, 1861895, 1499623, 1229152, 1009781, 834212, 716259, 618446, 545593, 493954, 449346, 415325, 373089, 334832, 313497, 291655, 273618, 265244, 238981, 223207, 214849, 207245, 195860, 163178, 153092, 160228, 153532, 137287, 127861, 120176, 118691, 113406, 110591, 107110, 94049, 102037, 114900, 102588, 86037, 86831, 83338, 65988, 61171, 65816, 62685, 75669, 87876, 90538, 86145]
18050H6145O00P456K294j0176O161q999j6270k274R577J2631J5098m682l331j193
18036I3037K280o167r609r851M343J0156J551J1818K558o12M604q448k1029k259
18022G2372o967m821K918l72O26q152J6679J6915J240P834J3559l70j4638p777
18008H9046O828L321K167J5294q069k4624O01P061n837K312j469P196O161l456
17994I6532m540O299o84J871K541n575O15J4230J1002k517k762L487L449p145
17980A16803q066k710M903N871O7K683l477J198o328j5183j2097K648m025p544
17966G4743m138J909L233J7462O055k062j523J20k0223o22R417Q643J9731P216
17952A19961O838n499k4973j9169J0760K645r42L820o566j979O067M699O593P93
$$ y = [86145, 86745, 94201, 96495, 86319, 92480, 83481, 67211, 64937, 74514, 87145, 102243, 97561, 94230, 93037, 95317, 89150, 79541, 69690, 74033, 84189, 85740, 97558, 100116, 99504, 104108, 95660, 74631, 72372, 65405, 60584, 63502, 63130, 63756, 55604, 72283, 89198, 90438, 98272, 111831, 111461, 96823, 89046, 95874, 99195, 101362, 116656, 108587, 83963, 84564, 91625, 85788, 88100, 86631, 93827, 99988, 96532, 91992, 98291, 97607, 99478, 102019, 96444, 97059, 111289, 122291, 119774, 117012, 120499, 123948, 116803, 108737, 106027, 110930, 116801, 116868, 119551, 116074, 117272, 110944, 95761, 83664, 86312, 82287, 74743, 70605, 72514, 75747, 93209, 99264, 97202, 95679, 95799, 75576, 74954, 84371, 93014, 112745, 119961, 126799, 121300, 96327, 77158, 87918, 90563, 89621, 93441, 86875, 84896, 90963, 95662, 102255, 103048]
17938A03048L030l739n22L19J2767m204M389m666j1278r463J0008Q968l796k253
17924A02608L038j078j945q573r47J282J0616O427L78L00p019k20J878J2091J3061
17909A31897O298Q264J4718N690j389p976R681K3990P114r514J0807R571j5068
17896A94083k1723j7588M635O331j6360l799R04n347M230n467J3369P479K981
17883A63728J5086J5839L041j644o419M304K7639l752k3199j5129L77n299m786
17870A69786R697P319j059N172M466J7952l013l574m411j9336n180M866m962p08
17856A77015R153l14j1854j5751J224L820k841k436o932K489N448P919k966J857
17842A65831j409L295O835N366p23j0934P526P854N516r566q806M444k400k632
$$ y = [103048, 106078, 102339, 101817, 102136, 114903, 110699, 115088, 110422, 99144, 89681, 99689, 108657, 104861, 102608, 105646, 104568, 102623, 94050, 93103, 94385, 105001, 111428, 111806, 112106, 105087, 104867, 106745, 118836, 131897, 138195, 146459, 161177, 166867, 165478, 157502, 167183, 191173, 198287, 188773, 199580, 209151, 194083, 172360, 154772, 159407, 165738, 149378, 145579, 146483, 141136, 145366, 139899, 153268, 160747, 163728, 178814, 194653, 197694, 196050, 189631, 193935, 221574, 217822, 194623, 179494, 179871, 174572, 169786, 179483, 186802, 185743, 190915, 195381, 213333, 210320, 206746, 202335, 182999, 177819, 182685, 177723, 177015, 186168, 185854, 174000, 158249, 159473, 163293, 160452, 158016, 151084, 153573, 159021, 166940, 163974, 165831, 164422, 167717, 174552, 179918, 179195, 168261, 175787, 183641, 189157, 179591, 170785, 175229, 172829, 170197]
17828A70197n173l073j992K189J0l728j1078n353N327J1869K6304L720J655j0979
17814A79895m473N232J6200N473q541M927M46q448J580Q916J096k134k859j243
17800A96067Q432R336J3978J796R824J9039P831q197K174J5685M139j7056l920
17787B59128k3872o033N077Q672K2697O840o16j074L12K2027O057j800l566n834
17773B88015k847J2723n389j8349j6339j5803k804J0490J3058j1497o650Q836
17761B53444K6672R406j2036Q210K892M884K050n511R805n961j1209N49J961M557
17747B89713K8721J5334J2819J378k388R028n429J720J2727k908OK382j3882m990
17733C44231N557L576l494Q058J2750L320J8853O024J1302P009K471J1373L749
$$ y = [170197, 165024, 161951, 159959, 162148, 162158, 158430, 147352, 141999, 147326, 159195, 185499, 189219, 190874, 179895, 175422, 180654, 196854, 202327, 193786, 198713, 199159, 190711, 192291, 201207, 202303, 200169, 197310, 196067, 204499, 213835, 227813, 229609, 239433, 258472, 266303, 258106, 260280, 275965, 280104, 263048, 259128, 235256, 229223, 234300, 242972, 265669, 272509, 271893, 270819, 271131, 293158, 299215, 297415, 293849, 288015, 285168, 297891, 292502, 274153, 257814, 242011, 239207, 249697, 262755, 251258, 244608, 253444, 280116, 289522, 277486, 285696, 288588, 293472, 295522, 290011, 299816, 293855, 282646, 283195, 285156, 289713, 318434, 333768, 346587, 347965, 345577, 354605, 349176, 350896, 363623, 360715, 360721, 363103, 349221, 344231, 349788, 353364, 349870, 357928, 370678, 373998, 392851, 398875, 410177, 417186, 419657, 431030, 434779]
17720D34779N578j085n088P986K3505K5111Q909m915J5622K9192K4262M297K273
17707E70426j502L951J9663J0515J0823K0834J8749L1105K6622K0813K1524M1188
17695G94711L5155J2102K3563K7407L5205K5751M7016M7199N5935P0894Q0337
17684A255275P3188R3670J04533J29292J45522J76134J79693J68341J48970J20006
17674B594624J22512J65629K02337K42413K91770L36129L96027M80857N29908
17665E362206N72451O34124P05489Q25691R46009J072380J197956J348342J494246
17656A4158894J728998K071581K659227L707976N410961P629001R604598J0256308
17648E7227544R208694O218918j1841p893730j2476064j2391020j0032662p321679
$$ y = [434779, 440357, 439272, 434184, 442170, 465675, 490786, 499695, 494780, 510402, 539594, 563856, 568153, 570426, 568924, 572875, 592538, 603053, 613876, 634710, 653459, 684564, 711186, 731999, 753523, 794711, 829866, 841968, 865531, 892938, 928143, 953894, 1000910, 1048109, 1104044, 1174938, 1255275, 1328463, 1422133, 1526666, 1655958, 1801480, 1977614, 2157307, 2325648, 2474618, 2594624, 2717136, 2882765, 3085102, 3327515, 3619285, 3955414, 4351441, 4832298, 5362206, 5934657, 6568781, 7274270, 8099961, 9045970, 10118350, 11316306, 12664648, 14158894, 15887892, 17959473, 20618700, 24326676, 29737637, 37366638, 46971236, 57227544, 66436238, 72655156, 72643315, 64749585, 52273521, 39882501, 29849839, 22528160]
17640B2528160n050502l431117k372200j682564j184621p77730m68195k36904
17632G324327l9532J01339K17655L08871M24669N25663O45017P82121R16976J033790
17622A2240896J172697J346845J590015J913760K405314L213325M591032O661845
17614C5135729Q987465J0507702J0345313Q398823L723858m238634j1525867j3883732
17606D7450657j2325671r491143o763332m639352l181200k277729j659591j229696
17598E882943r35658p15345n52896m28807l59439l05506k48877k25428j74433
17589A936554j28626j32701j43603j58021j46455j14389n3712k5712k1631k4398
17579I87306n2399j05996j37384j17797r1256n9958m3646l8845l7036l7534k0249
$$ y = [22528160, 17477658, 14046541, 11674341, 9991777, 8807156, 8029426, 7561231, 7324327, 7284795, 7386134, 7603789, 7912660, 8337329, 8862992, 9508009, 10290130, 11207106, 12240896, 13413593, 14760438, 16350453, 18264213, 20669527, 23882852, 28473884, 35135729, 44123194, 54630896, 64976209, 73375032, 77098890, 72860256, 61334389, 47450657, 35124986, 25633843, 18870511, 14231159, 11049959, 8772230, 7112639, 5882943, 4947285, 4231940, 3679044, 3250237, 2890798, 2585292, 2336415, 2110987, 1936554, 1807928, 1675227, 1531624, 1373603, 1227148, 1112759, 1059047, 1033335, 1011704, 987306, 934907, 828911, 691527, 573730, 482474, 422516, 378870, 340025, 302989, 265455, 245206]
17568B45206k2172j4158l2308m3540j1051j731p684n620n258j0679k607O776j2
17555I5162j311n981j6847n626j169j7951j8507K517J3853r54M534r399m084J4502
17541D8739P385p696j2360L034K857j626q983j7552J548J105J3529J2150m458
17528C7672r760L577N389K862J4001P064j2803k2055j2581q505q893R749M049
17515I766o457Q576J2149m789o810k431j2014j89K189o258N053J217O05J6920
17501A7527N670l3K172n518r653J2914R702p803J4476J0498j2802j4149j6276
17488F725l331o879j1567L628R768j740n750O691m170J037L363j444R491q803
17474b981j2462o28K848j2609r180n402J2632J612j1254j931J1754K0176l956
$$ y = [245206, 223034, 208876, 176568, 133028, 121977, 120246, 112562, 106942, 101684, 91005, 88398, 95174, 95162, 93851, 87870, 71023, 65397, 64228, 46277, 27770, 30287, 44140, 43186, 47720, 38321, 34237, 48739, 56124, 48428, 36068, 39102, 41959, 40333, 31350, 13798, 15346, 16451, 29980, 42130, 37672, 27912, 31489, 36878, 39740, 53741, 60805, 48002, 25947, 13366, 4861, -4032, 5717, 9766, 3309, 11885, 24034, 19245, 12435, 10004, -2010, -2199, -10, -6268, -1215, 2, 607, 17527, 23197, 23164, 25336, 19818, 10165, 23079, 32781, 24978, 39454, 49952, 37150, 23001, 6725, 3394, -3485, -15052, -11424, -1656, -3396, -9146, -2455, -6625, -5588, -2225, -3669, 5822, -2981, -15443, -16071, -13223, -25832, -35012, -40414, -27782, -26170, -37424, -39355, -27601, -7425, -11381]
17461a1381l267J1436P469j434J907L323j362l221l156N27K997j915J9033K11
17447B1167Q846K794J7257Q107l321K0251K6230K3039j6253k2583j4181k5341
17435D6012k5509P37q539j2996k913n36j0718O001J4289n886k2017j4067L064
17422c3078R322J4080N719j49k14l730M074J20j941K15K27J3132N985O769q125
17407A2406k047j789k58k247m336R21l089P772J3789M553j77J806n1j713n80l093
17391B1867Q431J2391j2698p623n06M195J091r443M47m552p912q938N463m820
17377b607p086j665p327P637J1154Q231r428k273m473J4032J1379K866K61L882
17363B4583R69j129Q248L56q423M759R394J0765j871k1079K784k090m256K275
$$ y = [-11381, -14648, -3212, 4257, 2823, 4730, 8053, 6691, 3470, 314, 841, 3838, 1923, 20956, 21167, 30013, 32807, 50064, 58171, 54850, 75101, 101331, 124370, 108117, 85534, 71353, 46012, 20503, 21240, 12701, -295, -3208, -3744, -14462, -8461, 5828, -58, -22075, -36142, -33078, -23756, -9676, -3957, -4106, -4320, -8050, -3976, -3856, -5797, -5582, -5355, 7777, 13762, 20531, 12406, 10359, 8570, 8312, 6065, 1729, 2650, -439, 7333, 21122, 25675, 25498, 27304, 27253, 25540, 24960, 21867, 30298, 42689, 29991, 22368, 21862, 26057, 27148, 17705, 18152, 13600, 5688, -3250, 2213, -2607, -9693, -11358, -18685, -11048, 106, 8337, -1091, -3364, -7837, 6195, 17574, 20440, 20701, 24583, 25552, 24423, 32671, 33027, 24604, 29363, 38757, 49522, 47651, 26572, 29356, 27266, 23010, 25285]
17349B5285J869P195J3406J4956n926j385L180j1361j0061m532P710J3079L321
17336E6736l877l024l921L751K139K736n795j0460J0370K858j1725l07Q122m193
17322D3410j2217j2336p845j649J0507N128o958j0790K4319K1662l251M473K467
17309E6920R863N337l007j354K175j651m843J0623K799l587J001J1175J1348P938
17295A04737O35k382P564N196K2597J7981K5742L7439M1439L4670O2726O3759
17283D22103O4356L7942L270j6421j6590k1976N457j2993o8039p2314n5758n4824
17271B14213m4831k7350j2674o105k3099p101j761j6995j2599o108M970O079l923
17258F2716n425k80n471r937L40P147R016J442j4688L289J6272j1131j1332J0329
$$ y = [25285, 27154, 34349, 47755, 62711, 56785, 55400, 58580, 47219, 37158, 32626, 40336, 53415, 56736, 52859, 49835, 45914, 49665, 51804, 54540, 48745, 38285, 48655, 51513, 39788, 39481, 47603, 43410, 31193, 18857, 11012, 9363, 19870, 24998, 18040, 7250, 31569, 53231, 49980, 54453, 56920, 66783, 72120, 69113, 67759, 69934, 68283, 63440, 74063, 76862, 73275, 74276, 85451, 96799, 104737, 105372, 102990, 110554, 115750, 138347, 156328, 182070, 219509, 260948, 295618, 358344, 422103, 486459, 524401, 527671, 511250, 494660, 472684, 478141, 465148, 397109, 324795, 269037, 214213, 169382, 142032, 129358, 123253, 100154, 93053, 91292, 74297, 61698, 55590, 60560, 66639, 62716, 57291, 57011, 51540, 41603, 41943, 49090, 58106, 59548, 44860, 48149, 64421, 53290, 41958, 52287]
17244E2287j009q875p751Q082J4570J077r207o67J1864m694K12o434J0166M249
17230F3870p492r173m743n51K719p63P624J2794o48L722r055j3072K233J3R351
17215E6829L954J1094N847J2291J087j0143j0990l014J2808p844L575J4603M860
17202I4957o307j1259n640j729J2856j04j0653n960N526k462L394K111M430j066
17188G8094J2728J5969m897J902J413q90Q562n73j5871o111Q734q285l254o297
17174H1224j730L064j656j1670p658Q5N064j313P76K890O967N805R531o591j1476
17159G3312m927l325R160J0847L812k20r996l561J6216K2626K2997R328l713P306
17145A49862K486j5301k9536j6848j3672L266k514q341o521m66K1335J628j35
$$ y = [52287, 51278, 42403, 34652, 42734, 57304, 58381, 49174, 48507, 60371, 55677, 55889, 49455, 59621, 63870, 56378, 47205, 42462, 41911, 44630, 43867, 51491, 64285, 63637, 67359, 58304, 45232, 47465, 47478, 56829, 60783, 71877, 77724, 90015, 91102, 80959, 69969, 66955, 79763, 71919, 75494, 90097, 94957, 88650, 77391, 71751, 70022, 82878, 82774, 72121, 66161, 71687, 69225, 72619, 74730, 79160, 78094, 90822, 106791, 101894, 103796, 105209, 104319, 112881, 112308, 96437, 90326, 99060, 90775, 87521, 81224, 79494, 82558, 80902, 69232, 61574, 61659, 66723, 65410, 66186, 69076, 76043, 81848, 91379, 84788, 73312, 68385, 65060, 74220, 85067, 88879, 88659, 78663, 75102, 91318, 113944, 136941, 146269, 142556, 149862, 152348, 137047, 107511, 90663, 76991, 80257, 77743, 69402, 62881, 62415, 83750, 85378, 85243]
17132H5243J233n839o907m870m59J3986P169J102k628r181L096Q276J2277J7485
17118A19983R424l314N339J340o135J4004K0960J6832J9350J4438L0508L6357
17106B79086M8221M9949L2094J1415q958o0019n8544m2788n0018k2308m840j1571
17094A61719k2992j8252j5684l440J1394l961m526Q062J5590L995q753J759n512
17081A19399k358P083O723j773K0647L7450J4791K0579L0568L1783M1239M7270
17069C73401O1926L7115K0491l741m5943p0187n5177n9226n8105k7908j7280j8492
17057A36874j8339l024M098R346o95j0323N512L478j2633j0046j3546J206O293
17044I8201Q524N277J7999R7j6850j2452N984L273l139k106m17K907J8513J2945
$$ y = [85243, 86476, 80637, 73730, 68860, 68401, 82387, 89556, 90658, 88030, 78849, 81945, 90221, 102498, 119983, 129407, 126093, 131432, 132772, 126637, 140641, 161601, 178433, 197783, 212221, 242729, 279086, 327307, 377256, 409350, 420765, 411807, 351788, 293244, 250456, 200438, 178130, 173290, 161719, 138727, 120475, 104791, 101351, 112745, 108784, 104258, 112320, 127910, 131905, 123152, 124911, 119399, 117041, 124124, 130847, 129074, 149721, 187171, 201962, 222541, 253109, 284892, 326131, 373401, 435327, 472442, 492933, 489192, 443249, 373062, 317885, 258659, 200554, 172646, 155366, 136874, 118535, 115511, 119609, 128955, 128260, 117937, 123449, 126927, 114294, 104248, 90702, 91908, 98201, 106725, 112002, 130001, 130098, 113248, 100796, 106780, 110053, 106914, 104808, 104391, 107298, 125811, 138756]
17030A38756R433J1698L764J160k250j2542J0285J2477K6018K4874K8691K6715
17018B79079M2164L2961L6241L2935K6307J4838o944m0549n4175m7591m6139l2437
17006B36690l1787l1342j6967m166p967n242r31m099M432R716J5191J931j8232
16993A47227j9294j6168K517J8923M3608L1688j187q457J3226J8644L5298L6780
16981C02805K4697K6006M6986L0002Q955r92l0652m3906n7775m4998l1264k8805
16969B01059j5815j8669j5653K726K164n75j2428j3575l090j80j2931L76m577
16956A08832k374l288J3081J2451R31j2062j3558n756M73J0388L425O128r982
16943A08689j1584j114K276K8664O085q759p19J6721P906p417J3972n56K478l199
$$ y = [138756, 148189, 159887, 163651, 164811, 162561, 150019, 160304, 172781, 198799, 223673, 252364, 279079, 321243, 354204, 390445, 423380, 449687, 464525, 457581, 417032, 362857, 315266, 269127, 236690, 204903, 173561, 156594, 152428, 144461, 139219, 138288, 134189, 138621, 148337, 163528, 165459, 147227, 127933, 111765, 114282, 133205, 176813, 208501, 207314, 198857, 212083, 230727, 266025, 302805, 327502, 353508, 400494, 430496, 439451, 438459, 407807, 363901, 306126, 261128, 229864, 201059, 185244, 166575, 150922, 153648, 155812, 155237, 142809, 129234, 126144, 125964, 113033, 113409, 108832, 106458, 103170, 116251, 128702, 129633, 117571, 104013, 98257, 98730, 109118, 112543, 118671, 108689, 97105, 95991, 98267, 126931, 133016, 124257, 123538, 140259, 148165, 140748, 154720, 154164, 156642, 153443]
16929A53443j4250n851j2966l524P158j547n504N787K764j7574j539P112N670
16916A19179j126O516N433J1070j1226M54l872J4434j218n327o844j807O764j3854
16902A18576r573J2899K9446l320j4936r165P011M179N128R93j1698R149O749
16889A45438O635N821K852K98j2330p943L680J6194M25j2697n044M62l995J1620
16875A51416r2l062K736j5813q546Q627Q064o685l340Q60k906Q209J926J1471
16861A52865p26k546n679q434J459O812J4827J941L159K735J1730J2694r238j1442
16847A70157r757J2609m87j0795J546J2260l838l283q474P90O916O46J140k965
16833A66465k335Q011K216r519L158R16m92n732R01N024n76l636L239J3160n553
$$ y = [153443, 139193, 133342, 120376, 116852, 124010, 122463, 116959, 122746, 125510, 107936, 106397, 113509, 119179, 118053, 124569, 130002, 141072, 129846, 130300, 126428, 140862, 139644, 134317, 127473, 125666, 132430, 118576, 109003, 121902, 151348, 148028, 133092, 123927, 130938, 135117, 140245, 141238, 129540, 138689, 145438, 152073, 157894, 160746, 161044, 148714, 140771, 144451, 160645, 161070, 148373, 143329, 143791, 139796, 151416, 151324, 148262, 150998, 135185, 126639, 135266, 143330, 136645, 133305, 134165, 131259, 139468, 141394, 152865, 152139, 149593, 143914, 135480, 136939, 143751, 158578, 160519, 163678, 166413, 178143, 190837, 181599, 170157, 160400, 173009, 172522, 161727, 163273, 175533, 171695, 168412, 159938, 160728, 167644, 168290, 169430, 166465, 164130, 172141, 174357, 164838, 167996, 168912, 168420, 162688, 163589, 168613, 168037, 164401, 167640, 180800, 175247]
16818A75247n377M487j717P356Q585P307J896p667l429j4184n916P067P268J3790
16804A94713m891M67o041m968L84j998o133j275L710P617Q395N359o853j2895
16790A75591j332Q013J4413O517j149L305Q272j1077j2823j4635K098O814j505
16777A82502k843M014M955j578J1946K427J0742o17j0090M329M245N943M080n587
16763B14468p471P83k479P167Q114J0406o922n321k667k10P443p99j0418M471
16749B16565J3502j70m901j7272J2609P867m307j5410j851O041p070O141R565
16736B21309K65p235j2035n53m852M212J8420k80J789J4439l198J813K50l677
16722B30667N312J7884R906j0427m561l284k362L639K432n890P714N949j5904
$$ y = [175247, 169870, 174357, 172640, 179996, 188581, 195888, 197784, 190117, 186688, 172504, 166588, 173655, 180923, 194713, 189822, 190289, 184248, 179280, 179664, 177666, 171533, 170258, 173968, 181585, 189980, 195339, 188486, 175591, 174259, 182272, 196685, 203202, 202053, 205358, 213630, 202553, 189730, 175095, 177193, 184007, 182502, 179659, 183673, 188628, 187050, 198996, 201423, 212165, 211548, 201458, 205787, 210032, 215975, 220055, 214468, 206997, 207780, 205301, 212468, 220582, 230988, 224066, 218745, 216078, 215868, 223311, 222512, 212094, 216565, 230067, 229897, 224996, 207724, 220333, 228200, 223893, 208483, 206632, 212673, 205603, 211744, 221309, 221574, 214339, 202304, 201751, 196899, 201111, 219531, 219251, 221040, 235479, 232281, 234094, 234344, 230667, 235979, 253863, 263769, 253342, 248781, 245497, 243135, 246774, 249206, 243316, 251030, 256979, 241075]
16709B41075j555J6379J2545Q975J0527P348J634o303J328p609j3260j436M153
16696B73801q054O10N268m573O09Q664J0922J1770j0284j5848R0k721N487J6567
16682B92308J7923N769j421j0472j0686J0532J7348Q466J6267L781j3149k826
16670C33840K1395J4993L502P203m609j8917m26J660j8266r200J1518L51r255
16657C33789J056Q286j4833L136q218L113N484n42J068K035n837K647J1587J4085
16643C56856J4141p76j734P903n492J5206J103m731J8407N970L204K841J1111
16630D24009O480l116p825o955j1168j4846J1963L807M591j165J201N594j7075
16617C95495p479J0999J0539l810j7025k038J5169K0227P858l86p062n004r62
$$ y = [241075, 239520, 255899, 268444, 277419, 287946, 295294, 296928, 290625, 291953, 284344, 271084, 269648, 273801, 265747, 266357, 271625, 267052, 267661, 276325, 287247, 299017, 288733, 272885, 272975, 270254, 275741, 292308, 310231, 316000, 314579, 304107, 293421, 303953, 321301, 329767, 346034, 349815, 336666, 333840, 355235, 370228, 373730, 380933, 376324, 357407, 356981, 358641, 340375, 331175, 342693, 343044, 333789, 334845, 343131, 328298, 331434, 323216, 326329, 331813, 331271, 332339, 334374, 328537, 331184, 342771, 356856, 370997, 370221, 368487, 376390, 370898, 386104, 387207, 382476, 400883, 406853, 410057, 412898, 424009, 430489, 427373, 419548, 412593, 401425, 386579, 398542, 402349, 406940, 405775, 406976, 412570, 395495, 388016, 399015, 409554, 405744, 388719, 386681, 401850, 422077, 429935, 429549, 422487, 417483, 416521]
16604D16521J975J9252K4291J2078k971k857k371n549N067m250j2499n086k796
16591D40805J61J1274O903r891q741N963M741M726n728j4214O055J6021J4415
16578D72490J4592o144k234k711M288J0204K8193J2442k0946J33J265L489K212
16565E17273k336J2754Q380J5767J0761Q741j621r003N273O594N63K1844K2012
16552F17002R022N671J8263L460j6670j6663q957n351l427l214m760j8349p71
16539E75256L178k040k658k114Q50R465n836r904O762N424o807J3448J8585J576
16525F05185Q180Q82j03J2111r13J1051J1818J0405J8705r51R344K6268J2989
16512G24971l65j7334q082J598R307r512P519J7993k984j9773j6882R033o98K2451
$$ y = [416521, 418496, 437748, 462039, 474117, 471146, 468289, 465918, 460369, 465436, 461186, 448687, 443601, 440805, 440966, 452240, 459143, 449252, 440511, 446474, 451215, 455941, 450213, 435999, 442054, 458075, 472490, 487082, 480938, 478704, 475993, 480281, 490485, 518678, 531120, 510174, 510307, 511572, 515061, 517273, 514937, 527691, 536071, 551838, 562599, 571340, 569719, 560716, 565989, 572583, 573146, 594990, 617002, 626024, 631695, 649958, 653418, 636748, 620085, 611128, 605777, 602350, 599136, 594376, 576027, 575256, 578434, 576394, 573736, 571622, 572472, 581937, 576101, 566197, 572959, 578383, 571576, 585024, 603609, 605185, 613365, 614247, 614144, 626255, 625342, 636393, 648211, 658616, 677321, 676370, 685714, 711982, 724971, 724606, 707272, 699190, 700788, 710095, 700583, 708102, 726095, 723111, 703338, 686456, 695489, 694791, 717242]
16498G17242J9964j2967O561L898L162P931J9401O336L132O629J9233J2003o348
16485H06177J635O498k158R350O146J6364K4129M329J0653J9906K6034J2242K3125
16472I64430L7092J5551L55J9179L0168J6021J3929K3811L3775K4366L2242K3543
16460A234462K1132L7665K9858L6284N7658N7433N6159N4922P3960Q6941J10640
16449A857114J16374J32665J50843J69802J84880J99809J89936J99219K05938
16440C406580K24005K64041K97603L32601L60543M06538M72745N40923O20512
16431F926091O92762Q21136R69581J117879J258665J444011J664286J958159K403026
16422A9255596L078799M070451N310010O630075P738645Q079356P004880M740784
$$ y = [717242, 737206, 724239, 730800, 734698, 737860, 745791, 765192, 771528, 774660, 781289, 800522, 812525, 806177, 807812, 814310, 812152, 821502, 827648, 844012, 868141, 872470, 883123, 903029, 929063, 941305, 964430, 1001522, 1017073, 1017428, 1036607, 1066775, 1082796, 1096725, 1120536, 1154311, 1178677, 1210919, 1234462, 1255594, 1293259, 1323117, 1359401, 1417059, 1474492, 1530651, 1585573, 1659533, 1746474, 1857114, 1973488, 2106153, 2256996, 2426798, 2611678, 2811487, 3001423, 3200642, 3406580, 3630585, 3894626, 4192229, 4524830, 4885373, 5291911, 5764656, 6305579, 6926091, 7618853, 8439989, 9409570, 10527449, 11786114, 13230125, 14894411, 16852570, 19255596, 22334395, 26404846, 31714856, 38344931, 46083576, 54162932, 61167812, 65908596]
16414F5908596J533621k652670o429134q456404q998594q446446p054875n375730
16406B0028364l877948k722755j908915j311463q82690n79249l44144j43816k241
16397H255143J14667K47247L88621N08381O39822Q00492R58092J129212J329813
16388A4371490J561719J892441K403081L180215M208691N432380O639520P426241
16380D7115778P160907N562440L038125m81542m502491p361656q533711q562271
16372C3435579p634054o096468m546266l274174k353287j698747j239044r49933
16364E643606p35746n49394m47484l58663k76333k35486j90224j72484j59373
16355B518419j51830j34725j01343q2784r2911r2288p3343p0915p6816r2233r0887
$$ y = [65908596, 67442217, 64789547, 58360413, 49904009, 40905415, 32458969, 25404094, 20028364, 16150416, 13427661, 11518746, 10207283, 9324593, 8745344, 8401200, 8257384, 8255143, 8369810, 8617057, 9005678, 9514059, 10153881, 10954373, 11912465, 13041677, 14371490, 15933209, 17825650, 20228731, 23408946, 27617637, 33050017, 39689537, 47115778, 54276685, 59839125, 62877250, 62395708, 57893217, 50531561, 41997850, 33435579, 25801525, 19705057, 15158791, 11884617, 9531330, 7832583, 6593539, 5643606, 4907860, 4358466, 3910982, 3552319, 3275986, 3040500, 2850276, 2677792, 2518419, 2366589, 2231864, 2130521, 2047737, 1954826, 1862538, 1789195, 1718280, 1641464, 1549231, 1458344]
16344A458344q4311p9876o2775m6335l9751j1327j7246j8370k4619j5733M226
16333A062227j2426j7469j1225q237K725l162j2766R298j512N430J4758m346q716
16320A014579p853l762N907R342J5916R484R151N247K4749J9767K8619L3655K5765
16307A190566J6228K2238K8500L9652M1374M6555M0166L0382J4974Q158j4225
16296A464568k6709k5055l3733m3427m4919l2034j5483n578L256o083q320N587
16284A232070N472q257p716O48J6729J0485N900N102m515J291L482O588N651n622
16270A267308J6000J9879J2516M565K125K6266J1863O840P102k023O01J4431J4965
16257A402438M58J0491q040L59J5054J5473K4360R800l126J1266J8868N878M103
$$ y = [1458344, 1374033, 1294157, 1231382, 1185047, 1145296, 1133969, 1116723, 1098353, 1073734, 1058001, 1062227, 1049801, 1032332, 1021107, 1012870, 1015595, 1012433, 999667, 1008965, 1007453, 1012883, 1027641, 1023295, 1014579, 1006726, 1002964, 1008871, 1018213, 1034129, 1043613, 1052764, 1058011, 1082760, 1102527, 1131146, 1164801, 1190566, 1206794, 1229032, 1257532, 1297184, 1338558, 1385113, 1425279, 1455661, 1470635, 1478793, 1464568, 1437859, 1412804, 1379071, 1335644, 1290725, 1258691, 1243208, 1237630, 1240886, 1234803, 1226483, 1232070, 1237542, 1229285, 1221569, 1222217, 1238946, 1249431, 1255331, 1260433, 1255918, 1257209, 1260691, 1267279, 1272930, 1267308, 1283308, 1303187, 1315703, 1320268, 1322393, 1348659, 1360522, 1367362, 1374464, 1372441, 1373042, 1387473, 1402438, 1402896, 1413387, 1405347, 1405706, 1420760, 1436233, 1460593, 1470393, 1467267, 1478533, 1497401, 1503279, 1507382]
16244A507382J2222J3630J0637K3686L142o448O46M180P527R323K2267J7996K1097
16231A647287K2797J9774J8551R487O801J7056K8134L1329K0231K4637N397m847
16219A846634L715K1781K1665K5583J2473R092K0917J2967J4488L4998K1934J5668
16207B061915J9719J9003J8268K7650L6999K5565K3637K9825R831O143K7443K3633
16195B329631o110K3966L5506L0870L4155K2379J3807K7584L4022L5150K2758
16184B603718K0484M7220M0226J2556J9192J8950L0227M2949L8009L0098M1331
16173B944960M6470L8757L3423M4071K9238K7185K9639L7759M6871L6823L7113
16162C352309K4901L9395N2056M5150M0889L7288M1075M7569M1732M0401N2146
$$ y = [1507382, 1519604, 1533234, 1543871, 1567557, 1570699, 1564251, 1564897, 1569077, 1576604, 1585927, 1608194, 1626190, 1647287, 1670084, 1689858, 1708409, 1717896, 1724697, 1741753, 1769887, 1801216, 1821447, 1846084, 1851481, 1846634, 1850349, 1872130, 1893795, 1919378, 1931851, 1940943, 1961860, 1974827, 1989315, 2024313, 2046247, 2061915, 2081634, 2100637, 2118905, 2146555, 2183554, 2209119, 2232756, 2262581, 2272412, 2278555, 2305998, 2329631, 2323521, 2347487, 2382993, 2413863, 2448018, 2470397, 2484204, 2511788, 2545810, 2580960, 2603718, 2624202, 2671422, 2711648, 2724204, 2743396, 2762346, 2792573, 2835522, 2873531, 2903629, 2944960, 2991430, 3030187, 3063610, 3107681, 3136919, 3164104, 3193743, 3231502, 3278373, 3315196, 3352309, 3377210, 3416605, 3468661, 3513811, 3554700, 3591988, 3633063, 3680632, 3722364, 3762765, 3814911]
16151C814911M7822M5489N9849O0995M9979O1601N7267M8697M3877M3524M8213
16140D382224O8479O3324O9179O7694N5077O8140Q4228O8484O9708P0892P9278
16129E146707P6920P5427Q4868Q2439Q2668P2430Q5368P9491P8892Q2367Q2956
16118F030533R7563R3358J18473J11037R5808J00472R4315R7158J08833R8857
16108G046407J09838J25692J12824J18047J19949J36730J33141J32677J32700
16099H168005J41378J45533J56283J30085J27756J34062J47613J69774J72741
16090I493230J65101J60563J62996J82279J64779J61979J85870J88760J86815
16081A1052372J97355J99838J96808J99738J96083J98874K02341K25742K27574
$$ y = [3814911, 3862733, 3908222, 3968071, 4029066, 4079045, 4140646, 4197913, 4246610, 4290487, 4334011, 4382224, 4450703, 4514027, 4583206, 4650900, 4705977, 4774117, 4858345, 4926829, 4996537, 5067429, 5146707, 5223627, 5299054, 5383922, 5466361, 5549029, 5621459, 5706827, 5786318, 5865210, 5947577, 6030533, 6128096, 6221454, 6339927, 6450964, 6546772, 6647244, 6741559, 6838717, 6947550, 7046407, 7156245, 7281937, 7394761, 7512808, 7632757, 7769487, 7902628, 8035305, 8168005, 8309383, 8454916, 8611199, 8741284, 8869040, 9003102, 9150715, 9320489, 9493230, 9658331, 9818894, 9981890, 10164169, 10328948, 10490927, 10676797, 10865557, 11052372, 11249727, 11449565, 11646373, 11846111, 12042194, 12241068, 12443409, 12669151, 12896725]
16072A2896725K01902K13602K28000K29563K44658K41320K43156K34703K24765
16063A4958394K42498K44386K32859K33681K52357K44900K40585K34640K41553
16054A7125853K57994K61780K42021K38850K34888K26021K34421K18420K21509
16045A9261757K30867K09956J97332K00718J93514J89832J87377J82160J63654
16036B1017167J51088J44341J25249J18587J10667R5395R7462Q0509O4160N9357
16026B2063982M1069L8133J8127o837j8469l5365l3647m2886m1739o8627q2771
16015B1830970j19297j12884j07225j43558j47802j31547j60156j70779j86847
16006B0550875j96755k14771j99890k04488k19514k21486k31650k31351k32174
$$ y = [12896725, 13098627, 13312229, 13540229, 13769792, 14014450, 14255770, 14498926, 14733629, 14958394, 15200892, 15445278, 15678137, 15911818, 16164175, 16409075, 16649660, 16884300, 17125853, 17383847, 17645627, 17887648, 18126498, 18361386, 18587407, 18821828, 19040248, 19261757, 19492624, 19702580, 19899912, 20100630, 20294144, 20483976, 20671353, 20853513, 21017167, 21168255, 21312596, 21437845, 21556432, 21667099, 21762494, 21859956, 21940465, 22004625, 22063982, 22105051, 22143184, 22161311, 22154474, 22136005, 22100640, 22066993, 22024107, 21982368, 21913741, 21830970, 21711673, 21598789, 21491564, 21348006, 21200204, 21068657, 20908501, 20737722, 20550875, 20354120, 20139349, 19939459, 19734971, 19515457, 19293971, 19062321, 18830970, 18598796]
15997A8598796k49365k48336k45437k45324k34655k37991k43521k65058k70981
15988A6358128k51287k53163k53555k55767k59174k46794k45952k43577k41259
15979A4107600k38880k49125k25632k20311k31871k24446k17757k16407k22992
15970A2060179k10113k06679k06318k11440j91148j90369j78228j97375k06852
15961A0261657j77861j62720j80188j79053j75947j69434j75894j56784j46723
15952H737053j49898j45124j41692j45495j34771j29201j34956j42605j28894
15943G484417j28600j29501j21779j14413r7661j03840j13944j27761j11218j04536
15933F331164r2376q5655j05383j02099q8519q0163j03255r3951q0924r0064p6556
$$ y = [18598796, 18349431, 18101095, 17855658, 17610334, 17375679, 17137688, 16894167, 16629109, 16358128, 16106841, 15853678, 15600123, 15344356, 15085182, 14838388, 14592436, 14348859, 14107600, 13868720, 13619595, 13393963, 13173652, 12941781, 12717335, 12499578, 12283171, 12060179, 11850066, 11643387, 11437069, 11225629, 11034481, 10844112, 10665884, 10468509, 10261657, 10083796, 9921076, 9740888, 9561835, 9385888, 9216454, 9040560, 8883776, 8737053, 8587155, 8442031, 8300339, 8154844, 8020073, 7890872, 7755916, 7613311, 7484417, 7355817, 7226316, 7104537, 6990124, 6892463, 6788623, 6674679, 6546918, 6435700, 6331164, 6238788, 6153133, 6047750, 5945651, 5857132, 5776969, 5673714, 5579763, 5498839, 5408775, 5332219]
15922E332219r5564q3874o5819o5268q4668p0576o9299p0134p1755o9855n4791
15911D530616n6380o3499o4060o9131n6086p1292p1113n2401n9634n5053m4178
15900C867789n0589n3582n3576m0743n4872n1092m0459n1683m5635l0546k5950
15889C369062m0025k5240n2775n8485m5348m2373l9415j8961j4894k0519m8788
15878B962239m7159k6518l2048l1603l4931k7566k4263l4657l2394j3321k1606
15867B636173k2301p334k8397l1061j6896k1031l3158q927R27k0777k7226k4602
15855B395390l1608k8744k0269j8800k7279j7245k1635j8254j9216k7662j6848
15844B147830j8799l9752l0987k4941k4914l7037l0856j7150k4113l6496k1815
$$ y = [5332219, 5236655, 5152781, 5086962, 5021694, 4937026, 4866450, 4797151, 4727017, 4655262, 4585407, 4530616, 4474236, 4410737, 4346677, 4277546, 4221460, 4150168, 4079055, 4026654, 3967020, 3911967, 3867789, 3817200, 3763618, 3710042, 3669299, 3614427, 3563335, 3522876, 3471193, 3425558, 3395012, 3369062, 3329037, 3303797, 3251022, 3192537, 3147189, 3104816, 3065401, 3046440, 3031546, 3011027, 2962239, 2915080, 2888562, 2856514, 2824911, 2789980, 2762414, 2738151, 2703494, 2671100, 2657779, 2636173, 2613872, 2606538, 2578141, 2547080, 2530184, 2509153, 2475995, 2467068, 2467995, 2447218, 2419992, 2395390, 2363782, 2335038, 2314769, 2295969, 2268690, 2251445, 2229810, 2211556, 2192340, 2164678, 2147830, 2129031, 2089279, 2058292, 2033351, 2008437, 1971400, 1940544, 1923394, 1899281, 1862785, 1840970]
15833A840970j6438p877j6264k5228j7866k6799j6692j8897k2447n640j1739r224
15821A645859j7130m266n63k0399k1572K756k910K644N086K8403M1142L3673K9647
15808A722370J5431l1686m0660m3750m6357n7221o8925m8126m9909m7752k0481
15797A282934k9694j8849o153j5491j4142j2962k259k721l324o51o206o922q43
15784A162717m466n079j7972j2467j223J7331J2860J4277K9896K8337L4565K0785
15772A279561Q812J3420l683k2641n6745o4639m8946m1371l5582l0200k8413o205
15760I63368k5912j5416m156Q99J052L643k898Q830K0783K2749K1886J8311K9592
15747A042731K9805K3110L1184J0800o18j5864l0330n1996o9658l1805l5330l3662
$$ y = [1840970, 1824532, 1816655, 1800391, 1775163, 1757297, 1730498, 1713806, 1694909, 1672462, 1666822, 1655083, 1645859, 1628729, 1624463, 1623900, 1603501, 1581929, 1584685, 1581775, 1584419, 1589505, 1617908, 1659050, 1692723, 1722370, 1737801, 1706115, 1665455, 1621705, 1575348, 1518127, 1449202, 1401076, 1351167, 1303415, 1282934, 1253240, 1234391, 1228238, 1212747, 1198605, 1185643, 1183384, 1180663, 1177339, 1176688, 1170482, 1163560, 1162717, 1158251, 1153172, 1135200, 1122733, 1121510, 1138841, 1151701, 1165978, 1195874, 1224211, 1258776, 1279561, 1288373, 1301793, 1298110, 1275469, 1218724, 1154085, 1105139, 1063768, 1028186, 997986, 969573, 963368, 937456, 922040, 917884, 918783, 919835, 923478, 920580, 929410, 950193, 972942, 994828, 1013139, 1042731, 1072536, 1095646, 1126830, 1137630, 1137012, 1121148, 1090818, 1038822, 969164, 937359, 902029, 868367]
15735H68367l5013m1622l0214j8977j4527q366j2067j3451r862N668r238k1982
15723F58716m319q545j1417p704N441p937L15l00j0566L021l594r618n018j4917
15709E83558R28q540j0570Q688Q644m750j9813n222k830j94j3375m237j1696Q260
15695E28851J0299q271o135n932p436j792j5292j10j1761j6395J111R056J1866
15682D88059L61j3573q413o529j0022O04j753J3879l835R13o362l421p475j4995
15668D27438j5247J6987K4895o776k0314l310L217o913o157J357N158N391j2490
15655D13236j4696j7951j6242Q749N082m257j46m131J836O026Q50q494j0879q825
15641C50158J0762R63j5792n372j3825J5282J5044j0998r136j812q64l525k009
$$ y = [868367, 833354, 791732, 761518, 742541, 728014, 719648, 707581, 694130, 684268, 689936, 680698, 658716, 654397, 645852, 634435, 626731, 632172, 624235, 624550, 624250, 613684, 616705, 613111, 603493, 598475, 583558, 584486, 575946, 565376, 574064, 582708, 577958, 558145, 552923, 550093, 549899, 536524, 532287, 520591, 528851, 539150, 530879, 524744, 518812, 511376, 509584, 494292, 494182, 482421, 466026, 467137, 476193, 488059, 488420, 474847, 466434, 459905, 449883, 450487, 448734, 462613, 458778, 459691, 453329, 449908, 442433, 427438, 412191, 429178, 454073, 447297, 426983, 423673, 426890, 419977, 413820, 415177, 420335, 425726, 413236, 398540, 380589, 364347, 373096, 378178, 373921, 373775, 369644, 371480, 377506, 378356, 369862, 358983, 350158, 360920, 361883, 346091, 340719, 326894, 342176, 357220, 346222, 337086, 335274, 334410, 330885, 328876]
15628C28876m414j1372L288o144r230R630J707N97N268l560k150L382j0547p033
15614B98298M80l220P001M54m360j869J34K118l578M56k675L520O619q570m355
15599B90453j1808q78l64m906q896l227N466m912N221Q979o481j4215Q198N954
15585B68584o13j178q647j7611J849N224R34R788k912p415l076o84K84K374n983
15570B40918M178n069j0910o387O222J5334n52R10j0194k151J3901L015j011j3914
15556B34290j3386p51q477k838r411j1960J568J49R051J0559J355J86q918j9223
15542A82194K007j085n161J964J0980j533n120o987M970R291q431L109Q975l661
15528A91512n531p74j7455j1554m151n954O892J1516Q170q534q48O696N805N086
$$ y = [328876, 324462, 313090, 316378, 310234, 301004, 310634, 312341, 312938, 318206, 314646, 312496, 315878, 305331, 298298, 298778, 295558, 302559, 303013, 298653, 296784, 296918, 299036, 295458, 295914, 293239, 296759, 303378, 294808, 290453, 278645, 277767, 277403, 272497, 263601, 260374, 265840, 260928, 266149, 275128, 268647, 254432, 262630, 268584, 267971, 266793, 258146, 240535, 242384, 247608, 248542, 258330, 255418, 248003, 244927, 244243, 244527, 246901, 240918, 245096, 240027, 229117, 222730, 228952, 244286, 243734, 244644, 234450, 232299, 246200, 249215, 248204, 234290, 220904, 220153, 211676, 208838, 199427, 187467, 189035, 189184, 198235, 208794, 210149, 210335, 201417, 182194, 184201, 183116, 177955, 179919, 190899, 189366, 184246, 177259, 182229, 191520, 183089, 186198, 195173, 191512, 185981, 185207, 167752, 156198, 152047, 146093, 152985, 164501, 172671, 164137, 163289, 169985, 175790, 180876]
15514A80876q371j9883m713M317J4548M162n079q706n672m530p392j2391J716
15501A28882J1191J7981q643j1504J58K98O393L888p174o577j496K22l311j900
15487A28408R602n384K34R691J7094m664j6434k436j522j4320M125O262m792j144
15473A24720M166p178j0052P046r155o489J8390q761o792J0078o73N71J518P778
15459A25167n286j335q606j6406N896Q537L199q946n675J9439J358P94m943L957
15445A17150j3128j818P749n483j3679j155p13M092k946N776o60n338k992K099
15431H8954N928R464j193r788j1595k869J8696J437K881K3101R511j574j3565
15418A19388k5024m517o306L121O132K361j5J0402K116j3397j4807k380J925j1143
$$ y = [180876, 172505, 152622, 147909, 152226, 166774, 170936, 165857, 157151, 151479, 146949, 139557, 127166, 128882, 140073, 158054, 149411, 137907, 138065, 138363, 144756, 148644, 141470, 134893, 133397, 133619, 130308, 128408, 138010, 132626, 132860, 142551, 159645, 154981, 138547, 136111, 134589, 120269, 124394, 130656, 125864, 124720, 128886, 121708, 111656, 118702, 109547, 103058, 121448, 112687, 105895, 115973, 115300, 115871, 117389, 125167, 119881, 118546, 109940, 93534, 99430, 107967, 111166, 102220, 96545, 115984, 117342, 118136, 113193, 117150, 104022, 102204, 109953, 104470, 90791, 89636, 88923, 93015, 90069, 95845, 95185, 89847, 86855, 88954, 94882, 104346, 103153, 93365, 81770, 78901, 97597, 99034, 101915, 125016, 134527, 132953, 119388, 94364, 89847, 83541, 86662, 92794, 95155, 95140, 105542, 107658, 94261, 79454, 77074, 78999, 67856]
15404F7856q575J799J4468O557J856J833r626q027M986o397k354j433J9572K0407
15390A02922l631k4891j3778K655K5070k002j497J898r576j218n477P442J1368
15377H9285j1633k2468l927R937N837O031J1376J5059P496p923j6463m345j9457
15364E8805l418O043j878p152k067N420L433N547K967J2720J38p263o74O176j2934
15349F5863O179j946k45J0590o834n569q144Q910P674m241q026L809M47l373N18
15334F5612O149O488J1807j5656j7430J0900P039k951N046j439l528j4975N413
15321F2475P377q863P998j1399k913Q209J3136p913j9844p892q319K498L369N55
15307C8474J941K285j955P540J0187P947Q951q986o481K488n10k5313r190P802
$$ y = [67856, 59281, 61080, 75548, 82105, 83961, 85794, 76168, 68141, 73127, 66730, 64376, 62943, 82515, 102922, 99291, 74400, 60622, 63277, 88347, 86345, 84848, 86746, 77170, 75952, 70475, 77917, 89285, 77652, 55184, 51257, 61194, 67031, 73062, 84438, 99497, 106993, 99070, 82607, 78262, 58805, 55387, 61430, 59552, 52400, 50333, 55753, 59186, 64733, 67700, 80420, 80558, 73295, 72621, 78797, 65863, 72042, 70096, 69851, 80441, 73607, 68038, 59894, 68804, 76478, 72237, 64211, 68020, 68467, 65094, 65612, 71761, 78249, 90056, 74400, 56970, 67870, 74909, 71958, 77004, 75565, 72037, 57062, 62475, 69852, 60989, 68987, 57588, 54675, 62884, 76020, 68107, 48263, 40371, 32052, 34550, 37919, 38474, 40415, 42700, 40745, 48285, 58472, 66419, 75370, 66384, 59903, 62391, 61881, 36568, 27378, 35180]
15293C5180N426Q913K207m523n208J1337R589L154q895j0581j7665K328O99k755
15279B9206p257L775J4696N137p402j8680J770J2790J615J020l906l84j878Q604
15265C9106K132L144Q180k606k9j2836M78P828r911j4282J3257J168P685l164
15251D0150j5929m220R37J891J049P601j026R050j197j5606K55J247J5520p129
15237C2593k0164L510R630J8179P012o402o259k581q247q12L27P57P229K237k426
15222C4583N644n943j2682r101O144l582j070j577O631N918Q106O240l799K289
15208C7801j484k2992o152L897K9766K972p946m079j2035K518j734K469K915J0327
15194C6243M336q122j0117j493j2376j0639J1231J4159O76K327O979q319L93l23
$$ y = [35180, 40606, 49519, 51726, 47203, 41995, 53332, 62921, 66075, 57180, 46599, 28934, 31262, 31961, 29206, 21949, 25724, 40420, 45557, 38155, 19475, 21245, 34035, 35650, 36670, 32764, 32380, 30502, 39106, 41238, 44382, 52562, 49956, 49927, 37091, 37569, 45397, 35486, 21204, 34461, 35629, 43314, 40150, 24221, 20001, 20938, 22829, 23878, 31479, 30453, 39503, 38306, 22700, 22955, 24202, 39722, 32593, 12429, 15939, 25569, 43748, 50760, 44358, 38099, 35518, 27271, 26459, 26786, 27543, 34772, 37009, 34583, 40227, 34284, 21602, 12501, 18645, 15063, 13993, 12416, 19047, 24965, 33071, 39311, 35512, 37801, 36317, 13325, 7173, 11070, 40836, 43808, 35862, 31783, 19748, 22266, 20532, 23001, 25916, 36243, 40579, 32457, 22340, 20847, 8471, -2168, 9063, 23222, 23898, 26225, 33204, 24885, 25278, 24955]
15180B4955n239Q516L566N8M743J57P967M79n055k474r385l587J720O889o886
15165B6424N526P663o547R68j2129j8359o400N290P881m066r747p122Q814J0980
15151I176Q05J555j2456N205O515L151j0211j543R062J2639Q608R706M664j0323
15137C6553j8060n629j157k682M144o359k543Q686M068p276Q155K4635J4074r812
15123D6797j2695j1741J499j5434m027Q296p91M738R996k616K861N421p863R142
15109C3583J0627k0846p287k832o785J669R650O100J969k254M49J767m230q541
15095A3039q98M767m611P836P771J1917p920j5293n926m779J0345J0075o352j3002
15081F969m733J2974O406O00m417K866q205j0604n032N825K1249K425k1720k566
$$ y = [24955, 19716, 28232, 31798, 31856, 36599, 36756, 44723, 45202, 40147, 37673, 28288, 24701, 26421, 33310, 26424, 31950, 39613, 33066, 34034, 21905, 3546, -2854, 2436, 10317, 6251, -3496, -10618, -1804, 9176, 9981, 11536, -920, 4285, 10800, 13951, 3740, 2197, 11259, 23898, 32506, 42212, 46876, 36553, 18493, 12864, 11707, 9025, 13169, 6810, 4267, 12953, 17021, 9745, 17900, 42535, 56609, 46797, 34102, 22361, 23860, 8426, 4399, 12695, 11904, 16642, 26638, 24022, 26883, 32304, 24441, 33583, 44210, 23364, 16077, 13245, 6460, 8129, 17779, 23879, 25848, 23594, 24043, 25810, 21580, 13039, 12141, 16908, 12297, 20133, 27904, 39821, 31901, 16608, 10682, 5903, 16248, 26323, 19971, 6969, 2236, 15210, 21616, 22216, 17799, 20665, 12460, 1856, -3176, 2649, 23898, 26323, 4603, 2037]
15067B037Q373j2723R571J6314N73o222k00j084J1768L587j2765M441P485o83
15053C0472l764q548o055K621L193N679P483m294J0318o070r116R01O160Q237
15039C7217q639L27q818j4166M617J3885n944o622L355P458j5492l732J1031l965
15025A0512K21Q806J5025K0415J5310j5483p272o134o260j2994k872J1855P0j6035
15011A5164J592J719l024L628J5448j535j1347k835J229o715j998J5816J7833
14998D4975K466r056k115l672J6930J2686L370j0366j0635n596l53J045m496j114
14984C4069J1615O730n005j6863q562r670J091k328O13Q585j526j3134O902J8969
14970C1486N937K91r930j3671j031K923J3381J4040j6918j0932M858p770m438
$$ y = [2037, 10410, -2313, 7258, 23572, 24145, 17923, 17723, 16639, 28407, 31994, 19229, 23670, 31155, 30472, 26708, 18160, 12105, 14726, 17919, 23598, 31081, 26787, 37105, 31035, 21919, 22820, 28980, 37217, 28578, 28905, 20087, 5921, 10538, 24423, 18479, 11857, 15212, 22670, 7178, 3446, 14477, 10512, 10733, 19539, 34564, 54979, 70289, 54806, 47534, 41400, 35140, 22146, 19274, 31129, 31199, 15164, 16756, 18475, 15451, 19079, 34527, 32992, 21645, 18810, 20039, 13324, 11326, 27142, 44975, 47441, 38385, 36270, 32598, 49528, 62214, 65584, 55218, 44583, 38987, 38634, 39679, 35183, 34069, 45684, 52414, 47409, 30546, 21984, 12314, 13405, 11077, 11690, 20275, 18749, 5615, 12517, 31486, 37423, 37714, 27784, 14113, 13082, 16005, 29386, 43426, 26508, 15576, 20434, 12664, 8226]
14957H226j9934p848K183n742n197J634Q013J0809J0355l5l421R518O663N729
14943B0953q267K70k25j2265q218m100J1576J0914q205j2259J2446J3671P619
14930B3910l925j0984K857N079q882j1688j0763M041J6095M860j33n739K522J308
14916H558J702k502Q406J8621j659m677R411j526k6814r294l154o236L360J942
14902c862j1141o612P74o335N982N525N79J206K56p035O269N404N127N880J2714
14887A4731R192j6242q914N88k089n596O295N380O376J473j6690k3782J462J355
14873b6461L899J0880J767m059J1116M111m419j2244J2824J3816l759n855j1840
14860a0224n171P484L663J1822J0223o019l913R70n97j5812r398j0106J9537P084
$$ y = [8226, -11708, -19556, -17373, -23115, -28312, -26678, -18665, -7856, 2499, 2464, -957, 8561, 15224, 20953, 12686, 12956, 12731, 466, -7752, -11852, -276, 10638, 2433, -9826, 2620, 16291, 23910, 19985, 9001, 11858, 16937, 8055, -3633, -14396, -10355, 5740, 10600, 10467, 4728, 7250, 8558, 10260, 7758, 16164, 34785, 33126, 28449, 37860, 36334, 9520, 226, -2928, -9164, -5804, -3862, -15003, -21615, -20841, -27176, -21194, -15669, -15090, -13884, -13628, -20663, -14394, -8990, -3863, 2017, 14731, 23923, 7681, -1233, -645, -2734, -8330, -2035, 3345, 9721, 11194, -5496, -29278, -27816, -26461, -22562, -11682, -9915, -13974, -2858, 1253, -3166, -15410, -2586, 11230, 7471, 1616, -10224, -15395, -7911, -4248, 7574, 17797, 11778, 7865, 8835, 8238, -7574, -16972, -27078, -7541, -457]
14846d57r954l694P999n353j3697O432M958l131j290p204J072J1711Q826k687
14832f469k084K567j1582Q210J3159P137N948j2640k1240J71j306k31L220r560
14818b4700J3573q254j1127K1000J0264m631J140j4520l068Q673M361j0031O835
14805a0485L683k407k136p482j0216L240p22k497P528p454O360k931L995J4915
14791f609M052q343j3763j0834J662j36K683n321L637j543n757K852k676N135
14777c4961L875M584P951n01n155P846K621r833j2728r996p100N30P352N298m672
14762d4889J0663J6456l377m084j5371J6309J0459O912J054j120O908o020l329
14749i429P997N61k741r070k462L210L174k074m605o769m324l131N972J1116K353
$$ y = [-457, -10411, -14105, -6106, -11459, -25156, -18724, -13766, -16897, -18187, -25391, -24319, -12608, -3782, -6469, -8553, -5986, -17568, -9358, 3801, 10938, 16886, 4246, -16994, -16823, -18129, -18360, -15140, -24700, -11127, -19381, -30508, -9508, 756, -3875, -2735, -17255, -20323, -11650, -7289, -17320, -10485, -6802, -9209, -11345, -18827, -29043, -25803, -26525, -29022, -21494, -28948, -22588, -25519, -21524, -6609, -2557, -10900, -24663, -35497, -33835, -33971, -31288, -36609, -32972, -34515, -40272, -37420, -40096, -34961, -31086, -26502, -18551, -19052, -24207, -16361, -13740, -23573, -36301, -46297, -53397, -52867, -45515, -40217, -44889, -34226, -17770, -21147, -25231, -40602, -24293, -13834, -6922, -5868, -6988, -80, -6100, -9429, -1432, -871, -3612, -12682, -15144, -11934, -8760, -10834, -15439, -22208, -26532, -29663, -23691, -12575, -10222]
14734a0222O013k312m904j2105j4681k076Q486M656J1027J1175l654j5359m56
14721b4412M391M834k46k708n577l151J030L697k834k657m800K249J2787J5784
14707a613k150j0393r789l556P872m584j8407j506K6632J5315L72R648j4734j0431
14693a7324j906R570M665j7275n629l748O913J1403J0076p770J632K438m654j642
14679a3251q599J3613J5376m276o479k716J763L173j858j0770q064m63J1771n722
14665a6502m93O100j860j0265N668K840J051J307j4568k293J3184J1121o558j1691
14651b2959M716N214Q528p017K875n786l123L097L669n694j655m033n194J8443
14637h919O133K266P712l484L196j863L164n980j3936N3l916J135l817M565j292
$$ y = [-10222, -4209, -6521, -11425, -23530, -38211, -40287, -31801, -27145, -16118, -4943, -8597, -23956, -24412, -20021, -15187, -15433, -18141, -23718, -26869, -25839, -22142, -24976, -27633, -32433, -30184, -17397, -1613, -3763, -14156, -23945, -27501, -19629, -24213, -42620, -44126, -17494, -2179, -1807, 7841, -6893, -17324, -19230, -9660, -4995, -22270, -27899, -31647, -24734, -13331, -3255, -11025, -9393, -6955, -11609, -13251, -21850, -8237, 7139, 2863, -3616, -6332, -4569, -1396, -3254, -14024, -22088, -22551, -10780, -16502, -16995, -10895, -12755, -23020, -17352, -14512, -13461, -12154, -26722, -29015, -15831, -4710, -11268, -22959, -18243, -13029, -4501, -11518, -8643, -14429, -17552, -14455, -10786, -16480, -18135, -22168, -27362, -8919, -2786, -520, 7192, 3708, 6904, 5041, 8205, 2225, -11711, -11658, -15574, -14439, -18256, -13691, -14983]
14622a4983K275p13Q59l551k0863Q364L152l948K088p088j5983L814J7136m39
14608b9880J1853R029Q808n592O852l464j9384j7603Q227J1185M668k558k053
14595a9912j699o315J2152J8980k290q550j3009K594o92L923P466J3922q624J739
14581c15j3197n799J4644J631q471n631q777P811n065n464j5305J4371P172k22
14567b2617L799j911m626O370J743L124J3921j902Q931J869l855j1008R562n824
14553b424j3701j1231k338N18K515J6637K788q096j3670o47O943K207M978Q434
14539g087j1281l117R532K500L342k389o150Q291o048j0293M792j2967J716j0206
14525c9365K620r79N696K4496L842K864P65m802j1299m799J4114m638j3317p327
$$ y = [-14983, -12708, -13421, -12562, -16113, -36976, -28612, -25460, -29408, -27320, -34408, -50391, -46577, -29441, -29880, -18027, -8998, -190, -5782, 1070, -2394, -21778, -39381, -31154, -19969, -15301, -17859, -19912, -21611, -27926, -15774, 3206, 916, -7634, -20643, -18049, -18741, -14818, -7352, 6570, -2054, -315, -13512, -19311, -4667, -3036, -11507, -17138, -25915, -18104, -23169, -28633, -43938, -29567, -22395, -22617, -18818, -20729, -25355, -18985, -17242, -14118, -197, -2099, 6832, 8701, 4846, -6162, 3400, -2424, -16125, -27356, -29694, -29176, -26661, -10024, -7236, -15332, -29002, -29649, -22706, -20499, -15521, -7087, -18368, -21485, -11953, -9453, -6111, -8500, -14650, -6359, -12407, -22700, -17908, -30875, -29159, -39365, -36745, -37724, -32028, -7532, -3690, -826, -61, -4863, -16162, -20961, -6847, -11485, -24802, -32129]
14511c2129o04R676R152l890N510N732j107J57P703q762m210o666j092N055M422
14496a1053n075P523L133j845n073L763O891j3859o63P30R362j1653n338j1041
14482c4198M893J5413j1449p597J329N70N691J2385J975k324r28q35q310n364
14468b8749R417m796r624M020k590l401l560m023M578Q555pj0283R300P690M040
14453a9433n41O678K8365L548o868j6329j4141j4257l251M882J335J5313m455
14440a9154j2136j082N504J3078J7392j0195j4607J2533J2053r327j0792l52m288
14427b1373L269j189k654m146o92l200j1174L027J6449R451r813M412l63J916
14413a6080j0556q405K13n978L039J7519P270m146n099R48J6439N831o925r637
$$ y = [-32129, -32733, -23057, -13905, -17795, -12285, -6553, -7660, -7503, 200, -8562, -12772, -19438, -20530, -15475, -11053, -16128, -8605, -5472, -7317, -12390, -8627, -1736, -15595, -16258, -15528, -6166, -17819, -23157, -34198, -29305, -13892, -25341, -32938, -31609, -31039, -25348, -12963, -10988, -13312, -14240, -15075, -23385, -28749, -19332, -24128, -33752, -29732, -32322, -35723, -39283, -43306, -38728, -30173, -30180, -40463, -31163, -23473, -19433, -19974, -13296, 15069, 18617, 11749, -4580, -18721, -32978, -36229, -31347, -30012, -14699, -19154, -31290, -32372, -26868, -13790, 3602, -6593, -21200, -8667, 3386, -5941, -16733, -17085, -21373, -18104, -19293, -21947, -26093, -26785, -29985, -41159, -38132, -21683, -12232, -22045, -17633, -17996, -16080, -26636, -35041, -34828, -40806, -37767, -20248, -12978, -17124, -22223, -21275, -4836, 995, -5930, -15567]
14399a5567Q117J4899r787k976O021J0385q657k0245r251J168R441n723j052o747
14385b9974O215O649m215o304J890k621M170M460M517o401j330J0409o417J1332
14371g620R119m038j1105p907K582K0155q857K883O769k749k3707j2752N494Q15
14357c0918L285L807Q579Q495q064j690M111J1126j743j956j2300J966l0K99p868
14342b2901N104n040Q152K292m92k437o171p01J1890J1226R023M711j9066k1587
14328b5997n230m143q473J1589J0822O651p647l856P445K114J4159L691l282j3170
14314a5327p574O680k703l592o117j174J3576l187J1919O476j696j4114p635P442
14300a7026j976q256o710J1041O399p576K733m100n809l349J0298R482q657j0096
$$ y = [-15567, -7450, 7449, -2338, -5314, 707, 11092, 2435, -17810, -27061, -25893, -16452, -22175, -23227, -29974, -23759, -17110, -21325, -27629, -25739, -28360, -24190, -19730, -15213, -21614, -22944, -12535, -18952, -7620, 1499, -2539, -13644, -21551, -18969, 1186, -7671, -4788, 1981, -768, -24475, -37227, -31733, -30918, -27633, -23826, -15247, -6752, -14816, -16506, -12395, -1269, -3012, -4968, -17268, -15302, -15332, -15033, -22901, -17797, -22837, -14685, -12393, -12885, -15322, -21493, -22194, -10304, 922, 9945, 14656, -4410, -25997, -31227, -35370, -43843, -32254, -21432, -14781, -22428, -26284, -18839, -16725, -2566, 1125, -2157, -15327, -22901, -16221, -18924, -22516, -28633, -29807, -16231, -19418, -7499, -1023, -2719, -16833, -24468, -17026, -19002, -27258, -33968, -22927, -16528, -24104, -21371, -25471, -31280, -34629, -24331, -14849, -23506, -33602]
14286c3602P413O430Q436j0031k1839J1759J9394J1210K379j1904o956Q086M818
14273d407N203L928p593j4648N730o40N307J3745m964m783o557k448q977n711
14259b6815O653n30K540R415J15j9249k725Q138J3541l071j2714p622N047J0079
14245a7198M38k090J2209M116j0314k011M553J615n750K536J2010j145o568m319
14231a1918J986J6599N348m419n725j4600r473L616N704j0838J0735O088J1073
14218D176J3966j8847j7012m634m594m910J1454l359J013q08k480J951J167n922
14204b8839Q731N045m399j449J3505J634r299R080P320k793j857J599M909J040
14190D227o284p479j0080p008M027l89j628p75j0648M165K569k21l396O906P137
$$ y = [-33602, -26189, -19759, -11323, -21354, -43193, -31434, -12040, -830, 1549, -10355, -17311, -9225, -4407, 796, 4724, -2869, -17517, -11787, -12427, -7120, 6625, 1661, -3122, -9679, -12127, -21104, -26815, -20162, -20692, -18152, -8737, -8622, -27871, -30596, -22458, -8917, -11988, -24702, -32324, -27277, -17198, -16760, -18850, -6641, -2525, -12839, -14850, -10297, -8682, -14432, -11896, 114, -1031, -7599, -11918, -9932, 6667, 12015, 7596, 1871, -12729, -22202, -18586, -12882, -23720, -12985, -6897, 4176, 18142, -705, -17717, -22351, -26945, -31855, -20401, -23760, -22747, -23555, -26035, -24084, -22917, -28839, -20108, -15063, -19462, -20911, -7406, -5772, -15071, -5991, 1329, -1464, -3321, -1722, 3187, 4227, -2057, -9536, -19616, -26624, -22597, -22986, -24614, -25389, -36037, -31872, -29303, -29524, -32920, -26014, -18877]
14175a8877J31q610M746J575K216Q072P726k064p960l303k555R871R553j8120
14161a7599p003J604J5843L98k983J0240r635J159o058P006r155k106L040J1167
14147d082Q411l815j1136j1179J642j1868L376P854L604J6203n987P023M819j3617
14133h752r830k234P98J374j712K767m29l900j1517j4924Q755R914R118J1636
14119h936k903K489l8p384j497J5826N981J453O775j6921k3135p641Q505J5827
14105a1599j698m90L275M786J688M629M091L022N631j1595j3004n928O145L3k0444
14090c1458L632O546N736J0188P646N815M749p385j1197K081k726K200L61m601
14076h413M701k191P984j0942j6148K23O272O245J2989j3757n5J0356p820J0959
$$ y = [-18877, -18746, -27356, -22610, -21035, -18819, -10747, -3021, -5085, -13045, -16348, -18903, -9032, 521, -17599, -24602, -22998, -7155, -6757, -9740, 500, -9135, -7976, -14034, -7028, -16183, -18289, -15249, -4082, 4329, 514, -10622, -21801, -20159, -32027, -28651, -20797, -17193, -990, -6977, 46, 4865, -8752, -18582, -20816, -20018, -18644, -20356, -17589, -18018, -21918, -33435, -48359, -39604, -29690, -20572, -8936, -11839, -9350, -9388, -16772, -18269, -2443, 3538, 4991, 11766, -5155, -28290, -35931, -27426, -11599, -13297, -13787, -10512, -5726, -4038, 591, 4682, 7704, 13335, 1740, -11264, -17192, -11047, -11014, -31458, -27826, -21280, -15544, -5356, 2290, 8105, 12854, 5469, -5728, -3647, -6373, -4173, -3812, -8413, -3712, -5903, 2081, -8861, -25009, -24786, -18514, -12269, 720, -13037, -13092, -2736, -10556, 403]
14062D03N585j6618j2827k720j770K694L72J7080Q78P914M678j0014l139q003
14048a5487P996K1601L623j2585o084p211j5930M72J6124j292r237q3p40R529
14034i304J8814o532L10P626q780j4449M689l128Q49K797K230m625P646k701l418
14019g976k983m439l825J481J1847M560K39J0841P457j1648P239l328j0769K184
14005H80J668n931q108p48O490L978j1625p116j008O221O570P116p883j3115j533
13990b4144R811Q274J0103J3133l843j3524m350m970J1963P131r527j778Q080
13977F359N105R404q033j1145j3729K531k97L79j718m118k064m045J9740N619
13963C988q537R010J285j1863p12O181j527j934q380J911J5199J0055L545j7767
$$ y = [403, 5988, -10630, -23457, -26177, -27947, -25253, -24881, -7801, -6923, 991, 5669, -4345, -7484, -15487, -7491, 14110, 17733, 5148, -936, -8147, -24077, -23605, -7481, -8773, -18010, -18093, -18833, -9304, 9510, 2978, 3288, 10914, 2134, -12315, -7626, -10754, -9905, -7108, -4878, -9503, -1857, -4558, -7976, -10959, -15398, -19223, -17742, -5895, -1335, -1096, 9745, 17202, 5554, 12793, 9465, -1304, 880, 2548, -3383, -11491, -12239, -5749, -1771, -13396, -20512, -21520, -15299, -8729, -1613, -9496, -22611, -24144, -14333, -6059, 4044, 17177, 13334, -190, -4540, -9510, 2453, 9584, 57, -1721, 6359, 11464, 20868, 12835, 1690, -12039, -9508, -9805, -9426, -11144, -15262, -17326, -21371, -1631, 3988, -4549, 4461, 5746, -6117, -6829, -648, -2175, -4109, -12489, -10578, 4621, 14676, 18221, 454]
13949D54j1744M735R428q216j4577q06L677J1417L011l453q570k832J301K92J639
13934a4244P997J239j1683j1262R31L705P387o00j78P226P64n532J0775J814L441
13919A780J3269O468l34j351p618o500j4752n634p201O732Q024K590k105J246
13905e386P4R46O876j2464l369K021O296N374j905j0896j5741J493J3249J4175
13891G43K922j3762o266j0109M469R826J933J447K482K174k925M196l464J3910
13877G576K08K967J572J714N156m869n131m234j059o231k888J045L266J287r488
13862i109p310j811K609k729k827p522j1515R357Q359L02j5745O264M195L066
13848b4416n80L77P246K040k824J0659M848N376j0523O929J3819j3558p28o036
$$ y = [454, -11290, -6555, 2873, -5343, -19920, -20726, -17049, -5632, -2621, -6074, -14644, -17476, -16175, -15883, -14244, -6247, -5008, -16691, -27953, -27022, -23317, -15930, -16530, -16708, -9482, -8718, -14250, -3475, -1661, 1780, 15049, 21517, 21183, 19832, 12214, 5714, -9038, -14672, -21873, -15141, -7117, -4527, -6632, -5386, -5312, -4366, 2510, -9954, -13323, -11302, -5006, 368, -1537, -12433, -28174, -26681, -13432, 743, 3665, -10097, -16363, -26472, -22003, -12177, -10244, -8797, -6315, -4141, -7066, -2870, -6334, 7576, 7784, 10751, 12323, 14037, 19193, 14324, 9193, 4959, 3900, -2331, -5219, -4174, -908, 379, -9109, -16419, -18230, -15621, -18350, -21177, -28699, -40214, -30857, -22498, -22196, -37941, -31677, -27482, -24416, -24996, -24619, -17373, -15333, -18157, -7498, -2650, 2726, -7797, -868, 12951, -607, -1335, -7371]
13834g371l793J7149P967Q28o699k0231K708j1884O91J1471r33J0875j0392j791
13820a1405M252l95j212N586M525k87l912m118J158L371l031Q496o390l810J517
13805e655j456L080J5851J0062n623Q673l402j4903J789J621m913j7885p897K283
13791a8375Q325j45M673m066J0134J9122n161n687j706q501M031N514J2508P021
13777B7687j6466m857O159J0594K571k124M470l356N772M487p023k348l662n31
13763B1373J6835J0647L991O226l532j299J4898K2397J0342J4078N650P846R873
13750A39325k314J5939J4901N892J408O962m673n251j6175j1347q669p758m212
13737A24028p101k1874j5747n613j2236j9679k0462l403K0258J924q562J6375
$$ y = [-7371, -11164, 5985, 13952, 14780, 8081, -12150, -9442, -21326, -20635, -9164, -10097, 778, -9614, -11405, -7153, -7548, -8760, -3174, 1351, 1064, -2848, -6966, -5808, -2437, -5468, 3028, -3362, -7172, -5655, -7111, -4031, 11820, 21882, 16259, 24932, 21530, 6627, 8416, 10037, 5124, -12761, -20658, -18375, -10050, -10195, -5522, -9588, 546, 19668, 14507, 8820, 7114, -1387, 2644, 8158, 20666, 27687, 11221, 6364, 12523, 23117, 25688, 23564, 28034, 24678, 30450, 34937, 27914, 25566, 21904, 21373, 38208, 48855, 52846, 59072, 55540, 54241, 69139, 91536, 101878, 115956, 121606, 129452, 139325, 137011, 152950, 167851, 173743, 175151, 182113, 177440, 172189, 156014, 144667, 135998, 128240, 124028, 116927, 95053, 79306, 73693, 61457, 41778, 21316, 17913, 38171, 40095, 31533, 47908]
13725D7908N003p255j4813l544K552P886J2161o438r491n482j520L3o474J2864
13711C3390J1137R230J0489M983J9344J18P753K4078K1384J6481J3541J0896o702
13698A76122J993K0558L865j1493k58n517j9051n187o684m439j1748k1148k1939
13685I5074j2227p925k577n554o515r425p912r043p885P018n04p627q675m61J4870
13670C0632j99j3120O13J1512k68K348N829j7231q946K671M701q578J3617K0389
13656D3970q016o645j452n269q689p336r236L797n402l882k661j39k842n163j643
13641b0608J8749J8174n950o546L36P198M281n139j5535M648J6369L535j721J3288
13627C1079k2192j8894M843k98L266J2759K625K980r315j3852Q408k62k892m471
$$ y = [47908, 52911, 45656, 30843, 27299, 29851, 37737, 49898, 43460, 33969, 28487, 26967, 27000, 20526, 33390, 44527, 53757, 64246, 69229, 88573, 88691, 96444, 120522, 141906, 158387, 171928, 182824, 176122, 178115, 198673, 202538, 191045, 190787, 185270, 166219, 161032, 154348, 149909, 138161, 117013, 95074, 82847, 74922, 72345, 66791, 60276, 50851, 42939, 33896, 26011, 33029, 32525, 24898, 16223, 15762, 30632, 30433, 17313, 17926, 29438, 29170, 31518, 37347, 20116, 11170, 13841, 18542, 9964, 23581, 43970, 35954, 29309, 27857, 22588, 13899, 6563, -2673, 1124, -4278, -8160, -10821, -10960, -13802, -18965, -20608, -1859, 16315, 10365, 3819, 4155, 11353, 15634, 10495, -5040, -392, 15977, 19512, 17791, 31079, 8887, -10007, -5164, -5462, -2196, 10563, 13188, 16168, 6853, -6999, 1409, 1147, -1745, -6216]
13613f216J039P195J4735L079L589k0252l992J0331J2703R69o596p941n095l519
13599B9O14q486m31R786j491p615J0661O154L820P724M309k567Q079r05j1462
13584A8219j7591k70j581r560l848M34J2485J2964p664j7007J2879K4233l401
13571B0292r211r333m261O582p657o675m90m509P703J4379P24Q738K877p097M360
13556A6422j5158j7087n134J5204J0518o944p655N914K332l335l624q153m455
13543b1155J1549J705r18N095J35R110r340o639J8750m41j0387j5636k052P659
13529a2565q426K838o299j464P076J6638J0037p027n054J0390P329o943J34O60
13515G324L300L246l07M262j7764j9845P252N272m026N454J0243L248P053K197
$$ y = [-6216, -5177, 2018, 16753, 19832, 23421, 3169, -823, 9508, 22211, 23180, 16584, 8643, 3548, 29, 643, -7843, -8274, 1512, 21, -7594, 3067, 9221, 13041, 20765, 25074, 22507, 30586, 29681, 18219, 628, 358, -1223, -10783, -14631, -14197, -1712, 11252, 3588, -13419, -540, 23693, 20292, 11081, 1748, -2513, 4069, -3588, -10263, -10753, -15262, -7559, 6820, 7544, 16282, 19159, 12062, 16422, 1264, -15823, -20957, -5753, 4765, -2179, -9834, -3920, -1588, -4923, -8547, -16700, -21155, -9606, -7901, -8819, -3724, -3589, 5521, -3819, -10458, 8292, 7851, -2536, -18172, -20224, -12565, -20991, -18153, -24452, -25916, -18840, -2202, 7835, 808, -4246, 6144, 13473, 6530, 6664, 7324, 10624, 13870, 13563, 17825, 61, -19784, -12532, -7260, -11286, -5832, 4411, 7659, 14712, 16909]
13501A6909j0719k2423o496J0845k175N445J7869L641N367k017N440j3237j8978
13488a0529L430J2345R012p214J0535j502l233M493j695J2948J0120j2673r650
13475A6387K812P918N950Q828j4122k3827o206N783M409L867Q873p325J18Q168
13461B1633j2039p294K506J1312l367n143k698Q088R313J781m088j1040p827n640
13447d503L496P848k258n40J0707p72p862l553M202J818m035l840M885j618K629
13432F604l841O039J33L281O474q288J78K0380Q041j1013j7415p453R884K657
13418A5661p516m262M177M925k06J0794J5217J2234L364L253j8825o417j2847
13405A9552j2260Q972j723L116K062M250L409J887q79j2472j0944K681L301K042
$$ y = [16909, 6190, -16233, -22729, -11884, -14059, -8614, 9255, 12896, 18263, 16246, 21686, 8449, -10529, -7099, 5246, 14258, 7044, 17579, 16077, 12844, 17337, 15642, 28590, 38710, 26037, 16387, 19199, 27117, 33067, 41895, 27773, 3946, -2260, 3523, 7932, 11799, 20672, 13347, 13465, 21633, 9594, 2300, 4806, 16118, 12751, 7608, 4910, 12998, 22311, 24092, 20004, 8964, 1137, -4503, -1007, 6841, 4583, 4043, 14750, 13978, 6116, 2563, 6765, 8583, 4548, 708, 5593, 3975, 6604, 2763, 8802, 8935, 12216, 18690, 10402, 10580, 30960, 39001, 27988, 10573, 3120, 13004, 15661, 8145, 3883, 8060, 12985, 12779, 23573, 38790, 51024, 54388, 57641, 38816, 32399, 19552, 7292, 16264, 14541, 17657, 19719, 23969, 27378, 29265, 28386, 15914, 4970, 7651, 10952, 12994]
13391A2994M611Q2R643J7052J0201j0507j0109o058k519j796m835K939Q792o839
13377B3651M15n916o136j3524k354K0647N620K787J1100J5552n501k0303k164
13364B3874r127p199j115J9459L075m848j2486p162J2524J3782o020M118R038
13351C7913n915l330l31N451l792r995j8422J78J2455R252j0588j130p38o079
13337D929M205n891q028j175K771N254M920K359O482M437Q040R573j317r213r371
13322A7975m036Q653K073j669n882j5114K498K0711O722j0662j4575P455J802
13309A5951L64J081k29k649j154Q35J2121M783k200p746k797N1M120j832K531
13294B3230Q136J0060o23q599P37q690Q96J5219J0903O479K450J960j4020r196
$$ y = [12994, 17605, 17687, 27330, 44382, 54583, 44076, 33967, 27909, 25390, 23594, 18759, 21698, 30490, 23651, 24066, 18150, 12014, -1510, -3864, 16783, 22403, 25190, 36290, 51842, 46341, 26038, 23874, 14747, 7548, 6433, 25892, 28967, 24119, 11633, 4471, 16995, 30777, 24757, 28875, 37913, 31998, 28668, 28337, 33788, 29996, 20001, 1579, 1757, 14212, 23464, 12876, 11746, 11008, 4929, 9134, 3243, -4785, -5960, -3189, 2065, 6985, 9344, 15826, 20263, 28303, 37876, 36559, 27346, 17975, 13939, 22592, 24665, 22996, 17114, 2000, 4498, 25209, 31931, 21269, 6694, 14149, 15951, 16315, 17396, 17167, 14518, 13364, 14199, 26320, 31103, 28903, 21157, 18360, 18411, 22531, 20699, 23230, 31366, 41426, 40803, 32204, 32941, 24251, 25147, 40366, 51269, 57748, 60198, 62158, 48138, 38942]
13280C8942j3543p055M373m361R769R943n586K563j2180j679J1262o228j781P087
13266C1526J4575O622r587k5904K192j792J4291J1654M283m642m750L736j2574
13253B9630L199J0691K96l071o54J5965m67r405j7462j1891O932N588N622j726
13239C3247M508O919j856L412L803L795q212k655L166j0928m035n930J780R766
13225C6780L100J3101L314M880j1286O301J3122K524r498j6451j1781j54j068
13212C2884l25o89j469P455N2N163J843m288N65J638p978m544J271r43J747M910
13196C7292O653o88j963R60o761j5978M89J4380J6602L125L614N254Q27N551m428
13181F4929n583k866K192q573N947O644j4039q958J2477J0320O396k0539o681
$$ y = [38942, 25399, 18344, 22717, 18356, 28125, 38068, 32482, 35045, 22865, 21186, 32448, 26220, 24439, 31526, 46101, 52723, 43136, 17232, 19424, 17632, 31923, 43577, 47860, 43218, 38468, 42204, 29630, 32829, 43520, 43816, 40745, 40091, 56056, 55589, 46184, 28722, 16831, 23763, 29351, 34973, 33247, 37755, 44674, 42818, 46230, 50033, 53828, 45616, 42961, 46127, 35199, 31164, 25234, 27014, 36780, 39880, 52981, 56295, 61175, 49889, 56190, 69312, 71836, 62338, 45887, 34106, 33952, 32884, 32559, 31870, 30401, 37856, 37908, 43071, 44914, 40626, 41191, 42829, 34851, 30307, 31578, 30635, 32382, 37292, 43945, 43257, 41294, 42254, 35493, 19515, 20004, 34384, 50986, 54111, 57725, 62979, 63806, 69357, 64929, 59346, 56480, 58672, 50099, 56046, 62690, 48651, 39693, 52170, 62490, 68886, 48347, 41666]
13168D1666N488J3700J2448L06N742R157J57j1723k534o030n155J6379n708M4
13154G3937j541j3089j2686O155J2236M010l172p300Q67R962J4784j36l725L063
13140H3365R037M159k0962q581J8436J3118M472Q065J03q007N549J1794j3623
13127A06925m04R466P095q870R212L868R804J9173J3683K1517J8293Q680L1665
13114B50107K6389J6684L6994L7909M5387M2003M0855M7978N3757P4478Q3991
13103G56532J08784J60025K58618L70162L88707L40657K80930K3938m09667n54146
13093A724540m69227l50237k38440j47004p4306o3744o4252l6108l0133m1579
13083B09510l5824j6241r769l828j5219p654r295j9406j6934n829L779j727j0024
$$ y = [41666, 47154, 60854, 73302, 73608, 79350, 88507, 88664, 76941, 74407, 68377, 63222, 79601, 73893, 73937, 72396, 59307, 46621, 52776, 65012, 69022, 65850, 58550, 59417, 69379, 84163, 84027, 80302, 83365, 92402, 96561, 75599, 67018, 85454, 98572, 103044, 111109, 111212, 103205, 108754, 120548, 106925, 106521, 115987, 123082, 114212, 123424, 127292, 137096, 156269, 169952, 191469, 209762, 218442, 250107, 276496, 293180, 330174, 368083, 413470, 455473, 496328, 544306, 598063, 672541, 756532, 865316, 1025341, 1283959, 1654121, 2042828, 2383485, 2664415, 2688353, 2278686, 1724540, 1255313, 905076, 666636, 519632, 445326, 381582, 317330, 281222, 251089, 209510, 173686, 157445, 147676, 143848, 128629, 120975, 111680, 92274, 75340, 69511, 73290, 71563, 61539]
13070F1539j074O502O265O315J5092j4157l840O441K147j778j1964j0680m535
13057E6273j0714r77R977L742J273J714r47J57k574J2736M589j0645j0970N06
13043E4140J1056K852o225k046l39J0154K855l34l351n940M477J3131P755m306
13029H3879n526j2917q25O697M854j218J2331J3862L04K93l455j3538j6131n898
13015F2712R271j8238l301J0796J1257o360l372O792J6354J887l567o071L681
13002H1841J433K86M984K624q707j0598P701N045o556J4483J6992M498o011m847
12988A03168k365j6591o224L535K306N675k108J30J2290M135J0129K02k2487n973
12974H5822M603P869J263l549m199p010K635K3878J6868l049o721o869l468j086
$$ y = [61539, 60465, 66967, 73232, 79547, 94639, 80482, 76642, 83083, 85230, 83452, 71488, 60808, 56273, 45559, 44582, 54559, 58301, 59574, 61288, 60341, 60498, 57924, 70660, 75249, 64604, 53634, 54140, 65196, 68048, 61823, 59777, 59438, 69592, 72447, 72113, 68762, 62822, 67299, 80430, 88185, 83879, 78353, 65436, 64611, 71308, 76162, 74944, 87275, 101137, 101441, 101734, 98279, 84741, 68610, 62712, 71983, 53745, 50444, 61240, 72497, 66137, 62765, 69557, 85911, 87798, 84231, 78160, 81841, 83274, 83560, 88544, 91168, 82461, 71863, 79564, 84609, 78053, 92536, 109528, 114026, 108015, 103168, 100803, 84212, 77988, 81523, 83829, 89504, 87396, 87526, 99816, 103951, 114080, 114282, 91795, 85822, 90425, 98294, 99557, 96008, 91809, 84799, 87434, 111312, 128180, 125131, 118410, 111541, 108073, 106987]
12960A06987p323j2251l095k993J973J8174K1203j0371j0760k813j468m93o30
12947I6140J1644J9732L5888J4300R07j400o593j3003q072M841Q450n484K722
12934A60072j3520Q029r342j950P89m033P351o767k966j3449M200R968Q726P668
12920A54776L313p937n32M659J0185o053l751k817q799k132k797Q357P049J9333
12906A72854P849j0566j3859Q38J180J3971Q125p385n050J4168L1529L4645N1463
12893B99762O2737P4300Q2761j1212P6248L5315j66903p4394j9590l3584k1100
12882C04340j7482j2394j0688j8691k6607k2116l5081o922j981J150j545M220
12870A56203K722N808Q662J1376K6196K1539N405Q757r701j6483o870k4065k1782
$$ y = [106987, 99664, 87413, 84318, 81325, 83298, 101472, 122675, 112304, 101544, 98731, 97263, 96770, 96140, 107784, 127516, 163404, 177704, 178611, 177211, 170618, 157615, 149543, 154384, 162834, 157350, 160072, 146552, 154581, 145239, 143289, 144078, 140045, 147396, 140629, 137663, 124214, 128414, 138382, 147108, 154776, 158089, 150152, 149620, 154279, 164464, 158411, 154660, 151843, 143044, 140912, 138115, 146472, 153521, 172854, 180703, 170137, 156278, 157116, 158296, 172267, 180392, 173007, 167957, 182125, 213654, 248299, 299762, 362499, 436799, 519560, 508348, 584596, 619911, 453008, 378614, 359024, 325440, 304340, 286858, 274464, 263776, 245085, 218478, 196362, 161281, 154359, 152378, 153528, 151983, 156203, 158925, 164733, 173395, 184771, 210967, 232506, 237911, 246668, 236967, 220484, 213614, 189549, 167767]
12857A67767k0906m822N69M226J8046J4100l359l425J4025j199k603n480k750
12844A74189n813J45L339J0627L730J5577J15N173J5265N384M785L747R824l104
12830B42983o989J3121K1599J3708K4236K7408K7252K6370J159j754M82k6703
12818C62872l0756j9013l0618n863o048j3204J7390N448k1041j946J556Q823J5543
12805B83143N044K7938K8984L4714L5310J1851O417O894o511O758j9968j8971
12793D01603j5850j0969P43K0265K1667K6073L6538J7480J6639J6636J000j3648
12781E18177j2343J0267J9978K6844J3117k1446j3913J0843M7237L5177j9843
12770F14095l0843m314j65j1785j1746J0079q337j837k484o0676m3688l8591m4928
$$ y = [167767, 146861, 142039, 142608, 146834, 164880, 178980, 175621, 172196, 186221, 185022, 182419, 176939, 174189, 168376, 168521, 171860, 182487, 186217, 201794, 201909, 207082, 222347, 227731, 232516, 236263, 246087, 242983, 235994, 249115, 270714, 284422, 308658, 336066, 363318, 389688, 390847, 389093, 389575, 362872, 332116, 313103, 282485, 276622, 270574, 257370, 274760, 280208, 259167, 257221, 258777, 267600, 283143, 288187, 316125, 345109, 379823, 415133, 426984, 433401, 440295, 433784, 440542, 420574, 401603, 385753, 374784, 375527, 395792, 417459, 443532, 480070, 497550, 514189, 530825, 531825, 518177, 505834, 516101, 536079, 562923, 576040, 554594, 540681, 551524, 598761, 633938, 614095, 583252, 578938, 578773, 566988, 555242, 565321, 556984, 555147, 552663, 491987, 448299, 409708, 364780]
12757C64780k6020j0617J4419J5557N198J6744J7264J5457J9089K6964K0154K5814
12745E04803r44k601q912j0390r261n5k560L982J912J2569J5549K4928K8688J5691
12731E73399J4198j882Q582Q284J694K4958K4640K9774L2648L6159J3940L2117
12719G98511M5093K8717K1428J5598J4167J1612K2100L1572K0471J0147J3564
12708A032980K8942M6903N0230P8491O1137L5725N5951O7162M6501M6946O8328
12697A619296O0358K0042J0909L6963M9796O4728O7744P2979P4996Q5015J13802
12686B276628R9003J06890J12504J03818J16587J24290J49471J71706K18710K31555
12676C711162K55268K64536L21037L89107M60722N06277N42990N94332O53594
$$ y = [364780, 338760, 328143, 342562, 358119, 363317, 380061, 397325, 412782, 431871, 458835, 478989, 504803, 503859, 501258, 492346, 481956, 472695, 472640, 470080, 474062, 475974, 488543, 504092, 529020, 557708, 573399, 587597, 585715, 594297, 602581, 604275, 629233, 653873, 683647, 716295, 752454, 766394, 798511, 843604, 872321, 893749, 909347, 923514, 935126, 957226, 988798, 1009269, 1019416, 1032980, 1061922, 1108825, 1159055, 1237546, 1298683, 1334408, 1390359, 1457521, 1504022, 1550968, 1619296, 1679654, 1699696, 1710605, 1747568, 1797364, 1862092, 1929836, 2002815, 2077811, 2162826, 2276628, 2375631, 2482521, 2595025, 2698843, 2815430, 2939720, 3089191, 3260897, 3479607, 3711162, 3966430, 4230966, 4552003, 4941110, 5401832, 5908109, 6451099, 7045431, 7699025]
12667G699025P79084Q93433R35397J006014J085583J220714J429586J643943J930439
12658A8623218K242079K512305K761934L126971L654090M360214N207110O222628
12650D8710549P241279Q213493R071033R123339R762758J1370912J3695681J8425307
12642A35614351K8071608M5253263O5729477P3681984O4017152N9733008L0746464
12635E02847307n6183507j03957114r0131183o8976507m8971580l2643418k1851987
12628H0132011j5465174j1414352q669155o752302n273947m400857l938518l358232
12620B0859474k668111k149011j774271j484752j223559r99693q52929p55098
12612H952050o76180n99618n19762m43104l75377l77835l80041l38909l23860
$$ y = [7699025, 8478109, 9371542, 10306939, 11312953, 12398536, 13619250, 15048836, 16692779, 18623218, 20865297, 23377602, 26139536, 29266507, 32920597, 37280811, 42487921, 48710549, 55951828, 64165321, 73236354, 82359693, 92122451, 103493363, 117189044, 135614351, 163685959, 208939222, 274668699, 348350683, 412367835, 472100843, 502847307, 446663800, 342706686, 252575503, 183598996, 134627416, 101983998, 80132011, 64666837, 53252485, 44583330, 37831028, 32557081, 28156224, 24217706, 20859474, 18191363, 16042352, 14268081, 12783329, 11559770, 10560077, 9707148, 8952050, 8275870, 7676252, 7156490, 6713386, 6338009, 5960174, 5580133, 5241224, 4917364]
12603D917364k77101k11158j81873j72328j57589j42671j24037q1488k2898O6612
12593C612833J45245J75751J43661J06218M8844k06410m57748m77226l95866l00506
12583B394796k20840j76220j36279j10428j04020r1770p3058r7923q5946l7166
12573A261146l7066l0193l7786l4522j1246L938j1579j4970k3561l4333k3853
12562A005975l0658m4696l4527l3876m0645k6373j6493J0267J361j0934j7867
12551G61534k7002j4982l731J2798J3418P386j1221j8850o178l0553l0880r949
12539F41790j3199J1618J8167k227M582J789j1026j2536N406m999k0443j5448
12527F03474N840J9307J9315K405Q443J9488J0270q013o307J0168J2903M353j8127
$$ y = [4917364, 4640263, 4429105, 4247232, 4074904, 3917315, 3774644, 3650607, 3569119, 3546221, 3612833, 3758078, 3933829, 4077490, 4183708, 4232552, 4026142, 3568394, 3091168, 2695302, 2394796, 2173956, 1997736, 1861457, 1751029, 1647009, 1555239, 1482181, 1384258, 1298312, 1261146, 1224080, 1193887, 1156101, 1121579, 1110333, 1114271, 1102692, 1087722, 1064161, 1029828, 1005975, 975317, 930621, 896094, 862218, 821573, 795200, 778707, 788974, 790335, 779401, 761534, 734532, 719550, 715819, 728617, 742035, 749421, 738200, 719350, 713172, 682619, 651739, 641790, 628591, 640209, 658376, 656149, 660731, 662520, 651494, 638958, 644364, 639365, 618922, 603474, 609314, 628621, 647936, 650341, 658784, 678272, 688542, 680529, 674222, 684390, 697293, 701646, 683519]
12514F83519k7807j4783k9133m3838l8458o049L2840M0178R997j4395k6127k7429
12502E38515j6895n089k7698l8211k3935j4385r795n956l374o363N537J0031J6051
12489D18433J4115l723O321K53J3571J2669J5141J0948J9598R474n156o708J9025
12476E23961P815K0791K2573L5372M3318J9511N788r632P720J1310J8030K0930
12464G27487J5176J1750J0696j3605n947k8135o0212n5225n3483p4305p5218n7414
12452C41565l1430l7482o419J080m99J0995J6753J3824K6662K8725K5751J1478
12440D01003J0335K1516J6755l878j2348l1758l7837k9312k3304o993q764j3413
12428B82002j3167l1009r879J557J4241n912j1603J826k629q482O117L061m241
$$ y = [683519, 655712, 640929, 611796, 567958, 529500, 523451, 556291, 596469, 606466, 592071, 565944, 538515, 521620, 516531, 488833, 450622, 426687, 412302, 402507, 396551, 393177, 386814, 392351, 402382, 418433, 432548, 428825, 435146, 435399, 448970, 461639, 476780, 487728, 507326, 516800, 511644, 504936, 523961, 531776, 552567, 575140, 610512, 653830, 673341, 679129, 669497, 677217, 688527, 706557, 727487, 742663, 754413, 765109, 751504, 745557, 717422, 657210, 601985, 548502, 474197, 398979, 341565, 310135, 272653, 266234, 267314, 266815, 277810, 294563, 308387, 335049, 363774, 389525, 401003, 411338, 432854, 449609, 445731, 433383, 401625, 363788, 334476, 311172, 304179, 295415, 282002, 268835, 237826, 227947, 229504, 243745, 237833, 226230, 228056, 225427, 216945, 223062, 226123, 221882]
12415B21882k4409j0342j5004o685q366j0358o074m816k299N577K512J1637N230
12402A58485R424Q802J1129J2317J8743J2605K347J3810O299m05N263K5397K7387
12389C11603L4200K8583K4796J4381m06q946j3795p324j373N93J5160L3393L1072
12376D61937K6759M8131M5656N7864N1901O9309J06833J64261K37447K75621K62026
12365A807745K46798J53845j26866l47753l71105k97786k23879j63846j16823
12356E60330q9853n8794m5842l0693l4197m3239l0258j0761r391k345j0288j4064
12344A80605j3399j5195j4985P385N947j027J999K2124J673L620J6098K956k026
12331A95775q490p940o307O020K435L748K3123R870j4329k3305j1746j3912j3912
$$ y = [221882, 197473, 187131, 172127, 165442, 157076, 146718, 140644, 135828, 133529, 139106, 141618, 153255, 158485, 167909, 176711, 187840, 200157, 218900, 231505, 233852, 247662, 253961, 253556, 258819, 284216, 311603, 345803, 374386, 399182, 413563, 413157, 404211, 390416, 383092, 381719, 382312, 397472, 430865, 461937, 488696, 536827, 582483, 640347, 692248, 761557, 868390, 1032651, 1270098, 1545719, 1807745, 2054543, 2208388, 2081522, 1733769, 1362664, 1064878, 840999, 677153, 560330, 470477, 411683, 365841, 335148, 300951, 257712, 227454, 216693, 207302, 204957, 194669, 180605, 167206, 152011, 137026, 144411, 150358, 149331, 151330, 173454, 175127, 178747, 194845, 197801, 195775, 187285, 179345, 173038, 179058, 181493, 185241, 208364, 218234, 203905, 180600, 168854, 154942, 141030]
12318A41030j868Q602N694k53n642j1489j964k563j558J0797j997M377Q047J9236
12304A70449K2426m821R141P131M071K563j0905R539J8674J385j216p274M870
12291B26033O759N184l140j9279j0507P049Q589n31j7709J0887J3406k629r431
12278B14681j1056j3674j680k175m705J2384L832J3276J2570Q913J824j983O496
12265B38703J8965J4981O449N609J4704J0552k010m592L579n36o283n706o697
12252B87718r505l563j327l468r336q292j4170j1372q36j60p69k769J533n620
12238B18064n558K538K4294J1580j0567p519P026N069P649R528J4601Q218M641
12225B89564m654j6592k2920k843q823l7185j8412j0057j0030j4427n984j285
$$ y = [141030, 139162, 147764, 153458, 153205, 147563, 136074, 134110, 131547, 129989, 140786, 138789, 143166, 151213, 170449, 192875, 188054, 197195, 204326, 208397, 210960, 200055, 209594, 228268, 229653, 228437, 221163, 226033, 232792, 237976, 234836, 215557, 205050, 212099, 220688, 220157, 202448, 213335, 226741, 224112, 214681, 203625, 189951, 188271, 186096, 181391, 193775, 197607, 210883, 223453, 232366, 234190, 232207, 238703, 257668, 272649, 279098, 284707, 299411, 309963, 307953, 303361, 306940, 306404, 300121, 294415, 287718, 278213, 274650, 273323, 269855, 260519, 252227, 238057, 226685, 225849, 225689, 224920, 222151, 223684, 218064, 212506, 215044, 239338, 250918, 240351, 232832, 239858, 244927, 252576, 262104, 276705, 284923, 289564, 284910, 268318, 245398, 242555, 233732, 196547, 178135, 168078, 158048, 143621, 137637, 136352]
12213A36352L463J784J240p86j350o180k02R060K1415L405q958O780Q653p036
12199A67640R43j2604n126L308M760J2615J2473R028K8908K6133l565j3209k59
12186B31045K7330L9289K8201L0684L6273N2869O2086O2622M7490N6111N6838
12175G30838O9115J25226K18018L32345M06329L58570L24355J74778k70579n56099
12165A912896n17257l78846k57494j90709j25245r0864n4068k1817j4493k6232
12155B35871l8581k5608j8529j1282j9245k1897n519j3226j583J7203J8236k509
12143A13331j4147j1886L929P320K417l428P943P631J0457m561O98P089P35p38
12129A26790P277J6654O365L632Q477M103J343p733j3792r370K472J368j3101
$$ y = [136352, 139815, 141599, 142839, 142053, 140703, 134523, 134321, 143381, 164796, 168201, 159243, 166023, 174676, 167640, 168583, 155979, 150853, 154161, 158921, 171536, 184009, 193037, 221945, 248078, 244513, 231304, 231045, 258375, 297664, 325865, 356549, 392822, 445691, 507777, 570399, 617889, 674000, 730838, 799953, 925179, 1143197, 1475542, 1881871, 2240441, 2564796, 2739574, 2468995, 1912896, 1395639, 1016793, 759299, 568590, 443345, 352481, 298413, 276596, 262103, 235871, 197290, 171682, 153153, 141871, 122626, 100729, 95210, 81984, 80401, 97604, 115840, 113331, 99184, 87298, 91227, 98547, 100964, 97536, 105479, 113110, 123567, 119006, 119704, 126793, 127528, 126790, 134067, 150721, 157086, 160718, 169195, 173298, 174641, 166908, 153116, 143746, 146218, 147586, 134485]
12116A34485J386K3737K863p185k413Q028J1707L0633L8496M1011O4478P8858
12104D26084P7610O4428K2841k4710o5572r3794q5161o8182m1111l7317l6830
12093A38286r051o982o305r065J895n998j1309p270l259K304k6682o334Q210J0232
12079F8672J142J393L085j3026j8398J482p525p119m363J5465J661J687J2983
12066E7139K545j4916r819K294J3459M399q571J099n863j2389R550J4137m696
12053D8368j4102j476J8977Q995q731k211j726j1173K445J0614j1643l712K343
12040C6968K676j344K045R222j0673q61J6929P380m806j0518k046J7922K239k0100
12026D5033j6247q647m482K251P128R959K449J119J3066K1165j0751q089M218
$$ y = [134485, 135871, 159608, 162471, 155286, 152873, 160901, 172608, 203241, 241737, 282748, 347226, 426084, 503694, 568122, 590963, 566253, 500681, 406887, 321726, 253544, 212433, 175116, 138286, 129235, 122253, 115948, 106883, 108778, 102780, 91471, 84201, 80942, 83246, 56564, 50230, 58440, 68672, 69814, 71207, 74292, 61266, 42868, 44350, 36825, 29706, 25343, 40808, 42469, 44156, 57139, 59684, 44768, 34949, 37243, 50702, 55101, 46530, 47629, 41766, 29377, 38927, 53064, 48368, 34266, 32790, 51767, 60762, 52031, 49820, 48094, 36921, 39366, 49980, 38337, 34625, 36968, 39644, 38300, 40345, 49567, 38894, 38033, 54962, 62342, 57536, 47018, 44972, 62894, 65133, 45033, 28786, 20139, 15657, 17908, 25036, 34995, 37444, 38563, 51629, 72794, 62043, 53954, 58172]
12013E8172J2251J890J514J564K033L142N298m720K733l945o275o9R603k532m237
11998G6422L312N062o909p587l106R068M88n775Q484l210k868j656O132N179N404
11983H8440J784J921q772P740J174q898l581O298J648Q143R939m003N039P147
11969A14019M000l899k955O11j1338N06J631p91j3773p240l814o45K1219o519
11955I1012j0141l438k785P07o864l199l70J908P712O593K064k645m153j286J6548
11940I1663L311m256J2414P827O501m501q461j2762j1942P025l758r457o587J213
11926F8230r712l878L315L596J1738o696j0589l189m590l806l96R454J4762L777
11912G2016j6453o254M517k71o523L602L939m707j2988p187J2037J4048j807j8676
$$ y = [58172, 70423, 72313, 73827, 75391, 77424, 80566, 85864, 81144, 83877, 79932, 73657, 73588, 83191, 80659, 76422, 79734, 84796, 77887, 70300, 67194, 76262, 76750, 70975, 79459, 76249, 73381, 71725, 77857, 83036, 88440, 90224, 92145, 83373, 91113, 92287, 83389, 79808, 86106, 87754, 95897, 105836, 101833, 106872, 114019, 118019, 114120, 111165, 111776, 100438, 100944, 102575, 101784, 88011, 80771, 76957, 76312, 97531, 91012, 80871, 77433, 74648, 75355, 68491, 65292, 64922, 66830, 74542, 81135, 83199, 80554, 76401, 75115, 91663, 94974, 90718, 103132, 110959, 117460, 112959, 104498, 91736, 79794, 86819, 83061, 73604, 67017, 68230, 58518, 54640, 57955, 61551, 73289, 66593, 56004, 52815, 48225, 44419, 44023, 53477, 68239, 72016, 55563, 49309, 53826, 53555, 47032, 50634, 54573, 49866, 36878, 29691, 41728, 55776, 53969, 35293]
11898C5293p337m21r481J0533J4250J0298M05k436L755R7m487j792J929j2550
11884C8056M712J7365P01O600k0808j0504N480N466n268j2699L695J6853N211
11871E4860J0456K849o944N539M738j2435O259M106M464r789p141O588J40o36
11857F3054L844j0286l134K9033L828j333o783Q029R112L824Q019R422K89J3804
11843A30722J2657K3762M7607L7191K2326J4327k8363l2999l3858k5570k3335
11832A44467l1117j6946r036k7044j4849m541L809L067q28R1q505l11L081j1572
11818B9766j181o437M00L551o198R835P627r895j0474J0257J2372n025j1312J7399
11804D0685k25k3560O487P996J1351J0957L8J098M976M16p3j2402n302j696p103
$$ y = [35293, 27956, 27535, 18054, 28587, 42837, 53135, 53540, 51104, 54859, 54956, 50469, 48677, 50606, 38056, 42768, 60133, 60834, 67434, 46626, 36122, 41602, 47068, 41800, 29101, 32796, 49649, 54860, 65316, 68165, 61221, 66760, 71498, 59063, 65322, 69428, 73892, 64103, 56962, 63550, 63690, 63054, 66898, 56612, 53478, 82511, 86339, 85006, 78223, 86252, 95364, 99188, 107207, 116629, 116918, 130722, 143379, 167141, 214748, 251939, 274265, 288592, 260229, 227230, 193372, 167802, 144467, 113350, 96404, 87368, 60324, 45475, 40934, 44743, 47810, 46982, 47073, 38568, 38257, 41338, 29766, 28585, 22148, 22548, 26099, 19901, 29736, 37363, 27468, 16994, 27251, 39623, 34598, 23286, 40685, 40460, 16900, 23387, 31383, 42734, 53691, 53729, 54827, 59803, 60219, 60146, 47744, 42442, 40746, 33643]
11789C3643K985Q031j686j1920o557j83r550M084J1632k042R1J5995P045o639
11775D4929p495j1226J1633J966K767J3048N09r499k3975o452M287l242P449K7982
11761E2681J4972m762Q233J1j8604j9260q14L639J5465N925o395j064o80M17J022
11746E0786j469l152o874m039m613O718p2j1860j3855K718J753J0824J0313Q94
11732C8072j2192j0941j0859O632P975j0384R404N611j539O19L539K923L729q111
11718B4478j0202M642j353J078Q689R51L350O79J151R425R889o032l171j1950
11704C1624q883L144j058k988K497P557P801J007P069J0836P231K688O41n224
11690F3942j024r154K012r749p177m379N247J2149J3347p34K156j624k354J2162
$$ y = [33643, 36628, 44659, 42973, 31053, 24496, 24313, 14763, 18847, 30479, 28437, 28528, 44523, 51568, 44929, 37434, 26208, 37841, 39807, 42574, 55622, 56131, 46632, 22657, 16205, 20492, 17250, 24699, 52681, 67653, 62891, 71124, 71135, 52531, 33271, 32457, 36096, 51561, 57486, 51091, 50027, 49347, 49764, 50786, 49317, 46165, 39291, 35252, 30639, 37357, 37285, 25425, 11570, 14288, 16041, 26865, 37178, 38072, 25880, 14939, 4080, 10712, 18687, 8303, 17707, 23318, 21779, 22398, 25937, 28860, 32589, 24478, 14276, 18918, 17565, 18643, 27332, 28283, 31633, 32312, 33463, 42888, 52777, 46745, 43574, 31624, 22741, 25885, 24827, 21839, 24336, 31893, 39694, 40701, 47770, 58606, 65837, 68525, 69166, 63942, 62918, 53764, 55776, 46027, 38850, 34471, 39718, 51867, 65214, 64480, 66636, 65012, 62658, 74820]
11676G4820N639L666j951J070m375Q021M468j2958M37N803k0261q97J6310n147
11662G4645r841M842m455m956J59n055o410j3949n417K380Q738J1068N196j0977
11648D5968Q792P584J0622j5899j5893J4473p840j413J1393R13K2946N093p788
11635G8951J1123Q117k446J3314R105j4878k2400k256J3391K5336J8039n84j2978
11622A21834M248J7152o021M327Q280J9345K037l847N469M810J456J5061k605
11609A91546k415m640J0106N442J349L376J6436J3205j585j649k639J6201R94
11596B45727r631j0368M117K128J4304J5536K1590J4976k345Q00m202m004m473
11583B84155P158J1557K682K1815J1392m307j8863l061P502j330L783o221l610
$$ y = [74820, 80459, 84125, 82174, 83244, 78869, 86890, 91358, 78400, 78837, 84640, 64379, 63482, 79792, 74645, 64804, 69646, 65191, 60235, 60394, 55339, 48929, 34980, 29563, 31943, 40681, 51749, 56945, 45968, 54760, 62344, 72966, 57067, 41174, 55647, 47807, 46394, 57787, 58700, 81646, 86739, 78951, 90074, 98191, 95745, 109059, 118164, 103286, 80886, 78630, 92021, 117357, 135396, 134812, 121834, 126082, 143234, 137213, 141540, 149820, 169165, 171202, 167355, 172824, 177634, 179090, 194151, 191546, 189131, 184491, 194597, 200039, 201388, 204764, 221200, 234405, 232820, 231171, 228532, 244733, 245727, 236096, 225728, 229845, 231973, 246277, 261813, 283403, 298379, 296034, 296834, 292632, 288628, 284155, 291313, 302870, 305552, 327367, 338759, 334452, 315589, 312528, 320030, 318700, 322483, 316262, 312652]
11570C12652l259J798P917K605o903kJ3218J9730o623o310j0066J0376J6147J8368
11556C69648o052O934l808j6649j0945j4670M004J4208n543n034P022l013q320
11543C27782m155j1512j7320j0498k542P979R812Q009R013n628m462j4056j2555
11530B79867n016j0881J456o752r032k336r531l541o137q441P725L517j981j6781
11516B12136j618J4160q97j5137l313j2522k1957M92J753o871o277m378j1204
11503A44367N835j738p129k0288k081O18P56P470j4663j2628K596o268J0296M570
11489A11713K47l499L895k804j5904N232j314j0194p700l269K598n412m26l757
11475F9406N537K2912j916p400m590j0954p164p402o06m087R837J656L144l86
$$ y = [312652, 309393, 311191, 319108, 321713, 314810, 314808, 328026, 347756, 341133, 334823, 324757, 335133, 351280, 369648, 363596, 370530, 366722, 350073, 339128, 324458, 328462, 342670, 337127, 332093, 339115, 336102, 327782, 323627, 312115, 294795, 284297, 281755, 289734, 299546, 307555, 316568, 310940, 306478, 292422, 279867, 274851, 263970, 265426, 258674, 249642, 247306, 237775, 234234, 228097, 219656, 227381, 230898, 228917, 212136, 210518, 224678, 223781, 208644, 205331, 192809, 170852, 171344, 173097, 166226, 159949, 155571, 144367, 150202, 148464, 141335, 121047, 118966, 119584, 120340, 127810, 113147, 100519, 103115, 96847, 107143, 111713, 111960, 108461, 112356, 109552, 93648, 98880, 97566, 87372, 79672, 76403, 79001, 73589, 73163, 69406, 74943, 97855, 95939, 88539, 83949, 72995, 65831, 58429, 57823, 53736, 63573, 65229, 68373, 67987]
11461F7987n531o230J0003J203o008R274J3486K414K469n211M328K9420J542J2516
11447A31662J0436J3565K0354J5611K3272J3221M298j0292q217k675j7465j6376
11435A77394K5266K0319m307r438j8422j8687k0819k6334j2794j0062j8227j2299
11423G1590j0088j596j817r088l937Q0j2973R418p925m539O42K34J0627m0j423
11408C9165j406P60M009M172l876j6256m492N787K302J7763l152p017j8328j4899
11394D532R551K1217M783m900r932j3767m607J2974J0630l783Q156J4705R654
11381E9213J4226j379J4081J5856K2263N675N679J1353J7738K6188M089K095r322
11368A87755l2251l175l50o633l517J0207R369k0848r090j2261j8245k0796j7534
$$ y = [67987, 62456, 56226, 66229, 67432, 61424, 70698, 84184, 86598, 89067, 83856, 88184, 117604, 119146, 131662, 142098, 155663, 176017, 191628, 214900, 228121, 232419, 222127, 213910, 211235, 193770, 177394, 202660, 222979, 218672, 209234, 190812, 172125, 151306, 124972, 112178, 102116, 83889, 71590, 61502, 59906, 58089, 49001, 45064, 45144, 32171, 41589, 33664, 29125, 29767, 30001, 40628, 40588, 39165, 37759, 38519, 42528, 46700, 42824, 26568, 22076, 27863, 30165, 47928, 44776, 37759, 19431, 4532, 14083, 35300, 40083, 35183, 25251, 11484, 6877, 19851, 30481, 26698, 34854, 49559, 59213, 73439, 72060, 86141, 101997, 124260, 129935, 135614, 146967, 164705, 190893, 194982, 197077, 187755, 155504, 152329, 151979, 145346, 141829, 152036, 161405, 140557, 131467, 119206, 100961, 80165, 62631]
11355F2631k2124o720j0182o042K153J8442J1768j0613L079n758L8j6130k2902
11342b360P479J1017J218k034p054N258m852p979r809L937J5896K8675R850j7530
11328C1712q795J3440o219o113j948j2256Q974P155L635N578j294J0594J689q060
11314C8092j3682j1756o919m866K241K723j332K08R805J1024L662m393j5794k393
11300F620J0271J601l307J8902M978p772j9012j2092L945J686J222L197L120N194
11286A8553j9561r111o158N837k605M623J3488M931k642N615r275o844j5550J4261
11272d438J2990J234K382M593o129m941o332K512j1213K261O597k83Q344j0529
11258b952J2366J1364j6019j4580J117l83M602K05M158j492q90J692l035M791
$$ y = [62631, 40507, 33787, 23605, 17563, 19716, 38158, 49926, 39313, 42392, 36634, 36672, 20542, -2360, 5119, 16136, 17354, 15320, 8266, 13524, 8672, 693, -9116, -5179, 10717, 39392, 49242, 31712, 22917, 36357, 30138, 24025, 22077, 9821, 18795, 25950, 29585, 35163, 33869, 44463, 46152, 38092, 24410, 12654, 5735, 869, 3110, 5833, 4501, 4709, 14514, 25538, 29200, 24807, 9013, 6620, 16891, 18492, 15185, 34087, 39065, 31293, 12281, 189, 4134, 5820, 7042, 10239, 13359, 18553, -1008, -10119, -16277, -10440, -13045, -8422, 5066, 9997, 7355, 12970, 3695, -3149, -18699, -4438, 8552, 9786, 12168, 16761, 10632, 5691, -641, 1871, -9342, -7081, -484, -767, 7577, -2952, 9414, 20778, 4759, -9821, -8704, -9087, -4485, -4280, -122, -1614, -2504, -812, -3847, 944]
11244I44m396k811J0679Lo64Q592l573p74k843r658k553Q196J1852O575j035O685
11228B5219J364o308j8177r454P487J78L915r28j0733o875q505J019J1013Q225
11214b560m165k539M756P965k55Q135l50n137J177J3982J5338j6487J125R961
11200C0946q868p870J135j63P965M848j1472o212J3280j89M023L993j355k599
11186B7462p666r857k2230m059O785L299K622J4178m022j0623J5811O011K670
11173B0381j0686P75o453p156o587K357j1560j057J6281N664P118L02o741j3249
11159a0611O055R663J256p331r093j603r24O060M235n971o50J3272J015M85j789
11144D069R147K3543R045n585j2054k1809o586M952j340Q021L314R5j2311j6335
$$ y = [944, -3452, -6263, 4416, 4419, 3755, 12347, 8774, 8000, 5157, -4501, -7054, 1142, 12994, 19569, 18534, 25219, 26583, 20275, 2098, -7356, 131, 309, 4224, 3296, -7437, -14312, -22817, -21798, -10785, -2560, -6725, -9264, -4508, 3457, 3202, 11337, 10987, 5850, 7027, 21009, 36347, 19860, 20985, 30946, 22078, 14208, 15343, 15180, 23145, 27993, 16521, 10309, 23589, 23400, 27423, 31416, 30061, 27462, 19796, 9939, -12291, -16350, -9565, -6266, -3644, 10534, 6512, -4111, 11700, 17711, 20381, 9695, 10470, 4017, -3139, -9726, -7369, -18929, -19986, -3705, 1959, 9077, 9379, 2638, -10611, -4556, 5107, 6363, -968, -10061, -11664, -12588, -6528, -2293, -8264, -8914, 4358, 5373, 5858, 4069, 13216, 36759, 45804, 40219, 28165, 6356, -230, 4722, 3382, 11403, 14717, 14812, 2501, -13834]
11130a3834P553P369j4182P143P622O047k660j642L049R715r174j2577R57J6725
11116A2111O703l385j6765l223K2835J572r30J047M459J3204L489k413j4942j3184
11102A0578k703J0674k837n384q211J227o044n314k789r263J1537L921Q437J1927
11088A5756J29l520j4260j1409K022J5787J0501j0726m018p725n490l704N97J8380
11074B320J0074l8j1622m529N759O691K193j0261L047q820N603J408j4189J3534
11060A170J3285j582j0364p399K73J7479L064k1536j0021j0029L476R094Q301
11047d789l697q177J3054N210P556n450j3508J009n332M425N049K02j243n55p65
11032g011j0739K771J7359J1883R611l625j1197r827l575J3045P721j4370p751
$$ y = [-13834, -6281, 1088, -13094, -5951, 1671, 7718, 5058, 3416, 6465, 16180, 7006, -5571, -4614, 12111, 18814, 15429, -1336, -4559, 18276, 19848, 18918, 19965, 24424, 37628, 41117, 38704, 23762, 10578, 7875, 18549, 15712, 10328, 2117, 3344, -2700, -8014, -10803, -20066, -8529, -4608, 3829, 15756, 15885, 12365, -1895, -13304, -11282, 4505, 15006, 4280, 262, -7463, -12953, -16657, -16060, 2320, 12394, 12356, 734, -3795, 1964, 8655, 10848, 587, 3634, -5186, 417, 1825, -12364, 1170, 14455, 12873, 2509, -4890, -4617, 12862, 15926, -5610, -15631, -25660, -22184, -13090, -4789, -8486, -16663, -3609, 1601, 9157, 3707, -9801, -8792, -14124, -9699, -4650, -4448, -5691, -6246, -7011, -17750, -14979, 2380, 14263, 23874, 20249, 9052, -775, -4350, 8695, 16416, 2046, -5705]
11019e705J2513J3857R460K983j2669R35o31j1933j4420N420k982N183L976L684
11005I671j9693P444J0392K802L575L996j5675k1452M760Q249M25O70N567J1494
10991A2225L595o903J2440J1968K514L270K00j3403j5121o301K165j693L106j0992
10977b930o472J2311R747M069k729k927L897N699J893q703j6210L47k288p128
10963a1424L727k653J0869r137K229J0671m159k817J2205j342l690m91o392J0440
10949H036J9914k281j9091p643l383q898J025J224j447n100R4J2241o1j1064%
10934a6434l602k217n629J1065J2960K58j1556J0700N317r047J945o428J1627
10921a041J5026L333l639j465n001j880o046m394K629R00M62p821M205N054j737
$$ y = [-5705, 6808, 20665, 30125, 33108, 20439, 21374, 20743, 8810, -5610, -190, -3172, 2011, 5987, 9671, -10022, -2578, 7814, 10616, 14191, 18187, 2512, -18940, -14180, -5931, -5506, -4836, 731, 12225, 15820, 8917, 21357, 33325, 35839, 39109, 39309, 25906, 10785, 4484, 6649, 4956, 8062, -2930, -9402, 2909, 12656, 16725, 13996, 11069, 14966, 20665, 22558, 13855, -2355, -2008, -4296, -11424, -7697, -10350, 519, -8618, -6389, 4282, 123, -2694, 9511, 8169, 4479, 3988, -2404, 8036, 27950, 25669, 6578, -1065, -4448, -13346, -12321, -11097, -12544, -17644, -17550, -5309, -5370, -16434, -16434, -20036, -22253, -27882, -16817, -3857, -3599, -15155, -4455, 862, -8185, -6240, -12668, -1041, 13985, 17318, 13679, 12214, 7213, 5333, -713, -5107, -2478, -1578, -1116, -8937, -4732, 322, -1415]
10906a415j1682j8155p010M828J1766J629j4395j7987O418K0976K6357N989o588
10893G31Q937M453j5638o319L513M573P177Q291J3624P735j0174L256j2620m462
10879A3077N095j8137q337P58O091J955M806j1840j251m549o591J0874k800k769
10865a3618j010J2837Q073K397J747J4522m943J1461k177q555k276o64l926j567
10851A2301n870j2654n201J0127J6584j709l635J760q351J286J2387J0544j070
10838B6499q563j1696j6816J5715J1846q089K478L031q28j113k425o397l247Q450
10824H845k606K235J5477J927Q26K666j1616J438L340n066p534j544R682J509
10810A9579q562j78M807N60j1083q978K820j279P952O90P373J1610l571o539n3
$$ y = [-1415, -13097, -31252, -38262, -33434, -21668, -20039, -34434, -52421, -46003, -25027, 1330, 7319, 731, 9668, 14121, -1517, -7836, -4323, 250, 7427, 15718, 29342, 37077, 26903, 30159, 17539, 13077, 18172, 35, -8302, -7544, -1453, 502, 5308, -6532, -7783, -12332, -18923, -8049, -10849, -13618, -14628, -1791, 6282, 8679, 10426, 24948, 20005, 31466, 29289, 20734, 18458, 17794, 13868, 12301, 6431, -6223, -11424, -1297, 15287, 13578, 9943, 11703, 3352, 4638, 17025, 27569, 26499, 17936, 6240, -10576, 5139, 16985, 8896, 11374, 14405, 13577, 12464, 10039, 3642, 395, 8845, 6239, 8474, 23951, 25878, 26704, 29370, 17754, 19192, 22532, 17466, 9932, 8388, 18070, 19579, 11017, 10839, 15646, 16206, 5123, -3855, -1035, -2314, 5638, 6328, 13701, 25311, 21740, 15201, 15148]
10795A5148o421R395N292l420j3232m327J7212P967q984R71N765j830k685R94
10781B1845j2198n399K8j649R619J0971L010j5262P107M080K8q527j2131l617
10767b095O542J4057n294o148j1028j0384J2867K0672Q366n853M73m820m958j1326
10753A071Q80j623L263J6481K2148K3j0793o497p652P276k056l640J680O698K320
10738B9579j0288J4756Q954j1701K511J4801l738m169N622p876n259j451l09J1147
10724D2579j771N967k640j7615K555j4150M570j101p635l234J4k399J6056J6895
10710C8091j575r629J076m003J9782J5800j0624j4755j5719r01O559K515P423
10697C4040k57K117o203q751R019J4327m915o260j15R057J1408J2253O009O368
$$ y = [15148, 8727, 18122, 23414, 19994, 6762, 2435, 19647, 27614, 18630, 19601, 25366, 23536, 20851, 21845, 9647, 4248, 4276, 2627, 12246, 23217, 26227, 10965, 18072, 22152, 22180, 13653, 1522, -2095, 4447, 18504, 13210, 7062, -3966, -14350, -1483, 19189, 27555, 21702, 22175, 17355, 12397, 1071, 1951, 328, 3591, 20072, 42220, 42243, 31450, 24953, 17301, 24577, 22521, 18881, 20561, 27259, 29579, 19291, 34047, 43001, 31300, 33811, 48612, 44874, 40705, 46327, 38451, 33192, 31741, 31432, 42579, 40808, 46775, 44135, 26520, 29075, 14925, 19495, 18394, 10759, 7525, 7539, 5140, 21196, 38091, 36516, 26887, 27963, 23960, 43742, 59542, 48918, 34163, 18444, 17543, 24102, 26617, 34040, 33783, 35900, 29697, 20946, 29965, 44292, 39377, 33117, 33002, 42059, 53467, 65720, 71729, 78097]
10683G8097J273q693N515j1897j3265R77l244r224j5255k842M271j898r267K285
10669A6833J0766k034p955J1820o240K049k256k799Q907J1312j329J1049k338
10656D7785j4459j7526o648p77r16J1360r26o573J4422N413L964J849q259l608
10642B5101K995K442L385p397p84q325L7Q715O132J5126J0760j0448O212r337
10628D4614N517L552k3670o964o250J1055K9140p374j7429m262J4374R001N499
10615E6803k2046j6428M32J1486J982o340K753K071M453J5806J2013k061j1566
10602D9358o259o094K498J2708j2129n178j9449l7J5202M508P981p182J630Q28
10588C8385K254J492j0477J6968J4973j3017r435r573o895O110J2062n200p855
$$ y = [78097, 79370, 70677, 76192, 64295, 51030, 52007, 48763, 39539, 24284, 21442, 25713, 23815, 14548, 16833, 27599, 25565, 17610, 29430, 23190, 25239, 22983, 20184, 29091, 40403, 39074, 50123, 47785, 33326, 15800, 9152, 8375, 7459, 18819, 17893, 11320, 25742, 31155, 35119, 36968, 28709, 25101, 28096, 30538, 33923, 26526, 25742, 17417, 17454, 26169, 32301, 47427, 58187, 47739, 53951, 44614, 50131, 53683, 30013, 23049, 16799, 27854, 56994, 49620, 32191, 27929, 42303, 51304, 56803, 34757, 18329, 18761, 30247, 32229, 25889, 28642, 30713, 35166, 50972, 62985, 60924, 49358, 43099, 37005, 39503, 52211, 40082, 34904, 15455, 15418, 30620, 35128, 43109, 35927, 37557, 38385, 40639, 42131, 31654, 48622, 63595, 50578, 41143, 31570, 24675, 30785, 42847, 37647, 29792]
10575B9792J0603J7528o064j9878Q422J517o068R233M763O249n301j4824P02J054
10561C7728l763r469K510O813Q491J2725k74k181o760q794l503K716J3781P022
10547E7042L049p527R249j0956k2842q062L999O043J796P03l054p292j015p566
10533A3567O680R112J2109Q288j9785j2746n300o538J2745J7287J1957P29j0632
10520C7473p408l899K152j0862L663o993l057L973p447m413J710R058L481L419
10506B0850o626k0232o139R38m437R660J0858J0284j4561l624k609r65J3099N212
10492A1708q620j6110l851J6717j88p914l579O537j433o821k94O334O214R821
10478H521J580J5502J1887l777n573q230m747r875j0365J0819O381R766P095O518
$$ y = [29792, 40395, 57923, 51859, 31981, 40403, 41920, 35852, 45085, 49848, 56097, 50796, 35972, 36674, 37728, 33965, 24496, 27006, 33819, 42310, 55035, 54761, 52580, 45820, 37026, 33523, 36239, 50020, 57042, 60091, 52564, 61813, 50857, 28015, 19953, 23952, 29995, 31791, 32494, 29440, 22148, 21133, 13567, 20247, 29359, 41468, 49756, 29971, 17225, 11925, 5387, 18132, 35419, 47376, 48105, 37473, 30065, 26166, 28318, 17456, 21119, 14126, 11069, 15042, 7595, 3182, 4892, 13950, 17431, 20850, 14224, -6008, -12147, -11209, -15646, -5986, 4872, 15156, 595, -3029, -5638, -6603, 6496, 11708, 3088, -13022, -16873, -156, -344, -8258, -11837, -5300, -6733, -13554, -13848, -7514, -1300, 8521, 10101, 25603, 37490, 33713, 28140, 19910, 15163, 5288, -5077, 5742, 12123, 21889, 28984, 35502]
10464C5502L813N804l398k691p810J954O567p062q660j1583J246K863j2800O34
10450D379N803j0760P092q71O893j0175j814J9001J7860R91r630j4860L211K328
10436A9448p879M472r5K912r33O391j192J6641j1155j7480N768M562j234j0765
10422I461O86q003p802O196O356k331n051r547M117M680K972L188K157M328j133
10407A0274n895M672q735p769O021l667J85Q173N555M804R674N704j0019j4060
10393D917j3620m795o830m282J3589J0467J2794j2110j0758p823Q505R152J7478
10380A6684J565k09j554j2606j9688J338j626p509J3688J6839K327k5280l454
10367a9485J0188L129k873P57k985q86J7125j905j1911M569m387o091J638o250
$$ y = [35502, 39315, 45119, 41721, 39030, 31220, 33174, 39741, 32679, 24019, 12436, 13682, 16545, 3745, 4379, 10182, -578, 6514, 5643, 12536, 2361, 547, 19548, 37408, 38399, 28769, 13909, 17120, 19448, 11569, 16041, 15946, 18858, 17925, 24316, 23124, 39765, 28610, 11130, 16898, 21460, 20226, 9461, 10147, 2144, -5658, 538, 6894, 4563, -488, -10035, -5918, -1238, 1734, 4922, 7079, 11407, 10274, 4379, 9051, 316, -7453, -1432, -5099, -4914, 3259, 8814, 13618, 23292, 28996, 18977, 4917, -8703, -13498, -20328, -24610, -11021, -554, 12240, 130, -10628, -18451, -9946, -794, 16684, 18249, 18040, 16486, 3880, -15808, -14470, -16096, -23605, -9917, 6922, 9249, -16031, -19485, -9297, -6168, -9041, -8284, -11269, -12155, 4970, 3065, -8846, -4277, -8664, -14755, -13117, -19367]
10353a9367J3381J880r581L401P786r851O487p401o498J0258K810Q641j461J717
10339B202k268J317J4444L0680M838l1147j9476j1392K0031J1225j1300q284O576
10326G446j6123M83O289J7492R200J270N786p282n383j3758j18j372k659k603
10312a332K747o677J3080J5314o971n30q88o422q753n467l988Q401M521M727l552
10297D210R865Q980N51M708j352j4046k1629m080J1872N340J3751p35n457p634
10283D344j7858K182l815N208q127M638J5515j987J957k305L145j4771j1428J446
10269b1856R808R68K885J9696J1872L150j5209j0714K03j858O615N328o184O109
10255A0813p826p796j0175m45K622k646L66P897K323j2667k864o910l376J2333
$$ y = [-19367, -5986, -4106, -13687, -10286, -2500, -12351, -5864, -13265, -19763, -9505, -6695, 1946, 485, 2202, -66, 1251, 15695, 46375, 51213, 20066, 590, -10802, 9229, 20454, 9154, 870, 7446, -8677, -8194, -1905, 15587, 24787, 26057, 31843, 24561, 19178, 5420, 5302, 3930, 1271, -1332, 1415, -5262, 7818, 23132, 16161, 15631, 14743, 8321, -432, -5899, -9887, -1486, 3035, 7762, 4210, 14075, 23055, 23606, 28314, 26962, 12916, -8713, -12793, -921, 4419, 18170, 17435, 11978, 4344, -13514, -11332, -15147, -9939, -18066, -13428, 2087, 100, 2057, -248, 2897, -11874, -23302, -21856, -12048, -11080, -8195, 11501, 23373, 26523, 11314, 600, 803, -1055, 5560, 10888, 4704, 10813, 2987, -4809, -14984, -15429, -12807, -15453, -15087, -7190, -4867, -17534, -20398, -27308, -30684, -18351]
10241a8351j4698Q565Q674Q02o68L171M636J567o438q139N060J6016j0332p5J7442
10226G232L985j0163n969J1477J6337k891j7672k2661m433M656l355J1370J1810
10213b77K488N32q625k1779p159Q448N518N447L671o136q845Q704J2632O900j1703
10198a0184Q178J2401J0211j982k938p129p277M236n632m96M883J338j4929Q946
10184c74J4588K532k108l77p068J0101j794n851N11j8274m490R17j2680j768J0910
10169a5225j767j040J2862l515m692k1334j0108J3030J2251P171q930n554m001
10156c0852M19k324J858L860J2111R247k238N025O047m884m603L163L674R93K848
10141D344L534N267j066n370n54P40j5845j3798k485J3367J3894R791J734k619
$$ y = [-18351, -33049, -24484, -15810, -15008, -15676, -12505, -7869, -6302, -12740, -20879, -15819, 197, -10135, -10210, 7232, 11217, 1054, -4915, 6562, 22899, 20008, 2336, -20325, -24758, -20102, -23457, -12087, -277, 2211, 2743, -5882, -27661, -34820, -26372, -20854, -15407, -11736, -17872, -26717, -18013, -5381, 1519, -10184, -2006, 10395, 20606, 18624, 15686, 8557, 1280, 5516, -116, -612, 4271, 5609, -9320, -374, 14214, 16746, 14638, 14261, 7193, 17294, 15500, 9649, 10160, -8114, -12604, -11687, -24367, -26135, -15225, -16992, -18032, -5170, -8685, -13377, -34711, -44819, -31789, -19538, -12367, -21297, -26851, -30852, -30433, -32757, -30899, -27039, -14928, -5681, -7919, -2894, 3153, -1731, -6334, -3171, 503, 1496, 4344, 7878, 13145, 12079, 6709, 6155, 6895, -8950, -22748, -25233, -11866, 2028, 11819, 13553, 10934]
10127A0934n965j8608r931J686P298J77L270K4132K72N751j002j3073j6740j5837
10113b7636k944J4522J1846r138r735m679J8141j209k040p524J0523J0823k185
10100a235l507o73J460n570L983M260M958j4380j4037J0166o41m151J1309J6259
10086H201O485q722p188J846j2085K322J6802J8624L749j5391k4860j3218P994
10073a5441J6788R993L122p788j8778j99L183n284J0597k468j1067l134J1087
10060i389J1448J7677R499k3167N601J0630P216q218r42J1856p302m550m663K146
10046A7842R534R715P459J2988K038k121j5043m559k2772j0097o06j15O475m364
10032F374m735M12J884o707N707R775k754J480Q743o719J53J307q123q009l564
$$ y = [10934, 4969, -13639, -23570, -21884, -14586, -14409, -11139, 12993, 13265, 19016, 18014, 4941, -11799, -27636, -30580, -16058, -4212, -13350, -23085, -27764, -9623, -10832, -12872, -20396, -9873, 950, -1235, -4742, -5415, -3955, -9525, -5542, -1282, 3676, -10704, -24741, -14575, -15216, -19367, -8058, 8201, 14686, 5964, -1224, 622, -11463, -9141, 7661, 26285, 30034, 14643, -10217, -23435, -15441, 1347, 11340, 14462, 6674, -12104, -12303, -9120, -14404, -3807, -6275, -17342, -20476, -9389, 2059, 19736, 29235, 6068, 11669, 22299, 29515, 21297, 20355, 32211, 24909, 20359, 15696, 17842, 27376, 37091, 44550, 57538, 59576, 57455, 42412, 37853, 15081, 4984, 4378, 4263, 10738, 6374, 1639, 2051, 3935, -2772, 2935, 12710, 9956, 11436, 20179, 13460, 13613, 14920, 6797, -1212, -4776]
10017d776R505R48l535n939m708m540M917R890N586K375j0112j1660o158K0686
10003B479K691M96r747l350M59r40k032j020K0220Q940o37p789l678n098m602
9988c608l739O392l896j013j1108j1438M688J1539l356N699k254J758L519J434
9974e383M785j387J514Q047O869k857r579l636Q138J4916n129j2691m847M659
9960C419O244j1870N892P995O428j7070n475j752R91Q433L773j0359q340j5354
9946b7045j402L256R627J2435J065q296p236O903R719P478J906p966l135p263
9932i954j0875J2996J263o455J1109J2872l269k006j689Q423J0385k833p969j0721
9918A277M970J1655j5400j0500o520L831N850J7027K817j1091J236J0820M317
$$ y = [-4776, 4729, 5677, 2142, -3797, -8505, -13045, -8128, 1762, 7348, 9723, -389, -12049, -18207, 2479, 5170, 5666, -4081, -7431, -6972, -7912, -9944, -10964, 9256, 18196, 17559, 9770, 6092, 994, -3608, -7347, -955, -4851, -5864, -16972, -28410, -23722, -12183, -15539, -9840, -12094, -10336, -6817, -5383, -598, -1985, -471, 7576, 14445, 11588, 2009, -1627, 6511, 21427, 16298, 3607, -1240, 3419, 9663, -2207, 3685, 11680, 18108, 1038, -4437, -6189, -5198, 3235, 7008, -3351, -11691, -27045, -28447, -25191, -15564, -3129, -2064, -10360, -17596, -10693, -974, 6504, 8410, 444, -2691, -9954, -20829, -7833, -6570, -13025, -1916, 10956, 7687, 5681, 3992, 12415, 22800, 19967, 11998, 1277, 6247, 17902, 2502, -7998, -14518, -10687, -4837, 12190, 15007, 3916, 5152, 15972, 20289]
9905B0289l164m20l732j473M382j174K204K110R671J0064m858Q66O473q524q196
9890B4518j2155K303N586J1867O302m170L360q14j5098j0119L298J451M881K822
9876B4032n604l755j0353n758P028J2870Q501n19O09j7940j599P111M131p996
9862A0758p276r307L121n182N446n24N262R233p863o766j512K881P557N127K309
9847A3264N649J1662k683Q800k114k2024%o027l623Q043P428N427P399K515m684
9832B9032j6214o361l831o08r85J0157M381p430j0070P985Q315O182r915j0118
9818E20p59k892P131Q940K419k614p094J0679N425N003o632m713l633M761O702
9803B3243K874l751j1171L392O867j994q568o064J2182R641J2194M797l457j3060
$$ y = [20289, 17125, 16705, 12973, 11500, 15882, 14708, 16912, 19022, 28693, 38757, 33899, 34765, 41238, 32714, 24518, 12363, 14666, 20252, 32119, 38421, 34251, 37611, 36797, 21699, 11580, 14878, 16329, 21210, 24032, 18428, 14673, 4320, -1438, 5590, 18460, 26961, 26442, 27051, 9111, 7512, 14623, 18754, 10758, 3482, -5825, -2704, -7886, -2440, -2964, 2298, 11531, 3668, -3098, -4610, -1729, 5828, 10955, 13264, 18913, 30575, 27892, 36692, 34578, 12554, 12554, 6527, 2904, 10947, 18375, 23802, 31201, 33716, 29032, 12818, 6457, 2626, 2018, 1033, 11190, 15571, 8141, -1929, 6056, 14371, 20553, 10638, 520, -239, -3131, 4000, 12940, 15359, 12745, 5651, 16330, 21755, 26758, 20126, 15413, 11780, 16541, 23243, 26117, 22366, 11195, 14587, 21454, 19460, 10892, 4828, 17010, 26651, 38845, 43642, 40185, 27125]
9789B7125n179k2922j6676L96O716J276J2024L840J1242L941r152r738k543n811
9775e461p054l595N91m692Q280J6917L174j67j3194O672O004J3082M064Q518o355
9760B6784o292R311k81j0881J859L677n501m954L771R258N959m882Q332K78O745
9745D3183m007j0383M001m716j1326o619l417L635r07N050J8598l342q192p067
9731A4491J400m70J22O568r700k586J2513l297J975k842n225J308j9670J773J9247
9716A5607o025J9584K0017k103J022p878j0588o173N32m587j619k303j1066p285
9702b865M128L169l481p576J1007J0186L716K319o899O067q92j4425k037N983
9688H400K852N208q403j1273n170K1343J5025O85l041J1324j0326j2852K1024
$$ y = [27125, 21946, -976, -17652, -17256, -10540, -9264, 2760, 6600, 17842, 21783, 12631, 2893, 350, -5461, -12515, -16110, -15519, -20211, -11931, 4986, 8160, 7993, -5201, 1471, 7475, 20557, 24621, 33139, 26784, 20492, 29803, 29522, 18641, 20500, 24177, 18676, 13722, 17493, 26751, 32710, 27828, 36160, 36438, 43183, 39176, 28793, 32794, 28078, 16752, 10133, 6716, 10351, 9444, 14494, 33092, 29750, 21558, 14491, 15891, 15421, 15543, 22111, 12411, 9825, 22338, 19041, 21016, 18174, 12949, 14257, -5413, -3640, 15607, 9582, 29166, 49183, 47080, 48102, 40224, 29636, 23463, 23995, 19408, 17789, 15486, 4420, -2865, 1263, 4432, 951, -6625, 4382, 14568, 18284, 20603, 13704, 19771, 18879, 4454, 2417, 8400, 11252, 16460, 8057, -3216, -8386, 12957, 27982, 28667, 25626, 36950, 26624, 13772, 34796]
9675C4796l024p929O139k648J202M589N938m051j2455N467J5859J0988l639N526
9661E6758p635j8489j2902J4488L726r055o499Q381J876o621j1748M17J0421J2820
9647C5938O280j0106R975K3131p207k5404M719J4015P607M045j3002q83r803n114
9633C4191L992j4818M710K1311L655j204l343J148Q915j649j2277J5587J9692
9620G9910l251j2414j0398J634J4465O731j0975M590P875q313p295j496k364j913
9606E6786J1014J2215J2783P703o168j614m247R406J00J79R70m462O11O157J972
9591A03405M124q485M356m383l039J5341N184R64K513O891Q215J995k4131j382
9577A11568R429O267k93o120K202m817n111J1908Q997O553Q900J8939K4666l651
$$ y = [34796, 31772, 23843, 29982, 27334, 28536, 33125, 39063, 35012, 22557, 28024, 43883, 54871, 51232, 56758, 49123, 30634, 17732, 32220, 35946, 26891, 20392, 28773, 30649, 24028, 12280, 12697, 23118, 35938, 42218, 32112, 42087, 65218, 58011, 32607, 37326, 51341, 58948, 62993, 49991, 49108, 39305, 34191, 38183, 23365, 28075, 49386, 53041, 51837, 48494, 49642, 58557, 56908, 44631, 60218, 79910, 76659, 64245, 53847, 55481, 69946, 76677, 65702, 70292, 78167, 69854, 62559, 61063, 58699, 56786, 67800, 80015, 92798, 100501, 94333, 92719, 88472, 97878, 97978, 98157, 99127, 94665, 95276, 101433, 103405, 107529, 99044, 103400, 99017, 95978, 111319, 116503, 117467, 119980, 126871, 135086, 137081, 112950, 111568, 120997, 127264, 126971, 120851, 123053, 118236, 113125, 125033, 134030, 140583, 149483, 168422, 193088, 189437]
9563A89437j8395n619Q627R10J1073M184l485R97K883J1693O523J619J6737n250
9549B21934K033K6381J965o132r112N185M938Q956R36o458J145O207O409R458
9535B73845J1916O317K2562J5356m091m506o469K307R526j0586j0829j5J962L462
9521C10757J2396J9398J2490p865q468J0512J0832M683M18j026P449J3399k162
9508C82813j0204J941O840j6601o241P256J7119J4247J1772K241O60j8713j495
9495C91635J9133R348J052j3562L512n734q881Q09J2204P950l521J9350l66j6751
9481D16178N45O3k788j1929j6654l952J5905l531n625N886k2209m796l317M014
9467C67790n586J029N129k1515K787M971l658p146M320l08p743J3110o121q020
$$ y = [189437, 171042, 165423, 174050, 174960, 186033, 190217, 186732, 187729, 190612, 202305, 208828, 210447, 227184, 221934, 223967, 250348, 252313, 246181, 237069, 242254, 247192, 256148, 257084, 250626, 251771, 257978, 264387, 273845, 285761, 292078, 314640, 329996, 325905, 321399, 314930, 317237, 326763, 316177, 305348, 305333, 307295, 310757, 323153, 342551, 355041, 347176, 338708, 349220, 360052, 364735, 365153, 364127, 371576, 384975, 382813, 372609, 374550, 381390, 364789, 358548, 365804, 382923, 397170, 408942, 411183, 411843, 393130, 391635, 410768, 420116, 421168, 407606, 411118, 405384, 396503, 397312, 409516, 417466, 413945, 433295, 432929, 416178, 416723, 416786, 413998, 402069, 385415, 381463, 397368, 393837, 388212, 394098, 371889, 367093, 363776, 367790, 362204, 363233, 368362, 346847, 349634, 354605, 350947, 343801, 348121, 347813, 340070, 353180, 347059, 339039]
9453C39039j6649r859k384j2934j845M651p767q129M142K780l027q878j2353o246
9439B60541R140M867j3829l972K066o004L714q120o582j2016Q618Q105M747N140
9425B56415m516r002l436n60R451r170k4396r277o170J0097J0342J6636r384j4761
9411B12269n629J3524p342r073J2050q500p439q758r109M241J2880o987l114J688
9397A90701o661P316L838j0868p534J0608M538n328p980R63J6945R407j4292n816
9383A85837j491k526N032p921J5367P439P746k483Q362j0763n840Q55Q25n301
9369A95138L638J0199M361k247j823j2166j0630q271L566K4824Q446j2560j0020
9356A92455p23O991J3955Q729m977k622J0179O256n304O98M411k112j9358J33
$$ y = [339039, 322390, 312531, 310147, 297213, 295368, 300019, 292252, 284123, 288265, 291045, 288018, 279140, 266787, 260541, 269681, 274548, 260719, 256747, 258813, 252809, 256523, 248403, 241821, 229805, 238423, 246528, 251275, 256415, 251899, 242897, 239461, 238901, 248352, 239182, 214786, 205509, 199339, 209436, 219778, 236414, 227030, 212269, 206640, 220164, 212822, 203749, 215799, 207299, 199860, 191102, 181993, 186234, 199114, 192127, 189013, 190701, 184040, 191356, 195194, 184326, 176792, 187400, 191938, 186610, 178630, 179593, 196538, 205945, 191653, 185837, 184346, 181820, 186852, 178931, 194298, 201737, 209483, 207000, 215362, 204599, 198759, 199614, 200439, 195138, 198776, 208975, 213336, 211089, 209266, 197100, 186470, 178199, 181765, 206589, 215035, 202475, 192455, 191732, 198723, 212678, 221407, 216430, 213808, 223987, 230243, 224939, 225637, 230048, 227936, 208578, 208711]
9342B08711K499O717m339n09O689k622o718K800j46k839J4743J3819m008L206
9328B38003O17J2337J481L464N124j0576k604p298p464j326o86J2375J2463J5428
9314B71338m887J384J5780J1941O216J635r808j6142j419n596J221K2418J8605
9301C12686J113l099r040j883O457j1882O509J3888O021j3101j3935q930O673
9288B91477J4170J3353P63m823O755O927P273k138R740Q832P796R641K586N09
9274C72861J4506Q189P129j596K545Q993N618N403K089O560Q091N454O691j666
9260D50867O76J600n576r208J5655K2416L216O431n821K876J9828J780L168L887
9246E11795N935M171J0844k959L215K1251M801q0J1035J198q07j854j3412K5042
$$ y = [208711, 211210, 217927, 213588, 213079, 219768, 217146, 210428, 213228, 213082, 210243, 224986, 238805, 234797, 238003, 238620, 250957, 252438, 255902, 261026, 250450, 247846, 240548, 233084, 231758, 231072, 243447, 255910, 271338, 266451, 267835, 283615, 295556, 301772, 303407, 293599, 277457, 276038, 270442, 271663, 294081, 312686, 313799, 310700, 301660, 299777, 306234, 294352, 300861, 314749, 320770, 307669, 293734, 284804, 291477, 305647, 319000, 319763, 314940, 321695, 328622, 335895, 333757, 343497, 352329, 360125, 369766, 372352, 372861, 387367, 395556, 402685, 401089, 403634, 412627, 418245, 423648, 425737, 432297, 440388, 445842, 452533, 450867, 451543, 453143, 447567, 438359, 454014, 476430, 479646, 486077, 480256, 483132, 502960, 504740, 507908, 511795, 517730, 521901, 532745, 529786, 533001, 554252, 559053, 558973, 570008, 571206, 570399, 568545, 555133, 580175]
9232E80175Q274r235M507K120L656N402j3390p170O789Q451K491K6297P200n09
9218F25058J2064M204j050J475L625o890n899J2065J035j3837m546N133J118j5186
9204F18369j4212o177o616n653R868J264o702k296J436k056j9511j2627L865N838
9190E64790p961M025K428m229p394p702j721J1829J8334j423q945o46j4495j3458
9176E33432o132k019k660N002R781l130j1267j6126J552j0122k366K1678Q186
9163E25809n867j5077j6667m021k329M098P124k228Q28j4234j4688J251M286K586
9149D70871j7766j718N339q062R620j0691P67J5993J6063R81j8544L329L877j0261
9135D59798m25j0612p525j3701j2286k393k89K072O895m01k308P715n892j4682
$$ y = [580175, 588449, 579214, 583721, 585841, 589497, 594899, 581509, 574339, 581128, 589579, 592070, 618367, 625567, 625058, 637122, 641326, 640276, 641751, 645376, 638486, 632587, 644652, 645687, 631850, 627304, 632437, 633555, 618369, 604157, 597980, 591364, 585711, 595579, 596843, 590141, 587845, 589281, 587225, 567714, 555087, 558952, 564790, 556829, 560854, 563282, 559053, 551659, 543957, 542236, 554065, 572399, 570976, 562031, 561385, 546890, 533432, 527300, 525281, 522621, 527623, 537404, 534274, 523007, 506881, 508433, 498311, 495945, 517623, 525809, 519942, 504865, 488198, 484177, 481848, 485946, 493070, 490842, 491670, 477436, 462748, 463999, 468285, 470871, 453105, 451387, 456726, 448664, 458284, 447593, 448360, 464353, 480416, 481397, 462853, 466182, 470059, 459798, 459373, 448761, 441236, 427535, 415249, 412856, 412567, 414639, 421534, 421133, 418825, 426540, 420648, 405966]
9121D05966r158o922J2435l511j408P458J6767j227j2426O669j6466j6954r609
9108C71614j1937o487r26N866M871M718M817q883p593J55m786M273N167j3666
9094C47203j0814k307M92K784r50j6074k0552j8254l089Q683J4572P58K341K393
9080C07186L199J0840p822j2833L007P274K541m805j0121r769j8175j0253J47
9067B60416J9751O057N090p711j4979j955q396j5705N068j7938j3433O458R570
9054B32293m844q476j1348r311l957J1387m265M205k218l713O665J2798l23k7436
9040A91457j1115j973K7343N606j0856o033m771m189j0662J0416R59r320K625
9027A79487m902l37J5742l301o210p973J1508p075r47J335j5973k3504o394J377
$$ y = [405966, 396808, 389886, 402321, 398810, 397402, 404860, 421627, 420400, 407974, 414643, 398177, 381223, 371614, 359677, 353190, 352264, 358130, 363001, 367719, 372536, 363653, 356060, 356215, 351429, 355702, 360869, 347203, 336389, 334082, 334574, 337358, 336408, 320334, 299782, 281528, 278439, 287122, 301694, 302452, 304793, 307186, 310385, 321225, 313403, 300570, 303577, 310851, 313392, 308587, 298466, 288697, 270522, 260269, 260416, 280167, 286224, 291314, 283603, 268624, 266669, 258273, 242568, 247636, 229698, 216265, 222723, 232293, 227449, 218973, 207625, 198314, 194357, 205744, 201479, 205684, 203466, 199753, 206418, 219216, 218893, 191457, 180342, 178369, 205712, 211318, 200462, 194429, 189658, 185469, 174807, 185223, 186182, 176862, 179487, 174585, 174248, 189990, 186689, 180479, 172506, 184014, 176939, 175992, 177327, 161354, 137850, 131456, 132833]
9013A32833j1549j4594J2200J3891k670j6165R073J0953J5253M308k832r584j2204
9000A28913M522j440k196l002k342l870j960O277M883J2443j0176j0349j358j254
8986A19091Q92R184r046k254K109K310j886k779r503p284j4412P607J7355M930
8972A16314K221N397L217k548o465N306j7579j4470j0560l489N322R223J0012
8959A01901P228n874l40l855j0976J0811J6174R924J2044O204m871j2119q614
8946A17637Q543r69j3114j7658j3622l523O35J5831N610j2805j2534J1512J3965
8933I9508Q525o133n135L834Q180L397o697M715P862O625J1797p594j0985n412
8919A12487L45O461M286j9161j0680K13N615J079J575Q998m420J175O903P468
$$ y = [132833, 121284, 106690, 118890, 132781, 130111, 113946, 123019, 133972, 149225, 153533, 150701, 141117, 128913, 133435, 131995, 129799, 126797, 124455, 120585, 118625, 124902, 129785, 142228, 132052, 121703, 120345, 119091, 119983, 129167, 120121, 117867, 119976, 122286, 120400, 117621, 108118, 100834, 86422, 94029, 111384, 116314, 118535, 123932, 127149, 124601, 118136, 123442, 105863, 91393, 80833, 77344, 82666, 91889, 101901, 109129, 103255, 102915, 99060, 88084, 98895, 115069, 124993, 137037, 143241, 138370, 126251, 117637, 126180, 125211, 112097, 94439, 80817, 77294, 77929, 93760, 99370, 86565, 74031, 85543, 99508, 108033, 101900, 96765, 100599, 108779, 112176, 105479, 110194, 118056, 124681, 136478, 128884, 117899, 112487, 112832, 119293, 123579, 104418, 93738, 93951, 99566, 100645, 102220, 111218, 106798, 107973, 114876, 122344]
8905A22344J6439J866k2887l847q280n187M391N839J6958R614K058l51J2859K692
8891A54508J9P490N393j112j849L800J5370K2571J7304Q080J8939J3288J8692
8878B82493K1226L1316L5494K8688M1715L4163M0382M3585P4903P6224Q4455J17192
8866I11836J41711K02242K98849L95507L87379L31844K45663k2512l69474m99218
8856B023827m37031l43346k57026j91371j37962j04450q9696n9330m2345m0944
8846C20326l8377k0042j4342j9252j8393k0177j1262j6901o839o308N503o748
8834A47188J0695m867k5789j9622k358K485O829J152o146J254m571j6325l502
8821H6423J3346j6694j1631P755j1341l402J0322J2843L214j647r761q807l187
$$ y = [122344, 138783, 140649, 117762, 113915, 105635, 100448, 104839, 110678, 127636, 137250, 139308, 138957, 151816, 154508, 154527, 162017, 167410, 166298, 164449, 168249, 183619, 206190, 223494, 231574, 250513, 263801, 282493, 303719, 335035, 370529, 399217, 440932, 475095, 515477, 559062, 633965, 710189, 794644, 911836, 1053547, 1255789, 1554638, 1950145, 2337524, 2669368, 2915031, 2892519, 2523045, 2023827, 1586796, 1243450, 986424, 795053, 657091, 552641, 462945, 403615, 361270, 320326, 281949, 261907, 247565, 228313, 209920, 189743, 178481, 161580, 154741, 148433, 153936, 147188, 157883, 153016, 127227, 107605, 105247, 107732, 114561, 115713, 109567, 110821, 106250, 89925, 86423, 99769, 83075, 71444, 79199, 67858, 64456, 74778, 87621, 90835, 89188, 79427, 70620, 67433]
8808F7433k66J77k731J4775O422l513o627o436q454J737L967k1904k2039P224
8794B9765J4905J944K89N138j707N84n19l528Q020L572R46l064r219n180k697
8779C9249N896r411j5096l868J4208p264O420K6710O450L20r130j0951j5578P507
8765C5462L752K0985J3272l696j0587q714j3121K363M657p422j670r12p210J3857
8751D1016J482p621K88N757J0175l410L094J0664q337j4242l909J2827L096P226
8737E8106n050l60Q687L628n811j0028k3562l029Q545k021O551L013n579M78N50
8722C4118K923o291L652k262p968j2945K740j1847N996K79J1282j1033J580J1288
8708B1512L511r358p473J1593n040l987M040O81o227M3Q530o755p688l099j370
$$ y = [67433, 67167, 67344, 64613, 79388, 85810, 82297, 75670, 69234, 60780, 62517, 66484, 44580, 22541, 29765, 44670, 46614, 46903, 52041, 50334, 50918, 50399, 46871, 54891, 58463, 59409, 56345, 47126, 41946, 39249, 45145, 35734, 20638, 16770, 30978, 23714, 30134, 56844, 63294, 63614, 54484, 43533, 27955, 35462, 39214, 60199, 73471, 69775, 59188, 50474, 37353, 39716, 44373, 36951, 35281, 34369, 27159, 41016, 42498, 34877, 35165, 40922, 51097, 47687, 50781, 61445, 53108, 38866, 34957, 47784, 50880, 58106, 53056, 52696, 61383, 65011, 59200, 49172, 25610, 22581, 31126, 29105, 35656, 38669, 33090, 33568, 34118, 37041, 30750, 34402, 32140, 24172, 11227, 13967, 2120, 8116, 8395, 19677, 8644, 10224, 21512, 25023, 15665, 8192, 19785, 14745, 10758, 14798, 15479, 9252, 9295, 17825, 11070, 3382, 283, -1087]
8693a087J8890J8945K786l841p546L485K693j266O429j6710j2574K15R987J2847
8679C3253m4n416k501l86r145Q098P759j4860j4593R369P885L140M882r210j3273
8664D958K737M590J2580Q108j3382q594Q346J1553m045j1363j6106j577J069J2528
8650A1402L158K994J2354j942L07L278L011J428l771o168j1266l437K893N307
8636A9548n216m544J1107R160O449L471k028j588o952r167o360N153n026p63J3061
8621B6305M894j1061J621m548j096M753K3343M622M942n958m895r810J0404J4052
8607E7568q519o712j2109r74K741j4785p224N886Q58O773J5138j0189k971O100
8593C1581k714N015J6612K01k0315r433K337J1867k421m682K761l14Q448Q83J571
$$ y = [-1087, 17803, 36748, 39534, 35693, 28147, 31632, 34325, 33059, 39488, 22778, 10204, 10419, 20406, 33253, 33209, 27793, 25292, 24906, 15761, 23859, 31618, 16758, 2165, 11534, 19419, 22559, 27441, 18231, 4958, 7695, 12285, 24865, 32973, 19591, 10997, 19343, 30896, 26851, 15488, -618, -2195, -1126, 11402, 14560, 17554, 29908, 27966, 28273, 31551, 34562, 35990, 32219, 26051, 14785, 11348, 14241, 19548, 14332, 9788, 20895, 30055, 36504, 39975, 37947, 36359, 29407, 20240, 13880, 19033, 14007, 13244, 26305, 31199, 20138, 21759, 17211, 16115, 20868, 44211, 48833, 53775, 47817, 42922, 33112, 43516, 57568, 49049, 42337, 30228, 29254, 31995, 17210, 9986, 15872, 16730, 23503, 38641, 28452, 25481, 31581, 28867, 33882, 50494, 50695, 30380, 20947, 23284, 35151, 32730, 28048, 30809, 30495, 38943, 39826, 41397]
8578D1397j0860j3793O534M694o543j0104N630o377p928N103J1697j157n939q139
8564D215j291L141L601j698k271j1131l693J2291R853J6458M119j3154o254l608
8550A0578r56J0007j74j1915j4087q457o692k610O834J6160O979J3603O696o906
8536A9060k17j4343j079l050j889q664l917j949R335O59l87J035J7443O70j082
8521A1625J0962j745J998j3731J085m604l975m380j0365J3049K2340J666r393
8508A4532O97k357L09J537J733J279l421k685o467m357K26j81j959l935K312J4651
8492A1914j930k962j3869k264j405j3115Q186J4919R279L210J712J92j9471r031
8478a4635l884K865K209k953J0368O634l90J6653J2406j4294j9703o652M103R773
$$ y = [41397, 30537, 16744, 23278, 27972, 21429, 11325, 16955, 10578, 2650, 7753, 19450, 18293, 12354, 4215, 2924, 6065, 9666, 7968, 5697, -5434, -9127, 3164, 13017, 29475, 33594, 20440, 14186, 10578, 9622, 19629, 19455, 7540, -6547, -15004, -21696, -24306, -17472, -1312, 5667, 19270, 25966, 19060, 18843, 4500, 3421, 371, -1518, -10182, -14099, -16048, -6713, -6054, -6441, -5406, 12037, 12707, 11625, 22587, 20842, 22840, 9109, 10194, 5590, 1615, -2765, -13130, -81, 22259, 23925, 14532, 15229, 12872, 13181, 14718, 16451, 17730, 14309, 11624, 5157, 800, 1026, 845, -1114, -5049, -2737, 11914, 9984, 7022, -6847, -9111, -10516, -23631, -15445, -526, 8753, 11963, 13675, 13867, -5604, -14635, -18519, -15654, -13445, -16398, -6030, 604, 214, 16867, 29273, 14979, -4724, -11376, -7273, 2500]
8464B500R349m625J3734m737j5607J278k545m860j38M303N305q11N257P718K849
8449A8970j5254j3678K407O397M38K727j036J0229o626j0073K232J771n565o249
8435a3310P838J3603j1940j0018m68m753o502j165O744K4218J8142r630r18P657
8421A9498L063J4067j795j340o508J93l77q100o050n239P221N015q982o618o025
8406a977j683R696R119j6329J549K097J220l023o314Q491J1992l971o687m597
8392d17q041R561J8186M404j3534j6855j0443J6565K718j351M839r277j0676M918
8378i403P074o735P253J1743K0100m948r498j272O39R652J3912j2155k6615j4706
8364a4959O788J1047p878k318P55J2305P78O556p088r978j805j0200j4168J0856
$$ y = [2500, 11849, 7224, 20958, 16221, 614, 1892, -653, -5513, -5651, -1348, 3957, 3146, 8403, 16121, 18970, 3716, -9962, -7555, -1158, -720, 2007, 971, 11200, 4574, -5499, -3267, -1496, -7061, -13310, -5472, 8131, -3809, -13827, -14295, -19048, -25550, -26715, -19971, 4247, 22389, 12759, 11841, 19498, 22561, 36628, 34833, 33493, 26985, 27178, 26801, 18701, 12651, 7412, 14633, 19648, 10666, 4048, -1977, -3660, 6036, 15155, -1174, 375, 2472, 3692, 669, -5645, 2846, 14838, 10867, 4180, -417, -8458, 1103, 19289, 23693, 10159, -6696, -17139, -574, 2144, 793, 5632, -3645, -14321, -9403, -2329, -9064, -1811, 9932, 30032, 25084, 15586, 14314, 14953, 24605, 38517, 26362, -253, -14959, -8171, 2876, -5002, -7320, -6565, 5740, 6518, 13074, 5986, -3992, -5797, -15997, -30165, -19309]
8350a9309K5279J5863j1227j9651O719N983j9723p75Q554J3442L458j3807m487
8337i681K205J5279j680p795k834N589m63R205J8126q140k1844P79Q338Q325k721
8322A2688r478j315n75o946N93K080j402M870n468O16O586J910m092P331K817
8307A0215K381l959J037q54q018N10L661l013n781k107j0508J709J4052Q173j054
8292F444r158P477J4309L386O63R39j0287k1522j4811k307K2067P607K343J2280
8278A9430R484M98Q96j1436j2946j4150j3532M982O142n834m24O440L11O450P619
8263C930o358J403P51n176m393N619L681P994p269L650j373o422j9748Q018J8266
8248B573o68j3976j9170R240L904j2084L15J3065M898l376J443J9596J8088j0932
$$ y = [-19309, 5970, 21833, 10606, -9045, -2326, 3657, -16066, -16841, -8287, 5155, 8613, -5194, -9681, -7476, 7803, 6123, -1672, -4506, 1083, 620, 9825, 27951, 19811, -2033, -1254, 7084, 15409, 12688, 3210, 1895, 1320, -5626, -5033, -2953, -4355, 515, -4953, -4337, 2249, 4159, 67, 7398, 10215, 12596, 8637, 9674, 8820, 802, 1312, 4973, 1960, -3821, -5928, -16436, -14727, -675, 7498, 6444, -2714, 4763, 19072, 22458, 23121, 24060, 13773, -7749, -22560, -24867, -2800, 4807, 7150, 19430, 28914, 29412, 30308, 18872, 5926, -8224, -21756, -16774, -10632, -16466, -16890, -10450, -10139, -3689, 3930, -2428, -1025, -274, -5450, -9843, -4224, -543, 7451, 182, 3832, 2459, -3963, -23711, -15693, 2573, 1905, -12071, -31241, -22001, -18097, -30181, -29866, -16801, -11903, -15279, -13836, 5760, 23848, 12916]
8234A2916j2797k1166o642J7128J7225l430m232L081j352Q624m00N381j0655j7001
8220a3320R637M578n742j061P853j747J969N449N693N876j0635j4422J3550J5952
8206B3630j2700J571N252o995l729K77O792l457K066n978k964O51J103O37K489
8191H645l190O755k0202j4323j2094R17N605J4449k039J864M198j1865r709K309
8177b8680O485j639N849M710J0597J1315O541l156j4507p775O534R350R2m271
8163A445l544j2871O30N799L235J6770j5055L22n579O540R00J0654N246n193J165
8148A0464p408j1496m43J0020K999n883R611P986l430l169J0487P932j5130o479
8134F061M203l121j5304P84J9992K809j1387O70K424n346r39k644j760K587L626
$$ y = [12916, 119, -21047, -27689, -10561, 6664, 3234, -998, 2083, 731, 9355, 8955, 14336, 3681, -13320, -3683, 895, -4847, -5908, 1945, 198, 2167, 7616, 13309, 19185, 8550, -5872, 7678, 23630, 10930, 12501, 17753, 10758, 7029, 7306, 14098, 10641, 12707, 6729, 3765, 4416, 5519, 6156, 8645, 5455, 12210, -7992, -22315, -34409, -33492, -27887, -13438, -15477, -13613, -9415, -21280, -30989, -28680, -22195, -23834, -17985, -13275, -2678, 8637, 15178, 12022, -2485, -10260, -3726, 5624, 5716, 1445, -2099, -14970, -14340, -8541, -5306, 11464, -3591, -3269, -8848, -2308, -1408, 9246, 14492, 9299, 10464, 3056, -8440, -8883, 1137, 4136, -1747, 7864, 15850, 12420, 9251, 19738, 27670, 12540, 6061, 10264, 7143, -8161, -7377, 12615, 15424, 4037, 4707, 7131, 1785, 846, -1798, -3558, -971, 2655]
8119B655l383Q055j5569J647Q725K1922O86p992J427J23K400q703r886M539j3055
8104f409J0875M147j640r285j4162O347J6565P286n54j3843r854N486J0253N634
8090A0846j0406j7910j0519J1593J1433P753M483l90o545o575m424P711L621K377
8076C048M157R70p676o829j6623J3610J7134L670k0140j2550j6940P539J6869
8063a3761J2191J950q587k540O221R714j979o457M862N642j287L81m562l954N850
8048C684j3285m107O461J973K417J0398j470R150l706m538j0037J795j496M218
8034A457J0628J3640O758j244j3643j1716K206j986l148r786Q222K381J798O521
8020A2088J3522O328l266j3701o12m643J2521J1132p92j447j8537j5590J550N887
$$ y = [2655, -728, 7327, -8242, -6595, 2130, 24052, 24738, 16746, 18173, 18296, 20696, 11993, 2107, 6646, -6409, 4466, 8613, 6973, -2312, -16474, -10127, 6438, 13724, 13170, -673, -10527, -5041, 5212, 10846, 440, -17470, -27989, -16396, -4963, 2790, 7273, 6883, 338, -6237, -10661, -2950, 671, 3048, 7205, 8175, 499, -6330, -22953, -9343, 7791, 11461, -8679, -21229, -38169, -30630, -13761, -1570, 380, -8207, -10747, -4526, 5188, 3209, -3248, 1614, 7256, 5969, 6350, 1788, -2166, 3684, -9601, -13708, -7247, -5274, -2857, 7541, 6071, 15221, 11515, 6977, -3060, -1265, -2761, 1457, 12085, 25725, 32483, 31239, 17596, 5880, 8086, 6100, 2952, -6834, 1388, 3769, 5567, 12088, 25610, 31938, 28672, 14971, 14359, 9716, 22237, 33369, 32577, 31130, 12593, -2997, -1447, 4440]
8006D440K836n662n753L874j219o915k251N70J792q074J9747J5505l094N467j094
7991B0169j5869j2958q74J790o78O812j495n035l434J479K064J0866Q540K772
7977A4149r152k6153q678P515R259R050o536J0930M682n185J2042J857P871N858
7963B7509r67l2l346r582L376K75l043r279J3554J3310m650q478o899n602m068
7948B078q614R92K0388J5267r900l996q909j3900k2002L305J0019K4657J5207
7935B4592j4897m032N646R941j851L26n595l598n826o502r590q985m442J7394
7921g419K686l712R926O210J4428J3291Q379j511j8435j6627j0091M045p016N784
7907f2J1154n90m103l065L318J007j91o507p466j102N883j424m099j4524L972
$$ y = [4440, 7276, 1614, -4139, -265, -1484, -8399, -10650, -10080, -8288, -16362, 3385, 18890, 15796, 21263, 20169, 4300, -8658, -9532, -7742, -8420, -1608, -3103, -8138, -11572, -10093, -8029, 2837, 11377, 14149, 4997, -21156, -29834, -22319, -13060, -4010, -10546, 384, 5066, -119, 11923, 13780, 21651, 27509, 26542, 26510, 23164, 13582, 16958, 17233, 14190, 4911, 18465, 31775, 27125, 18647, 11748, 6146, 2078, -6536, -5544, 14844, 30111, 20211, 16215, 7306, -6594, -28596, -25291, -15272, 9385, 24592, 9695, 5663, 11309, 21250, 19399, 19725, 14130, 10532, 4706, -1796, -11386, -20371, -24813, -7419, -4733, -8445, 1481, 7691, 22119, 35410, 43789, 42278, 23843, 7216, -2875, 1170, -5846, -62, 11092, 10502, 6399, 3334, 6652, 7659, 7468, 961, -6505, -7607, -1724, -3148, -7247, -21771, -17799]
7892a7799R2K3403R071k2502j0954K1369L572n917r41N343j19P89P916J1883q786
7877A6420K48J0730j1921M01P454j2752l906n087l496p69J337J005Q010k148j1983
7862f457n283P79O817O009J2532m067j1936j4008N779O299M081j0237J287P094
7848a311k242K284m320O69R244p615j2482k091O717R579o300j0651m300P945O864
7833h010K811r394q929K920R148Q018Q394q013K339R31r686r700n985K900M585
7818a7671P668p86m157j480K894J9478N187j2072o506R502j53l807q613P407N57
7803b552M984M84j0565n63J0214j3452j2603k099M292M089M956p019m622O627
7789a7829l300O89L047J3342P015j3878M176n769j0769r659K258o611J3953K1149
$$ y = [-17799, -17707, 5696, 14767, -7735, -18689, 2680, 6252, 335, -606, 4737, 4618, 5407, 13323, 25206, 16420, 16668, 27398, 15477, 15878, 23332, 10580, 6674, 1587, -1909, -2678, -1341, -336, 7674, 5526, -6457, -11740, -10961, -4144, 1865, 14397, 10330, -1606, -15614, -9835, -3536, 545, -9692, -8405, -1311, -3553, -1269, -5589, -4920, 4324, -3291, -15773, -17864, -11147, -1568, -7868, -18519, -22819, -14874, -8010, -5199, -14593, -23522, -20602, -11454, -3436, 4958, -3055, -716, 215, -9471, -19171, -25156, -22256, -17671, -10003, -10789, -14946, -16426, -13532, 5946, 11133, -939, -7445, 2057, 1904, -1903, -10516, -3109, -2552, 2432, 2916, -7649, -8212, 2002, -11450, -24053, -26152, -21860, -17771, -12815, -19834, -24456, -17829, -21129, -20440, -17393, -4051, 2964, -10914, -6738, -12507, -23276, -32935, -30677, -37288, -23335, -2186]
7775b186Q570q808m846P197N04o690p51r27k069M639J1233O170o236j833P32K30
7759D929Q680o155l026k240p027m081m685n76P367j852k102L980J5601m467Q644
7744A2990L569j4322j8854J4245P469J4371j0628q343j0669j6490K608J8073N007
7731i74j2167n729N760P729R444r791k450J257o418R708R848Q358N995k3528j401
7716d359J308o835K808K0504Q715j5446p060p694j7449Q662J3056M72N154K00
7702B036r538J6080K144q210m205O179Q791n993j2112M984L579K417N629l942
7688G839p567p343m137L938O32q011M309k252n74j8120p33J6676j3190p747N850
7673c0430J667J2055O033L609n09J9007L877L243J7221l289q631p864j620q506
$$ y = [-2186, 6384, -2424, -7270, -73, 431, -6259, -7010, -7937, -10006, -5367, 5866, 12036, 5800, 3967, 4699, 4929, 13609, 7454, 4428, 2188, -4839, -8920, -13605, -14181, -6814, -8666, -10768, -6788, 8813, 4346, 12990, 16559, 2237, -16617, -2372, 5097, 19468, 8840, 497, -10172, -26662, -24054, -5981, -974, -13141, -18870, -13110, -5381, 4063, -5728, -8178, -6921, -13339, -3631, 6217, 14575, 20570, -2958, -4359, -3051, -9886, -7078, 13426, 22141, 6695, -365, -8059, -25508, -16846, -3790, -3318, 1836, 2036, -7502, 8578, 10722, 2512, -1693, 4486, 13277, 7284, -4828, 156, 3735, 6152, 11781, 7839, 272, -7071, -11208, -7270, -6638, -14649, -10340, -12592, -13166, -31286, -32019, -15343, -28533, -36280, -30430, -28763, -16708, -10675, -7066, -7575, 11432, 15309, 18552, 35773, 32484, 23853, 15989, 14369, 5863]
7659E863J051j847l961k938p420j26p030j89l847k4L748N346O207k125Q555O054
7643G317o734K818o117L285J3012j0212p854j3244l449J9420R903l607R10J2142
7629A7590J2960j845j81o759n378j0739k3187k1428K148Q311K543o398Q108P772
7615a6483P680K0650j1617k670l533J19M368M167j280m171J177p092K490o584
7601a2779l610O853j1519O889P450P509j0263j378o988J0208N256n724n714j078
7587a4888J775K269J4039K291p068J552n53m642p160P886P196p211k152l04P681
7572G11r516k768P622J0002n344j4123J778q857j3519M711J1271r30j0336k031
7558c1329Q824N399J0977r576N306J1560O916j1061j965J288K867R831q49j1084
$$ y = [5863, 6914, 5067, 1106, -1832, -9252, -9378, -16408, -16597, -20444, -20468, -16720, -11374, -5167, -7292, 1263, 7317, 583, 3401, -2716, 569, 13581, 3369, -4485, -17729, -21178, -1758, 8145, 4538, 5448, 17590, 30550, 28705, 28524, 21765, 16387, 5648, -17539, -38967, -36819, -28508, -25965, -32363, -24255, -16483, -8803, 11847, 230, -2440, -5973, -5854, -1486, 2681, 1401, -2770, -1593, -8685, -6195, -12779, -16389, -9536, -21055, -14166, -6716, 793, -9470, -10848, -17836, -7628, -2372, -8096, -13810, -14888, -13113, -10844, 3195, 5486, -1582, -30, -583, -5225, -12385, -4499, 2697, -4514, -6666, -6970, 711, -8805, -11573, -3951, 6051, 707, -13416, -11638, -20495, -34014, -29303, -18032, -18962, -29298, -31329, -22505, -17106, -6129, -15705, -10399, 1161, 8077, -2984, -4949, -3661, -794, 9037, 8188, -2896]
7544b896j1924L002J0374j898q872K1014Q603j5897K957J4074r35O55p892k00
7530A0165K864j2192M376M300j2990p509N964J1480o293r642K380M421O082J1024
7516A4430q547r843k114L790l805J782j457P940J1309N762M501j2732j9734r713
7502a8431K241M111P735o073R983j454j5741o688l323P868J4198Q936k670j145
7488d53k068m754j4335o607M806J486R083m644K117J2328O954P87K2615p10j4875
7473A1730n573J028m449n991l727l762m08J1626J3666p712p714L67l038j282j4354
7458a9593K477R462J1453m844j5157l63M601P37Q186k303j4388k577Q953J572
7444a1784o62P382J4200j4188n096M790j1779M145j224J3143j031M043K89M824
$$ y = [-2896, -14820, -11818, -1444, -3342, -12214, 8800, 17403, 1506, 4463, 18537, 17602, 18257, 10365, 10165, 13029, 837, 5213, 9513, -3477, -10986, -5022, 6458, 165, -9477, -7097, -2676, 3406, 14430, 5883, -3960, -6074, -2284, -6089, -4307, -5764, 2176, 13485, 19247, 23748, 11016, -8718, -18431, -16190, -12079, -4344, -10417, -434, -1888, -17629, -24317, -27640, -19772, -5574, 3362, 692, -453, -2521, -7275, -21610, -28217, -23411, -21925, -12842, -17486, -15369, -3041, 3913, 4700, 27315, 26605, 11730, 6157, 7185, 2736, -3255, -6982, -10744, -11152, 474, 14140, 6428, -1286, -919, -3957, -5239, -19593, -17116, -7654, 3799, -1045, -16202, -16565, -11964, -11227, -3041, -5344, -19732, -22309, -13356, -11784, -12446, -5064, 9136, -5052, -10148, -5358, -17137, -12992, -14216, -1073, -2104, 1939, 2228, 7052]
7430G052q083k39L897m176J8648L839p718J1544J481p784l073k789j5682r163
7416a2246j0427m701J670Q111M473J656J3392n167M351l255j6030j4693O049P219
7402a9598O255O079J3889n781o37j135o146q464o241J0039K932m544J2053L566
7388B267m058p891n314p876n245J7872N416k332J1654P071r415N926n423j365
7374A287J642m738J8416L417l700j5748k0294J0851N612j0273L219l295L018p774
7360a8360J544L407j259L47Q23J4022j340o959N079M097K308r221j343J3698r458
7345b615k552r26O367m913J981M291j4515l336P024nq245L114k671o123j593K08
7329b4509k011p384J1745P032m613j5549j107J8252K486p878P578q259m045O359
$$ y = [7052, -1031, -1270, 2627, -1549, 17099, 20938, 13220, 24764, 26245, 18461, 15388, 12599, -3083, -12246, -22673, -27374, -25704, -17593, -13120, -11464, 1928, -3239, 1112, -2143, -18173, -32866, -26817, -19598, -13343, -7264, 6625, 844, 207, -928, -7074, -15538, -21779, -11740, -8808, -13352, -1299, 2267, -1791, -9682, -14996, -22872, -28117, -10245, -4829, -7161, 4493, 11564, 2149, 8075, 2652, 1287, 2929, -1809, 16607, 20024, 16324, 576, -19718, -8867, -3255, -13528, -10309, -13604, -10586, -18360, -16816, -13409, -14668, -14321, -13498, 524, -816, -7775, -2696, 1401, 3709, -5512, -6855, 6843, -2615, -5167, -6093, 274, -4639, -2658, 1633, -12882, -16218, -9194, -9199, -17444, -14330, -17001, -23124, -24717, -24509, -26520, -33904, -22159, -15127, -19740, -35289, -36396, -18144, -15658, -23536, -15958, -24217, -28262, -21903]
7315b1903L599Q596J629K572n451J540J1801P723Q384r334r812j0333o726j423
7301a9138O252K925M082q614j641K716J8992p111n374K1493m412L779m706j8639
7287i396l595P617J3103j4425j0998J157L423q609L747R071N424P93j5240p355
7273b5283J0109R552J6376n28j1852j048r57R79J617Q168k417P057J0623j456
7259B0940j0165j4958r935j97j844m888J3542n703r321J2395Q013N636n209l750
7245e444k850p044J8636N894q901m782j1921q297N211R434J2615p525O712P17
7231B455l551j4138m34Q881J0295P325K927R03K239J278N85q578P841j3722M852
7216I158J0123j9838j1122M507Q478N478J4580j5714o903N621J1763M87o534r343
$$ y = [-21903, -18304, -9708, -8079, -5507, -10958, -9418, 2383, 10106, 18490, 9156, -656, -10989, -17715, -19138, -12886, -9961, -5879, -14493, -16134, -13418, 5574, -1537, -6911, 14582, 10170, 13949, 9243, -9396, -12991, -5374, 7729, -6696, -17694, -16537, -13114, -21723, -17976, -8905, -3481, -2688, -17928, -25283, -15174, -5622, 10754, 10226, -1626, -2674, -3631, -2652, -1035, 7133, 4716, 11773, 22396, 20940, 10775, -4183, -14118, -14315, -16159, -21047, -7505, -13208, -22529, -10134, -2121, 3515, -1694, -5444, -8294, -15338, 3298, 9192, 291, -4491, -16412, -24709, -19498, -10064, 2551, -4974, 1738, 2455, -1096, -15234, -15668, -6787, 3508, 10833, 13760, 14663, 16902, 18180, 18765, 10187, 18028, 4306, 9158, 19281, -557, -11679, -7172, 1306, 6784, 21364, 5650, -1253, 4368, 16131, 16618, 10084, 741]
7202G41p255m361J0678q367J0667R230r588r993O152p833k091o418J315O227R511
7187a385J0321J014n385j0151O515N799r895n991J854J9723M101N176j5016j9091
7173a2411j1899K556J4813o751r345L186J0404Q562l333J4085N83m965n323R825
7159I987j264j5888l854r718k401P578j702o615M850J0619K13n994J4562L968
7145D341q375N147o650p670J663m73K241p524p568J1553J7934K645j8133j55J9165
7130H141j270p482j2179R961P521l013j0331L359o908o26M043J397p113O829J5195
7115G524L064j810n848N912L464j7000P508P135J521r888R671O374L881j647L231
7100B3092j1124n220L52l941l032r139m906J506m852l52O613o453o959j0247j1028
$$ y = [741, -6514, -10875, -197, -8564, 2103, 11333, 1745, -8248, -2096, -9929, -12020, -18438, -17123, -10896, -1385, 8936, 9950, 4565, -5586, 929, 6728, -3167, -9158, -7304, 12419, 16520, 21696, 6680, -12411, -24310, -21754, -6941, -13692, -23037, -19851, -9447, -885, -4218, 9867, 10450, 5485, 162, 9987, 8723, -7165, -11019, -20737, -23138, -15560, -17262, -23877, -19027, -8408, -8195, -14189, 373, 4341, -4034, 1113, -5537, -13207, -11544, -12017, -9776, -17300, -24868, -13315, 4619, 7264, -10869, -11024, 8141, 6871, -611, -12790, -2829, 4692, 1679, -8652, -5293, -12201, -12827, -8784, -7387, -14500, -7671, 7524, 10588, 8778, 2930, 8842, 12306, -4694, 2814, 9949, 11470, 1582, 11253, 17627, 21508, 19861, 23092, 11968, 6748, 7100, 3159, 127, -9012, -13918, -12412, -17264, -17616, -11003, -17456, -24415, -34662, -45690]
7085d5690J6105J1679R246J3066m136j4714Q818J0516m608j461l154j0884m874
7072b0091L91n308L968J2646N596j484j8025j4141N804L595k193J0531N413R244
7058d054j1669j4625j316J0411L586O958k492QM607O008l370O645l335j976J094
7043c520M23J730j437k856k483J1539r34m116m340m120j030k551K807K662P832
7028c94k222m260L981k099j1953K981j778O281n046k515J4513l068q172p113J0494
7013a0370L269p333j5343j2642J068Q136N796o950M214Q297O147L295M278L13
6999g825p67Q198L867p890J3524P700o790L808m233p192o011l794n58N539M209
6984A785p335q24l828J0570j0918m630J0735l653j0634n833J643j2642P151R923
$$ y = [-45690, -29585, -17906, -8660, 4406, 270, -14444, -5626, 4890, 282, -1179, -4333, -15217, -20091, -19700, -25008, -21040, -8394, -2798, -4282, -22307, -36448, -30644, -27049, -29242, -18711, -13298, -4054, -15723, -30348, -31664, -21253, -17667, -10709, -13201, -13193, -8586, -2578, -5948, 697, -2638, -4614, -3520, -3097, -1367, -2804, -5660, -8143, 3396, 2462, -1654, -5994, -10114, -11144, -13695, -10888, -8226, -394, -2616, -6876, -2895, -4994, -16947, -13966, -15744, -9463, -14509, -17024, -2511, -5579, -13751, -20864, -10370, -7101, -14434, -29777, -42419, -41351, -33215, -27419, -34369, -30155, -21858, -15711, -12416, -8138, -7825, -8592, -394, 3473, -4417, 9107, 16807, 10017, 13825, 9592, 2400, -3611, -7405, -7963, -2424, 1785, -5550, -6374, -10202, 368, -10550, -15180, -4445, -8098, -18732, -24565, -22922, -35564, -28413, -18490]
6970a8490K178J1112o319l761N000l201J0107L988m817r881M854J4043n60j0691
6956f438N141K08j8310o942L248J6897R115j912J3662j2237N26K041m805o490
6942f296M620J1193l646j1955j2167k115j273p77Q346K721k701Q455O285Q43K840
6927D373Q735k491k0496m929J052k046M242N956O603q387o83N028Q926J0732q875
6912G740j3422j1989J718K542J4639J3620j1582j6258M845n944m843j3712p511
6899d0157J1853J1917R082Q029L808N963k354n405m181O487o132j1971J627R644
6885a790r677j0093j5991m200J4351J2291J2071r476p902J0268O738J2528r830
6872g12n857n253o547j0076Q39J0891J2141J6980j3584k757P427R101o133j0350
$$ y = [-18490, -16312, -5200, -11519, -15280, -10280, -13481, -3374, 614, -4203, -14084, -9230, 4813, 4253, -6438, -1297, -1089, -19399, -26341, -23093, -6196, 2919, 1007, 14669, 2432, 2958, 4999, 194, -6296, -1676, 9517, 5871, -6084, -18251, -20366, -21639, -22416, -14070, -11349, -14050, -5595, 690, 1533, 4373, 13108, 10617, -9879, -14808, -13756, -15802, -11560, -5604, 999, -7388, -8071, -3043, 5883, 16615, 7740, -5682, -17671, -15953, -13411, 1228, 14848, 3266, -12992, -8147, -14091, -18934, -32646, -40157, -28304, -16387, -7305, 724, 4532, 10495, 8141, 2736, -1445, 5042, -1090, -13061, -11434, -1790, -11467, -21560, -37551, -41751, -27400, -15109, -3038, -12514, -20416, -10148, -3410, 9118, -712, -6569, -11822, -18369, -28445, -27606, -16715, -4574, 12406, -1178, -3935, 3492, 12593, 6460, -3890]
6858c890M254M211R510k638k4214j5961R039J7110m751j919K619N725J0974N317
6844A5386j3202j2019r902J1779J2457L398n783l83j8368j2732K429J1450N562
6831i928r49j0920O031J8577J1755k817j2901j313j1335P890Q042J5350n221j0510
6817A751p192m708N602P991j20N494k542j6199P226q891k526j15M050L048p859
6802a4990L244P74R021J2947q014n815M348P695J092l527p020k037R300M317j0657
6787F78k009k147p666J1251k53q863J2408j430j3084m377j073J649J1611n503
6773h808j2323r671P546R106J1145n41n058k7n254q346j953P22o005n746J8042
6758a7171O70J0201j638n942M582P898m111N557o91N636K907l241o841m20P2L437
$$ y = [-3890, 364, 4575, 14085, 11447, -12767, -28728, -19689, -2579, -7330, -9249, -6630, -905, 10069, 15386, 2184, -9835, -19737, -7958, 4499, 7897, 2114, 1731, -16637, -29369, -26940, -15490, -9928, -10877, -21797, -15766, 2811, 14566, 11749, -1152, -2465, -13800, -5910, 2132, 17482, 12261, 1751, -5441, -10149, -4547, 3444, 3324, 8818, 6276, -9923, -2697, -11588, -14114, -14229, -10179, -7131, -14990, -11746, -10972, -1951, 10996, 2982, -2833, 1515, 9210, 10302, 6775, -245, -2282, 7018, 11335, 678, -1331, -3478, -11144, 107, -146, -9009, 3399, 1969, -11115, -15492, -16565, -14916, -3305, -8808, -21131, -30802, -23256, -14150, -3005, -3546, -8604, -8631, -13885, -22231, -24184, -23462, -29467, -35213, -17171, -16501, -6300, -7938, -13880, -9298, -1400, -5511, 46, -645, 4991, 7898, 4657, -2184, -2604, -2532, 905]
6742I05l443j1774l923J6368J201r025m063r795N754Q140n112K826j037p140O310
6727a3808J1424L391J7467l16L727O79N569p792k5095l232j443q252N525J555
6713a0601j2567N734Q412M649j1482L48M079O22K532N742p913L215Q924Q876q026
6698B544j5626n229O410K0113O536o790N867l285M788l88m194k466n322R54n359
6683a447K820J0165j0208j5393o698R068M032n909K349K0619Q607j3063j5068
6670a0126O775J8509J1727j0316j3319J0745Q849q24j3967l739n798P696Q790
6657A5002N663l429j0521n478l235N249N349L769j4140j088P294O798o260j3059
6643h086o148J0914J2200j2679K6j464J3088K568l79q121q993J2108J2478m822
$$ y = [905, -2538, -14312, -18235, -1867, -666, -9691, -13754, -23549, -17795, -9655, -14767, -11941, -12978, -20118, -13808, -2384, 1007, 18474, 18158, 21885, 22564, 28133, 20341, -4754, -7986, -9429, -17681, -12156, -10601, -23168, -17434, -9022, -4373, -15855, -15507, -11428, -10806, -8274, -2532, -10445, -7230, 1694, 10570, 2544, -13082, -18311, -11901, 8212, 14748, 7958, 13825, 10540, 15328, 14940, 10746, 8280, 2958, 3912, -1447, 1373, 11538, 1330, -14063, -20761, -11693, -7661, -13570, -11221, 9398, 18005, 4942, -10126, -3351, 15158, 26885, 16569, 3250, 13995, 22844, 22020, 8053, 4314, -1484, 6212, 15002, 20665, 17236, 6715, 1237, -1998, 3251, 8600, 12369, -1771, -2859, 4435, 11233, 4973, -8086, -14234, -3320, 8880, -3799, -3773, -5237, 7851, 10419, 10040, 1919, -7074, 5034, 17512, 12690]
6629A2690j5477j599L554M123R711K065L06n392p532J41j7478j0576O77J3124
6615a1663J5164p383n257J4534R445l447K39m703j6439o642p038l423J0606j936
6601a7943K774J322Q694M893k346j747j011j1052o097O990p860Q961J0740Q230
6587D548j4621r762J3726P431m831q794l263m313m191n742M850J7710N679K150
6573E77j2202o698j745R523P161k125o39Q845J8607M540K821j1858m887J2562
6559B4482k0101p593j636j72L083K195p103j9332P487J2409R508L257J55m884
6545A755n190j810p180Q216O615Q95j1325k703k260j530j1462N771J8599j461
6531c070J0112J3520r391k8951j6069J5229J1710J5384j315j2956K89j428K687
$$ y = [12690, -2787, -4386, -832, 3291, 13002, 15067, 15373, 9981, 2449, 2590, -14888, -25464, -24787, -11663, 3501, -3882, -9139, 5395, 14840, 11393, 11632, 6929, -9510, -16152, -23190, -26613, -16007, -17943, -15169, -13847, -5153, -260, -2606, -4353, -5364, -16416, -22513, -15523, -23383, -14422, -3682, 4548, -10073, -19835, -6109, 1322, -3509, -12303, -15566, -19879, -24070, -29812, -24962, -7252, -1573, 577, -11625, -18323, -20068, -10545, -3384, -5509, -6148, 2697, 21304, 25844, 28665, 16807, 11920, 24482, 4381, -3212, -4848, -5020, -1937, 258, -6845, -26177, -18690, -6281, 3227, 6484, 6639, 1755, -3435, -5245, -12425, -4209, 2406, 3301, -8024, -10727, -12987, -14517, -25979, -20208, -1609, -3070, 7042, 20562, 11171, -17780, -33849, -18620, -6910, 8474, 7159, -5797, -5508, -6936, -4249]
6518d249p221L62J1407k489J242m001j2904j915J6067J9453j828m539R401m568
6504A4218L433k741o755j0066q486j043N409L418O43J3522p186j4267k659R682
6490b878j3767o950K525J5748L222K018R18R872p504r333J5278j1738l933J688
6476d834J0242J0123J6356n291q165k349j5414N796j2678j8021N145J1745J6419
6463I074r208k68R71n331J2578R36n971P74j063j2576J772j73k253p463K912j628
6447a6917P164L325J4639j5271p358J8535N531q81n614J236l529j988k133L105
6433a56O614j1659M011q847J371n349m534R604P626L167N527N535q052j0523J0213
6418D548p795j3844M61J3394R441p90k746j194K189R829o233J399L810q596r614
$$ y = [-4249, -11470, -11108, 299, -2190, -948, -4949, -17853, -19768, -3701, 15752, 13924, 9385, 18786, 14218, 17651, 14910, 8155, -1911, -10397, -11440, -6031, -2613, -1970, 11552, 4366, -9901, -12560, -2878, -16645, -23595, -21070, -5322, -2100, -82, 836, 10708, 3204, -6129, 9149, -2589, -6522, -4834, 5408, 15531, 31887, 26596, 18431, 16082, 668, 6464, -6214, -24235, -19090, -7345, 9074, -134, -402, 569, -4762, 7816, 8752, 2781, 3555, 2492, -10084, -8312, -8485, -10738, -18201, -15289, -16917, -9753, -6428, 8211, -7060, -14418, 4117, 9648, 8767, 3153, 4389, 860, -1128, -3261, -156, 6458, -5201, -1190, -10037, -8666, -14015, -18549, -8945, -1319, 1848, 7375, 12910, 4858, -5665, 4548, -3247, -17091, -16630, -3236, 6205, 5415, 2669, 1475, 3664, 13493, 7260, 8659, 12469, 3873, -5741]
6403e741n37J969N859J321k014j1932m085L004K2948K720j4306o888J1481n214
6389a415J44K3808L950o556n091q72j371L524J728k642j1051q739J885M929q158
6374e927j3276m605K3019J7807j5170q836o553o856J1679J3173P300k484j507
6361G764R759o541j2841N37N717j190k945J1659Q02q781j1206m885P939M835M850
6346E473J484p997j293n410N522J368r133j2703j3223J973J5627J6240k785q098
6332a2955o558J2954N18m233p501M567Q661M212J287m516K269J09M284o966m593
6317h461P549R838j4520p442J4210M401N9P12k999K99k36L585N913L323k6514
6302a0283j5366K798N235N429P8M635J6890N861J140j0362n092l751n847k73k086
$$ y = [-5741, -6278, -4309, 1550, 2871, 857, -11075, -15160, -12156, 10792, 13512, -794, -7682, 3799, -1415, -1271, 22537, 26487, 19931, 14840, 13968, 12597, 16121, 17849, 15207, 4156, -4583, -2698, 2231, -5927, -19203, -23808, -789, 17018, 1848, -6988, -13541, -20397, -8718, 4455, 11755, 9271, 7764, 17523, 10982, -1859, -1322, 4395, 3205, 260, 11919, 12721, 3940, -7266, -12151, -4212, 623, 5473, 6957, -1040, -2333, -7743, -2221, -853, -9986, -22689, -35912, -33939, -18312, -2072, -4857, -12955, -19513, -6559, -6041, -10274, -17775, -13208, -4547, -335, 952, -3564, -1295, -1186, 3098, -3868, -8461, -912, 8926, -5594, -13036, 1174, 5575, 5634, 6346, 3347, 3646, 3410, 6995, 12908, 16231, -10283, -25649, -22851, -17616, -12187, -12109, -7474, 9416, 15277, 16417, 6055, 963, -2788, -8635, -8908, -10994]
6287a0994J3941Q896M34L127n227j3792j6703J0248J0424O627L510j1043r823
$$ y = [-10994, 2947, 11843, 12277, 15404, 10177, -3615, -20318, -10070, 354, 6981, 10491, -552, -10375]
$$ [...]
##END NTUPLES=NMR SPECTRUM
##END=
