##TITLE=Analysis number 327216
Compound Code han 00203
Project Code adrs
Chemist Name aci
##JCAMPDX= 6.0         $$ Bruker NMR JCAMP-DX V2.0
##DATA TYPE= NMR SPECTRUM
##DATA CLASS= NTUPLES
##ORIGIN= Bruker BioSpin GmbH
##OWNER= nmr
$$ XWIN-NMR		Version 3.5
$$ Thu Mar 15 10:58:37 2007 GMT Standard Time (UT+0h)  MAYBRIDGE\nmr@NMR_250MHZ
##.OBSERVE FREQUENCY= 250.131544655141
##.OBSERVE NUCLEUS= ^1H
##.ACQUISITION MODE= SIMULTANEOUS (DQD)
##.ACQUISITION SCHEME= undefined
##.AVERAGES= 16
##.DIGITISER RES= 18
##SPECTROMETER/DATA SYSTEM= dpx250
##.PULSE SEQUENCE= zg30
##.SOLVENT NAME= CDCl3
##.SHIFT REFERENCE= (INTERNAL, CDCl3, 0, 16.522)
##AUDIT TRAIL= $$ (NUMBER, WHEN, WHO, WHERE, WHAT)
$$ ##TITLE= Audit trail, XWIN-NMR		Version 3.5
$$ ##JCAMPDX= 5.01
$$ ##ORIGIN= Bruker BioSpin GmbH
$$ ##OWNER= nmr
$$ C:\u/data/dgb/nmr/ADRS/960/pdata/1/auditp.txt
$$ ##AUDIT TRAIL=  $$ (NUMBER, WHEN, WHO, WHERE, WHAT)
(   1,<2007-03-15 10:58:14.49 +000>,<MAYBRIDGE\nmr>,<NMR_250MHZ>,
      <created by zg, POWCHK disabled, PULCHK disabled
       configuration hash MD5:
       49 4B E0 1D 92 C2 6B 37 9F E6 65 BC 52 41 86 1D
       data hash MD5: 64K
       E5 C7 1A B5 BB 8D 29 49 35 1B C1 9B 44 D0 19 95>)
(   2,<2007-03-15 10:58:28.24 +000>,<MAYBRIDGE\nmr>,<NMR_250MHZ>,
      <Start of raw data processing
       ef LB = 0.3 FT_mod = 6 PKNL = 1 SI = 32K 
       data hash MD5: 32K
       D6 87 E7 2B EF F4 C9 4C 72 3C E6 7B CB 77 FF 1C>)
(   3,<2007-03-15 10:58:30.05 +000>,<MAYBRIDGE\nmr>,<NMR_250MHZ>,
      <apk 
       data hash MD5: 32K
       39 D5 B4 EC 15 D1 B8 11 FB 52 00 CD C6 E5 FC E2>)
(   4,<2007-03-15 10:58:30.86 +000>,<MAYBRIDGE\nmr>,<NMR_250MHZ>,
      <abs ABSG = 5 
       data hash MD5: 32K
       46 4C 29 1F 1F 16 E0 83 2E D3 E3 0D C9 80 81 0B>)
$$ ##END=
$$ 
$$ hash MD5
$$ 39 8A DA 87 BB C2 D0 00 DA 8F 81 E7 3A 46 E5 3E
##$RELAX= 
##$RELAX= 
##$RELAX= 
##$RELAX= 
##$RELAX= 
##$RELAX= 
##$RELAX= 
$$ Bruker specific parameters
$$ --------------------------
##$DU= <C:\u>
##$EXPNO= 960
##$NAME= <ADRS>
##$PROCNO= 1
##$TYPE= <nmr>
##$USER= <dgb>
##$AMP= (0..31)
100 100 100 100 100 100 100 100 100 100 100 100 100 100 100 100 100 100 
100 100 100 100 100 100 100 100 100 100 100 100 100 100 
##$AQSEQ= 0
##$AQ_mod= 3
##$AUNM= <au_zg>
##$AUTOPOS= <18 >
##$BF1= 250.13
##$BF2= 250.13
##$BF3= 250.13
##$BF4= 250.13
##$BF5= 500.13
##$BF6= 500.13
##$BF7= 500.13
##$BF8= 500.13
##$BYTORDA= 1
##$CFDGTYP= 0
##$CFRGTYP= 5
##$CHEMSTR= <none>
##$CNST= (0..31)
1 1 145 1 1 1 1 1 1 1 1 1 1 1 1 1 1 1 1 1 1 1 1 1 1 1 1 1 1 1 1 1 
##$CPDPRG= <>
##$CPDPRG1= <>
##$CPDPRG2= <>
##$CPDPRG3= <>
##$CPDPRG4= <mlev>
##$CPDPRG5= <mlev>
##$CPDPRG6= <mlev>
##$CPDPRG7= <mlev>
##$CPDPRG8= <mlev>
##$CPDPRGB= <>
##$CPDPRGT= <>
##$D= (0..31)
0 1 0 0 0 0 0 0 0 0.06 0 0 0 0 0 0 0.0002 0 0 0 0 0 0 0 0 0 0 0 0 0 0 
0 
##$DATE= 1173956293
##$DBL= (0..7)
120 120 120 120 120 120 120 120 
##$DBP= (0..7)
150 150 150 150 150 150 150 150 
##$DBP07= 0
##$DBPNAM0= <>
##$DBPNAM1= <>
##$DBPNAM2= <>
##$DBPNAM3= <>
$$ [...]
##$SUBNAM7= <"">
##$SUBNAM8= <"">
##$SUBNAM9= <"">
##$SW= 20.6930455092707
##$SWIBOX= (0..15)
0 0 3 0 0 0 0 0 0 0 0 0 0 0 0 0 
##$SW_h= 5175.983436853
##$TD= 65536
##$TD0= 1
##$TE= 683.16
##$TE2= 300
##$TE3= 300
##$TEG= 300
##$TL= (0..7)
0 120 120 120 120 120 120 120 
##$TP= (0..7)
150 150 150 150 150 150 150 150 
##$TP07= 0
##$TPNAME0= <>
##$TPNAME1= <>
##$TPNAME2= <>
##$TPNAME3= <>
##$TPNAME4= <>
##$TPNAME5= <>
##$TPNAME6= <>
##$TPNAME7= <>
##$TPOAL= (0..7)
0.5 0.5 0.5 0.5 0.5 0.5 0.5 0.5 
##$TPOFFS= (0..7)
0 0 0 0 0 0 0 0 
##$TUNHIN= 0
##$TUNHOUT= 0
##$TUNXOUT= 0
##$USERA1= <user>
##$USERA2= <user>
##$USERA3= <user>
##$USERA4= <user>
##$USERA5= <user>
##$V9= 5
##$VALIST= <valist>
##$VCLIST= <CCCCCCCCCCCCCCC>
##$VD= 0
##$VDLIST= <DDDDDDDDDDDDDDD>
##$VPLIST= <PPPPPPPPPPPPPPP>
##$VTLIST= <TTTTTTTTTTTTTTT>
##$WBST= 1024
##$WBSW= 4
##$XGAIN= (0..3)
0 0 0 0 
##$XL= 0
##$YL= 0
##$YMAX_a= 473509
##$YMIN_a= -506099
##$ZGOPTNS= <>
##$ZL1= 120
##$ZL2= 120
##$ZL3= 120
##$ZL4= 120
##$ABSF1= 16.522
##$ABSF2= -4.171173
##$ABSG= 5
##$ABSL= 3
##$ALPHA= 0
##$AQORDER= 0
##$ASSFAC= 0
##$ASSFACI= 0
##$ASSFACX= 0
##$ASSWID= 0
##$AUNMP= <proc_1d>
##$AZFE= 0.1
##$AZFW= 0.1
##$BCFW= 0
##$BC_mod= 0
##$BYTORDP= 0
##$COROFFS= 0
##$CY= 12.5
##$DATMOD= 1
##$DC= 0
##$DFILT= <>
##$DTYPP= 0
##$F1P= 14.0000005364418
##$F2P= -0.99999901652339
##$FCOR= 0.5
##$FTSIZE= 32768
##$FT_mod= 6
##$GAMMA= 0
##$GB= 0
##$INTBC= 1
##$INTSCL= 1
##$ISEN= 128
##$LB= 0.3
##$LEV0= 0
##$LPBIN= 0
##$MAXI= 10000
##$MC2= 0
##$MEAN= 0
##$ME_mod= 0
##$MI= 0
##$NCOEF= 0
##$NC_proc= -4
##$NLEV= 6
##$NOISF1= 0
##$NOISF2= 0
##$NSP= 0
##$NTH_PI= 0
##$NZP= 0
##$OFFSET= 16.522
##$PC= 1
##$PHC0= 229.8485
##$PHC1= 6.828629
##$PH_mod= 1
##$PKNL= yes
##$PPARMOD= 0
##$PSCAL= 4
##$PSIGN= 0
##$REVERSE= no
##$SF= 250.13
##$SI= 32768
##$SIGF1= 0
##$SIGF2= 0
##$SINO= 400
##$SIOLD= 32768
##$SREGLST= <1H.CDCl3>
##$SSB= 0
##$STSI= 32768
##$STSR= 0
##$SW_p= 5175.98343685301
##$SYMM= 0
##$S_DEV= 0
##$TDeff= 65536
##$TDoff= 0
##$TI= <Analysis number 999999
Compound Code 99
Book Reference 9
Project Code 9>
##$TILT= no
##$TM1= 0
##$TM2= 0
##$TOPLEV= 0
##$USERP1= <user>
##$USERP2= <user>
##$USERP3= <user>
##$USERP4= <user>
##$USERP5= <user>
##$WDW= 1
##$XDIM= 32768
##$YMAX_p= 457030560
##$YMIN_p= -209091
$$ End of Bruker specific parameters
$$ ---------------------------------
##NTUPLES= NMR SPECTRUM
##VAR_NAME=  FREQUENCY,     SPECTRUM/REAL,   SPECTRUM/IMAG
##SYMBOL=    X,             R,               I
##VAR_TYPE=  INDEPENDENT,   DEPENDENT,       DEPENDENT
##VAR_FORM=  AFFN,          ASDF,            ASDF
##VAR_DIM=   32768,         32768,           32768
##UNITS=     HZ,            ARBITRARY UNITS, ARBITRARY UNITS
##FACTOR=    0.157963299565203, 1,           1
##FIRST=     4132.6476996994, 0,             0
##LAST=      -1043.33573715361, 0,           0
##MIN=       -1043.33573715361, -209091,     0
##MAX=       4132.6476996994, 457030560,     0
$$ Real data points
##PAGE= N=1
##DATA TABLE= (X++(R..R)), XYDATA
$$ [...]
22877A6922q654k1860O304n5635k9217L0083N1611j264J7069L8012K4187k2970
22865D4588j4498M202J0744q373l6q951l851J0186k2014r782o1657l6119K109
22852i3452M3211j198k5731K1208Q7104J3043k8488m4789L132J4202N1105l4641
22840D706m2013L345r664k9851k2802J2288K6151R088J1916L0513J5783q359l6307
22827c5206m1027k7326L8827N9738K472k0523K314n06k3328j8085J4369k9189
22815g7470m576L9852O3829j3855r722p1837j5749J7417N6195P4234j7528o1795
22803b1005l5203J4534J02520L8555j5554n4994l0683j2363q817j1363r183K7635
22791a5921K8576k3221O822R744j7294m5402n9200p983L8427L3964M5053K6050
$$ y = [16922, 8268, -13592, -7288, -62923, -92140, -62057, -10446, -11710, 5359, 43371, 67558, 44588, 30090, 34292, 45036, 36663, 36627, 27676, 23825, 34011, 11997, 2215, -59442, -95561, -93452, -50241, -51439, -77170, -55962, 31142, 44185, 15697, -29092, -25960, -11758, 39347, 4706, -37307, -33962, -43626, -73477, -96279, -83991, -57840, -48752, -36836, -6323, 9460, 1101, -35206, -76233, -103559, -64732, -4994, -2522, -23045, -20731, -21237, -44565, -62650, -48281, -77470, -82046, -42194, 21635, 7780, -1942, -73779, -89528, -72111, -15916, 58318, 40790, -21005, -56208, -41674, 60846, 99401, 83847, 28853, -1830, -14193, -23010, -34373, -43556, -15921, 12655, -10566, -3744, 6000, -11294, -56696, -115896, -123879, -85452, -51488, -6435, 19615]
22779A9615k4599n1693N930n6967l6072n8976m244L2042J8962k7309M0919O7818
22767g4574J2174J7745K1807J8513m8187K8085M8245N423k0596M136M898l4540
22755a6871j9660L5994L8918M6960j9310k859m2498q502k1640o6019j5110P5134
22743a5463L6690n677k1072k0081j5790k6534R899L0410J8226n885K3751j291
22731G183j3546r0495l9587Q4729L1681l299J4984R145o2488k2532l481l2076
22719a19782N0983J2050n4127j0865N8651L2559J0411M549L2025o0290l9469K3023
22707f0282K8824k8109j8280o889M5290O3776K8221L6270K5936n4840n6729m432
22695a244j2126j2173J542L30K928J0061l028K0834k6109n4424j406M8227p825
$$ y = [19615, -4984, -56677, -50747, -107714, -143786, -202762, -207006, -174964, -156002, -183311, -142392, -74574, -62400, -44655, -22848, -4335, -52522, -24437, 23808, 29231, 8635, 12771, 17669, -16871, -36531, -537, 38381, 85341, 66031, 63172, 20674, 12172, -9468, -75487, -90597, -15463, 21227, 15550, -5522, -25603, -41393, -67927, -58028, -27618, -9392, -15277, 8474, 7183, -6363, -96858, -136445, -51716, -20035, -23334, -8350, 795, -61693, -84225, -87706, -119782, -68799, -56749, -110876, -121741, -63090, -30531, -20120, -15571, 16454, -43836, -83305, -60282, -31458, -59567, -77847, -84736, -39446, 24330, 52551, 88821, 114757, 59917, 3188, -1244, -13370, -25543, -24001, -23671, -20743, -10682, -13710, 7124, -18985, -73409, -74815, -26588, -34413]
22682c4413k421L2169N7744P842p8597R970r37m9090J9462k0734m2971K9017k29
22669g3188L6376M2285J582q481k3675J5198J768m58J2801L6782J0939m3892p700
22656C37j1729J6540k5722o1046L2391j5037L2512L3768j0787K3680l0245n2474
22644f7812m9626Q847k0650M9M7994Q1604J7816m5711l3476l545M8270N3544q2
22631C7222J9584J3829m2954k0541j6144M1944j9927O931M2871j4775k0450j9059
22619H531k1680k3773l3922l7926N7960J4834n1294l6422K5876J0676o43l1170
22607a18953O41J7555J6820n95J3216J0497r736j8086O5577j8170p057J0659j2343
22594d9975j2374O5975J4827n1041L3206K558k2039m0338j2903K1047k9024k1881
$$ y = [-34413, -36834, -4665, 53079, 60921, -17676, -7706, -8643, -57733, -38271, -59005, -101976, -72959, -73188, -36812, 5473, 7055, -1426, -25101, -9903, -8135, -8593, 4208, 40990, 51929, 8037, 337, -11392, 5148, -20574, -81620, -49229, -64266, -31754, 2014, -8773, 14907, -15338, -67812, -117438, -108591, -129241, -129192, -81198, 406, 18222, -27489, -60965, -64510, -16240, 37304, 37222, 56806, 70635, 27681, 7140, -9004, 32940, 13013, 19944, 62815, 48040, 27590, 8531, -13149, -36922, -70844, -108770, -50810, -35976, -87270, -123692, -97816, -87140, -87783, -118953, -118312, -100757, -83937, -84532, -71316, -60819, -70555, -88641, -23064, -41234, -48291, -37632, -49975, -62349, 3626, 18453, -32588, 618, 3176, -18863, -59201, -72104, -51057, -80081, -101962]
22582a01962L8257l0156n836k5314M2659M3804N5135J7612P75q067L208k5910
22570D205j228k1892n2953K5831K2282L8934M080n7544J0370J9477L2358J2173
22558C6093J1406j8053k6640j3087K3795K0376m7278r082J7554K5529j5932l412
22546A269L033j5588l9343j7054l004n232n435O8508q001o5475k8570J7314P8511
22533a9067J532j0227k7126J9442O6142m364q8955j3365j857K4457N4853k78l1765
22520c0578j1636J7433Q0033R722n8742m761K7704k1220m3653K0590K9135j0426
22508C601j9146K765j0917O644K8429j9038o9874k7985k1579N5160J2515k2157
22496h1582l512k2166J1712K3424l5428k3581K9878O3979K3266J9088r463M4844
$$ y = [-101962, -63705, -93861, -99697, -125011, -82352, -38548, 16587, 34199, 34974, 26907, 30115, 4205, 2977, -18915, -71868, -46037, -23755, 15179, 19259, -38285, -27915, -8438, 23920, 36093, 47499, 29446, 2806, -10281, 13514, 33890, -13388, -22470, -4916, 20613, 4681, 1269, 4302, -11286, -50629, -67683, -70687, -75919, -81354, -12846, -20847, -86322, -114892, -97578, -19067, -17535, -27762, -54888, -35446, 30696, 26332, -62623, -75988, -77845, -53388, 1465, 1187, -30578, -42214, -24781, 55252, 64974, 6232, 1471, 29175, 7955, -35698, -15108, 14027, 3601, -15545, -12780, -23697, -17053, 11376, -7662, -77536, -105521, -127100, -71940, -59425, -81582, -85094, -107260, -95548, -72124, -107552, -131133, -101255, -37276, -14010, 5078, -4385, 40459]
22484D0459K4582p6343j6688N6725o615k3621L1689k659l1317P411k1632p437
22472b5446M4750K8227k2208n6497K1052J8657M964j6943m257J1450N717r2167
22460h2701J5163R740k6702J1574M0155l987q013j8902L1689K294l3017o32p834
22447g1173l4134J9969Q6136N8792k2823l8115J2087j5222j7761L0047K662J6311
22435B6776K481K4235q381n7549n350n6661k5090K3862J06016O0974p8514p8269
22423f5470J4165k5290J384l3954K3121N956K4076L0354k3693q5336K9560J7557
22411h7570P081l967K2716M9561L5412o0591l0154k1073r274K9045P825N635N4085
22398a269J5171J1439k4655l1121L8578O6513l5557m3367n962l6653J9264O0511
$$ y = [40459, 65041, -11302, -27990, 28735, 22120, -1501, 30188, 27529, -3788, 3623, -18009, -25446, 19304, 47531, 25323, -31174, -10122, 8535, 13499, -3444, -7701, 3749, 9466, -82701, -67538, -57798, -84500, -72926, -32771, -36758, -44771, -63673, -31984, -29690, -62707, -63339, -71173, -105307, -85338, 798, 59590, 36767, -1348, 10739, -4483, -22244, 7803, 10465, 26776, 29257, 53492, 45111, -12438, -17788, -74449, -99539, -75677, 30339, 91313, 12799, -65470, -51305, -76595, -75211, -109165, -86044, -80088, -56012, -25658, -49351, -134687, -105127, -87570, -80489, -84456, -61740, -12179, 23233, -37358, -67512, -88585, -97859, -68814, -60989, -55354, -1269, 13902, 25341, 686, -30435, 8143, 74656, 39099, -4268, -10230, -46883, -27619, 32892]
22386C2892K2600j258k0016M111j2554r579j1665l7419k9024n5274r845J8088
22374a08943L2833K6734n1089l4732M073M9929j9983M4344r496Q856L4397l2472
22362e5549n558M6078M4740M3726J4640k0965J6818N1431m6369p7095o3092J146
22350e0049J9572k1541L521l5336L9979L5940k5229m037K6214k5422o86P7071
22338C9997K5231n0921p5386j0122l4830k8020K0591j8267K3822M7690O0966J8772
22326A9523k2114m1586k6421J4431Q749j3105J261j2478n6913K460Q9063l2181
22314f9311n212O7170K8662m0847k7644j3762L278L7293k3739M831n3626Q182
22302h4725J4213l94n8899k4238K4758j9308O0933N9326J773k8341m6455J344
$$ y = [32892, 55492, 54234, 34218, 38329, 25775, 16196, 4531, -32888, -61912, -117186, -127031, -108943, -76110, -49376, -100465, -135197, -131124, -81195, -101178, -56834, -66330, -57474, -23077, -55549, -61107, -15029, 29711, 73437, 88077, 67112, 83930, 135361, 88992, 11897, -51195, -50049, -30477, -52018, -48497, -83833, -43854, -7914, -33143, -37180, -10966, -36388, -37074, 39997, 65228, 14307, -61079, -71201, -106031, -134051, -113460, -131727, -107905, -60215, 751, 19523, -2591, -44177, -70598, -56167, -47418, -60523, -59262, -71740, -128653, -126193, -37130, -69311, -74523, -7353, 21309, -19538, -47182, -60944, -57666, -20373, -44112, -39281, -92907, -84725, -70512, -70906, -129805, -154043, -129285, -148593, -87660, -28334, -26561, -54902, -101357, -100013]
22290a00013J2876P3450L5947q838o0175k0627L5936J3532m9079o7132l8223K7512
22278a44834K5633O0198M5172L7713q019n8719K1277M6095j2670r045K518j6730
22266a1411j3780k3083q8K7131K2354l0062l9527J0959L7544n115k4805Q52p463
22253e6494k5277M7320L3688l4619m401K2807k4258k108K5363l4532J9151O6385
22241C3025M6459M4947K409l5044k1570l047Q898l2999m5082o4289J5779J7956
22229c2558M119L9034j5226l8870j7256L9225M2327L7540L6890o1514k5384n5893
22217d7566q5565K5872N0499K6894J6805j4740r772l6791p1389M4461P9739L4404
22205A2851j5802j3654J1394l5229j8154M880n513m0260n4319L3222M8359N4454
$$ y = [-100013, -87137, -13687, 22260, 13422, -46753, -67380, -31444, -17912, -66991, -134123, -172346, -144834, -119201, -59003, -13831, 23882, 15863, -42856, -21579, 24516, 11846, 2801, 5319, -11411, -25191, -48274, -48362, -21231, 1123, -28939, -68466, -57507, -19963, -25078, -49883, -49031, -56494, -81771, -34451, -763, -35382, -39783, -16976, -41234, -43342, -17979, -52511, -33360, 33025, 79484, 124431, 126840, 91796, 70226, 67179, 76077, 43078, -2004, -66293, -50514, -32558, -28439, 10595, -4631, -43501, -60757, -21532, 20795, 58335, 95225, 33711, 8327, -47566, -133131, -107259, -56760, -29866, -13061, -27801, -37573, -74364, -145753, -101292, -21553, 12851, -2951, -16605, -5211, -40440, -58594, -53714, -59227, -99487, -153806, -120584, -72225, -17771]
22193a7771l1371l791k8488L0324K5666K4901j515k7714l9906k2510N369O932
22181g9874j5904L3255j0866k465N3908L7537n4911r576M0416r027K677k402J3842
22168c390M3219L4784l1125l5518k9389J595j4746J2693J8496L0317l8748l6503
22156d8315m3404K8925M8638k2686j8101L9525k7814l0970J0650k742j5197L4277
22144d7214P11O1989m1676j5220k4385k248M6982M1814K8014q075L2473l6012
22132C7153l7058j7798L1272L8821m745K248J430j6678p474n3742Q062L4037p3004
22119e7476J8025J04625O4477m8313l0713l1101n90M0378j5565r3721j1017k7941
22107h8932l136K6413L3271K3435l8727j2986j0107K8604J7015m033K5820J5153
$$ y = [-17771, -49142, -52933, -81421, -51097, -25431, -530, -2045, -29759, -69665, -92175, -86806, -79874, -95778, -62523, -73389, -75854, -21946, 15591, -39320, -48896, -8480, -17507, -14830, -17232, -3390, 39829, 74613, 43488, 7970, -21419, -19824, -34570, -21877, -3381, 26936, -11812, -48315, -91719, -62794, -14156, -36842, -54943, -15418, -43232, -74202, -63552, -66294, -81491, -47214, -46503, 15486, -26190, -41410, -65795, -68043, -21061, 20753, 48767, 40692, 73165, 37153, 95, -17703, 13569, 52390, 47645, 49893, 51323, 34645, 27171, -26571, -18509, 15528, -57476, -39451, 65174, 129651, 81338, 50625, 19524, 18934, 59312, 43747, -49974, -60991, -88932, -92068, -65655, -32384, -8949, -47676, -60662, -70769, -42165, -25150, -29183, -3363, 11790]
22095A1790n3542J7206L4210j6276k3955K981k512k8106J7506j465M0326l127
22083d964n8703k5139M8288J3161N036L7453L793j9632J5883k6609O491K0261
22071A5319k551q643L7665J3570K702m1295m5212j3830L5900J9294j3202M5804
22059D5521j0235k2001q253j5822k59O5265j7773o818k0302Q60k4899J8271L637
22046G192l7502K1725K7607k0382l0972L4275J598m694k1542l2919L338K3784
22034b8492Q850j3239J5009k2906j8884k5297m306o3412p401J06974O8616J2207
22022B7719m988j0987l2247o5840j1887p279M6300M2104r728p701l8071o0623
22010a33228L3098O476L9236L122j0753K0048J6369k169L297j1714k6731J6596
$$ y = [11790, -41752, -24546, 9664, -6612, -30567, -27586, -30098, -58204, -40698, -42163, -1837, -4964, -63667, -88806, -40518, -27357, -22321, 15132, 18925, -707, 15176, -11433, -4942, 15319, 12768, 4125, 41790, 55360, 58062, 16767, -28445, -42275, -6375, 12919, -283, 45521, 35286, 13285, 5032, -10790, -11049, 54216, 36443, 29625, 9323, 10183, -14716, 3555, 7192, -30310, -8585, 19022, -1360, -32332, 1943, 3541, -1153, -22695, -55614, -52276, -28492, -19642, -32881, -17872, -40778, -59662, -84959, -89265, -152677, -160078, -53104, 15512, 27719, 22731, 11744, -20503, -86343, -98230, -105509, -59209, -17105, -26833, -34534, -72605, -133228, -100130, -93654, -54418, -51296, -62049, -42001, -25632, -27801, -24504, -36218, -62949, -46353]
21998d6353M4595k7676K2392j6054K4223l2319q4676L1569N046J6785n459j2558
21986h0485J8260J8263o21M6462N4429m6959m8880k094N735M645N3287j0116m3675
21973c1749l0993N436J2160j2560N8998L1222l737L412k1471l9334o6002K0800
21961g3818O9750N982K652M556j9064n2742j8650K9369L0200P3330r257n4746
21949a2438k2986k3176m459K3356K0504L1593K5413l8646p769M1321O562R906
21937D9181K5302p617j6143k2628m9698l4895K997J9386p722p764j1542l4686
21925i5829l731J1415L2920L0086J429K4373k9546o281L5793O596l8700K52J5951
21912a5272L9615L7726l5569m7793l9330l2065j0403N5480O5106L055K0069j6290
$$ y = [-46353, -1758, -29434, -7042, -23096, 1127, -31192, -115868, -84299, -79253, -62468, -67927, -80485, -62225, -43962, -44583, 1879, 56308, 9349, -39531, -41625, -35890, -31245, 22042, 11926, -31749, -62742, -57306, -45146, -57706, 1292, 32514, 28777, 32189, 10718, -28616, -94618, -73818, -4068, 1914, 4566, 9122, -9942, -62684, -81334, -51965, -21765, 51565, 42308, -12438, -35424, -58600, -63059, -39703, -19199, 12394, 37807, -839, -8608, 32713, 39275, 49181, 74483, 66866, 50723, 28095, -21603, -56498, -53501, -34115, -41837, -49601, -61143, -95829, -99560, -88145, -55225, -25139, -23710, 663, -28883, -35164, 629, 7225, -31475, -31223, -15272, 24343, 62069, 26500, -21293, -60623, -92688, -103091, -47611, 17495, 20550, 40619, 24329]
21900B4329j4812p7400l791L8462m1851r865J8225j9098l8338J6856n796J5396
21888i7683L1969L2608L3637l4388k8370L0847l7677p916k42k490Q353L8847p268
21875c9773K781L863o388O5715p779Q615l4560m3861l369P508K0971j8269m0294
21862h4840M5388M6185k6169k2822K595P701J7771j2010J1035q897j5267l4174
21850g3504K6782n714O447L7022M5765q08O78n6474l5802L0555J2434m540m1499
21837e8658K6479j260m9174J2269P7224J2344n588o2283m7550L276m1369m286
21825a38576J4947L4572q213n980J6118J3980J3379R409J6092K4225K8544J8889
21813C7386j9088k073J878L8211p335l1731M1121K2427j8976p6209n4527N772
$$ y = [24329, 9517, -67883, -71674, -33212, -75063, -84928, -66703, -85801, -124139, -107283, -113079, -97683, -65714, -33106, 531, -33857, -62227, -31380, -69057, -76973, -77215, -79705, -71352, -32505, -39773, -36992, -33129, -39517, 26198, 18419, 27034, -7526, -51387, -54756, -47248, -26277, -44546, -84840, -39452, 6733, -19436, -42258, -39663, -31962, -14191, -26201, -15166, -24063, -39330, -73504, -46722, -52436, -45989, -8967, 36798, 35990, 36668, -19806, -55608, -25053, -12619, -17159, -58658, -32179, -33439, -82613, -70344, 6880, 19224, 13636, -48647, -96197, -92921, -134290, -138576, -123629, -89057, -97270, -103250, -87132, -73152, -59773, -50364, -34272, -10047, 18497, 37386, 18298, 16225, 18103, 56314, 48979, 17248, 58369, 80796, 61820, -14389, -68916, -63144]
21801f3144l6935j4425o30K5567J8343J5408o3500L5548O3010O4285k0152m0407
21789a7032j2369l2394L1507J3193Q991j6008m5674Q46j4513J0760M786M3215
21777b4692M0n550L651L6114j2285M49K2420O5797J3645N394q033k7600o1771
21764G579n5960L287m714k7530N625M0411M0210l5617m0593J0276K5728J3426
21752a7872O155k5136J8824L2879k9096n2345l490n569J5406l7705P761K1993
21740f8195N1520J2765k7531l2423j3473J8769M4469J568k4875j8630Q641L8154
21728i241N1958m634k7505k2366k8074k8524K7318M1812q30N554J8788l4412N7918
21715D7762K4664l3031j0346R305L944l7037O853N210L3824j9535J361p95l702
$$ y = [-63144, -100079, -114504, -115134, -89567, -71224, -55816, -119316, -83768, -20758, 43527, 23375, -17032, -29401, -61795, -30288, -17095, -8104, -24112, -69786, -68940, -83453, -72693, -67907, -24692, -24652, -30202, -26551, 9563, -2722, -2273, 20147, 85944, 99589, 104983, 96950, 69350, 7579, -48381, -45094, -49808, -77338, -71713, -31302, 8908, -26709, -67302, -57026, -31298, -17872, -11717, -36853, -18029, 14850, -14246, -66591, -70081, -75650, -60244, -97949, -90188, -68195, -16675, -3910, -31441, -63864, -77337, -58568, -14099, -12531, -37406, -56036, -47395, -9241, 42717, 38083, 10578, -11788, -39862, -68386, -41068, 744, -86, 5468, 24256, -10156, 47762, 72426, 39395, 29049, 38354, 42298, 5261, 12114, 17324, 51148, 31613, 32974, 32179, 28477]
21702B8477R25o7073n6339R272P1755Q12J3820L418P288j1526n1311L6972L5179
21689B1669o6834j5169J128O5074j2867Q176n131j4952K6480J9920j2133p966
21677G395j4885m9805q654P4505J4370j8700J2205K6954O5096N743l7543j653
21665G5028j8441l6018k3924K7862k2155O818P5214j6355k6184j2088j1316K2694
21653D1135m2334m6479M691O9544M9856L607l8552m8201l4573O462r663N364O249
21640c2894j9201P2366L2993m3689l0973J8606L9315j5994q376k6576n6965j9139
21628i0527k4422L0622O9842j0927m7023q469N9239k335L0422M2495o3527K5645
21616A1035j2720q65k1618l6227J4739N5199K5739l0862K432Q685J4644J9272
$$ y = [28477, 29402, -37671, -94010, -84738, -12983, -12171, 1649, 5067, 12355, 829, -50482, -13510, 21669, -45165, -60334, -59206, 5868, -6999, 1177, -3954, -18906, 7574, 27494, 15361, 7395, -7490, -57295, -65949, 8556, 22926, 4226, 16431, 43385, 108481, 114224, 76681, 75028, 56587, 20569, -3355, 24507, 2352, 9170, 84384, 68029, 41845, 29757, 18441, 41135, -1199, -47678, -42987, 26557, 76413, 80020, 41468, -6733, -41306, -34844, -44507, -39143, -32894, -52095, 20271, 53264, 9575, -21398, -2792, 36523, 20529, 12153, -14423, -71388, -90527, -114949, -84327, -14485, -25412, -72435, -80904, -21665, -24000, 6422, 48917, -14610, 11035, -1685, -2550, -24168, -60395, -45656, 9543, 35282, 4420, 6852, 15537, 30181, 49453]
21604D9453K1730m829n8130n2711K9930M2772l5487J4539J5156j9222q0273k5171
21592a02243Q2405K5538N429q100k0479K6264k3043K3792K8057m4401r238L6861
21580B0842j0332o248m5327L223j7110J2280R852P270K9664M1444j4484l0339
21568G35K466r717n156k1940j5751k0329O3255M2389K9772K0525p213L497J7921
21555A00454p1018k6056K0682j1447K8560J2038j2896n1462L6437R257m0537q1319
21543h7307n820M9221n4089l646K7194L6708L1418P20m0079K7414J441n433J6582
21530e676J0160J1247o340o609k1744J876Q425l5752j701K7724o153O44J5977
21517g922k5690j8881N491K6544J1597l2687J6963o88n3063K036J5927j5177k9547
$$ y = [49453, 71183, 66354, 8224, -44487, -14557, 28215, -7272, 7267, 22423, 3201, -77072, -102243, -19838, 5700, 11129, 3029, -17450, 8814, -14229, 9563, 37620, -6781, -16019, 20842, 10510, 4262, -41065, -37842, -54952, -42672, -32820, -25550, 4114, 45558, 31074, 735, 3201, -6516, -11672, -33612, -49363, -69692, -6437, 35952, 65724, 86249, 79036, 82533, 100454, 29436, 3380, 24062, 12615, 41175, 53213, 40317, -11145, 25292, 34549, -5988, -87307, -93127, -43906, -97995, -101641, -74447, -37739, -6321, -5601, -45680, -18266, -16825, -22258, -5676, 4484, 15731, 9391, 2782, -18962, -17086, -8661, -44413, -46114, -18390, -24543, -23899, -7922, -33612, -52493, -47002, -20458, -8861, -41548, -24585, -25273, -78336, -76300, -60373, -75550, -105097]
21504a05097J1387n2715L1508P0678J0401k1339K8417K8061m5642K4760J7603
21493a978J7546j3673n3974M7719p602l3350l470k7786l5485O9820O4511n4127
21481c1849j5057L4058P509j2672O4030J3884k9618M0654m0833l8815J1014j8359
21469a6054n0135K7527O4785K6914J5760j867k6797n4567j4968L7401k2569j1723
21457b6293K20K4251J8148m0323l6146K4999M3361M981n761j3627j7488J0248
21445a3430P783k1790r5501n9571K1486N4693K5909J4301J2586K845k2013j344
21433g4046L2005J7802j6613k6779j2315N3986M8086J687J4981M3881K7532o6817
21421D3390p8030R839K6158J5799O276l4269q724m0826K0604P1896j3075k4806
$$ y = [-105097, -93710, -146425, -114917, -44239, -33838, -55177, -26760, 1301, -44341, -19581, -1978, 15568, 1895, -52079, -4360, -11962, -45312, -48782, -76568, -112053, -42233, 22278, -31849, -46906, -12848, -5339, -18011, 46019, 59903, 30285, 70939, 30106, -8709, 2305, -16054, -66189, -38662, 26123, 53037, 68797, 66930, 40133, -14434, -29402, 7999, -14570, -26293, -26073, -1822, 16326, -23997, -60143, -35144, 8217, 13198, 7437, -6190, -23678, -13430, -5647, -27437, -122938, -182509, -161023, -106330, -80421, -66120, -53534, -50689, -72702, -74046, -42041, -24239, -40852, -67631, -79946, -25960, 22126, 23813, 38794, 82675, 110207, 43390, -34640, -24801, 1357, 17156, 23432, -10837, -19561, -60387, -39783, 32113, 19038, -5768]
21409e768j933O193m0458k7068o32K5825K1241L8516Q719L3767m555l5092J3076
21396C1831Q477q4260m0454M8955M4316J3668m5209L260N3845O9159N681J206
21384A10475k215l6501o6182k6575L1008J0347o688m6237K9021K2048k9834K844
21372h489N01k3179P3453R8727n0838n3880p2662m319N2174j1366j6679M4781
21360B8224Q9170K2808o2241l5411O2655L6102o5652n0206l3550j3265L3070j9966
21348h262j9382L0836l8807m2709J5692M7076p999J3261J1314J2201k0816J5203
21336G608o370l6759Q77m4820l7971j0157M9330K9142L0884N9150M7958P686m4331
21323E2227K14L3005L686q418k8338o2550j7196j4680M9652O4070o133m0624n42
$$ y = [-5768, -7701, -1508, -41966, -69034, -69666, -43841, -22600, 15916, 24635, 58402, 53847, 18755, 31831, 40308, -43952, -84406, -35451, 8865, 22533, -22676, -19416, 34429, 103588, 109269, 110475, 108260, 71759, 5577, -20998, 10010, 20357, 13669, -32568, -3547, 18501, -11333, -8489, -7988, -31167, 42286, 141013, 90175, 36295, -36367, -40686, 11488, 122, -16557, 28224, 117394, 140202, 77961, 42550, 105205, 141307, 75655, 25449, -8101, -21366, 11704, -8262, -27644, 3192, -35615, -78324, -62632, -15556, -23555, -10294, 1020, 13221, -7595, 7608, 1238, -35521, -34644, -79464, -117435, -127592, -78262, -49120, -18236, 40914, 88872, 96558, 52227, 52441, 85446, 89132, 80714, 52376, -10174, -27370, -42050, 7602, 71672, 65539, 24915, 24373]
21310B4373n2047k7570l6737K2175L5657J1743k1479l6052j1143M6925N367j4732
21298e3520o462N569L0653K4917K7136j0254j0180K7286J3260k8888j3445L8255
21286D4327N1870m9895q930J8490O134o4173o6364L1195L4794k7745L7154N3680
21274F0537r744j2564N081n7642k877O342k001M1596N7937K033j2420l5628n3473
21261a2823m3822L9274M2441K723k0650q737M9234k9152n4751K8311L435j105
21249e622Q605l7523O069j079J6666M1216j1652k9990m729R942j8130j3179N297
21236c4109n6640N778M0205O544N1063K4038K508J1591O334l9431n2496J5015
21224a9600J9967j4434J3319l614K3849j5163m676L6875L8936q284j4919o7320
$$ y = [24373, -27674, -55244, -91981, -69806, -34149, -22406, -43885, -79937, -91080, -44155, -38788, -53520, -59982, -54413, -23760, 1157, 28293, 18039, 7859, 35145, 48405, 19517, 6072, 44327, 96197, 46302, 37372, 55862, 61996, -2177, -68541, -37346, -2552, -30297, 6857, 60537, 50793, 38229, 43310, -14332, -17209, -10867, -12868, 28728, 86665, 88698, 76278, 40650, -12823, -56645, -17371, 25070, 27793, 7143, -1594, 47640, 18488, -36263, -7952, -4517, -5622, 2983, -34540, -28471, -29550, -12884, 28332, 16680, -13310, -18039, -8097, -26227, -39406, -34109, -90749, -84971, -44766, -38222, 12841, 36879, 39387, 50978, 57312, 17881, -34615, -19600, 367, -14067, -748, -4362, 19487, 4324, -352, 36523, 75459, 67175, 52256, -15064]
21212a5064J1199J9034m9280n180O6804R063N463j6046k6258l5511m1086K7668
21200d9194j628M6728l0518j9038O98Q250O898j0019J4337M2762j3130n1277p935
21187f3066j6094o344l355l1018N0110J1793J7437m233J2822j0104m000K1495
21175b4557q5461O226O2702j986k8384m2197N6622K4163N0538L9433q0932k9312
21163e3145L6766k7412r1787j4384l4310K3662Q8394L1802k1461M3275k6919p2643
21151a18162M9657J03078L1262n1922o7807l9327L0361L1289m2178k5824m344
21140a03917m3909J0644K2822N5546L4132k4021K7770J3290L8688l325K1611r891
21128C9440l3050Q107K4534o3321n4901M2233L7482l9993L2109J9924n2719q079
$$ y = [-15064, -3865, 15169, -34111, -39291, 27513, 36576, 42039, 25993, -265, -35776, -76862, -49194, -50822, -4094, -34612, -53650, -52952, -44702, -37804, -47823, -33486, 9276, -3854, -55131, -63066, -79160, -85504, -88859, -119877, -69767, -57974, -40537, -44770, -31948, -42052, -46052, -24557, -110018, -103792, -41090, -43076, -71460, -113657, -57035, -32872, 17666, 57099, -23833, -53145, -16379, -43791, -135578, -149962, -184272, -160610, -72216, -40414, -61875, -18600, -45519, -118162, -68505, 34573, 65835, 13913, -53894, -93221, -62860, -31571, -73749, -99573, -103917, -147826, -137182, -114360, -58814, -24682, -48703, -20933, -7643, 31045, 27720, 49331, 39440, 6390, 14497, 39031, -24290, -79191, -36958, 524, -39469, -7360, 12564, -40155, -48234]
21116d8234M4155N813j0373o351m0175j8638l437o408K2363P5297N1380J5914
21104H1306J5734l0375n9434k5327J2604k3911r873K4099O418K3159K3936j777
21092C6559m6224n3719m992J6629O7461k8693q512J5011p934j2756K6210J1617
21080A0657J3552J1968l7819l0135k5885J5954J5439J50M5595K5429J3070J0709
21068F8684l1330n3642m1652K5848J7392n2790J9413L1348J234N7793m2487k1484
21056b1673L0339K538R112n8581j7092M9518J0126J9474n4892o484P832l7881
21044f7664j9984M5979N4147K0495l1056k8637j69L5118j4254M5974P3392q295
21032A05046l9423n0642N189O269p1000m7117N381L7077L2144n8447l2514K3608
$$ y = [-48234, -4079, 1734, -8639, -14990, -55165, -73803, -77240, -83648, -61285, 14012, 65392, 81306, 97040, 66665, 7231, -18096, -5492, -29403, -39276, -15177, -8759, 14400, 38336, 36559, -9665, -63384, -68376, -51747, 15714, -12979, -21491, -6480, -14414, -27170, -960, 10657, 24209, 36177, -1642, -31777, -57662, -41708, -26269, -26119, 19476, 44905, 57975, 68684, 37354, -16288, -57940, -32092, -14700, -67490, -48077, -16729, -15495, 42298, -189, -21673, 8666, 11204, 20316, -38265, -55357, -5839, 4287, 23761, -31131, -37615, -29783, -67664, -87648, -41669, 12478, 32973, 1917, -26720, -26889, 8229, -6025, 39949, 113341, 105046, 65623, 14981, 20170, 26439, -44561, -91678, -86297, -49220, -17076, -75523, -108037, -84429]
21020h4429O0833J1469l3275L986O3259M0194J9773Q540l3252J246l1315k0640
21008F389J5320K4896k831j4885Q07n8521j2279O8616P642m0698j3330K0710j3077
20995a1241l170p778n4923J5263K6290P447j012m3212J4696j7478m9755j511L6267
20982i0117K3501J1794J238l4555l1262N3704M3016Q251M782K1919k5829k7549
20970d1107l4270p518m0936n924K9937K06K4870L3279p949M0671J5661L289K2407
20957C2616M3167K1396j3333k4057j7007j7072j4719o8898k3368j225j0257k076
20945i4833J3457K0257j177O999j411M1870j9754k0470j8756j0157M2264K8618
20933a3093K96l2521j3001L3322n39M2647j5781l6112M689J081K4636l1417p6643
$$ y = [-84429, -23596, -12127, -45402, -41416, 21843, 62037, 81810, 90350, 57098, 58344, 27029, 6389, 21709, 46605, 43774, 28889, 29696, -28825, -41104, 27512, 35154, -5544, -18874, 1836, -11241, -14411, -22189, -77112, -61849, -35559, -28112, -29124, -72336, -57640, -75118, -124873, -126384, -90117, -66616, -54822, -53584, -88139, -119401, -65697, -22681, -14430, -9648, 12271, -13558, -41107, -75377, -82895, -123831, -129755, -99818, -99612, -74742, -41463, -49412, -8741, 6920, 10209, 32616, 75783, 97179, 83846, 59789, 42782, 25710, 10991, -57907, -81275, -82500, -92757, -94833, -81376, -61119, -62296, -55297, -56708, -14838, -34592, -55062, -73818, -83975, -41711, -13093, -12797, -45318, -58319, -24997, -25536, 17111, 1330, -34782, -30093, -29012, -4376, -35793, -112436]
20920a12436M426J0460K1832L3318M557r199j2764k4067j7044l6554M939J8834
20908a13698M0821M3039Q713k0197J916n3049K08p025O0927k241q094q399k785
20895e9864J2422j9955j1032N3879J3304K8890L6248l1270k6834J0718K0605r413
20883A7698r870j0455K8766J5392m5025k5219M2373l1529N319J7962l9452l8557
20871g2597L5672K8440m5431j8046M2812K038o565J8818j252L6477J1179L503
20859C5048j1419k4736p895N0656j9467q317l9278L3065P286j3027n0389m3490
20847i1963j072P5448l6554J8312P660l3732P798j8264K2237L1773R941j0151
20835a8567o960j1845J5649N8706M966k2234m4979k2685k0942P370P0362k5502
$$ y = [-112436, -108010, -97550, -75718, -42400, -37843, -47042, -59806, -83873, -100917, -137471, -132532, -113698, -72877, -29838, -21125, -41322, -39406, -92455, -92247, -99272, -38345, -40586, -48680, -57079, -59864, -47442, -67397, -78429, -24550, -11246, 17644, 53892, 22622, -4212, 6506, 27111, 17698, 7828, -2627, 26139, 41531, -3494, -28713, 13660, -17869, -12550, 5412, -34040, -72597, -36925, -8485, -53916, -71962, -29150, -27112, -33677, -14859, -16111, 20366, 31545, 35048, 23629, -1107, -9002, 41654, 22187, 13870, -25408, 7657, 14943, 1916, -48473, -91963, -93035, -17587, -54141, -35829, -28169, -61901, -54103, -72367, -50130, -18357, -8416, -18567, -25527, -37372, -21723, 36983, 41949, 19715, -25264, -47949, -68891, -61521, 8841, -16661]
20823a6661J1820O27K789o7918K4297N4174l6680o9288N7631L8372l0238m2785
20811g3860R990M4432M3795K2555K984P645J508n2199q1619j4747l1747j5924
20799a37187O1501N479j1466l166j0006k7799j0550J7461K1611J9814K6137O8573
20787B0402l4006k8331M742k4549n1589j155M3926L1719O1937j0951p9835O352
20775f1338O2858m627j0198o049j8896m5056k2976l920j2333L2323M751O1106
20763b4355J2363N3457M3656k242K0522m7129m6855J3215l2479q770n9961J218
20751g7360M4533L7548L6285j7264M9919K169k0445p1121K98L7132m7050N5958
20739C0602R898k1186J0367l0330l8174N447r98j3816m3050J3653M4012K547M7169
$$ y = [-16661, -4841, -4214, -1425, -69343, -45046, 9128, -27552, -96840, -39209, -837, -31075, -73860, -63870, -19438, 24357, 46912, 49896, 57541, 59049, 6850, -74769, -89516, -121263, -137187, -75686, -70207, -81673, -84839, -94845, -122644, -133194, -115733, -94122, -74308, -48171, 20402, -13604, -41935, -37193, -61742, -113331, -114486, -70560, -38841, 23096, 12145, -67690, -61338, 1520, -3107, -13305, -19354, -38250, -83306, -106282, -110202, -122535, -90212, -85461, -24355, -11992, 41465, 85121, 82879, 103401, 56272, 9417, 22632, -9847, -18617, -78578, -77360, -32827, 4721, 41006, 23742, 73661, 75830, 55385, -15736, -15438, 21694, -25356, 30602, 40500, 19314, 29681, -649, -38823, -33376, -34374, -48190, -91240, -77587, -33575, -31028, 16141]
20726A6141L6393m6388q648L0808M1959L517n6480r1597k9259k755k414L8779
20714f9944J8667k2411m163M6065Q0634K6430o8460k7045N9301Q755l7933m1380
20702c1484j0204K0628L695n838l7194M4851j3757J2268L2149k3532j7583l3326
20690e9327K3489r447j6146l3705l340o648K5123R697r478J0195J2588K5578J1710
20677a9711j397j26k3994P068L4861J3748j9388J8304m3775J7216k6731K3987
20665a9938n501O216M1227L3848k4599k9101L7354k7846p3040J3034K5679k1736
20653d4403l5377O6920K8037j2897K1460l4222l3719r156l0392k16J9858K4437
20641c9670L2300k869q241R546j1693Q177K26j9172n4089O525K9420K59l058m803
$$ y = [16141, 52534, 6146, -2502, 28306, 70265, 73782, 17302, -74295, -103554, -106309, -108723, -69944, -51277, -73688, -77851, -31786, 48848, 75278, 6818, -20227, 39074, 47829, 9896, -31484, -41688, -21060, -17365, -23203, -60397, -15546, -29303, -17035, 15114, -8418, -26001, -59327, -35838, -45285, -61431, -95136, -98476, -105124, -80001, -70304, -79782, -69587, -56999, -31421, -19711, -21108, -21234, -45228, -38160, -3299, 10449, -8939, 9365, -34410, -17194, -43925, -19938, -25439, -19223, 22004, 55852, 31253, 2152, 39506, 11660, -61380, -48346, -22667, -44403, -79780, -12860, 15177, 2280, 23740, -10482, -44201, -53357, -83749, -83965, -64107, -39670, -7370, -10239, -18480, -8934, -20627, -12450, -12224, -31396, -85485, -78960, -49540, -49281, -52339, -57142]
20627e7142L4319K6798l2797k8239k2395M461J6912R264J1804O762j3438j1359
20615e5050r52n6433r307N6742K0355J7251j178L3755r832k3713J2601L071L0163
20602A7473j7274L5603M072l4743l2299j0051k1259K8361m791J189k9508K0195
20590d3032p544o968L992L2384M4392r812J7168J158J7200n2346m6739J7557L5289
20577B699O788j2972o009K0629K933m682J4948K4906j7386j4279l5507K0245j2970
20564a0657J5998L574K2421m010m9264p206N0500J995m0988p419n8577M9521Q484
20551b5628k297M9813M3538L5561j2209k3886n4041j4261J5918J2156j7303q45
20539F516o103J9839q963P0453O3872n0235l3173o1791n3852j7344L8531K1335
$$ y = [-57142, -22823, 3975, -28822, -57061, -79456, -74995, -58083, -48819, -37015, -30253, -43691, -55050, -56002, -112435, -121742, -65000, -44645, -27394, -28572, 5183, -4649, -28362, -15761, -12690, 17473, 199, 35802, 39874, 5131, -27168, -37219, -58478, -30117, -34908, -33719, -63227, -43032, -50576, -57544, -53552, -21168, 23224, 13412, 30580, 31738, 48938, -3408, -50147, -32590, 2699, 9487, -3485, -9494, 11135, 14068, 9386, 24334, 49240, 31854, 17575, -17932, 2313, -10657, 5341, 8915, 31336, 27326, -21938, -29144, 21356, 23351, -17637, -25056, -83633, -34112, -25628, -27925, 21888, 65426, 100987, 88778, 64892, 10851, -3410, 12508, 24664, 7361, 6516, 413, 20252, 11289, 81742, 145614, 95379, 62206, 415, -53437, -70781, -32250, -10915]
20527a0915K8781k570L5857J645m3378k1133R321N2631K1430o0045j893j2897
20515c166L6954R876P475Q029M444J5274k4982l1847j4328k0213J0131k7233J2125
20502a7461q518n6755J76P439k0674K3467k2016J8103L376M0384J859q409N2887
20489A3858R3910K7927j04139q1694Q3999L0574j7824l8842P171l0305K1709N361
20477A1705l3127l2518J0546L1847J7114N6862l8503j9039k6534n763P536l3830
20465e3704j8641J6424J6168J8139J8467k4138K2052M3671k3696n9332J4675M3548
20453A3633M8950J1715j6154j0371O861j6498q769N3690k3633m4241J7826k4336
20441H673j8625R663M0432O173n1554l3997K2370J9218l0921J2983O8373K5742
$$ y = [-10915, 17866, 15296, 51153, 52798, 9420, -11713, -2392, 50239, 71669, 11624, 9731, -3166, 33788, 43664, 51139, 59168, 63612, 78886, 53904, 22057, 7729, -12484, -2353, -29586, -17461, -25979, -82734, -82558, -75119, -95793, -72326, -94342, -76239, -72863, -32479, -30620, -39029, 13858, 107768, 135695, 31556, -50138, 33861, 64435, 46611, 7769, 14940, -15365, 6344, 11705, -21422, -53940, -43394, -11547, 5567, 62429, 23926, 4887, -21647, -27410, -19874, -53704, -72345, -55921, -39753, -21614, -3147, -27285, -5233, 38438, 14742, -44590, -29915, 13633, 62583, 74298, 58144, 47773, 54634, 38136, 29367, 83057, 59424, 15183, 33009, 8673, -9952, -289, 40143, 46316, -5238, -39235, -16865, 2353, -28568, -15585, 52788, 78530]
20429G8530j2382m2361L1702L9414m0712m7062k9183k7470L6825J61o899L5242
20417A5805p876k693J6571j1741J6093P999l4589k1120k0735J1241k3114j3202
20405f7361M378k1369l0965O232O7480J7990K6848M3605L3832K4365j2422l6033
20393E6580o5146n3400J8242k3926m195Q68N217M6261O8056K8946q613l6564l4837
20380b511j723R59k0800j9363k485R2552k2260n8174k7462L9737L976K8789K1556
20367C2791p336o370J0283M9578k4160n5701P382O0768Q12o2475k5646k7031L4204
20354a2901k3484n452R853j1927n3633l52L6369m218o717K5351J2274J4275j2118
20341c2680n5624k930J1704k775L9507N2999l4319m3695N8908O1775P970K6892
$$ y = [78530, 66148, 23787, 55489, 94903, 54191, 7129, -22054, -49524, -12699, -12538, -19437, 15805, 7929, 5236, 21807, 10066, 26159, 34158, -431, -21551, -42286, -31045, -54159, -67361, -62983, -84352, -115317, -109085, -41605, -23615, 3233, 46838, 80670, 105035, 92613, 56580, -8566, -61966, -43724, -67650, -71845, -70977, -65760, -19499, 48557, 77503, 68890, 32326, -2511, -4234, -3275, -24075, -43438, -45923, 46629, 24369, -33805, -61267, -21530, -17554, 11235, 32791, 25455, 19085, 29368, 78946, 54786, -915, 6467, 67235, 68047, 5572, -20074, -47105, -12901, -36385, -41837, -31984, -43911, -97544, -97896, -61527, -65745, -72462, -47111, -34837, -20562, -32680, -88304, -91234, -79530, -82305, -42798, 10201, -24118, -67813, -8905, 52870, 60840, 87732]
20329H7732o2187l2755l1061m2776j5029J1516N043L5570r339P758K7061K1777
20317C310l6737M904J9633J33l3715m9032r365R5989L546L3505Q366o996l2156
20304A385m6432o168M5946q051L1697k8585J2147M6467K4268J0269r74R327n6994
20291C4302k1006Q379K3342k488k2844J5456J9716m184K724k5356j0427L9729
20279E7343J5401k3566p328K8717M1133J8886k9025j1344J1522p10q1589k207
20267A7233J6369m4535M129k3916O988l1117l1636R811R044k0963j371l497J3313
20254h0148m2602m4170M1831O3695O9406J164m020j6171n1620j7402M6258p403
20242d1182P419j4039K781M7803R540k8415k703R855J6860m1618o551M785k9995
$$ y = [87732, 25545, -7210, -38271, -81047, -96076, -84560, -79517, -43947, -53286, -45528, -18467, 3310, -33427, -28523, -8890, -8757, -42472, -91504, -100869, -4880, -1334, 32171, 40537, 33541, 1385, -45047, -51215, -5269, -13320, 18377, -10208, 1939, 48406, 72674, 82943, 81969, 91296, 34302, 13296, 21675, 45017, 42529, 19685, 35141, 54857, 50673, 53397, 28041, 17614, 57343, 72744, 49178, 41850, 70567, 111700, 130586, 101561, 90217, 101739, 101029, 19440, 17233, 33602, -10933, -6804, -30720, -23732, -54849, -86485, -76674, -67630, -88593, -89964, -93461, -80148, -122750, -166920, -125089, -61394, 8012, 9176, 5156, -11015, -62635, -80037, -33779, -41182, -33763, -47802, -45021, 2782, 12322, -16093, -18796, -8941, 7919, -33699, -40250, -35465, -65460]
20229f5460M2236M5933J9111J6396m1241j5692j1300O2519O5537k7448k8203p2275
20217i887p5114K4163m1993k7301j0085M4259P949M2916M5668j5426K7149J182
20205A3480j9668m3700J3010L3064j6030L1704J5441K0928j7194l0301l0098k3860
20193e3224j3669L093j764R592O559K4013K2842j4433n548k5889K1214N7844L8377
20180F9007k656j9773k7714L102l3837j8457P014j886k9604q436K7236K4716J6446
20167E158K2982J5323J9701j7657m0722M077k0435m1978J1199K0935J481L7876
20155A7940J8865K9631J8429l9225k2338l8883j165j6565M6136N2126p082K0392
20143G8261p800k7719k2177r744k1611L7665L9131j6710k3707o3830L7894J1890
$$ y = [-65460, -23224, 22709, 41820, 58216, 16975, 1283, -10017, 52502, 118039, 90591, 62388, -9887, -85001, -60838, -102831, -130132, -140217, -95958, -88009, -45093, 575, -14851, 12298, 13480, -6188, -49888, -36878, -3814, -19844, 11860, 27301, 48229, 31035, 734, -29364, -53224, -66893, -63800, -65564, -55972, -49413, -25400, -2558, -16991, -22539, -48428, -27214, 30630, 69007, 66351, 46578, 18864, 21966, -11871, -30328, -23314, -25200, -54804, -63240, -36004, -11288, 5158, 28140, 43463, 63164, 45507, 4785, 8862, -11573, -53551, -42352, -21417, -19936, 17940, 36805, 66436, 84865, 45640, 23302, -15581, -16746, -33311, 12825, 64951, 57869, 78261, 70461, 42742, 20565, 10821, -10790, 26875, 66006, 49296, 25589, -38241, -347, 11543]
20131A1543n4756l2687k0103l3485k064j8685N7597L6568k4721k9247R18L9972
20119f9150O1250K0712J3018Q933j6674M6121M5329N10j4961k8592o6360m7923
20107d7787p998j8676J6345J8162K5186L0094j1802J1616L2193J2511J1178n1487
20095A9535j3353l6131k6217O5645q556m424m042l9488K6696M9132N1726j5109
20083F5414l7910o4192o637R1579L3058k4769l7815l5885N4659l8350n9171K2218
20071c7801J1652J2425K1456O6801j8043K066O8309M149j6857O964m8670r0378
20059a7927l9385N0013K1445L5180j7949l1538K9551R2l3531J303J2749j1625
20047a622K6658j7948N3603j6227R173L8099J5174l4217n3578K555k0544M0744
$$ y = [11543, -43213, -75900, -96003, -129488, -131552, -150237, -92640, -56072, -80793, -110040, -109122, -69150, -7900, 12812, 25830, 34763, 18089, 64210, 109539, 110049, 95088, 66496, 136, -47787, -55785, -74461, -58116, -39954, -14768, 15326, 3524, 15140, 47333, 59844, 71022, 19535, 6182, -29949, -56166, 9479, 923, -3501, -7543, -47031, -20335, 28797, 80523, 65414, 27504, -36688, -43325, 48254, 81312, 56543, 18728, -17157, 37502, -848, -60019, -37801, -26149, -13724, 7732, 74533, 56490, 58556, 126865, 131014, 114157, 121121, 72451, -17927, -57312, -7299, 14146, 49326, 31377, -161, 29390, 29482, -4049, -2746, 10003, -1622, 25036, 7088, 60691, 44464, 53637, 91736, 106910, 72693, 19115, 21670, 1126, 41870]
20035D1870M0401k2185j547n4079m6662N2169P982P859O774p8490k8686L37m872
20022g9129q178l1508N3204L9748n395o9208N0905J11753N5091m658j270q1286
20010C0069l1696K8753K05p7799K310J178O6663M6894K146J0959J3086j5358m564
19997G2846P677P853k2753J1964K060m4489k9545o0773R318N5244J7914p787K0885
19984D0414m901k5528J8756k8568o1193k6909M6346Q804R57l1079J7495K7157
19972a8249l5899o1852k6830K1462K9848r517L9538K5479O0601l2714N441J3464
19960A0772R589J9109J9226j4129n9608k1124j5764r595q176K9154J2764N2878
19948B5096O8457M9506K2454k6632m6442J6772L5450n0482m9558J9253K5525j2014
$$ y = [41870, 82271, 60086, 58539, 4460, -42202, 9967, 17949, 25808, 32582, -45908, -74594, -74257, -79129, -87307, -118815, -65611, -25863, -31258, -100466, -49561, 62192, 117283, 112625, 111355, 30069, -1627, 27126, 27331, -50468, -48158, -46980, 19683, 66577, 68723, 79682, 92768, 77410, 72846, 80523, 88376, 65623, 77587, 79647, 35158, 5613, -55160, -45842, 9402, 27316, 19529, 40414, 35513, 9985, 28741, 173, -61020, -87929, -41583, -32779, -31822, -62901, -45406, -18249, -54148, -116000, -142830, -121368, -91520, -101037, -61499, -36020, 24581, -8133, -2692, 10772, 20361, 39470, 58696, 44567, -15041, -36165, -51929, -61524, -69700, -40546, -27782, 25096, 93553, 143059, 165513, 138881, 92439, 109211, 144661, 94179, 44621, 63874, 89399, 77385]
19936G7385p941K9201K3142M34m8402p5458k0869K2143l3742m8462M949K3192
19924e4428L3398J6078K3726J8324l763N3344L9744l7308n7954j7619P594k7418
19912f282k31J0736K8184L9886m2866P592j591J9938L2226m0113m9388M1628K284
19899D2003j1912o026k389l045l9975l0752l7865j0220N1008L0733M6458n1297
19887b3279p3628L719P2742R488J758J4805j7762j5750o6847P1346N9505o2094
19875b5997j9700L7966l2564K9462N1459l7206K086L0280K5752j303l4979k6274
19863a018m1980k1171L7870N8522J1662m6329q540j4276L1669J6920k1988O955
19851H296J054M3751L274l4713l1140L7053L3943M9488k3181k348m1407N369J778
$$ y = [77385, 69444, 98645, 121787, 122221, 73819, -1639, -22508, -365, -34107, -82569, -77620, -54428, -21030, -4952, 18774, 37098, 33335, 86679, 126423, 89115, 31161, 13542, 21136, -6282, -6513, 4223, 32407, 72293, 29427, 37019, 35428, 55366, 87592, 47479, -1909, 39719, 42003, 30091, 24065, 21676, 18631, -21344, -52096, -89961, -100181, -49173, -18440, 28018, -23279, -96907, -93188, -20446, -10958, -9200, 5605, -12157, -27907, -94754, -23408, 36097, -25997, -45697, -7731, -40295, -10833, 40626, 3420, 5506, 35786, 61538, 60235, 25256, -1018, -42998, -64169, -26299, 32223, 43885, -2444, -10984, -25260, 6409, 23329, 1341, 8296, 9350, 53101, 56375, 21662, -9478, 27575, 61518, 111006, 87825, 85477, 44070, 49439, 51217]
19838E1217k7914l916K8513O06k3541m932o612p168k853K9982K7820k6818m2673
19825h289p939q933r199m9795J7883M9714K0433q945R080J0783k0681M4673M8796
19812H7581j2816Q788K344m7679l6246l2180N0875Q5180J2362j6319l5514K0247
19800H6623k0800k7111K1181k3918q5835m3053O4014K5815k8507J1262P0779J8571
19788F9021k184P1105K9690o1019m7767J7792k79J8551j6442p5691j9722O784
19776a0161L6001J8519m684M9658K5775k6091l6477j1267N1962J1872k8682k3460
19764E2965j3560L46O1176J0103j4567l3562m1412j2857J699k3439m4868O821
19752e1155K5894M5322N5462k2318k4035J0659k4633k7022M3115K5028k4745K255
$$ y = [51217, 23303, 19387, 47900, 48506, 24965, 20033, 13421, 6253, 3400, 33382, 61202, 34384, -8289, -16228, -25161, -34360, -84155, -66272, -16558, 3875, -5070, 4010, 14793, -5888, 38785, 87581, 74765, 83553, 85897, 38218, 1972, -30208, 20667, 105847, 118209, 101890, 66376, 86623, 65823, 38712, 59893, 35975, -49860, -92913, -28899, -3084, -31591, -20329, 50450, 69021, 66837, 137942, 167632, 106613, 58846, 76638, 76359, 94910, 78468, 2777, -16945, -10161, 25840, 44359, 39675, 89333, 115108, 89017, 52540, 41273, 93235, 105107, 76425, 52965, 39405, 39751, 100927, 111030, 96463, 62901, 21489, 8632, 10331, -13108, -57976, -51155, -25261, 20061, 75523, 53205, 29170, 39829, 15196, -11826, 31289, 56317, 31572, 33827]
19740C3827L411n0192p012j1504P581L1107L9034K9597R450k5753l1568j9704
19728H274J4643q831l0692O177N3697M4433j8110l9790K1111M0837q246j6228
19716F7275j7445m4638N3584N6808j573k4522j4372N159k9472m8416K635j7936
19704a2913J0273J7292K404j7089M3576j5441l1834j7456j5638k1650M7698p722
19692a8500O2494J6810m673M2695k520l5328l5376M689J6461L128r884Q989j8560
19679C0425j3573k0301m3538K7934r140n0930J5620j4023M5842P4250J4221K634
19667E9421n378k1593k003j8329o5659J8672r036o034M5120J5833K0262l1822
19655e46J5708J6247p249J35K0359P919J6100l1607l0427J7850j0441o1789l4591
$$ y = [33827, 37238, -12954, -19966, -31470, -23889, 7218, 46252, 75849, 85299, 59546, 27978, 8274, 22917, 14086, -16606, -10429, 43268, 87701, 69591, 29801, 50912, 91749, 83503, 67275, 49830, 5192, 58776, 115584, 114011, 89489, 75117, 80276, 50804, 2388, 5023, -12913, -2640, 14652, 17056, -33, 43543, 28102, -3732, -21188, -36826, -58476, -10778, -18500, 43994, 60804, 56131, 98826, 96306, 60978, 25602, 30291, 46752, 49880, 39996, 48985, 30425, 16852, -3449, -46987, -19053, -28193, -79123, -63503, -77526, -31684, 42566, 56787, 59421, 54043, 32450, 30447, 12118, -53541, -34869, -43905, -49939, -4819, 11014, 31276, -546, 15162, 31409, 24160, 24295, 44654, 52573, 68673, 37066, 6639, 24489, 14048, -47741, -82332]
19642h2332J966M4140Q8703M5250J1282k8354j6087p281j0791n8909k6846O9437
19630C0178j8488j1276O218q841j243L3597L0943J5570M684k1343L921K4827j710
19617H7037j8693r4533N895L2483L9153K621k620N4041j0965j0251l7045k1869
19605B5254j3024L4516O2795j2205l2410o3246j9537Q6268j4964k990N011k3804
19593C1664R927l006n9181O7880K5027o8284k9398R994l2730l5291N1831K4001
19581g566N9001M0301m1431l5884n5082k9172N9620N4058L1916L869R552r934
19569G9248K7935l9417o3667k4164J5013J0946m8546J750M3222N4306j136J3449
19557F8939L392j3146Q652k0493o299K0386J5232m7107l4997J5517L1778N6453
$$ y = [-82332, -80366, -36226, 52477, 97727, 109009, 80655, 64568, 57287, 46496, -12413, -39259, 30178, 11690, 414, 6632, -2209, -3452, 30145, 61088, 76658, 81342, 59999, 63920, 88747, 87037, 68344, -26189, -20294, 12189, 51342, 53963, 51343, 105384, 94419, 84168, 47123, 25254, 12230, 46746, 109541, 97336, 64926, 1680, -17857, 68411, 53447, 50457, 55468, 31664, 41591, 38585, -20596, 47284, 72311, 4027, -25371, -15377, -48107, -83398, -31567, -7566, 51435, 91736, 50305, 14421, -40661, -69833, -10213, 43845, 75761, 79630, 89182, 79248, 107183, 67766, 4099, -20065, -5052, 5894, -42652, -40902, 2320, 56626, 55490, 68939, 72331, 59185, 67837, 47344, 41045, 61431, 76663, 29556, -5441, 10076, 41854, 98307]
19545I8307R501k7065m8595M109L1640k7578m0410J9084L4219q898K551K1902
19533F8767l2132J8305Q0879o809m2018k5163l1329k7203Q7242K9053l4470j2681
19521G2441k6088J1950L8504K9096n5107j12721K1427L7856J0858Q176L4313J5971
19509H6676O54m2825L992L8409N834l7044r578O7969J5210n1162l5947N0467l9
19496I2616J7767R921J0033L7944k3259p4474l0801m2324n2854M7501J6425l664
19484D831M0009L4781k7831O8953L3189o717j2639l8018l4559o288M6830R683
19472A12224j5518n100N314N6191K1102J715O2687M8987O2904Q6846J18917J09261
19460F65530J41231J46539L5874Q7919K36291K27925J62084J00388m930j7164
$$ y = [98307, 107808, 80743, 32148, 36257, 67897, 40319, -91, 18993, 53212, 44314, 46865, 68767, 36635, 54940, 135819, 129010, 86992, 61829, 30500, 3297, 90539, 119592, 85122, 72441, 46353, 58303, 96807, 125903, 70796, -41925, -20498, 17358, 28216, 36392, 70705, 86676, 87330, 44505, 48497, 86906, 92740, 55696, 46118, 114087, 129297, 78135, 42188, 92655, 92616, 110383, 120304, 130337, 168281, 145022, 70548, 39747, -2577, -55431, -7930, 8495, 4831, 44840, 79621, 51790, 120743, 153932, 147215, 134576, 96558, 61999, 55711, 102541, 112224, 96706, 91606, 96920, 153111, 174213, 175928, 238615, 287602, 350506, 437352, 556269, 665530, 806761, 953300, 989174, 1077093, 1313384, 1541309, 1703393, 1803781, 1798851, 1781687]
19450A781687J9160R4534J39430Q3764j6990j11728j32386L558N6180R5333P9531
19439B092073J07579N286q8844j58759j22656l6621P3558Q4441r6544k14603k32630
19428A412280j63771j00908p0366j77400j65821j24760p7693p8128j12663j04228
19418B36542l8350m5680R371J1966j2399m1246m240M3039J3741J1651j7658m7069
19406A19668L6846P5697n9412l3131r183J2650n4757l0994M1974K0268l2678n5771
19394C1177k2116K3761K5947k1333k4518N7793L6038m3936j3726K8687J7429N4263
19382A49466k1363p3298j5852J9637J0119k4644m4700q303L7218M4208M948j7004
19370F0432j1389j0518L9827k128j7888K4760p3978m195M3284n5596K6246Q4088
$$ y = [1781687, 1800847, 1895381, 2034811, 2118575, 2101585, 1989857, 1857471, 1861029, 1917209, 2012542, 2092073, 2199652, 2204938, 2116094, 1957335, 1834679, 1798058, 1871616, 1956057, 1859513, 1644910, 1412280, 1248509, 1147601, 1077235, 899835, 734014, 609254, 531561, 453433, 340770, 236542, 198192, 152512, 161883, 173849, 161450, 120204, 115964, 159003, 172744, 184395, 166737, 119668, 156514, 232211, 172799, 139668, 130485, 143135, 88378, 57384, 99358, 119626, 86948, 31177, 9061, 32822, 58769, 37436, 12918, 70711, 106749, 62813, 49087, 77774, 95203, 149466, 128103, 54805, 38953, 58590, 68709, 44065, -635, -8938, 28280, 72488, 77436, 60432, 49043, 38525, 78352, 76224, 58336, 83096, 9118, 4923, 48207, -7389, 18857, 102945]
19358A02945J6608m891J2240O0528k5990n3927j8163m1984N824J0698N8434j0712
19346A11610n917k1492j4342L809J7678K142j8737K9309k339p9075l3601J7809
19334F854P7616P141j8210K6097P322k2546J1414k2542k0624M2017N3193O030
19322A53762n8365k8590j7760Q95M0046l0168M25K1613O465K3130p7251J910K8234
19309F4346N4830k9304o7909M1118L5043K9977n6705k1504M7678J5833m1392l6668
19297C5343j8581R371K7420P015M262L5505K5709o625n3757k3852L7326J4084
19285I3220N228J2237M0482Q261l477m2950m8020k3478K654L2560K0268N398O3019
19272A65402k1703r953J4610j4866l7030l9850j3894N3728J6186L3240o253J9492
$$ y = [102945, 119553, 114662, 126902, 187430, 161440, 107513, 89350, 47366, 53190, 63888, 122322, 111610, 105693, 84201, 69859, 73668, 91346, 93488, 74751, 104060, 101721, 22646, -10955, 6854, 84470, 91611, 73401, 99498, 106820, 84274, 95688, 73146, 52522, 94539, 147732, 153762, 95397, 66807, 49047, 49942, 89988, 59820, 60245, 81858, 88323, 111453, 34202, 36112, 64346, 119176, 89872, 21963, 63081, 98124, 128101, 71396, 49892, 97570, 113403, 72011, 35343, 16762, 26133, 53553, 60568, 64830, 100335, 126044, 119419, 65662, 41810, 79136, 93220, 98448, 110685, 151167, 159428, 155951, 113001, 64981, 41503, 44157, 76717, 96985, 102383, 165402, 143699, 133746, 148356, 133490, 96460, 56610, 42716, 96444, 112630, 145870, 139617, 159109]
19260A59109m8867k9438J8510K6926R952J8277J4521o1832n407P448l5147J7892
19248I1944L7046J4299J061L7512J1086r695j614L957L2436J5979K1633N999m7822
19235B13821j5974j4769o1926k716j0135k2864J763k075j1279l3073j4231K8948
19223E5490O1710P5558m8873k6247K917R359n6462j5218K8602K9655M0996j8026
19211A39461m5853k2312j9315k7144J3235N8652l0945j1953M5656K1979K5372
19200A46833k2224k6968J0678P82N1081K9349L4887j0229j01108r4219L3342N3139
19188A05343M8881j0760P413k180j730j2453L513J5772O473K1496K6116Q5274
19176B93158L8025n6106o8954m4085k7307j3595j9604n159l656M3601J0508J7628
$$ y = [159109, 110242, 80804, 99314, 126240, 136192, 154469, 168990, 107158, 101751, 109199, 74052, 91944, 128990, 143289, 144350, 181862, 192948, 183253, 181639, 185596, 218032, 234011, 255644, 261643, 213821, 197847, 183078, 121152, 118436, 108301, 85437, 87200, 85125, 73846, 40773, 26542, 55490, 117200, 192758, 143885, 117638, 120555, 129914, 73452, 58234, 86836, 116491, 157487, 139461, 93608, 71296, 51981, 24837, 38072, 96724, 65779, 53826, 99482, 121461, 146833, 124609, 97641, 108319, 109101, 160182, 189531, 224418, 214189, 113081, 18862, 52204, 105343, 154224, 143464, 150877, 148697, 146967, 134514, 138027, 153799, 160272, 181768, 207884, 293158, 331183, 275077, 206123, 162038, 134731, 121136, 101532, 96373, 92717, 136318, 146826, 164454]
19164A64454J494m3455j0235l939L3459L1133j9926j1015J1468L2893k5125L0973
19152A92179l3616L266M1815m819j5064J9554Q582K2852L956l9279k4146K2580
19140A97860m1703j2387n900m998l8616j91J0114O764L5558K5769j7155J5053
19128A70168N8824J3569j9465n3303J0031J2159j5626Q012N2828O0694L1143j5601
19116C13433L207L1822K3257O129J849L603k6401P2097O5060N0483L7274l4169
19104E47644l3342n938J5675N4584m176m3967k6915K718m7911O467J6024P04J2348
19091D93915Q6879M4402n4339o9770k5580j7854J1191M3528n8731k3621K0425
19080D50445k5159k4508l0389j3466j00275m8340L5790J7634N4908k4934o8207
$$ y = [164454, 165948, 122493, 112258, 108319, 141778, 172911, 152985, 141970, 153438, 186331, 161206, 192179, 158563, 161829, 203644, 198825, 183761, 203315, 211897, 234749, 238705, 199426, 175280, 197860, 156157, 143770, 137870, 132872, 94256, 94065, 104179, 110943, 146501, 172270, 155115, 170168, 228992, 242561, 223096, 169793, 179824, 191983, 176357, 184369, 237197, 297891, 329034, 313433, 316640, 348462, 371719, 377848, 379697, 383300, 356899, 428996, 494056, 544539, 581813, 547644, 514302, 508364, 524039, 578623, 574447, 530480, 503565, 506283, 458372, 464839, 480863, 481567, 493915, 580794, 625196, 570857, 501087, 475507, 457653, 468844, 512372, 453641, 430020, 450445, 425286, 400778, 370389, 356923, 256648, 208308, 244098, 261732, 316640, 291706, 223499]
19069B23499J5764k0626J556K4242q615K324L3455K5508m8433o931N13l3529m9540
19056A59187M0502J1052m7274O1889L5646k8622r1846j8254K484M6687L3923M791
19044B10165K4370N0261j9665l1425N0799K0196K1213L9661N6363n6493k7915
19033C37530K058m075r759L2625J1415n6195J185M1330K3535l0524k1973K2081
19021C49233O8614M1324L5728n5243l4204j4508j1602j2070P5308O3153K484r317
19009D98900o8182l3563p2924J6878O0710J0982K0975l1467J0738J8870K9989
18998D61906K0057l413K5114j3948p8930R85K3529K5305L3523L1571j3961N2347
18986E64085J9866L2713j3741m452k4805k6141N878M1963l2652K9351N1511L8106
$$ y = [223499, 239263, 218637, 220193, 244435, 235820, 238144, 271599, 297107, 248674, 241743, 242256, 208727, 159187, 199689, 210741, 163467, 225356, 261002, 232380, 140534, 122280, 124764, 171451, 205374, 210165, 234535, 284796, 265131, 233706, 284505, 304701, 325914, 365575, 421938, 365445, 337530, 339588, 335513, 325754, 358379, 369794, 313599, 314784, 356114, 379649, 349125, 327152, 349233, 417847, 459171, 494899, 439656, 405452, 390944, 379342, 367272, 442580, 505733, 508217, 498900, 430718, 397155, 324231, 341109, 401819, 412801, 433776, 402309, 413047, 431917, 461906, 481963, 478550, 503664, 489716, 410786, 411771, 435300, 460605, 494128, 525699, 511738, 564085, 583951, 616664, 602923, 598471, 573666, 547525, 553403, 595366, 562714, 592065, 643576, 681682]
18974F81682M1479l3360j1831M2825L7404J8695j2502j691o4281r9727j9025N8867
18962F38535J13518N3280k1647j6508l1301k3453Q272n383J3855L5265L7704j0456
18950G91681p558n3649M494L9450L8862K1161L5392r011K2005K7840R171p336
18938I12502N4518K1040J9976j277m6992l280J9661J6846j0679L4136J1854J5245
18926A043550M9466K4476N7127L1087J2537M2945N0993N8131O6214N3359N5908
18915A545793Q6732M8347L4779N7827P1104P0567J3302O615J25579J03702P7809
18904B242156Q7840J6828L9547M8171R6830J37547J58519J45912J64294J39385
18894C277029J64728J93312K60917L01238L08839L92787M85291M62864M69308
$$ y = [681682, 723161, 689801, 677970, 720795, 758199, 776894, 764392, 762701, 698420, 598693, 579668, 638535, 752053, 805333, 783686, 767178, 735877, 712424, 720696, 715313, 729168, 764433, 802137, 791681, 784123, 730474, 734968, 774418, 813280, 834441, 869833, 860822, 882827, 910667, 919838, 912502, 967020, 988060, 1008036, 1006759, 959767, 956487, 976148, 992994, 982315, 1016451, 1028305, 1043550, 1093016, 1117492, 1174619, 1205706, 1218243, 1261188, 1312181, 1370312, 1436526, 1489885, 1545793, 1632525, 1680872, 1715651, 1773478, 1844582, 1915149, 1928451, 1935066, 2060645, 2164347, 2242156, 2329996, 2346824, 2386371, 2434542, 2531372, 2668919, 2827438, 2973350, 3137644, 3277029, 3441757, 3635069, 3895986, 4197224, 4506063, 4898850, 5384141, 5847005, 6316313]
18885F316313N02623N27551O67090Q13365Q62155O77630N04263N64026P37706
18876A2172722J063150J194728J302063J390643J475286J843371K309792K953693
18868B5705448M129741N712131Q282703J1889279J6995560K2901206K5906928
18861A21522996K2350667J5896300J4358708K2793511M0243153N4730467M4885346
18854C36781148J2698511j4740813j8797991K022560L0333525M0977153K1320365
18847D10594458p634975k5504554k5642625j3072588K454128J6116570K7132594
18840C84443008K8464431P467165k1877285l7449245k8651386j761259K1744863
18833C52380292J7407643j4236064m4516301n4055005m1637001k2826813j2604838
$$ y = [6316313, 6818936, 7346487, 8013577, 8826942, 9689097, 10366727, 10870990, 11435016, 12172722, 13235872, 14430600, 15732663, 17123306, 18598592, 20441963, 22751755, 25705448, 29835189, 35547320, 43830023, 55719302, 72714862, 95616068, 121522996, 143873663, 159769963, 174128671, 196922182, 237165335, 291895802, 336781148, 349479659, 334738846, 315940855, 317963415, 348296940, 389274093, 410594458, 402959483, 377454929, 351812304, 338739716, 341193844, 357310414, 384443008, 412907439, 420374604, 398497319, 361048074, 332396688, 330635429, 352380292, 369787935, 355551871, 311035570, 256980565, 215343564, 192516751, 179911913]
18826A79911913j5018345k2776459k7346741k5325090j9239660j3480126r445803
18819D7279689o995695n426942m190365l251070k524301k023957j865939j729119
18811A9272301j599163j334916j114223r23676r20719j003029q81493q17507p79847
18802I897728p16766p70900p83306o11292n04336m80899n21158m23259l50923
18793D734889l55937k87884k02258k30652j58662j18772j71496j78145q3462j34175
18783B813446k07477j49060j35270j09465m0646n0902j06098m8205l0873o4057
18773A871393p6165k4512l1673n348N6635R1357J88877N4144j67448k06660j81545
18762A569055j46848j10858p2688l1773m59O674o3495k7634q5445m3707Q528o9787
$$ y = [179911913, 164893568, 142117109, 114770368, 89445278, 70205618, 56725492, 47279689, 40283994, 34857052, 30666687, 27415617, 24891316, 22867359, 21001420, 19272301, 17673138, 16338222, 15223999, 14300323, 13379604, 12376575, 11495082, 10677575, 9897728, 9180962, 8410062, 7626756, 7015464, 6511128, 6030229, 5509071, 5085812, 4734889, 4378952, 4091068, 3888810, 3658158, 3499496, 3380724, 3209228, 3031083, 2947621, 2813446, 2605969, 2456909, 2321639, 2212174, 2171528, 2120626, 2014528, 1966323, 1935450, 1871393, 1795228, 1770716, 1739043, 1733695, 1790330, 1881687, 2070564, 2124708, 1957260, 1750600, 1569055, 1422207, 1311349, 1238661, 1206888, 1206429, 1213103, 1149608, 1121974, 1036529, 992822, 1001350, 931563]
18750I31563j9223k838k9840L0608l8818j4508p93k8080q2347k1627O3046N5140
18738H42283k9242j1119J0606J9952N1066J0696o2614K02M167Q839M666n7189
18726G92313Q833J2827K4727N6391J3341j618K3037l7782l8970m789k0138L4228
18714H62400l9207j2129k6814k8144m3782j1260K1802k2596J1568j7347K2609
18703G17100m1917o8264m3767N8152l4385m1775K736k6163n6938m7840k3906m0138
18691C52895q095J319K0710M289J6652n4869n8739O942K640Q4890L0804p7789
18679C21649j1723n780l5609k750j7331k7934k3438J7132l0498k6754O1623J1922
18667B30509m7486J3476R9178N6326J4215p0125q8223l4465N5757j8410N470m1412
$$ y = [931563, 912340, 909502, 879662, 910270, 871452, 856944, 856151, 828071, 745724, 724097, 787143, 842283, 813041, 801922, 812528, 832480, 883546, 894242, 831628, 831830, 835997, 844836, 849502, 792313, 801146, 813973, 838700, 895091, 908432, 906814, 929851, 892069, 853099, 848310, 828172, 862400, 823193, 811064, 784250, 756106, 712324, 701064, 722866, 700270, 711838, 694491, 717100, 675183, 606919, 563152, 621304, 586919, 545144, 547880, 521717, 464779, 416939, 393033, 352895, 344800, 346119, 366829, 371118, 387770, 332901, 274162, 281104, 283744, 368634, 399438, 321649, 309926, 304146, 268537, 265787, 248456, 220522, 197084, 214216, 183718, 156964, 218587, 230509, 183023, 196499, 295677, 352003, 366218, 296093, 207870, 173405, 229162, 210752, 216222, 174810]
18655A74810L7026K6192k1328m2190m9961M218k1208n862O1108J0004J2366k8598
18643A56577n124l865K2075M002k8987m554m0285l6786j2232K1777P8902M1315
18631A92815J5299k3469m8293k5907J0436K1372P1858l5899k7817L5019k8188
18620A57226Q226M557N9173M8860p075l5277k9265M435J2260k7420k0982k3622
18608A51096K0900J9345M3434j5777l229m1499q958K1865k6788l8400m1315j8086
18596F2588m257J5109O683O7740L3143n1811L708j7205k482K6221J1715j484m5690
18583A03978l9395O430j1943q089N56M3079N6304R908j1088l9823K4257J2444
18571A46618j6664k6646j6211j3368n031n6857k4894O9739M7872K5179n3436k4132
$$ y = [174810, 211836, 238028, 216700, 174510, 124549, 128767, 107559, 101697, 162805, 172809, 185175, 156577, 151453, 147588, 169663, 173665, 144678, 140124, 99839, 63053, 50821, 72598, 151500, 192815, 208114, 184645, 136352, 110445, 120881, 142253, 214111, 178212, 150395, 185414, 157226, 165452, 170009, 229182, 278042, 270967, 235690, 206425, 210860, 223120, 195700, 174718, 151096, 171996, 191341, 234775, 218998, 215769, 174270, 165312, 187177, 160389, 121989, 80674, 62588, 58331, 73440, 80123, 147863, 181006, 129195, 132903, 115698, 113216, 139437, 151152, 149668, 103978, 64583, 71013, 59070, 50981, 51537, 94616, 150920, 160828, 149740, 109917, 134174, 146618, 129954, 103308, 87097, 73729, 68698, 11841, -13053, 56686, 104558, 129737, 76301, 52169]
18559E2169K2807p794j5899j1121O8685q2633r23m861n540K3507L5206K8913q20
18546A01696l6606j3323j0542j2380J0284L4547J9444j9930l4784k3684Q589k4804
18534a493j6951J0788L4148L0996K3479l2087K5650M0716n5450j0394J2540k60
18522F1682l4970L9550Q8089j0177n1913j4601o5306J3543L9416k0688K6820o0864
18510A0581l4142N0905M9700k2500j7272l3489O454M9108k6916m6832J4809k9082
18498b8676j4043J3465K9023N1872J9255l3983o8300k9884K3973J6764l900L5739
18486A1305l695K7601o0574l436N778R207L7852N763l2182k4938K7581J5828k2431
18473f341o633n299L2143o368j4415R753L2527M6713o769o7719j0868Q23K0469
$$ y = [52169, 74976, 67182, 51283, 40162, 108847, 26214, 25291, 20430, 14890, 38397, 73603, 102516, 101696, 65090, 51767, 41225, 28845, 39129, 73676, 93120, 73190, 38406, 14722, 23311, -1493, -18444, -7656, 26492, 57488, 80967, 48880, 74530, 115246, 59796, 49402, 61942, 61682, 26712, 66262, 154351, 144174, 92261, 77660, 12354, 25897, 65313, 44625, 71445, 10581, -23561, 27344, 77044, 54544, 37272, 3783, 10237, 59345, 32429, -14403, 406, -28676, -42719, -29254, -231, 51641, 70896, 36913, -31387, -61271, -37298, -20534, -24434, 11305, 7610, 35211, -25363, -28799, -23021, -13814, 24038, 29801, -2381, -27319, 262, 16090, -6341, -12974, -18273, 13870, 7502, -6913, 2840, 35367, 82080, 75311, 7592, -3276, -2453, 18016]
18460A8016K7641j921j3580q875K5637P111k9493n8372j0417j7220Q2155M9453
18448G0135J912K8923j2312l9044J8156R021k8597J8170O849j3300o016m3932
18436I965l7283J0247j6635n0804L2808K7296L5322K361j4605L7353K9372l5126
18424C0271j0929l6239n8945M3975N3248j0075N6793M5129n9406o2503k3127J7168
18412a4640j7560p959l4036J8415P2730O5963L5343j6123m534M221N337j3305
18400I3852m6333p454K5204k940M2512l1433o2244J0904j1948l7674j9466q330
18388e5350J9754Q2347J6418J0219k5392p0516m1639p614L7508J5119N1973k228
18376C0599o5645M432J8367L1158j6080j3559J0975J3163J7218J1050k684k6723
$$ y = [18016, 45657, 43736, 30156, 21281, 46918, 54029, 24536, -33836, -44253, -61473, 20682, 70135, 72047, 100970, 88658, 49614, 67770, 76791, 48194, 66364, 73213, 59913, 53897, 9965, -27318, -17071, -33706, -84510, -51702, -24406, 10916, 13277, -1328, 36025, 65397, 30271, 19342, -16897, -75842, -31867, 21381, 11306, 68099, 113228, 53822, -8681, -31808, -14640, -32200, -40159, -74195, -55780, 16950, 82913, 118256, 102133, 97599, 101820, 107157, 93852, 47519, 40065, 65269, 62329, 104841, 73408, 11164, 22068, 10120, -27554, -47020, -55350, -35596, 46751, 63169, 73388, 47996, -22520, -64159, -71773, -34265, -19146, 32827, 30599, -35046, -30614, -12247, 18911, 2831, -10728, 247, 13410, 30628, 41678, 38994, 12271]
18364A2271R191L1976r420R114O3848k961p4858p7034L7436K8104N7233K670n4190
18351C3380o2692Q075K4033j4984O679K2219J1213J0917m038k2564J4912J998
18339B9148j6737j339j4560j2232K3799j958N102k0507j0838J9653l4969J3472
18327b1966j5564J3552K0429Q493j251K4125O611k2605K9165l8107O215N636M1591
18314E6324j2057k933k890L4066M5858p095j4036k3692M4349L1767r21q346n1978
18301H8416k6813M2682K2518k078K2915j0094N371n2448q8832J8921L3501K6970
18289H1029M1323K6299j2268n8789O110M2933K5318J261J5664N038j6924o133
18277A50861l6828o8117k292J2609J3443P4277M6134n095l8815k6074o377j9751
$$ y = [12271, 21462, 53438, 44018, 53132, 116980, 114019, 39161, -37873, -437, 27667, 84900, 87570, 33380, -29312, -21237, 2796, -12188, -5509, 16710, 27923, 38840, 34802, 12238, 27150, 29148, 12411, 11072, -3488, -15720, 8079, 6121, 11223, -9284, -20122, -469, -35438, -21966, -37530, -23978, -3549, 4944, 3693, 27818, 34429, 11824, 40989, 2882, 9097, 14733, 56324, 44267, 41334, 38444, 72510, 118368, 111273, 97237, 73545, 117894, 149661, 148740, 140394, 88416, 61603, 104285, 126803, 124725, 147640, 137546, 142917, 90469, 1637, 20558, 54059, 81029, 122352, 148651, 136383, 77594, 83704, 126637, 151955, 153216, 168880, 173918, 156994, 150861, 114033, 45916, 43624, 56233, 69676, 143953, 190087, 184992, 146177, 120103, 113726, 93975]
18265I3975J9928L8730L5344M4440K1750L5866Q720P2920R0142J37275J22747
18254G21837R0801J27825J06589J40084J77965J92842J78239Q9193j5352n0183
18244A759840M0708J37356J96011R5135k4994n5137j05479q0209K2125J19187
18234B104543Q3141O5377Q862o9060j59177j42497m6807O3657P8936j04661k38709
18223A643605k65911k14638j26887o7059m7601j28454j72083j50299n9995m5082
18213C65596o3913p4409l9249l4063J5320L9579n781J0726n499k5258m1240r702
18201A32107M9235j3759k3753l6223j5374J4102k6750Q997K7875l1364K8528M1857
18189A55478m3809n825K6463M6056k8839n8372N985N460J0595k6762k7613K5558
$$ y = [93975, 113903, 152633, 187977, 232417, 254167, 290033, 298753, 371673, 461815, 599090, 721837, 812638, 940463, 1047052, 1187136, 1365101, 1557943, 1736182, 1825375, 1810023, 1759840, 1800548, 1937904, 2133915, 2229050, 2204056, 2148919, 2043440, 1963231, 1985356, 2104543, 2187684, 2253061, 2261923, 2192863, 2033686, 1891189, 1844382, 1908039, 1986975, 1882314, 1643605, 1377694, 1163056, 1036169, 969110, 921509, 793055, 620972, 470673, 410678, 365596, 301683, 227274, 188025, 153962, 169282, 208861, 203080, 213806, 208307, 183049, 141809, 132107, 181342, 167583, 143830, 107607, 92233, 106335, 79585, 88582, 116457, 85093, 113621, 155478, 111669, 105844, 132307, 178363, 149524, 91152, 97137, 102597, 113192, 86430, 58817, 84375]
18177H4375k6798k0135o906K0267N328K373k0563J0776K9141R142K0077l483P65
18164A04359j2818k5586J0583j1477K773P1783K4743K8097l5268M128J3158M0960
18152B15435j1974M5307J3516m9396J9381j4901k5322J3253j3659L2386O2014
18141B86040N3476M8394K6501k7485j6161L23M1580P8989K9660O2298m1601M2585
18129E84599O5360O7068J21075J56501J83252J68763J65141J72103J44357K54444
18119B082663L90501N32024P26168J117974J623825K510493M106248P457047J3909669
18110C4456612K6049591L7300751K0169406j0249289k9835572l0663354j8495360
18103B8732785r506252n250859l274452k281251j711171j217707q84160p29905
$$ y = [84375, 57577, 37442, 30536, 50803, 56131, 58504, 37941, 48717, 77858, 87000, 107077, 103594, 104359, 91541, 65955, 76538, 65061, 67834, 139617, 164360, 192457, 157189, 161317, 174475, 215435, 203461, 248768, 262284, 212888, 232269, 217368, 192046, 205299, 191640, 224026, 286040, 339516, 387910, 414411, 386926, 370765, 371088, 412668, 491657, 521317, 583615, 542014, 584599, 649959, 717027, 838102, 994603, 1177855, 1346618, 1511759, 1683862, 1828219, 2082663, 2473164, 3005188, 3731356, 4849330, 6473155, 8983648, 13089896, 20546943, 34456612, 60506203, 97806954, 117976360, 107727071, 77891499, 47228145, 28732785, 19226533, 13975674, 10701222, 8419971, 6708800, 5491093, 4606933, 3877028]
18095C877028n65920m59191m03024l19867k18748j68592j28157j69223j59114
18086A285192j56092j14073q3692r3087r5408n7001r2395o2176j8766m4849L651
18075D71304n8549j2896o6651l5496N2403L1732K2145L578J3920M992l5893q1568
18063C09021q7977o458M5428m140L1485J1322J4151k9405k0833k8426J2050K8961
18051B75179l0298n0714k8891l2605n2030k3287J2553Q305J2603K0618j894M701
18039A14240l6809K9300N8224o055J0326P149M4348M3517l4853o6804k3772J3328
18027A52139K8992J2213l5436n6039p5817l2674q373Q2329M4795M5986N9012k6247
18015A90880o9478r122Q1302K2177k8133L4383n280k5459L6099Q6395l8156k9515
$$ y = [3877028, 3311108, 2851917, 2448893, 2129026, 1910278, 1741686, 1613529, 1444306, 1285192, 1129100, 1015027, 931335, 838248, 742840, 685839, 593444, 531268, 512502, 467653, 471304, 412755, 399859, 333208, 297712, 350115, 381847, 403992, 407570, 421490, 426482, 390589, 309021, 221044, 214586, 260014, 255874, 287359, 298681, 312832, 283427, 262594, 234168, 246218, 275179, 244881, 194167, 165276, 132671, 80641, 57354, 69907, 78212, 90815, 111433, 109539, 114240, 77431, 106731, 164955, 158900, 169226, 176375, 220723, 264240, 229387, 162583, 138811, 152139, 181131, 193344, 157908, 101869, 26052, -6622, -14995, 67334, 112129, 158115, 217127, 190880, 121402, 112280, 193582, 215759, 187626, 222009, 216729, 191270, 227369, 313764, 275608, 246093]
18003B46093r072K7851N779r207M1150l0375l4881J3044R820n796m8729l2595
17991A73082J7210l1479k4920o413l235L3520R278l3268m8100j2603j460J1312
17979H2924J0939j1295q386k2223J9765j3635p908l2657J8057O2298K1607n3366
17967F6120J935j2089M619K8348l3918r770J8290K8354J8519o813N4287L7535
17955A95417m4193J7119J2954l9233P266L7358o0340l5610j6934k1417J7255k8172
17943D1470N747J6027R448R466k6354M7504k0602q246M2063m2307l1703l4016
17931H497l991N7906o32M3054o1588m1620k4979K266K7587M1772M327r765l6191
17918F643L1344J1474K5060n563M0779J2040O743l5920l7640k6218k034l1944
$$ y = [246093, 237021, 264872, 270651, 261444, 302594, 272219, 237338, 250382, 260202, 254406, 205677, 173082, 190292, 158813, 133893, 127480, 124245, 157765, 167043, 133775, 85675, 73072, 71612, 82924, 93863, 82568, 74182, 51959, 71724, 58089, 50181, 17524, 35581, 97879, 119486, 66120, 68055, 55966, 60585, 88933, 55015, 45245, 63535, 91889, 110408, 103595, 157882, 195417, 151224, 168343, 181297, 142064, 149330, 186688, 126348, 90738, 73804, 52387, 69642, 41470, 47217, 63244, 72692, 82158, 55804, 103308, 82706, 74460, 116523, 74216, 42513, 8497, 4506, 62412, 61780, 104834, 43246, 1626, -23353, -21087, 6500, 48272, 52599, 42834, 6643, 37987, 49461, 74521, 68958, 109737, 121777, 128520, 92600, 54960, 28742, 26708, -5236]
17906e236j4492Q6738K5351j4642k732o2019n4467n1324N1556J01070O8862L409
17894A32074p00j7159l7826n0976n553L0072l145p0076R496M3018J8540k5831
17882B1934L9866M6131L3983l7669l025k5522j5873J7645l8138k8108j2652q95
17870b323L6043J6427k2738k3694K0734k1794J0367N2164O8188j090L4144j4616
17858A51812p6340n9028K2770l3211n7410M253Q3136j0715l4815k0747L3115M8369
17846E1189r828k2611N2349N4685l2210K0490o7392N368M8953r056j6687k9569
17834D5681j2410m552J4474j0299k4631k9674R652j8724j0916K3846Q97N5207
17822C8551K1778j4629r234L1510l8861k0603K3104K3676m8155j8736J7020O1663
$$ y = [-5236, -19728, 67010, 92361, 77719, 74987, 12968, -41499, -92823, -41267, 59803, 128665, 132074, 131374, 114215, 76389, 25413, 19860, 49932, 46787, -23289, -13793, 29225, 47765, 21934, 61800, 107931, 141914, 104245, 101220, 75698, 59825, 77470, 39332, 11224, -1428, -2323, 33720, 50147, 27409, 3715, 24449, 2655, 13022, 65186, 133374, 132284, 166428, 151812, 75472, 16444, 39214, 6003, -51407, -47154, 35982, 25267, -9548, -30295, 2820, 51189, 41361, 18750, 71099, 125784, 93574, 114064, 46672, 52040, 100993, 91937, 75250, 45681, 33271, 28719, 43193, 32894, 8263, -21411, -11759, -30483, -41399, -17553, -16656, 38551, 60329, 45700, 36466, 67976, 29115, 8512, 31616, 55292, 7137, -11599, 5421, 67084]
17810F7084K7705K6981K0302K6722j2156k2128M8189K7336k6888p5249K773K3362
17798A34033M9484j9220m3573l5037j6361K1595L7831k5423k9780l8060L863J3145
17786E2497o2850k657M0380P672n110J7860K9814k7279L2079O1712L424N034j6931
17773A35645l3964r204L9714j1647l4152l474O8113L1206n0566m6719N3485K1919
17761A60356K7676L0116J08741P2071L0365J7868J17765J79341J99095J63356
17751A106750J52774K71519L49607K65166J89924R6418O7281J5519q5383j85765
17741B243810k30023k15788j10423K7450L0628O286J5800J16103K00892K03948
17731B288683O9004L6134o637q976j23272k88414k76058k49889k73230l04933
$$ y = [67084, 94789, 121770, 142072, 168794, 156638, 134510, 182699, 210035, 183147, 107898, 110671, 134033, 183517, 164297, 120724, 85687, 69326, 90921, 128752, 103329, 73549, 35489, 39352, 52497, -10353, -13010, 27370, 35042, 29932, 47792, 77606, 50327, 82406, 144118, 147542, 152576, 135645, 101681, 92477, 132191, 120544, 86392, 82918, 151031, 182237, 131671, 84952, 138437, 160356, 188032, 218148, 326889, 398960, 429325, 447193, 564958, 744299, 943394, 1106750, 1259524, 1531043, 1880650, 2145816, 2335740, 2432158, 2499439, 2514958, 2429575, 2243810, 2013787, 1797999, 1687576, 1715026, 1745654, 1751940, 1767740, 1883843, 2084735, 2288683, 2357687, 2393821, 2387184, 2378208, 2254936, 1966522, 1690464, 1440575, 1167345, 862412]
17721H62412j76748j36083o4242l317q0536k0726k1737l1115Q393j0m6561o5037
17709B24693k0025j8685j6169l0485n6286k0010K4233K3392R429m1156n0905K1527
17697D9553K0066K2205m1039K7816l016J49J7631j0700j1569k9919p705K6181
17685E9653N0037m4241m1096m5869m1194J9371L7139M9572J0052J2424O8497j7705
17673A16640l4575L622P352J9837K528M431j3011o1272n5464L9332M5043R415
17661H3878M7169n611m2383l7152J9256o094l2396k6472M99M0987J6443K2386
17649H0510j4893M1470P2880K9612Q984j11314l4640l954L3363K1311m7237m8325
17637B7767N605R57M9630L9129j3284k01r839l0919l1406j3891k6405O545p963
$$ y = [862412, 685664, 549581, 485339, 482022, 401486, 380760, 359023, 327908, 336301, 336291, 289730, 224693, 204668, 185983, 169814, 139329, 83043, 63033, 87266, 110658, 120087, 78931, 28026, 49553, 69619, 91824, 50785, 78601, 75585, 75734, 93365, 82665, 71096, 41177, 33472, 59653, 109690, 65449, 24353, -21516, -62710, -43339, -6200, 43372, 53424, 65848, 134345, 116640, 82065, 85687, 93039, 112876, 115404, 119835, 106824, 45552, -9912, 29420, 74463, 83878, 131047, 125436, 83053, 45901, 65157, 59063, 26667, 195, 694, 41681, 58124, 80510, 65617, 107087, 179967, 209579, 218563, 107249, 72609, 68655, 102018, 123329, 76092, 27767, 33372, 34329, 83959, 123088, 109804, 109603, 99764, 68845, 37439, 23548, -2857, 3688, -4275]
17624d275K6476O8016L3801j2883l2827J1031o74L382l274n655j058L2865j8177
17611I6748p6574N612Q0711J8029k9299l8443P272K4594j8542J1373O658j4470
17599G3669l502J9828j1244k9274k6146M591K0452J5988L9927m882o1056J6245
17587E4596Q7600N455K4045n019l6003n8862l1932m753l1185k3174K0431M5443
17575D6642M796J9367K6416M7107O2341j3801l3399k0816j8739l8621L0191k3336
17563H8148m718R059K5097p042j8093k0654j7811O493K6731M4296J4945l2688
17551A13763l2989J5528L9945m645l2887m8924k7488P493k459K1063P0387M79
17539A19266j1809P247J0495m7524L9434N2333l825o0182q1065o05L6525J1081
$$ y = [-4275, 22201, 90217, 124018, 111135, 78308, 89339, 88665, 92047, 88773, 83118, 82060, 114925, 96748, 20174, 25786, 106497, 124526, 95227, 56784, 64056, 88650, 70108, 81481, 88139, 73669, 70167, 89995, 78751, 49477, 23331, 27922, 48374, 64362, 104289, 99407, 38351, 54596, 142196, 147651, 171696, 166677, 130674, 71812, 39880, 35127, 3942, -19232, 1199, 46642, 51438, 70805, 97221, 144328, 206669, 192868, 159469, 138653, 119914, 81293, 111484, 88148, 83430, 92489, 117586, 110544, 92451, 71797, 53986, 60479, 87210, 131506, 146451, 113763, 80774, 96302, 136247, 131602, 98715, 49791, 22303, 29796, 27337, 48400, 118787, 119266, 107457, 114704, 125199, 77675, 117109, 169442, 165617, 105435, 24370, 23765, 60290, 71371]
17527G1371J7999n433k9827J3681K7458j5828j8676l7313j3284N4356K5383L4849
17515A24736J0028J3665l700L1775L517K1193p870k3106k9243J881P84m9685j163
17502I2812K8227J4257K127M742k3384J5500J0974J7874K5766k267k9848L050
17490A59830k1525r070k1773j4514K3859O0196l4513l0377M866k4572j1981J0319
17478I0745J8283Q642N2949M8203n6899K2325L9484j1892J1074q080m2565K3838
17466A96107k6263n8957R363R270J4248J073N7329j0073o4616M0506M3745k8936
17454A82796l3532J1729O096l0575L7802J9995M8425j9005j817O3436J91183K84255
17442G60788J79626o1869k54598j68757j09207n4940m8429L7645K2167L3118M3541
$$ y = [71371, 89370, 83937, 54110, 67791, 95249, 79421, 60745, 23432, 10148, 64504, 89887, 124736, 134764, 148429, 144729, 176504, 180021, 201214, 193344, 170238, 140995, 142876, 143660, 93975, 92812, 121039, 135296, 137423, 142165, 118781, 134281, 145255, 163129, 188895, 186628, 156780, 159830, 138305, 129235, 107462, 92948, 116807, 177003, 142490, 112113, 116979, 92407, 80426, 90745, 109028, 117670, 170619, 218822, 161923, 184248, 223732, 211840, 222914, 214834, 172269, 196107, 169844, 110887, 120250, 129520, 143768, 144841, 202170, 192097, 127481, 167987, 211732, 182796, 149264, 160993, 167089, 136514, 174316, 194311, 242736, 223731, 221914, 285350, 476533, 760788, 940414, 878545, 623947, 455190, 345983, 291043, 242614, 280259, 302426, 335544, 379085]
17431C79085P464J1629L9465P6031L3645k0006J6494P306n9269k5784j3890j1903
17419D40267n9724k0186J7426P4740O9294l9964k471L5443N149M1535j4916j853
17407E44740q219q6400q1434q3359k0951K3884J6886j7004j8580j7357M7238j0608
17395B88836m6084O156L1370k1688l1938k7158J4073j136k3612j3245K8780n925
17383A98429J788l4292m0712k3610n32M4678J6225M7110j8814l5599p2032L6918
17371A19557M2430q256k3287K8665L6952K5476J6705m4458l8142J2324M6221j4040
17359B00147K7043J8873k2280j0222n830J1888O206K1679q551M7358q366l7862
17347B40083m3465M3501P1605J914Q130O7732P2048l4044r9972p1939n337j1664
$$ y = [379085, 386549, 398178, 437643, 513674, 547319, 527313, 543807, 551113, 491844, 466060, 452170, 440267, 380543, 360357, 377783, 452523, 521817, 481853, 479382, 514825, 519974, 561509, 546593, 544740, 536521, 450121, 368687, 285328, 264377, 288261, 305147, 288143, 269563, 252206, 299444, 288836, 242752, 248908, 280278, 258590, 226652, 199494, 213567, 212431, 188819, 175574, 204354, 198429, 200217, 165925, 125213, 101603, 101071, 145749, 161974, 209084, 190270, 154671, 82639, 119557, 161987, 153731, 130444, 159109, 196061, 221537, 238242, 193784, 155642, 167966, 214187, 200147, 227190, 246063, 223783, 213561, 207731, 219619, 225825, 247504, 238953, 286311, 277945, 240083, 196618, 240119, 311724, 313638, 321768, 389500, 461548, 427504, 327532, 255593, 250256, 238592]
17335B38592J5131J1339J4230R54j1326L8786Q624k9325j2288M8695M6302P2724
17323D42438j3139j5883m4319n5910K0495N7112r720j8189J4462K5059K0727J6111
17311D39244j2066O7027M8396J257j6870M8816M1067K1768k6367m1101l3181L6387
17299E74377N824M03j8756K2570M8077K3487l805J702Q424k9147K7543O9777K0737
17286G51213K660j2750n9938K4098K6356k3152J4076K8063M4777M5420L4227n8962
17274H16088J6837m6749l666l2008p063k1447j8000n1074L7539M1624O2515m1344
17262G53252K6031R2015L3347n1239Q845L0845j7532M096R209M7783R1874M5391
17250A073917K1210L7915J8357K417J1340N7864P3499K0110R1173L1523K2099
$$ y = [238592, 253723, 265062, 279292, 280246, 268920, 307706, 316330, 287005, 274717, 323412, 369714, 442438, 429299, 413416, 369097, 313187, 333682, 390794, 381074, 362885, 377347, 402406, 423133, 439244, 427178, 494205, 542601, 543858, 526988, 575804, 616871, 638639, 612272, 571171, 537990, 574377, 580201, 580604, 561848, 584418, 632495, 655982, 652177, 653879, 662303, 633156, 660699, 730476, 751213, 753873, 741123, 681185, 705283, 731639, 708487, 722563, 750626, 795403, 840823, 875050, 816088, 832925, 786176, 782510, 750502, 743439, 721992, 703992, 652918, 690457, 732081, 794596, 753252, 779283, 871298, 904645, 853406, 862251, 893096, 875564, 879660, 888869, 936652, 1028526, 1073917, 1095127, 1133042, 1151399, 1153816, 1165156, 1223020, 1296519, 1316629, 1407802, 1439325, 1461424]
17239A461424P429P6028j330O0319P898O3162R3350O5176J06183N9738L0648J05572
17227B135597N0681Q4489M8396P6745J39828M8537k3175P9249P7701Q3009J33534
17216B934591K47045K06073J69364J85363J59044J86411K60997L63227M31481
17207E143596M05378M25647N29864O14313O51458P46108Q61347P79274Q94463
17198A1051448R87074J038410J238359J377125J418087J612459J953718K366341
17190B3043021K715140L271240M182398N564431P599412J0878996J5955456K3517148
17182I6727242L3000354M0516077M3125602M5976528N4374208N9797167M6126749
17175D19643927K2457430Q732920O196283m514049k6247109m1726981m1302953
$$ y = [1461424, 1468853, 1544881, 1543551, 1603870, 1611768, 1674930, 1768280, 1833456, 1939639, 1999377, 2030025, 2135597, 2186278, 2270767, 2319163, 2395908, 2535736, 2584273, 2561098, 2640347, 2718048, 2801057, 2934591, 3181636, 3387709, 3557073, 3742436, 3901480, 4087891, 4348888, 4712115, 5143596, 5548974, 5974621, 6504485, 7118798, 7770256, 8516364, 9377711, 10156985, 11051448, 12038522, 13076932, 14315291, 15692416, 17110503, 18722962, 20676680, 23043021, 25758161, 29029401, 33211799, 38776230, 46375642, 57254638, 73210094, 96727242, 129727596, 170243673, 213369275, 259345803, 313720011, 373517178, 419643927, 442101357, 450834277, 457030560, 452516511, 426269402, 384542421, 343239468]
17168C43239468l0476213j8580322o624240M554204J4424150K6650139M1289704
17161C74476890M4325863K7156025P218007n19299l677622k0078794m2063988
17154C86837082n4028682n2703079m7374934m4093220m0026547l3026376k4621404
17147I0962840j7509898j2475961r105098o917927n500339m442916l669085l042523
17139B8299093k638876k344058k035920j774357j540089j372530j296379j171546
17131A4125338j019329j003629r79329q94965q50011q16378o95589o48422n49565
17122F668121m27203m49007l94962l26903k31222k87957k46656k13353j73668
17113C917190j94175j84329j72796j32610j24874j50274j35278j33302j54934
$$ y = [343239468, 312763255, 294182933, 287558693, 292112897, 306537047, 333187186, 374476890, 418802753, 445958778, 453176785, 452657486, 448979864, 428901070, 386837082, 332808400, 280105321, 232730387, 188637167, 148610620, 115584244, 90962840, 73452942, 60976981, 51871883, 44953956, 39453617, 35010701, 31341616, 28299093, 25660217, 23316159, 21280239, 19505882, 17965793, 16593263, 15296884, 14125338, 13106009, 12102380, 11123051, 10228086, 9378075, 8561697, 7866108, 7217686, 6668121, 6240918, 5791911, 5396949, 5070046, 4838824, 4550867, 4304211, 4090858, 3917190, 3723015, 3538686, 3365890, 3233280, 3108406, 2958132, 2822854, 2689552, 2534618]
17104B534618j02451j04545r3982o9170r0655q030o0295n5387n4464n9890o7313
17093A768436j35628j16454p3431J2975N8774m3887j43941k3939K7914l5517q3303
17082A211999J5887n2173m4305r51K1646k1004p4465m8128l4556j2994k1839k2929
17070I16188j6293L033l0352j5773n46n5869m8094j85J0685m776n7317j5329L3036
17057G18408O383k8069R915M4974K8943K8958M2906J6306M4195M5037j9370n9691
17045H78895o5288J9203J657l4061m122K5665O218o8832L230O2634L4254J5746
17033H75199K5190l3733j9565j504m2433k8185n2635n8121n3906r5912k1909N4469
17021E46955r660j9012L4124k4257l9149K1647k8855p2350n6744p9535j6634P9941
$$ y = [2534618, 2432167, 2327622, 2233640, 2164470, 2073815, 2065785, 2005490, 1950103, 1895639, 1835749, 1768436, 1632808, 1516354, 1442923, 1455898, 1514672, 1470785, 1326844, 1302905, 1330819, 1295302, 1211999, 1227886, 1175713, 1131408, 1130457, 1152103, 1131099, 1056634, 1008506, 973950, 960956, 939117, 916188, 899895, 902928, 872576, 856803, 856257, 800388, 752294, 752109, 762794, 758018, 700701, 685372, 718408, 724791, 696722, 706637, 751611, 780554, 809512, 852418, 868724, 912919, 957956, 938586, 878895, 813607, 832810, 834467, 800406, 796284, 821949, 828167, 759335, 762565, 825199, 859453, 875199, 900389, 866656, 847091, 845587, 803154, 774969, 722334, 664213, 610307, 514395, 492486, 546955, 537295, 518283, 552407, 528150, 489001, 510648, 481793, 409443, 352699, 273164, 256530, 336471]
17009C36471N8242n4742J5642N3057n3049k7264m719k4357J4370j4811k8493J8252
16997B88599K1929j9448k9700j6160K5967Q569k956m5541k5595n5834l1255m5268
16985G3307K1747J04587N6666J3884Q804l3732j3755P4623r477p45J8610O280
16973C20799m1790q7843k3889L1506m400j3080n2524k1136M1733J5929M6964K3147
16961B35416p910j0569j1277N982m4807l9387j4553J3827j7006j8251J2413L1138
16949A35016o08K6050Q989N3275m6351J6533q017j796l3440J9183O512m7156m250
16936A23940j0911k2050l3881M5764O3253K8574M921j9116J1534N7667L1244M081
16924B85020j7232k8759n3170l4911l8260m263K3096L4150J0176m881l8118K5016
$$ y = [336471, 394713, 339971, 355613, 408670, 355621, 328357, 323638, 299281, 313651, 298840, 270347, 288599, 310528, 291080, 261380, 245220, 271187, 279756, 276800, 231259, 205664, 149830, 118575, 73307, 95054, 199641, 256307, 270191, 278995, 245263, 231508, 306131, 296654, 295909, 314519, 320799, 279009, 191166, 167277, 198783, 194383, 181303, 128779, 107643, 149376, 165305, 212269, 235416, 227506, 216937, 205660, 211642, 166835, 127448, 112895, 126722, 109716, 91465, 103878, 135016, 134408, 160458, 169447, 222722, 176371, 192904, 184887, 183091, 149651, 168834, 175346, 128190, 123940, 113029, 90979, 57098, 102862, 166115, 194689, 199610, 180494, 192028, 249695, 280939, 285020, 267788, 239029, 185859, 150948, 112688, 108425, 131521, 165671, 175847, 170966, 132848, 157864]
16912A57864j7597k1350K9568J1568j2423M0858j8282l5464j1268p835j6219N2569
16900A51989M4600l304m5121q7781j8289J822L667J2251j2939J7596k1668k52
16888D2571K4553P4494P9l4012L4402J9770K715m8029l2393l4030K2337K6901
16876I9358P5729j3277j8365m107k1330o0916k2217k3191o129j5582r926K1431
16864A478l2561L4638N1062K855j3769M485M4281q029k1484K0366l8022m6221
16852i21K9031j3122k3943j1789J0616K7389k3940J5971J9806j9509r3458q814
16840i2683j0890J8451O0986O3057L201K1398N2979n357k1249p2434m1077l1227
16828e4845l0141j9114O6062N2022j4807k5198M7106L6732n634j5156m73k6271
$$ y = [157864, 140267, 118917, 148485, 160053, 147630, 188488, 170206, 134742, 123474, 115639, 99420, 151989, 196589, 193285, 148164, 60383, 42094, 43916, 47583, 59834, 46895, 64491, 42823, 42571, 67124, 141618, 141697, 107685, 142087, 161857, 164572, 116543, 84150, 50120, 72457, 99358, 175087, 161810, 143445, 139338, 118008, 57092, 34875, 11684, 5555, -10027, -19953, 1478, -31083, 3555, 54617, 57472, 43703, 48188, 92469, 84440, 62956, 83322, 45300, -921, 28110, 14988, -8955, -20744, -10128, 17261, -6679, 9292, 29098, 9589, -83869, -92683, -103573, -85122, -24136, 38921, 42122, 63520, 116499, 111142, 89893, 17459, -23618, -54845, -84986, -104100, -38038, 13984, -823, -26021, 21085, 57817, 52183, 37027, 36554, 10283]
16816A0283l5697p37K2965N1072J5696k0092o7296N86K7653L980j558J61k0404
16803a3388Q837K877L3206K4310m367l8721m363L7728J0980j2569k814J7241k1222
16790C7735k6565N713N995O157P9521k2720n7887Q580p479K5570k5423l9504m759
16777a5066n112l582N25K9223J8896J3580p1396j2251K8486k87Q548j1473J2385
16764g524L5945k2124n3613N1880O1002P475m5206K6742K5985l9756l8937j5906
16752a4037R803J8704j1393l455K7636j7706p6975r442K1767L941j0954J6811
16740d5300K7504J1357J3571K8746k5008J6801j8855j566L2692m875k4743J6570
16728B6894M2019N663k8886l2603k5273m9409L697N6026K9128M203J0353L6119
$$ y = [10283, -25414, -26151, -3186, 47886, 63582, 43490, -23806, -23220, 4433, 8413, 6855, 7016, -13388, -4551, -1674, 31532, 55842, 51475, 12754, 8391, 46119, 57099, 44530, 41716, 58957, 37735, 11170, 16883, 22878, 29035, 108556, 85836, 27949, 36529, 29050, 54620, 29197, -10307, -15066, -20178, -23760, -23235, 5988, 24884, 38464, -32932, -45183, -16697, -16984, -8436, -19909, -7524, 28421, 6297, -47316, 4564, 65566, 73041, 27835, 54577, 80562, 40806, 1869, -14037, -4234, 14470, 3077, -378, 27258, 9552, -67423, -76865, -55098, -51157, -62111, -45300, -17796, -6439, 7132, 35878, 10870, 27671, 8816, 7250, 39942, 35067, 10324, 26894, 68913, 74576, 45690, 13087, -12186, -61595, -57898, -1872, 27256, 31459, 41812, 77931]
16716G7931n3926l4649p256J6316k1564n6750K3617P3258L0367m146O0100q892
16704I4406j1422j8009K4218L1810j9278m3004j9841r200K9621k5007p8452n7401
16692a01559J9704J2729P122k5820k5498K7455M6290M4615j0420l4796m345J1074
16680c3449J6843K7094j0120l9400J9975L5152k4059o9172m111K9852L4601R044
16668g750Q265j4909p647j7881k8198k9600J5489L4576q574O491j464M4799M3223
16655C6820p096j6785K7054l5127j2431r60j9661L4938L472j2724p0063M5856
16643b6707O9355J690q15k2150j6368J6731L556L2774O510m3544J2433k6035K344
16630I774K7900K8750l0603k5886k5586J7773K2328L9481K1222J6545m0751k7431
$$ y = [77931, 24005, -10644, -17900, -1584, -23148, -79898, -56281, 16977, 47344, 43198, 103298, 94406, 82984, 64975, 89193, 121003, 101725, 58721, 38880, 29680, 59301, 34294, -44158, -101559, -81855, -69126, -62004, -87824, -113322, -85867, -39577, 5038, -5382, -40178, -44523, -33449, -16606, 10488, 368, -39032, -19057, 16095, -7964, -77136, -81247, -51395, -16794, -7750, 515, -14394, -22041, -39922, -68120, -97720, -82231, -47655, -56229, -49738, -51202, -6403, 36820, 29724, 12939, 39993, 4866, -7565, -8525, -28186, 6752, 10224, -2500, -72563, -26707, 42648, 44338, 43523, 21373, 5005, 21736, 25292, 58066, 64576, 21032, 33465, 7430, 9774, 37674, 66424, 35821, 9935, -15651, 2122, 24450, 63931, 85153, 101698, 60947, 33516]
16618C3516K7455Q050J9242n811J3967J8216K0842K8450l362L4739N4714N3967
16606C03985J11721J68256J95336J84475J71462K55541L20296K45290K03687J20228
16596B280277N7857l1095l5286p0320j43825j83861j34066r7406n2287K8031R7178
16585A715197K01903K35411K07083Q8313r42k5791q1060p7253k14112l13124k76349
16574A459276k10736k02459j94487j86389j15032q1002m1937J8382o9190o1407
16564C15019j10704r3412j0686j440J5815k7591l0033J0826Q358O356k0706l1021
16552C0781n3857J9699j1799L9111J6003j1634j5272L1589L1729J8634n5210o8947
16540b9173k0212p918J6665P7552J2252l6638k7717J5820o946l0399p321m8556
$$ y = [33516, 60971, 69021, 88263, 82452, 96419, 114635, 135477, 163927, 160565, 195304, 250018, 303985, 415706, 583962, 779298, 963773, 1135235, 1390776, 1711072, 1956362, 2160049, 2280277, 2338134, 2307039, 2271753, 2201433, 2057608, 1873747, 1739681, 1642275, 1589988, 1618019, 1715197, 1917100, 2152511, 2359594, 2447907, 2446965, 2421174, 2340114, 2262861, 2048749, 1735625, 1459276, 1248540, 1046081, 851594, 665205, 550173, 469171, 427234, 445616, 376426, 315019, 204315, 110903, 100217, 98777, 114592, 87001, 56968, 67794, 76152, 82508, 61802, 30781, -23076, -3377, -15176, 23935, 39938, 28304, 13032, 44621, 76350, 94984, 39774, -29173, -49385, -57303, -40638, 36914, 49166, 12528, -15189, 631, -6315, -36714, -44035, -92591]
16528i2591l3265L6067J8688n1129q784O8772O9524R310k1365k4197K1723o730
16516a3977J1111k6869k589l0763j2896K162J9627l11q1J3901k6425j4916k862
16503h4888K5931O7882J4581l5770K4832o105j4687m9768P072l3148o3988Q628
16491a39428L8404K6732K5197O6374j6989j8065k5428k4051k156O0827K4728r665
16479F480K1524R221m4149n4393J119L8472K1219o2945M571J5953M7172M9643
16467E3887M0643m6729l8980q651J4241j0650O285p57j8808O799L8467k7281k1802
16454a3336K3522L6124m8904n3063m5725J5291J6878K2832J2624J7046K3538j8175
16442a1348l2839P137m0432J7334j409J1714K275J5364O744Q408J0162L3114J2334
$$ y = [-92591, -125856, -89789, -71101, -122230, -131014, -62242, 7282, 16592, -4773, -28970, -7247, -13977, -2866, -29735, -32324, -63087, -75983, -73821, -54194, -54505, -54586, -40685, -67110, -82026, -84888, -58957, 8925, 23506, -12264, 12568, 6463, -8224, -57992, -50920, -84068, -148056, -139428, -101024, -74292, -49095, 17279, 290, -17775, -43203, -67254, -69410, -8583, 16145, 6480, 28004, 37225, -6924, -61317, -60198, -21726, -507, -63452, -58881, -42928, 4244, 53887, 94530, 47801, 8821, 170, 14411, 3761, 10046, 9289, -9519, -2720, 35747, 8466, -13336, 10186, 46310, -2594, -55657, -101382, -86091, -69213, -46381, -33757, -16711, 6827, -11348, -44187, -37050, -77482, -60148, -61557, -49843, -47568, -32204, -25460, -17052, -6890, 26224, 38558]
16429C8558N210j0895k0197n4512k150M552k1955P848K9638P2329k0272n6789
16417b8635n7108K7385O7663k6419m0533q407j0086q549n415J1982M0658M3344
16405E880r598R87l8528j5560Q852k9549K0888O5475M0199k9172J7860l1909j4408
16392h583M1906r872J5529K5712M03j0739K4911o361j2219k7554R696l3987l6716
16379b7874k8984K3187R241O330L2270o984m2451L5605j6042k7224m4219j333
16367h8478J2526m287m3159l7268O7291L1869O3955L0904p3071l3046j6601K0636
16355f8729M6041j4429k3203m6863K8430Q1031J4949M6826j3721l4721l8333j9582
16343d2304p600R062j523j2557K7456k1336j1618l6489j2186N4979L2556K7895
$$ y = [38558, 43768, 32873, 12676, -41836, -43986, -39434, -61389, -53541, -23903, 48426, 28154, -28635, -85743, -58358, 9305, -17114, -57647, -66054, -76140, -84689, -90104, -78122, -37464, 5880, -3718, -2731, -41259, -56819, -47967, -77516, -56628, 8847, 49046, 19874, 37734, 5825, -8583, 33323, 23451, 38980, 64692, 65095, 54356, 79267, 72906, 60687, 33133, 42829, 8842, -27874, -56858, -33671, -24430, -18100, 14170, 7186, -35265, 340, -15702, -42926, -87145, -88478, -75952, -80239, -123398, -160666, -93375, -61506, 2449, 33353, -39718, -72764, -89365, -68729, -22688, -37117, -60320, -107183, -78753, 2278, 17227, 64053, 50332, 15611, -22722, -42304, -49904, -40842, -42365, -54922, -27466, -48802, -60420, -96909, -109095, -54116, -21560, 6335]
16331F335Ok7212l405L2047k0932J797k5114m0754K2988M6659N1089o273q4084
16318d6853K4831K5270l0350o7695j7276N3495N5977P468j5758L2674K0668L9320
16306H1771J3978k9254n2114k0895O728M742l4926K0451n831j6023r876l5375
16294g6624O307K4472M5297O6700K2903n1289j7229l2086o1291L0957N2210P653
16282A7980Q398o1264R662J415j467l8275k1652L1149M5120n3345m0132L53J0736
16269i1322K6368l0311m4424K0046M2191K1770K6905r921N3524O631j6658l7024
16257c2225m2746J3079J4938L4313m5241p6050J3304M133K298J9163r500j7615
16245a22149K7021K2362J878L3643k2753J8381J5791k3613j663j0246n265K246
$$ y = [6335, 6341, -20871, -24276, 7771, -13161, -11364, -36478, -77232, -54244, -7585, 43504, 37231, -46853, -22022, 3248, -27102, -94797, -112073, -58578, -2601, 4867, -10891, 21783, 42451, 81771, 95749, 66495, 14381, -6514, 214, 4956, -29970, -9519, -15350, -31373, -41249, -76624, -70317, -45845, -548, 66152, 89055, 37766, 20537, -11549, -72840, -41883, 10327, 17980, 26378, -34886, -25224, -23809, -25276, -63551, -85203, -54054, -8934, -62279, -102411, -102058, -91322, -64954, -95265, -139689, -119643, -77452, -55682, -28777, -38698, 14826, 21457, 4799, -32225, -74971, -61892, -46954, -12641, -57882, -133932, -120628, -116495, -114197, -95034, -104534, -122149, -95128, -72766, -70888, -37245, -59998, -41617, -25826, -49439, -51102, -61348, -66613, -64367]
16233f4367K871L1656r720J8991m3262p019N7726J2536L454M8408M0733o76n1328
16220D0003q524J42k0193k4868j248r617n714M7539Q0733J5452j2050l4280l1070
16207C6305l6552k0487O436P425K5441k8927p1310k7133N1512R020L9342M6705
16195C7777k1653M5262K1771O140n1175l2728k7918K1579R6361n1004p6615m4636
16183g6839J5333P794M26m2430l317l0299O3980J7307j0874L116K2811l8014J4267
16170e6739L2000J8899N066K9401k9291l2948K3226O1335m4296n5740M788M0144
16158d155O2176j3927o9329j5683l6872q865K3827k3061K483J9005K6384k1017
16146e9034j6527j3421J3490J0729J5241Q0152J5194k4494l7380k2265k604J7623
$$ y = [-64367, -61496, -29840, -39560, -20569, -63831, -70850, -13124, -588, 2866, 51274, 92007, 91331, 40003, 31479, 31621, 11428, -13440, -14688, -24305, -30019, 17520, 98253, 113705, 101655, 67375, 36305, -247, -20734, -14298, -6873, 18568, -10359, -81669, -108802, -57290, -48270, -8928, 37777, 16124, 61386, 83157, 89297, 38122, 5394, -22524, -945, 95416, 44412, -32203, -76839, -61506, -53712, -53286, -95716, -99033, -129332, -65352, -48045, -58919, -55803, -32992, -71006, -56739, -24739, -5840, -774, 28627, -664, -33612, -10386, 50949, 6653, -49087, -44299, -4155, 58021, 44094, -25235, -40918, -77790, -86655, -62828, -85889, -83406, -64401, -38017, -59034, -75561, -88982, -75492, -64763, -49522, 30630, 45824, 21330, -16050, -38315, -40919, -23296]
16134b3296J3843k8112K774j6318P805O5688O490J2811j7030m201k3496k8284
16122c1326l7882k660M879K0676J6650k0551j7283l422m2851j3896O5582j3264
16110g5348j0518K7186Q6179J3489m8611j4648l4210J7183R293k3772K8899L682
16098b1196n0849K5409L1774M3692L9837k5513m2614k7764L395k324L1000k2242
16086a7395l5538k6030J0927R8803M5837l7532l3649r819m4719n127K626N2559
16074I43L7892l0373l4338k4515L514j2667J3326j5414n0786K242O948k1874M4909
16061h0193M9107Q483j5972M2200L0348m1449L243n0100n799Q1695K0888n2578
16049a0127j8758L2613l1343P808J8369l3423k9376M7294Q2434M8378m4981n1637
$$ y = [-23296, -9453, -37565, -34791, -51109, -43304, 22384, 28874, 41685, 24655, 20454, -3042, -31326, -69208, -71868, -66989, -46313, -29663, -50214, -67497, -70919, -113770, -127666, -62084, -75348, -85866, -58680, 27499, 40988, -7623, -22271, -56481, -39298, -30005, -53777, -24878, -21196, -72045, -46636, -14862, 28830, 68667, 43154, 540, -27224, -23829, -26153, 4847, -17395, -52933, -78963, -68036, 30767, 76604, 39072, 5423, -4396, -49115, -54242, -51616, 943, 38835, 8462, -25876, -50391, -46877, -59544, -46218, -61632, -112418, -110176, -103228, -125102, -80193, -31086, -22603, -38575, 3625, 33973, -7476, -4233, -54333, -60132, 21563, 42451, -10127, -28885, 3728, -27615, -19807, -1438, -34861, -64237, -16943, 65491, 113869, 68888, 17251]
16037A7251k4779K5221k6589l4288j883R5082r758n6105M712M5906k5974l4406
16025b5610L0562l4007j5391M5528K2674K0653N4024R686l0427p4629m1333Q620
16013b9650l7104K5217L5566k5146J9905L5818j6400k3828l3308o750K0608L8918
16001C846l5832j4970L863M1704l2343L431K5310M5847M7336o6674p7228k7952
15989h3662J3776N0013J3129R257j9335L8491J3481n9116m0175L1127O683M9762
15977B3431l1665l9773P081K782J5996j1382L4502m4324k2761J1495l4994J2430
15965g7182L5601N6041Q035K5945k5430l0897K2406j7097n4784J8158J4420j6674
15953d1458J8673K6814k7587o7550K266M2934P9613J1241m3739M68k2618N994
$$ y = [17251, -7528, 17693, -8896, -43184, -45067, 50015, 40257, -15848, -11136, 34770, 8796, -25610, 4952, -29055, -44446, 1082, 23756, 44409, 98433, 108119, 77692, 3063, -38270, -29650, -66754, -41537, -5971, -31117, -11212, 24606, 8206, -15622, -48930, -55680, -35072, 3846, -31986, -46956, -43093, -1389, -33732, -30301, -4991, 40856, 88192, 21518, -55710, -83662, -69886, -19873, -6744, 2513, -16822, 21669, 35150, -23966, -64141, -33014, -26331, 23431, -8234, -48007, -40926, -38144, -22148, -33530, 972, -43352, -66113, -54618, -89612, -77182, -41581, 14460, 22495, 48440, 23010, -7887, 14519, -2578, -57362, -39204, -24784, -41458, -22785, 4029, -23558, -91108, -88842, -45908, 33705, 44946, 1207, 1675, -20943, -14949]
15941a4949O0386j981j7741J6290K4036m2353k6862j8778l442R854J1082j274
15929e732K5531K836J2827n7904M8955k1310n9483o514M674M6510L6209N1493
15917G8092J1405K3641l5643l4171j1007m1997j2465P434J7250L0663J3761m7363
15905d00m3112L932K8851P2781J6728m1107k146j7720k6591l5529L0058K6348
15893A2093m0380K9752M1698j2454n4543K6994K1649L0659k0668n2277l3549J1316
15881c9710j5704R258J1332O411M9663K9893k5619m0994n439K9900J761K746o372
15868G126k4747N0506N0531j1816n9321q335L1938k6086L5038m776n0843O439
15856d346J173K1087k3126J7434J2415L223P062j5407j0173J7208q347k5901n5315
$$ y = [-14949, 45437, 43456, 25715, 42005, 66041, 23688, -3174, -21952, -25394, -15540, -4458, -5732, 19799, 22635, 35462, -22442, 26513, 5203, -54280, -60794, -56120, -9610, 26599, 78092, 89497, 113138, 77495, 43324, 32317, -9680, -22145, -14711, 2539, 33202, 46963, -400, -43512, -39580, -10729, 62052, 78780, 37673, 35527, 17807, -8784, -44313, -14255, 12093, -28287, 1465, 43163, 30709, -23834, 3160, 24809, 55468, 34800, -17477, -51026, -39710, -55414, -46156, -34824, -28413, 21250, 51143, 25524, -15470, -20909, 8991, 10752, 13498, 7126, -17621, 32885, 83416, 71600, 12279, 3944, 35882, 9796, 44834, 40058, -10785, -4346, -3173, 17914, -5212, 12222, 24637, 27860, 34922, 19515, 9342, 26550, 18203, -7698, -63013]
15843f3013Q671L3960L7824K8033j8892k7740m2878J3496N9252M0813l1763l2491
15831E272P641m0812L9075j0415m1885P786J01169J7447o0719m2717j3931K9058
15819c031l0826q1092P020N1006J05857J5228M115l144p2716l0355M8095M7786
15807E7943n103o4189m0667Q806M2205K4353l456K937k1316J7811l56J9634m0312
15794a710O84O47l9361N845O0013j4778p9085m997P7905L3264J9766j8798j1841
15781B7554l62j679l4435m1566M3058J7516L8435J5347k8808K7735l505q7031
15769b7741n2307L5685L6652J0543M647L9636k3761l1688J4721r530n394k1661
15757c0198n1698l6551K2790O134l0328L9184Q5549M3618J6604n3452J869j4267
$$ y = [-63013, -54342, -20382, 17442, 45475, 26583, -1157, -44035, -30539, 28713, 69526, 37763, 5272, 12913, -27899, 11176, 761, -41124, -33338, 67831, 85278, 24559, -18158, -32089, -3031, -33857, -114949, -107929, -56923, 48934, 64162, 68277, 65133, -7583, -37938, 10157, 57943, 52840, -11349, -52016, -43210, -1005, 23348, 19892, 22829, 1513, 19324, 18968, 38602, -1710, -1026, -379, -39740, -33895, 26118, 11340, -67745, -72742, 5163, 38427, 58193, 39395, 27554, 27192, 25513, -8922, -50488, -7430, 10086, 48521, 63868, 35060, 62795, 59290, -27741, -80048, -44363, -7711, 2832, 7479, 47115, 23354, -8334, 6387, -3143, -8537, -30198, -81896, -118447, -95657, -89523, -119851, -80667, 4882, 48500, 65104, 11652, 13521, -746]
15745g46m0181k1773M01L936Q202K8392J2154l742O7388N1602n5800l7989N14
15732A2358K7928M0552l7085l5497k9382m4622J7680M5293l919K6353l8743j9739
15720c8823l0460o4824N1437K3089J9934l2609L144P536j9229O1454K9850j7739
15708g240L1725k3679o0951L9732P8824n720o6061l2474Q005K6998K4922m3529
15696b9448j3930J7690N5936L635J3888j1042o8809l4657J9335K7388Q25k147
15684b1336L9819j9802p0864n728Q968J7198M4500j4299N541j0063m4447L4920
15672c5593K2245Q736M703l3788J3416L6306j2361l1512L7068l8650n1443j4138
15660i5011k4297J6528P0350N1274M3058L3490j8688n0320l8655k596O1555L0865
$$ y = [-746, -40927, -62700, -62299, -58363, -50161, -21769, -9615, -13357, 54031, 105633, 49833, 11844, 12358, 40286, 80838, 43753, 8256, -21126, -65748, -48068, -2775, -6694, 19659, -19084, -38823, -69283, -134107, -82670, -59581, -39647, -72256, -69112, -61576, -80805, -19351, 10499, -7240, 24485, 806, -60145, -20413, 58411, 52691, -13370, -45844, -37839, -10841, 14081, -29448, -43378, -25688, 30248, 33883, 47771, 36729, -32080, -66737, -47402, -20014, -19189, -21336, 18483, -1319, -72183, -77911, -68943, -51745, -7245, -21544, -16003, -26066, -70513, -35593, -13348, -4612, 91, -33697, -20281, 16025, 3664, -27848, 9220, -29430, -80873, -95011, -119308, -102780, -32430, 18844, 61902, 95392, 76704, 26384, -12271, -14867, 46688, 77553]
15648G7553J9234N955k6864j1138k1795L0384l2173m6031J7481J9202n4122o5201
15636h7515L9654Q399J3309O093N6659r588o2175O0794M7488p0473J7597j1512
15624H730M423M1023n0316J6907O415m396J942K429p4147j6495K6326l086n352
15611d5597K6953J1617p018O5410p6273K633l691m0115o3641J0313P3176N3611
15599G378o168j0931O4358M3281k7142j6836K5089L3373P459k8046m3253p1600
15587b3038j8091J3814k6087k9042J9130K061O573J0387M671M2230K9458n933
15575B6133K2739N9098r6856J1090J9874J5555m1983J7861K0182l3842j0557r775
15563d81j8074l9191K2238P0067k7841J0962K7516P825k7652k4483l2108j9465
$$ y = [77553, 96787, 102742, 75878, 64740, 42945, 73329, 41156, -4875, 12606, 31808, -22314, -87515, -47861, -39462, -26153, -20060, 36599, 27011, -35164, 25630, 73118, 2645, 20242, 8730, 13153, 54176, 3860, 20767, 27182, 22786, 24728, 27157, -46990, -63485, -37159, -40245, -45597, -18644, -7027, -14045, 51365, -24908, -22275, -25966, -66081, -129722, -119409, -46233, 7378, 1210, -9721, 54637, 97918, 70776, 53940, 79029, 112402, 119861, 91815, 48562, -23038, -41129, -27315, -53402, -82444, -63314, -61253, -54680, -44293, -39622, 2608, 32066, 26133, 48872, 107970, 11114, 22204, 42078, 57633, 15650, 33511, 53693, 19851, 9294, -481, -18555, -57746, -35508, 34559, 6718, 17680, 45196, 53021, 25369, 886, -31222, -50687]
15551e0687N3338M0926O20k78j4144j6414K9066J9593j8268L428k5860j8208J2816
15538A5928j6474l4123n0166J0048N6231k396m5423K8315l4263l9361M7921N6883
15526f880J3532k7033J6421n878k7539M0778L7929q0717K845l9935n2553L0005
15514i9025L8377r090J0559o605K7656J8522k8908L579L2221M6879k9645l9278
15502c4758m1117j2671L5102L8174N2057J6618k5242k9355j0435L1546k977J0033
15490B6975k5851o861l0673m141K3268j1184k4332M8474O919L0327K8143k2136
15478C8928j1455m5079R632k2792l9522k4840J7933n784O337j8368L2416J8763
15466d3831j5462K4528J5092L2560l9116r5548J0752J04619J8164p391j8717r403
$$ y = [-50687, 2651, 43577, 44197, 43919, 29775, 13361, 42427, 62020, 43752, 47180, 21320, 3112, 15928, -546, -34669, -84835, -74787, -18556, -20952, -66375, -38060, -72323, -111684, -63763, -6880, 6652, -20381, -3960, -9838, -37377, 3401, 41330, -39387, -36542, -76477, -129030, -99025, -60648, -69738, -59179, -65784, -38128, -19606, -48514, -44935, -12714, 34165, 4520, -34758, -75875, -88546, -53444, -15270, 36787, 53405, 28163, -1192, -11627, 19919, 16942, 26975, 1124, -5737, -36410, -40551, -17283, -28467, -52799, -4325, 2594, 32921, 61064, 38928, 27473, -17606, -7974, -30766, -70288, -95128, -77195, -82979, -76642, -95010, -62594, -43831, -59293, -34765, -19673, 12887, -26229, -121777, -111025, -6406, 11758, 4367, -14350, -23753]
15454b3753j4148j140K9690L4110n881k5892l0168l0603o7335j6542k5437k3901
15442b01000K5577L8766L3045K4895Q714Q999M203k6986m460L3454K1442M2233
15430H882N8018Q9664j6502n2947k0687m740l9688k489k0126p717n08q3213p617
15417i9670O3185J7629m4406j1695M4247K6393j0921N991j5186m5790K0432J1333
15405c8458K3699r687N297j7250j5517q950K0606K4343O3548n0654L761j2405
15393a1667O5905P629k9733k0288r212r3364p252L7761K7119L4016j984l6285
15381c7355K3335M6273L0796l7607m2815j7893J5228n3475M6484J5134k9466l1838
15369g3199R74L038M885M967j4283k811L807K0908m175n6330p68M3373N5845N3642
$$ y = [-23753, -37901, -39041, -9351, 24759, 18878, -7014, -37182, -67785, -135120, -151662, -177099, -201000, -175423, -136657, -103612, -78717, -70003, -61004, -56801, -83787, -88247, -54793, -33351, 8882, 66900, 156564, 140062, 87115, 66428, 61688, 22000, 19511, -615, -8332, -8840, -92053, -99670, -36485, -18856, -63262, -74957, -30710, -4317, -15238, -9247, -24433, -70223, -49791, -38458, -14759, -24446, -19149, -36399, -51916, -60866, -40260, -15917, 47631, -3023, 738, -11667, 54238, 61867, 32134, 11846, 2634, -90730, -97982, -60221, -33102, 914, -1070, -37355, -14020, 32253, 63049, 25442, -17373, -35266, -20038, -73513, -27029, -11895, -41361, -73199, -72225, -69187, -64302, -59335, -73618, -76429, -72622, -51714, -55889, -112219, -112987, -69614, -13769, 39873]
15355C9873j3585q2729k4317j4227K8162M623l710p915p841j4777L9982L8703
15343a7758M0720K1601j6990n8922L3190o099l2642l952j7510R432P196m2984
15331h4718J4379k533j3783O2033K8776L0121R420o4992m7670P419L6788N6132
15319C1372O019o02K3787R683j3147l9097j0017r581m760M0129L6677L9298M21
15306A10182j8206j2751p3432o3049j3861M2696J6399O2700q049l4926O249j0776
15294C176L3097L6204m3022o0017l4484N9972P8k5917J947O1336J5661L2798J2072
15281I2901m0301k5555k0113k9217L740k2505k4183J9870K1329L3775n5844J1898
15269c4205N4180j192m4515L047l037j1654R927M0424Q9299J4403j19687o9922
$$ y = [39873, 26288, -56441, -80758, -94985, -66823, -62200, -65910, -73825, -81666, -96443, -56461, -17758, 22962, 44563, 27573, -31349, 1841, -4258, -36900, -40852, -58362, -48930, -41734, -84718, -70339, -72872, -86655, -24622, 4154, 34275, 43695, -21297, -68967, -61548, -24760, 31372, 37391, 36789, 60576, 70259, 57112, 18015, 7998, -1583, -6343, 33786, 70463, 109761, 110182, 91976, 79225, 5793, -57256, -71117, -28421, -12022, 50678, 42629, 7703, 13952, 3176, 36273, 72477, 29455, -30562, -65046, -5074, -4996, -30913, -28966, 32370, 48031, 80829, 92901, 52600, 27045, 6932, -22285, -18545, -41050, -65233, -45363, -24034, 9741, -46103, -34205, 19975, 18783, -25732, -22685, -25722, -37376, -27449, 12975, 102274, 116677, -3010, -72932]
15257g2932j4966M405L7120Q367J222J3917k7760k2417N419l0708K8125R4j8465
15244h8579j0808L5148l943J5217L2453J4315k6027j620P9196L1893k5659m5334
15232F252N8374m1188j9017O722j3312o565j408j6330m712m3639J2213N7166p823
15219a3267j9893k3565l1804k2104K5555K4170j2064l3179m688L6860J823k7933
15207a00089j0592M2615J6317k6836J7949J6874K0402N770L7494Q594L3777j758
15195F0517j5733p3600j00551m7629q462O1765N5725Q8942K0894J1965K193k3731
15183C2295o1027j1706L3826l2426l073j513M568K5849k6885l8495K7145L4339
15171a7103L6637k7571o588k1963q9k0541J7718N3807k239r855J5159r363l1238
$$ y = [-72932, -87898, -83493, -46373, -38006, -36784, -22867, -50627, -73044, -67625, -98333, -70208, -70114, -88579, -99387, -64239, -68182, -52965, -20512, -6197, -32224, -33844, 45352, 77245, 51586, 6252, 64626, 23438, 4421, 11143, -2169, -8734, -10142, -26472, -31184, -74823, -62610, -5444, -13267, -33160, -56725, -88529, -110633, -85078, -60908, -72972, -106151, -110839, -73979, -72156, -100089, -110681, -68066, -51749, -78585, -60636, -43762, -23360, -17590, 19904, 28498, 62275, 60517, 44784, -28816, -129367, -176996, -185458, -123693, -67968, 20974, 41868, 53833, 56026, 32295, -28732, -40438, -6612, -39038, -42111, -43624, -39056, -13207, -40092, -78587, -51442, -17103, 19534, -8037, -14625, -36588, -36677, -57218, -39500, 14307, 12068, 2213, 17372, 8009, -23229]
15158b3229n0507j0970l8534l6463O4981J40085M0016m6123m2500m1396J0911
15147c3729m9375P636O0877N2044l9133j6408p574n2288k0369M8875K1779k4944
15135e2609k1732O1802J06442L1211k4501o4290j8486K2181J2243j337N828k9757
15123B6995m4062L2326K3321J2095O670m1501j4522J2372K8061J202j0238R164
15111D1883o130m6303K2883j171K4360j3964P05k7610M3439K3441j179o2445L0976
15098B8885m2865l3649M1303n4235J4917Q6100R0735j8862n2017m1665l9063Q034
15086a2382M0846J4210k0814k0475l852O9738r3k2852k3480K715M1638k6612l4431
15073D156J9650m8827K3694L4438m5380j6642l500K8771K3881j1124j3226K3749
$$ y = [-23229, -73736, -84706, -123240, -159703, -94722, 45363, 85379, 39256, -3244, -44640, -33729, -83104, -75468, -14591, 37453, -1680, -18088, -25662, -77950, -98319, -49444, -27665, -52609, -74341, -12539, 93903, 125114, 100613, 36323, 17837, 40018, 52261, 50924, 56752, 26995, -17067, 15259, 38580, 50675, 57345, 15844, 1322, 13694, 41755, 42957, 32719, 41883, 35753, -10550, 12333, 11162, 35522, 21558, 22263, -5347, 38092, 61533, 60354, -2091, 28885, -13980, -47629, -6326, -60561, -45644, 40456, 131191, 112329, 60312, 18647, -20416, -12382, 28464, 42674, 21860, 1385, -2467, 67271, 67178, 44326, 20846, 23561, 65199, 38587, 4156, 23806, -25021, -1327, 33111, -12269, -28911, -32411, -3640, 20241, 9117, -4109, 19640]
15061A9640o2372n1618O838M1547L1079p894n4335o4906O413L7869L2918K0064
15049d4757N6749J4453r517j4479j794m6271P179N476K0020k0548k7476j7115
15037g8080Q450j93k163j0757o9476J1242L2654Q3177Q8432P99p4642m4918j3440
15024f8915M7372J7001k0643J7861Q76J0515k0912L1282m4848l0898k09L6876
15012b4642J5288L2546N1147l191l5831M5883L1335k6020j8058k5455k8868k6574
15000a2440L1692M6829R476k5129k8547k7471l6196L9534L6113O162k5128k4284
14988i389L0169L7756j1637k8817n0948l0999j4040j3426j7294j8420N161L6141
14976h5743O7795M4604N6292K8276L3948l487l7819M486j2346l8706K338L3649
$$ y = [19640, -42732, -94350, -87512, -45965, -14886, -22780, -77115, -142021, -135608, -97739, -64821, -44757, 11992, 26445, 16928, 2449, 655, -45616, -38437, -32961, -12941, -33489, -60965, -78080, -69630, -69823, -71986, -82743, -152219, -140977, -108323, -25146, 63286, 64085, -10557, -55475, -68915, -21543, -4542, -25185, -7324, -6448, 4067, -16845, 14437, -30411, -61309, -61518, -24642, -9354, 23192, 74339, 71148, 35317, 81200, 112535, 86515, 68457, 43002, 14134, -12440, 19252, 66081, 75557, 50428, 21881, -5590, -41786, -2252, 33861, 40023, 14895, -9389, 20780, 58536, 46899, 18082, -32866, -63865, -77905, -91331, -108625, -127045, -121884, -85743, -17948, 26656, 82948, 111224, 145172, 141685, 103866, 108352, 96006, 57300, 59638, 93287]
14964I3287L6450j0324M4892r076l1368n1796m430j4149k7389m5582j522O105
14952a4902J843N28p0393j9373K0918K7710Q628K3363J4276k0472J1452L494K5517
14939A2589k1853l5928L3295k1251J0703K5035K0608j1317o4553n9253L9039j8561
14927i1447J4321K7424L875j920J970K8923L5426m2767m7998n369N0788K0747
14915f027j3773n694N1009l0077J9253P501j4281o25m2449l8906R150j4596N7854
14902b1661M2822j9275K3544O9620O800m1798o3417l213K4691l0095m7211J5439
14890d3754M1322M7131l2513K3163m452n0112j8518j1562R067K8518p640q623
14878b7973k591k1009k6328J8330M1717J0697p2133p147J8915L5603N3235j1323
$$ y = [93287, 129737, 119413, 164305, 155229, 123861, 72065, 67635, 53486, 26097, -19485, -21007, -14902, -13059, -12531, -82924, -102297, -81379, -53669, -45041, -21678, -7402, -27874, -16422, -12928, 12589, -9264, -45192, -11897, -33148, -22445, 2590, 23198, 11881, -52672, -111925, -72886, -91447, -77126, -49702, -45827, -47747, -45777, -16854, 18572, -24195, -72193, -77562, -26774, -6027, -19800, -25494, 25515, -4562, 14691, 22192, 7911, 7286, -35163, -74069, -64919, -79515, -21661, 21161, 1886, 25430, 95050, 101850, 60052, -3365, -6578, 18113, -11982, -59193, -43754, -2432, 44699, 12186, 35349, 30897, -19215, -37733, -49295, -40228, -11710, -19350, -27973, -30564, -51573, -77901, -59571, -17854, -7157, -79290, -86437, -67522, -31919, 21316, 9993]
14866I993L6074M5638q544k0456n9305r832n9198m5275j2741M0738P0872Q960
14854c076L9787R7102K6422p4874m7375j3735Q7239n369q0924l2830N9582k0261
14842C1688n7116m0302j9610n876K2161N2856K6730J1376M9744M9643k5374r6353
14830d33r702J5204M285M4007j6007n1523k8483P018N7984M1498J8369o8500j3935
14817b18l8659R3M8383o163J3807J1641l839O579J795K4782K3949O8076m1060
14804A09166q1334n6964j3446L0961l5976K6162L9803M0059l8248l0209k5570
14793c5596l6306J0447L9598L1360Q895K2545P586r809j7651l2630l0895J0219
14781c2237P878O4920k0009k5159m550q0821q674M8247Q2380K4900k7488o2105
$$ y = [9993, 46067, 91705, 83161, 62705, 3400, -6432, -65630, -110905, -123646, -82908, -12036, -3076, 36711, 133813, 160235, 85361, 37986, 24251, 111490, 106121, 25197, -7633, 51949, 31688, -25428, -65730, -85340, -91216, -69055, -16199, 10531, 21907, 71651, 121294, 95920, -433, -10135, 5069, 9354, 53361, 37354, -14169, -42652, -35634, 22350, 63848, 82217, 13717, -218, -38877, -38784, 9599, 3436, 17243, 28884, 25045, 31624, 33419, 58201, 82150, 150226, 109166, 27832, -29132, -42578, -11617, -47593, -21431, 18372, 58431, 20183, -10026, -35596, -71902, -61455, -21857, 9503, 18398, 40943, 48529, 38720, 21069, -11561, -42456, -32237, -24359, 40561, 20552, -4607, -9157, -89978, -98652, -50405, 31975, 56875, 29387, -32718]
14769c2718m5944l9215K9036k0518O599L1272L696l0059L3465K9040j5385K1456
14757b9275L7480L6762O1458m7207k6197J5501k028j5623n2590O4650K3820J6817
14745H3568k3552l7518k7547K2038N4277M831l6690L8746L8872n532n5237M9793
14733A06049M870m7858n0360J0148L5729j8339P095N0278r089j8069j7215m0599
14721A2640k151K5146R530m3182K7957N99j1925L5851K8391k9913k8268J7709
14709D2384l1986l7518O5862J0688o4731o000M2642L6824k9549O906M3811n528
14697G3805r341j3313k0018j4561l9338m8544J7352L8228l096k0196L9923O8741
14685F9642j2031L496k6601R192j8564q0593m2992M5714K007O7426K3522r8795
$$ y = [-32718, -78662, -117877, -88841, -109359, -102760, -71488, -67792, -97851, -64386, -35346, -50731, -29275, 8205, 44967, 106425, 59218, 33021, 48522, 46494, 30871, -21719, 42931, 66751, 83568, 60016, 22498, -5049, 16989, 71266, 76097, 39407, 78153, 117025, 111493, 56256, 106049, 110919, 63061, 12701, 22849, 58578, 40239, 47334, 97612, 88523, 70454, 53239, 12640, 10489, 35635, 45165, 1983, 29940, 30539, 18614, 54465, 82856, 52943, 24675, 42384, 10398, -27120, 38742, 49430, -15301, -21301, 21341, 58165, 28616, 35522, 79333, 73805, 64464, 51151, 31133, 16572, -22766, -71310, -53958, -15730, -18826, -39022, 901, 69642, 57611, 61107, 34506, 43698, 25134, -55459, -98451, -52737, -50730, 16696, 40218, -58577]
14673e8577L294K695O6747K5377j0206r7552m6105K6385O6515P0279j9447l2641
14661c236l3803l947J6811O919n856L8977N1859L7377m1019k3463J6026L2102
14649H8747j9786m2903j8634J1740j0854j4047k8062k4793p4803J7057N9366L813
14637e3159M2474L968o4620p9752P4333K4925L0554N9347L0324r643K4850J7265
14625A00866k5002j2435m2391n9296q445P565L233J5669K3920j7804q796P111
14613a5805J3749L9180J2258k1374k7994k6754J9815j4312J043J8059j1719O893
14601f961j6207j9354J1594J2607J5098l9132K6964Q800n1855J8052o147K782
14589d3759M4924J5124m9699m7057M9955O0708j859N27M0649n877n9188k406l782
$$ y = [-58577, -55283, -52588, 14159, 39536, 29330, -68222, -114327, -87942, -21427, 48852, 29405, -3236, -37039, -40986, -24175, -17256, -23112, 15865, 67724, 105101, 64082, 40619, 56645, 88747, 68961, 26058, 7424, 19164, 8310, -5737, -33799, -58592, -133395, -116338, -56972, -53159, -10685, -6717, -71337, -151089, -76756, -51831, -21277, 38070, 68394, 58751, 83601, 100866, 75864, 63429, 21038, -38258, -46703, -39138, -35905, -20236, 3684, -14120, -22916, -15805, -2056, 37124, 49382, 28008, 14, -26740, -6925, -21237, -20194, -2135, -13854, -6961, -23168, -42522, -30928, -18321, -3223, -42355, -15391, -6591, -58446, -40394, -46541, -43759, 1165, 16289, -33410, -80467, -30512, 30196, 28337, 28864, 69513, 63636, 4448, 2042, -1740]
14576a740n531P033j786n734m1637Q166K0449N5287J6381j3040L5976K1190R327
14563A04341K5227p932Q169k9629l1830l6676k0600K1565P381j8840j006R1818
14551A11988N242m284o2j8743m7812k90l647p685o3626o062K3515k2434o79m6264
14537h0843J9361M2416l3237o348K5206N1272J7614j5112j2544j5087L9170K1784
14525E3652l4090j754j5665R075k6537K0078L10j0880O451K917K2281Q437n202
14512B9073j7824J6130l2575l5887r971M0571k3220M7764M5251k0988k4386J0039
14500B3977K5891O143J4723R254l6448l5448k5175J3068j9158K6010L0296n231
14488B7902L0668n459O665l4687n900Q075k1799p628j2820L3148k4726l0101K1300
$$ y = [-1740, -7271, -238, -2024, -7758, -49395, -41229, -20780, 34507, 50888, 37848, 73824, 95014, 104341, 129568, 121636, 129805, 100176, 68346, 31670, 11070, 32635, 40016, 21176, 20170, 111988, 117230, 112946, 112884, 94141, 46329, 46039, 42392, 34707, -28919, -34981, -11466, -33900, -34579, -80843, -61482, -19066, -52303, -58651, -33445, 17827, 35441, 20329, 7785, -7302, 31868, 53652, 19562, 17808, 2143, 11218, -15319, 4759, 5069, -5811, 640, 3557, 25838, 34275, 29073, 11249, 27379, -5196, -41083, -51054, -10483, -33703, 14061, 59312, 38324, 13938, 23977, 49868, 56011, 70734, 79988, 43540, 8092, -17083, -4015, -23173, 2837, 33133, 27902, 58570, 53111, 59776, 25089, 19189, 27264, 5465, -2163, -14983, 18165, -6561, -36662, -15362]
14475a5362n0683j5506K3435L2163K4582J2491n516N625N399j4382j6811k0703
14463c5268j3124N9161m7648K1669J8912r821j8702L7695L862m7555j8293N3364
14451D252M4782Q949l4055j4728M961l7675K2055k6436o5380k1222L5203K835
14439g6459J7040N6915J9293L0082R985m6061q7265k2383K3433J0043L7958M6432
14427A9013r753m098M4166J1027l4774l3393p828J517M680J4697q67Q763n5185
14414d2035K4301J1781M1995k2595M4259j2864M043L8468K2604l2825n3164p8802
14402e4834n9684L1400M1456K9557K1093J9031j3238M2281j5244o7714k7226j1247
14390f4369j3529Q424j3911N8852N8565O657m1262p5929m6882M3222K4027k6738
$$ y = [-15362, -66045, -81551, -58116, -25953, -1371, 11120, 5604, 11229, 16628, 2246, -14565, -35268, -48392, 10769, -36879, -15210, 3702, -6119, -24821, 12874, 16736, -30819, -49112, 4252, 49034, 57983, 23928, 9200, 14161, -23514, -1459, -27895, -93275, -114497, -79294, -76459, -59419, -2504, 16789, 46871, 56856, 10795, -76470, -98853, -75420, -65377, -27419, 19013, 9260, 5162, 49328, 60355, 25581, -7812, -15640, -14123, -9443, 5254, 4387, 13150, -42035, -17734, -5953, 36042, 13447, 57706, 44842, 48885, 87353, 109957, 77132, 23968, -54834, -114518, -83118, -41662, -12105, 8988, 28019, 14781, 57062, 41818, -25896, -53122, -64369, -77898, -69474, -83385, -24533, 34032, 40689, -573, -76502, -123384, -80162, -56135, -82873]
14378h2873Q052L9443K5033M3875p218P66K1838J1849m1761l9511J1720l7255
14366d6042j4160K5153O1498L8562M5283K398p6715k9533J1603R349Q353K3745
14354E9494J2458L6408j347r4979J0543p247J6620J6512j0962k6917l1989J2134
14342i272M0036Q376j2640O347J5835j4317N798M0240o650o9920o5578M7661O8566
14329E4482J5148l4446l5825j2401l0788M3252M9466o0539P986k4901p8152J3046
14317i3672M7408L6644o902l4235K832j9380M1996O7174M3819K2667m0385m6782
14305B1184j8801k4126J2078J4455J7302J9330k2433n9093k5873J7506j2223J6034
14293d4660K0947j8975o2951m7496N6219K8410K4200J1516R243l3103J0940N2466
$$ y = [-82873, -74821, -35378, -10345, 33530, 26312, 27078, 48916, 60765, 19004, -20507, -8787, -46042, -60202, -35049, 26449, 65011, 110294, 112692, 35977, 6444, 18047, 27396, 35749, 59494, 71952, 108360, 107013, 12034, 22577, 15330, 31950, 48462, 37500, 10583, -21406, -9272, 30764, 39140, 26500, 32847, 48682, 34365, 40163, 80403, 73753, 3833, -61745, -14084, 54482, 69630, 35184, -641, -13042, -43830, -578, 48888, -11651, -3665, -28566, -106718, -93672, -46264, -9620, -16522, -50757, -47925, -67305, -25309, 41865, 85684, 108351, 67966, 21184, 2383, -21743, -9665, 4790, 22092, 41422, 18989, -40104, -65977, -48471, -60694, -44660, -23713, -42688, -105639, -153135, -96916, -68506, -44306, -32790, -23547, -56650, -45710, 6756]
14281F756J5622q228l8072l3184J4817k0042J7547J7971l4513N6858N419k925
14269a974k7084l3310M0291j1720R229L3724q263k5393J4437Q500O1613j1730
14257D8320p3093K4020j3137K7329K6613o8112L071m3209j7187j3615j4120J2444
14245a00676Q2631K3929k3144j1856J0688j281l4771O8615M8345M027o615m6522
14233A3370P854J8424j4191M9842L5514l9093m055L636r170o3246l6831q1706
14221a19652j7681J1208M2027n247K2846P9681J7572k3744l2387M839L4188Q850
14209B2500J6673J690l8896m948K2991r154j2161j1121q042J7190Q762m2645J8033
14196a9128K4534n3188k1778J6801j8393J289k3688j5585Q468M8908r926j1380
$$ y = [6756, 22378, 14150, -23922, -57106, -42289, -62331, -44784, -26813, -61326, -4468, 951, -1974, -29058, -62368, -22077, -33797, -24568, 9156, 893, -24500, -10063, -1563, 60050, 48320, -24773, -753, -13890, 13439, 40052, -28060, -24989, -68198, -85385, -99000, -113120, -100676, -18045, 5884, -17260, -29116, -18428, -19709, -54480, 14135, 62480, 66507, 59892, 13370, 21224, 39648, 25457, 75299, 110813, 71720, 67665, 71301, 62131, -1115, -37946, -119652, -137333, -126125, -84098, -89345, -66499, 13182, 30754, 7010, -25377, -20538, 13650, 22500, 39173, 40863, 1967, -2981, 20010, 10856, -1305, -12426, -20468, -3278, 5484, -37161, -19128, 5406, -47782, -69560, -52759, -71152, -69863, -93551, -109136, -100668, -51760, -61686, -73066]
14184g3066J4185N3099J3893j18070n4248K5390P8508N3509J5330K2638L7541
14173F8709l449j1617m9982p999R857k8668p837J5371J9511k1027m9823m8212
14161a15166k7817K7600N6749P2133L3430M2462K6588m6676m6194o6436j7702
14150f1029M5474N2570J7026L2952k2482m6392k4058M292K4374j9570l4263M7447
14138A6341J1445J857j5005Q224l2081K1040J7208l721M4752K209J7894k2006
14126F8157n1305k3598J891Q546q623l4901R476R886q747K3470J4658j6278L3470
14113B6102L493J3128J1901q1958n1047m963K1621l010N6913J3462K2430l3254
14101e182m2320j6464L7902N5236J3342k3773j6298l592N1020J6745M232q8799
$$ y = [-73066, -58881, -5782, 8111, -109959, -164207, -138817, -60309, -6800, 8530, 31168, 68709, 65260, 53643, 3661, -4338, 5519, -23149, -30986, -15615, 3896, -17131, -66954, -115166, -142983, -115383, -58634, 13499, 46929, 89391, 115979, 69303, 23109, -43327, -61029, -15555, 37015, 54041, 86993, 64511, 18119, -5939, -1647, 22727, 3157, -31106, 16341, 27786, 29643, 14638, 22862, -9219, 11821, 29029, 25308, 70060, 72269, 90163, 68157, 16852, -6746, -4855, 3691, -4932, -39833, -30357, -20471, -29218, -5748, 8910, -7368, 26102, 29595, 42723, 54624, -27334, -78381, -83344, -61723, -64733, -7820, 5642, 28072, -5182, -47502, -63966, -26064, 29172, 42514, 18741, 2443, -1149, 49871, 66616, 70848, -17951]
14089a7951n1902L6511k6736l1068l1354R358O2052J0892j0376m694J2843K0138
14077b2287J2066m7784j7786N9069J6685l7206j2218L3606P1363Q4563m5041r0391
14065D639k7129K3410j7976n0262J4313O3145j6336K0019J5129L105l0713n580
14053d236k0140l1125o6275o329L4466O2583O8096M2037K3785o194k6166k9558
14041D0944k1595M468k7808m1417j4934K5336J1666j0447L599P0486J6892l9096
14029A8094J2411K2040M488J1933n1651J1797m7900k0040L1185j4610p8586N0551
14017e0288O9835l2775r433J5348o0201k2188p853k7233j9509M3304P8236L1671
14005H914k4843k0662m9846P527M6461j038K8322j917l1871l5234l764j4265K0866
$$ y = [-17951, -69853, -33342, -60078, -91146, -122500, -113142, -51090, -40198, -50574, -55268, -42425, -22287, -10221, -58005, -75791, -16722, -37, -37243, -49461, -15855, 55508, 140071, 95030, 4639, -22490, 920, -17056, -67318, -53005, 10140, -6196, 13823, 28952, 32057, 1344, -4236, -24376, -55501, -121776, -128105, -93639, -31056, 37040, 79077, 102862, 96668, 70502, 40944, 19349, 23817, -3991, -45408, -60342, -35006, -23340, -33787, -30188, 40298, 57190, 18094, 30505, 52545, 57033, 68966, 17315, 29112, -18788, -38828, -7643, -22253, -100839, -50288, 19547, -13228, -22661, -7313, -67514, -89702, -97555, -124788, -144297, -100993, -22757, 8914, -15929, -36591, -86437, -78910, -32449, -33487, -5165, -7082, -38953, -74187, -77951, -92216, -71350]
13992g1350Q3002o945k9051O136N3511K6029k1286K6991l413k5542j88M969m5894
13979c031n2371J2646N46J3216j8988k4843K575R199L182P070p274o546n788L6219
13965c4188L1427l46K5815L6155J0716n4995k8646m453L773j7920j3025Q236K943
13952c4508J55K581l9843J0300R968M5996m5552p4731L9652N5877L9590l3346
13940b3861k8825M3496Q2553j8051M6241J7316L6211L186o2699l7328l3476q1620
13928e6857k0617K6667j5469M5593K0374L448n710j7358j7743Q142K8005J8330
13916A6805n0563j4824L9986J9773j5640m157K1279J6364j8166l1275L2404k85
13904A1701J5777j4696N471N0370N3792l5177o4222m7446Q59L4857J9525j1626
$$ y = [-71350, 11652, 4707, -24344, -18208, 35303, 61332, 40046, 67037, 63624, 38082, 37894, 42863, -3031, -55402, -42756, -42210, -28994, -47982, -72825, -70250, -61051, -57869, -50799, -58073, -64619, -70407, -34188, -2761, -3107, 22708, 58863, 69579, 14584, -14062, -18515, -14742, -32662, -45687, -37451, -34508, -34353, -31772, -71615, -61315, -51347, -5351, -50903, -125634, -85982, -30105, 9485, -23861, -52686, -9190, 73363, 55312, 101553, 118869, 155080, 158266, 95567, 58239, 24763, -56857, -77474, -50807, -66276, -20683, -309, 3139, -2571, -19929, -37672, -29530, -1525, 16805, -33758, -48582, -8596, 11177, -4463, -8620, 12659, 29023, 10857, -20418, 11986, 11701, 27478, 12782, 18253, 68623, 122415, 87238, 23016, -24430, -23571, 11286, 30811, 19185]
13892A9185K3400K7045Q712m1612l015l4066k8132l1511j42K4988M04P051M5472
13879A7779L1184l6058l2684k9784J7323l8434k4625L0598K6275L6045L6097L8261
13867G1977N2250n0382r2797m3937L0674M3347R466n2041m9092m8483K5924K5305
13855g7789N2219J843r208M0769R4222L6215k4479m0643o4781j2758n7469L9625
13843b2234K025K0971J5097k2295j4885L8452n1872l947M3142j0224p565m4094
13831e7429k1343K3525K9243O3840P5980l6541p7657m9257k8875m6266M144l8582
13819a59218K2694M9018M6621M0456k6027r557j2743J905o121j6754K0538r073
13807e8261m4910M7542l1852J824L6200N6855j7490J8090Q1307Q619j3712m2777
$$ y = [19185, 42585, 69630, 78342, 36730, 33715, -351, -28483, -59994, -60136, -35148, -34744, -27693, 17779, 48963, 12905, -19779, -49563, -32240, -70674, -95299, -64701, -38426, -2381, 33716, 71977, 124227, 73845, -18952, -62889, -32215, 11132, 20598, -31443, -80535, -129018, -103094, -77789, -25570, -23727, -32935, 7834, 102056, 138271, 113792, 73149, 8368, -4390, -61859, -22234, -20209, 762, 15859, -6436, -21321, 17131, -34741, -38688, 4454, -5770, -13335, -57429, -78772, -55247, -26004, 37836, 113816, 77275, -382, -49639, -78514, -124780, -120636, -159218, -136524, -87506, -40885, -429, -26456, -36013, -48756, -46851, -52972, -69726, -49188, -58261, -103171, -55629, -87481, -85657, -49457, 7398, -10092, 7998, 89305, 97924, 84212, 41435]
13795D1435m1923j0233J4785K8879K0132K7058J0379J5776q391j8135j3972k2304
13783D3486p145L791L2787N080J4876j6474j1446k0454l6397k978j0413l3780
13771c9067l4967M4888K4187n187R6J0745J3734J1859L4910k2052l3855j1173
13759e882n17M4141n6758n5397l163O0799K3394K4054n558n4387J4181L2691N891
13746B3489J8169L2938K2508J855k5311O26l751j4037n4439l2782K3314J0581
13734C160j9775L7k8009k598k7089K9708j0629M0804R9350J7511j0226o8205m94
13721B3545O016p7765k6898K4575K2033K8201n8313j6667M7054L6218M522k7637
13709a5116k5915K0951J0276K931M095K9420n1857M514l48L4939K0246n628P494
$$ y = [41435, -488, -10721, 4064, 32943, 53075, 80133, 90512, 106288, 97897, 79762, 65790, 43486, 36341, 40132, 72919, 77999, 92875, 76401, 64955, 44501, 8104, 5126, -5287, -39067, -74034, -29146, -4959, -10146, -10050, 695, 14429, 26288, 61198, 39146, 5291, -5882, -6399, 37742, -19016, -74413, -77576, -16777, 6617, 30671, 25113, -29274, -15093, 17598, 23489, 41658, 74596, 97104, 98959, 73648, 74274, 70523, 56486, 2047, -30735, -7421, 3160, -16615, -16578, -44587, -47185, -74274, -44566, -55195, -14391, 84959, 102470, 92244, 24039, 23545, 29561, -48204, -75102, -50527, -28494, -293, -58606, -75273, -28219, 7999, 12521, -15116, -41031, -20080, -9804, -6873, -2778, 26642, -25215, -20701, -21049, 13890, 34136, 28508, 36002]
13696C6002q8785K3298J7658l9961J8687M9560N5341M9604o028m4686M200m770
13684G0120k2960N5406j3421m4755l8146j2736J5763O2266L6946n5026j4699J6257
13672E5015o0057m2241l5519O116L6407L5416N6982J9900K4465j4542o411j5565
13660E9966j7947l4448J3219l279J7635k8114N004L33m261M398j9536P192L4279
13647C4441M3287o267J2107N224r136l141m2172k4503n284m1421K7549J7567j5354
13634g103P81K7622J4918J3820J9395k6789j9172J1726L6576m6969r734L4450
13622D9521J5491R54j487k7933j6347m754M761M3412M2859l3951J0261L8480m167
13609A17100m6769m0959l6538r493m1184j5993K6350O7079J5082m8346l1676Q536
$$ y = [36002, -52783, -29485, -11827, -51788, -33101, 16459, 71800, 121404, 115376, 70690, 74890, 70120, 47160, 102566, 89145, 44390, 6244, -6492, 9271, 71537, 108483, 53457, 38758, 55015, -5042, -47283, -82802, -76686, -40279, -4863, 52119, 72019, 96484, 81942, 75531, 59966, 42019, 7571, 20790, 17511, 35146, 7032, 12036, 12369, 8108, 12506, -7030, 162, 34441, 77728, 71461, 83568, 88792, 79656, 76515, 34343, 9840, 4556, -36865, -9316, 8251, -7103, -6322, 21300, 36218, 50038, 69433, 42644, 23472, 35198, 71774, 24805, 15071, 49521, 65012, 65966, 64479, 36546, 20199, 15445, 20206, 63618, 106477, 72526, 82787, 121267, 117100, 70331, 29372, -7166, -16659, -57843, -73836, -47486, 19593, 34675, -13671, -45347, -36811]
13597c6811M4533K061l4443N522j287N5041K3520K4973n140q0983m8248J8258
13585c3004M4684j2911l8352J1153j2724J9599J7432k1947J2152O4274L9315p3563
13573A6108p0340J4554K9231J8719r802J0647J6712n8167m9108j8872Q2200Q8469
13561G0351j6629o3201o651l8483k0900O7479M6646L6425K650j1751p6312q800
13549a9176M3400J7595q5035M142Q6559l63J746L464l2952J4165j607j5026m2087
13536b5175L4997M9896o7555l8368J5870m1321K115N2501P3748K310O2639j2230
13524A09427p8885p8569Q37N5398k8295J7567J1102l4543L1510O8849m3499m6687
13512a5788j5964M3615K5350L0176K3589K1819l1008m5097L909J8387k8575J3499
$$ y = [-36811, 7722, 9783, -24660, -19138, -20425, 34616, 58136, 83109, 77969, -3014, -51262, -33004, 11680, -1231, -39583, -28430, -41154, -21555, -4123, -26070, -13918, 50356, 89671, 16108, -54232, -39678, -10447, 8272, -1530, 9117, 25829, -32338, -81446, -100318, -18118, 70351, 53722, -9479, -16130, -54613, -75513, -8034, 38612, 75037, 77687, 65936, -10376, -19176, 24224, 41819, -43216, -39074, 47485, 47122, 48868, 52332, 19380, 33545, 31938, 16912, -25175, 9822, 59718, -7837, -46205, -30335, -71656, -69541, -17040, 56708, 59018, 121657, 109427, 30542, -48027, -47190, 8208, -20087, -2520, 8582, -25961, 5549, 74398, 30899, -15788, -31752, 11863, 37213, 67389, 90978, 112797, 81789, 36692, 40601, 58988, 30413, 43912]
13500D3912Q0868k3468n7692m1121p5718m0992M9871M8630K9053L0243O3432l2060
13488G4958q6076k9925k22o156n027K0654m951K3780K4939l8630L7316J8407n791
13475B3276L2576J6954J5420k0818q9649j0880J7766Q668q32l7603M4325K6572
13463B5775J5622m4729m722J3301l1838o2204K2313N7782J1697J5134j6088k1583
13451a9540j3531L7374K9672l7282Q998M9252J8958n2609k2470L0489J5264k6840
13439A7735l3062K4334M1968l3278l0593J4082n7397M784N9807J2735j6251P004
13427A1868M381K6342L3010L6459j4234m3306J2167l7904k9078O484M6176j0832
13415D1533j0061l9301Q52J2398n869l5399m7299J9102J6868P875R292L771k998
$$ y = [43912, 124780, 101312, 43620, 2499, -73219, -114211, -64340, -15710, 13343, 43586, 107018, 74958, -11118, -41043, -41265, -47421, -52448, -31794, -36745, -12965, 11974, -26656, 10660, 29067, 23276, 55852, 72806, 88226, 67408, -22241, -33121, -15355, -6687, -7519, -45122, -797, 25775, 41397, -3332, -8054, 5247, -26591, -88795, -66482, -8700, 2997, 18131, 2043, -19540, -33071, 4303, 33975, -3307, 5691, 54943, 73901, 21292, -1178, 29311, 44575, 17735, -15327, 9007, 50975, 17697, -12896, 1186, -56211, -51427, 8380, 21115, 4864, 11868, 16249, 42591, 75601, 112060, 97826, 54520, 66687, 28783, -295, 6189, 52365, 41533, 31472, -7829, -6977, 5421, -448, -35847, -83146, -64044, -47176, -39301, -30009, -26238, -29236]
13402b9236J6613M3660O0110j4253q1541k6505j4890n5248k1144M5262q122n3647
13390a38941M6769Q2293K0981k3845K2310k4572k7665K9862m305j1909n056L3828
13378b50L6113M953k0777k073k599p711L519K7545j8797n4021n566m4426r827
13365i3917j3375L1050K1069J6323J3095k9933L2520M2013j3976n1489o6786K7085
13353h6321P2260k363r597l143O355M7699O0873n2816m1484j4294n167J3904l5993
13340e0087R726j4130j8861J5299N9706r697n7749P848R5634M5000N1045k3973
13328A09761k4425l3937M6541P3977K978o1794n4826p2064O258J1335L6290J1328
13316E1422m0108J7961p185L67M2691K7186k5652j7129p2225m3855K8704K0633
$$ y = [-29236, -12623, 31037, 91147, 76894, -4647, -31152, -46042, -101290, -122434, -77172, -85294, -138941, -92172, -9879, 11102, -12743, 9567, -15005, -42670, -12808, -17113, -29022, -34078, -250, 35863, 40816, 20039, 17966, 15367, 7656, 11175, 38720, 19923, -34098, -39664, -84090, -93917, -107292, -76242, -55173, -38850, -25755, -55688, -23168, 18845, 4869, -46620, -113406, -86321, -14061, -16424, -26021, -29164, -22809, 24890, 85763, 32947, -8537, -22831, -27998, -14094, -50087, -40361, -54491, -73352, -58053, 1653, -8044, -65793, -57945, 37689, 82689, 133734, 109761, 85336, 51399, 97940, 171917, 174895, 113101, 58275, -13789, -7531, 3804, 40094, 51422, 11314, 29275, 22090, 22457, 65148, 92334, 66682, 49553, -22672, -66527, -37823, -17190]
13304a7190K6757n50M6367l6260k082K8291m8766j7608l2570n043L9778o592P706
13291a7762L9115m4144m6784O5900Q7214M1175K4239k7566o1214k4202r8L2340
13279F8213P196R849p522j4712k3042k4357M5656o161l1962J1044L7722R668K5985
13266A07577j2402n0546p2781r606j9519o0164n932O5821K7012j716O5311k0378
13254A2677o9747K790Q211l2401j1892k971O8303L0373m476K0254K8100l0515
13242A8706m7729M4415J6113q97m874k8630l6423J9570M2255J1331J5072l2984
13230A5925n3381r864j3042k1009l4146K5863P3641N5167k398k2890q3352l724
13218g3210L6287j4097j6857M9174L4545K625l3165r297L6826j8863m7064M6731
$$ y = [-17190, 9567, 9017, 55384, 19124, 17042, 45333, -3433, -21041, -53611, -58654, -18876, -25468, -17762, 21353, -22791, -69575, -3675, 83539, 124714, 148953, 121387, 60173, 35971, 35873, 68213, 75409, 85258, 77736, 63024, 39982, 15625, 61281, 55120, 23158, 34202, 71924, 81592, 107577, 95175, 44629, -28152, -37758, -57277, -117441, -123373, -57552, -30540, -32256, 33055, 12677, -57070, -54280, -46069, -78470, -90362, -93333, -25030, 5343, 867, 21121, 49221, 18706, -29023, 15392, 31505, 30608, 25734, -2896, -39319, -19749, 22506, 33837, 48909, 15925, -37456, -47320, -60362, -81371, -115517, -89654, -16013, 39154, 36756, 13866, -69486, -73210, -36923, -51020, -67877, -18703, 15842, 18467, -14698, -23995, 12831, -6032, -53096, -6365]
13206f365N1128j2293j0132P498j4016n4212J0805M416j1319K4825L9815J9727
13194D9877J05N439L672m5103l9056J6401O588n9220j5680J6266M5213M2949K8790
13181E6241Q194n6727j1645M934l2189k6655M7608M6894p221K8911Q712j4909
13169E2148r614l6101L8038K322L1664k9586j4753l1489k7135L6502M8319N9773
13157A20088k6739p7260n2249n820J10506N7701P377o8808k5164k7538P653O0601
13145H0348o628l6343m9547M9323K7995k8481j2136j4981K2671l4335n2919J3563
13133d1470j5637L7424J7935P604j2039n38L7426j1434L7926J5774n8330m1296
13121b6655q793j6186K6874L0781J1601o3861j5038M2232M9485J5394Q781j8492
$$ y = [-6365, 44763, 32470, 22338, 29836, 15820, -38392, -27587, -23171, -34490, -9665, 30150, 49877, 49982, 55421, 59093, 13990, -25066, -8665, -2077, -61297, -76977, -60711, -15498, 27451, 56241, 64435, 7708, -3937, 997, -31192, -57847, -10239, 36655, 29434, 58345, 67057, 52148, 42534, 6433, 44471, 46793, 78457, 48871, 34118, 2629, -24506, 11996, 60315, 120088, 93349, 16089, -36160, -41980, 68526, 126227, 133604, 64796, 39632, 12094, 19747, 80348, 73720, 37377, -12170, 37153, 65148, 36667, 24531, 9550, 32221, -2114, -55033, -41470, -57107, -19683, -1748, 5856, -6183, -6721, 30705, 19271, 57197, 72971, 14641, -26655, -35448, -51634, -24760, 6021, 17622, -46239, -61277, -19045, 30440, 45834, 54615, 36123]
13109C6123P612J4264J8933L746n4166n1930j6058k5759O421L1736N6047K1648
13097D8617j5529L2228J0687Q710j4353K9878j8151n4226k8917M3708M2413m81
13085H4584n8468J5702o131O175q770K3656q102j9128n660N6236L8718K1012n2095
13072H7729j3967l482k8833L4382j4110l1081j2036j3962n99M1568K9055L141
13060G7805k1162M041o621j4163N447M482J2065j6630M0841j5735J2477l2464
13048E0383k7175k8651k8106j7264O3414l83l5193j4694L838k2414K9691m8658
13036g5212j0478N7236N4393m059J0844K1922o5672p7419O660J7378N2375M1946
13024B9914n5122k4167n2854L7572L1185M1481M8550j823L7181Q650j2905n0484
$$ y = [36123, 43735, 57999, 76932, 80678, 26512, -25418, -41476, -67235, -60814, -29078, 26969, 48617, 33088, 65316, 76003, 84713, 70360, 100238, 82087, 27861, -1056, 42652, 85065, 84584, 26116, 41818, 35687, 41862, 33092, 56748, 48646, 29518, 23858, 80094, 118812, 139824, 87729, 73762, 70280, 41447, 75829, 61719, 30638, 18602, 4640, 4041, 45609, 74664, 77805, 56643, 60684, 54063, 39900, 45347, 49829, 61894, 45264, 86105, 70370, 82847, 50383, 23208, -5443, -33549, -50813, 12601, 12218, -22975, -37669, -33831, -56245, -26554, -75212, -85690, -28454, 25939, 21880, 32724, 54646, -11026, -88445, -81785, -64407, -12032, 29914, -25208, -49375, -102229, -64657, -33472, 8009, 56559, 54736, 91917, 100567, 87662, 37178]
13012C7178o8015J7028J2076K0187j8849m4715l3599j9275L6996k4533o342J3959
13000g7904j7436J4695J6028k4484l0965K9087N2909N9428J1602K0923L5894k6109
12988F3668l0262J3391l8799m3706Q1580K7355m1242l5943L7152J5506M1348k3844
12976F6204m7888J0240N5691N053p427l1064j8400j2990j972L2394O560j8941
12964C7460k2863M171J2415P6800k8665m4544l4443M1k722l0603n1793K7723M6549
12951a0474L3084q709j5864j0717l2625J3798N5874K7949J193o3361l9014k1324
12939g0190K6206k4187j1996j5494J1810K554n6170l3154N5670M7287O3960j4888
12927a8592o215P2142k3596l9608J1728L2538j9887j8330K7131K7250l1372M546
$$ y = [37178, -30837, -13809, -1733, 18454, -395, -45110, -78709, -97984, -60988, -85521, -91863, -77904, -95340, -80645, -64617, -89101, -120066, -90979, -38070, 21358, 32960, 53883, 89777, 63668, 33406, 46797, 7998, -35708, 45872, 73227, 31985, -3958, 33194, 48700, 90048, 66204, 18316, 28556, 84247, 89300, 81873, 50809, 32409, 19419, 17447, 49841, 56401, 37460, 14597, 18768, 31183, 107983, 79318, 34774, 331, 372, -2350, -32953, -84746, -57023, -10474, 22610, 13901, -1963, -12680, -45305, -31507, 24367, 52316, 53509, -9852, -48866, -70190, -43984, -68171, -80167, -95661, -83851, -81297, -137467, -170621, -114951, -67664, -3704, -18592, -24807, 47335, 23739, -15869, -4141, 28397, 8510, -9820, 17311, 44561, 13189, 17735]
12915A7735N6356o4514j5202K6396l834l0204m0717m858n429k695L8208K7578
12903a180l7588n0478j8134J2635L4936L2500j1138n9631k7448L3968M4415K5133
12891b2010Q169L2113N536k8817k2554j8233n9006M511K2132J438n3965L1314
12879i9372L4356L2276L8794J2233m1573k8360L5475N3583L7236k7373n075J1108
12867E3308m062k6112k5853J2900m0507j6017R506l2127j9409R546K4285l9409
12855i3951O4240O0335K386j7882L9882k5437m7422N3473L648p8766L5851K8505
12843B4862K8522J9443M1651K2106N076p4223P819l3039n8697j408L7690J8655
12831C8457N7987J3964j4507p4982o521J0460L8327k66k5676K353p042J0373L0630
$$ y = [17735, 74091, 9577, -5625, 20771, 16937, -13267, -53984, -58842, -64271, -66966, -28758, -1180, -38768, -89246, -107380, -94745, -59809, -27309, -38447, -98078, -125526, -91558, -47143, -22010, -13841, 18272, 23808, -5009, -27563, -45796, -104802, -100291, -78159, -76721, -130686, -99372, -65016, -32740, 6054, 18287, -23286, -51646, -16171, 37412, 74648, 47275, 42200, 53308, 49246, 23134, -2719, 10181, -30326, -46343, -36837, -68964, -88373, -78827, -54542, -93951, -29711, 30624, 33010, 15128, 55010, 29573, -17849, 35624, 39272, -39494, -3643, 24862, 53384, 72827, 114478, 136584, 141660, 67437, 75256, 42217, -16480, -17888, 19802, 38457, 96444, 110408, 95901, 20919, 14398, 24858, 63185, 62919, 37243, 39596, 32554, 42927, 73557]
12818G3557L3547j2135L0028M9027m0977o6118l936o216k2016P186M2060l2044
12806E1963m2020J6578L0169j7619j6197l8017j6902k4105k779k59m303j1367
12794g4858q50M6327Q345o3011l9574o340M6191O1450m9803j2647L6437M8132
12782b01k2394m4029M727K6199N9459N316j630k5881j5566m5760j4894N0691J3665
12769a0298M5213L5216l6193j0932k3006N9128M1387Q213J3099k3570o5293k5480
12757G484J3758J2913j841q72J2209J0314J8574N9135J2284n235n4081q1671l8034
12744c5063Q136O983M153K5962N6749L9514p9671o3612q861K8968L0334j81J1966
12731B5377n4915J2811M4387L0291m1996n611m5009k7288N6997N4403K6394m6180
$$ y = [73557, 107104, 94969, 124997, 174024, 133047, 66929, 62993, 56777, 34761, 41947, 84007, 51963, 9943, 26521, 56690, 39071, 22874, -15143, -32045, -56150, -58929, -59188, -63491, -74858, -75708, -29381, -21036, -84047, -123621, -129961, -83770, -22320, -72123, -84770, -48333, -201, -22595, -66624, -61897, -35698, 23761, 29077, 27447, 1566, -14000, -59760, -74654, -23963, -10298, 34915, 70131, 33938, 23006, 0, 59128, 100515, 108728, 121827, 98257, 32964, 7484, 21242, 34155, 32314, 31442, 43651, 53965, 72539, 131674, 143958, 138723, 84642, 2971, -35063, -26927, -19944, -15791, 10171, 66920, 106434, 26763, -36849, -45710, -16742, 13592, 13411, 25377, -29538, -16727, 27660, 57951, 15955, 10344, -34665, -61953, -4956, 49447, 75841, 29661]
12719B9661J1900J3467j2963K7104L2252J5151n5436n5888J389J3745l938J1879
12707B8323j5697q044l4447Q0820N3346k5674o1998K9021k158n7358J0531l6756
12695d0091l838o176j2578J1031Q638M4028K7879j4864J4104j0749p2658k1738
12683g7012M5635P3977l0593k4505r981N1374N0032m5954l1549m1012J7901K8435
12671F748j5864l464k3444j8663j6686K3708j7842R766j7627M7163k487M0181
12659A1489L6007n502N084N761R536r0019o235L4367l2185L0619k0028o678l768
12646c1552N803M657k363L941O23o044j22K4471K8044j744k1541l8321j709R966
12632b5891N401K528M6931K9896n7847p4217j0800M3083M576n7322L5222L4121
$$ y = [29661, 41561, 55028, 42065, 69169, 101421, 116572, 61136, 5248, 6637, 20382, 16444, 28323, 12626, 4582, -29865, 50955, 104301, 78627, 16629, 45650, 43492, -13866, -3335, -40091, -43929, -50105, -62683, -51652, -43014, 1014, 28893, 14029, 28133, 17384, -55274, -77012, -31377, 42600, 12007, -12498, -22479, 28895, 78927, 32973, 1424, -39588, -21687, 6748, -9116, -12580, -36024, -54687, -71373, -47665, -65507, -55741, -73368, -26205, -28692, 11489, 47496, 41994, 47078, 52839, 62375, -27644, -33879, 488, -31697, -1078, -21106, -27784, -31552, -25749, -21092, -23455, -19514, -18891, -24935, -25057, -586, 27458, 25714, 4173, -34148, -35857, -25891, -20490, -17962, 28969, 58865, 1018, -73199, -83999, -40916, -36340, -93662, -58440, -24319]
12620b4319k5789q111Q2003L704q0594J1926K7171j6358J5724j1643k1002m2556
12608h9844K3065P5286O4063n9113m9320J0555L5491L4759J9588M4282J0274O4853
12596A83939j7591m0082k1307m4002l8435M918J695o759K2424m1572k6174M2365
12584A9419J0895L3842k9035j3033N180L8181J4247j2506Q36J8139l4158L2228
12572H4235P6931O65n0101m5784j6353Q109L4703L8361P574Q073M5504J3252n8006
12559A47163n6416k4051J1598m4285q4622J3100R570j0303K8190J5754K34n8256
12547e2324J3389K4606L4609J5408j1263o708l6508n3905j9609O3610L4158J1837
12535A7300j299K8808P294j2395m2086M1079J6819o1331m1959J1141M0416N658
$$ y = [-24319, -50108, -58219, 23784, 27488, -53106, -41180, -14009, -30367, -14643, -26286, -47288, -89844, -66779, 8507, 72570, 13457, -35863, -25308, 10183, 44942, 64530, 108812, 119086, 183939, 166348, 126266, 104959, 60957, 22522, 27440, 29135, 22376, 44800, 3228, -22946, 19419, 30314, 64156, 35121, 22088, 27268, 65449, 79696, 67190, 68026, 86165, 52007, 84235, 161166, 161831, 111730, 65946, 49593, 57702, 92405, 130766, 138340, 146413, 191917, 205169, 147163, 90747, 66696, 78294, 34009, -50613, -37513, -27943, -38246, -10056, 5698, 5932, -52324, -38935, -14329, 20280, 35688, 24425, 17717, -18791, -72696, -92305, -28695, 5463, 17300, 16001, 44809, 52103, 39708, -2378, 38701, 55520, -5811, -47770, -36629, 3787, 9445]
12523I445k6365j6936j0581j0180J9372L1220j6764j2981J8426K2029J4814l3173
12511a1674j0730j7168j4101q802J2073P4294N9262k8553j6087l638J1249J7042
12499F3167j0477q0547m9847J2894K9603Q3714n53k798J7097L3784p4776q3025
12487f1764j6322Q2552R2568L680r821J6585L778m0937l220k4872l9964o1003
12475e8740K9857P5888J0912l476M6481j3987q0759l5675J0695L2602N8292P921
12463H0011j0431L2108j1446k2423m3996k1778O728l194J6500O483l3857R737
12451D442L7516k7623k1363l0425R498j1654j279n998N7498J3059m2330j881R830
12438a0710p318Q089K1872r98j9004L0840N625j9751N044P3169K457o6263m4320
$$ y = [9445, -16920, -33856, -44437, -54617, -35245, -4025, -20789, -33770, -15344, 6685, 21499, -11674, -22404, -39572, -53673, -62475, -50402, 23892, 83154, 54601, 38514, 34876, 46125, 63167, 52690, -27857, -77704, -64810, -35207, 48507, 47954, 45156, 62253, 96037, 21261, -61764, -78086, 4466, 97034, 100714, 90893, 107478, 111256, 70319, 67099, 42227, 2263, -58740, -28883, 47005, 57917, 54441, 100922, 86935, 6176, -29499, -18804, 13798, 72090, 80011, 69580, 101688, 90242, 67819, 23823, 2045, 8773, 5579, 22079, 28562, -5295, 4442, 41958, 14335, -7028, -37453, -27955, -39609, -40888, -46886, 10612, 23671, -18659, -20540, -10710, -18028, -9939, 11933, 10935, -8069, 22771, 28396, 8645, 13689, 86858, 89315, 23052, -21268]
12425b1268J8384M7590q551n1424R789L8241m2327q787O7485j0389K6869o595
12413E9017n5695l1697j184m282J967J0096K5820J0527k9640m339r607l4498k238
12400f5753M3280J8317J3898k866l2452l2763J0206j1966J8861J5838l1103L2156
12388b4347l842k5707J0118Q8437N2344l6878p8982o0138L0723J9759j4049P7415
12376C4853N290k8136j7559K1534N0305J2387L742k0448l0929k3379k2463j0615
12364b5418K051O2482M2795l3761j1447Q635j4075J9859J7096j8584l7578N2786
12352F4841M003J8342K6160k5403l2170m1549k7925j501N861K7451J9407M8023
12340H5540k88K599K2292L615l0841K1185l9816j8180m6119k4074j1786l3839
$$ y = [-21268, -2884, 44706, 36155, -15269, -5480, 32761, -9566, -18353, 49132, 38743, 65612, 59017, 3322, -28375, -29559, -33841, -31874, -21778, 4042, 14569, -15071, -19410, -29017, -63515, -65753, -22473, -4156, 9742, 6876, -25576, -58339, -48133, -60099, -41238, -25400, -56503, -24347, -28189, -53896, -43778, 44659, 97003, 60125, -18857, -78995, -48272, -28513, -42562, 34853, 40143, 12007, -5552, 15982, 66287, 78674, 82416, 61968, 31039, 7660, -14803, -25418, -23367, 39115, 81910, 48149, 36702, 45337, 31262, 51121, 68217, 49633, 12055, 64841, 68844, 87186, 113346, 87943, 55773, 14224, -13701, -15202, -9341, 18110, 37517, 85540, 85252, 87851, 110143, 113758, 82917, 104102, 64286, 46106, -13, -24087, -35873, -69712]
12328f9712j3921M2471L0694R655J9495M4561R578k811l4265r891k3811q996M4048
12315C7095K0712o1169k4267k0716m5701N4779N2637K1547m1370m4706L322L6521
12303a1316k9698j0326P7856O5102J2533j0946R082k2597M93M7862N2363O2776
12291B43184O7069L503L3373p3657j52756m7205J4091k8879j6797k7452K102q432
12279H144O9547k0399j20473J8806O207r475j9651k32J6461k386N220M2661k4200
12266b9770l8796J6308P878j1295M5283J8562L7876Q892L0313R64m3069k2676
12254B0470L0695J9120M6385N1679K9470O369M7575K5247Q693J8721m0312o1514
12242B02598o4906q7611n9977j2069k9826O1248K5445k9959Q5582N2392K0809
$$ y = [-69712, -83633, -41162, -10468, -813, 18682, 63243, 72821, 70010, 35745, 25854, 2043, -6953, 37095, 57807, -3362, -27629, -48345, -94046, -39267, 13370, 34917, -6453, -51159, -47837, -11316, -41014, -51340, 26516, 91618, 104151, 93205, 102287, 79690, 80183, 128045, 180408, 243184, 310253, 313756, 347129, 273472, 120716, 73511, 87602, 58723, 41926, 14474, 16576, 8144, 77691, 57292, -63181, -44375, -38168, -47643, -67294, -67526, -51065, -53451, -48231, -5570, -29770, -68566, -52258, -44380, -55675, -10392, 8170, 46046, 54938, 85251, 86215, 43146, 20470, 51165, 70285, 116670, 168349, 197819, 204188, 251763, 277010, 285703, 304424, 264112, 202598, 137692, 50081, -9896, -21965, -51791, 9457, 34902, 4943, 90525, 142917, 163726]
12231A63726m0783p7231n9970L7062k0861l0435m0873Q419J0579p903n03j7318
12219g6091j7767O597K6003M7375N732j2219K55k290L5080L2969q99L461J4301
12206F2507j4383m3926j8919N7279R4608l052m0697l2749k0998j8754p888K906
12194A5934P501K2614l0759q879N2433o920J0898J2526o2353k6642N8694O06j7850
12181B7803l964Q121N691l1496r056o0321l6995n327K7544K5923J6616O3080j64
12168B7455l8198M5084Q356L4010m6109k5787k3749l7274M0142L5611k2380q823
12156a1662k9701K389p828k5756M1169q533O3301P8206J980J024L4335J3200q2690
12143F9434p9766J1665P9750O8902j841J3598o3481j0653M4119l39o1478j2312
$$ y = [163726, 122943, 45712, -14258, 22804, 1943, -28492, -69365, -60946, -50367, -58270, -58773, -76091, -93858, -87261, -61258, -13883, -8151, -20370, -20115, -22405, 12675, 45644, 44745, 48206, 62507, 48124, 4198, -14721, 42558, 137166, 134114, 93417, 60668, 39670, 20916, 13028, 15934, 23435, 46049, 15290, 6411, 58844, 51924, 62822, 75348, 12995, -13647, 45047, 45653, 27803, 23839, 31960, 37651, 6155, -2901, -63222, -100217, -105544, -78000, -52077, -35461, 27619, 27455, -10743, 34341, 42697, 76707, 30598, 4811, -18938, -56212, -16070, 19541, -2839, -11662, -41363, -38974, -46802, -72558, -31389, -39922, 23379, 101585, 103565, 104589, 138924, 152124, 69434, -10332, 1333, 81083, 149985, 148144, 161742, 98261, 87608, 131727, 131388, 69910, 57598]
12131E7598L147K5416J607r2598p521K0449j3471J361j4204K8477m581J284K1832
12118B8796L9463j869k3650q067k7822Q156k3174j5861j5898n0039q640Q7806
12106a0799Q4889j2568l3024n1866M2103L6853J6986m846o6306p980L6461m4486
12094a4583l1275L7978J6508L8040j2871k3512r609p061k1340L2454K6181q885
12082B2025q209J8232R80K2889j4987j9029O926j6547J3104M7075K5237l7297
12070F0399o1246J9917L1705J1373M552l2923j9296L2431k471J4439J8360J7121
12058I4361m7795r5708j1220L2536J8538m301Q665J7459M3510O4377l1079n0490
12046C8853m8663M4857L644q5316l7554L7215j0425J1682J6108L831O4927n148
$$ y = [57598, 60745, 86161, 87768, -4830, -12351, 8098, -5373, -4012, -18216, 10261, 5680, 6964, 28796, 68259, 66390, 42740, 34673, 6851, 15007, -8167, -24028, -39926, -89965, -98605, -10799, 74090, 61522, 28498, -23368, 18735, 55588, 72574, 67728, 1422, -6558, 29903, -14583, -45858, -7880, 8628, 46668, 33797, 10285, 676, -6385, -27725, 4729, 30910, 22025, 13816, 32048, 33028, 55917, 40930, 21901, 28827, 12280, 25384, 72459, 97696, 60399, -847, 19070, 50775, 62148, 66700, 33777, 14481, 46912, 44441, 58880, 77240, 94361, 46566, -49142, -60362, -27826, -9288, -13589, -4924, 12535, 56045, 120422, 89343, 38853, -9810, 35047, 38691, -46625, -84179, -46964, -57389, -45707, -29599, -25768, 39159, 34011]
12034C4011n7649k6516m3961j8914O4214R1151O5261l156k8986k3703n2292J0703
12022A0163J3027J921j3714L139j2049l3363l3177N5967N1175n0295J5385M5664
12010E3843m6036j3928K4317L4536m0177r6604K6320L3859r371J2693L1232K169
11998A2853L2773J1130m184j3833K6282n1899o3925k8600K3119k1534l44p699
11986h5861l907R687J6858M0372O1879K3704m8204K875j4765Q404J920r105L5656
11973C9513j6469k0336J1502j3381l4224p2223p096K2741n6963L0672P980L1366
11961g6918N5714J5284P8012K0534j3587m2Q240k0474j7506q661K4645j0627k4805
11948B9809k1676M4065N5363j7482l1703J2873m710j4728M4352m7675n2303M5135
$$ y = [34011, -23638, -50154, -94115, -113029, -48815, 42336, 107597, 104441, 75455, 51752, -540, 10163, 23190, 25111, 11397, 14536, 2487, -30876, -64053, -8086, 43089, -7206, 8179, 53843, 7807, -6121, 18196, 52732, 12555, -84049, -57729, -23870, -33241, -20548, 10684, 12853, 45626, 56756, 52572, 38739, 65021, 13122, -50803, -79403, -56284, -77818, -78162, -85861, -89768, -80081, -63223, -22851, 39028, 62732, 14528, 17403, 2638, 11042, 12962, 3857, 39513, 23044, 2708, 14210, 829, -33395, -105618, -112714, -89973, -146936, -116264, -108284, -76918, -21204, -5920, 72092, 92626, 79039, 78997, 87237, 66763, 49257, 40596, 65241, 54614, 29809, 8133, 52198, 107561, 90079, 58376, 71249, 66539, 51811, 96163, 48488, -3815, 41320]
11936D1320k2446k2348j3360K4577J6512L9193L1022J5472M705q2774j29507l8889
11924a36523j4269R1185K0486l712M8018J8187l0746l8584L5796P0227k2752n0106
11912a2793Q578j8962k0306j0050j8779L0593O2532J0907j3874l0409j9946r565
11900d2074k0320L4656M6012K4354o0656o9070l2597k6292k6883j7028P6747J7949
11888i5202M4730N583M125k6428L4861l9083l8901J8156O7290P5185O2940k2847
11876I0409k7555p8114K6837M2614J7556m7027l5914m1318j3118j1396K9231n538
11864e3333k0920J7730L7749j3511K162k4335j4694j4252J616L0937j7552r537
11852g7940J3770m3576n2518L7128N5751O7385j1949n9431J4623J8766k1182P26
$$ y = [41320, 18874, -3474, -16834, 7743, 24255, 63448, 94470, 109942, 114647, 31873, -97634, -136523, -150792, -59607, -39121, -42833, 5185, 23372, -7374, -45958, -10162, 60065, 37313, -12793, -4215, -23177, -43483, -53533, -72312, -41719, 20813, 31720, 17846, -12563, -32509, -42074, -62394, -27738, 18274, 42628, -18028, -87098, -119695, -145987, -172870, -189898, -113151, -95202, -50472, -44889, -40764, -67192, -32331, -71414, -110315, -92159, -24869, 50316, 113256, 90409, 62854, -15260, 11577, 54191, 71747, 24720, -11194, -52512, -65630, -77026, -47795, -53333, -74253, -56523, -18774, -32285, -30123, -54458, -69152, -83404, -81788, -50851, -68403, -77940, -64170, -107746, -160264, -123136, -67385, 0, -11949, -71380, -56757, -37991, -59173, -58447]
11840e8447L9677j87K6863J7165l4906L1636M3930Q107n9136j9758m3352j5525
11828f3933J7656j7876j9917L8209R445J514J6079m5938Q8873O6528q732K6609
11816A08517j5927n3782n1724n2530k3168K4546j2690k4642K2924K2416J9058
11805c7002Q1454m561R884j8000k7799l1531l5365k206j5948L0756k0141l2569
11793a03028J799O5290m6620k3741M5861P7911K7907K7977j711l5992L181N5122
11781I3956K1566l3977o7111l0262j7418L8259N7144n422k2603J9550N0304L0649
11769A34635l1784n3516k9861k8064r816q587l4903k3715N5594N4840m6039K7538
11757F322K1727m7154j9185K1381j2372n7502l712K4890Q719M1587K1886j7265
$$ y = [-58447, -18770, -18957, 7906, 25071, -9835, 21801, 65731, 73838, 14702, -5056, -48408, -63933, -46277, -64153, -84070, -45861, -36416, -34902, -18823, -64761, 24112, 90640, 81908, 108517, 92590, 38808, -12916, -65446, -88614, -64068, -76758, -101400, -78476, -56060, -37002, 44452, 39891, 49775, 31775, 3976, -27555, -62920, -65126, -81074, -50318, -70459, -103028, -101229, -35939, -82559, -106300, -60439, 17472, 45379, 73356, 71645, 35653, 38834, 93956, 115522, 81545, 14434, -15828, -33246, 5013, 62157, 56735, 34132, 53682, 103986, 134635, 102851, 49335, 19474, -8590, -18406, -26993, -61896, -85611, -30017, 24823, -21216, 6322, 28049, -19105, -38290, -16909, -29281, -86783, -90495, -65605, -56886, -15299, 6587, -10678]
11745a0678J2679j693j9740K4905M8465k4079p0102J7651O1376n3555n8314p634
11733h0719L7052L0434R1540j6681l4230O3150k021j04988K1490K5526k4999k5929
11721b0375o5709j9329O2033K6594j2775J2833m1641j8245j7886K0021K8247k6813
11709g3045m2357R462N9147J1293n5207k0253M5958N0135L8471l96j0988k6839
11697a4619m5213J17M9544R496M3066r466m7534j7590L2980k6829J0937J7323
11685B212N8537J0368l8659J1713m097m345k08p4531K207j3327K88L3559J9244
11672B961P597j3950L8208K6905j6053l7371j0141q62k6354Q601p739J1999L185
11659a3014K7978k1505r864k1643k8584L026K803K0334K7957O2590k8726l5338
$$ y = [-10678, 2001, 308, -19432, 5473, 53938, 29859, -40243, -22592, 38784, -14771, -73085, -80719, -43667, -13233, 78307, 61626, 27396, 90546, 88525, -16463, 5027, 30553, 5554, -20375, -86084, -105413, -43380, -16786, -29561, -16728, -58369, -76614, -94500, -74479, -46232, -73045, -115402, -105940, -46793, -35500, -90707, -110960, -65002, -14867, 23604, 23208, 12220, -14619, -59832, -59715, -10171, -675, 42391, 32925, -14609, -32199, 781, -26048, -15111, 2212, 60749, 71117, 32458, 44171, 40074, 35729, 35521, -39010, -36803, -50130, -49842, -16283, 2961, 10558, -3392, 34816, 61721, 45668, 8297, -1844, -2706, -29060, -20459, -28198, -16199, -13014, 14964, -6541, -16405, -38048, -66632, -63606, -60803, -40469, -12512, 50078, 21352, -13986]
11647a3986N874o6590K0017M797R957N9508K885m6815K6006K7237K446L6302p776
11634E9862m6429j5032J2588n3088j0541j1910O3879N4174k2302r8609k0791M3144
11622d5055J0542N4928K3785l2257j7426j0741P581Q725P985k27m1426m209k176
11609c9971Q533P962J5566k0334N35O0787K5921k1236o6642M378L8629K3802n0405
11596a2475l0137r435P1888P9975l0202j34512k6637M6561R5659K2105k0654l5899
11584A6237j2878J055j9488n249J8327l43L5075j0774p933L0836N6669J4055M0172
11571A55761j2819o4246n9429j5743k5045l0597q199M6584j1529n711l2414m4348
11559a07735l8553K1021O7373N4133j8155k83j748m7936n3424O1920L6479r709
$$ y = [-13986, -8112, -74702, -54685, -49888, -39931, 19577, 22462, -24353, 1653, 28890, 31336, 67638, 59862, 13433, -1599, 10989, -42099, -52640, -64550, -671, 53503, 31201, -67408, -88199, -45055, -34513, 20415, 44200, 11943, -5483, -16224, -8643, 82, 8067, 7840, -33586, -37795, -39971, -31438, -23476, -7910, -28244, -27709, 33078, 58999, 37763, -28879, -24501, 14128, 37930, -12475, -42612, -52047, 19841, 99816, 69614, -64898, -91535, -44974, 50685, 72790, 52136, 16237, 3359, 4414, -15074, -20323, -1996, -2339, 32736, 21962, 14029, 44865, 101534, 115589, 155761, 142942, 78696, 19267, 3524, -21521, -52118, -60317, -13733, -25262, -30973, -63387, -107735, -146288, -125267, -57894, -3761, -21916, -22199, -23947, -71883, -125307, -63387, -26908, -36617]
11547c6617M0127J3285K6308l1517o1712N3681L9857J5858J5478l6342n6599N9041
11535D0848K2606n606k0309k4919K0032l7326Q934r040l496K7506M7475m6858
11523A9847o0960K9407K9807J6299M718o1256q66q633m8277J3340K4117R436K2165
11510a0856J5089j3186O4289J1653j7393p7036q9072l3138k7552O6349L5191o018
11498h1680j6596Q576L7881L1859M6793J3829p0401l7229J4723K6704m8150M0810
11486c2881L5987M0397m782k1232l1893l6891n1495k8400O014K2870l2010k5964
11474a60280M4596K4292O693L2155R3291K2860o7642l6084m0452J7122j0644L6560
11462c7533N0697P48M901m2432P736L9690j4351j404M2066k3856J2591J66n9853
$$ y = [-36617, 3510, 16795, 43103, 11586, -50126, 3555, 43412, 59270, 74748, 38406, -18193, 40848, 63454, 57848, 37539, 12620, 32652, -4674, 4260, -4780, -8276, 19230, 66705, 19847, -41113, -11706, 18101, 34400, 39118, -22138, -23004, -31637, -79914, -66574, -42457, -33021, -10856, 4233, -8953, 55336, 66989, 49596, -27440, -116512, -149650, -177202, -110853, -75662, -81680, -98276, -89700, -51819, -19960, 26833, 40662, -29739, -66968, -52245, -25541, -73691, -32881, 3106, 43503, 38721, 17489, -14404, -51295, -102790, -131190, -125176, -102306, -134316, -160280, -115684, -91392, -84699, -52544, 40747, 63607, -4035, -40119, -80571, -63449, -74093, -37533, 13164, 13912, 18813, -23619, -15883, 23807, 9456, 8052, 50118, 26262, 38853, 39019, -20834]
11449b0834o1325k7560N9759N3494K5195R893J3620k0818k3093p134J5872n655
11437A1414P904J541j2263j5042K531m5536M2611l368j9206k299p757j2603k5610
11424g7683j2082p62k1996M2190R957l4408l3919N098P4350K4263n3177k6426
11412a04595l1044J7808O786L4930J4346m63N6380K1173m474l042j879J4004J3398
11399C3328n1328k6524k5660K465q021o499J9568k0834N283L4590k461L9705j7224
11386b3612k286L1699L0170m2286N8465M8546k3927n2766j6224o477K200j7392
11374a3890l0010N872M0855J1377o897L4512l687k6234J5479r144j2928l6031
$$ y = [-20834, -82159, -109719, -49960, 3534, 28729, 38622, 52242, 31424, 8331, 1197, 17069, 11414, 19318, 20859, 8596, -6446, -3915, -49451, -6840, -10208, -29414, -31713, -39470, -52073, -77683, -89765, -90527, -112523, -70333, -60376, -94784, -128703, -123605, -49255, -24992, -78169, -104595, -135639, -117831, -111045, -76115, -61769, -62232, -5852, 15321, 10847, 7805, 5926, 19930, 33328, -18000, -44524, -70184, -67719, -75740, -82239, -62671, -83505, -78222, -43632, -46093, -6388, -23612, -25898, 5801, 35971, -6315, 52150, 100696, 76769, 24003, 7779, 1302, 3502, -13890, -43900, -38028, 2827, 14204, 7307, 41819, 38132, 11898, 27377, 18233, 5305, -30726]
$$ [...]
##END NTUPLES=NMR SPECTRUM
##END=
